##TITLE=Analysis number 328713
Compound Code cc 66309
Book Reference 464/160/2
Project Code adrs
Chemist Name chrisr
##JCAMPDX= 6.0         $$ Bruker NMR JCAMP-DX V2.0
##DATA TYPE= NMR SPECTRUM
##DATA CLASS= NTUPLES
##ORIGIN= Bruker BioSpin GmbH
##OWNER= nmr
$$ XWIN-NMR		Version 3.5
$$ Wed Jun 27 13:07:56 2007 GMT Daylight Time (UT+1h)  MAYBRIDGE\nmr@NMR_250MHZ
##.OBSERVE FREQUENCY= 250.131544655141
##.OBSERVE NUCLEUS= ^1H
##.ACQUISITION MODE= SIMULTANEOUS (DQD)
##.ACQUISITION SCHEME= undefined
##.AVERAGES= 16
##.DIGITISER RES= 18
##SPECTROMETER/DATA SYSTEM= dpx250
##.PULSE SEQUENCE= zg30
##.SOLVENT NAME= CDCl3
##.SHIFT REFERENCE= (INTERNAL, CDCl3, 0, 16.4477)
##AUDIT TRAIL= $$ (NUMBER, WHEN, WHO, WHERE, WHAT)
$$ ##TITLE= Audit trail, XWIN-NMR		Version 3.5
$$ ##JCAMPDX= 5.01
$$ ##ORIGIN= Bruker BioSpin GmbH
$$ ##OWNER= nmr
$$ C:\u/data/dgb/nmr/ADRS/2130/pdata/1/auditp.txt
$$ ##AUDIT TRAIL=  $$ (NUMBER, WHEN, WHO, WHERE, WHAT)
(   1,<2007-06-27 13:07:28.64 +100>,<MAYBRIDGE\nmr>,<NMR_250MHZ>,
      <created by zg, POWCHK disabled, PULCHK disabled
       configuration hash MD5:
       76 6E 9A 78 1E 09 19 81 EC 84 63 8F B0 6A 59 2D
       data hash MD5: 64K
       31 DD 1B 2D B1 67 A0 53 44 23 8E 5C 9C 11 61 18>)
(   2,<2007-06-27 13:07:45.29 +100>,<MAYBRIDGE\nmr>,<NMR_250MHZ>,
      <Start of raw data processing
       ef LB = 0.3 FT_mod = 6 PKNL = 1 SI = 32K 
       data hash MD5: 32K
       0E B3 82 DC AF 78 B0 D6 12 FF 8A 1C 51 CB 6B 7D>)
(   3,<2007-06-27 13:07:46.96 +100>,<MAYBRIDGE\nmr>,<NMR_250MHZ>,
      <apk 
       data hash MD5: 32K
       19 74 54 C7 2C FE 41 CA AD BC 7D 83 2C 6A D9 01>)
(   4,<2007-06-27 13:07:47.70 +100>,<MAYBRIDGE\nmr>,<NMR_250MHZ>,
      <abs ABSG = 5 
       data hash MD5: 32K
       A4 1D C5 65 34 61 68 62 7A 23 90 BF 5F EC 25 18>)
$$ ##END=
$$ 
$$ hash MD5
$$ 04 F9 34 86 E1 79 34 C1 38 17 84 9F 4B A9 A8 E4
##$RELAX= 
##$RELAX= 
##$RELAX= 
##$RELAX= 
##$RELAX= 
##$RELAX= 
##$RELAX= 
$$ Bruker specific parameters
$$ --------------------------
##$DU= <C:\u>
##$EXPNO= 2130
##$NAME= <ADRS>
##$PROCNO= 1
##$TYPE= <nmr>
##$USER= <dgb>
##$AMP= (0..31)
100 100 100 100 100 100 100 100 100 100 100 100 100 100 100 100 100 100 
100 100 100 100 100 100 100 100 100 100 100 100 100 100 
##$AQSEQ= 0
##$AQ_mod= 3
##$AUNM= <au_zg>
##$AUTOPOS= <29 >
##$BF1= 250.13
##$BF2= 250.13
##$BF3= 250.13
##$BF4= 250.13
##$BF5= 500.13
##$BF6= 500.13
##$BF7= 500.13
##$BF8= 500.13
##$BYTORDA= 1
##$CFDGTYP= 0
##$CFRGTYP= 5
##$CHEMSTR= <none>
##$CNST= (0..31)
1 1 145 1 1 1 1 1 1 1 1 1 1 1 1 1 1 1 1 1 1 1 1 1 1 1 1 1 1 1 1 1 
##$CPDPRG= <>
##$CPDPRG1= <>
##$CPDPRG2= <>
##$CPDPRG3= <>
##$CPDPRG4= <mlev>
##$CPDPRG5= <mlev>
##$CPDPRG6= <mlev>
##$CPDPRG7= <mlev>
##$CPDPRG8= <mlev>
##$CPDPRGB= <>
##$CPDPRGT= <>
##$D= (0..31)
0 1 0 0 0 0 0 0 0 0.06 0 0 0 0 0 0 0.0002 0 0 0 0 0 0 0 0 0 0 0 0 0 0 
0 
##$DATE= 1182946046
##$DBL= (0..7)
120 120 120 120 120 120 120 120 
##$DBP= (0..7)
150 150 150 150 150 150 150 150 
##$DBP07= 0
##$DBPNAM0= <>
##$DBPNAM1= <>
$$ [...]
##$SUBNAM7= <"">
##$SUBNAM8= <"">
##$SUBNAM9= <"">
##$SW= 20.6930455092707
##$SWIBOX= (0..15)
0 0 3 0 0 0 0 0 0 0 0 0 0 0 0 0 
##$SW_h= 5175.983436853
##$TD= 65536
##$TD0= 1
##$TE= 297.16
##$TE2= 300
##$TE3= 300
##$TEG= 300
##$TL= (0..7)
0 120 120 120 120 120 120 120 
##$TP= (0..7)
150 150 150 150 150 150 150 150 
##$TP07= 0
##$TPNAME0= <>
##$TPNAME1= <>
##$TPNAME2= <>
##$TPNAME3= <>
##$TPNAME4= <>
##$TPNAME5= <>
##$TPNAME6= <>
##$TPNAME7= <>
##$TPOAL= (0..7)
0.5 0.5 0.5 0.5 0.5 0.5 0.5 0.5 
##$TPOFFS= (0..7)
0 0 0 0 0 0 0 0 
##$TUNHIN= 0
##$TUNHOUT= 0
##$TUNXOUT= 0
##$USERA1= <user>
##$USERA2= <user>
##$USERA3= <user>
##$USERA4= <user>
##$USERA5= <user>
##$V9= 5
##$VALIST= <valist>
##$VCLIST= <CCCCCCCCCCCCCCC>
##$VD= 0
##$VDLIST= <DDDDDDDDDDDDDDD>
##$VPLIST= <PPPPPPPPPPPPPPP>
##$VTLIST= <TTTTTTTTTTTTTTT>
##$WBST= 1024
##$WBSW= 4
##$XGAIN= (0..3)
0 0 0 0 
##$XL= 0
##$YL= 0
##$YMAX_a= 378008
##$YMIN_a= -233541
##$ZGOPTNS= <>
##$ZL1= 120
##$ZL2= 120
##$ZL3= 120
##$ZL4= 120
##$ABSF1= 16.4477
##$ABSF2= -4.245472
##$ABSG= 5
##$ABSL= 3
##$ALPHA= 0
##$AQORDER= 0
##$ASSFAC= 0
##$ASSFACI= 0
##$ASSFACX= 0
##$ASSWID= 0
##$AUNMP= <proc_1d>
##$AZFE= 0.1
##$AZFW= 0.1
##$BCFW= 0
##$BC_mod= 0
##$BYTORDP= 0
##$COROFFS= 0
##$CY= 12.5
##$DATMOD= 1
##$DC= 0
##$DFILT= <>
##$DTYPP= 0
##$F1P= 14.0000005364418
##$F2P= -0.99999901652339
##$FCOR= 0.5
##$FTSIZE= 32768
##$FT_mod= 6
##$GAMMA= 0
##$GB= 0
##$INTBC= 1
##$INTSCL= 1
##$ISEN= 128
##$LB= 0.3
##$LEV0= 0
##$LPBIN= 0
##$MAXI= 10000
##$MC2= 0
##$MEAN= 0
##$ME_mod= 0
##$MI= 0
##$NCOEF= 0
##$NC_proc= -4
##$NLEV= 6
##$NOISF1= 0
##$NOISF2= 0
##$NSP= 0
##$NTH_PI= 0
##$NZP= 0
##$OFFSET= 16.4477
##$PC= 1
##$PHC0= -51.32586
##$PHC1= 4.869387
##$PH_mod= 1
##$PKNL= yes
##$PPARMOD= 0
##$PSCAL= 4
##$PSIGN= 0
##$REVERSE= no
##$SF= 250.130018582992
##$SI= 32768
##$SIGF1= 0
##$SIGF2= 0
##$SINO= 400
##$SIOLD= 32768
##$SREGLST= <1H.CDCl3>
##$SSB= 0
##$STSI= 32768
##$STSR= 0
##$SW_p= 5175.98343685301
##$SYMM= 0
##$S_DEV= 0
##$TDeff= 65536
##$TDoff= 0
##$TI= <Analysis number 999999
Compound Code 99
Book Reference 9
Project Code 9>
##$TILT= no
##$TM1= 0
##$TM2= 0
##$TOPLEV= 0
##$USERP1= <user>
##$USERP2= <user>
##$USERP3= <user>
##$USERP4= <user>
##$USERP5= <user>
##$WDW= 1
##$XDIM= 32768
##$YMAX_p= 374107310
##$YMIN_p= -231593
$$ End of Bruker specific parameters
$$ ---------------------------------
##NTUPLES= NMR SPECTRUM
##VAR_NAME=  FREQUENCY,     SPECTRUM/REAL,   SPECTRUM/IMAG
##SYMBOL=    X,             R,               I
##VAR_TYPE=  INDEPENDENT,   DEPENDENT,       DEPENDENT
##VAR_FORM=  AFFN,          ASDF,            ASDF
##VAR_DIM=   32768,         32768,           32768
##UNITS=     HZ,            ARBITRARY UNITS, ARBITRARY UNITS
##FACTOR=    0.157963299565203, 1,           1
##FIRST=     4114.06363183462, 0,            0
##LAST=      -1061.91980501839, 0,           0
##MIN=       -1061.91980501839, -231593,     0
##MAX=       4114.06363183462, 374107310,    0
$$ Real data points
##PAGE= N=1
##DATA TABLE= (X++(R..R)), XYDATA
$$ [...]
26317f2518Q8786O4303j1873J4882n828J952n9354q2256k1181J7242N3348O5540
$$ -62518 26268 90571 78698 93580 87752 89704 30350 -51906 -73087 -55845 -2497 63043
26305F3043K2539k2655j3013K750j3546p529M4956P653J3835l0663l9790m587
$$ 63043 85582 62927 49914 52664 39118 31589 76545 84198 98033 67370 27580 22993
26293B2993K6495P054K2625m9186k8071j1584P62J7508k605J2736M387n0202n535
$$ 22993 49488 56542 79167 29981 1910 -9674 -8912 8596 5991 18727 23114 -27088 -32623
26280c2623n6083j3828M2103P883l3343J2914P2756K4781k1220J4225j5581q138
$$ -32623 -88706 -102534 -60431 -52548 -85891 -72977 -221 24560 3340 17565 1984 -6154
26268f154Q755J1164K5763L5273l241n1205l2178L8040P2763J3592m450l4926
$$ -6154 2601 13765 39528 74801 71560 20355 -11823 26217 98980 112572 108122 73196
26256G3196n075l0800l1796m9811k6148M4668Q5734O764P09p4915j6081j4379
$$ 73196 68121 37321 5525 -44286 -70434 -25766 59968 66732 67441 -7474 -23555 -37934
26244c7934j1577O6059L6080k3776n8562m1344N7179K3838l1998K4644J6531m0237
$$ -37934 -49511 16548 52628 28852 -29710 -71054 -13875 9963 -22035 2609 19140 -21097
26232b1097N1040K5354M4208J8740j7349p260l6245j7525K2381k9365k088l7587
$$ -21097 29943 55297 99505 118245 100896 93636 57391 39866 62247 32882 30794 -6793
26220f793K9353l3313l4647L1320L2449k9008l523L5338P006L7529R273k7238
$$ -6793 22560 -10753 -45400 -14080 18369 -10639 -14162 21176 28182 65711 74984 47746
26208D7746j898J9274j079m8339j170K4781p904P365J3947J0773m8597L6588M5420
$$ 47746 45848 65122 64043 15704 14534 39315 31411 38776 52723 63496 14899 51487 96907
26195I6907L3964o0793k3762j7621n3148m0046j7860k4509O053K6907k2338l7762
$$ 96907 130871 70078 46316 28695 -24453 -64499 -82359 -106868 -100815 -73908 -96246 -134008
26183a34008M9634Q7148J49q599M6534K4082j8612n1504J5610M2361j6179l042
$$ -134008 -84374 2774 2923 -5676 40858 64940 46328 -5176 10434 52795 36616 33574
26171C3574k3966k1913L4334L0988k7268l4125L8306L182n8876L4481n2123n328
$$ 33574 9608 -12305 22029 53017 25749 -8376 29930 33112 -25764 8717 -43406 -48734
26159d8734O8545m7936l9991k754M1167j7811L6059J3405K4029M651K8419K6217
$$ -48734 19811 -28125 -68116 -70870 -29703 -47514 -11455 1950 25979 30630 59049 85266
26147H5266J6590m8767R071k5217j7235J3001J8451j4751K7896L2392l6604j7994
$$ 85266 101856 53089 62160 36943 19708 32709 51160 36409 64305 96697 60093 42099
26135D2099p214k7911k7636j4717Q4912n020M025n386l1801k9785j5322J7116
$$ 42099 34885 6974 -20662 -35379 49533 44513 48538 43152 11351 -18434 -33756 -16640
26123a6640O3239R739O75l4800J0312L6293L1627K7911k0639j2170L9484J8166
$$ -16640 46599 56338 57013 22213 32525 68818 100445 128356 107717 95547 135031 153197
26111A53197J3393m1084m5834k5207p336J7979k0997J9439R50O030P872M7322
$$ 153197 166590 125506 79672 54465 47129 65108 44111 63550 64500 70530 78402 125724
26099A25724L4369p4147j14410k3444K5621P1059N158q0826P5265L5896j7813
$$ 125724 160093 85946 -28464 -51908 -26287 44772 49930 -30896 44369 80265 62452
26088F2452n3414j1763k494j4033l9557L0582J04767l2349n9618K4618J8204m0888
$$ 62452 9038 -2725 -5219 -19252 -58809 -28227 76540 44191 -15427 9191 27395 -13493
26076a3493m2381R2319J08410K7942k0202k6430j3758l804K7318l0777n2602j2003
$$ -13493 -55874 36445 144855 172797 152595 126165 112407 108603 135921 105144 52542 40539
26064D0539k2337l7022k5374K0742L0167k5839m2094L2719N2535J8402K1904l1751
$$ 40539 18202 -18820 -44194 -23452 6715 -19124 -61218 -28499 24036 42438 64342 32591
26052C2591J3370K353l3995n6827k5797J3288J2530K0891P597M5292L6397k7214
$$ 32591 45961 48314 14319 -42508 -68305 -55017 -42487 -21596 -13999 31293 67690 40476
26040D0476q7492k6673K0948Q4830K7945j7206n9868k7566k0333J9156L0987M8899
$$ 40476 -47016 -73689 -52741 32089 60034 42828 -17040 -44606 -64939 -45783 -14796 34103
26028C4103J3851j0210j5479m9390j6315M1824j7687K8463R0464l8914p8214k9415
$$ 34103 47954 37744 22265 -27125 -43440 -1616 -19303 9160 99624 60710 -17504 -46919
26016d6919n306J5020L92M349K5827j8116j0906J8017M4204j9574j6051K1620
$$ -46919 -52225 -37205 -36813 -32464 -6637 -24753 -35659 -17642 26562 6988 -9063 12557
26004A2557N7623M6019o9717n2060p830J2028j7537l7368j8618m1558j0186O4849
$$ 12557 70180 116199 46482 -5578 -13408 -1380 -18917 -56285 -74903 -116461 -126647 -61798
25992f1798L1026M0741M6872j1274m6851p950r94m3748p4410n4203Q0542M3297
$$ -61798 -30772 9969 56841 45567 -1284 -9234 -10228 -53976 -128386 -182589 -102047 -58750
25980e8750N7383J4359l9019K6437N8642K8395l9584r47q136q28n0237l3962l6222
$$ -58750 -1367 12992 -26027 410 59052 87447 47863 46916 38780 37952 -12285 -46247 -82469
25967h2469r475k6140M7062O7790l2333J2935L2903j4305o870M978J7250k9426
$$ -82469 -91944 -118084 -71022 -3232 -35565 -22630 10273 -4032 -10902 -5924 11326 -18100
25955a8100k0376K7157k1259J2804N7360L2370n6559j6200l6984J9654M6748J521
$$ -18100 -38476 -11319 -32578 -19774 37586 69956 13397 -2803 -39787 -20133 26615 28136
25943B8136k2730K4788j6816o0168L6280K9998L1680P405J4340q0740p6955O362
$$ 28136 5406 30194 13378 -46790 -10510 19488 51168 58573 72913 -7827 -84782 -78420
25931g8420Q5925Q2944J0943k7873m0036J8318j965p6861K2112J8667r1269k9801
$$ -78420 7505 90449 101392 73519 33483 51801 49836 -27025 -4913 13754 -77515 -107316
25919a07316M514M1861Q7180Q5663M4598j9374p9671l2945J4393J4464J4439l3242
$$ -107316 -102802 -60941 26239 111902 156500 137126 57455 24510 38903 53367 67806 34564
25907C4564k496k3572K2708N0244j9826k6784l3044m5404J4992N7280r7797K8128
$$ 34564 32068 8496 31204 81448 61622 34838 1794 -43610 -28618 28662 -69135 -41007
25895d1007L2797k8003r391N7428P1716J0034n1148p885Q541p343P3981m3655
$$ -41007 -8210 -36213 -45604 11824 83540 93574 42426 34541 43082 35739 109720 66065
25883F6065q1347J2103K3828r406l8509q7735L5565Q3046k5811M3092J7757K240
$$ 66065 -15282 -3179 20649 11243 -27266 -115001 -79436 3610 -22201 20891 38648 40888
25871D0888J4564K3135K2740k768K772m8714j7640N6516O58J7092L3231J7774
$$ 40888 55452 78587 101327 98559 101331 52617 34977 91493 92151 109243 142474 160248
25859A60248l3484l3230n5404j014J6207j2432m2553K6507n724m3650K6199M0324
$$ 160248 126764 93534 38130 37116 53323 40891 -1662 24845 19121 -24529 1670 41994
25847D1994j3802q135K2149r062J322Q1907Q653p745j6296q1174l5747L7097J6696
$$ 41994 28192 20057 42206 33144 34466 116373 125026 117281 100985 19811 -15936 21161 37857
25834C7857K7459K1811J2705j382m3546j7659J5068n7073M4308J8591n8363o4827
$$ 37857 65316 87127 99832 98450 54904 37245 52313 -4760 39548 58139 -224 -65051
25822f5051j3850K0997L9622J3357j8386M7778L877j5416o8780O211P950J3086
$$ -65051 -78901 -57904 -18282 -4925 -23311 24467 28344 12928 -55852 -49641 -41691 -28605
25810b8605L8967J3515n2781m329l2988M2300M599q2022M6356N3802Q962M211
$$ -28605 10362 23877 -28904 -33233 -66221 -23921 -19322 -101344 -54988 -1186 7776 11987
25798A1987L1765q003k4546j7438J8578n5056l3255m953j2626J5973M9548K9018
$$ 11987 43752 35749 11203 -6235 12343 -42713 -75968 -80921 -93547 -77574 -28026 992
25786I92j2101k9519j2045M2697K9964k103j9144K964k4991p4331l1877J43381
$$ 992 -11109 -40628 -52673 -9976 19988 17885 -1259 1705 -23286 -97617 -129494 13887
25774A3887N4365k7498n9326p466p1104L2850M0119J2926m057K4971k1886M09
$$ 13887 68252 40754 -18572 -26038 -97142 -64292 -24173 -11247 -15304 9667 -12219 -11810
25762a1810N3438q121q2352k591N2938P254k0271M0008K1018K7384k9788q0851
$$ -11810 41628 33507 -48845 -51436 1502 8756 -11515 28493 49511 76895 47107 -33744
25750c3744J2515J1456O1492J5554L657o7104l2470L2199k6767l3760K7719J4097
$$ -33744 -21229 -9773 51719 67273 70930 3826 -28644 3555 -23212 -56972 -29253 -15156
25738a5156R288m230J1249K2746j1059m3214J6223N9958M9459O013k6255k0570
$$ -15156 -5868 -10098 1151 23897 12838 -30376 -14153 45805 95264 101277 75022 54452
25726E4452k854j5901j8208m102j1071j6440J6643j2184j0212l987j3651J3304
$$ 54452 51598 35697 17489 13387 2316 -14124 2519 -9665 -19877 -23864 -37515 -24211
25714b4211M0413j3553m7266k5065M8371M5673l4950k4518O6840k0035m1496O1783
$$ -24211 16202 2649 -44617 -69682 -21311 24362 -10588 -35106 31734 11699 -29797 31986
25702C1986m815n6916q246L3562L7009Q975N638r851n6395J7079M3974M9857j9765
$$ 31986 27171 -29745 -37991 -4429 32580 41555 47193 37342 -19053 -1974 42000 91857 72092
25689G2092n3340L9966K1558n2767n4120m5071J3903M2327p993j7860J5799J4332
$$ 72092 18752 58718 80276 27509 -26611 -71682 -57779 -15452 -23445 -41305 -25506 -11174
25677a1174K4557J4576k2311j824n3266m3879l9000K6324K0180M9979Q1665M2382
$$ -11174 13383 27959 5648 3824 -49442 -93321 -132321 -105997 -85817 -35838 45827 88209
25665H8209j5281k3988K841j2409M359K2098k6455l7190J1681N262j504j9582
$$ 88209 72928 48940 51781 39372 43731 65829 39374 2184 13865 19127 17623 -1959
25653a959k212j0943M6052J2777o1141l4155L3065j0182q92K6043P5968n653r5084
$$ -1959 -4171 -15114 30938 43715 -17426 -51581 -18516 -28698 -29590 -3547 72421 66768 -28316
25640b8316j3326j9278j5950M0591J1318l5684m3744K2542K9431Q164N2370L5042
$$ -28316 -41642 -60920 -76870 -36279 -24961 -60645 -104389 -81847 -52416 -44252 8118 43160
25628D3160P66o0856l4448N5664O674l5339K2127m4594j7464K6101k2498k3892
$$ 43160 43926 -16930 -51378 4286 10960 -24379 -2252 -46846 -64310 -38209 -60707 -84599
25616h4599N7264K5272o967K532n2131k4876j1312k600N8453l174j1999N2799
$$ -84599 -27335 -2063 -9030 -6498 -58629 -83505 -94817 -97417 -38964 -42138 -54137 -1338
25604a338l0744j5624p434J0102p2450l2914K4744O6387K8281P1583k034m5127
$$ -1338 -32082 -47706 -55140 -45038 -117488 -150402 -125658 -59271 -30990 40593 38559 -6568
25592f568M204o1341m6709O7055M8920J5257j8944m6180L6676L72L0461n175J4070
$$ -6568 -2364 -63705 -110414 -43359 5561 20818 1874 -44306 -7630 -7258 23203 18028 32098
25579C2098N0605J0279n2498n092k2148J2336k394l3328l5846j3628K2054L9428
$$ 32098 82703 92982 40484 35392 13244 25580 23186 -10142 -45988 -59616 -37562 1866
25567A866K1777j064J0472l5898o5494K6453N3362K8232M9393m6091k6702L7616
$$ 1866 23643 22579 33051 -2847 -68341 -41888 11474 39706 89099 43008 16306 53922
25555E3922L4765J063k4525j1400J0334r683o8895K1877j5085M032N1209j4946
$$ 53922 88687 89750 65225 53825 64159 54476 -14419 7458 -7627 -3595 47614 32668
25543C2668l2718K3623O3069K7025o4506o8881o6150r603K5186N4114O1287j3828
$$ 32668 -50 23573 86642 113667 49161 -19720 -85870 -95473 -70287 -16173 45114 31286
25531C1286m1970P0805L4848m4900J8890K5165j7177K8170j2143q6403j0125j388
$$ 31286 -10684 60121 94969 50069 68959 94124 76947 105117 92974 6571 -3554 -4942
25519d942P1098m4490n8250J7640n24J2045N4092Q904l6382K0113Q536m6829M4967
$$ -4942 66156 21666 -36584 -18944 -19468 -7423 46669 55573 19191 39304 47840 1011 45978
25506D5978O9928p734L646k3891L956m5878J7145N02k8435j4211L3337M8291o3427
$$ 45978 115906 108172 111818 87927 91883 46005 63150 63652 35217 21006 54343 102634 39207
25493C9207j799r202k8400J205J5516L3579K068N7597j3383o7011o7279J5742
$$ 39207 37408 28206 -194 1011 16527 50106 52174 109771 96388 29377 -37902 -22160
25481b2160K9295j5205N8476N5820j4777k7570k9554K4621l5488o5063p343l9303
$$ -22160 7135 -8070 50406 106226 91449 63879 34325 58946 23458 -41605 -48948 -88251
25469h8251M4752J17068P0425m7235l2413j7069l596l0015k509L6671P3510K8129
$$ -88251 -43499 73569 143994 96759 64346 47277 43681 13666 11157 47828 121338 149467
25457A49467Q072j01989l0259J5306j7901q9678l8458R2597O5316l7047n5250
$$ 149467 157539 55550 25291 40597 22696 -66982 -105440 -12843 52473 15426 -39824
25446c9824m4411l587M5616J9147M467m7731J7892P7218N3249n4847p588j2442
$$ -39824 -84235 -87822 -42206 -23059 -18592 -66323 -48431 28787 82036 27189 19601 7159
25434G159Q066r918k1803K8322o565j4422j9471J2575O348L7507O238K1102P927
$$ 7159 15225 5307 -16496 11826 5261 -9161 -28632 -16057 -9709 27798 34036 55138 63065
25421F3065l5014k8200m1830J0139N3563N2766M0839l9460n7909l9305j9918J1396
$$ 63065 28051 -149 -41979 -31840 21723 74489 115328 75868 17959 -21346 -41264 -29868
25409b9868k3189l6252J4497O7780K9412M3893k7389j2828l3294j6657L610N4977
$$ -29868 -53057 -89309 -74812 -7032 22380 66273 38884 26056 -7238 -23895 -20285 34692
25397C4692O2383j3390k7594l0554l8239O3766k5910k0497j3517o779K223J3323
$$ 34692 97075 83685 56091 25537 -12702 51064 25154 4657 -8860 -15639 -13416 -93
25385i3N958J1818o0998p577L8497k6789k0608N5461m3J4895J10844J5169k2336
$$ -93 5865 17683 -43315 -50892 -12395 -39184 -59792 -4331 -4374 10521 121365 136534 114198
25372A14198P03o1753r171j9473j2646k2139n8088L9743N9645q88o235N139o0429
$$ 114198 114901 53148 43977 24504 11858 -10281 -68369 -28626 31019 30131 23896 29035 -31394
25359c1394m7954N3135R0603J2034l8756J2256N6693K1933o3633k5991m4501R811
$$ -31394 -79348 -26213 64390 76424 37668 49924 106617 128550 64917 38926 -5575 4236
25347D236l503n2963J3461K4523K4838j974L3895L0117k4716O8163J464M09j7791
$$ 4236 733 -52230 -38769 -14246 10592 8618 42513 72630 47914 116077 117541 117950 100159
25334A00159p2169m9247J9427J433L326K135j8891K6312M5825N2929Q948j1029
$$ 100159 27990 -21257 -1830 -397 2929 5064 -13827 12485 58310 111239 120187 109158
25322A09158n7419n6895k5158L6245M5500j04635l7790J2171R490O0719N319j4688
$$ 109158 51739 -5156 -30314 5931 51431 -53204 -90994 -78823 -69333 -8614 -3295 -17983
25310a7983l990L2070M1014j7758o6288m3668j0927M084J4159M7496L1186L163
$$ -17983 -21973 10097 51111 33353 -32935 -76603 -87530 -83446 -69287 -21791 9395 12558
25298A2558J4000k4451K5844J7605l1530r806J4694j6777m6228l0542J7470Q8714
$$ 12558 26558 2107 27951 45556 14026 4220 18914 2137 -44091 -74633 -57163 31551
25286C1551P7j2759j1574P6233k3194k5390L3661q1872P54K3572K2843p902k1433
$$ 31551 31628 18869 7295 83528 60334 34944 68605 -13267 -12513 11059 33902 26000 4567
25273D567l3779M9632K4015j8264k7393k5588n8013j8743J004K9139M3395R4370
$$ 4567 -29212 20420 44435 26171 -1222 -26810 -84823 -103566 -102562 -73423 -30028 64342
25261F4342N4079K9885p5569n2841l2368m98M2114M8726L300o871L731n5096j18429
$$ 64342 118421 148306 72737 19896 -12472 -12970 29144 77870 81170 74299 78030 22934 -95495
25248i5495n3003Q0244M0915p3293o0999N1262M1476l30K9471l2721K3252j590
$$ -95495 -148498 -68254 -27339 -100632 -161631 -110369 -68893 -69223 -39752 -72473 -49221 -50811
25236e0811n087l6046j8841k8791q953M5513P4579m5635J3688L9386j1241m4751
$$ -50811 -55898 -91944 -110785 -139576 -148529 -103016 -28437 -74072 -60384 -20998 -32239 -76990
25224g6990j8716j7049L2920K0404L1762K9633R73o858J5673J1365k0337l5556
$$ -76990 -95706 -112755 -79835 -59431 -27669 1964 2937 -3921 11752 23117 2780 -32776
25212c2776k9113k051P1017J621k5969l9616J496k6873L1320j9451m1357N2363
$$ -32776 -61889 -63940 7077 8698 -17271 -56887 -55391 -82264 -50944 -70395 -111752 -59389
25200e9389q557K509K1382L6935m296J3423k0879l9962l873k1833P29J3805K1492
$$ -59389 -67946 -65437 -44055 -7120 -11416 2007 -18872 -58834 -62707 -84540 -83811 -70006 -48514
25187d8514k6751K6837N7527J3002l2504n9018l3729K8360P8811K5753r124l0372
$$ -48514 -75265 -48428 9099 22101 -10403 -69421 -103150 -74790 4021 29774 20650 -9722
25175i722j0294O709M7351L3676p318j481j11K853j6506l3003l1716K7595N3394
$$ -9722 -20016 -13307 34044 67720 60402 58921 58810 61663 45157 12154 -19562 8033 61427
25162F1427P213l7618r1780k7550P569k2286M3652N1466K3629J6102M682K5568
$$ 61427 68640 31022 -60758 -88308 -80739 -103025 -59373 -7907 15722 31824 36506 62074
25150F2074J8115j8070J0154m3986r971J1725j7047J0217m3173j7929k430n3096
$$ 62074 80189 62119 72273 28287 18316 30041 12994 23211 -19962 -37891 -40321 -93417
25138i3417O3144M5535K6837k3324j0317k1524j5517m824l9424O7002P4718J0847
$$ -93417 -30273 15262 42099 18775 8458 -13066 -28583 -33407 -72831 -5829 68889 79736
25126G9736n0733n0134l6366J0655J7988J9750K5482o148j400K5559L9279K1163
$$ 79736 29003 -21131 -57497 -46842 -28854 -9104 16378 10230 8830 34389 73668 94831
25114I4831m7242l039r3638m0896m3897P967J17068J8855l6840M8048K4633o4558
$$ 94831 47589 44550 -49088 -89984 -133881 -125914 -8846 10009 -26831 21217 45850 -18708
25102a8708n5240j3684N8162K7184l651K843J0531J4379J8216O088m7384k9823
$$ -18708 -73948 -87632 -29470 -2286 -5937 -3094 7437 21816 40032 46120 -1264 -31087
25090c1087P4753J1496k998j5112j1450m3938K3509L8250M1615j5101O392j1519
$$ -31087 43666 55162 52164 37052 25602 -18336 5173 43423 85038 69937 76329 64810
25078F4810k2274Q952p5891q349O624j8137r747m478J7307J7694p0890k8500P2362
$$ 64810 42536 51488 -24403 -32752 -26128 -44265 -54012 -58490 -41183 -23489 -94379 -122879 -50517
25065e0517R5049J113n2219k2259L9951N4717k5220o5444K5977P220j4342l8188
$$ -50517 44532 45645 -6574 -28833 11118 65835 40615 -24829 1148 8368 -5974 -44162
25053d4162j0373L7715L2550k2858k8559L1358M5829j8239m4749R037Q167o28
$$ -44162 -54535 -16820 15730 -7128 -35687 -4329 41500 23261 -21488 -12451 -4284 -4912
25041d912p0826k5052J9184K7699m2972N4248Q6133L1080J7655m0021l6320L0414
$$ -4912 -75738 -100790 -81606 -53907 -96879 -42631 43502 74582 92237 52216 15896 46310
25029D6310K8314o5572J929l2590r760O6516K28n4436m9614j3027K9929j9638
$$ 46310 74624 9052 10981 -21609 -31369 35147 35375 -19061 -68675 -81702 -51773 -71411
25017g1411J6965r974j8055L2516K2068N6716R938L4099L0115k9475J0017j2603
$$ -71411 -54446 -64420 -82475 -49959 -27891 28825 38763 72862 102977 73502 83519 70916
25005G0916j3575o7615M0871J328O664k7067L4966N0212r748n0132K2229L9757
$$ 70916 57341 -10274 30597 31925 38589 11522 46488 96700 86952 36820 59049 98806
24993I8806R9392p822r7665q758n34K5279q7426j1221K044j9892p212j5458J1103
$$ 98806 198198 190376 92711 83953 83419 108698 21272 10051 12095 -7797 -15009 -30467 -19364
24980a9364N7237l5384n134k5030j2649K4172L1531L2809k9458j401L3260J7966
$$ -19364 37873 2489 -2645 -27675 -40324 -16152 15379 48188 18730 17329 50589 68555
24968F8555k0679j1686k6557j4417L0746p003O890k7461k4409J705L2108J9285
$$ 68555 47876 36190 9633 -4784 25962 18959 25849 -1612 -26021 -24316 7792 27077
24956B7077K730j4178l0145m2426J0146M5018l5639n4643j9707J5018O7153M6946
$$ 27077 29807 15629 -14516 -56942 -46796 -1778 -37417 -92060 -111767 -96749 -29596 17350
24944A7350J2301k0593L025O0157n1401K0921M952l4489n7022J1905L1377K5579
$$ 17350 29651 9058 12083 72240 20839 41760 46712 12223 -44799 -32894 -1517 24062
24932B4062N0767J7506k4256n1514p8323N1230J580l3860J0217J4580k9990l60
$$ 24062 74829 92335 68079 16565 -61758 -10528 -8948 -42808 -32591 -18011 -48001 -48361
24920d8361j6718Q1224J02750o0707q2054L4560N8662r700n5233k5239r252k9714
$$ -48361 -65079 16145 118895 58188 -23866 10694 69356 59656 4423 -20816 -30068 -59782
24908e9782m877r169O1905N1472K0083K8913m2939j6011l2348k2071n514r908
$$ -59782 -64659 -73828 -11923 39549 59632 88545 45606 29595 -2753 -24824 -30338 -40246
24896d0246k504n537l3912n688o1600l9950Q7799R4173n2896p7385L0919N0657
$$ -40246 -42750 -48287 -82199 -87887 -149487 -189437 -101638 -7465 -60361 -137746 -106827 -56170
24884e6170M4740K4513j2361q696J4268Q987L5523K7507N1249r1684o9543J1006
$$ -56170 -11430 13083 722 -7974 6294 15281 50804 78311 129560 37876 -31667 -20661
24872b0661L0274J5565m659o770J6804k4735r055j4565l4709J9689r275j2277
$$ -20661 9613 25178 20519 13749 30553 5818 -3237 -17802 -52511 -32822 -42097 -54374
24860e4374O641L891k4654l2096l3713j3801O3813P3355O9605l2714n9765J151
$$ -54374 -47733 -43842 -68496 -100592 -134305 -148106 -84293 -10938 58667 25953 -33812 -32661
24848c2661k0377L2361k3693J3938J0223K6191N2879K4292r404p2820l9145J1276
$$ -32661 -53038 -20677 -44370 -30432 -20209 5982 58861 83153 73749 929 -38216 -26940
24836b6940K4217N2678M7772m1948l0049l9619l4526O6884J1661n8354K4561M9212
$$ -26940 -2723 49955 97727 55779 25730 -13889 -48415 18469 30130 -28224 -3663 45549
24824D5549L2894j5774j0958j819r7784m3776J3769J6614l1207Q25L6446J528
$$ 45549 78443 62669 51711 49892 -47892 -91668 -77899 -61285 -92492 -91667 -55221 -53693
24812e3693p4685P972N5161O2645p863k0580J1055j219J4142J9053N3083p435
$$ -53693 -128378 -120406 -65245 -2600 -10463 -31043 -19988 -21207 -7065 11988 65071 57636
24800E7636q902j8451p5596m9549o193q857L7368L1795J3253M175J0742j4021
$$ 57636 48734 30283 -45313 -94862 -101055 -109912 -72544 -40749 -27496 -23321 -12579 -26600
24788b6600O1408K0897k2837n6992L7434R8502J019j6538o2247k9998j5038J1430
$$ -26600 34808 55705 32868 -24124 13310 111812 112831 96293 34046 4048 -10990 440
24776D40k0884L133J5555R525L1247j2627k0616m5979k127K3708O5621J8556q0059
$$ 440 -20444 -17311 -1756 7769 39016 26389 5773 -40206 -42333 -18625 46996 65552 -14507
24763a4507l1489k3846O702J8826k4834J0153K1827L5039j4552k527J4151J1853
$$ -14507 -45996 -69842 -63140 -44314 -69148 -58995 -37168 -2129 -16681 -19208 -5057 6796
24751F796J9931L7925P247J241J519p3972q3586k5858O6308N4647j3731N243L2446
$$ 6796 26727 64652 71899 73140 74659 687 -82899 -108757 -42449 12198 -1533 3710 36156
24738C6156n902J6223L1597j1843M8773K8555R82l914j07952m9585N7373m1752
$$ 36156 30254 46477 78074 66231 115004 143559 144541 140627 32675 -16910 40463 -1289
24726a289j3128M1991k3743n0976L0199P489J0276J3788K0130O361N9341j5804
$$ -1289 -14417 27574 3831 -47145 -16946 -9457 819 14607 34737 41098 100439 84635
24714H4635l3456m8420m5631p1472K2162R0624L7605j9229m9820n452K1439J6107
$$ 84635 51179 2759 -42872 -114344 -92182 -1558 36047 16818 -33002 -38454 -17015 -908
24702i08k0696k104n7896k4843O8719N9253O5082L6720n3542k4225p772M234o752
$$ -908 -21604 -23708 -81604 -106447 -37728 21525 86607 123327 69785 45560 37788 42022 35270
24689C5270n9935j44112J8213N0589L5181K0035M3565L771l248j1083M9181o4615
$$ 35270 -24665 -168777 -150564 -99975 -64794 -44759 -1194 2577 -671 -11754 37427 -27188
24677b7188nk6962L7329L1071r4r992k4572q0813m2729J5033P6121M6168q095
$$ -27188 -27193 -54155 -16826 14245 14151 4159 -20413 -101226 -143955 -128922 -52801 -6633 -14728
24664a4728O839P66K3797N5392R024j3215j9597j6949l7169j8677l6109l1984
$$ -14728 -7889 -7123 16674 72066 81090 67875 48278 31329 -5840 -24517 -60626 -92610
24652i2610J1585R033L6604M3984N067K1184K9307m1877j2438K5050Q957l5185
$$ -92610 -81025 -71992 -35388 8596 13663 34847 64154 22277 9839 34889 43846 8661
24640H661p4926J9364P7313J2130m9857l0885m1350M5171L2648K7539O037k9300
$$ 8661 -66265 -46901 30412 42542 -7315 -38200 -79550 -34379 -1731 25808 31845 2545
24628B545k2461K0181j5149k5682K1808K5155K4249L9452L455o1882K2128l4441
$$ 2545 -19916 265 -14884 -40566 -18758 6397 30646 70098 73553 11671 33799 -642
24616f42j00759O69Q2407R8779j2604j07240l4887M2962K3537m9189J8056N5457
$$ -642 -101401 -100732 -18325 80454 67850 -39390 -74277 -31315 -7778 -56967 -38911 16546
24604A6546K5804j3947k8437m3636M4764M316N6360j9103l9310l839o475m3852
$$ 16546 42350 28403 -34 -43670 1094 5410 61770 42667 3357 -482 -6957 -50809
24592e0809l2365j71J7194N4495N7511J7978R368K8332R95k3727n170n5742p1824
$$ -50809 -83174 -83345 -66151 -11656 45855 63833 73201 101533 102528 78801 73631 17889 -53935
24579e3935K4355p738q95J7106k5909j4757N0440j1039J368k2649k9293k7653
$$ -53935 -29580 -37318 -38213 -21107 -47016 -61773 -11333 -22372 -21004 -43653 -72946 -100599
24567a00599N5127O1205l9974j40103l1227N1248Q6533N2577L6744j7227O1675
$$ -100599 -45472 15733 -24241 -164344 -195571 -144323 -57790 -5213 31531 14304 75979
24556G5979r628k0478n3295n6901K4496Q0486M9062q0381L9706O2992j9749o6941
$$ 75979 66351 45873 -7422 -64323 -39827 40659 89721 9340 49046 112038 92289 25348
24544B5348p5021L340N0520Q762r307L688j0935r618L705n9307K4364N8410J0217
$$ 25348 -49673 -46333 4187 12949 3642 7330 -3605 -13223 -9518 -68825 -44461 13949 24166
24531B4166n408k4222n2080J6576j0457j5116K265K3995j787l9314L9437R5771
$$ 24166 18758 -5464 -57544 -40968 -51425 -66541 -64276 -40281 -42068 -81382 -41945 53826
24519E3826r217n6002q5954l6188N3123O2512m5325m4056M4580N1572l7630r481
$$ 53826 44609 -11393 -97347 -133535 -80412 -17900 -63225 -107281 -62701 -11129 -48759 -58240
24507e8240k740O2440N6767j0417r0752K6851P36J6418R5928N413k162p4575N5592
$$ -58240 -60980 1460 58227 47810 -42942 -16091 -15355 1063 96991 102404 100242 25667 81259
24494H1259O8515q1933l2156j4477j1607m0607k6772N1111K3790L1285K6682m3405
$$ 81259 149774 67841 35685 21208 9601 -31006 -57778 -6667 17123 48408 75090 31685
24482C1685j3757L7116M614J6082j8951l8167o55N461K8397k3538n9164q071P9994
$$ 31685 17928 55044 59658 75740 56789 18622 17967 23428 51825 28287 -30877 -38948 41046
24469D1046K850l8296k3299L043M0556m7277k6443k3913n972M0009Q5155M9827
$$ 41046 43896 5600 -17699 -14656 25900 -21377 -47820 -71733 -77705 -37696 47459 97286
24457I7286n2517j23531J099J2682q432K6307K2706K2586n3528J6343M9151o3768
$$ 97286 44769 -78762 -77663 -64981 -73413 -47106 -24400 -1814 -55342 -38999 10152 -53616
24445e3616j0387N63j2358K6011J544M56l2859M587N7702k2146j354P0590J08775
$$ -53616 -64003 -63440 -75798 -49787 -48243 -47787 -80646 -76059 -18357 -40503 -41857 28733 137508
24432A37508O5547q2562p4008m6575j6308J3721K8976J6584k8296N43J3469K4986
$$ 137508 203055 120493 46485 -90 -16398 -2677 26299 42883 14587 15130 28599 53585
24420E3585n5107n9293K2867L8597K4457K6446k1870m6077n4159r2281l0698M9576
$$ 53585 -1522 -60815 -37948 649 25106 51552 29682 -16395 -70554 -162835 -193533 -143957
24408a43957N0602O1308K7994J7242l0857P585j5766M9949N5489L2458m3317l2775
$$ -143957 -93355 -32047 -4053 13189 -17668 -10083 -25849 24100 79589 112047 68730 35955
24396C5955k9455k9728m9599n550m3111K3555N9741j5530R707M1457N174k8256
$$ 35955 6500 -23228 -72827 -78377 -121488 -97933 -38192 -53722 -44015 -2558 2616 -25640
24384b5640o0754k6496J4708N9354K796J0686k3466j7494M3082O3356J0796L7670
$$ -25640 -86394 -112890 -98182 -38828 -36032 -25346 -48812 -66306 -23224 40132 50928 88598
24372H8598n776n567k0933j9775k0586p586K5465K952P653O821K4819q780n4931
$$ 88598 82822 77255 56322 36547 15961 8375 33840 36792 44445 51266 76085 67305 12374
24359A2374p8830O2445O273Q438J7901j3415n364k0759N7096J0237n1977j0187
$$ 12374 -66456 -4011 2262 10700 28601 15186 9822 -10937 46159 56396 4419 -5768
24347e768J4650l5828j8069Q718N4397M1609M8286M0613n9541q530L8830k833
$$ -5768 8882 -26946 -45015 -36297 18100 59709 107995 148608 89067 80537 119367 116534
24335A16534n5678p4173l779l5775L6731N5362j3932n5017l4711j0528l1627P1476
$$ 116534 60856 -13317 -17096 -52871 -16140 39222 25290 -29727 -64438 -74966 -106593 -35117
24323c5117N4411j2985Q269l6307k815R543K771j770N6900M8422k239j8945J5730
$$ -35117 19294 6309 14578 -21729 -24544 -15001 -12230 -14000 42900 91322 89083 70138 85868
24310H5868j0447k3245m3016L6678O93l9694p300M5243m0316j4861K4167m1053
$$ 85868 75421 52176 9160 45838 46531 6837 -463 44780 4464 -10397 13770 -27283
24298b7283j4316n561k8772K4427L5586M9642L4129l8792l9621r942J2408K2881
$$ -27283 -41599 -47160 -75932 -51505 -15919 33723 67852 29060 -10561 -20503 -8095 14786
24286A4786J5125l355O323m7372l9092M59n5514J4130K3893K3565j3702k5793
$$ 14786 29911 26556 32879 -14493 -53585 -53126 -108640 -94510 -70617 -47052 -60754 -86547
24274h6547M2094Q9033k8895m4632l2410R666o5190l0213M8338O4102O6614j9083
$$ -86547 -44453 44580 15685 -28947 -61357 -51691 -116881 -147094 -98756 -34654 31960 12877
24262A2877n8143k7598n4430p7575O2573O2265K2843N2369N1654m2k0184l2426
$$ 12877 -45266 -72864 -127294 -204869 -142296 -80031 -57188 -4819 46835 46793 26609 -5817
24250e817n870K7400J19K9607j0606r705Q809j3937m2687j610J9753k7345q991
$$ -5817 -11687 15713 15832 45439 34833 25128 33937 20000 -22687 -24297 -4544 -31889 -40880
24237d0880J1787r239k2451l2344j3755K8146N1994J3085J3408n0950J2578N0235
$$ -40880 -29093 -38332 -60783 -93127 -106882 -78736 -26742 -13657 -249 -51199 -38621 11614
24225A1614N93l2820j1084M7827k3298L9505O5124L7132l4647n4117m6566J5155
$$ 11614 12207 -20613 -31697 16130 -7168 32337 97461 134593 99946 45829 -737 14418
24213A4418l011l2250Q485M351J7193K4309M346q1715n3249j5712M2056J3194
$$ 14418 11407 -20843 -12358 -8007 9186 33495 37841 -43874 -97123 -112835 -70779 -57585
24201e7585o1749J6468P0322K4346K8194j726J2511k0059l9019J9312m361N2526
$$ -57585 -119334 -102866 -32544 -8198 19996 18270 30781 10722 -28297 -8985 -13346 39180
24189C9180K0816m3285k1212L0729P962m0829m2058p022J4628L2701J4085J252
$$ 39180 59996 16711 -4501 26228 34190 -6639 -48697 -55719 -41091 -8390 5695 6947
24177F947q244n4309j5797M3346P579K3931j7804j3394k9492j8764n3627L2406
$$ 6947 -1297 -55606 -71403 -28057 -20478 3453 -14351 -27745 -57237 -76001 -129628 -97222
24165i7222L6730N684n528M2476K0185K5427l4108J318o109K9396P378O577j261
$$ -97222 -60492 -54808 -60336 -17860 2325 27752 -6356 -5038 -11147 18249 25627 32204 30943
24152C0943k9146l9606j0792J6527j8685n2303k0883j0858Q6016M7385j096L0939
$$ 30943 1797 -37809 -48601 -32074 -50759 -103062 -123945 -134803 -48787 -1402 -2498 28441
24140B8441j2191k2372l042R6666m0858j1723m842n188R42M2857m3387m2823L6429
$$ 28441 16250 -6122 -9164 87502 46644 34921 30079 24891 25833 68690 25303 -17520 18909
24127A8909n5249j4081M797L2159K8419j2526r5343m143P8752K2784M605L2143
$$ 18909 -36340 -50421 -45624 -13465 14954 2428 -92915 -97058 -18306 4478 9083 41226
24115D1226J787k0664L7082N5836k2763n2266k7640R859n6927J0825N8330N54
$$ 41226 43013 22349 59431 115267 92504 40238 12598 22457 -34470 -23645 34685 35239
24103C5239Q622J0940L096l3604m4000j6378j1092L2611O136j7978n4656J8671
$$ 35239 43861 54801 57897 24293 -19707 -36085 -47177 -14566 -8430 -26408 -81064 -62393
24091f2393l2325M3750L1528k8334o5452l5500L7002K7463J6035N0850J6902o9626
$$ -62393 -94718 -50968 -19440 -47774 -113226 -148726 -111724 -84261 -68226 -17376 -474 -70100
24079g0100q1813L1524Q5135J790k3720k6728M6389L7867q911r533k70L6292M5505
$$ -70100 -151913 -120389 -35254 -33464 -57184 -83912 -37523 344 -8567 -18100 -18370 17922 63427
24066F3427m8811k6922o194J236n1880O228P7380K8507l2865p547N4327Q258N1163
$$ 63427 14616 -12306 -18500 -17264 -69144 -62916 14464 42971 10106 2559 56886 65144 116307
24053A16307J9987o0465k4387K6142P521K9271k7317m4156J0091j1263M32r2478
$$ 116307 136294 75829 51442 77584 85105 114376 87059 42903 52994 41731 42163 -50315
24041e0315l4328M9347M310N830O0348R478n3620k7137j6697M0079L1958N2283
$$ -50315 -84643 -35296 -30986 -25156 35192 44670 -8950 -36087 -52784 -12705 19253 71536
24029G1536K6992p0724j15733K4650O2958l7349j1188L1314p132p748j4213L0916
$$ 71536 98528 27804 -87929 -63279 -321 -37670 -48858 -17544 -24676 -32424 -46637 -15721
24017a5721J6826m669M898j2256J8760L1244o0427n4948m700k0091K5625j8356
$$ -15721 1105 -3564 1334 -10922 7838 39082 -21345 -76293 -80993 -101084 -75459 -93815
24005i3815L5437K2467l440O2237N5315j5872j2623m2446l7651M9557J4423q949
$$ -93815 -58378 -35911 -39351 22886 78201 62329 49706 7260 -30391 19166 33589 24640
23993B4640q02j6307k0290k0828k1960K0848K5663K1798K2071l9445o369o5827
$$ 24640 23838 7531 -12759 -33587 -55547 -34699 -9036 12762 34833 -4612 -10981 -76808
23981g6808O144J4989m7777J2753k632o9174M3105N7750Q1134R991K7894M9925
$$ -76808 -70664 -55675 -103452 -90699 -93331 -162505 -119400 -61650 19484 29475 57369 107294
23969A07294m3377j9531J6425P241k0852m0903n1204M096k455j4123m4151L6314
$$ 107294 63917 44386 60811 68052 47200 6297 -44907 -40811 -43266 -57389 -101540 -65226
23957f5226O9024N7106n1634r0906K878J7007n022l6680J1791K0683k843l7075
$$ -65226 3798 60904 9270 -81636 -78758 -61751 -66773 -103453 -91662 -70979 -73822 -110897
23945a10897r190J1339J3655M7368N9699K8336l6538j4800k274q595J0859J2679
$$ -110897 -120087 -108748 -95093 -47725 11974 40310 3772 -11028 -13302 -21897 -11038 1641
23933A641j8253L061l180j3667K9351m6655j8811O3968J1465P921l0587j4106
$$ 1641 -16612 -13551 -16731 -30398 -1047 -47702 -66513 -2545 8920 16841 -13746 -27852
23921b7852N2823p140j1151m0096k1632N0062L2908m9704l4131Q403j1385L6863
$$ -27852 24971 17831 6680 -33416 -55048 -4986 27922 -21782 -55913 -47510 -58895 -22032
23909b2032J4146n4608p4986K5459M1646K0503P302k5883J3203l6222L8751J2110
$$ -22032 -7886 -62494 -137480 -112021 -70375 -49872 -42570 -68453 -55250 -91472 -52721 -40611
23897d0611M8997J7507n3860N4914K033j8431j3325M0699P2646j258n6264k2379
$$ -40611 8386 25893 -27967 26947 28980 10549 -2776 37923 110569 109311 53047 30668
23885C0668o6963n5893q995M2820j706N865J610J8106j9429l2017L3586Q4737
$$ 30668 -36295 -92188 -101183 -58363 -60069 -54204 -52594 -34488 -53917 -85934 -52348 32389
23873C2389K7701J0318k1831O38L2118J0394k877L7215k3259m3891j0253j4414
$$ 32389 60090 70408 48577 49215 81333 91727 88850 126065 102806 58915 48662 34248
23861C4248o4940o0615J6540L8509k1615r686j9686L2596M1103L1720k3866n3855
$$ 34248 -30692 -91307 -74767 -36258 -57873 -67559 -87245 -54649 -13546 18174 -5692 -59547
23849e9547R81j8090P612r753N2717L9479n8200J8554Q5221m81k3830K0166j7421
$$ -59547 -58566 -76656 -69044 -78797 -26080 13399 -44801 -26247 58974 58493 34663 54829 37408
23836C7408l8677p97k865R786k816j74o598J4637O097l7885r7453L0920N5911
$$ 37408 -1269 -2066 -4931 4855 2039 1865 -4733 9904 16001 -21884 -119337 -88417 -32506
23823c2506N0328n0402o3201M2877o75n2550M0899j4787L5090L3077l1720o909
$$ -32506 17822 -32580 -95781 -52904 -53579 -106129 -65230 -80017 -44927 -11850 -43570 -50479
23811e0479M112M9989k302M761M281l0115K6705K6396J5781K1520r854m25k1192
$$ -50479 -46367 3622 1320 6081 10362 -19753 6952 33348 49129 70649 60795 60370 39178
23798C9178J8887J3650P493k2459j7577L1233N906m7290l7387M497M3062j6456
$$ 39178 58065 71715 79208 56749 39172 70405 76311 29021 -8366 -3869 39193 22737
23786B2737m3683M12P4721M1129l5221n7096l2536M4601Q782p846o2781O9406
$$ 22737 -20946 -20534 54187 95316 60095 2999 -29537 15064 23846 16000 -46781 22625
23774B2625J7516p604O526R461l655L641R2364m1649j16520k8981L0874j2383
$$ 22625 40141 32537 39063 48524 44869 48510 140874 99225 -17295 -46276 -15402 -27785
23762b7785l2078J724k1405n99J4219J6249l623r127j4472L5343j5827p452j2110
$$ -27785 -59863 -58139 -79544 -80143 -65924 -49675 -53298 -62425 -76897 -41554 -57381 -64833 -76943
23749g6943K2978m2729k0123J3289Q5088K5349l7619M8616J7347m3592l6710K142
$$ -76943 -53965 -96694 -116817 -103528 -18440 6909 -30710 17906 35253 -8339 -45049 -42907
23737d2907K7367P209m1965J3143K7461k7789k5400L9141N0606j8083M4605m112
$$ -42907 -15540 -8331 -50296 -37153 -9692 -37481 -62881 -23740 26866 8783 53388 49276
23725D9276K448K4284J3244l3904p1678j2482k7731l9931l805M9289K9636J3048
$$ 49276 51724 76008 89252 55348 -16330 -28812 -56543 -96474 -100279 -50990 -21354 -8306
23713h306k9897j1668K5838L9112l1968j4759k4894K4684Q1924K4263J6077J1628
$$ -8306 -38203 -49871 -24033 15079 -16889 -31648 -56542 -31858 50066 74329 90406 102034
23701A02034k3068m409j0981n708j5090q80K5086J0992o4384M437K2630L1913
$$ 102034 78966 74557 63576 57868 42778 41898 66984 77976 13592 18029 40659 72572
23689G2572l2670Q027k0232J3731j4792l0178m4752j1157J1714K7310k1327M5267
$$ 72572 39902 47929 27697 41428 26636 -3542 -48294 -59451 -47737 -20427 -41754 3513
23677C513k3090k2809N8386O3466m2270J811o1320J458Q0273k6568L773m6230
$$ 3513 -19577 -42386 16000 79466 37196 39007 -22313 -20855 59418 32850 36623 -9607
23665i607n7938l307K540k1678j0492O2473L3442K4431j2954o629O0735M1766
$$ -9607 -67545 -70852 -68312 -89990 -100482 -38009 -4567 19864 6910 281 61016 102782
23653A02782L3393q0279p7222J4426J0016J3917k2333J0405M6397j0105J4959
$$ 102782 136175 55896 -21326 -6900 3116 17033 -5300 5105 51502 41397 56356
23642E6356J7355r240n2294k9531m1918K6694P0711K0200k5231o1769K4570J4622
$$ 56356 73711 64471 12177 -17354 -59272 -32578 38133 58333 33102 -28667 -4097 10525
23630A0525L653K5555O5311n239j11508p0069m4896L9534M4641n369O1090m345
$$ 10525 14178 39733 105044 99805 -11703 -81772 -126668 -87134 -42493 -47862 13228 8883
23618H883k3050r807j0646J8675M7035k3391n899L2830m5761O0935k5258k2880
$$ 8883 -14167 -23974 -34620 -15945 31090 7699 1800 34630 -11131 49804 24546 1666
23606A666K8661l7697o238K2184l1383m3699P894N809N7627l51l2525L7994J9498
$$ 1666 30327 -7370 -13608 8576 -22807 -66506 -58612 -52803 4824 4473 -28052 9942 29440
23593B9440l3927l6548K1378M8025N4878o0201p4858m9964p5328J07448J1340
$$ 29440 -4487 -41035 -19657 28368 83246 23045 -51813 -101777 -177105 -69657 -58317
23582e8317q926M7443L4245K6403k7769l1951J8978N0696O165m1804j1327n1478
$$ -58317 -67243 -19800 14445 40848 13079 -18872 106 50802 56967 15163 3836 -47642
23570d7642n3117l7425K2259K4407j5518j3349M2887L248k0375k5463J4191L8571
$$ -47642 -100759 -138184 -115925 -91518 -107036 -120385 -77498 -74250 -94625 -120088 -105897 -67326
23558f7326k0637r5047M613P284n040K325K1772J2490P0257P7600j0712o3009
$$ -67326 -87963 -183010 -178397 -171113 -176153 -173828 -152056 -139566 -69309 8291 -2421 -65430
23546f5430p127N871q323L5358K2052Q31k8349p6641K9867N4996j1796j1395L0715
$$ -65430 -72557 -66686 -75009 -39651 -17599 -16768 -45117 -121758 -91891 -36895 -48691 -60086 -29371
23533b9371N468L7920k8792p7959n8539O2158R5998K1372J1615n1299l1466m7398
$$ -29371 -23903 14017 -14775 -92734 -151273 -89115 6883 28255 39870 -11429 -42895 -90293
23521i0293l0544L4653K6119k6104k3678N0419J6346j3946J8097l7176k6473M1831
$$ -90293 -120837 -86184 -60065 -86169 -109847 -59428 -43082 -57028 -38931 -76107 -102580 -60749
23509f0749N7952M820L8457l551m2457J0419L7270j4379o4846M6236N6333J9390
$$ -60749 -2797 2023 40480 36929 -5528 4891 42161 27782 -37064 9172 65505 84895
23497H4895j6207k0840J5265J1933l4556j6916p867J7065p474p848K0448J0565
$$ 84895 68688 47848 63113 75046 40490 23574 15707 32772 25298 17450 37898 48463
23485D8463J0559k1894k2597k8362L674L7739M2969k1880o595n4177l6509M7400
$$ 48463 59022 37128 14531 -13831 -10157 27582 70551 48671 42076 -12101 -48610 -1210
23473a210R326k205O079L2856k8461m4096K8568Q3935m0516p0102L5909j0923
$$ -1210 8116 5911 11990 44846 16385 -27711 857 84792 44276 -25826 10083 -840
23461h40n0106j7872K4560L7902J4131p2803k5497K486K2458K7756J8050N3991
$$ -840 -50946 -68818 -44258 -6356 7775 -65028 -90525 -88039 -65581 -37825 -19775 34216
23449C4216J5658J611j3555n2549j6591K5965l2162j3883J6511J5380n4292J5458
$$ 34216 49874 51485 37930 -14619 -31210 -5245 -37407 -51290 -34779 -19399 -73691 -58233
23437e8233J7093P0433N3411K4158k460n0935l4524l6242m0473J0284j8220L0424
$$ -58233 -41140 29293 82704 106862 104402 53467 18943 -17299 -57772 -47488 -65708 -35284
23425c5284M2504K4470m331m608L463J0693q885M30J105m896L5866K4940R192
$$ -35284 7220 31690 27359 22751 26214 36907 28022 28452 29557 24661 60527 85467 94659
23412I4659l4069k8630k1489P42J7327J7703K1190l6006l8462k5999J2508K9706
$$ 94659 60590 31960 10471 11213 28540 46243 67433 31427 -7035 -33034 -20526 9180
23400I180n7726n5289j4908l53k5727k0816N5661M4022L5385L6422K1065o9273
$$ 9180 -48546 -103835 -118743 -119096 -144823 -165639 -109978 -65956 -30571 5851 26916 -42357
23388d2357n2185L3978K5925j8451K1260M5118K2589m305j5875o401P931j32l0081
$$ -42357 -94542 -60564 -34639 -53090 -31830 13288 35877 31572 15697 9296 17227 17095 -12986
23375a2986j9134K9124j6335o8245N3837K7909P828j8730l9764K0772O3725K0635
$$ -12986 -32120 -2996 -19331 -87576 -33739 -5830 1998 -16732 -56496 -35724 28001 48636
23363D8636m2760k96J4502J3227n8974o845L1784j4282M8717k7540j6469J665
$$ 48636 5876 5580 20082 33309 -25665 -32510 -726 -15008 33709 6169 -10300 -8635
23351h635k9164k6102k3679K3776P7162L4793j6761q660j5135K0468m5057K7668
$$ -8635 -37799 -63901 -87580 -63804 13358 48151 31390 22730 7595 28063 -16994 10674
23339A0674Q7648J1124l9821n5232k0041j1589j4539k4958P031j3989k922Q735
$$ 10674 98322 109446 69625 14393 -5648 -17237 -31776 -56734 -49703 -63692 -66614 -57879
23327e7879L6111o723K05L871O61m6972m546N1899K3397o1867J3633L2546L4649
$$ -57879 -21768 -28491 -28286 -24415 -23754 -70726 -75272 -23373 24 -61843 -48210 -15664 18985
23314A8985l2943k7982J9k8489K252j1592R879L7654k1836l4461N8778k029k5340
$$ 18985 -13958 -41940 -41921 -70410 -68158 -79750 -69871 -32217 -54053 -88514 -29736 -31765 -57105
23301e7105j5624j8133L1164L2061n7310o071K7135K2896J7930K2008l808o8058
$$ -57105 -72729 -90862 -59698 -27637 -84947 -91018 -63883 -40987 -23057 -1049 -4857 -72915
23289g2915L0985L3419R131K6768k7606m1502l5387L5049M4714J9626K5002J6845
$$ -72915 -41930 -8511 620 27388 -218 -41720 -77107 -42058 2656 22282 47284 64129
23277F4129n6584k8633o902M7343J2384L4320N880l1468P994R097O18l6433p0216
$$ 64129 7545 -21088 -27990 19353 31737 66057 71937 40469 48463 57560 58178 21745 -48471
23264d8471m3091m4590J8253L5179r450q234J0451L4268p2074r1126J4531O1880
$$ -48471 -91562 -136152 -117899 -82720 -92170 -100404 -89953 -55685 -127759 -218885 -204354 -142474
23252a42474O7600Q7151J5086m9399m0162J5266L1280N1111N9588l8342l6788
$$ -142474 -74874 12277 27363 -22036 -62198 -46932 -15652 35459 95047 56705 19917
23241A9917r257l5135K9205o0274J8394L8052K8111K9529q6965l5590K8568m939
$$ 19917 10660 -24475 4730 -55544 -37150 902 29013 58542 -28423 -64013 -35445 -40384
23229d0384k9677k5738K9191P2717o5574l2162M296M7035L1738l550N501k1992
$$ -40384 -70061 -95799 -66608 6109 -59465 -91627 -87331 -40296 -8558 -12108 -6607 -28599
23217b8599L3166l9766m9704R068M5675N6147n2034K0949L2244r297j2757n0069
$$ -28599 4567 -35199 -84903 -75835 -30160 25987 -26047 -5098 27146 17849 5092 -44977
23205d4977m3977j9001N3393r750l1365l146L5291n541m2788l8027j193M2626
$$ -44977 -88954 -107955 -54562 -64312 -95677 -98823 -63532 -69073 -111861 -149888 -151081 -108455
23193a08455L3594o363L8207M2088n5454r63K6369n4572L5257K5542j2303k5849
$$ -108455 -74861 -81224 -43017 -929 -56383 -57346 -30977 -85549 -50292 -24750 -37053 -62902
23181f2902o468L9164K9001k0738K9317k0120k0007j2203P433N1224m8424n0552
$$ -62902 -69370 -30206 -1205 -21943 7374 -12746 -32753 -44956 -37523 13701 -34723 -85275
23169h5275M6026R498l2291r94K7534k4046l1642L9453N219n6877m9707O0724
$$ -85275 -39249 -29751 -62042 -63036 -35502 -59548 -91190 -51737 -46518 -103395 -153102 -92378
23157i2378o578K2362L3285L4497l0211m505N2122N45j9365j6159j4246O3713
$$ -92378 -98956 -76594 -43309 -8812 -39023 -43528 8594 9139 -10226 -26385 -40631 23082
23145B3082M0630n6620k537L8987m4044j5248j045l2399k8476N2499L6557k5851
$$ 23082 63712 7092 4555 43542 -502 -15750 -16795 -49194 -77670 -25171 11386 -14465
23133a4465K1320Q870l779m342k48j5949m6519p485r634k2021L7371Q632k3747
$$ -14465 6855 15725 11946 7604 7356 -8593 -55112 -62597 -72231 -94252 -56881 -48249 -71996
23120g1996K5753K388L8868j853k3640P663J1532l6576P3395N2416J8064k4876
$$ -71996 -46243 -43855 -4987 -6840 -30480 -22817 -11285 -47861 25534 77950 96014 71138
23108G1138k6576L150L681k4421n2357L850k2667J1998j6223O819L7878K1193
$$ 71138 44562 47712 51393 26972 -25385 -21535 -44202 -32204 -48427 -41608 -3730 17463
23096A7463k2655L73q504L6708L7789k8610m4867k8233o591l1162j2096j3402
$$ 17463 -5192 -4819 -13323 23385 61174 32564 -12303 -40536 -47127 -78289 -90385 -103787
23084a03787j555j315K0623k7446j5593m423J9561L4493N791K483L7352K4450
$$ -103787 -105342 -106657 -86034 -113480 -129073 -133496 -113935 -79442 -73651 -71168 -33816 -9366
23072i366m7496j4193K3763K2228M3356j9235l8818l292r3049r5491K2185P4015
$$ -9366 -56862 -71055 -47292 -25064 18292 -943 -39761 -43053 -136102 -231593 -209408 -135393
23060a35393O8311j5046P651K0705J8526Q297L3592N6173j8565o3494l8922n228
$$ -135393 -67082 -82128 -74477 -53772 -35246 -26949 6643 62816 44251 -19243 -58165 -63393
23048f3393L4501m5089J1828L3098P406K0113k6706j8086K1653m5765l4684j5869
$$ -63393 -28892 -73981 -62153 -29055 -21649 -1536 -28242 -46328 -24675 -70440 -105124 -120993
23036a20993Q6767J9781J8156p685K1593j4253J3044k1437n8847n366r845K1042
$$ -120993 -34226 -14445 3711 -3974 17619 3366 16410 -5027 -63874 -69240 -79085 -58043
23024e8043O728q13J1874L1784j5720k9211r601J3458K1691K0318R5j8962J587
$$ -58043 -51315 -52128 -40254 -8470 -24190 -53401 -63002 -49544 -27853 -7535 -7440 -26402 -24815
23011b4815m5068l1498N4519Q4803j1535l0624K592j7048q985O1729l6484p078
$$ -24815 -69883 -101381 -46862 37941 26406 -4218 -1626 -18674 -27659 34070 -2414 -9492
22999i492j2448J8789J3228L2862R927m1464n3376j738L0975J0821K5689J7419
$$ -9492 -21940 -3151 10077 42939 52866 11402 -41974 -43712 -12737 -1916 23773 41192
22987D1192o1071n5178j649L6047O7305k6710k3857l637m9956L5326N9032r985
$$ 41192 -19879 -75057 -76706 -40659 26646 -64 -23921 -27558 -77514 -42188 16844 6859
22975F859J272l7480K0625Q4165j5839j6331l790M8461o8958p8982L6089k5185
$$ 6859 8131 -29349 -8724 75441 59602 43271 39481 87942 18984 -59998 -23909 -49094
22963d9094k8025J828P942j5097N1209L7384K7806L339l9696k8590N111m8429
$$ -49094 -77119 -75291 -67349 -82446 -31237 6147 33953 37292 -2404 -30994 -25883 -74312
22951g4312J3756M1156O4375m4985p3855k7408J666J551J0372M8182L8208L4972
$$ -74312 -60556 -19400 44975 -10 -73865 -101273 -99607 -98056 -87684 -39502 -1294 33678
22939C3678m0151J2850L8731K923R371J3359q2697m3330m055J9717l8037R301
$$ 33678 -6473 6377 45108 48031 57402 70761 -11936 -55266 -59321 -39604 -77641 -68340
22927f8340L3701j1309M0221K3684K1679k1391n8170m530p216o3136k1683m3436
$$ -68340 -34639 -45948 -5727 17957 39636 18245 -39925 -44455 -51671 -114807 -136490 -179926
22915a79926M252O8479O386p597J3341K7731K1571l306k4478J8516k9837k0246
$$ -179926 -175674 -107195 -100809 -108406 -95065 -67334 -45763 -49069 -73547 -55031 -84868 -105114
22903a05114M4485L0038M2577J0229k5186R618L444k4572k1728P262p6J7883r587
$$ -105114 -60629 -30591 11986 22215 -2971 6647 10091 -14481 -36209 -28947 -29023 -11140 -20727
22890b0727l5273M2517J3835n5690j1976L6550l485K4118m748j6983k9164o7440
$$ -20727 -56000 -13483 352 -55338 -67314 -30764 -34249 -10131 -14879 -31862 -61026 -128466
22878a28466M0573J7593j3273k7846M1866N2639k4405R078K9704q859l0455k9119
$$ -128466 -87893 -70300 -83573 -111419 -69553 -16914 -41319 -32241 -2537 -11396 -41851 -70970
22866g0970M1633L5316J5043L982m1668n4468L2452j4151l0776J1817K9271o583
$$ -70970 -29337 5979 21022 25004 -16664 -71132 -38680 -52831 -83607 -71790 -42519 -49102
22854d9102O501M6175L6854l1729l1264n3357j1803L7322K4043j4944M6946l2546
$$ -49102 -42601 3574 40428 8699 -22565 -75922 -87725 -50403 -26360 -41304 5642 -26904
22842b6904j3270l1296l1512N858M5743N3527J11j4845l3489K2158k1878q982
$$ -26904 -40174 -71470 -102982 -97124 -51381 2146 2257 -12588 -46077 -23919 -45797 -54779
22830e4779k5885K8370M8568P4631j2762l9275l4124J3931l3348q2045m0053O7227
$$ -54779 -80664 -52294 -3726 70905 58143 18868 -15256 -1325 -34673 -116718 -156771 -89544
22818h9544K0823j5981l8586k315R487N8059N184k3691m5973J8603L4706J7485
$$ -89544 -68721 -84702 -123288 -125603 -116116 -58057 -52873 -76564 -122537 -103934 -69228 -51743
22806e1743L7157J3658J1171l0794j5689R203j6782J4178O187O6666L1604K5101
$$ -51743 -14586 -928 10243 -20551 -36240 -27037 -43819 -29641 -23454 43212 74816 99917
22794I9917k3680q8453o7147L2288M8739k6352l7340m044j2375k2937K7956O4665
$$ 99917 76237 -12216 -79363 -47075 1664 -24688 -62028 -66072 -78447 -101384 -73428 -8763
22782h763O0347p002n6348n0539M4947J1137j51k3677J5027J4930j5965j4779
$$ -8763 51584 44582 -11766 -62305 -17358 -6221 -6372 -30049 -15022 -92 -16057 -30836
22770c0836K6988k08l4443j117n5685p321K9183k7031Q3450j044N8098k971p3326
$$ -30836 -3848 -4056 -38499 -39616 -95301 -102622 -73439 -100470 -17020 -18064 40034 37063 -36263
22757c6263q766K2261l6910k1292N8592O8505L550k423K0624m3557p5682K6857
$$ -36263 -45029 -22768 -59678 -80970 -22378 46127 49677 47254 67878 24321 -51361 -24504
22745b4504J4779j8583n961o0474k2420o713j4767K2070Q5013K0935j9370J9136
$$ -24504 -9725 -28308 -34269 -94743 -117163 -123876 -138643 -116573 -31560 -10625 -29995 -10859
22733a0859M2771l1197K748M9609M1161k4454m5622m234P3597O9970K1339m583
$$ -10859 31912 715 3463 53072 94233 69779 24157 19923 93520 163490 184829 180246
22721A80246m7732k3686q952n3042o7723l9519M8308L098j154J1387k4778m6410
$$ 180246 132514 108828 99876 46834 -20889 -60408 -12100 -9002 -10156 1231 -23547 -69957
22709f9957K1013n1043K6078K2318K9360J630j5783N6678j8156J775M914n9420
$$ -69957 -48944 -99987 -73909 -51591 -22231 -20601 -36384 20294 2138 3913 8827 -50593
22697e0593k7724K0834L8561L3081n3433j0995j661k3816M2283K7718O633J0588
$$ -50593 -78317 -57483 -18922 14159 -39274 -50269 -51930 -75746 -33463 -5745 888 11476
22685A1476l7883l4172l1494k3985L2074N1226N7523k6231j2025L6577L1171k0396
$$ 11476 -26407 -60579 -92073 -116058 -83984 -32758 24765 -1466 -13491 23086 54257 33861
22673C3861k6118P583l5140k2370l2242j4960k085M2103N5496J0066M6614o549
$$ 33861 7743 15326 -19814 -42184 -74426 -89386 -91471 -49368 6128 16194 62808 56259
22661E6259N858j7798r8546j0721r552Q857L710l2504k2539J3870R8506J3375
$$ 56259 62117 44319 -54227 -64948 -74500 -65643 -61933 -94437 -116976 -103106 -4600 8775
22649H775j7990K4160k6879o3544K5578L5110Q737J6512o888j0503K1204M1057
$$ 8775 -9215 14945 -11934 -75478 -49900 -14790 -6053 10459 3571 -6932 14272 55329
22637E5329R841J9816J1503q1548p2428J5439N182l2858M620m8890N6964m268
$$ 55329 65170 84986 96489 14941 -57487 -42048 -36866 -69724 -65104 -113994 -57030 -61298
22625f1298L5812J8141N611M3916l8233o5862q038m2120M5213N4209M290K6608
$$ -61298 -25486 -7345 -1734 42182 3949 -61913 -69951 -112071 -66858 -12649 -8359 18249
22613A8249j6951J6718j7314j0872k341l0491m4788K0386n96j2289m7152j6595
$$ 18249 1298 18016 702 -10170 -12511 -43002 -87790 -67404 -68000 -80289 -127441 -144036
22601a44036M7411M8469j738p0824J4666J6425N0748J8844J6311J2615k1264j8573
$$ -144036 -96625 -48156 -49894 -120718 -106052 -89627 -38879 -20035 -3724 8891 -12373 -30946
22589c0946O187o420k6752J0037J5099l7340n3976M9791P179M1512J8165m7391
$$ -30946 -24759 -31179 -57931 -47894 -32795 -70135 -124111 -74320 -67141 -25629 -7464 -54855
22577e4855j8640j0582L6274K4702J8690L9129p726n2380O467J880N257P8249
$$ -54855 -73495 -84077 -47803 -23101 -4411 34718 26992 -25388 -18921 -17041 -11784 66465
22565F6465P406p6120p8417j03626j6098J15201M5147j148k288m119l1349Q400
$$ 66465 73871 -2249 -80666 -184292 -200390 -85189 -40042 -41190 -43478 -47597 -78946 -70546
22553g0546L3538M0905p743M4078O8427j5957k8707n8776m1610r332M3550M7619
$$ -70546 -37008 3897 -3846 40232 108659 92702 63995 5219 -36391 -45723 -2173 45446
22541D5446l6816k3394j1617o095p223L9178k654j3830K674l4814q679O264l793
$$ 45446 8630 -14764 -26381 -32476 -39699 -521 -3175 -17005 -14331 -49145 -57824 -51560 -55353
22528e5353k0989n3472k4819L903N8001Q23M14m936J0568N7514O137Q908O9213
$$ -55353 -76342 -129814 -154633 -150730 -92729 -91906 -91492 -96428 -85860 -28346 -22209 -13301 55912
22515E5912M357m4080m9182l9903M8988L7954L5860N747m760L5363N5133n4118
$$ 55912 60269 16189 -32993 -72896 -23908 14046 49906 55653 50893 86256 141389 87271
22503H7271r0584k6906J6217k4968J8079P3280L112l6987n0862N504J807k5384
$$ 87271 -3313 -30219 -14002 -38970 -20891 52389 55501 18514 -32348 -26844 -25037 -50421
22491e0421j3632P835M4418L9114j3531J369Q818K3215J2389j2644J200m0106
$$ -50421 -64053 -56218 -11800 27314 13783 15152 23970 47185 59574 46930 48130 8024
22479H024k3780K2403j2012j5J7957J3730j9426L2905K071l8457L5612J687k5601
$$ 8024 -15756 6647 -5365 -5380 12577 26307 6881 39786 41857 3400 39012 40699 15098
22466A5098J8133l8787L8247O9870k4128J7007k5696o3386j7952K1092j5399M7135
$$ 15098 33231 -5556 32691 102561 78433 95440 69744 6358 -11594 9498 -5901 41234
22454D1234M0368k3253k5729O3796j7124n4283m5900p6643K110J9540K6874N1984
$$ 41234 81602 58349 32620 96416 79292 25009 -20891 -97534 -95424 -75884 -49010 2974
22442B974k42M4636J8238l0588j0539K1661N2804j8180m4756J3822M7157k2833
$$ 2974 2732 47368 65606 35018 24479 46140 98944 80764 36008 49830 96987 74154
22430G4154l6940l1831K5006l7641n5957J9061J25292l940o437o2417m5124J3311
$$ 74154 37214 5383 30389 -7252 -63209 -44148 81144 77204 70767 8350 -36774 -23463
22418b3463K0256j929k9335L2612L2640m195J0455j4100p5343J459L6967q014
$$ -23463 -3207 -5136 -34471 -1859 30781 26586 37041 22941 -52402 -50943 -13976 -21990
22406b1990l2308K9753K734O029M0211M63L6388k2006J4685M676k1310m7974m5153
$$ -21990 -54298 -24545 -21811 -15782 24429 24892 61280 39274 53959 58635 37325 -10649 -55802
22393e5802M906M7015N0402L2642M6340J8116l9240l9013m7052m2497m3219O6566
$$ -55802 -50896 -3881 46521 79163 125503 143619 104379 65366 18314 -24183 -67402 -836
22381h36N958n946m0755k4857k1712m2271j309N5775L6789J3916j1394m7128J3842
$$ -836 5122 -824 -41579 -66436 -88148 -130419 -131728 -75953 -39164 -25248 -36642 -83770 -69928
22368f9928k0015l9742R18J3997P6917J3243r1941J4697P7432o461p2870j5544
$$ -69928 -89943 -129685 -128767 -114770 -37853 -24610 -116551 -101854 -24422 -30883 -103753 -119297
22356a19297L8634N7104j0895N2809K6547L4474k6277j4173k9635p2747m239O5001
$$ -119297 -80663 -23559 -34454 18355 44902 79376 53099 38926 9291 -63456 -67695 -2694
22344b694Q139k049J5439m8394L3531P8702k6897n0523O0671J0604K6087Q069
$$ -2694 5445 3396 18835 -29559 3972 82674 55777 5254 65925 76529 102616 110685
22332A10685L3631K1145k7708J1847n662J7980j9420o1180l1701L2534r788m4641
$$ 110685 144316 165461 137753 149600 143938 161918 142498 81318 49617 82151 72363 27722
22320B7722j2707j6969J7082M2287k0157L8748M2314n3586q422k9588l8280j0315
$$ 27722 15015 -1954 15128 57415 37258 76006 118320 64734 56312 26724 -11556 -21871
22308b1871K0137K5490l7712n7528L2192K1893j5741j4097m4168m0583N6917M4682
$$ -21871 -1734 23756 -13956 -71484 -39292 -17399 -33140 -47237 -91405 -131988 -75071 -30389
22296c0389o008L4303J1483O5834j1522l2057M222l2601o3436j2287O2668K0568
$$ -30389 -36397 -2094 9389 75223 63701 31644 35866 3265 -60171 -72458 -9790 10778
22284A0778l5390j3132l4544P649Q8318K1516m7136L8075m6451j24479L9784M6053
$$ 10778 -24612 -37744 -72288 -64639 23679 45195 -1941 36134 -10317 -134796 -95012 -48959
22272d8959j6298J3268Q2160o034m2674p2402P651R759M1357K8162m488k8326
$$ -48959 -65257 -51989 30171 24137 -18537 -90939 -83288 -73529 -32172 -4010 -8498 -36824
22260c6824j3151L1661K3804J1617o154m4523j2206K8000o04R400L2049J133p0129
$$ -36824 -49975 -18314 5490 17107 10953 -33570 -45776 -17776 -18380 -8980 23069 24202 -45927
22247d5927Q428K0341J2211j0137J3249l5215L991P6426j8597j1190m3154L0011
$$ -45927 -37499 -17158 -4947 -15084 -1835 -37050 -33059 43367 24770 13580 -29574 437
22235D37N8658r487r6965j00678j5006L0410R6267J5548K0349R255L5021M6924
$$ 437 59095 49608 -47357 -148035 -163041 -132631 -36364 -20816 -467 8788 43809 90733
22223I0733o2857l6346J6788K3077r197P337R507l621R384j9744k2118N5143j544
$$ 90733 27876 -8470 8318 31395 22198 29535 39042 35421 44805 25061 2943 58086 56542
22210E6542k7580n1896m4777R450O7179l8768p074J1550k2917m2010J6089q933
$$ 56542 28962 -22934 -67711 -58261 8918 -29850 -36924 -25374 -48291 -90301 -74212 -83145
22198h3145o2256R347L3192K7070M1180o000J7682R054%K8203j2623J3577K9441
$$ -83145 -145401 -136054 -102862 -75792 -34612 -40612 -22930 -13876 -13876 14327 1704 15281 44722
22185D4722p870m0064k1297K1083M4507k0092J5136p336l2853k8104k8034J5737
$$ 44722 36852 -3212 -24509 -3426 41081 20989 36125 28789 -4064 -32168 -60202 -44465
22173d4465J9395J8776q11k6270Q578K8334L2776K1440k3599o14J3414q0016K870
$$ -44465 -25070 -6294 -7105 -33375 -24797 3537 36313 57753 34154 33540 46954 -33062 -30192
22160c0192L8295n7764k5951M019O9533k8822o358L5284n472m544j2657m8505
$$ -30192 8103 -49661 -75612 -71593 -2060 -30882 -37240 -1956 -7428 -11972 -24629 -73134
22148g3134m789P3786K3384m3050j2808J0896k4697K0665L3113O6153n954r570
$$ -73134 -77923 -4137 19247 -23803 -36611 -25715 -50412 -29747 3366 69519 63565 53995
22136E3995N0933n3196p8628M773k1307k2527L2619n916j46L657L9225L0909j5563
$$ 53995 104928 51732 -26896 -22123 -43430 -65957 -33338 -39254 -39400 -35743 3482 34391 18828
22123A8828q206o163k2754j6045k946L8544J3765J53l3248L0382J8264M6770J103
$$ 18828 10622 4459 -18295 -34340 -37286 1258 15023 15176 -18072 12310 30574 77344 78447
22110G8447p7224l4712M899J7441K9577m9000L7420K8756p7431p9207l0288O9848
$$ 78447 1223 -33489 -28590 -11149 18428 -30572 6848 35604 -41827 -121034 -151322 -81474
22098h1474M1591k2849j509L7319J1062j5334O0157M4500K670l1498m5182N2070
$$ -81474 -39883 -62732 -64241 -26922 -15860 -31194 28963 73463 76133 44635 -547 51523
22086E1523R4494m8628j03544j0321J1984L5655p502k9113o2019l914J08161N4774
$$ 51523 146017 97389 -6155 -16476 -4492 31163 23661 -5452 -67471 -71385 36776 91550
22074I1550n3444M383o699j0214j3024k47m943n2176m8388j865L5284j0332n3724
$$ 91550 38106 42489 35790 25576 12552 12305 7362 -44814 -93202 -95067 -59783 -70115 -123839
22061a23839K2290O7929J3118M3026K0570n3015j0995R875K769L3593O85k1448
$$ -123839 -101549 -33620 -20502 22524 43094 -9921 -20916 -11041 -8272 25321 26006 4558
22049D558j1293K4451P760n1218j1375L2238o5256p3651K0419O9816Q267r721
$$ 4558 -6735 17716 25476 -25742 -37117 -4879 -70135 -143786 -123367 -53551 -45284 -55005
22037e5005L590L4935O9480l637K6795j6886J109j6659k5630r04r088l5463L4260
$$ -55005 -51415 -16480 53000 49363 76158 59272 60381 43722 18092 17188 8100 -27363 6897
22024F897j1905n926k324j7145K7234R1m977J3322k0089k0504L0286N8548q324
$$ 6897 -5008 -10934 -13258 -30403 -3169 -3078 -8055 5267 -14822 -35326 -5040 53508 45184
22011D5184o3618J729M3031J1641J8416j6642J1726l1092J8569M3406k1718p2337
$$ 45184 -18434 -16705 26326 37967 56383 39741 51467 20375 38944 82350 60632 -11705
21999a1705j8207J6132K2152j8547j2429L131o887J2292J2415n9922N137K1841
$$ -11705 -29912 -13780 8372 -10175 -22604 -19473 -26360 -14068 -1653 -61575 -56438 -34597
21987c4597O3690j7785O0282j077r250q2180o7553j3274M6158K4625j3588J4904
$$ -34597 29093 11308 71590 70513 61263 -20917 -88470 -101744 -55586 -30961 -44549 -29645
21975b9645m5624K7436K9702m71R81k0467l4987j2864K9089P5496N1853M5322
$$ -29645 -75269 -47833 -18131 -18602 -17621 -38088 -73075 -85939 -56850 18646 70499 115821
21963A15821n0018k7175o564n1131n054K3482N9081m58j7652n2517l3640j5933
$$ 115821 65803 38628 32064 -19067 -24121 -639 58442 57984 40332 -12185 -45825 -61758
21951f1758K2072N635l816K9894P23L6855k2991P39l9917k4387j4227L3950P4538
$$ -61758 -39686 -34051 -37867 -7973 -7250 29605 6614 7353 -32564 -56951 -71178 -37228 37310
21938C7310J9378k493k9504j6986l147O0450R211m308m5882l2134J9026o4136
$$ 37310 56688 54195 24691 7705 4558 65008 74219 69911 24029 -8105 10921 -53215
21926e3215m5481N1171N5869K1117K7513j6150K6499k0011J1515J8470l3334n6573
$$ -53215 -98696 -47525 8344 29461 56974 40824 67323 47312 58827 77297 43963 -12610
21914a2610n677J0156k8110o7441L3596L2404M9272j2941l4449m7690J7257R830
$$ -12610 -18287 -8131 -36241 -103682 -70086 -37682 11590 -1351 -35800 -83490 -66233 -56403
21902e6403L9574Q939m4704N0059J00314j6716r0079n7466j7037n2452K821o4
$$ -56403 -16829 -7890 -52594 -2535 97779 81063 -9016 -66482 -83519 -135971 -133150 -133214
21890a33214k4915N3755K5715J2493j7396p685M833j469O9375N2317k9692o568
$$ -133214 -158129 -104374 -78659 -66166 -83562 -91247 -86414 -87883 -18508 33809 4117 -2451
21878b451J3081R624l6085l430J4088K0277J2875q306L7820K0512k6189k6769
$$ -2451 10630 20254 -15831 -19261 -5173 15104 27979 19673 57493 78005 51816 25047
21866B5047n2331o6559K5656L7988M7588l6716J1315l0960l6541L4276J7057l8165
$$ 25047 -27284 -93843 -68187 -30199 17389 -19327 -8012 -38972 -75513 -41237 -24180 -62345
21854f2345O211k0382K4549L9480J8250n795j3690K181n776K3055L0801o2297
$$ -62345 -56134 -76516 -51967 -12487 5763 -32 -13722 -11541 -17317 5738 36539 -25758
21842b5758J9354k9239l0364O325k3009L915O55K2614J749J0935k0304j8456k005
$$ -25758 -6404 -35643 -66007 -59682 -82691 -78776 -78121 -55507 -53758 -42823 -63127 -81583 -83588
21829h3588Q8321M0858j2677l799n5394k6208J454K2827L0672j0532n6182k3132
$$ -83588 4733 45591 32914 29115 -26279 -52487 -51033 -28206 2466 -8066 -64248 -87380
21817h7380k3684m3133M6652P3485K4695k4869j8811k9855J3289L6467J8548L9842
$$ -87380 -111064 -154197 -107545 -34060 -9365 -34234 -53045 -82900 -69611 -33144 -14596 25246
21805B5246j1599n5954J5096M8516L619J1829N4048j6764k1269J6188M5082k9289
$$ 25246 13647 -42307 -27211 21305 24924 36753 90801 74037 52768 68956 114038 84749
21793H4749j40173j8674K9821L6295k4470o529K9110J2166P0686j8979p1647o53
$$ 84749 -55424 -74098 -44277 -7982 -32452 -38981 -9871 2295 72981 54002 -17645 -18298
21781a8298j81J0846l3125K260O986Q2420q564r4038m0490P866L996J6190J8840
$$ -18298 -18479 -7633 -40758 -38498 -31512 50908 42344 -51694 -92184 -84318 -80322 -64132 -45292
21768d5292L8741l5941J1030l827n7578l5168J9691M9533Q2431J0033m3128j3804
$$ -45292 -6551 -42492 -31462 -35289 -92867 -128035 -108344 -58811 23620 33653 -9475 -23279
21756b3279P1253J1042m0145J680N1044p4171l5294J7051k215J6684J3951k0036
$$ -23279 47974 59016 18871 20551 71595 -2576 -37870 -20819 -23034 -6350 7601 -12435
21744a2435J5550K2464r243K930k791K12n4749j0014k9711K7804k5245r750r633
$$ -12435 3115 25579 16336 19266 16475 16687 -38062 -48076 -77787 -49983 -75228 -84978 -94611
21731i4611L355O1812K9407K5378m480J2634k4675j2043N4012o6320n7279L2747
$$ -94611 -91256 -29444 -37 25341 20861 33495 8820 -3223 50789 -15531 -72810 -40063
21719d0063O8908n9241n7787K7278K9695J348L1671J9126n6859P792K7761R142
$$ -40063 28845 -30396 -88183 -60905 -31210 -29862 1809 20935 -35924 -28132 -371 8771
21707H771n5134L4640K1423N076J5793M319L9554l4190j0136m6855Q276J0763
$$ 8771 -46363 -11723 9700 14776 30569 34888 74442 40252 30116 -16739 -8463 2300
21695B300j6854m5261J8667J9210l6972j9156P0024M1800j7303M8283l1193j6866
$$ 2300 -14554 -59815 -41148 -21938 -58910 -78066 -8042 33758 16455 64738 33545 16679
21683A6679K049l7m8340l6739R07K4363j9140J9196K9440n1430j2857K470L7500
$$ 16679 18728 18691 -29649 -66388 -65481 -41118 -60258 -41062 -11622 -63052 -75909 -73439 -35939
21670c5939m0345m0451O4084L4292l5802n616K1573O5977M9535j646k6871l2972
$$ -35939 -76284 -116735 -52651 -18359 -54161 -59777 -38204 27773 77308 75662 48791 15819
21658A5819l7415J8885O6501J8456o5656p2334j1292M3094J7198k789N352N7920
$$ 15819 -21596 -2711 63790 82246 16590 -55744 -67036 -23942 -6744 -9533 -4181 53739
21646E3739j243m9082N6203M7052j7617k4649K635o1303o7931K3472m093j5197
$$ 53739 52496 3414 59617 106669 89052 64403 67038 5735 -62196 -38724 -42817 -58014
21634e8014m9765l170M5378M3291r873j4385L5869O0684L980m7235K463q579J8274
$$ -58014 -107779 -110949 -65571 -22280 -32153 -46538 -10669 50015 53995 6760 9223 644 18918
21621A8918k7465o2560L6938M8869K2155l8607l5254j6378L3416K3794l4884l202
$$ 18918 -8547 -71107 -34169 14700 36855 -1752 -37006 -53384 -19968 3826 -31058 -34260
21609c4260N1661n6055K4365k5398l4247M1124k1688m5356N790L0928L1034n249
$$ -34260 17401 -38654 -14289 -39687 -73934 -32810 -54498 -99854 -94064 -63136 -32102 -37351
21597c7351j409J3138N4781m9673m5898k99j1135j2903K2870K140J8231M9688
$$ -37351 -38760 -25622 29159 -20514 -66412 -66711 -77846 -90749 -67879 -65739 -47508 2180
21585B180L9551l7929p9769N48k3559L7273n060N459J0346k8398J0449J9932j9279
$$ 2180 41731 3802 -75967 -75419 -98978 -61705 -66765 -61306 -50960 -79358 -68909 -48977 -68256
21572f8256n2862j6712O6151J594r533j8575j0663J488j764L0084J11034O1416
$$ -68256 -121118 -137830 -71679 -70085 -79618 -98193 -108856 -107368 -109132 -79048 31986 93402
21560I3402O515j1021l0575l7394m2318L079j6026m1897L200Q312q738m91M5095
$$ 93402 99917 88896 58321 20927 -21391 -18312 -34338 -76235 -73035 -64723 -73461 -73952 -28857
21547b8857L4595l3015k5636k5160J0289p860L0912Q8254N8720l2541j4230k2726
$$ -28857 5738 -27277 -52913 -78073 -67784 -75644 -44732 43522 102242 69701 55471 32745
21535C2745k5078m187K2062l7997m7967j4446l8737M7441M1749n1288n1297j9783
$$ 32745 7667 3480 25542 -12455 -60422 -74868 -113605 -66164 -24415 -75703 -127000 -146783
21523a46783L2897J282O1595M0141j7724K6568N5015N7013k559p3250k0501M488
$$ -146783 -113886 -112604 -51009 -10868 -28592 -2024 52991 110004 107445 34195 13694 18182
21511A8182J9189k8911l2693j9038R324j3440P653k532j5092J5324l340R731K930
$$ 18182 37371 8460 -24233 -43271 -33947 -47387 -39734 -42266 -57358 -42034 -45374 -35643 -32713
21498c2713k5814L8705M852q654M3522l3651q7224o317o791P558O2028J2863m1465
$$ -32713 -58527 -19822 -14970 -23624 19898 -13753 -100977 -107294 -114085 -106527 -44499 -31636 -73101
21485g3101J0137j9845O261J5558N2844L8604l3722k211n3811r006K4491N1425
$$ -73101 -62964 -82809 -76548 -60990 -8146 30458 -3264 -5475 -59286 -68292 -43801 7624
21473G624L2378m5169k4085O2830j4893n6348j5852P8484N0777m3363j5264J2534
$$ 7624 40002 -5167 -29252 33578 18685 -37663 -53515 24969 75746 32383 17119 29653
21461B9653q646m234L200n4196k2416L12j1434K3839O2815K762k1972L5971m0453
$$ 29653 21007 16773 19973 -34223 -56639 -56327 -67761 -43922 18893 21655 -317 35654 -4799
21448d799j7934k949J6916N3480l5993p2717o204N2289j4288j1710j731L7096
$$ -4799 -22733 -25682 -8766 44714 8721 -63996 -70200 -17911 -32199 -43909 -45640 -8544
21436h544J2415j1148j2225k7830J2770r256p614L8593J0533n1670j8258n156
$$ -8544 3871 -7277 -19502 -47332 -34562 -43818 -51432 -12839 -2306 -53976 -72234 -77390
21424g7390K4577N1036J1728k1631m1452M22L912k3471k699k3977k1064l2537
$$ -77390 -52813 -1777 9951 -11680 -53132 -52710 -48798 -72269 -74968 -98945 -120009 -152546
21412a52546Q387R2522N9467L917K8617l384j0023N5321J6418m4589j9101L2000
$$ -152546 -144159 -51637 7830 11747 40364 36980 26957 82278 98696 54107 35006 67006
21400F7006k0760m2427k9277L425J6026M2598p706p0869n7003o583p798L5460
$$ 67006 46246 3819 -25458 -22033 -6007 36591 28885 -41984 -98987 -105570 -113368 -77908
21388g7908M7478M6139l89k787J8799m8858K5639P3947k8765M497L4138r365n2351
$$ -77908 -30430 15709 15320 12533 31332 -17526 8113 82060 53295 57792 91930 82565 30214
21375C0214J2684O0978J5844n6984q0493j9748L7684n2165l5078L0876Q5185p459
$$ 30214 42898 103876 119720 62736 -17757 -37505 179 -51986 -87064 -56188 28997 21538
21363B1538l4219J9159j2375r61N0637N584n3326n7218J6360N2146l3561j8605
$$ 21538 -12681 6478 -5897 -6858 43779 49363 -3963 -61181 -44821 7325 -26236 -44841
21351d4841j8130Q093k2187k4963j3122J8821M4104L4038n962k0035j7901J3748
$$ -44841 -62971 -54878 -77065 -102028 -115150 -96329 -52225 -18187 -24149 -44184 -62085 -48337
21339d8337m6269K7211P5060L3526m0617k5895r401M46J696K0984K8230J2738
$$ -48337 -94606 -67395 7665 41191 574 -25321 -34722 -34276 -32580 -11596 16634 29372
21327B9372l7431j5648M3561K0050R698K2480l4312l3181K1509m6852j9498K9388
$$ 29372 -8059 -23707 19854 39904 49602 72082 37770 4589 26098 -20754 -40252 -10864
21315a0864J726J4361N2414n472l7652k3607L8038n7205J7894M4342m8369n9294
$$ -10864 -9138 5223 57637 52165 14513 -9094 28944 -28261 -10367 33975 -14394 -73688
21303g3688K5650O9929j531m2607k579P2234q378k7651K3698k6558j0595O085
$$ -73688 -48038 21891 20360 -22247 -24826 47408 39030 11379 35077 8519 -2076 4009
21291D009J1767L383p881j3031l8985N2946P11J6020l077l4790o2278m9252J1848
$$ 4009 15776 19159 11278 -1753 -40738 12208 12919 28939 25862 -8928 -71206 -120458 -108610
21278a08610O2139L4203j6335J4288L5454K927o9482O9835P7509j7347p3293j09669
$$ -108610 -46471 -12268 -28603 -14315 21139 24066 -45416 24419 101928 84581 11288 -98381
21266i8381r034M4285N8290Q787n8611l2050N168J1883K0702O3381K3974l3437
$$ -98381 -107415 -63130 -4840 3947 -54664 -86714 -81546 -69663 -48961 14420 38394 4957
21254D957l2547L191l2721n1757M2697q0725j9363O2009K7306j8171l7828N4274
$$ 4957 -27590 -24399 -57120 -108877 -66180 -146905 -166268 -104259 -76953 -95124 -132952 -78678
21242g8678Q6458O5035l3524p8838J605l252Q571Q6171L5030l0980n4577J8544
$$ -78678 7780 72815 39291 -39547 -37942 -41194 -32623 53548 88578 57598 3021 21565
21230B1565J3103k5727l9722J1816j6157j8266l3589M554J7567O4237L7406k9205
$$ 21565 34668 8941 -30781 -18965 -35122 -53388 -86977 -82423 -64856 -619 36787 7582
21218G582m8333M9057L7987n2510J5630K1300l4765J3758k8960q3181N3138J29901
$$ 7582 -40751 8306 46293 -6217 9413 30713 -4052 9706 -19254 -102435 -49297 80604
21206H0604m4704m1954M3792k1021L5429Q922m4190R492o189k3523l2661l6591
$$ 80604 35900 -6054 37738 16717 52146 61068 16878 26370 20181 -3342 -36003 -72594
21194g2594k5091M8784K1917M0834M358n3002r470O0625K6013j29J5572l2997
$$ -72594 -97685 -48901 -26984 13850 18208 -34794 -44264 16361 42374 42245 57817 24820
21182B4820l4100L2463J2374K8486k3721j0399N677m3864m4498k8959l4315N2501
$$ 24820 -9280 23183 35557 64043 40322 29923 35600 -8264 -52762 -81721 -116036 -63535
21170f3535N3238j25755k1032P5397K5213K8600M0170k5082k1371L9967J1785
$$ -63535 -10297 -136052 -157084 -81687 -56474 -27874 12296 -12786 -34157 5810 17595
21159A7595J1745r864N3460l2379p1960j6809K957j1775L5293L1003J3390q66
$$ 17595 29340 19476 72936 40557 -31403 -48212 -45255 -57030 -21737 9266 22656 21790
21147B1790J1269j13954n5645Q977M8449L5326p2694l8031Q4578Q4042J5318L7744
$$ 21790 33059 -80895 -136540 -127563 -79114 -43788 -116482 -154513 -69935 14107 29425 67169
21135F7169M1176l9527p1928k9726J5767K7388M5603L8004J2825l284k9619l3432
$$ 67169 108345 68818 -3110 -32836 -17069 10319 55922 93926 106751 103467 73848 40416
21123D0416J96J6381M1463l1147j3359L4756L7325l0860m6281p506O428j1616
$$ 40416 40612 56993 98456 67309 53950 88706 126031 95171 48890 41384 47812 36196
21111C6196j9533O5210L4165J6298k1137Q7283M3668R1503J45469N3048O8178
$$ 36196 16663 81873 116038 132336 111199 198482 242150 333653 479122 532170 600348
21100F00348J11960J01971O7625J11851M7231j33653j50179m5064j06259j35642
$$ 600348 712308 814279 881904 993755 1040986 907333 757154 712090 605831 470189
21090D70189p5851m7539n0048l9637j8490N3639J29773J30933J10546J31915K1261
$$ 470189 394338 346799 296751 257114 238624 292263 422036 552969 663515 795430 816691
21079H16691P2683M1332m035r3881j54984q8233n3599q7871j21645n0967k9021
$$ 816691 889374 930706 926671 832790 677806 589573 535974 448103 326458 275491 246470
21068B46470o7182m9592m0460K1150J1693m6784j5137K4652j3394l7807m7213
$$ 246470 179288 129696 89236 110386 122079 75295 60158 84810 71416 33609 -13604
21057a3604K1937R912M6259k3433m2289m647k5507n6100O44K9108K1124j5115
$$ -13604 8333 18245 64504 41071 -1218 -5865 -31372 -87472 -86828 -57720 -36596 -51711
21045e1711N4249j0076l2937N2372M2475J6381M0519k8973n1216l0443m1222K3270
$$ -51711 2538 -7538 -40475 11897 54372 70753 111272 82299 31083 640 -40582 -17312
21033a7312L0421K0504k9469o402k557j0815N7005k3653J0977l2369J2764J4481
$$ -17312 13109 33613 4144 -2258 -4815 -15630 41375 17722 28699 -3670 9094 23575
21021B3575J8295k748N806k7962j9272k1343L4590k8881l6781L4651L8754k2091
$$ 23575 41870 39122 44928 16966 -2306 -23649 10941 -17940 -54721 -20070 18684 -3407
21009c407m4869M2799P5441q3094q7407k8716l4482O4159N6438j0880K7751L8740
$$ -3407 -48276 -5477 69964 -13130 -100537 -129253 -163735 -99576 -43138 -54018 -26267 12473
20997A2473J1793q008o677O0009k6807p2258P282N0726p438j7941j7188j6653
$$ 12473 24266 16258 9581 69590 42783 -29475 -22193 28533 21095 3154 -14034 -30687
20985c0687L9563O7245j5698m8902l5813K8949J8444o1626m507K062l1038L1047
$$ -30687 8876 76121 60423 11521 -24292 4657 23101 -38525 -43032 -40970 -72008 -40961
20973d0961L2478m837j8004L887O6598J2034N631L8561J9103k8190k0333o165
$$ -40961 -8483 -13320 -31324 -27437 39161 51195 56826 95387 114490 86300 65967 59802
20961E9802L4381p7415q4636k7308J0400M7720J5490N7649R3944k2177o4654m1025
$$ 59802 94183 16768 -67868 -95176 -84776 -37056 -21566 36083 130027 107850 43196 2171
20949B171J633M995o453N583o1622K0689J2189j9754l2069K4208L0148N2374L5132
$$ 2171 3804 8799 2346 7929 -53693 -33004 -20815 -40569 -72638 -48430 -18282 34092 69224
20936F9224j9461o1151K2275j5313J6395M7744l1500k5148J5089R096p8598M2030
$$ 69224 49763 -11388 10887 -4426 11969 59713 28213 3065 18154 27250 -51348 -9318
20924i318K0946L3864k615p0478m5247j3255K2860M8521L7915k5060n095K6455
$$ -9318 11628 45492 42877 -27601 -72848 -86103 -63243 -14722 23193 -1867 -6962 19493
20912A9493l2184o1622m9152O9809P1567J7347k5563k2289K7419K2738N1654l9127
$$ 19493 -12691 -74313 -123465 -53656 17911 35258 9695 -12594 14825 37563 89217 50090
20900E0090n9694l1131m192L5239J0975O363j6990l3097J1195N8024k1527J5545
$$ 50090 -9604 -40735 -44927 -9688 1287 7650 -9340 -42437 -31242 26782 5255 20800
20888B0800K3437L9637n256n0956p4315J0001Q5315K2828j1923K5040L289j1963
$$ 20800 44237 83874 78618 27662 -46653 -36652 48663 71491 59568 84608 87897 75934
20876G5934k0032p0717q686j0682J7477j3557o9227P409M8278M4841o0763m8838
$$ 75934 55902 -14815 -23501 -34183 -16706 -30263 -99490 -92081 -43803 1038 -59725 -108563
20864a08563J8411p558Q50j9079K3372K5920J0579J08002M2218n5953p8702l7033
$$ -108563 -90152 -97710 -96860 -115939 -92567 -66647 -56068 51934 94152 38199 -40503 -77536
20852g7536N0856N311N7345L6115n4676P0681N8637j4308L317m4699m1627k7954
$$ -77536 -26680 -21369 35976 72091 17415 88096 146733 132425 135742 91043 49416 21462
20840B1462l2739j2835k5460k7361L51M9421k0467n2248J0363k7195o2781q85
$$ 21462 -11277 -24112 -49572 -76933 -76582 -27161 -47628 -99876 -89513 -116708 -179489 -180374
20828a80374L2915N8798L5491k7682k564M2440K3094m186l3333q598M1315K2686
$$ -180374 -147459 -88661 -53170 -80852 -83416 -40976 -17882 -22068 -55401 -63999 -22684 2
20816BL401J1599L4634l2984J4064k5466l2868j1683l5433k8347K1969M1392P2164
$$ 2 3403 15002 49636 16652 30716 5250 -27618 -39301 -74734 -103081 -81112 -39720 32444
20803C2444o409N176N6188l2768l0027j3252L5582P877j0392m4107J3258K368
$$ 32444 26035 31211 87399 54631 24604 11352 46934 54811 44419 312 13570 15938
20791A5938K0525K3507l0542K3908M8020r411N724P126N6385O848p414k3063L0974
$$ 15938 36463 59970 29428 53336 101356 91945 97669 104795 161180 168028 160614 137551 168525
20778A68525L7103K7645L2888L8045l9508o3971o2819L0747k698p3771m6403l0767
$$ 168525 205628 233273 266161 304206 264698 200727 137908 168655 165957 92186 45783 15016
20766A5016N80o007p106k3555k926N7440J4065j8059L2104J3946J7461J0651l2477
$$ 15016 15596 9589 2483 -21072 -23998 33442 47507 29448 61552 75498 92959 103610 71133
20753G1133k6979M5755m5317l6433m848k2256M790J0747j3824K6690M9921K0331
$$ 71133 44154 89909 44592 8159 3311 -18945 -14155 -3408 -17232 9458 59379 79710
20741G9710j4501l8959k3183K9953L0655k1467p0183k1705N5109J0068l9286j8994
$$ 79710 65209 26250 3067 33020 63675 42208 -27975 -49680 5429 15497 -23789 -42783
20729d2783R539O2141R115k6399L7764J875p642L3262j2964P549l926k6906k0741
$$ -42783 -33244 28897 38012 11613 49377 51252 43610 76872 63908 71457 67531 40625 19884
20716A9884K6170N3446k3608L8825r105J5827L4120k0048J0230j4561m4136j6954
$$ 19884 46054 99500 75892 114717 105612 121439 155559 135511 145741 131180 87044 70090
20704G0090k2448l710L7706J2161o0957K655N2787j1702l4758K1704N1724M5007
$$ 70090 47642 43932 81638 93799 32842 35497 88284 76582 41824 63528 115252 160259
20692A60259m4793j2371j0086j4582L9386k8700K7141O4206M4517l101m7348j6088
$$ 160259 115466 103095 93009 78427 117813 89113 116254 180460 224977 221876 174528 158440
20680A58440L3505M610n4428k8494N9160N2428L1932o5856n349o1508j6465k8228
$$ 158440 191945 196555 142127 113633 172793 225221 257153 191297 185948 124440 107975 79747
20668G9747l1240Q1225R4289m4075p2843p035P5644Q429l7661k4446n2610m0779
$$ 79747 48507 129732 224021 179946 107103 100068 175712 184141 146480 122034 69424 28645
20656B8645K2376N4393N9433Q3765N0691Q9528N6055L5192L042k1996K1014m6301
$$ 28645 51021 105414 164847 248612 299303 388831 444886 480078 483120 461124 482138 435837
20644D35837J7867m6994j8425k3731q2231l1995N01O658r600j0375R2460J1793
$$ 435837 453704 406710 388285 364554 282323 250328 250829 257487 247887 237512 329972 341765
20632C41765k9811O822p379l7346q682M0211K991o1263o8030L9621J4521m418
$$ 341765 311954 318776 311397 274051 265369 305580 308571 247308 179278 218899 233420 229002
20620B29002K8865j3570N9451N4170j7583n8942o630J01941Q265k1716J0495O676
$$ 229002 257867 244297 303748 357918 340335 281393 274763 376704 384969 363253 373748 380424
20608C80424j7292K7179K8128j5054K7303K6392M3862K6196M3166K2768N352j4362
$$ 380424 363132 390311 418439 403385 430688 457080 500942 527138 570304 593072 598424 584062
20596E84062k1567k9896k7758o365J3300L7204J6595K5098N6408N2757M1760P0002
$$ 584062 562495 532599 504841 498476 511776 548980 565575 590673 647081 699838 741598 811600
20584H11600M1542l0390M8267P1333M4046K7140K5635M2156R2362M909R8441R6541
$$ 811600 853142 822752 871019 942352 986398 1013538 1039173 1081329 1173691 1178600 1277041 1373582
20572A373582R9755Q0540Q4164J31774J13927O6713J3420J23599J66462J94783
$$ 1373582 1473337 1553877 1638041 1769815 1883742 1950455 1963875 2087474 2253936 2448719
20562B448719J84582K43866L10303L20083K96113M35873N20976M22492K23815
$$ 2448719 2633301 2877167 3187470 3507553 3803666 4239539 4760515 5183007 5406822
20553E406822J80257K49772L88402L67432M35386M74078N76884O48964N96723
$$ 5406822 5587079 5836851 6225253 6592685 7028071 7502149 8079033 8727997 9324720
20544I324720O52629Q25861Q88952Q00217Q74465J274807J718440K317303L008104
$$ 9324720 9977349 10803210 11692162 12492379 13366844 14641651 16360091 18677394 21685498
20535B1685498L906905N238645P377589J0612481J5768433K3694913L5141743
$$ 21685498 25592403 30831048 38208637 48821118 64589551 88284464 123426207
20528A23426207M6717516M9653287M0126410L1370037L9297919L9015810M500124
$$ 123426207 170143723 219797010 259923420 291293457 330591376 369607186 374107310
20521C74107310m2132840m8512628l3342402l5057684m8587620m8248978l4602631
$$ 374107310 331974470 283461842 250119440 215061756 166474136 118225158 83622527
20514H3622527k2095127j4367247r822102o906421m969136l761078k946413k252892
$$ 83622527 61527400 47160153 37338051 30431630 25462494 21701416 18755003 16502111
20506A6502111j646844j235695r40505o96996n18672m50888n76723o25419n84827
$$ 16502111 14855267 13619572 12679067 11982071 11463399 11012511 10435788 9810369 9225542
20497I225542n80457m82082l84763l62252l74328l08331j44883j26475k81726
$$ 9225542 8645085 8163003 7778240 7415988 7041660 6733329 6588446 6461971 6180245
20488F180245n02054m86611m11597m36401n30647n05510l60003k43249j17977
$$ 6180245 5678191 5191580 4779983 4343582 3812935 3307425 2947422 2704173 2586196
20479B586196p0311n6587R62O0971k3478j63880k20009j10581k5513o2443r7373
$$ 2586196 2515885 2459298 2460260 2521231 2497753 2333873 2113864 2003283 1977770 1915327 1817954
20468A817954j07008r8511J0709L6630j02327j30948p5449r06j6732O3568O6800
$$ 1817954 1710946 1612435 1623144 1659774 1557447 1426499 1351050 1350144 1333412 1396980 1463780
20457A463780p4414j37631n6211k7744p794o28K40q5268p7911L430O6677J3861
$$ 1463780 1389366 1251735 1195524 1167780 1159986 1159358 1159598 1074330 996419 999849 1066526 1080387
20445A080387p5188m0313N240M0260J07042P0308o1532q1401j06273j74045j03226
$$ 1080387 1005199 964886 970126 1010386 1117428 1187736 1126204 1044803 938530 764485 661259
20434F61259k2527J6927j1893O467K8234L8768J06028n357J2696K1835j7035k6038
$$ 661259 638732 655659 643766 650233 678467 717235 823263 817906 830602 852437 835402 809364
20422H09364m21n560q6051j37268o4913L0959P909O9133J1444M3585O5630o4706
$$ 809364 808943 803383 717332 580064 515151 546110 554019 623152 634596 678181 743811 679105
20410F79105q3484m4702o0429L4785m338m2372n4066K5433k810j0505L1973L4029
$$ 679105 595621 550919 490490 525275 520937 478565 424499 449932 447122 436617 468590 502619
20398E02619k9360J8145L0631Q121K0027N6126J9881n6679l3840k5177n8569K668
$$ 502619 473259 491404 522035 530156 550183 606309 626190 569511 535671 510494 451925 454593
20386D54593l6801o5670R622k9748l9946m6811r170k3532K0312m1726L2140K9169
$$ 454593 417792 352122 361744 331996 292050 245239 236069 212537 232849 191123 223263 252432
20374B52432J6720l9473j9830O954N6715k2627q8336n5844M461K8643P4660Q259
$$ 252432 269152 229679 209849 216803 273518 250891 162555 106711 111172 139815 214475 222734
20362B22734k2652o267L1560k1950K9307Q6022j9690o2600J2860J5305N2561j7273
$$ 222734 200082 193815 225375 203425 232732 318754 299064 236464 249324 264629 317190 299917
20350B99917R863K7093K2995k2041l2023k3029n8972k9517j0j8492j7188L0922
$$ 299917 309780 336873 359868 337827 305804 282775 223803 194286 194276 175784 158596 189518
20338A89518L863o9358l7298j122n829m318m7121p151Q8734J05166N2318j3556
$$ 189518 193381 124023 86725 85603 79774 75456 28335 21184 109918 215084 267402 253846
20326B53846N567L5177J569k0505o965M5478J5545j1511j9227J5467q621l3279
$$ 253846 259413 294590 296159 275654 268689 314167 329712 318201 298974 314441 305820 272541
20314B72541k0536j0635n5773n0725k8384L0320L3611k9047R429j8542j2205M7154
$$ 272541 252005 241370 185597 134872 106488 136808 170419 141372 150801 132259 120054 167208
20302A67208K6970l4010O2424J9828O9496m648p5846n515k5911o4845J9801J01515
$$ 167208 194178 160168 222592 242420 311916 307268 231422 225907 199996 135151 154952 256467
20290B56467M0130j8260j16680L8296J30509P6653J07490L0236l1483l0444m8446
$$ 256467 296597 278337 161657 199953 330462 407115 514605 544841 513358 482914 434468
20279D34468r7449l2249o5122k237l7792l7484n515O438k2891l6828k108K6587
$$ 434468 337019 304770 239648 237411 199619 162135 156620 163058 140167 103339 101231 127818
20267A27818J4577j6465L4479o177m6084o7229P0190L0478R196N1558l3120m3104
$$ 127818 142395 125930 160409 154232 108148 40919 111109 141587 150783 202341 169221 126117
20255A26117k4916m4493p171M5679N976k9357J9021M1299n253m4949l5186L0115
$$ 126117 101201 56708 49537 95216 101192 71835 90856 132155 126902 81953 46767 76882
20243G6882N8286j4129N7752J7272k2126m0740J620N9285M5819j9095n7434m5708
$$ 76882 135168 121039 178791 196063 173937 133197 134817 194102 239921 220826 163392 117684
20231A17684M7937M3819M9632k063j4710L607N7378k6568M062K8274k8383n1815
$$ 117684 165621 209440 259072 257009 242299 245906 303284 276716 280778 309052 280669 228854
20219B28854o776j5070n0578n8373J8943J870r896l0268O878J3446N7736N0451
$$ 228854 222078 207008 156430 98057 117000 118870 108974 78706 85584 99030 156766 207217
20207B07217N3486L7559L6268O9265J6746p3068j2963R458k9332o5316r534l2705
$$ 207217 260703 298262 334530 403795 420541 347473 334510 343968 314636 249320 239786 207081
20195B07081n5682O363P6341P389k0790M9117j7192j8127l558n74k0034N4989
$$ 207081 151399 157762 234103 241492 220702 269819 252627 234500 230942 230368 210334 265323
20183B65323l089J5973o663p3959k3711Q385K2313j0481j8161J1215l3001R072
$$ 265323 262234 278207 271544 197585 173874 182259 204572 194091 175930 187145 154144 163216
20171A63216j8535j4176M9028L8883Q0396M7600l0366k7498j2999p5909q1408
$$ 163216 144681 130505 179533 218416 298812 346412 316046 288548 275549 199640 118232
20160A18232L5260K6887n3625P930O7542p871l0356j07881k0801L7384l71k4662
$$ 118232 153492 180379 126754 134684 202226 194355 163999 56118 35317 72701 72330 47668
20148D7668k9836K7529j4595J3766P3775K5920L9506k9664p3216l7003J4537K2806
$$ 47668 17832 45361 30766 44532 118307 144227 183733 154069 80853 43850 58387 81193
20136H1193J1343J8786J4846K519N9099K9904m8233k435K6269L2570j7421m6941
$$ 81193 92536 111322 126168 128687 187786 217690 169457 167022 193291 225861 208440 161499
20124A61499o0453m9668K2269m578O7313J6283p022j8048J2217j0245o5489N0135
$$ 161499 101046 51378 73647 69069 136382 152665 145643 127595 139812 129567 64078 114213
20112A14213J0220j2293Q2484m462l2165J5798l1097l2165l8527k3359J3549N0676
$$ 114213 124433 112140 194624 190162 157997 173795 142698 110533 72006 48647 62196 112872
20100A12872M1370M8517j9394r652j6787j4384M0663L042m5374l5044L7787j279
$$ 112872 154242 202759 183365 173713 156926 142542 183205 186247 140873 105829 143616 142337
20088A42337k5621o828J7199M4853P4115o300j8287L1282O353o2187N0046J9972
$$ 142337 116716 109888 127087 171940 246055 239755 221468 252750 259103 196916 246962 266934
20076B66934m5319k7451l4504n8201O0961M9863m5926k113j5173J4440N559J3331
$$ 266934 221615 194164 159660 101459 162420 212283 166357 164244 149071 163511 169070 182401
20064A82401K1712k4997k858j3243j537l1919L94N8565N4346N8435M6584M7647
$$ 182401 204113 179116 176258 163015 161478 129559 129953 188518 242864 301299 347883 395530
20052C95530l4279l1880J8074j346J3743p641l6472o126K6314M4116J3658K589
$$ 395530 361251 329371 347445 346099 359842 352201 315729 309603 335917 380033 393691 396280
20040C96280r326k270L9492k4678K8350J2052K6726k727j7118o2879p251J8821
$$ 396280 386954 384684 424176 399498 427848 439900 466626 463899 446781 383902 376651 395472
20028C95472m238K461N4090N9066N6388J7137K613l9671K6004R1249J04787R5839
$$ 395472 391234 393695 447785 506851 563239 580376 582989 543318 569322 660571 765358 861197
20016H61197J36216J46630K40630K57252L41560L34934K83358J36172m4955R8759
$$ 861197 997413 1144043 1384673 1641925 1983485 2318419 2601777 2737949 2692994 2791753
20006B791753K84780K09793J79790L22886P23879J240861J709184J590900P73778
$$ 2791753 3076533 3286326 3466116 3789002 4512881 5753742 7462926 9053826 9827604
19997I827604n9669l93968o61287r34045j105876r32622n43782k9517L22548N49072
$$ 9827604 9767935 9373967 8712680 7778635 6672759 5740137 5196355 5166838 5489386 6038458
19987F038458Q02256J239664J787814K677940L541364L572521K573274J662669
$$ 6038458 6840714 8080378 9868192 12546132 16087496 19660017 22233291 23895960
19979B3895960K347777K727168K295172M039611R560093J6537113J8417710Q521525
$$ 23895960 26243737 28970905 31266077 35305688 44865781 61402894 79820604 88342129
19971H8342129j0090736j8193471j2379286o425842l380041j5960M274628N748660
$$ 88342129 78251393 60057922 47678636 41252794 37872753 37856793 42131421 47880081
19963D7880081J873663m178943l790629J045064M088620K948858j393801m027641
$$ 47880081 49753744 45574801 41784172 42829236 46917856 49866714 48472913 44445272
19955D4445272j089123N028746J0704861J2553558Q345118J405079j840818K63179
$$ 44445272 43356149 48384895 59089756 71643314 79988432 81393511 79552693 79815872
19947G9815872L09086p252466j4679847j2233576n387999O31661O218519J0595044
$$ 79815872 80124958 72872492 58192645 45959069 40571070 41202731 47421250 58016294
19939E8016294J0121554J903615r924898j3386391q721276l287384O37308L229813
$$ 58016294 68137848 70041463 60116565 46730174 38008898 34721514 35358822 38588635
19931C8588635N635701R713142J3910603J2624342L566530n777418p967539p415806
$$ 38588635 44224336 53937478 67848081 80472423 84038953 78261535 70293996 62878190
19923F2878190o971495l230724J793460K455754l417246r877960q419268l174797
$$ 62878190 55906695 52675971 54469431 56925185 53507939 43629979 35210711 32035914
19915C2035914J846161P028641J2889419J8635799J9284106Q943706j0708292
$$ 32035914 33882075 40910716 53800135 72435934 91720040 100663746 89955454
19908H9955454k2647228j7168356r936877p773507p882333o270234l920478k191502
$$ 89955454 67308226 50139870 40202993 32429486 24547153 18276919 14356441 12164939
19900A2164939r16438N4710R23123J624892J698897O20727j346514k781701k706644
$$ 12164939 11248501 11303211 12226334 13851226 15550123 16170850 14824336 12042635 9335991
19891I335991j656675p27672j8732N78717J310262J372185M94704j006055j526663
$$ 9335991 7679316 6951644 6932912 7511629 8821891 10194076 10688780 9682725 8156062
19882H156062q06504r2562j03501o51404r14718p20582l02806k02147m12729p26203
$$ 8156062 7349558 7256996 7153495 6502091 5587373 4866791 4563985 4361838 3949109 3222906
19872C222906o82401m24813k45564j93945j67600j91456j33124j11605p8750K0834
$$ 3222906 2540505 2115692 1870128 1676183 1508583 1317127 1184003 1072398 993648 1014482
19862A014482j317m195k5238l4602m2054k5375m4866Q936O377l1707j7135j5230
$$ 1014482 1013165 1008970 983732 949130 907076 881701 836835 845771 852148 820441 803306 788076
19850G88076K4314o2418j4981p514l1254r111k194J9885l1137l6399l8972m5324
$$ 788076 812390 749972 734991 727477 696223 687112 684918 704803 673666 637267 598295 552971
19838E52971l6184K9628O471o9357n0381K8444k1493q9797n9357l0878P6559P465
$$ 552971 516787 546415 552886 483529 433148 461592 440099 350302 290945 260067 336626 344091
19826C44091N0357O0694m059q1838j2064O0766q082j7668l7088O076O341o5689
$$ 344091 394448 455142 451083 369245 357181 417947 409865 392197 355109 361185 367526 301837
19814C01837l4273l7575M283N1864M6364k5629J847M7492J4850l4203j8908J0037
$$ 301837 267564 229989 234272 286136 332500 306871 308718 356210 371060 336857 317949 327986
19802C27986J5335o102l1310n3176k7928L4498K7714J153j18962j4047P6497k513
$$ 327986 343321 337219 305909 252733 224805 259303 287017 288170 169208 155161 231658 229145
19790B29145j1522o641r031k1218r837l7982K7280J1482J0020j7942l2207N914
$$ 229145 217623 210982 201951 180733 170896 132914 160194 171676 181696 163754 131547 137461
19778A37461Q1596j0382l7794K1086L1564M603l3429K4244k2685n7180o3039L960
$$ 137461 219057 208675 170881 191967 223531 228134 194705 218949 196264 139084 76045 80005
19766H0005L2559J1435L6479K4533J807k468j7570j3576N950p4896l7123J6721
$$ 80005 112564 123999 160478 185011 186818 184350 166780 153204 159154 84258 47135 63856
19754F3856K2277m7735Q172O1352l515l6146K1794K2241j0694m9909o631n237
$$ 63856 86133 38398 46570 107922 104407 68261 90055 112296 101602 51693 45062 39825
19742C9825K5899P892K2660J2948J3085j3006j7418M1368j7482l3852N863N3027
$$ 39825 65724 73616 96276 109224 122309 109303 91885 133253 115771 81919 87782 140809
19730A40809M265O053j2790o1385j7904K3901L3081n4999o711L2049L4620K1291
$$ 140809 145074 151127 138337 76952 59048 82949 116030 61031 54320 86369 120989 142280
19718A42280J2630M0817K0377j2886K9819K2601m5565l2460m6435n0045K6555
$$ 142280 154910 195727 216104 203218 233037 255638 210073 177613 131178 81133 107688
19707A07688J3924L030j678K7313m580k1913k0985k8145k78J0588K5308M7879
$$ 107688 121612 124642 122964 150277 145697 123784 102799 74654 74376 84964 110272 158151
19695A58151n0076o2552N7802K1607o545n4631L4398J7798R201j6970L2304P348
$$ 158151 108075 45523 103325 124932 118387 63756 98154 115952 125153 108183 140487 147835
19683A47835J2377k4749k2146L1394r080k7584J212k4206l4706j0497p269J4580
$$ 147835 160212 135463 113317 144711 135631 108047 109259 85053 50347 39850 32581 47161
19671D7161R772l02K9901K4087k173L2131J510p5009j3390n097J3061P408j6395
$$ 47161 56933 56631 86532 110619 108446 140577 142087 67078 53688 48591 61652 69060 52665
19658E2665m7507M6101L0270k0134j0078J7837O8996M8848j3214l3693n2736P856
$$ 52665 5158 51259 81529 61395 51317 69154 138150 186998 173784 140091 87355 95211
19646I5211P903m1486k7890P913K2010o6504K2193j0950k7568L500M2697L0920
$$ 95211 103114 61628 33738 41651 63661 -2843 19350 8400 -19168 -15668 27029 57949
19634E7949J0479j1711m7927K0724N0749o0730o2858j6580p340M4129J9795K1108
$$ 57949 68428 56717 8790 29514 80263 19533 -43325 -59905 -67245 -23116 -3321 17787
19622A7787L4875Q5044K4453j05532j7177m1771j2520K2710j115k440j9462n9465
$$ 17787 52662 137706 162159 56627 39450 -2321 -14841 7869 6754 4314 -15148 -74613
19610g4613n077J5182J2726K7317N437J6679M1046M7700q706J2810k5562j5932
$$ -74613 -79690 -64508 -51782 -24465 -19028 -2349 38697 86397 77691 90501 64939 49007
19598D9007j3568o6263j1755j214L6787N5704k1498J6342P8145k0656l6279M9696
$$ 49007 35439 -30824 -42579 -43793 -7006 48698 27200 43542 121687 101031 64752 114448
19586A14448L1588L720m2938o5917N322L101K7361J6359l4356p1623k0296L6776
$$ 114448 146036 149756 106818 40901 46223 49324 76685 93044 58688 -12935 -33231 3545
19574C545O5604J1224j8121l1544l256N45k6953K4823J2161m0752L665j3106k122
$$ 3545 69149 80373 62252 30708 27452 27997 1044 25867 38028 -2724 941 -12165 -14287
19561a4287q984L5983k0610L7928M8342l56l9704k6013m0389K4146K4662L6938
$$ -14287 -23271 12712 -7898 30030 78372 78016 38312 12299 -28090 -3944 20718 57656
19549E7656k6203J1380j3257l8197m2907p973R3642j7749k381K5584N603j1952
$$ 57656 31453 42833 29576 -8621 -51528 -59501 34141 16392 14011 39595 45198 33246
19537C3246l3203j8792J1197K1704J8278k1114j0649r730N2502K4920l1761N774
$$ 33246 43 -18749 -7552 14152 32430 11316 667 -9063 43439 68359 36598 42372
19525D2372L7873J0920J2421n4871n3239P392J4929K5712L7030n8343q924O1007
$$ 42372 80245 91165 103586 48715 -4524 2868 17797 43509 80539 22196 13272 74279
19513G4279J7411k9237m2425o6819O450K6079o0814R083N1833R377M1913j1438
$$ 74279 91690 62453 20028 -46791 -40341 -14262 -75076 -65993 -14160 -4783 37130 25692
19501B5692Q699n754J8586J5499J6238P463m3878l5978n5696M8240P1014k5620
$$ 25692 34391 28637 47223 62722 78960 86423 42545 6567 -49129 -889 70125 44505
19489D4505p311n288O4423k7337j01955o5802L5236K2971Q861m07K5775r085P48
$$ 44505 37194 31906 96329 68992 -32963 -98765 -63529 -40558 -31697 -32104 -6329 -15414 -14666
19476a4666l5221L5605O1498o1741M0797K5382k382l405L5696N3425M4025M9347
$$ -14666 -49887 -14282 47216 -14525 26272 51654 49272 45867 81563 134988 179013 228360
19464B28360j7658k1110M6588K6504J9224N7205J3370n2912j0849k3624K3741
$$ 228360 210702 189592 236180 262684 281908 339113 352483 299571 288722 265098 288839
19453B88839L7587J5341j567m4577m9239m303n4287k4960K8847J4878L023J15187
$$ 288839 326426 341767 340200 295623 246384 242081 187794 162834 191681 206559 209582 324769
19441C24769N9643l1771K5564j8316n6452o5432q4062p690O8254N9417J8254L8818
$$ 324769 384412 352641 378205 359889 303437 238005 153943 146253 214507 273924 292178 330996
19429C30996M4009K8293l9103j27323n7543j893l0018N5690M9892K0472M0018
$$ 330996 375005 403298 364195 236872 179329 177436 147418 203108 253000 273472 313490
19418C13490K4426k5775M2587R6536J455n073l7120m871P449j3474m7505m1873
$$ 313490 337916 312141 354728 451264 452719 447646 410526 405655 413104 399630 352125 310252
19406C10252q8q224M9438P7413R3565n0217r6928r6676o5139r1589r948K8376
$$ 310252 310164 301940 351378 428791 522356 472139 375211 278535 213396 121807 111859 140235
19394A40235N6044O0762O6090J4334M8942j9817r8093k9691m1331p3006l4120
$$ 140235 196279 257041 323131 337465 386407 366590 268497 238806 197475 124469 90349
19383I0349N3848N0859j3423J9287k3469n8519r2744J1578j5192q8351J116M8434
$$ 90349 144197 195056 181633 200920 177451 118932 26188 37766 22574 -65777 -64661 -16227
19371a6227K6129k661l7581k9570O3217K6738m3154k3919o5094L452L2551O4578
$$ -16227 9902 7241 -30340 -59910 3307 30045 -13109 -37028 -102122 -98670 -66119 -1541
19359a541L6066M9183n6335m2851L008L3927L9274K5045q411j988N7089Q364n8963
$$ -1541 34525 83708 27373 -15478 -12470 21457 60731 85776 77365 75377 132466 140830 81867
19346H1867K70p8761O1592N4039O923l5107k5092q895k8044l987q703K5002m3751
$$ 81867 82137 3376 64968 119007 125930 90823 65731 56836 28792 24805 16102 41104 -2647
19333b647j4704k0453O3526N0666K0742J4061n9754k6486j0242n2422L5866M8892
$$ -2647 -17351 -37804 25722 76388 97130 111191 51437 24951 14709 -37713 -1847 47045
19321D7045J5077q8352k685O7636k7914j2267m5216L1228M4662Q166j9919l3035
$$ 47045 62122 -26230 -28915 38721 10807 -1460 -46676 -15448 29214 37380 17461 -15574
19309a5574L3591N4768k1105l9629m2058o7174o0659K5508M0521N3207M2846M2298
$$ -15574 18017 72785 51680 12051 -30007 -97181 -157840 -132332 -91811 -38604 4242 46540
19297D6540K9537j5368m6415k0623m4017K5317J5483L5859L8803j741m8906p1417
$$ 46540 76077 60709 14294 -6329 -50346 -25029 -9546 26313 65116 63375 14469 -56948
19285e6948J4506M4154O1489J9518q5279o9308M0952P333O315p491O068O3925
$$ -56948 -42442 1712 63201 82719 -2560 -71868 -30916 -23583 -17268 -24759 -18691 45234
19273D5234l96l6417q1692k2536J2091L2411M099J1367P4468J7651j6113J2358
$$ 45234 44838 8421 -73271 -95807 -83716 -51305 -47206 -35839 38629 56280 40167 52525
19261E2525K3856o8456j7542L2062l2889m0478k0249J6399k536K7266K9930J1149
$$ 52525 76381 7925 -9617 22445 -10444 -50922 -71171 -54772 -57308 -30042 -112 11037
19249A1037L9699l7749k2543J931O158J575K9240N746N012K124N1633o456L599
$$ 11037 50736 12987 -9556 -7625 -1467 108 29348 35094 40106 42230 93863 87407 91006
19236I1006m7798j2366k8969k4080j5967k4429P8421J4492o9987k7391K5562J33
$$ 91006 43208 30842 1873 -22207 -38174 -62603 15818 30310 -39677 -67068 -41506 -41373
19224d1373k2000n012L4631P2326j6303j0008L2976K1938k9230L3868P4922j4774
$$ -41373 -63373 -68385 -33754 38572 22269 12261 45237 67175 37945 71813 146735 131961
19212A31961l3592k8884l6615j6003j4629m5313M1233N1311M8830l8369q4875
$$ 131961 98369 69485 32870 16867 2238 -43075 -1842 49469 98299 59930 -24945
19201b4945k1585M8160O1351j1173k5764j6117q030J854j5139j5299K1399J17043
$$ -24945 -46530 1630 62981 51808 26044 9927 1897 3751 -11388 -26687 -5288 111755
19189A11755L6057k9038q139m9762n7057p268K31K229N251l2390K2330J834l5402
$$ 111755 147812 118774 110635 60873 3816 -3452 -3221 -992 4259 -28131 -5801 -3967 -39369
19176c9369o917L7703L2209N8624k4691J036L4729k7076Q5186Q988n2818r3069
$$ -39369 -46286 -8583 23626 82250 57559 58595 93324 66248 151434 160422 107604 14535
19164A4535m0548O7359N3908m4554p2556l4937L9720P6893J5811N398J3646l2552
$$ 14535 -26013 41346 95254 50700 -21856 -56793 -17073 59820 75631 81029 94675 62123
19152F2123p9664p2627k4706K2327Q2980K7134N960q2851l4095L2878L2553N3415
$$ 62123 -17541 -90168 -114874 -92547 -9567 17567 23527 -59324 -93419 -60541 -27988 25427
19140B5427P3776L9024N018m8364L668M6n4656o9970k7022P3140N9056N0456P409
$$ 25427 99203 138227 143245 94881 98549 98595 43939 -26031 -53053 20087 79143 129599 137008
19127A37008k0396q1971l0267j7153N5413N1002O697j3519r720j729k4466n8278
$$ 137008 116612 34641 4374 -12779 42634 93636 100333 86814 77094 75365 50899 -7379
19115g379k1772k2431n3531j8711N9443K9692J8217K2654J4629J24N1310k4236
$$ -7379 -29151 -51582 -105113 -123824 -64381 -34689 -16472 6182 20811 20935 72245 48009
19103D8009p2504j1492J753p365K8349J03425o188j02314m7548l5973K4215O653
$$ 48009 -24495 -35987 -34234 -41599 -13250 90175 83987 -18327 -65875 -101848 -77633 -70980
19091g0980P703p806M8J0747O7055P8333L8203k6304j3812n1197p4972j4857P0320
$$ -70980 -63277 -71083 -71035 -60288 6767 85100 123303 96999 83187 31990 -42982 -57839 12481
19078A2481M7903L9184k4995k7476l3060m7439N8424J04719n3961o9272k5833
$$ 12481 60384 99568 74573 47097 14037 -33402 25022 129741 75780 6508 -19325
19067a9325K8927J2498j8421j283K9291K378M2657J629m5833n2208m4306m443
$$ -19325 9602 22100 3679 2396 31687 34065 76722 78351 32518 -19690 -63996 -68439
19055f8439L9650J0940l6486N0820K2682L6293M7823J7252k5061l5158L943j0656
$$ -68439 -28789 -17849 -54335 -3515 19167 55460 103283 120535 95474 60316 64259 53603
19043E3603k0315J1678O6610J15471J24628O5862k2616o7348q7040q8934k4093
$$ 53603 33288 44966 111576 227047 351675 417537 394921 327573 240533 151599 127506
19032A27506O3879j3662j9111Q0534M3828J9451Q1110L6961N233k9299l8567l6371
$$ 127506 191385 177723 158612 239146 282974 302425 383535 420496 425729 396430 357863 321492
19020C21492p8290l0325k3703k2806k32J598J3060l1944j7526K3182l0113K1045
$$ 321492 243202 212877 189174 166368 166136 167734 180794 148850 131324 154506 124393 145438
19008A45438R3890R0172l4146j3174k9441O3045K7838l9350J6299O666N0247L5708
$$ 145438 239328 329500 295354 282180 252739 315784 343622 304272 320571 327237 377484 413192
18996D13192j379o2088j6947n8076o2878O2987M4947m241K7505N8832O2608N2857
$$ 413192 411813 349725 332778 274702 211824 274811 319758 315517 343022 401854 464462 517319
18984E17319P4286O3711P7745O8493j6708l1992l2156k471n6347p4525j04490
$$ 517319 591605 655316 733061 801554 784846 752854 720698 718227 661880 587355 482865
18973D82865k4199m7056l9741o259j2886J1567J0441m0633m5062K2499P160j7188
$$ 482865 458666 411610 371869 365610 352724 364291 374732 334099 289037 311536 318696 301508
18961C01508k3584J7155L8061J5621J7262k1315j3845R187j4972l1296r9770j33621
$$ 301508 277924 295079 333140 348761 366023 344708 330863 340050 325078 293782 194012 60391
18949F0391n2563N6728N7902O6374J8526M2322P7151k4117j1963l5352l4684M2753
$$ 60391 7828 64556 122458 188832 207358 249680 326831 302714 290751 255399 220715 263468
18937B63468J08435K446M8560L8295m4654O820K78m0522l3138j7098k1619n4102
$$ 263468 371903 374349 422909 461204 416550 423370 423648 383126 349988 332890 311271 257169
18925B57169r7718j412j3772M0234M6366n2141m3149j6749J2636P945M2001j8610
$$ 257169 159451 158039 144267 184501 230867 178726 135577 118828 131464 139409 181410 162800
18913A62800p7400o4579K8658m402o278J5072k0485k6379L1827R4443j2527p2107
$$ 162800 85400 20821 49479 45077 38799 53871 33386 7007 38834 133277 120750 48643
18901D8643k3313p515l1617j6082N0425L4983k1250k8208k9197Q0233K1192l7695
$$ 48643 25330 17815 -13802 -29884 20541 55524 34274 6066 -23131 57102 78294 40599
18889D0599k3045j4581j306K3955n44o1975q251R584J9674j6731r025L6610O8912
$$ 40599 17554 2973 1667 25622 25078 -36897 -45148 -35564 -15890 -32621 -41646 -5036 63876
18876F3876l8603l5360k7554J0163L4725J0810O1727N8787m9668p9919n56j2761
$$ 63876 25273 -10087 -37641 -27478 7247 18057 79784 138571 88903 8984 8428 -4333
18864d333P0305J7788o548M4312m39q2987l9031l8560K9314M4984j2877p196K5515
$$ -4333 65972 83760 77212 121524 121085 38098 -933 -39493 -10179 34805 21928 14732 40247
18851D0247l2067J0145r265J719j9222j649J9759j4091L0499R2259m3624J0454
$$ 40247 8180 18325 9060 10779 -8443 -10092 9667 -4424 26075 118334 74710 85164
18839H5164R74j9061J5879l0612k1360K5730N027p6463N978J3986K8665K6602
$$ 85164 86138 67077 82956 52344 30984 56714 61741 -14722 -8744 5242 33907 60509
18827F0509j4490N296j5871J1705L981o142m3769K3102K9120r511K527P1278j2581
$$ 60509 46019 51315 35444 47149 51130 44988 1219 24321 53441 43930 46457 117735 105154
18814A05154l7589K3649j6056P512k2970Q280Q6356K9681m548m4658M2996l2246
$$ 105154 67565 91214 75158 82670 59700 67980 154336 184017 179469 134811 177807 145561
18802A45561m3570k1255J7301m3066J8943L4376l5221n9746M642k863k946L5481
$$ 145561 101991 80736 98037 54971 73914 108290 73069 13323 17965 15102 12156 47637
18790D7637K7544k8154l9644k3551L3125l6066m1109L6236j5170O412K498L1406
$$ 47637 75181 47027 7383 -16168 16957 -19109 -60218 -23982 -39152 -32740 -30242 1164
18778A164Q7735j5184n363N4196J6414m2250J7849M1980M6264P7167Q4077J49031
$$ 1164 88899 73715 68352 122548 138962 96712 114561 156541 202805 279972 364049 513080
18766E13080K35187J06008j52405k66263j84415p1619m9661m8132K4872O2189
$$ 513080 748267 854275 701870 435607 251192 179573 129912 81780 106652 168841
18756A68841K3054l1216K3455J6483J3600P2916j0452o6866l1367M493M9017J6743
$$ 168841 191895 160679 184134 200617 214217 287133 276681 209815 178448 182941 231958 248701
18744B48701j3633n6855N7289J1260l4624K7947L6146o276n8751O366O807q534
$$ 248701 235068 178213 235502 246762 212138 240085 276231 269955 211204 217570 224377 215843
18732B15843r4699l11Q7590P5858Q5900L3190q8872j37503M825Q170j5227J9869
$$ 215843 121144 120833 208423 284281 370181 403371 314499 176996 181821 189991 174764 194633
18720A94633J2151Q360l4829p9854P172K8550P746J7707q640M988N6533L0023
$$ 194633 206784 215144 180315 100461 107633 136183 143929 161636 152996 157984 214517 244540
18708B44540L9892N185p3516j4134n3128Q55j900J4022J7641m5488j2302j0659
$$ 244540 284432 289617 216101 201967 148839 149694 147794 161816 179457 133969 121667 111008
18696A11008Q696Q1400j4431J7455N4030p167r1518J7302k9136J9307N2320M5363
$$ 111008 119704 201104 186673 204128 258158 250991 159473 176775 147639 166946 219266 264629
18684B64629j3906k5901J2069l9853O81k9291n133l6319m1964k4849N8587j372
$$ 264629 250723 224822 236891 197038 197719 168428 163295 126976 85012 60163 118750 117378
18672A17378l5675J8271j1470o215L87R867j6524R598k880M2369K4308P227O1796
$$ 117378 81703 99974 88504 82289 82676 92543 76019 85617 82737 125106 149414 156641 218437
18659B18437J0198k4991K1869m2841J3612J6809m3102j4406L853l4846k114L2692
$$ 218437 228635 203644 225513 182672 196284 213093 169991 155585 159438 124592 122478 155170
18647A55170j5017K3234K6542N2387k758m088j8316M8560K8533J7315k5821J4079
$$ 155170 140153 163387 189929 242316 239558 235470 217154 265714 294247 311562 285741 299820
18635B99820M461j8496k83q8938m5300q488J5888J9603q048K2349q744J9573r34
$$ 299820 304281 285785 285502 196564 151264 142776 158664 178267 170219 192568 183824 203397 202463
18622B02463n609O5541L1853j4201l6191j8141l4396O3197P1751L8617M4801k5007
$$ 202463 196854 262395 294248 280047 243856 225715 191319 254516 326267 364884 409685 384678
18610C84678k6989j7866l0282j2363K2069P657L8625J3924L5039m30J2320q569
$$ 384678 357689 339823 309541 297178 319247 326904 365529 379453 414492 414062 426382 417813
18598D17813k6453n1483j4605j8272j6897M3693l1875l8051j8948j2084M3329
$$ 417813 391360 339877 325272 307000 290103 333796 301921 263870 244922 232838 276167
18587B76167N7793J03555N3023K7067K6231J02041R3933J17573k2036p8619j4582
$$ 276167 333960 437515 490538 517605 543836 645877 739810 857383 835347 756728 742146
18576G42146L4j2714j3470J1153l1149N5462N4288Q6139R9074Q7243J94288L79836
$$ 742146 742180 729466 715996 727149 696000 751462 805750 891889 990963 1078206 1272494 1652330
18564A652330M33936N59517N06836J16276m72112o05913l46947o1749J54654K60640
$$ 1652330 2086266 2645783 3152619 3268895 2796783 2190870 1843923 1782174 1936828 2197468
18554B197468K63520K71803J56976j22757p5450l8315k95323l61328k13327j7146
$$ 2197468 2460988 2732791 2889767 2767010 2691560 2653245 2357922 1996594 1783267 1766121
18544A766121N2008o853L4806k7867Q6023R5407J53174J79353J77721K24712L72375
$$ 1766121 1818129 1811276 1846082 1818215 1904238 1999645 2152819 2332172 2509893 2734605 3106980
18533C106980N79214P44218R06245J099623J214879J067662O79369N98863J436752
$$ 3106980 3686194 4430412 5336657 6436280 7651159 8718821 9398190 9997053 11433805
18524A1433805K375672K472389J263022l65704j132988p97716O47682K439135
$$ 11433805 13809477 16281866 17544888 17179184 16046196 15248480 15896162 18335297
18516A8335297L911091M904994N170952M330663J142145k642421j667078R14809
$$ 18335297 22246388 27151382 32322334 36652997 37795142 35152721 33485643 34400452
18508C4400452J267518O73424K216477L440523K101484J820906P342744J7040665
$$ 34400452 35667970 36341394 38557871 41998394 44099878 45920784 53263528 70304193
18500G0304193K8404695L5496581K8807240O894952j2924164j9692883k1486230
$$ 70304193 98708888 134205469 163012709 169907661 156983497 137290614 115804384
18493A15804384k3213077j5840592m015068L517103L519581k413396m917450R25023
$$ 115804384 92591307 76750715 72735647 76252750 79772331 77358935 72441485 73366508
18485G3366508O834339O814408J225821k458613J063477N869334R404078J5039375
$$ 73366508 80200847 87015255 88241076 85782463 86845940 92715274 102119352 117158727
18477A17158727K1839718K5668068J6584602p981280k9099383k7690926j2830728
$$ 117158727 138998445 164666513 181251115 173269835 144170452 116479526 103648798
18470A03648798j718721j22315m413506m204570J722206K583068n945876j4449951
$$ 103648798 101930077 101807762 97394256 93189686 94911892 97494960 91549084 77099133
18462G7099133j2388004m362354M329616J4350299K7914182M2919003M4277555
$$ 77099133 64711129 60348775 64678391 79028690 106942872 149861875 194139430
18455A94139430J4467027l6740565n6221464l7710672j8456016o234137J319202
$$ 194139430 208606457 171865892 115644428 77933756 59477740 53243603 54562805
18448E4562805M398343J872525l713584q357044r943037r510104p177071m374864
$$ 54562805 58961148 60833673 57120089 48763045 38820008 29309904 22132833 17757969
18440A7757969k538386j597145q50792k00822N05904J133518J569995K030613
$$ 17757969 15219583 13622438 12771646 12570824 13076728 14210246 15780241 17810854
18432A7810854K356097J271047j987639m498001l687384k216344j264468p61910
$$ 17810854 20166951 21437998 19450359 14952358 11264974 9048630 7784162 7022252
18424G022252m45274l00610n57668p82817n75803k41516n4878J3939j32524m41599
$$ 7022252 6576978 6276368 5718700 4935883 4360080 4118564 4063686 4077625 3945101 3503502
18414C503502m69986m00961l08044j97653j19032j32548j55401j9890o3748p5660
$$ 3503502 3033516 2632555 2324511 2126858 2007826 1875278 1719877 1699987 1636239 1560579
18404A560579o1201J831Q2831J0018j1217q008n4959j03154j54789j02143K0040
$$ 1560579 1499378 1501209 1584040 1594058 1582841 1574833 1519874 1416720 1261931 1159788 1179828
18393A179828Q6524R0373P2542N0711P4142o7197j74788k08045p0898k3897l8289
$$ 1179828 1266352 1356725 1429267 1479978 1554120 1486923 1312135 1104090 1033192 1009295 971006
18382I71006K8802o820n9041k7234p0565j33076q4614L9373O322r6436J1998P1067
$$ 971006 999808 992988 933947 906713 836148 703072 618458 657831 664153 567717 579715 650782
18370F50782K8279l5733q711k7274P484N9116k9915l9314J1684O7170l9787m6143
$$ 650782 679061 643328 634617 607343 614827 673943 644028 604714 616398 683568 643781 597638
18358E97638n6499K5577J7831j4317l1897l7299K5030j8078K4776J5059M992n0380
$$ 597638 541139 566716 584547 570230 538333 501034 526064 507986 532762 547821 552813 502433
18346E02433o319j7595j4474o7853m0073J8575J4629M8612j7059J6302J08940
$$ 502433 496114 478519 464045 396192 356119 374694 389323 437935 420876 437178 546118
18335E46118J990j05102n0320M9899L1744k1287m934m9146n511j0270n8910K9180
$$ 546118 548108 443006 392686 442585 474329 453042 448108 398962 393451 383181 324271 353451
18323C53451K6017L413L279j9281m0979l9003j7712m3980m80R9651K2827l5913
$$ 353451 379468 382881 386160 366879 325900 286897 269185 225205 224725 324376 347203 311290
18311C11290o3645r9331R187O6334P5677L6677J5534l8362j6559p7270q1357l5840
$$ 311290 247645 148314 157501 223835 299512 336189 351723 313361 296802 219532 138175 102335
18299A02335M3561M2004m781R90M5687L7095k4911m7812o7430l0890K6674L0576
$$ 102335 145896 187900 183119 184109 229796 266891 241980 194168 126738 95848 122522 153098
18287A53098J7400j1243K4381N0683m3352m5673L4201J0549M1207O965l5008m6954
$$ 153098 170498 159255 183636 234319 190967 145294 179495 190044 231251 238216 203208 156254
18275A56254O3092K0989l7480J8783J5776m5618r740j3331l7535N605M9869O0198
$$ 156254 219346 240335 202855 221638 237414 191796 182056 168725 131190 136795 186664 246862
18263B46862K2526M4074q358j5638k3891k9900n2811k6346O481N411p071k7180
$$ 246862 269388 313462 305104 289466 265575 235675 182864 156518 162999 168410 161339 134159
18251A34159K1993P90j0846j0398M0883N4629m7162l1368j4009l7297N017J5816
$$ 134159 156152 156942 146096 135698 176581 231210 184048 152680 138671 101374 106391 122207
18239A22207L0109k1348k6823M8642M1120R0513N3253r0059j4797K5022j7736
$$ 122207 152316 130968 104145 152787 193907 284420 337673 247614 232817 257839 240103
18228B40103J4495n587p2612J7550o8888m8292L5416M5205j989r782j6108L5152
$$ 240103 254598 249011 176399 193949 125061 76769 112185 157390 155401 145619 129511 164663
18216A64663L5525K3488R940K8456K1737o5697r1236K2262K3544J8309j8173m8721
$$ 164663 200188 223676 233616 262072 283809 218112 126876 149138 172682 190991 172818 124097
18204A24097J2517N7214K6817k2916q35k7621l6982O1287K2904j4402j9063N1017
$$ 124097 136614 193828 220645 197729 196894 169273 132291 193578 216482 202080 183017 234034
18192B34034J5296o6691L4011j6120K532L8378k7164j830L0308m9169k0391L2535
$$ 234034 249330 182639 216650 200530 203062 241440 214276 212446 242754 193585 173194 205729
18180B05729N6042R1683j1716j03922n5588p9795j13017O4171R7071P469m6203
$$ 205729 261771 353454 341738 237816 182228 102433 -10584 53587 150658 158127 111924
18169A11924L7501N7104j5942k3553J5986K4534k8995M681j2206R5617O9186m1933
$$ 111924 149425 206529 190587 167034 183020 207554 178559 183240 171034 266651 335837 293904
18157B93904J9270P8355j5739o7245q8007m0376Q3412J22658Q3167k2425m7200
$$ 293904 313174 391529 375790 308545 220538 180162 263574 386232 469399 446974 399774
18146C99774k7538l9187j812j9959J293O4557J14729N8337N3605L6014L1586J3715
$$ 399774 372236 333049 331237 311278 312571 377128 491857 550194 603799 639813 671399 685114
18134F85114Q7865Q6489r963l96O9691J12206J14889J16757J35280J82265J90406
$$ 685114 772979 859468 849505 849109 918800 1031006 1145895 1262652 1397932 1580197 1770603
18123A770603J75398K41958L41657M09546M62352N94159Q11369J228370J677679
$$ 1770603 1946001 2187959 2529616 2939162 3401514 3995673 4807042 6035412 7713091
18114G713091K401240L809366O394595J1384752K0395703L3755929M0416396K0795551
$$ 7713091 10114331 13923697 20318292 31703044 52098747 85854676 126271072 147066623
18106A47066623k7135605m9455323l0703311j5275115q008560m659599k890626
$$ 147066623 119931018 70475695 39772384 24497269 16488709 11829110 8938484
18099H938484j905787j367146r74682o89616m99247m07020l47997l69146l04298
$$ 8938484 7032697 5665551 4690869 4001253 3502006 3094986 2746989 2377843 2073545
18090B073545k23295j36045j20687j73770j41192j09194j13840j25272j10377
$$ 2073545 1850250 1714205 1593518 1419748 1278556 1169362 1055522 930250 819873
18081H19873m3097M8085l2099m0171K4302j1740k6430k4350m0412o8203j10476
$$ 819873 776776 824861 792762 752591 776893 765153 738723 714373 673961 605758 495282
18070D95282o0317l662L9325K306j1039n636K8957k2716r964L167K9812L8190
$$ 495282 434965 431303 470628 472934 461895 456259 485216 462500 452536 455703 485515 523705
18058E23705J1439J7656m721m5919l0120r375k0658j6401K569q3621o7638p7297
$$ 523705 535144 552800 548079 502160 472040 462665 442007 425606 428175 344554 276916 199619
18046A99619L7584p0318N9292Q6995l219k8573l2790P695M334m0153k5725j2075
$$ 199619 237203 166885 226177 313172 309953 281380 248590 256285 260619 220466 194741 182666
18034A82666L867l2452J6143N0031N3628N3782m335o3803m1718K7174M9234M0923
$$ 182666 186533 154081 170224 220255 273883 327665 323330 259527 217809 244983 294217 335140
18022C35140M5659M776k1911J7643m1187m258N8997m25p2343k858k7531N6249
$$ 335140 380799 385575 363664 381307 340120 335862 394859 394434 322091 319233 291702 347951
18010C47951O3123P1398M7592M3296J3947l183k47q478J7180k812K3550M7787
$$ 347951 411074 482472 530064 573360 587307 584124 583877 575399 592579 589767 613317 661104
17998F61104N2039Q3608R4637J7294m1334O065J9957l9143o2894o3551j5796p3156
$$ 661104 713143 796751 891388 908682 867348 873413 893370 854227 791333 727782 711986 638830
17986F38830K426l45r7919m2031O0935m2579j04530k2000N993M2947M6005P6426
$$ 638830 641256 640911 542992 500961 561896 519317 414787 392787 398780 441727 487732 564158
17974E64158P9024K19K0778K2531L2980R1074Q5705Q810o2390l8779l2861L2342
$$ 564158 643182 643401 664179 686710 719690 810764 896469 905279 842889 804110 771249 803591
17962H03591J76q9935j15390m7453J0797l437L4584N1652L8334J0337M4898m545
$$ 803591 803767 713832 598442 550989 561786 558349 592933 644585 682919 693256 738154 733609
17950G33609n7387j16078r6720k7174K3142J7014j49j8944m5520K7592Q3656N7539
$$ 733609 676222 560144 463424 436250 459392 476406 476257 457313 411793 439385 523041 580580
17938E80580o5511l9018k1447l891l0596j8667o9458l4272Q4003K6113l1916k5491
$$ 580580 515069 476051 454604 450713 420117 401450 331992 297720 381723 407836 375920 350429
17926C50429l2434l9922M1982o8989n1633J3577N4551J7652l5499n3418K0133
$$ 350429 317995 278073 320055 251066 199433 213010 267561 285213 249714 196296 216429
17915B16429J05410M4144K0035j1092N6946k2668j14902l9177n5661N543K8873
$$ 216429 321839 365983 386018 374926 431872 409204 294302 255125 199464 205007 233880
17904B33880k652n4437k612r823m7454q7437l193J3762Q2699L5286k3354k1651
$$ 233880 231228 176791 174179 164356 116902 29465 26272 40034 122733 158019 134665 113014
17892A13014q2047k2487K1748K6164k7222P4698L8170l1607n0531j8987N0432
$$ 113014 30967 8480 30228 56392 29170 103868 142038 110431 59900 40913 91345
17881I1345r1133K0361N5208o1027m5131K6883L8189O2997p221J1944j6805K846
$$ 91345 212 20573 75781 14754 -30377 -3494 34695 97692 90471 102415 85610 88456
17869H8456K2462o0113q8005k966Q4285M5146k7832r921p634J1237k1534K9775
$$ 88456 110918 50805 -37200 -40166 44119 89265 61433 51512 43878 55115 33581 63356
17857F3356k29M1017n843r0387n6154L7813M9538K5688r505m1168L353J4348j6566
$$ 63356 63127 104144 98301 7914 -48240 -10427 39111 64799 55294 14126 17479 31827 15261
17844A5261k2470J3476l5507n5368M035J8823Q370O1500M5345K3016p9304j5628
$$ 15261 -7209 6267 -29240 -84608 -80573 -61750 -53380 8120 53465 76481 -2823 -18451
17832a8451Q87K2354J0709K270j6117l0458o960M0004M3666k3841o006m096P23
$$ -18451 -17564 4790 15499 17769 1652 -28806 -35766 4238 47904 24063 18057 13961 14684
17819A4684p345K0648J4206k915K2784m2535j5421o3599J1267N9123K2023k0109
$$ 14684 7339 27987 42193 39278 62062 19527 4106 -59493 -48226 10897 32920 12811
17807A2811n337J9707j2843n3987P672K7388P656J2269N0601j5176m7695k527
$$ 12811 7474 27181 14338 -39649 -31977 -4589 3067 15336 65937 50761 3066 539
17795E39l0962l2490L3729M2504M2200k3965l3273n43j3132J6336N7798K1879
$$ 539 -30423 -62913 -29184 13320 55520 31555 -1718 -2261 -15393 943 58741 80620
17783H0620q4802m2129N155Q0057N8073k3220l4000K2298l6600O28K285j3337
$$ 80620 -4182 -46311 -41156 38901 96974 73754 39754 62052 25452 26080 28365 15028
17771A5028J0963j7058P2970O05L500l3981m2114o4720K0270N110k2429j0898
$$ 15028 25991 8933 81903 82508 86008 52027 9913 -54807 -34537 -29427 -51856 -62754
17759f2754J0086M6196J8721J4324K5109m833m9616J9650p567N7095k8396R691
$$ -62754 -52668 -6472 12249 26573 51682 46849 -2767 16883 9316 66411 38015 47706
17747D7706q0946j5234L5212j287n2754N9298M2783L7922N1773j1068p0764l9371
$$ 47706 -33240 -48474 -13262 -14549 -67303 -8005 34778 72700 124473 113405 42641 3270
17735C270l4234k2099q386M539P458M9985j3533l791K6476J3164m5757j0294K5419
$$ 3270 -30964 -53063 -61449 -56910 -49452 533 -13000 -16791 9685 22849 -22908 -33202 -7783
17722g783L486o2964j7156M8198J3419k4944O270L6133O4042o9893l0091O715
$$ -7783 -4297 -67261 -84417 -36219 -22800 -47744 -41474 -5341 58701 -11192 -41283 -34568
17710c4568K7q5910J8080M0278M3679P7051J0711n6710p0207K653L6187j3409
$$ -34568 -34541 -120451 -102371 -62093 -18414 58637 69348 12638 -57569 -54916 -18729 -32138
17698c2138K9875J1580J356k1106l198K6037l0500k7068k2495M696k4110O22L5782
$$ -32138 -2263 9317 10673 -10433 -13631 12406 -18094 -45162 -67657 -62961 -87071 -86449 -50667
17685e0667M6212k8819L7964J8305o1581n8886m1385Q8020J0379K9738k844j5887
$$ -50667 -4455 -33274 4690 22995 -38586 -97472 -138857 -50837 -40458 -10720 -13564 -29451
17673b9451n327J0613M991O2269K4759L4846J2953j09015j4039M1496L4428k529
$$ -29451 -34778 -24165 -19174 43095 67854 102700 115653 6638 -7401 34095 68523 65994
17661F5994k440M4182K1444n0691n7716l9964r465n354Q020R883p2504k7999M1584
$$ 65994 63554 107736 129180 78489 20773 -19191 -28656 -34010 -25990 -16107 -88611 -116610 -75026
17648g5026P2190l8785n1197j248J3255O3973O6540L4346p00k4848m3532j1213
$$ -75026 -2836 -41621 -92818 -94066 -80811 -16838 49702 84048 83348 58500 14968 3755
17636C755j469k4879J803j5056O0086m6816k4158K8757j7742P628J6037R560J67
$$ 3755 2286 -22593 -20790 -35846 24240 -22576 -46734 -17977 -35719 -28091 -12054 -2494 -2327
17623b327j9733j0846L6104O1549J1117M665l988j8840M3081o4281J9037j8531
$$ -2327 -22060 -32906 3198 64747 75864 80529 76541 57701 100782 36501 55538 37007
17611C7007K6031M0009n7712q342K6025m9801n7662m4287K504L7901j7479J5757
$$ 37007 63038 103047 45335 36993 63018 13217 -44445 -88732 -86228 -48327 -65806 -50049
17599e0049R901j5491N3388J468K7285k3000j1594L5331O25j4215N676k8468K8912
$$ -50049 -40148 -55639 -2251 -783 26502 3502 -8092 27239 27864 13649 19325 -9143 19769
17586A9769J91m3432M5632m299j8207L7803N4516K4626m765p9701m7512q009K3123
$$ 19769 19960 -23472 22160 17861 -346 37457 91973 116599 111834 32133 -15379 -23388 -265
17573b65J5779J5619M9957m0060j1872m9151k6752n192Q237l2324N1625j0081
$$ -265 15514 31133 81090 41030 29158 -19993 -46745 -51937 -43700 -76024 -24399 -34480
17561c4480P010P0141r72n8292r697m107k0587j5392L5276L7486l6552k316O9760
$$ -34480 -27470 42671 41699 -16593 -26290 -30397 -50984 -66376 -31100 6386 -30166 -32482 37278
17548C7278K9035K2474L671m7625l0233K1218K1120L1992r496j01j1010K0044
$$ 37278 66313 88787 92458 44833 14600 35818 56938 88930 79434 79333 68323 88367
17536H8367L7425N0377j8287r3200m8098p265k6791k5189J8252N156M171o5035
$$ 88367 125792 176169 157882 64682 16584 9319 -17472 -42661 -24409 -19253 -15082 -80117
17524h0117m5655J0303N3773K1234j6753J8930K0907J5048o3518j1010M6109p236
$$ -80117 -125772 -115469 -61696 -40462 -57215 -38285 -17378 -2330 -65848 -76858 -30749 -37985
17512c7985J4925N2441J2239j8241l813j0182n0639n3578r998M1128R8919K3934
$$ -37985 -23060 29381 41620 23379 19566 9384 -41255 -94833 -104831 -63703 35216 59150
17500E9150o459l9670o6755k0816j4152l195K4099Q8978Q317k3154o463K8378
$$ 59150 52691 13021 -53734 -74550 -88702 -91897 -67798 21180 29497 6343 -120 28258
17488B8258m990o0107l216r479P0915k5456j6508q951j9882O715K0254k0888J3364
$$ 28258 23268 -36839 -40055 -49534 21381 -4075 -20583 -29534 -49416 -42701 -22447 -43335 -29971
17475b9971L3529O742P94L4429q984J4210L58M3644k3092j7716j6332j0431m7324
$$ -29971 3558 10300 11094 45523 36539 50749 51107 94751 71659 53943 37611 27180 -20144
17462b0144K4222l6212p0245p219L5140J13969O1535m4525m9265m9576k8279M674
$$ -20144 4078 -32134 -102379 -109598 -74458 39511 101046 56521 7256 -42320 -70599 -65925
17450f5925J9837L5347K8616N3686O8026k5950L7387J91969J98751J90013o4789
$$ -65925 -46088 -10741 17875 71561 139587 113637 151024 342993 541744 731757 666968
17439F66968k46887j44693p2636j26904o5589L1760L950N3270l641n8739M761
$$ 666968 420081 275388 202752 75848 10259 42019 45969 99239 95598 36859 41620
17428D1620J2998l6732n7947l3668n2297L6120J7350O0984M7272K0114J3509l1756
$$ 41620 54618 17886 -40061 -73729 -126026 -89906 -72556 -11572 35700 55814 69323 37567
17416C7567p547M6k910m9086k6524M4262J8451P790K2820K5952l1020k7090k0678
$$ 37567 30020 30066 27156 -21930 -48454 -4192 14259 22049 44869 70821 39801 12711 -7967
17403g967J06j9724p0673k1782J8547N1402O13k3845K2703L0864L0129J1409l6744
$$ -7967 -7861 -27585 -98258 -120040 -101493 -50091 -49478 -73323 -50620 -19756 10373 21782 -14962
17390a4962J611j9941k720L199O329K8574N107m2509j7384R926O951j1878K3780
$$ -14962 -13351 -33292 -36012 -32813 -26484 2090 7197 -35312 -52696 -42770 -35819 -47697 -23917
17377b3917m0605M6723P664k3131O5171m8843n7785J8218Q3544J451M9852k6864
$$ -23917 -64522 -17799 -10135 -33266 31905 -16938 -74723 -56505 27039 28490 78342 51478
17365E1478k2090J3318j4009K1547m5745j6766p154j2320L5585P0264k6427l6262
$$ 51478 29388 42706 28697 50244 4499 -12267 -19421 -31741 3844 74108 47681 11419
17353A1419l6405M1325M3122L500j0250n470m6718r672K1219o431k2504J9209
$$ 11419 -24986 16339 59461 62961 52711 47241 523 -9149 12070 5639 -16865 2344
17341B344p132k4009j6014K3412L7617M5104L9741K5955k7969n5691k8092k687
$$ 2344 -4788 -28797 -44811 -21399 16218 61322 101063 127018 99049 43358 15266 12579
17329A2579J7042J1934k0396m7268m346k5811Q074m80M8108K3294j1285j8023
$$ 12579 29621 41555 21159 -26109 -30455 -56266 -48192 -48672 -564 22730 11445 -6578
17317f578j0102l20j9742m1598k1880M4445k0374P968N9591J5213n8489j568N8262
$$ -6578 -16680 -17000 -36742 -78340 -100220 -55775 -76149 -68181 -8590 6623 -51866 -53434 4828
17304D828L3690k6011K5558j3744O279j0540j1094m5425q802K0249K103J0383
$$ 4828 38518 12507 38065 24321 30600 20060 8966 -36459 -45261 -25012 -22909 -12526
17292a2526n9452l9790O7042M8254k9453l7480K2100K3666N6347L073J0245k8724
$$ -12526 -71978 -111768 -44726 3528 -25925 -63405 -41305 -17639 38708 41781 52026 23302
17280B3302P6679n43p1838r7006K4406M7554k0687k2663l7428m753L3787N0637
$$ 23302 99981 99438 27600 -69406 -45000 2554 -18133 -40796 -78224 -82977 -49190 1447
17268A447l4914r8446J710O2977m146M8283L9529J667L0165L5830L4142j02874
$$ 1447 -33467 -131913 -130203 -67226 -71372 -23089 16440 18107 48272 84102 118244 15370
17256A5370m0660M8481k6980p1948l9815R414L2488K5206L5607j1098J246O7240
$$ 15370 -25290 23191 -3789 -75737 -115552 -106138 -73650 -48444 -12837 -23935 -22689 44551
17244D4551P6232l0509l0459k2823n4787k0969J211L0224p271q3516M3322O7307
$$ 44551 120783 90274 59815 36992 -17795 -38764 -37553 -7329 -14600 -98116 -54794 12513
17232A2513R412k9390j0601k8469N0851N8677j1954k9387l1185k9820L8242K1142
$$ 12513 21925 -7465 -18066 -46535 4316 62993 51039 21652 -9533 -39353 -1111 20031
17220B0031m1351o549L449l341N828J2342J0173o7711J1338N8448L5098J4617
$$ 20031 -21320 -27869 -24420 -27761 -21933 -9591 582 -67129 -55791 2657 37755 52372
17208E2372J3052j3861N596o4552m5715j824J897P683M062j1553l5992K8152P1132
$$ 52372 65424 51563 57159 -7393 -53108 -54932 -53035 -45352 -41290 -52843 -88835 -60683 10449
17195A0449J1518K601p2684k7593M643M3338n7320j8174M5901N080k8416J7398
$$ 10449 21967 24568 -48116 -75709 -71066 -27728 -85048 -103222 -57321 -52241 -80657 -63259
17183f3259K0547o4136p052K7420k694K9597K2838r2194k6264N7371M8168K7983
$$ -63259 -42712 -106848 -113900 -86480 -89174 -59577 -36739 -128933 -155197 -97826 -49658 -21675
17171b1675j7210J1033l3247J9946O3453l3068j2445n6452K6737l167M2045L9146
$$ -21675 -38885 -27852 -61099 -41153 22300 -10768 -23213 -79665 -52928 -56095 -14050 25096
17159B5096m0195k1517l7861k3543l4827k7150L0626R4715K543L8194J2745J1368
$$ 25096 -15099 -36616 -74477 -98020 -132847 -159997 -129371 -34656 -32113 6081 18826 30194
17147C0194j4997n5039o1685P0413K8532n1499K1127N4380j7735k8150k3210k8354
$$ 30194 15197 -39842 -101527 -31114 -2582 -54081 -32954 21426 3691 -24459 -47669 -76023
17135g6023o483Q0107K4129p854m4183j7535L1689L757K9830L6734L78L84J3800
$$ -76023 -82506 -2399 21730 13876 -30307 -47842 -16153 -12396 17434 54168 54546 54930 68730
17122F8730M655p429J2484j6119k8231N703m5042k9921J9656k5027N8781k0508
$$ 68730 73385 65956 78440 62321 34090 39793 -5249 -35170 -15514 -40541 18240 -2268
17110b268k1838O9964J2345k4381m0400q681k7714m5064J25523L1790m5248P864
$$ -2268 -24106 45858 58203 33822 -6578 -15259 -42973 -88037 37486 69276 24028 31892
17098C1892k5647P841M8368K4708r2552l8483J5975K6554j6316o9669K3270N8718
$$ 31892 6245 14086 62454 87162 -5390 -43873 -27898 -1344 -17660 -87329 -64059 -5341
17086e341M4757l3873M7909J1605l8599n5114m9703J2375L3579k5319J9014O3846
$$ -5341 39416 5543 53452 65057 26458 -28656 -78359 -65984 -32405 -57724 -38710 25136
17074B5136J0946M512j2388o2566k5491R3257K0686p7532l0128J9558L1102p1229
$$ 25136 36082 40594 28206 -34360 -59851 33406 54092 -23440 -53568 -34010 -2908 -74137
17062g4137k482L6452O7875J0880k7720l1999j5643j7020J0850K369m8448K5670
$$ -74137 -76619 -40167 27708 38588 10868 -21131 -36774 -53794 -42944 -40575 -89023 -63353
17050f3353K6071L6137K2079L913l7771Q493K8084j5526p8509J4122N1829n3844
$$ -63353 -37282 -1145 20934 24847 -12924 -4431 23653 8127 -70382 -56260 -4431 -58275
17038e8275n6735O7645N5633O845J627J952l0438n5807M5626l290j4829n4085
$$ -58275 -115010 -47365 8268 15113 16740 18692 -11746 -67553 -21927 -25217 -40046 -94131
17026i4131K9796K6019m0293L7490M4808q7065m5097j1337K4819M2690K3439j8233
$$ -94131 -64335 -38316 -78609 -41119 3689 -83376 -128473 -139810 -114991 -72301 -48862 -67095
17014f7095R049L4237N3458l500m59j1047K2941j8525k8523L6087j5648J5105
$$ -67095 -58046 -23809 29649 26149 25690 14643 37584 19059 -9464 26623 10975 26080
17002B6080J6117M4573k0308m5606r201k9596M558K6521l4671k7000j4812l920
$$ 26080 42197 86770 66462 20856 11655 -17941 -13383 13138 -21533 -48533 -63345 -67265
16990f7265N562k5157J1946L6795J9215O5043M7568m9848J0890l4912k1162m302
$$ -67265 -61703 -86860 -74914 -38119 -18904 46139 93707 43859 54749 19837 -1325 -5627
16978e627k2156L465N951M5748K2321l3965p8610n0874J4913O7185l3049j856
$$ -5627 -27783 -24318 -18367 27381 49702 15737 -62873 -113747 -98834 -31649 -64698 -66554
16966f6554l066m2247L6925M0150l2966K4893M7329N4J4840m3255m1771o805M4061
$$ -66554 -69620 -111867 -74942 -34792 -67758 -42865 4464 4518 19358 -23897 -65668 -72473 -28412
16953b8412n876r473K09K4637L683N3339K9949r447o8919N0169j5331n8528K3659
$$ -28412 -34288 -43761 -43552 -18915 -15232 38107 68056 58609 -10310 39859 24528 -34000 -10341
16940a0341j2210J240J5764l3263j0453J955j3580J0798L9332L5431p8098p327
$$ -10341 -22551 -21311 -5547 -38810 -49263 -47308 -60888 -50090 -10758 24673 -53425 -60752
16928f0752Q2495J8246O439R703l1828o2535j3127M2268J5656K3926M2885l5341
$$ -60752 21743 39989 46428 56131 24303 -38232 -51359 -9091 6565 30491 73376 38035
16916C8035L0782j1886J436k9971k6897n9080l3780O7183M0514K9214n1237m6005
$$ 38035 68817 56931 58367 28396 1499 -57581 -91361 -24178 16336 45550 -5687 -51692
16904e1692M29K0738p2381N304M5728O8272J3379l3K8786r175k6989k8413j0053
$$ -51692 -51263 -30525 -102906 -97602 -51874 16398 29777 29744 58530 49355 22366 -6047 -16100
16891a6100k2528L3312L6979k004l876N2762n0226l4608J5292n1407j402M7329
$$ -16100 -38628 -5316 31663 29659 25783 78545 28319 -6289 9003 -42404 -43806 3523
16879C523L4560K674k0958L3635R828m1113o183J7576L578j3465p4745k1730N5275
$$ 3523 38083 40757 19799 53434 63262 22149 15966 33542 37120 23655 -51090 -72820 -17545
16866a7545K4098K9179m944j1290O412K0715m197j5127j6962l4115l4517K3242
$$ -17545 6553 35732 30788 19498 25910 46625 42428 27301 10339 -23776 -58293 -35051
16854c5051N5931M8744K5235l3677l3395J6572K156l602K5742m3732l477J6385
$$ -35051 20880 69624 94859 61182 27787 44359 46515 42913 68655 24923 21446 37831
16842C7831J9436m2373j0234j9322r893p487k742k2388J8120R4623O520m3254
$$ 37831 57267 14894 4660 -14662 -24555 -32042 -34784 -57172 -39052 55571 62091 18837
16830A8837J7944j8016k7554m5014L856o4438K6399J1457M6186n915p695L0182
$$ 18837 36781 18765 -8789 -53803 -49947 -114385 -87986 -76529 -30343 -36258 -43953 -13771
16818a3771L3395K2057K9150N098k589J9420j6294l6158l2375m2405n6707o4336
$$ -13771 19624 41681 70831 75929 73340 92760 76466 40308 7933 -34472 -91179 -155515
16806a55515K089J4058J7922N5510K2251J8785J5233l0200n6363m9081L004J11696
$$ -155515 -153426 -139368 -121446 -65936 -43685 -24900 -9667 -39867 -96230 -145311 -142307 -30611
16794c0611P1940K1020k5457n0230m0859p52l0729n3154M158P7829N2613K9416
$$ -30611 41329 62349 36892 -13338 -54197 -54949 -85678 -138832 -134674 -56845 -4232 25184
16782B5184M0482k3189J3876J9302j7485l547N191k1116k7889k0252m527j5491
$$ 25184 65666 42477 56353 75655 58170 54623 59814 38698 10809 -9443 -13970 -29461
16770b9461k9462L5436O7980J6725M69k26m962K838J7814l9480j6827J781k3869
$$ -29461 -58923 -23487 44493 61218 61687 61461 56499 59337 77151 37671 20844 22625 -1244
16757a244n780K207m672J1263k8821l9393J494O2493L4634k6976L2195J2130l7480
$$ -1244 -7024 -4817 -9489 1774 -27047 -66440 -64946 -2453 32181 5205 37400 49530 12050
16744A2050k1967r279J3923K0515L3215q915j0809n8752p7753o5128Q3060K9439
$$ 12050 -9917 -19196 -5273 15242 48457 39542 28733 -30019 -107772 -172900 -89840 -60401
16732f0401K3229M35r0677K7694P0214K1551k4712m2765K666o045O47k6390M5641
$$ -60401 -37172 -36737 -127414 -99720 -29506 -7955 -32667 -75432 -72766 -78811 -78164 -104554 -58913
16719e8913M1650L2857l3570K0124L9741O637j1790J5676M2596J3316K3366M01
$$ -58913 -17263 15594 -17976 2148 41889 48526 36736 52412 95008 108324 131690 132091
16707A32091l6997l2968O619J123k3521J4983M8635k5469j7521j0450K7395j5652
$$ 132091 95094 62126 68745 69868 46347 61330 109965 84496 66975 56525 83920 68268
16695F8268r6706j1902J3423l4650j3984J0115K5631m005N0817N293n2058Q983
$$ 68268 -28438 -40340 -26917 -61567 -75551 -65436 -39805 -43810 7007 12300 -39758 -30775
16683c0775N355K5885r791j8398l398N4335r179m8867j1931r942j9466L3629O4262
$$ -30775 -25420 465 -9326 -27724 -31122 23213 14034 -34833 -46764 -56706 -76172 -42543 21719
16670B1719J1298k6431k4290l3930n452J4614J2261L8723R528k563M939R979j4972
$$ 21719 33017 6586 -17704 -51634 -57086 -42472 -30211 8512 18040 15477 20416 30395 15423
16657A5423j8997J7376o284l266n3394l3946M1975n5917J8362P9675j8822J0103
$$ 15423 -3574 13802 7518 4252 -49142 -83088 -41113 -97030 -78668 1007 -17815 -7712
16645g712P186L781J553J5333j1527o8227k4707J7582L7837K8868k506N3977N4990
$$ -7712 -526 3255 4808 20141 8614 -59613 -84320 -66738 -28901 -33 -2539 51438 106428
16632A06428k7750j395p1983p5279k9055n942Q7890N9603m1070n9645K6143K1238
$$ 106428 78678 77283 5300 -69979 -99034 -104976 -17086 42517 1447 -58198 -32055 -10817
16620a0817L8156Q890j3106l9691m940R917p5662P606L2196K5056r985m6336k2483
$$ -10817 27339 36229 23123 -16568 -21508 -11591 -87253 -79647 -47451 -22395 -32380 -78716 -101199
16607a01199l0337M3883M5298j9075o6898j388J35268R6137o8222o9619m1865
$$ -101199 -131536 -87653 -42355 -61430 -128328 -129716 5552 101689 33467 -36152 -78017
16596g8017o5189N2159P2920L7229L6696o55j7517n4692l5q376Q983Q867p9756
$$ -78017 -143206 -91047 -18127 19102 55798 55143 37626 -17066 -17101 -25477 -16494 -7627 -87383
16583h7383K6445N4410m7539q415L3146K597k472l4422J1464N3800N715K4986
$$ -87383 -60938 -6528 -54067 -62482 -29336 -26739 -29211 -63633 -52169 1631 7346 32332
16571C2332j4072r252k3465N8045N7687O813N3376L830o6458o403J1621n5089
$$ 32332 18260 9008 -14457 43588 101275 108088 161464 165294 98836 92433 104054 48965
16559D8965p4178j5209J9917o0599k4627K4483J1700L6428M2653l3582j4726o973
$$ 48965 -25213 -40422 -20505 -81104 -105731 -81248 -69548 -33120 9533 -24049 -38775 -45748
16547d5748p184J4906K117K8848J2943P243k3746p2186p386L6204P6273K4937
$$ -45748 -52932 -38026 -35909 -7061 5882 13125 -10621 -82807 -90193 -53989 22284 47221
16535D7221k7007m0759J889N6783k7829j1143R478O7713J1270l0700p966j865
$$ 47221 20214 -20545 -18656 38127 10298 -845 8633 76346 87616 56916 48950 47085
16523D7085o4670k5035L0302j2921m2906k2060l1841k4751J6924N1075J0837M2234
$$ 47085 -17585 -42620 -12318 -25239 -68145 -90205 -122046 -146797 -129873 -78798 -67961 -25727
16511b5727M6237j0864k9257r196q006Q17J9272q800R201k8124k2566l554M2938
$$ -25727 20510 9646 -19611 -28807 -36813 -35996 -16724 -25524 -16323 -44447 -67013 -70567 -27629
16498b7629Q139J2625n1590j9959N8228L3949k9996j7695J7134k0550q6310M7391
$$ -27629 -19490 -6865 -58455 -78414 -20186 13763 -16233 -33928 -16794 -37344 -123654 -76263
16486g6263N2522O1888J2136m0433J0916K0704q9l3001p1129p2081M85P2935P4909
$$ -76263 -23741 38147 50283 9850 20766 41470 41381 8380 -62749 -134830 -134345 -61410 13499
16473A3499j1104N483J1946L814J8389l1184m6755k8957j2325m3981m0651K4885
$$ 13499 2395 7878 19824 23638 42027 10843 -35912 -64869 -77194 -121175 -161826 -136941
16461a36941K7937J1965M2877J2109J4253j9442r785J0291j8552P252K5799J2096
$$ -136941 -109004 -97039 -54162 -42053 -27800 -47242 -57027 -46736 -65288 -58036 -32237 -20141
16449b0141j9925l3741N998O482M7023J9392L1775l5360p006l6125L2363l0447
$$ -20141 -40066 -73807 -67809 -61327 -14304 5088 36863 1503 -5503 -41628 -9265 -39712
16437c9712l0999J0850L0112l5568l8438k636J412L6983K9254l1137k6309M032
$$ -39712 -70711 -59861 -29749 -65317 -103755 -106391 -104979 -67996 -38742 -69879 -96188 -92156
16425i2156k1015L3482q095k4878O0081K9478O2375Q418J2010M494o9304J4253
$$ -92156 -113171 -79689 -87784 -112662 -52581 -23103 39272 47690 59700 64194 -5110 9143
16413I143j93j2714J3915q821M957O435k8057k0316K4078N072q0251K8546K1591
$$ 9143 8950 -3764 10151 1330 6287 12722 -15335 -35651 -11573 -6501 -86752 -58206 -36615
16400c6615P289P8153N7186L752r1788l2481n9456J3295Q403L6888J3840l2266
$$ -36615 -29326 48827 106013 109765 17977 -14504 -73960 -60665 -52262 -15374 -1534 -33800
16388c3800J7833l460L7834J6339n2099q790o692M467M4218l4172k4698j2221
$$ -33800 -15967 -19427 18407 34746 -17353 -26143 -32835 -28368 15850 -18322 -43020 -55241
16376e5241L1742K4212J6130N7696K3638J0598k76n5368l3539j0294l7393q2111
$$ -55241 -23499 713 16843 74539 98177 108775 108499 53131 19592 9298 -28095 -110206
16364a10206j6171N2074j586l087O3883N2193o890N127Q3046k4971r3782m1461
$$ -110206 -126377 -74303 -75889 -78976 -15093 37100 30210 35337 118383 93412 -370 -41831
16352d1831n7542N5632J7243j2614j1459N343J7601J3988K5512K8755o677k8319
$$ -41831 -99373 -43741 -26498 -39112 -50571 -45228 -27627 -13639 11873 40628 33951 5632
16340E632M3428Q569n0741j4489K9275R592m3376k5757Q873K8975o1953K2161
$$ 5632 49060 57629 6888 -7601 21674 31266 -12110 -37867 -28994 -19 -61972 -39811
16328c9811P6501R206n8582J6134M3795q175M7547R1958n6283l2520q9392j0135
$$ -39811 36690 45896 -12686 3448 47243 39068 86615 178573 122290 89770 378 -9757
16316i757M9540j50r1950m169L8893L0582K5031P062l0399m9116K6266M0591l1064
$$ -9757 39783 39633 -52317 -56486 -17593 12989 38020 45082 14683 -34433 -8167 32424 1360
16303A360p504l0128p9664o337R3390N4018k937m7374j8857k5551k595m135q780
$$ 1360 -6144 -36272 -115936 -122273 -28883 25135 22198 -25176 -44033 -69584 -72179 -76314 -85094
16290h5094q680M5414N8355K398K8731j6162l7567K7436M1372J5975l408M2906
$$ -85094 -93774 -48360 9995 12393 41124 24962 -12605 14831 56203 72178 68770 111676
16278A11676k6796n1294q739J6207j1387p4436j3794J2296O9797O373k498o7213
$$ 111676 84880 33586 24847 41054 29667 -44769 -58563 -46267 23530 29903 27405 -39808
16266c9808m0105Q098m5042M229N5593P8181J8677n867l0706k8198m2004n4208
$$ -39808 -79913 -71815 -116857 -112628 -57035 21146 39823 33956 3250 -24948 -66952 -121160
16254a21160K687O4031N1457N3593o5045k0228N539M964J1003NN275l2723K0892
$$ -121160 -118473 -54442 -2985 50608 -14437 -34665 -29126 -24162 -13159 -13154 -7879 -40602 -19710
16241a9710L9520M7798l82j4900k2104o846K5004j3263l3935n626j3054j7496
$$ -19710 19810 67608 67226 52326 30222 23376 48380 35117 1182 -4444 -17498 -34994
16229c4994j4648K0267J1804J3750p606L3446J974n2658O365O2970k6822k7818
$$ -34994 -49642 -29375 -17571 -3821 -11427 22019 23993 -28665 -22300 40670 13848 -13970
16217a3970n404L6271j9410q6080J7072R331M8730K7748j773L5733j8991J3651
$$ -13970 -19374 16897 -2513 -88593 -71521 -62190 -13460 14288 12515 48248 29257 42908
16205D2908j6353l5483J9010k2512J1145j4137J7611J10268N2934l1955j8478
$$ 42908 26555 -8928 10082 -12430 -1285 -15422 2189 112457 165391 133436 114958
16194A14958n5585m4943J3766K0286n0271m6047k6317n6984k0232O3083K3056
$$ 114958 59373 14430 28196 48482 -1789 -47836 -74153 -131137 -151369 -88286 -65230
16183f5230P389J5147o4382P182J5316P0739M0679M6024m2095k7391m0809n3474
$$ -65230 -57841 -42694 -107076 -99894 -84578 -13839 26840 72864 30769 3378 -37431 -90905
16171i0905L3269K1434r073J3868k094J4827k4675M3723N5029p2474n0206N7919
$$ -90905 -57636 -36202 -45275 -31407 -33501 -18674 -43349 374 55403 -17071 -67277 -9358
16159i358L5076k6381m889n501q693L6386N3943Q370n9863j0661n5299M0780N408
$$ -9358 25718 -663 -5552 -11053 -19746 16640 70583 78953 19090 8429 -46870 -6090 -682
16146f82J0443j0962j1919K7400l1102r661O578k6402R491K425L1558n7818J802
$$ -682 9761 -1201 -13120 14280 -16822 -26483 -19905 -46307 -36816 -34391 -2833 -60651 -58849
16133e8849r850K588M8737J6253k8900K4927R063R361k3032j3175l4366m5295
$$ -58849 -68699 -66111 -17374 -1121 -30021 -5094 3969 13330 -9702 -22877 -57243 -102538
16121a02538K2021N6102O3074J2219J2465q7353K3805N7304l3875o4064N94J4377
$$ -102538 -80517 -24415 38659 50878 63343 -24010 -205 57099 23224 -40840 -40246 -25869
16109b5869L0535J0499o1020m0163n486j8663P3300K1139j9768O5661O268o6814
$$ -25869 4666 15165 -45855 -86018 -91504 -110167 -36867 -15728 -35496 30165 36433 -30381
16097c0381N506J6521M403K9101K5042j7994j0443K8581o8915l2192J7279K0677
$$ -30381 -24875 -8354 -3951 25150 50192 32198 21755 50336 -18579 -50771 -33492 -12815
16085a2815K2334m736r354K258O2529L9571m1193m6494J160K7739M3509O722m6925
$$ -12815 9519 4783 -4571 -2313 60216 99787 58594 12100 13260 40999 84508 91230 44305
16072D4305k0722p0442K0045L5585j4668k3627J8714O7954k6611p6392j6638J5534
$$ 44305 23583 -46859 -26814 8771 -5897 -29524 -10810 57144 30533 -45859 -62497 -46963
16060d6963L5578J9887P804J2772J7503j01571j9324M7503j4243L2362O8166o243
$$ -46963 -11385 8502 16306 29078 46581 -54990 -74314 -26811 -41054 -8692 59474 53231
16048E3231N075q1366o306M4924K0620k1466j2121M3467j4791L2637J8854m6999
$$ 53231 58306 -23060 -29366 15558 36178 14712 2591 46058 31267 63904 82758 35759
16036C5759n8880l6325j5573J1988j4629j9545m905j1191m284J8805M4560J417
$$ 35759 -23121 -59446 -75019 -63031 -77660 -97205 -102110 -113301 -117585 -98780 -54220 -52803
16024e2803N5693N9124M6430l3265k8884o1201J3124O666M114L6586j5950k2304
$$ -52803 2890 62014 108444 75179 46295 -14906 -1782 4884 8998 45584 29634 7330
16012G330K7774j2572L6426k5763n990l3477p7608l65j7654L9116N2067L7797
$$ 7330 35104 22532 58958 33195 27205 -6272 -83880 -84245 -101899 -62783 -10716 27081
16000B7081j7602Q2565P7085k3755o9669m3314K3801J3330K928p1759o1309n060
$$ 27081 9479 92044 169129 145374 75705 32391 56192 69522 72450 691 -60618 -65678
15988f5678K8406m9129n6487k6644M7346O2743n368J3134K8353n2547o864l3375
$$ -65678 -37272 -86401 -142888 -169532 -122186 -59443 -64811 -51677 -23324 -75871 -82735 -116110
15976a16110O874O6244j7628m548P5392J6675M539L9920Q11k7559M179K398p9962
$$ -116110 -109236 -42992 -60620 -65168 10224 26899 31438 71358 72169 44610 48789 51187 -28775
15963b8775o6637P80j1619N5306N2103j7468j0258J9484M650O4590j3794m4769
$$ -28775 -95412 -94632 -106251 -50945 1158 -16310 -26568 -7084 -2434 62156 48362 3593
15951C593l7041j6524p29p890j7613O8400j9163l2599K2408n6559k8503K4008
$$ 3593 -33448 -49972 -50701 -58591 -76204 -7804 -26967 -59566 -37158 -93717 -122220 -98212
15939i8212J3744L5326N1218R538j881j0128J1818O0112o165J1219o247m7237
$$ -98212 -84468 -49142 2076 11614 9733 -395 11423 71535 65370 76589 70342 23105
15927B3105l5097M1764P4135K8917o2379n4917n102M0385l6696k4538L4794j1464
$$ 23105 -11992 29772 103907 132824 70445 15528 10426 50811 14115 -10423 24371 12907
15915A2907m688o7j6410k2599M3797J6238k7201j0813K0131j4369m2792k7509
$$ 12907 8219 8152 -8258 -30857 12940 29178 1977 -8836 11295 -3074 -45866 -73375
15903g3375j0036L0860k255N3574j9609j9844K4097j4768K9741L2481K7021j9962
$$ -73375 -83411 -52551 -54806 -1232 -20841 -40685 -16588 -31356 -1615 30866 57887 37925
15891C7925L340o097Q858k9872N0932k2960j002j6168l0130j157p459n9518r459
$$ 37925 41265 35168 44026 14154 65086 42126 41124 24956 -5174 -6331 -13790 -73308 -82767
15878h2767M2498j894o440o3163p1488M0948N9310K1849j3722N0972K4889j5468
$$ -82767 -40269 -42163 -48603 -111766 -183254 -142306 -82996 -61147 -74869 -23897 992 -14476
15866a4476j4964p647L8853J7762J7061n1408J638N2838J2933j4088m1924j0896
$$ -14476 -29440 -37087 1766 19528 36589 -14819 -13181 39657 52590 38502 -3422 -14318
15854a4318K6678N28K7344o5r266k1075M002j6585p493j2377K0696J5022k4156
$$ -14318 12360 12888 40232 40167 30901 9826 13828 -2757 -10250 -22627 -1931 13091 -11065
15841a1065L7160J4323o9907j0616J5332J7994K7992m0434k2744P564N6649J2746
$$ -11065 26095 40418 -29489 -40105 -24773 -6779 21213 -19221 -41965 -34401 22248 34994
15829C4994N1473K2958n0698j00148j9254J7368L0841O1508L2307k6869n5601
$$ 34994 86467 109425 58727 -41421 -60675 -43307 -12466 49042 81349 54480 -1121
15818a121J6877K614M5654N9951l5675l5189L072O904N88m7361Q350j8222j5439
$$ -1121 15756 18370 64024 123975 88300 53111 56183 63087 63675 16314 24664 6442 -8997
15805h997l2388k5769M5649P038p709n8760j9499N4175L6287O3351l2872k7427
$$ -8997 -41385 -67154 -21505 -14467 -22176 -80936 -100435 -46260 -9973 53378 20506 -6921
15793f921j3317N7162P8045o3266n3795k3645K6828N310K0781o4340l7291J128
$$ -6921 -20238 36924 114969 51703 -2092 -25737 1091 6401 27182 -37158 -74449 -73321
15781g3321k8326K471K8226j258R1036M7349n4313k8524k0472o4569m5778k4319
$$ -73321 -101647 -99176 -70950 -72208 18828 66177 11864 -16660 -37132 -101701 -147479 -171798
15769a71798O8869J14713j4118p0168l0703J3407J8599J03030L4203l133J7484
$$ -171798 -102929 11784 -2334 -72502 -103205 -89798 -71199 31831 66034 62901 80385
15758H0385j4173l6782n0019L8743L8199J3080K1224m9812o5549r131K9011K8846
$$ 80385 66212 29430 -20589 18154 56353 69433 90657 40845 -24704 -33835 -4824 24022
15746B4022K0114N597Q005o721k8314q0619j2345j0842n2J07084K2575K5760N0682
$$ 24022 44136 49733 57738 51017 22703 -57916 -70261 -81103 -81155 25929 48504 74264 124946
15733A24946m464m3385k4534k5538o3082n0092L055J13804M6955j232m9314j6534
$$ 124946 120482 77097 52563 27025 -36057 -86149 -83094 30710 77665 76433 27119 10585
15721A0585o0056O905N3306K7817J4885l7475K1099K6556l4282j0262j4715K6837
$$ 10585 -49471 -42566 10740 38557 53442 15967 37066 63622 29340 19078 4363 31200
15709C1200K1480k5860O896K3023j4723j7406j8019J1431L7340M1693k9278n7658
$$ 31200 52680 26820 33716 56739 42016 24610 6591 18022 55362 97055 67777 10119
15697A0119k9182J0378l824k3975O675K8070l609k4289n0848j0733L8258l4970
$$ 10119 -19063 -8685 -12509 -36484 -29809 -1739 -5348 -29637 -80485 -91218 -52960 -87930
15685h7930m8848R849R6535P13l6011r617K7807M2782k344L2085m6152j05139
$$ -87930 -136778 -126929 -30394 -29681 -65692 -75309 -47502 -4720 -7064 25021 -21131 -126270
15673a26270p475R6069O1668j3355l9707J866k126m6079J8227K5023M60k0243
$$ -126270 -133745 -37676 23992 10637 -29070 -27204 -29330 -75409 -57182 -32159 -31699 -51942
15661e1942J3476N2615J5403k7953L9313L7876n0757J7657L8885o221r9162j3323
$$ -51942 -38466 14149 29552 1599 40912 78788 28031 45688 84573 78352 -20810 -34133
15649c4133J05305J4924m2075L6877K5794m4019p3013k7188O4504M8484n652k854
$$ -34133 71172 86096 44021 80898 106692 62673 -10340 -37528 26976 75460 69808 66954
15637F6954j5084j8668L8523J6319j4530j5672O2229K3182P141m7160m2257p75
$$ 66954 51870 33202 71725 88044 73514 57842 120071 143253 150394 103234 60977 60202
15625F0202k0155O110J7035p7189J1135M201n2474J7312P5949N3713l3285j28493
$$ 60202 40047 46157 63192 -13997 -2862 1339 -51135 -33823 42126 95839 62554 -65939
15613f5939j7796k3285P5549K3789n4592k3229O2572k3261k5450M8376L3825N8765
$$ -65939 -83735 -107020 -31471 -7682 -62274 -85503 -22931 -46192 -71642 -23266 10559 69324
15601F9324J8052j0756j5411J0191j06940K6544K0521o531j2023J3148L4972m791
$$ 69324 87376 76620 61209 71400 -35540 -8996 11525 4994 -7029 6119 41091 36300
15589C6300L6951j8183n5204l8791K1229m9278l71j1327L8251j1152p2009j1608
$$ 36300 73251 55068 -136 -38927 -17698 -66976 -67347 -78674 -40423 -51575 -123584 -135192
15577a35192J434O9969O6357n459p1333k8376K0099J0764M1245j4809j9495J3432
$$ -135192 -133758 -63789 2568 -2891 -74224 -102600 -82501 -71737 -30492 -45301 -64796 -51364
15565e1364r999j5517k821J4453K647J2754m634O8270O6161o1199j898k3439l4309
$$ -51364 -61363 -76880 -79701 -65248 -62601 -49847 -54481 13789 79950 18751 16853 -6586 -40895
15552d0895p315J6391N6020K2020m70K4572j4658j7576m8898n2322J875K4877
$$ -40895 -48210 -31819 24201 46221 45751 70323 55665 38089 -10809 -63131 -61256 -36379
15540c6379o4450l5393R0061K4508K3016P0205p220M417j1977m1485m1630k1380
$$ -36379 -100829 -136222 -46161 -21653 1363 71568 64348 68765 56788 15303 -26327 -47707
15528d7707P7909N0690k2687p5263l346L390m785n6404m8374j1256P809o334K2111
$$ -47707 30202 80892 58205 -17058 -20404 -17014 -21799 -78203 -126577 -137833 -130024 -136358 -114247
15515a14247K6318P6199N4220M2320n0414k6349k1683k45n412p64K610m820n1003
$$ -114247 -87929 -11730 42490 84810 34396 8047 -13636 -13881 -19293 -20057 -17447 -22267 -73270
15502g3270J4688M6379M4225k6965l49J3027j964m5756R346j6314l286K7137N1881
$$ -73270 -58582 -12203 32022 5057 4708 17735 15771 -29985 -20639 -36953 -40239 -13102 38779
15489C8779p697l7606m590Q234l096Q677j0507J3597M4750K5254p009j3204k138
$$ 38779 31082 -6524 -11114 -2880 -5976 2701 -7806 5791 50541 75795 68786 55582 53444
15476E3444p1391j2006j2009k8317K1049K1503J7979j6600m9917J823P3838l3359
$$ 53444 -17947 -29953 -41962 -70279 -49230 -27727 -9748 -26348 -76265 -74442 -604 -33963
15464c3963n9493n252J0550l804L4548K3050J4709K5734m4120J5372L9855j037
$$ -33963 -93456 -98708 -88158 -91962 -57414 -34364 -19655 6079 -38041 -22669 17186 16149
15452A6149L216K4770j6618J4634m1820K4515M5653m4090n8989J4498J1585K9399
$$ 16149 19365 44135 27517 42151 331 24846 70499 26409 -32580 -18082 -6497 22902
15440B2902K8842n3221k1809P0311K0734j9795J6467J0481k8315j0902n4449q005
$$ 22902 51744 -1477 -23286 47025 67759 47964 64431 74912 46597 35695 -18754 -26759
15428b6759K5588J2085K6198r592l7986j6472m451K5629N1643M9396n5039p2732
$$ -26759 -1171 10914 37112 27520 -10466 -26938 -31389 -5760 45883 95279 40240 -32492
15416c2492J989Q0918l0477k1244l2356M3037R5701J5626m6212j13403m812J888
$$ -32492 -30503 50415 19938 -1306 -33662 9375 105076 120702 74490 -38913 -43725 -41837
15404d1837n7r5838k2694K4370J0963L53M1012j6493O7108P2747M338n8051n9402
$$ -41837 -41894 -137732 -160426 -136056 -125093 -124740 -83728 -100221 -33113 39634 43972 -14079 -73481
15391g3481J9433K2739p10O57L0398j6918O780K8170M2108p455l7795n2684k9515
$$ -73481 -54048 -31309 -32019 -31362 -964 -17882 -11102 17068 59176 51721 13926 -38758 -68273
15378f8273o3977K0562L569J5965J00065N3555M6508j1108m7953l4373l4288k1597
$$ -68273 -132250 -111688 -108119 -92154 7911 61466 107974 96866 48913 14540 -19748 -41345
15366d1345L1566k1527p5772k2544Q6405L2873p2699o752O7358k584J553K2157
$$ -41345 -9779 -31306 -107078 -129622 -43217 -10344 -83043 -89795 -22437 -25021 -23468 -1311
15354a311J3705L2658m049j14409N02N4252m971O0084K0751J781k6708J8356j5004
$$ -1311 12394 45052 41003 -73406 -72904 -18652 -23623 36461 57212 58993 32285 50641 35637
15341C5637L8718L6991m0387J7806j8910m6386j0117l6484l1329k8815k5798M2752
$$ 35637 74355 111346 70959 88765 69855 23469 13352 -23132 -54461 -83276 -109074 -66322
15329f6322n93K1026M1803J230l3652m749J7495M940k8333M8201j965m6856k2268
$$ -66322 -66915 -45889 -4086 -2856 -36508 -41257 -23762 -18822 -47155 1046 -919 -47775 -70043
15316g0043O0459M7959m8515m4308K945j5920L1998j4072j4283j7479N6881K086
$$ -70043 -9584 38375 -10140 -54448 -51503 -67423 -35425 -49497 -63780 -81259 -24378 -22292
15304b2292L1794o385j5514l6030m466O6245k4257l5183M6135J5401J7291m7808
$$ -22292 9502 3117 -12397 -48427 -52893 13352 -10905 -46088 47 15448 32739 -15069
15292a5069k6874P25J2066k6902p3158J941J5591N3003N0614J0789m8871K7959
$$ -15069 -41943 -41218 -29152 -56054 -129212 -127271 -111680 -58677 -8063 2726 -46145 -18186
15280a8186L6175K3464o3431k7668L2598K7131l1701K3939K6636M8178K0602o5806
$$ -18186 17989 41453 -21978 -49646 -17048 10083 -21618 2321 28957 77135 97737 31931
15268C1931L4725L1033j6695J2789O3160N9929q1265j31731l322L488Q842k2818
$$ 31931 66656 97689 80994 93783 156943 216872 135607 3876 554 4042 12884 -9934
15256i934k077J3739K0399R009r79J6366k2527J7562k1080m5111m3639r467j529
$$ -9934 -12011 1728 22127 31136 30157 46523 23996 41558 20478 -24633 -68272 -77739 -79268
15243g9268P2261K9942M948p1689M891M7264J8039j7081o0804K3948L2115L8840
$$ -79268 -7007 22935 27883 -43806 -38915 8349 26388 9307 -51497 -27549 4566 43406
15231D3406K4474l7478k2900L9429N0432j5856j1418l6735p1529K7997P8223M7588
$$ 43406 67880 30402 7502 46931 97363 81507 70089 33354 -38175 -10178 68045 115633
15219A15633k2077n0336j23769K3072L1072N4355K8595j8809J3159N2445K5403
$$ 115633 93556 43220 -80549 -57477 -26405 27950 56545 37736 50895 103340 128743
15208A28743l4465m098M503K1064n8905p9717j5196n0057L6882J13043m9100p3263
$$ 128743 94278 90180 94683 115747 56842 -22875 -38071 -88128 -51246 61797 12697 -60566
15196f0566L6636L3463J9314m992k1968k5784p062k6069M0565M1050K8864l2484
$$ -60566 -23930 9533 28847 23855 1887 -23897 -30959 -57028 -16463 24587 53451 20967
15184B0967l2717j1423r618l008L8225k3393l2903k669P29N5068Q19p5905l623
$$ 20967 -11750 -23173 -32791 -35799 2426 -20967 -53870 -56539 -55810 -742 77 -75828 -79451
15171g9451P0685L505M0097N3998p053n1232l4116m661K6825j1615K0143k5271
$$ -79451 -8766 -5261 34836 88834 81781 30549 -3567 -8228 18597 6982 27125 1854
15159A854n2037l6441n347J02961o2160j5364L0242M823n1620N1707M8098J6383
$$ 1854 -50183 -86624 -91971 10990 -51170 -66534 -36292 -31469 -83089 -31382 16716 33099
15147C3099m7643q8637m2756M0116J0941o170Q385M5005m385o9762J5626J09532
$$ 33099 -14544 -103181 -145937 -105821 -94880 -101050 -92665 -47660 -52045 -121807 -106181 3351
15135C351O1209j2959n4523L5167J3446q1431k8458j9909L1789N9545J3786j036
$$ 3351 64560 51601 -2922 32245 45691 -35740 -64198 -84107 -52318 7227 21013 19977
15123A9977J4185k3740N3888Q83j7311k0486l6377m5454J6148K3295J5330k233
$$ 19977 34162 10422 64310 65193 47882 27396 -8981 -54435 -38287 -14992 338 -1895
15111a895l6149L8738j0775k1944P606k7279k4307M6062K2828L2265K7453l2749
$$ -1895 -38044 694 -10081 -32025 -24419 -51698 -76005 -29943 -7115 25150 52603 19854
15099A9854l5891n6j6533N0086M5069l456o2075R752K0263L2512J9110j0517l3167
$$ 19854 -16037 -16093 -32626 17460 62529 59073 -3002 6750 27013 59525 78635 68118 34951
15086C4951k2568j7449l2400p053J599M6922J3293J2596m9877K9510L5782k9223
$$ 34951 12383 -5066 -37466 -44519 -42920 4002 17295 29891 -19986 9524 45306 16083
15074A6083j6858L8672O0145k8722o6114J0014k6575j2168M2008l5752n6466K7048
$$ 16083 -775 37897 98042 69320 3206 13220 -13355 -25523 16485 -19267 -75733 -48685
15062d8685O5919K0750M244J4791J2079k5685L730m702m308m5665k2633k0526
$$ -48685 17234 37984 42228 57019 69098 43413 47143 42441 38133 -7532 -30165 -50691
15050e0691O59m8535L5250M7254j3995K4057N8627K1599l8371N324R434k2666
$$ -50691 -50032 -98567 -63317 -16063 -30058 -6001 52626 74225 35854 41178 50612 27946
15038B7946m4489N908j3588L3573P167J6925L070j3861J6233P135N755M205j2724
$$ 27946 -16543 -10635 -24223 9350 16517 33442 36512 22651 38884 46019 51774 55979 43255
15025D3255q998l5257k3082J1820J2632r439O59m7128k9809k01J7201K2819n488
$$ 43255 34257 -1000 -24082 -12262 370 -9069 -8410 -55538 -85347 -85548 -68347 -45528 -51016
15012e1016j9018M3638N5106k8270l9242r955L8523K0284j8380k0712O0498J8156
$$ -51016 -70034 -26396 28710 440 -38802 -48757 -10234 10050 -8330 -29042 31456 49612
15000D9612k6845O770R258M0765k8239l0735l6718n6277N9519O8234M1954m638
$$ 49612 22767 29537 38795 79560 51321 20586 -16132 -72409 -12890 55344 97298 92660
14988I2660k5773j4560k7038q946n123M4864m9757p1919R19O8617J1811n315m0821
$$ 92660 66887 52327 25289 16343 11220 56084 6327 -65592 -64673 3944 15755 10440 -30381
14975c0381j1841Q245M0735K2754j3387k1692n6976p8313j2512J47J5546M7755
$$ -30381 -42222 -33977 6758 29512 16125 -5567 -62543 -140856 -153368 -153221 -137675 -89920
14963h9920J2296M7269J5942j9103J2089O7279j3260m4418p1501l958N3193N8419
$$ -89920 -77624 -30355 -14413 -33516 -21427 45852 32592 -11826 -83327 -87285 -34092 24327
14951B4327o482n3690J5055p881K4031l939K2142j4331j764k308J204L1967N1969
$$ 24327 17845 -35845 -20790 -28671 -4640 -8579 13563 -768 -2532 -4840 -3636 28331 80300
14938H0300k8581q16j9912j7276J2318M3366k0066j7960r340l914J7686K9486
$$ 80300 51719 50903 30991 13715 26033 69399 49333 31373 22033 18119 35805 65291
14926F5291l4809P4883K7293l7230m3715r936n676Q909P119n8485k1109N9280
$$ 65291 30482 105365 132658 95428 51713 41777 36101 45010 52129 -6356 -27465 31815
14914C1815j5209J2684J2096m915J0455O837r15J3947O2976l0516q3660m892M025
$$ 31815 16606 29290 41386 36471 46926 53763 52848 66795 129771 99255 15595 10703 14728
14901A4728M5935P041j6409k7576l9205l0901J8652O4343O48r382J9326k1917
$$ 14728 60663 67704 51295 23719 -15486 -46387 -27735 36608 37256 27874 47200 25283
$$ [...]
##END NTUPLES=NMR SPECTRUM
##END=
