##TITLE=Analysis number 328960
Compound Code cc 66501
Book Reference 467/168
Project Code adrs
Chemist Name benw
##JCAMPDX= 6.0         $$ Bruker NMR JCAMP-DX V2.0
##DATA TYPE= NMR SPECTRUM
##DATA CLASS= NTUPLES
##ORIGIN= Bruker BioSpin GmbH
##OWNER= nmr
$$ XWIN-NMR		Version 3.5
$$ Thu Jul 19 14:03:44 2007 GMT Daylight Time (UT+1h)  MAYBRIDGE\nmr@NMR_250MHZ
##.OBSERVE FREQUENCY= 250.131544655141
##.OBSERVE NUCLEUS= ^1H
##.ACQUISITION MODE= SIMULTANEOUS (DQD)
##.ACQUISITION SCHEME= undefined
##.AVERAGES= 16
##.DIGITISER RES= 18
##SPECTROMETER/DATA SYSTEM= dpx250
##.PULSE SEQUENCE= zg30
##.SOLVENT NAME= DMSO
##.SHIFT REFERENCE= (INTERNAL, DMSO, 0, 16.522)
##AUDIT TRAIL= $$ (NUMBER, WHEN, WHO, WHERE, WHAT)
$$ ##TITLE= Audit trail, XWIN-NMR		Version 3.5
$$ ##JCAMPDX= 5.01
$$ ##ORIGIN= Bruker BioSpin GmbH
$$ ##OWNER= nmr
$$ C:\u/data/dgb/nmr/ADRS/1230/pdata/1/auditp.txt
$$ ##AUDIT TRAIL=  $$ (NUMBER, WHEN, WHO, WHERE, WHAT)
(   1,<2007-07-19 14:03:24.45 +100>,<MAYBRIDGE\nmr>,<NMR_250MHZ>,
      <created by zg, POWCHK disabled, PULCHK disabled
       configuration hash MD5:
       76 6E 9A 78 1E 09 19 81 EC 84 63 8F B0 6A 59 2D
       data hash MD5: 64K
       0D D6 33 00 AF 05 34 6B F4 73 2F 8D 06 C2 5D DE>)
(   2,<2007-07-19 14:03:35.30 +100>,<MAYBRIDGE\nmr>,<NMR_250MHZ>,
      <Start of raw data processing
       ef LB = 0.3 FT_mod = 6 PKNL = 1 SI = 32K 
       data hash MD5: 32K
       2D B8 77 28 8C AF 14 08 F3 0A 7B 5D 47 CF 92 83>)
(   3,<2007-07-19 14:03:36.97 +100>,<MAYBRIDGE\nmr>,<NMR_250MHZ>,
      <apk 
       data hash MD5: 32K
       B4 00 BA 03 FD 8E C1 9B 4E 7C FE 50 9A 1C D9 E5>)
(   4,<2007-07-19 14:03:37.72 +100>,<MAYBRIDGE\nmr>,<NMR_250MHZ>,
      <abs ABSG = 5 
       data hash MD5: 32K
       04 7B CD 2B 8A 12 F1 BE 6E CB E2 1B AE BA 80 99>)
$$ ##END=
$$ 
$$ hash MD5
$$ 7A EB CD 52 A1 BD 8D 60 A7 79 DE DC 73 24 D6 B9
##$RELAX= 
##$RELAX= 
##$RELAX= 
##$RELAX= 
##$RELAX= 
##$RELAX= 
##$RELAX= 
$$ Bruker specific parameters
$$ --------------------------
##$DU= <C:\u>
##$EXPNO= 1230
##$NAME= <ADRS>
##$PROCNO= 1
##$TYPE= <nmr>
##$USER= <dgb>
##$AMP= (0..31)
100 100 100 100 100 100 100 100 100 100 100 100 100 100 100 100 100 100 
100 100 100 100 100 100 100 100 100 100 100 100 100 100 
##$AQSEQ= 0
##$AQ_mod= 3
##$AUNM= <au_zg>
##$AUTOPOS= <31 >
##$BF1= 250.13
##$BF2= 250.13
##$BF3= 250.13
##$BF4= 250.13
##$BF5= 500.13
##$BF6= 500.13
##$BF7= 500.13
##$BF8= 500.13
##$BYTORDA= 1
##$CFDGTYP= 0
##$CFRGTYP= 5
##$CHEMSTR= <none>
##$CNST= (0..31)
1 1 145 1 1 1 1 1 1 1 1 1 1 1 1 1 1 1 1 1 1 1 1 1 1 1 1 1 1 1 1 1 
##$CPDPRG= <>
##$CPDPRG1= <>
##$CPDPRG2= <>
##$CPDPRG3= <>
##$CPDPRG4= <mlev>
##$CPDPRG5= <mlev>
##$CPDPRG6= <mlev>
##$CPDPRG7= <mlev>
##$CPDPRG8= <mlev>
##$CPDPRGB= <>
##$CPDPRGT= <>
##$D= (0..31)
0 1 0 0 0 0 0 0 0 0.06 0 0 0 0 0 0 0.0002 0 0 0 0 0 0 0 0 0 0 0 0 0 0 
0 
##$DATE= 1184850203
##$DBL= (0..7)
120 120 120 120 120 120 120 120 
##$DBP= (0..7)
150 150 150 150 150 150 150 150 
##$DBP07= 0
##$DBPNAM0= <>
##$DBPNAM1= <>
$$ [...]
##$SUBNAM7= <"">
##$SUBNAM8= <"">
##$SUBNAM9= <"">
##$SW= 20.6930455092707
##$SWIBOX= (0..15)
0 0 3 0 0 0 0 0 0 0 0 0 0 0 0 0 
##$SW_h= 5175.983436853
##$TD= 65536
##$TD0= 1
##$TE= 296.16
##$TE2= 300
##$TE3= 300
##$TEG= 300
##$TL= (0..7)
0 120 120 120 120 120 120 120 
##$TP= (0..7)
150 150 150 150 150 150 150 150 
##$TP07= 0
##$TPNAME0= <>
##$TPNAME1= <>
##$TPNAME2= <>
##$TPNAME3= <>
##$TPNAME4= <>
##$TPNAME5= <>
##$TPNAME6= <>
##$TPNAME7= <>
##$TPOAL= (0..7)
0.5 0.5 0.5 0.5 0.5 0.5 0.5 0.5 
##$TPOFFS= (0..7)
0 0 0 0 0 0 0 0 
##$TUNHIN= 0
##$TUNHOUT= 0
##$TUNXOUT= 0
##$USERA1= <user>
##$USERA2= <user>
##$USERA3= <user>
##$USERA4= <user>
##$USERA5= <user>
##$V9= 5
##$VALIST= <valist>
##$VCLIST= <CCCCCCCCCCCCCCC>
##$VD= 0
##$VDLIST= <DDDDDDDDDDDDDDD>
##$VPLIST= <PPPPPPPPPPPPPPP>
##$VTLIST= <TTTTTTTTTTTTTTT>
##$WBST= 1024
##$WBSW= 4
##$XGAIN= (0..3)
0 0 0 0 
##$XL= 0
##$YL= 0
##$YMAX_a= 373445
##$YMIN_a= -231964
##$ZGOPTNS= <>
##$ZL1= 120
##$ZL2= 120
##$ZL3= 120
##$ZL4= 120
##$ABSF1= 16.522
##$ABSF2= -4.171173
##$ABSG= 5
##$ABSL= 3
##$ALPHA= 0
##$AQORDER= 0
##$ASSFAC= 0
##$ASSFACI= 0
##$ASSFACX= 0
##$ASSWID= 0
##$AUNMP= <proc_1d>
##$AZFE= 0.1
##$AZFW= 0.1
##$BCFW= 0
##$BC_mod= 0
##$BYTORDP= 0
##$COROFFS= 0
##$CY= 12.5
##$DATMOD= 1
##$DC= 0
##$DFILT= <>
##$DTYPP= 0
##$F1P= 14.0000005364418
##$F2P= -0.99999901652339
##$FCOR= 0.5
##$FTSIZE= 32768
##$FT_mod= 6
##$GAMMA= 0
##$GB= 0
##$INTBC= 1
##$INTSCL= 1
##$ISEN= 128
##$LB= 0.3
##$LEV0= 0
##$LPBIN= 0
##$MAXI= 10000
##$MC2= 0
##$MEAN= 0
##$ME_mod= 0
##$MI= 0
##$NCOEF= 0
##$NC_proc= -4
##$NLEV= 6
##$NOISF1= 0
##$NOISF2= 0
##$NSP= 0
##$NTH_PI= 0
##$NZP= 0
##$OFFSET= 16.522
##$PC= 1
##$PHC0= -63.09637
##$PHC1= 11.21749
##$PH_mod= 1
##$PKNL= yes
##$PPARMOD= 0
##$PSCAL= 4
##$PSIGN= 0
##$REVERSE= no
##$SF= 250.13
##$SI= 32768
##$SIGF1= 0
##$SIGF2= 0
##$SINO= 400
##$SIOLD= 32768
##$SREGLST= <1H.DMSO>
##$SSB= 0
##$STSI= 32768
##$STSR= 0
##$SW_p= 5175.98343685301
##$SYMM= 0
##$S_DEV= 0
##$TDeff= 65536
##$TDoff= 0
##$TI= <Analysis number 999999
Compound Code 99
Book Reference 9
Project Code 9>
##$TILT= no
##$TM1= 0
##$TM2= 0
##$TOPLEV= 0
##$USERP1= <user>
##$USERP2= <user>
##$USERP3= <user>
##$USERP4= <user>
##$USERP5= <user>
##$WDW= 1
##$XDIM= 32768
##$YMAX_p= 554716775
##$YMIN_p= -241468
$$ End of Bruker specific parameters
$$ ---------------------------------
##NTUPLES= NMR SPECTRUM
##VAR_NAME=  FREQUENCY,     SPECTRUM/REAL,   SPECTRUM/IMAG
##SYMBOL=    X,             R,               I
##VAR_TYPE=  INDEPENDENT,   DEPENDENT,       DEPENDENT
##VAR_FORM=  AFFN,          ASDF,            ASDF
##VAR_DIM=   32768,         32768,           32768
##UNITS=     HZ,            ARBITRARY UNITS, ARBITRARY UNITS
##FACTOR=    0.157963299565203, 1,           1
##FIRST=     4132.6476996994, 0,             0
##LAST=      -1043.33573715361, 0,           0
##MIN=       -1043.33573715361, -241468,     0
##MAX=       4132.6476996994, 554716775,     0
$$ Real data points
##PAGE= N=1
##DATA TABLE= (X++(R..R)), XYDATA
$$ [...]
26896h3196n9363N5159O2996j1995n35k0060M9352r445k784K5256J6453N7285
26884G9123k0012o2084m0344K1767K4134l8221K8898l2175o123L6191Q094q591
26872i343m2493Q322O0919j1561j0014L2889m5738m4670Q0328M797P4859M17m2344
26859E6368n6718j8697L6475L0729j3763k4806K2372K8152l5457j7870l6024j9829
26847d9068M9851l3179l402M4570j7572m42J6076K2010R692K1684M845j4725j9969
26834C0371j5958O1130k0965m7648L1077N251M0163k2804n2874L8308n4480o9566
26822g7995m902L4218n855k7501J0353Q569J7870M0586N082K1884P663L6079n8089
26809G962p4157J908J4990p046j5777K9406k2165k7044M8314M0672n443L4887
$$ y = [-83196, -142559, -87400, -24404, -36399, -36934, -56994, -7642, -17087, -19871, 5385, 21838, 79123, 59111, -2973, -43317, -21550, 2584, -35637, -6739, -38914, -45037, -8846, -752, -9343, -51836, -43514, 17405, 5844, -4170, 28719, -17019, -61689, 18639, 23436, 98295, 98712, 56368, -350, -19047, 17428, 48157, 34394, 9588, 31960, 60112, 24655, 6785, -29239, -49068, 783, -32396, -35798, 8772, -8800, -9242, 6834, 28844, 38536, 60220, 65065, 50340, 30371, 14413, 75543, 54578, 6930, 38007, 43258, 83421, 60617, 7743, 46051, -8429, -77995, -82897, -48679, -54534, -82035, -71682, -63113, -45243, -4657, 425, 22309, 29972, 66051, 7962, -66195, -64287, -49297, -56343, -72120, -42714, -64879, -91923, -43609, -2937, -8380, 26507]
26797B6507J1306o3247k1433j919q260K6543M7465j9262K02r0094q886K6940L8185
26784c5953K0426Q761K4675k1991j6865N2292J5902n0514j5327J5004N4691Q808
26772E9909k9066n4090M4104R2577K2256n9600q0871N96P6114J1245k6713l1283
26760B5178R4819N112m1414J99Q497k8292j6896l5276L421m7634q1060m2585j7400
26747a73331L6271N4471N1817L0324J05759N259k4524l5412l9853j6259n6525
26736f2003N6094P5880K9691p560j750m9637o6129L184J5706J2353L32O8017J0840
26723H5018m3164l1801L4822p22m5500k6480J9243l6804O563Q217k1928j1144
26711f3680L9943N3501N9863o4798r9334m2372j6586P416L1029N5787N4553k7037
$$ y = [26507, 37813, -25434, -46867, -48786, -57046, -30503, 16962, -2300, -2098, -92192, -101078, -74138, -35953, -15527, -6766, 17909, -4082, -20947, 31345, 47247, -3267, -18594, -3590, 51101, 59909, 30843, -23247, 20857, 113434, 135690, 76090, -4781, -4185, 71929, 83174, 56461, 25178, 119997, 125109, 83695, 83894, 92391, 64099, 47203, 11927, 15348, -32286, -113346, -155931, -173331, -137060, -82589, -30772, -448, 105311, 110570, 86046, 50634, 10781, -5478, -62003, -5909, 69971, 99662, 92102, 90352, 40715, -25414, -22230, -6524, 5829, 6161, 74178, 85018, 41854, 10053, 44875, 44153, -1347, -27827, -8584, -45388, -38825, -30608, -52536, -63680, -23737, 29764, 89627, 24829, -74505, -116877, -133463, -126047, -95018, -39231, 15322, -11715]
26699a1715n4696L229J0478N3310K8455J8710j4360N3313L1906k3646l5887p5878
26687a6781Q075k3633K0482Q7368k7795l3080Q686Q577m3068j6873O04J8585M304
26674d549J1806L2857M0298m6109k422J8233p802J5461m9962l6402j3970M6113
26662C552K6536k4555J3088L3498R7753q447q0133j00875k0363R1199L0756k4023
26650C7986j1244L0373j1799m2313j8319Q433k2322k5220k2112J2223j5358K14
26638g9458M5783j020O97o544l4026L6049O2127n0839j071N2750N0739m8611k8159
26625a583m8193M9217K0771q784p7463k2077L6950Q3419K2578r6378n8249L1412
26613f8380J8210M4837K3658m2454j9975j4965l4639Q673J179L9830O6427J0106
$$ y = [-11715, -66411, -63182, -52704, 606, 29061, 47771, 33411, 86724, 118630, 94984, 59097, -16781, -8706, -32339, -11857, 75511, 47716, 14636, 23322, 31899, -11169, -28042, -27438, -8853, -4549, 7257, 40114, 80412, 34303, 31881, 50114, 42312, 57773, 7811, -28591, -42561, 3552, 30088, 5533, 18621, 52119, 149872, 141425, 61292, -39583, -59946, 31253, 62009, 37986, 26742, 57115, 45316, 3003, -15316, -6883, -29205, -54425, -76537, -64314, -79672, -79458, -33675, -34695, -33998, -40542, -74568, -38519, 23608, -27231, -28302, 24448, 75187, 26576, -1583, -49776, -559, 20212, 11428, -66035, -88112, -51162, 32257, 54835, -41543, -99792, -68380, -50170, -5333, 18325, -24129, -44104, -59069, -93708, -85035, -83856, -44026, 22401, 32507]
26601C2507k0932m1452l9547N7416r727p9375P972L5262L2572M8333M398k3049
26589D378J8648L3714M8508J4733m4330n1070R245N0528K1109o3145m097P1271
26577A09492o4451q1844j3600n012L5726L1798M3328J5443j4451n3541l4747n086
26565c6945L4935o238p9381j8023J3948M2964P3325J3890r529n1978n0576J5422
26553e8186M5989N3153J0360o508K422J8962J804n7176L189O2201k3894j663q692
26540D1961j0423k6682k7464n946j4453K3969L8998J4366r191m7535o0748j9651
26528a02799K1639J8487j035m8821n5507k438M2637N9650K8632L2465J0786m1567
26516c7871r093l03P3817J2252l4610j9718K8013M3752K460l6234m6777k0651
$$ y = [32507, 11575, -29877, -69424, -12008, -21735, -101110, -93138, -57876, -25304, 23029, 27427, 4378, 23026, 56740, 105248, 119981, 75651, 24581, 33826, 84354, 105463, 42318, 38221, 109492, 45041, -36803, -50403, -55415, -19689, 12109, 55437, 70880, 56429, 2888, -31859, -36945, -2010, -8248, -87629, -105652, -91704, -48740, 24585, 38475, 28946, -23032, -73608, -58186, -12197, 40956, 51316, 44808, 47230, 66192, 67996, 10820, 14009, 76210, 52316, 50653, 41961, 31538, 4856, -22608, -28554, -43007, -19038, 19960, 34326, 25135, -22400, -83148, -102799, -81160, -62673, -63708, -112529, -168036, -170474, -127837, -68187, -39555, -7090, 3696, -37871, -46964, -47267, 26550, 38802, 4192, -15526, 12487, 56239, 58699, 22465, -24312, -44963]
26504d4963M0387k5993j8156M9481l412N8k431J7022K6889J876J2339N436k5106
26491C3427l3425p5336k3706K2002J8189L6998Q248K2058j2618J0539K8164j6114
26479A8426n9K6080q328p539p899j9060K9748M9837J530m664l2967j16433j5952
26466h7280K8946J6852L0676J2677j1117L765n4531J5980P5143l4799k0216J0674
26454a3230M1485q2365q8104O992O4291M1379N867m634m9042j216j3337O6083
26442b5831K9076j7054R431J6080O964N5152K9088n1758p0582P365L1105j2099
26430F937n0563K3093M5920K3763l5045n134l6178n1151k472L1128m272L1168
26418b2806k4546j2408k6370j8939M6092M5051R412n7988m5335J9195O7184M339
$$ y = [-44963, -4576, -30569, -48725, 756, -2656, -2598, -5029, 11993, 38882, 40758, 53097, 58533, 33427, 2, -75334, -99040, -77038, -58849, -21851, -13603, 8455, -4163, 6376, 34540, 18426, 18367, 44447, 36119, 28580, 20681, 1621, 31369, 81206, 82736, 78072, 45105, -71328, -87280, -58334, -41482, -10806, 1871, -9246, -5481, -60012, -44032, 31111, -3688, -23904, -13230, 28255, -54110, -142214, -135222, -70931, -29552, -23685, -28319, -77361, -78577, -91914, -25831, 3245, -13809, -4378, 11702, 18666, 73818, 102906, 51148, -19434, -12069, 19036, 6937, -43626, -20533, 25387, 49150, 14105, 8971, -27207, -78358, -80830, -49702, -53974, -22806, -47352, -59760, -86130, -105069, -58977, -13926, -4514, -62502, -107837, -88642, -21458, -17119]
26406a7119m1413j8215l8114K4155L7886O000J0271p767J7796J2240o9819k2143
26394a06242K0882M4348O0573r978L5308J404j5281j02537j4066M5211j389k7517
26382f9284K7177O4881P1307o89k6408k4458k2464k181l2437l5170J4379M3709
26370H362k010j2912j2146m4640M333M8751L0394p152k1598N358N7048L2096m3543
26357D2341n618j9447k0242L334Q934J4235j8139n1277n5944m6963L4290J02447
26345a2049K1161m846j1778O1186K2369j3878L2702J1724m8044n6403k0773K064
26333a6565l1283l5288N1448M5856J6731p190n2130N5936L318m2101k9134L8291
26321b111M8561j522m9608j5766q446m306j9001N2439P518k9254l5138j9178M2981
$$ y = [-17119, -58532, -76747, -114861, -90706, -52820, -46820, -36549, -44316, -26520, -14280, -84099, -106242, -85360, -41012, 19561, 9583, 44891, 46295, 31014, -71523, -85589, -40378, -41767, -69284, -42107, 22774, 94081, 93392, 66984, 42526, 20062, 17881, -14556, -49726, -35347, 8362, 6352, -6560, -18706, -63346, -59013, -10262, 20132, 12980, -8618, -3260, 53788, 85884, 42341, 36723, 17276, -2966, 368, 9302, 23537, 5398, -45879, -101823, -148786, -114496, -12049, 9112, 4266, -7512, 53674, 76043, 62165, 94867, 106591, 58547, 2144, -18629, -16565, -47848, -83136, -31688, 14168, 30899, 23709, -28421, 27515, 30833, -11268, -40402, -2111, 46450, 44928, -4680, -20446, -28892, -33198, -52199, 240, 7758, -21496, -56634, -75812, -32831]
26308c2831O3149pm725m8378l1703n5011L329M2564J2233K8135K1213k2827L8841
26295A3982O8704M0184o3660p0586l9581n0550J6166j0816L3518J5543Q681o021
26283d4436K8032l0477k9842R076J0646J214M6793L9635J4204j872j2161o0969
26271c0157m2307j256P992L5842k4243j5200M6982R781M0394N1872l4329o2924
26259a7553J4925K8404m9887j3907r883L187J8503j2675l544P514J003m8762m628
26246h7303K9262k2736n203k1524q242k738L9132L7458o655K0610P344N3206L2735
26233F5346l9323q847J7523j1277k0027l9446K0267K6021j8588j950K6863n0070
26221c3508J185q638m0876J9913M6586L3391J430m6866K7832j1518n4029l3400
$$ y = [-32831, 30318, 30311, 25586, -22792, -54495, -109506, -106177, -63613, -51380, -23245, -2032, -24859, 13982, 82686, 122870, 59210, -11376, -50957, -101507, -85341, -96157, -62639, -47096, -38415, -44436, -16404, -46881, -76723, -67647, -57001, -55787, -8994, 30641, 44845, 42973, 30812, -30157, -72464, -73720, -65728, -29886, -54129, -69329, -22347, -12566, 27828, 79700, 45371, -17553, -2628, 25776, -24111, -38018, -47901, -44714, -26211, -38886, -42430, -34916, -33913, -82675, -87303, -58041, -80777, -85980, -107504, -115746, -118484, -79352, -41894, -48549, -27939, -20595, 32611, 65346, 26023, 17176, 34699, 23422, 3395, -36051, -15784, 10237, -8351, -10301, 16562, -33508, -32323, -40961, -81837, -61924, -15338, 18053, 19483, -27383, 449, -11069, -65098, -98498]
26209i8498k933N209N158l0507k417K0559M1159N8264K1959p634m0475o057L5662
26196e51K6913k1505J760O3689n1955n0418n1371n6384k9258J1282K7486J7033
26184a13279J6222L5850Q678J2841N904J4794J8009j3575j5201K6956j9915k1574
26172d4290k4172o376K381o785J3994j2809N0252J4431p3645n6625Q2943L8678
26160b2023J3923m4198J4815j7535k852l7098L8802P6074L2115K5923l6490j6125
26148B5331l5011m5977m9152o295N0992M4939N8430J7690m830K9483m2817j8135
26136B4648m2205j0266J7091j1946M903K267O4819N263m876m3994q3546l7482
26124a15324K0807L6220M3957K843l1926l3106m0613J6125O5278J9050j0232K960
$$ y = [-98498, -101431, -96222, -91064, -121571, -123988, -103429, -62270, -4006, 17953, 10319, -30156, -36213, -551, 26362, 4857, 6617, 70306, 18351, -32067, -83438, -139822, -169080, -157798, -130312, -113279, -97057, -61207, -52529, -39688, -33784, -18990, -981, -14556, -29757, -2801, -22716, -44290, -68462, -74838, -72457, -79242, -65248, -78057, -27805, -13374, -87019, -143644, -60701, -22023, -8100, -52298, -37483, -55018, -57870, -94968, -56166, 19908, 52023, 77946, 41456, 25331, -9680, -55657, -104809, -111104, -60112, -15173, 43257, 60947, 56117, 85600, 42783, 24648, -17557, -27823, -10732, -22678, -17775, -15508, 49311, 54574, 49698, 5704, -77842, -115324, -94517, -58297, -14340, -11497, -43423, -76529, -117142, -101017, -35739, -16689, -26921, -23961]
26112b3961J5825J2793k5182k3933q914p773N9588l1119l3543K5456K3583K9036
26100A1856K9294Q025j8955m3382l8612J4395L4549J9493k6629j1948k9009R640
26088d1283L0303P2594k3442k8756L4985J4873j0113L6998J0106o4723L895K3272
26076E8709J7042m4167p9245k3672m98Q815O9110L3343j5352j5191k1254m7922
26064f0282l07q039M9491k579K6705l7999K245L6694J5858M719M5558j7963o9429
26051a5328M0571J9229o5851m33l7955m6154K4725L0251N5299j0158o1179o3598
26039a30581K3123L1481P0910j4584N3156j2282k9798k4205k6268j8794K3722
26028e4120P8394L1882M423k3828j7821k3355J5417N1478J0876r362q6997j0563
$$ y = [-23961, -8136, 4657, -20525, -44458, -53372, -61145, -1557, -32676, -66219, -40763, -17180, 11856, 41150, 49175, 30220, -13162, -51774, -37379, -2830, 16663, -9966, -21914, -50923, -41283, -10980, 61614, 38172, 9416, 44401, 59274, 49161, 86159, 96265, 31542, 35437, 58709, 75751, 31584, -47661, -71333, -71831, -63016, 6094, 39437, 24085, 8894, -12360, -60282, -60589, -68628, -19137, -21716, 4989, -33010, -30765, 5929, 21787, 26506, 72064, 54101, -15328, 25243, 44472, -21379, -21812, -59767, -105921, -81196, -50945, 4354, -5804, -66983, -130581, -107458, -75977, -5067, -19651, 33505, 21223, -8575, -32780, -59048, -77842, -54120, 24274, 56156, 60579, 36751, 18930, -4425, 10992, 62470, 73346, 63984, -23013, -33576]
26016c3576k9618J6570P665J522J7547J0861M142n9477o5198M3914n556J9922
26004g1282M5578J2210J8957k4515k7733N596O1112k4227q4028Q99P4308K939
25992a0186j5670k2154k7110l2900l1320M6691M0370N9618j7406k4927l195L1814
25980f375L5097o2009q3323m3028M5657K5325J3439q720r609N6331o088k1935
25968f5238P951J8110N4868O3898O718l9228K813K0914j2606J1792j3780R244
25956F5456K0938k9353L71N0957m5425o6963k2847j4517K0410j2684o0720J5255
25944g9122M1907p901L2704J9250k8105M642K6668O185q822P3611k1141l6262
25932B3614N4294J0538n6713j29234m226K5670p315k8428Q468q608R1115J2712
$$ y = [-33576, -63194, -46624, -38959, -37437, -19890, -9029, -4887, -64364, -129562, -85648, -91204, -71282, -25704, -13494, 5463, -19052, -46785, -41189, 19923, -4304, -88332, -87433, -13125, -10186, -25856, -48010, -75120, -108020, -139340, -92649, -52279, 7339, -10067, -34994, -38189, -6375, 28722, -33287, -116610, -159638, -113981, -88656, -75217, -83937, -93546, -37215, -43303, -65238, -57287, -39177, 15691, 79589, 86307, 47079, 49892, 70806, 58200, 69992, 56212, 65456, 86394, 57041, 57412, 108369, 62944, -4019, -26866, -41383, -20973, -33657, -94377, -79122, -37215, -45116, -12412, 6838, -21267, -16625, 10043, 16228, 7406, 81017, 59876, 23614, 77908, 88446, 31733, -97501, -101727, -76057, -83372, -111800, -103332, -111940, -20825, -8113]
25920h113n0849o334L866J6254j7370k5360N2378m0436k9147J2253L4230N547
25908e3081M8264o0583q5002M9494l0130J725L6154O3206M9316q64l6853k4589
25896d2943j5986J2229J9839L747J8039o333k4450J2504N85l074m827l1749P1026
25883H607L9836m6619j3338q260L0477M3116j13626Q424L9745K53j0143J02070
25871H0542k0254l4020j8098r660j9667p961j6614N6173L0526n1969m974k9493
25859d5469r484J7004j2929m4706J2761m354l966L8064L3185M5751k5198l5034
25847c4375k2289L1l3491n525o997n589l6596N6254J449k1904Q384Q185j0032
25834a02495N8805N4822P085m6104j5057M4342Q5318L7924N941l3959l1573n0822
$$ y = [-8113, -58962, -65296, -61430, -45176, -62546, -87906, -35528, -75964, -105111, -92858, -58628, -53081, -4817, -65400, -150402, -100908, -131038, -129313, -93159, -29953, 19363, 18499, -18354, -42943, -58929, -46700, -26861, -23114, -5075, -11408, -35858, -23354, -22769, -25843, -30670, -62419, 8607, 48443, 1824, -11514, -19774, 10703, 53819, -59807, -51383, -11638, -11385, -21528, 80542, 60288, 26268, 8170, -1490, -21157, -29118, -45732, 10441, 40967, -11002, -15976, -45469, -54953, -37949, -50878, -95584, -82823, -87177, -91143, -53079, -19894, 25857, 659, -34375, -56664, -56633, -90124, -95649, -102646, -108235, -144831, -88577, -87128, -109032, -100648, -92463, -102495, -43690, 11132, 18217, -27887, -42944, 1398, 86716, 124640, 130581, 96622, 65049, 14227]
25822A4227N696k6275K8386M274m8427m788k082L6701J5164J0884J5793l4705
25810A4848n3972J6531J8328M5846r412m8451M3707K9866K0505O9608M1714o3823
25798A25295m6166k7875l8767k9456J8117K9382j9688k6563K1236l1884m359k6241
25786e6969l4425K396K8462K8345J8712J5062O4072L9268m3602m3978j0166l7600
25774c0423m8523L9760J3250J5369L5929k1091k0795J5775j7877l43O2257N4447
25762I7735P7977j00825n1087k0432P969m1005k6900l532J1625Q179K542j317
25750c9071k9154n4541l7338M7289P4114o523M0751m161l880O613k8670K1897
25738a2674k7135N135Q2008J2929p5860K767l7627l3520K3047j0183j6768j1735
$$ y = [14227, 19923, -6352, 22034, 26308, -22119, -26907, -28989, 7712, 22876, 33760, 49553, 14848, -39124, -22593, -4265, 41581, 32169, -16282, 27425, 57291, 77796, 147404, 189118, 125295, 79129, 51254, 12487, -16969, 1148, 30530, 10842, -15721, 5515, -26369, -30728, -56969, -91394, -88998, -60536, -32191, -13479, 1583, 65655, 104923, 61321, 17343, 7177, -30423, -78946, -39186, -25936, -10567, 25362, 4271, -16524, -749, -18626, -18969, 43288, 97735, 175712, 74887, 23800, 3368, 11337, -29668, -56568, -60100, -48475, -40296, -37754, -39071, -68225, -122766, -160104, -112815, -38701, -45224, -4473, -8634, -12514, -5901, -34571, -12674, -39809, -34674, 47334, 60263, -15597, -12830, -50457, -83977, -60930, -71113, -87881, -99616]
25726i9616q305L4700k933L674j5720J7902K6388J0801L5686k0340l3762j3376
25714f4901o7451l707K7456N2787K8754j1604o318r518O8152L8132j9951J2768
25702D4599r073j1470K9937m1289j9152o9559P052K9834l1785P1932M0917o5905
25690b3962m6095j0886m038K3891K0480K8327J3626M3841k1492M943l9599j3120
25678b4084J2106m0455j237O5430Q8476l2182q7240l9393K4174M8854K1883R992
25666D6324J48j5519j9502K4938M6516o6297r38l8241l7704R289o067R0321N3531
25653H6799j9757p8455o8282l6599Q128N8958N202j4813N6733J8883l1901M1257
25641B6153Q745j2187M4026j9019p4489m7375o162M1036J7036J0043R183L578
$$ y = [-99616, -107921, -73221, -76154, -72480, -88200, -70298, -43910, -33109, 2577, -17763, -51525, -64901, -132352, -136059, -108603, -55816, -27062, -38666, -44984, -54502, 13650, 51782, 31831, 44599, 35526, 24056, 53993, 12704, -6448, -76007, -68955, -39121, -70906, 1026, 41943, -23962, -70057, -80943, -84981, -61090, -40610, -12283, 1343, 45184, 23692, 28635, -10964, -24084, -11978, -52433, -53670, 11760, 100236, 68054, -19186, -58579, -34405, 14449, 36332, 46324, 46472, 30953, 11451, 36389, 82905, 16608, 15670, -22571, -60275, -50986, -57053, 33268, 86799, 67042, -11413, -79695, -116294, -108166, -49208, -44006, -58819, -2086, 16797, -15104, 26153, 34898, 22711, 66737, 47718, -26771, -74146, -80308, -39272, -22236, -12193, -3010, 568]
25629E68J5369j0378j2042J9571J8721L736O664M6240R69p1005l9542m5927l2413
25616i9469M7284K396M1919R976o2372p0692J551O258r468O5548L3661m4195j2140
25603h9743j6725j7614L6551J9310o709K5737K6671k148j0296k3066j9454K5716
25591e1770K9910J2902q346K1616K2792m574l1217m9255R801L6122o178m7943
25579f6140L804M4245N4698K0004n6895l2759J7108N4065J2237q978j7621j0722
25567A3046k3127n933P418l8688o207l6963k0046K5423L5344j2687Q878M1938
25555a1604l319l0328K6380M2041l7615o2370k5429j4103k1078Q115l4920K665
25543a61565P8649J9088J5698K4720K4246M8249M3413k7980m6144n6316J9598
$$ y = [568, 15937, 5559, -6483, 13088, 31809, 35545, 42209, 88449, 89418, 18413, -21129, -67056, -99469, -52185, -49789, -7870, 2106, -60266, -130958, -129407, -123149, -132617, -67069, -33408, -77603, -89743, -106468, -124082, -87531, -68221, -74930, -49193, -22522, -24670, -34966, -58032, -77486, -51770, -21860, -8958, -17304, 4312, 27104, 22530, -8687, -57942, -48141, -12019, -18197, -66140, -62336, -18091, 36607, 56611, -284, -33043, -15935, 38130, 50367, 41389, 23768, 13046, -10081, -16014, -8596, -47284, -53491, -90454, -110500, -85077, -49733, -62420, -53542, -11604, -14923, -45251, -18871, 23170, -14445, -76815, -102244, -116347, -137425, -129310, -164230, -161565, -82916, -63828, -48130, -23410, 836, 49085, 92498, 64518, 18374, -37942, -18344]
25532a8344O7591M9886k8197n8912k9106Q064N852L840J1955J0384q819M2665
25520E6859J5231J9392k5474J2985L9260J3601p3389n5729N5038l2609n1891l4551
25508f1277L3890K3257k3537j9336M4121N3605L704r9258l5550N2392K6248p406
25496i147J5369M4265l8638k4126n8898O429K0572M9957O0336j3070n8797o180
25484a1928q602j5446l3942J7898M0975M0993O5092l0746k2881j1374o143K127
25472B6023l9245k9175J0540l967K5315L7585o395j3363K165L876m2124J1436
25460a7329j8308O754J9391O7506O2359K7238n1315q6504K4790J3651p3849K9078
25448C462P4886M4507p9484n8644n1203j9198J9854N0151m2551j6317K2757N8604
$$ y = [-18344, 49247, 99133, 70936, 12024, -17082, -9018, -3166, 674, 12629, 23013, 14194, 56859, 72090, 91482, 66008, 78993, 118253, 131854, 58465, 2736, 57774, 25165, -26726, -61277, -27387, -4130, -27667, -47003, -2882, 50723, 54427, -44831, -80381, -27989, -1741, -9147, 6222, 50487, 11849, -12277, -71175, -64746, -44174, 5783, 66119, 53049, -5748, -11928, -20530, -35976, -69918, -52020, -11045, 29948, 95040, 64294, 41413, 30039, 23896, 26023, -13222, -42397, -31857, -35824, -10509, 27076, 20681, 7318, 9483, 13359, -28765, -17329, -35637, -28883, -9492, 58014, 120373, 147611, 96296, 9792, 34582, 48233, -25616, 3462, 78348, 122855, 43371, -15273, -66476, -85674, -65820, -15669, -58220, -74537, -51780, 6824]
25436F824J5531r398k2334m9318K1127L324k6687L5428L3494M5192Q825N5569
25424A17577j8633p4784l2101q575P355M3876L4263k3020l9935n3178J89r104
25412e6070m3J4737M7977j8358m6500J6987L6069k29n5247J4958K2434M0602J3877
25399C1194q028L4147m8890K849J5594l3839m6405K2675L9365o937K8825J6105
25387D6655k4557N3139J3224j3607p7629p3769p635k8064j6732j7187M7724M9307
25375d9131J65m4812L4950P9046O325J9419r1715l3202O5247O705K1788l1005
25363a6220k7965R236N690J628j1360l0141K1271J1729j4435l9028k5008o165
25351a20768L944N6848J1003L5596K8768P216n8622j7222o72m0536k5489q544
$$ y = [6824, 22355, 12957, -9377, -58695, -37568, -34244, -60931, -25503, 7991, 53183, 62008, 117577, 98944, 24160, -7941, -16516, -9161, 34715, 68978, 45958, 6023, -47155, -46966, -56070, -56113, -41376, 6601, -11757, -58257, -41270, -5201, -5430, -60677, -45719, -23285, 17317, 31194, 23166, 57313, 8423, 11272, 26866, -6973, -53378, -30703, 8662, 1725, 30550, 46655, 22098, 75237, 88461, 74854, -2775, -76544, -84179, -112243, -128975, -146162, -98438, -49131, -48966, -93778, -58828, 20218, 26543, 45962, -45753, -78955, -13708, -7003, 14785, -16220, -44185, -34949, -29259, -27631, -38991, -69132, -47861, -36132, -50567, -89595, -114603, -120768, -116824, -59976, -48973, -13377, 15391, 22607, -36015, -53237, -53909, -94445, -119934, -128478]
25339a28478M0657M0870N0967L6567m8306O294l661l108K1729N1813M5057j6024
25327I4377k4014k1657J5774m2900o6940K593N8009n879l6293m7973l1100p987
25315a13990L915L2373L315m0940J6162J8018L0385J3782q484K946M440M6526
25303H448k3131k5473k4361K3892N3751l3286k2861k9846L59J0798n615Q6954
25291A9629Q5104m7134k3769l2718R270J5364p285k3431J8337m271j9458J7933
25279G571J5718N0048k1023o0874k9225K179q690m4200J5166L7977J2878J6023
25267f452K6221l3257J6425K6557K1206k7971K147n6452k6749J5995j085O8388
25255B4973L5292K7948l2724n0926k699J9907k6058j4454L6839r058p5952J1784
$$ y = [-128478, -87821, -46951, 4016, 40583, -7723, -1429, -5090, -8198, 13531, 65344, 110401, 94377, 70363, 48706, 64480, 21580, -45360, -42767, 15242, 9363, -26930, -74903, -106003, -113990, -110075, -77702, -74387, -115327, -99165, -81147, -50762, -36980, -45464, -42518, -38078, 8448, -14683, -40156, -64517, -40625, 13126, -20160, -43021, -72867, -72508, -61710, -67325, 19629, 104733, 57599, 33830, 1112, 10382, 25746, 18461, -4970, 13367, 9096, -10362, 7571, 23289, 73337, 52314, -8560, -37785, -35606, -44296, -88496, -73330, -35353, -22475, -6452, 19769, -13488, 2937, 29494, 50700, 22729, 24876, -31576, -58325, -42330, -43415, 24973, 60265, 88213, 55489, 4563, 1864, 21771, -4287, -18741, 18098, 9040, -66912, -55128]
25243e5128K3447k1693j0479K2973M2517J5673K2439m6403K69l4185l6794N2444
25231b4920L968k7690l7761L8265n861N7476m350k1258O082L09o486K2400j9955
25218a9781l7477O3022j8137r62j0542K1103O0052k7621r332L5607q996o575m8706
25205h345k1692n489k0266j5765k4690q132O600L6175o899N2067L9511n0509m4363
25192g1797M4844M9161L8424j8021J9190m5289l0712k031J0959m4113O269J3893
25180b9223j2174j6529R119L3546J9730l216j7374j484L048R724j8136m0945J4994
25167d8920Q504j892O382K3492j2898J8132o3045k8000K6221J3462k0221J3255
25155f5528N0157j6264m8868n7775l6083J2537K1216P2673M574L5701J6907j9461
$$ y = [-55128, -31681, -53374, -63853, -40880, 1637, 17310, 39749, -6654, -6385, -40570, -77364, -24920, -20952, -48642, -86403, -48138, -53999, 3477, -873, -22131, -16049, -15740, -22226, 174, -19781, -57258, 5764, -12373, -13335, -23877, -2774, 57278, 29657, 20325, 55932, 46936, 40361, -8345, -30037, -35526, -55792, -71557, -96247, -104379, -97779, -61604, -68503, -16436, 23075, -27434, -71797, -26953, 22208, 60632, 42611, 61801, 16512, -14200, -16231, -5272, -49385, -43116, -29223, -41397, -57926, -48807, -15261, 4469, 1253, -16121, -17605, -14557, -4833, -22969, -63914, -48920, -40416, -42308, -35926, -12434, -25332, -7200, -70245, -98245, -72024, -58562, -78783, -65528, -15371, -31635, -80503, -138278, -174361, -161824, -140608, -67935, -63361, -27660, -10753, -30214]
25143c0214L8930l1565j8730M0950k5625p7891j0214O3770K6947J3373K8149L3022
25131E0902j2467m2542l0715Q5184N9117j692l939m917r520o9753k4882l0114
25119c5338J3067l8980k1433k3339P2155K3867L1897j2414q951L3607j445j8489
25107A4204l3539K5762j469p572n175M413j4918k9902p13P4081P7510K712n250
25094A00144o6849J6557r697K8822j5785p2179n4573j3694k5619O3767K8841L2156
25082A1891j1818N1214K7990m2921m5847L490k7751o4593m11L6991L9515K1083
25070a167P061n2721K0693M9447J8042J6341l7116j4030j6003j3262n0462m4592
25058a17769P3477O7402L161L6923k9476k1950k7981k9944L7932k9164k2711P356
$$ y = [-30214, 8716, -22849, -41579, -629, -26254, -104145, -114359, -50589, -23642, -10269, 17880, 50902, 38435, -4107, -34822, 50362, 109479, 107787, 103848, 98931, 89411, 19658, -5224, -35338, -22271, -61251, -82684, -106023, -33868, -10001, 21896, 9482, 531, 34138, 32693, 14204, -19335, 6427, 4958, -2614, -7789, -3376, -18294, -48196, -48909, 25172, 102682, 105394, 100144, 33295, 49852, 40155, 68977, 53192, -18987, -73560, -87254, -112873, -49106, -20265, 11891, 73, 51287, 79277, 36356, -9491, -6001, -33752, -98345, -98756, -61765, -22250, -1167, 5894, -46827, -26134, 23313, 41355, 57696, 20580, 6550, -9453, -22715, -73177, -117769, -44292, 23110, 26271, 63194, 33718, 11768, -16213, -46157, -8225, -37389, -60100, -52744]
25046e2744K3947l5439k2076j0329L7483k8707l2579K4370N9233N4117l1259m244
25034a8227j5802K3795J7152K6774M519l8387j3776L9453K674j9375L8983j2215
25022C5568n6003Q944m156n316k7062N8075k7201l3661K2844J5838J4519M0944
25010D3333l7343n6279k006P4961P9244k624m0946o6811q656k851l1024n642j6768
24997g3412j510M8262Q7962P392j6978m8437J1487m2984o3813L6742j3432j7816
24985h6537k8613j6035j6088l2650q825R3186N2144l2865k223m2578l111j4230
24973a38425K4625j1846R283J25569K3351j1116M4900M1858l2703r5172m9078
24962f8754J3589M6234R396Q785j0908p119p493k3814m3503K9936L9526J9893
$$ y = [-52744, -28797, -64236, -86312, -96641, -59158, -87865, -120444, -96074, -36841, 17276, -13983, -18227, -34029, -10234, 6918, 33692, 38211, -176, -13952, 25501, 28175, 8800, 47783, 35568, -20435, -11491, -15647, -20963, -48025, 10050, -17151, -50812, -27968, -12130, 2389, 43333, 5990, -50289, -52295, 22666, 101910, 99286, 58340, -8471, -17127, -19978, -51002, -56644, -73412, -74922, -26660, 61302, 68694, 51716, 3279, 14766, -28218, -92031, -55289, -68721, -86537, -115150, -131185, -147273, -179923, -188748, -95562, -43418, -76283, -78506, -121084, -124195, -138425, -113800, -125646, -116363, 9206, 32557, 21441, 66341, 108199, 75496, -19676, -68754, -55165, -8931, 465, 9250, -1658, -8777, -16270, -40084, -83587, -53651, -14125, 5768]
24950E768N465J9180j0538k1420l5545p1l739j677p676K3003n7146M2713l069
24937d4752j6507K0347k3418R650l5859j8329N4052P7491m2306L5737j0275m733
24925A098k8526k2308J1194M9114L2812M4219J2832j512l0564n445L1310j9999
24913G4225p6819m1631m2591l4341k5210J3566J9750l989N6693P4630N908M64
24901B0655j3703l632j7387j6868K4572K4243l6895L1088K566o0459L6135j374
24889a1059K5713P848n3681o5655j2721N461Q0129P3456m8523n8171m5515k465
24877a05183l2440K6855M8988K8870J0493J3253k6723l6598l2776J4961N8860
24866c1440L0492L7156l1773m0637L3270m06J64m7782l2394O4917M6058k7229
$$ y = [5768, 11233, 30413, 19875, -1545, -37090, -37161, -40900, -42577, -50253, -27250, -84396, -41683, -44752, -61259, -40912, -64330, -54680, -90539, -108868, -54816, 22675, -19631, 16106, 5831, 1098, -27428, -49736, -38542, 10572, 43384, 87603, 100435, 98923, 68359, 62914, 94224, 74225, -2594, -44225, -86816, -121157, -146367, -132801, -113051, -117040, -60347, 14283, 20191, 20655, 6952, 3320, -14067, -30935, -6363, 17880, -19015, 12073, 14639, -45820, -9685, -11059, 14654, 22502, -31179, -96834, -109555, -104094, -23965, 49491, 968, -57203, -102718, -105183, -137623, -110768, -61780, -32910, -22417, -9164, -35887, -72485, -105261, -90300, -31440, -948, 36208, 4435, -36202, -2932, -3338, -3174, -50956, -83350, -18433, 27625, 396]
24854C96o7372j4255K4865k7421K519N7839R998m8490j5714O8318O0863k7914
24842B3632m2578m1648k0198Q77M5131M2573Q2995m6107o163J9963m9324m1743
24830c2590N094k0094K2938m538k741J5448j556K9100j1430j353L2473J7656q525
24817C9882o1645p7999L166K6896K4603R447k8700L0763J0660j6018L7116L543
24805A714m5504L3991J8446k2825l6820J5876O7572N6611k3285q688k924o8774
24793a4610p4288K4237K4937l085Q323j2932O5421J4350n3775l2316J1665L3233
24781h840M1236n2604k3600L032k6392J1922O4927J8395k9310l5674J3533M7717
24769B4342n32K476k4511k5525l595J2890o1212J5805K1151j2331n4964L7182
$$ y = [396, -66976, -81231, -56366, -83787, -81268, -23429, -13431, -61921, -77635, -9317, 51546, 23632, -18946, -60594, -80792, -79915, -34784, 7789, 90784, 44677, 38514, 58477, 9153, -32590, -27496, -47590, -24652, -29190, -31931, -16483, -18039, 11061, -369, -1722, 30751, 48407, 39882, -21763, -99762, -96596, -69700, -45097, -35650, -64350, -33587, -22927, -38945, -1829, 1714, -43790, -9799, 8647, -14178, -50998, -35122, 32450, 89061, 65776, 57088, 54164, -14610, -88898, -64661, -39724, -42809, -34486, -47418, 18003, 32353, -21422, -53738, -42073, -8840, 32396, -20208, -43808, -40776, -67168, -55246, 9681, 28076, -1234, -36908, -23375, 24342, 23810, 26286, 1775, -23750, -27345, -14455, -75667, -59862, -38711, -51042, -106006, -68824]
24757f8824N2350j2839J7816N6660m8464n197j3599J2781J2748j9186M426K6107
24745A4779L7023K5084M409k991k1005J1678l286m8438J0864o970k3467K017K1466
24732B1163l7846q4083l6910J8800L5842P92K6494K5743J0469J5569J06K6338
24720B2477J443R675n3956J6001R1368P877q6763k1684O120j6446q93O3942l3359
24707E802l4022k1861J8115N7122N4433J9940l1935o868J588o5969j3122N5648
24695C8871j6145o2478l6340m806r108j2731R451N4042r184n3408N508M8961K5543
24682b1824l5749j9545k76P275M7005M2835r334j3816k6903K1975k6060j4572
24670d8989N2554n178m06M5725P161n6687n7967j6457P1788M5852k7524j0788
$$ y = [-68824, -16474, -29313, -11497, 45163, -3301, -8498, -22097, -9316, 3432, -15754, -11328, 14779, 51802, 76886, 81295, 78304, 57299, 68977, 65691, 17253, 28117, 21147, -2320, -303, 21163, -16683, -100766, -137676, -118876, -83034, -82242, -55748, -30005, -19536, -3967, -3861, 22477, 23920, 33595, -20361, -4360, 87008, 94885, 8122, -13562, -7442, -23888, -24781, 39161, 5802, -28220, -50081, -31966, 25156, 79589, 99529, 67594, 60726, 62314, -3655, -16777, 38871, 22726, -39752, -76092, -80898, -90006, -102737, -93286, -39244, -48428, -101836, -96328, -47367, -21824, -57573, -77118, -77394, -70119, -23114, 19721, 10387, -3429, -30332, -8357, -34417, -48989, 3565, -1613, -2019, 43706, 50867, -5820, -63787, -80244, -8456, 37396, 9872, -916]
24658i16j9708j9009n4289l5532O3842J01671K7210J025k5937m6703K7370L5113
24646E4137J0853j4356K1285m9454r3181J117M3790N734k2674L1958J5546k2150
24634a7395N7008l4703j01161m7759M8740P9197l3404j5840j3301l5608j3461
24623a27687n7903M4101P0974L8737J8054L4244o358q7192m4916j9609K6361l526
24611a14720O7601L2254o0250k6017P0756L5784m156j8068L520J9139Q253k6312
24599a2216k6362q337J4262l8700n0074J4425L3364O7987k3057k0356K6447m361
24587b6978j2534j3140K4356K2004R302l4818Q243L4144k5442k4016M44m7651
24575h6086n2770K8807k4698R105L4062R5306J1575K5955k5172l4149N7688P27
$$ y = [-916, -20624, -39633, -93922, -129454, -65612, 36059, 63269, 64294, 38357, -8346, 19024, 54137, 64990, 50634, 71919, 22465, -70716, -69599, -25809, -20075, -42749, -10791, 4755, -17395, 39613, 4910, -96251, -144010, -95270, -16073, -49477, -65317, -78618, -114226, -127687, -185590, -141489, -70515, -31778, -13724, 20520, 14162, -73030, -117946, -137555, -111194, -114720, -47119, -14865, -75115, -101132, -30376, 5408, 1252, -16816, -13296, 5843, 14096, -12216, -38578, -46915, -32653, -71353, -121427, -107002, -73638, -5651, -28708, -49064, -22617, -26978, -39512, -52652, -28296, -6292, 3010, -31808, -23565, 10579, -14863, -38879, -38435, -86086, -138856, -110049, -134747, -125642, -91580, 3726, 15301, 41256, 16084, -18065, 39623, 40350]
24563D0350j3182k1278j4998m0236j1310K4073J1766m0242j7679r539k8627K1437
24551i9465Q9542j3052j682M0384Q7680K7767k3750m5956n3352m962P488k9729
24539a9087L4558o6955m1280P0038N6226j7954k2214r666l4091l08M876K6334
24527a9523j1183P378J6133J785n8041k2412N5746R316J5739L9076L0328J3649
24515G7991p867N607m5700L1191L858m3759k6875j2203j3201k1125J5352J491
24503c5240J6840M980n066j7014p7423O736r396M5836O5642M4579m9088k3530
24491c2144K3261K815j28491j6036J16246L3831k7620k090k583j2602l632n853
24479e4898J0869L2186l2799M5057Q615l1388M4060m044j8013M9914K9263l5130
$$ y = [40350, 27168, 5890, -9108, -49344, -60654, -36581, -24815, -65057, -82736, -92275, -120902, -99465, -9923, -22975, -24657, 15727, 103407, 131174, 107424, 61468, 8116, 3154, 10642, -19087, 15471, -51484, -92764, -22726, 33500, 15546, -6668, -16334, -50425, -50733, -45857, -19523, -30706, -23328, -7195, -5410, -63451, -85863, -30117, -20801, -5062, 34014, 64342, 77991, 70124, 75731, 30031, 61222, 65080, 21321, -5554, -17757, -30958, -52083, -36731, -35240, -18400, -13420, -18486, -35500, -112923, -106187, -115583, -69747, -4105, 40474, -8614, -32144, -8883, -6068, -134559, -150595, -34349, -518, -28138, -30228, -32811, -45413, -49045, -54898, -44029, -11843, -44642, 415, 9030, -22358, 21702, 17658, -355, 49559, 78822, 43692]
24467D3692p2047r272N2899J9921Q089p2231K687j3741p116N220K6774K9390n5105
24454d0840k1546L2815N093j610J9749M5596n1377m0413j6714l80L3977L6031
24442C81J1259M3308L7266k9578l3382m0587j3995L2706N1296J456k2710k0450
24430A6970Q958P715L4291K7185k4521m1297l4909m5090R999l1019K0754L2205
24418a8759R082J1577L3118K5591j9711m0735l9418L360K3463p0794p0770O5070
24406h8926R8714K1168O704k4185K8978M8831q622p2884m706N648L0618j1329
24394C0009o7122j545L6863j4224l2802K1503j8440l509m305Q953N2351j6023
24382h291m5945m0634M654J0285P680k8409l0484L4817N3401O0721m8316k5022
$$ y = [43692, -28355, -37627, 15272, 35193, 43282, -28949, -26262, -40003, -47119, -41899, -15125, 14265, -40840, -62386, -29571, -24478, -26088, -6339, 39257, -12120, -52533, -69247, -69627, -35650, 381, 11640, 54948, 92214, 62636, 29254, -11333, -25328, 7378, 58674, 60130, 37420, 16970, 25928, 33643, 67934, 95119, 70598, 29301, -5608, -50698, -40699, -71718, -50964, -18759, -9677, 1900, 35018, 60609, 40898, 163, -39255, -35895, -12432, -83226, -153996, -88926, 9788, 30956, 37660, 13475, 42453, 91284, 82662, 9778, 5072, 10720, 41338, 30009, -37113, -38658, -1795, -16019, -48821, -27318, -45758, -49267, -53572, -44619, 7732, -8291, -54236, -94870, -90216, -79931, -72251, -100660, -131144, -96327, -42926, 17795, -30521, -55543]
24370e5543j5499P1126R342m2127N187K9654o771K5246J7769K7048K6076L3765
24358A25273l5864n8447L477k7639r0274K5750L4523l9099M0575l6657k1111L0510
24346d8983M3456k6439k5106O200k6546r964K1071j0837J8977N66p548j9748j2341
24333i7242k44m9K6959L2151J7648N5475k8951q5290l0361M4140K5141j3711p2426
24320a26760J6934k0140K5557K1542K6543M2319O4187p052P386N3648j6379j03298
24308a5513k1127L1790J6919m5269M145m5628L843M408O5024p736K3253J3774
24296B7883j6491q743m378K6478N108m6371r248m3966n860m3321j6152M1722K289
24283i1050p94L1101L8849m3834L3914J5551j9779j166O822K705k056l438L3023
$$ y = [-55543, -71042, 84, 9426, -32701, -27514, 2140, -4631, 20615, 38384, 65432, 91508, 125273, 89409, 30962, 34439, 6800, -83474, -57724, -23201, -62300, -21725, -58382, -79493, -48983, -5527, -31966, -57072, -50872, -77418, -87382, -66311, -77148, -58171, -57605, -65153, -84901, -97242, -97486, -97535, -70576, -38425, -20777, 34698, 5747, -79543, -109904, -65764, -40623, -54334, -126760, -109826, -129966, -104409, -82867, -56324, -14005, 50182, 43130, 50516, 104164, 87785, -15513, -36640, -4850, 12069, -33200, -29055, -74683, -70840, -66432, -1408, -9144, 14109, 27883, 11392, 2649, -1729, 24749, 29857, -16514, -25762, -69728, -75588, -118909, -135061, -93339, -91050, -91844, -60743, -21894, -65728, -31814, -16263, -36042, -37208, -30386, -27681, -29737, -33175, -152]
24270a52K5066M1280J0838k9721m9280N3009P0352l4112q0482k1136M1195K7301
24258E4158k3720K726N591L0020M1639o8236j01351n0936j514L1679L9767N9277
24246A9100n9202o1857k348O9046M2333N8764O2625p4863j1695k4683n268L0440
24234D2392k1027m5966n875M349R473n236k1789m3929N421M2517K8776l3664N8380
24221A3822L2m1176l1250K1068K5170l0100L1835M0078L239L9036N2456p439j1917
24208A04854p4025q1457q5409N6153N1242L4014l742L8630k6630q1743L5888M8154
24196A5929L2035o1780o4355L1456K0899J6810k7671j6159L1484L188l7276J3024
24184d2416J109l129N0069k6300k2283k2769L9553L3386j1373q9256o429m073
$$ y = [-152, 24914, 66194, 77032, 47311, -1969, 51040, 121392, 87280, 6798, -14338, 26857, 54158, 30438, 33164, 38755, 68775, 110414, 42178, -59173, -110109, -111623, -79944, -40177, 19100, -40102, -101959, -104307, -35261, 7072, 65836, 128461, 53598, 41903, 17220, 11952, 42392, 21365, -24601, -30476, -26127, -16654, -21890, -43679, -87608, -82187, -39670, -10894, -44558, 13822, 13854, -27322, -58572, -37504, -12334, -42434, -10599, 29479, 32718, 71754, 124210, 116771, 104854, 30829, -50628, -136037, -79884, -28642, 5372, 1630, 40260, 13630, -68113, -32225, 15929, 47964, -13816, -78171, -46715, -25816, -9006, -36677, -52836, -21352, -18164, -55440, -42416, -41307, -44436, 5633, -20667, -42950, -65719, -26166, 7220, -4153, -93409, -99838, -103911]
24172a03911k0655M5813K0953N4071L684n0016q051k1318K8460O69K0894L2216
24160B809r810l3744j1180J9762O2526J8427j3195o6556k4350K8291M8095K9747
24148E0822k6480m7809k0103R299N0672K0562j8978m2607j2115J6295M7925k1630
24136E853l4193l0423K8511J796J3472O435k8711n4478Q064L9434J0534k206P216
24123b8696M3610j3911j8896n7242J7211m6462n8790N7876O873K2165l2972l2153
24111a41387N2643k479L6140O0298J0172l8540k0449m347J7507K3764j2216P40
24099a8154l6575J0615j9927k1991J2078k8775Q903M072K2674L239N0705P2664
24087E9528q1647J2723L5418l6119l7653l9663K1339L8935O3662N4187o3381o0016
$$ y = [-103911, -124566, -78753, -57800, -3729, -45, -50061, -58112, -79430, -50970, -50301, -29407, 2809, -7001, -40745, -51925, -32163, 30363, 48790, 35595, -30961, -55311, -27020, 21075, 50822, 24342, -23467, -43570, -34271, 16401, 36963, 17985, -24622, -36737, -20442, 27483, 5853, -28340, -58763, -30252, -28456, -14984, -8549, -37260, -91738, -83674, -44240, -33706, -35912, -28696, 14914, 1003, -17893, -75135, -57924, -104386, -163176, -105300, -98427, -76262, -109234, -141387, -88744, -91223, -55083, 5215, 15387, -23153, -43602, -47949, -30442, -6678, -18894, -18154, -54729, -44114, -64041, -86032, -73954, -102729, -93826, -89754, -67080, -63841, -13136, 59528, -22119, -9396, 26022, -10097, -47750, -87413, -66074, -27139, 36523, 90710, 27329, -32687]
24075c2687J238K1534r017K9194j549J7972j2995K6396O5217q4351p1610P719
24063d2939N5421K4432r6322m1523O7798O789K260m261m6495l5051R6422O3332
24051D9863O1819q507M347l0817n3613J466k2443m876k6933j4730j3481Q876K4427
24038b4602J3848K4196P926k7186l246K0099M2075L4405P304n1043l9977n4098
24026e0299m3970K723N2410J6330q878m4173N7991N0042p0606o3092M78M0232
24014f0812M0857m280N1316M0305p2130k6447O2083N916L0299j3126m9220l1193
24002b6432k2961j7660L3398j6463n5483J9090O1393L2156q733k5622l8073k9357
23990i4747n914J0712J1518O5184m4981k7334k710N0033Q262K7482j9355r7932
$$ y = [-32687, -31449, -9915, -18932, 10262, 8713, 26685, 13690, 40086, 105303, 20952, -50658, -42939, 12482, 36914, -59408, -100931, -33133, -26344, -24084, -28345, -74840, -109891, -13469, 49863, 111682, 103175, 107522, 76705, 23092, 24558, 2115, -2761, -29694, -44424, -57905, -49029, -24602, -10754, 13442, 21368, -5818, -9064, 11035, 53110, 87515, 94819, 43776, 3799, -50299, -94269, -91546, -39136, -22806, -31684, -75857, -17866, 32176, -38430, -101522, -101044, -60812, -19955, -24235, 27081, 67386, -4744, -31191, 30892, 36808, 67107, 53981, 4761, -26432, -49393, -67053, -33655, -50118, -105601, -86511, -25118, 7038, -1695, -27317, -65390, -94747, -100661, -89949, -78431, -13247, -58228, -85562, -88272, -38239, -29977, -2495, -21850, -119782]
23978a19782n2385Q7555M0093l1140k6374M9391L2256q693k5432M7933O1043m372
23966E0093l9010l113J6303j0160p815P091L376k0760O931J7456j568j4070n195
23953d41p165j7783j0538J043P140N7316K0046l0860P295K0386q0063o9682K8901
23940g4405L2903L3383j9627p1326k601K2788L856Q9282m699k0453J7520j3572
23928f951K0327j339k9406L7269j2157k3740m9418J225K1610J1719n9546Q605
23916h1802M4786L8638J9278J88l1367n7032p907L978J6723M560J6868j9714l0276
23903h3079k9309J0722L8843O311j0977m3978n708k4863K7432K7589m489j430
23891i2936L9947K7105J1721m6824M468P1523M5676j8902j2162k3749p6219n8756
$$ y = [-119782, -172167, -84612, -44519, -75659, -102033, -52642, -20386, -29079, -54511, -6578, 54465, 50093, 11083, 7970, 24273, 14113, 6298, 13389, 16765, -3995, 2936, 20392, 18824, 4754, -441, -7606, -25389, -35927, -34884, -27744, 29572, 49618, 18758, 26053, 46439, -33624, -103306, -74405, -41502, -8119, -27746, -99072, -101673, -78885, -75029, 14253, 9554, -10899, 6621, -6951, 13376, 12037, -17369, 19900, 7743, -15997, -65415, -64190, -42580, -30861, -90407, -81802, -37016, 1622, 20900, 21088, -10279, -67311, -75218, -71240, -54517, -49957, -33089, -52803, -83079, -112388, -101666, -62823, -56512, -67489, -111467, -117175, -142038, -114606, -87017, -91506, -92936, -52989, -25884, -14163, -60987, -56519, 15004, 60680, 41778, 29616, 5867, -70352, -129108]
23879a29108K4947K8874L7809Q888r096j9614J1065Q9100K5302m2243j8078o0535
23867e2689O6586l427o6201k3257J3255J4388M715J7873J883J0724K5360L1145
23855D0355j7865j7367J4566q309j1581r708k7401Q816j2366j3656j8083j8149
23843i0748K5953M1799K0061L5284k9189o9378l5994Q2454Q3799l7515j7177L8987
23831D8336J4124j8098l5283l3507k4773n9824K2955P9690J9412J5416J0144R634
23819D8226k7269j6709o890l5333m0202k5682L6999Q1626J9208l1727m498l0518
23807c2769k5387O384l4387k7871L8541N9328k4072R321q53J8304K1879m0023
23795c1605p0548j353J7291J5552M22M0452L2539K4574N2020k6553o6145o8645
$$ y = [-129108, -104161, -75287, -37478, -28590, -37686, -57300, -46235, 42865, 68167, 25924, 7846, -52689, 13897, 10470, -55731, -78988, -65733, -51345, -46630, -28757, -26874, -16150, 9210, 40355, 22490, 5123, 19689, 11380, -201, -9909, -37310, -28494, -40860, -54516, -72599, -90748, -64795, -22996, -2935, 32349, 3160, -66218, -102212, -19758, 64041, 26526, 9349, 48336, 62460, 44362, 9079, -24428, -49201, -109025, -86070, -6380, 13032, 28448, 38592, 48226, 20957, 4248, -2642, -37975, -78177, -103859, -66860, 14766, 33974, 2247, -2251, -32769, -58156, -51772, -86159, -114030, -75489, -16161, -40233, -30912, -31765, -13461, 8418, -31605, -102153, -103506, -86215, -70663, -70241, -29789, 2750, 27324, 79344, 52791, -13354, -81999]
23783h1999J3969j5727l2072n6913j6739J2696Q953M7104N7694O0005L007l3885
23771c3907M8815K1429J968J4937l8869l6028n563p943o0816k076L4876N534k0909
23758g8552J1380o865J453K480j8836p489m5825k6442K2247O9363P1104J1899
23746E917m7291j8907m1927L4603R095M8340K1770l8172O007l0649j2667m5577
23734a09458R519J0942M9844P0547K7232P292l1292p7165K5940K3319j2138n9710
23722f5128l8137k8242K6198K0452K6386l0951j3113K4880r941J3090L2597K6863
23710a5046l0495j4656j0228M4903l1837K9457K6168m591J612l8924J7853j0283
23698c6067J2948j5975l4139N6065K2818n963M4208j5226k8830L9264K5267j0543
$$ y = [-81999, -68030, -83757, -115829, -172742, -189481, -176785, -167832, -120728, -63034, -3029, -22, -33907, 14908, 36337, 38305, 53242, 14373, -21655, -27218, -35161, -95977, -98053, -63177, -57643, -78552, -67172, -74037, -72584, -70104, -88940, -96429, -142254, -168696, -146449, -77086, -5982, 5917, -41374, -60281, -102208, -67605, -58510, -10170, 11600, -26572, -20565, -51214, -63881, -109458, -99939, -88997, -39153, 31394, 58626, 65918, 34626, -42539, -16599, 6720, -5418, -65128, -103265, -131507, -105309, -84857, -58471, -89422, -102535, -77655, -87596, -74506, -41909, -15046, -45541, -60197, -70425, -25522, -57359, -27902, -1734, -6325, -4713, -43637, -25784, -36067, -23119, -39094, -73233, -17168, 5650, -313, 43895, 28669, -161, 39103, 64370, 53827]
23686E3827K2153j6627n3269n1927q3637l067N2847J1011j8799J7126K7442N0333
23674G413j3428n0350l6089M070L4564l140q3140K895R8611O3693R004N19n9171
23661b4549k7612L2996j4324l1610k735K605L988K4797L9141L9951P319O309l9073
23648A7203j1217J0652p3356k950q666K6297J7326m7787m137R636M0695k6417
23636e2721l5639P26K3194j805K7172Q23P103K9472K4988K0698k6438L3332m910
23623D5995m2507K8529l0700m8842k593L2873M1605M2691m6640k0561K4479K0254
23611D4583K6438o702K4918J8718q399m9489o5002q039P8158N764r7887j7822
23599e4761J4839N3030N7765M2167n0602j10697p869M8335j6017k1346j38n4269
$$ y = [53827, 75980, 59353, 6084, -45843, -129480, -132547, -79700, -68689, -87488, -70362, -42920, 7413, -6015, -56365, -92454, -88384, -53820, -56960, -140100, -137205, -38594, 25099, 34103, 34622, -24549, -52161, -19165, -33489, -65099, -67834, -65229, -61241, -36444, 2697, 42648, 49967, 56276, 17203, 5986, 16638, -56718, -59668, -68334, -42037, -24711, -72498, -76635, -66999, -26304, -52721, -88360, -87634, -64440, -66245, -39073, -38250, -31147, -1675, 23313, 44011, 17573, 50905, 45995, 3488, 32017, 1317, -47525, -50118, -17245, 24360, 67051, 20411, -150, 24329, 44583, 71021, 64319, 89237, 107955, 99556, 50067, -14935, -22974, 55184, 60948, -36939, -54761, -39922, 13108, 70873, 113040, 62438, -48259, -56128, -7793, -23810, -45156, -45294, -99563]
23587i9563j1478j7035M1693M4463L5316M008l8854m1639l272L2166K3445K1833
23575h917M289j795o8002n4952N6739J17038J2148r2741R05K0262k0992N121K3296
23562g601n3574l8717j9738R884r286N8970P8286J6769m963p649j7126N9932o4401
23549G86n9865M7166P2810J5614p975p1619p7207J6784j867l9560K3168J17409
23537C5644L4909k7571q6962J0972O3165N122m801N434j2682k3731M010m7628
23525d4119n9871k7923K0041K9798P7345O4185K5316j9234l8710p2233n5278m2906
23513a43589R5425O3875O0697k6771k6164n4326K5974J327q848N938m4208k5123
23501g5793m978M0853j9040J4860k8012j0403m7476n7740N1182P8358k5210o3428
$$ y = [-99563, -111041, -128076, -86383, -41920, -6604, -2596, -41450, -83089, -86361, -54195, -30750, -8917, -4628, -6423, -74425, -129377, -72638, 44400, 56548, -36193, -35288, -15026, -36018, -30897, -7601, -61175, -99892, -119630, -109746, -119032, -60062, 18224, 34993, 30030, 22381, 5255, 65187, 786, -59079, -11913, 60897, 76511, 68536, -3083, -80290, -63506, -65373, -104933, -81765, 35644, 70553, 42982, -43980, -33008, 30157, 35279, 30478, 35912, 23230, -501, 3509, -44119, -103990, -131913, -111872, -82074, -4729, 59456, 84772, 65538, 26828, -45405, -100683, -143589, -48164, 15711, 76408, 49637, 23473, -30853, -4879, -3552, -12400, -6462, -50670, -75793, -80771, -39918, -58958, -44098, -72110, -82513, -129989, -187729, -136547, -58189, -83399, -146827]
23489a46827M3989J9711K7309K2055L7274J9620j0320n6851j9845J6331O1500
23478A3946O591K9090J8669p2286Q749J3062L3103K6775l4513k6860L3191o973
23466D2544m492k6642m7119M764l7543J2306M3680K2262n7548n0569L385P482
23454h7490r822L285N8808L0013l1030p35n1914O670L0681j1547M8421M4281k0923
23441H698j1319K884M8885K1474n1805m7629k486M602Q853P886j9439j5331J9901
23428b4826M5227q714l2343j6504j4630j3764L0921K808j4956N262Q8617O7481
23416A14579J1599l7834l9083k8972k4207M6703k0921R704M2630j2520o0076q0996
23404g9394O052M377Q192k2508K579j6825O492P9033K0837j9837k8237L4276O1093
$$ y = [-146827, -102838, -83127, -55818, -33763, 3511, 23131, 12811, -44040, -63885, -47554, 13946, 20537, 49627, 68296, -3990, 4759, 17821, 50924, 77699, 43186, 16326, 49517, 42544, 38052, 11410, -35709, -30945, -68488, -56182, -12502, 9760, -47788, -98357, -94972, -87490, -97312, -94027, -35219, -5206, -36236, -36971, -88885, -82215, -51534, -63081, -14660, 29621, 8698, -2621, 263, 49148, 70622, 18817, -28812, -31298, -26696, -17843, -9957, -29396, -44727, -24826, 20401, 11687, -20656, -37160, -51790, -65554, -34633, -31825, -46781, -41519, 47098, 114579, 126178, 88344, 49261, 20289, -3918, 42785, 21864, 31568, 74198, 61678, 1602, -79394, -73342, -68965, -60773, -83281, -80702, -97527, -91035, -12002, 8835, -11002, -39239, -4963, 56130]
23391E6130o369k2027L5084K3821L4177m2594o3960j4061j1193m3256m3130J01317
23379C939M1693p471j413J9904j3799P182j4754N3152L0266m0882n4983j5942
23367F892m599K8417K397o3716n3163j3382J4012M1934K0203l1190l0832L876
23355g9151J6896R0088m9947p6744N8763K0451k7126L6485O225J877N4530o579
23343D5768M0279k7204m9565K2209k6603R329M9659J8215j3405J2064M4850k0201
23331A05395o8324N399k6067j01583L542P2113N4121O5720k6811p0200n4125R383
23319c1437J8404m1521N915K3607K9285l5677m3696j8098M6551K6317r569N4619
23307B4700j3196l6559j8291r347O224O25J080M9515L9615l7724l3495R525K4306
$$ y = [56130, 49761, 27734, 62818, 86639, 120816, 78222, 14262, 201, -10992, -54248, -97378, 3939, 45632, 38161, 36748, 56652, 42853, 50035, 35281, 88433, 118699, 77817, 22834, 6892, 2293, 30710, 33107, -30609, -83772, -97154, -83142, -41208, -21005, -52195, -83027, -79151, -62255, 27833, -22114, -98858, -40095, -19644, -46770, -10285, -4060, -2183, 52347, 45768, 86047, 58843, 9278, 31487, 4884, 14213, 63872, 82087, 68682, 80746, 125596, 105395, 37071, 42470, 16403, -85180, -81638, -9525, 44596, 110316, 83505, 13305, -40820, -31437, -13033, -54554, -48639, -25032, 4253, -31424, -75120, -93218, -46667, -20350, -29919, 24700, 11504, -25055, -43346, -52693, -46469, -45844, -44764, 4751, 44366, 6642, -26853, -17328, 6978]
23294F978l8156L4482r025o882j0189o0802l5758O6196L0374L1257K8760L734
23282D0969K7629K58k9345l6428m2467j0069M726Q229L1712L1570k4325L8789
23270D1248r615M3K7538j5286l1215l151l8326J2331L9251k2796o8655M3388K2726
23257b519L9579M2024k1844l7148K5592j0386l7743k6734J0129Q602o17N8094
23245D7029L4579n3786M2260j8339l2733k5672R428K3757j7133p1665k877J4819
23233e0333L6312L7621L7187l9526o8238L421K0616K704k2353k1619L6489K6571
23221a148k79p078m4724l9553J234N0690N8526o9342o7082J4505j3546N4167M8972
23208a4658J7552L2017K2911R233q5464o1399J3800L0458k4745O1192Q3037L1823
$$ y = [6978, -31178, 3304, -5721, -12603, -22792, -83594, -119352, -53156, -22782, 8475, 37235, 40969, 68598, 68856, 39511, 3083, -39384, -49453, -44727, -36498, -4786, 26784, 2459, 41248, 31633, 31676, 59214, 43928, 12713, 9562, -28764, -16433, 22818, 22, -68633, -25245, -2519, 37060, 79084, 57240, 20092, 45684, 35298, -2445, -29179, -19050, -10448, -11065, 47029, 81608, 27822, 70082, 51743, 19010, -6662, 2766, 26523, 9390, -62275, -65152, -50333, -14021, 23600, 60787, 21261, -46977, -43556, -22940, -20236, -42589, -64208, -27719, -1148, -1427, -8505, -53229, -92782, -91548, -40858, 17668, -51674, -118756, -104251, -117797, -63630, -14658, 2894, 34911, 57822, 67055, -18409, -79808, -66008, -35550, -60295, 897, 83934, 115757]
23196A15757j2941k7986l5790l2754M5385j9909m7453l3019K3480p988j6318j4904
23184f4440K3173O2353K3594m2119o4994m0283O266r278K8059J4221l2120j2808
23172a08376j0842n4586j431Q8000M4916P531m0649Q190J5601K1655L4643J4306
23160A8958m6403l1057r091P918P2689M5169k4380n4205l3689k6839m6552L8986
23148h8496K6616k4451q579M4457M8659J5955p6974k1452K8233r722p836N546
23136f8044M8799j3460k9908r973l5138K9508N5002J036r884k6330l8393j1659
23124a08444j6968P418N1623O3070N9930N6139m4721j6815P235o366O602k0314
23112C8389j2277J481K0093l5236O362Q159l7468l531J6122K0136R636j2927n6262
$$ y = [115757, 102816, 74830, 39040, 6286, 51671, 31762, -15691, -48710, -25230, -33218, -49536, -64440, -41267, 21086, 44680, 2561, -62433, -102716, -96450, -105728, -77669, -63448, -95568, -108376, -119218, -173804, -175235, -87235, -42319, -34788, -75437, -67247, -51646, -29991, 4652, 18958, -27445, -58502, -67593, -59675, 13014, 58183, 33803, -20402, -54091, -80930, -127482, -88496, -61880, -86331, -94910, -50453, -1794, 14161, -62813, -84265, -56032, -65754, -73590, -68044, -19245, -32705, -62613, -72586, -107724, -78216, -23214, -22178, -32062, -58392, -96785, -108444, -125412, -117994, -66371, -3301, 56629, 112768, 68047, 51232, 58467, 52101, 58703, 38389, 26112, 27593, 47686, 12450, 18812, 26971, -10497, -14028, 2094, 22230, 31866, 18939, -37323]
23099c7323l0490J2904Q4212J6202K6461k7632q6054M610j8460O0574P4444n2935
23087B6513k4580l9282j0578J3595M435O3985K1533M0371p3494j00097j759M9243
23075c0115L5881l5013l5634j4700j3231M6754K4539P7779n9873j3065K1724l2695
23063b7649j3180K7934J5196J415m9500p6540L4912M4562Q3032L1292l1704J0114
23051D9884j630L4668k7329l8268k5504o5535q32O2639N2297k2776l4510K9598
23039A2702Q6806r386r2891n4697n9812M874M2933Q491M352J2274K9698K2650
23027G994o263K3780Q4794M662o2705l6387l4716m0237l298P9649K116q0554l5175
23014i6340N9588N4500J5869o6826Q851o239j6420P507N9807R4148j6211j7789
$$ y = [-37323, -67813, -54909, 29303, 45505, 71966, 44334, -41720, -37110, -55570, 5004, 79448, 26513, 1933, -37349, -47927, -34332, -29897, 34088, 55621, 95992, 22498, -77599, -79358, -30115, 5766, -29247, -64881, -79581, -92812, -46058, -21519, 56260, -3613, -16678, 5046, -27649, -40829, -12895, 2301, 3716, -45784, -122324, -87412, -42850, 40182, 71474, 39770, 49884, 48254, 82922, 55593, 17325, -8179, -73714, -74546, -11907, 40390, 17614, -16896, 12702, 99508, 90122, -2769, -57466, -117278, -112404, -69471, -60980, -56628, -44354, -14656, 7994, 1731, 25511, 110305, 114967, 52262, 15875, -18841, -59078, -62376, 17273, 19389, -61165, -96340, -36752, 17748, 33617, -33209, -24358, -30597, -47017, -39510, 20297, 114445, 98234, 80445]
23002H0445K33k8774j9948N813k6381p1968P614M8923k024o826j6934l1915m0181
22989a01923K0596P5905O595p3039o0488N1361K1330L5975j3202P895K0043j6486
22977b5438M889L9318l3606K5888L173m974M945J9278m2987J4283J0081k7859
22965a3009j1139K2110p495Q517L177O78J1511l6196n5620l4980o1395l624O4251
22952a13214K4156K9462O7334Q0869Q549m3063k5289j0024r064j4590j3170p1919
22940h9963J1345j670j6132K6124J4770j92K1949J3849m685o5537K7207L3217
22928b9718L4771J8204K0366n5746N3908O322r919m2341O8996K3120J2319K335
22916A02617J1026o0441k9728K7669k5284l9372j7752L8610L1215K5605j8286
$$ y = [80445, 80678, 51904, 31956, 37769, 11388, -60580, -52966, -4043, -6067, -12893, -29827, -61742, -101923, -81327, -5422, 1173, -71866, -132354, -80993, -59663, -23688, -36890, -28995, -8952, -25438, -20549, 18769, -14837, 11051, 14224, 9250, 14195, 33473, -9514, 4769, 14850, -13009, -24148, -2038, -9533, -1016, 2161, 2839, 14350, -21846, -77466, -112446, -173841, -177465, -113214, -89058, -59596, 7738, 88607, 97156, 54093, 28804, 18780, 9716, -4874, -18044, -89963, -78618, -80288, -96420, -70296, -55526, -55718, -33769, -19920, -24605, -90142, -62935, -29718, 5053, 23257, 43623, -12123, 41785, 48107, 38188, -4153, 64843, 87963, 100282, 102617, 113643, 53202, 23474, 51143, 25859, -13513, -31265, 7345, 38560, 64165, 45879]
22905D5879K1660r79p9703j55K5096K3688J4784j5677m4352p7670L1714j1329
22893f7044R124M1336J617j3954j1125K8230K0125J3745J5549j492n1558q3110
22881i8557K4456N2665j2963J655j0810K2440J6896m5081j5489k529N7066Q2878
22869G2627l387l3923N4232l4305m0502k6404K259K3011J8295M5939P688n3111
22857C2419m8996J7740p935n823K2366L2975j002K9559n398J0403m6608o0284
22845c0584r64m43m8890K1276l475J6365K3187L984j9588k362M5638m67k7376
22832b3699L6372K778L512K3919L8543J5082j2172k9651j9604q422o280J5612
22820C5990M7115L4419o7987k3658J0440j6136J1406l82p5M4726j0689p3512o9204
$$ y = [45879, 67539, 66560, -13143, -13298, 11798, 35486, 50270, 34593, -9759, -87429, -55715, -67044, -57920, -16584, -14967, -28921, -40046, -11816, 8309, 22054, 37603, 36111, -15447, -98557, -74101, -21436, -34399, -32744, -43554, -21114, -4218, -49299, -64788, -67317, -10251, 72627, 69240, 35317, 89549, 55244, 14742, -11662, -9403, 13608, 31903, 77842, 85530, 32419, -16577, 1163, -6772, -12595, 9771, 42746, 41744, 71303, 65905, 76308, 29700, -30584, -31548, -31991, -80881, -59605, -63080, -46715, -23528, -19544, -39132, -41494, 4144, 3677, -23699, 12673, 15451, 18963, 42882, 81425, 96507, 84335, 54684, 35080, 26658, 20378, 35990, 83105, 117524, 49537, 25879, 36319, 20183, 31589, 31207, 31132, 75858, 65169, -8343, -77547]
22807g7547j8552m93O1336L3193l6456j15958k5528N2178K8306N3826P0192J9350
22795D3847k7963n3336o389k0104M280K007K1595M3954R390p995q069P888j028
22782H077J9508m1488j4342n161J4872J0180K1590j8989J2562L6216l3228P338
22770A7135M710L244k7398J134N6467j3283K0504J6591j2266m002l0819q257q043
22757A5717J7951n878l6441n5263l5631M8652P2662L0694J6682n8914n4408p697
22745e1874p444P4084K3172n1946k7546N8580Q9387m12m7160r3295J6810L9419
22733B1775K6554L1699R233l1648l1625l3062j8598J1798K0554m2448k9508J1203
22721e4073K4274K4528k1647j9930K2809k0466j0739L0504M9420r646o7423m7622
$$ y = [-77547, -96099, -96592, -35256, -2063, -38519, -154477, -180005, -127827, -99521, -45695, 24497, 43847, 15884, -37452, -43841, -63945, -59665, -57658, -36063, 7891, 17281, 9286, 1217, 9105, 8077, 27585, -13903, -28245, -33406, -18534, -8354, 13236, -5753, 6809, 43025, 9797, 17135, 21845, 25089, -2309, -1175, 55292, 42009, 62513, 79104, 66838, 62836, 32017, 23760, 15717, 33668, 27790, -8651, -63914, -99545, -50893, 21769, 52463, 69145, 10231, -44177, -51874, -59318, 14766, 37938, -14008, -41554, 17026, 106413, 106001, 58841, -34454, -17644, 21775, 48329, 80028, 89261, 57613, 25988, -7074, -25672, -13874, 6680, -35768, -65276, -54073, -29799, -5271, -26918, -46848, -24039, -44505, -55244, -24740, 24680, 15034, -52389, -100011]
22709a00011q988K2736M7263M2837N015l8804m0543m790M3374N7136M389k8900
22697G14j9991Q316L2964j3678J823m909O693o8245m5199N531K3847K5368L931
22684d2835j4359l9407R1219P9549L6493p0668k8009R0573J0413o3701p2825O6648
22672D3091K478n5270m0794o895n1894l097K6386o931o469M1567P5000N8827P607
22659H3606L168j3086q8610k3674p102r048N9259L9783k8489l2432J6006J1372
22647A0753l6868l9760Q159O0740L7484j6892m7160k7875j2758N3480L8524k2038
22635E789R387j15k2984L694K6408J6799K2593m9134l803O07n5998O4819K8530
22622D6592o060l9161l4765m0957L0984P4146j5287l0042M8520l3765n4178P016
$$ y = [-100011, -108999, -86263, -39000, 3837, 8852, -29952, -70495, -75285, -31911, 25225, 29614, 714, -19277, -10961, 22003, 8325, 10148, 5239, 11932, -56313, -101512, -95981, -72134, -46766, -42835, -57194, -96601, -5382, 74167, 110660, 39992, 11983, 102556, 112969, 49268, -23557, 43091, 45569, -9701, -50495, -57390, -109284, -112381, -85995, -92926, -99395, -57828, 17172, 75999, 83606, 86774, 73688, -14922, -38596, -45698, -54746, 4513, 44296, 15807, -16625, -619, 10753, -26115, -65875, -57716, 3024, 40508, 23616, -23544, -51419, -64177, -10697, 27827, 5789, 15176, 15061, -7923, -4229, 22179, 38978, 61571, 12437, 8634, 9241, -46757, 18062, 46592, 40532, 1371, -33394, -74351, -43367, 30779, 15492, -14550, 33970, 205, -53973, -46957]
22610d6957K9510p291K9994J022m9954j0031J665J6489N4295O9365l304k0924
22598F3879l4793j336O3017M8340k174l9092n3685o6715o4933J9294K9507k3787
22586f2478P004M9562R261O0308K9047l2392l1549o0412q246L0760R578M2263
22574D2706J7015K813P448j1314j2857M976L1441j7329m9517j8491J8316n0687
22562c5480k3284L1809K3777J0845j6995n691J0103q651j0112l6098n643J2152
22550e3268J9323M8090K3840n9837n2553K4059M20m503M8367M8314N7547j2516
22538H7283n9514k8439K2378r32j9244K1546J0380j4816j4860l0684m5592j8456
22526i0950N9534J2787M7172O7049K7905J11969J21053Q3554P5223P6411L8465
$$ y = [-46957, -17447, -24738, 5256, 6278, -43676, -53707, -52042, -35553, 18742, 88107, 84803, 63879, 29086, 27750, 90767, 139107, 136933, 97841, 44156, -22559, -87492, -68198, -38691, -62478, -55474, -5912, 3349, 63657, 92704, 60312, 28763, -31649, -39895, -9135, 443, 42706, 59721, 62534, 69982, 58668, 45811, 50787, 82228, 64899, 15382, -3109, 15207, -35480, -58764, -26955, -3178, 7667, -9328, -15019, -4916, -13567, -23679, -59777, -65420, -53268, -33945, 14145, 37985, -21852, -74405, -50346, -49926, -54429, -6062, 42252, 99799, 87283, 27769, -670, 21708, 20776, 1532, 23078, 33458, 18642, 3782, -26902, -72494, -90950, -31416, -18629, 28543, 95592, 123497, 235466, 356519, 440073, 515296, 591707, 630172]
22515F30172P9329J4599p9078j34328j11690j25423q8722m1394o8125p6109R93
22504B24J10944J38587k5182q5147r3345j1391L6256l8582K9432o7394n2665O6144
22492G881N5563j0622k682l1928J8327K3569K7296p145k9867m079k4842l7672
22480a6201j099O5917N5932j7547k1458j4849N655m0934j5337n008l1093k2116
22468e8138L7916J2844p178J3205l7537k0710Q4276m105K1514j408m3205n5790
22456e8316M8679O8465J533l3546k6758n8094L438K2539N4407N944o589Q1437
22444A03139J394l8165J9658K3219K0450K555O519M5199o259k1324o9790r0893
22432d298o1217O1920M8899N411k2825M8894J3943l8049n0695m4201N578M1504
$$ y = [630172, 709501, 724100, 645022, 510694, 399004, 273581, 184859, 143465, 75340, -769, 224, 111168, 249755, 224573, 139426, 46081, 34690, 70946, 32364, 61796, -5598, -58263, 7881, 63444, 52822, 50140, 18212, 36539, 60108, 87404, 80259, 50392, 46313, 21471, -16201, -17300, 48617, 104549, 87002, 65544, 50695, 56350, 15416, 79, -4929, -36022, -58138, -20222, -7378, -14556, -1351, -38888, -59598, 24678, 20573, 42087, 40679, -2526, -58316, -9637, 58828, 60361, 26815, 57, -58037, -54599, -32060, 22347, 28291, 21702, 103139, 104533, 66368, 86026, 109245, 129695, 132250, 138769, 183968, 177709, 156385, 86595, -4298, -65515, -3595, 45304, 50715, 27890, 76784, 90727, 52678, 1983, -42218, -36640, 4864]
22420D864k791M4440k1462l8763P326P332N709J3071K2543q615J8816N1644N887
22407A10001K0885p1333l3160k4243J2803K9467K3326k5985m4614J3387n101M5029
22395E0462K6122m1705Q67J5287m8905j6239P7791K111l6665n5268o2635L0481
22383e8296L0725M3105K8471k3157M907k9536Q519J733k0051Q21k5096J3230M2830
22370A8205o7873m7780L5572M6050J9680L3166K9513j5886o1604l3606J3377L3673
22358B487j0686m0318q166K1130J1346m1174L2248K6771J2975J0250M5941J6948
22346G9752k1474j4941n260K7647m7507j1100L7745q179k3601J7518M3764j8335
22334E6029m0200K3717n1929j0688J03629L1071n1386j04168l4007P061P3429
$$ y = [4864, 2073, 46513, 25051, -13712, -6386, 946, 6655, 19726, 42269, 33654, 52470, 104114, 110001, 130886, 59553, 26393, 2150, 14953, 44420, 67746, 41761, -2853, 10534, 5433, 50462, 76584, 34879, 35746, 51033, 2128, -14111, 63680, 65791, 29126, -26142, -88777, -58296, -27571, 15534, 44005, 20848, 25755, -3781, 4738, 6471, -13580, -12759, -37855, -24625, 18205, -49668, -97448, -61876, -15826, 3854, 37020, 66533, 50647, -10957, -44563, -31186, 2487, -8199, -48517, -56683, -35553, -24207, -65381, -33133, -6362, 6613, 16863, 62804, 79752, 58278, 43337, 38077, 65724, 18217, 7117, 44862, 36683, 13082, 30600, 74364, 56029, 15829, 39546, -12383, -23071, 80558, 111629, 60243, -43925, -77932, -70871, 2558]
22323B558o4m7364K0686J5494K4703k0382l5662j4677M553J1249K5023l7910j1214
22310f3007p251n169L3796m5491N6188K157l3168n2501J1367M310j6640K5401
22298i0008M4152L2449K4342j94j0406j5879L2812n229m3085q0942j1690j9799
22286a43477J0794J4027L2017K7525j5748m2562J7982O9272l6781O4289K1903
22275A9241L9212q805N209j3796o1516j4363O2153k825m8631J9303K0455J8087
22263C3724J4917n7711J5520Q8758N3316k0648l3886k7086o5367r542Q859o210
22251e356M9146Q3833k1387l4205L8702J3649j3138j1082p160l002k2852n7740
22239I408n4777L8888P0362M351m78n203k5289m0775m2159j9871N3041P072l9046
$$ y = [2558, 2494, -44870, -24184, -8690, 16013, -4369, -40031, -54708, -50155, -38906, -13883, -51793, -63007, -70258, -75427, -41631, -87122, -30934, -28777, -61945, -114446, -103079, -98769, -115409, -90008, -45856, -13407, 10935, 10741, 335, -15544, 17268, 12039, -31046, -111988, -123678, -143477, -132683, -118656, -86639, -59114, -74862, -117424, -99442, -30170, -66951, -2662, 19241, 58453, 49648, 54857, 41061, -20455, -34818, 27335, 24510, -24121, -4818, 15637, 33724, 48641, -9070, 6450, 95208, 148524, 127876, 93990, 66904, 1537, -8005, 854, -5356, 43790, 127623, 106236, 72031, 110733, 124382, 111244, 100162, 93002, 90000, 67148, 9408, -45369, -6481, 63881, 68232, 67754, 62551, 37262, -3513, -45672, -65543, -12502, -5430, -44476]
22226d4476k8904N1116O4210Q393n117q41J3842Q295L843l0519p302J3739l7124
22213I155K7931K9390l5319m192p138J1776r895j9857k9392K6791M8621J5057
22201F2928l3848m8382L699k8364L725N6225O3885K8764K3712n0506J9943J8760
22189A20541m1877k1062M7847J80p632K3620l9848j7988K3752J9290o0457K4389
22177G0755N1424N360k8936n8454j8418k0017K011O512K208O416J1341o97J1726
22164D1231j5786k4126r895o530j2529l425m0064K6613j4921L6343O9305q504
22152C7712j0998K8293P467o1844k1853O5039k1306o7435L2790K2724k5280l1573
22140d6264L0895q381k9702r279K2095J1783j1155M28l161J7883L0745K6471M0363
$$ y = [-44476, -73380, -22264, 41946, 50339, 45222, 44381, 58223, 66518, 70361, 39842, 32540, 46279, 9155, 37086, 66476, 31157, 26965, 19827, 31603, 21708, 1851, -27541, -750, 47871, 62928, 29080, -19302, -15603, -43967, -40242, 15983, 79868, 108632, 132344, 81838, 101781, 120541, 78664, 57602, 105449, 105629, 97997, 121617, 81769, 63781, 87533, 106823, 46366, 70755, 122179, 127539, 98603, 40149, 21731, 1714, 3725, 10237, 12445, 18861, 30202, 29505, 41231, 25445, 1319, -8576, -15106, -27635, -31060, -71124, -44511, -59432, -23089, 46216, 37712, 26714, 55007, 62474, 630, -21223, 43816, 22510, -44925, -12135, 10589, -14691, -46264, -15369, -23750, -53452, -62731, -40636, -28853, -40008, -39580, -42741, -24858, 5887, 32358, 72721]
22127G2721J5517L7514m7347m6664m4680J8777J6607L2821j1329o6249j8871J9313
22115b1870J7715k4915R5846J7168q9798k5582L2779J8167j3900K985J1628J2151
22103C2374L3476J674j7484n02j0209J4558J6718K200K307J3077l0283l239m380
22090E0287O7948L6305k7998K4066K350m861L0004k0074q5264j05947l768K1451
22078a5501M9350N8128K0132m5978n3349j3229R531M274j7415K7304L1698R701
22066F4646M430o1123L1364K1655p9697J257M6799l8260K0988M9131k5428k9214
22054F548L1710k55k2829k973J7480j6842M002M3167R421l807k3019M047M0411
22041H7061j7851J7830P4703m8570m6774n2403o388o0917J3694L1143J2076l340
$$ y = [72721, 88238, 125752, 78405, 31741, -12939, 5838, 22445, 55266, 43937, -22312, -41183, -21870, -4155, -29070, 66776, 83944, -5854, -31436, 1343, 19510, 5610, 8595, 20223, 32374, 65850, 67524, 50040, 49538, 39329, 53887, 70605, 72805, 75112, 88189, 57906, 54667, 50287, 118235, 154540, 126542, 150608, 152958, 148097, 178101, 158027, 72763, -33184, -36952, -15501, 33849, 91977, 112109, 66131, 12782, -447, 9084, 13358, -4057, 23247, 54945, 64646, 69076, 7953, 39317, 60972, -18725, -17468, 29331, -8929, 12059, 61190, 35762, 6548, 38258, 38003, 15174, 12201, 29681, 12839, 16841, 60008, 69429, 65622, 42603, 46650, 87061, 69210, 87040, 161743, 113173, 66399, 13996, 7608, -53309, -39615, -8472, 3604, 264]
22029B64Q493k1947M4175j7930j0566L1880J2636J3517j9535n4992k2615J5239
22017b1381J0750k0832J9638J8901n6779k1123Q835O2478o87L5461P594J1804
22005E4659K2377K5755N5004O2379l9983p5225J4806k4420p0109j8384j6599j2852
21993b2592J8553l7599K401M4397J3745m799K4236q804N4989Q690o047L065j7696
21980G2539k1487l9869M0493P2529l6147o8589k3M5261j0177j03916k3530R4791
21968B1875N2017j4462k1841K1933k2199j6459M5481L8704r626K733K0705k4399
21956I4462o8385R478O1506k3181l2003J4121L0494r388j4927p0128M006K4856
21944B0911J6907J598K2293J2086n2382O482K2906O8621l5656m9801l374J4345
$$ y = [264, 8757, -13190, 30985, 13055, 2489, 34369, 47005, 60522, 40987, -14005, -36620, -21381, -10631, -31463, -11825, 7076, -49703, -70826, -61991, 487, -200, 35261, 42855, 54659, 77036, 102791, 157795, 220174, 180191, 104966, 119772, 95352, 25243, 6859, -9740, -22592, -4039, -41638, -39237, 5160, 18905, 14106, 38342, 29538, 84527, 93217, 87170, 90235, 72539, 51052, 11183, 51676, 124205, 88058, 19469, 19446, 64707, 54530, -49386, -72916, 21875, 73892, 59430, 37589, 59522, 37323, 20864, 66345, 105049, 95423, 98156, 118861, 94462, 26077, 35555, 97061, 73880, 41877, 55998, 86492, 77104, 62177, -7951, -3945, 20911, 37818, 39416, 61709, 73795, 21413, 27895, 50801, 119422, 83766, 33965, 30591, 44936]
21932D4936N3170m411J6568l6715n8326J8527K8931K2454J6261l8564M6470m123
21920A05178j8751L171n9495J458O519j5325l2085o0055J5209K8218N5745J212
21908C0999n4811L7078L7552j9625l3018k7666p842J1203O3025J9025L959L2541
21896I2420K5883m03o3425o6483J8787M3087j9650k686J0968j8295m5753n896
21884c1446M5888k3599K5573M540M9697j268m3508Q410r216M975m1978m1948R161
21871d4719J2561N3022j2765k821M6205K1384J3470l3916l3509O7850P767l075
21859I1454J3480M9429R023J3695N7925l6717r9570r0725l4708o034P0935K1324
21847E9511j8744m6979J1498M5358M881L7366K7923m7721j1958J4111j8031L4083
$$ y = [44936, 98106, 93695, 110263, 73548, 15222, 33749, 62680, 85134, 101395, 62831, 109301, 105178, 86427, 89598, 30103, 31561, 38080, 22755, -9330, -69385, -54176, -25958, 29787, 30999, -23812, 13266, 50818, 31193, -1825, -29491, -37333, -26130, 36895, 55920, 59879, 92420, 118303, 117900, 54475, -12008, 6779, 49866, 30216, 27530, 38498, 20203, -25550, -31446, 14442, -9157, 16416, 20956, 70653, 69385, 25877, 34287, 25071, 30046, -11932, -53880, -44719, -32158, 20864, 8099, 5278, 51483, 72867, 86337, 52421, 18912, 86762, 94529, 91454, 104934, 154363, 163386, 177081, 235006, 198289, 98719, 7994, -26714, -32748, 38187, 59511, 40767, -6212, 5286, 50644, 55525, 92891, 120814, 73093, 61135, 75246, 57215, 91298]
21835I1298L2907l3269j4505N0957L4311K850k1494l8839j5607j0599O777L1651
21823A16438l9176m1275l8898l5166R098R9789M7569q4841l1026J00290L261J785
21811A07848M1466K768q3530J6050R1869J5212j8443j5214p060K4619M894n923
21799A74556k2519k8482L5254m1546J3153n905k6080k0641L9257M4571j9199m7911
21787I4508l4244L536J0410J8802J8884L7383K386j9010r059O7031k8205k0395
21775A42027J4701j9714J5709m8848m640K4173J7478M7126o7247L4784N2537N2363
21763B60449l1369L2351K7496j7852N2791J09068J19235J82099J95691J94961
21753A124920J28641J15828Q9327J1865n3017j63137k40648j66228r1793n4768
$$ y = [91298, 124205, 90936, 76431, 127388, 161699, 164549, 143055, 104216, 88609, 78010, 84787, 116438, 77262, 35987, -2911, -38077, -28979, 70810, 118379, 33538, 2512, 102802, 106063, 107848, 149314, 152082, 68552, 84602, 176471, 191683, 173240, 158026, 150966, 175585, 180479, 174556, 152037, 123555, 158809, 117263, 130416, 124511, 98431, 77790, 117047, 161618, 142419, 94508, 60264, 63800, 74210, 93012, 111896, 149279, 151665, 132655, 123596, 190627, 162422, 142027, 156728, 137014, 152723, 103875, 99235, 123408, 140886, 188012, 120765, 155549, 208086, 260449, 229080, 261431, 288927, 271075, 323866, 432934, 552169, 734268, 929959, 1124920, 1253561, 1369389, 1458716, 1470581, 1417564, 1254427, 1013779, 847551, 755758, 700990]
21743G00990m520L8562l2776J7490P5459J49921K16576K12687J26206L9691n65
21732A539721m6942j57054j87299j90548k41127j47875r4338r2304l722P511q8720
21721B97303n2636K1641P4560J496J8145k3853m0021k028k9556m0024o9790n1076
21709A04161O7273K2257L3836k1309l2371K1678K5089j5945m5149p604O4117P192
21697B23225J0814j6203n6000j6226J5250m0517p6132J4201N559K9223O4539n9215
21685I8518j4499K4012L4055O7024o6461o1682O684M4759K4591r908l9070J6804
21673A24827K5855K5063Q131o6735k6795M806q403j5216P104K0743M1514m8497
21661I2397q385k17N5701l6394j2695J7258r756q1304o4909N970O8711Q0171j1492
$$ y = [700990, 696470, 735032, 702256, 719746, 795205, 945126, 1161702, 1374389, 1500595, 1540286, 1539721, 1492779, 1335725, 1148426, 957878, 716751, 568876, 474538, 382234, 378512, 386023, 297303, 244667, 266308, 340868, 342364, 360509, 336656, 296635, 294607, 265051, 225027, 155237, 104161, 171434, 193691, 227527, 206218, 173847, 195525, 220614, 204669, 159520, 151916, 216033, 223225, 234039, 217836, 161836, 145610, 160860, 120343, 44211, 58412, 63971, 93194, 157733, 98518, 84019, 108031, 142086, 209110, 142649, 80967, 87651, 132410, 157001, 147093, 108023, 124827, 150682, 175745, 183876, 117141, 90346, 95152, 86749, 71533, 78637, 99380, 140894, 92397, 84012, 83795, 139496, 103102, 90407, 107665, 97909, 16605, -48304, -42334, 26377, 106548, 95056]
21648I5056K2307N0610j7801O602n3679N630L0405L7036p7898k7381k3752o222
21636D0913K0823j4436k6502n074N2741J4094q5027n9687J8881N3755M2395N5685
21624A08561m1366l5201j0603M803Q821m4223m399O4687M8183L8153j3650m0018
21612H3748M3320l2063K5399N7205m817k4247j0972J7623M2577j4700j4193L3023
21600B01903j3502r5605n7075Q545J192L0363n111N0898j1472K862N7011L6509
21588B06518n2235n3091m1991n2519r79O8612P6680K2134l9456n6361m0824m88
21576C6000L9055Q3272L2530K0071j9615q9693K5877J1585o1776q99O227P33L0315
21563A13682p036k2763l0706l3198l0052M1488L8531L9408P8610P422N516m5760
$$ y = [95056, 117363, 167973, 150172, 156774, 103095, 108725, 139130, 176166, 98268, 70887, 47135, 40913, 61736, 47300, 20798, 15724, 68465, 82559, -2468, -62155, -43274, 10481, 52876, 108561, 67195, 31994, 21391, 26194, 35015, -9208, -13607, 51080, 99263, 137416, 123766, 83748, 127068, 95005, 120404, 177609, 172792, 148545, 137573, 155196, 197773, 183073, 168880, 201903, 188401, 92796, 35721, 44266, 45458, 75821, 70710, 121608, 110136, 112998, 170009, 206518, 154283, 101192, 59201, 6682, 5703, 74315, 150995, 173129, 133673, 77312, 36488, 36000, 75055, 158327, 190857, 210928, 191313, 101620, 127497, 139082, 77306, 76407, 82634, 83367, 113682, 106646, 83883, 53177, 19979, -10073, 31415, 69946, 109354, 187964, 195386, 200902, 155142]
21551A55142j401K8326L8456K0483l2144J5082K944l3709K7662K336Q618o8562
21539A63233l4892J1867M1459l744n255p200l3050n1485K8347J3088r567J8096
21527A30897L0486M1755Q618n050k7435J040j1359n8160K0492N218k6675L0694
21515A40521K6185k1110r4106k4436M6996Q5719k7062L3475K4169L3939J0991
21504B35281m7414j5083L6230j9690o4262M9599J0660j9061n6842o0848K4660
21493G3230J3757L5122O3622k1041n8035j8951K6830l599L4565K2815K2384J6962
21481B07661K3263J0827j8574n5343q995k8530K1402j8104k0270J7348P3613J8598
21469B22896k2317o1629k5992O7414O1968n6930o0771L2513M2211N1394K3747
$$ y = [155142, 153741, 182067, 220523, 241006, 208862, 223944, 226888, 193179, 220841, 223177, 231795, 163233, 128341, 140208, 181667, 177923, 172668, 165468, 132418, 80933, 109280, 122368, 112801, 130897, 161383, 203138, 211756, 206706, 179271, 180311, 168952, 110792, 131284, 136502, 109827, 140521, 166706, 145596, 51490, 27054, 74050, 159769, 132707, 166182, 190351, 224290, 235281, 187867, 172784, 209014, 189324, 125062, 174661, 185321, 166260, 109418, 48570, 73230, 86987, 122109, 185731, 164690, 106655, 87704, 114534, 110935, 145500, 168315, 190699, 207661, 230924, 241751, 223177, 167834, 158839, 130309, 151711, 133607, 113337, 130685, 204298, 222896, 200579, 138950, 112958, 180372, 242340, 185410, 124639, 157152, 199363, 250757, 274504]
21458B74504k6055k091j8226J8382r179M609q132l2369k5385L3986j9845k2292
21446A67907j0099j1378l3732M8501M1054k7247J3790l2634m232M6698j5689K7836
21434B10775L3277j8414j3022j9560L0575L1756P8368k593K8649K4827l5054L681
21422C53265M0635Q5050M9813M8894M2468N0673J07995O2579m636M4138j7089
21411H63785o3511o6287L48M9278J84j31365j62710j21252k2911j0430k4274l7546
21399B73309L6671j3187l4824j3195M976K3834j1671K1238M4922k370k1048j4945
21387B93710p794O629K9311N2292n0010l7875M6130k6371L0551k6426n6262J9285
21375B73170k2439l1900m1927N3851N3338M4872j982k757L3895j8616k0168K57
$$ y = [274504, 248449, 246358, 228132, 246514, 237335, 241944, 233812, 201443, 176058, 210044, 190199, 167907, 157808, 146430, 112698, 161199, 202253, 175006, 188796, 156162, 151930, 198628, 182939, 210775, 244052, 225638, 212616, 193056, 223631, 255387, 333755, 331162, 359811, 384638, 349584, 353265, 393900, 478950, 528763, 577657, 620125, 670798, 778793, 841372, 836736, 880874, 863785, 800274, 733987, 734335, 783613, 783797, 652432, 489722, 368470, 345559, 335129, 310855, 273309, 309980, 296793, 261969, 248774, 253750, 277584, 265913, 287151, 332073, 329703, 308655, 293710, 285916, 292545, 321856, 374148, 324138, 286263, 332393, 306022, 336573, 310147, 253885, 273170, 250731, 218831, 176904, 230755, 284093, 328965, 326983, 324226, 358121, 339505, 319337, 319594]
21363C19594O8633O6948n2245l1063m5659O925K2761p240K9903k4362L0743M7916
21351D32854P8284J9268o869j6K50o2588Q967J0644J3113N8411K8903k300k3622
21338E55299q6474j2257j4649l4973j5214L1746l72J404j7744J4442J9126L0762
21326D71096P724J283l8580K5416m1921P3003P5643p768m0142L3845J7329P3429
21314F50357L8391M2760Q4361N3275L0294K1957j6430o1789m5540j6410J1260
21303G92486p094M3768l0438q2738l9859O0449Q0121j8512Q6753O2955R2371J67729
21291A207991J47260J11291R0289J36698J34843J68290M6780o5293m2746o6193
21281A869210j23302r4621j93974j71443j24881j40887q2078n5484m0480p5156
$$ y = [319594, 388227, 455175, 402930, 371867, 326208, 333133, 355894, 348654, 378557, 354195, 384938, 432854, 511138, 530406, 523537, 523521, 523771, 461183, 470150, 480794, 493907, 552318, 581221, 578921, 555299, 468825, 456568, 441919, 406946, 391732, 423478, 423106, 424510, 406766, 421208, 440334, 471096, 478820, 480103, 441523, 466939, 425018, 498021, 573664, 565896, 525754, 559599, 576928, 650357, 688748, 731508, 815869, 869144, 899438, 921395, 904965, 843176, 797636, 781226, 792486, 785392, 829160, 798722, 715984, 676125, 736574, 816695, 798183, 884936, 947891, 1040262, 1207991, 1355251, 1466542, 1556831, 1693529, 1828372, 1996662, 2043442, 1978149, 1935403, 1869210, 1745908, 1651287, 1457313, 1285870, 1160989, 1020102, 938024, 882540, 842060, 766904]
21271G66904K589J8066k8921l8102j287L5819R4008j1684p2916K5406Q5507M2679
21259I18068l1608k706J8013K1009K5728O9000N8580K5480N8107N7227L1360M4514
21247A292772J4894Q814M8450m304l9277m2978J144K8357L1869L0145Q7387L3342
21235A490615M9840M5799J6926L7738j5913P7666Q7258M0843K2177r497R5160
21224A938612J25388P6599R9450R6268N6626N2176R6612J03255k1358p1203K661
21213B555086O2859J14725J25900J12088J0562O908N9109J29506J58726M7538
21203C383007J09511K01329K33631K50529J83878K18444L88380M82751O18691
21194F070151P57459O48932M56140M05634K15433k4449k06967j29778P8702J56221
$$ y = [766904, 769493, 787559, 758638, 720536, 719249, 755068, 849076, 837392, 764476, 789882, 875389, 918068, 886460, 883754, 901767, 922776, 948504, 1017504, 1076084, 1101564, 1159671, 1216898, 1248258, 1292772, 1307666, 1316480, 1364930, 1360626, 1321349, 1278371, 1279515, 1307872, 1339741, 1369886, 1457273, 1490615, 1540455, 1586254, 1603180, 1640918, 1625005, 1702671, 1789929, 1830772, 1852949, 1843452, 1938612, 2064000, 2140599, 2240049, 2336317, 2392943, 2445119, 2541731, 2644986, 2623628, 2552425, 2555086, 2617945, 2732670, 2858570, 2970658, 2981220, 2988128, 3047237, 3176743, 3335469, 3383007, 3492518, 3693847, 3927478, 4178007, 4361885, 4580329, 4968709, 5451460, 6070151, 6827610, 7476542, 7932682, 8338316, 8553749, 8529300, 8322333, 8192555, 8271257, 8427478]
21184H427478L17371M96872N90107O96935P53240R07819J176880J527003J749603
21175A6643308J821302K062721K350134K646777L075288L717570M900561O719271
21167D3936932Q949323J1859029J5672966K1249765K9424846M2170809O2947133
21160B36210803R3155911J02876276P3583936L6922057J1967792k5814329p1281722
21153D57620724j06538803j04096389p2081317m3942636k7033667j7565912j2348541
21146G4013459r383050p349568n965244m814225l640049k860082k311861j912203
21138C5777177j640150j532740j544010j571517j442207j164728j080729q86211
21130B4914885o11536l04219j52807Q3532K98274N28673O78485N96065L1137p36020
$$ y = [8427478, 8744849, 9241721, 9831828, 10528763, 11282003, 12189822, 13366702, 14893705, 16643308, 18464610, 20527331, 22877465, 25524242, 28599530, 32317100, 37217661, 43936932, 52886255, 64745284, 80418250, 101668015, 131092861, 173263670, 236210803, 329366714, 432242990, 505826926, 542748983, 554716775, 528902446, 457620724, 351081921, 246985532, 174904215, 130961579, 103927912, 86362000, 74013459, 64630409, 57280841, 51315597, 46501372, 42861323, 40001241, 37689380, 35777177, 34137027, 32604287, 31060277, 29488760, 28046553, 26881825, 25801096, 24914885, 24303349, 23999130, 23846323, 23929855, 24228129, 24756802, 25435287, 26031352, 26062489, 25326469]
21120B5326469j186979j548401j715384j593888j424820j151159r66049q63634
21112A4876155p52243p06108o85457p08201o15779o24820o62405o14942n12872
21103H993328m90142m74815m33509k92996l65191l32911l12144l23280l12801
21094E655539l27400k84901k44785k29013k28829j40294j65741k16737j31524
21085C686315j01555j35026j75641j48144j70289j36081q6232q6621j36572j15215
21075B394939j72768j26937l6046q6922j00787k9517k5713j33781r0930q6291
21065A505247n4035k3015r9871j03236k9745k8078k4225l5016R120L0304J1708
21054A159158n2588r249n6805j15948m9884m5636L1689M9967J024R1965P9820
$$ y = [25326469, 24139490, 22591089, 20875705, 19281817, 17856997, 16705838, 15739789, 14876155, 14123912, 13417804, 12732347, 12024146, 11408367, 10783547, 10121142, 9506200, 8993328, 8503186, 8028371, 7594862, 7301866, 6936675, 6603764, 6291620, 5968340, 5655539, 5328139, 5043238, 4798453, 4569440, 4340611, 4200317, 4034576, 3817839, 3686315, 3584760, 3449734, 3274093, 3125949, 2955660, 2819579, 2733347, 2646726, 2510154, 2394939, 2222171, 2095234, 2059188, 1972266, 1871479, 1841962, 1816249, 1682468, 1591538, 1505247, 1451212, 1428197, 1328326, 1225090, 1195345, 1167267, 1143042, 1108026, 1117146, 1147450, 1159158, 1106570, 1097321, 1040516, 924568, 874684, 829048, 860737, 910704, 911728, 1003693, 1083513]
21043A083513J8146N0868O794K3611Q4811J30050P7781O6595M6110m526j6183
21032A567570j78978l12199j93200r4799k7520k9075m6713q4759o0358l9971n1786
21021D48212q0240m9617q0061k3666j8901J47m4070m0173O7365j5442K4361n4804
21009A33111j17667k2499n2189j4157o188L501l2439M7483R9999N1384M6032R1693
20997B28064N0029L1880m3616k0955N5697J249j620L491K179L3155J2665J6288
20985C68506O2614K2718O3609J6312q717o2265n2136r4654j578J6027J044M442
20973C35922m4404N705M3877O7876k2209r530m9156o8844J0846P9427J5989m6906
20961C18593k5427L9067L6807Q920n716q4636n5954M5953r693L968M3241K4541
$$ y = [1083513, 1101659, 1152527, 1159321, 1182932, 1267743, 1397793, 1475574, 1542169, 1588279, 1583753, 1567570, 1388592, 1076393, 883193, 788394, 760874, 731799, 685086, 600327, 539969, 499998, 448212, 367972, 318355, 238294, 214628, 195727, 195874, 151804, 111631, 178996, 163554, 187915, 133111, 15444, -7055, -59244, -73401, -79589, -76088, -108527, -61044, 38955, 90339, 136371, 228064, 278093, 309973, 266357, 245402, 301099, 302348, 300728, 304219, 306398, 339553, 352218, 368506, 431120, 453838, 517447, 533759, 525042, 462777, 410641, 315987, 314409, 330436, 331480, 335922, 291518, 297223, 341100, 408976, 386767, 377237, 328081, 259237, 270083, 349510, 365499, 318593, 293166, 332233, 369040, 377960, 372244, 287608, 231654, 277607, 267914, 271882, 315123, 339664]
20949C39664M5329m7188l014n4115j2273M8986J1561j9532m2958j3138k4784J1226
20937B39764O8137M3965k5389l9733m5956k4409j2599l9391M7612r291L4475L8525
20925B75710k0220N0791N619q4933m5260P087M8589K6463K5452o780L3675J2143
20913C28336l0441L9164N463J5820K3357O039K8265n8467k4204q819q6368m8815
20901A89330J7540j8586L4994K2141K21o4192m4884j1033k7028L6888R123p1718
20889G2796k296j9122q258N6040l678l4614m5345l0085P6171j8114m6835M0782
20877C7442M7519J1308k9975J2362L988k0387p244M6194L0691k3798k5882P410
20865H9628m2283l2604m0798P2375K9058k0889R841K4711J9907L9408M410l8083
$$ y = [339664, 384993, 337805, 334791, 280676, 268403, 317389, 328950, 309418, 266460, 253322, 228538, 239764, 307901, 351866, 326477, 286744, 240788, 216379, 203780, 164389, 212001, 202710, 237185, 275710, 255490, 306281, 311900, 226967, 181707, 188794, 237383, 263846, 289298, 282518, 316193, 328336, 297895, 337059, 342522, 358342, 381699, 387738, 416003, 357536, 333332, 324513, 238145, 189330, 206870, 188284, 223278, 245419, 245640, 181448, 136564, 125531, 98503, 135391, 144514, 72796, 70500, 51378, 43120, 99160, 95482, 60868, 15523, -14562, 61609, 43495, -3340, 37442, 84961, 96269, 66294, 78656, 82644, 62257, 55013, 101207, 131898, 108100, 82218, 89628, 47345, 14741, -26057, 46318, 75376, 54487, 64328, 89039, 108946, 148354, 152764, 114681]
20853A14681l0063n344j3096l0115n6011j8642K3706l54K7457K1361l1013l3251
20841c0684L0792O181L6438j0497Q987O56K8330P4624L7557J3500n9559m2178
20829I4147L8299k1277K6034J9785n377K385k5068m8940k0430o170J3002L2806
20817I9196K063L178J9411n1204k92L6667Q5837m472j466k3921j0865N939k69
20804A59802J9349l8113k1469l2076J7833m6977k2886j01257q7429O3035K6396
20793f3792K4755M4601L3946M5607P9583k9815k7810K7327J2598P258j5242m6693
20781I2323k680l7296j958k0611K216K4997L6664K0764j1870k6645L2805o9501
20769C9208q0488N111L5374J7505l0694m0498j9326N1651Q3990J5246O73L258
$$ y = [114681, 84618, 79274, 66178, 36063, -19948, -38590, -14884, -15238, 12219, 33580, 2567, -30684, 108, 6289, 42727, 32230, 41217, 41873, 70203, 144827, 182384, 195884, 136325, 94147, 132446, 111169, 137203, 156988, 151611, 153996, 128928, 79988, 59558, 53388, 66390, 99196, 101259, 104437, 123848, 72644, 72352, 109019, 194856, 190384, 188918, 164997, 154132, 160071, 159802, 179151, 141038, 119569, 87493, 105326, 58349, 35463, -65794, -153223, -90188, -63792, -39037, 5564, 39510, 85117, 164700, 134885, 107075, 134402, 147000, 154258, 139016, 92323, 89643, 52347, 50389, 29778, 31994, 56991, 93655, 114419, 102549, 75904, 108709, 39208, -41280, -36169, -795, 16710, -13984, -54482, -73808, -22157, 61833, 77079, 77752, 81010]
20757H1010p4542r247j8912M4206o010m7114J2501J26513l435n7715n5750m0649
20745d9144p742O3118k3539m4104l2564K0063J7737n2648K2809P6821J0204j0016
20733i005L7480k2752J9714j6386o2228m4107J6320L5124J351M9639K9529J9820
20721E4499k5209l6435J5164M0529R544j0411J2328p1343l8898N5693M4325L650
20709E3436l3179O673K233r387k1972o366K8777k156M8626j3021j7432m5552L5509
20696B6189R326j9501K8724P1169J8882j8944m3908o1885R799L374j2521j3676
20684b972K0528L384P8035K2687k1548l9575O271l349n9436m5958l6312N7839
20672b0406j0573k3428K0976j8987k4363n783r897L1651K4304r046M640O6137
$$ y = [81010, 6468, -2779, -21691, 22515, 16505, -30609, -18108, 108405, 104970, 47255, -8495, -49144, -56886, 6232, -17307, -61411, -93975, -73912, -56175, -108823, -86014, -9193, 1011, -9005, 28475, 5723, 25437, 9051, -53177, -97284, -80964, -45840, -44489, 5150, 34679, 54499, 29290, -7145, 8019, 48548, 58092, 47681, 60009, -11334, -50232, 5461, 49786, 53436, 20257, 26930, 29163, 19776, -2196, -8562, 20215, 18059, 66685, 53664, 36232, -9320, 26189, 35515, 16014, 44738, 115907, 134789, 115845, 71937, 10052, 19851, 23225, 10704, -2972, 17556, 20940, 98975, 121662, 100114, 60539, 66810, 63461, 4025, -41933, -78245, -20406, -30979, -54407, -33431, -52418, -76781, -82564, -92461, -60810, -36506, -45552, -40912, 25225]
20660B5225M2817K4759j1320K8982M2437j7839o3665k7138P774r597N4809o1385
20648C5859o7736L4601N92J7405l6177k5591j535k0835J4950L0072j4183l2933
20636f5511l4450M1429K4314M26o94l3091L4873M9287L7050O073k3190K1488l3585
20623B4419j9134J1257J1093M1406j4626o1167m1964r6M5342M2238o0692l8375
20611f0299J7993L3338O1267O9292p038p2682q6292K3371M8443J4881k5005L4644
20599E1913l1923n6248j7299K4065K2574l8194k7901J4575M7589L1604N6031O4643
20587A41429J9609k4324q3334N643J17524M8120P7479R9104J2114N4956J84079
20576F52399K08888J36665K19425J52497M3358O2343p1796j93773j96952j34904
$$ y = [25225, 68042, 92801, 81481, 110463, 152900, 135061, 71396, 44258, 52032, 42435, 97244, 35859, -31877, 2724, 3316, 20721, -15456, -41047, -42582, -63417, -48467, -18395, -32578, -65511, -99961, -58532, -34218, -33792, -34486, -67577, -32704, 16583, 53633, 59706, 36516, 58004, 24419, 5285, 16542, 27635, 69041, 54415, -6752, -48716, -48812, -3470, 38768, -21924, -60299, -42306, -8968, 52299, 121591, 114553, 41871, -44421, -21050, 27393, 42274, 17269, 51913, 19990, -36258, -53557, -29492, -6918, -45112, -73013, -58438, -10849, 20755, 76786, 141429, 161038, 136714, 53380, 59023, 176547, 224667, 302146, 401250, 413364, 468320, 652399, 861287, 997952, 1217377, 1369874, 1413232, 1475575, 1403779, 1210006, 1013054, 878150]
20566H78150j41077j04525n4337p3413J9453L4300P2756K08660J93616J57208
20556A190791J86643P0502l0534n6716r4072j34556k38458j59609j58837j14130
20546D61024m6105k8318o5625j2375J777R581j3070q108k9920m9396l9835m034
20534A75596M8843p786k5566l6447J4747K5086J0156n6068n8392j8946M6027p922
20522A09328L3308O1116n8479n3029L2965M3003r7576o3483L7647M3039K5299
20511A13138m8566k4070L8292K6495j3155J2913n589j7289k0254L668j2819l9364
20499A3400j5493k8067k0371M12J8245O30j7297j3496m7972K8072L6520K900n1021
20486i3538o706N3727L5419o1300K2643N1789r1844n0942L6354M9423N238K7184
$$ y = [878150, 737073, 632548, 578211, 504798, 524251, 558551, 631307, 839967, 1033583, 1190791, 1377434, 1447936, 1417402, 1360686, 1266614, 1132058, 893600, 733991, 575154, 461024, 414919, 386601, 320976, 308601, 310378, 319959, 306889, 298781, 268861, 219465, 179630, 175596, 224439, 216653, 191087, 154640, 169387, 194473, 204629, 148561, 90169, 71223, 117250, 109328, 142636, 203752, 145273, 92244, 125209, 168212, 70636, 7153, 44800, 87839, 113138, 64572, 40502, 78794, 105289, 92134, 105047, 99458, 82169, 61915, 65583, 52764, 13400, -2093, -30160, -50531, -50119, -31874, -31244, -48541, -62037, -110009, -81937, -45417, -42517, -93538, -100244, -46517, -11098, -72398, -49755, 2034, -89810, -140752, -104398, -54975, -49737, -22553]
20474b2553L8613K6051l5089l0425j8738j6026K8458M7081N862o4384n071M9756
20462C535O4487M4117o4500m0609j6475n4891M3243M5101j206l0401J0241J1601
20450A4243p0118N34l5507O108K0750p70J4583L8685j6383o8551l4380M1446K6408
20437f2952L9330j9606N2994K6524K4468J0319m8006j5290m970p5220m5316R780
20425a07945J0052M5341K4559L5171M553j0908K0271M0750J3032l2294J2514M8931
20413A04027n34l3567j4130K5395l6756p7578L097r595L8069O4698j1345m6624
20401E157o6346o3324L7346K1603K5179J5954L4177L0413j0350L1000k5503l4366
20389I40m1355q268M232k7280n9744M7293R8926l337P090N908k5858M0512R692
$$ y = [-22553, 16060, 42111, 7022, -23403, -42141, -58167, -29709, 17372, 23234, -41150, -46221, 3535, 68022, 112139, 47639, 7030, -9445, -64336, -21093, 24008, 22802, -7599, 2642, 14243, -55875, -55341, -90848, -84740, -63990, -64760, -50177, -11492, -27875, -96426, -130806, -89360, -62952, -23622, -43228, 9766, 36290, 60758, 71077, 23071, 7781, 2811, -72409, -117725, -107945, -97893, -52552, -27993, 7178, 11731, 823, 21094, 61844, 74876, 42582, 55096, 104027, 103493, 69926, 55796, 81191, 44435, -33143, -30046, -39641, -1572, 63126, 51781, 5157, -61189, -124513, -87167, -65564, -40385, -24431, 9746, 40159, 29809, 60809, 35306, 940, -40415, -48683, -44451, -71731, -131475, -84182, 14744, 11407, 18497, 24405, -1453, 39059, 48751]
20376D8751J7233J805l2537K5033m8689j5560m975q396l8494J6790J4804Q880
20364a5355k6441j4530K2278K2046J9745J8120N1412J7971K1819p2465j20960
20353g6360J4994n621q275M4089M9020j2260k2558n494K1929l5011j3315K5599
20341b3263k9761j7559j935L3686Q8994j3402K782M4921m4881j2445J5515k3755
20329A8897k5299L1809k4514l2307Q10N666j3751k4364K1326J4853K147K2919
20317a808K2824j9517m7549J0674M5102K4289K0787M6583O524o8401m9690l5837
20305d6019k1869J8190O621L2003P8135k4422m4105m2087Q829Q7900R1582l445
20293A41313j2549M3011o2074o4530q0940j5252K1392R290M211m519K5701N361
$$ y = [48751, 65984, 67789, 35252, 60285, 11596, -3964, -8939, -17335, -55829, -39039, -24235, -15355, -41796, -56326, -34048, -12002, 7743, 25863, 77275, 95246, 117065, 44600, -76360, -61366, -66987, -75262, -31173, 17847, 5587, -16971, -22465, -536, -35547, -48862, -23263, -53024, -70583, -72518, -38832, 50162, 36760, 39542, 84463, 39582, 27137, 42652, 18897, -6402, 25407, 893, -31414, -30604, -24938, -38689, -63053, -41727, -26874, -24727, -1808, 21016, 1499, -46050, -35376, 9726, 34015, 54802, 101385, 107909, 39508, -10182, -46019, -67888, -49698, -43077, -11074, 67061, 42639, -1466, -43553, -34724, 53176, 144758, 141313, 128764, 171775, 109701, 45171, -35769, -51021, -29629, -20339, -16128, -20647, 5054, 10415]
20281A0415l6397n0054N8789M4014K1252m7387m3423j5517O3533q833m0464j0159
20269e4231j8024N794L4886p682p1338O5388L0700L0805M24m6599l4358L8628
20257b5607R174k8071K6773L3371K9840k6917L7589J1747m9689k9512J6321L1196
20245C6215J2722j8677O039n8427j1570J3201J2544K1473R278K8918o61n1502
20233d47j3542K1002J8741N511q1526m1463K7725K7553l2962K130N0742l1003
20221d7539m9343N7991M9315m3325J1383M2669k4949m5791j9973M953J3012l953
20209e5550k0263k0690N4737M1653P86l3136N4077J1207n5112O55M2223L3811
20197E4398M4329l1296o8847J8806M2276r028k7341o944r4712k8920k8936M7517
$$ y = [10415, -25982, -76036, -17247, 26767, 48019, 632, -42791, -58308, 5225, -3608, -44072, -54231, -72255, -66461, -31575, -39257, -110595, -45207, -14507, 16298, 16722, -29877, -64235, -25607, -16433, -44504, -17731, 15640, 45480, 18563, 56152, 67899, 18210, -11302, 5019, 36215, 48937, 30260, 36299, -22128, -33698, -20497, -7953, 13520, 22798, 51716, 51055, -447, -13989, 7013, 25754, 31265, -50261, -91724, -63999, -36446, -69408, -67278, -16536, -47539, -96882, -38891, 10424, -32901, -21518, 21151, -3798, -49589, -69562, -64609, -51597, -55550, -75813, -96503, -41766, -113, 673, -32463, 21614, 32821, -22291, -21636, 20587, 54398, 98727, 67431, -1416, 17390, 59666, 50638, 23297, 16353, -78359, -107279, -136215, -88698]
20185h8698M3242J0642l4299p867N9619L3936k4050k6235Q388O14o5013n394l635
20172i8750K2918N2447k0920k9518j8508P2433M5256N3728N6047k4462l9309J533
20160G2895j2276j5270j7153n1802N2865M3840l2393n2075M6445N4595j8941m6206
20148B4524J5522M6626m0800K2349O6236K8887j0864o8274O420J4220k2192k5364
20136E7290p7739j8163N2445k7917r040K9457O8239j5368k0108k465q43M0376
20124G6164O4796m5233N515j1739k2746k98l8832n8422K2632k14q545J3675q667
20111a1914L5046L3468j2940k2464J0452K5663n8742j337l3769j3176L4725M1687
20099B6699L0982O6819K1788j1051n2558j9383j2416M0588N3633N8591N713q812
$$ y = [-88698, -45456, -34814, -69113, -76980, -17361, 16575, -7475, -33710, -25322, -24708, -89721, -95115, -98750, -75832, -23385, -44305, -73823, -92331, -19898, 25358, 79086, 135133, 110671, 71362, 72895, 60619, 45349, 28196, -23606, 29259, 73099, 40706, -11369, 35076, 89671, 70730, 24524, 40046, 86672, 45872, 68221, 134457, 163344, 152480, 84206, 90626, 104846, 82654, 57290, -20449, -38612, 13833, -14084, -23124, 6333, 74572, 59204, 39096, 36631, 35788, 76164, 140960, 95727, 101242, 89503, 66757, 66459, 27627, -30795, -8163, -8377, -16922, -3247, -11914, 23132, 56600, 43660, 21196, 31648, 57311, -1431, -2768, -36537, -49713, -14988, 26699, 57681, 124500, 146288, 135237, 82679, 63296, 50880, 91468, 145101, 203692, 209405, 200593]
20087B00593k5893n4089p6049l8717n4424L0213O078L5075o154K8337J2506L2208
20075H9684J8850j0505n955k2113J8362p7752j5963J2344r451K7794N9615k8472
20063E6438J048k8237m0914N580j9989J00506Q1508R049k2952j6061o9106R801
20051F6671L2414k3315o3172J9618J4918j0288O0588J1011l9102l124J838K8470
20039I6527P3947j3299j9062j4881n839K2682N7084k0295l2785L8081M8093P666
20027B37919N9002N2278K3315Q822J8846K4944P5423M4840J6896l523l9452m9223
20015D70087j4008j9582o5293n0381m4373l2407k2949n45l5l6050j7501p211N669
20002A65421m6757n848Q232l119J6353k9067m7049K7014j497j5159K4923K5207
$$ y = [200593, 174700, 120611, 44562, 5845, -48579, -18366, -12288, 22787, 16633, 44970, 57476, 89684, 108534, 98029, 92074, 69961, 88323, 10571, -5392, 6952, -2499, 25295, 84910, 56438, 57486, 29249, -11665, -6085, -26074, 74432, 155940, 164989, 142037, 125976, 56870, 66671, 99085, 75770, 12598, 32216, 47134, 36846, 97434, 108445, 69343, 66219, 68057, 96527, 170474, 157175, 138113, 123232, 117393, 140075, 197159, 176864, 144079, 182160, 230253, 237919, 296921, 349199, 372514, 381336, 400182, 425126, 500549, 545389, 562285, 558762, 519310, 470087, 456079, 436497, 371204, 320823, 276450, 244043, 221094, 220549, 220514, 184464, 166963, 159752, 165421, 118664, 112816, 121048, 117929, 134282, 105215, 58166, 85180, 83683, 68524, 93447, 118654]
19990A18654K2556J3049M825m3615j9808j0721m7257j1125N2958J1841J2738o7764
19978C6331k8976K6046n4280J4451P1091Q4212J6173L8956k4318J1788J8807j8627
19966A91654p108n3926K0360L3105K4708K4130O4448L4437J2877M5354M0465K4027
19954D54531M5880N992l9675O1699M6418k9859l3416J1206O7213j111l0539q6565
19942D71774m0461m0891o6598m9522o0188N25N0585M7156P1610K2423J2476L1245
19930D50134L5934N0393m9876p631l4268p456M4641O3682J2781n9526l9169m9573
19918D10066j2152L8573m0638n7156p8352m8934J7314n245j6103q911k806j2972
19906A82684K2579J2785j4207k3758j2636P026M4254J5083l7255J3742N3936p01
$$ y = [118654, 141210, 154259, 159084, 115469, 95661, 84940, 37683, 26558, 79516, 91357, 104095, 36331, 7355, 33401, -20879, -6428, 64663, 148875, 165048, 204004, 179686, 191474, 210281, 191654, 184546, 130620, 150980, 184085, 208793, 232923, 297371, 331808, 344685, 390039, 430504, 454531, 500411, 506403, 466728, 528427, 574845, 544986, 511570, 522776, 589989, 588878, 558339, 471774, 431313, 390422, 323824, 274302, 214114, 214639, 265224, 312380, 383990, 406413, 418889, 450134, 486068, 536461, 486585, 478954, 444686, 437230, 481871, 545553, 558334, 498808, 459639, 410066, 397914, 436487, 395849, 338693, 260341, 211407, 228721, 223476, 207373, 198462, 195656, 182684, 205263, 218048, 203841, 180083, 167447, 174473, 218727, 233810, 196555, 210297, 264233, 263532]
19894B63532p0483l584M92M317k0651j2893l2608l113P2297P3116j0190o4381
19882A95851n0198N7514M6671N47m6079J1807k335J4613r641n728J659k2804k347
19869A89530k1366r1302J6009J6914Q345O0727M1240P63j8882O897j969j7344
19857A89562N7220O1155m1158q454M017N0314L8847l592K6744k6142l7250j3359
19845B97904J1817R8361K0313l9085N973n1973k8685K3272o891j8563j0319j2867
19833B89257j0406L0704L8671O239Q875O9921K5716m0104k7588k1073j8725L8903
19821C90390P4351q164n5006k1734n3793l5920N7936k3113R984P413j6186j3541
19809C12617j1975j5121J8068M5554O428n0579J4832K1939L8959j750l1246M763
$$ y = [263532, 193049, 189465, 189957, 194274, 173623, 160730, 128122, 125009, 197306, 270422, 260232, 195851, 145653, 203167, 249838, 250385, 204306, 216113, 213778, 228391, 218750, 213022, 214681, 191877, 189530, 168164, 76862, 92871, 109785, 118130, 178857, 220097, 220860, 201978, 208875, 206906, 189562, 246782, 307937, 266779, 258325, 262342, 312656, 351503, 347911, 374655, 348513, 311263, 297904, 309721, 408082, 428395, 389310, 395283, 343310, 314625, 337897, 331006, 312443, 302124, 289257, 278851, 309555, 348226, 354465, 363340, 433261, 458977, 418873, 391285, 370212, 351487, 390390, 464741, 456577, 401571, 379837, 326044, 290124, 348060, 324947, 334931, 342344, 326158, 312617, 300642, 285521, 303589, 349143, 355571, 304992, 319824, 341763, 380722, 378972, 347726, 352489]
19797C52489k8770m36J2291N860K5412P8357p451J1840k5356o505q465j7626L7295
19784D28935K0378J1223l9753m9404K0041L0486l7364O1843Q6902L8387P1357
19773F43031J00208L5688k3723J3836J09342J46626J80863Q6616R0256J64098
19763A546841J73202J83781K20248J76547J80673J03187Q8972M7337Q6733L9338
19753B846859J36776J09000J9165k738o4953j73697j27155j26834j10420k8903
19743B477100k9085J2481J10855J01112P3197O8934Q7031J81370J00882J5085
19733C198962J6553M071L1640j6608k6315r6545o0538o8888m0029r3566j38639
19722B710098j71335j57739j22736j43925j25001j01071j5873j7793r1864n1293
$$ y = [352489, 323719, 323283, 335574, 341434, 366846, 445203, 437752, 449592, 424236, 417731, 409266, 391640, 428935, 449313, 460536, 420783, 371379, 391420, 421906, 384542, 446385, 533287, 571674, 643031, 743239, 778927, 755204, 769040, 878382, 1025008, 1205871, 1292487, 1382743, 1546841, 1720043, 1903824, 2124072, 2300619, 2481292, 2584479, 2673451, 2720788, 2807521, 2846859, 2983635, 3092635, 3111800, 3109062, 3044109, 2870412, 2743257, 2616423, 2506003, 2477100, 2448015, 2460496, 2571351, 2672463, 2745660, 2814594, 2901625, 3082995, 3183877, 3198962, 3215515, 3219586, 3251226, 3234618, 3208303, 3111758, 3051220, 2982332, 2942303, 2848737, 2710098, 2538763, 2381024, 2258288, 2114363, 1989362, 1888291, 1872418, 1854625, 1762761, 1711468]
19712A711468P934j9039o8874n1102j9192k8988m5424r4726p8391j09149q0433
19701A124084k300j1586m4845r1669k0592L1281J3957L0121M590k8369k6410j4228
19689I64034K1990O3343M389k0044r150K3195l6153N981O9631J642L3802J26082
19677A248742J09298j2189J7655M6108O3509P3010M083K1838K3497P2716L2136
19666A700403j5763J7767j5144n564m7619o7302N5763K1416K6276p521L2279p6195
19654A618796q6521j66l435k304j6776K0076q497l3022l6643J9058l314j2595
19642A454657j21135m4385k4367o0150j17355p1728k9537j6977q2898q7700m0380
19631G58045l2914p2334k0903j153J2488M2324k4369J1256O572J5091p4774m3918
$$ y = [1711468, 1719402, 1700363, 1631489, 1580387, 1561195, 1532207, 1486783, 1392057, 1313666, 1204517, 1124084, 1121784, 1110198, 1065353, 973684, 953092, 984373, 998330, 1028451, 1033041, 1004672, 978262, 964034, 986024, 1049367, 1053756, 1033712, 1024562, 1047757, 1011604, 1017585, 1087216, 1088858, 1122660, 1248742, 1358040, 1345851, 1363506, 1409614, 1473123, 1546133, 1550216, 1572054, 1595551, 1668267, 1700403, 1684640, 1702407, 1687263, 1681699, 1634080, 1566778, 1622541, 1643957, 1670233, 1662712, 1694991, 1618796, 1532275, 1532109, 1528674, 1526370, 1509594, 1529670, 1521173, 1488151, 1451508, 1470566, 1467252, 1454657, 1333522, 1289137, 1264770, 1204620, 1087265, 1015537, 986000, 969023, 886125, 798425, 758045, 725131, 652797, 631894, 630741, 643229, 685553, 661184, 672440, 679012, 694103, 619329, 575411]
19619E75411n5383k6906m699J352M3015J3293M555L972k7104l3243J9667jN432
19606E19361K2624l1348L1285j1602M572q6104m4810J1215M2366j3952j0048M2080
19594D75639O5415j2199j9867L3206L1080J1500j8606J7694L9109l7826J6968
19583F02113K3272K3609O0554N8371J02697Q8062M3307O2189J46564L4574N4630
19572A299942O4098N6105L5953J09926J00523k6179j1219l5706l0282k2097m2539
19561A498525p2528q2446l2535l4754j4676O3975L7928j9447L0741J05624J07493
19550A587900J93040J54522P7737J28993P4919R8034J06142j9000K0867k2339
19540B400815J6518P406J1271q1066q4825p9486p6305p6103j15286o0545n5393
$$ y = [575411, 520028, 493122, 488423, 489775, 532790, 546083, 550638, 554610, 527506, 494263, 513930, 513929, 519361, 541985, 510637, 541922, 530320, 534892, 448788, 403978, 415193, 457559, 443607, 433559, 475639, 541054, 528855, 508988, 542194, 573274, 584774, 566168, 583862, 622971, 585145, 602113, 625385, 648994, 709548, 767919, 870616, 958678, 1001985, 1064174, 1210738, 1245312, 1299942, 1364040, 1420145, 1456098, 1566024, 1666547, 1640368, 1629149, 1593443, 1563161, 1541064, 1498525, 1425997, 1343551, 1311016, 1276262, 1261586, 1325561, 1363489, 1344042, 1374783, 1480407, 1587900, 1780940, 1935462, 2013199, 2142192, 2217111, 2315145, 2421287, 2402287, 2423154, 2400815, 2417333, 2424739, 2436010, 2354944, 2270119, 2190633, 2114328, 2038225, 1922939, 1862394, 1807001]
19529A807001n5907q3531r6108n8407n2022r2880J112k1004J9032j038k0004J6127
19517A362371P060L1484K4369L909k943N4045O0377O6418M3791n929l8614L2315
19505A638653J5507l624K2047q2363r0787m7066N608n0212O406n5693p1858l4726
19493A251892Q39n9310r5303l1307K5932j43n8656K8261M2630k2440L0913M2928
19481A156236o8261k856L1048J9439J2308j3099K4150M2931O158l7947L6643K1440
19469A228190l2358Q296Q4529N5991J3705J29946O2966l2973J410J4164Q0090
19458A613956P9594N1284J03101J03216M9120M3082Q8477O6908R7671N4109N2677
19447B403195R5315Q5759J13559J52355J04789J35546J34965J77566K50164L47568
$$ y = [1807001, 1751094, 1667563, 1571455, 1513048, 1461026, 1368146, 1369258, 1348254, 1367286, 1366248, 1346244, 1362371, 1369431, 1400915, 1425284, 1429193, 1426250, 1480295, 1540672, 1607090, 1650881, 1644952, 1606338, 1638653, 1654160, 1650536, 1672583, 1590220, 1499433, 1452367, 1457975, 1407763, 1414169, 1358476, 1286618, 1251892, 1252731, 1193421, 1098118, 1066811, 1092743, 1092600, 1033944, 1062205, 1104835, 1082395, 1113308, 1156236, 1087975, 1085119, 1116167, 1135606, 1147914, 1134815, 1158965, 1201896, 1208054, 1170107, 1206750, 1228190, 1195832, 1204128, 1288657, 1344648, 1358353, 1488299, 1551265, 1518292, 1519702, 1533866, 1613956, 1693550, 1744834, 1847935, 1951151, 2000271, 2043353, 2131830, 2198738, 2296409, 2350518, 2403195, 2498510, 2584269, 2697828, 2850183, 2954972, 3090518, 3225483, 3403049, 3653213, 4000781]
19437D000781M15951M74849N00515N80956N90409O72759Q58949J122092J433561
19428A0650822J849853K282195K949336M051281N674809Q042219J1364973J2952756
19420E9818244J0774483P361261M851654J573668k212414l837234l96397M265341
19412H2198606M592989K446051K42321l656798r071407j3244227j2995858q865810
19404D1645867m681078j601799P13319K740806N141386Q459076J1965791J2215100
19396G6598468R198204N945648L346287o80626m212017m370873L71970M022778
19388I0219839L431980J062203j565603o295665j1615420j4875796j3477297r456903
19380C7427338o075824l903690k632524j997533j724026j552137j374411j214690
$$ y = [4000781, 4416732, 4891581, 5392096, 5973052, 6563461, 7236220, 8095169, 9217261, 10650822, 12500675, 14782870, 17732206, 21783487, 27458296, 35500515, 46865488, 59818244, 70592727, 77953988, 82805642, 84379310, 82166896, 78329662, 77933265, 82198606, 86791595, 89237646, 89479967, 85823169, 76751762, 63507535, 50511677, 41645867, 36964789, 35362990, 36076309, 38817115, 43958501, 52417577, 64383368, 76598468, 85796672, 91742320, 95088607, 94407981, 90195964, 85825091, 86197061, 90219839, 93651819, 94714022, 93148419, 86852754, 75237334, 60361538, 46884241, 37427338, 31351514, 27447824, 24815300, 22817767, 21093741, 19541604, 18167193, 16952503]
19372A6952503j074779r12277p69256o69297o09659n53713m38783m47297k92254
19363A1185188j39046q7338j67646j56179j10920j40574k11846j68257j98596
19354I804786j28980r2702k01378k45967l72697l78478l88659l59761m22863m43262
19344F770039m32227k65048l17866l61468l56967l11794k55699k52023k58859
19335C958088j71559j60332j77787j87466j50059j02111j45256j06818r5519p8797
19325B582384n3477j18854j03218l9936n6418n3775r1041p2684q9727p0188k3887
19314A809179n5419m1303K2228m6570q5047p3800l6783P9098O6195K157j7448
19303A622487j3864L7630K7951R3812J3375J19259J21756P4031O9727P13k9472
$$ y = [16952503, 15877724, 14965447, 14196191, 13526894, 12917235, 12363522, 11924739, 11477442, 11185188, 11046142, 10958804, 10791158, 10634979, 10524059, 10383485, 10171639, 10003382, 9804786, 9675806, 9583104, 9381726, 9135759, 8763062, 8384584, 7995925, 7636164, 7213301, 6770039, 6337812, 6072764, 5754898, 5393430, 5036463, 4724669, 4468970, 4216947, 3958088, 3786529, 3626197, 3448410, 3260944, 3110885, 3008774, 2863518, 2756700, 2661181, 2582384, 2528907, 2410053, 2306835, 2266899, 2210481, 2156706, 2065665, 1992981, 1903254, 1833066, 1809179, 1753760, 1712457, 1734685, 1688115, 1603068, 1529268, 1492485, 1571583, 1637778, 1639935, 1622487, 1608623, 1646253, 1674204, 1768016, 1781391, 1900650, 2022406, 2096437, 2166164, 2166877, 2137405]
19292B137405K262Q649q386K9886M4102m6071n1778q3485p9694r3752r7615r4056
19280A667467o1199o2496l1292l5156l2097R962k2986j7435k2740j5778J4437
19269A390687O3170J6182L4966O5599K4617L4153J10910Q1331L7782K4778q6817
19258A797358L6842L5532l8309r902l2204p6341n5800P182j1564j30616j16021
19247A406157o4069m0511k0430l2060j1199J02245J22095P4880M488k0968j0623
19236A510005O895M7528m2613k5121j0196J7106l7808p7899m4030p1682l0292
19225A241893Q990p839o8435o4821j5302m0799M0501Q2439K4581L7834O5162N7977
19213A362181J28515J23543O2201N5108J47707K3218J0255k1888M6050N0593O0863
$$ y = [2137405, 2139667, 2148316, 2139930, 2169816, 2213918, 2167847, 2116069, 2032584, 1952890, 1859138, 1761523, 1667467, 1606268, 1543772, 1512480, 1477324, 1445227, 1455189, 1432203, 1414768, 1392028, 1376250, 1390687, 1453857, 1470039, 1505005, 1570604, 1595221, 1629374, 1740284, 1821615, 1859397, 1884175, 1797358, 1834200, 1869732, 1831423, 1821521, 1789317, 1712976, 1657176, 1664358, 1652794, 1522178, 1406157, 1342088, 1301577, 1281147, 1249087, 1237888, 1340133, 1462228, 1537108, 1541596, 1520628, 1510005, 1516900, 1564428, 1521815, 1496694, 1486498, 1503604, 1465796, 1387897, 1343867, 1272185, 1241893, 1250883, 1243044, 1174609, 1109788, 1094486, 1053687, 1094188, 1176627, 1201208, 1239042, 1304204, 1362181, 1490696, 1614239, 1676440, 1731548, 1879255, 1902473, 1912728, 1890840, 1936890, 1987483, 2048346]
19202B048346J2714J4588K5676j614k4434m3283j10497p7689N1402N6606Q2733
19191B034548Q6189L5484O2561J13924J38647M9324R5988J06523J22230J13087
19181B958505K04472K83015K83937K89084L18261L40182M15723M46910N01313
19172F041402P17112R87989J207999J497862J913675K507081L410636M699616
19164B2983372O879622J0129048J3082271J2388514R118846N934237L164060j125177
19156H2554793m445772l859921J020475L488984K302863M16900j933233o703966
19148G2841123j1496534j3605346j1233089p268709m344803k629322j579179r71582
19140A9712559m10161P9522M91667J012106J641528K460818L636603N408695Q131852
$$ y = [2048346, 2061060, 2075648, 2101324, 2099710, 2075276, 2031993, 1921496, 1843807, 1895209, 1951815, 2034548, 2120737, 2156221, 2218782, 2332706, 2471353, 2520677, 2616665, 2723188, 2845418, 2958505, 3162977, 3445992, 3729929, 4019013, 4337274, 4677456, 5093179, 5540089, 6041402, 6758514, 7746503, 8954502, 10452364, 12366039, 14873120, 18283756, 22983372, 29862994, 39992042, 53074313, 65462827, 74581673, 80515910, 83679970, 82554793, 78109021, 74249100, 75269575, 78758559, 81061422, 81478322, 79545089, 72841123, 61344589, 47739243, 36506154, 29237445, 24892642, 22263320, 20684141, 19712559, 19302398, 19381920, 19873587, 20885693, 22527221, 24988039, 28624642, 34033337, 42165189]
19131D2165189J2017249J4491203J2213957Q203166N141606J584990l146059o280929
19123H6390372m272863J181605K900852J407424o45621l813915q838957j3113035
19115F1195862j4034371j1039507p311674m716217l113130k232969j724764j501667
19107A5521563j234311r85322q10613p09123n77498n18683m16550l31088k77149
19098I661226k89205k69163k59853j93389j44853k36696l00216k59153k21256
19089G487442k32927k50209k74098j91881k12004k90172k94670l04520l45383
19080E091578k93389k09145j41427k29851j99292k09775k28982j56037j51318
19071C272362j86623j54718j35847j19415j22025j37576j26144o9512m2901j29021
$$ y = [42165189, 54182438, 68673641, 80887598, 89090764, 94232370, 95817360, 92671301, 86390372, 82117509, 83299114, 86199966, 87607390, 86961769, 83147854, 74308897, 61195862, 47161491, 36121984, 28810310, 24094093, 20980963, 18747994, 17023230, 15521563, 14287252, 13301930, 12491317, 11782194, 11204696, 10686013, 10269463, 9938375, 9661226, 9372021, 9102858, 8843005, 8649616, 8504763, 8268067, 7967851, 7708698, 7487442, 7254515, 7004306, 6730208, 6538327, 6326323, 6036151, 5741481, 5436961, 5091578, 4798189, 4589044, 4447617, 4217766, 4018474, 3808699, 3579717, 3423680, 3272362, 3085739, 2931021, 2795174, 2675759, 2553734, 2416158, 2290014, 2220502, 2177601, 2048580]
19061B048580j34276p7622q1575o4815m7895j4351n2923j05031k8539n2850n4663
19050A334040o0576l4780l7058p4005o0049n5180j2184l6175o3592k0087m0727
19039H39627n485o3042j5981P391j9498l6489N0478K4291J21l3392r9761n3696
19027E94564p557R036q720o1220l7047L1045n9498o4166k3938j5622k8440M300
19015C32737l5263O765R340M032J7990j5786M850J3467L2581M5819K7462m8018
19003C95976O760J4517j4864k0806j4083J7591L1562j9644L950k9395o0693l2638
18991B78233o142k4544n7321j4755r046R654N040J8133k8827p8727m4577J8042
18979F5163N0461L727M4440N207j8132m224O6789j293l5627O19l6179m0507m4844
$$ y = [2048580, 1914304, 1836682, 1755107, 1690292, 1642397, 1628046, 1575123, 1470092, 1441553, 1388703, 1334040, 1273464, 1238684, 1201626, 1127621, 1067572, 1012392, 1000208, 964033, 900441, 880354, 839627, 834142, 771100, 755119, 762510, 743012, 706523, 757001, 781292, 781413, 748021, 648260, 594564, 587007, 596043, 587323, 526103, 489056, 520101, 460603, 396437, 372499, 356877, 328437, 332737, 297474, 304239, 313579, 317611, 335601, 319815, 324665, 338132, 370713, 416532, 443994, 395976, 402736, 417253, 402389, 381583, 367500, 385091, 416653, 397009, 400959, 371564, 310871, 278233, 272091, 247547, 190226, 175471, 166425, 176079, 181119, 199252, 170425, 91698, 47121, 65163, 115624, 119351, 163791, 168998, 150866, 146642, 213431, 212138, 176511, 177130, 140951, 100444, 55600]
18966E5600k8517j5631P4638K4262L0545Q1060q957l390n9348j2020M4386L2253
18954B14881P5872K9085J2993l9668l3646J7433j7340m1167k6383j2816j3034
18943A66210K8598K2394P928M76k9040k7174l6480K3635J2091M828k3481l103
18931A46882M3741m2585k5291j6636N4892K0794J3395L3289N138l3468J414J7786
18919B19351K610j1260J2294N819J887R072k8218R792l268n9444K1319O4676n1118
18906A93512o3248J6664Q4002M6708m0415j9596K6556m656L884K4770j5798k8619
18894B23764l0973m4641L9084J12864L7095m7597n6473n2168j3577Q5781J05762
18883C58921k094O865O5155O4709J05667Q8454N4234L8859m2187m0471N1629R962
$$ y = [55600, 27083, 11452, 86090, 110352, 140897, 221957, 213000, 209610, 150262, 138242, 182628, 214881, 290753, 319838, 332831, 293163, 259517, 276950, 259610, 218443, 192060, 179244, 166210, 194808, 217202, 225130, 225606, 196566, 169392, 132912, 156547, 168638, 173466, 149985, 146882, 190623, 148038, 122747, 106111, 161003, 181797, 195192, 228481, 233619, 200151, 201565, 219351, 221961, 210701, 222995, 228814, 230701, 239773, 211555, 221347, 218079, 158635, 179954, 244630, 193512, 130264, 146928, 230930, 277638, 237223, 217627, 244183, 239527, 243411, 268181, 252383, 223764, 192791, 148150, 187234, 300098, 337193, 289596, 233123, 180955, 167378, 253159, 358921, 356827, 363692, 428847, 493556, 599223, 687677, 741911, 780770, 738583, 698112, 749741, 759703]
18871G59703k2376j7407L8785l6161p9338j30184j08061m3078j0724K848K1360
18860C75367M0849O3154J09289N3456J9358K4482Q7567R1582M5872p9956m7303
18849G83717n161L2248M4481N291o5709o4419n6897j14351j49988q9997M3749
18838C62964k1070P521q112j22058p9775m2092M224P122k8063j6771n159j129
18826E7602L1789M0388l6924j9805M1590K8755O74m4381K4779O0898J6157n0938
18814A50584j8348k1260l7083L6129K1132M6500l085m9337m7781K2200j1219K0988
18802A09420n3677R420p276k6455J3560K5736j0940o0010M2647J8782L3584O687
18790A01478J5378k1647K3545K0852j1455j5288K5650M9469j627k8852r086m6230
$$ y = [759703, 737327, 719920, 758705, 722544, 643206, 513022, 404961, 361883, 351159, 354007, 375367, 416216, 479370, 588659, 642115, 661473, 685955, 773522, 865104, 910976, 831020, 783717, 778556, 810804, 855285, 860576, 794867, 730448, 673551, 559200, 409212, 319215, 362964, 341894, 349415, 341303, 219245, 139470, 97378, 101602, 108724, 80661, 63890, 58731, 57602, 89391, 129779, 92855, 73050, 114640, 143395, 144069, 99688, 124467, 185365, 201522, 150584, 132236, 110976, 73893, 110022, 131154, 177654, 174569, 125232, 77451, 99651, 88432, 109420, 55743, 65163, 57887, 31432, 44992, 70728, 59788, -222, 42425, 61207, 94791, 101478, 116856, 95209, 118754, 139606, 128151, 112863, 138513, 187982, 186355, 157503, 148417, 102187]
18778A02187j4351q345j1931K216R150n0189Q3872L5592o3885n0221p0554O3757
18766B7298L4003K4791j1839n8081o1793j1216N5738N0933j3374l8760j4803M2496
18754B5393L3210n8462n3820k0722L9993M0706M0561J9113l8917k8636Q148j9637
18742a3070m1333N5757K8303J414K8156L1106m5773n5689j382L1688k529J108
18730A7756j8575j7376j1961j1155k3522L5380j5901K4771N0681L5690j1497q218
18718D6073J4056k7768p4516l1284M2427J8319M6582r612l0001K5376J1183j8158
18706A2677J3854J6253J4284k8804J3168N7255j484n9986L1782J7263P2885Q9584
18694B48731P5566P2942K8266n8361l6419m4987l9102m9449p0146m471k8802j1182
$$ y = [102187, 87836, 79491, 67560, 69776, 78926, 28737, 112609, 148201, 84316, 34095, -36459, 27298, 61301, 86092, 74253, 16172, -45621, -56837, -1099, 49834, 36460, -2300, -17103, 25393, 58603, 141, -53679, -74401, -34408, 6298, 46859, 65972, 27055, -1581, 6567, -13070, -54403, 1354, 29657, 31071, 59227, 90333, 44560, -11129, -12511, 19177, 16648, 17756, -819, -18195, -30156, -41311, -64833, -29453, -45354, -20583, 30098, 65788, 54291, 46073, 60129, 32361, -42155, -73439, -31012, -12693, 33889, 24277, -5724, 19652, 30835, 12677, 26531, 42784, 57068, 28264, 41432, 98687, 97203, 37217, 68999, 86262, 159147, 248731, 324297, 397239, 425505, 367144, 330725, 285738, 246636, 197187, 127041, 122570, 93768, 82586]
18682H2586l7246m033O7212q209k4897l001N5263R577K0515P2009K7206L3842
18670B90824M7400N9983R819k0676p677Q73m0171k1320M322J0798L663J8902m8577
18657C08163k2864m2202o4075O428q595K0307K7952O556l8612l3282m786L2697
18645A87687J7371J239P712P871M0599L9061m79L1282O2827j1479j3726k9794
18633C40171q6780Q67p4709n4074M4362m282j130J1411n8498m0936M1189Q131
18621A25722j4881J6060R956M2664K1322l1675l1193k4998o4133o7538K3967P2394
18609G7667M8286N2452l3147K7165n596j9282n0490k5332j1517M030L9092J7221
18597A20549j0792p1680m482M6424k8319k9216l1440j3151p384K0516j5349l0113
$$ y = [82586, 45340, 41307, 108519, 100310, 75413, 72412, 127675, 137252, 157767, 229776, 256982, 290824, 338224, 398207, 408026, 387350, 379673, 380546, 340375, 319055, 323377, 334175, 337838, 356740, 308163, 285299, 243097, 179022, 185450, 176855, 197162, 225114, 231670, 193058, 159776, 154990, 187687, 205058, 206297, 214009, 221880, 262479, 301540, 301061, 332343, 395170, 383691, 369965, 340171, 253391, 254258, 179549, 125475, 169837, 165555, 164425, 175836, 117338, 76402, 117591, 125722, 110841, 126901, 136857, 179521, 200843, 169168, 137975, 112977, 48844, -18694, 5273, 77667, 125953, 178405, 145258, 172423, 166827, 147545, 97055, 71723, 60206, 64236, 103328, 120549, 109757, 38077, 33595, 80019, 51700, 22484, -8956, -22107, -29491, -8975, -24324, -54437]
18585e4437J4710K3070K4967k5718l0849M7807J1698l7012l5350M2822P8319K4593
18573H4620m290k8314l7832M7201M491J2142Q440m236J01741N4010N1923P1905
18561C61801Q8455N1588r1071j00477J7740P3600M8849q193l2131k9886m7006
18550C33269n8925n6788p5397j5582L0129N720n6877n3265N8762O7166L7396j205
18538B14403l463J9085j2595j1685N3983Q8488Q0540J3047J0615k8623k1610m786
18526C97399K9935k0583P9701q957m3731J2805m364q655o5855r7750k5827J8031
18514B62149l1097m6045n1106m1239K9304K800l3719m5577M6117M7380N2819J7189
18502B08975j105l4666n5021J5066J2623j4832l5612k9035m1446J2240L7603k1826
$$ y = [-54437, -39727, -16657, 8310, -17408, -48257, -450, 11248, -25764, -61114, -18292, 60027, 84620, 80330, 52016, 14184, 61385, 65876, 78018, 86458, 82222, 183963, 237973, 289896, 361801, 450256, 501844, 410773, 310296, 328036, 401636, 450485, 442292, 410161, 380275, 333269, 274344, 217556, 142159, 126577, 156706, 162426, 105549, 52284, 111046, 178212, 215608, 214403, 210940, 230025, 217430, 205745, 259728, 348216, 428756, 441803, 452418, 423795, 402185, 397399, 427334, 406751, 486452, 477495, 433764, 446569, 442205, 433550, 367695, 269945, 244118, 262149, 231052, 185007, 133901, 92662, 121966, 124766, 91047, 45470, 91587, 138967, 191786, 208975, 207870, 173204, 118183, 133249, 145872, 131040, 95428, 66393, 24947, 37187, 74790, 52964]
18490E2964K7267J2810J2289J1809P608p296M540m5439J9579l5673m9771l4682
18478b3995n0810P2307Q1721l4933p7009k5605k4382J0361N0332j2111K2057M9166
18466C7099K9027j116m9961M583K7292P9788l4525m4684j3222n4116L3994K2270
18454C6429o3798n4902j2986J3767P5555O4169J4020l3386k1394j4417k6146k9621
18442e2710O1694P3536k754k7790L914l0612l0567K7948j9920R628L4638r650
18430C7355K4304M8386k3714k0235k7906K8456j8367L3761j7338M081Q0318P4965
18418B24066L0927N470n3639j8607j3292k2074n20n5688J2823l0878p3289M601
18406I900L4560k9614l0131n819O706K1111j6004q147p405J8677L9720M0554L1979
$$ y = [52964, 80231, 93041, 105330, 117139, 124747, 117451, 121991, 76552, 96131, 60458, 10687, -23995, -74805, -2498, 79223, 44290, -32719, -58324, -82706, -72345, -22013, -34124, -12067, 37099, 66126, 65010, 15049, 19632, 46924, 126712, 92187, 47503, 34281, -19835, 14159, 36429, -27369, -82271, -95257, -81490, -5935, 58234, 72254, 38868, 17474, 3057, -23089, -52710, 8984, 82520, 79766, 51976, 55890, 25278, -5289, 22659, 2739, 12367, 47005, 37355, 61659, 110045, 86331, 66096, 38190, 66646, 48279, 82040, 64702, 68783, 149101, 224066, 254993, 260463, 206824, 188217, 174925, 152851, 152331, 96643, 109466, 78588, 5299, 9900, 44460, 14846, -15285, -21104, -14398, 6713, -9291, -17438, -24843, -6166, 33554, 74108, 106087]
18393A06087L6017J7379j0948n522l1032M7192K3656j8154o1590J0141J097O8976
18381A83299L5591k3409j3137J2976J3655n8717K5532O4476l3628k5941o1184
18370A19513k7684k2204P9581M3194J0429k0785r701P1293L6986k5658j1334O4945
18358C08575L3665j6869N59m2861q5701L3483L7106K3559K9898m9006r8446L816
18346A77778J5468J327l2548N0652L434K030Q259K9640K9743K3358L9393Q627
18334C57161j6734n3622k7947K0476L9029j664l0735l2267l5778K8123Q7334o859
18322C26517j5153M9941J8950O855j4777L233P1743k1758J7707K0373Q1005P4142
18310F18778J2096K692M1223N4840J8447R0723Q5581J42118K68183K27884K81981
$$ y = [106087, 142104, 159483, 148535, 143013, 111981, 159173, 182829, 164675, 103085, 113226, 114323, 183299, 218890, 195481, 182344, 195320, 208975, 150258, 175790, 240266, 206638, 180697, 119513, 91829, 69625, 149206, 192400, 202829, 182044, 172343, 243636, 280622, 254964, 243630, 308575, 342240, 325371, 325930, 283069, 197368, 230851, 267957, 291516, 321414, 272408, 173962, 177778, 193246, 194573, 162025, 212677, 216111, 218141, 226400, 256040, 285783, 309141, 348534, 357161, 340427, 286805, 258858, 279334, 318363, 316699, 285964, 253697, 217919, 246042, 333376, 326517, 311364, 361305, 380255, 387110, 372333, 375566, 447309, 425551, 443258, 463631, 544636, 618778, 630874, 633566, 674789, 729629, 748076, 838799, 924380, 1066498, 1334681, 1562565, 1844546]
18299A844546K20986K31041J85936J44089J03822J0738n9541j40394j70002j93466
18289B177755j60583j36300j41180q7845k1368k5585l7452N2416N0164O1692R8027
18278A829741J44194K03885K43580L15923K43799K34642K34142J91780J81170
18269C822856J17163P0033N7123O2988O641j30666k04411k23381k35578k29082
18259C113686k57118k10703j79581j77857j74545j40377j12188r3484q1884j4613
18249A671336N7026P8676J04492J88130J81586K25093K48185K35719J13484J8490
18239C122217l4529l0102j15686j74545j11036j50607j88351j92492j61053p6596
18229A887220o5918j17036l5144M7K3707K4038p8374k9978L0488J22846P9561
$$ y = [1844546, 2065532, 2296573, 2482509, 2626598, 2730420, 2741158, 2681617, 2541223, 2371221, 2177755, 2017172, 1880872, 1739692, 1651847, 1630479, 1604894, 1567442, 1619858, 1670022, 1731714, 1829741, 1973935, 2177820, 2421400, 2737323, 2981122, 3215764, 3449906, 3641686, 3822856, 3940019, 4010052, 4067175, 4130163, 4136804, 4006138, 3801727, 3578346, 3342768, 3113686, 2856568, 2645865, 2466284, 2288427, 2113882, 1973505, 1861317, 1767833, 1685949, 1671336, 1728362, 1807038, 1911530, 2099660, 2281246, 2506339, 2754524, 2990243, 3103727, 3122217, 3087688, 3057586, 2941900, 2767355, 2656319, 2505712, 2317361, 2124869, 1963816, 1887220, 1821302, 1704266, 1669122, 1669169, 1692876, 1716914, 1638540, 1608562, 1639050, 1761896, 1841457]
18218A841457J12597J34059L1004j6621k4858j31777j43171r4782n5897o5114
18208A586897p2646j5011L9825m0304J8653P0877K5332J00965Q0600J34527R3748
18197B023463R5158J46796J74718J99241K23455K06137J78734Q0536K8491M7508
18187C404237O8374J04703O2977j3646k4231j210K8208M5423O3115J40827K36267
18176D115044K39064K57185L57364L62313N21423P18118Q33539J080629J472675
18167I957354J968249K651683L589907M963776P240029J0716637J3921166J2736516
18159F7745317Q404160M114455R5784o142450j2077941j4800885j2248419p956157
18151B7133864m797919k885272j686335q27578l17810J46323O17841J168827J753391
$$ y = [1841457, 1954054, 2088113, 2119117, 2102496, 2077638, 1945861, 1802690, 1707908, 1652011, 1586897, 1514251, 1499240, 1539065, 1498761, 1517414, 1588291, 1613623, 1714588, 1795188, 1929715, 2023463, 2118621, 2265417, 2440135, 2639376, 2862831, 3068968, 3247702, 3328238, 3356729, 3404237, 3472611, 3577314, 3640291, 3626645, 3602414, 3601204, 3629412, 3674835, 3737950, 3878777, 4115044, 4354108, 4611293, 4968657, 5330970, 5852393, 6570511, 7404050, 8484679, 9957354, 11925603, 14577286, 18167193, 23130969, 30370998, 41087635, 55008801, 67745317, 76149477, 80263932, 80359716, 74217266, 62139325, 47338440, 35090021, 27133864, 22335945, 19450673, 17764338, 16936760, 16618950, 16765273, 17383114, 18551941, 20305332]
18142B0305332K620076L830274N630719Q181092J1559510J3262795J1313119P789477
18134H4492394M801101J323442k671081m860152k524126K073134L393644J919538
18126H7947894k22328l620409q560646j2807147j3564605j0630339p075346m589427
18118B6877647l034053j981583j234867p08472k81148J73061O04308J289484K209862
18109B3914239L415640N189397P943688J1354499J2045228Q721392M560747J325386
18101G8470216l811538r561515j3607101j2914523r091056n755218l639406k411862
18093A7677997j799153j402838j188098j015670q71773p36853o84878n55100n26622
18084H897012m36160m01278m11468l51300k36238k21109k57866k41900j69069
$$ y = [20305332, 22925408, 26755682, 32386401, 40567493, 52127003, 65389798, 76702917, 84492394, 89293495, 90616937, 87945856, 83085704, 80561578, 82634712, 86028356, 87947894, 87725566, 84105157, 75544511, 62737364, 49172759, 38542420, 31467074, 26877647, 23843594, 21862011, 20627144, 19918672, 19637524, 19810585, 20414893, 21704377, 23914239, 27329879, 32519276, 40462964, 51817463, 63862691, 72584083, 77144830, 78470216, 74658678, 65097163, 51490062, 38575539, 29484483, 23729265, 20089859, 17677997, 15878844, 14476006, 13287908, 12272238, 11400465, 10663612, 9978734, 9423634, 8897012, 8460852, 8059574, 7648106, 7296806, 7060568, 6839459, 6581593, 6339693, 6170624]
18075F170624j44632j55410j40559j62252k14577j24469j53816k11882j54886
18066D708141j67542k25915j82816j65714k01071k21307k19374j93963j25135
18057C005304j18408k31995j64971j11092q6819k5993j30078j15826l3270q6933
18047A899919q3687p5606q9133k3093q987m1297p2222o7382j2885o7799n9247
18036A298581l3957k2868m2445n1074m7843M964J7883n4541o7744q3073R555N1036
18024I78474j6392k9202o2087o0938k0742K1152j20069p7846L8954O2145l184
18013G10265K4473m5684j9165l0194j61N6356J8984L918K357m4153K3849K9281
18001G30126n1039l2337m30m6576m1959l355m951m9009m1247p5386o4662Q750
$$ y = [6170624, 6025992, 5870582, 5730023, 5567771, 5353194, 5228725, 5074909, 4863027, 4708141, 4540599, 4314684, 4131868, 3966154, 3765083, 3543776, 3324402, 3130439, 3005304, 2886896, 2654901, 2489930, 2378838, 2292019, 2266026, 2135948, 2020122, 1986852, 1899919, 1816232, 1740626, 1651493, 1628400, 1619413, 1578116, 1505894, 1438512, 1425627, 1357828, 1298581, 1264624, 1241756, 1199311, 1148237, 1100394, 1105358, 1123241, 1068700, 1000956, 917883, 927438, 978474, 962082, 932880, 870793, 809855, 789113, 810265, 690196, 612350, 651304, 713449, 710265, 734738, 689054, 669889, 639695, 639534, 695890, 714874, 718792, 721149, 676996, 700845, 730126, 679087, 646750, 646320, 599744, 557785, 554430, 549479, 500470, 459223, 383837, 319175, 327925]
17989C27925N5088p370o9625p339K5398K5064L2746k3777n753l2360K340j8789
17977C03548n4703J9022j1640l5884N8557J2164J9722o509m2497P269j9105o7032
17965A82912p980k8061M029J3316K8096Q884k5599l5994O310l8822J7026O3742
17953A87859m9165J6232j4266k6646o0194J0115O8635Q1952K5020l1916p7195
17942A30431N59P9910K8785M0539K7442k5170P814M7100o1429m9249k9241m7115
17930A50376j4832L8338O3085k8460K3181M279p8867O802J6355j3449k944j8847
17918A45017N2064N5544L0878M4334p038J7079o5177j16910O478J0051O8199n119
17906B35400m1196l3478p233N4775M7609m5224j46065k8940K942K5369K3649J1130
$$ y = [327925, 383013, 375643, 306018, 298679, 324077, 349141, 381887, 358110, 352357, 319997, 322337, 303548, 248845, 267867, 256227, 220343, 278900, 291064, 310786, 304277, 261780, 269049, 249944, 182912, 174932, 146871, 150900, 164216, 192312, 201196, 175597, 139603, 145913, 107091, 124117, 187859, 138694, 154926, 140660, 114014, 53820, 63935, 132570, 214522, 239542, 207626, 130431, 130990, 210900, 239685, 280224, 307666, 282496, 290310, 337410, 275981, 226732, 197491, 150376, 135544, 173882, 236967, 208507, 231688, 235967, 157100, 163902, 180257, 166808, 163864, 145017, 197081, 252625, 283503, 327837, 320799, 337878, 272701, 155791, 162269, 172320, 240519, 235400, 194204, 160726, 153493, 208268, 255877, 210653, 64588, 35648, 38590, 63959, 87608, 98738]
17894I8738K0231r831K195K1474j5849O706n4087J0656j0598J6310O2486M4130
17882A92561n337L5747K5326j18022l2008l4626R327K0953N775k4763k4690K5847
17870G6090K0135n4553q103J3202k4791J3836j8655m900J3044k7709j6017K2669
17858D248J8876o075K1232k8515K3589J8075J2249l0207j2833K1901j9773K510
17846B5277o2670n9722M519J4997J07137M9198o8044o4673j3576j1532J5312J14726
17834E0949M8632n0841N875K3645J1414K5673l224k0242m8889J0772K8971L9850
17822A22585o6054J6941J679k9696n3436j0426K8709J7908j4508m4545p511K404
17810c5950Q132K9030n267m1097l365J9747J7863J7408j3440k3493k0277r605
$$ y = [98738, 118969, 109138, 111333, 132807, 116958, 123664, 69577, 80233, 69635, 85945, 148431, 192561, 187224, 222971, 248297, 130275, 98267, 63641, 72968, 93921, 99696, 74933, 50243, 76090, 96225, 41672, 33569, 46771, 21980, 35816, 17161, 12261, 25305, -2404, -18421, 4248, 23124, 17049, 38281, 9766, 33355, 51430, 63679, 33472, 20639, 42540, 22767, 25277, -37393, -97115, -92596, -77599, 29538, 78736, 10692, -53981, -67557, -79089, -63777, 50949, 99581, 48740, 54615, 78260, 89674, 115347, 112123, 91881, 42992, 53764, 82735, 122585, 56531, 73472, 75151, 45455, -7981, -18407, 10302, 28210, 13702, -30843, -38354, -35950, -27818, 1212, -4055, -45152, -48517, -28770, -10907, 6501, -6939, -30432, -50709, -60314]
17798f0314l801L7459l3444n59O2261l009m8388n4418m2123j0232P5663L5249
17786d5656l7799N2086P4860l5816M964n288P70L2035Q413k109O413Q154o642
17773E4385o6679j4011M9948M6556j4300p48J3251m4472k9228r103l8122k1609
17761g4132P5188K9581m345o9618p1077J7670j9645K5483Q594K7498k7806m8641
17749a31250J6502O3194M7899M2694m4644j8336o4774k2036K9527l230O3229M2938
17737B1713j318q416k2187j9564j5392L7350k7231n1155O1552N7610M8038j7811
17725F3189j4556k5938m947J021m8777j5647k9140P0955O3155K0428n2839p3692
17713d6788j760L3439j7023j2863M8012M9043j8724m3739J3739l5541k9743J4592
$$ y = [-60314, -64115, -26656, -60100, -60659, 1602, -1407, -49795, -104213, -146336, -156568, -80905, -45656, -83455, -31369, 43491, 7675, 12639, 7351, 8121, 40156, 48569, 46460, 52873, 61027, 54385, -12294, -26305, 23643, 70199, 55899, 55151, 68402, 23930, -5298, -14401, -52523, -74132, 1056, 30637, 26292, -43326, -114403, -96733, -116378, -90895, -82301, -54803, -82609, -131250, -114748, -51554, -3655, 39039, -5605, -23941, -88715, -110751, -81224, -84454, -21225, 21713, 20395, 11979, -10208, -29772, -45164, -7814, -35045, -86200, -24648, 32962, 81000, 63189, 48633, 22695, 17748, 18769, -30008, -45655, -74795, -3840, 59315, 79743, 26904, -46788, -48548, -15109, -32132, -44995, 3017, 52060, 33336, -10403, 3336, -32205, -61948, -47356]
17701d7356K9197Q973J0169j0351n7670l0033L6370K1123k2669o319J0527J5689
17689d2350n789k7218j1424K0969j9403M489J5901j1721L7460j1429M2149J8710
17677A0344j7658j7612L0438j6006O593K5716n8466m1769M7136Q4421K8477O270
17665H7884m221k9493q6409q7108J4599O9179K8898l381r197J5867j2341P0721
17653E4998R110o9356j1124q084K1119j0877j1799M0837N7543o0498Q453K8393
17641D8715n965o960l4715k5727K4152L6431j3408o6177j6719J8621m722K7733
17629a8741P8806l9699R189Q5611P2044l4816k9214K3323N6255O5062L060n9177
17617B11703k2946J2183k1627p521J405n2519k9165k5571K0950k5802N442K8877
$$ y = [-47356, -18159, -9186, 983, -9368, -67038, -97071, -60701, -39578, -62247, -68566, -58039, -42350, -48139, -75357, -86781, -65812, -85215, -80726, -64825, -76546, -39086, -50515, -8366, 10344, -7314, -24926, 5512, -10494, -3901, 21815, -36651, -78420, -31284, 53137, 81614, 87884, 83663, 54170, -32239, -119347, -104748, -35569, -6671, -10052, -19249, -3382, -15723, 54998, 64108, -5248, -16372, -24456, -3337, -14214, -26013, 14824, 72367, 11869, 20322, 48715, 42750, 35790, 1075, -24652, -500, 35931, 22523, -43654, -60373, -41752, -46474, -18741, 60065, 20366, 29555, 115166, 187210, 152394, 123180, 146503, 202758, 267820, 270880, 211703, 188757, 200940, 179313, 171792, 173197, 120678, 91513, 65942, 86892, 61090, 66532, 95409]
17605I5409N0103K7330O3503K9873m5905k3878n1849q547J19088M3736K6084N8390
17593C83337J8472K5252o1129n4708K7426N5049J123L5868k3630o1432J2571k0123
17581C38076N47o7347q49r060j53824q5123k0614k287M9685R0984j6065o4935
17569E9188L8784J6573P909L3036M0640J4293N9963N092J1986k9568j244l6830
17557B19822l9359J035o9626o9003j3620L9860J6195K1579k1805q0636L1626J8502
17545E4570L4499P082m4290l742k1735k4345k6843J2673K2266k6745J1653Q468
17533C511L9338N372k9414m0415l8731K0794j6274P524r985M1501J444m2242J8320
17520c9257l6614K5427J4286L1357O760l1917k5096m0851K0140P8043M3318k8613
$$ y = [95409, 145512, 172842, 236345, 266218, 220313, 196435, 144586, 136039, 255127, 298863, 324947, 383337, 401809, 427061, 365932, 311224, 338650, 393699, 394822, 430690, 407060, 345628, 358199, 338076, 338623, 271276, 270427, 261367, 107543, 22420, 1806, -481, 49204, 140188, 124123, 59188, 97972, 114545, 122454, 155490, 196130, 210423, 270386, 275478, 287464, 257896, 256652, 219822, 180463, 181498, 111872, 42869, 29249, 69109, 85304, 106883, 85078, 4442, 36068, 54570, 89069, 96151, 51861, 48119, 26384, 2039, -24804, -12131, 10135, -16610, -4957, 3511, 42849, 48221, 18807, -21608, -60339, -39545, -55819, -48295, -58280, -16779, -15335, -57577, -39257, -75871, -50444, -36158, -4801, 1959, -29958, -55054, -95905, -75765, 2278, 45596, 16983]
17508A6983K1166n207l4666l0935J1615p1179l1219L6961j1449l8832M2187O8762
17496b5813R1823k4139p9445L829j9948k909L3160M9358l4974K4888M0655j4630
17484D1855R522n877n6730J0520L7811j2036k5914l9922m215p2614j1011k2708
17472a51319N8261j7966j6072Q304K4455J6009K4721L2682P6595m6919m7253l3776
17460g2278K1087J32569J7153q8424j5044l0727o2026O9646P6518j0969m4550
17449g045n0343j1912L595L6429N1234P3344P969r3617n0677N1143K8490l4271
17437D339k9388P439j236m6644O529k953j6793N811P5784p496l3468p449k9789
17424g5314J2775J5437r405K5319J8370L009J2518P179N0519K6990m6781N653
$$ y = [16983, 38149, 32942, -1724, -32659, -21044, -92223, -123442, -86481, -97930, -136762, -94575, -25813, 66010, 41871, -37574, -33745, -53693, -56602, -23442, 25916, -9058, 15830, 56485, 41855, 51377, 45500, -11230, -710, 37101, 25065, -849, -40771, -44986, -117600, -128611, -151319, -93058, -111024, -127096, -118792, -94337, -78328, -53607, -20925, 55670, 8751, -38502, -72278, -51191, 81378, 98531, 10107, -4937, -35664, -97690, -28044, 48474, 37505, -7045, -57388, -69300, -65705, -29276, 21958, 95302, 103271, 9654, -41023, 10120, 38610, 4339, -25049, -17610, -18846, -65490, -58961, -61914, -78707, -72896, 2888, -4608, -38076, -45525, -75314, -62539, -47102, -56507, -31188, -12818, -9809, 2709, 9888, 60407, 87397, 40616, 46269]
17412D6269j8784j0179m1068k563J4887k0755K4179K5372L809l5199m0971k5503
17400h0506l0820M4123K5813p459q512l5852m3525J5754N1753P713K4233M268
17388c3017l2388K3389N3734l4368J8165j964p0748P706L5882j6646J4501M7605
17376A1851o680K2104L7700Q479j0629k9736m8028k0139j9400l5231l5333P1737
17364e3305n608J1712Q9206K2414k9007J1323j9005j2476l2898K6188m3635q1425
17352a16516J8274M3678J9440J1994J1015j774J1133p6545j2629j7514j8666J8593
17340a09517j1619J0171N3555K2043L9138j5547Q647N662k7156k2469K1270P5621
17328D9799l36O380j143k9319k1190o704j22845m7068L6473M7051r162n522L1208
$$ y = [46269, 27485, 17306, -23762, -26325, -11438, -32193, -8014, 17358, 21167, -14032, -55003, -80506, -111326, -67203, -41390, -48849, -57361, -93213, -136738, -120984, -69231, -61518, -37285, -33017, -65405, -42016, 11718, -22650, -4485, -6449, -77197, -69491, -33609, -50255, -35754, 11851, 5171, 27275, 64975, 73454, 62825, 33089, -14939, -35078, -54478, -89709, -125042, -53305, -58913, -47201, 42005, 64419, 35412, 46735, 27730, 15254, -17644, 8544, -35091, -116516, -98242, -54564, -35124, -23130, -12115, -13889, -2756, -79301, -91930, -109444, -128110, -109517, -121136, -110965, -57410, -35367, 3771, -11776, -3129, 2533, -24623, -47092, -25822, 49799, 49463, 55843, 54700, 25381, 4191, -2513, -125358, -172426, -135953, -88902, -98064, -103586, -72378]
17315g2378l2193K3679r315M3125l0711L113L0947o944l3633n677L1808L9501
17303a8678m7880k2095K4342J7452n9266j5802K1646j5105J4198N9568M0504L2754
17291C1638n3553j9583L8205l781j6515K2915l5232J3921K9701n3119K1394K0955
17279c054J6129m6680j5845J3732j9683L5264k9021l2954O766j8741K252p157
17267i8992K0066J1657N1047k7082M542Q0650m1115K3607m0514p8832j8806k4982
17255a38754k1585J3270Q3266j8118j2457J7922M1535N3199K9992k4314n2903
17244b8947n7167M2264P0031O594l0863l8131p091L6202J056n6320r754M2435
17232b9691L3346l3678q0472l6433O4273n626M105J0526j4671o3889K4810M3884
$$ y = [-72378, -104571, -80892, -90207, -47082, -77793, -74680, -43733, -50677, -84310, -89987, -58179, -18678, -66558, -88653, -64311, -46859, -106125, -121927, -100281, -115386, -101188, -41620, -1116, 31638, -21915, -41498, -3293, -7074, -23589, -674, -35906, -21985, 7716, -45403, -24009, -3054, 13075, -33605, -49450, -35718, -55401, -20137, -49158, -82112, -75346, -94087, -91835, -98992, -78926, -67269, -16222, -43304, -38762, 41888, 773, 24380, -16134, -94966, -113772, -138754, -160339, -147069, -63803, -81921, -94378, -76456, -34921, 18278, 48270, 23956, -28947, -86114, -43850, 26181, 32775, 1912, -36219, -43310, -7108, -6052, -62372, -72126, -29691, 3655, -30023, -110495, -146928, -82655, -88281, -84176, -73650, -88321, -152210, -127400, -83516]
17220h3516q564p924L3098r450K3612q700L579l7542k7856k5856K0366M0150R18
17207h7685k4508K6743K1618J3181l2454Q7428O4018k686k0897k5661J4739P509
17195D1345j6142m8091m9775M4333L9113J8330r0542n0417N5463K093j0753m329
17183f9372N5308M6057j2214l8993j3077l6539J6750l833N4410M7207p6489j2240
17171d3025M8399L7148J5881l1711k6389l2470K490l7824m7747m2553J9041j5051
17159a53811L5155N5956L1267J4786k1117p077q164J8125J8822l3094m9027m470
17147a02649N9527M738K777O0349j8698m459R696j0242k7475J882J9271J552J7226
17134A3495N9871M852o9828j57564o4645N1387O5541R4889Q0174j8836r1204J7043
$$ y = [-83516, -92080, -100004, -66906, -76356, -52744, -61444, -57865, -95407, -123263, -149119, -128753, -88603, -87685, -112193, -85450, -63832, -50651, -83105, 4323, 68341, 65655, 44758, 19097, 33836, 41345, 25203, -22888, -72663, -28330, 10783, 29113, -61429, -111846, -56383, -54290, -65043, -69372, -14064, 31993, 19779, -19214, -32291, -68830, -52080, -55913, -1503, 45704, -30785, -43025, 5374, 42522, 58403, 26692, 303, -32167, -29677, -67501, -115248, -157801, -138760, -153811, -118656, -62700, -31433, -16647, -37764, -44841, -53005, -34880, -16058, -49152, -98179, -102649, -43122, -38384, -35607, 24742, 6044, 1585, 11281, 1039, -26436, -24554, -5283, -3731, 13495, 73366, 78218, 8390, -149174, -213819, -162432, -96891, -2002, 78172, 59336, -31868, -14825]
17122a4825L1951k2923k3311m3394j1263l3903M2029K4856k0040p7859q0695O723
17110b22654Q6877N299J7983L7875M096n772M218l7326J816M3269k348m1714m608
17097a12989r829j4214M5770j4532o118O512O211j7695J4773M9915J5553J7031
17085a9612j7735m768L1103J6396l7849m8851L2201P039o5273l1364L0597R242
17073i8874N0577L1669n4889n0291n1397J7221J1939Q1213J7929K9887J0562L7447
17061C2993j471k2112K7146P600m0874m7990o911M5200J8702m8989n0958M4681
17049d2983k6579l7673l9604J8487O4789l2213l1915M4605M2524j8541K0699O3497
17037B5093J9169O751q8254k3129M3775Q444Q11j2631o5130m0489N4229Q0691
$$ y = [-14825, 17126, -5797, -29108, -72502, -83765, -117668, -75639, -50783, -70823, -148682, -229377, -222654, -135777, -130478, -112495, -74620, -70524, -76296, -72078, -109404, -107588, -64319, -66667, -108381, -112989, -122818, -137032, -91262, -105794, -111912, -105400, -99189, -116884, -102111, -52196, -36643, -19612, -37347, -42115, -11012, 5384, -32465, -81316, -49115, -42076, -107349, -138713, -108116, -98874, -48297, -16628, -71517, -121808, -173205, -155984, -144045, -62832, -44903, -15016, -4454, 32993, 31522, 9410, 36556, 44156, 3282, -44708, -51619, -6419, 12283, -36706, -87664, -42983, -69562, -107235, -146839, -128352, -63563, -95776, -127691, -83086, -40562, -59103, -38404, 25093, 44262, 51013, -37241, -60370, -16595, -8151, -7340, -19971, -85101, -125590, -71361, 9330]
17025I330K7046j6622o4730l4383Q3260K050n3486q9391L4083K7614N1342J1656
17013a2231O1054j9275j8837j5734k3004j1698L5369L641J6155P04k1099j0112
17001a5067K7763R010l2018l2257J6390K4532j9726l0056J2097N3582m1800m8640
16989g6190j3104P2743P0068m9123l5857K9049M8664o0083k1628M3266k5443k9488
16977d7126l9631Q749L6999K1103L7215J3858n7344J5537q632k8996l4868L2193
16965e0943M7749L0999j5357l1802R2164J4357m1841m6010p7810J5510L139R220
16953e0625P1856k1912n5618R401N002K562Q5271L2895j5065j07072n7394l078
16941a03777K3077j9871K395N1930l1198j4094j794j8235K9929M1493N1070j6824
$$ y = [9330, 36376, 19754, -44976, -79359, 3901, 5951, -47535, -136926, -102843, -75229, -23887, -12231, 48823, 29548, 10711, -5023, -28027, -39725, -4356, -715, 15440, 16144, -4955, -15067, 12696, 21706, -10312, -42569, -26179, -1647, -21373, -51429, -39332, 14250, -27550, -76190, -89294, -16551, 53517, 4394, -31463, -2414, 46250, -13833, -35461, 7805, -17638, -47126, -86757, -78008, -41009, -19906, 17309, 31167, -26177, -10640, -19272, -48268, -83136, -50943, -3194, 27805, 12448, -19354, 72810, 87167, 45326, -684, -78494, -62984, -59845, -50625, 21231, -681, -56299, -46898, -41896, -39334, 45937, 78832, 63767, -43305, -100699, -103777, -80700, -100571, -98176, -46246, -77444, -91538, -93332, -111567, -81638, -40145, 10925, -5899]
16929e899N6072l2953n7464k9698J8294l3494j1609J1648m6592J8057J3043J3079
16917h7516R9046k95l9672k68j6217J254M6934J526o8580m8707J7725m547l1187
16904a30504K612L3267j0174P1500Q5704J0948o0858k5484J6002M863o4222k5928
16892i2274M8423L991j0666o024N5311j031k8341l3684k1599M0521M2942m0859
16880d3290q6350K1282M4252K300k2078N0412M9498P260L307k3965p8475M4854
16868c0993L4796q17j217J719o0414l7205M2162K8243J8393r40l5600n9024m0117
16855a41014o012K8349N0721N4510l2525n6113n967j7543p4044m1830P9485N0686
16843a11297l276K202J0270K273L9851O5180M5121l0416n2159j6714M1036n9479
$$ y = [-5899, 50173, 17220, -40244, -69942, -51648, -85142, -96751, -85103, -131695, -113638, -100595, -87516, 11530, 11235, -28437, -28705, -44922, -43668, 3266, 4792, -63788, -112495, -94770, -99317, -130504, -127892, -94625, -104799, -33299, 52405, 63353, 2495, -22989, -6987, -2124, -66346, -92274, -43851, -39860, -50526, -56550, -1239, -2270, -30611, -64295, -85894, -45373, -2431, -43290, -129640, -108358, -64106, -61806, -83884, -33472, 16026, 23286, 26593, 2628, -75847, -30993, 3803, 2986, 1769, 3488, -56926, -94131, -51969, -23726, -5333, -6273, -41873, -100897, -141014, -147026, -118677, -67956, -13446, -45971, -102084, -108051, -125594, -199638, -241468, -161983, -111297, -114573, -112371, -102101, -99828, -59977, 5203, 50324, 19908, -32251, -48965, -7929, -67408]
16831f7408m3506L0784J8150r230J9651L8700j5564m3664J445L6401q728M0075
16819b894N3325K6695q0361l899O473K542J6016m0928j6774K4338N621J4529q654
16806c971l9644J6862j1870K7429L0132K7218n0660j6280O9243L6573k0664n744
16794E8624J0503O83n2483j4194j1972O800j2734J1629l5156j724M7059j3150
16782f115m0606J6995p172L1739J8969K9250k3788l2250q6546m5660O8764K2888
16770e3532j1775J0847J6001j7746R054Q230J4165o3683n43N5398L0640M2509
16758C9565l1759m9563L2036k2271K6340j3864Q0390L4773l7570r840k3385j037
16746B3815n8555l4798p75K9221M3561L6298L9830N888k5506o1217k5683P7162
$$ y = [-67408, -110914, -80130, -61980, -71210, -51559, -12859, -28423, -72087, -70642, -34241, -42969, -2894, 50431, 77126, -3235, -7134, -661, 1881, 17897, -23031, -39805, -15467, -9846, 4683, -3971, -43615, -26753, -38623, -11194, 18938, 46156, -4504, -20784, 48459, 85032, 64368, 58624, 69127, 69810, 17327, 3133, -8839, -2039, -14773, -3144, -38300, -40024, 7035, -6115, -46721, -29726, -36898, -5159, 13810, 43060, 19272, -12978, -99524, -145184, -76420, -53532, -65307, -54460, -38459, -56205, -47151, -38921, -24756, -88439, -88982, -33584, -2944, 39565, 7806, -41757, -9721, -31992, -5652, -19516, 60874, 95647, 58077, 48237, 24852, 23815, -34740, -69538, -70313, -41092, 2469, 38767, 78597, 84485, 58979, -2238, -27921, 49241]
16734D9241j2503N5235M5187n1441n0262J3098l3128K0740L6244J4354J9430K5848
16722A32043N1036j0390m3660L3758L3187j1266p5079L5988L9327J1984J06678
16711C03606M1518L5483L4094N2084M4013O4637P1964O8446N4477M0374K0518
16700H31214K0987J4256j4077p4469n6728o9034n4475j4819K1058r1573j07528
16689D04812r6676o3504M4555l5185n1513m6341K7007K6695J0236J6819m2432
16678A94473k2993j8952q6546j1489K4289j041m1143k2624M72j7587q141M4096
16666C2814L7773k1685m7689Q521K2871J7115m2348j2030J8102J7975l4726O48
16654b659j4058N0298n6664l8325Q253m0131O6695M710Q535N650J089j9991K1655
$$ y = [49241, 36738, 91973, 137160, 85719, 35457, 48555, 15427, 36167, 72411, 86765, 106195, 132043, 183079, 172689, 129029, 162787, 195974, 184708, 109629, 145617, 184944, 196928, 303606, 345124, 380607, 414701, 466785, 510798, 575435, 647399, 715845, 770322, 810696, 831214, 852201, 866457, 852380, 777911, 721183, 652149, 597674, 582855, 603913, 512340, 404812, 308136, 244632, 289187, 254002, 202489, 156148, 183155, 209850, 220086, 236905, 194473, 171480, 152528, 65982, 54493, 78782, 77741, 36598, 13974, 14446, -3141, -11282, 32814, 70587, 48902, 1213, 9734, 32605, 49720, 7372, -4658, 13444, 31419, -3307, -2659, -16717, 33581, -23083, -61408, -53155, -93286, -26591, -21881, -13346, -7696, -6607, -26598, -4943]
16641d943m791k8257j8729K6435j5175j1748k5906L1287M5229o477j7712J9569
16629a1218N4377P04J7733K9327o2077J8173N802J201l0132j2744N0066p205m8505
16616E502l5521k8405L0511j2165p87j8893n9068o4096M3132P1405O0062l1229
16604c9552l9250M370M8792N0704L416p7840M0413P89m705m5572l8170M6222M2941
16591g442Q349Q14K9251m3130m4624q609L3885L198l1320l6777l3073j3026P2271
16578g0233K4570q045K545K1366j8798q595R638j5093K1777m4472m7220Q5230
16566d7330M8791j049j6508n8763k9155L9782P723j5646l2153Q355K1897L7295
16554c6761m5094Q88M0756K3848N9r303O974J8748j3898j5257J9202J4655Q335
$$ y = [-4943, -9734, -37991, -56720, -30285, -45460, -57208, -83114, -51827, -6598, -13075, -30787, -11218, 43159, 43863, 61596, 90923, 28846, 47019, 52821, 54022, 23890, 11146, 61212, 54007, 5502, -30019, -58424, -27913, -40078, -40865, -59758, -118826, -182922, -139790, -68385, -8323, -39552, -78802, -74432, -25640, 25064, 28480, -49360, -8947, -8158, -12863, -58435, -96605, -50383, -7442, 907, 1721, 30972, -12158, -56782, -65391, -31506, -28308, -59628, -96405, -129478, -142504, -70233, -45663, -53708, -51163, -29797, -48595, -57190, -47552, -62645, -40868, -85340, -132560, -47330, 1461, 412, -16096, -74859, -104014, -64232, -56509, -72155, -104308, -95953, -74056, -36761, -81855, -80967, -40211, -16363, -16304, -25607, -18633, 115, -13783, -29040, -9838, 4817, 13152]
16541A3152m9333j5128N8330j0692J7303J640j7295l7997K9063M7987n0395l8670
16529e2035l8728K8722N4798M2091L0224k2599P239m1434r296j7007q236j4328
16517d0589j8359J2274J1249k0660J1066M3258k7669M4134m240n2863j2255m8891
16505a03545k7296L6220Q771P157J1545l041L5738N6688K0350o8592r149j256
16493c6410k2049J9292J2071J7371m4169L1873J6947K998P3757M5113m9056m032
16481F3706j6490j429j4523j0220J7850J4488k0587l4746l8252j5969J1161K4070
16469b0941N6957p8949l2562o6833l4402O6164N7020K8993r401j1098J6916k4434
16457e2570L0230K2735l6050p8789j1166J1448m465M2822J7013k6910K1428J2163
$$ y = [13152, -36181, -51309, 7021, -3671, 13632, 15272, -2023, -40020, -10957, 37030, -13365, -52035, -90763, -62041, -7243, 34848, 65072, 42473, 49712, 8278, -1018, -18025, -26261, -40589, -58948, -46674, -35425, -56085, -45019, -1761, -29430, 14704, 10464, -42399, -54654, -103545, -130841, -94621, -85850, -78693, -67148, -70189, -34451, 22237, 42587, -26005, -35154, -36410, -58459, -39167, -27096, -9725, -53894, -22021, -5074, -2076, 71681, 116794, 67738, 63706, 47216, 45787, 31264, 21044, 38894, 53382, 32795, -1951, -40203, -56172, -45011, -20941, 36016, -42933, -75495, -142328, -176730, -110566, -53546, -24553, -33954, -45052, -28136, -52570, -22340, 395, -35655, -114444, -125610, -114162, -118627, -75805, -58792, -85702, -64274, -52111]
16445e2111m359n1021j2168O8592K5150k595p4309l2267K7220O6299j677m7229
16433i0475j4525K8225K2670L5606o5307N2570O4645j0908j7904k4128l400J4573
16421h358n6703m1109K6174J06972J0516m3585k39m285k6785m3008l7883N9850
16409e8443N9454M9897M3277m8540o8926m3887J6701J7184p440j0344o017O1539
16397D455j8309O099l8643j0883L6567l5368R293k1902l773O6118L7399o4214
16385c3161J348J9289l0250l0842K162j9934l9100J6313l6982j9433N801N6306
16373a08483k7372J3132O7775Q598N62k2421Q248J2266j0060j6024K9958K0861
16361b2960K004k5678o240J2814J172o455M3996j219l0817j5615Q3101R045n8063
$$ y = [-52111, -56470, -107491, -119659, -51067, -25917, -28512, -102821, -135088, -107868, -41569, -43246, -90475, -105000, -76775, -54105, -18499, -83806, -31236, 33409, 22501, 4597, -19531, -22931, -8358, -65061, -106170, -79996, 26976, 37492, -6093, -6332, -10617, -37402, -80410, -118293, -58443, 1011, 50908, 94185, 45645, -23281, -67168, -50467, -33283, -40723, -51067, -57084, 4455, -13854, -7755, -46398, -57281, -20714, -56082, -46789, -68691, -72464, -6346, 31053, -33161, -31813, -12524, -42774, -73616, -71454, -91388, -130488, -114175, -151157, -170590, -164789, -108483, -135855, -122723, -54948, -46350, -45788, -68209, -59961, -47695, -57755, -73779, -43821, -22960, -20956, -46634, -52874, -40060, -38888, -45343, -1347, -2566, -33383, -48998, 34103, 43148, -14915]
16348a4915l8085M4816L1262l2018m7282n7231M2028R8676j0459l4410l5512o56
16336e3786l4415k5983J3423K1434o144m4477K0166N6916M6309n9077k6726k825
16324i5185j6146L9194J0005P5209K5301k1083j117l0195j3344j3874l4304k568
16312g8107J9088l1079k7400k3332K8146M0450P714l355L111R124O3661l594m689
16299b62r08n8485m5448m0629K5249O7246N7428j0975O831k4122n874M977k6525
16286e1497m4127l1227J6848Q3934M6457j8008o2747l4867J1053J1737J9381j7833
16274g0896m9411J5471N7934N0925J6696p2725l8864K3241N4035L4128k2437n2524
16262e4427r2794j3042M7598J11281M8270k3253q1714N76O0392J2396L6375k9130
$$ y = [-14915, -53000, -8184, 23078, -8940, -56222, -113453, -71425, 27251, 16792, -17618, -53130, -53786, -88201, -114184, -100761, -79327, -85471, -129948, -109782, -52866, -6557, -65634, -92360, -95185, -111331, -72137, -62132, 13077, 38378, 17295, 16178, -14017, -27361, -41235, -75539, -78107, -59019, -90098, -117498, -140830, -112684, -72234, -64520, -67875, -64764, -55640, 8021, 4427, -262, -1170, -59655, -105103, -145732, -120483, -53237, 4191, -6784, 47, -24075, -29949, -24972, -51497, -95624, -126851, -110003, -26069, 20388, 2380, -60367, -95234, -84181, -72444, -53063, -70896, -120307, -104836, -46902, 4023, 20719, -52006, -90870, -67629, -13594, 20534, -1903, -54427, -147221, -160263, -112665, -1384, 46886, 23633, -58081, -57505, 2887, 15283, 51658, 22528]
16250B2528j6069o144n0137M348n1301q3518Q0254J02433J1609N214l5019J8441
16238B639n4618l7691n3190k1702j0232L2359P2208j1534m970J4075J7900m910
16226e9666j3608K9853K2804l6364j9866J2393j90m8547R901Q3850L3587n970
16214H177k622l4158m3390j7112M4235J0993n2548P0876K2061p3900j4477k4931
16202a06796k4356L1573J0761l7771o2141j3626N8397j744J1406J1124J9613N8940
16190d4620L0798R395q507p7691L7173Q0247j7196L3754n771k2066l7822K6845
16178D539r546j4314l891j6087o1054K1438O3086M4451M3910o8277R157M449o2641
16165d4780N5987l9238r995k3455n1092j2020O5257L1084l4905l1676L3521J00495
$$ y = [22528, 6459, 315, -49822, -45474, -96775, -180293, -100039, 2394, 14003, 19217, -15802, 2639, -51979, -89670, -142860, -164562, -174794, -142435, -70227, -81761, -86731, -72656, -54756, -59666, -73274, -43421, -20617, -56981, -76847, -64454, -64644, -113191, -103290, -19440, 14147, 8177, 5555, -28603, -71993, -89105, -44870, -33877, -86425, -15549, 6512, -67388, -81865, -106796, -131152, -99579, -88818, -126589, -188730, -202356, -143959, -145703, -134297, -123173, -103560, -44620, -13822, -4427, -12934, -90625, -53452, 26795, 9599, 43353, 37582, 15516, -22306, 4539, -5007, -19321, -23212, -39299, -100353, -78915, -15829, 28622, 72532, 4255, 13412, 17861, -44780, 11207, -28031, -38026, -61481, -112573, -124593, -59336, -28252, -63157, -94833, -61312, 39183]
16153C9183L3543p8890k6486j6309j2735M6424K4383n829m4820k2142K9320M23
16141c3935Q932M2005j1720l1420o956K5493K7553l1227o3137m5266K4919n271
16129a00030o006L6385K1170n7802K1926j5218j3682N596M1819N8476J4133P812
16117A4579k8511L4127m856j0959l3281J5653K2916l8287l1028j2767L0677J1470
16105c0267j7955n236k9267M7449L2304K0947j6419j4516n7764K2117J5398l2001
16093f5210K450J4782M5493M069q8381m3009m894O0149N0345m2278j2883L9810
16081c9557j0600j2597l4454L8769J8807J5784K4336p790J9773o8211n2018k5441
16069a33199K7322K9246K3591J09918N144l0913j0883N3313l565m3713K7526r08
$$ y = [39183, 72726, -6164, -32650, -48959, -61694, -15270, 9113, 3284, -41536, -63678, -34358, -33935, -25003, 17002, 5282, -26138, -33094, -7601, 19952, -11275, -74412, -119678, -94759, -100030, -106036, -69651, -48481, -106283, -84357, -99575, -113257, -107661, -65842, -7366, 6767, 14579, -13932, 20195, 15339, 4380, -28901, -13248, 9668, -28619, -59647, -72414, -41737, -30267, -48222, -53458, -82725, -35276, -2972, 17975, 1556, -12960, -70724, -48607, -33209, -65210, -62760, -47978, -2485, 1584, -86797, -129806, -134700, -74551, -24206, -66484, -79367, -39557, -50157, -62754, -97208, -58439, -39632, -23848, 488, -7302, 12471, -55740, -107758, -133199, -105877, -76631, -53040, 56878, 62022, 31109, 20226, 73539, 69974, 26261, 53787, 52879]
16057E2879m0732L2511J1959p9178j48525J2379O2208O5244K766L6330M529j9912
16045g542R5L713j7288o0518N2356N7025j353m7259k3562k7016j1326J2173K329
16032f8173L0429l905L5107L3723L9383j6716m1938l897j2713J2931n2307l9375
16020h7451J6761J190K6204N4951m3106J7931j9366L784n0249j5001j3376L9346
16008f8382J7082k655K6785J3671k251K4123j6981k0133k3330k2882O646J8560
15996d9747O1848J00533K1238n8022o7537k7072J6524Q255R313j3503j5434j5954
15984b9558J0964K2222l4823l003p64Q896l4364L4418M0738O3795j9296o2679
15972c454K2407q348j1620L0869l2084p4652N1898M7479m4507k1889J1678N681
$$ y = [52879, 12147, 44658, 56617, -22561, -171086, -158707, -96499, -31255, -28489, 7841, 12370, -7542, -7447, -3734, -21022, -81540, -29184, 27841, 26488, -20771, -44333, -71349, -82675, -70502, -68173, -37744, -41649, -6542, 27181, 66564, 49848, 7910, 4013, -8700, 4231, -48076, -87451, -70690, -69500, -43296, 11655, -31451, -13520, -32886, -29102, -79351, -94352, -107728, -68382, -51300, -53955, -27170, -13499, -15750, 8373, -8608, -28741, -52071, -74953, -68307, -49747, 12101, 112634, 133872, 75850, 8313, -18759, -2235, 6020, 15333, 1830, -13604, -29558, -18594, 3628, -31195, -34198, -34962, -26066, -60430, -26012, 14726, 78521, 59225, -3454, 18953, 10605, -1015, 29854, -2230, -76882, -24984, 22495, -22012, -43901, -32223, -26542]
15960b6542J2378J4572M0318K7643k6066J3183k3830k5100m0145k9555J7157o839
15948e2826j9777K4453o830q616J7509J7644P3464J092j0520j3295k0199n1242
15936d9143j3340k5018K3510O4920q1759p0103J3484J789J2883M5882N0814J9664
15924f417k0235q197K6328l023L9703L6090M063n5757m0951k6280r128l1390m9257
15911a44451l6547K8741M3713L4253l464P0043r393k1529m0847P348Q1228K7636
15899C6731k9059M7881j4288k0571J8710R759M615q091l9798J1477o94q476k8218
15886b0022k048m2689o3542m4121O9712L5084M2808L1954j104j0329N767k2290
15874b0820j3307L2412J5893l9303j6493m5146l0283j7698M1384J7567M646k333
$$ y = [-26542, -14164, 408, 40726, 68369, 42303, 55486, 31656, 6556, -33589, -63144, -45987, -52826, -72603, -48150, -54980, -63596, -46087, -28443, 45021, 46113, 35593, 22298, 2099, -49143, -62483, -87501, -63991, 929, -80830, -150933, -137449, -135660, -122777, -76895, -26081, -6417, -26652, -34849, -8521, -11544, 28159, 64249, 68312, 12555, -28396, -54676, -63804, -95194, -144451, -180998, -152257, -108544, -74291, -77755, -7712, -17105, -38634, -79481, -72133, 9095, 36731, 7672, 55553, 41265, 20694, 39404, 49163, 53778, 45687, 5889, 17366, 16672, 8196, -20022, -22070, -64759, -128301, -172422, -102710, -67626, -24818, 7136, 6032, -4297, 1470, -20820, -34127, -1715, 14178, -25125, -41618, -86764, -117047, -134745, -93361, -75794, -71148, -73481]
15862g3481L7153k3707l7552l1921J2894O2110L4352j3542j2640l9724K9695M4048
15850a2315r534l5588J9823j825N886K0979m2094k4305q178J9081K2971l4298
15838g9397k241o471J0533L3524Q632J0791J1277J4564j1630n1896J5579K7817
15826a8918J1191Q996J8374m444j3241J286o9823l6120j6555L5328K0399M077
15814e9450Q4968K6454j30442l395P6324O6518m0456P293M2755k8508m2260k0323
15802b0522j7003Q7588K9774o2499o1265J459k0100m6012k9357L0897N0035M876
15790e2129l1160k2139R186K780M9488O589k7219n1089K9690J3523J1889M0584
15778b0007L669L5079k7038j2967K087M9251L8474j302m4725o1075j2671K1225
$$ y = [-73481, -36328, -60035, -97587, -129508, -116614, -54504, -20152, -33694, -46334, -86058, -56363, -12315, -21849, -57437, -37614, -39439, -33553, -12574, -54668, -78973, -87151, -68070, -45099, -79397, -81638, -88109, -77576, -44052, -35420, -24629, -13352, 1212, -10418, -62314, -46735, -18918, -7727, 1269, 19643, 15199, 1958, 3244, -66579, -102699, -119254, -83926, -63527, -59450, 25518, 51972, -78470, -81865, -5541, 60977, 20521, 27814, 70569, 42061, -199, -20522, -37525, 50063, 79837, 17338, -43927, -42468, -62568, -108580, -137937, -107040, -57005, -52129, -83289, -105428, -96242, -93462, -43974, -37385, -64604, -115693, -86003, -72480, -60591, -20007, -16338, 18741, -8297, -21264, -19177, 30074, 68548, 67246, 22521, -38554, -51225, -30000]
15766c0000M9393L1872p824k5508k6224p95L1954J7543L3301K637l0770K0041
15754F5620L0117N7666L2782Q7269p052P9816J02389R7511J16053K55569L15629
15743A233369M54006O28974R02620Q51338M84131J24580j16523m98663q39887
15734C223945r67453p51392l66241j93892j90869j21808n1894l5826l8221j36138
15724C70211j14297o3723J6731j7874r047J358m2085j5084M2743K5614k6245p1922
15712I6380o5139P0973L5641l7510M4043M7004j8042n8736N368M3121R898l732
15700A69269n9361J9546N74n953P387o6173n6575n511O1454p567m236K123K8099
15687H3076K0210J6600L3391n4970m3841J7242J1653M7768l9510o7734l1460J2070
$$ y = [-30000, 19393, 51265, 43441, 17933, -8291, -9086, 22868, 40411, 73712, 76349, 45579, 65620, 95737, 153403, 186185, 273454, 266402, 346218, 448607, 546118, 662171, 917740, 1233369, 1687375, 2316349, 3218969, 4070307, 4554438, 4679018, 4562495, 4063832, 3223945, 2256492, 1505100, 1138859, 944967, 754098, 632290, 580396, 544570, 506349, 370211, 255914, 192191, 208922, 191048, 182001, 183359, 141274, 126190, 168933, 194547, 168302, 96380, 31241, 102214, 137855, 100345, 144388, 191392, 173350, 114614, 119982, 163103, 173001, 169269, 109908, 129454, 130028, 124075, 131462, 65289, 8714, 3203, 64657, 57090, 52854, 54977, 83076, 103286, 119886, 153277, 98307, 54466, 71708, 83361, 131129, 91619, 23885, -7575, 4495]
15675D495K7764k3173j2640L8763j5432m5231J542l232j9235N340Q0528n2427
$$ y = [4495, 32259, 9086, -3554, 35209, 19777, -25454, -23912, -27144, -46379, -41039, 39489, -12938]
$$ [...]
##END NTUPLES=NMR SPECTRUM
##END=
