##TITLE=Analysis number 329384
Compound Code cc 66504
Book Reference 467/188
Project Code adrs
Chemist Name benw
##JCAMPDX= 6.0         $$ Bruker NMR JCAMP-DX V2.0
##DATA TYPE= NMR SPECTRUM
##DATA CLASS= NTUPLES
##ORIGIN= Bruker BioSpin GmbH
##OWNER= nmr
$$ XWIN-NMR		Version 3.5
$$ Fri Aug 24 12:47:50 2007 GMT Daylight Time (UT+1h)  MAYBRIDGE\nmr@NMR_250MHZ
##.OBSERVE FREQUENCY= 250.131544655141
##.OBSERVE NUCLEUS= ^1H
##.ACQUISITION MODE= SIMULTANEOUS (DQD)
##.ACQUISITION SCHEME= undefined
##.AVERAGES= 16
##.DIGITISER RES= 18
##SPECTROMETER/DATA SYSTEM= dpx250
##.PULSE SEQUENCE= zg30
##.SOLVENT NAME= CDCl3
##.SHIFT REFERENCE= (INTERNAL, CDCl3, 0, 16.4521)
##AUDIT TRAIL= $$ (NUMBER, WHEN, WHO, WHERE, WHAT)
$$ ##TITLE= Audit trail, XWIN-NMR		Version 3.5
$$ ##JCAMPDX= 5.01
$$ ##ORIGIN= Bruker BioSpin GmbH
$$ ##OWNER= nmr
$$ C:\u/data/dgb/nmr/ADRS/1120/pdata/1/auditp.txt
$$ ##AUDIT TRAIL=  $$ (NUMBER, WHEN, WHO, WHERE, WHAT)
(   1,<2007-08-24 12:46:37.19 +100>,<MAYBRIDGE\nmr>,<NMR_250MHZ>,
      <created by zg, POWCHK disabled, PULCHK disabled
       configuration hash MD5:
       76 6E 9A 78 1E 09 19 81 EC 84 63 8F B0 6A 59 2D
       data hash MD5: 64K
       25 11 8D 4B 87 25 FC 0D 27 D7 AA 43 40 6C 67 1E>)
(   2,<2007-08-24 12:47:10.99 +100>,<MAYBRIDGE\nmr>,<NMR_250MHZ>,
      <Start of raw data processing
       ef LB = 0.3 FT_mod = 6 PKNL = 1 SI = 32K 
       data hash MD5: 32K
       38 F4 A0 46 48 7F C1 60 97 2F CF 1B 6D 00 3A 53>)
(   3,<2007-08-24 12:47:16.66 +100>,<MAYBRIDGE\nmr>,<NMR_250MHZ>,
      <apk 
       data hash MD5: 32K
       C0 2E 71 77 E2 7A 6E 4C DD F8 E6 11 10 38 81 7B>)
(   4,<2007-08-24 12:47:21.39 +100>,<MAYBRIDGE\nmr>,<NMR_250MHZ>,
      <abs ABSG = 5 
       data hash MD5: 32K
       7C A0 07 CA 92 7F B0 ED 61 C8 76 93 7A 26 DE 64>)
$$ ##END=
$$ 
$$ hash MD5
$$ 7B 95 65 C4 BE C9 7F 39 6F 7A 97 54 05 E2 C9 43
##$RELAX= 
##$RELAX= 
##$RELAX= 
##$RELAX= 
##$RELAX= 
##$RELAX= 
##$RELAX= 
$$ Bruker specific parameters
$$ --------------------------
##$DU= <C:\u>
##$EXPNO= 1120
##$NAME= <ADRS>
##$PROCNO= 1
##$TYPE= <nmr>
##$USER= <dgb>
##$AMP= (0..31)
100 100 100 100 100 100 100 100 100 100 100 100 100 100 100 100 100 100 
100 100 100 100 100 100 100 100 100 100 100 100 100 100 
##$AQSEQ= 0
##$AQ_mod= 3
##$AUNM= <au_zg>
##$AUTOPOS= <60 >
##$BF1= 250.13
##$BF2= 250.13
##$BF3= 250.13
##$BF4= 250.13
##$BF5= 500.13
##$BF6= 500.13
##$BF7= 500.13
##$BF8= 500.13
##$BYTORDA= 1
##$CFDGTYP= 0
##$CFRGTYP= 5
##$CHEMSTR= <none>
##$CNST= (0..31)
1 1 145 1 1 1 1 1 1 1 1 1 1 1 1 1 1 1 1 1 1 1 1 1 1 1 1 1 1 1 1 1 
##$CPDPRG= <>
##$CPDPRG1= <>
##$CPDPRG2= <>
##$CPDPRG3= <>
##$CPDPRG4= <mlev>
##$CPDPRG5= <mlev>
##$CPDPRG6= <mlev>
##$CPDPRG7= <mlev>
##$CPDPRG8= <mlev>
##$CPDPRGB= <>
##$CPDPRGT= <>
##$D= (0..31)
0 1 0 0 0 0 0 0 0 0.06 0 0 0 0 0 0 0.0002 0 0 0 0 0 0 0 0 0 0 0 0 0 0 
0 
##$DATE= 1187955994
##$DBL= (0..7)
120 120 120 120 120 120 120 120 
##$DBP= (0..7)
150 150 150 150 150 150 150 150 
##$DBP07= 0
##$DBPNAM0= <>
##$DBPNAM1= <>
$$ [...]
##$SUBNAM7= <"">
##$SUBNAM8= <"">
##$SUBNAM9= <"">
##$SW= 20.6930455092707
##$SWIBOX= (0..15)
0 0 3 0 0 0 0 0 0 0 0 0 0 0 0 0 
##$SW_h= 5175.983436853
##$TD= 65536
##$TD0= 1
##$TE= 296.16
##$TE2= 300
##$TE3= 300
##$TEG= 300
##$TL= (0..7)
0 120 120 120 120 120 120 120 
##$TP= (0..7)
150 150 150 150 150 150 150 150 
##$TP07= 0
##$TPNAME0= <>
##$TPNAME1= <>
##$TPNAME2= <>
##$TPNAME3= <>
##$TPNAME4= <>
##$TPNAME5= <>
##$TPNAME6= <>
##$TPNAME7= <>
##$TPOAL= (0..7)
0.5 0.5 0.5 0.5 0.5 0.5 0.5 0.5 
##$TPOFFS= (0..7)
0 0 0 0 0 0 0 0 
##$TUNHIN= 0
##$TUNHOUT= 0
##$TUNXOUT= 0
##$USERA1= <user>
##$USERA2= <user>
##$USERA3= <user>
##$USERA4= <user>
##$USERA5= <user>
##$V9= 5
##$VALIST= <valist>
##$VCLIST= <CCCCCCCCCCCCCCC>
##$VD= 0
##$VDLIST= <DDDDDDDDDDDDDDD>
##$VPLIST= <PPPPPPPPPPPPPPP>
##$VTLIST= <TTTTTTTTTTTTTTT>
##$WBST= 1024
##$WBSW= 4
##$XGAIN= (0..3)
0 0 0 0 
##$XL= 0
##$YL= 0
##$YMAX_a= 340767
##$YMIN_a= -217076
##$ZGOPTNS= <>
##$ZL1= 120
##$ZL2= 120
##$ZL3= 120
##$ZL4= 120
##$ABSF1= 16.45209
##$ABSF2= -4.241083
##$ABSG= 5
##$ABSL= 3
##$ALPHA= 0
##$AQORDER= 0
##$ASSFAC= 0
##$ASSFACI= 0
##$ASSFACX= 0
##$ASSWID= 0
##$AUNMP= <proc_1d>
##$AZFE= 0.1
##$AZFW= 0.1
##$BCFW= 0
##$BC_mod= 0
##$BYTORDP= 0
##$COROFFS= 0
##$CY= 12.5
##$DATMOD= 1
##$DC= 0
##$DFILT= <>
##$DTYPP= 0
##$F1P= 14.0000005364418
##$F2P= -0.99999901652339
##$FCOR= 0.5
##$FTSIZE= 32768
##$FT_mod= 6
##$GAMMA= 0
##$GB= 0
##$INTBC= 1
##$INTSCL= 1
##$ISEN= 128
##$LB= 0.3
##$LEV0= 0
##$LPBIN= 0
##$MAXI= 10000
##$MC2= 0
##$MEAN= 0
##$ME_mod= 0
##$MI= 0
##$NCOEF= 0
##$NC_proc= -4
##$NLEV= 6
##$NOISF1= 0
##$NOISF2= 0
##$NSP= 0
##$NTH_PI= 0
##$NZP= 0
##$OFFSET= 16.45209
##$PC= 1
##$PHC0= -37.08474
##$PHC1= 3.116963
##$PH_mod= 1
##$PKNL= yes
##$PPARMOD= 0
##$PSCAL= 4
##$PSIGN= 0
##$REVERSE= no
##$SF= 250.130017485921
##$SI= 32768
##$SIGF1= 0
##$SIGF2= 0
##$SINO= 400
##$SIOLD= 32768
##$SREGLST= <1H.CDCl3>
##$SSB= 0
##$STSI= 32768
##$STSR= 0
##$SW_p= 5175.98343685301
##$SYMM= 0
##$S_DEV= 0
##$TDeff= 65536
##$TDoff= 0
##$TI= <Analysis number 999999
Compound Code 99
Book Reference 9
Project Code 9>
##$TILT= no
##$TM1= 0
##$TM2= 0
##$TOPLEV= 0
##$USERP1= <user>
##$USERP2= <user>
##$USERP3= <user>
##$USERP4= <user>
##$USERP5= <user>
##$WDW= 1
##$XDIM= 32768
##$YMAX_p= 437544535
##$YMIN_p= -449516
$$ End of Bruker specific parameters
$$ ---------------------------------
##NTUPLES= NMR SPECTRUM
##VAR_NAME=  FREQUENCY,     SPECTRUM/REAL,   SPECTRUM/IMAG
##SYMBOL=    X,             R,               I
##VAR_TYPE=  INDEPENDENT,   DEPENDENT,       DEPENDENT
##VAR_FORM=  AFFN,          ASDF,            ASDF
##VAR_DIM=   32768,         32768,           32768
##UNITS=     HZ,            ARBITRARY UNITS, ARBITRARY UNITS
##FACTOR=    0.157963299565203, 1,           1
##FIRST=     4115.16138671329, 0,            0
##LAST=      -1060.82205013972, 0,           0
##MIN=       -1060.82205013972, -449516,     0
##MAX=       4115.16138671329, 437544535,    0
$$ Real data points
##PAGE= N=1
##DATA TABLE= (X++(R..R)), XYDATA
$$ [...]
26437A6804j635o1471R741o2327j05781K9855P6915L2889L4355M9223N468j15547
$$ 16804 15169 -46302 -36561 -98888 -204669 -174814 -97899 -65010 -30655 18568 24036 -91511
26425i1511M5567l0582L290j8337o9671j0900j06105l0827J26841J26732k0375
$$ -91511 -45944 -76526 -73236 -91573 -161244 -172144 -278249 -309076 -182235 -55503 -75878
26414g5878P8043O7870P29Q7135R9894k4582r5681n219K4844m5744p1525n6346
$$ -75878 2165 70035 70764 157899 257793 233211 137530 132311 157155 111411 39886 -16460
26402a6460Q6134J66202J8171k18233K9570M9280r0130N2835J59721P0516n6235
$$ -16460 69674 235876 254047 35814 65384 114664 24534 77369 237090 307606 251371
26391B51371q872p1487L1488q2347j49209k1266L6012j80408k4348Q9557J3525
$$ 251371 242499 171012 202500 120153 -29056 -50322 -14310 -194718 -219066 -129509 -115984
26380a15984P7036P3423P3664j6502k8756r5183j44381l4118j0911J24058P6804
$$ -115984 -38948 34475 108139 91637 62881 -32302 -176683 -210801 -221712 -97654 -20850
26369b0850l3556J23651N7895L5461q4927n5406k2307p2459P661J2159n340j2467
$$ -20850 -54406 69245 127140 162601 77674 22268 -39 -72498 -64837 -52678 -58018 -70485
26357g0485L745N3911R8332K488j14464l1617l6984M200L5699N4432O2024o3000
$$ -70485 -66740 -12829 85503 87991 -26473 -58090 -95074 -90874 -55175 -743 61281 -1719
26345a719j88408j0070p8N5896L8307O4701j77766N3662N9071M6793L8681K0877
$$ -1719 -190127 -200197 -200275 -144379 -106072 -41371 -219137 -165475 -106404 -59611 -20930 -53
26333e3j21394J4207j5257O7345l1729p904Q1422L1678m3716k5304n759L1329
$$ -53 -121447 -107240 -122497 -55152 -86881 -94785 -13363 18315 -25401 -50705 -56464 -25135
26321b5135J03874M5585m6959M5446Q9524j27265r8900p1659j477J8236k2097
$$ -25135 78739 124324 77365 122811 212335 85070 -13830 -85489 -86966 -68730 -90827
26310i0827J36661L4955M5857o3150r2755k9536m9496o2767K2858P1297j46633
$$ -90827 45834 80789 126646 63496 -29259 -58795 -108291 -171058 -148200 -76903 -223536
26299b23536q5781N2096K0361O3608J06787L8865k6248k4615L4503J04521J8383
$$ -223536 -309317 -257221 -236860 -173252 -66465 -27600 -53848 -78463 -43960 60561 78944
26288G8944p8332J688J5797n8470K3305r854R8M6380J64205L2053j53732j03105
$$ 78944 612 2300 18097 -40373 -17068 -26922 -26824 19556 183761 215814 62082 -41023
26276d1023N8815L5301R683o0163J145O0939m9426j2017J04135q190J1729r667
$$ -41023 17792 53093 62776 2613 3758 64697 15271 3254 107389 99199 110928 101261
26264A01261n2890K6664p4491Q617n8805J6950j41590r4750J40760Q1069R4547
$$ 101261 48371 75035 544 9161 -49644 -32694 -174284 -269034 -128274 -47205 47342
26253D7342Q5240o8157o8838r663j4923O2709M7731m0640k9930P5439M0172o8692
$$ 47342 132582 64425 -4413 -14076 -28999 33710 81441 40801 10871 86310 126482 57790
26241E7790j08998Q7296J01977l1047o0612p2350J5206K842J2747l6932Q2068
$$ 57790 -51208 36088 138065 107018 46406 -25944 -10738 -7896 4851 -32081 49987
26230D9987M9088k6585l0987j5814r5460p3426O609N0769J6318M9181N5276J0379
$$ 49987 99075 72490 41503 25689 -69771 -143197 -136588 -85819 -69501 -20320 34956 45335
26218D5335j5627n0015r4419j9067P783q122q4263N0030j9284M2875M8402N2113
$$ 45335 29708 -20307 -114726 -133793 -126010 -134132 -218395 -168365 -187649 -144774 -96372 -44259
26206d4259L8301K9357P355l6509l4664o3845P7521L8720j6977R343L0631l9890
$$ -44259 -5958 23399 30754 -5755 -40419 -104264 -26743 11977 -5000 4343 34974 -4916
26194d916n6258O3348R8075J97n2911k8095l4597j6356p8512L401j5730k1718
$$ -4916 -61174 2174 100249 100446 47535 19440 -15157 -31513 -110025 -106624 -122354 -144072
26182a44072j9057K3060K4434Q807J18204k118q4338q295k1397Q05j8200P2040
$$ -144072 -163129 -140069 -115635 -106828 11376 9258 -75080 -83375 -104772 -103967 -122167 -50127
26170e0127J21948P6863j49633p8778J7603k3931J3067J53580j00301l0414Q4467
$$ -50127 71821 148684 -949 -79727 -62124 -86055 -72988 80592 -19709 -50123 34344
26159C4344Q5840m0513j05366m4782M5878O9551J20558J8210j0266j18530P368
$$ 34344 120184 79671 -25695 -70477 -24599 44952 165510 183720 173454 54924 62292
26148F2292N6326k6817l5255j50278j555L15335K3278k18985j32837P008O9171
$$ 62292 118618 91801 56546 -93732 -95287 220048 243326 24341 -108496 -101488 -32317
26137c2317j0328R4962M6960j48500M01P7891m0422j46869M7057J11142m3573
$$ -32317 -42645 52317 99277 -49223 -48822 29069 -11353 -158222 -111165 -23 -43596
26126d3596j6727K9624J01305l1071l5368l9294L7930J530p0991M5525P5593o3366
$$ -43596 -60323 -30699 70606 39535 4167 -35127 2803 4333 -66658 -21133 54460 -8906
26114h906l7686l6106J14494p4271r6572n6226j5171J59666J50754J02348l3090
$$ -8906 -46592 -82698 31796 -42475 -139047 -195273 -210444 -50778 99976 202324 169234
26103A69234j07673j68285r0215J43282R9196J00277j7217r403j6573L9857M445
$$ 169234 61561 -106724 -196939 -53657 45539 145816 128599 119196 102623 142480 146925
26092A46925R5792P0832j01450r9433M3687o323l0964K2786L4807p9284P1963
$$ 146925 242717 313549 212099 112666 156353 150030 119066 141852 176659 97375 169338
26081A69338Q5652q3968n9987p4292O852l8298J29943M3017k3248q7241j03583
$$ 169338 254990 171022 111035 36743 43595 5297 135240 178257 155009 67768 -35815
26070c5815K8359k9253j50270L6995J66716N1832o3917l7932j3174K8484j3817
$$ -35815 -7456 -36709 -186979 -149984 16732 68564 4647 -33285 -46459 -17975 -31792
26059c1792o6046O9475P7913j40482M7141O6925o1616j3508j03541r5724N2376
$$ -31792 -97838 -28363 49550 -90932 -43791 23134 -38482 -51990 -155531 -251255 -198879
26048a98879J01458J11024O2352K1673l7805j58105j78839K2120J91799M0829
$$ -198879 -97421 13603 75955 97628 59823 -98282 -277121 -255001 -63202 -22373
26038b2373l5776M0468m7133J27342N4226j49742N125J5759j2101M7527O0077
$$ -22373 -58149 -17681 -64814 62528 116754 -32988 -27863 -12104 -24205 23322 83399
26027H3399q3986P694q1323p4519K7177m4324k6965J03929M380O6774J06753J42585
$$ 83399 -587 7107 -74216 -148735 -121558 -165882 -192847 -88918 -84538 -17764 88989 231574
26015B31574l6761o4179j91747j32168K8132J4973O6351R7278L5601L0352N3421
$$ 231574 194813 130634 -61113 -193281 -165149 -150176 -83825 13453 49054 79406 132827
26004A32827k6125m9378K6012l3453L2893M9813O4135r4624k9444j1610l9995
$$ 132827 106702 57324 83336 49883 82776 132589 196724 102100 72656 61046 21051
25993B1051J6808k0551k8246O2624j9162m0811r5037Q0593Q7440l0906k59q5105
$$ 21051 37859 17308 -10938 51686 32524 -8287 -103324 -22731 64709 33803 33544 -51561
25981e1561L7707n8286L751J51111L3170k184n5684j01017l8650K6536j8321L99
$$ -51561 -13854 -72140 -68389 82722 115892 113708 58024 -42993 -81643 -55107 -73428 -73029
25969g3029P8827K09173n1577j67761N0807L03m342J05228L6128k9141j62051
$$ -73029 5798 214971 163394 -4367 46440 46743 42401 147629 183757 154616 -7435
25958g435p9436k3056N4964K0338R2618L9530n3920M7314l7008J14233L9503k48706
$$ -7435 -86871 -109927 -54963 -34625 57993 97523 43603 90917 53909 168142 207645 -41061
25946d1061j9838N4422m0007m1509Q6613J31358n3627r8390j0413N4722Q1189
$$ -41061 -60899 -6477 -46484 -87993 -1380 129978 76351 -22039 -32452 22270 103459
25935A03459N910m2719p1692J9410k7282l2400j9423M2806k7569n5586k9754P5839
$$ 103459 109369 66650 -5042 14368 -12914 -45314 -64737 -21931 -49500 -105086 -134840 -59001
25923e9001N4631q478o1875J2154k505L3645n9572o4275M3539J2337J5942Q3739
$$ -59001 -4370 -12848 -74723 -62569 -65074 -31429 -91001 -155276 -111737 -99400 -83458 281
25911B81q8873q4240P1818J17701M5580l8834k2557j9377q9400j5869J35797m695
$$ 281 -88592 -172832 -101014 16687 62267 23433 876 -18501 -107901 -123770 12027 7332
25899G332K0815k0991J8792q9384J4563k7499j35191m0907p788J74761K4439r66
$$ 7332 28147 7156 25948 -63436 -48873 -76372 -211563 -252470 -260258 -85497 -61058 -62024
25887f2024N6844o4791K7293J23371j1943P541k8927N9095k7083k6058r7167J9724
$$ -62024 -5180 -69971 -42678 80693 68750 76291 47364 106459 79376 53318 -43849 -24125
25875b4125n9457m3017q1872L9669n3818O0562j4230m1391n62L7760J209k2357
$$ -24125 -83582 -126599 -208471 -168802 -222620 -162058 -176288 -217679 -218241 -180481 -179272 -201629
25863b01629J60326J54745K4969j10678l0448r188j01346o9588N2135m6374O4789
$$ -201629 -41303 113442 138411 27733 -2715 -11903 -113249 -182837 -130702 -177076 -112287
25852a12287Q4474Q1592J0386j31974m5296Q7200K8091o283J3551m1086o1950
$$ -112287 -27813 53779 64165 -67809 -113105 -25905 2186 -4097 9454 -31632 -93582
25841i3582J33847R2850N167n9547j55613j31912O5246J57112K3401K6672n1518
$$ -93582 40265 133115 138282 78735 -76878 -208790 -143544 13568 36969 63641 12123
25830A2123j16592J0362K2645n725O3158J7847L2862j02067o1610J72290O3942
$$ 12123 -104469 -94107 -71462 -77187 -14029 3818 36680 -65387 -126997 45293 109235
25819A09235l5547j8378N7391L5760r0323o6683o9938K4864J80481Q8154p6801
$$ 109235 73688 55310 112701 148461 58138 -8545 -78483 -53619 126862 215016 138215
25808A38215n6141J8773k589j14345j359j0127J10731j8707J4839L566N619O880
$$ 138215 82074 100847 98258 -16087 -17446 -27573 83158 64451 79290 82856 88475 95355
25796I5355m0551q4479j24k6719J05020L7225p5163q9485R9072J27362l6625j41194
$$ 95355 54804 -29675 -29799 -56518 48502 85727 10564 -78921 20151 147513 110888 -30306
25784c0306o7340l9324L8471l1558K9174J35926m2009l5306j08247m0373k0631
$$ -30306 -97646 -136970 -98499 -130057 -100883 35043 -6966 -42272 -150519 -190892 -211523
25773b11523j8714K8151J41971J23438J2119m5870l7211q4848O2535J22906M6865
$$ -211523 -230237 -202086 -60115 63323 75442 29572 -7639 -92487 -29952 92954 139819
25762A39819k0659p7890j2956J8866m7004M1490j0215N0325K2422p2892j9432
$$ 139819 119160 41270 28314 47180 176 41666 31451 81776 104198 31306 11874
25751A1874O756j1211l1197n4790r4673K7800J43043J89403J42927j91318j21064
$$ 11874 18630 7419 -23778 -78568 -173241 -145441 -2398 187005 329932 138614 17550
25740A7550n5793J2577P9056p4705j98024L7459K06217R1226n0877o3267p5124
$$ 17550 -38243 -25666 53390 -21315 -219339 -181880 24337 115563 64686 1419 -73705
25729g3705k524j6791O2421O646j0195Q1300N1555j6156m9044M7686l7804Q169
$$ -73705 -76229 -93020 -30599 -23953 -34148 47152 98707 82551 33507 81193 43389 51558
25717E1558P5897n8351j951p7638j9230j26437M4408J26063K28120M5725l4394
$$ 51558 127455 69104 67153 -10485 -29715 -156152 -111744 14319 242439 288164 253770
25706B53770q3380q5956j27747L9668J34116m4583R798L5405L0413p3399n222
$$ 253770 170390 84434 -43313 -3645 130471 85888 95686 131091 161504 88105 82883
25695H2883q444Q5623L290k9164L0627n0459k1592Q4463q7824j22966l3110j0888
$$ 82883 74439 160062 163352 134188 164815 114356 92764 177227 89403 -33563 -66673 -77561
25683g7561n5386J5032m8497n9300r479N7800J1163K9758J02998R1775k5139m2230
$$ -77561 -132947 -117915 -166412 -225712 -235191 -177391 -166228 -136470 -33472 58303 33164 -9066
25671i066J33287L2905j18551j9287L7488M8977l9875o5074j37368m0091J41263
$$ -9066 124221 157126 38575 19288 56776 105753 65878 804 -136564 -176655 -35392
25660c5392N0657n0848l6618q4648N0163j6900J2600k5413K6411R8115M3522N8776
$$ -35392 15265 -35583 -72201 -156849 -106686 -123586 -110986 -136399 -109988 -11873 31649 90425
25648I0425o3166j26256k9252J42222q203q1795j40570j4603L995L5688R8082
$$ 90425 27259 -98997 -128249 13973 5770 -76025 -216595 -231198 -227203 -191515 -93433
25637i3433J2224n6485m5199M1523R5P2712m1066o9941l124q9282J44772L4398
$$ -93433 -81209 -137694 -182893 -141370 -141275 -68563 -109629 -179570 -182694 -271976 -127204 -92806
25625i2806j00883Q3850N8875N2581r5492j02170Q6631Q8150J0897j2096O9874
$$ -92806 -193689 -109839 -50964 1617 -93875 -196045 -109414 -21264 -10367 -22463 47411
25614D7411p483j95379l0455P3923R5291k5582n8466r3999J00403R2036k913M6438
$$ 47411 39928 -155451 -185906 -111983 -16692 -42274 -100740 -194739 -94336 -2300 -5213 41225
25602D1225N8232l7131n0277P3840P878n0188O3568l2964k0510j4243j21458r7670
$$ 41225 99457 62326 12049 85889 93767 43579 107147 74183 53673 39430 -82028 -179698
25590a79698k0925k7153N0835R6020n2805K4313L0857J2335M7390R6927K3039
$$ -179698 -200623 -227776 -176941 -80921 -133726 -109413 -78556 -66221 -18831 78096 101135
25579A01135R3183j9766j05296j5848m350j00550L3496J27227O5644r2238k12827
$$ 101135 194318 174552 69256 53408 49058 -51492 -17996 109231 174875 82637 -130190
25568a30190P7022J11578J05340j4921j06339o5766j1932n312J19183J01586k07955
$$ -130190 -53168 58410 163750 148829 42490 -23276 -35208 -40520 78663 180249 -27706
25557b7706l1445P7391l762l9980p8559N3412L4032L1772J9186q9549q2186j7473
$$ -27706 -59151 18240 14478 -25502 -104061 -50649 -16617 15155 34341 -55208 -137394 -154867
25545a54867j8153P293O3732M5162n907j8970o8978N704R1685p8505N4643K23216
$$ -154867 -173020 -165727 -101995 -56833 -62740 -81710 -150688 -144984 -53299 -131804 -77161 146055
25533A46055m1006j1118J5738K0234J5452l4937K7092p7504p1566K7404P6892
$$ 146055 105049 93931 109669 129903 145355 110418 137510 60006 -11560 15844 92736
25522I2736o7658j25097l1049N8064J05729P9740l4513o2349P7758O2640P138
$$ 92736 25078 -100019 -131068 -73004 32725 112465 77952 15603 93361 156001 163139
25511A63139k0451l8049j20003l2407k5130P5194l3553m4940j6325m1476r8833
$$ 163139 142688 104639 -15364 -47771 -72901 2293 -31260 -76200 -92525 -134001 -232834
25500b32834K8412J40606N5719J49875P5282j4658j15501j08112K0914J18m0115
$$ -232834 -204422 -63816 -8097 141778 217060 202402 86901 -21211 -297 -179 -40294
25489d0294O602M0455K1236M0763n7732M9229m271j25080n3747J046R8023J02890
$$ -40294 -33692 6763 27999 68762 11030 60259 55988 -69092 -122839 -121793 -23770 79120
25477G9120Q4976o50q6650N5607j696L789r0226o4093L7457N8992p9838o7746
$$ 79120 164096 163446 76796 132403 130707 134496 44270 -19823 17634 76626 -3212 -70958
25465g0958r0139M9248j8228q6799Q8077J49490R2645j04828J9132K4716K9723
$$ -70958 -161097 -111849 -130077 -216876 -128799 20691 113336 8508 27640 52356 82079
25454H2079K233P2439l9146j31720J4117q1555R7950M0671L2695k1090l4115j03900
$$ 82079 84312 156751 117605 -14115 2 -81553 16397 57068 89763 68673 34558 -69342
25442f9342j9028j53154j14062J04833N8110J50462P3922n3768J10545r2260j2461
$$ -69342 -88370 -241524 -355586 -250753 -192643 -42181 31741 -22027 88518 -3742 -16203
25431a6203l2504J7890K1429J0816p7859J6065J890J04645M9642N8894n8968o8036
$$ -16203 -48707 -30817 -9388 1428 -76431 -60366 -58476 46169 95811 154705 95737 27701
25419B7701N0214j9080R15k7294q9490m6772N5053K0916j7079L9591J00722L4734
$$ 27701 77915 58835 59750 32456 -57034 -103806 -48753 -27837 -44916 -5325 95397 130131
25407A30131l0773M420j6371M6600j9471n8480m8410m9741j01818N9520N289J34700
$$ 130131 99358 103778 87407 134007 114536 56056 7646 -42095 -143913 -84393 -79104 55596
25395E5596J38235l1594J2631j56256p4002P2091L7692q9178m2700l5318J4181
$$ 55596 193831 162237 174868 18612 -55390 16701 54393 -34785 -77485 -112803 -98622
25384i8622l0767N4032N8706J995m2198K0153L4959q813M1903n2190R626Q2954
$$ -98622 -129389 -75357 -16651 -14656 -56854 -36701 -1742 -10555 31348 -20842 -11216 71738
25372G1738j59777j73181k965K07765K02845m4124j22538o2397J16785K9166l6240
$$ 71738 -88039 -261220 -264185 -56420 146425 102301 -20237 -82634 34151 63317 27077
25361B7077j23755K0467J01927N4147L6652j0854o5542j29341p1864N1245R6431
$$ 27077 -96678 -76211 25716 79863 116515 105661 40119 -89222 -161086 -109841 -13410
25350a3410J14569k4633r5500J7115m0540j2979m927M807K05630r247o5564O3949
$$ -13410 101159 76526 -18974 -1859 -42399 -55378 -60305 -55498 150132 140885 75321 139270
25338A39270j0609n0018m9597J14316K3704l7925k7658r6487p1477m0802p53J91367
$$ 139270 128661 78643 29046 143362 167066 129141 101483 4996 -66481 -107283 -108036 83331
25326H3331J09834N6000l4237m745n0190q5302p5391J0534p9695L1859R0752K1726
$$ 83331 193165 249165 214928 210183 159993 74691 -700 9834 -69861 -38002 52750 74476
25314G4476q952l5114r872O9932j21069l0372r2108j9293M2595j4988J29556J1340
$$ 74476 65524 30410 20538 90470 -30599 -60971 -153079 -172372 -129777 -144765 -15209 -3869
25302c869j5134K0897k134k12349p2099Q203J2859J9237Q4455N2367k269j06879
$$ -3869 -19003 1894 -240 -212589 -284688 -276485 -263626 -244389 -159934 -107567 -109836 -216715
25290b16715K5714O2395p6827J5764J66307Q1509l885j084o6602O1315R1788j41775
$$ -216715 -191001 -128606 -205433 -189669 -23362 58147 54262 53178 -13424 47891 139679 -2096
25278b096p0927k4887o6713N910N3199l159k3188j13543J27587N6938O2473Q5464
$$ -2096 -73023 -97910 -164623 -158713 -105514 -108673 -131861 -245404 -117817 -60879 1594 87058
25266H7058j30073j25900J8040N6486J9714R6875n9449J2287L3200j07238m7278
$$ 87058 -43015 -168915 -150875 -94389 -74675 22200 -37249 -24962 8238 -99000 -146278
25255a46278L9772N0802k359l362j9745K1268J9830q9900l7196O0540q0995j04598
$$ -146278 -106506 -55704 -58063 -61425 -81170 -59902 -40072 -129972 -167168 -106628 -187623 -292221
25243b92221O3669K04Q3134O3476k7688q1412k661J4141Q7436N2276j7206j5078
$$ -292221 -228552 -228348 -145214 -81738 -109426 -190838 -193499 -179358 -91922 -39646 -56852 -71930
25231g1930P5936Q8572j1672J8751l5684N1254n1005K7247L42j1937R349k9223
$$ -71930 4006 92578 80906 99657 63973 115227 64222 91469 91811 79874 89223 60000
25219F0000n1915K241p2869p5243j38949L3123J47737j6216P5580o6648J13466
$$ 60000 8085 10326 -62543 -137786 -276735 -243612 -95875 -112091 -36511 -103159 10307
25208A0307J2079J6017k5478p9778K8508K5732M8951L5900j03779Q8852j5704
$$ 10307 22386 38403 12925 -66853 -38345 -12613 36338 72238 -31541 57311 41607
25197D1607p8750n8608K5193o8937o4670J3720K14697j05136l5074J37498N1120
$$ 41607 -37143 -95751 -70558 -139495 -204165 -190445 24252 -80884 -115958 21540 72660
25186G2660q8703P392j07399q0264N3300K07984O870j38268m2835m5874K03798
$$ 72660 -16043 -8651 -116050 -196314 -143014 64970 71840 -66428 -109263 -155137 48661
25175D8661l1505j7876m7683j02612j0218K0417N961j37524k3089O1293Q6498
$$ 48661 17156 -720 -48403 -151015 -161233 -140816 -134855 -272379 -295468 -234175 -147677
25164a47677J40153L8267J289k06212m3251K21950L1183j44094M3100J73542M9943
$$ -147677 -7524 30743 32032 -174180 -217431 4519 35702 -108392 -65292 108250 158193
25153A58193k62586p7902O0037K5688n8383j7336J465N5219M6155M1563K2033
$$ 158193 -104393 -182295 -122258 -96570 -154953 -172289 -170824 -115605 -69450 -27887 -5854
25142e854P8223j29255m4998O1629N7883M8247m926k4345j4255J31279K1773j18225
$$ -5854 72369 -56886 -101884 -40255 17628 65875 60949 36604 22349 153628 175401 57176
25130E7176p5238l3591N1286Q1694j30408K7386J6009j4919r3040j1906O1678
$$ 57176 -18062 -51653 -367 81327 -49081 -21695 -5686 -20605 -113645 -125551 -63873
25119f3873M6740n5462M9664N6637j33227j11470m1065J07939O0154P5269n601
$$ -63873 -17133 -72595 -22931 33706 -99521 -210991 -252056 -144117 -83963 -8694 -14295
25108a4295p4135J64621M7598o8192j37149K9702m2566M5737K1930r3901Q9823
$$ -14295 -88430 76191 123789 55597 -81552 -51850 -94416 -48679 -26749 -120650 -30827
25097c0827J33303N3070J16694o583r2092j12480r941J05217m1919q1935m0449
$$ -30827 102476 155546 272240 265657 173565 61085 51144 156361 114442 32507 -7942
25086g942K3500m1027j4077l7660j42368o4844J14617L5593m2063R881J51988
$$ -7942 15558 -25469 -39546 -77206 -219574 -284418 -169801 -134208 -176271 -166390 -14402
25075a4402P9414k1543q257K8389N15n3953m0148r5641M1892L715q6266Q8810
$$ -14402 65012 43469 35212 63601 64116 10163 -29985 -125626 -83734 -80019 -166285 -77475
25063g7475R6740N6446L2887j00879j43434P7106P3092l3183O2101k3003K8110
$$ -77475 19265 75711 108598 7719 -135715 -58609 14483 -18700 43401 20398 48508
25052D8508J26941m1113k7248n8038J20959k2171j09554o8895q3950N191o164
$$ 48508 175449 134336 107088 49050 170009 147838 38284 -30611 -114561 -109370 -115534
25041a15534J5957Q6740N5787j52741j9427J12278j02818J9907J09798L0010P702
$$ -115534 -99577 -12837 42950 -109791 -129218 -16940 -119758 -99851 9947 39957 47659
25030D7659k174j47000k9173K5099J19337J213l3227J37776M8784M6513o5678
$$ 47659 45485 -101515 -130688 -105589 13748 14961 -18266 119510 168294 214807 149129
25019A49129j21124p6883M696L6668l9300k4428J129O7821r119m1767p0556O6043
$$ 149129 28005 -48878 -44182 -7514 -46814 -71242 -70113 -2292 -11411 -53178 -123734 -57691
25007e7691J2159K3126r7170k4463L0225L1072M0161n4231K4225J7118m7287j13648
$$ -57691 -45532 -22406 -119576 -144039 -113814 -82742 -42581 -96812 -72587 -55469 -102756 -216404
24995b16404M4286K4457J04696k9256j3741J22211K592l6683k5098k364m9123
$$ -216404 -172118 -147661 -42965 -72221 -85962 36249 38841 2158 -22940 -25304 -74427
24984g4427L5445N1655l5066o8716o304L5934M459J17050J03593l1505p9099q9208
$$ -74427 -38982 12673 -22393 -91109 -97413 -61479 -57020 60030 163623 132118 53019 -36189
24972c6189n6354r0941q0534J01314J50337J0381n0965k364k9063P0781m7039
$$ -36189 -92543 -183484 -264018 -162704 -12367 -1986 -52951 -55315 -84378 -13597 -60636
24961f0636L7187q935k8152l458P2220j7233j41126K0040J6659j9888j4688L1485
$$ -60636 -23449 -32384 -60536 -63994 8226 -9007 -150133 -130093 -113434 -133322 -148010 -116525
24949a16525M956P8895J34038M0271o4912j6058k5413P636j04167J2744m3757
$$ -116525 -111569 -32674 101364 141635 76723 60665 35252 42888 -61279 -48535 -92292
24938i2292m6582M6667K4209K4825k875q9709R0711J25918J9618l2075N0467n319
$$ -92292 -138874 -92207 -67998 -43173 -46048 -135757 -45046 80872 100490 68415 118882 113563
24926A13563j31653Q259O9445J3134j0041K4030J02870l6231q7759k4098O6004
$$ 113563 -18090 -9831 59614 72748 62707 86737 189607 153376 65617 41519 107523
24915A07523j10307j34218K7019Q8803O8917p186p4247m6534M136O462J31331
$$ 107523 -2784 -137002 -109983 -21180 47737 40551 -33696 -80230 -76094 -69632 61699
24904F1699N1067j7591K688P4049J23163j62267k06909K2700J2771k2743K5426
$$ 61699 112766 95175 97863 171912 295075 132808 -74101 -51401 -38630 -61373 -35947
24893c5947J05126p6619n3374J29587l6237r7597Q4761Q5816o5045K2800J23390
$$ -35947 69179 -7440 -60814 68773 32536 -65061 19700 105516 40471 63271 186661
24882A86661Q5318k5545L0921n0537p1043q6021p5540m5581r8473k1094J03436
$$ 186661 271979 246434 277355 226818 155775 69754 -5786 -51367 -149840 -170934 -67498
24871f7498J46575m982n9310p8075M3077j01852j07436n0092N8272J6235P1450
$$ -67498 79077 74095 14785 -63290 -20213 -122065 -229501 -279593 -221321 -205086 -133636
24860a33636K2761J54907M9970r6824l5339m2381n3032L8061J08467M4009j76076
$$ -133636 -110875 44032 94002 -2822 -38161 -80542 -133574 -95513 12954 56963 -119113
24849a19113m6383M5615M1500j04319L0067M3920J25768J07006j09878m9807R327
$$ -119113 -165496 -119881 -78381 -182700 -152633 -108713 17055 124061 14183 -35624 -26297
24838b6297J18597N9143K1944j21573q1650J19613q9036r6344N4325k1860M612
$$ -26297 92300 151443 173387 51814 -29836 89777 741 -95603 -41278 -63138 -58526
24827e8526o376M654J04115N7408o4578o5502n8178J64296L5447o3081l4376j19363
$$ -58526 -64902 -60248 43867 101275 36697 -28805 -86983 77313 112760 49679 15303 -104060
24815a04060j0210Q6957l7936o2372K65J35319M3936q2514M936L2256m7999k7995
$$ -104060 -114270 -27313 -65249 -127621 -127356 7963 51899 -30615 -25679 6577 -41422 -69417
24803f9417P3929J5834q0457L4776J01864n3092j45604J9503J45585J06310k9089
$$ -69417 4512 20346 -60111 -25335 76529 23437 -122167 -102664 42921 149231 120142
24792A20142q8319n7091M5934P2262L7425j791k4763j7602j18118J8642l099J4566
$$ 120142 31823 -25268 20666 92928 130353 128562 103799 86197 -31921 -13279 -16378 -1812
24780a812L4542k0940J20553P5716p0249l9492j26731k7257M0474P1679m2108
$$ -1812 32730 11790 132343 208059 137810 98318 -28413 -55670 -15196 56483 14375
24769A4375k0559M546L932l0765o8106L0002q8200O2604L4900r6272M0024l599
$$ 14375 -6184 -1638 2294 -28471 -96577 -66575 -154775 -92171 -57271 -153543 -113519 -117118
24757a17118L7624R4216p379O7337O5879q1388r2526L1377L0040l8847O4482J13282
$$ -117118 -79494 14722 7343 74680 140559 59171 -33355 -1978 28062 -10785 53697 166979
24745A66979m8705j19989K8495n668j1672k1500k9481m8120J8004J02642L1542
$$ 166979 118274 -1715 26780 21112 9440 -12060 -41541 -89661 -71657 30985 62527
24734F2527J42278m4896j14157j59718O9596l9980Q147M1907L6575M859j9809
$$ 62527 204805 159909 45752 -113966 -44370 -84350 -76203 -34296 2279 7138 -12671
24723a2671R722N2215M1488l3360J9496q7670j00861L258n4946j9145J5340M4904
$$ -12671 -2949 49266 90754 57394 76890 -10780 -111641 -108383 -163329 -182474 -167134 -122230
24711a22230J28843M7271j42506m5490n71n2335q0755R5300J21383J9872j27634
$$ -122230 6613 53884 -88622 -134112 -134683 -187018 -267773 -172473 -51090 -31218 -158852
24700a58852j9540J23703j733K0264Q0777n2461N2592M4316q5672R7888l5230
$$ -158852 -178392 -54689 -56422 -36158 44619 -7842 44750 89066 3394 101282 66052
24689F6052j89294r236N6559K557l7384J57293Q6198j25439j5780p0189k546R3573
$$ 66052 -123242 -132478 -75919 -73362 -110746 46547 132745 7306 -8474 -78663 -81209 12364
24677A2364m0035k3794N4954P1109k9759K7762o6064j24302L9852J08905l9163
$$ 12364 -27671 -51465 3489 74598 44839 72601 6537 -117765 -77913 30992 -8171
24666h171r9471j5364k1756M3333M4303J08571M4641j40199j41775l0516J08787
$$ -8171 -107642 -123006 -144762 -101429 -57126 51445 96086 -44113 -185888 -216404 -107617
24655a07617m3707n2163J62072P0681o9215L4409J2311J04821j24652j6980r871
$$ -107617 -151324 -203487 -41415 29266 -39949 -5540 6771 111592 -13060 -30040 -39911
24644c9911J25960P3439O027J4461j30940j31529P1098Q9627o0210n9247R863
$$ -39911 86049 159488 165515 179976 49036 -82493 -11395 78232 18022 -41225 -31362
24633c1362M2093J18472l6489q8935j34174O9338l2902j136J6411Q5226P4233
$$ -31362 10731 129203 92714 3779 -130395 -61057 -93959 -95095 -78684 6542 80775
24622H0775Q4118j5457n2406o2251j22707j22967m4091N7001K0633J82971M5774
$$ 80775 164893 149436 97030 34779 -87928 -210895 -254986 -197985 -177352 5619 51393
24611E1393o9029k9010j31184m8645J21414J05457J05071p0009M8364M5653j49418
$$ 51393 -17636 -46646 -177830 -226475 -105061 396 105467 35458 83822 129475 -19943
24600a9943m604Q3147l5362j4088j25296p6268q0906O1220Q3398N1482r454L590
$$ -19943 -24547 58600 23238 9150 -116146 -192414 -273320 -212100 -128702 -77220 -86674 -83084
24588h3084J3370L0665P1O3743Q0897o4094n697Q6942L4194J5073J6146n3751
$$ -83084 -69714 -39049 -38978 24765 105662 41568 35871 122813 157007 172080 188226 134475
24576A34475l2682j33738r6894P6122n3389o0721R3936J01457J25178j6112j06238
$$ 134475 101793 -31945 -128839 -52717 -106106 -166827 -72891 28566 153744 137632 31394
24565C1394j40695Q2753J09255J2603q5927q2880O7024Q0101P5805O251p0416
$$ 31394 -109301 -26548 82707 95310 9383 -73497 -6473 73628 149433 155684 85268
24554H5268j86684r5828J9010R3045O5573Q4206J2898L3992o9115J0171p6367
$$ 85268 -101416 -197244 -178234 -85189 -19616 64590 77488 111480 42365 52536 -23831
24543b3831j18457N4670l6102M7467J07878o2801o2952J16805N7456n3797l88
$$ -23831 -142288 -87618 -123720 -76253 31625 -31176 -94128 22677 80133 26336 25948
24532B5948j19742j03775o939J44064J11111M9913J47145l4219n3332q5292j12382
$$ 25948 -93794 -197569 -204508 -60444 50667 100580 247725 213506 160174 74882 -37500
24521c7500q180k885l2233N6581N4944j003n4230k1341k0018r4383R8903J72453
$$ -37500 -45680 -48565 -80798 -24217 30727 29724 -24506 -45847 -65865 -160248 -61345 111108
24509A11108p0933j55558o0086j1891J11530q0016q611n6312r3041L6761N8800
$$ 111108 40175 -115383 -175469 -187360 -75830 -155846 -164457 -220769 -313810 -277049 -218249
24498b18249J6590m8712R5381R9169P9483J3247n2849q2170J9262k7543o5854
$$ -218249 -201659 -250371 -154990 -55821 23662 36909 -15940 -98110 -78848 -106391 -172245
24487a72245J6362J27064J37101N0031M5768r5051r3436J01379p284j8148N7269
$$ -172245 -155883 -28819 108282 158313 204081 109030 15594 116973 109689 91541 148810
24476A48810p5179j9560M38J5825q2735k3906M9069J60378J24648R187j7784k0398
$$ 148810 73631 54071 54509 70334 -12401 -36307 12762 173140 297788 306975 289191 268793
24464B68793m1555P0123j79442j38641J33258j8079L6801J5195p2837J548j0869
$$ 268793 227238 297361 117919 -20722 112536 94457 131258 146453 73616 75164 64295
24453F4295k9714r0753J37677M5816K5341R8954m5716k4188l6519j15939r5916
$$ 64295 34581 -56172 81505 127321 152662 251616 205900 181712 145193 29254 -66662
24442f6662M9479P1794o8713J8983m4165M7720J44065R285o7609j3415P861q3256
$$ -66662 -17183 54611 -14102 4881 -39284 8436 152501 161786 94177 80762 88623 5367
24430E367J80501L9238m9354n9348j81069O880L7749j7753j18414k1006J98611
$$ 5367 185868 225106 175752 116404 -64665 -57785 -20036 -37789 -156203 -177209 21402
24419B1402J82823M6522l8526j40662L7158N499n7369m3072o8572j53432O4472
$$ 21402 204225 250747 212221 71559 108717 114216 56847 13775 -54797 -208229 -143757
24408a43757J03903K4978K6916o048q238K7645O3585p2572o5075K9785l4213p3952
$$ -143757 -39854 -14876 12040 5992 -2246 25399 88984 16412 -48663 -18878 -53091 -127043
24396a27043j04730J20236J29499m4423j8734M4263j7761o6507p0867L6712J86411
$$ -127043 -231773 -111537 17962 -26461 -45195 -932 -18693 -85200 -156067 -119355 67056
24385F7056R7757j26926j3086j4042m7279j35647O330j0152P5057K6778L4886
$$ 67056 164813 37887 24801 10759 -36520 -172167 -165837 -175989 -100932 -74154 -39268
24374c9268k9675r6002L9514M5352l8155J46972o6520p2188O9717P0424J59570
$$ -39268 -68943 -164945 -125431 -80079 -118234 28738 -37782 -109970 -40253 30171 189741
24363A89741q9778j08683Q0609n1181n4653P897J5893l0579K6181p0832j44013
$$ 189741 99963 -8720 71889 20708 -33945 -26048 -10155 -40734 -14553 -85385 -229398
24352b29398q2480M596J40741L4177J01598K7807k2297O1297N9432J14036j19069
$$ -229398 -311878 -307282 -166541 -132364 -30766 -2959 -25256 36041 95473 209509 90440
24341I0440q5255k06R2630j56952O6672m5430k7913K253K8421R777p1660Q5720
$$ 90440 5185 4979 97609 -59343 7329 -38101 -66014 -63761 -35340 -25563 -97223 -11503
24329a1503J22868p8242j22282Q461P2601l7722j11856K9331J81094M7817n7496
$$ -11503 111365 33123 -89159 -80698 -8097 -45819 -157675 -128344 52750 100567 43071
24318D3071q832k7076o2363l1928l4573J8116n2487k7753K15164P4965J1846K1336
$$ 43071 34239 7163 -55200 -87128 -121701 -103585 -156072 -183825 31339 106304 118150 139486
24306A39486m394q5076q5785O358N1524P5662Q4266r4653j1335p0921l3241M0389
$$ 139486 135092 50016 -35769 -29411 22113 97775 182041 87388 76053 5132 -28109 12280
24294A2280M821k1050p9331n1437R322O8223O4394J0387j7934l1128N8809m7762
$$ 12280 17101 -3949 -83280 -134717 -125395 -57172 7222 17609 -325 -31453 27356 -20406
24282b0406p0862l9591J16409j0880k8682N5218J68070o9163j32383K2201Q2708
$$ -20406 -91268 -130859 -14450 -25330 -54012 1206 169276 100113 -32270 -10069 72639
24271G2639j1546J9018r4939p4200o689K1052j840K4225k5911J7682J05485N477
$$ 72639 61093 80111 -14828 -89028 -95717 -74665 -76505 -52280 -78191 -60509 44976 50453
24259E0453n9922l678J02275p1400o3580l3553n6258J39645O437m9319q149K167
$$ 50453 -9469 -13147 89128 17728 -45852 -79405 -135663 3982 10419 -38900 -47049 -44882
24247d4882j6927r367j6060m8289R0381N6315o3631l2268J04154R3607k4123j53293
$$ -44882 -61809 -71176 -87236 -135525 -45144 11171 -52460 -84728 19426 113033 88910 -64383
24235f4383L954o767j11498J2834M1612J0574P0661Q0644m969O123j7869q8108
$$ -64383 -60429 -67196 -178694 -165860 -124248 -113674 -43013 37631 32662 38785 20916 -67192
24223f7192K496k4170J6672J32747j8884J2793O4973L430j11700J674j4172K2224
$$ -67192 -64696 -88866 -72194 60553 41669 54462 119435 122865 11165 12839 -1333 20891
24211B0891J02906M4403j72632m4111O4527N5929M6142o6521L4936j5949J9350
$$ 20891 123797 168200 -4432 -48543 15984 71913 118055 51534 86470 70521 89871
24200H9871p3113k7296P807o0154r3078j1650K3364J21249P0711j8442m8006j32568
$$ 89871 16758 -10538 -2731 -62885 -155963 -167613 -144249 -23000 47711 29269 -18737 -151305
24188a51305q2909K480J63045M0419p1612k1727L5669k0526K0210J3967M934l7658
$$ -151305 -234214 -231734 -68689 -28270 -99882 -121609 -85940 -106466 -86256 -72289 -67355 -105013
24176a05013K0389k9290p3965J08303k967j51043k2640O6100P2696R6118K6539
$$ -105013 -84624 -113914 -187879 -79576 -82543 -233586 -256226 -190126 -117430 -21312 5227
24165E227j4387r185l2617p3673k55472k4074J92213O2960J12258q2761j47045
$$ 5227 -9160 -18345 -50962 -124635 -380107 -404181 -211968 -149008 -36750 -119511 -266556
24154b66556O4186O9896J24448P4876J4862r7471L2276L2257R3946N9366j08522
$$ -266556 -202370 -132474 -8026 66850 81712 -15759 16517 48774 142720 202086 93564
24143I3564j23103j05720l4357P3990J16779Q5416K1025r233m6736p7048n5655
$$ 93564 -29539 -135259 -169616 -95626 21153 106569 127594 118361 71625 -5423 -61078
24132f1078J32696p815q5109L3392J8801K0464L3290O4597j18301j53711m9946
$$ -61078 71618 63803 -21306 12086 30887 51351 84641 149238 30937 -122774 -172720
24121a72720N847Q8320J27961q0397k6550J217p159J4738N9906r213J211j6132
$$ -172720 -166873 -78553 49408 -30989 -57539 -56322 -63481 -48743 11163 1950 3161 -12971
24109a2971k3925L7238p6738l9787K4905M0543Q831J4086j2624P8202Q4683j39697
$$ -12971 -36896 342 -76396 -116183 -91278 -50735 -41904 -27818 -40442 37760 122443 -17254
24097a7254q2897O0222O3810J4810N8905j4608o9975j10719k9551m0608L6299
$$ -17254 -100151 -39929 23881 38691 97596 82988 13013 -97706 -127257 -167865 -131566
24086a31566j2564j4429K7475L6026q505N3064Q0013J22836K1240L786K4039p0766
$$ -131566 -144130 -158559 -131084 -95058 -103563 -50499 29514 152350 173590 177376 201415 130649
24074A30649p9350J942k9731o0467R440L346j16525n7514M1771J4072K3114j1617
$$ 130649 51299 53241 23510 -36957 -27517 -24171 -140696 -198210 -156439 -142367 -119253 -130870
24062a30870j22460j15742L4241M6836j1518J04008J12382J0938O2444O4302K8575
$$ -130870 -253330 -369072 -334831 -287995 -299513 -195505 -83123 -72185 -9741 54561 83136
24051H3136N5208k6907j33500n372J41068L0163k12590J6567M6995Q1900j3254
$$ 83136 138344 111437 -22063 -27435 113633 143796 -68794 -52227 -5232 76668 63414
24040F3414l8173k4510k9961j25847j3484J52334P6071r8691k653M5974m5750
$$ 63414 25241 731 -29230 -155077 -168561 -16227 59844 -38847 -41500 4474 -41276
24029d1276p2538J4330K8191Q4827j63k2659j25587o370P3921j0400m2801k842
$$ -41276 -113814 -99484 -71293 13534 13371 -9288 -134875 -141245 -67324 -77724 -120525 -123367
24017a23367j0290k6008K917M2286P0535n5654o1227j20253K6826R1025J85885
$$ -123367 -133657 -159665 -156748 -114462 -43927 -99581 -160808 -281061 -254235 -163210 22675
24006B2675Q9777q8483n1220l8354K4458M2130N1935k3192o6863M1658m1686k828
$$ 22675 112452 23969 -27251 -65605 -41147 983 52918 29726 -37137 4521 -37165 -39993
23994c9993l6546Q5767J11572K2260j82304k6065O0630K8603J197o1675j49081
$$ -39993 -76539 9228 120800 143060 -39244 -65309 -4679 23924 25121 -36554 -185635
23983a85635p7051K7463J16522K1027n1169O3139p4070r7756O1200J50678r4532
$$ -185635 -262686 -235223 -118701 -97674 -148843 -85704 -159774 -257530 -196330 -45652 -140184
23972a40184J9565o2326J3560N4034l2168J5297R2426K3446q8571j9782q7164
$$ -140184 -120619 -182945 -169385 -115351 -147519 -132222 -39796 -16350 -104921 -124703 -211867
23961b11867j0010R3733m1536m1569O7771J34888J19734J8682J8265K2750l2511
$$ -211867 -221877 -128144 -169680 -211249 -143478 -8590 111144 129826 148091 170841 138330
23950A38330j46927p4959M1297J2758o2959n363L6472p4825K9412O8070N5466
$$ 138330 -8597 -83556 -42259 -29501 -92460 -97823 -61351 -136176 -106764 -38694 16772
23939A6772J7388l465q7185q6082R1761r592Q117p5915m3077K2744R3647M6590
$$ 16772 34160 30695 -56490 -142572 -50811 -60403 -52286 -128201 -171278 -148534 -54887 -8297
23927h297O9569k3287N1333p2399M1468M6549q7241j49332J13785M9055N9262
$$ -8297 61272 37985 89318 16919 58387 104936 17695 -131637 -17852 31203 90465
23916I0465P3077o2442j6014J45481L8045j00351j06342k2643j9999O6746J02804
$$ 90465 163542 101100 85086 230567 268612 168261 61919 39276 19277 86023 188827
23905A88827J3500l8304q3455j12497j93350j1350K05230J38963Q0016K0703k15041
$$ 188827 202327 164023 80568 -31929 -225279 -236629 -31399 107564 187580 208283 -6758
23894f758m0026J03208K9941j01787q5199r0872o0001M1410J83879N5970k9402
$$ -6758 -46784 56424 86365 -15422 -100621 -191493 -251494 -210084 -26205 29765 363
23883C63j6080o7114K0273K0498p9837L3151j7264k8610o4939K3524J10745l9143
$$ 363 -15717 -82831 -62558 -42060 -121897 -88746 -106010 -134620 -199559 -176035 -65290 -104433
23871a04433j0484Q478j3354m8863k856L2588m4091n5431R1174M3510J37120j6014
$$ -104433 -114917 -106439 -119793 -168656 -171512 -138924 -183015 -238446 -147272 -103762 33358 17344
23859A7344J33286m5600o8981J9280o4370n0522q4931p4760J5759R842J2864O4586
$$ 17344 150630 105030 36049 55329 -9041 -59563 -144494 -219254 -203495 -193653 -180789 -116203
23847a16203P0518L3560N9423j3129k1066j4763Q5240L4146j37784l3105r895
$$ -116203 -45685 -12125 47298 34169 13103 -1660 83580 117726 -20058 -53163 -63058
23836f3058J3474m7805L6444R4471J0060r0408n200M8749M516O0703m1019m7842
$$ -63058 -49584 -97389 -60945 33526 43586 -46822 -52022 -3273 1243 61946 20927 -26915
23824b6915J93089k1421m7374O9924p820n6861r7888Q212N0675j4649m2738J7029
$$ -26915 166174 144753 97379 167303 159483 102622 4734 12946 63621 48972 6234 23263
23812B3263Q9397j27477p7171k0782J13903L0672J1547P0861n4714P880n6427
$$ 23263 112660 -14817 -91988 -112770 1133 31805 43352 114213 59499 67379 10952
23801A0952j12936k8814M0915l7394J0670l8160N5090p923j6387o6366j1876M5094
$$ 10952 -101984 -130798 -89883 -127277 -116607 -154767 -99677 -107600 -123987 -190353 -202229 -157135
23789a57135J84990O0765l5155p747J8018j49301P0499K06356j0566j65104r5072
$$ -157135 27855 88620 53465 45718 63736 -85565 -15066 191290 180724 15620 -79452
23778g9452K55L0008R0528n390q1092q2065P6997J22151L4J1323L1021R09m4450
$$ -79452 -79197 -49189 41339 35949 -45143 -127208 -50211 71940 71974 83297 114318 115227 70777
23765G0777o9796J4765M8951l8974Q8577K1293q8599J5495N3574j40493j7943
$$ 70777 981 15746 64697 25723 114300 135593 46994 62489 116063 -24430 -42373
23754d2373R3366l7548K6399r021R296q5831o5201R122J5509J45790J2751O0859
$$ -42373 50993 13445 39844 30823 40119 -45712 -110913 -101791 -86282 59508 72259 133118
23742A33118n3143j58445n9174J7714O9074L3573n8784r0244M0195M0454l910
$$ 133118 79975 -78470 -137644 -119930 -50856 -17283 -76067 -166311 -126116 -85662 -89572
23731h9572l9276q1184m1369P2084P9917K9900M761o213p3552Q3338J72731j9992
$$ -89572 -128848 -210032 -251401 -179317 -99400 -69500 -64739 -70952 -144504 -61166 111565 91573
23719I1573o0560N2078k6003L9164j5979n6056K2325l3005J1254N8328m0720M783
$$ 91573 31013 83091 57088 96252 80273 24217 46542 13537 24791 83119 42399 47182
23707D7182M2213q8960j47961l6591R8835L7297J3406m6460p5027K1363j7298
$$ 47182 89395 435 -147526 -184117 -85282 -47985 -34579 -81039 -156066 -134703 -152001
23696a52001m2181R091J17260Q4936P3065m880q5026p5218Q245P4132k9408P611
$$ -152001 -194182 -185091 -67831 17105 90170 85290 264 -74954 -66709 7423 -21985 -14374
23684a4374K8606r2983p7353J41794k7337P3234P4455j78009n5926P3954K9654
$$ -14374 14232 -78751 -156104 -14310 -41647 31587 106042 -71967 -127893 -53939 -24285
23673b4285p2402j17249j03168K1591m390J9441o4377K9819J86530J11189k446
$$ -24285 -96687 -213936 -317104 -295513 -299903 -280462 -344839 -315020 -128490 -17301 -19747
23662a9747q016Q8714J1928j01529k5059l7253J03776J0371j2553o2521o6140
$$ -19747 -27763 60951 72879 -28650 -53709 -90962 12814 23185 10632 -51889 -118029
23651a18029j31541k633M2530p5062L9947J6450Q7818J6823L8990j5517O9419
$$ -118029 -249570 -252203 -209673 -284735 -244788 -228338 -140520 -123697 -84707 -100224 -30805
23640c0805K043p2389L7883J20969J8456q5094q9480j7096J38534J2529o6609
$$ -30805 -28762 -101151 -63268 57701 76157 -8937 -98417 -115513 23021 35550 -31059
23629c1059M0354o1650N3389M0794j6916M663q8625k1495m404j7800L7813O20
$$ -31059 9295 -52355 1034 41828 24912 29575 -59050 -80545 -84949 -102749 -64936 -64316
23617f4316j55674L363j0535J4495R1539O4473k7874M3641j556k2128n3042P5934
$$ -64316 -219990 -216627 -227162 -212667 -121128 -56655 -84529 -40888 -42444 -64572 -117614 -41680
23605d1680J03910M3499m6502Q132J240j7272q0067K5935K7846j5651M011o1398
$$ -41680 62230 105729 59227 67359 68599 51327 -28740 -2805 25041 9390 13401 -47997
23593d7997L5239j639N6467l2263o5767N3315l1987q9626q0611L4432J45650n1503
$$ -47997 -12758 -14397 42070 9807 -55960 -2645 -34632 -124258 -204869 -170437 -24787 -76290
23581g6290k5880P188M8188J84667m2995m8581n7645J6093J59998Q1246J7767
$$ -76290 -102170 -94982 -46794 137873 94878 46297 -11348 4745 164743 245989 263756
23570B63756p0831j21388K8879J9674j1561j03381q8045n383K3282K8086O8685
$$ 263756 192925 71537 100416 120090 108529 5148 -82897 -88280 -64998 -36912 31773
23559C1773m2764p0321n701K1995p4011m9947o369J32145Q2778P5240j3223r386
$$ 31773 -10991 -81312 -87013 -65018 -139029 -188976 -195345 -63200 19578 94818 81595 72209
23547G2209n5648q576k1254K9057Q6067k9773p9992N3870P8991q2162j46530l9323
$$ 72209 16561 7985 -13269 15788 101855 72082 -7910 45960 124951 42789 -103741 -143064
23535a43064n1906J22221J19279K6862j46991m0560K3410N4510Q1383N1848r0068
$$ -143064 -194970 -72749 46530 73392 -73599 -114159 -90749 -36239 45144 96992 6924
23524F924l058J0653q1938o3095P7660M3714j53323P9724r297n4813k7157O8286
$$ 6924 3866 14519 -67419 -130514 -52854 -9140 -162463 -82739 -92036 -146849 -174006 -105720
23512a05720O0379P6311J1225j02888r232k9378j6585q1928k9098j5037J09768
$$ -105720 -45341 30970 42195 -60693 -69925 -99303 -115888 -197816 -226914 -241951 -132183
23501a32183M820K1009N3873J6197r3105M6248n0947k2856J13154Q1861Q9057
$$ -132183 -127363 -106354 -52481 -36284 -129389 -83141 -134088 -156944 -43790 38071 127128
23490A27128j14646q6495j9230N4051n7529K4011r7619k5564O2427k1438R893
$$ 127128 12482 -74013 -93243 -39192 -96721 -72710 -170329 -195893 -133466 -154904 -145011
23479a45011k8712l8552m5374q0588N4393J69643j2760p440N3114M0360J182j30471
$$ -145011 -173723 -212275 -257649 -338237 -283844 -114201 -126961 -134401 -81287 -40927 -39745 -170216
23467a70216M7151J60643j500r5479q2772q5032j1144N1705N6147m5352N8444
$$ -170216 -123065 37578 36078 -59401 -142173 -227205 -238349 -186644 -130497 -175849 -117405
23456a17405O0362j10797l6355K2898J24168J58752J01954j25171m0442n0396
$$ -117405 -57043 -167840 -204195 -181297 -57129 101623 203577 78406 37964 -12432
23446a2432K0520j847r8552m1304n2761K3284o121k0547K2871J28882k4505J8883
$$ -12432 8088 6241 -92311 -133615 -186376 -163092 -169213 -189760 -166889 -38007 -62512 -43629
23434d3629r0722l6878N9472k0353j2799O3424M7423J2935l6032n4318n466N8447
$$ -43629 -134351 -171229 -111757 -132110 -144909 -81485 -34062 -21127 -57159 -111477 -116943 -58496
23422e8496P8165k3413r0163M5711j9478L6558j6606j02837m4847O8977J33772
$$ -58496 19669 -3744 -93907 -48196 -67674 -31116 -47722 -150559 -195406 -126429 7343
23411G343K5387j5385j33548p8428k3394J19093K8983j7063n394N5230P7612M0734
$$ 7343 32730 17345 -116203 -194631 -218025 -98932 -69949 -87012 -92406 -37176 40436 81170
23399H1170L6708Q0148L4605n4460n532K4039j15684p9601l9165l6446j87091
$$ 81170 117878 198026 232631 178171 172639 196678 80994 1393 -37772 -74218 -261309
23388b61309j8211Q3208N6615L7346N170J6247J19309J7167j1115k5242J0445
$$ -261309 -279520 -196312 -139697 -102351 -97181 -80934 38375 55542 44427 19185 29630
23377B9630J951o8055m4970J9903L6335O4322N8914J73o4954j6831P706p9397
$$ 29630 31581 -36474 -81444 -61541 -25206 39116 98030 98203 33249 16418 24124 -55273
23365e5273l1358P0457O8703j10632n7388m4608O1100l2224M238O6588O1739m9516
$$ -55273 -86631 -16174 52529 -58103 -115491 -160099 -98999 -131223 -126985 -60397 1342 -48174
23353d8174q3634N2125K7181K589L6644M4047k5802J7581m5860J1380J33772p2230
$$ -48174 -131808 -79683 -52502 -49913 -13269 30778 4976 22557 -23303 -11923 121849 49619
23341D9619n6226J31120J02094n9535J03364K0898q3395j43776m3344m1336k1361
$$ 49619 -6607 124513 226607 167072 270436 291334 207939 64163 20819 -20517 -41878
23330d1878l5030j02290M6283J16472j1284L8344m3637j05826J8964J03510R6766
$$ -41878 -76908 -179198 -132915 -16443 -27727 10617 -33020 -138846 -119882 -16372 80394
23319H0394K8694m1560p3322r7219q9771L7596P5037k7932J4694N4132l5157n491
$$ 80394 109088 67528 -5794 -103013 -192784 -155188 -80151 -108083 -93389 -39257 -74414 -79905
23307g9905J31716R1957o0406r7159O3498p9230K225M1101Q6644j80458o8881
$$ -79905 51811 143768 83362 -13797 49701 -29529 -27304 13797 100441 -80017 -148898
23296a48898L2988J01980L8482p7043K8207j20602p8630J10648J31535M7471k7837
$$ -148898 -115910 -13930 24552 -52491 -24284 -144886 -223516 -112868 18667 66138 38301
23285C8301N8477j24270J172j3222j4165O0475J8447O8072o9189r7271K0189K1398
$$ 38301 96778 -27492 -26320 -39542 -53707 6768 25215 93287 24098 -73173 -52984 -31586
23273c1586o2239P6702o205p4115K5292Q3284n2615q8852p9120L0658k4851L2480
$$ -31586 -93825 -17123 -23328 -97443 -72151 11133 -41482 -130334 -209454 -178796 -203647 -171167
23261a71167J4359K7406J35063J5595Q487P223o6148l632l7430j20388J48668
$$ -171167 -156808 -129402 5661 21256 29743 36966 -29182 -32814 -70244 -190632 -41964
23250d1964P4790J02635L0822o9215m1863K3861r6166m8166O718j8473O835Q3889
$$ -41964 32826 135461 166283 97068 55205 79066 -17100 -65266 -58548 -77021 -70186 13703
23238A3703l7182K0219J13678J8209j811r7993l4584L7566L0820p297K150j00379
$$ 13703 -23479 -3260 110418 128627 126816 28823 -5761 31805 62625 55328 57478 -42901
23226d2901p6128J36801J25259M4970j02609j60192q306L3602o4826M0400O2606
$$ -42901 -119029 17772 143031 188001 85392 -74800 -83106 -49504 -114330 -73930 -11324
23215a1324O8136j11592j78891j6035P5250p3602P253R8914M4733O7135M7135
$$ -11324 56812 -54780 -233671 -249706 -174456 -248058 -240805 -141891 -97158 -30023 17112
23204A7112N1922J00683o6187j60254O2973k596m0935j1173k4137J2795j1486
$$ 17112 69034 169717 103530 -56724 6249 3653 -37282 -48455 -72592 -59797 -71283
23193g1283l5395l5379L9061J7121O0253K20388M3316n7153o5082j59488j16585
$$ -71283 -106678 -142057 -102996 -85875 -25622 194766 238082 180929 115847 -43641 -160226
23182a60226q3178n937L0040J16255J16212J04705J2507n8865o832l2522p8736
$$ -160226 -243404 -249341 -219301 -103046 13166 117871 130378 71513 64681 32159 -46577
23171d6577q0292K0867l1142m9677K6612r270J00400K6739J9895m3601j0372k2812
$$ -46577 -126869 -106002 -137144 -186821 -160209 -169479 -69079 -42340 -22445 -66046 -76418 -99230
23159i9230j911L7487n1913n1426O0631J12319J19799R7305n3232O8067R6645
$$ -99230 -101141 -63654 -115567 -166993 -106362 5957 125756 223061 169829 237896 334541
23148C34541q2247M184R391L470k3249J69631K05439N8819N4555P8906J54956
$$ 334541 252294 256478 265869 269339 246090 415721 621160 679979 734534 813440 968396
23137I68396R1552Q2742J57398o2304k44094k19572j86678j51191j52919j02379
$$ 968396 1059948 1142690 1300088 1237784 993690 774118 587440 436249 283330 180951
23127A80951o1102M2255j2631q4946j2384p2570j38936Q0940O1170n6109j31727
$$ 180951 119849 162104 149473 64527 52143 -20427 -159363 -78423 -17253 -73362 -205089
23116b05089j378O6183P3018o803J5264Q2951p0521N7623J29350P4689J11031
$$ -205089 -206467 -140284 -67266 -74069 -58805 24146 -46375 11248 140598 215287 326318
23105C26318j01216k11298j7945n5901l4350K8966K0286l7819j17595N3765K10040
$$ 326318 225102 13804 -4141 -60042 -94392 -65426 -45140 -82959 -200554 -146789 63251
23094F3251J01611J8332l002r0387J9172O9367k8382r0893n822p7563M6483m72
$$ 63251 164862 183194 180192 89805 108977 178344 149962 59069 53247 -24316 22167 21695
23082B1695q6508m6379P9742N1969l7035J52756k7670j38690o5160L0580O1174
$$ 21695 -64813 -111192 -31450 20519 -16516 136240 108570 -30120 -95280 -64700 -3526
23071c526M5227l9773K4007L8624q364r4494j9923J46532K5636j00180K5548J11769
$$ -3526 41701 1928 25935 64559 56195 -38299 -58222 88310 113946 13766 39314 151083
23059A51083o587j02357q8420M1570l0048M7223O7988J30873K4038m4099o1113
$$ 151083 144496 42139 -46281 -4711 -34759 12464 80452 211325 235363 191264 130151
23048A30151p4500q2090j7849j05547P1875Q2367j5112p612n0094J5303K3532
$$ 130151 55651 -26439 -44288 -149835 -77960 4407 -10705 -18317 -68411 -53108 -29576
23037b9576M8510j04073j48661J10103J63732j13365M3783n725p0348K0082K5732
$$ -29576 18934 -85139 -233800 -123697 40035 -73330 -29547 -35272 -105620 -85538 -59806
23026e9806k9820l2176p4235L33902J88159j75138j60087Q2050k0212L6399L3934
$$ -59806 -89626 -121802 -196037 137865 326024 150886 -9201 72849 52637 89036 122970
23015A22970l1196j01885N5039o2910Q812l3307k1620j764K1691o6173q9536K140
$$ 122970 91774 -10111 44928 -17982 -9170 -42477 -64097 -65861 -44170 -110343 -199879 -197739
23003a97739J84932L2664j65233l6703K2665P0058N0723K1630L1780k4678M8199
$$ -197739 -12807 19857 -145376 -182079 -159414 -89356 -38633 -17003 14777 -9901 38298
22992C8298M0780Q4412J04457n3380j54677k2229Q346j42999j5936m6490J51063
$$ 38298 79078 163490 267947 214567 59890 37661 46007 -96992 -112928 -159418 -8355
22981h355J23522j87L5953Q623n405m8056n7449o8460j7083R3919J00477m2125
$$ -8355 115167 114980 150933 159556 154151 106095 48646 -19814 -36897 57022 157499 115374
22969A15374o527k7315l3306P5671j057k078j8923R1265o713j5256m5930p3877
$$ 115374 108847 81532 48226 123897 122840 120762 101839 193104 186391 171135 125205 51328
22957E1328M3201L6579P1576n6379n3154o6912j46130l2181l4275Q1241j2508
$$ 51328 94529 131108 202684 146305 93151 26239 -119891 -152072 -186347 -105106 -117614
22946a17614J8116j8094K2311Q6150J8178P286j7997K7335K893k8940m5071P2162
$$ -117614 -99498 -117592 -95281 -9131 9047 16333 -1664 25671 28564 -376 -45447 26715
22934B6715K1766M0126L9239k0379k1766n2204p2734o3809p244J2749l7863P5034
$$ 26715 48481 88607 127846 107467 85701 33497 -39237 -103046 -110290 -97541 -135404 -60370
22922f0370n4233m0156k1246M0991k8105n4454k5217L8184K3160O6177Q0778n634
$$ -60370 -114603 -154759 -176005 -135014 -163119 -217573 -242790 -204606 -181446 -115269 -34491 -40125
22910d0125O6319O58r8162Q4553j3128k3300M1461L1798j2609j5351J1542Q4976
$$ -40125 26194 26852 -71310 13243 115 -23185 18276 50074 37465 22114 33656 118632
22898A18632p3761L1714J9079q335p3707K7284L9083j39970m1473o3563r013k2787
$$ 118632 44871 76585 95664 87329 13622 40906 79989 -59981 -101454 -165017 -174030 -196817
22886a96817n006L8694P1308N4270n0052q2065N1361Q5639l4892m4552N464O5685
$$ -196817 -201823 -163129 -91821 -37551 -87603 -169668 -118307 -32668 -67560 -112112 -106648 -40963
22874d0963l1936l5908R3275Q39j0293J08126K2812p5256n7598m7237L8420P5587
$$ -40963 -72899 -108807 -15532 -14693 -24986 83140 105952 30696 -26902 -74139 -35719 39868
22862C9868J64327P4749j93o5443r844q4052o3300M9357p411j9862j8397M7468
$$ 39868 204195 278944 278751 213308 203464 119412 56112 105469 98058 78196 59799 107267
22850A07267N720N5955n0355l8690R4617n6402o8524q6216p7264P4846N978J1251
$$ 107267 112987 168942 118587 79897 174514 118112 49588 -36628 -113892 -39046 -33068 -21817
22838b1817J21688o2263k0276m2845L8513J04162L3084n0072l4198M4409O7084
$$ -21817 99871 37608 17332 -25513 13000 117162 150246 100174 65976 110385 177469
22827A77469M4617o6206m1546J85168O9912j74843j33404j04937J08827J40185
$$ 177469 222086 155880 114334 299502 369414 194571 61167 -43770 65057 205242
22817B05242Q2042J3693n8776m6824O899J7925j16776m1067L3285J3238j11338
$$ 205242 287284 300977 242201 195377 202276 220201 103425 62358 95643 108881 -2457
22806b457J20519K2684r4319R6645O9372r726r5283J08019m9285j17601K8352
$$ -2457 118062 140746 46427 143072 212444 202718 107435 215454 166169 48568 76920
22795G6920L3337J1996R9798Q434j14509m0682M1983J7428P0343n0055k5307k126
$$ 76920 110257 122253 222051 230485 115976 75294 117277 134705 205048 154993 129686 127560
22783A27560q6766J3924P1407P6127J9236m9314m4985l8315l8008K9861M5207
$$ 127560 40794 54718 126125 202252 221488 172174 127189 88874 50866 80727 125934
22772A25934l21k4753R4902R3816n4651j6600m9427n2961o7701n0640k4069m5371
$$ 125934 125613 100860 195762 289578 234927 218327 168900 115939 48238 -2402 -26471 -71842
22760g1842m5757P4499L3655N7584Q6345J46653j41225k38416Q2970J15515P4826
$$ -71842 -117599 -43100 -9445 48139 134484 281137 139912 -98504 -15534 99981 174807
22749A74807j8341J31478J6882j17037K6608P4552J9560o7959k2222j13100l4566
$$ 174807 156466 287944 304826 187789 214397 288949 308509 240550 218328 105228 70662
22738G0662k061N3816R8768m569J18973J2462j3037L8468O9534K892j43682j9317
$$ 70662 68601 122417 221185 216616 335589 348051 335014 373482 443016 445908 302226 282909
22726B82909o1052l7710M4059K9337l5731o3870O1604O4503L4827O1085J50142
$$ 282909 221857 184147 228206 257543 221812 157942 219546 284049 318876 379961 530103
22715E30103k0175n0051Q2109J7547k7526k6605l3731j6397J325O411m789J41005
$$ 530103 509928 459877 541986 559533 532007 505402 471671 455274 456599 463010 458221 599226
22703E99226M0534p5544j1257J82738l2701N8062k715L1336Q5235P8396J6974
$$ 599226 639760 564216 552959 735697 702996 761058 758343 789679 874914 953310 970284
22692I70284j63605k1061n5652L0711O1865o1517j03922L8205M1954m1785N3435
$$ 970284 806679 785618 729966 760677 822542 761025 657103 695308 737262 695477 748912
22681G48912p082K6026L1994J09584J49922L588p4110J71746K14898k2853j06777
$$ 748912 741830 767856 799850 909434 1059356 1062944 988834 1160580 1375478 1352625 1245848
22670A245848M8560O9002J6073J05935J13822q8082q8822J08214R6596N4748L7728
$$ 1245848 1294408 1363410 1379483 1485418 1599240 1511158 1422336 1530550 1627146 1681894 1719622
22659A719622J56234L15973J88799J58513L16149K53557N2447o0058j97473l42235
$$ 1719622 1875856 2191829 2380628 2539141 2855290 3108847 3161294 3101236 2903763 2561528
22649B561528k10185j26745n8374J07942J97853q1950J5958L6991o3811J35689
$$ 2561528 2351343 2224598 2166224 2274166 2472019 2390069 2406027 2443018 2379207 2514896
22639B514896J97018K5176K1767J13915P3816J21721J62403J54699J46229J43639
$$ 2514896 2711914 2737090 2758857 2872772 2946588 3068309 3230712 3385411 3531640 3675279
22629C675279J78816J86633J23848J37136J83326J45132J70106J86941J20163
$$ 3675279 3854095 4040728 4164576 4301712 4485038 4630170 4800276 4987217 5107380
22620E107380J43008R2222K43604K63749K93795K16024J72314K41784L97809L44631
$$ 5107380 5250388 5342610 5586214 5849963 6143758 6359782 6532096 6773880 7171689 7516320
22610G516320L14902L82905M18650L50570N00355M12311L81689L97227N04391
$$ 7516320 7831222 8214127 8632777 8983347 9483702 9896013 10277702 10674929 11179320
22601A1179320L26799L91258O92773P47043O98632Q12500J072739J119967J206215
$$ 11179320 11506119 11897377 12590150 13337193 14035825 14848325 15921064 17041031 18247246
22592A8247246J452975J896473K173377K710648L075663L445177L955471M747514
$$ 18247246 19700221 21596694 23770071 26480719 29556382 33001559 36957030 41704544
22584D1704544N554990O899253R510920J4128677K0858797K7813799L1935966
$$ 41704544 47259534 54158787 63669707 77798384 98657181 126470980 158406946
22577A58406946L2168937L0890423K2822714l30984l3467286n5878684n4097159
$$ 158406946 190575883 221466306 244289020 243958036 210490750 154612066 100514907
22570A00514907l6419825k0073419j1547606p496560n340522m021985k866475
$$ 100514907 64095082 44021663 32474057 24977497 19636975 15614990 12748515
22563A2748515k218867j688979j224706r57787p76526n47989m73285m41662m45319
$$ 12748515 10529648 8840669 7615963 6658176 5881650 5333661 4860376 4418714 3973395
22554C973395k28527k55805k81531k03329k25735r5367k27906k70533j80333j45271
$$ 3973395 3744868 3489063 3207532 3004203 2778468 2683101 2455195 2184662 2004329 1859058
22544A859058k76076j68432j46050n6429L6916j17260L0015o9751o8584J381J8336
$$ 1859058 1582982 1414550 1268500 1212071 1248987 1131727 1161742 1091991 1023407 1024788 1043124
22533A043124k0574m7465j00508j09000n4699R1383J14263j62319r6358P84J15002
$$ 1043124 1022550 975085 874577 765577 710878 802261 916524 754205 657847 658631 773633
22522G73633q2917k3151M4471o7401l1132q5040n0347l5763L9433L9917J18348
$$ 773633 690716 667565 712036 644635 613503 528463 478116 442353 481786 521703 640051
22511F40051Q7213l3208O0020Q503k4365k3644j1766j1533M7959R5676P6506N5679
$$ 640051 727264 694056 754076 762579 738214 714570 702804 691271 739230 834906 911412 967091
22499I67091N9949J698J28980J01977J33247J79624j14192k36742k33587k12569
$$ 967091 1027040 1028738 1157718 1259695 1392942 1572566 1458374 1221632 988045 775476
22489G75476j74019j56704K3351R6678j17720j86046q8555J871N4812N7775J6105
$$ 775476 601457 444753 468104 564782 447062 261016 172461 174332 229144 286919 303024
22478C03024J388L1622k1363K9960n1571n984j8775p1326O84J9010L9337J5010
$$ 303024 304412 336034 314671 344631 293060 287076 268301 196975 197659 216669 256006 271016
22466B71016j28785M841K237k4869m2879o7257J24312J8785j13431l0536L4197
$$ 271016 142231 147072 149309 124440 81561 14304 138616 157401 43970 13434 47631
22455D7631N912j1225J34443r334Q6113l3024j34723o8706K6956r5253k263J4428
$$ 47631 53543 42318 176761 167427 253540 220516 85793 17087 44043 -51210 -53473 -39045
22443c9045r0407o9454K56606J32276j8506r4757L3883j8212n1123K1049k5094
$$ -39045 -129452 -198906 57700 189976 171470 76713 110596 92384 41261 62310 37216
22432C7216N8103j9265n4051L1804m5989J2472j77792m2254K48N5511J83053m7326
$$ 37216 95319 76054 22003 53807 7818 20290 -157502 -199756 -199508 -143997 39056 -8270
22420h270L0627j2363j72155q325J24056J48400J48139l3261o9303J2488o4208
$$ -8270 22357 9994 -162161 -170486 -46430 101970 250109 216848 147545 160033 95825
22409I5825k5218k8129N016L4107m4405j21191p7329J02734j0691N7763K7132
$$ 95825 70607 42478 47494 81601 37196 -83995 -161324 -58590 -69281 -11518 15614
22398A5614N2902J10662j9134k7296l2895j42857K3310O6162J43584j0350j5536
$$ 15614 68516 179178 160044 132748 99853 -43004 -19694 46468 190052 179702 164166
22387A64166j9967j29896o9532L6735j4618N3652k8087q7917K6849J8262j4132
$$ 164166 144199 14303 -55229 -18494 -33112 20540 -7547 -95464 -68615 -50353 -64485
22376f4485O7607L6601j10581j3383m5193K8039R0295Q5450r9330K3548O9433
$$ -64485 3122 39723 -70858 -84241 -129434 -101395 -11100 74350 -24980 -1432 68001
22365F8001j00097N8236L5290r8163L3314J21456p3099m4738J21732k5432J6589
$$ 68001 -32096 26140 61430 -36733 -3419 118037 44938 200 121932 96500 113089
22354A13089J1798O343o3569o655Q9124k2135J27017o0251k6381j4628n3385r364
$$ 113089 124887 131230 67661 61006 150130 127995 255012 194761 168380 153752 100367 91003
22342I1003K8716O6980J21286J5522n7031r0742J5006L0887j01840l1845M3260
$$ 91003 119719 186699 307985 323507 266476 175734 190740 221627 119787 87942 131202
22331A31202p1226J6799l0028j6025j26438l607J01805O3552K9096k09142L2603
$$ 131202 59976 76775 46747 30722 -95716 -99323 2482 66034 95130 -114012 -81409
22320h1409P4297L0994K9084O3105m9377l2025M4047L4305r3717M1526m132j10749
$$ -81409 -7112 23882 52966 116071 66694 34669 78716 113021 19304 60830 56698 -54051
22308e4051M0309O1107j6059K7086R6555K3771m9004o1288J9307L1020o4509L7110
$$ -54051 -13742 47365 31306 58392 154947 178718 129714 68426 87733 118753 54244 91354
22296I1354J5160k7068rj65j24731l2967k1535k4498N3172N4888L1836R900m5203
$$ 91354 106514 79446 79437 79272 -45459 -78426 -99961 -124459 -71287 -16399 15437 25337 -19866
22283a9866j657J05535J6500M961N0353r5191n3074M8993k358p0487l7232o0271
$$ -19866 -21523 84012 100512 105473 155826 60635 7561 56554 54196 -16291 -53523 -113794
22271a13794O3462N7932J53666l2649R828K1470k8985p7842r1933P0102K7605
$$ -113794 -50332 7600 161266 128617 138445 159915 130930 53088 -38845 31257 58862
22260E8862J278R4302o28q8973k3297o5342J8871k4359j0831p4685o8718P8984
$$ 58862 60140 154442 153814 64841 41544 -23798 -4927 -29286 -40117 -114802 -183520 -104536
22248a04536L9918P7331L4515N3362n7629j60268k2964L0472N9167L0857P6298
$$ -104536 -64618 12713 47228 100590 42961 -117307 -140271 -109799 -50632 -19775 56523
22237E6523j8881j8488Q482p3430Q175l1011K7835m3345L2967O8806O1601o8295
$$ 56523 37642 19154 27636 -45794 -37619 -68630 -40795 -84140 -51173 17633 79234 10939
22225A0939j6249O7511p1837j07861m6517J12911O2144p0455q484J368j18909
$$ 10939 -5310 62201 -9636 -117497 -164014 -51103 11041 -59414 -67898 -66530 -185439
22214a85439M3012K7379Q2358P1660j2517j14589K6668J10173M799p3288l2239
$$ -185439 -142427 -115048 -32690 38970 26453 -88136 -61468 48705 53504 -19784 -52023
22203e2023K7468j0228J3610K2049N5200P8252J19986N2479r3073j15706j3428
$$ -52023 -24555 -34783 -21173 876 56076 134328 254314 306793 213720 98014 84586
22192H4586Q095M4577j26141J13686O931p6879O1356j21876K0660L395l5167k2928
$$ 84586 92681 137258 11117 124803 131734 54855 116211 -5665 14995 18390 -16777 -39705
22180c9705N2473P6966j4980j00708m221R7979Q0324k4559n4000p08o9631L387
$$ -39705 12768 89734 74754 -25954 -30175 67804 148128 123569 69569 68861 -770 2617
22168B617O1929Q0416J15217K9328q0943q4483o7691l1980M901j25728j9341P9819
$$ 2617 64546 144962 260179 289507 208564 124081 56390 24410 29311 -96417 -115758 -35939
22156c5939l4776j6751J9019K5059R930L8623N9286m6149n369r1424r3783j7310
$$ -35939 -70715 -87466 -68447 -43388 -33458 5165 64451 18302 12933 -78491 -172274 -189584
22144a89584J24590J32354J08678Q4066J055r2029j97625r4258m3432L2404J14045
$$ -189584 -64994 67360 176038 260104 261159 169130 -28495 -122753 -166185 -133781 -19736
22133a9736P3444M6909Q6274p774J2229n0371J9164K8758q9576J5132l6242k33956
$$ -19736 53708 100617 186891 179117 191346 140975 160139 188897 99321 114453 78211 -155745
22121a55745K1143J19299M7741j039k4610K6235p0893n7890J75763l4540l2720
$$ -155745 -134602 -15303 32438 31399 6789 33024 -37869 -95759 80004 45464 12744
22110A2744N7566m8200O8557J00994j58881j39937N7550M2444O61Q7302L7520
$$ 12744 70310 22110 90667 191661 32780 -107157 -49607 -7163 -6502 80800 118320
22099A18320m2285k8231j3119n6131l817Q9359O891J0063R4417K4296k1362L377
$$ 118320 76035 47804 34685 -21446 -25263 64096 70987 81050 175467 199763 178401 181778
22087A81778l9920L6965K9364p6565n1282l2731m2799j46471J890J39566j6814
$$ 181778 141858 178823 208187 131622 80340 47609 4810 -141661 -139771 -205 -17019
22076a7019p8779l5821R6759O355K7317q0513o9775q8746M175Q923P7947M7862
$$ -17019 -95798 -131619 -34860 -28505 -1188 -81701 -151476 -240222 -236047 -227124 -149177 -101315
22064a01315Q3072O1828R677k7189j12397j12229Q0711k6163j0322M597M0859
$$ -101315 -18243 43585 53262 26073 -86324 -198553 -117842 -144005 -154327 -149730 -108871
22053a08871J24786p6535j6616J21952k6002K4141l592j34170P7027J70225m422
$$ -108871 15915 -60620 -77236 44716 18714 42855 39263 -94907 -17880 152345 147923
22042A47923r2173J12548k0732j04236Q154N2137n2677k8042l0657N4550R4066
$$ 147923 55750 168298 147566 43330 51484 103621 50944 22902 -7755 46795 140861
22031A40861J08857m6089p1851K3218M4691j3197J4194J01803L2825M1887J38354
$$ 140861 249718 203629 131778 154996 199687 186490 200684 302487 335312 377199 515553
22020E15553L2103k0827j41118j18098n6253k2776J30526k6060R6259J26325J22335
$$ 515553 547656 526829 385711 267613 211360 188584 319110 293050 389309 515634 637969
22009F37969K33040K84631J99176L6756o1943l2492k24347k86511l73302j78650
$$ 637969 871009 1155640 1354816 1391572 1329629 1297137 1072790 786279 412977 234327
21999B34327l7106j02832j59237k8939J40641O0522n5288Q644Q1092q165k2623
$$ 234327 197221 94389 -64848 -93787 46854 107376 52088 60732 141824 133659 111036
21988A11036N6646p1385j48945l5107J0177Q0746O0691k07664P2447P7410L6920
$$ 111036 167682 96297 -52648 -87755 -77578 3168 63859 -143805 -71358 6052 42972
21977D2972R882j8174j04853M1097Q8869q5638L3686M2939l3962K9014n8022M5582
$$ 42972 52854 34680 -70173 -29076 59793 -25845 7841 50780 16818 45832 -12190 33392
21965C3392L4997K7671J4999k5108o6476J8995j02212j61711J09868K63543J84607
$$ 33392 68389 96060 111059 85951 19475 38470 -63742 -225453 -115585 147958 332565
21954C32565m2229n5829j54724j01568L1554J9368q1579q4036O0948o105J1455
$$ 332565 290336 234507 79783 -21785 9769 29137 -52442 -136478 -75530 -81635 -70180
21943g0180J51411k8533j51286j0473L5524P2634R4736K5108p6462q6612j15037
$$ -70180 81231 52698 -98588 -109061 -73537 -903 93833 118941 42479 -44133 -159170
21932a59170P2768m8337k2007k0958n8404J02307N5667L1436L5848O3269J4432
$$ -159170 -86402 -134739 -156746 -177704 -236108 -133801 -78134 -46698 -10850 52419 66851
21921F6851o8670K0657n1502R018p5577J2777r8623J3023K2900j8522j8597J59159
$$ 66851 -1819 18838 -32664 -23646 -99223 -86446 -185069 -172046 -149146 -167668 -186265 -27106
21909b7106Q2440j5620M7924M1246r699j61632M044J17699J02344p2130j20410
$$ -27106 55334 39714 87638 128884 119185 -42447 -38403 79296 181640 109510 -10900
21898a0900r267M89J34150J1235j09229p0141O9485P6239q1383p3713j0359j11607
$$ -10900 -20167 -19678 114472 125707 16478 -53663 15822 92061 10678 -63035 -73394 -185001
21886a85001n2597l8872J44685P9008k211J3797j09214q7388M8357N4462o3002
$$ -185001 -237598 -276470 -131785 -52777 -54988 -41191 -150405 -237793 -189436 -134974 -197976
21875a97976o3535M8985P9475R2928l8112j6739n693J2807r277J39738N4326O858
$$ -197976 -261511 -212526 -133051 -40123 -78235 -94974 -100667 -87860 -97137 42601 96927 103785
21863A03785l7281l5136k2684k281n9677J3100L5404l3531m791K802j17694o8555
$$ 103785 66504 31368 8684 6403 -53274 -40174 -4770 -38301 -43092 -40290 -157984 -226539
21851b26539L730J02362P6945Q6819j03080j54015l2415J14575P1801k6854r5875
$$ -226539 -222809 -120447 -43502 43317 -59763 -213778 -246193 -131618 -59817 -86671 -182546
21840a82546j1379L5069J8450L2240N2989J08359j0304m0962o7433j4970o9606
$$ -182546 -193925 -158856 -140406 -108166 -55177 53182 42878 1916 -65517 -80487 -150093
21829a50093M4524k945M4665N8085O0729j47470q0220N561J29566K7903J0280
$$ -150093 -105569 -108514 -63849 -5764 54965 -92505 -172725 -167164 -37598 -9695 585
21818E85P1276J91227J15995j62033r0774o3954q3844j5238K00917p5488j85430
$$ 585 71861 263088 379083 217050 126276 62322 -21522 -36760 164157 88669 -96761
21807i6761N3450l9234N6110J45242n935l0683n8295L5849K7712O5996r5187o4455
$$ -96761 -43311 -82545 -26435 118807 112872 82189 23894 59743 87455 153451 58264 -6191
21795f191p8262o6401J0438J55415r499J833Q0697N0053j66376k0661l4341L2262
$$ -6191 -84453 -150854 -140416 14999 5500 7333 88030 138083 -28293 -48954 -83295 -51033
21783e1033O6975j32257o6603J06088q000K0198P4834o34q4481r282l3375r0459
$$ -51033 15942 -116315 -182918 -76830 -84830 -64632 10202 9568 -74913 -84195 -117570 -208029
21771b08029n3070J01800N29M7940J50461N1432J3009j36565j7744J4181N4562
$$ -208029 -261099 -159299 -158770 -110830 39631 91063 104072 -32493 -50237 -36056 18506
21760A8506k5785q2260N4228q3066j9782J2998Q9585j50846O3436k2395M1460
$$ 18506 -7279 -89539 -35311 -118377 -138159 -125161 -35576 -186422 -122986 -145381 -103921
21749a03921J71087K1353o422j10308m7297q5105J3707Q1283j3353O843j08881
$$ -103921 67166 88519 82097 -28211 -75508 -160613 -146906 -65623 -78976 -72133 -181014
21738a81014k0176K8742J72932O8860P8997o5299o6457J3023j2960k4224m5302
$$ -181014 -201190 -172448 484 69344 148341 83042 16585 29608 16648 -7576 -52878
21727e2878j3684O067j10385N9593J20449Q2542J6006K0880l06q1991L2329J61007
$$ -52878 -66562 -60495 -170880 -111287 9162 91704 107710 128590 128284 46293 78622 239629
21715B39629l2854j61572p6263r3355j3291J38328P1775j6109N9295r233q3338
$$ 239629 206775 45203 -31060 -124415 -137706 622 72397 56288 115583 106350 23012
21704B3012k6666j11774N5551J17526P304N5634k4420l0499J49009M2376n5534
$$ 23012 -3654 -115428 -59877 57649 64953 120587 96167 65668 214677 257053 201519
21693B01519j25131q1527o8814k9752Q2422j1240m892R9123J833J7065J02695
$$ 201519 76388 -5139 -73953 -103705 -21283 -32523 -37415 61708 63541 80606 183301
21682A83301l1989q8380N9707K9009m4897m3334n3943L9405J5189l8991r9032
$$ 183301 151312 62932 122639 151648 106751 63417 9474 48879 64068 25077 -73955
21671g3955R8132J94324L1179r3399n4952k4761j9690k4830o3583o2714J28822
$$ -73955 24177 218501 249680 156281 101329 76568 56878 32048 -31535 -94249 34573
21660C4573J80882J04977j36305k3428J3066P060k7840L2605l6894M3340l0697
$$ 34573 215455 320432 184127 160699 173765 180825 152985 185590 148696 192036 161339
21649A61339j27941K2785J7824L3015R0728R9261L2259q2892j70091J907R6562
$$ 161339 33398 56183 74007 107022 197750 297011 329270 246378 76287 78194 174756
21638A74756M4831J0721o8504n0271K3308l8214q908L0170p7812O3090K1216j03395
$$ 174756 219587 230308 161804 111533 134841 96627 87719 117889 40077 103167 124383 20988
21626B0988m0140P8705J33756N6639j42816O7565M2077J19139J01358N0484Q2313
$$ 20988 -19152 59553 193309 249948 107132 174697 216774 335913 437271 487755 570068
21615E70068K12978M3746k4347J35765J95410N4253j3481r5389k27245k08761
$$ 570068 783046 826792 802445 938210 1133620 1187873 1174392 1079003 851758 642997
21605F42997n7476o8764r9788o9064n2058M6912L9871K55094J73878J42004P9719
$$ 642997 585521 516757 416969 347905 295847 342759 382630 637724 811602 953606 1033325
21594A033325L166J21586j0540j91260j05191k85985j52566O6565m1507l5408
$$ 1033325 1036491 1158077 1147537 956277 851086 565101 412535 479100 437593 402185
21584D02185j39311k49535k4473L114q1944P7638J05513k102o116o0815Q3827
$$ 402185 262874 13339 -11134 -8020 -89964 -12326 93187 91085 84969 24154 107981
21573A07981O2510l0574P0081j583r5496o1453Q5259K1991q909N6902r0589m2966
$$ 107981 170491 139917 209998 208415 112919 51466 136725 158716 149807 206709 116120 73154
21561G3154k8939j8311M4054p6098l1495q1496L7353J9110J1388m6924K338l2184
$$ 73154 44215 25904 69958 -6140 -37635 -119131 -81778 -62668 -51280 -98204 -95866 -128050
21549a28050j965L902n8636M1025P2812Q0364k674m9545l7175j17387K9200M8001
$$ -128050 -130015 -126113 -184749 -143724 -70912 9452 6778 -42767 -79942 -197329 -168129 -120128
21537a20128J1552j2866k7016n5387O7571P9029q754N2980k595j35598q2101l3606
$$ -120128 -108576 -121442 -148458 -203845 -136274 -57245 -65999 -13019 -15614 -151212 -233313 -266919
21525b66919m7890J0003J04367M314R7023N5244r478l8555k2188K416P8379J98465
$$ -266919 -314809 -304806 -200439 -196125 -99102 -43858 -53336 -91891 -114079 -111663 -33284 165181
21513A65181o5693j15894j03438p1935j1775J06274M2383M2922L1726l3328N4376
$$ 165181 99488 -16406 -119844 -191779 -203554 -97280 -54897 -11975 19751 -13577 40799
21502D0799k5317J10878R9372k21742j21790K6697O6493J9024O3380j3097M2040
$$ 40799 15482 126360 225732 3990 -117800 -91103 -24610 -5586 57794 44697 86737
21491H6737p9887q3831R3678M6707q1785r2949j9370L6947O8365P4356J9492J1747
$$ 86737 6850 -76981 16697 63404 -18381 -111330 -130700 -93753 -25388 48968 68460 80207
21479H0207k0153P1103p8733j13663R911n0587j00306m6524M6965O0034J05609
$$ 80207 60054 131157 52424 -61239 -51328 -101915 -202221 -248745 -201780 -141746 -36137
21468c6137N6993j4359j562k7237j3679P4508R417k413q9647m299K3219n4592
$$ -36137 20856 6497 4935 -22302 -35981 38527 47944 45531 -44116 -48415 -25196 -79788
21456g9788j3372J39995O2607J0280j58844j03047k3312L7499M6343M0188L1196
$$ -79788 -93160 46835 109442 119722 -39122 -142169 -165481 -127982 -81639 -41451 -10255
21445a0255Q6192Q0520M5399l2767j25124q5247j274J9648k36Q5610j0930j15869
$$ -10255 75937 156457 201856 169089 43965 -41282 -42556 -22908 -23144 62466 51536 -64333
21433f4333J690J24446J25802N2693K8941q771l797J7836j4938j08542j4558L3091
$$ -64333 -62643 61803 187605 240298 269239 260468 256671 274507 259569 151027 136469 169560
21421A69560m4724o7364m3462q7351m8167O1532p819N8608Q0690O164L0489O1967
$$ 169560 124836 57472 14010 -73341 -121508 -59976 -67795 -9187 71503 77667 108156 170123
21409A70123l313K2678j2253j14986R0378M0456j48985r3410P0516J5561Q5614
$$ 170123 166810 189488 177235 62249 152627 193083 44098 -49312 21204 36765 122379
21398A22379P900n7694J7102K3866N2145q2597k9227K6454m9219m779L7878q0456
$$ 122379 130279 72585 89687 113553 165698 83101 53874 80328 31109 26330 64208 -16248
21386a6248N4037J08842J34645o5595m332n518L281m061o6471m2192j22101M7897
$$ -16248 37789 146631 281276 215681 211349 205831 209112 205051 138580 96388 -25713 22184
21374B2184N257K1622L5438j22884P3850m7663p8934J2440K9129n7980l3235J22760
$$ 22184 27441 49063 84501 -38383 35467 -12196 -91130 -78690 -49561 -107541 -140776 -18016
21362a8016J5467j21630K0001J02575P4683R0971N0686R812K1518N6601K807r5792
$$ -18016 -2549 -124179 -104178 -1603 73080 164051 214737 224549 246067 302668 305475 209683
21350B09683o0210j04965M419J14825M1588j62574L7105N3390N5603J01822L0316
$$ 209683 149473 44508 48927 163752 205340 42766 79871 133261 188864 290686 321002
21339C21002j56960l6845Q026J26482l7475q2608J1146L7325R11N8209Q2704J9930
$$ 321002 164042 127197 135223 261705 224230 141622 152768 190093 191004 249213 331917 351847
21327C51847j37006P6633K6065o7367k3313l9436M8529J02972N4242k6353k6119
$$ 351847 214841 291474 317539 250172 226859 187423 235952 338924 393166 366813 340694
21316C40694j76P414N1765M3516l7287P4112R7202r2499Q444J9803J50724P2089
$$ 340694 340518 347932 399697 443213 405926 480038 577240 484741 493185 512988 663712 735801
21304G35801N8656M1361N5290R0919J54156Q2962J44407K58500K80429L34741
$$ 735801 794457 835818 891108 982027 1136183 1219145 1363552 1622052 1902481 2237222
21294B237222N33002O58076O36970O62205O85698L78074j84558j119977j214384
$$ 2237222 2770224 3428300 4065270 4727475 5413173 5791247 5606689 4486712 3272328
21285C272328p85859n62717l72453j59528o6285k04007k16895j46429j5308l9116
$$ 3272328 2486469 1923752 1551299 1391771 1325486 1121479 904584 758155 742847 703731
21275G03731n2320j8784M6858N234K0211K6128m9441q2545j66637j32900k7097
$$ 703731 651411 632627 679485 684719 704930 731058 681617 599072 432435 299535 272438
21264B72438l7034j52309j7066L1534j0770J45897L3224j00981o1288l094N0216
$$ 272438 235404 83095 66029 97563 86793 232690 265914 164933 103645 100551 150767
21253A50767r129K0895L337N941N9857k2429q6900P9133Q2715o8621j15844K4372
$$ 150767 141638 162533 165870 171811 231668 209239 122339 201472 284187 215566 99722 124094
21241A24094R6042m0416r084j07967j03151P1699J67910L2055k4514R0802J01348
$$ 124094 220136 179720 170636 62669 -40482 31217 199127 231182 206668 297470 398818
21230C98818r459m6042P5336J8025j61468L2818r4077m9459n280L2134k5363K395
$$ 398818 389359 343317 418653 436678 275210 308028 213951 164492 159212 191346 165983 168378
21218A68378j575o8871J21312J70804j9101j25118j85470j70778j15325O2146
$$ 168378 166803 97932 219244 390048 370947 245829 60359 -110419 -225744 -163598
21208a63598Q2460J18291J09385P4229M1551J04600M554n3032j5798J06604L6071
$$ -163598 -81138 37153 146538 220767 262318 366918 371472 318440 302642 409246 445317
21197D45317O9750J48638J06752j04971j88998Q9386J05919K5049L232k4686j998
$$ 445317 515067 663705 770457 665486 476488 565874 671793 696842 700074 675388 673390
21186F73390k5457J3563r4412K4360m978Q5315M8550p2843O4085P1131O5Q5905
$$ 673390 647933 661496 567084 591444 586466 671781 720331 647488 711573 782704 782769 868674
21174H68674k2167j73605J6782O8148P5057M6809K2003p7228n4453l8716k8975
$$ 868674 846507 672902 689684 757832 832889 879698 901701 824473 770020 731304 702329
21163G02329Q4182J41270M9388O699N9034J60823P4729p9377o3242l0234L7185
$$ 702329 786511 927781 977169 983868 1042902 1203725 1278454 1199077 1135835 1105601 1142786
21152A142786K20008O7881q5149J6954M1949J9044q4823J20918k0145m7799J8363
$$ 1142786 1362794 1430675 1345526 1362480 1404429 1423473 1338650 1459568 1439423 1391624 1409987
21141A409987Q4752m3252J5915Q3801m2558J7234q607N9283L1407J00285J44250
$$ 1409987 1494739 1451487 1467402 1551203 1508645 1525879 1517272 1576555 1607962 1708247 1852497
21130A852497Q3005K3057N6346Q3732O0038J23701L8364q638N5428R6282R8391
$$ 1852497 1935502 1958559 2014905 2098637 2158675 2282376 2320740 2312102 2367530 2463812 2562203
21119B562203M4196K1884J01623J13371m0651Q8998P5241Q6577J60699L1635J39669
$$ 2562203 2606399 2628283 2729906 2843277 2802626 2891624 2966865 3053442 3214141 3245776 3385445
21108C385445J53106J39072R4077R2908Q1122P5892J44462J49127J79267J16776
$$ 3385445 3538551 3677623 3771700 3864608 3945730 4021622 4166084 4315211 4494478 4611254
21098D611254J32151R7574J42818J16679J21490O5333J03094J48433J19405K24488
$$ 4611254 4743405 4840979 4983797 5100476 5221966 5287299 5390393 5538826 5658231 5882719
21088E882719J79741K96309J93229K87425K60445K70873J82759J43470K90287
$$ 5882719 6062460 6358769 6551998 6839423 7099868 7370741 7553500 7696970 7987257
21079G987257L56474M68001M08475K80392L78833L78080L79309L89100L84820
$$ 7987257 8343731 8811732 9220207 9500599 9879432 10257512 10636821 11025921 11410741
21070A1410741L89517M84028M62146O97750O54331Q70173R14538J063206R83268
$$ 11410741 11800258 12284286 12746432 13444182 14098513 14968686 15883224 16946430 17929698
21061A7929698Q74522Q23038O80444M86732M90116O23711Q09645J078092J075121
$$ 17929698 18804220 19627258 20307702 20794434 21284550 21908261 22717906 23795998 24871119
21052B4871119J012917J255958J396012J476742J719696J890698J769392K059436
$$ 24871119 25884036 27139994 28536006 30012748 31732444 33623142 35392534 37451970
21044C7451970K442956K816440L066927L789994M719081N689688O720894P781089
$$ 37451970 39894926 42711366 45778293 49568287 54287368 59977056 66697950 74479039
21036G4479039Q929705J0575473J2724954J6586764K3538523L4176695M6470710
$$ 74479039 83408744 93984217 106709171 123295935 146834458 181011153 227481863
21029B27481863N4380359N4119204M9027842M0814614J1720653m3599098q9260866
$$ 227481863 281862222 335981426 385009268 425823882 437544535 393945437 304684571
21022C04684571r4671044o7072756m1228662k5986906j7114344j1594273q321850
$$ 304684571 210013527 142940771 101712109 75725203 58610859 47016586 38694736
21015C8694736o431999n065424l970005k978375k226217j707040j325460q36824
$$ 38694736 32262737 27197313 23227308 20248933 18022716 16315676 14990216 14153392
21007A4153392n87827o46611n15345m98226p98464j000146r12187p87066p71250
$$ 14153392 13565565 12918954 12403609 11905383 11106919 10106773 9194586 8407520 7636270
20998G636270o76619l13066k12105k74845k44958l3598P0750N7440k80482n69507
$$ 7636270 6959651 6646585 6434480 6159635 5914677 5881079 5951829 6009269 5728787 5159280
20988E159280o07106l82901l46191m11789l23332k30708k08075j32387j36909
$$ 5159280 4552174 4169273 3823082 3411293 3087961 2857253 2649178 2516791 2379882
20979B379882q7885J1036o6856j38216p7659m4813m2110j90701k4302j18831q7549
$$ 2379882 2291997 2303033 2236177 2097961 2020302 1975489 1933379 1742678 1718376 1599545 1511996
20968A511996l5822k2027J7268J10494p1716p7615m9227p8993j4698l5688k15857
$$ 1511996 1476174 1454147 1471415 1581909 1510193 1432578 1383351 1304358 1289660 1253972 1038115
20957A038115J3798j1005k06432l3044O809K1007M966p889Q449j8584j5627j06305
$$ 1038115 1051913 1040908 834476 801432 808241 829248 834214 826325 834774 816190 800563 694258
20945F94258r0167J2703o4335n7948J06719P7645M8004l8151n5758r641P1834
$$ 694258 604091 616794 552459 494511 601230 678875 726879 688728 632970 623329 695163
20934F95163K9695k3417j29868j02025q5297M4696Q9061L8097m873m9629r5900
$$ 695163 724858 701441 571573 469548 384251 428947 518008 556105 551232 501603 405703
20923D05703J7521L0670j4892J048K9710r2847M8221j1661q4049r2207l847j8337
$$ 405703 423224 453894 439002 440050 469760 376913 425134 413473 329424 237217 233370 215033
20911B15033P5391Q8509n0795Q3930M1096j42691N2183m2656J79800J05864j0321
$$ 215033 290424 378933 328138 412068 453164 310473 362656 320000 499800 605664 595343
20900E95343j84401j08693L5775k5142o041j86029j9897N0788J08426j8608o0805
$$ 595343 410942 302249 338024 312882 306841 120812 100915 151703 260129 241521 180716
20889A80716L4317j5980q0884J01234L7085l9026N4422k6090J7095j00931q5427
$$ 180716 215033 199053 118169 219403 256488 217462 271884 245794 262889 161958 76531
20878G6531P6924M2526j96431j5206m2163L2619K2360J05338K0381N1931k3259
$$ 76531 153455 195981 -450 -15656 -57819 -25200 -2840 102498 122879 174810 151551
20867A51551j01875N2855J39080n2891o3186O8915m0170r0616l8590J06544M9749
$$ 151551 49676 102531 241611 188720 125534 194449 154279 63663 25073 131617 181366
20856A81366q3789m9727M3739N6147N1589k6331K1179O4248J8963m8938j2160
$$ 181366 97577 47850 91589 147736 199325 172994 194173 258421 277384 228446 216286
20845B16286j9216k1355o689L8945L4741O9721o4561j24557p6377o9701K8656
$$ 216286 197070 175715 169026 207971 242712 312433 247872 123315 46938 -22763 5893
20834E893J64196J29715p2357r425L7556K9620n9450j38587k1996p5946m438r5506
$$ 5893 170089 299804 227447 218022 255578 285198 225748 87161 65165 -10781 -15219 -110725
20822a10725O699J34036j10709l2465Q4517N3793o6504l7079R3440N8728Q8188
$$ -110725 -104026 30010 -80699 -113164 -28647 25146 -41358 -78437 15003 73731 161919
20811A61919q5322j36179r0227p0494k8766l6047J13887R6420R1524K9166L9456
$$ 161919 76597 -59582 -149809 -220303 -249069 -285116 -171229 -74809 16715 45881 85337
20800H5337l527Q3083p6041K7849j09480j01050Q1223J24117M1777p8109o7416
$$ 85337 81810 164893 88852 116701 7221 -93829 -12606 111511 153288 75179 7763
20789G763P9448L7674o6997m3319j5902N7732O7690M9533p3204Q5335p3309q6050
$$ 7763 87211 124885 57888 14569 -1333 56399 124089 173622 100418 185753 112444 26394
20777B6394R2043N7419M5753j04107j29487P4725n9261q8030K0630n263O4346
$$ 26394 118437 175856 221609 117502 -11985 62740 3479 -84551 -63921 -69184 -4838
20766d838N9441o9442j4620J7738O1519K7862p6727K7041J03522k8138j8542q1114
$$ -4838 54603 -14839 -29459 -11721 49798 77660 933 27974 131496 103358 84816 3702
20754C702J62426K1832R1567K069m8088j34901j96887j59463M5983J21796N6176
$$ 3702 166128 187960 279527 281596 233508 98607 -98280 -257743 -211760 -89964 -33788
20743c3788O7797J14165R4477j29919j41815M7898p701j44071M3375K2522n140
$$ -33788 34009 148174 242651 112732 -29083 18815 11114 -132957 -89582 -67060 -72200
20732g2200n2620L6152k4128P5421K1462r6923Q0982J42972J61644r5815m1567
$$ -72200 -124820 -88668 -112796 -37375 -15913 -112836 -31854 111118 272762 176947 135380
20721A35380O732p3209P6482r1372j6729o525M9012j19590q4027R0304J01897
$$ 135380 142112 68903 145385 54013 37284 30759 79771 -39819 -123846 -33542 68355
20710F8355M6211Q5152j64493j01775j4649P0584P7173K4822l0618r3511Q7738
$$ 68355 114566 199718 35225 -66550 -81199 -10615 66558 91380 60762 -32749 54989
20699E4989J42432q6314j70795K4349L3224J2747N9630m2613n3147L2792M9004
$$ 54989 197421 111107 -59688 -35339 -2115 10632 70262 27649 -25498 7294 56298
20688E6298k8550J2389r4507j08381L6346R1618L577j3656P0014j2612p1084l5220
$$ 56298 27748 40137 -54370 -162751 -126405 -34787 -31210 -44866 25148 12536 -58548 -93768
20676i3768m6116O2096N4991l4577P6654O3825J2032K9444o104M2462Q4389n0279
$$ -93768 -139884 -77788 -22797 -57374 19280 83105 95137 124581 118477 160939 245328 195049
20664A95049o9580j19575P472l5988m2313n8655n7794M4L4044O5527K1407n7572
$$ 195049 125469 5894 13366 -22622 -64935 -123590 -181384 -181340 -147296 -81769 -60362 -117934
20652a17934Q7518P0296K4489j2631L9725j29965k196J8570J27788L88j9465n1481
$$ -117934 -30416 39880 64369 51738 91463 -38502 -40698 -22128 105660 106048 86583 35102
20640C5102P005p2153m837P5870N1737J4797j6809k3576J3678J44984J1400j19317
$$ 35102 42107 -30046 -34883 40987 92724 107521 90712 67136 80814 225798 237198 117881
20628A17881J8311N5398j7970J6381m5955o7630K1707m1759N7186n8573N7098
$$ 117881 136192 191590 173620 190001 144046 76416 98123 56364 113550 54977 112075
20617A12075O5725p0293j33828J31077Q1027j19127n9138N975N2006p431j3263
$$ 112075 177800 107507 -26321 104756 185783 66656 7518 13493 65499 58068 44805
20606D4805o6761O698k0318j8952N4451Q3013m4873p0834K102o9202N688J29088
$$ 44805 -21956 -15258 -35576 -54528 -77 82936 38063 -32771 -30669 -99871 -94183 34905
20594C4905l4857j30223M9590R2085O4254l8029L3118n3374n0312R7779L8817
$$ 34905 48 -130175 -80585 11500 75754 37725 70843 17469 -32843 64936 103753
20583A03753J8582K150q0778O510J2051k01L2097l865l1154J11665L1475r1537
$$ 103753 122335 124485 43707 50217 62268 62067 94164 90299 59145 170810 202285 110748
20571A10748r5262J2181l766j45006k3145N0856l4707n9821L1508N731m0854R7513
$$ 110748 15486 27667 23901 -121105 -144250 -93394 -128101 -187922 -156414 -150683 -191537 -94024
20559i4024J24062J8082p0117j44100n9020K2746L703M3343k5109K19992J44331
$$ -94024 30038 48120 -21997 -166097 -225117 -202371 -198668 -155325 -180434 39558 183889
20548A83889r7212j23991N9675n0125k4679m2648J9386K4602K9038l9795M3860
$$ 183889 86677 -37314 22361 -27764 -52443 -95091 -75705 -51103 -22065 -61860 -18000
20537a8000j5612j9060O5531j8969p6926k6720Q2228J46163n4282j1985m0030
$$ -18000 -33612 -52672 12859 -6110 -83036 -109756 -27528 118635 64353 52368 12338
20526A2338m8675J17830J69311L7780r0882j15803j1268j2768j3192j14144Q226
$$ 12338 -36337 81493 250804 288584 197702 81899 70631 57863 44671 -69473 -61247
20515f1247J35297n34o7260m4339R8522N2027m6792k2089m5956R7217O8581r1908
$$ -61247 74050 73516 6256 -38083 60439 112466 65674 43585 -2371 94846 163427 71519
20503G1519J3457j7329k4685L1910M2943K9078m464O3408L7583q640k3619q8954
$$ 71519 84976 67647 42962 74872 117815 146893 142429 205837 243420 234780 211161 122207
20491A22207m0871q785m9294n3469l3606R4900j6196L2133Q3237n3929j19094
$$ 122207 81336 72551 23257 -30212 -63818 31082 14886 47019 130256 76327 -42767
20480d2767K7739R0156J00837j3094K0049L1451j29570n7176M327N1208n7037
$$ -42767 -15028 75128 175965 162871 182920 214371 84801 27625 31952 83160 26123
20469B6123k8501R5575O9133n231l1366r0791N7175m4214J29670J19931l2894
$$ 26123 -2378 93197 162330 157099 125733 34942 92117 47903 177573 297504 264610
20458B64610q8504J08677J60028J25926K60515K61946J98662J56870r4280k44757
$$ 264610 176106 284783 444811 570737 831252 1093198 1291860 1448730 1354450 1109693
20448A109693k51375r6135j97665j15381p1153K7035j6728j7O5079J06390Q9877
$$ 1109693 858318 762183 564518 449137 377984 405019 388291 388274 453353 559743 649620
20437F49620J03364Q5960Q3287O6913m417M2830j13871k13792k20110q5658m9121
$$ 649620 752984 838944 922231 989144 984727 1027557 913686 699894 479784 394126 345005
20426C45005j64774j36805j50734j1183L778j1491P7158J58835J02074r2392n1834
$$ 345005 180231 43426 -107308 -118491 -114713 -126204 -49046 109789 211863 119471 67637
20415F7637q0279n4488J21824K2591l9954o7194N7966O127M526Q8413J57653M3821
$$ 67637 -12642 -67130 54694 77285 37331 -29863 28103 34230 38756 127169 284822 328643
20403C28643l0095k7900N7713l3018m5596k1038q6428o1228n1691k298p5570J89531
$$ 328643 298548 270648 328361 295343 249747 228709 142281 81053 29362 27064 -48506 141025
20391A41025K630K05K5702p2791n5472o8125M2420p8376P4474j8854j9601M6212
$$ 141025 143655 143860 169562 96771 41299 -26826 15594 -62782 11692 -7162 -26763 19449
20379A9449k12846l1601J8717R2041J29368R0445n275K70k6407r4789k7752j3214
$$ 19449 -193397 -224998 -206281 -114240 15128 105573 100298 100568 74161 -20628 -48380 -61594
20367f1594P5184J45951j3035o6088J1208k2911J1021j2795p6007p8823o499j7149
$$ -61594 13590 159541 146506 80418 91626 68715 79736 66941 -9066 -87889 -94388 -111537
20355a11537K3603j20673N3691J04178L2566j2401j9066N5811m4042k4055j812
$$ -111537 -87934 -208607 -154916 -50738 -18172 -30573 -49639 6172 -37870 -61925 -63737
20344f3737k2201j41672m5055J10472J21574O7418l106m6942m192j2144o8558
$$ -63737 -85938 -227610 -272665 -162193 -40619 26799 23693 -23249 -27441 -39585 -108143
20333a08143n0132L8170J29407R5600j42262p8172R6748P1944J8093l3232l6012
$$ -108143 -158275 -120105 9302 104902 -37360 -115532 -18784 53160 71253 38021 2009
20322B009m7337n807K1153K6239J15460J10167m0614j98350j26097n7027k7591
$$ 2009 -45328 -51135 -29982 -3743 111717 221884 181270 -17080 -143177 -200204 -227795
20311b27795l1494Q2984j5940P2841K4794K9586q263J16361J7909m7756r6221
$$ -227795 -259289 -176305 -192245 -119404 -94610 -65024 -73287 43074 60983 13227 -82994
20300h2994P958J07428n3455m2458m1547q038L9663Q975J05903l2511q9838L3806
$$ -82994 -75036 32392 -21063 -63521 -105068 -113106 -73443 -64468 41435 8924 -80914 -47108
20288d7108l0680r0972k1346O9066Q2610N1450k8299l1250l011j4747p3688K4689
$$ -47108 -77788 -168760 -190106 -121040 -38430 13020 -15279 -46529 -49540 -64287 -137975 -113286
20276a13286O8449k2165Q658j3196k2035j1960O1743O7709O7554L4643n6869Q5193
$$ -113286 -44837 -67002 -58344 -71540 -93575 -105535 -43792 23917 91471 126114 69245 154438
20264A54438Q6209l0645l0319j4562l7769O9314r7675m0129j30273q5413m8342
$$ 154438 240647 210002 179683 165121 127352 196666 98991 58862 -71411 -156824 -205166
20253b05166P0219O967K9080n547q8115J10689Q8179J4520K8557J56043n3048
$$ -205166 -134947 -127980 -98900 -104447 -192562 -81873 6306 20826 49383 205426 152378
20242A52378J1060K7018n4713o6942L0906k4237n3802j15953L6037P4369o3623
$$ 152378 163438 190456 135743 68801 99707 75470 21668 -94285 -58248 16121 -47502
20231d7502j20292j2872m2957J33265J34744q3514j7127M8481N6650R3137J07681
$$ -47502 -167794 -180666 -223623 -90358 44386 -39128 -56255 -7774 48876 142013 249694
20220B49694M3860Q713j45973q1950j23576n235K4072N9487Q3231k8275j34804
$$ 249694 293554 302267 156294 74344 -49232 -54467 -30395 29092 112323 84048 -50756
20209e0756n2222L5040J64338M4625K2613j7491q1613q9600J43655l0799q8167
$$ -50756 -102978 -67938 96400 141025 163638 146147 64534 -25066 118589 87790 -377
20198c77m4300m9850L2225l8208R9651M447o6587K4218J04594r984n6684r3124
$$ -377 -44677 -94527 -62302 -100510 -859 3588 -62999 -38781 65813 55829 -855 -93979
20186i3979j57q886p9156l1612J7603N8120J31245M6029O769m8399K6011p1718
$$ -93979 -94136 -103022 -182178 -213790 -196187 -138067 -6822 39207 45976 -2423 23588 -48130
20174d8130p8844K5234J37049K36716l5765j39841j12747m9413J17406Q3977m5976
$$ -48130 -126974 -101740 35309 272025 236260 96419 -16328 -65741 51665 135642 89666
20163H9666j25793j11577j1031J10032R8395O7651n6386P9343J19097p5620j09998
$$ 89666 -36127 -147704 -158735 -48703 49692 117343 60957 140300 259397 183777 73779
20152G3779j12345J7019J10251J06263M1022J1428q7846n7956j21795l9126Q3484
$$ 73779 -38566 -21547 88704 194967 235989 247417 159571 101615 -20180 -59306 24178
20141B4178O6441P4773p7657j8603K1628j04588J3448P8406n8367R530Q5567q5610
$$ 24178 90619 165392 87735 69132 90760 -13828 -380 78026 19659 29189 114756 29146
20129B9146Q9696K7720p4924q1726N0055M7679r2950J39213j6058j26691K8907
$$ 29146 118842 146562 71638 -10088 39967 87646 -5304 133909 117851 -8840 20067
20118B0067r01j12145N5120R6919m3051M2546K6705p9970M1419J5783O2687k8402
$$ 20067 19166 -92979 -37859 59060 16009 58555 85260 5290 46709 62492 125179 96777
20106I6777N9715m4001j906M3335M3470p209J81499O6086j40586j0145J64767
$$ 96777 156492 112491 110585 153920 197390 190181 371680 437766 297180 287035 451802
20095D51802l6638K4292N6947J9246q2059j00925L5197j7498N4205m6479p3320
$$ 451802 415164 439456 496403 515649 433590 332665 367862 350364 404569 358090 284770
20084B84770L9168q6927N3960M0087j61309j21665P4804P1723N5557K2219L3104
$$ 284770 323938 237011 290971 331058 169749 48084 122888 194611 250168 272387 305491
20073C05491M9660J3210n1501k3558L3065M9498o362j4104R5973J41053q7968
$$ 305491 355151 368361 316860 293302 326367 375865 369503 355399 451372 592425 504457
20062E04457j71107m9987l3257M3373m0120r8615p2664p1277j06616L6018P5529
$$ 504457 333350 283363 250106 293479 253359 154744 82080 10803 -95813 -59795 15734
20051A5734m4501M406J42887L7033o4555J08602J4887j3328q0437j82670m0366
$$ 15734 -28767 -24361 118526 155559 91004 199606 214493 201165 120728 -61942 -102308
20040a02308L5450J03941o0161N4845J9197R4199k0992M34m5983L3546m0965m7742
$$ -102308 -66858 37083 -23078 31767 50964 145163 124171 124605 78622 112168 71203 23461
20028B3461L0243o7442p6548M6751J08437j8782j14938n1925j7081Q7946N1667
$$ 23461 53704 -13738 -90286 -43535 64902 46120 -68818 -120743 -137824 -49878 1789
20017A789n3478o9308L7017N342n2790p0845O0289J07576N4717j27534m2476n1123
$$ 1789 -51689 -120997 -83980 -78638 -131428 -202273 -141984 -34408 20309 -107225 -149701 -200824
20005b00824j9596N3729Q6113J73247m1999r6182O471L9399o6022l4706O6387
$$ -200824 -220420 -166691 -80578 92669 50670 -45512 -39041 358 -65664 -100370 -33983
19994c3983M0667m0442j29382o0896r96Q1734N6103p0868j12672J173R4703P9062
$$ -33983 6684 -33758 -163140 -224036 -225032 -143298 -87195 -158063 -270735 -269562 -174859 -95797
19982i5797J04048K2278j62603j0615R1916J35293P5437M9395o2036j07136j19173
$$ -95797 8251 30529 -132074 -142689 -50773 84520 159957 209352 147316 40180 -78993
19971g8993m7241R6551P1390O3805M6964r3548j48478L6241M0575j25078M219
$$ -78993 -126234 -29683 41707 105512 152476 58928 -89550 -53309 -12734 -137812 -133593
19960a33593L2968Q449k2878K0682l9301o4258p3122J33889O0438n0475J097L7803
$$ -133593 -100625 -92176 -115054 -94372 -133673 -197931 -271053 -137164 -76726 -127201 -126104 -88301
19948h8301Q9854K8666k7750l1412r3100J4169R363L1280n5474J2287J37628J07747
$$ -88301 1553 30219 2469 -28943 -122043 -107874 -98511 -67231 -122705 -110418 27210 134957
19936A34957J2229k2082l024q6780k4178M4421O6078J8047r7343k4816m6851O5471
$$ 134957 147186 125104 122080 35300 11122 55543 121621 139668 42325 17509 -29342 36129
19924C6129J8238j24559L9918m717R0389m1037k5782J03374O150j30398j50774
$$ 36129 54367 -70192 -30274 -34991 55398 14361 -11421 91953 98103 -32295 -183069
19913a83069k7677J02047K5845Q7984L3149n953q6375r8881q914L5768J16305
$$ -183069 -210746 -108699 -82854 5130 38279 32326 -54049 -152930 -161844 -126076 -9771
19902i771n9947K7685L1239p7042j52791l8414K51645J31309L0074j62889n6120
$$ -9771 -69718 -42033 -10794 -87836 -240627 -279041 -27396 103913 133987 -28902 -85022
19891h5022J2845R2533N3481j6064l4178J4578L9148M2099p7738o7461K7237p802
$$ -85022 -72177 20356 73837 57773 23595 38173 77321 119420 41682 -25779 1458 -6344
19879f344o3732K8153P9888Q7758M4794J01062q1415j65618l8491O2990m9785
$$ -6344 -70076 -41923 37965 125723 170517 271579 190164 24546 -13945 49045 -740
19868g40n2143J2566J15068P1366k5302p7023j24934k5483J07595o1604o2830
$$ -740 -52883 -40317 74751 146117 120815 43792 -81142 -106625 970 -60634 -123464
19857a23464R2429L1662J5638J20290N5646L238r9532p1345J05385n3629n9793
$$ -123464 -31035 627 16265 136555 192201 195439 95907 24562 129947 76318 16525
19846A6525k7739j7603K9033O3704o0376j4490J20611K3317k2008r3103n1335
$$ 16525 -11214 -28817 216 63920 3544 -10946 109665 132982 110974 17871 -33464
19835c3464J26476M058O36O575n398j48716j9355J7009o8586j25852M4599J28649
$$ -33464 93012 97070 97706 104281 98883 -49833 -69188 -52179 -120765 -246617 -202018 -73369
19823g3369J14842M5378J3348j7364K7903k3737k7507o0063j9700M4868J06744
$$ -73369 41473 86851 100199 82835 110738 87001 59494 -569 -20269 24599 131343
19812A31343j129J200J8444k1213J06688N4429l4397l5536J6439l3428o2700j60284
$$ 131343 130214 131414 149858 128645 235333 289762 255365 219829 236268 202840 140140 -20144
19800b0144n3114o8024J23030R5792O2223p3928R71J3960l7630M0884P3671K2455
$$ -20144 -73258 -141282 -18252 77540 139763 65835 66806 80766 43136 84020 157691 180146
19788A80146j68388o7918J39375K7903Q6338O4733J46977k1634O126r6169o6258
$$ 180146 11758 -56160 83215 111118 197456 262189 409166 387532 393658 297489 231231
19777B31231n9869k2386p7630J4741n6453m9933K7181K3808N3380m9050M4319
$$ 231231 171362 148976 71346 86087 29634 -20299 6882 30690 84070 35020 79339
19766G9339q5006P228J51305O2014m3400M7333k2624K8743j2307j20017O0514
$$ 79339 -5667 1561 152866 214880 171480 218813 196189 224932 212625 92608 153122
19755A53122L6060M5387J40643o8599j72346l949O8068J71348L7669J102k4297
$$ 153122 189182 234569 375212 306613 134267 130318 198386 369734 407403 408505 384208
19744C84208P2467n435Q9937M5346k5169k2228r269j10044q9213L2465N3839o8550
$$ 384208 456675 451240 541177 586523 561354 539126 529857 419813 330600 363065 416904 348354
19732C48354o5935q7203J27589M0492o2163k5742K2022K8711N5929P3536n4946
$$ 348354 282419 195216 322805 363297 301134 275392 297414 326125 382054 455590 400644
19721D00644j44141M2635N2025k1962P8231O5320l7550M8516O4844m996K5104
$$ 400644 256503 299138 351163 329201 407432 472752 435202 483718 548562 543566 568670
19710E68670k9143r2107o065o1809n4854R3892l9049j81800p05K0469r489K4448
$$ 568670 539527 447420 441355 379546 324692 418584 379535 197735 197030 217499 208010 232458
19698B32458Q4011m0875N7914J26888r679j14070j4504k1843r0040l4372L1176
$$ 232458 316469 275594 333508 460396 450717 336647 322143 300300 210260 175888 207064
19687B07064j8146J21669J02750K3434o1618M6942j1834m0426p561m0428L8294
$$ 207064 188918 310587 413337 436771 375153 422095 410261 369835 362274 321846 360140
19676C60140J24016L2193k542j3932R3497j3741j8297J16838N5382l8979j50191
$$ 360140 484156 516349 513807 499875 593372 579631 561334 678172 733554 694575 544384
19665E44384q8405J4790K8157R9430J21838N7658l8014n4199M0581N8028Q2319
$$ 544384 455979 470769 498926 598356 720194 777852 739838 685639 726220 784248 866567
19654H66567P4009o4683r2625n5283J0410N5465J6142k8316O3590J5406P9415
$$ 866567 940576 875893 783268 727985 738395 793860 810002 781686 845276 860682 940097
19643I40097J62609L1255l6560Q1226K7805P9330p6669N1083o8476k5035Q1227
$$ 940097 1102706 1133961 1097401 1178627 1206432 1285762 1209093 1260176 1191700 1166665 1247892
19632A247892J03171M4172l2812k4447L5214L5113M2637J59265O0803K6603P478
$$ 1247892 1351063 1395235 1362423 1337976 1373190 1408303 1450940 1610205 1671008 1697611 1705089
19621A705089J77633J44022R5462J6054Q1263J69541j2066m5755J05916J36058
$$ 1705089 1882722 2026744 2122206 2138260 2219523 2389064 2376998 2331243 2437159 2573217
19611B573217J14583Q6838L8177J57053J22567l6600L0326J93366K04625J20994
$$ 2573217 2687800 2774638 2812815 2969868 3092435 3055835 3086161 3279527 3484152 3605146
19601C605146J48411J35321R1876J35234K74431L16102K00487K49836J80142J26207
$$ 3605146 3753557 3888878 3980754 4115988 4390419 4706521 4907008 5156844 5336986 5463193
19591E463193J59776J69238K48799L66255L48022K65459L63067K92357L24085
$$ 5463193 5622969 5792207 6041006 6407261 6755283 7020742 7383809 7676166 8000251
19582H000251K56576K14765L87921M84753M77421M22270O12280O71390P82278
$$ 8000251 8256827 8471592 8859513 9344266 9821687 10243957 10856237 11527627 12309905
19573A2309905J003215Q75337R32726J275266J479131J645185J824115K216528
$$ 12309905 13313120 14188457 15121183 16396449 17875580 19520765 21344880 23561408
19565B3561408K857598L967300N826853Q154747R443033Q663871Q086992Q989018
$$ 23561408 26419006 30386306 36213159 44367906 53810939 62474810 70561802 79550820
19557G9550820N388524q747367j2492185l669996K742233L998319M485943O188091
$$ 79550820 84939344 76191977 63699792 60029796 62772029 66770348 71256291 77444382
19549G7444382J446743j4547214j8507949j0853232n301607k219992n26286O89514
$$ 77444382 78891125 64343911 45835962 34982730 29681123 27461131 26934845 27624359
19541B7624359J693125K995668M982279P650218R052115Q313404P760875Q993390
$$ 27624359 29317484 32313152 37295431 44945649 53997764 62311168 70072043 79065433
19533G9065433N432969r507874j3787582m674411J882532L479560M066921N560811
$$ 79065433 84498402 74990528 61202946 56528535 58411067 61890627 65957548 71518359
19525G1518359L95336j5844348j9908003j2282977o726386l878395k311410j486405
$$ 71518359 71913695 56069347 36161344 23878367 17151981 13273586 10962176 9475771
19517I475771j155220j164860r84142q13837o80800l43055k55394k68174k41597
$$ 9475771 8320551 7155691 6171549 5357712 4676912 4333857 4078463 3810289 3568692
19508C568692k63104j92759k27626j35343j1483L0230J14705p649j43263j22085
$$ 3568692 3305588 3112829 2885203 2749860 2738377 2768607 2883312 2875663 2732400 2610315
19498B610315k40923k23599j50684j83863N2755M4176j50221k60946j67010j71022
$$ 2610315 2369392 2145793 1995109 1811246 1864001 1908177 1757956 1497010 1330000 1158978
19488A158978j37519j06026N8888l7282p5264L3346j05957j18494L0495O7757
$$ 1158978 1021459 915433 974321 937039 861775 895121 789164 670670 701165 768922
19478G68922k3156j44933o665M1235P7551q0498m8949o253o6223J9362p7161p2798
$$ 768922 745766 600833 594168 635403 712954 632456 583507 577254 511031 530393 453232 380434
19466C80434p7501j81055l6416J5836M497Q4300K47722M1265j62367k5538R8153
$$ 380434 302933 121878 85462 101298 105795 190095 437817 479082 316715 291177 389330
19455C89330J9450j30034j9482o0747K2854J9558M026m1313L8372J63400n4274
$$ 389330 408780 278746 259264 198517 221371 240929 244955 203642 242014 405414 351140
19444C51140q4940m5697p9618m9815m8689m7069Q7411r529O2816M9280K1933p3266
$$ 351140 266200 220503 140885 91070 42381 -4688 82723 73194 136010 185290 207223 133957
19432A33957N0706P6984R4733n0900r1982k4241j03350q8857n907K2885R038P2249
$$ 133957 184663 261647 356380 305480 213498 189257 85907 -2950 -8857 14028 23066 95315
19420I5315l8816o3051L5694j33455P6016Q0131L9843m2863m7613j08213J2670
$$ 95315 56499 -6552 29142 -104313 -28297 51834 91677 48814 1201 -107012 -94342
19409i4342K8495K722K2904n8773J523m261j9463O5121n4217j9893K00724J16241
$$ -94342 -65847 -63125 -40221 -98994 -97471 -101732 -121195 -56074 -110291 -130184 70540 186781
19397A86781O7108m6257j89707m1154L7803j4561k7122N1351O9633L1105J0418
$$ 186781 253889 207632 17925 -23229 14574 13 -27109 24242 93875 124980 135398
19386A35398n8895m4333K4524M2963k9039N7160K6925M8035m02P7161m6363j53019
$$ 135398 76503 32170 56694 99657 70618 127778 154703 202738 202336 279497 233134 80115
19374H0115J3263l1900P005j06738q9389R0543K7216K2676J02854P5238k2527
$$ 80115 93378 61478 68483 -38255 -127644 -37101 -9885 12791 115645 190883 168356
19363A68356j0782j24884k0428L332j03208o2975k7396O2416K1836k5849J31476
$$ 168356 157574 32690 12262 15594 -87614 -150589 -177985 -115569 -93733 -119582 11894
19352A1894j7147l7324k3314L9454r070L1388L6897O731m5934k8957O7051m8889
$$ 11894 -5253 -42577 -65891 -26437 -35507 -4119 32778 39509 -6425 -35382 31669 -17220
19340a7220n2524J59553k1293p6418m5710J10241J27798M5383M4544M4387l9679
$$ -17220 -69744 89809 68516 -7902 -53612 56629 184427 229810 274354 318741 279062
19329B79062o3619p6403l4555J3659p963O6731q7001j5905N8814J5877P184m0575
$$ 279062 215443 139040 104485 118144 110181 176912 89911 74006 132820 148697 155881 115306
19317A15306M6555Q1419O2575K2432P4862K428q830l5117O2946R2096M7417L5699
$$ 115306 161861 243280 305855 328287 403149 405577 396747 361630 424576 516672 564089 599788
19305E99788O645n8826j25526j5466J8678p3772j77209M5996k8826m9132O1917
$$ 599788 606433 547607 422081 406615 425293 351521 174312 220308 191482 142350 204267
19294B04267r1484o4958L6885N8509L1860q0908N751J25934Q5155k3147j8344
$$ 204267 112783 47825 84710 143219 175079 94171 99922 225856 311011 287864 269520
19283B69520Q5535K3800N66n7847j14252n5996J38994J18862r9872n1334J08689
$$ 269520 355055 378855 379421 321574 207322 151326 290320 409182 309310 257976 366665
19272C66665M6394o1276m8064j48804p8106K8490O2672o4418R601Q8212k9468
$$ 366665 413059 351783 303719 154915 76809 105299 167971 103553 113154 201366 171898
19261A71898q4084r7625N0239P5851j3258J2477r4580M1910O3428l2498n4160
$$ 171898 87814 -9811 40428 116279 103021 115498 20918 62828 126256 93758 39598
19250C9598R9721o0372m8927l7880k1964N0230m5238l8325L7865K8870R1195k8415
$$ 39598 139319 78947 30020 -7860 -29824 20406 -24832 -63157 -25292 3578 94773 66358
19238F6358l8992Q937p8136k4017l8103L7640M660j30761l927K9245k5021J25931
$$ 66358 27366 36303 -41833 -65850 -103953 -66313 -61653 -192414 -196341 -167096 -192117 -66186
19226f6186K13703L5106j02484j15956J01345o6480o4899N1173J42377K3761q0742
$$ -66186 147517 182623 80139 -35817 65528 -952 -65851 -14678 127699 151460 70718
19215G0718M504L3962r8320k0881O6951R579P1722k4715r3653j47799J6513P0881
$$ 70718 75222 109184 10864 -10017 56934 66513 138235 113520 19867 -127932 -111419 -40538
19203d0538o199J31003N047K4545M7160K9956m9886j99139q0915K5531J69066
$$ -40538 -46737 84266 89313 113858 161018 190974 141088 -58051 -138966 -113435 55631
19192E5631N1755n6667j4322O2809j08687o3147j8913j9487m6314O8298j5179
$$ 55631 107386 50719 36397 99206 -9481 -72628 -91541 -111028 -157342 -89044 -104223
19181a04223p9233Q82O9546j6866M0470P530j39714j0722O6457J05526R5569j9897
$$ -104223 -183456 -182574 -113028 -129894 -89424 -81894 -221608 -232330 -165873 -60347 35222 15325
19169A5325J6071k5578j07611P11l5118m4559P3254J2064r4520k8989J57109J34698
$$ 15325 31396 5818 -101793 -101082 -136200 -180759 -107505 -95441 -189961 -218950 -61841 72857
19157G2857l4839n6393o8564j5792L3396O1828m4515L6620K1413K6097O2146M1032
$$ 72857 38018 -18375 -86939 -102731 -69335 -7507 -52022 -15402 6011 32108 94254 135286
19145A35286J100p1319m5305k3525k7783l2535J1182L0280P9575j623K9982q771
$$ 135286 136386 65067 19762 -3763 -31546 -64081 -52899 -22619 56956 55333 85315 76544
19133G6544k8026k7705o0959Q4376j9248j24972m1458K9537J19039J05387K7040
$$ 76544 48518 20813 -40146 44230 24982 -99990 -141448 -111911 7128 112515 139555
19122A39555p1674j4545L3735O1648l0040m8458p9761q382j3414k2082P159q040
$$ 139555 67881 53336 87071 148719 118679 70221 -9540 -17922 -31336 -53418 -46259 -54299
19110e4299o35j34495N1893k6565l4388J02108K6730j6387J21864J63403r6332
$$ -54299 -54934 -189429 -137536 -164101 -198489 -96381 -69651 -86038 35826 199229 102897
19099A02897k6605M0886q2769l3452M2054J7362n903K7041Q6459o2927j13749
$$ 102897 76292 117178 34409 957 43011 60373 54470 81511 167970 105043 -8706
19088h706k1027J17569O3591P5031q9529p0277j57876R7409J19230j98038j1522
$$ -8706 -29733 87836 151427 226458 136929 66652 -91224 6185 125415 -72623 -84145
19077h4145L0980O5592Q6162j36098r3812n9018Q4566J33127K6585L3063O5853
$$ -84145 -53165 12427 98589 -37509 -131321 -190339 -105773 27354 53939 87002 152855
19066A52855q840j27013m2281M4616K3333q5712q4846J28511N6442j03958j5287
$$ 152855 144015 17002 -25279 19337 42670 -43042 -127888 623 57065 -46893 -62180
19055f2180k1612J41285l6039r6527J7081m3720K6421j4191j17704Q3952M0493
$$ -62180 -83792 57493 21454 -75073 -57992 -101712 -75291 -89482 -207186 -123234 -82741
19044h2741J5846m7005N1527J28820k8761r7792n4029j6018N6320o3497N8948
$$ -82741 -66895 -113900 -62373 66447 37686 -60106 -114135 -130153 -73833 -137330 -78382
19033g8382J08165J05995l2940n3933M1533N6300L1210l2354k1226k6001R673
$$ -78382 29783 135778 102838 48905 90438 146738 177948 145594 124368 98367 108040
19022A08040J18760J790l6407Q84O4261Q2328j7100p3602M3297M2511m7911L3208
$$ 108040 226800 228590 192183 193067 257328 339656 322556 248954 292251 334762 286851 320059
19010C20059O1399k7599M3739J42071P895j11226n6351L2624j44557k46325l1979
$$ 320059 381458 353859 397598 539669 547564 436338 379987 412611 268054 21729 -10250
18999a0250O9714Q6022N6186L7969L0425Q7606P9961J09537K1049K7632q7569
$$ -10250 59464 145486 201672 239641 270066 357672 437633 547170 568219 595851 508282
18988E08282j67939M1955Q0402K8724R2807P5138J19734j56598j66819p5627l6119
$$ 508282 340343 382298 462700 491424 584231 659369 779103 622505 455686 380059 343940
18977C43940m8132o9171r2250j65683J19736J35088J2771j34817j55841R7698
$$ 343940 295808 226637 134387 -31296 88440 223528 236299 101482 -54359 43339
18967D3339k1911j16300n0945R343J38553P694j0420p8468k5418J38671L0262
$$ 43339 21428 -94872 -145817 -136474 2079 9773 -647 -79115 -104533 34138 64400
18956F4400j08595p2808J4885J09451J44032Q5849l4067q9192Q1077p990n878
$$ 64400 -44195 -117003 -102118 7333 151365 237214 203147 113955 195032 187042 181164
18945A81164o5296O163O2631n6054l9543J07399M8220m6016o8451n6659J38568
$$ 181164 115868 122031 184662 128608 89065 196464 244684 198668 130217 73558 212126
18934B12126p7949q0491N3008l0245n0455m7109o659m9445K4052K0036L7205K10081
$$ 212126 134177 53686 106694 76449 25994 -21115 -27774 -77219 -53167 -33131 4074 214155
18922B14155j40214j98096Q5750J51445k3231p8449L1719J7252R7971n8625p0786
$$ 214155 73941 -124155 -38405 113040 89809 11360 43079 60331 158302 99677 28891
18911B8891J6418N3207M7511K3444P0856N3037n2925M4715M4031j49786n8916
$$ 28891 45309 98516 146027 169471 240327 293364 240439 285154 329185 179399 120483
18900A20483P4158l8232Q2022k619O3429J18573n4966K8416m3273J18215Q7613
$$ 120483 194641 156409 238431 235812 299241 417814 362848 391264 347991 466206 553819
18889E53819Q756O5200l9123k3868N0254O3274o9802o8024K102L2800J10854k2643
$$ 553819 562575 627775 588652 564784 615038 678312 608510 540486 542588 575388 686242 663599
18877F63599k0423r5870m6966j11978R3163j7149j09509m6636R2460k3170j05622
$$ 663599 643176 547306 500340 388362 481525 464376 354867 308231 400691 377521 271899
18866B71899L9913J08288M4149o7685O8093O4137R6602M9018o6588J9314N7356
$$ 271899 311812 420100 464249 396564 464657 528794 625396 674414 607826 627140 684496
18855F84496n5425r205L5240N670j22875p7581J61619J37652R8882q36m1902p0758
$$ 684496 629071 619866 655106 660776 537901 460320 621939 759591 858473 857637 815735 744977
18843G44977k9720n0168j10616k3140O2415N4559N1032Q6090j11112j77360L7559
$$ 744977 715257 665089 554473 531333 593748 648307 699339 785429 674317 496957 534516
18832E34516k816n7110k6477O8534J39032L0400l4000O778q6012P2462J31573
$$ 534516 531700 474590 448113 516647 655679 686079 652079 658857 572845 645307 776880
18821G76880J49721k0501J5456L1377m5358l0848R9002k1987j6818J01186J57878
$$ 776880 926601 906100 921556 952933 907575 876727 975729 953742 936924 1038110 1195988
18810A195988K7576j6794p72J4420n4602k3315L8451Q3359k8834O8037P4834N998
$$ 1195988 1223564 1206770 1205998 1220418 1165816 1142501 1180952 1264311 1235477 1303514 1378348 1384346
18798A384346J19908J5951k5082N7229N633N8173O6845Q731J23891K50385r5668
$$ 1384346 1504254 1520205 1495123 1552352 1557985 1616158 1683003 1691734 1815625 2066010 1970342
18787A970342j1762R6836J49070L9872O043m3786J23565J18180J56203J44499
$$ 1970342 1958580 2055416 2204486 2244358 2250401 2206615 2330180 2448360 2604563 2749062
18777B749062J55051N6180Q8513L2002Q7131J50515J93845J61901J56550K53657
$$ 2749062 2904113 2960293 3048806 3080808 3167939 3318454 3512299 3674200 3830750 4084407
18767D084407L25196K54225J80552L45271L03470j68881O463N1600Q8151J88676
$$ 4084407 4409603 4663828 4844380 5189651 5493121 5324240 5330703 5382303 5470454 5659130
18757E659130K17715J97742K58127K12345K99563K93823L70924M56497L89982
$$ 5659130 5876845 6074587 6332714 6545059 6844622 7138445 7509369 7965866 8355848
18748H355848L84752M17095M29124M76716O36052N42977O15261Q32309J048686
$$ 8355848 8740600 9157695 9586819 10063535 10699587 11242564 11857825 12690134 13738820
18739A3738820J146190J124724J582029J820861K018371K719495L919449N738708
$$ 13738820 14885010 16009734 17591763 19412624 21430995 24150490 28069939 33808647
18731C3808647Q074263R348939Q346572P603898Q634494N236880q558169j2383954
$$ 33808647 41882910 51231849 59578421 67182319 75816813 81053693 72495524 60111570
18723F0111570m039540J981844L327876L970283N390428Q08248j4097990j7841934
$$ 60111570 56072030 58053874 61381750 65352033 70742461 71550709 57452719 39610785
18715C9610785j0848521n621208l055661j617059j080153n40245L2872N29975
$$ 39610785 28762264 23141056 20085395 18468336 17388183 16847938 16880810 17410785
18707A7410785P72674R92465J348165J644398K036325K949847M821959P033541
$$ 17410785 18183459 19175924 20524089 22168487 24204812 27154659 31976618 39010159
18699C9010159R269186R636319Q247122Q290711R088701O20659j3956349j1447618
$$ 39010159 48279345 57915664 66162786 74453497 83542198 84162857 70206508 58758890
18691E8758890j944155K655975L385714M261628M615627m803678j9208949j7295972
$$ 58758890 56814735 59470710 62856424 67118052 71733679 66930001 47721052 30425080
18683C0425080r904135n474513l286727k095618j446573j015266p79014o54151
$$ 30425080 20520945 15046432 11759705 9664087 8217514 7202248 6423234 5769083
18675E769083n32623m31409l87125k27020j32316M586j46156k89908l24590l29972
$$ 5769083 5236460 4805051 4417926 4190906 4058590 4063176 3917020 3627112 3302522 2972550
18665B972550l92053l42581k38085q248o9794p5295j31038n4774j36933j38965
$$ 2972550 2580497 2237916 1999831 1991583 1921789 1846494 1715456 1660682 1523749 1384784
18655A384784q7010L2233j09526k3843J19522J31014N4815j875L8954M6071j65214
$$ 1384784 1297774 1330007 1220481 1196638 1316160 1447174 1501989 1500114 1539068 1585139 1419925
18644A419925n4855m7619n2353l763J749O7898J28560q4390j61178j09513o6590
$$ 1419925 1365070 1317451 1265098 1261335 1263084 1330982 1459542 1375152 1213974 1104461 1037871
18633A037871K317n6253j92325r2356j09489j9433O8262K9845p8093k6889o9265
$$ 1037871 1040188 983935 791610 699254 589765 570332 638594 668439 590346 563457 494192
18622D94192l9924n2498j16681q1342l5064R5993m1681J3530R9049O2642o6079
$$ 494192 454268 401770 285089 203747 168683 264676 222995 236525 335574 398216 332137
18611C32137m2515Q707N0884r1138j34675q60L0682R7749p0390k0903N3233M4375
$$ 332137 289622 298329 349213 258075 123400 122540 153222 250971 180581 159678 212911 257286
18599B57286L4355R9575k3563r7570n391J18710J49951J37763L7031n0002j04762
$$ 257286 291641 391216 367653 270083 264692 383402 533353 671116 708147 658145 553383
18588E53383Q8203j23976k21259l0594o7885j9554L8802Q9645L535n6577O6129
$$ 553383 641586 517610 296351 265757 197872 178318 217120 306765 310300 253723 319852
18577C19852r5030J1038p4497m2444l0615J43213J82721K1720p7529J7413J32394
$$ 319852 224822 235860 161363 118919 88304 231517 414238 435958 358429 375842 508236
18566E08236M8875N8344L0583q1963j61608n903N7164o3025q3203k9774k7104
$$ 508236 557111 615455 646038 564075 402467 396564 453728 390703 307500 277726 250622
18555B50622N3026P8935O9508l4589l4065k03191j66044l5384P0709K9255p2226
$$ 250622 303648 382583 452091 417502 383437 180246 14202 -21182 49527 78782 6556
18544F556m4081o941P3025R8057m980l1294J22605J76189J06899j16156k2719
$$ 6556 -37525 -44466 28559 126616 121636 90342 212947 389136 496035 379879 357160
18533C57160M492j19339j81245j36091O2708p1288q2578L5792N9497N0468J65821
$$ 357160 361652 242313 61068 -75023 -12315 -83603 -166181 -130389 -70892 -20424 145397
18522A45397o5045O6546Q654r6016R7660k1696j17403k7153O849O0233j1022K9601
$$ 145397 80352 146898 155552 59536 157196 135500 18097 -9056 -2207 58026 47004 76605
18510G6605J22652K6414j4999q5188j21057j10202j3969K0662R2449Q8716r289
$$ 76605 199257 225671 210672 125484 4427 -105775 -119744 -99082 -6633 82083 72794
18499G2794q963K2555J17708M545r7221q2055M44j30534j6127P7438L2385j45401
$$ 72794 63831 86386 204094 208639 111418 29363 29807 -100727 -116854 -39416 -7031 -152432
18487a52432j0325l5036L0298J56989n2148q0446J3177l553N5057Q7286L1604
$$ -152432 -162757 -197793 -167495 -10506 -62654 -143100 -129923 -133476 -78419 8867 40471
18476D0471M2951j31957p3044m2000P2615J1619o7631p1114M7095J57124N0027
$$ 40471 83422 -48535 -121579 -163579 -90964 -79345 -146976 -218090 -170995 -13871 36156
18465C6156N3088m1895l1998J45909J6529j01184o1157k1704L5569Q3835k3174
$$ 36156 89244 47349 15351 161260 177789 76605 15448 -6256 29313 113148 89974
18454H9974n4162l7486r7131l921J5576J88824R4391p0547l7510O3322J041o5587
$$ 89974 35812 -1674 -98805 -102726 -87150 101674 196065 125518 88008 151330 152371 86784
18442H6784J2443M8121l4846l9784M8k6881N062J2326L9474r3847L2052O3184
$$ 86784 99227 147348 112502 72718 72766 45885 50947 63273 102747 8900 40952 104136
18430A04136J089l631q6877K2812o9342q6032L7753l183K1167K1128K5962q8369
$$ 104136 105225 101594 14717 37529 -31813 -117845 -80092 -83275 -62108 -40980 -15018 -103387
18418a03387J95270J06076K4474n7675j03800l2274j6920K8192O8867Q9364r7168
$$ -103387 91883 197959 222433 164758 60958 28684 11764 39956 108823 198187 101019
18407A01019K2804p6410j6057l9471M4166J11727m8514n2149p8354l8007J35716
$$ 101019 123823 47413 31356 -8115 36051 147778 99264 47115 -31239 -69246 66470
18396F6470J06079j53078m9661n88K237N6308m9410o60Q0727N8359K6263J6303
$$ 66470 172549 19471 -30190 -30778 -28541 27767 -21643 -22303 58424 116783 143046 159349
18384A59349j44547j49877P3068J67324k5607p7025M0494q4008J00863M0478P025
$$ 159349 14802 -135075 -62007 105317 79710 2685 43179 -40829 60034 100512 107537
18373A07537l9405M2586M9828m8451L8500R6386Q6796k5959o8394n9402k44587
$$ 107537 68132 110718 160546 112095 150595 246981 333777 307818 239424 180022 -64565
18362f4565q3440N800Q1691J76514J31706n1296r9307J07457L5262J4396M3287
$$ -64565 -148005 -142205 -60514 116000 247706 196410 97103 204560 239822 254218 297505
18351B97505r1899j46766k4012N1825P043j33227j60212m6680l2318J34557M2840
$$ 297505 205606 58840 34828 86653 93696 -39531 -199743 -246423 -278741 -144184 -101344
18340a01344K3126K9813J12935P0477N6148m4433j67599M2294R7686L2970L8660
$$ -101344 -78218 -48405 64530 135007 191155 146722 -20877 21417 119103 152073 190733
18329A90733J5011O185m0196K4590j64974n6172O5921J33767l6285o4067J32891
$$ 190733 205744 211929 171733 196323 31349 -24823 41098 174865 138580 74513 207404
18318B07404J04831p3784K1352N8455m8134p0399k3130Q5298j4157j4080n9871
$$ 207404 312235 238451 259803 318258 270124 199725 176595 261893 247736 233656 173785
18307A73785O7894J24397k3119N702k9912m7065j1007k5254r9274j60537n134
$$ 173785 241679 366076 342957 348659 318747 271682 260675 235421 136147 -24390 -29524
18296b9524P6003L5755N9137K0382O8662L8341k5585r2296K26K6858K9045l2712
$$ -29524 46479 82234 141371 161753 230415 268756 243171 150875 151101 177959 207004 174292
18284A74292l3739M1549p349m5993K8945J4877m4587K1313m457k4962j6251m8173
$$ 174292 140553 182102 174753 128760 157705 172582 127995 149308 144851 119889 103638 55465
18272E5465L0675O0547J36164k4641q4829j6059L3154m1156J3046J65009R1478
$$ 55465 86140 146687 282851 258210 173381 157322 190476 149320 162366 327375 418853
18261D18853n9348k4471J19309L9903j06212K345J2582K6702l9023n4661P9828
$$ 418853 359505 335034 454343 494246 388034 390379 402961 429663 390640 335979 415807
18250D15807J695j22263n2385J1180N0554L4904O107j9375m6345N6113J8819o2897
$$ 415807 417502 295239 242854 254034 304588 339492 345599 326224 279879 335992 354811 291914
18238B91914M755O0598o511Q5694k5586Q9047R6342j4559j02801P811J69187r3238
$$ 291914 296669 357267 350756 436450 410864 499911 596253 581694 478893 486704 655891 562653
18226E62653r3337m3434j2222N1608P2620J05660J60056O6556K2389k0224j62793
$$ 562653 469316 425882 413660 465268 537888 643548 803604 870160 892549 872325 709532
18215G09532r303k4107N2895P3648K7627k7080J4853P7686m53j66248j14236O7854
$$ 709532 700229 676122 729017 802665 830292 803212 818065 895751 895298 729050 614814 682668
18203F82668N0591M3229N9953J23216J24386j8175p4582m8730L6393K3288R5214
$$ 682668 733259 776488 836441 959657 1084043 1065868 991286 942556 978949 1002237 1097451
18192A097451J11375J40388J15739j6991j202r6419q3066L8446J57528M7975k3645
$$ 1097451 1208826 1349214 1464953 1447962 1446760 1350341 1267275 1305721 1463249 1511224 1487579
18181A487579N7338J00044J15113j8069L0013J26474N9434N2620O4023L991R9735
$$ 1487579 1544917 1644961 1760074 1742005 1772018 1898492 1957926 2010546 2074569 2078560 2178295
18170B178295O290m7126J13242N9418J68850K88749L0789O4111J38888J53300
$$ 2178295 2184585 2137459 2250701 2310119 2478969 2767718 2798507 2862618 3001506 3154806
18160C154806n0064O0358J92380J19118J83398J58041P1749R8050j37053l1836
$$ 3154806 3104742 3165100 3357480 3476598 3659996 3818037 3889786 3987836 3850783 3818947
18150C818947J99897J90473K31319J96223K04480J75315K43501K69033L09413
$$ 3818947 4018844 4209317 4440636 4636859 4841339 5016654 5260155 5529188 5838601
18141E838601L01717L84235L58633K73996K66079P7874K10477L96489L63565K42885
$$ 5838601 6140318 6524553 6883186 7157182 7423261 7501135 7711612 8108101 8471666 8714551
18131H714551L16568L38945K96060N27518N40314N18361O25719P98618J077684
$$ 8714551 9031119 9370064 9666124 10193642 10733956 11252317 11878036 12676654 13754338
18122A3754338J015582J270426J581137J722312K075064K401183K897141L297522
$$ 13754338 14769920 16040346 17621483 19343795 21418859 23820042 26717183 30014705
18114C0014705L752318N266233Q464201J3512867J9768117K2492717J8446567
$$ 30014705 33767023 39033256 47497457 61010324 80778441 103271158 121717725
18107A21717725J5976292J9616736Q634017l8366411n0683271k9349342j5016034
$$ 121717725 137694017 157310753 165944770 127578359 76895088 47545746 32529712
18100C2529712q607415n320008l277366k398827j774209j212311q75186m13915
$$ 32529712 23922297 18602289 15324923 12926096 11151887 9939576 9064390 8650475
18092H650475m00078k88434r5887q481q8096l0103p3597o5727J874J11946K17609
$$ 8650475 8250397 7961963 7866076 7857595 7769499 7739396 7665799 7600072 7601946 7713892 7931501
18081G931501Q4014K53767K91743L00389K34377K21676L69952L45099O17012P71704
$$ 7931501 8015515 8269282 8561025 8861414 9095791 9317467 9687419 10032518 10649530 11421234
18071A1421234Q12159R02202J048019J253099J388322J647923K122485K901861
$$ 11421234 12233393 13135595 14183614 15436713 16825035 18472958 20595443 23497304
18063B3497304M206294O469668Q809124R429915P815361P339034Q156113L23072
$$ 23497304 27703598 34173266 42982390 52412305 60227666 67566700 75722813 76045885
18055G6045885j7427265j8586965j0825288n793844l240378j670228q04012l38691
$$ 76045885 58618620 40031655 29206367 23412523 20172145 18501917 17697905 17359214
18047A7359214J95071O42433Q66331J072567J477696J729336K221209K881788
$$ 17359214 17554285 18196718 19063049 20135616 21613312 23342648 25563857 28445645
18039B8445645M178599O577906R215419R815822Q432691Q247501R179129K577521
$$ 28445645 32624244 39202150 48417569 58233391 66666082 74913583 84092712 86670233
18031H6670233j2502065j1759261k591070J828578K771711M245734M419791o856123
$$ 86670233 74168168 62408907 59817837 61646415 64418126 68663860 73083651 66227528
18023F6227528j9248493j4923315q286840m701210k612535j563718q53397m87331
$$ 66227528 46979035 32055720 23768880 19067670 16455135 14891417 14038020 13550689
18015A3550689k60473J17941M74937O52199J001191J265608J637807K433113L977472
$$ 13550689 13290216 13408157 13883094 14535293 15536484 16802092 18439899 20873012 24850484
18006B4850484O233149P935240P304211N736542O014846N558857o025526j8649552
$$ 24850484 31083633 39018873 46323084 52059626 58074472 63633329 57607803 38958251
17998C8958251j4670911q146681m547273k799576j915793j296529q46136n89781
$$ 38958251 24287340 16140659 11593386 8793810 6878017 5581488 4735352 4145571
17990D145571l24553k40731k50737j90312o1197q9316j99182k84066k35620k30283
$$ 4145571 3821018 3580287 3329550 3139238 3078041 2988725 2789543 2505477 2269857 2039574
17980B039574j93336j04185j53615k55468p6394J33213K0974q3928j08315n3260
$$ 2039574 1846238 1742053 1588438 1332970 1256576 1389789 1410763 1326835 1218520 1165260
17970A165260n5250k05317J1745N6330o3154n8852j01584M8002n4108p3428n5487
$$ 1165260 1110010 904693 916438 972768 909614 850762 749178 797180 743072 669644 614157
17959F14157o3738n981k7660j72008L093N5773r3312m370L9055k3830M4056o7486
$$ 614157 550419 544438 516778 344770 347863 403636 310324 305954 345009 321179 365235 297749
17947B97749q763L0723k4285m7461L9122K6401r5174m3197L9159j8313m7903M219
$$ 297749 288986 319709 295424 247963 287085 313486 218312 175115 214274 195961 148058 152277
17935A52277J0313K8165o1291k3205N0772K8859J26494L9367j17263p7696Q7031
$$ 152277 162590 190755 129464 106259 157031 185890 312384 351751 234488 156792 243823
17924B43823m2456q5443P4768N2508o1134N5609q3892r1966M9740P2158R9019
$$ 243823 201367 115924 190692 243200 182066 237675 153783 61817 111557 183715 282734
17913B82734j12027j01951j6319j6291N4091O3639q4650M3133l0418R2636J34276
$$ 282734 170707 68756 52437 36146 90237 153876 69226 112359 81941 174577 308853
17902C08853J9264j07293r8571P1907n7691j60741j48452P0366L5333L9120Q3499
$$ 308853 328117 220824 122253 194160 136469 -24272 -172724 -102358 -67025 -27905 55594
17891E5594j17071j953J51950J40124K2333L1555r8874O344m4570j24885j15467
$$ 55594 -61477 -63430 88520 228644 250977 282532 183658 190002 145432 20547 -94920
17880i4920J21400P402r4107j2254l7503p1368Q658N1093J01702K34300P0715
$$ -94920 26480 33882 -60225 -72479 -109982 -181350 -172692 -121599 -19897 214403 285118
17869B85118J8125j09519j63463k6226j1956J01967J06591j02102m2441l7787
$$ 285118 303243 193724 30261 4035 -7921 94046 200637 98535 56094 18307
17859A8307l9536M3703J34230Q261m6094M8833O4470p1638r476n2156j9501L9156
$$ 18307 -21229 22474 156704 164965 118871 167704 232174 160536 151060 98904 79403 118559
17847A18559J5762r8524J7469k5748o5095k9776L7362l591J53474K2797j50373
$$ 118559 134321 35797 53266 27518 -37577 -67353 -29991 -33582 119892 142689 -7684
17836g684m2428J3147N1204l1898m1938J54328K26542k0766k24073j07852o3509
$$ -7684 -50112 -36965 14239 -17659 -59597 94731 321273 300507 76434 -31418 -94927
17825i4927P207o7531M3900M4484N5266l171M1201R4652J39980n084o7800j90453
$$ -94927 -87720 -155251 -111351 -66867 -11601 -14772 26429 121081 261061 255977 188177 -2276
17813b276j36044J998O995K1483R753J0051J02895J09130J35294q7754k67123
$$ -2276 -138320 -136322 -129327 -107844 -98091 -88040 14855 123985 259279 171525 -95598
17802i5598P8285N5246K028r4458M413J3803o6069o4482P9162K075j33168J68261
$$ -95598 -17313 37933 39961 -54497 -50084 -36281 -102350 -166832 -87670 -85595 -218763 -50502
17790e0502K3862N8686P4505o2400K6184R3637j3666L771j503J6335K8696n7770
$$ -50502 -26640 32046 106551 44151 70335 163972 150306 154077 152574 168909 197605 139835
17778A39835q1991j6952r914n142j75948M658J14567J02451m3975l8325j40117
$$ 139835 57844 40892 30978 25836 -150112 -145454 -30887 71564 27589 -10736 -150853
17767a50853n3741J5138J11663L1561m4916o8520k8661L9174M5138M2748J9632
$$ -150853 -204594 -189456 -77793 -46232 -91148 -159668 -188329 -149155 -104017 -61269 -41637
17756d1637P6499L0593k1332N683R2120m9472l4782r0652J128p240j8768m1782
$$ -41637 34862 65455 44123 49806 141926 92454 57672 -32980 -31852 -39092 -57860 -99642
17744i9642l9232L6875m6595q0391K0552J8161k1354L2671l5437o023O2401o5632
$$ -99642 -138874 -101999 -148594 -228985 -208433 -190272 -211626 -178955 -214392 -220415 -158014 -223646
17732b23646n6521Q0038K20379M7574j55818j0166L9550K4180o5123p0410j3616
$$ -223646 -280167 -200129 20250 67824 -87994 -98160 -58610 -34430 -99553 -169963 -183579
17721a83579P3476r8317p6309R5987Q3374l9008J33817N2705q8175r169N1215
$$ -183579 -110103 -208420 -284729 -188742 -105368 -144376 -10559 42146 -46029 -55198 -3983
17710c983J39981m5884p946j2818n8043r5916J4831J02576P6636m2235L914j29119
$$ -3983 135998 90114 82168 69350 11307 -84609 -69778 32798 109434 67199 71113 -58006
17698e8006q154L238J2912K5935M2093J4952J7580N403l0148j2772J4418j2498
$$ -58006 -66160 -62922 -50010 -24075 18018 32970 50550 55953 25805 13033 27451 14953
17686A4953j0793K5652L5276p6085o1180j6931O9141M7759J53686L4055J7623
$$ 14953 4160 29812 65088 -10997 -72177 -89108 -19967 27792 181478 215533 233156
17675B33156q6165j38882M8488L5525p7449q8225L4424K9661M8263L6492M5628
$$ 233156 146991 8109 56597 92122 14673 -73552 -39128 -9467 38796 75288 120916
17664A20916M4561j26253j01837k922j1147k9725P7650O8549Q901n5363r2146
$$ 120916 165477 39224 -62613 -65535 -76682 -106407 -28757 39792 48693 -6670 -98816
17653i8816p3106O4096N5447q3103l9571L3258J77312O5005K777k9802N4066M050
$$ -98816 -171922 -107826 -52379 -135482 -175053 -141795 35517 100522 103299 73497 127563 131613
17641A31613j54481J652J74207P4569j0981j10169j19417m9385O2490M9125o2585
$$ 131613 -22868 -21216 152991 227560 216579 106410 -13007 -62392 98 49223 -13362
17630a3362m9652J37192P351m6677j7547N050K3187J07676j17005j22304K1988
$$ -13362 -63014 74178 81529 34852 17305 22355 45542 153218 36213 -86091 -64103
17619f4103J24705M2697j23999n1376L2835m3734J7051k8213K1836J69721j1186
$$ -64103 60602 103299 -20700 -72076 -39241 -82975 -65924 -94137 -72301 97420 86234
17608H6234l4015o049K3623j82371q6123j433P0232L8907j5028q9432J9139J8094
$$ 86234 52219 46170 69793 -112578 -198701 -200134 -129902 -90995 -106023 -195455 -176316 -158222
17596a58222J59297l7733r41J6761O0756L8214o3244k0684O2642M215K749p6883
$$ -158222 1075 -36658 -37599 -20838 39918 78132 14888 -5796 56846 61061 63810 -13073
17584a3073m8209N8723L8077M2841p7137R0223j9891K2022Q4453R1887j26316
$$ -13073 -61282 -2559 35518 78359 1222 91445 71554 93576 178029 269916 143600
17573A43600k40067l7119m7345k4633J21721J22588J10355m3176j7401l1209r1980
$$ 143600 -96467 -133586 -180931 -205564 -83843 38745 149100 105924 88523 57314 -34666
17562c4666l2185O7685O1430q2494n783J42990J08223j6154n0862k0871k58p6781
$$ -34666 -66851 834 62264 -20230 -26013 116977 225200 209046 158184 137313 137055 60274
17550F0274j15715j50790m8447O5737R3824p5751J5646K9781O8147J05262K4039
$$ 60274 -55441 -206231 -254678 -188941 -95117 -170868 -155222 -125441 -57294 47968 72007
17539G2007l6423l2377O0716k4942o1644j01466Q3998Q7730m077J5247Q2221R2932
$$ 72007 35584 3207 63923 38981 -22663 -124129 -40131 47599 43522 58769 140990 233922
17527B33922J18654q7476o3641n0594n2952O6660K28433M8687p4113p3546K5863
$$ 233922 352576 265100 201459 150865 97913 164573 393006 441693 367580 294034 319897
17516C19897j29620o1925k1327l6494L8263l7317Q864J03928q9933q9440k5933
$$ 319897 190277 128352 107025 70531 108794 71477 80341 184269 94336 4896 -21037
17505b1037q8845K0605J2801m2496k4144J3681J62557J08928J4571J02689J11648
$$ -21037 -109882 -89277 -76476 -118972 -143116 -129435 33122 142050 156621 259310 370958
17494C70958k9178J31034j4051j18826k6793p1234n8931K6913J22127L4193q9164
$$ 370958 341780 472814 458763 339937 313144 241910 182979 209892 332019 366212 277048
17483B77048n5842O876j4659l5512J3519N6165O7927p0278j22420o233n831k5280
$$ 277048 221206 228082 213423 177911 191430 247595 315522 245244 122824 116591 110760 85480
17471H5480m4870M6783P7847K456q8768n9481R9300K309K3723l6635L749L4119
$$ 85480 40610 87393 165240 167696 78928 19447 118747 121056 144779 108144 111893 146012
17459A46012L7577K8755q3792n0549j5036M8111n6500r2191J1107N853q6410O0119
$$ 146012 183589 212344 128552 78003 62967 111078 54578 -37613 -26506 -20653 -107063 -46944
17447d6944R6067K50234O1273J1950Q8050P8046J11837J23319J19233p9002k74990
$$ -46944 49123 299357 360630 372580 460630 538676 650513 773832 893065 814063 539073
17436E39073k24292j17253o3930P9428q1810q7988o5278m121n2456J8761m0422
$$ 539073 314781 197528 133598 213026 131216 43228 -22050 -26171 -78627 -59866 -100288
17425a00288o1884K5424J16232K0247K0452q1086J168p9271J20363J13460N2414
$$ -100288 -162172 -136748 -20516 -269 20183 -60903 -59735 -139006 -18643 94817 147231
17414A47231o5249K1237J16514o6443r0581j2684J50867M0605k7714o1183j42219
$$ 147231 81982 103219 219733 153290 62709 50025 200892 241497 213783 152600 10381
17403A0381j01903N8820M1790l7200o537O2639M5766q6308m3111r747L8133R3927
$$ 10381 -91522 -32702 9088 -28112 -34649 27990 73756 -12552 -55663 -65410 -27277 66650
17391F6650l5693j572K7187O5177k4695q4464j14032K9090n326m592K3313M2304
$$ 66650 30957 29385 56572 121749 97054 12590 -101442 -72352 -77678 -82270 -58957 -16653
17379a6653j9095J08186Q4321j54156j02753K3898P952p2790k9260l7388N192
$$ -16653 -35748 72438 156759 2603 -100150 -76252 -68300 -141090 -170350 -207738 -202546
17368b02546K1001N2752m1397J9534m1279J35252P8866j64564P8430J38116J3948
$$ -202546 -181545 -128793 -170190 -150656 -191935 -56683 22183 -142381 -63951 74165 88113
17357H8113K6531o8968L3459k1002q1972Q302M2863P4857Q5268l8773M3930j24572
$$ 88113 114644 45676 79135 58133 -23839 -15537 27326 102183 187451 148678 192608 68036
17345F8036r2711n2887j00135J14529J11608j22006m2L3874j31762j8796L3080
$$ 68036 -24675 -77562 -177697 -63168 48440 -73566 -73608 -39734 -171496 -190292 -157212
17334a57212m0048N3647p2239n9212R4947m1282l9867j2927O9205J35630R4042
$$ -157212 -197260 -143613 -215852 -275064 -180117 -221399 -261266 -274193 -204988 -69358 24684
17323B4684j4171J9394k3230j26389o2825L2290J49638k8636n8079o4888M2135
$$ 24684 10513 29907 6677 -119712 -182537 -150247 -609 -29245 -87324 -152212 -110077
17312a10077M899m1282J4100O4129Q6057L9016o2304j13619j8154r7403P5256
$$ -110077 -105178 -146460 -132360 -68231 17826 56842 -5462 -119081 -137235 -234638 -159382
17301a59382R7219k2334q1624R979O3553O8386p6870j5510L3881K4237J03751
$$ -159382 -62163 -84497 -166121 -156142 -92589 -24203 -101073 -116583 -82702 -58465 45286
17290D5286N983j417j4277J4164l4754J7990n5849j3441N293N0867J23867O2715
$$ 45286 51269 49852 35575 49739 14985 32975 -22874 -36315 -31022 19845 143712 206427
17278B06427q8371j39160j1453Q9104q4845J6541J15283j2681p5607l8243O6363
$$ 206427 118056 -21104 -32557 56547 -28298 -11757 103526 90845 15238 -23005 43358
17267D3358j4808k3805m4876Q5956N4672K3386l107n6246j6n8794o8307R416k0335
$$ 43358 28550 4745 -40131 45825 100497 123883 120776 64530 64514 5720 -62587 -53171 -73506
17254g3506n2629K3204q9269J2295K9745L7363O64l0296o4197N2468J56360J44927
$$ -73506 -126135 -102931 -192200 -179905 -150160 -112797 -112133 -142429 -206626 -154158 2202 147129
17242A47129p2985j90099j9754j19688l6875J15367J58255q777P9711j26806J6725
$$ 147129 74144 -115955 -135709 -255397 -292272 -176905 -18650 -27427 52284 -74522 -57797
17231e7797R3995l5216n3462k206N1565k51P8180O7078R609L7589j664k1879l149
$$ -57797 36198 982 -52480 -54686 -3121 -3372 74808 141886 151495 189084 187420 165541 162392
17218A62392K0819l6308k6209k9390m8031k3725L786l4598j9184O809p5573P9625
$$ 162392 183211 146903 120694 91304 43273 19548 23334 -11264 -30448 -23639 -99212 -19587
17206a9587k4406n9559m3423R0886J44883m2166j28213o8318j32679O0987J44607
$$ -19587 -43993 -103552 -146975 -56089 88794 46628 -81585 -149903 -282582 -221595 -76988
17195g6988K9619J16238J03899k7238j04127n2969q498m9635k2761N5901m393
$$ -76988 -47369 68869 172768 145530 41403 -11566 -20064 -69699 -92460 -36559 -40952
17184d0952q5534j4125o4580M1876J85287J29065N7585p6368k9092k6359k00860
$$ -40952 -126486 -140611 -205191 -163315 21972 151037 208622 132254 103162 76803 -124057
17173a24057l3993K3278P069J04265M1284q7537P5386K4420j01024q1192m3407
$$ -124057 -158050 -134772 -127703 -23438 17846 -69691 5695 30115 -70909 -152101 -195508
17162a95508j22909J12475K06528J5269k4488R956P2201o4349l3185P8546L324
$$ -195508 -318417 -205942 586 15855 -8633 1323 73524 9175 -24010 54536 57860
17151E7860r3059K8416O0702R9198j0371m5179q9497j1348N2987R5477L8787p2929
$$ 57860 -35199 -6783 53919 153117 142746 97567 8070 -3278 49709 145186 183973 111044
17139A11044j29840p6172R8670k1076R2158j40087j04338J6550m8530l8334L8197
$$ 111044 -18796 -94968 3702 -17374 74784 -65303 -169641 -153091 -201621 -239955 -201758
17128b01758J1685L9858k0623M5595n7790o385J09398P2506n220J11157k0838
$$ -201758 -190073 -150215 -170838 -125243 -183033 -189418 -80020 -7514 -12734 98423 77585
17117G7585k34980j56394r685J01928O6908j3100j68304L7506M8759o3886M6133
$$ 77585 -157395 -313789 -323474 -221546 -154638 -167738 -336042 -298536 -249777 -313663 -267530
17106b67530J81235N1523m1963l6896n4790O0678M9877Q4810q0171K6112J11926
$$ -267530 -86295 -34772 -76735 -113631 -168421 -107743 -57866 26944 -53227 -27115 84811
17095H4811M1571j21162j10585L028Q4905q760K8736l9499l266m1140j27188k5169
$$ 84811 126382 5220 -105365 -102337 -17432 -26192 2544 -36955 -40221 -81361 -208549 -233718
17083b33718Q6453M4426l4147n1080P0947J14493L9374j2543q752L8341n1563
$$ -233718 -147265 -102839 -136986 -188066 -117119 -2626 36748 24205 15453 53794 2231
17072B231o9158l5969N8111K0178J8679l1937J1069j1472K2504Q187o8912m2480
$$ 2231 -66927 -102896 -44785 -24607 -5928 -37865 -26796 -38268 -15764 -7577 -76489 -118969
17060a18969J90847k3460q8131R4044J10492J5007J44794K1181j97933r8919Q6757
$$ -118969 71878 48418 -39713 54331 164823 179830 324624 345805 147872 48953 135710
17049A35710q4754j26667j14735O0806J20224J39697j26274j95891k2417L8778
$$ 135710 50956 -75711 -190446 -129640 -9416 130281 4007 -191884 -214301 -175523
17039a75523J16323J0606j30129j0508j4767K8881J2433P7062k3688o5683J874
$$ -175523 -59200 -48594 -178723 -189231 -203998 -175117 -162684 -85622 -109310 -174993 -173119
17028a73119Q248M3302J68483J59695o4519j88328j62274L7328p8380P4261N7929
$$ -173119 -164871 -121569 46914 206609 142090 -46238 -208512 -171184 -249564 -175303 -117374
17017a17374m1338N2892M8055N8709O5144n0116o4137j20218q7774R916P9355
$$ -117374 -158712 -105820 -57765 944 66088 15972 -48165 -168383 -256157 -246241 -166886
17006a66886O6370m1255J3059l9320J2440L1475j1682j6945j0666M2007N9018
$$ -166886 -100516 -141771 -128712 -168032 -155592 -124117 -135799 -152744 -163410 -121403 -62385
16995f2385P5097N0966J9148L8855j08418j10412M4415R0710M6030n4759o313
$$ -62385 12712 63678 82826 121681 13263 -97149 -52734 37976 84006 29247 22934
16984B2934J33405J55491j69240k63886o4397J12215l857j2014P105M9800K1417
$$ 22934 156339 311830 142590 -121296 -185693 -73478 -77335 -89349 -82244 -32444 -11027
16973a1027r9118j25206P795n8986L6818l3497N6077J60550J21776j15898K6240
$$ -11027 -110145 -235351 -227556 -286542 -249724 -283221 -227144 -66594 55182 -60716 -34476
16962c4476J28269j03241l1739M4442k9068o2622j7798M959O0540K7518q5054
$$ -34476 93793 -9448 -41187 3255 -25813 -88435 -106233 -101274 -40734 -13216 -98270
16951i8270l9892J29663R1858J9782j04169o8564k0762K8440k4462M7274P5985
$$ -98270 -138162 -8499 83359 103141 -1028 -69592 -90354 -61914 -86376 -39102 36883
16940C6883l7219j26395L4877M345J3235M9163l4121L8299p1102o5673O0492m5565
$$ 36883 -336 -126731 -91854 -87509 -74274 -25111 -59232 -20933 -92035 -157708 -97216 -142781
16928a42781m0103J2200j8828J5231J30387O3926L4793K008p1658m4369p9825
$$ -142781 -182884 -170684 -189512 -174281 -43894 20032 54825 56833 -14825 -59194 -139019
16917a39019k3006k4022K1921o9411N0433O1297R018J6258R813K82J14444R3103
$$ -139019 -162025 -186047 -164126 -233537 -183104 -121807 -112789 -96531 -86718 -86436 28008 121111
16905A21111K8469N6013J2099j29264l3132m9116K1261o402O377Q6021j00303
$$ 121111 149580 205593 217692 88428 55296 6180 27441 21039 27416 113437 13134
16894A3134r2380K7435J57119J2317p0560l5066j32174l440J10385L6412P3655
$$ 13134 -79246 -51811 105308 117625 47065 11999 -120175 -123615 -13230 23182 96837
16883I6837L8774p7826l7975r4909r8367P6804L1708m091Q804P399N6111m1647
$$ 96837 135611 57785 19810 -75099 -173466 -96662 -64954 -69045 -60241 -52842 3269 -38378
16871c8378m2536m5037j4650j10390O8088O0237O2868J32052R7874M4418k8984
$$ -38378 -80914 -125951 -140601 -250991 -182903 -122666 -59798 72254 170128 214546 185562
16860A85562j81605r5838j4638m4246M5925R137L7076P8653J04892j37000k3834
$$ 185562 3957 -91881 -106519 -150765 -104840 -95703 -58627 20026 124918 -12082 -35916
16849c5916j8175M3604N0614K387j43566J5005l9193o4671P5798p0377o6181J36871
$$ -35916 -54091 -10487 40127 42514 -101052 -86047 -125240 -189911 -114113 -184490 -250671 -113800
16837a13800P1150M5878M6098l6464k659R6631R084o6158q3302j02107K2438j1091
$$ -113800 -42650 3228 49326 12862 10203 106834 115918 49760 -33542 -135649 -113211 -124302
16825a24302j871J23194m0239l6526j8014p0967K5588L2279R5510K7843j0257
$$ -124302 -126173 -2979 -43218 -79744 -97758 -168725 -143137 -110858 -15348 12495 2238
16814B238m5961K8411L2812L178N4438q4146j50298k8924K3761q259Q0108J13188
$$ 2238 -43723 -15312 17500 20678 75116 -9030 -159328 -188252 -164491 -172750 -92642 20546
16802B0546R7485j00630j0598J44384m6358K0592P706j07639r6868p0702K37P0620
$$ 20546 118031 17401 6803 151187 104829 125421 133127 25488 -71380 -142082 -141845 -71225
16790g1225P8490q691m4970M6830o7785K6389O9005N2156l1987K4253J01130K5604
$$ -71225 7265 -1426 -46396 434 -67351 -40962 28043 80199 48212 72465 173595 199199
16778A99199j30830n8205j0085p9037j28537K1966J59088J06911j1112q274l3283
$$ 199199 68369 10164 79 -78958 -207495 -185529 -26441 80470 69358 61084 27801
16767B7801l4046L4518J705k9640o2499R3912L4708q5093L1472k1386n6838q6015
$$ 27801 -6245 28273 29978 338 -62161 31751 66459 -18634 12838 -8548 -65386 -151401
16755a51401O7004R1758k7913r1502l10410L7035J51090R3975J2810N4609K5554
$$ -151401 -84397 7361 -20552 -112054 -422464 -385429 -234339 -140364 -127554 -72945 -47391
16744d7391o0887M8320P4766L3185J33594Q044q9750j29134j09158r2774J25239
$$ -47391 -108278 -59958 14808 47993 181587 189631 99881 -29253 -138411 -231185 -105946
16733a05946K8964o4298M0286p0163l0792M5731L6728J00085P5628r4720M5679
$$ -105946 -76982 -141280 -100994 -171157 -201949 -156218 -119490 -19405 56223 -38497 7182
16722G182P9013m9930k9976j44524p8270l9184K0755L2833M806L1617J66886o18
$$ 7182 86195 36265 6289 -138235 -216505 -255689 -234934 -202101 -197295 -165678 1208 590
16710E90Q3758l6470n3145m0107n0545m2233K452K9491r729P1837M1166O0713
$$ 590 84348 47878 -5267 -45374 -95919 -138152 -135700 -106209 -115938 -44101 -2935 57778
16698E7778j07159p8861M451m8102m8551J85861N6980p3480l8952k3834N8131
$$ 57778 -49381 -128242 -123791 -171893 -220444 -34583 22397 -51083 -90035 -113869 -55738
16687e5738N0872Q3548k4605j59197j34822O0660O8522N4033K8497p0105M9400
$$ -55738 -4866 78682 54077 -105120 -239942 -179282 -110760 -56727 -28230 -98335 -48935
16676d8935m9985q5101L3861J24161k8444L1610J5976K515J9164m5206J0371N2512
$$ -48935 -98920 -184021 -150160 -25999 -54443 -22833 -6857 -4342 14822 -30384 -20013 32499
16664C2499L1513j14233r5365j09172L7756J12859q9653l6949J40521M5230K5829
$$ 32499 64012 -50221 -145586 -254758 -217002 -104143 -193796 -230745 -90224 -44994 -19165
16653a9165o3000j0626O7288K7851p9121j72215l8647O9477N2512n2311J21661
$$ -19165 -82165 -92791 -25503 2348 -76773 -248988 -287635 -218158 -165646 -217957 -96296
16642i6296N3245L1659P6602R3568Q899q5755N0344K953r9189o7768r4316n69
$$ -96296 -43051 -11392 65210 158778 167677 81922 132266 135219 36030 -31738 -126054 -126623
16630a26623J46758J03115l4824M8581J02770L100O7293m0659j29279j72188j18018
$$ -126623 20135 123250 88426 137007 239777 242877 310170 269511 140232 -31956 -149974
16619a49974P7199J5701L8583J5331j54103k1866k8554O4814J47574O5610J9554
$$ -149974 -72775 -57074 -18491 -3160 -157263 -179129 -207683 -142869 4705 70315 89869
16608H9869J18250o3647j85163l2331J8448K4284O8697m1277N65n7190l1773J07123
$$ 89869 208119 144472 -40691 -73022 -54574 -30290 38407 -2870 -2305 -59495 -91268 15855
16596A5855L6799o2739j52595n2017R8519J57244l7175J3567Q4842o9074p3212
$$ 15855 52654 -10085 -162680 -214697 -116178 41066 3891 17458 102300 33226 -39986
16585c9986L3322k603q888N0821n6897N3534P4280n2519o4019o0397J44984p1149
$$ -39986 -6664 -9267 -18155 32666 -24231 29303 103583 51064 -12955 -73352 71632 483
16573D83M2507Q9580o5064O3835j0516M975j2051j10810J1582r589j25456k6789
$$ 483 42990 132570 67506 131341 120825 125800 113749 2939 14521 4932 -120524 -147313
16561a47313M2688R262J9179M9201O4687J66100n3969j25566q1833o0306O2921
$$ -147313 -104625 -95363 -76184 -26983 37704 203804 149835 24269 -57564 -117870 -54949
16550e4949j9802P6768k4863M3253J17374n1263J4074J7168j45523j7725j2474
$$ -54949 -74751 2017 -22846 20407 137781 86518 100592 117760 -27763 -45488 -57962
16539e7962J51364K04863k946j35917j008r7684l8940q3587o0118P2158Q268L630
$$ -57962 93402 298265 295319 159402 158394 60710 21770 -61817 -121935 -49777 -41509 -37879
16527c7879L4659J90981j3032q4056m5092L5907o0604j39376k8231M9196R5182
$$ -37879 -3220 187761 174729 90673 45581 81488 20884 -118492 -146723 -97527 -2345
16516b345j17293n5644p0899m157R4042k674m6864P5074J9340j68048L3522O2268
$$ -2345 -119638 -175282 -246181 -250338 -156296 -158970 -205834 -130760 -111420 -279468 -245946 -183678
16504a83678O6072N8980P2433j14197m5148L8095n0303O7419N6656m5214J8760
$$ -183678 -117606 -58626 13807 -100390 -145538 -107443 -157746 -90327 -33671 -78885 -60125
16493f0125n8070K7557O6192N2453k933l3417o5268K9417O523n0717j6575k4534
$$ -60125 -118195 -90638 -24446 28007 25074 -8343 -73611 -44194 -37671 -88388 -104963 -129497
16481a29497j10049j00587P1542K22416m9354j4542l8605q9928L1312J05313J1780
$$ -129497 -239546 -340133 -268591 -46175 -95529 -110071 -148676 -238604 -207292 -101979 -90199
16470i0199m7883j7024J44329m151n1067L4267l630q1816k8230J18841N3625O5007
$$ -90199 -138082 -155106 -10777 -14928 -65995 -31728 -35358 -117174 -145404 -26563 27062 92069
16458I2069o4686l1551q7921k8467J010o4766J06350M3715P1961m5522j04245
$$ 92069 27383 -4168 -92089 -120556 -119546 -184312 -77962 -34247 37714 -7808 -112053
16447a12053j60431R4367M3704L1273M3905R309j8428O4651k9303K7725J0762
$$ -112053 -272484 -178117 -134413 -103140 -59235 -49926 -68354 -3703 -33006 -5281 5481
16436E481L0533l7041l9338O06L7798L4163J02288n4597j61229n7568M1988J05217
$$ 5481 36014 -1027 -40365 -39759 -1961 32202 134490 79893 -81336 -138904 -96916 8301
16424H301K1600l5273j11246o2065M649O4883N1381R6676J4630o6620m2998M200
$$ 8301 29901 -5372 -116618 -178683 -174034 -109151 -57770 38906 53536 -13084 -56082 -51882
16412e1882j7062L8547Q9909k4253K597k9300n891p6952M1677Q1151p6040m3305
$$ -51882 -68944 -30397 59512 35259 37856 8556 2665 -74287 -32610 48541 -27499 -70804
16400g0804P0179J13872K5511o3349P414L6226o3406O4147q4865j65408r4209
$$ -70804 -625 113247 138758 75409 82823 119049 55643 119790 34925 -130483 -224692
16389b24692j19571m475M521L2017J00293J05440L3877K5827p3923j10901O2817
$$ -224692 -344263 -348738 -344217 -312200 -211907 -106467 -72590 -46763 -120686 -231587 -168770
16378a68770J22503N7172Q5106J0665m5637J6918m8491l8399k7050N6330J83214
$$ -168770 -46267 10905 96011 106676 61039 77957 29466 -8933 -35983 20347 203561
16367B03561J6203j95153j02586j02015N4880J17984N0062j35461O828O0552M370
$$ 203561 219764 24611 -77975 -179990 -125110 -7126 42936 -92525 -85697 -25145 -20775
16356b0775N1189L8647N5786m3066j8500q9281q6530j00648Q7343Q1679n0029
$$ -20775 30414 69061 124847 81781 63281 -26000 -112530 -213178 -125835 -44156 -94185
16345i4185m6057K6504L0234O2497l466N9429J19968M5257q3823j2020N3569L5726
$$ -94185 -140242 -113738 -83504 -21007 -24473 34956 154924 200181 116358 104338 157907 193633
16333A93633m0993p2777p2090n9797J2117k7516j31843l1765K3366K38492J13226
$$ 193633 152640 79863 7773 -52024 -39907 -67423 -199266 -231031 -207665 30827 144053
16322A44053q0658l9962o8376r3128J5495n0096R180J43772m7191N0312l0992
$$ 144053 63395 23433 -44943 -138071 -122576 -172672 -163492 -19720 -66911 -16599 -47591
16311d7591P243L6748k0026o1482P6384N0586K345l3705j791o2839M4727L6992
$$ -47591 -40348 -3600 -23626 -85108 -8724 41862 44207 10502 8711 -54128 -9401 27591
16299B7591r1022j6092M0255J14440Q7048Q3388J178j37179n9352n326j56934
$$ 27591 -63431 -79523 -39268 75172 162220 245608 246786 109607 50255 44929 -112005
16288a12005l9261J5434L4821K0126N367k4971K4895J4394M3078L7640j3531J74501
$$ -112005 -151266 -135832 -101011 -80885 -75518 -100489 -75594 -61200 -18122 19518 5987 180488
16276A80488R7182p8853j62828j45036L5047M2831N5049K0j02663M4479J52328
$$ 180488 277670 198817 35989 -109047 -74000 -31169 23880 23900 -78763 -34284 118044
16265A18044j5167M75M514k2952r3745q5032J05725R2433n7050j12814O894o296
$$ 118044 102877 103352 107866 84914 -8831 -93863 11862 104295 47245 -65569 -58675 -64971
16253f4971O0346j2831l3550j9654L0811P3803p0954k1875R7549j4572N8893m2207
$$ -64971 -4625 -17456 -51006 -70660 -39849 33954 -37000 -58875 38674 24102 82995 40788
16241D0788l3653J7910r3909l2830L7991o1357l3579Q185M182Q7249L1340L387
$$ 40788 7135 25045 -68864 -101694 -63703 -125060 -158639 -150454 -146272 -59023 -27683 -24296
16229b4296j84569o2013Q2950J01113O6148l9281J323j09760P2695O4661n8570
$$ -24296 -208865 -270878 -187928 -86815 -20667 -59948 -58625 -168385 -95690 -31029 -89599
16218h9599m0231J8269J49896m7220p409l4112j1250J6373q9644O834J05928k5449
$$ -89599 -129830 -111561 38335 -8885 -16294 -50406 -61656 -45283 -134927 -128093 -22165 -47614
16206d7614l7434J11905J15485O2777o2128P14k8820r4231j13454r5582j946P0264
$$ -47614 -85048 26857 142342 205119 142991 143705 114885 20654 -92800 -188382 -190328 -120064
16194a20064P6156j5906p0343m2132R6885J1081M8256o57l2613O9866N9636k4289
$$ -120064 -43908 -59814 -130157 -172289 -75404 -64323 -16067 -16724 -49337 20529 80165 55876
16182E5876l9461j32937k1227Q7167m681Q058L3443J01413P6272j00531j70018
$$ 55876 16415 -116522 -137749 -50582 -55263 -47205 -13762 87651 163923 63392 -106626
16171a06626k467l1521l6385J03116K4312k46J9747j662n7911o1468q618J36818
$$ -106626 -109093 -140614 -176999 -73883 -49571 -49817 -30070 -31732 -89643 -151111 -159729 -22911
16159b2911L0766o2300o1595k4828J86106O8510k7144q1049j4901j5026J51745
$$ -22911 7855 -54445 -116040 -140868 45238 113748 86604 5555 -9346 -24372 127373
16148A27373R6685O9334q6707j17011j19991q0148q3839L4685R7230m6479o2941
$$ 127373 224058 293392 206685 89674 -30317 -110465 -194304 -159619 -62389 -108868 -171809
16137a71809m0429o952J13519L1281K2863j4567o4869K0222M6818L3189l112K0302
$$ -171809 -212238 -219190 -105671 -74390 -51527 -66094 -130963 -110741 -63923 -30734 -33846 -13544
16125a3544J05820l5871j30811j67084L0390Q9587J52522M7883q5590j61701j4306
$$ -13544 92276 56405 -74406 -241490 -211100 -121513 31009 78892 -6698 -168399 -182705
16114a82705Q0635Q2478K2861l677n091o1167m3514l8848J2282j316J1539J7881
$$ -182705 -102070 -19592 3269 -408 -5499 -66666 -110180 -149028 -136746 -138062 -126523 -108642
16102a08642M8490m1345p5303k7001m7269R6749K32711Q7728q9837j18649J00298
$$ -108642 -60152 -101497 -176800 -203801 -251070 -154321 78390 166118 76281 -42368 57930
16091E7930j4558O1461j02492j52156m0506Q275O0653n374r4455P5603J62813
$$ 57930 43372 104833 2341 -149815 -190321 -182046 -121393 -126767 -221222 -145619 17194
16080A7194r184n9051M6504J038m1558L0508q611N2375O6961J11626J1106K8200
$$ 17194 8010 -51041 -4537 -3499 -45057 -14549 -23160 29215 96176 207802 218908 247108
16068B47108q1997j74100Q4647M2549J9079r4234m9577l1770J2229J1272j49013
$$ 247108 165111 -8989 75658 118207 137286 43052 -6525 -38295 -26066 -14794 -163807
16057a63807j7488m253j20338K3284J05232N3391R4386J15343J97572p4701j25030
$$ -163807 -181295 -185548 -305886 -282602 -177370 -123979 -29593 85750 283322 208621 83591
16046H3591j63499k9921j1700Q3879j6443J0081K7710j58330j2838N5052P266
$$ 83591 -79908 -109829 -121529 -37650 -54093 -44012 -16302 -174632 -187470 -132418 -125152
16035a25152J3285R0594O7929o7572l4778M3822K0988o8437j15202l8436J5724
$$ -125152 -111867 -21273 46656 -20916 -55694 -11872 9116 -59321 -174523 -212959 -197235
16024a97235M2656M1430L6320L2347k2772J2655j32917l3002l7736M741R9095
$$ -197235 -154579 -113149 -76829 -44482 -67254 -54599 -187516 -220518 -258254 -253513 -154418
16013a54418O3778R824K7966l1601L1100J20941q3645l7408K6378j09888n4467
$$ -154418 -90640 -80816 -52850 -84451 -53351 67590 -16055 -53463 -27085 -136973 -191440
16002a91440J0066N4771j12711P8191J21365n4011J01719Q554M4408n2482m1554
$$ -191440 -181374 -126603 -239314 -161123 -39758 -93769 7950 16504 60912 8430 -33124
15991c3124m1545K0221R2504j5163L6895j8320J7736l0572q3300j57748l6388
$$ -33124 -74669 -54448 38056 22893 59788 41468 59204 28632 -54668 -212416 -248804
15980b48804J10644J04686k5347j4883J19321j5201J218O228j34810q1006j3673
$$ -248804 -138160 -33474 -58821 -73704 45617 30416 31634 37862 -96948 -177954 -191627
15969a91627m2266J4577o8049O8499O0729J14688R0796n7592j23358n3244J9929
$$ -191627 -233893 -219316 -287365 -218866 -158137 -43449 47347 -10245 -133603 -186847 -166918
15958a66918P9591k4324m7279P8039K368o4825L2632N6790k7203k8714K2134J0804
$$ -166918 -87327 -111651 -158930 -80891 -78523 -143348 -110716 -53926 -81129 -109843 -87709 -76905
15946g6905o8070P0129R7994p0340l193L7367k2382o9943J16368R1910j01616
$$ -76905 -144975 -74846 23148 -47192 -50385 -13018 -35400 -105343 11025 102935 1319
15935A319j24389j00007j9563J22129J70628O9631p8199q3834j4907l7867j5421
$$ 1319 -123070 -223077 -242640 -120511 50117 119748 41549 -42285 -57192 -95059 -110480
15924a10480N6877o2588o4772J3886j7525N5933q115L6475M0525Q105K5413N3508
$$ -110480 -53603 -116191 -180963 -167077 -184602 -128669 -136784 -100309 -59784 -51679 -26266 27242
15912B7242P7957r2971n4980J3470M4976l9730m6657J12315J58853j05242j71132
$$ 27242 105199 12228 -42752 -29282 15694 -24036 -70693 41622 200475 95233 -75899
15901g5899N852P4566P712k4815O3568j15122m8313J35021n3575l2221N913L6373
$$ -75899 -70047 4519 12231 -12584 50984 -64138 -112451 22570 -31005 -63226 -57313 -20940
15889b0940P6820M7213J07475P9152l8617n7560j11366k8583L8502P57J02845
$$ -20940 55880 103093 210568 289720 251103 193543 82177 53594 92096 92853 195698
15878A95698j18647k27307J14851J03949J10541M0978k1725k6859K6284J1253
$$ 195698 77051 -150256 -35405 68544 179085 220063 198338 171479 197763 209016
15868B09016n9407j5080P5789m2222p0713n8579j5214L4885Q4487n8716j34168
$$ 209016 149609 134529 210318 168096 97383 38804 23590 58475 142962 84246 -49922
15857d9922Q1925M6155J7214Q6668j34727j26938r6842o973O9504n6990p13P5526
$$ -49922 32003 78158 95372 182040 47313 -79625 -176467 -183440 -113936 -170926 -171639 -96113
15845i6113J83922P468m4665K8738J6963J7948j0503k0791k6414k8979k5429j68843
$$ -96113 87809 95277 50612 79350 96313 114261 103758 82967 56553 27574 2145 -166698
15833a66698m0654O3512M2472k2532P0430N4160q6271j6113N8982L8084J34613
$$ -166698 -207352 -143840 -101368 -123900 -53470 690 -85581 -101694 -42712 -4628 129985
15822A29985l5689J4859l7477L8765M8058j17293l9318m205Q4387l3050j03057
$$ 129985 94296 109155 71678 110443 158501 41208 1890 -2315 82072 49022 -54035
15811e4035L6516J6251q2046k5007Q4003Q3900j16538k2677m6183K9029J04135
$$ -54035 -17519 -1268 -83314 -108321 -24318 59582 -56956 -79633 -125816 -96787 7348
15800G348j5912L7275O255L7129m0415m914j7895j64793o2527N666J17834J26297
$$ 7348 -8564 28711 34966 72095 31680 26766 8871 -155922 -218449 -212783 -94949 31348
15788C1348n6068n2983J50893J33690l0638j10555O1816O1141p0609r5958j11188
$$ 31348 -24720 -77703 73190 206880 176242 65687 127503 188644 118035 22077 -89111
15777h9111l7808L9960R77l9839J0175Q1046O2247r1633m9719L3763K8155p070
$$ -89111 -126919 -86959 -85982 -125821 -115646 -34600 27647 -63986 -113705 -79942 -51787 -58857
15765e8857k8433P1327J15578P3245J7576n7381n0044l5928p8914p3969j06900
$$ -58857 -87290 -15963 99615 172860 190436 133055 83011 47083 -31831 -105800 -212700
15754b12700k2298R5267J8892j09913l3568R7304Q4673K4364J83773J14762K223
$$ -212700 -234998 -139731 -120839 -230752 -264320 -167016 -82343 -57979 125794 240556 242779
15743B42779n8434k8719p3963K2166j9609j03493p4523n0074l4628l2632J39305
$$ 242779 184345 155626 81663 103829 84220 -19273 -93796 -143870 -178498 -211130 -71825
15732g1825P7673m1534j3852l7812j72409J65803M9634L173Q0556l2499k1179
$$ -71825 5848 -35686 -49538 -87350 -259759 -93956 -44322 -41149 39407 6908 -14271
15721a4271J2200K909j4048L8012O4857l7317Q2219k3993j359q2533j26795N936
$$ -14271 -2071 838 -13210 24802 89659 52342 134561 110568 109209 26676 -100119 -94183
$$ [...]
##END NTUPLES=NMR SPECTRUM
##END=
