##TITLE=Analysis number 329230
Compound Code cc 66509
Book Reference 467/172
Project Code adrs
Chemist Name benw
##JCAMPDX= 6.0         $$ Bruker NMR JCAMP-DX V2.0
##DATA TYPE= NMR SPECTRUM
##DATA CLASS= NTUPLES
##ORIGIN= Bruker BioSpin GmbH
##OWNER= nmr
$$ XWIN-NMR		Version 3.5
$$ Mon Aug 13 13:37:18 2007 GMT Daylight Time (UT+1h)  MAYBRIDGE\nmr@NMR_250MHZ
##.OBSERVE FREQUENCY= 250.131544655141
##.OBSERVE NUCLEUS= ^1H
##.ACQUISITION MODE= SIMULTANEOUS (DQD)
##.ACQUISITION SCHEME= undefined
##.AVERAGES= 16
##.DIGITISER RES= 18
##SPECTROMETER/DATA SYSTEM= dpx250
##.PULSE SEQUENCE= zg30
##.SOLVENT NAME= CDCl3
##.SHIFT REFERENCE= (INTERNAL, CDCl3, 0, 16.4517)
##AUDIT TRAIL= $$ (NUMBER, WHEN, WHO, WHERE, WHAT)
$$ ##TITLE= Audit trail, XWIN-NMR		Version 3.5
$$ ##JCAMPDX= 5.01
$$ ##ORIGIN= Bruker BioSpin GmbH
$$ ##OWNER= nmr
$$ C:\u/data/dgb/nmr/ADRS/530/pdata/1/auditp.txt
$$ ##AUDIT TRAIL=  $$ (NUMBER, WHEN, WHO, WHERE, WHAT)
(   1,<2007-08-13 13:36:57.29 +100>,<MAYBRIDGE\nmr>,<NMR_250MHZ>,
      <created by zg, POWCHK disabled, PULCHK disabled
       configuration hash MD5:
       76 6E 9A 78 1E 09 19 81 EC 84 63 8F B0 6A 59 2D
       data hash MD5: 64K
       B3 36 35 2C 87 EF F4 2D 74 EE DF F2 C8 D9 65 E8>)
(   2,<2007-08-13 13:37:08.86 +100>,<MAYBRIDGE\nmr>,<NMR_250MHZ>,
      <Start of raw data processing
       ef LB = 0.3 FT_mod = 6 PKNL = 1 SI = 32K 
       data hash MD5: 32K
       C0 07 4E 4F EA 45 EE C5 12 32 25 15 32 9F 85 F2>)
(   3,<2007-08-13 13:37:10.50 +100>,<MAYBRIDGE\nmr>,<NMR_250MHZ>,
      <apk 
       data hash MD5: 32K
       EC BB EA C1 3E E9 F6 B4 AA 64 6C 84 CE 63 65 A4>)
(   4,<2007-08-13 13:37:11.18 +100>,<MAYBRIDGE\nmr>,<NMR_250MHZ>,
      <abs ABSG = 5 
       data hash MD5: 32K
       97 61 5D 31 D7 A1 AD E5 DB 20 D6 99 A0 B2 A9 08>)
$$ ##END=
$$ 
$$ hash MD5
$$ 41 D3 5A 8D DC 24 C5 CA 77 F2 E8 43 CD B8 53 8A
##$RELAX= 
##$RELAX= 
##$RELAX= 
##$RELAX= 
##$RELAX= 
##$RELAX= 
##$RELAX= 
$$ Bruker specific parameters
$$ --------------------------
##$DU= <C:\u>
##$EXPNO= 530
##$NAME= <ADRS>
##$PROCNO= 1
##$TYPE= <nmr>
##$USER= <dgb>
##$AMP= (0..31)
100 100 100 100 100 100 100 100 100 100 100 100 100 100 100 100 100 100 
100 100 100 100 100 100 100 100 100 100 100 100 100 100 
##$AQSEQ= 0
##$AQ_mod= 3
##$AUNM= <au_zg>
##$AUTOPOS= <32 >
##$BF1= 250.13
##$BF2= 250.13
##$BF3= 250.13
##$BF4= 250.13
##$BF5= 500.13
##$BF6= 500.13
##$BF7= 500.13
##$BF8= 500.13
##$BYTORDA= 1
##$CFDGTYP= 0
##$CFRGTYP= 5
##$CHEMSTR= <none>
##$CNST= (0..31)
1 1 145 1 1 1 1 1 1 1 1 1 1 1 1 1 1 1 1 1 1 1 1 1 1 1 1 1 1 1 1 1 
##$CPDPRG= <>
##$CPDPRG1= <>
##$CPDPRG2= <>
##$CPDPRG3= <>
##$CPDPRG4= <mlev>
##$CPDPRG5= <mlev>
##$CPDPRG6= <mlev>
##$CPDPRG7= <mlev>
##$CPDPRG8= <mlev>
##$CPDPRGB= <>
##$CPDPRGT= <>
##$D= (0..31)
0 1 0 0 0 0 0 0 0 0.06 0 0 0 0 0 0 0.0002 0 0 0 0 0 0 0 0 0 0 0 0 0 0 
0 
##$DATE= 1187008616
##$DBL= (0..7)
120 120 120 120 120 120 120 120 
##$DBP= (0..7)
150 150 150 150 150 150 150 150 
##$DBP07= 0
##$DBPNAM0= <>
##$DBPNAM1= <>
$$ [...]
##$SUBNAM8= <"">
##$SUBNAM9= <"">
##$SW= 20.6930455092707
##$SWIBOX= (0..15)
0 0 3 0 0 0 0 0 0 0 0 0 0 0 0 0 
##$SW_h= 5175.983436853
##$TD= 65536
##$TD0= 1
##$TE= 297.16
##$TE2= 300
##$TE3= 300
##$TEG= 300
##$TL= (0..7)
0 120 120 120 120 120 120 120 
##$TP= (0..7)
150 150 150 150 150 150 150 150 
##$TP07= 0
##$TPNAME0= <>
##$TPNAME1= <>
##$TPNAME2= <>
##$TPNAME3= <>
##$TPNAME4= <>
##$TPNAME5= <>
##$TPNAME6= <>
##$TPNAME7= <>
##$TPOAL= (0..7)
0.5 0.5 0.5 0.5 0.5 0.5 0.5 0.5 
##$TPOFFS= (0..7)
0 0 0 0 0 0 0 0 
##$TUNHIN= 0
##$TUNHOUT= 0
##$TUNXOUT= 0
##$USERA1= <user>
##$USERA2= <user>
##$USERA3= <user>
##$USERA4= <user>
##$USERA5= <user>
##$V9= 5
##$VALIST= <valist>
##$VCLIST= <CCCCCCCCCCCCCCC>
##$VD= 0
##$VDLIST= <DDDDDDDDDDDDDDD>
##$VPLIST= <PPPPPPPPPPPPPPP>
##$VTLIST= <TTTTTTTTTTTTTTT>
##$WBST= 1024
##$WBSW= 4
##$XGAIN= (0..3)
0 0 0 0 
##$XL= 0
##$YL= 0
##$YMAX_a= 525038
##$YMIN_a= -353741
##$ZGOPTNS= <>
##$ZL1= 120
##$ZL2= 120
##$ZL3= 120
##$ZL4= 120
##$ABSF1= 16.45169
##$ABSF2= -4.241482
##$ABSG= 5
##$ABSL= 3
##$ALPHA= 0
##$AQORDER= 0
##$ASSFAC= 0
##$ASSFACI= 0
##$ASSFACX= 0
##$ASSWID= 0
##$AUNMP= <proc_1d>
##$AZFE= 0.1
##$AZFW= 0.1
##$BCFW= 0
##$BC_mod= 0
##$BYTORDP= 0
##$COROFFS= 0
##$CY= 12.5
##$DATMOD= 1
##$DC= 0
##$DFILT= <>
##$DTYPP= 0
##$F1P= 14.0000005364418
##$F2P= -0.99999901652339
##$FCOR= 0.5
##$FTSIZE= 32768
##$FT_mod= 6
##$GAMMA= 0
##$GB= 0
##$INTBC= 1
##$INTSCL= 1
##$ISEN= 128
##$LB= 0.3
##$LEV0= 0
##$LPBIN= 0
##$MAXI= 10000
##$MC2= 0
##$MEAN= 0
##$ME_mod= 0
##$MI= 0
##$NCOEF= 0
##$NC_proc= -4
##$NLEV= 6
##$NOISF1= 0
##$NOISF2= 0
##$NSP= 0
##$NTH_PI= 0
##$NZP= 0
##$OFFSET= 16.45169
##$PC= 1
##$PHC0= -41.32311
##$PHC1= -1.252771
##$PH_mod= 1
##$PKNL= yes
##$PPARMOD= 0
##$PSCAL= 4
##$PSIGN= 0
##$REVERSE= no
##$SF= 250.130017584336
##$SI= 32768
##$SIGF1= 0
##$SIGF2= 0
##$SINO= 400
##$SIOLD= 32768
##$SREGLST= <1H.CDCl3>
##$SSB= 0
##$STSI= 32768
##$STSR= 0
##$SW_p= 5175.98343685301
##$SYMM= 0
##$S_DEV= 0
##$TDeff= 65536
##$TDoff= 0
##$TI= <Analysis number 999999
Compound Code 99
Book Reference 9
Project Code 9>
##$TILT= no
##$TM1= 0
##$TM2= 0
##$TOPLEV= 0
##$USERP1= <user>
##$USERP2= <user>
##$USERP3= <user>
##$USERP4= <user>
##$USERP5= <user>
##$WDW= 1
##$XDIM= 32768
##$YMAX_p= 586226216
##$YMIN_p= -230591
$$ End of Bruker specific parameters
$$ ---------------------------------
##NTUPLES= NMR SPECTRUM
##VAR_NAME=  FREQUENCY,     SPECTRUM/REAL,   SPECTRUM/IMAG
##SYMBOL=    X,             R,               I
##VAR_TYPE=  INDEPENDENT,   DEPENDENT,       DEPENDENT
##VAR_FORM=  AFFN,          ASDF,            ASDF
##VAR_DIM=   32768,         32768,           32768
##UNITS=     HZ,            ARBITRARY UNITS, ARBITRARY UNITS
##FACTOR=    0.157963299565203, 1,           1
##FIRST=     4115.06167753669, 0,            0
##LAST=      -1060.92175931632, 0,           0
##MIN=       -1060.92175931632, -230591,     0
##MAX=       4115.06167753669, 586226216,    0
$$ Real data points
##PAGE= N=1
##DATA TABLE= (X++(R..R)), XYDATA
$$ [...]
26071G7933p8575l1731l4219K3956Q2646M5693k6916o7847m3771J5974L4792K3023
26059B0958K4497p577J7463l2978j5951k5828l2320k6113m0751K3015o950L1441
26047g1094M1393J5121P6875j1531K6617O4297p8629m4669k5339M3907K8030j7664
26035D7314l4176m0169j375q722j3127J427J6937k995J9456L9321l6953l7271
26023e0333j7010o5838l9284J8791K1604Q3637R58K9133N4922K5965l9468M788
26011B7865l858L9135m1029j4203K4879J5924L4249O9621O1392m0157n7752j9038
25999I7028m3689l2860L0827J6952j9948J4505M1297q851l3473n3408O4490j9107
25987E3763p4869K2382J5417j9985L5453L379k2959J1355m7011O933O5616r559
$$ y = [77933, -642, -32373, -66592, -42636, 40010, 85703, 58787, -9060, -52831, -36857, -2065, 20958, 45455, 37878, 55341, 22363, 6412, -19416, -51736, -77849, -118600, -95585, -102535, -71094, -29701, -14580, 62295, 50764, 77381, 141678, 63049, 18380, -6959, 36948, 64978, 47314, 13138, -27031, -28406, -37128, -50255, -48828, -31891, -34886, -15430, 23891, -13062, -50333, -67343, -133181, -172465, -153674, -132070, -48433, -47475, -18342, 36580, 62545, 23077, 27865, 24007, 63142, 22113, 7910, 32789, 48713, 82962, 152583, 213975, 173818, 116066, 97028, 53339, 20479, 51306, 68258, 48310, 62815, 104112, 95261, 61788, 8380, 72870, 53763, -21106, 1276, 16693, -3292, 32161, 35540, 12581, 23936, -23075, -16142, 49474, 39915]
25975C9915q1499K92k508o880P7119L2548n8650n4589j3674O6523K7220R6805
25963A22622O268p6437J8076m5025o9241K5760M1155J0314k3504j2683R781K0438
25951B7524o43J3454O194J2912r533k8085j0846l5082l4777M1759R067J8868J02757
25938A13569J1565j0640n4172m1891J9883O2639j7104L0280K2490P77k7504j9983
25926H9909K5946k2251j12573K4368L5702o4419j11023N170M5024K5929J0692
25915d7526m0279P1608J8284j690k2981P090N1040O760k0159m4090l4824N9888
25903C121J968m2163K5483N6999O4667K0535J9581L462k4386n344l6969l2168
25891E4786L271J1283j3412J0495l3008p3836m4825j5266P211N6799j2856K016
$$ y = [39915, -41584, -41292, -43800, -50680, 26439, 58987, 337, -54252, -67926, -1403, 25817, 122622, 128890, 52453, 70529, 25504, -43737, -17977, 23178, 33492, 9988, -2695, 7086, 27524, 26881, 40335, 46529, 59441, 49908, 21823, 10977, -24105, -58882, -17123, -8056, 10812, 113569, 125134, 114494, 60322, 18431, 38314, 100953, 83849, 114129, 136619, 137396, 109892, 89909, 115855, 93604, -18969, 5399, 41101, -23318, -134341, -129171, -84147, -58218, -47526, -87805, -16197, 2087, 397, -22584, -15494, 35546, 42306, 22147, -21943, -56767, 3121, 5089, -37074, -11591, 45408, 110075, 130610, 150191, 153653, 129267, 123923, 86954, 54786, 58057, 69340, 55928, 66423, 33415, -40421, -85246, -100512, -93301, -36502, -49358, -47342]
25879d7342J8571J7348N677M352j2206r3407J7261L6807j556j6141R829R603k2133
25866g3337L2163K9138K7856j5894p264J3277j8204j4636L8898Q1844N1417m3325
25854A01933m3650m792k481j8853L2017j3251k8408M8535l2477M351k7839K0443
25842C5528J9560L2934o3403L5253nR004k5427q0291n3107j8192M0754L3104Q934
25829b5354N8860k1431q8500M1602L2132J0968J8915j2347k1048j8734j1921J6503
25817b0355j3304k105l7229J6427J387k668K1114P412l5165j0134O5869K5999
25805A7248j8802l8697J3140K8683j7617q441q168L1466r516K3556L5424Q07N26
25792D9609m5187k9524L9202m6777m412K697n354j5216j6589k3435o205J01673
$$ y = [-47342, -28771, -11423, -5746, -1394, -13600, -107007, -89746, -52939, -54495, -70636, -60807, -51204, -73337, -41174, -12036, 15820, -74, -7338, 5939, -12265, -26901, 11997, 93841, 145258, 101933, 58283, 53491, 51010, 32157, 64174, 50923, 22515, 71050, 38573, 42924, 15085, 35528, 55088, 88022, 24619, 59872, 59867, 68871, 43444, -36847, -89954, -108146, -67392, -34288, -25354, 33506, 12075, -76425, -34823, -2691, 8277, 27192, 14845, -6203, -24937, -36858, -20355, -33659, -35764, -72993, -56566, -55179, -57847, -36733, -29321, -64486, -74620, -8751, 17248, -1554, -40251, -27111, 1572, -16045, -24486, -32654, -1188, -10704, 12852, 48276, 49083, 49609, 4422, -25102, 14100, -32677, -37089, -34392, -39746, -54962, -71551, -94986, -101191, 482]
25780D82N8262l2988R068M6009K3387o6680k1327J322k33p096J5977M0614j5160
25767E1637O662L1349m414q381n1247l1584j3123l0781O117N2810O1936j6576
25755E4405k3287n4730j0424P995l5096K8000K6280R482o4847J7698K2924L9591
25743A7991R6705K1771l5498n2919o2582m9910n100n5526k8340L8473N9424l2215
25731h7726K6285L489P3382J6125j8129m5841K5899l4193m5870L3258J8982K2837
25719a1502K6177j3354k9759J3407r612l0294j6253O2430R1624n281k1136j3782
25707D2665l1251J2359o677p4J236J1638M6822j3611o329l4119o5458J3771P9566
25694E0538J6059n729m5877j3987J2567O367K0362j4337J6435n138l5450k8009
$$ y = [482, 58744, 25756, 34824, 80833, 104220, 37540, 16213, 17535, 17302, 10206, 26183, 66797, 51637, 58299, 89648, 85234, 76853, 25606, -5978, -19101, -49882, -43765, 9045, 70981, 54405, 31118, -23612, -34036, -26041, -61137, -33137, -6857, 2625, -62222, -44524, -21600, 17991, 114696, 136467, 100969, 48050, -14532, -64442, -69542, -125068, -153408, -114935, -55511, -87726, -61441, -57952, 15430, 31555, 13426, -32415, -6516, -40709, -86579, -53321, -34339, -11502, 14675, 1321, -28438, -15031, -24643, -54937, -71190, -8760, 82864, 77583, 56447, 42665, 11414, 23773, 17096, 17022, 18258, 29896, 76718, 63107, 56778, 22659, -42799, -29028, 50538, 66597, 60868, 14991, 1004, 13571, 19938, 40300, 25963, 42398, 37260, 1810, -26199]
25682b6199M896R40L8795Q993m1041k0698r397l2609M1057N6453J2522J9969o559
25669D7122l9787l479j7725n562k4664l1269M3418M0287l8337k4811m3887L398
25657i5296o7229l4820R2814O2593j152J1735k3946l3281o5545N0476M4953j4843
25645g3541n5480L7039M4534k2445m0329l4469J0367O7618M0997m473L2106J9245
25633B1169k9452l1669J9159P330L9745k2645K2476j760J0344l2783l7175r479
25621d4740m5835K2520O6417k4151k0145O5347J2084l5459m039O265k3047j5830
25609d0613J8449J1827j5009o495k3267J5243M5675j5369Q713k065k7741l5808
25597f6460J6899M4180N4335k7104j0608J2224r289J8235K0661j929j3729l3144
$$ y = [-26199, -21303, -20363, 18432, 27425, -13616, -34314, -43711, -76320, -35263, 21190, 33712, 53681, 47122, 7335, 3856, -13869, -19431, -44095, -75364, -31946, 8341, -29996, -54807, -98694, -95296, -162525, -197345, -104531, -41938, -43090, -31355, -55301, -88582, -154127, -103651, -58698, -73541, -129021, -91982, -47448, -69893, -110222, -144691, -134324, -66706, -25709, -30182, 1924, 21169, -8283, -39952, -20793, -13463, 26282, 3637, 26113, 24353, 34697, 1914, -35261, -44740, -90575, -68055, -1638, -25789, -45934, 19413, 31497, -3962, -8001, -1736, -24783, -40613, -22164, -10337, -25346, -31841, -55108, -39865, 5810, -9559, -846, -2911, -30652, -66460, -49561, -5381, 48954, 21850, 11242, 23466, 14177, 32412, 53073, 51144, 37415, 4271]
25585D271J7332K1109j2413j8658l0709K3488J5285R103m2591o8938j3855M0536
25573e6040L2545k9125k1044J5703P9587M0943j4056k9311j4868J9882j2969O0057
25561G1304k2186q7723j2639O4020L9400j4235q72K0543K9619m7690n8624r31
25549b0014o0477l5933p164N5223J11424L5760q601j5196l13Q038N63j4216k8853
25536B0241L9233l3227r4213l4679K4327N479l270M3788K778r416k276P2791L1375
25523F2931K151j6717k1309q285m685K3774L260j9346o1442k7192Q9948K3438
25511D6526R961n6346m7498J6040J684P0177P4367j9543o5153o1139K2181M8500
25499C9757j8088k7447k8361J4939o1408M9446J8019M361K4247O2199p449p5121
$$ y = [4271, 21603, 42712, 30299, 11641, -19068, 4420, 19705, 28808, -13783, -82721, -96576, -56040, -23495, -52620, -73664, -57961, 21626, 62569, 48513, 19202, 4334, 24216, 11247, 71304, 49118, -38605, -51244, 12776, 52176, 37941, 37069, 57612, 87231, 39541, -19083, -20014, -80491, -116424, -123588, -68365, 43059, 78819, 70218, 55022, 54709, 62747, 63310, 49094, 20241, 59474, 26247, -67966, -102645, -78318, -72839, -76109, -32321, -29543, -38959, -41235, 31556, 62931, 65082, 48365, 27056, 18771, 14086, 37860, 41120, 21774, -39668, -66860, 23088, 46526, 56487, 141, -47357, -31317, -29633, 40544, 114911, 95368, 30215, -30924, -8743, 39757, 21669, -5778, -34139, -19200, -80608, -31162, -13143, -8782, 15465, 77664, 70215, -4906]
25487d906l2033L0315M0600L0748l1430n1083M5965L1072l468k0214J5447J3192
25475F4205k4261m1822o5259j1968J8136J9765P7835N2843j7234l0486J6269k163
25463E5860J3518J5395J9027K0028l8692n1911l1508j04537L582L3558N612L3987
25451b6081l978j0600J0273N9940l1089p2764o2574l476L4874M7086J1405O5623
25439A8639L8225l0406L0458k0300l728l9885j1514J86j9294m295Q7416j5334
25427C0168K744m3794k7075k3875q891M2797M0166k000j8523l0763k9875m4148
25415a13069N2806J7407j7254J2974J400M8563m832k8M1668l478k7703O728k3964
25402h782m5333o0463K3111K8850M0274k1073k5737P6428L5197m4604m0032n0774
$$ y = [-4906, -36939, -6624, 33976, 64724, 33294, -17789, 28176, 59248, 55780, 35566, 51013, 64205, 39944, -1878, -67137, -79105, -60969, -41204, 36631, 89474, 72240, 41754, 58023, 55860, 69378, 84773, 103800, 123828, 85136, 33225, 1717, -102820, -99238, -65680, -60068, -26081, -30059, -40659, -30386, 29554, -1535, -74299, -136873, -140349, -105475, -58389, -46984, 18639, 56864, 26458, 56916, 36616, 32888, -6997, -18511, -18325, -37619, -41914, 45502, 30168, 32912, -10882, -37957, -61832, -70723, -27926, 12240, 10240, -8283, -39046, -68921, -113069, -60263, -42856, -60110, -47136, -45736, 2827, -2005, -2033, 39635, 36157, 8454, 15182, -8782, -54115, -114578, -91467, -62617, -22343, -43416, -69153, 7275, 42472, -2132, -42164, -92938]
25390i2938J6271M8345P5057m014m5796J3575O511N5416J4922o661j4005j0561
25378E6122n50l0367M770k1753k0563L0539J2609L88k4496j0798m9164M6701N3561
25365D6999O887q737M743Q856j3896k2322m0584k8065j3985K3914M4737J9613
25353B8160K6376J5208J001K558L9640j5264p5725L3542K8279n723m264m7951
25341B5837k562j7092j0580K083m9930M0619k939l422M7318p4400r840Q8504m141
25328B9455l7538j9196j199j7532K616L7758j4741K528K0617p6131M1708J0575
25316b1080N683L0854k2513M9043L1624l2535M179J3168m4244p9021M7203K8474
25304A0835K8703j0943o0866m9236J5580L8114l7625j1323L9012N6863k0847n8391
$$ y = [-92938, -76667, -28322, 46735, 42721, -3075, 10500, 17011, 72427, 87349, 80688, 66683, 56122, 55572, 25205, 29975, 8222, -12341, 18198, 30807, 31195, 6699, -4099, -53263, -6562, 46999, 53886, 45149, 49892, 58748, 44852, 22530, -18054, -46119, -60104, -36190, 8547, 28160, 54536, 69744, 70745, 73303, 112943, 97679, 21954, 55496, 83775, 78052, 73788, 25837, 23275, 6183, -4397, -2314, -52244, -11625, -14564, -17986, 29332, -45068, -54908, 33596, 29455, -8083, -27279, -28478, -46010, -43394, -5636, -20377, -17849, 2768, -73363, -31655, -21080, -15397, 15457, -7056, 41987, 73611, 41076, 45255, 58423, 14179, -64842, -17639, 10835, 39538, 28595, -32271, -81507, -65927, -27813, -65438, -76761, -37749, 19114, -1733, -60124]
25292f0124M1824L7242m7813N782N3876k1643j7579K2311j0641J8554L2421l9377
25280A4833o1866n1304K5056L4207M6083O3722J9885J2342l8277p4702m6321K6041
25268c0301N0065O0449J5374k2371j2054l3832j2234K761m8681l7072r388L4345
25256d2939R782j8507k0661M1500L1189k0448k8187j9378n5352j8285N2135L665
25244h5486o0979J1162K5928J7690J5818L0745N0899n576o272k190K9096L4741
25232E5576k186l3305j449j0872J3946k6495m3650J2712M7229L4378j633q494
25220C5757k0168J6135K7379m519n539j1054l2581J2474k1426l436j2666P2274
25208E2630J1311L9910K7057j4589p4233j8795o7855n0693k794Q2528O7906J3522
$$ y = [-60124, -18300, 18942, -28871, -23089, 30787, 9144, -8435, 13876, 3235, 21789, 54210, 14833, -47033, -98337, -73281, -39074, 7009, 70731, 90616, 102958, 64681, -10021, -56342, -30301, 19764, 80213, 95587, 73216, 61162, 27330, 15096, 17857, -30824, -67896, -77284, -42939, -33157, -51664, -72325, -30825, 364, -20084, -48271, -67649, -123001, -141286, -89151, -85486, -146465, -135303, -109375, -91685, -75867, -45122, 5777, 201, -6071, -8261, 20835, 55576, 53390, 20085, 18636, 7764, 21710, -4785, -48435, -35723, 11506, 45884, 44251, 35757, 15589, 31724, 59103, 54584, 49045, 37991, 5410, 17884, -3542, -6978, -19644, 52630, 63941, 103851, 130908, 116319, 42086, 23291, -44564, -95257, -98051, -15523, 52383, 65905]
25196F5905m5484n5819K8106K5248J5765J1977N2605K2626l5677q5304o8993k5206
25184i4251M0333L3793J9687k4948p2838N2232O5032O8120j0359k0720o5757n373
25172a5049L1771o633k8253k8232j0829K2987j0188J4956L8230N2253p756m4992
25160H265M610l1465K1746M1524J3963J2821P5608K9527k2006p2682l9241j9889
25148B2781J4252l1352j03425N7842M0236K5151K2635p3024m408J9451k8883P424
25136c1320M8600L5081o7715j3446K6496j7539r691j3822J0567K3209K6079o6201
25124d9702N5906m3755k2844l4161O5945L3625j0334k979k0480q098J3334J8357
25112e186k206j0730k4117J8757L2866p2263p1182k9273J7027K2289R7947Q1511
$$ y = [65905, 20421, -35398, -7292, 17956, 33721, 45698, 98303, 120929, 85252, -52, -69045, -94251, -53918, -20125, -438, -25386, -98224, -45992, 19040, 87160, 76801, 56081, -9676, -15049, 16722, 10089, -18164, -46396, -57225, -34238, -44426, -29470, 8760, 61013, 53257, 8265, 12875, -18590, 3156, 44680, 58643, 71464, 147072, 176599, 154593, 81911, 42670, 22781, 37033, 5681, -97744, -39902, 334, 25485, 48120, -24904, -29312, -9861, -38744, -31320, 17280, 52361, -15354, -28800, -2304, -19843, -29534, -43356, -32789, -9580, 16499, -49702, 6204, -37551, -60395, -94556, -28611, 5014, -5320, -8299, -28779, -36877, -23543, -5186, -7392, -18122, -42239, -23482, 9384, -62879, -134061, -163334, -146307, -124018, -26071, 55440]
25100E5440O5582J2777o4565n6556l4270N12l5059L0293J01497J7823n5377k4237
25088A3860k0928k9656K3694k1161Q581J723j1370k0618n482k5667J1855K9882
25076d5287j763N3149J9773O630n7724o9197M836K5619K6015j711K863K7334J09438
25063I9975Q2920p147l6201m2721L3275k4426p9570O119q261l9003o1774l9976
25051a16790M8094K5729j7718K1510N5703r115j3144n5965o5449O829Q1339P2368
25039C3391M3362N0959j4863o3665k9270K2018k7816l0111J0026l1078n6861K2150
25027g1758K6701N7552J7734l2930L3184N7651l8260J2054J6886K1564n5819m3420
25015A139l7471J106Q848P1763P7531k7951j7864p868K5925J0667j0973n8855
$$ y = [55440, 121022, 133799, 69234, 12678, -21592, -21080, -56139, -25846, 75651, 93474, 38097, 13860, -7068, -36724, -13030, -34191, -25610, -23887, -35257, -55875, -61357, -87024, -75169, -45287, -47050, 6099, 25872, 32502, -25222, -94419, -89583, -63964, -37949, -39660, -36797, -9463, 99975, 182895, 175748, 139547, 96826, 130101, 105675, 26105, 32224, 23963, -15040, -76814, -116790, -68696, -42967, -60685, -39175, 16528, 7413, -5731, -61696, -127145, -120316, -38977, 33391, 76753, 127712, 112849, 49184, 19914, 41932, 14116, -15995, -5969, -37047, -93908, -71758, -45057, 12495, 30229, -2701, 30483, 88134, 49874, 61928, 78814, 100378, 44559, 1139, -36332, -35226, -26378, 45385, 122916, 94965, 77101, 69233, 95158, 105825, 94852, 35997]
25003C5997M959l4966m7220K4196P2981R3043K0597l5818k4251k1607K0576L8585
24991A47072j4343k1022N895k8428l6568k4633m3305N1727M1831m3987j3969m4887
24979b4617k0915m8656k6878J1004P6056K0422R66K3883K686j5581o519K2118
24967A3969R096L3239j0063N0139K2647j9526m7065n4442N540l7846r749L3236
24955a0825m9698M317L9323m926p9900j1281Q637P9176O3988j3377J1269l4230
24943B473p6563O3242N2248l877j0323L1529k4700n1561m6961L7571O0448O8321
24931A01847L8359o3210l1024n3565n7877O8569K7718m8603j1200k9453L2496
24920b5943R847P7885M3378m9492l141N0801o077j745m3924K3958N704m0011m5374
$$ y = [35997, 40956, 5990, -41230, -17034, 55947, 148990, 169587, 133769, 109518, 87911, 108487, 147072, 132729, 111707, 117602, 89174, 52606, 27973, -15332, 36395, 78226, 34239, 20270, -24617, -45532, -94188, -121066, -110062, -34006, -13584, -12618, 11265, 13951, -1630, -8149, 13969, 23065, 56304, 46241, 96380, 119027, 99501, 52436, -2006, 3534, -34312, -44061, -10825, -60523, -56206, -16883, -21809, -101709, -112990, -104353, -25177, 38811, 25434, 36703, 2473, -74090, -10848, 41400, 37523, 27200, 58729, 34029, -17532, -64493, -26922, 33526, 101847, 140206, 76996, 45972, -7593, -65470, 3099, 30817, -17786, -28986, -58439, -25943, -16096, 61789, 105167, 55675, 52534, 103335, 97258, 95513, 51589, 75547, 81251, 41240, -4134]
24907d134l2172K9908K3342l831k9863J7015J2026j4526k1160j373K0667j4978
24895a9079m4974k916M754l6054N5802N2692J5754N910j1806l1583O49J1260O387
24882F796M391m763m5138K5165o413M6689l2866o3709J7194K0032R73j127j0224
24869d3000j8799l033j3746k2053K5746J6526m8406m2929M0364M1468M0231M5510
24857A7879L7926o7031m8005j315L4427L656K3991O1062J4663k5693p1499n9561
24845g9500O870P5105N299J2110k8544l7513k754o053J7280L5925k2695m4646
24833f9116n0801M637L9300J5018j3394N7676L5902l8652m9276J7161l5855k9569
24821a16969k1892M0599O7835K4889j5918p538j8706k7643J00502J1705J4061
$$ y = [-4134, -36306, -6398, 16944, 13113, -16750, 265, 12291, -2235, -23395, -24768, -4101, -19079, -64053, -66969, -62215, -98269, -42467, 10225, 25979, 31889, 20083, -11500, -10851, 409, 6796, 11187, 6424, -38714, -13549, -19962, 26727, -6139, -69848, -52654, -32622, -31649, -32776, -43000, -61799, -64832, -78578, -100631, -74885, -58359, -106765, -149694, -109330, -67862, -27631, 17879, 55805, -11226, -59231, -60546, -26119, -22463, 1528, 62590, 77253, 51560, -19939, -79500, -72630, 2475, 7774, 19884, -8660, -46173, -48927, -54980, -37700, -1775, -24470, -69116, -119917, -115280, -75980, -60962, -74356, -16680, 19222, -19430, -68706, -51545, -87400, -116969, -138861, -98262, -30427, -5538, -21456, -28994, -47700, -75343, 25159, 36864, 50925]
24810E0925j992k3947K3015o964k2144q655O109n3883L678K9456r259l4615M7179
24797a097R500K2963q35j8626o5051L2942m567q5873n039l2558k0005N8704J4574
24784i4968J3210K7020K3135K1949k756k4985o6967k9261p589M8821P220L993
24772h1178J7958j1205P366J8036J02391k23m9155j7138K2858M4259M6651N4l5527
24759F5147r531J0277m0349k8330K4231K9213J8661J3893j0342m460j8262l7388
24747A2760p0471k3836J2670k8311Q859k5218N0771M8529j3774l6847J2459L770
24735d8639K9817N6698j6872p2410N6113M3875P0951m5281q8952j6484Q940k638
24723b4882K162j9587m2432J2321L3759o047k6626K2242P3184M7107j5528j3600
$$ y = [50925, 48933, 24986, 48001, 41037, 18893, 10238, 16347, -37536, -33858, -4402, -13661, -48276, -1097, 8403, 31366, 30531, 11905, -53146, -20204, -24771, -110644, -115683, -148241, -168246, -109542, -94968, -81758, -54738, -31603, -9654, -12410, -37395, -104362, -133623, -141212, -92391, -85171, -81178, -63220, -74425, -67059, -49023, 53368, 53145, 3990, -13148, 9710, 53969, 100620, 100674, 65147, 55616, 65893, 25544, -2786, 21445, 50658, 69319, 83212, 72870, 68410, 50148, 12760, -57711, -81547, -68877, -97188, -88329, -113547, -62776, -14247, -28021, -64868, -52409, -48639, -18822, 37876, 21004, -51406, 4707, 48582, 119533, 74252, -14700, -31184, -22244, -24882, -22720, -42307, -84739, -72418, -38659, -44706, -71332, -49090, 24094, 71201, 55673, 42073]
24711D2073p4798N843J6286L380N7423N4026o411k6152J731j6772p7670m8065
24699f9106L8220O158l0991J8538M110j1207k3621O6242J2144L497k9287J0238
24687e065k878l746k4271P3824L316l4420m4495p889N331R125J4997K2145J9876
24674B5850o5527m5120o2993M5440m440K6296J8683m943k2205p126Q2045K1733
24662G693J6369J2484p3710l0542o5218j0360M0126N268k3730N0990N2274j4198
24650c2554K6269M6253l4678l57R2131k7461p9997m0822N6974J3217J0328M2119
24638G1422N5577l8337o1120j7105j2228Q344L9234N1094k4438L8687L8843l9225
24626A10748n7140o4707j4072m061M7667J0311J0634l5435J9567R989n4668k9488
$$ y = [42073, -32725, -26882, -10596, -7216, 50207, 104233, 97822, 71670, 73401, 56629, -21041, -69106, -30886, -24728, -55719, -37181, -33071, -44278, -67899, -1657, 10487, 13984, -15303, -5065, -7943, -11689, -35960, 37864, 41180, 6760, -37735, -45624, -40293, -31168, -16171, 5974, 25850, -39677, -84797, -147790, -102350, -106790, -80494, -61811, -66754, -88959, -96085, -14040, 7693, 24062, 36546, -37164, -67706, -132924, -143284, -103158, -97890, -121620, -70630, -18356, -32554, -6285, 39968, 5290, 4933, 97064, 69603, -10394, -51216, 5758, 18975, 29303, 71422, 126999, 88662, 27542, 10437, -1791, 6553, 45787, 96881, 72443, 111130, 149973, 110748, 53608, -11099, -25171, -29232, 18435, 28746, 39380, 3945, 23512, 33501, -21167, -50655]
24614e0655M1448L3997P226r5079q1220J6247M9853M3381M3264L4989L9310K3468
24602A06229q0590k6069J03745M306k2475j1220l4235j1615J1687N620M5207J7656
24590A08246o7334m8620j0318J0775k0658n7081L6220O6127Q106q544j4967M0400
24578D2352J4996m7117k2671K0114J2253p70p456J7689m0456l1322L7867J6921
24566A2400K9345M847j690M4660M8393J4323o6159j01118m2151j2833j1617j3171
24554i4771L8231N517N6091L4672l1200L4648L2569l7452q771q800j9538l7359
24542c6163N612n606J4742K7268K1688k2658J2138J2055n4329J2568N4955L4718
24530G6988l4300j2744J5290j4681o2305L8526k5925n5056N9095K4341j2493O0118
$$ y = [-50655, -9207, 24790, 32016, -63063, -144283, -128036, -78183, -34802, 8462, 43451, 82761, 106229, 25639, -430, 103315, 107621, 85146, 73926, 39691, 28076, 39763, 45383, 90590, 108246, 40912, -7708, -18026, -7251, -27909, -84990, -48770, 17357, 25463, 16919, 1952, 42352, 57348, 10231, -12440, 7674, 19927, 19157, 11701, 29390, -11066, -42388, -4521, 12400, 41745, 46592, 44902, 89562, 137955, 152278, 86119, -14999, -57150, -69983, -81600, -94771, -56540, -51023, 5068, 39740, 8540, 43188, 75757, 38305, 29534, 20734, 1196, -36163, -30551, -36157, -21415, 5853, 27541, 4883, 17021, 29076, -25253, -12685, 42270, 76988, 42688, 29944, 45234, 30553, -31752, 6774, -19151, -74207, -15112, 9229, -3264, 56854]
24518E6854P5232l2027p7762k5882L793P135R011k8235m3071L5633K9357m8316
24506c8278m1884o141j5865M1066J3659M6415J272k8561K1151n9943J1355L7079
24494a8675J0667m174j6843L9285j0988m06k71j1086j1414M8224m923m8614K7012
24481b206N4545k6810m3432K243L0320J8339j726k59k8570r8486L3482K1670q0551
24468a21441Q261R5451J7228j2178K1437l0301m5238p641O0316N0346j1778j6591
24456G871j2540p921J0927j0419o166O8673N5303J0885l3271n282n4098p4846
24444e0884q263K6133n5040L8679N6804J519P334l3734K5292M5412K2110l6888
24432C8474q376j4530R040m867K923K9320l2834L025k5544k4607M2731l1536J3881
$$ y = [56854, 132086, 100059, 22297, -3585, 208, 7343, 16354, -11881, -54952, -19319, 10038, -38278, -80162, -86303, -102168, -61102, -47443, -1028, 244, -28317, -7166, -67109, -55754, -18675, -8008, -12182, -29025, 10260, -728, -1134, -1405, -12491, -23905, 24319, 19396, -29218, -2206, 52339, 25529, -17903, -15660, 14660, 32999, 31273, 31014, 2444, -96042, -62560, -40890, -121441, -113180, -17729, -501, -12679, 8758, -21543, -66781, -74422, -14106, 36240, 24462, 7871, -4669, -12590, -1663, -12082, -18248, 50425, 105728, 116613, 83342, 78060, 23962, -50884, -59147, -33014, -88054, -49375, 7429, 8948, 16282, -17452, 7840, 53252, 75362, 38474, 30098, 15568, 24608, 19741, 22664, 51984, 19150, 22175, -3369, -27976, 14755, -16781, -2900]
24419b900N8517K9737J841o8727j0927K475N1389Q707k0606o8227m4420k9358
24407i2499j8042N1591J06025n4637m0512k2816j310K1861O994m886j7865q250
24395g4346j4965K584O161N3799L7412L8359j7960K263J2074J2881j8565o7343
24383b7646l9785J267P7417N3314o5617p1516j0730L0155L5473K8896K9798m1092
24371f6r3763L6107L6807K2324m2706l0941j5203J1646O2552J38557K1634k7484
24359A19464o990j33K4359L07k5125j2549r8417j7250l3749J6562P2801J9617
24347E8897L6312j627q3758j2452j3275k7468M3518r97r981J775k0719N4540l898
24334B0867n3030o7156K7890O3273R531M3490J8159m6610J8400k277J7779k7956
$$ y = [-2900, 55617, 85354, 87195, 18468, 7541, 10016, 61405, 70112, 49506, -18721, -63141, -92499, -110541, -58950, 47075, -7562, -48074, -70890, -72200, -50339, -43345, -48231, -66096, -74346, -89311, -86727, -80566, -26767, 10645, 49004, 31044, 33307, 45381, 58262, 39697, -27646, -67431, -66164, 11253, 64567, -1050, -72566, -83296, -53141, -17668, 11228, 41026, -66, -93829, -57722, -20915, 1409, -41297, -72238, -87441, -75795, -13243, 125314, 146948, 119464, 112474, 112341, 136700, 137007, 111882, 99333, 916, -16334, -50083, -33521, 39280, 58897, 95209, 93582, 9824, -2628, -15903, -43371, 147, -850, -10831, -9056, -29775, 24765, 20867, -32163, -99319, -71429, -8156, 1375, 44865, 63024, 16414, 34814, 32537, 50316, 22360]
24322B2360k4804p2547J6774K2353L550M8664K3496N3963L2506k8895o8202J2146
24310D1364r622J3796O3598k8017J4546j6542n4329j2032k0754q911Q2282K1486
24298H6865j728M037J8288n4793l4431K1986n819K1378l3972j3593k3277M408
24286a0651K541N4934J9898j2067p2230L330R1052j5492n9267o5618J8793M7703
24274B926J2556K4494K7414O178n9034k0527L6221k7075k4516n6966j9531k0163
24262a18023l3293J87L8329O6872K3906k9192j0159m1137l2258K469R7308R2905
24250E7914n5102n6319K2810O2823K4404j68j5548j3042j4927O608j5639k1970
24238a8156k417O6795K1096m0292m0555n3323O041L3091j3311m1162m8528L856
$$ y = [22360, -2444, -74991, -58217, -35864, -32314, 16350, 39846, 93809, 126315, 97420, 29218, 41364, 31742, 45538, 109136, 81119, 95665, 79123, 24794, 12762, -7992, -16903, 65379, 86865, 85137, 89174, 107462, 52669, 18238, 40224, 34405, 55783, 21811, 8218, -15059, -10651, -8110, 46824, 66722, 54655, -17575, -14245, 76807, 61315, 2048, -63570, -44777, 2926, 15482, 39976, 67390, 73568, 14534, -5993, 30228, 3153, -21363, -78329, -97860, -118023, -151316, -151129, -112800, -45928, -22022, -51214, -61373, -102510, -134768, -132299, -34991, 57914, 2812, -53507, -30697, 32126, 56530, 56362, 40814, 27772, 12845, 19453, 3814, -18156, -20573, 46222, 67318, 27026, -13529, -66852, -60811, -27720, -41031, -82193, -130721, -126865]
24226a26865N5299K5788K6644M6678J0335k689J188j9705M046j6798M044J4539
24214B2504k1206r420K6995L2341L4245j2481m2756K321l203j8051k764l2650
24202b4125r032J4157L7675m734o5241j7560m5907M0695O2890M2796J0178o471
24190C5321J7860n8154j1708K0128j2328M0663J2071L197K3528K7617k3819k7203
24178D7173m2715p0793M6689k143K2055l954J5196j1293M213K8993q5155j7663
24166f9397N7146K3679L0831M214m2494n827j0410P4630m3479p122n0195N3837
24154A5413K2249m2667J1880K2907M2811J560m5232j0954L8152J230l1834l2391
24142f876O259N2311j5659l0425k9211J4867n352n075Q7946K3533m0983O953k0830
$$ y = [-126865, -71566, -45778, -19134, 27544, 37879, 35190, 36378, 16673, 20719, 3921, 7965, 22504, 1298, -8122, 18873, 51214, 85459, 72978, 30222, 32543, 29340, 11289, 8525, -24125, -33157, -19000, 18675, 13941, -51300, -68860, -114767, -74072, -11182, 31614, 41792, 35321, 53181, -4973, -16681, 3447, -8881, 31782, 43853, 47050, 70578, 98195, 74376, 47173, 4458, -66335, -19646, -21789, 266, -3688, 11508, 215, 4428, 33421, -51734, -69397, -12251, 11428, 42259, 46473, 3979, -1848, -12258, 62372, 18893, 11771, -38424, 15413, 37662, -5005, 6875, 29782, 72593, 74153, 28921, 17967, 56119, 57349, 25515, -6876, -617, 51694, 36035, 5610, -23601, -8734, -14086, -19161, 68785, 92318, 51335, 58288, 37458]
24129C7458k5831k6084k3848j8087J5934k9247K6421J3458J5651n2632K0816K5725
24117b0266l5805j1566k2470J6319L096j4792k8527k2199N2387P4306N5250K9431
24105G5164n1355o8537l6984J7089P3065J4545L726L8750l6192k7366J8393O672
24093B6970J3167l2825P726k0036k208L383j1585P553r47m0349m4034J1563k4050
24080a05672M0026N6580L6955m1184m8785M4306P5072n6919n2979R853n7308M1832
24068e8223O2080M0899k2162q198m1938k5967o062j4423M3407p702J4739J7706
24056e844o4925l0963J8972K2198J638r154r200O8263J629n8625n1470l668P5803
24043d5346K6078K6391m3095L447L6976K5587K6378k5440o5387l1065o4410M699
$$ y = [37458, 11627, -14457, -38305, -56392, -40458, -69705, -43284, -29826, -14175, -66807, -45991, -20266, -56071, -67637, -90107, -73788, -70692, -85484, -114011, -136210, -83823, -9517, 45733, 75164, 23809, -44728, -81712, -64623, 8442, 22987, 26713, 65463, 29271, 1905, 20298, 26970, 40137, 7312, 15038, -4998, -7206, -3823, -15408, -7855, -8802, -49151, -93185, -81622, -105672, -65646, -9066, 27889, -13295, -62080, -17774, 57298, 379, -52600, -42747, -100055, -58223, 3857, 44756, 22594, 14396, -27542, -53509, -59571, -73994, -30587, -38289, -23550, -5844, -70769, -101732, -82760, -60562, -58924, -68078, -77278, -9015, -7386, -66011, -117481, -121149, -45346, -19268, 7123, -35972, -32525, 4451, 30038, 56416, 30976, -34411, -65476, -129886, -125187]
24031a25187N6998P000j2942O760L532l950l0904p970L9435k8914Q1495M7703
24019C3056k8076j5978k5967Q285M3040N3925k6281l7473j6652J4471K0040l3410
24007a1020k2644J4875j0405l7597k3932J7299N7323M8841j1N2o4771k9921L9954
23994b1957q219J5788r479O9453N4052k7490l5502l9073l4885J9750J7229m1340
23982d1673r613L5621j583k6057L6397L7856o1358k5956l620k1339O346n5802
23970a30781R5606L9593n6822N932J9767l208K5316j2139K9564L3033k4029o7532
23958d5700m3379M0274R2603k0614m5252m5633l8487P9509K2376j5614m9230j2655
23946h1802L4034J9767J5913M995m8553k2357q121N0509J5504o0739N491m645
$$ y = [-125187, -68189, -61189, -74131, -67371, -63839, -67789, -98693, -106663, -67228, -96142, -14647, 33056, 4980, -10998, -36965, -28680, 14360, 68285, 42004, 4531, -12121, 2350, 22390, -11020, -33664, -18789, -29194, -66791, -90723, -73424, -16101, 32740, 32729, 32781, -31990, -61911, -21957, -30176, -14388, -23867, 45586, 99638, 72148, 36646, -2427, -37312, -17562, -333, -41673, -51286, -15665, -17248, -43305, -6908, 30948, -30410, -56366, -59986, -81325, -74979, -130781, -35175, 4418, -52404, -46472, -26705, -29913, -4597, -16736, 12828, 45861, 21832, -45700, -89079, -48805, 43798, 23184, -22068, -67701, -106188, -26679, -4303, -19917, -69147, -81802, -47768, -28001, -12088, -7093, -55646, -78003, -86124, -35615, -20111, -80850, -75359, -80004]
23934h0004M8320K3755p885L2006m3311r4259k1577K9093K5058m9776Q153O7021
23922f3406Q7729L9417p3271m6312j4724M5353J7594J4208P0185j7480r8932J327
23910c8312K0839Q095m4556m2675N6030N5992L4835l9899J6161J6353o1116L1727
23898A3474K3912m740P825q2209l9756N3726J18202L615m46j8963k5518q0960
23886c1838l7119J7245Q39L853p743J5408p333p4253J6511M6069m0806L0921L2906
23873c5340j4667L881P527P0766l4120o0755l9312K9388N6114L8506K8028J3641
23861F3657K609L986J843l0320J3109Q368J3102J404O229j333k7454l5986l7810
23848a8596k4126l8517k5463M5343p250n5477N0800R176N3186M3256k809k810
$$ y = [-80004, -31684, -7929, -15814, 16192, -27119, -121378, -142955, -113862, -88804, -138580, -130427, -63406, 24323, 63740, -9531, -55843, -70567, -25214, -7620, 6588, 76773, 59293, -39639, -38312, -17473, -9378, -53934, -96609, -40579, 15413, 50248, 10349, 26510, 42863, -18253, 13474, 37386, 32646, 40471, -41738, -81494, -27768, 90434, 94049, 93603, 74640, 49122, -31838, -68957, -51712, -50873, -47020, -54763, -39355, -46688, -120941, -104430, -58361, -99167, -68246, -35340, -50007, -46126, -38599, 32167, -1953, -62708, -102020, -72632, -16518, 21988, 50016, 63657, 66266, 70252, 72095, 41775, 54884, 63252, 76354, 77758, 83987, 82654, 55200, 19214, -18596, -42722, -81239, -106702, -61359, -68609, -124086, -73286, -64110, -10924, 32332, 29523, 26713]
23836B6713m8675k8321O6567P1167K3072o1570j26759p543R558J8697K4943N0639
23824A8488N080k4622k8401l3403K2134O0764R727p0913N0065L1342K6704p1581
23812d616l7186O1508n171k6873J2044N0084J3565n3737r20J0823L1259m3m7945
23799B792o002K3502k4850m046M5656J7583m2946K4577L6090O417o3128q058o9968
23786f2381q388M9477k2139m2039M8000M5416j5103J0692l7438k6791m0417L1068
23774g0043N5197j0254j7151M1403j2016N0399P116j2611J0666L17q236J5984
23762E0771k7521l8704J8172p235l6813m8002M851Q851L0558N1565o1338k1410
23750g6255J5816N8630K1496n1234m2077L4001J8823j4934q9938m9517M3594R3349
$$ y = [26713, -21962, -50283, 16284, 87451, 110523, 48953, -77806, -85349, -75791, -57094, -32151, 18488, 23568, -1054, -29455, -62858, -40724, 20040, 29767, -41146, 8919, 40261, 66965, -4616, -41802, 19706, 14535, -12338, -294, 49790, 63355, 9618, 8698, 19521, 50780, 50737, 2792, -3210, 20292, -4558, -8604, 37052, 54635, 11689, 36266, 72356, 78773, 15645, 7587, -62381, -70769, -21292, -43431, -85470, -37470, 7946, -7157, 3535, -33903, -60694, -101111, -70043, -14846, -25100, -42251, -848, -12864, 37535, 44651, 32040, 42706, 43023, 34787, 50771, 23250, -15454, 2718, -4517, -41330, -89332, -84481, -75630, -45072, 6493, -54845, -76255, -60439, -1809, 19687, -31547, -73624, -39623, -20800, -35734, -125672, -175189, -131595, -38246]
23738c8246M3214k5164l2573L0500O531l3830o0989L6489M4338J0498M7667L2559
23726F0994k4565m2820p3180R184O7835L3036K8289R97j15359m0358J716m1355
23714a35586k7198M5151O1306L4405L8360K7797K2433Q42j15884p0128N562L2898
23702h0042k8699J8797M3890j3365J873m0164j7899L6382k5371k6115O268M2358
23690h2087N8404M0787q84N52P2629O186j08522r0083m1809O798k917K0520Q213
23677a12213P2031N6194K065j9286K837L0659O869j3434j9488m7696k6061N3776
23665a3747M5524l4585l8312l4361r590L6718m143J7624P2752O3613n4537l6640
23653A0316L6858N3537k295q0235m5710J552l8580J301N5331L6713K2898l281
$$ y = [-38246, 4968, -20196, -52769, -22269, -15738, -49568, -110557, -74068, -29730, -19232, 28435, 60994, 36429, -6391, -79571, -70387, -2552, 30484, 58773, 59770, -55589, -95947, -94231, -135586, -162784, -117633, -56327, -21922, 16438, 44235, 66668, 67510, -48374, -118502, -112940, -80042, -108741, -89944, -46054, -59419, -57546, -97710, -115609, -79227, -104598, -130713, -124445, -82087, -23683, 17104, 16220, 16772, 89401, 95587, -12935, -103018, -144827, -138029, -140946, -120426, -112213, -40182, 16012, 18077, -1209, 1628, 32287, 39156, 25722, 6234, -41462, -67523, -13747, 31777, -2808, -41120, -75481, -85071, -48353, -52496, -34872, 37880, 101493, 46956, 10316, 47174, 100711, 98416, 18181, -27529, -25977, -64557, -63256, -7925, 28788, 51686, 48405]
23641D8405J0887j4366P977L7767L6950n6616m1768l9343k72J1702k0822M3577
23629B4078r385M111K3915l0884J3848r092r2322p073k6047N00J1320Q568J2635
23616g5828k0636J3703O9262j9803l7221O4790M5738r601n8895J3574L1056K212
23604A8351L855L630p559k0270L0775J9198m1352o5966N063P9666l5359P446k1604
23591b4126l5247j536L1800K9677M899j4923J9429l2735k5850P729L9109J4676
23579A2902k0732M2014M3492o5882k9801j3661m1668K0571K6455M930L1306L0868
23567D0794M601k0322m8325n6056o985J0812K7288K083O906k4297j0078Q4933
23555A1354N9514k9518p2406L6912M8115M2265j6813j8643l1709l8125L7389l5710
$$ y = [48405, 59292, 44926, 52903, 90670, 127620, 71004, 29236, -10107, -10379, 1323, -19499, 24078, 14693, 18804, 42719, 11835, 25683, 16591, -75731, -82804, -108851, -108351, -97031, -88463, -75828, -96464, -82761, -13499, -33302, -70523, -5733, 40005, 30404, -28491, -14917, 16139, 18351, 22206, 25836, 18277, -1993, 28782, 47980, 6628, -59338, -54275, 25391, -9968, -2522, -24126, -59373, -60909, -29109, 568, 5467, -9456, 9973, -22762, -48612, -40883, -1774, 12902, -7830, 34184, 77676, 11794, -18007, -31668, -73336, -52765, -26310, -21380, 9926, 40794, 45395, 25073, -23252, -79308, -86293, -75481, -48193, -46110, -39204, -63501, -73579, 11354, 70868, 41350, -31056, 5856, 53971, 96236, 79423, 60780, 29071, -9054, 28335, -7375]
23543g375l5725K3226K3717o5473n4478O5999j2115j0980J4112K0089K1357K841
23531a4805m7431J3322j0712k0843O333L8008K8710m961L7210m349l3399j7749
23519c0666J5876N800J4173L2604Q646k1803l2795o9299L7959N8623j3752K8609
23507C3975n6130n3596M1957L1108k9827L0216N5334L801k6762J1241p828j6003
23495A7486n4832o853O0057Q6847r157j15178R619K020K54k120K7708L210j6914
23482B147n256j122n6338r5652R760O6697L7031o3365K5317R2499M7363q135m8587
23469B359l9996l7515m8277K2175J13919p772r9734j4081P6125J8934K6125j606
23457A0656J8335N736J6029k472j7110P90n6112J4269O5238k0397L6815l36l6939
$$ y = [-7375, -43100, -19874, 3843, -61630, -116108, -50109, -62224, -73204, -59092, -39003, -17646, -14805, -62236, -48914, -59626, -80469, -74136, -36128, -7418, -12379, 24831, 20482, -12917, -30666, -14790, -8990, 5183, 37787, 46433, 24630, -8165, -77464, -39505, 19118, 5366, 33975, -22155, -75751, -33794, -2686, -32513, -2297, 53037, 56838, 30076, 41317, 33489, 17486, -37346, -44199, 15858, 102705, 93548, -21630, -12011, -9991, -9737, -11857, 15851, 19061, 2147, -3109, -4231, -60569, -156221, -146461, -79764, -42733, -106098, -80781, 11718, 59081, 50946, 2359, -37637, -75152, -123429, -101254, 12665, 4893, -94841, -108922, -32797, -13863, 12262, 10656, 28991, 34727, 50756, 48284, 31174, 31964, -24148, -9879, 55359, 34962, 71777, 71441, 34502]
23444C4502o5709R88L5352j6347K3785Q338M4569k9060j3059M8309m4671j7026
23432I971k4997l3614M8971l1290q928K1204l6431j4884M2499n2123j4534L7903
23420e6253L5922M5206m3756n6986M0358j3626L2165N2416o073l5196k7302R679
23408b3446j2808J6811N6657O505j2304J0950J4757J7085m0726p3616M383k25
23396c5977k6600o622J3100p307L9135P0497R512J3461O885l4644p4683p214P477
23383c2980j6374l1899M1100L8655J3072N130o5808m3937q598M1816L3362N5729
23371B9268J3838m7170j8155m5954m4613J2261j2306N2659J6065J4018K7562R691
23359G164k8665m6475L9459N9350L6397p560k9766m5950r106j51k5791j1212M2499
$$ y = [34502, -31207, -30219, 5133, -11214, 12571, 20909, 65478, 36418, 23359, 71668, 26997, 9971, -15026, -48640, 331, -30959, -39887, -18683, -55114, -69998, -27499, -79622, -94156, -56253, -20331, 24875, -18881, -75867, -35509, -49135, -16970, 35446, 29373, -5823, -33125, -23446, -36254, -19443, 37214, 43719, 31415, 42365, 57122, 74207, 33481, -40135, -35752, -35977, -62577, -69199, -56099, -63406, -24271, 46226, 55738, 69199, 76084, 41440, -33243, -40457, -32980, -49354, -81253, -40153, -1498, 11574, 16704, -49104, -93041, -101639, -59823, -26461, 29268, 43106, -4064, -22219, -68173, -112786, -100525, -112831, -60172, -44107, -30089, -2527, 7164, -21501, -67976, -28517, 30833, 67230, 59670, 29904, -16046, -25152, -25303, -51094, -62306, -19807]
23346a9807k062K7778K5184l7527K2421K7428o9826l317M5073L7490n1957L313
23334D191q484L737K9617j4933k462k5015j8039q645L161n4996R704M6634r98
23321c6528M7134J2091p3599k4124M8403k6161j3794m9097k7539N1636M0383K9836
23309b1359J0988p3447l5757N6996P8322N4818N4406j8218p510k8479P6775p288
23297A40247o2493n7674m7301M0706n6558j1470k3518J7476K7301K6307K6067
23286A9090n0392J623K9712K3563j0902n7192Q251j9659J1288j1918l5161P3272
23274a8425j2883j7402L9015M4136J1477j3481l5449K2065J0677j1805m5148Q709
23262a8514L7799M2140L8912q6071n4087P06M6647M1060P313K3872P853m5305
$$ y = [-19807, -21869, 5909, 31093, -6434, 15987, 43415, -26411, -29728, 15345, 52835, 878, 4191, -4293, -556, 29061, 14128, 11666, -13349, -31388, -40033, -36872, -91868, -82164, -35530, -36528, 10606, 22697, -50902, -75026, -26623, -52784, -66578, -115675, -143214, -91578, -51195, -21359, -10371, -83818, -119575, -62579, 15743, 70561, 124967, 106749, 99239, 70760, 147535, 140247, 77754, 20080, -27221, 13485, -43073, -54543, -78061, -60585, -33284, -6977, 19090, -31302, -29679, 33, 23596, 12694, -44498, -36247, -55906, -44618, -56536, -91697, -18425, -31308, -48710, -9695, 34441, 45918, 32437, -3012, 19053, 29730, 17925, -27223, -18514, 19285, 61425, 100337, 14266, -39821, -39115, 7532, 48592, 55905, 79777, 87630, 42325]
23250D2325j06214o1160K3338L8013N594L0121L6355J6677j7185K0678j1835o0831
23238d4124l6414k902M6791P9000J0674q741n1503m2154K2148k7723k0552M3396
23226c2104k3341M815K5724k1662m881K7664L4231J3154N1228J7992m2862k7870
23214B2088p419j3740J6995R367l2369l5890k3272L27K9757q4257l1575M4074
23202a05914J9014K2533K0630N5928L2877r138j1812r446J6975K662L338k2942
23190A4705k6443j2369P797P44K5280J8746K9056K1732m9977k0536p884J701l6308
23177c3756J6910m2793j3005j4523Q926N6123J7813L5666o780j3773k8496m7755
23165f5443K6826J7660N4117J9049n0120r2109M9165J18530m0911p0188N929K7878
$$ y = [42325, -63889, -125049, -101711, -63698, -58104, -27983, 8372, 25049, 7864, 28542, 16707, -44124, -80538, -83440, -36649, 42351, 53025, 44284, -7219, -49373, -27225, -54948, -75500, -32104, -55445, -50630, -24906, -46568, -51449, -23785, 10446, 23600, 74828, 92820, 49958, 22088, 14669, 929, 17924, 27291, -5078, -40968, -64240, -63913, -34156, -118413, -149988, -105914, -86900, -64367, -43737, 12191, 45068, 35930, 24118, 14672, 31647, 34309, 37647, 14705, -11738, -24107, -16310, -15566, 9714, 28460, 57516, 79248, 29271, 8735, 851, 2552, -33756, -16846, -59639, -72644, -87167, -78241, -22118, -4305, 31361, 24581, 10808, -17688, -65443, -38617, -20957, 33160, 52209, 2089, -90020, -40855, 77675, 36764, -33424, -27495, 383]
23153C83J1805R266l346J4142p877q612l819o294j6860M3843N2924l7709n1619
23140c773l7984j9041k0810J2950j929N3313k450R772J1870Q006o7969o325P1311
23127F941J4686m8558m3399J0948J1715l7298P3393J6012k1919j0248j8396K4663
23115b1460l2244P8422M9557l9963n3865o5071m671L8053P5237o1425k6222M2358
23103b1294L2635m4446M1779J3976j1538M089N2224n2142m3145L5314N3483L5646
23091I6581K164o2250j4049l3948K5350J2604N2938J9105m3751k6311J6643q125
23079C6951m6384P529r991l86M862K2858l1728L880N798K1178O7887n430l8359
23066C8665Q379q2425o7575L2788m5433m1731R7231K3661j03004L7998K2844L3426
$$ y = [383, 12188, 21454, 18108, 32250, 24373, 15761, 11942, 5648, -11212, 32631, 85555, 47846, -3773, -41757, -60798, -81608, -68658, -70587, -17274, -19724, -9952, 1918, 9924, -58045, -64370, 6941, 21627, -26931, -70330, -59382, -47667, -84965, -11572, 4440, -17479, -27727, -46123, -21460, -53704, 24718, 74275, 34312, -19553, -84624, -89295, -51242, 23995, -37430, -63652, -21294, 11341, -33105, 8674, 22650, 11112, 15201, 67425, 15283, -27862, 7452, 60935, 96581, 98745, 36495, 22446, -11502, 13848, 26452, 79390, 98495, 54744, 28433, 45076, 36951, -9433, -1904, -11895, -12281, -7419, 15439, -16289, -12409, -6611, 14567, 82454, 77024, 38665, 47044, -35381, -102956, -70168, -115601, -157332, -60101, -36440, -139444, -101446, -78602, -45176]
23054d5176l3418O4510M628k19M775j5718j1120j9682L0516J0406k6797M0852
23042C557M6052L2917j0247l7537k8288k004k2347l2374m5345m7341M1470M1098
23030f0389l0894j9385J1284l736j506j0715n446k8465N9503O4025j5738P669
23018c3793r490n5101l9684M6467M3211k025N7554M9818L194K3287N999J9274
23006A08711j13588l7861l531J7172l2126k5496L448R7145R032n2262j4549n507
22994d9412r285P0117K5951L369l5993N014j5690P316n245o854Q254o4490k2926
22981h9874O9692K9874J5933n1486n9205J161O8595k6303o241L0615P6022k1783
22969C7000n9038J3904L096j7392K9299K1851J7214J3766j4180m9365l5392k5767
$$ y = [-45176, -78594, -14084, -9456, -9675, -4900, -20618, -31738, -51420, -20904, -10498, -37295, 3557, 49609, 82526, 72279, 34742, 6454, 4450, -17897, -50271, -95616, -142957, -101487, -60389, -91283, -110668, -99384, -103120, -104626, -115341, -120787, -149252, -89749, -25724, -41462, -33793, -43283, -98384, -138068, -91601, -48390, -50415, 7139, 56957, 60151, 83438, 89437, 108711, -4877, -42738, -46269, -29097, -61223, -86719, -83271, 13874, 22906, -29356, -43905, -49412, -58697, 11420, 37371, 40740, 4747, 9761, -5929, 1387, -3858, -10712, -2458, -66948, -89874, -20182, 9692, 25625, -25861, -85066, -83905, -15310, -41613, -47854, -17239, 58783, 37000, -22038, -8134, -5038, -22430, 6869, 28720, 45934, 59700, 45520, -3845, -39237, -65004]
22957f5004K4539j8447l991j5154L5869j337o855L1871m563m853m1517n3193J9758
22944a02877L8991k9192M6786J9876k1276j705L6293j4443J502K6586L5575J2435
22932D8551l1756l1131N211O9947j2200o0189o2477M9632K4117O347j0868j5017
22920a9833K1164l9604K731J6759l2850j7228L2967j1359n3519n788Q296p135
22908a05399Q0205P4938L0696l5773r1686l9456N89M9428K1255L0538L7927k5997
22896B7265o1386j236k5369Q6956Q4853j5653l8150p2886o7720k2324R249K2420
22884g3981N4445K6602N5128P721K7916p4585r7116l2669M2575K1695J04137n0432
22872A1436k1896k668L3506n1196M6570K7716J1982n7112r6831o694N1981K3849
$$ y = [-65004, -40465, -58912, -62903, -78057, -42188, -43525, -50380, -18509, -23072, -27925, -69442, -122635, -102877, -63886, -93078, -46292, -26416, -47692, -49397, -13104, -27547, -26045, 541, 36116, 48551, 16795, -14336, -9125, 60822, 48622, -11567, -74044, -24412, -295, 6052, -4816, -19833, 1331, -38273, -35542, -18783, -51633, -68861, -35894, -47253, -100772, -106560, -98264, -105399, -25194, 49744, 80440, 44667, -47019, -86475, -85886, -36458, -15203, 15335, 53262, 27265, -34121, -35357, -60726, 26230, 111083, 95430, 57280, -15606, -83326, -105650, -96401, -73981, -19536, 7066, 62194, 69915, 97831, 23246, -73870, -106539, -63964, -42269, 61868, 11436, -10460, -13128, 20378, -30818, 15752, 43468, 55450, -1662, -98493, -105187, -53206, -29357]
22860b9357M9533k7960J8858l3440n6385K5247K7944l4658L6679P2753l494m30
22848D5290O850m874j8942M0079J9111o4287o7864J205k9395L5744K2840K7321
22836A3078o4817l9212K0400N1588J9076J1393J7111M5906J3505j945n8872n1065
22824b3854n7287l5599N674K782q208L2384M782j0964M5081j4585J9831o335q4682
22811a30980K140O0254J1634L1572n327r976Q1879K0476n1446k3312l6682K0461
22799b9307n6923m5614M6087M1826N8690M1954p990l5623k5684l4206R747m7148
22787h4191k1069J6186L7567L4620j680j2838k8587M1292J3511n1611N3628R483
22775F311K1266L481l3161k8741m051J0467K6811k53L7464j7829Q985j1957n945
$$ y = [-29357, 20176, -7784, 11074, -22366, -78751, -53504, -25560, -60218, -23539, 49214, 45720, 45290, 52140, 47266, 28324, 68403, 87514, 23227, -44637, -43432, -72827, -37083, -14243, 13078, -51739, -90951, -70551, -18963, 113, 11506, 28617, 74523, 88028, 86083, 27211, -23854, -81141, -116740, -111066, -108284, -116492, -84108, -79326, -90290, -45209, -59794, -39963, -46298, -130980, -128840, -68586, -56952, -25380, -30707, -40683, 41196, 61672, 10226, -13086, -49768, -29307, -86230, -131844, -85757, -43931, 14759, 56713, 48723, 13100, -12584, -46790, -37043, -84191, -105260, -89074, -51507, -16887, -18567, -31405, -59992, -18700, -5189, -56800, -3172, 6311, 27577, 31058, -2103, -30844, -34895, -24428, 2383, 2130, 39594, 21765, 30750, 18793, 12848]
22762A2848o446p686p7160o6597P3785N1858j2128j4381P50m198k0687q4803N2042
22749a02803R6569j3721m5304j1001R670M227M9689j7183k34k6297L683J07990
22737E5285m897m5522N423j6516m2159L617k5040J711K1487J841k0880j6445k341
22724h4436J7610R381M6666J3749M99M6493r731j3351O300K419j9010o587l1846
22711b1844L03k7630p2477M7788K7297P8144J6307k6390p7095J1211Q3662M3148
22699H2424m425l4045L1018l6824n2797K5292J8803j9758L6541M524r656j9106
22687B1991j2209J5354J4391o1437j1710K8807K6852j0026j514Q1380k9360p2151
22675i632m6203m2199k9460O4451L7965L9571k4461L4745k1601k6269k1091o040
$$ y = [12848, 6402, -1284, -78444, -145041, -71256, -19398, -31526, -45907, -45157, -49355, -70042, -154845, -102803, -6234, -19955, -65259, -76260, -66590, -62363, -12674, -29857, -30091, -56388, -52705, 55285, 50388, 4866, 10289, -6227, -48386, -44769, -69809, -68098, -46611, -44770, -65650, -82095, -84436, -66826, -57445, -10779, 2970, 3469, 49962, 40231, 26880, 33180, 35599, 16589, 10002, -21844, -21541, -49171, -121648, -73860, -46563, 31581, 47888, 21498, -55597, -44386, 39276, 82424, 77999, 43954, 74972, 38148, -14649, 10643, 29446, 9688, 46229, 50753, 41097, 21991, 9782, 25136, 39527, -21910, -33620, -4813, 22039, 12013, 10499, 91879, 62519, -9632, -55835, -98034, -127494, -63043, -25078, 14493, -9968, 24777, 3176, -23093, -44184, -50224]
22663e0224r272j4226J0113L5245j0758j3635k1424p082K4051j5235O374M9697
22651a6376J2276k727K8943r91k4475N9842m5578r1267k4740l0821L3429P2795
22639b9690M6769J3424j1576n0264J6140J7918r7377k0461N777m531K2115N7956
22627c3800N9899l6541J5960P865j7366j7424p352m8360m0166L5858N8853j0836
22615c3410m7277M7978p327K1735J186p100J3331m7355p628j3472K6361J8608
22603c4370j0805j636P8001O911k061j6394N0025j2696j1996p1380m1191J8406
22591d9186p890L5675q264l345k1985m9024J3570N4006l4917J6033n397l5736
22579i6460p699R507J4671O6106M2078P6805j7936q8188r4827j9515m850L065
$$ y = [-50224, -59496, -73722, -63609, -28364, -39122, -52757, -74181, -81263, -57212, -72447, -66073, -16376, -4100, -6827, 22116, 21125, -3350, 56492, 10914, -80353, -105093, -135914, -102485, -29690, 17079, 30503, 18927, -31337, -15197, 2721, -94656, -115117, -109340, -113871, -91756, -33800, 26099, -10442, 5518, 13383, -3983, -21407, -28759, -77119, -117285, -81427, -22574, -33410, -80687, -32709, -40036, -18301, -17115, -24215, -10884, -58239, -65867, -79339, -52978, -34370, -45175, -46811, 31190, 38101, 36040, 19646, 69671, 56975, 44979, -26401, -67592, -49186, -57076, -21401, -29665, -33010, -54995, -104019, -90449, -36443, -71360, -55327, -60724, -96460, -104159, -94652, -79981, -13875, 28203, 105008, 87072, -1116, -95943, -115458, -120308, -117243]
22567a17243J8692P7559j8166q3833j3929J1297M3259K9358K2342O6791k0077
22556A6050l5470l692j1445j1879m0280q895P4639J5251m6088q803N8646L8117
22544C6151O77n4396k3618N98K2011Q2813J53983J47019J01456O5769L924r3570
22532D42817j70235j20111l9855o4749j0743j2662K0370q421m0766m9084k7620
22521h1059k6531K559J3896N4833O4552O898m1111M1368O1509m3153j39945j933
22509h8117M2443M7391K7005j3546K4450K9569l9468p9353n5340K1762K5071N901
22497e2232k8586J3159P2824K0085M2241m5384o1675l104q6970k9489Q7986N1257
22485a9888R696m3366J0176l0649L1603J5331j2312m948N0280L6223o9929k3738
$$ y = [-117243, -98551, -20992, -39158, -122991, -136920, -125623, -82364, -53006, -30664, 36127, 16050, -19420, -23112, -34557, -46436, -86716, -95611, -20972, -5721, -51809, -60612, -1966, 36151, 36828, -17568, -41186, -40588, -18577, 64236, 218219, 365238, 466694, 532463, 536387, 442817, 272582, 152471, 112616, 47867, 37124, 24462, 44832, 36411, -4355, -53439, -81059, -107590, -105031, -91135, -36302, 28250, 35148, -5963, 35405, 96914, 53761, -86184, -88117, -45674, 1717, 28722, 15176, 39626, 69195, 29727, -49626, -104966, -83204, -58133, -52232, -80818, -67659, 5165, 25250, 67491, 22107, -39568, -42672, -129642, -159131, -71145, -19888, -10192, -53558, -43382, -74031, -42428, -27097, -39409, -44357, 5923, 42146, -27783, -51521]
22473e1521P61K7022m594J5599k3989m6885N053m901k7131j9390J3509J5327j0901
22460a12041k1665k467Q320j2847J8738N9561J8484R888j5946m6649l2704M9463
22448g9865P6993L342K5439O9399o2479K3095k701o9882m9428Q0058L7519M120
22436E5610j1848l2933r561P78R358k694M508q0815n2575m752K7269j4230L5456
22423g6429M7338m593O6322L5089K6522l5096n2736n5357o014Q637k1182m1047
22411a08546L074L7593J6386K5392j6152k6256k3524O1591J02335r518l5872n2945
22399b6442k3363K4902j4582j2431k0464L169J2154o7536q9319M7260M1568R728
22387a15356K4406L490L404L6559N9632P2323n8171m2726j0196M2573k3273k5417
$$ y = [-51521, -50760, -23738, -28332, -12733, -36722, -83607, -78554, -83455, -110586, -129976, -116467, -101140, -112041, -133706, -136173, -127853, -140700, -121962, -62401, -43917, -34029, -49975, -96624, -129328, -79865, -2872, 470, 25909, 95308, 32829, 55924, 53223, -16659, -66087, 13971, 51490, 55610, 43762, 10829, 1268, 2046, 11404, 8710, 13218, -67597, -120172, -124924, -97655, -111885, -76429, -29091, -33684, 32638, 67727, 94249, 59153, 6417, -48940, -54954, -46317, -67499, -108546, -105472, -67879, -51493, -26101, -42253, -68509, -92033, -30442, 71893, 62375, 26503, -26442, -49805, -24903, -39485, -51916, -72380, -69211, -57057, -124593, -213912, -166652, -125084, -115356, -90950, -87460, -84056, -47497, 12135, 84458, 26287, -16439, -26635, 15938, -7335, -32752]
22375c2752k3004K9559N313j2496j02425m9094N1811L7576K312K5086q3J0821
22363e7376k3768p204O3420L6141M2050R827j473L1734q6263o7850K0943O0180
22351B0361J2446J989j7134r517O465j5253n8670l4216N4841K987j249p713l470
22338d8133L9495N1408M7260R6090Q8937q2244l1413o6149p0233k661M7925L9512
22326A09794k1483o2865Q90k581k9871k0465N739O387L4686j678J3510K399J7810
22313E2272o8814l9599n165J2973L1231Q854K20O762j8290K240n379k239j0197
22300c5131l7843M491J7053M8956p1999p2963j3699K0611J9912N5919m6917k2636
22288a34246J933P5185Q0677L3370K2431m3408j03385q67P2433M4843J1242j9959
$$ y = [-32752, -55756, -26197, -20884, -33380, -135805, -184899, -133088, -95512, -93200, -68114, -68197, -57376, -81144, -88348, -24928, 11213, 53263, 63090, 61617, 93351, 7088, -60762, -39819, 20361, 32807, 34796, 17662, 8145, 14610, -643, -59313, -93529, -38688, -35701, -36950, -44663, -48133, -8638, 42770, 90030, 186120, 275057, 192813, 161400, 95251, 25018, 22357, 70282, 109794, 88311, 25446, 26336, 23755, -6116, -26581, -20842, -14455, 20231, 18553, 32063, 34462, 52272, -16542, -56141, -61306, -48333, -17102, -8248, -8028, -1266, -19556, -17316, -22695, -24934, -35131, -72974, -68483, -51430, -2474, -74473, -147436, -161135, -140524, -120612, -64693, -111610, -134246, -132313, -57128, 23549, 56919, 79350, 35942, -67443, -68310, 4123, 48966, 60208, 40249]
22276D0249n5393o4822J0928K5246J9129j2094K1794K2440l7326j4973l7142M4353
22264c7611J9658l651p7201n3943O0143K2129n59k2698l070K1478Q2947P9613
22252H7235j0701l6840n2968l7180l1230K6945j3136J0961N289K6007L1408j4143
22240h353K591N222j5443K6724l349m1364K3333K142j6601p0871k1779L3596k3598
22227a07750J7453M8172J01821k121l2426n2978k5942L1102L3776l277M2168j8601
22215C1397p8246j0188Q854K0136L0037o674M2820R2988J2187j03611k5544J9076
22203C3232k3616k3290o3738k3452L4426L4129K3650k395o095o6484l6411L4678
22191h5366J2191k4791o866J2034K9467L5003O311j8496J3921L4704l5642n4840
$$ y = [40249, -15144, -79966, -69038, -43792, -24663, -36757, -14963, 7477, -29849, -44822, -81964, -37611, -17953, -21604, -98805, -152748, -92605, -70476, -71035, -93733, -96803, -75325, 7622, 87235, 76534, 39694, -13274, -50454, -81684, -54739, -67875, -56914, -51625, -25618, 5790, -8353, -5762, -540, -15983, 10741, 7392, -33972, -10639, -8497, -25098, -95969, -117748, -84152, -107750, -90297, -42125, 59696, 57575, 25149, -27829, -53771, -22669, 11107, 7830, 49998, 31397, -46849, -57037, -48183, -28047, 1990, -4684, 38136, 131124, 143311, 39700, 14156, 33232, 9616, -13674, -77412, -100864, -66438, -32309, -8659, -11054, -17149, -83633, -120044, -85366, -73175, -97966, -104832, -92798, -63331, -28328, -22017, -40513, -26592, 8112, -27530, -82370]
22179h2370K7848P7126L4194l452q728K2196n746l8001n3111l9598m0406J3321
22167i6727k5714N3935J0311j5039L7447N152P512j2333L257O3573J3374o1736
22155a6988K5227m569k5130p2017o138M81m2324j9883N5591Q0449N918l6119l9209
22142i4711j0966P9787L3520l9720n4105L5119Q4363K3763q2586o0955n5625J371
22130a40745Q532R1706O6825O893n9122J9442M0015J2202p482m9301k5215o185
22118d2435m667n5308L6611N0218K5558j7187m5500L3997n1269k3932L1313n619
22106f8220l0013J4882M0365K4617L3481k2617n9698j3767k6683P143N0025J9084
22094c1401R6173N2144J5411p5786l2670J6213j1790k1695k330m952p296K2940
$$ y = [-82370, -54522, 22604, 56798, 53346, 44618, 66814, 61068, 23067, -30044, -69642, -110048, -96727, -122441, -68506, -58195, -73234, -35787, -30635, -23123, -35456, -32199, 31374, 44748, -16988, 8239, 3670, -21460, -93477, -99615, -99134, -141458, -161341, -105750, -25301, -19383, -55502, -94711, -105677, -25890, 7630, -32090, -86195, -51076, 33287, 57050, -25536, -86491, -142116, -140745, -132213, -40507, 26318, 33211, -25911, -6469, 33546, 45748, 38266, -11035, -36250, -42435, -47102, -102410, -65799, -15581, 9977, -7210, -52710, -18713, -69982, -93914, -62601, -68220, -98233, -83351, -42986, -18369, 15112, -7505, -67203, -80970, -107653, -100510, -50485, -31401, 64772, 116916, 132327, 56541, 23871, 40084, 28294, 6599, 4269, -683, -7979, 14961]
22082A4961j1592Q33K9481j1933N4346J1962M4092m3587r1220j5054J6454k0654
22070b1911l5424J886K3924J3143K9440l82k716k4639Q823k215j43K1682N210
22057A6678m8924j8547R100K8850k8735J9627m6396j18071M7722K1264J9177l1204
22045a29459J7881J6361q591L64K224L8109J117l7058m2125n965J0276N8319j603
22032h0150j1172N1181M3122q9575j8226N5816j4297k0830N0594j0346l6958J4839
22020f6002L3826K1460K3607M7166k0502q4976K3069O5444K0769N0740n1057n8096
22008E448q9932m7648J5474L4985K056O088j8702P0863M6497j1298j8356N1132
21996D6607M9861m3420n160l5282l3718n0169K9861J5971J5104K0896k5686q9513
$$ y = [14961, 3369, 4202, 33683, 21750, 76096, 88058, 132150, 88563, -2657, -17711, -1257, -21911, -57335, -55449, -31525, -18382, 11058, 10676, 7960, -16679, -7856, -10071, -10214, 11468, 16678, -32246, -50793, -41693, -12843, -41578, -21951, -68347, -186418, -138696, -117432, -98255, -129459, -111578, -95217, -103808, -103444, -101220, -63111, -61994, -99052, -141177, -147142, -136866, -78547, -80150, -91322, -40141, 2981, -86594, -104820, -49004, -63301, -84131, -33537, -43883, -80841, -66002, -32176, -10716, 12891, 60057, 39555, -45421, -22352, 43092, 63861, 114601, 63544, 5448, -84484, -132132, -116658, -81673, -79617, -73529, -92231, -21368, 25129, 13831, -4525, 46607, 96468, 53048, 47888, 12606, -21112, -71281, -41420, -25449, -10345, 10551, -15135, -104648]
21984a04648q12j0844k9440P5078O3398M0953j2925l2955N592K1513j01906L5569
21972e1427k4465K46P7754L8763J4128j642J190L334L3490l9681k6010q7032K2768
21959c8584K4114K3041L1249N438O8596M7066J5579l2350m6882n1825m6958J6423
21947A4907M058K7459K7146J3066l3144J7144M7785J07768m2175o2483k703M0735
21935A59563J1547K0210N6839N4513M1570n276J18150M7554L7249J09562K91642
21924I43123M42596O61095J034242N52531o59724r75060o63251m29925l18491
21915E87136j33076j51227p5447p8043l3167K1303k8426n5481k6673P500P734
21904D2133J8740N9032M4557k6189r9718n277k1858k3263J403r375j2529k7186
$$ y = [-104648, -105460, -116304, -145744, -70666, -7268, 33685, 20760, -12195, -6603, 14910, -86996, -51427, -75892, -75646, 2108, 40871, 54999, 53357, 54547, 57881, 91371, 51690, 25680, -61352, -38584, -14470, 8571, 39820, 45258, 113854, 160920, 176499, 144149, 97267, 45442, -1516, 14907, 18965, 46424, 73570, 86636, 53492, 70636, 118421, 226189, 184014, 121531, 118828, 159563, 171110, 191320, 248159, 302672, 344242, 338966, 457116, 504670, 541919, 651481, 943123, 1385719, 2046814, 3081056, 3633587, 2973863, 1998803, 1335552, 905627, 587136, 454060, 302833, 227386, 149343, 116176, 137479, 109053, 53572, 26899, 34399, 42133, 60873, 119905, 164462, 138273, 38555, 33278, 11420, -11843, -10440, -19815, -32344, -59530]
21892e9530O1232M8988n436l6684J643o233o6769k4133K483N1902p411J0102L4931
21879E085J7927j5152n2993k2255L3768k4857q798L6858K6308j9399j1502j6384
21867e1394J0438O334M9222o5177j8098k9689m399M3492n898j013n8079n0332
21855a74593N2015M9229M4314k841m4780k0721J5163J043K0987Q7961M726n8112
21843b5609L2658L543m0224m5222K9573M8005J8916J2285k8952N515J7603m7216
21831a9125o2093P913N9159K062Q647O1611N086j5990k0274J8801p016L1987k0257
21818E0511L5670Q957m2928o034k6729J0367N6835K6330k3866p1236j01326k3664
21806a07113N5322M1639j308n9648k6040j5214r291R7778p99K6406n031j6062
$$ y = [-59530, 1702, 50690, 45254, 8570, 10213, 3980, -62789, -86922, -84439, -32537, -39948, -29846, 5085, 23012, 7860, -45133, -67388, -33620, -58477, -67275, -30417, -4109, -23508, -35010, -51394, -40956, -34622, 14600, -50577, -68675, -98364, -102763, -59271, -65169, -66182, -124261, -174593, -122578, -73349, -29035, -31876, -76656, -97377, -82214, -81171, -60184, 27777, 32503, -25609, 7049, 10592, -29632, -74854, -45281, 2724, 21640, 33925, 4973, 10488, 28091, -19125, -81218, -73305, -14146, -12084, -3437, 58174, 63260, 47270, 26996, 45797, 38781, 70768, 50511, 86181, 95138, 52210, 46176, 19447, 29814, 86649, 112979, 89113, 17877, -83449, -107113, -51791, -10152, -11460, -71108, -97148, -112362, -121653, -23875, -24674, 1732, -3299, -19361]
21794a9361j1316k2186Q619q343l364P300p762o3080k6211R0729M5818K4727m5648
21781c0078J3000l1093q5561j3284l9800K5385N5332L9227O1102j5058k0896j0713
21769e2437k4258N8964K9489n1995m1560j2028J3847K8963k4559j266k7284n9561
21757a63685j3556O0382n1567l7739K8179L6828J4981j8472M5742P2875M113m2159
21745f4078K1772Q167K6541L6885p6295m9158R458l4331k4j54l304k6769K7678
21732a23612P4163o519j4457J4012L1895P647K9012j351k2838r595m3278k8124
21720i3045M4487O139L1068N3971N0199k9249k9184k5192J0568l1451o736L535
21708a4890k5330K1962J7378n2522q0346N5927P2235M5383l6146r040L3471K8981
$$ y = [-19361, -30677, -52863, -44244, -52587, -55951, -48651, -56413, -119493, -145704, -54975, -9157, 15570, -30078, -17078, -48171, -133732, -147016, -186816, -161431, -106099, -66872, -5770, -20828, -41724, -52437, -76695, -17731, 11758, -40237, -81797, -93825, -79978, -51015, -75574, -76840, -104124, -163685, -177241, -116859, -168426, -206165, -177986, -141158, -126177, -144649, -98907, -26032, -21919, -64078, -42306, -34139, -7598, 29287, -47008, -96166, -86708, -121039, -121063, -121217, -124521, -151290, -123612, -49449, -55968, -70425, -56413, -24518, -16871, 12141, 10790, -12048, -21643, -64921, -93045, -48558, -42419, -11351, 42620, 92819, 63570, 34386, 9194, 19762, -11689, -18425, -14890, -40220, -18258, -880, -53402, -133748, -77821, -5586, 39797, 3651, -5389, 28082, 57063]
21696E7063L3673K1237k1042l1773K3255o891m2508L6891r871m7964l9070n6416
21684h3416L8156O5299N8106k2314n2201o4989l9334j1217k8198J9699k899J0460
21672a12848j4436l1349K2214J7608p473m4286J2141J9483j0639K3576R614J5584
21660a00811N0570N8498j4116o3342l1435L1517Q1884M7959l1381j5246k9350
21649a5253n5040K0608K7058r0274k9849O4749N727o745M4336P8465O4532J8796
21637A27110p4726l3076m7967l7710L3841L7405J2458J0559n7805o2700m2348
21626a34959N8858K8051O0698P899Q1616K7402r3677j3308K6835L0611k4677o4059
21614h710n5264k0861K4769K9318P8978N9910J4264j7127q7537O606L905k6887
$$ y = [57063, 90736, 111973, 90931, 59158, 82413, 75522, 33014, 69905, 60034, 12070, -27000, -83416, -45260, 20039, 78145, 55831, 3630, -61359, -100693, -111910, -140108, -120409, -123308, -112848, -127284, -158633, -136419, -118811, -126284, -170570, -158429, -138946, -149585, -126009, -116395, -100811, -50241, 8257, -5859, -69201, -100636, -69119, 12765, 60724, 29343, 14097, -15253, -70293, -49685, -22627, -112901, -142750, -78001, -72274, -79019, -34683, 43782, 108314, 127110, 52384, 19308, -28659, -66369, -32528, 4877, 17335, 27894, -29911, -92611, -134959, -76101, -48050, 12648, 20547, 102163, 129565, 35888, 22580, 49415, 80026, 55349, -8710, -63974, -84835, -60066, -30748, 48230, 108140, 122404, 105277, 17740, 24346, 28251, 1364]
21602A364n5695K6922J2242k5065j532K2343L565n6333l1468M9143K9704M5803
21590B0993j4317o0667O7132K0444n4857j7331N7499J5355o6755l9346m2668K1953
21578i2565J6354L229k2381l4681K2265R6225L7187k5043n2267O7081K1194k2283
21566A4315L9877k7465p7698l1915j6319J8784L2527N6161n3107m3805k1316J6519
21554i3442N6769j3327p087j5601L014J870K6009n294N6270l7276j7430R1907
21542D6382K8907Q046r5544M153J6614K610j3574n5884k93r912k9467o170k94
21529a04426N0923K7116L6844J7734k4254K3495l3308m987L5908j6203q5708r295
21517h6161J0865M1319k7410k3906l7181N9793K8298M3801j2352k7598n6888J3237
$$ y = [1364, -54331, -27409, -15167, -40232, -41764, -19421, -15856, -72189, -103657, -54514, -24810, 20993, 6676, -53991, 13141, 33585, -21272, -38603, 18896, 34251, -32504, -71850, -114518, -92565, -76211, -72982, -95363, -130044, -107779, -11554, 25633, 590, -51677, 15404, 36598, 14315, 54192, 26727, -50971, -82886, -99205, -80421, -47894, 8267, -44840, -88645, -109961, -93442, -36673, -50000, -57087, -72688, -69674, -67804, -41795, -47089, 9181, -28095, -45525, 46382, 75289, 83335, -12209, -8056, 8558, 11168, -2406, -58290, -58583, -68495, -97962, -104132, -104426, -53503, -26387, 10457, 28191, 3937, 27432, -5876, -10863, 25045, 8842, -76866, -86161, -75296, -33977, -61387, -85293, -122474, -62681, -34383, 9418, -2934, -30532, -87420, -74183]
21505g4183L8760O028J773J6867J0075m7625n8387n9546M837K3370K4155j5232
21493a29108M9650P5448N2246k2348l9733l5779J5576L5900O600k4120k8901L1358
21481a3211m5759K211N7893m2142k975q03j8225P509j4159n4082m2619O9988K2388
21468g3986k8944L3922J6076j9152J6739j5984L705J6482N621o376J4206O030
21456c1661k9668o875M4545L4168J3288K726K9098k7098J8661L5543p117n0684
21444B4926l3911l3381R407J7928j9604N1234k288m1877q5699j3303M6061M1954
21432c8553K7933J0547J2365k4868j3817j8622k6953k2472M1007K0682L9442K9007
21420C5698o352k5339o1909J4817j8020k2708j5427j2087l8711N1327J977m4532
$$ y = [-74183, -35423, -29395, -27622, -10755, -680, -48305, -106692, -166238, -161401, -138031, -113876, -129108, -79458, -4010, 48236, 25888, -13845, -49624, -34048, 1852, 8452, -15668, -44569, -13211, -58970, -56759, 1134, -41008, -43983, -44786, -63011, -55502, -69661, -123743, -166362, -96374, -73986, -102930, -69008, -52932, -72084, -55345, -71329, -67624, -51142, -45521, -51897, -37691, -31661, -61329, -68204, -23659, 10509, 23797, 26523, 55621, 28523, 47184, 82727, 75610, 24926, -8985, -42366, -32959, -15031, -34635, 16599, 14311, -27566, -113265, -126568, -80507, -38553, -10620, -73, 12292, -12576, -26393, -45015, -71968, -94440, -53433, -32751, 6691, 35698, 29346, 4007, -57902, -43085, -61105, -83813, -99240, -111327, -150038, -98711, -96734, -141266]
21408a41266K0504O4629O9478k7602j7824j513m699j0590J7318O4738N1793p2461
21396A2505m2834O1554l9118n1365P6105N379l3442n4170J7868j5184m8015J7779
21384i2938N2257L3902L6815k9247K653r491k2727K2528K792q589m0236j5134
21372f7415J5239o512K9473J6034Q247j4090L2025N397n8509l9892L2219K6937
21360b0847l098q2966L3965O0038p059L4630k9294j25031k0775J35384K9723j4793
21348a0123j2221p205J9931l1006l7299J3012L7665J9762n7601n2696L1562k6371
21336a12590l0374O7269K8532r647K229K3678l8513l0088M0913J8191K5147r43
21324a6196P307j5123L111j2122R902j7891j1603k1714K0988R802L9586M59K6967
$$ y = [-141266, -120762, -56133, 13345, -14257, -32081, -33594, -38293, -48883, -31565, 33173, 84966, 12505, -30329, 31225, -7893, -59258, 16847, 22226, -11216, -65386, -47518, -62702, -110717, -92938, -40681, -6779, 30036, 789, 3442, -6049, -28776, -6248, -3456, -12045, -52281, -67415, -52176, -58688, -29215, -13181, -4934, -19024, 13001, 18398, -40111, -80003, -47784, -20847, -23945, -106911, -72946, -12908, -19967, 14663, -14631, -139662, -160437, -25053, 4670, -10123, -22344, -29549, -9618, -40624, -77923, -64911, -27246, -7484, -65085, -117781, -86219, -112590, -142964, -75695, -47163, -56810, -54581, -30903, -69416, -99504, -58591, -40400, -15253, -16196, -8889, -24012, -20901, -33023, -23121, -41012, -52615, -74329, -53341, -43539, -3953, -3494, 23473]
21311B3473j5400k7058J0074J4090Q9057o441k6860n2313p0790L5768L1557p191
21299b034j7456m285k8355Q735n037M0071L0186j6660M1528J1611K4869L6736
21287A19909k1599J2877J7393O878J05326J14473Q1921J67321J59085p7111k05537
21276D80936j23069j42356j58140p7991n7092O8854L6310m9842j6949N39l27n841
21264d4968k5096O5127P4769J9819M3687j6256n1810J079O5650K655l8290j8633
21252G7733q975l9796r1807l9830L3982K4240j6359Q781N0748R485l4489k311
21240b8598J7758L1756L9517J8678m8157l4487M2271J9460n3652k8360p041K7442
21228c413P7692L4211j7696m6646O674J4908M2068K8787j1202n7289n2242P319
$$ y = [23473, 8073, -18985, -8911, 5179, 94236, 87795, 60935, 8622, -62168, -26400, 5157, -2034, -19490, -23775, -52130, -43395, -48432, -8361, 21825, 5165, 46693, 58304, 83173, 119909, 98310, 111187, 128580, 135458, 240784, 355257, 437178, 604499, 763584, 686473, 480936, 357867, 215511, 57371, -20620, -77712, -8858, 27452, -22390, -39339, -38800, -39127, -44968, -70064, -4937, 69832, 89651, 133338, 117082, 65272, 66351, 132001, 134656, 96366, 77733, 68758, 28962, -62845, -102675, -68693, -44453, -60812, -52031, -1283, 8202, -26287, -28598, -10840, 20916, 60433, 79111, 30954, -3533, 38738, 58198, 4546, -23814, -30855, -3413, 74279, 108490, 90794, 44148, 50822, 65730, 107798, 136585, 125383, 68094, 15852, 23171]
21216B3171J9083k9410N2801J7116l1670o4538j1783m146j2767m0939k9561L6855
21204g5788J206J7318K0501m8484j8259M4072M8450j5376L3615l497K3304J5024
21192D2086L115l4978p1523J1263K8844q7472l3600L3728N2991L8028J9801J5252
21180A7535l1250o9469j2016M3360K6884l4416l5871J0351k5682K4329K0548N7752
21168g945N4662r807l4320K467M7423o2409o3405K6986J9524k0126P3175m6220
21156a9995k8687j092p328j2834N9939j8766L169L6117J8944J614J529j7523l5556
21143b0469O9912N974l2657j2559J7912l7140l4404j4494k3617j8480J1433J1592
21131g6997K0973P586j1460n4617m6241p455N9549O6923J099l4915N4943P7609
$$ y = [23171, 42254, 12844, 65645, 82761, 51091, -13447, -25230, -29376, -42143, -83082, -112643, -75788, -74582, -57264, -36763, -85247, -103506, -59434, -10984, -26360, 7255, 3758, 27062, 42086, 45201, 10223, -61300, -50037, -21193, -108665, -142265, -108537, -55546, -17518, 2283, 17535, -13715, -83184, -95200, -51840, -24956, -59372, -95243, -84892, -110574, -86245, -65697, -7945, 46717, 36910, 2590, 5057, 52480, -9929, -73334, -46348, -26824, -46950, 26225, -19995, -48682, -49774, -57102, -69936, -9997, -28763, -25594, 10523, 29467, 31081, 32610, 15087, -20469, 49443, 55417, 22760, 10201, 28113, -9027, -43431, -57925, -81542, -100022, -88589, -76997, -56024, -48438, -59898, -114515, -160756, -168211, -108662, -41739, -40640, -75555, -20612, 56997]
21119E6997m2564p5016P4561K5260l9620m7529P0391K7174l5885j8208J2934P2257
21107H0752K0863O664r8042n9971j8940J7402r904J5295L1281n084j7174l143
21095d0001q980M5967J749k9477n585j0302p0371M1709L7453L0450l5870l0097
21083g3355n119r604j31L0646j8402j7825K4255L1352P263j2811J4502L0352L8595
21070C9718o8835p5468M0513N2637r969J6813M1958k4428o1931l4795L6377K6532
21058b0878l0619j2113N859p184J378L3208q147j2084K629j3742l876k7603q713
21045a01885P752q213N7854N5447M4656j0879l4049K3126M799M0336j1962l2635
21033C4347r894K2717j5307j9640k6080L0565L2332l9269m4076j5292k0179P0696
$$ y = [56997, 14433, -60583, 13978, 39238, -382, -47911, 22480, 49654, 13769, -4439, 8495, 80752, 101615, 108279, 10237, -49734, -68674, -51272, -61176, -45881, -14600, -19684, -36858, -40001, -48981, -3014, -1265, -30742, -36327, -46629, -117000, -75291, -37838, -7388, -43258, -73355, -78474, -88078, -88209, -57563, -75965, -93790, -69535, -38183, -30920, -43731, -29229, 1123, 39718, -29117, -104585, -64072, -11435, -21404, -4591, 37367, 12939, -48992, -83787, -47410, -20878, -51497, -63610, -57751, -64935, -63557, -30349, -38496, -50580, -47951, -61693, -65569, -93172, -101885, -94133, -102346, -44492, 10955, 55611, 44732, 10683, 33809, 38608, 78944, 66982, 34347, 24453, 47170, 31863, 12223, -13857, 16708, 49040, 9771, -34305, -49597, -69776, 920]
21021I20J44o0750l7107O3562O0719r778q651J1636M28m7540M5259L7824l4973
21008B1693m849m3289L9372M8813J7501M1488m4407p2242N4896L6227M7990R8221
20996B41414J38241K19443K24243o473k44040k58620j88388q3502l4991K8779
20986C6106M686n160L1481l5750N015q763m7703k7305j6114M4305K0562N695M1229
20973D8284J3515m1957m6765J6484O635J4667L28L6167j6223j9134L0168J2139
20961E4308k4803m1062m561J0264L0502m202N0034l2048n3221j2310o4239J1980
20949g9358j516J9593L31L167l3619m1918l0299L2357P0894Q8147j7414m0453
20937c0088O807L7475p70L7608n4357m5394L2997O2925J2564K1587K3770j125
$$ y = [920, 1064, -59686, -96793, -33231, 27488, 17710, 9059, 20695, 21123, -26417, 18842, 56666, 21693, 16844, -26445, 12927, 61740, 79241, 120729, 76322, 4080, 58976, 95203, 143193, 241414, 379655, 599098, 823341, 816868, 572828, 314208, 125820, 42318, 7327, 36106, 40792, 35632, 67113, 31363, 36378, 27615, -20088, -47393, -63507, -19202, 1360, 7055, 48284, 61799, 19842, -26923, -10439, -3804, 10863, 11191, 47358, 31135, 12001, 42169, 54308, 29505, -11557, -16118, -5854, 24648, 20446, 70480, 38432, -14789, -27099, -91338, -79358, -80874, -61281, -60950, -57783, -91402, -133320, -163619, -131262, -60368, 27779, 10365, -30088, -23281, 14194, 13424, 51032, -3325, -48719, -15722, 47203, 59767, 81354, 105124, 103999]
20925A03999L01j5996O1617L4523k9231l4203m0061J171K0471r210M8847J01415
20913B43643k5639j3807j9708j991O0841R1055K0937k3992l8295J0487J13915
20902D17446J12722Q9698J42033K16863J40647R5164J73795J60703M7931j60418
20892A436584j66346j70325j56285j46411j33932q4220l1702L858N5431k0760
20882E85892R0674J72491J52572R6194J78696K62316J28375p4844j89645j10446
20872A292275j85701k34006k14803j30343q3997m9985q5026m8705m3089N462J7582
20861B39664k6719l8754N2923P6611J36498P8238j18812q4464j16159l7964M7199
20850B08261J4993o866p4101q8476J289Q1045k8452k3869J5693K0556k7829j4491
$$ y = [103999, 104300, 88304, 149921, 184444, 155213, 121010, 80949, 82120, 102591, 93381, 142228, 243643, 218004, 204197, 184489, 182498, 243339, 334394, 355331, 331339, 293044, 303531, 417446, 530168, 619866, 761899, 978762, 1119409, 1214573, 1388368, 1549071, 1597002, 1436584, 1270238, 1099913, 943628, 797217, 663285, 579065, 547363, 551221, 606652, 585892, 676566, 849057, 1001629, 1097823, 1276519, 1538835, 1667210, 1592366, 1402721, 1292275, 1106574, 872568, 657765, 527422, 443425, 393440, 308414, 259709, 216620, 222082, 239664, 212945, 174191, 227114, 303725, 440223, 518461, 399649, 315185, 199026, 161062, 208261, 223254, 216388, 142287, 53811, 55100, 136145, 107693, 83824, 99517, 120073, 92244, 77753]
20838G7753l4470l8326k0511l2268J3199M6315j9878j3359K4041M062q707Q826
20826F677K1407K2901k3873j2125j9894O3111K7505l5294l6967J7426k5439j09922
20814a04487L3784O6523l4950l348k6922r595L6496M8458l4170j8794l661L5175
20802a5491Q8088p760J0807m3630M999L6947K802J4502O5495l1074k2466n8976
20790D4243n6579L3435J9064l1296M3988J3533l3276O676o6392J3317J614k5446
20778c7119k030l083j3433L9833K075k182N827k5124m8634m6522j3319j1503O0751
20765i4463Q9433M0817j0045k2982l525J7212k89j2922j1313k6190J1034K5327
20753B094J444j1234l6542o652M4768j2012l4328Q7195N3804m1790j5950j1626
$$ y = [77753, 43283, 4957, -15554, -47822, -34623, 11692, -8186, -21545, 2496, 6558, -2149, 6677, 28084, 50985, 27112, 14987, -4907, 58204, 85709, 50415, 13448, 30874, 5435, -104487, -70703, -4180, -39130, -42478, -69400, -78995, -42499, 5959, -28211, -47005, -50666, -15491, 72597, 64837, 75644, 32014, 37013, 73960, 76762, 91264, 156759, 125685, 103219, 44243, -12336, 21099, 40163, 8867, 52855, 66388, 33112, 39788, -26604, -13287, -11673, -37119, -39149, -42232, -55665, -15832, -13757, -15939, -10112, -35236, -83870, -130392, -143711, -155214, -94463, -5030, 35787, 25742, 2760, -765, 16447, 16158, 3236, -8077, -34267, -23233, 2094, 3538, -7696, -44238, -50890, -6122, -18134, -52462, 34733, 88537, 46747, 30797, 19171]
20741A9171J5306k5184m9868m4060J0097Q3956J8603m1821j949J3567K8086l9088
20729a3184m735k6513l8940J6310J2507o711M9725M3475j9122l8226K9848l2530
20717b8096r448M6750q477n205J9192N0131Q2514j9431l8604l3869p5989L2557
20705A2025J8450Q7932k8176m1071P0940k7586j12507l8396J6082M3089j6118
20694a5336m2053O766l3278K5061M6578q477l6818j9907q58j3182N253R881L8038
20681c8332O5807O661j2362M883K0788L3737j5471J0538K0382M951K9156K7417
20669A58155l0057o0275m8465M4869M919n8491k3239k4685m939J3464n2721n6016
20657a37481Q7109N5877L1126P025l2631l8048N6896K9167k6652o3261m6745N0134
$$ y = [19171, 34477, 9293, -40575, -84635, -74538, 9418, 28021, -13800, -15749, -2182, 25904, -13184, -17919, -44432, -83372, -67062, -54555, -61266, -11541, 31934, 12812, -25414, 4434, -28096, -37544, 9206, 729, -4476, 14716, 64847, 147361, 127930, 89326, 55457, -20532, 12025, 30475, 118407, 90231, 49160, 120100, 92514, -19993, -58389, -42307, 782, -15336, -57389, -50623, -83901, -58840, -12262, -20739, -57557, -77464, -78322, -91504, -86251, -76370, -38332, 27475, 34136, 21774, 26657, 47445, 81182, 65711, 76249, 96631, 101582, 130738, 158155, 128098, 67823, 19358, 64227, 69146, 10655, -12584, -37269, -42208, -28744, -81465, -137481, -50372, 5505, 36631, 43656, 11025, -27023, 29873, 59040, 32388, -30873, -77618, -27484]
20645b7484K7154j6265L8437M11n5861l159L3869L5264l2320K3355K2315n1952
20633f236k4726l4505J7998R7562J6461j2301l6310l4602O1237M9025Q425p4721
20621B7307M0332k1079o8220J1916J6456J9576n599L2235N2766m423n5860q0305
20609c4898j1730L7742J9431l0293J0065M4910o013n9646J796P3709K3682k8010
20597D0745k7897L7265J9549O1986j7266m894n1954k3737K5809P3649K4087J412
20585A58754N4122L4735r496M4171l640J0773K1450L2088K5334m3059m6716L98
20573B78914L429p135m9432J4832K1225n3939o5425j1319M1894n4813r5690o228
20561A6313P9782L6056j4446K679n0856p6391o3876n358M2210M1471q6N1004j2558
$$ y = [-27484, -330, -16595, 21842, 22253, -33608, -36767, -2898, 32366, 46, 23401, 45716, -6236, -30962, -65467, -47469, 50093, 66554, 54253, 17943, -16659, 44578, 93603, 102028, 27307, 67639, 46560, -21660, -9744, 6712, 26288, 20689, 52924, 105690, 101267, 45407, -34898, -46628, -8886, 10545, -19748, -9683, 35227, 29214, -30432, -28636, 45073, 68755, 40745, 12848, 50113, 69662, 131648, 114382, 109488, 57534, 33797, 59606, 133255, 157342, 158754, 212876, 247611, 238115, 282286, 278646, 289419, 310869, 342957, 368291, 325232, 278516, 278914, 282343, 275208, 225776, 240608, 261833, 207894, 142469, 131150, 173044, 118231, 22541, 16313, 96095, 132151, 117705, 120384, 69528, -6863, -70739, -76097, -33887, 7584, 7498, 58502, 45944]
20548D5944m3920K4041J241p749j5066p3934J6327O065Q270R8658j594K2472J924
20535H2679k1322q873j5408L5660N7173K694n4090l1323L23j6212M0893M6666
20523A18860J8819J6536j6940o8404j5251J3572l22j2476q655l3107k1360P5783
20511F7055k332L4581Q5652J0278m2273K9132J6391r697L5181k1952K6369k5723
20499B02662J3330N242j6391o1654o4789k593L1886n969N502Q9121J4689l5413
20487A75623L2387L6210l1244r175O2035R1116P8632L4522L62K2008K4521q09
20475E16188l9083J0274J0083n0735k5607q2271j9360L9835j7765J0265k4671
20464C27153M5938O2302J2622J8690L0600J0243K9537Q7059O3355N5230J04486
$$ y = [45944, 2024, 26065, 27306, 19557, 4491, -69443, -53116, -47051, -38781, 59877, 58283, 80755, 82679, 61357, 52484, 37076, 72736, 129909, 132603, 78513, 47190, 47513, 31301, 72194, 118860, 137679, 154215, 137275, 68871, 53620, 67192, 66870, 54394, 45739, 12632, -8728, 67055, 64723, 99304, 184956, 195234, 152961, 182093, 198484, 188787, 223968, 202016, 228385, 202662, 215992, 221234, 204843, 143189, 78400, 75807, 107693, 101724, 107226, 196347, 211036, 175623, 208010, 244220, 212976, 203801, 265836, 356952, 435584, 470106, 470468, 492476, 516997, 516188, 477105, 487379, 497462, 446727, 421120, 338849, 319489, 359324, 341559, 351824, 327153, 373091, 435393, 448015, 466705, 497305, 507548, 537085, 624144, 687499, 742729, 847215]
20453H47215J13809m42q434Q5804O3087N95j36832o1760J05208J1635j90269k18503
20441F11113j67348q4748o0646m1941k6919r923o0467J2344R894k894l8833p210
20429A32422j8371J01820O4147M6651L5434M8900O1033J48j8771k7305k515L8378
20417D61971l5287k270K298J8717K3351K1343L3740Q0745M5141M3075N1443M496
20405G48763j163L2534Q6125M6918j6125M2161J44967M4929k6205m1434m7305
20394A014165o0575l2468L2647l6134j8163P6267J41253J32806Q0373Q1684J14723
20383A526578Q2537R3761O7013Q8413J41841J82488J16379J14885J81884K10749
20373B806528J00024R2245J79640K13862K01828J65567K19958M06994M12821M10010
$$ y = [847215, 961024, 960582, 952148, 1037952, 1101039, 1101634, 964802, 903042, 1008250, 1019885, 829616, 611113, 443765, 359017, 298371, 256430, 229511, 219588, 159121, 171465, 181359, 178465, 139632, 132422, 114051, 215871, 280018, 326669, 362103, 411003, 472036, 472184, 453413, 426108, 423593, 461971, 426684, 424414, 426712, 445429, 468780, 490123, 523863, 604608, 649749, 692824, 744267, 748763, 747600, 780134, 866259, 913177, 897052, 939213, 1084180, 1129109, 1102904, 1061470, 1014165, 953590, 921122, 953769, 917635, 899472, 975739, 1116992, 1249798, 1330171, 1411855, 1526578, 1609115, 1702876, 1769889, 1858302, 2000143, 2182631, 2299010, 2413895, 2595779, 2806528, 2906552, 2998797, 3178437, 3392299, 3594127, 3759694, 3979652, 4386646, 4799467, 5209477]
20363E209477L75828M10190N69683P06706Q65950J080737J156785J154470J465653
20354A2995479J798878J669118J448141J731157K074396K205793K136280K248582
20346B8307824K531966K600744K682562K654336K414551K290437K627158K886355
20338D8995933K574782K354738K867946L663813M462165N238545O265232P763200
20330H4186354J0188856J3786978J9139188K7781009M2971501O5361120P9308380
20323C42723386N4833198K9361415N7460548Q6647941J5199728q4574814p5752443
20316D25898959l7187715m8216752q0418443p4925031n1325230l3130989k2388562
20309G8306237j5809169j1297409q334326o499050m891500l561792k661938k153339
$$ y = [5209477, 5585305, 5995495, 6565178, 7271884, 8137834, 9218571, 10375356, 11529826, 12995479, 14794357, 16463475, 17911616, 19642773, 21717169, 23922962, 26059242, 28307824, 30839790, 33440534, 36123096, 38777432, 41191983, 43482420, 46109578, 48995933, 51570715, 53925453, 56793399, 60457212, 64919377, 70157922, 76423154, 84186354, 94375210, 108162188, 127301376, 155082385, 198053886, 263415006, 342723386, 397556584, 426917999, 484378547, 571026488, 586226216, 501651402, 425898959, 388711244, 340494492, 260076049, 185151018, 133825788, 100694799, 78306237, 62497068, 51199659, 42865333, 36366283, 31474783, 27912991, 25251053, 23097714]
20301B3097714j823461j280190p94103r15237j315882j109354r55912j084758
20293A3818817j128752p81028n51304n10302m74675l32571j98706j02011m25571
20284I313897q50952p43780n03225n50241o26894n98623m83725l21784k56748
20275D377925k21497k26988r5832q5534k12485j63146p1795k8110j54460j48652
20265B969426j26075j65822j48564j18207j11874p2366n7853q3307q2723j03336
20255A899299n9977n7620k8486k2730r9985k8271N1741J0642r1896r6180n4248
20244A422289p8203k4776j3488o7813n2675o4570K8071j5924k8850Q36K376Q2470
20232A189743m9238n6804K121k2480N5657N0701r8876r0418j8824M1111j0168
$$ y = [23097714, 21274253, 19994063, 19199960, 18284723, 16968841, 15859487, 14903575, 13818817, 12690065, 11909037, 11357733, 10847431, 10372756, 10040185, 9841479, 9739468, 9313897, 8462945, 7719165, 7215940, 6665699, 6038805, 5440182, 4956457, 4634673, 4377925, 4156428, 3929440, 3833608, 3748074, 3535589, 3372443, 3300648, 3272538, 3118078, 2969426, 2843351, 2677529, 2528965, 2410758, 2298884, 2226518, 2168665, 2085358, 2002635, 1899299, 1839322, 1781702, 1753216, 1730486, 1630501, 1602230, 1653971, 1664613, 1572717, 1476537, 1422289, 1344086, 1319310, 1305822, 1238009, 1185334, 1120764, 1148835, 1132911, 1104061, 1104897, 1107273, 1189743, 1140505, 1083701, 1085822, 1063342, 1118999, 1169700, 1070824, 980406, 961582, 1002693, 992525]
20221I92525l9595l0572O0899J09189J3829j25212j9116M809j4608l5188l22K8562
20209I45200K3186L9385K1632m0122l6073m1753n7446q8423k764j7922m156r1077
20197F49667j13954j27095j66374l8689l4562m2493l2795j11450l1015L0536M9070
20186C0846N349O2525Q8699O8686O2845J22166M2394Q305P3157J3113L2910N9616
20174F70611J4733j938o602p4941m8235m4485k6514q250O8989L3270O0142N6581
20162F93361O3029j8029m6570p9243p7580o2619n3163m2072l2446K6111m423l4903
20150C31453n1178J2388J3654J8473j129K8267K473J7967J2114K4942N930P8715
20138D94069J4503M4158J08640N9720R3262O61j09372j35030n1773p478j2772
$$ y = [992525, 952930, 922358, 983257, 1092446, 1106275, 981063, 961947, 966756, 952148, 916960, 916638, 945200, 968386, 1007771, 1029403, 989281, 953208, 911455, 854009, 765586, 762822, 744900, 740744, 649667, 535713, 408618, 242244, 203555, 168993, 126500, 93705, -17745, -48760, -18224, 30846, 36195, 98720, 187419, 256105, 318950, 441116, 483510, 491815, 564972, 578085, 610995, 670611, 685344, 683406, 676804, 601863, 553628, 509143, 482629, 474379, 543368, 576638, 636780, 693361, 756390, 738361, 691791, 612548, 534968, 472349, 419186, 377114, 344668, 370779, 366356, 331453, 280275, 292663, 306317, 324790, 323661, 351928, 354401, 372368, 384482, 409424, 415354, 494069, 508572, 552730, 661370, 721090, 814352, 815013, 705641, 570611, 518838, 511360, 498588]
20127D98588j1733p4999k9247p501K2528J962p4325p3610L8919K6265q239J0076
20115C18684K2869J4017p2512l7095k1253M5201Q416j8184K6361q945m8852K5720
20103B54427Q6513j898J2168j0002Q630l337l0296l2513L6259J7600r264K365
20091C30652j6566m7190k2924L8706L4908J9922m6268K2709N4353p663l9118J631
20079C23152k9365L6013R6221M3864o8254k6552Q7925N5061M1596J2375L5510
20068F07546N233M7589k5532m9058j14449l8399l5941p4533n9003K1131q423n429
20056B70732l8925q228P0268k4912o8638n0558K0698R5730K2146o1351R702J071
20044B37735m43k4010l0946j6432P6354J5769k9403K0591R1288L1692K395l7940
$$ y = [498588, 486855, 411856, 382609, 375108, 397636, 399598, 325273, 251663, 290582, 316847, 308608, 318684, 341553, 355570, 283058, 245963, 224710, 269911, 278327, 260143, 286504, 277559, 228707, 254427, 340940, 339042, 351210, 341208, 349838, 346501, 316205, 283692, 319951, 337551, 328287, 330652, 314086, 266896, 243972, 282678, 317586, 337508, 291240, 313949, 368302, 360639, 321521, 323152, 293787, 329800, 426021, 469885, 401631, 375079, 463004, 518065, 559661, 572036, 607546, 612779, 660368, 634836, 585778, 471329, 432930, 396989, 322456, 263453, 284584, 276161, 270732, 231807, 223579, 293847, 268935, 200297, 149739, 170437, 266167, 288313, 226962, 236664, 237735, 237292, 213282, 182336, 165904, 242258, 258027, 228624, 249215, 340503, 372195, 374590, 336650]
20032C36650o6402m3008n1618o6349j5879K8315K2556L5038J8083n3395Q926l0707
20020A22210L9659O9078J1750r317j2029o3302m6440N2908O9123m409n9183k4639
20008A45409K9580J811k9249o8026j3445p401K7435j101L5508J3702k2232l0540
19996H1451j880M7340O3937k7597M788R477Q62j4275m9127k5477l0957l999J2976
19983F7519K8081l8428j2164M2985L5269q356k0652k5976o3381k7575M1070O84
19971A9076K046M1233K9488J4664j0812M502m3356l5354l977N9108M4756l954
19959A17420L0584J5808l444l5883m6524R627L6455J9006M904l5117o924k5440
19947H0472j1038l103k9486J3794k3291n9504M0000N3976N8189K3202m5145j1442
$$ y = [336650, 270248, 227240, 175622, 109273, 93394, 121709, 144265, 179303, 197386, 143991, 152917, 122210, 161869, 230947, 242697, 233380, 221351, 158049, 111609, 164517, 233640, 229231, 170048, 145409, 174989, 176800, 147551, 79525, 66080, 58679, 86114, 85013, 120521, 134223, 111991, 81451, 79571, 126911, 190848, 163251, 168039, 177516, 178378, 164103, 114976, 89499, 58542, 54543, 67519, 95600, 57172, 45008, 87993, 123262, 114906, 94254, 68278, 4897, -22678, 18392, 19076, 21122, 62355, 91843, 106507, 95695, 100197, 56841, 21487, 17510, 76618, 121374, 117420, 148004, 163812, 160368, 124485, 77961, 87588, 124043, 143049, 147953, 112836, 105912, 80472, 69434, 66331, 36845, 50639, 27348, -32156, 7844, 61820, 120009, 143211, 98066, 86624]
19935H6624k4330m40l0510l7800M6449L7851l479l7561j1399Q9146M851L471J4637
19922A37510p316j3075j0338k4855J295l3321j8986M1277J8522k7618j415P5976
19910A37656k9112k0454r033j4627P4302L0596m1629m0423J023N9594m3758k8328
19898G5807R460j4196k2420J0167r8895m2793J07585J343L126P0370L3458K1415
19886A54427K1390j9992k721p1643k4570j1705k3503m647J1103r905n6468J3146
19874b5088N3074N0184J0559j183j106n0206l323j1241O2919j7058o4673k5379
19862b2521M3706J0824j0059J00413J3195o9139J357n1038j6751K1055j8127N4942
19850E7857N4184Q220l626j7892J8353k7952L922l7179J1049L3128L9913R848
$$ y = [86624, 62294, 61854, 31344, -6456, 39993, 77844, 74365, 36804, 25405, 114551, 119402, 122873, 137510, 130194, 117119, 106781, 81926, 83221, 49900, 30914, 72191, 90713, 63095, 61680, 137656, 108544, 88090, 79057, 64430, 138732, 169328, 127699, 87276, 88299, 147893, 104135, 75807, 85267, 71071, 48651, 58818, -40077, -82870, 24715, 26058, 29184, 99554, 133012, 154427, 175817, 155825, 153104, 81461, 56891, 45186, 21683, 17036, 28139, 18234, -38234, -25088, 27986, 78170, 88729, 87546, 86440, 36234, 32911, 21670, 84589, 67531, 2858, -22521, 21185, 32009, 21950, 122363, 135558, 66419, 67776, 16738, -13, 21042, 2915, 57857, 112041, 120261, 116635, 98743, 117096, 89144, 93066, 55887, 66936, 100064, 139977, 149825]
19838A49825k0790k1537j0084j5216M8988L937o4977j6357N3616J160l2852n8458
19826A7255q146L1133m2780K4808K2240L7006o321m2906K9547O3365k2778J612
19814A04035M4696K4574l6545P133Q111K6172P8724K4471Q607j7086J41888K42308
19802F57088J47648j2589r9839j10969p2024L4153N5675J35375J26038m2138j61783
19791F56635j80564O326l4924l0029j8337o6112j3124l2949P6472J18601Q3484
19780E65479J59485J86883J13856r4912j72688r8521j9528R8J26945J36707N3737
19769I57541j01345j63975j18884n0979L3799N7478L7401J13408J06632J62628
19759A033704J97012R4417J65772K39561O7400j64418j66373j31750j09148j56983
$$ y = [149825, 129035, 107498, 97414, 82198, 131186, 135123, 70146, 53789, 107405, 108565, 75713, 17255, 9109, 40242, -2538, 22270, 44510, 81516, 75195, 32289, 61836, 125201, 102423, 104035, 148731, 173305, 136760, 143893, 152004, 178176, 256900, 281371, 289978, 272892, 414780, 657088, 804736, 792147, 692308, 581339, 509315, 543468, 599143, 734518, 860556, 818418, 656635, 476071, 482397, 447473, 417444, 399107, 332995, 319871, 286922, 363394, 481995, 565479, 724964, 911847, 1025703, 930791, 758103, 659582, 640054, 640152, 767097, 903804, 957541, 856196, 692221, 573337, 522358, 556157, 613635, 651036, 764444, 871076, 1033704, 1230716, 1325133, 1490905, 1730466, 1797866, 1633448, 1467075, 1335325, 1226177, 1069194]
19749A069194j61887j26539m654q5851m5642M0554R8048J18199J46767J78727
19739A226916J30808J42262J20330q492j64788j95925r0840j70744j55693j43351
19729F90483j12544o9091n1227N626K2001k0277j2803J5051P9968R141n2128l1593
19717D72607J1077M8448P5346R3429M7653P8174J04631R7760K18033L97484M55606
19706B100248J78854k17275l82589k84581l78J50299L02308L92846Q7003l56392
19696A970343m17754l24319j66509j28759o8159p1644l4004M5124N1430K2689
19686H78438J20344J80624K67394M32850K79648j49828l37312k84897j31956O7107
19676A322412K48802L34854J51509l13086m81575l63455k29966j39730j19972
$$ y = [1069194, 907307, 780768, 776114, 690263, 644621, 685175, 783223, 901422, 1048189, 1226916, 1357724, 1499986, 1620316, 1611824, 1447036, 1251111, 1160271, 989527, 833834, 690483, 577939, 508848, 457621, 463247, 485248, 464971, 452168, 467219, 547187, 556328, 504200, 472607, 483684, 532132, 607478, 700907, 748560, 826734, 931365, 1029125, 1247158, 1644642, 2100248, 2279102, 2061827, 1679238, 1394657, 1394279, 1544578, 1846886, 2239732, 2326735, 1970343, 1552589, 1228270, 1061761, 933002, 864843, 793199, 759195, 804319, 855749, 878438, 998782, 1179406, 1446800, 1879650, 2159298, 2009470, 1672158, 1387261, 1255305, 1322412, 1571214, 1906068, 2057577, 1744491, 1262916, 899461, 669495, 529765, 409793]
19667D09793j55483l8499N7431R5111k0151n1464J0832J3393p3230m3259j7835
19656A86639P8378R896M8979J09424l3672p9010k100r519j9950Q939M9528J13786
19644D61318p7889j57649m4233j4034J6559m5480o3442M7897J5151l8315n386
19633I4497Q6755K4329P130M4893J80222J5873r7149n7588o2240o8350o780J00808
19621B62400J42847r11j16719j27233q4528o4748p6350O5472R9837l4000j9453
19610D6614M0072M213M947L1446L0606l6449R989k0605m1863m0662N0531J9418
19598I8257K0359N1977K8263n1982q0949j8534O1625K9538J1312m8002l5073M018
19586G0809K6863j7160k4742J2521J8703K0714J00267O4878n5126k3758K9357
$$ y = [409793, 254310, 215811, 273242, 368353, 348202, 296738, 307570, 320963, 247733, 204474, 186639, 265017, 274913, 323892, 433316, 399644, 320634, 318534, 309015, 289065, 298004, 347532, 461318, 383429, 225780, 181547, 167513, 184072, 138592, 75150, 123047, 138198, 99883, 94497, 181252, 205581, 212711, 257604, 437826, 453699, 356550, 298962, 236722, 168372, 161592, 262400, 405247, 404336, 287617, 160384, 75856, 11108, -65242, 230, 100067, 66067, 46614, 86686, 90899, 95846, 127292, 157898, 121449, 131438, 110833, 68970, 28308, 78839, 98257, 118616, 170593, 198856, 146874, 65925, 47391, 109016, 138554, 149866, 101864, 66791, 70809, 97672, 80512, 55770, 68291, 86994, 107708, 207975, 272853, 217727, 193969, 223326]
19575B23326P7330M1804R1822J18961K18235K29770J91640j13503k38004j71491
19565F69890o9483K9263J25318K32728J97246j91234k86791j80038j00006p9585
19555C47308q1889L7362N4063L49P487P9208R9027R1906K18813L07971K02264
19544A363869j92392k39855j11639l5874J06091K10789J55165P8149k78634l49658
19534G06011j73333M38L1803n8815j41507j04313K5764J4730K6241Q388m3373
19523B92034k2482J146J9984L8607J5865k8232M7636L2050m5529j04073l7973
19512B09033j7154K0010K116N3964Q4659m3879o0488l8180n544n4731m3041k5872
19500H0893m6693j7763M2634q780o575l1035L6475J3935P0588M3414L7075j4278
$$ y = [223326, 300656, 342460, 434282, 553243, 771478, 1001248, 1192888, 1079385, 841381, 669890, 600407, 629670, 754988, 987716, 1184962, 993728, 706937, 526899, 426893, 347308, 265419, 302781, 356844, 357193, 364680, 443888, 542915, 634821, 853634, 1161605, 1363869, 1171477, 931622, 819983, 784109, 890200, 1100989, 1256154, 1334303, 1055669, 706011, 532678, 533116, 564919, 506104, 364597, 260284, 286048, 300778, 327019, 335407, 292034, 269552, 270698, 290682, 329289, 345154, 316922, 364558, 396608, 351079, 247006, 209033, 191879, 211889, 214005, 267969, 352628, 308749, 248261, 210081, 204537, 149806, 106765, 80893, 34200, 16437, 59071, 50291, 43716, 12681, 49156, 63091, 133679, 177093, 214168, 199890]
19488A99890n7532J5406M1538j535L0248J8440j8908l1855l5889K5545M0658n9228
19476A66778J7538J1180M0840N2p2471l8988O001m6148o8693L7481P8499K093
19464A34162l3233L768m400J03169J8936L4269K1662m4141o8341Q966Q1541P7178
19452C33536K7547o5885k5710k8290r077N814j743j1346j0102m6853l6677m5570
19440H5644j2972P3675j7991l5792n134P715M3576J3208k5790q580N068J9173
19428A41800N7279j8093l7708n5560R681N5245l5390l7687j0750M9145J7587J1623
19416A47172L5336k3180p256j9284J326J2198K4814k804j3926M9231J5416J3070
19404B32113K506j7643L8152q908M0001Q7083L6673o861n5437o5086L0813Q6841
$$ y = [199890, 142358, 157764, 199302, 197767, 228015, 246455, 227547, 195692, 159803, 185348, 226006, 166778, 184316, 195496, 236336, 236388, 163917, 124929, 130930, 84782, 16089, 53570, 132069, 134162, 100929, 104697, 100297, 203466, 222402, 256671, 278333, 234192, 165851, 174817, 256358, 333536, 361083, 295198, 269488, 241198, 232121, 237935, 236192, 224846, 214744, 167891, 131214, 85644, 72672, 146347, 128356, 92564, 87430, 95145, 138721, 151929, 126139, 117559, 122627, 141800, 199079, 180986, 143278, 87718, 97399, 152644, 117254, 79567, 68817, 117962, 135549, 147172, 182508, 159328, 152072, 132788, 134114, 146312, 171126, 168322, 154396, 203627, 219043, 232113, 234619, 216976, 255128, 246220, 286221, 373304, 409977, 403116, 347679, 282593, 313406, 400247]
19392D00247L3932m5299r1564k1464n9709K7928J50253Q5012n2623r1327j03904
19381B31482q152J3559K9019K8402P9181Q1650J6199k7697q4219n0936K0566N9642
19369C88696M7643N319J196l6801r4067j07795K114Q4628O5028o7640p8272q2320
19357A27729m5212J403L4567N2104J04810r46k5748j3998j9725J6121J9359j6529
19345B33935R2135k7277M780K9800M8118n3897o2843J2093L9080K2645Q700j4796
19333C32473m8302N7280J3248Q5723O2288O822m2692j6326Q2215N1612o66K4837
19321F08512l752j635J9059N3405j5349J5969k347M6498J54956Q8000O7901r828
19309A021389K0544Q3313O8556J02664J77268K31763K26858N8359n1338K31Q4880
$$ y = [400247, 434179, 388880, 297316, 275852, 216143, 244071, 394324, 479336, 426713, 335386, 231482, 223330, 236889, 265908, 294310, 373491, 455141, 471340, 443643, 359424, 308488, 329054, 388696, 436339, 441658, 442854, 406053, 311986, 204191, 206305, 290933, 355961, 288321, 210049, 127729, 82517, 83920, 118487, 170591, 275401, 274455, 248707, 234709, 214984, 231105, 250464, 233935, 326070, 298793, 303573, 333373, 381491, 327594, 264751, 276844, 315924, 338569, 347269, 332473, 284171, 341451, 354699, 440422, 502710, 509532, 466840, 450514, 532729, 584341, 583675, 608512, 604760, 603125, 622184, 675589, 660240, 676209, 673862, 720360, 875316, 963316, 1031217, 1021389, 1041933, 1125246, 1193802, 1296466, 1473734, 1705497, 1932355, 1990714, 1939376, 1939607, 2024487]
19298B024487J91883L23219L70575L25035J23416K01357K76594L55703M53916
19289D646185O65923Q20817J030640J201981J374125J328098R94733Q93081J132176
19280A4087759J501770J713181J843310K191201K481732K553830L525611N599512
19272C5497906R093560J6047829K9182466M1948894K1232410k6923385l5911966
19265I0167714j9084056l930060R249773K5866572L9477860J4828900l4914415
19258A21662288m1003454k4035387j1919578n743739k403684k99980N02273R88642
19250C7747381K386018N199476J0429705K0651104L6760938M0256340j829073
19243A51601889l9239493l1366191j3392091N61263J5181423L2879260L4039807
$$ y = [2024487, 2216370, 2539589, 2910164, 3235199, 3358615, 3559972, 3836566, 4192269, 4646185, 5312108, 6132925, 7163565, 8365546, 9739671, 11067769, 12062502, 12955583, 14087759, 15589529, 17302710, 19146020, 21337221, 23818953, 26372783, 29898394, 35497906, 44591466, 60639295, 89821761, 131770655, 153003065, 126079680, 90167714, 71083658, 67153598, 76403371, 102269943, 141747803, 156576703, 121662288, 80658834, 56623447, 44703869, 38960130, 36556446, 36256466, 36758739, 37747381, 40133399, 45332875, 55762580, 76413684, 113174622, 153430962, 151601889, 112362396, 80996205, 67604114, 68165377, 83346800, 116226060, 150265867]
19236A50265867j0705626m5234276l5782671j9772520j0952800o571562m041655
19229A7204757k666535j974697j739987j585442j246768q62824p25314n59807
19221E843383k95106j22575k01886n82190o36013m83260l08313k03178M934M9867
19211C065663j23909k67593k17477k06089j86879q0616l2573M0251P0272J3199
19201B074249j20911j97536k17368j49367j21131q0454o112M510l6724l9594q9547
19190A020015m1988j8092m2024j0641J9282j5399n7139n1931k3764M528l1956
19179G50891l2618p6047m8026O8215j4422o683K3299L9384l2270p8446p8745j8456
19167D96076K7769R9900K3311n6832p9952m3914k7775n1574n881n4235j8602K0126
$$ y = [150265867, 139560241, 94325965, 58543294, 38770774, 27817974, 21246412, 17204757, 14538222, 12563525, 10823538, 9238096, 7991328, 7128504, 6403190, 5843383, 5548277, 5425702, 5223816, 4641626, 4005613, 3522353, 3214040, 3010862, 3015796, 3065663, 2941754, 2674161, 2456684, 2250595, 2063716, 1983100, 1950527, 1990778, 2061050, 2074249, 1953338, 1755802, 1538434, 1389067, 1267936, 1187482, 1181370, 1185880, 1149156, 1109562, 1020015, 978027, 959935, 917911, 907270, 926552, 911153, 854014, 802083, 778319, 782847, 750891, 718273, 642226, 594200, 662415, 647993, 641310, 664609, 703993, 671723, 593277, 514532, 496076, 523845, 623745, 647056, 590224, 510272, 466358, 438583, 387009, 381128, 326893, 308291, 328417]
19155C28417K6550K8237n598L9400K4902L757N773r755N844k9805p7346k2368
19143C18008k4707P3113R4542r5816o6652r4102p2464p585j2814K815M3004J2729
19131A70071l2078J4302j3023L7120J21462M8373M2083J9361J172j24163j48845
19120A35835l8407N0871N7363L5569m4929o1109n4600m5j7346K647L4372K0926
19108A21147k0656q7520l428Q0320K6906J5623N3623n027J0816J4609J4984l6920
19096A84477K1834L1815j6407J3725m3653J485N3171m5080j04442j1371K6226
19085A11780m6159K20L3172J6457n4488j4105L1546P6652k1100r454O282o521
19073A24282M2032M0823m5308j2372J2288m0912k749O8035M9733n9433k0534J0872
$$ y = [328417, 354967, 383204, 377606, 417006, 441908, 445665, 451438, 441683, 447527, 417722, 340376, 318008, 293301, 366414, 460956, 365140, 298488, 204386, 131922, 124337, 111523, 114338, 157342, 170071, 137993, 152295, 139272, 176392, 297854, 346227, 388310, 407671, 408843, 284680, 135835, 97428, 148299, 205662, 241231, 196302, 135193, 80593, 80548, 63202, 65849, 100221, 121147, 100491, 12971, 9543, 89863, 116769, 132392, 186015, 180988, 191804, 206413, 221397, 184477, 206311, 238126, 221719, 235444, 191791, 193276, 246447, 201367, 96925, 85554, 111780, 65621, 65841, 99013, 115470, 60982, 46877, 78423, 155075, 133975, 124521, 130803, 124282, 166314, 207137, 161829, 149457, 161745, 120833, 118084, 186119, 235852, 176419, 155885, 166757]
19061A66757R119p0612K4773Q0987r73L7824j7076M5012o430M0664J77343K59007
19049G46395J33847m5891j11933k8052m7362L437N0463J91116J46679r9031k24379
19038G15289k20122j48308n6979n3598p328J4434n3485m5503r948J0216K3411
19027A68079K4864j5103N0722N5931J06020L8544L7709J20456R8826J51436J34174
19016I71658j7494k22540j35615l9795l5230O796J62159J22722n8901k08398j81746
19005C63616r8772j0998J6047L4217l252n2580K0572L2044j6796j06290j8559
18994A59249M3084O5363l0013o9054o7922m8092l7122L3310Q0l655q717K4490
18982F1001Q1352J2133J7705J865N7144m6676J3799O6042j4653R215n0318q3586
$$ y = [166757, 175876, 105264, 130037, 211024, 210051, 247875, 230799, 275811, 269381, 310045, 487388, 746395, 880242, 834351, 722418, 694366, 647004, 650441, 700904, 892020, 1038699, 939668, 715289, 495167, 346859, 289880, 236282, 228954, 243388, 189903, 144400, 134452, 144668, 168079, 192943, 177840, 228562, 284493, 390513, 429057, 466766, 587222, 686048, 837484, 971658, 954164, 731624, 596009, 556214, 520984, 527780, 689939, 812661, 753760, 545362, 363616, 264844, 253846, 269893, 304110, 300858, 248278, 268850, 300894, 284098, 177808, 159249, 202333, 267696, 237683, 168629, 100707, 52615, 15493, 48803, 48883, 45228, 36511, 61001, 142353, 154486, 172191, 174056, 231200, 184524, 198323, 264365, 249712, 258927, 208609, 125023]
18970A25023l363N7754o640J0060q265j18632p7291l2862R6574K4949J1847j2204
18958F6950j0531o054J6439J235J8507Q3989l0566n0143m8787L7029O0407R10
18946A39385r4202n158P1662J2550k1339M8726K931r643K5517J8703N2653N2612
18934B94397n1453n7737k1688M787k056P716r475K5192m3269j8518p5389j9595
18922C2912J9236K0137J9793L7749M5153K8832j0657p44R525M8432L0265l4289
18910B46344q2561k4090O8530J0137p9705K9607K2983j5352m0681j8484k6048
18899I0680L0945L4304K9101P001o2775o1548J9109K0635K1400J4158J5583J9320
18887A77913k6295p3167j2557K0121k5076Q0160P2519K7344M4653K5212m4070
$$ y = [125023, 121660, 179414, 172774, 182834, 174569, 55937, -21354, -54216, 42358, 67307, 79154, 66950, 56419, 50365, 66804, 68039, 86546, 170535, 139969, 89826, 41039, 78068, 138475, 139385, 45183, 40025, 111687, 124237, 102898, 151624, 154555, 144912, 170429, 189132, 241785, 294397, 242944, 185207, 163519, 168306, 166250, 173966, 164491, 189683, 146414, 127896, 52507, 32912, 52148, 72285, 92078, 129827, 174980, 203812, 193155, 192411, 201936, 250368, 280633, 246344, 163783, 139693, 208223, 218360, 138655, 168262, 191245, 175893, 135212, 116728, 90680, 121625, 155929, 185030, 192031, 129256, 67708, 86817, 107452, 128852, 143010, 158593, 177913, 151618, 78451, 65894, 86015, 60939, 141099, 213618, 240962, 285615, 310827, 266757]
18876B66757J8881O2713j6161O7352P2388P1778K4800J4747N8132Q4148J76282
18865I01817K06041L71835O78308N00180l23676n67322l70281j00298J08390K83847
18855A688841N37426K91371n46062o70958m18215j59317q3361j41360n7565j1990
18845D28810K5660P6072K5493L45K2432M0962l8148O4150R9303R0558J32478R3183
18833A061298L34824O44310P09075J6147o51512m88602k12629j5357J66576M74581
18823B038711N64542k05288p02265n22189k38854O772k1678n5122j04766j53667
18813F06196j10567l6625J3527l96l3686k8520o8751k6264p588o961k1889n3771
18801B24705L8956N4114J6752P4646J40156J78449J49694j47388k20831j53900
$$ y = [266757, 285638, 348351, 332190, 399542, 471930, 543708, 568508, 583255, 641387, 725535, 901817, 1107858, 1479693, 2158001, 2658181, 2334505, 1767183, 1396902, 1296604, 1404994, 1688841, 2226267, 2517638, 1971576, 1300618, 882403, 723086, 639725, 498365, 440800, 428810, 454470, 530542, 556035, 556380, 578812, 619774, 581626, 645776, 745079, 835637, 968115, 1061298, 1396122, 2040432, 2749507, 2765654, 2114142, 1625540, 1412911, 1397554, 1564130, 2038711, 2603253, 2397965, 1695700, 1173511, 934657, 941429, 919751, 864629, 759863, 606196, 495629, 459004, 472531, 472135, 438449, 409929, 341178, 314914, 307326, 300365, 278476, 224705, 263661, 317775, 334527, 409173, 549329, 727778, 877472, 730084, 509253, 355353]
18791C55353n3347M459m4241j7698P178o609M4928O8280P0088P1816O3736M5289
18779F09232R4842L7379j01493j28130j21252m4116L6662j1693k7120K8809N8995
18768D32115R7674K00917K40655J23121j82533j70155l5118J4467J72216J37284
18758A030643j26529j90066k10660j22605o5797l9510R09j3086K089k1542r703
18747B34143j3015k9011N0863N5190K275P94p468n296p074o9043k7801Q0490R9104
18734C64151L8309O4757J01253J26856K03231J55909O8415j36312j00375K876
18724H89070J16340R7779M6870M2889o4854j85284q4379M3631J1677n9347j06320
18713G48072j04843j17699j732R8613R9952J01006J5509R2883Q5747j08274j17235
$$ y = [355353, 302006, 306465, 262224, 244526, 251704, 245095, 290023, 358303, 428391, 500207, 563943, 609232, 704074, 741453, 639960, 511830, 390578, 346462, 383124, 371431, 344311, 373120, 432115, 529789, 730706, 971361, 1094482, 911949, 741794, 706676, 721143, 893359, 1030643, 904114, 714048, 503388, 380783, 314986, 275476, 276385, 263299, 265388, 243846, 234143, 221128, 192117, 242980, 298170, 300445, 301239, 293771, 288475, 281401, 212358, 184557, 265047, 364151, 402460, 467217, 568470, 695326, 898557, 1054466, 1122881, 986569, 886194, 889070, 1005410, 1103189, 1150059, 1192948, 1128094, 942810, 858431, 902062, 913739, 854392, 748072, 643229, 525530, 523798, 622411, 722363, 823369, 838878, 931761, 1017508, 909234, 791999]
18702G91999o3201N1934Q0586J25633J91550O4984r1609j65499q6006m8035P9349
18691I31685o3955j24056m8229L4587p0678O678L7223K682j09592j05310k699
18680D88336m7498J394k2118N5199m720q3344n3069K5932N2382m0022k2938K6574
18668C76108K302P6189L0846k9980K9810J40060K09567K35475K85987J60104k50534
18657A265934k46917j54908j23943N9308K15114L00095J34079l59806l46241j70424
18647E72291q9995k2110j3606J817l6832l4585j5015R0402J7416K5932M3024K5413
18635E64152J99N0962M3634Q3248J14262J20413K49125L76084M4776l34766k96299
18624A015790j42860k9903J73949K44702L26671p7529m59750l01116j52838q0984
$$ y = [791999, 728798, 780732, 861318, 986951, 1178501, 1243485, 1151876, 986377, 900371, 852336, 931685, 867730, 743674, 695445, 730032, 659354, 666032, 703255, 705937, 596345, 491035, 488336, 440838, 442232, 420114, 475313, 470593, 387249, 334180, 360112, 412494, 372472, 349534, 376108, 378410, 454599, 485445, 455465, 485275, 625335, 834902, 1070377, 1356364, 1516468, 1265934, 1019017, 864109, 740166, 799474, 1014588, 1314683, 1448762, 1088956, 742715, 572291, 482296, 460186, 446580, 448397, 411565, 376980, 361965, 452367, 469783, 495715, 538739, 564152, 564351, 615313, 658947, 742195, 856457, 976870, 1225995, 1602079, 1646855, 1312089, 1015790, 872930, 843027, 1016976, 1261678, 1588349, 1510820, 1051070, 749954, 597116, 516132]
18614E16132m3762m7354l4820K813k6750N3936J02315k2479L8034l1345l7607
18603D69113n2104k3433Q1835J22011J33608J7728n5735q0209r1439j02674P1617
18592D90318J22761j3368q0957p8661q3415r4080P930J06558M5821l0906j22985
18581B69016m4046K2750j5643P6538J16240K3614o930j5117L5074J2301M5146
18570E18943k4534J215K6322M6469M8729P2090n1401q9461n5157L6953R5205N9117
18558F84490K6245p3452j25326q1195k9765J09455J03996q533p6852m5147J2836
18547D96752J6093M2397K0018J06631J78147J80598J49881Q521j42028j82213
18537H74797p9330j10617l9481J5630j3495l1778j86k7778J1114J9626j6180o615
$$ y = [516132, 472370, 425016, 390196, 393009, 366259, 420195, 522510, 500031, 538065, 506720, 469113, 417009, 393576, 475411, 597422, 731030, 748758, 693023, 612814, 521375, 418701, 490318, 613079, 599711, 518754, 440093, 356678, 262598, 270528, 377086, 422907, 392001, 269016, 224970, 247720, 232077, 308615, 424855, 448469, 441539, 426422, 461496, 473797, 518943, 494409, 495624, 521946, 568415, 617144, 689234, 637833, 548372, 493215, 530168, 625373, 684490, 710735, 637283, 511957, 430762, 400997, 510452, 614448, 605915, 529063, 483916, 496752, 512845, 555242, 575260, 681891, 860038, 1040636, 1190517, 1199038, 1057010, 874797, 795467, 684850, 645369, 660999, 647504, 615726, 615540, 587762, 598876, 618502, 602322, 595707]
18525E95707N091Q1739J50618J60197J05551M3158J398r254k0629m7888l8963
18514A026725n362l0408l1175j2789O110L6081J03866J98667J39396J54402J18540
18503A704053j08107p5943j2011O5757J32388J06988J96557K97137R4548l3365
18493B368002J7655J50886K18492K78621L91995M54176L47919L90955N98295O28226
18483E845222M65452N94732Q73399J087275J443796J945917K053643K108129K238635
18474A8656200K807429L827946N335616Q166395J3957136K5273710M0909874L2754113
18466A51688419j9882535l8859264k2498131o717539N608024J9297502L5249096
18459A23885572K4396109k9316916m4027514k6864468j3723408p257219m074340
$$ y = [595707, 600798, 682537, 833155, 993352, 1098903, 1142061, 1143459, 1134205, 1113576, 1065688, 1026725, 1021363, 990955, 959780, 946991, 953101, 989182, 1093048, 1291715, 1431111, 1585513, 1704053, 1595946, 1520003, 1507992, 1573749, 1706137, 1813125, 2009682, 2306819, 2401367, 2368002, 2385657, 2536543, 2755035, 3033656, 3425651, 3879827, 4227746, 4618701, 5216996, 5845222, 6310674, 6905406, 7778805, 8866080, 10309876, 12255793, 14309436, 16417565, 18656200, 21463629, 25291575, 30627191, 38793586, 52750722, 78024432, 118934306, 151688419, 131805884, 92946620, 70448489, 63730950, 69338974, 88636476, 123885572, 148281681, 118964765, 74937251, 48072783, 34349375, 27092156, 23017816]
18452B3017816l056736k170606r16756K47942R00849J150518J660946K133827
18444B2967800J805718J690442K664251M242200N991391R543457J7078386L1352343
18436I7335988M8429393K8460705l2947742m3670321k2890974n804726Q036316
18429G6948639K4603404M0337528J7231145l9627815m6289521k7102490j4103967
18422C1996923p856653n048561l904465k863967j915145j257964r81717q07436
18414G361015p14817n61305m68482m42645k11010j12534k49314l16943l48435
18405C935530n46341l74903j91304j97838j81462m8631M6147n4445k77096k31177
18395A878480r3502j53996j50535m0797r0233o8653j24447r2289K1824O8116O5748
$$ y = [23017816, 19961080, 17790474, 16873718, 17121660, 18022509, 19173027, 20833973, 22967800, 24773518, 26463960, 29128211, 33370411, 39361802, 48905259, 65983645, 97335988, 145765381, 174226086, 141278344, 97608023, 74717049, 68912323, 76948639, 101552043, 141889571, 159120716, 119492901, 73203380, 46100890, 31996923, 24140270, 19091709, 15187244, 12323277, 10408132, 9150168, 8168451, 7361015, 6646198, 6084893, 5616411, 5173766, 4962756, 4850222, 4600908, 4283965, 3935530, 3389189, 3014286, 2822982, 2625144, 2443682, 2395051, 2441198, 2386753, 2109657, 1878480, 1784978, 1630982, 1480447, 1439650, 1349417, 1280764, 1156317, 1064028, 1085852, 1153968, 1219716]
18384A219716P1127l9189j66073j63328q4673n3476O669P1125L3155n3148j46248
18373F95657p3742p4372O278L8445J2202q0401l5081P7525M3083J5112n5690n1389
18361E17627k4773n606M1160J980J9537k0417n2485m4175l1997J9088O3770k5757
18349D57952k3146K2969r063j4097o7598j01541o8693K4678J02662R4001M7303
18338D65427p5259j20467l1978n0658j2148O0920P4532l4025l7621n3499l6287
18327A48937L9192K3450j9015Q0935J7396R240Q603K0790M7591L2640J0188j8464
18315D01483q169m4175l2691m2852j48167l5334J15993O9481l2083n7654q9025
18304I6807j01583K5019J11851N3991m0701k9188n8598j2412L3501O2316k0841
$$ y = [1219716, 1290843, 1251654, 1085581, 922253, 837580, 784104, 790773, 861898, 895053, 841905, 695657, 621915, 547543, 553821, 592266, 604468, 524067, 488986, 566511, 609594, 624706, 569016, 517627, 492854, 487248, 528408, 530388, 549925, 529508, 477023, 432848, 400851, 419939, 483709, 457952, 434806, 457775, 448712, 434615, 367017, 265476, 196783, 221461, 324123, 418124, 465427, 390168, 269701, 237723, 187065, 174917, 235837, 310369, 276344, 238723, 185224, 148937, 188129, 211579, 192564, 273499, 290895, 300135, 308738, 329528, 377119, 409759, 419947, 401483, 393314, 349139, 316448, 273596, 125429, 90095, 206088, 275569, 243486, 185832, 96807, -4776, 20243, 132094, 186085, 145384, 116196, 57598, 45186, 78687, 141003, 120162]
18293A20162N9701O2284j1118M3495k0605L6457j8237k3434k502k1813k5865m578
18281A93947J7921j915j4806N3009n7336K17l4772n340N4412j1735J8430j4792
18269A97240k1727J8931O4811L1925L1470J8156K038p1424q3339J0907J145J0341
18257B10474k9880n7882j6102l7652M7411O9701p8327l6905J0471M951J7703O8490
18245A72453m373L9390K1194N4203J09597R29O0954N7764Q538o5032p8538k2186
18233C54893O5426K4748k0319j37168r9345r3850m546Q5991L7603k106r1720k8448
18221I1159R565J1018O1930K283K0840J2854J0474k9781j3688j97K1620K247J2935
18208B13259n246K499k1498L1908Q009m57K3002J3790l2693J5177m0396j0437
$$ y = [120162, 179863, 242147, 231029, 274524, 253919, 290376, 272139, 248705, 246203, 224390, 198525, 193947, 211868, 209953, 195147, 248156, 190820, 191037, 156265, 150925, 205337, 193602, 212032, 197240, 175513, 194444, 259255, 291180, 322650, 340806, 342844, 271420, 188081, 198988, 200133, 210474, 180594, 122712, 106610, 68958, 116369, 186070, 107743, 70838, 81309, 86260, 103963, 172453, 168080, 207470, 228664, 282867, 392464, 393393, 454347, 512111, 520649, 455617, 377079, 354893, 420319, 445067, 424748, 287580, 188235, 94385, 89839, 175830, 213433, 211327, 119607, 91159, 100724, 111742, 173672, 175955, 196795, 209649, 220123, 190342, 176654, 176457, 198077, 200324, 213259, 208013, 210512, 189014, 220922, 228931, 228474, 251476, 265266, 232573, 247750, 207354, 196917]
18196A96917K4908j7330M1624K6M6208m1182k1512L8447p2K2558J00498J4634
18184D05724q2350n7263p4930j3503Q280N3636J7221K1578P7127K6578m1582N410
18172C45926J3925l6944q6003J2489J07242M9183k2027l1336l151J352n5853L3317
18160C28120J8068P507K924N2721L0234M3130O0859N3718O0570l4143R078N1105
18148F83891N4144J14548N1975N3036J16808J01609J62272M36665P94357O77678
18138C246983k86767p43886n06670k04571j53508k3337N4590J15051N9457k159
18128A555183J35253J92310J76236K32836K15455K40759L29066M83014N42820
18119D102932O67459J040401J398050K003989K591857K652723L329129N081598
$$ y = [196917, 221825, 204495, 246119, 246145, 292353, 251171, 229659, 268106, 268034, 290592, 391090, 405724, 323374, 266111, 191181, 177678, 185958, 239594, 256815, 278393, 355520, 382098, 340516, 345926, 359851, 322907, 236904, 249393, 356635, 405818, 383791, 352455, 349304, 350656, 294803, 328120, 346188, 353695, 356619, 409340, 439574, 482704, 543563, 597281, 657851, 623708, 632786, 683891, 738035, 852583, 904558, 957594, 1074402, 1176011, 1338283, 1774948, 2569305, 3246983, 2960216, 2216330, 1709660, 1505089, 1351581, 1328244, 1382834, 1497885, 1557342, 1555183, 1690436, 1882746, 2058982, 2291818, 2507273, 2748032, 3077098, 3560112, 4102932, 4770391, 5810792, 7208842, 9212831, 11804688, 14457411, 17786540, 22868138]
18111B2868138P674379J2227068K2915088M1790653L4705979l3880867m7274096
18104F1026342k5588224j2511816o811618m225261k864775j956934j358492j011513
18096D697709o70495m48742l70558k29261j12331j40966j65211j69563q8474j0510
18086B291598J31270L82071N60110J55391o61143o42382l81421k57069j27275
18077A451150o2861q5747j43926j57397n0142L9612m1108r1144p6785n3340n9733
18066F68579j5501J9117P3880L6136k9154j21607m7034o316J21764O7440J03129
18055H70433J23757Q9945m6173j963N9408J00885K69275K67442p570j83764j77407
18044A364268j50578q8551o9430N1688k577o9667j01285m2747n6231l4651j2290
$$ y = [22868138, 30542517, 42769585, 65684673, 107475326, 142181305, 108300438, 61026342, 35438118, 22926302, 16114684, 11889423, 9024648, 7067714, 5709222, 4697709, 4027214, 3578472, 3207914, 2978653, 2866322, 2725356, 2560145, 2390582, 2302108, 2291598, 2422868, 2804939, 3365049, 3520440, 2859297, 2216915, 1835494, 1578425, 1451150, 1388289, 1302542, 1158616, 1001219, 951077, 990689, 949581, 858437, 781652, 728312, 668579, 653078, 672195, 746075, 782211, 753057, 631450, 584416, 578100, 699864, 767304, 870433, 994190, 1084135, 1037962, 1035999, 1095407, 1196292, 1465567, 1733009, 1725439, 1541675, 1364268, 1213690, 1125139, 1055709, 1107397, 1104820, 1035153, 933868, 891121, 834890, 800239, 787949]
18033G87949L8864N7613R0478J26162J14034K53019L53769K28993j68562k19094
18023A663225k05404q9111k2474O69Q223l1535k3578m25j49212j48331r0915k2749
18011H88383O6847J1566O3855L5221Q0830M7791J23847K96744L70590K00103k73176
18000A912601l18274j09428L4664K11809L08957L49124P6438j64781j75214j98840
17990A927056j00981K447R7995J22383m0027J6560m268o1762R5425K53315K66352
17979B574495J53220J17036L76189L10274j01262p3976J60780N17959N05232O2797
17969D602744j39260J03265J72785L12873N34054P77283O66112O81152J045740
17960H756748J177080J397187J632835J555958J744471K023464K524912L511821
$$ y = [787949, 826813, 884426, 974904, 1101066, 1215100, 1468119, 1821888, 2050881, 1882319, 1663225, 1457821, 1368710, 1346236, 1346905, 1355128, 1323593, 1300015, 1299590, 1150378, 1002047, 911132, 888383, 955230, 966796, 1030651, 1065872, 1146702, 1194493, 1318340, 1615084, 1985674, 2185777, 1912601, 1594327, 1484899, 1519563, 1731372, 2040329, 2389453, 2465891, 2301110, 2125896, 1927056, 1826075, 1828522, 1926517, 2048900, 2008873, 2025433, 2021165, 1959403, 2054828, 2308143, 2574495, 2727715, 2844751, 3220940, 3531214, 3429952, 3355976, 3516756, 4034715, 4539947, 4602744, 4463484, 4566749, 4739534, 5052407, 5586461, 6363744, 7029856, 7711008, 8756748, 9933828, 11331015, 12963850, 14519808, 16264279, 18287743, 20812655, 24324476]
17952B4324476M974253Q209008J4729749K7940723M9334289M1306452l6630473
17945A34188477n2835883k9841842j5643578q624244m901603k894263j811919
17938A7635145q00836R4747O39654R52956J372362J726046K106907K399560L240452
17929B9366993M809336P195329J1119444J9651843L6034890N2513549R170581
17922A69861965m9743126l8126066j6966370l752958P674207K2740374M2152412
17915A33840438K3386598m2079713m4619105k4416814j3068346p361573m317609
17908B1363876k760037j801104q26175k00364L0816L08735O28952Q95528J297484
17899A8937711J706113K501223L865056N779473R541218J8146991L4192664M5705401
$$ y = [24324476, 29298729, 37507737, 52237486, 80178209, 129512498, 170818950, 134188477, 81352594, 51510752, 35867174, 27242930, 22341327, 19447064, 17635145, 16834309, 16929056, 17568710, 18521666, 19894028, 21620074, 23726981, 26126541, 29366993, 34176329, 41371658, 52491102, 72142945, 108177835, 160691384, 169861965, 120118839, 81992773, 65026403, 61273445, 68947652, 91688026, 133840438, 157227036, 115147323, 70528218, 46111404, 33043058, 25681485, 21363876, 18603839, 16802735, 15976560, 15776196, 15807012, 16115747, 16744699, 17640227, 18937711, 20643824, 23145047, 27010103, 32789576, 42330794, 60477785, 94670449, 140375850]
17891A40375850o808827n0070976l3816048j7265471r417021n573465l907789
17884A3516253k878343k064125j464741r90895o88173n43322k24057k455J37881
17875D798023K12793K595p3638j93900n11146o75810m50854l47471j57052J7791
17865B621331J17890K07285L66236J17571n62817o49973l97011k29571k10618
17856A380323j40285n2179k0857l6171r2306o4741m2739j19738k5643j3309k5506
17845G46849J1768N3574K5711M7101L8199Q7137J0921j51461j17198j9503l1111
17834G01987o6216K6340N3478N0548P065j04162j24568o1992l0089p3751o3811
17823C14829n2489m8156P042K5020o2055m7563l7473K1678O9673M4171K9177J0836
$$ y = [140375850, 133567023, 83496047, 49679999, 32414528, 22997507, 17424042, 13516253, 10637910, 8573785, 7109044, 6118149, 5429976, 4886654, 4662597, 4660142, 4798023, 5010816, 5013411, 4939773, 4745873, 4234727, 3558917, 3108063, 2760592, 2603540, 2621331, 2739221, 2946506, 3312742, 3430313, 2867496, 2217523, 1820512, 1590941, 1380323, 1240038, 1187859, 1167002, 1130831, 1038525, 973784, 931045, 811307, 785664, 772355, 746849, 758617, 812191, 837902, 885003, 923202, 1010339, 1021260, 869799, 752601, 733098, 701987, 635771, 662111, 715589, 766137, 773202, 669040, 544472, 482480, 452391, 378640, 314829, 262340, 214184, 221226, 246246, 184191, 136628, 99155, 120833, 190506, 234677, 263854, 274690]
17811B74690P6168L2709p28n666K409J7555j3805O5008O9182K159j22487o8984
17799C28210k4236k9601m126J177k1111m9516o7064q2513j1448J1528M9501L1648
17787A32449p839m8739p1017O5320Q4028Q5635K1380J6384j3020J7060j6245m4830
17775B20566J573P591j9183j031m094k4565N293m4111j3081R554Q1732M2511q8001
17762A74754j15282q6073L951J3900J7999R1301J18281l7016j5867l9402m9730
17751G6816Q681J2706L5122K1333l649n2103m1688M3426k7727o8368O0327M7092
17739A11968K7243K250l3059o9058m4762L7573P5291L1378l3204n400K8183N965
17727A34368l4933k9005l5052j6466o91K1806O0927o7590m6755n1877m8847K2736
$$ y = [274690, 350858, 383567, 382839, 377173, 379582, 397137, 383332, 448340, 517522, 519681, 397194, 328210, 303974, 274373, 270247, 271424, 250313, 200797, 133733, 51220, 39772, 51300, 100801, 132449, 124610, 75871, 4854, 70174, 154202, 239837, 261217, 277601, 264581, 281641, 265396, 220566, 222139, 229730, 210547, 209516, 205422, 180857, 186150, 142039, 128958, 138512, 220244, 262755, 174754, 59472, -26601, -22650, -8750, 9249, 100550, 218831, 181815, 165948, 126546, 76816, 85497, 98203, 133325, 154658, 151009, 98906, 57218, 100644, 72917, 4549, 64876, 111968, 139211, 141461, 108402, 39344, -5418, 32155, 107446, 138824, 105620, 100220, 128403, 134368, 99435, 70430, 35378, 18912, 18221, 40027, 100954, 33364, -13391, -65268, -114115, -91379]
17715i1379K44l2560J3158P3627j5946O8156N2754L6501j097n187j4212m668K2315
17702A01706N0143J8759k9744J0223p498k7793M7814j79j6229n3512m9314J0598
17690E4974j8988L9160L9869M3191J5543l0483K3707k978l8734m3197m9357m8676
17678a5969M1747J12077P25n8086p035n8378m5885K4519J774M7507M5351m6435
17666D1912m7517j6675J0954N3100k5250j5475N7849R5992O3297M968J01659P5708
17654D00522m543l2973M9359J7327l127M7807n2194p9494k8802n9532j05443o3074
17642H5833o2940j7481J817l1812m1632J7385Q9579J01464N467m5473J5380l577
17630A14010j3308r484j0078r160j1777l5456l2116q3239L1093Q4059K2121J2991
$$ y = [-91379, -91135, -123695, -110537, -36910, -52856, 15300, 68054, 104555, 103458, 98271, 84059, 79391, 101706, 151849, 170608, 140864, 151087, 143589, 115796, 163610, 163431, 147202, 93690, 44376, 54974, 35986, 75146, 115015, 158206, 173749, 143266, 166973, 163995, 125261, 82064, 32707, -15969, 25778, 137855, 138580, 80494, 73459, 15081, -30804, -6285, -4511, 42996, 88347, 41912, -5605, -22280, -11326, 41774, 16524, 1049, 58898, 154890, 218187, 223155, 324814, 400522, 395979, 363006, 412365, 429692, 426565, 474372, 422178, 342684, 313882, 254350, 148907, 85833, 22893, 5412, 7229, -24583, -66215, -48830, 40749, 142213, 147680, 102207, 117587, 114010, 100702, 91218, 81140, 71980, 60203, 24747, -7369, -90608, -59515, 24544, 46665, 59656]
17618E9656k8943j0793K8655M1171m903p54N549O6788o95l1407O155j0042j6192
17605A04245j553m0090m6873j012L7870j4305m3169N2843N6981K2839M881m1046
17593I1611j09496K408M5016q384r173m2419l5145K1015M0854L7024k7360n0157
17581d4206L7637L4815M738J3701j4889J3490k9677n2069j4894K2301O0871M2026
17569G3844N42o8055L135K6132j2707N0261L309l3163r8653M3680P1963J6415
17557G6703m50j1815p624p384m4027o6631m383P5471N2712j8755l0044k5636l3897
17544d5760j8877M665O8824K3082M2988L2538L590K955m4070M4372m3079o1163
17532A0065J6850M1318M3899k0369J633l7441o086l5264k8792M3862J4742m3192
$$ y = [59656, 30713, 19920, 48575, 89746, 84843, 84089, 89638, 156426, 155731, 124324, 130479, 120437, 104245, 102692, 62602, 15729, 14717, 52587, 38282, -4887, 47956, 104937, 127776, 132657, 91611, -17885, -15477, 29539, 21155, 11982, -30437, -65582, -44567, -3713, 33311, 5951, -44206, -6569, 28246, 32984, 46685, 31796, 45286, 15609, -36460, -51354, -29053, 31818, 73844, 74386, 6331, 9466, 35598, 22891, 73152, 76461, 43298, -55355, -11675, 60288, 76703, 76253, 64438, 56814, 49430, 5403, -61228, -65611, 9860, 62572, 43817, 13773, -11863, -45760, -64637, -59972, 8852, 31934, 74922, 107460, 111050, 114005, 69935, 114307, 71228, 10065, 26915, 68233, 112132, 91763, 93396, 55955, 49869, 14605, -14187, 29675, 44417, 1225]
17520A225k670M4875P195O1298K9443n23p6909n9907N844J4849r460K7686k6442
17507A6504q9687M3354L5796O024K1003M8009J4026j0069n8285m3350N1828Q7820
17495A22973K9736O342m9038l2175k3806k2935k0263l5063J4639J4344N82r294
17483c958k5533j117J9812K6184J1317p0613j6030L138K0077J8485l0475p7324
17471a26037M0420L3628K1177k041m7269K519R0028M7253k7802m6955l5140j0599
17459f0818N7016o855O3916M9726n4338m4463M1533J9484l5615j3591M7061L9097
17447A02153j7442l2933n509M6150J23453J93617K07792k5191k12708j56386j09921
17436A13075J9589j274r820k9091l6220j8777n845L9073j2919J9673K2688m4905
$$ y = [1225, -1445, 43430, 50625, 111923, 141366, 140843, 63934, 4027, 9871, 24720, 15260, 42946, 16504, -73183, -29829, 5967, 11991, 32994, 81003, 95029, 84960, 26675, -16675, 35153, 122973, 152709, 159051, 110013, 77838, 54032, 31097, 10834, -24229, -9590, 4754, 5336, -3958, -29491, -30608, -10796, 15388, 26705, -43908, -59938, -56800, -36723, -18238, -48713, -126037, -85617, -51989, -30812, -32853, -80122, -77603, 12425, 59678, 31876, -15079, -50219, -60818, -3802, -10657, 53259, 102985, 48647, 4184, 45717, 65201, 29586, 15995, 63056, 102153, 84711, 51778, 46269, 92419, 215872, 409489, 617281, 592090, 379382, 222996, 113075, 132664, 131390, 121570, 92479, 56259, 37482, 31637, 70710, 57791, 77464, 100152, 55247]
17424E5247l0039K8521J417l4948M2826N8212O9178N2518n1005j6680J4592Q2517
17412B72356J74963K28880J34255j28333k46003j71710k7064m0070L3064j8937
17402B11401p890m3502o1861j9591q663p274J3104M2153L3806k7696k7889Q0267
17390A76365R2778J33958J93582K28851M2332k01000j60892j12351q1870R9036
17380D10789J59290J48150J07383j97929k95830j65180n1403l7572j467o2422
17370A3809P6928J9258k8735O20P207K0192l0240N3820K8584k812o5914K2115
17358A14832P5821J22490K28284J97012o2010k29558k29385n8360k7493k5166
17348A06467j8024J51P502m464n0222q568j9499k1037K2338m6677l6870L7798
$$ y = [55247, 25208, 53729, 55146, 20198, 63024, 121236, 190414, 242932, 191927, 175247, 189839, 272356, 447319, 676199, 810454, 682121, 436118, 264408, 237344, 197274, 230338, 211401, 203511, 160009, 98148, 78557, 69894, 62620, 75724, 117877, 151683, 123987, 96098, 176365, 269143, 403101, 596683, 825534, 867866, 666866, 505974, 393623, 311753, 410789, 570079, 718229, 825612, 627683, 331853, 166673, 115270, 77698, 76231, 13809, 90737, 109995, 81260, 81880, 89087, 109279, 79039, 132859, 161443, 158631, 92717, 114832, 190653, 313143, 541427, 738439, 676429, 446871, 217486, 159126, 131633, 106467, 88443, 88594, 96096, 91632, 41410, 32842, 13343, -7694, 14644, -32033, -68903, -31105]
17336c1105O2770J24001k8891k9411M4247L8511m6825n9872k1932k3724o6835
17325c9066k9087J2715j9175J0395l1806j6072N0037N175n6832L3967J3048J7522
17313d9179k0808j5567l0735M6280L4021L1065L497n4654r0004j9715O7288K4789
17301g3722P2101N1121N5329l4881j3632K9085q5936q8154k0377K0301P2654K2623
17289F512j7505n4063k7801J2805J2735k6502l3242P6727M7737o8686p0138k6163
17277a67584Q6850N8195K2430n7524p341K2779P564j0782m4817K0346M220N6845
17265h819J4213r4074l4482L5678N2014J8431j7234l3821j4778K9304J7466J3364
17253b2738Q405m7911j7616j5466P588j9039j0840J5033M220n2103R866P7512
$$ y = [-31105, 31665, 155666, 126775, 97364, 141611, 180122, 133297, 73425, 51493, 27769, -39066, -68153, -55438, -74613, -64218, -96024, -112096, -62059, -56884, -113716, -79749, -66701, -49179, -69987, -85554, -116289, -70009, -35988, -4923, -1426, -56080, -146084, -165799, -98511, -73722, -1621, 49500, 104829, 69948, 56316, 85401, -535, -88689, -109066, -88765, -16111, 6512, -10993, -65056, -92857, -80052, -67317, -93819, -127061, -50334, -2597, -71283, -141421, -167584, -80734, -22539, -109, -57633, -64974, -42195, -34631, -45413, -90230, -69884, -65664, -8819, 5394, -88680, -123162, -87484, -35470, -17039, -34273, -68094, -82872, -53568, -36102, -22738, -14333, -62244, -79860, -95326, -87738, -106777, -117617, -102584, -98364, -150467, -140601, -63089]
17241f3089J7705K1150J5063K4186o2186J3324J7945n4376n0180j6819J1579J3063
17229a12635r1125l609P2230L9358J7790M76R722L2460Q3557l5800K5935K5723
17217F4082n684j5851k3504j3973m8377m0658l6086K4561N596L583o2850L2075
17205a17086R9076K3329M4884j7601m8196l6611k8020K8665K0497J1337M367J1649
17193c710J3693r448J8028k3291N1195Q2310j6064q8243k5703q319n061O1525
17181D6912j0055m9437J327n096P075j6219k0494j9174P4728M6468q619k7158
17169B0258n1335q856M8210K8041K2379o27l8637r343j2816j2677k4219o2622
17157a02244K1265p950R9727J683k5461J3208Q909k9083p178o6141m7838N4236
$$ y = [-63089, -45384, -24234, -9171, 15015, -47171, -33847, -15902, -70278, -120458, -137277, -125698, -112635, -203760, -207369, -135139, -95781, -77991, -77515, -67793, -35333, 48224, 12424, 38359, 64082, 58398, 42547, 19043, 5070, -43307, -83965, -120051, -95490, -89894, -86311, -149161, -117086, -18010, 5319, 50203, 32602, -15594, -52205, -80225, -51560, -31063, -19726, -15359, -3710, 9983, 535, 18563, -4728, 46467, 128777, 112713, 24470, -1233, -9552, -14613, 46912, 36857, -12580, -11253, -16349, -9274, -25493, -45987, -65161, 9567, 56035, 47416, 20258, -31077, -39933, 8277, 36318, 58697, 58070, 19433, 10090, -2726, -15403, -39622, -102244, -80979, -88929, 10798, 12481, -12980, 228, 9137, -19946, -27124, -93265, -141103, -86867]
17145h6867P6792O0206r557j8970l3227m596N421j7911k6813J6485M314p3142
17133a07865K7503L0532J180K4418K9327n2779n9238j1143j7259J10874O3735
17122C9285L4655m5581p6278N5350Q0295p3694o991J9166j3092o1848k3119J0572
17110f1280n1807K1724O4086m058k4596l0970k375L439k9183K1609M3006R7104
17098D6699P399n2528m7337L529R3667l0919o9489p1446M1991M8454o984l65o099
17085d3428l1294j7449K2784K6261L5039K8198n9482p909M8209j5340P524j8331
17073b5218n1485Q624R6951J2887k8654k1756j7974O148J0946m4980j7995K4838
17061d7668m3167j0595p864m2526J0468K8740Q9429M3417K0867J7704l9729m1929
$$ y = [-86867, -10075, 50131, 40574, 21604, -11623, -16219, -10798, -28709, -55522, -39037, -34723, -107865, -80362, -49830, -48650, -24232, 5095, -47684, -106922, -118065, -135324, -24450, 39285, 73940, 28359, -47919, 7431, 87726, 14032, 7041, 26207, 13115, -48733, -71852, -61280, -113087, -91363, -27277, -31335, -55931, -86901, -89276, -85837, -115020, -93411, -50405, 46699, 54098, 1570, -45767, -42238, 51429, 20510, -48979, -120425, -78434, -29980, -36964, -37329, -43428, -74722, -92171, -69387, -43126, -8087, 20111, -39371, -47280, 929, -14411, -6887, -25218, -76703, -68079, 28872, 41759, 13105, -8651, -26625, -20477, -9531, -54511, -72506, -47668, -90835, -101430, -109294, -151820, -141352, -112612, -23183, 20234, 41101, 58805, 19076, -22853]
17049b2853l901j4526L3599J9244o3165q696M986J3032k6008l7167K1588P0351
17037a3516M0966J0531k6358K8421K2851q397o5224m0841l1943Q628M2506J7906
17025a4470R287Q760P3786o054J7949o8854k629N3486k2138k4266l3590m8666
17013e7399j7867J4916J12991R1669p1373j1677M4219M4046Q044j05260L36L4460
17001H7105j9853L0984N8857l7152n640K3775R456k1718m4872l6979k382l780
16989C7801j495m2538Q134M3057j8321l3114q4521K6245K6585k5371J3673l887
16977e3752M138M0802k9423J676P7100K3915n031P291k0049l0671j0812j2788
16965g604j7056m6649j2167N9004Q0599o821j11337L4272J2205m8868K7663M5883
$$ y = [-22853, -26754, -41280, -7681, 11563, -51602, -60298, -55312, -42280, -68288, -105455, -83867, -13516, 27450, 37981, 11623, 40044, 62895, 54498, -10726, -51567, -83510, -74882, -32376, -14470, -5183, 3577, 77363, 71309, 89258, 20404, 17775, 71261, 49123, 24857, -8733, -57399, -75266, -60350, 52641, 144310, 72937, 61260, 105479, 149525, 157569, 52309, 52645, 87105, 67252, 98236, 157093, 119941, 114301, 138076, 147532, 125814, 80942, 43963, 41581, 37801, 36306, -6232, 1902, 44959, 26638, -6476, -90997, -64752, -38167, -63538, -49865, -53752, -49614, -8812, -38235, -36559, 40541, 64456, 59425, 66716, 46667, 15996, 5184, -7604, -24660, -71309, -83476, -24472, 56127, 49306, -62031, -27759, -15554, -64422, -36759, 9124]
16953I124M8170l4523l8519k895k1897L3215r327K5761o442m9804m9176J6298
16941h0015K1435K7765N0391l155L896l0937k4583J9907p1K7152N0180k6357j8960
16928A6648J1228K8231L1991k1810J1287l9290k76j3116l5987K1450M6305K2871
16916G9532l6746J3036J7193l4468o5017M8337P3853l9281j5634k3404k2021j5280
16904a9900n6715m4085O158O5616K9502n2266L8414N5589n2790p6887j953J9711
16892h9606O6566P9139R003m8363m1909m4237k0049Q6749J9978J32L2671j6360
16880C3714m7906Q245L5605L7835k7489p7904J2586n14j9026o5122P393L8577
16868f4006L3073K1582K6020O856J1037l9309l0120l1646k1240k3889k7443P5904
$$ y = [9124, 57294, 22771, -15748, -18643, -40540, -7325, -16652, 9109, 2667, -47137, -96313, -80015, -58580, -30815, 19576, 16421, 20317, -10620, -35203, -15296, -15367, 11785, 61965, 35608, 16648, 27876, 56107, 88098, 66288, 77575, 38285, 38009, 24893, -11094, 10356, 56661, 79532, 42786, 55822, 73015, 38547, -26470, 21867, 95720, 56439, 40805, 17401, -4620, -19900, -76615, -120700, -114542, -48926, -19424, -71690, -33276, 22313, -30477, -107364, -109317, -89606, -23040, 56099, 65102, 16739, -25170, -69407, -89456, -2707, 17271, 17403, 50074, 33714, -14192, -5947, 29658, 67493, 40004, -37900, -25314, -25828, -44854, -109976, -102583, -64006, -30933, -9351, 16669, 23525, 34562, -4747, -34867, -66513, -87753, -111642, -139085, -63181]
16856f3181N3733J8082P092l3303j2864r9458m4380R7960K1121N119N4030J651
16844E602j3333m0679N2786m79k4286L1569J6765j1624P053O3599K2263k0419
16832H8817l3376l249k2971k5612m1631p910J6315j9136n6372K004K0287m9467
16820a32301J554N2454L541K7469p893j0173l8773Q871L0557K6941K3795r349
16808b3307M0178n2886l7312p247j3876K4615K2420K9450j0156k607l6749K4004
16796d3473j1326K5198O2338K9892o7272j2017k7356J8961l4366J8823m226n5567
16784a00391K4993J7177o539o3410k3110j3695K6616L2515K5950n3530J6375L3327
16772h3722M8075L7208k6456m3084k8042K3334j0690K7139P120O217q641K8240
$$ y = [-63181, -9448, 8634, 15726, -17577, -30441, -129899, -174279, -76319, -55198, -50079, 3951, 5602, -7731, -48410, 4376, 3897, -20389, 11180, 27945, 16321, 23374, 86973, 109236, 88817, 55441, 52192, 29221, 3609, -38022, -45932, -29617, -48753, -105125, -103121, -82834, -132301, -130747, -78293, -74752, -47283, -55176, -65349, -104122, -95251, -64694, -37753, -13958, -23307, 16871, -36015, -73327, -80574, -94450, -69835, -47415, -17965, -28121, -30728, -67477, -43473, -54799, -29601, 32737, 62629, -4643, -16660, -44016, -25055, -59421, -40598, -44824, -100391, -75398, -58221, -64760, -128170, -151280, -164975, -138359, -105844, -79894, -133424, -117049, -83722, -35647, 1561, -24895, -67979, -96021, -72687, -83377, -56238, -49118, -42901, -51542, -23302]
16760b3302l8063J7085O4565J0557k7296m4696l2035K7971l8797M3027K1710j1545
16748c0819J9151O3696l1454L6321N1k5618L1986p165m3422m51M8294n5628l4080
16735b9138j8943J4416O6922K9803n1233k3537K3078l124j7641j2626j6520J7990
16723b0553j2056O1604K5354n9288k4592K244o3983R586N6122m367n4538l5604
16711a20071J2939J2082K8952M7107J595q4109K143L5117N7116R439q199l6659
16699d2548j9238m1k9596k5773J8385j469k1853j454j7499R7009J4039k9161p440
16686f6639N1948P5306l1001l5532n950l2236K0435K3455k5946k2695m5081m1606
16674a35542N5739L9244l0741K4278R0805L9563m2349m6103L417J3822j1059k7089
$$ y = [-23302, -61365, -44280, 20285, 30842, 3546, -41150, -73185, -45214, -84011, -40984, -19274, -30819, -11668, 52028, 20574, 56895, 56946, 31328, 63314, 56149, 12727, 12276, 60570, 4942, -29138, -48081, -33665, 33257, 63060, 11827, -11710, 11368, 8244, -9397, -22023, -38543, -20553, -32609, 28995, 54349, -4939, -29531, -27287, -91270, -81684, -25562, -29929, -84467, -120071, -107132, -95050, -66098, -18991, -17396, -101505, -99362, -64245, -7129, 2310, -5889, -42548, -61786, -61827, -91423, -117196, -98811, -100280, -122133, -123587, -141086, -44077, -30038, -59199, -66639, -14691, 60615, 29614, -5918, -11868, -44104, -23669, -214, -26160, -48855, -93936, -135542, -79803, -40559, -71300, -47022, 43783, 83346, 40997, -5106, -1689, 12133, 1074, -26015]
16662b6015K1706K0873l2742k5933p965j7831J8070O2342L6706m7479k8041J7895
16650h414k9081p4727M2589L1468N2922l1660l8226j8444K037N8724K8806J1387
16638B7381L7443o235j16649r4569L4655R0496J0204k412J1102m4276k379J2214
16626d3025L3306K4383K089o822m365k3038r030L7805J1604Q487K4532k7671k8403
16613a48n783J9850n1846n7225n9707K6618L1797K5962J19791j067k3584j3142
16601A1516l880K4274l696n4337j985J1479j4717L7582r506l3138J7203L6297
16589A7092j1575n299l6377n2609J6090P7891J6396k3265l3570j3911L1753J7319
16577f5J932M2454k0944l0085l936r706L0382K0782o3767k7945J7736n068K7828
$$ y = [-26015, -4309, 16564, -16178, -42111, -50076, -67907, -49837, 12505, 49211, 1732, -26309, -8414, -37495, -112222, -69633, -38165, 14757, -16903, -55129, -73573, -71536, -12812, 15994, 27381, 64824, 58589, -58060, -152629, -117974, -27478, -17274, -19686, -8584, -52860, -55239, -43025, -9719, 14664, 16753, 9931, 5566, -17472, -26502, 11303, 22907, 31394, 55926, 28255, -148, -5931, 13919, -37927, -95152, -154859, -128241, -96444, -70482, 49309, 48242, 24658, 11516, 7636, 31910, 28214, -26123, -28108, -16629, -31346, 6236, -3270, -36408, -19205, 17092, 5517, 218, -36159, -88768, -72678, 5213, 21609, -1656, -35226, -49137, -17384, -65, 1867, 44321, 23377, -6708, -10644, -20350, 10032, 30814, -32953, -60898, -43162, -48230, -20402]
16564b0402q500j2075j9730k5589K7076L4298p0817j944N9332K5817m512L171
16552a3875M9991j9098m5194K0522l4555L3808o029o45L3112J5850l2339l8923
16540c7375Pj4041N4265L5970k4452n932l5178m8343K0710O506N99L2199m4849
16527e9914m3430J6997j1055K8822L9884P4371M0240m3765r5040m9902J4773K2523
16515f5496q082m1826o807J03376J9047p5971m7822K0152K7560l9330K0807j235
16503i5627m9497J6666L8521M3731L4413m4029k2405L478L6950m3497l0743K4613
16491h7426j2547K9178K6133O2876N0129q309m6078q1622P859N5501O943K1392
16479B4029j5592n9644N209L5885j4956K270p0135j5518K4k2638K4351N2940q101
$$ y = [-20402, -28902, -40977, -60707, -86296, -59220, -24922, -95739, -97683, -38351, -12534, -17046, -13875, 36116, 17018, -28176, -7654, -42209, -8401, -14430, -15075, 18037, 33887, 1548, -37375, -37368, -51409, 2856, 38826, 14374, 8442, -26736, -75079, -54369, -47863, -47264, -15065, -59914, -103344, -86347, -97402, -68580, -28696, 45675, 85915, 42150, -52890, -102792, -88019, -65496, -73578, -115404, -122211, -18835, 212, -75759, -123581, -103429, -75869, -115199, -94392, -95627, -145124, -128458, -89937, -46206, -11793, -55822, -78227, -74749, -37799, -81296, -112039, -87426, -99973, -70795, -44662, 18214, 68343, 60034, 13956, -67666, -59807, -4306, 2637, 24029, 8437, -51207, -45998, -10113, -25069, -22799, -92934, -108452, -108428, -131066, -106715, -53775, -61876]
16466f1876J1573J2186L1451J9624O7586k5593p2586m0919J9439K3693m576M9001
16454B9003Q10m4361m0708O8404k2642q9979N444M0523o576R1852j3950p8667
16442f0847j1174O7575O7133J8943m6498q0113m5932j8311M9891P46n9289Q121
16430a09755N9972L2559M6204N9324j5936q8135L407l926o6460l3331P7914M3278
16418E115j2028K6200k4265k168K5873J4188k4710m9892l3883k6543J8287L2188
16406e1638Q711K8962j8636O2892j8956r3474M6785J7545l4217L6061K7278K5181
16394C6494K8428n1293m7936n1791j3457J3292k0318N420J3220L3052k8076J5970
16382f6995K780P2597P508n2747k6207N7256N862Q216j6804N109J3359m1745l0298
$$ y = [-61876, -50303, -38117, -6666, 12958, 80544, 54951, -17635, -58554, -39115, -15422, -19998, 29003, 29813, -14548, -55256, 13148, -9494, -99473, -94029, -53506, -60082, 31770, 17820, -60847, -72021, -4446, 62687, 81630, 35132, -44981, -90913, -109224, -59333, -58587, -117876, -109755, -49783, -17224, 28980, 88304, 72368, -15767, -12360, -16286, -82746, -116077, -38163, 5115, -6913, 19287, -4978, -7146, 18727, 32915, 8205, -41687, -75570, -102113, -83826, -51638, -42927, -13965, -32601, 30291, 11335, -82139, -35354, -17809, -52026, -15965, 11313, 36494, 64922, 13629, -34307, -86098, -99555, -86263, -106581, -101161, -87941, -54889, -82965, -66995, -64215, 8382, 15890, -36857, -63064, -5808, 54, 8270, -8534, -3425, 9934, -31811, -62109]
16369f2109l2275J58l807M7306j9767L9493M8011l9497K4567j5091n5862J0574
16357e8299J425k5358j424O0492M3597m071m1496k3717K7893L6454K1451N2560
16345H9507k1680m8258l8625o6758l1442j6890K2612O2908L7939J2014l5305k4202
16333e8180K1318k6541l867k003L0177J7313l2118k2131m9815k8716J3458L8295
16321a02810N1504K6068M7280P035J7365l7691n8798K1245M063l768j7951n299
16309e1757j6462m591k5323j353p682j5725j3240r120J02231P2082n005m8616
16297b4561l0749m7705k0015j2352J433K9827N0576J2491o3016o2889L8230L3591
16285i5139L7062p3160k1191O2909R1935K2118M0983l0021l4834j4978J4152J0590
$$ y = [-62109, -94384, -94226, -98033, -50727, -70494, -31001, 17010, -22487, 2080, -13011, -68873, -58299, -56874, -82232, -83656, -23164, 20433, 16362, -25134, -48851, -20958, 15496, 36947, 89507, 67827, 19569, -19056, -85814, -117256, -134146, -111534, -48626, -10687, 1327, -33978, -58180, -36862, -63403, -67270, -69273, -39096, -21783, -53901, -76032, -125847, -154563, -141105, -102810, -51306, -25238, 22042, 29077, 46442, 8751, -50047, -28802, -24739, -28507, -46458, -51757, -68219, -72810, -98133, -99486, -107168, -122893, -136133, -145253, -43022, 29060, 24055, -24561, -55310, -103015, -123030, -135382, -133949, -104122, -53546, -41055, -104071, -166960, -128730, -95139, -58077, -131237, -152428, -89519, 2416, 24534, 65517, 35496, 662, -14316, -164, 10426]
16273A0426M0858J8888k5192o7254k4002j1475n2968P4950L3883j1529j8745l3384
16261f5544K5206R088M3538J085r3923l334J4814j261J9623J1439M950K2938N5382
16248D4001m989k8637K12l5888j3227M6961r098m6982l3982L8337L9122K2402
16236A8232M2401J8060j8677l792n7374q2556q0684k5147Q4589N0685J9776j2335
16224d6822L3558N6689r670k7309J0904J2507N224J5520j6899J8514J5413n0257
16212A7372j6338J0669J5994j6229O960j9307p740M4740K5577M6655K0848p2088
16200E7113o5593m940j5058j7913M56q395o393J958J819n828J532n66K8402J1624
16186b1782k4936M225q606J8032q049J6772J7981m9161l5501J7274O868J0658
$$ y = [10426, 51284, 70172, 44980, -22274, -46276, -57751, -110719, -35769, -1886, -13415, -32160, -65544, -40338, -31250, 12288, 13373, -80550, -83884, -69070, -70331, -50708, -39269, -34319, -11381, 44001, 39012, 10375, 10587, -25301, -38528, 8433, -665, -47647, -81629, -43292, -4170, 18232, 60633, 78693, 60016, 56224, -1150, -83706, -164390, -189537, -104948, -54263, -34487, -46822, -13264, 43425, 33755, 6446, 17350, 29857, 35081, 50601, 33702, 52216, 67629, 17372, 1034, 11703, 27697, 11468, 18428, -879, -8619, 36121, 61698, 108353, 129201, 57113, -8480, -13420, -28478, -46391, -45935, -54330, -60723, -58765, -56946, -62774, -61242, -61808, -33406, -21782, -46718, -42493, -51099, -33067, -41116, -24344, -6363, -55524, -91025, -73751, -66883, -56225]
16174e6225O288j2878K2727j8702k705m6091l1133J0761k499J3426O5741N1201
16162h9q669l7587R097K3921p5962L7331N9246R048K9569k7517n7599P338k363
16149c4236L603L6245J1000M2632M9411k7668o0531M1015K2285j6604o039J2343
16137G3456j9350M214L4256l527j00595m1457O8084Q0908l3704o5712K378M361
16125C312O702J0041m21L2418K852j8015l0906k2081K7363k993j1753k128m8864
16112e4473L3900P0094j2170o7174o939J2205P1409m4136j1046J330K1457n0111
16100c5654l7119K6477K8702N080L9233N2472j8121l2144k6173j3571m6204j0538
16088f7560k4459j6253J1636P6111J9098j3589m7446j8184K665m329N772l459
$$ y = [-56225, -49937, -62815, -40088, -58790, -61495, -107586, -138719, -127958, -130457, -117031, -51290, -89, -8758, -46345, -37248, -13327, -89289, -51958, 7288, 16336, 45905, 18388, -39211, -31873, -34236, -30633, 5612, 16612, 59244, 108655, 80987, 20456, 61471, 83756, 67152, 61113, 73456, 54106, 58320, 92576, 89049, -11546, -53003, 15081, 95989, 62285, -3427, -1049, 3312, 10014, 20055, 19634, 52052, 54904, 36889, 5983, -16098, 11265, 8272, -3481, -5609, -54473, -20573, 49521, 37351, -29823, -36762, -24557, 46852, 2716, -8330, -7000, 14457, -35654, -72773, -46296, -17594, -12514, 26719, 79191, 61070, 28926, 2753, -10818, -57022, -67560, -92019, -108272, -96636, -20525, -1427, -15016, -62462, -80646, -77981, -82310, -76538, -79997]
16076g9997m3267L0756J9565N977N7601m2627K5309P3358k6412J8499j6308r331
16064A3123N7694j5332n3238L6348J0474l9767M4991n2179L938K634J6570K5738
16052E0994O16K1733M477l90j19246p2148M8336M9644N3655o316l9186m0964L8542
16039a0253P687Q499J3853m1587K0719O0637k36N6404m3218p7667n9246o1984
16027a26392K3881K3168K3882K7868L4090L1887K5240n4225k4867n6579N3909
16016a8138M796j7972J6291l7031m3669K2200R1212J1026j6414m0671O1517K242
16004C5389m414j6545j8566l5565R979j2040j1107K0153j2994j6548j4040R1834
15992A5536J24372j3303o7189p0602k4603Q0619J4369l7107k6626j7040J915J5927
$$ y = [-79997, -123264, -92508, -72943, -66966, -9365, -51992, -26683, 46675, 20263, 38762, 22454, 13123, 70817, 55485, 2247, 38595, 49069, 9302, 54293, 2114, 6052, 8686, 25256, 50994, 51610, 73343, 77820, 77430, -41816, -113964, -65628, -15984, 37671, 31355, -7831, -48795, -10253, -2566, 5933, 19786, -21801, -1082, 59555, 59319, 115723, 72505, -5162, -64408, -126392, -102511, -79343, -55461, -27593, 6497, 38384, 63624, 9399, -15468, -72047, -18138, -13342, -31314, -15023, -52054, -95723, -73523, 17689, 28715, 12301, -28370, 33147, 35389, 30975, 14430, -4136, -39701, -29722, -41762, -52869, -32716, -45710, -62258, -76298, 15536, 139908, 126605, 59416, -11186, -35789, 44830, 59199, 22092, -4534, -21574, -19659, -3732]
15980c732J6652J5531M4285k2005n0451o0198j1522P153M75M8893J6266l0530
15968b9183M8241N8592q2817l5531K9319M993K3809l764J2363o881J6077r141
15956B6077k4343k0124k6733q588N9502N4556k2958o1224M2739l411m6439l2109
15944f3055O0883M0557M546n5310J5476L1850L3175M4092m7562j8661l052p5576
15932c2637l5512J0814K8640j2548n6574n9216J829M7292J4444Q6155Q7592j2205
15920F8074j7078l4095n4673m1834K8350M0878J5164p030n226L587j4610L7118
15908A8625P6824k6867l3643o3526l9815k0000L1420p774K2968P835j7047M5222
15896e778q185k167j7871m532M5614K1347P827K2178l7494p6273m5216p936o856
$$ y = [-3732, 12920, 28451, 72736, 50731, 280, -59918, -71440, -64287, -63812, -14919, 1347, -29183, 19058, 77650, -5167, -40698, -11379, -6386, 17423, 13659, 26022, 19141, 35218, 26077, 1734, -18390, -45123, -53711, 5791, 60347, 37389, -23835, 18904, 15493, -30946, -63055, -2172, 38385, 42931, -12379, 3097, 34947, 68122, 112214, 64652, 45991, 42939, -32637, -68149, -57335, -28695, -41243, -97817, -157033, -155204, -107912, -93468, -7313, 80279, 68074, 50996, 16901, -37772, -79606, -51256, -10378, 4786, -2244, -7470, -3883, -18493, 18625, 95449, 68582, 34939, -28587, -68402, -88402, -56982, -64756, -41788, -33953, -51000, -5778, -13963, -16130, -34001, -38533, 7081, 28428, 36255, 58433, 20939, -55334, -100550, -108486, -115342]
15883a15342P3789O0109Q155j06126L7877N2326j2533j8496k163J9468j2445K832
15871a2549M6373l0686m767m902m0642J9446K9915k515N5711o7845o0601N1553
15859b1509K4156j1562n6702l6742K5670O5079K2135M2118J9823J6390k5218l8605
15847B5033o5620k0536M7607J9485M1177J3766l858m7415R963N656L510J4134
15835D2902l5216m4959K6195j5999m9367K3713M6789l725k2895K4428o671K2398
15823G593j6894j8131L2377N128k6106l1263K1432J2510m0125m520n5651j4341
15811a27991L6271N13j9394O4163N7122L1372K6429k1655r101l6322j3118m3890
15799e5601L1009K2650m7097q0930j1091N0135M3031k6562k7285l4245L8293P1540
$$ y = [-115342, -41553, 18556, 26711, -79415, -41538, 10788, -1745, -20241, -22404, -2936, -15381, -12549, 33824, 3138, -1629, -6531, -47173, -27727, 2188, -327, 55384, -12461, -73062, -21509, 2647, -8915, -65617, -102359, -76689, -11610, 10525, 52643, 72466, 88856, 63638, 25033, -40587, -61123, -13516, 5969, 47146, 60912, 57054, 9639, 19602, 25258, 28768, 42902, 7686, -37273, -11078, -27077, -76444, -52731, -5942, -9667, -32562, -8134, -14805, 7593, -9301, -27432, 4945, 10073, -16033, -47296, -25864, -13354, -53479, -57999, -113650, -127991, -91720, -91207, -110601, -46438, 10684, 42056, 68485, 46830, 37729, 1407, -11711, -55601, -24592, -1942, -49039, -129969, -141060, -90925, -47894, -74456, -101741, -135986, -97693, -26153]
15787b6153n7398J8832p446k9743K4238M1120k554L0350L8989O538k2436m681
15775I656j6951P4683o093j4646m7156k0341j0708J9696j445r577j5330j9589
15763e7801J4960M2439K5874J898o944k7890q532K0121L8388j9278O1310J7018
15751A01563l6103j9964m1802K3595K5798N5423r6244p6815j5382N8256M2755
15740B1080l4463K8652j5817o211L3743L415k1458n2471M5789M0516L8725K9133
15728A10633o2608o9293j0993M7919k5465m8625n550P1201K1138l2238k9647r927
15716d3455J3778J547j430K5750j3132L5250J3294J0048j0026k6277m4002l5075
15704g3730M0242L5311n9877l5569k3304K3824N5658N1227l4160l3315l2626j1097
$$ y = [-26153, -83551, -64719, -72165, -101908, -77670, -36550, -39104, -8754, 30235, 36773, 14337, 9656, -7295, 67388, 61295, 46649, -507, -20848, -31556, -11860, -13305, -22882, -38212, -57801, -42841, -402, 25472, 27370, 20426, -7464, -15996, 4125, 42513, 23235, 84545, 101563, 65460, 45496, 3694, 27289, 53087, 108510, 12266, -64549, -79931, -21675, 21080, -13383, 15269, -548, -6759, 26984, 30399, 8941, -43530, 2259, 42775, 81500, 110633, 48025, -21268, -32261, 15658, -9807, -58432, -63982, 7219, 28357, -3881, -33528, -43455, -29677, -28130, -29560, -3810, -16942, 18308, 31602, 41650, 31624, 5347, -38655, -73730, -33488, 1823, -58054, -93623, -116927, -93103, -37445, 13782, -20378, -53693, -86319, -97416]
15692i7416k6135l416R917K6485K2170J0584m3810m834J5634K6016Q415o629L4053
15679b8966k1965L06R228L3463n6770l5849J6978l8767N790M4425L4206m9N030
15666c2940P239J9367r767n579l351L0175K7567j0126n1823m31L4142L7859n685
15653C6647k8070J6610L1713j8316j9681M5116j1931n1714j6187J3400L7658k1791
15641A3454m3720N186K2031l2501J8407q759m2611n7588n477J762P0404P687K1141
15628c0584J1507O935N7710m5417q697j8520l7698K4467N7224L8689O3593kj9079
15615A00128k9984n0864L3495k2074o717M8235p3351o6055K1795m6183l1369M0036
15603h2908N6098J1066J8396L7021O945L0148l526L2698k8054l1803n1942p1704
$$ y = [-97416, -123551, -126967, -117050, -90565, -68395, -57811, -101621, -106455, -90821, -64805, -56390, -63019, -28966, -50931, -50625, -41397, -7934, -64704, -100553, -83575, -122342, -116552, -72127, -37921, -37970, -32940, -25701, -6334, -16101, -21680, -25031, 5144, 32711, 22585, -29238, -29669, 4473, 42332, 36647, 8577, 25187, 56900, 38584, 18903, 64019, 52088, 374, -15813, -2413, 35245, 13454, -30266, -25080, -3049, -35550, -17143, -25902, -68513, -126101, -131578, -129816, -59412, -51725, -30584, -19077, -12142, 45568, 151, -8546, -27066, -64764, -40297, 16927, 55616, 119209, 119207, 100128, 70144, 19280, 52775, 30701, 23984, 72219, -1132, -67187, -45392, -91575, -122944, -82908, -26810, -15744, 2652, 39673, 46618, 76766, 73240, 105938, 77884, 46081, -5861, -77565]
15591g7565l6640j9658k3182O8886K0514j5265J8208K6810M4648L9683j6417k538
15579B7484J069r5220o5510j2698L4924M2335M8450l4935k597M3735J1081Q8442
15567H6560L5213l4995k9253j3361n1059o5603M9330K0611n1108P700L1834K0994
15555F863m2478j0219J7995N8706J0284K1155L2703L332m7300q2361m9829P7041
15543d108J00699o0219n138J3782P023m4298m8864L0086L6752l4788m9684L5720
15531b3037J1611M5721j5194m0000n9870L6465R5173K9518M953r3683n0985O5525
15519F197L537L115m865m9524J6420M7880k7354n7222m2j582o3481m9044N373
15506a70592O728O0055K2208N2220O5858K6509m5537j3474L4346N2379k4494m0449
$$ y = [-77565, -114205, -133863, -157045, -88159, -67645, -82910, -64702, -37892, 6756, 46439, 30022, 27484, 28553, -66667, -132177, -144875, -109951, -67616, -19166, -54101, -56698, -12963, -1882, 86560, 121773, 86778, 57525, 44164, -6895, -72498, -23168, -2557, -53665, -45965, -14131, 6863, -35615, -45834, -27839, 30867, 41151, 62306, 95009, 98341, 51041, -31320, -81149, -4108, 96591, 36372, 31234, 45016, 52039, 7741, -41123, -11037, 25715, -9073, -58757, -23037, -11426, 34295, 19101, -20899, -80769, -44304, 50869, 80387, 85340, -8343, -59328, 6197, 9734, 12849, 7984, -41540, -25120, 22760, -4594, -61816, -61858, -63440, -126921, -175965, -170592, -163864, -103809, -81601, -29381, 36477, 62986, 17449, 3975, 38321, 90700, 66206, 25757]
15494B5757p2898n4142m386K1519Q043N9474M5239J7252j9316N482j1245k7655
15482f876J8316K6643l2789k1340r177p975R247N1526L7095J2470J242j9235l5196
15469B3951n0844m1039k648m076k3240k6354n832J0070P1362K5776n5761Q165
15457g0470K4818k0013L755L1202K2311L458n4453l3638L3597K1839o6o5654K9683
15444g3631L7140J8282m1749l8543J530M4125K1735l887n174J5004o1330L326
15432h3172M3067M9094L0930O23o5284L633n4543O1659J16688r24r5081q0462
15420g3772j82M7858K415j6097m6102m9520L9982J1558J3997R4577J2473q209
15408B8978J2678o4415q8244J1837K8382O8154K5336P334k8249J8829n0610m9147
$$ y = [25757, -47141, -101283, -105669, -84150, -76107, -16633, 28606, 45858, 26542, 32024, 20779, -6876, 11440, 38083, 5294, -16046, -25223, -33198, -23951, 27575, 64670, 77140, 78382, 59147, 23951, -26893, -67932, -70580, -74656, -97896, -124250, -130082, -120012, -48650, -22874, -78635, -70470, -45652, -65665, -61910, -30708, -8397, -4939, -59392, -93030, -59433, -37594, -37660, -103314, -73631, -36491, -18209, -59958, -98501, -96971, -52846, -31111, -34998, -40172, -25168, -86498, -83172, -40105, 8989, 39919, 40542, -24742, -21109, -75652, -13993, 102695, 101771, 6690, -73772, -73954, -26096, -23681, -39778, -85880, -135400, -95418, -83860, -69863, 24714, 37187, 28978, 41656, -22759, -111003, -99166, -70784, -2630, 22706, 30040, 1791, 20620, -29990, -79137]
15396g9137j8041L6276Q1733j6405p2784k9444K3021O5721N8708Q220K2811J5469
15384I6148k1404j25974l778N1947L7945j282m2920L320n3225l5747K9009m1101
15372a07062M5777J8387j7030K2152J6451J6381M3219K9809o9784k4616m2397
15361f8713R700N2740O0865R382l9273m2349K0167k102O4419m270o5756n3440
15349e8630P462j3904Q5220k4124m9813L0900N2166l7253M141J7789J7911n5319
15337b3454J1365J06808M9986K5239l4718n5717j8444J5446k0758m9569O919N2820
15325F5923J7978l7371j2382Q71j8609m7159J4105O935L819r466K4312M1377k0710
15312B9623j6174l7605o0715n790M2324M0383j0500l4903M6165K921j0885l9490
$$ y = [-79137, -97178, -60902, 20831, 4426, -68358, -97802, -74781, -9060, 49648, 57868, 80679, 96148, 74744, -51230, -55008, -3061, 34884, 33602, -9318, -5998, -59223, -94970, -65961, -107062, -61285, -42898, -59928, -37776, -21325, -4944, 38275, 68084, -1700, -26316, -68713, -59013, -6273, 54592, 63974, 24701, -17648, 2519, 417, 64836, 60566, -5190, -58630, -51168, -65072, 20148, -3976, -53789, -22889, 29277, -7976, -3835, 13954, 31865, -23454, -12089, 94719, 144705, 169944, 135226, 79509, 61065, 76511, 55753, 6184, 13103, 65923, 83901, 46530, 34148, 35019, 16410, -30749, -16644, -9709, -5890, -15356, 8956, 50333, 29623, 13449, -24156, -84871, -90661, -48337, -7954, -18454, -53357, -7192, -4271, -15156, -54646]
15300e4646J5023Q331M1250q729J4775m7692p5273J8237Q0510J073k7042J0371
15288b3812N382l288J0855N944J5501R027j9841N948n4302P338Q133n162L4170
15275d107K4017m6461J5928J8855l4694M8057M8586j604M294p2128j03446J4748
15263h7955M5956J9340O4297J1597k3115k4200p850n83J641m478l174j7631k721
15250b8876J6697K6902L0634j4064m4980J1345k2899L3268M567r0130L7241N9738
15238A9443Q5601P133n0867l9165j1016J3571k0397k2279J3771m1047k3940K4942
15226d4250q833Q6491L1672K0974R428m9930r2638k6317M0417K7169K2901J5261
15214C2345J6514J1157J8744o8942o112J4287P31r0650k0877L3693J009j0310
$$ y = [-54646, -39623, -31292, 9958, 1229, 16004, -31688, -106961, -88724, -8214, -7141, -34183, -23812, -18430, -21718, -10863, -4919, 10582, 19609, -232, 5716, -48586, -41248, -33115, -38277, -4107, 19910, -26551, -10623, 8232, -26462, 21595, 70181, 68577, 72871, 743, -102703, -87955, -41999, -22659, 41638, 53235, 30120, 5920, -1930, -2513, -872, -5350, -8524, -26155, -28876, -12179, 14723, 45357, 31293, -13687, -2342, -25241, 8027, 12594, -77536, -40295, 19443, 105044, 112177, 61310, 22145, 11129, 24700, 4303, -17976, -4205, -45252, -69192, -44250, -53083, 33408, 65080, 86054, 95482, 45552, -47086, -73403, -32986, -5817, 17084, 32345, 48859, 60016, 78760, 9818, 3706, 17993, 18724, -71926, -92803, -59110, -58101, -68411]
15202f8411N8045k314J0635J3650k4482j37n6727J2177M6041j7367k9034R715
15190d8209P32L0858L0531n9879k7558Q1764N6471p983m4555o41N9833j7375m9939
15177D050k2161k6602l1956K4909P0665j5156j4496k6597K5347Q3653j7727J9038
15165G2967l5425j5445K09J3809j9109l9744L9404K6613K2938n440k2212Q944
15153D7509K960J3759q043M1308K01K505L137k5228k2575K881O1885q716o163
15140A05420l1455K8831J5651l5359p684Q8607n7200j30922p21M6068M7100J1460
15128G9796p575Q2968j7198k6046l2259K1941n9372R643K6319n8654j6350P3053
15116G6266J5373o289k7746k804q363m6567K0219j7581l1109O5919k7525m6450
$$ y = [-68411, -10366, -12680, -2045, 11605, -12877, -13014, -69741, -57564, -11523, -28890, -57924, -48209, -47477, -16619, 13912, -45967, -73525, 8239, 64710, 56727, 12172, 11531, 71364, 53989, 4050, -18111, -44713, -76669, -51760, 18905, 3749, -10747, -37344, -11997, 71656, 53929, 72967, 37542, 22097, 22306, 36115, 17006, -22738, 16666, 43279, 66217, 60777, 38565, 47509, 50469, 64228, 56185, 97493, 97694, 100199, 103336, 78108, 55533, 58414, 120299, 111583, 105420, 73965, 102796, 118447, 83088, 75404, 164011, 106811, -24111, -24832, 21236, 68336, 79796, 72221, 155189, 137991, 111945, 79686, 101627, 42255, 51898, 78217, 19563, 3213, 76266, 91639, 85350, 57604, 54800, 46437, -130, 20089, 2508, -28601, 37318, 9793, -36657]
15104c6657L7170M9003L0220j3708q4520K7614N6352m8894J9968j3185l1072K3167
15092A5458k937Q6798L3801o8484l139O0970l0884l4197n4382r984J6820J5535
15080B5375J3749K4147j8183p106j4261J9297q082j7744P0937l5656j08874M4535
15068a1866M5518M8643J1062l6521j5668M0109j7847K6237K6356q3590k0154m8579
15056c6300m5804M2600Q6525j200j711o0312K5804J7033L3059j0826J5828J8775
15044H3471l0059k9330k9115O2644k8721k1813N4861J3435n1204j42113j8486
15033a36430R1265O7083K0219k0084j5191M8710R3086M1237o1447n5610L8521
15022A11359l406k6176o8159k2124M3652O716k5131L342L1705K1727l128l8108
$$ y = [-36657, 513, 49516, 79736, 66028, -18492, 9122, 65474, 16580, 36548, 23363, -7709, 15458, 12521, 99319, 133120, 64636, 61497, 122467, 91583, 57386, 3004, -6980, 9840, 25375, 39124, 63271, 45088, 37982, 23721, 43018, 34936, 17192, 88129, 52473, -56401, -11866, 33652, 82295, 93357, 56836, 41168, 81277, 63430, 89667, 116023, 32433, 12279, -36300, -82104, -39504, 47021, 45821, 44110, -16202, 9602, 26635, 59694, 48868, 64696, 83471, 53412, 24082, -5033, 57611, 28890, 7077, 61938, 75373, 24169, -117944, -136430, -45165, 21918, 42137, 22053, 6862, 55572, 148658, 189895, 128448, 72838, 111359, 107953, 81777, 13618, -8506, 35146, 41862, 16731, 20073, 51778, 73505, 70377, 32269]
15010C2269R221K2696m5562k5278l6659J8286K8763L1342m919K8503M1205r792
14998I0075j5657j2256n6402K268l9669K6973P2324j2531r0800m3361J0449J5901
14986e2686l6497O354K9228Q1613K5300m2873j0122M5014N0880k9184l3047j2165
14974B1815j2418N57M3004O368L7846l703J8026l3494n9677n147k322K726N990
14961A9571K2024j0062j5185Q8975N4329p5238n2409K524n810n1932L4686L4985
14949D6458n3833L8142J7838k6190r0143K5817J05103P1486p3468L203k1424O9061
14937A12050K6183j05174k0203J2448L1242M3434k618K135n7554o1076l0001J7800
14925c1334O6780M7319j8137N5877k4820J0782K8187L0610J9966m7821j0200m7104
$$ y = [32269, 41490, 64186, 18624, -6654, -43313, -25027, 3736, 35078, 30159, 58662, 99867, 90075, 74418, 62162, 5760, 8028, -31641, -4668, 67656, 55125, -35675, -79036, -68587, -52686, -89183, -82829, -53601, 28012, 53312, 10439, 317, 45331, 96211, 67027, 33980, 21815, 9397, 9954, 52958, 59326, 97172, 93469, 111495, 78001, 18324, 13177, 10855, 13581, 19571, 41595, 31533, 16348, 105323, 159652, 84414, 32005, 34529, 28719, -23213, 11473, 46458, -7375, 30767, 48605, 22415, -67728, -41911, 63192, 134678, 61210, 64413, 42989, 112050, 138233, 33059, 12856, 25304, 56546, 99980, 97362, 99497, 41943, -19133, -49134, -31334, 35446, 82765, 64628, 120505, 95685, 106467, 134654, 165264, 185230, 137409, 127209, 80105]
14913H0105K237o9377R37N4281K3857j5515j2275q096Q522m198L1900r896p9209
14900C273m8039m2001L4522L2201Q6204K4407L398p9691p5580l0448L6451P9214
14888B3911K8230J8666l5205p3738K7879L753L2797M7761J72l2678l8781L138
14876E905N6911N1261J8477p5517k1775n3569L9690K7151j1448J3503J7680K4846
14864I3115L1975M2952j9302m6311J1953L0666m6175p1074l5899K7543M6267O0365
$$ y = [80105, 82342, 12965, 13902, 68183, 92040, 76525, 64250, 56154, 64676, 60478, 92378, 82482, 3273, -44766, -86767, -52245, -20044, 66160, 90567, 93965, 14274, -61306, -91754, -55303, 23911, 52141, 70807, 35602, -38136, -10257, -6504, 26293, 74054, 74226, 41548, 2767, 5905, 62816, 114077, 132554, 57037, 35262, -18307, 21383, 48534, 37086, 50589, 68269, 93115, 125090, 168042, 148740, 102429, 114382, 145048, 98873, 27799, -8100, 19443, 65710, 126075]
$$ [...]
##END NTUPLES=NMR SPECTRUM
##END=
