##TITLE=Analysis number 329632
Compound Code cc 66524
Book Reference 467/186
Project Code adrs
Chemist Name benw
##JCAMPDX= 6.0         $$ Bruker NMR JCAMP-DX V2.0
##DATA TYPE= NMR SPECTRUM
##DATA CLASS= NTUPLES
##ORIGIN= Bruker BioSpin GmbH
##OWNER= nmr
$$ XWIN-NMR		Version 3.5
$$ Wed Sep 19 11:25:39 2007 GMT Daylight Time (UT+1h)  MAYBRIDGE\nmr@NMR_250MHZ
##.OBSERVE FREQUENCY= 250.131544655141
##.OBSERVE NUCLEUS= ^1H
##.ACQUISITION MODE= SIMULTANEOUS (DQD)
##.ACQUISITION SCHEME= undefined
##.AVERAGES= 16
##.DIGITISER RES= 18
##SPECTROMETER/DATA SYSTEM= dpx250
##.PULSE SEQUENCE= zg30
##.SOLVENT NAME= CDCl3
##.SHIFT REFERENCE= (INTERNAL, CDCl3, 0, 16.522)
##AUDIT TRAIL= $$ (NUMBER, WHEN, WHO, WHERE, WHAT)
$$ ##TITLE= Audit trail, XWIN-NMR		Version 3.5
$$ ##JCAMPDX= 5.01
$$ ##ORIGIN= Bruker BioSpin GmbH
$$ ##OWNER= nmr
$$ C:\u/data/dgb/nmr/ADRS/1730/pdata/1/auditp.txt
$$ ##AUDIT TRAIL=  $$ (NUMBER, WHEN, WHO, WHERE, WHAT)
(   1,<2007-09-19 11:25:19.32 +100>,<MAYBRIDGE\nmr>,<NMR_250MHZ>,
      <created by zg, POWCHK disabled, PULCHK disabled
       configuration hash MD5:
       76 6E 9A 78 1E 09 19 81 EC 84 63 8F B0 6A 59 2D
       data hash MD5: 64K
       E3 18 13 D9 E9 19 12 21 B8 12 2F 26 0C 89 56 9D>)
(   2,<2007-09-19 11:25:30.93 +100>,<MAYBRIDGE\nmr>,<NMR_250MHZ>,
      <Start of raw data processing
       ef LB = 0.3 FT_mod = 6 PKNL = 1 SI = 32K 
       data hash MD5: 32K
       3E 1B D1 9A C2 DA A1 39 64 A1 07 87 F4 0E 30 FE>)
(   3,<2007-09-19 11:25:32.56 +100>,<MAYBRIDGE\nmr>,<NMR_250MHZ>,
      <apk 
       data hash MD5: 32K
       36 1D AF E9 48 62 8A AF 51 1E CC 32 AE 64 14 AF>)
(   4,<2007-09-19 11:25:33.45 +100>,<MAYBRIDGE\nmr>,<NMR_250MHZ>,
      <abs ABSG = 5 
       data hash MD5: 32K
       E0 36 61 40 8C 39 A0 25 0C BE 27 56 4F E4 F9 21>)
$$ ##END=
$$ 
$$ hash MD5
$$ 07 5C D6 97 20 DD 02 F8 F1 62 0F D8 91 EC AE 32
##$RELAX= 
##$RELAX= 
##$RELAX= 
##$RELAX= 
##$RELAX= 
##$RELAX= 
##$RELAX= 
$$ Bruker specific parameters
$$ --------------------------
##$DU= <C:\u>
##$EXPNO= 1730
##$NAME= <ADRS>
##$PROCNO= 1
##$TYPE= <nmr>
##$USER= <dgb>
##$AMP= (0..31)
100 100 100 100 100 100 100 100 100 100 100 100 100 100 100 100 100 100 
100 100 100 100 100 100 100 100 100 100 100 100 100 100 
##$AQSEQ= 0
##$AQ_mod= 3
##$AUNM= <au_zg>
##$AUTOPOS= <17 >
##$BF1= 250.13
##$BF2= 250.13
##$BF3= 250.13
##$BF4= 250.13
##$BF5= 500.13
##$BF6= 500.13
##$BF7= 500.13
##$BF8= 500.13
##$BYTORDA= 1
##$CFDGTYP= 0
##$CFRGTYP= 5
##$CHEMSTR= <none>
##$CNST= (0..31)
1 1 145 1 1 1 1 1 1 1 1 1 1 1 1 1 1 1 1 1 1 1 1 1 1 1 1 1 1 1 1 1 
##$CPDPRG= <>
##$CPDPRG1= <>
##$CPDPRG2= <>
##$CPDPRG3= <>
##$CPDPRG4= <mlev>
##$CPDPRG5= <mlev>
##$CPDPRG6= <mlev>
##$CPDPRG7= <mlev>
##$CPDPRG8= <mlev>
##$CPDPRGB= <>
##$CPDPRGT= <>
##$D= (0..31)
0 1 0 0 0 0 0 0 0 0.06 0 0 0 0 0 0 0.0002 0 0 0 0 0 0 0 0 0 0 0 0 0 0 
0 
##$DATE= 1190197518
##$DBL= (0..7)
120 120 120 120 120 120 120 120 
##$DBP= (0..7)
150 150 150 150 150 150 150 150 
##$DBP07= 0
##$DBPNAM0= <>
##$DBPNAM1= <>
$$ [...]
##$SUBNAM7= <"">
##$SUBNAM8= <"">
##$SUBNAM9= <"">
##$SW= 20.6930455092707
##$SWIBOX= (0..15)
0 0 3 0 0 0 0 0 0 0 0 0 0 0 0 0 
##$SW_h= 5175.983436853
##$TD= 65536
##$TD0= 1
##$TE= 296.16
##$TE2= 300
##$TE3= 300
##$TEG= 300
##$TL= (0..7)
0 120 120 120 120 120 120 120 
##$TP= (0..7)
150 150 150 150 150 150 150 150 
##$TP07= 0
##$TPNAME0= <>
##$TPNAME1= <>
##$TPNAME2= <>
##$TPNAME3= <>
##$TPNAME4= <>
##$TPNAME5= <>
##$TPNAME6= <>
##$TPNAME7= <>
##$TPOAL= (0..7)
0.5 0.5 0.5 0.5 0.5 0.5 0.5 0.5 
##$TPOFFS= (0..7)
0 0 0 0 0 0 0 0 
##$TUNHIN= 0
##$TUNHOUT= 0
##$TUNXOUT= 0
##$USERA1= <user>
##$USERA2= <user>
##$USERA3= <user>
##$USERA4= <user>
##$USERA5= <user>
##$V9= 5
##$VALIST= <valist>
##$VCLIST= <CCCCCCCCCCCCCCC>
##$VD= 0
##$VDLIST= <DDDDDDDDDDDDDDD>
##$VPLIST= <PPPPPPPPPPPPPPP>
##$VTLIST= <TTTTTTTTTTTTTTT>
##$WBST= 1024
##$WBSW= 4
##$XGAIN= (0..3)
0 0 0 0 
##$XL= 0
##$YL= 0
##$YMAX_a= 303903
##$YMIN_a= -434829
##$ZGOPTNS= <>
##$ZL1= 120
##$ZL2= 120
##$ZL3= 120
##$ZL4= 120
##$ABSF1= 16.522
##$ABSF2= -4.171173
##$ABSG= 5
##$ABSL= 3
##$ALPHA= 0
##$AQORDER= 0
##$ASSFAC= 0
##$ASSFACI= 0
##$ASSFACX= 0
##$ASSWID= 0
##$AUNMP= <proc_1d>
##$AZFE= 0.1
##$AZFW= 0.1
##$BCFW= 0
##$BC_mod= 0
##$BYTORDP= 0
##$COROFFS= 0
##$CY= 12.5
##$DATMOD= 1
##$DC= 0
##$DFILT= <>
##$DTYPP= 0
##$F1P= 14.0000005364418
##$F2P= -0.99999901652339
##$FCOR= 0.5
##$FTSIZE= 32768
##$FT_mod= 6
##$GAMMA= 0
##$GB= 0
##$INTBC= 1
##$INTSCL= 1
##$ISEN= 128
##$LB= 0.3
##$LEV0= 0
##$LPBIN= 0
##$MAXI= 10000
##$MC2= 0
##$MEAN= 0
##$ME_mod= 0
##$MI= 0
##$NCOEF= 0
##$NC_proc= -4
##$NLEV= 6
##$NOISF1= 0
##$NOISF2= 0
##$NSP= 0
##$NTH_PI= 0
##$NZP= 0
##$OFFSET= 16.522
##$PC= 1
##$PHC0= 157.3593
##$PHC1= 10.23518
##$PH_mod= 1
##$PKNL= yes
##$PPARMOD= 0
##$PSCAL= 4
##$PSIGN= 0
##$REVERSE= no
##$SF= 250.13
##$SI= 32768
##$SIGF1= 0
##$SIGF2= 0
##$SINO= 400
##$SIOLD= 32768
##$SREGLST= <1H.CDCl3>
##$SSB= 0
##$STSI= 32768
##$STSR= 0
##$SW_p= 5175.98343685301
##$SYMM= 0
##$S_DEV= 0
##$TDeff= 65536
##$TDoff= 0
##$TI= <Analysis number 999999
Compound Code 99
Book Reference 9
Project Code 9>
##$TILT= no
##$TM1= 0
##$TM2= 0
##$TOPLEV= 0
##$USERP1= <user>
##$USERP2= <user>
##$USERP3= <user>
##$USERP4= <user>
##$USERP5= <user>
##$WDW= 1
##$XDIM= 32768
##$YMAX_p= 544550914
##$YMIN_p= -475767
$$ End of Bruker specific parameters
$$ ---------------------------------
##NTUPLES= NMR SPECTRUM
##VAR_NAME=  FREQUENCY,     SPECTRUM/REAL,   SPECTRUM/IMAG
##SYMBOL=    X,             R,               I
##VAR_TYPE=  INDEPENDENT,   DEPENDENT,       DEPENDENT
##VAR_FORM=  AFFN,          ASDF,            ASDF
##VAR_DIM=   32768,         32768,           32768
##UNITS=     HZ,            ARBITRARY UNITS, ARBITRARY UNITS
##FACTOR=    0.157963299565203, 1,           1
##FIRST=     4132.6476996994, 0,             0
##LAST=      -1043.33573715361, 0,           0
##MIN=       -1043.33573715361, -475767,     0
##MAX=       4132.6476996994, 544550914,     0
$$ Real data points
##PAGE= N=1
##DATA TABLE= (X++(R..R)), XYDATA
$$ [...]
19156E8602p093K8970M1977L0004j174k9897q8778o7384M1111J11436J58486K372
$$ 58602 51509 80479 122456 152460 151286 121389 32611 -34773 6338 117774 276260 278632
19144B78632j30972j00722j01388n4211O6983O7319L7878J33127M372L7575K7469
$$ 278632 147660 46938 -54450 -108661 -41678 25641 63519 196646 201018 238593 266062
19133B66062k8428j59523q2752R0343o667p0538j8877l1202J07098M9046R9765
$$ 266062 237634 78111 -4641 85702 79035 8497 -10380 -41582 65516 114562 214327
19122B14327Q6672R1770k8566l3340j48791j56509k3805j02716l4422J36956Q5414
$$ 214327 300999 392769 364203 330863 182072 25563 1758 -100958 -135380 1576 86990
19111H6990K8856J41901P3961o669j5424L6024k4755O7676R0697m9492M4101o6230
$$ 86990 115846 257747 331708 325039 309615 345639 320884 388560 479257 429765 473866 407636
19099D07636k0903R1614O3723M9224K729j12856j20099k27440j63613J01493J46980
$$ 407636 386733 478347 542070 591294 594023 481167 361068 133628 -29985 71508 218488
19088B18488o7764q2879J8424K6899k10827p0259K36267O6139M8688m9768R048
$$ 218488 150724 67845 86269 113168 -97659 -167918 68349 134488 183176 133408 142456
19077A42456L7228P8636n160O5374J03103J03604K6077j00135j28450l8263j8452
$$ 142456 179684 258320 253160 318534 421637 525241 551318 451183 322733 284470 266018
19066B66018p1034O2028K51023N1092j85145r2316m3633p0150m7262R034k4648
$$ 266018 194984 257012 508035 559127 373982 281666 238033 167883 120621 129655 105007
19055A05007q2397j7142L2748n1267L751m3183O8519k7269n003K8540M6941p8662
$$ 105007 22610 5468 38216 -13051 -9300 -52483 16036 -11233 -16236 12304 59245 -19417
19043a9417r4563O62J23970r6514k3562J01159N3187j15170J2476J30857j0615
$$ -19417 -113980 -113318 10652 -85862 -109424 -8265 44922 -70248 -57772 73085 62470
19032F2470j50182m976L4885l7718l8435q340J22010m5774l1847Q6912O3479n415
$$ 62470 -87712 -92688 -57803 -95521 -133956 -142296 -20286 -66060 -97907 -10995 52484 47069
19020D7069j68893N4272P529k8145l1602K2633J4583J4968J1656P8169l2899o4034
$$ 47069 -121824 -67552 -60023 -88168 -119770 -97137 -82554 -67586 -55930 22239 -10660 -74694
19008g4694r9257l7788J9109q5235l061J85356N1417j47905J001N1419R1560K0568
$$ -74694 -173951 -211739 -192630 -277865 -280926 -95570 -44153 -192058 -191057 -139638 -48078 -27510
18996b7510o9278M1192N9194l3781R932p1656m011J7432Q8580N6120j0454j26141
$$ -27510 -96788 -55596 3598 -30183 -20251 -91907 -95918 -78486 10094 66214 55760 -70381
18984g0381o6988J7500l469P824N1841R8916r7596o3090J9501J7925m1099J0958
$$ -70381 -137369 -119869 -123338 -115514 -63673 35243 -62353 -125443 -105942 -88017 -129116 -118158
18972a18158J75273K6467o7792O6620O8128R576L424O3119J0358r1687l7761j21647
$$ -118158 57115 83582 15790 82410 150538 160114 163538 226657 237015 145328 107567 -14080
18960a4080l1523n3476j5737K8535K5296p3474n4876L9292p3975J2904J24718
$$ -14080 -45603 -99079 -114816 -86281 -60985 -134459 -189335 -150043 -224018 -211114 -86396
18949h6396J9204n278M0682Q1644l1195N1625P560n6893n5183J9171O5107R041
$$ -86396 -67192 -72470 -31788 49856 18661 70286 77846 20953 -34230 -15059 50048 59089
18937E9089O672m6483j3958J02108J6108j39817r4054J08515O3043k8488j18167
$$ 59089 65761 19278 5320 107428 123536 -16281 -110335 -1820 61223 32735 -85432
18926h5432K0301J30589n630p6885m5069K5538p3648L1047m1893k2772M2550Q0874
$$ -85432 -65131 65458 59828 -17057 -62126 -36588 -110236 -79189 -121082 -143854 -101304 -20430
18914b0430j8390Q5312J516p3812m7533J05656J47406r3815j21455k1319J7866
$$ -20430 -38820 46492 48008 -25804 -73337 32319 179725 85910 -35545 -56864 -38998
18903c8998P254l8854J07451k4481q1822O9343M6136J2839R5688O3341L3709L0824
$$ -38998 -31744 -70598 36853 12372 -69450 -107 46029 58868 154556 217897 251606 282430
18891B82430J77375N1449j12952j15896k4751m6219J3285M9222O4042k9722j44913
$$ 282430 459805 511254 398302 282406 257655 211436 224721 273943 337985 308263 163350
18880A63350j41397m9248m0187J32426J4762n342j37511j3267N0679P9011n6795
$$ 163350 21953 -27295 -67482 64944 79706 74364 -63147 -76414 -25735 53276 -3519
18869c519n5676L9139k8816J4907m713N704Q2881L6198R8974J54696P8024n3685
$$ -3519 -59195 -20056 -48872 -33965 -38678 -32974 49907 86105 185079 339775 417799 364114
18857C64114j93834q7849n4710J25032J50736J05544p5712j06269j50684q4358
$$ 364114 170280 82431 27721 152753 303489 409033 333321 227052 76368 -7990
18847g990r882N9188j8241l9786J45642r6981o5720R2251Q1765m2449j3820q9585
$$ -7990 -17872 41316 23075 -16711 128931 31950 -33770 58481 140246 97797 83977 -5608
18835e608q9951n8104j1698P9804J05001m0341Q851J41924l0355M4696j3995l3557
$$ -5608 -95559 -153663 -165361 -85557 19444 -20897 -12046 129878 99523 144219 130224 96667
18823I6667n2147N7630J494o3884k2939l8757l9232p0O871N4152J35486M9989
$$ 96667 44520 102150 103644 39760 16821 -21936 -61168 -61238 -54367 -215 135271 185260
18811A85260m6392j08377j8065K9026Q2179N2606M3114P3398K5503n4734J8368
$$ 185260 138868 30491 12426 41452 123631 176237 219351 292749 318252 263518 281886
18800B81886L9878Q3666J61002J17852J8313P8221n6220j77968N6485P2963k2812
$$ 281886 321764 405430 566432 684284 702597 780818 724598 546630 603115 676078 653266
18789F53266k555j34842j04506n1477o7558l4167Q2078j1986j59126J1559K1275
$$ 653266 650711 515869 411363 359886 292328 258161 340239 328253 169127 180686 201961
18778B01961j9974J3061J93816K14686J90509J80061q4705k40120l4543K30824
$$ 201961 181987 195048 388864 603550 794059 974120 889415 649295 614752 845576
18768H45576L22379M41199J35008j58141l71031m96151k94455j47663j7680m1970
$$ 845576 1167955 1609154 1744162 1586021 1214990 718839 424384 276721 259041 217071
18758B17071N9770J14183M3768j01134m6977j4023O8639q0802p7894O314n4419
$$ 217071 276841 391024 434792 333658 286681 272658 341297 260495 182601 188915 134496
18747A34496n0688q8634K8840Q2308J00691p2310p8003n7168m3809R5684O454
$$ 134496 83808 -4826 24014 106322 207013 134703 56700 -468 -44277 51407 57861
18736E7861K1841P5913M0541j84825n8659l5509k2796l8016L2201N1939M080P8334
$$ 57861 79702 155615 196156 11331 -47328 -82837 -105633 -143649 -111448 -59509 -55429 22905
18724B2905l8995k400K0522o2523K477j06853J4096Q6986n054o970O4742m0302
$$ 22905 -16090 -18490 2032 -60491 -58014 -164867 -150771 -63785 -68839 -75809 -11067 -51369
18712e1369q8972K8309k5347M0220K8568M3403P4829R4884N2708o3833o4779q4120
$$ -51369 -140341 -112032 -137379 -97159 -68591 -25188 49641 144525 197233 133400 68621 -15499
18700a5499N7207P0885q454o7415Q6601K1447n8666Q3574M4127R38J2050l277
$$ -15499 41708 112593 104139 36724 123325 144772 86106 169680 213807 214745 226795 223518
18688B23518o1793J0721l8401K2274p3979j36706J5468J63790J6144j16486o856
$$ 223518 161725 172446 134045 156319 82340 -54366 -38898 124892 141036 24550 17694
18677A7694N5485K0871j7214P9705O3945J1081k1783K9870q801P0894J06770J10389
$$ 17694 73179 94050 76836 156541 220486 231567 209784 239654 230853 301747 408517 518906
18665E18906j3198j30028j22147L3992q8404j06676J28490Q0862l5563j60278
$$ 518906 505708 375680 253533 287525 199121 92445 220935 301797 266234 105956
18655A05956j40981m1143J00933J25401J14663O547o1576o1408m6329p1620O1982
$$ 105956 -35025 -76168 24765 150166 264829 271376 209800 148392 102063 30443 92425
18644I2425O1298L6366J36874O1307J12122K779j20488k5128n3702m493j39999
$$ 92425 153723 190089 326963 388270 500392 503171 382683 357555 303853 299360 159361
18633A59361n2149K5025K524P2792K8483j18907j17088m0302n4156M5759R8769
$$ 159361 107212 132237 134761 207553 236036 117129 41 -40261 -94417 -48658 50111
18622E0111j1689N2019M1346j2915l624N1915M0413q769Q746j5670N5351Q829
$$ 50111 38422 90441 131787 118872 115248 167163 207576 198807 207553 191883 247234 256063
18610B56063n9656j7826J7272J46k0372L6411J04089K9880P625l7656q5247P226
$$ 256063 196407 178581 195853 195999 175627 212038 316127 346007 353632 315976 230729 237955
18598B37955n9204j03462m3455n7413O2496O0831P9562P9467L4577M4418R3524
$$ 237955 178751 75289 31834 -25579 36917 97748 177310 256777 291354 335772 429296
18587D29296m7848k0374K7222q7909j50971K1782J09493O0390p757r1759p2183
$$ 429296 381448 361074 388296 300387 149416 171198 280691 341081 333324 241565 169382
18576A69382N7098N5853K1610L1845n2396l2563N7012L3927O1770J52026J12707
$$ 169382 226480 282333 303943 335788 283392 250829 307841 341768 403538 555564 668271
18565F68271N6787N5821n2692m5434r42K5034J24887J9079J11543J82726J64164
$$ 668271 725058 780879 728187 682753 681811 706845 831732 850811 962354 1145080 1309244
18554A309244J00233L4684L17462J95506R8314j357m3495O7356J96977K09148
$$ 1309244 1409477 1444161 1761623 1957129 2055443 2054086 2010591 2077947 2274924 2484072
18544B484072L66531L10404K21424K73440K11917L19976L06810L99425N44961
$$ 2484072 2850603 3161007 3382431 3655871 3867788 4187764 4494574 4893999 5438960
18535E438960Q19428J025578J096193J360633J494288J808099K363388L250460
$$ 5438960 6258388 7283966 8380159 9740792 11235080 13043179 15406567 18657027
18527A8657027M565750P126795J1901156K0074584K7711322J6260952q406153
$$ 18657027 23222777 30349572 42250728 62325312 90036634 106297586 97891433
18520I7891433j8893336j6396853p164716L109168J4175897K2605904J0454170
$$ 97891433 78998097 62601244 55436528 58545696 72721593 95327497 105781667
18513A05781667j4114541k3496109k0738556j3242251p522094m706812l273572
$$ 105781667 91667126 68171017 47432461 34190210 26668116 21961304 18687732
18506A8687732k283448j267864m63912J62880L15829O13877J090693J304832J625876
$$ 18687732 16404284 15136420 14672508 14835388 15151217 15765094 16855787 18160619 19786495
18497A9786495K254828L522544N287789Q656193J4669721K4551751L0474700J1801093
$$ 19786495 22041323 25563867 30851656 39507849 54177570 78729321 109204021 121005114
18489A21005114j4397091k2124353j6836220n686866N839696J8016099K3865752
$$ 121005114 106608023 84483670 67647450 61960584 67800280 85816379 109682131
18482A09682131M881014j9900970k6837395k2250518j4124131q130386n195883
$$ 109682131 114563145 94662175 67824780 45574262 31450131 23319745 18123862
18475A8123862l681409k741172j800732j329376j010076q55736n21615n12608
$$ 18123862 14442453 11701281 9900549 8571173 7561097 6705361 6183746 5671138
18467E671138m05052l86675l23590k62609k85948l33254k35182l00861l27394
$$ 5671138 5266086 4879411 4555821 4293212 4007264 3674010 3438828 3137967 2810573
18458B810573l22811k14160j0374Q8802O0720q4917k21107j78349m7391j89502
$$ 2810573 2487762 2273602 2263228 2352030 2412750 2327833 2106726 1928377 1880986 1691484
18448A691484r6901o2090o3987r6120j15291r3997o6125p9577o6569o3136j04642
$$ 1691484 1594583 1532493 1468506 1372386 1257095 1163098 1096973 1017396 950827 887691 783049
18437G83049p551O0898J05206M6745j15507q6063M7127L9311o6939j03205p8165
$$ 783049 775498 836396 941602 988347 872840 786777 833904 873215 806276 703071 624906
18426F24906j08332j1877m2203p641R6887m8360J40399n0461N9287M1390m0944
$$ 624906 516574 504697 462494 454853 551740 503380 643779 593318 652605 693995 653051
18415F53051j04195q5442j13515o6233j35625O6605R9043O0909j07356k3974R0089
$$ 653051 548856 463414 349899 283666 148041 214646 313689 374598 267242 243268 333357
18404C33357K03081m3866j07653j7909J8852Q738q69m3649J7215J16168k2161
$$ 333357 536438 492572 384919 367010 385862 394600 393731 350082 367297 483465 461304
18393D61304m1411n799o7396p4493o5913j06265q3550q975O8074N033m5848N6513
$$ 461304 419893 414094 346698 272205 206292 100027 16477 7502 75576 80609 34761 91274
18381I1274P4400j26203J6305J00340n8040j16727N983K48256o954o8718r982
$$ 91274 165674 39471 55776 156116 98076 -18651 -12668 235588 228634 159916 149934
18370A49934l5626R0487R035p8502N5359K2705J09410M4511n2424n3302j35712
$$ 149934 114308 204795 213830 135328 190687 213392 322802 367313 314889 261587 125875
18359A25875n5468J25j6351M486m3492N1019m2412k7743k8946l822L9670O5832
$$ 125875 70407 70532 54181 58667 15175 66194 23782 -3961 -32907 -36729 2941 68773
18347F8773j0737j122N2472m5646j5973O4797J185l6694P3166q05N4726O4791
$$ 68773 58036 56914 109386 63740 47767 112564 113749 77055 150221 149416 204142 268933
18335B68933j34769j90000n8018l2411M1309J78159M0354K8669r1899K782M4907
$$ 268933 134164 -55836 -113854 -146265 -104956 73203 113557 142226 50327 53109 98016
18324I8016N0772j18214k558J02822R7731r0091j65939P0593K05486N9651j35199
$$ 98016 148788 30574 28016 130838 228569 138478 -27461 43132 248618 308269 173070
18313A73070j01952M5934M5655J11293n4554n1723l2538l0053J5545p4264L5593
$$ 173070 71118 117052 162707 274000 219446 167723 135185 105132 120677 46413 82006
18302H2006j07328k2066J00116k8231P2824N7665o1088Q2289m203q7854p4107
$$ 82006 -25322 -47388 52728 24497 97321 154986 93898 176187 171984 84130 10023
18291A0023l9851N724O6000P1765j14080m8929m5241o5873K8845P483j1898J41639
$$ 10023 -29828 -24104 41896 113661 -419 -49348 -94589 -160462 -131617 -124134 -136032 5607
18279E607L0265o8181J17154J05219J10434j25025k369j11100q4797L6397k3124
$$ 5607 35872 -32309 84845 190064 300498 175473 173104 62004 -22793 13604 -9520
18268i520k0037J9525l6701n8451K8720M8787Q478P3565N9823m3510j5994O0088
$$ -9520 -29557 -10032 -46733 -105184 -76464 -27677 -19199 54366 114189 70679 54685 114773
18256A14773N6008R373r697p7774n8933l6073k5279J72203j5412j99491o8715
$$ 114773 170781 180154 170457 92683 33750 -2323 -27602 144601 129189 -70302 -139017
18245a39017Q34Q9924L5030J9495J6254J15298J47059k1546L1605L9479m9640
$$ -139017 -138183 -48259 -13229 6266 22520 137818 284877 263331 294936 334415 284775
18234B84775M2665j29127j60909p9667l2977M1596q676l2440J6437M4744l9835
$$ 284775 327440 198313 37404 -42263 -75240 -33644 -42320 -74760 -58323 -13579 -53414
18223e3414j23M2634K9940k4796j07176j53687J01828K21953J0720n3235N9169
$$ -53414 -53537 -10903 19037 -5759 -112935 -266622 -164794 57159 67879 14644 73813
18212G3813J32801O3996J591L4161j23398p0681J5559k970N4089O1409j07741
$$ 73813 206614 270610 272201 306362 182964 112283 127842 124872 178961 240370 132629
18201A32629k4709o5488o5480N6823P1685M664m0687l8978j2407M1074q5580R3031
$$ 132629 107920 42432 -23048 33775 105460 110124 69437 30459 18052 59126 -26454 66577
18189F6577K3796l1725o0770j06416L9085J30322Q4979M5194O7252P3293M1709
$$ 66577 90373 58648 -2122 -108538 -69453 60869 145848 191042 258294 331587 373296
18178C73296k9340j0528J6244J1480j06382n5210r682k3896P2026M2831J02726
$$ 373296 343956 333428 349672 361152 254770 199560 189878 165982 238008 280839 383565
18167C83565J27713N5723m8561j245k8122j21584M480n15P4420M9895J49515M1571
$$ 383565 511278 567001 518440 517195 489073 367489 371969 371454 445874 495769 645284 686855
18155F86855j71966P2982N3937J9293J01776P5184q2476m275L4700J06894J47882
$$ 686855 514889 587871 641808 661101 762877 838061 755585 751310 786010 892904 1040786
18144A040786P4090J22343R9685j3499o7454J82759L7444Q6100J54367K13816
$$ 1040786 1114876 1237219 1336904 1323405 1255951 1438710 1476154 1562254 1716621 1930437
18134A930437l0711P9903K96502L16095K29164J28218M25839M84406M45105N37492
$$ 1930437 1899726 1979629 2276131 2592226 2821390 2949608 3375447 3859853 4304958 4842450
18124D842450Q86921J036196J006743J408298J620288K063281K303492K824570
$$ 4842450 5729371 6765567 7772310 9180608 10800896 12864177 15167669 17992239
18116A7992239L572044M974657P268396J1445361J9651122L5514788O1407119
$$ 17992239 21564283 26538940 33807336 45252697 64903819 100418607 161825726
18109A61825726N6323246j4233382n3076360n3469648l6389142k0184597j1653995
$$ 161825726 218148972 203915590 150839230 97369582 60980440 40795843 29141848
18102B9141848p523275n217066l652873k616731j735116j124673r18498q97733
$$ 29141848 21618573 16401507 12748634 10131903 8396787 7272114 6353616 5455883
18094E455883o55608m75224n10477m88606m99523l53603j77625o1537j05780q3346
$$ 5455883 4800275 4325051 3814574 3325968 2826445 2472842 2295217 2233680 2127900 2044554
18084B044554j13970n2751L0786l8289j30511j17549k8632l4954l1972r1763o4273
$$ 2044554 1930584 1877833 1908619 1870330 1739819 1622270 1593638 1558684 1526712 1434949 1370676
18073A370676n3191j45674j91090j24423K3623J00819j3177j04313j34368r8333
$$ 1370676 1317485 1171811 980721 856298 879921 980740 967563 863250 728882 630549
18063F30549p4518J06421L9480j35238J846M7701J08868Q5305o8109k2653J5864
$$ 630549 556031 662452 701932 566694 568540 616241 725109 810414 742305 719652 735516
18052G35516L2278K0985M2797j58823r2872j14313N5841J00627J5003J5322M1375
$$ 735516 767794 788779 831576 672753 579881 465568 521409 622036 637039 652361 693736
18041F93736P017j29836j8626J56058N5442r694q500p4423k0163J9659Q0042K1034
$$ 693736 700753 570917 552291 708349 763791 754097 745597 671174 651011 670670 750712 771746
18029G71746K3713Q5165J0909Q6640J23517k052m3995N4524o6067m2515K187K5251
$$ 771746 795459 880624 891533 978173 1101690 1099638 1055643 1110167 1044100 1001585 1003772 1029023
18017A029023J5301M5850Q6491P7421J32703J10705K30018J71545L8106r0681
$$ 1029023 1044324 1090174 1176665 1254086 1386789 1497494 1727512 1899057 1937163 1846482
18007A846482r7556o1049n4209J14886J34983K66202M10764K83820J63513L14140
$$ 1846482 1748926 1687877 1633668 1748554 1883537 2149739 2560503 2844323 3007836 3321976
17997C321976M19048L99648M90585N21505N12426O66750Q39870J077968J374434
$$ 3321976 3741024 4140672 4631257 5152762 5665188 6331938 7171808 8249776 9624210
17988I624210J520138J988704K840664L757660N586998R134524J5880821K6930806
$$ 9624210 11144348 13133052 15973716 19731376 25318374 34452898 50333719 77264525
17980G7264525L0606286M095279k1449405k6298996k0820223j2634698p368085
$$ 77264525 107870811 111966090 90516685 64217689 43397466 30762768 23394683
17973B3394683m458399k859581j804072j068519m83428J78545M66349Q19981J223712
$$ 23394683 18936284 16076703 14272631 13204112 12720684 12899229 13365578 14185559 15409271
17964A5409271J560492K025688L083997M726808P073542J1449505J9647507L0034931
$$ 15409271 16969763 18995451 22079448 26806256 33879798 45329303 64976810 95011741
17956I5011741K3042005o864205k1793862k0745217j1418478p22856R794264K1657824
$$ 95011741 118053746 111189541 89395679 68650462 57231984 56509128 66303392 87961216
17948H7961216K0897579n257133k2695006k4030238j7659840j0555035o357755
$$ 87961216 108858795 103601662 80906656 56876418 39216578 28661543 22303788
17941B2303788m057567k538086j653879j059450p00184j78604R4174N54243R76163
$$ 22303788 18246221 15708135 14054256 12994806 12294622 12116018 12210192 12764435 13740598
17932A3740598J285320J576034K499762M001701O385254J0731691J8741024K7235584
$$ 13740598 15025918 16601952 19101714 23103415 29488669 40220360 58961384 86196968
17924H6196968J4497798j3363748k3567663k1380180j3845592q110357n012853
$$ 86196968 100694766 87331018 63763355 42383175 28537583 20427226 15414373
17917A5414373l224300k191296j501692q13755k82391n03356p28630r26957o45901
$$ 15414373 12190073 9998777 8497085 7683330 7400939 6897583 6168953 5241996 4596095
17908D596095n05603l30971k85056l60298l16242l19329j52677j99443l12399
$$ 4596095 4090492 3759521 3474465 3114167 2797925 2478596 2325919 2126476 1814077
17899A814077j07564J6023J9891M2325k1889p0014j11169j47465k09864r5904
$$ 1814077 1706513 1722536 1742427 1784752 1762863 1692849 1581680 1434215 1224351 1128447
17889A128447Q3230q3338l1545p2706j02256l3510n1085j71205M1465N4004j08392
$$ 1128447 1211677 1128339 1096794 1024088 921832 888322 837237 666032 707497 761501 653109
17878F53109j26869O4131O0766k5459n0079m3268L8393L3179o3366j4151j06520
$$ 653109 526240 590371 651137 625678 575599 532331 570724 603903 540537 526386 419866
17867D19866J20580J5899p9343m6808m6453J0202J0474Q4638o4285l5557R6259
$$ 419866 540446 556345 477002 430194 383741 393943 404417 489055 424770 389213 485472
17856D85472p2369q1899J2013j29089j50951O589J03710J99079L2674r0219J2056
$$ 485472 413103 331204 343217 214128 63177 69766 173476 372555 405229 315010 327066
17845C27066k64m368l1989n3589m0243r8098K7354J22510p1075n290m4795J0552
$$ 327066 326802 322434 290445 236856 196613 98515 125869 248379 177304 172014 127219 137771
17833A37771K7466k5872P3534o4258r347N3896J4083K1617m1144L3901j9727j13570
$$ 137771 165237 139365 212899 148641 139294 193190 207273 228890 187746 221647 201920 88350
17821H8350o4061N7747Q4376J20976k0676j19906j58600L7763J00333p7296J2862
$$ 88350 24289 82036 166412 287388 266712 146806 -11794 25969 126302 49006 61868
17810F1868R3078j5152p4913k0153q159o0501o6948R2138J04715L9951L8338j64775
$$ 61868 154946 139794 64881 44728 36569 -23932 -90880 1258 105973 145924 184262 19487
17798A9487p5108J2031N3543L8399J54070n6919p9127j31403l7512L628J18095
$$ 19487 -55621 -43590 9953 48352 202422 145503 66376 -65027 -102539 -98911 19184
17787A9184J16462l9288k7873k5233L9310O5944P1181j29287o5958m2063M4751
$$ 19184 135646 96358 68485 43252 82562 148506 219687 90400 24442 -17621 27130
17776B7130n1439j64716O7631J47753J56360J0467m8362Q8633J2778l3789r5850
$$ 27130 -24309 -189025 -121394 26359 182719 193186 144824 233457 246235 212446 116596
17765A16596k7151P1360k197p4969o3034J02120N4456j16796m5751j5505l4073
$$ 116596 89445 160805 158608 83639 20605 122725 177181 60385 14634 -871 -34944
17754c4944m1982j579k5531Q0950J23155j39695j54895J13699J38562j2473J3825
$$ -34944 -76926 -78505 -104036 -23086 100069 -39626 -194521 -80822 57740 45267 59092
17743E9092j08635j15377p8211N6458Q2809q369L8253p688J7815J0813q5694j22197
$$ 59092 -49543 -164920 -243131 -186673 -103864 -112233 -73980 -81668 -63853 -53040 -138734 -260931
17731b60931k0333O3889J90308M7208J1768l8941L7408O9977j21847m5718J9310
$$ -260931 -281264 -217375 -27067 20141 31909 -7032 30376 100353 -21494 -67212 -47902
17720d7902R7492O5070R1140j0901p7967j187l4801K3662o014L0569o0332q1345
$$ -47902 49590 114660 205800 194899 116932 115745 80944 104606 98592 129161 68829 -12516
17708a2516j3524l6561m1635J8294j09977o1192k6907J12422L7527Q6679n5948
$$ -12516 -26040 -62601 -104236 -85942 -195919 -257111 -284018 -171596 -134069 -47390 -103338
17697a03338j00861J5507N6602J3855J9756Q782n3403k3641n686N3461m36J49050
$$ -103338 -204199 -188692 -132090 -118235 -98479 -89697 -143100 -166741 -172427 -118966 -119402 29648
17685B9648k2136j48072J5595k7161j7830K3795J42082Q5830l590m4185L6554
$$ 29648 7512 -140560 -124965 -152126 -169956 -146161 -4079 81751 78161 33976 70530
17674G0530m1999k0602J09603P917p9395o7578p511J03501J6066n6462M566J13210
$$ 70530 28531 7929 117532 125449 46054 -21524 -29035 74466 90532 34070 38636 151846
17662A51846n123p9564k494J64016P8685p1389j33803l0136m4532q7635L0302
$$ 151846 146723 67159 64665 228681 307366 235977 102174 72038 27506 -60129 -29827
17651b9827J694O079j7969l7185p1185J8884L7776r8438p347J27926J83098l8644
$$ -29827 -28133 -22054 -40023 -77208 -148393 -129509 -91733 -190171 -197518 -69592 113506 74862
17639G4862p6135L6313J41365j5196k48289n3795J6898K9129P951J34728Q4375
$$ 74862 -1273 35040 176405 161209 -87080 -140875 -123977 -94848 -86897 47831 132206
17628A32206K0764o1045M5537k6127j8344m6716N5175O5891K9659m0585P1261
$$ 132206 152970 91925 137462 111335 92991 46275 101450 167341 197000 156415 227676
17617B27676Q606j31474j32703l4196P6905M8111o536k7431n2882m1140M10K5604
$$ 227676 236282 104808 -27895 -62091 14814 62925 56389 28958 -23924 -65064 -64654 -39050
17605c9050p2525j09181k0312N4227K6869K2717j45532K0967J14771k0342L7252
$$ -39050 -111575 -220756 -241068 -186841 -159972 -137255 -282787 -261820 -147049 -167391 -130139
17594a30139R4180m8540P9565O2956J5841j49319R8846L9463n5932j75348N6580
$$ -130139 -35959 -84499 -4934 58022 73863 -75456 23390 62853 6921 -168427 -111847
17583a11847R2437L4954J27938l0852l6057J05583L0217K2091L0352L8448r1667
$$ -111847 -19410 15544 143482 112630 76573 182156 212373 234464 264816 303264 211597
17572B11597l5547j55153q1630o6658J7941M5807l0637N239J7586N6859J615J6992
$$ 211597 176050 20897 -60733 -127391 -109450 -63643 -94280 -89041 -71455 -14596 -12981 4011
17560D011J10424J5917l2942o0992j7306M0314o9323M2820m6422m4790J5319N2989
$$ 4011 114435 130352 97410 36418 19112 59426 -9897 32923 -13499 -58289 -42970 10019
17548A0019r3122j30851J3131M0915J14178O7437n0537j46762Q3367N5840l7516
$$ 10019 -83103 -213954 -200823 -159908 -45730 21707 -28830 -175592 -92225 -36385 -73901
17537g3901P3916N607P904m5058k4195k5077j2061M7530k5329K5049j7263N3574
$$ -73901 15 5622 13526 -31532 -55727 -80804 -92865 -45335 -70664 -45615 -62878 -9304
17525i304Q3414J05719j56944q0276Q8226L6440N2835P6905j0340q972M2137o2714
$$ -9304 74110 179829 22885 -57391 30835 67275 120110 197015 186675 177703 219840 157126
17513A57126j27408J9942n7921j23278q2444l2973J0900P621l9210J8892L1334
$$ 157126 29718 49660 -8261 -131539 -213983 -246956 -236056 -228435 -267645 -248753 -217419
17502b17419J01826j7235l9394K3090J12151R0796o907l4052m559n1888j53403
$$ -217419 -115593 -132828 -172222 -149132 -36981 53815 46908 12856 8297 -43591 -196994
17491a96994j19934l832M7508O3180J11536M293R6214J6425n4634m6563Q9016
$$ -196994 -316928 -320760 -273252 -210072 -98536 -94243 1971 18396 -36238 -82801 6215
17480F215m3816R5906J18098k2736p8618P125J58923O8113J53143P8895o3753
$$ 6215 -37601 58305 176403 153667 75049 82174 241097 309210 462353 541248 477495
17469D77495j67879j51843R9762J12564Q7103M2078p3233j26250J616K8608P3819
$$ 477495 309616 157773 257535 370099 457202 499280 426047 299797 301413 330021 403840
17458D03840o8536j37845j27511k9672N7930J39749m6364l8052O7935o8153K3503
$$ 403840 335304 197459 69948 40276 98206 237955 191591 153539 221474 153321 176824
17447A76824K3465R6060K45415N03111N56547k7929k89064l48789l18648k36821
$$ 176824 200289 296349 541764 1044875 1601422 1573493 1284429 935640 616992 380171
17437C80171j46235n7811Q2062R4928n8577j45966O0515J8463m4024J18175J09548
$$ 380171 233936 176125 258187 353115 294538 148572 209087 227550 183526 301701 411249
17426D11249K1708P206K9774o7508Q1806P5080J7477J03774J81550j54004j46860
$$ 411249 432957 440163 469937 402429 484235 559315 576792 680566 862116 708112 561252
17415E61252j49531r8828J16114J85594Q9178J38150p0187k94222k96009j82761
$$ 561252 411721 312893 429007 614601 703779 841929 771742 477520 181511 -1250
17405a250J7140J24962J12912n2208o106m7009j31282r7856J72249O4875Q523
$$ -1250 15890 140852 253764 201556 195450 148441 17159 -80697 91552 156427 164950
17394A64950Q306k002j26646J0003R7240L8912J00942J14524l9363j92489r921
$$ 164950 173256 171254 44608 54611 151851 190763 291705 406229 366866 174377 164456
17383A64456K6130r3633m3194k1722o0839l9895K8894m2812K5494n5516J21365
$$ 164456 190586 96953 53759 32037 -28802 -68697 -39803 -82615 -57121 -112637 8728
17372H728k925J8396m0337o3224r4576j3149R8613J47667m513o9391q7349M7791
$$ 8728 5803 24199 -16138 -79362 -173938 -187087 -88474 59193 54680 -14711 -102060 -54269
17360e4269N5419k5358r3026p1149q3964J8571J21808N177j4449K2181M7351m6659
$$ -54269 1150 -24208 -117234 -188383 -272347 -253776 -131968 -126791 -141240 -119059 -71708 -118367
17348a18367n0091J00869n510J4589N6906L5174j59478j94422J0280J21830L704
$$ -118367 -168458 -67589 -73099 -58510 -1604 33570 -125908 -320330 -310050 -188220 -184516
17337a84516l2440J476J0432L2987J03146k7297l3832J23988O2453k3904p0746
$$ -184516 -216956 -215480 -205048 -172061 -68915 -96212 -130044 -6056 56397 32493 -38253
17326c8253n9988j01826M8132L9131P8941J3193j06100K0320J26267J39773M2208
$$ -38253 -98241 -200067 -151935 -112804 -33863 -20670 -126770 -106450 19817 159590 201798
17315B01798l8317k1146m1969j26420m459J06326o7326M9305K210r6060p8011
$$ 201798 163481 142335 100366 -26054 -30513 75813 8487 57792 60002 -36058 -114069
17304a14069R503m058p7677M7037N6952m2260q566J50404J4943k9835l6001j23789
$$ -114069 -104566 -108624 -186301 -139264 -82312 -124572 -133138 17266 32209 2374 -33627 -157416
17292a57416J22208K40106K408j30750j64655R852J23290L6352j12432j67062
$$ -157416 -35208 204898 207306 76556 -88099 -78247 45043 81395 -31037 -198099
17282a98099j0884J05596L9392l2132J18166O6975k22948p0068K9842k329k666
$$ -198099 -208983 -103387 -63995 -96127 22039 89014 -133934 -204002 -174160 -176489 -179155
17271a79155j31567l3514k3428M2005Q9929O8560R9737N0774p8905j06783O5364
$$ -179155 -310722 -344236 -367664 -325659 -235730 -167170 -67433 -16659 -95564 -202347 -136983
17260a36983N4606m7661r9689m4843J06270J3664L2057J02548K5782L8138q032
$$ -136983 -82377 -130038 -229727 -274570 -168300 -154636 -122579 -20031 5751 43889 35857
17249C5857m8654n7290o4244o5044N4229J0505o9461J13828J14129j075j4325
$$ 35857 -12797 -70087 -134331 -199375 -145146 -134641 -204102 -90274 23855 22780 8455
17238H455r6553J01835l9646j41151o4095J01723Q933p7313k8269m1558K3002
$$ 8455 -88098 13737 -25909 -167060 -231155 -129432 -120499 -197812 -226081 -267639 -244637
17227b44637K8905n1499O156O0708J83436J01306q0958j34548j20004r1798J43348
$$ -244637 -215732 -267231 -261075 -200367 -16931 84375 3417 -131131 -251135 -342933 -199585
17216a99585j25940n9260J56418R2991J7748l1846j6529P7842k5799m8253q4548
$$ -199585 -325525 -384785 -228367 -135376 -117628 -149474 -166003 -88161 -113960 -162213 -246761
17205b46761P41L0322Q0830R6244n981P487l1209k27654l4029M1259j03249N6376
$$ -246761 -246020 -215698 -134868 -38624 -44605 -37118 -68327 -295981 -330010 -288751 -392000 -335624
17193c35624J17199M7458J13880m3948q9638k9434p8248O8803J79096J18468k9744
$$ -335624 -218425 -170967 -57087 -101035 -190673 -220107 -298355 -229552 -50456 68012 38268
17182C8268K4744J8793m1580p7924o4840j14009J33483M7244o777M9443m5707
$$ 38268 63012 81805 40225 -37699 -102539 -216548 -83065 -35821 -42598 6845 -38862
17171c8862p2340j12517o8149R7223N7135l4188o0375j2963J12726l345l4228
$$ -38862 -111202 -223719 -291868 -194645 -137510 -171698 -232073 -245036 -132310 -135655 -169883
17160a69883L1498K0347k8022J48155K2254n4313L7580l0217q6035l3421M4905
$$ -169883 -138385 -118038 -146060 2095 24349 -29964 7616 -22601 -108636 -142057 -97152
17149i7152Q8701M0321k4202j3221K6058K664m1606o9152K8390L815P1554J1800
$$ -97152 -8451 31870 7668 -5553 20505 23169 -18437 -87589 -59199 -55384 16170 27970
17137B7970j46875l7940M6190P3420k0684m4718j1264o5644L3927O6502o3690
$$ 27970 -118905 -156845 -110655 -37235 -57919 -102637 -113901 -179545 -145618 -79116 -142806
17126a42806l2946K2498O8434O8353l5076q7271j85159R8891O6958k7183O7487
$$ -142806 -175752 -153254 -84820 -16467 -51543 -138814 -323973 -225082 -158124 -185307 -117820
17115a17820m0142j44580m4280M0078Q100m0206k5696o1116P1655N2929J15663
$$ -117820 -157962 -302542 -346822 -306744 -298644 -338850 -364546 -425662 -354007 -301078 -185415
17104a85415O5309N2931N9197j12070p9150J48753m8442j34498r216R1569k1616
$$ -185415 -120106 -67175 -7978 -120048 -199198 -50445 -98887 -233385 -242601 -151032 -172648
17093a72648J34921Q1445j21928l3341N3315K5642l5186j28188o5383J16322N9319
$$ -172648 -37727 43718 -78210 -111551 -58236 -32594 -67780 -195968 -261351 -145029 -85710
17082h5710k7295q7486K3328Q5358J02845j61607n590k7285p6604J01585O5539
$$ -85710 -113005 -200491 -177163 -91805 11040 -150567 -156157 -183442 -260046 -158461 -92922
17071i2922J2433m562j7205L5531L9664j38021r8797l7294R4807Q903L8265j17885
$$ -92922 -80489 -85051 -102256 -66725 -27061 -165082 -263879 -301173 -206366 -197463 -159198 -277083
17059b77083j7320J06700J36285M5206l6064r024P296L1479l4655n4526k18245
$$ -277083 -294403 -187703 -51418 -6212 -42276 -51300 -44004 -12525 -47180 -101706 -319951
17048c19951q8058m9498o495P3124Q2299R1073M0646j17867k0878M2819K0964
$$ -319951 -408009 -457507 -464002 -390878 -308579 -217506 -176860 -294727 -315605 -272786 -251822
17037b51822N3138m1385l1783P7342J13204j71755q0818P6992N5746M5158k5701
$$ -251822 -198684 -240069 -271852 -194510 -81306 -253061 -333879 -256887 -201141 -155983 -181684
17026a81684M1967M4819N5759k0661j50144j13129M1487M7604R7203J17970k8128
$$ -181684 -139717 -94898 -39139 -59800 -209944 -323073 -281586 -233982 -136779 -18809 -46937
17015d6937j2055j07288l9782L2692n0738l8399N5591J58458P9975l9920K9369
$$ -46937 -58992 -166280 -206062 -173370 -224108 -262507 -206916 -48458 31517 -8403 20966
17004B0966L943o7182m467K6148K9169n177J10167K0775j20718j19518r616J03760
$$ 20966 24909 -42273 -46740 -20592 8577 3400 113567 134342 13624 -105894 -115510 -11750
16992a1750l5369n5949j03084N5650O1862j00474r0329J02647R1900M3247K0946
$$ -11750 -47119 -103068 -206152 -150502 -88640 -189114 -279443 -176796 -84896 -41649 -20703
16981b0703R7192j4596j5639r9920j61278J1605L1530m0767N959Q5766O5247N2034
$$ -20703 76489 61893 46254 -53666 -214944 -203339 -171809 -212576 -206617 -120851 -55604 -3570
16969c570J1424r5103j57295k8342L5581P2208O1948J3667p0989k1591L2463m7019
$$ -3570 7854 -87249 -244544 -272886 -237305 -165097 -103149 -89482 -160471 -182062 -149599 -196618
16957a96618m9419M9534O0562J00727J27869n2937j03727n514J7454m1364m7159
$$ -196618 -246037 -196503 -135941 -35214 92655 39718 -64009 -69523 -52069 -93433 -140592
16946a40592P6991L73m9337M8194O4957j7335q414q4114n9272O2686j3770L8909
$$ -140592 -63601 -63228 -112565 -64371 586 -16749 -25163 -109277 -168549 -105863 -119633 -80724
16934h0724n3391j85409K8545Q3229J18939R8097j02294N9445j4004k7196q2063
$$ -80724 -134115 -319524 -290979 -207750 -88811 9286 -93008 -33563 -47567 -74763 -156826
16923a56826L3257J50094J1263l275l0121l0390M215k3898k2070Q3073N195M8052
$$ -156826 -123569 26525 37788 34513 4392 -25998 -21783 -45681 -67751 15322 20517 68569
16911F8569L6690n6952p5266j06976j5964M8626l212J4918N4967K3043k6213j6797
$$ 68569 105259 48307 -26959 -133935 -149899 -101273 -104485 -89567 -34600 -11557 -37770 -54567
16899e4567k5483J59060K7837k0424l6206j7858n8228o6027L1345j04P1569o6720
$$ -54567 -80050 79010 106847 86423 50217 32359 -25869 -91896 -60551 -60655 10914 -55806
16887e5806q4022M3885L6761q7349L5747N7288k6602r1877m4085k1078J07483
$$ -55806 -139828 -95943 -59182 -146531 -110784 -53496 -80098 -171975 -216060 -237138 -129655
16876a29655N5885m0865L7641J01169j48923j16507M5982N8447k2696Q4047J1223
$$ -129655 -73770 -114635 -76994 24175 -124748 -241255 -195273 -136826 -159522 -75475 -64252
16865f4252p3233M1573o1521P184J21194j81792L7764J11905J1173m1939K0551
$$ -64252 -137485 -95912 -157433 -150249 -29055 -210847 -173083 -61178 -50005 -91944 -71393
16854g1393j4887k5990o1320M9934R4921l4740o3396l331J4789J1472p0417J19827
$$ -71393 -86280 -112270 -173590 -123656 -28735 -63475 -126871 -130202 -115413 -103941 -174358 -54531
16842e4531R083n0086n2610R7473R5757o305j54432j27737K9627R0435j9538n4218
$$ -54531 -45448 -95534 -148144 -50671 45086 38781 -115651 -243388 -213761 -123326 -142864 -197082
16830a97082O479J09485k5325O5650j8844J3812L0283J12694r0648j08661r6551
$$ -197082 -190603 -81118 -106443 -40793 -59637 -45825 -15542 97152 6504 -102157 -198708
16819a98708J01494J27469o0939l7323N9787P5999j34894o4998R1846l2425J6315
$$ -198708 -97214 30255 -30684 -68007 -8220 67779 -67115 -132113 -40267 -72692 -56377
16808e6377R131J1632l7504J8461m0008o2300j8590m7105k362q02R0919L0900
$$ -56377 -47246 -35614 -73118 -54657 -94665 -156965 -175555 -222660 -225022 -225824 -134905 -104005
16796a04005J21373J5833j71p8920l1093O9572M3939r695j8346k097O3788O8797
$$ -104005 17368 33201 33030 -45890 -76983 -7411 36528 26833 8487 6390 70178 138975
16784A38975l0226j2013M2255J5294N1654j37795k28084J9830P2112K3776J5461
$$ 138975 108749 96736 138991 154285 205939 68144 -159940 -140110 -67998 -44222 -28761
16773b8761P0528n0785j43190N2140r264l7267l3561m0486K2140J9813j5390L263
$$ -28761 41767 -9018 -152208 -100068 -109332 -146599 -180160 -220646 -198506 -178693 -194083 -190820
16761a90820j6280r6112O6037P4240k3134P1237o959k6479N8318j11126Q6424
$$ -190820 -207100 -303212 -237175 -162935 -186069 -114832 -121791 -148270 -89952 -201078 -114654
16750a14654O2067J2119k8034j18861R3825L482o2605Q2093J72454k4946j36702
$$ -114654 -52587 -40468 -68502 -187363 -93538 -90056 -152661 -70568 101886 76940 -59762
16739e9762l0590M7843p4163M8303J39794r3888k1601L6077O3828l1050j14520
$$ -59762 -90352 -42509 -116672 -68369 71425 -22463 -44064 -7987 55841 24791 -89729
16728h9729Q1967l5488m8337J1026L1112k3252K1645j1667j22795J4277j8868
$$ -89729 -7762 -43250 -91587 -80561 -49449 -72701 -51056 -62723 -185518 -171241 -190109
16717a90109l2253J03615J72405R0171q3204q4538l0330n8525N9326n044J2205
$$ -190109 -222362 -118747 53658 143829 60625 -23913 -54243 -112768 -53442 -58486 -46281
16706d6281K7986j38192p7527J38741J02307r689k154k9001O364j25610L202J01134
$$ -46281 -18295 -156487 -234014 -95273 7034 -2655 -4809 -33810 -27446 -153056 -149854 -48720
16694d8720r699r1593j15713O5198L4821P5552J48168M9436m5314n7256K1205
$$ -48720 -58419 -150012 -265725 -200527 -165706 -90154 58014 107450 62136 4880 26085
16683B6085l373J03141j14759M2946J1532j5899j39089r9342K953J3218n085O0833
$$ 26085 22712 125853 11094 54040 65572 49673 -89416 -188758 -185805 -172587 -177672 -116839
16671a16839P973r7635l337k9119O0080q242M7055j9111r79P7125R8739p7897
$$ -116839 -108866 -206501 -209838 -238957 -178877 -187119 -140064 -159175 -160154 -83029 15710 -62187
16659f2187m6359n1205r690L7733P4996o0869l3160n6204m7185J66782o3189m7064
$$ -62187 -108546 -159751 -169441 -131708 -56712 -117581 -150741 -206945 -254130 -87348 -150537 -197601
16647a97601J37061j4812r9081j07081O4888L0614N5014P1294l636j06523Q3454
$$ -197601 -60540 -75352 -174433 -281514 -216626 -186012 -130998 -59704 -63340 -169863 -86409
16636h6409J73939K8626q0033k2042j0395l6628p1908M6790j04586K4507j6522
$$ -86409 87530 116156 36123 14081 3686 -32942 -104850 -58060 -162646 -138139 -154661
16625a54661Q8588J2360J00340J12942K728p8267n2121l9483M1830r9737k6896
$$ -154661 -66073 -53713 46627 159569 162297 84030 31909 -7574 34256 -65481 -92377
16614i2377R0282j3123j60655P3787O1014m9162m6663J3355q703O773l7071O3346
$$ -92377 -2095 -15218 -175873 -102086 -41072 -90234 -136897 -123542 -132245 -125472 -162543 -99197
16602i9197N9772K1966j250r7817n5906K3887Q76m5143O4736K1281L980q4258
$$ -99197 -39425 -17459 -18709 -116526 -172432 -148545 -147669 -192812 -128076 -106795 -102815 -187073
16590a87073j1297P6508L0836J47999M5003j14448m8886L8604l2869j26013k10597
$$ -187073 -198370 -121862 -91026 56973 101976 -12472 -61358 -22754 -55623 -181636 -392233
16579c92233Q4831J84007J47715l6352j98458j9118J13025k2123p9346O901J5784
$$ -392233 -307402 -123395 24320 -12032 -210490 -229608 -116583 -138706 -218052 -211151 -195367
16568a95367N3169N7865J20265k2335j20240q0906m2919k9611l0169J25719K06031
$$ -195367 -142198 -84333 35932 13597 -106643 -187549 -230468 -260079 -290248 -164529 41502
16557D1502m7519j01968J1418j4131o621L7082n1835J2821J55024N0181p249R700
$$ 41502 -6017 -107985 -96567 -110698 -117319 -80237 -132072 -119251 35773 85954 78705 88405
16545H8405L0398k2181m6780j36703j5798K6499q8887m0452O4833P5557k0592
$$ 88405 118803 96622 49842 -86861 -102659 -76160 -165047 -205499 -140666 -65109 -85701
16534h5701j62990J04894m4114P4699k3386n8240J16391R1091l8055k08106j66666
$$ -85701 -248691 -143797 -187911 -113212 -136598 -194838 -78447 12644 -25411 -233517 -400183
16523d00183J012l1224Q6289R8205Q5451J42383L4294M2253L1474r0578m3131
$$ -400183 -399171 -430395 -344106 -245901 -160450 -18067 16227 58480 89954 -624 -43755
16512d3755N4380l4483M1037j01230r5441M0398k3512j8832O7703O8163k5938
$$ -43755 10625 -23858 17179 -84051 -179492 -139094 -162606 -181438 -113735 -45572 -71510
16501g1510l5782J36768J35722o9572k21615m2241N6881p6066O3169P2817Q37
$$ -71510 -107292 29476 165198 95626 -125989 -168230 -111349 -187415 -124246 -51429 -50592
16490e0592j11182M5615O689O307J2423J37991J4410n6307M9565J3625o1987m6046
$$ -50592 -161774 -116159 -109470 -103163 -90740 47251 61661 5354 54919 68544 6557 -39489
16478c9489o9828n9219Q638l2651N5675N1429o3039M709J0239R9841K5671n1657
$$ -39489 -109317 -168536 -159898 -192549 -136874 -85445 -148484 -143775 -133536 -33695 -8024 -59681
16466e9681j1418N6903O4068o2187q4853j30484K300J52647Q700k6335N295j19362
$$ -59681 -71099 -14196 49872 -12315 -97168 -227652 -225352 -72705 -64005 -90340 -85045 -204407
16454b04407r3196R1001J39492Q8581k3490j37424r039k9506q1446n7030O3878
$$ -204407 -297603 -206602 -67110 21471 -2019 -139443 -148482 -177988 -259434 -316464 -252586
16443b52586j6517l1093k1893p3320l2684j723J71830K17417J52174j5940m8589
$$ -252586 -269103 -300196 -322089 -395409 -428093 -429816 -257986 -40569 111605 95665 47076
16432D7076n9814M525R3486j318j10525r3546K4148N3897O5508l1793k3257n6013
$$ 47076 -12738 -8213 85273 83955 -26570 -120116 -95968 -42071 23437 -8356 -31613 -87626
16420h7626l0807L446l5969K770J3842o708J8410N366q7191O5763N0067m8491
$$ -87626 -118433 -114987 -150956 -148186 -134344 -141052 -122642 -117276 -204467 -138704 -88637 -137128
16408a37128J70j37855K8762Q8195J18389L0443j8001r1545J1288K221R1142J3548
$$ -137128 -136958 -274813 -246051 -157856 -39467 -9024 -27025 -118570 -107282 -105061 -13919 -371
16396c71k3988q5020M6042N4961j4428J0501P3856J454K5372k1846l094o9952
$$ -371 -24359 -109379 -63337 -8376 -22804 -12303 61553 63007 88379 66533 63439 -6513
16384f513M6054N0391r8567l0600O1689J8281M3973J09911j3872j56967N8777
$$ -6513 39541 89932 -8635 -39235 22454 40735 84708 194619 180747 23780 82557
16373H2557n1141m9079j8485r9791n1394N2458n2357Q4704M8149O8438q2207k4045
$$ 82557 31416 -17663 -36148 -135939 -187333 -134875 -187232 -102528 -54379 14059 -68148 -92193
16361i2193l5223L0982q2896j10459p3700Q7611J6719p5594N3807J76974J18970
$$ -92193 -127416 -96434 -179330 -289789 -363489 -275878 -259159 -334753 -280946 -103972 14998
16350A4998n9816q999O1140o0234q3325Q9688R6121N3213N1434K7985r5421j6745
$$ 14998 -44818 -53817 7323 -52911 -136236 -46548 49573 102786 154220 182205 86784 70039
16338G0039j14549o2550k8097R2216M3287r77J11717o1970q0819O761p4749N3399
$$ 70039 -44510 -107060 -135157 -42941 346 -631 111086 49116 -31703 -24942 -99691 -46292
16326d6292K0966n1262m9362n4660Q4722r106Q988l1527L849Q6227N572o0318
$$ -46292 -25326 -76588 -125950 -180610 -95888 -104994 -96006 -127533 -123684 -37457 -31885 -92203
16314i2203Q1837J8209j1885L7857M3266o4041r7187P3594O9410K9210J3208k8578
$$ -92203 -10366 7843 -4042 33815 77081 13040 -84147 -10553 58857 88067 101275 72697
16302G2697M4929K666j11635o3526J686j28040k4524P1800k0663o3631j05169
$$ 72697 117626 120292 8657 -54869 -53183 -181223 -205747 -133947 -154610 -218241 -323410
16291c23410J24114J83118O1045J1486q1799p4416M1513J09666P6202M1795m2872
$$ -323410 -199296 -16178 44867 56353 -25446 -99862 -58349 51317 127519 169314 126442
16280A26442n2446m8237o6703q5676j15162k45P7989M0719J2604Q0759k7831N8819
$$ 126442 73996 25759 -40944 -126620 -241782 -242027 -164038 -123319 -110715 -29956 -57787 1032
16268A032l1737j05319l1146j24289J01975Q5147M0490J27529l257r4908K8291
$$ 1032 -30705 -136024 -167170 -291459 -189484 -104337 -63847 63682 60425 -34483 -6192
16257f192n8672n9709j19076Q5532J27619q7031k0690M8020J3491k9400M5067
$$ -6192 -64864 -124573 -243649 -158117 -30498 -117529 -138219 -90199 -76708 -106108 -61041
16246f1041N7873j3923k78j3092k3233K0680K362K4074o4090l9147r3236j5848
$$ -61041 -3168 -17091 -17369 -30461 -53694 -33014 -30652 -6578 -70668 -109815 -203051 -218899
16234b18899L1255O355J5360M9568O8584n9996j24989j7646P6875O8543J3590
$$ -218899 -187644 -181289 -165929 -116361 -47777 -107773 -232762 -250408 -173533 -104990 -91400
16223i1400O4143Q3156j3153Q6593l2912k8099j71444m2100l3237K2018k420P8880
$$ -91400 -27257 55899 42746 129339 96427 68328 -103116 -145216 -178453 -156435 -158855 -79975
16211g9975k8291L2198L797m3625K6404K6515K2811M1202k7006j56463q8332N2773
$$ -79975 -108266 -76068 -72271 -115896 -89492 -62977 -40166 1036 -25970 -182433 -270765 -217992
16199b17992M2094J0832J6860j339m5943M5674N4971m5958L4000M695P589l898
$$ -217992 -175898 -165066 -148206 -149545 -195488 -149814 -94843 -140801 -106801 -102106 -94517 -98415
16187i8415l2381L9868j5979O6270n5092m025R075Q355j6857j9369j22345r828
$$ -98415 -130796 -90928 -106907 -40637 -95729 -99754 -90679 -82324 -99181 -118550 -240895 -250723
16175b50723M0893O0204N9383p652j32063O736M5344J6857m5248o3911J10452
$$ -250723 -209830 -149626 -90243 -97895 -229958 -223222 -177878 -161021 -206269 -270180 -159728
16164a59728P0346j3330O3120L7710n3824r977J8138L5627N8039Q9369j32574
$$ -159728 -89382 -102712 -39592 -1882 -55706 -65683 -47545 -11918 46121 135490 2916
16153B916j14938n6891j23256k3737J58949o541J3394N1356q290J5044K6498O822
$$ 2916 -112022 -168913 -292169 -315906 -156957 -163498 -150104 -98748 -107038 -91994 -65496 -58674
16141e8674O0526M3516l0318m0046r654J07360J2983j27321m0520j8979j04727
$$ -58674 1852 45368 15050 -24996 -34650 72710 85693 -41628 -82148 -101127 -205854
16130b05854l2089j648P7955j9146L5330J61107M2981o2810L4367N0435L1288
$$ -205854 -237943 -239591 -161636 -180782 -145452 15655 58636 -4174 30193 80628 111916
16119A11916L3548r1095j39239M6059J61559q8046l1074J1413K3184r5620l9842
$$ 111916 145464 54369 -84870 -38811 122748 34702 3628 15041 38225 -57395 -97237
16108i7237k1955o6529m1511M8914P3312P4006L5752K6150K6918q4845j22420
$$ -97237 -119192 -185721 -227232 -178318 -105006 -31000 4752 30902 57820 -27025 -149445
16097a49445o7108j1968p4252l3908M7845O2310J00924J0704o9176k0539Q0198
$$ -149445 -216553 -228521 -302773 -336681 -288836 -226526 -125602 -114898 -184074 -204613 -124415
16086a24415J01749P9706o4763q0949J0329r0781M6738N1317j8402k2327l771
$$ -124415 -22666 57040 -7723 -88672 -78343 -169124 -122386 -71069 -89471 -111798 -115569
16075a15569N7052P5464K4534q2652m2111N3660l4738r3137n0770k5394q4159
$$ -115569 -58517 16947 41481 -41171 -83282 -29622 -64360 -157497 -208267 -233661 -317820
16064c17820q5387R2266J24407K2108m6115L3343j4917m3199k8016O3204O6567
$$ -317820 -403207 -310941 -186534 -164426 -210541 -177198 -192115 -235314 -263330 -200126 -133559
16053a33559j7236J22896k3600j67568R798m2428J76756N3375r4134K567K409
$$ -133559 -150795 -27899 -51499 -219067 -209269 -251697 -74941 -21566 -115700 -113133 -110724
16042a10724k7195J952N7806J29196J01503j91833j44348j5466k4922M6889J08741
$$ -110724 -137919 -135967 -78161 51035 152538 -39295 -183643 -199109 -224031 -177142 -68401
16031f8401m7361n884k2717j15805L4721R1191j17653j80795L9870R9912n5966
$$ -68401 -115762 -121646 -144363 -260168 -225447 -134256 -251909 -432704 -392834 -292922 -348888
16020c48888j0334O1504J87266L6149J00658K27958n6439j51113j46341O4396
$$ -348888 -359222 -297718 -110452 -74303 26355 254313 197874 46761 -99580 -35184
16010c5184N9254J3507K4036n6924m3625m3809o9826Q7511J20258m631k1112J8146
$$ -35184 24070 37577 61613 4689 -38936 -82745 -152571 -65060 55198 50567 29455 47601
15998D7601j34659l0167m9145m4614M0815J24033M3815j18441j9720N3767N426
$$ 47601 -87058 -117225 -166370 -210984 -170169 -46136 -2321 -120762 -140482 -86715 -81289
15987h1289L0413J35349j03921p328n2575m4931o0788n0501j7733K9025l8616
$$ -81289 -50876 84473 -19448 -26776 -79351 -124282 -185070 -235571 -253304 -224279 -262895
15976b62895j977j470J09808J0522m8288L0386J25802J05943m6867M839L9675
$$ -262895 -264872 -266342 -156534 -146012 -194300 -163914 -38112 67831 20964 25803 65478
15965F5478Q0641L9513R772m402l9678q0248p7364r0059k0952l2256k9523L1696
$$ 65478 146119 185632 195404 191002 151324 71076 -6288 -96347 -117299 -149555 -179078 -147382
15953a47382J04026P4790o6420o5640j9508J15087Q635J877j22338N6144m909
$$ -147382 -43356 31434 -34986 -100626 -120134 -5047 3588 5465 -116873 -60729 -65638
15942f5638m075j00958n9136J20860J68438R5377K1715R371o0858M9078l3955
$$ -65638 -69713 -170671 -229807 -108947 59491 154868 176583 185954 125096 174174 140219
15931A40219o3157p5023K5236P478J48198K43723j87361k02808l3045J7268Q6662
$$ 140219 77062 2039 27275 34753 182951 426674 239313 36505 3460 20728 107390
15920A07390j7787q8903l1305P5364P1082k0984o5285l3054K5260p6205j11529
$$ 107390 89603 700 -30605 44759 115841 94857 29572 -3482 21778 -54427 -165956
15909a65956l0644l9116L1597M5007P7741J45752O5519j8083n5809p935j29766
$$ -165956 -196600 -235716 -204119 -159112 -81371 64381 129900 111817 56008 48073 -81693
15898h1693o3351J2418M3309n1687j1785l7653P513Q2966j1124p9366p3152m1710
$$ -81693 -145044 -132626 -89317 -141004 -152789 -190442 -182929 -99963 -111087 -190453 -263605 -305315
15886c05315O6464P0882L073j1976K1512P186M9034l8870l8011K520J77639k6322
$$ -305315 -238851 -167969 -164896 -176872 -155360 -148174 -99140 -138010 -176021 -173501 4138 -22184
15874b2184j9374Q3313J07647N5679J25623r6721j12066j6927K1642k0724j14466
$$ -22184 -41558 41755 149402 205081 330704 233983 121917 104990 126632 105908 -8558
15863h558j60870p0053M4918J47356P1125k1485N3247m8023q922O0827n1073k7714
$$ -8558 -169428 -239481 -194563 -47207 23918 2433 55680 7657 -1265 59562 8489 -19225
15851a9225p8873j25050j9161J31447J08350o1045l121J13038K1685j13975L8298
$$ -19225 -98098 -223148 -242309 -110862 -2512 -63557 -66678 46360 68045 -45930 -7632
15840g632k9500j44658K4983N9696L2277K227j00379l3468R4340n4824o3081l9137
$$ -7632 -37132 -181790 -156807 -97111 -64834 -62607 -162986 -196454 -102114 -156938 -220019 -259156
15828b59156R1837J09818K0514n3978K6655p2221j01139J05385j6573l0698L0123
$$ -259156 -167319 -57501 -36987 -90965 -64310 -136531 -237670 -132285 -148858 -179556 -149433
15817a49433J5688J3265J74051P5575j59860o9679N5854N724n5285J23087P0529
$$ -149433 -133745 -120480 53571 129146 -30714 -100393 -44539 -38815 -94100 28987 99516
15806I9516L787M3255p1860j4701J7518N633l7810N7591l0656n6423k2756m8681
$$ 99516 103303 146558 74698 59997 77515 83148 45338 102929 72273 15850 -6906 -55587
15794e5587j16251K044l8457J25578R9391l9520l1693K4797l4528j2701k2380
$$ -55587 -171838 -169794 -208251 -82673 16718 -22802 -54495 -29698 -64226 -76927 -99307
15783i9307J2692k3736p9725J24341P8440l3051l122p311l8538R4243J25153o65
$$ -99307 -86615 -110351 -190076 -65735 12705 -20346 -23468 -30779 -69317 24926 150079 149414
15771A49414j66408n7064l4132n2017Q3702J6993J30076M2370m5686L5349p2750
$$ 149414 -16994 -74058 -108190 -160207 -76505 -59512 70564 112934 67248 102597 29847
15760B9847n5067j09543q0803N8300K7447L4231Q5366L5636L8424n0982l4990
$$ 29847 -25220 -134763 -215566 -157266 -129819 -95588 -10222 25414 63838 12856 -22134
15749b2134P667n541j5822J6847P1917o2559n1124k726j11260L1623N3685n6348
$$ -22134 -14467 -20008 -35830 -18983 52934 -9625 -60749 -63475 -174735 -143112 -89427 -145775
15737a45775j0217k5381k7634q152j510P8858l8015J6135P1512R5410r4519N4479
$$ -145775 -155992 -181373 -209007 -217159 -218669 -139811 -177826 -161691 -90179 5231 -89288 -34809
15725c4809R6256k3492j66267j46802J6946J09778n1495r3219P86Q2109O9743
$$ -34809 61447 37955 -128312 -275114 -258168 -148390 -199885 -293104 -292318 -210209 -140466
15714a40466j402j15882J1835j8096o4205J68349O6954r6205N9491J23148M4323
$$ -140466 -141868 -257750 -245915 -264011 -328216 -159867 -92913 -189118 -129627 -6479 37844
15703C7844O9334K963o6892p1619N013n8737n6946m1369P9097m6123l6801N6855
$$ 37844 107178 110141 43249 -28370 -23357 -82094 -139040 -180409 -101312 -147435 -184236 -127381
15691a27381O2013l8600j16119J7988L3525Q5191P1940o41J5051P4917q7409o5409
$$ -127381 -65368 -103968 -220087 -202099 -168574 -83383 -11443 -12084 2967 77884 -9525 -74934
15679g4934o482k0999r0280L7472Q4185N404M047J7679j43257k2756J4102M2443
$$ -74934 -81416 -102415 -192695 -155223 -71038 -65634 -61587 -43908 -187165 -209921 -195819 -153376
15667a53376Q2713L0223n6624q6256O815l524M508O8634j1477R6520J08693j02433
$$ -153376 -70663 -40440 -97064 -183320 -176505 -180029 -175521 -106887 -118364 -21844 86849 -15584
15655a5584j21212p4850m8151O5252O8379n5591M7419J61055r7158L2853L7715
$$ -15584 -136796 -211646 -259797 -194545 -126166 -181757 -134338 26717 -70441 -37588 127
15644A27j009J7721n0725N863M7899m2955o1913r519l5211P2985M6002J03783
$$ 127 -882 16839 -33886 -28023 19876 -23079 -84992 -94511 -129722 -56737 -10735 93048
15632I3048j2975n4822L6446J29359M2980j9681q7426j12086k6153j43514j41132
$$ 93048 80073 25251 61697 191056 234036 214355 126929 14843 -11310 -154824 -295956
15621b95956J15844O8786j4853N0699l474N1219K6611j9867l9889p8093J08324
$$ -295956 -180112 -111326 -126179 -75480 -78954 -27735 -1124 -20991 -60880 -138973 -30649
15610c0649M8189q9091j01644l7458J36017Q2169j00227N8676J81807Q1841q9711
$$ -30649 17540 -71551 -173195 -210653 -74636 7533 -92694 -34018 147789 229630 139919
15599A39919j52201k0584J07890J18757p6324j18848o8026N1411k9153R9745j2172
$$ 139919 -12282 -32866 75024 193781 117457 -1391 -69417 -18006 -47159 52586 40414
15588D0414m6356N026K7641O2748J73948N5565j55120j64078j13672J0235J6669
$$ 40414 -5942 -916 26725 89473 263421 318986 163866 -212 -113884 -103649 -86980
15577h6980K4489p8090k8179P0214r276l2460j7924L0452J52782P2694r3319j10421
$$ -86980 -62491 -140581 -168760 -98546 -107822 -140282 -158206 -127754 25028 97722 4403 -106018
15565a06018J2979J5467R5112Q6400j37362o0634k748J7425p7526o6368L4529
$$ -106018 -93039 -77572 17540 103940 -33422 -94056 -96804 -79379 -156905 -223273 -188744
15554a88744J33052r2923n9135R9938n7037p3808K2172O0124j3428p9130n0200
$$ -188744 -55692 -148615 -207750 -107812 -164849 -238657 -216485 -156361 -169789 -248919 -299119
15543b99119P3655J84628l8349M9989M0377m4849M1493N7974n1589m3598J3534
$$ -299119 -225464 -40836 -79185 -29196 11181 -33668 7825 65799 14210 -29388 -15854
15532a5854o8646n022k5022M7518Q6818j5069r545L0780q6981k5181q2282j2096
$$ -15854 -84500 -89522 -114544 -67026 19792 4723 -4822 25958 -61023 -86204 -168486 -180582
15520a80582q719k5403K3431L98J4238J33916O8439l907k12224J1583P843O6854
$$ -180582 -189301 -214704 -191273 -190875 -176637 -42721 25718 21811 -190413 -178830 -170987 -104133
15508a04133L309P418j31817O6758j9262R5205j5774k5775J21696R7167J3327
$$ -104133 -100824 -93406 -225223 -158465 -177727 -82522 -98296 -124071 -2375 94792 108119
15497A08119k8729o1590o4889o1581K4840k3071K4374M9399n1490j12584j03252
$$ 108119 79390 17800 -47089 -108670 -83830 -106901 -82527 -33128 -84618 -197202 -300454
15486c00454j21153J09513J16533L0385N9078J0480j04772k3424J05199M8672
$$ -300454 -421607 -312094 -195561 -165176 -106098 -95618 -200390 -223814 -118615 -69943
15476f9943k2561l2977m8891L3426j1005J4480O772o575N2741k9659r8340J12750
$$ -69943 -92504 -125481 -174372 -140946 -151951 -137471 -130699 -137274 -84533 -114192 -212532 -99782
15464i9782J34622p361l5690M6022k2711l4010m7433n2078o8662l7107J39463
$$ -99782 34840 27479 -8211 37811 15100 -18910 -66343 -118421 -187083 -224190 -84727
15453h4727J12540M9655o4966k3466M5794j0586N4263L1226j35513o6331R600
$$ -84727 27813 77468 12502 -10964 34830 24244 78507 109733 -25780 -92111 -82511
15442h2511J45000J47882j05604j43759m5044P5118N8778m5473M2612n035p48
$$ -82511 62489 210371 104767 -38992 -84036 -8918 49860 4387 46999 41964 41216
15431D1216J5865J3391n8228M7208K7555j12065l9619j2917l1973J4943n3843
$$ 41216 57081 70472 12244 59452 87007 -25058 -64677 -77594 -109567 -94624 -148467
15420a48467p8773J24191O7191j2435O6969J26040j88733m9009n6394L1945L3791
$$ -148467 -227240 -103049 -35858 -48293 18676 144716 -44017 -93026 -149420 -117475 -83684
15409h3684j9881j7948p5824q0149R6093J13865O1150K1306N8448J01048l7698
$$ -83684 -103565 -121513 -197337 -277486 -181393 -67528 -6378 14928 73376 174424 136726
15398A36726p4099J6550m1869j28058R0277N2376k989m6280m1263P8063N0375
$$ 136726 62627 79177 37308 -90750 -473 51903 48914 2634 -38629 39434 89809
15387H9809j4414o9167o6909n42O289L1149J07256j00642k4947k609r72q8520
$$ 89809 75395 6228 -60681 -61223 -54934 -23785 83471 -17171 -42118 -44727 -45699 -134219
15375a34219j243J18321N8733L5577n9526M2332q2765j56910J47850Q0114o5361
$$ -134219 -135462 -17141 41592 77169 17643 59975 -22790 -179700 -31850 48264 -17097
15364a7097j55683j10049R7408O4364L2787K2410m0837J54977N6038q6683j32405
$$ -17097 -172780 -282829 -185421 -121057 -88270 -65860 -106697 48280 104318 17635 -114770
15353a14770J5581M1399K7554R2385M0740K3347J1397L442O1597L620j35242k6806
$$ -114770 -99189 -57790 -30236 62149 102889 126236 137633 141075 202672 206292 71050 44244
15341D4244m08j01385p0783m7573K5412J32766J48651M1717o4510j0528M5583
$$ 44244 43836 -57549 -128332 -175905 -150493 -17727 130924 172641 108131 97603 143186
15330A43186q6633k37292O939M5725j01941J07597J07164n2546k8514Q163j22741
$$ 143186 56553 -180739 -173800 -128075 -230016 -122419 -15255 -67801 -96315 -88152 -210893
15319b10893L2704J00994p060n5327O9059N299q7522K4258O0965J09108P5955
$$ -210893 -178189 -77195 -84255 -139582 -70523 -65224 -152746 -128488 -67523 41585 117540
15308A17540K1737j54058J3088J08481k6759k644q3254p0822J768J71060j5949
$$ 117540 139277 -14781 -1693 106788 80029 77385 -5869 -76691 -74923 96137 80188
15297H0188L8921p454p6184L5341r2798J4635q8112j8706j1011J0545L7867m6845
$$ 80188 119109 111655 35471 70812 -21986 -7351 -95463 -114169 -125180 -114635 -76768 -123613
15285a23613P2286L294Q3042J2631N1729n3609j91708J5559R7646k6383j92210
$$ -123613 -51327 -48033 35009 47640 99369 45760 -145948 -130389 -32743 -59126 -251336
15274b51336J10719J11528L8469j00943j9447l770O1354N1592o4868m9764k9295
$$ -251336 -140617 -29089 9380 -91563 -111010 -114780 -53426 -1834 -66702 -116466 -145761
15263a45761j04414L6966j31182o3133J67221J29488j6971k508P9154k8389K185
$$ -145761 -250175 -213209 -344391 -407524 -240303 -110815 -127786 -130294 -51140 -79529 -77344
15252g7344l0458L5556l0538j36016R6223K1472M7106O4314K4610j60916q1293
$$ -77344 -107802 -72246 -102784 -238800 -142577 -121105 -73999 -9685 14925 -145991 -227284
15241b27284J56313N7480R7999m625j3449J6806q6756m0231O6240m3304O846o1491
$$ -227284 -70971 -13491 84508 79883 66434 83240 -3516 -43747 22493 -20811 -13965 -75456
15229g5456m4778Q8849o6258L020n6953O6087J13397Q41p0M5599o036K3837j47742
$$ -75456 -120234 -31385 -97643 -94623 -151576 -85489 27908 28749 28679 74278 68242 92079 -55663
15216e5663q1001O6863l1622o3292o570J4289N3149J05076J28710N5844j04880
$$ -55663 -136664 -69801 -101423 -164715 -171285 -156996 -103847 1229 129939 185783 80903
15205H0903k27016m1363l7032L6122n4747m1564J00484j7636m1582R5533R8489
$$ 80903 -146113 -187476 -224508 -188386 -243133 -284697 -184213 -201849 -243431 -147898 -49409
15194d9409M6332q4167q7802m1998L1028P7308O2697l3216M8987q5203j55607
$$ -49409 -3077 -87244 -175046 -217044 -186016 -108708 -46011 -79227 -30240 -115443 -271050
15183b71050k8474K4081J4638j4591O1173Q8810Q6762Q2896p8981M9033R7220
$$ -271050 -299524 -275443 -260805 -275396 -214223 -125413 -38651 44245 -34736 14297 111517
15172A11517j41812l6829N6073N6994l9115M2460j1857r3171L3812m819N0261
$$ 111517 -30295 -67124 -11051 45943 6828 49288 37431 -55740 -21928 -26747 23514
15161B3514l0933l0054O3492k1854L3861k5640j26520M8836J52959J04996k3622
$$ 23514 -7419 -37473 26019 4165 38026 12386 -114134 -65298 87661 192657 169035
15150A69035r3268r2666j074o60j4741l8290P0815r2932J975N1781R123k2613
$$ 169035 75767 -16899 -17973 -18633 -33374 -71664 -849 -93781 -91806 -40025 -30902 -53515
15138e3515j4708n789n142N1497R374p2402j14989J1586k789m8656k5499r903
$$ -53515 -68223 -74012 -79154 -27657 -18283 -90685 -205674 -194088 -196877 -245533 -271032 -280935
15126b80935N3550M0226J33568j20957P1230J06882Q1436n4883m1259J17366J07832
$$ -280935 -227385 -187159 -53591 -174548 -103318 3564 85000 30117 -11142 106224 214056
15115B14056o6471J200j66303K6823P211K1500L7479m973O129n191m5468K2649
$$ 214056 147585 148785 -17518 9305 16516 38016 75495 70522 76651 71460 25992 48641
15103D8641l3285l6467M1882k347j12430k5894J06438J81485M3244j11845j01697
$$ 48641 15356 -21111 20771 18424 -94006 -119900 -13462 168023 211267 99422 -2275
15092b275j01598q6323p8313J65768R4295n5766j24616j3157J8310r99R4527P4404
$$ -2275 -103873 -190196 -268509 -102741 -8446 -64212 -188828 -201985 -183675 -184674 -90147 -15743
15080a5743k5708O2617o4678k7894o5283n0900J0135m4266L7643L1601Q1173O0343
$$ -15743 -41451 21166 -43512 -71406 -136689 -187589 -177454 -221720 -184077 -152476 -71303 -10960
15068a0960q9186p2269j3598m1466M283R9641l6210J64050R8407k4332p0002q1997
$$ -10960 -100146 -172415 -186013 -227479 -223196 -123555 -159765 4285 102692 78360 8358 -73639
15056g3639P9941R8878P1470m7123n0954l8737o2027O8942m3324o2113L4697O4055
$$ -73639 6302 105180 176650 129527 78573 39836 -22191 46751 3427 -58686 -23989 40066
15044D0066M4814l0515Q5126o9231o5995N5915n227O8938J8795k5560J4026m5483
$$ 40066 84880 54365 139491 70260 4265 60180 54953 123891 142686 117126 131152 85669
15032H5669l5157p2600j8195P7953N0322p2394J329Q0938L0321p8519p2701k8928
$$ 85669 50512 -22088 -40283 37670 87992 15598 16927 97865 128186 49667 -23034 -51962
15020e1962k9022L7888l3541N1767L0067J06178J02081j07157j41592n7531n3131
$$ -51962 -80984 -43096 -76637 -24870 5197 111375 213456 106299 -35293 -92824 -145955
15009a45955K807K2751j11225k4002J15542J96383q0386j61701M4274J22038r7093
$$ -145955 -143148 -120397 -231622 -255624 -140082 56301 -24085 -185786 -141512 -19474 -116567
14998a16567j4710M6919K2372P517M3916L0912l0878l2278O098J5642L4692q0891
$$ -116567 -131277 -84358 -61986 -54469 -10553 20359 -10519 -42797 -36699 -21057 13635 -67256
14986f7256k6712L7428J1115n2652o5709J17979k0035m7860J039J8480l1812O5824
$$ -67256 -93968 -56540 -45425 -98077 -163786 -45807 -65842 -113702 -112663 -94183 -125995 -60171
14974f0171O9200M8078L6681Q6400r8940j25525R8683O8842K1609o3133n7113
$$ -60171 9029 57107 93788 180188 81248 -44277 54406 123248 144857 81724 24611
14963B4611J46916J6871q093p5204j54067m9828O4226l6739M9761M3067L8928
$$ 24611 171527 188398 180305 105101 -48966 -98794 -34568 -71307 -21546 21521 60449
14952F0449J1880J054l976K2724L9431r7340m4701K9295J6603j17963n5490j1043
$$ 60449 72329 73383 69407 92131 131562 34222 -10479 18816 35419 -82544 -138034 -149077
14940a49077k0478k8437L2702J15428n726n4377N8887k630j1247M0268J662r1033
$$ -149077 -169555 -197992 -165290 -49862 -55588 -109965 -51078 -53708 -64955 -24687 -23025 -114058
14928a14058l7566l1918r5312P9045j1223Q8837J75965L9389j12841q2867j6815
$$ -114058 -151624 -183542 -278854 -199809 -211032 -122195 53770 93159 -19682 -102549 -119364
14917a19364J9669L7206K5542R3415k2111M6622Q6221K9095j23149Q692K6764
$$ -119364 -99695 -62489 -36947 56468 34357 80979 167200 196295 73146 81838 108602
14906A08602J2600L5906p1449r7067j12973N376O7841M6506J02860n8195Q2333
$$ 108602 121202 157108 85659 -11408 -124381 -119005 -51164 -4658 98202 40007 122340
14895A22340j4717j21745j3823Q8278P1828j4967l3996J5529j1192k01236N3412
$$ 122340 107623 -14122 -27945 60333 132161 117194 83198 98727 87535 -113701 -60289
14884f0289j2537j27485l4067O0670M6823k3534p2611M0706Q5282K5886N4866
$$ -60289 -72826 -200311 -234378 -173708 -126885 -150419 -223030 -182324 -97042 -71156 -16290
14873a6290N775j44112Q185k2271K5187J16089O6870j1353l3025j28629m7529
$$ -16290 -10515 -154627 -146442 -168713 -143526 -27437 39433 28080 -4945 -133574 -181103
14862a81103J6144M981J35789P606l1687l0188o1573R9367M8359l0168K0475r2140
$$ -181103 -164959 -159978 -24189 -16583 -48270 -78458 -140031 -40664 7695 -22473 -1998 -94138
14850i4138J6247J98579p2615q6984R0486m6515p1030l7888K9230l3460j5039
$$ -94138 -77891 120688 48073 -38911 51575 5060 -65970 -103858 -74628 -108088 -123127
14839a23127L0296L069N4223j3969n1916l715k3328J3393P1738o5512j01093N2184
$$ -123127 -92831 -89762 -35539 -49508 -101424 -105139 -128467 -115074 -43336 -108848 -209941 -157757
14827a57757J10116J40992J6371r5802l6648j08996J4709R3737P7781N0722q4740
$$ -157757 -47641 93351 109722 13920 -22728 -131724 -117015 -23278 54503 105225 20485
14816B0485k9462Q095n7813n9128n8218k2984R2608N3526l7658q7563P4331N2583
$$ 20485 -8977 -882 -58695 -117823 -176041 -199025 -106417 -52891 -90549 -178112 -103781 -51198
14804e1198J036l7290M5979J09785q6618j15334m7472J723k9774J9792K151k4240
$$ -51198 -50162 -87452 -41473 68312 -18306 -133640 -181112 -179389 -209163 -189371 -187220 -211460
14792b11460n7089J4779p117M8543P7872N1582M5266r328m0424L4757l4829N6221
$$ -211460 -268549 -253770 -260887 -212344 -134472 -82890 -37624 -46952 -87376 -52619 -87448 -31227
14780c1227N4047Q3282P1784J0558q407j31507j10929O565M8662J7957K5589j285
$$ -31227 22820 106102 177886 188444 180037 48530 -62399 -55834 -7172 10785 36374 35089
14768C5089m9529k5255K7285k2678N5655n7576p1770q2639n2056K08022J48738
$$ 35089 -14440 -39695 -12410 -35088 20567 -37009 -108779 -191418 -243474 -35452 113286
14757A13286P302k0872l5447K6406j9573L8464m407r0525Q082P5400L8944n6412
$$ 113286 120588 99716 64269 90675 71102 109566 105159 14634 22716 98116 137060 80648
14745H0648j70239n1103M6730K4799j8884L8880K1737j08088J1688j5224l288
$$ 80648 -89591 -140694 -93964 -69165 -88049 -49169 -27432 -135520 -123832 -139056 -142344
14734a42344N7269j7243p7733q4687Q7565J01432O752r0051M1934L7087j8131
$$ -142344 -85075 -102318 -180051 -264738 -177173 -75741 -68989 -159040 -117106 -80019 -98150
14723i8150n8706N4106J13726j1696M18k2320q0746r5442l0374j6120L5009J57652
$$ -98150 -156856 -102750 10976 -720 -302 -22622 -103368 -198810 -229184 -245304 -210295 -52643
14711e2643J42040j74783r8320M6954P3305N0276N7470M139o5002n7416o9922
$$ -52643 89397 -85386 -183706 -136752 -63447 -13171 44299 48438 -16564 -73980 -143902
14700a43902L9774n0251j3830Q2746J9529r3057M6860J16608o453P1915N9368
$$ -143902 -104128 -154379 -168209 -85463 -65934 -158991 -112131 4477 -1976 69939 129307
14689A29307p1104O4471J3870J22977O6816j68081j33922k2517J4394l6675l513
$$ 129307 58203 122674 136544 259521 326337 158256 24334 1817 16211 -20464 -23977
14678b3977k1619N2726J05597o780m9992p6993l1873j46971O3406J11753J0832
$$ -23977 -45596 7130 112727 105947 55955 -21038 -52911 -199882 -136476 -24723 -13891
14667a3891N59j19197j3578J24798p7309m5166l6875N3145r8891M546J66673J42257
$$ -13891 -13332 -132529 -146107 -21309 -98618 -143784 -180659 -127514 -226405 -221859 -55186 87071
14655H7071J33372j76326j59828N8886R4132R4965j05151L449Q1583q7136j07683
$$ 87071 220443 44117 -115711 -56825 37307 132272 27121 30570 112153 25017 -82666
14644h2666j24596L3706j1091N1879l2824m8438P6045R1447R0168k4226J6267
$$ -82666 -207262 -173556 -184647 -132768 -165592 -214030 -137985 -46538 43630 19404 35671
14633C5671r1230Q8536k8007l9068J14247R9747R855n2030n8038J2159Q7356L17
$$ 35671 -55559 32977 4970 -34098 80149 179896 189751 137721 79683 91842 179198 179515
14621A79515q4830j19124l1312Q2904k4996j32549n6322K73835J14498k2409o3589
$$ 179515 94685 -24439 -55751 27153 2157 -130392 -186714 87121 201619 179210 115621
14610A15621j5117k02489q8272R0094J3185o3788l6102J62879O1652K9119n3412
$$ 115621 100504 -101985 -190257 -100163 -86978 -150766 -186868 -23989 37663 66782 13370
14599A3370M9404P2626j0742j7358N9000m0431j16318Q2048M3628o5152m5145
$$ 13370 62774 135400 124658 107300 166300 125869 9551 91599 135227 70075 24930
14588B4930j8529l0203P0810N8634j14018L7550O7558o4944k01537q5416J16989
$$ 24930 6401 -23802 47008 105642 -8376 29174 96732 31788 -169749 -255165 -138176
14577a38176J19220n1522q9268O6383M5796L3947n7807j3301k7242O1069l8890
$$ -138176 -18956 -70478 -159746 -93363 -47567 -13620 -71427 -84728 -111970 -50901 -89791
14566h9791o2668L318L3712R4609j0500O8581n8613k9944l549k4379Q6616J66742
$$ -89791 -152459 -149141 -115429 -20820 -31320 37261 -21352 -51296 -54845 -79224 7392 174134
14554A74134m0364j37179j5472O773r4681J0935L5609L4734L6202J72319q7766
$$ 174134 133770 -3409 -18881 -12108 -106789 -95854 -60245 -25511 10691 183010 95244
14543I5244q7722o2752q667K4816O1096P1990j25603q7791m0671M8189R8569p479
$$ 95244 7522 -55230 -63897 -39081 22015 94005 -31598 -119389 -160060 -111871 -13302 -20781
14531b0781J3050j445m9555r0280K18138k12o0609L2231j9915q8663j60575J14496
$$ -20781 -7731 -9176 -58731 -149011 69127 68915 8306 40537 20622 -68041 -228616 -114120
14519a14120k840K3937L283O9166J46210P723j30589l2287J03668L6924j6578
$$ -114120 -116960 -93023 -89740 -20574 125636 133359 2770 -29517 74151 111075 94497
14508I4497r7272n2433J35471K4484k44870k4183n214M7667L6465J20926k3904
$$ 94497 -2775 -55208 80263 104747 -140123 -164306 -169520 -121853 -85388 35538 11634
14497A1634j04514J7578L8262o397J00985J04128K4607o5008j67523o1059O4854
$$ 11634 -92880 -75302 -37040 -43437 57548 161676 186283 121275 -46248 -107307 -42453
14486d2453O1116q433k9793n9007k0818J48352k1714K6400P4673n11n1784q3689
$$ -42453 18663 10230 -19563 -78570 -99388 48964 27250 53650 128323 127812 76028 -7661
14474g661j1859j21716k3489o6340J29037P5263q940Q4333l6225r686k2834k1735
$$ -7661 -19520 -141236 -164725 -231065 -102028 -26765 -35705 48628 12403 2717 -20117 -41852
14462d1852l1262J34775J50570o7151k4321M9889r5402m8310q7380q8742J490
$$ -41852 -73114 61661 212231 145080 120759 170648 75246 26936 -60444 -149186 -147696
14451a47696J29127K6799M9550J0061r111J23508j54827k06617J1168K2411J03261
$$ -147696 -18569 8230 57780 67841 58730 182238 27411 -179206 -168038 -145627 -42366
14440d2366l9182n7987n3436O5561J13847P4122kp754n7483L9779J26244L0130
$$ -42366 -81548 -139535 -192971 -127410 -13563 60559 60557 52803 -4680 35099 161343 191473
14428A91473p0751o3452J7096R6285o1242q3551r8551J710J55767o0233k41823
$$ 191473 120722 57270 74366 170651 109409 25858 -72693 -70983 84784 24551 -217272
14417b17272m9593L2988J62084M0197j1371k5508o2691j2100J9895P6271J21262
$$ -217272 -266865 -233877 -71793 -31596 -42967 -68475 -131166 -143266 -123371 -47100 74162
14406G4162N8274p3343j9788j5301M178K4230k6748M601j47983k6369N5613M5801
$$ 74162 132436 59093 39305 24004 28182 52412 25664 30265 -117718 -144087 -88474 -42673
14394d2673P2811N8694M9626L3661m0953q5606j54733M8121n2002m6374o0251
$$ -42673 30138 88832 138458 172119 131166 45560 -109173 -61052 -113054 -159428 -219679
14383b19679P0703k0927M1777J44209P222j4495n2202q4865j09003j02036K03627
$$ -219679 -148976 -169903 -128126 16083 23305 8810 -43392 -128257 -237260 -339296 -135669
14372a35669K03882p570j6501K9690j8355r6920N4122J645j2145o713L9949J2358
$$ -135669 68213 60643 44142 73832 55477 -41443 12679 14324 2179 -4534 35415 47773
14360D7773l2499j7556Q622r3j0689k8121j3233q167j5877K0811M1003J35660
$$ 47773 15274 -2282 6340 6247 -4442 -32563 -45796 -53963 -69840 -49029 -8026 127634
14348A27634O1917J2335J1009k0474Q1119J21439O5225K17978L75120N09172L90651
$$ 127634 189551 201886 212895 192421 273540 394979 460204 678182 1053302 1562474 1953125
14337A953125L59405L10193J85964Q0085k07684l41954m95339o04236l37679k24721
$$ 1953125 2312530 2622723 2808687 2888772 2681088 2339134 1843795 1239559 901880 677159
14327F77159k06649j55565m9881o7203r545O1531k0009l3584o2968j14278O0979
$$ 677159 470510 314945 265064 197861 188316 249847 229838 196254 133286 19008 79987
14316G9987O4673O0364j4097m6127n2047j44530m5479J26698Q1227m3974M108
$$ 79987 144660 205024 190927 144800 92753 -51777 -97256 29442 110669 66695 70803
14305G0803Q6171p1859R1951M8682J3737n8722j38824j70006l0078J14965J24126
$$ 70803 156974 85115 177066 225748 239485 180763 41939 -128067 -158145 -43180 80946
14294H0946J6634K4831J3048j12328L9068J12371m0927l5445J6180J9997k3851
$$ 80946 97580 122411 135459 23131 62199 174570 133643 98198 114378 134375 110524
14283A10524J57912r4944o7834N5766M5754q5631j6927R9222N5495r6893K277
$$ 110524 268436 173492 105658 161424 207178 121547 104620 203842 259337 162444 164721
14272A64721n5331j19754l1156P1331L4252j27898q4986m530J16525J01415j5386
$$ 164721 109390 -10364 -41520 29811 64063 -63835 -148821 -153351 -36826 64589 49203
14261D9203m2668n9606K879J7540L9504J0244r398n1405n0107k4071J16318J3226
$$ 49203 6535 -53071 -50192 -32652 6852 17096 7698 -43707 -93814 -117885 -1567 11659
14249A1659o2919P0684r1785j6846Q2318l2038o2599K2392M7311L4704q7072k0432
$$ 11659 -51260 19424 -72361 -89207 -6889 -38927 -101526 -79134 -31823 2881 -84191 -104623
14237a04623J15682o7466K5137J04188J56176P3259j51485j39120l1050l4628
$$ -104623 11059 -56407 -31270 72918 229094 302353 150868 11748 -19302 -53930
14227e3930k3112j4983J4618M3903K6344L4364K1615l9419j1500K7855q7687o7171
$$ -53930 -77042 -92025 -77407 -33504 -7160 27204 48819 9400 -2100 25755 -61932 -129103
14215a29103K5260M1238K8654j13239O1082J34244Q0146j27747o903K8011M9966
$$ -129103 -103843 -62605 -33951 -147190 -86108 48136 128282 535 -6368 21643 71609
14204G1609O2174J0056N2890j06908j23581q8783j00094n713R5443J01683N0302
$$ 71609 133783 143839 196729 89821 -33760 -122543 -222637 -228350 -132907 -31224 19078
14193A9078p1587k1539o253R5886L5261j07396J6232O7553M2645j5857N8898l9193
$$ 19078 -52509 -74048 -80301 15585 50846 -56550 -40318 27235 69880 54023 112921 73728
14181G3728k2951r100n3931q3251M7717J17064k8378k5356k6577n2961J23255
$$ 73728 50777 41677 -12254 -95505 -47788 69276 40898 15542 -11035 -63996 59259
14170E9259P3010k1938K9957j8323N0406Q5319N805q847j48776p7265J34124k038
$$ 59259 132269 110331 140288 121965 172371 257690 263495 254648 105872 28607 162731 160693
14158A60693q0225P247P1623Q9311k7726o254n0061o7865R7774O3361n9764m4093
$$ 160693 80468 87715 159338 248649 220923 214669 164608 96743 194517 257878 198114 154021
14146A54021j5415k6368M2768M238J842P8544J2403O3989J12802R4676N1430q0443
$$ 154021 138606 112238 155006 159244 161086 239630 252033 316022 428824 523500 574930 494487
14134D94487m2259j7837R189P461m3442k28941j25857p280k6985m2035K9688K1198
$$ 494487 452228 434391 443580 451041 407599 178658 52801 45521 18536 -23499 6189 27387
14122B7387k1858K0285J6340J19687Q1082P9256P6553p0830p4529m9899J26163
$$ 27387 5529 25814 42154 161841 242923 322179 398732 327902 253373 203474 329637
14111C29637J34655k7869q5806n5382L7320M3495r6478n119J3961r1654M7628
$$ 329637 464292 436423 350617 295235 332555 376050 279572 274453 288414 196760 244388
14100B44388L0353m6044Q005j08031j06684N369l557o193p4598j633J4471K0541
$$ 244388 274741 228697 236702 128671 21987 27356 23799 17606 -56992 -58625 -44154 -23613
14088b3613O7851J67668J19M8305o3848r2335K6146l740j18499R8508l6041j1879
$$ -23613 44238 211906 212025 260330 196482 104147 130293 126553 8054 106562 70521 58642
14076E8642n6237k9706L6470o2215p5060M2729R543k0804P1167m815l7659k1190
$$ 58642 2405 -27301 9169 -53046 -128106 -85377 -75834 -96638 -25471 -30286 -67945 -89135
14064h9135r2881L6086K7439J61437P1482m5775q3326l8363M1024J6330L828n731
$$ -89135 -182016 -145930 -118491 42946 114428 68653 -14673 -53036 -12012 4318 8146 2415
14052B415R6676K6355j23146l0555O420j00584o7498Q9444M0651m4972k2899k1740
$$ 2415 99091 125446 2300 -28255 -21835 -122419 -189917 -100473 -59822 -104794 -127693 -149433
14040a49433n8620J3323M2526L9596j40670O8844J21015m9853l4724J31511R1854
$$ -149433 -208053 -194730 -152204 -112608 -253278 -184434 -63419 -113272 -147996 -16485 75369
14029G5369M1312n0725j44561p7799M7332J19870L5232M248n4560j67566N5964
$$ 75369 116681 65956 -78605 -156404 -109072 10798 46030 50278 -4282 -171848 -115884
14018a15884O1192J52181Q6345J6451Q012j11719j08077j34212m1216m1627j0645
$$ -115884 -54692 97489 183834 200285 208297 96578 -11499 -145711 -186927 -228554 -239199
14007b39199Q7780J99102O4049k0698m6548j27619p0761J67480m0646J2639J37100
$$ -239199 -151419 47683 111732 91034 44486 -83133 -153894 13586 -27060 -14421 122679
13996A22679l4751l0174n6665L9646K15933k2970P3600O5765m2642O8016J44074
$$ 122679 87928 57754 1089 40735 256668 233698 307298 373063 330421 398437 542511
13985E42511M7370q520M2916N4904j59140k52006L225L2509q4756l1964J5169
$$ 542511 589881 581361 624277 679181 520041 268035 271260 303769 219013 187049 202218
13974B02218j0068L4128J3329j15616j30264L1411J44090J81669q1920l8682p1011
$$ 202218 192150 226278 239607 123991 -6273 25138 169228 350897 268977 230295 159284
13963A59284m913R062o0351M1295J79283L1901m5065J8108q1695K3865L8663j66287
$$ 159284 154371 163433 103082 144377 323660 355561 310496 328604 246909 270774 309437 143150
13951A43150l3981N5983R3798j2419M7479k0702L2634p3564j8901J31400P5504
$$ 143150 109169 165152 258950 246531 294010 273308 305942 232378 213477 344877 420381
13940D20381m4573o4297l5194J740P3850O4541J14399J27080m4160l8244O2249
$$ 420381 375808 311511 276317 278057 351907 416448 530847 657927 613767 575523 637772
13929F37772M0388O4771n9858n4409N419J2410K0359j7987m621J4930L9443p6357
$$ 637772 678160 742931 683073 628664 634083 646493 666852 648865 644244 659174 698617 622260
13917F22260K13089P2903j53648j22347J56812K66643O8735J3329J46193J10435
$$ 622260 835349 908252 754604 632257 789069 1055712 1124447 1137776 1283969 1394404
13907A394404n2205Q5882J13801J53947O2126J62638N8129J12838R1958J99319
$$ 1394404 1342199 1428081 1541882 1695829 1757955 1920593 1978722 2091560 2183518 2382837
13897B382837K15402K27477K45855J85229J62466K58281K24832M03026M00680
$$ 2382837 2598239 2825716 3071571 3256800 3419266 3677547 3902379 4305405 4706085
13888D706085M31124M15491N01465N77539O82359Q19906R76168J192923J505401
$$ 4706085 5137209 5552700 6054165 6631704 7314063 8133969 9110137 10303060 11808461
13879A1808461J815238K152097K672309K930449L212156L611544L567125L901390
$$ 11808461 13623699 15775796 18448105 21378554 24590710 28202254 31769379 35670769
13871C5670769M596130N240857O193267P896139J0376430J4185800K0462096L1128566
$$ 35670769 40266899 45507756 51701023 59597162 69973592 84159392 104621488 135750054
13863A35750054M8724034P2021109Q1773069O7771185O4419133O1806854J2285476
$$ 135750054 184474088 256495197 338268266 406039451 470458584 532265438 544550914
13856E44550914m0697850n5512399o6675469q1667429p9797525o3718917m3583936
$$ 544550914 503853064 448340665 381665196 299997767 220200242 156481325 112897389
13849A12897389k7927118j8321050j2165987q356551n810370m073229l348257
$$ 112897389 84970271 66649221 54483234 46126683 40316313 36243084 32894827
13842C2894827k873165k477632k507739k726144k653820k407037k224341k044925
$$ 32894827 30021662 27544030 25036291 22310147 19656327 17249290 15024949 12980024
13834A2980024j585595j260553r72255p89991o96197n84235o17480n63746m43179
$$ 12980024 11394429 10133876 9161621 8371630 7675433 7091198 6473718 5909972 5466793
13825E466793k55320j84239l75074k47525j14025l17376k74534j14507l0239r4286
$$ 5466793 5211473 5027234 4652160 4404635 4290610 3973234 3698700 3584193 3553954 3459668
13815C459668j25025k12757j37016j34607r5555K9911k36j08594o9711Q731o8845
$$ 3459668 3334643 3121886 2984870 2850263 2754708 2784619 2784383 2675789 2606078 2614809 2545964
13804B545964j50194o5857K6341k6902p8483j75033j48406j10326m4291j79705
$$ 2545964 2395770 2329913 2356254 2329352 2250869 2075836 1927430 1817104 1772813 1593108
13794A593108n7330K1456q228L7388j77147r7235N26r0568K2889O0026J12204
$$ 1593108 1535778 1557234 1549006 1586394 1409247 1312012 1312538 1221970 1244859 1304885 1417089
13783A417089J4456r8249j69884j47527O9510J3561L4549J10590q215R1445L6859
$$ 1417089 1431545 1333296 1163412 1015885 1085395 1098956 1133505 1244095 1235880 1327325 1364184
13772A364184j50934j29323O7968R2557P1658q1472k04798r4986Q4462M9875j10659
$$ 1364184 1213250 1083927 1151895 1244452 1316110 1234638 1029840 934854 1019316 1069191 958532
13761I58532l0814j4009J0735j13985k1850p2850J01041L0676r7150j5037M1443
$$ 958532 927718 913709 924444 810459 788609 715759 816800 847476 750326 735289 776732
13750G76732J3543j1278M6569n1044j616N256q0793J8933m0161p7839O6334M234
$$ 776732 790275 778997 825566 774522 772906 778162 697369 716302 676141 598302 664636 668870
13738F68870K5919J25528n2032j52808q5636n9922k7417k2804R332Q7877L9457
$$ 668870 694789 820317 768285 615477 529841 469919 442502 419698 429030 516907 556364
13727E56364K9855k7655p8360q8045L3604n6135j74421J3429J10241P3726n8367
$$ 556364 586219 558564 480204 392159 425763 369628 195207 208636 318877 392603 334236
13716C34236M7512K3502K4091k8541m4110r1252k6081k8364l4395J42225J0061
$$ 334236 381748 405250 429341 400800 356690 265438 239357 210993 176598 318823 328884
13705C28884m5025N5151l198M2872p556J01318j62891l5524M1465J4492m9331
$$ 328884 283859 339010 335812 378684 371128 472446 309555 274031 315496 329988 280657
13694B80657M2629M1328O5505J88898p3862j66386j6130j243n4610O3040L8750
$$ 280657 323286 364614 430119 619017 545155 378769 362639 361396 306786 369826 408576
13683D08576J32177K7196j71689p1730J05256J27983J6535p0428J14220J52421
$$ 408576 540753 567949 396260 324530 429786 557769 574304 503876 618096 770517
13673G70517m7203j03746k4810P6905l6076q4553o5849r0594o3818J18207J3246
$$ 770517 723314 619568 594758 671663 635587 551034 485185 394591 330773 448980 462226
13662D62226q2267j08149j6004J7088Q7092j1149j33369n5524K8881M2210o979
$$ 462226 379959 271810 255806 272894 359986 348837 215468 159944 188825 231035 224056
13651B24056J09605M6549n2804K6282k5980M7883R7960M7791o3743J9718o2540
$$ 224056 333661 380210 327406 353688 327708 375591 473551 521342 457599 477317 414777
13640D14777o9176j06390N0602n3667n3930j3346J01381M8424J2111J0129J5194
$$ 414777 345601 239211 289813 236146 182216 168870 270251 318675 330786 340915 356109
13629C56109p3072q4364m6502m9382P1475m747J0609K8690p0312j14817J697J07507
$$ 356109 283037 198673 152171 102789 174264 169517 180126 208816 138504 23687 25384 132891
13617A32891P3391J006l8866k2505J1000Q4434l3103l8361m7050J02410M9467
$$ 132891 206282 207288 168422 145917 156917 241351 208248 169887 122837 225247 274714
13606B74714j5013j02940j21878L1433L8810J0174N4427K3952l0054K5023N0282
$$ 274714 259701 156761 34883 66316 105126 115300 169727 193679 163625 188648 238930
13595B38930l4170q7533L4991L7122M0866j22923q2561J01386Q3157o2349l051
$$ 238930 204760 117227 152218 189340 230206 107283 24722 126108 209265 146916 143865
13584A43865k0914k5098K9508M3698M4493o9012m6885L4339P1048L2837m8893
$$ 143865 122951 97853 127361 171059 215552 146540 99655 133994 205042 237879 188986
13573A88986o2589K7732J46767o1600p5312o9962l0503N4108o2932q2239J90912
$$ 188986 126397 154129 300896 239296 163984 94022 63519 117627 54695 -27544 163368
13562A63368k1020j16780R782M1272N8769o1744J1614P1624R3722q4289q3981
$$ 163368 142348 25568 35350 76622 135391 73647 85261 156885 250607 166318 82337
13551H2337K0684O1392k4712o2136L7576n8842L5670M5012l3378m9872O3976O445
$$ 82337 103021 164413 139701 77565 115141 56299 91969 136981 103603 53731 117707 124152
13539A24152o9145j03837J80178J30625q1950k08241q3676N959q222J15033N5128
$$ 124152 55007 -48830 131348 261973 180023 -28218 -111894 -105935 -114157 876 56004
13528E6004p4089j61164K8827J5977J0585J89808P226l0620K5651j29020J11513
$$ 56004 -18085 -179249 -150422 -134445 -123860 65948 73174 42554 68205 -60815 50698
13517E0698Q8582R4338m0261j16270l1643P5902N2087J71731j6632J5194r3047
$$ 50698 139280 233618 193357 77087 45444 121346 173433 345164 328532 343726 250679
13506B50679k7685p5943n1741m0079n7555j0647o2989P3962K5164j34526M9482
$$ 250679 222994 147051 95310 55231 -2324 -12971 -75960 -1998 23166 -111360 -61878
13495f1878M2710m1923Q6558k0220p2317K0443k856J23824N2504O6447J11120
$$ -61878 -19168 -61091 25467 5247 -67070 -46627 -49483 74341 126845 193292 304412
13484C04412o611j958L1343o7381L248O530o1408q7418p8498Q143k5994o4566
$$ 304412 297801 295843 327186 259805 263053 269583 208175 120757 42259 50402 24408 -40158
13472d0158O8391J43344j6360j3234K3579k082K7140o8719P927n0413p3340J20025
$$ -40158 28233 171577 155217 141983 165562 163480 190620 121901 129828 79415 6075 126100
13460A26100J67516m8894m4841m1376o6905J09589K0728p4053p4084j37260j3852
$$ 126100 293616 244722 199881 158505 91600 201189 221917 147864 73780 -63480 -77332
13449g7332N1601J38005J21564l8809j27822k6640n9567k013L2534L7853L6247
$$ -77332 -25731 112274 233838 195029 67207 40567 -19000 -21013 11521 49374 85621
13438H5621J04751K1634j81110j08727O5206N5610O5382m951l7865j37730o2925
$$ 85621 190372 212006 30896 -77831 -12625 42985 108367 103416 65551 -72179 -135104
13427a35104R0376J80286P5652K810M8815P5280l1610N8084L0283j78599k8131
$$ -135104 -44728 135558 211210 214020 262835 338115 306505 364589 394872 216273 188142
13416A88142p3582j43196m0047J93023J76040k8096l8556L7467j8926l0064n4101
$$ 188142 114560 -28636 -68683 124340 300380 272284 233728 271195 252269 222205 168104
13405A68104L7965o7298L6119Q8239K5082J3421k3115j4874M9186m7707j34512
$$ 168104 206069 138771 174890 263129 288211 301632 278517 263643 312829 265122 130610
13394A30610M1788r916n2953O9769J27064J83674k8597p55m6418n158Q0614L5752
$$ 130610 172398 162482 109529 179298 306362 490036 461439 460684 414266 409108 489722 525474
13382E25474P142O2841N693L30442M15349L14941K89557L37470L29919K63391
$$ 525474 532616 595457 601150 931592 1346941 1661882 1951439 2288909 2618828 2882219
13372B882219J43022j99852m32177m38650m52816m94219k87770j16360j26989
$$ 2882219 3025241 2825389 2393212 1954562 1501746 1007527 719757 603397 476408
13363D76408p1630p4945p335Q2969p9620p7532J41R3215Q0277j49224N492L4522
$$ 476408 404778 329833 322498 405467 325847 248315 248456 341671 421948 272724 278216 312738
13351C12738j28033j55745n5615j9804N8964j2066p422O7390L5387O3917L1334
$$ 312738 184705 28960 -26655 -46459 12505 439 -6983 60407 95794 159711 191045
13340A91045j52439m3515Q769n0645L747j02057R740J06032K7576L5032j10661
$$ 191045 38606 -4909 3860 -46785 -43038 -145095 -135355 -29323 -1747 33285 -77376
13329g7376Q8374J75112O5286j03545j0698k8371M3507O4692r0702m4215J30779
$$ -77376 10998 186110 251396 147851 137153 108782 152289 216981 126279 82064 212843
13318B12843l4793o4410o3636Q434K3924L5646j34577m5180J02422n284N5637
$$ 212843 178050 113640 50004 58438 82362 118008 -16569 -61749 40673 35389 91026
13307I1026p0592J6228R5674n8131j09995Q7545J10312K0959O564p2686r858r5979
$$ 91026 20434 36662 132336 74205 -35790 51755 162067 183026 189590 116904 107046 11067
13295A1067j19005J86771J4570K0186M5536q5707J6318j3150R8674J5485M2067
$$ 11067 -107938 78833 93403 113589 159125 73418 89736 76586 175260 190745 232812
13284B32812P0062o2299O243J12952l8540p9173M6746O4513Q1288p2528m0348
$$ 232812 302874 240575 246818 359770 321230 242057 288803 353316 434604 362076 321728
13273C21728J12613l4134O4236m3023q9167p8051O1986R5245j22594o1470M9699
$$ 321728 434341 400207 464443 421420 332253 254202 316188 411433 288839 227369 277068
13262B77068p6999q5506m6037L9623N4355Q9894k8731o0151O2893J13749J9034
$$ 277068 200069 114563 68526 108149 162504 252398 223667 163516 226409 340158 359192
13251C59192j15912j5375K4647p357n5418l1650n8042J8244L2550j19816K2938
$$ 359192 243280 227905 252552 245195 189777 158127 100085 118329 150879 31063 54001
13240E4001K1092M3560l4053j5559J360n3667K8583M8893p8657J2808J10548k4195
$$ 54001 75093 118653 84600 69041 70401 16734 45317 94210 15553 28361 138909 114714
13228A14714l7855J12700m9696Q714j4528R0929J02622M8102p7680j22379r5778
$$ 114714 76859 189559 139863 148577 134049 224978 327600 375702 298022 175643 79865
13217G9865J738O377j46867J1322J32234N9441Q0451K0404L9894l2798k17857
$$ 79865 81603 87980 -58887 -47565 84669 144110 224561 244965 284859 252061 34204
13206C4204k3006j1373L4795L8691L4826J2570N8182L3597m9342O3586r502l1184
$$ 34204 11198 -175 34620 73311 108137 120707 178889 212486 163144 226730 217228 186044
13194A86044n9547K1341k1070J3738P7074j630k4973r9346m9054Q0817R9249J09098
$$ 186044 126497 147838 126768 140506 217580 215950 190977 91631 42577 123394 222643 331741
13182C31741M0536q6193p6964m3336N791J3084p698k8163j90303q0181R0688N7166
$$ 331741 372277 286084 209120 165784 171575 184659 176961 148798 -41505 -121686 -30998 26168
13170B6168j53458q6711Q0808K03147N5001m3866J9766l2773L7699J14914R0005
$$ 26168 -127290 -214001 -133193 69954 124955 81089 100855 68082 105781 220695 310700
13159C10700o3688J5243q636K5357j13117K0767j2074J16888O9869l9438o2500
$$ 310700 247012 262255 253619 278976 165859 186626 174552 291440 361309 321871 259371
13148B59371r6117L3036o752o1291n9366J21199Q7894p4072Q3494L6671o3759
$$ 259371 163254 196290 189538 128247 68881 190080 277974 203902 287396 324067 260308
13137B60308K5616k0364l4232K2449K5806o4585l1067r1567P7383J17857m4560
$$ 260308 285924 265560 231328 253777 279583 214998 183931 92364 169747 287604 243044
13126B43044Q434m6697j25838j21386M716P5083J83401M0807R573j21167p8452
$$ 243044 251478 204781 78943 -42443 -37727 37356 220757 261564 271137 149970 71518
13115G1518L6089J54737j9176j17436l7660n0974M0143L4259K0438j12076m5263
$$ 71518 107607 262344 243168 125732 88072 37098 77241 111500 131938 19862 -25401
13104b5401k0645J07806J8421N4937Q8787J30698j2673j41715n6829N4594J6462
$$ -25401 -46046 61760 80181 135118 223905 354603 341930 200215 143386 197980 214442
13093B14442k8350k5903K0754o4934N2853q440k7404l2431j24963m017L3846K947
$$ 214442 186092 160189 180943 116009 168862 160422 133018 100587 -24376 -28393 5453 8400
13081H400M0439N867M18O4405Q0337K6123o9738p5798O6760k9025N6289o5026
$$ 8400 48839 54706 55124 119529 199866 225989 156251 80453 147213 118188 174477 109451
13069A09451J9414j75911j1477N7396R524L929N3728J29132J0587j66776m6386
$$ 109451 128865 -47046 -58523 -1127 8397 12326 66054 195186 205773 38997 -7389
13058g389M6035j5025Q6988P4332K7687Q211n9020r523N1090l540j02037k6798
$$ -7389 38646 23621 110609 184941 212628 220839 161819 152296 203386 199846 97809 71011
13046G1011R271l0740P0064k0567j7812J3939j3853K5187Q3354j55830j8869j0478
$$ 71011 80282 49542 119606 99039 81227 95166 81313 106500 189854 34024 15155 4677
13034D677P4238n4802m1301j6069J7533J27400N7684O1346l7005l5618n5643j16153
$$ 4677 78915 24113 -17188 -33257 -15724 111676 169360 230706 193701 158083 102440 -13713
13022a3713N158M9484k3006l1572M1827O8472K8044R6028J7134m136K4641L0982
$$ -13713 -8555 40929 17923 -13649 28178 96650 124694 220722 237856 233720 258361 289343
13010B89343q9593q9784K0445j402n0739P8916K9673r5286p0741M811Q8092N3609
$$ 289343 199750 109966 130411 129009 78270 157186 186859 91573 20832 25643 113735 167344
12998A67344p4104q8615J21463J50314j06881o6349N7369N9384j30361m1490O8751
$$ 167344 93240 4625 126088 276402 169521 103172 160541 219925 89564 48074 116825
12987A16825m8281P7763J6992q7684L2315n2975p307Q2789k7045Q0373J6046J4075
$$ 116825 68544 146307 163299 75615 107930 54955 47648 130437 103392 183765 199811 213886
12975B13886O77l1051j03500n6516J13453M5522m9134j35584j82621J07246J29669
$$ 213886 214563 183512 80012 23496 136949 182471 133337 -2247 -184868 -77622 52047
12964E2047R3066J26924L3365m9923K7179m3851N2514m8139p4384J0444m7771
$$ 52047 145113 272037 305402 255479 282658 238807 291321 243182 168798 179242 131471
12953A31471L2120K7591m7239J4225M3148k3742j36993r8832N3037Q60L9953J46698
$$ 131471 163591 191182 143943 158168 201316 177574 40581 -58251 -5214 -4354 35599 182297
12941A82297O907n1138j3329o0444L4299Q4351q5407j08558J12416P0866L6267
$$ 182297 189204 138066 124737 64293 98592 182943 97536 -11022 101394 172260 208527
12930B08527j0656j3515p5476k6662m9318o2186P9487k650o6290n4295q475p7726
$$ 208527 197871 184356 108880 82218 32900 -29286 50201 47551 -18739 -73034 -81509 -159235
12918a59235l3017Q803N1409k6079l6032J04265Q8500J02251N5301l7411n0342
$$ -159235 -192252 -183449 -132040 -158119 -194151 -89886 -1386 100865 156166 118755 68413
12907F8413J7997K3803m8186m3611o3195J0463N6563L607m71k2312P5234Q715
$$ 68413 86410 110213 62027 18416 -44779 -34316 22247 25854 25383 3071 78305 87020
12895H7020Q293L281J4547K8499N8878N0764j1662p590L6890O3987j39422k2924
$$ 87020 95313 98594 113141 141640 200518 251282 239620 232030 268920 332907 193485 170561
12883A70561j2547k3597R3484k8334j75287P2436M7542n2361j3120l1790j47744
$$ 170561 158014 134417 227901 199567 24280 96716 144258 91897 78777 46987 -100757
12872a00757m7600J23133m699K5715Q7453J23338j7988N1213J6126m5152Q9854
$$ -100757 -148357 -25224 -29923 -4208 83245 206583 188595 239808 255934 210782 300636
12861C00636J41785j89863j33117j7917L2923J408N2487m0690q2717J5077p2730
$$ 300636 442421 252558 119441 101524 134447 135855 188342 147652 64935 80012 7282
12850G282k8953j2436M5340M5265P0289M783n4995j4202r8852j28147N521R2952
$$ 7282 -21671 -34107 11233 56498 126787 131570 76575 62373 -36479 -164626 -159105 -66153
12838f6153O6934J15100L4272N4969O2058m694p8252K7450N3959j00651j31065
$$ -66153 781 115881 150153 205122 267180 262486 184234 211684 265643 164992 33927
12827C3927j4996M3480O6928o6283l8879j9621J13586j8356q1640J06268J06162
$$ 33927 18931 62411 129339 63056 24177 4556 118142 99786 18146 124414 230576
12816B30576M2177q5070j6548j2400j81025q5865m2929R47K1417j6020J83645
$$ 230576 272753 187683 171135 158735 -22290 -108155 -151084 -150137 -128720 -144740 38905
12805C8905J16347r7036k2884n3443p8458J663P6967J47991Q7643k1644q4691
$$ 38905 155252 58216 35332 -18111 -96569 -94906 -17939 130052 217695 196051 111360
12794A11360j05382Q5133J42457J5520p7281j50024Q236l1897L5595M7484N6657
$$ 111360 5978 91111 233568 249088 171807 21783 30019 -1878 33717 81201 137858
12783A37858J1199k52273j12901J22326J61414Q0620o2702p4046M16j8308Q6717
$$ 137858 149057 -103216 -216117 -93791 67623 148243 85541 11495 11911 -6397 80320
12772H0320J29487k09477o2593J19123j6789r0579j0023o4J39260q7892j09669
$$ 80320 209807 330 -62263 56860 40071 -50508 -60531 -60595 78665 -9227 -118896
12761a18896J7180R9812p9420L460M5309P9627j2031j34782m7454L2581R2803
$$ -118896 -101716 -1904 -81324 -77864 -32555 47072 35041 -99741 -147195 -114614 -21811
12750b1811J13838L5650m4772q1843j9727J19826p1160j00328J5471J73574J5169
$$ -21811 92027 127677 82905 1062 -18665 101161 30001 -70327 -54856 118718 133887
12739A33887j328J1882l8393N7661j41540j04005M9691K5588N9127L3914k9236
$$ 133887 132559 144441 106048 163709 22169 -81836 -32145 -6557 52570 86484 57248
12728E7248j52357O525O5475P8782J8173q0507J13607Q5941O1243j25368j37363
$$ 57248 -95109 -88584 -23109 55673 73846 -6661 106946 192887 254130 128762 -8601
12717h601o6957J250N0142N3326m0779N349r251O7532l6817k648O5103K7170M5259
$$ -8601 -75558 -74308 -24166 29160 -11619 -6270 -15521 52011 15194 12546 77649 104819 150078
12704A50078m5251Q7873j03319p5053M1999Q6086N1288j00207p6802o841o1954
$$ 150078 104827 192700 89381 14328 56327 142413 193701 93494 16692 9851 -52103
12693e2103J3123J20253p015K1908n238l1248j17733j2639N0990j7898l3370J26509
$$ -52103 -38980 81273 74258 96166 90928 59680 -58053 -70692 -19702 -37600 -70970 55539
12681E5539M9623L5218j73123R1888N4067J6382J8915Q7177L5436q4065j43996
$$ 55539 105162 140380 -32743 59145 113212 129594 148509 235686 271122 187057 43061
12670D3061J9375l9791L7798K4553r0951m6832K6856P8421O5551n966O915j28918
$$ 43061 62436 22645 60443 84996 -5955 -52787 -25931 52490 118041 112075 118990 -9928
12658i928r1080J7206m5990M0375J59250r4777j4025J68168l8542N0687L7356
$$ -9928 -101008 -83802 -129792 -89417 69833 -24944 -38969 129199 90657 141344 178700
12647A78700j68409j80325P8430Q5005K1169q1703k212l508J0386J47401m454
$$ 178700 10291 -170034 -91604 -6599 14570 -67133 -69345 -72853 -62467 84934 80480
12636H0480j9732L1142Q890q2178n7925P9254K9881J5644M4990p5330p7004M9862
$$ 80480 60748 91890 100780 18602 -39323 39931 69812 85456 130446 55116 -21888 27974
12624B7974J43726o3556L4655o0540r4539J0800J15464P0960L2933j5581j65514
$$ 27974 171700 108144 142799 82259 -12280 -1480 113984 184944 217877 202296 36782
12613C6782j5630J9014Q5356M8068j688j20715m6872R1411R4071j00126n4690
$$ 36782 21152 40166 125522 173590 171902 51187 4315 95726 189797 89671 34981
12602C4981K8783o8428o3995P979P6973J38831K7310r8568p4655J6369O1875L3601
$$ 34981 63764 -4664 -68659 -60680 16293 155124 182434 83866 9211 25580 87455 121056
12590A21056n5330N5530P7347o4988m1271l4647j7015R0754M0324k729q87o9364
$$ 121056 65726 121256 198603 133615 92344 57697 40682 131436 171760 169031 168144 98780
12578I8780j67256M6824J07623J5724J7922j6255q7042J09465N8185r0881j01021
$$ 98780 -68476 -21652 85971 101695 119617 103362 16320 125785 183970 93089 -7932
12567g932M8002P7366J10265r0398j31255j21830J759Q5558j7978q13m3266n2047
$$ -7932 40070 117436 227701 137303 6048 -115782 -114023 -28465 -46443 -47256 -90522 -142569
12555a42569K7236N6158j811O1824P6704K03938m3678l1226o3062K6953P5383
$$ -142569 -115333 -59175 -60986 838 77542 281480 237802 206576 143514 170467 245850
12544B45850k7190N2846o7461j09545k16398N2603J54426R9950L1768p8383k7287
$$ 245850 218660 271506 204045 94500 -121898 -69295 85131 185081 216849 138466 111179
12533A11179l2579q9432p7877J35059j4580J03206m1697j7185l0389j4194l800
$$ 111179 78600 -10832 -88709 46350 31770 134976 93279 76094 45705 31511 27711
12522B7711n0513J05262m8903p631o4738k8642L936l7092N4545N3458N6670R2051
$$ 27711 -22802 82460 33557 25926 -38812 -67454 -63518 -100610 -46065 7393 64063 156114
12510A56114j01929K5421m8214k9927M2502J2771J13748M1445Q099k7690l3545
$$ 156114 54185 79606 31392 1465 43967 56738 170486 211931 220030 192340 158795
12499A58795L4957O9211j05198q1413O6601k6595p6130P2432J12166K049Q3696
$$ 158795 193752 262963 157765 76352 142953 116358 40228 112660 224826 226875 310571
12488C10571j3327q7778J8999j9837l4230n2967r2040n8994Q9812Q3197N1536
$$ 310571 297244 209466 228465 208628 174398 121431 29391 -29603 60209 143406 194942
12477A94942J96702J50678j1137m5852r0407j28745j22422k3023J39645O2882
$$ 194942 391644 542322 531185 485333 394926 266181 143759 120736 260381 323263
12467C23263k308j5244M8432K184k7456j20943n0656Q1186J00839K1191O6476
$$ 323263 320955 305711 354143 356327 328871 207928 157272 238458 339297 360488 426964
12456D26964o65j1630r0689q4829K7693Q6979Q5699j5348j14069n9968m4797P2109
$$ 426964 426299 414669 323980 239151 266844 353823 439522 424174 310105 250137 205340 277449
12444B77449L3840m9079k5119J02696J26477r5173P4117j7048j156l421P4980
$$ 277449 311289 262210 237091 339787 466264 371091 445208 428160 427004 423583 498563
12433D98563J16139m2231n5490p2971J5657j0555O8807K438P9494o3151j32622
$$ 498563 614702 572471 516981 444010 459667 449112 517919 520357 599851 536700 404078
12422D04078O7533M5409l5966k5318n9648K4181o8046m7829J22572K21031N2790
$$ 404078 471611 517020 481054 455736 396088 420269 352223 304394 426966 647997 700787
12411G00787J2453L9158j01760p0288o8197m6494P0340j68522o4849n1613o9578
$$ 700787 713240 752398 650638 580350 512153 465659 535999 367477 302628 251015 181437
12400A81437M2654K7776j19556k7796J39674L5299J44048J11754Q4314m1415k3953
$$ 181437 224091 251867 132311 104515 244189 279488 423536 535290 619604 578189 554236
12389E54236K5934l1049J180J26292P5894p1353q2677k8016k9765q5943o520p3911
$$ 554236 580170 549121 550301 676593 752487 681134 598457 570441 540676 454733 448213 374302
12377C74302J6496J18346J943p5278j6710R7663J9846j04202j46593j69819l2092
$$ 374302 390798 509144 511087 435809 419099 516762 536608 432406 285813 115994 83902
12366H3902Q5032J37853K4042n417l9425J24803Q2337Q5104m3982n1080l0928
$$ 83902 168934 306787 330829 325412 285987 410790 493127 578231 534249 483169 452241
12355D52241j76165j20932M1661J96988L7897J1308R2834M6557o6643j05783k5790
$$ 452241 276076 155144 196805 393793 431690 442998 535832 582389 515746 409963 384173
12344C84173m0938L1120O9911m6144j08613r334R4658m4340N1116L7433N4957
$$ 384173 343235 374355 444266 398122 289509 280175 374833 330493 381609 419042 473999
12333D73999m8440q9172J3136J7443L9999p3868j64497N7005N9634O4427k9472
$$ 473999 425559 336387 349523 366966 406965 333097 168600 225605 285239 349666 320194
12322C20194l3478L789j77134j12740R503k238j8603N9992R1648R533j1580j17472
$$ 320194 286716 290505 113371 631 10134 7896 -10707 49285 140933 150466 138886 21414
12310B1414M6052M6655K6909M3531N1804j19689L8153J15897J35425k5800m0601
$$ 21414 67466 114121 141030 184561 236365 116676 154829 270726 406151 380351 339750
12299C39750j77176q2911l4970K0236n5483J07109L1672q2154o235L5843O8473
$$ 339750 162574 79663 44693 64929 9446 116555 148227 66073 59838 95681 164154
12288A64154L5112j46935p6605L7699j7426K5731M0004J0553N2760J11195r6192
$$ 164154 199266 52331 -24274 13425 -4001 21730 61734 72287 125047 236242 140050
12277A40050K7315P11J7868l3307q0398j16479P3402o402L9305M5538l1354J32849
$$ 140050 167365 168076 185944 152637 72239 -44240 29162 22760 62065 107603 76249 209098
12265B09098N9989j13617Q7495o8878q93q3845j9225P5933j31621K6522J13395
$$ 209098 269087 155470 242965 174087 173194 89349 70124 146057 14436 40958 154353
12254A54353J37616j11960k7595L6576J153j1605r0185j51787o8514K1216J10911
$$ 154353 291969 180009 152414 188990 190143 178538 88353 -63434 -131948 -110732 179
12243A79J50204j4324j03948l3219q638L8954L3135J5667L2547L7281P0J09145
$$ 179 150383 136059 32111 -1108 -9746 29208 62343 78010 110557 147838 147908 257053
12231B57053K0582j11700j51124J4103J7087n2686M1631j14176J5374Q201J50371
$$ 257053 277635 165935 14811 28914 46001 -6685 34946 -79230 -63856 -55655 94716
12220I4716k406N5835J03219j33002r8738j459N9604k2208j14693l6157o836n0863
$$ 94716 92310 148145 251364 118362 19624 18165 77769 55561 -59132 -95289 -102125 -152988
12208a52988k1421Q0134P6686k2066L3508M3084Q5212L0893K0727j7919J1980
$$ -152988 -174409 -94275 -17589 -39655 -6147 36937 122149 153042 173769 155850 167830
12197A67830o0813j01052Q1345j2470O2939Q4704j16045j8641M1146L5410j3997
$$ 167830 107017 5965 87310 74840 137779 222483 106438 87797 128943 164353 150356
12186A50356R8721J69543M2330r7525o6605o0872j18038p86M8417J19376n1664
$$ 150356 249077 418620 460950 363425 296820 235948 117910 117124 165541 284917 233253
12175B33253n3247r8603n0955q7031k3454P0997K0328M2324J81249J37139p5139
$$ 233253 180006 81403 30448 -56583 -80037 -9040 11288 53612 234861 372000 296861
12164B96861Q379j8049J17925O670j06320J1831M1321J7050M4054j17255k34098
$$ 296861 305240 287191 405116 411786 305466 317297 358618 375668 419722 302467 68369
12153F8369l6568P8160m1206n920L2335j0317o763L2222P3603N8717N6832J6153
$$ 68369 31801 109961 68755 62835 95170 84853 78090 110312 183915 242632 299464 315617
12141C15617m3120j9877r3513n0879P789K4953J16853n5966k2969m7501p2473
$$ 315617 272497 252620 159107 108228 116017 140970 257823 201857 178888 131387 58914
12130E8914L2757L9424p5240Q7287P1335l0499J1978N2103O8091j1891M4921k9433
$$ 58914 91671 131095 55855 143142 214477 183978 195956 248059 316150 304259 349180 319747
12118C19747j36007N6108j3073r6850m8756J2851J04501L3579j06853k0757Q036
$$ 319747 183740 239848 226775 129925 81169 94020 198521 232100 125247 104490 112526
12107A12526L7485l3719n8567J21357L1767n5245J3451J0054k5661m2644j1067
$$ 112526 150011 116292 57725 179082 210849 155604 169055 179109 153448 110804 99737
12096I9737j01851J06856O4971j02505j05026O6203Q9690L8122q528l0688l2199
$$ 99737 -2114 104742 169713 67208 -37818 28385 118075 156197 147669 116981 84782
12085H4782M4548M8481p8598j45302P0877l050K00531J18298l835k5766N188O127
$$ 84782 129330 177811 99213 -46089 24788 21738 222269 340567 336732 310966 316154 322281
12073C22281p0677q2140N5735k2102n9299L0998r6817j9154P7049o9683p4492
$$ 322281 251604 169464 225199 203097 143798 174796 77979 58825 135874 66191 -8301
12062h301M9481M6040O1765O1915l3582j50494o098K0186k942J37056Q2892J4362
$$ -8301 41180 87220 148985 210900 177318 26824 20726 40912 37970 175026 257918 272280
12050B72280j20458q4073P7887P3292K1675j06097P0412p0584k3312K2962L5973
$$ 272280 151822 67749 145636 218928 240603 134506 204918 134334 111022 133984 169957
12039A69957L0759Q24l5108M0720P1643p420M8180j4311j92015j05208n9811K4548
$$ 169957 200716 201540 166432 207152 278795 271375 319555 305244 113229 8021 -51790 -27242
12027b7242R5201R9771O3952P403J9718N6609q2507l791L9569p2362K1217J18875
$$ -27242 67959 167730 231682 239085 258803 315412 232905 229114 268683 196321 217538 336413
12015C36413j0201o7877n4584R8543l1900o4061n4971L9697P2874n7521N5994
$$ 336413 326212 258335 203751 302294 270394 206333 151362 191059 263933 206412 262406
12004B62406N3216n0653k8906n0811o3536J3178J00939P6626K5682J267k0640
$$ 262406 315622 264969 236063 185252 121716 134894 235833 312459 338141 339408 318768
11993C18768j0871j27354l3459O9630J9827Q5468L536k6612M1137M4619J2479
$$ 318768 307897 180543 147084 216714 236541 322009 325545 298933 340070 384689 397168
11982C97168n9878j48089O0663K9635n341O1591K556m8244J5056j687p5352Q2686
$$ 397168 337290 189201 249864 279499 274158 335749 338305 290061 305117 303430 228078 310764
11970C10764l6387j24103O9542Q8750O5255J03904M1872j4636K5916q2168m2061
$$ 310764 274377 150274 219816 308566 373821 477725 519597 504961 530877 448709 406648
11959D06648L4199p4271j06109J2937k3419m5578R8225m1659p5528o1943k0524
$$ 406648 440847 366576 260467 273404 249985 204407 302632 260973 185445 123502 102978
11948A02978J07472N7195j21894k8159Q4716l499P5394k277l6573j51499o7229
$$ 102978 210450 267645 145751 117592 202308 198809 274203 271926 235353 83854 16625
11937A6625M5265N7030J540N885Q3137M5647l6915J657J46367N0322q0271q7965
$$ 16625 61890 118920 120460 126345 209482 255129 218214 219871 366238 416560 336289 248324
11925B48324j6673p5597o5621K0755K862N211n3527O9243J13691J55478k0540
$$ 248324 231651 156054 90433 111188 114050 119261 65734 134977 248668 404146 383606
11914C83606Q449j76480j99643n1497M7760L4980Q1713J02431r9302o2727Q5006
$$ 383606 392055 215575 15932 -35565 12195 47175 128888 231319 132017 69290 154296
11903A54296J6140l9762N283P1666j11401q3100q3568L4489J31436p644j3820
$$ 154296 170436 130674 135957 207623 96222 13122 -70446 -35957 95479 87835 74015
11892G4015J53716N6383j12048M6880m3975j2730l0300L4989l9067r1924o7797
$$ 74015 227731 284114 172066 218946 174971 162241 131941 166930 127863 35939 -31858
11881c1858p2314J44674J12904j59230p7964R3825O8640j5978j06703K3737L9886
$$ -31858 -104172 40502 153406 -5824 -83788 10037 78677 62699 -44004 -20267 19619
11870A9619j37977q007O4489l0392J9692J80375P6343l7356j22664k7712J92541
$$ 19619 -118358 -126365 -61876 -92268 -72576 107799 184142 146786 24122 -3590 188951
11859A88951M2842p0736q7977p2704n4918K7912J24153N920N0690o1141j3518
$$ 188951 231793 161057 73080 376 -54542 -26630 97523 103443 154133 92992 79474
11848G9474m4989q0779J09534P738N529R384J60390N3542M5495o3069j40833j99843
$$ 79474 34485 -46294 63240 70978 76507 85891 246281 299823 345318 282249 141416 -58427
11836e8427r6253J01546m4836J20761J54534K7601j20319p5718q491r586k5064
$$ -58427 -154680 -53134 -97970 22791 177325 204926 84607 8889 398 -9188 -34252
11825c4252p760n9537m6981M1958P2553J6406l7010J761j1097k6499K7183J2812
$$ -34252 -42012 -101549 -148530 -106572 -34019 -17613 -54623 -52862 -63959 -90458 -63275 -50463
11813e0463o447N8835K0239l5207p6872J20739o747O6285k4597m589p3195q0085
$$ -50463 -56910 1925 22164 -13043 -89915 30824 24077 90362 65765 61176 -12019 -92104
11801i2104n8792r8495l021N1284O0226Q3781k1125l3694k1497J05557J7866l174
$$ -92104 -150896 -249391 -252412 -201128 -140902 -57121 -78246 -111940 -133437 -27880 -10014 -13188
11789a3188J1792p3598r1532l7855L4007Q7556P6794j537j4190M3470J1165j1554
$$ -13188 -1396 -74994 -166526 -204381 -170374 -82818 -6024 -7561 -21751 21719 32884 21330
11777B1330j01930o7235N1015r7883q6651J16331J02758r5179n742J36651n2239
$$ 21330 -80600 -147835 -96820 -194703 -281354 -165023 -62265 -157444 -163186 -26535 -78774
11766g8774k8388J29384L6264J14103j51963j27385j9892n9458K9496K250N1186
$$ -78774 -107162 22222 58486 172589 20626 -106759 -126651 -186109 -156613 -154363 -103177
11755a03177R0811j5877J4339R4797q94o6283k4292M1253L1176K0334O7514q2744
$$ -103177 -12366 -28243 -13904 80893 79999 13716 -10576 30677 61853 82187 149701 66957
11743F6957N783L7248J0511M3743K2488k3931L743j34589q9346k1537M3368J2832
$$ 66957 72740 109988 120499 164242 186730 162799 166542 31953 -57393 -78930 -35562 -22730
11731b2730p9118j0880K9272J22055l9986o5327L0050j1283M7201O5470l3369
$$ -22730 -101848 -112728 -83456 38599 -1387 -66714 -36664 -47947 -746 64724 31355
11720C1355j40241p2474Q6916P0214j7361K7829k987k9772K2481J40849Q1570
$$ 31355 -108886 -181360 -94444 -24230 -41591 -13762 -16749 -46521 -24040 116809 198379
11709A98379k09383j77838L828R6151O7019M780m276m2978q955O3619n3310n2330
$$ 198379 -11004 -188842 -185014 -88863 -21844 -17064 -21340 -64318 -73273 -9654 -62964 -115294
11697a15294l4565K8152J4501o8206n737J0837J13416R9011J12470o5421p4091
$$ -115294 -149859 -121707 -107206 -175412 -181149 -170312 -56896 42115 154585 89164 15073
11686A5073o9443J02095M2168o9796K9076J5300k7359k1282J3727J30902N2202
$$ 15073 -54370 47725 89893 20097 49173 64473 37114 15832 29559 160461 212663
11675B12663k09671j46400M6164N7632J2951M6798Q0790j3250O293m0581L6036
$$ 212663 2992 -143408 -97244 -39612 -26661 20137 100927 87677 93970 53389 89425
11664H9425O1604j59432l4709J8701M798m1828L305J20932J7638j0413j5738q2262
$$ 89425 151029 -8403 -43112 -24411 -19613 -61441 -58136 62796 80434 70021 54283 -27979
11652b7979q8755o0909L9362K7569N4951K69j14377j26226M8328q557J04458J04341
$$ -27979 -116734 -177643 -138281 -110712 -55761 -55492 -169869 -296095 -247767 -256324 -151866 -47525
11640d7525N5726m5277J31242J64652m0640j06507j39402M642J03078q7460l1314
$$ -47525 8201 -37076 94166 258818 218178 111671 -27731 -23089 79989 -7471 -38785
11629c8785K6893m4007J841l6586P8096k7625p5331K1890N4023M8711j08539m0637
$$ -38785 -11892 -55899 -54058 -90644 -12548 -40173 -115504 -93614 -39591 9120 -99419 -140056
11617a40056q806m6905j4626R9099M0631j1474m05J20262Q4452o9746j04990p9179
$$ -140056 -148862 -195767 -210393 -111294 -70663 -82137 -82542 37720 122172 52426 -52564 -131743
11605a31743R7935J12368L5879o7432L7962L6230L6364o737j43576l1280J14358
$$ -131743 -33808 78560 114439 47007 84969 121199 157563 150826 7250 -24030 90328
11594I0328J16363p7334m4895J17989k8896j77546j00823P9458J4025J10774J14162
$$ 90328 206691 129357 84462 202451 173555 -3991 -104814 -25356 -11331 99443 213605
11583B13605K0337j01310l0699l84R102L7668J63191l3720j41361n5776k0612
$$ 213605 233942 132632 101933 101549 110651 148319 311510 277790 136429 80653 60041
11572F0041l9811j8042m129N2738j65268J7656L6232R5286P5109J48758J46003
$$ 60041 20230 2188 -1941 50797 -114471 -96815 -60583 34703 109812 258570 404573
11561D04573L4540j10796p0552Q6513J01367j03259q9767n904M6436o4229q4194
$$ 404573 439113 328317 257765 344278 445645 342386 252619 246715 293151 228922 144728
11550A44728J10547J13303k8690j13995L3086L7107M4660L1833M0273J3281J97580
$$ 144728 255275 368578 339888 225893 258979 296086 340746 372579 412852 426133 623713
11539F23713M8549n6605R014r171J64123J33479j42031j10866j38038j15465j19772
$$ 623713 672262 615657 624671 615500 779623 913102 771071 660205 522167 406702 286930
11528B86930m5529Q1065J37547j24097j34593j0855k8087L7378N8080n787N96
$$ 286930 241401 322466 460013 335916 201323 190468 162381 199759 257839 252052 252648
11517B52648Q6729n5350m1592R6572J45012J07952L5263O6744o7279P1116J92551
$$ 252648 339377 284027 242435 339007 484019 591971 627234 693978 626699 697815 890366
11506H90366j6378k87028j28003J25419J63197o0572j91374j01754p5520O6112
$$ 890366 873988 586960 458957 584376 747573 687001 495627 393873 318353 384465
11496C84465K4403K3465m4422J40971R2763k1701m4729J19568J56314j05493r1982
$$ 384465 408868 432333 387911 528882 621645 599944 555215 674783 831097 725604 633622
11485F33622N9961n2685q2960O932o9103j67023j15775p5625Q6421n5957Q0150
$$ 633622 693583 640898 557938 564870 495767 328744 212969 137344 223765 167808 247958
11474B47958O325l7502N9019q9112N4745J183J26012Q4382P4549l9620K5815J22117
$$ 247958 254283 216781 275800 186688 241433 242616 368628 453010 527559 487939 513754 635871
11462F35871J58205N4562m5904j27989k23738J5630J04481p2780j04480m139j7310
$$ 635871 794076 848638 802734 674745 451007 466637 571118 498338 393858 389719 372409
11451C72409j18664k6132O3775J52847N2881L1540n1024l5213k7943L0302j0586
$$ 372409 253745 227613 291388 444235 497116 528656 477632 442419 414476 444778 434192
11440D34192j4975M033j12621n0218j07312K6423J26105L5422l6034N0792K4574
$$ 434192 419217 423250 310629 260411 153099 179522 305627 341049 305015 355807 380381
11429C80381r4283r1504q6212M0092R6413J8842j3836Q2686m5816l0300L2703
$$ 380381 286098 194594 108382 148474 244887 263729 249893 332579 286763 256463 289166
11418B89166K5133R7276P367J8040P079j17786l5045p8445k1503j08326Q8839
$$ 289166 314299 411575 418942 436982 444061 326275 291230 212785 191282 82956 171795
11407A71795j13985q8007j3682K7946L7183N8086r9966K3587M5426j29172p7867
$$ 171795 57810 -30197 -43879 -15933 21250 79336 -20630 2957 48383 -80789 -158656
11396a58656M2030J9357k9328J04109P3025L4808q5671q9686O700q452K4601l6655
$$ -158656 -116626 -97269 -126597 -22488 50537 85345 -326 -90012 -83312 -91764 -67163 -103818
11384a03818m320P5539N5844k3880n8013j9506j8069k8000O8440m8213N5667R1968
$$ -103818 -108138 -32599 23245 -635 -58648 -78154 -96223 -124223 -55783 -103996 -48329 43639
11372D3639j1270o7482j45778l0416M7565J23136K2272J9225O617l2626j18420
$$ 43639 32369 -35113 -180891 -211307 -163742 -40606 -18334 891 7508 -25118 -143538
11361a43538N9564J826M2455k3721L7797J7773L5111n8033K4252J11398k8780
$$ -143538 -83974 -82148 -39693 -63414 -25617 -7844 27267 -30766 -6514 104884 76104
11350G6104K3658J9862m701j35529r061R4940p2650n1801p4695L6135O0105M1922
$$ 76104 99762 119624 114923 -20606 -29667 65273 -7377 -59178 -133873 -97738 -37633 4289
11338D289j05024K6362J09443R3431P4816L8566n8125p8182j12708k5794o897
$$ 4289 -100735 -74373 35070 128501 203317 241883 183758 105576 -7132 -32926 -39823
11327c9823J3624P0542j8384j10918j78282n239J18612K3932k2744m0741Q6726
$$ -39823 -26199 44343 25959 -84959 -263241 -268480 -149868 -125936 -148680 -189421 -102695
11316a02695K0441k7068o7416P6485k5766J35887k3388j3193k4869n1371J67395
$$ -102695 -82254 -109322 -176738 -100253 -126019 9868 -13520 -26713 -51582 -102953 64442
11305F4442L774l4801o4235n94L3986k8783j4211r3088J10402J42263j3941m5873
$$ 64442 68216 33415 -30820 -31414 2572 -26211 -40422 -133510 -23108 119155 105214 59341
11293E9341Q7617n0341q9461j6760L767P922O2579o0255p8084M9812k1145o498
$$ 59341 146958 96617 7156 -9604 -5837 2085 64664 4409 -73675 -23863 -45008 -51506
11281e1506M0725J8609L3600k3092L4111k4328j2446j18668M9052N6372m0365
$$ -51506 -10781 7828 41428 18336 52447 28119 15673 -102995 -53943 2429 -37936
11270c7936j21433J3168L7890k9431k6858R6097k5217m6851J32448J54408P1547
$$ -37936 -159369 -146201 -108311 -137742 -164600 -68503 -93720 -140571 -8123 146285 217832
11259B17832p733J8341k610R3381J405j66114j64448o3319K7563J0654J04938
$$ 217832 210099 228440 225830 319211 320616 154502 -9946 -73265 -45702 -35048 69890
11248F9890m5614n0014r0313l7856P0503Q068O4969Q9489n9306j04557J6635q1579
$$ 69890 24276 -25738 -116051 -153907 -83404 -75336 -10367 79122 19816 -84741 -68106 -149685
11236a49685J9695J48293J53610j50750j43379m8419P5568J42428J8701p2903
$$ -149685 -129990 18303 171913 21163 -122216 -170635 -95067 47361 66062 -6841
11226f841J5949j5223j30659k2173R0524K7452L0897o8599K3286O2062O6729l3776
$$ -6841 9108 -6115 -136774 -158947 -68423 -40971 -10074 -78673 -55387 6675 73404 39628
11214C9628p7304K1507p844K2903P4977l8310o3204l5226j2572j6141r7341R1188
$$ 39628 -37676 -16169 -24013 -1110 73867 35557 -27647 -62873 -75445 -91586 -188927 -97739
11202i7739p7228l2661J22267N5924j4009R2884J2345j09417o7244l5756P4798
$$ -97739 -174967 -207628 -85361 -29437 -43446 49438 61783 -47634 -114878 -150634 -75836
11191g5836J29321m4483r1957p3722p0018j8964o0418P889k4690R9148K629K7443
$$ -75836 53485 9002 -82955 -156677 -226695 -245659 -306077 -298188 -322878 -223730 -221101 -193658
11179a93658R2515j6490k4919K6406Q0215k2838m1647L9018K6121K1825l9170
$$ -193658 -101143 -117633 -142552 -116146 -35931 -58769 -100416 -61398 -35277 -13452 -52622
11168e2622k9560P0146L369l0877n5908L6764M0815n9761l9615J22307J16325
$$ -52622 -82182 -12036 -8667 -39544 -95452 -58688 -17873 -77634 -117249 5058 121383
11157A21383J6951p9295O5444l6063j39273q6883J5980K4140l3552p1597N2544
$$ 121383 138334 59039 124483 88420 -50853 -137736 -121756 -97616 -131168 -202765 -150221
11146a50221R4785Q02p621O506L506p2398L6781k0912p028M9250j9339j39436
$$ -150221 -55436 -54634 -62255 -55749 -52243 -124641 -87860 -108772 -115800 -66550 -85889 -225325
11134b25325L3299R4902j20070l2208J39325Q4420k7520M379j006j9392j6823
$$ -225325 -192026 -97124 -217194 -249402 -110077 -25657 -53177 -48798 -49804 -69196 -86019
11123h6019P6560M65j41321j9899J69800L0620q5079j02112J09296J02932m9488
$$ -86019 -9459 -8994 -150315 -170214 -414 30206 -54873 -156985 -47689 55243 5755
11112E755J0130j04757p7865J16156P8051O2342k1473k40m439J6440l8921N140
$$ 5755 15885 -88872 -166737 -50581 27470 89812 68339 68099 63660 80100 41179 46319
11100D6319N2434k8701l9618L8413l7837l9324k2328n1291m1425M1099R3200K2614
$$ 46319 98753 70052 30434 68847 31010 -8314 -30642 -81933 -123358 -82259 10941 33555
11088C3555K4669k8846o0809J2786m2173r2454M5796J64690n7970n6865l1025
$$ 33555 58224 29378 -31431 -18645 -60818 -153272 -107476 57214 -756 -57621 -88646
11077h8646n3219J06753n8771m9020J2596N6740P3751j7134o1146o628N8072m0189
$$ -88646 -141865 -35112 -93883 -142903 -130307 -73567 184 -16950 -78096 -84724 -26652 -66841
11065f6841k1833j3374K9868K1635Q3827r825m3134k0536k3275R609J1316J42557
$$ -66841 -88674 -102048 -72180 -50545 33282 23457 -19677 -40213 -63488 -53879 -42563 99994
11053I9994N1605r061j23599P110N7223l1646M6961j2364M7783P1786J54623j16538
$$ 99994 151599 142538 18939 26049 83272 51626 98587 86223 134006 205792 360415 243877
11041B43877j16636R5781j58281l9132m4937j68460K4N0615J24177J12372N3116
$$ 243877 127241 223022 64741 25609 -19328 -187788 -187764 -137149 -12972 99400 152516
11030A52516q5383j76935J8894J25186j9930L811j4921q5905l1882R1117J23791
$$ 152516 67133 -109802 -90908 34278 14348 18159 3238 -82667 -114549 -23432 100359
11019A00359M7869p9006m7075l7956k6927R7247j60406J5518Q5112O9332j08383
$$ 100359 148228 69222 22147 -15809 -42736 54511 -105895 -90377 -5265 64067 -44316
11008d4316q5980J74854J965j01454M3028K4010k6820j03819J14263L9456K3091
$$ -44316 -130296 44558 46523 -54931 -11903 12107 -14713 -118532 -4269 35187 58278
10997E8278J3784l6412L3789M9848J29415m0151o3398n3086l6746o6370l9215
$$ 58278 72062 35650 69439 119287 248702 208551 145153 92067 55321 -11049 -50264
10986e0264m8912O3758M0388l8369K7902j63337l9633l9950p043n3843P1242K9501
$$ -50264 -99176 -35418 4970 -33399 -5497 -168834 -208467 -248417 -255460 -309303 -238061 -208560
10974b08560J07911L7980l4814J2476j37146J5732Q3688N8751J09625l0988n1697
$$ -208560 -100649 -62669 -97483 -85007 -222153 -206421 -122733 -63982 45643 14655 -37042
10963c7042k3695j6484k1374o3915m2687L2708K8672N20L4259J23988K1329n1311
$$ -37042 -60737 -77221 -98595 -162510 -205197 -172489 -143817 -143297 -109038 14950 36279 -15032
10951a5032O4348K592N4104l9517j00493O1788J3950o7754k77700J502J30974
$$ -15032 49316 51908 106012 66495 -33998 27790 41740 -26014 -303714 -302212 -171238
10940a71238O1205q9010q7662j7744Q2470P0365J41861K6244k4770M5410j21236
$$ -171238 -110033 -199043 -286705 -304449 -221979 -151614 -9753 16491 -8279 37131 -84105
10929h4105P94J0118m4960M9184m9438m4892L3747o4220O3538k2491Q5787O5282
$$ -84105 -83311 -73193 -118153 -68969 -118407 -163299 -129552 -193772 -130234 -152725 -66938 -1656
10917a656l7123M4727J8375r1841N8176K7928j24910r7208N1729L8842P5313P8966
$$ -1656 -38779 5948 24323 -67518 -9342 18586 -106324 -203532 -151803 -112961 -37648 41318
10905D1318j2046N3040J17573N915l8904o3874j30309j44166r6776K9242Q5159
$$ 41318 29272 82312 199885 205800 166896 103022 -27287 -171453 -268229 -238987 -153828
10894a53828l2698Q0998J25532P4058k0222k2997n3255r9121J26710O0503k7537
$$ -153828 -186526 -105528 20004 94062 73840 50843 -2412 -101533 25177 85680 58143
10883E8143N6245M4794K2623j27290j06546o0800j1664J23721n045r1657k7957
$$ 58143 114388 159182 181805 54515 -52031 -112831 -124495 -774 -5819 -97476 -125433
10872a25433J6692R0778L6556k6570k6417m1877J5429j01779J4640j4848j46245
$$ -125433 -108741 -17963 18593 -7977 -34394 -76271 -60842 -162621 -147981 -162829 -309074
10861c09074O3126K75916n769j5736L8653p5422j5410J04410J309n2286j42641
$$ -309074 -245948 29968 24199 8463 47116 -28306 -43716 60694 62003 9717 -132924
10850a32924m6565K0256p3633l5781J29533J79488q4431n0354L6949M0458k3133
$$ -132924 -179489 -159233 -232866 -268647 -139114 40374 -44057 -94411 -57462 -17004 -40137
10839d0137O6207L3362M7999q5551q9593O558P8354q8304m5929K147J03719M0252
$$ -40137 26070 59432 107431 21880 -67713 -61155 17199 -71105 -117034 -114887 -11168 29084
10827B9084k90k9009m2795P4702p9711o7281l2978O542J26757j17033k1286O6675
$$ 29084 28794 -215 -43010 31692 -48019 -115300 -148278 -141736 -14979 -132012 -153298 -86623
10815h6623l8320M193J00233Q91L4372k6650o1901J1921l3952K2919M1316J06119
$$ -86623 -124943 -120750 -20517 -19626 14746 -11904 -73805 -61884 -95836 -72917 -31601 74518
10803G4518r6727q0135r8493o9315L0928Q8510l824r8449j7442j2892N3595J72352
$$ 74518 -22209 -102344 -200837 -270152 -239224 -150714 -154538 -252987 -270429 -283321 -229726 -57374
10791e7374J45935q8088J00056J25224K1072m5793o9404p7238l9112j5676l8981
$$ -57374 88561 473 100529 225753 246825 201032 131628 54390 15278 -398 -39379
10780c9379J454N8075j68216O5590n881P5595L2290j06358Q162m8382q4344l0884
$$ -39379 -37925 20150 -148066 -82476 -88357 -12762 19528 -86830 -78668 -127050 -211394 -242278
10768b42278K3363J61869M7410j65058m7307J56619Q4133J23397Q8800j17855
$$ -242278 -218915 -57046 -9636 -174694 -222001 -65382 18751 142148 230948 113093
10758A13093q5120m3779o295m4038n2123J4757J00462k5686j1550K9893P31L9864
$$ 113093 27973 -15806 -22101 -66139 -118262 -103505 -3043 -28729 -40279 -10386 -9655 30209
10746C0209k9686n1859J4989k8384q106O3485N0737Q0457J32510m7162p3073j9942
$$ 30209 523 -51336 -36347 -64731 -72837 -9352 41385 121842 254352 207190 134117 114175
10734A14175O8062l5604r9302m8299N4910J6563K3421J13669k6681j40649n7888
$$ 114175 182237 146633 47331 -968 53942 70505 93926 207595 180914 40265 -17623
10723a7623M5651L9335j10094m9455R4120Q3160p612k2459Q2808P986j9444K5950
$$ -17623 28028 67363 -42731 -92186 1934 85094 77482 55023 137831 145817 126373 152323
10711A52323M54j37125l0562m456K9945m1628p4053j2673N1777j20990m7335P5833
$$ 152323 152777 15652 -14910 -19366 10579 -31049 -105102 -117775 -65998 -186988 -234323 -158490
10699a58490P4294o0857m0681N9251q093N0262M2896j5062L8905M363j7308L552
$$ -158490 -84196 -145053 -185734 -126483 -134576 -84314 -41418 -56480 -17575 -13212 -30520 -26968
10687b6968j0641R82n9845O4150M6960q9729j6890J2999N3518p9580j19758j01866
$$ -26968 -37609 -36627 -96472 -32322 14638 -75091 -91981 -78982 -25464 -105044 -224802 -326668
10675c26668o9363J31036O946K4392J02995J15144J2799M1728o8047p0031J7360
$$ -326668 -396031 -264995 -258049 -233657 -130662 -15518 -2719 39009 -29038 -99069 -81709
10664h1709M1214q9217j6181L7050K5550j5436r2606j83082R4728J37732M9986
$$ -81709 -40495 -129712 -145893 -108843 -83293 -98729 -191335 -374417 -279689 -141957 -91971
10653i1971n2121j21305Q133Q9052O0657j15247n5210L1863J34506P2577N8267
$$ -91971 -144092 -265397 -257264 -168212 -107555 -222802 -278012 -246149 -111643 -39066 19201
10642A9201q3516j44596k403K4359P288O6793J05686k9000j03879J0964j5350
$$ 19201 -64315 -208911 -211314 -186955 -179667 -112874 -7188 -36188 -140067 -129103 -144453
10631a44453r2690o1221J37480J08965l0387o6243L7779R812L6991o7982j5450
$$ -144453 -237143 -298364 -160884 -51919 -82306 -148549 -110770 -100958 -63967 -131949 -147399
10620a47399Q6774k4143K9815J55297o1137J0589Q7354J25907o9518j86941p6962
$$ -147399 -60625 -84768 -54953 100344 39207 49796 137150 263057 193539 6598 -70364
10609g0364M9096R8523j8557l496j1260O058p722m2970J4508l8695l726n686M1330
$$ -70364 -21268 77255 58698 55202 43942 50000 42278 -692 13816 -24879 -28605 -34291 7039
10596G039J07159P212n7662q6813k6159J2381l1864L4880k4949L4241M930O0156
$$ 7039 114198 121410 63748 -23065 -49224 -36843 -68707 -33827 -58776 -24535 -19605 40551
10584D0551J45472J40221l1005n8908n7743M0874M2713Q277p8137p9327p8681
$$ 40551 186023 326244 295239 236331 178588 219462 262175 270452 192315 112988 34307
10573C4307j24393r7936K0100J25914J60285L1492p7616j79472n8109J75351M8407
$$ 34307 -90086 -188022 -167922 -42008 118277 149769 72153 -107319 -165428 9923 58330
10562E8330j06138j1185j526K664k4175j5764k0342M0534L1302J29763J70193
$$ 58330 -47808 -58993 -60519 -57855 -82030 -97794 -118136 -77602 -46300 83463 253656
10551B53656j4415m9628l8545l7714j08727k156m4167N5012L3299N1456j9420
$$ 253656 239241 189613 151068 113354 4627 2471 -41696 13316 46615 98071 78651
10540G8651j288L8841j15424R2157o9166k7488J20564O4343r1347l0339n9958
$$ 78651 77363 116204 780 92937 23771 -3717 116847 181190 89843 59504 -454
10529d54M6791P4556j01665J26369J6129l6462K1868o4770M6738q5313n7511L151
$$ -454 46337 120893 19228 145597 161726 125264 147132 82362 129100 43787 -13724 -10573
10517a0573l359j3125l4283J01943N5864o2133N1866m713j09383M1838Q6623m9336
$$ -10573 -13932 -27057 -61340 40603 96467 34334 86200 81487 -27896 13942 100565 51229
10505E1229O1823R68l4361k2984j77337O297R5471L9981R69m3430L0626J8089
$$ 51229 113052 114020 79659 56675 -120662 -114365 -18894 21087 22056 -21374 9252 27341
10493B7341P996q5574L9129l8037N8456R1519j75082n2394O1316O7888o1068p2516
$$ 27341 35337 -50237 -11108 -49145 9311 100830 -74252 -126646 -65330 2558 -58510 -131026
10481a31026M442R8796J01537P5466P9521j4128j01230k7943p1382K4159L6039
$$ -131026 -126584 -27788 73749 149215 228736 214608 113378 85435 14053 38212 74251
10470G4251j34378J9078m8106j09111J68106K73893J9068p2737k1968j7982q7660
$$ 74251 -60127 -41049 -89155 -198266 -30160 243733 262801 190064 168096 150114 62454
10459F2454o5965M488O054n5467j6408o8491J25413K06938J9771m8461m6127j12474
$$ 62454 -3511 977 7031 -48436 -64844 -133335 -7922 199016 218787 170326 124199 11725
10447A1725n3153n3584q8759O0508J00275J78623J7900p4801K2373J1733r0938
$$ 11725 -41428 -95012 -183771 -123263 -22988 155635 173535 98734 121107 132840 41902
10436D1902m029k965j8196q8418m3618Q8986N8426m3134J0355J02026l8924n4698
$$ 41902 37873 34908 16712 -71706 -115324 -26338 32088 -11046 -691 101335 62411 7713
10424G713j07129Q1640O8543k2391o3098J21259J52532j5545j29128j9514j3863
$$ 7713 -99416 -17776 50767 28376 -34722 86537 239069 223524 94396 74882 61019
10413F1019j1271j17752P4850m0063k5969p650M328p055O3958J42288j6834o4832
$$ 61019 49748 -68004 6846 -33217 -59186 -66836 -62508 -69563 -5605 136683 119849 55017
10401E5017j05068r9449J8819K6636k5690O9989J25062j3382o3087m4152L5281
$$ 55017 -50051 -149500 -130681 -104045 -129735 -59746 65316 51934 -11153 -55305 -20024
10390b0024j14497O8114J24863r4422j68602j22559K8730M3625P3498P1255J0065
$$ -20024 -134521 -66407 58456 -35966 -204568 -327127 -298397 -254772 -181274 -110019 -99954
10379i9954k3709M4647Q7732j005l4178P0478k5187j27120j21486o1831L3032
$$ -99954 -123663 -79016 8716 7711 -26467 44011 18824 -108296 -229782 -291613 -258581
10368b58581J75091k0780j498Q9858J55815j4300j4471M4571L0534m5834o3575
$$ -258581 -83490 -104270 -105768 -15910 139905 125605 111134 155705 186239 140405 76830
10357G6830l1232k4707m0942J0986O0999l8772o5341P1007J5519K1974n2637J1391
$$ 76830 45598 20891 -20051 -9065 51934 13162 -52179 18828 34347 56321 3684 15075
10345A5075R7827P8836m0801j18614m5895P5981O0699P4108n9651J27690J31130
$$ 15075 112902 191738 150937 32323 -13572 62409 123108 197216 137565 265255 396385
10334C96385o1842j38162j80193l258O3798P78j8531R99o1486j10093n4906N5335
$$ 396385 334543 196381 16188 12930 76728 77506 58975 59974 -1512 -111605 -166511 -111176
10322a11176N9747k799m2543Q3452P5083q7529j17336N7768J24375J2309Q9747
$$ -111176 -51429 -54228 -96771 -13319 61764 -25765 -143101 -85333 39042 51351 141098
10311A41098J0047K2616m9712m4975p8176k1190L2098P7134N3873J35849m4274
$$ 141098 151145 173761 124049 79074 898 -20292 11806 88940 142813 278662 234388
10300B34388J2015m0598m2673J16784n7315j70348J9269r1563p3318L4969P0824
$$ 234388 246403 205805 163132 279916 222601 52253 71522 -20041 -93359 -58390 12434
10289A2434m8715j8643N059o0286r4401J62607N6655n6436N1944J4815J33011
$$ 12434 -36281 -54924 -49865 -110151 -204552 -41945 14710 -41726 10218 25033 158044
10278A58044p4845r1968o814M1851M1381p8734j9646m1601k5474M421K3363N0428
$$ 158044 83199 -8769 -15583 26268 67649 -11085 -30731 -72332 -97806 -93385 -70022 -19594
10266a9594J62931Q6821K5934L7356j15942l4921o6860K2845l9713R5244J1236
$$ -19594 143337 230158 256092 293448 177506 142585 75725 98570 58857 154101 165337
10255A65337j07652q7475j8409N2479k6058M157j04388M4663K3649J50783l8761
$$ 165337 57685 -29790 -48199 4280 -21778 -17621 -122009 -77346 -53697 97086 58325
10244E8325j9061K8722O5584N7252R2133r0524o2210j24571j8499M3586L6255
$$ 58325 39264 67986 133570 190822 282955 192431 130221 5650 -12849 30737 66992
10233F6992N7150N1668o3218o7006k3139k0875R1215J34339q55j39571j17853
$$ 66992 124142 175810 112592 45586 22447 1572 92787 227126 226271 86700 -31153
10222c1153N2922R0675J23242q558r0553r620m2074L688m5156K7927p5855o9489
$$ -31153 21769 112444 235686 227128 136575 126955 84881 88569 43413 71340 -4515 -74004
10210g4004M1357r8734P9156L1767L8553n1774P890j2201N241N5978l6184n6823
$$ -74004 -32647 -131381 -52225 -20458 18095 -33679 -25789 -37990 -32749 23229 -12955 -69778
10198f9778J11184O5625j299k4977o2183j30885k1953K1385O6883K8273n1594
$$ -69778 41406 107031 105732 80755 18572 -112313 -134266 -112881 -45998 -17725 -69319
10187f9319j42959r391J03114k8468K2627J00157K6885R5488N9163l8339K9363
$$ -69319 -212278 -221669 -118555 -147023 -124396 -24239 2646 98134 157297 118958 148321
10176A48321J31951o4700j46183M4401J4706o0267o6048J3875J05836q8956k3747
$$ 148321 280272 215572 69389 113790 128496 68229 2181 16056 121892 32936 9189
10165I189l7216l090K1581J5325k2337q581L516J49658o7750k1002N5477q222
$$ 9189 -28027 -31117 -9536 5789 -16548 -25129 -21613 128045 60295 39293 94770 86548
10153H6548o3067m3521K0358P5973J48664l4871k97134p6970L4102L4000K13406
$$ 86548 23481 -20040 318 76291 224955 190084 -107050 -184020 -149918 -115918 97488
10142I7488O6008j15297l6773O5716M6839j05198M6038P5634l466O0923j2666
$$ 97488 163496 48199 11426 77142 123981 18783 64821 140455 136989 197912 185246
10131A85246m6688K1819r31K239r8121m7138J31449O6657j24447o2937L0636Q1991
$$ 185246 138558 160377 159446 161685 63564 16426 147875 214532 90085 27148 57784 139775
10119A39775K7054n2225l2909J1463p7807O5802L0781k7918k1448j50742k0424
$$ 139775 166829 114604 81695 93158 15351 81153 111934 84016 62568 -88174 -108598
10108a08598j9430J3701N2028L9898k4480l5706J36688J32660p3628o858p4707
$$ -108598 -128028 -114327 -62299 -22401 -46881 -82587 54101 186761 113133 106275 31568
10097C1568m0212M9101J05409M5585J8837m7599k7101L2374J32914K7803q9113
$$ 31568 -8644 40457 145866 191451 210288 162689 135588 167962 300876 328679 239566
10086B39566p3767q3688m1922J12754j2749R830L4804p051K9114J2183j13318
$$ 239566 165799 82111 40189 152943 140194 150024 184828 177777 206891 219074 105756
10075A05756m2770o1197Q7652J67790q19o5812J04061P1449p328J80732J78593
$$ 105756 62986 1789 89441 257231 256412 190600 294661 366110 358782 539514 718107
10064G18107J26684J36011L4476O1171K15899L08491M21715M13433L12380M72945
$$ 718107 844791 980802 1015278 1076449 1292348 1600839 2022554 2435987 2748367 3221312
10054C221312Q00253J220799J713251L058604N864819J0333862R124546l108158
$$ 3221312 4021565 5242364 6955615 10014219 15879038 26212900 35337446 32229288
10046C2229288q896125q431513n655461l164516j637754r68128o28033n47292
$$ 32229288 23333163 14901650 9246189 6081673 4443919 3475791 2847758 2300466
10038B300466n61046k76258j65508j14582k61746j75058j1705J13796l1261j33346
$$ 2300466 1739420 1463162 1297654 1183072 921326 746268 734563 848359 817098 683752
10028F83752p0278m9882r9495m6757m1192l0594J6606r8199J0694K9969m0467
$$ 683752 613474 563592 464097 417340 376148 345554 362160 263961 274655 304624 264157
10017B64157j0107m005o5396j58362l7652K4078O9926n6321N5195j43762j03032
$$ 264157 254050 250045 184649 26287 -11365 12713 82639 26318 81513 -62249 -165281
10006a65281O2253J03219K7714q574L3782l4659J1727N6053j04000p2027N3099
$$ -165281 -103028 191 27905 19331 53113 18454 30181 86234 -17766 -89793 -36694
9995c6694P0777O2969N8815j6335j20047j41025L9242J05028k3646L8074j2649
$$ -36694 34083 97052 155867 139532 19485 -121540 -82298 22730 -916 37158 24509
9984B4509K1183J3099n2804J7568J02891O6452l3650O3002L4926r4819k9745j625
$$ 24509 45692 58791 5987 23555 126446 192898 159248 222250 257176 162357 132612 130987
9972A30987J11079n2092r7490O5727P1978R682k8348j8107q2332R58n1312k0192
$$ 130987 242066 189974 92484 158211 230189 239871 211523 193416 111084 112042 60730 40538
9960D0538M1727j5929O4361J11280q0714l3352k492M1203R3478j02315r2687q2592
$$ 40538 82265 66336 130697 241977 161263 127911 125419 166622 260100 157785 65098 -17494
9948a7494P8638j8528K3095P5360K4028o5812j06952R681J27281J9689P5214r2638
$$ -17494 61144 42616 65711 141071 165099 99287 -7665 2016 129297 148986 224200 131562
9936A31562r8378n3097M3103K7768L2290N7035q5285n9791J12459O9015q2627
$$ 131562 33184 -19913 23190 50958 83248 140283 54998 -4793 107666 176681 94054
9925I4054J8785o6607L4418P212r2151K8104M4440J3327K1472K4953J10940J0838
$$ 94054 112839 46232 80650 87862 -4289 23815 68255 81582 103054 128007 238947 249785
9913B49785j02422n5025Q620J5963O8315J04390k2054l1426M8296m5587r1041
$$ 249785 147363 92338 100958 116921 185236 289626 267572 236146 284442 238855 147814
9902A47814m2922j07686j8167M5526L064J26742P9821L5211P1299M077j28072
$$ 147814 104892 -2794 -20961 24565 27629 154371 234192 269403 340702 344779 216707
9891B16707j81635p6198J33044k2649J6021o9056n473j3361J16800J7654q1341
$$ 216707 35072 -41126 91918 69269 85290 16234 10761 -2600 114200 131854 50513
9880E0513L0125l0503M7444P364L5766L398m3368j21897J41140J23730P989M8294
$$ 50513 80638 50135 97579 104943 140709 144107 100739 -21158 119982 243712 251701 299995
9868B99995o3889q1042p2720m221K9491L2677J41900R4915r6614j81309j10421
$$ 299995 236106 155064 82344 78123 107614 140291 282191 377106 280492 99183 -11238
9857a1238J16719K21625M7375n1953r0685p5291k3619m9304m9217K4367M84j5916
$$ -11238 105481 327106 374481 322528 231843 156552 132933 83629 34412 58779 59263 43347
9845D3347j05959K1116P9885P7398M9476o2468l2337j7405M8003l0177k4265N1323
$$ 43347 -62612 -41496 38389 115787 165263 102795 70458 53053 101056 70879 46614 97937
9833I7937N1780n1744J9748O8538k7548j53711j23627L7780N940L338L4542R8697
$$ 97937 149717 97973 117721 186259 158711 5000 -118627 -80847 -74907 -71569 -37027 61670
9821F1670n7405M914J8494O2067J9290l53l3060o9086Q0887J03359n0360q9133
$$ 61670 4265 9179 27673 89740 109030 108677 75617 6531 87418 190777 140417 51284
9809E1284N881n3859m7058J59923J12674J3587j45369j15678R9669P1270l6162
$$ 51284 57165 3306 -43752 116171 228845 242432 97063 -18615 81054 152324 116162
9798A16162j07669r4311J2974K8228M712N4391J9107m6390L8437J60477q6405
$$ 116162 8493 -85818 -72844 -44616 -39904 14487 33594 -12796 25641 186118 99713
9787I9713p8144L1126M0900K9937J75381Q0037j03509j65055J02642O862j25378
$$ 99713 21569 52695 93595 123532 298913 378950 275441 110386 213028 219890 94512
9776I4512K335q7048M5343J10801J73205P4322n4029j37178r0391o8150R3779
$$ 94512 96847 9799 55142 165943 339148 413470 359441 222263 131872 63722 157501
9765A57501N9022M434J9105k4739k2747J06455p1845j43265j29998j28070R0455
$$ 157501 216523 220957 240062 215323 192576 299031 227186 83921 -46077 -174147 -83692
9754h3692L80421J3020r5692j44304r9578Q287m3171Q3560R9532k1968k0585P246
$$ -83692 296729 309749 214057 69753 -29825 -21538 -64709 18851 118383 96415 75830 83076
9742H3076p4032n1664K1541R8558P5774M6406J6795p272j2960J50994l5253n717
$$ 83076 9044 -42620 -21079 77479 153253 199659 216454 209182 196222 347216 311963 306246
9730C06246p4928j05886Q9237J8960r9441L9322j23423N151J19769N0898K0582
$$ 306246 231318 125432 214669 233629 134188 173510 50087 55238 175007 225905 246487
9719B46487k3403p1340K3384O0844J07706k613q9527n1919O6749l1754j31410
$$ 246487 223084 151744 175128 235972 343678 341065 251538 199619 266368 234614 103204
9708A03204MM3787j38133k0923N3496k8540N6935P2419l9632K7672p3110M9009
$$ 103204 103208 146995 8862 -12061 41435 12895 69830 142249 102617 130289 57179 106188
9696A06188P0298Q9939N5452m0251q196K2818n074K8954k6320N3906J06237k7537
$$ 106188 176486 266425 321877 281626 273430 296248 291174 320128 293808 347714 453951 426414
9684D26414j57987l2851j7112p6417n388J3177o7579J7135L4500O3868J1198M7484
$$ 426414 268427 235576 218464 142047 136659 149836 82257 99392 133892 197760 208958 256442
9672B56442j8347n4480Q1372N2373Q674J35543K3053o6777p0194j3566M6137L1941
$$ 256442 238095 183615 264987 317360 326034 461577 484630 417853 347659 334093 380230 412171
9660D12171j0458j38082j13621l2022O1658P5060J38689K7593R433j5342M3317
$$ 412171 401713 263631 150010 117988 179646 254706 393395 420988 430421 415079 458396
9649D58396l1737O1357p2471r0049J05673J51062r6345l2191Q9237Q9025r2636
$$ 458396 426659 488016 415545 325496 431169 582231 485886 453695 542932 631957 539321
9638E39321j37620p4533j45001j87782m2801J02236M1134m8199N7210R4774R4523
$$ 539321 401701 327168 182167 -5615 -48416 53820 94954 46755 103965 198739 293262
9627B93262p95J4999p3129o4799p0981Q0748L8323J06534O8541N0774J41705o8522
$$ 293262 292467 307466 234337 169538 98557 179305 217628 324162 392703 443477 585182 516660
9615E16660j06567N314o7285j69333M172J19657J29115N1161j1572M4173k7325
$$ 516660 410093 415407 348122 178789 182961 302618 431733 482894 471322 515495 488170
9604D88170O819O8788j6661j776Q4235m8334k56571k9922L7332N6795K7492O4560
$$ 488170 494989 563777 547116 545340 629575 581241 324670 294748 332080 388875 416367 480927
9592D80927o077Q7888j1685n1569n580n7249O6357l629j7258K2804j7985M805
$$ 480927 474850 562738 551053 499484 493904 436655 503012 499383 482125 504929 486944 491749
9580D91749N8979n649j61224r7094L4011k1812M5360N0735P7614J72527L294p5048
$$ 491749 550728 545079 383855 286761 320772 298960 344320 395055 472669 645196 648490 573442
9568E73442o8589j87852o8810P5351J9844Q0214L1334N16J29674k4332j29648
$$ 573442 504853 317001 248191 323542 343386 423600 454934 455450 585124 560792 431144
9557D31144n4412N9863J6198m4376M1453P4731j8803J1923N1914N7827p7932O3502
$$ 431144 376732 436595 452793 408417 449870 524601 505798 517721 569635 627462 549530 613032
9545F13032M9142p9321n4054K2544R7468P1496P55m5044N9579k2988m8706k1477
$$ 613032 662174 582853 528799 551343 648811 720307 721062 676018 735597 712609 663903 642426
9533F42426M2511L4015j992j9524j6092j49246n3115J4922J2001J68818m8428
$$ 642426 684937 718952 716960 697436 681344 532098 478983 493905 505906 674724 626296
9522F26296m5253J25902J52297p6095j11608q1255j2138L4048K1093R0405N2668
$$ 626296 581043 706945 859242 783147 671539 590284 578146 612194 633287 723692 776360
9511G76360k4174r6858m1915J00808M9066K1836m8546o4425M1839R7398R0754
$$ 776360 752186 655328 613413 714221 763287 785123 736577 672152 713991 811389 902143
9500I02143m7050k06691J34980J50638m1088o7784k3237j8331J36956m6702l3110
$$ 902143 855093 648402 783382 934020 892932 825148 801911 783580 920536 873834 840724
9489H40724N724j41836m3145P0938M5176K0617P1616r3936q679M0995K4212P0824
$$ 840724 846448 704612 661467 732405 777581 798198 869814 775878 767199 808194 832406 903230
9477I03230k2507p2697j5292l5452Q6481K3677k8321L9657O731K063j25275j7015
$$ 903230 880723 808026 792734 757282 843763 867440 839119 878776 885507 887570 762295 745280
9465G45280N7861J08170l5121n0350p181Q2299J30223J6635k1716L3973l6046
$$ 745280 803141 911311 876190 825840 818659 900958 1031181 1047816 1026100 1060073 1024027
9454A024027K7808p3793r9595M6325M0075k2072R8553m5939P0440O7859j23044
$$ 1024027 1051835 978042 878447 924772 964847 942775 1041328 995389 1065829 1133688 1010644
9443A010644m4893m512j2377Q7814J36403R034M6503J278O3945J01824o5745o9779
$$ 1010644 965751 961239 948862 1036676 1173079 1182113 1228616 1229894 1293839 1395663 1329918 1260139
9431A260139k4804M8616M0983M7691N7676q0186j621J12974q7588k3444J09091
$$ 1260139 1235335 1283951 1324934 1372625 1430301 1350115 1348494 1461468 1373880 1350436 1459527
9420A459527j2670j0882L5986k3441n3503j2553l8025m7319P0110l3078P5044
$$ 1459527 1446857 1435975 1471961 1448520 1395017 1382464 1344439 1297120 1367230 1334152 1409196
9409A409196J51069P0609j05823Q5360J10584j4535j11134j9951O6814J70273
$$ 1409196 1560265 1630874 1525051 1610411 1720995 1706460 1595326 1575375 1642189 1812462
9399A812462J46474L7212P5948J07243j7228j71266m0762O1972O0073o3629P5703
$$ 1812462 1958936 1996148 2072096 2179339 2162111 1990845 1950083 2012055 2072128 2008499 2084202
9388B084202J2369j1807o7739K0601Q0862K1355O0088k4300k1373J3014J47548
$$ 2084202 2096571 2084764 2017025 2037626 2118488 2139843 2199931 2175631 2154258 2167272 2314820
9377B314820J59996N8908r5639O0365K9179p015J12342m2165J3884R8018N936
$$ 2314820 2474816 2533724 2438085 2498450 2527629 2520614 2632956 2590791 2604675 2702693 2708629
9366B708629J32898N7358r4026J0736K9689M5627P6853K5657O1885P1372N7977
$$ 2708629 2841527 2898885 2804859 2815595 2845284 2890911 2967764 2993421 3055306 3126678 3184655
9355C184655Q5710k2046J75932P8282m4237J45096R1025m1585M6182N4792p822
$$ 3184655 3270365 3248319 3424251 3502533 3458296 3603392 3694417 3652832 3699014 3753806 3745984
9344C745984l2576P0376J35240J01245Q6060J28633N5755o3226r0155L455J16395
$$ 3745984 3713408 3783784 3919024 4020269 4106329 4234962 4290717 4227491 4137336 4140791 4257186
9333D257186J06317J05969n8317N9844J67567M4489K1462K2167J36815R8863J10056
$$ 4257186 4363503 4469472 4411155 4470999 4638566 4683055 4704517 4726684 4863499 4962362 5072418
9322E072418K1560l9787P2398J60477L2752P6388Q6834l2799J10280J00045N4008
$$ 5072418 5093978 5054191 5126589 5287066 5319818 5396206 5483040 5450241 5560521 5660566 5714574
9311E714574N703J09360J10326J7805J6124j1532q926J07700P9225P8283O9850
$$ 5714574 5720277 5829637 5939963 5957768 5973892 5962360 5953434 6061134 6140359 6218642 6288492
9300F288492k1985J23704J24836O5506k6823N722L6842M1732N5736L035O0197
$$ 6288492 6266507 6390211 6515047 6580553 6553730 6559452 6596294 6638026 6693762 6696797 6756994
9289F756994O4994K9903o6443j43345O8646K3591l6531m5464j2436K9145r3401
$$ 6756994 6821988 6851891 6785448 6642103 6710749 6734340 6697809 6652345 6639909 6669054 6575653
9278F575653o2254P2764R6037j2092j02710k18731o9013K7218O3866r8591j23911
$$ 6575653 6513399 6586163 6682200 6670108 6567398 6348667 6279654 6306872 6370738 6272147 6148236
9267F148236M5754O5386l2891Q6352N7971k1087k03980q5310O6320J2309k00856
$$ 6148236 6193990 6259376 6226485 6312837 6370808 6349721 6145741 6060431 6126751 6139060 5938204
9256E938204j11815L4782l3581j28702j03870j84046p2595m0173m7750m8242j04526
$$ 5938204 5826389 5861171 5827590 5698888 5595018 5410972 5338377 5298204 5250454 5202212 5097686
9245E097686j34198n7615j40644j62578N0894J57030q4465j22741j13757j5329
$$ 5097686 4963488 4905873 4765229 4602651 4653545 4810575 4726110 4603369 4489612 4474283
9235D474283o2188j7725J3476o7617n1705k3882k21304j80995J2514m6221j21540
$$ 4474283 4412095 4394370 4407846 4340229 4288524 4264642 4043338 3862343 3874857 3828636 3707096
9224C707096k0283L0841l337N4572r1412k25081j5920l3946o1014P0650l7135
$$ 3707096 3686813 3717654 3714317 3768889 3677477 3452396 3436476 3402530 3341516 3412166 3375031
9213C375031m2347J6998q308k4217K9065p1265j30829j04019m253p1990n5198
$$ 3375031 3332684 3349682 3341374 3317157 3346222 3274957 3144128 3040109 3035856 2963866 2908668
9202B908668j04924Q4192O7j4194l3927j02891m8627J3764j64479j01947J31723
$$ 2908668 2803744 2887936 2888003 2873809 2839882 2736991 2688364 2702128 2537649 2435702 2567425
9191B567425O9191K45j0622K6903l0114n6533O1307K9926m8093j16127j10022
$$ 2567425 2636616 2636861 2626239 2653142 2623028 2566495 2627802 2657728 2609635 2493508 2383486
9180B383486Q350o3443k5898o2896o4373O4384K7287N780o3698l0724q878p2474
$$ 2383486 2391836 2328393 2302495 2239599 2175226 2239610 2266897 2272677 2208979 2178255 2169377 2096903
9168B096903o5434K4007J08187j55689j27475N8492O113O556q6814j8373J8672
$$ 2096903 2031469 2055476 2163663 2007974 1880499 1938991 1945104 1951660 1864846 1846473 1865145
9157A865145l3011m5867K810R1343j10024j0767Q3056Q5713k7130j5101k673j46485
$$ 1865145 1832134 1786267 1789077 1880420 1770396 1759629 1842685 1928398 1901268 1886167 1883494 1737009
9145A737009K9563L2822j08978m7538M0666N2905O6403M8734N100p1008p791p7676
$$ 1737009 1766572 1799394 1690416 1642878 1683544 1736449 1802852 1851586 1856686 1785678 1777887 1700211
9133A700211N6766M2620k1857M954L7444n3579l907J07454M6779o0766k8462q0367
$$ 1700211 1756977 1799597 1777740 1782694 1820138 1766559 1762652 1870106 1916885 1856119 1827657 1747290
9121A747290j4843j4406k0179K3147P6453k772o8804M1369j309j37903P5248J65821
$$ 1747290 1732447 1718041 1697862 1721009 1797462 1794690 1725886 1767255 1765946 1628043 1703291 1869112
9109A869112L7176m2907j07983J44030R5850L360J46975J92992J79015K27328
$$ 1869112 1906288 1863381 1755398 1899428 1995278 1998638 2145613 2338605 2517620 2744948
9099B744948R4114J10221J12827J09678L8820p8043k94280l12690k44244j78344
$$ 2744948 2839062 2949283 3062110 3171788 3210608 3132565 2838285 2525595 2281351 2103007
9089B103007j06895l7918N0467k0871j32267j23923K3467O9718M8541L2423j27693
$$ 2103007 1996112 1958194 2008661 1987790 1855523 1731600 1755067 1824785 1873326 1905749 1778056
9078A778056L8646j19668K1398M4879N5251R2876K4205L5064O2938l5285J2959
$$ 1778056 1816702 1697034 1718432 1763311 1818562 1911438 1935643 1970707 2033645 1998360 2011319
9067B011319Q372k6625p9713R0049J30958J4487J79179Q3068L9449J96735K82868
$$ 2011319 2019691 1993066 1913353 2003402 2134360 2148847 2328026 2411094 2450543 2647278 2930146
9056B930146K32366K23784L17565M32692M74510O21797M57742J1854j22149o8728
$$ 2930146 3162512 3386296 3703861 4136553 4611063 5232860 5690602 5702456 5580307 5511579
9046E511579k22462j25381J05574K56033L23794N98090O81885O63778O08968L15161
$$ 5511579 5289117 5163736 5269310 5525343 5849137 6447227 7129112 7792890 8401858 8717019
9036H717019j34355m95417p17839q26332r71807p53327n45638n21961l79803k07245
$$ 8717019 8582664 8087247 7369408 6543076 5571269 4817942 4272304 3750343 3370540 3163295
9026C163295j67532k10297p6488q539l2251m8061p2743J7344K011j19562k6296
$$ 3163295 2995763 2785466 2708978 2700439 2668188 2620127 2547384 2564728 2566739 2447177 2420881
9015B420881M4362M1278L2362j6726P5360K47321J89898K72238K20717K19828
$$ 2420881 2465243 2506521 2538883 2522157 2597517 2844838 3034736 3306974 3527691 3747519
9005C747519K38151L75472L47071L96511M12335L73888M62046O09420N31562N06980
$$ 3747519 3985670 4361142 4708213 5104724 5517059 5890947 6352993 6962413 7493975 8000955
8995H000955L51078j9164l28478o17483r69480q59949o09327n90962n00968l19933
$$ 8000955 8352033 8332869 8004391 7386908 6417428 5557479 4948152 4357190 3856222 3536289
8985C536289l04585k14351p6584j89196j85903j25591o9575r7622j38953Q963
$$ 3536289 3231704 3017353 2940769 2751573 2565670 2440079 2370504 2272882 2133929 2142892
8975B142892R0779k6082P4381J31421K29580K3125j27133j40626k06134q4482
$$ 2142892 2233671 2207589 2281970 2413391 2642971 2666096 2538963 2398337 2192203 2107721
8965B107721j27209j48784j28071j21173j71681P103J30935L0879o7999L0632
$$ 2107721 1980512 1831728 1703657 1582484 1410803 1417906 1548841 1579720 1511721 1542353
8955A542353J65073k276K7372o511k1831N9475J11494J8256J4454M4360K2939
$$ 1542353 1707426 1705150 1732522 1726011 1704180 1763655 1875149 1893405 1907859 1952219 1975158
8944A975158L0948n7641o8467k1708K2385K02852O9415j25012m8747m8393M9487
$$ 1975158 2006106 1948465 1879998 1858290 1880675 2083527 2152942 2027930 1979183 1930790 1980277
8933A980277P0162N2942Q0486J72744J60209K27840N9191J80361R4297J057m6528
$$ 1980277 2050439 2103381 2183867 2356611 2516820 2744660 2803851 2984212 3078509 3079566 3033038
8922C033038j6043Q8283O3505J35091J50711K14729J23744K38991M86166M39293
$$ 3033038 3016995 3105278 3168783 3303874 3454585 3669314 3793058 4032049 4518215 4957508
8912D957508L47938O25656P33535P46045O26467L95993K91962M89149N25923M94399
$$ 4957508 5305446 5931102 6664637 7410682 8037149 8433142 8725104 9214253 9740176 10234575
8902A0234575L33837K54455P7282k18403n90171p83747q97091r40422p84898n99173
$$ 10234575 10568412 10822867 10900149 10681746 10091575 9307828 8410737 7470315 6685417 6086244
8892F086244n07440m42831l48467k41247j60980j24965M833j09570o0952l1716
$$ 6086244 5578804 5135973 4787506 4546259 4385279 4260314 4265147 4155577 4094625 4062909
8882D062909j957j5508l4461k1400P3341J61474L87240K94808K33267L87972L42405
$$ 4062909 4060952 4045444 4010983 3989583 4062924 4224398 4611638 4906446 5139713 5527685 5870090
8871E870090L28675M00507M18218N24433M82914L51196K84655J83483J85119K75958
$$ 5870090 6198765 6599272 7017490 7541923 8024837 8376033 8660688 8844171 9029290 9305248
8861I305248N07036M95338K77570p5544k15028o17623q63388r64014q55731q29825
$$ 9305248 9812284 10307622 10585192 10509648 10294620 9676997 8813609 7849595 6993864 6164039
8851F164039n85679n65228m10789l13014k36384j59937j62019j09513j32257k04766
$$ 6164039 5578360 5013132 4602343 4289329 4052945 3893008 3730989 3621476 3489219 3284453
8841C284453k0522j12162j64771o6932j81916j60805n7680P9538O8337k0093j46530
$$ 3284453 3263931 3151769 2986998 2920066 2738150 2577345 2519665 2599203 2667540 2647447 2500917
8830B500917q1847J8884n3514m3738n326j0449o784l4248o5190Q985Q8610j18706
$$ 2500917 2419070 2437954 2384440 2340702 2335376 2324927 2318143 2283895 2218705 2227690 2316300 2197594
8818B197594j29845P8508N0489p77N9168j39870o4882j4624n8616n2842O8736
$$ 2197594 2067749 2146257 2196746 2195969 2255137 2115267 2050385 2035761 1977145 1924303 1993039
8807A993039Q1453J34937Q8232K6357J5062j52419l6474o4906l9494p0830m3266
$$ 1993039 2074492 2209429 2297661 2324018 2339080 2186661 2150187 2085281 2045787 1974957 1931691
8796A931691l3284N1408R5284p5518m2040M0900N7631l2515J1322N7323K7726
$$ 1931691 1898407 1949815 2045099 1969581 1927541 1968441 2026072 1993557 2004879 2062202 2089928
8785B089928j423q373M1764q52m9630R171J1436J362q916J43332m0784l0643o3684
$$ 2089928 2088505 2080132 2121896 2121044 2071414 2080585 2092021 2093383 2084467 2227799 2187015 2156372 2092688
8772B092688j36357J8325J20299l8125l5077k115j8871k2083m2976n2644P0198
$$ 2092688 1956331 1974656 2094955 2056830 2021753 2019638 2000767 1978684 1935708 1883064 1953262
8761A953262L9770j23915o4910J22215J32387r6815k1848j72627j04069O124M1220
$$ 1953262 1993032 1869117 1804207 1926422 2058809 1961994 1940146 1767519 1663450 1669574 1710794
8750A710794n6975K3820m897L8915n9836j01147r3356L5240J73600o7695R2695
$$ 1710794 1653819 1677639 1672742 1711657 1651821 1550674 1457318 1492558 1666158 1598463 1691158
8739A691158O9350k0779O3319Q4471n447L9849L4227N2329K9294J10521o9961
$$ 1691158 1760508 1739729 1803048 1887519 1882072 1921921 1956148 2008477 2037771 2148292 2078331
8728B078331j95203j12483J2181r833o0971j2892O6041O8629m0843m5646M468
$$ 2078331 1883128 1770645 1782826 1772993 1712022 1699130 1765171 1833800 1792957 1747311 1751779
8717A751779r797J2086M5209J9593o4088n8102P3351N8552O6657m3733j84738
$$ 1751779 1741982 1754068 1799277 1818870 1754782 1696680 1770031 1828583 1895240 1851507 1666769
8706A666769n832J58533J34120j5558M8922l6233p0522L363P841o1903O9926P2968
$$ 1666769 1660937 1819470 1953590 1938032 1986954 1950721 1880199 1883562 1891403 1829500 1899426 1972394
8694A972394l4874p1514o2909J4311K6041k2693R2128P5131j08886j9974n8158
$$ 1972394 1937520 1866006 1803097 1817408 1843449 1820756 1912884 1988015 1879129 1859155 1800997
8683A800997P1470O3069k5861j32689j17542k210R4523O9014o9410J14541J60002
$$ 1800997 1872467 1935536 1909675 1776986 1659444 1657234 1751757 1820771 1751361 1865902 2025904
8672B025904q919j39705J0015K2653m3017j04008N5572J22053j25280j34617n8158
$$ 2025904 2016985 1877280 1887295 1909948 1866931 1762923 1818495 1940548 1815268 1680651 1622493
8661A622493l8592M2175M2074K253J66486J66575K3155q4379L8840l8j00945n0084
$$ 1622493 1583901 1626076 1668150 1670403 1836889 2003464 2026619 1942240 1981080 1981042 1880097 1830013
8649A830013q5594K0658J09419J75551k5735j5359m1441q1845j6293r851o4846
$$ 1830013 1744419 1765077 1874496 2050047 2024312 2008953 1967512 1885667 1869374 1859523 1794677
8638A794677j34216p7389N6847J29131j4816l242o4713o6461O7047J95705J58342
$$ 1794677 1660461 1583072 1639919 1769050 1754234 1750992 1686279 1619818 1686865 1882570 2040912
8627B040912M4877O3265k1002j16154r0803m6529j16963R347L1474O6324O9045
$$ 2040912 2085789 2149054 2128052 2011898 1921095 1874566 1757603 1766950 1798424 1864748 1933793
8616A933793l6471m3054p6093Q459L0772J23763J16795N1887r3120n84l1108m2901
$$ 1933793 1897322 1854268 1778175 1786634 1817406 1941169 2057964 2109851 2016731 2016147 1985039 1942138
8604A942138J20772m495M3541R463j5811N7219R5488M0623j76190j23336K6080
$$ 1942138 2062910 2058415 2101956 2111419 2095608 2152827 2248315 2288938 2112748 1989412 2015492
8593B015492M2850n2644Q4060O1898O2605p1677J4405J65467r4863j17629q3456
$$ 2015492 2058342 2005698 2089758 2151656 2214261 2142584 2156989 2322456 2227593 2109964 2026508
8582B026508j24139m4915q629p9997k2975J09837J65480q1062n8282j50580M9727
$$ 2026508 1902369 1857454 1848825 1768828 1745853 1855690 2021170 1940108 1881826 1731246 1780973
8571A780973K2645m6609l2528J4299j3698k6999q7986N0272L1070o9296K3140
$$ 1780973 1803618 1757009 1724481 1738780 1725082 1698083 1610097 1660369 1691439 1622143 1645283
8560A645283J8808j16857O6574O8993j6477r268j97240j9089J7079O2537o1230
$$ 1645283 1664091 1547234 1613808 1682801 1666324 1657056 1459816 1440727 1457806 1520343 1459113
8549A459113m6462l4271j2727p4087m3620J46364P2109K684r0371q8035l2669
$$ 1459113 1412651 1378380 1365653 1291566 1247946 1394310 1466419 1469103 1378732 1290697 1258028
8538A258028J37002J50625m852p6667n9485J27183P3987N8601k2206r9667j23646
$$ 1258028 1395030 1545655 1540803 1464136 1404651 1531834 1605821 1664422 1642216 1542549 1418903
8527A418903n4156K2098O2759R1428n1328k4735J9149l4153n8502L8372j93403
$$ 1418903 1364747 1386845 1449604 1541032 1489704 1464969 1484118 1449965 1391463 1429835 1236432
8516A236432j11578Q505R3508J00763o1786j60324N1756R0841P6661m0149n4092
$$ 1236432 1124854 1133359 1226867 1327630 1265844 1105520 1157276 1248117 1324778 1284629 1230537
8505A230537r0019R7545m939J8607n7209m3731j17024N8799J21210J96499J37017
$$ 1230537 1140518 1238063 1233124 1251731 1194522 1150791 1033767 1092566 1213776 1410275 1547292
$$ [...]
##END NTUPLES=NMR SPECTRUM
##END=
