##TITLE=Analysis number 328770
Compound Code cc 66709
Book Reference 528/40
Project Code adrs
Chemist Name davee
##JCAMPDX= 6.0         $$ Bruker NMR JCAMP-DX V2.0
##DATA TYPE= NMR SPECTRUM
##DATA CLASS= NTUPLES
##ORIGIN= Bruker BioSpin GmbH
##OWNER= nmr
$$ XWIN-NMR		Version 3.5
$$ Tue Jul  3 08:57:09 2007 GMT Daylight Time (UT+1h)  MAYBRIDGE\nmr@NMR_250MHZ
##.OBSERVE FREQUENCY= 250.131544655141
##.OBSERVE NUCLEUS= ^1H
##.ACQUISITION MODE= SIMULTANEOUS (DQD)
##.ACQUISITION SCHEME= undefined
##.AVERAGES= 16
##.DIGITISER RES= 18
##SPECTROMETER/DATA SYSTEM= dpx250
##.PULSE SEQUENCE= zg30
##.SOLVENT NAME= CDCl3
##.SHIFT REFERENCE= (INTERNAL, CDCl3, 0, 16.522)
##AUDIT TRAIL= $$ (NUMBER, WHEN, WHO, WHERE, WHAT)
$$ ##TITLE= Audit trail, XWIN-NMR		Version 3.5
$$ ##JCAMPDX= 5.01
$$ ##ORIGIN= Bruker BioSpin GmbH
$$ ##OWNER= nmr
$$ C:\u/data/dgb/nmr/ADRS/190/pdata/1/auditp.txt
$$ ##AUDIT TRAIL=  $$ (NUMBER, WHEN, WHO, WHERE, WHAT)
(   1,<2007-07-03 08:56:44.93 +100>,<MAYBRIDGE\nmr>,<NMR_250MHZ>,
      <created by zg, POWCHK disabled, PULCHK disabled
       configuration hash MD5:
       76 6E 9A 78 1E 09 19 81 EC 84 63 8F B0 6A 59 2D
       data hash MD5: 64K
       45 A8 54 F9 90 2C FD 38 92 5E D9 5B D0 FE 87 CF>)
(   2,<2007-07-03 08:56:59.91 +100>,<MAYBRIDGE\nmr>,<NMR_250MHZ>,
      <Start of raw data processing
       ef LB = 0.3 FT_mod = 6 PKNL = 1 SI = 32K 
       data hash MD5: 32K
       39 DA 69 AB 9A AA 40 66 E9 9B 2B A3 4E 59 8E 61>)
(   3,<2007-07-03 08:57:01.52 +100>,<MAYBRIDGE\nmr>,<NMR_250MHZ>,
      <apk 
       data hash MD5: 32K
       16 7F 15 14 33 3F BE B2 17 97 B7 00 DC 46 6B 6C>)
(   4,<2007-07-03 08:57:02.23 +100>,<MAYBRIDGE\nmr>,<NMR_250MHZ>,
      <abs ABSG = 5 
       data hash MD5: 32K
       C1 73 07 C8 0C 44 6B BC 74 74 AC 09 60 84 44 6F>)
$$ ##END=
$$ 
$$ hash MD5
$$ AC 1F 8B FB 3B 6A CA 04 5F EA 95 38 20 C3 A9 A3
##$RELAX= 
##$RELAX= 
##$RELAX= 
##$RELAX= 
##$RELAX= 
##$RELAX= 
##$RELAX= 
$$ Bruker specific parameters
$$ --------------------------
##$DU= <C:\u>
##$EXPNO= 190
##$NAME= <ADRS>
##$PROCNO= 1
##$TYPE= <nmr>
##$USER= <dgb>
##$AMP= (0..31)
100 100 100 100 100 100 100 100 100 100 100 100 100 100 100 100 100 100 
100 100 100 100 100 100 100 100 100 100 100 100 100 100 
##$AQSEQ= 0
##$AQ_mod= 3
##$AUNM= <au_zg>
##$AUTOPOS= <3 >
##$BF1= 250.13
##$BF2= 250.13
##$BF3= 250.13
##$BF4= 250.13
##$BF5= 500.13
##$BF6= 500.13
##$BF7= 500.13
##$BF8= 500.13
##$BYTORDA= 1
##$CFDGTYP= 0
##$CFRGTYP= 5
##$CHEMSTR= <none>
##$CNST= (0..31)
1 1 145 1 1 1 1 1 1 1 1 1 1 1 1 1 1 1 1 1 1 1 1 1 1 1 1 1 1 1 1 1 
##$CPDPRG= <>
##$CPDPRG1= <>
##$CPDPRG2= <>
##$CPDPRG3= <>
##$CPDPRG4= <mlev>
##$CPDPRG5= <mlev>
##$CPDPRG6= <mlev>
##$CPDPRG7= <mlev>
##$CPDPRG8= <mlev>
##$CPDPRGB= <>
##$CPDPRGT= <>
##$D= (0..31)
0 1 0 0 0 0 0 0 0 0.06 0 0 0 0 0 0 0.0002 0 0 0 0 0 0 0 0 0 0 0 0 0 0 
0 
##$DATE= 1183449402
##$DBL= (0..7)
120 120 120 120 120 120 120 120 
##$DBP= (0..7)
150 150 150 150 150 150 150 150 
##$DBP07= 0
##$DBPNAM0= <>
##$DBPNAM1= <>
$$ [...]
##$SUBNAM7= <"">
##$SUBNAM8= <"">
##$SUBNAM9= <"">
##$SW= 20.6930455092707
##$SWIBOX= (0..15)
0 0 3 0 0 0 0 0 0 0 0 0 0 0 0 0 
##$SW_h= 5175.983436853
##$TD= 65536
##$TD0= 1
##$TE= 296.16
##$TE2= 300
##$TE3= 300
##$TEG= 300
##$TL= (0..7)
0 120 120 120 120 120 120 120 
##$TP= (0..7)
150 150 150 150 150 150 150 150 
##$TP07= 0
##$TPNAME0= <>
##$TPNAME1= <>
##$TPNAME2= <>
##$TPNAME3= <>
##$TPNAME4= <>
##$TPNAME5= <>
##$TPNAME6= <>
##$TPNAME7= <>
##$TPOAL= (0..7)
0.5 0.5 0.5 0.5 0.5 0.5 0.5 0.5 
##$TPOFFS= (0..7)
0 0 0 0 0 0 0 0 
##$TUNHIN= 0
##$TUNHOUT= 0
##$TUNXOUT= 0
##$USERA1= <user>
##$USERA2= <user>
##$USERA3= <user>
##$USERA4= <user>
##$USERA5= <user>
##$V9= 5
##$VALIST= <valist>
##$VCLIST= <CCCCCCCCCCCCCCC>
##$VD= 0
##$VDLIST= <DDDDDDDDDDDDDDD>
##$VPLIST= <PPPPPPPPPPPPPPP>
##$VTLIST= <TTTTTTTTTTTTTTT>
##$WBST= 1024
##$WBSW= 4
##$XGAIN= (0..3)
0 0 0 0 
##$XL= 0
##$YL= 0
##$YMAX_a= 408815
##$YMIN_a= -594532
##$ZGOPTNS= <>
##$ZL1= 120
##$ZL2= 120
##$ZL3= 120
##$ZL4= 120
##$ABSF1= 16.522
##$ABSF2= -4.171173
##$ABSG= 5
##$ABSL= 3
##$ALPHA= 0
##$AQORDER= 0
##$ASSFAC= 0
##$ASSFACI= 0
##$ASSFACX= 0
##$ASSWID= 0
##$AUNMP= <proc_1d>
##$AZFE= 0.1
##$AZFW= 0.1
##$BCFW= 0
##$BC_mod= 0
##$BYTORDP= 0
##$COROFFS= 0
##$CY= 12.5
##$DATMOD= 1
##$DC= 0
##$DFILT= <>
##$DTYPP= 0
##$F1P= 14.0000005364418
##$F2P= -0.99999901652339
##$FCOR= 0.5
##$FTSIZE= 32768
##$FT_mod= 6
##$GAMMA= 0
##$GB= 0
##$INTBC= 1
##$INTSCL= 1
##$ISEN= 128
##$LB= 0.3
##$LEV0= 0
##$LPBIN= 0
##$MAXI= 10000
##$MC2= 0
##$MEAN= 0
##$ME_mod= 0
##$MI= 0
##$NCOEF= 0
##$NC_proc= -4
##$NLEV= 6
##$NOISF1= 0
##$NOISF2= 0
##$NSP= 0
##$NTH_PI= 0
##$NZP= 0
##$OFFSET= 16.522
##$PC= 1
##$PHC0= -51.11037
##$PHC1= 6.609643
##$PH_mod= 1
##$PKNL= yes
##$PPARMOD= 0
##$PSCAL= 4
##$PSIGN= 0
##$REVERSE= no
##$SF= 250.13
##$SI= 32768
##$SIGF1= 0
##$SIGF2= 0
##$SINO= 400
##$SIOLD= 32768
##$SREGLST= <1H.CDCl3>
##$SSB= 0
##$STSI= 32768
##$STSR= 0
##$SW_p= 5175.98343685301
##$SYMM= 0
##$S_DEV= 0
##$TDeff= 65536
##$TDoff= 0
##$TI= <Analysis number 999999
Compound Code 99
Book Reference 9
Project Code 9>
##$TILT= no
##$TM1= 0
##$TM2= 0
##$TOPLEV= 0
##$USERP1= <user>
##$USERP2= <user>
##$USERP3= <user>
##$USERP4= <user>
##$USERP5= <user>
##$WDW= 1
##$XDIM= 32768
##$YMAX_p= 388842662
##$YMIN_p= -127259
$$ End of Bruker specific parameters
$$ ---------------------------------
##NTUPLES= NMR SPECTRUM
##VAR_NAME=  FREQUENCY,     SPECTRUM/REAL,   SPECTRUM/IMAG
##SYMBOL=    X,             R,               I
##VAR_TYPE=  INDEPENDENT,   DEPENDENT,       DEPENDENT
##VAR_FORM=  AFFN,          ASDF,            ASDF
##VAR_DIM=   32768,         32768,           32768
##UNITS=     HZ,            ARBITRARY UNITS, ARBITRARY UNITS
##FACTOR=    0.157963299565203, 1,           1
##FIRST=     4132.6476996994, 0,             0
##LAST=      -1043.33573715361, 0,           0
##MIN=       -1043.33573715361, -127259,     0
##MAX=       4132.6476996994, 388842662,     0
$$ Real data points
##PAGE= N=1
##DATA TABLE= (X++(R..R)), XYDATA
$$ [...]
22796 4936 -25507 -32054 -52436 -48188 -52358 -57513 -31454 19476 45937 33016 31608 40659 34320
22783 34320 -6218 -24591 -3746 -5227 -28401 -40453 -18651 9150 26574 22183 18093 12762
22771 12762 16761 18476 32425 13159 16353 18757 12439 -1020 -4050 62 3066 5602 1606 7140
22757 7140 19165 -21351 -35623 -11216 -17192 -43730 -42852 -12382 -8662 -2149 12234 2943 18980
22744 18980 27948 14907 578 -22502 -40952 -14371 18807 26546 18521 23943 18254 24458 27791
22731 27791 43517 43545 3338 -8512 -3854 28507 26623 -3248 -17601 -21968 -492 20714 -2089
22718 -2089 2110 24593 9096 -14382 2493 25331 10718 12075 8093 7708 -7813 -18729 -2889
22705 -2889 17782 -6147 -14433 -3278 -14099 4204 21390 17490 28260 29935 36621 25422 29590
22692 29590 16109 -2386 2547 17056 41537 46319 42639 36534 5972 -16454 -11934 -47 -14505
22679 -14505 -10718 4674 41293 34029 -648 -5495 -4589 22285 31195 29613 16514 9044 -10604
22666 -10604 -19377 -6305 25707 47006 32173 37547 4128 -12057 -10116 -7540 -5401 -8506 7869
22653 7869 6534 -33602 -50340 -52724 -28780 12024 14931 26011 27449 1213 -957 10674 15400
22640 15400 4459 18877 12188 -5709 1718 -491 -11332 -22073 -12981 -11706 -26694 -31749 -32906
22627 -32906 -42284 -7976 14303 8701 9458 -1813 -30667 -28768 -20976 -15566 2047 -15198 -44285
22614 -44285 -30192 -14028 8208 11731 -10624 -31905 -35160 -37321 -26716 -24521 -17616 -24393 -33634
22601 -33634 -19776 -7792 -5020 2353 -4058 -11874 -324 7262 37221 40534 22091 32818 48646
22588 48646 41354 -542 -23271 -11032 -484 -4977 6097 27703 44514 50988 45312 60149
22576 60149 57424 51707 49158 34598 42210 42840 44027 24524 8964 -13189 3996 11599 7051
22563 7051 -29760 -54269 -64234 -41243 -47301 -49424 -37018 -22657 -102 8506 -16713 -46837 -6176
22550 -6176 18700 12649 25682 12990 -1476 32021 40186 25669 8999 17331 25011 23534 24634
22537 24634 18798 -5297 2271 1579 -2057 -21308 300 -12411 533 7589 24056 21118 29270
22524 29270 48178 58546 64974 69618 68635 16805 15897 26804 28936 22688 9355 4657 -19695
22511 -19695 -41539 -52819 -38290 -30898 -9638 -3814 733 10787 13889 -3646 5844 -15992 -6012
22498 -6012 2076 -197 30716 26403 10793 -13357 5437 11077 10208 8503 2326 -37394 -59856
22485 -59856 -53691 -67547 -72036 -29720 -6831 1471 -1332 8267 26243 -3149 -6596 535 30597
22472 30597 26673 16342 22877 3372 -10708 21513 28498 8077 2583 15934 8770 6423 -1006
22459 -1006 20470 23650 13793 21018 8930 23404 13109 -16022 -27122 -9754 -1532 -23518 -22614
22446 -22614 -10003 -20186 -37894 -55049 -37708 -10859 15975 32271 11900 9360 15496 13785
22434 13785 18069 -9108 -19996 -17886 -4737 25480 -10208 -2545 -13785 -6304 6327 6606 -5504
22421 -5504 -20533 -7071 12729 -13523 -23846 -12957 10502 24483 29899 12723 16643 9588
22409 9588 10662 8785 13743 17595 34972 51436 31072 1454 -20046 -2230 39479 50329 32414
22396 32414 42836 47340 48400 33994 23672 -19805 -8071 15956 -8079 -21297 -40536 -56157
22384 -56157 -30309 -18134 -34868 -40190 -29388 -20512 -20252 -45767 -42124 -6506 34756 19809 -12529
22371 -12529 -23716 -31621 -17489 1035 -3026 -29562 -13224 11180 13292 9029 -19149 -26258 -13800
22358 -13800 14178 13033 -12600 -9559 -3783 18857 22771 41756 38402 -4556 -9081 -10977 -6693
22345 -6693 -20063 -21514 -28034 -39080 -45519 -29162 -6348 -4863 19986 33271 11612 -472 -6191
22332 -6191 -20139 -2594 3918 9182 -1452 12647 9432 -10199 -17665 20852 29622 7377 -9076
22319 -9076 -16328 -28771 -25246 -44229 -60935 -57743 -47761 -42863 -7971 19613 16168 4480 -13334
22306 -13334 -8952 8488 11441 32938 32035 26328 5587 -226 -4231 -15804 -5677 26237 26873
22293 26873 9217 -4981 9561 8931 -25987 -38695 -24580 -25086 -5744 31449 57588 54567 37092
22280 37092 51159 38764 -10603 -7518 32036 24969 15494 28580 15217 19386 22927 5239 -4371
22267 -4371 11527 19017 22034 5942 4340 -24316 -42692 -30690 -35137 -42218 -7997 -11871 -7963
22254 -7963 -9751 -20888 -20360 -17915 -23847 4270 -6344 -6548 5413 21435 27067 5814 -6139
22241 -6139 19026 -1091 -7812 5408 25651 18646 31665 56545 44551 13387 -12554 -14628
22229 -14628 -14925 -4315 26069 48548 91394 86056 41878 10286 -12941 -24268 -21254 -3784
22217 -3784 20862 40878 26540 28171 17222 -15556 -34385 -32115 -30175 -30082 -28906 -1982 15678
22204 15678 8375 -13865 -20201 2535 8566 -9539 -14766 5519 3981 -11744 -3955 4340 -3241
22191 -3241 1441 -8847 -13477 -26110 4495 22656 39616 25858 21950 32613 27678 -7404 5150
22178 5150 16282 20044 285 13906 20548 -1183 628 11355 -17919 -25579 -22263 -36289 -34536
22165 -34536 -25463 -16346 3576 -5984 -13799 -22855 -22006 -13943 447 45975 38669 15893 -3907
22152 -3907 -20489 -3477 25857 14690 20457 36894 22076 -8284 1098 15048 -9148 -5672
22140 -5672 24883 50002 40954 27003 6970 -27841 -37384 -29975 -21175 -6470 -10268 -8400 2036
22127 2036 2462 1837 -2564 -16322 -26780 -18254 -6960 -3964 3881 38441 41873 44033 23769 9186
22113 9186 7824 7861 22668 43604 21402 -1047 -16765 -4653 19270 14397 10274 17299 16076
22100 16076 1531 -3649 -3292 -2902 542 4982 -16073 -25445 326 6272 25209 43688 25397
22087 25397 -8254 2067 11377 4729 3529 10688 26279 2838 3928 24606 11406 -21207 -12870
22074 -12870 10156 24519 47655 33188 -15053 -26911 -27796 -23671 -11836 -7074 15646 -1322
22062 -1322 -3249 -1893 14729 3638 10251 9724 21137 -330 -23228 -21487 -17947 -10026 -24861
22049 -24861 -13175 -12430 -23248 -26696 -44919 -57189 -35403 -13056 7521 12335 13112 -1430 -28146
22036 -28146 -22025 -24113 -20927 -13788 -14643 -4876 4236 3429 -9179 -7493 -4324 -1072 26934 44503
22022 44503 52195 54731 37034 10709 -4096 -14978 -7014 4154 24871 2264 -16820 -18022
22010 -18022 4356 50908 47554 53284 36415 19938 21044 32700 11568 13059 21539 -3182 -12178
21997 -12178 -23267 -16954 1407 -7763 -12467 -12705 -4866 -27619 -19576 7520 -5080 -25663 -12791
21984 -12791 -44393 -66283 -57266 -19253 2287 -5468 -7526 471 11337 3192 22271 51294 39339
21971 39339 18117 14179 23041 36797 16678 5239 -21891 -26901 -6532 8771 12050 15737 25373
21958 25373 20636 6513 3342 -18281 -25464 -17974 -21079 -40152 -56589 -36927 1767 26027 24611
21945 24611 24015 -1320 -14147 -14923 -9910 -16851 -25327 -17911 13421 -3677 -12379 4519 -14394
21932 -14394 -14068 10859 33981 44836 37103 31217 37614 38642 59310 40576 24848 10684 -9513
21919 -9513 -22076 -8740 4683 13236 -172 -2341 12325 5881 -12835 -16466 -27013 -29028 -26652
21906 -26652 -27532 5090 23994 -2490 -3718 -11130 -8984 -835 -395 24600 2554 -17468 4940
21893 4940 23935 24043 23466 -21068 -34835 4317 19442 32404 20204 -2603 -13518 13377 7553
21880 7553 4967 8858 -7760 -7135 11747 24740 31919 12639 3911 712 -5985 18351 19964 199
21866 199 13667 11185 2978 16139 32707 39581 32712 6561 -6011 -11794 14098 33418 17654
21853 17654 -9930 -1880 12520 5439 -14259 16287 34745 41205 26121 25538 23854 5655 -2091
21840 -2091 -19595 -21815 -17025 -13448 4537 13860 -328 -18703 -24153 -12786 10581 23509 27611
21827 27611 22365 9210 28591 33229 51221 31166 -923 21401 29638 8274 3729 13794
21815 13794 15699 -12118 -23047 -10167 1413 5339 13047 -5284 5033 20571 -2725 -3279 10090
21802 10090 -18406 -16866 -7080 -9711 -38197 -34313 -34194 -44087 -28216 -22720 -18560 861 6988 2178
21788 2178 8126 11508 2356 13787 43256 40621 33339 17853 -5036 -43167 -23893 -5858 2887
21775 2887 5304 29837 54303 69370 34745 35741 33972 7745 -1671 12801 8885 17943 24902
21762 24902 3541 -14742 -27571 -30024 -17084 -10516 -25129 8535 20674 -14372 -4000 3862
21750 3862 -44728 -36154 -19159 -3813 -14205 -30583 -26660 -13216 24092 33702 28161 19366 24702
21737 24702 39740 27883 17504 -3477 -3801 -2265 -2481 13749 16042 25020 12331 1796 -33082
21724 -33082 -64860 -63532 -45669 -36888 8028 21877 36593 39954 53869 56428 28002 23937 23145
21711 23145 33291 30795 28666 53772 71248 44085 12266 -9374 -29762 -17101 -11669 -7703
21699 -7703 -12828 -5063 13919 30882 41390 22061 17515 13834 -2867 -19764 -18683 12907 18825
21686 18825 37248 38726 58649 74124 32076 -6825 -17713 -16873 -3815 -3015 -7753 -22206 -954
21673 -954 -1224 -7836 4222 -23126 -28376 -17355 15917 -1021 9700 29685 20678 15343 9455
21660 9455 8685 1495 -21416 -16684 -5224 33806 58459 48038 3677 -44542 -44713 -38371 2958
21647 2958 23965 18616 30623 7574 -35889 -55111 -39285 -42408 -34321 -12935 5421 4223 -16112
21634 -16112 -27943 -21513 -20825 -30479 -35762 -34982 -38979 -20818 19624 29658 27865 36678 40310 38420
21620 38420 30946 38108 54611 61847 40096 17279 2383 -12660 -25463 9616 33904 43894
21608 43894 60635 69613 67865 44894 41528 30415 -4322 -20543 -24028 -19938 -3962 -19550 -23153
21595 -23153 -8029 18996 44274 51562 35662 29101 24693 12545 -8905 -14809 -17877 -16253 -30029
21582 -30029 -18021 -4016 -6239 -3980 -20749 -13464 -7392 -16025 -12535 5909 43352 36916 34162
21569 34162 -1035 -41461 -39182 -36798 -25912 -3988 11342 13063 16184 27266 29135 21122 12453
21556 12453 8511 -16266 -26496 -33768 -17225 26713 50924 56221 35021 44033 52086 8330 6386
21543 6386 33822 25381 20117 27107 5620 20731 24366 13464 -19162 7976 35095 5639 -6482
21530 -6482 -21399 -22498 -7274 -8733 2869 8235 18167 10658 15523 2240 -2295 3033 43923
21517 43923 30819 27752 13428 3787 -2710 -287 -3339 179 14225 8740 20309 18657 34774
21504 34774 52186 48834 34022 21075 6289 -10477 -7015 -18279 -18753 -15362 -23436 -37619 -43743
21491 -43743 -34454 1717 2492 6379 29131 44486 29924 -1482 -11750 -25300 -20671 -34990 -48571
21478 -48571 -41221 -36582 12494 39092 32984 23258 28268 -3447 -23154 -8014 1463 11596 7463
21465 7463 -2180 -28045 -25784 -495 31847 33566 16655 -19504 -21207 -5013 -22634 -52173 -63803
21452 -63803 -24570 2014 9613 -5213 -171 -5253 -5602 5329 9136 6890 -5458 -26633 -45915
21439 -45915 -38007 -35865 -20282 -10922 -2095 4465 -1291 -6716 -5400 10908 11721 21333 21531 14314
21425 14314 44119 34611 27882 3910 -2893 -5655 4456 -11493 -34369 -48659 -56823 -51185 -38288
21412 -38288 -52772 -40118 -13544 4053 -21694 -33327 -33045 -2646 -31 -340 -12387 -13518 4239
21399 4239 14381 -6690 -11786 -4619 234 -22812 -32223 -20768 20009 41687 21224 17482 16443
21386 16443 28389 23406 24582 21610 52707 63081 41129 22818 -5887 -52233 -76039 -59254
21374 -59254 -57865 -73550 -58559 -27451 -3368 -29218 -38233 -18396 -21551 -30869 -44495 -78635
21362 -78635 -84053 -57822 -34125 -32346 -34687 -12985 5913 4664 4906 -314 -16531 -2055 -9833
21349 -9833 -21978 -23242 -14594 -8436 -3011 -4028 2524 4146 -17667 -28834 -1103 8463 17897 39835
21335 39835 55494 44112 42148 57526 33165 19544 16807 -19545 -24831 -33391 -57350 -66430 -24638
21322 -24638 3695 -414 -12008 -9668 10524 11908 -6373 -23941 -7300 3321 4662 20308
21310 20308 8124 637 -7430 -7388 -7853 -15820 -20944 -13772 6900 23153 19086 -2122 -5773 -12170
21296 -12170 -18170 -23084 -40752 -23423 5350 14644 1065 -10341 -20211 -20956 -25845 -3278 -8270
21283 -8270 -16924 -35585 -54993 -26016 18072 16415 102 17288 28534 10174 10755 3265 -25135
21270 -25135 -66782 -57857 -43500 -31820 -41869 -46490 -27450 -449 8659 8620 -24563 -19036 -19580
21257 -19580 -18462 -4962 -12698 3564 25290 15376 -9271 -31861 -27076 -33559 -39590 -58453 -49938
21244 -49938 -4719 -3849 -24708 -4350 27350 11691 -1585 16667 14711 -25746 -30726 -24485 -23469
21231 -23469 -19810 -19071 -9520 -23714 -2589 15847 20225 15912 16438 -36003 -53227 -51745 -31908
21218 -31908 -7773 -12119 18985 49502 34026 14841 25169 42362 51544 36083 16929 19772
21206 19772 32172 73400 78564 13875 2279 15773 17744 6011 -7231 -25232 -18382 3034
21194 3034 3475 513 21070 18504 -27292 -34842 -9016 8208 -13141 -74465 -80687 -33899 -9396
21181 -9396 -6223 -36261 -24023 -17584 -5311 -644 -9582 -11978 10695 18283 7731 -12311 -23668
21168 -23668 -35281 -15700 33 -4504 -28837 -47264 -40121 -17745 -5584 -45494 -68170 -61450
21156 -61450 -56450 -34365 -44750 -46302 -36427 -27250 -8258 5160 -9127 -53292 -67196 -57211 -41583
21143 -41583 -10716 -15588 -14653 -6948 -28618 -26997 6100 18075 10934 8529 -3509 10745 23121
21130 23121 15792 18077 -10797 -25268 2999 13382 -11826 -26326 18268 39124 28449 -7740
21118 -7740 -7972 9902 13296 28026 34385 21090 17543 23353 33034 40746 40517 38645 18921 -5352
21104 -5352 -24427 -54621 -77966 -57883 -34988 -26600 -8212 -8433 -9072 2033 9242 -102 -17774
21091 -17774 -27929 -58259 -77487 -79673 -55879 -32155 -7774 21591 -5446 -13358 -6204 -22676
21079 -22676 -15917 -8872 -7805 11434 14430 20436 36941 6785 -31563 -46207 -35169 -7732 17588
21066 17588 11464 16652 -3844 -23646 -9685 -21761 -46327 -42873 -26804 -34696 -32563 -35001 -37055
21053 -37055 -22314 -17972 -6884 22250 28980 15441 4243 -24130 -26414 -24054 -7704 2427
21041 2427 27770 16792 -22511 -24158 -32252 -65982 -47769 -17219 -7396 -7635 -28364 -46529 -31092
21028 -31092 13745 16134 9556 -11110 7747 11207 3647 15673 19798 40619 29154 2352 -18362
21015 -18362 -13772 10930 25145 14385 15077 5238 9000 844 -704 -10011 -7674 5333 -21261
21002 -21261 -48693 -45297 -36330 -36467 -3806 -8205 -8333 -36314 -40556 -6695 13993 -16069 -34264
20989 -34264 -34708 -27385 -17787 -12794 7524 9052 8607 16949 20802 21884 -4900 -22667 -8087 -15753
20975 -15753 -23035 -15847 11679 14511 -1099 -1136 -22608 -26811 3027 13773 18498 1022 -17899
20962 -17899 5500 16061 1105 -986 -10430 -32125 -31584 -16582 -3242 5609 -14832 -5534 8256
20949 8256 -3549 7759 23557 49662 44877 17741 3700 -6323 -23451 -13519 -18451 -45194
20937 -45194 -34927 -14316 1048 -8501 4368 20506 17319 -2878 -37415 -22802 5057 9869
20925 9869 -5785 -20925 -33227 -18568 -4861 11440 27022 11880 17751 -7015 -21822 -10095
20913 -10095 9923 24902 25686 14393 7482 14866 25827 39181 42353 36200 39549 13654 -1307
20900 -1307 -8772 -29741 -41522 -50289 -32627 17538 28200 36827 48288 16410 -3049 4814 5297
20887 5297 11666 16802 2293 -18506 -13165 14465 24754 9677 -26495 -36137 -18028 -13194 -13050
20874 -13050 -22907 -22902 -24466 -23693 -23150 -19907 -12379 -10103 -8942 -27720 -45590 -35824 -41543 -37790 -13810
20859 -13810 -10718 -7889 -13461 -19019 -32687 -30233 -36730 -7435 8467 29626 32022 24358 40020
20846 40020 27491 13863 -16055 -31173 -37056 -41518 -13939 -1650 -28189 -3955 -25296 -37549
20834 -37549 -39395 -28308 -19759 -23851 -32000 -36382 -26875 -7890 -10083 -22385 -12027 -18562 -37221
20821 -37221 -66693 -50103 -54499 -42361 -49681 -49715 -40227 -53389 -42168 -46507 -40714 -2015 16559
20808 16559 19012 20485 -10541 -58202 -41930 -24286 -8328 31913 31660 12898 -260 -16604
20796 -16604 -35772 -26521 -7677 -8176 -6779 -4323 11759 14261 22756 20732 -17071 -13314 -8030 -25942
20782 -25942 -29843 -46404 -42637 -63072 -39033 -22957 -14486 3008 -3434 -13145 -5018 3453 21653
20769 21653 16674 -13584 -45486 -41947 -38576 -20666 -12432 -10967 13959 45906 20799 10558 18044
20756 18044 20982 16546 5101 7385 29565 34129 36125 17459 -5546 -21274 -28789 -5084 10311
20743 10311 -15624 -36487 -25418 9688 14240 10555 14077 24822 7061 3504 6207 -14432 -6121
20730 -6121 -5112 -32911 -46303 -13181 22146 21605 -20497 -13817 21216 37769 4903 -8016 -28693
20717 -28693 -6084 20394 14517 -28088 -39289 -13254 15122 35113 25993 14485 8229 -9740
20705 -9740 -19298 -5157 19390 2099 -7152 -13811 -22588 -6863 -7517 -8427 -18648 -26514 -31781 3297
20691 3297 -685 -3563 -6369 -11807 -2990 24196 -1208 -10236 -11102 4146 -13293 -6474 48 -26473
20677 -26473 -15613 -5488 16684 17790 6744 8977 18696 -16615 -18687 -11113 -9120 -2390 6691
20664 6691 -1239 -1435 -14228 -21635 -9670 -2254 -8678 -1945 4484 28581 -18318 -4588 -6578 -36591
20650 -36591 -49094 -49621 -29575 -28826 -23211 6743 21751 29454 24797 46216 27860 8724 15661
20637 15661 25267 40261 29098 -1896 -37191 -43249 -1509 18363 12797 5409 -494 25480 23713
20624 23713 12567 21713 31702 8808 -6735 -17097 -20034 -5589 -5705 1360 5405 -1207 -18123
20611 -18123 -14650 -14145 1615 17412 19466 6177 367 35423 58054 20774 -3753 -9024 -17899
20598 -17899 -29841 -48559 -44429 -32476 -35392 -11730 352 -24540 -37549 -39028 -31321 -13245
20586 -13245 -4463 12514 21475 4287 -33538 -39972 -6133 38648 14021 -17405 -20184 -22917 -19319
20573 -19319 -7003 20985 13394 1030 6684 -25460 -20278 -21130 -26040 -21554 -38276 -30464 -6754
20560 -6754 -9669 7926 6622 -1992 -23098 -13031 -24774 -22900 -4507 -14295 -2862 11454 -1189
20547 -1189 -20094 -7501 8935 12343 14064 23068 -2013 -6023 -23235 1241 40503 48537 50505
20534 50505 11916 -18333 -20352 -30703 -22576 16341 48414 30265 25063 3983 2840 11968 17495
20521 17495 22049 33859 45992 25447 6059 6237 -7025 -29253 -44357 -60509 -32799 -1734
20509 -1734 3915 18230 39749 7145 -25032 -31179 -27996 -35356 -13864 5188 -2742 -40472 -50058
20496 -50058 -32162 -13104 -13456 -15465 -28320 -51686 -32902 -20079 -4347 -1115 -16944 -10267 -15929
20483 -15929 -6349 10107 27883 31493 33298 20929 10515 35312 28874 31572 36356 11245 5518
20470 5518 12075 -6288 -6667 -11714 -10853 2381 -6845 22861 5251 -12578 -26497 -31211 -34592 -19590
20456 -19590 -7241 -1813 10672 -1921 -22979 -20046 -15469 -30205 -26050 -852 2197 -16884 -9377
20443 -9377 10440 31775 27758 -583 -42601 -43837 -6134 2219 -1580 4734 27061 37057 33075
20430 33075 29701 32589 22402 6142 8736 18321 4469 -30576 -13750 -252 16229 32250
20418 32250 32436 4482 -9323 13830 31514 11523 -1793 876 -21094 -2717 23725 22032
20406 22032 10310 12472 -1599 2456 2999 -5877 14713 1310 -3584 -8721 2168 32090 12371
20393 12371 -14915 -20835 -40164 -51974 -55721 -28669 11849 -4526 -28924 -37201 -19116 5081
20381 5081 14899 11063 -12775 -15594 -12428 4307 8826 -3453 -11683 -12131 -5088 -2314 -15034 -35473
20367 -35473 -53986 -50215 -41999 -24783 -18996 -18184 -30331 -28429 -9221 -31481 -55550 -41450 -16048
20354 -16048 17604 55627 50494 23214 -9654 -10307 24872 46924 29459 3967 -4598 8093
20342 8093 37469 34678 38858 24612 -971 -28347 -26928 -22823 -5587 9238 -11583 -7952 -14809
20329 -14809 -18941 -9475 -2735 -5100 18620 16994 8903 -22624 -38489 -36294 -20601 -6014 -4528
20316 -4528 17641 17884 -26803 -32983 -16509 -23437 -13648 -2804 781 -699 10342 -12500 -7916
20303 -7916 -10601 -10004 -17753 -31304 -39673 -21096 -38499 -46043 -23558 1826 33627 32275 7502
20290 7502 -16139 -23519 -13755 2153 -10472 -1410 -11798 -7799 3165 5247 39801 43066 29323
20277 29323 32311 3666 -36942 -50912 -21298 -21455 -49791 -70148 -73476 -41925 -30915 -42239
20265 -42239 -52079 -55700 -48602 -33471 -37554 -51818 -55890 -40142 -18892 -23753 -23319 -5006 20280
20252 20280 21751 -466 -11514 -18051 -4725 -4331 19736 43466 38329 30811 36493 42823 30883
20239 30883 -2327 -20393 2497 -5635 21907 12709 -11170 -16799 1280 3117 4535 508 -13464
20226 -13464 -16522 -12525 -7484 -14004 4854 17516 7364 13549 13580 34583 16711 22764 3608
20213 3608 6453 20773 4574 -15393 -28921 -31699 -6052 29016 28407 17977 18422 34370 39636
20200 39636 51064 58219 31573 2969 -15776 -30783 -22404 -22723 -25112 -18539 -17404 -11944 -2526
20187 -2526 10299 17245 43674 31903 31053 30870 16531 -10641 -21466 -21442 -29287 -12396 9462 -15
20173 -15 -1308 -1730 250 11110 24919 18490 7418 5574 36998 9100 -2788 7863 12266 5113
20159 5113 -13002 -25455 -7378 16821 5971 3484 -779 -28755 -59818 -46283 -24950 -23293
20147 -23293 -21401 -14973 -23035 -8499 15371 12562 -938 2497 7480 -6261 -21394 -26174 -25253
20134 -25253 9474 24659 13217 -1134 -9256 29 -2994 -7074 -19569 -5946 -766 -14428 -26973
20121 -26973 -8209 26293 58228 55482 72927 94086 68775 52429 1696 -46897 -65464 -62769
20109 -62769 -44957 -40572 -22697 9504 19662 39280 31927 36707 41070 10706 1418 15869 5157
20096 5157 -14509 -6930 26555 11235 10197 16510 -942 -46165 -30643 2174 20395 50328
20084 50328 47905 26184 9889 7715 -15661 -44742 -30089 -14193 -19689 12361 1940 -3239
20072 -3239 -9981 -10885 -4173 12900 -12969 -15496 -4273 13106 11237 24272 12661 12043 15761 24529
20058 24529 11198 -23633 -28629 -27830 -35964 -21863 -4437 -49582 -56195 -23416 4166 11685 125
20045 125 1783 -23791 -25759 13594 21303 4358 -36651 -31950 -7212 20843 27020 23429 -8588
20032 -8588 -2225 -3736 12976 23776 10787 2073 3969 7096 7094 11623 19134 -37204 -44523 -9860
20018 -9860 21384 3676 -9350 -22827 -18049 2372 -29643 -32943 -6955 -7318 4205 28936 33870
20005 33870 14529 -12843 -15548 -13163 -8823 -6541 -14749 -25021 -12543 11781 37276 31230 18953
19992 18953 2332 -29005 -28456 -22985 -17508 20742 1043 -5853 -1859 -5131 -15885 12964 42227
19979 42227 10497 -2498 -13653 19614 35155 38774 45963 45730 15455 4335 10102 -1411 -6927
19966 -6927 -8215 -7836 -20127 -25626 -5189 -27012 -23546 -33496 -39108 -20988 -16636 -12030 -2895 8851
19952 8851 -15515 -34964 -21703 9143 29690 17905 14863 546 -10910 -6936 5605 1441
19940 1441 -26743 -47334 -57785 -53889 -27076 -23029 -48732 -20321 623 -3109 -2740 15152 11357
19927 11357 664 3283 4766 7048 -15275 -26235 -42057 -28612 -16746 1472 4943 -23131
19915 -23131 -4864 -4678 13362 -1658 -28020 -39421 -28953 -24565 -20583 18131 24294 29982 32185
19902 32185 26012 24834 41186 15780 -8664 -13123 -339 -16967 -18070 -17376 -11959 4563 30436
19889 30436 47805 63210 51827 59503 33040 8376 -7115 -34256 -35445 -10128 -20607 -23861
19877 -23861 -24862 -27674 -17440 199 -17129 -35581 -34228 -19891 -31304 -60467 -47363 -29414
19865 -29414 -19184 -35478 -18897 21002 45547 11821 10812 18455 32553 23318 670 1385 -23978
19852 -23978 -31202 -20146 -14090 5445 28194 15070 -3440 -11622 -14959 -35993 -59671 -44212
19840 -44212 -3070 24611 21164 13650 8737 -7317 -6724 -13729 -21182 -43918 -36198 -32781 -8257
19827 -8257 12737 -5972 -15371 -43026 -27120 -896 -31701 -24484 -34430 -44643 -14013 -10682 -18420
19814 -18420 -26935 -14273 -4140 -13747 11982 3127 -15948 -24839 -37051 -47717 -35700 -31027 -4800
19801 -4800 16889 16531 9322 3532 -3944 -31920 -27218 -20546 -5273 -6990 -28559 -27963 -13442 -16416
19787 -16416 -24879 -34212 -49072 -47623 -16620 -7936 -3476 -12657 -20086 -27911 -25967 -17363 -19754 -17860
19773 -17860 -12476 -14863 -19681 4017 1313 -1202 -2257 -24300 -29214 -31095 -36038 -66920 -68828 -40663
19759 -40663 -36237 -38376 -44826 -8091 16278 25088 20091 -3044 -10745 -1256 51473 41132 11257
19746 11257 7619 -13283 -11419 -38330 -41874 -26223 -5033 3985 -9646 -8933 -22813 -23732 -35880
19733 -35880 -24927 -5733 1448 8402 52759 85900 48110 -2056 -12658 -11118 -9458 2699
19721 2699 13366 -100 -26963 -54614 -82643 -68622 -46100 -41718 -47807 -34425 -32148 -62484
19709 -62484 -87306 -106176 -97911 -60398 -40660 -24292 5377 12561 -10354 -11027 24866 27460 8248
19696 8248 20610 20617 15972 -13992 -24686 -16743 -1926 -14377 -14962 -11700 -18597 -42207 -52010 -47767
19682 -47767 -28606 -25122 -26380 -13229 -20766 -14906 9972 14789 2747 -10761 -38654 -27717 -3505
19669 -3505 2011 -20332 -32038 -24846 -22622 -8376 5578 20653 -15534 -18343 -43765 -69705 -52553
19656 -52553 -27974 1249 -6518 -12096 7336 -5940 -21583 -47889 -58462 -52535 -21660 -14006
19644 -14006 -6968 -2339 -3675 -26065 -50405 -44067 -20915 -13910 3495 2058 -5987 -3547 23188
19631 23188 15194 -23184 -55816 -79432 -81072 -85945 -67015 -34222 -24394 -13437 -4503 4880 -11395
19618 -11395 -19343 4138 -1594 -20447 -54324 -48350 -34161 -41076 -9859 -19711 -36715 -37363 -45762
19605 -45762 -70049 -64309 -25516 1739 -10146 -22727 -33796 -29605 -36000 -25132 -35580 -45878
19593 -45878 -45433 -33344 -5429 242 24737 18013 8924 43091 43731 18850 -13741 -16733 -47395
19580 -47395 -77534 -107630 -88731 -77002 -63004 -30802 -6405 -10830 -26473 -27441 -19743 -28676 -48880
19567 -48880 -15964 -1267 -3015 -13852 -23561 -8950 -30181 -37252 -15979 -92 20853 28014
19555 28014 29682 27528 15016 6964 -12989 -22334 -24997 -16242 -4428 -36864 -25919 -36284 -40977
19542 -40977 -52682 -48751 -27171 -21844 -558 718 10962 7398 3286 -8643 -8397 -1182 -6496
19529 -6496 -19704 -35947 -62607 -55112 -30425 -5700 13410 6622 12390 45669 49057 30086 6676
19516 6676 25356 33394 -43 -17009 -22373 -13883 -8556 8827 -12278 -6488 -3068 -5807 6622
19503 6622 42655 30811 8331 -238 15123 29697 51038 43678 29919 9749 -2489 -13911
19491 -13911 -14041 -33526 -59756 -36829 -5488 -11979 -17823 -15995 -29724 424 24320 18396 17659
19478 17659 19797 12676 -16161 -32957 -40735 -25377 -9644 242 19261 20750 -3540 -2071 -3139
19465 -3139 -13643 -33146 -42299 -27504 -7977 -21214 -36058 -26659 -42270 -34860 -8699 4929
19453 4929 728 -27312 -32430 -7560 6109 16073 16226 26221 7806 -12068 -23625 -33385 -16191
19440 -16191 -9390 -15957 -36704 -68859 -58446 -32994 -15673 -7317 -21140 -16590 -11009 -36619 -45427
19427 -45427 -39503 -56378 -45489 -20461 -11109 -22722 -13653 -10660 -40789 -53575 -28829 21491
19415 21491 35305 23182 25171 21012 19502 -4405 -17499 -4330 -21377 -110 6719 11128 5406
19402 5406 5279 -5282 10544 4074 -9394 -7325 -6370 -5161 -12337 -9362 14317 13518 -16216 -26780
19388 -26780 -2999 2477 17146 45190 35038 31024 34632 17000 5857 17142 26559 14638
19376 14638 19899 6940 -22273 -23317 -5234 2999 9789 -10004 -20569 9484 3236 430 5188
19363 5188 -29520 -47365 -38839 -36222 -38348 -50787 -41092 -10310 -3403 -35997 -46111 3809 38697
19350 38697 27425 -9273 8034 40396 58278 48342 17808 -2260 -44852 -20938 16606 42954
19338 42954 64847 69364 53220 7545 -28667 -19492 17568 19581 9875 375 -29494 -26248 -4228
19325 -4228 8900 12361 15157 -22678 -37932 -29970 -3631 13248 4825 -8180 -5195 -8397 -16947
19312 -16947 -14422 -4229 12165 -4295 -15509 7636 17666 2365 53 22412 38684 43875
19300 43875 36783 34579 24653 11187 3639 -3776 -969 -16859 -27791 -12224 6577 11979 -7410
19287 -7410 -39642 -17756 -8452 1495 11468 18449 29902 4937 -24956 -3866 6716 19828 34953
19274 34953 37090 34688 32075 4729 6446 -3191 -461 5442 22771 30763 45975 61348 25726
19261 25726 6790 11848 10865 -20858 -15801 -7014 -2229 -8421 -11613 -25115 -6422 -38793 -60738
19248 -60738 -43130 -20560 -29502 -40018 -15384 -27902 -33271 -36455 -34782 -26629 -38741 -30396 -27042
19235 -27042 -9425 -3759 -12148 -26654 -16222 7204 24454 25905 7796 -23143 -28343 -31585 -7972
19222 -7972 -20704 -10209 642 20821 35964 39966 10841 -2503 -7148 -52366 -58162 -29325
19210 -29325 -2769 -7468 -16062 -22858 -43632 -59073 -77331 -66622 -44683 -51154 -41838 -23210 -11669
19197 -11669 -9074 -25532 -28898 -2175 39945 19085 6302 9857 -1554 -27263 -37709 -30692
19185 -30692 -21401 -8282 9345 17253 55244 40486 14399 -13225 -2729 -23595 24004 15915
19173 15915 -7428 4818 8552 -14540 -17410 -32059 -29933 -29715 -35736 -31648 -30969 -5104 29800
19160 29800 44473 27491 4721 3773 19914 19111 13648 -13351 -15939 -19207 -19759 10253 5421 -378
19146 -378 8481 -2849 -21243 9119 23936 20342 12205 18893 9842 29905 24348 -707 2060
19133 2060 -3929 -4364 -15763 -46026 -52118 -48489 -36144 -14208 -22546 -35684 -23613 8463 43939
19120 43939 16353 -5144 -3054 -14951 -23163 -12013 -1695 1097 8867 15196 12423 12448 -22718
19107 -22718 -45835 -21111 20640 20542 185 1967 21697 -2169 -5747 19291 15520 14706 37102
19094 37102 -3684 -43107 -24393 -14952 -1957 -17909 -25533 7000 7329 13326 17854 11213 22054
19081 22054 -8314 -12382 -15508 4360 -7380 -17587 -23778 -9000 17485 28556 39781 21069
19069 21069 -6303 6024 35099 39791 25122 31134 35405 14047 13331 26668 32515 26722 2970
19056 2970 -10432 -5609 -13434 -21450 -12209 -25629 -14955 -16475 -18114 -40414 -33242 -14719 9
19043 9 -13451 -21426 2627 19738 14010 -8396 -30843 -18222 29512 34594 13946 -12566 -43465
19030 -43465 -54662 -45929 -30526 18237 14617 -14112 4189 2367 3960 35326 23262 8054
19018 8054 7312 14046 17502 13722 -8448 -24032 -28037 -5501 -5787 -23932 -24845 -17236 754 -32883
19004 -32883 -68023 -69861 -58227 -32297 -32784 -26501 -31137 -29799 -23545 -8956 -3834 -1006 27989
18991 27989 2756 -17471 -38037 -49698 -26895 5588 -6979 -18541 -17772 -17075 3506 47664
18979 47664 47853 39776 15175 -6646 -32737 -43294 -55363 -52759 -23026 3603 31245 50893
18967 50893 58534 34595 -8733 -21025 -24504 -39637 -47197 -44710 -23205 -16911 -46388 -34905 -17815
18954 -17815 -6181 -36626 -52494 -48885 -25549 -8229 10405 -13916 -7840 -20977 -45745 -34834
18942 -34834 -14818 -3183 -19032 -11123 -27674 -27826 234 -1480 15355 35887 12293 2344 12114
18929 12114 8502 473 -10269 -11904 -8173 -10 10336 9617 20011 16706 4940 -27579 -28793
18916 -28793 -36474 -44201 -27339 -24479 -13995 -37639 -38048 -32135 -21456 4219 1560 -6078 -15451
18903 -15451 -14477 -36429 1197 53212 87882 99837 69135 29637 8772 15374 33467 22350
18891 22350 -16380 -25078 -18896 -4839 23852 38298 -7925 -43524 -18425 7666 8421 -9983
18879 -9983 -10707 -283 24355 14772 17402 6278 6716 13504 13037 32233 38980 33302 26080 11631
18865 11631 -6210 -7858 7556 24558 28016 27962 15928 -17385 -41034 -27526 842 7502 -8861
18852 -8861 -10731 -19190 -18431 -19999 -5111 -11312 1305 -23127 -41614 -23753 1749 -8201 -15242
18839 -15242 -2836 7718 6420 9739 35698 20063 -13616 -499 -12026 -20891 -45775 -30980
18827 -30980 -11224 -5119 -5891 -51086 -61366 -57039 -61537 -56152 -40439 -42150 -41460 9343 21996
18814 21996 -2675 14119 18664 7931 11624 7431 11228 14069 26530 21143 5878 35218 51525
18801 51525 22612 -48132 -58134 -20815 -27998 -29089 -41174 -54192 -38145 -36462 -40054 -15592
18789 -15592 -12671 -21728 -21069 -34740 -27188 -26025 -4247 -3945 -20442 -10914 -8509 17341 24064 16891
18775 16891 3068 12628 34210 26400 36163 50240 83206 155676 261069 345495 302756 202195
18763 202195 117814 68058 20593 24726 31309 26385 13150 2171 -32392 -18165 -12686 -19919
18751 -19919 -16796 25075 10218 -27576 -32403 -14316 -9688 -42772 -64517 -64578 -53894 -46426 -46454 -11288
18737 -11288 -10842 -15555 3797 31739 41991 34350 17958 32890 48657 51223 52318 56574 40306
18724 40306 10755 -5758 4406 14050 26578 13691 4319 36678 39733 17748 936 -10518
18712 -10518 22025 34337 16326 5065 20086 24432 17213 -1791 -17669 -13320 11276 1772
18700 1772 15968 29757 4091 10357 -3520 -4504 12971 -9143 -282 42261 48062 38165 36408
18687 36408 55774 59442 52775 26260 23001 1999 4106 16996 14212 -4549 -18324 -2295 -4082
18674 -4082 -12655 14205 12655 -18859 -26741 -9576 26549 42223 27628 20116 -8954 -45019 -61664
18661 -61664 -42390 -16078 -730 13682 25571 19647 -1983 -22947 -13584 6727 10053 21758
18649 21758 42002 61355 102826 143435 247758 395876 506554 486001 375633 285188 238214
18638 238214 250080 289317 362707 483851 543471 470671 344737 225461 139852 81982 53437
18627 53437 40989 30999 35741 46814 23940 5398 18307 36392 12891 5432 37551 72699
18615 72699 167731 273956 403338 546974 583589 442281 298502 266571 233513 231534 308206
18604 308206 428472 528078 497291 370403 266505 176136 78216 37407 41141 85379 99661
18593 99661 81003 38055 7434 8636 14007 19022 35866 44350 25230 20406 17240 -12190 -17124
18580 -17124 -9135 -4405 -11658 -3859 274 3138 -6510 -15661 -26166 -29562 -8842 26849 33795 26309
18566 26309 30306 43942 66438 47341 15817 10443 19121 23615 26721 13645 10741 9549 6767
18553 6767 8020 3435 -25761 -3753 9647 10516 8713 -15515 -18078 2974 10217 6423 19306
18540 19306 55408 33869 -1783 -16112 9885 16959 -5714 -18596 -16901 -47379 -47758 -34376
18528 -34376 -42741 -37811 -36893 -30361 -24395 -40137 -30580 -10400 -18972 -30726 -41357 -38762 -19598
18515 -19598 2610 11238 -6035 -31841 -33270 -18694 -17537 -15830 -23754 -18683 -15436 -20594 -41336
18502 -41336 -45088 1376 38645 21336 -5059 -35801 -21739 4411 20121 -7164 -17418 -7628
18490 -7628 -36453 -57805 -31136 -41601 -67096 -67822 -54580 -62645 -70516 -70601 -59262 -50681 -35642
18477 -35642 -40944 -38112 -53013 -48345 -46094 -46311 -17804 -3613 -2779 18863 1313 5218 17136
18464 17136 24079 25324 -10712 -49346 -43980 -35453 -28112 -37296 -41670 -26864 -8260 2934 -35590
18451 -35590 -32031 -36763 -18861 -12546 334 10770 4988 -15796 4853 12470 -42369 -89010 -86683
18438 -86683 -63222 -27936 -8406 590 -10496 -24800 -44492 -49101 -45742 -29443 -4168 11889
18426 11889 4742 22065 7026 -6064 -13627 -16259 -12799 31938 60222 62109 65700 52504 42999
18413 42999 18662 12764 -5464 -17959 -35612 -60230 -70117 -55413 -27531 -21537 -4002 18022
18401 18022 -5346 -20017 -14286 -22285 -10888 4797 -7695 -24678 -25421 -4167 3714 -10788 -27130
18388 -27130 -5783 11075 13961 576 6263 -2203 -9301 -30363 5589 49708 43186 33900 41817
18375 41817 16606 9896 16683 -12516 -32234 -25830 -30524 -30726 -7891 3636 -9475 -23098 15116
18362 15116 37458 60937 38238 -5590 53 -4326 -11260 6221 -6219 -19442 -36620 -48869
18350 -48869 -17020 -3813 9350 13239 14757 -475 -3480 -14700 -36105 -32919 -31217 -17082 -25032
18337 -25032 -14062 7926 8715 -12249 -29134 -41177 -58667 -56817 -38911 -35155 -31735 27175 33806
18324 33806 2595 -2653 -5349 -9279 -16175 -24955 -8498 1199 48101 104482 105830 60765 7152
18311 7152 -25895 -41496 -28107 -6734 36033 39653 14307 15042 5868 24923 1379 877 13538
18298 13538 11996 36292 51085 29492 41425 16997 -1857 -9238 7348 28885 16957 29932
18286 29932 45963 44848 24023 29603 40706 57040 28059 -7896 -11028 15866 37185 26442
18274 26442 25738 11479 -9553 -37422 -57045 -75437 -64559 -33657 -10736 -15117 -8301 -6543 -6934
18261 -6934 -9048 -13015 -15673 -23183 -16792 -700 2534 -8778 -32731 -28229 -5438 -25699 -40434
18248 -40434 -23543 11022 40072 3211 -15432 -11053 -20491 -35103 -35068 -32293 -9653 -1335 2974
18235 2974 9497 23280 -1457 -4860 29584 39790 40254 111 -4858 5039 10810 23846 39174
18222 39174 33508 39132 36115 56413 33368 16873 -14691 -6888 9262 33443 51030 64063
18210 64063 84180 75920 70148 68400 58005 56701 72009 76313 72481 47734 23193 20783 27861
18197 27861 61208 73153 38240 -14316 -28109 -5941 2067 29969 70434 110717 161136 159222
18185 159222 126322 105554 65252 67348 92972 101122 128798 136774 138145 140651 129625 124400 97490
18172 97490 105139 114055 103997 92196 96296 93080 94430 95133 100775 128788 120811 128193 167749 220352
18158 220352 254237 327187 425464 491796 503941 506992 468638 420244 394050 376827 391562 385821
18146 385821 401214 433500 514133 622220 783215 1141953 1767200 2738642 3425400 3111570
18136 3111570 2259247 1715707 1568129 1580179 1769037 2273858 3263600 4020297 3613905 2586884
18126 2586884 1912037 1659984 1611818 1707525 1809951 1841535 1860758 1909684 2052911 2294650
18116 2294650 2725844 3359688 4374746 6007616 8770383 13902899 23954440 43566425
18108 43566425 69390186 75087080 53158287 29868316 17784880 12039488 9167440
18101 9167440 7736436 7160152 7187492 7027004 5900060 4381016 3270108 2628019 2239489
18092 2239489 2017757 1929998 1865400 1717855 1560718 1494691 1513325 1641148 1867786 2047764
18082 2047764 2049448 1962249 1931536 2027202 2258394 2609521 2867788 2995762 3140013 3387592
18072 3387592 3858729 4631483 5722010 6999874 8467968 10508463 14007509 20490371
18064 20490371 32570033 54314271 84012706 99504801 84780381 58601669 42452799
18057 42452799 37558450 41805855 56260525 80886789 100195770 92534453 64823255
18050 64823255 40732953 26819247 19396608 15354723 12989444 11299272 9874698 8704168
18042 8704168 7958086 7648114 7777554 8338644 9267295 10483102 12092876 14574489 19077265
18033 19077265 27645506 43751460 72647474 107489417 115957435 89199090 59288955
18026 59288955 44703224 42246812 49984908 70262496 101061641 117689672 98789405
18019 98789405 63738209 38926363 25510064 18177812 13931734 11250432 9141850 7330162
18011 7330162 5999349 5110095 4528225 4164774 3975993 3863891 3577335 3114038 2708155
18002 2708155 2479835 2404083 2341501 2170900 1937091 1722273 1558037 1482765 1546090 1632370
17992 1632370 1620843 1497660 1316108 1148173 987875 848698 780553 788429 811304 822163
17982 822163 849190 872158 863985 809163 790781 812467 829955 832843 812108 728879 641953 588489
17970 588489 584956 582160 573555 542353 513195 467404 450510 410844 376416 339765 308614 325234
17958 325234 319341 308497 335622 374708 351604 330719 318787 303953 284501 287284 300190 321309
17946 321309 320661 321425 290502 282715 267228 261365 251892 276963 312754 327595 304763 291616 288660
17933 288660 271295 254476 275544 276503 255737 247299 260612 262773 242438 230466 245358 249118
17921 249118 241473 204977 169503 172305 176797 169218 189717 180539 187317 220228 215768 203731 194716
17908 194716 191597 172096 179582 211627 229256 240710 216006 198747 217029 202644 153344 154339
17896 154339 180386 194739 191531 206402 187420 176885 159431 148615 148440 136327 157285 158844
17884 158844 169820 210409 240586 220589 216745 219006 204603 201038 187616 145963 160481 178729
17872 178729 180735 182740 199455 237835 227646 196265 152477 133096 148735 169894 182711 192907
17860 192907 186566 218149 234509 195316 157430 135411 157830 162003 139172 151571 171716 176865
17848 176865 156590 135860 138249 161206 158650 118829 100870 79735 97732 108242 95821 83311
17836 83311 65376 75190 74426 82400 96087 109197 160076 185399 175049 188911 201015 157807
17824 157807 111805 114542 95818 87641 98024 85467 81751 89115 90975 103384 92016 93965 63820
17811 63820 51976 90057 114987 113007 94282 92560 99596 123241 150141 208419 247560 254566
17799 254566 243949 263768 272313 268489 267073 245971 219520 168950 143478 155558 172659 172813
17787 172813 181041 179750 149004 121992 121519 120961 139800 124668 122180 116620 95372 104069 104456 102664
17773 102664 84400 93790 114080 114420 115887 146047 176924 208057 205070 185023 169629 190510
17761 190510 180819 187593 184252 157997 126833 118676 118823 119867 98049 106601 150054 158580 117940
17748 117940 71135 82754 80599 71473 90763 114297 126662 119970 110731 100744 76141 101966
17736 101966 130277 152744 163644 191689 230456 232924 221415 209194 184956 177262 205535 228944
17724 228944 278988 325967 346704 369842 446481 581449 742031 763600 715464 734652 909979
17713 909979 1128303 1178660 1129778 1204351 1344870 1366611 1230155 1205680 1398607 1618065
17703 1618065 1561628 1271597 1105890 1175854 1357529 1502096 1705380 1984134 2095460 2053892
17693 2053892 2239301 2812735 3429528 3414322 3018440 2987992 3311365 3360448 2931492 2619453
17683 2619453 2799162 3079165 2870542 2298756 1992718 2024182 2165084 2115353 1952589 2022421
17673 2022421 2511578 3554575 4870902 5650461 5262052 4121186 3140045 2666292 2556915
17664 2556915 2601462 2814085 3228544 3687425 3917123 3889247 3943902 4195689 4209561 3795230
17654 3795230 3269012 2894259 2695457 2694408 2934910 3307654 3551992 3419269 3030688 2767541
17644 2767541 2800244 3201326 3880216 4770395 5721464 6312266 6239701 5838878 5689046 6037960
17634 6037960 6953575 8677327 11850269 17732160 28364652 45128268 64404804 74697705
17626 74697705 67341037 48896125 31987464 21208026 15315841 12181445 10536785 9778088
17618 9778088 9561280 9518576 9410588 9343710 9718149 10935263 13297450 17389300 24429315
17609 24429315 36881920 58399339 89394470 119307535 127508001 107298125 75709137
17602 75709137 50571882 36010883 29541964 29092854 34448925 45448711 57523878 60466634
17594 60466634 50076380 34734862 23134169 16459375 12859930 10839862 9668796 9000371
17586 9000371 8687813 8655636 8851932 9292447 10100381 11473542 13881827 18168410 25817950
17577 25817950 39558853 62927911 95323609 122602223 122756989 95379919 62909632
17570 62909632 40335457 27581797 20534304 16342832 13663310 11866089 10674572 10010271
17562 10010271 9791780 10036342 10768488 12118831 14522567 18706188 25683809 35463832
17554 35463832 44272017 48129040 49920199 56539962 71052267 86457945 90355260 85794592
17546 85794592 85214407 88162296 89247755 88406665 90154407 95793858 93741832 78543276
17538 78543276 62783922 55824741 55034828 53682357 49024830 44367283 41016653 37683508
17530 37683508 36115430 39304356 47145567 53158491 51433883 46726808 45473764 46320430
17522 46320430 46473044 45564721 45887887 47147290 43595483 35242661 28662519 26113081
17514 26113081 25232700 22578196 17685027 13009491 9836641 7828505 6498782 5550690
17506 5550690 4858387 4350690 3993871 3665831 3339799 3055832 2794335 2585056 2436223
17497 2436223 2297320 2188145 2093817 1935942 1792428 1683836 1617288 1553930 1476637 1414689
17487 1414689 1366855 1310112 1247479 1154859 1101323 1082013 1073714 1036963 975745 924050 930097 933821
17475 933821 885912 857769 864633 909189 995429 1157929 1375394 1488423 1391221 1186937 1031469
17464 1031469 917544 867353 889646 980493 1089792 1076156 952464 822623 716951 672758
17454 672758 610001 587087 584171 523315 488180 519290 565640 553949 557777 580302 598793 664846
17442 664846 769266 871863 881647 802541 823411 877986 812786 678772 610518 560332 526605
17431 526605 543426 598236 690353 765047 681526 573802 475223 416579 400788 396596 375890
17420 375890 368455 364997 351113 325961 324020 326910 323512 298537 298291 290348 304873 301054 263588
17407 263588 259310 273912 266044 274373 284468 244578 240130 254311 259097 238495 225959 235903 237586
17394 237586 252093 246445 224710 217770 183446 180911 210505 212504 196734 213788 191600 160635
17382 160635 145673 150908 153200 140713 152247 159608 161860 166686 154407 134282 147779 181299
17370 181299 183310 173366 151395 126447 118782 108648 122454 138953 122536 137273 147178 114934
17358 114934 89886 76943 102596 141304 156371 170603 202265 198277 181630 177967 179708 175451
17346 175451 171988 143778 158448 154819 124642 101370 112803 106724 103145 99083 108377 116395 117945
17333 117945 122169 121923 103207 86204 98445 130446 142398 141811 113413 96715 97188 119531 119388
17320 119388 130350 147533 152145 144639 172049 206295 190094 161893 171203 178132 175989 154727
17308 154727 127130 101772 85997 102663 107962 114924 114634 113066 110219 111935 135763 126624 95303
17295 95303 75332 69032 77403 100912 109554 97410 99588 115859 112991 118412 97372 103637 116376
17282 116376 115717 93407 97702 90735 95355 100109 91887 79902 76728 88309 118469 140688 154606
17269 154606 127496 114337 107164 117646 101065 81610 80791 55796 44137 21502 19215 19898 49221
17256 49221 83101 73476 86643 80721 80620 108961 91683 80503 90329 101698 115727 110688 83297
17243 83297 89553 87551 90886 104538 88077 70661 43586 52513 54456 41168 71409 84291 85210
17230 85210 83429 90761 90154 104570 117869 124340 128432 104301 72651 77258 34475 22046 30663
17217 30663 33559 85547 87127 73039 90420 82431 118353 136265 144843 102347 92306 91765 87138
17204 87138 61348 60239 80584 88884 92006 89717 102468 129221 89873 36642 43467 51898 13074
17191 13074 31751 42949 26150 40938 69363 45463 47011 47768 48331 66899 58432 95417 119491
17178 119491 103558 87187 97089 126712 138081 142754 144535 123735 112460 103946 83891 38899
17166 38899 34596 41687 39435 33021 60959 78610 76562 98179 115972 113364 85603 65879 52475
17153 52475 43978 77874 93931 92256 83668 72853 58479 45494 66138 59375 41919 38638 31656
17140 31656 54729 47311 37984 34508 38597 37300 30208 65478 67780 64159 85878 73015 54962
17127 54962 41860 42797 47085 41914 34664 35870 68071 74376 63740 88960 97069 107839 95651
17114 95651 67881 21684 43344 49099 54435 85916 79339 44345 41677 26974 21056 34642 72302
17101 72302 89719 99764 130756 137990 197939 297400 424087 533614 528472 430737 292421
17090 292421 217421 183273 142181 112301 114859 126503 111037 107605 103206 78708 66989 88088
17078 88088 123700 149395 216471 296327 382842 464068 493880 450337 354126 276430 241638 231980
17066 231980 225327 256554 305641 425200 528716 527939 425565 315437 237847 201292 179772
17055 179772 132534 108349 90324 61536 36133 42228 52722 45006 76895 109487 128534 157845
17043 157845 194600 291450 399243 437533 409754 332470 246651 179670 130935 99807 114401
17032 114401 122699 149665 184788 237043 261251 281688 337773 419029 465858 461380 459509 417573
17020 417573 396731 406162 440127 456176 428756 372519 335785 298956 300041 314315 299241 308331
17008 308331 309357 286960 276238 296861 341621 382122 395543 384227 357038 349658 373556 375988
16996 375988 350329 344888 345051 292724 226179 181924 149649 166358 161173 134101 98995 58308
16984 58308 35131 9651 22041 42726 36395 21926 24219 26938 29826 32394 44184 33248 20009
16971 20009 497 15589 33674 65921 86420 97821 89733 85589 64296 46130 44082 63259
16959 63259 65773 72599 62222 44716 37653 32407 33480 49831 46625 46086 62793 54641 29149
16946 29149 24350 32414 21531 29364 24940 12229 -252 16327 37634 60474 39529 33817 15535
16933 15535 31773 23747 30820 43878 78252 70261 29828 7226 21362 38494 5170 5441 45728
16920 45728 61315 90760 83013 57110 27077 57712 42524 33289 61203 64376 32704 25410
16908 25410 32917 -3695 10825 23924 35165 35255 45477 67143 38511 15140 13216 3066 -10596
16895 -10596 4385 10997 2130 7363 38200 80939 58812 45362 43903 22315 4656 5842 44439
16882 44439 25718 4648 19828 26275 23127 14918 5807 10551 -91 -10467 19980 32021 18304
16869 18304 39342 47881 18947 13013 22305 26162 57256 46820 4245 16646 13321 17054 21043
16856 21043 6484 22539 29346 25321 5425 11874 9429 -6998 -42567 -43344 -32527 -39481 -13679
16843 -13679 1807 21312 18748 -20973 -5958 29438 59389 53940 19739 -9704 -13193 -9633
16831 -9633 -2867 -1341 7516 -4609 -2158 -1894 -18963 -13704 16215 31811 9786 3176 16182
16818 16182 28951 35883 22944 3236 -23792 -32593 -31885 -17566 -12534 -9847 -3928 -18136 -31968
16805 -31968 -19082 7434 22005 28473 231 -15480 706 6570 42405 52971 48069 17647
16793 17647 -1991 2963 35393 27884 -383 3311 27867 40269 35646 33538 10109 5375 39668
16780 39668 63731 56502 36046 37099 39599 29156 45865 62892 33958 6430 44290 49172
16768 49172 39033 15635 8083 1444 5903 10369 18095 18353 7098 12317 9184 10153 -9120 -8591
16754 -8591 -1701 46519 67715 66548 56119 53100 42512 36655 33354 32116 33322 18328 23080
16741 23080 24388 8918 -4276 21856 8843 27820 34335 33251 41504 51894 70770 77042 84944
16728 84944 70592 44635 37151 38792 41571 32417 69683 56750 25920 31031 31827 20412 36965
16715 36965 48748 57093 73790 68417 56406 30434 28856 65837 70693 67496 26303 4467 -16808
16702 -16808 -18763 4214 18359 5617 -15395 -2882 -9401 -11215 -11755 -37018 -21270 -29070 -27996
16689 -27996 -1363 -873 -2348 2706 15666 26170 29351 18062 -8131 -8877 -13122 17239 30952
16676 30952 27924 37273 55183 52081 44672 23694 25820 20600 9585 34681 23424 3665 -794
16663 -794 11604 1740 -20616 -19938 2333 21208 4108 -3440 -17677 -18249 -36406 -44613 -23110
16650 -23110 5349 27264 23692 15350 13991 4533 6415 18008 33435 21283 21479 2411 15452
16637 15452 35486 51964 56521 50758 25824 3790 4098 -12738 1441 27034 11072 4868 31702
16624 31702 -12020 -22267 6314 -8998 -35947 -48302 -46699 -34726 13697 32887 16085 7116
16612 7116 17137 13154 -2551 6234 11996 -3811 9954 25041 12091 10717 -1630 -7520 7556
16599 7556 21079 41779 43272 23848 13916 6848 -4842 -12219 -16623 860 10697 50 -9837
16586 -9837 -13187 -17705 1468 20274 39777 43090 34428 48552 27730 26270 25092 22191 39340
16573 39340 45700 32842 -1140 -22139 -19390 -34315 -22287 -24394 -20063 -19930 -23156 -5853 -4748
16560 -4748 -1142 3993 7333 19953 12359 -9236 -51009 -77013 -51782 -11016 37242 44202 18098
16547 18098 9735 -12858 -15385 -14658 -10498 -19853 -7793 19160 20215 28047 12933 2217 10906
16534 10906 -8934 -23525 -24814 -36210 -54431 -30346 -10703 -24834 -15328 25764 37670 20636
16522 20636 3031 9851 28988 30179 521 -15793 -21593 -24808 5318 3672 -15735 -22262 -28592
16509 -28592 -9354 8374 16085 23727 11609 21238 50117 43670 22107 -2605 -20658 -20877 -7547
16496 -7547 -312 3489 -4418 2626 -6147 -12740 4297 -3691 10409 27371 24708 5194 -4293 23023
16482 23023 17874 2742 -2289 -13124 -27811 -31459 -15503 27323 53285 43146 41971 10888
16470 10888 -8369 4600 18134 1454 26632 63511 31060 6144 756 2066 15633 14486
16458 14486 29710 31787 26938 15237 14315 8137 3357 21458 38452 37241 2103 -1404 -13841
16445 -13841 -20360 -4184 11204 29179 63511 44609 33395 27391 20606 7121 -13665 -24076
16433 -24076 -25950 -4371 7405 193 34448 43366 46783 54745 64412 51221 26943 31223 51880
16420 51880 84874 69048 38912 14177 15903 38619 7422 -26623 -43720 -18093 5423 9844
16408 9844 2655 1840 -7719 -651 14735 14906 -10026 -20881 975 28133 24059 2987 14974
16395 14974 -6831 -42227 -51361 -30193 -14410 9161 23734 30704 42949 50636 36594 11816
16383 11816 9746 21025 9915 -17172 -6184 -11294 -9629 32889 54796 83267 57768 42466
16371 42466 493 -28130 -27123 -1803 11109 5334 -12011 -14480 -4235 -4991 -13172 -1418 -10545
16358 -10545 -24860 -40343 -45871 -42937 -15051 -2807 -3144 7146 -11709 -26718 -12744 -12706 -20431
16345 -20431 -773 -12570 11271 51897 43761 44289 42889 27332 18181 -16097 -20201 -13719 -1794
16332 -1794 -17569 -24026 -23715 -30493 13918 64557 60507 29661 41016 59404 37723 5930 9297
16319 9297 25820 14354 1096 15507 10420 -4956 187 -7024 -16284 -3746 12063 19810 29045
16306 29045 36987 45155 13379 22975 42990 43223 37333 19839 -7384 -4756 -6233 9041 21001
16293 21001 19953 2246 8969 15283 -1732 9026 24383 24246 -4882 2963 24521 15505 34566
16280 34566 33678 12119 7173 -10422 -13952 269 -22861 -33271 -50771 -52062 -23299 -11833 -12375
16267 -12375 2730 29767 15658 -7208 8509 26192 34607 16448 28543 43079 53135 40992
16255 40992 53627 64988 35562 13116 1652 2164 -9795 4110 4850 7324 12008 9930 22377
16242 22377 16781 16543 544 2719 2616 5981 10929 -4278 7493 10381 3474 -383 11419 24012
16228 24012 16444 -55 -12062 -29940 -17759 665 17319 43480 36279 27168 6046 -5453
16216 -5453 6122 22881 30089 20792 7573 -10911 -6458 -10069 -34921 -8297 31686 30944 8980
16203 8980 12985 -4188 -24897 -43233 -46238 -2693 6968 5163 -20784 3550 9031 -10321 -945
16190 -945 -25232 -34331 -56799 -71520 -50493 -14592 -9305 -13075 -13806 9543 42814 20443 23123
16177 23123 31741 27442 70508 63644 57118 45369 5085 -32682 -41409 -19382 10177 3378 -4810
16164 -4810 434 14766 11766 -7541 -15535 -7354 -19899 -21976 816 -12238 -28222 -32955 -42443
16151 -42443 -47350 -36713 17127 40516 14524 12692 20013 160 -2511 -5075 -27539 -41495 -40132
16138 -40132 -41362 -25094 -12879 3485 6642 3506 2493 3929 -7547 -27081 -36207 -32623 -1089
16125 -1089 -17390 -24952 -27302 -28211 -37611 -42447 -57722 -64082 -40183 -12166 -23930 -36194 -33329
16112 -33329 -10905 -15303 6033 25148 6219 -3918 -26655 -34653 -56075 -48957 -50469 -69956
16100 -69956 -45239 -24856 -10529 3673 -1681 -15323 -7918 -17578 -24085 -15208 -17852 -49715 -67305
16087 -67305 -49304 -37938 -28641 -14724 -737 -19190 -18997 9263 43301 65428 45994 23636
16075 23636 18384 -12959 -3657 1212 11249 17832 -14240 -20901 -12436 1229 14388 21458 7973
16062 7973 -13049 -28120 -34338 -52783 -47858 -14833 -28751 -26187 -32828 -9955 -22622 -24745 3498
16049 3498 21636 13549 -6721 -16915 10061 35363 71766 66786 22045 11802 34254 22774
16037 22774 57 5711 4653 -16113 -31042 -32454 -22851 -11234 1048 -10138 -24975 -36028
16025 -36028 -51945 -71128 -55295 -22254 -2313 -9904 -30031 -31653 8649 21887 30448 14941
16013 14941 10383 1189 -10740 -27744 -12719 11896 38865 50486 16426 26793 48219 57510
16001 57510 47798 36665 57297 62501 41137 7968 -28270 -28753 -31725 -42982 -26293 -17269 -15489
15988 -15489 12291 44083 27726 26944 21355 19074 30152 11760 6944 -14970 -23427 -8894 -10570
15975 -10570 -23782 -20440 -635 -25080 -28038 -14277 -19832 -42887 -22154 -8681 4619 6084
15963 6084 3121 -10938 15702 -5356 -20012 3476 20419 9421 -3591 -35970 -61230 -54818
15951 -54818 -36291 -23586 -21430 -14480 -25025 -34678 -47974 -24202 -12897 -10143 -13369 -270 -5598
15938 -5598 -10243 19174 59992 70118 58878 23669 12395 -9048 -1648 -16650 -25583 -7679
15926 -7679 -15868 -29971 -28484 -37384 -41969 -13738 8590 7861 -10948 -22359 -47158 -62567 -52003
15913 -52003 -35702 -930 14177 11631 8161 -22229 -33312 -15583 23344 16834 10469 7616 1288
15900 1288 618 25519 34554 27014 -754 6329 -3057 -15478 -122 8489 6776 -153 -9486 11607
15886 11607 26356 14756 1780 16971 33905 28786 16292 14189 1728 -11564 -21960 -44873
15874 -44873 -44287 -57472 -47451 -28856 -34214 -24030 3496 3422 27374 30923 44106 37630 23165
15861 23165 35444 40357 20233 27357 27128 74 -7504 -3178 12063 863 14996 17699 13457
15848 13457 6916 241 20590 36819 13487 -11961 -10967 -245 -6410 6683 6344 -7808 -21355
15835 -21355 -8086 4168 10613 -308 4288 16572 43001 26967 25569 39368 31039 7986
15823 7986 23683 45638 20894 1681 20500 20550 39040 16917 12366 6845 -15508 -25464 -5983
15810 -5983 36367 55521 21176 24040 9631 -3043 1976 11862 -21731 -27824 -30740 -58769 -65097
15797 -65097 -64620 -57946 -21244 11320 716 -14661 16326 22323 18872 12235 -10945 -19567 -10495
15784 -10495 -1379 -14737 -24726 -31643 -35191 -19420 33163 59396 39630 22205 6122 -12084
15772 -12084 -9485 -26491 -53059 -55308 -31284 4350 -15213 -17137 -8275 19628 9078 -24059
15760 -24059 -28904 -46510 -48602 -34348 -27256 -38119 -33528 -30499 -26830 -33281 -29930 -9342 -10491
15747 -10491 -4370 -22369 -16607 -6732 -9217 -19088 -9071 -5187 3828 -2428 -7050 -8446 -20228 -11203
15733 -11203 -5259 26446 22193 34366 32144 -1623 -19871 -15733 -17372 5347 2709 8228 -1359
15720 -1359 -6268 -18883 -8617 -16884 -8383 -10813 -25209 -3015 7786 4161 14754 17431 -8780
15707 -8780 10072 -6032 -12667 11279 14039 1973 10599 8410 -10119 -17982 10226 -992 -20778
15694 -20778 -27406 -19844 -11251 -20036 -37168 -21575 -4272 -7929 -37182 -36640 -22225 -24094 -34366
15681 -34366 -45463 -46866 -49251 -22791 -12051 -6692 -9115 -21063 -19627 -27098 -19002 -17643 -12179
15668 -12179 -11722 -22305 -11836 -28723 -40978 -56863 -69942 -78897 -81430 -57690 -35176 -41871 -35007
15655 -35007 -52594 -55510 -50731 -30476 -957 26031 17827 39556 44529 9960 -28333 -54038
15643 -54038 -38119 -14284 -12490 -22223 -16082 -20192 2781 -12932 -37913 -44291 -45278 -41274 -21736
15630 -21736 -19422 -40712 -35265 -7618 218 -1390 -18514 -15408 -5244 -18506 -50681 -49814 -26164
15617 -26164 -38497 -30037 -1775 -6245 18536 21753 38594 7483 999 8194 4553 5558 -9756
15604 -9756 -42982 -61851 -82817 -81513 -53141 -25508 7866 -11146 -37836 -55343 -56673 -27696
15592 -27696 -11561 -22519 -35822 -34313 -43091 -44055 -19548 32206 38896 1549 17871 4875 -2283
15579 -2283 -18126 -21452 -35284 -13025 8345 -7159 -15051 -17118 -13459 -40285 -42498 -26193 -24808
15566 -24808 -44383 -60282 -52071 -71122 -89007 -75369 -51043 -30087 -14463 -26062 -7714 12996
15554 12996 6743 -11867 -434 14049 -1350 -43702 -41506 -49190 -63376 -51197 -12648 -4241
15542 -4241 -28798 -46138 -26139 -6139 -19874 -16721 -21730 -13541 -14295 -6955 -7165 -21140 -28034 -32216
15528 -32216 -23746 -21032 -26492 -8765 -34111 -32871 -20912 -11772 -9730 -4288 22563 11695 -17675
15515 -17675 -13717 7540 -6905 13548 32191 46165 55711 21598 -9004 -13879 -9741 -4704 -11134
15502 -11134 -13398 -14619 -21189 -18377 -6882 7091 17911 22934 7991 -18176 -9907 -24962 -49835
15489 -49835 -48096 -42971 -19689 -4755 -16501 -11921 -1296 -4688 -81 -8420 -25518 -47709 -56958
15476 -56958 -72225 -78330 -43289 -7034 -14794 -28528 -36816 -25122 -10792 3775 -2601 -12379 -35772
15463 -35772 -33101 -31282 -12173 -16710 -36764 -49250 -52004 -52168 -40992 -9998 -4620 3930 -810
15450 -810 17999 6910 -12052 -48631 -69094 -42531 -33902 -37898 -50826 -60638 -64873 -31274 -4335
15437 -4335 -3962 -36661 -42946 -26809 -24410 -6312 21332 12982 -12651 -35904 -60247 -73870 -83256
15424 -83256 -64798 -37215 -45728 -53535 -72299 -63559 -71611 -46341 -46613 -82895 -95358 -76830 -40330
15411 -40330 -8127 -10101 6090 15828 -299 8603 -1977 3600 6633 6113 20277 3031 -9867
15398 -9867 1088 1993 -19400 1102 28230 12855 12170 6866 -8418 -30601 -49780 -37873 -26934
15385 -26934 26747 58396 49752 35570 27717 10753 -5482 10122 21999 8920 -45249 -49766
15373 -49766 -19016 -28140 -35486 -56127 -65434 -64132 -51583 -41401 -34173 -30676 -27303 -29552 -14780
15360 -14780 -25756 -55935 -51726 -60580 -64469 -59738 -54048 -30541 -30466 -32922 -54149 -50208 -4872 8636
15346 8636 1449 -28090 -50959 -35671 -30535 -39733 -26707 -34410 -29952 -34159 -9454 28009 7992
15333 7992 -34292 -41918 -36062 -43364 -5360 -8651 -46437 -50714 -29038 -43527 -14152 9342 18630
15320 18630 22058 18360 9203 16978 -7228 -24981 -39664 -29427 -1314 998 16008 15892 23147
15307 23147 -1853 -5687 -17192 -40516 -32873 5456 2166 11806 37776 31215 34304 33614 21346
15294 21346 5694 -3118 -7264 -7686 19215 33043 8936 34200 55716 49689 37482 12828 -21268
15281 -21268 -41887 -33543 -33199 -49324 -44917 -23951 -30350 -39030 -27216 -25487 -33213 -37100 -24579
15268 -24579 -40469 -46010 -40355 -32597 -20158 -27485 -39286 -45395 -39807 -45715 -36208 -14537 -6657
15255 -6657 -5515 -4365 -22332 -32088 -31888 -2710 16424 24221 -10946 -54705 -73319 -75120 -79420
15242 -79420 -74445 -56918 -27995 -33749 -43835 -39842 -10623 8466 -2575 -34302 -26541 -8948
15230 -8948 9414 9246 15979 2827 23534 5555 -28075 -49652 -25774 -21744 -23705 -31973 -30311
15217 -30311 -31065 -39435 -32819 -34067 -50796 -65755 -57691 -25498 -18234 -51810 -62242 -40527 -21075
15204 -21075 -15139 1788 -5263 -19674 -18606 -22308 -25988 -44797 -42364 -33307 -29719 -43557 -57069
15191 -57069 -33916 16789 20866 -16551 -48513 -57447 -54986 -44389 -39492 -39231 -46157 -57489 -52068
15178 -52068 -29672 -39264 1027 17582 -4348 -18430 -6268 -5861 -9072 -1000 -5313 8875 20090
15165 20090 -5835 -17468 -14459 12882 11262 -1350 311 13862 -9804 -20693 -27376 -31553 -7328
15152 -7328 -17657 -28278 -45887 -50665 -46100 -28406 -35346 -25366 -17056 -17386 -21342 -12584 -21954 -10414
15138 -10414 7830 11905 3462 18576 1186 -51806 -51770 -15887 -22226 620 37709 47633 12058
15125 12058 11419 18118 -9146 -14467 -20458 -35868 -39595 -23958 -20537 -35425 -40542 -40424 -41837 -24118
15111 -24118 -4429 -4585 -23212 -7863 21718 3773 -33912 -40390 -20846 -9931 -4305 -1610 -3105
15098 -3105 -12515 -11772 -18135 -30410 -43199 -29887 -925 5666 2027 -3353 -285 2574 -4451 3043
15084 3043 -8978 -32276 -44945 -31023 -19815 -15746 -19097 -32809 -22805 -7610 1291 -31384
15072 -31384 -35094 -19749 -5665 9186 27237 11795 -16160 -7359 -2193 6044 -14755 -26710
15060 -26710 -45059 -22657 -667 -2506 4746 10184 18353 8068 6520 12755 8618 -22231 -10831
15047 -10831 -4061 -26688 -27226 -34238 -10977 27387 32238 21893 19527 11608 -16474 -27582 -10965
15034 -10965 4922 10567 -14214 -33925 -54675 -29969 -5078 -4598 -4093 7213 -13331 3117 21702
15021 21702 18748 8230 -8909 -5744 -7736 2946 -6830 -10109 -25066 -41988 -36567 -31113 -19711
15008 -19711 -15356 -18065 -2641 14165 23618 13629 18998 25462 -10365 -47146 -54514 -49173 -16464
14995 -16464 -8073 -2114 20475 35030 17215 -20831 -14286 -21523 -35867 -32766 -26340 -13577 9141
14982 9141 -1654 -16130 -7216 330 15456 38206 25834 -7886 -12144 -32122 -28704 -1080 28066
14969 28066 18998 23343 -9777 -15208 -28330 -16709 -29144 -34273 -38469 -33906 -37254 -28529 -15534
14956 -15534 10336 3509 2790 -6899 -3446 -39673 -37901 -8608 -12006 -15592 -16470 -29682 -19734 -17270
14942 -17270 3081 -1030 -4739 10048 6410 1885 -9975 -35336 -29609 11677 23468 -4724 12890
14929 12890 13050 4084 3665 -986 -12548 10370 32852 10429 -16592 -20496 -24861 -15329 20859
14916 20859 5756 -1008 43461 76160 43904 23418 31375 22651 7705 8514 -8571 -29240 -38378
14903 -38378 -46318 -28907 5901 17665 37561 31153 28902 8163 -5052 -566 1396 6633 2142
14890 2142 -14308 -18453 -32712 -26573 -16931 -17004 2853 15307 9300 -15462 -25724 -25330 -45486 -46954
14876 -46954 -14375 -19906 -27551 -14248 -22185 -18536 -7755 -4532 6937 3163 13790 -8325 -4466
14863 -4466 21402 27570 16030 -15212 -40636 -31856 -27915 -49897 -30825 -24063 -30349 -25958 -43946
14850 -43946 -71590 -76721 -61018 -31078 -10792 17351 38851 33505 18856 26059 15494 19231
14838 19231 44307 20782 -4650 2303 -2966 -24512 -2132 19385 27366 7534 -11658 -6811
14826 -6811 -8318 -1013 -8535 -7105 12443 6619 5717 -1514 9161 16389 15602 13645 -2339 14409
14812 14409 50084 43675 36767 24098 10082 20274 12565 -3975 -14619 4229 11766 -12040
14800 -12040 -7068 -441 -17870 -10436 -12173 816 -16204 -40353 -24158 6431 29724 -1709
14788 -1709 3390 1939 20300 38660 858 -31078 -24303 -6408 -13267 14110 18968 2911 -33998
14775 -33998 -50513 -44590 -50081 -48976 -38652 -45770 -36103 -24232 -26536 -27360 -27071 -30536 -43625 -40661
14761 -40661 -12759 3654 -17691 -39318 -48158 -21489 -33782 -41725 -33163 -24523 -19005 -9868 -16731
14748 -16731 -4465 -45084 -51618 -48442 -32491 -13307 -5229 -25347 -27522 -13642 2487 -11664
14736 -11664 -8424 5440 13173 -4320 -21294 -63485 -77978 -69252 -48217 -21080 -15093 -26015
14724 -26015 -14393 1659 -13 12626 17717 27727 19591 -941 -12923 -28846 -19357 -368
14712 -368 29493 41509 36494 39518 29962 51461 66380 50081 68243 102392 125853 110310 86837
14699 86837 50280 39252 19490 26340 41889 28956 15510 9672 43206 53001 26200 10364
14687 10364 -9989 -23690 -20000 -15421 -23604 -39544 -33072 -21068 -22568 -12068 10738 2634 -14764
14674 -14764 8943 15127 -3863 16970 -1910 -5571 -6314 4734 -24346 -51498 -28610 3568
14662 3568 27601 50154 24398 33551 25225 1582 -26667 -39267 -40343 -16673 -25561 -5825 -4622
14649 -4622 -21427 -19151 -23540 -40732 -48899 -36194 -20480 -6200 -16091 -25739 -59982 -59852 -35541
14636 -35541 -14395 -10968 -20578 -28117 -17347 -14968 -10361 -5508 -15637 -30578 -31010 -15952 5583
14623 5583 17902 32520 25630 -7787 -13515 -1906 25397 29874 11632 -1113 7656 27994 39836
14610 39836 38484 39814 35776 34741 22406 8602 16302 36217 27140 36469 30331 38588 44651 42398
14596 42398 43111 34990 40148 41719 53997 61999 61121 76318 98352 98985 69813 89530 117523 97505
14582 97505 80812 91037 131464 165381 161942 151327 142944 131430 145657 147456 148137 170946 177375
14569 177375 183492 196543 207660 224892 236788 252455 286806 260075 260482 266357 294710 295983
14557 295983 306379 281906 265863 266811 297638 293150 289805 269935 271311 272208 262448 247200 252202
14544 252202 255719 237716 222121 234773 255550 239998 239180 235079 208681 192910 176731 182346
14532 182346 160118 136630 114630 114519 124173 109420 93373 87461 97546 88727 79506 78388 74028
14519 74028 81304 68845 78844 108104 72672 46692 28619 37441 43484 27165 36639 65699 68631
14506 68631 77180 81779 63721 43041 15606 8025 13590 10011 27867 12695 8210 -3661 6326
14493 6326 4927 -32763 -29542 -13050 -15292 12468 24674 6210 24916 25976 18959 13243 -12759
14480 -12759 -28306 -14264 3838 -5936 155 6257 8859 5575 2008 -6212 4458 40248 50398
14467 50398 52556 60677 68212 47272 25474 -5845 -15038 -12340 -13245 -16898 -28078 -22665 -21191 -12737
14453 -12737 -12105 16717 30942 31758 24210 37375 37671 36580 43496 50741 48685 39125 48369 36553
14439 36553 25829 28554 54504 52496 24591 18538 18293 34951 59276 38025 41442 37101 20491
14426 20491 -29281 -16958 -27970 -29955 4221 9817 -17072 -5283 18826 12333 -14328 672
14414 672 -11047 -11341 7937 -16859 -29604 -42634 -26969 6024 24208 12307 -3522 -17515
14402 -17515 -43119 -35464 -6993 -3593 4429 -5906 -23615 -35972 -42677 -23104 -15608 -4263 -8607
14389 -8607 -5896 -5869 -12193 -30318 -32599 -46538 -26498 -25383 -34949 -52466 -54782 -37994 -34908 -32539
14375 -32539 -28564 -16380 -18321 -8140 -29498 -31396 -18751 4711 -21846 -42373 -35101 -38950 -28649
14362 -28649 -29690 -32041 -5039 -25810 -27090 -56649 -64068 -35802 -34304 -44125 -44635 -9766 15778
14349 15778 31206 34165 1304 -10200 -5029 -17141 -17366 -26770 -33524 -27217 -13344 -17276 -95
14336 -95 22982 34638 47972 47881 24678 32748 35972 8342 -728 -5753 -5666 -19417 1812 24718
14322 24718 7532 -2687 6694 29855 21316 22927 10457 1817 -7527 -3743 10999 24100 22619
14309 22619 -5260 -18310 -29629 -25594 -10669 -8646 13492 9983 27222 55788 44398 16110
14297 16110 6235 -1158 27893 38100 42812 16623 -25445 -3761 7726 3821 -12628 16053
14285 16053 36453 28177 8373 19598 38941 24434 24985 2882 -4772 20749 69382 117207
14273 117207 143087 154182 143560 144331 160192 180445 219709 261113 322410 412919 513524 579306
14261 579306 652144 769580 898299 1130744 1492411 2073527 3208982 5276628 8733193
14252 8733193 12566834 14416567 13572494 12288232 12910129 14443352 14050060 11043853 7332148
14243 7332148 4618767 3058216 2185604 1680009 1322287 1063398 903408 765416 681796
14234 681796 602157 532135 467524 362178 297621 253574 193639 177251 155053 159298 167528 128341
14222 128341 102550 106604 74988 49401 57279 49561 31568 27661 36817 68515 80032 53980
14210 53980 67233 74695 67254 67388 66556 87068 67606 50582 47579 80356 69232 13161 1361
14197 1361 28580 15853 -14190 -24312 -7214 1705 -16390 -1314 33070 50419 22915 2144
14185 2144 1041 10406 19995 17496 1701 5289 19160 12949 17840 26240 4565 5208 7008 -10298
14171 -10298 -26195 -18106 -19997 -20394 -32093 -4339 -5943 -1256 8462 7793 1035 -10953 -17238 -9135
14157 -9135 28902 40205 37817 32718 16975 -63 -8768 14991 52998 43827 17444 15602 2341
14144 2341 -28617 -43979 -55868 -38609 -34756 -36959 -26814 -19185 -13677 5337 21800 9828 -20154
14131 -20154 -57411 -26188 -7812 5826 21142 -1131 -25363 -16011 328 17086 -13495 -32386
14119 -32386 -12351 -12223 -19553 -5129 -12366 -38673 -67761 -56946 -38383 -43511 -29373 -29945 -21697
14106 -21697 -10771 -17871 -19836 -13850 -17392 -15060 18718 20375 -10182 -46917 -58674 -24921 -15078
14093 -15078 -34879 -32288 -14442 -1407 -11730 -23649 -18659 -21479 -21786 -662 16136 19229 25872
14080 25872 49757 45113 27965 36961 31273 2220 -34765 -31750 -10283 -16407 -5406 22967 21911
14067 21911 7148 -1084 -8381 -33377 -41585 -37591 -37994 -20437 -27615 -25581 -25421 -22302 -18859 -27711
14053 -27711 -30479 -11154 28522 1355 197 9461 5997 17708 9838 -9104 -1471 2357 -1863
14040 -1863 -22260 -46599 -64304 -83410 -48609 -33589 -33851 -10779 9211 -14407 -31967 -36075
14028 -36075 -35145 -39309 -75075 -67720 -65319 -44723 -58582 -71263 -47714 -21078 -13704 -11206 -311
14015 -311 -8521 -12850 -32882 -39054 -23859 843 5521 -2945 -27203 -25953 -17540 -30523 -27022 -32717
14001 -32717 -45128 -38187 -17132 22315 9635 7491 1398 6096 -11917 -18117 -2757 10584 -29916
13988 -29916 -34121 -27018 -17857 -14981 -8067 -1843 -8152 -7727 -16129 -32172 -48000 -35785 -32024 -34261
13974 -34261 -20707 -15559 9717 1015 -1583 -14735 -37867 -58449 -70399 -62379 -55840 -56777 -49566
13961 -49566 -53985 -39627 -44081 -34375 3697 -7144 1004 17114 23694 -6114 -16778 -13462 -27555
13948 -27555 -38447 -27425 -38709 -69202 -82111 -81746 -80795 -56827 -56929 -69102 -63092 -70561 -70004 -41670
13934 -41670 -20028 16580 -5001 -1870 28173 13394 17704 12506 10057 2687 -4288 3575 4844
13921 4844 -21867 -44755 -31815 -25530 -32707 -23001 -22260 -19466 -22743 -60902 -67964 -57358 -39636
13908 -39636 -50885 -50437 -16471 6054 -3747 -31591 -45861 -60620 -28614 -13457 4162 6832
13896 6832 -1723 6739 -20675 -23355 -25511 -19293 3648 5192 -13040 -55549 -50416 -39328 -12202
13883 -12202 -13633 -34602 -20909 -22089 -50814 -80555 -79417 -76479 -80153 -58759 -33410 -34403 -27792
13870 -27792 -39231 -61395 -57206 -26079 -29853 -34815 -16294 11276 60355 64329 36446 3540
13858 3540 -2014 -36284 -45830 -29065 -57116 -54295 -61976 -48662 -16237 9394 40403 9281 -17723
13845 -17723 -31874 -61797 -74943 -49636 -36593 -45377 -45280 -49816 -28228 -14025 -29012 -32138 -25423
13832 -25423 -6267 5167 15669 6092 -32817 -66558 -63713 -48160 -10711 13309 8302 -1326
13820 -1326 -27799 -67788 -71440 -95018 -103066 -119804 -127259 -88656 -52362 -7763 -12836 -32576 -50888
13807 -50888 -70242 -70261 -51057 -54282 -57274 -55756 -66764 -38047 -24304 -20766 -33226 -11972 -12270
13794 -12270 -3880 22713 54920 74752 96674 102513 75258 49859 69445 64385 61602 49452
13782 49452 7138 -8497 -22999 -52596 -73031 -76095 -101508 -72887 -33819 -11946 -24445 -8782
13770 -8782 -5744 14611 26567 -3280 -28519 -15795 -1031 -4339 -35640 -64551 -52221 -63017
13758 -63017 -72654 -59634 -39102 -37753 -30106 -28792 -19489 -11219 -26055 -38767 -16483 744 1751
13745 1751 -15014 -17470 -16543 10615 16463 14225 9520 7755 2560 8752 -1944 -8154 -17622 -21025
13731 -21025 -12817 -24488 -34476 -22443 -15903 -39970 -46226 -50114 -42422 -35025 -2731 -51876 -81790
13718 -81790 -86181 -86914 -65498 -60927 -46679 -26126 -19676 -17218 -21724 -33589 -28985 -43605 -67275
13705 -67275 -51709 -52261 -44351 -46556 -42475 -39895 -27210 -18696 -29354 -18267 -12234 -3938 16645
13692 16645 1851 -4974 -18628 -10832 -1499 -1556 -11940 -8367 -20647 -36722 -47196 -66399 -49475
13679 -49475 -20324 -20080 -26310 -7076 -20210 -17018 -3066 -30201 -32025 -26862 -24340 -15563 -18179
13666 -18179 -45164 -70320 -58442 -44285 -39942 -34010 -29074 -31228 -49556 -48899 -62859 -57213 -36177
13653 -36177 -29007 -47522 -60646 -47280 -53063 -76109 -81824 -69250 -67160 -71636 -75809 -81631 -71757
13640 -71757 -42619 -46512 -38600 -28880 -15896 -30592 -61811 -87665 -62177 -46903 -61438 -72569
13628 -72569 -86128 -70249 -51969 -48182 -54626 -52536 -40052 -39693 -20887 -15528 -29525 -40765 -29295
13615 -29295 -19041 -19554 -24132 -30725 -40723 -52762 -23360 -8168 -23570 -51246 -72237 -76244 -46574
13602 -46574 12425 59 -24019 -29108 -15927 -10856 -17959 -14858 -22496 -32701 -43620 -66970 -59584
13589 -59584 -57674 -50961 -22450 -29043 -53898 -40265 -38565 -32347 -18596 -51079 -67267 -60937 -48287
13576 -48287 -33972 -39988 -12024 -14893 -49291 -62203 -36278 -41929 -29372 -29117 -41086 -25609 -30043
13563 -30043 -44383 -65080 -47003 -25859 -50541 -75201 -64781 -52149 -51898 -38662 -50921 -31629
13551 -31629 -32926 -38664 -43796 -73665 -74288 -61829 -56583 -33860 -29505 -39940 -41843 -43111 -14217
13538 -14217 -32161 -27248 -19962 -18016 -15401 -27234 -42208 -70360 -69671 -43196 -44493 -52819 -51709
13525 -51709 -62754 -69860 -81604 -69664 -61171 -42539 -5122 8008 -690 -11670 -20558 -22785 -28632
13512 -28632 -35869 -36384 -4650 -14928 -6783 10888 -17120 -17822 -10240 1908 -9420 -45269 -63623
13499 -63623 -59171 -58441 -57059 -50901 -52783 -48203 -26069 -30378 -50818 -50589 -47438 -66443 -85409 -59718
13485 -59718 -23134 -16697 -32476 -54577 -63163 -48966 -53608 -54385 -71918 -70366 -86692 -85796 -78182
13472 -78182 -67519 -52067 -54201 -46965 -46639 -41598 -34018 -16084 -1244 -2045 -548 6289 -10941 -21793
13458 -21793 -9716 -17094 -37020 -54591 -52847 -49822 -54291 -52950 -22055 -39672 -63635 -52833 -53495
13445 -53495 -74623 -55842 -42472 -18393 -1687 12477 19187 -2262 -25604 -40272 -48579 -24541
13433 -24541 -15018 -29589 -34811 -44782 -60196 -51300 -45937 -56760 -58785 -44063 -21667 15290 -20585
13420 -20585 -46175 -54014 -43320 -49698 -47567 -39638 -40041 -24538 -6988 -26109 -47817 -58043 -48386
13407 -48386 -45574 -39696 -47887 -44103 -45085 -47246 -47976 -38224 -28727 -1765 -6002 -18117 -22202 -30219
13393 -30219 -24440 -7462 -28429 -61662 -83726 -58694 -29867 -30458 -49475 -43295 -46135 -64565 -65716
13380 -65716 -66724 -61664 -55846 -61063 -87828 -88963 -79956 -67522 -65503 -92455 -98570 -100603 -86385
13367 -86385 -61839 -23970 17839 6251 5378 3120 -18320 -23111 -44132 -70493 -60054 -50566 -67069
13354 -67069 -34649 7422 -27835 -40074 -53306 -60430 -55893 -59297 -59917 -58609 -59861 -45130 -55037
13341 -55037 -55445 -65439 -74393 -61215 -40042 -30446 -58558 -32575 -3542 5063 -22639 -65262 -58870
13328 -58870 -57922 -62210 -74670 -73151 -75869 -60208 -25808 -15739 -11750 -8593 -10539 -50412 -77609
13315 -77609 -62687 -50032 -37248 -57151 -51802 -58474 -61856 -25795 -7856 -1479 5472 -25256 -49094
13302 -49094 -48583 -32071 -43132 -68961 -70216 -48218 -26646 -34193 -58569 -63685 -85690 -90032 -76405
13289 -76405 -41010 -25119 -31916 -18800 15478 5321 11592 -5557 -15624 -20225 -26122 -44722
13277 -44722 -40277 -20101 -15758 -48821 -77641 -61816 -47597 -77016 -75693 -64791 -60928 -66822 -80823
13264 -80823 -71630 -57900 -26635 -27294 -22046 -21645 -25742 -14460 -43669 -47692 -49437 -52649 -70919 -71319
13250 -71319 -81502 -59071 -11659 8891 -10921 -29033 -31359 -60522 -40683 -39039 -59314 -60612
13238 -60612 -65459 -61809 -52060 -63554 -63975 -74995 -49746 -25216 -16849 -24015 -35562 -31667 -29972
13225 -29972 -35607 -34424 -30938 -39873 -46818 -65107 -71543 -75040 -69174 -58035 -39102 -28634 -42976
13212 -42976 -75920 -71144 -65318 -71421 -34892 -83 -16337 -4521 -14576 -24246 -27020 -43206 -64142
13199 -64142 -82221 -61359 -54412 -66346 -73368 -77854 -83157 -65895 -23369 -2373 -7762 -14408 -26054
13186 -26054 -12325 -28119 -29426 -56126 -60617 -39203 -19022 -19045 -17190 -28248 -32306 -44691 -33652
13173 -33652 2353 6561 6828 -7324 -823 23042 23726 -23390 -59006 -63332 -76133 -69826 -56664
13160 -56664 -55380 -36116 -9870 -11964 -9295 13185 1474 -11969 -32896 -50435 -63471 -75406
13148 -75406 -73643 -56998 -57465 -59676 -52592 -23160 -20183 13118 802 -39277 -57067 -57367 -50636
13135 -50636 -45585 -19383 594 -5165 -18376 -27766 -18927 -27693 -14095 -36208 -62284 -54080 -60773
13122 -60773 -40889 -56191 -58217 -41447 -51220 -82057 -105137 -91020 -89401 -87693 -67379 -43329
13110 -43329 -14543 -33200 -45061 -38120 -29064 -36887 -33845 -20430 -30051 -39501 -43540 -49644 -48929 -57071
13096 -57071 -82005 -63415 -25037 -27787 -34664 -23352 -18272 -6518 -9726 -24130 -39348 -51530
13084 -51530 -49025 -22430 -14260 -24593 -17799 9840 -17361 -17322 -26715 -56404 -79275 -81259 -72226
13071 -72226 -45803 -20181 5576 8633 -25851 -25663 -8020 -9280 21721 37864 44278 25330 -9123
13058 -9123 -45169 -65891 -51685 -32575 -16594 -16550 -12039 -24780 -59779 -56018 -49424 -25797 -45547
13045 -45547 -45740 -32603 -19914 -18840 -29134 -39572 -42178 -15867 -22817 -39627 -51892 -53094 -26706
13032 -26706 -9886 -29784 -33429 -17938 -25109 -37572 -29100 -45643 -66558 -62099 -35575 -32911 -28464
13019 -28464 -39894 -54152 -37030 -14718 4511 20663 3791 -31508 -17638 -38303 -18819 9347
13007 9347 1772 -8169 -5517 -10222 -7064 -29936 -56934 -70451 -51042 -82948 -77809 -59291 -58910
12994 -58910 -57898 -68718 -32576 9640 1441 -23937 427 16964 24507 14645 1523 -28811
12982 -28811 -49018 -30417 -21579 -47336 -55757 -52455 -64324 -80533 -75847 -49329 -23245 -29793 -37275
12969 -37275 -26153 -8706 -23761 -31808 -50361 -101925 -103834 -75434 -73709 -59941 -64208 -59004 -63923
12956 -63923 -29199 -5551 -8156 -20339 -43719 -53683 -52580 -26640 -26273 -4358 -56 9033 3552
12943 3552 -18920 -10117 2439 -4115 17235 34275 31878 17724 38003 83739 109036 111941 139639
12930 139639 176757 205523 224362 288317 397665 557956 779325 1096788 1452669 1762807
12920 1762807 1884251 1847238 1800286 1839294 1897557 1796502 1487567 1106039 767264 545020
12910 545020 406057 335909 281310 233137 225125 181727 146170 117842 104193 94833 84404 97530
12898 97530 85031 53051 51314 48939 55488 34121 33838 49155 56552 61397 17842 8390 5555
12885 5555 -17774 -24120 -22459 -13795 -10886 -12058 -38753 -35720 -10962 -12528 -17973 -6730 29419
12872 29419 25310 25789 -7826 -28582 5491 -24613 -50876 -36054 -31325 -29731 -23562 -17362 -17954
12859 -17954 -19581 13477 19074 166 -7707 -15238 -17020 -29792 -31744 7436 15722 -23414 -46715
12846 -46715 -38563 -26963 -1084 21531 13629 14037 26834 43940 67670 84497 114315 121032 84179
12833 84179 56494 63677 48385 51038 81184 75610 59290 12182 -19069 -13446 16556 17529 -5443
12820 -5443 -13293 -28961 -12758 -3522 -27106 -19779 -14315 -6848 22724 29016 29927 21162 -11925 -26857
12806 -26857 -12089 40994 73441 65238 78925 78998 53442 84502 106110 131060 141596 107062
12794 107062 74719 34628 7020 -15695 -12572 21167 28955 44264 65298 70851 52553 34932
12782 34932 12631 -15990 -13882 -4856 2846 11566 -2471 -28121 -60801 -60016 -33551 -14153 -16844
12769 -16844 -54951 -74544 -53770 -39659 -12027 -18437 -20954 -3096 21429 35866 7623 -2704
12757 -2704 15333 47572 104664 162776 221886 264056 290443 304776 311123 316534 290510 259710
12745 259710 248117 201456 159795 117066 78726 29956 -17279 -41000 -23956 4413 7445 2531
12733 2531 33383 68094 120133 173691 245602 256926 146481 78605 51233 49297 31129 2500
12721 2500 -25809 -33491 -34871 -32413 -36712 -25596 -40924 -67251 -64111 -45834 -46076 -41878 -54408
12708 -54408 -39046 -29874 -34947 -46318 -41166 -19553 2437 26797 52972 60158 74870 161773
12696 161773 253116 325066 380590 408878 420326 389772 355146 294254 233046 176641 106880
12685 106880 88746 95192 96066 100585 109284 104085 81686 61366 81269 120450 92208 71582 49272
12672 49272 46271 55476 64591 58182 53489 50084 52946 39181 32500 46063 84315 94555 107454
12659 107454 135572 269218 349541 344730 266644 158807 89390 85115 68004 59240 43214 27310
12647 27310 32632 32456 27514 37225 55053 67187 65507 60773 56544 51154 41457 25912 14042 29745
12633 29745 16308 695 25578 55126 73324 99662 165804 230340 320867 363919 363049 352308
12621 352308 353408 389057 410042 378953 353004 281866 229872 188662 168775 176505 166781 137860
12609 137860 123769 116890 80910 71384 64424 104264 120572 116331 146476 133507 124815 118339 123495
12596 123495 157167 185810 183309 189729 214093 237490 260437 278901 285889 295587 324582 367233
12584 367233 415062 449952 494248 568716 675173 841594 1079955 1333504 1549765 1623290
12574 1623290 1528363 1311053 1097804 919945 802372 694713 615263 599887 609748 601174 586257
12563 586257 570939 569500 585125 606354 625347 627169 633024 645475 690562 797109 883725 916784
12551 916784 969504 1022043 1077053 1129180 1185024 1233941 1260174 1312101 1409210 1571411 1732978
12540 1732978 1948334 2209907 2478677 2707341 2863553 2963977 2962568 2884583 2836530 2796667
12530 2796667 2791723 2854048 2962588 3144302 3362579 3607154 3905087 4222143 4612627 5142478
12520 5142478 5781309 6516082 7320631 8317491 9633415 11399962 13689557 16453771 19287090
12511 19287090 21750000 23954812 26612427 30373628 35353951 41615324 49963384 62647885
12503 62647885 83547435 118271276 173815906 251663107 333014415 381979792 381494232
12496 381494232 359282111 357538303 380207223 388842662 349352630 270545410 190073556
12489 190073556 131907157 95245737 72523238 58136595 48644999 41864382 36464334
12482 36464334 31914747 28283328 25642062 23499203 21193373 18475537 15689436 13265926
12474 13265926 11355343 9914152 8774057 7907930 7258219 6719224 6210549 5755187 5353570
12465 5353570 4993015 4684290 4421131 4214705 4059214 3955206 3857888 3793945 3721747 3544890
12455 3544890 3302282 3115616 2956888 2758893 2552943 2394223 2264377 2178516 2124411 2077769
12445 2077769 2037041 1994137 1959743 1909309 1861166 1818846 1795367 1797373 1798492 1819583 1789388 1715720
12433 1715720 1655306 1592536 1547188 1522399 1524237 1506994 1516946 1540194 1609075 1716970 1915472
12422 1915472 2130723 2319716 2355170 2216420 2017194 1794100 1591326 1469641 1389106 1309217
12412 1309217 1226767 1190939 1170507 1161781 1167818 1154644 1139274 1087619 1008931 959230 917119 901834
12400 901834 900816 912498 921395 920772 899953 882892 881812 895735 913339 928318 943230 979140
12388 979140 976106 996240 1054102 1142070 1220083 1181048 1044657 915105 790504 706883 609100
12377 609100 569970 539033 532918 564097 569908 580032 605714 638645 657061 650783 680641 652926
12365 652926 601247 543441 489927 481734 466215 470801 466860 468253 444104 392831 383133 398298
12353 398298 435360 497973 517973 534360 559626 576655 557441 524148 500653 447583 393550
12342 393550 355752 312178 302751 259646 263799 286500 276424 298751 310103 305266 287844 283832
12330 283832 276750 277859 274183 280998 293027 257349 252126 273625 315659 333674 310278 263356
12318 263356 243514 223620 194039 180293 175825 182500 189774 214035 203021 210808 206468 191089
12306 191089 167704 133272 117187 111572 120211 132785 163569 158231 147572 172114 194920 205364
12294 205364 214321 207803 222698 240777 234458 212317 199970 239365 263873 270329 254745 240337
12282 240337 235368 251304 267203 262897 276764 266624 229988 209215 178939 193536 211970 227979
12270 227979 217333 238422 272985 274563 286140 286171 301923 357642 401302 413708 400697 384431
12258 384431 372763 369216 365451 302338 280076 308783 338252 340909 305987 277136 259574 232839
12246 232839 232019 239743 232615 236180 246476 247650 244226 254650 263394 253234 239411 259445 262737
12233 262737 254775 258743 244866 241009 273934 295080 308947 326186 359077 422556 472623 486103
12221 486103 479439 435141 404934 363574 352757 357166 343725 344134 394816 390017 375687 359484
12209 359484 388267 384067 368589 360023 361279 380477 392689 425413 457981 466927 479670 524815
12197 524815 561054 634082 707473 765643 826914 893472 953347 977629 998225 1000474 969709 950212
12185 950212 922735 895323 853244 813238 783125 800847 854652 898566 950633 996697 1045555
12174 1045555 1126744 1177588 1241379 1313755 1419703 1523239 1608033 1718436 1802875 1889874 2006374
12163 2006374 2160993 2363067 2614036 2888374 3181752 3515768 3876349 4271160 4754074
12154 4754074 5314847 5953936 6778809 7772128 9045979 10649085 12605527 14942670 17666177
12145 17666177 20951609 25165237 30985197 39472251 52380701 72532847 103815381 149353852
12137 149353852 205760068 256695977 278549350 260626089 214877572 162674659 118511911
12130 118511911 86457936 64795977 50352310 40622738 33971650 29382619 26227811
12123 26227811 24014751 22396011 21229778 20326341 19513184 18584924 17538383 16470271
12115 16470271 15549287 14969311 14781134 14988862 15579461 16541062 17854067 19517164 21594758
12106 21594758 24287682 27911041 32968941 40253341 51084928 67367361 91516244 125154869
12098 125154869 166895310 210014283 243173354 255173905 241555603 207336916 163912961
12091 163912961 122678339 89984762 66704878 50873868 40178207 32810619 27624832
12084 27624832 23941675 21285001 19468833 18291558 17469029 16555392 15132925 13154474
12076 13154474 11082902 9382953 8174344 7395398 6906037 6626679 6513973 6387465 6137843
12067 6137843 5833727 5534795 5356869 5213181 4885236 4376803 3847135 3384987 3008481
12058 3008481 2723078 2543217 2401226 2281122 2189445 2099119 2018189 1924543 1845448 1768241
12048 1768241 1691820 1593121 1501749 1452005 1385895 1303389 1236542 1198091 1190658 1175228 1165234 1138908
12036 1138908 1109823 1072056 1039598 1051534 1043752 1003461 984420 957458 936155 902000 878821
12025 878821 871913 856018 832645 808800 782238 790371 806128 777597 746948 758165 743483 722343
12013 722343 740685 778394 798228 816353 812902 786365 764272 731361 675446 647867 606885 558560
12001 558560 562556 559328 537813 520395 518556 508403 524063 546467 561970 555397 522127 503368
11989 503368 480106 484478 489871 510999 518683 497127 477617 459591 445188 442139 422441 388940
11977 388940 365829 371527 355302 375932 438217 493878 519614 513313 467060 460081 468071 495840
11965 495840 467542 422841 395187 343218 324646 328057 328209 312517 306072 324544 316856 284090
11953 284090 279760 272883 267340 258300 259537 260110 293559 287424 260247 256753 237307 220936 222525
11940 222525 221891 204751 206714 199207 207216 226680 254860 248542 250270 248261 218625 198027 207573
11927 207573 210414 200520 185562 195136 206128 189608 201607 226559 252666 224002 223753 216547 208265
11914 208265 211139 210295 188626 190616 193980 197204 216321 229938 201179 186418 204248 195055 157664
11901 157664 168099 160989 167147 174409 172076 154583 169991 204470 214889 227863 213873 221926
11889 221926 205182 187966 201658 241323 260385 258925 272635 260096 221072 233954 211819 179461
11877 179461 173770 161954 158018 138927 154002 146459 134695 140005 146202 157387 150277 145042 131768
11864 131768 99703 112085 145120 150883 146412 155211 157271 154281 131516 75729 66250 109702 143325
11851 143325 134829 156227 151437 135981 151419 141912 147886 139349 147172 159919 166417 195352 152568
11838 152568 137899 125234 133586 135649 144848 139646 115271 114638 121218 117079 99609 98159 112213
11825 112213 96017 96407 102800 104180 113120 107760 74076 73919 89242 108218 106771 136662 126620
11812 126620 115512 103826 139419 129768 134038 155261 150966 126324 93436 77513 75387 88245
11800 88245 98682 115222 136086 127166 127290 119471 109645 106185 101547 104536 119950 138939 117657
11787 117657 114342 95338 106048 94818 112382 94682 107472 155196 175412 184538 189957 228997
11775 228997 258956 272495 250673 217758 225543 225008 208138 175386 156681 169878 194908 224172
11763 224172 253300 279002 279223 286167 290336 321471 327237 312500 309976 299059 297246 338391 363479
11750 363479 347200 330315 328784 322852 312447 315788 327579 357953 316277 267565 276996 319465
11738 319465 349238 340954 351111 349043 346668 309242 296207 311000 289104 246681 204429 193323
11726 193323 175935 153751 148154 165934 194646 232873 243286 224407 199396 195017 169605 160719
11714 160719 143201 114174 127721 182192 198763 214511 227508 221707 195467 179676 187662 224262
11702 224262 242858 298087 333511 356809 368295 390638 417897 424084 492006 612462 725662
11691 725662 898806 1150939 1436773 1618043 1646976 1516346 1337210 1139703 978576 858529
11681 858529 744502 674512 652334 591223 547798 505952 499637 480008 468886 463167 469153 466459
11669 466459 458479 434830 378889 361110 352076 332909 302853 301947 342756 361007 382540 390010
11657 390010 397473 400716 406527 456943 567782 718054 893404 1069174 1254034 1409377 1422722
11646 1422722 1337228 1168741 953185 760070 612836 480904 409186 360459 296200 206257
11636 206257 143428 151823 149296 152914 150524 181573 158728 94872 87065 96965 69814 40752 38910
11623 38910 44603 46827 49512 71078 74599 63211 28051 14610 7749 23757 35055 45213 59660
11610 59660 53121 37302 63718 61399 53683 39286 61977 71886 87782 103164 106720 92444 84984
11597 84984 67431 43139 66378 107449 130049 136840 129972 119337 133870 137127 121408 130263
11585 130263 145559 145746 152400 179791 213945 280316 336146 400552 482870 586294 675768 713718
11573 713718 716934 717999 746870 755147 771473 790261 785855 770078 761112 757758 750214 737836 722669
11560 722669 721912 750129 827691 893950 946260 995003 1040336 1065323 1085298 1158702 1230360 1243139
11548 1243139 1203995 1110030 1003624 894136 806776 780202 762815 784386 775281 727171 681703
11537 681703 675232 679105 720591 776032 810156 829325 820010 796327 796152 807099 805163 766240 712282
11524 712282 653502 584631 544555 488877 402594 359224 328416 292996 259205 233098 175191
11513 175191 143494 113838 98725 136830 179425 218902 248659 271149 314450 380816 452580
11502 452580 492405 527591 611182 695144 767103 815672 874140 958217 1008681 1020183 1045354
11491 1045354 1073998 1074907 1056839 997644 947447 912529 907419 943286 967736 980387 959323 976527
11479 976527 1036386 1105139 1191039 1307053 1395343 1428298 1412741 1371005 1334651 1330594 1327980 1275301
11467 1275301 1198783 1133439 1057462 1000941 956206 927772 906291 919429 936358 938796 960653
11456 960653 956914 956115 952293 942439 941047 925217 925439 919543 893634 845499 768885 675944 564629
11443 564629 437803 344192 299867 297870 266450 254442 264079 248654 235403 225925 216770 232569
11431 232569 222709 184212 186446 208595 190739 177603 196059 195230 172889 183932 171266 144903
11419 144903 141126 157312 169998 160268 161614 162919 141400 152328 135929 124076 130027 187608
11407 187608 211459 240442 261441 245236 221665 210782 209464 195087 219167 241305 229053 246272
11395 246272 266990 278548 299518 315122 318694 348898 367470 391209 417796 459930 487358 502505
11383 502505 509260 545633 563656 581346 584017 628997 684049 719214 750133 818867 890055 986304
11371 986304 1089782 1206495 1264807 1343537 1438635 1516151 1609105 1745430 1898375 2088564
11361 2088564 2301056 2572015 2861591 3196410 3549278 3912437 4272659 4753737 5414663
11352 5414663 6311382 7485493 9027643 11101957 13731141 16945055 20417025 23710916
11344 23710916 26321234 28005765 28760885 28890967 28768006 28742976 29073574 29931243 31196687
11335 31196687 32588688 33589979 33884007 33493329 32775141 32217189 32262514 33010535 34351542
11326 34351542 36335694 39102922 42715305 47230845 52370357 57517406 61846833 64552545
11318 64552545 65161522 63659154 60640644 57006096 53608851 50843789 48637616 46760220
11310 46760220 45167881 43811297 42562565 41276802 40087034 39272482 38965594 38979357 39013127
11301 39013127 38825128 38432481 37917782 37409164 36935954 36290647 35150592 33424150 31423077
11292 31423077 29593370 28201451 27221548 26354317 25292074 23862806 22121060 20353394
11284 20353394 18857854 17845088 17359246 17472595 18166615 19377361 20969496 22630449
11276 22630449 24149335 25395737 26593135 28057697 29875533 31861271 33706120 35139382
11268 35139382 36161904 37016495 37903158 38901900 39942679 40780266 41200159 41037236 40470186
11259 40470186 40002606 40202989 41231578 42888331 44686520 46282930 47688707 49101176
11251 49101176 50881638 53331893 56666629 60911169 65672424 69943787 72530517 72620344
11243 72620344 70088223 65755208 60691826 55740291 51413360 47824528 44955808 42709589
11235 42709589 41118632 40281394 40224709 40691119 41007707 40482182 38933481 36746983 34716069
11226 34716069 33469563 33232911 33830270 34690379 35151413 34618390 32871041 30064755 26480832
11217 26480832 22542830 18725747 15334700 12598600 10477477 8867841 7647714 6770454
11209 6770454 6091225 5570917 5164601 4848093 4575233 4298837 4022515 3712507 3421776
11200 3421776 3162965 2949579 2761087 2587771 2438199 2309998 2186748 2083365 1978139
11191 1978139 1870142 1789917 1721648 1644899 1573799 1483022 1419031 1380015 1329091 1246774 1215647
11180 1215647 1187845 1144577 1107613 1075821 1057050 1025766 997905 975860 950272 935103 928098
11169 928098 885900 850771 834566 842428 843040 791776 755919 740643 683865 663364 646937 651914
11157 651914 658794 663802 657692 649382 631556 620244 603012 585324 560700 520140 511286 507602 528236
11144 528236 518113 507224 529166 537293 526976 506672 505140 507749 493257 492730 500577 500040 491397
11131 491397 484221 489812 494987 525372 524200 495811 488413 463927 452352 480971 511304 502562 489212
11118 489212 486231 472183 452972 448330 445799 443449 424438 421349 437411 418882 420114 439985 410724
11105 410724 390927 394067 390790 412015 455225 449098 421861 415148 432287 446000 439643 417566
11093 417566 399185 385859 406885 393198 374706 374638 364394 340594 303572 281404 307915 307750
11081 307750 296873 278867 277668 284575 265957 259797 297929 291480 249037 239073 228569 206185
11069 206185 191609 197324 222207 215575 201765 194818 199079 191410 162447 168756 175915 182352 188771
11056 188771 169008 173772 192317 187867 192285 200859 224008 238162 224505 238383 233819 222562
11044 222562 198686 175137 185994 197462 167465 176171 195194 173531 158880 166144 177418 175041
11032 175041 187450 174704 149861 152024 182210 177225 193121 203710 174277 130133 142862 184792
11020 184792 193440 209414 196897 212221 196174 198557 193226 191188 178370 184870 174413 161321
11008 161321 136136 129403 140078 119853 129422 135088 115358 101428 98122 97245 105797 141166 127187
10995 127187 127357 125306 112875 137637 135524 119571 97382 108013 119989 143836 155582 151813
10983 151813 125500 107815 94141 120749 118585 114955 115815 126930 138658 156012 148950 146865 115069
10970 115069 117480 92916 71218 81943 83144 87307 59524 54629 101984 121886 125931 104939
10958 104939 110645 100787 92065 111478 108547 110285 124278 122027 115362 113271 97294 87669 101509
10945 101509 97635 106822 102666 95592 94444 95748 83202 65418 43691 60837 91287 103497 125745
10932 125745 103255 71456 73311 102073 111376 88350 72417 69109 80549 121721 151182 131602
10920 131602 108099 99421 87131 104764 102972 58849 42935 50308 82235 117121 121865 143257
10908 143257 161413 189656 220816 246944 228378 196811 189215 232290 225414 232125 208336 228554
10896 228554 265648 269349 259644 260439 261015 291309 331457 336244 327054 321664 310193 324522 331856
10883 331856 319690 302608 335376 346182 351454 345037 329117 326615 315623 316430 279744 239903
10871 239903 230521 248819 239217 252460 269609 278733 299296 302683 277580 263293 271435 251760
10859 251760 228700 207754 195722 217813 203223 213481 235198 207003 206131 221101 230275 242927
10847 242927 232075 182511 146183 153188 173131 193778 216989 207148 220193 247169 226586 251200
10835 251200 253433 226469 202571 205974 224236 237008 242436 248852 262222 281051 294995 321450
10823 321450 326784 333326 319169 337063 367199 365050 385239 443304 498140 538660 619727 761889
10811 761889 944928 1139723 1322098 1469484 1514048 1464409 1323420 1188203 1087599 1021658
10801 1021658 992603 958681 940018 943844 979572 986330 1011998 1054594 1139604 1271127 1368016
10790 1368016 1391198 1327536 1171714 977075 846873 733480 631712 544259 504155 462148
10780 462148 426816 376205 360971 341977 307185 234061 201118 211945 219892 236065 200181 156916
10768 156916 140047 146785 157472 119167 112507 130784 142445 138147 121834 112243 137650 151865
10756 151865 145888 129069 102708 100324 102684 111480 121752 122728 122469 139311 150467 192601 246039
10743 246039 278087 286555 305058 361062 425524 505189 601956 743400 943821 1205993 1495031
10732 1495031 1769081 1989995 2089373 2092685 2022708 1851690 1618673 1405141 1217783 1063366
10722 1063366 1004125 1028887 1090649 1195926 1324484 1476624 1672159 1868593 2022036 2077784
10712 2077784 2054997 1906622 1643239 1364953 1101944 902874 716828 579954 476143 431249
10702 431249 377182 305691 248970 226693 172465 125104 113092 93051 115647 131358 111861
10691 111861 86639 78814 96067 85096 87383 78188 68145 64378 42546 57042 49646 40938 76108
10678 76108 79427 76184 69353 51390 57358 73628 86025 91821 94912 100426 119809 136196 120958
10665 120958 143855 154764 174133 202038 226826 287055 374253 484057 577943 691007 826328
10654 826328 921584 995388 1023843 980906 857214 762272 692993 623281 537361 501094 501856 544234
10642 544234 585585 638594 703041 751930 832734 919107 966733 989855 943788 803827 660993
10631 660993 516248 398720 300335 240652 204787 199365 169843 129747 110875 105348 94662
10620 94662 89211 82792 61520 55070 51074 54219 78967 65325 51637 51786 28744 35863 25235
10607 25235 42412 62474 59914 38995 43840 82272 72746 64462 53424 15297 5991 33959 65946
10594 65946 48141 55603 68688 74058 56065 60877 48458 39336 28743 13293 3047 10590 20146
10581 20146 36630 40169 28607 25087 20108 25093 32462 24188 37238 44110 35913 22530 60999
10568 60999 37214 3962 -12794 13443 36673 37390 12193 -206 -4331 4313 -35401 -51350
10556 -51350 -15805 300 26664 37516 48527 38220 19421 37334 33400 201 21869 26638
10544 26638 6121 18555 23300 44485 50628 29775 25922 34285 42220 8477 -24283 -26704 -7506
10531 -7506 -7710 -7304 -10929 -10495 -534 15326 16354 14524 -70 20284 29593 39802 16947 10164
10517 10164 29010 34276 3521 -14846 -947 -11818 -9228 -7940 11709 24185 42018 30076
10505 30076 40199 58402 75816 70167 62604 39458 47549 58920 44120 6726 -5447 -6316 24023
10492 24023 34073 38393 47613 48105 62606 75565 89698 141167 177977 169605 137227 90438 68811
10479 68811 86035 79758 79463 92442 98014 72612 60860 41652 81529 66969 38445 42899 52551
10466 52551 59421 79954 105376 93423 70938 35579 35295 30834 40566 33249 32932 32586 26797 25397
10452 25397 19571 30960 47390 51678 71794 86980 109616 99267 107239 124748 187257 249827
10440 249827 355513 462199 520316 476868 367529 260852 181682 154145 135003 102974 34765
10429 34765 23042 41616 32842 -6076 -25213 5739 19705 19794 9117 -1056 -40066 -62568
10417 -62568 -31553 -27071 -31090 -4479 8152 -16345 -26249 -21099 -34436 -19936 23463 52281
10405 52281 58756 38542 17175 25777 37011 30876 59333 79669 123070 177748 260174 359249
10393 359249 463013 498508 449069 350645 233231 159780 96837 78424 92418 95544 79492
10382 79492 55461 56390 43691 17504 -13007 -18801 -697 12986 1895 -27856 -36810 -18376
10370 -18376 -12852 -3168 -3002 2727 9233 22033 26602 5481 -16134 29780 34274 39605 39851 2680
10356 2680 -249 33219 56666 54650 36339 37150 72298 107199 122970 157252 178952 169269 135727
10343 135727 111374 80531 51060 41153 50855 56573 62300 41974 39134 30389 24058 30902 48368
10330 48368 41545 39867 40055 16504 -3351 -32937 -47666 -37573 -21139 -26432 -29619 -12581 12697
10317 12697 27179 44238 35709 22220 5466 7941 16413 12613 -3632 21033 29819 20085 -14656
10304 -14656 -19848 -11858 -11497 3396 -9282 -27930 -29612 -2765 9337 17969 18375 31095 28537
10291 28537 12597 8644 21358 26026 16991 1187 -1856 -810 4749 10476 33941 49858 47496
10278 47496 47882 35629 20223 16675 10757 11425 46722 56844 45948 38768 52705 57373 66453
10265 66453 43216 25684 35307 57261 85937 136074 173054 205621 211779 241975 281378 289148
10253 289148 278509 252178 205607 179529 167956 150453 126160 151012 147385 125218 159538 183171
10241 183171 207158 229932 247279 308672 343340 308398 253133 205319 172716 161145 172439
10230 172439 175261 160851 146249 157897 164165 175154 203249 255253 249488 211644 248596 288767
10218 288767 311448 310176 352957 415507 519345 676528 928834 1333468 1982634 2853235
10208 2853235 3576882 3925982 4389638 5291494 5846013 5411963 4554873 4090503 3807649
10199 3807649 3203315 2374723 1760828 1443221 1330114 1468054 1867762 2332421 2462247
10190 2462247 2084471 1584301 1232108 1010892 872827 826124 792441 738157 712045 667493
10180 667493 639355 618308 587755 544460 482101 452855 445235 432573 398318 404284 444701 459772
10168 459772 459882 499859 476722 468069 466067 477916 451849 416509 362358 299545 260001 219733
10156 219733 178725 166391 152023 115792 76197 92239 83962 68990 83639 82331 94181 101937
10144 101937 100230 111827 113016 107766 90770 55401 51149 66718 65443 65071 53315 62740 73081
10131 73081 73770 75797 61278 74730 93272 85471 67288 57881 81659 82716 81855 81508 76812 109028
10117 109028 123411 124573 140747 160193 212434 261551 281172 306244 303906 310214 298006 276982
10105 276982 244833 213684 209813 213208 215025 228081 223176 214727 218789 272351 292549 284778 260959
10092 260959 248935 220452 194321 195641 181821 142730 123884 86261 48726 40098 48811 71045
10080 71045 48249 49739 71503 88158 97841 87427 105620 96630 54602 13870 -1827 8968
10068 8968 34748 41767 27854 42888 44392 22427 13939 27690 28725 31409 45737 54306 63989
10055 63989 72548 74192 34458 39060 60296 78041 74225 34758 39963 48704 65629 90813 79201
10042 79201 73609 67713 54340 89153 110814 99580 100318 76541 83619 89209 93207 88114 91941
10029 91941 110830 107414 83200 80674 93162 104557 128710 178040 203592 197997 175059 135834
10017 135834 122463 98809 60729 29112 46508 42453 86474 103406 65727 70832 93314 62976
10005 62976 57423 44442 51517 58332 60599 50603 36185 22343 30344 49596 53452 37216 28976
9992 28976 47348 55586 48650 28521 30476 44200 55083 74707 79754 100907 131789 160318 186214
9979 186214 202188 211371 199493 175930 178514 174120 188235 181306 206447 231864 243210 220031
9967 220031 189273 189783 204076 193665 168380 157855 146619 149627 129457 144320 177995 202743
9955 202743 184846 147479 126115 133534 152672 164912 161620 176803 177823 184490 186344 161793 156693
9942 156693 159932 142026 152103 141803 136567 130240 123013 94277 86763 104415 132810 157854 150679
9929 150679 119637 134188 135752 137724 150605 160772 144132 162591 193712 188928 193493 198522 197712
9916 197712 199606 197818 217464 233545 236929 232074 266382 306404 356754 394170 408577 429359
9904 429359 428760 423298 397017 406807 421603 427672 449743 487077 523962 546980 575860 613152 647620
9891 647620 669834 698126 751103 829364 877278 901767 949296 983933 1023893 1096023 1156088 1269440
9879 1269440 1359954 1432495 1545266 1664520 1812626 2032382 2312023 2652291 3044752 3542880
9869 3542880 4104688 4793614 5652464 6707572 7979550 9511433 11352286 13582535 16226845
9860 16226845 19412055 23183379 27572357 32382634 37067355 40774325 42699015 42430738
9852 42430738 40333343 37324639 34286376 31766780 30009263 28980738 28642584 29112725
9844 29112725 30466652 32404767 34455913 36479364 38587117 40633673 41850668 41507187
9836 41507187 39536182 36476361 33007457 29697806 26793427 24350919 22140621 19906456
9828 19906456 17596302 15364409 13401384 11729833 10297870 8989944 7855924 6947146
9820 6947146 6226423 5695838 5306630 5065675 4934438 4886361 4898212 4941078 5016275 5146555
9810 5146555 5261122 5339377 5383341 5428593 5464661 5489991 5532779 5612603 5747470 6014411 6413427
9799 6413427 6950222 7670940 8656688 9970561 11666219 13801190 16387545 19490143 23101474
9790 23101474 27109496 31589461 36896265 43558633 51439935 59175052 65739174 71471360
9782 71471360 76365886 79418042 80031291 78582294 76075239 73206659 70452388 68256452
9774 68256452 66897481 66323102 66400357 67148551 68637564 70797773 73136510 75199739 77073382
9765 77073382 78595605 78810118 76861390 72884182 67610658 61714626 55714953 49925973
9757 49925973 44554288 39557048 34664009 29864095 25374984 21402783 18059366 15357669
9749 15357669 13216574 11556795 10280337 9260539 8482249 7907499 7449847 7089319 6838980
9740 6838980 6701974 6644625 6634890 6633243 6584570 6485590 6298447 6132320 5993668 5879884 5823167
9729 5823167 5838550 5914296 6079440 6374970 6839883 7467615 8236635 9112458 10116675 11305739
9719 11305739 12713514 14350302 16198049 18168093 20224801 22549991 25470866 29186974
9711 29186974 33554056 38053935 42012963 44769748 45770846 45110542 43497234 41639057
9703 41639057 39638607 37580276 35855077 34908303 34840825 35517321 36816073 38670270 40932934
9694 40932934 43312231 45362436 46286592 45257091 42105920 37618030 32867503 28509692
9686 28509692 24762859 21621999 19053225 16905127 15074431 13456277 11990763 10595270
9678 10595270 9305661 8222980 7334486 6638862 6107373 5706019 5384354 5135241 4958789
9669 4958789 4813088 4704595 4627111 4561034 4514426 4488326 4482024 4507252 4516173 4517692 4526990 4583090
9657 4583090 4684965 4778106 4884880 4995524 5132292 5252340 5392169 5561545 5772811 5991252
9647 5991252 6228312 6476524 6739810 7058100 7400627 7776492 8200220 8670019 9174085 9741359
9637 9741359 10351419 11045275 11835393 12708951 13677451 14763987 15992533 17340039 18879637
9628 18879637 20614385 22573404 24799182 27363179 30345239 33792215 37785374 42457036
9620 42457036 47843424 54071503 61258490 69408977 78475175 88318233 98472481 108257539
9612 108257539 116686399 122792140 125669227 124849599 120511427 113364267 104418907 94661955
9604 94661955 84834886 75527484 67036339 59421768 52712011 46882169 41810305 37440386
9596 37440386 33633630 30303526 27398531 24888069 22677411 20740285 19032502 17516800
9588 17516800 16172189 14983270 13916048 12949296 12070095 11302383 10616243 9987136 9407045
9579 9407045 8909546 8430417 7955239 7504523 7109083 6785037 6477400 6209094 5934103 5640741
9569 5640741 5384075 5183554 4975551 4794481 4627324 4483444 4348704 4183531 4024565 3876549
9559 3876549 3746368 3646610 3561990 3494696 3398383 3282161 3176143 3061999 2944314 2865068
9549 2865068 2806192 2727044 2644767 2605641 2547884 2505440 2471662 2445941 2396522 2372139 2313982
9538 2313982 2242203 2171411 2119504 2048709 2021421 1968395 1928117 1852900 1806216 1777693 1731808
9527 1731808 1694676 1646536 1615904 1601531 1556522 1533241 1496282 1450899 1392192 1376754 1349234
9516 1349234 1341042 1340634 1336803 1330385 1299116 1269885 1244739 1224566 1198209 1196347 1169064 1141241 1150335
9503 1150335 1134461 1116067 1105347 1093608 1096357 1106676 1074936 1031509 1032725 1008539 992674 953077
9491 953077 941484 950206 930258 920775 929401 955618 968272 975836 962321 958594 951031 931457 929918
9478 929918 939847 935265 946936 935494 914326 910827 929464 954109 967441 941603 902752 864695
9466 864695 853274 874017 866506 852892 846570 829778 814858 798935 795264 808163 847590 851344
9454 851344 852827 862112 897849 914589 944938 969500 1005498 1002987 1001422 1006492 1020826 1022047 1026482
9441 1026482 1026786 1051950 1080021 1124987 1131135 1152396 1192707 1247667 1270017 1295482 1334485 1368455
9429 1368455 1407373 1408399 1424939 1449890 1503462 1546246 1570293 1604927 1687811 1808805 1902593
9418 1902593 2004273 2114372 2282918 2502135 2736879 2992684 3325308 3782875 4328304 5025694
9408 5025694 5854463 6752455 7751686 8760359 9642151 10321702 10777417 11085803 11449622
9399 11449622 12010779 12803620 13830210 14979158 16232671 17624272 19191977 20887770
9391 20887770 22707482 24632321 26699811 28835873 30894735 32686578 34038012 34925487
9383 34925487 35600980 36352360 37325255 38521675 39761716 40862652 41795222 42633254 43589631
9374 43589631 44757923 45993536 46892872 47128446 46630568 45700117 44698016 43898121 43504745
9365 43504745 43512022 43773295 44103429 44467247 44776422 45013937 45157990 45176423 45018520 44532136
9355 44532136 43606989 42311146 40793511 39253590 37698238 36007691 34191086 32364703
9347 32364703 30668529 29103662 27683531 26405590 25280832 24368196 23618440 22888753 22054062
9338 22054062 21138186 20206442 19357653 18649302 18143456 17908568 17936620 18099043 18279445 18544112
9328 18544112 18901396 19398502 20069301 20745747 21182112 21289696 21101916 20821195 20672613
9319 20672613 20808415 21209341 21833059 22617351 23622898 24939382 26604460 28667648 31170984
9310 31170984 34089534 37293561 40733876 44105581 46881193 48614482 49246849 49254558 49218618
9301 49218618 49478392 50059867 50812604 51553907 52132023 52584146 53106006 53760864 54537980
9292 54537980 55287375 55756357 55896262 55756464 55386397 54939965 54677947 54735235 54973215 55209592
9282 55209592 55348626 55240589 54901569 54526823 54289112 54178038 53935576 53245701 51940665
9273 51940665 50058855 47832552 45488756 43129157 40789098 38419204 35939085 33589681
9265 33589681 31536680 29840404 28524764 27521154 26727979 26003182 25188105 24168600 22936464
9256 22936464 21554928 20082301 18579707 17134033 15803159 14600928 13457790 12293496
9248 12293496 11105962 9946064 8868819 7882267 7034253 6296687 5660499 5127191 4660933
9239 4660933 4284559 3957813 3678692 3424236 3262817 3163185 3120575 3051840 2926297 2762035
9229 2762035 2602691 2436242 2302670 2197102 2069688 1939873 1819429 1736056 1682327 1637299
9219 1637299 1609546 1559011 1494202 1412755 1381435 1316018 1271818 1245937 1246368 1240013 1223896 1210785
9207 1210785 1203615 1238174 1284902 1308476 1272556 1202601 1176263 1153791 1129902 1097966 1097666 1083459
9195 1083459 1046028 1051765 1067343 1097116 1117634 1108657 1123072 1175154 1202536 1194115 1173557 1174969
9183 1174969 1141343 1110123 1054659 997161 935984 900222 864951 863438 832020 811386 836984 841885
9171 841885 838134 877681 906313 960469 1025010 1090097 1159692 1227882 1226012 1186710 1138315 1058999
9159 1058999 1006275 962838 942504 941383 919257 888994 845546 818204 798641 810649 854715 861506
9147 861506 832535 826078 814626 796974 782657 780683 762898 760702 768206 757246 705104 685913
9135 685913 713257 735506 759988 797157 796869 782171 777281 763998 795270 850338 874262 907346
9123 907346 916111 926976 904515 865390 852607 886970 942243 1003383 1073672 1088718 1096813 1122333
9111 1122333 1137676 1170724 1216572 1263285 1293153 1311464 1401256 1497199 1671883 1938432 2300646
9100 2300646 2762771 3270317 3683638 3987804 4060316 3887447 3524461 3143212 2809054 2499809
9090 2499809 2233032 2018970 1882643 1775642 1720583 1724668 1765877 1860726 1965318 2100414
9080 2100414 2332634 2686152 3126846 3617919 4124478 4532590 4840434 4935856 4827694 4514089
9070 4514089 4114466 3701460 3335231 3041276 2836265 2752775 2826736 3006135 3299455 3819960
9060 3819960 4555385 5426422 6337943 7076492 7439429 7347569 6934025 6362884 5805702 5295650
9050 5295650 4836778 4404107 3981868 3601233 3331368 3153728 3097911 3168220 3338920 3622093
9040 3622093 4054878 4689952 5526849 6558016 7760503 8949155 9884703 10388302 10427901
9031 10427901 10084771 9623379 9227819 9052660 9114135 9304450 9482415 9487807 9245650 8826025
9021 8826025 8373455 8025324 7837491 7830316 7891833 7943384 7988833 8074080 8203734 8330505 8393393
9010 8393393 8389346 8297397 8274253 8515241 9134655 10156867 11497559 12923532 14070508 14549929
9000 14549929 14247485 13405494 12413263 11622146 11168082 11015715 11037314 11102892 11157582 11253188
8990 11253188 11474949 11864368 12489975 13406320 14487395 15517566 16263356 16532064 16243985
8981 16243985 15515451 14630497 13734458 12936766 12214957 11573310 11029464 10670023 10476226
8972 10476226 10390543 10392179 10516874 10802776 11363432 12388992 14016074 16303868 19182967
8963 19182967 22234321 24654959 25535105 24577497 22355922 19752113 17502076 15931466
8955 15931466 15113528 14919728 15033315 15132410 15044821 14727047 14240058 13728073 13398288 13278312
8945 13278312 13398322 13659550 13999564 14327770 14525790 14543146 14289678 13831994 13286938 12842964
8935 12842964 12639013 12792133 13378389 14397469 15673934 16933102 17821180 18106576 17807162
8926 17807162 17214342 16723920 16606241 16729844 16736039 16310134 15425680 14297759 13273707
8917 13273707 12610020 12483306 13047474 14268844 15905486 17572691 18772369 19082495 18559437
8908 18559437 17517443 16285311 15028579 13769435 12590786 11631273 10954477 10477506 10100363
8899 10100363 9780826 9612455 9694338 10128776 11038786 12538549 14791997 17896415 21573581
8890 21573581 25015659 27032309 26856307 24654091 21439795 18274579 15642153 13748681
8882 13748681 12584262 12169108 12546478 13879671 16621431 21634651 30308221 43856310
8874 43856310 58474568 63240776 54741532 42770503 34767536 30305883 27260930 24267098
8866 24267098 20944304 17535272 14551945 12236830 10562510 9329658 8369125 7662576
8858 7662576 7234642 7083495 7187197 7589183 8381595 9570951 11116354 12728274 13858874
8849 13858874 13988994 13023125 11301487 9424866 7751172 6471687 5498192 4791679 4295342
8840 4295342 3956916 3759052 3687336 3734575 3953713 4326954 4866832 5568286 6429166 7186492
8830 7186492 7587492 7464597 6844237 5948297 4978098 4121528 3428784 2891002 2483774 2171014
8820 2171014 1965539 1795140 1685564 1597644 1487574 1400774 1373754 1357435 1290054 1251280 1284233
8809 1284233 1289050 1277604 1249063 1241883 1283782 1303260 1331556 1371573 1404474 1429230 1511085 1593881
8797 1593881 1666031 1732244 1821306 1941260 2062276 2202452 2345963 2527609 2761452 3017967
8787 3017967 3323580 3743982 4305168 4961777 5773005 6800154 8079079 9695319 11732661
8778 11732661 14387916 17791089 21960670 26590853 30888822 33840459 34743276 33658783
8770 33658783 31299493 28625268 26068543 23612642 21100417 18548145 16169762 14154010
8762 14154010 12581997 11505969 10893856 10765800 11166126 12093646 13590701 15637046 18091532
8753 18091532 20820256 23795345 26922215 29801307 31792562 32338117 31369932 29290260
8745 29290260 26885324 24739970 22836915 20982340 18971472 16762164 14450603 12331340
8737 12331340 10525810 9069207 7957169 7081840 6403453 5908539 5580024 5364985 5220559
8728 5220559 5107225 4983834 4890223 4801736 4728792 4744206 4842366 4971189 5165504 5437673
8718 5437673 5767262 6148148 6542564 7008585 7620335 8382376 9359989 10602831 12127634
8709 12127634 13900227 15937220 18340715 21237462 24666353 28425084 32317179 36136756
8701 36136756 39784236 43408195 47075736 50677436 53975241 56533838 57909362 57802542
8693 57802542 56131695 52950589 48694165 44042410 39589362 35762340 32656637 30364941
8685 30364941 28912411 28255491 28243326 28822205 30079200 32140078 34984512 38364309 41918512
8676 41918512 45322191 48563264 51691166 54453032 56413577 57175179 56558951 54595463
8668 54595463 51388034 47072574 41991064 36718566 31823207 27571172 23903190 20696259
8660 20696259 17888487 15520879 13556175 11936113 10649223 9633729 8836929 8228519
8652 8228519 7749227 7312491 6920387 6627423 6426671 6310132 6206403 6161903 6168995 6239371
8642 6239371 6429582 6775245 7305744 8060146 9041274 10237089 11649673 13172878 14593363
8633 14593363 15827448 16842759 17819082 19020711 20642945 22801590 25438208 28248817
8625 28248817 30806433 32796042 34378226 35959754 37740848 39520920 40889084 41477694
8617 41477694 41138157 39909229 37977046 35623595 33102968 30571834 28275579 26448258
8609 26448258 25179535 24482079 24188542 24247143 24804460 25902471 27527580 29477986 31427381
8600 31427381 33085871 34452672 35689923 37023007 38437753 39609048 40172957 40004142
8592 40004142 38992013 36966905 34026400 30463552 26631823 22832393 19331775 16326791
8584 16326791 13825860 11791315 10106297 8725588 7619498 6725285 6045109 5529285 5141430
8575 5141430 4850117 4558684 4298179 4072988 3862541 3717337 3629172 3554053 3469053 3405230
8565 3405230 3384328 3368824 3420884 3511622 3639983 3826791 4136532 4583419 5134594 5775289
8555 5775289 6489294 7216924 7902637 8552590 9122203 9640817 10170681 10768684 11480208 12317898
8545 12317898 13141587 13667797 13585588 12970109 12091998 11121377 10121512 9035383 7978192
8536 7978192 7075512 6397539 5919442 5673765 5628547 5813718 6170577 6667630 7278798 7992771
8526 7992771 8806572 9717534 10722627 11818346 12867560 13685473 14114136 13947831 13156577
8517 13156577 11895902 10465405 9076836 7843058 6758545 5804328 4961509 4238906 3631153
8508 3631153 3114014 2705665 2372654 2088738 1875281 1737701 1618103 1536774 1417272 1337299
8498 1337299 1307726 1212282 1160307 1129220 1091061 1061772 1068986 1075610 1044459 1061862 1104625 1181847
8486 1181847 1257085 1313817 1342605 1379586 1437867 1472741 1504152 1535931 1601789 1664663 1695473
8475 1695473 1744004 1762449 1769682 1735212 1656651 1553517 1434655 1334514 1230765 1161519 1108498
8464 1108498 1079343 1054997 1042563 1074057 1099525 1118683 1158864 1193009 1232676 1254190 1313425
8453 1313425 1332172 1352634 1383631 1415595 1440436 1424549 1410350 1409105 1348881 1240585 1118243
8442 1118243 999939 885938 814708 772069 709415 626741 574311 565477 523410 499525 493075
8431 493075 490418 460370 440829 408125 398352 427811 444085 465191 462658 454738 464866 469199 460679
8418 460679 467885 501800 504742 536932 557672 597389 632775 703868 772482 832073 878141 906392
8406 906392 943162 1013444 1049010 1069748 1098142 1108653 1116998 1123237 1136048 1152137 1139098 1116415
8394 1116415 1077332 1017824 948780 870221 841256 813788 804770 814587 848082 902664 949257 1006805
8382 1006805 1086851 1139736 1193794 1278227 1409917 1544162 1654694 1677465 1615356 1501945 1413067
8371 1413067 1321079 1259525 1205805 1130826 1047434 926785 810937 714950 624990 583739 564825
8360 564825 545739 519788 531191 526482 495220 480241 485132 477479 497776 491467 469921 476285 451245
8347 451245 438104 422840 426330 415126 396128 408389 418695 401683 397480 408703 438646 487006
8335 487006 552843 643905 818291 1083776 1406343 1648389 1655885 1432334 1170222 986193
8325 986193 852770 760150 686518 638011 615390 564277 546924 521392 488147 453853 450896 457801
8313 457801 456999 450861 452324 435625 428523 471519 499863 514995 545887 587000 641291 700147 745168
8300 745168 773855 780616 762911 739356 754917 759512 734887 713819 683344 684718 702647 780575
8288 780575 870772 1005459 1104195 1140195 1136195 1055089 922872 806345 736569 670312 636503
8277 636503 620868 603242 568518 524050 494868 468842 447884 454051 449699 411838 384461 351457
8265 351457 317920 295929 286166 253826 244530 269831 281798 284520 283808 278890 246801 222727 212142
8252 212142 253889 270562 304857 323059 352543 400566 486959 542497 492838 428632 366038 324732
8240 324732 266877 222800 235471 252213 248935 243777 226987 250606 255101 242752 253185 271338
8228 271338 299299 332831 348522 332908 342477 351090 352894 381679 412191 439573 433196 399831
8216 399831 351634 304475 281067 261403 281598 271786 278285 290316 313134 319961 312164 329643
8204 329643 349343 352040 334346 313304 323101 322450 337296 329615 347967 372183 395103 384731 354723
8191 354723 322884 291158 270051 263337 254903 239554 196800 164346 160509 149708 148623 143699 156427
8178 156427 159045 152328 163086 161041 161709 146557 138015 149663 176013 163684 129761 115246 126947
8165 126947 133812 135346 165278 166821 151387 147651 133326 114704 105593 93989 121677 158933 165510
8152 165510 193186 233038 219701 201054 227741 252096 260043 279356 265775 245456 225013 208717
8140 208717 204753 210427 221416 192613 188387 203138 198670 201009 190258 190948 188292 190651 182049 187815
8126 187815 179697 187258 190111 190015 179537 154762 156039 171406 174840 193763 191446 169662 157821
8113 157821 148352 148919 160766 122092 77583 84600 121058 146471 131501 117228 139219 135093 106630
8100 106630 123549 128229 123727 130402 132366 137477 103057 79009 81765 93369 106512 125423 154057
8087 154057 136899 132231 139227 137133 134545 124495 108925 131682 148449 156757 146486 138050 135389
8074 135389 126926 110314 85921 93472 109024 106014 84115 96671 89710 120048 116175 122923 121911
8061 121911 114799 106634 103971 118593 133196 115605 111428 106422 103151 90875 76069 84537 101629
8048 101629 139283 164024 128357 78446 61368 71411 134304 140681 112745 110741 134193 140458
8036 140458 149705 159079 164607 135677 101232 77406 84827 102244 110559 108526 133588 150988 144448
8023 144448 143274 137736 123181 110300 117134 109766 90454 108544 136012 117429 98714 106770 128590
8010 128590 158782 160396 135945 134703 149676 169112 174383 176568 186406 190762 182478 167968 154668
7997 154668 156620 190757 215017 196077 165616 140637 121533 112489 125117 117179 106954 96608
7985 96608 86118 65893 44187 60989 64680 55306 80840 105939 114890 116534 114205 106291 120994
7972 120994 111863 106539 128796 133236 131799 137150 142920 116449 95982 105302 130481 154186 156610
7959 156610 147966 124067 120921 122517 110279 118483 146795 156359 148246 152228 157661 147758 119934
7946 119934 114206 129390 129893 105206 88034 61364 60334 68061 50229 81349 102942 128884 113640
7933 113640 98594 116514 116482 137816 167255 170071 170531 150045 150348 152299 137137 135904 127478 130350
7919 130350 137117 114556 121290 117819 112731 107903 102480 89842 89410 77564 81652 90328 102844 113959
7905 113959 85344 65400 61681 58690 52904 63866 56868 60085 46117 54840 83439 76226 59815
7892 59815 71893 75456 89011 86032 83439 97025 118546 99528 81491 85654 99077 78985 74926
7879 74926 89779 68738 36032 9859 9772 16944 15726 13141 11439 10764 32129 37079 26933 33127
7865 33127 45535 43506 31965 47920 76290 86921 103041 85049 95132 123545 121396 93364
7853 93364 95102 120890 108267 109891 111740 96358 88983 94569 78446 48436 33606 43211 55888
7840 55888 56341 46730 63435 100668 127647 105691 73464 65342 92014 90474 81473 87149 90899
7827 90899 86789 79733 57400 79701 77894 84094 73154 53016 53946 57671 53244 87772 80840 73748
7813 73748 86195 64113 61033 64807 58906 44664 31577 58413 69138 53242 23724 28768 49810
7800 49810 34793 32085 55084 51584 61942 76790 96863 105518 87432 80178 75548 103199 107277
7787 107277 62313 37145 32201 30212 13922 26165 47141 50075 64679 77845 75086 62931
7775 62931 80312 77758 68394 85151 72588 58783 72252 73277 83680 62771 17153 -4634
7763 -4634 28656 69646 50040 37125 43506 50634 60621 51772 52278 77959 96836 105607 61142
7750 61142 36646 27951 21425 32147 5247 7317 20718 51757 62302 65879 46876 37556 26447
7737 26447 36893 55820 47260 29380 49457 36464 9379 17239 11800 11809 -5119 19130 41315
7724 41315 73110 77967 29256 13539 57000 49590 8320 -3063 12515 44875 42682 15339
7712 15339 14269 23698 -991 -2706 -25853 -4786 30165 39154 31713 20627 12512 23563 33453
7699 33453 33089 28495 34587 43044 61253 73230 51245 37539 31963 53890 53617 55960 44076 37760
7685 37760 42769 68103 68848 57310 51617 32918 14345 18160 35092 31971 43690 67414 44554
7672 44554 36560 87081 98560 78287 26406 -3151 1437 1961 -17401 -9259 28999 45891 39719
7659 39719 43306 45641 35295 38358 34399 43316 68067 44521 13058 38485 60170 62012 54538
7646 54538 39865 51233 57430 60050 81127 87226 79938 75775 76443 65713 45486 69069 81094
7633 81094 75739 53138 64594 61048 53603 37267 42261 60582 65347 50999 40770 33493 45838
7620 45838 71210 67507 46896 47227 39712 71426 102238 94243 75817 66053 11334 -22653 -12350
7607 -12350 -13534 741 17473 10420 28834 38267 24700 19711 13869 20168 41119 35364 26932
7594 26932 29052 25563 22332 13559 -3265 1020 -17180 7621 28443 60079 82264 70702 34622
7581 34622 33864 73501 81644 46678 35596 30813 42672 51267 47424 41482 59989 47345 27758
7568 27758 32334 26391 14125 23853 51566 54673 44652 34929 29610 24586 9798 14247 22905 18303
7554 18303 34172 35518 30642 29567 36140 54669 59130 61893 67491 68452 53367 40286 62327 52559
7540 52559 44113 45846 36811 40406 35593 41544 27319 45378 47819 48445 21437 15037 28711 29464
7526 29464 18561 1100 16106 22342 24548 41211 63870 67762 44937 45556 41699 44041 72521
7513 72521 59149 38111 40563 31054 23092 18885 43139 57779 37528 36710 31748 26971 7135
7500 7135 17071 42052 50717 75855 81311 72924 69898 73938 60952 47018 23283 9752 22678
7487 22678 11684 16419 50617 79379 79417 41952 44174 54838 39749 43385 48809 51294 53438 59724
7473 59724 61895 55329 22405 22222 48716 60434 44189 21931 2800 14324 8237 22198 2703
7460 2703 11142 38540 20289 11439 19936 46119 86400 82711 96697 130570 111510 74396 50075
7447 50075 24357 36350 87498 79727 73903 67401 49438 50081 66605 51963 28644 16484 30550
7434 30550 63787 80149 58209 16485 -4170 6407 10654 -8637 -7221 8372 7156 -11998
7422 -11998 -7098 37435 47307 48985 59548 59330 37471 20090 8367 8295 17217 56135 67834 34106
7408 34106 15189 47536 57397 50643 46214 60445 40283 19183 7577 35561 36184 38779 43277
7395 43277 37794 43477 46936 51682 47970 57483 81957 74666 73200 85183 80954 56122 50099 53473
7381 53473 38490 14824 2563 3953 5414 2117 16052 24623 20679 31523 44774 50904 49686
7368 49686 31462 16755 11932 18985 46446 74077 79566 64344 49324 55790 20491 18956 42519
7355 42519 45212 27866 30239 55641 69691 70952 17020 2416 3929 -1429 19932 27594 28232
7342 28232 16744 -1752 -10797 6997 18055 18287 8739 9244 -3337 1049 26533 59113 82535
7329 82535 78979 57371 48494 72566 118098 109545 69662 74595 93268 107921 128122 97398 61347
7316 61347 38508 29675 32139 29532 15223 23586 2437 13324 8643 -6360 9426 37304 39446
7303 39446 11142 -25475 -13826 12042 21864 39293 30104 2225 -3427 12424 35368 36110 38198
7290 38198 20792 22940 46241 27310 20724 19708 39156 40108 46863 34106 -18093 -23498 -17059
7277 -17059 1000 24943 43035 37321 34597 43517 48755 26643 14414 26511 5335 -10955 -4113
7264 -4113 2655 14214 379 10427 31277 20744 32938 60400 54614 55424 57312 71175 48317
7251 48317 -2285 -34397 -14844 -2738 4727 22822 34109 9454 5523 9472 9746 21565 17084
7238 17084 3756 776 22397 19976 32331 50262 41664 39854 58212 43695 32479 48470 46701
7225 46701 48229 46950 13516 -984 10873 39649 44562 29863 35072 31100 28909 15537 43768
7212 43768 46859 26096 27727 31860 29011 32334 27777 44873 71899 69201 61224 47097 38986 29185
7198 29185 37063 78545 65548 27543 23892 10688 22095 40100 48356 68476 50115 19479
7186 19479 -629 31372 33714 13881 7877 9468 47252 66818 51377 42862 32540 25613 54793
7173 54793 92771 98560 65820 36235 36822 28748 33279 67773 50708 36091 48114 43062 27697
7160 27697 22778 11854 31593 57210 59236 62595 58684 32528 27206 30406 8369 6463 37640
7147 37640 44227 36040 28967 39495 73939 84411 66596 46867 40968 28641 46276 62811 51111
7134 51111 19224 28570 42275 25593 39844 43877 21512 -3812 -3928 15935 13323 -10481 -659
7121 -659 38106 39950 24051 33983 31852 38647 53139 57965 31884 16696 5700 7074 39567
7108 39567 73004 44405 -692 -13154 -16599 -17447 -31278 -26417 -4164 1780 -18832 -21178 -32806
7095 -32806 -34662 -6087 32313 16188 -3193 1179 -9760 7872 47528 64871 34427 19156
7083 19156 27853 29349 10547 -2101 -14031 -31593 -14792 20140 31700 32929 19140 16771 27152
7070 27152 -11001 -42357 -52006 -40436 -27801 5289 28118 41247 70476 67395 54024 22546
7058 22546 18196 6355 24598 46357 7043 -17609 -19128 -12226 1761 7661 25169 33969 43634
7045 43634 31710 21848 58609 75969 57953 61116 70695 72663 19824 18727 48746 64581 29692
7032 29692 -6370 -4979 -700 -2333 10284 12990 8497 2077 7937 11854 15216 31259 61955 39442
7018 39442 56330 38296 21850 13827 -2624 -25747 -34846 -28975 -55680 -66199 -60887 -38636 -25229
7005 -25229 -14703 1058 1413 -37290 -27135 7173 41095 68703 64709 27270 -13457 -1280
6993 -1280 9430 -9061 18240 22648 32788 28678 23724 27705 17149 34289 33944 20099 -387
6980 -387 -23972 -18470 -15487 -11518 -12727 -37042 -38402 -15026 -8325 4431 26846 43348 23115
6967 23115 20592 23918 40304 45553 67308 73466 29550 24654 -182 -19919 -21784 -7081 -3946
6954 -3946 -3289 -3370 -10536 3271 10365 21533 20244 27452 29354 33688 18400 19174 23495 36028 42298
6939 42298 74838 68130 46752 52113 42659 13090 15506 -3862 -4597 13895 17757 24301 26004 39625
6925 39625 48040 44414 41981 36024 20053 17603 33329 23459 24912 8828 8401 29843 14598 16147
6911 16147 25698 3790 24845 44985 29100 45056 51378 48985 69342 66888 42949 34776 25673
6898 25673 29661 57004 46521 61464 79772 66906 70660 53784 53042 67305 70409 65601 52634
6885 52634 10662 7318 1354 -7921 -36605 -66980 -50191 -31357 -6024 7686 20569 -3313
6873 -3313 -34693 -25901 5802 16884 -729 840 12240 30304 45648 69148 57004 46185
6861 46185 18302 -2581 4232 25862 28284 33321 35644 33153 37080 1846 -11630 6015 8898
6848 8898 3664 -28840 -37982 -667 18915 40882 27107 26250 28151 19027 20394 46525 46330 37202
6834 37202 31728 15114 11204 60 -15670 -12906 44344 53335 36912 9656 -32726 110 20572
6821 20572 35244 37510 32101 44938 56427 48659 53388 58313 37012 26519 48642 43625 25301
6808 25301 5261 -601 -224 17655 -949 -39380 -12279 16570 19216 -2781 -26538 10841 16909
6795 16909 -15249 -24001 -11273 -7557 -3040 11559 23415 8323 -14832 -7089 -22796 -28080 -11352
6782 -11352 -8158 -3053 18508 6907 51638 60013 46461 39471 53058 60856 51663 63029 20292
6769 20292 -3923 -5418 -13684 16073 28619 27705 27490 14124 -4942 3141 17069 4265 2521
6756 2521 21408 30241 13112 54520 55771 38123 15624 16065 25767 40319 52162 72331 60159
6743 60159 37572 19661 27179 11858 5311 -2584 -7122 -4700 -9573 8794 36151 31791 17348
6730 17348 4679 4794 23068 49206 51604 31627 13357 7524 -10844 4045 9271 10374 7038
6717 7038 -8214 6348 -8781 3932 47998 64383 60688 33047 33801 20544 16677 12249 27631
6704 27631 3400 -29537 -20818 -4246 14663 27829 32875 23702 1451 4503 11405 14780 4969
6691 4969 -17278 6560 8210 -17738 -15020 -5695 18702 17116 2208 1598 -39386 -39660 -3073 13030
6677 13030 5591 -3378 4998 19341 23685 4300 -8975 -1354 -2887 4035 -6280 -790 6333 26481
6663 26481 36619 12039 -16896 -14462 -1237 17658 12530 -2893 -21864 -17708 -16113 -6806 1300
6650 1300 1541 30066 39206 23535 -21820 -715 17109 20915 14968 15528 199 -7009 -26992 -31537
6636 -31537 -16695 -2486 -12702 -9878 -31787 -43423 -6747 -6020 -7523 -18280 -31903 -16763 -4546
6623 -4546 -4101 -8942 -12820 -36304 -50982 -24940 1180 -3315 -1916 2930 25561 25757 9860 17956
6609 17956 -4505 -3459 23159 51222 46206 25463 -6685 -12555 14103 49767 59041 58954 60049
6596 60049 52688 54336 20499 -3785 -25932 -10164 2151 -8855 -9454 -379 -27087 -26020 -13291
6583 -13291 -650 2329 -12961 -13030 -16822 -6792 17338 47388 59321 40513 29838 -2927 -18363
6570 -18363 -29920 2158 2889 1869 19815 2519 -8995 -7821 16084 4978 -6541 29627 39152
6557 39152 17439 -1277 3338 18269 14863 8250 -10673 -57034 -82663 -80685 -49365 -29359 -14931
6544 -14931 -14134 -14761 -20247 5950 12354 28328 33949 19794 18363 23167 28036 27756 11978 5550
6530 5550 12668 7991 14126 542 -15674 -10482 -8418 16265 22332 21492 55368 61704 35485 -13576
6516 -13576 -28405 -18807 7791 28588 45938 41372 37806 32830 13870 -2911 830 22378 17334
6503 17334 5230 27245 22329 24851 52634 71344 63403 43847 55350 79968 68360 12982
6491 12982 -282 8159 -935 10607 46355 70328 31576 11919 37449 26863 -3587 -18670
6479 -18670 -5329 -19402 -33551 -37932 -24192 -12771 12613 12685 -12502 -32206 -23652 -1837 13854
6466 13854 21290 45500 20087 13086 -338 -17595 -15944 6569 38305 42825 42802 33504 4894
6453 4894 -18304 -15642 -3202 -7343 -8284 -7034 -23633 25 25502 30873 41768 48165 50293 21117
6439 21117 14830 21719 7736 -20670 -38702 -11277 22232 -1455 -2920 19166 29295 30451 13459
6426 13459 -2971 11540 44568 36555 12566 28218 40200 17010 -16331 -13374 -1771 7792
6414 7792 22763 44730 44412 17950 -8739 7940 -5044 -1896 1506 23900 41972 14694 18676
6401 18676 38398 38633 272 1486 12482 36928 58317 46686 24668 19497 15292 -4865 -19673
6388 -19673 24507 19982 5370 14847 23910 29618 -944 -11371 -24349 -30559 -21964 6859 2808
6375 2808 -14416 15337 51706 39233 37502 12628 2195 5586 2001 -3363 -21441 -41051 -19102
6362 -19102 6978 21987 16297 15759 338 4483 24086 18640 -21404 -24012 -19407 -23593 -45048
6349 -45048 -63078 -32999 -26377 -25990 -6747 -2861 16039 39607 65370 35774 9823 -8931 -34597
6336 -34597 -36435 -26255 -37775 -23021 -9892 -11707 -26855 -20392 -12070 20813 24576 21536 13190
6323 13190 -1293 2327 -756 5909 10171 3292 -19109 -22545 -22509 4060 10510 12504 -1330 10560
6309 10560 34233 38411 19736 -6458 19741 21869 11590 49799 46716 2587 -12136 -11106 -24356
6296 -24356 -29245 -39966 -7335 36783 34421 21746 15582 26478 36716 45510 18313 8762 -10078
6283 -10078 -26810 -41299 -53404 -4306 13034 19085 20882 7611 -660 -47042 -58783 -29144
6271 -29144 1740 8039 10408 -5031 -19148 -38427 -54944 -25503 5801 20575 48906 35370
6259 35370 -19842 -6438 9754 -27207 -41694 -14371 25681 36291 29545 17899 650 -32461
6247 -32461 -23712 -8128 -22997 -39723 -44260 -37695 -33294 -19427 5468 -3583 -24569 -2002 9295
6234 9295 -856 -29317 -33746 -49900 -26015 21693 52052 59948 80809 77958 29091 7785 -505
6221 -505 6104 9871 2505 -9120 -10458 -21697 -37335 -49145 -54978 -49206 -62835 -47619 -20119
6208 -20119 -4116 11779 -18359 -23764 -17961 20135 33650 -316 -30523 -35802 -16530 17601
6196 17601 29446 6340 -9982 -20483 1460 42712 29168 11791 -6240 333 -4662 -24854
6184 -24854 -35617 -14730 -8969 -9417 -20514 7231 47592 55659 49021 37081 26684 51968 50837
6171 50837 34039 22271 6638 -35308 -58190 -54565 -17984 -2975 16148 24431 13557 645
6159 645 -3233 19190 28020 -3974 -28572 -9103 10144 -273 3793 30692 28048 -1985 -13061
6146 -13061 -6347 -32609 -61407 -32210 -23232 -13556 -16488 -5537 -5279 -4443 1282 -37427 -18236 -32615
6132 -32615 -54457 -40175 -20863 -5284 -32 10285 12471 14107 41397 43247 21469 -39605 -51108
6119 -51108 -29410 -284 17132 26361 45309 37114 2205 -20191 -22180 -618 12840 -148
6107 -148 -13145 10249 16436 1747 -19668 20337 51841 61260 60352 62973 44941 32399 7119
6094 7119 3319 -28360 -38378 -17496 -2719 147 19720 17206 4062 17685 -6037 659 -39955
6081 -39955 -38686 -44970 -41538 -32280 -47646 -38719 -50901 -55360 -51110 -42927 -30716 -11753 -34205
6068 -34205 -32168 -10783 -6928 -6803 3964 371 10587 33151 42719 35131 24038 36652 33922
6055 33922 2127 -11128 -29510 3581 5958 1220 -10199 -22267 -31903 -18121 -14508 8382 33577
6042 33577 53285 33648 16201 17492 -4437 -15062 -17863 -24114 -31380 -25055 -318 6792 -17187
6029 -17187 -10402 -44241 -65099 -43078 -31498 -13511 2762 -275 -13269 -2400 35407 36312 37291
6016 37291 36917 32035 34789 27838 -443 6088 -11828 -24540 -11879 13426 36765 12036 9849
6003 9849 -3474 -11360 -27471 -15905 -37634 -31618 -18105 -28812 -39268 -37432 -32337 -24260 -2557
5990 -2557 23343 19959 15338 -17192 -15848 -4791 13724 18820 -7996 -30469 -29177 -6334 -19821
5977 -19821 -43259 -43180 -34569 -17677 -4534 -28315 -49004 -24589 2977 12614 -7114 -18179 -18513
5964 -18513 -32099 -19139 -20723 -12619 13847 -1016 -8144 -17519 -37060 -24913 -20377 19592 15395
5951 15395 22030 24442 17667 29029 26719 21509 -11972 -14759 -7883 8906 28745 27418 15988
5938 15988 -4552 -14125 -7961 -35099 -35316 -10806 370 -6017 -23507 -15785 -37892 -72042 -48828
5925 -48828 -11508 9168 -15532 -39205 -21432 -28926 -56269 -71739 -71948 -29676 -9907 -20024
5913 -20024 -14383 8376 -11938 -48145 -56822 -31761 -26119 -27318 -45460 -56024 -24949 -12802 -10311
5900 -10311 1791 32330 50673 40321 185 -14770 -4235 -737 17592 21746 14723 932
5888 932 2977 7214 9971 25680 54345 34060 20991 17905 9587 -5519 919 6301 9878 -26987
5874 -26987 -61810 -61016 -30321 -20392 -33648 -23279 -4853 -15552 -8908 11160 17566 8909 2744
5861 2744 11457 10439 4471 11509 9319 -18412 -35744 -18720 -14550 -17785 -9623 -3123 -8283 -11772
5847 -11772 -14345 -39700 -59203 -29239 -30586 -23008 -13357 -13244 3712 -19113 -29371 2046 1205
5834 1205 -11932 -22086 -37716 -47535 -62230 -65897 -34385 -32217 -39349 -15130 8211 6518 25908
5821 25908 15446 -9635 1632 9425 -2814 -11660 -8812 1534 16033 6603 -19674 -24341 -3472
5808 -3472 9875 2720 13328 19846 9643 14307 32498 65531 54083 31993 31362 26112 45998
5795 45998 46452 2928 -22755 -12672 36301 37694 -9765 -5856 1498 10634 24648 21637 24122
5782 24122 24215 8074 9603 821 -10072 -13159 -16361 -16083 3634 -18273 -10725 -464 -40339 -84390
5768 -84390 -90156 -75169 -46595 -43708 -50290 -72344 -51560 -5734 5338 -8313 16018 49448
5756 49448 7271 -6237 29400 47207 53467 30810 23076 28418 12148 -14382 -52183 -30018
5744 -30018 -7192 -13111 -10564 -1607 5352 15074 19955 26732 35709 26076 40853 62045 48390 5052
5730 5052 -9265 -18985 -23805 6187 -6359 -4449 10252 951 -4689 -843 -14198 -24509 -16983
5717 -16983 -37424 -53778 -59124 -26897 -28269 9754 15941 -12789 -23293 -19061 -15165 -13501 -1232
5704 -1232 -6707 -7664 -9155 -5102 -28425 -61752 -32840 -2644 12289 19653 21193 24039 6776 -18837
5690 -18837 -31212 -23673 -37156 -4768 27670 6482 5901 27210 19540 34166 48907 31945 5744
5677 5744 -8875 -10871 -5905 -8489 -6397 16438 11268 -30205 -55923 -40476 -27749 -1097 7370
5664 7370 -115 -14664 -22948 -56431 -46446 -18879 -1496 19221 -10434 -15698 -23994 -29274 -36060
5651 -36060 -50502 -46272 -48647 -41293 -15067 9253 -4466 -5152 -1636 -12537 -27541 -27791 -14964
5638 -14964 -4315 10419 -3368 -24657 -31671 -28852 -11983 1719 -17146 -46891 -50434 -36824
5626 -36824 -41418 -42940 -45325 -37500 -30261 -7936 -2508 5812 38976 10057 -27945 -37023 -11471
5613 -11471 17702 15495 -15135 -9709 15095 -5484 8106 25065 44602 17380 5751 9962
5601 9962 927 -10410 -1332 -4127 -24485 -41562 -27380 7790 18653 19641 22901 -3387 -8214
5588 -8214 -21099 -29827 -26518 -8765 -7498 -7144 -8022 10658 4430 -34337 -53850 -59578 -68631 -36823
5574 -36823 -27416 -28839 -7570 -4812 3750 16889 11826 -16862 18684 26842 24734 28763 33434 7940
5560 7940 7888 -11617 -2156 5192 3054 1578 -17822 -14426 16577 7540 21372 30559 -744 -30510
5546 -30510 -43902 -54704 -13349 33813 34724 33144 22327 -5201 -3519 4869 6544 11678 -14757
5533 -14757 -7476 36 19780 10576 -3504 3480 8913 4786 -10833 -19218 -26389 -27005 -920 21989
5519 21989 46687 35947 14293 4658 1601 -1181 -27579 -14676 1934 -23808 -43990 -74281
5507 -74281 -75458 -55813 -32165 -19220 13997 44664 33850 1335 2478 1087 -20414 -24531 -30484
5494 -30484 -18353 110 21237 32131 29084 16689 10819 -1455 -41705 -44766 -17150 -584
5482 -584 -14725 -19542 -17083 -20539 -27122 4580 28500 29904 27731 -7065 -35426 -34767 -10437 -12031
5468 -12031 -7671 -30676 -34281 -15390 -1101 2440 19553 26771 24233 37494 24191 -7515 -28004
5455 -28004 -42923 -20058 -20522 -43284 -59069 -33902 -15210 -15005 -26436 -1629 -10596 -6515 11332
5442 11332 24305 21023 -6651 -28138 9650 2749 -14290 -702 6755 -443 -14536 -22580 -17241
5429 -17241 -8742 -34313 -10617 -14684 -21867 -23593 -9316 21338 8387 8772 13728 -1818 20972
5416 20972 54613 40005 -2619 -8832 -22141 -24164 -3305 2401 11365 36688 13737 -8458 12246
5403 12246 3922 -11492 -23267 -32522 -40151 -25305 -11924 -21133 -20484 -23791 -11812 -10150 -554 -4880
5389 -4880 22291 11300 22529 13590 8443 11566 -8051 -18284 -16211 -23717 -32551 -32713 -29440 -11177
5375 -11177 -13009 -19448 -10673 -43708 -69423 -67513 -80075 -69624 -31072 -34469 -28508 -30168 -41572
5362 -41572 -19745 -3964 2012 -7319 -21183 -27292 -14783 -5832 -23221 -14483 -29821 -19557 3770
5349 3770 15134 -3997 -11640 -14647 -25159 -25773 -18688 -26171 -67525 -50600 -26486 -14507 -14774 -7559
5335 -7559 -69 -7483 -12370 -17793 -45825 -36205 -11635 -25055 -29934 -29832 -58918 -89122 -80062 -26080
5321 -26080 -7666 -18830 -21633 10309 12258 -10562 -21932 -39665 -24230 9375 11026 -24375
5309 -24375 -41524 -10759 -10288 -33437 -25693 -20618 -28594 -38964 -16315 5095 -6065 3445 18727
5296 18727 27776 -3859 -49964 -36228 -8677 -10804 -5491 -16827 -28567 -6648 16896 13957 -11089
5283 -11089 -10890 18397 22748 22045 16126 27430 38647 27917 45907 47219 22947 -3567 10320
5270 10320 -321 -766 -4313 -2660 1026 -6955 -24217 -46328 -60728 -70461 -32133 2553 8125
5257 8125 16664 39600 42413 18808 11016 -16485 -31730 -33519 -22253 -24928 -24291 -3787 -20505
5244 -20505 -33357 -38649 -55138 -43504 -14580 -2752 -24581 -4853 10757 15979 10133 -1307
5232 -1307 9888 -5878 -13192 -6738 -10794 -26135 -29532 -28502 -35832 -34981 -28338 -14878 -27766 -15550
5218 -15550 -18083 5610 12139 7559 10457 -349 -31503 -37635 -41781 -33074 -9152 20782 20696 -568
5204 -568 15993 22900 -2568 -2699 19186 30138 13942 -1004 -2572 13368 45507 34675 -14381
5191 -14381 -20944 1199 10820 -2065 -7351 6774 -8193 -13896 -9452 -16321 -5172 -10933 -24161
5178 -24161 -3740 49014 77895 67491 38638 34961 36541 22392 14559 26891 29684 40052 41726
5165 41726 31375 5231 -43449 -73774 -74351 -42263 -34770 -22283 -21968 -12551 -20093 -26547 -28138 -33744
5151 -33744 -16781 8657 33060 13268 -15212 -9932 4736 27728 19174 22169 44807 31561
5139 31561 50294 68403 49496 6852 -25473 -42492 -16498 22295 24318 13631 1840 -20275
5127 -20275 -4793 9064 -14036 -2221 2968 -27708 -46212 -40251 -20237 -13521 3411 4938 -14108
5114 -14108 -19125 -6773 -18347 -23175 -6306 -6734 -9204 -9975 -20773 -41744 -49169 -52410 -39399 -37147
5100 -37147 -47100 -44605 -26529 3094 10352 -12041 -32981 -12524 -25899 -62486 -52678 -25378 -19965
5087 -19965 -21525 -25003 -21195 -25555 -3139 4057 34020 46414 23334 18341 -3088 14159 29608
5074 29608 38800 14544 -37872 -65907 -63083 -72682 -63357 -44141 -55894 -61336 -66100 -48915 -28685
5061 -28685 -39604 -36545 -31758 -10159 2435 -7642 -15051 -23618 -37717 -56083 -31492 -1360 -1527
5048 -1527 17684 10641 12524 24469 25980 -9317 -32501 -29253 -19842 -47520 -65651 -46514 -11928
5035 -11928 -7151 -42308 -39875 -15659 2806 1534 6627 27653 25498 1022 -9921 -25811 -54727
5022 -54727 -67727 -60919 -27470 -8067 1282 -32856 -40165 -17761 -28412 -36300 -49889 -68234 -59800
5009 -59800 -39769 -26456 -40882 -35717 -23410 -13079 5762 7788 -10817 -11861 -2960 13309 -2458
4996 -2458 -10252 -16640 -22594 3668 -25122 -15014 -9621 -14870 -18227 -28845 -18339 7359 -7214
4983 -7214 -11091 7982 13365 -12257 -5947 -6272 704 17065 24863 -7629 -40234 -39560 -43459 -55463
4969 -55463 -30076 16483 21845 8139 19971 18626 22372 -3270 -1152 -1834 -3417 -19978 -7914
4956 -7914 8061 -4389 -18975 -8449 8338 -8985 5219 11598 6949 13338 -31743 -45886 -31632
4943 -31632 -31780 -49756 -46697 -42296 -65391 -70916 -74120 -25196 30247 51126 49847 15968 -15026
4930 -15026 -125 8405 1970 -26624 -60560 -64496 -37532 -18394 -18676 -5743 14814 4285 -27361
4917 -27361 -17831 4852 10409 6398 -23886 -43965 -56898 -58079 -48069 -17344 2417 -1338 -15347
4904 -15347 -10667 -19903 -12649 -25495 -32127 -10470 12004 22424 6471 -17980 -43643 -45795 -56263
4891 -56263 -74175 -74127 -57677 -51639 -72893 -38998 -6083 -28554 -26831 -16962 -13298 25763 25672 15063
4877 15063 -9610 -5185 -22203 -24948 -29761 -44869 -43922 -28254 -38928 -44784 -36656 -57277 -36392
4864 -36392 -36366 -26387 1003 3665 -7223 2098 11375 -1814 19848 7187 -11083 -24239 -8632
4851 -8632 -8544 -14286 -29403 -39927 -40093 -38315 -50308 -61348 -59226 -21308 -12626 -20248 -17838 -19068
4837 -19068 -12496 12288 5674 24048 18491 -9067 -19392 16706 23555 42634 53431 27154 2983
4824 2983 -2409 37914 27704 10440 -14523 -2001 12014 -6541 -42986 -19921 19305 45481
4812 45481 62126 35671 3625 -12080 -683 -15880 -32269 -5339 30959 39452 -8005 -44931
4800 -44931 -28884 -5066 -19921 -5345 -4765 9926 -5107 -452 -6449 -38700 -56457 -52089 -36532
4787 -36532 -8849 11405 26325 22035 18074 -6500 -19800 -10130 34347 15035 -24292 -27221 -7766
4774 -7766 8022 22371 10022 -13061 -14601 -16434 -4370 15314 12997 -7890 -24242 -45449 -43493
4761 -43493 -4079 16788 -18752 -34900 -42818 -54885 -18510 -3380 -12777 -30828 -44898 -36740
4749 -36740 -38824 -69818 -42076 -52 32992 25955 4921 -6668 -11178 -11587 -1421 14005 19083
4736 19083 23105 29994 32420 13584 8402 19076 22172 16301 2722 6986 2172 -22977 -25331 -33422
4722 -33422 -40512 -38474 -22845 -49192 -58779 -15921 5454 16308 -27226 -31921 -8744 -16669 -4863
4709 -4863 9721 11973 -2242 -18130 -27337 -30146 -32146 -23352 -15045 -25030 -32571 -8077 -12810 -24838
4695 -24838 -11948 -24870 -37019 -35119 -27652 -48559 -65023 -27175 -6033 -15753 -18721 -31839 -32060
4682 -32060 -19282 -1139 -22475 -36033 -36379 -39966 -33928 -42164 -40799 -19503 -9157 -4660 16914
4669 16914 21099 -8533 -27120 -20964 -3692 14738 19520 4727 8705 11130 5338 -7418 -851
4656 -851 29561 12285 19232 54896 48617 18089 26289 23492 -2956 -10941 -9579 -560 -13230 -37221
4642 -37221 -14908 -26246 -20218 15776 11623 -395 -9410 8490 -7079 -40727 -38248 -34964 -14388
4629 -14388 -23864 -26122 -32081 -25747 -35287 -16409 32196 7852 -41387 -36941 -41474 -43297 -20182
4616 -20182 -27970 -12727 1900 -6538 5097 28044 2578 -11668 -9736 -18141 7909 11245 -4678
4603 -4678 -33584 -36346 -38719 -15441 -56833 -89619 -81875 -57464 -51394 -67240 -71621 -62269 -45029
4590 -45029 -37275 -37551 -39759 -21186 -11465 -38260 -46726 -36174 -48134 -45860 -30481 -15128 -47767
4577 -47767 -66256 -26796 -20389 -3528 642 -19998 -49433 -44209 -33074 -33748 -5908 -657 8268
4564 8268 -5911 -15411 -8025 -11045 -31673 -25883 -15699 -10033 -27656 -6739 -16326 -40132 -52443
4551 -52443 -54423 -20431 -20319 -12235 -30012 -26985 -18992 -4456 4555 5968 -10049 -18187 -30142 -6105
4537 -6105 19942 -2340 -27549 -30574 -24100 2488 39011 16209 -21944 -24808 -30529 -12270 12793
4524 12793 21462 23245 4156 8603 18253 27210 12640 2160 744 45669 38084 18592 25200
4511 25200 15741 5212 10594 -143 -14326 -5690 -5602 -5387 3327 -17519 -658 34835 43558 17855
4497 17855 -11034 -20614 4530 13964 556 -6628 -15122 -24360 -31113 -12939 -795 -10917 -244
4484 -244 3634 -6322 -31448 -35599 -37058 -20944 -18834 -4633 -10759 -43635 -39208 -22752 -2913 -12979
4470 -12979 -22042 -4381 -3169 -32505 -33226 -22155 -9611 -16956 -35214 -56878 -27068 -10616 -30436
4457 -30436 -47017 -45947 -47215 -15680 9851 23 7691 14114 4475 -10453 -23880 -10030 -23653
4444 -23653 -28597 -20444 13138 23364 -7183 -43542 -51846 -36781 -10242 -29102 -15633 17067
4432 17067 27406 4650 8164 12226 1121 -22615 -4750 15695 9212 973 -3060 -1692 -2868
4419 -2868 -13171 1918 10572 9185 644 13734 1396 -31217 -51022 -51776 -33925 -36752 -41044
4406 -41044 -2229 12793 25580 40796 48750 6704 -26778 -3748 11120 412 -738 12950
4394 12950 8093 -13675 -38937 -46545 -26167 -12855 -22702 -44106 -58988 -54068 -45657 -51365 -49025
4381 -49025 -39280 -48662 -40260 -18921 -2584 -36929 -63189 -74889 -67695 -53638 -36358 -44506 -63791
4368 -63791 -52643 -44244 -27951 5895 -3088 -19589 -21456 -29366 -35132 -517 31503 40791 180
4355 180 -19660 -23267 -27163 -34934 -20705 -14649 -28143 -11832 -11560 -25894 5328 14164 23079 -4335
4341 -4335 -4852 -3049 -651 -28450 -12654 -16653 -15971 -28770 -50067 -39835 -30641 -34189 -28348 -2946
4327 -2946 -31567 -17252 36303 37131 -8064 -15800 -462 -134 -4444 -200 8847 22180 17818 15027
4313 15027 30835 20999 -17440 -42501 -55608 -57653 -31445 2229 -9027 -25529 -1090 24736
4301 24736 1213 13109 9115 3988 -8352 -22408 -11635 6647 18872 16789 9248 6961 -6232
4288 -6232 -17609 -29134 -33070 -45983 -28130 -231 -5338 -27866 -5599 -4506 -30839 -42305 -21732
4275 -21732 -282 2597 -10762 -23257 -4954 -9781 -8232 -17682 -42178 -38043 -32149 -36585 -34443
4262 -34443 -15190 -6791 -720 13055 12853 -3128 -9324 10548 2576 1651 7185 -8212 -10582 -23862
4248 -23862 -16851 -1656 -25192 -44117 -31535 -49870 -29433 -22145 -21700 -3913 -4781 -10175 -3623
4235 -3623 13668 6691 3291 -7461 -30505 -35276 -8837 -8001 -39690 -38042 -26318 -18006 -40593
4222 -40593 -46547 -39230 -22237 -30618 2651 -20444 -53754 -39399 -13970 -26237 -32868 -45065 -37509
4209 -37509 -30473 -17004 -26851 -58130 -46348 -22833 2119 7825 -17532 -32447 -16030 13245
4197 13245 30611 41845 45468 27113 -19139 -28202 -41127 -31570 -25140 -18072 -16578 -26768 -39946
4184 -39946 -15563 -19573 -20620 -19800 -11880 -8743 -36819 -34384 -17153 -25188 -28073 -3252 9880 4246
4170 4246 -12149 -33086 -32222 -19145 -7018 1179 -18721 -24793 -18016 -41118 -38602 -37467 -44456 -27866
4156 -27866 -13863 -13619 -7270 -549 2485 2567 1911 1182 -10318 -21517 -35379 -39540 -59306 -42072
4142 -42072 -22048 -5476 -28330 -32710 -25960 3516 13447 -7839 -24561 -11020 12814 -12618
4130 -12618 -28026 -5783 12695 -6102 -23930 -40008 -37071 -28532 -16858 -11856 8170 -14407
4118 -14407 -14340 8876 20450 -13289 1904 13229 10055 -9221 -17486 -10766 -8517 -26497 24168
4105 24168 64964 27692 6324 -626 10856 -6208 -47511 -60238 -55894 -28775 -33533 -29312 -6934
4092 -6934 -18280 -39074 -6425 -4769 16517 23961 2525 -827 -19819 -27227 -3966 786 -7405
4079 -7405 7273 15517 21863 19480 8138 -9099 -5278 21382 -3227 -20994 -16359 -9944 -19101
4066 -19101 -54900 -33453 -6548 -50837 -70794 -62949 -23102 -30755 -29874 -23702 -32282 -70554 -44226
4053 -44226 -11542 -15318 -34428 -33171 -31333 -17402 28372 63969 59548 6217 -13742 -18163 -13351
4040 -13351 4823 6922 4101 23478 10954 -17091 -4999 33281 23537 -16074 -21966 -7015 2348
4027 2348 41480 49998 20096 14582 -22087 -33556 -12284 -13188 -11641 -38851 -45406 -43905 -29868
4014 -29868 -3743 1792 -21163 -36436 -14138 -8719 -4422 5979 22159 37347 20266 3733
4002 3733 -21594 -26413 -20905 -43173 -35693 -21600 -3389 26572 35680 50006 35604 -1501 -21640
3989 -21640 -47674 -74626 -48995 -22498 -14186 -18942 -4964 10914 26565 3264 6279 37348
3977 37348 20556 33546 44593 40816 3911 -21269 -32440 1153 1205 19889 15184 24858 18106
3964 18106 10859 6505 -13570 -26325 -31398 -30196 -35084 -58882 -40079 -32746 -24033 -11542 -342
3951 -342 -3301 -12869 -24361 -28786 -30562 -35317 -63758 -72829 -36081 -14147 -9203 -21163 -28381 -23343
3937 -23343 -57821 -59866 -13893 25046 7456 -10776 -2808 -14282 -48660 -61503 -41082 -44367
3925 -44367 -63739 -44042 4619 -1138 -10121 -17386 -49827 -61043 -34407 -23467 -12644 -39051
3913 -39051 -44245 -25467 -8846 -5530 -44460 -65616 -64972 -54074 -38356 -12552 -2232 2264 15068
3900 15068 -602 105 9284 -6386 -4925 -14755 -23257 -28467 -9512 -3826 -11764 -14905 -32261 -34366
3886 -34366 -38970 -54470 -79487 -94695 -77699 -50733 -31430 -30035 -38558 -47225 -42346 -21466 2989
3873 2989 8937 23614 20777 -7010 -8359 10695 9985 -26677 -40334 -31012 285 22657 13882
3860 13882 2337 -5682 -9063 9219 -7144 -6254 -20874 -35820 -54469 -21727 -9191 -3722 -12397
3847 -12397 -37090 -25710 -7095 -8329 -24848 -38142 -52347 -51080 -44052 -42000 -53478 -40680 -5307
3834 -5307 -115 -12962 -42546 -28107 -4162 -2069 4945 37044 31570 29517 41930 28545 1175
3821 1175 -9739 -23119 -7045 -1787 -18053 -34771 -52306 -54179 -23746 -25897 -34358 -22458 -12288
3808 -12288 -26142 -47336 -56480 -57835 -39580 -13673 2960 24891 7098 16028 41247 42738 32412
3795 32412 35129 4515 -2929 -3882 -8168 1732 10452 3576 9136 22854 29988 38768 39875 29895
3781 29895 11312 -6320 -31445 -6613 8006 -4947 -13236 -20828 -8106 15295 23946 20321 14394
3768 14394 -1744 25412 46671 37235 22954 10758 5205 -9959 -14672 14 18666 29896
3756 29896 25852 4385 -22314 -30422 -20639 -30241 -13575 30983 4037 -36239 -61216 -56098 -42531
3743 -42531 -26681 -16026 -10210 -1144 -11036 -16696 -7792 -29235 -21984 -6939 1835 -22667 -37496
3730 -37496 -36477 -565 6656 -13609 -27430 -44503 -31597 -18202 -20813 -1830 -18406 7395
3718 7395 -23158 -49479 -44241 -35936 -37412 -56986 -32992 -28210 -18766 -18819 -26669 -8335 -10084 5443
3704 5443 2435 -7931 -20080 -33667 -50930 -53472 -46043 -6808 -3315 7373 6893 -3380 -28184
3691 -28184 -41583 -61508 -88637 -70613 -20421 -9788 -13349 -27721 -39620 -30230 -36689 -12641
3679 -12641 2155 -5030 -1653 1992 7129 16213 6580 -9406 -23730 -18036 9822 19002 3644
3666 3644 -28793 -41564 -46435 -22100 -8516 -1641 -16323 119 -14423 -41839 -66211 -43242
3654 -43242 -47074 -45388 -28778 -27844 -32652 -3123 -4788 -45471 -41506 -42519 -40565 -40028 -36672 -39527
3640 -39527 -52588 -58083 -27425 -18192 -658 7840 -15134 -12019 -18933 -31876 -43567 -44536 -9936
3627 -9936 3923 8538 235 -19510 -21316 -20816 -10480 -16199 -55935 -57815 -8445 6588 9076 -5108
3613 -5108 10296 23519 27807 -2996 -31373 -26840 -1277 10238 21702 57426 60037 30848 19962
3600 19962 23100 23792 22708 39118 35427 22560 12419 26576 13674 28704 32267 34496 20727
3587 20727 35921 39683 18299 -16112 -35115 -26558 -37366 -25570 -25342 -55349 -47596 -33621 6013
3574 6013 9165 -17411 -21946 -10423 6255 -18157 -48463 -54455 -32986 -30501 -30247 -9417 6785
3561 6785 -1993 -25871 -26795 -28557 -61290 -72656 -65888 -55076 -50474 -28494 -44683 -43054 -33644 -18571
3547 -18571 -14763 329 27348 47979 39609 36306 68342 61196 38720 16006 7223 15447 9185
3534 9185 -25423 -46805 -24273 12272 37565 24185 -17353 -39470 -18623 -25436 -38495 -23155
3522 -23155 -654 -17351 -16290 -12294 -13419 8849 19399 6154 21732 24103 18494 5370 -19868
3509 -19868 -29469 -16405 -8460 -31719 -11679 -3381 -4665 16150 18125 -3587 11542 6906 -5928
3496 -5928 -17439 -31289 -40141 -38540 -24502 -20987 -26353 -24540 18046 22906 -12641 -45170 -49659
3483 -49659 -29099 -16194 -2887 -22829 -45831 -35347 -28868 -19020 -18229 -11473 -3925 -12627 -39469
3470 -39469 -47948 -38728 2582 -2064 -815 -18618 -42853 -30224 -46320 -36046 -20758 -6899 -9270
3457 -9270 -38082 -26720 4257 10248 4486 -7792 -6296 7682 -7159 -13459 -17253 -19113 12293
3444 12293 30176 21763 11846 7256 17374 27819 39469 29851 23618 16893 2932 9463 6228
3431 6228 -18226 -2485 5068 -14518 -21336 -7814 -3648 4148 21059 15005 -4556 -28786 -24421
3418 -24421 -25807 -33460 -457 16501 -1655 4315 -10680 -53197 -57748 -37140 -16899 3291 25379
3405 25379 23172 28044 2035 -24267 -11585 22464 -1923 -2823 -3807 1629 5910 3288 -22886 -29443
3391 -29443 -51622 -53980 -44919 -42040 -21539 -12707 7443 2769 8928 19779 32381 42842 14469
3378 14469 -9449 -8153 4399 6112 -2173 17058 20472 4377 -22951 -52477 -48574 -53730 -51861
3365 -51861 -14377 -3420 -12644 -23013 -43925 -46063 -28676 -28737 -38295 -23762 -23158 -23657 -25824 -17084
3351 -17084 -17766 -1374 -15947 -1536 -5113 -26473 -10213 -20351 -34447 465 31375 23268 16250
3338 16250 22946 35588 44774 8821 1223 7279 -8655 16342 41731 21738 -8404 -9148 -21926
3325 -21926 -26799 -14208 -14712 -28545 -23388 -34012 -46720 -46510 -17680 -10137 -8028 13839 21489 34673
3311 34673 58661 64389 64698 43255 9618 -36028 -1302 3505 3068 -644 -25897 -35982 -24822
3298 -24822 -30593 -19324 7252 22665 25502 36621 34852 864 1458 -8000 -16152 -11437 -2297 32136
3284 32136 10257 4749 2151 -22821 -51332 -57969 -44585 -33398 -34562 -3918 24575 20039 -2256
3271 -2256 -2203 2614 -21778 -16796 -19352 -33564 -42231 -41812 -28720 -36222 -34093 -37851 -63140 -44013
3257 -44013 -6552 2411 -17791 -30689 -26906 -14608 -31672 -19621 33335 42987 18375 -1171
3245 -1171 -2689 -7490 -24007 -19824 -36234 -50082 -16641 24229 31728 32222 43915 39492 -25910
3232 -25910 -66458 -71655 -51407 -13860 -3316 -15671 -8806 -22278 -20595 -10294 -5704 18018 41356
3219 41356 33640 15842 12514 3469 -10864 -11007 -124 16105 -1349 -12704 -25311 -28661 -8656
3206 -8656 14854 1213 -18363 -37258 -28310 -1777 3334 -7094 -46076 -55275 -20426 -25493 -27861
3193 -27861 -28398 -37305 -31378 -48588 -44802 -44284 -25297 -6765 -7037 -31012 -28182 -31127 8485 6492
3179 6492 3037 4953 -7986 -32090 -29401 1345 4682 -5951 -34257 -32670 -18538 7122 -2703
3166 -2703 -23201 -39259 -30101 -24104 -17988 -22543 -15991 -32158 -10197 48080 50745 21668 8457
3153 8457 -6711 -3254 -6482 556 -15313 -34645 -18363 -24112 -29954 -6904 -4724 -14294 -40043
3140 -40043 -14750 -23328 -45634 -51441 -43985 -54212 -60252 -57599 -39720 -16322 -34962 -39987 -24884
3127 -24884 -45228 -52335 -45661 -34542 -25043 -34020 -24539 14940 40171 30813 20749 19529 21100
3114 21100 2248 -25144 -35085 -25904 -36441 -37904 -63144 -60054 -55302 -58882 -52205 -52537 -50766 -32125
3100 -32125 -30074 -28280 -16168 -39030 -37532 -42824 -44935 -43995 -20331 -11452 -37210 -36483 -3838 12809
3086 12809 9853 -11610 -10627 -24619 -17291 -25978 -30917 -20601 -19160 2996 6982 -144 12077 -2262
3072 -2262 -16315 12670 29582 21914 -5208 -345 8824 26269 35217 -7775 -34804 -17580 18567
3059 18567 15918 -3496 3434 26572 23884 22007 12083 -15732 -34344 -16876 1088 14274 -5988
3046 -5988 -8517 -19291 -49679 -38408 -26684 12514 7333 -5359 19395 27775 29517 56130 53754
3033 53754 38139 22034 -10675 -13005 -12648 -10756 -183 -3510 -25132 -28444 -34083 -20883 -23501
3020 -23501 -28527 -9607 21227 21099 -20513 -12943 -9705 -1139 -5416 6194 23391 12145 2215
3007 2215 -4307 -19531 -33282 -21293 -14282 -27316 -36496 -41740 -47005 -16489 -16490 -39301 -74629 -77231
2993 -77231 -61554 -38868 -9421 18275 18501 37656 21568 -1937 -29919 121 10295 -18284
2981 -18284 -21760 -38473 -13321 13645 15366 26771 7335 6109 -7840 9626 14016 3378 21864
2968 21864 9406 -16557 -9688 -35923 -39925 -1889 11226 -4592 -2177 28955 31827 13497 -9003
2955 -9003 -16287 18612 41138 43264 39947 41833 28869 5594 -7152 -23046 -30053 -51595 -61978
2942 -61978 -74022 -56825 -29877 -31663 -46833 -46287 -19748 -3962 1616 -11541 -16453 -143 -4084
2929 -4084 -2116 -16786 -25029 9306 32539 14382 -44102 -51330 -49036 -52490 -13008 18390 5779
2916 5779 -7483 -25248 -12618 -4376 -14766 -26330 2615 6465 8373 -6847 -37288 -53170 -19447
2903 -19447 20312 25521 23906 -14843 -52487 -50731 -47992 -23369 -17921 -11433 276 -21603 -32862
2890 -32862 -5785 -10934 -29820 -22794 -18133 5137 4453 -10598 -14038 4321 11924 -26268 -13697
2877 -13697 7171 19277 7787 -13094 -10306 -5999 -20203 -55047 -66904 -55451 -47657 -58236
2865 -58236 -47060 -38439 -30448 -29266 -21877 -21685 -27351 -20093 -11594 1707 -18748 -17911 -15318 -13554
2851 -13554 8034 17216 22378 29302 45948 18264 -11070 -18471 -1061 21604 18931 8047 26095
2838 26095 25451 15171 -6905 -17675 4939 18204 11987 -26533 -41804 -22085 -8876 4855
2826 4855 41811 51379 46459 46210 37625 7611 -19329 -24396 -13581 8388 2592 -32489 -44066
2813 -44066 -29949 -15765 -37618 -59289 -44080 -10457 -23839 -34019 -29184 -30162 7259 16695 13792
2800 13792 -22986 -54021 -16870 20185 14241 22996 23535 -4816 -36447 -33609 -14278 -25440 -12164
2787 -12164 16821 1575 -19533 -25948 -26733 -42954 -53272 -43542 -8614 -15387 -10469 -8260 12410
2774 12410 3506 -27733 -20694 -18400 -11133 -35706 -45929 -27675 -13040 -38445 -28021 -16162 -1335
2761 -1335 -19486 -16378 2480 -11855 -17420 -10289 -3095 -28160 -21326 -6958 9238 30941 18868
2748 18868 -8049 -27673 -15453 -23005 -21272 -31262 -34384 -10934 -14277 -2559 -26373 -21790 8378
2735 8378 -6672 -29123 -24498 6332 3647 -2754 -25332 -17218 -18758 -15965 -1856 14438 14500 6785
2721 6785 -4792 -20876 -21227 -14762 -8715 -33396 -57494 -50915 -39819 -12761 920 13699 18160
2708 18160 -23908 -43337 -30588 -17806 -20519 -8701 -16753 -8701 3516 8766 15716 17200 -8280
2695 -8280 -10586 -22519 -31965 -29460 -19466 -21873 -20189 -26909 6879 -22825 -41638 -15484 9157
2682 9157 26082 47722 70787 66988 40893 8425 6654 27758 30255 36457 33250 54255 9824
2669 9824 -35953 -51419 -36029 -13329 -1523 -22540 -19706 -19649 -32006 -18046 -19235 -23925 -22786
$$ [...]
##END NTUPLES=NMR SPECTRUM
##END=
