##TITLE=Analysis number 329658
Compound Code cc 66746
Book Reference 528/64
Project Code adrs
Chemist Name davee
##JCAMPDX= 6.0         $$ Bruker NMR JCAMP-DX V2.0
##DATA TYPE= NMR SPECTRUM
##DATA CLASS= NTUPLES
##ORIGIN= Bruker BioSpin GmbH
##OWNER= nmr
$$ XWIN-NMR		Version 3.5
$$ Fri Sep 21 10:06:45 2007 GMT Daylight Time (UT+1h)  MAYBRIDGE\nmr@NMR_250MHZ
##.OBSERVE FREQUENCY= 250.131544655141
##.OBSERVE NUCLEUS= ^1H
##.ACQUISITION MODE= SIMULTANEOUS (DQD)
##.ACQUISITION SCHEME= undefined
##.AVERAGES= 16
##.DIGITISER RES= 18
##SPECTROMETER/DATA SYSTEM= dpx250
##.PULSE SEQUENCE= zg30
##.SOLVENT NAME= CDCl3
##.SHIFT REFERENCE= (INTERNAL, CDCl3, 0, 16.522)
##AUDIT TRAIL= $$ (NUMBER, WHEN, WHO, WHERE, WHAT)
$$ ##TITLE= Audit trail, XWIN-NMR		Version 3.5
$$ ##JCAMPDX= 5.01
$$ ##ORIGIN= Bruker BioSpin GmbH
$$ ##OWNER= nmr
$$ C:\u/data/dgb/nmr/ADRS/2120/pdata/1/auditp.txt
$$ ##AUDIT TRAIL=  $$ (NUMBER, WHEN, WHO, WHERE, WHAT)
(   1,<2007-09-21 10:06:24.83 +100>,<MAYBRIDGE\nmr>,<NMR_250MHZ>,
      <created by zg, POWCHK disabled, PULCHK disabled
       configuration hash MD5:
       76 6E 9A 78 1E 09 19 81 EC 84 63 8F B0 6A 59 2D
       data hash MD5: 64K
       4E 1E 1E 19 2E 33 F4 51 6B D1 50 9B B4 E0 50 70>)
(   2,<2007-09-21 10:06:36.96 +100>,<MAYBRIDGE\nmr>,<NMR_250MHZ>,
      <Start of raw data processing
       ef LB = 0.3 FT_mod = 6 PKNL = 1 SI = 32K 
       data hash MD5: 32K
       9D C1 39 7A E6 64 A6 85 D8 F4 A6 C7 FF 17 49 AA>)
(   3,<2007-09-21 10:06:38.66 +100>,<MAYBRIDGE\nmr>,<NMR_250MHZ>,
      <apk 
       data hash MD5: 32K
       ED 68 20 1F F5 03 0D 78 7B E2 E4 4B E1 79 9E BE>)
(   4,<2007-09-21 10:06:39.44 +100>,<MAYBRIDGE\nmr>,<NMR_250MHZ>,
      <abs ABSG = 5 
       data hash MD5: 32K
       F7 A3 38 00 39 EB 4C A9 AF 39 88 CD 08 02 75 5D>)
$$ ##END=
$$ 
$$ hash MD5
$$ 95 7F D4 AA 9E 3F B9 AF 25 80 34 5B 33 88 3F D8
##$RELAX= 
##$RELAX= 
##$RELAX= 
##$RELAX= 
##$RELAX= 
##$RELAX= 
##$RELAX= 
$$ Bruker specific parameters
$$ --------------------------
##$DU= <C:\u>
##$EXPNO= 2120
##$NAME= <ADRS>
##$PROCNO= 1
##$TYPE= <nmr>
##$USER= <dgb>
##$AMP= (0..31)
100 100 100 100 100 100 100 100 100 100 100 100 100 100 100 100 100 100 
100 100 100 100 100 100 100 100 100 100 100 100 100 100 
##$AQSEQ= 0
##$AQ_mod= 3
##$AUNM= <au_zg>
##$AUTOPOS= <3 >
##$BF1= 250.13
##$BF2= 250.13
##$BF3= 250.13
##$BF4= 250.13
##$BF5= 500.13
##$BF6= 500.13
##$BF7= 500.13
##$BF8= 500.13
##$BYTORDA= 1
##$CFDGTYP= 0
##$CFRGTYP= 5
##$CHEMSTR= <none>
##$CNST= (0..31)
1 1 145 1 1 1 1 1 1 1 1 1 1 1 1 1 1 1 1 1 1 1 1 1 1 1 1 1 1 1 1 1 
##$CPDPRG= <>
##$CPDPRG1= <>
##$CPDPRG2= <>
##$CPDPRG3= <>
##$CPDPRG4= <mlev>
##$CPDPRG5= <mlev>
##$CPDPRG6= <mlev>
##$CPDPRG7= <mlev>
##$CPDPRG8= <mlev>
##$CPDPRGB= <>
##$CPDPRGT= <>
##$D= (0..31)
0 1 0 0 0 0 0 0 0 0.06 0 0 0 0 0 0 0.0002 0 0 0 0 0 0 0 0 0 0 0 0 0 0 
0 
##$DATE= 1190365583
##$DBL= (0..7)
120 120 120 120 120 120 120 120 
##$DBP= (0..7)
150 150 150 150 150 150 150 150 
##$DBP07= 0
##$DBPNAM0= <>
##$DBPNAM1= <>
$$ [...]
##$SUBNAM7= <"">
##$SUBNAM8= <"">
##$SUBNAM9= <"">
##$SW= 20.6930455092707
##$SWIBOX= (0..15)
0 0 3 0 0 0 0 0 0 0 0 0 0 0 0 0 
##$SW_h= 5175.983436853
##$TD= 65536
##$TD0= 1
##$TE= 297.16
##$TE2= 300
##$TE3= 300
##$TEG= 300
##$TL= (0..7)
0 120 120 120 120 120 120 120 
##$TP= (0..7)
150 150 150 150 150 150 150 150 
##$TP07= 0
##$TPNAME0= <>
##$TPNAME1= <>
##$TPNAME2= <>
##$TPNAME3= <>
##$TPNAME4= <>
##$TPNAME5= <>
##$TPNAME6= <>
##$TPNAME7= <>
##$TPOAL= (0..7)
0.5 0.5 0.5 0.5 0.5 0.5 0.5 0.5 
##$TPOFFS= (0..7)
0 0 0 0 0 0 0 0 
##$TUNHIN= 0
##$TUNHOUT= 0
##$TUNXOUT= 0
##$USERA1= <user>
##$USERA2= <user>
##$USERA3= <user>
##$USERA4= <user>
##$USERA5= <user>
##$V9= 5
##$VALIST= <valist>
##$VCLIST= <CCCCCCCCCCCCCCC>
##$VD= 0
##$VDLIST= <DDDDDDDDDDDDDDD>
##$VPLIST= <PPPPPPPPPPPPPPP>
##$VTLIST= <TTTTTTTTTTTTTTT>
##$WBST= 1024
##$WBSW= 4
##$XGAIN= (0..3)
0 0 0 0 
##$XL= 0
##$YL= 0
##$YMAX_a= 492157
##$YMIN_a= -602023
##$ZGOPTNS= <>
##$ZL1= 120
##$ZL2= 120
##$ZL3= 120
##$ZL4= 120
##$ABSF1= 16.522
##$ABSF2= -4.171173
##$ABSG= 5
##$ABSL= 3
##$ALPHA= 0
##$AQORDER= 0
##$ASSFAC= 0
##$ASSFACI= 0
##$ASSFACX= 0
##$ASSWID= 0
##$AUNMP= <proc_1d>
##$AZFE= 0.1
##$AZFW= 0.1
##$BCFW= 0
##$BC_mod= 0
##$BYTORDP= 0
##$COROFFS= 0
##$CY= 12.5
##$DATMOD= 1
##$DC= 0
##$DFILT= <>
##$DTYPP= 0
##$F1P= 14.0000005364418
##$F2P= -0.99999901652339
##$FCOR= 0.5
##$FTSIZE= 32768
##$FT_mod= 6
##$GAMMA= 0
##$GB= 0
##$INTBC= 1
##$INTSCL= 1
##$ISEN= 128
##$LB= 0.3
##$LEV0= 0
##$LPBIN= 0
##$MAXI= 10000
##$MC2= 0
##$MEAN= 0
##$ME_mod= 0
##$MI= 0
##$NCOEF= 0
##$NC_proc= -3
##$NLEV= 6
##$NOISF1= 0
##$NOISF2= 0
##$NSP= 0
##$NTH_PI= 0
##$NZP= 0
##$OFFSET= 16.522
##$PC= 1
##$PHC0= 152.5755
##$PHC1= 4.660278
##$PH_mod= 1
##$PKNL= yes
##$PPARMOD= 0
##$PSCAL= 4
##$PSIGN= 0
##$REVERSE= no
##$SF= 250.13
##$SI= 32768
##$SIGF1= 0
##$SIGF2= 0
##$SINO= 400
##$SIOLD= 32768
##$SREGLST= <1H.CDCl3>
##$SSB= 0
##$STSI= 32768
##$STSR= 0
##$SW_p= 5175.98343685301
##$SYMM= 0
##$S_DEV= 0
##$TDeff= 65536
##$TDoff= 0
##$TI= <Analysis number 999999
Compound Code 99
Book Reference 9
Project Code 9>
##$TILT= no
##$TM1= 0
##$TM2= 0
##$TOPLEV= 0
##$USERP1= <user>
##$USERP2= <user>
##$USERP3= <user>
##$USERP4= <user>
##$USERP5= <user>
##$WDW= 1
##$XDIM= 32768
##$YMAX_p= 412980083
##$YMIN_p= -55621
$$ End of Bruker specific parameters
$$ ---------------------------------
##NTUPLES= NMR SPECTRUM
##VAR_NAME=  FREQUENCY,     SPECTRUM/REAL,   SPECTRUM/IMAG
##SYMBOL=    X,             R,               I
##VAR_TYPE=  INDEPENDENT,   DEPENDENT,       DEPENDENT
##VAR_FORM=  AFFN,          ASDF,            ASDF
##VAR_DIM=   32768,         32768,           32768
##UNITS=     HZ,            ARBITRARY UNITS, ARBITRARY UNITS
##FACTOR=    0.157963299565203, 1,           1
##FIRST=     4132.6476996994, 0,             0
##LAST=      -1043.33573715361, 0,           0
##MIN=       -1043.33573715361, -55621,      0
##MAX=       4132.6476996994, 412980083,     0
$$ Real data points
##PAGE= N=1
##DATA TABLE= (X++(R..R)), XYDATA
$$ [...]
16533B0655j439J042J2155j0237j9392j0388l22r8j302l09j5211r12K0737J3825
16519H804j499j7293j0223J1362J0568m646q052J1913n72m602J2806l705j2378
16506g517j6886q440R291J2901J6992K264n642j1788m212k482r839J7342J8309
16493A0293l224r223m94r00j3076J32j610L36J8692Q003K764J0615j4018p077
16479A213q325J1865J049j810l321J0855j6179j2356j350J6896J085n402J969
16466c811j2105p225R233J9353P299K390q736j3494O744m73N854L661P82m812
16452D660K740p97K981j316j4356k1583P652J0681j2831j684J9747M89p808L375
16438h050N393L005L422o734L321n931M748Q00o044j1188O859O970r939p134Q898
$$ plain form
16533 20655 19216 20258 32413 22176 2784 -7604 -7926 -8024 -9326 -9635 -24846 -25758 -5021 8804
16519 8804 7305 -9988 -20211 -8849 1719 -2927 -10979 934 362 -4240 8566 4861 -7517
16506 -7517 -24403 -32843 -23552 -10651 6341 8605 2963 -8825 -13037 -15519 -25358 -8016 10293
16493 10293 7069 -2154 -2648 -3548 -16624 -16492 -18102 -17766 926 8929 11693 22308 8290 1213
16479 1213 -7112 4753 5802 3992 671 11526 -4653 -17009 -18359 -1463 -378 -5780 -3811
16466 -3811 -15916 -23141 -13908 5445 12744 15134 6398 -7096 -352 -825 5029 8690 9472 4660
16452 4660 7400 6603 9584 8268 -6088 -27671 -20019 -9338 -22169 -23853 -4106 -3617 -11425 -8050
16438 -8050 -2657 348 3770 -2964 357 -5574 -826 -26 -6070 -17258 -10399 -3429 -13368 -20502 -11604
16423a1604O929N179Q062k635N082O576p182j5309p326P129N193j231m575L392
16409b320j4279q159J076O467Q603J1758j4006j3035q138r048L088J1218M056
16396b2719O28Q793l328k497L891m960j1874k117J4350J8027R105j049j1834J454
16382d130J0005p871p884m87q054j1378k130Q07L818J8000N310L758n258r156
16368a4650J2296Q368j1120j3586Q431L723r989J3598O66j3861n341Q514K503
16355a0448M796k904k528l949l905l931J0841M252j25j7569L195m298M375J4331
16341g867K241j315j1612j484M411Q143J177j850m417n936l348P090Q935O0j019
16326f791q505l103k451p311J8457P588Q035l079n148n912L464J3206K563o115
$$ plain form
16423 -11604 -4675 504 8566 5931 11013 17589 10407 -4902 -12228 -5099 94 -1137 -5712 -2320
16409 -2320 -16599 -24758 -23682 -17215 -8612 3146 -10860 -23895 -32033 -41081 -37993 -26775 -22719
16396 -22719 -22091 -13298 -16626 -19123 -15232 -20192 -32066 -34183 -19833 -1806 7299 6250 -5584 -4130
16382 -4130 5875 -1996 -9880 -10367 -18421 -29799 -31929 -31122 -27304 -9304 -3994 -236 -5494 -14650
16368 -14650 -2354 6014 -5106 -18692 -10261 -6538 -16527 -2929 -2263 -16124 -21465 -12951 -10448
16355 -10448 -5652 -8556 -11084 -15033 -18938 -22869 -12028 -7776 -7901 -25470 -22275 -26573 -22198 -7867
16341 -7867 -5626 -6941 -18553 -20037 -15626 -7483 -6306 -8156 -12573 -18509 -21857 -14767 -5832 -5772 -6791
16326 -6791 -15296 -18399 -20850 -28161 -9704 -2116 5919 2840 -2308 -8220 -4756 8450 11013 4898
16312D898l629o934k096j1319l283J2592m322p610m506J4883R152R551M358m232
16298G503j2001O9N811Q490O006m276n159J323o791j7277Q159J2962L610K123
16284A0552j3296q423J3347L785l470m40l795j297q338r818j89P844Q360k334
16270g512n353r448l495P858q079o635o352l943R126J7554N78J1429O067m491
16256b696l482m414J3879M850J681J411q555j5877l926q418M09J4329P117R203
16242E511j0459j5870l417r11Q543r45J105q82J9707J517r442Q402j96j0821l275
16227a1433P916O507k133K47p854j7648j060N957n711O555Q177L070j4171J303
16213b0278J3696K0373q264j2178O880l944p210l895J734J8285l738j3626M423
$$ plain form
16312 4898 1269 -5665 -7761 -19080 -22363 -9771 -14093 -21703 -26209 -11326 -2174 7377 11735 7503
16298 7503 -4498 -4429 1382 9872 15878 11602 6443 7766 975 -16302 -8143 4819 8429 10552
16284 10552 -2744 -11167 2180 5965 2495 2055 -1740 -3037 -11375 -21193 -21382 -13538 -5178 -7512
16270 -7512 -12865 -22313 -25808 -17950 -26029 -32664 -39016 -42959 -33833 -16279 -15701 -4272 1795 -2696
16256 -2696 -6178 -10592 3287 8137 9818 11229 2674 -13203 -17129 -25547 -25138 -10809 -3692 5511
16242 5511 -4948 -20818 -24235 -25146 -16603 -17548 -16443 -17325 2382 3899 -5543 2859 2663 -8158 -11433
16227 -11433 -3517 2990 857 1104 -6750 -24398 -25458 -19501 -25212 -18657 -10480 -7410 -21581 -20278
16213 -20278 -6582 13791 5527 -6651 229 -3715 -10925 -14820 -13086 5199 1461 -12165 -7742
16200g742J575K168N377l643r131j3878j921Q078J910j3745P689K1643K2511o929
16186A3962j4969j1528o272J692R882Q373N890j1772M647N660n110j15o447n483
16172a1590J281j0324l975m397O037J6747p607J1459K1877k34j892j6809q283
16159g710J2565M276j21k156j1049j3807K606R661N58J4082L943o797J396j5503
16145h056j3606j665R028j293r798Q150J3125N07m845r912L93L839L091J058k423
16130a2407N828J132M431L186j161M145j3680r96r307j2452J818l56j298K919
16116b8198K435O103R526J3662k418l37o436K630k282k547l118m399P531P442
16102d06J487j0120l100O989m305j030p778p365O032N307J7960R776r211j3964
$$ plain form
16200 -7742 -6167 -3999 1378 -2265 -11396 -25274 -27195 -19117 -17207 -30952 -23263 -1620 20891 13962
16186 13962 -1007 -12535 -18807 -17115 -7233 1140 7030 -4742 -95 5565 455 340 -6107 -11590
16172 -11590 -10309 -20633 -24608 -29005 -22968 -6221 -13828 -2369 19508 19274 17382 573 -7710
16159 -7710 4855 9131 9010 6854 -4195 -18002 -15396 -5735 -5177 8905 12848 6051 7447 -8056
16145 -8056 -21662 -23327 -14299 -15592 -25390 -17240 -4115 -3608 -8453 -18365 -17972 -14133 -11042 -9984 -12407
16130 -12407 -6579 -5447 -1016 2170 1009 5154 -8526 -9522 -18829 -31281 -29463 -29819 -31117 -28198
16116 -28198 -25763 -19660 -10134 3528 1110 773 -5663 -3033 -5315 -7862 -10980 -15379 -7848 -406
16102 -406 1081 -9039 -12139 -5150 -9455 -10485 -18263 -25628 -19596 -14289 3671 13447 4236 -9728
16088i728l037J3418J6998o637j9852j4455L273r25m140k461Q311J275p26M005
16074a4681J088j048k689q138R239L719N164k653m636j2557J1211J5659n232j1337
16060a6891j827J5621J2030m134j1207M963n324k33k747J994J5461L986K962j6696
16046b042j1653J2329J0044r483k675r361q233l293M427O480K0287Q132p195k53
16032G511o719j2342j250P02J7251j9890k287K955O923J1821m261j3178J2592
16019a72J6889K064j0568M84J403j4331K032R652q739k1156j1321K689Q244J0534
16005a2296Q408j7494m790J8270J5568L87o969k977p589l624K624K499L270k160
15991f873j1191l248P442M144Q208M392K192j7348J559J3804J7640j5453j7312
$$ plain form
16088 -9728 -12765 653 17651 11014 -8838 -23293 -20020 -20945 -25085 -27546 -19235 -17960 -18686 -14681
16074 -14681 -13593 -14641 -17330 -25468 -16229 -12510 -7346 -9999 -14635 -27192 -15981 -322 -5554 -16891
16060 -16891 -18718 -3097 8933 4799 -6408 -1445 -6769 -7002 -9749 -7755 7706 11692 14654 -2042
16046 -2042 -13695 -1366 8678 -805 -3480 -12841 -21074 -24367 -19940 -13460 6827 14959 7764 7511
16032 7511 792 -11550 -12800 -12098 5153 -14737 -17024 -14069 -7146 4675 414 -12764 -172
16019 -172 16717 18781 8213 8697 10100 -4231 -2199 7453 -1286 -22442 -33763 -31074 -22830 -12296
16005 -12296 -3888 -21382 -26172 -7902 7666 8053 1084 -1893 -9482 -13106 -10482 -7983 -4713 -6873
15991 -6873 -18064 -21312 -13870 -9726 -1518 2874 5066 -12282 -10723 3081 20721 5268 -12044
15978a2044R42P782J3750j0578o37J3422R787Q300P25r631j3100l295j29J7610
15964B2904k298j7331n710j21j999n160O759J258P955J0589o250q019j0141n755
15950a3319o817J0331J2759Q185R162O246k718j3361j1124l243J5679R270K273
15937B3323o952j0628k700l002n741L82P382K641r920j3947j2401J6767J14P518
15923g164l167k965o149j532Q277J187j3431M833K188o94j1658J4387J5119J2886
15909A2117J051k68p270n601r418j1282k405J1946M314O945J3253m405m570l477
15895I30J535L097j1644j0719q47L459N059j598m536o74r399p179J0068P392p882
15880b2938l590J0550J869J2590J3108J3022j4326j0217j0630J2210O999p30j220
$$ plain form
15978 -12044 -11102 -3320 10430 -148 -785 12637 22424 30724 31449 21818 8718 5423 5294 22904
15964 22904 20606 3275 -2435 -2556 -4555 -9715 -2956 -1698 6257 16846 10596 2577 -7564 -13319
15950 -13319 -20136 -9805 2954 11139 20301 26547 23829 10468 -656 -3899 11780 21050 23323
15937 23323 16371 5743 3043 41 -5700 -5318 2064 4705 -5215 -19162 -31563 -14796 -14682 -7164
15923 -7164 -10331 -13296 -19445 -20977 -12700 -11513 -24944 -20111 -17923 -18617 -30275 -15888 -769 12117
15909 12117 13168 12900 5630 29 -9389 -20671 -23076 -11130 -6816 129 13382 8977 4407 930
15895 930 2465 5562 -6082 -16801 -17648 -14189 -9130 -10728 -15264 -15938 -25337 -32516 -22448 -15056 -22938
15880 -22938 -26528 -15978 -14109 -1519 11589 24611 10285 68 -10562 1648 8647 7917 6697
15867F697J650q564j2723j156l776J9358J3739q59n743n438P230o37j7516n196
15853a2934q356o474L65K581O656k507R684J6281Q755j269j0877j246J659o034
15839c716K05N976j767p641l074p126j0468p367K8390O911m626p374K269L315
15825f093Q423j1563n053K250k666R337R431J2437O911j7030j0862j997o248l152
15811a5875p342Q908N882k343M495J9110O068K198m964l444L187k14j804j0193
15797C669n215j0415L431r098j419O358O907P709J3686Q415j125r650j1645o354
15783d746o177l479M396l703o149l661k544K7364J1540L960j4767r410L725o410
15769a0061o015l308J994J1929O714j2231m313N002P207k713K243j555M31m8L127
$$ plain form
15867 6697 8347 -217 -12940 -14096 -17872 1486 15225 14366 8623 3185 10415 9778 -7738 -12934
15853 -12934 -21290 -27764 -27399 -24818 -18162 -20669 -10985 5296 14051 12782 1905 659 2318 -3716
15839 -3716 -3511 2465 698 -6943 -10017 -17143 -27611 -34978 -6588 323 -4303 -11677 -9408 -6093
15825 -6093 2330 -9233 -14286 -12036 -14702 -5365 4066 16503 23414 6384 -4478 -6475 -12723 -15875
15811 -15875 -23217 -14309 -8427 -10770 -6275 12835 18903 21101 16137 12693 15880 15666 13862 3669
15797 3669 -1546 -11961 -8530 -17628 -19047 -12689 -5782 1927 15613 24028 22903 13253 1608 -4746
15783 -4746 -10923 -14402 -10006 -13709 -19858 -23519 -26063 1301 12841 16801 2034 -7376 -3651 -10061
15769 -10061 -16076 -19384 -17390 -5461 1253 -10978 -15291 -10289 -3082 -5795 -3552 -5107 -4676 -4724 -1597
15754a597L084p921J929o026J1433j3660K931O646n55j5293j0645n773J8732N178
15740a1537J3040J5321p020r629Q698L750n853q31K657p697J1290J631n475j5928
15726g583j3520J6576R422p051O24j942j4947j5778j552P335J3664m122j0503
15713b9377J917q971L955J1544N264m86j6065l954K360O957R324J256K583R715
15699c978K09j4788n781p28P412L70K479l799l400K176K807N84M912N342O492
15684C09m93P845M32j1040j2263j621n931o365R638j601q225j4650N947J1338
15670b6680R689j237m736k363L24J0260N136J023n55j569q47N769j0792K12K075
15655a4291J0306N181j2512r37P30k230j046n139l75m25k753J3627L400N224O702
$$ plain form
15754 -1597 1487 -6434 -4505 -10531 902 -12758 -9827 -3181 -3736 -19029 -29674 -35447 -16715 -11537
15740 -11537 1503 16824 9804 175 8873 12623 6770 5939 8596 899 12189 13820 8345 -7583
15726 -7583 -21103 -4527 4895 -2156 -1532 -3474 -18421 -34199 -35751 -28416 -14752 -18874 -29377
15713 -29377 -27460 -36431 -32476 -20932 -15668 -16154 -32219 -36173 -33813 -26856 -17532 -16276 -13693 -3978
15699 -3978 -3769 -18557 -24338 -25066 -17654 -17284 -14805 -18604 -22004 -19828 -17021 -16437 -11525 -6183 309
15684 309 -184 7661 8093 -2947 -15210 -16831 -22762 -29127 -19489 -21090 -29315 -43965 -38018 -26680
15670 -26680 -16991 -18228 -22964 -25327 -25003 -14743 -9607 -8584 -9139 -10708 -11555 -5786 -16578 -16366 -14291
15655 -14291 -3985 1196 -11316 -12253 -11523 -13753 -14799 -19938 -20313 -20738 -23491 -9864 -6464 -1240 5462
15640E462j103k924P248N742m446j3703Q810N428j300j201K16K381o813j2500
15626h703O492J1386M69k966M358o759j2527J2333Q990Q721j3531n642k626j576
15612a581n835j0747M380P287K228j823k109Q847J1753l079J64O591j0454n153
15598D69L380j0729R532Q638N860n934J629j1705r277k296M150m180M169R396
15584C102j0406k331K981N775j2311k73M546P602m176P895N258O34L683j293L369
15569A4055m527l359j291N518M638l498K064j5349m771J3255J5829m182j9739
15556a357j927M288R539J0264r308k4381m212p420J9173J6407K880J238r869n533
15542b18J937O827j080J0089n971m178n816q024J1576Q080K180O104P080j2264
$$ plain form
15640 5462 4359 1435 8683 14425 9979 -3724 5086 10514 9214 8013 8229 10610 3797 -8703
15626 -8703 -2211 9175 9644 6678 11036 4277 -8250 4083 13073 21794 8263 2621 -5 -1581
15612 -1581 -7416 -18163 -13783 -6496 -4268 -6091 -8200 647 12400 9321 9485 16076 5622 469
15598 469 3849 -6880 2652 11290 17150 11216 12845 1140 -8137 -10433 -6283 -10463 -6294 3102
15584 3102 -7304 -9635 -6654 -879 -13190 -13463 -8917 -1315 -5491 2404 7662 8296 11979 10686 14055
15569 14055 9528 6169 4878 10396 15034 11536 13600 -1749 -6520 6735 22564 18382 -1357
15556 -1357 -3284 1004 10543 20807 11499 -12882 -17094 -24514 -5341 11066 13946 15184 5315 -218
15542 -218 1719 8546 7466 17555 11584 7406 1590 -6434 5142 13222 15402 21506 28586 16322
15528A6322l308l619r00j580r483J0088L18P754L317J211k402p58Q3O397M75M790
15512B8705K607j501j5111N321n96j4876j518K417J655n937q379O053R988p987
15498H41K854J2977j0899j7934q461L115R681L747k407R266q206p72K394p252
15484a1056l240o137l659K716R938N529J254j439J0990Q704Q024n231j591L540
15470A8342p620l69Q719O335q608k1594j9145N364L704m351M933PL784J793K177
15455f529L256M453P622L895J302q168K45m291j475k613L989p448j2428J4661
15441c529J5456K072j0698j5463n746K185j618J1184O816l913K256j429J2280
15428I853J1790j371K599r432p684r242J65m617k879q69O207K845l22R234P174
$$ plain form
15528 16322 13014 9395 8495 6915 -2568 7520 7838 15592 18909 20120 17718 16960 17043 23440 23915 28705
15512 28705 31312 29811 14700 20021 19425 4549 3031 5448 7103 1166 -7213 -1160 8828 841
15498 841 3695 16672 5773 -12161 -20622 -17507 -7826 -4079 -6486 2780 -5426 -6198 -3804 -11056
15484 -11056 -14296 -20433 -24092 -21376 -11438 -5909 -4655 -6094 4896 13600 21624 16393 14802 18342
15470 18342 10722 10353 19072 25407 16799 -4795 -23940 -18576 -14872 -19223 -14290 -14283 -10499 -8706 -6529
15455 -6529 -3273 1180 8802 12697 13999 5831 6076 1785 310 -2303 1686 -5762 -18190 -3529
15441 -3529 11927 13999 3301 -12162 -17908 -15723 -17341 -6157 659 -3254 -998 -2427 9853
15428 9853 21643 20272 22871 13439 5755 -3487 -3322 -7939 -10818 -11687 -5480 -2635 -2957 6277 13451
15413A3451l191j7620M591M98p945n488L47P160J1387M837N117N07j4123J402
15399I30R428K730q22n075j839J6503j2861j3925j764L162o756j2050n627o004
15385c3970J0897J0783M797q711J372n68k219J435J077N341Q472K352k864j819
15371c625J1665R547k198k4971k0250J3970J6521j0264k168M001m910M856j0819
15358a8645k003J5135J71j3173r650K340N858J2437Q223n206j0625k19J1392k582
15344f547J3244Q206j0202k0972J1435Q036J824l877L69p28j3905N32M236l107
15330a1456n602N316M899j997k995Q782q03r16Q863l413j7103k232J0379k322
15316a0600j6249j671J0940J3709L902q575p92O419n391j723J991L815j682j4989
$$ plain form
15413 13451 10260 -7360 -2769 -2271 -10216 -15704 -15357 -8197 3190 8027 13144 13651 -472 930
15399 930 10358 13088 12266 7191 5352 21855 8994 -4931 -6695 -3533 -10289 -22339 -27966 -33970
15385 -33970 -23073 -12290 -7493 -16204 -14832 -15400 -17619 -16184 -15107 -9766 -1294 1058 -1806 -3625
15371 -3625 8040 17587 15389 -9582 -29832 -15862 659 -9605 -11773 -7772 -12682 -7826 -18645
15358 -18645 -20648 -5513 -5342 -18515 -28165 -25825 -19967 -7530 693 -4513 -15138 -15357 -3965 -6547
15344 -6547 6697 14903 4701 -16271 -4836 3200 5024 1147 1516 788 -13117 -12585 -8349 -11456
15330 -11456 -17058 -11742 -6843 -8840 -11835 -3053 -3856 -4772 4091 678 -16425 -18657 -8278 -10600
15316 -10600 -26849 -28520 -17580 -3871 31 -8544 -9336 -2917 -8308 -10031 -8040 -4225 -5907 -20896
15302b0896M76J3744K308l39J105m529K773L005j3227q547M492N722J7638k571
15288A154j5838l122l528M55R580p280o761P818R49J0191l865k768k1j598M311
15273a0323O564j398j6061K88K322r135J2205K8043J5722J5629l707j9067j0921
15260A0161l68J459q588l097p136q681Q474q83j11N970j2477j7564J1277K3175
15246A611J0201q637P805q589n312L862m018n004j466Q325m150k307J0934p187
15232c932n608n56J0908Q731n163p029o338j3845j767J3958J0921L837N996Q376
15218A8489o073k6425p19L503M600M736p0k340m478q989N903J1203N439n417j5657
15203a6295R343O326L287L423N802l999j3964p014L746J2442Q091J0480J272j0433
$$ plain form
15302 -20896 -20420 -6676 -4368 -4707 -3602 -8131 -5358 -2353 -15580 -24127 -19635 -13913 3725 1154
15288 1154 -14684 -17806 -21334 -20879 -11299 -18579 -25340 -17522 -16573 -6382 -10247 -13015 -13036 -14634 -10323
15273 -10323 -3759 -5157 -21218 -20930 -18608 -27743 -15538 12505 28227 43856 40149 21082 10161
15260 10161 9793 11252 2664 -433 -7569 -16250 -7776 -8659 -8770 -2800 -15277 -32841 -21564 1611
15246 1611 11812 3175 10980 2391 -2921 941 -3077 -8081 -9547 -1222 -5372 -7679 3255 -3932
15232 -3932 -9540 -10096 812 9543 4380 -2649 -8987 -22832 -24599 -10641 280 4117 10113 18489
15218 18489 12416 -14009 -14728 -11225 -6625 -1889 -1959 -4299 -8777 -17766 -11863 -660 4779 -638 -16295
15203 -16295 -6952 -626 2661 6084 11886 7887 -6077 -13091 -9345 3097 11188 21668 22940 12507
15189A2507l728k685o716j0042q290L872M56n590J4218O198j4076k14O814J2471
15175E195J505o688m609q491o118L175q19J3673Q445J003k394j6152k0322n944
15161c8541P697J8844M50j861j75j712L133k490o388K0360J785o987O06J48q319
15146a3450o311J352O452j483J639k326J6001j749j0394r993o49J4095J748J477
15132c591j0778m674p223m132K3553j614j1537J042j918J0166J2684K985L208
15119H171k754J0687K384j2748j3126J5236J729j234q314J642O705j1794j8052
15106b1468N345R094J1360p321K445Q014R905r803n817K739M81m691K150m405
15092a972P360p929q743P95J3842N295R035m060j2743j2891O929N545k101J902
$$ plain form
15189 12507 8779 6094 -622 -10664 -18954 -15082 -14626 -20216 -5998 200 -13876 -14090 -7276 5195
15175 5195 6700 12 -4597 -13088 -19206 -16031 -16850 -3177 5268 6271 3877 -12275 -32597 -38541
15161 -38541 -30844 -12000 -11550 -13411 -13586 -15298 -12165 -14655 -21043 -683 1102 -5885 -5279 -5131 -13450
15146 -13450 -19761 -18409 -11957 -13440 -11801 -14127 1874 125 -10269 -20262 -20911 -6816 -5068 -3591
15132 -3591 -14369 -19043 -26266 -30398 -6845 -8459 -19996 -18954 -20872 -10706 1978 4963 8171
15119 8171 5417 16104 18488 5740 -7386 7850 9579 8345 31 1673 8378 -3416 -21468
15106 -21468 -16123 -7029 4331 -2990 -545 7469 17374 7571 1754 4493 4974 283 2433 -1972
15092 -1972 5388 -2541 -11284 -10489 3353 8648 17683 13623 880 -12011 -5082 463 -1638 264
15078B64m109K207R86p761N357r762q623J1826o616m384L294M36j1837R386J3373
15063e963M660j1635l473n230K433K0104J660p628R39n184j2217K197O777J0507
15049b053R961p994r839J1475O206o979L743j491q512n570k59p275j5001J699
15035c1889L410Q544J6279J1953O723n620j4713j782J1243L860n985j4850j1473
15022b4300q801Q350M258N980M565K413j966J149j0697M90P331k480k958N128
15008a1538J138P77m137r70M267j1058p569J19M396J76P064P213J7070q790q858
14993a0700P575j425l685N759l749P177M913r560l00J5741j255j1983j407J87
14979b712m985p34J0239M925p351n759j4234M65r52k256J4043N692j9137LJ2170
$$ plain form
15078 264 -3845 -1638 -652 -8413 -3056 -12818 -21441 -9615 -16231 -20615 -17321 -16885 -28722 -19336 -5963
15063 -5963 -1303 -12938 -16411 -21641 -19208 896 2556 -5072 -4133 -9317 -21534 -19337 -12560 -2053
15049 -2053 7908 -86 -9925 1550 7756 777 4520 3029 -5483 -11053 -11312 -18587 -33588 -31889
15035 -31889 -28479 -19935 -3656 8297 15020 9400 -5313 -7095 4148 8008 2023 -12827 -24300
15022 -24300 -33101 -24751 -20493 -14513 -9948 -7535 -9501 -8352 -19049 -18559 -11228 -13708 -16666 -11538
15008 -11538 -10400 -9623 -13760 -14730 -10463 -21521 -29090 -28971 -24575 -24399 -17335 -10122 6948 -1842 -10700
14993 -10700 -3125 -4550 -8235 -2476 -6225 952 5865 -3695 -3995 11746 10491 -1492 -2899 -2712
14979 -2712 -7697 -8431 1808 6733 -618 -6377 -20611 -20146 -21098 -23354 -9311 -3619 -22756 -22753 -10583
14964a0583O351J3881j4128j0753J287R509J3744p22l643o583R032n078O041m428
14950C927j2105p226j211R798J0310J097n527J121o102j3953j119N903M049N531
14936e507j8025l731J6008j64j1487j050J308l032O149J3796K981O538P357j1848
14922g07j5801J1165J0494L978Q476j1729k5083j1054n572O410J0849R182R051
14909c41l23k942n19M865n363K780k194j4974j3536P181K050R31Q293J3042q141
14894i191K72P357L387J4621r318k370m38N256l593m683J233j0029k071J314Q864
14879F11R789N683O133j2230j320p895j4095K338p49J037q451p626J023J1652
14865a4100l153l760J7325J282p707l924J442n862J2405J0318R416M568o871q958
$$ plain form
14964 -10583 -4232 9649 -4479 -15232 -13945 -4436 9308 8586 4943 -1640 7392 2314 8355 3927
14950 3927 -8178 -15404 -16615 -6817 3493 4590 -937 184 -5918 -19871 -20990 -15087 -11038 -5507
14936 -5507 -23532 -27263 -11255 -11419 -22906 -23956 -22648 -25680 -19531 -5735 -2754 3784 11141 -707
14922 -707 -16508 -5343 5151 9129 17605 5876 -19207 -30261 -35833 -29423 -18574 -9392 -341
14909 -341 -664 -3606 -4125 740 -4623 -1843 -4037 -19011 -32547 -25366 -23316 -22385 -14092 -1050 -9191
14894 -9191 -8919 -1562 1825 16446 7128 4758 4320 9576 5983 1300 2533 -7496 -9567 -8253 611
14879 611 10400 16083 22216 9986 8666 771 -13324 -10986 -11735 -10698 -19149 -26775 -25752 -14100
14865 -14100 -17253 -21013 -3688 -2406 -10113 -14037 -12595 -18457 -6052 4266 13682 18250 11379 2421
14851B421q590R664n48k824o794n055j3567J67J3447J8986j569j2447J017M787
14837i05k39l90k915m036j358N650K415n920j940J170j104J344J078n267r229
14822b1646N871k99N284J2992M768m973J0840p063j5132k382o974J006N189J4153
14808A634j3470q478m51J0296M95O219j315l571J09O874J56l982l247J0763L692
14793E724K804j7212j2287q15j1L433j609o618J0804J8472J4396o105m530m871
14779A575n486M271P570o7N13N475m097k6434J523K875j1036Q18M436L330N260
14764i474J0287k805p992r286o309M110K058J2205J6582j1575j0249k571P31p669
14750b1957n989J133P001P214R386j4374m26K521N639J0097l287j6233r782J8472
$$ plain form
14851 2421 -6169 3495 2947 123 -6671 -11726 -25293 -25126 -11679 7307 5738 -6709 -5692 -905
14837 -905 -1144 -1534 -4449 -8485 -9843 -4193 -1778 -7698 -9638 -8468 -9572 -8228 -7150 -12417 -21646
14822 -21646 -15775 -16074 -10790 2202 6970 1997 12837 5774 -9358 -11740 -18714 -17708 -12519 1634
14808 1634 -11836 -20314 -20765 -10469 -9974 -3755 -5070 -8641 -8532 -1658 -1502 -5484 -8731 2032 5724
14793 5724 8528 -8684 -20971 -21786 -21797 -18364 -19973 -26591 -15787 2685 17081 10976 6446 1575
14779 1575 -3911 360 7930 7863 8376 13851 9754 -16680 -15157 -12282 -23318 -22500 -18064 -14734 -9474
14764 -9474 813 -1992 -9984 -19270 -25579 -21469 -19411 -7206 9376 -2199 -12448 -15019 -14288 -21957
14750 -21957 -27946 -26813 -19812 -12598 -3212 -17586 -18012 -15491 -9852 245 -3042 -19275 -29057 -10585
14736a0585m784O500P740o232K700R088N944k286j4359L12j2082P43r776r246
14722c6323J5470J0427j2820N705N406l416M853J3842j2872j2391Q568N223j2130
14709b0458K24J2610R781N059j4116P084K2234L17o872l499l292r114L383m873
14695a532l451J4159k844j9620n192Q925J2543n351j381N12P160k774M279Q5j2637
14680g119m996j4J829K0199K32p765o538L803p10o624k807J1983M50j2151p453
14665a7681R703m95j2621J093J6161j287M868l941o852K053L83j418P689p393
14651i738r072m921O171P69J635M484o186n467N36k452n653l742J4708P264K1293
14636I629J1078j2347j4808l705j1700L688M106p105r636R423J2823J9157J3828
$$ plain form
14736 -10585 -15369 -8869 -1129 -7361 -4661 4427 10371 8085 -6274 -5962 -18044 -17301 -27077 -36323
14722 -36323 -20853 -10426 -23246 -17541 -12135 -15551 -10698 3144 -9728 -22119 -13551 -8328 -20458
14709 -20458 -20234 -7624 2157 7216 -6900 184 22418 22735 15863 12364 9072 -42 3341 -1532
14695 -1532 -4983 9176 6332 -13288 -18480 -9555 2988 -2363 -3744 -3232 3928 1154 5433 5518 -7119
14680 -7119 -12115 -12129 -10300 9899 10131 2366 -4172 -369 -1079 -7703 -10510 1473 1923 -10228 -17681
14665 -17681 -7978 -8473 -21094 -20001 -3840 -5127 -259 -4200 -11052 -8999 -8616 -10034 -2345 -9738
14651 -9738 -18810 -23731 -17560 -16791 -15156 -10672 -16858 -22325 -21789 -24241 -29894 -33636 -18928 -11664 9629
14636 9629 20707 8360 -6448 -10153 -21853 -18165 -14059 -21164 -30800 -21377 -8554 10603 24431
14623B4431j3966j3987l996J2305k662M385O319j4347k67J842J5264k336k976
14610A0009J0806l996K696n341q777k1771J030L38K399N715J907o492P321k130
14596f286m86O233J2046mj5246j4279M154N080j386O131J4730o22k0197m105L325
14581a0912J9328J014j2545j4861k112K86J6596J5753r569o910J26r790j0060
14568b3656j6082J9583M841q129j9069J1838P939M551M839K4228L053R03j2396
14555B443P131J932m790L550K438N113k377q546j7331j4881j671K089Q866O329
14541i705N098L920M986j303p828o793M300L844L052N151q042p130l38J4872N790
14526I874j1023q354r948r733L396J0082J1292J508n516j1856P971K4346M156
$$ plain form
14623 24431 10465 -3522 -7518 4787 2125 6510 12829 -1518 -1785 57 15321 12985 10009
14610 10009 20815 16819 19515 14174 5397 -16374 -15344 -15006 -12607 -6892 -4985 -11477 -4156 -6286
14596 -6286 -6772 -539 11507 11503 -3743 -18022 -13868 -8788 -10174 -4043 10687 10065 -10132 -14237 -10912
14581 -10912 8416 9430 -3115 -17976 -20088 -19802 -3206 12547 2978 -3932 -3806 -13596 -23656
14568 -23656 -39738 -20155 -15314 -23443 -42512 -30674 -22735 -18184 -13345 10883 13936 14839 2443
14555 2443 9574 11506 6716 10266 12704 17817 15440 6894 -10437 -25318 -26989 -24900 -16034 -9705
14541 -9705 -4607 -687 4299 2996 -4832 -11625 -7325 -3481 -429 4722 -3320 -10450 -10788 4084 9874
14526 9874 -1149 -9503 -19451 -29184 -25788 -15706 -4414 -2906 -8422 -20278 -12307 12039 16195
14513A6195k965K02n36o870j0041L548R327K083K876j4029j767J00j9165J202
14499a9840J3629J671L042l465r567P910O782J4476k015j9694k585k372K418j1564
14485b1174j4757N053R516M265k901k257J13o332m230O366R430J2851m8l75o618
14470a1098m915M796K629q800p293L078L645R06L154J4918Q157O298r974j2784
14456g283q973o71K2935Q673n679K740o075l510P82P875l347J160j2697q412J1932
14441e50o015j0215J8059m370j6928r80J0639L733K0880J4195j2339q428J677
14428I358Mm685m939J1785k30r164j0563j0231m848L082J3908J287r784j506J0782
14413e744J0142r772k636k008J9721J3125M202j0726n55j1475j255J3491L640
$$ plain form
14513 16195 13230 13432 12896 6026 -4015 -467 8860 10943 13819 -210 -1977 -1877 -21042 -19840
14499 -19840 -6211 -4540 -1498 -4963 -14530 -6620 162 14638 12623 -7071 -9656 -12028 -9610 -21174
14485 -21174 -35931 -30878 -21362 -17097 -19998 -22255 -22142 -28474 -32704 -26338 -16908 -4057 -4105 -4480 -11098
14470 -11098 -16013 -11217 -8588 -17388 -24681 -21603 -17958 -17052 -13898 1020 9177 15475 5501 -7283
14456 -7283 -16256 -16927 6008 14681 9002 11742 5667 2157 2939 10814 7467 8627 -4070 -12482 -550
14441 -550 -6565 -16780 1279 -3091 -20019 -20999 -10360 -6627 14253 28448 16109 7681 9358
14428 9358 9362 4677 -262 11523 11293 2129 -8434 -18665 -23513 -20431 -6523 -5236 -15020 -16526 -5744
14413 -5744 4398 -5374 -8010 -10018 9703 22828 27030 16304 15749 4274 3019 16510 20150
14400B0150r205j1573k464J1114q677j3441J442Q497J178o405k833M647r63R624
14386A091m080K818n273N09N715O225l681k2309j3846J0351J4428J3370R731q564
14372F485k0233p927J3975O482j3390q603o53J2797J4227n562P22L902L883J0252
14358A6357M462j5983r797J2367K908j3932q160L895j85m396n60K454P441J0012
14344F883P140O549k481k591p092l214p49L726p204q129O81N92P295l100k673
14329d367l030r592j0307l096J1176R34M599Q35k128k797K909K662m522l217L718
14314a6223M237l857j626r329j2758j4425K1281J0219k858j308o46J054J2859
14301a3380J2708J0412l931q219l138j3044N583o982L767m273J2066J6226j1209
$$ plain form
14400 20150 10945 -628 -3092 8022 -655 -14096 -12654 -4157 -2979 -9384 -12217 -7570 -8533 1091
14386 1091 -2989 -171 -5444 -4935 780 7005 3324 -18985 -32831 -22480 -8052 5318 15049 6485
14372 6485 -13748 -21675 -7700 -1218 -14608 -23211 -23864 -11067 3160 -2402 -1680 2222 6105 16357
14358 16357 20819 4836 -4961 7406 10314 -3618 -11778 -7883 -8068 -12464 -13024 -10570 -3129 6883
14344 6883 14023 20572 18091 15500 8408 5194 4445 8171 967 -7162 -6481 -5889 1406 -1694 -4367
14329 -4367 -7397 -16989 -27296 -30392 -19216 -18282 -13683 -12848 -14976 -17773 -14864 -12202 -16724 -19941 -16223
14314 -16223 -11986 -15843 -17469 -26798 -39556 -53981 -32700 -22481 -25339 -26647 -27293 -26239 -13380
14301 -13380 -672 9740 5809 -2410 -5548 -18592 -13009 -19991 -16224 -20497 -8431 7795 -3414
14288c414o761N145P257M950o1l454O378j1614M853k425r729p797N266M228k608
14273i786J4757l54q485o023K957r084j2164k82J0173J2163J0795k92l305L793
14259D863M49R641o684p146O892J555j012j3126O924K756m126J4884k599Q757
14245B2028M259n64n217o25j491m271j5155j2945Q735k313p88N482j2471p262
14231b2598P523j0377L067J1263J0785L960j2273l367J819J902J0019M787j4302
14218g792m51J1196L964m743O991O975J3874m780J860M072O43K805K919N012J1129
14203E3674N721K19k149N831m221q000j7904k2442n040l325l67k028J702R904
14189A1575n915k276K973K3236R285n831k2484j1679l153J6257J0650l091p297
$$ plain form
14288 -3414 -10175 -5030 2227 7177 7116 3662 10040 -1574 3279 854 -8875 -16672 -11406 -7178 -9786
14273 -9786 4971 4617 -3868 -9891 -6934 -16018 -28182 -28464 -18291 -6128 4667 4375 1070 4863
14259 4863 5312 14953 8269 1123 8015 9570 8558 -4568 2356 5112 986 15870 13271 22028
14245 22028 26287 25723 20506 19881 18390 14119 -1036 -13981 -5246 -7559 -8347 -2865 -15336 -22598
14231 -22598 -15075 -25452 -22385 -11122 -337 3623 -8650 -12017 -10198 -8296 1723 6510 -7792
14218 -7792 -8243 2953 6917 2174 9165 16140 30014 25234 27094 31166 31809 34614 37533 42545 53674
14203 53674 59395 59614 57465 63296 59075 51075 33171 10729 5689 2364 1997 -31 1671 11575
14189 11575 5660 3384 6357 29593 38878 33047 10563 -1116 -4269 11988 22638 19547 12250
14176A2250K259M426j7615r564M43l788N377l5R593j964M240M436j066N484j4323
14161A53L742J945n327L1J517R325L424j5741k670K374j3717l771O047Q921p648
14146a1395j3617k201K2471J5127q498p687j2334k596P573r325m698Q383K840
14133a5957n967M921J1193P314n247K558M824q605k607K037P61L658J0611O971
14119A6465o501j2971j721M866L924j6166L950R634k382j453o915M045p35o071
14105a2031L447k612L761J5308j075j1381k188J894l300O717L826j2887p573R301
14091h793j764r90R717M024l758L510l423n959j0250N1M464j4790P585J5317m473
14076i532m071J498J5643R372N512j0401j7994J925J717o153L064O352p217l844
$$ plain form
14176 12250 14509 18935 1320 -8244 -7801 -11589 -6212 -6247 3346 1382 5622 10058 8992 14476 153
14161 153 3895 5840 513 544 2061 11386 14810 -931 -3601 -1227 -14944 -18715 -12668 -3747 -11395
14146 -11395 -25012 -27213 -4742 10385 1887 -5800 -18134 -20730 -13157 -22482 -27180 -18797 -15957
14133 -15957 -21924 -17003 -5810 1504 -3743 -1185 3639 -4966 -7573 -5536 -4775 -1117 9494 16465
14119 16465 9964 -3007 -4728 138 4062 -12104 -8154 1480 -902 -2355 -9270 -5225 -5960 -12031
14105 -12031 -8584 -11196 -7435 7873 6798 -4583 -6771 -4877 -8177 -1460 2366 -10521 -18094 -8793
14091 -8793 -10557 -11547 -1830 2194 -1564 1946 -1477 -7436 -17686 -17635 -13171 -27961 -20376 -5059 -9532
14076 -9532 -13603 -12105 3538 12910 18422 8021 -9973 -8048 -6331 -12484 -9420 -3068 -10285 -14129
14062a4129K112j0842J2696Q385j1359m037r407n46J2259K267n524N192J1104
14049a829O52n877L527J2104l746j0112K482P731n171m37K788j1406n713j427
14035a6434J1910K565L128l259j778Q949p188k1j2721l428n831J137j153m819
14021b8943P383O301L457j32j3415M951n853J1427J8722j5721k145K093n880j10
14007a7865P810k423j1152L666L391q304N9J7696J2099J0666Q829j6512j2380
13994d420q530l398p088j3407k118O691J2957J6989M176Q000o585j0895J5975
13981H347K865l289L668r666m599j586n739q225J0808J2490j2141L934J403J1055
13967I325Q898j252j4244M662o969m095N499M591j0543j0138J1300m47Q775m060
$$ plain form
14062 -14129 -12017 -22859 -10163 -1778 -13137 -17174 -26581 -27127 -14868 -12601 -18125 -12933 -1829
14049 -1829 -1177 -7054 -3527 8577 4831 -5281 -2799 4932 -239 -676 2112 -9294 -15007 -16434
14035 -16434 -4524 -1959 1169 -2090 -3868 5081 -2107 -2128 -14849 -18277 -24108 -22971 -24124 -28943
14021 -28943 -21560 -15259 -11802 -11934 -25349 -20398 -26251 -14824 3898 -11823 -13968 -11875 -17755 -17865
14007 -17865 -10055 -12478 -23630 -19964 -16573 -24877 -24818 -7122 4977 15643 24472 7960 -4420
13994 -4420 -12950 -16348 -23436 -36843 -38961 -32270 -19313 -2324 1852 9852 3267 -7628 8347
13981 8347 11212 7923 11591 1925 -2674 -4260 -9999 -18224 -7416 5074 -7067 -3133 -1730 9325
13967 9325 18223 16971 2727 7389 420 -3675 1824 6415 -4128 -14266 -2966 -3413 5362 1302
13953A302j5047r166J7510J197l092j3722M772J2623O847l027m649j3925n098
13940b3475Q19J2756J7138L709q091r472o759L106r63L943J4426l564p144K867
13926g04o48r359Q939k972j4446J6705m847n471N493n41K789R126l971j2185J588
13911a0504j412K628J5904k526O183K0029p351r98N617o252j6639j20n426N851
13897D984M44J251l199j0601M146k363J2473R521m950r228K32K304m844r024q482
13882a7336P636N948J6006J0019m114j1840j2541j8666R117P450L114m816J508
13869h515m993J157P370m279J697O960K122j0275o789P428P606k922p762p537
13855a8732L600J4158J0309J4394N847l754n132k58j5538j9250O548Q000m92k2312
$$ plain form
13953 1302 -13745 -22911 -5401 -4204 -7296 -21018 -16246 -3623 3224 197 -4452 -18377 -23475
13940 -23475 -22656 -9900 7238 10947 2856 -6616 -13375 -10269 -11232 -7289 7137 3573 -3571 -704
13926 -704 -1352 -10711 -1772 -4744 -19190 -2485 -7332 -12803 -7310 -7851 -5062 4064 93 -12092 -10504
13911 -10504 -11916 -9288 6616 4090 10273 30302 22951 21953 27570 21318 4679 4559 -867 4984
13897 4984 5428 6679 3480 -7121 -2975 -5338 7135 16656 11706 2478 2710 5014 170 -8854 -17336
13882 -17336 -9700 -3752 12254 22273 18159 6319 -6222 -24888 -15771 -8321 -5207 -10023 -8515
13869 -8515 -13508 -12351 -4981 -9260 -7563 -603 1519 -8756 -15545 -8117 -511 -3433 -11195 -18732
13855 -18732 -15132 -974 9335 23729 29576 25822 20690 20432 4894 -14356 -7808 192 -300 -22612
13841b2612K00J4691k963N116N613r638j2185n486L374Jk746o144Q434J6302J124
13826f919n783l792Q53P123J9050k736m569K921j34Q836R396j4498j1175k440
13812c867j3549l414J9518N724L017m829m599P173l267J1307M818o298j1987k385
13798b638k5119j0141J8527J2365M897m14M096m57r333P301N560J963o428J285
13784A464O52m488M762o946m437O146J7587j2921o978J7524P715K116O42L426
13770B6264n988j3184K35R305j0751j0669n922j1294P934J5192O858o856J399
13757B523O313q200j805k739k518R091N130p66m648o85J0999L133j3266r200P475
13742H37j0919r186P965N475Q732P309J1068L294o372P473L016j2593j4643r424
$$ plain form
13841 -22612 -22412 -7721 -10684 -5568 45 -9593 -21778 -27264 -23890 -23889 -26635 -32779 -24345 -8043 -6919
13826 -6919 -12702 -16494 -15641 -8518 10532 7796 3227 6148 6014 14850 24246 9748 -1427 -3867
13812 -3867 -17416 -20830 -1312 4412 7429 2600 -1999 5174 1907 13214 18032 11734 -253 -2638
13798 -2638 -27757 -37898 -19371 -7006 -2109 -2523 1573 1116 -8217 -916 4644 6607 179 1464
13784 1464 2116 -2372 2390 -4556 -8993 -2847 14740 1819 -5159 12365 20080 22196 22838 26264
13770 26264 20276 7092 7327 16632 5881 -4788 -10710 -22004 -14070 1122 7980 1124 2523
13757 2523 8836 636 -1169 -3908 -6426 2665 7795 7029 2381 1696 12695 15828 2562 -6638 837
13742 837 -10082 -19268 -11303 -5828 2904 10213 21281 24575 18203 25676 28692 16099 1456 -7968
13728g968R348N568k144Q82N030k506l565n182L152l888o153R713J342J834k443
13713C020o657l425P665Q192M89J5360j285k3452j5319q628R422J0287N101N654
13699F424j4138q928J3475O766L530n60J0652O227O45r025Q778O323p237k4591
13685a659Q374J746k446o38j482m103m037K661q073M116J7929O904l410O808J0830
13670C3520m272m175j2092q504P539J4572P780p035l779M278m771j3528j499m461
13656C573M057P783N863K123j8959p123R586l764N886m448m329J0143O139j2799
13642C731j3528l706K675M222L245M138p363P804P852k430j0907M128N907o499
13628g31j2046j939Q035J6989J0767j566O668j4014p515J041O335j733p272j3284
$$ plain form
13728 -7968 1380 6948 4804 5686 10716 8210 4645 -537 2615 -1273 -7426 2287 3629 5463 3020
13713 3020 -3637 -7062 603 8795 9284 24644 23359 -93 -15412 -24040 -14618 -4331 770 6424
13699 6424 -7714 -16642 -3167 3599 7129 6569 17221 23448 24093 15068 23846 30169 22932 -1659
13685 -1659 6715 8461 6015 5377 3895 -208 -4245 -1584 -9657 -5541 12388 19292 15882 22690 33520
13670 33520 29248 25073 12981 4477 12016 26588 34368 27333 23554 27832 23061 9533 8034 3573
13656 3573 7630 15413 21276 23399 4440 -2683 6903 3139 9025 4577 248 10391 16530 3731
13642 3731 -9797 -13503 -10828 -6606 -3361 777 -6586 1218 9070 6640 -4267 -139 5768 -731
13628 -731 -12777 -14716 -6681 10308 21075 19509 26177 12163 4648 5689 12024 10291 3019 -10265
13614a0265q550J6216K242N734J0486Q051j7353j6348m34N694m779p807K039N711
13600i363o867M462R260r92p293P09M684R267R413J060j0970J1363q811o991N387
13585D318J0835k806m052r291k665N891o178k030M59J0795J222J753N038m305
13571H984j5460m072N100K411J0826J0883o085k379K231p94L94m898l648m279
13557g86j1738O215K15N977P270q233m805N083m946q545K170J5932O995K675j3031
13542D48o393n69p735O766O326L754j1088L000K471o632Q574O690J0128m135o344
13527E261q141N71J3633L055q037L416O10q249p85j6273M274N665k583k968Q44
13512i707J132R476p549j1762Q187K169N825n460k5J5112P241j6182m463l402
$$ plain form
13614 -10265 -18815 -2599 -357 5377 15863 23914 6561 -9787 -10221 -4527 -9306 -17113 -15074 -9363
13600 -9363 -16230 -11768 -2508 -3500 -10793 -10084 -5400 3867 13280 14340 3370 14733 5922 -1069 4318
13585 4318 15153 12347 8295 -996 -3661 2230 -3948 -5978 -5519 5276 6498 8251 13289 8984
13571 8984 -6476 -10548 -5448 -3037 7789 18672 12587 10208 12439 11645 12039 7141 3493 -786
13557 -786 -12524 -6309 -6094 -117 7153 -1080 -5885 -802 -5748 -14293 -12123 3809 10804 13479 448
13542 448 -5945 -6514 -14249 -7483 -1157 2597 -8491 -5491 -3020 -9652 -1078 5612 15740 11605 5261
13527 5261 -2880 -2309 11324 14379 6342 9758 10368 2119 1334 -14939 -10665 -5000 -7583 -10551 -9707
13512 -9707 -8575 901 -6648 -18410 -10223 -8054 -2229 -7689 -7714 7398 14639 -1543 -6006 -9408
13498i408j517Q864K812K590m265L033j214M078K1811P352L687L231m183j4154
13484B2717k502o603j1282Q3O264k442k758Q678k941m192n744k424R959J2431
13470A9244j6903j3778K821l79O987k010j3086O265L823M720J3186l754p271j1260
13456a1395n726k12j0850J9002J8678N008p039k763Q726p302j6841K790k299P83
13442i440J935K502Q890Q200K913M682k893l491p383J11J2118n730j0664J50Q304
13427A0204M21j4494N096K075j4555Q12J2124Q043j1568k007N836L403n841L351
13413B900N767L938m752r629j811k398J514L397M637n584M638N88L01M843j826
13398F523N676J410K514J717j184j802p320j1821l436J344n19J763P779J952J1873
$$ plain form
13498 -9408 -10925 -2061 751 3341 -924 2109 895 4973 26784 34136 37823 41054 36871 22717
13484 22717 20215 13612 2330 2413 8677 6235 3477 12155 9214 5022 -722 -3146 6813 19244
13470 19244 2341 -11437 -8616 -8995 -2008 -4018 -17104 -10839 -7016 -2296 10890 7136 -135 -11395
13456 -11395 -17121 -17333 -28183 -9181 9497 14505 7466 4703 13429 6127 -10714 -7924 -10223 -9440
13442 -9440 -7505 -5003 3887 12087 15000 19682 16789 13298 5915 6026 18144 12414 1750 1900 10204
13427 10204 10625 -3869 1227 3302 -11253 -10441 1683 9726 -1842 -3849 1987 5390 -451 2900
13413 2900 8667 12605 7853 -1776 -3587 -5985 -4471 -1074 3563 -2021 2617 3205 3506 8349 6523
13398 6523 12199 13609 16123 17840 16656 14854 7534 -4287 -7723 -6379 -6898 -5135 2644 4596 16469
13383A6469N203J607j0883n974j5038l599P637P679M036J770q319M565l970j1934
13369a0751L366J3961M005o321n250k340k14p52J3463k892q923J427J1546k789
13355G536L291L080J7247m986j1215n372Q615m332k912J913p210M96q454N84P44
13340i75n877J755N376J6068q201j1794R051J2706o494l362m553n854J4065R643
13326B1554R451O159n970n138m594j0711o289J1049J1728n064l105o585k856Q430
13312A8059J5035n185r101o938n942L510K930l871r829k801l720P732L078N664
13298H621J0730J6054K0837K0635J8477L9313O2422L9368p762l7672m6934m2213
13286A01876k6638l1873j4313J49J6275J7743O7P101j024j1237R0j5102j0081
$$ plain form
13383 16469 21672 23279 12396 6422 -8616 -12215 -4578 3101 7137 8907 588 5153 1183 -10751
13369 -10751 -7385 6576 10581 4260 -990 -3330 -3544 -4296 9167 6275 -2648 -1221 10325 7536
13355 7536 10827 13907 31154 26168 14953 9581 18196 13864 10952 12865 5655 6151 -2303 -1719 -975
13340 -975 -6852 -5097 279 16347 8146 -3648 5403 18109 11615 8253 3700 -2154 11911 21554
13326 21554 31005 37164 31194 26056 21462 10751 4462 15511 27239 22175 19070 12485 9629 18059
13312 18059 33094 27909 18808 11870 5928 9438 12368 8497 -1332 -4133 -7853 -121 2957 8621
13298 8621 19351 35405 56242 76877 95354 134667 197089 236457 228695 191023 144089 101876
13286 101876 75238 43365 29052 29201 45476 63219 63286 70387 69363 58126 58216 43114 33033
13273C3033P953N668M041n34r454j0729K39l325m534m736N302q943p456j1105
13259d580O839J0075O729Q7k899r11M320J348J898j0805j1967n209L095k330Q13
13244c497P345R850n0J392Q07k267k562l030Q307k487K267r398q629N72J6425
13229A5045J0727j499j4331o577j2845L677J5931K908j3094r062R959k737r81
13216b879J7158M901M601r727q724p171j1320n527P604o675J2331M217r317r56
13202a1484P808p94J277m664J45j980R013m993P789J46j819O883Q484l991n110
13187F710q7j71n11P095o210J456N540o96j2091L633N38r53j0580P264N378l947
13171B368Q667J485m574M940J2233L619j584M993m042o239k813m685m621J1625
$$ plain form
13273 33033 40986 46654 50695 50161 40707 29978 30217 26892 22358 17622 22924 13981 6525 -4580
13259 -4580 2259 12334 19063 19150 16251 15340 19660 21008 22906 12101 134 -5075 -1980 -4310 -3497
13244 -3497 3848 13698 13648 15040 15847 13580 11018 7988 16295 13808 16075 6677 -1952 -1380 15045
13229 15045 25772 24273 9942 3365 -9480 -5803 10128 13036 -58 -9120 839 -1898 -2879
13216 -2879 14279 19180 23781 14054 5330 -1841 -13161 -18688 -11084 -17759 -5428 -1211 -10528 -11484
13202 -11484 -3676 -4470 -3193 -7857 -7712 -9692 -679 -5672 2117 2263 444 7327 15811 11820 6710
13187 6710 6623 6452 5941 13036 6826 8282 13822 13126 1035 4668 5206 4253 -6327 937 6315 2368
13171 2368 11035 12520 7946 12886 25119 28738 27154 32147 28105 21866 19053 14368 9747 21372
13157B1372J083n870o809K546M703Q512J124Q92j7399p868J596J3779k583L40
13143A5418N053m192Q250J7111j0950j0340j8138l343J0027p903N94P316o990
13130A913l890j878m407J8488J5823o520k631N346N56p584n683q208J216m733
13116b192J4372m451r181p986k059L473R574P271J552n447J824k094j714q344
13102e402p615J5052J2275P001J2653j1071j0693l507M531J580j4221j3303J5797
13089C077K2521m987j3736r531K191J3739R294J994k251n625m819j2559O740Q530
13075A4578q63j7714l220K735Q201J1386K230j2892m037M479J8726J4765l880
13062C4494j0567l158n075l362o187n264K038j640M594J78J742P993j606j201
$$ plain form
13157 21372 22455 16585 9776 12322 17025 25537 26661 27553 10154 2286 3882 17661 15078 15418
13143 15418 20471 16279 24529 41640 30690 20350 2212 -1131 8896 993 1587 8903 1913
13130 1913 -1977 -3855 -8262 10226 26049 19529 16898 22244 22800 15216 9533 1325 2541 -2192
13116 -2192 12180 7729 -1452 -9438 -11497 -8024 1550 8821 10373 4926 6750 4656 2942 -5402
13102 -5402 -13017 2035 14310 21311 33964 22893 12200 8693 13224 14804 583 -12720 3077
13089 3077 25598 20611 6875 -2656 -465 13274 22568 24562 22311 16686 11867 -692 6048 14578
13075 14578 13715 -3999 -7219 -4484 3717 15103 17333 4441 404 4883 23609 38374 34494
13062 34494 23927 20769 15694 12332 6145 881 2919 1279 5873 6051 7793 15786 14180 12979
13048A2979k905n853l510j962N514J3132N011o177R25j3160k109p391n18J6676
13034A0652o214j3374q317M914J7428P164P951L751m522j7116q039r732L233J5047
13020B826Q618K752R213O94n749L815J127o916r677o873P59L511J672p944K746
13005E74R059J7996J6927k154m505q806j9313r954Q894O704L396k0340n221j01
12991f844N700J3680j576O679l964J0005J1195n240q826j548Q384P166J0450j869
12977D3392j7995O114k778n166l317m340L061p42o781Q768k174l206K915J4276
12963C2027O106p991m461J0320p29k311Q219J0186r195p633J6579N418J908n874
12949E2569o89p907p529k805p742L107P639J198j7600j4874K717m401O561O528
$$ plain form
13048 12979 10074 4221 711 -1251 4263 17395 22406 16229 17154 3994 1885 -5506 -6024 10652
13034 10652 4438 -8936 -17253 -12339 5089 12253 20204 23955 19433 2317 -5722 -15454 -12221 2826
13020 2826 11444 14196 23409 24103 18354 22169 23296 16380 6703 -170 589 4100 5772 -2172 574
13005 574 9633 27629 44556 42402 37897 29091 9778 -176 8718 15422 18818 -1522 -6743 -6844
12991 -6844 -1144 12536 10960 17639 13675 23680 34875 29635 20809 19261 27645 34811 45261 43392
12977 43392 25397 31511 28733 23567 20250 15910 18971 18229 11448 20216 18042 14836 17751 32027
12963 32027 38133 30142 25681 36001 35272 32961 41180 51366 42171 34538 51117 56535 58443 52569
12949 52569 51880 43973 36444 33639 25897 29004 36643 37841 20241 5367 8084 3683 10244 16772
12935A6772m417J0843Q924j2003k876K014n899j907k165P042j200K205r33N018
12921B1418J2116l768n411Q419O486l116K690R985K6923N640K544j401P759O579
12907I6863J3567K6449L3000M3209L0492L2762K1385L0967L1580L3729N1698P4462
12895E20163J02046J16719R4180M7754J2476l880p782R54k7505j12096j41703
12884F01326j27352r2241p0562m7749l1223r758j883m649j5880k4865j3130P027
12872A69061J9730J7389M519J6110M5326L2921M3746N1516M1906L6191N6181Q7520
12860F22116J18668J48640J85012K81681M44652O71097R02782Q99862N32807J8067
12850D825384j79465k574J51736j01715o04675r09949r18208o90774m35692k73518
$$ plain form
12935 16772 12355 23198 32122 20119 17243 19257 13358 11451 9286 16328 15128 17333 16400 21418
12921 21418 33534 29766 24355 32774 39260 36144 38834 48819 75742 81382 83926 82525 90284 96863
12907 96863 110430 136879 169879 213088 243580 276342 297727 328694 360274 394003 445701 520163
12895 520163 622209 738928 833108 880862 893338 889458 881676 882630 855125 743029 601326
12884 601326 473974 381733 311171 263422 232199 222441 220558 215909 200029 175164 162034 169061
12872 169061 188791 206180 210699 226809 272135 305056 348802 400318 442224 478415 534596 622116
12860 622116 740784 889424 1074436 1356117 1800769 2471866 3374648 4274510 4807317 4825384
12850 4825384 4645919 4643345 4795081 4693366 4088691 3178742 2260534 1569760 1134068 860550
12840H60550j80003j11192q4704n6281m5988k9731k8068m2956k5848k1261l6812
12829A97706m4999k0810O909q416j9155j6478j0206o527k413j925j0118o068J1065
12816F8565L888j1501n948P337k5337%R792m12O968Q826O663j302q430o13n736
12801E2760n331j986N682R584K289q307j9949q149O099O04O761O337j0572o058
12787B9764q169k109N288k68P639j1932L601J8283J2524N713J173J0404J3553
12774H5464q926o416q880N416o14O051M970j1623k83M069m314k35j6295M883J5211
12759F8478K360l024O53K322p075j3779j2570J11P507l27N650J687j2349L970
12745D3614K3482J1471n097o713o538k035r6k521m996J3960J3965r546j1144R391
$$ plain form
12840 860550 680547 569355 484651 428370 382382 352651 324583 281627 255779 234518 197706
12829 197706 152707 131897 138806 130390 111235 94757 84551 78024 75611 73686 63568 57500 68565
12816 68565 72453 60952 55004 62341 37004 37004 46796 46384 53352 62178 68841 67539 59109 58496 52760
12801 52760 47429 45443 51125 60709 62998 54691 34742 26593 32692 33296 40057 46394 35822 29764
12787 29764 21595 19486 24774 24506 32145 20213 23814 42097 54621 60334 61507 71911 85464
12774 85464 76538 70122 61242 66658 66044 72095 77065 65442 65159 69228 64914 64679 48384 53267 68478
12759 68478 70838 67814 68467 70789 63714 49935 37365 37476 44983 44656 50306 51993 39644 43614
12745 43614 67096 78567 73470 66757 60219 58184 58088 55567 50571 64531 78496 68950 57806 67197
12731F7197P802R606j433N953M22K0126K1958K1129J1111K962P457L77J004M895
12717A80566R14k0554k3956j4962j5948j1785p308j0885j311J3265O425P164q772
12704I2853J078L509j769o184q885m240J6078R470n832K699K14j6713l587R855
12690H8546R970Q453m134l384k919j2085k307P492J1584n352K06j069O010j0128
12676I0883j0670N606p062J501J9042P921m820P634J5441n365J690n794r366j745
12662A04896l214j7658J852M695q570r179J2202J1631L960j9226o752J0186k194
12649H2629q235j0689Q575J6420o377n296j1360P224N946J331J215M02Q846j0200
12635H0431j4544n842j2894J138J0627R662M067o292p263O027j726Q670k54j758
$$ plain form
12731 67197 74999 84605 83172 89125 89547 109673 131631 152760 163871 166833 174290 174667 175671 180566
12717 180566 181480 160926 136970 122008 106060 94275 86967 76082 74771 88036 94461 101625 92853
12704 92853 93931 97440 95671 89487 80602 76362 92440 101910 96078 98777 98991 82278 78691 88546
12690 88546 98516 106969 102835 99451 96532 84447 82140 89632 101216 95864 96070 95001 101011 90883
12676 90883 80213 85819 78757 80258 99300 107221 102401 110035 125476 120111 121801 116007 106641 104896
12662 104896 101682 84024 85876 90571 82001 72822 85024 96655 100615 81389 74637 84823 82629
12649 82629 74394 63705 72280 88700 82323 77027 65667 72891 78837 80168 81383 81785 90631 80431
12635 80431 65887 60045 47151 48289 58916 68578 72645 66353 59090 65117 63391 72061 71807 70049
12621G0049k928O16J744N63J6868J9782J3092M078n533l88Q467Q638m240L534
12607A34342r52Q660J1865K43J632j930J4445K4483Q201n438j7598j9765j8149
12594A40039k4756k1187o415j6207j5634M309J47j0894J9838J4570J0514K025
12582I6349l076N140N550j127Q538M081J0228K2978K138j1322P308J0163O655
12569A63603l652K577K1293o210j5571N970O62O123M633P671m07J78M413J4201
12555B05484J9195J5314K1731J0774j8009N469J3373J4919J0975J0735m679M946
12543C10227J9983k207p749p448Q116K3903n139J9153K8119P244R318L7602K5953
12530D67075K0722K2825P312L44J2706L1636M3385L1757N0929L6564L7477M3259
$$ plain form
12621 70049 67121 67737 69481 70044 86912 106694 119786 123864 118331 117943 126410 135048 130808 134342
12607 134342 133390 142050 153915 154158 155790 153860 168305 192788 200989 195551 177953 158188 140039
12594 140039 115283 94096 87681 71474 55840 60149 60296 49402 69240 83810 94324 96349
12582 96349 93273 98413 103963 102836 111374 115455 125683 148661 150799 139477 146785 156948 163603
12569 163603 159951 162528 183821 177611 162040 168010 168672 174795 179428 187099 186692 186870 191283 205484
12555 205484 224679 239993 261724 272498 254489 259958 273331 288250 299225 309960 305281 310227
12543 310227 330210 328003 320254 312806 320922 344825 339686 358839 386958 394202 403520 441122 467075
12530 467075 487797 510622 517934 518278 530984 562620 606005 637762 688691 725255 762732 805991
12518H05991N4562O2244Q3469Q9774Q7732P3799N9686M0118M2450P3385O4508
12507A537718N6507M3595L6888P7969Q0358Q5472J05622J42910J60119J98898
12497B526056K22584K28584K62759L29263M05700N12238N97548P04969Q21381
12488F611082J060059J401173J831142K244551K481547K416680K196295K183941
12480B2426470K635063L433213M249798N166153O796248J0088333J5769106K3440141
12472I4004525K9303079K6286293J3184832q56102m999793K38559L822342l279814
12464A57703921j7732774k8223964k8940831k3269567j5951913j0278503o638906
12457B6667463m452011l221557k532242k067232j652736j292291j086996j083071
$$ plain form
12518 805991 860553 922797 1006266 1096040 1183772 1257571 1317257 1357375 1399825 1473210 1537718
12507 1537718 1594225 1637820 1674708 1752677 1833035 1918507 2024129 2167039 2327158 2526056
12497 2526056 2748640 2977224 3239983 3569246 3974946 4487184 5084732 5789701 6611082
12488 6611082 7671141 9072314 10903456 13148007 15629554 18046234 20242529 22426470
12480 22426470 25061533 28494746 32744544 37910697 44706945 54795278 70564384 94004525
12472 94004525 123307604 149593897 162778729 161922627 156922834 157161393 160983735 157703921
12464 157703921 139971147 111747183 82806352 59536785 43584872 33306369 26667463
12457 26667463 22215452 18993895 16461653 14394421 12741685 11449394 10362398 9279327
12449I279327j145764j151130j000645q13323o30981m86967m00171l18176k52798
12440C079372k33643k40325k02877j76120j58531j41029j42198j23980j14115
12431A546554r6220p9381n8330m8506n3333o5749o0861o6013l0637l9661k4732
12420I23131j9846l9304k8019k3131j2008k201k9421j1182n776n711l6195m0112
12408F70225m5238k5629k8120j7849j0160k1676j8687n914l193n613M521j16j4311
12395D78240j8301j8253j9493j0351N924M511n125k2993j4989j1455j0878J217
12383C58054n995j6349l799m951M362l83m961n240o047L072p423j6451k2156k2
12369B71711J750J377m140r457Q08L779j005R307p733p351p448K918q251j2081
$$ plain form
12449 9279327 8133563 6982433 5981788 5168465 4537484 4050517 3650346 3332170 3079372
12440 3079372 2845729 2605404 2402527 2226407 2067876 1926847 1784649 1660669 1546554
12431 1546554 1450334 1370953 1312623 1264117 1210784 1145035 1084174 1018161 987524 947863 923131
12420 923131 903285 863981 835962 812831 800823 798622 769201 758019 752243 746532 710337 670225
12408 670225 624987 599358 571238 553389 543229 521553 502866 496952 493759 488146 492667 492551 478240
12395 478240 459939 441686 422193 411842 417766 422277 417152 394159 379170 367715 356837 358054
12383 358054 352059 335710 331911 326960 331322 330939 325978 320738 314691 317763 310340 293889 271733 271711
12369 271711 273461 274838 270698 261241 262049 265828 264823 274130 266397 259046 251598 254516 246265 234184
12355B34184L110o254m677k4489P770J1808K4247K0041N22L292J627k0382j8985
12342B31814j0328l169r372j2495j0834k7842j8264k281l556O154Q527j2094j6708
12329A19552L005q31K27j3291j0755o96L111P272j89K632p090m330J5937J1646
12315A26200M164K570J1248L663j48j5087n004k0991N337J5765j647j0763q248
12302A07059J3948k751r6j032K238L987m335j2596j7833p878l165J4500J4493
12289A06539l447j9354k845J4099p805j7610R861Q580M25q172r307o234K083K308
12275F9121n856k2279r088K926m603l402j312N932K109m434M917j5771o308J004
12261A2956R047J9208J2411M628j3168r807J8036J1136j5421p166j6284m120O932
$$ plain form
12355 234184 237294 231040 226363 201874 209644 221452 245699 265740 266262 269554 271181 250799 231814
12342 231814 221486 218317 208945 196450 185616 157774 139510 137229 133673 139827 148354 136260 119552
12329 119552 122557 121726 121953 108662 97907 97211 100322 107594 107405 110037 102947 98617 114554 126200
12315 126200 130364 132934 144182 147845 147697 132610 127606 106615 111952 127717 126070 115307 107059
12302 107059 121007 118256 118160 117128 119366 123353 119018 106422 88589 80711 77546 92046 106539
12289 106539 103092 83738 80893 94992 87187 69577 79438 88018 88443 80271 70964 64730 66813 69121
12275 69121 63265 40986 31898 34824 30221 26819 25507 31439 33548 29114 34031 18260 11952 12956
12261 12956 22003 41211 53622 58250 45082 35275 53311 64447 49026 41860 25576 21456 28388
12248B8388N344j1209J0841N364j2525r677m13k682p871p123J0662l584J61Q825
12234A4501J0209Q036L054p829j8308M781M566Q032J8972M124k0252r792L55J3678
12220C4127k776J865M18o819o277J3259o203j037J0036j594l991Q427j3367j0957
12206A5111J0753N131m27R92P165k041k631J1408p284K389J3083O058o56p629
12192E1422k882m720L20N941k924m688j277l560K118Q691j883M989m885o272P580
12177D7970M262o519j3546k119k503P878J4356j71J7474J4529O150K544J4659
12164A04964L1711J8778j0423j3532j4007L101n446j5720j5570j1211j8145K504
12152E7004J5583Q254j2664j4879o733l689L749P050M795K755K947j3343m384
$$ plain form
12248 28388 33732 22523 33364 38728 26203 16526 16113 13431 5560 -1563 9099 5515 5676 14501
12234 14501 24710 32746 35800 27971 9663 14444 19010 27042 46014 50138 29886 20094 20449 34127
12220 34127 31351 33216 33634 26815 20538 33797 27594 26557 36593 34999 31008 39435 26068 15111
12206 15111 25864 30995 30568 31560 38725 36684 34053 45461 38177 40566 53649 59707 59051 51422
12192 51422 48540 43820 44140 50081 47157 42469 41192 37632 39750 48441 46558 51547 46662 40390 47970
12177 47970 52232 45713 32167 30048 27545 35423 49779 49608 67082 81611 87761 90305 104964
12164 104964 136675 155453 145030 131498 117491 120592 115146 99426 83856 72645 54500 57004
12152 57004 72587 80841 68177 53298 46565 42876 46625 53675 58470 61225 64172 50829 46445
12139D6445N561K77j0889p429J9609M588j7704q376K996r12m508P573K0958P578
12125F5767j5290j7296J194J0625J3423L34m732m537P055L155j386Q322J1163
12112G7797J6848J4696o45K87Q635K33R478K6491M0332K2091L3215N0300M0459
12099C40217L9468Q1887Q7470J16870J90520K79933L55489L93346L00038O9726
12089B254964j80037l36057l75799l33514k52689j65288j22314r1856n9125m3332
12079B94953k8966j0465k5643l2394l1280n004K004l61J2822J4564Q102K813J6591
12066B17736J5518Q107J43R547L0668L5830M6214O7678R9851J32692J57142K08835
12054A029961K75900L21590L21066K30647Q0988r4121k10111k72973k73045j81535
$$ plain form
12139 46445 52006 52283 41394 33965 53574 58162 40458 32082 35078 34166 29658 37231 58189 65767
12125 65767 50477 33181 34375 45000 58423 58757 54025 49488 56543 59698 58312 66634 77797
12112 77797 94645 109341 108696 108983 117618 117851 127329 153820 194152 216243 249458 299758 340217
12099 340217 379685 461572 549042 665912 856432 1136365 1491854 1885200 2185238 2254964
12089 2254964 2074927 1738870 1363071 1029557 776868 611580 489266 397410 338285 294953
12079 294953 265987 255522 229879 197485 166205 161201 163205 162844 175666 190230 198332 201145 217736
12066 217736 233254 241361 241504 251051 281719 317549 363763 431441 531292 663984 821126 1029961
12054 1029961 1305861 1627451 1948517 2179164 2260152 2166031 1955920 1682947 1409902 1228367
12044A228367p6012q205O044l3985o2794n7541k9909k6005m3908q7960j30004
12033F78088j25391j22689r5603o1937l0578k5058l1043k3769j2721j9150k0117
12022A10032q189k913m251j1370n29Q700q239M984j6458m887j1609p733P30j2377
12008C5891O635k020j171p956J0030K07p43q802m200J022P454N948l935j2751
11994B5609r771Q78L939M290M571L069P127p16p320l44o982p666R981J6882j045
11979D2502r229q11k923j8149o734P243N534j695J9493M331k0603j0982o048J6411
11965A8340J0400K820M241j013J2736j0419j482Q410l74r084p644J0287Q336j3480
11951C2074l706M325J4614R84j5670k620o185l022r520n61K653l471j242o193
$$ plain form
12044 1228367 1152355 1144150 1150194 1116209 1053415 995874 965965 939960 896052 808092 678088
12033 678088 552697 430008 334405 272468 241890 216832 185789 162020 149299 130149 110032
12022 110032 101843 98930 94679 83309 82780 91480 83241 88225 71767 66880 55271 47538 48268 35891
12008 35891 42526 40506 39335 31379 41409 41616 40873 32071 27871 28893 36347 42295 38360 25609
11994 25609 15838 16716 20655 24945 29516 32585 39712 38996 31676 31332 24350 16684 26665 43547 42502
11979 42502 33273 32462 29539 11390 4656 11899 17433 15738 35231 39562 18959 7977 1929 18340
11965 18340 28740 31560 35801 34788 47524 37105 35623 44033 43659 34575 26931 37218 45554 32074
11951 32074 28368 32693 47307 48291 32621 30001 23816 20794 11274 10713 13366 9895 8653 2460
11937B460J2713o553J898J2238K562J43j185j5244L883Q071j138O776J933r84
11923B7573N688k976q19j2189kn674j1853m941k594R105J5059k346J717k175J0525
11908B4098N074j015L035o021j0956J731Q924j648K134m413p12k697J7549J3033
11894D8116M202r254k515n246J445p703o964j2628p338q386j763j461M567Q533
11880C605l640L00n459J7933K1348N413k557k3065k40J4363J214J376M997m634
11866C0954m572j1663L184j731J4196j212j096J001q160j372J97k135L532R696
11852C0819J1081J4467r810j1339q903j0189M498N978K072L640l49J352j7929
11839A5388L892K703j728N016K504M454j1014m754Q63p614l757R556J1463j374
$$ plain form
11937 2460 15173 8620 10518 22756 25318 25461 24276 9032 12915 20986 19848 26624 28557 27573
11923 27573 33261 30285 29466 17277 17275 11601 -252 -5193 -7787 1318 16377 14031 15748 13573 24098
11908 24098 29172 28157 31192 25171 14215 15946 24870 23222 25356 20943 20231 17534 35083 48116
11894 48116 52318 43064 40549 35303 36748 29045 22081 9453 2115 -6271 -8034 -9495 -4928 3605
11880 3605 -35 265 -5194 12739 34087 39500 36943 13878 13638 28001 29215 30591 35588 30954
11866 30954 26382 14719 17903 16172 30368 29156 28060 29061 20901 19529 19726 17591 21123 30819
11852 30819 41900 56367 46557 35218 26315 16126 20624 26602 28674 32314 31965 33317 15388
11839 15388 19280 21983 20255 25271 27775 32229 21215 16461 17324 9710 5953 15509 26972 25598
11825B5598M932r846o291R064Q342m725j813L188J50N603j0280j0107J0220l801
11811B0234K808P103m771R28j3719L429n035K883O809L219l584m419p177Q818
11797A7526K044l031K967l596l834r045O4M952K125m571Q354J5517l107j4960
11783A1405J5276R695r367L399K3849n739k4624j2138M249m166J4111O425m666
11770B7709J026J630m58k684l760Q278J0572J564j112o040p813r20L419J6120
11756D7531n626j3421o365N951K996J72K272J0192R00N110K815m300M047J8409
11742G0683J4899M339N178r59O023J3278n709Q611J97q199j67L108J856r84K825
11727A14979k542L465J2393R125O416J3786j0108m476q697M305R99j0910K931
$$ plain form
11825 25598 30530 20684 14393 23457 31799 27074 25261 28449 28599 34202 23922 13815 24035 20234
11811 20234 23042 30145 25374 26302 12583 16012 10977 13860 20669 23888 20304 15885 8708 17526
11797 17526 19570 16539 19506 15910 12076 3031 3095 8047 10172 5601 13955 29472 26365 11405
11783 11405 26681 36376 27009 30408 54257 48518 23894 11756 16005 11839 25950 32375 27709
11770 27709 28735 30365 29907 27223 23463 31741 42313 43877 42765 36725 28912 27992 31411 47531
11756 47531 41905 28484 22119 28070 31066 31238 33510 43702 44602 49712 52527 48227 52274 70683
11742 70683 85582 89921 95099 94140 100163 113441 107732 116343 116540 108341 108174 111282 113138 112154 114979
11727 114979 112437 115902 128295 137420 143836 157622 147514 143038 134341 138646 139645 128735 131666
11714A31666J7021N162O010m760K1450J9229l695j6479j0337k702j2445p526J7271
11701A59865J6742j1608q188j8734N370J087m845j2452o03J049k25n371r206j2194
11687A00687k1538r746J2516J4496m38p115j532K599R598R829n660q336r499Q679
11673I4540n95o215k185N327J4986k511j2866q355k840J7156R902J9451J990L094
11659A30879p272r420N59J9778K405O532L751J215o759j6178J2165J3761J4356
11646A65772J5101J1991P84M695n239j6167L999o79N982j4625L812r985M21k588
11632A63274j3185j2316J6233q439k40o124J286K97o88r034r429O72Q161j0806
11618A19662j4780k467J2011J0138L09L861j4291r568j259k775J063l359j2919
$$ plain form
11714 131666 148687 153849 159859 155099 176549 195778 192083 175604 165267 162565 150120 142594 159865
11701 159865 176607 164999 156811 138077 143447 144534 139689 127237 126634 127683 127458 122087 112881 100687
11687 100687 79149 69403 81919 96415 95977 88862 87330 89929 99527 109356 103696 95360 85861 94540
11673 94540 93945 87730 85545 90872 105858 103347 90481 82126 79286 96442 106344 125795 127785 130879
11659 130879 123607 114187 114746 134524 136929 143461 147212 148427 141668 125490 137655 151416 165772
11646 165772 180873 192864 193648 198343 193104 176937 180936 180257 186239 171614 175426 165441 165862 163274
11632 163274 150089 137773 154006 145567 145327 139203 140489 140786 140098 131064 121635 122307 130468 119662
11618 119662 104882 102415 114426 124564 124873 128734 114443 104875 103616 100841 101904 98545 85626
11605H5626l855p625j0065k449K000Q724k066j3236q050m402j021k595J3135P19
11591E4840k64l02J1732J155j6260n683O540K860R078K786o9L50K907N767j6397
11576E9040j3150R159J9575j909n881L584P986J32j3881j1140J802J4916K8113
11563I8346j076j976N227l052r823o88o246j245Q905J2241j446q841M078L066
11549I7470n516o816o074m092Q949O576R197p996p445r472m038J0592Q216N371
11535I4922j295O627J3004J072K280l881l177m769q267L482K233K766N506L304
11521A13807J013P046J513l137Q321R73m935m963r679q764n542N945J295J0205
11507A13098N68p678o265q00J597r765j3891L935J7863M156N008J5495n868j6
$$ plain form
11605 85626 81771 74146 64081 61632 63632 72356 70290 57054 49004 44602 43581 40986 54121 54840
11591 54840 54576 54274 66006 67161 50901 45218 51758 54618 63696 66482 66413 66763 69670 75437 59040
11576 59040 45890 55049 74624 72715 66834 70418 78404 78536 64655 53515 55317 70233 98346
11563 98346 97270 95294 100521 97469 87646 86958 80712 79467 88372 100613 99167 90326 94404 97470
11549 97470 91954 85138 79064 74972 83921 90497 99694 91698 84253 74781 70743 81335 89551 94922
11535 94922 93627 100254 113258 114330 116610 112729 109552 104783 96516 99998 102231 104997 110503 113807
11521 113807 114820 121866 123379 120242 128563 129536 124601 119638 109959 101195 95653 101598 102893 113098
11507 113098 113666 105988 99723 98923 100520 90755 76864 80799 98662 102818 107826 123321 117453 117437
11493A17437q627n33n93r379j4928j392R075Q883L534k716J2655J520m315N027
11479A15648m09j4910r250L248k976R87j2279Q56J6701K779J0860Q673m949j3478
11465A01501r749J994O81p88l450r374Q496K0314L449l705K34p610l770L445J5770
11450A17438o901j150J0811k987J423O464P523l492q372M069O301k3792K735J0622
11436A20692l535K790J9510q305J860O723j2297n540p028o05j189R001K0071o804
11422A35344q252P17J2621J0448l601j1149N224J636r204j332q240k767J3123
11409A34568J678J4748J2004j3014j6552j3000q269j191N493N076N365n946K657
11396A23617R823L301O792J3307N071l119L423O105M371n203p445j0656n346N594
$$ plain form
11493 117437 108810 108277 107684 98305 83377 81985 91060 99943 103477 100761 113416 114936 110621 115648
11479 115648 115239 100329 91079 94327 91351 92338 80059 80915 97616 100395 111255 119928 114979 101501
11465 101501 91752 93746 94427 93639 90189 80815 89311 109625 113074 109369 109603 101993 98223 101668 117438
11450 117438 110537 109387 120198 117211 118634 125098 132621 129129 120757 124826 131127 107335 110070 120692
11436 120692 117157 119947 139457 131152 133012 139735 127438 121898 114870 114265 113076 122077 142148 135344
11422 135344 127092 127809 140430 150878 147277 136128 141352 142988 133784 132452 124212 121445 134568
11409 134568 136246 150994 162998 149984 133432 120432 112163 110972 116465 121541 126906 120960 123617
11396 123617 133440 136741 143533 156840 161911 158792 162215 168320 172691 167488 160043 149387 144041 149635
11382A49635l754Q637J0539O073L160L777L509q5K816N32m001O125J549l815K150
11367A86847J2652M038J0913J342N872J3289J2310R957J0080K759N413O192J1341
11354B93005Q797J3692O916L821O020J8450K2522J9455J5934J9671K6538K8231
11342D83052K6841L3936K1890L3563N0904M2782N3108N7820M4289N1769N4962
11331I54916N6414M4718O2501O6815N8216P0522Q6786R4263J12739J35027J52978
11320A895895J80252J90106K04464K53110K99802L72741M19561M89397O17268
11311D922596P56923R39767J134843J304112J360164J271527J022307O75031L57459
11302A3744729J24119K2428M0516J60083L72442N47606N68157M51813K19852m151
$$ plain form
11382 149635 145881 154518 165057 171130 174290 178067 181576 181491 184307 184839 180838 186963 188512 184697 186847
11367 186847 199499 203537 214450 215792 221664 234953 247263 257220 267300 270059 275472 281664 293005
11354 293005 301802 315494 322410 326231 332251 350701 373223 392678 408612 428283 454821 483052
11342 483052 509893 543829 565719 599282 650186 692968 746076 803896 848185 899954 954916
11331 954916 1011330 1056048 1118549 1185364 1243580 1314102 1400888 1495151 1607890 1742917 1895895
11320 1895895 2076147 2266253 2470717 2723827 3023629 3396370 3815931 4305328 4922596
11311 4922596 5679519 6619286 7754129 9058241 10418405 11689932 12712239 13387270 13744729
11302 13744729 13868848 13891276 13931792 14091875 14464317 15011923 15580080 16031893 16251745 16247594
11292A6247594j04055j7880J65121L97194O67272R27348J214058J524634J822358
11283B2843644K029559J980780J617098R30064M7651p90560j366571j535902j357499
11274B4398264j029137p37461n75741n12894n37409n79449n72529m90144l59588
11265A9003912k28973j67932j64323k22838k99633l17512l16955l03199l84704
11256A6597843n59640p18478p87367p44899n94167m52662m15715m71029n93926
11247A1259960o60677o29414m93198l09702q5496J80280M05905N85388P13666
11238A0966712P04582O38637N53131N70611O53060P69414Q05333P33225N91681
11229A6986386M54716L75698L72608M10289M18746L44919J97565L4280p7102m243
$$ plain form
11292 16247594 16143539 16125659 16290780 16687974 17355246 18282594 19496652 21021286 22843644
11283 22843644 24873203 26853983 28471081 29401145 29448796 28658236 27291665 25755763 24398264
11274 24398264 23369127 22631666 22055925 21543031 21005622 20426173 19853644 19363500 19003912
11265 19003912 18774939 18607007 18442684 18219846 17920213 17602701 17285746 16982547 16597843
11256 16597843 16038203 15319725 14532358 13787459 13193292 12740630 12324915 11853886 11259960
11247 11259960 10599283 9969869 9476671 9166969 9081473 9261753 9667658 10253046 10966712
11238 10966712 11671294 12309931 12863062 13433673 14086733 14856147 15661480 16394705 16986386
11229 16986386 17441102 17816800 18189408 18599697 19018443 19363362 19560927 19595207 19518105 19513862
11219A9513862K53516N72771Q01337Q53781P66824O48725N72547O01754Q14848
11210B5399965J199792J595957J787071J569115Q81487j05073j068707j729338
11202B9530269k003530j975288j759379j510072j245418r53491o46390l24751
11194A9111950q0274l4948k40974n79755q40893q92246p23073m23027j33405N1003
11184A5214358K0301k41049n83948r65087j297258j491867j539832j441893j259979
11175F413746j019485q09803o48133n05852l82972l03401k30806j83426j39899
11166B189969j24163j17924r8860r9724q5178p6479p6144p5672p0849n4877q7365
11155A222734j10624p2170n5034o0912n5002n2189m3829k5946m0116k0757j8714
$$ plain form
11219 19513862 19767378 20340149 21141486 21995267 22762091 23410816 23983363 24585117 25399965
11210 25399965 26599757 28195714 29982785 31551900 32433387 32328314 31259607 29530269
11202 29530269 27526739 25551451 23792072 22282000 21036582 20083091 19436701 19111950
11194 19111950 19031676 18996728 18755754 18175999 17335106 16442860 15719787 15296760 15163355 15214358
11184 15214358 15234659 14993610 14409662 13444575 12147317 10655450 9115618 7673725 6413746
11175 6413746 5394261 4584458 3936325 3430473 3047501 2744100 2513294 2329868 2189969
11166 2189969 2065806 1947882 1849022 1749298 1664120 1587641 1511497 1435825 1364976 1310099 1222734
11155 1222734 1112110 1039940 984906 923994 868992 816803 772974 747028 706912 686155 667441
11144F67441j5965R5j1700q840k5878p646j0464j1267j4014k2472j7138j5052
11132E07100k3719q501k0303j5857j8711j7506j1407m162R99p609o660q142r352
11119C56170j7247k498l208N002r59M155o438j4779j2218m185n562l128j4791
11106B80314k1029J0063k468k0865r272J8382P668O551l599k1192k2532p141L359
11093B18239N150m320j175r232k716l280m660J5879J1056N953j0874j7930j2486
11080A89604Q982P148j3023p985o791o985J3642k760j3166j4552j0034m210j809
11067A38061L757O201P111J6694k92j2280r137n195R079n110k848L98n117p179
11053A34143J2992K492p561M068J5580J9307m799m561J18J6357L339p179m683
$$ plain form
11144 667441 651476 651571 639871 631031 605153 597507 587043 575776 561762 539290 522152 507100
11132 507100 483381 474880 454577 438720 420009 402503 391096 386934 387933 380324 373664 365522 356170
11119 356170 338923 336425 333217 338219 337260 341415 334977 320198 307980 303795 298233 295105 280314
11106 280314 259285 269348 266880 246015 236743 255125 262793 269344 265745 244553 222021 214880 218239
11093 218239 223389 219069 217894 208662 205946 202666 198006 213885 224941 230894 220020 202090 189604
11080 189604 198586 205734 192711 184726 177935 170950 184592 181832 168666 154114 144080 139870 138061
11067 138061 141818 148019 155130 171824 171532 159252 150115 144920 153999 148889 146041 146439 141322 134143
11053 134143 147135 149627 142066 146134 161714 181021 176222 171661 171779 188136 191475 184296 179613
11040A79613J1293M935P396Q020j3148q948j6479j8522j0105j3412j8160n039
11028A07444K343K31k015J087j7513j451J2481M021P145N509K56j470O874L061
11014A28003n736J3485J1380j3887N496L2897K5020j374o657j1803j1149j5227
11002A50448k6443j5805m23k201j50J6222m020N071J1551R016r831j6441j1780
10989A05214o692N918o771j9809O522n701n942J1682N305N728P291J994r141j0226
10975H5372l608J712J16m236j2917J1050M521J333O620j4410j5724R163K6832
10962I5824J4617L006n89j998q939n132Q371N473j860j8600j9354p638M144P153
10948G4478M980j0644k292N620K363J3196K9470L9994K4428J109k5235j7616J5801
$$ plain form
11040 179613 190906 195841 203237 211257 198109 189161 172682 154160 144055 130643 112483 107444
11028 107444 109787 110018 108003 109090 91577 90126 102607 106628 113773 119282 119538 118068 124942 128003
11014 128003 122267 135752 147132 133245 138741 171638 196658 195284 188627 176824 165675 150448
11002 150448 124005 108200 107777 105576 105426 121648 117628 122699 134250 143266 133435 116994 105214
10989 105214 98522 104440 97669 77860 84382 78681 72739 84421 89726 95454 102745 104739 95598 85372
10975 85372 81764 83476 83592 79356 66439 77489 82010 83343 89963 75553 59829 68992 95824
10962 95824 110441 113447 112858 110860 101921 96789 105160 110633 108773 90173 70819 63181 67325 74478
10948 74478 79458 68814 66522 72142 74505 87701 117171 157165 181593 182702 157467 139851 155652
10935A55652q45k502r528j6652J631J977m440o633J1281O489O170J720O420Q301
10921A59041J4798K2355J7759K2852L6827L1897L4338O0720Q0703Q9513O9547
10910F40350K7682k7309o0293p8058p1935o3197n6303m6553k4135j2058k7955
10899B00236j8635N807n539q189K020M098m555K0158J4923M301j5232m815j750
10886A92828O675L940O85N69P532K3357J7219j799K0838L4146L1359M0649M1789
10873D19787O3288P4629O4901M8394K2306j6018m8605o6778o2889l7897m3972
10862D17146k2444j2354p614m804m863n999p024M030K6569J4692J0316M1960M4367
10849D93978M7383O3907P2766R8886J57944K45665L67956M57781L28029l5813
$$ plain form
10935 155652 154807 152305 142777 126125 127756 129733 125293 118660 129941 136430 142600 144320 150740 159041
10921 159041 173839 196194 213953 236805 273632 305529 339867 400587 481290 570803 640350
10910 640350 668032 640723 580430 502372 430437 367240 310937 264384 240249 228191 200236
10899 200236 181601 187408 181869 173680 175700 179798 175243 195401 210324 214625 199393 194578 192828
10886 192828 199503 203443 204128 204697 212229 235586 252805 251006 271844 305990 337349 377998 419787
10873 419787 483075 557704 622605 670999 693305 677287 628682 561904 499015 461118 417146
10862 417146 394702 382348 374734 369930 365067 359068 352044 356074 382643 397335 407651 449611 493978
10849 493978 541361 605268 678034 776920 934864 1180529 1548485 2006266 2334295 2298482
10839B298482l35407m45844l90033k60974j65809j19659q3279m8972l3577k5983
10829C88945k3232k629L947m418j6233j300n598r084j8350j2368K307j0927j2294
10816B78766J3829O472k4133k2136q806j9087n715j3875j3113J327J2308L1201
10804B37038K4092K611p750J3462K583q290k453N859p13j0904K455J4878M521
10791B77389j106J8847J8583K1461J8529R457M08K6762N1895M0229R277o979l5222
10778D49530m2969m8356l2489o572n180P745R693J172j2029r64m62p913p975L897
10764C07128p531j1390j3737n766J163R99N886n41K16o624J1378J7956O44l981
10750B95800p504p708J593K358q838j1002k0328j7703o892j1595r544j299j010
$$ plain form
10839 2298482 1963075 1517231 1127198 866224 700415 580756 497477 448505 414928 388945
10829 388945 365713 363084 367031 362613 346380 345080 339482 330398 312048 299680 301987 291060 278766
10816 278766 292595 299067 274934 252798 243992 224905 219190 205315 192202 193529 205837 237038
10804 237038 261130 263741 255991 269453 272036 263746 261293 267152 266439 255535 257990 272868 277389
10791 277389 276283 295130 313713 335174 353703 363160 363568 390330 442225 482454 491731 484752 449530
10778 449530 406561 358205 325716 319144 313964 321709 331402 332574 320545 319581 319119 311206 303231 307128
10764 307128 299597 288207 274470 268704 269867 270866 276752 276211 276427 269803 281181 299137 299781 295800
10750 295800 288296 280588 282181 284539 275701 264699 244371 226668 219776 208181 198637 197338 196328
10737A96328l042r794K307J7679J9526K4308K9183N3716P8052N5652q678n9296
10725C95941o3525n8137l9093j0375R707O4k656J0277q454j6142p728J4857K4500
10712B49236J7437J4793J769l169P850J006M892l201l0122j8535j004r659Q88
10699B32181r0l794m55P70J5655N179M58P061j5515j3736M499P794P162j3524
10685B33645j0993J0601P137R083J2497J6146L8460N8214P6242M2489k1786m0553
10673D31182l3380l9565l7454l5147j7015j3978j2510j126j8652k1136l335k324
10661A95560Q634J7372J0446J5438N162j012J2676M688P337K786L533j2798P474
10648B77296K241j4352k1780M740J1111O518j660K5O629J226O474J4278O239p645
$$ plain form
10737 196328 193286 183492 185799 203478 223004 247312 276495 330211 408263 463915 455237 395941
10725 395941 332416 274279 235186 224811 234518 234582 231926 242203 233749 217607 209879 224736 249236
10712 249236 266673 281466 283235 280066 287916 288922 293814 290613 260491 241956 240952 231293 232181
10699 232181 232091 228297 227842 228612 244267 249446 249904 256965 241450 227714 232213 240007 247169 233645
10685 233645 222652 233253 240390 249473 261970 278116 316576 374790 451032 493521 471735 431182
10673 431182 397802 358237 320783 285636 268621 254643 242133 241007 222355 201219 197884 195560
10661 195560 204194 221566 232012 247450 252612 251600 264276 268964 276301 279087 282620 269822 277296
10648 277296 279537 265185 243405 248145 259256 265774 264114 264139 270768 271994 278468 292746 298985 291340
10634B91340n082K1068K1917L270Q56L411J1695J1209K516N418j0998o059j3356
10621C37205N731n447j9588l1022j0010n884m667O657K6880J6878J4389l068n355
10608C22699n259o891j1811k735P283J4086J7012J8674K1838P685R359O818R51
10595C99709m52p845q866j050P325M636K1988J3217n785J979N530R685n292o953
10581D27826j4466j9771n098k223J1998K8863L5037L2692J9995K7844K5871L9748
10569F08316L5266L4657M5577M8644L0301j294j7529j5977J770R198J3531K1025
10557H13485M1442N1693O1729N4575M6162P4085O3562L5555L182m1710o5915o6510
10545A071335j9554K1432L4828M4854M5088O2116Q7085R1725Q2109P7521Q8638
$$ plain form
10634 291340 286258 307326 329243 332513 333369 336780 348475 359684 362200 367618 356620 350561 337205
10621 337205 342936 337489 317901 286879 276869 270985 266318 272975 299855 316733 331122 328054 322699
10608 322699 317440 310549 298738 296003 303286 317372 334384 353058 374896 382581 391940 398758 399709
10595 399709 399257 391412 382546 381496 388821 393457 415445 428662 422877 424856 430386 440071 434779 427826
10581 427826 413360 393589 388491 386268 398266 427129 462166 494858 514853 542697 568568 608316
10569 608316 643582 678239 723816 772460 802761 801467 783938 767961 769731 778929 792460 813485
10557 813485 854927 906620 968349 1022924 1069086 1143171 1206733 1242288 1245470 1203760 1137845 1071335
10545 1071335 1051781 1073213 1108041 1152895 1197983 1260099 1347184 1438909 1521018 1598539 1687177
10534A687177J42492J75067J95815K15451K42445K86705L55903M59692O09451
10525D370198Q78853J370916K178610L052614K915460P88915j602535k556937
10517A1396094k247879j339848n18582K8421M26853P90350J121778J380999J574066
10508A2612252J777375K067349K546678L307707M454388O146967Q636454J2017492
10500E3566662J5490526J6896156J3459388M680749o058673j4006258j6889201
10493F7139349j5577184j2293518q890133o146922m218291k906312k036828j512615
10485A3557546j209641j041351r25383p94324o26038m41082k56470m9942J36098
10476H349413K66390L76600M77672O25969Q30267J044182J249319J452232J666392
$$ plain form
10534 1687177 1829669 2004736 2200551 2416002 2658447 2945152 3301055 3760747 4370198
10525 4370198 5249051 6619967 8798577 11851191 14766651 15555566 13953031 11396094
10517 11396094 9148215 7808367 7289785 7318206 7745059 8535409 9657187 11038186 12612252
10508 12612252 14389627 16456976 19003654 22311361 26765749 32912716 41549170 53566662
10500 53566662 69057188 85953344 99412732 104093481 98034808 84028550 67139349
10493 67139349 51562165 39268647 30378514 24231592 20013301 17106989 15070161 13557546
10485 13557546 12347905 11306554 10381171 9586847 8960809 8519727 8263257 8213315 8349413
10476 8349413 8615803 8992403 9470075 10096044 10926311 11970493 13219812 14672044 16338436
10467A6338436J956778K385521L038281M003216N400865P247610R503940J1745066
10459F1619713J3055724J2314314Q859182K950564l957846r882298j3318014j3823550
10451E7817789j2137964r473138o830390m667263l069773j938794j111186m69282
10443A8119999N7563M81378P48236Q64186J015915J393056K023092K838903L645722
10434C1188050M372046N305566O768116Q886271J1952686J6882032K5304040L9553342
10426A50212149O1941843Q7719707Q7500283K5606101n0055574q4819904q3705409
10419A94399196o0451778l8511922k4629500j6372251j1336721q167252o059784
10412B8869988m590740l477078k628149j984499j460514j137241j092712j237894
$$ plain form
10467 16338436 18295214 20680735 23719016 27722232 33123097 40370707 49874647 61619713
10459 61619713 74675437 86989751 95848933 98799497 94841651 84959353 71641339 57817789
10451 57817789 45679825 36206687 29376297 24709034 21639261 19700467 18589281 18119999
10443 18119999 18177562 18658940 19407176 20271362 21287277 22680333 24703425 27542328 31188050
10434 31188050 35560096 40865662 47633778 56520049 68472735 85354767 110658807 150212149
10426 150212149 212153992 299873699 387373982 412980083 362924509 278104605 194399196
10419 194399196 133947418 95435496 70805996 54433745 43097024 34929772 28869988
10412 28869988 24279248 20802170 18174021 16189522 14729008 13591767 12499055 11261161
10404A1261161j255349j087097q51242o57593n13347m72633n00552n04840m52715
10395D965793l74553l35787k98241k59664k61527k24792j80994j58767j34710
10386B736758j17708j33141j30191j10895q5673n0814o7708q2223q2941j05723
10376A769741j11455q5314n1269l5329q769J209O558r225j9798l2248n3589n4865
10364A315647n5376k9470n8341m6849l8698n1315k8802L516J7466J1378m082k4393
10352A010681l4152p655j1228j7244k4996k6053l7619l9306j5654j3904j0723
10341G72147j6276O05q500K027J866J48j5366o566L443M252k413j731j3714j2477
10327G07445k4655j3512k0106j6458l2206j6649o514j5867j6567N695Q680l689
$$ plain form
10404 11261161 10005812 8918715 8067473 7409880 6896533 6423900 5923348 5418508 4965793
10395 4965793 4591240 4255453 3957212 3697548 3436021 3211229 3030235 2871468 2736758
10386 2736758 2619050 2485909 2355718 2244823 2159150 2108336 2040628 1958405 1875464 1769741
10376 1769741 1658286 1572972 1521703 1486374 1477605 1478814 1485372 1476147 1456349 1424101 1370512 1315647
10364 1315647 1260271 1230801 1172460 1125611 1086913 1035598 1006796 1010312 1027778 1039156 1035074 1010681
10352 1010681 976529 968874 957646 940402 915406 889353 851734 812428 796774 782870 772147
10341 772147 755871 756476 747976 750003 751869 752017 736651 730085 733528 737780 735367 733636 719922 707445
10327 707445 682790 669278 649172 632714 600508 583859 577345 561478 544911 550606 559286 555597
10315E55597m326l449j808n293j4410J180j957m779m802K1283J4504J2635K6495
10302E90870K2530L6002K7808K0522j1453n9283q1879p8052n4206n2634m1829
10291C18396q178J3778P215K4229K4212K8050J3377Q997J310L2661P7414J34362
10279F75823K12600J78090l9042j49302j66998j08008k1811n691k793j3366l3979
10268E25523l9857l0971j8892j6165k8499o942q680j8089j2467r255j2872Q14
10256C23648J896j6271j5150p230j8044k3371p828j0679j6633j942J1795K3488
10244B43679L4253L2188P632j1722j8900l4004k4555P655J5954r60J2504J4590
10232B78314Q995r74k0699j5495l5904l0930j6708J4797M4334M4201J1637L649
$$ plain form
10315 555597 551271 547822 546014 540721 526311 527491 525534 520755 515953 537236 551740 564375 590870
10302 590870 613400 649402 677210 697732 686279 626996 545117 467065 412859 360225 318396
10291 318396 310218 323996 331211 355440 379652 407702 421079 430076 431386 464047 541461 675823
10279 675823 888423 1066513 1027471 878169 711171 603163 581352 575661 572868 559502 525523
10268 525523 485666 454695 435803 419638 391139 384197 375517 357428 344961 335706 322834 323648
10256 323648 325544 309273 294123 286893 268849 245478 237650 226971 210338 208396 220191 243679
10244 243679 277932 310120 317752 306030 287130 253126 228571 236226 252180 251220 263724 278314
10232 278314 287309 286335 265636 250141 214237 183307 166599 181396 225730 269931 281568 285217
10220B85217J3258M166j3888j7801j7929j6904j2087j4637M873m553r910j0381
10208A89424J0867P527K622J7258P061O031P610N666j3486k3898o197l633j5262
10195A91590k1521j7573j6588q986N65J575m675o626O254K1418K1470o93l981
10182A62229r80o742l739n350Q29j2505o062l789K0524J8427Q41r565l856M506
10168A54768O296N134o880O420j352R979J1559j0517j292l34j108O971J2272L796
10154A95712Q342K8159K4287P126L690K4906K4697K1567K2742J6133m773l0726
10142C41862k3488j1588r918j3365j736q983n627N41l972L283J2810K0120K013
10129C01952q161j0439k1088j3868k0374j9979j4618q344m587o175m933q936p076
$$ plain form
10220 285217 298475 302641 288753 270952 253023 236119 224032 209395 214268 209715 199805 189424
10208 189424 200291 207818 210440 227698 234759 240790 248400 254066 240580 216682 210485 206852 191590
10195 191590 170069 152496 135908 126922 127487 129062 124387 117761 124015 145433 166903 166210 162229
10182 162229 161249 154507 150768 145418 146247 133742 127680 123891 144415 162842 163683 154118 150262 154768
10168 154768 161064 166198 159318 165738 164386 174365 185924 175407 174115 173781 172673 179644 191916 195712
10154 195712 204054 232213 256500 263626 267316 292222 316919 338486 361228 377361 372588 341862
10142 341862 318374 306786 296868 283503 281767 272784 267157 267698 263726 267009 279819 299939 301952
10129 301952 293791 283352 262264 248396 228022 208043 193425 185081 180494 174319 169386 160450 153374
10116A53374o764J1071J1880K517J4527K4236M698Q166k977N64K1958J4161L4784
10103B92195M2274K9610J1990L364j4209j1806j3825l644o874k5352k2014j6976
10091B64733k7789r594N830J6773J2738J9120K2667M1515M8467O2992P6831Q8891
10079F23174P1414L0239Q101k3285m9570m7541n8838m4040l8956m7873j5049m337
10067D03439n016q32K0470K8963K3266L9672O0081O1556N6483M9024O7675P6732
10055H81513Q0465J38688K16809K86845L01922J21923j47869l10547l38056k67881
10045I63812j78138r9590n8092l7292J5442L5262M6979M0014K6389j1228m2564
10034G00994n1132p1998p5611n5965m5222n8905n4475k6079j1349j1840p266L120
$$ plain form
10116 153374 146610 157681 169561 172078 186605 210841 215539 223705 220728 221292 243250 257411 292195
10103 292195 334469 364079 376069 379433 365224 353418 339593 335949 329075 303723 281709 264733
10091 264733 236944 227350 233180 249953 262691 281811 304478 345993 394460 457452 534283 623174
10079 623174 694588 724827 732928 709643 660073 612532 553694 509654 470698 422825 407776 403439
10067 403439 398423 397591 418061 447024 470290 509962 570043 631599 688082 737106 804781 881513
10055 881513 961978 1100666 1317475 1604320 1906242 2028165 1880296 1569749 1231693 963812
10045 963812 785674 686084 627992 590700 606142 641404 688383 728397 754786 743558 700994
10034 700994 649862 577864 502253 446288 401066 342161 287686 261607 250258 238418 231152 234272
10022B34272j044j6837K20k166q340l566K0981K9933O049J1652K9110L3615K3340
10009C57219K1519M5387N5324P8177R6615J58700K36787L46820M77969L89750
9999B264267M0142l08668m61776m07062k74246j77922j32837q1842o2792n0572
9989C46692k9574k7980l6345k5251n953p865k33N900n319J977P997j2733j4898
9976A96415j9879l779L081J749L595P894j413j0506J2511M0432K1298j7817k5184
9963B08397l728J659q652j645L952o124j5789j5592K746J4274J0769Q909J170
9950B00346m928M001K1024Q261p681j2667K540K1391J9043L7184L8613L0667K2536
9937C80330J0020n291l1342l6118k5315k2210j3591k1914k7950p606M897k119
$$ plain form
10022 234272 233228 216391 216611 214445 206105 202539 223520 253453 259502 271154 300264 333879 357219
10009 357219 378738 424125 479449 557626 654241 812941 1049728 1396548 1874517 2264267
9999 2264267 2304409 1995741 1533965 1126903 852657 674735 541898 460056 397264 346692
9989 346692 317118 289138 252793 227542 221589 213724 213491 219391 214072 216049 224046 211313 196415
9976 196415 176536 172757 175838 177587 181182 189076 187663 177157 189668 230100 251398 233581 208397
9963 208397 204669 206328 197676 196031 199983 193859 178070 162478 165224 179498 190267 199176 200346
9950 200346 195418 199419 220443 228704 221023 208356 210896 232287 251330 288514 327127 357794 380330
9937 380330 390350 385059 353717 317599 292284 270074 256483 234569 206619 199013 203910 201791
9925B01791n28l739J468l345o465p605Q052j560P334r61o323k980L663J7193K06
9910B06201J5092j710r72P823P356J0693J4041J1716k32N576J3414J7793L2736
9897C39527L7102L4390N2222M7646K0747K951j6937m6970n0324n2000j8668n268
9885C44418j1964q963L660N804m10L771M69O962j440J0105Q089N98j379L724l028
9870C60416p54N316N351O344j055J9494J8053J2937K276M477P290J1280J9135
9857D70560O601K2729K4449K5832K9063L1033L5240L7192K9647M9016O9241N5743
9845H86346O2636O7647P4470R8001J13181J33325J65593J91170K25034K67742
9835B285145K95509L39657M01747M57902N06400N67584O72391Q10692R45102J104206
$$ plain form
9925 201791 201263 197524 198992 195647 189182 181577 189629 188069 195403 194442 188119 185139 188802 205995 206201
9910 206201 221293 219583 218611 226434 233790 244483 258524 270240 270008 275584 288998 306791 339527
9897 339527 376629 411019 463241 510887 531634 534585 517648 470678 420354 368354 349686 344418
9885 344418 332454 323491 327151 332955 332545 336316 336785 343747 342307 352412 360501 361099 359720 363444 360416
9870 360416 359662 364978 370329 376673 375618 395112 413165 426102 428378 432855 440145 451425 470560
9857 470560 477161 499890 524339 550171 579234 610267 645507 682699 712346 761362 830603 886346
9845 886346 948982 1016629 1091099 1189100 1302281 1435606 1601199 1792369 2017403 2285145
9835 2285145 2580654 2920311 3322058 3779960 4286360 4853944 5526335 6337027 7282129 8386335
9825H386335J282703J470113J638834J751944J735885J482331R55871K95859l62576
9816A8637299q31529j047793j003854q03588n63479k90075J537K65331M89186
9807A4853035O17149O56773O57068N86394L45779r1729n99619j005528j212323
9798A4806999j257332j146744j002481r18514r05886r19732r05622q70027p89336
9789F091325o98075o12436n40978m63006l62364k88666k14108j38744r8675m2608
9779B631665p567K7299N7106P8606P8849O3644O3998Q4207Q8368R8887J15014
9768C380076J41374J89329K54172L27350M02099M95940N83596P09637Q63330J028927
9758H375830J230808J418877J589555J722718J866419K088415K385317K666172
$$ plain form
9825 8386335 9669038 11139151 12777985 14529929 16265814 17748145 18704016 18999875 18637299
9816 18637299 17805770 16757977 15754123 14950535 14387056 14096981 14098518 14363849 14853035
9807 14853035 15470184 16126957 16784025 17370419 17716198 17624469 17024850 16019322 14806999
9798 14806999 13549667 12402923 11400442 10481928 9576042 8656310 7750688 6880661 6091325
9789 6091325 5393250 4780814 4239836 3776830 3414466 3125800 2911692 2772948 2674273 2631665
9779 2631665 2624098 2651397 2708503 2787109 2865958 2929602 2993600 3077807 3166175 3265062 3380076
9768 3380076 3521450 3710779 3964951 4292301 4694400 5190340 5773936 6483573 7346903 8375830
9758 8375830 9606638 11025515 12615070 14337788 16204207 18292622 20677939 23344111
9750B3344111K868574K870316K645814K169768J437792N97373j17213n91419q31280
9741C4393836q73306p39924n14006k73342p9598J14579L25578M34505L76319K69487
9731C3434128J70200k931m03890r26138j490294j930076k203980k336767k341838
9722B1968414k251938k128073k012827j905873j769645j599252j424331j217848
9714G658627r83942q03928o63621n25827m00771l30795k57854j90222j38382p3658
9704C289627l4164k8938j1491m602l1866l0718l0745j9232m940K2748N4809J05294
9692C275782J58910K08276K70713L43453L98236M59621N33361O00890O85883P80204
9682G715329Q38432Q76844R65485J090472J264265J496284J639342J634102J414768
$$ plain form
9750 23344111 26212685 29083001 31728815 33898583 35336375 35933748 35816535 35225116 34393836
9741 34393836 33520530 32780606 32266600 31993258 31913660 32028239 32353817 32788322 33164641 33434128
9731 33434128 33604328 33601397 33197507 32271369 30781075 28850999 26647019 24310252 21968414
9722 21968414 19716476 17588403 15575576 13669703 11900058 10300806 8876475 7658627
9714 7658627 6674685 5870757 5207136 4681309 4280538 3949743 3691889 3501667 3363285 3289627
9704 3289627 3255463 3226525 3215034 3210432 3178566 3147848 3117103 3097871 3092931 3115679 3170488 3275782
9692 3275782 3434692 3642968 3913681 4257134 4655370 5114991 5648352 6249242 6935125 7715329
9682 7715329 8553761 9430605 10396090 11486562 12750827 14247111 15886453 17520555 18935323
9673A8935323R60786L78956j28116m21214n79855o69278p05005o06121l85981
9664A6779495r6871J86896L80744N00284N44085M72475J96238l07833r19664j456088
9654A6279761j755087j784803j646440j422268j202000r97592q47497p31186o55166
9645E237722o08905n45251m88258m38726l78742l38425k70381k05007j72205j61385
9635A630437j44400j18945q9568p0825o5456o4107n0893l7944l8280m3575m7619
9624H58825m2200l9009l7056k3859l6006k9581k7701l9053k7388j9195k786p523
9612E27468l4722j7018j2472j6036o914j0955m914p06o728k984k329l826L868
9599D11732p482j9017k7347r07m555L495j0103j4997l75N939l082o09j0948n854
$$ plain form
9673 18935323 19896109 20275065 20146949 19725735 19145880 18476602 17771597 17165476 16779495
9664 16779495 16682624 16869520 17250264 17750548 18294633 18767108 18963346 18655513 17735849 16279761
9654 16279761 14524674 12739871 11093431 9671163 8469163 7471571 6624074 5892888 5237722
9645 5237722 4628817 4083566 3595308 3156582 2777840 2439415 2169034 1964027 1791822 1630437
9635 1630437 1486037 1367092 1277524 1206699 1141243 1077136 1026243 988299 950019 906444 858825
9624 858825 816625 777616 740560 716701 680695 651114 623413 584360 556972 537777 534991 527468
9612 527468 492746 475728 463256 447220 440306 429351 424437 423731 417003 414019 411690 407864 411732
9599 411732 404250 385233 357886 356979 352424 355919 345816 330819 330444 336383 333301 332692 321744 315890
9585C15890j586k093k346M386j3095L494l636j513j739J2818M509N559r130N643
9571C17161N075k514l842k987M412J606q214j360k4334j3528J2609K8835K074
9558C14993r739o343k462j0078j2201p112J495k725j3059K684J5501l797o944
9545B60213M579p179o544M284K893j1010q682P015J749o466Q407k283J647L554
9531B52177j5116m686K030j467q886J0085M464l592j1287j377L120K3773P745
9518B56983N046J2244n18q055R132n43M651n768Q274j125j5989m904L353j2433
9504B50348j670P404k490j8244n866L546R496n732n228J5617R409J099m564j7690
9490B35435j0253m82p419K870k963J517O198k264j432J6848J9393K988N813Q290
$$ plain form
9585 315890 314304 312211 309865 314251 301156 304650 301014 299501 297762 310580 315089 320648 311518 317161
9571 317161 322236 319722 315880 312893 317305 318911 310697 309337 285003 271475 284084 312919 314993
9558 314993 305254 298911 296449 286371 274170 267058 268553 265828 252769 255453 270954 267157 260213
9545 260213 264792 257613 251069 255353 258246 247236 238554 245569 247318 240852 249259 246976 248623 252177
9531 252177 237061 232375 234405 232938 224052 234137 238601 235009 223722 222345 225465 249238 256983
9518 256983 262029 274273 273755 265700 274832 274289 278940 273172 281446 280321 264332 259428 262781 250348
9504 250348 248678 256082 253592 235348 229482 233028 242524 236792 231564 247181 256590 257689 253125 235435
9490 235435 225182 224700 217281 220151 217188 218705 224903 222639 221207 238055 257448 260436 266249 274539
9476B74539p847M239m554j8212o267r021o574m059m180J4353J0391j286j3118
9463B28404L101J247r012J1902N521j0793j335j1095j3981L648L969J2526l275
9450B20827l121j973P235J127O658M591q522J25k047k976J2636J1864R0p580M052
9435B42986j654r299k521J4759O285Q58J3266K6545J1075l765n524Q550p14J1976
9421C12823J4311J0035N173N146Q796K5951P286K012M154K553J1587O682m334
9408D12175p471l753J3891L0334P668J5527R861J8544J6725L5775J7417K5806
9396E92499J1623J9645L7082K531m508P143K4589K5078K2222L4090K0593K1215
9384H13802J7636L0408M8202K7506J2147J6723L4510L7745L1761K6164M1895M5363
$$ plain form
9476 274539 266692 270931 266377 248165 241898 232877 226303 222244 218064 232417 242808 241522 228404
9463 228404 231505 232752 223740 235642 241163 230370 229035 217940 203959 207607 211576 224102 220827
9450 220827 217706 215733 222968 224095 230753 235344 226822 226947 224900 221924 234560 246424 246514 238934 242986
9435 242986 241332 232033 229512 244271 250556 251414 264680 291225 302300 298535 293011 301561 300847 312823
9421 312823 327134 337169 342342 347488 356284 382235 389521 391533 395687 398240 409827 416509 412175
9408 412175 404704 400951 414842 445176 452844 468371 478232 496776 513501 549276 566693 592499
9396 592499 604122 623767 660849 663380 658872 666015 690604 715682 737904 771994 792587 813802
9384 813802 831438 861846 910048 937554 949701 966424 1000934 1038679 1070440 1096604 1138499 1183862
9372A183862L5535N0725P0925O4592P4589Q7534R5496J00550J13438J47271J75938
9361B200455K12704K58346K93790L32444L88344M34674M21762L64609K85124K29088
9351E421340J78129J99192K55931L52767M61989N49527O10581O83692P59935Q27710
9341A0300793Q89944R31785R87024R87207R15768P74197N82991L99161L02752
9332A7071622L26798L90840M73133N17906M96372M61039M35135M38560M10545
9323B1021950L35843J85911m3392k70636m08275m30301l28938j53543Q22J04614
9313B0014055J38761J31362J20572R3498K9808n5839j94395l68375n27041o22842
9303A8759564o72766p06689p45206p82786p96854p32040o51854n71962n10216
$$ plain form
9372 1183862 1219397 1270122 1341047 1405639 1480228 1567762 1663258 1763808 1877246 2024517 2200455
9361 2200455 2413159 2671505 2965295 3297739 3686083 4120757 4542519 4907128 5192252 5421340
9351 5421340 5599469 5798661 6054592 6407359 6869348 7418875 8029456 8713148 9473083 10300793
9341 10300793 11190737 12122522 13109546 14096753 15012521 15786718 16369709 16768870 17071622
9332 17071622 17398420 17789260 18262393 18780299 19276671 19737710 20172845 20611405 21021950
9323 21021950 21357793 21543704 21500312 21229676 20821401 20391100 20062162 19908619 19909441 20014055
9313 20014055 20152816 20284178 20404750 20498248 20528056 20472217 20277822 19909447 19382406 18759564
9303 18759564 18086798 17380109 16634903 15852117 15055263 14323223 13671369 13099407 12589191
9294A2589191m59714l96282l16766k78583k85407k93837l39962l48698l26557
9285I543385k78113j82173m7471M0071P2194J30904J82456K36521K61309K68877
9275A0227960K07745J09708M0629J2973K5054R9552K04641L08009L82495M85003
9265A2103769N87569O93832Q28818R87205J118971J220698J302427J289808J102671
9256B1235768Q06240M34161J54307N5832R4061J91107K52779K46761K08942J62038
9246B3841996J38450J72489K17664K15035J60231N7909o2723j43139j69037j14304
9236B4314571n1669K1084O5268M6405O316o9226j23676j76221k49247l41138n00736
9225B2941731o82863q68390j027790j118685j136387j117847j051421r65510q61557
$$ plain form
9294 12589191 12129477 11733195 11416429 11137846 10852439 10558602 10218640 9869942 9543385
9285 9543385 9265272 9083099 9035628 9075699 9147893 9278797 9461253 9697774 9959083 10227960
9275 10227960 10435705 10545413 10586042 10599015 10624069 10723621 10928262 11236271 11618766 12103769
9265 12103769 12691338 13385170 14213988 15201193 16320164 17540862 18843289 20133097 21235768
9256 21235768 22042008 22476169 22630476 22686308 22780369 22971476 23224255 23471016 23679958 23841996
9246 23841996 23980446 24152935 24370599 24585634 24745865 24803774 24741051 24597912 24428875 24314571
9236 24314571 24262902 24283986 24349254 24395659 24401975 24332749 24209073 24032852 23783605 23442467 22941731
9225 22941731 22258868 21390478 20362688 19244003 18107616 16989769 15938348 14972838 14111281
9216A4111281p45108o04165m74802l98015l56282l55468l91480m51629n29444
9207I804888o15897o65399o74109o49659o20518n68007n24528n01788m78169m60123
9197D046691m27330l72725l29442k84364k31091k14213k04329j93923j53464j43344
9187A492466j35181j03181q9040p4722m1939m9047p4649l7166k8326m1269m3449
9176G74497k2462j1384k1047k9739r108q101J967j7994k8402k8125k0590j8192
9164E61320r036K07r050j6501o661j620R55k820k694p244J806j1700M553N944
9150E07459N724o563k041r90Q271O814L654m234k652q764j0089J447k8629p300
9136D62107J971m265r429o620K980j882j1378k12O305J819n021J505J1540m870
$$ plain form
9216 14111281 13366173 12762008 12287206 11889191 11532909 11177441 10785961 10334332 9804888
9207 9804888 9188991 8523592 7849483 7199824 6579306 6011299 5486771 4984983 4506814 4046691
9197 4046691 3619361 3246636 2917194 2632830 2401739 2187526 1983197 1789274 1635810 1492466
9187 1492466 1357285 1254104 1165064 1090342 1048403 999356 924707 887541 859215 817946 774497
9176 774497 752035 740651 719604 689865 680757 672656 674623 656629 628227 600102 579512 561320
9164 561320 552284 552491 543441 526940 520279 518659 519614 516794 514100 506856 508662 496962 501515 507459
9150 507459 513183 506620 504579 503589 511860 518674 522328 518094 515442 506678 496589 498036 469407 462107
9136 462107 464078 459813 450384 443764 446744 444862 433484 433272 439577 441396 436375 437880 449420 444550
9122D44550j0802j2057j322o77l275j7046M145N227q30L353o057j1086J9892J4425
9108D28440j616Q353O503Q978Q25M399n896n188P323Q816r727K490j456j3791
9094D38453j3412j9376L218O691p88n339j2112m357P823N6N549j894M072N699
9080D14283J654J1128J0396J7056J4969L3229K5580J1017J9739K3666J5573j096
9068E97194j3368j5670l0348j6157o91m89k0620k3914j2155o584r758o662j109
9055D39669K305R540M846J1817K1610K5288L3217K4845K112j718K1793L16r57
9042E94683N376O934n746J588J6521J6768R779L2222M6640N1447M6370O3439J04407
9029I90428J32893J56722J64928J20550P9716J5534q0860j10202j18640j31334
$$ plain form
9122 444550 433748 421691 420369 419692 416417 399371 403516 408743 407913 411266 405209 394123 414015 428440
9108 428440 426824 435177 441680 450658 451483 455882 449986 444798 452121 460937 451210 453700 452244 438453
9094 438453 425041 405665 408883 415574 414786 409447 397335 392978 400801 400857 406406 404512 408584 414283
9080 414283 415937 427065 437461 454517 469486 502715 528295 539312 559051 582717 598290 597194
9068 597194 583826 568156 537808 521651 520960 520471 499851 475937 463782 457198 447440 440778 439669
9055 439669 441974 451514 456360 468177 489787 515075 548292 573137 575249 573531 595324 595640 594683
9042 594683 600059 606993 601247 602835 619356 636124 645903 678125 724765 776212 822582 886021 990428
9029 990428 1123321 1280043 1444971 1565521 1645237 1660771 1579911 1469709 1351069 1219735
9019A219735j14377j03214o3020l1615n978p924J6789L8856M5730N2900P4955
9008A122837J13283J39276J56662J95906J90118J65270J12648K1323l6112q8679
8998B092532j30684j33413j25387r7120o4164l0794J0730N4078P9582J11951J93810
8987A961121K52838K97508L02194K54585J80908O1596o3835j46300k03288k20789
8977B676538k30117j98962j62668j24930q6915l4619J5226N6287P9470J27968
8967B117278J76897K32303L19476L94367M30352M41309L74303K56006J05192O96
8957D848179p1259j03476p9173o8023q4083j40497j75550k08429k00935j82330
8947C534424j18456l3840L1031Q1657J46217K00011K12027K08587J82409J37771
$$ plain form
9019 1219735 1105358 1002144 939124 907509 901531 893607 910396 949252 994982 1047882 1122837
9008 1122837 1236120 1375396 1532058 1727964 1918082 2083352 2196000 2217323 2181211 2092532
8998 2092532 1961848 1828435 1703048 1605928 1541764 1510970 1521700 1575778 1655360 1767311 1961121
8987 1961121 2213959 2511467 2813661 3068246 3249154 3310750 3246915 3100615 2897327 2676538
8977 2676538 2446421 2247459 2084791 1959861 1872946 1838327 1853553 1909840 1989310 2117278
8967 2117278 2294175 2526478 2845954 3240321 3670673 4111982 4486285 4742291 4847483 4848179
8957 4848179 4776920 4673444 4594271 4526248 4442165 4301668 4126118 3917689 3716754 3534424
8947 3534424 3415968 3382128 3413159 3494816 3641033 3841044 4053071 4261658 4444067 4581838
8937D581838J07053J07152J72695K61269L52478L89530L34053J46853j21913l06683
8927F024325l81027l77659k94560j55842k3164O3022J44016K05957K15817J96772
8917E617657K08011K34079K76366L16585L14845K86126J79079J8716j35452k87888
8907G028124l52989l73233l63476l05780k34922j44391o5145M351O2520J17232
8897E372291J72640K40812L96107N60996P37873R10530R83797Q21592M32789p2797
8887A0556630m70334o76715o97393n68560m05698k82122k16520k31237k90199
8878F717852l23180k88908k40619j39299j7635Q7779J76259K60980L07742K74291
8868F815262J83980O6164l3836o8019L89R6482J92570L11629L52456K39908K1241
$$ plain form
8937 4581838 4688891 4796043 4968738 5230007 5582485 5972015 6306068 6452921 6331008 6024325
8927 6024325 5643298 5265639 4971079 4815237 4792073 4855095 4999111 5205068 5420885 5617657
8917 5617657 5825668 6059747 6336113 6652698 6967543 7253669 7432748 7451464 7316012 7028124
8907 7028124 6675135 6301902 5938426 5632646 5397724 5253333 5188188 5192539 5255059 5372291
8897 5372291 5544931 5785743 6181850 6742846 7480719 8391249 9375046 10196638 10629427 10556630
8887 10556630 10086296 9409581 8712188 8143628 7737930 7455808 7239288 7008051 6717852
8878 6717852 6394672 6105764 5865145 5725846 5708211 5795990 5972249 6233229 6540971 6815262
8868 6815262 6999242 7065406 7031570 6963551 6963940 7060422 7252992 7564621 7917077 8156985 8178226
8857H178226j89867l52080l90359l18591j86333l9607Q1830J46974J43453P7482
8847G151128o905p4526o7438L1872K43369M53270N93344N87792L97816N0163l21983
8836I037902o24561p68058p68823o53118m82064l55149k31756j18587m9168O893
8826D993511O6390J79880L39296N31714P77537J040437J235160J183319P67778
8817A1115022J01201o11651j089374j278759j171186r77054p40731n18869l46768
8808D481831k35333j16586P820J20102K38005L95618N62109P32619Q74072Q64275
8798G924532O07231J48740l62582p70789r51652r35108p96400o30026m68331l40244
8788C425371k15895r4290j4193N6948J57729K78847L88820M97563N60820M95993
$$ plain form
8857 8178226 7988359 7636279 7245920 6927329 6740996 6701389 6783219 6930193 7073646 7151128
8847 7151128 7144223 7069697 7002259 7034131 7277500 7730770 8324114 8911906 9309722 9359885 9037902
8836 9037902 8413341 7645283 6876460 6223342 5741278 5386129 5154373 5035786 4986618 4993511
8826 4993511 5059901 5239781 5579077 6110791 6888328 7928765 9163925 10347244 11115022
8817 11115022 11216223 10604572 9515198 8236439 7065253 6088199 5347468 4828599 4481831
8808 4481831 4246498 4129912 4137732 4257834 4495839 4891457 5453566 6186185 7060257 7924532
8798 7924532 8531763 8680503 8317921 7547132 6595480 5660372 4863972 4233946 3765615 3425371
8788 3425371 3209476 3115186 3100993 3157941 3315670 3594517 3983337 4480900 5041720 5537713
8778E537713L29591O7582k54967m77947n66181n61612m87408l71408k63654j59353
8768B792356p2945J9651R0675J42570J83317K19310K00278J44451O9744j5545
8758C773862j05960j51999j81058j85380j52579j15854p0588J287N6909J30148
8748B998788J84236K24498K73757L56500M25230N00140O27726P62042R61828J231499
8738H546244J527106J717323J658135J309269O85179n860n03237p55498q61291
8729A3317370r18948r66861j012965j009261r04060p41522n36017l16475r2575
8720F818686J25480L48657N55958P18625Q72386R95020J110481J166922J049164
8711A3761379O91228J91782k76850o34617q36690r03236r03431r31906r94482
$$ plain form
8778 5537713 5867304 5934886 5679919 5201972 4635791 4074179 3586771 3215363 2951709 2792356
8768 2792356 2719411 2739062 2829737 2972307 3155624 3374934 3575212 3719663 3789407 3773862
8758 3773862 3667902 3515903 3334845 3149465 2996886 2881032 2810444 2811731 2868640 2998788
8748 2998788 3183024 3407522 3681279 4037779 4463009 4963149 5590875 6352917 7314745 8546244
8738 8546244 10073350 11790673 13448808 14758077 15443256 15437396 14934159 14178661 13317370
8729 13317370 12398422 11431561 10418596 9409335 8505275 7763753 7227736 6911261 6818686
8720 6818686 6944166 7292823 7848781 8567406 9439792 10434812 11545293 12712215 13761379
8711 13761379 14452607 14644389 14367539 13732922 12896232 11992996 11089565 10157659 9163177
8702I163177j047430j036245r45974q00065o42564m78889l52214k82903j99861
8693C377032j40778p0328m2248k6303l4489l7869q10L2308O3716Q1674J16331
8682C318236J50915K06092K42963K68110K98581L49143M01768M59379N59377O48690
8672F903254P52874Q54040R91780J163341J343488J474796J508633J473056J411744
8663A7877006J395422J407433J421041J402482J306028J039939N17433j96069
8655B6170715r48155j520311j789969j809654j668168j408433j091134p28771
8647A5206120l91558j17473J56352M27970P02142R50254J133849J220152J234591
8638B0522399J196587J133061R95083P83960N00685K7072o27233j318925j890687
$$ plain form
8702 9163177 8115747 7079502 6133528 5333463 4690899 4212010 3859796 3576893 3377032
8693 3377032 3236254 3165926 3123678 3097375 3062886 3025017 3024207 3056515 3120231 3201905 3318236
8682 3318236 3469151 3675243 3918206 4186316 4484897 4834040 5235808 5695187 6254564 6903254
8672 6903254 7656128 8510168 9501948 10665289 12008777 13483573 14992206 16465262 17877006
8663 17877006 19272428 20679861 22100902 23503384 24809412 25849351 26366784 26170715
8655 26170715 25222560 23702249 21912280 20102626 18434458 17026025 15934891 15206120
8647 15206120 14814562 14697089 14853441 15281411 15983553 16933807 18067656 19287808 20522399
8638 20522399 21718986 22852047 23847130 24631090 25131775 25158847 24531614 23212689 21322002
8629B1322002k205158k216047k047831j809839j589578j402494j227766j055520
8621G767769r02603p62618o17421m95972l97467l10481k29976j59344j22994q0037
8611C688856l0387q542J3025M7400Q1509J16239J57541K44057L35852M33682N06683
8600E585915N82039O10442N85640N30622M72095M32910M67979N59070P07523Q54297
8590A1388532R49824R80492R36164Q29218P21614O60431O06306N53346M24507
8581A8050434K36407j4525l04333n68016p66368q47052q54056p87603o86467n64073
8571A2894348m26181k76011q4717J49589L60775N33021O44030O50972N94748N13421
8561A5553995M78438M52145L58336K38741Q3715j22867m19497p93993j177998
$$ plain form
8629 21322002 19116844 16900797 14852966 13043127 11453549 10051055 8823289 7767769
8621 7767769 6865166 6102548 5485127 4989155 4591688 4281207 4051231 3891887 3768893 3688856
8611 3688856 3658469 3649927 3662952 3710352 3791861 3908100 4065641 4309698 4645550 5079232 5585915
8600 5585915 6167954 6778396 7364036 7894658 8366753 8799663 9267642 9826712 10534235 11388532
8590 11388532 12338356 13318848 14255012 15084230 15805844 16466275 17072581 17625927 18050434
8581 18050434 18286841 18272316 17967983 17399967 16633599 15786547 14932491 14144888 13458421 12894348
8571 12894348 12468167 12192156 12107439 12257028 12617803 13150824 13794854 14445826 15040574 15553995
8561 15553995 16032433 16484578 16842914 17081655 17165370 17042503 16623006 15829013 14651015
8552A4651015j459727j583398j559124j431831j237668j024918q49085o99416
8544D805848n55588m43547l46681k75599k14370j67976j32448j02653p7721q1002
8534B408263o9586m8015l0817k8735o785o080M936J2146K1031P1509J00641J34788
8522B563296J61615J90545K28166K72652K93362K98510K98532K95912K48553K20379
8512E071522K19303K48980K84179K75246J85833R591j59017k82022l32280l63895
8502E157440l67392l70780l44675k95735k04866j10975l8595M4199J14599J76784
8492C760004K38964K81761L16465L52346L92223M06710L74396K95981J36804q8286
8482F467368l04653m73575n39575n29711m77131m13646l76734l44654l07619k69928
$$ plain form
8552 14651015 13191288 11607890 10048766 8616935 7379267 6354349 5505264 4805848
8544 4805848 4250260 3806713 3460032 3184433 2970063 2802087 2669639 2566986 2489265 2408263
8534 2408263 2338677 2290662 2259845 2231110 2224325 2218245 2223181 2235327 2256358 2327867 2428508 2563296
8522 2563296 2724911 2915456 3143622 3416274 3709636 4008146 4306678 4602590 4851143 5071522
8512 5071522 5290825 5539805 5823984 6099230 6285063 6294654 6135637 5853615 5521335 5157440
8502 5157440 4790048 4419268 4074593 3778858 3573992 3463017 3424422 3468621 3583220 3760004
8492 3760004 3998968 4280729 4597194 4949540 5341763 5748473 6122869 6418850 6555654 6467368
8482 6467368 6162715 5689140 5149565 4619854 4142723 3729077 3352343 3007689 2700070 2430142
8472B430142k19939j78993j26955j02762r8703p4531o1553k9712k2000k9132j9744
8461A466118N79j1319j8665k7403k6107j6086k1242l581n579k1458j5945M801
8449A304113k475l036n868k846j1734j1362Q856J2519J1098N180J8701J2979q402
8436A327723q894J5165J3839M7J697J7138J8290J2452M731J1780K1650m349N4
8423A431323J4770J7668J9246J3120J3779O776J1570N772K0703K0403K2762J3238
8411A611130K553O245O193J8512L539j053J8268R811J0393L646J8183L3577K5798
8398A766795K4055R878O514K1745K0558J9054K0882J3849J1618J8083J3371J1418
8386A957820K7761L2045L2329J7952J4062K4327R724Q111J1661J3995L0466K8462
$$ plain form
8472 2430142 2210203 2031210 1904255 1801493 1702790 1628259 1566706 1536994 1514994 1485862 1466118
8461 1466118 1466697 1455378 1436713 1409310 1383203 1367117 1345875 1342294 1336715 1315257 1299312 1304113
8449 1304113 1301638 1298602 1292734 1289888 1278154 1266792 1275648 1288167 1299265 1304445 1323146 1336125 1327723
8436 1327723 1318829 1333994 1347833 1347880 1349577 1366715 1385005 1397457 1402188 1413968 1435618 1431269 1431323
8423 1431323 1446093 1463761 1483007 1496127 1509906 1516682 1528252 1534024 1554727 1575130 1597892 1611130
8411 1611130 1613683 1619928 1626121 1644633 1648172 1647119 1665387 1675198 1685591 1689237 1707420 1740997 1766795
8398 1766795 1790850 1800728 1807242 1828987 1849545 1868599 1889481 1903330 1914948 1933031 1946402 1957820
8386 1957820 1985581 2017626 2049955 2067907 2081969 2106296 2116020 2124131 2135792 2149787 2180253 2208715
8374B208715R663j493K180J9260L7684K5467L6690K2333J8397K2023J4991L1714
8362B447624M3236K6338K9216L0873L6072K8522L2835L5258L6532L7138K2279
8351B805923J7486K2900L8331L5911M4993K3936L0510L8869L5844L0218K5779
8340C150700L2361K0718M5118L5165L0954L3848L4453J7034K9367M5987M1980
8329C517685L5997L9021K0478L8677N9154M7804L4886M1465M5573M6418L8064
8318C965222M1942M9505L5528K3920K8731L2362L9218L9781M6284N2745L6448
8307D391686L5600L0623J8708L7817M0046K4108L5007M5920L8673M9454L5607
8296D783249K0211M3007K5685J7979L4203L4610L7170L2913L4563L2130J3528
$$ plain form
8374 2208715 2218378 2216885 2219065 2238325 2276009 2301476 2338166 2360499 2378896 2400919 2415910 2447624
8362 2447624 2490860 2517198 2546414 2577287 2613359 2641881 2674716 2709974 2746506 2783644 2805923
8351 2805923 2823409 2846309 2884640 2920551 2965544 2989480 3019990 3058859 3094703 3124921 3150700
8340 3150700 3183061 3203779 3248897 3284062 3315016 3348864 3383317 3400351 3429718 3475705 3517685
8329 3517685 3553682 3592703 3613181 3651858 3711012 3758816 3793702 3835167 3880740 3927158 3965222
8318 3965222 4007164 4056669 4092197 4116117 4144848 4177210 4216428 4256209 4302493 4355238 4391686
8307 4391686 4427286 4457909 4476617 4514434 4554480 4578588 4613595 4659515 4698188 4747642 4783249
8296 4783249 4803460 4846467 4872152 4890131 4924334 4958944 4996114 5029027 5063590 5095720 5109248
8285E109248K0367J6303K5453L4679L4710K1550J7252L0139L4562J6926L4692
8274E395881K2396J3350J7329J4889J9978J8408N870k174J6911m62O972J9798
8262E549146l953j402J0934J3396q539j5325r702k6864j3756k9014l1021k9806
8250E404094k0490l0977j4856o045m572j7654j3269j2830j5426k7373k5264l2618
8238E182720m2167l3515m0929l9459j8288k6902l9401m5569l8094n3074n8099
8227D747223l9109l8427k4398l3267m3629l5536m9479m3251l9991k9334m3193
8216D327609l7636j7902m2448n6286m7012m3054m2830m2442o2399m2808j3311
8205C879481l2729l4493m8525m9856k6096k6514k4926l2854k0647j1423k5475
$$ plain form
8285 5109248 5129615 5145918 5171371 5206050 5240760 5262310 5279562 5309701 5344263 5361189 5395881
8274 5395881 5418277 5431627 5448956 5463845 5483823 5502231 5508101 5505927 5522838 5522376 5529348 5549146
8262 5549146 5545193 5543791 5554725 5568121 5559582 5544257 5534555 5507691 5493935 5464921 5433900 5404094
8250 5404094 5383604 5352627 5337771 5331726 5327154 5309500 5296231 5283401 5267975 5240602 5215338 5182720
8238 5182720 5140553 5107038 5066109 5026650 5008362 4981460 4942059 4896490 4858396 4805322 4747223
8227 4747223 4708114 4669687 4645289 4612022 4568393 4532857 4483378 4440127 4400136 4370802 4327609
8216 4327609 4289973 4272071 4229623 4173337 4126325 4083271 4040441 3997999 3935600 3892792 3879481
8205 3879481 3846752 3812259 3763734 3713878 3687782 3661268 3636342 3603488 3582841 3571418 3545943
8194C545943k8286j5777j2363l457n640Q086L4273N5482K6352m4587p3216j01821
8182C384989j07144q4742p1614o4688m9813m4479m9302n0396m5270l9424m1320
8171B736797k5355k0928k2295l0213k1571j4904l2244l6441l4164k0823j6370
8160B461489k3477k0774k6994k2936j5385k6336l4237l4214j5085l2132j7440
8149B192479j0123o263J1305K2813N2555Q7155J42312J78337J06048l3989j52505
8138B590124j91879j75050j26538q1624o7519p1657n9706l7779k4448j1145m942
8127A737837k0260k2956r522l322k3012l6192k3307j7021k2220k1702k8476r283
8115A500564o85j2700k4463k7615j6385o535j2433p594r356m349n754O691Q290
$$ plain form
8194 3545943 3517657 3501880 3489517 3486060 3480420 3488506 3522779 3578261 3604613 3560026 3486810 3384989
8182 3384989 3277845 3193103 3121489 3056801 3006988 2962509 2913207 2862811 2817541 2778117 2736797
8171 2736797 2711442 2690514 2668219 2638006 2616435 2601531 2569287 2532846 2498682 2477859 2461489
8160 2461489 2438012 2417238 2390244 2367308 2351923 2325587 2291350 2257136 2242051 2209919 2192479
8149 2192479 2182356 2176093 2187398 2210211 2262766 2349921 2492233 2670570 2776618 2742629 2590124
8138 2590124 2398245 2223195 2096657 2015033 1947514 1875857 1816151 1778372 1753924 1742779 1737837
8127 1737837 1717577 1694621 1685099 1681777 1658765 1622573 1599266 1582245 1560025 1538323 1509847 1500564
8115 1500564 1499879 1487179 1462716 1435101 1418716 1412181 1399748 1392154 1382798 1378449 1372695 1379386 1387676
8102A387676L673J3801J8901J5873M8257O0196M5490J0086o2137p6718q0268o9349
8090A315481m4315l8165l0596k3236j7933j9845j0796j2717j3814l422q841j1492
8078A080309j9479n444j1131k8932l2782o570L560J089j0043j2974l065j5226
8066I39312j0010j0603k1185j9733p792l806k539o877p54J1141n17j4015j5973
8053H36649j1541J176m899n084J932q810l756j2917n339q860k7933j4543M27r418
8039G27084m860q801n557K62N401L534o934J348r647k0692j7147K368r798k173
8025F54388k790r318r657K421P63J438k5401j0834k992J0972m649o571p358o562
8011E83850L351L925p656k247l497k950j7472q901l239p846K084j857L481q462
$$ plain form
8102 1387676 1391349 1405150 1424051 1439924 1488181 1548377 1593867 1603953 1541816 1465098 1384830 1315481
8090 1315481 1271166 1233001 1202405 1179169 1161236 1141391 1130595 1117878 1104064 1100642 1091801 1080309
8078 1080309 1060830 1055386 1044255 1015323 982541 975971 979531 980620 970577 957603 954538 939312
8066 939312 929302 918699 897514 877781 869989 866183 863644 856767 856013 867154 866637 852622 836649
8053 836649 825108 826284 821385 816301 818233 809423 805667 792750 787411 778551 750618 736075 736502 727084
8039 727084 722224 713423 707866 708128 713529 717063 710129 711477 701830 681138 663991 666359 656561 654388
8025 654388 651598 642280 632623 635044 635807 637245 611844 601010 598018 608990 604341 597770 590412 583850
8011 583850 587201 591126 583470 581223 577726 574776 557304 548403 545164 537318 539402 537545 541026 532564
7997E32564n90L010O653j148J063j6531j2717J0002j3679q459o053r385K452O751
7983D93933o849m317O741N421j3889q885Q268N053r506j0695R994P123j172k662
7969D78558j6530p101k0527p129m923J9702p86k0909j4372O217J1260j741j356
7956D20363P716J08O724p704q321k0279r387o71K504J4244R47L356O39q613m840
7941C96786j0119r510m549p155k782J0242J0998n395N854J31j3326r646p038m699
7927C49792k539R072M338L520o976l098j1056n842n267m267M53K535q115o6o879
7912C15605l367K0210J8652j8600j2970n28m960q354J038k262o004q688l723P392
7898B93441M659j317j8399j6155j743N84N707J204P104j514L958J3196p27p341
$$ plain form
7997 532564 531974 534984 541637 540489 541552 525021 512304 522306 508627 500168 494115 484730 487182 493933
7983 493933 487084 482767 489508 494929 481040 472155 480423 485476 475970 465275 475269 482392 481220 478558
7969 478558 462028 454927 434400 427271 422348 442050 441264 420355 405983 412200 423460 421719 420363
7956 420363 428079 428187 434911 427207 418886 398607 389220 388549 391053 405297 406244 409600 410239 401626 396786
7941 396786 386667 377157 372608 365453 362671 372913 383911 378516 384370 384501 371175 361529 354491 349792
7927 349792 347253 356325 360663 364183 357207 354109 343053 337211 331944 327677 328130 330665 322550 322484 315605
7912 315605 312238 332448 351100 332500 319530 319002 314042 305688 306726 304464 298460 289772 286049 293441
7898 293441 298100 296783 278384 262229 260486 261070 266777 267981 275085 273571 277529 290725 289998 282657
7884B82657j3228p686N133N221J106j1930p311J3540k403j1152r984J1428o224
7871B49167j8838L774J822M937L158R484j0711O00O53j605O087Q518j1400p724
7857B37922M622p132j1303n051P734j213j372o593j145m205j9572J8151N747l372
7843B13218J833J503m56L373M940O051r058j8653m377j1202k630K151P864J3537
7829B08094q03m366N793J964j7076j2075j334M201J1173l488k500j58n143k187
7815A82095m999p19j32K516r003N833L969j830L982k121J219N655K742o075j6039
7800A67093o089K046j460n801p174p246K755K587J4342j141n645q949q796M985
7786A41507J1350O094O796K098J3235j2896Q654J0046q435j2705m147j2305p627
$$ plain form
7884 282657 269429 261743 266876 272097 273203 261273 253962 267502 265099 253947 243963 255391 249167
7871 249167 230329 234103 235925 240862 244020 253504 242793 243393 244046 242441 248528 257046 245646 237922
7857 237922 242544 235412 224109 219058 226792 225579 224207 217614 216469 212264 192692 210843 216590 213218
7843 213218 215051 216554 216098 219471 224411 230462 221404 202751 198374 187172 184542 186693 194557 208094
7829 208094 207291 202925 208718 210682 193606 181531 180197 184398 195571 192083 189583 189425 184282 182095
7815 182095 177096 176377 176245 178761 169758 175591 179560 177730 181712 179591 180810 186465 189207 183132 167093
7800 167093 161004 163050 161590 155789 148615 141369 144124 146711 161053 159912 154267 145318 136522 141507
7786 141507 152857 158951 165747 167845 181080 168184 176838 186884 178449 165744 161597 149292 141665
7773A41665R043J487M9o998P637Q372j1000k945j241J0053n359q400M63n217J2356
7758A49965K000n815j1729j657p39j600p677J813J256J9306K875k743m742o484
7744A34029k950P4O49n042o001M759M999o832n331J6380J2193j1715k1803r378
7730A04031J2859K852P136p690j873l157K0385J5126j4517r119L722n141r57O855
7716A30512m137n489J4358j401j1614r215r380J0182m327M457J2251m237J142
7703A23102k363k1246o785P186p822j969Q312L808m512R495j530k668k132n313
7689I5563Q295R542q228R88p051K838j075l033J256j1473N239J2606Q180N673
7675A19320M224n482j3254j2270k062K993K77n768j0419J3831J98n347M833J0631
$$ plain form
7773 141665 150708 152195 152244 145246 152883 161255 150255 147310 146069 156122 150763 142363 142826 137609 149965
7758 149965 151965 146150 134421 132764 132025 130425 122748 124561 125817 145123 147998 145255 140513 134029
7744 134029 131079 131153 131802 126760 120759 125518 130517 123685 118354 134734 146927 135212 113409 104031
7730 104031 116890 119742 126878 119188 117315 114158 134543 149669 135152 126033 129755 124614 123657 130512
7716 130512 126375 120886 135244 133843 122229 113014 103634 113816 109489 113946 126197 121960 123102
7703 123102 120739 99493 92708 99894 92072 90103 98415 102223 97711 107206 105676 103008 100876 95563
7689 95563 103858 113400 105172 106160 99109 101947 100872 97839 99095 87622 92861 105467 113647 119320
7675 119320 123544 118062 104808 92538 90476 93469 93746 87978 77559 91390 91588 86241 91074 101705
7661A01705j959O474N067l674j3565J009R244n131o196l631m375j1512o07R390
7647H2239J8130j754q721j4605k497R660l32J777J0498m462j1126j767L605J6049
7633I6694J3048j462j3592l647j2753R78J7266J903O703l364j8236o153K061r03
7619G8543P553k696Q7j5171j1013j5475k184J5646J988J381Q019J7779j292j0278
7605G2887j4362M612J1234j983j1125O501j0523J784J2016N733j5528j1191P270
7592E7325N952N07K207J116M268j335p723M929J5852q16j23j4083O112o720n578
7577F1890m427O302l173J2385Q777M340O753O35m277m849j0749R933k106j550
7563G9884k311o836O207O143n879r739j3677J529m24J2786K5098P132j7186j2182
$$ plain form
7661 101705 99746 106220 111287 107613 94048 95057 104301 99170 92974 89343 84968 73456 72849 82239
7647 82239 100369 98615 89894 75289 72792 82452 82120 83897 94395 89933 78807 77040 80645 96694
7633 96694 109742 108280 94688 91041 78288 79266 96532 98435 105138 101774 83538 77385 79446 78543
7619 78543 86096 83400 83487 68316 57303 41828 39644 55290 57278 58659 66678 84457 83165 72887
7605 72887 58525 63137 74371 72388 61263 67764 57241 59025 71041 76774 61246 50055 57325
7592 57325 63277 63784 65991 67107 71375 70040 62317 67246 83098 82282 82159 68076 74188 67468 61890
7577 61890 57463 63765 60592 72977 81754 86094 92847 93482 89205 84356 73607 83540 81434 79884
7563 79884 77573 70737 76944 83087 77208 67469 53792 55321 54897 67683 92781 99913 82727 70545
7549G0545p276j3037q986J1579N468o678n074R206O761j981j5572p919R249R980
7535E6265P411L696P124l848r162J284p926j753n205J5490J840j2099J2405J2196
7521G7718l075k3519O866K195J9642j636m979Q108j4418q544k381o106j0530M032
7507D3373J1096m172p629K892J3294m518M58k013j3028j1729K57l69O812O268
7493D0992J6237k84m631P944J2210M987j893l398j3800l529j572j0388M428J3023
7479F0326K145l24o634k0873m950P195J4304m188n686k391l242M808P755J8888
7465F7133o672l037m853q877l324M05P186j7339l55j442O302J1331J4369j6273
7451D4554l312L909J820n911k671l47J54J042Q453J6827j2375j119q292N061O268
$$ plain form
7549 70545 63269 50232 41246 52825 58293 51615 46541 55747 62508 60527 44955 37036 46285 56265
7535 56265 63676 67372 74496 70648 61486 62770 54844 53091 47886 63376 65216 53117 65522 77718
7521 77718 74643 51124 57990 60185 79827 78191 73212 81320 66902 58358 55977 49871 39341 43373
7507 43373 54469 50297 42668 45560 58854 54336 54794 52781 39753 28024 28281 27912 34724 40992
7493 40992 57229 56945 52314 60258 72468 77455 75562 72164 58364 54835 53263 42875 47303 60326
7479 60326 62471 62147 55513 34640 29690 36885 51189 47001 41315 38924 35682 40490 48245 67133
7465 67133 60461 57424 52571 43694 40370 40775 47961 30622 30267 28825 35127 46458 60827 44554
7451 44554 41242 45151 46971 41060 38389 38042 38196 39238 47691 64518 52143 51024 42732 47793 54061
7436E4061J078j1821M166J824k148k231l935K519M325R898M000N194k330m330
7422F0270k140j4695j1466p633K223m70j7743LJ6289J6393J648j1228k499p22
7408B8230O867J1292N012p486k1938n300L803p967l380K426K753l363K952p657
7394F244M775N713J3049Q80j2371m480L996N608l988o990J1075Q063q323n375
7380A7876L513n467j2788J2781J1706N37K276p823j534P769L763r291J579L675
7366B8572k838M994j32P220J127j008j2547J821j73P27j2784L915L501K687r203
7351A5879l017k873J0253q205j0442L159M922J4335J4053N679r310p291K373o67
7337B8848J1377J649j1382k743N055J567j239q904J186j2004r990K2241J4369
$$ plain form
7436 54061 55139 43318 47484 49308 47160 44929 40994 43513 47838 57736 61736 66930 64600 60270
7422 60270 58130 43435 31969 24336 26559 26089 8346 8349 24638 41031 42679 31451 28952 28230
7408 28230 35097 46389 51401 43915 21977 16677 20480 12513 9133 11559 14312 10949 13901 6244
7394 6244 11019 16732 29781 30661 18290 13810 17806 23414 19426 12436 23511 31574 23251 17876
7380 17876 21389 15922 3134 15915 27621 28158 30434 22611 21077 28846 32609 23318 24897 28572
7366 28572 25734 30728 30596 37816 38943 37935 25388 27209 27036 27763 14979 18894 22395 25082 15879
7351 15879 12862 9989 20242 12037 1595 4754 9676 24011 38064 43743 34433 27142 29515 28848
7337 28848 40225 41874 30492 27749 32804 34371 33132 24228 25414 13410 3420 25661 40030
7324D0030M183K479n166j1397K987l247M873L78M21R358k818r583K844J263o883
7309B9722r239M790o00j5020q481P815Q047o507m378J0401O030N901O173l640
7295C1014o269q874K761J1452m981o538n888L033N173j4094m198K0239J6004n477
7281C3357j2362N74p282p780M617J3829J2794K010n04j1767n48j270J348n107
7267B1909K461q61n636q647J0958J2142j2751J0055J3304P363m205o986m508J5
7253C4613j103j529k104r389O426J859r009m887M474o781l367Q798J0039m648
7239B3392j0079j028J4934J0144l523j057j29n080j2743n211R648J2333J569r939
7225B3231N596P39J284k818j3375O0L685n351K280R86j725p447j7525J858J3701
$$ plain form
7324 40030 44213 46692 41526 30129 33116 29869 34742 35120 35541 44899 42081 32498 35342 36605 29722
7309 29722 20483 25273 24673 9653 1172 8987 17034 10527 6149 16550 22580 28481 34654 31014
7295 31014 24745 15871 18632 30084 25103 18565 12677 15710 20883 6789 2591 22830 38834 33357
7281 33357 20995 21569 14287 6507 11124 24953 37747 39757 39253 27486 26938 25668 27016 21909
7267 21909 24370 23509 17873 9226 20184 32326 19575 29630 42934 50297 46092 39106 34598 34613
7253 34613 33510 31981 29877 20488 26914 28773 19764 14877 19351 12570 9203 18001 28040 23392
7239 23392 13313 12285 27219 37363 33840 32783 32654 27574 14831 9620 19268 31601 33170 23231
7225 23231 28827 29566 30850 28032 14657 14717 18402 13051 15331 16317 14592 7145 -10380 -8522 5179
7210E179J9106K317q309j1451J4295m966O67P091O930Q768R223N705j1417j1068
7196C2070n616p967Q163M852K361M160j2342R241J0861n873j3428p798R290p328
7182B0646k603P577J4303l429j3370p882m111p670j0102q948q54N949P396N43
7168b555J3914J609n063o867R170R1J0084R47l20j010K26o024M909o431J8739
7153C1419K844j981M185l812q904j0764J0464J9547J654j7599j1539N827r030
7140A2311o830p023R979o815M732P718O934j1406K306J804P671L141j1502K079
7126A5099Q78m115p885M87n460o755m665O874J0128l394r79P354R838j421j034
7111A4950j0159O255J024m987l147J073J092J0828j290L540j0072j1154J5317
$$ plain form
7210 5179 24285 26602 18293 6842 21137 16171 16838 23929 30859 39627 48850 54555 43138 32070
7196 32070 26454 18487 26650 31502 33863 38023 25681 34922 45783 39910 26482 18684 27974 20646
7182 20646 18043 25620 39923 36494 23124 15242 11131 3461 -6641 -15589 -16443 -10494 -3098 -2555
7168 -2555 11359 12968 7905 1038 10208 10299 20383 21330 21010 20000 20226 14202 19111 12680 31419
7153 31419 34263 32282 36467 32655 23751 12987 23451 42998 44652 27053 15514 21341 12311
7140 12311 5481 -1542 8437 1622 6354 14072 21006 9600 11906 13710 21381 24522 13020 15099
7126 15099 15977 11862 3977 4464 -996 -7751 -12416 -5542 4586 1192 213 7567 17405 15984 14950
7111 14950 4791 11046 12070 7083 3936 5009 6101 16929 15639 19179 9107 -2047 13270
7098A3270J624N549O689m184j4342J259R271R829m541j890k089R004k729j921
7084B4799q204q269Q170m004n566j4307j9390l354J5817K3051M109p563n817j687
7070b215N414j878K575J0922j926J540l057Q308m504m011p75P684n96K744N781
7055B6006k979q427J878M3j1651r022L57M046K0216J0097n607k539K139L209j2914
7040A4852n621j58m995j8847p459L431N294J4793Q861j1731q520J5142J1686k322
7026A4406L724m756j417k403p183j4038J0551J4388J0273N666j7074j485J034
7013A1686j7658j0446J63J3540N191j7766N857M555J0963k997J456J488j1781
7000e749P608k965j0941J3592K1202J1230k5740j1511j997k318J6024N496j010
$$ plain form
7098 13270 14894 20443 27132 22948 8606 9865 19136 28965 24424 22534 20445 29449 26720 24799
7084 24799 16595 8326 16496 12492 6926 -7381 -26771 -30125 -14308 8743 12852 5289 -528 -2215
7070 -2215 3199 1321 3896 14818 12892 14432 11375 19683 15179 11168 10393 18077 17481 20225 26006
7055 26006 23027 14600 16478 16521 4870 -4152 -3795 251 20467 30564 24957 22418 24557 27766 14852
7040 14852 9231 9073 4078 -14769 -22228 -18797 -13503 1290 10151 -1580 -10100 5042 16728 14406
7026 14406 18130 13374 11957 9554 2371 -11667 -1116 13272 23545 29211 12137 10652 11686
7013 11686 -5972 -16418 -16255 -2715 2476 -15290 -9433 -4878 6085 3088 4544 6032 -5749
7000 -5749 1859 -1106 -12047 1545 22747 33977 8237 -3274 -5271 -7589 8435 13931 12921
6987A2921o184l350L048J1128L361r116k276r705k93J187l593j24j5975R043N305
6972d623p614P051N685N338j874k519p532M064j3860L299J2657R544k962o668
6958a4O371q080m854o12l516J108J577Q936J508n044P985k259Q221L941j771k1155
6942g658J104P881l930r193J549P867K923j095N613N383l827L42o717p568L475
6927c851M490L689n121j4601k834J5880j829L308L017r871n703O072J7345k290
6913G701p357L399K340m370L527q778K7354J0372j3112n820N924m43p126j717
6899A1894J411N16r785j315J989M439J9486M690J818n678j0800j8032K316K611
6885E560J1716O650k0969j0861n308l360J1554K868n829m36J6504R357O217L071
$$ plain form
6987 12921 6737 3387 6435 17563 20924 11808 9532 -173 -466 721 -2872 -2996 -18971 -9928 -4623
6972 -4623 -12237 -5186 499 5837 3963 1444 -6088 -2024 -15884 -12585 72 9616 6654 -14
6958 -14 6357 -1723 -6577 -7189 -10705 -9597 -8020 916 2424 -2620 5365 3106 11327 15268 13497 -7658
6942 -7658 -6554 1327 -2603 -11796 -10247 -2380 543 -552 5061 10444 6617 6959 242 -7326 -3851
6927 -3851 639 4328 -793 -15394 -18228 -2348 -4177 -869 2148 -7723 -13426 -7354 9991 7701
6913 7701 344 3743 6083 1713 5240 -3538 23816 34188 21076 15256 21180 20737 13611 11894
6899 11894 13305 13821 4036 2721 4710 9149 28635 33325 35143 29465 18665 633 2949 5560
6885 5560 17276 23926 2957 -7904 -13212 -16572 -5018 -2150 -7979 -8415 8089 17446 23663 26734
6871B6734j4346r39R832p01K13k624j2630k896J3889J2268j101j0757K315j4134
6857E123p306L214N338j0659n78n112j0517M319P456J0569J0194l403j0288K887
6843A237o163N69M09N295R734R719Q41o857q52K394l952J1182O540o620k139m403
6827A6934n794Q572P823n943j3481n722p20J186M847J3504P285P47O054j02m309
6812C0881p50o547k484n012k354q616J412l241j042J395J0569k142j3756j964
6798c651J743o048k833N398J093R404o292L961K1770P110j3102j5441K46M312
6784G670L144L765Q80m60k850p276j0172J048N475M465j450N069J3564M332j1479
6769A5725j1964j0891k655K962k273P812J961j3151j0580J419J1588Q062J3147
$$ plain form
6871 26734 12388 11449 21281 20580 20793 18169 5539 2643 16532 28800 27699 16942 19257 5123
6857 5123 -2183 1031 6369 -4290 -4868 -9980 -20497 -16178 -8722 1847 12041 8638 -1650 1237
6843 1237 -4926 -4357 -3948 1347 11081 20800 21641 14784 13932 16326 12374 23556 30096 23476 21337 16934
6827 16934 11140 19712 27535 21592 8111 2389 1669 2855 7702 21206 28491 29238 35292 35190 30881
6812 30881 30131 23584 21100 16088 13734 5118 6530 3289 2247 3642 14211 12069 -1687 -3651
6798 -3651 -1908 -7956 -10789 -5391 -4298 5106 -1186 2775 24545 31655 18553 3112 3358 7670
6784 7670 10814 14579 15459 14999 12149 4873 -5299 -4251 1224 5689 4239 9308 22872 27204 15725
6769 15725 3761 -7130 -9785 -6823 -9096 -1284 677 -12474 -23054 -21635 -10047 -1985 11162
6756A1162j4423n896q33J4409J1376P617K13j1470n518m137k95n099M721j2630
6742a0803j3226J5343J7502n61r955N619j706P37O002K778q163m546l859j2153
6728a6991J312Q030M759M80m64k394m530n082j193R16J6010r164j6528k869n861
6713c3569O961N065N339K1784m910J912P212Q409O021j2937j8196k940R808l61
6699d02l402J589N413k68n59K423j17j0002r230J2731J350j540j770L388K014
6684A618P511n510o638o343j416L835P148l77J2070J3892M948o422L078j3449
6670A3945j2919n872O037K007K897j4212j0816J0765J4779j06k673K533k253j6139
6656a2027k71J429J3623L475j4687M770J495l082O306j54k329q169J0995l253
$$ plain form
6756 11162 -3261 -9157 -9990 4419 15795 23412 23625 12155 6637 2500 2205 -2894 1827 -10803
6742 -10803 -24029 -8686 8816 8255 -1700 3919 2213 2950 8952 11730 3567 -979 -4838 -16991
6728 -16991 -15679 -7649 -2890 -2410 -2874 -5268 -9798 -14880 -16073 -15157 853 -8311 -24839 -27708 -33569
6713 -33569 -26608 -21543 -16204 5580 670 2582 9794 18203 24224 11287 -6909 -9849 -41 -402
6699 -402 -3804 -2215 3198 2930 2371 4794 4677 -5325 -14555 -1824 -474 -2014 -3784 -396 1618
6684 1618 9129 3619 -3019 -9362 -10778 -6943 205 -172 11898 25790 30738 24316 27394 13945
6670 13945 1026 -4846 1191 3198 6095 -8117 -18933 -8168 6611 6505 3832 6365 4112 -12027
6656 -12027 -12298 -10869 2754 6229 -8458 -3688 -2193 -5275 1031 877 -1452 -9621 1374 -1879
6642a879j9339j2084Q372J2480L652P214J0852J2068k962j4909O076o671l130
6629b60q907Q482L854N673J4486J294m417J726m700o33j4552p931Q194J5945j754
6614A6500j2682j5067J1949N954N840K893J544n765J212r74O818O133q070r244
6600G041p204J2771m4L178Q574j3841j4730M7J1093j076j0175j352L556J1845
6586I683k198j2431j1522J3459o738m634P542L287n089j08O236m430m50N172K364
6571A43M435J6375J3116o552j3402q058R524J3509q298j3802p828m103j498Q286
6557A847o887r277J4582J5064L469k0151j3048K229O858K3937M434p457r66O3
6543A4697N021p174j2748j0400j9000p330J5729J7786j3120j3028J3999r81L567
$$ plain form
6642 -1879 -21218 -33302 -24930 -12450 -8798 -1584 9268 21336 18374 3465 9541 2870 -260
6629 -260 -9167 -685 3169 8842 23328 24622 20205 21931 17231 16598 2046 -5885 2309 18254 16500
6614 16500 3818 -11249 700 6654 12494 15387 16931 11166 12378 11404 18222 24355 16285 7041
6600 7041 -163 12608 12564 15742 24316 10475 -4255 -4208 6885 5809 -4366 -5718 -2162 9683
6586 9683 7485 -4946 -16468 -3009 -9747 -14381 -6839 -3552 -8641 -8749 -2513 -6943 -7393 -2221 143
6571 143 4578 20953 34069 27517 14115 6057 15581 29090 20792 6990 -838 -4941 -6439 1847
6557 1847 -5040 -14317 265 15329 18798 -1353 -14401 -12172 -5314 18623 23057 15600 14634 14697
6543 14697 19718 12544 -204 -10604 -29604 -36934 -21205 -3419 -16539 -29567 -15568 -16549 -12982
6530a2982J5184R707O200n352j1583n106j3269j0821M146O745J1283J2789L238
6517A0179N8N937Q283j3747o087L101M305N797j7497j1212N30M31l635R908M994
6502A345n339j0977N817O404K91p627l484j3459l593Q435M211j041j815L63J7618
6487b851J0516j506j1596O946O379n800n051m877J1871o25j1055m832m753M073
6473a3161J0290J4529K105O231L411k078j582q872p127L049m846m631J1873K050
6459A1241j4139K615J927K655r72P785k032o346m621l192o837o586J3476J4128
6445I102p416o810N675N453q046K59L880j4802m563q07J5075L591j3943k514L337
6430a2529J3708Q359j673r72l873M251K828j0884L253M566J1237J5675j0335j1444
$$ plain form
6530 -12982 2202 11909 18109 12757 1174 -3932 -17201 -28022 -23876 -17131 -5848 6941 10179
6517 10179 10237 16174 24457 10710 4623 7724 12029 17826 329 -10883 -10353 -9922 -13557 -3649 1345
6502 1345 -3994 -14971 -9154 -2750 -2459 -10086 -13570 -27029 -30622 -22187 -17976 -19017 -20832 -20469 -2851
6487 -2851 7665 6159 -5437 1509 7888 2088 -2963 -7840 4031 3406 -7649 -12481 -17234 -13161
6473 -13161 -2871 11658 13763 19994 23405 21327 19745 10873 3746 6795 1949 -2682 9191 11241
6459 11241 -2898 -283 1644 4299 3327 11112 9080 2734 -1887 -5079 -11916 -18502 -5026 9102
6445 9102 1686 -5124 551 6004 -2042 -1783 2097 -12705 -17268 -18075 -3000 591 -13352 -15866 -12529
6430 -12529 1179 9538 7865 6893 3020 7271 10099 -785 2468 7034 18271 33946 23611 12167
6416A2167j2666j0081Q79J4736J6740L106l025n011m922R62L670N59j2315j465
6402C334l61j2722J1077P135j288r792j0596m787j201r53N818O819j327r516J3553
6387d807p807j027J062n655K1123Q892l916k954j683m171j571R707m101q015m271
6372i194L911K238J217p475r362n555N630j782o818P272J4500J5689n846p069
6358b644k754k974M305J0925N587p19J114j335N256r937q750m489O807K143j1546
6343i011k936J0537N071q521o50j269k242L44N180J614n46l148j4501p507R884
6328a7701Q860N403n869M910j745l066J480j224P395k414j3464j4295O031j042
6314b6741J4885M241l668Q673O709P190j203P383K587j2104p978K349O196J800
$$ plain form
6416 12167 -499 -10580 -9701 5035 21775 24881 21856 16845 11923 12885 16555 17114 4799 3334
6402 3334 2973 -9749 1328 8463 7175 -2617 -13213 -18000 -19201 -20154 -14336 -7517 -8844 -18360 -4807
6387 -4807 -12614 -13641 -12579 -18234 2889 11781 7865 4911 3228 -943 -2514 7193 3092 -4923 -9194
6372 -9194 -5283 -3045 -1828 -9303 -18665 -24220 -18590 -20372 -27190 -19918 -5418 10271 4425 -2644
6358 -2644 -5398 -8372 -4067 6858 12445 11726 12840 11505 16761 6824 -1926 -6415 392 2535 -9011
6343 -9011 -11947 -1410 3661 -4860 -5510 -6779 -9021 -8677 -3497 -1883 -2429 -5577 -20078 -27585 -17701
6328 -17701 -8841 -3438 -9307 -4397 -6142 -9208 -7728 -8952 -1557 -3971 -17435 -31730 -25699 -26741
6314 -26741 -11856 -7615 -11283 -2610 4099 11289 10086 17469 20056 7952 -26 2323 8519 10319
6300A0319j0964R043l117o538M04j113k737J4421l381o937j1014j431J1737Q16
6286d92L461j507M073J0967N021m172j0788M90P867o468j4658o38j174M832Q363
6271E177q084m790Q165j742K109m623p758m423J0968J7094K741m321o541p085
6257c113o837N903N092k401k868K457N677N100l134j1952j4709m770o708l585
6243c5848M711K210J3997J2793M461Q119p970l981N298O232k890j4440j3472Q496
6229a2284L868j3162r76m846Q010J8716q485j3503l004O354l19j1614n03N452
6215b6296M659O473n838R407J6033L548O211k494j0651j6432j3430R721J2510
6202f579K895j2346J039Q081J491O504J0193O778n500q019k754n071P889n35N90
$$ plain form
6300 10319 -645 8398 5281 -1257 -853 -1966 -4703 9718 6337 -600 -11614 -13045 -1308 -492
6286 -492 2969 1462 5535 16502 21523 17351 6563 7053 14920 8452 -6206 -6844 -8018 -3186 5177
6271 5177 -2907 -7697 468 -1274 835 -3788 -11546 -15969 -5001 12093 14834 10513 3972 -3113
6257 -3113 -9950 -4047 1045 -1356 -4224 -1767 3910 9010 5876 -6076 -20785 -25555 -32263 -35848
6243 -35848 -31137 -28927 -14930 -2137 2324 10443 2473 -1508 3790 10022 7132 -7308 -20780 -12284
6229 -12284 -8416 -21578 -22554 -27400 -19390 -674 -9159 -22662 -25666 -19312 -19631 -31245 -31748 -26296
6215 -26296 -21637 -15164 -21002 -11595 4438 7986 14197 11703 1052 -15380 -28810 -19089 -6579
6202 -6579 -3684 -16030 -14991 -6910 -5419 1085 11278 18056 12556 4537 1783 -3288 4601 4066 4656
6187D656q691l236O4o751L609j581o155K561J0431M586J1449m585O360q865j4488
6172a0636j1211k524R678J3165R896j0731p892j4023j96P597n147K436J3678p59
6158f669p984J081J2116m252k2050q214K0071K0291j1752o959r145L620N839q358
6144b2365J79P966J7649q776n942J2655K275m3m609n608M067o179R088J650n010
6129c003j1924o852Q560l887M661J2813J1930R202o146o262k565j0137L279J9747
6115A9416o123j5424j2618j7972R127J1495n935o297J660M320P008Q026N127m634
6101b824n760L110q381k141J878J647J2479L438n440M437n8O740j2929r471Q861
6086d414r314r159j162J4262m843j581Q656L714M683N103j4630j1263j6347p912
$$ plain form
6187 4656 -4035 -7271 -7207 -13958 -10349 -11930 -18085 -15524 -5093 -507 10942 6357 12717 3852 -10636
6172 -10636 -21847 -24371 -14693 -1528 8368 -2363 -10255 -24278 -24474 -16877 -22024 -19588 -5910 -6669
6158 -6669 -14653 -13572 -1456 -5708 -27758 -35972 -15901 4390 -7362 -14321 -23466 -19846 -14007 -22365
6144 -22365 -22186 -14220 3429 -5347 -11289 1366 3641 3598 -1011 -6619 -2552 -8731 357 2007 -3003
6129 -3003 -14927 -21779 -13219 -17106 -12445 368 12298 21500 15354 9092 6527 -3610 -331 19416
6115 19416 13293 -2131 -14749 -32721 -23594 -12099 -18034 -24331 -22671 -18351 -11343 -3317 1810 -2824
6101 -2824 -8584 -5474 -13855 -15996 -14118 -12471 8 3446 -1994 2443 2385 9125 -3804 -13275 -4414
6086 -4414 -13728 -22887 -24049 -9787 -14630 -16211 -7555 -3841 842 5945 -8685 -19948 -36295 -44207
6072d4207R233J0989K818R99N662p275k812J578m58O382Q121n380P485j77p144
6057a4186k74n588J253J5575k64K651R817K444j0012r712l53j876m658L683j227
6042a2727k043J6083j791j0433J4830j36j2969p008k643R263Q934J926P020m90
6028G816p467L026p858l384J0293n437o345m219K2858J0896N854k0712k4569N676
6014a3572J1684K686p018r430J6327P364j6508L16O792J6180K639p469p291K047
6000D747O93K910k6381o168P776N760J838L695J0545j405q640R57p599n745J2523
5985d494k179l502J812r401J4874O224m838j4313L578q226k715k542j654J6074
5971a1302j195j782j2758o201k279J6926J5594k920J5338J0521l316j3470L048
$$ plain form
6072 -44207 -34974 -23985 -21167 -20168 -14506 -21781 -24593 -23015 -23473 -17091 -8970 -14350 -6865 -7042 -14186
6057 -14186 -14460 -20048 -18795 -3220 -3484 -833 8984 11428 1416 -8296 -8649 -10525 -15183 -11500 -12727
6042 -12727 -14770 1313 -478 -10911 3919 3783 -9186 -16194 -18837 -9574 -640 1286 8306 7816
6028 7816 349 3375 -4483 -7867 2426 -3011 -9356 -13575 9283 20179 26033 5321 -19248 -13572
6014 -13572 -1888 798 -6220 -15650 677 8041 -8467 -8151 -1359 14821 17460 9991 2700 4747
6000 4747 5440 8350 -18031 -24199 -16423 -10663 -8825 -5130 5415 4010 -4630 -3673 -11272 -17017 -4494
5985 -4494 -6673 -10175 -8363 -17764 -2890 3334 -1504 -15817 -12239 -20465 -23180 -25722 -27376 -11302
5971 -11302 -12497 -14279 -27037 -33238 -35517 -18591 -2997 -5917 9421 19942 16626 3156 6204
5958F204K561k667R085N846j1610q775n738q356R725q60Q092L019j5451j0875
5944a9800J871L256l895l431N577j742q678p647J096j346j786j239M434l709m26
5929c7465J0907K2850N679p087k295j997L752m801l597n77P550R70M314P4m751
5914f474L110j647J1764j1017j8930N843R175j991O589q728R605J4636m58j3679
5900b202k371O413o031j2787l117J0248M375j1378J5361m241q899o438L037K310
5886a5720L919O536P123j2970O063J4824O701N223P809J78n008j2014p032n4m99
5871E079j8535q037k056P103k828P253J38k9J2220R57K979k952k655m489J30r92
5855f714k040o399N585L083N4L451j0996J2702L06j2010J2335L577N066p069j8167
$$ plain form
5958 6204 8765 6098 15183 21029 9419 644 -5094 -13450 -3725 -4585 3507 6526 -8925 -19800
5944 -19800 -17929 -14673 -18568 -21999 -16422 -18164 -26842 -34489 -33393 -34739 -36525 -37764 -33330 -37039 -37465
5929 -37465 -26558 -3708 1971 -5116 -7411 -9408 -5656 -10457 -14054 -14631 -7081 -6111 -1797 -1723 -6474
5914 -6474 -3364 -5011 6753 -4264 -23194 -17351 -8176 -10167 -3578 -12306 -2701 11935 11477 -2202
5900 -2202 -4573 1840 -4191 -16978 -20095 -9847 -5472 -16850 -1489 -5730 -14629 -21067 -18030 -15720
5886 -15720 -11801 -5265 1858 -11112 -5049 9775 16476 21699 29508 29686 24678 12664 5632 5578 5079
5871 5079 -13456 -21493 -23549 -16446 -19274 -12021 -11883 -11912 308 1265 4244 1292 -1363 -5852 -5722 -6714
5855 -6714 -8754 -15153 -9568 -6485 -6431 -2980 -13976 -1274 -968 -12978 -643 2934 8000 931 -17236
5840a7236o234k78L940J3310M383m777N114j295R004J717o257K181k533j8743
5826a7704o093P73J1580Q047O032j4391m209L929m270j368O987Q23m051j3195
5812b7110j320Q927J4576K0878j2096m326Q056O243r33M879p992o560m616n435
5798f829Q066L431n562j1533j9611L0M092N875K2071M818j2582q377j217J0083
5784g245K1660R411O757k324j833r972j9554j7539J668L126P173O851J951J3339
5770A3469J156j4329r808K7p77N135O220j2918n482J1907j058L009n397n484M491
5755i839J0571J940l375l291L129P921Q433R058O98m905m564j1944j0854q856
5741a5878j8069P227J494o186P19J7837q305Q846J2896J2812M273l913P285r351
$$ plain form
5840 -17236 -23470 -23748 -19808 -6498 -2115 -6892 -1778 -3073 5931 7648 1391 3572 1039 -17704
5826 -17704 -23797 -23024 -11444 -3397 2635 -11756 -15965 -12036 -16306 -17674 -10687 -9864 -13915 -27110
5812 -27110 -28430 -19503 -4927 15951 3855 -471 7585 13828 12895 17774 9782 3222 -1394 -6829
5798 -6829 1237 4668 -894 -12427 -32038 -32008 -27916 -22041 30 4848 -7734 -16111 -17328 -7245
5784 -7245 14415 23826 30583 28259 26426 16454 -3100 -20639 -18971 -15845 -8672 -1821 130 13469
5770 13469 14625 296 -9512 -9485 -10262 -5127 1093 -11825 -17307 -5400 -6458 -3449 -8846 -14330 -9839
5755 -9839 732 2672 -703 -3994 -865 7056 15489 24547 25245 20340 15776 3832 -7022 -15878
5741 -15878 -33947 -26720 -25226 -31412 -30693 -12856 -21161 -12315 581 13393 17666 13753 21038 11687
5727A1687j3530L21J404O974m457k2047k102J1656k843L82K93j4483J31J3504
5713a3110K178J5494J0668o851j7377m622K566p703J4325L372J289L291m498K185
5699A207K841J7279m853p394j3700r100O596m172L259P152j2890k655N583J1231
5685C84Q608o773J583l18k586J0620l421n506m486M69o722m926O907R86p179j211
5669a3571P96m160N148L154p924j1340R07j032J1023n253N008m47P897O020J4320
5654A0546j6944r738n089j0504m380Q533J2965O024Q879k028j1182M89N078r2
5640g443k765j2933k62J270j0871P793J5112o196o70J0146J5061Q814K896n201
5626A4751q73N487n774L1k897n191j1102n628J7812M208m922J46q755M218q546
$$ plain form
5727 11687 -1843 -1522 -118 6856 2399 -19648 -21750 -10094 -12937 -12555 -12262 -26745 -26614 -13110
5713 -13110 -10932 4562 15230 8379 -8998 -13620 -11054 -18757 -4432 -1060 229 3520 -978 1207
5699 1207 4048 21327 16474 9080 -4620 -13720 -7124 -11296 -8037 -885 -13775 -16430 -10847 384
5685 384 8992 2219 3802 3484 898 11518 8097 2591 -1895 -1426 -8148 -13074 -6167 -5181 -12360 -13571
5669 -13571 -12775 -16935 -11787 -8633 -16557 -27897 -26990 -28022 -16999 -22252 -17244 -17691 -9794 -3774 10546
5654 10546 -6398 -16136 -21225 -31729 -36109 -27576 -14611 -8587 292 -1736 -12918 -12429 -7351 -7443
5640 -7443 -10208 -23141 -23403 -22133 -33004 -25211 -10099 -16295 -16965 -6819 8242 17056 19952 14751
5626 14751 13878 19365 13591 13622 10725 5534 -5568 -11196 6616 10824 5902 6048 -2707 1511 -7035
5611g035M302R670j007J597l451j1083O272M973k796P54J3959m332l486j3883
5597e546j3715m915J829n83J036l71R438R081j863j377O511j9414N979N384o877
5582a5403J696l950n840N175M01r079N578Q865L05m766q440j0431Q918K5985J2583
5567A1597j7581p086r64M421l646O031M311j2434j367L605O408O458P018k804
5553C967Q12o178m869j1512m636N349K546M607J44K418R385j386k984j6088o280
5538b4705l541p357P638N618l634L470J0403O06K767K638p978m031j266M298o836
5523b1910r435j236j277J0374l887j685L0O286Q642J1310L692j605M85Q690n370
5508C104M831j0729m018m937m502P446Q576K484o595o801m847K0976L204m02n259
$$ plain form
5611 -7035 -2733 6937 5930 7527 4076 -7007 -735 4238 1442 2196 16155 11823 8337 -5546
5597 -5546 -19261 -24176 -22347 -22930 -21894 -22265 -12827 -3746 -5609 -6986 -475 -19889 -13910 -8526 -15403
5582 -15403 -13707 -17657 -23497 -18322 -17921 -27000 -21422 -12557 -12252 -17018 -25458 -35889 -26971 -986 11597
5567 11597 -5984 -13070 -14034 -9613 -13259 -7228 -2917 -15351 -16718 -13113 -6705 -247 6771 3967
5553 3967 4779 -1399 -6268 -17780 -22416 -17067 -14521 -9914 -9770 -7352 2033 647 -2337 -18425 -24705
5538 -24705 -28246 -35603 -27965 -22347 -25981 -22511 -12108 -11502 -8735 -6097 -14075 -18106 -19372 -15074 -21910
5523 -21910 -31345 -32581 -33858 -23484 -27371 -29056 -29026 -22740 -14098 -2788 904 -701 -216 8474 3104
5508 3104 7935 -2794 -6812 -11749 -16251 -8805 -229 2255 -4340 -11141 -15988 4988 8192 7790 2531
5493B531m750j4714Q331Q592K665k166p419k76l672N600J6353O935j7313j0870
5479a0173q420k063M499N053r32l960o991N863J1073J2314M046n883o144K957
5465A239P689Q314k945j477j6291J9493L894j2903m840j5888n466J1846l671p627
5451a8633J7888p511p9p19p758K433J5717J1086o723j2240L963j576l505j1617
5437a9274J597Q372j4468k133N579n69j4489J543K439m816l004J3350K101O565
5423a7207L131P955L192j408r235k80M890J1861P755j4412J34n660l010R565j826
5408d555l632R726l280j0049m82J1951k832o266r493K697K531N973r09N622j2149
5393a5147p597J1417J4997j4712K981M662p324j282p652q84L888p226j980J5466
$$ plain form
5493 2531 -2219 -16933 -8602 -10 2655 489 -6930 -7206 -10878 -5278 11075 18010 697 -10173
5479 -10173 -18593 -20656 -16157 -11104 -12036 -15996 -22987 -17124 -6051 6263 10309 4426 -1718 1239
5465 1239 8928 17242 14297 12820 -3471 16022 19916 7013 2173 -13715 -19181 -7335 -11006 -18633
5451 -18633 -745 -8256 -8335 -9054 -16812 -14379 1338 12424 5701 -6539 -2576 -4152 -7657 -19274
5437 -19274 -17677 -9305 -23773 -25906 -20327 -20896 -35385 -33842 -31403 -36219 -39223 -25873 -23772 -17207
5423 -17207 -14076 -6121 -2929 -4337 -13572 -13852 -8962 2899 10654 -3758 -3624 -9284 -12294 -2729 -4555
5408 -4555 -8187 1539 -1741 -11790 -12272 -321 -3153 -9419 -18912 -16215 -13684 -7711 -8620 -2998 -15147
5393 -15147 -22744 -11327 3670 -11042 -8061 -3399 -10723 -12005 -19657 -20541 -16653 -23879 -25859 -10393
5379a0393N586n720K391J8812j987K51k183m23Q410L573q44j4617m833j1437J989
5364a1425J6744P603p532j2584P255J4565J038j2060j0025n109l395N978Q748
5351a99j1136j8772q772N080J3792O589j2135N133P342j5018k184K209L251N396
5337a9424q174q178R604Q506Q120J2681j818q492j8016K53O797J808J232j439
5323a6540M192o1L505M733J2505l524j5287L481J0359l579M961J1244j4930k5973
5309b4914P617J4626Q386n088j0961O640M522o047o529k998r623K180k05Q507
5295a3887N628J356n285M093n092j0795P399J1942O783M981K787j2835j9120p162
5281b9207J1372Q547l75p178l180K555j1170p37l495k211J9867J3007j6040q709
$$ plain form
5379 -10393 -4807 -10527 -8136 10676 8689 8940 6757 6334 14744 18317 17473 2856 -1977 -13414 -11425
5364 -11425 5319 12922 5390 -7194 61 14626 15664 3604 -6421 -11530 -14925 -8947 -199
5351 -199 -11335 -30107 -38879 -33799 -20007 -13418 -25553 -20420 -13078 -28096 -30280 -28071 -24820 -19424
5337 -19424 -27598 -35776 -26172 -17666 -9546 3135 1317 -7175 -25191 -24938 -18141 -16333 -15101 -16540
5323 -16540 -12348 -12409 -8904 -4171 8334 4810 -10477 -6996 3363 -216 4745 15989 1059 -24914
5309 -24914 -17297 -2671 5715 627 -10334 -3694 828 -5219 -11748 -14746 -24369 -22189 -22394 -13887
5295 -13887 -8259 -6903 -12188 -8095 -13187 -23982 -16583 -4641 2142 7123 9910 -2925 -22045 -29207
5281 -29207 -17835 -9288 -9663 -16841 -20021 -17466 -28636 -29373 -32868 -35079 -15212 -2205 -18245 -26954
5267b6954L300Q436O842J6768n579q183O629J1163l070j2274o255q176J0179m260
5253a1434q492M377J7483O415o897m538o75L273J0407q034j0587r248M533K798
5239a0619j085p356p693p367N113J961J111N028j2543K201J6807k83J040K194
5225a1491J187q969R720N686o541l928l672Q223j365r12l530m730n22l240m136
5210b8220j0499J4895K5057l194j2318k0633m99K271J8710J4641K600l137M172
5197C846P828q741r696k966M281J068J20J1855L189q898n412M427R930m480j7232
5182a0881J846K89q261j526L6N119m323k016J2120J2424N210M870j0300j3532
5168h925o437O305J1035n697M155O9M877n659q341L323J0754J6565l541p770j6850
$$ plain form
5267 -26954 -23654 -15218 -8376 8392 2813 -5370 1259 12422 9352 -2922 -9177 -17353 -7174 -11434
5253 -11434 -19926 -15549 1934 8349 1452 -3086 -3761 -488 9919 1885 -8702 -17950 -13417 -10619
5239 -10619 -11704 -19060 -26753 -34120 -29007 -27046 -25935 -20907 -33450 -31249 -14442 -14725 -13685 -11491
5225 -11491 -10304 -19273 -9553 -3867 -10408 -14336 -18008 -9785 -11150 -12062 -15592 -20322 -20844 -24084 -28220
5210 -28220 -38719 -23824 1233 -1961 -14279 -34912 -35411 -33140 -14430 211 2811 -326 3846
5197 3846 11674 2933 -6763 -9729 -5448 -4380 -4260 7595 10784 1886 -3526 901 10831 6351 -10881
5182 -10881 -9035 -8746 -17007 -18533 -18497 -13378 -17701 -19717 -7597 4827 10037 14907 4607 -8925
5168 -8925 -15362 -9057 1978 -3719 436 505 5382 -277 -8618 -5295 5459 22024 18483 10713 -6137
5153f137o170l006J7220M105Q722q568l897l495j2710m325r408Q510K5185R538
5139A5564n869j8400q906J2689N486r431n830M519K472M314j3991J2649J6167
5126A1433J4205j60j7574j0477J7J758o16j834J010O308l524p795l348P27r476
5111a9346k920Q3j0889k273N553J9507l31j5814j334J6422J1745R862M253n271
5097I247j301k368l21k376M333j072j1498L175R312R159P2q082N71j3080P238
5082C009J983L061q853r837N276R919n92j7475j8443N705K0470O024q205j2125
5068b0083K90L015L465N36P594q24Q387n538Q073R146j0714j561L934R448K331
5053A7499J375k372j0416j1203k999o570p087O922N851Q519N596N868K161p820
$$ plain form
5153 -6137 -12307 -15313 1907 6012 14734 6166 2269 -1226 -13936 -18261 -27669 -19159 6026 15564
5139 15564 9695 -8705 -17611 -4922 564 -8867 -14697 -10178 -7706 -3392 -17383 -4734 11433
5126 11433 25638 25478 7904 -2573 -2556 -798 -1414 -3248 -2238 4070 546 -7249 -10597 -9870 -19346
5111 -19346 -22266 -22183 -33072 -35345 -29792 -10285 -10616 -26430 -27764 -11342 403 10265 14518 9247
5097 9247 7946 5578 5257 2881 7214 6142 -5356 -2181 7131 16290 16362 8280 8851 -4229 3009
5082 3009 4992 8053 -800 -10637 -5361 4558 3966 -13509 -31952 -26247 -5777 247 -7958 -20083
5068 -20083 -19793 -16778 -13313 -12777 -5183 -6007 2380 -3158 4915 14061 3347 1786 5720 15168 17499
5053 17499 18874 16502 6086 -5117 -8116 -14686 -21773 -14851 -9000 -481 5115 10983 13144 5324
5039E324k87L133j2003K46K614P068L327j6934M377J5766p639j5814K747Q616
5025E41R423j5675L943K225k031j747J623j5120j9806L966K1083R719j121O848
5011C871q60L707J83j1921j7817Q966p715p65P805O012l259r296j6199l684J1499
4996b9473Q896P896m17K467J9749L341q745l349n745J230k176n69L878M715j0149
4981h451k106K907p510r85M152J0446l557K864K0641r492j1483R456j8516p913
4967a9547J5112J1333k140M249K124n099l831J1409N818q491j1898k0139j5374
4954c6474R70J3878k299j4363P499M668k534Q082m66m430J0731J1806L335n514
4940e111j031J551J808n417k932P9J739M549j619p591l988o158J1743O389L896
$$ plain form
5039 5324 5037 8170 -3833 -3587 -973 6095 9422 -7512 -3135 12631 4992 -10822 -8075 541
5025 541 9964 -5711 -1768 457 -1574 -3321 -1698 -16818 -36624 -32658 -11575 -1856 -2977 3871
5011 3871 3011 6718 6901 -5020 -22837 -13871 -21586 -22351 -14546 -8534 -11793 -21089 -37288 -40972 -29473
4996 -29473 -20577 -12681 -13098 -10631 9118 12459 3714 365 -5380 -4150 -6326 -6895 -3017 1698 -8451
4981 -8451 -10557 -7650 -15160 -16145 -11993 -1547 -5104 -2240 18401 8909 -2574 6882 -11634 -19547
4967 -19547 -4435 6898 4758 9007 11131 6032 2201 13610 19428 10937 -961 -21100 -36474
4954 -36474 -35504 -21626 -23925 -38288 -30789 -26121 -28655 -20573 -21039 -25469 -14738 -2932 403 -5111
4940 -5111 -6142 -4591 -2783 -8200 -11132 -11053 -9314 -4765 -6384 -13975 -17963 -24121 -12378 -5989 -2093
4925b093Q586N601j1066k972j220k080J507k394m941M203J6816j4033n354r04
4911a0344r498L388r282n444J233J131k806R225m947N876K350k130L517P693N895
4896d143p757p046R645L893O83k746j3793m194J1960J2971j538r764m31l190P310
4881h140k834J821J7462O455p188p534L598J2823M725J685q568n019j5125j103
4867f942j243J093m44q921m274Q370J0729q245o681N052J7825J5139j997q495
4853A0966k77m982j0450m39J3432m23r676j973J01J894L812M107J0344Q62j0575
4838F723j8451O094K330P54j0962n955K170l01Q49l757j4268K2311K0392R54l547
4823E336k40q228j2658K033j275M162l669j0147Q96P176j2884K784J9279R356
$$ plain form
4925 -2093 6493 12094 1028 -1944 -3164 -5244 -3737 -6131 -11072 -6869 9947 -4086 -9440 -10344
4911 -10344 -19842 -16454 -25736 -31180 -29947 -28816 -31622 -22397 -27344 -21468 -19118 -21248 -17731 -10038 -4143
4896 -4143 -11900 -18946 -9301 -5408 -4725 -7471 -21264 -25458 -13498 -527 -2065 -11829 -12260 -15450 -8140
4881 -8140 -10974 -9153 8309 14764 7576 42 3640 16463 21188 22873 14305 9286 -5839 -6942
4867 -6942 -8185 -7092 -7536 -16457 -20731 -12361 -1632 -9877 -16558 -11506 6319 21458 19461 10966
4853 10966 10689 5707 -4743 -5182 8250 7827 -1849 -3822 -3721 -1827 1985 6092 16436 17298 6723
4838 6723 -11728 -5634 -3304 -2550 -13512 -19467 -17297 -17598 -16749 -20506 -34774 -12463 7929 8883 5336
4823 5336 5096 -3132 -15790 -13757 -15032 -10870 -14539 -24686 -23790 -16614 -29498 -26714 -7435 1921
4809A921q072n163n804J6764Q709o940N313R409N467k473q56p713J204n783j5735
4794i752j572k469N696J085l977M551J5945J7059L800j4693j3465n929p105n105
4780a5931O580R338P249m440K48o04m623m229J9176L382n144j0124M583n014j0092
4765i645N571J020L330o119r370k547m719Q540J5043K332J0269p267j796K017
4751F659l899j202j6063J218N14n425P294K102J857N304o134j6094p034K1081
4737i822J0151R33n22n820J712J4596J2236m304j3440j2954K546Q528k611l571
4723b342N322J4536p125r394n305l787m451o728K767Q124O20l403l759J772P392
4708e761L609m495q309p048O508J517J397q63J2401L393q384q029J387Q539R420
$$ plain form
4809 1921 -6151 -11314 -17118 -354 8355 1415 6728 16137 21604 19131 18275 10562 11766 5983 -9752
4794 -9752 -11324 -13793 -8097 -7012 -10989 -6438 9507 26566 30366 15673 2208 -3721 -10826 -15931
4780 -15931 -9351 -13 7236 2796 3044 2440 -2183 -6412 12764 16146 11002 878 5461 447 -9645
4765 -9645 -4074 -3054 276 -5843 -15213 -17760 -22479 -13939 1104 3436 13705 6438 4642 6659
4751 6659 2760 1558 -14505 -13287 -12773 -18198 -10904 -8802 -6945 -1641 -7775 -23869 -30903 -9822
4737 -9822 329 1262 740 -5080 -3368 11228 23464 19160 5720 -7234 -4688 3840 1229 -2342
4723 -2342 2980 17516 10391 997 -4308 -8095 -12546 -19274 -16507 -8383 -7763 -11166 -14925 -13153 -5761
4708 -5761 -2152 -6647 -14956 -22004 -15496 -13979 -12582 -13445 -1044 2349 -6035 -14064 -12677 -4138 5282
4693E282Q341r352j0741L944J0582j529j6303L258L014p292o219J2566J0221m526
4679A246j520n03M379o363Q045m369j058r003l350J0182L624n08L003M947N735
4664A4487p168m947N404Q325L644j1075j4078j0185n493j7597r419J4638K4153
4651i311m269k957J1230K094n540R610J2264R231o683n514q720k719N324q236
4637d196j555k723o144r620J5741O914l303O212j635n694l235N038j955o177M116
4622h216K2088K11p569m674O11K233m103q259J485N21Q608p557r562j4312J804
4607b6691L853O097K496K156n046m308o712j25L654R338P530m702r564J1134J8937
4592H047N285j0563o325q321J0834J1253l509o843j8797P065J1946o26r91J933
$$ plain form
4693 5282 13623 4271 -6470 -2526 8056 6527 -9776 -6518 -3504 -10796 -17015 -4449 5772 1246
4679 1246 -274 -777 3602 -2761 5284 915 -143 -9146 -12496 -2314 1310 802 3805 8752 14487
4664 14487 7319 2372 7776 16101 19745 8670 -5408 -15593 -21086 -38683 -48102 -33464 -9311
4651 -9311 -13580 -16537 -5307 -3213 -8753 857 13121 22352 15669 10155 1435 -1284 4040 -4196
4637 -4196 -5751 -8474 -14618 -24238 -8497 -1583 -4886 1326 -309 -6003 -9238 -4200 -6155 -12332 -8216
4622 -8216 13872 14083 6514 1840 2451 4684 581 -7678 -6193 -5672 2936 -4621 -14183 -28495 -26691
4607 -26691 -22838 -16741 -14245 -12089 -17135 -21443 -28155 -28280 -24626 -15288 -7758 -12460 -22024 -10890 8047
4592 8047 13332 2769 -3556 -11877 -1043 10210 6701 -142 -18939 -11874 72 -554 -1545 388
4578C88n174r419r860N729R274N456P391J169r155R05o725n365K709J4857q439
4563f259q059l316K340M26n749K749J7061J0986l097k2536p481n523m19j760K0072
4548a0565q295L154K265l756j0650l416O420M984R183J5411K861J205j607k63
4534F931j0410L305L807Q231p535m805n474r921M12N699k513R506L895j355j909
4519b136j9688p151J0997J3169j07n925k215O422J972q140k612j809N086M508
$$ plain form
4578 388 -4786 -14205 -24065 -18336 -9062 -3606 3785 4954 -4201 -3296 -10021 -15386 -12677 2180 -6259
4563 -6259 -14318 -17634 -15294 -14868 -20617 -17868 -807 10179 7082 -15454 -22935 -28458 -28877 -30637 -10565
4548 -10565 -18860 -15706 -13441 -17197 -27847 -31263 -24843 -19859 -10676 4735 7596 8801 7194 6931
4534 6931 -3479 -174 3633 11864 4329 -476 -5950 -15871 -15459 -9760 -12273 -2767 1128 -227 -2136
4519 -2136 -21824 -28975 -17978 -4809 -4916 -10841 -13056 -6634 -4662 -12802 -15414 -17223 -12137 -7629
$$ [...]
##END NTUPLES=NMR SPECTRUM
##END=
