##TITLE=Analysis number 329585
Compound Code cc 66910
Book Reference 510/80
Project Code adrs
Chemist Name jimp
##JCAMPDX= 6.0         $$ Bruker NMR JCAMP-DX V2.0
##DATA TYPE= NMR SPECTRUM
##DATA CLASS= NTUPLES
##ORIGIN= Bruker BioSpin GmbH
##OWNER= nmr
$$ XWIN-NMR		Version 3.5
$$ Fri Sep 14 11:57:13 2007 GMT Daylight Time (UT+1h)  MAYBRIDGE\nmr@NMR_250MHZ
##.OBSERVE FREQUENCY= 250.131544655141
##.OBSERVE NUCLEUS= ^1H
##.ACQUISITION MODE= SIMULTANEOUS (DQD)
##.ACQUISITION SCHEME= undefined
##.AVERAGES= 16
##.DIGITISER RES= 18
##SPECTROMETER/DATA SYSTEM= dpx250
##.PULSE SEQUENCE= zg30
##.SOLVENT NAME= CDCl3
##.SHIFT REFERENCE= (INTERNAL, CDCl3, 0, 16.522)
##AUDIT TRAIL= $$ (NUMBER, WHEN, WHO, WHERE, WHAT)
$$ ##TITLE= Audit trail, XWIN-NMR		Version 3.5
$$ ##JCAMPDX= 5.01
$$ ##ORIGIN= Bruker BioSpin GmbH
$$ ##OWNER= nmr
$$ C:\u/data/dgb/nmr/ADRS/1630/pdata/1/auditp.txt
$$ ##AUDIT TRAIL=  $$ (NUMBER, WHEN, WHO, WHERE, WHAT)
(   1,<2007-09-14 11:56:50.70 +100>,<MAYBRIDGE\nmr>,<NMR_250MHZ>,
      <created by zg, POWCHK disabled, PULCHK disabled
       configuration hash MD5:
       76 6E 9A 78 1E 09 19 81 EC 84 63 8F B0 6A 59 2D
       data hash MD5: 64K
       07 E0 5F 5B 69 12 8E 1D 7D 86 BE 18 41 8A E9 8D>)
(   2,<2007-09-14 11:57:02.56 +100>,<MAYBRIDGE\nmr>,<NMR_250MHZ>,
      <Start of raw data processing
       ef LB = 0.3 FT_mod = 6 PKNL = 1 SI = 32K 
       data hash MD5: 32K
       95 68 9B FC FD 63 C3 1F 4A 45 07 F7 EA 8C AA C3>)
(   3,<2007-09-14 11:57:04.20 +100>,<MAYBRIDGE\nmr>,<NMR_250MHZ>,
      <apk 
       data hash MD5: 32K
       91 BB 23 9C E6 6E 00 94 57 A7 51 E5 EA F5 1D F4>)
(   4,<2007-09-14 11:57:04.92 +100>,<MAYBRIDGE\nmr>,<NMR_250MHZ>,
      <abs ABSG = 5 
       data hash MD5: 32K
       65 46 2D 1A ED 44 E4 DD 63 BD 31 6F 1A 14 E6 34>)
$$ ##END=
$$ 
$$ hash MD5
$$ 02 2C A9 E3 86 26 CE 1C 9F DC 1F E9 F0 63 AE 0D
##$RELAX= 
##$RELAX= 
##$RELAX= 
##$RELAX= 
##$RELAX= 
##$RELAX= 
##$RELAX= 
$$ Bruker specific parameters
$$ --------------------------
##$DU= <C:\u>
##$EXPNO= 1630
##$NAME= <ADRS>
##$PROCNO= 1
##$TYPE= <nmr>
##$USER= <dgb>
##$AMP= (0..31)
100 100 100 100 100 100 100 100 100 100 100 100 100 100 100 100 100 100 
100 100 100 100 100 100 100 100 100 100 100 100 100 100 
##$AQSEQ= 0
##$AQ_mod= 3
##$AUNM= <au_zg>
##$AUTOPOS= <25 >
##$BF1= 250.13
##$BF2= 250.13
##$BF3= 250.13
##$BF4= 250.13
##$BF5= 500.13
##$BF6= 500.13
##$BF7= 500.13
##$BF8= 500.13
##$BYTORDA= 1
##$CFDGTYP= 0
##$CFRGTYP= 5
##$CHEMSTR= <none>
##$CNST= (0..31)
1 1 145 1 1 1 1 1 1 1 1 1 1 1 1 1 1 1 1 1 1 1 1 1 1 1 1 1 1 1 1 1 
##$CPDPRG= <>
##$CPDPRG1= <>
##$CPDPRG2= <>
##$CPDPRG3= <>
##$CPDPRG4= <mlev>
##$CPDPRG5= <mlev>
##$CPDPRG6= <mlev>
##$CPDPRG7= <mlev>
##$CPDPRG8= <mlev>
##$CPDPRGB= <>
##$CPDPRGT= <>
##$D= (0..31)
0 1 0 0 0 0 0 0 0 0.06 0 0 0 0 0 0 0.0002 0 0 0 0 0 0 0 0 0 0 0 0 0 0 
0 
##$DATE= 1189767409
##$DBL= (0..7)
120 120 120 120 120 120 120 120 
##$DBP= (0..7)
150 150 150 150 150 150 150 150 
##$DBP07= 0
##$DBPNAM0= <>
##$DBPNAM1= <>
$$ [...]
##$SUBNAM7= <"">
##$SUBNAM8= <"">
##$SUBNAM9= <"">
##$SW= 20.6930455092707
##$SWIBOX= (0..15)
0 0 3 0 0 0 0 0 0 0 0 0 0 0 0 0 
##$SW_h= 5175.983436853
##$TD= 65536
##$TD0= 1
##$TE= 296.16
##$TE2= 300
##$TE3= 300
##$TEG= 300
##$TL= (0..7)
0 120 120 120 120 120 120 120 
##$TP= (0..7)
150 150 150 150 150 150 150 150 
##$TP07= 0
##$TPNAME0= <>
##$TPNAME1= <>
##$TPNAME2= <>
##$TPNAME3= <>
##$TPNAME4= <>
##$TPNAME5= <>
##$TPNAME6= <>
##$TPNAME7= <>
##$TPOAL= (0..7)
0.5 0.5 0.5 0.5 0.5 0.5 0.5 0.5 
##$TPOFFS= (0..7)
0 0 0 0 0 0 0 0 
##$TUNHIN= 0
##$TUNHOUT= 0
##$TUNXOUT= 0
##$USERA1= <user>
##$USERA2= <user>
##$USERA3= <user>
##$USERA4= <user>
##$USERA5= <user>
##$V9= 5
##$VALIST= <valist>
##$VCLIST= <CCCCCCCCCCCCCCC>
##$VD= 0
##$VDLIST= <DDDDDDDDDDDDDDD>
##$VPLIST= <PPPPPPPPPPPPPPP>
##$VTLIST= <TTTTTTTTTTTTTTT>
##$WBST= 1024
##$WBSW= 4
##$XGAIN= (0..3)
0 0 0 0 
##$XL= 0
##$YL= 0
##$YMAX_a= 412841
##$YMIN_a= -273847
##$ZGOPTNS= <>
##$ZL1= 120
##$ZL2= 120
##$ZL3= 120
##$ZL4= 120
##$ABSF1= 16.522
##$ABSF2= -4.171173
##$ABSG= 5
##$ABSL= 3
##$ALPHA= 0
##$AQORDER= 0
##$ASSFAC= 0
##$ASSFACI= 0
##$ASSFACX= 0
##$ASSWID= 0
##$AUNMP= <proc_1d>
##$AZFE= 0.1
##$AZFW= 0.1
##$BCFW= 0
##$BC_mod= 0
##$BYTORDP= 0
##$COROFFS= 0
##$CY= 12.5
##$DATMOD= 1
##$DC= 0
##$DFILT= <>
##$DTYPP= 0
##$F1P= 14.0000005364418
##$F2P= -0.99999901652339
##$FCOR= 0.5
##$FTSIZE= 32768
##$FT_mod= 6
##$GAMMA= 0
##$GB= 0
##$INTBC= 1
##$INTSCL= 1
##$ISEN= 128
##$LB= 0.3
##$LEV0= 0
##$LPBIN= 0
##$MAXI= 10000
##$MC2= 0
##$MEAN= 0
##$ME_mod= 0
##$MI= 0
##$NCOEF= 0
##$NC_proc= -2
##$NLEV= 6
##$NOISF1= 0
##$NOISF2= 0
##$NSP= 0
##$NTH_PI= 0
##$NZP= 0
##$OFFSET= 16.522
##$PC= 1
##$PHC0= -62.50854
##$PHC1= 9.652372
##$PH_mod= 1
##$PKNL= yes
##$PPARMOD= 0
##$PSCAL= 4
##$PSIGN= 0
##$REVERSE= no
##$SF= 250.13
##$SI= 32768
##$SIGF1= 0
##$SIGF2= 0
##$SINO= 400
##$SIOLD= 32768
##$SREGLST= <1H.CDCl3>
##$SSB= 0
##$STSI= 32768
##$STSR= 0
##$SW_p= 5175.98343685301
##$SYMM= 0
##$S_DEV= 0
##$TDeff= 65536
##$TDoff= 0
##$TI= <Analysis number 999999
Compound Code 99
Book Reference 9
Project Code 9>
##$TILT= no
##$TM1= 0
##$TM2= 0
##$TOPLEV= 0
##$USERP1= <user>
##$USERP2= <user>
##$USERP3= <user>
##$USERP4= <user>
##$USERP5= <user>
##$WDW= 1
##$XDIM= 32768
##$YMAX_p= 322566788
##$YMIN_p= -56926
$$ End of Bruker specific parameters
$$ ---------------------------------
##NTUPLES= NMR SPECTRUM
##VAR_NAME=  FREQUENCY,     SPECTRUM/REAL,   SPECTRUM/IMAG
##SYMBOL=    X,             R,               I
##VAR_TYPE=  INDEPENDENT,   DEPENDENT,       DEPENDENT
##VAR_FORM=  AFFN,          ASDF,            ASDF
##VAR_DIM=   32768,         32768,           32768
##UNITS=     HZ,            ARBITRARY UNITS, ARBITRARY UNITS
##FACTOR=    0.157963299565203, 1,           1
##FIRST=     4132.6476996994, 0,             0
##LAST=      -1043.33573715361, 0,           0
##MIN=       -1043.33573715361, -56926,      0
##MAX=       4132.6476996994, 322566788,     0
$$ Real data points
##PAGE= N=1
##DATA TABLE= (X++(R..R)), XYDATA
$$ [...]
19330A3449N68N997L501m232j2893n744J2464L088L241j3416p312J4212J7915
$$ 13449 14017 20014 23515 19283 6390 646 13110 16198 19439 6023 -1289 12923 30838
19317C0838j467r219n616p508N557K198k624J5578N24j3185j4242j4583j2527
$$ 30838 29371 20152 14536 7028 12585 14783 12159 27737 28261 15076 834 -13749 -26276
19304b6276K704N048J8385J1272k981K651j5563m038n948J0582N223m974N105
$$ -26276 -23572 -18524 -139 11133 8152 10803 -4760 -8798 -14746 -4164 1059 -3915 1190
19291A190q70l605j2468L764J2953N459m126n242R259N261L398J644o069k266
$$ 1190 320 -3285 -15753 -11989 964 6423 2297 -2945 6314 11575 14973 16617 10548 8282
19277H282k84J795J2694L39k5147j4203p917L135N43Q789p94P703O723o726M004
$$ 8282 7998 9793 22487 22826 -2321 -16524 -24441 -21306 -20763 -11974 -12768 -5065 1658 -5068 -1064
19262a064r58m062J60N091P10O851m998o10n336Q138Q012P761R48m004j194o389
$$ -1064 -2022 -6084 -5924 -833 -123 6728 1730 1120 -4216 3922 11934 19695 20643 16639 15445 9056
19246I056j1875J0663l87J528j775j614Q384N373K511j6955m025J7496n467j7937
$$ 9056 -2819 7844 7457 8985 7210 5596 13980 19353 21864 4909 884 18380 12913 -5024
19232e024o898J1538J6264N038K074j7838J594O950M143K30j2660j4479j2059
$$ -5024 -11922 -384 15880 20918 22992 5154 6748 13698 17841 18071 5411 -9068 -21127
19219b1127q427P099L613l563K903M384J1499J6251K039n600J086K249O221J882
$$ -21127 -29554 -22455 -18842 -22405 -19502 -15118 -3619 12632 14671 9071 10157 12406 18627 20509
19205B0509K700m370p181j0510j4321j888J9120M912K378N800J161p952j6755
$$ 20509 23209 18839 11658 1148 -13173 -15061 4059 8971 11349 17149 18310 10358 -6397
19192f397M528k153R495L094J712J135K171M350k739J34k610M212o668p859N355
$$ -6397 -1869 -4022 5473 8567 10279 11414 13585 17935 15196 15330 12720 16932 10264 2405 7760
19177G760J145O127J023q866j555q570L279L632o8l373Q42l888L368J3248P010
$$ 7760 8905 15032 16055 7189 5634 -2936 343 3975 3907 534 1376 -2512 856 14104 21114
19162B1114o089k1548k749P703M556L25Q43J0210J1480o838m775m605q675P207
$$ 21114 15025 -6523 -9272 -1569 2987 3312 4155 14365 25845 19007 14232 9627 952 8159
19148H159N28O277j718q266l412k498O806n403k101J2820N406M857L701o598q420
$$ 8159 8687 14964 13246 4980 1568 -930 5876 473 -1628 11192 16598 21455 25156 18558 10138
19133A0138l739r988p16N675L592N108o844j268k97P072k647q004O087M683N259
$$ 10138 6399 -3589 -4305 1370 4962 10070 3226 1958 1661 8733 6086 -1918 4169 8852 14111
19118A4111j003N195m398p552n140j4392o74n827O042Q093R38Q6M49J6708J3888
$$ 14111 13108 18303 13905 6353 1213 -13179 -13853 -19680 -13638 -5545 -4607 -4521 -4072 12636 26524
19103B6524O872j670L917L923K66L077m763k124L217J4014N113O798L9491M3047
$$ 26524 33396 31726 35643 39566 39832 42909 38146 36022 39239 53253 58366 65164 104655 147702
19089A47702K5969J232j7093j1091K147L883J6807J0216j8870l1910l4647k1738
$$ 147702 173671 174903 157810 146719 148866 152749 169556 179772 160902 128992 94345 72607
19077G2607k2921q842J813k945j0860J0022l250k3419l868n704N603N357L370
$$ 72607 49686 40844 42657 39712 28852 38874 35624 12205 8337 2633 8236 13593 16963
19064A6963j0413p120J1067M550O727o760j4486J176J3754k92j559n635j517m748
$$ 16963 6550 -570 10497 15047 21774 15014 528 1704 15458 15166 13607 7972 6455 1707
19050A707K257J6765j024o161O310J5998J7008J2328K5581M0628K1635K2743P8
$$ 1707 3964 20729 19705 13544 19854 35852 52860 65188 90769 131397 153032 175775 175853
19037A75853k4924j7932M239J2663K4678K828k0305n1588l8519k3882k0540Q88
$$ 175853 150929 132997 137236 149899 174577 177405 157100 105512 66993 43111 22571 23459
19025B3459j0737j3186J4072J8494L803j927j536m726n90K2516R509k1257k4078
$$ 23459 12722 -464 13608 32102 35905 33978 32442 27716 27126 49642 59151 37894 13816
19012A3816m172J3975n15p060J0210O161o573K738P946l026J831j930k118j0025
$$ 13816 9644 23619 23104 16044 26254 32415 25842 28580 36526 33500 35331 33401 31283 21258
18998B1258m67J834j3564r57J844k911M219L242R00J336L991J1236J3823j7666
$$ 21258 20791 22625 9061 8104 9948 7037 11256 14498 15398 16734 20725 31961 45784 28118
18984B8118k986J3310K531j142K374J675j4102k0416j37O683j341Q543Q657N599
$$ 28118 25132 38442 40973 39831 42205 43880 29778 9362 9225 15908 14567 23110 31767 37366
18970C7366j8022k4537q67J7939r81N403L454J1496k308l815p006P06J251R667
$$ 37366 19344 -5193 -6060 11879 10898 16301 19755 31251 28943 25128 18122 18828 20079 29746
18956B9746K025j0381K992l337n905Q59J0474j1802o508R830p760r22K787l699
$$ 29746 31771 21390 24382 21045 15140 15999 26473 14671 8163 17993 10233 9311 12098 8399
18942H399j4528j363j013J1686O119K7340O257j0739L722N727j6519k7449P448
$$ 8399 -6129 -7492 -8505 3181 9300 36640 42897 32158 35880 41607 25088 -2361 5087
18929E087R815J0378l56j1554l90K852J3665k268p620O91r54o885j2497M1J6735
$$ 5087 14902 25280 24924 13370 12980 15832 29497 27229 19609 20300 19346 12461 -36 5 16740
18914A6740o570p271M110J0066J7525L658j181j2063L565R158k934q570Q88j0648
$$ 16740 10170 2899 7009 17075 34600 38258 37077 25014 28579 37737 34803 26233 27121 16473
18900A6473j1520O470J3927P846P308j37k050k1847O698R886m767m619j3378p039
$$ 16473 4953 11423 25350 33196 40504 40367 38317 16470 23168 33054 28287 23668 10290 3251
18886C251J82Q9O142q075l481m794n115Q454J0678J0470J0466k599K882m066j3429
$$ 3251 3433 3522 9664 1589 -1892 -6686 -11801 -3347 7331 17801 28267 25668 28550 24484 11055
18871A1055j5467P208P633O888p8j5528j067J0817P739p238k274Q832L722N859
$$ 11055 -4412 2796 10429 17317 17239 1711 644 11461 19200 11962 9688 18520 22242 28101
18857B8101o658L68O598m611j1344K03M011L270J1958q980J464j5997P783J0151
$$ 28101 21443 21811 28409 23798 12454 12657 16668 19938 31896 22916 24380 8383 16166 26317
18843B6317J0322o183l749J4995j513K039J9212N257k6229j9330L192J0268J2003
$$ 26317 36639 30456 26707 41702 40189 42228 61440 66697 40468 21138 24330 34598 46601
18830D6601N793r507j3355R313J29p215j2207m435J0493L820n635k609J2927n429
$$ 46601 52394 42887 29532 38845 38974 31759 19552 15117 25610 29430 23795 21186 34113 28684
18816B8684n687j1239k437K303J0529J1983J5548l713R36p573o170k669J499J1323
$$ 28684 22997 11758 9321 11624 22153 34136 49684 45971 46907 39334 33164 30495 31994 43317
18802D3317n997j1725P542J0192P344O663Q077K0253J9403R398J2859J5922J5592
$$ 43317 37320 25595 33137 43329 50673 57336 65413 85666 105069 114467 127326 143248 158840
18789A58840J8163J0788l813j1228m959k109L5011p203k8149j0511k4032l7633
$$ 158840 177003 187791 183978 172750 167791 165682 200693 193490 165341 154830 130798 93165
18777I3165j9649M918j2118p410q348P083K4681J8190K1265J8351L9273L0180
$$ 93165 73516 78434 66316 58906 50558 57641 82322 100512 121777 140128 179401 209581
18765B09581l3207m7343l2535k1882o090J4661j962k6473o756l764J0699M880
$$ 209581 176374 129031 96496 74614 68524 83185 81223 54750 47994 44230 54929 59809
18753E9809J5947J483K023Q721J881p286k704P571R965J6357L0498K7981J1491
$$ 59809 75756 77239 79262 87983 89864 82578 79874 87445 97410 113767 144265 172246 183737
18740A83737O26J267q0J074J3960L294p613j3631o490l2640n2307m0129k8332
$$ 183737 184363 185630 185550 186624 200584 203878 196265 182634 176144 143504 91197 51068 22736
18727B2736j517M398J0123J1430J1040K880j2569j783O084l37j21j641J091Q900
$$ 22736 21219 25617 35740 47170 58210 61090 48521 46738 52822 52485 52364 50723 51814 60714
18713F0714N984P53k838L578J885N198K999p505k584j6183j9335J26N533J4060
$$ 60714 66698 67451 64613 68191 70076 75274 78273 70768 68184 52001 32666 32792 38325 52385
18699E2385N501J2740r100K242l961j17j722Q201K234K505M21k517j292J2225
$$ 52385 57886 70626 61526 63768 59807 59690 57968 66169 68403 70908 71329 68812 67520 79745
18685G9745k1152j4660O084P03J3653j096J2441l57r300K2061J4158R707K3663
$$ 79745 58593 43933 50017 50720 64373 63277 75718 75361 66061 88122 102280 111987 135650
18672A35650O401K347p886o69J3993J0095Q333j0451o518N767l902k4209k8181
$$ 135650 142051 144398 136512 135843 149836 159931 168264 157813 151295 157062 153160 128951 100770
18659A00770j5184J5983n609q883J3157L440P72l767P53l716J0717J3538M583
$$ 100770 85586 101569 95960 87077 100234 103674 104446 100679 101432 97716 108433 121971 126554
18646A26554L310j142K126l367n15j995K11l431R449K0647J187l976j0057J359
$$ 126554 129864 128722 130848 127481 126966 124971 125182 121751 131200 151847 153034 149058 139001 140360
18632A40360J1512K3563L174n697o745j009J9864K3643K6604L4083L3205J4595
$$ 140360 151872 175435 178609 172912 166167 165158 185022 208665 235269 269352 302557 317152
18620C17152P957K5555L9915M8938K6196k112K0197N8928P0382Q1622M4997L3031
$$ 317152 325109 350664 390579 439517 465713 463601 483798 542726 613108 694730 739727 772758
18608G72758j0438o882L7711O8272P7178Q3182N7448N8274J00333J67069K33910
$$ 772758 762320 755438 793149 861421 938599 1021781 1079229 1137503 1237836 1404905 1638815
18597A638815L08811L93998M64369N25276N83595O93798Q77192J192326J721937
$$ 1638815 1947626 2341624 2805993 3331269 3914864 4608662 5485854 6678180 8400117
18588H400117K569054L689896M899962N705795L960479q02482m441655l484285
$$ 8400117 10969171 14659067 19559029 25264824 29225303 28422821 23981166 20496881
18580B0496881P7621K988675L732574M63847m961969p487343n762656l190215
$$ 20496881 20574502 23563177 27295751 27759598 22797629 15310286 9547630 6357415
18572F357415j755268j066593p09439m52733k82625k08458j90245j68362j18304
$$ 6357415 4602147 3535554 2826115 2373382 2090757 1882299 1692054 1523692 1405388
18563A405388n8248Q609N8776N2405R776l7188o0268o782K9470O8542J06309O9061
$$ 1405388 1347140 1355749 1414525 1466930 1476706 1439518 1379250 1372468 1401938 1470480 1576789 1645850
18551A645850M5556P6015J32241K16903L08189M25890N23142N83588O66927P93086
$$ 1645850 1691406 1767421 1899662 2116565 2424754 2850644 3373786 3957374 4624301 5417387
18541E417387J038106J446241K111322L105249M348864N675517O165234L281419
$$ 5417387 6455493 7901734 10013056 13118305 17467169 23142686 29307920 32589339
18533C2589339k194926n110531k949180R91660L737359L571554r86092o606277
$$ 32589339 30394413 25283882 22334702 23326362 27063721 30635275 29649183 23042906
18525B3042906q093730n610804l088645j750588j081101o71654m28184l20348
$$ 23042906 14949176 9338372 6249727 4499139 3418038 2746384 2318200 1997852
18517A997852k84335k68507k32666j59392r8101m1134j1417l145k5765p2287q6306
$$ 1997852 1713517 1445010 1212344 1052952 954851 913717 902300 899155 873390 801103 714797
18506G14797o8424l4394Q488R116j2057o3197q8922q9228o5160l4269k2271j8632
$$ 714797 646373 611979 620467 629583 617526 554329 465407 376179 311019 276750 254479 235847
18494B35847q859r359k1099q860q561N394N394r103N729J3475J1262k395J7748
$$ 235847 226988 217629 196530 187670 179109 184503 189897 180794 186523 199998 211260 208865 226613
18481B26613K5017K155J9381N8006N7917N2127O6000M9375l9903p4511k7476K291
$$ 226613 251630 253785 273166 331172 389089 441216 507216 556591 516688 442177 414701 416992
18469D16992M8942P5867j9054j17409j23550o6495l4396k5807m892K986m343p797
$$ 416992 465934 541801 522747 405338 281788 215293 180897 155090 150198 153184 148841 141044
18457A41044j1928j098o972j714j2544r427Q241M831O498j030k8917q977j6154
$$ 141044 129116 128018 121046 119332 106788 97361 105602 110433 116931 115901 86984 78007 61853
18444F1853j6191J4834K0922O094n842j2575J5075K373q104J6071K2179J6132
$$ 61853 45662 60496 81418 87512 81670 69095 84170 86543 78439 94510 116689 132821
18432A32821J8821J3728K0709L3496N7172Q1613Q6468J08200L2329q5816r8754
$$ 132821 151642 165370 186079 219575 276747 358360 444828 553028 585357 499541 400787
18421D00787k8425L0805P5177N6550o0657j43585j10810o1330j8698j9336k4470
$$ 400787 372362 403167 478344 534894 474237 330652 219842 158512 139814 120478 96008
18410I6008m250J0679j8876n074J1565J2347n396Q21J755k531j9051q837K338
$$ 96008 91758 102437 83561 78487 90052 102399 97003 97824 99579 97048 77997 69160 71498
18397G1498j331L522K171o424o675p531K212j8863r709J6226J5058J3111R852
$$ 71498 70167 73689 75860 69436 62761 55230 57442 38579 28870 45096 60154 73265 83117
18384H3117j8402j3551r117J2129N017j73k90J9560l985j1558Q215L647o786n416
$$ 83117 64715 51164 42047 54176 59193 59020 58730 78290 74305 62747 70962 74609 67823 62407
18370F2407n545l64J495J1821Q848r15k55M903J3378n903r311l090J7526J1474
$$ 62407 56862 56498 57993 69814 78662 77747 77492 82395 95773 89870 80559 77469 94995 106469
18356A06469n137q63p054j7005j3219K421Q133M9q475R353N857J1253K501J7212
$$ 106469 101332 100469 93415 76410 63191 65612 73745 73794 65319 74672 80529 91782 94283 111495
18342A11495K0856m494p035m673J9661J3591j27j0048r930j1832j102N834J0544
$$ 111495 132351 127857 120822 116149 135810 149401 149274 139226 129296 117464 116362 122196 132740
18329A32740o834j1826n996q567R839J2337J7464q31p81m987L736P487L356j786
$$ 132740 125906 114080 108084 99517 109356 121693 139157 138326 137545 132558 136294 143781 147137 145351
18315A45351J1526K0423J3319K0437J2093Q060J4259J1104J0291K3965J4070J4221
$$ 145351 156877 177300 190619 211056 223149 231209 245468 256572 266863 290828 304898 319119
18303C19119L5434M3050N9221O9377P6307O5161M8928M3964N2041L3981M4433
$$ 319119 354553 397603 456824 526201 602508 667669 716597 760561 812602 846583 891016
18292H91016Q5105Q1187Q2823Q3579J02118J36051K10325K88112L55528M14058
$$ 891016 976121 1057308 1140131 1223710 1325828 1461879 1672204 1960316 2315844 2729902
18282B729902M79984N79739O85105Q85770J246073J780901K546006L461352M582232
$$ 2729902 3209886 3789625 4474730 5360500 6606573 8387474 10933480 14394832 18977064
18273A8977064N200392J923736k68098j12757k553919j739280J505269J972366
$$ 18977064 24177456 26101192 25833094 25720337 23166418 21427138 22932407 24904773
18265B4904773j625707k054730l517966n974677m290081k249931j248982p32183
$$ 24904773 23279066 21224336 17706370 11731693 7441612 5191681 3942699 3210516
18257C210516m40369k90140j71341j41604j15239p8071o1993J461K8153K946j8396
$$ 3210516 2770147 2480007 2308666 2167062 2051823 1973752 1911759 1913220 1941373 1944319 1925923
18246A925923k0011o0308n5797k1738K9751M3639J03607J19010J43675K42720
$$ 1925923 1905912 1845604 1789807 1768069 1797820 1841459 1945066 2064076 2207751 2450471
18236B450471L41892M24279M92583O28109P64047R70904J376570K005248K898965
$$ 2450471 2792363 3216642 3709225 4337334 5101381 6072285 7448855 9454103 12353068
18227A2353068L965887N241558O151701K702029l85869p0136k929403k498454
$$ 12353068 16318955 21560513 27712214 30414243 30028374 29958238 27028835 24530381
18219B4530381J226194K264917j593356k505528l715281o683278n131856k755388
$$ 24530381 25756575 28021492 26428136 23922608 20207327 13524049 8392193 5636805
18211E636805j532603q95658n49146l58453k19912j90783j63895j41480j53838
$$ 5636805 4104202 3208544 2659398 2300945 2081033 1890250 1726355 1584875 1431037
18202A431037r9089l2133l7471o7397p4141j26714j49719j09068o2817m3657l2386
$$ 1431037 1331948 1299815 1262344 1194947 1120806 994092 844373 735305 672488 628831 596445
18191E96445l9408o6602o7722p6852n3368k0093l2684l6128j2160j1219l140O417
$$ 596445 557037 490435 422713 345861 292493 272400 239716 203588 191428 180209 177069 183486
18179A83486J0046J207k3175j9802J206j1429N684L513Q11K559j5012O578J9492
$$ 183486 193532 194739 171564 151762 152968 141539 147223 150736 151547 154106 139094 145672 165164
18166A65164L479k1104j1691Kl0518j524O968k68k2O910K336M167J48J319j4458
$$ 165164 168643 147539 135848 135850 105332 103808 110776 110508 110486 117396 119732 123899 124047 125366 110908
18151A10908j2179J3375J5502o963j226L778J7741J8992K2049P745J7245L1943
$$ 110908 98729 112104 127606 120643 119417 123195 140936 159928 181977 189722 206967 238910
18139B38910J5109m480K519l893J4226K8255Q986N925P816L3303L5536M3616M9717
$$ 238910 254019 249539 252058 248165 262391 290646 299632 305557 313373 346676 382212 425828 475545
18126D75545P1565J12943J28387J62118J88726K23652K63424L43889L58185L58339
$$ 475545 547110 660053 788440 950558 1139284 1362936 1626360 1970249 2328434 2686773
18116B686773M52470O14571Q54385J272632K102751L354810M513660N879478N427857
$$ 2686773 3139243 3753814 4608199 5880831 7983582 11338392 15852052 21731530 27159387
18107B7159387n546618r735108n305480k474339j293170p79640m99307l37428
$$ 27159387 21612769 11877661 6572181 4097842 2804672 2025032 1525725 1188297
18099A188297k30899j77969j39893j08172o2325o1770l9824l1081l2995k6689
$$ 1188297 957398 779429 639536 531364 469039 407269 367445 336364 303369 276680
18089B76680l2020k0788j7928r397n052q769j0215k4956k6426l036P224K3423
$$ 276680 244660 223872 205944 196547 191495 182726 172511 147555 121129 118093 125317 148740
18077A48740L5493K2463K9111K2934J3862p483j9389K0085M9509N8638N6146L8025
$$ 148740 184233 206696 235807 258741 272603 265120 245731 265816 315325 373963 430109 468134
18065D68134l0046j03505j10220p1431m5409j2697K021r231o308j9241m247m894
$$ 468134 438088 334583 224363 152932 107523 94826 96847 87616 81308 62067 57820 52926
18053E2926j154N058Q321J701l894L679j356j4204j6093N33O377Q556L149o085
$$ 52926 51772 56830 65151 66852 62958 66637 65281 51077 34984 35517 41894 50450 53599 47514
18039D7514p363j0085L067M820J3649P467J6486J3724n960J1016J8301p43J7839
$$ 47514 40151 30066 33133 37953 51602 59069 75555 89279 83319 94335 112636 111893 129732
18026A29732L8554M2590K7332L227k7746j4396L782K4135K8881J0752l9545o1907
$$ 129732 168286 210876 238208 241435 213689 199293 203075 227210 256091 266843 227298 165391
18014A65391n4832k7585r521k5678m013J926O400J1601q698n244j1349M87M219
$$ 165391 110559 82974 73453 47775 43762 45688 52088 63689 54991 49747 38398 38885 43104
18001D3104J685j033L271k1053l788k471j4954l699J5773Q053R265L043k763n195
$$ 43104 44789 43756 47027 25974 22186 19715 4761 1062 16835 24888 34153 37196 34433 29238
17987B9238k560J839P09K765O299p870o627J403m274J5978N280q45j2741o888
$$ 29238 26678 28517 29226 31991 38290 30420 23793 25196 20922 36900 42180 41335 28594 21706
17973B1706p222k404Q037J0243K036N686o718k554m523l122N465N262K172o870
$$ 21706 14484 12080 20117 30360 32396 38082 31364 28810 24287 21165 26630 31892 34064 27194
17959B7194L625J8341Q988P450M787N356j3656k709o596P0l249O338Q064l629
$$ 27194 30819 49160 58148 65598 70385 75741 62085 59376 52780 52850 49601 55939 64003 60374
17945F0374M789K695j68q95q460j5919j907m307n08J1964O05j4275q917p632J43
$$ 60374 65163 67858 67690 66795 58335 42416 40509 36202 35694 47658 48263 33988 25071 17439 17582
17930A7582p74J409J9345J3527Q314j260L258p025j8111j2946O523K220J4119
$$ 17582 16808 18217 37562 51089 59403 58143 61401 54376 36265 23319 29842 32062 46181
17917D6181O858q653n971o594J4364Q266O298J612q674r81J2562J5588O671j6536
$$ 46181 53039 44386 38415 31821 46185 54451 60749 62361 53687 52706 65268 80856 87527 70991
17903G0991k496o635o124M188n579l343O147m501p38o591j954L574L749m772l724
$$ 70991 68495 61860 55736 59924 54345 51002 57149 52648 51910 45319 43365 46939 50688 45916 42192
17888D2192Q031o936k7481m048J2825J6839J5R95r65K46j2174r999k886N907J0915
$$ 42192 50223 43287 15806 11758 24583 41422 41437 42432 41467 41713 29539 19540 16654 22561 33476
17873C3476r800N694P840Q941J1814m115m297m153k751L204o011j4293o89P0m839
$$ 33476 23676 29370 37210 46151 57965 53850 49553 45400 42649 45853 39842 25549 24860 24930 20091
17858B0091m454K400j122j2353K0847O503l649Q53J3086j623N41K746P778j5099
$$ 20091 15637 18037 16915 4562 25409 31912 28263 29116 42202 40579 41120 43866 51644 36545
17844C6545j2078R550j544j6095N663J5050j1069M553J5687J7773P338l081j5036
$$ 36545 24467 34017 32473 16378 22041 37091 26022 30575 46262 64035 71373 68292 53256
17831E3256L152n631j090J4648p36m715m581r382L453Q721k481O491J000J7835
$$ 53256 56408 50777 49687 64335 63599 58884 54303 44921 48374 57095 54614 61105 62105 79940
17817G9940P279o133R058J3291j5245j2675k791O176K3658K617j8519j8858l996
$$ 79940 87219 81086 90144 103435 88190 75515 72724 78900 102558 105175 86656 67798 63802
17804F3802R589o08o219J0823M963J1920K2578K057m699j7004j6420o57P116j1217
$$ 63802 73391 72783 66564 77387 82350 94270 116848 118905 114206 97202 80782 80125 87241 76024
17790G6024J178n250O730J5367Q262o068o307R122l864R073K1395N535N056l53
$$ 76024 77202 71952 78682 94049 102311 96243 89936 99058 95194 104267 125662 131197 136253 135900
17776A35900n111Q114J2029J4502R428P57J4365J9425L6169L8861R03k9833k2763
$$ 135900 130789 138903 150932 165434 174862 175619 189984 209409 245578 284439 285342 255509 232746
17763B32746k7078j1979j003J0522J8172q410L238P244L0791J8273K4001J0069
$$ 232746 205668 193689 192686 203208 221380 212970 216208 223452 254243 272516 296517 306586
17751C06586K0861J7147j923j644K4612M1878J1547j2000q661o787J459J6767
$$ 306586 327447 344594 342671 341027 365639 407517 419064 407064 398403 391616 393075 409842
17739D09842K7028L5292L0318M1676M8546M9484P2565R2271R2459J09527R1104
$$ 409842 436870 472162 502480 544156 592702 642186 714751 807022 899481 1009008 1100112
17728A100112Q9417R7229Q2702O3509O3598R0320J26165J71929K57110L59069
$$ 1100112 1189529 1286758 1369460 1432969 1496567 1586887 1713052 1884981 2142091 2501160
17718B501160M25154M91566N70143O69069Q37248J033381J281455J701524K340974
$$ 2501160 2926314 3417880 3988023 4657092 5494340 6527721 7809176 9510700 11851674
17709A1851674L283513M481023N672256O229303N376984L006653l01312l733200
$$ 11851674 15135187 19616210 25288466 31517769 36894753 39901406 39600094 35866894
17701C5866894o025586o774069o010131m289032k568716j313189n23310Q21M26239
$$ 35866894 29841308 23067239 17057108 12768076 10199360 8886171 8362861 8363682 8789921
17692H789921Q70427J412051K161359L221177M544234N770267O298916N328754
$$ 8789921 9660348 11072399 13233758 16454935 20999169 26769436 33068352 38397106
17684C8397106K808042o41192m204003o561852p365338o605919m904115l241420
$$ 38397106 41205148 40563956 36359953 29798101 22432763 15826844 10922729 7681309
17676G681309k042683j321888r07623o31616m57834l21309k11914j56178j35835
$$ 7681309 5638626 4316738 3409115 2777499 2319665 1998356 1786442 1630264 1494429
17667A494429j22666q2886o2736k6797O645j1416j0455j6130k7015p8877j04151
$$ 1494429 1371763 1288877 1226141 1199344 1205989 1194573 1184118 1167988 1140973 1062096 957945
17656I57945j05525r6703q3042p2049m7785j1949L399K1399L0176Q152n7672l5656
$$ 957945 852420 755717 672675 600626 552841 540892 544291 565690 595866 604018 546346 510690
17644E10690m954k249J8276K6250J5931J6309l0889m4588m607J6950K0539J0797
$$ 510690 505736 503487 521763 548013 563944 580253 549364 504776 500169 517119 537658 548455
17632E48455K1723L8224O6725R3641J22633J69526J99235K13408K67586L51915
$$ 548455 570178 608402 675127 768768 891401 1060927 1260162 1473570 1741156 2093071
17622B093071M17954M90769N34787O10785Q14914J130797J646459K580015L930517
$$ 2093071 2511025 3001794 3536581 4147366 4962280 6093077 7739536 10319551 14250068
17613A4250068N324811O567327N784841j848780r310102q254967m642105k477287
$$ 14250068 19574879 26142206 31927047 30078267 20768165 12513198 7871093 5393806
17605E393806j447400r27154n82318l58650k27935j24956r5835j25469j68852
$$ 5393806 3946406 3019252 2436934 2078284 1850349 1725393 1629558 1504089 1335237
17596A335237j67891j01367n4620j1366K6739J9632L962m0704n7845k9011n003
$$ 1335237 1167346 1065979 1011359 999993 1026732 1046364 1050326 1009622 951777 922766 917763
17585I17763J9382P0294J05299R4212P6813J25521K08139K83375L69992M38653
$$ 917763 937145 1007439 1112738 1206950 1283763 1409284 1617423 1900798 2270790 2709443
17575B709443N38935O32876O89676Q01343R59135J169693J525844K147230L232745
$$ 2709443 3248378 3881254 4570930 5372273 6331408 7501101 9026945 11174175 14406920
17566A4406920M918001P095932R452714J0362840N231378l763615j1409333j3118036
$$ 14406920 19324921 26420853 35873567 46236407 51467785 47704170 36294837 23176801
17558B3176801q860197m906255k788660j713974j080888p16968m88985l22047
$$ 23176801 14316604 9410349 6621689 4907715 3826827 3109859 2620874 2298827
17550B298827k52457k79699k75270j94899j33916r1481q0562n8342j1798j9879
$$ 2298827 2046370 1766671 1491401 1296502 1162586 1071105 990543 932201 920403 900524
17540I00524n2840m7086k0286J279K6477N7543N8489M0249j0108L631M6828J06980
$$ 900524 847684 800598 780312 781591 808068 865611 924100 964349 954241 957872 1004700 1111680
17528A111680J71967K21368K54247K87634K90583L07789L62739M80540O49464
$$ 1111680 1283647 1505015 1759262 2046896 2337479 2645268 3008007 3488547 4138011
17519D138011R15706J373032K168082L282118M353916N283223L990343k817109
$$ 4138011 5053717 6426749 8594831 11876949 16230865 21514088 25504431 22687322
17511B2687322p772592o093371l301220j783028j074060o82597m45660l01001
$$ 22687322 14914730 8821359 5520139 3737111 2663051 1980454 1534794 1233793
17503A233793k12046j55773j47714j30640q5146n2182m3455m1324l1297j5045
$$ 1233793 1021747 865974 718260 587620 502474 450292 406837 365513 334216 319171
17493C19171j3507k0407k8691j3655M173L719J3455L419Q066q556l8711m2026
$$ 319171 305664 285257 256566 242911 247084 250803 264258 267677 275743 267187 228476 186450
17481A86450j3410L792l777J0445K0185J3294l2270m0223l2711k2653r741j4235
$$ 186450 173040 176832 173055 183500 203685 216979 184709 144486 111775 89122 79381 65146
17469F5146p555j8595j1529P860J4035L394J0700J3049j484L624l969p947q164
$$ 65146 57591 38996 27467 35327 49362 52756 63456 76505 75021 78645 74676 66729 58565
17456E8565n179N338J136k03J421j0672o312O662j9843n8J6999L6124L1160L9037
$$ 58565 53386 58724 59860 59657 61078 50406 44094 50756 30913 30855 47854 83978 115138 154175
17442A54175L5678k6796p8076k9185o394L703J973j7625j3273l994p211n721M3
$$ 154175 189853 163057 84981 55796 49402 53105 55078 37453 24180 20186 12975 7254 7297
17429G297N302O483J1239o644j380r489j3257k528J3578J1918p545j21L591K8034
$$ 7297 12599 19082 30321 23677 22297 12808 -449 -2977 10601 22519 14974 14853 18444 46478
17415D6478P415m52n640Q394J8035L8554N6043O9103N6438L293n7119r7699n5214
$$ 46478 53893 53441 47801 56195 74230 112784 168827 237930 294368 297661 240542 142843 87629
17402H7629k3663r759q451j3360j0496R502J2911j532o995O96J6379K1100M0111
$$ 87629 63966 54207 45756 32396 21900 31402 44313 42781 35786 36482 52861 73961 114072
17389A14072M3619M9772L1146J2077l9712o2433n0355l9781k4302j2242p228j5949
$$ 114072 157691 207463 238609 250686 210974 148541 98186 58405 34103 21861 14633 -1316
17377a316m029L216J3488J0982l970j0126p210m36J6114L484J5855r800j1441
$$ -1316 -5345 -2129 11359 22341 18371 8245 1035 599 16713 20197 36052 26252 14811
17364A4811q64J1329m986j2216M769J6928j242o884k224q595k975R431L982q80
$$ 14811 13947 25276 20290 8074 12843 29771 28529 21645 19421 10826 7851 17282 21264 20384
17350B0384J0412J1187O618J0237J4603J6911K4543M6658M1826K0770L0497M0810
$$ 20384 30796 41983 48601 58838 73441 90352 114895 161553 203379 224149 254646 295456
17338B95456L1791L3277N1205O7621O8116N2876K0415j641j4049j8020j7080k455
$$ 295456 327247 360524 411729 479350 547466 600342 620757 619116 605067 587047 569967 567512
17326E67512j6575k6878n4316n3692n8421n5702k4719l7888m3523m0109l5858
$$ 567512 550937 524059 469743 416051 357630 301928 277209 239321 195798 155689 119831
17315A19831k1832k6363j1673o359j0227j4919j9521m961J1922j3389n261M631
$$ 119831 97999 71636 59963 53604 43377 28458 8937 3976 15898 2509 -2752 1879
17303A879K1214m934l0659j2645R812J7801L698j4652Q013M28m035n589k17J3852
$$ 1879 23093 18159 -12500 -25145 -15333 2468 6166 -8486 -473 -45 -4080 -9669 -9886 3966
17289C966m683K808L185m985j599m82j3897L520N130Q642l4j2055j5114R122M645
$$ 3966 -717 2091 5276 291 -1308 -1790 -15687 -12167 -7037 1605 1571 -10484 -25598 -16476 -11831
17274a1831K511O232p154j810J601r869J2504M236J246J3916k618j712k8078o734
$$ -11831 -9320 -3088 -10242 -12052 -10451 -20320 -7816 -3580 -2334 11582 8964 7252 -20826 -27560
17260b7560J744P538P145P597O822k222j8902Q559O721K824k599l413o383R833
$$ -27560 -25816 -18278 -11133 -3536 3286 1064 -17838 -9279 -2558 266 -2333 -5746 -12129 -2296
17246b296K78r006r111k135J4447Q563N787L107j096L828J354j1462o758Q56L292
$$ -2296 -2018 -11024 -20135 -22270 -7823 740 6527 9634 8538 12366 13720 2258 -4500 -3644 -352
17231c52K473K150J6826j5585j2605O4o464j355m015m894J0276P595J829m016
$$ -352 2121 4271 21097 5512 -7093 -7029 -13493 -14848 -18863 -23757 -13481 -5886 -4057 -8073
17217h073O326K67m878O291J1639j3060L292L162k129N271k220P692q097j1856
$$ -8073 -1747 -1480 -6358 -67 11572 -1488 1804 4966 2837 8108 5888 13580 5483 -6373
17203f373j3606o812Q466J4037R574K338p486K070n878q157P093n116j715J3481
$$ -6373 -19979 -26791 -18325 -4288 5286 7624 138 2208 -3670 -11827 -4734 -9850 -11565 1916
17189A916R83Q54k623p485j5470J2859J9220M445n354m611N595j055j788N311
$$ 1916 2899 3753 1130 -6355 -21825 -8966 10254 14699 9345 4734 10329 9274 7486 12797
17175A2797j75j9227J2225n02j438Q625J341J1476L207j6817j0547M922j784n148
$$ 12797 12622 -6605 5620 5118 3680 12305 13646 25122 28329 11512 965 5887 4103 -1045
17161a045N011J8620J960j434K2274J3285j0179n593O78j625J0155J2621J9243
$$ -1045 3966 22586 24546 23112 45386 58671 48492 42899 43577 41952 52107 64728 83971
17148H3971J050l680j1023j6572k730M80r561p908k043J1551J8575J9641J2421
$$ 83971 85021 81341 70318 53746 51016 51496 41935 34027 31984 43535 62110 81751 94172
17135I4172J3503o534j2448L596R982J6674L1554K4470j1261q194L4017L8937
$$ 94172 107675 101141 88693 92289 102271 118945 150499 174969 163708 155514 189531 228468
17123B28468J9310j5729l6762l0755k2553j1884m840N229J0092R168r977j2605
$$ 228468 247778 232049 195287 164532 141979 130095 125255 130484 140576 149744 139767 127162
17111A27162j0389R833J5019P096M721L1307L9948M4940L3417J5135r591K308
$$ 127162 116773 126606 141625 148721 153442 184749 224697 269637 303054 318189 308598 310906
17099C10906j102l7199n8908o2702l4186k3033j1381r975N400J692j2074k6359
$$ 310906 309804 272605 213697 150995 116809 93776 82395 72420 77820 79512 67438 41079
17087D1079k7262m342j3479N826J4307l919o492k166J635P17j770K0636n508j1637
$$ 41079 13817 9475 -4004 1822 16129 12210 5718 3552 5187 5904 4134 24770 19262 7625
17073G625J462N908K640q128m559Q286K0422R00q674k460J2994j474O5n143o412
$$ 7625 9087 14995 17635 9507 4948 13234 33656 34556 25882 23422 36416 34942 35007 29864 23452
17058B3452K3924J0708M639J9913L0863L7985L7663M3097L0335l454m0277n4720
$$ 23452 47376 58084 62723 82636 113499 151484 189147 232244 262579 259125 218848 164128
17046A64128n0993k4401j6096r902j6852q041l062o38L414m064k467j238k916
$$ 164128 113135 88734 72638 62736 45884 37843 34781 34143 37557 33493 31026 29788 26872
17033B6872j6661n899j909l605J921J7239J0496l992O471k934n14R881L138m624
$$ 26872 10211 4312 2403 -1202 719 17958 28454 24462 30933 27999 27485 37366 40504 35880
17019C5880L874m943j2656m704l66j780J872J3855P799N902k860K229J0268p58
$$ 35880 39754 34811 22155 17451 17085 15305 17177 31032 38831 44733 41873 44102 54370 53612
17005E3612P373J2831K4413K0253K9021K739l2514m1405j9643j6046q640J525
$$ 53612 60985 73816 98229 118482 147503 150242 117728 76323 56680 40634 31994 33519
16993C3519r531K653N950J796M487r055m089q06j963J4391j157m477L030j3904
$$ 33519 23988 26641 32591 34387 38874 29819 25730 24924 22961 37352 36195 31718 34748 20844
16979B0844j4652j3178m234J7363J0622J4289O218n746J1433J0562R60j0947M31
$$ 20844 6192 -6986 -11220 6143 16765 31054 37272 31526 42959 53521 54481 43534 43965
16966D3965p196m473K829J174P436L856p632M207j9848k344l527J421k260P053
$$ 43965 36769 32296 35125 36299 43735 47591 39959 44166 24318 21974 18447 19868 17608 24661
16952B4661J6310J0407J3751O098o054L99L61j8355l61L850K92O438J3448k309
$$ 24661 40971 51378 65129 71227 65173 65572 65933 47578 47217 51067 51359 57797 71245 68936
16938F8936j1090k966j779k771K985k132R008J4868k482k018J589P188P154j478
$$ 68936 57846 54880 53101 50330 53315 51183 60191 75059 72577 70559 72148 79336 86490 85012
16924H5012L118Q961P004n170j1163O12q031r056J754J4481N677K9674k685j9813
$$ 85012 88130 97091 104095 98925 87762 88374 80343 71287 73041 87522 93199 122873 120188 100375
16910A00375R360J5785O749J5207Q437L954j2255J2225K2828J6906Q098J3608
$$ 100375 109735 125520 132269 147476 155913 159867 147612 159837 182665 199571 207669 221277
16898B21277J9122L3854K1558J5999k712L499J5573J4798L9727N3879L8507K7109
$$ 221277 240399 274253 295811 311810 309098 312597 328170 342968 382695 436574 475081 502190
16886E02190L4443O7891Q6462J15263J10365R1498Q1624N2913Q1846J44995J66462
$$ 502190 536633 604524 690986 806249 916614 1008112 1089736 1142649 1224495 1369490 1535952
16875A535952J59794J95700K83237L73302M28972M58276N40498O73913Q06718
$$ 1535952 1695746 1891446 2174683 2547985 2976957 3435233 3975731 4649644 5456362
16866E456362R01052J104774J472205K052630K966977M411820O507497Q871551
$$ 5456362 6357414 7462188 8934393 10987023 13954000 18365820 24873317 33744868
16858C3744868J1076955R171448j430996j2634345j4383737q914727m581027k437767
$$ 33744868 44821823 53993271 52562275 39927930 25544193 16629466 12048439 9610672
16850I610672j376646p20603j96867J84628M42946P41673J169697J806928K748197
$$ 9610672 8234026 7513423 7316556 7501184 7944130 8685803 9855500 11662428 14410625
16841A4410625M185854O162214Q354025J0340753Q105828k325519j2803594j3927256
$$ 14410625 18596479 24758693 33112718 43453471 51559299 49233780 36430186 22502930
16833B2502930q595356m590474k598525j616958j057134p47115n90600m61880
$$ 22502930 13907574 9317100 6718575 5101617 4044483 3297368 2706768 2244888
16825B244888l21228k25040j11060n1356m4373j09381j44331j02385r7574j26013
$$ 2244888 1923660 1698620 1587560 1536204 1491831 1382450 1238119 1135734 1038160 912147
16815I12147j55436j12385n7553k4871j1056j222J3830m304n7600r4383p6983
$$ 912147 756711 644326 586773 561902 550846 549624 563454 559150 501550 407167 330184
16804C30184m6803k9637j3792j7777k9871j1560p939O109k668k1300n208l163
$$ 330184 283381 253744 239952 222175 192304 180744 172805 178914 176246 154946 149738 146575
16792A46575p707J308K324P601j2639k3235l532K279m567J5968o929k2536j6092
$$ 146575 138868 140176 142500 150101 137462 114227 110695 112974 108407 124375 117446 94910 78818
16779G8818j6268J3332P309M785n170k5157q171J0510j045Q535J1373o599M16
$$ 78818 62550 75882 83191 87976 82806 57649 49478 59988 58943 67478 78851 72252 72668
16766G2668j5592k2811j0196O946J3393n029l477J0544J072n038k840J868j505
$$ 72668 57076 34265 24069 31015 44408 39379 35902 46446 47518 42480 39640 41508 40003
16753D0003n508j8025J0019K8559r933j2271K603L517p258Q482J083k786q927
$$ 40003 34495 16470 26489 55048 45115 32844 35447 38964 31706 40188 41271 38485 29558
16740B9558p897j4521j160J3999J1134j1299r781J4062k617K301j0673j512R530
$$ 29558 21661 7140 5980 19979 31113 19814 10033 24095 21478 23779 13106 11594 21124
16727B1124k313p536M556m428N766Q310j0853k0068k623R371K3469O119j8275
$$ 21124 18811 11275 15831 11403 17169 25479 14626 -5442 -8065 1306 24775 30894 12619
16714A2619j1086L135R295R129K099l709l564P91O979M391j8026k994J0815j7318
$$ 12619 1533 4668 13963 23092 25191 21482 17918 18709 25688 30079 12053 9059 19874 2556
16700B556j8771R517N416J2044R229j7482k5775j396J2512R626j728R40M976J9803
$$ 2556 -16215 -6698 -1282 10762 19991 2509 -23266 -24662 -12150 -2524 -4252 -3312 1664 21467
16686B1467O943M78j5297k6178M877J0132P028Q333l772l242k215j7327o610q5
$$ 21467 28410 28888 13591 -12587 -7710 2422 9450 17783 14011 10769 8554 -8773 -15383 -15468
16672a5468O663Q665l235o401J930Q503Q691j606L87j74j2191L714j5M964n153
$$ -15468 -8805 -140 -3375 -9776 -7846 657 9348 7742 8129 7955 -4236 -522 -537 4427 -726
16657g26j3451q779j6948N403l41r314m576J0494K2867J1241J8630P33M093L16
$$ -726 -14177 -22956 -39904 -34501 -34842 -44156 -48732 -38238 -15371 -4130 14500 15233 19326 19642
16643A9642J1853j3152j9616r312L234K459p556L712q870M410m007J333k135k852
$$ 19642 31495 18343 -1273 -10585 -7351 -4892 -12448 -8736 -17606 -13196 -17203 -15870 -18005 -20857
16629b0857J0913J6065j6234j4045k084O693N58P442P10j614J001n132K146j273
$$ -20857 -9944 6121 -10113 -24158 -26242 -19549 -18991 -11549 -10839 -12453 -11452 -16584 -14438 -15711
16615a5711p051P107K568O531J2985P40j0146p321j0948N134J7994k1061o715
$$ -15711 -22762 -15655 -13087 -6556 6429 7169 -2977 -10298 -21246 -16112 1882 -19179 -25894
16602b5894L498J135n958j1623m187J0478J8271P903P099l55n764q126j796m813
$$ -25894 -22396 -21261 -27219 -38842 -43029 -32551 -14280 -6377 722 367 -5397 -13523 -15319 -20132
16588b0132j925N282M794l109J5021l447m163p268j1101j521l703k722j2424O711
$$ -20132 -22057 -16775 -11981 -15090 -69 -3516 -7679 -14947 -26048 -27569 -31272 -33994 -46418 -39707
16574c9707K3929M310m567M695J9680n631j2390J653K546q082J3283j730p461
$$ -39707 -15778 -11468 -16035 -11340 8340 2709 -9681 -8028 -5482 -13564 -281 -2011 -9472
16561i472k459j0969k920M28k034q967j2577j248j040J7860J9704P476J2195m413
$$ -9472 -11931 -22900 -25820 -25392 -27426 -36393 -48970 -50218 -51258 -33398 -13694 -6218 5977 1564
16547A564q468j8526P266J1549j1414J005K850J51q078J813J3996Q686p462m876
$$ 1564 -6904 -25430 -18164 -6615 -18029 -17024 -14174 -14023 -22101 -20288 -6292 2394 -5068 -9944
16533i944P870J6831O856r052o386n738k3984R95K1054N387K405J0137P12m494
$$ -9944 -2074 14757 21613 12561 6175 437 -23547 -22552 -1498 3889 6294 16431 17143 12649
16519A2649k231k251k640j5157K961R899k02k1188l21L235j0558r384M68J9449
$$ 12649 10418 8167 5527 -9630 -6669 3230 3028 -18160 -18481 -15246 -25804 -35188 -34720 -15271
16505a5271P51m397Q651J9558N619q039J6786j88j5584M519j0212j4416q698n988
$$ -15271 -14520 -18917 -10266 9292 14911 6872 23658 23470 7886 12405 2193 -12223 -20921 -26909
16491b6909K473Q39m03k362o609K848R876N113R056J784N418j2885p776p865l320
$$ -26909 -24436 -23597 -24000 -26362 -32971 -30123 -20247 -15134 -6078 -4294 1124 -11761 -19537 -27402 -30722
16476c0722J5614R70L49R89J4947O661j2823q990n394L375n613m301M55P615o581
$$ -30722 -15108 -14138 -13789 -12800 2147 8808 -4015 -13005 -18399 -15024 -20637 -24938 -24483 -16868 -23449
16461b3449k680J3979J3082r702k4799n854P378Q654l055p296O000J9232P163
$$ -23449 -26129 -12150 932 -8770 -33569 -39423 -32045 -23391 -26446 -33742 -27742 -8510 -1347
16448a347j3485o24P915o362J045N827N968K861p987j2687L963R466Q83K382k60
$$ -1347 -14832 -15456 -7541 -13903 -12858 -7031 -1063 1798 -6189 -18876 -14913 -5447 -4564 -2182 -2442
16433b442j4468J2317J2619m683J473K679j2159k972o064r139q829j8130J0047
$$ -2442 -16910 -4593 8026 3343 4816 7495 -4664 -7636 -13700 -22839 -31668 -49798 -39751
16420c9751L874J2717J3806R017M989M359r385j0749k980o981J3777J2440j1171
$$ -39751 -35877 -23160 -9354 -337 4652 9011 -374 -11123 -14103 -21084 -7307 5133 -6038
16407f038j1015k943j023J0444k74P926M81k445J5870j0830j3021R403p771l775
$$ -6038 -17053 -19996 -21019 -10575 -10849 -2923 -2442 -4887 10983 153 -12868 -3465 -11236 -15011
16393a5011Q323J1139p226j5406J248q82l087N020J1556k17j5291o286q995J709
$$ -15011 -6688 4451 -2775 -18181 -16933 -17815 -20902 -15882 -4326 -4543 -19834 -26120 -35115 -33406
16379c3406P827J9501o356R542J7513o729j5109n982L836M909p417o511k544m749
$$ -33406 -25579 -6078 -12434 -2892 14621 7892 -7217 -13199 -9363 -4454 -11871 -18382 -20926 -25675
16365b5675M882J7457m4j7360R87J0161R326K979N66J0472j1771q171j1776p785
$$ -25675 -20793 -3336 -3380 -20740 -19753 -9592 -266 2713 3279 13751 1980 -6191 -17967 -25752
16351b5752p705o916J7610J8766J019q81j4514r299r048J36j642O095O694J543
$$ -25752 -33457 -40373 -22763 -3997 -2978 -3859 -18373 -27672 -36720 -36584 -38226 -32131 -25437 -23894
16337b3894j027P492m471o060o963N347J6926m737O866Q107J5516J449j4324o387
$$ -23894 -24921 -17429 -21900 -27960 -34923 -29576 -12650 -17387 -10521 -2414 13102 14551 227 -6160
16323f160r77O989m671j53j1538R927L096m124N426O265q661n001k006K0068K1311
$$ -6160 -7137 -148 -4819 -4972 -16510 -6583 -3487 -7611 -2185 4080 -4581 -9582 -11588 8480 29791
16308B9791R610J2428K5665M6086N1921L7349N3144L0797r777o1856p1658o5372
$$ 29791 39401 51829 77494 123580 175501 212850 265994 296791 287014 225158 153500 88128
16296H8128m3018j4090l262M455o945o12J4186o14R464J3050J8705J7767L9174
$$ 88128 45110 31020 27758 32213 25268 24656 38842 38228 47692 60742 79447 97214 136388
16283A36388N1611N3104K1250r975o1480o2854n1157j9859k1537j3168j2792R140
$$ 136388 187999 241103 262353 252378 190898 128044 76887 57028 35491 22323 9531 18671
16271A8671J1105K345k2855k4322j7J7890J3163m479o995K576M236j1063j6730
$$ 18671 29776 32121 9266 -15056 -15073 2817 15980 11501 4506 7082 11318 255 -16475
16258a6475R438J2088N396n253n524o762j8156P554o322J973J1786K627K655o771
$$ -16475 -7037 5051 10447 5194 -330 -7092 -25248 -17694 -24016 -22043 -10257 -7630 -4975 -11746
16244a1746L352L079Q142n574j5447O306R825l018k752o822R544o759j8761l222
$$ -11746 -8394 -5315 2827 -2747 -18194 -11888 -2063 -5081 -7833 -14655 -5111 -11870 -30631 -33853
16230c3853K005J2722J0978m529k338J4016N827n600j0170l871N557N926R914
$$ -33853 -31848 -19126 -8148 -12677 -15015 -999 4828 -772 -10942 -14813 -9256 -3330 6584
16217F584n804R069M313l071o889j4320m848j2032m784J121P104N374m361M65
$$ 6584 780 9849 14162 11091 4202 -10118 -14966 -26998 -31782 -30661 -23557 -18183 -22544 -22079
16203b2079O423J6792J4642M66k378m997N777o174j1294J01l995M352P953j1126
$$ -22079 -15656 1136 15778 16244 13866 8869 14646 8472 -2822 -2721 -6716 -2364 5589 -5537
16189e537J2699M675j3425q934j1908j7237J5050K292J364j60N32j728l720n958
$$ -5537 7162 11837 -1588 -10522 -22430 -39667 -24617 -22325 -20961 -21121 -20589 -22317 -26037 -31995
16175c1995J2871N652N822J079r698O44K5599J1984k9614k4695R72J9214K518
$$ -31995 -19124 -13472 -7650 -6571 -16269 -15625 9974 21958 -7656 -32351 -31379 -12165 -9647
16162i647j0623J1522J8669n41l162l943j0502J097l984p915N646K12K225R261
$$ -9647 -20270 -8748 9921 9380 6218 2275 -8227 -7130 -11114 -19029 -13383 -13171 -10946 -1685
16148a685n371M597P843l658k023l019j3177J060J2932L448q850j729j816N338
$$ -1685 -7056 -2459 5384 1726 -297 -3316 -16493 -15433 -2501 947 -7903 -9632 -11448 -6110
16134f110J0197K24k4381l056Q509k852K986J5842p034o30m525m793p88j1805
$$ -6110 4087 4311 -20070 -23126 -14617 -17469 -14483 1359 -5675 -6305 -10830 -15623 -16411 -28216
16120b8216l742J3267J1502p46n936L069J0839m631j1655n795N500Q437m609r28
$$ -28216 -31958 -18691 -7189 -7935 -13871 -10802 37 -4594 -16249 -22044 -16544 -8107 -12716 -13644
16106a3644j961J2512O717M335r18k1170j3239J0528J8993J5458j5853j4973j1719
$$ -13644 -15605 -3093 3624 7959 7041 -14129 -27368 -16840 2153 17611 1758 -13215 -24934
16093b4934l231l158R269J2593j296j0819J763J1549J5245m099j2384j4067O356
$$ -24934 -28165 -31323 -22054 -9461 -10757 -21576 -19813 -8264 6981 2882 -9502 -23569 -17213
16080a7213J2183J2381j279N301o456j1739L29N586N461j228r18n322m047j5305
$$ -17213 -5030 7351 6072 11373 4917 -6822 -6493 -907 4554 3326 2408 -2914 -6961 -22266
16066b2266J942K321r075Q2j738R732Q997K682P229m881j5860n763K197J7923
$$ -22266 -20324 -18003 -27078 -26996 -28734 -19002 -10005 -7323 -94 -4975 -20835 -26598 -24401 -6478
16052f478J8957n071m587r699j3767j092Q094L267J1304R7j5731J0797J4953l459
$$ -6478 12479 7408 2821 -6878 -20645 -21737 -13643 -10376 928 1025 -14706 -3909 11044 7585
16038G585j2805k969K5445l520r959j5047K474O374M271P962N821j1151k4834
$$ 7585 -5220 -8189 17256 13736 3777 -11270 -8796 -2422 1849 9811 15632 4481 -20353
16025b0353j6611J5981J6661j402N994P500m73j1232lj2133k126n824n552P253
$$ -20353 -36964 -20983 -4322 -5724 270 7770 7297 -3935 -3938 -16071 -18197 -24021 -29573 -22320
16011b2320J5028K380M54j0707j4921J64J6127J0537K480j3458O84J4279R769
$$ -22320 -7292 -4912 -4458 -15165 -30086 -29922 -13795 -3258 -778 -14236 -13552 727 10496
15998A0496q247k992r903j2709k794J344L309M563J1348J4180N463P582J1744
$$ 10496 2249 -743 -10646 -23355 -26149 -24805 -21496 -16933 -5585 8595 14058 21640 33384
15985C3384k637j6321k1942j8454J9247J1419Q999j4794k2868q895j005Q006P258
$$ 33384 30747 14426 -7516 -25970 -6723 4696 13695 -1099 -23967 -32862 -33867 -25861 -18603
15972a8603o922O066J21O272M054m447Q21O63J2016n218k4745k413K746M251K0464
$$ -18603 -25525 -19459 -19338 -13066 -9012 -13459 -12638 -11975 41 -5177 -29922 -32335 -29589 -25338 -4874
15957d874O883L384n243r539J4296m543p22r92j228r856M065l083M246R268J0867
$$ -4874 2009 5393 150 -9389 4907 364 -358 -1350 -2578 -12434 -8369 -11452 -7206 2062 12929
15942A2929P62L782M335r371K422R763k2510j4911o181l308j3270p27K7520O515
$$ 12929 13691 17473 21808 12437 14859 24622 2112 -12799 -18980 -22288 -35558 -36285 -8765 -2250
15928b250j3383J327j116l161L86j3053O657R19n821L415J0226k498l26l647m883
$$ -2250 -15633 -14306 -15422 -18583 -18197 -31250 -24593 -23674 -29495 -26080 -15854 -18352 -18678 -22325 -27208
15913b7208J3945N634j0204l778p010J4004O530j0990l853k501k462M957J8774
$$ -27208 -13263 -7629 -17833 -21611 -28621 -14617 -8087 -19077 -22930 -25431 -27893 -22936 -4162
15900d162j631J252O922j1065l77j1128k0340K1478K4256P468r334p157M209R017
$$ -4162 -5793 -4541 2381 -8684 -9061 -20189 -40529 -19051 5205 12673 3339 -3818 391 9408
15886I408n088j6156L019J078o271M336J169P47q534J678J1559L295j4799j6552
$$ 9408 4320 -11836 -8817 -7739 -14010 -9674 -8505 -7758 -16292 -14614 -3055 240 -14559 -31111
15872c1111N11K32p338J6358R512j552K788Q855n626N040m965J054J4855r59J15
$$ -31111 -30600 -30368 -37706 -21348 -11836 -13388 -10600 -1745 -7371 -2331 -7296 -6242 8613 7654 7769
15857G769o46J0326P177r997j7446k798L954N593O99j1031o027M966j1058N988
$$ 7769 7123 17449 24626 14629 -2817 -5615 -1661 3932 4631 -6400 -12427 -7461 -18519 -12531
15843a2531R050R860q186r663j0633j2328m786l869j587R651J4447J7348L105
$$ -12531 -3481 6379 -1807 -11470 -22103 -34431 -39217 -43086 -44673 -35022 -20575 -3227 -122
15830a22r237j5717J1262J1821K063m243Q907l390m996k040M699R942J112p761
$$ -122 -9359 -25076 -13814 -1993 70 -4173 4734 1344 -3652 -5692 -993 8949 10061 2300
15816B300L307r471j7543j013N25M165j18j172P692M747k009l751l919N334J1803
$$ 2300 5607 -3864 -21407 -22420 -21895 -17730 -17848 -19020 -11328 -6581 -8590 -12341 -16260 -10926 877
15801H77p31L296q642J726o023j3208J621J936j465J5823J2866m26j3785L696
$$ 877 146 3442 -5200 -3474 -9497 -22705 -21084 -19148 -20613 -4790 8076 7650 -6135 -2439
15787b439J6038J3026r564j1646k530m158k5327K090J6795N864M808L030Q080
$$ -2439 13599 26625 17061 5415 2885 -1273 -26600 -24510 -7715 -1851 2957 5987 14067
15774A4067J1242j5602j3594n775P78O14M400P898R948r949j1070q811k412J4432
$$ 14067 25309 9707 -3887 -9662 -8884 -8270 -3870 4028 13976 4027 -7043 -15854 -18266 -3834
15760c834J1431n942M201Q09j0503O023q997r256r90j66J0472M831j2393j6733
$$ -3834 7597 1655 5856 6665 -3838 2185 -6812 -16068 -17058 -17224 -6752 -1921 -14314 -31047
15746c1047R698J3883k141j6144Q800J1818n187K398Q538J91l590n557m834Q445
$$ -31047 -21349 -7466 -9607 -25751 -16951 -5133 -10320 -7922 616 807 -2783 -8340 -13174 -4729
15732d729P153N91J2002L060N386n273j7141j4284j866k755J0803M028P011K6
$$ -4729 2424 3015 15017 18077 23463 18190 1049 -13235 -15101 -17856 -7053 -3025 3986 4012
15718D012k336J0204m384j773M214q051J0201l481j2135r431n091J2041J3374
$$ 4012 1676 11880 7496 5723 9937 1886 12087 8606 -3529 -12960 -18051 -6010 7364
15705G364m606j3549o374J494J1005k183q552Q451l901j5524Q580L755o690k0784
$$ 7364 2758 -10791 -17165 -15671 -4666 -6849 -15401 -6950 -10851 -26375 -17795 -14040 -20730 -41514
15691d1514n604J0334n364K226Q350N29O206P626m389Q300k970j9895l805N451
$$ -41514 -47118 -36784 -42148 -39922 -31572 -31043 -24837 -17211 -21600 -13300 -16270 -36165 -39970 -34519
15677c4519M897J7754J1305r812q91j169n868K38l07n004J5463J4916J4624k1120
$$ -34519 -29622 -11868 -563 -10375 -11266 -12435 -18303 -18065 -18372 -23376 -7913 7003 21627 507
15663E07j3201L354L351J1064j0004j3842K503O470K026l299l622p426n766o886
$$ 507 -12694 -9340 -5989 5075 -4929 -18771 -16268 -9798 -7772 -11071 -14693 -22119 -27885 -34771
15649c4771J3006P550L548n711o411J3528m440m221K0107J199K210P02k072m40
$$ -34771 -21765 -14215 -10667 -16378 -22789 -9261 -13701 -17922 2185 3384 5594 6296 4224 3784
15635C784o339m036R588m774m358O721K617m154r467J4586n122o858J278M759
$$ 3784 -2555 -6591 2997 -1777 -6135 586 3203 -951 -10418 4168 -954 -7812 -6534 -1775
15621a775j380j1488j2430J5277L323R37J1946l560j462P452O03j3112k700K544
$$ -1775 -3155 -14643 -27073 -11796 -8473 -7536 4410 850 -612 6840 7443 -5669 -8369 -5825
15607e825j578j942j952J0629N594m922k6922r064J9751Q925M905J476j0927m112
$$ -5825 -7403 -9345 -11297 -668 4926 4 -26918 -35982 -16231 -7306 -2401 -925 -11852 -15964
15593a5964K181J1716j82j5124l534m817q90j852M085Q989J3028o414k8055J4114
$$ -15964 -13783 -2067 -2249 -17373 -20907 -25724 -26614 -28466 -24381 -15392 -2364 -8778 -36833 -22719
15579b2719J8082N249J6320J1398l693j3343M374j7826k0812r877N327J8933Q513
$$ -22719 -4637 612 16932 28330 24637 11294 15668 -2158 -22970 -32847 -27520 -8587 -74
15566g4J2495P910N577n337n773q796p49q610j3763q158J0306O101r09J0141L919
$$ -74 12421 20331 25908 20571 14798 6002 5253 -3357 -17120 -25278 -14972 -8871 -9780 361 4280
15551D280j4013q759J746Q309J8940J7893j0717j6451q629r458m640k813J698
$$ 4280 -9733 -18492 -16746 -8437 10503 28396 17679 1228 -7401 -16859 -21499 -24312 -22614
15538b2614K742Q236O748l754j0650j173j970N9K4440M516q305Q10K558R811k017
$$ -22614 -19872 -11636 -4888 -8642 -19292 -20465 -22435 -22376 2064 6580 -1725 -915 1643 11454 9437
15523I437j6075m711J500k150K644o545k569J9011J1043j7266o047j158j983O457
$$ 9437 -6638 -11349 -9849 -11999 -9355 -15900 -18469 542 11585 -5681 -11728 -12886 -14869 -8412
15509h412M916j0241j2214L790L87N509o178j127K0596O490M535L016j3293M128
$$ -8412 -3496 -13737 -25951 -22161 -21774 -16265 -22443 -23570 -2974 3516 8051 11067 -2226 1902
15495A902L719N417M981l904R02K350J31j329N993m507J3480J8223p034j5556
$$ 1902 5621 11038 16019 12115 13017 15367 15498 14169 20162 15655 29135 47358 40324 24768
15481B4768j0508m132l233j8705m392j141r12L917P469o50p353m563j08Q433j3741
$$ 24768 14260 10128 6895 -11810 -16202 -17343 -18255 -14338 -6869 -7519 -14872 -19435 -19543 -11110 -24851
15466b4851M166r44Q878K0202R845j559j605k86L795n811j7255j0231K868P084
$$ -24851 -20685 -21629 -12751 7451 17296 15737 14132 13846 17641 11830 -5425 -15656 -12788 -5704
15452e704Q540L653N012N94L264P061L578o993j0341j6864q769j349p343K261
$$ -5704 2836 6489 11501 12095 15359 22420 25998 19005 8664 -8200 -16969 -18318 -25661 -23400
15438b3400q88J23j62N441O134M57J053Q597L345K2226J209j4407j9471j6005
$$ -23400 -24288 -24165 -24327 -18886 -12752 -12295 -11242 -2645 700 22926 24135 9728 -9743 -25748
15424b5748K818L772R114P395J1787p891M432O46p271L418o063L334R090L025
$$ -25748 -22930 -19158 -10044 -2649 9138 1247 5679 6325 -946 2472 -3591 -257 8833 11858
15410A1858J5895N932l0596j0059n614K464O831J4691Q429m988o844p891m805
$$ 11858 27753 33685 3089 -6970 -12584 -10120 -3289 11402 19831 14843 7999 108 -4697
15397d697O152q34N046M262j7674K568Q315J785o334p354j9698q60J0187n853
$$ -4697 1455 621 5667 9929 -7745 -5177 3138 4923 -1411 -8765 -28463 -29323 -19136 -24989
15383b4989Q275R64q957m622p526J4802K2962M709L562M043Q02j3493k051K957
$$ -24989 -16714 -15750 -24707 -29329 -36855 -22053 909 5618 9180 13223 14025 532 -1519 1438
15369A438o291n315J1221r429j6696r365j0058m781J0129K7572J3541M672L489
$$ 1438 -4853 -10168 1053 -8376 -25072 -34437 -44495 -49276 -39147 -11575 1966 6638 10127
15356A0127k871j046J349L38j1732r772o339k2268n257P395J7831J0898O058O222
$$ 10127 7256 6210 7559 7897 -3835 -13607 -19946 -42214 -47471 -40076 -22245 -11347 -5289 933
15342I33O002J0183l031k1716q218K043J4576J825j6141O016J7532J2491j2236
$$ 933 6935 17118 14087 -7629 -15847 -13804 772 2597 -13544 -7528 10004 22495 10259
15329A0259r212n661j9379j2017J1545R930o842J4047J2565N373o130q700J901
$$ 10259 1047 -4614 -23993 -36010 -24465 -14535 -21377 -7330 5235 10608 4478 -4222 -2321
15316b321J4189J2125P224N544j7564q978P997N764k812p158n888o384n380Q657
$$ -2321 11868 23993 31217 36761 19197 10219 18216 23980 21168 14010 8122 1738 -3642 5015
15302E015L864P315J388j376j4216j1246Q06r826j2707J5024K1118n335M711n907
$$ 5015 8879 16194 17582 16206 1990 -9256 -8450 -18276 -30983 -15959 5159 -176 4535 -1372
15288a372J164Q080k406O472k454j3495n438J1642M099o236r559p352M518J5489
$$ -1372 -208 7872 5466 11938 9484 -4011 -9449 2193 6292 56 -9503 -16855 -12337 3152
15274C152p282k1194j0367J5119J5251M868m827J1993o838o567k242L907l101
$$ 3152 -4130 -25324 -35691 -20572 -5321 -453 -5280 6713 -125 -6692 -8934 -5027 -8128
15261h128M698J5294p049p711P644O250j4063p894q577j2023o016J4864K8766
$$ -8128 -3430 11864 4815 -2896 4748 10998 -3065 -10959 -19536 -31559 -37575 -22711 6055
15248F055r282j1997O097N06l71o128P131J2537R467P565k940K987M015m310j3112
$$ 6055 -3227 -15224 -9127 -8621 -8992 -15120 -7989 4548 14015 21580 18640 21627 25642 21332 8220
15233H220j3624n470j595j0847O847J3068J3914k432N36p154Q560M936j8730M229
$$ 8220 -5404 -10874 -12469 -23316 -16469 -3401 10513 8081 8617 1463 10023 14959 -3771 458
15219D58j3433j742R038K7823Q485k557m785o926L211l555p924j0666n417J279
$$ 458 -12975 -14717 -5679 22144 30629 28072 23287 16361 19572 16017 8093 -2573 -7990 -6711
15205f711L05n090J2456J1893o381L061j198K654J7102J0979m030o548j8433j3809
$$ -6711 -6406 -11496 960 12853 6472 9533 8335 10989 28091 39070 35040 28492 10059 -3750
15191c750J344o870l83Q981R050r002l5860l949J8841J7143Q529O567K217M075
$$ -3750 -2406 -9276 -9659 -678 8372 -630 -36490 -40439 -21598 -4455 4074 10641 12858 16933
15177A6933m919k91J8035n648k242m785p997n255q907k3209l869J1948J1531L641
$$ 16933 12014 11723 29758 24110 21868 17083 9086 3831 -5076 -28285 -32154 -20206 -8675 -5034
15163e034M001M980J982J699j3793r482K571Q507R158p001n345J7188M631r232
$$ -5034 -1033 3947 5929 7628 -6165 -15647 -13076 -4569 4589 -2412 -7757 9431 14062 4830
15149D830p928j0600n164k60j4112K099J9158K634R312O921l686j5821m724K151
$$ 4830 -3098 -13698 -18862 -19122 -33234 -31135 -11977 -9343 -31 6890 3204 -12617 -17341 -15190
15135a5190R464J3257j6483P56P107o267k096Q01l270J0991j2483J921k659q422
$$ -15190 -5726 7531 -8952 -8196 -1089 -7356 -9452 -8651 -11921 -930 -13413 -11492 -14151 -22573
15121b2573o9J532p01M119k967j587L376M370J6500N768j567j0711j203L287j2018
$$ -22573 -22642 -21110 -21811 -17692 -20659 -22246 -18870 -14500 2000 7768 6201 -4510 -5713 -2426 -14444
15106a4444l88m459N901j974P56M414R140K159J038N423L063o51k08o046p121
$$ -14444 -14832 -19291 -13390 -15364 -14608 -10194 -1054 1105 2143 7566 10629 9978 9770 3724 -3397
15091c397R988P16n269j3732p39P835l435j2271L371Q717K8n745J266m392Q79
$$ -3397 6591 7307 2038 -11694 -12433 -4598 -8033 -20304 -16933 -8216 -8188 -13933 -12667 -17059 -16180
15076a6180n484l466J2041J761n196J8724K3248l61m984N753q78m266l284j2496
$$ -16180 -21664 -25130 -13089 -11328 -16524 2200 25448 25087 20103 25856 24978 20712 17428 4932
15062D932j0716j523q744J2580q41q951K592R331J348m758J3614N124q482L195
$$ 4932 -5784 -7307 -16051 -3471 -4312 -13263 -10671 -1340 8 -4750 8864 13988 5506 8701
15048H701k458j2J1095k6906q228l387J5042K069q835M170m02K943p775O748N106
$$ 8701 6243 6231 17326 -9580 -17808 -21195 -6153 -4084 -12919 -8749 -9151 -6208 -13983 -7235 -2129
15033b129m601j8255k148K963J1102P754k771l676j063K25l366j0954K192k077
$$ -2129 -6730 -24985 -27133 -24170 -13068 -5314 -8085 -11761 -12824 -12599 -15965 -26919 -24727 -26804
15019b6804J0173R400L036P577n112n334k1505O052L862J551J7153J2376R308
$$ -26804 -16631 -7231 -4195 3382 -1730 -7064 -28569 -22517 -18655 -17104 49 12425 21733
15006B1733j1874q369j0553Q211J2695j5817o739O625r94k3214O863K3428O798
$$ 21733 9859 1490 -9063 -852 11843 -3974 -10713 -4088 -5082 -28296 -21433 1995 8793
14993H793J0775p733J983j2624K239j0184j7053K48K922M82J7080Jj1580M276
$$ 8793 19568 11835 13818 1194 3433 -6751 -23804 -23556 -20634 -20152 -3072 -3071 -14651 -10375
14979a0375J4443L094j0333p992L274M711r476R207P340j1040k4553j0074M818
$$ -10375 4068 7162 -3171 -11163 -7889 -3178 -12654 -3447 3893 -7147 -31700 -41774 -36956
14966c6956K4452L256q034j1349J0542N888j545R345m98j0786J92O049p878m736
$$ -36956 -12504 -9248 -17282 -28631 -18089 -12201 -13746 -4401 -4899 -15685 -15493 -9444 -17322 -22058
14952b2058L515K503l723R242j674m62j162L358M283P692K853j3793k4450j138
$$ -22058 -18543 -16040 -19763 -10521 -12195 -12657 -13819 -10461 -6178 1514 4367 -9426 -33876 -35014
14938c5014J9478O060k1110j0274J5060K1674N971P53q833J651L077J2213J756
$$ -35014 -15536 -9476 -30586 -40860 -25800 -4126 1845 2598 -6235 -4584 -1507 10706 12462
14925A2462j5353k519J0903K2945l411j7850j4781l352O135J3299n789n376J1669
$$ 12462 -2891 -5410 5493 28438 25027 7177 -7604 -10956 -4821 8478 2689 -2687 8982
14912H982j174K921k465j5076n227q15j55Q268k541j2283J534J5176J5387J2150
$$ 8982 7808 10729 8264 -6812 -12039 -12854 -13009 -4741 -7282 -19565 -18031 -2855 12532 24682
14898B4682M67r449k636q908r199k4j1481p878L249O893M010J2022P632q209p668
$$ 24682 25149 15700 13064 4156 -5043 -5067 -16548 -24426 -21177 -14284 -10274 1748 9380 1171 -6497
14883f497P581j1212l314K270o691J0257P063J4772j515r49j130r848j3871j654
$$ -6497 1084 -10128 -13442 -11172 -17863 -7606 -543 14229 12714 11765 10635 787 -13084 -14738
14869a4738J828k39j163L752j2785O672O023n351j374J472J7692j329k776j048
$$ -14738 -12910 -13149 -14312 -10560 -23345 -16673 -10650 -16001 -17375 -15903 1789 460 -2316 -3364
14855c364Q52M340q949m467Q198r02J361O195j2196j198p748r300M352N542J124
$$ -3364 -2512 1828 -7121 -11588 -3390 -4292 -2931 3264 -8932 -10130 -17878 -27178 -22826 -17284 -16160
14840a6160r10o424l892j3088k931K5104J1608j303O367J0600J5461P915q552
$$ -16160 -17070 -23494 -27386 -40474 -43405 -18301 -6693 -7996 -1629 8971 24432 32347 23795
14827B3795m640p186K831K189L29r194j9580j1745n441J2366L891q099N40M211
$$ 23795 19155 11969 14800 16989 17318 8124 -11456 -23201 -28642 -16276 -12385 -20484 -19944 -15733
14813a5733L881L058k654q700P095l516O304K49j759m13M348j6055j0613j696
$$ -15733 -11852 -8794 -11448 -20148 -13053 -16569 -10265 -10016 -11775 -12188 -7840 -23895 -34508 -36204
14799c6204Q833J0809J3580P640J1359j3267j4868J1527L994o644P305K849n784
$$ -36204 -27371 -16562 -2982 4658 16017 2750 -12118 -591 3403 -3241 4064 6913 1129
14786A129L560J6610j3744j5009o662j5038L545J0378J0583J0541q567q247j5973
$$ 1129 4689 21299 7555 -7454 -14116 -29154 -25609 -15231 -4648 5893 -2674 -10921 -26894
14773b6894K935J7811L803R884J173K462j0769q549M879l787O818l069j091r681
$$ -26894 -23959 -6148 -2345 7539 8712 11174 405 -8144 -3265 -7052 -234 -3303 -4394 -14075
14759a4075R328Q377j0673k762K800N837M530o680r487P014Q36J0022J4990p259
$$ -14075 -4747 3630 -7043 -9805 -7005 -1168 3362 -3318 -12805 -5791 -4955 5067 20057 12798
14745A2798q888K995J0382O405j524J0581o811j554j505l970r332K523j4353j5702
$$ 12798 3910 6905 17287 23692 22168 32749 25938 24384 22879 18909 9577 12100 -2253 -17955
14731a7955k5710J415Q719J5035J0032o440l330p47r3L292K411K293P102o563
$$ -17955 -43665 -42250 -33531 -18496 -8464 -14904 -18234 -18981 -19074 -15782 -13371 -11078 -3976 -10539
14717a0539K792Q267J4435J464l0070L178J387J1783Q973n562j2428j349n526
$$ -10539 -7747 520 14955 16419 -13651 -10473 -9086 2697 11670 6108 -6320 -7669 -13195
14704a3195j556M614k204N011R152Q060j8598m118J6167J2742j1973q277P661
$$ -13195 -14751 -10137 -12341 -7330 1822 9882 -8716 -12834 3333 16075 4102 -4175 3486
14691C486p255j77n376O926Q790J4012p309j3268j9264M592J4913J448j4992N396
$$ 3486 -3769 -3946 -9322 -2396 6394 20406 13097 -171 -19435 -14843 70 1518 -13474 -8078
14677h078J025m324k091J4319J0213L683j5906m556J885l373Q305J500q246j416
$$ -8078 -7053 -11377 -13468 851 11064 14747 -1159 -5715 -3830 -7203 1102 2602 -5644 -7060
14663g060q580m628K758j222J4721l277k028j770q893R35J0077p957n402J1165
$$ -7060 -15640 -20268 -17510 -18732 -4011 -7288 -9316 -11086 -19979 -19044 -8967 -16924 -22326 -11161
14649a1161K2482o971l5288j3748m970J6143J9683K157K516N451J3100J3178k459
$$ -11161 11321 4350 -30938 -44686 -49656 -33513 -13830 -11673 -9157 -3706 9394 22572 20113
14636B0113p535L547j0949p959K856p541L303O092j0083n735N535N081O651j44
$$ 20113 12578 16125 5176 -2783 73 -7468 -4165 1927 -8156 -13891 -8356 -3275 3376 3232
14622C232p132j356J4943m1j8843j3590M499l99N728J4635P536q807k065Q677
$$ 3232 -3900 -5256 9687 9646 -9197 -22787 -18288 -18687 -12959 1676 9212 405 -1660 7017
14608G017J8420j2948m446P438q055l885n649j7843J2706j181q009J4422J5156
$$ 7017 25437 12489 8043 15481 7426 3541 -2108 -19951 -7245 -8426 -16435 -2013 13143
14595A3143o762m906L412n847R7k039n526l34n615r763J83N005L460N921j5509
$$ 13143 6381 1475 4887 -960 -863 -2902 -8428 -8762 -14377 -24140 -23957 -18952 -15492 -9571 -25080
14580b5080l982J4711J3304k146M282P946K4244K225j7720n114j330m711o577
$$ -25080 -29062 -14351 -1047 -3193 1089 9035 33279 35504 17784 12670 11340 6629 52
14567E2k956N399n136l911j2823n311J0046P119j857Q569O920P955J907K890J818
$$ 52 -2904 2495 -2641 -6552 -19375 -24686 -14640 -7521 -9378 -809 6111 14066 15973 18863 20681
14552B0681p829r266j0489k569Q538o141n549j5223p462k362j0313Q713K675K6882
$$ 20681 12852 3586 -6903 -9472 -934 -7075 -12624 -27847 -35309 -37671 -47984 -39271 -36596 -9714
14538i714J7501m568j2533j0300N884Q367P265o325p685o405k956K5315J802j1268
$$ -9714 7787 3219 -9314 -19614 -13730 -5363 1902 -4423 -12108 -18513 -21469 3846 5648 -5620
14524e620p950M955J4640l280k2237n64J0179P572j1600j1714O255M307l99P065
$$ -5620 -13570 -8615 6025 2745 -19492 -20056 -9877 -2305 -13905 -25619 -19364 -15057 -15456 -8391
14510h391R810J958J424K680j382J900r05j3677j7022J2307R279J132R793p776
$$ -8391 1419 3377 4801 7481 6099 7999 7094 -6583 -23605 -11298 -2019 -887 8906 1130
14496A130j018j0859K849j0217n195P359K977j143K994r25M999O614L964q230
$$ 1130 112 -10747 -7898 -18115 -23310 -15951 -12974 -14117 -11123 -12048 -7049 -435 3529 -4701
14482d701j914L898m325r858k764K1127Q824j0271J470k686J594j1463l807J7246
$$ -4701 -6615 -2717 -7042 -16900 -19664 1463 10287 16 1486 -1200 394 -11069 -14876 2370
14468B370J2286m099j0265l581N424n607j3096m729N65J2488J1668q581j2162
$$ 2370 14656 10557 292 -3289 2135 -3472 -16568 -21297 -20732 -8244 3424 -5157 -17319
14455a7319K38j6713J449J3977P65Q599j1332K328N821J3566m731k4087j94J2149
$$ -17319 -17081 -33794 -32345 -18368 -17603 -9004 -20336 -18008 -12187 1379 -3352 -27439 -27633 -15484
14441a5484J5842J5728M245p469m284N916J0291j6662o530N312j5556j9075N266
$$ -15484 358 16086 20331 12862 8578 14494 24785 8123 1593 6905 -8651 -27726 -22460
14428b2460P280R613O779m388o080J7393l713o383J2584q376n062j022K588m717
$$ -22460 -15180 -5567 1212 -3176 -9256 8137 4424 -1959 10625 2249 -2813 -3835 -1247 -5964
14414e964R361L465k1505m396K3071P546j7582k1260N13J4882N364R42J392j1896
$$ -5964 3397 6862 -14643 -19039 4032 11578 -6004 -27264 -26751 -11869 -6505 -5563 -4171 -16067
14400a6067o39N329M535l362n502J986O464L021n302J357K015j696J76r290P978
$$ -16067 -16706 -11377 -6842 -10204 -15706 -13720 -7256 -4235 -9537 -8180 -6165 -7861 -7685 -16975 -8997
14385h997M180J580M957k043k515L170J1379o30k5204K976O885K067J5918O573
$$ -8997 -4817 -3237 1720 -323 -2838 332 11711 11081 -14123 -11147 -4262 -2195 13723 20296
14371B0296l537j6634L202P106N776R292j6250j0048r881Q613L724k22J0588j8884
$$ 20296 16759 125 3327 10433 16209 25501 9251 -797 -10678 -2065 1659 1437 12025 -6859
14357f859k4911K433L363n755J0036K7582O77r641O326j5061j993J0987O510j387
$$ -6859 -31770 -29337 -25974 -31729 -21693 5889 6566 -3075 3251 -11810 -13803 -2816 3694 2307
14343B307J8015n965q418J0k488k984K22O33k239O667m39l254k740l78Q373N585
$$ 2307 20322 14357 5939 5949 3461 477 699 1332 -907 5760 5321 2067 -673 -1051 7322 12907
14327A2907N237j6592j0146l174J6062m431r943j776K281L815J7304j329J78j9921
$$ 12907 18144 1552 -8594 -11768 4294 -137 -10080 -11856 -9575 -5760 11544 10215 10393 -9528
14313i528o24j230r466J1960K8915q407j4360j1946K301J6111l360m24M237p396
$$ -9528 -10152 -11382 -20848 -8888 20027 11620 -2740 -14686 -12385 3726 366 -58 4179 -3217
14299c217k884P816O209l69j0010m270j0680o255k726Q70J2899Q928J0437m366
$$ -3217 -6101 1715 7924 7555 -2455 -6725 -17405 -23660 -26386 -25516 -12617 -3689 6748 2382
14285B382m642L170j1815o176J5903J9653j1289j1654j417q473K211J4814J487
$$ 2382 -2260 910 -10905 -17081 -1178 18475 7186 -4468 -5885 -14358 -12147 2667 4154
14272D154p16l506O96R95o389R611m884o340K09K930o704P97n785R710L852J29
$$ 4154 3438 -68 628 1623 -4766 4845 -39 -6379 -6170 -3240 -9944 -9147 -14932 -5222 -1370 -1241
14256a241j3033j965n637J9234J8645L800K02r051l179l404m684L078N32j2563
$$ -1241 -14274 -16239 -21876 -2642 16003 19803 20005 10954 7775 4371 -313 2765 3297 -9266
14242i266j0145R012J3730M010j1546j7813n107J4904Q873P690q213r521Qr079
$$ -9266 -19411 -10399 3331 7341 -4205 -22018 -27125 -12221 -3348 4342 -3871 -13392 -13384 -22463
14228b2463N245K213N296k005r635R422J0071N330n858j3316N745N434O820L5
$$ -22463 -17218 -15005 -9709 -11714 -21349 -11927 -1856 3474 -2384 -15700 -9955 -4521 2299 2334
14214B334j0132l064J0790l962j6788m00n47Q643M900l143J1934L221J926l457
$$ 2334 -7798 -10862 -72 -4034 -20822 -21222 -21769 -13126 -8226 -11369 565 3786 5712 2255
14200B255J4550J1374j3890j9992k693j3096m15Q313K174K700m384j6757L555
$$ 2255 16805 28179 14289 -5703 -8396 -21492 -21907 -13594 -11420 -8720 -13104 -29861 -26306
14187b6306J7109Q42r021J5975K1543r612j4644Q752l46p93J252p113j3720R933
$$ -26306 -9197 -8355 -17376 -1401 20142 10530 -4114 4638 4292 3499 4751 -2362 -16082 -6149
14173f149J424N203J9424Q667n935j5629M578l160L790p098Q584j0020j1049R99
$$ -6149 -4725 478 19902 28569 22634 7005 11583 8423 12213 5115 13699 3679 -7370 -6371
14159f371j0893j667O587J1805K177j499m460k937L17Q98O756l7J1390q502k6153
$$ -6371 -17264 -18931 -12344 -539 1638 139 -4321 -7258 -6941 -6043 713 676 12066 3564 -22589
14144b2589r363J7943K0303J5379o924o01k935j957J849R20O411j569k4785o482
$$ -22589 -31952 -14009 6294 21673 14749 14148 11213 9256 11105 12025 18436 16867 -7918 -14400
14130a4400Q676j451j1491l80N095L838O480M443M25m87R230k350m343j2362J1064
$$ -14400 -5724 -7175 -18666 -19046 -13951 -10113 -3633 810 1235 748 9978 7628 3285 -9077 1987
14115A987R767n786j0332J0646L200M833L533j3691p113J5503R478m838p607j1563
$$ 1987 11754 5968 -4364 6282 9482 14315 17848 4157 -2956 12547 22025 17187 9580 -1983
14101a983q755o171Q696N225J583J1949j283N087j081j6469l685l600Q436J9615
$$ -1983 -10738 -16909 -8213 -2988 -1405 10544 9261 14348 13267 -3202 -6887 -10487 -2051 17564
14087A7564M466j3573n379n550q419l839J0918r505K409N020Q991n754p174o940
$$ 17564 22030 8457 3078 -2472 -10891 -14730 -3812 -13317 -10908 -5888 3103 -2651 -9825 -16765
14073a6765r994n05K0853J0744j6248J4443K8127j7441k2772q35l450L363l460
$$ -16765 -26759 -27264 -6411 4333 -11915 2528 30655 13214 -9558 -10393 -13843 -10480 -13940
14060a3940L202N617j3658J3099J1944O242n638l158L633k573j1601n2p14j844
$$ -13940 -10738 -5121 -18779 -5680 6264 12506 6868 3710 7343 4770 -6831 -6883 -7597 -9441
14046i441P976m814P492L855M065k125j0802J0863J2361o606k3648q321K031J6875
$$ -9441 -1465 -6279 1213 5068 9133 7008 -3794 7069 19430 12824 -10824 -19145 -17114 -239
14032b39J3407m348M65j408j1595R379j309J853O432l74N499o069j4151m271j1705
$$ -239 13168 8820 9285 7877 -3718 5661 4352 6205 12637 12263 17762 11693 -2458 -6729 -18434
14017a8434J833o460Q980J7451J8877n167j5383l381N910J13j597j8687P525M876
$$ -18434 -16601 -23061 -14081 3370 22247 17080 1697 -1684 4226 4339 2742 -15945 -8420 -3544
14003c544Q893m063j667j0498m375m87l620O257J1508j141j937O09j471k458k134
$$ -3544 5349 1286 -381 -10879 -15254 -15741 -19361 -13104 -1596 -2737 -4674 -4065 -5536 -7994 -10128
13988a0128P967N604r973J012M648o734J191M630l273l649J4324J8179J972l944
$$ -10128 -2161 3443 -6530 -5518 -870 -7604 -6413 -1783 -5056 -8705 5619 23798 25770 21826
13974B1826k6284j318K0682k062j4696q10J6400O629j2368r516N029M196m805
$$ 21826 -4458 -5776 14906 12844 -1852 -2662 13738 20367 7999 -1517 3512 7708 2903
13961B903j2480O544J3512J0703N808n961m04p704l196R054L49m430o433J813
$$ 2903 -9577 -3033 10479 21182 26990 21029 20625 12921 9725 18779 19128 14698 8265 10078
13947A0078n619k727J905K2089M123j3096N60j802l644J677m081o210p579R294
$$ 10078 4459 1732 3637 25726 29849 16753 17313 15511 11867 13544 9463 3253 -4326 4968
13933D968J0260o457K806P503N489j3243l703k123J283J742j7406k149l902K415
$$ 4968 15228 8771 11577 19080 24569 11326 7623 5500 6783 8525 -8881 -11030 -14932 -12517
13919a2517R240J3780J7475Q286l922l327q178K78j2646m251J266K5906J0265
$$ -12517 -3277 10503 27978 36264 32342 29015 20837 21115 8469 4218 5484 31390 41655
13906D1655m017k829N109K688k9032p677J255O18N567n874J371q104K191L76r155
$$ 41655 37638 34809 39918 42606 13574 5897 7152 7770 13337 7463 8834 730 2921 3297 -5858
13891e858n895l039m233Q58J1418J7800m764j2021J36P835O409J8334K2862m779
$$ -5858 -11753 -14792 -19025 -18167 -6749 11051 6287 -5734 -5598 2237 8646 26980 49842 45063
13877D5063p928j3435j5325n721N587L996r583j017J132N818p758j0148N640q26
$$ 45063 37135 23700 8375 2654 8241 12237 2654 1637 2769 8587 829 -9319 -3679 -4505
13863d505J0184J7572p358r795j5767j124O909j4767J612o77J2232L549P979J5547
$$ -4505 5679 23251 15893 6098 -9669 -10793 -3884 -18651 -17039 -17716 -5484 -1935 6044 21591
13849B1591P384n182J230k9490l941J3612N557K265J3453P76j4323j1759o066
$$ 21591 28975 23793 25023 -4467 -8408 5204 10761 13026 26479 27255 12932 1173 -4893
13836d893l440K674n060j097N404j2951M599j566k202J224M147Q455P241J1676
$$ -4893 -8333 -5659 -10719 -11816 -6412 -19363 -14764 -16330 -18532 -17308 -13161 -4706 2535 14211
13822A4211J0261J3506k285k021o799j1889J33P24j5035Q85K6057N43k709l654
$$ 14211 24472 37978 35693 33672 26873 14984 15117 15841 806 1691 27748 28291 25582 21928
13808B1928n894J442K59r619O179O833P59n090k4263r35O289Q533k676P242j203
$$ 21928 16034 17476 17735 8116 14295 21128 21887 16797 -7466 -8401 -2112 6421 3745 10987 9784
13793I784j5513M90J0172n40k808J738L34L67m369L933P34P579L456m042n430
$$ 9784 -5729 -5239 4933 4393 1585 3323 3657 4024 -345 3588 4322 11901 15357 11315 5885
13778E885p207J0216J1152m171q244q072L462L905k151J2108M056j2920j7559
$$ 5885 -1322 8894 20046 15875 7631 -441 3021 6926 4775 16883 20939 8019 -9540
13765i540R868J691j4373K330k019J559j66K52N207J515r613m5R571R005j0270
$$ -9540 328 2019 -12354 -10024 -12043 -10484 -10650 -10398 -5191 -3676 -13289 -13334 -3763 5242 -5028
13750e028K917k670P355P970N523K934p373j333P061R862r796n01o972L535R653
$$ -5028 -2111 -4781 2574 10544 16067 19001 11628 10295 17356 27218 17422 16921 9949 13484 23137
13735B3137l246r763p444j2384k084O765J2390L629j428J209j0462J484J642M305
$$ 23137 19891 10128 2684 -9700 -11784 -5019 7371 11000 9572 10781 319 1803 3445 7750
13721G750O892o47Q78L568L602l152p233K134l853j83R135l478o345L376j614
$$ 7750 14642 13995 14873 18441 22043 18891 11658 13792 9939 9756 18891 15413 9068 12444 10830
13706A0830j5428L524P045j553L707N857p94J83K078j2362m259p189L307J4164
$$ 10830 -4598 -1074 5971 4418 8125 13982 13188 13371 15449 3087 -1172 -8361 -5054 9110
13692I110J224N982Q884M111L630m537o985n296o645Q29j58j1329j083J0867k547
$$ 9110 10334 16316 25200 29311 32941 28404 21419 16123 9478 10307 10149 -1180 -2263 8604 6057
13677F057Q471J2738P863p544J444n235L690M280j7220j5818J9561J7296j95J5194
$$ 6057 14528 27266 35129 27585 29029 23794 27484 31764 14544 -1274 18287 35583 35388 50582
13663E0582J8467J4594J8252J5109J3845p5Q791J6533L2863M7235M9670N6573
$$ 50582 69049 83643 101895 117004 130849 130774 139565 156098 188961 236196 285866 342439
13651C42439Q7505J51588K13376K95848L60953K24763j02555l83719m60495l06718
$$ 342439 429944 581532 794908 1090756 1451709 1676472 1573917 1190198 729703 422985
13641D22985j54322p7914m2205l5886k4469j5980j6845q443J499j8180r199Q89
$$ 422985 268663 190749 148544 112658 88189 72209 55364 46921 48420 30240 21041 21930
13629B1930p725J4725l284m606j5959j2464O288J3251p344O062K3094O278j1653
$$ 21930 14205 28930 25646 21040 5081 -7383 -1095 12156 4812 10874 33968 40246 28593
13616B8593p080J7398L577k6873q076K1931J0031m787K445P989r60j1309O148
$$ 28593 21513 38911 42488 15615 7539 29470 39501 34714 37159 45148 44188 32879 39027
13603C9027q256J72N753q471N060k176j3678p421Q299J3994Q239m195j4141j3162
$$ 39027 30771 30943 36696 28225 33285 31109 17431 10010 18309 32303 40542 36347 22206 9044
13589I044o849L815J0487p344o488J16o987J2376k351k640O899O087O362M405
$$ 9044 2195 6010 16497 9153 2665 2781 -4206 8170 5819 3179 10078 16165 22527 26932
13575B6932L423j5058p792q76N458J884o32Q719j1135j1746O367J3704J6098L143
$$ 26932 30355 15297 7505 6629 12087 13971 13339 22058 10923 -823 5544 19248 35346 38489
13561C8489o938l660q494j5541Q076R095p94o885k319l618J3521N521n049j8961
$$ 38489 31551 27891 19397 3856 11932 21027 20233 13348 11029 7411 20932 26453 21404 2443
13547B443o397J0584P355P555K654N61p997Q299J3552o37L291M700N363j8262
$$ 2443 -3954 6630 13985 21540 24194 24755 16758 25057 38609 37972 41263 45963 51326 33064
13533C3064k5417J402J1503r302j3092m146J559n481M159m341J5645J4161j738
$$ 33064 7647 9049 20552 11250 -1842 -5988 -4429 -9910 -5751 -10092 5553 19714 17976
13520A7976J81j714J4722J0103M74J3536Q541j248N386M354l659k015n16J558
$$ 17976 18157 16443 31165 41268 41742 55278 63819 62571 67957 72311 68652 66637 66121 67679
13506F7679q029q872M75k917o046n162J534j606m39jj3838j9847j979J2555J3407
$$ 67679 59650 50778 51253 48336 42290 37128 38662 37056 36617 36616 22778 2931 952 13507 26914
13491B6914P05L64O511p838q20j886l774o71n589m120J9964M70k999J3392j313
$$ 26914 27619 27983 34494 26656 25836 23950 20176 19505 13916 9796 29760 30230 27231 40623 39310
13476C9310n626j7489J1348L5527K8455n533j3969K3891J9817R722m114P746J4994
$$ 39310 33684 16195 27543 63070 91525 85992 72023 95914 115731 125453 121339 129085 144079
13463A44079P945L2059L8704j3595n0480n4437k8463k9940p513J1479J1311j2295
$$ 144079 152024 184083 222787 209192 158712 104275 75812 45872 38359 49838 61149 48854
13451D8854j1679J3955J1744J3119L234j907Q77j5800j1069N949j1063o903o122
$$ 48854 37175 51130 62874 75993 79227 77320 78197 62397 51328 57277 46214 39311 33189
13438C3189J8090J322J250j3442o055O947o666j6945J537J6052K3661J0065j3015
$$ 33189 51279 52601 53851 40409 34354 41301 34635 17690 19227 35279 58940 69005 55990
13425E5990j8861j2233K420N458R47P813K5135L637j2083o857Q581K0263J8520
$$ 55990 37129 24896 27316 32774 33721 41534 66669 70306 58223 51366 59947 80210 98730
13412I8730J1753N383k443j1979k4872j5211k3916l0224l5702j7835J539K62K7746
$$ 98730 110483 115866 113423 101444 76572 61361 37445 7221 -28481 -46316 -44777 -44515 -16769
13399a6769K6259J6923N3032M7923K8462q097m2205l9161k1940P657L81r670M023
$$ -16769 9490 26413 79445 127368 155830 147733 105528 66367 44427 52084 52465 42795 46818
13386D6818J3799K5786m91o729j8530j9486L061M106n254j933j459N654P514j7306
$$ 46818 60617 86403 85912 79183 60653 41167 44228 48334 43080 41147 39688 45342 52856 35550
13372C5550p469L023R724m98k455r24k983j6114k4716o716N370N869L4314J4618
$$ 35550 28081 31104 40828 40330 37875 36951 33968 17854 -6862 -13578 -8208 -2339 31975 46593
13358D6593q361J0749L800j1849j0566r129J457R194K148p72J817K0758K638Q343
$$ 46593 38232 48981 52781 40932 30366 21237 22694 31888 34036 33264 35081 55839 58477 66820
13344F6820L958N854R635k807m604l15Q102K193K4499K8127m799J127r216j5753
$$ 66820 70778 76632 86267 83460 78856 78541 86643 88836 113335 141462 136663 137790 128574 112821
13330A12821q340R929K233m938j0994m713r166j4073L52K1781P131K329l589k127
$$ 112821 104481 114410 116643 111705 100711 95998 86832 72759 73111 94892 102023 104352 100763 98636
13316I8636j054q31k580k777q69Q565L471j4168J980K626k662O787J1647q947
$$ 98636 97582 96751 94171 91394 90525 99090 102561 88393 90373 92999 90337 97124 108771 99824
13302I9824O112J9412Q005o90j3634j0291Q218k21P661L0607J3690K3032n747
$$ 99824 105936 125348 133353 132663 119029 108738 116956 116735 124396 155003 168693 191725 185978
13289A85978j1977j0010Q656R464k318M283M742J5165K6844R560R880J5716n805
$$ 185978 174001 163991 172647 182111 179793 184076 188818 203983 230827 240387 250267 265983 260178
13276B60178J0095K4923L2634K5328J5100m90o972j1818k0176j8785q783N323
$$ 260178 270273 295196 327830 353158 368258 367768 360796 348978 328802 310017 301234 306557
13264C06557K0616J8590J7875J0459M614J4063R172J1265L0045N4160N6336M0526
$$ 306557 327173 345763 363638 374097 378711 392774 401946 413211 443256 497416 553752 594278
13252E94278M5668L7296L9049P3884Q3274R3336O6129K8259K5890N5933Q4749
$$ 594278 639946 677242 716291 790175 873449 966785 1032914 1061173 1087063 1142996 1227745
13241A227745J28949J53757J43875J42097J46898J53151J91280J96545K13365
$$ 1227745 1356694 1510451 1654326 1796423 1943321 2096472 2287752 2484297 2697662
13232B697662K38259K91097L79077M79978O04861P65178J004764J314081J703456
$$ 2697662 2935921 3227018 3606095 4086073 4690934 5456112 6460876 7774957 9478413
13223I478413K167049K672374L297360M045016M599498M867056N228457O267181
$$ 9478413 11645462 14317836 17615196 21660212 26259710 31126766 36355223 42622404
13215D2622404Q103220J1260073J6840998K6652630M0468209N5601409O9789852
$$ 42622404 50725624 61985697 78826695 105479325 145947534 201548943 271338795
13208B71338795N1227993r998124o6719019r0924017o2653862l2786877j7555011
$$ 271338795 322566788 312568664 245849645 154925628 92271766 59484889 41929878
13201D1929878j0304588o724557m768125l578114k631407j989661j727582j613440
$$ 41929878 31625290 24900733 20132608 16554494 13923087 11933426 10205844 8592404
13193H592404j339089r65836p14378n58923m58486l84498k96699k63424k68810
$$ 8592404 7253315 6287479 5573101 5014178 4555692 4171194 3874495 3611071 3342261
13184C342261k83508k86066k87502k83555k36967j87896j67067j46291j03529
$$ 3342261 3058753 2772687 2485185 2201630 1964663 1776767 1609700 1463409 1359880
13175A359880o5091k3557l1817n5764q4030r5192o2333k1640j0746p35j8476l4593
$$ 1359880 1294789 1271232 1239415 1183651 1099621 1004429 942096 920456 909710 908975 890499 855906
13163H55906l4508n4967m3710j0517Q29q840j3811l8570k4039j7776j4251q308
$$ 855906 821398 766431 722721 712204 713033 704193 690382 651812 627773 609997 595746 587438
13151E87438j6030j7500k1177j7175j3628k8954l2586j1485K891L1621P5747Q1937
$$ 587438 571408 553908 532731 515556 501928 472974 440388 428903 431794 463415 539162 621099
13139F21099R2085P2322J1907o5384r8272q9869n8030l2776j3656l5841k0208
$$ 621099 713184 785506 797413 732029 633757 543888 485858 453082 439426 403585 383377
13128C83377j3143j5388j8739j4044j213R918K361J509Q003j238j0197k569J545
$$ 383377 370234 354846 336107 322063 320850 330768 333129 334638 342641 341403 331206 328637 330182
13115C30182K4462K2280J1349L1545O8525O6640P1274P3236P5401R4309J33828
$$ 330182 354644 376924 388273 419818 488343 554983 626257 699493 774894 869203 1003031
13104A003031K01665L26441M95752P12578R15832Q76285L85765m63596j100445
$$ 1003031 1204696 1531137 2026889 2739467 3655299 4531584 4917349 4453753 3353308
13095C353308j110389p19720m07312k37551j64231j28946j01128o7698n9202l5180
$$ 3353308 2242919 1523199 1115887 878336 714105 585159 484031 416333 357131 321951
13085C21951j7729k0573k3975j5521P635m201k0411k3938j8068m15K240j1872
$$ 321951 304222 283649 259674 244153 251788 247587 227176 203238 185170 184755 186995 175123
13073A75123k4993k0313q830J455O095j1876m57j067j401M406J1601j1155j3798
$$ 175123 150130 129817 120987 122442 128537 116661 116204 115137 113736 118142 129743 118588 104790
13060A04790n13O763J7004m921j338J3600J0273K1756J1235r754k8063j5253o546
$$ 104790 104277 111040 128044 123123 121785 135385 145658 167414 178649 168895 140832 125579 119033
13047A19033j0125p641k2456J611M558l294J263n703n40K873M025m591j7462j0007
$$ 119033 108908 101267 78811 80422 84980 81686 82949 77246 76706 79579 83604 79013 61551 51544
13033E1544j0297m611L935K4023M463L452r977n393Q92j4932k2152k3592l5666
$$ 51544 41247 36636 40571 64594 69057 72509 62532 57139 58031 43099 20947 -2645 -38311
13020c8311j8615J8460M9178N0931M0036J4309J2328P799j0225l2455l2280k5069
$$ -38311 -56926 -38466 10712 61643 101679 115988 128316 136115 125890 93435 61155 36086
13008C6086m815l1426l9755j399l93P527J9938K8558R587K0135P851L227J521
$$ 36086 31271 -155 -39910 -41309 -41702 -34175 -14237 14321 23908 44043 51894 55121 56642
12995E6642j567R277k835o690l421j2487o458k150j060L385J1974l518N229O331
$$ 56642 55075 64352 61517 54827 51406 38919 32461 30311 29251 32636 44610 41092 46321 52652
12981E2652n916j0027J00q044M617p950l9480k2240R179R420O588K3135J6512
$$ 52652 46736 36709 36809 28765 33382 25432 -14048 -36288 -27109 -17689 -11101 12034 28546
12968B8546o271j1075J90J3509J3678N244n532l192K664N770k538M950o678j6308
$$ 28546 22275 11200 11390 24899 38577 43821 38289 35097 37761 43531 40993 45943 39265 22957
12954B2957q991o215l436l326j4470r123O21J2900J3068J4294P403J0234K0622
$$ 22957 13966 7751 4315 989 -13481 -22604 -21983 -9083 3985 18279 25682 35916 56538
12941E6538J3878j393r39j217k676j5874o693l327m359J2676J2229j2349j5320
$$ 56538 70416 69023 68084 66867 64191 48317 41624 38297 33938 46614 58843 46494 31174
12928C1174j0139m721j3819r0J594o899J8112K079p321q866P83n274n439Q994
$$ 31174 21035 16314 2495 2405 3999 -2900 15212 17291 9970 1104 1887 -3387 -8826 168
12914A68k029j1961j722j0978m578K255k09r199j2258m52M756P652J0295M461
$$ 168 -1861 -13822 -15544 -26522 -31100 -28845 -29054 -38253 -50511 -50963 -46207 -38555 -28260 -23799
12900b3799K2301L422r069J4844K9448L530K639K550j1675q712L210K268J599
$$ -23799 -1498 1924 -7145 7699 37147 40677 43316 45866 34191 25479 28689 30957 32556
12887C2556L474k5856Q110K169j2217j9458J170o759p852J6524R615R048M3PL794
$$ 32556 36030 10174 18284 20453 8236 -11222 -10052 -16811 -24663 -8139 1476 10524 10567 10574 14368
12872A4368J0704n004r038P032J434L877n816n807m821J3460J2585n409m572J251
$$ 14368 25072 20068 11030 18062 19496 23373 17557 11750 6929 20389 32974 27565 22993 24244
12858B4244j9930j1448J0276N568J0744j5028q993q579l696J8773j299k909o625
$$ 24244 4314 -7134 3142 8710 19454 4426 -4567 -13146 -16842 1931 632 -2277 -8902
12845h902J510J2455k204O070J5905j227n930P398j1964P167P950l905n806M889
$$ -8902 -7392 5063 2859 8929 24834 23607 17677 25075 13111 20278 28228 24323 18517 23406
12831B3406o566n316k845j4310n757M218M252M023O488N826P940J720k369M682
$$ 23406 16840 11524 8679 -5631 -11388 -7170 -2918 1105 7593 13419 21359 23079 20710 25392
12817B5392p692K057J282k447K2475n162k307N46N360J728j5119J993O273K418
$$ 25392 17700 19757 21039 18592 41067 35905 33598 34144 39504 41232 26113 28106 34379 36797
12803C6797q536n360l57N507q94j9507O92Q650Q508q881j3936M162n757J5902
$$ 36797 28261 22901 22544 28051 27157 7650 8342 16992 25500 16619 2683 6845 1088 16990
12789A6990O488j302M069K515j30P551N906n207J178Q205P840L597J3382K6401
$$ 16990 23478 22176 26245 28760 28630 36181 42087 36880 38058 46263 54103 57700 71082 97483
12775I7483R093K3782L7998K7883L1114M1440L1728R5562J62285K13775K99975
$$ 97483 106576 130358 168356 196239 227353 268793 300521 396083 558368 772143 1072118
12764A072118L56720K38875p4967l61122m53215l15696j68149p7839m1147l7375
$$ 1072118 1428838 1667713 1592746 1231624 778409 462713 294564 216725 175578 138203
12754A38203k6341k4399j4984n798r254m190j2725j8384o084l625k3655o864J8992
$$ 138203 111862 87463 72479 66681 57427 53237 40512 22128 16044 12419 -11236 -18100 892
12741H92j675j7103K254J2922q083n624J6042O789r6n710j0656l476J4976O556
$$ 892 -783 -17886 -15632 -2710 -10793 -16417 -375 6414 6318 608 -10048 -13524 1452 8008
12727H008k1735j929R548N900K285j4309L581J6786o698m76k36j2076J2247K5191
$$ 8008 -13727 -15656 -6108 -208 2077 -12232 -8651 8135 1437 961 725 -11351 896 26087
12713B6087L523j8142n887q21P966p558J316n850q947J107j638Q199j894j5497
$$ 26087 29610 11468 5581 4760 12726 5168 6484 634 -8313 -7206 -8844 -645 -2539 -18036
12699a8036j2135R924P311P648M050N256r137K084m086J051j7715N314J8391J641
$$ -18036 -30171 -20247 -12936 -5288 -1238 4018 -5119 -3035 -7121 -6070 -23785 -18471 -80 1561
12685A561q39L342J1404m559j3123M270M807O949r608l796L583O397L344J0668
$$ 1561 722 4064 15468 10909 -2214 2056 6863 13812 4204 408 3991 10388 13732 24400
12671B4400J3385M492j3074j9366L1l615j655n97Q33P186J403R5o718Q345J7454
$$ 24400 37785 42277 29203 9837 9868 6253 4598 4001 4834 12020 13423 13518 6800 15145 32599
12656C2599Q461k320p18j4222k564J3123R334q827r20k98j4714k868k008m005
$$ 32599 41060 38740 38022 23800 21236 34359 43693 34866 33946 33648 18934 16066 14058 10053
12642A0053N491M794P244M650m667r030j414n610j2693q598P435J7589j2230j946
$$ 10053 15544 20338 27582 32232 27565 18535 17121 11511 -1182 -9780 -2345 15244 3014 1068
12628A068R657o044p67J3043k697P39M5N194N847o382J567k564j0713O508J3419
$$ 1068 10725 4681 3914 16957 14260 14999 15044 20238 26085 19703 21270 18706 7993 14501 27920
12613B7920l038j130m442M523K0740O150n137j7937J1581J0231j0744j3275q076
$$ 27920 24882 23752 19310 23833 44573 50723 45586 27649 39230 49461 38717 25442 17366
12600A7366l390j1228L400K992J1308J6417R499k2203j0019q660j938n638J2797
$$ 17366 13976 2748 6148 9140 20448 36865 46364 24161 14142 5482 3544 -2094 10703
12587A0703Q291Q432K873Q088j695K398l415n853r036j4060K3524N253j959P094
$$ 10703 18994 27426 30299 38387 36692 39090 35675 29822 20786 6726 30250 35503 33544 40638
12573D0638N631j3480J877J115Q26J3462P576J3135l339j2654k2033l484M595
$$ 40638 46269 32789 34666 35781 36607 50069 57645 70780 67441 54787 32754 29270 33865
12560C3865Q759n24k0644j4435P749Q817m501J1859K5710j91k7230r280j3250
$$ 33865 42624 42100 21456 7021 14770 23587 19086 30945 56655 56464 29234 19954 6704
12547F704j2515L233k657M459J7852J122J125j0941j4396n667J2468O199J68o413
$$ 6704 -5811 -2578 -5235 -776 17076 18198 19323 8382 -6014 -11681 787 6986 7154 741
12533G41l535J6223L470r118N527O309j3827l255M936M661j908o679j2429J772
$$ 741 -2794 13429 16899 7781 13308 19617 5790 2535 7471 12132 10224 3545 -8884 -7112
12519g112M999O326J1302J3655m448k6712j4013k682Q345q2M558P916k351j52
$$ -7112 -2113 4213 15515 29170 24722 -1990 -16003 -18685 -10340 -10422 -5864 2052 -299 -451
12505d51J5720o362j623N161R048m519l445j0744k085j5384N066K787J762r310
$$ -451 15269 8907 7284 12445 21493 16974 13529 2785 700 -14684 -9618 -6831 -5069 -14379
12491a4379m708K445J3623J4457L501j3132j795j2318KR506M131M707o517j2657
$$ -14379 -19087 -16642 -3019 11438 14939 1807 12 -12306 -12304 -2798 1333 6040 -477 -13134
12477a3134O016R141n075M786L77R375l453L146j334j8115L136K7k732r015k47
$$ -13134 -7118 2023 -3052 1734 2111 11486 8033 11179 9845 -8270 -5134 -5107 -7839 -16854 -17101
12462a7101P265O159n607J782J4128O515j733K172L828j3518k746m963n774J180
$$ -17101 -9836 -3677 -9284 -7502 6626 13141 11408 13580 17408 3890 1144 -3819 -9593 -8413
12448h413o209J0606J0763J384N798k235j0534l856K273j0329j0303K518J4380
$$ -8413 -14622 -4016 6747 8131 13929 11694 1160 -2696 -423 -10752 -21055 -18537 -4157
12435d157O884P490o771j3503O011n18J3402o916J050o246J6912K0652j9063j3395
$$ -4157 2727 10217 3446 -10057 -4046 -4564 8838 1922 2972 -3274 13638 34290 15227 1832
12421A832O49O767O597N696j5283O53j706q214q257j113J1073N849J091j0696
$$ 1832 2481 9248 15845 21541 6258 6911 5205 -3009 -11266 -12379 -1306 4543 5634 -5062
12407e062O994N29J1275q994j5712r8J2955m937R948P505j2301n848n673q25j052
$$ -5062 1932 2461 13736 4742 -10970 -11068 1887 -3050 6898 14403 2102 -3746 -9419 -10244 -11296
12392a1296j9255m794K559J3290n559O945J0233P843J8845j2577j9370q482M32
$$ -11296 -30551 -35345 -32786 -19496 -25055 -18110 -7877 -34 18811 6234 -13136 -21618 -21186
12379b1186Q120L257N815J140o785j504k279j5550M184K4835p598o671q227k895
$$ -21186 -13066 -9809 -3994 -2854 -9639 -11143 -13422 -28972 -24788 47 -7551 -14222 -22449 -25344
12365b5344j88R412Q724J3465l521M732Q206o420j0591l031O795L044J812n68
$$ -25344 -25532 -16120 -7396 6069 2548 7280 15486 9066 -1525 -4556 2239 5283 7095 6527
12351F527p862N781j6614r211J4745K240o46R696o870p476N277j864O332O092
$$ 6527 -1335 4446 -12168 -21379 -6634 -4394 -5040 4656 -2214 -9690 -4413 -6277 55 6147
12337F147p960o123j127m699p25k929P442R168L866l989j0842j0608Q150j0256
$$ 6147 -1813 -7936 -9063 -13762 -14487 -17416 -9974 -806 3060 -929 -11771 -22379 -14229 -24485
12323b4485l731J2187J3315p045J628K1073o375o528k751J0588J7671n348k642
$$ -24485 -28216 -16029 -2714 -9759 -8131 12942 6567 39 -2712 7876 25547 20199 17557
12310A7557P85o606r591o744r291L452J0776L301J9201l207p33j0146j7503K271
$$ 17557 18342 11736 2145 -4599 -13890 -10438 338 3639 22840 19633 18900 8754 -8749 -6478
12296f478q307q314J0777Q350P00K479O970j070j2244k260m018o51r14J93J4148
$$ -6478 -14785 -23099 -12322 -3972 -3272 -793 6177 5107 -7137 -9397 -13415 -14066 -14980 -14787 -639
12281f39J19N708k747j6746l306J9979N268l466l786q257r108M612R186R773k495
$$ -639 -520 5188 2441 -14305 -17611 2368 7636 4170 384 -7873 -16981 -12369 -3183 6590 4095
12266D095j4876l119J3108J740N104j1055m778Q448N555j1699l567J5827R626
$$ 4095 -10781 -13900 -792 948 6052 -5003 -9781 -1333 4222 -7477 -11044 4783 14409
12253A4409M619k1313j0042o704J7563K431l236J4582n386M847j1859j2621n72
$$ 14409 19028 -2285 -12327 -19031 -1468 963 -2273 12309 6923 11770 -89 -12710 -13282
12240a3282o04o786l844K1687J8184r3q361M332N999p388k936N733j8198j1889
$$ -13282 -13886 -20672 -24516 -2829 15355 15262 6901 11233 17232 9844 6908 12641 -5557 -17446
12226a7446Q566j979J2855J2858O189L219j382l167j1864L485k0266k906K1238
$$ -17446 -8880 -10859 1996 14854 21043 24262 22880 19713 7849 11334 -8932 -11838 9400
12213I400K9656j0191p170K637Q34p030j4094p415q379J3133J723K841q10L373
$$ 9400 39056 28865 21695 24332 25166 18136 4042 -3373 -11752 1381 3104 5945 5135 8508
12199H508p353l491j001O487k752r955j901J0678R048m084j3171j8788K490M604
$$ 8508 1155 -2336 -3337 3150 398 -9557 -11458 -780 8268 4184 -8987 -27775 -25285 -20681
12185b0681N415o390j8740J1138K0172N924Q23J504j0915m454M000J0659K7762
$$ -20681 -15266 -21656 -40396 -29258 -9086 -3162 -2339 -835 -11750 -16204 -12204 -1545 26217
12172B6217J6723j1513k4956j3849p909o374k070R952J9961P878j428j7370k5027
$$ 26217 42940 31427 6471 -7378 -15287 -21661 -23731 -13779 6182 14060 12632 -4738 -29765
12159b9765q000J4316J2622P696J462r94P395m142j1553J062O686L838J0246r750
$$ -29765 -37765 -23449 -10827 -3131 -1669 -2663 4732 590 -10963 -9901 -3215 623 10869 1119
12145A119j901O012J2032j1441k1675N584O7j1852J5138N925L708q655j5353K722
$$ 1119 -782 5230 17262 5821 -15854 -10270 -10203 -22055 -6917 -992 2716 -5939 -21292 -18570
12131a8570J4841P744j210N829L987K450n640o334o228K691r49j1483k566j776
$$ -18570 -3729 4015 2805 8634 12621 15071 9431 3097 -3131 -440 -1389 -12872 -15438 -17214
12117a7214O571j350L513j5599j2814J0575J8428l299j2531p603R522R852r59
$$ -17214 -10643 -11993 -8480 -24079 -36893 -26318 -7890 -11189 -23720 -31323 -21801 -11949 -12908
12104a2908p191N77M84K945l392k457J6149o875j0912L820J1434R431N601J4492
$$ -12908 -20099 -19522 -19038 -16093 -19485 -21942 -5793 -12668 -23580 -19760 -8326 1105 6706 21198
12090B1198p096q368n719K024k231p026M918R81k405l050r30j751o131J3439O255
$$ 21198 14102 5734 15 2039 -192 -7218 -2300 -1319 -3724 -6774 -7704 -9455 -15586 -2147 4108
12075D108o886R817J4795J5940j968n880m102n439r609j2536J500k682n862j2629
$$ 4108 -2778 7039 21834 37774 35806 29926 25824 20385 10776 -1760 -260 -2942 -8804 -21433
12061b1433J0195j3452p977m748J0798j159K0255J3571p700L756J883p0J637n384
$$ -21433 -11238 -24690 -32667 -37415 -26617 -27776 -7521 6050 -1650 2106 3989 3919 5556 172
12047A72k207J3853N538O78O168p318k2019r145J036o081N00J1005J1831r022
$$ 172 -2035 11818 17356 18034 24202 16884 -5135 -14280 -13244 -19325 -18825 -7820 4011 -5011
12033e011K219Q340o980k781R38p080r243k968Q86r408R495J5795J1472m782r942
$$ -5011 -2792 5548 -1432 -4213 -3275 -10355 -19598 -22566 -21680 -31088 -21593 -5798 5674 892 -9050
12018i050N169J1666L002r703j1258l404j1453q490K3857J9233L530j1333r52
$$ -9050 -3881 7785 10787 1084 -10174 -13578 -25031 -33521 -9664 9569 13099 1766 814
12005H14j1907Q21J6752P198q944o787N106q333Q228L18p774o988K485N227l492
$$ 814 -11093 -10272 6480 13678 4734 -2053 3053 -5280 2948 3266 -4508 -11496 -9011 -3784 -7276
11990g276j324J947m034O37m17L126J0312j968Q194J3803k11j1895j6846J627
$$ -7276 -8600 -6653 -10687 -10050 -10467 -7341 2971 1003 9197 23000 22789 10894 -5952 -4325
11976d325k368M435k812q6L540k824n123r633m00L146L312L030K192j9102J177
$$ -4325 -6693 -2258 -5070 -5156 -1616 -4440 -9563 -19196 -19596 -16450 -13138 -10108 -7916 -27018 -25841
11961b5841J1994p008L519J0221q25K690K006J8799L896j9191k2527o384J4914
$$ -25841 -13847 -20855 -17336 -7115 -7940 -5250 -3244 15555 19451 260 -22267 -28651 -13737
11948a3737K4466L235L44j4686j8246j3868O078P964J6296k317l999j275N417
$$ -13737 10729 13964 14308 -378 -18624 -32492 -26414 -18450 -2154 -4471 -8470 -9745 -4328
11935d328M376j2036r753M697J3337J2654j974n980K062l693K950K870r37n91
$$ -4328 48 -11988 -21741 -17044 -3707 8947 6973 993 3055 -638 2312 5182 4245 3654
11921C654j374Q200q407k136j112P727p667j3908j1939O317K2058O825l751l31
$$ 3654 2280 10480 2073 -63 -1175 6552 -1115 -15023 -26962 -20645 1413 8238 4487 4156
11907D156r525J0127M35q365r88k77J0060K323K468M327k817l044p640N03l148
$$ 4156 -5369 4758 5193 -3172 -4160 -4437 5623 7946 10414 14741 11924 8880 1240 1743 -1405
11892a405m860M146j0604J552R201J2066n457j2094r170Q244M971l660J467R212
$$ -1405 -6265 -2119 -12723 -11171 -1970 10096 4639 -7455 -16625 -8381 -3410 -7070 -5603 3609
11878C609j319J1903K75l944j1000R17J2180j301o769q339r191k14J2244m890
$$ 3609 2290 14193 14468 10524 -476 441 12621 11320 4551 -3788 -12979 -13193 -949 -5839
11864e839m987k364r596J3967M321l951o298n316r329L845P550J971R234P387
$$ -5839 -10826 -13190 -22786 -8819 -4498 -8449 -14747 -20063 -29392 -25547 -17997 -16026 -6792 595
11850E95J2716K544j8848M615j3940j0456J6572J1601K363l452N90L597j2216
$$ 595 13311 15855 -2993 1622 -12318 -22774 -6202 5399 7762 4310 4900 8497 -3719
11837c719k0460j5023N157P66P452K4j3156J877K5768J5068k611q799k454O787
$$ -3719 -24179 -39202 -34045 -33279 -25827 -25803 -38959 -37082 -11314 3754 1143 -7656 -10110 -3323
11823c323L861j3800l509J1422j0036J0255R957N04Q702J526j2708o047M067l610
$$ -3323 538 -13262 -16771 -5349 -15385 -5130 4827 5331 14033 15559 2851 -3196 871 -2739
11809b739K254J9290o617o622M66m683m740L439O447M698j4635j0391p348m725
$$ -2739 -485 18805 12188 5566 6032 1349 -3391 48 6495 11193 -3442 -13833 -21181 -25906
11795b5906P193M341r141r502P800m125M844J6815Q43o516P008R783q0j067M849
$$ -25906 -18713 -14372 -23513 -33015 -25215 -29340 -24496 -7681 -6838 -13354 -6346 3437 3357 2290 7139
11780G139k519j1451o212q164K55j3436R258K7000Q92j3265j5565K370K2767J0621
$$ 7139 4620 -6831 -13043 -21207 -20952 -34388 -25130 1870 2762 -10503 -26068 -23698 -931 9690
11766I690q091J103l990p886j3130j8498K768J5279R907q671J0568R625m16o208
$$ 9690 1599 2702 -1288 -9174 -22304 -40802 -38034 -22755 -12848 -21519 -10951 -1326 -1742 -7950
11752g950r187Q892o987r097J945j076l132N273P365J0435L080m193o614O35n658
$$ -7950 -17137 -8245 -15232 -24329 -22384 -23460 -26592 -21319 -13954 -3519 -439 -4632 -11246 -10611 -16269
11737a6269k694K386J598m445J8100J4058M797n566k015r0q081p740J1517J0158
$$ -16269 -18963 -16577 -14979 -19424 -1324 12734 17531 11965 9950 9860 1779 -5961 5556 15714
11723A5714J3187J4469j5066n367p375n880p142q328l334p240j902Q189Q958M179
$$ 15714 28901 43370 28304 22937 15562 9682 2540 -5788 -9122 -16362 -18264 -10075 -1117 3062
11709C062J1668L743K767p256j4435j8741j7102k848J8156K5044N877j6588j1959
$$ 3062 14730 18473 21240 13984 -451 -19192 -36294 -39142 -20986 4058 9935 -6653 -18612
11696a8612N862J7532p983j5427J1404r64J060j2270O47J1754L525O173j2547
$$ -18612 -12750 4782 -3201 -18628 -7224 -8188 -7128 -19398 -18751 -6997 -3472 2701 -9846
11683i846o483o292l94O379J6618O167j3016n858r762l560l253P070Q216p015
$$ -9846 -16329 -22621 -23015 -16636 -18 6149 -6867 -12725 -22487 -26047 -29300 -22230 -14014 -21029
11669b1029L217J3048M252k2486K280J5247R072N157o17R107r220j1510j1658
$$ -21029 -17812 -4764 -512 -22998 -20718 -5471 3601 8758 8141 17248 8028 -3482 -15140
11656a5140n372L120J5483J1010J1217J136l956j0291n388P909J898q500r633
$$ -15140 -20512 -17392 -1909 9101 20318 21454 17498 7207 1819 9728 11626 3126 -6507
11643f507j0329L264k551J31n093K0149K691K165N66m058j6371j4133L12J1392
$$ -6507 -16836 -13572 -16123 -15992 -21085 -936 1755 3920 4486 428 -15943 -30076 -29764 -18372
11629a8372N659P535j955n990j1918Q456K6841Q841k0798j2028J0846J0389m809
$$ -18372 -12713 -5178 -7133 -13123 -25041 -16585 10256 19097 -1701 -13729 -2883 7506 2697
11616B697P616Q289m038j3841j0201J2730L72j5406P404K274j0748K258k072L8
$$ 2697 10313 18602 14564 723 -9478 3252 3624 -11782 -4378 -2104 -12852 -10594 -12666 -12628
11602a2628N300l964j294J0784J0196R68j3059K728J2423m821o316J2601j601
$$ -12628 -7328 -11292 -12586 -1802 8394 9362 -3697 -969 11454 6633 317 12918 11317
11589A1317J73j1N590K003q914M890M344J893o224p214r800R161j5646j4086j6266
$$ 11317 11490 11479 17069 19072 10158 15048 19392 21285 15061 7847 -1953 7208 -8438 -22524 -38790
11574c8790m494Q222O624K4724J8044m361j088M499J1432j4989j3208K91l459
$$ -38790 -43284 -35062 -28438 -3714 14330 9969 8881 13380 24812 9823 -3385 -3094 -6553
11561f553o916O716J2126N892o504j68p341r967k046P310J5984k494n954Q566
$$ -6553 -13469 -6753 5373 11265 4761 4593 -2748 -12715 -14761 -7451 8533 6039 85 8651
11547H651j0841N275k978o761j0247k226J3543J1008j494j2048m8R66n648j283
$$ 8651 -2190 3085 107 -6654 -16901 -19127 -5584 5424 3930 -8118 -8166 -7200 -12848 -14131
11533a4131J3937O3l500N997l576k821m233p02J5469J2434j1216m985j0394N387
$$ -14131 -194 -131 -3631 2366 -1210 -4031 -8264 -8966 6503 18937 7721 2736 -7658 -2271
11519b271N674n369j5380j5243j487N312J6065P130R727J3802R35o013r296p089
$$ -2271 3403 -1966 -17346 -32589 -34076 -28764 -12699 -5569 4158 17960 18895 12882 3586 -3503
11505c503p18M676K2885r425j1808n332J938R389J912L039m461p795j2197m584
$$ -3503 -4221 455 23340 13915 2107 -3225 -1287 8102 10014 13053 8592 797 -11400 -15984
11491a5984l601J2693r93j1015P112N579p289L573J9759M411j0466K07N861M847
$$ -15984 -19585 -6892 -7885 -18900 -11788 -6209 -13498 -9925 9834 14245 3779 3986 9847 14694
11477A4694J4382j93j5328k7830k0170J980J7615L000Q151J0121J635m775J019
$$ 14694 29076 28883 13555 -14275 -34445 -32465 -14850 -11850 -3699 6422 8057 3282 4301
11464D301q680L72Q422j892l839l110j472O907J301J0753O066r328j6189O104
$$ 4301 -4379 -4007 4415 2523 -1316 -4426 -5898 1009 2310 13063 19129 9801 -6388 -284
11450b84J3659J2504k499q954p981p031L935O431J4075j248Q40k894L811R351
$$ -284 13375 25879 23380 14426 6445 -586 3349 9780 23855 22607 23447 20553 24364 33715
11436C3715J5474k489k3719l1221o145L2966L787j3982R349L278o606j1062l799
$$ 33715 49189 46700 22981 -8240 -14385 18581 22368 8386 17735 21013 14407 3345 -454
11423d54j8418K033o63L875l649J471K577j24j420j518O074Q188o775j0649N737
$$ -454 -18872 -16839 -17502 -13627 -17276 -15805 -13228 -13352 -14772 -16290 -10216 -2028 -8803 -19452 -13715
11408a3715k809J5247L560r276J2437k57k3819o298J0927O398Q438M347Q217M354
$$ -13715 -16524 -1277 2283 -6993 5444 5187 -18632 -24930 -14003 -7605 833 5180 13397 17751
11394A7751L049K51j4237Q99k090m223o914o097m303R682K400m860j7983J3179
$$ 17751 20800 21051 6814 7713 5623 1400 -5514 -11611 -15914 -6232 -3832 -8692 -26675 -13496
11380a3496K0282J0831j509M744j555l4651p135R821L903M893J782k229l102J045
$$ -13496 6786 17617 16108 20852 19297 -15354 -22489 -12668 -8765 -3872 -2090 -4319 -7421 -6376
11366f376O316J368Q24n918J3988n947R88O779L486j1790K501m63Q832N053o817
$$ -6376 -60 1308 2132 -3786 10202 4255 5243 12022 15508 3718 6219 5756 14588 19641 12824
11351A2824o825N556j124l448j3977r5k693j1985j1192N645J7078J3010M893m583
$$ 12824 5999 11555 10431 6983 -6994 -7089 -9782 -21767 -32959 -27314 -10236 2774 7667 3084
11337C084j0735K129j0200O748L748j5094Q25J3875O94l402p119m475n45J8772
$$ 3084 -7651 -5522 -15722 -8974 -5226 -20320 -19495 -5620 -4926 -8328 -15447 -19922 -20467 -1695
11323a695J2491j4548k743q344K596Q21O268q176J4140J3941o865j1389k0314
$$ -1695 10796 -3752 -6495 -14839 -12243 -11422 -5154 -13330 810 14751 7886 -3503 -23817
11310b3817n037J7467Q189m231K253J3335J3690k8864k7039L729Q491L520J9692
$$ -23817 -28854 -11387 -3198 -7429 -5176 8159 21849 -7015 -34054 -30325 -21834 -18314 1378
11297A378O947j5510j3927n338m307J7194J7494J453k811l104j802o231K69J4550
$$ 1378 8325 -7185 -21112 -26450 -30757 -13563 3931 5384 2573 -531 -2333 -8564 -8295 6255
11283F255n809r856r590l350o107J1365J6745K521j820P980M308Q628j2157j1234
$$ 6255 446 -9410 -19000 -22350 -28457 -17092 -347 2174 354 8334 12642 21270 9113 -2121
11269b121Q411J466m926P09m310R400n094j0511J1136R143r74N459N486Q327m623
$$ -2121 6290 7756 2830 3539 -771 8629 3535 -6976 4160 13303 12329 17788 23274 31601 26978
11254B6978j0539r903p194n429M45M324m375n1M363O100P471M340L898n039J287
$$ 26978 16439 6536 -658 -6087 -5642 -1318 -5693 -5744 -1381 4719 12190 16530 20428 15389 16676
11239A6676N279l409o624r368k876J2430m321l546j5316m460N121k097J4032j1873
$$ 16676 21955 18546 11922 2554 -322 12108 7787 4241 -11075 -15535 -10414 -12511 1521 -10352
11225a0352N865K706q21J2186l821R599M393p170j9663k3120n31K4842K310j1146
$$ -10352 -4487 -1781 -2602 9584 5763 15362 19755 12585 -7078 -30198 -30729 -5887 -3577 -14723
11211a4723k97J2894l242k335P469J7242k36J0737J2836j3171j2419R42m336J917
$$ -14723 -15020 -2126 -5368 -7703 -234 17008 16772 27509 40345 27174 14755 15697 11361 13278
11197A3278N339N897l881m471O687j6722p430j7000L931J8440q413m449Q728M87
$$ 13278 18617 24514 20633 16162 22849 6127 -1303 -18303 -14372 4068 -4345 -8794 -66 421
11183D21Q766L134j0308j5248j3947P344J1967l703J885M774R561P477J877n060
$$ 421 9187 12321 2013 -13235 -27182 -19838 -7871 -11574 -9689 -4915 4646 12123 14000 8940
11169H940l419q706J8355J7283j0815j7594m036N540j081Q821J0366J462l399
$$ 8940 5521 -3185 15170 32453 21638 4044 8 5548 4467 13288 23654 25116 21717
11156B1717n343l627J3811K246j4263q725j7273j227k156j4748K955N453N367
$$ 21717 16374 12747 26558 28804 14541 5816 -11457 -12684 -14840 -29588 -26633 -21180 -15813
11143a5813O129J0355R3M567k799L851l652j2048j1103k790J6991J5089K84N831
$$ -15813 -9684 671 764 5331 2532 6383 2731 -9317 -20420 -23210 -6219 8870 9154 14985
11129A4985l898j3395L063m174j5234m532K039M502J1368J333J1477m750J179
$$ 14985 11087 -2308 755 -3419 -18653 -23185 -21146 -16644 -5276 -3943 7534 2784 3963
11116C963o255p239N871J7305j5427j4422m679J7007J9512O483R302m805j7607
$$ 3963 -2292 -9531 -3660 13645 -1782 -16204 -20883 -3876 15636 22119 31421 26616 9009
11103I009q718N297N028j1332q407m44K890P006J0794o145J929O320p89L964j1093
$$ 9009 291 5588 10616 -716 -9123 -9567 -6677 329 11123 4978 6907 13227 12438 16402 5309
11088E309j915j6614J75Q326l4N568l563o341p448K601J8451Q383k2445j4960
$$ 5309 3394 -13220 -13045 -4719 -4753 815 -2748 -9089 -16537 -13936 4515 12898 -9547 -24507
11074b4507L158J7953p560m055l430Q716K7694J3314j4952r588k926p167j3772
$$ -24507 -21349 -3396 -10956 -15011 -18441 -9725 17969 31283 16331 6743 3817 -3350 -17122
11061a7122o83P947J941l398J161L558O15J4459L543k513k517o235k742O176K785
$$ -17122 -17805 -9858 -7917 -11315 -10154 -6596 -5981 8478 12021 9508 6991 756 -1986 4190 6975
11046F975K267Q16l903N242P580M648k2050J899k437l727n42J0501l551p557l051
$$ 6975 9242 10058 6155 11397 18977 23625 1575 3474 1037 -2690 -3232 7269 3718 -3839 -6890
11031f890m199L444k642N576j1697R136P471J0751J5932K473p049j7326q717j930
$$ -6890 -11089 -7645 -10287 -4711 -16408 -7272 199 10950 26882 29355 22306 4980 -3737 -5667
11017e667Q158R449R943q021j27r23j3339l036J0898L969K2165J99q934M550l422
$$ -5667 2491 11940 21883 13862 13735 12812 -527 -3563 7335 11304 33469 33668 24734 29284 25862
11002B5862N902k4783j4037J16N28O974l981M57J0942R687O332j3341j1832j1940
$$ 25862 31764 6981 -7056 -6940 -6412 562 -3419 -2962 7980 17667 23999 10658 -1174 -13114
10988a3114j943L005q893l572J6785J4709M562m109K797l357j3993l651j305k593
$$ -13114 -15057 -12052 -20945 -24517 -7732 6977 11539 7430 10227 6870 -7123 -10774 -12079 -14672
10974a4672j786J9651P940O647L64j0976j9701o340j713n933P674J3891M809o617
$$ -14672 -16458 3193 11133 17780 18144 7168 -12533 -18873 -20586 -26519 -18845 -4954 -145 -6762
10960f762O198J6424P204J123q17j5539R75P934l108l6395p963O209q0Q935N658
$$ -6762 -564 15860 23064 24187 23370 7831 8806 16740 13632 -22763 -30726 -24517 -24597 -15662 -10004
10945a0004J1458O871n836l833j535O570m5l504k321R754n063L477j485j6249
$$ -10004 1454 8325 2489 -1344 -2879 3691 3646 142 -2179 7575 2512 5989 4504 -11745
10931a1745l917J7675k609R317O960o905k809m386j2943L379J3699L161O164o856
$$ -11745 -15662 2013 -596 8721 15681 8776 5967 1581 -11362 -7983 5716 8877 15041 8185
10917H185j0759O859K494q7j8811J0755M836m52M738p733l653O935q533l456J0807
$$ 8185 -2574 4285 6779 6692 -12119 -1364 3472 3020 7758 25 -3628 3307 -5226 -8682 2125
10902B125N784l928j712j4849M18J2704j6134o341J4615k299Q69q545M938J4042
$$ 2125 7909 3981 2269 -12580 -12162 542 -15592 -21933 -7318 -9617 -8748 -17293 -12355 1687
10888A687k902m077J567j921r832L628O400j1738L146J4756K69m396O816O74k3040
$$ 1687 -1215 -5292 -3725 -5646 -15478 -11850 -5450 -17188 -14042 714 983 -3413 3403 4077 -18963
10873a8963j0925R957J5903J707j4405o939J2505R928J477Q878J630L315j6429
$$ -18963 -29888 -19931 -4028 -2321 -16726 -23665 -11160 -1232 245 9123 10753 14068 -2361
10860b361l206K173l967J3022M41K648r172j2784J145K510M131J005K065R475
$$ -2361 -5567 -3394 -7361 5661 6102 8750 -422 -13206 -12061 -9551 -5420 -4415 -2350 7125
10846G125R183J0625J2713q264j0498r540j2334o160J3952l466j7401j0933J5564
$$ 7125 16308 26933 39646 31382 20884 11344 -990 -7150 6802 3336 -14065 -24998 -9434
10833i434J7511M800q350j1589m199k881N016L896K1258J922j2168j2860J932
$$ -9434 8077 12877 4527 -7062 -11261 -14142 -9126 -5230 16028 17950 5782 -7078 -5146
10820e146l440k3044n489J6492J5070M85m378m57K2561M11j5709o14n000j0233
$$ -5146 -8586 -31630 -37119 -20627 -5557 -5072 -9450 -9907 12654 13065 -2644 -3258 -8258 -18491
10806a8491J755K785J2598J918k2462N933M431J067l39K400n490J3177J742R476
$$ -18491 -16736 -13951 -1353 565 -21897 -15964 -11533 -10466 -10805 -8405 -13895 -718 1024 10500
10792A0500R87j813l544n251L964M050k645J0755L379l750j7169O269R162q992
$$ 10500 11487 9674 6130 879 4843 8893 6248 17003 20382 16632 -537 5732 14894 5902
10778E902P94P387j1620n846k954j399N015N133p490N675n067M843J6694j1359
$$ 5902 6696 14083 2463 -3383 -6337 -7736 -2721 2412 -5078 597 -4470 373 17067 5708
10764E708L813q768r668M22n66R303r114j743j976P823j213J3539J2454k3743
$$ 5708 9521 753 -8915 -8493 -9059 244 -8870 -10613 -12589 -4766 -5979 7560 20014 -3729
10750c729l274J0750k736j2681j2017J3233L547j4693R51Q033j3993q913J6942
$$ -3729 -7003 3747 1011 -11670 -23687 -10454 -6907 -21600 -20649 -12616 -26609 -35522 -18580
10737a8580J4007M921J35p957j8265o473J7657R555r293r869M383K846P879M641
$$ -18580 -4573 348 483 -7474 -25739 -32212 -14555 -5000 -14293 -24162 -19779 -16933 -9054 -4413
10723d413r83J080P636J230J1879J2641k537O616K114p429r189j0444q50o831
$$ -4413 -5396 -4316 3320 4550 16429 29070 26533 33149 35263 27834 18645 8201 7351 520
10709E20J1964J0174q904j1061j1574p260M231J5071J297o514l961q882J082M428
$$ 520 12484 22658 13754 2693 -8881 -16141 -11910 3161 4458 -2056 -6017 -14899 -13817 -9389
10695i389L722n720k376J0245P460j3698P90k48p331p13K410k913P261r88j2712
$$ -9389 -5667 -11387 -13763 -3518 3942 -9756 -8966 -9214 -16545 -17258 -14848 -17761 -10500 -11488 -24200
10680b4200k984K0148J0578l112R451P545j4140j0135q043k288N849R142q481
$$ -24200 -27184 -7036 3542 430 9881 17426 3286 -6849 -14892 -17180 -11331 -2189 -10670
10667a0670K693j5475P081N858j4197Q776L880l278O136o431q795J8612J2781
$$ -10670 -7977 -23452 -16371 -10513 -24710 -15934 -12054 -15332 -9196 -15627 -24422 -5810 6971
10654F971Q506j9184j1624J588j5527O503J5408O040j1109L03p091j3894K0952
$$ 6971 15477 -3707 -15331 -13743 -29270 -22767 -7359 -1319 -12428 -12125 -19216 -33110 -12158
10641a2158K0969L280j1897K184J7091q138k77p767l79Q058K376m109o531N525
$$ -12158 8811 12091 194 2378 19469 11331 11054 3287 2908 10966 13342 9233 2702 8227
10627H227J6120L648m590j5421J0096J39p180L054p100J677J3121q043r090k283
$$ 8227 24347 27995 23405 7984 18080 18219 11039 14093 6993 8670 21791 13748 4658 2375
10613B375J554j3906P001P181L354j0168n324J2568j105p235M34R95J5733j503
$$ 2375 3929 -9977 -2976 4205 7559 -2609 -7933 4635 3530 -3705 -3271 -2276 13457 11954
10599A1954k835p47m649l376l666j554l96j7542k7370N803Q13J124K1869Q570
$$ 11954 9119 8372 3723 347 -3319 -4873 -5269 -22811 -50181 -44378 -43565 -42441 -20572 -12002
10585a2002O741l266p916N834Q897m340L208J4326j6813k617K705o387j2987q253
$$ -12002 -5261 -8527 -16443 -10609 -1712 -6052 -2844 11482 -5331 -7948 -5243 -11630 -24617 -32870
10571c2870P852M201J0173J39M816P247J0216r559p788q76J320J621O244L388
$$ -32870 -25018 -20817 -10644 -10505 -5689 1558 11774 2215 -5573 -6449 -5129 -3508 2736 6124
10557F124O961N695j0423m802j80L350J4524r435l891J370m479j7785M44N626
$$ 6124 13085 18780 8357 3555 3375 6725 21249 11814 7923 9293 4814 -12971 -12527 -6901
10543f901l858n448n91M178l20J4243K00j348N647P434N826O560N50j0471m142
$$ -6901 -10759 -16207 -16798 -12620 -12940 1303 1503 155 5802 13236 19062 25622 26172 15701 11559
10528A1559j537k733l662J272Q76L611N914q834n228P322P40p995j2674J046O767
$$ 11559 10022 7289 3627 4899 5775 9386 15300 6466 1238 8560 9300 1305 -11369 -10323 -3556
10513c556O047l195R002J3006j762k2252j724O886K375m182K392J405O080J8700
$$ -3556 2491 -704 8298 21304 19542 -2710 -4434 2452 4827 645 3037 4442 10522 29222
10499B9222K919M596J3136j3453k0535o975J1340J3537J837j6142m115o064r166
$$ 29222 32141 36737 49873 36420 15885 8910 20250 33787 35624 19482 15367 9303 137
10486A37q767R298k912K825j216m672N461p823j761L889l521R873n87j7108O51
$$ 137 -8630 668 -2244 581 -635 -5307 154 -7669 -9430 -5541 -9062 811 224 -16884 -16233
10471a6233M373J4609J7718J6148p419j6562p433m389l077m077M414K795P29J9999
$$ -16233 -11860 2749 20467 36615 29196 12634 5201 812 -2265 -6342 -1928 867 1596 21595
10457B1595l07j1111p293m995n26R067o367O929J115n993K150J564k508q963p447
$$ 21595 21288 10177 2884 -2111 -2637 6430 63 6992 8107 2114 4264 5828 3320 -5643 -13090
10442a3090M215J3124k652O00m963q712n308L769J0001J0075p01o896J918R049
$$ -13090 -8875 4249 1597 2197 -2766 -11478 -16786 -13017 -3016 7059 6358 -538 1380 10429
10428A0429j5893Q517K0812m63j0953q447r39r165k538R952j10O513l360j1644
$$ 10429 -5464 3053 23865 23402 12449 4002 3063 -6102 -8640 1312 1202 7715 4355 -7289
10414g289L091n99R715j1172l818J1681l948J3852J743K827R240J194j0886k7546
$$ -7289 -4198 -4797 4918 -6254 -10072 1609 -2339 11513 13256 16083 25323 26517 15631 -11915
10400a1915J652L486J38M882Q016R853M692j990j3712j2218l343l223J5597P735
$$ -11915 -10263 -6777 -6639 -1757 6259 16112 20804 18814 5102 -7116 -10459 -13682 1915 9650
10386I650R63o258j649N637Q383J1473M934K921o159j2962N702o152L161J4133
$$ 9650 10613 4355 2706 8343 16726 28199 33133 36054 29895 16933 22635 16483 19644 33777
10372C3777r843j758j0474j5188O128N954j986L499J3475n153n104q319n607m643
$$ 33777 23934 22176 11702 -3486 2642 8596 6610 10109 23584 18431 13327 5008 -599 -5242
10358e242K616P163r037j1429O857J2395P077j5356j5055k137J1776J5642j1524
$$ -5242 -2626 4537 -4500 -15929 -9072 3323 10400 -4956 -20011 -22148 -10372 5270 -6254
10345f254j067l922L568r284j1702J2747J6753M90q200K184P271R435P735j3087
$$ -6254 -7321 -11243 -7675 -16959 -28661 -15914 839 1329 -6871 -4687 2584 12019 19754 6667
10331F667q471l088J4714Q084N747j529L394R850k830q885O975n469n640J1238
$$ 6667 -1804 -4892 9822 17906 23653 22124 25518 35368 32538 23653 30628 25159 19519 30757
10317C0757M81j4098Q439K1350K0864M5459K3435j7284k2505j5824J6007P702
$$ 30757 31238 17140 25579 46929 67793 113252 136687 119403 96898 81074 97081 104783
10305A04783q83o375l2954l8799o502p175n6k390P77N546N049J0176j973j070
$$ 104783 103900 97525 64571 25772 19270 12095 12039 9649 10426 15972 21021 31197 29224 28154
10291B8154j7993j0031J647J1927J4257m617J325j4194j3361R15R07k107O101
$$ 28154 10161 130 1777 13704 27961 23344 24669 10475 -2886 -1971 -1064 -3171 2930
10278B930J5343N458K983l888l767n735J846j57m094K685O119K177q577M356n022
$$ 2930 18273 23731 26714 22826 19059 13324 15170 15013 10919 13604 19723 21900 13323 17679 12657
10263A2657j668j2647K850J9290K8306J0162r657K1028K524k711O708J3931M98
$$ 12657 10989 -1658 1192 20482 48788 58950 49293 70321 72845 70134 76842 90773 91271
10250I1271M021N197M013L2042K5369J2434K9469K6261N1733N6854N1634N9454
$$ 91271 95292 100489 104502 136544 161913 174347 203816 230077 281810 338664 390298 449752
10238D49752P6252J12910J70355K63821L66252M77305N36164L93521o7946m29812
$$ 449752 526004 638914 809269 1073090 1439342 1916647 2452811 2846332 2778386 2348574
10228B348574l36668l1329K29037L21030R5608l96014o87172n80480l45645j67139
$$ 2348574 2011906 1980577 2209614 2530644 2626252 2230238 1543066 962586 616941 449802
10218D49802r4507n8276m5962l3239r162l7352k5429j0383k7061j6730j5304J2521
$$ 449802 355295 297019 251057 217818 208656 171304 145875 135492 108431 91701 76397 88918
10206H8918N46j8218j6875Q05k533q900j9732p142P009l560r935K589L980L139
$$ 88918 89464 71246 54371 55176 52643 43743 24011 16869 23878 20318 10383 12972 16952 20091
10192B0091K431J850q966m446J5234j1340r421J891J466N280R840N0l603J2534
$$ 20091 22522 24372 15406 10960 26194 14854 5433 7324 8790 14070 23910 23960 20357 32891
10178C2891J8359j850r84l868K510j730p760j2140J485k06J109O125r227j1978
$$ 32891 51250 49400 48416 44548 47058 45328 37568 25428 26913 26707 27816 33941 24714 12736
10164A2736l833L383p229J5953j3399r835l315M238R327O646j0955L314n374k348
$$ 12736 8903 12286 5057 21010 7611 -2224 -5539 -1301 8026 14672 3717 7031 1657 -691
10150f91k622n60j4493p322Q015J1927o022j471Q320K486N149N166n14j6753j1378
$$ -691 -3313 -3873 -18366 -25688 -17673 -5746 -11768 -13239 -4919 -2433 2716 7882 7368 -9385 -20763
10135b0763J3263J3441K826J1361j298j2210j214J1809K506n391m831K217J2862
$$ -20763 -7500 5941 8767 20128 18830 6620 5406 17215 19721 14330 9499 11716 24578
10122B4578j1448q114L708j1292j570Q913P972m36N632n178j3747j1077J147J0546
$$ 24578 13130 5016 8724 -2568 -4138 4775 12747 12311 17943 12765 -982 -12059 -10912 -366
10108c66Q067O775r804J0025L031L32n194N915l718N668M394O892j942j955k81
$$ -366 7701 14476 4672 14697 17728 18060 12866 18781 15063 20731 25125 32017 30075 28120 27839
10093B7839j3227k365Q766j0422L637j950K273j6529j539P126q011J7673j783
$$ 27839 14612 12247 21013 10591 14228 12278 14551 -1978 -3517 3609 -4402 13271 11488
10080A1488m292N073p418J4604o68j2158r44Q122q233L174l965j2077k192M922
$$ 11488 7196 12269 4851 19455 18787 6629 5685 13807 5574 8748 4783 -7294 -9486 -4564
10066d564J9561J0684j1316o274j0066k826r813R768J1758R205r809j563n774
$$ -4564 14997 25681 14365 8091 -1975 -4801 -14614 -4846 6912 16117 6308 4745 -1029
10053a029K824l805m495N921M564N111P065J959l350j2748O643L627l370J2477
$$ -1029 1795 -2010 -6505 -584 3980 9091 16156 18115 14765 2017 8660 12287 8917 21394
10039B1394r902j9941m693R498m007k179r71K25k863L191J958r669J0436K1817
$$ 21394 11492 -8449 -13142 -3644 -7651 -9830 -10801 -10576 -13439 -10248 -8290 -17959 -7523 14294
10025A4294j65Q988J0279R863q667j0485J0591n110k1422j0524K0135Q856j3693
$$ 14294 14129 23117 33396 43259 34592 24107 34698 29588 8166 -2358 17777 26633 12940
10012A2940k317q682l530J1444J8552Q504j9437j4155k35J3129l885j2980l725
$$ 12940 10623 1941 -1589 9855 28407 36911 17474 3319 3084 16213 12328 -652 -4377
9999d377m449J923l241J0402N24k086q503p84R73J3239K9561j8345o794M386J0060
$$ -4377 -8826 -6903 -10144 258 782 -1304 -9807 -10591 -9618 3621 33182 14837 8043 12429 22489
9984B2489L3j2962J533P927j901J281L826l808l838L64O410J232M31J9165N553
$$ 22489 22522 9560 11093 19020 17119 18400 22226 18418 14580 14944 21354 22586 23017 42182 47735
9969D7735j7162o568k594j6689m249J0095P346r904q523m872o937L381n033m811
$$ 47735 30573 24005 21411 4722 473 10568 17914 8010 -513 -5385 -12322 -8941 -13974 -18785
9955a8785r1O627M166R875N650r972k2428J1156J3499J0853Q575R565o404n924
$$ -18785 -18876 -12249 -8083 1792 7442 -2530 -24958 -13802 -303 10550 19125 28690 22286 16362
9941A6362J1665O926o69j4760j4424Q927J3147P878L27q240o216j4674K156j825
$$ 16362 28027 34953 34284 19524 5100 14027 27174 35052 35379 27139 20923 6249 8405 6580
9927F580k027j2418q039l917j625K272O583p349O90L960J3661J68P086M715J2083
$$ 6580 4553 -7865 -15904 -19821 -21446 -19174 -12591 -19940 -19250 -15290 -1629 -1461 5625 10340 22423
9912B2423L590k261P685N483j6872j2401J9635j433L979j454O29k2757m205Q96
$$ 22423 26013 23752 31437 36920 20048 7647 27282 25849 29828 28374 29003 6246 2041 2937
9898B937K1710J5005j0735o32J659J8311q26j0036M887O550J0670L732P728K1385
$$ 2937 24647 39652 28917 28285 29944 48255 47429 37393 42280 48830 59500 63232 70960 92345
9884I2345K5624L3717L7317M0187L6114M2880P5450J19487J87014K68053L78205
$$ 92345 117969 151686 189003 229190 265304 308184 383634 503121 690135 958188 1336393
9873A336393M57957L38035j14799n47499n89090l67631k03436j01035m6427k7352
$$ 1336393 1794350 2132385 2017586 1470087 880997 513366 309930 208895 162468 135116
9863A35116k4859j6256p665j3771j7193o670J015k062o767r374K930j6058n204
$$ 135116 110257 94001 86336 72565 55372 48702 49717 47655 40888 31514 34444 18386 13182
9850A3182Q341R306l389p707j263O184L614k000J133q035j2283J0416m628k690
$$ 13182 21523 30829 27440 19733 18470 24654 28268 26268 27401 19366 7083 17499 12871 10181
9836A0181r64J337O914k467P865L745m156P817J2478p840k498j5619Q04N500L933
$$ 10181 9217 10554 17468 15001 22866 26611 22455 30272 42750 34910 32412 16793 17597 23097 27030
9821B7030J3227j131P93J0862J278j3825k8329O00J5069m610j1590j7605O282
$$ 27030 40257 39126 39919 50781 52059 38234 9905 10505 25574 20964 9374 -8231 -1949
9808a949K827J0573n438O292N337J365m109n560J16j0661L996J2409K168j977
$$ -1949 878 11451 6013 12305 17642 19007 14898 9338 9454 -1207 2789 15198 17366 15389
9794A5389K666k285J0060r430j1400N91l975K639J1244l826K919K582j0139k709
$$ 15389 18055 15770 25830 16400 5000 5591 1616 4255 15499 11673 14592 17174 7035 4326
9780D326m288j361K681l559J015J644k645K683J7319j881p514O63o147r022O581
$$ 4326 38 -1323 1358 -2201 -1186 458 -2187 496 17815 15934 8420 9083 2936 -6086 495
9765D95O793O4O417N022N979m88J2836j840K956J0716L412j9284j7272J2826k337
$$ 495 7288 7352 13769 18791 24770 24282 37118 35278 38234 48950 52362 33078 15806 28632 26295
9750B6295k0423l093L137J1172j0569Rm608j3347L559K06p458J2167J6978K123
$$ 26295 5872 2779 5916 17088 6519 6528 1920 -11427 -7868 -7662 -15120 -2953 14025 16148
9736A6148l407k1223K451L0979Q133o729r340L929O38j7334k218M99m131J412
$$ 16148 12741 -8482 -6031 24948 33081 26352 17012 20941 21579 4245 2027 2526 -1605 -193
9722a93M918j810p134n983J3196J4199l47j3383n575J2411l792m886J0276j0710
$$ -193 4725 2915 -4219 -10202 2994 17193 16846 3463 -2112 10299 6507 1621 11897 1187
9708A187k5393n420J3612K4392R90k157j190n002k677r603k677Q012R835J5848
$$ 1187 -24206 -29626 -16014 8378 9368 7211 6021 1019 -1658 -11261 -13938 -5926 3909 19757
9694A9757j0377J892rJ0521o182j6963L93P939k815K692j972q949j7703Q092J7747
$$ 19757 9380 11272 11263 21784 15602 -1361 -968 6971 4156 6848 4876 -4073 -21776 -13684 4063
9679D063K185M970Q960M438o1k687J585j0928n574L311j6490m962k944R506Q985
$$ 4063 6248 11218 20178 24616 24555 21868 23453 12525 6951 10262 -6228 -11190 -14134 -4628 4357
9664D357k521m663j3893L000J3778k037j1459P427J4340r773m930m20n690N314
$$ 4357 1836 -2827 -16720 -13720 58 -1979 -13438 -6011 8329 -1444 -6374 -6794 -12484 -7170
9650g170P83k076N869J783P964J4734l843j3198J1854K002o71n457o885J5594
$$ -7170 -6387 -8463 -2594 -811 7153 21887 18044 4846 16700 18702 18031 12574 5689 21283
9636B1283O04q487o46J5780P118M849R309k3689j8417O826O567J1188R894J617
$$ 21283 21887 13400 12754 28534 35652 40501 49810 26121 7704 14530 21097 32285 42179 43796
9622D3796R077k57p220r228j854j504p665K808q84J447p57K1922J2025j7546m213
$$ 43796 52873 52616 45396 36168 34314 32810 25145 27953 27069 28516 27759 49681 61706 44160 39947
9607C9947p886m60J7143M062l844q304j1072j0545N715K981J020r27L18j477j728
$$ 39947 32061 31601 48744 52806 48962 40658 29586 19041 24756 27737 28757 27830 28148 26671 24943
9592B4943k2923r145Q354r706O973K3657J4712N975L635j7132j6990j870J7296
$$ 24943 2020 -7125 1229 -8477 -1504 22153 36865 42840 46475 29343 12353 10483 27779
9579B7779K2434J4663m403k0295j0021M24J4767K284j273J5637O206k777n686
$$ 27779 50213 64876 60473 40178 30157 30581 45348 47632 46359 61996 68202 65425 59739
9566E9739l754J558J4621K1089m80l596K453j6541j8032o942q702l789o160j0934
$$ 59739 55985 57543 72164 93253 92773 89177 91630 75089 57057 50115 41413 37624 31464 20530
9552B0530P966K3948K171l133P838N360J624J226R91j7511j8312K253J780L151
$$ 20530 28496 52444 54615 51482 59320 64680 66304 67530 68521 51010 32698 34951 36731 39882
9538C9882R067O626n840j0093j317K129k0800k880j813j5895l52J7610Q499K406
$$ 39882 48949 55575 49735 39642 38325 40454 19654 16774 14961 -934 -1286 16324 24823 27229
9524B7229P829l222O17J1603n402q047l0386r594K3712P869l747N456j0248j4924
$$ 27229 35058 31836 32453 44056 38654 30607 221 -9373 14339 22208 18461 23917 13669 -1255
9510a255N389M006J1274P255j8475k957l440n893J4439J8693j0911p094J808L133
$$ -1255 4134 8140 19414 26669 8194 5237 1797 -4096 10343 29036 18125 11031 12839 15972
9496A5972k366O326M209r578m35M646Q737r896o997M258n339R10k128o89J4380
$$ 15972 13606 19932 24141 14563 14128 18774 27511 17615 10618 14876 9537 10447 8319 7630 22010
9481B2010J5614L749k343K375r226j1537M411J6540O762o140j1714j6176J742
$$ 22010 37624 41373 39030 41405 32179 20642 25053 41593 48355 42215 30501 14325 16067
9468A6067r572K193N921J762L710Q264O661J2469N665k1951j3637j4985M7J099
$$ 16067 6495 8688 14609 16371 20081 28345 35006 47475 53140 31189 17552 2567 2614 3713
9454C713J2517R597N20k523O002l267M150j11J128O263m794p764J50O233J522
$$ 3713 16230 25827 26347 23824 29826 26559 30709 30598 31726 37989 33195 25431 25581 31814 33336
9439C3336o374j1727m245L366j148r89M406Q663j244O84k8271P852J985j0543
$$ 33336 26962 15235 10990 14356 13208 12219 16625 25288 24044 24728 -3543 4309 6294 -4249
9425d249l296q50j0053J2304K2192J3277P378l339n594O667k0j5670j03m688J177
$$ -4249 -7545 -8395 -18448 -6144 16048 29325 36703 33364 27770 34437 34417 18747 18644 13956 15133
9410A5133k723n737J1493Q406J7644K849Q446r366l080P88r23P561P082k1706
$$ 15133 12410 6673 18166 26572 44216 47065 55511 46145 43065 43853 42930 50491 57573 35867
9396C5867r670O362p543o839N504j5529o220l371O341M656q382Q884o006k055
$$ 35867 26197 32559 25016 18177 23681 8152 1932 -1439 4902 9558 1176 10060 4054 1999
9382A999J0947l296k944m958J4067J7419K999K047L274j414m422m550o86L985
$$ 1999 12946 9650 6706 1748 15815 33234 36233 38280 41554 40140 35718 31168 30482 34467
9368C4467j0448o034p7Q521J83o915O549N363M601l318k63n45R273K506L029p291
$$ 34467 24019 17985 17908 26429 26612 19697 26246 31609 36210 32892 32629 32084 41357 43863 46892 39601
9352C9601n610q689M650J613O23K535Q302p999p541n049l722j1867L191M497N479
$$ 39601 33991 25302 29952 31565 32188 34723 43025 35026 27485 22436 18714 6847 10038 14535 20014
9337B0014O049K896l073M280j799K075k268o851r817o944K0180J6747q150j930
$$ 20014 26063 28959 25886 30166 28367 30442 28174 21323 11506 4562 24742 41489 33339 31409
9323C1409P661j7250p333n117Q37N89L361J5163J0092R972m161l882j3238M656
$$ 31409 39070 21820 14487 9370 10207 10796 14157 29320 39412 49384 45223 41341 28103 32759
9309C2759N451r720K08n490m545O516N234J3826Q335L494n300o484q093n927P451
$$ 32759 38210 28490 28698 23208 18663 25179 30413 44239 52574 56068 50768 44284 36191 30264 37715
9294C7715J5536J7318p675k5058k0890J43j444J1796K1487K970r054j2058k1238
$$ 37715 53251 70569 62894 37836 16946 17089 15645 27441 48928 51898 42844 30786 9548
9281I548m824M651J8298Q58p610Q067K702q840l860j871l464J1631J672L511M26
$$ 9548 4724 9375 27673 28531 20921 28988 31690 22850 18990 17119 13655 25286 26958 30469 30895
9266C0895J707j7150k911j589Q090L576K204J5782J1511q821q148r124j3551L974
$$ 30895 32602 15452 12541 10952 19042 22618 24822 40604 52115 43294 35146 26022 12471 16445
9252A6445P301R069N800k403j7787J0844r9N989J7872O204j0182K28R311o003
$$ 16445 23746 32815 38615 36212 18425 29269 29170 35159 53031 59235 49053 49281 58592 52589
9238E2589j0071m554j1610J4827K3383J2402o909r48J0280k4322j3089P941J0921
$$ 52589 42518 37964 26354 41181 64564 76966 70057 69109 79389 55067 41978 49919 60840
9225F0840p661j6068J321N976j2474J1181K9710P539j6662l4852p326O546R97
$$ 60840 53179 37111 38432 44408 31934 43115 72825 80364 63702 28850 21524 28070 29067
9212B9067O508o982j4297L645N809N495N902J872k790P575J3028o932k1227m22
$$ 29067 35575 28593 14296 17941 23750 29245 35147 37019 34229 41804 54832 47900 26673 26251
9198B6251P885J916Q723k112j0282p760Q121l144R723R178m525m902l317Q30o63
$$ 26251 34136 36052 44775 42663 32381 24621 32742 29598 39321 48499 43974 39072 35755 36585 35922
9183C5922N472Q518j0105m835k108J0448j1208j0748P038P435m670N803P476L557
$$ 35922 41394 49912 39807 34972 32864 43312 32104 21356 28394 35829 31159 36962 44438 47995
9169D7995K004n998n186r88J794q568l527M246K098q418L407P156J2200J2345
$$ 47995 49999 44001 38815 37827 39621 31053 27526 31772 33870 25452 28859 36015 48215 60560
9155F0560m816n097m462n625J0176m879j2558l927O880M736P953J32K168n406
$$ 60560 55744 50647 46185 40560 50736 45857 33299 29372 36252 40988 48941 49073 51241 45835
9141D5835q659M977j0920O268L729l068K318J9778L647j1372p387R241J4458Q400
$$ 45835 37176 42153 31233 37501 41230 38162 40480 60258 63905 52533 45146 54387 68845 77245
9127G7245j2505o135M169O085J0256J4996M399O73j5708k21L387q615j6473p593
$$ 77245 64740 58605 62774 68859 79115 94111 98510 99183 83475 83254 86641 78026 61553 53960
9113E3960N146J6479r42r166o951P478m705O424K2158O371k4307l281K185j1138
$$ 53960 59106 75585 74643 65477 58526 66004 61299 67723 89881 96252 71945 68664 70849 59711
9099E9711m351R425J0893M123o604o29P930Q393L958m570j0004K296O445J5478
$$ 59711 55360 64785 75678 79801 73197 72568 80498 88891 92849 88279 78275 80571 87016 102494
9085A02494J1466J3092M503P516J117K580o806M668O331J8377J8052J2822J77
$$ 102494 113960 127052 131555 139071 140188 142768 135962 140630 146961 165338 183390 196212 196389
9072A96389M256J9711L451K5495N6071O0100N3434O3351R2493J14144J32117J68561
$$ 196389 200645 220356 223807 249302 305373 365473 418907 482258 574751 688895 821012 989573
9060I89573J76875K07891K41491L05358M29313O12407R16443J402123J935948
$$ 989573 1166448 1374339 1615830 1921188 2350501 2962908 3879351 5281474 7217422
9051G217422K357795K474867L51533l149220l400700k094173j191513p08514m56822
$$ 7217422 9575217 12050084 12401617 9252397 5851697 3757524 2566011 1857497 1400675
9042A400675l09700k07184j45282j15457q2823p5954o2758n0213n3737l2625j1650
$$ 1400675 1090975 883791 738509 623052 540229 464275 401517 351304 297567 264942 253292
9031B53292k9978j0970K676j9545q141j2396j5545j9961k6791J759j838p880m382
$$ 253292 223314 212344 215020 195475 187334 174938 159393 139432 112641 114400 112562 104682 100300
9018A00300N731K701n724m771r826p846p397n638p278K5314K5632k525j600j7207
$$ 100300 106031 108732 103008 98237 88411 80565 73168 67530 60252 85566 111198 108673 107073 89866
9004H9866n616l129p829K168L609k680j3038r34L6L339M619J068j2621k441J4246
$$ 89866 84250 81121 73292 75460 79069 76389 63351 62417 62453 65792 70411 71479 58858 56417 70663
8989G0663J4648k857l7852k2911J2056Q825l194M487m106J481M916O863J4659
$$ 70663 85311 82454 44602 21691 33747 42572 39378 43865 39759 41240 46156 53019 67678
8976F7678O83k5017k1694J0840N616J4037J3982j809j4151P86n002j3809O06N446
$$ 67678 68361 43344 21650 32490 38106 52143 66125 64316 50165 50951 45949 32140 32746 38192
8962C8192j055L316l062O661J4998K944j3403j7151p409p92L32M290J8019J9861
$$ 38192 37137 40453 37391 44052 59050 61994 48591 31440 24031 23239 23571 27861 45880 65741
8948F5741p121j2858L842j1094k3850K3953J9531q753m98L57m999J3915K1451
$$ 65741 58620 45762 49604 38510 14660 38613 58144 49391 48893 49250 44251 58166 79617
8935G9617L259J300j6206r125j879j0083q425j533k329m067p623P789o474o107
$$ 79617 82876 84176 67970 58845 56966 46883 38458 36925 34596 30529 22906 30695 24221 18114
8921A8114L882O731N772M695O974n699l126J5896R540j6601O771J6948m983J2195
$$ 18114 21996 28727 34499 39194 46168 40469 37343 53239 62779 46178 52949 69897 64914 77109
8907G7109K2124K7283K9056K6902q06k8769m2921l4338r40n218j7150j8844r588
$$ 77109 99233 126516 155572 182474 181668 152899 109978 75640 74700 69482 52332 33488 23900
8894B3900j3246P996J0388p52N457j2015M202J5426p247j1385J057l206r766k019
$$ 23900 10654 18650 29038 28286 33743 21728 25930 41356 34109 22724 23781 20575 10809 8790
8880H790J7592J6128j2866k0977j7285k922J675J1255J2958J3744m991J130L234
$$ 8790 26382 42510 29644 8667 -8618 -11540 -9865 1390 14348 28092 23101 24231 27465
8867B7465q492q858J210L034j7707J139J1961K0347L093j65M872Q771k797Q939
$$ 27465 18973 10115 11325 14359 -3348 -2209 9752 30099 33192 33027 37899 46670 43873 52812
8853E2812R032j9863l0735j3523O98M482l735l489L478k110L786O54k758o371
$$ 52812 61844 41981 11246 -2277 -1579 2903 -832 -4321 -843 -2953 833 1487 -1271 -7642
8839g642J5027Q144J850o579l207M847L786j1761o061Q455Q882l793k1136n394
$$ -7642 7385 15529 17379 10800 7593 12440 16226 4465 -1596 6859 15741 11948 -9188 -14582
8825a4582N369O371Q974J6027J0637n856R06o478p780K225n032L633M687O622
$$ -14582 -9213 -2842 6132 22159 32796 26940 27846 21368 13588 15813 10781 14414 19101 25723
8811B5723J335J375r331k380J0456n98j0912j4395K095O461k644J0171p05J0547
$$ 25723 27058 28433 19102 16722 27178 26580 15668 1273 3368 9829 7185 17356 16651 27198
8797B7198J1287l893L641p800o329J2928k758r467J917Q507p247J421N600P95
$$ 27198 38485 34592 38233 30433 24104 37032 34274 24807 26724 35231 27984 29405 35005 35800
8783C5800J0235J3117q688n016p678n050r870L740L320K147J1789j6976j3396
$$ 35800 46035 59152 50464 45448 37770 32720 22850 26590 29910 32057 43846 26870 13474
8770A3474j959O969j0958J2141J9117r52m286o625j5301O366N769p429L516J332
$$ 13474 11515 18484 7526 19667 38784 37832 33546 26921 11620 17986 23755 16326 19842 21174
8756B1174l790n778J597n124J367L365N410M497j2994N620k0543k8M942J3152
$$ 21174 17384 11606 13203 8079 9446 12811 18221 22718 9724 15344 -5199 -5227 -285 12867
8742A2867J431P661j4k2211j922K0242k991q842K191J9630J1078k674j3701j0751
$$ 12867 14298 21959 21945 -266 -2188 18054 15063 6221 8412 28042 39120 36446 22745 11994
8728A1994l110J1969J8341O163R577K964L852j2765O518N102K210J2521r364q239
$$ 11994 8884 20853 39194 45357 54934 57898 61750 48985 55503 60605 62815 75336 65972 57733
8714E7733L254n547j1281j2021N209q189l238M221l405J676J5113J4086r484n931
$$ 57733 60987 55440 44159 32138 37347 29158 25920 30141 26736 28412 43525 57611 48127 42196
8700D2196k17L049j797q180L2N520P431K49n116k318Q181P628L774J613J7873
$$ 42196 41979 45028 43231 35051 35083 40603 48034 48283 43167 40849 49030 56658 60432 62045 79918
8685G9918j312j454O333P424J4931J2350J6104J1994L6379N1156O5047R5028J21489
$$ 79918 78606 77152 83485 90909 105840 118190 134294 146288 182667 233823 298870 393898 515387
8672E15387R1007r0534j73934j16604o5300l7516j8508j4843k66j3277r356J0415
$$ 515387 606394 515860 341926 225322 160022 122506 103998 89155 88889 75612 66256 76671
8660G6671J546q576k161O289Q145J885J3417K081L362O308P098P680J8844K4490
$$ 76671 78217 69641 67480 73769 81914 83799 97216 99297 102659 108967 116065 123745 142589 167079
8646A67079K9767j6258k8618j0508Q8O596J7794L1983L4731L7840L5793L0172
$$ 167079 196846 180588 151970 141462 141550 148146 165940 197923 232654 270494 306287 336459
8634C36459K8458N2118N6905R0439J40654K04404K49455K67615l3815l32677k80701
$$ 336459 364917 417035 473940 564379 705033 909437 1158892 1426507 1392692 1060015 779314
8623G79314j56529r1443o4010o5965o8631n3004m7963k3953k1789j2137j4021
$$ 779314 622785 531342 467332 401367 332736 279732 231769 207816 186027 173890 159869
8612A59869j6865j0858l422j2133q033j3554J1541j1101N29K83M288J343M237
$$ 159869 143004 132146 128724 116591 108558 95004 106545 95444 95973 96256 100544 101887 106124
8599A06124O392K536j2148n099M768R413N778m426N06O807J1095N013R119K9267
$$ 106124 112516 115052 102904 97805 102573 111986 117764 113338 113844 120651 131746 136759 145878 175145
8585A75145P5831R4923J06085J20852J4556j60491j61973r2009l8050k4331q518
$$ 175145 250976 345899 451984 572836 587392 426901 264928 172919 134869 110538 102020
8574A02020K129j9607j1604j0806P3p376p71j986K172M11j1187o943J5060M12
$$ 102020 104149 84542 72938 62132 62205 54829 54058 52072 54244 54655 43468 36525 51585 51997
8560E1997j0064o121j3126J0409K1624p371j8885n297m814O247J0237K485n556
$$ 51997 41933 35812 22686 33095 54719 47348 28463 23166 18352 24599 34836 37321 31765
8547C1765j8711l601J3760Q036N383J2103O592q798j0572j7167J48J8142K756
$$ 31765 13054 9453 23213 31249 36632 48735 55327 46529 35957 18790 18938 37080 39836
8534C9836j7275p692J3872J5599J2729j0969m861P567K086K428r956j6042O539
$$ 39836 22561 14869 28741 44340 57069 46100 41239 48806 50892 53320 43364 27322 33861
8521C3861n23J2001l049k431m160r281o871o257Q673j288n45j1662N48J3837L399
$$ 33861 33338 45339 42290 39859 35699 26418 19547 13290 21963 20675 20130 8468 9016 22853 26252
8506B6252K951J079R393o240j5083J0417J846o28o634M192O200Q288n101j8263
$$ 26252 29203 30282 39675 33435 18352 28769 30615 29987 23353 27545 33745 42033 36932 18669
8492A8669m814J3785k198m372n773n023l87K4689k903J0432Q065j6845l339j0297
$$ 18669 13855 27640 25442 21070 15297 10274 9887 34576 31673 42105 50170 33325 29986 19689
8478A9689n735N931o188J936o104M846j1085p304j40p03Q370J7614K6445J196
$$ 19689 13954 19885 13697 15633 9529 14375 3290 -4014 -4154 -4857 3513 21127 47572 48768
8464D8768j0030O045j1777J816o520j359R465M386N028j0934j476k142j6766J416
$$ 48768 38738 44783 33006 34822 28302 26943 36408 40794 45822 34888 33412 31270 14504 15920
8450A5920L0927L973r260O84k0520n957K538O383P572R841m172j4633k434p73
$$ 15920 46847 50820 41560 42244 21724 15767 18305 24688 32260 42101 37929 23296 20862 20089
8436B0089q106P527J2783N388J1467o241j1382p134k784q530L402r39O219K500
$$ 20089 11983 19510 32293 37681 49148 42907 31525 24391 21607 13077 16479 15540 21759 24259
8422B4259m052l699o999P844n867l923j192K592P844k535j528R83j2312q150J185
$$ 24259 20207 16508 9509 17353 11486 7563 6371 8963 16807 14272 12744 13727 1415 -6735 -5550
8407e550J0794K879m948O434n92Q87l719j2328n613m77P027k263m514l059m920
$$ -5550 5244 8123 3175 9609 9017 9904 6185 -6143 -11756 -12233 -5206 -7469 -11983 -15042 -19962
8392a9962j199P665K0527R962O923j3j2390P123K145O334r738J0855q01j2842
$$ -19962 -21161 -13496 7031 16993 23916 23903 11513 18636 20781 27115 17377 28232 27431 14589
8378A4589q121l106k2757q797L019M447M904J8131J6929n025M457r097l703m342
$$ 14589 6468 3362 -19395 -28192 -25173 -20726 -15822 2309 19238 14213 18670 9573 5870 1528
8364A528P872K799m95M871j7204j7022L319m12J1235Q987N698q26m24P888j2411
$$ 1528 9400 12199 11704 16575 -629 -17651 -14332 -14744 -3509 5478 11176 10350 9926 17814 5403
8349E403j1900j0644L395M611M716L1K0967N424j1729j077L343K73j672j3660
$$ 5403 -6497 -17141 -13746 -9135 -4419 -4388 16579 22003 10274 9197 12540 12813 11141 -2519
8335b519l773m263M980L952R299J042O195l393R373l478J337M85p699J0385J3173
$$ -2519 -6292 -10555 -5575 -1623 7676 8718 14913 11520 20893 17415 18752 19237 11538 21923 35096
8320C5096N176p289j1693l060N694q652Q259n357O203J0238o947p385j0473m70
$$ 35096 40272 32983 21290 18230 23924 15272 23531 18174 24377 34615 27668 20283 9810 9340
8306I340J1930J742r875L604m834k519J4018o747o969Q576l084j4508l550J147
$$ 9340 21270 23012 13137 16741 11907 9388 23406 16659 9690 18266 15182 674 -2876 -1729
8292a729o020n376R311M933P080L000r66L191J2041Q314r507J32j0885j2712j438
$$ -1729 -7749 -13125 -3814 1119 8199 11199 10233 13424 25465 33779 24272 24404 13519 807 -631
8277f31M291j97P951J310L90r05P852P784j1208q765j4375L164J3228J0981l698
$$ -631 3660 3463 11414 12724 13114 12209 20061 27845 16637 7872 -6503 -3339 9889 20870 17172
8262A7172j0065k36p468j3636k083J354J0817N461K8954J495j5299Q172M393m735
$$ 17172 7107 6871 -597 -14233 -16316 -14962 -4145 1316 30270 31765 16466 24638 29031 24296
8248B4296m306r250N562J574l9o062p488J3242l736m000K541l967q813L697l810
$$ 24296 19990 10740 16302 17876 17837 11775 4287 17529 13793 9793 12334 8367 -446 3251 -559
8233e59p828J1553L771N138n704K139M083j420j257J704n997q704J4703Q625M87
$$ -559 -8387 3166 6937 12075 6371 8510 12593 11173 9916 11620 5623 -3081 11622 20247 20734
8218B0734K126l809r956p124o520L001p049K932J0985R396L051P744K914m809
$$ 20734 22860 19051 9095 1971 -4549 -1548 -8597 -5665 5320 14716 17767 25511 28425 23616
8204B3616o607m253n135q122J073n747r648J4569K0350m866j145l05p20K383k621
$$ 23616 17009 12756 7621 -501 572 -5175 -14823 -254 20096 15230 14085 13780 13060 15443 12822
8189A2822j6618K382k297j50j789J902L59q213L312J6866J2768j0054j3090j757
$$ 12822 -3796 -1414 -3711 -3861 -5650 -3748 -3389 -11602 -8290 8576 21344 11290 -1800 -3557
8175c557j701Q161J7529J1519r767n803j617J0942M278J479p766r927O008L099
$$ -3557 -5258 2903 20432 31951 22184 16381 14764 25706 29984 31463 23697 13770 19778 22877
8161B2877j1816j8830J3022L110p158M27Q79K403k425J2843k095j0012j0632o671
$$ 22877 11061 -7769 5253 8363 1205 1632 2511 4914 2489 15332 13237 3225 -7407 -14078
8147a4078j933J6623J7243k914J393k485q618J1834l555j2584o413R730J8724
$$ -14078 -16011 612 17855 14941 16334 13849 5231 17065 13510 926 -5487 4243 22967
8134B2967K024p338q314j2737m558J1745J2792Q196l035j5148k219q34l896Q129
$$ 22967 24991 17653 9339 -3398 -7956 3789 16581 24777 21742 6594 4375 3541 -355 7774
8120G774j5961j632K62J904J949K149J4274J6976N365p490P601j7398m4L960j875
$$ 7774 -8187 -9819 -9557 -7653 -5704 -3555 10719 27695 33060 25570 33171 15773 15729 19689 17814
8105A7814k764j1164o504L872p082P170J3187K805j329L513j90j8529n145q304
$$ 17814 15050 3886 -2618 1254 -5828 1342 14529 17334 16005 19518 19328 799 -4346 -12650
8091a2650O891O548K753l310p0j84L823P672L482l968o603P583J5746J4167q947
$$ -12650 -5759 789 3542 232 162 -22 3801 11473 14955 10987 4384 11967 27713 41880 32933
8076C2933j984j4654k2015p663J9071J1243m896m139P977r43R521J094K04L937
$$ 32933 30949 16295 -5720 -13383 5688 16931 12035 7896 15873 14930 24451 25545 25749 29686
8062B9686N180p666K536m533q23j6135p404J5744P5q663k212K728Q495m1j6024
$$ 29686 34866 27200 29736 25203 24380 8245 841 16585 16660 7997 5785 8513 17008 16967 943
8047I43L486L4468J8659M31K08j1430j858J1351O186J122j83J966K470J6241J5652
$$ 943 4429 38897 57556 57987 58195 46765 44907 56258 62444 63566 63383 65349 67819 84060 99712
8032I9712P147j7962j8667k0995j3208O133J3716J304j893J2604k14q024j3732
$$ 99712 106859 88897 70230 49235 36027 42160 55876 57180 55287 67891 67677 59653 45921
8019D5921j3401O035M937n11q120o498j2971mJ99m773L174M009n204K8847J4419
$$ 45921 32520 38555 43492 42981 34861 28363 15392 15388 15587 10814 13988 17997 12793 41640 56059
8004E6059N147M825J622j9957l318M124O169j5948j4180J397K1324J3691M177
$$ 56059 61206 66031 67653 47696 44378 48502 54671 38723 24543 25940 47264 60955 65132
7991F5132j277k0247j2216J5627P429k010j5833O978J0763K933K632m477j3102
$$ 65132 63855 43608 31392 47019 54448 52438 36605 43583 54346 57279 59911 55434 42332
7978D2332k124j4055p930O742J8285o586j1354L714q96p871m326l683J5J830N497
$$ 42332 40208 26153 18223 24965 43250 36664 25310 29024 28128 20257 15931 12248 12263 14093 19590
7963A9590o455k252N948n316L552Q007J6636j070k504J209J1627N303j8003l706
$$ 19590 13135 10883 16831 11515 15067 23074 39710 38640 36136 37345 48972 54275 36272 32566
7949C2566P36L025j0352o032m353N461M742P382K785k831p546o339J5057J348
$$ 32566 33302 36327 25975 19943 15590 21051 25793 33175 35960 33129 25583 19244 34301 35649
7935C5649n952j152j3352m597l146J327k045o61J5726N908j2523j1256M265j2057
$$ 35649 29697 28545 15193 10596 7450 8777 6732 6071 21797 27705 15182 3926 8191 -3866
7921c866M487J0163O900J756k319j0171P373Q276N974N089N557q911n135k100
$$ -3866 621 10784 17684 19440 17121 6950 14323 22599 28573 33662 39219 30308 25173 23073
7907B3073j1887j1571j6044P60J0178O787L519J7806R435R06p380j0014j1990
$$ 23073 11186 -385 -16429 -15669 -5491 1296 4815 22621 32056 32962 25582 15568 3578
7894C578k430m284J70K164n380P030J6526R469j2413o979M38J2032l480j4355
$$ 3578 1148 -3136 -2966 -802 -6182 848 17374 26843 14430 7451 7889 19921 16441 2086
7880B086K302j5091p499J1617J4100L968J307r218j3684j1980m125J1011K3907
$$ 2086 4388 -10703 -18202 -6585 7515 11483 12790 3572 -10112 -22092 -26217 -15206 8701
7867H701N003j616j0194r886O592L518J270j635j1637j2203p628j3508O81J1746
$$ 8701 13704 12088 1894 -7992 -1400 2118 3388 1753 -9884 -22087 -29715 -43223 -42542 -30796
7853c0796K0105J316J149n874j1268J4750J4327M343K680M525O952j983k7r581
$$ -30796 -10691 -9375 -8226 -14100 -25368 -10618 3709 8052 10732 15257 22209 20226 20199 10618
7839A0618N378J6833P373j6190j1648l138J827J935j092j2218r291M129J2793
$$ 10618 15996 32829 40202 24012 12364 9226 11053 12988 11896 -322 -9613 -5484 7309
7826G309O343n597O044L235L5N219J316n941o645l641n310J1757m988j2305l153
$$ 7309 13652 8055 14099 17334 17369 22588 23904 17963 11318 7677 2367 14124 9136 -3169 -6322
7811f322L89o291o625P396J5781q968o932J2316J4322q219j0713K832r80j1418
$$ -6322 -5933 -12224 -18849 -11453 4328 -4640 -11572 744 15066 6847 -3866 -1034 -2014 -13432
7797a3432j8191J0208P007L890R508Q174R406r683k154Q145p172j0754j6256j506
$$ -13432 -31623 -21415 -14408 -10518 -1010 7164 16570 6887 4733 12878 5706 -5048 -21304 -22810
7783b2810p298K891R610l01K0516m088J73K07K0075p304l980l719j0314P141j488
$$ -22810 -30108 -27217 -17607 -17908 2608 -1480 -1307 -1100 18975 11671 7691 3972 -6342 799 -689
7768f89k981P078J591q666j4877o447J712M066K153J1468Q606r68M777L184j0019
$$ -689 -3670 3408 4999 -3667 -18544 -24991 -23279 -19213 -17060 -5592 3014 2046 6823 10007 -12
7753a2p178m524O719L000k181M033n228j1161L259N561j556L988m180j018R920
$$ -12 -7190 -11714 -4995 -1995 -4176 -143 -5371 -16532 -13273 -7712 -9268 -5280 -9460 -10478 -558
7738e58J480Q443l871j396M182j5433M647J6812L546m136k0308L58o440n649J0213
$$ -558 922 9365 5494 4098 8280 -7153 -2506 14306 17852 13716 -6592 -6234 -12674 -18323 -8110
7723h110N725J881Q209N420J5215J714k1439j33N251L550j8298q950K556q705
$$ -8110 -2385 -504 7705 13125 28340 30054 8615 8482 13733 17283 -1015 -9965 -7409 -16114
7709a6114o703K020m809k91J0836Q699l217j420J089M128J1515K4932j762j7048
$$ -16114 -22817 -20797 -25606 -25897 -15061 -6362 -9579 -10999 -9910 -5782 5733 30665 28903 11855
7695A1855l690L962K294Q119j0412n724n144J251O130N793K411p702n596r152
$$ 11855 8165 12127 14421 22540 12128 6404 1260 2511 8641 14434 16845 9143 3547 -5605
7681e605j1504J930Q874N415R774j560r172q095k256K262J8408j053j0387j5965
$$ -5605 -17109 -15179 -6305 -890 8884 7324 -1848 -9943 -12199 -9937 8471 7418 -2969 -18934
7667a8934J2303M386j6067J334J3397J2339n282O451P589K793Q150n528L883j8451
$$ -18934 -6631 -2245 -18312 -16978 -3581 8758 3476 9927 17516 20309 28459 22931 26814 8363
7653H363j2178J626M543O527K182o541J251l346M66j3335j1030L672J9160r51
$$ 8363 -3815 -2189 2354 8881 11063 4522 5773 2427 2893 -10442 -21472 -17800 1360 409
7639D09p489k564j387J0047R771p926j0660N874O984p852M148r616j4281l13J8293
$$ 409 -7080 -9644 -11031 -984 8787 861 -9799 -3925 3059 -4793 -645 -10261 -24542 -24855 -6562
7624f562n860J077r16L125o443j6327k326J0812R0j81M743l013R957M812K598
$$ -6562 -12422 -11345 -12261 -9136 -15579 -31906 -34232 -23420 -23330 -23511 -18768 -21781 -11824 -7012 -4414
7609d414R924n832j0411L572N312J161K183o458m349M176J0031l569M803n866
$$ -4414 5510 -322 -10733 -7161 -1849 -688 1495 -4963 -9312 -5136 4895 1326 6129 263
7595B63k972M003j456k729l572K244l792L078l402M369M097L495r328p323Q544
$$ 263 -2709 1294 -162 -2891 -6463 -4219 -8011 -4933 -8335 -3966 131 3626 -5702 -13025 -4481
7580d481J1838l970M260p262q290rL873n157l013L5r207K331J1988J1606K0n552
$$ -4481 7357 3387 7647 385 -7905 -7914 -4041 -9198 -12211 -12176 -21383 -19052 -7064 4542 4562 -990
7564i90m330l473Q942P173K688l093o581m471q250P15L543o157J0943l600j3893
$$ -990 -5320 -8793 149 7322 10010 6917 336 -4135 -12385 -11670 -8127 -14284 -3341 -6941 -20834
7549b0834r074P108L421J578m388K5164O861j8992J622N410J858K666j5257L6
$$ -20834 -29908 -22800 -19379 -17801 -22189 2975 9836 -9156 -7534 -2124 -266 2400 -12857 -12821
7535a2821R001P005o621r408J5328K2338L629j4819k2211q578J569J5431J2905
$$ -12821 -3820 3185 -3436 -12844 2484 24822 28451 13632 -8579 -17157 -15588 -157 12748
7522A2748n962k399j6209M649J0188j2687l689M451k437J6212J69K190L354N506
$$ 12748 6786 4387 -11822 -7173 3015 -9672 -13361 -8910 -11347 4865 5034 7224 10578 16084
7508A6084r29j8216m741m957M595o159m603Q377J2009R571P08K2318Q91j4767
$$ 16084 15155 -3061 -7802 -12759 -8164 -14323 -18926 -10549 1460 11031 11739 34057 34948 20181
7494B0181j9862j3095o023j154J0503J268M098J859j7814j1718L727J0195J5843
$$ 20181 319 -12776 -18799 -19953 -9450 -8182 -4084 -2225 -20039 -31757 -28030 -17835 -1992
7481a992J642J735K477l922P254N38j2821k392p283k440J214O934J0540j073R170
$$ -1992 -350 1385 3862 -60 7194 7732 -5089 -7481 -14764 -17204 -15990 -9056 1484 411 9581
7466I581O224L052l089j5032q83r401q992K662Q489Q003Q34k445p650q98q270
$$ 9581 15805 18857 15768 736 -147 -9548 -18540 -15878 -7389 614 1448 -997 -8647 -9545 -17815
7451a7815N11k52L741j272J939N151M690p974R119J661j0705l653j442p610m088
$$ -17815 -17304 -17556 -13815 -15087 -13148 -7997 -3307 -11281 -2162 -501 -11206 -14859 -16301 -23911 -27999
7436b7999N402l392j5779J163K1432J496p724J4459m993K328n266j316P694j0262
$$ -27999 -22597 -25989 -41768 -40605 -19173 -17677 -25401 -10942 -15935 -13607 -18873 -20189 -12495 -22757
7422b2757q913k282J673j806m015J910J3795O636N304l688k476M315K010L445
$$ -22757 -31670 -33952 -32279 -34085 -38100 -36190 -22395 -15759 -10455 -14143 -16619 -12304 -10294 -6849
7408f849L170j0403l894M801m830j0647Q385j5822n311J3827J9752n515n55O037
$$ -6849 -3679 -14082 -17976 -13175 -18005 -28652 -20267 -36089 -41400 -27573 -7821 -13336 -13891 -7854
7394g854P306J1259j248N777M962j2513j1252P592n367k389L094M196j1741j01
$$ -7854 -548 10711 9463 15240 20202 7689 -3563 4029 -1338 -3727 -633 3563 -8178 -8279
7380h279p281L355R823O881j091j9218r434J0681K2170o456p534j666M047P030
$$ -8279 -15560 -12205 -2382 4499 3408 -15810 -25244 -14563 7607 1151 -6383 -8049 -4002 3028
7366C028l934j6386l816R320O92M674L461M943O582J837J2401j5959j2905j2631
$$ 3028 -906 -17292 -21108 -11788 -11096 -6422 -2961 1982 8564 10401 22802 6843 -6062 -18693
7352a8693L617K0263k16j424L91m821n233j2052J2113o039J108K734j2750M812
$$ -18693 -15076 5187 4971 3547 3938 -883 -6116 -18168 -6055 -12094 -10986 -8252 -21002 -16190
7338a6190L08p441M161l347M505J9988l571j5257J2558M786M571m535o320k255
$$ -16190 -15882 -23323 -19162 -22509 -18004 1984 -1587 -16844 -4286 500 5071 536 -5784 -8039
7324h039J0550J4355L176j4747p309R502J2219o443j1127q587Q024J3141P657
$$ -8039 2511 16866 20042 5295 -2014 7488 19707 13264 2137 -6450 1574 14715 22372
7311B2372j5089r817K704m406p991O06k371J3491p60n862R12r78O172N595o943
$$ 22372 7283 -2534 170 -4236 -12227 -11621 -13992 -501 -1261 -7123 -6211 -7189 -1017 4578 -2365
7296b365L495L22R448j2262r49J1950J292j329p647j0705r467J3307J0086l94
$$ -2365 1130 1452 10900 -1362 -2311 9639 10931 9602 1955 -8750 -18217 -4910 5176 4782
7282D782o967j6892j8124P128J1661l159P107n903q48R355q0M405j3005q841J7256
$$ 4782 -2185 -19077 -37201 -30073 -18412 -21571 -14464 -20367 -21215 -11860 -11940 -7535 -20540 -29381 -12125
7267a2125J0054p512R74N755q353j538N455j2746P777N446r37m740M871K8186
$$ -12125 -2071 -9583 -8609 -2854 -11207 -12745 -7290 -20036 -12259 -6813 -7750 -12490 -7619 20567
7253B0567L881k030L03j2838J36j7568l895J4259m698k238j4987j026r13Q554
$$ 20567 24448 22418 22721 9883 10019 -7549 -11444 2815 -1883 -4121 -19108 -20134 -21047 -12493
7239a2493J5600Q399j2286k0917M570k546q990n614J6794K1292p48j128j9220
$$ -12493 3107 11506 -780 -21697 -17127 -19673 -28663 -34277 -17483 3809 3061 1933 -17287
7226a7287j0346R170M389n432k236n757N31N334K2817P134j985p117l850J649
$$ -17287 -27633 -18463 -14074 -19506 -21742 -27499 -26968 -21634 1183 8317 6332 -785 -4635 -2986
7212b986Q32K883K4693L335J0168N58j3944k8233l820l77l201q101l764N384O52
$$ -2986 -2154 729 25422 28757 38925 39483 25539 -2694 -6514 -6891 -10092 -18193 -21957 -16573 -15921
7197a5921Q513L1O660J449p413J0298K43q784m334R345J6681j410o927O369k869
$$ -15921 -7408 -7377 -717 732 -6681 3617 3860 -4924 -9258 87 16768 15358 8431 14800 11931
7182A1931p313k72o526J461N800k108r674J2060Q781j0844o103P172L74L688J6724
$$ 11931 4618 4346 -2180 -719 5081 2973 -6701 5359 14140 3296 -2807 4365 4739 8427 25151
7167B5151R79k8441j1561J1872n10j2889R711O405L803p621j1157O438J047j206
$$ 25151 26130 -2311 -13872 -2000 -2510 -15399 -5688 717 4520 -3101 -14258 -7820 -6773 -7979
7153g979o999j0639N018J5811N20r769j1658N266P497j7113J497J8081K1499q289
$$ -7979 -14978 -25617 -20599 -4788 -4268 -14037 -25695 -20429 -12932 -30045 -28548 -10467 11032 2743
7139B743Q047M964l52j3368k0628J2307K940n386N141p180p770o727Q060N59O022
$$ 2743 10790 15754 15402 2034 -18594 -6287 -3347 -8733 -3592 -10772 -18542 -25269 -17209 -16650 -10628
7124a0628M357o558l748L900M798m248m328m582J9990K3144j0596k6679n115J0603
$$ -10628 -6271 -12829 -16577 -12677 -7879 -12127 -16455 -21037 -1047 22097 11501 -15178 -20293 -9690
7110i690j137O899L384q294Q447J1601K3127Q41j1587j4011j1577p038Q634L658
$$ -9690 -10827 -3928 -544 -8838 -391 11210 34337 35178 23591 9580 -1997 -9035 -401 3257
7096C257p750n831J1775J817O086o338j8527r724Q658R369K986L942o241j8839
$$ 3257 -4493 -10324 1451 3268 9354 3016 -15511 -25235 -16577 -7208 -4222 -280 -6521 -25360
7082b5360n19K153R96Q30J1528l910j7011M919l751Q798J7449M664n014k1562
$$ -25360 -25879 -23726 -22730 -21900 -10372 -14282 -31293 -26374 -30125 -21327 -3878 786 -4228 -25790
7068b5790L64J5707J8158o579j8042Q035J4312M526M369j1429j7935J367P48j0723
$$ -25790 -25426 -9719 8439 1860 -16182 -8147 6165 10691 15060 3631 -14304 -12937 -12189 -22912
7054b2912K279J4911J889o478j747j0436N768Ro083q857j03L150K0038R028O798
$$ -22912 -20633 -5722 -3833 -10311 -12058 -22494 -16726 -16717 -22800 -31657 -31760 -28610 -8572 456 7254
7039G254O943j398M19R14J2740j276m379k1523k8453p534L077Q046j379o944j2817
$$ 7254 14197 12799 13218 14132 26872 25596 21217 -306 -28759 -36293 -33216 -25170 -26549 -33493 -46310
7024d6310J5663J4342J2061K054j25J566O703k236q246O202j2358r038L138O169
$$ -46310 -30647 -16305 -4244 -2190 -2315 -749 5954 3718 -4528 1674 -10684 -19722 -16584 -10415
7010a0415O544J662l348o664l8m891K262J526O783N004K445j946j435M542N995
$$ -10415 -3871 -2209 -5557 -12221 -12259 -17150 -14888 -13362 -6579 -1575 870 -1076 -2511 2031 8026
6995H026P942j7254m220r668j2185m152J1368m07J32L017n170r056N558M368m641
$$ 8026 15968 -1286 -5506 -15174 -27359 -31511 -20143 -20550 -20418 -17401 -22571 -31627 -26069 -21701 -26342
6980b6342n852K7068K769k1101j1200q294J3503j032N926J3258J3106J5700j815
$$ -26342 -32194 -5126 -2357 -23458 -34658 -42952 -29449 -30481 -24555 -11297 1809 17509 15694
6967A5694r963k4874o974J9543J0123j3869j5027l806K2419K3395q233n320r257
$$ 15694 5731 -19143 -26117 -6574 3549 -10320 -25347 -29153 -6734 16661 8428 3108 -6149
6954f149n38J872q304O875k878q666K478Q483o5j4981Q064L894J9294K237o926
$$ -6149 -6687 -4815 -13119 -6244 -9122 -17788 -15310 -6827 -6892 -21873 -13809 -9915 9379 11616 4690
6939D690k464k757k686j2344K1n25N606J258R53j709n692j3527l513j4044r773
$$ 4690 2226 -531 -3217 -15561 -15540 -16065 -10459 -9201 -8248 -9957 -15649 -29176 -32689 -46733 -56506
6924e6506K1277M696o431K70K338k949N355O429N424M401o484O223J3698K853
$$ -56506 -35229 -30533 -36964 -36694 -34356 -37305 -31950 -25521 -20097 -15696 -22180 -15957 -2259 594
6910E94j1965J099K016R801o515J908Q232j0465O971p313k35N638Q855N026k834
$$ 594 -11371 -10272 -8256 1545 -4970 -3062 5170 -5295 1676 -5637 -5872 -234 8621 13647 10813
6895A0813j0145o642j662M219J5680j723j4849L182m073J054j119P810j2138M111
$$ 10813 668 -5974 -7636 -3417 12263 10540 -4309 -1127 -5200 -4146 -5265 2545 -9593 -5482
6881e482M791N94M844K677j158P201L09r326j0038j157j2768O742r292k1020k897
$$ -5482 -691 -97 4747 7424 6266 13467 13776 4450 -5588 -6745 -19513 -12771 -22063 -43083 -45980
6866d5980Q389k231P676K3968L682j185n771M051P505k802p860R973J5323M32
$$ -45980 -37591 -39822 -32146 -8178 -4496 -5681 -11452 -7401 104 -2698 -10558 -585 14738 15170
6852A5170R482j0574o959j1343K604J7642J93m708r007j1776P209J1391Q32j2037
$$ 15170 24652 14078 7119 -4224 -1620 16022 16215 11507 2500 -9276 -2067 9324 10156 -1881
6838a881j6364m61M908K84M742o731J1581p738M626J9097p9j6519N54O529j5933
$$ -1881 -18245 -18706 -13798 -13514 -8772 -15503 -3922 -11660 -7034 12063 11984 -4535 -3981 2548 -13385
6823a3385m771K1568K585K145Q50m460J211m498n512k384N991n893j2514J0427
$$ -13385 -18156 3412 5997 8142 8992 4532 5743 1245 -4267 -6651 -660 -6553 -19067 -8640
6809h640K249n423o599R626q16n639j8028m316J4184R756L910n720m078N725j390
$$ -8640 -6391 -11814 -18413 -8787 -9603 -15242 -33270 -37586 -23402 -13646 -9736 -15456 -19534 -13809 -15199
6794a5199m983R608Q369K396M187r22q038l46L062p118k387J5740P461r575J446
$$ -15199 -20182 -10574 -2205 191 4378 3456 -4582 -4928 -1866 -8984 -11371 4369 11830 2255 3701
6779C701M745K532k0104j6667L591Q13J0033Q200r575o334l644J4398J2528Q046
$$ 3701 8446 10978 -9126 -25793 -22202 -21389 -11356 -3156 -12731 -19065 -22709 -8311 4217 12263
6765A2263P981m06o744j0653j1071k136P444J5913j273l131p814L132M346n290
$$ 12263 20244 19838 13094 2441 -8630 -10766 -3322 12591 11318 8187 373 3505 7851 2561
6751B561l023N289J370j3686j2894Q839P312Q515L036q067j4522j0863Q720J17
$$ 2561 -462 4827 6197 -7489 -20383 -11544 -4232 4283 7319 -748 -15270 -26133 -17413 -17296
6737a7296j882O6J0225m451j4881R39j750O685n672N239j252l925j748m661K547
$$ -17296 -19178 -19112 -8887 -13338 -28219 -27280 -29030 -22345 -28017 -22778 -24030 -27955 -29703 -34364 -31817
6722c1817K320n46J0180O142J1549m463o161K2693O808j628Q757J3226p229p386
$$ -31817 -29497 -30043 -19863 -13721 -2172 -6635 -12796 9897 16705 15077 23834 37060 29831 22445
6708B2445J382p779n340R140j7981l178K2740J3737j5302r508K537n005j1351
$$ 22445 23827 16048 10708 19848 1867 -1311 21429 35166 19864 10356 12893 7888 -3463
$$ [...]
##END NTUPLES=NMR SPECTRUM
##END=
