##TITLE=Analysis number 329772
Compound Code cc 66913
Book Reference 510/88
Project Code adrs
Chemist Name jimp
##JCAMPDX= 6.0         $$ Bruker NMR JCAMP-DX V2.0
##DATA TYPE= NMR SPECTRUM
##DATA CLASS= NTUPLES
##ORIGIN= Bruker BioSpin GmbH
##OWNER= nmr
$$ XWIN-NMR		Version 3.5
$$ Wed Sep 26 16:54:25 2007 GMT Daylight Time (UT+1h)  MAYBRIDGE\nmr@NMR_250MHZ
##.OBSERVE FREQUENCY= 250.131544655141
##.OBSERVE NUCLEUS= ^1H
##.ACQUISITION MODE= SIMULTANEOUS (DQD)
##.ACQUISITION SCHEME= undefined
##.AVERAGES= 16
##.DIGITISER RES= 18
##SPECTROMETER/DATA SYSTEM= dpx250
##.PULSE SEQUENCE= zg30
##.SOLVENT NAME= CDCl3
##.SHIFT REFERENCE= (INTERNAL, CDCl3, 0, 16.522)
##AUDIT TRAIL= $$ (NUMBER, WHEN, WHO, WHERE, WHAT)
$$ ##TITLE= Audit trail, XWIN-NMR		Version 3.5
$$ ##JCAMPDX= 5.01
$$ ##ORIGIN= Bruker BioSpin GmbH
$$ ##OWNER= nmr
$$ C:\u/data/dgb/nmr/ADRS/2560/pdata/1/auditp.txt
$$ ##AUDIT TRAIL=  $$ (NUMBER, WHEN, WHO, WHERE, WHAT)
(   1,<2007-09-26 16:53:54.84 +100>,<MAYBRIDGE\nmr>,<NMR_250MHZ>,
      <created by zg, POWCHK disabled, PULCHK disabled
       configuration hash MD5:
       76 6E 9A 78 1E 09 19 81 EC 84 63 8F B0 6A 59 2D
       data hash MD5: 64K
       95 1B 51 AD 56 52 EB FE DF 14 B2 5F 37 03 50 B2>)
(   2,<2007-09-26 16:54:14.60 +100>,<MAYBRIDGE\nmr>,<NMR_250MHZ>,
      <Start of raw data processing
       ef LB = 0.3 FT_mod = 6 PKNL = 1 SI = 32K 
       data hash MD5: 32K
       04 72 C3 98 6E 46 C8 9C A8 18 C5 33 D7 20 ED 9D>)
(   3,<2007-09-26 16:54:16.42 +100>,<MAYBRIDGE\nmr>,<NMR_250MHZ>,
      <apk 
       data hash MD5: 32K
       B3 FB 60 B5 4D 9F 86 83 EC D6 DA F0 B0 F2 82 A5>)
(   4,<2007-09-26 16:54:17.17 +100>,<MAYBRIDGE\nmr>,<NMR_250MHZ>,
      <abs ABSG = 5 
       data hash MD5: 32K
       F4 6D 11 06 02 53 95 8B 81 F9 AC 4A 99 C3 1C 90>)
$$ ##END=
$$ 
$$ hash MD5
$$ D2 44 55 93 2F C1 B6 B2 0D 8E F2 EA E4 DC FE E6
##$RELAX= 
##$RELAX= 
##$RELAX= 
##$RELAX= 
##$RELAX= 
##$RELAX= 
##$RELAX= 
$$ Bruker specific parameters
$$ --------------------------
##$DU= <C:\u>
##$EXPNO= 2560
##$NAME= <ADRS>
##$PROCNO= 1
##$TYPE= <nmr>
##$USER= <dgb>
##$AMP= (0..31)
100 100 100 100 100 100 100 100 100 100 100 100 100 100 100 100 100 100 
100 100 100 100 100 100 100 100 100 100 100 100 100 100 
##$AQSEQ= 0
##$AQ_mod= 3
##$AUNM= <au_zg>
##$AUTOPOS= <30 >
##$BF1= 250.13
##$BF2= 250.13
##$BF3= 250.13
##$BF4= 250.13
##$BF5= 500.13
##$BF6= 500.13
##$BF7= 500.13
##$BF8= 500.13
##$BYTORDA= 1
##$CFDGTYP= 0
##$CFRGTYP= 5
##$CHEMSTR= <none>
##$CNST= (0..31)
1 1 145 1 1 1 1 1 1 1 1 1 1 1 1 1 1 1 1 1 1 1 1 1 1 1 1 1 1 1 1 1 
##$CPDPRG= <>
##$CPDPRG1= <>
##$CPDPRG2= <>
##$CPDPRG3= <>
##$CPDPRG4= <mlev>
##$CPDPRG5= <mlev>
##$CPDPRG6= <mlev>
##$CPDPRG7= <mlev>
##$CPDPRG8= <mlev>
##$CPDPRGB= <>
##$CPDPRGT= <>
##$D= (0..31)
0 1 0 0 0 0 0 0 0 0.06 0 0 0 0 0 0 0.0002 0 0 0 0 0 0 0 0 0 0 0 0 0 0 
0 
##$DATE= 1190822033
##$DBL= (0..7)
120 120 120 120 120 120 120 120 
##$DBP= (0..7)
150 150 150 150 150 150 150 150 
##$DBP07= 0
##$DBPNAM0= <>
##$DBPNAM1= <>
$$ [...]
##$SUBNAM7= <"">
##$SUBNAM8= <"">
##$SUBNAM9= <"">
##$SW= 20.6930455092707
##$SWIBOX= (0..15)
0 0 3 0 0 0 0 0 0 0 0 0 0 0 0 0 
##$SW_h= 5175.983436853
##$TD= 65536
##$TD0= 1
##$TE= 296.16
##$TE2= 300
##$TE3= 300
##$TEG= 300
##$TL= (0..7)
0 120 120 120 120 120 120 120 
##$TP= (0..7)
150 150 150 150 150 150 150 150 
##$TP07= 0
##$TPNAME0= <>
##$TPNAME1= <>
##$TPNAME2= <>
##$TPNAME3= <>
##$TPNAME4= <>
##$TPNAME5= <>
##$TPNAME6= <>
##$TPNAME7= <>
##$TPOAL= (0..7)
0.5 0.5 0.5 0.5 0.5 0.5 0.5 0.5 
##$TPOFFS= (0..7)
0 0 0 0 0 0 0 0 
##$TUNHIN= 0
##$TUNHOUT= 0
##$TUNXOUT= 0
##$USERA1= <user>
##$USERA2= <user>
##$USERA3= <user>
##$USERA4= <user>
##$USERA5= <user>
##$V9= 5
##$VALIST= <valist>
##$VCLIST= <CCCCCCCCCCCCCCC>
##$VD= 0
##$VDLIST= <DDDDDDDDDDDDDDD>
##$VPLIST= <PPPPPPPPPPPPPPP>
##$VTLIST= <TTTTTTTTTTTTTTT>
##$WBST= 1024
##$WBSW= 4
##$XGAIN= (0..3)
0 0 0 0 
##$XL= 0
##$YL= 0
##$YMAX_a= 492727
##$YMIN_a= -662473
##$ZGOPTNS= <>
##$ZL1= 120
##$ZL2= 120
##$ZL3= 120
##$ZL4= 120
##$ABSF1= 16.522
##$ABSF2= -4.171173
##$ABSG= 5
##$ABSL= 3
##$ALPHA= 0
##$AQORDER= 0
##$ASSFAC= 0
##$ASSFACI= 0
##$ASSFACX= 0
##$ASSWID= 0
##$AUNMP= <proc_1d>
##$AZFE= 0.1
##$AZFW= 0.1
##$BCFW= 0
##$BC_mod= 0
##$BYTORDP= 0
##$COROFFS= 0
##$CY= 12.5
##$DATMOD= 1
##$DC= 0
##$DFILT= <>
##$DTYPP= 0
##$F1P= 14.0000005364418
##$F2P= -0.99999901652339
##$FCOR= 0.5
##$FTSIZE= 32768
##$FT_mod= 6
##$GAMMA= 0
##$GB= 0
##$INTBC= 1
##$INTSCL= 1
##$ISEN= 128
##$LB= 0.3
##$LEV0= 0
##$LPBIN= 0
##$MAXI= 10000
##$MC2= 0
##$MEAN= 0
##$ME_mod= 0
##$MI= 0
##$NCOEF= 0
##$NC_proc= -2
##$NLEV= 6
##$NOISF1= 0
##$NOISF2= 0
##$NSP= 0
##$NTH_PI= 0
##$NZP= 0
##$OFFSET= 16.522
##$PC= 1
##$PHC0= 153.6182
##$PHC1= 9.387415
##$PH_mod= 1
##$PKNL= yes
##$PPARMOD= 0
##$PSCAL= 4
##$PSIGN= 0
##$REVERSE= no
##$SF= 250.13
##$SI= 32768
##$SIGF1= 0
##$SIGF2= 0
##$SINO= 400
##$SIOLD= 32768
##$SREGLST= <1H.CDCl3>
##$SSB= 0
##$STSI= 32768
##$STSR= 0
##$SW_p= 5175.98343685301
##$SYMM= 0
##$S_DEV= 0
##$TDeff= 65536
##$TDoff= 0
##$TI= <Analysis number 999999
Compound Code 99
Book Reference 9
Project Code 9>
##$TILT= no
##$TM1= 0
##$TM2= 0
##$TOPLEV= 0
##$USERP1= <user>
##$USERP2= <user>
##$USERP3= <user>
##$USERP4= <user>
##$USERP5= <user>
##$WDW= 1
##$XDIM= 32768
##$YMAX_p= 315220352
##$YMIN_p= -31282
$$ End of Bruker specific parameters
$$ ---------------------------------
##NTUPLES= NMR SPECTRUM
##VAR_NAME=  FREQUENCY,     SPECTRUM/REAL,   SPECTRUM/IMAG
##SYMBOL=    X,             R,               I
##VAR_TYPE=  INDEPENDENT,   DEPENDENT,       DEPENDENT
##VAR_FORM=  AFFN,          ASDF,            ASDF
##VAR_DIM=   32768,         32768,           32768
##UNITS=     HZ,            ARBITRARY UNITS, ARBITRARY UNITS
##FACTOR=    0.157963299565203, 1,           1
##FIRST=     4132.6476996994, 0,             0
##LAST=      -1043.33573715361, 0,           0
##MIN=       -1043.33573715361, -31282,      0
##MAX=       4132.6476996994, 315220352,     0
$$ Real data points
##PAGE= N=1
##DATA TABLE= (X++(R..R)), XYDATA
$$ [...]
##PAGE= N=2
##DATA TABLE= (X++(I..I)), XYDATA
18228A849306K4099J7092O822M089J2493J6789J5346J0226M540R843J1516J4295
$$ 1849306 1873405 1890497 1897319 1901408 1913901 1930690 1946036 1956262 1960802 1970645 1982161 1996456
18216A996456J4895N119Q352Q739J1377J6932J5148J3176J5926J3572J2199J5683
$$ 1996456 2011351 2016470 2024822 2033561 2044938 2061870 2077018 2090194 2106120 2119692 2131891 2147574
18204B147574P265Q069M066N025R961J5375J0641J7023J5103J4173J6297J1191
$$ 2147574 2154839 2162908 2166974 2171999 2181960 2197335 2207976 2224999 2240102 2254275 2270572 2281763
18192B281763J2314J5703J3654J3100J0317J2416P326J2613R989P860P631J4115
$$ 2281763 2294077 2309780 2323434 2336534 2346851 2359267 2366593 2379206 2389195 2397055 2404686 2418801
18180B418801J5181J2427J1000J0593J7305Q058J5486J6389J9037J9894K1454
$$ 2418801 2433982 2446409 2457409 2468002 2485307 2493365 2508851 2525240 2544277 2564171 2585625
18169B585625J6215J5713K0835J9969J5450J0241J9081K1289K0625K4953K2750
$$ 2585625 2601840 2617553 2638388 2658357 2673807 2684048 2703129 2724418 2745043 2769996 2792746
18158B792746J4571J9811K1023K0584J7916R467J6150K7956K7556K7705L5832
$$ 2792746 2807317 2827128 2848151 2868735 2886651 2896118 2912268 2940224 2967780 2995485 3031317
18147C031317L5237K6559L1558L6250L1661K7691L1045M4606L9044L1021L9345
$$ 3031317 3066554 3093113 3124671 3160921 3192582 3220273 3251318 3295924 3334968 3365989 3405334
18136C405334M5619M7089M7119N3799N6054O2298O5243O7995P5517Q7376R9745
$$ 3405334 3450953 3498042 3545161 3598960 3655014 3717312 3782555 3850550 3926067 4013443 4113188
18125D113188J08839J25647J46939J53206J78195K07467K30617K41619K63886
$$ 4113188 4222027 4347674 4494613 4647819 4826014 5033481 5264098 5505717 5769603
18116E769603L07312L50192M28607O03245P65217P06401r1679k839356m988423
$$ 5769603 6076915 6427107 6855714 7458959 8224176 8930577 8838898 5999542 1011119
18107A011119l486532j555694M89770R69706Q06870O11795M69618L83323L17916
$$ 1011119 -2475413 -4031107 -3541337 -2571631 -1764761 -1152966 -683348 -300025 17891
18098A7891K60954K18254J92193J64335J40219J18057J00497R1599R3154R2710
$$ 17891 278845 497099 689292 853627 993846 1111903 1212400 1303999 1397153 1489863
18088A489863R0366Q4182Q1536P7528P5558M7990K2756J9532J9516L6205M2895
$$ 1489863 1580229 1664411 1745947 1823475 1899033 1947023 1969779 1989311 2008827 2045032 2087927
18077B087927L5392L4160K8401K8945L8854L7798M2031M3704M1678M4433L6688
$$ 2087927 2123319 2157479 2185880 2214825 2253679 2291477 2333508 2377212 2418890 2463323 2500011
18066B500011L1285L5278K9479K6958K5179J7296N637l905j0964m715J856J1827
$$ 2500011 2531296 2566574 2596053 2623011 2648190 2665486 2671123 2667218 2656254 2651539 2653395 2665222
18054B665222K5575L3503L4296K7607K7143K5522K9941L2297K8287J9870K5139
$$ 2665222 2690797 2724300 2758596 2786203 2813346 2838868 2868809 2901106 2929393 2949263 2974402
18043B974402K8588K9277L0214K9373K7357L0839K5141J5381Q218L250J1638J4835
$$ 2974402 3002990 3032267 3062481 3091854 3119211 3150050 3175191 3190572 3198790 3202040 3213678 3228513
18031C228513J4876K5548K7963K4365K4386K0036K2506K7314J8727K4772K7515
$$ 3228513 3243389 3268937 3296900 3321265 3345651 3365687 3388193 3415507 3434234 3459006 3486521
18020C486521J6635J9157K3299K2140K1556K4377J8337K2142K1587K0348J6763
$$ 3486521 3503156 3522313 3545612 3567752 3589308 3613685 3632022 3654164 3675751 3696099 3712862
18009C712862K2602J7425K1487K0037J6379K5246L2978K8543K1953J8893L0855
$$ 3712862 3735464 3752889 3774376 3794413 3810792 3836038 3869016 3897559 3919512 3938405 3969260
17998C969260K3383K2752K5484L2105K6817J7105J6831K6897K6347K1253K1816
$$ 3969260 3992643 4015395 4040879 4072984 4099801 4116906 4133737 4160634 4186981 4208234 4230050
17987D230050K5049K9738K6015L1627K5004K0890K7288K8122K2850K5717K7145
$$ 4230050 4255099 4284837 4310852 4342479 4367483 4388373 4415661 4443783 4466633 4492350 4519495
17976D519495K7544K4491L0457K4386M0129L4112L3149L3400K9064L4269K8570
$$ 4519495 4547039 4571530 4601987 4626373 4666502 4700614 4733763 4767163 4796227 4830496 4859066
17965D859066L0386K7594L1130L7025L4075L6367L8516L3383M1432M3518L5909
$$ 4859066 4889452 4917046 4948176 4985201 5019276 5055643 5094159 5127542 5168974 5212492 5248401
17954E248401K6168L7748L1166K3840L0059L3483K7506K7726L9377N7843N1481
$$ 5248401 5274569 5312317 5343483 5367323 5397382 5430865 5458371 5486097 5525474 5583317 5634798
17943E634798M9429N0133N5624M6095L9898L9759M7636M3613M3070M9520M9680
$$ 5634798 5684227 5734360 5789984 5836079 5875977 5915736 5963372 6006985 6050055 6099575 6149255
17932F149255M6045M4631M1834N4108N5525N1760N5714N2127N7192O9589P0270
$$ 6149255 6195300 6239931 6281765 6335873 6391398 6443158 6498872 6550999 6608191 6677780 6748050
17921F748050N8171O0774O2641P1437P1716P1768O8296P1519P3530O7890P3756
$$ 6748050 6806221 6866995 6929636 7001073 7072789 7144557 7212853 7284372 7357902 7425792 7499548
17910G499548P1831P3695O8981P8593Q4815Q5207R2861R9163R8466J04476J04882
$$ 7499548 7571379 7645074 7714055 7792648 7877463 7962670 8055531 8154694 8253160 8357636 8462518
17899H462518R9323J05056J10628J18952J20221J17821J14348J14652J17523J25198
$$ 8462518 8561841 8666897 8777525 8896477 9016698 9134519 9248867 9363519 9481042 9606240
17889I606240J22460J38387J56609J65581J67649J69475J70732J66709J77614
$$ 9606240 9728700 9867087 10023696 10189277 10356926 10526401 10697133 10863842 11041456
17880A1041456J87689J99973K17798K37912K63707K77775K55148J88028J09181
$$ 11041456 11229145 11429118 11646916 11884828 12148535 12426310 12681458 12869486 12978667
17871A2978667K2329l567L3624J50171K94638M16232N06128N46623N83336O34175
$$ 12978667 13000996 12997429 13031053 13181224 13475862 13892094 14398222 14944845 15528181 16162356
17861A6162356O63497O51837N09586K47563J1382l52333p77635r39619j002243
$$ 16162356 16825853 17477690 17987276 18234839 18246221 17893888 17116253 16176634 15174391
17852A5174391r47079n42202j30873K62123N96041Q25138R71313J026199J022371
$$ 15174391 14227312 13685110 13554237 13816360 14412401 15237539 16208852 17235051 18257422
17843A8257422J045616J099170J183593J310985J440238J547612J618220J680009
$$ 18257422 19303038 20402208 21585801 22896786 24337024 25884636 27502856 29182865
17835B9182865J857115K183449K619018L076410L489954L758994L594444K566806
$$ 29182865 31039980 33223429 35842447 38918857 42408811 46167805 49762249 52329055
17827E2329055O98217k301721n695225r127074j3888203j9221286k0408373j4035693
$$ 52329055 53027272 50725551 45030326 35903252 22015049 2793763 -17614610 -31650303
17819c1650303m301044L421728O809961O820170N789816M452086K880366J528592
$$ -31650303 -35951347 -32529619 -25719658 -18899488 -13109672 -8657586 -5777220 -4248628
17811d248628J9706j891087l223997l889278m346654l486949k095861p44171N15941
$$ -4248628 -4228922 -6120009 -9344006 -13233284 -17579938 -21066887 -23162748 -23906919 -23390978
17802b3390978J378088J888205K125637K098430J967740J827446J717739J631320
$$ -23390978 -22012890 -20124685 -17999048 -15900618 -13932878 -12105432 -10387693 -8756373
17794h756373J569119J528820J522984J537744J555783J576059J641172J758048
$$ -8756373 -7187254 -5658434 -4135450 -2597706 -1041923 534136 2175308 3933356
17786C933356J935488K172504K359932J994662L4094m468259r890412j1915136
$$ 3933356 5868844 8041348 10401280 12395942 12430036 7961777 -1928635 -13843771
17778a3843771r156451m243834j65239J849362K380932K294172K012188J707107
$$ -13843771 -23000222 -27244056 -27409295 -25559933 -23179001 -20884829 -18872641 -17165534
17770a7165534J447182J251664J105693J003577R06836Q21846P49734O99773O67155
$$ -17165534 -15718352 -14466688 -13360995 -12357418 -11450582 -10628736 -9879002 -9179229 -8512074
17761h512074O27141N92121N32267M64737L89660L37213L28390L45033L42560
$$ -8512074 -7884933 -7292812 -6760545 -6295808 -5906148 -5568935 -5240545 -4895512 -4552952
17752d552952L45043L66765L88568M07879M11327M12470M12538M26686M62079
$$ -4552952 -4207909 -3841144 -3452576 -3044697 -2633370 -2220900 -1808362 -1381676 -919597
17743i19597M97003N54394O16267O82960P55622P49570M38399m80482j884927
$$ -919597 -422594 131800 748067 1431027 2186649 2936219 3374618 2894136 1009209
17734A009209k723609k284562j037627J55594P94783R32713Q62091P73928O80695
$$ 1009209 -1714400 -3998962 -5036589 -4880995 -4086212 -3153499 -2291408 -1517480 -836785
17725h36785N84357N03737M43657M10254L82895L46815L30310L47355M14776N27397
$$ -836785 -252428 251309 694966 1105220 1488115 1834930 2165240 2512595 2927371 3454768
17715C454768O45297P52840Q38026R21567J000911J106653J227923J364610J510661
$$ 3454768 4100065 4852905 5690931 6612498 7613409 8720062 9947985 11312595 12823256
17706A2823256J668226J844621K032301K148280J897609Q21295j439923m647448
$$ 12823256 14491482 16336103 18368404 20516684 22414293 23235588 21795665 17148217
17698A7148217p761597r529316r022342o582295l183725j02171J933113K864044
$$ 17148217 9386620 -142696 -9165038 -15747333 -18931058 -19033229 -17100116 -14236072
17690a4236072L055710K950932K781284K670478K624385K658288K720651K680731
$$ -14236072 -11180362 -8229430 -5448146 -2777668 -153283 2505005 5225656 7906387
17682G906387K187533P33956j944083n444194q580242j0110284r195075o462358
$$ 7906387 10093920 10827876 8883793 3439599 -5140643 -15250927 -24446002 -30908360
17674c0908360k975921o2211J702468K372696K367585K113017J829605J573633
$$ -30908360 -33884281 -33946492 -32244024 -29871328 -27503743 -25390726 -23561121 -21987488
17666b1987488J350982J154605R88493Q46191P40037O74340O21335N70993N27008
$$ -21987488 -20636506 -19481901 -18493408 -17647217 -16907180 -16232840 -15611505 -15040512 -14513504
17657a4513504M66006M17622L77045L36408K87060K60611K46857K53343K70489
$$ -14513504 -14047498 -13629876 -13252831 -12916423 -12629363 -12368752 -12121895 -11868552 -11598063
17648a1598063K72393K68382K44412K09513J76504J61355J54854J56665J73989
$$ -11598063 -11325670 -11057288 -10812876 -10603363 -10426859 -10265504 -10110650 -9953985 -9779996
17639i779996J79787J78384J80853J75855J59033J51602J41781J32622J36281
$$ -9779996 -9600209 -9421825 -9240972 -9065117 -8906084 -8754482 -8612701 -8480079 -8343798
17630h343798J34043J28515J17657J12713J14675J11193J09987J02352R3215R1640
$$ -8343798 -8209755 -8081240 -7963583 -7850870 -7736195 -7625002 -7515015 -7412663 -7319448 -7227808
17620g227808R3766Q5917P9613Q0032R4261R8497P4111O9889O9180P1423O6540
$$ -7227808 -7134042 -7048125 -6968512 -6888480 -6794219 -6695722 -6621611 -6551722 -6482542 -6411119 -6344579
17609f344579P3087P6327O8202O6504O3742N9308N8244N9259N3486N9068N4944
$$ -6344579 -6271492 -6195165 -6126963 -6060459 -5996717 -5937409 -5879165 -5819906 -5766420 -5707352 -5652408
17598e652408N4176N4757N0889N3937M6694M5391M2095M8287M3049M0850M6987
$$ -5652408 -5598232 -5543475 -5492586 -5438649 -5391955 -5346564 -5304469 -5256182 -5213133 -5172283 -5125296
17587e125296M4833M6707M7290M4018M6226M3047M6463L9878M0305L5117L0746
$$ -5125296 -5080463 -5033756 -4986466 -4942448 -4896222 -4853175 -4806712 -4766834 -4726529 -4691412 -4660666
17576d660666L1483M1249L7483L1191L0195L0321L4871L0210L2658L3065L2033
$$ -4660666 -4629183 -4587934 -4550451 -4519260 -4489065 -4458744 -4423873 -4393663 -4361005 -4327940 -4295907
17565d295907L2087L0388L2584L4362K3311K4103L7946L3902K4067K1155K2306
$$ -4295907 -4263820 -4233432 -4200848 -4166486 -4143175 -4119072 -4081126 -4047224 -4023157 -4002002 -3979696
17554c979696K3440K6195L0314K5068K2132K7745K1986J7578K3588L4506L1186
$$ -3979696 -3956256 -3930061 -3899747 -3874679 -3852547 -3824802 -3802816 -3785238 -3761650 -3727144 -3695958
17543c695958K7220L2504K9219K2341K2929K1838K1026K6310L3962J6249Q458
$$ -3695958 -3668738 -3636234 -3607015 -3584674 -3561745 -3539907 -3518881 -3492571 -3458609 -3442360 -3433902
17532c433902J9056L0564K6520J6798J9573J7905J4053J6274L0784K7407J5770
$$ -3433902 -3414846 -3384282 -3357762 -3340964 -3321391 -3303486 -3289433 -3273159 -3242375 -3214968 -3199198
17521c199198K0862K9086K2432J8799J9113K0021J5550J4448J8486K3862K3393
$$ -3199198 -3178336 -3149250 -3126818 -3108019 -3088906 -3068885 -3053335 -3038887 -3020401 -2996539 -2973146
17510b973146J8364J2410J5087J9430J8494J6985J8382J9506J4523K0859K0132
$$ -2973146 -2954782 -2942372 -2927285 -2907855 -2889361 -2872376 -2853994 -2834488 -2819965 -2799106 -2778974
17499b778974J6968J5277J0937J6892K0230K4354J8694N293J4347J8010J4900
$$ -2778974 -2762006 -2746729 -2735792 -2718900 -2698670 -2674316 -2655622 -2650329 -2635982 -2617972 -2603072
17488b603072J5379J9425J8006J7222K1155J4692J1888J6301J9622J8615K1185
$$ -2603072 -2587693 -2568268 -2550262 -2533040 -2511885 -2497193 -2485305 -2469004 -2449382 -2430767 -2409582
17477b409582K0385K6790K0349R893K0668K1844K4019K9589K3709K6188K7793
$$ -2409582 -2389197 -2362407 -2342058 -2332165 -2311497 -2289653 -2265634 -2236045 -2212336 -2186148 -2158355
17466b158355K0923j1019o7261p9522o0184k4638J4112L0965L4049L3030K5846
$$ -2158355 -2137432 -2148451 -2215712 -2295234 -2355418 -2380056 -2365944 -2334979 -2300930 -2267900 -2242054
17455b242054L0208L5538K7750K9506K4394L1025L0880K4589K0404J5107k5486
$$ -2242054 -2211846 -2176308 -2148558 -2119052 -2094658 -2063633 -2032753 -2008164 -1987760 -1972653 -1998139
17444a998139p0062q1350o3330l4681K312K8717L5152L3448K6914K2582K2846
$$ -1998139 -2068201 -2149551 -2212881 -2247562 -2245250 -2216533 -2181381 -2147933 -2121019 -2098437 -2075591
17433b075591J3355O628J8781J9707J8412P199J1469J4906J7761J4232N842R490
$$ -2075591 -2062236 -2055608 -2036827 -2017120 -1998708 -1991509 -1980040 -1965134 -1947373 -1933141 -1927299 -1917809
17421a917809J5952J1635P689J9262K1353N392O442J1128J5014J2200R703J4446
$$ -1917809 -1901857 -1890222 -1882533 -1863271 -1841918 -1836526 -1830084 -1818956 -1803942 -1791742 -1782039 -1767593
17409a767593R768K724R088J5186J0252J1241Q867J3390N158J3695M923O175J5172
$$ -1767593 -1757825 -1755101 -1746013 -1730827 -1720575 -1709334 -1700467 -1687077 -1681919 -1668224 -1663301 -1657126 -1641954
17396a641954J1909J0251J1034O290P078Q490J3797P224Q127J6568J1222J4335
$$ -1641954 -1630045 -1619794 -1608760 -1602470 -1595392 -1586902 -1573105 -1565881 -1557754 -1541186 -1529964 -1515629
17384a515629J2907J3304J754J0595J9269J2074J5874J4035Q174O926R120Q640
$$ -1515629 -1502722 -1489418 -1487664 -1477069 -1457800 -1445726 -1429852 -1415817 -1407643 -1400717 -1391597 -1382957
17372a382957J2543R952J7025K1871Q032Q473K8171K3723J2330P189J0820J1585
$$ -1382957 -1370414 -1360462 -1343437 -1321566 -1313534 -1305061 -1276890 -1253167 -1240837 -1233648 -1222828 -1211243
17360a211243Q852N116l494M102L565j502K584n099o886l618j768M820P146R966
$$ -1211243 -1202391 -1197275 -1200769 -1196667 -1193102 -1194604 -1192020 -1197119 -1204005 -1207623 -1209391 -1204571 -1197425 -1187459
17346a187459J0486J1682J6452J4558J7018K9389L6904L0938K3330J8025J2442
$$ -1187459 -1176973 -1165291 -1148839 -1134281 -1117263 -1087874 -1050970 -1020032 -996702 -978677 -966235
17335i66235J2756L511j0895l1371m5873m8105m5118l2944j1616j277N370l050
$$ -966235 -953479 -949968 -960863 -992234 -1038107 -1086212 -1131330 -1164274 -1175890 -1177167 -1171797 -1174847
17323a174847j6379k7863k4424j2118N69J2775J5938J0293J2102R822L485J50
$$ -1174847 -1191226 -1219089 -1243513 -1255631 -1255062 -1242287 -1226349 -1216056 -1203954 -1194132 -1190647 -1190497
17311a190497L610N254J2325J3571O257J1633J226m394O814J0451N996L466J7094
$$ -1190497 -1186887 -1181633 -1169308 -1155737 -1149480 -1137847 -1136621 -1141015 -1134201 -1123750 -1117754 -1114288 -1097194
17298a097194J9968J3104J9044J5456J1881K0383K7241K5621J6563J0192L338
$$ -1097194 -1077226 -1064122 -1045078 -1029622 -1017741 -997358 -970117 -944496 -927933 -917741 -914403
17287i14403j5286j6377j4235j3948j9311k1553j7592j1194M806J7326J5045J4418
$$ -914403 -929689 -946066 -960301 -974249 -993560 -1015113 -1032705 -1043899 -1039093 -1021767 -1006722 -992304
17275i92304K1457J9728R227J3546J6805J1317J7478J3231Q466J2995O996J2019
$$ -992304 -970847 -951119 -941892 -928346 -911541 -900224 -882746 -869515 -861049 -848054 -841058 -829039
17263h29039J1168P532R265J2967J0442J982J275Q924J4159Q346J64Q940J3597
$$ -829039 -817871 -810339 -801074 -788107 -777665 -775683 -774408 -765484 -751325 -742979 -742815 -733875 -720278
17250g20278J1382J0578R149J4721J1595Q446Q845J3870J7862J2727M678P301
$$ -720278 -708896 -698318 -689169 -674448 -662853 -654407 -645562 -631692 -613830 -601103 -596425 -589124
17238e89124p06j8579k5889k3430j3055m06J2262J5643J3001M214J1951J3657
$$ -589124 -589830 -608409 -634298 -657728 -670783 -671189 -658927 -643284 -630283 -626069 -614118 -600461
17226f00461J0899L951J3753J1186J1931P578R251N612J0681J605K951J1354R797
$$ -600461 -589562 -585611 -571858 -560672 -548741 -541163 -531912 -526300 -515619 -514014 -511063 -499709 -489912
17213d89912J4616J4157O199O912k56p20P341N897N587J4608J8224N209n067M875
$$ -489912 -475296 -461139 -454940 -448028 -448284 -449004 -441663 -435766 -430179 -415571 -397347 -392138 -397205 -392330
17199c92330J4887J3822J2942J2653J0347J0264M150K904K394J0621J8334R590
$$ -392330 -377443 -363621 -350679 -338026 -327679 -317415 -313265 -310361 -307967 -297346 -279012 -269422
17187b69422N93K840M614M009Q247J2133R811L959J0182Q842M203Q241J6345J2226
$$ -269422 -268829 -265989 -261375 -257366 -249119 -236986 -227175 -223216 -213034 -204192 -199989 -191748 -175403 -163177
17173a63177M249m63m969p817L93J1616J4964J1526J4390J5561R947N158M267
$$ -163177 -158928 -159391 -164360 -172177 -171784 -160168 -145204 -133678 -119288 -103727 -93780 -88622 -84355
17160h4355M169J4012J7274J3241J2688R264M931k796l02l563J836J6543J4534
$$ -84355 -80186 -66174 -48900 -35659 -22971 -13707 -8776 -11572 -11874 -15437 -13601 2942 17476
17147A7476N658Q495J7376J2943P223K480O333J5938J0552J3265J1372J3033J3217
$$ 17476 23134 31629 49005 61948 69171 71651 77984 93922 104474 117739 129111 142144 155361
17134A55361J3863J3857J1425J1222J9741K2678J8582J7386J3602J9468J8755
$$ 155361 169224 183081 194506 205728 225469 248147 266729 284115 297717 317185 335940
17123C35940L379j9067l1692l5322k9348k3703j2909m15K2488L3349K4562J9941
$$ 335940 339319 320252 288560 253238 223890 200187 187278 186863 209351 242700 267262 287203
17111B87203K7248K8377J7866J3926K7486L0248K3869J0961j762j8931l2150l8571
$$ 287203 314451 342828 360694 374620 402106 432354 456223 467184 465422 446491 414341 375770
17099C75770l7894l5122k0210j380K6614K2282K5606J5828K0804K3044J9295J8575
$$ 375770 337876 302754 282544 281164 307778 330060 355666 371494 392298 415342 434637 453212
17087D53212J9698J7488J7717J8342J1532Q695J5980J7651J1174J3039J9661J5311
$$ 453212 472910 490398 508115 526457 537989 546684 562664 580315 591489 604528 624189 639500
17075F39500R318Q434R841O868J3265J4895J4004J3322J8113J9479J8872J6411
$$ 639500 648818 657252 667093 673961 687226 702121 716125 729447 747560 767039 785911 802322
17063H02322J7553J4498J1454J4934J2221J7817J6881J5696J3865J5878J5248
$$ 802322 819875 834373 845827 860761 872982 890799 907680 923376 937241 953119 968367
17052I68367J0996J7073J7895J8438J7699J4140J7734Q565J5016J4958K0945L0242
$$ 968367 979363 996436 1014331 1032769 1050468 1064608 1082342 1090907 1105923 1120881 1141826 1172068
17040A172068K5380J6180J5746K0238K1472K7574K8105K3875J3841J8914K4594
$$ 1172068 1197448 1213628 1229374 1249612 1271084 1298658 1326763 1350638 1364479 1383393 1407987
17029A407987K3988K0309L1571K2439K4988J0224J9444K3483K8211L2047L1197
$$ 1407987 1431975 1452284 1483855 1506294 1531282 1541506 1560950 1584433 1612644 1644691 1675888
17018A675888K6356K1441K5731L6088L3618L1209K8183K1699K1757L7745L8919
$$ 1675888 1702244 1723685 1749416 1785504 1819122 1850331 1878514 1900213 1921970 1959715 1998634
17007A998634K7397L4138L5484L2745L7842L7975L9844K8266L4980M3147L6524
$$ 1998634 2026031 2060169 2095653 2128398 2166240 2204215 2244059 2272325 2307305 2350452 2386976
16996B386976L8324L4739L7786M6492M8718M3803M3613M5901M3043M7861N1555
$$ 2386976 2425300 2460039 2497825 2544317 2593035 2636838 2680451 2726352 2769395 2817256 2868811
16985B868811N2319N6326N7066O6832O7613N8728N9880O1670O5021O1492N9197
$$ 2868811 2921130 2977456 3034522 3101354 3168967 3227695 3287575 3349245 3414266 3475758 3534955
16974C534955P3201Q6485Q4786Q0032Q2648Q3434Q2637R5675J03230R7165J03072
$$ 3534955 3608156 3694641 3779427 3859459 3942107 4025541 4108178 4203853 4307083 4404248 4507320
16963D507320J04783J10692J22504J23066J25522J35513J38766J48503J57886
$$ 4507320 4612103 4722795 4845299 4968365 5093887 5229400 5368166 5516669 5674555
16954E674555J62758J82250J90713J97098K09655K15100K29670K46662K70604
$$ 5674555 5837313 6019563 6210276 6407374 6617029 6832129 7061799 7308461 7579065
16945G579065K89918K78468K57017K51933K90423L57934L92590L77313L91514
$$ 7579065 7868983 8147451 8404468 8656401 8946824 9304758 9697348 10074661 10466175
16936A0466175M65782N73989O70175P18236P68458Q77710J062406J275011J461546
$$ 10466175 10931957 11505946 12176121 12894357 13662815 14540525 15602931 16877942 18339488
16927A8339488J621135J798489J984993K275286K775810L173675K434665j695306
$$ 18339488 19960623 21759112 23744105 26019391 28795201 31968876 34403541 32708235
16919C2708235j0685514j7978691j6705791q812211r16988L460070M070558L532675
$$ 32708235 22022721 4044030 -12661761 -21473972 -22390960 -18930890 -14860332 -11327657
16911a1327657L056350K812461K719192K628404K555208K522129K543977K689000
$$ -11327657 -8271307 -5458846 -2739654 -111250 2443958 4966087 7510064 10199064
16903A0199064L043144L211186J990174k986402j1971696j7585338j4573173o692979
$$ 10199064 13242208 16453394 18443568 15457166 3485470 -14099868 -28673041 -35366020
16895c5366020L10770L494464L584961K934644K342349J905031J599521J386700
$$ -35366020 -35055250 -31560786 -27975825 -25041181 -22698832 -20793801 -19194280 -17807580
16887a7807580J224633J068324Q84024O60043M99107M40075M52472M56613M46728
$$ -17807580 -16582947 -15514623 -14630599 -13970556 -13471449 -13031374 -12578902 -12122289 -11675561
16878a1675561M29112M19448M03969L99702L76705L42422L05111K40305J84919
$$ -11675561 -11246449 -10827001 -10423032 -10023330 -9646625 -9304203 -8999092 -8758787 -8573868
16869h573868J70988J97637K09046K04161J66803J00813O5391J00027J32010J57244
$$ -8573868 -8402880 -8205243 -7996197 -7792036 -7625233 -7524420 -7459029 -7359002 -7226992 -7069748
16859g069748J73003J59365J42282J39675J38664J21450J09088J05065J04963
$$ -7069748 -6896745 -6737380 -6595098 -6455423 -6316759 -6195309 -6086221 -5981156 -5876193
16850e876193J03833R9979R3899Q6727Q1444Q2061P7209P9373P3742P4881O9932
$$ -5876193 -5772360 -5672381 -5578482 -5491755 -5410311 -5328250 -5251041 -5171668 -5097926 -5023045 -4953113
16839d953113P2281O9702P2199O6926O1981N3722M0178M8952M7263M8334N0087
$$ -4953113 -4880832 -4811130 -4738931 -4672005 -4610024 -4556302 -4516124 -4467172 -4419909 -4371575 -4321488
16828d321488N6904N5106M4721M4182M8924M4285M1340L8996L6184L5228L7321
$$ -4321488 -4264584 -4209478 -4164757 -4120575 -4071651 -4027366 -3986026 -3947030 -3910846 -3875618 -3838297
16817c838297M5978M2222M2828L5143L0203L2047K7568K8921L2707L6298K9015
$$ -3838297 -3792319 -3750097 -3707269 -3672126 -3641923 -3609876 -3582308 -3553387 -3520680 -3484382 -3455367
16806c455367K6779L5177L2596K7092L2740K8821J9356K1797K6971J9127K3407
$$ -3455367 -3428588 -3393411 -3360815 -3333723 -3300983 -3272162 -3252806 -3231009 -3204038 -3184911 -3161504
16795c161504J5593K0747K7113K0683K4430J7955K2904L0661K8219K2601K8809
$$ -3161504 -3145911 -3125164 -3098051 -3077368 -3052938 -3034983 -3012079 -2981418 -2953199 -2930598 -2901789
16784b901789J6498J7450J9216J5421R732J7568K0748K5580J5251J6139J5934
$$ -2901789 -2885291 -2867841 -2848625 -2833204 -2823472 -2805904 -2785156 -2759576 -2744325 -2728186 -2712252
16773b712252J6219J3619J7120J5366J7713J7676J9329J3736Q604J2592K2198
$$ -2712252 -2696033 -2682414 -2665294 -2649928 -2632215 -2614539 -2595210 -2581474 -2572870 -2560278 -2538080
16762b538080K1500K1383K4442J2190J2451Q153J9260R835J2197J6505R942Q802
$$ -2538080 -2516580 -2495197 -2470755 -2458565 -2446114 -2437961 -2418701 -2408866 -2396669 -2380164 -2370222 -2361420
16750b361420R156J3307R541P026R460m05J3805K2519K1558K1020J8390R275J0025
$$ -2361420 -2352264 -2338957 -2329416 -2322390 -2312930 -2313335 -2299530 -2277011 -2255453 -2234433 -2216043 -2206768 -2196743
16737b196743N892L452J1380J6287J5029J3962O412J2132J0384O805Q048K551
$$ -2196743 -2190851 -2187399 -2176019 -2159732 -2144703 -2130741 -2124329 -2112197 -2101813 -2095008 -2086960 -2084409
16725b084409P772J0457J1937J3150P609J1545J5489J930N489J1946J0181J1633
$$ -2084409 -2076637 -2066180 -2054243 -2041093 -2033484 -2021939 -2006450 -2004520 -1999031 -1987085 -1976904 -1965271
16713a965271J3795J3767R653N053J198P554R951J0631M141J1106K0796J4334
$$ -1965271 -1951476 -1937709 -1928056 -1923003 -1921805 -1914251 -1904300 -1893669 -1889528 -1878422 -1857626 -1843292
16701a843292Q042p04n65P070L619M294J2294R093J2227J4685K42P618N697N490
$$ -1843292 -1835250 -1835954 -1836519 -1829449 -1825830 -1821536 -1809242 -1800149 -1787922 -1773237 -1772995 -1765377 -1759680 -1754190
16687a754190N163N034K683l03P566J7057P206P443Q465L459O383J5012Q030N579
$$ -1754190 -1749027 -1743993 -1741310 -1741613 -1734047 -1716990 -1709784 -1702341 -1693876 -1690417 -1684034 -1669022 -1660992 -1655413
16673a655413L051R32R852J1575P210Q00J203m399N122O703L310K058N858N106
$$ -1655413 -1652362 -1651430 -1641578 -1630003 -1622793 -1621993 -1620790 -1625189 -1620067 -1613364 -1610054 -1607996 -1602138 -1597032
16659a597032Q092J3460N922M976K513k16R026Q993L951K62R164M908M956N32
$$ -1597032 -1588940 -1575480 -1569558 -1564582 -1562069 -1562285 -1553259 -1544266 -1540315 -1540053 -1530889 -1525981 -1521025 -1520493
16645a520493N028R001O496N304J1201N100o142N735K321J453O543J1355Q980
$$ -1520493 -1515465 -1506464 -1499968 -1494664 -1483463 -1478363 -1484505 -1478770 -1476449 -1474996 -1468453 -1457098 -1448118
16632a448118N206M587J2051O962L451J034J855R743J6824O053p551j021M09J3162
$$ -1448118 -1442912 -1438325 -1426274 -1419312 -1415861 -1414827 -1412972 -1403229 -1386405 -1380352 -1387903 -1388924 -1388515 -1375353
16618a375353M051k982K643N964K516q29k3J267L489L245P653J5452O309J222
$$ -1375353 -1371302 -1374284 -1371641 -1365677 -1363161 -1363990 -1364013 -1362746 -1359257 -1356012 -1348359 -1332907 -1326598 -1325376
16604a325376M038M967P60R504P770L078M558M888J6P679M530N374L597l154k913
$$ -1325376 -1321338 -1316371 -1315611 -1306107 -1298337 -1295259 -1290701 -1285813 -1285797 -1278118 -1273588 -1268214 -1264617 -1267771 -1270684
16589a270684j759o97R96N893P578R59Q8J3203Q911R610J671K521K990J401j117
$$ -1270684 -1272443 -1273140 -1272144 -1266251 -1258673 -1257714 -1257626 -1244423 -1235512 -1225902 -1224231 -1221710 -1218720 -1217319 -1218436
16574a218436L170M515Q945N607P183L513N352J1820r19L701J575l820l012K545
$$ -1218436 -1215266 -1210751 -1201806 -1196199 -1189016 -1185503 -1180151 -1168331 -1169250 -1165549 -1163974 -1167794 -1170806 -1168261
16560a168261R075J1309Q854m629l380K77K558O817R128O284j165K91L551J455
$$ -1168261 -1159186 -1147877 -1139023 -1143652 -1147032 -1146755 -1144197 -1137380 -1128252 -1121968 -1123133 -1122842 -1119291 -1117836
16546a117836P337P831P239Q353r789k010m379K979O964Q324N381J16Q15K531
$$ -1117836 -1110499 -1102668 -1095429 -1087076 -1096865 -1098875 -1103254 -1100275 -1093311 -1084987 -1079606 -1079490 -1078675 -1076144
16532a076144J744K302P211O552O381L47p254K291J0187J414L570M257j208K60
$$ -1076144 -1074400 -1072098 -1064887 -1058335 -1051954 -1051607 -1058861 -1056570 -1046383 -1044969 -1041399 -1037142 -1038350 -1038090
16518a038090M398R93L525q22N464M407N636L081K006j121j250O385j034L572
$$ -1038090 -1033692 -1032699 -1029174 -1029996 -1024532 -1020125 -1014489 -1011408 -1009402 -1010523 -1011773 -1005388 -1006422 -1002850
16504a002850j95J0816O611M962q21M176K509m193K168K536J378P086J0656L367
$$ -1002850 -1003045 -992229 -985618 -980656 -981477 -977301 -974792 -978985 -976817 -974281 -972903 -965817 -955161 -951794
16490i51794J761N966r76k389l126L438L066J570n089N289Q264J3230K948j1677
$$ -951794 -950033 -944067 -945043 -947432 -950558 -947120 -944054 -942484 -947573 -942284 -934020 -920790 -917842 -929519
16476i29519M260M254Q88K941N461M5k899m089O458L537J333L067K643M721P844
$$ -929519 -925259 -921005 -920117 -917176 -911715 -911670 -914569 -918658 -912200 -908663 -907330 -904263 -901620 -896899 -889055
16461h89055R093L729j281j062j147J297J2113O967K045o059Q20k602j58J125
$$ -889055 -879962 -876233 -877514 -878576 -879723 -878426 -866313 -859346 -857301 -863360 -862540 -865142 -865300 -864175
16447h64175J3480N953J580j49J406Q99O374J465j959n287r37j266L579R891Q57
$$ -864175 -850695 -844742 -843162 -843311 -841905 -841006 -834632 -833167 -835126 -840413 -841350 -842616 -839037 -829146 -828289
16432h28289J178N869O978K951M812N545J475j645m824J877L985K176P146Q480
$$ -828289 -827111 -821242 -814264 -811313 -806501 -800956 -799481 -801126 -805950 -804073 -800088 -797912 -790766 -782286
16418g82286K30N042M05l115p664q18N940K56N132O308J0466O570p27n0J638j496
$$ -782286 -782056 -777014 -776609 -779724 -787388 -788206 -782266 -782010 -776878 -770570 -760104 -753534 -754261 -754311 -752673 -754169
16402g54169K532J762N339N929L77L063Q099K631R25L47K830M931Q704r13M467
$$ -754169 -751637 -749875 -744536 -738607 -738230 -735167 -727068 -724437 -723512 -723165 -720335 -715404 -706700 -707613 -703146
16387g03146O477P096L513M779K041R930P871R109N432J296J2627L048J1475J1359
$$ -703146 -696669 -689573 -686060 -681281 -679240 -669310 -661439 -652330 -646898 -645602 -632975 -629927 -618452 -607093
16373f07093J3383J5639R380K1407J0579k3021o6890r6626o9243l1720Q58J5153
$$ -607093 -593710 -578071 -568691 -547284 -536705 -559726 -626616 -723242 -792485 -824205 -823347 -808194
16361h08194K2832K4175K3467J6204J6186J6630J5502J4446J6415J1892J2665
$$ -808194 -785362 -761187 -737720 -721516 -705330 -688700 -673198 -658752 -642337 -630445 -617780
16350f17780J7951m183k9430p4514q5559o1464k1492L469J7608K0497J5491J7004
$$ -617780 -599829 -604012 -633442 -707956 -793515 -854979 -876471 -873002 -855394 -834897 -819406 -802402
16338h02402J2237J1824P061O773Q566P722M112M549Q435O916L629K96n33O039
$$ -802402 -790165 -778341 -771280 -764507 -755941 -748219 -744107 -739558 -731123 -724207 -720578 -720282 -720815 -714776
16324g14776P700N260M099J093N998M89J34L450R112J3419j0746l209M370k032
$$ -714776 -707076 -701816 -697717 -696624 -690626 -690137 -690003 -686553 -677441 -664022 -674768 -677977 -673607 -675639
16310f75639L597J0779N815M832r91k256Q203Q803m002l220m26l309L015O626
$$ -675639 -672042 -661263 -655448 -650616 -651607 -653863 -645660 -636857 -640859 -644079 -644505 -647814 -644799 -638173
16296f38173L845J388j138K180L250L197Q67K775K661m440r65Q492Q289qm556
$$ -638173 -634328 -632940 -634078 -631898 -628648 -625451 -624584 -621809 -619148 -623588 -624553 -616061 -607772 -607780 -612336
16281f12336M03l73P82P253L711P248L295j1857m025J1121M753j723k146q511
$$ -612336 -611933 -612306 -611524 -604271 -600560 -593312 -590017 -601874 -605899 -594778 -590025 -591748 -593894 -602405
16267f02405M505P624K079N519Q651N177N664k764j122o89K8J332m416J867J264
$$ -602405 -597900 -590276 -588197 -582678 -574027 -568850 -563186 -565950 -567072 -567761 -567733 -566401 -570817 -568950 -567686
16252e67686P593R04m917L946P714j501k632J495k954P490M16o464q364M442L824
$$ -567686 -560093 -559189 -564106 -560160 -552446 -553947 -556579 -555084 -558038 -550548 -550132 -556596 -564960 -560518 -556694
16237e56694J735L031L862R137j513P672R13K175K022k586k687m499O343M669
$$ -556694 -554959 -551928 -548066 -538929 -540442 -532770 -531857 -529682 -527660 -530246 -532933 -537432 -531089 -526420
16223e26420J453J961k216K85p06k968R16M88O995J2622L641j435P616P285p972
$$ -526420 -524967 -523006 -525222 -524937 -525643 -528611 -527695 -527207 -520212 -507590 -503949 -505384 -497768 -490483 -498455
16208d98455m160l914M704O714k271j533L546O879K33k42J922l455M760K989l453
$$ -498455 -502615 -506529 -501825 -495111 -497382 -498915 -495369 -488490 -488257 -488499 -486577 -490032 -485272 -482283 -485736
16193d85736p254n1k074J934O661L93M003K994P924M3L860L398k902k657L2K605
$$ -485736 -492990 -493041 -495115 -493181 -486520 -486127 -482124 -479130 -471206 -471163 -467303 -463905 -466807 -469464 -469432 -466827
16177d66827K506M569N132m219o189K437M524N358O484J72M498m42j0419p192
$$ -466827 -464321 -459752 -454620 -458839 -465028 -462591 -458067 -452709 -446225 -446053 -441555 -441997 -452416 -459608
16163d59608K352L647J462M232N396J98p373q001n644J716O229K197M666O621
$$ -459608 -457256 -453609 -452147 -447915 -442519 -442321 -449694 -457695 -463339 -461623 -455394 -453197 -448531 -441910
16149d41910K564M597K469k953K476N504N629O364n411l124l66O688J897L368
$$ -441910 -439346 -434749 -432280 -435233 -432757 -427253 -421624 -415260 -420671 -423795 -424161 -417473 -415576 -412208
16135d12208l583q411k799L51J0j12L446M982R94M685P938m230J331j786l9L420
$$ -412208 -415791 -424202 -427001 -426650 -426640 -426752 -423306 -418324 -417330 -412645 -404707 -408937 -407606 -409392 -409431 -406011
16119d06011L075J823J344K830N85J643K675K768j908j218o13p59p72L137L522
$$ -406011 -402936 -401113 -399769 -396939 -396354 -394711 -392036 -389268 -391176 -392394 -393007 -393766 -394538 -391401 -387879
16104c87879n013J245R844J506j884L324o4k327k133o458j523O303q77m988R121
$$ -387879 -392892 -391647 -381803 -380297 -382181 -378857 -378921 -381248 -383381 -389839 -391362 -385059 -385936 -390924 -381803
16089c81803J4951N738p62q13k28J060P74m21J776j765L831j58K8m1k125L156
$$ -381803 -366852 -361114 -361876 -362689 -362917 -361857 -361083 -361504 -359728 -361493 -357662 -357820 -357792 -357833 -359958 -356802
16073c56802P214n15l863K64l223o3K45K72J0533O15l033l922N638J0971M737
$$ -356802 -349588 -350103 -353966 -353702 -356925 -356988 -356743 -356471 -345938 -345323 -348356 -352278 -346640 -335669 -330932
16058c30932j222l157N725j886l634N803J48n262L62L239k426l972J574O130j245
$$ -330932 -332154 -335311 -329586 -331472 -335106 -329303 -329155 -334417 -334055 -330816 -333242 -337214 -335640 -329510 -330755
16043c30755P34m99l14R461L845j667q66O20j955J009L550K927k55P77L075M766
$$ -330755 -330021 -330520 -330834 -321373 -317528 -319195 -320061 -319441 -321396 -320387 -316837 -313910 -314165 -313388 -310313 -305547
16027c05547L851q55J254J72l555J39J82J304O223k385o218L785M525K631l466
$$ -305547 -301696 -302551 -301297 -301125 -304680 -304541 -304359 -303055 -296832 -299217 -305435 -301650 -297125 -294494 -297960
16012b97960j453N867J001J690K653J637l157O845M400R83n097k676L288M440
$$ -297960 -299413 -293546 -292545 -290855 -288202 -286565 -289722 -282877 -278477 -277494 -282591 -285267 -281979 -277539
15998b77539q32o129j453J0185O197K11k382q263q102N422N687M184k220P06L986
$$ -277539 -278371 -284500 -285953 -275768 -269571 -269360 -271742 -280005 -288107 -282685 -276998 -272814 -275034 -274328 -270342
15983b70342j99K400O425L982N469j710l92L499L492p94j796m604K300m710K364
$$ -270342 -270541 -268141 -261716 -257734 -252265 -253975 -254367 -250868 -247376 -248170 -249966 -254570 -252270 -256980 -254616
15968b54616k188l367J498L266L443L248Q806L357j784L009j860R76L140l870
$$ -254616 -256804 -260171 -258673 -255407 -251964 -248716 -239910 -236553 -238337 -235328 -237188 -236212 -233072 -236942
15954b36942l91M760O03l73M175k045k597L663k988K785k797l580r30L134L121
$$ -236942 -237333 -232573 -231970 -232343 -228168 -230213 -232810 -229147 -232135 -229350 -232147 -235727 -236657 -233523 -230402
15939b30402o839n370M210O34k700l882J595K925j426L981K683Q549N872Q91J648
$$ -230402 -237241 -242611 -238401 -237767 -240467 -244349 -242754 -239829 -241255 -237274 -234591 -226042 -220170 -219279 -217631
15924b17631M319q243j298l375K164L388P481J467M218P97K24m35k020j610O606
$$ -217631 -213312 -221555 -222853 -226228 -224064 -220676 -213195 -211728 -207510 -206713 -206489 -206924 -208944 -210554 -203948
15909b03948R227M045n429p029p86n216r87L789O197o81k312P91L361j303j559
$$ -203948 -194721 -190676 -196105 -203134 -203920 -209136 -210123 -206334 -200137 -200818 -203130 -202339 -198978 -200281 -201840
15894b01840j925O068O429M337r94k091k451O927j711n01J1381L340n989J038
$$ -201840 -203765 -197697 -191268 -186931 -187925 -190016 -192467 -185540 -187251 -187752 -176371 -173031 -179020 -177982
15880a77982j119J054m755j06j070j987j948O401N099R036K715N065M98p036q67
$$ -177982 -179101 -178047 -182802 -182908 -183978 -185965 -187913 -181512 -176413 -167377 -164662 -159597 -159099 -166135 -167002
15865a67002k196n585k335J1787K866k5M248L039M842J18p715m006O933M615m099
$$ -167002 -169198 -174783 -177118 -165331 -162465 -162490 -158242 -155203 -150361 -150243 -157958 -161964 -155031 -150416 -154515
15850a54515m231K013j261K238K52L362k011j816Q77N802P805m752o215K536j327
$$ -154515 -158746 -156733 -157994 -155756 -155504 -152142 -154153 -155969 -155092 -149290 -141485 -146237 -152452 -149916 -151243
15835a51243P661Q51K10k286J627n70O09M307l937L154O258M560J783l400n496
$$ -151243 -143582 -142731 -142521 -144807 -143180 -143750 -143141 -138834 -142771 -139617 -133359 -128799 -127016 -130416 -135912
15820a35912n749K886L490l117k768L262N971L019j521P949K89K555Q92K419j434
$$ -135912 -141661 -138775 -135285 -138402 -141170 -137908 -131937 -128918 -130439 -122490 -122201 -119646 -118754 -116335 -117769
15805a17769k171P075p981q824j133M487R285n304k515M591J449J760O14k415
$$ -117769 -119940 -112865 -120846 -129670 -130803 -126316 -117031 -122335 -124850 -120259 -118810 -117050 -116436 -118851
15791a18851k754J455j85j161J001L924L263k418J687O953N743L812Q8L308P60
$$ -118851 -121605 -120150 -120335 -121496 -120495 -116571 -113308 -115726 -114039 -107086 -101343 -97531 -97443 -94135 -93375
15776i3375O61J737m756j97N84o12J392N953k952p12J71J34k236J307J607m104
$$ -93375 -92714 -90977 -95733 -95930 -95346 -95958 -94566 -88613 -91565 -92277 -92106 -91972 -94208 -92901 -91294 -95398
15760i5398L07N200P458M149j364k741J221L877O0o626k20K940j240m107O467
$$ -95398 -95091 -89891 -82433 -78284 -79648 -82389 -81168 -77291 -77231 -83857 -84077 -81137 -82377 -86484 -80017
15745h0017R60J55L081L23K945L341O809L536p840o263M545O964k854q4k10k360
$$ -80017 -79057 -78902 -75821 -75498 -72553 -69212 -62403 -58867 -66707 -72970 -68425 -61461 -64315 -64399 -64609 -66969
15729f6969R12P07J279k125R204J0705m878n781J338J065K418J261j640l302M789
$$ -66969 -66057 -65350 -64071 -66196 -56992 -46287 -51165 -56946 -55608 -54543 -52125 -50864 -52504 -55806 -51017
15714e1017N586l7o669Q9O892L443o326p657J626M93N349O01K310j63J496j749
$$ -51017 -45431 -45468 -52137 -52048 -45156 -41713 -48039 -55696 -54070 -53577 -48228 -47627 -45317 -45480 -43984 -45733
15698d5733K281K817j538n63l431M381J339N670j305l617j396Q219K163l751K415
$$ -45733 -43452 -40635 -42173 -42736 -46167 -41786 -40447 -34777 -36082 -39699 -41095 -32876 -30713 -34464 -32049
15683c2049N2p12N861J953m017r08k270P56K754K198J020m49O317l425J219n774
$$ -32049 -31997 -32709 -26848 -24895 -28912 -29820 -32090 -31334 -28580 -26382 -25362 -25811 -19494 -22919 -21700 -27474
15667b7474k454P33N193J871J043O13K003l917l730N340Q777L761N475j447j273
$$ -27474 -29928 -29195 -24002 -22131 -21088 -20475 -18472 -22389 -26119 -20779 -12002 -8241 -2766 -4213 -5486
15652e486R27N890K38l25K247n282m829k115P290M493L40J279j766n128L966k10
$$ -5486 -4559 1331 1569 1244 3491 -1791 -6620 -8735 -1445 3048 3388 4667 2901 -2227 1739 1529
15636A529J991r11J466J380M492j138p636n3J840J146O112L869m127m060K736
$$ 1529 3520 2609 4075 5455 9947 8809 1173 1120 2960 4106 10218 14087 9960 5900 8636
15621H636N855M056o033o907r2R553P604j159l382m631n9j22K396N115K160j910
$$ 8636 14491 18547 12514 5607 5515 15068 22672 21513 18131 13500 13441 13319 15715 20830 22990 21080
15605B1080j986m010n388j112K050j45J710O129N905Q28J613j75L046j79n636
$$ 21080 19094 15084 9696 8584 10634 10489 12199 18328 24233 25061 26674 26499 29545 29366 23730
15590B3730J764M275L066J772O284K688j400l459o71l503M513Q097o559N529J453
$$ 23730 25494 29769 32835 34607 40891 43579 42179 38720 38049 34546 39059 47156 40597 46126 47579
15575D7579L30n81Q53k768M815o850j601K522O20K964n345o70K105L752M347q85
$$ 47579 47909 47328 48181 45413 50228 43378 41777 44299 44919 47883 42538 41868 43973 47725 52072 51187
15559E1187n244P948O45L404J589m481k190K596k41J506j637L340k745L924J091
$$ 51187 45943 53891 54536 57940 59529 55048 52858 55454 55213 56719 55082 58422 55677 59601 60692
15544F0692o464O939L492L28m97L447j025N337M240n262m037M305l591J852K395
$$ 60692 54228 61167 64659 64987 64490 67937 66912 72249 76489 71227 67190 71495 67904 69756 72151
15529G2151J478j387J98Q07J675L246k787N53J913N719M600Q07n035l954L657
$$ 72151 73629 72242 72440 73247 74922 78168 75381 75934 77847 83566 88166 88973 83938 79984 83641
15514H3641N3k373o414J623M769P170M813l135L664R386J4j0610o681J030N882
$$ 83641 83694 81321 74907 76530 81299 88469 93282 90147 93811 103197 103211 92601 85920 86950 92832
15499I2832L949K930o930L613K305J617P80K60k476j998j421p516k340P568L363
$$ 92832 96781 99711 92781 96394 98699 100316 101096 101356 98880 96882 95461 87945 85605 93173 96536
15484I6536J190M279O919k75K846L956l960j401L237j318k583N941k033j416J563
$$ 96536 97726 102005 108924 108649 111495 115451 111491 110090 113327 112009 109426 115367 113334 111918 113481
15469A13481k840J125m83r66O400L056O68j464o08N659J020k983O17K389L856
$$ 113481 110641 111766 111283 110317 116717 119773 120441 118977 118369 124028 125048 122065 122682 125071 128927
15454A28927Q266J975N860o151l295J254j683j760n35J016R52P874L339K373k538
$$ 128927 137193 139168 145028 138877 135582 136836 135153 133393 132858 133874 134826 142700 146039 148412 145874
15439A45874P47J937m850M067L23J754p339l835J640Q22M746K225k889j679k724
$$ 145874 146621 148558 143708 147775 148098 149852 142513 138678 140318 141140 145886 148111 145222 143543 140819
15424A40819k76j642J937M68K434P713J0784m190p450j403r65J752K660n083o38
$$ 140819 140543 138901 140838 141306 143740 151453 162237 158047 150597 149194 148229 149981 152641 147558 146920
15409A46920J217N177M372o013J7N652J614k011J443p932M13O688P648L51l613
$$ 146920 148137 153314 157686 151673 151690 157342 158956 156945 158388 150456 150869 157557 165205 165556 161943
15394A61943M361j010K647l85l340O724K140K92R29P354N441m149m470k707j63
$$ 161943 166304 165294 167941 167556 164216 170940 173080 173372 174301 181655 187096 182947 178477 175770 175607
15379A75607m317n547K129P291J933M181R95p466j147J000Q774o19q09J066r10
$$ 175607 171290 165743 167872 175163 177096 181277 182272 174806 173659 174659 183433 182814 182005 183071 182161
15364A82161O18O482L54j281Q26l070j888J828K138L508o785L989P420P141l64
$$ 182161 182779 189261 189615 188334 189160 186090 184202 186030 188168 191676 184891 188880 196300 203441 203077
15349B03077j806m793o532j378k111R141j789l265M763L294M239J452K47K14J174
$$ 203077 201271 196478 189946 188568 186457 195598 193809 190544 195307 198601 202840 204292 204539 204753 205927
15334B05927l766j807j872L798o78l725N727P678N060k056j339k316j57k296k147
$$ 205927 202161 200354 198482 202280 201602 197877 203604 211282 216342 214286 212947 210631 210474 208178 206031
15319B06031K805J677J135K686q48K385l597m359n31J832K378q17j43m09O438
$$ 206031 208836 210513 211648 214334 213486 215871 212274 207915 207384 209216 211594 210777 210634 210225 216663
15304B16663J834K429m101k063O334L591j999K077M034k481q822M989M416Q85
$$ 216663 218497 220926 216825 214762 221096 224687 222688 224765 228799 226318 217496 222485 226901 227786
15290B27786o586J1223J6383j143p540K345j104k764o90k346k752M499N186Q233
$$ 227786 221200 232423 248806 247663 240123 242468 241364 238600 237910 235564 232812 237311 242497 250730
15276B50730K406l31J052P24n46J017m654m467q504p24L323J118R044P638L240
$$ 250730 253136 252805 253857 254581 254035 255052 250398 245931 237427 236703 240026 241144 250188 257826 261066
15261B61066l941k136m720p076o026k438Q261j518Q892j250r268j666J0956J8326
$$ 261066 257125 254989 250269 243193 237167 234729 242990 241472 250364 249114 239846 238180 249136 267462
15247B67462M910m352m619p179K4N693r61K381K617M325M150M462m27J754q11
$$ 267462 272372 268020 263401 256222 256246 261939 260978 263359 265976 270301 274451 278913 278486 280240 279429
15232B79429k444M90L042j949K158j95M4m168j058l903M603P895Q988K420m678
$$ 279429 276985 277475 280517 278568 280726 280531 280575 276407 275349 271446 276049 283944 292932 295352 290674
15217B90674q351L030J1326k92k513o200J166P004k826J463j75l759Q591M062
$$ 290674 282323 285353 296679 296387 293874 287674 288840 295844 293018 294481 294306 290547 299138 303200
15203C03200m278M271K637m152l583j460N824K067k808l687L956K84L044K77l499
$$ 303200 298922 303193 305830 301678 298095 296635 302459 304526 301718 298031 301987 302271 305315 305592 302093
15188C02093J652P439R67O394J718m645p057Q00k940k197M623L560K561J165j373
$$ 302093 303745 311184 312151 318545 320263 315618 308561 309361 306421 304224 308847 312407 314968 316133 314760
15173C14760O830k904m358L945M624K827l845P63L41Q69J062o771r27O929j467
$$ 314760 321590 318686 314328 318273 322897 325724 321879 322642 322983 323852 324914 318143 317216 324145 322678
15158C22678m068o212J0771O256l795j074L085O329J230j307J819l75n51L542
$$ 322678 318610 312398 323169 329425 325630 324556 327641 333970 335200 333893 335712 335337 334786 338328
15144C38328K345q505O49P788K024J14J121O189L115j981q319M32J276k374j127
$$ 338328 340673 332168 332817 340605 342629 342743 343864 350053 353168 351187 342868 343300 344576 342202 341075
15129C41075j097K853L111j370m016K769L679P66L597J824L143M963k157m621
$$ 341075 339978 342831 345942 344572 340556 343325 347004 347770 351367 353191 356334 361297 359140 354519
15115C54519l042j647O052J309j609Q481j237n889K530K705m106M983L983r43
$$ 354519 351477 349830 355882 357191 355582 364063 362826 356937 359467 362172 358066 363049 367032 366089
15101C66089n590n651K613J2278N081l697K472Jr686l755R67K702r73K750l444
$$ 366089 360499 354848 357461 369739 374820 371123 373595 373596 363910 360155 361122 363824 362851 365601 362157
15086C62157K59K747N00o573L532P604O111n057j687K828O941o303l184l64P184
$$ 362157 362416 365163 365663 359090 362622 370226 376337 371280 369593 372421 379362 373059 369875 369511 376695
15071C76695M281m262o585P99P886O280p123j445M189P057L65N901k0J0809Q573
$$ 376695 380976 376714 370129 370928 378814 385094 377971 376526 380715 387772 388137 394038 394018 404827 413400
15056D13400m960p209L275J121l381j219K183O625L833n305n284j422L779M97
$$ 413400 408440 401231 404506 405627 402246 401027 403210 409835 413668 408363 403079 401657 405436 405933
15042D05933l308l783j960L464k758K149j913k723j269M749J2995O676k032J692
$$ 405933 402625 398842 396882 400346 397588 399737 397824 395101 393832 398581 411576 418252 416220 417912
15028D17912J43j613j970K595j511k519l475J641O755R934k591l09R81J71K413
$$ 417912 418055 416442 414472 417067 415556 413037 409562 411203 417958 427892 425301 424992 425973 426144 428557
15013D28557R96m911P50o64J778J103m954L586J676R115L198l172k193J2037p50
$$ 428557 429553 424642 425392 424728 426506 427609 422655 426241 427917 437032 440230 437058 434865 446902 446152
14998D46152N079L589j398K132k987R47j703J146L929N353q073m397N168o61j493
$$ 446152 451231 454820 453422 455554 452567 453514 451811 452957 456886 462239 454166 449769 454937 454276 452783
14983D52783K18l81K899L998m806k6j834k990L265J929l47Q497L182k573o507
$$ 452783 453001 452620 455519 459517 454711 454685 452851 449861 453126 455055 454708 463205 466387 463814 457307
14968D57307o04L363L238L213L772N050N424m725o221K481M553O345L86r235J907
$$ 457307 456703 460066 463304 466517 470289 475339 480763 476038 469817 472298 476851 483196 483582 474347 476254
14953D76254K706M198j322l398l349j094L338k902p844m35J3550R947l334J97
$$ 476254 478960 483158 481836 478438 475089 473995 477333 474431 466587 466152 479702 489649 486315 486512
14939D86512N888o077n189L405k144K976O568j114K550M894m23l733o782n016
$$ 486512 492400 486323 481134 484539 482395 485371 491939 490825 493375 498269 497846 494113 487331 482315
14925D82315J121O741K924M929l090n476L434P100N059M173j957K64J651J618
$$ 482315 483436 490177 493101 498030 494940 489464 492898 499998 505057 509230 507273 507537 509188 510806
14911E10806L871R02L68m037R43j50L198k656J396P70J048L193J713m330L530
$$ 510806 514677 515579 515947 511910 512853 512703 515901 513245 514641 515411 516459 519652 521365 517035 520565
14896E20565O258j908k13L275J110Q47J349J819L366O53l346R99K239L537J288
$$ 520565 526823 524915 524702 527977 529087 529934 531283 533102 536468 537121 533775 534774 537013 540550 541838
14881E41838j145m090L35N408r45m402m183L141J102J458J194k866l608N125M619
$$ 541838 540693 536603 536938 542346 541401 536999 532816 535957 537059 538517 539711 536845 533237 538362 542981
14866E42981k659P48K115K389j260O469j359k808L887j602o66P446J203j898p
$$ 542981 540322 541070 543185 545574 544314 550783 549424 546616 550503 548901 548235 555681 556884 554986 554979
14851E54979J450N847M841j0664J435O764M129n510l391q72j825l195O133M719
$$ 554979 556429 562276 567117 556453 557888 564652 568781 563271 559880 559008 557183 553988 560121 564840
14837E64840O22K656q89M359K926k014J299M162L905m6K655K924l612j688j495
$$ 564840 565462 568118 567229 571588 574514 572500 573799 577961 581866 581820 584475 587399 583787 582099 580604
14822E80604j180K517L853M006R54N223j145n135n598J71M256K324J551J661j85
$$ 580604 579424 581941 585794 589800 590754 595977 594832 589697 584099 584270 588526 590850 592401 594062 593877
14807E93877l80n487m216O471J833N29m94K346P907K579k448J748q26o620N512
$$ 593877 593497 588010 583794 590265 592098 592627 592133 594479 602386 604965 602517 604265 603439 596819 602331
14792F02331L525L01J967M313J90P88L822L122m107j509j747K203K953P61O11
$$ 602331 605856 606157 608124 612437 612627 613415 617237 620359 616252 614743 612996 615199 618152 618913 619524
14777F19524J02P815O692K765l173n501k406m805l23L514l107q94M950R134K436
$$ 619524 619626 627441 634133 636898 633725 628224 625818 621013 620690 624204 621097 620203 625153 634287 636723
14762F36723l132O13N074P313M021L715L70m066r238m689J794l037J034Q241J794
$$ 636723 633591 634204 639278 646591 650612 654327 654697 650631 641393 636704 638498 635461 636495 644736 646530
14747F46530L078N51m65k445J276P990N145m155j194l599l862K306k136R389O998
$$ 646530 649608 650159 649694 647249 648525 656515 661660 657505 656311 652712 648850 651156 649020 658409 665407
14732F65407k257q415N339J772m803N16L986p61L327O226P323J808K496M37q579
$$ 665407 663150 654735 660074 661846 657043 657559 661545 660784 664111 670337 677660 679468 681964 682401 673822
14717F73822o028J467n044j793M336J4762N770m172R63J131K631N819j203o275
$$ 673822 667794 669261 664217 662424 666760 681522 687292 683120 684083 685214 687845 693664 692461 686186
14703F86186o155j357L685L808K061J634L209J179J109K384K573m578k782k148
$$ 686186 680031 678674 682359 686167 688228 689862 693071 694250 695359 697743 700316 695738 692956 690808
14689F90808M714Q798k43k175P814J278p828j49L293L92M650J054O5p70J035Q547
$$ 690808 695522 704320 704077 701902 709716 710994 703166 703017 706310 706702 711352 712406 712471 711701 712736 721283
14673G21283m544l860L118K880j394P06Q14J885L182K770K724K673J385n029R415
$$ 721283 716739 712879 715997 718877 717483 718189 719003 720888 724070 726840 729564 732237 733622 728593 738008
14658G38008m71k563j207k959k937l428K869j571J752r44K486K887J3101J0033
$$ 738008 737537 734974 733767 730808 727871 724443 727312 725741 727493 726549 729035 731922 745023 755056
14644G55056k955k309p175l099j291M660J64P67J375k60K074j526p938K915J1557
$$ 755056 752101 749792 742617 739518 738227 742887 743051 743818 745193 744933 747007 745481 737543 740458 752015
14629G52015O934l478r80k257l059k66P594L366j333L015j439Pn4k383r70Q864
$$ 752015 758949 755471 754491 752234 749175 748909 756503 759869 758536 761551 760112 760119 760065 757682 756712 765576
14613G65576j527J237L222N318L26R10K296m28P449j193L765J0060j548p837p188
$$ 765576 764049 765286 768508 773826 774152 775062 777358 776930 784379 783186 786951 797011 795463 787626 780438
14598G80438M340l108M998J370n50k43q05J660j578j746L997n507K479M546J512
$$ 780438 784778 781670 786668 788038 787488 787245 786440 788100 786522 784776 788773 783266 785745 790291 791803
14583G91803O132P751K341K88l502L114N952K617R259J877J339n53m393O739O491
$$ 791803 797935 805686 808027 808315 804813 807927 813879 816496 825755 827632 828971 828418 824025 830764 837255
14568H37255K696K652r125K248J969l754K081M95j590K644N130K056n481l662
$$ 837255 839951 842603 833478 835726 837695 833941 836022 836517 834927 837571 842701 844757 839276 835614
14554H35614o061L205j282m848m306k144L580k050K479q628k55N341K335k324
$$ 835614 829553 832758 831476 826628 822322 820178 823758 821708 824187 815559 815304 820645 822980 820656
14540H20656N95L449j273K715k18K033Q153j7j165L766J015j780O30r79J212k669
$$ 820656 821251 824700 823427 826142 825924 827957 836110 836093 834928 838694 839709 837929 838559 837580 838792 836123
14524H36123k388J335l933K497M908k893L479J0222O811O331P176J714m313P381
$$ 836123 833735 835070 831137 833634 838542 835649 839128 849350 856161 862492 869668 871382 867069 874450
14510H74450L124j06l026j327J215J39j724n156j529o06N696Q437p53L046M870
$$ 874450 877574 877468 874442 873115 874330 874469 872745 867589 866060 865454 871150 879587 878834 881880 886750
14495H86750K015J1272n322P04Q365k377K493K819J02l037J1133Q176n244k634
$$ 886750 888765 900037 894715 895419 903784 901407 903900 906719 906821 903784 914917 923093 917849 915215
14481I15215m255m707Q248O982j855q437K904L584j894j718L92n802N145N154
$$ 915215 910960 906253 914501 921483 919628 911191 914095 917679 915785 914067 914459 908657 913802 918956
14467I18956J337J353N441N283L895N110J738n542p268o28L737L375K252K324
$$ 918956 920293 921646 927087 932370 936265 941375 943113 937571 930303 929675 933412 936787 939039 941363
14453I41363O570J226J782k773L407Q26R80O619N32J408p82l625Q222N80l681
$$ 941363 947933 949159 950941 948168 951575 952401 953381 960000 960532 961940 961158 957533 965755 966335 962654
14438I62654N400M872M198K934N579j433j473K834K275m646l001q99O525L548
$$ 962654 968054 972926 977124 980058 985637 984204 982731 985565 987840 983194 980193 979294 985819 989367
14424I89367o452K830N954P75l70K59j437j462j060J1978Q841l103l622k762n512
$$ 989367 982915 985745 991699 992474 992104 992363 990926 989464 988404 1000382 1009223 1006120 1002498 999736 994224
14409I94224O495O186J037NN163P064M577k752J530K428J797r28n683j216j491
$$ 994224 1000719 1006905 1007942 1007947 1013110 1020174 1024751 1021999 1023529 1025957 1027754 1026826 1021143 1019927 1018436
14394A018436P318L120k319k048N455J3441N260J654j237k334L362R132N465J814
$$ 1018436 1025754 1028874 1026555 1024507 1029962 1043403 1048663 1050317 1049080 1046746 1050108 1059240 1064705 1066519
14380A066519m26P68M313L911j429K546l814n780J421O303J283M825O675j669
$$ 1066519 1066093 1066861 1071174 1075085 1073656 1076202 1072388 1066608 1068029 1074332 1075615 1080440 1087115 1085446
14366A085446m001q98k35N097K626l807j457P275L457K359j568P77M652L812J09
$$ 1085446 1081445 1080547 1080312 1085409 1088035 1084228 1082771 1090046 1093503 1095862 1094294 1095071 1099723 1103535 1103644
14351A103644l749j315J846M067O856N143J864K404k583K43L53J838J717J0899
$$ 1103644 1099895 1098580 1100426 1104493 1111349 1116492 1118356 1120760 1118177 1118420 1118773 1120611 1122328 1133227
14337A133227L713J32O07l739L548J085j028K451K531M909K673L261J174k947
$$ 1133227 1136940 1137072 1137679 1133940 1137488 1138573 1137545 1139996 1142527 1147436 1150109 1153370 1154544 1151597
14323A151597O355L238j854k434j268Q16J92N775O568Q540N469O66K362J162j072
$$ 1151597 1157952 1161190 1159336 1156902 1155634 1156450 1156642 1162417 1168985 1177525 1182994 1183660 1186022 1187184 1186112
14308A186112K490K315J187L221j218J56P787q29N382P974R759k122n8J716N534
$$ 1186112 1188602 1190917 1192104 1195325 1194107 1194263 1202050 1201221 1206603 1214577 1224336 1222214 1222156 1223872 1229406
14293A229406M146q27r00k683N286J0702P479N710R186M929j733p44K052M857
$$ 1229406 1233552 1232725 1231825 1229142 1234428 1245130 1252609 1258319 1267505 1272434 1270701 1269957 1272009 1276866
14279A276866M39J083O218P263O010O547O004R2L385L254K925J1264J041M713
$$ 1276866 1277305 1278388 1284606 1291869 1297879 1304426 1310430 1310522 1313907 1317161 1320086 1331350 1332391 1337104
14265A337104K1959J4916N892N303J3039J1250N528J0236J3492P407Q190P880
$$ 1337104 1359063 1373979 1379871 1385174 1398213 1409463 1414991 1425227 1438719 1446126 1454316 1462196
14253A462196N286k437P179j261p308n518O01n297j5830j1532j3758j1639j4963
$$ 1462196 1467482 1465045 1472224 1470963 1463655 1458137 1458738 1453441 1437611 1426079 1412321 1400682 1385719
14240A385719k3395k8820l1380k4273k6110k8627k9685k3238k5292j5058k3937
$$ 1385719 1362324 1333504 1302124 1277851 1251741 1223114 1193429 1170191 1144899 1129841 1105904
14229A105904k0188k0857j2022j0996k784k861J113L706P48O197j498M628R358
$$ 1105904 1085716 1064859 1052837 1041841 1039057 1036196 1037309 1041015 1041763 1047960 1046462 1051090 1060448
14216A060448J0639M641N353J8023J5915Q099N818P051J4692J1331K007J780Q660
$$ 1060448 1071087 1075728 1081081 1099104 1115019 1123118 1128936 1135987 1150679 1162010 1164017 1165797 1174457
14203A174457J2039O855J836M408J1870K682m614O509P653O144N444J1170Q772
$$ 1174457 1186496 1193351 1195187 1199595 1211465 1214147 1209533 1216042 1223695 1229839 1235283 1246453 1255225
14190A255225j019k597O816Q365M979P415L893N571M071k08q76J596N667L609
$$ 1255225 1254206 1251609 1258425 1266790 1271769 1279184 1283077 1288648 1292719 1292511 1291635 1293231 1298898 1302507
14176A302507p38K565Q408R540J663O209L845r343j502L414K583N953M249M079
$$ 1302507 1301769 1304334 1312742 1322282 1323945 1330154 1333999 1324656 1323154 1326568 1329151 1335104 1339353 1343432
14162A343432j017L561K145K30k53P052N006K375L477m570J195J0170K39m318
$$ 1343432 1342415 1345976 1348121 1348351 1348098 1355150 1360156 1362531 1366008 1361438 1362633 1372803 1373042 1368724
14148A368724M672R752N214L303L081O914O597k69j124L06R782R518N322J125
$$ 1368724 1373396 1383148 1388362 1391665 1394746 1401660 1408257 1407988 1406864 1407170 1416952 1426470 1431792 1432917
14134A432917k288m372J024M522J438K140N961J21j509M389L166M161R95p304
$$ 1432917 1430629 1426257 1427281 1431803 1433241 1435381 1441342 1441463 1439954 1444343 1447509 1451670 1452665 1445361
14120A445361k165o59J0748j72J563K866L046M081K994R0M604Q897N177J457J881
$$ 1445361 1443196 1442537 1453285 1453113 1454676 1457542 1460588 1464669 1467663 1467753 1472357 1481254 1486431 1487888 1489769
14105A489769N156M875K25J581L368R646j301m706j029J689L422J287n483L316
$$ 1489769 1494925 1499800 1500025 1501606 1504974 1514620 1513319 1508613 1507584 1509273 1512695 1513982 1508499 1511815
14091A511815O580K211J267Q305Q797J834K401J563N509J00q690J454L660L956
$$ 1511815 1518395 1520606 1521873 1530178 1538975 1540809 1543210 1544773 1550282 1550382 1541692 1543146 1546806 1550762
14077A550762P735K619K980O098j90M664L252l468l476P925N886K784q315M294
$$ 1550762 1558497 1561116 1564096 1570194 1570004 1574668 1577920 1574452 1570976 1578901 1584787 1587571 1579256 1583550
14063A583550R741J931M120J437J18j45J484J0092Q381O710M397J542L080L531
$$ 1583550 1593291 1595222 1599342 1600779 1600897 1600752 1602236 1612328 1620709 1627419 1631816 1633358 1636438 1639969
14049A639969N257L727L09M919Q51P56L498M524L924j61Q596L448l059q155l822
$$ 1639969 1645226 1648953 1649262 1654181 1655032 1655788 1659286 1663810 1667734 1667573 1676169 1679617 1676558 1668403 1664581
14034A664581R000k8N27M955l517M084J2503P138p30Q61Q637P315k534k962L646
$$ 1664581 1673581 1673553 1674080 1679035 1675518 1679602 1692105 1699243 1698513 1699374 1708011 1715326 1712792 1709830 1713476
14019A713476P105R026L748R461J870L73j229l634k062Q190M756K892L422R372
$$ 1713476 1720581 1729607 1733355 1742816 1744686 1745059 1743830 1740196 1738134 1746324 1751080 1753972 1757394 1766766
14005A766766N167K986O013J754k504k828J5123R637N4q707K32O161P995L559
$$ 1766766 1771933 1774919 1780932 1782686 1780182 1777354 1792477 1802114 1802168 1793461 1793693 1799854 1807849 1811408
13991A811408M025L179J954M387k261m80K957M890R146N866L490L609P242N070
$$ 1811408 1815433 1818612 1820566 1824953 1822692 1822212 1825169 1830059 1839205 1845071 1848561 1852170 1859412 1864482
13977A864482l89J421R764k547m542N819J0166O12M608L030m329j119P672Q031
$$ 1864482 1864093 1865514 1875278 1872731 1868189 1874008 1884174 1884786 1889394 1892424 1888095 1886976 1894648 1902679
13963A902679Q519K009K987K8R939L361R512j507L795M741l805N136L175M263
$$ 1902679 1911198 1913207 1916194 1916222 1926161 1929522 1939034 1937527 1941322 1946063 1942258 1947394 1950569 1954832
13949A954832M319J428L886N549N939R152j82r50Q050J681L476N590M988L040
$$ 1954832 1959151 1960579 1964465 1970014 1975953 1985105 1984923 1983973 1992023 1993704 1997180 2002770 2007758 2010798
13935B010798P126N607p893k870J0796N156O969K116K820K888P913J833P754O261
$$ 2010798 2017924 2023531 2015638 2012768 2023564 2028720 2035689 2037805 2040625 2043513 2051426 2053259 2061013 2067274
13921B067274J343J1997N153M631L141R341K069O301k43n529L493P955L967J832
$$ 2067274 2068617 2080614 2085767 2090398 2093539 2102880 2104949 2111250 2111007 2105478 2108971 2116926 2120893 2122725
13907B122725L824M088N180M505K550N288J908Q441N787K447N373L92o13N668
$$ 2122725 2126549 2130637 2135817 2140322 2142872 2148160 2150068 2158509 2164296 2166743 2172116 2172508 2171895 2177563
13893B177563R956M548M391Q052J0714R035P128L312q82N893M942M069N261J2237
$$ 2177563 2187519 2192067 2196458 2204510 2215224 2224259 2231387 2234699 2233817 2239710 2244652 2248721 2253982 2266219
13879B266219K543Q72N010R282K972q55K039N358R085R546l87J45J387N552J7240
$$ 2266219 2268762 2269634 2274644 2283926 2286898 2286043 2288082 2293440 2302525 2312071 2311684 2311829 2313216 2318768 2336008
13864B336008L083L618J2649J3426R909O416L547Q02O823M895Q470M275O439J0670
$$ 2336008 2339091 2342709 2355358 2368784 2378693 2385109 2388656 2389458 2396281 2401176 2409646 2413921 2420360 2431030
13850B431030J1650N379J114L423J2622J7340M351P753O822J1750P232N706J2390
$$ 2431030 2442680 2448059 2449173 2452596 2465218 2482558 2486909 2494662 2501484 2513234 2520466 2526172 2538562
13837B538562J2953M894J3817P870N958R616J2658K2285J4449J9570K7485J4779
$$ 2538562 2551515 2556409 2570226 2578096 2584054 2593670 2606328 2628613 2643062 2662632 2690117 2704896
13825B704896J5470J8138J5037K0296K8724L3360K5290K3035O232k1412l7461
$$ 2704896 2720366 2738504 2753541 2773837 2802561 2835921 2861211 2884246 2890478 2869066 2831605
13814B831605p0323j03947j26762j35113j11484p1543l0040L401K0173K7068K9020
$$ 2831605 2761282 2657335 2530573 2395460 2283976 2212433 2182393 2185794 2205967 2233035 2262055
13803B262055L0995K7524K7918K6048K2543J9231J6671J7325J1243R458J4069
$$ 2262055 2293050 2320574 2348492 2374540 2397083 2416314 2432985 2450310 2461553 2471011 2485080
13792B485080O925J3041J5844J6327J2248J0788O663O658J2784J4116J1607R891
$$ 2485080 2492005 2505046 2520890 2537217 2549465 2560253 2566916 2573574 2586358 2600474 2612081 2621972
13780B621972J1171M383O550M247N428J0267J1734R509J0259J1544R501R715J3168
$$ 2621972 2633143 2637526 2644076 2648323 2653751 2664018 2675752 2685261 2695520 2707064 2716565 2726280 2739448
13767B739448Q322P613R054N256K795J1091J2438Q210J4066J2919P454L853K957
$$ 2739448 2747770 2755383 2764437 2769693 2772488 2783579 2796017 2804227 2818293 2831212 2838666 2842519 2845476
13754B845476J0999R459O305N141J1026J2204O238Q62j15J3982J2080M586J3409
$$ 2845476 2856475 2865934 2872239 2877380 2888406 2900610 2906848 2907710 2907595 2921577 2933657 2938243 2951652
13741B951652J4863J3232J0335M241O563P478P187R707R279N657O314J3779J7201
$$ 2951652 2966515 2979747 2990082 2994323 3000886 3008364 3015551 3025258 3034537 3040194 3046508 3060287 3077488
13728C077488J7198K580j679N485O342J2926P037J1183J7297M092P511J3022Q433
$$ 3077488 3094686 3097266 3095587 3101072 3107414 3120340 3127377 3138560 3155857 3159949 3167460 3180482 3188915
13715C188915P826R782N370O008R756J1104O891R516J1603P071R313K566M793
$$ 3188915 3196741 3206523 3211893 3217901 3227657 3238761 3245652 3255168 3266771 3273842 3283155 3285721 3290514
13702C290514J0634R253O537P266J3732J0344J3933J9288J9805P210J5126J4655
$$ 3290514 3301148 3310401 3316938 3324204 3337936 3348280 3362213 3381501 3401306 3408516 3423642 3438297
13690C438297J2801J0191O990O034R037Q986J4427J5716J1679Q644J1724J0879
$$ 3438297 3451098 3461289 3468279 3474313 3483350 3492336 3506763 3522479 3534158 3542802 3554526 3565405
13678C565405P210J2455J6390J5694P653J0822J7135o1n524J0758K2659K1428
$$ 3565405 3572615 3585070 3601460 3617154 3624807 3635629 3652764 3652703 3647179 3657937 3680596 3702024
13666C702024J2802J5514J3724J0699J2386M233P451J4043J4356K5117J6499J1270
$$ 3702024 3714826 3730340 3744064 3754763 3767149 3771382 3778833 3792876 3807232 3832349 3848848 3860118
13654C860118J3153K4026J7775J2804J1221J7383J6031J4661R759R558M628O57
$$ 3860118 3873271 3897297 3915072 3927876 3939097 3956480 3972511 3987172 3996931 4006489 4011117 4011774
13642D011774K340j912O269M583J0392J5127J1380J3453K8374K5527K1211K2254
$$ 4011774 4014114 4012202 4018471 4023054 4033446 4048573 4059953 4073406 4101780 4127307 4148518 4170772
13630D170772J5630K5136J6672J7797J6670J9760K5712K1675J2350J5018J4408
$$ 4170772 4186402 4211538 4228210 4246007 4262677 4282437 4308149 4329824 4342174 4357192 4371600
13619D371600K0879K2418K3306K9973K4889L1936K4698K0825K3478K0863K8903
$$ 4371600 4392479 4414897 4438203 4468176 4493065 4525001 4549699 4570524 4594002 4614865 4643768
13608D643768L3078L3564L6528M1286N2393M3706M0308M6529N6611O3874O4910
$$ 4643768 4676846 4710410 4746938 4788224 4840617 4884323 4924631 4971160 5027771 5091645 5156555
13597E156555P1458Q7570R3907J02154O2460q8893l12058m74619m69295k59698
$$ 5156555 5228013 5315583 5409490 5511644 5574104 5485211 5173153 4698534 4229239 3969541
13587C969541m9705Q7530J17796J11020R5068Q6993P6553O4644N3756M5339M1760
$$ 3969541 3919836 4007366 4125162 4236182 4331250 4418243 4494796 4559440 4613196 4658535 4700295
13576D700295M3919M3805L6148L8159L3922K8547L5428L1525K3112K8185L4280
$$ 4700295 4744214 4788019 4824167 4862326 4896248 4924795 4960223 4991748 5014860 5043045 5077325
13565E077325L4186K8055K4851K4574K5306L4509L1110L4905L1288L4826L4066
$$ 5077325 5111511 5139566 5164417 5188991 5214297 5248806 5279916 5314821 5346109 5380935 5415001
13554E415001L6691L2624K9746K4327L1593L1387L1994K6272K7935L5796L6582
$$ 5415001 5451692 5484316 5514062 5538389 5569982 5601369 5633363 5659635 5687570 5723366 5759948
13543E759948K9656K0923K6504L4142L8114M0153L6264L0187L7986M0124L1980
$$ 5759948 5789604 5810527 5837031 5871173 5909287 5949440 5985704 6015891 6053877 6094001 6125981
13532F125981L3448M2104M4564M2759L3468L0625L7555M1010L5819L7133M2450
$$ 6125981 6159429 6201533 6246097 6288856 6322324 6352949 6390504 6431514 6467333 6504466 6546916
13521F546916M3779L3539L7222M3036L8951L4896L7277L9282M4583M8514N7306
$$ 6546916 6590695 6624234 6661456 6704492 6743443 6778339 6815616 6854898 6899481 6947995 7005301
13510G005301N9313N9808N3704N2089N4567N5965N4498M7872M7595N2386N3677
$$ 7005301 7064614 7124422 7178126 7230215 7284782 7340747 7395245 7443117 7490712 7543098 7596775
13499G596775N7931N5961O1900O1646O1525N9435O8464O4605O3702O6332O9577
$$ 7596775 7654706 7710667 7772567 7834213 7895738 7955173 8023637 8088242 8151944 8218276 8287853
13488H287853P0808P4406P1711O9394O1214O8555P1450P5432P1054O9443Q0158
$$ 8287853 8358661 8433067 8504778 8574172 8635386 8703941 8775391 8850823 8921877 8991320 9071478
13477I071478Q6240Q9261Q8932Q7451R1218R1835R1548R8210J02216R7799R5062
$$ 9071478 9157718 9246979 9335911 9423362 9514580 9606415 9697963 9796173 9898389 9996188 10091250
13466A0091250J01286J01899J11233J13352J21673J27578J33573J33790J24614
$$ 10091250 10192536 10294435 10405668 10519020 10640693 10768271 10901844 11035634 11160248
13457A1160248J27225J38438J42725J50207J61734J57462J58435J56296J62132
$$ 11160248 11287473 11425911 11568636 11718843 11880577 12038039 12196474 12352770 12514902
13448A2514902J67253J70111J77106J89718K03198K09817K14505K27092K34957
$$ 12514902 12682155 12852266 13029372 13219090 13422288 13632105 13846610 14073702 14308659
13439A4308659K34254K43039K42749K49366K64505K82564K99679L09962L29308
$$ 14308659 14542913 14785952 15028701 15278067 15542572 15825136 16124815 16434777 16764085
13430A6764085L51439L59445L82521M06632M31007M61616M83997N00581N34293
$$ 16764085 17115524 17474969 17857490 18264122 18695129 19156745 19640742 20141323 20675616
13421B0675616N65314O05538O45958O93192P36225P85388Q44260R14819R85190
$$ 20675616 21240930 21846468 22492426 23185618 23921843 24707231 25551491 26466310 27451500
13412B7451500J052305J101730J140597J196422J291857J419139J583723J767835
$$ 27451500 28503805 29605535 30746132 31942554 33234411 34653550 36237273 38005108
13404C8005108J967166K199420K468762K777352L134916L548668L972558M370527
$$ 38005108 39972274 42171694 44640456 47417808 50552724 54101392 58073950 62444477
13396F2444477M635273M478072L416206Q25710l491795q732742j4355726k0657191
$$ 62444477 67079750 71557822 74974028 75799738 72307943 63575201 49219475 28562284
13388B8562284k6259660k8082158k4282845j5757992o341427P08842M409122N581450
$$ 28562284 2302624 -25779534 -50062379 -65820371 -72161798 -71452956 -67043834 -61462384
13380f1462384N499307M988736M382178L775405L221587K756869K380809K073106
$$ -61462384 -55963077 -50974341 -46592163 -42816758 -39595171 -36838302 -34457493 -32384387
13372c2384387J835579J687176J567180J472748J401008J310007J235829J158994
$$ -32384387 -30548808 -28861632 -27294452 -25821704 -24420696 -23110689 -21874860 -20715866
13364b0715866J067462R77519Q79421P74210O78950N65517M82820M46420M52516
$$ -20715866 -19648404 -18670885 -17791464 -17017254 -16338304 -15772787 -15289967 -14843547 -14391031
13355a4391031M88878N09612N22007N13048M91844M77522M52209M21128M06290
$$ -14391031 -13902153 -13392541 -12870534 -12357486 -11865642 -11388120 -10935911 -10514783 -10108493
13346a0108493L93505L82282L67185L43643L16150L03571K86010K65305K56691
$$ -10108493 -9714988 -9332706 -8965521 -8621878 -8305728 -8002157 -7716147 -7450842 -7194151
13337g194151K51241K35995K38997K36221K23316K14271K14829K13527K06512
$$ -7194151 -6942910 -6706915 -6467918 -6231697 -6008381 -5794110 -5579281 -5365754 -5159242
13328e159242K03813J97974J96754J87994J92766J86498J78280J60497J58719
$$ -5159242 -4955429 -4757455 -4560701 -4372707 -4179941 -3993443 -3815163 -3654666 -3495947
13319c495947J57662J58982J53127J54518J53670J48034J34236J19803J12869
$$ -3495947 -3338285 -3179303 -3026176 -2871658 -2717988 -2569954 -2435718 -2315915 -2203046
13310b203046J19120J16526J31275J32682J37988J35529J32145J20041J12346
$$ -2203046 -2083926 -1967400 -1836125 -1703443 -1565455 -1429926 -1297781 -1177740 -1065394
13301a065394J21449J30057J19896J15753J21361J14458J16581J21064J25409
$$ -1065394 -943945 -813888 -693992 -578239 -456878 -342420 -225839 -104775 20634
13292B0634J28427J19799J08874J11264J06310R3765R3590J02550R9435Q1031
$$ 20634 149061 268860 377734 488998 595308 689073 782663 885213 984648 1065679
13282A065679P9383O9948R5007J30646J42814J36519J29052J24809J15428J12277
$$ 1065679 1145062 1215010 1310017 1440663 1583477 1719996 1849048 1973857 2089285 2201562
13272B201562J09021J10525J06626R8901J07040J08869J11110J12457J16603J18559
$$ 2201562 2310583 2421108 2527734 2626635 2733675 2842544 2953654 3066111 3182714 3301273
13262C301273J08338J07327J14186J21272J29464J21794J17070J22292J35389
$$ 3301273 3409611 3516938 3631124 3752396 3881860 4003654 4120724 4243016 4378405
13253D378405J34964J21971J17728J26757J26554J26243J34280J35887J30873
$$ 4378405 4513369 4635340 4753068 4879825 5006379 5132622 5266902 5402789 5533662
13244E533662J39154J45390J50459J53360J50261J48285J51882J55443J63809
$$ 5533662 5672816 5818206 5968665 6122025 6272286 6420571 6572453 6727896 6891705
13235F891705J59631J66409J81280J81186J89934K00346K01019J87666J86992
$$ 6891705 7051336 7217745 7399025 7580211 7770145 7970491 8171510 8359176 8546168
13226H546168J87339J82936K00679K19551K29623K47861K51047K48098K33718
$$ 8546168 8733507 8916443 9117122 9336673 9566296 9814157 10065204 10313302 10547020
13217A0547020K26546K44344K54729K69475K82185K91936L10179L37457L44698
$$ 10547020 10773566 11017910 11272639 11542114 11824299 12116235 12426414 12763871 13108569
13208A3108569L38097L42413L54152L63040L97879M21756M31907M31052M38950
$$ 13108569 13446666 13789079 14143231 14506271 14904150 15325906 15757813 16188865 16627815
13199A6627815M57789M91449N26868N57145N89960O23577O51470O90306P28687
$$ 16627815 17085604 17577053 18103921 18661066 19251026 19874603 20526073 21216379 21945066
13190B1945066P69676Q26752Q70296R16708R60011J016668J100352J212898J320093
$$ 21945066 22714742 23541494 24411790 25328498 26288509 27305177 28405529 29618427 30938520
13181C0938520J421957J530915J660871J801786J941751K089544K274839K568121
$$ 30938520 32360477 33891392 35552263 37354049 39295800 41385344 43660183 46228304
13173D6228304K961446L432345L919076M412261M904821N438407O120637O945132
$$ 46228304 49189750 52622095 56541171 60953432 65858253 71296660 77417297 84362429
13165H4362429P826452Q759343R983168J2019640J4856990J6542154J1478111
$$ 84362429 92188881 100948224 110931392 122951032 137808022 154350176 165828287
13158A65828287j1903536n5790486q8695103r5553938o4285612k3773473O932247
$$ 165828287 153924751 98134265 9439162 -86114776 -150400388 -174173861 -167241614
13151a67241614J8875943J8172561J4685748J1729970R628775Q054403O671296
$$ -167241614 -148365671 -130193110 -115507362 -103777392 -94148617 -86094214 -79422918
13144g9422918N531672M750364M275822L900063L554000L208727K910948K672104
$$ -79422918 -73891246 -69140882 -64865060 -60964997 -57410997 -54202270 -51291322 -48619218
13136d8619218K427961K189674J965939J766177J593097J463299J341799J236055
$$ -48619218 -46191257 -44001583 -42035644 -40269467 -38676370 -37213071 -35871272 -34635217
13128c4635217J159406J093410J039502R73070R09362Q48505P90283P49811P20292
$$ -34635217 -33475811 -32382401 -31342899 -30369829 -29460467 -28611962 -27821679 -27071868 -26351576
13119b6351576O72106O24266N92103N51940N25421N19095N06193N03584M94013
$$ -26351576 -25679470 -25055204 -24463101 -23911161 -23385740 -22866645 -22360452 -21856868 -21362855
13110b1362855M60678M11356L66476L45286L54035L73892L74577L61563L43401
$$ -21362855 -20902177 -20490821 -20124345 -19779059 -19425024 -19051132 -18676555 -18314992 -17971591
13101a7971591L28233L30407L33790L30806L36287L41143L39700L36875L27531
$$ -17971591 -17643358 -17312951 -16979161 -16648355 -16312068 -15970925 -15631225 -15294350 -14966819
13092a4966819L01932K14318K9888k11321l72120l37762j21909J01646K35289
$$ -14966819 -14664887 -14450569 -14420681 -14632002 -15004122 -15341884 -15463793 -15362147 -15126858
13083a5126858K80009K59024K35135K23267K14815K06899J99057J84010J75178
$$ -15126858 -14846849 -14587825 -14352690 -14129423 -13914608 -13707709 -13508652 -13324642 -13149464
13074a3149464J62366J64612J65087J59095J48632J49134J43961J41655J30074
$$ -13149464 -12987098 -12822486 -12657399 -12498304 -12349672 -12200538 -12056577 -11914922 -11784848
13065a1784848J23040J26343J31487J35262J38930J32176J21958J13585J05278
$$ -11784848 -11661808 -11535465 -11403978 -11268716 -11129786 -10997610 -10875652 -10762067 -10656789
13056a0656789J11036J12253J13124J08244J07392J04699J19543J23383J16665
$$ -10656789 -10545753 -10433500 -10320376 -10212132 -10104740 -10000041 -9880498 -9757115 -9640450
13047i640450J15088J10035J15485J26001J43293J56927J68185J75877J87024
$$ -9640450 -9525362 -9415327 -9299842 -9173841 -9030548 -8873621 -8705436 -8529559 -8342535
13038h342535J93331J51632r82k79174n68772o64746n03637k06740M4589J68829
$$ -8342535 -8149204 -7997572 -7998554 -8277728 -8846500 -9511246 -10014883 -10221623 -10177034 -10008205
13028a0008205K07117J88007J63880J37420J28667J18465R9794Q5165P9902Q3457
$$ -10008205 -9801088 -9613081 -9449201 -9311781 -9183114 -9064649 -8964855 -8879690 -8799788 -8716331
13018h716331Q6829Q0137P0755P8356P6359O5384N6840N5875O0272O1300N7542
$$ -8716331 -8629502 -8549365 -8478610 -8400254 -8323895 -8258511 -8201671 -8145796 -8085524 -8024224 -7966682
13007g966682N8677N1235L8147M7071N7944O0817O1613P0931O6084N7940M6863
$$ -7966682 -7908005 -7856770 -7818623 -7771552 -7713608 -7652791 -7591178 -7520247 -7454163 -7396223 -7349360
12996g349360L8254M2089M5997M5667N0727N1745L9872L5966L1815L8877L2523
$$ -7349360 -7311106 -7269017 -7223020 -7177353 -7126626 -7074881 -7035009 -6999043 -6967228 -6928351 -6895828
12985f895828L3896M1738L9806M6038M2389M6190L8813M5066M8889N3455N5590
$$ -6895828 -6861932 -6820194 -6780388 -6734350 -6691961 -6645771 -6606958 -6561892 -6513003 -6459548 -6403958
12974f403958M9408M4986M4996N5568N0251M8509N0757M4234M1781M7649M9626
$$ -6403958 -6354550 -6309564 -6264568 -6209000 -6158749 -6110240 -6059483 -6015249 -5973468 -5925819 -5876193
12963e876193M4743L0482J849k9460o5706j05724j34150j21961q3420k7740J5502
$$ -5876193 -5831450 -5800968 -5799119 -5828579 -5894285 -6000009 -6134159 -6256120 -6339540 -6367280 -6351778
12952f351778N3794O0624N2827N1353M5710M7600M6961L6761M3345M7754L8347
$$ -6351778 -6297984 -6237360 -6184533 -6133180 -6087470 -6039870 -5992909 -5956148 -5912803 -5865049 -5826702
12941e826702L9890L1092L0926L1515K9269K4722K8199K3133K6269L1187K4780
$$ -5826702 -5786812 -5755720 -5724794 -5693279 -5664010 -5639288 -5611089 -5587956 -5561687 -5530500 -5505720
12930e505720J3517N266J450J6804K1504K2426R101J3763K1270K4167K2651L3913
$$ -5505720 -5492203 -5486937 -5485487 -5468683 -5447179 -5424753 -5415652 -5401889 -5380619 -5356452 -5333801 -5299888
12918e299888K4038K6927L0512K4579K7113L2974L0431K7276K7619K2891J6440
$$ -5299888 -5275850 -5248923 -5218411 -5193832 -5166719 -5133745 -5103314 -5076038 -5048419 -5025528 -5009088
12907e009088J3521R998P012N270M990Q279J2479J1520J8717K0052J5471J6108
$$ -5009088 -4995567 -4985569 -4978557 -4973287 -4968297 -4960018 -4947539 -4936019 -4917302 -4897250 -4881779 -4865671
12895d865671J5645K1234J4680K2865K2918J6398J3896J4648J4155J2302J5263
$$ -4865671 -4850026 -4828792 -4814112 -4791247 -4768329 -4751931 -4738035 -4723387 -4709232 -4696930 -4681667
12884d681667J4095J7447K7787J6763J2374J0566R625J5512J8644J9526J6110
$$ -4681667 -4667572 -4650125 -4622338 -4605575 -4593201 -4582635 -4573010 -4557498 -4538854 -4519328 -4503218
12873d503218J2191J4994K1238J2250L190J1000O956J7540K8390K3944J4722J5094
$$ -4503218 -4491027 -4476033 -4454795 -4442545 -4439355 -4428355 -4421399 -4403859 -4375469 -4351525 -4336803 -4321709
12861d321709J8199J5472J0223J3215Q139R020J4585J4986J4372L600R63N333
$$ -4321709 -4303510 -4288038 -4277815 -4264600 -4256461 -4247441 -4232856 -4217870 -4203498 -4199898 -4198935 -4193602
12849d193602J3540O915N402J3035K0006J6767J4061J0313J3802Q430J3206J9228
$$ -4193602 -4180062 -4173147 -4167745 -4154710 -4134704 -4117937 -4103876 -4093563 -4079761 -4071331 -4058125 -4038897
12837d038897J5186J5422J7254J4438Q015P585N270J5485J7080R170P012J4446
$$ -4038897 -4023711 -4008289 -3991035 -3976597 -3968582 -3960997 -3955727 -3940242 -3923162 -3913992 -3906980 -3892534
12825c892534J1587J1406O891P296J3488J4655N785P960J4801J1894M037J0947
$$ -3892534 -3880947 -3869541 -3862650 -3855354 -3841866 -3827211 -3821426 -3813466 -3798665 -3786771 -3782734 -3771787
12813c771787J3033P605J6670J5679J1929J2204K900J1084J3855P756J1324J5460
$$ -3771787 -3758754 -3751149 -3734479 -3718800 -3706871 -3694667 -3691767 -3680683 -3666828 -3659072 -3647748 -3632288
12801c632288J1161J1563Q104J5167J4348M645K610Q334J1248J3563L767M833
$$ -3632288 -3621127 -3609564 -3601460 -3586293 -3571945 -3567300 -3564690 -3556356 -3545108 -3531545 -3527778 -3522945
12789c522945J2441P311Q626J1786L729J249J1246J4763J5115R878R810J1184
$$ -3522945 -3510504 -3503193 -3494567 -3482781 -3479052 -3477803 -3466557 -3451794 -3436679 -3426801 -3416991 -3405807
12777c405807J1561O307P772Q934N688J6731J7471N975M697O431M201J1330M149
$$ -3405807 -3394246 -3387939 -3380167 -3371233 -3365545 -3348814 -3331343 -3325368 -3320671 -3314240 -3310039 -3298709 -3294560
12764c294560j0765n828o691o62J2172K3107K2899J4034K175J3201J4213J4235
$$ -3294560 -3305325 -3311153 -3317844 -3318506 -3306334 -3283227 -3260328 -3246294 -3244119 -3230918 -3216705 -3202470
12752c202470J5584J1594R658J7560J8254J5080J6435J5019M58O565J1246Q085
$$ -3202470 -3186886 -3175292 -3165634 -3148074 -3129820 -3114740 -3098305 -3083286 -3082828 -3076263 -3065017 -3056932
12740c056932J4412J8619J3731K2553K3771K4371J5922J4243K8060L2361K5853
$$ -3056932 -3042520 -3023901 -3010170 -2987617 -2963846 -2939475 -2923553 -2909310 -2881250 -2848889 -2823036
12729b823036K1466K9474L5331L4754L9085M5611N0711O0603P6908Q4366Q9871
$$ -2823036 -2801570 -2772096 -2736765 -2702011 -2662926 -2617315 -2566604 -2506001 -2429093 -2344727 -2254856
12718b254856P2476m6326k85396m77017n04500l19300r7434N0331J08248R8551
$$ -2254856 -2182380 -2228706 -2514102 -2991119 -3495619 -3814919 -3912353 -3862022 -3753774 -3655223
12708c655223P5176N9889N3144N0864L9730L5339K9937K4150K4582K8438K9222
$$ -3655223 -3580047 -3520158 -3467014 -3416150 -3376420 -3341081 -3311144 -3286994 -3262412 -3233974 -3204752
12697c204752K7018L0946K1113R994J0515J0992J4938J6172J2304J0131J5695
$$ -3204752 -3177734 -3146788 -3125675 -3115681 -3105166 -3094174 -3079236 -3063064 -3050760 -3040629 -3024934
12686c024934J2328N868J1930Q968L067L273M773J6035J7832J0238J6384J057
$$ -3024934 -3012606 -3006738 -2994808 -2985840 -2982773 -2979500 -2974727 -2958692 -2940860 -2930622 -2914238 -2913181
12674b913181J932J553O999M245Q598J0764Q871M853Q232Q055R033M654Q776J1011
$$ -2913181 -2911249 -2909696 -2902697 -2898452 -2889854 -2879090 -2870219 -2865366 -2857134 -2849079 -2840046 -2835392 -2826616 -2815605
12660b815605J2847N314K336L645K915J2048P820J6208R256L835N539P211Q36
$$ -2815605 -2802758 -2797444 -2795108 -2791463 -2788548 -2776500 -2768680 -2752472 -2743216 -2739381 -2733842 -2726631 -2725795
12647b725795O372J430j733N210K102J2505J1651Q258M970J845J924J1982R181
$$ -2725795 -2719423 -2717993 -2719726 -2714516 -2712414 -2699909 -2688258 -2680000 -2675030 -2673185 -2671261 -2659279 -2650098
12634b650098N448N755J525o188r34O218L390K213J235M194O672J519M131O839
$$ -2650098 -2644650 -2638895 -2637370 -2643558 -2644492 -2638274 -2634884 -2632671 -2631436 -2627242 -2620570 -2619051 -2614920 -2608081
12620b608081P523O080N026R655Q519k101K098R376P423N212O168O102r69O197
$$ -2608081 -2600558 -2594478 -2589452 -2579797 -2571278 -2573379 -2571281 -2561905 -2554482 -2549270 -2543102 -2537000 -2537969 -2531772
12606b531772N216N888M499M279K15O896Q750K893N663P044J3040N740L523K959
$$ -2531772 -2526556 -2520668 -2516169 -2511890 -2511675 -2504779 -2496029 -2493136 -2487473 -2480429 -2467389 -2461649 -2458126 -2455167
12592b455167n090n004K955M887J816j0536j0451q737n34P123R089R342N672M612
$$ -2455167 -2460257 -2465261 -2462306 -2457419 -2455603 -2466139 -2476590 -2485327 -2485861 -2478738 -2469649 -2460307 -2454635 -2450023
12578b450023N57M635Q169J1253K088L241O512J1020K173n230L87P01M697k755
$$ -2450023 -2449466 -2444831 -2436662 -2425409 -2423321 -2420080 -2413568 -2402548 -2400375 -2405605 -2405218 -2404517 -2399820 -2402575
12564b402575O285J6591K766N565M610K259M61O775Q956L933P480M879j754m374
$$ -2402575 -2396290 -2379699 -2376933 -2371368 -2366758 -2364499 -2364038 -2357263 -2348307 -2344374 -2336894 -2332015 -2333769 -2338143
12550b338143M152J1094m933J802N843l134m851O650M678r84J740M971P377K970
$$ -2338143 -2333991 -2322897 -2327830 -2326028 -2320185 -2323319 -2328170 -2321520 -2316842 -2317826 -2316086 -2311115 -2303738 -2300768
12536b300768K216N676o66K957Q362M458N938L151K104R107K815N396P293M908
$$ -2300768 -2298552 -2292876 -2293542 -2290585 -2282223 -2277765 -2271827 -2268676 -2266572 -2257465 -2254650 -2249254 -2241961 -2237053
12522b237053R58M858J5867O974j875j666J141O147O083k503K012K680K001N156
$$ -2237053 -2236095 -2231237 -2215370 -2208396 -2210271 -2211937 -2210796 -2204649 -2198566 -2201069 -2199057 -2196377 -2194376 -2189220
12508b189220L062k037k548O953J2183R386Q985Q612m422k233o025l055N739L460
$$ -2189220 -2186158 -2188195 -2190743 -2183790 -2171607 -2162221 -2153236 -2144624 -2149046 -2151279 -2157304 -2160359 -2154620 -2151160
12494b151160L276J0544P413N401P13l973J549r09Q306P936N94L3K043O677K557
$$ -2151160 -2147884 -2137340 -2129927 -2124526 -2123813 -2127786 -2126237 -2127146 -2118840 -2110904 -2110310 -2110277 -2108234 -2101557 -2099000
12479b099000p050R674P330L952M207O771L993P670R330n913q373j743K26J1640
$$ -2099000 -2106050 -2096376 -2089046 -2085094 -2080887 -2074116 -2070123 -2062453 -2053123 -2059036 -2067409 -2069152 -2068926 -2057286
12465b057286O893O407J595N303O748l757L24R127l286J538M143N157N371L096
$$ -2057286 -2050393 -2043986 -2042391 -2037088 -2030340 -2034097 -2033773 -2024646 -2027932 -2026394 -2022251 -2017094 -2011723 -2008627
12451b008627M391M255k490R445O751j441J444M843J670R934Q226J511k413K08
$$ -2008627 -2004236 -1999981 -2002471 -1993026 -1986275 -1987716 -1986272 -1981429 -1979759 -1969825 -1961599 -1960088 -1962501 -1962293
12437a962293j140J388j051l226Q085Q924O779L046K008L092j203J890O631Q096
$$ -1962293 -1963433 -1962045 -1963096 -1966322 -1958237 -1949313 -1942534 -1939488 -1937480 -1934388 -1935591 -1933701 -1927070 -1918974
12423a918974N14l400O164O341O441N290O634J1265O169N963o797j3366q600n854
$$ -1918974 -1918460 -1921860 -1915696 -1909355 -1902914 -1897624 -1890990 -1879725 -1873556 -1867593 -1874390 -1887756 -1896356 -1902210
12409a902210l493j343O931L712J73R953J4760O504k524l272L077M301N113j100
$$ -1902210 -1905703 -1907046 -1900115 -1896403 -1896230 -1886277 -1871517 -1865013 -1867537 -1870809 -1867732 -1863431 -1858318 -1859418
12395a859418N53L649N018k661L512K373R97n45J595R211O410O88L570J2301P294
$$ -1859418 -1858865 -1855216 -1850198 -1852859 -1849347 -1846974 -1845977 -1846522 -1844927 -1835716 -1829306 -1828618 -1825048 -1812747 -1805453
12380a805453k924K090J0963M008j1605k2276k2353j3820p959J917N208J703K89
$$ -1805453 -1808377 -1806287 -1795324 -1791316 -1802921 -1825197 -1847550 -1861370 -1869329 -1867412 -1862204 -1860501 -1860212
12367a860212L111J2247P144O566K103Q126O078k795l209J500l867N259N868O507
$$ -1860212 -1857101 -1844854 -1837710 -1831144 -1829041 -1820915 -1814837 -1817632 -1820841 -1819341 -1823208 -1817949 -1812081 -1805574
12353a805574N019j743m896O741M102m384N236J7258N809J441O501J790P414O673
$$ -1805574 -1800555 -1802298 -1807194 -1800453 -1796351 -1800735 -1795499 -1778241 -1772432 -1770991 -1764490 -1762700 -1755286 -1748613
12339a748613l517j3933p917k994j985q27J161N040K052k05J695P22k457o120
$$ -1748613 -1752130 -1766063 -1773980 -1776974 -1778959 -1779786 -1778625 -1773585 -1771533 -1771738 -1770043 -1769321 -1771778 -1777898
12325a777898O642J0959L960M130m70K405L490L174P010M066O60Q947L827K050
$$ -1777898 -1771256 -1760297 -1756337 -1752207 -1752677 -1750272 -1746782 -1743608 -1736598 -1732532 -1731872 -1722925 -1719098 -1717048
12311a717048L340J233l272K616j728M378Q786j066J413O909Q211J215n704M19
$$ -1717048 -1713708 -1712475 -1715747 -1713131 -1714859 -1710481 -1701695 -1702761 -1701348 -1694439 -1686228 -1685013 -1690717 -1690298
12297a690298O057R89L74o256R10O010N105l331n702K814j65J0606M338o91R957
$$ -1690298 -1684241 -1683252 -1682878 -1689134 -1688224 -1682214 -1677109 -1680440 -1686142 -1683328 -1683493 -1672887 -1668549 -1669240 -1659283
12282a659283m510J437P953J1963O268K157L171n452m731j655N631Q44K56Q12
$$ -1659283 -1663793 -1662356 -1654403 -1642440 -1636172 -1634015 -1630844 -1636296 -1641027 -1642682 -1637051 -1636207 -1635951 -1635139
12268a635139N938l163n368n67O224M829J607l143j98M748K611K915P068M062
$$ -1635139 -1629201 -1632364 -1637732 -1638299 -1632075 -1627246 -1625639 -1628782 -1628980 -1624232 -1621621 -1618706 -1611638 -1607576
12254a607576k567P75J836p13L154j280L809K014J0111P626J471p132L984O638
$$ -1607576 -1610143 -1609368 -1607532 -1608245 -1605091 -1606371 -1602562 -1600548 -1590437 -1582811 -1581340 -1588472 -1584488 -1577850
12240a577850p03l75N436n211r090K172J3778K393m386K035L007j142q029K023
$$ -1577850 -1578553 -1578928 -1573492 -1578703 -1587793 -1585621 -1571843 -1569450 -1573836 -1571801 -1568794 -1569936 -1577965 -1575942
12226a575942N975P478O792M865K668j735l642K562Q316J231l080p95K743M301
$$ -1575942 -1569967 -1562489 -1555697 -1550832 -1548164 -1549899 -1553541 -1550979 -1542663 -1541432 -1544512 -1545307 -1542564 -1538263
12212a538263P745p049m407K214P159P214P73k007K263O202J821J416L003l913
$$ -1538263 -1530518 -1537567 -1541974 -1539760 -1532601 -1525387 -1524614 -1526621 -1524358 -1518156 -1516335 -1514919 -1511916 -1515829
12198a515829M494N116J904l432j546L227r03L502R413M568J019K90J02J773L333
$$ -1515829 -1511335 -1506219 -1504315 -1507747 -1509293 -1506066 -1506969 -1503467 -1494054 -1489486 -1488467 -1488177 -1488075 -1486302 -1482969
12183a482969n581m819n245J0714M981o36J93l576J42P919Q633l6j928j448l336
$$ -1482969 -1488550 -1493369 -1498614 -1487900 -1482919 -1483555 -1483362 -1486938 -1486796 -1478877 -1470244 -1470280 -1472208 -1473656 -1476992
12168a476992O003L938l336k300O762Q662R05K222j722L931M537k805J324Q81
$$ -1476992 -1470989 -1467051 -1470387 -1472687 -1465925 -1457263 -1456358 -1454136 -1455858 -1451927 -1447390 -1450195 -1448871 -1447990
12154a447990K914M964L909K787k235k594m312J070m050N082O998N367R151M406
$$ -1447990 -1445076 -1440112 -1436203 -1433416 -1435651 -1438245 -1442557 -1441487 -1445537 -1440455 -1433457 -1428090 -1418939 -1414533
12140a414533J454p397n838K073K402N876M257K251N693L643l346k470o119P805
$$ -1414533 -1413079 -1420476 -1426314 -1424241 -1421839 -1415963 -1411706 -1409455 -1403762 -1400119 -1403465 -1405935 -1412054 -1404249
12126a404249L644K952M829K317m342k764m176J2Q823L64k268L125k10L979l38
$$ -1404249 -1400605 -1397653 -1392824 -1390507 -1394849 -1397613 -1401789 -1401777 -1392954 -1392590 -1394858 -1391733 -1391943 -1387964 -1388302
12111a388302n160N696M523q21m814m695L055O961J029O00O313M441J725N173
$$ -1388302 -1393462 -1387766 -1383243 -1384064 -1388878 -1393573 -1390518 -1383557 -1382528 -1381928 -1375615 -1371174 -1369449 -1364276
12097a364276J070r30L553j509j439k271J607N969M955J176M689J826K495l437
$$ -1364276 -1363206 -1364136 -1360583 -1362092 -1363531 -1365802 -1364195 -1358226 -1353271 -1352095 -1347406 -1345580 -1343085 -1346522
12083a346522j425N676J677O301O76k54R8O401k979K65N755M83J059J013m088
$$ -1346522 -1347947 -1342271 -1340594 -1334293 -1333617 -1333871 -1333773 -1327372 -1330351 -1330086 -1324331 -1323848 -1322789 -1321776 -1325864
12068a325864o68M71L052O681J216m639j967Q335M079M113J09R62r31K039L498
$$ -1325864 -1326532 -1326061 -1323009 -1316328 -1315112 -1319751 -1321718 -1313383 -1309304 -1305191 -1305082 -1304120 -1305051 -1303012 -1299514
12053a299514N540k66n1J692O006K422m027j502L717M261J1954J262M346J767
$$ -1299514 -1293974 -1294240 -1294291 -1292599 -1286593 -1284171 -1288198 -1289700 -1285983 -1281722 -1269768 -1268506 -1264160 -1262393
12039a262393l562o440j0872q145m885p216q248o321K540M560L070Q210l279N411
$$ -1262393 -1265955 -1272395 -1283267 -1291412 -1296297 -1303513 -1311761 -1318082 -1315542 -1310982 -1307912 -1299702 -1302981 -1297570
12025a297570L681M709N462l261m02K487K581K14k465O262Q574N979j335k197
$$ -1297570 -1293889 -1289180 -1283718 -1286979 -1287381 -1284894 -1282313 -1282099 -1284564 -1278302 -1269728 -1263749 -1265084 -1267281
12011a267281k013m169k904O070O881M512o581M59P125J948J583M97M359l70m63
$$ -1267281 -1269294 -1273463 -1276367 -1270297 -1263416 -1258904 -1265485 -1265026 -1257901 -1255953 -1254370 -1253873 -1249514 -1249884 -1250347
11996a250347M322N77j687J720l372j064O250L5L555Q193J028j388L097o78K032
$$ -1250347 -1246025 -1245448 -1247135 -1245415 -1248787 -1249851 -1243601 -1243566 -1240011 -1231818 -1230790 -1232178 -1229081 -1229759 -1227727
11981a227727p09Q22J43l56P93O034k192l507l216J601M563J252L003Q11J756
$$ -1227727 -1228436 -1227614 -1227471 -1227827 -1227034 -1221000 -1223192 -1226699 -1229915 -1228314 -1223751 -1222499 -1219496 -1218685 -1216929
11966a216929k032J041M520k519j1189m347P144J2520N011Q59R56L52M824l85
$$ -1216929 -1218961 -1217920 -1213400 -1215919 -1227108 -1231455 -1224311 -1211791 -1206780 -1205921 -1204965 -1204613 -1199789 -1200174
11952a200174m374M518K265K983m966m262J2160N807n72M548l672O9N887K036
$$ -1200174 -1204548 -1200030 -1197765 -1194782 -1199748 -1204010 -1191850 -1186043 -1186615 -1182067 -1185739 -1185670 -1179783 -1177747
11938a177747n63l845k033j747j557N208K365l073l827j518J1070O437K243K121
$$ -1177747 -1178310 -1182155 -1184188 -1185935 -1187492 -1182284 -1179919 -1182992 -1186819 -1188337 -1177267 -1170830 -1168587 -1166466
11924a166466j562N32o95k313J753N605Q836N212m533j0320o199M17J21l895l103
$$ -1166466 -1168028 -1167496 -1168191 -1170504 -1168751 -1163146 -1154310 -1149098 -1153631 -1163951 -1170150 -1169733 -1169612 -1173507 -1176610
11909a176610N709L995N559M007K860N294k771L60Q781n899m491O80J0329O105
$$ -1176610 -1170901 -1166906 -1161347 -1157340 -1154480 -1149186 -1151957 -1151597 -1142816 -1148715 -1153206 -1152526 -1142197 -1136092
11895a136092k048l956j0213k822M445J172M649L358K986K918K382O026l715L791
$$ -1136092 -1138140 -1142096 -1152309 -1155131 -1150686 -1149514 -1144865 -1141507 -1138521 -1135603 -1133221 -1127195 -1130910 -1127119
11881a127119L509P95M465L726J388j439k118k509p86o903L737J047m602M285
$$ -1127119 -1123610 -1122815 -1118350 -1114624 -1113236 -1114675 -1116793 -1119302 -1120088 -1126991 -1123254 -1122207 -1126809 -1122524
11867a122524M009L761L77L901N980J249J238n032l926O033J590J311Q902M802
$$ -1122524 -1118515 -1114754 -1114377 -1110476 -1104496 -1103247 -1102009 -1107041 -1110967 -1104934 -1103344 -1102033 -1093131 -1088329
11853a088329l720m578n665j1364l186P452J862k395J082n406J4641O992n510
$$ -1088329 -1092049 -1096627 -1102292 -1113656 -1116842 -1109390 -1107528 -1109923 -1108841 -1114247 -1099606 -1092614 -1098124
11840a098124l680K252J2015k215J161j137O164J547r286k591M777R914J445m737
$$ -1098124 -1101804 -1099552 -1087537 -1089752 -1088591 -1089728 -1083564 -1082017 -1091303 -1093894 -1089117 -1079203 -1077758 -1082495
11826a082495n345L548L565J160O007O157L209j368k93K214n42K004r00j421N882
$$ -1082495 -1087840 -1084292 -1080727 -1079567 -1073560 -1067403 -1064194 -1065562 -1065855 -1063641 -1064183 -1062179 -1063079 -1064500 -1058618
11811a058618P366l679j340K461m329q032j787J774n36J374N365P048K659p49
$$ -1058618 -1051252 -1054931 -1056271 -1053810 -1058139 -1066171 -1067958 -1066184 -1066720 -1065346 -1059981 -1052933 -1050274 -1051023
11797a051023L574n17k129k006n578l179L116N176R942P722L894r467j4434L207
$$ -1051023 -1047449 -1047966 -1050095 -1052101 -1057679 -1060858 -1057742 -1052566 -1042624 -1034902 -1031008 -1040475 -1054909 -1051702
11783a051702J0577k894J04N613R750J587j54j822j90l11L861J064p169j823K680
$$ -1051702 -1041125 -1044019 -1043915 -1038302 -1028552 -1026965 -1027119 -1028941 -1029131 -1029442 -1025581 -1024517 -1031686 -1033509 -1030829
11768a030829K008J750M938q000l363M480n960K845K178l93R424M451k970r4k774
$$ -1030829 -1028821 -1027071 -1022133 -1030133 -1033496 -1029016 -1034976 -1032131 -1029953 -1030346 -1020922 -1016471 -1019441 -1019535 -1022309
11753a022309M426K389j358j860j480L549M074m246J846L591j711m87L500M736
$$ -1022309 -1017883 -1015494 -1016852 -1018712 -1020192 -1016643 -1012569 -1016815 -1014969 -1011378 -1013089 -1013576 -1010076 -1005340
11739a005340J45j135k928K158N200L541M855Q593l990N582K398r087K031O39
$$ -1005340 -1005195 -1006330 -1009258 -1007100 -1001900 -998359 -993504 -984911 -988901 -983319 -980921 -990008 -987977 -987338
11725i87338m896o884M122L893o34J0274n1n424o98L859L389J671k521J419j92
$$ -987338 -992234 -999118 -994996 -991103 -991737 -981463 -981514 -986938 -987636 -983777 -980388 -978717 -981238 -979819 -980011
11710i80011j458O67O452L220M515P33j082l564j0050J38K380J134P997K620k818
$$ -980011 -981469 -980802 -974350 -971130 -966615 -965882 -966964 -970528 -980578 -980440 -978060 -976926 -968929 -966309 -969127
11695i69127P701j753m732M607R77L089O501J260m359L518J906Q72j591k346K140
$$ -969127 -961426 -963179 -967911 -963304 -962327 -959238 -952737 -951477 -955836 -952318 -950412 -949540 -951131 -953477 -951337
11680i51337J694K359j963K317J327L381n07m047o842m16M619J811L92K095j249
$$ -951337 -949643 -947284 -949247 -946930 -945603 -942222 -942729 -946776 -953618 -954034 -949415 -947604 -947212 -945117 -946366
11665i46366k436n646K873N702k999j213P343N026l402l679O973K218L220Q843
$$ -946366 -948802 -954448 -951575 -945873 -948872 -950085 -942742 -937716 -941118 -944797 -937824 -935606 -932386 -923543
11651i23543k57p087n49m56p791Q842K615K104q06k819O815l146m072K40P315
$$ -923543 -923800 -930887 -931436 -931892 -939683 -930841 -928226 -926122 -926928 -929747 -922932 -926078 -930150 -929910 -922595
11636i22595N113l613o052J290j149K561K051L886M050K022o739J638R653K836
$$ -922595 -917482 -921095 -927147 -925857 -927006 -924445 -922394 -918508 -914458 -912436 -919175 -917537 -907884 -905048
11622i05048k518K200k086l239O843K935n880J770j089l138L34m289L51L0K306
$$ -905048 -907566 -905366 -907452 -910691 -903848 -900913 -906793 -905023 -906112 -909250 -908916 -913205 -912854 -912824 -910518
11607i10518O60O366Q620q219o904r79Q551J557J863K114N40l855j886M767Q179
$$ -910518 -909858 -903492 -894872 -903091 -909995 -910974 -902423 -900866 -899003 -896889 -896349 -900204 -902090 -897323 -889144
11592h89144K888P19j632m854j393N25l399m259n79J990Q848N58L050N993K626
$$ -889144 -886256 -885537 -887169 -892023 -893416 -892891 -896290 -900549 -901128 -899138 -890290 -889732 -886682 -880689 -878063
11577h78063n794K080R20K129K503j27l919J706L083r87m074m989k937J229M730
$$ -878063 -883857 -881777 -880857 -878728 -876225 -876352 -880271 -878565 -875482 -876469 -880543 -885532 -888469 -887240 -882510
11562h82510P649O495j508m987n241M11N814K982j696q21N29Q782L101L096N371
$$ -882510 -874861 -868366 -869874 -874861 -880102 -879691 -873877 -870895 -872591 -873412 -872883 -864101 -861000 -857904 -852533
11547h52533L296q176p325Q21J325j929j626L376J1934J766p319o943J985J533
$$ -852533 -849237 -857413 -864738 -863917 -862592 -864521 -866147 -862771 -850837 -849071 -856390 -863333 -861348 -859815
11533h59815M510O186M944L306m34j2543l137L476N245K442P838K85m391j996
$$ -859815 -855305 -849119 -844175 -840869 -841303 -853846 -856983 -853507 -848262 -845820 -837982 -837697 -842088 -844084
11519h44084L47L091O05l472N918P895K192m075Q53l334k833k510R63j596Q227
$$ -844084 -843737 -840646 -840041 -843513 -837595 -829700 -827508 -831583 -830730 -834064 -836897 -839407 -838444 -840040 -831813
11504h31813K559m318j875O550M177j132m342o764L583L054L786N342r72k095
$$ -831813 -829254 -833572 -835447 -828897 -824720 -825852 -830194 -836958 -833375 -830321 -826535 -821193 -822165 -824260
11490h24260M642K783J208m93j245m961j646J910n75P54Q103L725j346k248q65
$$ -824260 -819618 -816835 -815627 -816120 -817365 -822326 -823972 -822062 -822637 -821883 -813780 -810055 -811401 -813649 -814514
11475h14514k615m91L716N64m37P025m379n871k521O078N488r90M555K100O33
$$ -814514 -817129 -817620 -813904 -813340 -813777 -806752 -811131 -817002 -819523 -813445 -807957 -808947 -804392 -802292 -801659
11460h01659O029m914p323k46N830K431J452l56p99l928Q46M207L017P183o19
$$ -801659 -795630 -800544 -807867 -808113 -802283 -799852 -798400 -798756 -799555 -803483 -802637 -798430 -795413 -788230 -788849
11445g88849o72Q441q896n150j742R09M765J244k762l037K442O887q3N64K320
$$ -788849 -789521 -781080 -789976 -795126 -796868 -795959 -791194 -789950 -792712 -795749 -793307 -786420 -786503 -785939 -783619
11430g83619K939N31k057m344J310K4N907N018K373J521K586J12j49J312o147
$$ -783619 -780680 -780149 -782206 -786550 -785240 -785216 -779309 -774291 -771918 -770397 -767811 -767699 -767848 -766536 -772683
11415g72683p764l865J579N929K351K089j11K801J319l097K83j283k135j169J911
$$ -772683 -780447 -784312 -782733 -776804 -774453 -772364 -772475 -769674 -768355 -771452 -771169 -772452 -774587 -775756 -773845
11400g73845Q968L685Q36N356L571j807m280L458o325l716M190p997k790M782
$$ -773845 -764877 -761192 -760356 -755000 -751429 -753236 -757516 -754058 -760383 -764099 -759909 -767906 -770696 -765914
11386g65914K868O984N133K905J239k225K26o614L729m089n443L27R577P078P985
$$ -765914 -763046 -756062 -750929 -748024 -746785 -749010 -748784 -755398 -751669 -755758 -761201 -760874 -751297 -744219 -736234
11371g36234K003j484J479J552N57m955q645k823K99N912O516p13J0318m87J634
$$ -736234 -734231 -735715 -734236 -732684 -732127 -737082 -745727 -748550 -748251 -742339 -735823 -736536 -726218 -726705 -725071
11356g25071L160l192n262m348l320K143n946l608K164N346N73j391k098l654
$$ -725071 -721911 -725103 -730365 -734713 -738033 -735890 -741836 -745444 -743280 -737934 -737361 -738752 -740850 -744504
11342g44504O277J910K655P567L228j0419n774j88N636l22J438Q883J725j938
$$ -744504 -738227 -736317 -733662 -726095 -722867 -733286 -739060 -739248 -733612 -733934 -732496 -723613 -721888 -723826
11328g23826P0K159J702O25l35m08K756j400n651K879P933P388n296j159l50m559
$$ -723826 -723756 -721597 -719895 -719270 -719605 -720013 -717257 -718657 -724308 -721429 -713496 -706108 -711404 -712563 -712913 -717472
11312g17472J253L117m383o483N03O652J0308M735j981L542N762j730m359k622
$$ -717472 -716219 -713102 -717485 -723968 -723465 -716813 -706505 -701770 -703751 -700209 -694447 -696177 -700536 -703158
11298g03158L134J295m058m708j584N037k957O085M782j344m681q39r55L140k429
$$ -703158 -700024 -698729 -702787 -707495 -709079 -704042 -706999 -700914 -696132 -697476 -702157 -702996 -703951 -700811 -703240
11283g03240O600J675m788K666m3j79k923n30N714M870J016j10m596p172j201
$$ -703240 -696640 -694965 -699753 -697087 -697130 -697309 -700232 -700762 -695048 -690178 -689162 -689272 -693868 -701040 -702241
11268g02241Q482L571L235L125q406M605M19J105l029R15N424j200K01K583J752
$$ -702241 -693759 -690188 -686953 -683828 -692234 -687629 -687210 -686105 -689134 -688219 -682795 -683995 -683794 -681211 -679459
11253f79459n763k44K775M413n15m93J470l733j621M13K183N371R42O030O923
$$ -679459 -685222 -685466 -682691 -678278 -678793 -679286 -677816 -681549 -683170 -682757 -680574 -675203 -674261 -668231 -661308
11238f61308K273K595J336r145q967j696L470K291L535j00L356J707K841O009
$$ -661308 -659035 -656440 -655104 -664249 -673216 -674912 -671442 -669151 -665616 -665716 -662360 -660653 -657812 -651803
11224f51803m331n071m625l590O260K031p886l819J247L478m291K510M97J494
$$ -651803 -656134 -661205 -665830 -669420 -663160 -661129 -669015 -672834 -671587 -668109 -672400 -669890 -669393 -667899
11210f67899O507J445j704J3310N158j3137l2J311l362O51J838m446P817N644
$$ -667899 -661392 -659947 -661651 -648341 -643183 -656320 -656352 -655041 -658403 -657752 -655914 -660360 -652543 -646899
11196f46899j628K988M315l797l938r87M039N33m048L203K593L290N706Q23j192
$$ -646899 -648527 -645539 -641224 -645021 -648959 -649946 -645907 -645374 -649422 -646219 -643626 -640336 -634630 -633807 -634999
11181f34999k930J117m189o55l81l346l081J714m82K330L692N682K268j905K846
$$ -634999 -637929 -636812 -641001 -641656 -642037 -645383 -648464 -646750 -647232 -644902 -641210 -635528 -633260 -635165 -632319
11166f32319Q829P942L390M18m810k378j0809q977J2294Q075M094k978o651K169
$$ -632319 -623490 -615548 -612158 -611740 -616550 -618928 -629737 -638714 -626420 -618345 -614251 -617229 -623880 -621711
11152f21711l246m333o73l263M403L229n206j69o24K202J13M82q61N41J666K597
$$ -621711 -624957 -629290 -629963 -633226 -628823 -625594 -630800 -630969 -631593 -629391 -629278 -628796 -629657 -629116 -627450 -624853
11136f24853L074M30m480O483L544p51p08M604j630q830o332K255N384P274J1533
$$ -624853 -621779 -621349 -625829 -619346 -615802 -616553 -617261 -612657 -614287 -623117 -629449 -627194 -621810 -614536 -603003
11121f03003q8m812O1L522J845k013q885o415L850O125O257R19j386k779m9L809
$$ -603003 -603091 -607903 -607842 -604320 -602475 -604488 -613373 -619788 -615938 -609813 -603556 -602637 -604023 -606802 -606851 -603042
11105f03042m35j608n878q274o630Q624Q741L696L435P14L011Q170K64o604j235
$$ -603042 -603477 -605085 -610963 -619237 -625867 -617243 -608502 -604806 -601371 -600657 -597646 -589476 -589212 -595816 -597051
11090e97051N397n38j850l387m982l232n00L412O754J94L903P786j522M626O140
$$ -597051 -591654 -592192 -594042 -597429 -602411 -605643 -606143 -602731 -595977 -595783 -591880 -584094 -585616 -580990 -574850
11075e74850q14K897j38j3661m21k221O190M169M492O3J119Lj0214O36K646l077
$$ -574850 -575664 -572767 -572905 -586566 -586987 -589208 -583018 -578849 -574357 -574294 -573175 -573172 -583386 -582750 -580104 -583181
11059e83181k76o025L982J92l793J379l457j025R991J856L881L83l928K491P272
$$ -583181 -583457 -589482 -585500 -585308 -589101 -587722 -591179 -592204 -582213 -580357 -576476 -576093 -580021 -577530 -570258
11044e70258l790n384m520L377N218O224K320M14q59p95N43J742M700jj315O686
$$ -570258 -574048 -579432 -583952 -580575 -575357 -569133 -566813 -566399 -567258 -568053 -567510 -565768 -561068 -561069 -562384 -555698
11028e55698l248K586N620m141j676J505n608j1796l458p63M899R292M982j636
$$ -555698 -558946 -556360 -550740 -554881 -556557 -555052 -560660 -572456 -575914 -576677 -571778 -562486 -557504 -559140
11014e59140L420M25l300m911J293J573j059j174L810Q644N837L48q88o15m372
$$ -559140 -555720 -555295 -558595 -563506 -562213 -560640 -561699 -562873 -559063 -550419 -544582 -544234 -545122 -545737 -550109
10999e50109N087K122p423n215O089O385j418K663M577M145m155o524J954N56
$$ -550109 -545022 -542900 -550323 -555538 -549449 -543064 -544482 -541819 -537242 -533097 -537252 -543776 -541822 -541266
10985e41266qO045K041J244K830L231K441k306p613J76l186j647L029J680k404
$$ -541266 -541274 -535229 -533188 -531944 -529114 -525883 -523442 -525748 -533361 -533185 -536371 -538018 -534989 -533309 -535713
10970e35713N50m681o65M845L499L248K988j653J608n809m936R790R5k551O085
$$ -535713 -535163 -539844 -540509 -535664 -532165 -528917 -525929 -527582 -525974 -531783 -536719 -526929 -526834 -529385 -523300
10955e23300L447r60l836M409M659K474r648q353Q273J0188j620j152M153k075
$$ -523300 -519853 -520813 -524649 -520240 -515581 -513107 -522755 -531108 -522835 -512647 -514267 -515419 -511266 -513341
10941e13341o549J48J87n085Q031Q556O598k929q372k110J520k308m696M741P574
$$ -513341 -519890 -519742 -519555 -524640 -516609 -508053 -501455 -504384 -512756 -514866 -513346 -515654 -520350 -515609 -508035
10926e08035P699R03m538m573L651O348j461k166K54j225J737j273k077Q173K660
$$ -508035 -500336 -499433 -503971 -508544 -504893 -498545 -500006 -502172 -501918 -503143 -501406 -502679 -504756 -496583 -493923
10911d93923n463j155N838M526n960K629K873j045k140p545M57O065J279J84K525
$$ -493923 -499386 -500541 -494703 -490177 -496137 -493508 -490635 -491680 -493820 -501365 -500908 -494843 -493564 -493380 -490855
10896d90855j855P744M710j684l705p61N547j191j0333K745J991j511j716o28
$$ -490855 -492710 -484966 -480256 -481940 -485645 -486406 -480859 -482050 -492383 -489638 -487647 -489158 -490874 -491502
10882d91502N862L874M617J515J482m609K417p07j552l8k324j735K176j291l832
$$ -491502 -485640 -481766 -477149 -475634 -474152 -478761 -476344 -477051 -478603 -478641 -480965 -482700 -480524 -481815 -485647
10867d85647L838O412J235J328N29r745j27L387N365N141J289n202j954L343P249
$$ -485647 -481809 -475397 -474162 -472834 -472305 -482050 -482177 -478790 -473425 -468284 -466995 -472197 -474151 -470808 -463559
10852d63559o297n259K85J419P126M303n623m576q89L766J865K036J183k329P79
$$ -463559 -469856 -475115 -474830 -473411 -466285 -461982 -467605 -472181 -473070 -469304 -467439 -465403 -464220 -466549 -465770
10837d65770R021K727j131j659r25%j463L637O463m785p475J08J334P364L959
$$ -465770 -456749 -454022 -455153 -456812 -457737 -457737 -459200 -455563 -449100 -453885 -461360 -461252 -459918 -452554 -448595
10822d48595m053K57K530K111P984n114l552K6n28K745O562j054o812n940M52
$$ -448595 -452648 -452391 -449861 -447750 -439766 -444880 -448432 -448406 -448934 -446189 -439627 -440681 -447493 -453433 -452981
10807d52981R10K239J564J267l271J438O203k281m541M434P120J432n429q1L885
$$ -452981 -452071 -449832 -448268 -447001 -450272 -448834 -442631 -444912 -449453 -445019 -437899 -436467 -441896 -441977 -438092
10792d38092J1677K623J43K19K823j332l900p625n196N838J921k12Q484M126Q31
$$ -438092 -426415 -423792 -423649 -423430 -420607 -421939 -425839 -433464 -438660 -432822 -430901 -431113 -422629 -418503 -417672
10777d17672n171j029O418K47o307j0013j111m168m638K476M540P062L154l017
$$ -417672 -422843 -423872 -417454 -417207 -423514 -433527 -434638 -438806 -443444 -440968 -436428 -429366 -426212 -429229
10763d29229M0O180Q63K844n403q77N89k735M992R810P9j141k701k116k247J740
$$ -429229 -429189 -423009 -422146 -419302 -424705 -425582 -424993 -427728 -422736 -412926 -412847 -413988 -416689 -418805 -421052 -419312
10747d19312K374R836Q713k151O58l144l185K92N7Q58m459m739k559R21k663J254
$$ -419312 -416938 -407102 -398389 -400540 -399882 -403026 -406211 -405919 -405862 -405004 -409463 -414202 -416761 -415840 -418503 -417249
10731d17249L431K104j106n381j298J705K078Q349N97m840L430N728L433K27O248
$$ -417249 -413818 -411714 -412820 -418201 -419499 -417794 -415716 -407367 -406770 -411610 -408180 -402452 -399019 -398792 -392544
10716c92544J455k018j730L581L573n002n776M608m314o769l621N864M549N09
$$ -392544 -391089 -393107 -394837 -391256 -387683 -392685 -398461 -393853 -398167 -404936 -408557 -402693 -398144 -397635
10702c97635J713N641l24L637k18N05l733L31l883k996R38M519p41p86M741K637
$$ -397635 -395922 -390281 -390605 -386968 -387186 -386681 -390414 -390083 -393966 -396962 -396024 -391505 -392246 -393032 -388291 -385654
10686c85654m25j362L802N045K895K136j660l758J463K390K68J446J581l236k337
$$ -385654 -386079 -387441 -383639 -378594 -375699 -373563 -375223 -378981 -377518 -375128 -374860 -373414 -371833 -375069 -377406
10671c77406L372J972J24L718L572p048n253Q099N331K739k931k541l030N71K203
$$ -377406 -374034 -372062 -371938 -368220 -364648 -371696 -376949 -368850 -363519 -360780 -363711 -366252 -369282 -368711 -366508
10656c66508r69m557J203K218j666J023M078N383J959q106o3O781N428k432j504
$$ -366508 -367477 -372034 -370831 -368613 -370279 -369256 -365178 -359795 -357836 -365942 -366005 -359224 -353796 -356228 -357732
10641c57732K698p011m056N74K229l442j484M791J562j17N939K222R12L843K326
$$ -357732 -355034 -362045 -366101 -365527 -363298 -366740 -368224 -363433 -361871 -361988 -356049 -353827 -352915 -349072 -346746
10626c46746K533K055n381L79L623m448k387Q230M134j780k949n913n606P4N419
$$ -346746 -344213 -342158 -347539 -347160 -343537 -347985 -350372 -342142 -338008 -339788 -342737 -348650 -354256 -354182 -348763
10611c48763R544P122n486n054K144L77j07Q47J042j373K331L80M401r0p527j080
$$ -348763 -339219 -332097 -337583 -342637 -340493 -340116 -340223 -339376 -338334 -339707 -337376 -336996 -332595 -332685 -340212 -341292
10595c41292N125N355n542L173m773j844l313Q336K998j060l077K642O640M196
$$ -341292 -336167 -330812 -336354 -333181 -337954 -339798 -343111 -334775 -331777 -332837 -335914 -333272 -326632 -322436
10581c22436R99j048L875J983O96m708o998n300L125M605Q843K112l88l015j95
$$ -322436 -321437 -322485 -318610 -316627 -315931 -320639 -327637 -332937 -329812 -325207 -316364 -314252 -314640 -317655 -317850
10566c17850M349k655k87J74k889J56L848L85M917n452K892R924N971n848n163
$$ -317850 -313501 -316156 -316443 -316269 -319158 -319002 -315154 -314769 -309852 -315304 -312412 -302488 -296517 -302365 -307528
10551c07528k127l832J476j93N101N707M798k392m330K357L895M923j70k439O03
$$ -307528 -309655 -313487 -312011 -312204 -307103 -301396 -296598 -298990 -303320 -300963 -297068 -292145 -292315 -294754 -294151
10536b94151L428M359K354j557m812m892J857m960k933K216n07j203M321Q393
$$ -294151 -290723 -286364 -284010 -285567 -290379 -295271 -293414 -298374 -301307 -299091 -299598 -300801 -296480 -288087
10522b88087L690L373J113J75k406J944L127j259j739K518L932P81q207M317j513
$$ -288087 -284397 -281024 -279911 -279736 -282142 -280198 -277071 -278330 -280069 -277551 -273619 -272838 -281045 -276728 -278241
10507b78241K189M813L739J478j1679N35M576m26K752o27o077K809K485L506M232
$$ -278241 -276052 -271239 -267500 -266022 -277701 -277166 -272590 -273016 -270264 -270891 -276968 -274159 -271674 -268168 -263936
10492b63936K593J136N381k148o36L470K537J643M132M033J427J277k03j510m927
$$ -263936 -261343 -260207 -254826 -256974 -257610 -254140 -251603 -249960 -245828 -241795 -240368 -239091 -239294 -240804 -245731
10477b45731o004J195M533M620k828k772K254O921L284k466K374J034Q77L91m821
$$ -245731 -251735 -250540 -246007 -241387 -244215 -246987 -244733 -237812 -234528 -236994 -234620 -233586 -232709 -232318 -237139
10462b37139K858J1155J95L929J987j886k1L153l966m727K991R040L322r506N2
$$ -237139 -234281 -223126 -222931 -219002 -217015 -218901 -218922 -215769 -219735 -224462 -221471 -212431 -209109 -218615 -218563
10447b18563O131N132J1M452N041O719M034P286L643o000k837l533o872m596j0590
$$ -218563 -212432 -207300 -207289 -202837 -197796 -191077 -187043 -179757 -176114 -182114 -184951 -188484 -195356 -199952 -210542
10432b10542k0995p493J111M898O418Q254N005L285r533q678K993L005J85O908
$$ -210542 -231537 -239030 -237919 -233021 -226603 -218349 -213344 -210059 -219592 -228270 -225277 -222272 -222087 -215179
10418b15179P559J796l224K030R976J316n205R14K126L463j545N217L208m944
$$ -215179 -207620 -205824 -209048 -207018 -197042 -195726 -200931 -200017 -197891 -194428 -195973 -190756 -187548 -192492
10404a92492j253M370M165n86J567q88l716j175N842N379M146m904J12o21k543
$$ -192492 -193745 -189375 -185210 -185796 -184229 -185117 -188833 -190008 -184166 -178787 -174641 -179545 -179433 -180054 -182597
10389a82597O578N552O978P06J629N530M378m69M083L975M500O135K562J187N06
$$ -182597 -176019 -170467 -163489 -162783 -161154 -155624 -151246 -151715 -147632 -143657 -139157 -133022 -130460 -129273 -128767
10374a28767K974M514k66j126L401L099k867R75N117K755l976M719L374J349m232
$$ -128767 -125793 -121279 -121545 -122671 -119270 -116171 -119038 -118063 -112946 -110191 -114167 -109448 -106074 -104725 -108957
10359a08957N397J600n870O424M901M633l56O97N597P444K579R288N993O144L710
$$ -108957 -103560 -101960 -107830 -101406 -96505 -91872 -92228 -91531 -85934 -78490 -75911 -66623 -60630 -54486 -50776
10344e0776N163j159M46P779M078R132L96N671N798K233L373R751J2328J1193
$$ -50776 -45613 -46772 -46326 -38547 -34469 -25337 -24941 -19270 -13472 -11239 -7866 1885 14213 25406
10330B5406L028M079K459N735P242J1253J9366J5583J1292J2959J3742J8765J5285
$$ 25406 28434 32513 34972 40707 47949 59202 78568 94151 105443 118402 132144 150909 166194
10317A66194J2427J8756J2375J9867J4241K4297L1697L4339L5282M2183M9716
$$ 166194 178621 197377 209752 229619 243860 268157 299854 334193 369475 411658 461374
10306D61374N8228O4514Q3489R6306Q7920L5676r5446k58232l26204k38938p1795
$$ 461374 519602 584116 667605 763911 851831 887507 792061 533829 207625 -31313 -103108
10295a03108L6259K5163j22439k86996l28209k17698n8712N8214R5840J02125
$$ -103108 -66849 -41686 -164125 -451121 -779330 -997028 -1055740 -997526 -901686 -799561
10285g99561Q3847P3460O5660N5985M9955M4368M2080L8926M6776L9580M0988
$$ -799561 -715714 -642254 -576594 -520609 -470654 -426286 -384206 -345280 -298504 -258924 -217936
10274b17936M6002N0071L9830L1257j5305m6362l9450n0720q7152j38165j26854
$$ -217936 -171934 -121863 -82033 -50776 -66081 -112443 -151893 -202613 -289765 -427930 -554784
10263e54784q8157n4147n3596l1813M970K2191L7840M3755L7630L5031K2059K2023
$$ -554784 -642941 -697088 -750684 -782497 -777527 -755336 -717496 -673741 -636111 -601080 -579021 -556998
10251e56998J7730J9374J7953N556Q054J3188J3924O631Q490J6163J3027Q210
$$ -556998 -539268 -519894 -501941 -496385 -488331 -475143 -461219 -454588 -446098 -429935 -416908 -408698
10239d08698M394P226N462L328M164Q075R572Q030R97l94M196R038P203P847N982
$$ -408698 -404304 -397078 -391616 -388288 -384124 -376049 -366477 -358447 -357450 -357844 -353648 -344610 -337407 -329560 -323578
10224c23578L530R655o84M26L751L086J867l567k761P681Q847P966M119J239m1
$$ -323578 -320048 -310393 -311077 -310651 -306900 -303814 -301947 -305514 -308275 -300594 -291747 -283781 -279662 -278423 -278464
10209b78464K073M793M872m928p581J347O045L633k311l501J434J0999P577O160
$$ -278464 -276391 -271598 -266726 -271654 -279235 -277888 -271843 -268210 -270521 -274022 -272588 -261589 -254012 -247852
10195b47852L787n942M792N619L504j61L388p12N01j864L55N16j227q01K022J838
$$ -247852 -244065 -250007 -245215 -239596 -236092 -236253 -232865 -233577 -233076 -234940 -234585 -234069 -235296 -236097 -234075 -232237
10179b32237Q017L328K794N907L363m029m059K669L819J455L457M502k941p913
$$ -232237 -224220 -220892 -218098 -212191 -208828 -212857 -216916 -214247 -210428 -208973 -205516 -201014 -203955 -211868
10165b11868m57M043m8M678O902n288j247L606j354m793K981Q060k54M309K214
$$ -211868 -212325 -208282 -208330 -203652 -196750 -202038 -203285 -199679 -201033 -205826 -202845 -194785 -195039 -190730 -188516
10150a88516J409L601M147L480M667L068K095j737o823J611P37l57J841J339J904
$$ -188516 -187107 -183506 -179359 -175879 -171212 -168144 -166049 -167786 -174609 -172998 -172261 -172618 -170777 -169438 -167534
10135a67534K116R403J57L109o547K11K563O362L272l192O25l774l804J3447K71
$$ -167534 -165418 -156015 -155858 -152749 -159296 -159085 -156522 -150160 -146888 -150080 -149455 -153229 -157033 -143586 -143315
10120a43315n351O84J438L431N083K151N104N584J841J501J132R81k346j142K300
$$ -143315 -148666 -147982 -146544 -143113 -138030 -135879 -130775 -125191 -123350 -121849 -120717 -119736 -122082 -123224 -120924
10105a20924M151N457M014J418l855l373J219R178N949K412N858L181k117k296
$$ -120924 -116773 -111316 -107302 -105884 -109739 -113112 -111893 -102715 -96766 -94354 -88496 -85315 -87432 -89728
10091h9728Q34M189r76P618R369N299L71L101J414Q845L285R134R022J2911J7144
$$ -89728 -88894 -84705 -85681 -78063 -68694 -63395 -63024 -59923 -58509 -49664 -46379 -37245 -28223 -15312 1832
10076A832R720J1975J1106l7757r5093o6920l9605J146J6006J4650J2996P782
$$ 1832 11552 23527 34633 -3124 -98217 -165137 -204742 -203596 -187590 -172940 -159944 -152162
10064a52162R472J3347l90K787L885O433N002K876M775Q643l140M625Q747P846
$$ -152162 -142690 -129343 -129733 -126946 -123061 -116628 -111626 -108750 -103975 -95332 -98472 -93847 -85100 -77254
10050g7254l727j8J509J373L052R925j625J625P680L956P018K301K29K603k505
$$ -77254 -80981 -80999 -79490 -78117 -75065 -65140 -66765 -65140 -57460 -53504 -46486 -44185 -43956 -41353 -43858
10035d3858J242N859K430Q79k376l65k194L264j492P72P36L141O713N267n2l158
$$ -43858 -42616 -36757 -34327 -33448 -35824 -36189 -38383 -35119 -36611 -35839 -35103 -31962 -25249 -19982 -20034 -23192
10019b3192N628J228n8P801k344O58N868L046M667n89M73J509P293L920K288J518
$$ -23192 -17564 -16336 -16394 -8593 -10937 -10279 -4411 -1365 3302 2713 3186 4695 11988 15908 18196 19714
10003A9714K068K977M996L810J494O4O808K357r28N330L197O209L224K792M014
$$ 19714 21782 24759 29755 33565 35059 35123 41931 44288 43360 48690 51887 58096 61320 64112 68126
9988F8126L638L651o74K928K239L102L339N857R863K783m675L636J2612M824K651
$$ 68126 71764 75415 74741 77669 79908 83010 86349 92206 102069 104852 100177 103813 116425 121249 123900
9973A23900J3916Q586L134L730P542J2350J0096O561L591P79J5980J4357O583
$$ 123900 137816 146402 149536 153266 160808 173158 183254 189815 193406 194185 210165 224522 231105
9960B31105J7987J7742P520P091J1789J8212K2064L1113L5612K9231L0338L0555
$$ 231105 249092 266834 274354 281445 293234 311446 333510 364623 400235 429466 459804 490359
9948D90359K9961L3257Q639l8649r1440q9446l4971K946L7077N2786K1267o1232
$$ 490359 520320 553577 562216 523567 432127 342681 307710 310656 347733 400519 421786 360554
9936C60554j68016k33160j99952j10865p924M1445N0651K8062k6305p2553q3074
$$ 360554 192538 -40622 -240574 -351439 -359363 -317918 -267267 -239205 -265510 -338063 -421137
9925d21137o0745k1026J6154K7988L7460L3901K9317K2901K1378J5196K4168K1325
$$ -421137 -481882 -502908 -486754 -458766 -421306 -387405 -358088 -335187 -313809 -298613 -274445 -253120
9913b53120J2801J3345J3412J6519J7237Q007L687J7076J0134L74J0017J2556
$$ -253120 -240319 -226974 -213562 -197043 -179806 -171799 -168112 -151036 -140902 -140528 -130511 -117955
9901a17955J2959J3867P003N815J0593O518L773L723K088K428R188K854j41N453
$$ -117955 -104996 -91129 -84126 -78311 -67718 -61200 -57427 -53704 -51616 -49188 -40000 -37146 -37287 -31834
9887c1834j095q00P411R311M881O049K274L373p008m575Q513O058L177O537J649
$$ -31834 -32929 -33729 -26318 -17007 -12126 -6077 -3803 -430 -7438 -12013 -3500 2558 5735 12272 13921
9872A3921M476P512K54J0112M436O72M840L945P843R079l80J818L119O367O559
$$ 13921 18397 25909 26163 36275 40711 41383 46223 50168 58011 67090 66710 68528 71647 78014 84573
9857H4573N601M502N319N04N522R366J2721J0187L010r94L906L759P150J1164
$$ 84573 90174 94676 99995 100499 106021 115387 128108 138295 141305 140311 144217 147976 155126 166290
9843A66290J2938Q909L354O881P462J4540J5966J7557Q231J2042R367Q7k174L930
$$ 166290 179228 188137 191491 198372 205834 220374 236340 253897 262128 274170 283537 283624 281450 285380
9829B85380J1483J4939J6912K2619K9812L8658L1095K8132L9798M8374N2948N8653
$$ 285380 296863 311802 328714 351333 381145 419803 450898 479030 518828 567202 620150 678803
9817F78803M9618J7201l6296p7174p7450o8344j13676k26993k69444k08832j09177
$$ 678803 728421 745622 709326 632152 554702 486358 372682 145689 -123755 -332587 -441764
9806d41764o8939p5786p0698k8890J2703M8163N6197N3018N0627L6603L9432L2743
$$ -441764 -510703 -586489 -657187 -686077 -673374 -625211 -569014 -515996 -465369 -428766 -389334 -356591
9794c56591L4323L0833K0358J3922J5508J5796J0077N209J2097J1579Q825N591
$$ -356591 -322268 -291435 -271077 -257155 -241647 -225851 -215774 -210565 -198468 -186889 -178064 -172473
9782a72473J2161J0228J2250J6248J0858N103Q085Q221J388O281Q535O278J1786
$$ -172473 -160312 -150084 -137834 -121586 -110728 -105625 -97540 -89319 -87931 -81650 -73115 -66837 -55051
9769e5051R579J887L086o441n098R404O905k514O838P864Q726M569J068N203J723
$$ -55051 -45472 -43585 -40499 -46940 -52038 -42634 -35729 -38243 -31405 -23541 -14815 -10246 -9178 -3975 -2252
9754b252j898o254J120J1565K198O505R729k219R020O097K114M535n48o27K139
$$ -2252 -4150 -10404 -9284 2281 4479 10984 20713 18494 27514 33611 35725 40260 39712 39085 41224
9739D1224K655r83K357k088L24R383L688P404K45k32L837L607O862m277k400P777
$$ 41224 43879 42896 45253 43165 43489 52872 56560 63964 64209 63977 67814 71421 78283 74006 71606 79383
9723G9383K139k611N610R721M421L338K144o899m847J559N107N325J360j239n904
$$ 79383 81522 78911 84521 94242 98663 102001 104145 97246 92399 93958 99065 104390 105750 104511 98607
9708I8607R85P246O874P163P18K694L976l676K40J20K795l75j665L482O683J539
$$ 98607 99592 106838 113712 120875 121593 124287 128263 124587 124827 124947 127742 127367 125702 129184 135867 137406
9692A37406N705N95L50n29k262N395P261Q70n907L476M51O386L157K415J341j0874
$$ 137406 143111 143706 144056 143527 141265 146660 153921 154791 148884 152360 152811 159197 162354 164769 166110 155236
9676A55236q17N140j571M485J290K908J416R26N842M986J062M053O183K374L338
$$ 155236 154419 159559 157988 162473 163763 166671 168087 169013 174855 179841 180903 184956 191139 193513 196851
9661A96851m397Q89J7M678n71N467o684N572R754M799J532N58L567P083L986q517
$$ 196851 192454 193343 193360 198038 197467 202934 196250 201822 211576 216375 217907 218465 222032 229115 233101 224584
9645B24584q157L870O984M977l354Q587M200n432n841l162R355R013N967K04N83
$$ 224584 216427 220297 227281 232258 228904 237491 241691 236259 230418 227256 236611 245624 251591 251795 252378
9630B52378L462O260O175N016L724Q54o681q638L819P212L96m883n511R12P784
$$ 252378 255840 262100 268275 273291 277015 277869 271188 262550 266369 273581 273977 269094 263583 264495 272279
9615B72279J2223J166M264M297n287k494k748j707N207J5346N347l796k864J724
$$ 272279 284502 285668 289932 294229 288942 286448 283700 281993 287200 302546 307893 304097 301233 302957
9601C02957N634j394r69J947K826l323o2K416l294N29J0920R997J2450M933L251
$$ 302957 308591 307197 306228 308175 311001 307678 307616 310032 306738 307267 318187 328184 340634 345567 348818
9586C48818k093K680j0935j8753k1122n841r303J063R907L091R28J0859N550L606
$$ 348818 346725 349405 338470 319717 298595 292754 283451 284514 294421 297512 298440 309299 314849 318455
9572C18455J80R168P836K313l764m658K669K054M69L682J553P06l510M97J365
$$ 318455 318635 327803 335639 337952 334188 329530 332199 334253 334722 338404 339957 340663 337153 337650 339015
9557C39015N10Q401J245M736N612L260O388K133l376k629M46N726K998J607O45
$$ 339015 339525 347926 349171 353907 359519 362779 369167 371300 367924 365295 365741 371467 374465 376072 376717
9542C76717k63o443Q38N001j813N099M498M815L053l278k665j770J851J296N511
$$ 376717 376454 370011 370849 375850 374037 379136 383634 388449 391502 388224 385559 383789 385640 386936 392447
9527C92447l06J942R251J933L75K258M089N293J1941N311m20l077k449L393O07
$$ 392447 392141 394083 403334 405267 405642 407900 411989 417282 429223 434534 434114 431037 428588 431981 432588
9512D32588N760j232L317N208j975m152J530J0492J822O08L660K477M349J107
$$ 432588 438348 437116 440433 445641 443666 439514 441044 451536 453358 453966 457626 460103 464452 465559
9498D65559K820J433n105k807N953R361O428L218K177J308j816L459m064N19N544
$$ 465559 468379 469812 464707 461900 467853 477214 483642 486860 489037 490345 488529 491988 487924 488443 493987
9483D93987M920J0540O085Q279K695l774L104K984K196k67M26l634L108P124L384
$$ 493987 498907 509447 515532 523811 526506 522732 525836 528820 531016 530749 531175 527541 530649 537773 541157
9468E41157l145k450K197J132K734J228P781K798K26R847N933J567K810K98K033
$$ 541157 538012 535562 537759 538891 541625 542853 550634 553432 553658 563505 569438 571005 573815 574113 576146
9453E76146P845L243k152p623l051N138P223N227l165l35O928Q601N393M0L634
$$ 576146 583991 587234 585082 577459 574408 579546 586769 591996 588831 588496 595424 604025 609418 609458 613092
9438F13092N927M868p72O863P236r63k186J832J211N638O102k16p65k184J423
$$ 613092 619019 623887 623115 629978 637214 636251 634065 635897 637108 642746 648848 648632 647867 645683 647106
9423F47106J173O203J2970j908P30O079L776j169Q062K753j62n759N243Q824P881
$$ 647106 648279 654482 667452 665544 666274 672353 676129 674960 683022 685775 685613 679854 685097 693921 701802
9408G01802l845R8Q942N516L70O585J448p800m240N847O927K656L641k726K73
$$ 701802 697957 698055 706997 712513 712883 719468 720916 713116 708876 714723 721650 724306 727947 725221 725494
9393G25494M91m215N061R884O499K106j45P054M280P257K657M150M271Q23M152
$$ 725494 725985 721770 726831 736715 743214 745320 745175 752229 756509 763766 766423 770573 774844 775667 779819
9378G79819M389K948L943N782K738L220J950N229L881K628K077m463P738N026
$$ 779819 784208 787156 791099 796881 799619 802839 804789 810018 813899 816527 818604 814141 821879 826905
9364H26905N485J26L375L514N683M270j299j816N882R489L716J2816J3539J78
$$ 826905 832390 832516 835891 839405 845088 849358 848059 846243 852125 861614 865330 878146 891685 891863
9350H91863L828J106J807J484M764N606P080N599q19l416P437O267L552P732J924
$$ 891863 895691 896797 898604 900088 904852 910458 917538 923137 922318 918902 926339 932606 936158 943890 945814
9335I45814k473J158J0494M490k804m856N825O898N338l241K71p67M420L835M224
$$ 945814 943341 944499 954993 959483 956679 951823 957648 964546 969884 966643 966914 966147 970567 974402 978626
9320I78626L380M061J422N046J0853J1516Q352K060r99j445J828J1134J916l377
$$ 978626 982006 986067 987489 992535 1003388 1014904 1023256 1025316 1024317 1022872 1024700 1035834 1037750 1034373
9306A034373M785P927J687n24J639P078J2128J3576M534L326J66Q861J1116J1223
$$ 1034373 1039158 1047085 1048772 1048248 1049887 1056965 1069093 1082669 1087203 1090529 1090695 1099556 1110672 1121895
9292A121895J01J0M676P337K028R13J0748R611L602O284N501l55Q626P063J421
$$ 1121895 1121996 1122006 1126682 1134019 1136047 1136960 1147708 1157319 1160921 1167205 1172706 1172351 1180977 1188040 1189461
9277A189461J2445J1833P819O995P945R572J3234J1031J4126J2171m337n868J667
$$ 1189461 1201906 1213739 1221558 1228553 1236498 1246070 1259304 1270335 1284461 1296632 1292295 1286427 1288094
9264A288094n5n511n247o021L401j018J186N527Q329J6214J1470R321P716R917
$$ 1288094 1288039 1282528 1277281 1271260 1274661 1273643 1274829 1280356 1288685 1304899 1316369 1325690 1333406 1343323
9250A343323O945P961N968N292k04P210P691M303J960L99K791Q529Q778J9930
$$ 1343323 1350268 1358229 1364197 1369489 1369285 1376495 1384186 1388489 1390449 1390848 1393639 1402168 1410946 1430876
9236A430876J2208N875M812O379M913O684Q559j08q364j5642j1537j1302q94J0902
$$ 1430876 1443084 1448959 1453771 1460150 1465063 1471747 1480306 1480198 1471834 1456192 1444655 1433353 1432459 1443361
9222A443361J4407Q230J3144J3110R031J4900J0609J1154J1837P041J300M611
$$ 1443361 1457768 1465998 1479142 1492252 1501283 1516183 1526792 1537946 1549783 1556824 1558124 1562735
9210A562735R133K828P058O981L174M192n25L806J3250N006P768J0936K0593J3711
$$ 1562735 1571868 1574696 1581754 1588735 1591909 1596101 1595576 1599382 1612632 1617638 1625406 1636342 1656935 1670646
9196A670646O467J1322O126P747J0071k0L466Q949O335K179M839P317J0899R024
$$ 1670646 1677113 1688435 1694561 1702308 1712379 1712359 1715825 1724774 1731109 1733288 1738127 1745444 1756343 1765367
9182A765367J7833J1867J3523J3133J3790Q196J1934M315Q826J5303Q381N344
$$ 1765367 1783200 1795067 1808590 1821723 1835513 1843709 1855643 1859958 1868784 1884087 1892468 1897812
9170A897812Q937j2N681P053J4833L926L471P847J3396J1874P411R438N476J1612
$$ 1897812 1906749 1906737 1912418 1919471 1934304 1938230 1941701 1949548 1962944 1974818 1982229 1991667 1997143 2008755
9156B008755J8668J7990Q365Q933P200O952J1245J3253R126J4593J8652J4055
$$ 2008755 2027423 2045413 2053778 2062711 2069911 2076863 2088108 2101361 2110487 2125080 2143732 2157787
9144B157787J2424J3271J0967J4935R455J2534J2817J5003J4163J5702J0090J2878
$$ 2157787 2170211 2183482 2194449 2209384 2218839 2231373 2244190 2259193 2273356 2289058 2299148 2312026
9132B312026J9971J5428J0648J6778K0466R222O556J0113K5113J5961J9314J6168
$$ 2312026 2331997 2347425 2358073 2374851 2395317 2404539 2411095 2421208 2446321 2462282 2481596 2497764
9120B497764J7228J1325R811J6455J1685J6656K0551J4455J0475J4931J3195J0036
$$ 2497764 2514992 2526317 2536128 2552583 2564268 2580924 2601475 2615930 2626405 2641336 2654531 2664567
9108B664567J8863R920J7373K1471J7240J9914K2948J6527J8659J5902J5650J9408
$$ 2664567 2683430 2693350 2710723 2732194 2749434 2769348 2792296 2808823 2827482 2843384 2859034 2878442
9096B878442K7937K4471K1818J5912J3601J6795J6610K1389K5969K2048J9259
$$ 2878442 2906379 2930850 2952668 2968580 2982181 2998976 3015586 3036975 3062944 3084992 3104251
9085C104251K2474J7637J8410K4206K3532K4636K6263K7125K2015K5241K7566
$$ 3104251 3126725 3144362 3162772 3186978 3210510 3235146 3261409 3288534 3310549 3335790 3363356
9074C363356K1959J6478K2742K8565K6775K1312L1516K6177K5067K4565J9332
$$ 3363356 3385315 3401793 3424535 3453100 3479875 3501187 3532703 3558880 3583947 3608512 3627844
9063C627844K3278L2168L1169K5003K2719L0134L3373L5162L3222L1707L2656
$$ 3627844 3651122 3683290 3714459 3739462 3762181 3792315 3825688 3860850 3894072 3925779 3958435
9052C958435L8988L1984K8689L8088L8666L3152L5280L3723K9702L3034L3066
$$ 3958435 3997423 4029407 4058096 4096184 4134850 4168002 4203282 4237005 4266707 4299741 4332807
9041D332807M0023M0893M3037M7020M3378M7067M0069M3074M1308M6610M7224
$$ 4332807 4372830 4413723 4456760 4503780 4547158 4594225 4634294 4677368 4718676 4765286 4812510
9030D812510M5527N0812N5021N4725N8842M9872M7375N5888M9695M6906N3454
$$ 4812510 4858037 4908849 4963870 5018595 5077437 5127309 5174684 5230572 5280267 5327173 5380627
9019E380627N1841N7646O4755O1216O1101N6680N8849O4874O4466O8048P2246
$$ 5380627 5432468 5490114 5554869 5616085 5677186 5733866 5792715 5857589 5922055 5990103 6062349
9008F062349O8308O5734P9719Q0945O9167P5213Q0561Q2938Q2454Q5752R8313
$$ 6062349 6130657 6196391 6276110 6357055 6426222 6501435 6581996 6664934 6747388 6833140 6931453
8997F931453Q9970Q5538Q9923R5197R5836R8208R6558J03675J11219J11330J13560
$$ 6931453 7021423 7106961 7196884 7292081 7387917 7486125 7582683 7686358 7797577 7908907 8022467
8986H022467J18336J29625J24466J29128J33742J25810J32228J37324J48224J51728
$$ 8022467 8140803 8270428 8394894 8524022 8657764 8783574 8915802 9053126 9201350 9353078
8976I353078J56216J55938J66183J74494J77871J86384J83640J87316K03073K07667
$$ 9353078 9509294 9665232 9831415 10005909 10183780 10370164 10553804 10741120 10944193 11151860
8966A1151860K15888K33825K34568K38311K49757K66534K63058K85776L02068
$$ 11151860 11367748 11601573 11836141 12074452 12324209 12590743 12853801 13139577 13441645
8957A3441645L09844L27421L43795L59928L75977L95839M09205M34820M50990
$$ 13441645 13751489 14078910 14422705 14782633 15158610 15554449 15963654 16398474 16849464
8948A6849464M70387M99777N34223N69210N99887O33410O58336P14978P76572
$$ 16849464 17319851 17819628 18353851 18923061 19522948 20156358 20814694 21529672 22306244
8939B2306244Q33324Q89179R61481J037783J064445R19895L83303o24210j182803
$$ 22306244 23139568 24028747 24990228 26028011 27092456 28012351 28395654 27771444 26588641
8930B6588641p40840J01624Q85002J185698J152372R84759P45186M44935M8470
$$ 26588641 25847801 25949425 26834427 28020125 29172497 30157256 30902442 31347377 31395847
8921C1395847m62206j112579j904580k828404l839326m860516n793351o476129
$$ 31395847 30933641 29821062 27916482 25088078 21248752 16388236 10594885 4118756
8913D118756o799825o686576o167044n341535m346550l306044k347332j521608
$$ 4118756 -2681069 -9367645 -15534689 -20876224 -25222774 -28528818 -30876150 -32397758
8905c2397758q43924l14168Q1031L64596N64394P03199P84519Q40314Q66655Q66716
$$ -32397758 -33241682 -33555850 -33474819 -33110223 -32545829 -31842630 -31058111 -30217797 -29351142 -28484426
8895b8484426Q55756Q48081Q22022P83078P58822P26155O95859O59889O26734
$$ -28484426 -27628670 -26780589 -25958567 -25175489 -24416667 -23690512 -22994653 -22334764 -21708030
8886b1708030O05118N81766N49791N22280M96114M76977M49934M32469M20349
$$ -21708030 -21102912 -20521146 -19971355 -19449075 -18952961 -18475984 -18026050 -17593581 -17173232
8877a7173232L93535L79324L61076L44691L36986L23908L05582K92600K84345
$$ -17173232 -16779697 -16400373 -16039297 -15694606 -15357620 -15033712 -14728130 -14435530 -14151185
8868a4151185K77226K72588K50940K45252K38798K26941K13558K10687K09251
$$ -14151185 -13873959 -13601371 -13350431 -13105179 -12866381 -12639440 -12425882 -12215195 -12005944
8859a2005944J97384J94754J76526J70946J74961J76963J67106J59222J47314
$$ -12005944 -11808560 -11613806 -11437280 -11266334 -11091373 -10914410 -10747304 -10588082 -10440768
8850a0440768J46838J48545J43375J35883J26112J21034J26312J24139J21555
$$ -10440768 -10293930 -10145385 -10002010 -9866127 -9740015 -9618981 -9492669 -9368530 -9246975
8841i246975J15543J20855J09169R9317J11511J10410R8712Q9103Q7352R5606
$$ -9246975 -9131432 -9010577 -8901408 -8802091 -8690580 -8580170 -8481458 -8392355 -8305003 -8209397
8831h209397R8989R5442Q3047P0296P5556P9953P9596P8286P8580P8406Q0459
$$ -8209397 -8110408 -8014966 -7931919 -7861623 -7786067 -7706114 -7626518 -7548232 -7469652 -7391246 -7310787
8820g310787O9010O6602O7046O8986P4253O7900N3791N6269N4695N2627O0639
$$ -7310787 -7241777 -7175175 -7108129 -7039143 -6964890 -6896990 -6843199 -6786930 -6732235 -6679608 -6618969
8809f618969N8855M3676N6273N9715N3937N2472N4378N6107M6813M6758M8818
$$ -6618969 -6560114 -6516438 -6460165 -6400450 -6346513 -6294041 -6239663 -6183556 -6136743 -6089985 -6041167
8798f041167M8107M8814M1673L7042M2055M2615M0618M0815M1185L4386L6748
$$ -6041167 -5993060 -5944246 -5902573 -5865531 -5823476 -5780861 -5740243 -5699428 -5658243 -5623857 -5587109
8787e587109L8971L9873L6289L2232L1233L1724L9098M2044L5654K7424L5239
$$ -5587109 -5548138 -5508265 -5471976 -5439744 -5408511 -5376787 -5337689 -5295645 -5259991 -5232567 -5197328
8776e197328L8967L4844L2246L6891L3520L3186K5948K5184K7508K5833L0559
$$ -5197328 -5158361 -5123517 -5091271 -5054380 -5020860 -4987674 -4961726 -4936542 -4909034 -4883201 -4852642
8765d852642L2713L1503K7470K5720K0216K5863L0790K5078L1013K8731K9358
$$ -4852642 -4819929 -4788426 -4760956 -4735236 -4715020 -4689157 -4658367 -4633289 -4602276 -4573545 -4544187
8754d544187K7298L0611K9453K2958K8734K0116J8699K3311K1670K6978J8775
$$ -4544187 -4516889 -4486278 -4456825 -4433867 -4405133 -4385017 -4366318 -4343007 -4321337 -4294359 -4275584
8743d275584J9592J8336K5644L0030K2863J8347J1738J5062K4896K1277J8487
$$ -4275584 -4255992 -4237656 -4212012 -4181982 -4159119 -4140772 -4129034 -4113972 -4089076 -4067799 -4049312
8732d049312K5913J9362K2936K6789J9590J7601K0948K3637J2122Q308J8730J3377
$$ -4049312 -4023399 -4004037 -3981101 -3954312 -3934722 -3917121 -3896173 -3872536 -3860414 -3852106 -3833376 -3819999
8720c819999R601K9255K4379J5689J3511R286J3772K1446J6056J0008J9590K7303
$$ -3819999 -3810398 -3781143 -3756764 -3741075 -3727564 -3718278 -3704506 -3683060 -3667004 -3656996 -3637406 -3610103
8708c610103K2200Q602J2431J5197J7327P202J1942J7716J3506J5126J6167Q416
$$ -3610103 -3587903 -3579301 -3566870 -3551673 -3534346 -3527144 -3515202 -3497486 -3483980 -3468854 -3452687 -3444271
8696c444271J5195R042J7060J6327J2979J2237N831J3649J3716J2983J2275J4605
$$ -3444271 -3429076 -3420034 -3402974 -3386647 -3373668 -3361431 -3355600 -3341951 -3328235 -3315252 -3302977 -3288372
8684c288372J3899O758J3932J9869J6062J4059O822Q60P151K2116J7936Q543J7096
$$ -3288372 -3274473 -3267715 -3253783 -3233914 -3217852 -3203793 -3196971 -3196111 -3188960 -3166844 -3148908 -3140365 -3123269
8671c123269J0643M043J1938J3220J1173J1343K880N823N742P110Q631M925R312
$$ -3123269 -3112626 -3108583 -3096645 -3083425 -3072252 -3060909 -3058029 -3052206 -3046464 -3039354 -3030723 -3025798 -3016486
8658c016486R815J0891N967J930J4056Q784O101J0656Q698R499P333P869Q089
$$ -3016486 -3006671 -2995780 -2989813 -2987883 -2973827 -2965043 -2958942 -2948286 -2939588 -2930089 -2922756 -2914887 -2906798
8645b906798R240R791J5696O309M468M124P999R776J1768J4198L007J809J729
$$ -2906798 -2897558 -2887767 -2872071 -2865762 -2861294 -2857170 -2849171 -2839395 -2827627 -2813429 -2810422 -2808613 -2806884
8632b806884P351J8686J8390O881R93K448J2075J1020O906R578J4629Q649O463
$$ -2806884 -2799533 -2780847 -2762457 -2755576 -2754583 -2752135 -2740060 -2729040 -2722134 -2712556 -2697927 -2689278 -2682815
8619b682815k169P693J3008R752P051L475j164L009N492J1893R643J0840Q020
$$ -2682815 -2684984 -2677291 -2664283 -2654531 -2647480 -2644005 -2645169 -2642160 -2636668 -2624775 -2615132 -2604292 -2596272
8606b596272J0905J2028M985K036Q35M973l12N033J3143R307Q096P97j863J2670
$$ -2596272 -2585367 -2573339 -2568354 -2566318 -2565483 -2560510 -2560822 -2555789 -2542646 -2533339 -2525243 -2524446 -2526309 -2513639
8592b513639J1354N566l966P602J5534J934N108R756J3410P382k379N039R437
$$ -2513639 -2502285 -2496719 -2500685 -2493083 -2477549 -2475615 -2470507 -2460751 -2447341 -2439959 -2442338 -2437299 -2427862
8579b427862J0917M975M263N867J857O758R573Q732J732M884N346L874N951J1528
$$ -2427862 -2416945 -2411970 -2407707 -2401840 -2399983 -2393225 -2383652 -2374920 -2373188 -2368304 -2362958 -2359084 -2353133 -2341605
8565b341605J4160K927m780L228J5647R311M34K682L612J0062P672O030P479N822
$$ -2341605 -2327445 -2324518 -2329298 -2326070 -2310423 -2301112 -2300678 -2297996 -2294384 -2284322 -2276650 -2270620 -2263141 -2257319
8551b257319J2191P394q30m190k42P380N026J997N039N308J445Q576J1529J957
$$ -2257319 -2245128 -2237734 -2238564 -2242754 -2242996 -2235616 -2230590 -2228593 -2223554 -2218246 -2216801 -2208225 -2196696 -2194739
8537b194739J647K934M268M648q51q372J01L668j0708M168J0639O941L056J743
$$ -2194739 -2193092 -2190158 -2185890 -2181242 -2182093 -2190465 -2190364 -2186696 -2197404 -2193236 -2182597 -2175656 -2172600 -2170857
8523b170857O320N208P059J0030M222o02Q149J5274M867K109o88L858O257R233
$$ -2170857 -2164537 -2159329 -2152270 -2142240 -2138018 -2138620 -2130471 -2115197 -2110330 -2108221 -2108909 -2105051 -2098794 -2089561
8509b089561K267O64p70J106P589Q428J492J582l19O866R167K081p632O908R738
$$ -2089561 -2087294 -2086630 -2087400 -2086294 -2078705 -2070277 -2068785 -2067203 -2067522 -2060656 -2051489 -2049408 -2057040 -2050132 -2040394
8494b040394O321O912Q370L560j0516L110l82K724N969J0493N501P824M512J7211
$$ -2040394 -2034073 -2027161 -2018791 -2015231 -2025747 -2022637 -2023019 -2020295 -2014326 -2003833 -1998332 -1990508 -1985996 -1968785
8480a968785M614p956K122J0138N932J332M260K652K92J753L255O284Q33Q76M350
$$ -1968785 -1964171 -1972127 -1970005 -1959867 -1953935 -1952603 -1948343 -1945691 -1945399 -1943646 -1940391 -1934107 -1933274 -1932398 -1928048
8465a928048n410N657J2242j145K810j580J139J254Q465N037N381NL29j730P668
$$ -1928048 -1933458 -1927801 -1915559 -1916704 -1913894 -1915474 -1914335 -1913081 -1904616 -1899579 -1894198 -1894193 -1893864 -1895594 -1887926
8450a887926L431J3072N253p618k149J0564N185J65L335O094J159L436N506M001
$$ -1887926 -1884495 -1871423 -1866170 -1873788 -1875937 -1865373 -1860188 -1860023 -1856688 -1850594 -1849435 -1845999 -1840493 -1836492
8436a836492P694P517o544m811L217p61M009R812N030L253k014K341j031K572
$$ -1836492 -1828798 -1821281 -1827825 -1832636 -1829419 -1830180 -1826171 -1816359 -1811329 -1808076 -1810090 -1807749 -1808780 -1806208
8422a806208J974O180M483N097J553j029M075M801K297N572K634L423Q00N629
$$ -1806208 -1804234 -1798054 -1793571 -1788474 -1786921 -1787950 -1783875 -1779074 -1776777 -1771205 -1768571 -1765148 -1764348 -1758719
8408a758719k249O162N998K607M761K506k257n733O714L345j438O075k305M012
$$ -1758719 -1760968 -1754806 -1748808 -1746201 -1741440 -1738934 -1741191 -1746924 -1740210 -1736865 -1738303 -1732228 -1734533 -1730521
8394a730521M737j775q88P887M367M252l52N203J575o762O522M786j530P327O128
$$ -1730521 -1725784 -1727559 -1728447 -1720560 -1716193 -1711941 -1712293 -1707090 -1705515 -1712277 -1705755 -1700969 -1702499 -1695172 -1689044
8379a689044J683N085J478l11Q811N751l904m631J948Q393J0032J0243J846p277
$$ -1689044 -1687361 -1682276 -1680798 -1681109 -1672298 -1666547 -1670451 -1675082 -1673134 -1664741 -1654709 -1644466 -1642620 -1649897
8365a649897p924N938J0643L610k58r5m728j689O726k71m852M127O969p9R612
$$ -1649897 -1657821 -1651883 -1641240 -1637630 -1637888 -1637983 -1642711 -1644400 -1637674 -1637945 -1642797 -1638670 -1631701 -1631780 -1622168
8350a622168O897M493n483PJ1017M309K907R07l045N362M816n747J920M659k378
$$ -1622168 -1615271 -1610778 -1616261 -1616254 -1605237 -1600928 -1598021 -1597114 -1600159 -1594797 -1589981 -1595728 -1593808 -1589149 -1591527
8335a591527M627Qj926K189J079N735o36m932J027J355J2902Q711k571J19K421
$$ -1591527 -1586900 -1586892 -1588818 -1586629 -1585550 -1579815 -1580451 -1585383 -1584356 -1583001 -1570099 -1561388 -1563959 -1563840 -1561419
8320a561419M538o469J466K140L245P046j185l37M260P205O89p95P604l391k378
$$ -1561419 -1556881 -1563350 -1561884 -1559744 -1556499 -1549453 -1550638 -1550975 -1546715 -1539510 -1538821 -1539616 -1532012 -1535403 -1537781
8305a537781L999o47j127M452K393l58L007O509K793l476m22O151M876M335n356
$$ -1537781 -1533782 -1534429 -1535556 -1531104 -1528711 -1529069 -1526062 -1519553 -1516760 -1520236 -1520658 -1514507 -1509631 -1505296 -1510652
8290a510652K728M64O088k883J240Q537l16l431L686M285k560K544J998k405n923
$$ -1510652 -1507924 -1507460 -1501372 -1504255 -1503015 -1494478 -1494794 -1498225 -1494539 -1490254 -1492814 -1490270 -1488272 -1490677 -1496600
8275a496600O224R588j041q87n97l728M902L262R651M32J703K470K841M572M790
$$ -1496600 -1490376 -1480788 -1481829 -1482716 -1483313 -1487041 -1482139 -1478877 -1469226 -1468794 -1467091 -1464621 -1461780 -1457208 -1452418
8260a452418J715l801K078q67J1787M722k059o092K554l285J641R277J519m448
$$ -1452418 -1450703 -1454504 -1452426 -1453293 -1441506 -1436784 -1438843 -1444935 -1442381 -1445666 -1444025 -1434748 -1433229 -1437677
8246a437677p1K031J1473O156j0970r08N368J545Q499N636o169L606j346j197
$$ -1437677 -1437748 -1435717 -1424244 -1418088 -1429058 -1429966 -1424598 -1423053 -1414554 -1408918 -1415087 -1411481 -1412827 -1414024
8232a414024L979K405K079K233N675R218J0278k622o135j340N899m15k003n35
$$ -1414024 -1410045 -1407640 -1405561 -1403328 -1397653 -1388435 -1378157 -1380779 -1386914 -1388254 -1382355 -1382770 -1384773 -1385308
8218a385308n837K948M486N762O333m051j943J320L172M406J966O453l453o098
$$ -1385308 -1391145 -1388197 -1383711 -1377949 -1371616 -1375667 -1377610 -1376290 -1373118 -1368712 -1366746 -1360293 -1363746 -1369844
8204a369844J996m11K054L87j054M098M867k467M82R451M5j269r00k940J288N076
$$ -1369844 -1367848 -1368259 -1366205 -1365818 -1366872 -1362774 -1357907 -1360374 -1359892 -1350441 -1350396 -1351665 -1352565 -1355505 -1354217 -1349141
8188a349141P971k424l074L062M911N663L860m871N899J0573k436j0220m689k475
$$ -1349141 -1341170 -1343594 -1346668 -1343606 -1338695 -1333032 -1329172 -1334043 -1328144 -1317571 -1320007 -1330227 -1334916 -1337391
8174a337391J906J60O926J1606L537k359n70Q057M052J170l974m910M232L152
$$ -1337391 -1335485 -1335325 -1328399 -1316793 -1313256 -1315615 -1316185 -1308128 -1304076 -1302906 -1306880 -1311790 -1307558 -1304406
8160a304406L769J1458P309O814k507q28j0307j0089o983n382m390q18M118L273
$$ -1304406 -1300637 -1289179 -1281870 -1275056 -1277563 -1278391 -1288698 -1298787 -1305770 -1311152 -1315542 -1316360 -1312242 -1308969
8146a308969N389N327O040q21k130N397Q699m058P84O875R942k976l654l0l386
$$ -1308969 -1303580 -1298253 -1292213 -1293034 -1295164 -1289767 -1281068 -1285126 -1284342 -1277467 -1267525 -1270501 -1274155 -1274185 -1277571
8131a277571l976k05J805j531O172J2039J830L037J862K595j671p547J201k596
$$ -1277571 -1281547 -1281752 -1279947 -1281478 -1275306 -1263267 -1261437 -1258400 -1256538 -1253943 -1255614 -1263161 -1261960 -1264556
8117a264556K453O401N657l144k315J2200J5475N967q481p075j4728j2494j5685
$$ -1264556 -1262103 -1255702 -1250045 -1253189 -1255504 -1243304 -1227829 -1221862 -1230343 -1237418 -1252146 -1264640 -1280325
8104a280325r041M574O426p684p323M988N836Q753%L283n0L811N985R652L862
$$ -1280325 -1289366 -1284792 -1278366 -1286050 -1293373 -1288385 -1282549 -1273796 -1273796 -1270513 -1270563 -1266752 -1260767 -1251115 -1247253
8089a247253J081L189r08o705j019K957P340N045M232k077m813M156K939m088
$$ -1247253 -1246172 -1242983 -1243891 -1250596 -1251615 -1248658 -1241318 -1236273 -1232041 -1234118 -1238931 -1234775 -1231836 -1235924
8075a235924Q903n52R92L416M527M665L390n82q577q40N563m87P10j36n478r44
$$ -1235924 -1227021 -1227573 -1226581 -1223165 -1218638 -1213973 -1210583 -1211165 -1219742 -1220582 -1215019 -1215506 -1214796 -1214932 -1220410 -1221354
8059a221354l2L433J350o001j1038K872N212J0272K418J360n82k628K875K532
$$ -1221354 -1221386 -1217953 -1216603 -1222604 -1233642 -1230770 -1225558 -1215286 -1212868 -1211508 -1212090 -1214718 -1211843 -1209311
8045a209311o426l706L605Q502n44j518K611N862N620J525k344k906j117j46k30
$$ -1209311 -1215737 -1219443 -1215838 -1207336 -1207880 -1209398 -1206787 -1200925 -1195305 -1193780 -1196124 -1199030 -1200147 -1200293 -1200523
8030a200523k106K400R533K367p019k580L686N252N725J733k786k118J71J766
$$ -1200523 -1202629 -1200229 -1190696 -1188329 -1195348 -1197928 -1194242 -1188990 -1183265 -1181532 -1184318 -1186436 -1186265 -1184499
8016a184499N024O871L07p210L00J0328M170k554p075K942P89k209k152l141O146
$$ -1184499 -1179475 -1172604 -1172297 -1179507 -1179207 -1168879 -1164709 -1167263 -1174338 -1171396 -1170607 -1172816 -1174968 -1178109 -1171963
8001a171963K430N356O439O067L755j903n698k538j36M532K134o083m854J356
$$ -1171963 -1169533 -1164177 -1157738 -1151671 -1147916 -1149819 -1155517 -1158055 -1158191 -1153659 -1151525 -1157608 -1162462 -1161106
7987a161106k329P27M475n2j291J265p465L158K723J188j484m857P567O050k426
$$ -1161106 -1163435 -1162708 -1158233 -1158285 -1159576 -1158311 -1165776 -1162618 -1159895 -1158707 -1160191 -1165048 -1157481 -1151431 -1153857
7972a153857K239M186M060K248j63J190J589K379N217j681L44r12K585J169j483
$$ -1153857 -1151618 -1147432 -1143372 -1141124 -1141287 -1140097 -1138508 -1136129 -1130912 -1132593 -1132249 -1133161 -1130576 -1129407 -1130890
7957a130890J711L56q5J101l073J786k374k349J985J278L316K503K198N745L516
$$ -1130890 -1129179 -1128823 -1128908 -1127807 -1130880 -1129094 -1131468 -1133817 -1131832 -1130554 -1127238 -1124735 -1122537 -1116792 -1113276
7942a113276k249P614K751m304o876l558L810k152K611M109J394K237K815N794
$$ -1113276 -1115525 -1107911 -1105160 -1109464 -1116340 -1119898 -1116088 -1118240 -1115629 -1111520 -1110126 -1107889 -1105074 -1099280
7928a099280M509j0060p616j112L623N067j522l286J139k787Q097M286K775M64
$$ -1099280 -1094771 -1104831 -1112447 -1113559 -1109936 -1104869 -1106391 -1109677 -1108538 -1111325 -1103228 -1098942 -1096167 -1095703
7914a095703J549k92M157j385j298j705J017R991P05j3213l322P317M808L384
$$ -1095703 -1094154 -1094446 -1090289 -1091674 -1092972 -1094677 -1093660 -1083669 -1082964 -1096177 -1099499 -1092182 -1087374 -1083990
7900a083990L296j550m14k917m087L906R30k156m156R024Q201M542m412k803j278
$$ -1083990 -1080694 -1082244 -1082658 -1085575 -1089662 -1085756 -1084826 -1086982 -1091138 -1082114 -1073913 -1069371 -1073783 -1076586 -1077864
7885a077864M183J873k207n196L098J853k278l30M208N638j976N38r44j74o51
$$ -1077864 -1073681 -1071808 -1074015 -1079211 -1076113 -1074260 -1076538 -1076868 -1072660 -1067022 -1068998 -1068460 -1069404 -1069578 -1070229
7870a070229L121R95j965L114M954O811m973m708j443K761P512L570J718j024
$$ -1070229 -1067108 -1066113 -1068078 -1064964 -1060010 -1053199 -1058172 -1062880 -1064323 -1061562 -1054050 -1050480 -1048762 -1049786
7856a049786o015j350J685J156m090p87L525J427K172M31K110K463m23P48J285
$$ -1049786 -1055801 -1057151 -1055466 -1054310 -1058400 -1059187 -1055662 -1054235 -1052063 -1051632 -1049522 -1047059 -1047482 -1046734 -1045449
7841a045449J568j516k442j322K739Q7P594j755k33k334J032N710L443k964J339
$$ -1045449 -1043881 -1045397 -1047839 -1049161 -1046422 -1046335 -1038741 -1040496 -1040729 -1043063 -1042031 -1036321 -1032878 -1035842 -1034503
7826a034503K265q133P50L059O376R249K963k521m594k896n82J52P240L391l644
$$ -1034503 -1032238 -1040371 -1039621 -1036562 -1030186 -1020937 -1017974 -1020495 -1025089 -1027985 -1028567 -1028415 -1021175 -1017784 -1021428
7811a021428l239k480M83l805j854j639J709j300O462K304K159N076N913o364
$$ -1021428 -1024667 -1027147 -1026664 -1030469 -1032323 -1033962 -1032253 -1033553 -1027091 -1024787 -1022628 -1017552 -1011639 -1018003
7797a018003J595J1346J412k766j326J364m551M829l750l240K140L977p53K336
$$ -1018003 -1016408 -1005062 -1003650 -1006416 -1007742 -1006378 -1010929 -1006100 -1009850 -1013090 -1010950 -1006973 -1007726 -1005390
7783a005390K839L880j830k342j013J167p509P25J1568M104o047j2790J942P881
$$ -1005390 -1002551 -998671 -1000501 -1002843 -1003856 -1002689 -1010198 -1009473 -997905 -993801 -999848 -1012638 -1010696 -1002815
7769a002815K006P780J016k775l70K325L159l398j497J17K449Q01J305L262r96
$$ -1002815 -1000809 -993029 -992013 -994788 -995158 -992833 -989674 -993072 -994569 -994452 -992003 -991202 -989897 -986635 -987631
7754i87631J323J570L511L193k861p336m389k455l179J519N214j640K538N190
$$ -987631 -986308 -984738 -981227 -978034 -980895 -988231 -992620 -995075 -998254 -996735 -991521 -993161 -990623 -985433
7740i85433j918j031q97R661J055l739J846K51m020n304m903O573M177L248J1321
$$ -985433 -987351 -988382 -989279 -979618 -978563 -982302 -980456 -980205 -984225 -989529 -994432 -987859 -983682 -980434 -969113
7725i69113Q659o497j0025l544r1L433M424k435n063p58n75O615K444J200k793
$$ -969113 -960454 -966951 -976976 -980520 -980611 -977178 -972754 -975189 -980252 -981010 -981585 -974970 -972526 -971326 -974119
7710i74119L377J3247M361l449J390o165j972l229L311L702n251K82M507K511
$$ -974119 -970742 -957495 -953134 -956583 -955193 -961358 -963330 -966559 -963248 -959546 -964797 -964515 -960008 -957497
7696i57497L854r40k608M049l375n850O15k553J134j171K160o18K098j927j793
$$ -957497 -953643 -954583 -957191 -953142 -956517 -962367 -961752 -964305 -963171 -964342 -962182 -962800 -960702 -962629 -964422
7681i64422R628p67m739N65J555P946L409K276M158k35o426j325L375K383Q44
$$ -964422 -954794 -955561 -960300 -959735 -958180 -950234 -946825 -944549 -940391 -940626 -947052 -948377 -945002 -942619 -941775
7666i41775L41Q022P40J868n760J430M962K909k744j835n620q73r61j63Q10L311
$$ -941775 -941434 -933412 -932672 -930804 -936564 -935134 -930172 -927263 -930007 -931842 -937462 -938335 -939296 -939459 -938649 -935338
7650i35338k147m36J197K752L761N19n630l765o046n839m019J0152P52K833k111
$$ -935338 -937485 -937921 -936724 -933972 -930211 -929692 -935322 -939087 -945133 -950972 -954991 -944839 -944087 -941254 -943365
7635i43365K444J0175K695n232k358M928M464k610l975j264K986K233O127J387
$$ -943365 -940921 -930746 -928051 -933283 -935641 -930713 -926249 -928859 -932834 -934098 -931112 -928879 -922752 -921365
7621i21365N249K94j914K020o313m555J820J450K749l232j994P92Q081N722n664
$$ -921365 -916116 -915822 -917736 -915716 -922029 -926584 -924764 -923314 -920565 -923797 -925791 -924999 -916918 -911196 -916860
$$ [...]
##END NTUPLES=NMR SPECTRUM
##END=
