##TITLE=Analysis number 329652
Compound Code cc 66916
Book Reference 510/84
Project Code adrs
Chemist Name jimp
##JCAMPDX= 6.0         $$ Bruker NMR JCAMP-DX V2.0
##DATA TYPE= NMR SPECTRUM
##DATA CLASS= NTUPLES
##ORIGIN= Bruker BioSpin GmbH
##OWNER= nmr
$$ XWIN-NMR		Version 3.5
$$ Thu Sep 20 13:25:41 2007 GMT Daylight Time (UT+1h)  MAYBRIDGE\nmr@NMR_250MHZ
##.OBSERVE FREQUENCY= 250.131544655141
##.OBSERVE NUCLEUS= ^1H
##.ACQUISITION MODE= SIMULTANEOUS (DQD)
##.ACQUISITION SCHEME= undefined
##.AVERAGES= 16
##.DIGITISER RES= 18
##SPECTROMETER/DATA SYSTEM= dpx250
##.PULSE SEQUENCE= zg30
##.SOLVENT NAME= CDCl3
##.SHIFT REFERENCE= (INTERNAL, CDCl3, 0, 16.522)
##AUDIT TRAIL= $$ (NUMBER, WHEN, WHO, WHERE, WHAT)
$$ ##TITLE= Audit trail, XWIN-NMR		Version 3.5
$$ ##JCAMPDX= 5.01
$$ ##ORIGIN= Bruker BioSpin GmbH
$$ ##OWNER= nmr
$$ C:\u/data/dgb/nmr/ADRS/2080/pdata/1/auditp.txt
$$ ##AUDIT TRAIL=  $$ (NUMBER, WHEN, WHO, WHERE, WHAT)
(   1,<2007-09-20 13:25:19.54 +100>,<MAYBRIDGE\nmr>,<NMR_250MHZ>,
      <created by zg, POWCHK disabled, PULCHK disabled
       configuration hash MD5:
       76 6E 9A 78 1E 09 19 81 EC 84 63 8F B0 6A 59 2D
       data hash MD5: 64K
       F3 DF 28 50 AE F2 1B 36 44 A5 9A 90 BB 5A 7B 43>)
(   2,<2007-09-20 13:25:31.79 +100>,<MAYBRIDGE\nmr>,<NMR_250MHZ>,
      <Start of raw data processing
       ef LB = 0.3 FT_mod = 6 PKNL = 1 SI = 32K 
       data hash MD5: 32K
       D8 D1 9E 0B A7 74 9B 4B DB 12 32 89 B6 88 18 54>)
(   3,<2007-09-20 13:25:33.35 +100>,<MAYBRIDGE\nmr>,<NMR_250MHZ>,
      <apk 
       data hash MD5: 32K
       13 16 C9 5D 3B AB 34 E9 CC 23 9D 22 AC 96 BE CC>)
(   4,<2007-09-20 13:25:34.28 +100>,<MAYBRIDGE\nmr>,<NMR_250MHZ>,
      <abs ABSG = 5 
       data hash MD5: 32K
       B7 FC 5C 35 31 58 F7 89 2D 9F EB 71 49 3B 80 99>)
$$ ##END=
$$ 
$$ hash MD5
$$ AF 5E 1E 58 39 E1 A0 1A 66 75 1E AC A1 CA 05 C4
##$RELAX= 
##$RELAX= 
##$RELAX= 
##$RELAX= 
##$RELAX= 
##$RELAX= 
##$RELAX= 
$$ Bruker specific parameters
$$ --------------------------
##$DU= <C:\u>
##$EXPNO= 2080
##$NAME= <ADRS>
##$PROCNO= 1
##$TYPE= <nmr>
##$USER= <dgb>
##$AMP= (0..31)
100 100 100 100 100 100 100 100 100 100 100 100 100 100 100 100 100 100 
100 100 100 100 100 100 100 100 100 100 100 100 100 100 
##$AQSEQ= 0
##$AQ_mod= 3
##$AUNM= <au_zg>
##$AUTOPOS= <8 >
##$BF1= 250.13
##$BF2= 250.13
##$BF3= 250.13
##$BF4= 250.13
##$BF5= 500.13
##$BF6= 500.13
##$BF7= 500.13
##$BF8= 500.13
##$BYTORDA= 1
##$CFDGTYP= 0
##$CFRGTYP= 5
##$CHEMSTR= <none>
##$CNST= (0..31)
1 1 145 1 1 1 1 1 1 1 1 1 1 1 1 1 1 1 1 1 1 1 1 1 1 1 1 1 1 1 1 1 
##$CPDPRG= <>
##$CPDPRG1= <>
##$CPDPRG2= <>
##$CPDPRG3= <>
##$CPDPRG4= <mlev>
##$CPDPRG5= <mlev>
##$CPDPRG6= <mlev>
##$CPDPRG7= <mlev>
##$CPDPRG8= <mlev>
##$CPDPRGB= <>
##$CPDPRGT= <>
##$D= (0..31)
0 1 0 0 0 0 0 0 0 0.06 0 0 0 0 0 0 0.0002 0 0 0 0 0 0 0 0 0 0 0 0 0 0 
0 
##$DATE= 1190291118
##$DBL= (0..7)
120 120 120 120 120 120 120 120 
##$DBP= (0..7)
150 150 150 150 150 150 150 150 
##$DBP07= 0
##$DBPNAM0= <>
##$DBPNAM1= <>
$$ [...]
##$SUBNAM7= <"">
##$SUBNAM8= <"">
##$SUBNAM9= <"">
##$SW= 20.6930455092707
##$SWIBOX= (0..15)
0 0 3 0 0 0 0 0 0 0 0 0 0 0 0 0 
##$SW_h= 5175.983436853
##$TD= 65536
##$TD0= 1
##$TE= 296.16
##$TE2= 300
##$TE3= 300
##$TEG= 300
##$TL= (0..7)
0 120 120 120 120 120 120 120 
##$TP= (0..7)
150 150 150 150 150 150 150 150 
##$TP07= 0
##$TPNAME0= <>
##$TPNAME1= <>
##$TPNAME2= <>
##$TPNAME3= <>
##$TPNAME4= <>
##$TPNAME5= <>
##$TPNAME6= <>
##$TPNAME7= <>
##$TPOAL= (0..7)
0.5 0.5 0.5 0.5 0.5 0.5 0.5 0.5 
##$TPOFFS= (0..7)
0 0 0 0 0 0 0 0 
##$TUNHIN= 0
##$TUNHOUT= 0
##$TUNXOUT= 0
##$USERA1= <user>
##$USERA2= <user>
##$USERA3= <user>
##$USERA4= <user>
##$USERA5= <user>
##$V9= 5
##$VALIST= <valist>
##$VCLIST= <CCCCCCCCCCCCCCC>
##$VD= 0
##$VDLIST= <DDDDDDDDDDDDDDD>
##$VPLIST= <PPPPPPPPPPPPPPP>
##$VTLIST= <TTTTTTTTTTTTTTT>
##$WBST= 1024
##$WBSW= 4
##$XGAIN= (0..3)
0 0 0 0 
##$XL= 0
##$YL= 0
##$YMAX_a= 329366
##$YMIN_a= -489351
##$ZGOPTNS= <>
##$ZL1= 120
##$ZL2= 120
##$ZL3= 120
##$ZL4= 120
##$ABSF1= 16.522
##$ABSF2= -4.171173
##$ABSG= 5
##$ABSL= 3
##$ALPHA= 0
##$AQORDER= 0
##$ASSFAC= 0
##$ASSFACI= 0
##$ASSFACX= 0
##$ASSWID= 0
##$AUNMP= <proc_1d>
##$AZFE= 0.1
##$AZFW= 0.1
##$BCFW= 0
##$BC_mod= 0
##$BYTORDP= 0
##$COROFFS= 0
##$CY= 12.5
##$DATMOD= 1
##$DC= 0
##$DFILT= <>
##$DTYPP= 0
##$F1P= 14.0000005364418
##$F2P= -0.99999901652339
##$FCOR= 0.5
##$FTSIZE= 32768
##$FT_mod= 6
##$GAMMA= 0
##$GB= 0
##$INTBC= 1
##$INTSCL= 1
##$ISEN= 128
##$LB= 0.3
##$LEV0= 0
##$LPBIN= 0
##$MAXI= 10000
##$MC2= 0
##$MEAN= 0
##$ME_mod= 0
##$MI= 0
##$NCOEF= 0
##$NC_proc= -2
##$NLEV= 6
##$NOISF1= 0
##$NOISF2= 0
##$NSP= 0
##$NTH_PI= 0
##$NZP= 0
##$OFFSET= 16.522
##$PC= 1
##$PHC0= 155.5796
##$PHC1= 9.144787
##$PH_mod= 1
##$PKNL= yes
##$PPARMOD= 0
##$PSCAL= 4
##$PSIGN= 0
##$REVERSE= no
##$SF= 250.13
##$SI= 32768
##$SIGF1= 0
##$SIGF2= 0
##$SINO= 400
##$SIOLD= 32768
##$SREGLST= <1H.CDCl3>
##$SSB= 0
##$STSI= 32768
##$STSR= 0
##$SW_p= 5175.98343685301
##$SYMM= 0
##$S_DEV= 0
##$TDeff= 65536
##$TDoff= 0
##$TI= <Analysis number 999999
Compound Code 99
Book Reference 9
Project Code 9>
##$TILT= no
##$TM1= 0
##$TM2= 0
##$TOPLEV= 0
##$USERP1= <user>
##$USERP2= <user>
##$USERP3= <user>
##$USERP4= <user>
##$USERP5= <user>
##$WDW= 1
##$XDIM= 32768
##$YMAX_p= 312836857
##$YMIN_p= -120752
$$ End of Bruker specific parameters
$$ ---------------------------------
##NTUPLES= NMR SPECTRUM
##VAR_NAME=  FREQUENCY,     SPECTRUM/REAL,   SPECTRUM/IMAG
##SYMBOL=    X,             R,               I
##VAR_TYPE=  INDEPENDENT,   DEPENDENT,       DEPENDENT
##VAR_FORM=  AFFN,          ASDF,            ASDF
##VAR_DIM=   32768,         32768,           32768
##UNITS=     HZ,            ARBITRARY UNITS, ARBITRARY UNITS
##FACTOR=    0.157963299565203, 1,           1
##FIRST=     4132.6476996994, 0,             0
##LAST=      -1043.33573715361, 0,           0
##MIN=       -1043.33573715361, -120752,     0
##MAX=       4132.6476996994, 312836857,     0
$$ Real data points
##PAGE= N=1
##DATA TABLE= (X++(R..R)), XYDATA
$$ [...]
19054G57878L0915L2420K9680L2395J10595J62180J57141K64898L72597N07230
19044B457929P31781J088890J613876K608909M224109N616286N092734K420448
19036B5854962q41186k815892k585992j97283K703266L619099J541124j930022
19028B5348076m655116n567760m740461l157041j922771j196687q21849n86572
19020B699819m44526l09821k45091j70756q9301k8697o446Q272k1971o2098n6121
19009A273263m5442j1395J0890L2618N0843L1038m3319n4963j3650K1594Q2741
18998A334218J64323K39230K93415M15238O87084J052040J587951K428046L919100
18989A2120645N712250O058364L794065K10879k576605l173513j275010J944367
$$ plain form
19054 757878 788793 821213 850893 883288 993883 1156063 1313204 1578102 1950699 2457929
19044 2457929 3189710 4278600 5892476 8501385 12725494 18341780 23434514 25854962
19036 25854962 25013776 22197884 19611892 19414609 22117875 25736974 27278098 25348076
19028 25348076 20692960 15125200 10384739 7227698 5304927 4108240 3286391 2699819
19020 2699819 2255293 1945472 1700381 1529625 1440324 1411627 1405181 1413453 1391482 1329384 1273263
19009 1273263 1227821 1216426 1227316 1259934 1310777 1341815 1298496 1243533 1229883 1251477 1334218
18998 1334218 1498541 1737771 2031186 2446424 3133508 4185548 5773499 8201545 12120645
18989 12120645 17832895 23891259 27685324 27896203 25319598 22146085 20871075 22815442
18981B2815442L893237K654080q53131m287971n973539n594532m038750k484795
18973F130041j519695r95971o90664n15549l98132l42996k78861j99460j34492
18964A054221m8750n8049q5513p6896j07478n3169l2515k4463k0685J6017j933
18953E60787n0939r4179q6582k8726k7140k6377m2123l2575j2093k9368r936j5680
18941A05069j0206j1479k3921k4357p328K9248J7318K0456J0470j6172k0442K2792
18929I1448K458K3208K2330K3718J7082K4712J3039k8468k9300J5676K62L5496
18917B11661p219k6097j3940l5271n2557j9651L068P280l3799p745J8995r601
18905C5124J4607K1362L337r302j2708K653J7473j1513p814L161j8929K883j0201
$$ plain form
18981 22815442 26708679 29362759 28509628 24221657 18248118 12653586 8614836 6130041
18973 6130041 4610346 3614375 2923711 2408162 2010030 1667034 1388173 1188713 1054221
18964 1054221 1005471 947422 861909 785013 677535 624366 591851 567388 546703 562720 560787
18953 560787 509848 415669 329087 300361 273221 246844 204721 172146 160053 130685 120749 105069
18941 105069 94863 83384 59463 35106 27778 57026 74344 94800 105270 89098 68656 91448
18929 91448 93906 117114 139444 163162 180244 204956 217995 189527 160227 175903 176165 211661
18917 211661 204442 178345 164405 129134 76577 56926 59994 67274 33475 25730 44725 35124
18905 35124 49731 71093 74430 65128 52420 55073 72546 61033 53219 56380 37451 40334 30133
18892C0133L8919K2259r956k6352k5186J3771r016m1269o315L7663M0878Q668
18880G4197J6434J6021m606M4123L3562K0606O95J1639l817r619n617J1137M6079
18867B50834J96o1303j9934j844j7164j2734n4324n0578l5327J0421J0937J934
18855B1114P725K1888r134o196j5303j1975j4547J31q341j2295O456K1748Q766
18842A0037M2091K149n610N662o62j6313o63k037J0299l1762j8185M0545J0891
18829D6442k8543J6881K8550J1864m252o233K4253L7254L602k0783q996j9053
18817H0986J518K3562k358j2737K4103J3986p229j8540k0690l7677m5963J2948
18805A1909j8663q53L4305K1919q297l056q436Q169J9052k5144l0942J571N860
$$ plain form
18892 30133 69052 91311 81355 55003 29817 43588 34572 -6697 -13012 24651 65529 74197
18880 74197 90631 106652 102046 146169 179731 200337 201032 212671 208854 199235 193618 204755 250834
18867 250834 251030 189727 169793 167949 150785 138051 83727 33149 -2178 8243 19180 21114
18855 21114 28839 50727 41593 35397 20094 8119 -6428 -6297 -14638 -26933 -20477 1271 10037
18842 10037 52128 54277 48667 54329 53667 37354 36691 34654 44953 13191 -4994 35551 46442
18829 46442 17899 34780 63330 75194 70942 64709 88962 126216 129818 109035 100039 80986
18817 80986 82504 106066 103708 90971 115074 129060 121831 103291 82601 44924 -1039 11909
18805 11909 -6754 -7607 26698 48617 40320 37264 28828 36997 56049 30905 -37 1534 7394
18792G394P320J4357R458j2560k95j3491J1531J8882M0945R444k828R097j6275
18779H2979P588K9884k3041k0824r750k0433M270N486Q970L6434P8155P3435K5072
18766B78225l1705q1701p5795k8704l824k1512l9018M191L3890N690K299M305
18754D6341J3381j6162J660n815k1090k0315k984N811J9780j954k459k6104q61
18741a0771L1455m6O75J3573J9805K2436j7788j8090M176P552p962l4808j6659
18728f452M21K1212k5602j5824M0628J7641j0314p301o54J0352J9163K0627J1225
18715G5122p731Q024K981j1558k212j3341P42m9K1824M399k1895m716J5471O214
18701G3275j7971j9418K6177P533J0759L0461j4826k3873q543J840J9940k333
$$ plain form
18792 7394 14714 29071 38529 25969 25674 12183 23714 42596 83541 92985 90157 99254 82979
18779 82979 90567 120451 97410 76586 66836 46403 50673 56159 65129 101563 179718 253153 278225
18766 278225 246520 164819 89024 60320 56496 34984 -4034 157 34047 39737 42036 46341
18754 46341 59722 43560 45220 39405 18315 -2000 -4984 827 20607 18653 16194 -9910 -10771
18741 -10771 20684 20638 21313 34886 54691 77127 59339 41249 45425 52977 45015 10207 -6452
18728 -6452 -6031 15181 -10421 -26245 14383 32024 21710 14409 13755 24107 43270 63897 75122
18715 75122 67391 75415 78396 66838 64626 51285 52027 51978 73802 78201 56306 51590 67061 73275
18701 73275 55304 35886 62063 69596 80355 110816 95990 72117 63574 65414 85354 83021
18689H3021N195J707j6091j3863m171k4496J222O980Q802J0845r002r32J1887
18676F1104l297j0523K9087K706j1571j7268j8281K0375j484k596L0722n228k51
18663G3495J3189k0384j5084M186J894J0313j2703j6069K9425Q570p867l0299
18651C8666J2870J1371Q144J4564K3532r445L399J2965o106j3322k0403k719p297
18638F6219L4348J5461j167N59j0042l7280o098L1148J6799Q865J9055J7012L430
18625A58309L851j4317j4922k0587j4858L2263K2623j1472N092L1183K4405J4373
18613B15943O863J437J462k3615K274J5058N3742M8587N6089M9966N6718M4889
18601E29413J6981l393M2331L2663N6893R1720M5655P059p934j3222M4719P4951
$$ plain form
18689 83021 88216 89923 73832 59969 55798 31302 32524 39504 48306 59151 50149 49217 61104
18676 61104 57807 47284 76371 79077 67506 50238 31957 52332 50848 48252 78974 73746 73495
18663 73495 86684 66300 51216 55402 57296 67609 54906 38837 68262 76832 68965 38666
18651 38666 51536 62907 71051 85615 109147 99702 103101 116066 109960 96638 76235 73516 66219
18638 66219 100567 116028 114861 115420 105378 68098 62000 93148 109947 118812 137867 154879 158309
18625 158309 162160 147843 132921 112334 97476 129739 152362 140890 145982 177165 201570 215943
18613 215943 222806 224243 225705 202090 204364 219422 273164 321751 377840 427806 484524 529413
18601 529413 546394 543001 585332 617995 674888 766608 812263 819322 811388 798166 842885 917836
18589I17836N8831J21785J34928J73110L00469M43770O94485J085766J724431
18580E655411K898533M287618M342913L422352K456550L49437j320626j269158
18572B0823030m1512J034248J088223P91922r73173l156893m050590m161292l476411
18563G877552k331726j430551q81772n49777l51293k62306j77133j07103j05159
18554A680732j08013m8362j0294k723M8749K3671J0684K4297j5659n221L4429
18543A632290M7011L3508Q4862J08234J38191K68349M72382P30060J130140J795952
18533F440979K998916M696476N226301M196618L193917R48608j355661j697546
18525B4648608n71721Q21891J071570R11905o14892l178703m495875m772013m211920
$$ plain form
18589 917836 976667 1098452 1233380 1406490 1706959 2150729 2845214 3930980 5655411
18580 5655411 8553944 12841562 17184475 20606827 23063377 23412814 22092188 20823030
18572 20823030 20781518 21815766 22903989 23695911 22722738 19565845 15515255 11353963 7877552
18563 7877552 5545826 4115275 3233503 2683726 2332433 2070127 1892994 1785891 1680732
18554 1680732 1572719 1524357 1514063 1511340 1560089 1583760 1594444 1618741 1603082 1597861 1632290
18543 1632290 1679301 1712809 1797671 1905905 2044096 2312445 2784827 3514887 4645027 6440979
18533 6440979 9439895 14136371 19362672 23559290 26753207 27701815 26346154 24648608
18525 24648608 24076887 24898778 25970348 26882253 26267361 23088658 18592783 13820770 9608850
18516I608850k966004j830196j144928p77031n53819l69973k56335k01453j76452
18507A332659j13326j13872k2394k4860m3000o0153n7610K149k5845j6111m0440
18496H17197n0206o8749p2468n2354l1610n0208n7289q0205k9096J1621n8529
18485B78104m1813k6751l6617p385j0425J0217R338N514O6548K2525k0468J3514
18473B62301j1604j8920j0397j7728l0573j1394q879r651l3164l6438K562O494
18461H2609K790O770j0052j6064j5024r193J2215L5103J0558Q540J6613L9641
18449A64506L5054k7354m9101k2945j6124p749j1527J9833L6109k7056j6055J8418
18437I6009M6820N3575K3989r36Q661J2910o0610m6283l7440L510J3458n0357
$$ plain form
18516 9608850 6642846 4812650 3667722 2890691 2336872 1966899 1710564 1509111 1332659
18507 1332659 1219333 1105461 1083067 1058207 1015207 955054 897444 899593 873748 857637 817197
18496 817197 766991 698242 625774 573420 541810 491602 434313 354108 325012 336633 278104
18485 278104 236291 209540 172923 165538 155113 165330 174668 180182 246730 269255 248787 262301
18473 262301 250697 231777 221380 203652 173079 161685 152806 143155 109991 73553 76115 82609
18461 82609 85399 92169 82117 66053 51029 41836 54051 89154 99712 108252 124865 164506
18449 164506 199560 172206 123105 100160 84036 76287 64760 84593 120702 93646 77591 96009
18437 96009 142829 196404 220393 219457 228118 241028 180418 134135 96695 100205 113663 63306
18425F3306k1031M649L5279M4421m613r014K4171J6954Q808L1254L6629K4776
18413B55589L9325k5263p3132n6572j6477p580l2670m688N0139N0433K5074M7945
18401B52123m389N709j2329k3247q0496l6787J0724j441r813m6393j0482K0415
18389F3594j704k0754J373k3021l2317n025M0153K0227P715q582l0825M972j1261
18376D545K9742j1737J3211J3907o703J3952j1332k7209M138Q760q688j706j4218
18363F662M0359K2931k0331m9390K1226L348P220J5891P773K9620L0592O803j2871
18350A09833k4190n4898J920M2986J4625j0318k5792k6880j2851J95J485J2116
18338B8231m618J144q636q356l537O018L496J3682m6495j7930P173J437J4429
$$ plain form
18425 63306 42275 46924 82203 126624 122011 112997 137168 154122 162930 194184 230813 255589
18413 255589 294914 269651 196519 139947 123470 115890 83220 78532 128671 179104 204178 252123
18401 252123 247734 253443 241114 217867 137371 100584 111308 109867 100054 53661 43179 63594
18389 63594 61890 41136 42509 19488 -12829 -17854 22299 42526 50241 41659 10834 15806 4545
18376 4545 34287 22550 35761 49668 42965 56917 45585 18376 22514 31274 22586 20880 6662
18363 6662 47021 69952 49621 231 21457 24805 32025 47916 55689 85309 115901 122704 109833
18350 109833 85643 30745 32665 75651 90276 79958 54166 27286 14435 14630 16115 28231
18338 28231 23613 24757 16121 7765 4228 10246 13742 27424 -19071 -37001 -29828 -28391 -13962
18325a3962J5937Q391Q249o814J5923j9734j5922n782L0314J9396j4350k500j5304
18312C842q266J8837J2734k7037P363J704j1153l5360n346J2787j9772j9466L3589
18299c5544L2527k4233Q726K6273J7755p481k0488l495R885N05K8831j9372n16
18286A3373K89k2218n401J1729k4713J0176J4036J5846K898r175K2295K6133O901
18273F2169K2878k4180p230K5753q214J4759K1840O349k8794k2542O441K5649
18261I4878L1109O17j8231l5416l6616K1817n882l0555o574P734J9571K8340J6055
18248H6847j1675j5536m459K631j0564o463M697k7117K1794J3249n562L1125K3646
18235A02613M864l1732k6468k4418k0587J1702j380p774q151k942K0165J900k352
$$ plain form
18325 -13962 1975 10366 18615 11801 27724 7990 -7932 -13714 16600 35996 21646 19146 3842
18312 3842 -4424 14413 27147 110 7473 9177 -1976 -37336 -42682 -29895 -49667 -69133 -35544
18299 -35544 -3017 -27250 -18524 7749 25504 18023 -2465 -5960 3925 4430 33261 13889 13373
18286 13373 13662 -8556 -13957 -2228 -26941 -16765 -2729 13117 16015 6840 29135 55268 62169
18273 62169 85047 60867 53637 79390 71176 85935 107775 114124 85330 62788 69229 94878
18261 94878 125987 126604 108373 72957 36341 58158 52276 21721 15147 22881 42452 70792 86847
18248 86847 75172 59636 55177 57808 47244 40781 45478 18361 40155 53404 47842 78967 102613
18235 102613 107477 75745 49277 24859 4272 15974 14594 6820 -1331 -4273 15892 17792 15440
18222A5440L5303K4924K0033j9222J495L1090r58Q301Q779l1980j9297j6925N650
18209F2633j289j1107L820j5997j5621j8719O061M345K316k3445J1566J2748m214
18196A3097n703R788K9087L3706M922K3966j9938l0798l6359P352K9284L90k1609
18183C7185K0446k630o477K426j3672o997k1453K3062p001j9966J9764K8832P62
18170E4281l184K2834R886m474K1332L533l3096k069J4049M8162q275k9394j7169
18157G6416M56J4935Q138j0636p823J2390Q748O145J9801K3380K2206r210l9744
18144A25202K2957J2035J0947J1614L8966m245j2876r501K0388J56K5987M9213
18132B90843M9442M0956L8002K8440K3908J4630M2777Q6370P7312J16693J43102
$$ plain form
18222 15440 50743 75667 95700 76478 77973 109063 108105 116406 125185 93205 73908 56983 62633
18209 62633 61344 50237 54057 38060 22439 3720 9781 14126 16442 -7003 4563 17311 13097
18196 13097 7394 17182 46269 79975 84897 108863 88925 58127 21768 29120 58404 58794 37185
18183 37185 57631 55001 48524 50950 37278 30281 8828 31890 24889 4923 24687 53519 54281
18170 54281 51097 73931 83817 79343 100675 104208 71112 69043 83092 131254 122979 93585 76416
18157 76416 76872 91807 99945 89309 81486 93876 102624 108769 128570 151950 174156 164946 125202
18144 125202 148159 160194 171141 182755 221721 217476 204600 195099 215487 215643 241630 290843
18132 290843 340285 381241 419243 447683 471591 486221 528998 615368 692680 809373 952475
18121I52475J28976J92328K93172L68428N28640R23187J550531K419410L756005
18112A1113152O679819J2411892J4877531N319385l855906j0449633j2712579
18105B3383661r198400m992788k717008j631757j092149p63438o02957m11924
18097A973240l06856k37373k14422j93794j37625j37774j09089n7187o8808m0257
18087D70055l7051n5730n829K494n8607m9455n2713j9496p11Q266K1029J6052
18075B38304j8591k1595j7132l6217k7060J0850j1291q856o908J252J7348l589
18063A16515j5093l653l783J5846L5581Q687K0873q952j5148j0382J384K804L2451
18050A77130L3226q757j5412k9428m3057j5261J8468J4896j1398J1018n522j1913
$$ plain form
18121 952475 1081451 1273779 1566951 1935379 2464019 3387206 4937737 7357147 11113152
18112 11113152 17792971 30204863 45082394 50401779 46545873 36096240 23383661
18105 23383661 14185261 9192473 6475465 4843708 3751559 2988121 2385164 1973240
18097 1973240 1666384 1429011 1214589 1020795 883170 745396 636307 579120 510312 470055
18087 470055 433004 377274 371445 373939 315332 265877 213164 193668 192957 201223 222252 238304
18075 238304 219713 198118 180986 144769 117709 128559 117268 108412 101504 102756 120104 116515
18063 116515 101422 97769 93986 109832 145413 154100 174973 166021 150873 140491 141875 144679 177130
18050 177130 210356 201599 186187 156759 113702 98441 116909 131805 120407 131425 125903 113990
18038A13990M193J5741p387j5169j2875K5338j4744l8907M105L25r144M1058J4369
18025A20893l963J3738K0469m736j1380j2616J6343M1193p490M428o161k6541
18013A44177K9958Q4438J7896o092O351n075j0467k7801k4775Q118J2340K7484
18001B56552K1573j6606p564j5605m4843k8782k1783k1795j084O973j7473n552
17989A04011J8363M8956J8346K082j297j3877m1921P979J4903N422j5613K132
17977A49486M1898J3859K4193K8676N3225Q7100K9130J8942M9793M2252k4802
17966E13752j5702o610j5012m8979j534k68K3038M0400K9988P0119P8220N6640
17954G24052O1798Q7958J58787K31015L35468M07339N72940R37507J498736K323517
$$ plain form
18038 113990 118183 133924 126537 111368 98493 123831 109087 70180 74285 74610 65466 106524 120893
18025 120893 116930 130668 151137 146401 135021 122405 138748 179941 172451 176879 170718 144177
18013 144177 174135 258573 276469 270377 276728 271653 261186 233385 208610 216728 229068 256552
18001 256552 278125 261519 253955 238350 193507 164725 142942 121147 120063 127036 109563 104011
17989 104011 122374 171330 189676 191758 190461 176584 134663 142642 157545 162967 147354 149486
17977 149486 191384 205243 229436 258112 311337 398437 427567 446509 496302 538554 513752
17966 513752 498050 491440 476428 427449 425915 425647 448685 489085 519073 589192 667412 724052
17954 724052 785850 873808 1032595 1263610 1599078 2006417 2579357 3516864 5015600 7339117
17944G339117L863358O252647P456533M269944q08760m811561o595543n702052
17936A1263683l721730k210616j359714q95890n71891l76069k75305j86919j38453
17927A527096r0561r3284q6394n9398m2740l481L8564J4171k691J5587M162O6464
17915A287495Q186m7246k3593j4594j1175r74k355J6670N9269J16537J73399K41974
17903A803593L43930M72597O16260R69599J505243K321059L727032O143754Q336548
17894B6239615P495648N119682L215373l74040m512694o902324p917380o984923
17886A5378957m751592k847089j680332j112136p56716n12048l49626l08560k53462
17877B807396j85044j42382j63374q2650j0326L8283J07587J87944K70420L31746
$$ plain form
17944 7339117 11202475 17455122 24911655 29181599 28372839 23561278 16965735 11263683
17936 11263683 7541953 5331337 3971623 3075733 2503842 2127773 1852468 1665549 1527096
17927 1527096 1436535 1343251 1256857 1197459 1154719 1151238 1189802 1203973 1201282 1216869 1221031 1287495
17915 1287495 1295681 1248435 1224842 1210248 1199073 1198099 1195744 1212414 1271683 1388220 1561619 1803593
17903 1803593 2147523 2620120 3236380 4205979 5711222 8032281 11759313 17903067 26239615
17894 26239615 33735263 38854945 42070318 41696278 37183584 30281260 22363880 15378957
17886 15378957 10627365 7780276 6099944 4987808 4231092 3719044 3369418 3060858 2807396
17877 2807396 2622352 2479970 2316596 2233946 2223620 2261903 2369490 2557434 2827854 3159600
17867C159600M49800O12317Q58029J213495J808812K762404M063287N436650O334921
17858B6699315O126579M626814K010020j051383l837587n509942n812499n040961
17850A8210356l544615j894397l35284J292642L453901N806009N829158K860237
17842C1678007J9608j177312m4286K485922M159474L894912J883326j037750l959407
17833C7902494o003088o712238o270404n068200l651230k525458j733540j233808
17825D704528q53276n96323m23281l40834k44782j44176r9936o4295n9937r6794
17815A780894j10194q0496n8176j04791j18681j39948j29789j19751j24619p7485
17805G16964n9628r2163p8235k8322l7597j2096N646j4102k6937n0372k5089k6396
$$ plain form
17867 3159600 3609400 4221717 5079746 6293241 8102053 10864457 14927744 20364394 26699315
17858 26699315 32825894 37452708 39462728 38411345 34573758 29063816 23251317 18210356
17850 18210356 14665741 12771344 12436060 13728702 17182603 22988612 28817770 31678007
17842 31678007 31697615 30520303 30476017 32961939 37121413 41016325 42899651 41861901 37902494
17833 37902494 31899406 25187168 18916764 13848564 10197334 7671876 5938336 4704528
17825 4704528 3851252 3254929 2831648 2490814 2246032 2101856 2001920 1937625 1877688 1780894
17815 1780894 1670700 1590204 1532028 1427237 1308556 1168608 1038819 919068 794449 716964
17805 716964 657336 565173 486938 458616 421019 408923 414569 400467 373530 323158 298069 271673
17793B71673m1526k6429m5048k2306k8446m0775k1537j596n957K6002L9642O882
17781A10579o996j2037N767M42j0657q423M291K5307r455j8636n559m594r517
17768F0512m8616l5631l665J3765L901R914L0472K2206L536l3728q457K7008K3427
17755F4644k4091m2889k1113O538K7082p765L964J5065J7691k0271k6264m500
17743a1909p987K0819L6423k024K2826j560k1952J791L5360K6106R87l8139k2443
17730C8298j7216L2860j7545n3357j2174r60q252K3701L9737J946l4075l6075
17718d3112J7977O769L14j226Q132J4177j8l728j2641j8437l2000J3166L1994
17705a8633m294J2607J8211k323j768K9090L710j2765j6648r644j1474k9873j9776
$$ plain form
17793 271673 230147 203718 158670 136364 107918 67143 45606 44010 38053 64055 103697 110579
17781 110579 103583 91546 97313 97755 87098 78675 82966 108273 98818 80182 74623 70029 60512
17768 60512 11896 -23735 -27400 -13635 -9734 180 30652 52858 56394 22666 14209 41217 64644
17755 64644 40553 -2336 -23449 -16911 10171 2406 6370 21435 39126 18855 -7409 -11909
17743 -11909 -19896 923 37346 35322 58148 56588 34636 36427 71787 97893 98880 60741 38298
17730 38298 21082 53942 36397 -16960 -29134 -30094 -38346 -14645 25092 27038 -7037 -43112
17718 -43112 -25135 -18366 -18052 -19278 -11146 3031 3013 -715 -13356 -31793 -63793 -50627 -18633
17705 -18633 -22927 -10320 7891 5568 3800 32890 36600 23835 7187 -2457 -13931 -43804 -63580
17692f3580j3499L6353M3653o918p832l746m963J1213K0284O602J3730l1111j4422
17679a4236J7166J8313r365k0293k980j5369k480r514r732j9655k825J3215P36
17666e7019L1436M5821O371j4348j9411R689k526j2949k3919n405L498K6941n102
17653a6923j1521J9649J3703l1991l389n178k2679n134j3135L4796K7280l9895
17641e4417j8969J3827J0249Q037L750J2696j0759j9183O35m868l0024J2822L5016
17628d1188J8870k4020r045n718m342k3728l960K4451K3196K1272O427q436p441
17615c3662j7202J0974J5368J6888K0474o278p709k1384j926M715O42J5707K7139
17602B3746J3705m26j5323j1338k269j1934L835J0679L815j1083q772j2335J1133
$$ plain form
17692 -63580 -77079 -40726 2927 -3991 -11823 -15569 -20532 -9319 10965 17567 31297 186 -14236
17679 -14236 2930 21243 11878 -8415 -11395 -26764 -29244 -38758 -48490 -68145 -70970 -57755 -57019
17666 -57019 -25583 20238 26609 12261 -7150 2539 13 -12936 -36855 -42260 -38762 -11821 -16923
17653 -16923 -28444 -8795 4908 -27083 -30472 -35650 -58329 -63463 -76598 -41802 -14522 -54417
17641 -54417 -73386 -59559 -49310 -41273 -37523 -24827 -35586 -54769 -54134 -59002 -89026 -76204 -41188
17628 -41188 -22318 -46338 -55383 -61101 -65443 -89171 -93131 -68680 -45484 -24212 -17785 -26221 -33662
17615 -33662 -50864 -39890 -24522 -7634 12840 6562 -1147 -22531 -24457 -19742 -19100 -3393 23746
17602 23746 37451 37025 21702 10364 8095 -3839 -4 10675 14490 3407 -5365 -17700 -6567
17589f567O81O682O885L674J1696Q075k5707j82j4228k3012Q481K4155o81n560
17575e608Q900R567J1911L4429K6079N0546Q5510M0552k2243l985m8068m9396
17563A38194p0078n6824l2928Q687K8045j5815j8274q627m384K0525L0850J2185
17551C1556L5289M9843K1791M4032L8665R691n2420q7614n8825k4584J1532M2519
17539F1475J950l8162n443q075j1008k990K310j694j7066r532p177J3284L101
17526a9027l62k2228n166M124q867j8435o45m187L589K4023K4681m033K764L653
17512b0116n726l446J437J6741K1071k8858k3622q292P385K5296J3318j448j4316
17499b0576r849J4564p19K8618J2815J5329m5614n1351j0701K8110K4617L07k4996
$$ plain form
17589 -6567 -5886 796 7681 11355 23051 31126 5419 5237 -8991 -32003 -23522 633 -48 -5608
17575 -5608 3292 12859 24770 59199 85278 135824 221334 261886 239643 235658 187590 138194
17563 138194 68116 11292 -21636 -12949 15096 -719 -18993 -27620 -32004 -11479 19371 31556
17551 31556 66845 116688 138479 182511 221176 230867 178447 90833 32008 7424 18956 61475
17539 61475 63425 25263 19820 11745 737 -2253 57 -1637 -18703 -28235 -35412 -22128 -19027
17526 -19027 -19389 -41617 -46783 -42659 -51526 -69961 -70606 -74793 -71204 -47181 -22500 -26533 -23769 -20116
17512 -20116 -25842 -29288 -27851 -11110 9961 -18897 -42519 -50811 -43426 -18130 -4812 -6260 -20576
17499 -20576 -30425 -15861 -16580 12038 24853 40182 -5432 -56783 -67484 -39374 -14757 -14450 -39446
17486c9446P009l0967J5855L8845M0111N0153m869k6625N379K2760P020K1504
17474A06729N5035N6709J3731l0861R233J4513J9789j3973j1555p602j8721l5191
17462A57836m0993j5819l2944m0006k0110j6044K130J0882J4403m496Q609m85
17450B2963k0060q744k252J4785L6931P9899R0762N7477l9762n3323l0852m7442
17438A00382m5047j073J0284j8699k9860j9943k0987J2400M2802Q934m079o73
17426C4441J3872O6207L1578l521k8362m7775j3919J0169l6262q934K3966M043
17414D5503j2627q510k9416p938l1862k3221L3009L6761K3482J6912j0553j066
17402C0474K6590J6354j993l7867j5016q54K4915j406j9232l079Q888j4855R251
$$ plain form
17486 -39446 -32437 -63404 -47549 -8704 31407 81560 76691 50066 55445 78205 85225 106729
17474 106729 161764 218473 232204 201343 210576 225089 244878 230905 219350 211748 193027 157836
17462 157836 116843 101024 68080 28074 7964 -8080 -5950 4932 19335 14839 23448 22963
17450 22963 2903 -5841 -8093 6692 43623 123522 214284 271761 231999 178676 147824 100382
17438 100382 55335 54262 64546 45847 15987 -3956 -24943 -12543 30259 39193 35114 34441
17426 34441 48313 114520 146098 142577 114215 66440 52521 62690 26428 17494 41460 45503
17414 45503 32876 24366 -5050 -12988 -44850 -68071 -35062 1699 25181 42093 31540 30474
17402 30474 57064 73418 71425 33558 18542 17688 42603 41197 21965 18886 27774 12919 22170
17389B2170N952m1579n461L1758J6624o427p412K4829K8008K513l272N1726O7681
17376A87110J0895P892p863m926j0230m8828m6547m4601k5455p593J457P675j2371
17363F615J6974k0130m7K9375j1422o878L175M827k0648o490J3702n244j852M573
17349F530j15K551J7684l2806l5726J0983q99P03K9734J9505k0745M247j1837
17336a0191K8436K0560j9505j7355J2554K332J4935J1195L4765K4271j325j5186
17324H5486j3386k0880l7563l2644j0178R311M1258L2863oj4172k79K0235l9588
17311B0457o297J3086M333j4572j4332Q554Q518K3881Q990j4892l7075j9659k775
17298b1783O800n373k9857n727J33P872K6198n695L1553L4535P46r446n708L8502
$$ plain form
17389 22170 28122 -13457 -18918 12840 29464 23037 15625 40454 68462 70975 67703 119429 187110
17376 187110 198005 205897 198034 193108 182878 134050 87503 42902 17447 9854 11311 18986 6615
17363 6615 23589 3459 3412 32787 21365 14487 17662 22489 1841 -4649 9053 3809 1957 6530
17349 6530 6415 8966 26650 -6156 -41882 -30899 -31798 -31095 -1361 18144 -2601 1646 -10191
17336 -10191 18245 38805 19300 1945 14499 16831 31766 42961 77726 101997 100672 85486
17324 85486 72100 51220 13657 -18987 -29165 -19854 21404 54267 54261 40089 39810 60045 20457
17311 20457 14160 27246 31579 17007 2675 11229 19747 43628 52618 37726 651 -19008 -21783
17298 -21783 -14983 -20356 -50213 -55940 -55807 -47935 -21737 -27432 4121 38656 39402 29956 24248 62750
17284F2750l955r625L456R152J0256K0719r885K729j4745j4772J6522K2709M9996
17271A45307M4759Q628l9347k7975j6003O100N863k4239n0175o389K3095k0781
17259D8843l7844n482K5307J4987K595N6073N8743L1364L6961J7744l3897l6481
17247A78913q586l7558k5916n0017m6213J612j7239j997K6389j9024j2129J1174
17235e91K652K03N814K1177l447J0388J9878J3486l3831l1294j8664p79P603J1422
17221D017k2421K681L4117j6290l0092k7271o226J4286n902L4126L9839j7708
17209C156j9571k156k7234j864Q52k2555J5775K2100L2932O586k1185M177K6268
17196A7281J7965l5310j5720k208p939O905J8791k4389j5176Q284M5988K0602
$$ plain form
17284 62750 58795 49170 52626 61778 72034 92753 82868 85597 70852 56080 72602 95311 145307
17271 145307 190066 198694 159347 131372 115369 121469 127332 103093 52918 46529 69624 48843
17259 48843 10999 5517 30824 45811 48406 104479 163222 194586 231547 249291 215394 178913
17247 178913 170327 132769 106853 56836 10623 12235 -5004 -7001 19388 364 -11765 -591
17235 -591 2061 2264 8078 29255 25808 36196 56074 69560 35729 4435 -14229 -15008 -7405 4017
17221 4017 -18404 -15723 18394 2104 -27988 -55259 -61485 -47199 -53101 -18975 20864 3156
17209 3156 -16415 -18571 -45805 -47669 -46817 -69372 -53597 -31497 1435 8021 -13164 -8987 17281
17196 17281 35246 -64 -15784 -17992 -25931 -19026 -235 -24624 -39800 -31516 14472 35074
17184C5074k045n013j0038n903l7535k6941k548M2453R293K0054K3195j6058m097
17171A9891N675L164k5932k2920K2122K9626J6016J4835j0781l5143j4698L7254
17159C9109k135l5928m038L3433k3965o715K1478j5803j1637j7122J913K8433
17147G023j4J6907L109J8866K9507K3921j3374k2856j6319k4284k3936l642j4042
17134a9134J962K2628K104J9500k0082k6768l366M56J7628J2192J367n361M690
17121G816j5442Q244K0935J9757M287R241Q530j0976j4446m541K8080J3452o855
17108F8082R186j0174j5247P16M163l0007k0877j1088J7139j3397j472J1006j4277
17095f247N24J0631L5775J5200r192O015l976j6852N368K2410J849J6753J8019
$$ plain form
17184 35074 33029 28016 17978 12075 -25460 -52401 -54949 -12496 -3203 16851 40046 23988 19891
17171 19891 25566 28730 2798 -20122 2000 31626 47642 62477 51696 16553 1855 39109
17159 39109 36974 1046 -2992 30441 6476 -239 21239 5436 -6201 -23323 -21410 7023
17147 7023 7009 23916 27025 45891 75398 99319 85945 63089 46770 22486 -1450 -5092 -19134
17134 -19134 -17172 5456 7560 27060 6978 -19790 -23156 -22700 -5072 7120 8487 3126 7816
17121 7816 -7626 618 21553 41310 45597 54838 63368 52392 37946 33405 61485 74937 68082
17108 68082 77268 67094 51847 52563 56726 26719 5842 -5246 11893 -1504 -2976 8030 -6247
17095 -6247 -5723 4908 40683 55883 46691 52706 48730 31878 37246 59656 61505 78258 96277
17082I6277r961j2427k1422k951L2720J6000k070Q657Q739k0250j2912j3067O556
17069G3889q627K1309J8163Q387J5145k15o776L1029J2778P632P835j1237n1372
17056A17940j4321L8553L3976J1554K3692j441P707L5102J081O778L0400J9528
17044C10549M4499K4656O1085O5765N0671N2788O3486Q2879R0684O2691O4887
17033I74640L8966N4987N1168J04835J60891J58374J24268J25777K02718L43872
17023B340496N14753P37341J172154J813868K786510M289471O927431J0705831
17015C1287855J2072054P422921p98589p658942j0861958r830863o678093l970853
17007A0983532k365203j509307r78899n88955k16181J99859O54957J309003K144416
$$ plain form
17082 96277 86316 73889 52467 49516 82236 98236 96166 104823 113562 93312 80400 67333 73889
17069 73889 65262 86571 104734 113121 128266 128051 121275 152304 165082 172714 180549 169312 117940
17056 117940 103619 142172 176148 187702 211394 209953 217660 252762 253843 260621 291021 310549
17044 310549 355048 379704 440789 506554 557225 610013 673499 756378 847062 909753 974640
17033 974640 1013606 1068593 1119761 1224596 1385487 1543861 1668129 1793906 1996624 2340496
17023 2340496 2855249 3592590 4764744 6578612 9365122 13654593 20582024 31287855
17015 31287855 43359909 50782830 49984241 42325299 31463341 21632478 14954385 10983532
17007 10983532 8618329 7109022 6130123 5541168 5324987 5524846 6179803 7488806 9633222
16998I633222L421036N663747R113434J1473436Q472050J014950o204917j0255762
16990C2331196j0185536p328206m460311k687636j710147j196161q77981o80804
16982C204414n24373l79600k36636j86833j26474j46175j64188j39330r5460j01786
16972A103559o8442p1789j00595q1922l8736l1297n4360p2760p8006k1724l3712
16961D50216q2696n9868l0704m1284m9296q524k9170l084N7617M2859n679J719
16949B42106J0434l6335n4526l5898l0721l5440J0750L13J1262Q200Q916j5383
16937H3678j2065L300k6328Q890Q13J6713L652o197j9670j5976L661J872j6608
16924B5735O170L0942j6546m5754j3461K0488K0022o021r412J8584j1239J0548
$$ plain form
16998 9633222 13054258 18718005 27831439 39304875 47776925 48791875 42586958 32331196
16990 32331196 22145660 14817454 10357143 7669507 5959360 4763199 3885218 3204414
16982 3204414 2680041 2300441 2063805 1876972 1750498 1604323 1440135 1300805 1205345 1103559
16972 1103559 1035117 963328 862733 780811 742075 710778 656418 583658 505652 483928 450216
16961 450216 367520 307652 276948 235664 186368 177844 148674 145590 203207 246066 240387 242106
16949 242106 252540 216205 161679 125781 95060 59620 70370 70683 81945 90145 99061 83678
16937 83678 71613 74913 48585 57475 58288 75001 78653 72456 52786 36810 40471 42343 25735
16924 25735 31905 62847 46301 547 -12914 7574 27596 21575 12163 30747 19508 30056
16912C0056j1532q946L2618K08j6450j0036J551N6498j8229l7796j7867J4042
16900A4117K0726L718m5636k2731J2989P901m543o940Q869O949q776J066R96j8439
16886b9734Q32K460r005J3440J7439k1982l1992j8379l865J7529L217j5038L7398
16873c7680R561M12j5002J2825K4187m2142p297J3955K8175J865j4702J2248J4935
16860A340r651j2376j7842J4062J4381M721m0370J4394K6320k210j1111q419Q486
16847a8275p688J4246L7950j2412k2400L745J514j0297l2457M937J4762j1665
16835c8040J296K3016O538j1956J7922N8340q93k4596j9557l972k4082J4672K010
16822F98K0054J4995R806J1606J4402m0845l5070K9305R678k2620j4321l062J0585
$$ plain form
16912 30056 18524 9578 42196 42404 25954 15918 17469 73967 55738 17942 75 14117
16900 14117 34843 38561 -7075 -29806 -16817 -8916 -13459 -20399 -11530 -4581 -13357 -12291 -11295 -29734
16886 -29734 -28902 -26442 -35447 -22007 -4568 -26550 -58542 -76921 -80786 -63257 -60040 -75078 -37680
16873 -37680 -28119 -27707 -42709 -29884 -5697 -47839 -55136 -41181 -13006 -11141 -25843 -13595 1340
16860 1340 -8311 -20687 -38529 -24467 -10086 -5365 -45735 -31341 -5021 -7231 -18342 -26761 -18275
16847 -18275 -25963 -11717 26233 13821 -8579 -4834 -3320 -13617 -46074 -41137 -26375 -38040
16835 -38040 -36744 -13728 -7190 -19146 -1224 57116 56223 31627 12070 8098 -15984 -1312 698
16822 698 20752 35747 45553 57159 71561 30716 -4354 24951 34629 12009 -2312 -5374 5211
16809E211K0707j4846J0975j1706L500Q142k0763k8822l0811J0953j1438J3790
16797d5108M022K3833L210j1023m665l55J0392O272K0898j4792j1975J9938L2067
16784C2714N459j0024j1941K3940j2362L54Q023m578k6109Q85j627l3299m373
16771c2938L683J9995O861k6107L100K3672J5155o314k1537K2608L9060J8027
16759F5265j0082K389j8548k8832m168N679o224m1765R876L6976Q73J1975R054
16746C2468l1842j7396o123J2259p287J3651K4940K6990r916k8515r478K438K7152
16733B9341l0685j2955o955N025M441j6879J4536j1489m9609R142N366N953J6107
16720c8661K3247K0698j1k3490j754O934J5741k368Q338k3480J1375k9537r206
$$ plain form
16809 5211 25918 11072 22047 10341 13841 21983 1220 -27602 -58413 -47460 -58898 -45108
16797 -45108 -41086 -17253 -14043 -25066 -29731 -30086 -19694 -13422 7476 -7316 -19291 647 32714
16784 32714 38173 28149 16208 40148 27786 28140 36163 31585 5476 6361 4734 -28565 -32938
16771 -32938 -29255 -9260 -2399 -28506 -25406 -1734 13421 7107 -14430 8178 47238 65265
16759 65265 55183 57572 39024 10192 6024 11703 5479 -36286 -26410 10566 11439 23414 32468
16746 32468 626 -16770 -22893 -10634 -17921 -4270 20670 47660 37744 9229 -249 2189 29341
16733 29341 -1344 -14299 -21254 -16229 -11788 -28667 -14131 -25620 -75229 -66087 -60721 -54768 -38661
16720 -38661 -15414 5284 5273 -18217 -19971 -13037 2704 336 8674 -14806 -3431 -32968 -42174
16707d2174N608P875J8233j7655l140q769l5059J1579M1869R462l3679L0832K807
16694a2211k0615j7477J2430J5271o907N142P168K5647J5738M802K219m0174k5274
16681c4241J6052m137J7832j3064P232p803k7463K6314J0691k584K5364m13r57
16668A2823j0955j1878O410j5703m490j5676O813J3877j926J5075r947j6517N251
16655b6843j1873k2243K361K9051J7002j7885J6991J7940j2615O32J2586J3464
16643A8568j7275K707j9738R914K0347l236Q201R18j1986J2333K352j7504j8087
16630a2486j5483O177J7518q873K6906J2031k5864k0674J0733M302j1453j0198
16618b7364j4505m979K0317J2677j2661k5921J5843J6844l493K6336J3890J6881
$$ plain form
16707 -42174 -36566 -28691 -10458 -28113 -31253 -40022 -75081 -63502 -21633 -12171 -45850 -15018 -12211
16694 -12211 -32826 -50303 -37873 -22602 -29509 -24367 -17199 8448 24186 28988 31207 -8967 -34241
16681 -34241 -18189 -22326 -4494 -17558 -10326 -18129 -45592 -19278 -8587 -11171 14193 13780 12823
16668 12823 1868 -10010 -3600 -19303 -23793 -39469 -32656 -18779 -20705 -5630 -15577 -32094 -26843
16655 -26843 -38716 -60959 -58598 -29547 -12545 -30430 -13439 4501 -8114 -7482 5104 18568
16643 18568 1293 4000 -15738 -5824 14523 11287 19488 20406 8420 20753 23105 5601 -12486
16630 -12486 -27969 -21792 -4274 -13147 13759 25790 -74 -20748 -10015 -5713 -17166 -27364
16618 -27364 -41869 -46848 -26531 -13854 -26515 -52436 -36593 -19749 -23242 3094 16984 33865
16606C3865j1607J04R69k951j8238l5545O610J6430j5444L5090R457k0282k1635
16593b3177j498K321k0042N7309L1132j7224l7308j5744l9567m555L5546j4527
16581d7334R49R730j2637K9110n588K6727P701J256o696m063P003J188J3505M385
16567B5236j7962j8009M03j8380l569o553l7829l879K5666K3567j0211o915J5706
16554c2729k2996L505j2212j9355j6727k0238L5600J5894L6495L192O097o19n256
16541b9349K0729L2364k3681j5222j9942r046J7654J3K4545J5991j8810O224P849
16528I319J6170j9618j2758j9210K4065J3718k5242k0010k9337L674l609q857
16516g1695J4801N5763q556m7433n135O323K9202J6906m887K2396O005k9794j7407
$$ plain form
16606 33865 22258 22362 23331 20380 2142 -33403 -26793 -10363 -25807 9283 18740 -1542 -23177
16593 -23177 -24675 -22354 -42396 14913 46045 28821 -8487 -24231 -63798 -68353 -32807 -47334
16581 -47334 -46385 -36655 -49292 -20182 -25770 957 8658 9914 3218 -845 6158 7346 20851 25236
16567 25236 7274 -10735 -10332 -28712 -32281 -38834 -76663 -80542 -54876 -31309 -41520 -48435 -32729
16554 -32729 -55725 -52220 -64432 -83787 -100514 -120752 -85152 -69258 -32763 -29571 -23474 -24093 -29349
16541 -29349 -8620 23744 63 -15159 -35101 -44147 -26493 -26480 -1935 14056 -4754 1470 9319
16528 9319 25489 5871 -6887 -26097 -2032 11686 -13556 -33566 -62903 -59229 -62838 -71695
16516 -71695 -56894 -1131 -9687 -57120 -62255 -55932 -26730 -9824 -14711 7685 13690 -16104 -33511
16503c3511k251J5701J8337R433k616k1063J726J655p276J3562j5313P208J1501
16490b907j3868k3679J5111N293R247R906o064j9434K1974k5307j4243o729K872
16477d7828n601q924J5074M5495K1431J3312j8891q764j6420q309m175L554Q529
16464a1517L3580J4703k1353j3071J9817N4123L8623J1250N0632L3559L3980j7454
16452B26872m1156n8771l7196k6851k2990L242l4138j1828M21j1666J7861J1931
16440A5731j9132J5240M3955L6194P3616O2438J3089P355k9452o3757o2887k7828
16428F4562N78k8679k3563n135r369k250j5653j1234J7943p078j6144N13Q166
16415b7343j2802K1670K9393K988l7499J1546j610j8835k5064q463K2513p21K0219
$$ plain form
16503 -33511 -35762 -20061 -1724 7709 5093 -15970 -14244 -12589 -19865 -6303 -21616 -14408 -2907
16490 -2907 -16775 -40454 -25343 -20050 -10803 -897 -6961 -26395 -4421 -29728 -43971 -50700 -47828
16477 -47828 -53429 -62353 -47279 -1784 19647 32959 14068 5304 -11116 -19425 -23600 -20046 -11517
16464 -11517 22063 36766 15413 2342 22159 76282 114905 126155 176787 210346 244326 226872
16452 226872 185716 126945 89749 62898 39908 43150 9012 -2816 -2395 -14061 3800 15731
16440 15731 -3401 11839 55794 91988 165604 228042 241131 248486 219034 155277 92390 64562
16428 64562 65140 36461 12898 7763 -1606 -3856 -19509 -30743 -12800 -19878 -36022 -35509 -27343
16415 -27343 -40145 -18475 10918 13906 -23593 -12047 -13657 -32492 -57556 -66019 -43506 -44227 -24008
16402b4008J6576O328j0682n738j1753J1052L0336K499K651j1170k3816m071R173
16389a2623k5388L4835N147L851j3009j1732K7504o42k5404q617l0269j4850K0673
16376e0524K2038O815J449k8564l2331L5831K2777J5894j1322J0317j59k9153
16364c6932o915N077N997Q599n360o433j2625L952K2186l763j5721o898n766J0996
16350d3606N034K0197Q720j5901j8398L072M311k4841r415J7753J4541j0329L0306
16337a8556q077j0453K559J9380p686j4312k3739k2804R006L0492K1104J471j4613
16324c6228l0919j5380Q658J9655j6693j459L2251J0290J1166q329L7665k277
16312H400j6171j3788j1111j8749M69J0293R912L216J4165K4833m990n181j6792
$$ plain form
16402 -24008 -7432 -1104 -11786 -17524 -29277 -18225 12111 14610 17261 6091 -17725 -21796 -12623
16389 -12623 -38011 -3176 1971 5822 -7187 -18919 8585 7943 -17461 -26078 -56347 -71197 -50524
16376 -50524 -28486 -21671 -20222 -48786 -81117 -45286 -22509 -6615 -17937 -7620 -7779 -36932
16364 -36932 -43847 -38770 -32773 -24174 -29534 -35967 -48592 -44640 -22454 -26217 -41938 -48836 -54602 -43606
16350 -43606 -38572 -18375 -9655 -25556 -43954 -40882 -36571 -61412 -70827 -53074 -38533 -48862 -18556
16337 -18556 -26633 -37086 -34527 -15147 -22833 -37145 -60884 -83688 -74682 -44190 -23086 -21615 -36228
16324 -36228 -67147 -82527 -73869 -54214 -70907 -72366 -40115 -29825 -18659 -26988 10677 8400
16312 8400 -7771 -21559 -32670 -51419 -50950 -40657 -30745 -27529 -13364 11469 6479 1298 -15494
16299a5494j3383j6180R1K1752K0136j951Q897K0081K5649J1584k7464k9497j9481
16286a5260P73j3378j6115R660K5407j352r534J3581n89o064J0596k3467k408
16273b8150K008K3196k945k5043J0830R086o46l98j2480P430j0614j0793R254
16260b9265k887q855K765J4076J5606K0957p712j1191j2458q17J4502m786J3106
16247C041l8617j5706j7623J130M1744J9940j2655K602m270j8343p67L9427p886
16234g983j5734N0408L3860j9805l6863k3604M6K7011J8483j9148l3508r454J8373
16221a7918J7666J7941o472m063l94l257o832j1647J4772K6776k1559j9325p925
16208b2237l664k6591k1273N000J5351K6143K3588J0141k7047k9878j8625J5180
$$ plain form
16299 -15494 -28877 -45057 -44966 -23214 -3078 -5029 3868 23949 49598 61182 33718 4221 -15260
16286 -15260 -14487 -27865 -43980 -34320 -8913 -10265 -19799 -6218 -6807 -12871 -2275 -25742 -28150
16273 -28150 -26142 -2946 -5891 -30934 -20104 -11018 -11664 -12062 -24542 -17112 -27726 -38519 -29265
16260 -29265 -32152 -41007 -38242 -24166 -8560 12397 4685 -6506 -18964 -19781 -5279 -10065 3041
16247 3041 -35576 -51282 -68905 -67775 -26031 -6091 -18746 -16144 -20414 -38757 -39524 -97 -7983
16234 -7983 -23717 26691 60551 40746 3883 -19721 -19675 7336 25819 6671 -26837 -36291 -17918
16221 -17918 -252 17689 11217 7154 6760 3503 -3329 -14976 -204 26572 5013 -14312 -22237
16208 -22237 -25901 -52492 -73765 -68765 -53414 -27271 -3683 6458 -20589 -50467 -69092 -53912
16196e3912K3302n575L3780P152K4802J4994l1587j8594j4518m5995j2469K1707
16184e6913J6564j0804L0928Q035k104K4062j9561L994N1626m24k1306m0387k8890
16171d5180L055O106J388k725L7105m904j0517p301j4572K0862J7572k894k0269
16158b2274M3935j1479k1508j8686r985J5765K726K7650J4427K755m195l8153
16146a9022j8224p606P463J3637k2648r635R108R371J0118j280J5216K0051J0001
16133A6550N457j228j1687m0700k6377J3307L3341J446j7559K1174J5733K5512
16121C4969k575j2305k3382K8837k0129J3871L3124m32j1250o771o772j4319p689
16108E177l1076J5085o169J3950J4967j1524J1135n157Q182q193j3757J5252N080
$$ plain form
16196 -53912 -30610 -36185 -2405 4747 29549 44543 12956 -5638 -20156 -66151 -78620 -56913
16184 -56913 -40349 -51153 -20225 -12190 -14294 9768 -9793 -5799 45827 45403 24097 -16290 -45180
16171 -45180 -42125 -36019 -34631 -37356 -251 -5155 -15672 -22973 -37545 -16683 889 -2005 -22274
16158 -22274 21661 10182 -11326 -30012 -39997 -24232 -21506 6144 20571 23326 19131 -19022
16146 -19022 -37246 -44852 -37389 -23752 -46400 -56035 -46927 -37556 -27438 -28718 -13502 6549 16550
16133 16550 22007 20779 9092 -31608 -57985 -44678 -11337 -9891 -27450 -6276 9457 34969
16121 34969 32394 20089 -3293 25544 5415 19286 52410 51978 40728 33957 27185 12866 5177
16108 5177 -25899 -10814 -16983 -3033 11934 410 11545 6388 14570 6377 -7380 7872 12952
16095A2952p411k0550j0243j1395k7387L894K1041j4333q112J7203O386k3474
16083f1429K993M7994J4630j0385J8960J770k1267j7510N873j1616N918P15L7183
16070A3829j1460k7166k6438K8154K4498j4770q277J7937j1024k2945m021M8258
16058F575K5444r760m6550k156k551J3693N230J5989k0422M490J2753o116j5574
16045a8955K3865J8029j1914k3014j7553J9481J646j4784k7716j0104K8753L2695
16033D29l837k9189q326K2387J9491K588j7033K6146J9088R13J2674m191K489
16020D3629o746j3166j4581R940J9469K5853q691l9432L33q334P850M515l2636
16007a1997l4362n913K3956K4402k001k2454K903j6230l3786J1999M6858L0499
$$ plain form
16095 12952 5541 -15009 -25252 -36647 -64034 -60140 -39099 -53432 -61544 -44341 -37955 -61429
16083 -61429 -58436 -10442 4188 -6197 12763 14533 -6734 -24244 -18371 -29987 -24069 -23354 13829
16070 13829 2369 -24797 -51235 -23081 1417 -13353 -21630 -3693 -14717 -37662 -41683 6575
16058 6575 32019 22259 -24291 -26447 -28998 -15305 -10075 5914 -14508 -10018 2735 -3381 -18955
16045 -18955 4910 22939 11025 -11989 -29542 -10061 -8415 -23199 -50915 -61019 -32266 429
16033 429 -3408 -32597 -40923 -18536 955 3543 -13490 12656 31744 32657 45331 41140 43629
16020 43629 36883 23717 9136 19076 38545 64398 55707 16275 16608 8274 16124 20639 -11997
16007 -11997 -46359 -52272 -28316 -3914 -5915 -28369 -25466 -41696 -75482 -63483 -16625 13874
15995A3874M040k7583J0537N855j5589O222O659R594J942n084m785j4744J6197
15982G135p019m0439K480J8661K3108J8122o949n895K0163L0982j0822l8365n2699
15969d1537j4361L535K2006k8872j1557L0803O0089J4640j6055k3223j6108p623
15957b8263J5068J6835M598n068K8346j1725k7994O659l554l3205j0140M0304
15945h139P704j8314j5023N654K7171o344l3032r48J8975J2939L063J5252j0050
15932a092m4854j4179J8629O939O373r982J7161L384j818j0565J4119j241k1563
15919c8689p368M7496L013p727Q355K785M165K8282o176j9646k1342l2165j1581
15906e0598K863O405L1981N6030R004j7412l933J6778M820m5432m7803R214L4622
$$ plain form
15995 13874 17914 -9669 868 6723 -8866 -2644 4015 13609 15551 10467 5682 -9062 7135
15982 7135 116 -40323 -37843 -19182 3926 22048 15099 9204 29367 60349 49527 11162 -41537
15969 -41537 -55898 -52363 -30357 -59229 -70786 -39983 20106 34746 18691 -4532 -20640 -28263
15957 -28263 -13195 3640 8238 3170 31516 19791 -8203 -1544 -5098 -38303 -48443 -8139
15945 -8139 -435 -18749 -33772 -28118 -947 -7291 -40323 -41271 -22296 -9357 -6294 8958 -1092
15932 -1092 -45946 -60125 -41496 -34557 -28184 -38166 -21005 -17621 -19439 -30004 -15885 -17126 -38689
15919 -38689 -46057 1439 4452 -3275 5080 7865 12030 40312 34136 14490 -6852 -39017 -50598
15906 -50598 -47735 -41330 -9349 46681 55685 38273 34340 51118 55938 10506 -37297 -28083 6539
15893F539Q103J9179j5339k0848J4594M848j4590m815J6155R248k0132j8859J6833
15880I16m626o115k1866J1734n337m6948m857Q31J1701l454L7040M6067K7863
15867D2949n661j4064j5453j594j5025N582J768j2752k1543L0732J8726j0093
15855C572q222J1933p907r39o169K489J1162m653q368L245k3381p87p739o51L4042
15840b373p541l8849K2812K1725R854L572k235j6918Q998r215j7866J2346j332
15827a7022J1971J33o07j572k2612o150K686L6748J4513j7954J6739J6652j7493
15814A6032N57q938j2375l2551j833R935J8809K446R806J2660J458p157J5475
15801B4324J5927l0230m876k375j4004K696k0251J0082K0569L528j9655j8945
$$ plain form
15893 6539 14642 33821 18482 -2366 12228 17076 2486 -2329 13826 23074 2942 -15917 916
15880 916 -3710 -9825 -31691 -19957 -25294 -72242 -77099 -76268 -64567 -68021 -30981 15086 42949
15867 42949 37288 23224 7771 6177 -8848 -3266 -1498 -14250 -35793 -5061 13665 3572
15855 3572 -4650 7283 -624 -1563 -7732 -5243 5919 1266 -7102 -3857 -27238 -28025 -35764 -36415 -2373
15840 -2373 -9914 -48763 -25951 -4226 5628 9200 6965 -9953 -955 -10170 -28036 -15690 -17022
15827 -17022 -5051 -4918 -5525 -7097 -29709 -35859 -33173 3575 18088 134 16873 33525 16032
15814 16032 16589 7651 -4724 -37275 -39108 -29173 -10364 -7918 1888 14548 16006 8849 24324
15801 24324 40251 10021 5145 2770 -11234 -8538 -28789 -18707 1862 5390 -14265 -33210
15789c3210k515K1062j2046l3661K1885K9753k216j6073L956J9075m643p272Q171
15776g734K3952L3798j1359k5879P018k146l2028K279P120J6384L0787j1180k5189
15763E823j5590k0858K3556J3671P077j0846R659P658O166M492q364q750L1101
15750D4795J3309j2344J3393J7389j6136l3180j5547K7465k147n261k840J2910
15738D1806k4211j0817q142k4655K3228M251r72k303j0066j6767m9156j7582K9405
15725f5981O272m176M791K7785J2400J722N641j5492J4781J6306K2617R826q623
15712B7869o702j2655k9045k2192K7747J8075k8485k6780R623K7774L3869k725
15700A6373l95l579j7839j7670J2045M869K0459P41r650J5063j8077L508J2473
$$ plain form
15789 -33210 -35725 -14663 -26709 -60370 -38485 -8732 -10948 -27021 -23065 -3990 -8633 -15905 -7734
15776 -7734 16218 50016 38657 12778 19796 17650 -14378 -12099 -4979 11405 42192 31012 5823
15763 5823 -9767 -30625 -7069 6602 13679 2833 12492 20150 26316 30808 22444 13694 44795
15750 44795 58104 45760 59153 76542 60406 27226 11679 39144 36997 31736 28896 41806
15738 41806 17595 6778 -1364 -26019 -2791 1460 488 -1815 -11881 -28648 -77804 -95386 -65981
15725 -65981 -59709 -63885 -59094 -31309 -18909 -17187 -11546 -27038 -12257 4049 26666 36492 27869
15712 27869 21167 8512 -20533 -42725 -14978 3097 -25388 -52168 -42545 -14771 19098 16373
15700 16373 15978 12399 -5440 -23110 -11065 -6196 14263 15004 5354 20417 2340 5848 18321
15687A8321J379L2335J3488r84l1832k9776j5350j070j1015P403Q776o609l152
15674a8086R641M1595l778k9274K4493J2786R138j5873k2147R983J9323j4106
15662B3695n0103M942J3644J4815J2995K884O853L8291J7288n152m0018l4153
15650E981k2230M039J1002J1456j5183m997K3476L9996q13r761l0771k9621j1217
15637b8643M439K2801K2143r008J2988K191m1343l2483J5218L1625L9638q693
15625C0873k7111L980O555m173j4675K2636n099m837J7328L529L241j5286l0930
15612a3969K069K4969j5142o526K4981L1450l267k0854J1828j3962l7469J0936
15600d956J60j3922m024P948K3434j6343k2241J5961O282j4491J2302o526k0605
$$ plain form
15687 18321 19700 52035 65523 64539 32707 2931 -12419 -13489 -24504 -17101 -8325 -14934 -18086
15674 -18086 -8445 33150 29372 98 24591 37377 46515 30642 8495 18478 37801 23695
15662 23695 -26408 -21466 -7822 6993 19988 22872 29725 68016 85304 80152 40134 5981
15650 5981 -16249 -12210 -1208 10248 -4935 -9932 13544 53540 52727 42966 12195 -17426 -28643
15637 -28643 -24204 -1403 20740 11732 24720 26911 -14432 -46915 -31697 -72 39566 30873
15625 30873 3762 7742 14297 10124 -4551 18085 12986 8149 25477 29006 32247 16961 -13969
15612 -13969 -11900 13069 -2073 -8599 16382 47832 44565 23711 35539 21577 -15892 -4956
15600 -4956 -4796 -18718 -22742 -14794 8640 -7703 -29944 -13983 -7701 -22192 -9890 -16416 -37021
15587c7021J553Q974N416j5082N692K5223m276n500J4600K639j2097j4492j3389
15574c7760q302K9693M6698J5068J283k8119k4883j2518o008Q893J760j3443J266
15561b6372m4J0768K7596L0737K6249J1652j9221q521k0028l6023l739m273J0747
15548d72J1917q519l0468l3470L0318J8657Q466l1314l7561L299L5488K6507p777
15535a4929m03L861M860P535J0830J841j6649k6784P463K0905R756j7236m017
15522a2967M020J3267J0841M06o965m1826j841K992Q049K2329j2455j6278q244
15509c8672k2433J9777O850j2080Q87L437J4731J3045J897n820k5849J8462L9902
15496A4134q189p623k9891l331L5031J0714l0693K1172J0961N650j6877r209J3837
$$ plain form
15587 -37021 -35468 -26494 -21078 -36160 -30468 -5245 -9521 -15021 -421 2218 -9879 -24371 -37760
15574 -37760 -46062 -16369 30329 45397 46680 18561 -6322 -18840 -24848 -15955 -14195 -27638 -26372
15561 -26372 -26416 -15648 11948 42685 68934 80586 61365 52844 32816 -3207 -6946 -11219 -472
15548 -472 11445 2926 -27542 -61012 -30694 -12037 -3571 -34885 -72446 -69147 -33659 -7152 -14929
15535 -14929 -15332 -11471 -6611 924 11754 13595 -3054 -29838 -22375 -1470 8286 -8950 -12967
15522 -12967 -8947 4320 15161 15567 8602 -33224 -35065 -32073 -24024 -1695 -14150 -30428 -38672
15509 -38672 -61105 -41328 -34478 -46558 -45671 -42234 -27503 -14458 -12561 -18381 -44230 -25768 14134
15496 14134 5945 -1678 -31569 -34900 131 10845 -19848 1324 12285 17935 1058 -8151 5686
15483E686q817j5922l5882m996N3955J1805O062K4649j4787J4875o303K3047l41
15470E3031K185k6901j5206J2313k6534j6752P290K2845K753k091n307o64K910
15457I872j1694j5767n127L2679K029p513k7879p639J1949J7150K3326L606P579
15444C2571j9998r022j5143J5099J1273k078K3974K188j5464p842k8494m948n915
15431b3799J0774q74J2862n125p607j3687n763k1504K1212J7833P161K2225P311
15418B1019J0932j8774q727J2555K1020j4264k1186P504K5559K4340o108j847
15406E2023l9979k954J0456J2367k0227l198L610J085J5457j3930k583L730K0231
15393C6088j2913j6256k5406l831K1038J5582j0774j5382K9040o143k1686R875
$$ plain form
15483 5686 -3131 -19053 -54935 -59931 -5976 5829 11891 36540 21753 36628 30325 53372 53031
15470 53031 55216 28315 13109 25422 -1112 -17864 -10574 12271 15024 12933 7626 6962 9872
15457 9872 -1822 -17589 -22716 9963 11992 4479 -23400 -31039 -19090 -1940 21386 24992 32571
15444 32571 12573 3551 -11592 3507 14780 12702 36676 38864 23400 15558 -12936 -17884 -23799
15431 -23799 -13025 -13899 -1037 -6162 -13769 -27456 -33219 -54723 -33511 -15678 -8517 13708 21019
15418 21019 31951 13177 4450 17005 38025 23761 2575 10079 35638 59978 53870 52023
15406 52023 12044 9090 19546 31913 11686 8488 12098 13183 28640 14710 12127 15857 36088
15393 36088 23175 6919 -18487 -22318 -1280 14302 3528 -11854 17186 11043 -10643 -768
15381g68r661J063J8909p613j5276P923K6141l966j8488J509Q388J9766K4111
15368E2038l2292m7845j7899J2025L5681J0260K393m1384j4064M736J1501Q352
15356a6498J3415k3646j7547J9922L2412R092m238j5053J0739j5872j0664N415
15344a2523K5380P797n5248k6723J1173N1749n912k8492N96m221q090J4985P678
15331b1851J0444k0149K1928P985Q717L5978j9673m3280J0295k9487p086K3072
15319b3107J079k1381n753J3983J6203L181J4540l515Q679m369k1170k5133n965
15306e2728J5097L4163J5161K7140j6420k8805K091K8983R761p737j8196j1697
15294c187j0823k1509j0576J4133J5701l840O829k9943j5919M8056K8390k3316
$$ plain form
15381 -768 -10429 -9366 9543 1930 -13346 -5423 20718 16752 -1736 -227 8161 27927 52038
15368 52038 19746 -28099 -45998 -33973 1708 11968 14361 -27023 -41087 -36351 -24850 -16498
15356 -16498 -3083 -26729 -44276 -24354 8058 17150 12912 -2141 8598 -7274 -17938 -12523
15344 -12523 12857 20654 -34594 -61317 -50144 1605 -4307 -32799 -32203 -36424 -44514 -29529 -21851
15331 -21851 -11407 -31556 -9628 -1643 7074 43052 23379 -19901 -9606 -39093 -46179 -23107
15319 -23107 -22028 -43409 -49162 -35179 -18976 -15795 -1255 -4770 3909 -460 -21630 -46763 -52728
15306 -52728 -37631 -3468 11693 38833 22413 -6392 -4301 24682 34443 26706 8510 -3187
15294 -3187 -14010 -35519 -46095 -31962 -16261 -20101 -13272 -43215 -59134 -11078 17312 -6004
15282f004J9490K0407J4273q031j1915N698M183K373k9186J5019k1516n6541k433
15269e4183L9915j629l7288J1831K4121J6771k496r396J6351N913N267l0846l6801
15256e2470O048L4643J1539l1278j706L005J5689J03N222J048r885q482J7065
15243i459J1485o229l0405j1925L3902J679k6892K5802J250L828K5833p751l0847
15230a9729m6140J2597L3316j614j2830M04L0633J5948r869j8388L1243K5040
15218D0611p795m2482n7406m893K4375q315P985K6913N5106K4261j1473j9905
15206B6982j8872r128r23j9275j1787J6241L881Q289J0900l700j473j7681j0144
15193b6690J5294O0K512k780J3044O752j1594l3549j1117Q05K9415Q80N262k450
$$ plain form
15282 -6004 13486 33893 48166 40135 28220 33918 38101 40474 11288 26307 4791 -51750 -54183
15269 -54183 -14268 -15897 -53185 -41354 -17233 -462 -2958 -12354 3997 9910 15177 -15669 -52470
15256 -52470 -46422 -11779 -240 -31518 -33224 -30219 -14530 -14427 -9205 -8157 -18042 -26524 -9459
15243 -9459 2026 -4203 -34608 -46533 -12631 -10952 -37844 -12042 -10792 -6964 18869 11118 -19729
15230 -19729 -65869 -53272 -19956 -21570 -34400 -33996 -3363 12585 2716 -15672 15571 40611
15218 40611 32816 -9666 -67072 -71965 -47590 -55905 -47920 -21007 34099 58360 46887 26982
15206 26982 8110 -1018 -1941 -21216 -33003 -16762 -12881 -4592 6308 2608 1135 -16546 -26690
15193 -26690 -11396 -11336 -8824 -11604 1440 8192 -3402 -36951 -48068 -47263 -17848 -16968 -11706 -14156
15179a4156j5028N960K3288J1223r882K470P755j2098N380L193k175m715n338
15166d123M247P349j4782j4947N031j2841N930J5019Q589L245J1355Q190k5242
15153b980j0709J4164q895p069r860J127k0965K1547J2099o328o124M081J4808
15140e104J5765l2499m0284r691L231K5815J6053R260q293P356k5395j5069K5896
15127c2959L6772M168J9917l1543m166m360J4260J3492q454p890p928j4429J6197
15114f923m249l3920k1905L0698L7785L2555J0797m2764j7141N718l789j5617
15102b8755j2998J6316J7232K7678K1167k7023j8281o435L69J9557O637L184j838
15089A6810j4427k8943M232L1298K2859J0778m7568m0845N163M0838J4272k0764
$$ plain form
15179 -14156 -29184 -23224 64 11287 1405 3875 11630 -468 4912 8105 5930 1215 -4123
15166 -4123 124 7473 -7309 -22256 -17225 -30066 -24136 -9117 -528 2717 14072 22262 -2980
15153 -2980 -13689 475 -8420 -15489 -25349 -24222 -45187 -23640 -11541 -17869 -23993 -19912 -5104
15140 -5104 10661 -21838 -62122 -71813 -68582 -42767 -26714 -17454 -25747 -18391 -43786 -58855 -32959
15127 -32959 3813 7981 27898 -3645 -7811 -12171 2089 15581 7127 -763 -8691 -23120 -6923
15114 -6923 -11172 -45092 -66997 -36299 1486 34041 44838 2074 -15067 -9349 -13138 -28755
15102 -28755 -41753 -25437 -8205 19473 40640 13617 -4664 -11099 -10730 8827 15464 18648 16810
15089 16810 2383 -26560 -22328 8970 31829 42607 -4961 -45806 -40643 195 14467 -6297
15077f297q103l462K9925K4781J0281q668n859n0293k1245J0181j1969k9958K5293
15064d5393P688k692k834R654J3090O217K0915k3540j0184K5228J5401r665l2292
15051b8407j9713J4082J7382L8895K1409j3529n2390l4986n50M6874L7167j9585
15039F649j5112l2407p167M7327K3186j19j6570k4356m159J4558k4240r828K4349
15026a7889P383L799j9949q73K4796L0561l1220k1699J3985Q878J8760K8664J4236
15013E9432J17k7412R266l3567n917j0371k7303j2580k861m86M6137J0235p428
15000b738N542K870M184q973j2669K7703K2794J163l611k937L632l0802k9831
14987b3673k7670J3909Q289J6211J9054k975N929l706j2579j1899j883J5377o21
$$ plain form
15077 -6297 -14400 -17862 12063 36844 47125 38457 32598 -17695 -38940 -28759 -40728 -70686 -45393
15064 -45393 -37705 -40397 -43231 -33577 -20487 -14270 6645 -16895 -27079 -1851 13550 3885 -28407
15051 -28407 -48120 -34038 -16656 22239 43648 30119 -22271 -57257 -57807 -10933 26234 6649
15039 6649 -8463 -40870 -48037 -710 22476 22357 5787 -18569 -22728 -8170 -32410 -42238 -17889
15026 -17889 -10506 -6707 -26656 -27529 -2733 27828 -3392 -25091 -11106 -2228 16532 45196 59432
15013 59432 59549 32137 41403 7836 1919 -8452 -35755 -48335 -51196 -51682 -5545 4690 -2738
15000 -2738 2804 5674 9858 885 -11784 15919 38713 39876 36265 33328 36960 6158 -23673
14987 -23673 -51343 -37434 -29145 -12934 6120 3145 9074 5368 -7211 -19110 -20993 -5616 -6237
14974f237m879j5519J6035L2686l52k9917k0310o120r144j1873K4517K9837J8622
14961A7346j2944q191n538R744q70l0055L501p081J0754k458k1129J0626r829
14948d6124j2498L095L5345J9789k0586q338J5453L45M048J9607N070J4007j6293
14935A2920j1658J0999n097J3963K8151j6635k6912j8681k7K7580K7724j3776
14923B8551k1169K441n245j575J5724K870k9983j7336J1304J7078J9288K2403
14911D4351r362j897j2888k9208l2751L0568J6853j5141o852m619l800J5323J8495
14898I072j3913r126J4012K2891l246p639l305j0410p50j2604j0637j1657j1139
14885d8451J4745L5027J0816L169l884Q550r343k2994K2191l197j7641J5374Q804
$$ plain form
14974 -6237 -11116 -26635 -10600 22086 21734 -8183 -28493 -34613 -43757 -55630 -31113 -1276 17346
14961 17346 4402 -3789 -9327 417 -453 -30508 -27007 -34088 -23334 -25792 -46921 -36295 -46124
14948 -46124 -58622 -55527 -20182 -393 -20979 -29317 -13864 -13519 -9471 10136 15206 29213 12920
14935 12920 1262 12261 7164 21127 49278 32643 5731 -12950 -12977 14603 42327 28551
14923 28551 7382 9823 4578 3003 18727 21597 -8386 -25722 -14418 2660 21948 44351
14911 44351 34989 33092 20204 -9004 -41755 -11187 5666 -9475 -16327 -20946 -24746 -9423 9072
14898 9072 -4841 -13967 45 22936 19690 12051 8746 -1664 -2414 -15018 -25655 -37312 -48451
14885 -48451 -33706 1321 12137 15306 11422 19972 10629 -12365 9826 6629 -11012 4362 13166
14872A3166j1757J8279L493j0146j3155p680K521l043M713J5973Q817j4319k7985
14859b1123J623L2422j1868k0893K994J758k0705J8356L4700P535r011k5768l717
14846a3697j8550J5845o899L4343M507r96r038k478j4559L604j1010R313P982
14833a633q312L4566M223J0394o027J2132j1381k6L110k7077j2480j5204j150
14820a8865K2457J685p745o091l376Q063l687k6198k21O161K651j4898P267K2034
14806a0763P054J2447J1052q861j687O214j2893q609K178J8404k1317j5568j1324
14793c3673L751J5285L2728k6971j2413Q445J9154k838K1160N801O375k5008l4238
14780b2442j4543L2609K308k2566j9635M5479J5610j8171j1403P885M2394J7646
$$ plain form
14872 13166 1409 19688 23181 13035 -120 -7800 -5279 -8322 -3609 12364 21181 6862 -21123
14859 -21123 -19500 12922 1054 -19839 -16845 -15087 -35792 -17436 17264 24799 15788 -9980 -13697
14846 -13697 -32247 -16402 -23301 11042 15549 14553 5515 3037 -11522 -7918 -18928 -9615 -1633
14833 -1633 -9945 24621 28844 39238 33211 45343 33962 33936 37046 9969 -2511 -17715 -18865
14820 -18865 3592 5277 -2468 -8559 -11935 -3872 -7559 -33757 -33978 -27817 -25166 -40064 -32797 -10763
14806 -10763 -3709 8738 19790 10929 9242 15456 2563 -6046 -3868 14536 -6781 -22349 -33673
14793 -33673 -29922 -14637 18091 -8880 -21293 -12848 6306 3468 24628 30429 36804 11796 -22442
14780 -22442 -36985 -4376 -2068 -24634 -44269 1210 16820 -1351 -12754 -4869 37525 55171
14768E5171k3134j2145j742j4389K962K3895J5033J4626P910l9647k8927J1631
14756A1244L7382j1249j3039q753k6793N147r240M8121K3073j8876k3176J1009
14744B4850j9588k6423J1845K0802O415r227l290K265l913m81J1119j168j523
14731A1683p130O391M961J4588M277j2217j4041j4161P590j1795j3782n704n85
14718b9925J0905M753J7582J425J9759J0063K6999k5286j2247j2383J604j8265
14706e016N320p341K4341J0088k8496l166J6621J973J2813j540K0568l993j4547
14693B7625k3419k0665r677P446J2126j0651L842k9672j3533K2073k61j6005j8567
14680f9338M2501K8272n689J1727j2473j1891k1269p308j5434p657q835O531K4823
$$ plain form
14768 55171 32037 19892 18150 3761 6723 30618 45651 60277 68187 28540 -387 11244
14756 11244 48626 37377 24338 15585 -11208 -6061 -15301 32820 55893 37017 13841 24850
14744 24850 5262 -21161 -9316 11486 17901 8674 5384 7649 3736 3255 14374 13206 11683
14731 11683 4553 10944 15905 30493 34770 22553 8512 -5649 1941 -9854 -23636 -29340 -29925
14718 -29925 -19020 -14267 3315 4740 24499 34562 61561 36275 24028 11645 13249 -5016
14706 -5016 304 -7037 17304 27392 -1104 -4270 12351 14324 27137 25597 46165 42172 27625
14693 27625 4206 -16459 -26136 -18690 -6564 -17215 -13373 -43045 -56578 -34505 -34766 -50771 -69338
14680 -69338 -26837 1435 -4254 7473 -5000 -16891 -38160 -45468 -60902 -68559 -77394 -70863 -46040
14667d6040N779j0822J7545R003J4751L756J9555P321k8919j7817N970j0455q132
14654c8505l043M9612k407m2398O218L6103J1656j8991r137j1892J4449j56k3560
14641c2051j352K4017J9326K727j2929M7083j4596n6675k9015K7793L586m681
14629b6767R246j552M407P072J4424l401P434J4109M934j9607m0475N062L0062
14616D948n020j3778k3434k3346j9362L0831J9016L3600M4521P36l3889m8295
14604c3472J4824L4430R121n173k8230q783L668n375J1552p768p100j5666p947
14591d5919L715K9309J4981n722L1106J6394M285j694l3426j9239j5216m29K4630
14578B775k405j5747J9114L6760j0751J803j1544P063L3415r758l6802k1914L324
$$ plain form
14667 -46040 -40261 -51083 -33538 -24535 -9784 -6028 13527 20848 -8071 -25888 -19918 -30373 -38505
14654 -38505 -41548 8064 5657 -36741 -30523 5580 17236 -1755 -10892 -22784 -8335 -8491 -32051
14641 -32051 -33403 -9386 9940 12667 -262 46821 32225 -24450 -53465 -25672 -22086 -26767
14629 -26767 -17521 -19073 -14666 -7594 6830 3429 10863 24972 29906 10299 -30176 -25114 4948
14616 4948 -72 -13850 -37284 -60630 -79992 -49161 -30145 3455 47976 48712 14823 -33472
14604 -33472 -18648 15782 24903 19730 -8500 -17283 -13615 -18990 -7438 -15206 -22306 -37972 -45919
14591 -45919 -42204 -12895 2086 -3636 27470 43864 48149 46455 13029 -6210 -21426 -21855 2775
14578 2775 370 -15377 3737 40497 29746 31549 20005 27068 60483 50725 13923 -7991 -4667
14565d667R105K7228j6232l7604m7553o359O1316l894l536K4780O699k2108m740
14552a7565J5942J7186o136k1500P381l0018N721K1815N760j3790o243K8657N496
14539A2706k1281K3604K9381M642l0374l0755K4253N005J4183O667q157J3304
14527D3178r634j9631J1515O233P168o196j5717n98N200j3249J676J4930R623
14514C4498k6814j8314P349j0137r808L6833L6157j1676m3254l851j865p758K2883
14501D243J2715J7214L31l8440L319J763j9281L5371J9566j688O284j3407o801
14488B1189o611P376L573O737l1026P874p823j6906j0859J8678J5828m6712K0926
14475a7756O228P999o652l4976J6314K5760j3173p224J9998r883k4292r161L5562
$$ plain form
14565 -4667 4438 31666 15434 -22170 -69723 -76082 -14766 -18660 -22196 2584 9283 -12825 -17565
14552 -17565 -1623 15563 9427 -12073 -4692 -34710 -28989 -7174 -1414 -15204 -21447 7210 12706
14539 12706 -8575 15029 44410 49052 18678 -12077 12176 17181 31364 38031 29874 43178
14527 43178 33544 13913 25428 31661 38829 32633 16916 16318 21518 8269 9945 24875 34498
14514 34498 7684 -10630 -3281 -13418 -23226 13607 49764 38088 -5166 -9017 -10882 -18640 4243
14501 4243 16958 34172 34503 -3937 -618 1145 -18136 17235 36801 35113 41397 27990 21189
14488 21189 14578 21954 25527 32264 1238 9112 1289 -15617 -26476 -7798 8030 -38682 -17756
14475 -17756 -11528 -3529 -10181 -45157 -28843 -3083 -16256 -23480 -3482 -13365 -37657 -46818 -11256
14462a1256J2096R496r189j0254o996J4588K0560J7307O363k0209L09r984j1391
14449A440k0517o846J0439j2140n777J2451P243k3578L391J3298j381N634l834
14436b0177L38L2648J8611P962q192l4285l8531K4619J5921L96k2832L144j1288
14423c1666P534J1526j309k4631Q216K4347J2276k9322m1276M917Q528j1883K2677
14410d0066M5024K6872j115l2071k109l0289j2894L2138K6375Q125m52q06Q578
14397B7310J7653M596j3252j7691K3620K2653q410n5285p231j1075j8816l6905
14385g2833J0107K9591K7060p585l415J2190o803o101K1069J4249K8906K3879
14373G0314j0784l4739j4862P845k037L49J9751o699L573J486q179j2667N162
$$ plain form
14462 -11256 840 10336 1147 -9107 -16103 -1515 19045 36352 42715 22506 22815 12831 1440
14449 1440 -19077 -25923 -15484 -27624 -33401 -20950 -13707 -37285 -33894 -20596 -21977 -16343 -20177
14436 -20177 -19839 12809 31420 39382 31190 -3095 -41626 -17007 -1086 -690 -23522 -20378 -31666
14423 -31666 -24132 -12606 -13915 -38546 -30330 -5983 6293 -23029 -64305 -59388 -50860 -62743 -40066
14410 -40066 4958 31830 30715 -1356 -3465 -33754 -46648 -14510 11865 19990 19538 18732 27310
14397 27310 44963 49559 36307 18616 42236 64889 56479 1194 -6037 -17112 -35928 -72833
14385 -72833 -62726 -33135 -6075 -13660 -17075 -4885 -11688 -17789 3280 17529 46435 70314
14373 70314 59530 24791 9929 17774 15737 16086 35837 29138 32711 34197 26018 13351 18513
14360A8513O955L256j7225j3519O478j1273k565M570r61k748J7967j8256l599
14347a2407K6715l683R501j3610j95o231R103j6589P064J2576K6323j1939k8096
14334a468K61j1734j1976q582M5215J6820l6501l7862K5991M615o381K0430q239
14321i411J3764J0696J387j7330k1202k2975L0105K7212J6410j7495j4583r764
14309a3186K829J4342j4519k2108K2134K9544J0770l8687j5774p559k909Q135
14297b6988R75j1662J6218o272P381m102j756J8975P800J3067o551j0196N9920
14284E6809m436m0615l1987Q827J6483j0554n141k6601m642P531J7997K8512j8118
14271e935m269K2402O183O120J6604k3671n70Q737k2843j58J084Q191J0603k4392
$$ plain form
14360 18513 25468 28724 11499 -2020 4458 -6815 -9380 -4810 -5771 -8519 9448 -8808 -12407
14347 -12407 14308 10625 20126 6516 6321 90 9193 -7396 -332 12244 38567 26628 -1468
14334 -1468 -1207 -12941 -24917 -33499 11716 28536 -7965 -45827 -19836 -15221 -21602 -1172 -9411
14321 -9411 4353 15049 16436 -894 -22096 -45071 -14966 12246 28656 11161 -3422 -13186
14309 -13186 -10357 3985 -10534 -32642 -10508 19036 29806 -8881 -24655 -32214 -35123 -26988
14297 -26988 -26013 -37675 -21457 -27729 -20348 -24450 -26206 -7231 569 13636 7085 -3111 56809
14284 56809 52373 11758 -20229 -11402 5081 -5473 -10614 -37215 -41857 -34326 -16329 12183 -5935
14271 -5935 -10204 12198 18381 24501 41105 17434 16864 25601 2758 2600 3684 11875 22478 -1914
14257a914j7836j574l1638J0099M4098L478J1914j3953j1086j1479J3811J6737
14245A0657J3364J0645J3490J9296j3735l1336q353j0519j9575J1864J6048j3558
14233a712r575K546M256j9355k5791M431K6992j4552l9937j189L1830L6248k0994
14220b6802j1816K6744p728O492O365q661M592J8728k0750J0499M693l093o52
14207a389P14j5936j1745K2962J0707l82j905k9596K2697o780K040j4494r317
14194c2424o227n179P39K2884L4311J6192q505p456M600k790j1607j0319k1072
14181b6853k1485L424Q684J7577R348p210j0616L127L525n383J8081j6645r37
14168b5363j1352j2983P435n031j0317L1529K0976M0954j8862k9315k3893J9234
$$ plain form
14257 -1914 -19750 -21324 -52962 -42863 1235 4713 16627 2674 -8412 -19891 -6080 10657
14245 10657 24021 34666 48156 67452 53717 22381 14028 3509 -16066 -4202 11846 -1712
14233 -1712 -11287 -8741 -4485 -23840 -49631 -45200 -18208 -32760 -72697 -73886 -42056 -5808 -26802
14220 -26802 -38618 -11874 -19602 -13110 -6745 -15406 -10814 7914 -12836 -2337 2356 -737 -1389
14207 -1389 -675 -16611 -28356 -5394 5313 4931 3026 -26570 -3873 -10653 -8613 -23107 -32424
14194 -32424 -38651 -43830 -43091 -20207 14104 30296 21791 14335 18935 16145 4538 -5781 -26853
14181 -26853 -48338 -44914 -36230 -18653 -9305 -16515 -27131 -24004 -20479 -25862 -7781 -24426 -25363
14168 -25363 -36715 -49698 -42263 -47294 -57611 -26082 -5106 35848 16986 -12329 -36222 -16988
14156a6988K5903j970j4300k419Q442Q881Q820K881l187j1465j2895N799k7844
14143c0342J8504J8698K027R259N138q283l1680o083K1966J590J937K163j3527
14130h633j891P865J3204J2645j296n739J6810n882L906K06k9364J3820M875J8892
14116C9418k0230k9245P540J6713J0899j505k3424o835j7107J392K2675Q06k1268
14103b0171k933Q620K0372K1051j6137O321J439j1105N085R722j6575K2612l490
14090B4811k1136N370P883k9820j6459m467Q847J3011J7919l106J3619K4651k5521
14077A5602m6907L6010K2783l0495N697k192J5882q914J3731J3006N517K131k4121
14064A7730j7693j8142r913N055O831K5613M2620P282K1780k7447m3540j401J4033
$$ plain form
14156 -16988 8915 6945 -7355 -9774 -1332 7549 16369 19250 16063 4598 -8297 -2498 -30342
14143 -30342 -11838 6860 8887 18146 23284 15001 -16679 -22762 -796 794 2731 4894 -8633
14130 -8633 -10524 -2659 10545 23190 21894 16155 32965 27083 30989 31195 1831 15651 20526 39418
14116 39418 19188 -10057 -2517 14196 25095 23590 166 -6669 -23776 -22384 291 1097 -20171
14103 -20171 -23104 -14484 5888 26939 10802 17123 18562 7457 12542 22264 5689 28301 24811
14090 24811 3675 9045 16928 -12892 -29351 -33818 -24971 -11960 5959 2853 16472 41123 15602
14077 15602 -31305 4705 27488 -3007 2690 498 16380 7466 21197 34203 39720 41851 17730
14064 17730 37 -18105 -28018 -22963 -16132 9481 52101 59383 81163 53716 10176 8775 22808
14051B2808L094j5395k0211m721Q444K1247J7704P10Q15q985p186P437L345Q729
14037C7835j4754L263O205J3306o505r088j7307l210j2223K3440p355j1039M236
14024F804K0039j5782J419L583L997j1501K172J1105k432r441j1061k0994Q40
14011b1252L4604K0671n391j8414k590j9138J156R382R135n346j6516K5628J3492
13998B5421j1793k5518j0179m846K6850K3023K0624k212m644N788k9091j6255
13986b832J3726K2889K373K3N752P980j8462l7243M012J0572J544j2112r962j397
13972a3137K0168O160k9264r337J906L3K7707K9394J1003j2040k0941J6416K084
13959C0152o653k7406k4450K1485L5953k0603j4011J6290M1287J4815j6833J8948
$$ plain form
14051 22808 25902 10507 -9704 -14425 -5981 15266 32970 33680 34495 25510 18324 25761 29106 37835
14037 37835 23081 26344 32549 45855 39350 30262 12955 9745 -2478 20962 13607 2568 6804
14024 6804 26843 11061 12480 16063 20060 8559 10731 21836 19404 9963 -1098 -22092 -21252
14011 -21252 13352 34023 28632 10218 7628 -11510 -10354 -972 8163 2817 -13699 11929 25421
13998 25421 13628 -11890 -22069 -26915 -65 22958 43582 41370 36726 42514 13423 -2832
13986 -2832 10894 33783 36156 36179 41931 49911 31449 -5794 -1782 8790 10334 -1778 -11740 -13137
13972 -13137 7031 13191 -16073 -25410 -23504 -23471 4236 33630 44633 32593 11652 28068 30152
13959 30152 23499 -3907 -28357 -6872 29081 8478 -5533 10757 52044 66859 50026 68974
13947F8974J6454M17j8151l3095j2600J0899j2050k547j4566k0868K1194L6903
13935D0964L4229k7931m5683k2890R234o979K5298L4064j0253l5539l6083M750
13923c6819K5481O376J6195K3165k0976j9877P229J3348o364k7097j3463J1219
13911b1583J475N198J7126m221P385J8557q183L8041L735L46k5614N087K97l3757
13897C889l1059R559K4400n838J9907K614J948k2874O408K189j6191j4139L0085
13884A0898n047K2471k4851j8141Q524K4737j0552o416P097O244j8674j3869P948
13871i631N085K031J257k7194j4495L6449Q481m0164J1244M3970J9968L189k095
13858C8095k8992j5256j8017K7618O7L1491K1264k6733n811L3260q75j7804k2019
$$ plain form
13947 68974 85428 85845 67694 34599 21999 32898 20848 18301 3735 -17133 4061 40964
13935 40964 75193 47262 1579 -21311 -12077 -19056 6242 40306 30053 -5486 -41569 -36819
13923 -36819 -11338 -4962 11233 34398 13422 -6455 774 14122 7758 -19339 -32802 -21583
13911 -21583 -20108 -14910 2216 -2005 5380 23937 15754 53795 57530 57876 32262 37349 37646 3889
13897 3889 -27170 -17611 6789 951 20858 23472 25420 2546 8954 11143 -5048 -19187 10898
13884 10898 5851 28322 3471 -14670 -6146 18591 8039 1623 8720 14964 -3710 -17579 -9631
13871 -9631 -4546 -2515 -1258 -28452 -42947 -6498 1983 -38181 -26937 17033 37001 40190 38095
13858 38095 9103 -6153 -24170 3448 3515 35006 56270 29537 23726 56986 56111 38307 16288
13845A6288l512N822j064P813J1501j3299O71q884J9112P564l361M864K840j6975
13831B9380j6397l366L2855O886k4501J2666J3937j0767m6346j5288m084J6597
13819h428J7564J7173O343L453J5758j6363J733j365j5110P163J0545k749l0596
13806E121J0450r1K4135O392k5568J0962j4540J2995L082j1185k8976J1657r330
13793d896k5464P204J0562K678n136m111m967M981J3275j0083n4723Q561L1987
13780c0132J0243j3281j217R210j8568j3534J0996L1106J3000j9084m915J2874
13768a3302L299P900J5691N849l793j2475j049j1270J2678L3940j1525r808j6848
13755g13j1167k0448M6489J0707j9085K8441J9146J8426l2073l066j9009k55Q931
$$ plain form
13845 16288 12776 18598 17534 25347 36848 23549 24220 15336 34448 42012 38651 43515 46355 29380
13831 29380 12983 9617 42472 49358 24857 37523 51460 40693 -5653 -20941 -25025 -8428
13819 -8428 9136 26309 32652 36105 51863 35500 37233 35868 20758 27921 38466 35717 5121
13806 5121 15571 15480 39615 46007 20439 31401 16861 29856 32938 21753 -7223 4434 -4896
13793 -4896 -30360 -23156 -12594 -9916 -15052 -19163 -24130 -19149 -5874 -15957 -70680 -62119 -30132
13780 -30132 -19889 -33170 -34387 -25177 -43745 -57279 -46283 -15177 -2177 -21261 -26176 -13302
13768 -13302 -10003 -2103 13588 19437 15644 3169 2120 -9150 3528 37468 25943 16135 -713
13755 -713 -11880 -32328 14161 24868 5783 34224 53370 71796 39723 36657 17648 17393 26324
13742B6324l4671m054L2745O155q602J1800Q782L150l4683k7986R589O86q460
13729a9225L2490J5563j6319K3964p424k0909j1966r095R967K985J6976K3433
13717D0440j1744m3401j0405K0158K9625K3000r376l2931Q986m1571l1903K6029
13705c3093O549K1577J4975l7579j6514J2531J2974K294O821J9348J5050j4947
13693I986J0806j621J0267O595P522n197k2691k4859J6642J5297r15l2081K3232
13680A2983N8499l046j7365l9621k9154L648M1048J430p456J1356l1535l294L94
13667b113r077R922k023J3852J7096M866K008l261j2926P557m829j7490p816r96
13653e230N859R049m4837J458M1078O640j5947K2453J4084N675o707L0039l239
$$ plain form
13742 26324 -8347 -12401 20344 26499 17897 29697 38479 41629 6946 -21040 -11451 -10765 -19225
13729 -19225 13265 28828 12509 36473 29049 8140 -3826 -12921 -2954 31 17007 40440
13717 40440 28696 -14705 -25110 -4952 24673 47673 38297 5366 14352 -27219 -59122 -33093
13705 -33093 -26544 -4967 10008 -27571 -44085 -31554 -18580 -16286 -9465 9883 24933 9986
13693 9986 20792 19171 29438 36033 43555 38358 15667 -9192 7450 22747 21832 -10249 12983
13680 12983 71482 68436 51071 11450 -17704 -14056 26992 28422 20966 32322 787 -2507 -2113
13667 -2113 -11190 -1268 -3291 10561 27657 32523 34531 31270 18344 25901 21072 3582 -4234 -5230
13653 -5230 629 9678 -35159 -33701 7377 14017 -1930 20523 34607 40282 33575 63614 60375
13640F0375l4570J375N861q086k4369R605K3690N22Q577j8372k1164P33P31J6150
13626B1058K0554J7150k380L2659O7216R8397J28494K32799L44458L56555K28193
13615A545153Q484k20332l08297l54767k15260j48182r6538o343j8954m3881k2521
13604A18562j0838j2964k4907m2643p558N151l9267k2961K2952J0509M20j156
13592d700J1326J3397L8013J3783N707m9717k4518J0935J8662n105J2361J8862
13580E9006j080j2171j5201l8840j6051J7918J0571m279n741j7423J7974m955
13568a0272j064M802n283r601O692m141m72j166N489P650j8075K1180L1182K8175
13554E5096o360l2539J954j7489O292K324q066j5668R829L2043J5459q638j6545
$$ plain form
13640 60375 25805 27180 33041 24955 586 10191 33881 34403 42980 24608 3444 4177 4908 21058
13626 21058 41612 58762 56382 89041 156257 254654 383148 615947 960405 1316960 1545153
13615 1545153 1553637 1333305 1025008 670241 454981 306799 210261 203918 184964 141083 118562
13604 118562 107724 94760 69853 27210 19652 24803 -14464 -37425 -14473 -3964 -3544 -4700
13592 -4700 6626 20023 58036 71819 77526 27809 3291 14226 32888 27783 40144 59006
13580 59006 57926 45755 30554 -8286 -24337 -6419 4152 -127 -5868 -23291 -5317 -10272
13568 -10272 -11336 -6534 -11817 -21418 -14726 -18867 -19339 -20505 -15016 -7366 -25441 -4261 26921 55096
13554 55096 48736 16197 18151 662 6954 9278 1212 -14456 -4627 27416 42875 34237 17692
13541A7692J6345N167J3465p573m2716q66Q069J1584m114M584k193k1421L298
13528A321l406K2804K018k1615l050L3058k3050k5065K3429J9707J9269P37q447
13515C7710r790j3244j595K6956R012k1199q290K0342m628j0587k0730l874M939
13502E022O622J509k318j5905j2072N0R817m867j2932j5248J2337K193J3373K853
13488i566J467J192o140n967k4765L064L2013M6150J5684o650k6005P593J7741
13475D5811k1044k5801k906p64Q150k4331j2606N261N064J4013Q928J7799K3986
13462D1560j9944j9774n156L3950L516L046j1641r964o211R294J1996k83l942
13449B6447K8503K108k4321R275R614j2854j5227j0943k5522r644L4376L1044
$$ plain form
13541 17692 34037 39204 52669 45096 2380 1514 9583 21167 17053 21637 19444 -1977 1321
13528 1321 -2085 20719 22737 1122 -1928 31130 8080 -16985 6444 26151 45420 46157 37710
13515 37710 27920 14676 13081 40037 49049 27850 19560 39902 35274 24687 3957 83 5022
13502 5022 11644 13153 10835 -5070 -17142 -17092 -7275 -12142 -25074 -40322 -27985 -25792 -12419 -9566
13488 -9566 -8099 -6907 -13047 -19014 -43779 -40715 -8702 37448 53132 46482 20477 28070 45811
13475 45811 24767 -1034 -3940 -4704 3446 -20885 -33491 -28230 -23166 -9153 -225 17574 41560
13462 41560 21616 1842 -3314 30636 34152 37198 25557 15593 9382 18676 30672 30389 26447
13449 26447 54950 57058 32737 42012 51626 38772 23545 12602 -12920 -22564 11812 42856
13437D2856K4573L189Q240J9677l864K1511J574L3544K5299M0043p013o4902n9358
13424H5369k1008j9938n626j2948J4063J9953k3857k4913K9102L4997j9937k585
13412E2672k679j1522j5130K1410J5187M169k2475l9880M946J195j0100j9127
13400b1334k661J676J9007M1947l310R770K0518O627j8290l594n728j1090J137
13387C4675J8018K8329J2486k7798J1052k729j4933k980j1282N8J8743R811j3791
13374E9659j6233j3144l219N201Q106L8738M999o527K0145N080o605k1147j4824
13361F0229l3466k4673J9230J9888k169q911O498L524j4923k4648M737L409l388
13348E337Q79j4348O517J8956J089r139r104m215J6256L7576K0316J7178Q494
$$ plain form
13437 42856 67429 70618 78858 98535 94671 116182 117756 151300 176599 216642 209629 144727 85369
13424 85369 64361 44423 38797 25849 39912 59865 36008 11095 40197 75194 55257 52672
13412 52672 49993 38471 23341 44751 59938 64107 41632 1752 6698 7893 -2207 -21334
13400 -21334 -23995 -22319 -3312 38635 35325 45095 65613 72240 53950 50356 44628 33538 34675
13387 34675 52693 81022 93508 65710 76762 74033 59100 56120 44838 44896 63639 73450 59659
13374 59659 43426 30282 27063 32264 40370 79108 84107 77580 97725 102805 96200 75053 60229
13361 60229 26763 2090 21320 41208 39039 30128 36626 40150 25227 579 5316 8725 5337
13348 5337 6216 -8132 -1615 17341 18430 9291 187 -4028 12228 49804 70120 87298 95792
13335I5792k1667k8088j7855J8525J8241L863j7472j1038J5175N008j7087P111
13323E0508J6048k3321R402k812K2266J8642r224k7155k4641j0842M6988N4022
13311A19881M905q468Q720K5612L7437J8556J8574O9035L6253r815q3125p5908
13299A61657j8161l1527k2288K1499J5181j8222k6191M570L3076K5173j425J675
13287A45017j4803k820K5129K4805n211O243k7556J5968k453k2261P713j2580
13275A37191j7068O35m3187R616J8109Q429K2919m066j1887J6618N001k607j7669
13262A22034Q039j0077J631j646l738J1898O858L3486M1478Q320Q365K3103j1827
13249B37924j4463P297N457n3087m2491L1375M2803L2642R293J6379l0875L7903
$$ plain form
13335 95792 74125 46037 28182 46707 64948 68811 51339 40301 55476 60484 43397 50508
13323 50508 66556 43235 52637 49825 72091 90733 81509 54354 29713 18871 65859 119881
13311 119881 124786 116318 125038 150650 188087 206643 225217 294252 330505 320690 237565 161657
13299 161657 143496 111969 89681 111180 126361 108139 81948 86518 119594 144767 143342 145017
13287 145017 130214 127394 152523 177328 172117 178360 150804 166772 164319 142058 149771 137191
13275 137191 120123 120758 77571 87187 105296 113725 136644 132578 120691 137309 142310 139703 122034
13262 122034 130073 119996 121627 119981 116243 128141 134999 168485 209963 218283 226648 249751 237924
13249 237924 223461 230758 236215 183128 140637 172012 214815 247457 256750 273129 242254 280157
13237B80157M7976J5219R096j313L5056q756r366J7605J8643J5644J4572M1202
13225D75735J4783j3550K6708j5449N906O8604M9328K3291K3578J0214K3265M2652
13213G35065J4027M7778M0917L6450N5110J02289P6668O6361N8761M4920O5023
13202A343369J21544J60511K03917K40211K89795L17498L16355M04671N08629
13193C906500O40316P99884J039365J392787J765014K134520K566323L168947
13185A7413656M394496O841887J1070425J7875391L0012260N1244318P2168938
13178B11021371O7629342L4186144j7087642n5293556o8121705n8565619l8514682
13171G5253653k2136750j3006362q323699n806340m373828l479253k942529k497632
$$ plain form
13237 280157 328133 343352 352448 351135 386191 377435 368069 385674 404317 419961 434533 475735
13225 475735 490518 476968 503676 488227 494133 562737 612065 635356 658934 669148 692413 735065
13213 735065 749092 796870 837787 874237 929347 1031636 1108304 1174665 1233426 1278346 1343369
13202 1343369 1464913 1625424 1829341 2069552 2359347 2676845 2993200 3397871 3906500
13193 3906500 4546816 5346700 6386065 7778852 9543866 11678386 14244709 17413656
13185 17413656 21808152 28650039 39720464 57595855 87608115 138852433 211021371
13178 211021371 278650713 312836857 295749215 240455659 172333954 113768335 75253653
13171 75253653 53116903 40110541 31786842 25980502 21606674 18127421 15184892 12687260
13163A2687260k130896j776856j373585j066323q30953o47311n30213m13858l40944
13154C576321l38772k91613k46117k48788k34682j80836j40540j17329q9580j04781
13144A583283j33197j26602p7494p1008q0053o9941m0603m2802n1342k5707j7621
13133H46913n5779q6044k5227m5472n3324n4340l3666j9415n6946m0608j3739
13122C62353L092j840j2682r376Q836j1036q520n054P034J2809j5736j2358k0177
13109B97345o384J6182j5293k9175j1266j3790j8705j6361l238J8424J3300L6975
13097B68014J8508l1233l4671j9403J8827L3374k4955k5211M417J3522M956p535
13085B18610r708p443j4934k0993L0124J2681l528k0808k2807R577l903l825J6815
$$ plain form
13163 12687260 10556364 8779508 7405923 6339600 5508647 4861336 4331123 3917265 3576321
13154 3576321 3237549 2945936 2699819 2451031 2216349 2035513 1894973 1777644 1688064 1583283
13144 1583283 1450086 1323484 1245990 1174982 1094929 1024988 984385 941583 890241 864534 846913
13133 846913 791134 705090 679863 634391 581067 526727 493061 473646 416700 376092 362353
13122 362353 365445 363605 350923 341547 350383 339347 330827 325773 332807 345616 329880 317522 297345
13109 297345 290961 307143 291850 262675 251409 237619 218914 202553 199315 217739 231039 268014
13097 268014 286522 255289 220618 201215 220042 253416 228461 203250 207667 221189 226145 218610
13085 218610 208902 201459 186525 165532 195656 208337 204809 184001 161194 170771 166868 163043 179858
13072A79858J98L135L5792L2117N2063J31769J55837K44225L62738L93027L19504
13061A910263O4411k12022l59108l71095k92754k01024j18924m6853k0630k5166
13051C27098m4134l9851l8536j4792l8411k2443p535j3145k949R256k6533l2893
13039E5132J3273J4521l275j9027k8869l8340J843L5965J0039j5874L6374K2708
13027H4470M0426K3749n503P295R05K458j7825m8262k4547j2437J1144K3483K575
13014H7931l1388j4008o143p273r432m332J4891J6010j6995k9797J0896K6252
13002C6612J804J1588k8139j6061K1606K7633L5495K4361J580M415Q128m3373
12990H5649n0596m6522k3913K1757K2975j5462j1450L2492p725r237R108o947
$$ plain form
13072 179858 180056 183191 218983 251100 303163 434932 590769 834994 1197732 1590759 1910263
13061 1910263 1974674 1762652 1403544 1032449 739695 538671 419747 372894 352264 327098
13051 327098 282964 243113 204577 189785 151374 128931 121396 108251 105302 114558 88025 55132
13039 55132 68405 82926 79651 60624 31755 -6585 -4742 31223 41262 25388 61762 84470
13027 84470 124896 148645 143142 150437 151342 153800 135975 87713 63166 50729 61873 85356 87931
13014 87931 56543 42535 36392 29119 19687 15355 30246 46256 29261 -536 10360 36612
13002 36612 38416 50004 21865 5804 27410 55043 90538 114899 116479 120894 129022 85649
12990 85649 35053 -11469 -35382 -13625 9350 -6112 -17562 14930 7205 -2032 7076 129
12978A29O655K6114m603k0289k3074j3820k461j008q01L6311K4642O260j140q231
12964B4684J7617k0275k7044J7727m909j875j4339K1186J7768q305l6414J1260
12952b919R983K062K0210J4533J9020Q805k9948m4993k968j0528k0555J5991J3686
12939g621O246r590K243K8735K0313L2541r258N428r556j7185j2020j2191L363
12926B1448j0505r59L3398O741j3424m257J2644p231m042l1720n084K0444N523
12913B2976j269K4417j3899j2003j75j8245l8453j3365J3613J3930J1833j5404
12901b6044j6345J1187J3936J275n369j9765J4153k250K5281J8001N285j5577
12889C768l2073j8877J1364Q501K3781J0225o81P778J7832M625q346j5376R001
$$ plain form
12978 129 6784 32898 28295 8006 -15068 -28888 -31349 -32357 -33158 3153 27795 34055 32915 24684
12964 24684 42301 22026 -5018 12709 7800 5925 -8414 12772 30540 22235 -14179 -2919
12952 -2919 7064 9126 29336 43869 62889 71694 41746 -3247 -6215 -16743 -37298 -21307 -7621
12939 -7621 -1375 -10965 -8722 20013 40326 72867 63609 69037 59481 42296 30276 18085 21448
12926 21448 10943 9984 43382 50123 36699 32442 45086 37855 33813 2093 -2991 17453 22976
12913 22976 21707 46124 32225 20222 20047 1802 -36651 -50016 -36403 -22473 -10640 -26044
12901 -26044 -42389 -31202 -17266 -15991 -21360 -41125 -26972 -29222 -3941 14060 19345 3768
12889 3768 -28305 -47182 -35818 -27317 -3536 6689 6008 13786 31618 36243 27897 12521 21522
12876B1522L9095l2279k3843K2238j408k4101k4146O17J9703J4204l401M159j3850
12863a490k9940Q522m661j1304K3039L3483P978k516N360N782o492j2126j5650
12850a5J2982J4101L2768K3139j5959o25O527n587k6988o384k411L1999l551m1351
12836A8645k1080J635J3858J4538J5883o541P055J3111J0363k0486k3427j3235
12824A0319j452q334J9516Q326J2209J2154P935r996l8695j1830J4404k3364Q457
12811c51L0031j3198k9903J4214K0109j5680k2874m088J5030J6209m11J0124j9385
12798a73q468R424J0111K2723L4167p770L476j2049k5946k9752r096L0333K1807
12785C8787O4020M9089R8713J22722J47417J94859J67145L1896j39346j81929
$$ plain form
12876 21522 60617 28338 4495 26733 25325 1224 -22922 -22305 -2602 11602 8201 12360 -1490
12863 -1490 -31430 -22908 -27569 -38873 -15834 17649 25627 23111 28471 34253 27761 15635 -15
12850 -15 12967 27068 59836 82975 67016 66391 72918 67331 40343 33959 31548 63547 59996 18645
12836 18645 -2435 -800 13058 27596 43479 36938 43993 57104 67467 46981 23554 10319
12824 10319 8867 533 20049 28375 40584 52738 60673 50677 11982 152 14556 -8808 -351
12811 -351 29680 16482 -13421 793 20902 5222 -17652 -21740 -6710 9499 9088 19212 -173
12798 -173 -8641 783 10894 33617 67784 60014 63490 51441 25495 -4257 -13353 16980 38787
12785 38787 102807 151896 250609 373331 520748 715607 882752 914648 775302 593373
12775E93373j55027j39618j02554n0471m0665l3925m6674l6032J4040J239k3824
12764b0138L6936J219k6463j1352M472J1361J7368K3712L1688l660L764j6830
12752E2077l3824j8214N646Q552K3327j833N925K778k5307j7389M0234N6649K3883
12739A22504j8116J8824O5564J23990K23303L32441L73925K77359L3478k23166
12729A330106l27157l06801k17310j62943j10570k2333j6115p480j4432k1483
12719A23482k4514l3270n1223J87K5336j6926n641R01L405j5033j7891L507j223
12706h903J7965l5668o204L3555L0943j9263k0416Q921Q136l1781J5947K3441
12694A6673L9505M767l1016l4494k1706K0318K3834N984O849l0046j7352j1210
$$ plain form
12775 593373 438346 298728 196174 145703 105038 71113 24439 -11593 2447 3686 -20138
12764 -20138 16798 18017 -8446 -19798 -15326 -3965 13403 37115 68803 65143 68907 52077
12752 52077 18253 39 5685 14237 37564 35731 41656 44434 19127 1738 41972 98621 122504
12739 122504 104388 123212 188776 312766 536069 868510 1242435 1519794 1553272 1330106
12729 1330106 1002949 696148 478838 315895 205325 182992 166877 159397 144965 123482
12719 123482 98968 65698 14475 14662 39998 23072 17431 18332 21737 6704 -11187 -7680 -8903
12706 -8903 9062 -26606 -32810 745 31688 12425 -7991 930 9066 -22715 -6768 16673
12694 16673 56178 60945 29929 -4565 -26271 -5953 17881 23865 30714 668 -16684 -27894
12682b7894k0373R680J2191L172m103J0872r988q308O965J9371j846n888j4677
12669c0826j9960J6274J2444K3084J2647J4807j5782L171j0446l216K8284k1581
12657H900k9507l1406N383J0678N075J4897J8661J7499O347J839j3833j8299k0039
12644b3805k3739N068J6209j5139j2769o344m927K319J1611J9249L494L935L1289
12631F451l111k2116k7476M67R226K1138O245p085n184j1743N297j2950k1494
12618f2335o975J5126L6241J3474M453m74j0155n228J2170j2147j9372N58J5976
12605a8688P42k2039O840L0596k713k0122j0799J886K825L3981J9850j442J5511
12592C6428j205p827o357k1261j7289J4219k439J4010Q342J6459k4203j7481R217
$$ plain form
12682 -27894 -48267 -38587 -26396 -23224 -27327 -16455 -26443 -34751 -27786 -8415 -10261 -16149 -30826
12669 -30826 -50786 -34512 -22068 1016 13663 28470 12688 15859 5413 2197 30481 8900
12657 8900 -20607 -52013 -46630 -35952 -30877 -15980 2681 20180 26527 28366 14533 -3766 -23805
12644 -23805 -47544 -42476 -26267 -41406 -54175 -60519 -65446 -63127 -51516 -32267 -28773 -24838 6451
12631 6451 3340 -18776 -46252 -45785 -36559 -15421 -9176 -16261 -21445 -33188 -27891 -40841 -62335
12618 -62335 -69310 -54184 -17943 -4469 -16 -490 -10645 -15873 -3703 -15850 -35222 -34664 -18688
12605 -18688 -17946 -39985 -33145 -2549 -5262 -25384 -36183 -34297 -31472 2509 22359 20917 36428
12592 36428 35223 27396 21039 -222 -17511 -3292 -5731 8279 16621 33080 8877 -8604 613
12579F13L0238L737l5709k4478j8078J5496L0371o11n076R151j400j8550j9381
12566c3677K7275J037n236m245N288J7446L6997K4467l6592o1271l1474J275r881
12553f8591J8008K9417j1959m8833m850J8203M4400O663q655M941M517K7661m63
12540A0459j9054k1297K1012L3783m776k1846n225K14o382o794j2229r447L1353
12527a0229J189q661o023P508J3964k0728J5606p844j6132l5991Q71J9653K8223
12514a8594k64J9774J343k132p561k8811J9223R457J3614J8721j1291j5707m328
12501f556J9833k781k235k6113K6625O693j1845k1321L5151L8282Q822Q334P250
12488H0139k5072k6372Q88K46J0237l4580j4801j7068l937j4304j3290M520L6402
$$ plain form
12579 613 30851 34588 -1121 -25599 -43677 -28181 2190 1579 -3497 5654 4254 -14296 -33677
12566 -33677 -6402 -5365 -10601 -14846 -9558 7888 44885 69352 32760 -28511 -59985 -58710 -68591
12553 -68591 -50583 -21166 -33125 -81958 -86808 -68605 -24205 -17542 -26197 -21256 -16739 10922 10459
12540 10459 -8595 -29892 -8880 24903 20127 -1719 -6944 -6730 -13112 -19906 -32135 -41582 -10229
12527 -10229 -9040 -17701 -23724 -16216 -2252 -22980 -7374 -15218 -31350 -67341 -66470 -46817 -18594
12514 -18594 -18858 916 2259 127 -7434 -36245 -17022 -7565 6049 24770 13479 -2228 -6556
12501 -6556 13277 10496 8261 -17852 8773 15466 3621 -17700 17451 55733 64555 72889 80139
12488 80139 55067 28695 29583 29829 40066 5486 -9315 -26383 -30320 -44624 -57914 -53394 -16992
12475a6992M858K0215P338r569j4455J3018j9981j3897m650K7845k255j7434m928
12462c0887P502R106L8248K2938M198m5427l4457j2705r501J54j5256k48K4408
12449d1927K204r199J2675j1380O907J8482N29M031q032l915K4390R095m1028
12436c7168o572N699K5654K7080n296q483K6129q481l3587j4678J925K6819J7032
12423A6073j9752l0688K3838J7473j2954k1048N452P934L795J6795l045p711n111
12410h949J6735P823l8603N860K8241j0967l6362o458j6428o916L0309P135m088
12397c2668j3820K7226R967M992J6795l4409k7601K0920J3253J3441K6659j552
12385B3203j1159j1455j4031k087J7362K4477O040j1762n40k0465q400N103j2118
$$ plain form
12475 -16992 -12134 8081 15419 5850 -8605 4413 -15568 -29465 -34115 -6270 -8525 -25959 -30887
12462 -30887 -23385 -14279 23969 46907 51105 5678 -28779 -41484 -50985 -50831 -66087 -66335 -41927
12449 -41927 -39723 -48922 -36247 -47627 -40720 -22238 -21709 -17678 -25710 -29625 -5235 3860 -37168
12436 -37168 -43740 -38041 -12387 14693 9397 914 27043 18562 -15025 -29703 -27778 -959 16073
12423 16073 -3679 -34367 -10529 6944 -6010 -27058 -21606 -13672 -9877 6918 3873 -3838 -8949
12410 -8949 7786 15609 -22994 -17134 11107 140 -36222 -42680 -59108 -66024 -35715 -28580 -32668
12397 -32668 -46488 -19262 -9295 -4303 12492 -21917 -49518 -28598 -15345 -1904 24755 23203
12385 23203 12044 589 -13442 -15529 1833 26310 32350 20588 20048 -417 -8817 -3714 -15832
12372a5832M713k62j7773j0791J3839j0482J2483J1148J7718O575J619J6146M461
12359C3562N713q495l1721j9379N889K0780O909j0784j731Q537q440m3703l3973
12346g6836k3255M3083K2819J0933J3141j6918j0023Q002K0727k533r91M346m4438
12333e1943k3022N9870M7449l2943l7771J0517j728K1406J682P839k2176k6410
12321d7230O248K5973K0312m617j0328k340p179K9291N386k5847j2770J4096K5844
12308A6839k3934j0209L008j3081j6644J821K9710j697K916j1844K128J5395J4237
12295H645K1950J621k4504k3683k0185L295r636Q902L7185J3045j246j0345k7005
12282b1961K5799J9396m9257M425p730Q392r089K3251J1932k9491k2267j6736
$$ plain form
12372 -15832 -11119 -11381 -29154 -39945 -26106 -36588 -24105 -12957 4761 11336 12955 29101 33562
12359 33562 39275 30780 -941 -20320 -14431 6349 13258 2474 743 9280 840 -42863 -76836
12346 -76836 -100091 -57008 -34189 -23256 -10115 -27033 -37056 -29054 -8327 -10860 -11851 -7505 -51943
12333 -51943 -74965 -15095 32354 -589 -38360 -27843 -29571 -8165 -6483 1356 -20820 -47230
12321 -47230 -40982 -15009 5303 686 -9642 -11982 -19161 10130 15516 -10331 -23101 -9005 16839
12308 16839 -7095 -17304 -14296 -27377 -44021 -42200 -12490 -14187 -11271 -23115 -20987 -5592 8645
12295 8645 30595 32216 7712 -15971 -36156 -32861 -42497 -33595 3590 16635 15389 5044 -21961
12282 -21961 3838 23234 -26023 -21598 -29328 -20936 -30025 -6774 5158 -24333 -46600 -63336
12270f3336J6721J170k185K4583J7775n937k8780r826J7033N446j393n636J471
12257c2894Q902K220K287k1932k1277l0333L6512N6224j1706j5071J34k071j2114
12244d1119m416o365m325L1607K7936k591Q216m07K5433l316p450m064q628q191
12230B320m814R555n937l4056j4915J5396o688R095P026q013J5175K557M488k1481
12216c0292j3307Q6r895K5741L032j423k4676q800J5110r489K6476R714k0380
12203c8103J5014K8642m273k4751j8591N359O209k7848j8793J8107J9572J774
12191c7682j1015j2099K7576L1081Q491O274M812l136K3127p713k5778l5088j5891
12178d7041J7535j3519K3839O335J752J1313J6813j4415l628j2695L280J3201
$$ plain form
12270 -63336 -46615 -45445 -47630 -23047 -5272 -11209 -39989 -49815 -32782 -27336 -28729 -34365 -32894
12257 -32894 -23992 -21772 -19485 -41417 -62694 -93027 -56515 -291 -11997 -27068 -26934 -29005 -41119
12244 -41119 -45535 -51900 -56225 -24618 3318 727 8943 8536 33969 30653 23203 19139 10511 2320
12230 2320 -2494 7061 1124 -32932 -47847 -32451 -39139 -30044 -23018 -31031 -15856 -13299 -8811 -30292
12216 -30292 -43599 -43513 -53408 -27667 -24635 -26058 -50734 -59534 -44424 -53913 -27437 -17723 -38103
12203 -38103 -23089 5553 1280 -23471 -42062 -36703 -30494 -58342 -77135 -59028 -39456 -37682
12191 -37682 -48697 -60796 -33220 -2139 6352 12626 17438 14302 37429 29716 3938 -31150 -47041
12178 -47041 -29506 -43025 -19186 -12851 -11099 214 17027 2612 -1016 -13711 -10431 2770
12166B770N108J6189J1069q176N107j4224j4758K2818p551j7034j0715k4805K920
12153c1282J9136P201K1610q631j4651j192J158j1429p380l807J2387m501O256
12140a5125O555J0698k0983l0277m88J5221J3713o320r059K847N7l036J5927M4814
12126B4544o622k663r340k1213J0619R329j3640N274J4324J857j8349q811P064
12113g627L6353l498k2089l0361j7275j1739K6867J3504J3805Q667j2124r069
12101a4586N133K5016j2039o989N146l872J4633K181J2546k1977k2919L16J7664
12088B53K6630J0352k1723n858j4563q119j161M3948L4729j1990m3794L647R908
12075B2259l0310j8193j6291m044M905R252J6038l177J7961K6273k4706k0538
$$ plain form
12166 2770 7878 24067 35136 26960 32067 17843 3085 25903 18352 1318 -9397 -34202 -31282
12153 -31282 -12146 -4945 16665 8034 -6617 -7809 -6651 -18080 -25460 -29267 -16880 -21381 -15125
12140 -15125 -8570 2128 -18855 -49132 -49620 -34399 -20686 -27006 -36065 -33218 -33161 -36197 -20270 24544
12126 24544 17922 15259 5919 -15294 -4675 4654 -8986 -3712 10612 12469 -5880 -14691 -7627
12113 -7627 28726 25228 3139 -27222 -44497 -56236 -29369 -15865 -2060 6607 -5517 -14586
12101 -14586 -9453 15563 3524 -3465 1681 -2191 12442 14623 27169 5192 -17727 -17411 253
12088 253 26883 37235 15512 9654 -4909 -13028 -14189 29759 64488 52498 8704 12351 22259
12075 22259 -8051 -26244 -42535 -46579 -41674 -32422 -16384 -19561 -1600 24673 -33 -20571
12063b0571j50j2954l434r747N116N811M103k0475o276O788L9367L2647J6243
12050C6468J1339j1011j7281k2203j5800O909q325j4170K9005l316M865J8667
12038A5147j129m6760M375M2021J3328k1340N986j7080l294M1655m792j1997q14
12025A5306o172J11j1633o493J158K6614k163P112L0494J9574M0431J4551L5092
12012A63982K7621n918j7158j2658r877k853k6459o9316l7672N448J3113j2657
12000A5596o393Q894J1442L5854J1238m7126m6047n141R765J1830J2719K8041
11988D0672k37l7087l1070p92j0402J2194L491L3398J2557k6369j0382J8099J2585
11975A6657L4084O7202M4468M0164K3078K4609J9920K9334K0748p025l4895j8737
$$ plain form
12063 -20571 -20721 -33675 -37109 -46856 -41740 -35929 -31826 -52301 -58577 -51789 -12422 20225 36468
12050 36468 47807 36796 19515 -2688 -18488 -11579 -19904 -34074 -5069 -8385 -3520 15147
12038 15147 14018 -32742 -28367 13654 26982 5642 11628 -5452 -8746 32909 28117 16120 15306
12025 15306 9134 9245 -2388 -8881 -7723 18891 16728 23840 54334 73908 114339 128890 163982
12012 163982 191603 185685 168527 155869 145992 143139 116680 47364 9692 15140 28253 15596
12000 15596 9203 18097 29539 65393 76631 29505 -16542 -21683 -11918 -88 12631 40672
11988 40672 40435 3348 -27722 -28514 -38916 -26722 -23231 10167 22724 -3645 -14027 4072 16657
11975 16657 50741 117943 162411 202575 225653 250262 270182 299516 320264 313239 278344 259607
11963B59607M18l2394n9711j629j4458o3727n0453j0976m642J4460l6912j3151
11951a3568M495m727K4549L5427p520J420L912k5543j2757O474j0004j5451l5473
11938d8766q966L707J4743K9620L3888K6619k7365k4480o198K6553J8127L2685
11926G0167J893N8351L5731J4502L8155J3431j3307m7316o8593l0642l7345k307
11914C2720j3771l2888J0867p114l531J0591j3345J5504j3269j5361J4257Q438
11902f902q491O261J3919k3387k8554k267M1105M969J7468K0922j4989k0403J98
11889a51l779j3102k155K0010J5435K728l4378l789K5073q557R200K4049j3570
11876A7014j5096K698K2820O269P696R389m2313l8154k503J2889M2443j3851l7499
$$ plain form
11963 259607 260025 227631 167920 166291 151833 88106 37653 26677 22035 36495 -417 -13568
11951 -13568 -9073 -13800 10749 46176 38656 40076 43988 18445 5688 12162 2158 -13293 -48766
11938 -48766 -57732 -54025 -39282 -9662 24226 50845 23480 -1000 -7198 19355 37482 70167
11926 70167 72060 130411 166142 180644 218799 232230 218923 171607 103014 72372 35027 32720
11914 32720 18949 -13939 -3072 -10186 -13717 -3126 -16471 -967 -14236 -29597 -15340 -6902
11902 -6902 -15393 -9132 4787 -18600 -47154 -49421 -8316 -3347 14121 35043 20054 -349 -151
11889 -151 -3930 -17032 -19187 823 16258 18986 -15392 -19181 5892 -2665 6535 30584 17014
11876 17014 1918 4616 27436 33705 41401 50790 8477 -29677 -32180 -19291 23152 9301 -28198
11863b8198K8006K2292k3273k0532m773N600Q912Q125J3528M448k489k0018q155
11850a6527K2187K4374j3787Q043k1453j7148K581n722K6326P786l608j180k1832
11837i960k9841j9506L4235L6544r598J9693q401k1349k1431J1660R552k676K73
11824a0805L527L5326J3048M553k6425k9859m061j7756l5029M766L858M791M368
11811d9698n227L056J6623N840j6485j4548K6617J0671n281k4245k2888L7618
11799c7947K6657Q947j0830l825j8553j6188L395K8406J6591J7877k046J3794
11787B6278n423K799j1215k7771j8041j5070O443l525j5155J9675Q595J0785J4278
11774g347K2617j9789k997k826k4351p354M330K1935L559J262L3413L5441k5624
$$ plain form
11863 -28198 -192 22100 -1173 -21705 -26478 -20878 -11966 -3841 9687 14135 11646 -8372 -16527
11850 -16527 5660 30034 16247 24290 2837 -14311 -11730 -17452 8874 16660 13052 11872 -9960
11837 -9960 -39801 -59307 -25072 11472 1874 21567 13166 -8183 -29614 -17954 -8402 -11078 -10805
11824 -10805 -7278 28048 41096 45649 19224 -10635 -14696 -32452 -67481 -62715 -58857 -54066 -49698
11811 -49698 -54925 -51869 -35246 -29406 -45891 -60439 -33822 -23151 -28432 -52677 -75565 -37947
11799 -37947 -11290 -2343 -13173 -16998 -35551 -51739 -48344 -19938 -3347 14530 12484 26278
11787 26278 20855 23654 12439 -15332 -33373 -48443 -42000 -45525 -60680 -41005 -32410 -21625 -7347
11774 -7347 15270 -4519 -7516 -10342 -34693 -42047 -37717 -15782 -12223 -10961 22452 57893 32269
11761C2269j8557L404l899k3817R805j459N029k2445J6914j2352j2627O695O550
11748a4490j3770p736k205K8639K2108R92O897k6239p162j201l441k5159L135
11735c9632K476n477K1937J4995j3942l2678j0313J025K542K1512M5249J7917
11723B5611J8399J3858k069k7313k5422q355k6318k7789j583J8662M0224P423
11711E328k8380P857K1787j788p981m65J5272J5822R817M52j7293k5981n185j622
11697a2360J757J0588M1809J2541l0043m8405J0240Q091J1146m360j3984j5749
11685b8729N850L969L0573j1998j7370P634N699j0219k3152O40j6153L5432M1025
11672B3201R792j7385j3091N526q481j9586j3440p731J4016J3596O946l908P277
$$ plain form
11761 32269 13712 17116 13217 -10600 -795 -2254 2775 -19670 -2756 -15108 -27735 -21040 -14490
11748 -14490 -28260 -35996 -38201 -9562 12546 13538 20435 -5804 -12966 -14167 -17608 -42767 -39632
11735 -39632 -37156 -42633 -20696 -5701 -19643 -52321 -62634 -61609 -59067 -37555 7694 25611
11723 25611 44010 57868 55799 28486 3064 -5291 -31609 -59398 -60981 -42319 -2095 5328
11711 5328 -23052 -15195 6592 4804 -3177 -3642 11630 27452 37269 37721 20428 -5553 -10738 -12360
11697 -12360 -10603 -15 41794 54335 24292 -24113 -13873 -5782 5364 1004 -12980 -28729
11685 -28729 -22879 -18910 11663 -335 -17705 -10071 -4372 -14591 -37743 -37103 -53256 -17824 23201
11672 23201 32993 15608 2517 8043 -438 -20024 -33464 -41195 -27179 -13583 -6637 -10545 -3268
11659c268j7539l6378k4996P667L4517J924M2490K3443l6546l2096k0925P306
11647e4401k4960J7915L2654J1997K975N943J5939Q614j7396n436L780j79p934
11634a0489k4875J268J776N946L4200J5139J8119p260k4903l5831q614K4722K4918
11621A4116r017m081j0289J6965L006J2425p190l5120m0382P074J4245O4j1607
11608d9791K7656M2505P617Q269K5982n293k9537k8195L213K8583j9194l7803
11596b5988j2478O113j5689L034K0038K4651J7256j6384K4827J0414j8969j4749
11584B076j1551j0280k064o273j5055K2605K0724j2025J747J4707L618k2301j2832
11571b6904M47O707J6590J0701M891j2417p703J2858l7016O196K2432J7995q923
$$ plain form
11659 -3268 -20807 -57185 -82181 -74514 -39997 -38073 4417 27860 -8686 -40782 -61707 -54401
11647 -54401 -79361 -61446 -28792 -16795 -13820 -7877 8062 16676 -720 -6156 -2376 -2555 -10489
11634 -10489 -35364 -34096 -32320 -26374 7826 22965 41084 33824 8921 -26910 -35524 -10802 14116
11621 14116 5099 1018 -9271 7694 10700 23125 15935 -19185 -59567 -52493 -38248 -38184 -49791
11608 -49791 -22135 20370 27987 36256 62238 56945 27408 -787 2426 31009 11815 -25988
11596 -25988 -38466 -32353 -48042 -45008 -24970 -319 16937 553 25380 35794 16825 2076
11584 2076 -9475 -19755 -21819 -28092 -43147 -20542 182 -11843 -10096 4611 8229 -14072 -26904
11571 -26904 -26457 -19750 -3160 7541 12432 15 -7688 5170 -31846 -25650 -3218 14777 5854
11558E854j2653j6708P911P952m463K978r414k6037j6608M6761J3780m6264k4887
11545g1798L1706M9133J2140k9019j2550K4600j1027K4374O959K648p284j5421
11533D461j2152q896j578l466L4092J2230k1735k6828J2670J6686j221k8536k1569
11520d5842j9859J6579L1007L330R027K8243j2724j7118J7731Q592j4903J4618
11508A8681k7421l0070M845J931r076J5730j4603R979K5192j8032j6913k7437
11496f7194J5860J3871J6284K6870O365k97Q775J1118P455j6914p113L7571N986
11483E8637j7948l3679k8094k2443j7334J3166j0801P767K9774R4O532j7603J9521
11470a2411P486K0247J3250k2678j4349L4815m204k6505l3457j7238n957j0896
$$ plain form
11558 5854 -6799 -23507 -15596 -7644 -12107 -9129 -18543 -44580 -61188 -14427 -647 -46911 -71798
11545 -71798 -40092 9041 21181 -7838 -20388 4212 -6815 17559 24518 27166 19882 4461
11533 4461 -7691 -16587 -18165 -21631 12461 24691 2956 -23872 -11202 5484 4263 -24273 -45842
11520 -45842 -65701 -49122 -18115 -14785 -5758 22485 9761 -7357 10374 18966 4063 18681
11508 18681 -8740 -38810 -33965 -32034 -41110 -25380 -39983 -30004 -4812 -22844 -39757 -67194
11496 -67194 -51334 -37463 -21179 5691 12056 11759 20534 31652 39107 22193 15080 52651 58637
11483 58637 40689 7010 -21084 -43527 -60861 -47695 -58496 -50729 -20955 -20861 -14329 -31932 -12411
11470 -12411 -4925 15322 28572 5894 -8455 26360 22156 -4349 -37806 -55044 -61001 -71897
11458g1897L1799L5471O404j1782R075K083m259J8638P439j4243k8483l1999k2190
11445g3944J3023L0318J1087j2926K0128k579r979j3157j1646J3823L950J7274
11433a4628m0369K1842J2314J7037J3098j2948p645N405k1625n776L1147P999
11421E851K07j0969k1030j2182m364l763j740q189K3446K1807M3053L6677J0083
11408G8887l2486n1330k9435K4388N467m976p644J730q280J2381J0868J2460L0827
11395D2857J3800k4650M429o294q865j2002k3201q718m335r842K7734J3836j4670
11382i921Q9K055Q262M472P062l7745k4707J0235J8413P447l3217K085J3582j8328
11368e0216j8677K6382L0840M225r512j2737j5407K6515L7242L3120k2005O488
$$ plain form
11458 -71897 -40098 -4627 1777 -10005 -930 1153 -3106 15532 22971 8728 -19755 -51754 -73944
11445 -73944 -60921 -30603 -19516 -32442 -12314 -14893 -24872 -38029 -49675 -35852 -31902 -14628
11433 -14628 -54997 -33155 -20841 -3804 9294 -3654 -11299 -5894 -27519 -33295 -2148 5851
11421 5851 6058 -4911 -25941 -38123 -42487 -46250 -47990 -56179 -32733 -10926 32127 68804 78887
11408 78887 46401 -4929 -34364 -9976 -4509 -9485 -17129 -15399 -23679 -11298 -430 12030 42857
11395 42857 56657 32007 36436 30142 21277 9275 -13926 -22644 -26979 -36821 -9087 4749 -9921
11382 -9921 -9832 -7777 485 4957 12019 -25726 -50433 -40198 -21785 -14338 -47555 -45470 -31888 -50216
11368 -50216 -68893 -42511 -11671 -7446 -16958 -29695 -45102 -18587 18655 51775 29770 36258
11356C6258n416m7144k3745o446q469K7778J1360k0861M201j099J3392K8194J8386
11343B6389O540r557j3757R360J3898k8542l0229j4763Q837K3032J3493o371Q920
11330G250J8222J06R359o26M33j244k35j5216j0284N69q683K1072n669Q463j2774
11315A0743j5895k950p218O905K1909M325j6250O042j4651m0428k8223L1546k07
11302d4352m597N755l2309O701N247r04m064j1655J7543L0622l821j4843j0790
11289f1467l73k455J7425L9930K6421l1933m7353L926M2167K2554R053O154Q327
11276C2376j4430q946J5738P228J2814J3822l378j1781N584r037k6210k6030J9414
11263G164J1946j2662m155k8128J0123L7783J2407O62j9543P982q351J4191J6235
$$ plain form
11356 36258 30842 -16302 -40047 -46493 -54962 -27184 -15824 -36685 -32484 -33583 -20191 8003 26389
11343 26389 32929 23372 9615 18975 32873 4331 -25898 -40661 -31824 -8792 4701 -1670 7250
11330 7250 25472 25578 34937 34311 34744 33500 33265 18049 7765 8334 -349 20723 15054 23517 10743
11315 10743 -5152 -8102 -15320 -8415 13494 17819 1569 7611 -7040 -47468 -75691 -44145 -44352
11302 -44352 -48949 -43194 -75503 -68802 -63555 -64459 -68523 -80178 -62635 -32013 -35834 -50677 -61467
11289 -61467 -61840 -64295 -46870 -6940 19481 -12452 -59805 -55879 -13712 8842 17895 24049 32376
11276 32376 17946 9000 24738 31966 44780 58602 55224 43443 49027 39990 13780 -12250 7164
11263 7164 19110 6448 2293 -25835 -15712 22071 34478 35140 15597 23579 15228 29419 45654
11250D5654j9915k9468k8445r03J0597J6373o569p41K0851k2316q46L521M0411
11237B8204L3550k0433l3418l8681L030l642k6388P215J5544M3736J8995j4068
11225A3644j0708j8044J3814k34j4497J1089J0779l5020p500m962j7631P642j5451
11212f7079K2473K4369P062J2421o753j660K0498k4661k0298q480n071K912R774
11199c4493K3198O77K883k0866K7881L5566K416o074m5845M463L4791j0639k6638
11186a2680q388J558k3432L41L7202J7181j0965r304k2122j0820N434J9279Q567
11173h149j4365Q238p610J2858K5985L389j0124l2177k001k7241M277J819J9J2549
11159c2533L5710R601n286Q921Q127m386p428k5201k3057J1656M435K0316J6578
$$ plain form
11250 45654 25739 -3729 -32174 -33077 -22480 -6107 -12676 -13417 7434 -14882 -15728 -12207 28204
11237 28204 61754 41321 7903 -30778 -27748 -31390 -57778 -50563 -35019 8717 27712 13644
11225 13644 2936 -15108 -1294 -1528 -16025 -4936 5843 -29177 -36677 -41639 -59270 -51628 -67079
11212 -67079 -44606 -20237 -13175 -754 -7507 -9167 11331 -13330 -33628 -42108 -47179 -44267 -34493
11199 -34493 -11295 -10618 -7735 -28601 -720 34846 37262 31188 -14657 -10194 24597 13958 -12680
11186 -12680 -21068 -19510 -42942 -42601 -5399 11782 817 -8487 -30609 -41429 -35995 -16716 -8149
11173 -8149 -22514 -14276 -21886 -9028 16957 20346 10222 -21955 -23956 -51197 -46920 -45101 -45082 -32533
11159 -32533 3177 12778 7492 16413 24540 20154 12726 -12475 -35532 -23876 -19441 875 17453
11146A7453K5445N024j6814o206r670K4094J4383j1941R594l5888J3286J2198
11134D0958j8895j673K1947J6867K7848O1001M7308J08279J27418J08463Q7896
11123F27417R8160J33983J38069L2921m1288q3748j03766j07874r7814q5950j13931
11112C96179j15735o8424o8001o2241m660J1565j9603k1771l2834l3506k3574
11101d2605Q164L0117J4882n943K264J624K8069O761j4136q971J727l3886j6999
11088b8932j0309q910J5287J4423J2973k3913k2063j5072j3173l658K2208K3301
11076c7838K1098Q868q216j7379K0903K4412j276j4122r699K910K3288L76l1662
11063a8337Q749L936p187K7888J1320N978j7067J103J8775J9790j2819n958r295
$$ plain form
11146 17453 42898 47922 31108 24902 15232 39326 53709 41768 51362 15474 28760 40958
11134 40958 22063 20390 42337 59204 87052 148053 195361 303640 431058 539521 627417
11123 627417 725577 859560 997629 1030550 989262 905514 801748 693874 596060 510110 396179
11112 396179 280444 212020 144019 81778 77118 88683 69080 47309 14475 -19031 -42605
11101 -42605 -34441 -4324 10558 4615 6879 8503 36572 43333 29197 20226 21953 -11933 -28932
11088 -28932 -39241 -48151 -32864 -18441 -5468 -29381 -51444 -66516 -79689 -83347 -61139 -37838
11076 -37838 -16740 -7872 -16088 -33467 -12564 11848 10572 -3550 -13249 -10339 12949 13325 -18337
11063 -18337 -9588 -5652 -12839 15049 26369 32347 15280 16383 35158 54948 42129 36171 26876
11050B6876j3696o209K3460J3036j2892q174J1248j7083k2170k8000k3554J7421
11038c9737L9051M835L0147J0215l4948j8707j8874j799K2476M387j0223K2087
11026H910M760m4022K2198K3742m9179j9438M8558L6929O098l3169j0010l129
11014g752j9666Q682J0379j125j0334K76L158K7593K7258J5872k7045R04Q694
11001C6894j8047j8893l0429J1685Q216J3925J83K6945J3352n260j500m1797r382
10988a4108M937p07M14K4391K3473j0336J5387J8788k7022l3731k8372L711Q931
10975a4244O033J179j1170N96m580K344l267J0198K8122J7674k2176j3454N472
10962B727J9524k757j2935K669K389k6637m533k50L217J8310K5765K1557k6656
$$ plain form
11050 26876 13180 6971 30431 43467 30575 22401 33649 16566 -5604 -33604 -57158 -39737
11038 -39737 -686 4149 34296 44511 9563 -9144 -28018 -29817 -7341 -2954 -13177 8910
11026 8910 13670 -30352 -8154 15588 -33591 -53029 -4471 32458 38556 5387 -4623 -7752
11014 -7752 -27418 -18736 -8357 -9482 -19816 -19540 -16382 11211 38469 54341 27296 28200 36894
11001 36894 18847 -46 -30475 -18790 -10574 3351 3534 30479 43831 38571 37071 -4726 -14108
10988 -14108 -9171 -9878 -9464 14927 38400 28064 43451 62239 35217 1486 -26886 -23175 -14244
10975 -14244 -8211 -7032 -18202 -17606 -22186 -19842 -23109 -12911 15211 32885 10709 -2745 2727
10962 2727 22251 19494 6559 9228 11617 -15020 -19553 -19803 -16586 1724 27489 49046 22390
10949B2390m8392k5447n291P342J4291K3437J7732N945j9889k870J3287J725k4821
10936b0561j5108K2402o279K0478O386j1213Q75J8915L72j9198j9513j5991J6528
10923b1907O476J6713K8954J604R97J4013J7952k1465l0786p079k992j5795N539
10910g776P221J2798J1144K6870r452l7351j1100j3466J2698K763J291m176k3014
10897c1550p226J419N602J8883K2613N96L047J9205k7550l6182J0903P1509J9003
10884G0272k9748L98J2890J8766J4701P816l958j003J585N017r065K288K372j8375
10870G3956k6169k0038j7224j2544J5545J1355j0027O915j5552j0526j3439p483
10858b5231M283J8156K0469K330j9313r380n39K1621j7056j0808j4587j4203k5155
$$ plain form
10949 22390 -26002 -51449 -56740 -49398 -35107 -11670 6062 12007 -7882 -10752 2535 4260 -20561
10936 -20561 -35669 -13267 -19546 932 7318 -3895 -3020 15895 16267 -2931 -22444 -38435 -21907
10923 -21907 -15431 1282 30236 31840 32837 46850 64802 43337 12551 5472 2480 -13315 -7776
10910 -7776 -555 12243 23387 50257 40805 3454 -7646 -21112 -8414 -5651 -4360 -8536 -31550
10897 -31550 -38776 -37357 -31755 -12872 9741 10337 13384 32589 5039 -31143 -20240 51269 70272
10884 70272 40524 40922 53812 72578 87279 95095 91137 90134 91719 96736 87671 89959 92331 73956
10870 73956 47787 27749 10525 -2019 13526 24881 14854 21769 6217 -4309 -17748 -25231
10858 -25231 -20948 -2792 17677 20007 694 -8686 -9225 12396 -4660 -15468 -30055 -44258 -69413
10845f9413O520L1565K1348j438j1381J1941L817k517J345O753K334l0695k6371
10832e6192K0630L2053J0855j5114m773J4506j6882P766M795N612j5978l4124
10820d6846j1128J2040J6329k6109j361K2746P064J2253M710j0823o789p144j1120
10807d6178N565J9197N507J3083K2945n384k1176J1333J130k2398O174j91k9659
10794d0052P686J5666K109J1168J5710k6334q810J6819j3678J0571M1335K5549
10782E7739k0941l7339J121K6852r092j1601k1349K26J7496l242L861J7742J2536
10769C4009J7068J0495R28k8676q126j7274q764J3527K1565K520q238k7363j6034
10756a4363o579n098Q493J7626q358l3176j4591K0955R052Q237j1178l069J0280
$$ plain form
10845 -69413 -62893 -31328 -9980 -11418 -22799 -10858 -7041 -9558 -8213 -1460 874 -29821 -56192
10832 -56192 -35562 -3509 7346 -7768 -12541 1965 -14917 -7151 -2356 3256 -12722 -46846
10820 -46846 -57974 -45934 -29605 -55714 -57075 -34329 -27265 -15012 -10302 -21125 -27914 -35058 -46178
10807 -46178 -40613 -21416 -15909 -2826 20119 14735 -6441 4892 6022 -16376 -10202 -10393 -40052
10794 -40052 -32366 -16700 -14591 -3423 12287 -14047 -22857 -6038 -19716 -9145 32190 57739
10782 57739 36798 -541 580 27432 18340 6739 -14610 -14384 3112 -130 3731 21473 34009
10769 34009 51077 61572 62500 33824 25698 8424 -340 13187 34752 37272 29034 1671 -14363
10756 -14363 -20942 -26040 -17547 79 -8279 -41455 -56046 -35091 -26039 -17802 -28980 -32049 -21769
10743b1769J5583Q098k0057L169O350o028L5924J2547j7299l240n195o387k185
10730d89K7764K1318M765j6567J7581o198k8923j8154J8780M475N484j6308j0906
10717B622M355R853J4884M596K864N197P395N264m041m3863R605N246n780j674
10703A6523J70M3j7590o581L1477k9403l1776K0228M3453o583k3832j6317Q53
10690a9335P678K314p461o255q92j0135L801K0961J8647o086j9725j4002o714
10677c7204j1271L9101K8487l193l1870k1067M168J7070K4653K0718j7162p779
10665D651k9124J8372K5759k6184q246l490K551j805R118j0433k794J132j1585
10652c2078j5220K0086K5740L2679K7704l0341k4357j9100k5484L1326L8600j8356
$$ plain form
10743 -21769 -6186 1912 -18145 -14976 -8626 -14654 21270 33817 16518 13278 8083 1696 -489
10730 -489 27275 48593 53358 36791 54372 48174 19251 1097 19877 24352 29836 13528 2622
10717 2622 6977 16830 31714 36310 39174 44371 51766 57030 52989 9126 18731 23977 18197 16523
10703 16523 16693 16736 -854 -7435 24042 -5361 -37137 -16909 26544 19961 -3871 -20188 -19335
10690 -19335 -11657 -9343 -16804 -23059 -23951 -34086 -30285 -9324 9323 3237 -16488 -30490 -37204
10677 -37204 -48475 -9374 19113 15920 -15950 -37017 -32849 -15779 8874 29592 12430 4651
10665 4651 -24473 -6101 19658 -6526 -14772 -18262 -15711 -17516 -8398 -18831 -21625 -20493 -32078
10652 -32078 -47298 -27212 -1472 31207 58911 28570 4213 -14887 -40371 -9045 29555 11199
10640A1199K0639j4662q29N074k6845J598P74p551k0203k7308q565L5945K6941
10627c793N093k0702m3144K3552L8506J4584P315K4076p771j5274r669J1189K948
10614B6910q756K56k1868l1387k594N010J2439K9095j2005O634j3097j3531l882
10601b6776K185K2621Q972J4878o313J1203j2719j6092J1211J4615j9504J6323
10589B0604q132l4183j8103J0313q275n0521M949M4961N692q029K7952n051K0301
10576B478J7881L310q540p758J2917J4276P050L260p939k1421j5041p23K4110
10563B3860J0234p904J127j0856k7949j1542j0252J5963L4287o841L219l311j0023
10550A2j7703q71O165M119l701K9377l220j2654k0366k5222R654K1813r231K09
$$ plain form
10640 11199 31838 17176 16347 21421 -5424 -3826 -3052 -10603 -30806 -58114 -66679 -30734 -3793
10627 -3793 1300 -19402 -62546 -38994 -488 14096 21411 45487 37716 22442 12773 23962 26910
10614 26910 18154 18410 -3458 -34845 -37439 -32429 -19990 9105 -2900 3734 -9363 -22894 -26776
10601 -26776 -24591 -1970 7002 21880 15567 26770 14051 -2041 9170 23785 4281 20604
10589 20604 12472 -21711 -39814 -29501 -37776 -88297 -83348 -38387 -32695 -40724 -12772 -17823 2478
10576 2478 20359 23669 15129 7371 20288 34564 41614 44874 36935 15514 473 -250 23860
10563 23860 34094 26190 27317 16461 -11488 -23030 -33282 -17319 16968 10127 13346 10035 12
10550 12 -17691 -18562 -12397 -8278 -11979 17398 14178 1524 -18842 -44064 -34410 -12597 -21828 -21619
10536b1619J5883J5397L834K3162J1360l3032P075M731J3052l28k0257m622j0521
10523D115K880K0575k8075n976Q236K9422J6365q753k2070j9487j4121O203k1858
10510c2544N337l806M324j020K1152J1467n803J0873q730r484N411m082n964l3038
10496d5907J2466K2481N24K1305J1456j0545m1463M317J0835p113J3959J4800
10484G115K4212n958p019k835k340J0414l020j9199j958m153j5108L1518p366
10471D303l1057j2030P446J0580J0226M219J1182J909J8930L958N4L0746n1676
10458H790n0457m368J8415n269Q872J6369M603j8119j3898J529J8678p131M340
10445a7646n374N116k3149N706L867L6501K7576J4203k8500m266Q871L8086K4126
$$ plain form
10536 -21619 -5736 9661 13495 36657 48017 14985 22060 26791 39843 39515 19258 14636 4115
10523 4115 6995 27570 -505 -6481 1755 31177 47542 38789 16719 -2768 -16889 -10686 -32544
10510 -32544 -27207 -31013 -26689 -27709 -6557 4910 -893 9980 1250 -8234 -2823 -6905 -12869 -45907
10496 -45907 -33441 -10960 -10436 10869 22325 11780 -29683 -25366 -14531 -21644 -7685 7115
10484 7115 31327 25369 18350 15515 13175 23589 20569 1370 -588 -4741 -19849 11669 4303
10471 4303 -26754 -38784 -31338 -20758 -10532 -6313 4869 6778 25708 29666 29720 60466 8790
10458 8790 -41667 -46035 -27620 -32889 -24017 -7648 -3045 -21164 -35062 -33533 -14855 -21986 -17646
10445 -17646 -23020 -17904 -41053 -35347 -31480 5021 32597 46800 18300 14034 22905 60991 85117
10432H5117n953K2619Q623k1414j6506J611Q158K1254J103j9855m7674o786J8305
10419D8602J2604J5805K2480q089o08k137j292l3296j2591L217j2638K3705l929
10406E1833p610p99k2577p328J64K5977q370k0919k3385p545J5524K178M893J7151
10392A9187J1627k5710J2276K4959L9481L2022R404Q12P568K0875K4491J1610
10380A88602L547K0534R944j9242j6321l825K3512K272l2644l6406o677J8039
10368A51335r884k8680k6263j1635q378m3597j4455J6896j3738m7757J5254k0438
10356d1340J5615L7836j2754k6661K2557K472p754J6428M0287p719k4320lk974
10343A1670Q347q557K2284k236J6691K6177j3081n217J6925K387J4756M4139N327
$$ plain form
10432 85117 79164 101783 110406 88992 72486 74097 82255 103509 104612 84757 37083 30297 48602
10419 48602 61206 77011 99491 91402 90794 88657 87365 54069 41478 44695 32057 55762 51833
10406 51833 44223 43424 20847 13519 13683 39660 31290 10371 -13014 -20559 -5035 -2857 2036 19187
10392 19187 30814 5104 17380 42339 81820 113842 123246 124058 131626 152501 176992 188602
10380 188602 192149 212683 222627 203385 187064 183239 206751 209023 176379 139973 133296 151335
10368 151335 141451 112771 86508 74873 66495 22898 8443 25339 11601 -36156 -20902 -41340
10356 -41340 -25725 12111 -643 -27304 -4747 -2275 -10029 6399 46686 38967 14647 14644 11670
10343 11670 20017 11460 33744 31508 48199 74376 61295 56078 73003 75390 90146 134285 139612
10330A39612L486J2042J381k0165O530K8348J0907j338j6819k6679k6365k4326
10318H6614k7197O988k2816k501k4483p607J4022J0892J069j2452j3611q144l5355
10305c4581J3916K3809J7758J4317p660J067J0302m1192K968K1909J8148J0151
10293E0912j3810K0891L93k8768j8892j0141J2867j0786J3269J5538K4864J0752
10281F7089j4150l3436n860K7658N480J593J2038J0049K6043K162Q652N1653P2701
10268B31672R5527J41061J96624K15763J14331R352r4064o2286k3670O9418J37224
10257A030952N3294o1107j86010k61461j86389j19239l6670l0907l8673k6019
10247A37771j6078k2861l9621j1405j9001K3635M5934r686j6155j0456J1093J0641
$$ plain form
10330 139612 143098 155140 156521 136356 142886 171234 182141 180803 163984 137305 110940 86614
10318 86614 59417 66405 43589 41088 16605 8998 23020 33912 34981 22529 8918 774 -34581
10305 -34581 -20665 3144 20902 35219 27559 28626 38928 -2264 704 22613 40761 50912
10293 50912 37102 57993 58386 29618 10726 585 13452 2666 15935 31473 56337 67089
10281 67089 52939 19503 13643 41301 46781 48374 60412 70461 96504 98666 107318 158971 231672
10268 231672 327199 468260 664884 880647 994978 1004330 910266 847980 824310 893728 1030952
10257 1030952 1084246 1023139 837129 575668 389279 270040 233370 202463 163790 137771
10247 137771 121693 98832 59211 47806 28805 52440 98374 88688 72533 62077 73170 83811
10235H3811m086j0635k598m79J6661j0655j6145j995k8938j5775j6384K6461J1918
10222C1161l3704L500P754p033O288j0885J551K5551J0279k0016j3175J6476K5306
10209D3053R151o642j2232K2487J8195R9J625j2953M737J492J7820j1761n4569
10196B0502p000j4098p457J4258O240o106j6714k1446O799R771j487L0452M994
10183A8708j1512J1018J3883k4952j3464L5363J8508k8305J2173M307j899j0501
10171B3327M325K707M830J0705m5683l3541R128K9231j0591J7392M036o59k8633
10158a3426j7315M289J7862J3433J6911k2976k895J4608P506j627j0052K4580
10146C0898k518j2957M643O957o033M622J3351j2789m589K4165p598j9716P011
$$ plain form
10235 83811 79725 69090 66492 66013 82674 72019 55874 53879 24941 9166 -7218 19243 31161
10222 31161 -2543 957 8711 1678 7966 -2919 -1368 24183 34462 14446 1271 17747 43053
10209 43053 52204 45562 33330 55817 74012 74111 75736 62783 67520 69012 86832 75071 20502
10196 20502 13502 -596 -8053 6205 12445 6339 -10375 -31821 -25022 -15251 -16738 13714 18708
10183 18708 7196 18214 32097 7145 -6319 29044 47552 19247 31420 35727 33828 23327
10171 23327 27652 30359 35189 45894 211 -33330 -24202 5029 -5562 11830 15866 15207 -13426
10158 -13426 -30741 -26452 -8590 4843 21754 -1222 -4117 10491 17997 16370 6318 30898
10146 30898 28380 15423 20066 27023 20990 25612 38963 26174 21585 45750 38152 18436 25447
10133B5447k042k625j6265m9282J7823K6657j3320J0260J6566R746j5534K9731
10121C7162j1583k1270j4102O06q660j9172j5940M2822K7475Q645l1002Q69N892
10108A742M475K0749j1284l505j781j1320L61M66n253j9038o096L785q026J6854
10094a7871L4586k766j1951q828j0021L1084J3798j8038j0877J328J937k7086
10082b4705J9859J3303j1174M309o132q712J3079j0585j1353L5649K6297p387
10070C2448L3876L380q063j8375L636l2744j6473j7252k476K539j2526J832J8117
10057a2081k0537m414l088J8096J7539k652k1736q652K3731K9794r05j4917j6608
10044a6430P563j8175J2603L6315K172j3969J6672k1337j9703J5953J5686l114
$$ plain form
10133 25447 23405 20780 4515 -44767 -26944 -287 -13607 -3347 13219 22965 7431 37162
10121 37162 25579 4309 -9793 -9187 -17847 -37019 -52959 -10137 17338 25983 -5019 -4150 1742
10108 1742 6217 26966 15682 12177 10396 -924 -563 -97 -5350 -24388 -30484 -26699 -34725 -17871
10094 -17871 16715 13949 1998 -6830 -16851 14233 28031 9993 -884 444 2381 -24705
10082 -24705 -4846 8457 -2717 1592 -4540 -13252 -173 -10758 -22111 13538 39835 32448
10070 32448 66324 69704 61641 43266 46902 14158 -2315 -19567 -22043 -19504 -32030 -30198 -12081
10057 -12081 -32618 -37032 -40120 -22024 -4485 -7137 -28873 -37525 -13794 16000 15095 178 -16430
10044 -16430 -8867 -27042 -14439 21876 24048 10079 26751 5414 -14289 1664 17350 14236
10032A4236J4731K8778K777j0797j1685j8938L373l8038R689K8411q222Q840m102
10019A9053k0467n519J6640R727j846r602j6644R396j2993J8583k778j7286k904
10006a6640M014J1999J762P750Q926N256M23N096P510k23m3461O609J5212J4481
9992B8714J646K5498J5117j5684K897m3549m622m74J3137R172k2066p977R854
9979A1663J8798r564K735j2043k6288K1077K9888j2931k7019j3021r719p541K1211
9966a2754K3869J3393K8074o900l043J5452J3429J771p458k5254k510J9150q648
9953D8571M742J696l4197j7526j0250Q192P041n734o750N657J2868n174n912J2745
9939A5969J762K9579R586r280l3132J090o011q256r750N819K5656K353N135j5153
$$ plain form
10032 14236 28967 57745 60522 49725 38040 19102 22475 -15563 -5874 22537 14315 23155 19053
10019 19053 -1414 -6933 9707 19434 17588 7986 -8658 738 -12255 6328 3550 -13736 -16640
10006 -16640 -12626 -627 1135 8885 17811 23067 23490 28586 36096 35873 -7588 -979 14233 28714
9992 28714 30360 55858 70975 55291 58188 14639 10017 9543 22680 31852 9786 1809 11663
9979 11663 30461 20897 23632 11589 -14699 6378 36266 23335 -3684 -16705 -26424 -33965 -12754
9966 -12754 11115 24508 52582 45682 42639 58091 71520 73291 65833 40579 38069 57219 48571
9953 48571 53313 55009 20812 3286 -6964 1228 8269 2535 -4215 1442 14310 9136 3224 15969
9939 15969 17731 47310 56896 47616 14484 15574 9563 1307 -8443 -2624 23032 25385 30520 15367
9925A5367j1564k5486j7660O052L5525N990j5271l266L06J8856K1110o751k3617
9912d09j3581k1818J7198N5331L0984J3912j6258L0305j556j4555J3648J7450
9900A10651J433m5816n08l2877j1422O081K725R327L951R137l4600k5487n308
9887a2713R712N7061J4103j0274k9282l7890L043q768K016L1741k028l8088k2908
9874d4275N1172L1976j5845k188J1042O10O631L9072K8587L1224P234O927L6549
9861A88716J3960O335k2631m0870m3543J5768K5142m572j6121O504k0300m1511
9849F6877k0600n61J3699J579l798j5487J2536J6532q856K3090M2382k4689k3266
9836G9438j0259l8920k0300K6988O773r26j6852j3113m55L2964k9881j7156K2629
$$ plain form
9925 15367 3803 -21683 -39343 -33291 2234 8224 -7047 -10313 -10007 8849 29959 23208 -409
9912 -409 -13990 -35808 -18610 36721 67705 81617 65359 95664 94108 79553 93201 110651
9900 110651 112084 66268 65760 32883 21461 27542 30267 39594 43545 52682 18082 -7405 -12713
9887 -12713 -3001 54060 68163 57889 28607 -9283 -6240 -15008 -12992 18749 16721 -21367 -44275
9874 -44275 6897 38873 23028 20840 31882 32492 39123 78195 106782 138006 145240 152167 188716
9861 188716 202676 209011 186380 145510 101967 117735 142877 138305 122184 128688 108388 66877
9849 66877 46277 45716 59415 60994 57196 41709 54245 70777 61921 85011 127393 102704 79438
9836 79438 69179 30259 9959 36947 43720 42794 25942 12829 12374 45338 15457 -1699 20930
9823B0930K6118K2642J8046J4861L0793J578P724K3811k4986J4545J3780j6100
9811A53742l721L992j4050j6247j3348J4992k3968q22n792k5418j2871L741j7446
9798D2784N782j5211j653J7136l454j7989j2699k8071O737J4015k0326r150J2032
9785a0067J5569J0235J6022j991r19k5120o541J183j6278L3659J7911L98o549
9772B7512R920n337J0067K3088J1846J3584K3014K5489q286k1194j5719J6316
9760A10300k6668m9816k1291L042J3385L1002j1309j1719l9266J2387J9230K75
9748B9552P710J2779m924j3870k0015Q232j1774l165J5676J6308j0966j8133k993
9735D417j7378k2624q897J1050K4692J3837N997k0120p822J3369L1515K5009m1950
$$ plain form
9823 20930 47048 69690 87736 102597 133390 134968 142692 166503 141517 156062 169842 153742
9811 153742 150021 154013 139963 123716 110368 125360 101392 100570 94778 69360 56489 60230 42784
9798 42784 48566 33355 31702 48838 45384 27395 14696 -13375 -6638 7377 -12949 -22099 -10067
9785 -10067 5502 15737 31759 29768 28849 3729 -2812 -1629 -17907 15752 33663 34061 27512
9772 27512 37432 32095 42162 65250 77096 90680 113694 139183 130897 109703 93984 110300
9760 110300 83632 33816 12525 15567 28952 59954 48645 36926 -2340 10047 29277 29552
9748 29552 37262 50041 45117 31247 11232 19464 7690 4525 20201 36509 25543 7410 4417
9735 4417 -12961 -35585 -44482 -33432 -8740 5097 11094 -9026 -16848 -3479 28036 53045 11095
9722A1095k6916L7050J4615j355O56q936N709K4939P233m7900l070L3868L1788
9709G8776k5555k9822k6298M523o871l040K5896N879k8255j5276R823J1582o28
9696G34J5242O855j7341m724o050K079n452P294K9337R111k046J6831j8691J529
9682C4708k3724l5602J0848K4346k3988Q9J1215k4224r886M163L458J5745K3850
9669A0998K4908K7147j1191j4654j224M469l4036J4878k31n867J6660J6474J6176
9656F4507k7424l8635N427n86J2705L1033k4239j8245l424r53Q148R538j4907
9643B945j4853M8736O193p639R840M544k4015m3679p845K1092N7921J6469k6270
9630D3439r061j1902L885j3478J9349Q477J8194m3624j9015K450p983K7484J3652
$$ plain form
9722 11095 -15821 21229 35844 34489 35145 26209 31918 56857 64090 16190 13120 46988 78776
9709 78776 53221 23399 -2899 1624 -5247 -8287 17609 23488 -4767 -20043 -10220 1362 734
9696 734 15976 22831 5490 766 -5284 -3205 -8657 -1363 27974 37085 35039 51870 33179 34708
9682 34708 10984 -24618 -13770 10576 -13412 -13323 -2108 -26332 -36218 -32055 -28597 -12852 10998
9669 10998 35906 63053 51862 37208 35984 40453 6417 21295 21064 15197 31857 48331 64507
9656 64507 37083 -1552 3875 3289 15994 47027 22788 4543 1119 166 8314 17852 2945
9643 2945 -11908 36828 43021 35382 45222 49766 25751 -17928 -25773 -4681 53240 69709 43439
9630 43439 34378 22476 26361 12883 32232 40709 58903 15279 -3736 -1286 -9269 18215 31867
9617C1867j276M082j9137J2416N832n542K0576L5905l1089k6221l0742j3862Q806
9604h385K2423K1563j1412j2718k0447j1254Q865K0652J5946q43n032J2751R943
9591D2052J2881N51K500l3830l7254J8471K5299j5749k235j1302j7159J3112O720
9578D057J6934P287L2103r746j6794j485M793p482K526j9669r156K1058N226K963
9564C2615r038k6470j9695J6052R281J4318k881J1558j796k6027O939J0323K6724
9551D1903r588n768l797J4851R54j8583J081M139M548K183p5k6404k942J1324
9537A3826K8375J5386j3612k4048L4633K6778m414k3781m6530J0976L7398J6068
9525G1055k2397l0671o497p647n314L4221K6039m462k292l337r872J6447q381
$$ plain form
9617 31867 30591 34673 15536 27952 33784 28242 48818 84723 53634 27413 -3329 -17191 -8385
9604 -8385 14038 35601 24189 11471 -8976 -20230 -11365 9287 25233 24390 19358 32109 42052
9591 42052 54933 55484 57984 24154 -13100 5371 30670 14921 12686 1384 -15775 -2663 4057
9578 4057 20991 28278 60381 50635 33841 32356 37149 29667 32193 12524 3368 24426 29652 32615
9564 32615 23577 -2893 -22588 -6536 2745 17063 14182 25740 23944 -2083 4856 15179 41903
9551 41903 32315 26547 22750 37601 38555 19972 21053 25192 29740 31923 31848 5444 2502 13826
9537 13826 42201 57587 43975 19927 54560 81338 76924 53143 6613 17589 54987 71055
9525 71055 48658 17987 11490 3843 -1471 32750 58789 54327 52035 48698 38826 55273 46892
9512D6892P80k2244r078m27J4114R39m964L9707k814k1741l1928p578o613P539
9498B584J3567K8005K1268j7690m4926M380k055j1152k7683J6108J1876n94J020
9485e292K2609J6725P615L927n683n414l1333l8632J5109K4190j0344j9873K2828
9472c568K2818J2832l069m5753l0112J3858K7250Q174J1042k1681k603q564J5367
9459d009m715Q339J3134J072r665m580K2376J6087j3842k8867N210L5523L5124
9446G1187k338j8273J1278M294o880j5077P479N593j2871l5806j1721K7374M8998
9433G3237j5899l5087l108q067K2752L886J6711K4497o239j225l2651l6446J731
9420D092K1266K4234J764j7944n215k53J6492K568j4907m998r138l978Q663J8162
$$ plain form
9512 46892 47672 25428 16350 15923 30037 30976 26012 65719 62905 41164 9236 1658 -4955 2584
9498 2584 16151 44156 65424 47734 2808 7188 5133 -6019 -33702 -17594 -5718 -6312 -5292
9485 -5292 17317 34042 41657 45584 39901 34487 3154 -35478 -20369 3821 -6523 -26396 -3568
9472 -3568 19250 32082 29013 -16740 -46852 -32994 -5744 2430 13472 -8209 -10812 -19376 -4009
9459 -4009 -8724 -385 12749 13821 4156 -424 21952 38039 24197 -4670 540 36063 71187
9446 71187 68849 50576 61854 66148 59268 44191 51670 57263 44392 8586 -3135 24239 73237
9433 73237 57338 22251 19143 11076 33828 37714 54425 78922 72683 71458 38807 2361 4092
9420 4092 25358 49592 51356 33412 28197 27944 44436 47004 32097 27099 17961 13983 22646 40808
9406D0808j1652N35j9148J8491J2597j4404N298K2864J1956l472k9780J6318K429
9393E2840o472L487O774m7863j3742L2288Q142O664j2078k219J5755L3656l1798
9380D5434n907L5182k667j3896L746L9631l4953l1503K998j6255J8041K7617j0758
9367E6710m110K1744k8550m359J9088N230j3416L97j4929l9409j1671J6019K1562
9354B4306K7611J5997q988Q677l5266m8430Q72N476K630J7870R159j8093l992
9341b171L722K0976K7145K3912l1436j5353j2862q01J0851m112j3025J8047L9963
9328F4856q30j4702k0583n362j1575J0980j871N33R432M761k5170k5132j232k901
9314a8796L0768K3887M209J3237M8449J6645k8316R725P226l261Q268k0094k1304
$$ plain form
9406 40808 29156 29691 10543 29034 41631 27227 32525 55389 67345 63873 34093 50411 52840
9393 52840 46368 49855 56629 8766 -4976 27312 35454 42118 30040 27821 43576 77232 45434
9380 45434 39527 74709 72042 58146 61892 101523 66570 35067 38065 21810 39851 67468 56710
9367 56710 52600 74344 45794 41435 60523 65753 52337 52734 37805 -1604 -13275 2744 24306
9354 24306 51917 67914 58926 67603 32337 -16093 -15221 -9745 -7115 10755 19914 1821 -2171
9341 -2171 1551 22527 49672 73584 42148 26795 13933 13132 23983 19871 6846 24893 64856
9328 64856 64026 49324 28741 23379 11804 22784 20913 21446 30878 35639 10469 -14663 -15895 -18796
9314 -18796 11972 35859 40068 53305 101754 118399 90083 99808 107034 103773 112041 91947 70643
9301G0643q865K8985J64k6214q538R075j8588r906j2653j8264K8696K0022J1512
9288F6069J5715j2277k8653l2084L3595J6395k0961j2585K2765N05L815J7048
9276F9347k1389p121P570j8489p868L5241n765k0615j5606J7013J2711J0258j902
9263E3385j0867K3232J5487j3490k9777k1515K0824K81Q335L570r381j9037J9460
9250D0507J8406l656N960K6532K2898j3008k4208j7808M123O196j6859Q88j35
9237D9836l507j053N678J6454j2272n944L2013J1826q649O972k9825j6016k761
9224D2752L047M018J166q673j6962K6286J2552J2273l579Q972q395l918k1452
9211D8087p284L519K075K6840M1150q15n251m37j5146j6340j4981N6465R263K679
$$ plain form
9301 70643 61778 90763 90927 64713 56175 65250 46662 36756 24103 5839 34535 54557 66069
9288 66069 81784 69507 40854 8770 42365 58760 37799 25214 47979 48484 52299 69347
9276 69347 47958 40837 48407 29918 22050 57291 51526 30911 15305 32318 45029 55287 53385
9263 53385 42518 65750 81237 67747 37970 16455 37279 37560 45895 49465 40084 21047 40507
9250 40507 58913 55257 61217 87749 110647 97639 73431 55623 59746 65942 49083 49971 49836
9237 49836 46329 45276 50954 67408 55136 49192 81205 93031 84382 91354 61529 45513 42752
9224 42752 45799 49817 50983 42310 25348 51634 64186 76459 72880 81852 73457 69539 48087
9211 48087 40803 44322 46397 73237 114387 113572 108321 107884 92738 76398 61417 117882 127145 129824
9197A29824K926q405k2402j3301k3733j0520m619r178K3409J3422j3784j0320
9185E3319l330k2330J044j166j6940M1946K7988q434m79J1249Q676q690P689q197
9171H2345k6192Q67j1386j7506K2635J0448k673j425J6539L68L627m733n269k503
9157F5142K2226j847L796p27R169j0302J3393k5138j8629J7447j136j2598K7357
9144H8153L1008k6695l8062J8578q144l15O819n691J6921K158J280K5397r545
9131A01862J3773l187j2639P927J8429P709j1529m421K896M638k8725L442L8395
9118A38570L1152K0749n127P137j3690j2098l2481j0184P300J5014O489L22j8212
9105A34941L482K570O981K4078J2698P193J7980q578J7054K1857K4807J1485O297
$$ plain form
9197 129824 132750 124345 101943 88642 64909 54389 49770 40592 64001 77423 63639 53319
9185 53319 49989 27659 28703 27537 10597 52543 80531 72097 71618 82867 91543 82853 90542 82345
9171 82345 56153 57020 45634 28128 50763 61211 58538 57113 73652 74020 77647 72914 67645 65142
9157 65142 87368 85521 89317 88590 97759 87457 100850 75712 57083 74530 73394 60796 88153
9144 88153 119161 92466 54404 72982 64838 64523 71342 65651 82572 84730 86010 111407 101862
9131 101862 115635 112448 99809 107736 126165 133874 122345 117924 120820 125458 96733 100175 138570
9118 138570 169722 190471 185344 192481 178791 166693 134212 124028 131328 146342 152831 153153 134941
9105 134941 138423 140993 147974 172052 184750 191943 209923 201345 218399 240256 265063 276548 282845
9092B82845M8151N1466N5314K2166R5465J57719J62553J96902L25798N48710R18866
9081B865955J448863K517325M598427O672044L826080q10137l436041m932845
9073A2749671m590340k856689j579792r38472o09516m54526l14178k36880j63362
9064A005916j12993j03608j41271p2817n7729m3483l6983j9235l5458l9413k6215
9053C16711pQ152l4649k4626J6758o199l3952j8218j0976l3502P303m337R151
9040A91609l062l078L228q521j3750k2586j4207P139O366J564J406R714r685J1316
9026A57453j7397j5211p832K3605J911m7103k3132Q527n890m538j0406J9925J7166
9013I7078J6958n514l4553j1786N014l2239J1640J4860J2422n886J3377j57N203
$$ plain form
9092 282845 330996 382462 437776 459942 555407 713126 875679 1072581 1398379 1947089 2865955
9081 2865955 4314818 6832143 11430570 18102614 21928694 21118557 17682516 12749671
9073 12749671 8159331 5302642 3722850 2784378 2174862 1720336 1406158 1169278 1005916
9064 1005916 892923 789315 648044 575227 517498 474015 437032 417797 382339 342926 316711
9053 316711 316704 324856 290207 265581 282339 276140 242188 223970 212994 179492 186795 182458 191609
9040 191609 188547 185469 188697 180176 166426 143840 129633 136772 143138 144702 146108 155822 146137 157453
9026 157453 140056 124845 117013 140618 142529 95426 72294 80821 74931 70393 59987 79912 97078
9013 97078 114036 108522 73969 62183 67197 34958 46598 61458 73880 67994 81371 81214 86417
9000H6417R457J871J7035j9205j8014o855J4178J671p041J727K3446J279j0900
8987I5066K515j2674m200L1238N336Q813l2062l2110J288K2221J0494l1932l3862
8974C0131o187K321J3240J2879p229l1072J6018L2422R084O069k0885p789j6619
8961C2383K023K9535J4530r208l1640k5708P003M791J5584q474q478r012J4747
8948B8076K995Q18R634J260J5864p09k3560k1929J0804Q694j6152l1082n417L4839
8934A4135K2206L227k0029J361Q675j7618o581r756J4792o868n849K9841R02j8797
8920I641J9007K5497j7631j6479K432r119L142J2129j0602p178K7104o198q398
8907B3347J1684r110R144J38P207m244j4924j436k7018k1713J2388L3131q715
$$ plain form
9000 86417 95874 97745 114780 95575 77561 70706 84884 86555 79514 81241 104687 105966 95066
8987 95066 97581 84907 80707 111945 117281 126094 94032 61922 63210 85431 95925 63993 30131
8974 30131 23944 26265 39505 52384 45155 14083 30101 62523 71607 77676 56791 49002 32383
8961 32383 34406 63941 78471 69263 37623 11915 18918 23709 39293 30819 22341 13329 28076
8948 28076 31071 31889 41523 42783 58647 57938 34378 12449 23253 31947 15795 -15287 -20704 14135
8934 14135 36341 39568 19539 20900 29575 11957 5376 -4380 10412 3544 -2305 27536 28438 9641
8920 9641 28648 54145 36514 20035 22467 13348 16490 28619 18017 10839 37943 31745 23347
8907 23347 35031 25921 35065 35203 42410 38166 23242 21806 -5212 -26925 -14537 18594 9879
8894I879j0126o221J1957L3395L061m918j8070J2135m0579p176K1036L0160J3485
8881D8018j7862k6373j3641N652j7978L3912J7697k8343k2598k5048Q368K6909
8869a1287J1319k5033J6394O115j4852j232J9591N73p241J2453N917r48k797N3
8855I025j2239J2646J1623J2517r303J3855j1051R53R969J9310Q969k6567o253
8842C3454n836j2782j3004j5732N837J9135J3179K3675j4807j6347m960J1406
8830B3218K595p676J2969n362k4255J5002L1600K6543r943J408j2103N65J0697
8817F5258l6362j7045k3396L0170J4428q535n23M4606J5739j6216l0230j6350
8805B1544J3072k2464k1836R740K0495J2838l929J8278q230j5809m089j925k699
$$ plain form
8894 9879 -247 -6468 5489 38884 41945 37027 18957 31092 -9487 -16663 4373 34533 48018
8881 48018 30156 3783 -9858 -4206 -22184 11728 29425 1082 -21516 -46564 -38196 -11287
8869 -11287 32 -25001 -8607 -2492 -17344 -18576 1015 1588 -5653 6800 12717 11769 8972 9025
8855 9025 -3214 9432 21055 33572 24269 38124 27073 28026 37995 57305 66274 39707 33454
8842 33454 27618 14836 1832 -13900 -8063 11072 24251 47926 33119 16772 11812 23218
8830 23218 25813 18137 31106 25744 1489 16491 48091 74634 64691 66099 53996 54561 65258
8817 65258 28896 11851 -11545 18625 33053 24518 23995 68601 84340 68124 37894 21544
8805 21544 34616 12152 -9684 56 20551 33389 29460 47738 39508 23699 19610 17685 14986
8792A4986K190M319p363K6803j3071j4361k3883K5400M1983L832k6700j0923Q501
8779C1713l898K149K2737j1496k2448k4216r457O637J0769J5248k375r212j3915
8766g764J2280K4548o197m401r787k3673k5879J606K7641K1082J6490j9433M878
8753A1391q865j8803K2684M5183J4453P298k7636l5836k2106J037k3353K9256
8741e297J3088k2341K2790J6635j2088k7107j3294K0389J2542J3467j2311k3239
8729a6766j9962k085K1509K0419j6518K4939l071j3705j1016K3953J9720l3535
8717f118k1905o164M8273K5817j0542j4280n143K9315J7428j4651k2933j0019
8705I078Q152Q458N0j3033L289Q506l0141J0486K3338j7861K118J068l5695j8388
$$ plain form
8792 14986 17176 21495 14132 40935 27864 13503 -10380 15020 57003 60835 34135 23212 31713
8779 31713 27815 29964 52701 41205 18757 -5459 -14916 -8279 2490 17738 15363 6151 -7764
8766 -7764 4516 29064 22867 18466 8679 -14994 -40873 -39267 -11626 9456 25946 6513 11391
8753 11391 2526 -16277 6407 51590 66043 73341 45705 9869 -12237 -11200 -34553 -5297
8741 -5297 7791 -14550 8240 24875 12787 -14320 -27614 -7225 5317 18784 6473 -16766
8729 -16766 -36728 -38813 -17304 3115 -13403 11536 8465 -5240 -16256 7697 27417 -6118
8717 -6118 -28023 -34187 14086 39903 29361 15081 9938 39253 56681 42030 19097 9078
8705 9078 17230 25688 25738 12705 15994 24500 -5641 4845 28183 10322 12440 13508 -22187 -40575
8691d0575K5233k826N683m322j0258K7051K2960j0309K3354K3943j1719j8641
8679B9574J3334M261k4747j7296R56J977O923J4441j1830j005r253R541O262K3924
8665D7062M0114K853k5056k3139L865J9819j7957m413j4587m3895k2022K7449
8653i907K6177o027j3692j2936K5536r799P038P028L9433L1863j8792m214k0863
8640D0845j2032N571K5803m930j2613j5710M485J8099n012k8435o768m502O310
8627A1111J3444K8381k065K528q300p352J2273m534k576J3502J170K797k908L6644
8613I4115r869j8056k6761l941m888J3635k028J0625L3451l220k5859L085L615
8600F3904k6780j2871Q892p927l5098J6776N809k5033k0480j0563L6445J0199
$$ plain form
8691 -40575 -15342 -18168 -12485 -16807 -27065 -14 22946 12637 35991 59934 48215 29574
8679 29574 42908 47169 22422 5126 6082 8059 14982 29423 17593 16588 7335 16876 23138 47062
8665 47062 87176 90029 64973 41834 45699 65518 47561 43148 28561 -15334 -37356 -9907
8653 -9907 16270 10243 -3449 -16385 9151 -648 6390 13418 52851 84714 65922 61708 40845
8640 40845 28813 34384 60187 55257 42644 26934 31419 49518 44506 16071 9303 4801 11111
8627 11111 24555 52936 50871 53399 45099 37747 50020 45486 42910 56412 57582 60379 57471 94115
8613 94115 84246 66190 39429 35488 30600 44235 42207 52832 86283 83063 57204 60289 63904
8600 63904 37124 24253 33145 25218 -9880 6896 12705 -12328 -32808 -43371 -6926 3273
8588C273p95k1893l2052k1724L986J4724J8076J2017K443J594L6854K8751K0465
8575F5719M423J5473j9273j9896J119R037j8445k4409j878j3841J7793J752K9137
8562D6711j1214n1063o879j2102J942q187K3940J66k033j0848m711K4872J0415
8549A009q668j584K9830m770o363k4305J4376J4523J6682K6845q275k4119j3949
8536A1232J282N085k0709J429K172J323J6650l944j3347J9407m1876r289K7944
8523b641L462J2970L2111o916o526k507M4509K3071l2701j4409k1562P081K6805
8510F2747j7847j8765k79K2921K826J046l2277j0749R186K2655J8424K726K1729
8497H4343p658k0791j7962o171j6701k651J1992j4706j8671m026r75K537m459
$$ plain form
8588 3273 2478 -19415 -51467 -73191 -69205 -54481 -36405 -24388 -21945 -20351 16503 45254 65719
8575 65719 70142 85615 66342 46446 47565 56602 38157 13748 11870 -1971 15822 17574 46711
8562 46711 35497 -15566 -22445 -34547 -32605 -40792 -16852 -16686 -18719 -29567 -34278 -9406 1009
8549 1009 -7659 -9243 20587 15817 9454 -14851 -475 14048 30730 57575 49300 25181 11232
8536 11232 12514 17599 -3110 -1681 491 1814 18464 14520 1173 20580 -21296 -30585 -2641
8523 -2641 821 13791 45902 38986 32460 29953 74462 97533 64832 50423 28861 35942 62747
8510 62747 44900 26135 25856 48777 51603 52649 20372 9623 18809 41464 59888 62614 84343
8497 84343 76685 55894 37932 31761 15060 12409 24401 9695 -8976 -13002 -13977 -11440 -15899
8484a5899L3633K2753K2488k7889k7100j8138L7493J5250m167j9873n425L0146
8472D3272r545j4547k0540J3970K1433m882r554J4378J3633M633N726n649j8630
8459C3698l866l4376k3953K2797K1234j4931j4307l332K7133M0807K7252j0102
8447F8054r589l5276p118L0695k761j3527K7725J5230Q122j1489l587P702o065
8434F8116q443P535k1695l0981J6527R402R196N736j2890k085j8019l877J3633
8421C2155M958j8471j4095l5121l854J9698K5360K9421p909j2766K4n523M070
8408A7947p27o648M1942M326L5601J9776O687k0670m4964m2028Q584J4572M236
8395C8634j1404m7771o806Q224l683J5328R980j4811J0329L84j849L5561m44j2221
$$ plain form
8484 -15899 17734 40487 62975 35086 7986 -10152 27341 42591 38424 18551 13126 43272
8472 43272 33727 19180 -1360 12610 34043 29161 19607 33985 47618 52251 57977 52328 33698
8459 33698 29832 -4544 -28497 -5700 15534 603 -13704 -17036 10097 50904 78156 68054
8447 68054 58465 23189 16071 46766 44005 30478 58203 73433 81555 70066 66479 74181 68116
8434 68116 59673 67208 45513 14532 31059 40461 49657 55393 42503 40418 22399 18522 32155
8421 32155 37113 18642 4547 -30574 -34428 -14730 10630 40051 32142 19376 19400 13877 17947
8408 17947 17220 10572 52514 56840 92441 112217 118904 98234 53270 11242 19826 34398 38634
8395 38634 27230 -20541 -27347 -19123 -22806 -7478 2502 -12309 -1980 -1596 -3445 32116 31672 19451
8381A9451L3848k5701k0208K4829j144k7223q290K0400J0519j6142J5789K0931
8369D7059j8931M646j3417O06R801k4627L791J0034j1089r500O495J4509j975
8356A7402j5514K2765p725L470J1992J1184M410j2933o783P409j2905j4787l626
8343D359k6546j808K563M330J5272M3551k3263k7467q415q825j22K1687k0937
8330b5621n555K9060n4q933J2454q046L773j004J5230j663q625Q180n533j6739
8316a3076K3983J1716L281k0856P943j1493j7643q33R379j5012K172N078j4672
8303c0033j069l105j9557m694K5693J1219j1668r235L464J3259K6518o926j0159
8290a6293K2359Q666m221k1984J428O843l866J4772K5178k2183r970m785L2231
$$ plain form
8381 19451 53299 27598 7390 32219 31075 3852 -4438 15962 26481 10339 26128 47059
8369 47059 28128 32774 19357 19963 29764 5137 8928 18962 7873 -1627 4868 19377 17402
8356 17402 1888 24653 16928 20398 32390 43574 47984 35051 28268 35677 22772 7985 4359
8343 4359 -22187 -23995 -21432 -17102 -1830 41721 18458 -9009 -17424 -26249 -26371 -4684 -25621
8330 -25621 -31176 -2116 -2170 -11103 1351 -6695 -2922 -3926 11304 9641 1016 9196 3663 -13076
8316 -13076 10907 22623 25904 5048 12991 1498 -16145 -16978 -7599 -22611 -20439 -15361 -30033
8303 -30033 -31102 -34207 -53764 -58458 -32765 -21546 -33214 -42449 -38985 -25726 792 -6134 -16293
8290 -16293 6066 14732 10511 -11473 -10045 -3202 -7068 7704 32882 10699 729 -4056 28175
8277B8175J1542n738l4681k850J1983O76m296k9740L4318K0058l2726k1104j5083
8264c9466K377K7271J547k7412N708l158j2259N236K3491K8517k7800l3440K1108
8251b8280J6820K6662J1083j7471N589M489J3825R907k563j5194j245J424M927
8238B9973J2956k8812k3435j7741j883r22K0540L871J2775L25n418J0520j0483
8225B266j1689o169j9122j6101J7823J5435Q610L544j2098K3136j3683j2046j9071
8212c9165n295k462K321L8272K3727p519M10L830O99p791N643J398j3246j7242
8198a6420k848K3411J6533J8197j5749M276Q197l0422m394N700J7093l2280L731
8185d975K3760m234k4055q443L698M3042K639Q910K598q314j7151j8500p576J3525
$$ plain form
8277 28175 39717 33979 -702 -3552 8431 9107 4811 -24929 9389 29447 -3279 -24383 -39466
8264 -39466 -37089 -9818 -8271 -35683 -29975 -33133 -45392 -40156 -16665 11852 -15948 -49388 -28280
8251 -28280 -11460 15202 26285 8814 14403 18892 32717 42624 40061 24867 23622 25046 29973
8238 29973 42929 14117 -9318 -27059 -28942 -29864 -9324 -5453 7322 7647 2229 12749 2266
8225 2266 -9423 -15592 -34714 -50815 -32992 -17557 -8947 -5403 -17501 5635 -8048 -20094 -39165
8212 -39165 -44460 -46922 -44601 -6329 17398 9879 10289 14119 14818 7027 12670 14068 822 -16420
8198 -16420 -19268 4143 20676 38873 23124 27400 35597 5175 781 6481 23574 -8706 -4975
8185 -4975 18785 14551 -9504 -17947 -14249 28793 31432 40342 42940 34626 17475 -1025 -8601 4924
8171D924k2247j6439K0858n033q300l813M887P912L5698j2819k5487K449J5497
8158a913N690L924M699L879K7389j3940j3166P42j53J660j0953J389J331n923
8144D655P548k4051J7464J1969j9182K859K9880K6492k6611m3210l4178K0299
8132b6066J5137j115M149J4515n513J7919K082k7892j6403K6907j8550j6180r645
8119d0655j588J1775J6478q067o681O762r494k8263k1896J357p063J9129Q502
8106e9704J6366K0752n550J1186O964J993p497k9305J318M2958Q495k0668j5704
8093b8396K535N032J1901q168J6148P348j1359O649p73K1916K76j4362j0986r358
8079a1597K021p043K3296K6535K0133J2499J993P599L8741M4606M3082m09j0234
$$ plain form
8171 4924 -17323 -33762 -12904 -17937 -26237 -30050 -25163 -17251 18447 5628 -19859 -17410 -1913
8158 -1913 3777 7701 12400 16279 43668 29728 16562 17304 17151 18811 7858 9247 10578 4655
8144 4655 12203 -11848 5616 17585 -1597 1262 31142 57634 31023 -12187 -46365 -26066
8132 -26066 -10929 -12044 -7895 6620 1107 19026 21108 -6784 -23187 3720 -14830 -31010 -40655
8119 -40655 -42243 -30468 -13990 -22057 -28738 -21976 -31470 -59733 -81629 -80272 -87335 -68206 -59704
8106 -59704 -43338 -22586 -28136 -16950 -9986 -7993 -15490 -44795 -43477 -519 7976 -12692 -28396
8093 -28396 -25861 -20829 -8928 -17096 -948 6400 -4959 1690 917 22833 23109 8747 -2239 -11597
8079 -11597 -9576 -16619 6677 33212 53345 65844 67837 75436 114177 158783 201865 201456 191222
8066A91222k6791k4908m8014R032o86j0342m1864k9404j973q045l1512K1390n962
8053g857J354J3967j5416J1457K1440L376j7686j2654j630M602M757J3314J8708
8040C7732n378k861Q065p249q442l9835Q379M4164M343K2543L6770R7407R8292
8027B93930J39144J45804J19597P2020o2055j67117j40062j22615q6263o6345
8017A26038n5297l9166o012m428K857k6144J1754P376j5888J1857J5809O528n004
8004C0280J3968K0166j1117k4859j9044p606N438J2902q682j9521N951J562O899
7991F337J4117M632j4322l2596J1953L7245q03k0786r167o79k2175R058M593k0301
7977c2894k8727J7544R02O745J4510K565n529k1986R926K5250Q174K1757O551
$$ plain form
8066 191222 164431 139523 91509 100541 99855 89513 47649 18245 16272 8227 -23285 -1895 -7857
8053 -7857 -6503 7464 -7952 3505 24945 28321 10635 -2019 -3649 953 5710 19024 37732
8040 37732 32354 29493 37558 30309 21867 -17968 -9589 34575 38918 61461 98231 195638 293930
8027 293930 433074 578878 698475 770495 708440 541323 401261 278646 192383 126038
8017 126038 70741 31575 25563 21135 23992 -2152 9602 16978 1090 12947 28756 35284 30280
8004 30280 44248 64414 53297 28438 9394 1788 7226 20128 11446 -8075 -2124 -562 6337
7991 6337 20454 25086 10764 -21832 -9879 27366 26563 5777 -3390 -4069 -26244 -17186 -12593 -32894
7977 -32894 -61621 -44077 -43175 -36430 -21920 -19355 -24884 -46870 -36944 -11694 -3520 18237 24788
7964B4788l231J4247r358k176k2401q183j0066J7908K4J2038M834M526k1328j0196
7950h574J8031K495j0353p136J5545L493j6669M057Q079p013m295L13p507N932
7936c602l955m796L549j1692j3827R832J7771p037L470L1998n805Q599M746N004
7922C4255q383k3796j5443J4303j9060l4271K2151L0223J3904n318J206K3786
7910C3557k8266l1263j42K1396R461O3j3254j1277K940l419P058J1621M114J3176
7896A5765J3993j7536o351K3345k6482l550j4944j5695o119O081j0721J4191k599
7883c0622m997j1677J4496j0231J7091q298J3995R864k1989j641j7004J8537J8838
7870a3638q152L294O578k5254n156K3135J6521l72R382K5279O765l305p799r358
$$ plain form
7964 24788 21557 35804 26446 24270 1869 -6314 -16380 1528 1552 13590 18424 22950 1622 -8574
7950 -8574 9457 11952 1599 -5537 10008 13501 -3168 889 8968 1955 -2340 -2027 -9534 -3602
7936 -3602 -7557 -12353 -8804 -20496 -34323 -24491 -6720 -13757 -10287 21711 15906 24505 29251 34255
7922 34255 25872 2076 -13367 936 -18124 -52395 -30244 -21 13883 8565 9771 33557
7910 33557 5291 -25972 -26114 -4718 4743 4806 -8448 -19725 -16785 -20204 -13146 -1525 2589 15765
7896 15765 29758 12222 5871 29216 2734 -816 -15760 -31455 -37574 -31493 -42214 -28023 -30622
7883 -30622 -35619 -47296 -32800 -43031 -25940 -34238 -20243 -10379 -32368 -34009 -51013 -32476 -13638
7870 -13638 -21790 -18496 -11918 -37172 -42328 -19193 -2672 -3044 6338 31617 38382 35077 27278 17920
7856A7920o636J4421l419j4338m044j791L213p097r470J1402r071M3p095J1947
7842d015J225q765j622J244j1243j7470L843K8714j5310K705K2325N558j3165
7829e976l554K6242j8243k7383J4515L5228R579k2775j1953q118L704J5275L3
7816F574j3242J0061o540j809R275k7290j6653j958K6850J3102k5372j233j1701
7803c9936j2517j2697O644k571M044J2442J4093N881Q742o811m452q645J9073
7790a6710l323l8140j0136K6638K768L0900L169k3025L5238K6529j1820o492l7294
7777b1698j8365j8527K2552J3773j2312K549k7151R248K8321K0309j8306M254
7765a5353M60J4535J683R607n410r924j2116m800J4033j4196j417K3377p980k3304
$$ plain form
7856 17920 11284 25705 22286 7948 3904 2113 5326 -1771 -11241 161 -8910 -8867 -15962 -4015
7842 -4015 -2790 -11555 -13177 -11933 -23176 -40646 -36803 -8089 -23399 -20694 1631 7189 -5976
7829 -5976 -9530 16712 -1531 -28914 -14399 20829 30408 7633 -4320 -12438 -8734 6541 6574
7816 6574 -6668 3393 -3147 -4956 4319 -22971 -39624 -41582 -14732 -1630 -27002 -28235 -39936
7803 -39936 -52453 -65150 -58506 -61077 -57033 -44591 -30498 -24617 -15875 -22686 -27138 -35783 -16710
7790 -16710 -20033 -58173 -68309 -41671 -38903 -8003 -4834 -27859 7379 33908 22088 15596 -21698
7777 -21698 -40063 -58590 -36038 -22265 -34577 -32028 -59179 -49931 -21610 -1301 -19607 -15353
7765 -15353 -14893 -358 1325 10932 5522 -4402 -16518 -21318 -7285 -21481 -22898 479 -7501 -30805
7751c0805k0886K0834N807J3552L0334L4021r740j9682J1835k160K191r259k2752
7738C290j1004j548k3829K9654N32p186j2213j8414N498J4090k8000j7150K1543
7725d4737K5087J5345j3089r464J1776r214l4947O056L5063J4581j8359J4985
7713f917J9915l4814p441r408O543M1243N029k8123j1077M511K1174J1173j6986
7700e178k5110J2146K2598J1950O315j7250o891M10m687J3767k7040n3846k247
7687g5063M7535o08n117Q387j253l084j4732m848l0137n665J7302j245J4529J2419
7673d1580K9209j723p929K7740J829L436J8153J1760J2089j5651k6393j7370J4456
7660H026N801K924K5691l175l4478j8510Q357P164l4886j5662K2624K5498O284
$$ plain form
7751 -30805 -51691 -30857 -25050 -11498 18836 52857 43117 23435 35270 33110 35301 26042 3290
7738 3290 -7714 -9262 -33091 -3437 -2905 -10091 -22304 -40718 -35220 -21130 -49130 -66280 -44737
7725 -44737 -19650 -4305 -17394 -26858 -15082 -24296 -59243 -53187 -18124 -3543 -21902 -6917
7713 -6917 12998 -21816 -29257 -38665 -32122 9121 14150 -13973 -25050 -20539 635 11808 -5178
7700 -5178 -30288 -18142 4456 16406 22721 5471 -1420 -1010 -5697 8070 -18970 -72816 -75063
7687 -75063 -27528 -28136 -33253 -24866 -26119 -29203 -43935 -48783 -78920 -84585 -67283 -68528 -53999 -41580
7673 -41580 -12371 -14094 -22023 5717 7546 10982 29135 40895 52984 37333 10940 -6430 8026
7660 8026 13827 16751 42442 39267 4789 -13721 -5364 1800 -33086 -48748 -26124 -626 5658
7647E658k7326j8567J50R822l0838n661K9606J7242J2510n618k217k0503m552
7634d0294J8054j3019J997J8151L0904P723l4056l8815n336J4414n829J1682L8799
7621D375Q02r852k7290J361J4566K8539J0308n167l5151o791K5487n741j930N932
7607e52L2739j321p015L973Q899j001j23J1438K5162k3144l417j349j2908k604
7593B8777R145o85m011J0124n399j2385j6327r342M721L2750L1576J3208r234
7580G2918k852k3573l425o349j9435l0836j7584J1380J0752j1998J482L093m482
7567b0909J6990M586j4203l0779J6379J1451p529q906J3707o409J4583o651l28
7554a8018j3851L0408L3670k1071j8277j795q712L7347K1502K171J7797o271j2834
$$ plain form
7647 5658 -21668 -40235 -40085 -30263 -61101 -66762 -37156 -19914 -7404 -13022 -15239 -35742 -40294
7634 -40294 -22240 -35259 -33262 -15111 15793 23516 -10540 -49355 -54691 -40277 -46106 -34424 4375
7621 4375 5177 -4675 -31965 -30604 -16038 12501 22809 17642 -17509 -24300 1187 -4554 -6484 -552
7607 -552 32187 30866 23851 27824 36723 35722 35599 47037 72199 49055 45638 44289 31381 28777
7593 28777 37922 37237 33226 43350 37951 25566 9239 -103 4618 37368 68944 82152 72918
7580 72918 70066 46493 43068 36719 17284 -13552 -31136 -19756 -9004 -21002 -19520 -16427 -20909
7567 -20909 -3919 667 -13536 -44315 -27936 -16485 -24014 -32920 -19213 -25622 -11039 -17690 -18018
7554 -18018 -31869 -1461 32209 11138 -7139 -8934 -17646 19701 41203 43374 61171 54900 42066
7541D2066k6110j1156J6691k3952k5146n58L44m997j0363j2199l9654J6937N5598
7528b2499L3293L6198N113P315l4630j9096N308M179j5384K3527J5923q740k58
7515C0249l5117J2264m859j3017J0389j7385j3600Q54J9548L3612J5728j4893
7503B3773m898k0769p533L1889L1815m0022k3580P545J3938k059K1241J3766k4074
7490B1032k8564Q841n927r636J8964L3048O520O959J9059j6374m0729k0881k5185
7477c2873M21K942O367l3090j3331K1326R048L4173J8480J1946J4932q590r56
7464C0795l488p589r346n973O953q68J8694l149j5408n163k2044K0369j4634L187
7450g664J2068l406j5105l741M241L4037j2101J0202j4373j1601K185J163j9163
$$ plain form
7541 42066 15956 4800 21491 -2461 -27607 -28165 -27821 -32818 -43181 -55380 -95034 -78097 -22499
7528 -22499 10794 46992 52105 59420 24790 5694 11002 15181 -203 23324 39247 30507 30249
7515 30249 -4868 7396 2537 -10480 -91 -17476 -31076 -30222 -10674 22938 38666 23773
7503 23773 18875 -1894 -9427 22462 54277 14255 -9325 -1780 12158 10099 31340 45106 21032
7490 21032 -7532 1309 -4618 -14254 4710 37758 44278 51237 70296 53922 13193 -7688 -32873
7477 -32873 -32452 -29510 -23143 -56233 -69564 -48238 -39190 -5017 13463 25409 40341 31751 30795
7464 30795 27307 19718 10372 4399 11352 10484 29178 26029 10621 5458 -16586 3783 -10851 -7664
7450 -7664 4404 998 -14107 -17848 -13607 20430 8329 18531 4158 -7443 -5258 -4095 -23258
7437b3258K037J4685n929O39q958m860o206m163J0673R675m249j4416o18M7948
7423A3000j2876m2000J70J0808j9215O628J9406K2317m094k1846j523Q603K8111
7410G489N604k9786k4464N496K2399r142l060K7754k449j3735K342k8439l535
7397d3526Q563n668J2463Q417l466j3523J5668n821J6664J4221j6433p291l097
7384b2829N085K356P286Q713K8213n393k5437L038J1587Q434r226k977j8028j1091
7370b0269k153J9534O229J583J3761J2105m6491j6389K6657L9049K1986l1294
7358B4308n5138k5476O725L7917K9993J4673J4527k2032q02K508p909l7915j3603
7345c2224J6457J85P552R654K2378j115Q989j2956J7143N49k6639M152j5922k8235
$$ plain form
7437 -23258 -21221 -6536 -12465 -11826 -20784 -25644 -31850 -36013 -25340 -15665 -19914 -34330 -34948 13000
7423 13000 124 -41876 -41706 -30898 -50113 -43485 -24079 -1762 -5856 -27702 -29225 -20622 7489
7410 7489 13093 -16693 -41157 -35661 -13262 -22404 -25464 2290 -159 -13894 -11552 -39991 -43526
7397 -43526 -34963 -40631 -28168 -19751 -23217 -36740 -21072 -26893 -10229 3992 -12441 -19732 -22829
7384 -22829 -17744 -15388 -8102 611 28824 23431 -2006 1032 12619 21053 11827 8850 -9178 -20269
7370 -20269 -22422 -2888 3341 4924 18685 30790 -15701 -32090 -5433 33616 55602 24308
7358 24308 -30830 -56306 -49581 -11664 18329 33002 47529 25497 24695 27203 19294 -18621 -32224
7345 -32224 -15767 -15582 -8030 1624 24002 22887 31876 18920 36063 36612 9973 14125 -1797 -30032
7331c0032J7972L2934n797K034J590l728N57j3199j1507J1674P922j0365L377
7318C432r134M455K526j9366J9359J8323l2483k0054J1474M605R737K9786l1957
7305i297k4561O664j6007Q378J5599L783j9833R75p26M4380J5122P724r787k8433
7291f019p810j4173j8968n170J9702O491K9559J0279n551o17j0100k0155J5263
7278g269P910p845j4598J8203K3889j2243q283P061m041P0K8807l584j5765J0408
7264B2720K2579o866k9589J172j7420l552q054p392L251J4821l612l024m088j206
7250b0260K7574J8379O151r068l4428k5773K434K3263K581j3930J7106j5140j1130
7237c2241J4568l101k7594L1481O670N486l916q140j3666m867J7892J0999p757
$$ plain form
7331 -30032 -12060 20874 15077 17111 18701 14973 15530 2331 -9176 2498 10420 55 3432
7318 3432 -5702 -1247 1279 -18087 1272 19595 -12888 -32942 -21468 -16863 -7126 22660 -9297
7305 -9297 -33858 -27194 -43201 -34823 -19224 -15441 -35274 -34299 -35025 9355 24477 32201 22414 -6019
7291 -6019 -13829 -28002 -46970 -52140 -32438 -25947 3612 13891 8340 7723 -2377 -22532 -7269
7278 -7269 641 -7204 -21802 -3599 20290 8047 -236 6825 2784 2854 31661 28077 12312 22720
7264 22720 45299 38433 8844 10016 -7404 -10956 -19010 -26402 -23151 -8330 -11942 -14966 -19054 -20260
7250 -20260 7314 25693 31844 22776 -11652 -37425 -34991 -11728 -9147 -23077 -5971 -21111 -32241
7237 -32241 -17673 -20774 -48368 -16887 -10217 -4731 -8647 -16787 -30453 -35320 -17428 -6429 -14186
7224a4186J4851j2458j2937J299k8713P311L1892k087p792Q812K6276J5886k275
7211B5879j3162m080j8076j3875m750K3480p783j6071o030J8878J5656m316J3860
7198I610J184K7093j454m931o377p409j4652L056n807m661k1339J93J035j2652
7184c7111j6585L8011J5802M738l4565j8985L582J1781K7201k4292n048J2770
7172b2701K0349K350k9851K6446J829j2230K966P919K1960m720K345j6005k9814
7159b9157j3972O435O091J990j0401J4074R807L2453o285j5664K2716k92l0260
7146a2465j3212J7805J226k7486j8244L6359N25k2361l0695R387j071K1110K9013
7133a0109R797m201k8914l297L0461K0210l579K47J2416k431J6658N55k5670l01
$$ plain form
7224 -14186 665 -11793 -24730 -23431 -52144 -44833 -12941 -15028 -22820 -14008 12268 28154 25879
7211 25879 12717 8637 -9439 -23314 -28064 -4584 -12367 -28438 -34468 -15590 66 -4250 9610
7198 9610 10794 37887 36433 31502 25125 17716 3064 6120 313 -4348 -25687 -25494 -24459 -37111
7184 -37111 -53696 -15685 117 4855 -29710 -48695 -45113 -33332 -6131 -30423 -35471 -22701
7172 -22701 -2352 -2 -29853 -3407 -1578 -13808 -10842 -2923 19037 14317 16662 657 -29157
7159 -29157 -43129 -36694 -30603 -28613 -39014 -24940 -15133 17320 11035 -4629 18087 17795 -12465
7146 -12465 -25677 -7872 -6646 -34132 -52376 -16017 -15492 -37853 -68548 -59161 -60232 -39122 -10109
7133 -10109 -312 -4513 -33427 -36724 -6263 13947 10368 10615 23031 20600 37258 37813 12143 11842
7119A1842m923O764J547K5336j0863n1121J764K0444j1433k4793K2627K2885l8708
7106b8632l8923M030K2170K5835l086j41j8079Q375J0883j1651j6552J2467n876
7093c9180J8820K4696J6648j2710q277R662R108J038k135j7392L6026L946j0874
7080B9376O40k2739j9210o449N867K0130P059m567m2477K39L8404J4502k8745
7067g970l33k4605o897K0711M044M643k1330J8741j4739k671J6274J5741J1869
7054A3478k6152k101O448j4124J158K5045J0493l796j0331j5254J1356R155J0754
$$ plain form
7119 11842 6919 13683 15230 40566 29703 -21418 -19654 790 -10643 -35436 -12809 10076 -28632
7106 -28632 -67555 -63525 -41355 -15520 -18606 -18747 -36826 -28451 -17568 -29219 -45771 -33304 -39180
7093 -39180 -20360 4336 20984 8274 -3 9659 18767 19805 17670 278 36304 40250 29376
7080 29376 30016 7277 -11933 -18382 -12515 7615 14674 10107 -32370 -32131 6273 20775 -7970
7067 -7970 -8303 -32908 -39805 -19094 -15050 -10407 -31737 -12996 -27735 -30406 -14132 1609 13478
7054 13478 -12674 -14775 -8327 -22451 -21293 3752 14245 10449 118 -15136 -3780 5375 16129
$$ [...]
##END NTUPLES=NMR SPECTRUM
##END=
