##TITLE=Analysis number 329225
Compound Code cc 67109
Book Reference 513/117/19
Project Code adrs
Chemist Name ronp
##JCAMPDX= 6.0         $$ Bruker NMR JCAMP-DX V2.0
##DATA TYPE= NMR SPECTRUM
##DATA CLASS= NTUPLES
##ORIGIN= Bruker BioSpin GmbH
##OWNER= nmr
$$ XWIN-NMR		Version 3.5
$$ Mon Aug 13 11:50:14 2007 GMT Daylight Time (UT+1h)  MAYBRIDGE\nmr@NMR_250MHZ
##.OBSERVE FREQUENCY= 250.131544655141
##.OBSERVE NUCLEUS= ^1H
##.ACQUISITION MODE= SIMULTANEOUS (DQD)
##.ACQUISITION SCHEME= undefined
##.AVERAGES= 16
##.DIGITISER RES= 18
##SPECTROMETER/DATA SYSTEM= dpx250
##.PULSE SEQUENCE= zg30
##.SOLVENT NAME= CDCl3
##.SHIFT REFERENCE= (INTERNAL, CDCl3, 0, 16.522)
##AUDIT TRAIL= $$ (NUMBER, WHEN, WHO, WHERE, WHAT)
$$ ##TITLE= Audit trail, XWIN-NMR		Version 3.5
$$ ##JCAMPDX= 5.01
$$ ##ORIGIN= Bruker BioSpin GmbH
$$ ##OWNER= nmr
$$ C:\u/data/dgb/nmr/ADRS/520/pdata/1/auditp.txt
$$ ##AUDIT TRAIL=  $$ (NUMBER, WHEN, WHO, WHERE, WHAT)
(   1,<2007-08-13 11:49:48.31 +100>,<MAYBRIDGE\nmr>,<NMR_250MHZ>,
      <created by zg, POWCHK disabled, PULCHK disabled
       configuration hash MD5:
       76 6E 9A 78 1E 09 19 81 EC 84 63 8F B0 6A 59 2D
       data hash MD5: 64K
       6F 73 B1 E1 0E AD 31 72 4A 78 93 44 F7 9A D2 2F>)
(   2,<2007-08-13 11:50:04.75 +100>,<MAYBRIDGE\nmr>,<NMR_250MHZ>,
      <Start of raw data processing
       ef LB = 0.3 FT_mod = 6 PKNL = 1 SI = 32K 
       data hash MD5: 32K
       E8 D9 FC 06 61 C9 04 B9 2D 17 84 79 5B 4C E7 EA>)
(   3,<2007-08-13 11:50:06.39 +100>,<MAYBRIDGE\nmr>,<NMR_250MHZ>,
      <apk 
       data hash MD5: 32K
       75 EA E5 4B 6B 5B 25 64 F5 97 93 A3 BF 14 71 9A>)
(   4,<2007-08-13 11:50:07.12 +100>,<MAYBRIDGE\nmr>,<NMR_250MHZ>,
      <abs ABSG = 5 
       data hash MD5: 32K
       BC 31 C2 5A 6E 9C 18 2F 0F 95 BF 41 1C 2A 3C 3F>)
$$ ##END=
$$ 
$$ hash MD5
$$ DE B0 5C F1 56 FD 01 E8 92 74 0A 68 66 26 27 13
##$RELAX= 
##$RELAX= 
##$RELAX= 
##$RELAX= 
##$RELAX= 
##$RELAX= 
##$RELAX= 
$$ Bruker specific parameters
$$ --------------------------
##$DU= <C:\u>
##$EXPNO= 520
##$NAME= <ADRS>
##$PROCNO= 1
##$TYPE= <nmr>
##$USER= <dgb>
##$AMP= (0..31)
100 100 100 100 100 100 100 100 100 100 100 100 100 100 100 100 100 100 
100 100 100 100 100 100 100 100 100 100 100 100 100 100 
##$AQSEQ= 0
##$AQ_mod= 3
##$AUNM= <au_zg>
##$AUTOPOS= <18 >
##$BF1= 250.13
##$BF2= 250.13
##$BF3= 250.13
##$BF4= 250.13
##$BF5= 500.13
##$BF6= 500.13
##$BF7= 500.13
##$BF8= 500.13
##$BYTORDA= 1
##$CFDGTYP= 0
##$CFRGTYP= 5
##$CHEMSTR= <none>
##$CNST= (0..31)
1 1 145 1 1 1 1 1 1 1 1 1 1 1 1 1 1 1 1 1 1 1 1 1 1 1 1 1 1 1 1 1 
##$CPDPRG= <>
##$CPDPRG1= <>
##$CPDPRG2= <>
##$CPDPRG3= <>
##$CPDPRG4= <mlev>
##$CPDPRG5= <mlev>
##$CPDPRG6= <mlev>
##$CPDPRG7= <mlev>
##$CPDPRG8= <mlev>
##$CPDPRGB= <>
##$CPDPRGT= <>
##$D= (0..31)
0 1 0 0 0 0 0 0 0 0.06 0 0 0 0 0 0 0.0002 0 0 0 0 0 0 0 0 0 0 0 0 0 0 
0 
##$DATE= 1187002187
##$DBL= (0..7)
120 120 120 120 120 120 120 120 
##$DBP= (0..7)
150 150 150 150 150 150 150 150 
##$DBP07= 0
##$DBPNAM0= <>
##$DBPNAM1= <>
$$ [...]
##$SUBNAM6= <"">
##$SUBNAM7= <"">
##$SUBNAM8= <"">
##$SUBNAM9= <"">
##$SW= 20.6930455092707
##$SWIBOX= (0..15)
0 0 3 0 0 0 0 0 0 0 0 0 0 0 0 0 
##$SW_h= 5175.983436853
##$TD= 65536
##$TD0= 1
##$TE= 296.16
##$TE2= 300
##$TE3= 300
##$TEG= 300
##$TL= (0..7)
0 120 120 120 120 120 120 120 
##$TP= (0..7)
150 150 150 150 150 150 150 150 
##$TP07= 0
##$TPNAME0= <>
##$TPNAME1= <>
##$TPNAME2= <>
##$TPNAME3= <>
##$TPNAME4= <>
##$TPNAME5= <>
##$TPNAME6= <>
##$TPNAME7= <>
##$TPOAL= (0..7)
0.5 0.5 0.5 0.5 0.5 0.5 0.5 0.5 
##$TPOFFS= (0..7)
0 0 0 0 0 0 0 0 
##$TUNHIN= 0
##$TUNHOUT= 0
##$TUNXOUT= 0
##$USERA1= <user>
##$USERA2= <user>
##$USERA3= <user>
##$USERA4= <user>
##$USERA5= <user>
##$V9= 5
##$VALIST= <valist>
##$VCLIST= <CCCCCCCCCCCCCCC>
##$VD= 0
##$VDLIST= <DDDDDDDDDDDDDDD>
##$VPLIST= <PPPPPPPPPPPPPPP>
##$VTLIST= <TTTTTTTTTTTTTTT>
##$WBST= 1024
##$WBSW= 4
##$XGAIN= (0..3)
0 0 0 0 
##$XL= 0
##$YL= 0
##$YMAX_a= 535248
##$YMIN_a= -370267
##$ZGOPTNS= <>
##$ZL1= 120
##$ZL2= 120
##$ZL3= 120
##$ZL4= 120
##$ABSF1= 16.522
##$ABSF2= -4.171173
##$ABSG= 5
##$ABSL= 3
##$ALPHA= 0
##$AQORDER= 0
##$ASSFAC= 0
##$ASSFACI= 0
##$ASSFACX= 0
##$ASSWID= 0
##$AUNMP= <proc_1d>
##$AZFE= 0.1
##$AZFW= 0.1
##$BCFW= 0
##$BC_mod= 0
##$BYTORDP= 0
##$COROFFS= 0
##$CY= 12.5
##$DATMOD= 1
##$DC= 0
##$DFILT= <>
##$DTYPP= 0
##$F1P= 14.0000005364418
##$F2P= -0.99999901652339
##$FCOR= 0.5
##$FTSIZE= 32768
##$FT_mod= 6
##$GAMMA= 0
##$GB= 0
##$INTBC= 1
##$INTSCL= 1
##$ISEN= 128
##$LB= 0.3
##$LEV0= 0
##$LPBIN= 0
##$MAXI= 10000
##$MC2= 0
##$MEAN= 0
##$ME_mod= 0
##$MI= 0
##$NCOEF= 0
##$NC_proc= -4
##$NLEV= 6
##$NOISF1= 0
##$NOISF2= 0
##$NSP= 0
##$NTH_PI= 0
##$NZP= 0
##$OFFSET= 16.522
##$PC= 1
##$PHC0= -42.46697
##$PHC1= 0
##$PH_mod= 1
##$PKNL= yes
##$PPARMOD= 0
##$PSCAL= 4
##$PSIGN= 0
##$REVERSE= no
##$SF= 250.13
##$SI= 32768
##$SIGF1= 0
##$SIGF2= 0
##$SINO= 400
##$SIOLD= 32768
##$SREGLST= <1H.CDCl3>
##$SSB= 0
##$STSI= 32768
##$STSR= 0
##$SW_p= 5175.98343685301
##$SYMM= 0
##$S_DEV= 0
##$TDeff= 65536
##$TDoff= 0
##$TI= <Analysis number 999999
Compound Code 99
Book Reference 9
Project Code 9>
##$TILT= no
##$TM1= 0
##$TM2= 0
##$TOPLEV= 0
##$USERP1= <user>
##$USERP2= <user>
##$USERP3= <user>
##$USERP4= <user>
##$USERP5= <user>
##$WDW= 1
##$XDIM= 32768
##$YMAX_p= 271538261
##$YMIN_p= -224265
$$ End of Bruker specific parameters
$$ ---------------------------------
##NTUPLES= NMR SPECTRUM
##VAR_NAME=  FREQUENCY,     SPECTRUM/REAL,   SPECTRUM/IMAG
##SYMBOL=    X,             R,               I
##VAR_TYPE=  INDEPENDENT,   DEPENDENT,       DEPENDENT
##VAR_FORM=  AFFN,          ASDF,            ASDF
##VAR_DIM=   32768,         32768,           32768
##UNITS=     HZ,            ARBITRARY UNITS, ARBITRARY UNITS
##FACTOR=    0.157963299565203, 1,           1
##FIRST=     4132.6476996994, 0,             0
##LAST=      -1043.33573715361, 0,           0
##MIN=       -1043.33573715361, -224265,     0
##MAX=       4132.6476996994, 271538261,     0
$$ Real data points
##PAGE= N=1
##DATA TABLE= (X++(R..R)), XYDATA
$$ [...]
$$ plain form
19638 402008 421293 407990 569604 694502 734188 706353 651182 672904 678490 700822 740585
19627 740585 770718 790490 862721 1011555 1109203 1141997 1115969 1115164 980803 887734 823707
19616 823707 778899 697632 604017 572962 514493 541705 556549 595945 590658 494912 414043 433522
19604 433522 441134 401825 267107 170495 92514 27885 1885 12376 70762 139751 105911
19593 105911 42440 41573 105980 156090 159469 121713 132173 133706 103261 82009 54666 62977
19581 62977 54295 88854 97217 63759 31308 15297 11547 19348 10465 30865 49131 89138 79547
19568 79547 18758 -29568 -47576 -52488 2366 68154 29767 -1044 -20182 -52620 -48355 -14261
19556 -14261 13818 23384 63341 83793 107152 137190 108083 75015 72602 76590 124877 147407
$$ packed form
19638D02008J9285j3303J61614J24898L9686k7835n5171K1722N586K2332L9763
19627G40585L0133J9772P2231J48834R7648L2794k6028q05j34361r3069o4027
19616H23707m4808q1267r3615l1055n8469K7212J4844L9396n287r5746q0869J9479
19604D33522P612l9309j34718r6612p7981o4629k6000J0491N8386O8989l3840
19593A05911o3471q67O4407N0110L379l7756J0460J533l0445k1252k7343Q311
19581F2977q682L4559Q363l3458l2451j6011l750P801q883K0400J8266M0007r591
19568G9547o0789m8326j8008m912N4854O5788l8387l0811j9138l2438M265L4094
19556a4261K8079R566L9957K0452K3359L0038k9107l3068k413L988M8287K2530
$$ plain form
19544 147407 139488 149840 111474 107656 130747 160647 161621 199646 303000 395825 516656 656586
19532 656586 797174 977720 1151284 1196482 1164240 1145733 1056575 874751 665685 567492
19522 567492 517794 582700 713680 816211 903098 1015849 1155857 1238931 1252697 1165856 1033819
19511 1033819 852987 664998 494522 331481 237715 196587 129512 103879 145415 131931
19501 131931 88359 108586 141164 136184 95729 50150 15071 -39284 -18280 7889 17247 10061
19489 10061 -21610 -7158 -24867 -17535 71380 78711 69573 82189 75993 72509 63717 39997 41815
19476 41815 75524 39976 80266 139654 100989 51205 75192 110021 62128 76807 57508 18068
19464 18068 40953 70530 40850 32016 59749 81196 64959 48176 32182 -25676 17901 63698
$$ packed form
19544A47407p919J0352l8366l818K3091K9900R74L8025J03354R2825J20831J39930
19532F56586J40588J80546J73564M5198l2242j8507q9158j81824k09066r8193
19522E67492m9698O4906J30980J02531Q6887J12751J40008Q3074J3766q6841j32037
19511A033819j80832j87989j70476j63041r3766m1128o7075k5633M1536j3484
19501A31931m3572K0227L2578m980m0455m5579l5079n4355K1004K6169R358p186
19489A0061l1671J4452j7709P332Q8915P331r138J2616o196l484q792k3720J818
19476D1815L3709l5548M0290N9388l8665m9784K3987L4829m7893J4679j9299l9440
19464A8068K2885K9577k9680q834K7733K1447j6237j6783j5994n7858M3577M5797
$$ plain form
19452 63698 47017 123403 93262 28023 -3602 -12496 -6264 12028 -18221 -39857 -53905 4920
19440 4920 104942 145027 104451 102800 88254 70156 103699 74011 80162 122345 116015 90111
19428 90111 83960 51588 78548 51853 11762 42205 30294 61792 112231 118466 170527 212808
19416 212808 166577 73568 64738 62075 86538 83829 73613 61477 52156 105913 89694 91454
19404 91454 109861 96567 136236 234658 303158 365996 418080 557124 718091 831868 930150
19393 930150 1031990 1122490 1234706 1236969 1087868 950741 1009549 1102822 1117370 1128458 1123586
19382 1123586 1155993 1218623 1256228 1238136 1156672 996918 833265 743802 668498 587322 482121
19371 482121 409214 350700 319121 316326 296369 302583 252833 225500 225676 242028 246352 243569 248703
$$ packed form
19452F3698j6681P6386l0141o5239l1625q894O232J8292l0249k1636j4048N8825
19440D920J00022M0085m0576j651j4546j8098L3543k9688O151M2183o330k5904
19428I0111o151l2372K6960k6695m0091L0443j1911L1498N0439O235N2061M2281
19416B12808m6231r3009q830k663K4463k709j0216j2136r321N3757j6219J760
19404I1454J8407j3294L9669R8422O8500O2838N2084J39044J60967J13777R8282
19393I30150J01840R0500J12216K263j49101j37127N8808R3273J4548J1088m872
19382A123586L2407O2630L7605j8092q1464j59754j63653q9463p5304q1176j05201
19371D82121p2907n8514l1579k795j9957O214m9750k7333J76J6352M324k783N134
$$ plain form
19358 248703 299852 301526 305785 281743 223361 192421 168271 179513 186906 172362 193767 206809
19346 206809 219587 161308 105213 147572 134671 146054 225809 259754 254606 206254 200206 209494
19334 209494 204420 134943 96433 108101 152980 145932 153161 142211 98497 75364 45630 78460
19322 78460 117113 128888 47986 109733 160178 180197 155064 109557 94042 138292 125419 152355
19310 152355 167983 182679 218331 187091 124568 130924 114343 63607 86956 136841 178488 129939
19298 129939 115901 81860 114527 123519 91587 115253 155463 178955 170495 147449 192252 181623
19286 181623 102390 120360 153788 181757 128972 85705 124634 205971 265482 332604 384870
19275 384870 346267 275286 224226 225885 316228 355731 314197 273515 275419 261851 164625 130911
$$ packed form
19358B48703N1149J674M259k4042n8382l0940k4150J1242P393j4544K1405J3042
19346B06809J2778n8279n6095M2359j2901J1383P9755L3945n148m8352o048R288
19334B09494n074o9477l8510J1668M4879p048P229j0950m3714k3133k9734L2830
19322G8460L8653J1775q0902O1747N0445K0019k5133m5507j5515M4250j2873K6936
19310A52355J5628J4696L5652l1240o2523O356j6581n0736K3349M9885M1647m8549
19298A29939j4038l4041L2667Q992l1932K3666M0210K3492q460k3046M4803j0629
19286A81623p9233J7970L3428K7969n2785m3267L8929Q1337N9511O7122N2266
19275C84870l8603p0981n1060J659R0343L9503m1534m0682J904j3568r7226l3714
$$ plain form
19263 130911 100018 179043 277290 298875 292236 318335 298525 311516 310802 275211 264413 255857
19251 255857 227158 281316 340221 350256 282641 311879 341266 280098 239033 258658 276215
19240 276215 309040 263875 277791 270744 306768 293463 245651 245698 277993 283937 237512 263698
19228 263698 341442 323131 302203 326169 360131 383091 407166 436014 450378 485586 461624
19217 461624 455175 415559 432684 463220 462451 341702 324394 413814 473585 522474 503865 472563
19205 472563 424962 368040 373219 389226 369604 369865 428632 477893 475120 487334 475011 515921
19193 515921 556805 562937 573550 576918 580514 545534 491861 517959 550871 570478 575348 592934
19181 592934 645172 662337 642963 618127 659877 690826 658235 604764 623879 686251 715651
$$ packed form
19263A30911l0893P9025R8247K1585o639K6099j9810J2991p14l5591j0798q556
19251B55857k8699N4158N8905J0035o7615K9238K9387o1168m1065J9625J7557
19240B76215L2825m5165J3916p047L6024j3305m7812M7L2295N944m6425K6186
19228B63698P7744j8311k0928K3966L3962K2960K4075K8848J4364L5208k3962
19217D61624o449l9616J7125L0536p69j20749j7308Q9420N9771M8889j8609l1302
19205D72563m7601n6922N179J6007j9622K61N8767M9261k773J2214j2323M0910
19193E15921M0884O132J0613L368L596l4980n3673K6098L2912J9607M870J7586
19181E92934N2238J7165j9374k4836M1750L0949l2591n3471J9115O2372K9400
$$ plain form
19170 715651 703641 742817 765366 741148 764885 837665 830468 814650 800619 795267 861345 960669
19158 960669 939093 891384 883247 971266 1073515 1113149 1113371 1202407 1311608 1326183 1323262 1360361
19146 1360361 1419080 1503151 1580900 1612840 1644691 1697733 1823456 1932115 2039840 2124515 2275485
19135 2275485 2435540 2644149 2955771 3291871 3606075 3951810 4378824 4872358 5372520
19126 5372520 5853023 6421509 7131503 7997769 8918110 10023157 11435065 13385622 16117870
19117 16117870 20176051 26796746 37493270 53297768 71981488 82042287 82849846 92114482
19109 92114482 114681107 138659749 131975187 107860401 99642293 107505252 120045042
19102 120045042 125737325 133312651 141539573 152067302 170102687 189837794 211733681
$$ packed form
19170G15651j2010L9176K2549k4218K3737P2780p197j5818j4031n352O6078R9324
19158I60669k1576m7709q137Q8019J02249L9634K22Q9036J09201J4575k921L7099
19146A360361N8719Q4071P7749L1940L1851N3042J25723J08659J07725Q4675J50970
19135B275485J60055K08609L11622L36100L14204L45735M27014M93534N00162
19126E372520M80503N68486P09994Q66266R20341J105047J411908J950557K732248
19117A6117870M058181O620695J0696524J5804498J8683720J0060799Q07559R264636
19109I2114482K2566625K3978642o684562k4114786q218108P862959J2539790
19102A20045042N692283P575326Q226922J0527729J8035385J9735107K1895887
$$ plain form
19095 211733681 213674004 211155756 200543842 174821730 156721545 141973591 134179865
19088 134179865 125588210 117481217 109586290 98763878 99269234 114219063 132468016 123115164
19080 123115164 94420008 78762381 75814914 73220525 58027533 39612625 27604719
19073 27604719 20387174 15993363 13207326 11361610 9965916 8776577 7753747 6927712
19065 6927712 6211599 5611513 5180892 4688882 4126276 3656059 3315904 3085565 2871389
19056 2871389 2591398 2356476 2185100 2083105 2000814 1907905 1814749 1683086 1563876 1502012
19046 1502012 1442424 1377938 1334506 1298485 1282762 1186591 1041755 992634 965385 983777 982941
19035 982941 971719 904058 857442 808673 821346 836982 841362 854073 837650 777068 726290 734336
$$ packed form
19095B11733681J940323k518248j0611914k5722112j8100185j4747954p793726
19088A34179865q591655q106993p894927j0822412N05356J4949829J8248953r352852
19080A23115164k8695156j5657627k947467k594389j5192992j8414908j2007906
19073B7604719p217545m393811k786037j845716j395694j189339j022830q26035
19065F927712p16113o00086m30621m92010n62606m70217l40155k30339k14176
19056B871389k79991k34922j71376j01995q2291r2909r3156j31663j19210o1864
19046A502012n9588o4486m3432l6021j5723r6171j44836m9121k7249J8392q36
19035I82941j1222o7661m6616m8769J2673J5636M380J2711j6423o0582n0778Q046
$$ plain form
19023 734336 758171 751648 700413 610191 635425 689754 676752 622417 641022 620597 573530 687601
19011 687601 731538 705930 725769 711477 671772 662321 702134 795620 800048 744931 696263 677953
18999 677953 679306 669656 688891 706302 737715 745904 754166 747057 718469 724542 696474 655932 614150
18986 614150 577181 486676 438788 427514 458706 401209 383566 429176 486199 516530 566275
18975 566275 527012 475069 437237 370761 398718 377904 383185 399839 408593 376506 369770 386533
18963 386533 392959 402424 350562 316330 298015 309595 340032 326913 352035 379829 388964 382408
18951 382408 375281 365707 403628 506502 540163 496760 520835 486763 443134 404133 393806 398287
18939 398287 369928 355754 322353 292635 319670 329052 397980 467567 593202 712223 808265
$$ packed form
19023G34336K3835o523n1235r0222K5234N4329j3002n4335J8605k0425m7067J14071
19011F87601M3937k5608J9839j4292l9705r451L9813R3486M428n5117m8668j8310
18999F77953J353r650J9235J7411L1413Q189Q262p109k8588O073k8068m0542m1782
18986F14150l6969r0505m7888j1274L1192n7497j7643M5610N7023L0331M9745
18975E66275l9263n1943l7832o6476K7957k0814N281J6654Q754l2087o736J6763
18963C86533O426R465n1862l4232j8315J1580L0437j3119K5122K7794R135o556
18951C82408p127r574L7921J02874L3661m3403K4075l4072m3629l9001j0327M481
18939C98287k8359j4174l3401k9718K7035R382O8928O9587J25635J19021R6042
$$ plain form
18928 808265 790816 804378 740118 591329 427308 318309 288657 283356 274317 274919 214572 201874
18916 201874 240437 306506 290954 304034 360796 351765 262816 238888 173865 112116 110538 104162
18904 104162 79284 81564 95820 82785 61957 54135 35410 9186 -23509 9776 7618 49485
18892 49485 65445 54711 22986 -17579 -60681 -58680 -5230 18814 42579 30177 -1333 -18733
18880 -18733 -1874 12720 -29445 -26642 2218 16019 56058 69152 45311 39110 41598 60536
18868 60536 51323 129271 190836 197336 163257 117201 68344 -7309 -22007 16000 20739 25728
18856 25728 89626 152774 174079 157677 122292 62287 78810 110325 115048 67137 28851 49651
18844 49651 67259 28031 3634 21261 56568 69405 86096 91847 -647 -56496 -9171 57273
$$ packed form
18928H08265j7449J3562o4260j48789j64021j08999k9652n301r039O02o0347j2698
18916B01874L8563O6069j5552J3080N6762r031q8949k3928o5023o1749j578o376
18904A04162k4878K280J4256j3035k0828p822j8725k6224l2695L3285k158M1867
18892D9485J5960j0734l1725m0565m3102K001N3450K4044K3765j2402l1510j7400
18880a8733J6859J4594m2165K803K8860J3801M0039J3094k3841o201K488J8938
18868F0536r213P7948O1565O500l4079m6056m8857p5653j4698L8007M739M989
18856B5728O3898O3148K1305j6402l5385o0005J6523L1515M723m7911l8286K0800
18844D9651J7608l9228k4397J7627L5307J2837J6691N751r2494n5849M7325O6444
$$ plain form
18832 57273 48692 35841 3570 11256 69779 60729 -4208 -14245 -4164 -40819 -80632 -95121
18820 -95121 -71787 -77087 -76387 -65235 -87011 -56706 -53651 -83465 -89926 -109149 -59302 -53842 -59880
18807 -59880 -79528 -78894 -77425 -92808 -53251 49206 61015 60544 7448 -16296 -20752 -36827 -31789
18794 -31789 -53256 -81213 -64944 -15173 15038 39420 36873 27139 11341 36072 60720 56141
18782 56141 58793 69129 18624 -55106 -66065 12084 77977 66134 2233 -21092 60020 53498
18770 53498 48148 75391 207581 465875 713873 677059 415944 234882 123453 82652 53292
18759 53292 34334 -21750 -50179 -64338 -71419 -46490 -22672 -78370 -84653 -84394 -72492 -43846
18747 -43846 5719 10828 24510 36523 -48265 -82052 -50107 21697 -10905 -28614 -43423 -26417
$$ packed form
18832E7273q581j2851l2271P686N8523r050o4937j0037J0081l6655l9813j4489
18820i5121K3334n300P00J1152k1776L0305L055k9814o461j9223M9847N460o038
18807e9880j9648O34J469j5383L9557J02457J1809m71n3096k3744m456j6075N038
18794c1789k1467k7957J6269M9771L0211K4382k547r734j5798K4731K4648m579
18782E6141K652J0336n0505p3730j0959P8149O5893j1843o3901k3325Q1112o522
18770E3498n350K7243J32190K58294K47998l6814k61115j81062j11429m0801k9360
18759E3292j8958n6084k8429j4159p081K4929K3818n5698o283K59J1902K8646
18747d3846M9565N109J3682J2013q4788l3787L1945P1804l2602j7709j4809J7006
$$ plain form
18735 -26417 -4807 26852 56333 19589 -37946 -45524 -36408 -21430 -27137 -78289 -74112 -80221 -66667
18722 -66667 -90345 -83024 -111044 -106234 -101563 -114492 -95581 -70235 -101534 -97039 -64943 -83854
18710 -83854 -89024 -133014 -119257 -64163 -71879 -90985 -100240 -110636 -79773 -50243 -60610 -21832
18698 -21832 7208 613 -32801 -38599 -24601 -7564 25065 -185 -13757 18526 19242 34865
18686 34865 52362 50605 40182 81657 18898 -34726 -66069 -45044 -47541 -30688 17395 33304
18674 33304 79272 186206 206345 158129 113993 106409 122952 71662 32302 32102 14889 15169
18662 15169 53173 29098 -27294 -49820 -33954 15509 36733 31808 -24839 39865 20318 -46409
18650 -46409 -109009 -113582 -126486 -104252 -85665 -74983 -110919 -93392 -46574 -48357 -49126 -11899
$$ packed form
18735b6417K1610L1659K9481l6744n7535p578R116J4978n707n1152M177o109J3554
18722f6667k3678P321k8020M810M671j2929J8911K5346l1299M495L2096j8911
18710h3854n170m3990J3757N5094p716j9106r255j0396L0863K9530j0367L8778
18698b1832K9040o595l3414n798J3998J7037L2629k5250j3572L2283P16J5623
18686C4865J7497j757j0423M1475o2759n3624l1343K1025k497J6853M8083J5909
18674C3304M5968J06934K0139m8216m4136p584J6543n1290l9360k00j7213K80
18662A5169L8004k4075n6392k2526J5866M9463K1224m925n6647O4704j9547o6727
18650d6409o2600m573j2904K2234J8587J0682l5936J7527M6818j783p69L7227
$$ plain form
18638 -11899 -6961 20577 41813 48018 67682 90602 33047 -23830 -36505 71833 101307 109886
18626 109886 32326 13772 15828 -1338 -7745 -23392 -27997 33705 32867 -24062 -7326 5493
18614 5493 10159 -4996 16909 28714 38681 77752 78837 74483 87276 98513 108042 105903 51303
18601 51303 11957 54578 18416 -8757 -4044 -3406 -32370 -26297 6984 33084 28404 6000 4611
18588 4611 30804 54748 -10832 27190 101011 149953 194718 225523 258665 313455 394910 477631
18576 477631 554167 637527 617238 539627 471086 441890 513118 573659 658880 737233 817103
18565 817103 946842 1020606 1033718 1057793 1097867 1028018 902767 798933 756315 726363 695003
18554 695003 638839 592491 526912 537075 565046 567459 528083 416532 357529 301903 261460
$$ packed form
18638a1899M938K7538K1236O205J9664K2920n7555n6877j2675J08338K9474Q579
18626A09886p7560j8554K056j7166o407j5647m605O1702q38n6929J6736J2819
18614E493M666j5155K1905J1805R967L9071J085m354J2793J1237R529k139n4600
18601E1303l9346M2621l6162k7173M713O38k8964O073L3281K6100m680k2404j389
18588D611K6193K3944o5580L8022P3821M8942M4765L0805L3142N4790Q1455Q2721
18576D77631P6536Q3360k0289p7611o8541k9196P1228O0541Q5221P8353P9870
18565H17103J29739P3764J3112K4075M0074o9849j25251j03834m2618k9952l1360
18554F95003n6164m6348o5579J0163K7971K413l9376j11551n9003n5626m0443
$$ plain form
18543 261460 222606 161373 134291 97112 73977 65427 59472 46240 70670 97629 67825 21520
18531 21520 18831 -13287 -30224 -6670 12939 40241 77261 -3209 -22269 5532 59245 90798
18519 90798 97342 31340 -32018 -58848 -57778 -84528 -80316 -64002 -22585 -42823 -70443 -58329
18507 -58329 -63208 -77578 -85713 -64519 -22409 2358 22264 24924 23928 26961 8725 -7432 12783
18494 12783 53668 69222 43560 -656 -3097 -58643 -96957 -65380 -59636 -111518 -119554 -113968
18482 -113968 -126703 -146083 -112781 -117152 -33988 -10822 -42631 -41667 14300 -47066 -20492 26042
18470 26042 20817 37051 46196 52097 23570 -21612 2633 27070 48998 67069 63698 46125
18458 46125 29027 63957 127878 65863 -20961 15173 55081 69767 24570 -5856 59854 91201
$$ packed form
18543B61460l8854o1233k7082l7179k3135q550n955j3232K4430K6959k9804m6305
18531B1520k689l2118j6937K3554J9609K7302L7020q0470j9060K7801N3713L1553
18519I0798O544o6002o3358k6830J070k6750M212J6314M1417k0238k7620J2114
18507e8329m879j4370q135K1194M2110K4767J9906K660r96L033j8236j6157K0215
18494A2783M0885J5554k5662m4216k441n5546l8314L1577N744n1882q036N586
18482a13968j2735j9380L3302m371Q3164K3166l1809R64N5967o1366K6574M6534
18470B6042n225J6234R145N901k8527m5182K4245K4437K1928J8071l371j7573
18458D6125j7098L4930O3921o2015q6824L6134L9908J4686m5197l0426O5710L1347
$$ plain form
18446 91201 105838 91874 64062 24995 -21594 -58927 -92514 -45254 -20035 52655 35708 22337
18434 22337 54536 67374 65790 56031 68805 59094 105164 64649 8873 -32005 19718 68208
18422 68208 77133 96618 134127 165045 134319 109184 95042 62953 22588 28730 64601 131690
18410 131690 108379 89749 173166 201782 160607 147751 174617 226320 226054 186853 143974 117081
18398 117081 45149 -5609 -4607 23175 47473 74370 57868 25946 39783 33535 38098 38658
18386 38658 -16928 21109 93870 76054 92447 95590 93881 99004 94670 107458 138618 142285 156988
18373 156988 205137 248984 279265 265353 284321 311932 321381 397863 390299 412681 515683 614083
18361 614083 640002 530143 416513 373499 536844 666898 625458 506749 406337 377883
$$ packed form
18446I1201J4637j3964k7812l9067m6589l7333l3587M7260K5219P2690j6947j3371
18434B2337L2199J2838j584r759J2774r711M6070m0515n5776m0878N1723M8490
18422F8208Q925J9485L7509L0918l0726k5135j4142l2089m0365O142L5871O7089
18410A31690k3311j8630Q3417K8616m1175j2856K6866N1703k66l9201m2879k6893
18398A17081p1932n0758J002K7782K4298K6897j6502l1922J3837o248M563N60
18386C8658n5586L8037P2761j7816J6393L143j709N123m334J2788L1160L667J4703
18373A56988M8149M3847L0281j3912J8968K7611R449P6482p564K2382J03002R8400
18361F14083K5919j09859j13630m3014J63345J30054m1440j18709j00412k8454
$$ plain form
18351 377883 381763 362079 408113 412848 406634 395577 387254 443376 470483 489273 503142 533546
18339 533546 593623 474430 492638 530925 536267 546241 640703 723095 749072 698572 644649 617248
18327 617248 608497 590467 614382 570599 432923 315872 249030 232774 213747 230112 274092
18316 274092 276538 316112 447840 565169 682749 767461 716268 651231 625329 631730 678806
18305 678806 756233 654159 595775 607820 608154 613041 528936 461981 476264 467734 467100 429661
18293 429661 378492 358971 296489 228521 140607 130989 171873 215038 183521 168725 193201 260380
18281 260380 413956 515335 445239 333042 315315 400141 493190 452496 319801 222819 171854
18270 171854 117933 143540 162279 178038 190375 153883 109014 17125 -29475 -12445 31734
$$ packed form
18351C77883L880j9684M6034M735o214j1057q323N6122K7107J8790J3869L0404
18339E33546O0077j19193J8208L8287N342R974R4462Q2392K5977n0500n3923k7401
18327F17248q751j8030K3915m3783j37676j17051o6842j6256j9027J6365M3980
18316B74092K446L9574J31728J17329J17580Q4712n1193o5037k5902O401M7076
18305F78806P7427j02074n8384J2045L34M887q4105o6955J4283q530o34l7439
18293D29661n1169j9521o2482o7968q7914r618M0884M3165l1517j4796K4476O7179
18281B60380J53576J01379p0096j12197j7727Q4826R3049m0694j32695r6982n0965
18270A71854n3921K5607J8739J5759J2337l6492m4869r1889m6600J7030M4179
$$ plain form
18259 31734 91026 144026 170821 192354 219858 244488 216540 233535 235284 257484 206634 172522
18247 172522 176681 171974 158073 146840 108712 113332 114834 163641 208305 255842 254340 206675
18235 206675 217727 175122 156127 141100 103414 81804 69206 95744 158172 126395 110425
18224 110425 145627 174572 150273 145447 201953 187714 197009 258510 262619 251774 203288 186694
18212 186694 197873 188075 207844 226580 214932 243038 272173 263401 259789 244132 270434 265503
18200 265503 193858 159235 100590 41928 48572 54474 59276 20421 -10819 -3381 39379 44291
18188 44291 53232 71571 43517 50720 22249 59341 127466 172731 152523 114633 117272 120676
18176 120676 122114 122198 148184 170022 159707 90419 53957 115582 180297 167475 148163 156897
$$ packed form
18259C1734N9292N3000K6795K1533K7504K4630k7948J6995J749K2200n0850l4112
18247A72522M159m707j3901j1233l8128M620J502M8807M4664M7537j502m7665
18235B06675J1052m2605j8995j5027l7686k1610j2598K6538O2428l1777j5970
18224A10425L5202K8945k4299m826N6506j4239R295O1501M109j0845m8486j6594
18212A86694J1179r798J9769J8736j1648K8106K9135q772l612j5657K6302m931
18200B65503p1645l4623n8645n8662O644N902M802l8855l1240P438M2760M912
18188D4291Q941J8339k8054P203k8471L7092O8125M5265k0208l7890K639L404
18176A20676J438Q4K5986K1838j0315o9288l6462O1625O4715j2822j9312Q734
$$ plain form
18164 156897 151006 147615 163396 168935 149822 153213 194896 207167 173299 193913 233865 301463
18152 301463 293416 228500 223640 277643 262902 253583 226120 249498 322126 385569 445660 420825
18140 420825 367838 337777 314648 338997 409520 513425 628124 680155 737287 813604 880628
18129 880628 933154 1008018 1096542 1207159 1392066 1583189 1729414 1924885 2156895 2476506
18119 2476506 2909491 3481812 4240032 5257294 6616421 8784951 12258453 18044762 28736419
18110 28736419 48398892 80772519 125158519 140588699 90959423 48728175 28551035
18103 28551035 18366509 12539852 9087757 6865196 5260969 4129777 3336201 2783620
18095 2783620 2386834 2044858 1656998 1427078 1296904 1124602 988246 927000 787032 658978
$$ packed form
18164A56897n891l391J5781N539j9113L391M1683J2271l3868K0614L9952O7598
18152C01463q047o4916m860N4003j4741r319k7463K3378P2628O3443O0091k4835
18140D20825n2987l0061k3129K4349P0523J03905J14699N2031N7132P6317O7024
18129H80628N2526P4864Q8524J10617J84907J91123J46225J95471K32010L19611
18119B476506M32985N72321P58220J017262J359127K168530L473502N786309J0691657
18110B8736419J9662473L2373627M4386000J5430180m9629276m2231248k0177140
18103B8551035j0184526n826657l452095k222561j604227j131192p93576n52581
18095B783620l96786l41976l87860k29920j30174j72302j36356o1246j39968j28054
$$ plain form
18085 658978 555726 536062 565416 556380 495194 449920 428423 402992 348100 303792 285961
18074 285961 273496 292744 301536 279825 239059 218932 137152 93172 159753 184696 171768 166989
18062 166989 139783 103350 97837 99549 98226 149023 170192 106454 59433 40894 11474 1809
18050 1809 73930 114380 89466 42466 -6081 -3636 -16319 -26969 20739 18653 587 -28089
18038 -28089 -20888 -85999 -144237 -86388 -27537 -3495 42699 -6011 -28742 24626 84124 79539
18026 79539 -5755 -10661 32256 29617 16606 13009 19040 -6244 -6076 57756 66088 55560 -29829
18013 -29829 -39697 -2252 -57009 -61297 18113 7512 -50168 -95530 -85932 -9882 41987 1950
18001 1950 -8823 -13583 -30815 -14219 4930 20919 25407 26266 -18403 -77951 -56238 11252 64262
$$ packed form
18085F58978j03252j9664K9354r036o1186m5274k1497k5431n4892m4308j7831
18074B85961j2465J9248Q792k1711m0766k0127q1780m3980O6581K4943j2928m779
18062A66989k7206l6433n513J712j323N0797K1169o3738m7021j8539k9420r665
18050A809P2121M0450k4914m7000m8547K445j2683j0650M7708k086j8066k8676
18038b8089P201o5111n8238N7849N8851K4042M6194m8710k2731N3368N9498m585
18026G9539q5294m906M2917k639j3011l597O031k5284J68O3832Q332j0528q5389
18013b9829r868L7445n4757m288P9410j0601n7680m5362R598P6050N1869m0037
18001A950j0773m760j7232J6596J9149J5989M488Q59m4669n9548K1713O7490N3010
$$ plain form
17988 64262 67059 48516 -8285 -18027 -9231 -2346 14751 12929 -12969 -14850 -19201 13369 -19867
17975 -19867 -40076 -75159 -33304 13414 17117 16674 2525 -3634 -27336 -29891 -27002 -11249 -7353
17962 -7353 -18831 -3996 -4131 8996 -19696 -19709 27019 -18732 40 -20498 -56065 -57041 -61005
17949 -61005 -47161 -57729 -41197 -17187 -30309 14770 36735 21859 3068 -15117 -21454 -56684
17937 -56684 -22045 -23445 -60909 -71197 -131949 -106212 -91786 -138698 -127737 -78580 -77270 -74936
17925 -74936 -116942 -134528 -150086 -155657 -142590 -114286 -65444 -18688 -69462 -60711 -25256 -45981
17913 -45981 -99588 -122975 -78978 -26741 -53002 -33934 -32675 -9650 -41494 -88205 -148982 -135490
17901 -135490 -75435 -109794 -144534 -80128 -20663 -22766 -14914 -65842 -100507 -75634 -88275 -36721
$$ packed form
17988F4262K797j8543n6801r742Q796O885J7097j822k5898j881m351L2570l3236
17975a9867k0209l5083M1855M6718L703m43j4149o159k3702k555K889J5753L896
17962g353j1478J4835j35J3127k8692j3M6728m5751J8772k0538l5567r76l964
17949f1005J3844j0568J6532K4010j3122M5079K1965j4876j8791j8185o337l5230
17937e6684L4639j400l7464j0288o0752K5737J4426m6912J0961M9157J310K334
17925g4936m2006j7586j5558n571J3067K8304M8842M6756n0774Q751L5455k0725
17913d5981n3607k3387M3997N2237k6261J9068J259K3025l1844m6711o0777J3492
17901a35490O0055l4359l4740O4406N9465k103P852n0928l4665K4873j2641N1554
$$ plain form
17889 -36721 -7508 6909 -4086 -1238 58120 66545 -489 -51101 -61200 -62103 -24349 -53077
17877 -53077 -86439 -95263 -58269 -60463 -76546 -106020 -141095 -41319 37445 35604 11624 15513
17865 15513 -10839 -72423 -133613 -94918 -59655 -58759 -52275 -54235 -54236 -88950 -38502 -35101 -22948
17852 -22948 -21907 -5266 8243 -62217 -88367 -56001 -28543 -20196 -11590 7937 16894 -20814
17840 -20814 -27106 -14601 -5071 -3669 6453 7577 24862 43064 16959 -37913 -75973 -71375 -42207
17827 -42207 -73787 -129505 -155131 -123124 -98975 -93125 -71210 -99279 -112097 -68808 -37783 -41612
17815 -41612 -18579 -80515 -124286 -118214 -87653 -65713 -24450 -29992 -13898 -13613 -26583 -85258
17803 -85258 -99629 -56685 -18202 -13994 -23759 -46877 677 -8911 -983 -26315 -52425 -49141 -76446
$$ packed form
17889c6721K9213J4417j0995K848N9358Q425o7034n0612j0099r03L7754k8728
17877e3077l3362q824L6994k194j6083k9474l5075R9776P8764j841k3980L889
17865A5513k6352o1584o1190L8695L5263Q96O484j960jl4714N0448L401J2153
17852b2948J041J6641J3509p0460k6150L2366K7458Q347Q606J9527Q957l7708
17840b0814o292J2505R530J402J0122J124J7285J8202k6105n4872l8060M598K9168
17827d2207l1580n5718k5626L2007K4149N850K1915k8069j2818M3289L1025l829
17815d1612K3033o1936m3771O072L0561K1940M1263n542J6094K85j2970n8675
17803h5258j4371M2944L8483M208r765k3118M7554r588P928k5332k6110L284k7305
$$ plain form
17790 -76446 -44202 -12247 -18879 10328 37281 53044 24585 -43494 -43350 -90847 -132664 -91145
17778 -91145 -100821 -53503 14329 18961 56051 47014 32917 -24198 -64994 -82326 -126224 -162010
17766 -162010 -141332 -87278 -52100 -33902 -56296 -11961 -24209 -30691 71305 114487 69145
17755 69145 36621 -10189 -83277 -136822 -143072 -145217 -191142 -152471 -70499 -24299 -46540 -36836
17743 -36836 -37325 -94896 -112527 -38479 20786 13144 33968 -23006 -46426 -27554 27186 37743
17731 37743 -16785 -28884 -67224 -82620 -73431 -54458 -6632 -13986 -41631 -62523 -43575 -43938
17719 -43938 -73926 -82919 -86440 -2479 30409 47175 -38577 -47149 153 7590 -19433 -61857
17707 -61857 -72336 -37549 -3650 13929 -23745 -8608 -19038 -49792 -75070 -80482 -77030 -63607
$$ packed form
17790g6446L2244L1955o632K9207K6953J5763k8459o8079J44m7497m1817M1519
17778i1145r676M7318O7832M632L7090r037j4097n7115m0796j7332m3898l5786
17766a62010K0678N4054L5178J8198k2394M4335j2248o482J01996M3182m5342
17755F9145l2524m6810p3088n3545o250k145m5925L8671Q1972M6200k2241R704
17743c6836m89n7571j7631P4048N9265p642K0824n6974k3420J8872N4740J0557
17731C7743n4528j2099l8340j5396R189J8973M7826p354k7645k0892J8948l63
17719d3938k9988q993l521Q3961L2888J6766q5752q572M7302P437k7023m2424
17707f1857j0479L4787L3899J7579l7674J5137j0430l0754k5278n412L452J3423
$$ plain form
17695 -63607 -36303 -70340 -79089 -19589 -11644 9998 -23200 -69638 -72576 -15679 14896 -40585
17683 -40585 -40534 -22453 19055 13748 -7111 -27047 -89393 -135050 -130957 -122043 -105356 -89847 -82261
17670 -82261 -26478 -30248 -34237 -71271 -117795 -80537 -71847 -21403 -35557 -24101 5709 -2185
17658 -2185 -5166 -39874 -99327 -137114 -48882 -18093 -37161 -18617 -36138 -107292 -76416 18544
17646 18544 22109 -2369 -9177 -28324 -4127 13453 -4530 -38340 -45706 -56738 -33963 -14025
17634 -14025 -20723 -67336 -91726 -109807 -92373 -91144 -62705 -58258 -35971 -50565 -87516 -110361
17622 -110361 -66039 -31359 -22420 -46919 -100426 -83057 -82937 -92111 -59636 5394 6238 -11254 2032
17609 2032 1415 -37053 -38103 -32829 -2459 -10034 -25186 -32636 -22542 -47053 -85416 -88481 -94573
$$ packed form
17695f3607K7304l4037q749N9500P945K1642l3198m6438k938N6897L0575n5481
17683d0585N1J8081M1508n307k0859j9936o2346m5657M093Q914J6687J5509P586
17670h2261N5783l770l989l7034m6524L7258Q690N0444j4154J1456K9810p894
17658b185k981l4708n9453l7787Q8232L0789j9068J8544j7521p1154L0876R4960
17646A8544L565k4478o808j9147K4197J7580j7983l3810p366j1032K2775J9938
17634a4025o698m6613k4390j8081J7434J229K8439M447K2287j4594l6951k2845
17622a10361M4322L4680Q939k4499n3507J7369J20r174L2475O5030Q44j7492J3286
17609B032o17l8468j050N274L0370p575j5152p450J0094k4511l8363l065o092
$$ plain form
17596 -94573 -74898 -20901 -46588 -60805 -81518 -98517 -141042 -82086 -26715 -13182 11380 -26521
17584 -26521 -22144 -44018 -80859 -127413 -94892 -23851 -9768 631 -6265 -42333 -36940 -102820
17572 -102820 -52128 10151 32078 44587 33795 43191 77957 48198 -17821 -53646 -64825 -75154
17560 -75154 -97248 -17183 -56851 -81815 -115624 -140517 -133225 -139265 -144701 -123328 -103334 -47534
17548 -47534 -41183 -97270 -65220 -62662 -62297 -71037 -67480 -127460 -127696 -135965 -163729 -132901 -100940
17535 -100940 -115481 -138124 -154891 -131478 -37720 64966 26505 -29769 -53634 -37970 -74977
17524 -74977 -80829 -60411 -61511 -26055 9731 -12313 -49367 -42909 -39741 -56755 10544 42740
17512 42740 -21082 -64099 -65675 -76705 -50840 -56715 -92930 -97476 -74851 -27463 -18792 -4450
$$ packed form
17596i4573J9675N3997k5687j4217k0713j6999m2525N8956N5371J3533K4562l7901
17584b6521M377k1874l6841m6554L2521P1041J4083J0399o896l6068N393o5880
17572a02820N0692O2279K1927J2509j0792R396L4766k9759o6019l5825j1179j0329
17560g5154k2094Q0065l9668k4964l3809k4893P292o040n436K1373J9994N5800
17548d7534O351n6087L2050K558L65q740L557n9980k36q269k7764L0828L1961
17535a00940j4541k2643j6767K3413R3758J02686l8461n6274k3865J5664l7007
17524g4977n852K0418j100L5456L5786k2044l7054O458L168j7014O7299L2196
17512D2740o3822m3017j576j1030K5865n875l6215m546K2625M7388Q671J4342
$$ plain form
17500 -4450 -58681 -65310 -70098 -130385 -85114 -85245 -77834 -112499 -131262 -89608 -35472 -29956 -17436
17487 -17436 9710 -42703 -49096 -38687 -52930 -63496 -38459 -5616 8657 1006 20290 27052
17475 27052 -19755 -52695 -88431 -90683 -96381 -124398 -119085 -92466 -80913 -72297 -73076 -15262 -5953
17462 -5953 -32155 -106595 -87478 -92780 -69911 -23306 -7412 -522 -28436 -38086 -3260 -6795 -52583
17449 -52583 -43337 42264 45729 41872 43770 141767 320239 516602 748659 676015 399740 275789
17437 275789 171229 61810 50385 17588 -14389 -41429 10993 22317 54192 -11435 -63256
17426 -63256 -35383 146 -2436 -22255 -53201 -88599 -32303 -37242 -57849 -62254 -546 13371
17414 13371 -50574 -62074 -84998 -74673 -67925 -58364 -76218 -135190 -150052 -97107 -24948 6955
$$ packed form
17500d450n4231o629m788o0287M5271j31P411l4665j8763M1654N4136N516J2520
17487a7436K7146n2413o393J0409j4243j0566K5037L2843J4273p651J9284O762
17475B7052m6807l2940l5736k252n698k8017N313K6619J1553Q616p79N7814R309
17462e953k6202p4440J9117n302K2869M6605J5894O890k7914r650L4826l535m5788
17449e2583R246Q5601L465l857J898R7997J78472J96363K32057p2644k76275j23951
17437B75789j04560j09419j1425l2797l1977k7040N2422J1324L1875o5627n1821
17426f3256K7873L5529k582j9819l0946l5398N6296m939k0607m405O1708J3917
17414A3371o3945j1500k2924J0325O748R561j7854n8972j4862N2945P2159L1903
$$ plain form
17402 6955 -50616 -108325 -108558 -81967 -82829 -38777 -43081 -77293 -125443 -112619 -70173 -78263 -39934
17389 -39934 -36741 -31653 -24320 -26729 -27585 -28488 -43827 -44982 -19864 -17142 23270 -8427 -53544 -49498
17375 -49498 -31843 -52199 -62327 -67164 -57547 -9394 -5381 -13362 -22863 -11546 -56029 -113199 -106801
17362 -106801 -135452 -120340 -57241 -11270 -10376 12991 -9401 -15065 -36977 -91120 -99271 -105953
17350 -105953 -122964 -96975 -120106 -100925 -54467 -50909 -64393 -68353 -65018 -59411 -94436 -67849
17338 -67849 -26522 -6752 -16583 -3139 17205 22221 2727 -24988 -41058 -131943 -177644 -178484
17326 -178484 -172982 -93324 -32267 -32517 4472 16035 17452 27313 1170 -40308 -57392 -16048
17314 -16048 -20826 -30474 -29299 -24988 -903 -7627 -89401 -107068 -86240 -87110 -23073 -45356 -62930
$$ packed form
17402F955n7571n7709k33K6591q62M4052m304l4212m8150J2824M2446q090L8329
17389c9934L193N088P333k409q56r03j5339j155K5118K722M0412l1697m5117M046
17375d9498J7655k0356j0128m837R617M8153M013p981r501J1317m4483n7170O398
17362a06801k8651J5112O3099M5971Q94K3367k2392n664k1912n4143q151o682
17350a05953j7011K5989k3131J9181M6458L558j3484l960L335N607l5025K6587
17338f7849M1327J9770r831J3444K0344N016j9494k7715j6070r0885m5701q40
17326a78484N502P9658O1057k50L6989J1563J417R861k6143m1478j7084M1344
17314a6048m778r648J175M311K4085o724q1774j7667K0828q70O4037k2283j7574
$$ plain form
17301 -62930 -78855 -58254 -28157 7412 48959 6360 -33760 -40339 -21684 -89187 -127749 -143879
17289 -143879 -130845 -116161 -112312 -117263 -50633 -37048 -76383 -111997 -155691 -179530 -140057 -124406
17277 -124406 -60578 -36132 -40975 -49063 -64571 -62565 -73050 -123099 -133140 -89144 -58179 -50003
17265 -50003 -83290 -77502 -74325 -98487 -86887 -79851 -81767 -87342 -102029 -55722 -79674 -133653 -162390
17252 -162390 -117337 -93016 -136485 -130956 -127948 -130183 -93674 -34060 -24021 -91008 -101772 -59872
17240 -59872 -50017 -57877 -62687 -57794 -97015 -148054 -119903 -19130 -10157 -53121 -74441 -101254
17228 -101254 -59552 -36011 -53620 -35363 -29184 -39723 -52209 -10989 -23898 -58472 -69570 -93776
17216 -93776 -99539 -73429 -97340 -93078 -76378 -103753 -108787 -94196 -44448 -27845 -292 -79241
$$ packed form
17301f2930j5925K0601L0097L5569M1547m2599m0120o579J8655o7503l8562j6130
17289a43879J3034J4684L849m951O6630J3585l9335l5614m3694k3839L9473J5651
17277a24406O3828K4446m843q088j5508K006j0485n0049j0041M3996L0965Q176
17265e0003l3287N788L177k4162J1600P036j916n575j4687M6307k3952n3979k8737
17252a62390M5053K4321m3469N529L008k235L6509N9614J0039o6987j0764M1900
17240e9872R855p860m810M893l9221n1039K8151J00773Q973m2964k1320k6813
17228a01254M1702K3541j7609J8257O179j0539j2486M1220j2909l4574j1098k4206
17216i3776n763K6110k3911M262J6700k7375n034J4591M9748J6603K7553p8949
$$ plain form
17204 -79241 -130142 -128194 -97387 -86299 -101047 -99536 -54056 -32914 -43848 -64622 -53528 -53644
17192 -53644 -47390 -50149 -18536 -34141 -72808 -31607 -40029 -40812 -40411 -10505 18986 21829 -40149
17179 -40149 -22287 38324 51773 27784 -29882 -32661 -36772 -74681 -36019 -16606 -53208 -125649
17167 -125649 -111550 -110896 -143737 -120824 -113719 -146040 -162419 -143388 -43635 -17236 -65595 -69380
17155 -69380 -64319 7850 62904 62412 53783 46209 -24451 -81373 -47424 -39222 -81506 -80882 -8467
17142 -8467 -31585 -5233 -8213 4009 -26386 11747 96176 97274 84821 73819 35021 -37245
17130 -37245 -73618 -72257 -58728 -65693 -58395 -10253 -18335 -32436 -22244 -19495 -36880 -97411 -152599
17117 -152599 -169420 -165969 -109195 -73179 -12982 -63433 -145027 -127112 -107978 -61641 -109250 -118272
$$ packed form
17204g9241n0901J948L0807J1088j4748J511M5480K1142j0934k0774J1094j16
17192e3644O254k759L1613j5605l8667M1201q422p83M01K9906K9491K843o1978
17179d0149J7862O0611J3449k3989n7666k779m111l7909L8662J9413l6602p2441
17167a25649J4099O54l2841K2913P105l2321j6379J9031R9753K6399m8359l785
17155f9380N061P2169N5054m92q629p574p0660n6922L3949Q202m2284O24P2415
17142h467k3118K6352k980J2222l0395L8133Q4429J098j2453j1002l8798p2266
17130c7245l6373J361J3529o965P298M8142q082j4101J0192K749j7385o0531n5188
17117a52599j6821L451N6774L6016O0197n0451q1594J7915J9134M6337m7609r022
$$ plain form
17105 -118272 -107729 -86058 -98818 -83380 -74359 -87484 -78725 -64686 -23290 -28319 -67550 -23710
17093 -23710 20736 -37382 -71645 -28232 -44114 -78860 -590 55772 24280 -15986 -13630 15927
17081 15927 -13095 24162 20251 -18389 -57468 -30334 -48221 -65243 -131047 -181671 -142368 -102228
17069 -102228 -70656 -54030 -34850 -21747 -47085 -67523 -38516 -1225 -43252 -81089 -35346
17058 -35346 30673 10854 -84269 -125220 -93110 -80665 -84306 -78335 -98435 -64971 -83527 -67885
17046 -67885 -49420 -72605 -43128 -64 69710 79132 24057 -26492 -40788 -55529 -73391 -63567
17034 -63567 -77269 -24752 -2449 -40727 -17247 -36150 -63883 -114416 -141312 -61105 -63791 -51922
17022 -51922 -54775 -64602 -30704 -6639 5803 23354 -14902 -38837 -19659 -33626 -86635 -122017
$$ packed form
17105a18272J0543K1671j2760J5438R021j3125Q759J4039M1396n029l9231M3840
17093b3710M4446n8118l4263M3413j5882l4746P8270N6362l1492m0266K356K9557
17081A5927k9022L7257l911l8640l9079K7134j7887j7022o5804n0624L9303M0140
17069a02228L1572J6626J9180J3103k5338k0438K9007L7291m2027l7837M5743
17058c5346O6019j9819r5123m0951L2110J2445l641N971k0100L3464j8556J5642
17046f7885J8465k3185K9477M3064O9774R422n5075n0549j4296j4741j7862R824
17034f3567j3702N2517K2303l8278K3480j8903k7733n0533k6896Q0207k686J1869
17022e1922k853r827L3898K4065J2442J7551l8256k3935J9178j3967n3009l5382
$$ plain form
17010 -122017 -132830 -128819 -128321 -151114 -145802 -83161 -43728 -47474 -72857 -70215 -6742 22904 -3981
16997 -3981 -51368 -46653 -21757 -34795 -44889 -63705 -37081 1437 -15684 -46828 18116 38471
16985 38471 -5483 -5469 -21760 -21182 -24504 -34694 -54497 -90573 -108043 -33697 -33664 -7428 -15052 -38838
16971 -38838 -52162 -56055 -79276 -97405 -92067 -63737 -25994 -13424 16908 1254 9194 -11101
16959 -11101 -67645 -86307 -48875 -48400 -16734 10429 5786 2414 6515 21208 -12184 -52522 -46452
16946 -46452 -43798 -58812 -52609 -75441 -114204 -107921 -59237 -59627 -59639 -44380 -5176 39670 65037
16933 65037 38632 -22668 -63519 -5864 -32029 -71002 -43735 -2324 -17863 -380 5023 -64360
16921 -64360 -111664 -81490 -49602 -65761 -121001 -166493 -144320 -100852 -74930 -108676 -72178 -60648
$$ packed form
17010a22017j0813M011M98k2793N312O2641L9433l746k5383K642O3473K9646k6885
16997c981m7387M715K4896j3038j0094j8816K6624L8518j7121l1144O4944K0355
16985C8471m3954J4j6291N78l322j0190j9803l6076j7470P4346L3K6236p624k3786
16971c8838j3324l893k3221j8129N338K8330L7743J2570L0332j5654P940k0295
16959a1101n6544j8662L7432M75L1666K7163m643l372M101J4693l3392m0338O070
16946d6452K654j5014O203k2832l8763O283M8684l90j2J5259L9204M4846K5367
16933F5037k6405o1300m0851N7655k6165l8973K7267M1411j5539J7483N403o9383
16921f4360m7304L0174L1888j6159n5240m5492K2173M3468K5922l3746L6498J1530
$$ plain form
16909 -60648 -40317 -14241 -2746 -4964 -41902 -72484 -123125 -122290 -122430 -113779 -92420 -57573 -32154
16896 -32154 -27009 -75662 -74514 -12084 15000 24792 22323 46381 -10355 -39802 -44929 -48854 -53651
16883 -53651 -90327 -81502 -78250 -57095 -18916 -35879 -75856 -83853 -129893 -114984 -69395 -28992
16871 -28992 -41780 -80654 -106823 -86647 -38144 -14187 -52709 -60913 -49464 -5710 -420 -63091
16859 -63091 -88775 -101255 -58994 -34819 11093 16075 7514 -5656 -17548 -19331 -29115 -22242 -3623
16846 -3623 -37464 -88237 -89974 -52150 -78438 -121288 -108237 -124493 -94191 -49320 -31709 394
16834 394 -5615 -55077 -63223 -80274 -44661 -3811 2019 33892 17038 -10380 -49510 -56689 -14514
16821 -14514 -39199 -91485 -97108 -112331 -103674 -88067 -59712 -32222 -26982 -13389 -5408 -8785 -8631
$$ packed form
16909f0648K0331K6076J1495k218l6938l0582n0641Q35j40Q651K1359L4847K5419
16896c2154N145m8653J148O2430K7084R792k469K4058n6736k9447n127l925m797
16883e3651l6676Q825L252K1155L8179j6963l9977p997m6040J4909M5589M0403
16871b8992j2788l8874k6169K0176M8503K3957l8522q204J1449M3754N290o2671
16859f3091k5684j2480M2261K4175M5912M982q561j3170j1892j783r784O873J8619
16846c623l3841n0773j737L7824k6288m2850J3051j6256L0302M4871J7611L2103
16834C94o009m9462q146j7051L5613M0850N830L1873j6854k7418l9130p179M2175
16821a4514k4685n2286n623j5223Q657J5607K8355K7490N240J3593P981l377J54
$$ plain form
16808 -8631 -9664 -2282 -25721 -2583 -38593 -47513 -114845 -127435 -133708 -143922 -120304 -121431 -75974
16795 -75974 23177 10725 -81637 -126019 -125797 -119647 -108646 -50603 -17605 -885 8683 45323
16783 45323 48621 64750 -10458 -22988 21327 -27032 -39960 -44341 -39075 -22617 -36562 -49529
16771 -49529 -62428 -64876 -85177 -46116 -73365 -89626 -68336 -45715 -33896 9414 -1077 -42254
16759 -42254 -51499 -85654 -120538 -127913 -142557 -91582 -23217 7921 -42594 -72681 -75142 -20420
16747 -20420 -39937 -35635 -56515 -65058 -63678 -50990 -49314 -37289 -45742 -72841 -44680 -14899 -35854
16734 -35854 -40071 -64451 -87971 -92811 -99821 -91371 -57649 -18065 -6992 -36843 -53039 -55489 -81066
16721 -81066 -51224 -44998 -28383 -71743 -119188 -114146 -142004 -185201 -127407 -85981 -75016 -16821
$$ packed form
16808h631j033P382k3439K3138l6010q920o7332j2590o273j0214K3618j127M5457
16795g5974R9151j2452r2362m4382K22O150J1001N8043L2998J6720R568L6640
16783D5323L298J6129p5208j2530M4315m8359j2928m381N266J6458j3945j2967
16771d9529j2899k448k0301L9061k7249j6261K1290K2621J1819M3310j0491m1177
16759d2254r245l4155l4884p375j4644N0975O8365L1138n0515l0087k461N4722
16747b0420j9517M302k0880q543J380J2688J676J2025q453k7099K8161K9781k0955
16734c5854m217k4380k3520m840p010Q450L3722L9584J1073k9851j6196k450k5577
16721h1066K9842O226J6615m3360m7445N042k7858m3197N7794M1426J0965N8195
$$ plain form
16709 -16821 -20066 -27392 -69888 -77279 -49415 -51106 -65952 -49347 -65548 -94238 -84163 -42327
16697 -42327 44891 96738 107504 63276 31971 7698 -15486 -44323 -61839 -41766 -43422 -121486
16685 -121486 -134479 -128171 -118755 -46799 -30761 -79679 -87296 -105324 -128459 -112815 -150808 -120646
16673 -120646 -97898 -102258 -61015 -81724 -61076 -44686 -58492 -51222 -40291 -60802 -92217 -114242
16661 -114242 -129561 -111001 -8106 -33375 -124536 -111147 -155898 -174603 -149768 -133542 -80257
16650 -80257 -7550 -29268 -42780 -36500 -17835 -30358 -78350 -81553 -83089 -31723 -58902 -80719
16638 -80719 -38105 -55743 -93847 -75325 -22229 2570 24573 -16766 -95872 -80875 -20912 -16951
16626 -16951 -26942 -29063 -12887 -32120 -49494 -63227 -42398 -51228 -25795 -79702 -132508 -142807
$$ packed form
16709a6821l245p326m2496p391K7864j691j4846J6605j6201k8690J0075M1836
16697d2327Q7218N1847J0766m4228l1305k4273k3184k8837j7516K0073j656p8064
16685a21486j2993O308R416P1956J6038m8918p617j8028k3135J5644l7993L0162
16673a20646K2748m360M1243k0709K0648J6390j3806P270J0931k0511l1415k2025
16661a14242j5319J8560J02895k5269r1161J3389m4751j8705K4835J6226N3285
16650h0257P2707k1718j3512O280J8665j2523m7992l203j536N1366k7179k1817
16638h0719M2614j7638l8104J8522N3096K4799K2003m1339p9106J4997N9963L961
16626a6951r991k121J6176j9233j7374j3733K0829q830K5433n3907n2806j0299
$$ plain form
16614 -142807 -114147 -59255 -45205 -90828 -46901 38664 33948 -13041 -49410 -63288 -41366 -40440
16602 -40440 -22490 -66235 -85978 -26420 -3965 -53085 -58994 -19981 16438 -32604 -50064 -64714
16590 -64714 -72122 -95299 -121543 -59026 -37275 -49796 -94136 -67887 -22402 -11984 -39351 -19152
16578 -19152 -46754 -102348 -97963 -18732 19941 -18347 -7640 -24381 2197 11294 -21677 -15116
16566 -15116 -14221 -36076 -44146 -42361 -60823 -47568 46139 99829 59689 6777 -43511 -85056
16554 -85056 -47494 -24644 -52601 -60284 -43948 -14045 -34002 -74125 -54882 -72681 -64276 -6384
16542 -6384 37269 20257 1117 -21313 -26525 -43789 -54954 -53052 -41901 -25495 11941 37722
16530 37722 41534 97977 116963 64263 51163 49884 19858 2586 26304 26610 43856 61514
$$ packed form
16614a42807K8660N4892J4050m5623M3927Q5565m716m6989l6369j3878K1922R26
16602d0440J7950m3745j9743N9558K2455m9120n909L9013L6419m9042j7460j4650
16590f4714p408k3177k6244O2517K1751j2521m4340K6249M5485J0418k7367K0199
16578a9152k7602n5594M385P9231L8673l8288J0707j6741K6578R097l2971O561
16566a5116Q95k1855q070J785j8462J3255R3707N3690m0140n2912n0288m1545
16554h5056L7562K2850k7957p683J6336K9903j9957m0123J9243j7799Q405N7892
16542f384M3653j7012j9140k2430n212j7264j1165J902J1151J6406L7436K5781
16530C7722L812N6443J8986n2700j3100j279l0026j7272K3718L06J7246J7658
$$ plain form
16518 61514 18138 -39709 -23032 -18565 -16981 -32453 -35826 -47686 -89801 -74989 -24445 33541
16506 33541 81833 55441 50948 51298 19100 20192 -34862 -71087 -33640 8133 -34558 -19820
16494 -19820 13148 -8696 -23047 -59093 -122965 -59757 -8256 -27029 -42693 -15877 -44329 -29021
16482 -29021 -46553 -53566 -23073 -43061 -100054 -118792 -48241 -9914 -14134 -13564 1257 -38899
16470 -38899 -51821 -133849 -107533 -110875 -124725 -110708 -133441 -82788 4042 -3951 -31848 -31160
16458 -31160 -39885 -49536 -47674 -57297 -41964 -14096 -31253 -125760 -151909 -115611 -67785 -17569
16446 -17569 -1721 29225 21069 -6288 -33222 -23367 -14862 27827 13618 -33837 -22784 -10490
16434 -10490 13240 47071 33303 -8362 -29226 -36866 -70716 -17801 -37773 -17085 -18192 -27710
$$ packed form
16518F1514m3376n7847J6677M467J584j5472l373j1860m2115J4812N0544N7986
16506C3541M8292k6392m493L50l2198J092n5054l6225L7447M1773m2691J4738
16494a9820L2968k1844j4351l6046o3872O3208N1501j8773j5664K6816k8452J5308
16482b9021j7532p013L0493j9988n6993j8738P0551L8327m220N70J4821m0156
16470c8899j2922q2028K6316l342j3850J4017k2733N0653Q6830p993k7897O88
16458c1160q725r651J862r623J5333K7868j7157r4507k6149L6298M7826N0216
16446a7569J5848L0946q156k7357k6934R855Q505M2689j4209m7455J1053J2294
16434a0490K3730L3831j3768m1665k0864p640l3850N2915j9972K0688j107r518
$$ plain form
16422 -27710 -4270 -19597 6795 52956 -1989 -16971 -35228 -48366 -73369 -75238 -49323 -20758
16410 -20758 -17024 -92772 -100559 -56699 -33950 -91016 -101045 -102116 -123796 -88631 -57224 -47853
16398 -47853 -38969 -32155 -22918 -31088 -9680 -50989 -40420 15576 -14121 -68549 -65440 -76095 -43846
16385 -43846 -51402 -37345 -33144 -85120 -53181 -50346 -75436 -70013 -30848 -56889 -86376 -95905 -70537
16372 -70537 -30697 22175 4014 -24828 -34944 -15824 -20660 4540 -40111 -39047 6865 -37480
16360 -37480 -11646 14296 -4722 25022 11565 32226 2029 -17300 -12027 19403 -18630 -38515
16348 -38515 -58983 -113953 -114216 -56662 -26441 -13769 -59912 -27828 -21605 -53902 -60908 -63961 -39853
16335 -39853 -8784 15697 23286 11462 13875 16233 33858 3555 -21537 -15940 -5537 -52872
$$ packed form
16422b7710K3440j5327K6392M6161n4945j4982j8257j3138k5003j869K5915K8565
16410b0758L734p5748p787M3860K2749n7066j0029j071k1680L5165L1407R371
16398d7853Q884O814R237q170K1408m1309J0569N5996k9697n4428L109j0655L2249
16385d3846p556J4057M201n1976L1939K835k5090N423L9165k6041k9487r529K5368
16372g0537L9840N2872j8161k8842j0116J9120m836K5200m4651J064M5912m4345
16360c7480K5834K5942j9018K9744j3457K0661l0197j9329N273L1430l8033j9885
16348c8515k0468n4970k63N7554L0221J2672m6143L2084O223l2297p006l053K4108
16335c9853L1069K4481P589j1824K413K358J7625l0303k5092N597J0403m7335
$$ plain form
16323 -52872 -112435 -136723 -101227 -58708 -61591 -37297 -21149 47302 29152 -38127 -106819 -93260
16311 -93260 -627 38927 -8213 -55122 -60328 -2456 33962 26187 7368 -6668 -43131 -45932
16299 -45932 -36831 28742 45142 36209 37242 37838 21725 5528 -879 11793 -17980 -67469 -61333
16286 -61333 -43758 -36188 -34741 -31715 -12094 -50941 -67580 -9253 11062 -4300 -11058 -2069 3713
16273 3713 31900 48983 14878 -8254 22875 14887 -52227 -78879 -145080 -94759 -34858 7464
16261 7464 36425 954 -93107 -115267 -47374 -5116 -40539 -72029 -69028 1148 68329 53312
16249 53312 49642 21792 -18549 -73429 -121225 -124931 -100637 -108023 -124063 -69800 -32666 -47447
16237 -47447 -98517 -94836 -54544 -18772 -6869 -17223 -4681 16576 -17947 -29982 7735 -241
$$ packed form
16323e2872n9563k4288L5496M2519k883K4294J6148O8451j8150o7279o8692J3559
16311i3260R2633L9554m7140m6909n206N7872L6418p775j8819j4036l6463k801
16299d5932R101O5573J6400q933J033N96j6113j6197o407J2672k9773m9489O136
16286f1333J7575P570J447L026J9621l8847j6639N8327K0315j5362o758Q989N782
16273C713K8187J7083l4105k3132L1129p988o7114k6652o6201N0321N9901M2322
16261G464K8961l5471r4061k2160O7893M2258l5423l1490L001P0176O7181j5017
16249E3312l670k7850m0341n4880m7796l706K4294p386j6040N4263L7134j4781
16237d7447n1070L681M0292L5772J1903j0354J2542K1257l4523j2035L7717p976
$$ plain form
16225 -241 -18217 -27511 -23393 8588 43170 35268 30681 -4209 -46309 -95151 -99738 -72940 -68934
16212 -68934 -105634 -48473 -81177 -97924 -122429 -143786 -97291 -26610 -30334 -48010 36483 82947
16200 82947 59012 58840 60177 78612 69670 76385 69521 55954 2705 -17572 -26544 -52783 -38554
16187 -38554 -20703 -69818 -135250 -102786 -35849 -33472 -48668 -4947 49130 53874 81221 87954
16175 87954 31219 -60955 -101169 -27579 -17913 16555 11932 -3345 -37340 -23286 -25049 -14837
16163 -14837 -42335 -60724 -45165 -37677 -28923 -48169 2431 57337 67276 56258 34934 10768
16151 10768 -75485 -160525 -111838 -79577 -87828 -37944 1255 42332 120236 116654 62390 31237
16139 31237 16666 6160 -35453 -93184 -64126 28268 3956 -19992 -79443 -79196 -76292 -28483
$$ packed form
16225b41j7976r294M118L1981L4582p902m587l4890m2100m8842m587K6798M006
16212f8934l6700N7161l2704j6747k4505k1357M6495P0681l724j7676Q4493M6464
16200H2947k3935j72J337J8435q942O715o864j3567n3249k0277q972k6239J4229
16187c8554J7851m9115o5432L2464O6937K377j5196M3721N4077M744K7347O733
16175H7954n6735r2174m0214P3590R666L4468m623j5277l3995J4054j763J0212
16163a4837k7498j8389J5559P488Q754j9246N0600N4906R939j1018k1324k4166
16151A0768q6253q5040M8687L2261q251M9884L9199M1077P7904l582n4264l1153
16139C1237j4571j0506m1613n7731K9058R2394k4312k3948n9451K47K904M7809
$$ plain form
16127 -28483 -1992 -7203 -25215 -14413 -8564 -31813 -79503 -87191 -115113 -71096 -52966 -48598
16115 -48598 -55332 -36708 673 2555 9437 -4486 -32167 -43637 -59797 -25572 20279 8255
16103 8255 -67399 -76887 -67389 -58973 -41156 -19390 -8134 -33115 -65353 -70197 -71481 -47631 -6315
16090 -6315 -602 4664 -3162 -63942 -87441 -71019 -64837 -25697 -24951 -30913 -7600 -40713 -59801
16077 -59801 -60126 -99166 -122632 -61168 690 -19058 -83700 -99751 -76656 -35153 -13823 -34564
16065 -34564 31018 -11804 -34870 -8444 -13741 -37616 -30451 -42595 -52849 -94246 -54220 -22252
16053 -22252 8946 34446 50492 24985 -7628 -28549 -55640 -74450 -4417 30490 14569 -9358
16041 -9358 -30522 -60571 -67294 -56129 -26855 25404 19968 1839 -34496 -63711 -23066 18485
$$ packed form
16127b8483K6491n211j8012J0802N849k3249m7690p688k7922M4017J8130M368
16115d8598o734J8624L7381J882O882j3923k7681j1470j6160L4225M5851j2024
16103H255p5654r488R498Q416J7817K1766J1256k4981l2238m844j284K3850M1316
16090f315N713N266p826o0780k3499J6422O182L9140P46n962K3313l3113j9088
16077e9801l25l9040k3466O1464O1858j9748o4642j6051K3095M1503K1330k0741
16065c4564O5582m2822k3066K6426n297k3875P165j2144j0254m1397M0026L1968
16053b2252L1198K5500J6046k5507l2613k0921k7091j8810P0033L4907j5921k3927
16041i358k1164l0049o723J1165K9274N2259n436j8129l6335k9215M0645M1551
$$ plain form
16029 18485 22783 48199 25474 25073 -5453 -14379 -59161 -44871 -18945 36427 44745 -10469 5244
16016 5244 43521 12396 -36042 -58394 -32391 -30346 -47514 -40502 -38942 -21158 14047 51105
16004 51105 14408 13241 -18476 -12376 -8647 -58134 -59452 8796 61116 50264 2108 -15926
15992 -15926 -20809 -114036 -126307 -57594 -39497 -49097 -32479 27131 31153 28356 12523 -18196
15980 -18196 -56137 -29593 10731 -25102 -31497 11004 43479 19635 51735 65593 6516 -42285
15968 -42285 -95466 -52563 10489 5243 -18714 37565 41351 9539 28405 7200 -11994 -19404
15956 -19404 6133 57938 90414 64331 -4717 -32928 -35180 -41199 -3227 6769 -17441 -36820
15944 -36820 -81000 -89068 -8656 27949 -534 -55384 -62681 -60237 -44773 -94733 -122123 -126419
$$ packed form
16029A8485M298K5416k2725m01l0526q926m4782J4290K5926N5372Q318n5214J5713
16016E244L8277l1125m8438k2352K6003K045j7168P012J560J7784L5205L7058
16004E1105l6697j167l1717O100L729m9487j318O8248N2320j0852m8156j8034
15992a5926m883r3227j2271O8713J8097r600J6618N9610M022k797j5833l0719
15980a8196l7941K6544M0324l5833o395M2501L2475k3844L2100J3858n9077m8801
15968d2285n3181M2903O3052n246k3957N6279L786l1812J8866k1205j9194p410
15956a9404K5537N1805L2476k6083o9048k8211k252o019L7972R996k4210j9379
15944c6820m4180q068Q0412L6605k8483n4850p297K444J5464m9960k7390m296
$$ plain form
15932 -126419 -143648 -109612 -28057 45856 31296 712 -1430 -43752 -56010 -51136 -35660 -16510
15920 -16510 53519 37438 -1267 -36405 -78655 -80022 -64795 -12983 18462 -25346 -80115 -81178
15908 -81178 -108919 -122872 -80642 -49096 13362 -8333 -2045 183 -2424 -17802 -30045 -1966
15896 -1966 52718 57385 30069 31020 38647 42421 25315 -6509 -8972 -46521 -38522 47921 67088
15883 67088 53444 30901 29006 93476 99120 41185 87599 138266 202836 215874 217701 230421
15871 230421 196800 151685 147581 165474 114944 48512 36957 40340 16174 57717 76130 110002
15859 110002 63234 3618 35321 67150 40890 81527 83908 45750 36044 16466 7359 29587
15847 29587 22766 -4101 -11390 -66850 -90234 -64848 -26389 11409 24855 41766 24922 3661
$$ packed form
15932a26419j7229L4036Q1555P3913j4560l0584k142m2322j2258M874J5476J9150
15920a6510P0029j6081l8705l5138m2250j367J5227N1812L1445m3808n4769j063
15908h1178k7741j3953M2230L1546O2458k1695O288K228k607j5378j2243K8079
15896a966N4684M667k7316R51P627L774j7106l1824k463l7549P999Q6443J9167
15883F7088j3644k2543j895O4470N644n7935M6414N0667O4570J3038J827J2720
15871B30421l3621m5115m104J7893n0530o6432j1555L383k4166M1543J8413L3872
15859A10002m6768n9616L1703L1829k6260M0637K381l8158r706j9578r107K2228
15847B9587o821k6867p289n5460k3384K5386L8459L7798J3446J6911j6844k1261
$$ plain form
15835 3661 73213 130226 115787 92278 83050 54717 26091 31787 -4740 -53120 -40048 -25213
15823 -25213 -56356 -44426 32247 -9719 5951 -14332 31676 6471 3661 2081 -46247 -51425
15811 -51425 -2569 7667 -22769 -31071 -32026 -53647 -41221 -3825 -17812 -33072 10061 67178
15799 67178 94776 65177 14198 -41510 -33549 -33356 -30848 27466 11821 -13988 27070 75705
15787 75705 54632 25641 16593 8651 -23541 -85169 -117354 -57149 2325 -29054 12389 14387
15775 14387 -4163 24789 75831 87999 118200 121655 127560 119676 188249 241441 271572 233135
15763 233135 186719 178530 151742 162551 161190 125987 79568 40709 62986 -11357 -51434 -870
15751 -870 -25889 39031 25719 -56379 -88826 -9948 -11454 34140 31425 -3612 -3899 -61468 -79144
$$ packed form
15835C661O9552N7013j4439k3509r228k8333k8626N696l6527m8380J3072J4835
15823b5213l1143J1930P6673m1966J5670k0283M6008k5205k810j580m8328n178
15811e1425M8856J0236l0436q302r55k1621J2426L7396j3987j5260M3133N7117
15799F7178K7598k9599n0979n5708P961J93K508N8314j5645k5809M1058M8635
15787G5705k1073k8991r048p942l2192o1628l2185O0205N9474l1379M1443J998
15775A4387j8550K8952N1042J2168L0201L455N905p884O8573N3192L0131l8437
15763B33135m6416q189k6788J0809j361l5203m6419l8859K2277p4343m0077N0564
15751h70k5019O4920j3312q2098l2447P8878j506M5594k715l5037k87n7569j7676
$$ plain form
15738 -79144 -46244 -35899 -16055 -3397 12938 74598 69239 7925 -56972 -79941 -66150 -92735
15726 -92735 -109394 -103590 -120629 -43548 36763 94934 126200 94684 54567 37179 19280 31889
15714 31889 27076 30449 -25545 -59138 -27746 -21338 -26434 22458 26695 71193 69851 6551 37559
15701 37559 31611 25462 9879 29685 30774 29543 30343 20058 21972 77145 54997 30933 55179
15688 55179 72955 64939 35552 -13293 -60044 -55948 -49320 -18704 28869 38296 2547 -27162
15676 -27162 -53439 1448 27802 -3239 -11044 -39403 -24722 -12210 1924 42743 60046 70659
15664 70659 68885 23236 5734 20003 13598 21563 30339 13584 -16368 -81659 -92358 -24066
15652 -24066 -17555 16717 -2207 -38623 -4547 9706 -47773 -34937 -28002 -39681 -51150 -77127
$$ packed form
15738g9144L2900J0345J9844J2658J6335O1660n359o1314o4897k2969J3791k6585
15726i2735j6659N804j7039P7081Q0311N8171L1266l1516m0117j7388j7899J2609
15714C1889m813L373n5994l3593L1392O408n096M8892M237M4498j342o3300L1008
15701C7559n948o149j5583J9806J089j231Q00j0285J914N5173k2148k4064K4246
15688E5179J7776q016k9387m8845m6751M096O628L0616M7573R427l5749k9709
15676b7162k6277N4887K6354l1041p805k8359J4681J2512J4134M0819J7303J0613
15664G0659j774m5649j7502J4269o405P965Q776j6755k9952o5291j0699O8292
15652b4066O511L4272j8924l6416L4076J4253n7479J2836O935j1679j1469k5977
$$ plain form
15640 -77127 -56125 40309 90694 92300 58830 14596 6933 17942 -676 -43029 -43344 -46864 -54364
15627 -54364 30317 20220 -46606 -27679 -29960 -24065 -17955 -27844 27684 27442 31475 36063 10595
15614 10595 -9268 38678 40764 39416 48247 30112 26201 48449 69369 43524 49824 18200 -1196
15601 -1196 26302 -10245 37691 128278 140283 63950 69098 84893 71790 80770 62431 56665
15589 56665 44336 -3601 6980 61093 82282 109299 53346 83499 73941 78723 15246 -61148
15577 -61148 -31549 -29819 13597 63462 66602 60944 123463 94442 17633 -48249 -91021 -35683
15565 -35683 39533 73593 37422 19554 38194 24869 18677 21699 -22989 11806 28656 41514
15553 41514 58247 18714 6453 -915 -7917 -53263 -38411 7142 18349 15215 12768 8854 16501
$$ packed form
15640g7127K1002R6434N0385J606l3470m4234p663J1009j8618m2353l15l520p500
15627e4364Q4681j0097o6826J8927k281N895O110r889N5528k42M033M588k5468
15614A0595j9863M7946K086j348Q831j8135l911K2248K0920k5845O300l1624j9396
15601a196K7498l6547M7936R0587J2005p6333N148J5795j3103Q980j8339n766
15589E6665j2329m7937J0581N4113K1189K7017n5953L0153r558M782o3477p6394
15577f1148K9599J730M3416M9865L140n658O2519k9021p6809o5882m2772N5338
15565c5683P5216L4060l6171j7868J8640j3325o192L022m4688L4795J6850J2858
15553D1514J6733l9533j2261p368p002m5346J4852M5553J1207l134k447l914P647
$$ plain form
15540 16501 -30885 -22292 -30097 6337 47488 59509 24022 3818 11217 22277 -15856 -24612
15528 -24612 -2162 1128 -8012 -22957 -45075 -18365 20803 -1158 -14688 9603 30664 25674
15516 25674 22816 -7813 -25272 -36193 -65241 -107581 -104280 -78437 -70684 -43759 -13357 -21680
15504 -21680 -37347 -54278 16214 60015 93058 74480 78893 88754 84403 50933 63686 46336
15492 46336 18546 31237 33231 51795 60465 46406 27731 54296 84828 89765 81370 93497
15480 93497 94290 67087 53277 42212 22660 41712 56658 77986 44666 30277 17044 18346
15468 18346 18078 64765 52985 -11814 6443 18285 18114 35909 42714 85301 104164 115952 64726
15455 64726 17154 24308 -17884 -22352 24033 27194 24541 35246 14627 -4443 -46937 -34104
$$ packed form
15540A6501m7386Q593p805L6434M1151J2021l5487k0204P399J1060l8133q756
15528b4612K2450L290r140j4945k2118K6710L9168k1961j3530K4291K1061m990
15516B5674k858l0629j7459j0921k9048m2340L301K5843P753K6925L0402q323
15504b1680j5667j6931P0492M3801L3043j8578M413R861m351l3470J2753j7350
15492D6336k7790J2691J994J8564Q670j4059j8675K6565L0532M937q395J2127
15480I3497P93k7203j3810j1065j9552J9052J4946K1328l3320j4389j3233J302
15468A8346k68M6687j1780o4799J8257J1842j71J7795O805M2587J8863J1788n1226
15455F4726m7572P154m2192m468M6385L161k653J0705k0619j9070m2494J2833
$$ plain form
15443 -34104 -25669 -10549 21166 73595 55498 23114 12688 44277 44970 12901 33532 101307
15431 101307 81119 57537 86920 22563 -38989 -62563 -48436 -46236 33423 21662 28566 47446
15419 47446 62691 66049 -8769 -80883 -110357 -110488 -93349 -102232 -52470 38275 30134 65164 55858
15406 55858 -1410 27145 68959 86508 66429 47221 16466 53390 38716 42563 45742 39498
15394 39498 48786 33343 48436 69528 38293 20701 20203 -25 42886 48896 80365 115310
15382 115310 115371 77663 8525 -25022 -6456 43955 103239 117028 109772 60052 79118 57540
15370 57540 57787 18440 -6619 -7585 -40199 -35330 -43401 11377 40974 20391 59609 28276 3784
15357 3784 28010 12633 -3958 756 -10429 -2479 9313 49294 65970 97012 49596 -1588
$$ packed form
15443c4104Q435J5120L1715N2429j8097l2384j0426L1589O93l2069K0631O7775
15431A01307k0188k3582K9383o4357o1552k3574J4127K200P9659j1761O904J8880
15419D7446J5245L358p4818p2114k9474j31J7139q883M9762R0745q141L5030r306
15406E5858n7268K8555M1814J7549k0079j9208l0755L6924j4674L847L179o244
15394C9498R288j5443J5093K1092l1235j7592m98k0228M2911O010L1469L4945
15382A15310O1l7708o9138l3547J8566N0411N9284J3789p256m9720J9066k1578
15370E7540K47l9347k5059r66l2614M869q071N4778K9597k0583L9218l1333k4492
15357C784K4226j5377j6591M714j1185P950J1792L9981J6676L1042m7416n1184
$$ plain form
15345 -1588 18573 58241 61179 73338 27908 -7307 -759 27051 33693 38947 60507 137973 138627
15332 138627 121040 112478 85770 50740 21281 44647 18734 2868 1723 -5230 -1042 -24305
15320 -24305 -45887 94 24872 5217 54278 78335 72201 17115 9157 27413 35409 34257
15308 34257 53004 48122 55499 96788 96813 58345 38447 36207 55668 36188 43511 59931 64987
15295 64987 51558 50319 63219 108945 81809 73287 19629 10522 33660 19557 19587 37855 89
15282 89 21824 28350 37990 2428 -16292 -19057 -42481 -6864 60185 100327 78540 62753 47011
15269 47011 24751 33111 46305 17862 1729 8242 73458 132399 84426 50166 21879 3431
15257 3431 -25807 -51134 -52076 8570 -9879 1433 -23287 -30273 9308 73505 88286 56025
$$ packed form
15345a588K0161L9668K938J2159m5430l5215O548K7810O642N254K1560P7466O54
15332A38627j7587q562k6708l5030k9459K3366k5913j5866j145o953M188k3263
15320b4305k1582M5981K4778j9655M9061K4057o134n5086p958J8256P996j152
15308C4257J8747m882P377M1289K5l8468j9898k240J9461j9480P323J6420N056
15295F4987j3429j239J2900M5726k7136q522n3658r107K3138j4103L0J8268l7766
15282H9K1735O526R640l5562j8720k765k3424L5617O7049M0142k1787j5787j5742
15269D7011k2260Q360J3194k8443j6133O513O5216N8941m7973l4260k8287j8448
15257C431k9238k5327r42O0646j8449J1312k4720o986L9581O4197J4781l2261
$$ plain form
15245 56025 34011 29897 69710 34920 3540 23315 26928 -1885 -5289 29471 104873 175522
15233 175522 179232 110441 94519 47889 26959 74543 122828 149197 107867 85147 101279 137584
15221 137584 129766 115159 149721 136609 97389 96132 43108 19182 16712 42061 53195 71473
15209 71473 126904 89552 64733 96891 102094 93218 79891 90336 98447 106477 53137 61920 111934
15196 111934 104001 94565 13490 -60762 -37840 11255 29056 -3976 -12086 15863 63419 50466
15184 50466 46057 66962 99230 90450 50706 90004 89549 19891 44480 67684 48781 75147
15172 75147 114995 105967 114518 106525 148559 96933 27087 -9449 14685 3614 -21524 -17433
15160 -17433 16856 95602 109126 68558 47555 -15224 22381 106058 133046 110797 63571 95414
$$ packed form
15245E6025k2014m114L9813l4790l1380J9775L613k8813l404L4760P5402P0649
15233A75522L710o8791j5922m6630k0930M7584M8285K6369m1330k2720J6132L6305
15221A37584p818j4607L4562j3112l9220j257n3024k3926k470K5349J1134J8278
15209G1473N5431l7352k4819L2158N203q876j3327J0445Q111Q030n3340Q783N0014
15196A11934p933r436q1075p4252K2922M9095J7801l3032q110K7949M7556j2953
15184E0466m409K0905L2268q780l9744L9298m55o9658K4589K3204j8903K6366
15172G5147L9848r028Q551p993M2034n1626o9846l6536K4134j1071k5138M091
15160a7433L4289P8746J3524m0568k1003o2779L7605Q3677K6988k2249m7226L1843
$$ plain form
15148 95414 106009 45438 32219 52625 33514 -5486 11117 40682 51780 56790 61383 46257
15136 46257 28784 39467 104496 133225 161118 193053 185964 222227 232654 238857 295712 372181
15124 372181 416124 414709 420917 409233 400840 379540 330987 276655 217851 160327 142766 140772
15112 140772 85000 99842 128212 58926 84037 139496 115695 80079 22503 30728 95821 178209
15100 178209 109871 64352 62105 117771 172275 212584 182813 141634 77527 36804 11808 18372
15088 18372 9610 5896 39565 65163 108736 125842 135979 180776 192853 192390 174434 161607
15076 161607 164951 156527 119314 122592 75902 58558 90618 94177 32624 70479 154590 142735
15064 142735 138278 170831 131405 73773 24367 -9054 -10684 -2883 51442 67511 54464 23504
$$ packed form
15148I5414J0595o0571j3219K0406j9111l9000J6603K9565J1098N010M593j5126
15136D6257j7473J0683O5029K8729K7893L1935p089L6263J0427O203N6855P6469
15124C72181M3943j415O208j1684q393k1300m8553n4332n8804n7524j7561j994
15112A40772n5772J4842K8370o9286K5111N5459k3801l5616n7576Q225O5093Q2388
15100A78209o8338m5519k247N5666N4504M0309k9771m1179o4107m0723k4996O564
15088A8372q762l714L3669K5598M3573J7106J0137M4797J2077m63j7956j2827
15076A61607L344q424l7213L278m6690j7344L2060L559o1553L7855Q4111j1855
15064A42735m457L2553l9426n7632m9406l3421j630P801N4325J6069j3047l0960
$$ plain form
15052 23504 50440 69542 23956 11912 -27888 -45900 -30306 -43457 19766 40607 19665 48214
15040 48214 74689 89674 112241 153961 172346 141317 148905 218482 196772 145969 178461 211577
15028 211577 189341 183472 158088 145659 180161 198906 138518 105185 133547 171848 165304 113698
15016 113698 71810 96768 154518 177129 173663 111197 96055 127260 168827 224609 277744 225194
15004 225194 181279 177570 138268 141167 150264 164863 195797 260017 273405 270886 276509 262446
14992 262446 201414 144275 106736 126295 153154 101777 109465 153632 201155 262187 195983 169376
14980 169376 200122 191365 204087 208336 225949 233479 214185 169599 197310 207086 190661 172314
14968 172314 175306 165590 168252 233093 193447 182761 175698 150760 125165 132784 143730 127221
$$ packed form
15052B3504K6936J9102m5586j2044l9800j8012J5594j3151O3223K0841k0942K8549
15040D8214K6475J4985K2567M1720J8385l1029P588O9577k1710n0803L2492L3116
15028B11577k2236n869k5384j2429L4502J8745o0388l3333K8362L8301o544n1606
15016A13698m1888K4958N7750K2611l466o2466j5142L1205M1567N5782N3135n2550
15004B25194m3915l709l9302K899R097J4599L0934O4220J3388k519N623j4063
14992B62446o1032n7139l7539J9559K6859n1377P688M4167M7523O1032o6204k6607
14980A69376L0746q757J2722M249J7613P530j9294m4586K7711R776j6425j8347
14968A72314K992r716K662O4841l9646j0686p063k4938k5595P619J0946j6509
$$ plain form
14956 127221 114705 142169 102722 123009 172841 203887 198277 170919 194079 181937 125550 96937
14944 96937 150061 221850 174081 83892 96430 118845 82868 122627 112112 75336 109003 196236
14932 196236 183053 156305 162521 157066 135764 160075 173203 154919 162290 183547 164684 167934
14920 167934 143029 127715 205794 214518 165147 104184 38594 5007 32702 96029 143908 106696
14908 106696 86993 45441 20922 17915 17900 -27990 -14883 49560 111895 155599 135206 114067
14896 114067 131054 88310 105599 94423 79701 101556 66831 39045 101842 128269 143954
14885 143954 175009 195108 231529 186137 119230 169967 200058 202636 189517 145425 123458 167132
14873 167132 195916 136594 129524 179756 182478 201043 204705 168959 178186 138981 113801 111010
$$ packed form
14956A27221j2516K7464l9447K0287M9832L1046n610k7358K3160j2142n6387k8613
14944I6937N3124P1789m7769r0189J2538K2415l5977L9759j0515l6776L3667Q7233
14932A96236j3183k6748O216n455k1302K4311J3128j8284P371K1257j8863L250
14920A67934k4905j5314P8079Q724m9371o0963o5590l3587K7695O3327M7879l7212
14908A06696j9703m1552k4519l007j5m5890J3107O4443O2335M3704k0393k1139
14896A14067J6987m2744J7289j1176j4722K1855l4725k7786O2797K6427J5685
14885A43954L1055K0099L6421m5392o6907N0737L0091K578j3119m4092k1967M3674
14873A67132K8784n9322p070N0232K722J8565L662l5746R227l9205k5180k791
$$ plain form
14861 111010 80214 46922 37646 21783 12779 55823 72292 136786 163574 211187 162820 135422
14849 135422 132781 133308 198899 196570 168432 130434 117321 160506 255448 239966 218134 186589
14837 186589 192831 196217 237417 222886 215594 225135 196173 193340 134928 102919 43330 10694
14825 10694 43098 68607 67468 71605 177028 234538 245212 177556 140460 150283 164176 183730
14813 183730 164505 179877 211633 246724 260650 234048 226880 224612 229830 193080 173908 181264
14801 181264 189493 165154 178001 179051 242672 239928 182508 225316 255868 249889 225179 221653
14789 221653 167840 102882 123341 132303 107494 173764 217340 159546 154632 160255 162152 131253
14777 131253 125731 150123 187627 170390 135134 102424 139020 183757 170443 149332 139335 133623
$$ packed form
14861A11010l0796l3292r276j5863r004M3044J6469O4494K6788M7613m8367k7398
14849A35422k641N27O5591k329k8138l7998j3113M3185R4942j5482k1832l1545
14837A86589O242L386M1200j4531p292R541k8962k833n8412l2009n9589l2636
14825A0694L2404K5509j139M137J05423N7510J0674o7656l7096R823J3893J9554
14813A83730j9225J5372L1756L5091J3926k6602p168k268N218l6750j9172P356
14801A81264Q229k4339J2847J050O3621k744n7420M2808L0552n979k4710l526
14789B21653n3813o4958K0459Q962k4809O6270M3576n7794m914N623J897l0899
14777A31253n522K4392L7504j7237l5256l2710L6596M4737j3314k1111r997n712
$$ plain form
14765 133623 126547 138272 133032 148855 97596 99914 148677 164908 152299 140347 117579 106542
14753 106542 92032 64393 83389 122090 153529 203322 174784 127799 124403 156889 170337 190745
14741 190745 177481 137768 134034 202283 194565 168208 208887 208462 182797 183922 133764 112990
14729 112990 110167 136905 149679 138392 170319 138972 141413 146493 153344 137026 193616 244297
14717 244297 226772 194928 199763 159640 141554 159776 232665 268919 250969 239767 203918 211119
14705 211119 219797 175876 165117 222306 286854 305268 311486 338256 301142 305004 304640 250508
14693 250508 264500 324176 286295 213651 210173 183618 168362 231193 241801 190928 236943 343422
14681 343422 401400 376008 340396 346505 292316 272211 302164 286266 292214 321927 309946 270034
$$ packed form
14765A33623p076J1725n240J5823n1259K318M8763J6231j2609j1952k2768j1037
14753A06542j4510k7639J8996L8701L1439M9793k8538m6985l396L2486J3448K0408
14741A90745j3264l9713l734O8249p718k6357M0679m25k5665J125n0158k0774
14729A12990k823K6738J2774j1287L1927l1347K441N080O851j6318N6590N0681
14717B44297j7525l1844M835m0123j8086J8222P2889L6254j7950j1202l5849P201
14705B11119Q678m3921j0759N7189O4548J8414O218K6770l7114L862l64n4132
14693B50508J3992N9676l7881p2644l478k6555j5256O2831J0608n0873M6015J06479
14681C43422N7978k5392l5612O109n4189k0105K9953j5898N948K9713j1981l9912
$$ plain form
14669 270034 253086 224441 230634 249380 333600 398882 416035 442895 540832 519501 405041
14658 405041 363136 359800 359872 332342 291669 305194 404315 383023 316089 344695 324231 245342
14646 245342 200254 210741 204543 238792 228145 204542 145612 147731 224140 238110 206157 207601
14634 207601 189733 160765 153903 189631 228398 244786 184995 178453 193990 196648 222440 287344
14622 287344 307828 329055 357738 385546 393188 354799 305465 330763 279086 195387 223459 207198
14610 207198 208967 182493 204658 214118 182913 208262 215252 244795 266108 206428 186839 213179
14598 213179 231322 277078 255450 295141 321014 311518 280436 267436 312629 342877 317715 260936
14586 260936 271161 231546 189216 173525 129646 103516 162764 197835 213639 226586 207979
$$ packed form
14669B70034j6948k8645O193J8746Q4220O5282J7153K6860R7937k1331j14460
14658D05041m1905l336P2k7530m0673J3525R9121k1292o6934K8606k0464p8889
14646B45342m5088J0487o198L4249j0647k3603n8930K119P6409J3970l1953J444
14634B07601j7868k8968o862L5728L8767J6388n9791o542J5537K658K5792O4904
14622B87344K0484K1227K8683K7808P642l8389m9334K5298n1677q3699K8072j6261
14610B07198J769k6474K2165R460l1205K5349O990K9543K1313n9680j9589K6340
14598B13179J8143M5756k1628L9691K5873r496l1082j3000M5193L0248k5162n6779
14586B60936J0225l9615m2330j5691m3879k6130N9248L5071J5804J2947j8607
$$ plain form
14575 207979 211650 199600 214874 260225 267314 276080 282799 236346 247343 321537 322484 331929 302668
14562 302668 318721 349352 336705 321734 294353 326293 387322 442533 422672 381015 338914
14551 338914 423041 447016 413819 462483 480610 521603 539658 570027 618784 700108 761441
14540 761441 850278 924672 1030133 1146639 1268253 1381730 1499756 1599800 1645093 1657296
14530 1657296 1656637 1622490 1496307 1358446 1308184 1269250 1202242 1085832 937761 890967 861965
14519 861965 817330 754412 725041 713839 761192 783069 835080 827108 777689 789294 881271 955536
14507 955536 983943 1013534 1068131 1181615 1266968 1308570 1394339 1495965 1607970 1652317 1636046
14496 1636046 1612773 1523856 1464755 1430936 1364736 1198747 1031757 961477 856903 759307 738520
$$ packed form
14575B07979L671j2050J5274M5351P089Q766O719m6453J0997P4194R47R445k9261
14562C02668J6053L0631j2647j4971k7381L1940O1029N5211j9861m1657m2101
14551C38914Q4127K3975l3197M8664J8127M0993J8055L0369M8757Q1324O1333
14540G61441Q8837P4394J05461J16506J21614J13477J18026J00044M5293J2203
14530A657296o59l4147j26183j37861n0262l8934o7008j16410j48071m6794k9002
14519H61965m4635o2918k9371j1202M7353K1877N2011p972m9419J1605R1977P4265
14507I55536K8407K9591N4597J13484Q5353M1602Q5769J01626J12005M4347j6271
14496A636046k3273q8917n9101l3819o6200j65989j66990p0280j04574r7596k0787
$$ plain form
14485 738520 653890 601754 534174 455063 442445 429750 387250 360178 354809 375486 318371 274092
14473 274092 286303 320957 309008 290893 266493 260281 255315 281254 295515 228120 227692 236920
14461 236920 252781 275929 293836 323901 303141 331520 364622 338453 280660 270594 225941
14450 225941 229892 305379 318112 353932 344072 290900 261512 320449 364623 368524 361116 319151
14438 319151 315251 335308 369586 332864 319751 328588 328030 347944 386865 314249 252329 257907
14426 257907 260332 238733 213793 294853 321129 269346 229693 316680 442741 451321 446383 417621
14414 417621 381579 337641 331645 360853 354733 368609 401575 386681 399843 366373 332779 302882
14402 302882 277532 281740 311512 365024 327058 299920 298557 323106 345181 378732 351181 348458
$$ packed form
14485G38520q4630n2136o7580p9111j2618j2695m2500k7072n369K0677n7115m4279
14473B74092J2211L4654j1949j8115k4400o212m966K5939J4261o7395m28R228
14461B36920J5861K3148J7907L0065k0760K8379L3102k6169n7793j0066m4653
14450B25941L951P5487J2733L5820r860n3172k9388N8937M4174L901p408m1965
14438C19151l900K0057L4278l6722j3113Q837n58J9914L8921p2616o1920N578
14426B57907K425k1599k4940Q1060K6276n1783l9653Q6987J26061Q580m938k8762
14414D17621l6042m3938n996K9208o120J3876L2966j4894J3162l3470l3594k9897
14402C02882k5350M208K9772N3512l7966k7138j363K4549K2075L3551k7551k723
$$ plain form
14390 348458 338299 325934 308345 331903 350293 361305 351153 383102 395146 441901 435247 402138
14378 402138 443524 482599 516607 516023 531637 549700 604627 635658 581952 556207 572042 580675
14366 580675 580654 543140 468672 410405 462440 490635 460616 437930 425524 379600 407858 444932
14354 444932 450875 461345 470958 454035 467908 535228 522004 561332 549761 548743 602190 611393
14342 611393 659569 614338 626762 641601 629886 646147 683910 711516 712716 707898 696797 667191
14330 667191 613439 631746 615647 601017 642101 647562 637247 669708 687736 742011 796691 820152
14318 820152 795136 727900 749235 820528 858244 829777 795118 766204 733552 696443 681148
14307 681148 740803 757404 746587 727058 676180 636056 697434 754599 804982 794488 743267
$$ packed form
14390C48458j0159j2365j7589K3558J8390J1012j0152L1949J2044M6755o654l3109
14378D02138M1386L9075L4008n84J5614J8063N4927L1031n3706k5745J5835Q633
14366E80675k1l7514p4468n8267N2035K8195l0019k2686j2406m5924K8258L7074
14354D44932N943J0470R613j6923J3873O7320j3224L9328j1571j018N3447R203
14342F11393M8176m5231J2424J4839j1715J6261L7763K7606J200m818j1101k9606
14330F67191n3752J8307j6099j4630M1084N461j0315L2461J8028N4275N4680K3461
14318H20152k5016o7236K1335P1293L7716k8467l4659k8914l2652l7109j5295
14307F81148N9655J6601j0817j9529n0878m0124O1378N7165N0383j0494n1221
$$ plain form
14296 743267 774538 743901 753510 758280 749887 747321 741315 764874 728377 710770 699870 659393
14284 659393 655744 673668 652387 649325 673514 706298 643577 658012 666859 650798 653757 653089 653379
14271 653379 691789 753660 803820 822793 837965 824138 815842 830220 813733 725025 671546 639651
14259 639651 591490 580451 617793 587717 580119 633104 670995 701284 689122 725990 765697 718138
14247 718138 670748 674518 720343 719628 709597 676946 690413 765733 783629 778671 782152 792781
14235 792781 801473 787900 755226 726782 710673 759190 731317 728980 793791 861752 873448 870807
14223 870807 904851 891243 871155 883439 931660 990335 1046606 1044845 1118745 1150381 1170014 1208384
14211 1208384 1243831 1251925 1266233 1299679 1316719 1300504 1229131 1179120 1173363 1220586 1201442 1164803
$$ packed form
14296G43267L1271l0637R609M770q393k566o006K3559l6497j7607j0900m0477
14284F59393l649J7924k1281l062K4189L2784o2721J4435Q847j6061K959o68K90
14271F53379L8410O1871N0160J8973J5172j3827q296J4378j6487q8708n3479l1895
14259F39651m8161j1039L7342l0076p598N2985L7891L0289j2162L6868L9707m7559
14247G18138m7390L770M5825p15j0031l2651J3467P5320J7896m958L481J0629
14235G92781Q692j3573l2674k8444j6109M8517k7873k337O4811O7961J1696k641
14223H70807L4044j3608k0088J2284M8221N8675N6271j761P3900L1636J9633L8370
14211A208384L5447Q094J4308L3446J7040j6215p1373n0011n757M7223j9144l6639
$$ plain form
14199 1164803 1188717 1103302 1021833 1056622 1039653 1042975 1072431 1073983 1120397 1181499 1164906 1166143
14187 1166143 1212248 1214981 1262729 1283763 1260426 1279415 1327226 1364231 1413163 1493487 1595516
14176 1595516 1622527 1651955 1705329 1664239 1643466 1615559 1592704 1596595 1672555 1710158 1713381 1690518
14164 1690518 1645879 1553277 1513203 1591452 1666728 1707630 1761349 1753681 1816406 1863837 1931441
14153 1931441 1969889 1984553 2026687 2122720 2166556 2175350 2200143 2233735 2313082 2451825 2478316
14142 2478316 2534025 2612488 2708319 2745920 2810238 2918425 2996092 3104671 3205974 3263427 3353043
14131 3353043 3459569 3614716 3765861 3909162 4011609 4150883 4367404 4555449 4737716
14122 4737716 4962375 5137849 5337084 5558569 5764899 6099177 6465279 6798862 7193575
$$ packed form
14199A164803K3914q5415q1469L4789j6969L322K9456J552M6414O1102j6593J237
14187A166143M6105K733M7748K1034k3337J8989M7811L7005M8932Q0324J02029
14176A595516K7011K9428N3374m1090k0773k7907k2855L891P5960L7603L223k2863
14164A690518m4639r2602m0074P8249P5276M0902N3719p668O2725M7431O7604
14153A931441L8448J4664M2134R6033M3836Q794K4793L3592P9347J38743K6491
14142B478316N5709P8463R5831L7601O4318J08187P7667J08579J01303N7453Q9616
14131C353043J06526J55147J51145J43301J02447J39274K16521J88045J82267
14122D737716K24659J75474J99235K21485K06330L34278L66102L33583L94713
$$ plain form
14113 7193575 7683515 8178962 8705167 9328607 10086358 10922461 11887865 12976571 14225856
14104 14225856 15691834 17438875 19471973 21836782 24564961 27748040 31512093 36065597
14096 36065597 41508197 48076738 56142333 66217354 78649100 93760940 111552412
14089 111552412 131688720 153428725 176036552 198844913 220541121 239196735 253215675
14082 253215675 262031445 265765097 264190993 257008620 244971790 229512291 212205018
14075 212205018 194290415 176549543 159836838 144956809 132337588 122125743 114062384
14068 114062384 107896687 103363767 100356733 98654833 98167751 98878613 100821710 104108508
14060 104108508 108789462 115158161 123476344 134001735 146845082 162006121 179066037
$$ packed form
14113G193575M89940M95447N26205O23440P57751Q36103R65404J088706J249285
14104A4225856J465978J747041K033098K364809K728179L183079L764053M553504
14096C6065597N442600O568541Q065595J0075021J2431746J5111840J7791472
14089A11552412K0136308K1740005K2607827K2808361K1696208J8655614J4018940
14082B53215675Q815770L733652j574104p182373j2036830j5459499j7307273
14075B12205018j7914603j7740872j6712705j4880029j2619221j0211845q063359
14068A14062384o165697m532920l007034j701900m87082P10862J943097L286798
14060A04108508M680954O368699Q318183J0525391J2843347J5161039J7059916
$$ plain form
14053 179066037 197251708 215641943 233290035 249209167 261938188 269681264 271538261
14046 271538261 267724186 258692670 244546818 225606083 203275497 179530206 155903556
14039 155903556 133291385 112380840 93681155 77839785 64791155 54224897 45828697
14032 45828697 39011751 33391528 28821865 24947496 21646806 18881690 16549127 14558087
14024 14558087 12876469 11439286 10218501 9143455 8254788 7461069 6762062 6173262 5674743
14015 5674743 5255888 4899674 4497055 4145960 3865868 3618764 3356520 3116184 2911234
14006 2911234 2769585 2612273 2400224 2256389 2155565 2054332 1956198 1855353 1811035 1749728
13996 1749728 1688387 1674786 1693872 1651821 1599365 1545220 1532499 1556338 1559109 1533262 1450699
$$ packed form
14053A79066037J8185671J8390235J7648092J5919132J2729021P743076J856997
14046B71538261l814075r031516j4145852j8940735k2330586k3745291k3626650
14039A55903556k2612171k0910545j8699685j5841370j3048630j0566258q396200
14032D5828697o816946n620223m569663l874369l300690k765116k332563j991040
14024A4558087j681618j437183j220785j075046q88667p93719o99007n88800m98519
14015E674743m18855l56214m02619l51095k80092k47104k62244k40336k04950
14006B911234j41649j57312k12049j43835j00824j01233r8134j00845m4318o1307
13996A749728o1341j3601J9086m2051n2456n4145j2721K3839K771k5847q2563
$$ plain form
13985 1450699 1418445 1358607 1285941 1281602 1233419 1180199 1081799 1039459 1005517 974879 957312
13974 957312 935141 894727 802673 754672 749675 759941 731064 687088 649838 617181 657245 605243
13962 605243 569002 609623 631392 533138 539175 659520 657621 582336 563637 600064 574195 504219
13950 504219 463268 405343 351225 338021 324448 311116 323200 360445 390481 409472 326991
13939 326991 281091 293927 319909 402251 464240 477548 454615 437787 495108 534611 548993
13928 548993 510644 446544 473258 475171 480685 567993 620607 701189 831537 921495 993329 1019390
13916 1019390 1038433 1100230 1107900 1176581 1135757 1059164 1083601 1085784 1028604 954515 841475
13905 841475 770660 711158 637590 577661 554030 484057 391272 338166 239511 147086 155879 175182
$$ packed form
13985A450699l2254n9838p2666m339m8183n3220r8400m2340l3942l0638j7567
13974I57312k2171m0414r2054m8001m997J0266k8877m3976l7250l2657M0064n2002
13962F05243l6241M0621K1769r8254O037J20345j899p5285j8699L6427k5869o9976
13950E04219m0951n7925n4118j3204j3573j3332J2084L7245L0036J8991q2481
13939C26991m5900J2836K5982Q2342O1989J3308k2933j6828N7321L9503J4382
13928E48993l8349o4100K6714J913N514Q7308N2614Q0582J30348Q9958P1834K6061
13916A019390J9043O1797P670O8681m0824p6593K4437K183n7180p4089j13040
13905H41475p0815n9502p3568n9929k3631o9973r2785n3106r8655r2425Q793J9303
$$ plain form
13893 175182 188083 182203 105297 90958 110342 77176 34082 33110 63638 87417 88522 83172
13881 83172 103053 48585 -25803 -31753 50984 101632 138369 130220 96950 111503 77350 84589
13869 84589 66326 42719 -33254 -84120 -80748 -78721 -95717 -97176 -100646 -114877 -160318 -195588
13857 -195588 -192718 -140308 -122182 -82745 -45303 -22753 -38478 -64051 -109781 -158844 -181404 -154561
13845 -154561 -97509 -60366 -54421 -10199 18747 65815 100220 31875 -17127 5915 -366 19356
13833 19356 35669 33366 20581 23035 64027 39337 31111 31979 89452 182607 185398 165228 182948
13820 182948 221570 216082 213791 213566 220360 190100 192590 177372 100734 87725 128569 120173 131766
13807 131766 124343 149821 152872 169562 186302 163311 131245 106450 72312 84819 109949 115052
$$ packed form
13893A75182J2901n880p6906j4339J9384l3166m3094r72L0528K3779J105n350
13881H3172J9881n4468p4388n950Q2737N0648L6737q149l3270J4553l4153P239
13869H4589j8263k3607p5973n0866L372K027j6996j459l470j4231m5441l5270
13857a95588K870N2410J8126L9437L7442K2550j5725k5573m5730m9063k2560K6843
13845a54561N7052L7143N945M4222K8946M7068L4405o8345m9002K3042o281J9722
13833A9356J6313k303j2785K454M0992k4690q226Q68N7473R3155K791k0170J7720
13820A82948L8622n488k291k25O794l0260K490j5218p6638j3009M0844q396J1593
13807A31766p423K5478L051J6690J6740k2991l2066k4795l4138J2507K5130N103
$$ plain form
13795 115052 74190 76991 104708 147276 172248 131652 127271 175225 194018 142540 52888 -9693
13783 -9693 -20324 -24735 -5577 381 5303 10812 19620 -23815 -12827 -9876 -7199 34397 33097
13770 33097 5072 53040 79972 66260 15982 58240 76942 20378 -8569 -9438 28070 39114
13758 39114 3878 -59282 -52002 -24754 -23931 3377 -20779 -24581 -25478 595 42839 48239 35440
13745 35440 70580 123080 96556 122189 141021 139596 159307 130976 158175 185465 183467 175555
13733 175555 189708 264609 260914 231381 194698 141477 166712 170998 89733 22000 1328 -2001
13721 -2001 -33242 9977 77840 93157 166449 281629 381265 447427 499944 548308 569098 552049
13709 552049 527153 533239 503980 401751 328118 286276 242855 184953 124885 40263 2656
$$ packed form
13795A15052m0862K801K7717M2568K4972m0596m381M7954J8793n1478q9652o2581
13783i693j0631m411J9158N958M922N509Q808m3435J0988K951K677M1596j300
13770C3097k8025M7968K6932j3712n0278M2258J8702n6564k8947q69L7508J1044
13758C9114l5236o3160P280K7248Q23K7308k4156l802q97K6073M2244N400j2799
13745C5440L5140N2500k6524K5633J8832j425J9711k8331K7199K7290j998p912
13733A75555J4153P4901l695k9533l6683n3221K5235M286q1265o7733k0672l329
13721b001l1241M3219O7863J5317P3292J15180R9636O6162N2517M8364K0790j7049
13709E52049k4896O086k9259j02229p3633m1842m3421n7902o0068q4622l7607
$$ plain form
13698 2656 -24118 -46900 -53153 -35596 29260 73358 56736 71899 132861 207604 216434 147127
13686 147127 132573 166112 116325 120681 131589 154322 137579 79690 106046 168428 172241 150948
13674 150948 127202 80528 81694 110381 110169 77949 94380 101972 144456 170921 109475 107607
13662 107607 138553 223319 317052 378614 434063 513397 645344 813446 845788 635121 486893
13651 486893 425509 356350 308398 312402 348393 348430 346180 325986 320932 392817 404007 398026 453234
13638 453234 557450 637154 666760 721384 863793 983748 1114955 1213718 1335494 1410854
13628 1410854 1466382 1538034 1589208 1629708 1627735 1598762 1561117 1517737 1457783 1372922 1269352
13617 1269352 1210599 1190338 1163376 1245031 1414123 1668382 2081372 2581479 2660991 2108787
$$ packed form
13698B656k6774k2782o253J7557O4856M4098j6622J5163O0962P4743Q830o9307
13686A47127j4554L3539m9787M356J0908K2733j6743n7889K6356O2382L813k1293
13674A50948k3746m6674J166K8687k12l2220J6431P592M2484K6465o1446j868
13662A07607L0946Q4766R3733O1562N5449P9334J31947J68102L2342k10667j48228
13651D86893o1384o9159m7952M004L5991L7k250k0194n054P1885J1190n981N5208
13638D53234J04216P9704K9606N4624J42409J19955J31207R8763J21776P5360
13628A410854N5528P1652N1174M0500j973k8973l7645m3380n9954q4861j03570
13617A269352n8753k0261k6962Q1655J69092K54259M12990N00107P9512n52204
$$ plain form
13607 2108787 1508997 1195796 986122 893511 844453 837346 867049 912066 983315 1036662 1101180
13596 1101180 1180482 1236042 1344180 1372596 1475830 1556039 1597564 1519638 1434788 1334298 1222065
13585 1222065 1077355 973101 856477 733633 621194 569560 506013 421714 362262 350893
13575 350893 355793 387692 416308 398419 462213 612684 747909 927462 1178797 1619869 2102614
13564 2102614 2269318 1720387 1019390 625142 415658 266098 201403 202729 143019 62338
13554 62338 16392 30676 54896 37003 42724 29871 38502 23608 57141 40527 60549 57982
13542 57982 35133 41327 -18185 -28443 -9482 -20990 -15316 9590 82371 75817 80217 40407
13530 40407 38964 40066 50167 41767 83819 128276 202255 319064 415021 531716 648450 733280
$$ packed form
13607B108787n99790l13201k09674r2611m9058p107K9703M5017P1249N3347O4518
13596A101180P9302N5560J08138K8416J03234Q0209M1525p7926q4850j00490j12233
13585A222065j44710j04254j16624j22844j12439n1634o3547q4299n9452j1369
13575C50893M900L1899K8616j7889O3794J50471J35225J79553K51335M41072M82745
13564B102614J66704n48931p00997l94248k09484j49560o4695J326n9710q0681
13554F2338m5946J4284K4220j7893N721j2853Q631j4894L3533j6614K0022k567
13542E7982k2849O194n9512j0258J8961j1508N674K4906P2781o554M400l9810
13530D0407j443J102J0101q400M2052M4457P3979J16809R5957J16695J16734Q4830
$$ plain form
13518 733280 576392 347095 197353 113756 45261 22518 4044 -31044 -89347 -104720 -81987
13507 -81987 -67797 -34885 -33919 -37922 -59345 -49854 -39994 -38140 4577 89051 89188 65396 13443
13494 13443 3114 -23917 -77626 -58589 -71872 -90369 -39811 -30864 -37500 -33890 -3637 17918
13482 17918 -4598 -26882 25640 49163 36320 49691 3790 -27761 -21 21854 -39157 -18743
13470 -18743 1635 1073 3757 9626 11380 1935 10607 43374 41646 -34965 -33397 -35903 -77388 -50593
13456 -50593 -72471 -65298 -47278 -88641 -73503 -61165 -83492 -42392 -60186 -68201 -63742 -42539
13444 -42539 13299 -23976 -48680 -55640 -42762 -20498 -66392 -122208 -134853 -94230 -66834 -67354
13432 -67354 -25903 -26809 -36627 -69088 -88643 -90858 -59759 -101798 -120811 -97062 -34508 -8518
$$ packed form
13518G33280j56888k29297j49742q3597o8495k2743j8474l5088n8303j5373K2733
13507h1987J4190L2912R66m003k1423R491R860J854M2717Q4474J37k3792n1953
13494A3443j0329k7031n3709J9037j3283j8497N0558Q947o636L610L0253K1555
13482A7918k2516k2284N2522K3523j2843J3371m5901l1551K7740K1875o1011K0414
13470a8743K0378n62K684N869J754r445Q672L2767j728p6611J568k506m1485K6795
13456e0593k1878P173J8020m1363J5138J2338k2327M1100j7794q015M459K1203
13444d2539N5838l7275k4704o960J2878K2264m5894n5816j2645M0623K7396n20
13432f7354M1451r06r818l2461j9555k215L1099m2039j9013K3749O2554K5990
$$ plain form
13420 -8518 -28810 -77886 -105804 -79664 -26665 -38978 -21096 -8582 -30453 -30054 5936 -28294
13408 -28294 -99710 -118666 -76042 -70484 -52287 -33457 18685 43845 59918 8684 -41970 -19680
13396 -19680 3532 5787 10693 35193 -33628 -47592 -63489 -94949 -23102 -2579 25468 16453
13384 16453 -22555 -16321 -10026 -13154 60863 91858 15780 -3881 29949 47254 -21779 1409
13372 1409 24551 -33703 -18369 48695 56222 82397 113485 104680 83573 64707 40856 11556
13360 11556 56008 119440 90474 77473 57837 28055 25408 41976 83451 112059 95422 13703
13348 13703 -10927 25142 53130 40091 66125 144738 127741 98676 104674 67399 61442 96123
13336 96123 148131 164012 223092 280637 324363 375434 341220 270582 212835 205792 200194 203902
$$ packed form
13420h518k0292m9076k7918K6140N2999j2313J7882J2514k1871L99L5990l4230
13408b8294p1416j8956M2624N558J8197J8830N2142K5160J6073n1234n0654K2290
13396a9680K3212K255M906K4500o8821j3964j5897l1460P1847K0523K8047r015
13384A6453l9008O234O295l128P4017L0995p6078j9661L3830J7305o9033K3188
13372A409K3142n8254J5334O7064P527K6175L1088q805k1107j8866k3851k9300
13360A1556M4452O3432k8966j3001j9636k9782k647J6568M1475K8608j6637q1719
13348A3703k4630L6069K7988j3039K6034P8613j6997k9065N998l7275n957L4681
13336I6123N2008J5881N9080N7545M3726N1071l4214p0638n7747p043n598L708
$$ plain form
13324 203902 236609 229104 230335 220437 248213 259793 216709 235460 292929 325406 290731 265598
13312 265598 309038 364711 414109 404983 378464 298921 197996 178757 141843 106418 164486
13301 164486 177147 201636 245249 294449 295420 341506 357963 341582 268221 230475 232726 302553
13289 302553 352931 352054 412635 435593 410590 425202 387140 385040 425897 410168 417820 434941
13277 434941 413549 428680 514640 533915 557235 667423 877108 1094946 1151749 1028497 1016663
13266 1016663 1113181 1244201 1304675 1111233 901233 857698 766388 661332 663956 649178 583235
13255 583235 540125 560275 601679 644105 622535 555244 492935 464526 521043 606769 617397
13244 617397 586994 613945 684677 711056 710197 691049 696823 699790 714988 738750 663325 564039
$$ packed form
13324B03902L2707p505J231r898K7776J1580m3084J8751N7469L2477l4675k5133
13312B65598M3440N5673M9398r126k6519p9543j00925j9239l6914l5425N8068
13301A64486J2661K4489M3613M9200R71M6086J6457j6381p3361l7746K251O9827
13289C02553N0378q77O0581K2958k5003J4612l8062k100M0857j5729P652J7121
13277D34941k1392J5131Q5960J9275K3320J10188K09685K17838N6803j23252j1834
13266A016663R6518J31020O0474j93442k10000m3535r1310j05056K624j4778o5943
13255E83235m3110K0150M1404M2426k1570o7291o2309k8409N6517Q5726J0628
13244F17397l0403K6951P0732K6379q59j9148N774K967J5198K3762p5425r9286
$$ plain form
13232 564039 547849 540113 568372 629306 712617 818111 1069977 1387698 1568647 1531861 1475947
13221 1475947 1491418 1577149 1606814 1465739 1322826 1277280 1263731 1252507 1142857 1077988 1119777
13210 1119777 1186415 1196050 1157009 1136948 1153446 1128120 1077740 1061291 1096840 1114191 1153519
13199 1153519 1253795 1292274 1349748 1459575 1508945 1486060 1430838 1355061 1325099 1254083 1187076
13188 1187076 1184147 1233179 1231247 1249043 1343588 1374387 1422824 1507446 1646705 1816236 1968663
13177 1968663 2104965 2358960 2843792 3518258 4206498 4544664 4315947 3709384 3065974
13168 3065974 2529275 2182093 2039756 2035671 2083427 2106213 2105207 2068374 2035328 2030092 1986504
13157 1986504 1911933 1901900 1940436 2164954 2500603 2749242 2808639 2763680 2573158 2283691
$$ packed form
13232E64039j6190p736K8259O0934Q3311J05494K51866L17721J80949l6786n5914
13221A475947J5471Q5731K9665j41075j42913m5546j3549j1224j09650o4869M1789
13210A119777O6638R635l9041k0061J6498k5326n0380j6449L5549J7351L9328
13199A153519J00276L8479N7474J09827M9370k2885n5222p5777k9962p1016o7007
13188A187076k929M9032j932J7796R4545L0799M8437Q4622J39259J69531J52427
13177A968663J36302K53995M84832O74466O88240L38166k28717o06563o43410
13168C065974n36699l47182j42337m085M7756K2786j006l6833l3046n236m3588
13157A986504p4571j0033L8536K24518L35649K48639N9397m4959j90522k89467
$$ plain form
13147 2283691 2039887 1874833 1795158 1727071 1697140 1764871 1887244 2065699 2297065 2390828
13137 2390828 2405287 2426167 2533808 2662453 2916046 3289051 4025145 5327589 7288270
13128 7288270 9487422 10952208 10632259 8702427 6431821 4760570 3731553 3212294
13120 3212294 3020645 2923741 2776689 2697167 2636591 2567003 2570412 2559151 2557352 2465915 2419794
13109 2419794 2486735 2725122 2961555 3101666 3124336 2885702 2579348 2284714 2040697 1871158
13099 1871158 1810414 1833972 1909681 1955931 1999943 2106052 2261078 2300044 2288018 2350429 2458957
13088 2458957 2628901 2990295 3646099 4805859 6567810 8760245 10508570 10560135 8793845
13079 8793845 6367826 4495037 3370457 2703253 2286191 1920263 1757214 1725700 1731059
$$ packed form
13147B283691k43804j65054p9675o8087k9931O7731J22373J78455K31366R3763
13137B390828J4459K0880J07641J28645K53593L73005P36094J302444J960681
13128G288270K199152J464786l19949j929832k270606j671251j029017n19259
13120C212294j91649r6904j47052p9522o0576o9588L409j1261j799r1437m6121
13109B419794O6941K38387K36433J40111K2670k38634l06354k94634k44017j69539
13099A871158o0744K3558P5709M6250M4012J06109J55026L8966j2026O2411J08528
13088B458957J69944L61394O55804J159760J761951K192435J748325N1565j766290
13079H793845k426019j872789j124580o67204m17062l65928j63049l1514N359
$$ plain form
13070 1731059 1753083 1762115 1780754 1760035 1682747 1577892 1445468 1492214 1611900 1639239 1559719
13059 1559719 1499212 1335278 1194839 1009952 916634 864112 808386 811829 808136 819282 870113
13048 870113 917965 934063 887193 851369 855526 949611 1039733 1208890 1599134 2182807 2884549
13037 2884549 3504930 3645430 3210491 2419858 1712808 1210103 957844 819575 697702
13028 697702 619620 584147 592055 621413 586075 616105 576409 514362 500985 498592 489784 456554
13016 456554 442626 395016 350746 364855 317867 305990 302144 300131 321868 313212 282812 240588
13004 240588 186062 231744 246288 216476 172784 155481 170954 201234 250988 246273 217156 223636
12992 223636 252433 189490 125990 105966 141484 140175 128049 122939 90340 42328 54736 66801
$$ packed form
13070A731059K2024R032J8639k0719p7288j04855j32424M6746J19686K7339p9520
13059A559719o0507j63934j40439j84887r3318n2522n5726L443l693J1146N0831
13048H70113M7852J6098m6870l5824M157R4085R0122J69157L90244N83673P01742
13037B884549O20381J40500m34939p90633p07050n02705k52259j38269j21873
13028F97702p8082l5473P908K9358l5338L0030l9696o2047j3377k393q808l3230
13016D56554j3928m7610m4270J4109m6988j1877l846k013K1737q656l0400m2224
13004B40588n4526M5682J4544k9812m3692j7303J5473L0280M9754m715k9117O480
12992B23636K8797o2943o3500k0024L5518j309j2126n110l2599m8012J2408J2065
$$ plain form
12980 66801 40754 60881 78827 71321 58020 65262 108869 139730 108202 137571 177127 174530
12968 174530 98101 38182 56826 27258 60287 81995 47532 39447 -21696 31981 164077
12957 164077 300728 335696 370669 329652 258008 237351 174841 93838 83267 131896 94665
12946 94665 53313 -11710 -45335 -3109 -45115 -50701 -61959 -61501 -144482 -173037 -147761 -92537
12934 -92537 -31282 -43897 -33909 55315 103425 70405 50271 58536 78730 89431 93692 95173
12922 95173 97031 51224 18701 -4582 -11898 -31546 21410 67244 52549 1884 25753 40167
12910 40167 66775 95354 77004 35795 -1204 20100 71873 61796 102628 153281 190245 224892
12898 224892 227576 210015 142446 24985 1106 19331 23900 69271 89007 121881 106132 80001
$$ packed form
12980F6801k6047K0127J7946p506j3301P242M3607L0861l1528K9369L9556k597
12968A74530p6429n9919J8644k9568L3029K1708l4463q085o1143N3677J32096
12957A64077J36651L4968L4973m1017p1644k0657o2510q1003j0571M8629l7231
12946I4665m1352o5023l3625M2226m2006n586j1258M58q2981k8555K5276N5224
12934i2537O1255j2615R988Q9224M8110l3020k0134Q265K0194J0701M261J481
12922I5173J858m5807l2523k3283p316j9648N2956M5834j4695n0665K3869J4414
12910D0167K6608K8579j8350m1209l6999K1304N1773j0077M0832N0653L6964L4647
12898B24892K684j7561o7569j17461k3879J8225M569M5371J9736L2874j5749k6131
$$ plain form
12886 80001 54671 110221 156900 208629 190092 116548 83197 37290 104750 143369 102432 109731
12874 109731 152371 156668 122993 136088 174424 243047 346804 536394 863692 1118509 1095762
12863 1095762 774975 540437 386894 280213 221342 126612 59736 61547 36977 -696 -19111
12852 -19111 -4817 33763 47911 46320 82527 148522 180101 213004 210376 232399 182086 161659
12840 161659 58278 17983 50463 75585 97310 67393 67555 118579 117928 94533 79992 95667
12828 95667 60381 27490 12478 16137 37943 9945 -37041 -24327 -19255 4108 127583 182230
12816 182230 158493 145549 118940 96231 73700 60818 74539 69713 44121 56199 19967 -25002
12804 -25002 -32853 -60354 -57390 -1746 18710 15958 -10468 35316 40224 -31256 -29463 10602 53836
$$ packed form
12886H0001k5330N5550M6679N1729j8537p3544l3351m5907O7460L8619m0937P299
12874A09731M2640M297l3675J3095L8336O8623J03757J89590L27298K54817k2747
12863A095762l20787k34538j53543j06681n8871r4730o6876J811k4570l7673j8415
12852a9111J4294L8580J4148j591L6207O5995L1579L2903k628K2023n0313k0427
12840A61659j03381m0295L2480K5122K1725k9917J62N1024o51k3395j4541J5675
12828I5667l5286l2891j5012L659K1806k7998m6986J2714N072K3363J23475N4647
12816A82230k3737j2944k6609k2709k2531j2882J3721m826k5592J2078l6232m4969
12804b5002p851k7501K964N5644K0456k752k6426M5784M908p1480J793M0065M3234
$$ plain form
12791 53836 48202 68388 90508 113837 126407 60868 7448 -24068 -40504 -19777 -33535 -61817
12779 -61817 -88444 -36957 3049 39539 41685 54675 53994 27844 22741 35819 74032 71155 95728
12766 95728 65050 80694 56929 -2721 -25504 -11802 29424 92226 117299 95686 48034 32006
12754 32006 1543 1576 42218 56604 11961 -7140 -26639 -56072 -77753 -71413 -31742 22441
12742 22441 54663 95981 137624 115305 86542 68079 92547 72769 39384 62779 101386 147191
12730 147191 84311 -1456 15698 38345 20151 42612 75178 65877 23197 22457 57370 46786
12718 46786 71385 32659 38548 16410 -2446 -32389 -43678 -5027 72586 78684 55375 21562
12706 21562 13628 5103 8522 22314 64259 80231 67256 52414 43067 97515 97437 90662 99485
$$ packed form
12791E3836n634K0186K2120K3329J2570o5539n3420l1516j6436K0727j3758k8282
12779f1817k6627N1487M0006L6490K146J2990o81k6150n103J3078L8213k877K4573
12766I5728l0678J5644k3765n9650k2783J3702M1226O2802K5073k1613m7652j6028
12754C2006l0463L3M0642J4386m4643j9101j9499k9433k1681O340L9671N4183
12742B2441L2222M1318M1643k2319k8763j8463K4468j9778l3385K3395L8607M5805
12730A47191o2880q5767J7154K2647j8194K2461L2566r301m2680p40L4913j0584
12718D6786K4599l8726N889k2138j8856k9943j1289L8651P7613O098k3309l3813
12706B1562p934q525L419J3792M1945J5972j2975j4842r347N4448p8o775Q823
$$ plain form
12693 99485 87549 -9796 -61050 -14905 -35930 -19226 44566 79156 67874 89567 95077 50127
12681 50127 9956 35734 41824 46428 111321 118420 53063 -42432 -24164 55115 76252 81003
12669 81003 112202 138782 143534 119887 190809 201553 140732 119362 119218 146705 147051 143920 120495
12656 120495 144168 167618 185213 175513 147850 147422 132762 117258 109203 84301 69788 70605 117300
12643 117300 88341 93340 122200 103636 119199 105185 91306 132531 131354 101915 115763 114544
12631 114544 118431 147796 252243 237135 223701 218447 218332 225859 230846 276060 307828 314715 298826
12618 298826 254938 265317 240367 200948 210828 248135 264153 285477 302838 327097 293463 253711
12606 253711 202751 159267 133054 146532 162202 179898 239350 224404 211261 191943 214969
$$ packed form
12693I9485j1936r7345n1254M6145k1025J6704O3792L4590j1282K1693N510m4950
12681E0127m0171K5778O090M604O4893P099o5357r5495J8268P9279K1137M751
12669H1003L1199K6580M752k3647P0922J0744o0821k1370j44K7487L46l131k3425
12656A20495K3673K3450J7595r700k7663m28j4660j5504q055k4902j4513Q17M6695
12643A17300k8959M999K8860j8564J5563j4014j3879M1225j177k9439J3848j219
12631A14544L887K9365J04447j5108j3434n254j15P527M987M5214L1768O887j5889
12618B98826m3888J0379k4950l9419R880L7307J6018K1324J7361K4259l3634l9752
12606B53711n0960m3484k6213J3478J5670J7696N9452j4946j3143j9318K3026
$$ plain form
12595 214969 204181 134106 88425 66893 62934 41914 -12604 -63146 -71868 -73966 -8314 81357
12583 81357 86274 150953 198573 148507 129947 121684 76667 48970 31241 70778 68159 10171
12571 10171 22926 65027 115197 160616 192392 221137 177221 157020 118280 81576 127365 129262
12559 129262 132102 144718 135093 149609 69539 30564 81789 171257 197905 105769 74411 92381
12547 92381 102171 152489 197295 156694 172997 193456 226908 230060 245746 264301 233296 205718
12535 205718 228400 219312 208396 289734 342823 398806 406122 376185 353128 280000 268836 260145
12523 260145 252094 294313 240110 200031 226339 277174 305898 262995 255302 267284 259650 273686
12511 273686 320983 307727 314327 326549 353174 363318 390678 423276 400698 338090 366490 421239
$$ packed form
12595B14969j0788p0075m5681k1532l959k1020n4518n0542q722k098O5652Q9671
12583H1357M917O4679M7620n0066j8560q263m5017k7697j7729L9537k619n7988
12571A0171J2755M2101N0170M5419L1776K8745m3916k0201l8740l6704M5789J897
12559A29262K840J2616r625J4516q0070l8975N1225Q9468K6648r2136l1358J7970
12547I2381R790N0318M4806m0601J6303K0459L3452L152J5686J8555l1005k7578
12535B05718K2682r088j0916Q1338N3089N5983P316k9937k3057p3128j1164q691
12523B60145q051M2219n4203m0079K6308N0835K8724m2903p693J1982p634J4036
12511B73686M7297j3256O600J2222K6625J0144K7360L2598k2578o2608K8400N4749
$$ plain form
12499 421239 507390 572287 568743 527694 518028 525798 467378 376182 295294 311718 335967 359660
12487 359660 308965 259538 250750 237131 213216 175292 198154 181667 203774 195608 183036 250449
12475 250449 218201 247231 281560 287375 300348 297283 300896 280350 293896 306165 334487 317738
12463 317738 289987 341394 306680 287071 243033 197460 184894 145840 152755 162525 162120 159039
12451 159039 165230 126111 121625 137935 96920 67415 50670 74121 165254 196557 144344 116696
12439 116696 117517 202662 286495 249924 231322 240422 264268 271092 262053 306109 345543 388655
12427 388655 400411 420551 380227 387078 388418 471060 535319 706047 889552 1038558 971919
12416 971919 877150 855335 866081 844706 772773 742184 776420 811472 756440 684878 683531 581588
$$ packed form
12499D21239Q6151O4897l544m1049r666P770n8420r1196q0888J6424K4249K3693
12487C59660n0695m9427q788j3619k3915l7924K2862j6487K2107q166j2572O7413
12475B50449l2248K9030L4329N815J2973l065L613k0546J3546J2269K8322j6749
12463C17738k7751N1407l4714j9609m4038m5573j2566l9054O915R770m05l081
12451A59039O191l9119m486J6310m1015k9505j6745K3451R1133L1303n2213k7648
12439A16696Q21Q5145Q3833l6571j8602R100K3846O824r039M4056L9434M3112
12427C88655J1756K0140m0324O851J340Q2642O4259J70728J83505J49006o6639
12416I71919r4769k1815J0746k1375p1933l0589L4236L5052n5032p1562j347j01943
$$ plain form
12404 581588 545803 605172 639179 687897 730286 710985 638050 545127 543840 593783 583473 541751
12392 541751 519685 500188 503450 572742 631270 664377 668142 706175 705697 746977 864829 995545
12380 995545 1073815 1017322 889237 820882 714649 670297 590403 482192 413330 413693 449083
12369 449083 541131 622921 735723 826878 752548 559210 455206 431184 387685 358849 408497
12358 408497 421881 384904 402475 363197 311489 305663 314867 321118 313328 356406 369828 343676
12346 343676 323603 285428 226792 156737 89512 71803 139181 248161 277987 280064 262852
12335 262852 199059 200576 184735 199233 258608 302367 300070 308100 332222 301097 283416 299627
12323 299627 273830 293168 274702 288443 269894 253854 261143 242475 233050 236927 212516 174875
$$ packed form
12404E81588l5785N9369L4007M8718M2389j9301p2935r2923j287M9943j0310m1722
12392E41751k2066j9497L262O9292N8528L3107L765L8033m78M1280J17852J30716
12380I95545P8270n6493j28085o8355j06233m4352p9894j08211o8862L63L5390
12369D49083R2048Q1790J12802R1155p4330j93338j04004k4022m3499k8836M9648
12358D08497J3384l6977J7571l9278n1708n826R204O251p790M3078J3422k6152
12346C43676k0073l8175n8636p0055o7225j7709O7378J08980K9826K077j7212
12335B62852o3793J517j5841J4498N9375M3759k297Q030K4122l1125j7681J6211
12323B99627k5797J9338j8466J3741j8549j6040P289j8668r425L877k4411l7641
$$ plain form
12311 174875 125454 130494 167202 181611 193604 217974 221368 191346 194381 179136 213536 275650
12299 275650 272860 277438 258020 246198 226725 236760 254110 268927 267323 246297 255149 236040
12287 236040 192199 183405 177888 158478 90944 80992 103613 139833 197099 185415 160089 166096
12275 166096 187897 153441 134610 132282 207688 256619 290048 296527 286466 230980 217219 197366
12263 197366 205074 163720 154725 163696 145806 174302 194730 216960 178923 137428 160215 150638
12251 150638 127632 110009 124408 139226 142994 142248 109285 72196 43993 80008 66283 45963
12239 45963 122193 155667 128530 120033 158560 163838 172457 251231 253636 239133 246686 228599 197677
12226 197677 163312 142511 98837 82888 127728 140457 158289 175870 196532 174495 196082
$$ packed form
12311A74875m9421N040L6708J4409J1993K4370L394l0022L035j5245L4400O2114
12299B75650k790M578j9418j1822j9473J0035J7350J4817j604k1026Q852j9109
12287B36040m3841q794n517j9410o7534r952K2621L6220N7266j1684k5326O007
12275A66096K1801l4456j8831k328P5406M8931L3429O479j0061n5486j3761j9853
12263A97366P708m1354q995Q971j7890K8496K0428K2230l8037m1495K2787r577
12251A50638k3006j7623J4399J4818L768p46l2963l7089k8203L6015j3725k0320
12239D5963P6230L3474k7137q497L8527N278Q619P8774K405j4503P553j8087l0922
12226A97677l4365k0801m3674j5949M4840J2729J7832J7581K0662k2037K1587
$$ plain form
12215 196082 211547 155760 156860 130820 120750 169897 179104 159295 131503 222230 236181 179080
12203 179080 147290 168142 171738 191084 135745 81850 99069 90314 153964 176351 125453 119679
12191 119679 129673 166961 201076 195094 183684 188430 190328 196593 146500 162266 186528 235316
12179 235316 230498 237564 203442 163551 148698 195820 212862 172213 150806 136382 175907 158862
12167 158862 120617 121234 185765 202821 166126 141499 198441 196493 154421 131622 180013 213946
12155 213946 229201 222991 211054 238977 220693 214341 160753 152965 124870 107065 174322 224504
12143 224504 212700 246872 242676 222803 177684 167491 148562 114453 83722 123307 193603 204171
12131 204171 219788 244199 242236 307736 305518 253191 244759 221431 230332 219105 235550 273079
$$ packed form
12215A96082J5465n5787J100k6040j0070M9147R207j9809k7792R0727J3951n7101
12203A79080l1790K0852L596J9346n5339n3895J7219q755O3650K2387n0898n774
12191A19679R994L7288L4115n982j1410M746J898O265n0093J5766K4262M8788
12179B35316m818P066l4122l9891j4853M7122J7042m0649k1407j4424L9525j7045
12167A58862l8245O17O4531J7056l6695k4627N6942j948m2072k2799M8391L3933
12155B13946J5255o210j1937K7923j8284o352n3588p788k8095j7805O7257N0182
12143B24504j1804L4172m196j9873m5119j0193j8929l4109l0731L9585P0296J0568
12131B04171J5617K4411j963O5500k218n2327q432k3328Q901j1227J6445L7529
$$ plain form
12119 273079 248304 188391 171239 203632 213566 181035 187344 227243 260683 263927 247918 274708
12107 274708 278646 294285 324180 341912 250699 206276 307711 309857 259934 287792 335767 282640
12095 282640 281068 308413 342764 385227 423457 432922 397865 420123 415505 395555 383413 363691
12083 363691 347992 346722 378096 336788 257907 260822 249247 268075 318005 345812 331845 343377
12071 343377 335911 321394 380416 438896 430975 437288 419297 370628 321365 371552 400780 381801
12059 381801 333773 327087 406611 459921 463810 474438 467853 407760 392556 416902 347788 352047
12047 352047 401371 406955 415018 468988 488187 476009 402643 336662 338328 378861 345952 344492
12035 344492 360476 380405 391730 440127 482148 449688 425023 448636 426055 416709 418220 434912
$$ packed form
12119B73079k4775n9913j7152L2393R934l2531O309L9899L3440L244j6009K6790
12107B74708L938J5639K9895J7732r1213m4423J01435K146m9923K7858M7975n3127
12095B82640j572K7345L4351M2463L8230R465l5057K2258m618j9950j2142j9722
12083C63691j5699j270L1374m1308p8881K915j1575J8828M9930K7807j3967J1532
12071C43377p466j4517N9022N8480p921O313j7991m8669m9263N0187K9228j8979
12059C81801m8028o686P9524N3310L889J0628o585o0093j5204K4346o9114M259
12047C52047M9324N584Q063N3970J9199j2178p3366o5981J666M0533l2909j460
12035C44492J5984J9929J1325M8397M2021l2460k4665K3613k2581r346J511J6692
$$ plain form
12023 434912 518234 539155 558732 514314 535249 570193 557964 594416 613261 537161 512682
12012 512682 550533 570789 558943 535577 531252 562168 556069 518597 511040 585939 573752 556968
12000 556968 585660 624984 592814 575954 532545 558619 595734 563501 552836 547496 546760 513221
11988 513221 545428 615270 666715 682607 676275 698736 685462 692674 702200 726853 700368 725758
11976 725758 724891 712701 719005 721194 705392 687228 724795 749100 794583 826304 830033 803343
11964 803343 739072 679815 713665 727157 695084 714826 754197 764453 707845 680537 629101
11953 629101 644186 697039 702733 717965 731416 771787 756745 719939 789398 806426 853252 910905
11941 910905 927408 959159 941940 921141 907371 916228 939304 984117 1015056 1041523 1060299 1064757
$$ packed form
12023D34912Q3322K0921J9577m4418K0935L4944j2229L6452J8845p6100k4479
12012E12682L7851K0256j1846k3366m325L0916o099l7472p557P4899j2187j6784
12000E56968K8692L9324l2170j6860m3409K6074L7115l2233j0665n340p36l3539
11988E13221L2207O9842N1445J5892o332K2461j3274P212R526K4653k6485K5390
11976G25758q67j2190O304K189j5802j8164L7567K4305M5483L1721L729k6690
11964H03343o4271n9257L3850J3492l2073J9742L9371J0256n6608k7308n1436
11953F29101J5085N2853N694J5232J3451M0371j5042l6806O9459J7028M6826N7653
11941I10905J6503L1751j7219k0799j3770Q857K3076M4813L0939K6467J8776M458
$$ plain form
11929 1064757 1095698 1093629 1136329 1167333 1144433 1138427 1158752 1228455 1216467 1215597 1217538 1208934
11917 1208934 1231887 1288100 1335568 1284439 1205571 1233024 1280956 1313202 1322113 1311474 1340803
11906 1340803 1383461 1402626 1434658 1493717 1461796 1443921 1517640 1573574 1590007 1610671 1640189
11895 1640189 1710245 1790802 1880801 1917858 1912976 1932795 1929578 1963686 2029467 2129162 2191435 2226458
11883 2226458 2319050 2384361 2444875 2497254 2591765 2710551 2844667 2985979 3120725 3251338
11873 3251338 3403684 3515209 3611274 3722128 3879560 4036624 4223819 4437231 4681382 5029527
11863 5029527 5422468 5771885 6135758 6556863 7111684 7732731 8396718 9171840 10050990
11854 10050990 11041911 12171035 13510073 15152831 17094900 19411926 22191022 25449998
$$ packed form
11929A064757L0941k069M2700L1004k2900o006K0325O9703j1988q70J941q604
11917A208934K2953N6213M7468n1129p8868K7453M7932L2246Q911j0639K9329
11906A340803M2658J9165L2032N9059l1921j7875P3719N5934J6433K0664K9518
11895A640189P0056Q0557Q9999L7057m882J9819l217L4108O5781R9695O2273L5023
11883B226458R2592O5311O0514N2379R4511J18786J34116J41312J34746J30613
11873C251338J52346J11525R6065J10854J57432J57064J87195K13412K44151L48145
11863E029527L92941L49417L63873M21105N54821O21047O63987P75122Q79150
11854A0050990R90921J129124J339038J642758J942069K317026K779096L258976
$$ plain form
11846 25449998 29312235 33786376 38990666 44862421 51203252 57520452 63231815 67563644
11838 67563644 69942265 69998027 67907923 64208915 59709982 55016957 50408484 46197380
11830 46197380 42607223 39528788 36955443 34965408 33429788 32194308 31270006 30736279
11822 30736279 30537512 30670164 31225523 32053296 33159067 34695069 36760898 39459742 42786090
11813 42786090 46910915 52072177 58480064 66384091 76115421 87912803 101827552 117511784
11805 117511784 133980210 149094011 159791973 163356639 158628887 146868440 130859646
11798 130859646 113809514 97832333 83911160 72324551 62817655 55118298 48938090
11791 48938090 43973615 39943925 36678692 34073303 32025178 30459264 29357577 28520973
$$ packed form
11846B5449998L862237M474141N204290N871755O340831O317200N711363M331829
11838F7563644K378621N5762k090104l699008m498933m693025m608473m211104
11830D6197380l590157l078435k573345j990035j535620j235480r24302n33727
11822C0736279j98767J32652N55359Q27773J105771J536002K065829K698844L326348
11813D2786090M124825N161262O407887P904027R731330J1797382J3914749J5684232
11805A17511784J6468426J5113801J0697962L564666m727752j1760447j6008794
11798A30859646j7050132j5977181j3921173j1586609r506896p699357o180208
11791D8938090m964475m029690l265233k605389k048125j565914j101687q36604
$$ plain form
11783 28520973 28012768 27804810 27964381 28460406 29280064 30424011 31919332 33819499 36189674
11774 36189674 39022724 42379758 46173390 50279881 54470978 58385083 61491715 63245564
11766 63245564 63099414 60835804 56686923 51247545 45263866 39339029 33810612 28937976
11758 28937976 24845956 21349272 18402147 15851252 13706507 11999830 10562095 9320920
11750 9320920 8264622 7322903 6514491 5832121 5294663 4841837 4422785 4001778 3642335
11741 3642335 3307315 3064692 2840425 2686485 2524968 2349784 2250720 2126096 1916613 1770790
11731 1770790 1680799 1629321 1551152 1512338 1490841 1496340 1499747 1460068 1372598 1248894 1122719
11720 1122719 1037402 992620 980415 911511 831240 778340 706062 668325 643940 628299 619419
$$ packed form
11783B8520973n08205k07958J59571M96025Q19658J143947J495321J900167K370175
11774C6189674K833050L357034L793632M106491M191097L914105L106632J753849
11766F3245564j46150k263610m148881n439378n983679n924837n528417m872636
11758B8937976m092020l496684k947125k550895k144745j706677j437735j241175
11750I320920j056298r41719q08412o82370n37458m52826m19052m21007l59443
11741C642335l35020k42623k24267j53940j61517j75184r9064j24624k09483j45823
11731A770790q9991n1478p8169l8814k1497N499L407l9679q7470j23704j26175
11720A122719q5317m4782j2205o8904q0271n2900p2278l7737k4385j5641q880
$$ plain form
11709 619419 651312 676242 605406 583691 545140 480510 464734 512156 526056 510947 483529
11698 483529 494863 522968 474072 411783 436090 381523 340072 289265 288813 332112 358166 361056
11686 361056 307618 295051 303599 324445 384936 370962 325194 294558 217681 202116 209705 201868
11674 201868 248928 356211 432963 479809 556958 617334 654571 611496 599462 593108 527157
11663 527157 478938 449808 408875 400465 342329 273018 207041 182668 171400 144533 122635 146540
11651 146540 125318 153718 181512 185914 137129 92631 152210 179572 247130 251783 191491 172138
11639 172138 169145 144618 127941 134779 136756 108383 121024 126180 163274 173402 220705 127160
11627 127160 62469 96915 78570 69518 35039 -3518 -31663 9629 38040 44769 19456 6820
$$ packed form
11709F19419L1893K4930p0836k1715l8551o4630j5776M7422J3900j5109k7418
11698D83529J1334K8105m8896o2289K4307n4567m1451n0807m52M3299K6054K890
11686C61056n3438j2567Q548K0846O0491j3974m5768l0636p6877j5565P589p837
11674B01868M7060J07283P6752M6846P7149O0376L7237m3075j2034o354o5951
11663E27157m8219k9130m0933q410n8136o9311o5977k4373j1268k6867k1898K3905
11651A46540k1222K8400K7794M402m8785m4498N9579K7362O7558M653o0292j9353
11639A72138k993k4527j6677O838J977k8373J2641N156L7094J0128M7303r3545
11627A27160o4691L4446j8345r052l4479l8557k8145M1292K8411O729k5313j2636
$$ plain form
11615 6820 41554 56451 53332 45771 -4606 15756 55897 96729 68199 66293 128520 110073
11603 110073 124021 126162 113770 110817 97555 115525 86688 64905 77741 71898 71380 138739
11591 138739 172678 198656 265867 244766 232185 211456 186693 227967 282796 240537 174022
11580 174022 112464 95984 137986 134291 99588 144940 177302 144065 176808 205186 157353 131925
11568 131925 259137 321529 402213 455274 448327 363585 297920 233855 225389 208823 224944 192900
11556 192900 151421 123645 169037 145239 116347 129808 116471 135575 111568 74712 104994
11545 104994 135486 153607 168763 168606 154659 167281 221890 237782 275896 266741 257653 219134
11533 219134 204869 268926 296115 286644 310687 324136 362977 364547 374109 386817 395192 289134
$$ packed form
11615F820L4734J4897l119p561n0377K0362M0141M0832k8530j906O2227j8447
11603A10073J3948K141j2392k953j3262J7970k8837k1783J2836n843n18O7359
11591A38739L3939K5978O7211k1101j2581k0729k4763M1274N4829m2259o6515
11580A74022o1558j6480M2002l695l4703M5352L2362l3237L2743K8378m7833k5428
11568A31925J27212O2392Q0684N3061o947q4742o5665o4065q466j6566J6121l2044
11556A92900m1479k7776M5392k3798k8892J3461j3337J9104k4007l6856L0282
11545A04994L0492J8121J5156j57j3947J2622N4609J5892L8114r155r088l8519
11533B19134j4265O4057K7189r471K4043J3449L8841J570R562J2708Q375j06058
$$ plain form
11521 289134 203915 181644 145924 128933 185079 288730 316504 366515 435774 456828 470240
11510 470240 446102 451422 414458 287384 220683 160619 134096 197500 175783 124087 100037
11499 100037 64151 121393 171381 212056 210742 173144 121544 108405 40986 46474 127143 149696
11487 149696 175238 194430 258701 282335 238543 187589 142323 159440 156839 146965 97746 73925
11475 73925 81890 109398 122313 97828 119098 131927 81133 61196 75505 115207 128270 118833
11463 118833 138568 150802 196055 213225 169046 160640 164212 157188 190984 209055 182015 189985
11451 189985 137401 108353 105335 78817 85409 178035 216657 151984 86971 75169 75477 82915
11439 82915 126964 154737 207549 122265 71346 67484 97042 120987 124999 169139 144139 158724
$$ packed form
11521B89134q5219k2271l5720j6991N6146J03651K7774N0011O9259K1054J3412
11510D70240k4138N320l6964j27074o6701o0064k6523O3404k1717n1696k4050
11499A00037l5886N7242M9988M0675j314l7598n1600j3139o7419N488Q0669K2553
11487A49696K5542J9192O4271K3634m3792n0954m5266J7117k601r874m9219k3821
11475G3925P965K7508J2915k4485K1270J2829n0794j9937J4309L9702J3063r437
11463A18833J9735J2234M5253J7170m4179q406L572p024L3796J8071k7040P970
11451A89985n2584k9048l018k6518O592R2626L8622o4673o5013j1802L08P438
11439H2915M4049K7773N2812q5284n0919l862K9558K3945M012M4140k5000J4585
$$ plain form
11427 158724 135828 136858 150772 112742 37336 16096 18509 28065 -546 18769 76946 36938
11415 36938 19539 54492 31044 101012 110662 109103 125935 172277 160571 162218 138374 151229
11403 151229 141740 163300 131975 115784 182594 245778 317319 330708 375216 442521 465543 494091
11391 494091 498774 499019 418988 383930 407367 415779 392246 351038 364381 360234 309746 231846
11379 231846 213393 205493 179004 174478 145673 152752 121594 128117 145983 132168 155403 177203
11367 177203 136308 104635 130260 153230 106329 150777 131007 157309 218224 176875 92717
11356 92717 104783 198825 225579 224188 256750 255055 279332 328902 333561 296417 291571 278489
11344 278489 280552 294289 346901 433514 518311 572548 577539 549648 491302 425815 388945 355762
$$ packed form
11427A58724k2896J030J3914l8030p5406k1240K413R556k8611J9315N8177m0008
11415C6938j7399L4953k3448O9968R650j559J6832M6342j1706J647k3844J2855
11403A51229r489K1560l1325j6191O6810O3184P1541J3389M4508O7305K3022K8548
11391D94091M683K45q0031l5058K3437Q412k3533m1208J3343m147n0488p7900
11379B31846j8453p900k6489m526k8805P079l1158O523J7866j3815K3235K1800
11367A77203m0895l1673K5625K2970m6901M4448j9770K6302O0915m1349q4158
11356I2717J2066R4042K6754j391L2562j695K4277M9570M659l7144m846j3082
11344B78489K063J3737N2612Q6613Q4797N4237M991k7891n8346o5487l6870l3183
$$ plain form
11332 355762 345238 327630 293199 241861 192329 156032 147824 156458 146610 154716 184825 147217
11320 147217 142181 211173 247763 231037 225359 275680 285521 255901 188019 133058 138882 100955
11308 100955 120203 160700 142985 147746 169032 220199 226783 247529 335029 374607 307664 241495
11296 241495 188607 184973 194217 202893 235800 195508 171119 242670 243399 206494 217551 234522
11284 234522 289772 218750 165574 126580 79035 58368 104826 126991 123532 143918 147301 213381
11272 213381 253983 245846 230675 265678 282630 252887 251752 273421 290582 322463 310665 308362
11260 308362 305722 300038 297674 303648 268314 248013 236205 253152 276561 301497 318466 325268
11248 325268 373322 366061 358564 351132 329315 293969 251908 185316 104791 153253 244109 249216
$$ packed form
11332C55762j0524j7608l4431n1338m9532l6297q208Q634r848Q106L0109l7608
11320A47217n036O8992L6590j6726n678N0321R841k9620o7882n4961N824l7927
11308A00955J9248M0497j7715M761K1286N1167O584K0746Q7500L9578o6943o6169
11296B41495n2888l634R244Q676L2907m0292k4389P1551P29l6905J1057J6971
11284B34522N5250p1022n3176l8994m7545k0667M6458K2165l459K0386L383O6080
11272B13381M0602q137j5171L5003J6952k9743j135K1669J7161L1881j1798k303
11260C08362k640n684k364N974l5334k0301j1808J6947K3409K4936J6969O802
11248C25268M8054p261p497p432k1817l5346m2061o6592q0525M8462R0856N107
$$ plain form
11236 249216 243088 281707 275245 257539 214631 180587 225356 216736 208467 206895 172201 181726 233513
11223 233513 271011 282921 312664 363837 365713 433140 436912 377090 358615 418045 398578 458987
11211 458987 459015 385704 374589 386475 396143 372066 292170 273052 344824 360026 377287 369282
11199 369282 385579 388896 363461 327153 293856 277113 264364 263917 232259 188380 265029 313977
11187 313977 289494 327487 374068 318526 277277 218621 158466 177665 189593 199751 181032
11176 181032 128022 130227 161514 199623 206478 192724 217300 257351 273608 265448 253106 310376
11164 310376 416085 408340 337175 351406 417538 485606 519318 521807 512493 546294 512137 509465
11152 509465 483680 400773 373892 413953 432299 376200 299967 290456 265921 277361 274603 256230
$$ packed form
11236B49216o128L8619o462j7706m2908l4044M4769q620q269j572l4694R525N1787
11223B33513L7498J1910K9743N1173J876O7427L772n9822j8475N9430j9467O0409
11211D58987K8p3311j1115J1886R668k4077p9896j9118P1772J5202J7261q005
11199C69282J6297L317k5435l6308l3297j6743j2749m47l1658m3879P6649M8948
11187C13977k4483L7993M6581n5542m1249n8656o0155J9199J1928J0158j8719
11176A81032n3010K205L1287L8109O855j3754K4576M0051J6257q160j2342N7270
11164C10376J05709p745p1165J4231O6132O8068L3712K489r314L3801l4157k672
11152E09465k5785q2907k6881M0061J8346n6099p6233r511k4535J1440k758j8373
$$ plain form
11140 256230 255362 252194 236539 262568 277147 265952 299952 231470 240242 215471 169717 231710
11128 231710 361980 359124 344563 368657 329417 271348 266422 184098 174689 233155 153216 81346
11116 81346 103357 202972 229147 175341 143516 157036 175597 226754 256971 259119 280062 279619
11104 279619 287534 353634 382884 324552 301143 322714 358453 317455 306980 336743 348283 309394
11092 309394 230013 205024 191549 166163 187174 122555 43932 32307 11596 16413 40684 71025
11080 71025 86174 85622 90083 121660 142915 105018 104192 120968 130347 200818 191068 168432 153910
11067 153910 142541 150428 139114 152669 184557 242914 330719 318000 313856 344566 402986 423315
11055 423315 415547 375742 317460 269411 232400 179298 133187 118509 98736 99555 117320 136590
$$ packed form
11140B56230q68l168j5655K6029J4579j1195L4000o8482Q772k4771m5754O1993
11128B31710J30270k856j4561K4094l9240n8069m926q2324r409N8466p9939p1870
11116H1346K2011R9615K6175n3806l1825J3520J8561N1157L0217K148K0943m43
11104B79619P915O6100K9250n8332k3409K1571L5739m0998j0475K9763J1540l8889
11092C09394p9381k4989j3475k5386K1011o4619p8623j1625k0711M817K4271L0341
11080G1025J5149n52M461L1577K1255l7897q26J6776R379P0471r750k2636j4522
11067A53910j1369P887j1314J3555L1888N8357Q7805j2719m144L0710N8420K0329
11055D23315p768l9805n8282m8049l7011n3102m6111j4678j9773Q19J7765J9270
$$ plain form
11043 136590 119913 92002 114772 93689 96807 93550 57782 28565 62517 42220 6469 -26541
11031 -26541 -6202 23318 -6498 -21161 27832 14566 25090 78197 59518 34243 55906 31728
11019 31728 53720 50664 21818 11792 50516 102095 95102 95551 119273 72644 90766 147247
11007 147247 156639 255064 332479 311331 296927 285374 320994 323269 263973 187691 174938 136745
10995 136745 129765 74178 81861 63620 68128 87816 42126 -15740 1961 10725 38563 15068
10983 15068 44817 31990 65127 26163 -15231 -4164 50046 73046 131977 161000 142453 90252
10971 90252 68219 68667 95582 57469 75754 89610 82006 85433 98891 80241 90031 60313 80120
10958 80120 53746 13740 -24870 -36324 21903 90310 98086 108953 102607 87306 44801 58257
$$ packed form
11043A36590j6677k7911K2770k1083L118l257l5768k9217L3952k0297l5751l3010
11031b6541K0339K9520k9816j4663M8993j3266J0524N3107j8679k5275K1663k4178
11019C1728K1992l056k8846j0026L8724N1579o993M49K3722m6629J8122N6481
11007A47247R392R8425P7415k1148j4404j1553L5620K275n9296p6282j2753l8193
10995A36745o980n5587P683j8241M508J9688m5690n7866J7701Q764K7838k3495
10983A5068K9749j2827L3137l8964m1394J1067N4210K3000N8931K9023j8547n2201
10971I0252k2033M48K6915l8113J8285J3856p604L427J3458j8650R790k9718J9807
10958H0120k6374m0006l8610j1454N8227O8407P776J0867o346j5301m2505J3456
$$ plain form
10946 58257 51943 106159 92507 54593 5648 18211 25070 69377 68266 26017 14482 61736
10934 61736 66420 27563 -26320 -82202 -89107 -50015 -4231 -37409 -54220 -21360 39044 35334
10922 35334 33878 31617 -4625 7079 -17078 -66237 -29275 -16299 52379 76847 71986 92412
10910 92412 25680 22291 -10441 -28787 -24004 22406 1021 -4818 -250 -3240 42337 63350 78483
10897 78483 117035 145854 158839 128771 106944 149357 151352 153041 97084 11686 -800 9746
10885 9746 67630 97653 101271 53374 18707 16562 37569 29398 -14251 -97119 -117071 -90259
10873 -90259 -76979 -34539 15732 19337 9368 23062 87968 60680 22520 31928 38389 53113
10861 53113 49179 -20893 -33820 -20682 13345 -17907 -14995 -22427 -20634 19459 33020 53034
$$ packed form
10946E8257o314N4216j3652l7914m8945J2563O859M4307j111m2249j1535M7254
10934F1736M684l8857n3883n5882o905L9092M5784l3178j6811L2860O0404l710
10922C5334j456k261l6242J1704k4157m9159L6962J2976O8678K4468m861K0426
10910I2412o6732l389l2732j8346M783M6410k1385n839M568k990M5577K1013J5133
10897G8483L8552K8819J2985l0068k1827M2413J995J689n5957q5398j2486J0546
10885I746N7884L0023L618m7897l4667k145K1007q171m3649q2868j9952K6812
10873i0259J3280M2440N0271L605r969J3694O4906k7288l8160R408O461J4724
10861E3113l934p0072j2927J3138L4027l1252K912p432J793M0093J3561K0014
$$ plain form
10849 53034 99808 98579 42676 37256 610 -14089 15798 71594 98508 126566 115504 129688
10837 129688 123875 91310 100505 89395 105991 144659 151730 123423 65730 44556 94596 96921
10825 96921 78973 52601 53679 57351 110959 120169 129326 182164 238784 197959 147842 93876
10813 93876 101990 167526 207895 180503 148653 146294 128485 147017 163671 140868 132748 122182
10801 122182 60910 81317 133944 101539 83666 86738 160226 161285 155093 119386 107781 81443
10789 81443 131987 177653 196210 245314 245087 211739 153495 141925 95092 95756 91886 124564 141921
10776 141921 102592 62620 98253 61026 66042 75756 77081 54818 33100 48100 63119 84031
10764 84031 64227 26604 35174 68791 86438 107566 126916 54441 38213 29108 82285 104229
$$ packed form
10849E3034M6774j229n5903n420l6646j4699K9887N5796K6914K8058j1062J4184
10837A29688n813l2565R195j1110J6596L8668P071k8307n7693k1174N0040K325
10825I6921j7948k6372J078L672N3608R210R157N2838N6620m0825n0117n3966
10813I3876Q114O5536M0369k7392l1850k359j7809J8532J6654k2803q120j0566
10801A22182o1272K0407N2627l2405j7873L072P3488J059o192l5707j1605k6338
10789H1443N0544M5666J8557M9104k27l3348n8244j1570m6833O64l870L2678J7357
10776A41921l9329l9972L5633l7227N016R714J325k2263k1718J5000J5019K0912
10764H4031j9804l7623Q570L3617J7647K1128J9350p2475j6228r105N3177K1944
$$ plain form
10752 104229 96546 117154 102789 75483 114880 104123 59963 32136 42263 38344 90071 107080
10740 107080 135003 162541 102114 77395 86181 27641 70082 98696 129624 173441 186860 200223
10728 200223 239415 230416 202521 230901 187604 188391 217236 240683 209765 239961 256415 223033
10716 223033 179261 164064 196970 252284 252315 224087 181383 158451 199816 264239 272492 229669
10704 229669 178433 236292 298726 306499 289258 312595 348583 338723 344029 321267 273667 227417
10692 227417 233936 279461 303750 327230 341557 344341 315791 282909 283942 296510 228918 207701
10680 207701 252597 227615 174015 139339 201361 264604 256829 245927 231234 246177 210886 164158
10668 164158 170966 227017 282662 338562 360616 317137 271141 301090 297089 277718 265831 241370
$$ packed form
10752A04229p683K0608j4365k7306L9397j0757m4160k7827J0127l919N1727J7009
10740A07080K7923K7538o0427k4719Q786n8540M2441K8614L0928M3817J3419J3363
10728B00223L9192q999k7895K8380m3297P87K8845K3447l0918L0196J6454l3382
10716B23033m3772j5197L2906N5314L1k8228m2704k2932M1365O4423Q253m2823
10704B29669n1236N7859O2434P773j7241K3337L5988r860N306k2762m7600m6250
10692B27417O519M5525K4289K3480J4327K784k8550l2882J033J2568o7592k1217
10680B07701M4896k4982n3600l4676O2022O3243p775j0902j4693J4943l5291m6728
10668A64158O808N6051N5645N5900K2054m3479m5996K9949m001j9371j1887k4461
$$ plain form
10656 241370 271477 276535 283169 297697 292817 283731 273925 251576 229776 194276 172252 226859
10644 226859 304413 375520 370145 441033 578446 655970 702398 691428 661424 620167 622934 664476
10632 664476 701184 736530 714230 668808 637317 569723 581881 553581 489581 406960 429320
10621 429320 452753 455053 517118 543498 511137 546263 536152 507272 549019 583322 608873 632295
10609 632295 644624 590643 544059 569859 646549 693498 749912 729841 719876 665995 567511 537005
10597 537005 512288 509406 521652 501048 468320 460210 453927 423471 445842 453838 462551 490837
10585 490837 606711 678979 717708 704821 716315 700759 720035 767806 757623 808175 891726
10574 891726 862605 781960 709774 663248 612178 577441 550161 551443 546262 502810 483071 477912
$$ packed form
10656B41370L0107N058O634J4528m880r086r806k2349k1800l5500k2024N4607
10644B26859P7554P1107n375P0888J37413P7524M6428j0970l0004m1257K767M1542
10632F64476L6708L5346k2300m5422l1491o7594J2158k8300o4000q2621K2360
10621D29320K3433K300O2065K6380l2361L5126j0111k8880M1747L4303K5551K3422
10609F32295J2329n3981m6584K5800P6690M6949N6414k0071r965n3881r8484l0506
10597E37005k4717k882J2246k0604l2728q110o283l0456K2371P996Q713K8286
10585D90837J15874P2268L8729j2887J1494j5556J9276M7771j0183N0552Q3551
10574H91726k9121q0645p2186m6526n1070l4737k7280J282n181m3452j9739n159
$$ plain form
10562 477912 418885 414710 460625 467938 495511 533949 562852 524878 445528 413005 387391 434361
10550 434361 417596 408440 460356 497066 475308 417851 468494 447433 460337 419550 414470 403018
10538 403018 426220 444708 499436 464445 361505 348193 284701 252275 279230 331883 319989
10527 319989 285558 263773 215884 173624 165965 184423 178279 173917 175988 197992 228501 181263
10515 181263 143014 149258 163197 158590 145306 178958 185391 139004 119041 135822 133265 104680
10503 104680 63539 102950 86126 56397 89554 119277 221334 264839 270660 273027 245138 255921
10491 255921 247630 308680 289803 282949 294548 297941 328857 362186 357049 370185 352150 290868
10479 290868 308963 349890 308465 241464 230279 246440 287245 290551 264779 244477 186447 183077
$$ packed form
10562D77912n9027m175M5915P313K7573L8438K8903l7974p9350l2523k5614M6970
10550D34361j6765r156N1916L6710k1758n7457N0643k1061J2904m0787n080j1452
10538D03018K3202J8488N4728l4991j02940j3312o3492l2426K6955N2653j1894
10527C19989l4431k1785m7889m2260p659J8458o144m362K071K2004L0509m7238
10515A81263l8249O244J3939m607j3284L3652O433m6387j9963J6781k557k8585
10503A04680m1141L9411j6824k9729L3157K9723J02057M3505N821K367k7889J0783
10491B55921q291O1050j8877o854J1599L393L0916L3329n137J3136j8035o1282
10479B90868J8095M0927m1425o7001j1185J6161M0805L306k5772k0302n8030l370
$$ plain form
10467 183077 178232 178294 194803 199194 215334 157789 172001 194678 211169 212511 222384 229305 223900
10454 223900 224008 188671 146669 177818 262476 254367 251671 254379 167294 103965 112131 158102 138513
10441 138513 116452 141726 198613 283703 339973 293813 247734 231061 193128 164912 133852
10430 133852 146980 148149 93084 55657 54582 43643 38735 10195 -6010 -8907 -3649 87029
10418 87029 133558 145799 152274 120582 33200 22958 63364 20913 45062 59284 52417 80305
10406 80305 82225 101728 129877 88656 85063 97407 133353 180123 130897 56530 46991 55099
10394 55099 67316 93220 83942 53556 66171 134916 225303 219476 156833 129287 112467 82313
10382 82313 89728 91129 42760 293 66800 161536 150295 102464 83044 72913 153698 201819
$$ packed form
10467A83077m845O2J6509M391J6140n7545J4212K2677J6491J342R873O921n405
10454B23900J08l5337m2002L1149Q4658q109k696K708q7085o3329Q166M5971j9589
10441A38513k2061K5274N6887Q5090N6270m6160m6079j6673l7933k8216l1060
10430A33852J3128J169n5065l7427j075j0939m908k8540j6205k897N258R0678
10418H7029M6529J2241O475l1692q7382j0242M0406m2451K4149J4222o867K7888
10406H0305J920J9503K8149m1221l593J2344L5946M6770m9226p4367r539Q108
10394E5099J2217K5904r278l0386J2615O8745R0387n827o2643k7546j6820l0154
10382H2313P415J401m8369m2467O6507R4736j1241m7831j9420j0131Q0785M8121
$$ plain form
10370 201819 182240 228307 196401 172019 215759 186232 153172 165964 160139 162641 108140 98788
10358 98788 138614 133905 97711 135382 150509 166924 183619 121848 99923 131424 160414 141566
10346 141566 110857 137528 123156 84395 89901 139530 164120 185716 169003 154687 174512 179500
10334 179500 191192 167722 197702 236503 180783 122340 143236 153442 178639 218900 238975
10323 238975 246645 223010 142020 118581 114016 94258 127948 133343 124735 110040 128413 150787
10311 150787 135935 56300 -6283 -50685 -12585 47781 54165 43389 44210 24566 20054 19277 53540
10298 53540 79997 81637 105297 163837 172121 151322 143378 204100 308868 348795 362950 330197
10286 330197 332992 367303 340548 254064 213442 276562 320843 302350 223139 186928 233708 212429
$$ packed form
10370B01819j9579M6067l1906k4382M3740k9527l3060J2792n825K502n4501r352
10358I8788L9826m709l6194L7671J5127J6415J6695o1771k1925L1501K8990j8848
10346A41566l0709K6671j4372l8761N506M9629K4590K1596j6713j4316J9825M988
10334A79500J1692k3470K9980L8801n5720n8443K0896J0206K5197M0261K0075
10323B38975P670k3635q0990k3439m565j9758L3690N395q608j4695J8373K2374
10311A50787j4852p9635o2583m4402L8100O0366O384j0776Q21j9644m512p77L4263
10298E3540K6457J640K3660N8540Q284k0799p944O0722J04768L9927J4155l2753
10286C30197K795L4311k6755q6484m0622O3120M4281j8493p9211l6211M6780k1279
$$ plain form
10274 212429 158641 165767 164609 138063 86155 69244 106483 118205 128263 161711 248919 283904
10262 283904 265467 201126 200778 210722 200904 231698 196072 203968 244594 266985 257852 202092 146848
10249 146848 116446 123682 121435 119571 108405 89499 49605 31302 70307 140671 185387 224507
10237 224507 283542 307166 338101 346350 332427 371851 443665 483713 477597 459302 367553 294937
10225 294937 247999 213424 223101 288428 305514 273806 207224 177749 165428 169179 183737 188117
10213 188117 151451 139979 137063 65592 16050 76522 97594 101718 120812 75331 86962 86329
10201 86329 47767 16827 22142 133370 182559 151319 148314 202885 214817 233952 207945 146150
10189 146150 128556 118575 126602 132961 140694 154448 165453 180965 194882 180111 215090 228475
$$ packed form
10274B12429n3788P126j158k6546n1908j6911L7239J1722J0058L3448Q7208L4985
10262B83904j8437o4341l48R944r818L0794l5626P896M0626K2391r133n5760n5244
10249A46848l0402P236k247j864j1166j8906l9894j8303L9005P0364M4716L9120
10237B24507N9035K3624L0935Q249j3923L9424P1814M0048o116j8295r1749p2616
10225B94937m6938l4575R677O5327J7086l1708o6582k9475j2321L751J4558M380
10213A88117l6666j1472k916p1471m9542O0472K1072M124J9094m5481J1631o33
10201H6329l8562l0940N315J11228M9189l1240l005N4571J1932J9135k6007o1795
10189A46150j7594r981Q027O359P733J3754J1005J5512J3917j4771L4979J3385
$$ plain form
10177 228475 212860 179145 159292 213721 239158 220932 197415 214654 199137 184766 238794
10166 238794 174125 147700 132993 144866 152648 134996 121520 130360 107129 125606 145870 153321
10154 153321 145945 134953 163175 115224 55113 112503 174897 175242 148681 112162 130511 139681
10142 139681 174737 218523 276844 244894 221068 163058 179159 207489 203941 155835 139623 157476
10130 157476 167924 162635 111204 86997 60055 30276 17329 79189 151450 206633 174816 119635
10118 119635 51557 41137 89499 112537 81569 58987 11720 -16913 602 69946 83344
10107 83344 68067 61704 54447 36756 34578 102855 147275 116363 129075 128822 145632 168922 143841
10094 143841 66918 25181 29335 72253 109187 107553 89290 71352 45557 43170 30534 43753
$$ packed form
10177B28475j5615l3715j9853N4429K5437j8226k3517J7239j5517j4371N4028
10166B38794o4669k6425j4707J1873P782j7652j3476Q840k3231J8477K0264P451
10154A53321p376j0992K8222m7951o0111N7390O2394L45k6561l6519J8349R170
10142A39681L5056M3786N8321l1950k3826n8010J6101K8330l548m8106j6212J7853
10130A57476J0448n289n1431k4207k6942k9779j2947O1860P2261N5183l1817n5181
10118A19635o8078j0420M8362K3038l0968k2582m7267k8633J7515O9344J3398
10107H3344j5277o363p257j7691k178O8277M4420l0912J2712k53J6810K3290k5081
10094A43841p6923m1737M154M2918L6934j634j8263j7938k5795k387j2636J3219
$$ plain form
10082 43753 47969 72003 128560 114352 108986 152356 176438 146806 118505 135778 106237 75768
10070 75768 41049 30897 30857 67738 143792 181402 184129 231919 240142 179135 127886 139925 128614
10057 128614 100514 131956 154362 103006 119418 150467 204799 201099 150227 121858 155748 142667
10045 142667 124357 115991 108616 113654 99385 103017 138379 155164 123885 110071 66290 70268
10033 70268 123397 120135 83604 112920 144942 220207 238688 199989 107859 25706 35242 59842
10021 59842 120420 190531 161459 132201 127224 84851 138829 165697 135870 118823 136860 115068
10009 115068 77978 110509 194232 230283 195515 193872 218936 212458 172432 153883 172310 170788
9997 170788 142825 167038 189003 199657 189076 145512 123270 187224 244219 304793 319888 288345
$$ packed form
10082D3753M216K4034N6557j4208n366M3370K4082k9632k8301J7273k9541l0469
10070G5768l4719j0152m0L6881P6054L7610K727M7790Q223o1007n1249J2039j1311
10057A28614k8100L1442K2406n1356J6412L1049N4332l700n0872k8369L3890j3081
10045A42667j8310q366p375N038j4269L632L5362J6785l1279j3814m3781L978
10033G0268N3129l262l6531K9316L2022P5265J8481l8699r2130q2153R536K4600
10021E9842O0578P0111k9072k9258m977m2373N3978K6868k9827j7047J8037k1792
10009A15068l7090L2531Q3723L6051l4768j643K5064o478m0026j8549J8427j522
9997A70788k7963K4213K1965J0654j0581m3564k2242O3954N6995O0574J5095l1543
$$ plain form
9985 288345 311077 292235 280955 273285 287336 321432 321003 322509 334664 325065 321511 385264 409723
9972 409723 435539 416698 427968 380721 349043 362387 362466 384134 385873 374550 387440 440295
9960 440295 489536 504615 482317 382265 324760 355680 363415 336933 277159 262762 297864 323038
9948 323038 395153 408690 397147 334453 251059 165942 153010 225239 249124 262789 345051 363295
9936 363295 385921 353220 322529 323695 293548 294045 304557 256335 289429 287724 335288 396723
9924 396723 439808 470282 524562 519180 524908 531626 526983 531054 527944 544821 561184 539446 518282
9911 518282 548076 563920 559342 543811 580517 599898 616789 641411 624080 579182 596802 620058
9899 620058 582091 572052 563507 621010 633480 625231 617481 601908 537378 530824 508965 540053
$$ packed form
9985B88345K2732j8842j1280p670J4051L4096m29J506J2155r599l554O3753K4459
9972D09723K5816j8841J1270m7247l1678J3344P9K1668J739j1323J2890N2855
9960D40295M9241J5079k2298j00052n7505L0920P735k6482n9774j4397L5102K5174
9948C23038P2115J3537j1543o2694q3394q5117j2932P2229K3885J3665Q2262J8244
9936C63295K2626l2701l0691J166l0147M97J0512m8222L3094j705M7564O1435
9924C96723M3085L0474N4280n382N728O718m643M071l110J6877J6363k1738k1164
9911E18282K9794J5844m578j5531L6706J9381J6891K4622j7331m4898J7620K3256
9899F20058l7967j0039q545N7503J2470q249p750j5573o4530o554k1859L1088
$$ plain form
9887 540053 596996 615654 634805 674223 649298 669449 671317 668251 668588 699515 698848 655955 680445
9874 680445 737066 743618 724160 676600 671820 704403 698294 685187 728035 713462 679531 708483
9862 708483 786365 818486 795333 783629 827202 884490 898162 916544 910922 911111 905595 878576
9850 878576 916570 987556 1100929 1173838 1230973 1368812 1461796 1537958 1576679 1577426 1629141 1719330
9838 1719330 1808809 1881789 2018329 2182586 2391931 2647160 3014796 3597884 4442109 5814430
9828 5814430 8047444 12014173 18853723 29109586 39659357 43189373 35398579 23127842
9820 23127842 13878567 8968638 6457048 5059418 4157488 3567166 3244216 3039839 2912675
9811 2912675 2871285 2884642 2956701 3058390 3164534 3272581 3458078 3699346 4017320 4357480
$$ packed form
9887E40053N6943J8658J9151L9418k4925K0151J868l066L37L0927o67m2893K4490
9874F80445N6621O552j9458m7560m780L2583o109j3107M2848j4573l3931K8952
9862G08483P7882L2121k3153j1704M3573N7288J3672J8382n622J89n516k7019
9850H78576L7994P0986J13373P2909N7135J37839R2984P6162L8721P47N1715R0189
9838A719330Q9479P2980J36540J64257K09345K55229L67636N83088Q44225J372321
9828E814430K233014L966729O839550J0255863J0549771L530016p790794j2270737
9820B3127842r249275m909929k511590j397630r01930n90322l22950k04377j27164
9811B912675m1390J3357P2059J01689J06144J08047J85497K41268L17974L40160
$$ plain form
9801 4357480 4677524 4977063 5309576 5753874 6291381 6891478 7595300 8387917 9294215 10312990
9791 10312990 11569608 13058330 14755215 16680194 18788717 20937511 23004607 24798762
9783 24798762 26151535 26745764 26524020 25504407 23838063 21782948 19547029 17317177
9775 17317177 15273884 13445588 11806587 10407816 9180266 8137077 7252022 6431977
9767 6431977 5737203 5130473 4662101 4292963 3896207 3549599 3250487 2967264 2733228 2595833
9757 2595833 2450919 2297134 2111561 1953795 1789552 1687814 1613128 1521956 1429377 1343925
9747 1343925 1273056 1191970 1095519 1077794 1058013 1001246 922301 835966 816186 831188 790726
9736 790726 734981 754002 766556 723501 693306 668477 655453 691820 703886 659700 612246 566175
$$ packed form
9801D357480L20044K99539L32513M44298N37507O00097P03822P92617R06298J018775
9791A0312990J256618J488722J696885J924979K108523K148794K067096J794155
9783B4798762J352773N94229k21744j019613j666344k055115k235919k229852
9775A7317177k043293j828296j639001j398771j227550j043189q85055q20045
9767F431977o94774o06730m68372l69138l96756l46608k99112k83223k34036j37395
9757B595833j44914j53785j85573j57766j64243j01738p4686r1172r2579q5452
9747A343925p0869q1086r6451j7725j9781n6767p8945q6335j9780J5002m0462
9736G90726n5745J9021J2554m3055l0195k4829j3024L6367J2066m4186m7454m6071
$$ plain form
9724 566175 547674 558246 539772 474082 466539 486472 522000 506059 517258 509095 493830 574801
9712 574801 549694 527823 522044 562296 564904 512801 502182 533500 571232 606079 685339 721879
9700 721879 679092 637160 647991 585447 521629 481049 465982 522596 488097 435293 424998 398142
9688 398142 439365 519783 533600 584207 571757 527050 513701 561924 589417 599373 631931 633919
9676 633919 610884 603782 549335 483043 482548 510371 514838 471818 414208 420607 410593 436062 439645
9663 439645 450999 453538 499180 496303 513434 554669 583075 556675 583578 618975 559024 570275
9651 570275 546104 538694 507638 478875 431773 452729 461032 434361 433832 431202 405176 343763 331172
9638 331172 389078 412390 394137 381890 354205 408665 442905 481838 428988 419589 450361 520163
$$ packed form
9724E66175j8501J0572j8474o5690p543J9933L5528j5941J1199q163j5265Q0971
9712E74801k5107k1871n779M0252K608n2103j0619L1318L7732L4847P9260L6540
9700G21879m2787m1932J0831o2544o3818m0580j5067N6614l4499n2804j0295k6856
9688C98142M1223Q0418J3817N0607j2450m4707j3349M8223K7493R956L2558J988
9676F33919k3035p102n4447o6292m95K7823M467m3020n7610O399j0014K5469L583
9663D39645J1354K539M5642k877J7131M1235K8406k6400K6903L5397n9951J1251
9651E70275k4171p410l1056k8763m7102K0956Q303k6671n29k630k6026o1413j2591
9638C31172N7906K3312j8253j2247k7685N4460L4240L8933n2850r399L0772O9802
$$ plain form
9626 520163 488348 446248 521272 529199 496651 447521 438758 413872 363295 358216 401063 381555
9614 381555 305570 235187 211446 198727 217434 262477 272350 251988 256280 279161 271078 284353
9602 284353 284593 315667 354124 397317 340434 308758 302743 278974 280845 257815 288389 269465
9590 269465 242950 222880 256788 226523 162885 132652 125356 169600 180281 174884 180283 203351
9578 203351 200854 214923 281098 370281 432035 445099 407447 406538 398113 396583 329986 274074 298770
9565 298770 304104 231563 201810 214039 163106 117481 124606 166480 186128 149178 169162 186467
9553 186467 197822 154236 187605 241557 286050 306434 294872 345661 379470 372448 329955 269786
9541 269786 189261 205538 202133 186013 151907 195966 199267 134063 95737 124260 121701 117876
$$ packed form
9626E20163l1815m2100P5024P927l2548m9130q763k4886n0577n079M2847j9508
9614C81555p5985p0383k3741j2719J8707M5043R873k0362M292K2881q083J3275
9602B84353K40L1074L8457M3193n6883l1676o015k3769J871k3030L0574j8924
9590B69465k6515k0070L3908l0265o3638l0233p296M4244J0681n397N399K3068
9578B03351k497J4069O6175Q9183O1754J3064l7652r09q425j530o6597n5912K4696
9565B98770N334p2541k9753J2229n0933m5625P125M1874J9648l6950J9984J7305
9553A86467J1355m3586L3369N3952M4493K0384j1562N0789L3809p022m2493o0169
9541B69786q0525J6277l405j6120l4106M4059L301o5204l8326K8523k559l825
$$ plain form
9529 117876 116115 126820 83768 14844 23372 65573 139153 239193 327059 355022 316173 330596
9517 330596 347613 325300 242342 203035 192902 225022 211630 198598 142921 134974 92908 102257
9505 102257 89697 105648 106631 122126 107006 98957 54157 16817 58769 141066 158215 203655
9493 203655 198134 199967 212312 190571 122331 43220 36173 48541 -2638 7633 32026 12605
9481 12605 -3300 5280 17087 -19946 44641 112019 103966 100150 87036 111001 87085 82576 60579
9468 60579 55199 52738 22303 50920 9098 -7258 -3072 8062 -36609 -46512 -15730 -24470 -35594
9455 -35594 15928 77530 62182 52297 19401 56070 119697 127572 88628 59900 37886 -4973
9443 -4973 -23392 -25086 5929 61971 150774 128418 73921 51129 42412 71286 64084 46035 93867
$$ packed form
9529A17876j761J0705m3052o8924Q528M2201P3580J00040Q7866K7963l8849J4423
9517C30596J7017k2313q2958l9307j0133L2120j3392j3032n5677p947m2066R349
9505A02257j2560J5951R83J5495j5120q049m4800l7340M1952Q2297J7149M5440
9493B03655n521J833J2345k1741o8240p9111p047J2368n1179J0271K4393j9421
9481A2605j5905Q580J1807l7033O4587O7378q053l816j3114K3965k3916m509k1997
9468F0579n380k461l0435K8617m1822j6356M186J1134m4671r903L0782q740j1124
9455c5594N1522O1602j5348r885l2896L6669O3627P875l8944k8728k2014m2859
9443d973j8419j694L1015N6042Q8803k2356n4497k2792q717K8874p202j8049M7832
$$ plain form
9430 93867 94282 114383 100656 82408 114781 76111 26242 32867 101888 128711 148302 182424
9418 182424 152031 105145 114250 73955 127671 187776 222816 194698 188737 171463 97982 78278
9406 78278 54204 18168 50010 101481 86613 102695 82790 1943 -21720 42607 83365 24591
9394 24591 16634 37578 36584 80705 55786 41826 63835 69016 26142 11316 -19877 16126 32094
9381 32094 28223 16933 82036 107145 93364 61498 -21202 -30289 12067 6925 9501 61474 62148
9368 62148 15897 33111 66434 67248 35638 5908 34109 37439 52655 43784 46049 32898 2254
9355 2254 14220 21630 22669 1013 31530 27168 70171 45486 13543 37103 24963 -28798 -107160
9342 -107160 -120453 -132762 -128722 -48179 32556 103699 72329 872 -23183 15502 67794 52821
$$ packed form
9430I3867M15K0101j3727j8248L2373l8670m9869O625O9021K6823J9591L4122
9418A82424l0393m6886R105m0295N3716O0105L5040k8118n961j7274p3481j9704
9406G8278k4074l6036L1842N1471j4868J6082j9905q0847k3663O4327M0758n8774
9394B4591p957K0944r94M4121k4919j3960K2009N181m2874j4826l1193L6003J5968
9381C2094l871j1290O5103K5109j3781l1866q2700r087M2356n142K576N1973O74
9368F2148m6251J7214L3323Q14l1610k9730K8201L330J5216q871K265j3151l0644
9355B254J1966P410J039k1656L0517m362M3003k4685l1943K3560j2140n3761p8362
9342a07160j3293j2309M040Q0543Q0735P1143l1370p1457k4055L8685N2292j4973
$$ plain form
9330 52821 37738 37555 41083 68067 82389 17880 -16431 25945 38955 24164 38381 16168
9318 16168 24203 37117 1432 4116 30468 28251 546 -28695 -43104 -16440 -61263 -35300
9306 -35300 -10911 9691 -13655 50975 96756 74918 68338 58321 65900 43126 47969 48678 60844
9293 60844 29069 824 32282 20965 71777 110561 114695 102929 51170 -38877 -91385 -60414
9281 -60414 -55318 24582 109129 77810 49690 -23146 -37773 6138 37837 70132 69160 25271
9269 25271 -7401 7791 33258 75068 98376 125418 139409 75041 4557 -20471 -50625 -10405
9257 -10405 43952 90292 104193 57325 66491 110700 95666 41597 35195 74835 100182 63816
9245 63816 37683 21275 4188 5103 46161 94696 101771 64024 52560 81590 133360 129702 87502
$$ packed form
9330E2821j5083j83L528K6984J4322o4509l4311M2376J3010j4791J4217k2213
9318A6168Q035J2914l5685K684K6352k217k7705k9241j4409K6664m4823K5963
9306c5300K4389K0602k3346O4630M5781k1838o580j0017P579k2774M843P09J2166
9293F0844l1775k8245L1458j1317N0812L8784M134j1766n1759r0047n2508L0971
9281f0414N096P9900Q4547l1319k8120p2836j4627M3911L1699L2295r72m3889
9269B5271l2672J5192K5467M1810K3308K7042J3991o4368p0484k5028l0154M0220
9257a0405N4357M6340J3901m6868R166M4209j5034n4069o402L9640K5347l6366
9245F3816k6133j6408j7087R15M1058M8535P075l7747j1464K9030N1770l658m2200
$$ plain form
9232 87502 86738 113823 123307 129235 169848 152160 134916 154059 137597 100175 135291 138569 121348
9219 121348 139833 112919 77717 65242 75003 155472 164885 157645 200554 214238 182225 168592
9207 168592 203749 151265 105228 49665 22740 26617 9654 61284 74859 51267 66684 69551
9195 69551 49833 83629 104344 116538 121975 128401 141624 159786 148002 35661 8882 80674
9183 80674 144975 164125 158389 149385 110380 113309 126002 150614 99022 100721 158363 159435 98948
9170 98948 97356 155497 180299 250800 262535 205145 150626 109341 94754 133986 199932 187848
9158 187848 167440 163712 169417 174380 157793 155671 218508 262072 275254 246269 226172 189312
9146 189312 167546 129624 128003 222868 285802 257097 275199 256235 231591 283633 279609 291489
$$ packed form
9232H7502p64K7085R484N928M0613j7688j7244J9143j6462l7422L5116L278j7221
9219A21348J8485k6914l5202j2475R761Q0469R413p240M2909J3684l2013j3633
9207A68592L5157n2484m6037n5563k6925L877j6963N1630J3575k3592J5417K867
9195F9551j9718L3796K0715J2194N437O426J3223J8162j1784j12341k6779P1792
9183H0674O4301J9150n736r004l9005K929J2693K4612n1592J699N7642J072o0487
9170I8948j592N8141K4802P0501J1735n7390n4519m1285j4587L9232O5946j2084
9158A87848k0408l728N705M963j6587k122O2837M3564J3182k8985k0097l6860
9146A89312k1766l7922j621R4865O2934k8705J8102j8964k4644N2042m024J1880
$$ plain form
9134 291489 246307 210769 219479 191522 224499 257556 247768 206900 230353 219071 231613 225932
9122 225932 232749 165447 158880 184437 214495 248266 226881 183691 165323 171290 218553 252009
9110 252009 304593 329719 372378 379848 379524 366835 351118 386669 387207 339499 312853 288778 305239
9097 305239 286687 240117 298791 294866 181604 135656 90448 91671 187739 249937 317737 369076
9085 369076 336174 375051 402424 388943 378638 389913 336907 269170 254701 232678 178705 209920
9073 209920 265301 323875 345779 321786 255554 226466 252688 266373 290789 272669 277046 234393
9061 234393 222518 258510 249887 203157 162503 210962 207357 244399 291398 299890 306679 328557
9049 328557 331875 357670 353492 366893 330263 269199 194661 213482 239961 188892 155184 162009
$$ packed form
9134B91489m5182l5538Q710k7957L2977L3057r788m0868K3453j1282J2542n681
9122B25932O817o7302o567K5557L0058L3771k1385m3190j8368N967M7263L3456
9110B52009N2584K5126M2659P470l24j2689j5717L5551N38m7708k6646k4075J6461
9097C05239j8552m6570N8674l925j13262m5948m5208J223R6068O2198O7800N1339
9085C69076l2902L8877K7373j3481j0305J1275n3006o7737j4469k2023n3973L1215
9073B09920N5381N8574K1904k3993o6232k9088K6222J3685K4416j8120M377m2653
9061B34393j1875L5992q623m6730m0654M8459l605L7042M6999Q492O789K1878
9049C28557L318K5795m178J3401l6630o1064p4538J8821K6479n1069l3708O825
$$ plain form
9037 162009 99716 117056 145518 140190 139520 140372 211132 251448 252395 258803 196731 143202 133311
9024 133311 167100 174085 126485 101724 92942 144915 173569 213877 253655 280047 264879 287935
9012 287935 298894 258130 211814 193925 183959 167313 168018 172057 171352 161112 190834 169234 152457
8999 152457 172454 178669 191171 153505 153633 141273 133130 171856 147882 122659 85048 104897
8987 104897 167535 146734 123472 141669 190408 173383 170500 252458 304430 277307 212184 162139
8975 162139 126587 133487 120610 120951 143312 116287 100688 101350 167792 167743 186063 167474 160885
8962 160885 206384 199745 168056 138774 130276 167526 192407 214081 203484 184005 269322 296812
8950 296812 335793 325756 283119 261326 229639 191632 229846 177440 118051 127148 76828 65349
$$ packed form
9037A62009o2293J7340K8462n328o70Q52P0760M0316R47O408o2072n3529r891
9024A33311L3789O985m7600k4761q782N1973K8654M0308L9778K6392j5168K3056
9012B87935J0959m0764m6316j7889r966j6646P05M039p05j0240K9722k1600j6777
8999A52457J9997O215J2502l7666J28j2360q143L8726k3974k5223l7611J9849
8987A04897O2638k0801k3262J8197M8739j7025k883Q1958N1972k7123o5123n0045
8975A62139l5552O900j2877L41K2361k7025j5599O62O6442m9J8320j8589o589
8962A60885M5499o639l1689k9282q498L7250K4881K1674j0597j9479Q5317K7490
8950B96812L8981j0037m2637k1793l1687l8007L8214n2406n9389R097n0320j1479
$$ plain form
8938 65349 72257 86826 123037 176389 225078 227864 217132 247550 215610 198537 203221 189817
8926 189817 199516 239945 265467 236818 294482 332268 270212 184676 176758 155571 157759 204380
8914 204380 178535 183351 210824 190403 208281 224729 205454 202282 183923 218975 204221 235244
8902 235244 260037 216817 195231 211842 269935 276569 288450 292312 316652 339532 364983 397626
8890 397626 387253 421482 448295 456272 548295 643509 778476 1092699 1544309 2079956 2528266
8879 2528266 2274014 1512215 982763 750347 603970 488644 446231 397225 422178 409380
8869 409380 361447 338088 355977 332474 300005 279250 323249 344606 336756 333218 387785 414440
8857 414440 398805 361300 287921 289934 292029 305041 346197 338525 294134 295513 352803 406939
$$ packed form
8938F5349O908J4569L6211N3352M8689K786j0732L0418l1940j7073M684j3404
8926A89817R699M0429K5522k8649N7664L7786o2056q5536p918k1187K188M6621
8914B04380k5845M816K7473k0421J7878J6448j9275l172j8359L5052j4754L1023
8902B35244K4793m3220k1586J6611N8093O634J1881L862K4340K2880K5451L2643
8890C97626j0373L4229K6813P977R2023R5214J34967L14223M51610N35647M48310
8879B528266k54252p61799n29452k32416j46377j15326m2413m9006K4953j2798
8869D09380m7933k3359J7889k3503l2469k0755M3999K1357p850l538N4567K6655
8857D14440j5635l7505p3379K013K095J3012M1156p672m4391J379N7290N4136
$$ plain form
8845 406939 418753 439850 472918 601064 703537 889483 1205940 1734781 2550551 3638278
8835 3638278 4706542 4410486 2985900 1878760 1248448 931943 739555 625543 502674
8826 502674 457731 413225 364538 326500 321723 339805 344498 343495 322617 306935 383002 456592
8814 456592 516495 599770 646378 524373 436911 377181 338517 349156 358151 367734 459944 445115
8802 445115 371751 341880 323045 357645 411398 482669 535702 634411 821046 1037618 1399819
8791 1399819 1872893 2324174 2308434 1733026 1225950 902643 668353 539490 444315 400345
8781 400345 389248 378877 401965 411309 428093 447542 462301 426735 439452 467020 495056 542528
8769 542528 585322 625953 645364 609809 588355 574034 572831 545776 548007 554504 584724 546229
$$ packed form
8845D06939J1814K1097L3068J28146J02473J85946L16457N28841Q15770J087727
8835C638278J068264k96056j424586j107140o30312l16505j92388j14012j22869
8826E02674m4943m4506m8687l8038m777J8082M693j003k0878j5682P6067P3590
8814D56592N9903Q3275M6608j22005q7462n9730l8664J0639Q995R583R2210j4829
8802D45115p3364k9871j8835L4600N3753P1271N3033R8709J86635K16572L62201
8791A399819M73074M51281j5740n75408n07076l23307k34290j28863r5175m3970
8781D00345j1097j0371K3088R344J6784J9449J4759l5566J2717K7568K8036M7472
8769E42528M2794M0631J9411l5555k1454j4321j203k7055K231O497L0220l8495
$$ plain form
8757 546229 575478 618430 617644 614492 590847 582536 567644 497998 452731 423027 398962 398127 443656
8744 443656 401369 404413 455483 510318 558974 569982 618678 667760 649504 684228 674259 703157
8732 703157 747326 785192 797816 804288 786523 797810 801526 782381 742249 730601 733910 705991
8720 705991 680241 670824 615636 607821 620916 669466 656570 667024 654854 665837 683696 711648
8708 711648 784992 847468 851815 881304 1018579 1113519 1169808 1235133 1261998 1215386 1187100 1215170
8696 1215170 1247223 1309589 1417377 1463482 1492431 1490765 1471354 1432363 1337407 1226271 1203871
8685 1203871 1198481 1271746 1360201 1552048 1814101 2141055 2403150 2284693 1926642 1671365
8675 1671365 1475279 1406939 1381283 1421508 1516323 1604276 1696812 1828397 1852404 1781756 1735232
$$ packed form
8757E46229K9249M2952p86l152k3645q311j4892o9646m5267k9704k4065q35M5529
8744D43656m2287L044N1070N4835M8656J1008M8696M9082j8256L4724r969K8898
8732G03157M4169L7866J2624O472j7765J1287L716j9145m0132j1648L309k7919
8720G05991k5750r417n5188p815J3095M8550j2896J0454j2170J0983J7859K7952
8708G11648P3344O2476M347K9489J37275R4940N6289O5325K6865m6612k8286K8070
8696A215170L2053O2366J07788M6105K8949j666j9411l8991r4956j11136k2400
8685A203871n390P3265Q8455J91847K62053L26954K62095j18457l58051k55277
8675A671365j96086o8340k5656M0225R4815Q7953R2536J31585K4007p0648m6524
$$ plain form
8664 1735232 1663446 1547129 1504059 1485554 1506898 1524990 1564333 1564395 1632267 1615627 1623648 1664530
8652 1664530 1731149 1777491 1804815 1861300 1859845 1849274 1922589 1987275 2099794 2143300 2199954
8641 2199954 2267510 2359504 2502812 2805445 3214458 3784215 4611391 5550502 5700697 5238401
8631 5238401 5216017 5635465 6526004 7940994 10147862 13132008 14314030 11315171 8032928
8622 8032928 6219597 5236191 4709639 4533382 4542457 4661627 4738991 4724442 4627321 4509235
8612 4509235 4425320 4264503 4130617 4092977 4185480 4346219 4470630 4615018 4679951 4767521
8602 4767521 4972196 5173062 5266767 5246540 5193431 5072073 4931910 4690950 4677493 4817631
8592 4817631 5053673 5402438 5913392 6569239 7070901 7389569 8046780 9344736 11207681
$$ packed form
8664A735232p1786j16317m3070j8505K1344J8092L9343O2O7872j6640Q021M0882
8652A664530O6619M6342K7324N6485j455j0571P3315O4686J12519M3506N6654
8641B199954O7556R1994J43308L02633M09013N69757Q27176R39111J50195m62296
8631E238401k2384M19448Q90539J414990K206868K984146J182022k998859l282243
8622H032928j813331r83406n26552j76257R075J19170P7364j4549r7121j18086
8612D509235q3915j60817j33886l7640R2503J60739J24411J44388O4933Q7570
8602D767521K04675K00866R3705k0227n3109j21358j40163k40960j3457J40138
8592D817631K36042L48765N10954O55847N01662L18668O57211J297956J862945
$$ plain form
8583 11207681 13733540 17693031 23542825 27629669 22632166 15307253 11240957 9359813
8575 9359813 8493919 8232639 8175659 8218945 8337043 8212981 7929579 7595329 7276990 6683358
8565 6683358 6023363 5643641 5492061 5503105 5628823 5844890 6096970 6409590 6782750 7044792
$$ packed form
8583A1207681K525859L959491N849794M086844m997503p324913m066296j881144
8575I359813q65894k61280n6980M3286J18098j24062k83402l34250l18339n93632
8565F683358o59995l79722j51580J1044J25718K16067K52080L12620L73160K62042
$$ [...]
##END NTUPLES=NMR SPECTRUM
##END=
