##TITLE=Analysis number 329069
Compound Code cc 67402
Book Reference 511/168
Project Code adrs
Chemist Name stevem
##JCAMPDX= 6.0         $$ Bruker NMR JCAMP-DX V2.0
##DATA TYPE= NMR SPECTRUM
##DATA CLASS= NTUPLES
##ORIGIN= Bruker BioSpin GmbH
##OWNER= nmr
$$ XWIN-NMR		Version 3.5
$$ Mon Jul 30 09:14:21 2007 GMT Daylight Time (UT+1h)  MAYBRIDGE\nmr@NMR_250MHZ
##.OBSERVE FREQUENCY= 250.131544655141
##.OBSERVE NUCLEUS= ^1H
##.ACQUISITION MODE= SIMULTANEOUS (DQD)
##.ACQUISITION SCHEME= undefined
##.AVERAGES= 16
##.DIGITISER RES= 18
##SPECTROMETER/DATA SYSTEM= dpx250
##.PULSE SEQUENCE= zg30
##.SOLVENT NAME= CDCl3
##.SHIFT REFERENCE= (INTERNAL, CDCl3, 0, 16.522)
##AUDIT TRAIL= $$ (NUMBER, WHEN, WHO, WHERE, WHAT)
$$ ##TITLE= Audit trail, XWIN-NMR		Version 3.5
$$ ##JCAMPDX= 5.01
$$ ##ORIGIN= Bruker BioSpin GmbH
$$ ##OWNER= nmr
$$ C:\u/data/dgb/nmr/ADRS/1640/pdata/1/auditp.txt
$$ ##AUDIT TRAIL=  $$ (NUMBER, WHEN, WHO, WHERE, WHAT)
(   1,<2007-07-30 09:13:59.69 +100>,<MAYBRIDGE\nmr>,<NMR_250MHZ>,
      <created by zg, POWCHK disabled, PULCHK disabled
       configuration hash MD5:
       76 6E 9A 78 1E 09 19 81 EC 84 63 8F B0 6A 59 2D
       data hash MD5: 64K
       6D 45 AE BB 23 84 F4 65 45 17 D0 B4 1B 55 4E 76>)
(   2,<2007-07-30 09:14:11.44 +100>,<MAYBRIDGE\nmr>,<NMR_250MHZ>,
      <Start of raw data processing
       ef LB = 0.3 FT_mod = 6 PKNL = 1 SI = 32K 
       data hash MD5: 32K
       CA 1E 25 70 07 C4 03 A1 A3 A1 7F 36 75 B9 D3 6F>)
(   3,<2007-07-30 09:14:13.54 +100>,<MAYBRIDGE\nmr>,<NMR_250MHZ>,
      <apk 
       data hash MD5: 32K
       C9 65 17 FA 6C 53 DA 65 78 DE FB 52 FB B7 C8 D5>)
(   4,<2007-07-30 09:14:14.28 +100>,<MAYBRIDGE\nmr>,<NMR_250MHZ>,
      <abs ABSG = 5 
       data hash MD5: 32K
       5E 2E 6B 47 52 B8 61 30 F0 6D 59 E1 54 56 13 5D>)
$$ ##END=
$$ 
$$ hash MD5
$$ 32 4A 12 A4 2B 01 F5 E1 E0 6D 03 CF AF B9 3E 8B
##$RELAX= 
##$RELAX= 
##$RELAX= 
##$RELAX= 
##$RELAX= 
##$RELAX= 
##$RELAX= 
$$ Bruker specific parameters
$$ --------------------------
##$DU= <C:\u>
##$EXPNO= 1640
##$NAME= <ADRS>
##$PROCNO= 1
##$TYPE= <nmr>
##$USER= <dgb>
##$AMP= (0..31)
100 100 100 100 100 100 100 100 100 100 100 100 100 100 100 100 100 100 
100 100 100 100 100 100 100 100 100 100 100 100 100 100 
##$AQSEQ= 0
##$AQ_mod= 3
##$AUNM= <au_zg>
##$AUTOPOS= <4 >
##$BF1= 250.13
##$BF2= 250.13
##$BF3= 250.13
##$BF4= 250.13
##$BF5= 500.13
##$BF6= 500.13
##$BF7= 500.13
##$BF8= 500.13
##$BYTORDA= 1
##$CFDGTYP= 0
##$CFRGTYP= 5
##$CHEMSTR= <none>
##$CNST= (0..31)
1 1 145 1 1 1 1 1 1 1 1 1 1 1 1 1 1 1 1 1 1 1 1 1 1 1 1 1 1 1 1 1 
##$CPDPRG= <>
##$CPDPRG1= <>
##$CPDPRG2= <>
##$CPDPRG3= <>
##$CPDPRG4= <mlev>
##$CPDPRG5= <mlev>
##$CPDPRG6= <mlev>
##$CPDPRG7= <mlev>
##$CPDPRG8= <mlev>
##$CPDPRGB= <>
##$CPDPRGT= <>
##$D= (0..31)
0 1 0 0 0 0 0 0 0 0.06 0 0 0 0 0 0 0.0002 0 0 0 0 0 0 0 0 0 0 0 0 0 0 
0 
##$DATE= 1185783238
##$DBL= (0..7)
120 120 120 120 120 120 120 120 
##$DBP= (0..7)
150 150 150 150 150 150 150 150 
##$DBP07= 0
##$DBPNAM0= <>
##$DBPNAM1= <>
$$ [...]
##$SUBNAM7= <"">
##$SUBNAM8= <"">
##$SUBNAM9= <"">
##$SW= 20.6930455092707
##$SWIBOX= (0..15)
0 0 3 0 0 0 0 0 0 0 0 0 0 0 0 0 
##$SW_h= 5175.983436853
##$TD= 65536
##$TD0= 1
##$TE= 296.16
##$TE2= 300
##$TE3= 300
##$TEG= 300
##$TL= (0..7)
0 120 120 120 120 120 120 120 
##$TP= (0..7)
150 150 150 150 150 150 150 150 
##$TP07= 0
##$TPNAME0= <>
##$TPNAME1= <>
##$TPNAME2= <>
##$TPNAME3= <>
##$TPNAME4= <>
##$TPNAME5= <>
##$TPNAME6= <>
##$TPNAME7= <>
##$TPOAL= (0..7)
0.5 0.5 0.5 0.5 0.5 0.5 0.5 0.5 
##$TPOFFS= (0..7)
0 0 0 0 0 0 0 0 
##$TUNHIN= 0
##$TUNHOUT= 0
##$TUNXOUT= 0
##$USERA1= <user>
##$USERA2= <user>
##$USERA3= <user>
##$USERA4= <user>
##$USERA5= <user>
##$V9= 5
##$VALIST= <valist>
##$VCLIST= <CCCCCCCCCCCCCCC>
##$VD= 0
##$VDLIST= <DDDDDDDDDDDDDDD>
##$VPLIST= <PPPPPPPPPPPPPPP>
##$VTLIST= <TTTTTTTTTTTTTTT>
##$WBST= 1024
##$WBSW= 4
##$XGAIN= (0..3)
0 0 0 0 
##$XL= 0
##$YL= 0
##$YMAX_a= 285387
##$YMIN_a= -451932
##$ZGOPTNS= <>
##$ZL1= 120
##$ZL2= 120
##$ZL3= 120
##$ZL4= 120
##$ABSF1= 16.522
##$ABSF2= -4.171173
##$ABSG= 5
##$ABSL= 3
##$ALPHA= 0
##$AQORDER= 0
##$ASSFAC= 0
##$ASSFACI= 0
##$ASSFACX= 0
##$ASSWID= 0
##$AUNMP= <proc_1d>
##$AZFE= 0.1
##$AZFW= 0.1
##$BCFW= 0
##$BC_mod= 0
##$BYTORDP= 0
##$COROFFS= 0
##$CY= 12.5
##$DATMOD= 1
##$DC= 0
##$DFILT= <>
##$DTYPP= 0
##$F1P= 14.0000005364418
##$F2P= -0.99999901652339
##$FCOR= 0.5
##$FTSIZE= 32768
##$FT_mod= 6
##$GAMMA= 0
##$GB= 0
##$INTBC= 1
##$INTSCL= 1
##$ISEN= 128
##$LB= 0.3
##$LEV0= 0
##$LPBIN= 0
##$MAXI= 10000
##$MC2= 0
##$MEAN= 0
##$ME_mod= 0
##$MI= 0
##$NCOEF= 0
##$NC_proc= -4
##$NLEV= 6
##$NOISF1= 0
##$NOISF2= 0
##$NSP= 0
##$NTH_PI= 0
##$NZP= 0
##$OFFSET= 16.522
##$PC= 1
##$PHC0= -31.442
##$PHC1= -18.47605
##$PH_mod= 1
##$PKNL= yes
##$PPARMOD= 0
##$PSCAL= 4
##$PSIGN= 0
##$REVERSE= no
##$SF= 250.13
##$SI= 32768
##$SIGF1= 0
##$SIGF2= 0
##$SINO= 400
##$SIOLD= 32768
##$SREGLST= <1H.CDCl3>
##$SSB= 0
##$STSI= 32768
##$STSR= 0
##$SW_p= 5175.98343685301
##$SYMM= 0
##$S_DEV= 0
##$TDeff= 65536
##$TDoff= 0
##$TI= <Analysis number 999999
Compound Code 99
Book Reference 9
Project Code 9>
##$TILT= no
##$TM1= 0
##$TM2= 0
##$TOPLEV= 0
##$USERP1= <user>
##$USERP2= <user>
##$USERP3= <user>
##$USERP4= <user>
##$USERP5= <user>
##$WDW= 1
##$XDIM= 32768
##$YMAX_p= 323520670
##$YMIN_p= -394549
$$ End of Bruker specific parameters
$$ ---------------------------------
##NTUPLES= NMR SPECTRUM
##VAR_NAME=  FREQUENCY,     SPECTRUM/REAL,   SPECTRUM/IMAG
##SYMBOL=    X,             R,               I
##VAR_TYPE=  INDEPENDENT,   DEPENDENT,       DEPENDENT
##VAR_FORM=  AFFN,          ASDF,            ASDF
##VAR_DIM=   32768,         32768,           32768
##UNITS=     HZ,            ARBITRARY UNITS, ARBITRARY UNITS
##FACTOR=    0.157963299565203, 1,           1
##FIRST=     4132.6476996994, 0,             0
##LAST=      -1043.33573715361, 0,           0
##MIN=       -1043.33573715361, -394549,     0
##MAX=       4132.6476996994, 323520670,     0
$$ Real data points
##PAGE= N=1
##DATA TABLE= (X++(R..R)), XYDATA
$$ [...]
16685b731J6591j2015j5108p847l6272n528l245J6521L4970o950j2003Q336J499
16672b3782K195j1816j970n339n088k7017r324M5567K8456K6512N0672N912l560
16659G1418k8748j8712K8709K5771l4013k7568N886L5074J296j1568L1006M928
16647H3479Q231k6260k1985l2172k08j6858P187P396k456K3431L273K131K194
16634C7383j0183m3322k5507K1230J5912J1147J5563K793l647q751J6724o74J6539
16621D5207Q129J703K802o503j7748j1526L345j2431l6456r07J431l2064J7803
16608c7215O599N0993K3808j0653o1582j7051j0778m1702J3504J8852j371N831
16596f0765J3213O671K635K8416L9620r677l1051L2646K1036j0120k6433K6533
$$ y = [-2731, 13860, 1845, -13263, -21110, -57382, -62910, -66155, -49634, -14664, -21614, -33617, -25281, -23782, -21587, -33403, -35373, -40712, -45800, -72817, -82141, -36574, -8118, 18394, 69066, 74978, 71418, 42670, 23958, 52667, 78438, 44425, 16857, 22743, 57817, 59113, 47545, 78551, 83479, 91710, 65450, 43465, 11293, 11085, -5773, 1414, 8810, 6354, 29785, 33058, 35189, 37383, 27200, -16122, -41629, -20399, -4487, 6660, 22223, 25016, 21369, 12618, 29342, 28668, 45207, 53336, 55039, 57841, 51338, 33590, 22064, 25409, 12978, -23478, -24385, -22954, -55018, -37215, -30616, 20377, 44185, 33532, -28050, -45101, -55879, -97581, -84077, -65225, -66596, -60765, -47552, -40881, -38246, -9830, 29790, 20113, -10938, 21708, 42744, 32624, 6191, 32724]
16584C2724j5626m9213k5989k9492M0030M0936L1056j2399J723l308l8839j6043
16572d4440J4630J3964j0272j1449l638J4460J2623l0693N456q025j6525K2213
16560d1696k100K0147M4002R572j6286j6401k3327N605p898O921j5566J8179K024
16547a6824M240M6827K730j4961l3271J2043J1971K1497K376J7328L0080j3005
16535G1031n3087l2173J134j0767K50J4132J2951M857k0502R808j1725q063m357
16522b6511K3630K6176J8558k5848j9112M222o400k306J4802M647k0832j1281
16510b0255J046J509N589L2265K4564j9697m9645j5898P594K230J8319K8242K1048
16497C6911J0701Q700n986j263m7295k4003k4841R186K1722R52p256k9969K0984
$$ y = [32724, 17098, -32115, -58104, -87596, -47566, -6630, 24426, 12027, 13750, 10442, -28397, -44440, -29810, -15846, -26118, -37567, -41205, -26745, -14122, -44815, -39359, -47384, -63909, -41696, -43796, -23649, 20353, 29925, 13639, -2762, -26089, -20484, -28382, -21461, -37027, -18848, -16824, -12584, 34243, 36973, 22012, -11259, 784, 12755, 34252, 36628, 53956, 84036, 71031, 17944, -14229, -13095, -23862, -23612, -9480, 3471, 8328, -12174, -2366, -14091, -22154, -26511, -2881, 23295, 41853, 16005, -3107, 1115, -5285, -7591, 7211, 11858, -8974, -20255, -19209, -17700, -12111, 20154, 44718, 25021, -24624, -40522, -32928, -30698, -12379, 15863, 36911, 47612, 56312, 50326, 49063, 1768, -22235, -47076, -37890, -16168, -15216, -22472, -52441, -31457]
16484c1457P991j0556L6366N2101m3884L344K9237J3519q038m6475j7487N1724
16472C6385K0744k3232k1446k8245O823J9833n86J104r400j3166l9049l190K7272
16459b6153J3137Q797J325L7310K708j9047k1276j1814n062q711Q463K2945j71
16446B451j3358k883M7918j372n4553m7759L5591O6008L182o2049n421J1300K2325
16433A380Q78k4229m4631L6529K780R86j1782k930J3111l2845n1279L2740p30
16420h0022j8102M2827L9775J4090m843J0541K3511j383k7601l042p437m162L6022
16407B0174J1200L0521l755j387j3411k3736N208O33J5704O824m677r825l9305
16394e832Q426r981k867k7350J2945K0394L3636k4677J0842p520l4237j6125K5107
$$ y = [-31457, -23466, -34022, 2344, 54445, 10561, 13905, 43142, 56661, 48623, 2148, -15339, 36385, 57129, 33897, 12451, -15794, -8971, 10862, 10276, 11380, 1980, -11186, -50235, -53425, -26153, -13016, -4219, -2894, 34416, 37124, 18077, -3199, -15013, -20075, -28786, -20323, 2622, 2451, -10907, -13790, 34128, 32756, -21797, -69556, -33965, 32043, 35225, -26824, -32245, -20945, 1380, 2258, -21971, -66602, -30073, -27293, -26307, -38089, -41019, -27908, -60753, -112032, -79292, -80022, -98124, -55297, -15522, -1432, -6275, 4266, 27777, 26394, -1207, -4249, -11686, -15848, 20174, 31374, 61895, 58140, 56753, 43342, 19606, 24814, 25447, 41151, 47975, 43298, 33473, -5832, 2594, -7387, -10254, -37604, -24659, -4265, 29371, 4694, 15536, 8016, -26221, -42346, -17239]
16381a7239R760p422L5221J1020j3772J7496K1363J5224m5728m2169K6186R225
16369A9165R474l0644j6515k9381K606J4362m0116K4313J7680M7698J6444k3942
16357A1144k723k4687j6492J0660J952l2569k8081J0362L5333j1278J3270L9804
16345F695n209k6896J3215L6575J5913o707K3892o251j5267l4938j0163l324o196
16332a8661j332O2636K0381k7061J4549J5742J043j9329l4350n433k0799J2989
16320C75N133n98M086M249K3541J0506N653k7056l571r345p315l363j1543N612
16306c636P409J7457n844j3326L4141J9851j0113l0915K466M9247M269K6550j3915
16293H3641k4875n0213l3861k4489k4486n895O926J0935L4709K437q832Q343q750
$$ y = [-17239, -7479, -14901, 20320, 31340, 17568, 35064, 56427, 71651, 25923, -16246, 9940, 19165, 28639, -2005, -18520, -47901, -45295, -30933, -71049, -46736, -29056, 18642, 35086, 11144, 8421, -16266, -32758, -22098, -20146, -52715, -80796, -70434, -35101, -46379, -33109, 6695, 1486, -25410, -12195, 24380, 40293, 33586, 57478, 51227, 35960, 1022, -9141, -12465, -18661, -19993, 42643, 63024, 35963, 50512, 66254, 67297, 47968, 13618, 8185, -12614, 375, 5508, 4910, 8996, 13245, 36786, 47292, 52945, 25889, 22318, 12973, 5658, 2295, -9248, -3636, 3773, 21230, 15386, 2060, 36201, 56052, 45939, 15024, 17490, 66737, 71006, 97556, 83641, 58766, 8553, -25308, -49797, -74283, -80178, -73252, -62317, -27608, -25171, -34003, -25660, -34410]
16280c4410j7727K0206q239j194j2436J2731k25j4245L7658J4442k6807k6392
16268e6638L2430L9679r835j2312k5010k0664q097K4829M581l3776Q73K3646K6043
16255a4251o422k8780K7281M1506k937k3080K2096l4316j4399j1940J2318J7950
16243a4974J2977J6814P257r679L8164K1868j6341K4651L031l8915k009J8233
16231F1077R340l6758k2039J6743R506J3711k3203k062k3109M580L0014M2001
16219G9801m942p242O064M5500K2255m1929l426q351J8843O6180K0631l8964j7584
16206A36836L4721l0083m1237j3962l53K0988K2303k3697l7817R57j0092j0652
16194D7912P228k2064k1008p112K76m4674o160K9621J644P026p451J7581m5393
$$ y = [-34410, -52137, -31931, -40170, -41364, -53800, -41069, -41294, -55539, -17881, -3439, -30246, -56638, -24208, 15471, 5636, -6676, -31686, -52350, -60447, -35618, -31037, -64813, -63940, -40294, -14251, -20673, -49453, -22172, 19334, 16397, -6683, 15413, -18903, -33302, -45242, -32924, -14974, -1997, 14817, 22074, 12395, 50559, 72427, 56086, 80737, 83768, 44853, 42844, 61077, 70417, 33659, 11620, 28363, 37869, 51580, 28377, 26315, 3206, 7786, 37800, 79801, 74859, 67617, 73681, 119181, 141436, 99507, 96081, 87730, 106573, 172753, 193384, 154420, 136836, 171557, 141474, 100237, 86275, 85922, 106910, 129213, 105516, 67699, 68656, 58564, 47912, 55140, 33076, 12068, 4956, 5232, -39442, -45602, -15981, -14337, -7311, -14762, 2819, -42574]
16181d2574j2897J6783M381O0437Q009K392j2153n09J3923n850l3563k0134n1260
16168g3015J8521M4649M1967J1538o273J8506j0091j6506l0776J1396j9405k8354
16156c7843J2515O393j8020J8902K1598j6803j3579O283K9156N899J1291R34j997
16143B4729J9516J9211l9560J354j7886k3606k2910J450j9426r634J6004M0293
16131a0465K6349P730P844M646j1135l398r555m834j851J0286L6308k462k3489
16118B5974P08l1200m6778n0302L9931N4835J0334K7875r956k4189K886J5934
16106A6052l1506j7134j9783K0993J2742n061N2516J6715k3365j9146N46L5746
16094C9315J1709l3135j6020j8541j0368L3141J9503p361M9345J3740k2580l1710
$$ y = [-42574, -55471, -38688, -34307, 26130, 34139, 36531, 24378, 23869, 37792, 31942, -1621, -21755, -73015, -54494, -9845, 32122, 43660, 37387, 55893, 45802, 29296, -1480, 9916, -9489, -37843, -25328, -18935, -36955, -18053, 3545, -13258, -26837, -20554, 8602, 14501, 25792, 26726, 24729, 44245, 63456, 23896, 25250, 7364, -16242, -39152, -37702, -57128, -66762, -50758, -10465, 15884, 23614, 31458, 36104, 24969, 21571, 12016, 7182, 5331, 15617, 51925, 49463, 25974, 26682, -4518, -51296, -101598, -61667, -6832, 3502, 31377, 21421, -2768, 118, 16052, -15454, -32588, -52371, -31378, -18636, -23697, 28819, 45534, 22169, 3023, 3569, 39315, 51024, 17889, 1869, -16672, -27040, 6101, 25604, 18243, 67588, 81328, 58748, 27038]
16082B7038j9154k6050R432L2010N480n0073N227N033k1529k1186J4311M2725
16070C264l2898Q878J0555j086J0037k883J9221j3224l6472J9982L5937L6164
16058E7475j5915k3027r713m845N775q630l7147J1554K5980J5956k296K651r033
16045H785k1164J7246J0138J4015j8905j7345J4633L455l13J6390P397k167j0012
16032B2153m1361l1965O743J8227j8953j2165k4061J4391O4070L3259P836J6898
16020E5072K0479k3921m79k4960o231j3930r246N951K3167L7491l0290l6082k1372
16007b4351J0823m893J6077K0319k5186m3521m8331k2380M5955J2758j4979l0288
15995a07997j5391M7955L8164K9296M189q48J7091l524L3935J0736k1275J9173
$$ y = [27038, 7884, -18166, -8734, 23276, 28756, -21317, -16090, -11057, -32586, -53772, -39461, 3264, -29634, -20756, -10201, -11287, -1250, -4133, 15088, 1864, -34608, -14626, 21311, 57475, 41560, 18533, 8820, 3975, 9750, 1120, -36027, -24473, 1507, 17463, 15167, 17818, 8785, -12379, 4867, 15005, 29020, 10115, -7230, 7403, 10858, 10545, 26935, 34332, 32165, 22153, -19208, -51173, -44430, -26203, -45156, -57321, -81382, -66991, -2921, 30338, 38174, 55072, 75551, 51630, 51151, 26191, 19960, 6030, -3216, 2735, 25902, 63393, 33103, -2979, -24351, -13528, -18421, -2344, 17975, -7211, -50732, -99063, -121443, -75488, -62730, -77709, -107997, -123388, -75433, -37269, -7973, -3784, -4632, 12459, 8935, 42870, 53606, 32331, 51504]
15983E1504K5266Q286k8109Q172l717q833j3362l041k0094j8226n428k3311k2992
15970e3885R555K8311J350k3173j0976J9910L5254J7072M8569k0717m6526j3105
15958h361j4725j4670j7383Q110O526K8682k076j9316p865M9953M868k3093m0895
15945e0245k031K8367j4555j4954n659n593J8821J3268R969n43M1679q808k2682
15932a2966j1170j0038J6802K0528k3086l8420k3765m151m831L7307K9617P221
15920a6952J0229N519L441q192j6311O712K5972q236j667l1306l2082o829j5247
15907h4949J0614j3840L6597O4446K0212j1661p684j8424J7858K8983o791j8256
15895A7105k1107k1031j0248l926L635R780J4088J4109k3022k2435J536O60o367
$$ y = [51504, 76770, 85056, 56947, 65119, 61402, 52569, 39207, 36166, 16072, -2154, -7582, -30893, -53885, -44330, -16019, -14669, -37842, -48818, -28908, 6346, 23418, 71987, 51270, 4744, -8361, -23086, -37756, -55139, -47029, -40503, -11821, -13897, -33213, -41078, 8875, 13743, -9350, -50245, -52276, -23909, -38464, -53418, -59077, -64670, -45849, -32581, -22612, -23155, 18524, 9716, -12966, -24136, -34174, -17372, 3156, -19930, -58350, -82115, -86266, -91097, -53790, -24173, -16952, -6723, -1204, 2237, -5955, -22266, -15554, 10418, 2182, 515, -30791, -62873, -69702, -84949, -74335, -88175, -51578, 12868, 33080, 21419, 13735, -4689, 13169, 42152, 35361, 17105, -4002, -25033, -35281, -39207, -35572, -25792, -11704, 2405, -20617, -43052, -41516, -40856, -47223]
15882d7223M336J0296J935K7303M558k4292j4672J1895M592M2902J3040l9527
15870d857J9956K0791j7986k6022Q346P018k6808n047l5812Q451O0775M65j2025
15857b755j2983M5070j126j5128J0877l9595k3605J5877p263o535R744j597K1324
15844g695P588J1270J4516l790K0466m0353q807K9437k7383k7808j886N0569k3758
15831g634j1398m46R187Q159l6118R105K2184J225K7778M129l4365p842J2988
15818c048o56j245o561j872p760J4655O1115j3752J715J7567k9703m3060l705
15805a6310J1485O548o075k2911L5647K4085l616J1462k7408m4727n148L0326
15793f642M3504n231m3022k370K1917M5497J3260k5844q993n866J1255q726K399
$$ y = [-47223, -42887, -32591, -30656, -3353, 1205, -23087, -37759, -25864, -21272, 21630, 34670, -4857, 15099, 35890, 17904, -8118, 228, 7246, -19562, -24609, -60421, -51970, 8805, 9270, -2755, -15738, 29332, 28206, 13078, 23955, -15640, -39245, -23368, -30631, -37166, -27422, -29019, -7695, -107, 11163, 25679, 21889, 42355, 2002, -6805, 22632, -4751, -32559, -34445, 16124, -7634, -19032, -19478, -10291, -2132, -38250, -29145, -6961, -5736, 22042, 26171, -8194, -16036, -3048, -3704, -4949, -11510, -13382, -21142, -6487, 54628, 40876, 42591, 60158, 30455, -12605, -16310, -4825, 1723, -4352, -27263, 8384, 32469, 28853, 40315, 12907, -31820, -36968, -6642, 36862, 31631, -11391, -13761, 8156, 53653, 66913, 41069, 32076, 26210, 37465, 28739, 31138]
15780C1138j6491l0680m7020K1275K2467k2217r785K7840p508N189J6161K6960
15768A7329j4991l1583O232p34j8554L7798Q638k87j9441k6585k2921N1131J5997
15755B029J5338J618l5365J2489J520L7849k0338o0475j7124j0430q840L2555
15743d9174J6227l5590J4791L7776q556k0278J4363K0643J7609M0924P6044m1808
15731H2971j00820J755M6357J9659k7833R422k0800j8055K1133K9597o385m370
15719C2631L604K1106j541n9630k3691n820k4326K0847J03j075p919k763J275
15706d7199K804j690P74L3053K2336K4374J0804k7681j9052J7333m528N370J2498
15693B9196Q586l6530J3709K4957l3021j4525J8084J3869l809P656j6766n18k444
$$ y = [31138, 14647, -16033, -63053, -41778, -19311, -41528, -51313, -23473, -30981, -25792, -9631, 17329, 2338, -29245, -23013, -23747, -42301, -4503, 4135, 3848, -15593, -42178, -65099, -13968, 2029, 17367, 18985, -16380, -3891, -2371, 35478, 15140, -45335, -62459, -72889, -81729, -49174, -32947, -68537, -53746, -15970, -24526, -44804, -30441, -9798, 7811, 48735, 124779, 82971, -17849, -16094, 30263, 49922, 22089, 31511, 10711, -7344, 13789, 43386, 37001, 32631, 36235, 57341, 55800, -3830, -27521, -33341, -57667, -36820, -36717, -37792, -45711, -48474, -47199, -44395, -46085, -45311, -12258, 10078, 34452, 45256, 17575, -1477, 15856, 11328, 16698, 29196, 37782, 1252, 14961, 39918, 6897, -7628, 10456, 24325, 20516, 28172, 11406, 10888, 8444]
15680H444M814M841N1924l422m5015m6915J0626L912J4844L747j9374J0422N5431
15667E4279q801J3292j473m3571J3373J6926m195k2771l2297k268j307j8647J2876
15654b4584M6062j545j3778M813K8373k3456j4190k335J6160J0508P106j5811
15642A7323l7889k0758j4132L1848K3240J4039K0180j402N991M74r203K7790j5445
15629D2056m1807n511j1089M672M2048K5216l5150o4332l3320J307K5551K8779
15617b1580J7631L603P852q627l8034N375j1044L5575K9243j2846N678k21j8953
15604f348r567M666j8551j5690L323P666L1870K534o952K8499J6635M984k2359
15591B0710j3177p858j8802p98k2658J5520M6543k0545r819J2847J961k1425K7270
$$ y = [8444, 13258, 18099, 70023, 66601, 21586, -25329, -14703, -10791, 4053, 7800, -11574, -1152, 54279, 45478, 58770, 57297, 13726, 27099, 44025, 39830, 17059, -15238, -17506, -18813, -37460, -24584, 21478, 19933, 6155, 10968, 39341, 15885, 1695, -640, 15520, 26028, 33134, 17323, -20566, -41324, -55456, -23608, -368, 13671, 33851, 32449, 38440, 38914, 29711, 57501, 42056, 249, -5262, -16351, -11679, 30369, 55585, 20435, -43897, -77217, -75910, -50359, -21580, -3949, -346, 7506, -1121, -39155, -33780, -44824, -9249, 19994, 7148, 12826, 12605, -6348, -15915, -11249, -29800, -45490, -42167, -34501, -2631, -97, -7049, 21450, 38085, 43069, 20710, 7533, -325, -19127, -19925, -42583, -27063, 19480, -1065, -10884, 1963, 3924, -17501, 9769]
15578I769M9608K1450n1256l6784l4429j7112k1614Q639O7125K0932m331O23J3586
15565B6206l300K1194J0364j1191j678q675j2700j4020J0865K4483J9239K098
15553F2885j8629j0216j1922j9261k5615o040k6795L412P758Q373L5158K4253
15541B3361j0359q635l3982j2803J0399p626k2541K2368L1994l0248L3499J8922
15529A4349n747k6673j7273J2212N9470P02p275J5250K4331j8972p743J175J116
15516D4922L8175l7500j8583p507q220K8911K0016m072o07j0540l9453l3218j7712
15503d5388j7660p49j646J7013l221L9666K8264N809m2788l3574P0266O3152j5035
15490F4109j5288m7380j7724O145K2291K4507J6440j5026N900l5745k5616j7993
$$ y = [9769, 59377, 80827, 29571, -7213, -41642, -58754, -80368, -71729, -4604, 16328, 11997, 12620, 26206, 22906, 44100, 54464, 43273, 41595, 32920, 20220, 6200, 17065, 41548, 60787, 62885, 44256, 34040, 22118, 2857, -22758, -28798, -55593, -52181, -44423, -36050, -892, 23361, 13002, 4367, -29615, -42418, -32019, -39645, -62186, -39818, -7824, -38072, -4573, 14349, 8602, -18071, -35344, -23132, 36338, 37040, 29765, 45015, 69346, 50374, 42631, 43806, 44922, 83097, 45597, 27014, 19507, 11287, 40198, 60214, 56142, 55535, 44995, 5542, -27676, -45388, -63048, -63797, -65443, -48430, -51651, -11985, 16279, 22088, -20700, -54274, 15992, 79144, 64109, 48821, 1441, -16283, -10138, 12153, 36660, 53100, 38074, 43974, 8229, -17387, -35380]
15478c5380J5003J0143J4605r70j8481L817M04K2891J479k2494L649K349m944
15465g929j0638N180K6042o969Q744j9645R423K1443J954J1600m5382k4239K1767
15452h649M6535J6447J8180l88j6285m1307l3045Q20K2622K348q657r678L1083
15439B0026k6134j7698K5967N357n7751M664P206J662R895L7557J9191N127j8030
15426A7039R803J2501K5019L732n0142k8676L1976j9015j9748P575j429M005J7783
15413A0423J266q119N9067q730j0578m0510l3421j706L0525J389j0272M1806K5353
15400E6493m8406l1632M553r130k5998Q597J1717L8533O040m8137o865J9251M4
15387b4940j3384j8455N888P099J4330L307r755k6328J5412j948M343j2750q631
$$ y = [-35380, -20377, -10234, 4371, 3401, -15080, -11263, -10859, 12032, 13511, -8983, -5334, -2985, -7929, -18567, -13387, 12655, 5686, 14430, -5215, 4208, 25651, 27605, 39205, -6177, -30416, -8649, 37886, 54333, 72513, 72125, 55840, 14533, -18512, -17692, 4930, 7278, -1379, -11057, 20026, -6108, -23806, 2161, 7518, -50233, -45569, -38363, -36701, -26806, 10751, 29942, 35069, 17039, 26842, 39343, 64362, 68094, 17952, -10724, 21252, 2237, -17511, -9936, -11365, -7360, 10423, 11689, 3570, 62637, 53907, 43329, 2819, -30602, -32308, -1783, -394, -10666, 31140, 56493, 8087, -23545, -18992, -28122, -54120, -45523, -33806, 4727, 10767, -37370, -44235, -24984, -24940, -38324, -56779, -50891, -43792, -29462, -26155, -35910, -62238, -46826, -48774, -44431, -57181, -65812]
15374f5812p274K8573J2916M1768K2364m3596L932L674r91O141J665k780J5228
15361A5808Q844m091k7510J1996j160k598m1985k3071K3679L2379J3184j6975
15349a1500q504M1059j4845j08J4236K9333K4280k7713j7416J2819j6695k8089
15337c143l3917j2161K4690M0582J578l9590L92k4846k3958m8K8888K3968j106
15324a8671k3866n816J5966Q4686l2608o8561J1820N1369k1308k4530N2723J6986
15312C8190k3960M608k1022k6754J4598L8371Q793J411R32n8501o138J150p010
15299c5332K8512M6435j2115j5758j7341l5568m4932M7319L1164n00j3175q655
15287b9946l982M486J1804o982J0682k2659M4204J1489j8342k5826o094l7263
$$ y = [-65812, -73086, -44513, -31597, 10171, 32535, -11061, -7129, -3455, -4446, 1695, 3360, 580, 15808, 24652, 20561, -6949, 5047, 3887, 1289, -40696, -63767, -40088, -7709, 5475, -11500, -20004, 21055, 6210, 6102, 20338, 49671, 73951, 46238, 28822, 41641, 24946, -3143, -37060, -49221, -24531, 16051, 17629, -21961, -21569, -46415, -70373, -70421, -41533, -17565, -18671, -42537, -48353, -32387, 52299, 19691, -48870, -37050, 14319, -6989, -31519, 21204, 38190, 14230, 18838, -2184, -28938, -14340, 24031, 32824, 34235, 35167, -23334, -29472, -28322, -35332, -6820, 39615, 27500, 11742, -5599, -41167, -86099, -38780, -7616, -8116, -21291, -29946, -33928, -29442, -17638, -24620, -13938, -36597, 7607, 19096, 754, -25072, -31166, -68429]
15275f8429K3842M7533n666o860k2290J3254J1689l2036L25L0123j1052q587l967
15262c2121Q684j840K555K553m989K1012j2848J4931k3138k0243K7250M0653j1620
15249A0839o0811r060k6488J7142J1935N209K8824j260P799K974P875j3723m6736
15236f5481K7118K7150J7310P918j6338J6508m4327Q609J3564K9156O471K401
15224C0059k608j0294l8099l906K1463j9734J059J0153K0084K6101k122j777N183
15211C5562L3201j0131j7606j4209j2355o6884k9131k3345K127J8518J0618M5593
15199b8042Q869J9696M967l8221k4850j8746j2840M2189K4020J3116L7626L8708
15187F6492K4178k5564L333J1814k6510n5098j6070j8368J8707J2910j3000K0502
$$ y = [-68429, -44587, 2946, -2720, -9580, -31870, -18616, -6927, -38963, -38638, -8515, -19567, -28154, -32121, -23437, -25277, -22722, -20169, -25158, -4146, -16994, -2063, -25201, -45444, -18194, 22459, 10839, -49972, -59032, -85520, -68378, -56443, -51234, -22410, -23670, -15871, -12897, -5022, -18745, -65481, -38363, -11213, 6097, 14015, -2323, 14185, -30142, -21533, -7969, 21187, 27658, 30059, 27451, 17157, -20942, -24848, -3385, -23119, -22060, -11907, 8177, 34278, 32156, 30379, 35562, 68763, 58632, 41026, 26817, 14462, -52422, -81553, -104898, -102771, -84253, -73635, -28042, -19173, 523, 5490, -32731, -57581, -76327, -89167, -46978, -22958, -9842, 27784, 66492, 90670, 65106, 68439, 80253, 53743, -1355, -17425, -35793, -17086, -4176, -17176, 3326]
15175C326J8139k1627K4314O3477l1576n0749l8853k8576j9517M4883N791l2725
15163f3693q01M3497l120j5542M45o979l2101j4304L7419L8488m235k0296L013
15150c8209j6089J8145K2842J0779M2267M775k8407j229q886k1343k3874J5904
15138b3325O7024m802o327k1124k7563N504R888J3842m7268q139q313L641L1539
15125a5423j4266k9095l4775P590J2454o213O246J4612P313J3486j8319k1978
15113g8368P128M913K837n861N223L40Q72j918J7841M2636J4786l1996m4184K8751
15099c7000J4994k316J0632J0418l990l9428j93P282l707l174m667K0136P401
15086b3612J4649J5471L361L6723j448l2811m3856m2507n057P3730K0252K322
$$ y = [3326, 21465, -162, 24152, 87629, 56053, 5304, -33549, -62125, -81642, -36759, -30968, -63693, -64494, -20997, -24117, -39659, -39214, -46193, -78294, -92598, -55179, -16691, -20926, -41222, -38209, -54298, -36153, -13311, -2532, 39735, 44510, 16103, 14874, 5988, -15355, -39229, -23325, 43699, 38897, 32570, 11446, -16117, -10613, -725, 13117, -34151, -42290, -50603, -46962, -15423, -29689, -58784, -93559, -85969, -73515, -79728, -73482, -58870, -51557, -38071, -56390, -78368, -71240, -66327, -63490, -69351, -64128, -63788, -62916, -64834, -46993, -4357, 10429, -21567, -65751, -37000, -22006, -24322, -13690, -3272, -7262, -46690, -46883, -39601, -43308, -46482, -51149, -31013, -23612, -8963, 6508, 9869, 46592, 45144, 12333, -31523, -74030, -79087, -5357, 14895, 17217]
15074A7217J217k0267k5084p421O736J6169k2481J0213K094j5918K8029j1699
15062b1195K5597k8167K1609k3443K4181K1287J7295K7596l880m528L473o9565
15050i740k8937n966P452J1539L9725J7542k9928K8653L4809J6778k9606m8160
15038D161j7587J7713l905k5J2603l710l0552k9461j0131J6153J5091k0727L8222
15025a2155M0279m8889L103M290l1974J3950M6951J6343K9233j7363k9795l0836
15013a6863K1999J5114L736n18O750K5093j5515l4247j6718p959J703l79l3868
15000e1672l942k4812m375J6322j775J3556J793j4107O540j4597J9328J5652J0961
14987c1128j7549K3812J8923Q8k955k898k2431k0577J4591L525j2962J7453L1227
$$ y = [17217, 18434, -1833, -26917, -34338, -27602, -11433, -33914, -23701, -21607, -37525, -9496, -21195, 4402, -23765, -2156, -25599, -1418, 19869, 37164, 64760, 60880, 56352, 59825, -9740, -38677, -44643, -37191, -25652, 14073, 31615, 1687, 30340, 65149, 81927, 52321, 4161, -13426, 4287, 382, 357, 12960, 9250, -21302, -50763, -60894, -44741, -29650, -50377, -12155, 28124, -20765, -17662, -13372, -45346, -31396, 15555, 31898, 61131, 43768, 13973, -16863, 5136, 20250, 23986, 23468, 30218, 55311, 39796, 5549, -11169, -19128, -17425, -17804, -51672, -55614, -80426, -84801, -68479, -70254, -56698, -54905, -69012, -62472, -77069, -57741, -42089, -31128, -48677, -24865, -5942, -5854, -8809, -11707, -34138, -54715, -40124, -36599, -49561, -32108, -881]
14974h81K1753J1894m6951q245N9591K3966j8149J896M561m4021o974j5617N029
14961a2148k0152L167N3549l1370k9137K5434K9436k414q315J9072k4105l3804
14949c0787l3027J5931L9562j6361j7117n6099Q192J1218m891l27N013K1782K2283
14936c4628n04k210K7210L1046J3590k1460k5902k9716J1230J9347k3681k3369
14924e9047r159J3348K8873r230M771K773k5641P298N1987M739l4053J7339K5790
14911A9788j0305j0429O92p837Q638K653k8216l9004N40K160K814q645N0887J0633
14897e631o792J1234j7072k7592J3078K1266j3333Q197l1466k8734R969j824K2726
14884d5974j7131j6105N1711L6641L669j7476j7544J4733p051j1341O898j0648
$$ y = [-881, 20872, 32766, -14185, -22430, 37161, 61127, 42978, 44874, 49435, 5414, -1560, -17177, -12148, -32300, -29133, 24416, -6954, -36091, -10657, 18779, 16365, 8050, 27122, 3017, -30787, -63814, -47883, -8321, -24682, -41799, -97898, -89706, -78488, -83379, -83706, -78693, -56911, -34628, -35132, -37342, -10132, 20914, 34504, 13044, -12858, -42574, -31344, -11997, -35678, -59047, -68206, -54858, -25985, -35215, -30444, -27671, -53312, -46014, 5973, 10712, -23341, -6002, 19788, 9483, -946, -254, -8091, 547, 3200, -25016, -64020, -63480, -61320, -58506, -67151, -16264, -5631, -12423, -1189, -18261, -45853, -32775, -11509, -24842, -16645, -48111, -76845, -66876, -68700, -45974, -63105, -79210, -27499, 9142, 12811, -4665, -22209, -7476, -14527, -25868, -18970, -29618]
14872b9618K391L6666K7894m5350q195L932N870m0043k6228q18r034j6717J8072
14859h1178K0485j1290n094R519q434K2351L5917K1077Q428o354N461j4013n414
14846h539J3375j2020n908K229j6416K5084K4059k216n852k8321k1002K6333J5168
14833E974p561j3545J2382M2266J878m2886j9404l2942p598J3420J7240j7705
14821d8481k4251K8227M4903K2543l6338j0465k4106k2983J9838K6338J6401q115
14809a6489J957O491J0152j5023l1446j6335k3198k213J6766j5190J6677N2822
14797a5029l610j0304L9863J7474k5058j5611J1120m722j1258Q905m099K5737
14785A3408L5188J0669K195N346k5571n0711J734Q404r810o651L3831j4112Q19
$$ y = [-29618, -27227, 9439, 37333, -8017, -16212, -12280, -6410, -46453, -72681, -73499, -82533, -99250, -81178, -60693, -71983, -77077, -67558, -75992, -53641, -17724, 3353, 11781, 5427, 10888, -3125, -8539, 4836, -7184, -13092, -10863, -27279, -2195, 21864, 19648, 13796, -14525, -35527, -9194, 5974, -1587, -15132, -2750, 39516, 41394, -1492, -20896, -53838, -61436, -48016, -30776, -48481, -72732, -44505, 398, 22941, -13397, -23862, -47968, -70951, -51113, -24775, -8374, -16489, -14532, -8041, 2111, -12912, -44358, -60693, -83891, -86104, -69338, -84528, -67851, -15029, -18639, -28943, 10920, 28394, 3336, -12275, -1155, -5877, -17135, -8230, -12329, 13408, 48596, 59265, 61460, 66806, 41235, -9476, -7742, 662, -9148, -15799, 18032, 3920, 4739]
14772D739m0560j6727j966j7053j3547J3752L8324J1251j2809J7071J63j64j1917
14759b9443k7911L2887J6397J0104l1733j0529K359l6072p509K072J2367J4350
14747e2661Q03j2184L5471K029j1836M5308k188k8665J5781o826l1155k6318k0995
14734i3436M3539K0774K1933K3605J7857k8025l7638k3981K6329J184L488K5668
14722A297m9579l5059M816L5273K5978J2662l7174l4205o179L8840K8805k408
14710a6933J876P904K942J1736j2910K9312K607k7312j6519j8511L7127k585k8188
14697b9454L3892M060n0522J0772P214L9384M31j5468J8234k606O927j3740n782
14684C342N9084k1984n5077l468k711J1722K6581j803o3092K569O5227M430j6569
$$ y = [4739, -35821, -52548, -54514, -71567, -85114, -71362, -33038, -21787, -34596, -17525, -17362, -17526, -29443, -57354, -24467, -8070, 2034, -29699, -40228, -37869, -73941, -81450, -79378, -67011, -52661, -51858, -64042, -28571, -26542, -38378, 6930, 4742, -23923, -8142, -14968, -46123, -72441, -93436, -49897, -29123, -7190, 16415, 34272, 6247, -31391, -55372, -29043, -27859, -24371, 1297, -48282, -83341, -78525, -43252, -17274, -4612, -41786, -75991, -82170, -43330, -14525, -16933, -15057, -7153, -4211, 7525, -5385, 23927, 26534, -778, -17297, -35808, 1319, -1266, -29454, 4438, 8498, -42024, -31252, -24038, 15346, 15777, 309, 18543, 15937, 22864, 9124, 3342, 62426, 40442, -14635, -18103, -20814, -9092, 17489, 15686, -47406, -44837, 20390, 24820, 8251]
14671H251m872n61L8263l2377m8855k5069j8173p394L2281J5622O041j6169j6744
14658f9756o727p198j4242j2927K8611K3629K4548L8145N9534m6474m2410K1472
14646c795J8446m4224P16j1555J7396L803M4718j4487l8600m058j1855K7734k0827
14633c6588Q290J80l9965q578k0659k2684K4876O4302M3871M965l5327m5524K5394
14620c7447N1545J4157k8152J6632J9993k4757l1040j3179q940p816M7953j0545
14608a1596n541P079N0395K7106j4215l9357j5008l974J5821P527m160j9427j6624
14595b1974k886m7506k6741R590N3348K2348K3908k2547j1314J2005K0659K2796
14583C1686l3511j192R413j4275Q708m857R540l760k3267j1649k1186j7180k0953
$$ y = [8251, 3379, 2818, 41081, 8704, -40151, -65220, -83393, -90787, -58506, -42884, -36843, -53012, -69756, -76483, -83681, -97923, -110850, -82239, -58610, -34062, 4083, 63617, 17143, -25267, -3795, 14651, -29573, -28857, -40412, -23016, -19213, 25505, 11018, -27582, -31640, -43495, -15761, -36588, -28298, -28118, -68083, -76661, -97320, -120004, -95128, -30826, 13045, 18010, -17317, -62841, -37447, 14098, 28255, 103, 16735, 36728, 11971, -19069, -32248, -41188, -49004, -1051, -11596, -17137, -10058, 40337, 67443, 53228, 13871, -1137, -5111, 10710, 18237, 14077, -5350, -21974, -24860, -72366, -99107, -89517, -36169, -13821, 10087, -12460, -23774, -11769, 8890, 31686, -1825, -3017, 6396, -7879, 829, -4028, 5512, 1752, -21515, -33164, -54350, -71530, -92483]
14570i2483r69L3751L0956o370J4010l4918j7767j1125R544j8851J5845N3156
14558b5221L2854J7787K156l3995K8900P247j4350m0008j2259M5602N588o1132
14546d6831m4339j3465L0688J3102n209k0740J7131K5042Q034j3014J4129L511
14534c1961R033J4713m1349j8265l3222k054K9960O061j8361j6581J6713M6037
14522c9276L9775J901R368P891k179j5906n0633j5931L340K6842j567l1818j2950
14509h1143O043K3889L27K5722j322Q593K424j8498J0682M9542K3462l9436l7120
14496b6835J3369J6471j5866n459q207m949r211l1768M995K1828r385R594L3677
14483a1746J9829j717p35K673q0041k3873m55j8612L6454L2075K4438K6437j9016
$$ y = [-92483, -93452, -59701, -28745, -35115, -21105, -56023, -73790, -84915, -75371, -94222, -78377, -25221, 7633, 25420, 27576, -6419, 22481, 29728, 15378, -24630, -36889, 8713, 14301, -46831, -91170, -104635, -73947, -60845, -66054, -86794, -69663, -44621, -36587, -49601, -35472, -31961, -22928, -8215, -49564, -67829, -101051, -103105, -73145, -67084, -85445, -102026, -85313, -39276, 499, 2400, 11768, 19659, 17480, 1574, -49059, -64990, -61650, -34808, -36375, -68193, -81143, -75100, -51211, -50884, -25162, -26484, -17891, -15467, -33965, -23283, 26259, 49721, 10285, -26835, -13466, 3005, -12861, -18320, -26527, -31476, -40687, -72455, -67460, -45632, -55017, -45423, -11746, 8083, 6366, 5631, 8304, -71737, -95610, -96065, -114677, -78223, -46148, -21710, 4727, -14289]
14470a4289K0256N5224j2396l9800J5225j3703p7300l0502j2270j944K6431K7121
14458e7947L4710K228J7350l8324n5859l001M553O905K8730k2551K4921L3264
14446b5021k474J8968p08p723j9175L8513N730p0789p789L9427K3017m1110k569
14433e1703j5254k1817L1044M0090J0660k7508p745L496j5571p415K2713j2359
14421e1369n9806m848J5078N0750j1257j8389J0318J2343K086j5759J8190J0235
14409d2428M405J2490l076r392P310K3791m321l030k5875j6756K2749R654K9156
14396D677n130l9958l96k5755j3096k0141m459L9211L4351j570j5436j8648j011
14383f7361j013Q313k5862J2797K8289k9479P61K0743m141j7486j6059q36M027
$$ y = [-14289, 5967, 61191, 48795, 8995, 24220, 10517, -66783, -97285, -109555, -111499, -85068, -57947, -23237, -21009, -3659, -41983, -97842, -100843, -96290, -89385, -60655, -83206, -58285, -25021, -27495, -8527, -9235, -16958, -36133, 2380, 8110, -62679, -70468, -31041, -8024, -49134, -51703, -66957, -88774, -57730, -17640, -6980, -34488, -42233, -38737, -54308, -61723, -39010, -51369, -111175, -116023, -100945, -50195, -61452, -79841, -69523, -57180, -55094, -70853, -52663, -42428, -38023, -25533, -28609, -38001, -30691, -6900, -11221, -14251, -40126, -56882, -34133, -24479, 4677, -453, -40411, -40807, -66562, -79658, -99799, -104258, -65047, -30696, -32266, -47702, -66350, -67361, -68374, -60061, -85923, -73126, -44837, -74316, -73555, -52812, -56953, -74439, -90498, -91334, -87307]
14370h7307J8076J4158L2590P044q856J336M3908N808j5719k1308n6723k0757
14358h7750K6576J0910j345j640k6167K1518J880K0046O290R531k2595k6848m1049
14345a10643L073K613M1378Q182J3803J8104J8090J6821m975l0043K8243J3254
14333A7900k3907r282j7653j1701K2356O635J9278k736L748o372J0555J528p983
14320B366r057p482j7949j6465j5734J5579L3392N465Q791R82o144j9307o354
14307c1917j0209l7895J3664L0595M2716L084j5476k0640j088J43j1839K0857
14295a8005L778k7468q050j0281j6193j567L4416Q414J2886N324k6252J1916Q84
14282c0198J0386j569J420L2117J7138j0515k3893m3841L8557M928l0470k4634
$$ y = [-87307, -69231, -55073, -22483, -15439, -24295, -22959, 20949, 26757, 11038, -10270, -66993, -87750, -61174, -50264, -51609, -53249, -79416, -57898, -56018, -35972, -29682, -20151, -42746, -69594, -110643, -107570, -104957, -63579, -55397, -41594, -23490, -5400, 11421, 6446, -23597, 4646, 17900, -6007, -15289, -32942, -44643, -22287, -15652, 3626, 890, 4638, -1734, 8821, 10349, 2366, -6691, -14173, -32122, -48587, -64321, -48742, -15350, -9885, -1094, -112, -6256, -25563, -31917, -42126, -80021, -66357, -35762, 6954, 10038, -5438, -26078, -27166, -27023, -38862, -18005, -14227, -41695, -49745, -60026, -76219, -77786, -43370, -34956, -22070, -16746, -42998, -31082, -30198, -19812, -21381, -19961, 12156, 29294, 18779, -5114, -48955, -10398, -5470, -35940, -60574]
14270f0574N159k6661L139L8921J4172L082j167k6886J0970k8961j8030r824L3542
14257f3118L2787j5665j7348L1299q341N663J5633j527m2251P508K5837L9928
14245A0405j8291K057K6606n06j9633m540J1116K2064j3008r044k3722n29J0853
14232f172J64k412J923L786n1282j7152j5535k0981r800K1405K3458K1529k1591
14219g2660j7725K8500P092J3229L2176M881j7526R527k3000j3274j1713L092
14207e7401L3124q267l9044j021K2628K613j1834O49p217K3650M9421N4656K4161
14194H6118k0345n4450n1404m747M6644p289l7457K2229j6257M546M893Q051J4652
14181d816p598l357L2054K0908l2726O806p102j421k9779N539j8614j9977o545
$$ y = [-60574, -55415, -82076, -78937, -40016, -25844, -22762, -23929, -50815, -39845, -68806, -86836, -96660, -63118, -30331, -45996, -63344, -32045, -40386, -34723, -19090, -20617, -62868, -55360, -29523, 10405, -7886, -5829, 20777, 20271, 638, -3902, 7214, 29278, 16270, 7226, -16496, -17025, -6172, -6008, -8420, -6497, -2711, -53993, -71145, -86680, -107661, -117461, -96056, -72598, -51069, -72660, -90385, -61885, -54793, -41564, -9388, -4507, -22033, -12506, -35506, -48780, -60493, -57401, -24277, -32544, -71588, -72609, -49981, -47368, -59202, -58553, -65770, -42120, 7301, 61957, 86118, 65773, 11323, -40081, -44828, 1816, -5473, -42930, -20701, -36958, -32412, -27519, -19468, -4816, -12414, -15771, 16283, 37191, 4465, 11271, 4169, 2748, -27031, -21492, -40106, -60083, -66628]
14168f6628J120K6409L4701m084j2381k4723n2218j3726J0770M9179p648r722
14156f8951j2832J3004J6411L8060J0659J8196k2884m7975j1159j7494j3001L5910
14144f2056M9107j2576K2706J3015l4286M6706K0124m9467J2239k2789j1650r864
14132c8791l651k747P491O881R711k6330k8876k5365l210N019J1145J2370K4814
14119e1539K6348j5048L683K0273l313j2927p535j6759j0289M5431K4957k4844
14107b1562J3329L0589J2457k4108j0458L7105L777l2123J044k6026M699J7414
14095F137j3610o580n3412l7779K942K5908j015n408K5611K1766M256k2872j352
14082e5408J3589M7872m823K0675j0478k5160K4016k8059k0954K1210J67P796
$$ y = [-66628, -65508, -39099, -4398, -8482, -20863, -45586, -97804, -111530, -100760, -51581, -59229, -68951, -81783, -68779, -52368, -14308, -3649, 14547, -8337, -56312, -67471, -84965, -97966, -62056, -12949, -25525, -2819, 10196, -24090, 22616, 42740, -6727, 5512, -17277, -28927, -38791, -42442, -45189, -37698, -30817, -21106, -47436, -76312, -101677, -104887, -99868, -88723, -76353, -51539, -25191, -40239, -36556, -16283, -19596, -32523, -40058, -56817, -67106, -21675, 3282, -21562, -8233, 22356, 34813, 10705, 247, 37352, 41129, 9006, 10050, -15976, -11277, 6137, -7473, -14053, -67465, -105244, -102302, -76394, -77409, -82817, -57206, -35440, -31184, -54056, -55408, -41819, 6053, 1230, 21905, 11427, -13733, 10283, -17776, -38730, -17520, -17353, -9557]
14070i557j433k4825l9966k204k7868J0644L1802J5515P432j9014N06J4021k1382
14057f6329k2505J4457l2391J4476K2718l3697j880Q364J4145Q892l776J1390
14045f6136l083j2731l7K0218K8059Q894r146l0064k982n76L7488k0812k3114
14032g4022N587k541k1312L0087J2210K0811K4541l508k1059J8995l9845J4570
14020c5486l0061k6912k976n763Q824l905J1851O400P012K3372J3068k0852K04
14007e5224j2239P92L0237q557k4573k9741J0379K4479K8482J594k338K6275k371
13994a2805j7713o949n798j2823r958k1539R594M1900J2879R573j3704j5277j6951
13981e9571P980l042n0897o357K2487K8852K2264j6099J0714J0038j544J5676
$$ y = [-9557, -10990, -35815, -75781, -77985, -105853, -95209, -63407, -47892, -40460, -59474, -58968, -44947, -66329, -88834, -74377, -106768, -92292, -69574, -103271, -105151, -96787, -82642, -73750, -77526, -66136, -69219, -81950, -81987, -61769, -33710, -24816, -33962, -64026, -67008, -67584, -30096, -50908, -74022, -68435, -70976, -92288, -62201, -49991, -29180, -4639, -8147, -29206, -10211, -50056, -35486, -65547, -92459, -95435, -101198, -92374, -96279, -84428, -78028, -71016, -47644, -34576, -55428, -55224, -67463, -66671, -36434, -44991, -69564, -99305, -88926, -64447, -35965, -34371, -36709, -10434, -12805, -30518, -37467, -43265, -56088, -66046, -87585, -77991, -36091, -23212, -13639, -27343, -42620, -59571, -51591, -54633, -105530, -111887, -89400, -60548, -38284, -54383, -43669, -33631, -35175, -19499]
13969a9499J0371m594j3654J0931m6214R889J3726k2855o326J3958r142k804r952
13956g6165n420N991p448K6210K6384J4832k0504k6556K3592N313j973P462L2619
13943D337K3307m5207o300r283J4971L88l9889q698K9557p434m28l060J6000K0478
13929a1261N616j6984K0292k3723J0574K7367p162q759j8740j275p470j7435n4484
13916a03444l499K8107k1466o16J3564r788M127J1666q933k8876j7589O620L0009
13903a00118J6399P826M45l6344k1186K9402J6472J7172P417O057j800K460J4542
13890d1256j816J762J3215m740M0101K1M196M9496J942l4791k6332k549j4988
13877a5739N745m3797J0842K6721m414k5001M193K727k5704k7113l384j7037K3531
$$ y = [-19499, -9128, -13722, -27376, -16445, -62659, -52770, -39044, -61899, -68225, -54267, -63409, -66213, -76165, -81585, -75594, -83042, -56832, -30448, -15616, -36120, -62676, -39084, -33771, -35744, -28282, 4337, 27644, -17563, -23863, -33146, -18175, -17787, -57676, -66374, -36817, -44251, -44679, -47739, -31739, -11261, -5645, -22629, -2337, -26060, -15486, 11881, 4719, -4040, -22780, -24055, -31525, -48960, -103444, -106943, -78836, -100302, -100918, -87354, -97142, -93015, -81349, -90282, -119158, -136747, -130127, -100118, -83719, -75893, -75448, -111792, -132978, -103576, -87104, -69932, -62515, -56458, -58258, -55798, -41256, -43072, -41310, -28095, -32835, 7266, 7287, 11483, 60979, 62921, 28130, 1798, -751, -15739, -9994, -53791, -42949, -16228, -20642, -45643, -41450, -38723, -64427, -91540, -94924, -111961, -88430]
13864h8430K2606K9363o366m4795j401J2723N2407M6491l2221j3364m8425j5998
13852h7410o227L3888O3225p779m4094p825j9947K099K8710j2692l8138J0604
13840h5586K5907J0081l3106J989M6692K7483l4289k3370k9708J4048j1337P207
13828h3989L2091M0108m3516m9259J0768M2378j3848l6449K65P760k6769l6961
13816a57421j3438n07P1721L7423N612j638p070p939j4959K04J2342m07m1541
13803a17618l0363K2168O7707Q217O550k5249R403j6364N846M868j5953K6610
13791e4178j0584k2732K2084O743r267k2087j3578K7083L9293Q189J9968J771
13779g295k0451K351n3900N997J7606M304j0614K504M1532L6265k8767n2688o061
$$ y = [-88430, -65824, -36461, -42827, -87622, -89023, -76300, -23893, 22598, -9623, -22987, -71412, -87410, -93637, -59749, 3476, -4303, -48397, -56222, -76169, -74070, -45360, -58052, -96190, -85586, -59679, -49598, -82704, -80715, -34023, -6540, -40829, -64199, -93907, -79859, -91196, -83989, -51898, -11790, -55306, -104565, -93797, -51419, -65267, -101716, -101451, -93691, -120460, -157421, -170859, -171366, -99645, -62222, -56610, -58248, -65318, -73257, -88216, -88012, -75670, -76077, -117618, -147981, -125813, -58106, -49889, -43339, -68588, -59185, -75549, -69703, -64835, -80788, -54178, -64762, -87494, -65410, -58667, -67934, -90021, -103599, -76516, -37223, -29034, -9066, -7295, -27746, -25395, -79295, -73298, -55692, -51388, -62002, -59498, -17966, 18299, -10468, -63156, -69217]
13766f9217K2031o690J9783O2064J9386n0634j2550K7098L723l6087j1586m057
13754c6736k0938j045L4071j3102m064J6386M92Q744r70l4260N0886K9918J860
13741C1242n1486j9605k0373j3532j662l7849p581J2602N2399J9246m1333R31
13729g7001K2933M774K2215o141k3895q174N020K1071K141j8286P556k4715K1742
13716e0760K8285k3127j1210k0180l5803k6421k0298L2686N7597n851k1131m987
13704a01200j71L2447n742q971p070P750j0460J8153p457N159N145k6365J517
13691i7265M8105L5324j8459j1611n5634k9809M5238k4835k0393K5348J2327J938
13679h9726r037j7456o58j4077K7569L5067J6069J638M24K4088Q053m7555n059
$$ y = [-69217, -47186, -53876, -34093, 27971, 47357, -3277, -15827, 11271, 14994, -21093, -32679, -36736, -57674, -58719, -24648, -37750, -41814, -25428, -24936, -16192, -17162, -51422, -536, 29382, 31242, -20244, -39849, -60222, -73754, -75416, -113265, -120846, -108244, -55845, -36599, -77932, -77001, -54068, -49294, -27079, -33220, -57115, -65289, -60269, -39198, -37057, -55343, -47787, -72502, -50760, -22475, -45602, -56812, -76992, -112795, -139216, -159514, -126828, -69231, -75082, -96213, -101200, -101371, -68924, -74666, -83637, -90707, -82957, -93417, -75264, -82721, -77562, -72417, -98782, -97265, -49160, -13836, -32295, -43906, -99540, -129349, -84111, -108946, -129339, -103991, -91664, -89726, -98763, -116219, -116877, -130954, -103385, -68318, -52249, -50611, -50187, -26099, -18046, -65601, -70660]
13666g0660J8619L0280k5299m5R946K5215K3817l7952m0765l3154l0489J1359
13654a19128R715K2613L7936k4179k0305k2115K2890K5900L0652j6691K934k63
13642e0041k715J3801O05l469n82k5158l4960k4632O536K7845L831o105O40k5202
13628a19606o531M142K652M6836L4472l4484l9769K3045j8997k4410K6669K70
13616a05711q319j873j2455J0903K7883m2300k2297j2311R74O0420N727J6497
13604h2862L7531K0376l0632r810j5826j3189R928L5725o014l8801l8049K8984
13592a02639J4728p805k2098n781L8599K0123N800l8296j3681J0309N3205r223
13580e6759k4278k8237P559K2784k6930m0750K303k9242l3539K8384K1861J5714
$$ y = [-70660, -52041, -21761, -47060, -47105, -37159, -11944, 11873, -26079, -66844, -99998, -130487, -119128, -109413, -86800, -48864, -73043, -93348, -115463, -92573, -66673, -36021, -52712, -49778, -50041, -52756, -38955, -38350, -41819, -42401, -67559, -102519, -127151, -120615, -92770, -88939, -95044, -94404, -119606, -126137, -121995, -119343, -72507, -38035, -72519, -112288, -89243, -108240, -132650, -105981, -105711, -114030, -115903, -128358, -117455, -89572, -131872, -154169, -166480, -165506, -105086, -99359, -82862, -45331, -24955, -55587, -65397, -81223, -94412, -84484, -48759, -54773, -93574, -131623, -102639, -87911, -95716, -117814, -123595, -84996, -64873, -59073, -97369, -111050, -100741, -47536, -56759, -81037, -109274, -101715, -78931, -105861, -146611, -144308, -173550, -207089, -178705, -156844, -141130]
13568a41130J6769L5325N3426k2497j901o178k1057l887L4060K3756J2034J1719
13556i561K8155K3852j0599K1968K2081O1709J7725j1896m16K8340j2895n2802
13544A05661n7697k8261j7324m856K9803j4560o2173K0785N7340N804k6081l0647
13532b2206K0239k5122l017j8358l7754j0552l3730n940M2400J5500n395K0796
13520f3139j5520j7376L3515k518j1837j2313J0703p021J2875J8549K3336M5312
13508A4566K3566r507J7251N8655M096K9189J9493K4043j8512o8471j10489l0980
13496d7100K2952J5094J8239L9374j4621p996M5547L0419M0044K6828J4064j8746
13484A64098n6033o4371j2943r554n5764q6963m306K5111L2922n095J0549K2699
$$ y = [-141130, -124361, -89036, -35610, -58107, -60008, -66186, -87243, -91130, -57070, -33314, -21280, -9561, 18594, 42446, 31847, 53815, 75896, 137605, 155330, 143434, 143018, 171358, 158463, 105661, 47964, 19703, 2379, -2477, 27326, 12766, -49407, -28622, 28718, 34522, 8441, -22206, -1967, -27089, -30106, -48464, -86218, -96770, -130500, -136440, -94040, -78540, -83935, -63139, -78659, -96035, -62520, -65038, -76875, -89188, -78485, -85506, -72631, -54082, -30746, 14566, 38132, 28625, 45876, 104531, 108627, 137816, 157309, 181352, 162840, 94369, -16120, -47100, -24148, -9054, 9185, 48559, 33938, 25942, 71489, 101908, 141952, 168780, 182844, 164098, 108065, 43694, 30751, 21197, -34567, -121530, -125836, -100725, -67803, -72898, -62349, -39650]
13472c9650l713j6298n47r977k1788J4070K7599N028K3772j8545K1852N5020o258
13459C0565k9943j0098k543P942J321k6586o588n359J9908L203J0183K9773M2507
13446F4285L3198M7283K1791J1942N9303L8591j030J9113M2945j9246j10336o5566
13434A42273m1437l5474n1703J079j4109K4058K8416L6795J5867j1101m191j550
13422H8923p03j807K326J5263N8360P2588K490r7696r2464o1830n520K5910j6819
13409a0979l984L2101J1619M112M3784K7216O8606O0999N6281M0833L1718O4609
13397D26915P6527O7973K490L0044M9505p4602j29759q3418q544J81l6993j7632
13385C02687k9300L7326R3063J00590M7464K7372L0937j0394r6546r9123o2064
$$ y = [-39650, -43363, -59661, -60208, -70185, -91973, -77903, -50304, -45276, -21504, -40049, -18197, 36823, 30565, 622, -9476, -12019, -4077, -2756, -29342, -35930, -41289, -21381, -18178, -7995, 21778, 64285, 97483, 144766, 166557, 178499, 237802, 276393, 275363, 294476, 337421, 318175, 207839, 142273, 100836, 65362, 13659, 14738, 629, 24687, 53103, 89898, 105765, 94664, 90473, 88923, 88220, 86413, 88739, 104002, 162362, 234950, 237440, 139744, 47280, -14550, -20070, 5840, -10979, -14963, 17138, 28757, 32869, 76653, 103869, 172475, 233474, 289755, 330588, 362306, 426915, 503442, 571415, 573905, 603949, 653454, 578852, 449093, 365675, 357131, 357312, 320319, 302687, 273387, 310713, 403776, 504366, 551830, 579202, 610139, 599745, 503199, 404076, 342012]
13374C42012N2507M2128M4089N302q9001q7943l3740j7839j5343k9213K6008L7392
13362B76359P564L4733O7319Q7678N7912k235q5558q1506o6545k5687j8818N494
13350B56710M3037L0761j4871r0662o9979n4001k0772m934n5501o479K250M2248
13338E7807N3797M9379J18572J36879Q3166l524r7822o5976q714K3808O201m5050
13326C08523q051j8419j0526J0223k0487r738J7638p774L405M9738N6177R7672
13314D68381J41655K9642p4747j08051p0062n5168m7816p5009J3713j4598l6897
13303A71043J0195J1277J6543o583K5571J0277j1859P458J5260m725K5062P4761
13291C44280Q8614M3373n552l5061m3309m1807J9405j8990p3301m2975j3379l1024
$$ y = [342012, 394519, 436647, 480736, 486038, 397037, 309094, 275354, 257515, 242172, 212959, 238967, 276359, 283923, 318656, 385975, 473653, 531565, 529330, 443772, 362266, 295721, 270034, 251216, 256710, 299747, 330508, 315637, 224975, 154996, 100995, 80223, 75289, 19788, 13309, 15559, 57807, 111604, 160983, 279555, 416434, 499600, 496076, 398254, 332278, 323564, 347372, 353573, 308523, 300472, 282053, 271527, 281750, 261263, 251525, 269163, 261389, 264794, 314532, 370709, 468381, 610036, 639678, 564931, 456880, 386818, 331650, 283834, 208825, 222538, 207940, 171043, 181238, 192515, 209058, 202475, 228046, 238323, 226464, 233922, 249182, 244457, 269519, 344280, 432894, 476267, 470715, 435654, 392345, 350538, 369943, 350953, 277652, 234677, 221298, 190274]
13279A90274j5260k5777l9005m2173m023j4917j8698l8742j5358O471Q527P596
13267a085j4297k0925L00N624m4705j9791K4455j8944l907L2448l143k5000L0773
13254e8197R943j0312k2704l7436J6380J8373m673L7669K2653j9204m6945l3118
13242a27571j0406J6405K9298j8290p8119J0358M3432K4406j3389K1852L2392
13231f9632j8553K7942o711j1836J2052j984j4185K266q079j3580L4122N031k449
13218f5596k92K631K3605J9853k5768J379j8549l4613J0468J3722j8284K3108
13206f8336R282K9483L6288l348k5783l4965n380m920K0853L9972k9658m2892
13194g9404j6851N100j6653j6884J8141K6739J0586Q035n919m4874L0426N9364
$$ y = [190274, 175014, 149237, 110232, 68059, 64036, 49119, 30421, -8321, -23679, -17208, -8681, -1085, -15382, -36307, -36007, -30383, -75088, -94879, -70424, -89368, -93275, -60827, -63970, -88970, -58197, -48254, -58566, -81270, -118706, -102326, -83953, -88626, -50957, -28304, -47508, -94453, -127571, -137977, -121572, -92274, -110564, -188683, -178325, -134893, -110487, -123876, -102024, -69632, -88185, -60243, -66954, -78790, -66738, -68722, -82907, -80641, -88720, -102300, -68178, -63147, -65596, -65888, -63257, -39652, -19799, -45567, -44188, -62737, -97350, -86882, -73160, -91444, -68336, -59054, -29571, 6717, 3369, -22414, -57379, -62759, -67679, -46826, -6854, -36512, -79404, -96255, -91155, -107808, -124692, -106551, -79812, -69226, -61191, -67110, -111984, -81558, -22194]
13182b2194L8675k5184j2469j3776m8282l6k398j8159o199M5048L7038M5457j821
13169A5700L769j1436l1724j8325j4880k0045k780j2683J1778J5437J5785J443
13157d7961j6390r13l8443n848J1733l674J1162j5649m6583M546K0469L5584J0368
13144h1599k4934n167k5323N569J7558N481j7954J561m3833k817J4473j7779m1286
13131b16050J3905K2153J2064k4810n534P6592P8137r233l2649m5307o2378m9739
13119b42849L6561Q3888L0686k3553K069L4844O238m0746n0581k6470O079j2232
13107a96066J3169L2289K0458J304l425M663k0091k1859j1491k324m1057k8932
13095b53362K4041L8932J7015J0275O471p863j652J3413M6656N1571M5244j9142
$$ y = [-22194, 16481, -8703, -21172, -34948, -83230, -83266, -85664, -103823, -110022, -64974, -27936, 17521, 15700, 19469, 8033, -23691, -42016, -56896, -76941, -79721, -92404, -80626, -65189, -49404, -47961, -64351, -65264, -103707, -109555, -97822, -101496, -90334, -105983, -152566, -148020, -127551, -91967, -81599, -106533, -111700, -137023, -131454, -113896, -108415, -126369, -124808, -168641, -171458, -156985, -174764, -216050, -202145, -179992, -167928, -192738, -198272, -121680, -43543, -52776, -85425, -130732, -193110, -242849, -206288, -122400, -91714, -115267, -113198, -78354, -72116, -112862, -163443, -189913, -183834, -196066, -182897, -150608, -130150, -128846, -132271, -127608, -147699, -169558, -181049, -183373, -224430, -253362, -229321, -190389, -173374, -163099, -156628, -164491, -166143, -152730, -106074, -54503, -9259, -28401]
13083b8401j5706N846m2617o061k2718L859J8085L7311O725l608j7951j1161J5893
13070f0504j0883k7363j5195J4618M4592k6496l9959n3660K4324L8886o698K2019
13058i6319k6654P51o39q50j068L915j6018p831k1555o2370k1264K1054J8794
13045b10054k883P693L3887K7455k1886l1675n692N5043l54J2516j9514m9798
13033b05262j0743k5574J8433Q804q658k5606j8065K4516P025k6944l4090m4824
13021c40988K0385L8245M2M0767K2506k8097k3141j7203K3915K2197K4263L627
13009b13482m867l694k2861l0416j982L3870Q030m0841n1476Q142K5841N2073
12997b41663J2186M9364J4173q341m476j5634L781K3590k2375q45j4233O360j5412
$$ y = [-28401, -44107, -38261, -80878, -86939, -109657, -105798, -87713, -50402, -43677, -47285, -65236, -76397, -60504, -71387, -98750, -113945, -99327, -54735, -81231, -121190, -174850, -150526, -111640, -118338, -96319, -122973, -122222, -122861, -123711, -124779, -120864, -136882, -144713, -166268, -228638, -249902, -228848, -210054, -212937, -205244, -171357, -143902, -165788, -197463, -203155, -148112, -148466, -135950, -155464, -205262, -216005, -241579, -223146, -214342, -223000, -248606, -266671, -242155, -235130, -262074, -296164, -340988, -320603, -282358, -282316, -241549, -219043, -247140, -270281, -287484, -263569, -241372, -217109, -213482, -218349, -222043, -244904, -275320, -277302, -243432, -235402, -276243, -327719, -319577, -293736, -241663, -229477, -180113, -165940, -174281, -178757, -194391, -190610, -167020, -189395, -190240, -204473, -198113, -213525]
12984b13525J7711q348J4633k899J844N537k934j9904j3108M6945K2678J7906
12972a33464m76O227N0913M6910M2421J13820J05339P1998O1409O3748N2858J03527
12960E85230R6270P3044M7710J26089J72394J86155K20567K48251K53435M04525
12950B413670N97340Q57140J202673J692725K410801L471093M913226O087809
12942B3646477N968672M657856L284213K235691J614135J771935J653718R87469
12934D5820166P47188Q81351Q53351J58027q69067j429719q19785R73605K387190
12925D8702307J839918j98333k238211l681597l681506k990645k911234k588546
12917C2252153j671854j14418K200229M219446M688819L591566J780152N80814
$$ y = [-213525, -195814, -204162, -189529, -192428, -190584, -185047, -187981, -207885, -220993, -174048, -151370, -133464, -133940, -127713, -76800, -29890, 12531, 126351, 231690, 303688, 365097, 428845, 481703, 585230, 681500, 754544, 802254, 928343, 1100737, 1286892, 1507459, 1755710, 2009145, 2413670, 3011010, 3868150, 5070823, 6763548, 9174349, 12645442, 17558668, 23646477, 29615149, 34273005, 37557218, 39792909, 41407044, 43178979, 44832697, 45820166, 46567354, 47448705, 48302056, 48460083, 47591016, 46161297, 45341512, 46315117, 48702307, 50542225, 50343892, 48105681, 44424084, 40742578, 37751933, 34840699, 32252153, 30580299, 30465881, 32666110, 36885556, 41574375, 45165941, 46946093, 47526907]
12909D7526907Q5981K04337M12114N90606N90733P06586J035247P88673k18808
12900E1722376j117373j251435k57023J003145N84839j636444l727976m646846
12892D0673263m573727m113918m050287m331420m444702l993414k978637j928610
12884A0258548j186126p22754l95909k29772j17320n177P1096K11007N43327J066960
12874I493880J790043K813370L925147M550522M603975M959789N823420O396279
12866D4356425N812700L973564J764055J4555k54646M70275J059187J350818J081579
12857E9628512l4567j038718j078402r33289n31018L58855J005606O66485q23760
12848E7219704k780902m378988m855051l958636k488904o08069J151780K282663
$$ y = [47526907, 47612888, 47817225, 48229339, 48819945, 49410678, 50117264, 51152511, 51941184, 51722376, 50605003, 49353568, 49096545, 50099690, 50684529, 49048085, 45320109, 40673263, 36099536, 31985618, 27935331, 23603911, 19159209, 15165795, 12187158, 10258548, 9072422, 8349668, 7953759, 7723987, 7606667, 7601490, 7672586, 7883593, 8426920, 9493880, 11283923, 14097293, 18022440, 22572962, 27176937, 32136726, 37960146, 44356425, 50169125, 54142689, 55906744, 55921299, 55666653, 56136928, 57196115, 58546933, 59628512, 59593945, 58555227, 57476825, 56543536, 56012518, 56371373, 57376979, 58043464, 57219704, 54438802, 50059814, 45204763, 41246127, 38757223, 38149154, 39300934, 41583597]
12840D1583597L332535M035226M505475M458279K609549J22726j326229j363349
12832E7957809N0159J333191J351099P29659K8393n30510q37321j132753j299670
12823E7650056j185352j039186j183211k497598m450771n849189o508459o389763
12815B8546527n694210m687190l637244k654057j862607j369450r84714p04118
12807F952937n60944m78105m57894l81861l33421l35479k60105j96202j67321
12798C781605j74293j69429j13604j62377j44759j39510j36660j36475j20457
12789B484041q6439j32789j28993q6947m9807j20055q2370n888k9553q0283r9769
12778A581148n6516m6734j5165l6242j7259n8543m9323p4031P035N4029k8344
$$ y = [41583597, 44916132, 48951358, 53456833, 57915112, 60524661, 60647387, 59321158, 57957809, 58007968, 59341159, 60692258, 61421917, 61450310, 60919800, 60082479, 58949726, 57650056, 56464704, 55425518, 54242307, 51744709, 47293938, 41444749, 34936290, 28546527, 22852317, 18165127, 14527883, 11873826, 10011219, 8641769, 7657055, 6952937, 6391993, 5913888, 5455994, 5074133, 4740712, 4405233, 4145128, 3948926, 3781605, 3607312, 3437883, 3324279, 3161902, 3017143, 2877633, 2740973, 2604498, 2484041, 2397602, 2264813, 2135820, 2048873, 1999066, 1879011, 1796641, 1790753, 1761200, 1680917, 1581148, 1524632, 1477898, 1462733, 1426491, 1409232, 1350689, 1301366, 1227335, 1234370, 1288399, 1260055]
12767A260055m3833l4380j2773K0833m0491j7422m8808K390k0621K6751j3273
12756A078428m3102J0704j9719o1103q099K1765L1812j8818q1181o4862k8996
12745H16829K712k1304J4186K8427K0642J9647K2477n96j7198k2067m4054k0387
12733G99314R59k2668j4377P643K3068K1405k9538m6034r440o731J138J2465K756
12720G39960m7260n7222J3782k0055j3016N159m282k0915J327K6495K3216J8346
12708F65535l1118o4549J6072L2481k152J8839l9153m0425j285J4121J0570j9288
12696E59648l0372l3517k692j497J5302J7423k7171l3239L2617J542R836J6640
12684E24520M4475O653J1843K479q063j077m8024j4856j3289m299k5439k0942
$$ y = [1260055, 1216222, 1181842, 1169069, 1189902, 1149411, 1131989, 1083181, 1085571, 1064950, 1091701, 1078428, 1035326, 1046030, 1026311, 965208, 957109, 978874, 1010686, 991868, 910687, 845825, 816829, 819541, 798237, 812423, 840850, 861492, 881139, 903616, 903020, 885822, 863755, 819701, 799314, 800273, 777605, 763228, 770871, 793939, 815344, 785806, 739772, 730332, 723601, 724739, 737204, 739960, 692700, 635478, 649260, 629205, 616189, 621348, 617066, 596151, 597478, 623973, 647189, 665535, 634417, 569868, 585940, 618421, 616269, 635108, 595955, 555530, 554245, 568366, 578936, 559648, 529276, 495759, 493067, 491570, 506872, 524295, 497124, 463885, 496502, 498044, 507880, 524520, 568995, 575648, 587491, 589970, 581907, 580830, 532806, 517950, 504661, 500362, 474923, 453981]
12672D53981p226j2891n1579p839K2832j5471j5696P451K7901J4299j6725Q809
12660D07846Q798K2148j8916n461O508j0839j8969Q670K3045Q842O3386M7433
12648E42491N3726M618k989L5883J5387k7558n755j9078m2553o9162j3543k9724
12636D41743o8818m4796M524J1638M7616k2487l5811j3609j2795K9832K1684j8737
12624C39984O0080j0385j2269q770l2479j7379J3582L6303O76j6914J9828L4493
12612D06750N6697P9517l870j7004l1505k7348l3575j0685p101J0683p744k2938
12600C91877k8574L1993J5981r620k6522l4210k7402j5339K0365R063j7422l1104
12588B79086R167J3903N543P85n8713M261N6736M290l1443j8099K7033M74j7939
$$ y = [453981, 446755, 433864, 382285, 374446, 397278, 381807, 366111, 373562, 401463, 415762, 399037, 407846, 416644, 438792, 419876, 414415, 420923, 410084, 391115, 399785, 422830, 431672, 495058, 542491, 596217, 600835, 597846, 633729, 649116, 621558, 615803, 596725, 554172, 485010, 471467, 441743, 372925, 328129, 332653, 344291, 391907, 369420, 333609, 320000, 307205, 337037, 358721, 339984, 400064, 389679, 377410, 368640, 336161, 318782, 332364, 368667, 369343, 352429, 372257, 406750, 463447, 542964, 539094, 522090, 490585, 463237, 429662, 418977, 411876, 422559, 414815, 391877, 363303, 395296, 411277, 401657, 375135, 340925, 313523, 298184, 318549, 327612, 310190, 279086, 288253, 302156, 307699, 308484, 249771, 254032, 310768, 315058, 283615, 265516, 292549, 293023, 275084]
12575B75084J8723J4904j6512j7121j0140q862J8008K2007k495M7306O3676M4299
12563D48877P0952N1361L1887k5620p9451l7859k4866r4733m5323k8777o897m552
12551B54999L120n940M090R316J7882M07R669p499j325j3913L577J0801K6945
12538C12129J8018K6468L998p029o93Q7032M7523K0045M9989Q1656O0457J12544
12526H12137J18284R3104P2161R595m8742o7458j24926r8378q3839m9387l8461
12515E94090K0361P403J7678L4383P4616Q5478P6581M0577l8310q4114q2949p5950
12503F69844p3508j604k1098l1526l258n835l4585k8695k335j9557J4246K5768
12491D87857J4133o53J8063J5317Q62j391k9049n0861n474q379m5725K0716P1681
$$ y = [275084, 293807, 308711, 292199, 275078, 264938, 256076, 274084, 296091, 293596, 340902, 404578, 448877, 519829, 571190, 603077, 577457, 498006, 460147, 435281, 340548, 295225, 266448, 259551, 254999, 258119, 252179, 256269, 265585, 283467, 283874, 293543, 286044, 284719, 270806, 274383, 285184, 312129, 330147, 356615, 360613, 353584, 352891, 439923, 487446, 507491, 557480, 639136, 699593, 812137, 930421, 1023525, 1095686, 1105281, 1056539, 989081, 864155, 765777, 681938, 632551, 594090, 614451, 621854, 639532, 673915, 748531, 834009, 910590, 951167, 912857, 828743, 745794, 669844, 596336, 594732, 573634, 542108, 538850, 533015, 498430, 469735, 467400, 447843, 462089, 487857, 501990, 501337, 519400, 534717, 535579, 534188, 505139, 454278, 448804, 440425, 394700, 415416, 487097]
12478D87097Q8336N7856L4335J1322l4676j3459l600m0525m2606j8734j1388M775
12466E18733P121k0389K2131O0303N3822K7288J2446k841M17N950j0395J713L1244
12453G07543L0151N8692M9775N1875Q7044P3817M041m4595n5595n4115o8457k1382
12441H18794P552K187J4068P4074P2620M3509L6532N8950N3143n1255o9323j24619
12429I36232j18690o1713n1414o1068j00519k1905n4333n8930j6662n1992l2457
12418C06549k0643K1852L4530N2444L4623K818n0074m2740l5871o0889l6768K6673
12406B32504L6798L2116J7299m9113L1246Q9970L2789j4523j830k332p055J3118
12394D10987K2197l840l9018l0986n569L348J7700q592Q005j599L3128L253l3082
$$ y = [487097, 575433, 633289, 667624, 678946, 644270, 630811, 627211, 586686, 544080, 525346, 513958, 518733, 525854, 505465, 527596, 587899, 641721, 669009, 681455, 678614, 679031, 684981, 674586, 676299, 707543, 737694, 796386, 846161, 898036, 985080, 1058897, 1062938, 1018343, 962748, 908633, 840176, 818794, 826346, 828533, 842601, 916675, 989295, 1032804, 1069336, 1128286, 1181429, 1130174, 1060851, 936232, 817542, 755829, 704415, 643347, 542828, 520923, 466590, 407660, 390998, 339006, 306549, 285906, 307758, 342288, 394732, 429355, 432173, 382099, 339359, 303488, 242599, 205831, 232504, 269302, 301418, 318717, 269604, 300850, 390820, 423609, 409086, 407256, 404924, 397869, 410987, 433184, 429344, 390326, 359340, 353771, 357119, 374819, 366227, 374232, 372633, 405761, 409014, 375932]
12381C75932J994J3310J0191K8678L7830L5099J19532R3432R90l3521l6406m4124
12369F02937k7834J1110M2339J0952l6318l1959O1536M2956J993O8596L4116l6750
12357G43674p2550o6426j9260m0481p4981n2685k9292p0324o7964J7311J093k2429
12345B45686J0590m9295n9492M7570j7453p750K830r238j6189m252j6779q7p70
12332A25371j5248J3853K5012K323p584J0368j0010R153j7186m3832N274R311
12320A06805J5528k5027R334k3755l5035L2443J2127L6632J8249k512j2932n8791
12308G3066k7682k8022k6267R138J9030O370J5180k1061J6257o354m536k0606
12296D513j5135R558L4670P885L6649M096k0114J7890j0948k7274j2363J7465
$$ y = [375932, 377926, 391236, 401427, 430105, 467935, 503034, 622566, 715998, 716988, 683467, 647061, 602937, 575103, 586213, 628552, 639504, 603186, 571227, 632763, 675719, 677712, 746308, 780424, 743674, 671124, 604698, 585438, 544957, 469976, 417291, 387999, 317675, 249711, 267022, 268115, 245686, 256276, 206981, 147489, 195059, 177606, 169856, 172686, 163448, 147259, 143007, 126228, 126141, 125371, 110123, 123976, 148988, 151311, 143727, 154095, 144085, 153238, 136052, 92220, 97494, 106805, 122333, 97306, 106640, 82885, 47850, 80293, 92420, 129052, 147301, 144789, 131857, 73066, 45384, 17362, -8905, 233, 19263, 25633, 40813, 19752, 36009, 29655, 25119, 4513, -10622, -1064, 33606, 41491, 78140, 82236, 62122, 80012, 69064, 41790, 29427, 46892]
12284D6892J5448j2106j7746N296o718J5978K0902K3854L052K9384n980j4359
12272A03897j3411j0400J0177J3852M309n845l6747K7090L2368r674j0429k1228
12260H3959j6031j4211M6973j427J1646k1630q541P534K484J8517j1106j617k0327
12247G6223K456n808k6568m3660j3168K6433L0495K0683J6551O192J8354k8447
12235G9736K427o980J7644m821j3903R973J5627J0439j3765j9859L9834P413k6582
12222I7183J4340N232j4223J4838J0089J884p628o63L1212l349m8833m5873o461
12209D7748R30j3077J9169L5710k4495j5263J0728L066j5569l2999K128K9486
12197D7562N856l1594k4985J9498J7012Q966m2519l2686j6222J7687L9579K4367
$$ y = [46892, 62340, 50234, 32488, 37784, 31066, 47044, 67946, 91800, 94852, 124236, 118256, 103897, 90486, 80086, 90263, 104115, 108424, 102579, 65832, 92922, 125290, 115616, 105187, 83959, 67928, 53717, 100690, 99263, 110909, 89279, 80738, 88272, 90756, 109273, 98167, 96550, 76223, 78679, 72871, 46303, 2643, -10525, 15908, 46403, 67086, 83637, 89829, 108183, 79736, 82163, 75183, 92827, 88006, 74103, 84076, 99703, 110142, 96377, 76518, 116352, 123765, 97183, 111523, 116755, 102532, 117370, 127459, 129343, 121715, 121052, 152264, 148915, 100082, 54209, 47748, 48678, 35601, 54770, 90480, 65985, 50722, 61450, 64516, 48947, 15948, 18076, 47562, 53418, 21824, -3161, 16337, 33349, 42315, -204, -32890, -49112, -31425, 8154, 32521]
12185C2521j816q494p355l0987K3359N2872J5068j0541j6191n492m9967k2033
12173b9056k0784K0778L1756L3469k4603J7108j0183l5948J813L0592M6572q665
12161E2849L343j6075l2977J6995P337J2899M5706j6054j4487K2810j8200j949
12149F2197k1823j8923K6191M6919M599M4051M6553M8575L6919l760m4489l4190
12137A92819J0746m4398k7412k9017l2333M537L0897M1459L4400J4702j447l5747
12125A59206p902o090n234m8477K764M7709M0443M3798N1020j903M9463M9922
12113C74719P581Q1923Q3014Q8393J14821J45054J97640K35159K84835L49563
12103A962702L97577N11187P23124J017055J183006J170812J095360J328314K063774
$$ y = [32521, 30705, 22211, 14856, -16131, 7228, 60100, 75168, 64627, 48436, 42944, -7023, -29056, -49840, -29062, 2694, 36163, 11560, 28668, 18485, -17463, -15650, 14942, 61514, 52849, 56192, 40117, 7140, 24135, 31472, 44371, 90077, 74023, 59536, 82346, 64146, 62197, 40374, 21451, 47642, 94561, 99160, 143211, 189764, 238339, 275258, 271498, 227009, 192819, 203565, 159167, 131755, 102738, 70405, 74942, 105839, 147298, 181698, 196400, 194953, 159206, 151304, 145214, 139980, 91503, 94267, 141976, 182419, 226217, 277237, 275334, 324797, 374719, 382300, 464223, 547237, 635630, 750451, 895505, 1093145, 1328304, 1613139, 1962702, 2360279, 2871466, 3594590, 4611645, 5794651, 6965463, 8060823, 9389137, 11452911]
12094A1452911L344593N284607P883377J0758052J2778153J2047774O650280j427709
12086F8772038o966218q069119o666772n018986l715975k019913N05912L243513
12078D0064480N436164O989958Q031974Q145914N149437k030664r583449j2476771
12070D9727043j1259679q592076o228865m617857l362966k415008j872789j641509
12062I736294j441684j229861r46763o68383n37353m37487l10220k07611j83391
12053C773541j73841k22139k67789k31920k15334j33261p5391n7679K1970K1882
12043B440039q2668l2436m8462l5452J6594N6413J29699J51597K46790L63211
12033C205325L73679M04183M15308M59277N28135P06304J033360J484540J962013
$$ y = [11452911, 14797504, 20082111, 27965488, 38723540, 51501693, 63549467, 70199747, 68772038, 61805820, 53736701, 47069929, 42050943, 38334968, 36315055, 36820967, 40064480, 45500644, 52490602, 60522576, 68668490, 73817927, 71787263, 62203814, 49727043, 38467364, 29875288, 23646423, 19028566, 15665600, 13250592, 11377803, 9736294, 8294610, 7064749, 6117986, 5449603, 4912250, 4474763, 4164543, 3956932, 3773541, 3599700, 3377561, 3109772, 2877852, 2662518, 2529257, 2453866, 2396187, 2418157, 2440039, 2357371, 2324935, 2276473, 2241021, 2257615, 2314028, 2443727, 2595324, 2842114, 3205325, 3579004, 3983187, 4398495, 4857772, 5385907, 6092211, 7125571, 8610111, 10572124]
12024A0572124K249815K463130K677802L509276N211735P721566J1074987J4987952
12016F0468387J8388157J9573600J7215514J0595281O70107r085300j3371140
12009A04454606j2872178j0435801p296721l021147K120916O884051J0030503
12002H9864229J1389971J1073241R254598N071773k420596j2646926k0002797
11995I1583493k0378144j6829250j2331703q620004n946980m149835l193417k720414
11987A7413746k428032k257149j916137j393760j069110q74745o96625n92058
11979F186130m89280l87445l75585l68450l03402k45141j70387j17668o7209r8130
11969C563433j1791j1851j13388j16869j20301l3668L1939J0923P0409J42582
$$ y = [10572124, 12821939, 15285069, 17962871, 21472147, 26683882, 34405448, 45480435, 60468387, 78856544, 98430144, 115645658, 126240939, 126911046, 117825746, 104454606, 91582428, 81146627, 73849906, 70828759, 72949675, 79833726, 89864229, 101254200, 112327441, 121582039, 126653812, 124233216, 111586290, 91583493, 71205349, 54376099, 42044396, 33424392, 27477412, 23327577, 20134160, 17413746, 14985714, 12728565, 10812428, 9418668, 8349558, 7474813, 6778188, 6186130, 5696850, 5309405, 4933820, 4565370, 4261968, 4016827, 3846440, 3728772, 3661563, 3563433, 3551642, 3539791, 3426403, 3309534, 3189233, 3155565, 3187504, 3198427, 3268836, 3411418]
11959C411418R7640R1364P3495M6691J17949K77024L90545N10098O36108R00815
11949F553147J124058J262019J460322J880990K795333M129938N722629P757038
11941C2685474R883771J0561581Q181943L379915j890034o600197q341090o885144
11933D0976219m636266k566339l08434K033201L694398M696058N456576N994818
11925E5340231N021528J824327l003944q359327j1654595j0782283p597372m789599
11917A5998966l050256j972720j310663j007826q99168r03129r05382q16484o63485
11908D469853n13106l48397k96458k84082k21015j72719j62743j28271j37328
11899B205734j04184q4015n1385k7944n6077r9276m6733m2366o0548m0474j7182
$$ y = [3411418, 3509058, 3600422, 3673917, 3720608, 3838557, 4115581, 4506126, 5016224, 5652332, 6553147, 7677205, 8939224, 10399546, 12280536, 15075869, 19205807, 24928436, 32685474, 42569245, 53130826, 61312769, 64692684, 62802650, 56202453, 47861363, 40976219, 36339953, 33773614, 33465180, 35498381, 39192779, 43888837, 49345413, 55340231, 60361759, 62186086, 59182142, 50822815, 39168220, 28385937, 20788565, 15998966, 12948710, 10975990, 9665327, 8657501, 7758333, 6855204, 5949822, 5133338, 4469853, 3956747, 3608350, 3311892, 3027810, 2806795, 2634076, 2471333, 2343062, 2205734, 2101550, 2017535, 1966150, 1938206, 1882129, 1782853, 1736120, 1693754, 1633206, 1592732, 1575550]
11888A575550o4884p0013o0406m2805k8878n2101q3530n1556l8590p805m3168
11877A031814m2939k1153O919J8868l0302l4270l0248j6186r008m2495p1627J7296
11865G76669J8981l5945k0245j1986l853o581k853L8841m2429p8415k5786K7210
11853F33608j0226l1476k446K9438j2694j5562L77o577n8654J979N8249J6115
11841F02131j8360J5512k9249m0841q533J5487L7553L4415J9097l6018k6017m7118
11829E18059Q962N4323L8127m1497n541j8805L4358k2714j8849j3996k3170J0039
11817E19296J0972J1514J4561K2914N546k2021J5609J6459j9267j7446l3658l6225
11805D88254l0178n2673Q865K0252L7088M292J7850k2878K589K6994q885q1329
$$ y = [1575550, 1510666, 1440653, 1380247, 1337442, 1308564, 1256463, 1172933, 1121377, 1082787, 1074982, 1031814, 988875, 967722, 974641, 993509, 963207, 928937, 898689, 882503, 873495, 831000, 759373, 776669, 795650, 759705, 739460, 727474, 723621, 717040, 714187, 753028, 710599, 632184, 606398, 633608, 623382, 591906, 589460, 618898, 606204, 590642, 591019, 584442, 525788, 527767, 586016, 602131, 583771, 599283, 570034, 529193, 520660, 536147, 573700, 608115, 627212, 591194, 565177, 518059, 527021, 581344, 619471, 577974, 572433, 553628, 587986, 565272, 546423, 532427, 509257, 519296, 530268, 541782, 556343, 579257, 584803, 562782, 578391, 594850, 575583, 558137, 524479, 488254, 458076, 405403, 414268, 434520, 471608, 475900, 493750, 470872, 473461, 500455, 491570, 410241]
11793D10241n9855j0888K0812L4966Q751k7914m295K0833K4330J1636l0643j5461
11781C82513O193q176j3688R719p071m967n2348l9202L4154L6321K360L2823m8274
11768C30357j280J9867J0750k2410j9334j3036L9483R889m6179l2760J2038P1310
11756C58695J5875l4392N103k3726j5294K7159J202j1038K1747J0485m866j6797
11744C34153j959J8123J2852m700k6456J9172J7575q337j4738k411K1364j121
11732C63517K673k7918r696p874P189p765O379K164P966K645p576O475k0663j9274
11718B98242j3681J9369J819j1896q187L1788N016L162r051m617j0201l331P443
11705C05875k9654j1789J112Q610j7448j9134M079J4479J5069m801k6735k0351
$$ y = [410241, 350386, 339498, 360310, 395276, 404027, 376113, 371818, 392651, 416981, 428617, 397974, 382513, 388706, 380530, 366842, 376561, 369490, 364523, 312175, 272973, 307127, 343448, 345808, 378631, 330357, 329077, 348944, 359694, 337284, 317950, 304914, 344397, 354286, 308107, 275347, 287385, 358695, 374570, 340178, 345281, 321555, 306261, 333420, 334622, 323584, 345331, 355816, 350950, 334153, 332194, 350317, 363169, 358469, 332013, 351185, 368760, 360423, 345685, 343274, 364638, 363517, 366190, 338272, 328576, 320702, 327891, 320126, 326505, 328669, 336635, 339280, 331704, 338179, 317516, 298242, 284561, 303930, 305749, 293853, 285666, 317454, 322470, 325632, 316581, 311964, 301763, 298432, 305875, 276221, 264432, 265544, 274154, 256706, 237572, 241651, 256130, 271199, 266398, 239663, 219312]
11693B19312J9987K2804k7196j8056K0227L4884J8290j1680m595L715J831k0754
11681B58769L149o986k522J3036K3666L4574J0733n5936l9879r633l7810J9294
11669B10455O2508J810k4577P586m124m8366j1256K523R38L8123n20J2651K8834
11656B76585j9463l5428j2776K9824K6332K6434M1905M2472O316O2962R6263N9234
11644F00660r924l8551q2861q6211k4662L7632M6994K3745J4072K733N0250L1624
11632E65501J9240N598j7291o4738l1916j1525k3426m3041n3746Q344k5624m9115
11620B78261k2001n947K063L0801o957l581J5548K6921L6590k4483K8100M6184
11608D01499M9035M2928Q5050R9043J40052J32191J10663o016j49514j14071j10369
$$ y = [219312, 239299, 262103, 234907, 216851, 237078, 271962, 290252, 278572, 273977, 277692, 279523, 258769, 261918, 254932, 252410, 265446, 289112, 323686, 334419, 278483, 238604, 228971, 191161, 210455, 272963, 274773, 250196, 257782, 253658, 205292, 194036, 196559, 197497, 235620, 235100, 247751, 276585, 257122, 221694, 208918, 238742, 265074, 291508, 333413, 375885, 382201, 445163, 541426, 600660, 590736, 552185, 469324, 383113, 358451, 396083, 443077, 466822, 480894, 483627, 533877, 565501, 584741, 590339, 573048, 508310, 476394, 464869, 441443, 398402, 344656, 353000, 327376, 278261, 256260, 250313, 252376, 283177, 276220, 272639, 288187, 315108, 351698, 327215, 355315, 401499, 450534, 493462, 578512, 677555, 817607, 949798, 1060461, 1054445, 904931, 790860, 680491]
11597F80491j34262p7077k1116k406n1559m1071j5676J0289m4734l7886K1974
11586B86967l260J2971J7999J7355Q641k9631O443L9368P6698K5641J8305N3449
11574E30946Q4567Q0264J22071J16678k9917m9947o1325p9286m8859n327j5313
11563F44552l4044J6271Q2792P1972P3911P0393P2314q085j07759r9679q2101
11552G00537j13483j34043n0962p2065j2084L5053r940l765j196j0871j8543K0165
11540C28803J0457J7917N294o030J8336M0803P5324J23796J54457J68675K70673
11529A208505K97092K01954O1788r7818k00262j75933j07561J9163M4479k3444
11519A227963j42008k00505j65908j63115r9282o8956o6407m5740j1268R567L0597
$$ y = [680491, 546229, 469152, 448036, 445630, 394071, 353000, 337324, 347613, 302879, 264993, 286967, 283707, 296678, 314677, 332032, 340673, 311042, 317485, 356853, 433551, 459192, 477497, 530946, 615513, 695777, 817848, 934526, 904609, 854662, 793337, 714051, 665192, 659865, 644552, 610508, 626779, 709571, 781543, 855454, 925847, 998161, 990076, 882317, 782638, 700537, 587054, 453011, 402049, 329984, 317900, 352953, 343013, 339248, 338052, 327181, 308638, 328803, 339260, 357177, 362471, 356441, 374777, 415580, 490904, 614700, 769157, 937832, 1208505, 1505597, 1707551, 1769339, 1671521, 1471259, 1295326, 1187765, 1206928, 1251407, 1227963, 1085955, 885450, 719542, 556427, 457145, 388189, 321782, 276042, 264774, 274341, 304938]
11508C04938R290l665P116K4283L099J1389M5234L0355K668L4693R7013O6593
11496F33006J6984M986N0727k2648m1596J4165M4847P3768J18653K27449L51594
11485A471935L96026K76219Q6217j34131l36347l90873l14067k35256j55177j06411
11475E58135r3549q0608m8855K3145L7082q0k4185k0161j2280j0586q53k276J9071
11462C44000P6043M7210L5464N0129J10768J72964J52606J04823M4758j25448
11452A013317j67846j26741j35944r1023k5156o3754q4149p6255j1916K4192l4859
11441B19866K057J8419l884J7901k5054j4038J781K0490N86k41l9454J4526J6668
11428B29623N980k2137j8467O56j5667N305j1559r509K2415L3234p747j6167Q543
$$ y = [304938, 314228, 310563, 317679, 341962, 345061, 356450, 401684, 432039, 434707, 469400, 566413, 633006, 649990, 654976, 705703, 683055, 641459, 655624, 700471, 774239, 892892, 1120341, 1471935, 1867961, 2144180, 2230397, 2096266, 1759919, 1369046, 1054979, 819723, 664546, 558135, 464586, 383978, 335123, 358268, 395350, 395270, 371085, 350924, 338644, 328058, 327205, 324929, 344000, 420043, 467253, 502717, 552846, 663614, 836578, 989184, 1094007, 1138765, 1013317, 845471, 718730, 582786, 491763, 466607, 402853, 318704, 242449, 230533, 254725, 219866, 221923, 240342, 236458, 254359, 229305, 215267, 217048, 237538, 238124, 237883, 198429, 212955, 229623, 235603, 213466, 194999, 195655, 179988, 185293, 173734, 164225, 186640, 219874, 212127, 195960, 204503]
11415B04503n5729k372K6016k3058K431L088K0713M3162M3341j9262p3009p2911
11403I6913n1L4898M8779K4140M782j9996m1750p479j3042K6641p563N172k3572
11390A27872m266n290J5605k7128K2679j1849J1768j5196k24L8376j929O832m057
11377A53193k2229J2401N3851M5473O0417N2841M8127R667p742p030l930r954
11365C85085l7011l288l5945o1909n615k3752o6974l3707K8284L1011N897K728
11353A84804j3039R662J2013j4114k0737Q683l562j3622m7829K2131J1445o148
11341A29687O219L6514L4258K8753j468k5140k2584L0905N6639o171l1222m3427
11329A92963J5314N6225L7562k394J6670J4680j3703j2316O386j9841p7852m9043
$$ y = [204503, 148774, 146402, 172418, 149360, 151791, 154879, 175592, 218754, 262095, 242833, 169824, 96913, 96862, 131760, 180539, 204679, 209461, 189465, 147715, 140236, 127194, 153835, 146272, 151444, 127872, 123606, 118316, 133921, 106793, 129472, 117623, 129391, 114195, 113971, 152347, 150418, 157250, 153193, 130964, 143365, 197216, 242689, 303106, 355947, 404074, 413741, 405999, 398969, 395039, 385085, 348074, 344786, 308841, 246932, 241317, 217565, 150591, 116884, 145168, 176179, 182076, 184804, 171765, 181427, 193440, 179326, 158589, 167272, 163710, 150088, 102259, 124390, 135835, 129687, 135906, 172420, 206678, 235431, 233963, 208823, 186239, 217144, 273783, 267612, 236390, 192963, 208277, 264502, 302064, 299670, 316340, 331020, 317317, 305001, 311387, 291546, 213694, 164651]
11317A64651j0375l563N937j1404n1190j3118L5221K894J843J7366J5738r38L397
11304A56459k194P303m000P671l318j5831k063j2525j1108O9160M5226Q322l7186
11291B05916q225j9552L1677l612m3550P423l4736j5195L5946j1275j2744j961
11279A30112l5161n474K2244J009K9402j741j1867J0430K2273n242n287k7262
11267A23436K4492P328J054K8339Q935M927K79K6070K0350L463j544K0996l2829
11254B35296k9833K8565J2571K2664N089J8068L3175J8287N0828N0566k022l064
11242D40190k1764l3782p3602m3752k5857o8031k8907o3283l5375j7045Q525M9840
11230H7157J6092O031N587L1722k7598J9617l869j8539K7718L8667N0794J4753
$$ y = [164651, 154276, 150713, 156650, 145246, 94056, 80938, 116159, 119053, 120896, 138262, 154000, 153062, 156459, 154265, 161568, 157568, 165239, 161921, 146090, 144027, 131502, 120394, 189554, 234780, 243102, 205916, 197691, 178139, 209816, 206204, 162654, 170077, 135341, 120146, 156092, 144817, 132073, 130112, 94951, 89477, 111721, 112730, 142132, 140391, 128524, 138954, 161227, 155985, 150698, 123436, 147928, 155256, 156310, 184649, 193584, 198511, 198790, 224860, 245210, 248673, 247129, 268125, 235296, 205463, 234028, 246599, 269263, 274352, 292420, 325595, 343882, 394710, 445276, 443254, 440190, 418426, 384644, 311042, 267290, 241433, 173402, 144495, 81212, 45837, 28792, 37317, 87157, 103249, 109280, 114867, 146589, 118991, 138608, 134739, 116200, 143918, 182585, 233379, 248132]
11218B48132J6705M9356Q818q202L158l4260k2412K3764L7042Q908j6959p39j3803
11205B99508M5388K0412M956Q648j2342j26M2239K6489o160j7162l1110m8592
11193C32148r6087n3925n5285n3347l729K7111L435j6701M1181L8020N9155N4741
11181B76717J0757R895M856M3409j0777k572K6793l924l0950M2612K2732R116
11169C98664N61O182j5914P557K9434P476n537N4879Q4964N6998p406j9533k5857
11156E72468k1447l0684n0767l3511O2383M5926K7629R3521P5194N0381R0372
11145H81465J74208J97772L08633M16225N04636N76059N30975L79599J37536L3378
11135D140486R0540K68858N02452Q76764J222932J579212J767160J711678J471100
$$ y = [248132, 264837, 314193, 323011, 314809, 317967, 283707, 261295, 285059, 322101, 331009, 314050, 313311, 299508, 344896, 365308, 370264, 378912, 366570, 366444, 408683, 435172, 429012, 411850, 380740, 332148, 236061, 182136, 126851, 73504, 69775, 96886, 100321, 83620, 124801, 162821, 221976, 276717, 287474, 297369, 302225, 345634, 334857, 332285, 359078, 355154, 324204, 366816, 389548, 398664, 399225, 405407, 389493, 397050, 426484, 433960, 428423, 483302, 568266, 625264, 617858, 598325, 572468, 551021, 520337, 469570, 436059, 498442, 544368, 571997, 665518, 740712, 791093, 881465, 1055673, 1253445, 1562078, 1978303, 2482939, 3058998, 3589973, 3969572, 4107108, 4140486, 4231026, 4499884, 5002336, 5879100, 7102032, 8681244, 10448404, 12160082, 13631182]
11126A3631182J447816J815547L001752N253310Q920060J4922485K4510279L7975909
11118A11478340N2319253N9787666N1097528K3630468j3848490m5405091n9084761
11111A79974913n4744068m0860210k6559458j6140225r695212n937423l666700
11104B2371617k375343j711227j535946j546031j538878j454018j176211p24021
11096A0309942l27475j11429o8152r4770J2979J68825L81783N36480P74518J014076
11086A2596777J281811J480838J455939J261020J341167J964161L478844O042952
11078C0903509J0248621J7133898K7956221M2742799N7547440O3874256N2104621
11071C02511365K1009305j9420146n1701885o4407926n8212641m2720735k7439023
$$ y = [13631182, 15078998, 16894545, 19896297, 25149607, 34069667, 48992152, 73502431, 111478340, 163797593, 223585259, 274682787, 298313255, 284464765, 239059674, 179974913, 125230845, 84370635, 57811177, 41670952, 31975740, 26038317, 22371617, 19996274, 18285047, 16749101, 15203070, 13664192, 12210174, 11033963, 10309942, 9982467, 9871038, 9802886, 9708116, 9721095, 9889920, 10271703, 10808183, 11582701, 12596777, 13878588, 15359426, 16815365, 18076385, 19417552, 21381713, 24860557, 30903509, 41152130, 58286028, 86242249, 128985048, 186532488, 250406744, 302511365, 323520670, 304100524, 252398639, 187990713, 129778072, 87057337, 59618314]
11064E9618314j6544051r967538o068821l775024k430736j790933j657809j821103
11056A5562299k005529k000868j735931j345924r95715p04903m74021k65304j28754
11047E905350L8382M3583j18457l14463m43562m36859m32690l49860k46428k03832
11037C441164j81785j32265j18092r3958o1459n7065k2370r3861j73012j95273
11027B312024j71701j56958j15142q4377o3847o6213l4897l722N2989L3268J435
11016A702859n3706p7868m9888o0578p1210l4271l4232l2034l1077j3019J4166
11005A259142L4059j6223j913M268k362j703k3830m8908k4620J1860M1311J9913
10993A250994R087j285O4936P9423N1558O744k4182m7552n6188r0583j51322j06499
$$ y = [59618314, 43074263, 33106725, 27037904, 23262880, 20832144, 19041211, 17383402, 15562299, 13556770, 11555902, 9819971, 8474047, 7478332, 6773429, 6299408, 6034104, 5905350, 5943732, 5987315, 5868858, 5554395, 5110833, 4673974, 4241284, 3891424, 3644996, 3441164, 3259379, 3127114, 3009022, 2915064, 2853605, 2796540, 2774170, 2680309, 2507297, 2312024, 2140323, 1983365, 1868223, 1783846, 1719999, 1653786, 1618889, 1615167, 1668156, 1701424, 1702859, 1649153, 1571285, 1521397, 1460819, 1389609, 1355338, 1321106, 1289072, 1257995, 1244976, 1259142, 1293201, 1276978, 1275065, 1279333, 1276971, 1275268, 1251438, 1202530, 1177910, 1189770, 1231081, 1250994, 1260081, 1258796, 1323732, 1403155, 1454713, 1461457, 1437275, 1389723, 1333535, 1242952, 1091630, 985131]
10981I85131n5164r754L0723R1315K7054K5064L6282m2388r7811j11101r0184
10970G89167n5739l6527k2838j7144r891J4227R069l023J9714R587M0837N834
10958G43273j9757K480j2769l6402j3381J1548P89k8989n962J4224L7528O0287
10946G52869N1308r35n9m0249o2063q7096j18799q6989m0765K4520M360m4180
10934C51922l5985J6055R781M551k4829L9529l653l564J1842j182J0201L2059
10922D06727m0574O065J9441K5793K1356m3415r639J038M289O787o919l1753K4357
10909C83553K5199M167k0604r726k3241n3952l0745k7639J1878K7489K7155o805
10897C06729o2919K81P587J3436m618k7817l5358J1876M7117K4737J9344o782
$$ y = [985131, 929967, 920213, 950936, 1042251, 1069305, 1094369, 1130651, 1088263, 990452, 879351, 789167, 733428, 696901, 674063, 656919, 647028, 661255, 670324, 667301, 687015, 696602, 737439, 743273, 723516, 725996, 713227, 676825, 663444, 674992, 675781, 646792, 640830, 655054, 692582, 752869, 804177, 803242, 803183, 762934, 700871, 613775, 494976, 407987, 367222, 391742, 396102, 351922, 315937, 331992, 341773, 346324, 321495, 361024, 357371, 353807, 365649, 364467, 374668, 406727, 366153, 372218, 391659, 417452, 438808, 395393, 385754, 386792, 391081, 397868, 390949, 359196, 383553, 408752, 412919, 392315, 382589, 359348, 305396, 274651, 247012, 258890, 286379, 313534, 306729, 243810, 244091, 251678, 265114, 260496, 232679, 197321, 209197, 256314, 281051, 300395, 293613]
10885B93613q100K5990K6897k1165M913j0962M4456M4676J1146l142K308j4750
10873C95880l033J505n920m5300K2306j3267j828j8372j2429j2824j9160j747
10861B85811k3882L1261o712L234k654k2663j1926j3086q612J2868K6634r719
10849B60554J0288M6174N1824J885P803l2767l1514J4636J2953M857k1994j5355
10837C09344L343m968q830j4694q555m3l397L3431K1773J5976m1563j7940k7581
10824B56296J7622o554j8781M1593J9583J6830L450J1637l192k0935l382O872
10812C21039K7018k0386l2784m3044j9873j4449N997k64J3187K7679J1057J6119
10800B91296k5206n532j2472J3434k0268j1530M3302J3395r514j9242m544L0856
$$ y = [293613, 285513, 311503, 338400, 317235, 322148, 311186, 355642, 400318, 411464, 408322, 410630, 395880, 392847, 394352, 388432, 343132, 365438, 352171, 350343, 331971, 319542, 306718, 287558, 285811, 261929, 293190, 286478, 289712, 287058, 264395, 252469, 239383, 230771, 243639, 270273, 260554, 270842, 317016, 368840, 370725, 378528, 345761, 314247, 328883, 341836, 346693, 324699, 309344, 312687, 307719, 298889, 284195, 275640, 275597, 272200, 305631, 327404, 343380, 301817, 283877, 256296, 273918, 267364, 248583, 290176, 309759, 326589, 330039, 341676, 338484, 317549, 314167, 321039, 348057, 327671, 294887, 251843, 231970, 217521, 223518, 223254, 236441, 264120, 275177, 291296, 266090, 260558, 248086, 261520, 241252, 229722, 273024, 286419, 276905, 257663, 253119, 283975]
10788B83975N991l5098o70K839l5824o224K953L0289j5529M792J5391K6941m766
10775B75060k3383l5876l6377k551n770J7617j5462m26M322J6836n9K1145l9407
10762A75669J3272L9894J6487l6546j6273L564k8023j769L0077M2007L9705k8805
10750B49259l2421K3363M0456o306k2912K702j7899p044K8152J7177M375j1759
10738B67143k0714M068O18j4962L2799k570p0980P314L5579J7871L56P861p531
10725B56852k7257Q08L889N40K3119M510k9541r318n209j0783L6439J1911j7193
10712B38767k2487K048J1504Q828K9304n353K0390N3479N8906R0563J31760J97417
10700H15126K63718K79679J81428Q0735n4262k05851k58944k72039j95564j51037
$$ y = [283975, 289966, 254868, 254198, 257037, 221213, 214989, 217942, 248231, 232702, 237494, 252885, 279826, 275060, 251677, 215801, 179424, 176873, 171103, 188720, 173258, 172832, 177154, 193990, 193931, 215076, 175669, 188941, 228835, 245322, 208776, 192503, 196067, 168044, 166275, 196352, 238359, 278064, 249259, 216838, 240201, 280657, 274351, 251439, 254141, 236242, 229198, 257350, 274527, 278902, 267143, 246429, 250497, 251115, 236153, 268952, 266382, 195402, 202716, 238295, 256166, 256522, 264383, 256852, 229595, 230403, 234292, 234832, 257951, 262461, 232920, 223602, 218393, 207610, 244049, 255960, 238767, 216280, 218328, 229832, 238660, 267964, 262611, 283001, 336480, 395386, 485949, 617709, 815126, 1078844, 1358523, 1539951, 1620686, 1566424, 1360573, 1101629, 829590, 634026, 482989]
10690D82989q3668k1388J3079k0134o1304j8128M3056L496j221J8795j4067j8981
10678C22524l5233m747L6366J7688m033k5176m0808o4570o511O2714J1474m2208
10666B27480l1413J4485L6470L1728M2877O7755R9259Q7733J39176K59280L15286
10655A290116L18473K38377P3330j40587k82370l13018k57530k26898j68832j22079
10645D08982l2273k7673l6089l2643j8805N792P704j4303n882k6922j492N041
10633B31437m925r778l7707o315L6331l692K5465q703N335K980Q138l76q932m437
10619B24821P486J1316N442k0490l587J2388j9072r474j2866r528r405L0097k6800
10606A80328l052k7660K5404K7501J979J577J4945k8255K0864L9953J0887l852
$$ y = [482989, 399321, 377933, 391012, 370878, 309574, 291446, 334502, 337998, 336777, 355572, 341505, 322524, 287291, 282544, 318910, 336598, 332565, 307389, 266581, 202011, 195500, 258214, 269688, 227480, 196067, 210552, 247022, 278750, 321627, 389382, 488641, 576374, 715550, 974830, 1290116, 1608589, 1846966, 1920296, 1779709, 1497339, 1184321, 926791, 699893, 531061, 408982, 376709, 349036, 312947, 280304, 261499, 267291, 274995, 260692, 254810, 227888, 226396, 231437, 226512, 216734, 179027, 172712, 209043, 205351, 230816, 222113, 227448, 230428, 238566, 238190, 229258, 224821, 232307, 243623, 249065, 228575, 224988, 237376, 218304, 208830, 195964, 186436, 177031, 207128, 180328, 177276, 149616, 175020, 202521, 204500, 206077, 221022, 192767, 213631, 253584, 264471, 260619]
10594B60619k6492J5984N235m3179j8361k0011M2217K3864l179o7899j5098K7907
10582A81607R333K1341l585K3904K5448k5358O745J4424j9777o853J9815l6118
10570B10926m3997K7310L7079l898l7191n5118k0046J2440K5567l1775j9234M5043
10558A47106J5154K7026L4286l0861k4325J2202j678j7147M874O489K3894j1095
10546A85925k112M823J2894p090j0915j9965q782M307J3336n112J8730J6993L0284
10533B33316J41j8501r020k8363J1356K4278L0866J9714o739m152L551k1450j4585
10520B20412K6453J5385Q143r087j0581j4077l000l7986k4623j7856K7339N9060
10508B39582L8113j7140m740k1002O38K1412J6678k2746J2475j3372k1371k2113
$$ y = [260619, 234127, 250111, 255346, 212167, 193806, 173795, 216012, 239876, 236697, 168798, 153700, 181607, 190940, 212281, 208696, 232600, 258048, 232690, 239435, 253859, 234082, 227229, 247044, 210926, 166929, 194239, 231318, 227420, 190229, 135111, 115065, 127505, 153072, 121297, 102063, 147106, 162260, 189286, 223572, 192711, 168386, 180588, 178910, 161763, 166637, 173126, 197020, 185925, 183813, 188636, 201530, 194440, 183525, 163560, 154778, 159085, 172421, 167309, 186039, 203032, 233316, 233457, 214956, 205936, 177573, 188929, 213207, 244073, 263787, 257048, 252896, 256447, 234997, 220412, 246865, 262250, 270393, 261306, 250725, 236648, 233648, 195662, 171039, 153183, 180522, 239582, 277695, 260555, 255815, 234813, 235451, 256863, 273541, 250795, 263270, 249898, 228527, 206414]
10496B06414P172o035k3701Q433J0890j7796M31K798K6992j0832J2373O660l5733
10483A88066j0332M5016K3958k0386K8256L8161K0768n5305j7559J2149J9894
10472B72686l4445k278J4540MQ475p516l1471j8871j9230j668K1564J9481j9820
10459B01451J2198J6091n448K3578K4625O092J1256j5558j332j8603J3759J7131
10447B85240J8011k2989l273K9781K4656L0181O039o6238k7211j5205q080K3638
10435B74550O144k2575N710P846L5794O2529P048j677o720M221O662K6711m3917
10422C62326R71M5912M4303M9125R7700J20231K12719J92321K38367K18133J07922
10411A690030p0889k06879k27261k16880j75867j13422p3887K8339K3488l9125
$$ y = [206414, 213586, 207551, 183850, 192283, 203173, 185377, 185808, 188606, 215598, 204766, 217139, 223799, 188066, 177734, 222750, 246708, 226322, 254578, 292739, 313507, 258202, 240643, 252792, 272686, 238241, 235963, 250503, 250507, 258982, 251466, 219995, 201124, 181894, 180226, 201790, 221271, 201451, 213649, 229740, 224292, 247870, 272495, 278587, 289843, 274285, 272953, 254350, 268109, 285240, 303251, 280262, 276989, 306770, 331426, 361607, 367646, 301408, 274197, 258992, 250912, 274550, 280694, 258119, 263829, 271675, 307469, 369998, 377046, 375369, 368649, 372870, 379532, 406243, 362326, 363297, 409209, 453512, 502637, 600337, 720568, 933287, 1125608, 1363975, 1582108, 1690030, 1619141, 1412262, 1185001, 968121, 792254, 678832, 604945, 633284, 656772, 617647]
10401F17647o2759k9731k9435q4554l5898l7296m2475n504R214L659m8385J5798
10389B70281J9467K4534J3317J3442R117K3291L6721M3828M3858n340K2153Q9183
10377F03852L8507L39P4643J55146J56174J65141K65206K94540J99621M5189r9669
10366A898689k24396k71825k81912k61800j49387q1628n1130o8961m7946J4393
10356D74097o540j2077K6819o936l7688P447k2831k1096n755l5625K4733N8274
10344D42822K6273Q70P4699Q4993J03826K05539K46085K45090K02783K69420K86806
10333B189206J86515N0275j6101o0719j37327k44941l30134k55495k20053j88396
10323I72830j81112j43879o8453n9539k026l6397n8062p284m0467m1123J4415
$$ y = [617647, 554888, 525157, 495722, 411168, 375270, 337974, 295499, 289995, 299209, 302868, 254483, 270281, 289748, 314282, 327599, 341041, 350158, 373449, 410170, 453998, 497856, 492516, 514669, 603852, 642359, 642698, 717341, 872487, 1028661, 1193802, 1459008, 1753548, 1953169, 1998358, 1898689, 1674293, 1402468, 1120556, 858756, 709369, 627741, 576611, 507650, 459704, 474097, 467557, 455480, 482299, 475363, 437675, 445122, 422291, 401195, 395440, 359815, 384548, 442822, 469095, 469965, 544664, 629657, 733483, 939022, 1185107, 1430197, 1632980, 1902400, 2189206, 2375721, 2425996, 2409895, 2349176, 2211849, 1966908, 1636774, 1381279, 1161226, 972830, 791718, 647839, 579386, 519847, 517821, 481424, 423362, 416078, 375611, 334488, 348903]
10312C48903k5089j9749K1248L6093l4134j6809j1210j0731K727N3010K6733j7917
10300C53075J801l3334J3307L283J863L3929j5358m8736K5596M1235l909m1405
10288C31347O020q010L1066M6170J2541j3572K650k8759j4862J7430K6655O503
10276D15179l0671n8063j4636m545L4253j9155k5211k7273r771K1943L1982K3853
10264C37885N083L9085j5133j2543j3676m894l1220j2371j669j287r724J2616
10252B92152J4628L2895J2534J0858L400N920l1474k236K5200j2773K0753L3420
10240D05277L4710Q5521O1971P2550J45981J23104Q0017M7204o4890j59566r4014
10229G37865o8099r1425n6526m0328j4599l8540j7004p849P221K1285k9380k4874
$$ y = [348903, 323814, 304065, 325313, 361406, 327272, 310463, 299253, 288522, 291249, 344259, 370992, 353075, 354876, 321542, 334849, 338132, 339995, 373924, 358566, 309830, 335426, 376661, 372752, 331347, 337367, 329357, 360423, 406593, 419134, 405562, 408212, 379453, 364591, 382021, 408676, 415179, 384508, 326445, 311809, 307264, 341517, 322362, 297151, 269878, 260107, 282050, 314032, 337885, 342968, 382053, 366920, 354377, 340701, 335807, 304587, 292216, 290547, 289260, 279536, 292152, 306780, 339675, 352209, 363067, 366467, 372387, 340913, 338677, 363877, 351104, 371857, 405277, 439987, 525508, 587479, 660029, 806010, 929114, 1009131, 1056335, 991445, 831879, 737865, 669766, 578341, 521815, 481487, 466888, 428348, 411344, 403495, 410716, 432001, 402621, 377747]
10217C77747l6280r445j6922J8522q094j7898L2004K8134j9694l289k4551P068
10205C27302l4847j1997L2883P2761L981j3670p227J4768k0547J815L8313L8498
10193D42033R4452J43066K32539J92753J22305M6149o4634j50856j78193k03444
10183F76170j14125p9652l6561q562k213K2749n132J3896R619J1924O6498K4876
10171E79487m8842l8375l9970k1738j6588Q432j0102k1964K3432L147J6091p060
10159D25950k1722K3432M9907K0563N4013K3699j5M9828M4856Q0125J20199J40254
10147A011089J66455K60780M20776N55147N92067N65712L51867J25098j96085
10138C852906m61787n75697n34776m29563k78661j62794q3762l4780J7532L6664
$$ y = [377747, 341467, 332022, 315100, 333622, 325528, 307630, 339634, 367768, 348074, 344785, 320234, 327302, 292455, 280458, 313341, 386102, 390083, 376413, 369186, 383954, 363407, 365222, 403535, 442033, 536485, 679551, 912090, 1104843, 1227148, 1273297, 1208663, 1057807, 879614, 676170, 562045, 482393, 445832, 437270, 435057, 457806, 452674, 466570, 476189, 488113, 554611, 579487, 530645, 492270, 452300, 430562, 413974, 422406, 412304, 390340, 413772, 416919, 433010, 425950, 404228, 427660, 477567, 498130, 552143, 575842, 575827, 625655, 670511, 750636, 870835, 1011089, 1177544, 1438324, 1859100, 2414247, 3006314, 3572026, 3923893, 4048991, 3852906, 3391119, 2815422, 2280646, 1851083, 1572422, 1409628, 1325866, 1291086, 1308618, 1345282]
10128A345282R5592N4885P4212R5758J95600K61419M42241O96826R45286J150362
10118E357463J140829R26648N25818r4077p00092j033910j131338r87734p29412
10109C274195n25630l20586j47935m0630Q9005K29332L33123N81920Q56501J002904
10099E332199J093471J033001Q07160M30982J57542p2135k53798l97100n67074
10090G564248p68150r60273q78210p12784n57119l30589k02424j8130J26848K39181
10080C502598M37741P10197J052773J523883J932107K207830K230568J867432
10072A5465129J209180N63671N2541m71957r70576j298287j458027j553701j736109
10063I801864j769705j335975q23343m51879k31558l2259K38957N46899P49946
$$ y = [1345282, 1440874, 1495759, 1569971, 1665729, 1861329, 2122748, 2564989, 3261815, 4207101, 5357463, 6498292, 7424940, 7950758, 7856681, 7156589, 6122679, 4991341, 4003607, 3274195, 2748565, 2427979, 2280044, 2239414, 2328419, 2557751, 2890874, 3472794, 4329295, 5332199, 6425670, 7458671, 8265831, 8696813, 8854355, 8782220, 8528422, 8131322, 7564248, 6796098, 5835825, 4957615, 4244831, 3687712, 3357123, 3154699, 3136569, 3263417, 3502598, 3940339, 4650536, 5703309, 7227192, 9159299, 11367129, 13597697, 15465129, 16674309, 17237980, 17290521, 16818564, 15847988, 14549701, 13091674, 11537973, 9801864, 8032159, 6696184, 5872841, 5420962, 5189404, 5157145, 5396102, 5943001, 6692947]
10054F692947Q60036R21662J057808J115899J225286J350665J473251J529204
10046A6226758J661489J685440J455508P46825l71517j611451k492585k811942
10038A4488525k632244k062837j380614p27693j20751M08921Q66814J181683J423183
10029A1444987J526679J566717J699067J801864J492031R83060M88801N3078m28414
10020B0627870q79589j310636j577901j489727j501407j705286j778922j464348
10012H920054r10650m21247m4791K51169N94000R32443J415988K012184K725715
10003A5474865L499758M121151M358061L852092K480218M66731j523159l149486
9995B9580231l926986l956965l565722l027828k454190j907894j447489r50857
$$ y = [6692947, 7552983, 8474645, 9532453, 10648352, 11873638, 13224303, 14697554, 16226758, 17888247, 19573687, 21029195, 21776020, 21404503, 19793052, 17300467, 14488525, 11856281, 9793444, 8412830, 7685137, 7564386, 7973307, 8840121, 10021804, 11444987, 12971666, 14538383, 16237450, 18039314, 19531345, 20514405, 21003206, 21056284, 20627870, 19748281, 18437645, 16859744, 15370017, 13868610, 12163324, 10384402, 8920054, 8009404, 7588157, 7543366, 7794535, 8388535, 9320978, 10736966, 12749150, 15474865, 18974623, 23095774, 27453835, 31305927, 33786145, 34252876, 32729717, 29580231, 25653245, 21696280, 18130558, 15102730, 12648540, 10740646, 9293157, 8342300]
9987H342300n31148j34774K16654N45383R82104J447896J690188J610605J619865
9978A5789073J822511J918437J614766J055931O27737J93351k44044q93962j296256
9969B0587544j533802j654514j864290j993658j954148j637450j099126n12652
9961H337904J41575O77187J313625J929160K328978K262534J814841J004268J49981
9952A9960053m50731p96032r68969j057821j085782j106822j035147j049978j068561
9943A1340210j081500j113379j075328q80581o44906l44512q62L37210P13631
9934G249983J119684J579696J808952J745849J741450J887421J948825J575473
9926B0657333R05681L894j026162k032075k791717k988999k717444k154459j513691
$$ y = [8342300, 7811152, 7676378, 7893032, 8438415, 9420519, 10868415, 12558603, 14169208, 15789073, 17611584, 19530021, 21144787, 22200718, 22828455, 23021806, 22777762, 21883800, 20587544, 19053742, 17399228, 15534938, 13541280, 11587132, 9949682, 8850556, 8337904, 8479479, 9156666, 10470291, 12399451, 14728429, 16990963, 18805804, 19810072, 19960053, 19509322, 18713290, 17744321, 16686500, 15600718, 14493896, 13458749, 12408771, 11340210, 10258710, 9145331, 8070003, 7189422, 6544516, 6200004, 6199142, 6536352, 7249983, 8369667, 9949363, 11758315, 13504164, 15245614, 17133035, 19081860, 20657333, 21563014, 21566908, 20540746, 18508671, 15716954, 12727955, 10010511, 7856052, 6342361]
9917F342361j054070o82643m10826k20189q9629K6700J78056L84444O00795Q68598
9907E943597J035433J023892J041459R82839Q83441O11907K97715j91082p85975
9898A0843226j309889j594231j515983j247005r39155o28877l34129j89851m4664
9889C039442N9484K52875M51665O86037R19894J148659J217423J053583N23837
9880I352899k21353q85345j287318j413810j241873r69467o32051l80136k45694
9871B075852j90695j72423j01667n0338j9239J938O6944J24934J67132K93132
9861B195570M63977N88658O67037O75772M37146P4363k96604n23652o65317o98335
9851B918615n74922l87524l33199k66094j58408j05434p8437p5354p7565q9083
$$ y = [6342361, 5288291, 4605648, 4194822, 3974633, 3885004, 3911704, 4089760, 4474204, 5074999, 5943597, 6979030, 8002922, 9044381, 10027220, 10910661, 11522568, 11820283, 11629201, 10843226, 9533337, 7939106, 6423123, 5176118, 4236963, 3608086, 3273957, 3084106, 3039442, 3098926, 3351801, 3803466, 4489503, 5409397, 6558056, 7775479, 8829062, 9352899, 9131546, 8246201, 6958883, 5545073, 4303200, 3333733, 2701682, 2321546, 2075852, 1885157, 1712734, 1611067, 1560729, 1541490, 1543428, 1610372, 1735306, 1902438, 2195570, 2659547, 3248205, 3915242, 4591014, 5028160, 5102523, 4805919, 4282267, 3616950, 2918615, 2343693, 1956169, 1622970, 1356876, 1198468, 1093034, 1014597, 939243, 861678, 772595]
9841G72595m7658J5372p995j4119p049k9335j9801Q080j1936M64j6913K4390J2650
9828F78745k2346n2533k6354k4968k3358o993j519N2754m671k6378l7867o1956
9816D42556j3291N9862J4607J2345J9662J9381K5089L3750o417j7981N1229m319
9804F36473n0853j1181m0366m0728j6153k3842J906J6179q511J9458P144k8716
9792D60810n7154r440R461K5431k039n721M477L3648J1033N1937l720k6071O907
9779D99559J8544l3654l8554m9133K720N226K0346J246l4570J288M6257K1632
9767D60907j589j1L7803L5470J1767R930m2975q38M256j7575k2379j6831J4006
9754D71941m5648k6022K249R910j489J1927J5654L6374K1905J1116K86j1163p182
$$ y = [772595, 724937, 740309, 732314, 718195, 711146, 681811, 662010, 670090, 658154, 658618, 641705, 666095, 678745, 656399, 603866, 577512, 552544, 529186, 522193, 520674, 573428, 568757, 542379, 504512, 442556, 429265, 489127, 503734, 516079, 535741, 555122, 580211, 613961, 607544, 589563, 640792, 636473, 585620, 574439, 534073, 493345, 477192, 453350, 455256, 471435, 462924, 482382, 489526, 460810, 403656, 394216, 403677, 429108, 427069, 421348, 425825, 459473, 470506, 522443, 518723, 492652, 499559, 518103, 484449, 445895, 396762, 399482, 404708, 425054, 426300, 391730, 393018, 439275, 460907, 459318, 459307, 497110, 532580, 544347, 554277, 511302, 510464, 514720, 497145, 474766, 457935, 471941, 426293, 400271, 402520, 412430, 410941, 422868, 438522, 474896, 496801, 507917, 508203, 497040, 489858]
9741D89858J8699L6196J2165K3187K5183M342r720J1458L5154J5687L4342N3281
9729G49832r151l0082q709k2823l056m0025m9802k349K244M095K0720J14149J9909
9716G44952N41K4598j2j8819l1620r512p038M6627K1083r529L5980J6563o683
9703H07131j0434m9199p58j7022k3813k757J5342k9365k5750L7299j6868K5016
9691G08822N5819k3483k5786r182K1071O737l3873j5176m291k9294j3708K1106
9679F58762r866J0977O125j3970j8149k8068L0959r472J2940J3840K4515m487
9667F74106k254R246L199N4823O5483j0166N3160M8528K2755J9230k9271m2755
9655H66084k3477o267m0130O0555M5241L5830Q2088J7957j891O36J5881K1428
$$ y = [489858, 508557, 544753, 556918, 580105, 605288, 609630, 599910, 611368, 646522, 662209, 696551, 749832, 740681, 710599, 701890, 679067, 676011, 635986, 586184, 583835, 586079, 590174, 610894, 725043, 744952, 745493, 770091, 770079, 751260, 719640, 710128, 703090, 749717, 770800, 761271, 797251, 813814, 807131, 796697, 747498, 746740, 729718, 705905, 703148, 718490, 689125, 663375, 700674, 683806, 708822, 764641, 741158, 715372, 706190, 727261, 733998, 700125, 684949, 680658, 651364, 637656, 658762, 648896, 659873, 665998, 652028, 633879, 605811, 636770, 627298, 640238, 654078, 678593, 674106, 671852, 681098, 684297, 739120, 804603, 794437, 847597, 896125, 918880, 938110, 908839, 866084, 842607, 836340, 796210, 856765, 902006, 937836, 1019924, 1037881, 1035990, 1036626, 1052507, 1073935]
9643A073935j1776K5744m4790k9777K3835J9102L7357M7402L9024N4048M5659
9632A279763M6934q178J962n2375q0709k5310j5734K188M4673L7759k150L2779
9620A261602J8696K9255o186k0617j6410n4919j9441r726L8218o467k7135K4621
9608A211491m753r819J3l5776l3000m008m6681k9519M727m3117K6376k15R422
9595A045141J1295M1617L3672N4696N5455J3783P311j9633l6317k7436l9832P533
9583A147285Q307n0305q960J1450k775j5710J8200M4192J6966m139k655N1232
9571A213088P03j1461j4497J9896K0911o056M5809j4947L7358K8427j5480r219
9559A294532O1692N5847j2485m8929k4375k1654n904L2345J246l5167N449K8813
$$ y = [1073935, 1062159, 1087903, 1043113, 1013336, 1037171, 1056273, 1093630, 1141032, 1180056, 1234104, 1279763, 1326697, 1318519, 1320481, 1268106, 1187397, 1162087, 1146353, 1148541, 1193214, 1230973, 1228823, 1261602, 1280298, 1309553, 1303367, 1282750, 1266340, 1211421, 1191980, 1182254, 1220472, 1214005, 1186870, 1211491, 1206738, 1196919, 1196932, 1161156, 1128156, 1124148, 1077467, 1047948, 1052675, 1009558, 1035934, 1035719, 1045141, 1056436, 1098053, 1131725, 1186421, 1241876, 1255659, 1262970, 1243337, 1207020, 1179584, 1139752, 1147285, 1155592, 1105287, 1096327, 1107777, 1105002, 1089292, 1107492, 1151684, 1168650, 1164511, 1161856, 1213088, 1213791, 1202330, 1187833, 1207729, 1228640, 1222584, 1268393, 1253446, 1290804, 1319231, 1303751, 1294532, 1356224, 1412071, 1399586, 1350657, 1326282, 1304628, 1298724, 1331069, 1332315, 1297148, 1302597, 1331410]
9547A331410k6211J6920j5299j6273l8382K464J7781m794J4332L7620M737k5726
9535A298579j4421K9527K0463n0106q3453p7714k0714j695K5191R239J8059k7933
9523A125022m077n294K1806Q110l370J9116Q196k5158J266j8268L73J0174j6282
9510A121614m0576l4183k5824K3092J5306k7051L207J9889L3168K5779J0822j2645
9498A112598j5553o020J4773m070q889Q786K8080M8712K9151m0736n4807m4460
9486A067565M008j1664k4866K4309L41k4113J3683L3797Q219l9627j3539K6687
9474A064800Q424J1942r202K9443M6925m9405l1850j1155l6587R684j4399k8337
9462I90283k8043J4498J3690J0190Q290j7253r021j7908J7182K5456K0577m2340
$$ y = [1331410, 1305199, 1322119, 1306820, 1290547, 1252165, 1254629, 1272410, 1267616, 1281948, 1319568, 1324305, 1298579, 1284158, 1313685, 1334148, 1284042, 1200589, 1122875, 1102161, 1100466, 1125657, 1134896, 1152955, 1125022, 1120945, 1115651, 1137457, 1145567, 1142197, 1161313, 1169509, 1144351, 1145617, 1127349, 1127722, 1137896, 1121614, 1081038, 1046855, 1021031, 1044123, 1059429, 1032378, 1035585, 1055474, 1088642, 1114421, 1125243, 1112598, 1097045, 1091025, 1105798, 1101728, 1092839, 1101625, 1129705, 1178417, 1207568, 1166832, 1112025, 1067565, 1071573, 1059909, 1035043, 1059352, 1059693, 1035580, 1049263, 1083060, 1091279, 1051652, 1038113, 1064800, 1073224, 1085166, 1075964, 1105407, 1152332, 1102927, 1071077, 1059922, 1023335, 1033019, 1018620, 990283, 962240, 976738, 990428, 1000618, 1008908, 991655, 982634, 964726, 981908, 1007364, 1027941, 985601]
9450I85601k8154R756k243J879j7279P050j7469j135j2865q840k725j3772p627
9437H92177r495m2306k4994K2059K6370l7727Q632j48m9982q165J4069K8360r025
9424H09825l8237p57j3014m957q733l0881o109M1732q983l3154K5415L8497l6392
9411G34252j9987R173L9651K5904L3397K703k5554N8263M6371n964j9929j9169
9399H59111R78O6262L9848N393J335K2346K0513j1126l0052q789J5376J787J3715
9386I96697K1290K1861K8539K9334K1541l7779l1817r956k468J4907K3242K6899
9374A102290L9673p986P0291O902p403L0327O8794M5038P114L031K9635M0089
9362A427795N5730Q3847O9160J02594J27041J17664J68498K20484K28620L39029
$$ y = [985601, 957447, 967203, 964960, 966839, 949560, 956610, 939141, 938006, 925141, 916301, 913576, 899804, 892177, 882682, 840376, 815382, 837441, 863811, 826084, 834716, 834568, 784586, 776421, 790490, 818850, 809825, 771588, 770831, 757817, 752860, 744127, 713246, 707137, 748869, 739886, 706732, 732147, 770644, 734252, 714265, 723438, 763089, 788993, 822390, 825093, 799539, 857802, 904173, 898209, 878280, 859111, 860089, 926351, 966199, 971592, 972927, 995273, 1015786, 1004660, 974608, 965819, 981195, 982982, 996697, 1017987, 1039848, 1068387, 1097721, 1119262, 1081483, 1049666, 1039710, 1037242, 1052149, 1075391, 1102290, 1141963, 1133977, 1204268, 1211170, 1203767, 1234094, 1302888, 1347926, 1355040, 1358071, 1387706, 1427795, 1483525, 1567372, 1636532, 1739126, 1866167, 1983831, 2152329, 2372813, 2601433, 2940462]
9352B940462M08602M89754N75339O99818Q67765J092015J296179J295045J177158
9343A0842137R90798R13844Q94299P49766O06908O27786R41867J511105K255003
9334B0333513L059543L742267M033020L694869K807864J734789P74042p3932n55968
9325C9550007n83848m76551m01820p3119P13698J909124K971039L427878K963539
9316D9999947J677221R9092j413036k495189k845109k434161j233872K59867J390219
9307D3004979J805368J710813J402032J020096L81157m82380j263522j868129
9299D5710414k464999k914165k732477j643444m3813J254714J537228P36609m85243
9290C8954824j675257k631537l271020l637708l652598l120171k405242j792083
$$ y = [2940462, 3349064, 3838818, 4414157, 5113975, 5981740, 7073755, 8369934, 9664979, 10842137, 11832935, 12746779, 13641078, 14390844, 14997752, 15625538, 16567405, 18078510, 20333513, 23393056, 27135323, 31168343, 34863212, 37671076, 39405865, 40179907, 40105975, 39550007, 38966159, 38489608, 38087788, 38014669, 38728367, 40637491, 43608530, 47036408, 49999947, 51677168, 51776260, 50363224, 47868035, 45022926, 42588765, 41354893, 41614760, 43004979, 44810347, 46521160, 47923192, 48943288, 49324445, 48842065, 47578543, 45710414, 43245415, 40331250, 37598773, 35955329, 35911516, 37166230, 38703458, 39440067, 38954824, 37279567, 34648030, 31377010, 27739302, 24086704, 20966533, 18561291, 16769208]
9282A6769208j251007o68030j75737J21129O7683l39009p44452r35193j007341
9273A1837251j069895j105634r89472p36633l08933J21123O23904J162633J710838
9264A1245182K188190K242152J971033J436455R23011M70630O2963j24742K20098
9255B0634972R99138J847531K634756L643800M873817N954274O164353N356485
9247E2109126L883139K094997J40942j616275k687462k280601l82623J966234
9239E3227477L595485L903502L478552K923839K461292J611855L63467j037319
9231G0528150k310675l324832l711927l116163j439260P25190K500855L490813
9223F3342151L577508K722949P87934j656469l967586n076433m504799k823532
$$ y = [16769208, 15518201, 14850171, 14674434, 14795563, 14863246, 14524237, 13779785, 12844592, 11837251, 10767356, 9661722, 8672250, 7935617, 7626684, 7747807, 8371711, 9534344, 11245182, 13433372, 15675524, 17646557, 19083012, 20006023, 20476653, 20539616, 20414874, 20634972, 21634110, 23481641, 26116397, 29760197, 34634014, 40588288, 46752641, 52109126, 55992265, 58087262, 58228204, 56611929, 53924467, 51643866, 51261243, 53227477, 56822962, 60726464, 64205016, 67128855, 69590147, 71202002, 71565469, 70528150, 68217475, 64892643, 61180716, 58064553, 56625293, 57350483, 59851338, 63342151, 66919659, 69642608, 70430542, 68774073, 64806487, 59730054, 55225255, 52401723]
9215E2401723r34160K15785L91277J43123q8739k04226l08893p14915j606449
9206D9294526k894578m314745n251288n271665m471844l195130j962172j079709
9198B0853395n90237o45029j023515j432368j600168j594858j555571j493566
9190A0918083j443998j350051j204406j067378q96417p26876o05711m22760l33922
9181B866564k62701k27603j88616j57826j05800o4611q4404q6675j20381p6123
9171A491824p7571o5864l7618M3700k1082k7212n0537m6263j9478k4298n0717
9160A114884l9094k7032M527j9733m6327J734J2004j0461j5491k1163l4222m5929
9148H73697n1656l7119N0820O5525M6796k5706j1310j7243n2870q4861m8196L836
$$ y = [52401723, 51467563, 51683348, 52074625, 52217748, 52129009, 51924783, 51615890, 50900975, 49294526, 46399948, 42085203, 36833915, 31562250, 27090406, 23895276, 21933104, 20853395, 20263158, 19618129, 18594614, 17162246, 15562078, 13967220, 12411649, 10918083, 9474085, 8124034, 6919628, 5852250, 4955833, 4228957, 3623246, 3200486, 2866564, 2603863, 2376260, 2187644, 2029818, 1924018, 1859407, 1775003, 1688328, 1567947, 1491824, 1414253, 1348389, 1310771, 1354471, 1333389, 1306177, 1255640, 1209377, 1189899, 1165601, 1114884, 1075790, 1048758, 1053285, 1033552, 987225, 988959, 1000963, 990502, 975011, 953848, 919626, 873697, 822041, 784922, 835742, 901267, 948063, 922357, 911047, 893804, 840934, 756073, 707877, 711713]
9136G11713r6j8092K9526L3091j8251j8190l8376k5527J089m154N5508L4584M2136
9123G84961L3595Q475l1461n5475j6791J7755O7534J349k0530N864K1329j2836
9111H03769k0717n8812m2816o4270k9910m3267k1533k7814J002n2977k6078j2464
9099D04113K9342M4161k9202j8316j7587K8559J8761l493N5411J3671n126j5164
9087E05130k92j8936l5359o445J1098k0898m2274K535J1327p459M368L047J1115
9074D16957L7467j728j7909n410j8423M688P511j5422p1026k5390K905K1510J1339
9061C47069j386M4094K6989k4134R296k9829r440P321p192K2373j3887j7910J9544
9048C72908J2686j7660k0223L6309L9915J8841J1510K7514L072o185l4763j3599
$$ y = [711713, 711617, 693525, 723051, 756142, 737891, 719701, 681325, 655798, 656887, 652733, 708241, 742825, 784961, 818556, 827031, 795570, 740095, 723304, 741059, 808593, 809942, 789412, 795276, 816605, 803769, 783052, 724240, 681424, 617154, 587244, 543977, 522444, 494630, 495632, 442655, 416577, 404113, 433455, 477616, 448414, 430098, 412511, 441070, 459831, 456338, 511749, 525420, 520294, 505130, 504838, 485902, 450543, 444098, 455196, 434298, 392024, 394559, 405886, 398427, 402795, 405842, 416957, 454424, 452696, 434787, 429377, 410954, 415642, 423153, 407731, 336705, 311315, 314220, 335730, 347069, 345683, 389777, 416766, 392632, 401928, 372099, 362659, 369980, 362788, 385161, 371274, 353364, 372908, 385594, 367934, 347711, 384020, 423935, 442776, 454286, 481800, 484872, 478687, 443924, 430325]
9036D30325k7984j3452p431k912L9212j175l0405p9894j6733k1734K3534L7063
9024C28414J4009l2608k7804K8204L4560M80k7624K2307L657k7723j0320K1848
9012C27400J2019k1362R435M0341P8630j7336j7092j6830r376J2502L944k2713
9000C79562j4221j469J1962J1017l705k5002l1593Q756K5466J276o771K8767P682
8987C91727K6070j464m9535k7854J4625K3603Q005K1946L8601K6546L9183L592
8975E15045k218n9521k6074O762R659J0539o180K4662L6144q205m333J3715K0220
8962E30215o825R869k1479K6762L8138Q239j6142j1998K3843M1623k2414k2832
8950E76999O205N0923p926k9347k103P390J2353N788K7230M1914J1069j2537L7095
$$ y = [430325, 402341, 388889, 381458, 378546, 417758, 416583, 386178, 306284, 289551, 267817, 291351, 328414, 342423, 309815, 282011, 310215, 344775, 345255, 317631, 339938, 343595, 315872, 305552, 327400, 339419, 318057, 327492, 367833, 446463, 429127, 412035, 395205, 385829, 398331, 402275, 379562, 365341, 363872, 375834, 386851, 383146, 358144, 326551, 335307, 360773, 362049, 355278, 384045, 391727, 417797, 416333, 366798, 338944, 353569, 377172, 385177, 407123, 445724, 472270, 511453, 515045, 512827, 453306, 427232, 433994, 443653, 454192, 448012, 472674, 508818, 500613, 496280, 509995, 530215, 523390, 533259, 511780, 538542, 576680, 584919, 568777, 556779, 580622, 622245, 599831, 576999, 583204, 634127, 626201, 596854, 594751, 602141, 614494, 620282, 647512, 689426, 700495, 687958, 725053]
8937G25053L8242M0195j6140j4005M1729O3993P2192J13104J17146J34674R6577
8926A412760J26148J34211L5524Q6673J55988J87268J92837K27571K23608K49301
8916C031889L05157L40669M96234P29174J064443J464032J891438K348967K874181
8907A4546184L504497M181809M354402L619174J876382m09121k134268k783074
8899B6755985k699626k627638k660264k439847j955254j563560j344727j197521
8891A0267548r63722n76967l07015k84899j74558J20700M23650O89562J010689
8882A0204988J438899J881462K239312K655186L070804L350196L188983K425198
8874C0455028P89499j238540k836495l333280k984452k269309j693434j366387
$$ y = [725053, 763295, 803490, 787350, 773345, 815074, 879067, 951259, 1064363, 1181509, 1316183, 1412760, 1538908, 1673119, 1708643, 1795316, 1951304, 2138572, 2331409, 2558980, 2782588, 3031889, 3337046, 3677715, 4173949, 4903123, 5967566, 7431598, 9323036, 11672003, 14546184, 18050681, 22232490, 26586892, 30206066, 32082448, 31673327, 29539059, 26755985, 24056359, 21428721, 18768457, 16328610, 14373356, 12809796, 11465069, 10267548, 9303826, 8726859, 8419844, 8134945, 7960387, 8081087, 8504737, 9194299, 10204988, 11643887, 13525349, 15764661, 18419847, 21490651, 24840847, 28029830, 30455028, 31244527, 30005987, 27169492, 23836212, 20851760, 18582451, 16889017, 15522630]
8866A5522630j223501j178779j282070j525028j587238j451777j105515p47295
8858E421427l99468j92197j07515r8890k06115k41502j68105m1061J18078K33129
8848D317781M12327N71528P71148R35681P35083J02830K1752M62770R67423J574993
8838A0873316K263779K908241L069981L204187M023069N140263O317257P096222
8830D4896315O959778N596155L291372M85748k223499m031047m477411l634406
8822D6863005j946474k43327P57212M34256q54581k648540m325138m822840m290357
8813B8923216l295993k395746j625634q35341J8699J036017K280841L493582M671689
8804C2271330N665912O281647O427531N954769M835582K736802l21838l146621
$$ y = [15522630, 14299129, 13120350, 11838280, 10313252, 8726014, 7274237, 6168722, 5421427, 5021959, 4829762, 4722247, 4623357, 4417242, 4175740, 4007635, 3966574, 4084652, 4317781, 4730108, 5301636, 6072784, 7008465, 7743548, 7846378, 7868130, 8330900, 9298323, 10873316, 13137095, 16045336, 19115317, 22319504, 26342573, 31482836, 37800093, 44896315, 51856093, 57452248, 60743620, 61229368, 59005869, 54974822, 50497411, 46863005, 44916531, 44673204, 45430416, 45864672, 45010091, 42361551, 38036413, 33213573, 28923216, 25627223, 23231477, 21605843, 20770502, 20789201, 21825218, 24106059, 27599641, 32271330, 37937242, 44218889, 50646420, 56601189, 61436771, 64173573, 63851735, 60705114]
8796F0705114m834836n110065m418164l182648j863667j163556j250175k015564
8788C6866439l137171m112059m525042m148651l334686k432902j808824j558322
8780A1808782j365748j194565r93264p39973m85560k76031j39362o8025q1174
8771F465080j46193j07467l7827M7134J44382K91120O04854R12553J165774J385939
8761A0725349J568039J763631K160761K796584L712799M538156M774437L993588
8753C6033344K301737M30561q86759j103442k90892J086731K531601L436991L345098
8744D6884970K193896K30510k014312l807123m815478n087248m713188l936535
8736B4935492l166925k347350j406029n12518M25397J297497K059063K859472
$$ y = [60705114, 55870278, 50760213, 46342049, 43159401, 41295734, 40132178, 38882003, 36866439, 33729268, 29617209, 25092167, 20943516, 17608830, 15175928, 13367104, 11808782, 10443034, 9248469, 8255205, 7515232, 7029672, 6753641, 6614279, 6546254, 6465080, 6318887, 6211420, 6173593, 6220727, 6365109, 6656229, 7261083, 8173636, 9339410, 10725349, 12293388, 14057019, 16217780, 19014364, 22727163, 27265319, 32039756, 36033344, 38335081, 38765642, 37878883, 36775441, 36484549, 37571280, 40102881, 43539872, 46884970, 49078866, 49309376, 47295064, 43487941, 38672463, 33585215, 28872027, 24935492, 21768567, 19421217, 18015188, 17502670, 17928067, 19225564, 21284627, 24144099]
8728B4144099L597151M264492M500505L933305K257489Q0712j609710k247789
8720C8920254j570572R464J623278K545096K390279J418000k20752k271157m206035
8711C8637855n403340n572910n004218m123690l316916k716671k248853j828529
8703H422728j393114j073730q16142n46276l89670l07108k71614k21866k35325
8694C167883k37722k10433j07652o4439K1185J09334J32204J23375R5929M9208
8684C078872N0424J14027K99612N31792P62282R84258J152904J143326J095505
8675I213002R54585Q50153R20729J177722J614278K026018J937622J003261l91072
8666A9306298j620249k377251k541379k267737j996954j589203j148555p05052
$$ y = [24144099, 27741250, 32005742, 36506247, 40439552, 42697041, 42777753, 41168043, 38920254, 37349682, 37359146, 38982424, 41527520, 43917799, 45335799, 45115047, 42843890, 38637855, 33234515, 27661605, 22657387, 18533697, 15216781, 12500110, 10251257, 8422728, 7029614, 5955884, 5139742, 4593466, 4203796, 3896688, 3625074, 3403208, 3167883, 2930161, 2719728, 2612076, 2547637, 2568822, 2678156, 2810360, 2933735, 3029664, 3078872, 3129296, 3243323, 3542935, 4074727, 4837009, 5821267, 6974171, 8117497, 9213002, 10167587, 11017740, 11938469, 13116191, 14730469, 16756487, 18694109, 19697370, 19306298, 17686049, 15308798, 12767419, 10499682, 8502728, 6913525, 5764970, 5059918]
8658E059918m24173k48163k10086j06060J4778J36250K57490M48043O93171R56702
8648F577870J020184J061567J212484J416469J605533J634818J606931J622317
8640A7758173J373569L95857j131875k437754k932056k704785k176830j728236
8632F416063j380526j037511p92969o15224m41991k77957k15486j33528j23039
8623A397832j62835j34865o8237n1878n7031l4273o437N9938O6467L5335m0637
8612A003379j46289j77739j13419o8257j9019m1829o1421o1100j7146J9154J6426
8601C32740j9435M0298Q4033J28468J61310J23158j9664j02522j12140j30625
8591D85621l9529n3516o6675l0928m7775m0820k239n899R601l933l3167j9166
$$ y = [5059918, 4635745, 4387582, 4177496, 4071436, 4086214, 4222464, 4479954, 4927997, 5621168, 6577870, 7598054, 8659621, 9872105, 11288574, 12894107, 14528925, 16135856, 17758173, 19131742, 19527599, 18395724, 15957970, 13025914, 10321129, 8144299, 6416063, 5035537, 3998026, 3205057, 2589833, 2147842, 1869885, 1654399, 1520871, 1397832, 1234997, 1100132, 1031895, 980017, 922986, 888713, 882276, 942214, 1008681, 1044016, 1003379, 857090, 679351, 565932, 497675, 478656, 436827, 375406, 314306, 297160, 316314, 332740, 313305, 353603, 437636, 566104, 727414, 850572, 830908, 728386, 616246, 485621, 446092, 392576, 325901, 294973, 247198, 206378, 204139, 198240, 207841, 203908, 170741, 151575]
8579A51575J7697M1768K406l6586p926P259J9472L9327Q2625P1756Q4440J34349
8567F08162K27908K33286O8204j53048k07816j47003l6986J6426Q2919J31412
8557H23464J71882J75004K43001L13249K91658K63726K12376l5414k70397l31896
8547A856653k75239k54098k17089j97004j57157o2730L3421Q8791J41608J70428
8537A127584K55293K59942K21207J69682n859j12427j40938k49281k90909k52795
8527I81499k43433j74437j10271r0950k9184k4027K4982K3292O8068P2752p528
8516D90763l6674l0284r1093p9775m8011p383J9795L5604R2242P5503k5590n0261
8504C44836o2445m3145K3731K277K5126M0847K6777O0961M0584L9237J3845J3800
$$ y = [151575, 169272, 211040, 213446, 176860, 168934, 176193, 195665, 234992, 317617, 389373, 473813, 608162, 836070, 1069356, 1137560, 984512, 776696, 629693, 592707, 609133, 692052, 823464, 995346, 1170350, 1413351, 1726600, 2018258, 2281984, 2494360, 2458946, 2188549, 1856653, 1581414, 1327316, 1110227, 913223, 756066, 693336, 726757, 815548, 957156, 1127584, 1382877, 1642819, 1864026, 2033708, 2027849, 1915422, 1774484, 1525203, 1234294, 981499, 738066, 563629, 453358, 362408, 333224, 309197, 334179, 357471, 425539, 498291, 490763, 454089, 423805, 332712, 252937, 204926, 197543, 217338, 252942, 345184, 420687, 395097, 344836, 282391, 239246, 262977, 265254, 290380, 331227, 358004, 418965, 459549, 498786, 512631, 526431]
8492E26431L4984M706p0358j29431q3764k6268k7974l7045j3323r064n8995j1863
8480I8036L3224n864l0281N755M845k8857O313M5366m745N178L9335L1160K956
8467B02421m023l3329p5424l0499J1990K3528q226q14J4889K5003Q037N4799N7370
8454B45722N7374K0294J0228l5150j04811o2948m6596j5289q001m2200Q15R982
8442B9420P063J9667r096J8104L6880J2392q059j3087j8687l5630L957K4659L5452
8429A03035L0735Q677J8782K6843P2323J25110R7442J6624k1851j1730p5336o6160
8417C24494k0169j7438K1696L0904L1103r402l2013j9833n3312m3334j4064L1094
8405B29726M1176J8171J9689J3173n033j4721J3521k0030J0837N5642K7827L1228
$$ y = [526431, 561415, 566121, 495763, 366332, 282568, 256300, 228326, 191281, 177958, 168894, 109899, 98036, 131260, 125396, 95115, 100870, 105715, 76858, 83171, 128537, 123792, 128970, 168305, 199465, 202421, 198398, 165069, 89645, 59146, 71136, 94664, 86438, 85624, 100513, 125516, 133553, 188352, 245722, 303096, 323390, 333618, 298468, 193657, 130709, 84113, 68824, 60823, 18623, 19438, 29420, 36483, 56150, 47054, 65158, 102038, 114430, 106371, 93284, 74597, 38967, 42924, 67583, 103035, 133770, 142447, 161229, 188072, 260395, 385505, 482947, 499571, 477720, 465990, 390654, 324494, 304325, 286887, 308583, 339487, 370590, 361188, 329175, 309342, 256030, 212696, 198632, 229726, 270902, 289073, 308762, 321935, 316902, 302181, 315702, 295672, 306509, 362151, 389978, 421206]
8393D21206K8170j9366p7771m5651o1288l2010l829j9920K339N763m7647m9595
8381A00401l9640j3622J5444j7483j3340M74k5073l646K0772q581k7388M387K8224
8368B0929O7k2868k9911J7567n71L187O0912R386l4548r538L7264p880l3098K4828
8354C5726j228N504q125j469P2673O9388L4547J3538k2087m5298k2379P1373Q7580
8341B89743K9515N911o035j7019m2602m7593l2216l0948m5556k0765K4447Q260
8329A15142L1605L4241j7150O331j7226k9942J1031O5256P6802L6145J3382k9587
8317B96030j5496j4156m9261N538P0811N0796k1954j8619l0731l6913r523l2853
8305A93669m0774k8327n0783j0356l1751j6987k7492R086L8321K8633J1264k0845
$$ y = [421206, 449376, 430010, 352239, 306588, 245300, 213290, 209461, 189541, 191880, 197643, 149996, 100401, 60761, 47139, 62583, 45100, 31760, 32234, 7161, 3515, 24287, 15706, -11682, -7295, 20929, 20996, -1872, -31783, -14216, -14787, -11600, 49312, 58698, 24150, 14612, 51876, 43996, 10898, 35726, 34498, 40002, 31877, 30408, 103081, 172469, 207016, 220554, 198467, 153169, 130790, 202163, 289743, 319258, 325169, 319134, 302115, 259513, 211920, 179704, 148756, 103200, 82435, 106882, 115142, 146747, 180988, 163838, 170169, 152943, 123001, 134032, 199288, 276090, 312235, 325617, 296030, 280534, 266378, 217117, 222655, 293466, 344262, 322308, 303689, 272958, 236045, 226522, 193669, 152895, 124568, 73785, 63429, 31678, 14691, -12801, -3715, 34606, 63239, 74503, 53658]
8293E3658O245R486K2828J8800q094k7901K215j5313l4930j5034L977k6542p429
8280a8034j13l4557K2948L0485K6463m6450N403L4489l7527l8265p772K8482L9013
8267D565P7468P3612Q402j5840j3784m100n9889l3411K9867k2467m9639j6742
8255b1958Q291J4306K4203j4965l0254m226K442L2037K3538k7155l9395j3671
8243d6807M0923J1787K4977J5490M5941J2383Q3J1127l146l8768j2839l454J773
8230E9470l1764m0687j3868J3929M6227m076j6132j1834Q186j49L808K1564Q66
8217C5540M806j237k3585J2919L3633j9846k6925J4359p054J1655j817J6515m1626
8204G337m3205L5492L589J9796j2404k8801j2828q472J940K7987M228m076O826
$$ y = [53658, 59903, 69389, 92217, 111017, 102923, 75022, 77237, 61924, 26994, 11960, 15937, -10605, -18034, -18147, -52704, -29756, 729, 27192, -19258, -13855, 20634, -16893, -55158, -62930, -34448, 4565, 82033, 155645, 164047, 148207, 134423, 130323, 70434, 37023, 66890, 44423, -5216, -21958, -13667, 639, 24842, 9877, -20377, -24603, -22161, 9876, 33414, 6259, -33136, -46807, -5884, 5903, 30880, 46370, 92311, 104694, 104777, 115904, 112758, 73990, 61151, 57697, 59470, 27706, -12981, -26849, -12920, 33307, 29231, 13099, 1265, 9451, 9302, 13110, 34674, 35540, 40346, 39109, 15524, 28443, 62076, 42230, 15305, 29664, 22610, 34265, 32448, 48963, 7337, -35868, -376, 3213, 23009, 10605, -18196, -31024, -39496, -37556, -9569, -5341, -9417, -2591]
8191b591K3762j576k5736j9257k3888j6692L1294L0882k4755j597K2864k8774
8179c6064J3395J2397O273J2145j0160k201j3376j0627o13K0137J2270j8444M567
8166a0301K4378j7980O871n586k2235m5297J8968K7682j8346M293L4402q777k3163
8153c5091K0866O513L6991j4060k069k3768k9828j4773r668o785L0374L1783J9364
8140I849l4225K0714J9049j5646n3809K1017J1778J941J0816J9326P774l7466
8128a8882j1413J3116J0747J2086k6371j7433M3455K1455k2116K9183R276k3640
8116A9463k89j9222K2334J1251P663L2542J2856o7507n3479K485K4397n633j4162
8103b7301L5619Q480P006n03j1318J4233K9736J5661p251j9850N099L2747l0564
$$ y = [-2591, 21171, 19595, -6141, -25398, -49286, -65978, -34684, -3802, -28557, -30154, -7290, -36064, -22669, -10272, -3999, 8146, -2014, -4215, -17591, -28218, -28831, -8694, 3576, -14868, -10301, 14077, -3903, 2968, -2618, -24853, -70150, -51182, -23500, -41846, -37553, -3151, -11928, -35091, -14225, -7712, 29279, 15219, 13150, -10618, -40446, -55219, -64887, -71672, -41298, -9515, 9849, -24376, -3662, 15387, -259, -54068, -33051, -21273, -19332, -8516, 10810, 18584, -18882, -30295, -17179, -6432, 5654, -20717, -38150, 5305, 26760, 4644, 33827, 43103, 19463, 19174, -48, 22286, 33537, 41200, 73742, 86598, 19091, -34388, -31903, -7506, -13139, -27301, 8318, 16798, 23804, 23301, 11983, 26216, 55952, 71613, 64362, 44512, 49611, 82358, 51794]
8090E1794m4374K8233L3368l2109j4433J816j3689m198J4113k9036k1704r625
8078c9844o9j3445j1245K7761N8601M4522k705j4192o898K3410k919j1157o264
8065D5556k6617j8442L4927J5895l4894J7315N946j3692j7871n806k4409k9970
8053e2062M664K4182M7294k3226O54j2260m0709J2996J9575L044o53J1514k6327
8040c1314j3453K7714J685M2766M1199p61K0195n230l5841l9879K04j1602K182
8027b135J0966K6569P223m464O32L5655k6195j5015j0083k7328l7668M998L0520
8014f325O124j865j0419r057M0190M7609j4432j1564p629j1231j1653j0457j273
8001a982o3995J1025j5932J3495L9894J9790L6275j9890k4163k2759l006K7021
$$ y = [51794, 7420, 35653, 69021, 36912, 22479, 24295, 10606, 6408, 20521, -8515, -30219, -39844, -39913, -53358, -64603, -36842, 21759, 66281, 63576, 49384, 42486, 65896, 62977, 51820, 45556, 18939, 497, 35424, 51319, 16425, 33740, 39686, 25994, 8123, 2317, -22092, -52062, -47398, -23216, 24078, 852, 1506, -10754, -51463, -38467, -18892, -15848, -16501, -4987, -31314, -44767, -17053, -15368, 27398, 68597, 67836, 88031, 82801, 46960, 7081, 7285, -4317, -2135, 8831, 35400, 42623, 38159, 38791, 74446, 48251, 33236, 23153, -4175, -41843, -36845, -6325, -201, -2066, -12485, -21542, 18648, 66257, 51825, 40261, 32632, 21401, 9748, -709, -1982, -65977, -54952, -70884, -57389, -17495, 2295, 38570, 18680, -5483, -28242, -31248, -4227]
7989d227K9022J8615j2526K0587J3172l9306n7901K130J9950J1358n918L0042
7977B4998J1770p415R834l2814j9130M0193J3787j8937p454m0132M3915K4090
7965D2705j4038n432J6537l376l495K9161k216j8901j3742M916m086l9481Q962
7952b486J1100L7637J70n2847j7348L9780K9870L1301j0823k1455R780J1301K402
7939F8382m4165m0095K101J7761P550N1766L6252j8873k8072J476j5526n2092
7927a3535l9871k6327K6486L9250M648J1624J1937q837l9866j8839J3266O3580
7915B3516J1163j5143m2971j190J0694O534l4275o819j2740K7982N7652L6210
7903F0613L0602R682l6062j976K9701j081j0198l4696k2016L5381q851o520K6155
$$ y = [-4227, 24795, 43410, 30884, 51471, 64643, 25337, -32564, -30434, -10484, 874, -5044, 24998, 36768, 29353, 39187, 6373, -12757, 27436, 41223, 22286, 14832, -25300, 18615, 42705, 28667, 23235, 39772, 36396, 32901, 62062, 59846, 40945, 27203, 32119, 28033, -11448, -2486, 8614, 46251, 46421, -6426, -23774, 16006, 45876, 77177, 66354, 44899, 54679, 65980, 68382, 24217, -15878, -13777, 3984, 11534, 63300, 99552, 80679, 52607, 54083, 38557, -13535, -53406, -79733, -53247, -13997, -9349, 2275, 14212, 5375, -34491, -53330, -40064, 23516, 34679, 19536, -23435, -24625, -13931, -7397, -41672, -48491, -61231, -33249, 24403, 60613, 91215, 100897, 64835, 62859, 92560, 91479, 81281, 46585, 24569, 59950, 51099, 44579, 70734]
7890G0734m2134M1247L3788k0669k2392O243k614m8073k1717q241J9926j6096
7878i998j0482k1996J3511K7515Q056j0040J802J5914k0114J7488r499N676K3693
7865C1526K3426j982k3072j342m4556m969j340q533M4257n938o54k0110j1849
7852b5136j0401Q53L6840l2285o8735K0127K5006L8097o214m6425j7241O2090
7840b3424q780k7083j6920J3660j3700K2462M2851n2L786j2417n284p181K3172
7827h910j2824j2696R344p731L5496K0979r290k7668L3125N92j0772k8069o4383
7814h2807J2419M5319L4214K5724p611o9162j918K2047k6479j0047M1061J5816
7802a424r385M246M2218j8204n8067m4800J4746K2859J5823N220k9907J6282N525
$$ y = [70734, 28600, 69847, 103635, 82966, 60574, 66817, 64203, 16130, -5587, -13828, 6098, -9998, -20480, -42476, -28965, -1450, 6606, -3434, -1632, 14282, -5832, 11656, 2157, 7833, 31526, 54952, 52970, 29898, 28556, -16000, -20969, -22309, -30842, 13415, 7477, 6823, -13287, -25136, -35537, -34684, 2156, -30129, -98864, -78737, -53731, -15634, -21848, -68273, -85514, -23424, -32204, -59287, -76207, -62547, -76247, -53785, -10934, -10986, -7200, -19617, -24901, -32082, -8910, -21734, -34430, -25086, -32817, 2679, 23658, 14368, -13300, 19825, 20417, 9645, -18424, -82807, -70388, -25069, 9145, 34869, 27258, -41904, -43822, -21775, -48254, -58301, -17240, -1424, -10809, -6563, 35655, 17451, -40616, -85416, -70670, -47811, -31988, -26768, -56675, -40393, -34868]
7789c4868m9310k9598r340J5780K5643J9931j0882k443O5156M6485L6307l3239
7777C9622m2332r626K1914M641j17m631K5988k3859m5939M813L3441J0025k0614
7764f674L4183p355l902k8372R659R313K4483N432q598l2652J319k0265r228Q599
7750b4058L7123J1333J0473O795M460j0400K4692j6765m7044k6565M1387J3628
7738B5059k7768l0201P020Q481J1852o216k2453l3763L2574N0600L962J67O509
7725B5823J6630J5686m6923m3506k2278N116j0634K7172L4441M15k2126K4466
7713D282j4354j0018N570K3168m411N179k5569J337R00l4794m2370J9925N167
7700f5988J217K7547L4635K8381m6959o606j731o367j5708K0419Q088L800K5514
$$ y = [-34868, -84178, -113776, -123116, -107336, -81693, -61762, -72644, -75087, -9931, 36554, 72861, 39622, -2710, -12336, 9578, 14219, 14102, 9471, 35459, 11600, -34339, -29526, 3915, 13940, -6674, 27509, 20154, 16252, -12120, -2461, 6852, 31335, 36767, 28169, -4483, -3164, -23429, -32657, -24058, 13065, 24398, 34871, 41666, 46126, 35726, 60418, 43653, -3391, -29956, 11431, 25059, -2709, -32910, -25890, -17409, -5557, -11773, -34226, -67989, -35415, 15185, 19147, 19314, 25823, 42453, 58139, 11216, -32290, -54568, -49452, -60086, -32914, 1527, 1942, -20184, 4282, -10072, -20090, -14520, 8648, 4237, 9416, -16153, -14816, -13916, -48710, -91080, -71155, -65988, -64771, -37224, -2589, 25792, -21167, -27773, -29504, -35871, -51579, -31160, -23072, -19272, 6242]
7687F242j4843r880K0923L000j7068k018J6513j2102j043j9825j4199P639k908
7674c9569Q364J4647N046n4733p398J3707Q119n991J8809P843j2054j3564M370
7661e2404K4358k4028j114R847L5540Q764j0034l1592J4089j3520J4537J3047
7649a2510m081n3339j5049J9890R447J6450J3921K9026K732j364O402K5492j3980
7636B3037j7707l558k0490J874J3420j6307p524K0744O116J1905l4386q00J6538
7623g138m086K3299j3723k7567k0946Q8483J5539k0805l1081l7137J0513L3822
7611I173K5780Q08N26L0147K6061K8194p3233n8187J1406p580j8276j1357j1680
7598d8218k951J54j3773K8341O4677L8775j4842j722m8926k2297J9127K4472m230
$$ y = [6242, -8601, -18481, 2442, 5442, -11626, -13644, 2869, -9233, -10276, -30101, -44300, -36661, -39569, -31205, -16558, -11512, -66245, -73643, -59936, -51817, -57808, -38999, -31156, -43210, -56774, -52404, -28046, -52074, -53188, -43341, -7801, 963, -9071, -40663, -26574, -40094, -25557, -12510, -16591, -69930, -84979, -65089, -55642, -39192, -25271, 3755, 6487, 5123, 11525, 37017, 23037, 5330, 1772, -18718, -16844, -3424, -19731, -27255, -6511, -395, 11510, -22876, -23676, -7138, -11224, 12075, -1648, -29215, -50161, 38322, 53861, 33056, 1975, -35162, -24649, 9173, 34953, 35761, 36287, 66434, 92495, 120689, 47456, -10731, 675, -6905, -25181, -36538, -48218, -51169, -51015, -64788, -36447, 28230, 67005, 52163, 50441, 1515, -20782, -1655, 22817, 18587]
7585A8587m5473n0925K8168K6982j310P242O422l9594L842J5472j383J3924J8114
7572F8r106J3450j1447j1347K6492k5240J7602J6530K2830Q132k4957R414L225
7559C5646K5765o0893m0400J8502o93K5848K6992j6113m3257j315m075N176k5908
7546e4725k6605J917J7136M6084j2540k6157J2130J5899R037r331j5603P752K7508
7533g498K5015J063M1636L320m2682k4738k3877l789m725J4546q143k3583M0895
7520a2560J00J0447k295l5295K905L1556J7540k3675K220M2700K9835k9497l5913
7507a932k7636K2233J0716l6014k3311R223L8961j5701j4926M7839K1481K090
7495C3023k6347j2104m16L9967n257j3599j3124j7852l2439j1860K4006L6749
$$ y = [18587, -26886, -77811, -49643, -22661, -23971, -16729, -10307, -49901, -46059, -30587, -31970, -18046, 68, -9038, 4412, -7035, -18382, 8110, -17130, 472, 17002, 39832, 47964, 23007, 32421, 35646, 61411, 518, -39882, -21380, -22073, 3775, 30767, 14654, -28603, -29918, -33993, -28817, -54725, -81330, -79413, -62277, -16193, -28733, -54890, -42760, -26861, -17824, -27155, -42758, -35006, -7498, 17517, 18580, 60216, 63536, 20854, -3884, -27761, -31550, -36275, -21729, -29872, -53455, -12560, -12460, -2013, -4308, -39603, -36698, -5142, 12398, -11277, -9057, 33643, 63478, 33981, -1932, -29568, -7335, 3381, -32633, -55944, -46721, -7760, -23461, -38387, 9452, 30933, 33023, 6676, -5428, -5844, 34123, 28866, 15267, 2143, -15709, -48148, -60008, -36002, 747]
7483G47J695m6753J6161K5220K4475q224k2677j1764K043p499J5625l3123l2794
7470g6868J9505K3354K267J2850K402K6835J1703m019j1013j1850m1325j910k3050
7457g1119L1320L6288P756j7909j6240K4582J2463j971K9719k668J0521p517l2919
7444B306m3496J0037K9520J6188j5591K2550K4548j6459n4431J6718L5797N254
7432C2941M9K1394m63k4593J7667r387J5793O647k8928q872J361m7631l4520K4359
7418c4183J1445K7439M2181l7273j7459j1642o117K3038K704J8817K5866k899
7406D1917J2414j543l8214N94m4671r802N090p07j7097j8245L3928r550K9963
7393a5923L8115k1492j0404O618N701k2347r97K0895O581N019K0577l0440l9560
$$ y = [747, 2442, -44311, -28150, -2930, 21545, 13321, -9356, -21120, -19077, -26576, -10951, -44074, -76868, -57363, -34009, -31742, -18892, -16490, 10345, 22048, 18029, 7016, -4834, -46159, -48069, -71119, -39799, -3511, 4245, -13664, -29904, -5322, 7141, 5170, 34889, 32221, 42742, 35225, 2306, -41190, -31153, -1633, 14555, -1036, 21514, 46062, 29603, -24828, -8110, 27687, 32941, 32990, 54384, 53921, 29328, 46995, 37608, 53401, 60048, 31120, 22248, 23609, -24022, -58542, -34183, -22738, 4701, 46882, 9609, -7850, -19492, -25609, -2571, 133, 18950, 44816, 41917, 54331, 52788, 14574, 15168, -29503, -39305, -34215, -34922, -52019, -70264, -36336, -45886, -15923, 22192, 700, -9704, -3086, 2615, -19732, -20729, 166, 6747, 11766, 32343, 1903, -37657]
7380c7657q341L0949j824j2652J4027J819K536n487M4406N352k0549l5859J2205
7367a1075r195j1309M6643N350k5281K1544l594l6301J1947K5000l054k6145n0412
7354f5882L1439P2999j2480q757Q353j3400n0750l5031J2368K6680J0996J1162
7342a2303P160J7383O258n853K4774K0266k5726m6526n9059k2319m550j733K5518
7329g6710L6775L1311q927N4597K6663j727J1182m6513m8968l0920J9621O7466
7317C3850m76R200j4620K947m692j57k5279K921K8236j6469l8893J1080K0296
7304G944k1695J6578K6511j5265N140L7261J5509o353k831l8147k6397R38J7551
7291A6744J6822k5054J4397M6320k5015n6663J7833N3124Q920l7239J2065L2511
$$ y = [-37657, -45998, -15049, -16873, -29525, -15498, -13679, -11143, -16630, 27776, 33128, 12579, -23280, -11075, -20270, -31579, 15064, 20414, -4867, 16677, 13083, -23218, -11271, 13729, 10675, -15470, -65882, -34443, 38556, 26076, 17319, 25672, 12272, -38478, -73509, -61141, -34461, -23465, -12303, -5143, 12240, 18498, 12645, 37419, 57685, 31959, -14567, -73626, -95945, -100495, -102228, -76710, -39935, -8624, -17551, 37046, 63709, 61982, 73164, 26651, -22317, -53237, -33616, 33850, 33374, 42574, 27954, 30901, 26209, 26052, 773, 3694, 31930, 15461, -23432, -12352, 7944, -13751, 2827, 29338, 14073, 19213, 56474, 71983, 65630, 62799, 24652, -1745, -807, 16744, 33566, 8512, 22909, 69229, 44214, -12449, 5384, 58508, 67428, 30189, 42254, 74765]
7279G4765m5754k3708j6202J7926L1089K9095n3026m4939L8629J7468o717r657
7267H969J5434m966j2117K2971M892K5057J0192l6669k5314O062K3821K4572k7753
7254C5151k4328K0772N316m2850k0735m5748k4005o137J3092J8442j5479o250
7242i2759k423J8144K801K7382J1362K2935Q658j2572l846r773k3109L3930m83
7229a9753j1936J0912L7848k5274j5176K3883J2869l585p374K5447K0938K0574
7217F9373k1841m1909J8078K9063l2761l4851K236J3247j8711k178j3492q644
7205d2390Q793J5115l1843M7690N9621k8246m1309m471M7515j9857o357J009J3819
7192A9089M1388O975m6888l5755l6328K0582J8978k3812j0846J6935J2215R472
$$ y = [74765, 29011, 5303, -10899, 7027, 38116, 67211, 14185, -30754, 7875, 25343, 18626, 8969, 24403, 19437, 7320, 30291, 35183, 60240, 70432, 33763, 8449, 14511, 38332, 62904, 35151, 10823, 31595, 36911, -5939, -26674, -72422, -96427, -102564, -89472, -71030, -86509, -92759, -95182, -77038, -74237, -46855, -35493, -12558, -3900, -16472, -20318, -30091, -53200, -19270, -19753, -31689, -20777, 17071, -8203, -23379, 504, 13373, 9788, 2414, 27861, 48799, 69373, 47532, 5623, 23701, 52764, 20003, -14848, -12612, 635, -18076, -20254, -33746, -42390, -33597, -18482, -50325, -2635, 56986, 28740, -12569, -17040, 30475, 10618, 4261, 5270, 19089, 60477, 67452, 20564, -15191, -51519, -30937, -11959, -35771, -46617, -29682, -17467, -7995]
7180g995J2435J6138k5750J2842J5299j8011O69r054j8799J2174K4668J5846K595
7167C3057K0439m150k2174j0030L6232J1385p633j7566j3781P87k6368j3890o9815
7154h3507j0909K3377N6072J0811l4802J6579K1662n582j2937n4044L3153O6226
7142B6099J9874j9150k512l218l7026l5248J7637J608j6045K29M4553N3152m1672
7129H281n0722j3800J2614K907k569Q866o79k0398P343L4178l872M826P668l0730
7115c6087k8167R800K6206L5108O800k0515k6823j613J2956j141k2898J5042M4819
7102A3487n895j674R74l1237L018N721j2709M1099K06k4515l1395R130M780J768
7088b7242L271M9516K1171l769k53k4567k4785J4170J0425K328j8408O709J1779
$$ y = [-7995, 4440, 20578, -5172, 7670, 22969, 4958, 5627, -3427, -22226, -10052, 14616, 30462, 33057, 53496, 49346, 27172, 17142, 53374, 64759, 57126, 39560, 25779, 26566, 198, -13692, -83507, -94416, -71039, -14967, -4156, -38958, -22379, -717, -6299, -19236, -73280, -40127, 26099, 45973, 26823, 24311, 21093, -15933, -51181, -33544, -31936, -47981, -47752, -3199, 49953, 8281, -42441, -56241, -43627, -40720, -43289, -34423, -35102, -55500, -48157, -13979, -17851, -13025, -5357, -36087, -64254, -54454, -28248, 6860, 13660, -6855, -33678, -35291, -22335, -23476, -46374, -31332, 13487, 7592, 5918, 6892, -24345, -21327, -15606, -28315, 12784, 12990, -11525, -42920, -33790, -29010, -27242, -23971, 25545, 46716, 42947, 42694, 18127, -6658, 7512, 17937, 20265, 1857, 8566, 20345]
7075B0345k843k1962J2911P326J5905J2664q199k0413j8688j1137l2657j5686
7063f2434n762J7469J8218j9398j0537J1961M856K4692K6293K6947m451l1227
7051c373k9910R74K6557J2435J4609k6543K107M084j2180R716P1950J0636o145
7038G4917n0424k5993J1620m107j0502j2621O537L5230Q686l1767L2320n873j6648
7025A1375j1306K8191l304k3461j3264L2712l171k7896P470J0161k451K8530o222
7012B7364l40M639l4573k2688M3224P967j0779J6072j8403q447M010K7255J8132
6999E3433m123j9447Q427j2369k8867m702J3304j9074J4921K6545K613m1823l8488
6986d9650J1592K0791J2970M589l5274L0387J9792k6001k280J1535J4352k7958
$$ y = [20345, 17502, -4460, 8451, 15777, 31682, 44346, 36147, 15734, -2954, -14091, -46748, -62434, -68196, -50727, -32509, -51907, -62444, -50483, -45627, -20935, 5358, 32305, 27854, -3373, -33283, -32309, -5752, 6683, 21292, -5251, -3144, 940, -11240, -1524, 70426, 81062, 74917, 24493, -1500, 10120, 6013, -4489, -17110, -10573, 24657, 33343, 1576, 33896, 28023, 11375, 69, 28260, 24956, 1495, -11769, 20943, 17772, -10124, -2654, 7507, 5056, 33586, 27364, 27024, 31663, -2910, -25598, 17626, 25593, 14814, 30886, 12483, 4036, 8046, 35301, 53433, 49310, 29863, 38290, 25921, -2946, -7648, 5656, -13418, 1503, 28048, 30661, -11162, -49650, -38058, -17267, -4297, 292, -34982, -4595, 15197, -10804, -13084, -1549, 12803, -15155]
6974a5155J7013j0964k5306j1683J805j529L2367J3477l3373N206Q510K3672j19
6961C921N259k9750l1835L8582N5585k1709k9377J4321p589r698n260K7472L5472
6948D5394K7788L952l903j8104J4315l1311k5474M0739j4627k3762j4121r881
6936h995K702L79J5314k0401l9024l581J094J2563o377Q433M7389J0989K81J8451
6922C9217J5676J6193P432k6680l1709l12J0017J288q645R811O34k0119P868l2053
6908a1382j0946j9218J5172M6048K5686j3082j3120O345O676r238j9098j7852
6896a4009m1242l0380j387M1014L7522J2264N8294N485k468k9474j1682N541J9284
6883D8762p628J2534k6396j9580l5427J726j6543K6597K9621j3582K5309j1873
$$ y = [-15155, 1858, -9106, -34412, -46095, -44290, -45819, -13452, 25, -33348, -28142, -19632, 4040, 3921, 9180, -20570, -52405, -13823, 41762, 20053, -9324, 4997, -2592, -12290, -17550, 9922, 45394, 73182, 77134, 73231, 55127, 69442, 38131, 12657, 53396, 38769, 15007, 886, -8995, -6293, -5914, 9400, -11001, -50025, -53606, -52512, -39949, -46326, -37893, 9496, 20485, 20766, 39217, 54893, 71086, 78518, 51838, 20129, 19817, 29834, 31122, 22477, 32288, 32922, 12803, 20671, -11382, -22328, -41546, -26374, 19674, 45360, 32278, 19158, 25503, 32179, 22941, 3843, -14009, -55251, -85631, -87018, -46004, -8482, 3782, 62076, 67561, 65093, 35619, 23937, 29478, 48762, 41134, 53668, 27272, 7692, -27735, -26009, -42552, -15955, 13666, 84, 25393, 13520]
6871A3520j6213o975M6824J5812j0193k9858r796J2928o125o828J1932J1999O750
6858C3777j347l725l5766j1586J6145l7815k5380m1117n809L3799M5029J0848
6846b2947M2331K109j1360j0799l1825n6985k1325K6135M0745K8755r865J1695
6834a3336R30J697J9269j0258l83J2245K6004j0797q739l1289m5332J9036N3630
6821A2677R660L867P320J281l4994Q860K7045K570O165j6888o681k176l2441l253
6807a6988J3035j7357J8594K0391n9505j8823J506k787Q083K1768P797K7686L1870
6794C5270k9220m6283j8257L0399K4091J6364J480j4645k5552P401J996L7665
6782B0709L1531n691m579k9540p399j590k2014n717O251k1262J9312m4852r188
$$ y = [13520, -2693, -9668, 37156, 52968, 42775, 12917, 3121, 16049, 9924, 3096, 15028, 27027, 33777, 32430, 28705, -7061, -18647, -2502, -40317, -65697, -106814, -112623, -78824, -33795, -22947, 19384, 21493, 10133, -666, -32491, -89476, -110801, -84666, -43921, -15166, -25031, -13336, -12406, -10709, 8560, -1698, -2081, 10164, 36168, 25371, 16632, -14657, -59989, -40953, 12677, 22337, 26204, 33524, 34805, -189, 8671, 35716, 38286, 44451, 27563, 20882, 18706, -13735, -16988, -3953, -21310, -2716, 17675, -41830, -60653, -59147, -61934, -53851, -32083, -24286, 3400, 35270, 6050, -40233, -58490, -28091, -4000, 12364, 13844, -801, -26353, -18952, -16956, 20709, 52240, 46549, 41970, 12430, 5031, 3441, -18573, -24290, -18039, -39301, -19989, -64841, -74029]
6769g4029K3419J5570P124J5903J8755M476L0121J6003R479P811m733O483l1661
6756D4721l6338p042l0763l1218J0278M9358L4339l0199j636n105l0686p387J3413
6743b8265L1472K7720j5583l09L2061j3637m6572l397k181o103K766j9036J3364
6730b7700K4555p580r138j0863M66K69L3680J2266J7902J5307r957o806m4668
6717a2267q313q846J7575m625J1741K5441j4399K0531K7533j723k4812j2750j1796
6704C290j1385J7247k816k4704r109k2967L9961M2771L5021m667j0269n667j2498
6691C4208k5805j7449q571K6576j0273j7579Q724k041o974p666k1645K4596N549
6678a8350j9230n80R725J6526L3531J2305j600k89J3167N358O544m4729k6427
$$ y = [-74029, -50610, -35040, -27916, -12013, 6742, 11218, 41339, 57342, 66821, 74632, 69899, 76382, 44721, 8383, 1341, -29422, -60640, -50362, -1004, 33335, 3136, 1500, -3605, -34291, -41678, -28265, 3207, 30927, 15344, 15035, 47096, 33459, -13113, -16510, -18691, -24794, -22028, -41064, -27700, -3145, -10725, -19863, -30726, -30260, -29991, 3689, 15955, 33857, 49164, 39207, 32401, -12267, -20580, -29426, -11851, -16476, -4735, 20706, 6307, 26838, 54371, 52648, 27836, 15086, 3290, -8095, 9152, 6336, -18368, -27477, -50444, -10483, 32288, 67309, 62642, 52373, 46706, 34208, 8403, -9046, -17617, 8959, -1314, -18893, -10169, -12210, -19184, -26850, -48495, -23899, -18350, -37580, -38160, -28435, -11909, 21622, 33927, 32327, 32038, 45205, 50563, 57107, 12378, -14049]
6665a4049N137n176j4534K5474m966l3226L9245J7278P214j9793m60N049l45q422
6651a574J1501K160j1002N021l0240k1681P51j9207j7185J1653k021M470M0591
6638b6763J0956J1145K4981P541J049L4722j4595l7597J3421O759L0841J4208
6626G6668j2489K280Q851j2792j833l7588k3061j5985K6738K0329k1620o120k5293
6613b1915J4855J0228j3114K2354L0722k9308n2507K5279K6307p534k281K2140
6601B5226r068j9545j8333r439j6710m70M7822L0397j5421k1131r48K2470M5244
6588F0094K1579m1553m4921k0368k0759j421K4893L8957K1383l1108k5992k9073
6576d8289J7710m855k73M8172j1042J5359K001j1226j5753l9241J3572K7471j2403
$$ y = [-14049, -8912, -14088, -28622, -3148, -8114, -41340, -2095, 15183, 22397, 2604, 2144, 7193, 6848, -1574, 9927, 12087, 1085, 6106, -24134, -45815, -45064, -64271, -81456, -69803, -71824, -67354, -26763, -15807, -4662, 20319, 27860, 28909, 63631, 49036, 11439, 24860, 31619, 62460, 76668, 64179, 66459, 75310, 62518, 60685, 23097, 36, -15949, 10789, 31118, 9498, 3378, -21915, -7060, 3168, -9946, 12408, 43130, 13822, -38685, -13406, 12901, 5367, 3086, 25226, 16158, -3387, -21720, -31159, -47869, -48339, -517, 29880, 14459, -6672, -7620, 14850, 60094, 81673, 40120, -4801, -25169, -45928, -47349, -22456, 16501, 37884, 6776, -19216, -48289, -30579, -35434, -35707, 12465, 1423, 16782, 18783, 7557, -8196, -47437, -33865, -6394, -18797]
6563a8797J7081M8762l233l3002m1117K6356j2063q269l629J8573N0939n9914
6551a8313l2276n523j1140K5745K27k4087k0041j1921K8477M5320J5208k1965
6539c0289j3968l0501m942L3540L7175L4563r72j6085j944m334L0463J2748m8702
6526c248j0821j607J4132k408l5149M355j498J3231K5421m0137k8092L3595l381
6513c5607n690l0588N996K4181J4794l232P41r541j0289n086J5742o31P290j1978
6499d3898N975K113O360M3225m768j7016j4574P204q117J2897r63P348j0737R720
6485e231J8512j0273Q965L116k9257K3689M3986P155k0123m569l2446k0935L432
6472a3979P3630J7105N731L624j1289m7244Q647K816J2258J6452k4952j4609n0887
$$ y = [-18797, -1716, 47046, 43813, 10811, -30306, -3950, -16013, -24282, -27911, -9338, 41601, -18313, -50589, -56112, -67252, -41507, -41280, -65367, -85408, -97329, -68852, -23532, -8324, -30289, -44257, -74758, -79700, -46160, -8985, 25578, 24606, 8521, 6577, 2243, 32706, 45454, -3248, -14069, -15676, -1544, -3952, -39101, -34746, -36244, -23013, 2408, -37729, -65821, -32226, -35607, -41297, -71885, -65889, -41708, -26914, -30146, -29405, -38946, -49235, -54321, -38579, -39210, -31920, -43898, -37923, -35810, -29450, 13775, 9007, -8009, -22583, -15379, -23496, -10599, -11562, -4214, -14951, -5231, 13281, 3008, 11973, 15089, -14168, 9521, 53507, 60662, 40539, 35970, 3524, -17411, -13979, 59651, 76756, 82487, 86111, 74822, 27578, 36225, 39041, 51299, 67751, 42799, 28190, -22697]
6459b2697j6959M4156M674k4959J1531J2768L3019k1130l1282n210j3338l2054
6447f1481J5041j489n983k0107p725q466L2922J9019p775M5109K3589J5949J316
6434C9919k8375m2225K863l792L3849K3345O026K11n461j0294j0491m6094j1430
6421e1949J1334L9205L6210K5424l6878j8632K4992J1983k5734P420R547J0847
6409D3769j7913k4322k351l5943j4080J8035L5994K0030j8731n151K5522M482
6397B9341j1414m780k0529J6442N6367l3588m1800J8509M9738j2491k3971j7903
6385C921k1101j4384j0857L0118L1624J8507k6804j4034j9049q961k3071J3137
6373d0954l623J0073J6955l3220l676K2917N7214r65l3193j775J7644m8915k8510
$$ y = [-22697, -39656, 4500, 9174, -15785, -4254, 8514, 41533, 20403, -10879, -16089, -29427, -61481, -46440, -47929, -53912, -74019, -81744, -90210, -57288, -38269, -46044, -935, 22654, 38603, 39919, 11544, -30681, -27818, -31610, 2239, 25584, 31610, 31821, 26360, 16066, 5575, -40519, -51949, -40615, -1410, 34800, 60224, 23346, 4714, 29706, 41689, 15955, 23375, 32922, 43769, 25856, 1534, -817, -36760, -50840, -32805, 3189, 23219, 4488, -663, 24859, 29341, 17927, 13147, -7382, 9060, 65427, 31839, -9961, 8548, 58286, 45795, 21824, 3921, -17180, -31564, -42421, -12303, 19321, 37828, 11024, -3010, -22059, -31020, -54091, -40954, -44577, -34504, -17549, -50769, -54445, -31528, 25686, 24721, -8472, -10247, 7397, -41518, -70028]
6360g0028M9043l141k9922k6399j388L5782K9559o783J0021M291j5168k7236J9839
6347c1530J7269L9858Q787M206L935k2647n6880L0792N7187m503n461j1101m2208
6334a2296m8427m087L1297K9084Q232l2074q53M8732K5896O268P379k0733m962
6321C3456j7876n524m0994n099o565R04K3840k5959l0986J0510K7346K3681J1921
6308a345k5855l5826n014L2302K0851m455K2710R735K5551K3595P273l2461j4703
6295B2358o43M5299m1458k1192J2261r775L3619L1571l1287R800J7040m409J3267
6282G6451j079k4332l8907l8102n580p91O840M9585L1234l3899l3904J7331L016
6269G863P434J9565m610o3136J3204M1589m7591j1957P90J8788M2987K818K800
$$ y = [-70028, -20985, -24126, -54048, -80447, -81835, -46053, -16494, -23277, -13256, -8965, -24133, -51369, -31530, -14261, 25597, 34384, 38590, 42525, 19878, -37002, -6210, 50977, 46474, 41013, 29912, -12296, -60723, -64810, -33513, -4429, 3803, -28271, -29124, 19608, 45504, 51772, 59151, 38418, 33456, 15580, 10056, -30938, -36037, -42602, -41698, -17858, -43817, -74803, -64293, -36947, -13266, -1345, -27200, -63026, -68040, -35738, -14887, -19342, 3368, 13103, 38654, 62249, 69522, 37061, 22358, 21715, 67014, 25556, 4364, 16625, 6850, 40469, 72040, 40753, 50553, 67593, 63184, 76451, 75372, 51040, 12133, -25969, -31549, -32340, -25500, 24085, 55319, 21420, -12484, 4847, 7863, 15297, 34862, 30252, -32884, -19680, 21909, -25682, -37639, -36849, -18061, 24926, 27744, 30544]
6256C0544k4691k9762Q612L6191K3106m0862k0432J7973J8165N279m786j6662
6244B675J3821l719l4116P043O2705L357k1580m7624n380L4024k948k300J6445
6231B2403n654J1456m050m8169j9288K879K3014k010n2829p752J1791j521K3287
6218d6443M251j9650L8523J7078J59N458J290J8879j1174p399o8382o560J8984
6205e4986K9502j2703j2646p373k4591J8044L3707m554r763J4129K8230N239j3914
6192a1679j0924J9817j2296J1032O1314j2245j0894N369L2350J652m8604L972
6180B8864J0883l0039j5031L5197K3507L352J0881j9068m820j513J3485j0432
6168D5266M054k3859k4979j4274M664M880P1L095L5825K4320k0754k4839l0597
$$ y = [30544, 5853, -23909, -15297, 20894, 44000, 3138, -17294, 679, 18844, 24123, 19337, 2675, 16496, 12777, -21339, -14296, 48409, 51766, 30186, -17438, -22818, 11206, 8258, 5958, 22403, 16749, 28205, 24155, -24014, -43302, -40423, -17409, -19419, -72248, -80000, -68209, -69730, -46443, -42192, -61842, -23319, -6241, -6082, -624, 666, 19545, 8371, 972, -67410, -73970, -54986, -25484, -38187, -50833, -58206, -82797, -64753, -31046, -35600, -45363, -31234, -3004, 2235, -11679, -22603, -2786, -15082, -4050, 57264, 45019, 34125, 39494, 71844, 73496, 24892, 28864, 39747, 9708, -5323, 29874, 53381, 56733, 67614, 48546, 43726, 42213, 55698, 45266, 49320, 25461, 482, -13792, -9128, -4248, -4177, -1082, 34743, 59063, 38309, 13470, -17127]
6155a7127j6219R297m640J2563O256K3548j0439j5938J925L9971k503l0790p271
6142a1367k8068j885r71J7216L0363R249k3831J2410N3150P320l1228k7218N623
6129A0763k5937L141l9311j3107K2472k0074J4625J4653M567p270k5989K1242
6117d0225J1005P092J7787J5225j5068j4875P048K3245J7509j3394k3981K1663
6105A3031K6879p128l7673j3811k5656m955J8890L6293R171K7354L9987j2285
6093G0097j2442j6254J3078n609k2146O95J6399l8462l6835P360q599M7708K2938
6080C7928J1957P443j5900n146J4977r256l8448Q082k7309L646j5155R86J0699
6067a5496J8228O691m199q577R05n360j7458q918J3017M1463J0151N388m6639
$$ y = [-17127, -33346, -24049, -28689, -16126, -9870, 13678, 3239, -12699, -10774, 29197, 26694, -4096, -11367, -39435, -41320, -42291, -25075, 5288, 14537, -9294, 3116, 56266, 63586, 32358, 5140, 10763, -15174, -12033, -51344, -64451, -41979, -62053, -47428, -32775, -28208, -35478, -61467, -40225, -29220, -22128, -4341, 10884, -4184, -19059, -12011, 11234, 28743, 15349, -8632, 13031, 39910, 32782, -4891, -18702, -44358, -49313, -30423, 5870, 15041, 42395, 82382, 70097, 57655, 41401, 54479, 48870, 26724, 27419, 43818, 5356, -31479, -24119, -32718, 14990, 37928, 49885, 57328, 41428, 36282, 51259, 42003, 3555, 11637, -15672, -12026, -27181, -26195, -15496, 2732, 9423, 5224, -3353, -2448, -7808, -25266, -34184, -21167, 20296, 30447, 35835, -10804]
6054a0804j9738j9224q948M6734N3600K7475J0590J5702k0268l6495o712l5986
6042d074k1685J6546j3867l6105L255M4666K7157m9518q575M5762L4098K804j2738
6029B7726l4657R446j3415j6020r190L879J1955K0487J096j0621q690J7736K3577
6016B3309L9087k3127k2715p451k2791J4407q31j2292J9296k547p255k1893N945
6003a8858q28J3492o787k3852j8431K5744n99j4985K7475K433k5367N448m2908
5990g8023k2546L6088J4570N5749N901k6926l7730K8845M5542k0379J2450k0721
5978g180j8400k6879J4762J6322k9455J0351J3284J0654Q539L4910q944n334J9079
5965C1709j1332l689k4754Q642k1072K037J6557K9425q184j941j2482J4058j4848
$$ y = [-10804, -30542, -49766, -58714, -11980, 41620, 69095, 79685, 95387, 75119, 38624, 31912, -4074, -25759, -9213, -23080, -59185, -55930, -11264, 15893, -33625, -42200, 3562, 37660, 40464, 27726, -6931, 2515, -10900, -26920, -36110, -32231, -20276, 211, 1307, -9314, -18004, -268, 23309, 62396, 39269, 16554, 9103, -13688, 719, -112, -12404, 6892, 4345, -2910, -24803, -18858, -19686, -6194, -12981, -36833, -55264, -29520, -30119, -45104, -17629, -15196, -40563, -35115, -78023, -100569, -64481, -49911, 5838, 11739, -15187, -52917, -24072, 21470, 1091, 13541, -7180, -25580, -52459, -37697, -21375, -50830, -40479, -27195, -16541, -8002, 26908, 17964, 12630, 31709, 20377, 16688, -8066, 576, -20496, -18459, -1902, 27523, 19339, 17398, 4916, 18974, 4126]
5952D126o6962k4044M2558L0277j5684j0295L4854J8278m838J929J0766R834j3879
5939A6920R739j2806K032j6419k447l3797N839j6628R903N240J7256J4752N731
5926E315J8308J1207J80N864j4785j367p575L2368k4506j220r35R652j707j2701
5912A8098N900K8658l4697k0238j9985J5465J3426N909P451p342l2818m169P985
5899a6357L9184M1486j967l3152j1732o139j5435j1657R528N1220p342l1113p025
5886e01j2537k500k3275r389J1429L7810K1928J4558j7173N315J5709K5428M2994
5873A09796l8008n4406J1076j5774K6354L922k0730j0735j2505j8328K3094Q087
5861A1843J392j992j0010L0447l0790j6722j3588l9455k2020R51M5323J5161k3236
$$ y = [4126, -62836, -86880, -44322, -14045, -29729, -40024, -5170, 13108, 8270, 10199, 20965, 30799, 16920, 26659, 13853, 15885, -534, -2981, -36778, -30939, -47567, -37664, -32424, -15168, -416, 5315, 23623, 34830, 35010, 40874, 26089, 24722, 17147, 49515, 25009, 23789, 22854, 32506, 30799, 18098, 23998, 52656, 17959, -2279, -22264, -6799, 6627, 12536, 19987, 12645, -20173, -24342, -16357, 22827, 64313, 62346, 29194, 17462, 11323, -4112, -15769, -6241, 44979, 37637, 6524, -501, -13038, -15538, -38813, -48202, -36773, 1037, 22965, 37523, 20350, 25665, 41374, 66802, 109796, 71788, 17382, 28458, 12684, 39038, 42960, 22230, 11495, -1010, -19338, 3756, 11843, 13235, 11243, 1233, 31680, 890, -15832, -29420, -68875, -90895, -89944, -44621, -29460, -52696]
5848e2696N327Q26J0236J2412K7085J6524m477n104l984j4318m872K2825R196
5835A8980P07K428L086l1462j5126K2205K36P556L0850q927k6626o0711M801O8226
5821A6223M5606p802K746k821j5356M1114J3491k5268j6172j9156n0692l4399
5809e2486P887K398L0306r408J490K6823m0154k6452P884Q209J3232K0416M0330
5796C0475J15k4373J6318J8984L1939j378m8338m7904J4468L9569m402r769k7261
5783a1557R426K8170L935j3314J916K7055J676o5486l6860K3892N8264K2475k6518
5770B3074J4261L2264j2759N092N99R480j4744r613j4254l0248l4245K592K3024
5757e477J8197k1657l4910j7918J8019O4846J4995k0775k7984J4419M1713J4569
$$ y = [-52696, -47369, -46543, -36307, -23895, 3190, 19714, 15237, 10133, 6149, -8169, -13041, 9784, 18980, 19687, 22115, 25201, -6261, -21387, 818, 1054, 8610, 39460, 30533, 3907, -56804, -52003, 16223, 61829, 54027, 56773, 53952, 38596, 79710, 93201, 67933, 51761, 32605, -18087, -52486, -44599, -42201, -11895, -21303, -19813, 7010, -33144, -59596, -51712, -43503, -30271, -9855, 30475, 30590, 6217, 22535, 41519, 73458, 72080, 23742, -24162, -9694, 29875, 25473, 15704, -11557, -2131, 26039, 29974, 16660, 18576, 45631, 47307, -18179, -55039, -31147, 27117, 49592, 23074, 37335, 69599, 56840, 61932, 62531, 72011, 57267, 47654, 33400, 3152, -31093, -28501, -5477, 12720, -8937, -43847, -61765, -43746, 21100, 36095, 15320, -12664, 1755, 43468, 58037]
5745E8037p106m1680k9683J0088p283N495j3046J733M9901J0483J5688J7842j2701
5732E7768k7611k2988l2709l316K3752K8786K2807p581k8654j5633R222N8511
5720F2354k309n9903l4549k302K6959j6609j2695J4997j834L0481K3909l4807
5708f308k1068J5228q455J7482L3815N1307j6283m3928q739l6862j4600K7729
5696a0682P938n852K4364K2810k0035m6363J8927K0933K5926K603p148J0232J6175
5683E9828l1629l445K0133k5252q490l0721O2M741K0860K4283k8181l5292k3942
5670e7045K9999L7281Q389J409l904k0974j7877K1370l253J4129K9961R986n756
5657D3715k2994l0460j660l4806l3321k6094L4062N3928O805J4340j471l8015
$$ y = [58037, 50931, 9251, -20432, -10344, -17627, -12132, -25178, -23445, 26456, 36939, 52627, 70469, 57768, 30157, 7169, -25540, -28856, -5104, 23682, 46489, 38908, 10254, -5379, 3843, 62354, 60045, 142, -34407, -36709, -9750, -26359, -39054, -24057, -25891, 4590, 28499, -6308, -27376, -12148, -20603, -3121, 30694, 82001, 65718, 21790, 13051, -23811, -38411, -10682, -2744, -8596, 15768, 38578, 18543, -27820, -8893, 12040, 37966, 40569, 33421, 43653, 59828, 28199, 24754, 44887, 19635, 11145, -19576, -19514, -14773, 6087, 30370, 2189, -33103, -57045, -27046, 10235, 18624, 20033, 16129, -4845, -22722, -1352, -4605, 9524, 39485, 49471, 43715, 20721, -9739, -11399, -46205, -79526, -105620, -71558, -17630, -10825, 3515, 2044, -35971]
5645c5971J4138o424M4861J6474j9769k9209j4779N806j958j2654K989J9275k4207
5632d1428j0448k252P585J105K696o867j0589J8622K5269k6046j5491K7420K4091
5619f333q927r463K1306j898m3272j6846J8569O182J9044K2415M6478J0472k313
5606E5414l0077k3092K9243L8129j7844k1031j072J115q34l1395L476K0789j0605
5593A2216k1105k543k3412M830L4064m050j6968N39j5647J1527J7980k2849J520
5580b3898P358J5314J3816q322R543j4966R248J9899K1222j306j1334N376k1364
5567B0586K5734J440P394j0263K9m141l7729j4962j8992J9297L5064n583m8742
5554c0868j003L0132j0625l69J8459R299k9241k825k3308k454K0933m98J4725
$$ y = [-35971, -21833, -28257, 16604, 33078, 13309, -15900, -30679, -24873, -26831, -39485, -36496, -17221, -41428, -51876, -54128, -46543, -45438, -42742, -49609, -60198, -41576, -16307, -42353, -57844, -30424, -6333, -15260, -24723, -3417, -5315, -48587, -65433, -46864, -40682, -21638, 777, 47255, 57727, 55414, 25337, 2245, 31488, 69617, 51773, 30742, 29670, 30785, 29951, -1444, 2032, 22821, 12216, -8889, -11432, -34844, -30014, 4050, 0, -16968, -16429, -32076, -20549, -2569, -25418, -23898, -16540, -1226, 12590, 4268, 13811, -1155, 8093, 27992, 49214, 47908, 36574, 41950, 20586, 46320, 47760, 55154, 44891, 44920, 40779, 3050, -11912, -30904, -11607, 23457, 17874, -30868, -31871, -1739, -12364, -12733, 5726, 15025, -14216, -17041, -40349, -42803, -21870, -22368, -7643]
$$ [...]
##END NTUPLES=NMR SPECTRUM
##END=
