##TITLE=Analysis number 329315
Compound Code cc 67406
Book Reference 511/182
Project Code adrs
Chemist Name stevem
##JCAMPDX= 6.0         $$ Bruker NMR JCAMP-DX V2.0
##DATA TYPE= NMR SPECTRUM
##DATA CLASS= NTUPLES
##ORIGIN= Bruker BioSpin GmbH
##OWNER= nmr
$$ XWIN-NMR		Version 3.5
$$ Mon Aug 20 18:48:19 2007 GMT Daylight Time (UT+1h)  MAYBRIDGE\nmr@NMR_250MHZ
##.OBSERVE FREQUENCY= 250.131544655141
##.OBSERVE NUCLEUS= ^1H
##.ACQUISITION MODE= SIMULTANEOUS (DQD)
##.ACQUISITION SCHEME= undefined
##.AVERAGES= 16
##.DIGITISER RES= 18
##SPECTROMETER/DATA SYSTEM= dpx250
##.PULSE SEQUENCE= zg30
##.SOLVENT NAME= CDCl3
##.SHIFT REFERENCE= (INTERNAL, CDCl3, 0, 16.522)
##AUDIT TRAIL= $$ (NUMBER, WHEN, WHO, WHERE, WHAT)
$$ ##TITLE= Audit trail, XWIN-NMR		Version 3.5
$$ ##JCAMPDX= 5.01
$$ ##ORIGIN= Bruker BioSpin GmbH
$$ ##OWNER= nmr
$$ C:\u/data/dgb/nmr/ADRS/900/pdata/1/auditp.txt
$$ ##AUDIT TRAIL=  $$ (NUMBER, WHEN, WHO, WHERE, WHAT)
(   1,<2007-08-20 18:47:09.71 +100>,<MAYBRIDGE\nmr>,<NMR_250MHZ>,
      <created by zg, POWCHK disabled, PULCHK disabled
       configuration hash MD5:
       76 6E 9A 78 1E 09 19 81 EC 84 63 8F B0 6A 59 2D
       data hash MD5: 64K
       14 F8 E5 4C F2 C9 F9 63 B8 6F 05 31 56 55 1D 63>)
(   2,<2007-08-20 18:47:36.56 +100>,<MAYBRIDGE\nmr>,<NMR_250MHZ>,
      <Start of raw data processing
       ef LB = 0.3 FT_mod = 6 PKNL = 1 SI = 32K 
       data hash MD5: 32K
       E5 66 3D EF 44 E2 F4 A0 B5 1D E5 03 D9 31 E5 06>)
(   3,<2007-08-20 18:47:42.21 +100>,<MAYBRIDGE\nmr>,<NMR_250MHZ>,
      <apk 
       data hash MD5: 32K
       8F A3 87 34 FF A6 E0 6A 3B 57 F9 E1 36 71 3A 1A>)
(   4,<2007-08-20 18:47:47.43 +100>,<MAYBRIDGE\nmr>,<NMR_250MHZ>,
      <abs ABSG = 5 
       data hash MD5: 32K
       F7 29 A8 42 DF 6F 29 D1 DB A4 07 6C 55 AD 30 B4>)
$$ ##END=
$$ 
$$ hash MD5
$$ 64 B4 E1 03 4C 46 65 00 F2 3D 15 B4 BE 0F 99 23
##$RELAX= 
##$RELAX= 
##$RELAX= 
##$RELAX= 
##$RELAX= 
##$RELAX= 
##$RELAX= 
$$ Bruker specific parameters
$$ --------------------------
##$DU= <C:\u>
##$EXPNO= 900
##$NAME= <ADRS>
##$PROCNO= 1
##$TYPE= <nmr>
##$USER= <dgb>
##$AMP= (0..31)
100 100 100 100 100 100 100 100 100 100 100 100 100 100 100 100 100 100 
100 100 100 100 100 100 100 100 100 100 100 100 100 100 
##$AQSEQ= 0
##$AQ_mod= 3
##$AUNM= <au_zg>
##$AUTOPOS= <17 >
##$BF1= 250.13
##$BF2= 250.13
##$BF3= 250.13
##$BF4= 250.13
##$BF5= 500.13
##$BF6= 500.13
##$BF7= 500.13
##$BF8= 500.13
##$BYTORDA= 1
##$CFDGTYP= 0
##$CFRGTYP= 5
##$CHEMSTR= <none>
##$CNST= (0..31)
1 1 145 1 1 1 1 1 1 1 1 1 1 1 1 1 1 1 1 1 1 1 1 1 1 1 1 1 1 1 1 1 
##$CPDPRG= <>
##$CPDPRG1= <>
##$CPDPRG2= <>
##$CPDPRG3= <>
##$CPDPRG4= <mlev>
##$CPDPRG5= <mlev>
##$CPDPRG6= <mlev>
##$CPDPRG7= <mlev>
##$CPDPRG8= <mlev>
##$CPDPRGB= <>
##$CPDPRGT= <>
##$D= (0..31)
0 1 0 0 0 0 0 0 0 0.06 0 0 0 0 0 0 0.0002 0 0 0 0 0 0 0 0 0 0 0 0 0 0 
0 
##$DATE= 1187632027
##$DBL= (0..7)
120 120 120 120 120 120 120 120 
##$DBP= (0..7)
150 150 150 150 150 150 150 150 
##$DBP07= 0
##$DBPNAM0= <>
##$DBPNAM1= <>
$$ [...]
##$SUBNAM7= <"">
##$SUBNAM8= <"">
##$SUBNAM9= <"">
##$SW= 20.6930455092707
##$SWIBOX= (0..15)
0 0 3 0 0 0 0 0 0 0 0 0 0 0 0 0 
##$SW_h= 5175.983436853
##$TD= 65536
##$TD0= 1
##$TE= 296.16
##$TE2= 300
##$TE3= 300
##$TEG= 300
##$TL= (0..7)
0 120 120 120 120 120 120 120 
##$TP= (0..7)
150 150 150 150 150 150 150 150 
##$TP07= 0
##$TPNAME0= <>
##$TPNAME1= <>
##$TPNAME2= <>
##$TPNAME3= <>
##$TPNAME4= <>
##$TPNAME5= <>
##$TPNAME6= <>
##$TPNAME7= <>
##$TPOAL= (0..7)
0.5 0.5 0.5 0.5 0.5 0.5 0.5 0.5 
##$TPOFFS= (0..7)
0 0 0 0 0 0 0 0 
##$TUNHIN= 0
##$TUNHOUT= 0
##$TUNXOUT= 0
##$USERA1= <user>
##$USERA2= <user>
##$USERA3= <user>
##$USERA4= <user>
##$USERA5= <user>
##$V9= 5
##$VALIST= <valist>
##$VCLIST= <CCCCCCCCCCCCCCC>
##$VD= 0
##$VDLIST= <DDDDDDDDDDDDDDD>
##$VPLIST= <PPPPPPPPPPPPPPP>
##$VTLIST= <TTTTTTTTTTTTTTT>
##$WBST= 1024
##$WBSW= 4
##$XGAIN= (0..3)
0 0 0 0 
##$XL= 0
##$YL= 0
##$YMAX_a= 367543
##$YMIN_a= -551930
##$ZGOPTNS= <>
##$ZL1= 120
##$ZL2= 120
##$ZL3= 120
##$ZL4= 120
##$ABSF1= 16.522
##$ABSF2= -4.171173
##$ABSG= 5
##$ABSL= 3
##$ALPHA= 0
##$AQORDER= 0
##$ASSFAC= 0
##$ASSFACI= 0
##$ASSFACX= 0
##$ASSWID= 0
##$AUNMP= <proc_1d>
##$AZFE= 0.1
##$AZFW= 0.1
##$BCFW= 0
##$BC_mod= 0
##$BYTORDP= 0
##$COROFFS= 0
##$CY= 12.5
##$DATMOD= 1
##$DC= 0
##$DFILT= <>
##$DTYPP= 0
##$F1P= 14.0000005364418
##$F2P= -0.99999901652339
##$FCOR= 0.5
##$FTSIZE= 32768
##$FT_mod= 6
##$GAMMA= 0
##$GB= 0
##$INTBC= 1
##$INTSCL= 1
##$ISEN= 128
##$LB= 0.3
##$LEV0= 0
##$LPBIN= 0
##$MAXI= 10000
##$MC2= 0
##$MEAN= 0
##$ME_mod= 0
##$MI= 0
##$NCOEF= 0
##$NC_proc= -4
##$NLEV= 6
##$NOISF1= 0
##$NOISF2= 0
##$NSP= 0
##$NTH_PI= 0
##$NZP= 0
##$OFFSET= 16.522
##$PC= 1
##$PHC0= -40.16937
##$PHC1= 0.2798052
##$PH_mod= 1
##$PKNL= yes
##$PPARMOD= 0
##$PSCAL= 4
##$PSIGN= 0
##$REVERSE= no
##$SF= 250.13
##$SI= 32768
##$SIGF1= 0
##$SIGF2= 0
##$SINO= 400
##$SIOLD= 32768
##$SREGLST= <1H.CDCl3>
##$SSB= 0
##$STSI= 32768
##$STSR= 0
##$SW_p= 5175.98343685301
##$SYMM= 0
##$S_DEV= 0
##$TDeff= 65536
##$TDoff= 0
##$TI= <Analysis number 999999
Compound Code 99
Book Reference 9
Project Code 9>
##$TILT= no
##$TM1= 0
##$TM2= 0
##$TOPLEV= 0
##$USERP1= <user>
##$USERP2= <user>
##$USERP3= <user>
##$USERP4= <user>
##$USERP5= <user>
##$WDW= 1
##$XDIM= 32768
##$YMAX_p= 323538273
##$YMIN_p= -124523
$$ End of Bruker specific parameters
$$ ---------------------------------
##NTUPLES= NMR SPECTRUM
##VAR_NAME=  FREQUENCY,     SPECTRUM/REAL,   SPECTRUM/IMAG
##SYMBOL=    X,             R,               I
##VAR_TYPE=  INDEPENDENT,   DEPENDENT,       DEPENDENT
##VAR_FORM=  AFFN,          ASDF,            ASDF
##VAR_DIM=   32768,         32768,           32768
##UNITS=     HZ,            ARBITRARY UNITS, ARBITRARY UNITS
##FACTOR=    0.157963299565203, 1,           1
##FIRST=     4132.6476996994, 0,             0
##LAST=      -1043.33573715361, 0,           0
##MIN=       -1043.33573715361, -124523,     0
##MAX=       4132.6476996994, 323538273,     0
$$ Real data points
##PAGE= N=1
##DATA TABLE= (X++(R..R)), XYDATA
$$ [...]
17472d0464R004K6121K7200O88j7445j370J9908K99R570L434k319o957q096k581
17458A6992Q691J2284k8630k7843J8836O718k0826p288K454M2681J3483M922r706
17445C2768L8547M2956N2542L1015L528L7650K3296o7907q9348n0337k4011N443
17433C6142K3498J7827j9325k9904j2205R842l1998j2161K1084J7646J5822K7238
17421F3506k4683m0906j7187L3370K7944j4076j4473o71j6459L595P866j52L479
17408A1153k7448j285M1868K2368J0952q216J7711M809r273j4225j7576N743p112
17395B9469k6617M870q34j5276L311Q120p17k4456l0029j5020M585K6049j021
17382c7566K9521K2900Q759k9157J4592j6551j9010P690J6636j4583l2013k7802
$$ plain form
17472 -40464 -31460 -5339 21861 22549 5104 3734 23642 23941 33511 36945 34626 27669 19573 16992
17458 16992 25683 37967 9337 -18506 330 7048 -13778 -21066 -18612 24069 37552 42474 32768
17445 32768 71315 114271 166813 197828 201356 239006 262302 194395 105047 54710 30699 36142
17433 36142 59640 77467 58142 28238 16033 25875 -6123 -18284 2800 20446 36268 63506
17421 63506 38823 -2083 -19270 14100 42044 27968 13495 12824 -3635 -40 7826 7674 11153
17408 11153 -16295 -17580 24288 46656 57608 49392 67103 71912 62639 48414 30838 36581 29469
17395 29469 2852 7722 6888 -8388 -5077 3043 2326 -22130 -52159 -67179 -62594 -36545 -37566
17382 -37566 -8045 14855 23614 -5543 9049 -7502 -26512 -18822 -2186 -16769 -48782 -76584
17370g6584L0088J7511J7806J5832j3471J4851J4086m564j7687k5720j2714K797
17358c7769j0312K297J6397J2529q234k3575l171P208k5336O109K0747n032L0340
17345a7802K7730J0550n698j8117J9099K4704J289k4855l434L340M083j617k618
17332A6654O293O17j0666k4752J531K9153J2303L363m0698k4805k1041K367R934
17319c9747j3517K172M8331J7479m2229j2069J7576J1102k940j3241j389p057
17307c5529M5534L5156l4550k8594j2227J3182K8557k027j2982J3246J1610l2806
17295a1430j2832K760N107L8188p35k1221L507L922L0060J9469j700j2585K216
17282D4726m3124j1809K2759K1089P15j3235m820l726N055k1387l5140J125O529
$$ plain form
17370 -76584 -46496 -28985 -11179 4653 -8818 6033 20119 15555 -2132 -27852 -40566 -37769
17358 -37769 -48081 -45784 -29387 -16858 -25092 -48667 -51838 -44630 -69966 -63857 -43110 -48142 -17802
17345 -17802 9928 20478 14780 -3337 15762 40466 41755 16900 13466 16806 20889 19272 16654
17332 16654 22947 23564 12898 -11854 -10323 18830 31133 34496 -6202 -31007 -52048 -49681 -39747
17319 -39747 -53264 -51092 -2761 14718 -27511 -39580 -22004 -10902 -13842 -27083 -28472 -35529
17307 -35529 10005 45161 10611 -17983 -30210 -17028 11529 9502 -3480 9766 21376 -11430
17295 -11430 -24262 -21502 -16395 21793 21058 -163 3344 7266 37326 56795 55095 42510 44726
17282 44726 1602 -10207 12552 33641 34356 21121 16301 12575 17630 -3757 -38897 -37772 -31243
17269c1243L865j2035J4099J2122J4658j2868L469N856r746M501j7814j4611k5246
17256f4993P185K5485J5219l3851K0539J6562q770K137J5644N556K44O72o052
17243d423L5037L1206l4879m6203j3473Q815N161n632j5331j6752j4039L2245
17231c8268L1774L334j1045J2743j2900J3187l838J5242R878l3398j7504R762
17219b1033K731j7466j982J1795L0084L6140l819k9572j9513J0365j1767r846
17207b3883q639j3100N127r058L3387M2528J2229R853N48J2488l6706m5447K4952
17194D279N397j789J6906k4137j0794J039j2821K056J2809k282K0662J583j8643
17181e735j3276l0502j0656J0954m533J7854J8810p241j916l715k9605j643j8989
$$ plain form
17269 -31243 -27378 -39413 -25314 -13192 1466 -11402 -7933 -2077 -11823 -7322 -25136 -39747 -64993
17256 -64993 -57808 -32323 -17104 -50955 -30416 -13854 -22624 -20487 -4843 713 957 1629 -4423
17243 -4423 30614 61820 26941 -19262 -32735 -23920 -18759 -24391 -39722 -56474 -70513 -38268
17231 -38268 -6494 -3160 -14205 -1462 -14362 -1175 -5013 10229 20107 -13291 -30795 -21033
17219 -21033 -18302 -35768 -37750 -25955 4129 40269 36450 6878 -12635 -2270 -14037 -23883
17207 -23883 -32522 -45622 -40495 -49553 -16166 26362 38591 48444 48992 61480 24774 -20673 4279
17194 4279 9676 7887 24793 656 -10138 -9099 -21920 -19864 -7055 -9337 11325 12908 -5735
17181 -5735 -19011 -49513 -60169 -49215 -53748 -35894 -17084 -24325 -26241 -29956 -59561 -61204 -80193
17168h0193K4744K3969j7937o55K0799K4241L910J0812l6358l0067j0158J7186
17156d9707K4652J5997J4225J1494j7555n498k8177j3777J7585K3386j3923J6090
17144e208N641m105p726k1454n560J2320K7807K297P53p094p024K0244K3553M777
17130C9221m9747p199l122J5035j3453k0623M092K1072J6393O147j4353O512J8140
17117A8115J893j4014l691J4251L288k2185k4525j1745J8681K6234J467N789k5161
17104a1603l0158j3292P017J2824Q529L3165p392j234m507j2329j4984L3525L6756
17091C6317K3463n021k7923k7505N318L1881R655k5181l5677k1846n9K3740k949
17078a5787j2536K2081n667j9004L733k294n140k3134j4432Q886K6397J693r03
$$ plain form
17168 -80193 -55449 -31480 -49417 -50072 -29273 -5032 -1122 9690 -26668 -56735 -66893 -49707
17156 -49707 -25055 -9058 5167 16661 -894 -6392 -34569 -48346 -30761 -7375 -21298 -5208
17144 -5208 433 -3672 -11398 -32852 -38412 -26092 1715 4012 4765 -2329 -9353 10891 34444 39221
17130 39221 -10526 -17725 -20847 -5812 -19265 -39888 -35796 -14724 1669 7816 -6537 -25 18115
17117 18115 20008 5994 2303 16554 19842 -2343 -26868 -38613 -19932 6302 7769 13558 -11603
17104 -11603 -41761 -55053 -48036 -35212 -26683 6482 -910 -2144 -6651 -18980 -33964 -439 36317
17091 36317 59780 54759 26836 -669 4649 36530 46185 21004 -14673 -36519 -36578 -12838 -15787
17078 -15787 -28323 -6242 -11909 -30913 -27180 -29474 -34614 -57748 -72180 -63294 -36897 -35204 -36107
17065c6107j5633q18N4J1844L9804L488J0451M177K950K550j2702Q553k4121l4592
17051d0102K346K1030m154O936J8325r114l812q598l0127K6208K9595l171j6574
17038a1212l4737j0057L2688K4838j9915j7896j3445j8041O705J4694K0888K9822
17026D332k0760p600J0911N772j5132k1209j8683L5165q817n528K1592R622J9146
17013H811q495O807K3498n338j8236K148m0089n0511N125M8203o538Q227O927
17000a9461M7592J2932k8492j3576j4461J8587L9121L441m5343n165p12j4494
16988b0031j0128m088J2294J5831J2711j2063J2950K3707k0524k5958j5914j3189
16976d4402L375K724K748J6294P861K4120r087j4367J9782L888j2404j9568K7610
$$ plain form
17065 -36107 -51740 -52558 -52504 -40660 -856 2632 13083 17260 20210 22760 10058 18611 -5510 -40102
17051 -40102 -37756 -16726 -20880 -13944 4381 -4733 -8545 -17143 -47270 -21062 8533 5362 -11212
17038 -11212 -45949 -56006 -23318 1520 -18395 -36291 -49736 -67777 -61072 -46378 -25490 4332
17026 4332 -16428 -24028 -13117 -7345 -22477 -43686 -62369 -27204 -36021 -41549 -19957 -10335 8811
17013 8811 316 7123 30621 25283 7047 9195 -30894 -81405 -76280 -28077 -34615 -26388 -19461
17000 -19461 28131 41063 12571 -1005 -15466 3121 42242 45683 340 -4825 -5537 -20031
16988 -20031 -30159 -34247 -21953 -6122 6589 -5474 7476 31183 10659 -15299 -31213 -44402
16976 -44402 -41027 -38303 -35555 -19261 -11400 12720 3633 -10734 9048 12936 532 -19036 8574
16963H574M327k5361j5846K598j3522J912Q894K9302J8994p353J2384q243k7713
16950a1053k102n346q949l9003J2772K2071j5040J4238m492m905j8811J5658K3550
16937b1412L7038K7893k5602l6157M425Q887J3688O959J0146k4151m5660j5093
16925e9039K9053K4655j721K8300N027k843k2590l1859j5683J0090L9421J8473
16913B1284j9894L248j0353n043Q79J2912K6972m578m9557l2125K7512M4386L7468
16900E3111n028j1808k3180K358J3113r447l0200q592R971J3584J460j4239P030
16887a867J9459k7335Q768J1652n962j4773j6492R555o110K191K514l1148R587
16874c9961O984K3324J2257k8803p937K7410O218m0338L385L313q066k7087J3581
$$ plain form
16963 8574 12901 -12460 -28306 -25708 -39230 -37318 -28424 878 19872 12519 24903 16660 -11053
16950 -11053 -13155 -18501 -27450 -66453 -53681 -31610 -46650 -32412 -36904 -41809 -60620 -44962 -21412
16937 -21412 15626 43519 17917 -18240 -13815 -4928 8760 15719 25865 1714 -43946 -59039
16925 -59039 -29986 -5331 -7052 21248 26275 23432 842 -31017 -46700 -36610 2811 21284
16913 21284 1390 4638 -5715 -10758 -9879 3033 30005 25427 -24130 -56255 -28743 15643 53111
16900 53111 48083 36275 13095 15453 28566 19119 -11081 -19673 -9702 3882 5342 -8897 -1867
16887 -1867 17592 -9743 -975 10677 4715 -10058 -26550 -16995 -23105 -20914 -18400 -49548 -39961
16874 -39961 -32977 -9653 2604 -26199 -34136 -6726 -508 -40846 -37461 -34148 -42214 -69301 -55720
16861e5720K3143n684M376o532J3701L5642n543k8118o091j1705j7205L479L3171
16848b3086K0181K2022N262l0241j3998L2510M594J2451J9237q283l0815k3122
16836a3288J9387J2439l916L668J6245R842k2282j5569j3562j4489j4318r55Q987
16823b7811Q112j283k0236L336N881j124J4826J4793k942j5904j764K6265J4058
16810A6207Q817l168J9573R529j4536L632j4046l0163j835J8925J7898j6387k9960
16797a5514J7572K3152J8842K5272k613l8401r151P67q877k5421k195J181j4M211
16783a1189n265N490L883r697K7475J2821J0851J0710q40l2157j167j7883j8914
16770b5882r294O987j4310J0272o243R752j1617n884K7709K0251p085j1253M0035
$$ plain form
16861 -55720 -32577 -38261 -33885 -40417 -26716 8926 3383 -24735 -30826 -42531 -59736 -56257 -23086
16848 -23086 -2905 19117 24379 -5862 -19860 12650 17244 29695 48932 40649 9834 -13288
16836 -13288 6099 18538 14622 18290 34535 44377 22095 6526 -7036 -21525 -35843 -36798 -27811
16823 -27811 -19699 -20982 -41218 -37882 -32001 -33125 -18299 -3506 -6448 -22352 -24116 2149 16207
16810 16207 25024 21856 41429 50958 36422 40054 26008 -4155 -5990 12935 30833 14446 -15514
16797 -15514 2058 25210 44052 69324 66711 28310 19159 19926 11049 -14372 -16567 -15386 -15400 -11189
16783 -11189 -16454 -10964 -7081 -16778 10697 23518 34369 45079 44239 12082 10915 -6968 -25882
16770 -25882 -35176 -28189 -42499 -32227 -38470 -28718 -40335 -46219 -18510 1741 -5344 -16597 23438
16757B3438K3177J9736l9239k1634k5363p153L421O929k3091M579J0659j0245
16745c4786J0562R40J6024K7029L652k8258j7726J3559Q780k8129j8995L879p123
16732e0592K1515K9780M909l176j9278N720j5510j4880j4929L9076L4225p097
16720I763j0289M808P49j503j5294K089o581j2387L2813J8780N344l391O64k8831
16706c266k3178J8237R9l644k4607k1219n170J5890L2140j1164P909J5080K2503
16693A9610p013j1045n056q221N434j7644R019J0289P309l375J0930J6215k5903
16680E49k8191l893J0251J4145K3242k3034o933J3267O191O413K0230j9791k3165
16667a0719L025J3048J7284j7550k7626M335J032m38P607R811j2494p874J4788
$$ plain form
16757 23438 46615 66351 27112 5478 -19885 -27038 -23617 -16688 -39779 -35200 -24541 -34786
16745 -34786 -24224 -23284 -7260 19769 23421 -4837 -22563 -9004 -224 -28353 -47348 -43469 -50592
16732 -50592 -29077 703 5612 2436 -16842 -11122 -26632 -41512 -56441 -17365 16860 9763
16720 9763 -526 4282 5031 3528 -11766 -9677 -16258 -28645 4168 22948 28292 24901 25565 -3266
16706 -3266 -26444 -8207 -8108 -11752 -36359 -57578 -62748 -46858 -14718 -25882 -17973 -2893 19610
16693 19610 12597 1552 -3504 -11725 -6291 -23935 -14916 -4627 2682 -693 10237 26452 549
16680 549 -27642 -31535 -21284 -7139 16103 -6931 -13864 -597 5594 12007 32237 12446 -10719
16667 -10719 -7694 5354 22638 5088 -22538 -18203 -17171 -17609 -10002 -191 -12685 -20559 -5771
16654e771O62P56R831j21j3713j500j3244k7239J1333K4113M328j1729l462K3888
16640a868L995k8960k7990l100J5676J748Q676L0699m583K7982J3066k8091Q731
16627A5981n088j7019k4198n58J5188J4126J1557j0652j8327P971J0577J3430
16615A2988K701j4045j9845k165J1454K0723l423j2415J852J23l798r979L58k878
16601a8349k1892j6999J4923J8337M906J1443J0760q578l4061m5039J8912M2006
16589b3631J9295j7323l71J0662P936M468K611K04M395N925j3683N379j6787q068
16575a8988k9818j1970J6144J0724k972K4921Q114l657p307m07L5556K6929k2587
16562B4682l4406K9043J1106k4544j1767k2126o970J2317P676l816j5487K2921
$$ plain form
16654 -5771 -5109 -4353 5478 5357 -8356 -9856 -23100 -50339 -39006 -14893 -10565 -22294 -25756 -1868
16640 -1868 2127 -26833 -54823 -57923 -42247 -40499 -31823 -1124 -5707 22275 35341 7250 15981
16627 15981 10893 -6126 -30324 -30882 -15694 -1568 9989 -663 -18990 -11019 -442 12988
16615 12988 15689 1644 -18201 -20366 -8912 11811 8388 -4027 -2175 -2052 -5850 -15829 -15471 -18349
16601 -18349 -40241 -57240 -42317 -23980 -19074 -7631 3129 -5449 -39510 -84549 -65637 -23631
16589 -23631 -4336 -21659 -22030 -11368 -3432 1036 3647 3851 8246 14171 488 5867 -10920 -18988
16575 -18988 -48806 -60776 -44632 -33908 -36880 -11959 -3845 -7502 -14809 -15216 20340 47269 24682
16562 24682 -9724 19319 30425 5881 -5886 -28012 -34982 -22665 -14989 -18805 -34292 -11371
16550a1371J2983J647k2149O0510J6866m8035J39j5803j5794k8934J7363j0015
16538d2593l0492l887J6221l814Q193J4212M3317R953n546J4228M507j2671k8231
16525a6603P106J5157k5136l4856J1273m140P844J2627N170J9756J3605m000j3984
16512f181o953J2140N281K987K7926P265j7911q378k3107j7638q96j0924R410
16499b6979r256J0976J268j1523q818k51j3612q991K0176J9405K1629K613k1446
16486b4809K1662j1105j8682N232l523m2648J27N1312J8561n655P192j7357p554
16473b7247M068J3345m709j0107J841Q004P111q678K920N130q413J0123Q097M585
16459F070R606r474l2399l399J0623J7164M508q312m629K216m064j2878n341k1629
$$ plain form
16550 -11371 1612 3259 -18890 41620 58486 10451 10590 -5213 -21007 -49941 -32578 -42593
16538 -42593 -73085 -76972 -60751 -64565 -56372 -42160 1157 11110 5564 19792 24299 11628 -16603
16525 -16603 -9497 5660 -19476 -54332 -43059 -47199 -39355 -26728 -21558 -1802 11803 7803 -6181
16512 -6181 -13134 -994 4287 7274 35200 42465 24554 16176 -6931 -24569 -25465 -36389 -26979
16499 -26979 -36235 -25259 -23991 -35514 -44332 -44583 -58195 -67186 -47010 -27605 -5976 -3363 -24809
16486 -24809 -3147 -14252 -32934 -27702 -31225 -73873 -73746 -22434 -3873 -9528 -2336 -19693 -27247
16473 -27247 -23179 -9834 -14543 -24650 -22809 -14805 -7694 -16372 -13452 -8322 -16735 -6612 1485 6070
16459 6070 15676 6202 -26197 -29596 -18973 -1809 2699 -5613 -10242 -8026 -12090 -24968 -30309 -51938
16445e1938J503K2800J0837k201K749j0379K0196q943l2271l868J3853r031L0811
16432a5882N1838k7160J3014K298M251j6220J0858J9588r343n587j8314L0098
16420C9439K2681j9477n8462l8571J4830L1687J0919K692J3694n874j5250p028
16408h720j6051n251L60J578K0795o327j9272r43p374O769j7201j9476J4951L3040
16394b3122Q160l07J917R533K5368K085k7160q240k2626k6215K681J588J7399
16381c8939J6044J9937P822m800l379l4761M652J3596j0365J3990n739k6599n32
16368d9073J6278K4994J6579n694L2483o147l0582j8315j4675m299K1270J4069
16356c112J8316J2060n941k4134l649J1385N639q789J3623j2610k2133j2561p468
$$ plain form
16445 -51938 -50435 -27635 -16798 -18999 -16250 -26629 -6433 -15376 -47647 -51515 -37662 -46693 -15882
16432 -15882 35956 8796 21810 24108 28359 12139 22997 42585 33242 27655 9341 39439
16420 39439 62120 42643 -15819 -54390 -39560 -7873 3046 5738 19432 13558 -1692 -8720
16408 -8720 -24771 -30022 -29662 -28084 -7289 -13616 -32888 -33831 -41205 -34436 -51637 -71113 -56162 -23122
16394 -23122 -14962 -15269 -13352 -3819 21549 23634 -3526 -11766 -34392 -60607 -57926 -56338 -38939
16381 -38939 -22895 -2958 4864 64 -3315 -38076 -33424 -19828 -30193 -16203 -21942 -48541 -49073
16368 -49073 -32795 -7801 8778 3084 35567 29420 -1162 -19477 -34152 -38451 -17181 -3112
16356 -3112 15204 27264 21323 -2811 -6460 4925 10564 1775 15398 2788 -19345 -31906 -39374
16343c9374K6876K1997l093R892k330m458j1187j304J1458j7104l1689K1276q333
16330b7373J9651K5977J2987m9866k4031K6451J8080R21J8908p730L107j6598
16318D84k1501R119l66M181j7052j7558j0093J7484K4509m548J4039j524j6703
16305a9529l2242J9930K0501n647M483m203K1188m0725k5437J8139O605k0022
16293e6959n551M4884K1080j4004M880q242J0684n593l0961j3512J6789K0194
16281a6311q914P501K4488o934k3478K2888R172j2017j3611m520K881M272k1885
16268c6468k903M5509K625k0357k7751l982K4888N549m315k5553R443J9036J4349
16255G0J0481r433N848o86j6506q583K966q276N237K2900m373l929j4851o939
$$ plain form
16343 -39374 -12498 9499 6406 16298 13968 9510 -1677 -2981 8477 -8627 -40316 -19040 -27373
16330 -27373 -7722 18255 31242 -18624 -42655 -16204 1876 2797 21705 13975 17082 484
16318 484 -21017 -11898 -12264 -8083 -25135 -42693 -52786 -35302 -10793 -15341 -1302 -2826 -19529
16305 -19529 -51771 -31841 -11340 -16987 -12504 -16707 4481 -36244 -61681 -43542 -36937 -56959
16293 -56959 -62510 -17626 3454 -10550 -5670 -13912 -3228 -8821 -39782 -53294 -36505 -16311
16281 -16311 -25225 -17724 6764 -170 -23648 -760 8412 -3605 -17216 -21736 -18855 -14583 -36468
16268 -36468 -39371 6138 8763 -11594 -39345 -43327 -18439 -12890 -17205 -42758 -33315 -14279 70
16255 70 10551 1118 6966 6280 -10226 -18809 -15843 -24119 -18882 4018 -355 -4284 -19135 -26074
16241b6074J9436P27J4873j0492j3241J5006j7688k3999K733L1914P251j3579
16229a3133k1627j0084M4596J3835r930P173q01p246j0094K664K1331J8536k0112
16216A5108m3445j2313K7117J1081k2072O868Q322j1281k6198M433K972J2575
16204b6833L3265J5645l0238l2105K4038J2790J1020j9004p856K3019J3000p292
16192I449j694k2795j1357M7672J0423k7619q029P548j0423l0859R685J8033L0424
16179B0458J5078r168l1697k8134l621K0008K4596j0514k2497P513j4276J743
16167c0511L8630L0890K674l168m817k4257k6008j1584n951j6572Q522j3827J2278
16154d3701k468l882J3770K3086m853Q496P345p789q582n190m685r077J2135Q125
$$ plain form
16241 -26074 -6638 -5911 8962 -1530 -14771 235 -17453 -41452 -38719 -6805 446 -13133
16229 -13133 -34760 -44844 -248 13587 3657 10830 10029 2783 -7311 -4647 16684 35220 15108
16216 15108 -28337 -40650 -13533 -2452 -24524 -17656 -9334 -20615 -46813 -42380 -39408 -26833
16204 -26833 6432 22077 -8161 -40266 -16228 -3438 7582 -11422 -19278 3741 16741 9449
16192 9449 7755 -15040 -26397 21275 31698 4079 -3950 3598 -6825 -37684 -27999 -9966 20458
16179 20458 35536 26368 -5329 -33463 -37084 -17076 7520 -2994 -25491 -17978 -32254 -30511
16167 -30511 8119 39009 41683 38515 33698 9441 -16567 -28151 -34102 -50674 -42152 -55979 -43701
16154 -43701 -46169 -50051 -36281 -13195 -18048 -9552 -2207 -9996 -18578 -23768 -28453 -37530 -25395 -17270
16140a7270J848n42N545n960P053J9221j416l12J0423O061j448k3791k1951R702
16126a2837K1692j2617m7310k911o295n597K2615R97J997L1860J3420n431P484
16113G067k9918l2598J0726J085J6974K4767j0222J705q735l700K4453l3855k0371
16100e2622j728p018l9590J7885M8893L4275p295l4076O287L303J5895J8232k4740
16087b2299P692M762J0911O08J548k2090J9703K942J81P815k466k6420n620n835
16073b8568k7541K5993L7061n982j4722r724j5276k2353P136K1677J4979K3767
16061F447n918j511J868L834k8750k5635L720L2326J1098j4562j8542K4756L658
16048g211R210M2954O902k3785k6693l0004Q98L929K1318J8829n472j8173R194
$$ plain form
16140 -17270 -15422 -15964 -10419 -16379 -9326 9895 8479 8167 18590 24651 23203 -588 -22539 -12837
16126 -12837 8855 -3762 -51072 -53983 -60278 -65875 -43260 -42263 -40266 -8406 5014 -417 7067
16113 7067 -22851 -55449 -44723 -43638 -26664 -1897 -12119 -10414 -19149 -22849 1604 -32251 -52622
16100 -52622 -54350 -61368 -100958 -83073 -34180 95 -7200 -41276 -34989 -31686 -15791 2441 -22299
16087 -22299 -14607 -9845 1066 1674 3222 -18868 835 3777 3958 11773 9307 -17113 -22733 -28568
16073 -28568 -56109 -30116 6945 963 -13759 -23483 -38759 -61112 -53976 -32299 -17320 6447
16061 6447 529 -982 886 4720 -24030 -49665 -45945 -13619 -2521 -17083 -35625 -10869 -7211
16048 -7211 1999 44953 51855 28070 1377 -28627 -27729 -23800 -2482 16347 10875 -7298 1896
16035A896M802k421O676M601K6597n58m117n668J033j4725k2407j7837J2460K0501
16021A0833j7228j6843J0161P919J4789J7658j8282k966J1845K1736P389k0327
16009B6684j3566r27J8541j1379r631l0474p673J6525J6528R934n859m4283o663
15996d2243J1987J1773j697J0321j385k3588R041L957M0744K6025j4152r083p423
15983A4277K998p923j894j905m263l010j1840k2687r342Q121J2438J4632J3964
15970C566j0973m106k994R196m318p35J8623K7444q097q244q292k49j5280O810
15956B351j9728m43K0098O692k5027M876L857J9877L4336R160L861l1154j5376
15943A3380l164K710R841m5536J3418j6199J6720J2359O992J2680q633k276p241
$$ plain form
16035 1896 6698 4277 10953 15554 42151 41593 37476 31808 32841 18116 -4291 -22128 -9668 10833
16021 10833 -6395 -23238 -13077 -5158 9631 27289 9007 6041 17886 39622 47011 26684
16009 26684 13118 12191 30732 19353 9722 -20752 -28425 -11900 4628 14562 8703 -35580 -42243
15996 -42243 -30256 -18483 -20180 -9859 -11244 -34832 -25791 -21834 18910 44935 30783 21700 14277
15983 14277 17275 9352 7458 5553 1290 -1720 -13560 -36247 -45589 -37468 -25030 -10398 3566
15970 3566 -7407 -11513 -14507 -5311 -9629 -10364 8259 35703 27606 19362 11070 10821 -4459 2351
15956 2351 -17377 -17820 2278 8970 -16057 -11181 -7324 12553 46889 56049 59910 28756 13380
15943 13380 10216 12926 22767 -22769 -9351 -25550 -8830 3529 10521 23201 14568 12292 5051
15930E051j2607k6513q92J2940K230K526J3093q670j6070m466k4863L325J6137
15917c8779q139J9504K8729O82k0679K8129k3729P431L919k7963r914N165R752
15904b5892J2068J8238k859J070k5318K364J1555l7104j9751J0872K171O278O703
15891c9605L6460K0802k1473j6997Q62l46k1523j1601O95K6289K816j2210q398
15878d4229p079j5165K0760O28L932J9496L0163j802k9283M563j8979j129r275
15865d7399j0449J6490K583l711N310J2904L029j3088m003j9013J6298L562J1233
15852b6254J6604M0688j1857m862k5305k2478Q330J9784N876N109J1498J4438
15840C1571R875Q016L649n15l2085r01J3835J9414j5802J5364n58k8558m291J4477
$$ plain form
15930 5051 -7556 -34069 -34961 -22021 -19791 -17265 -4172 -12842 -28912 -33378 -58241 -54916 -38779
15917 -38779 -46918 -27414 1315 1997 -18682 9447 -14282 -6851 -2932 -30895 -40809 -35644 -25892
15904 -25892 -13824 4414 1555 2625 -22693 -20329 -8774 -45878 -65629 -54757 -52586 -46308 -39605
15891 -39605 -3145 17657 -3816 -20813 -19951 -20297 -41820 -53421 -52726 -26437 -23621 -35831 -44229
15878 -44229 -51308 -66473 -45713 -45085 -41153 -21657 8506 6704 -22579 -18016 -36995 -38124 -47399
15865 -47399 -57848 -41358 -38775 -42486 -37176 -24272 -21243 -34331 -38334 -57347 -41049 -37487 -26254
15852 -26254 -9650 31038 19181 14319 -10986 -33464 -25134 -5350 526 5635 17133 31571
15840 31571 41446 49462 53111 52596 20511 19610 33445 52859 37057 52421 51863 23305 19014 33491
15826C3491J3627q247m625l057j0215j9516j4779p465j4654K333J7731K3030L842
15813A1496j5965j6985j4137j0826K693p624r621N791J9553K3642j02r79K1891
15800H827j1983k0289m429M452J4736J4138n902J94R130l486k0510R07O681J6787
15786I253M678k1793j3504J0204P736j2166l1089K8177J0911l86m757o502L84
15773a8854n557J0667N174O698k265k429J1554P251l2443k4446L5373J2641J5971
15760A9335K1136o186M992k849j3160k0520q544j0419O202m8810j0673K2732N352
15747d1412J6942j719k4334K4909L3445j9019j419k580j2315o742j8769m0055
15735i3068j932L3459J9112J4309K6405L625k9195J7004K4932j8535j6081J0188
$$ plain form
15826 33491 47118 38871 34246 31189 20974 1458 -13321 -20786 -35440 -33107 -15376 7654 11496
15813 11496 -4469 -21454 -35591 -46417 -43724 -51348 -60969 -55178 -35625 -11983 -12085 -13064 8827
15800 8827 -3156 -23445 -27874 -23422 -8686 5452 -450 -256 8874 5388 -15122 -14215 -7534 9253
15786 9253 13931 -7862 -21366 -11162 -3426 -15592 -46681 -18504 -7593 -7979 -12736 -19238 -18854
15773 -18854 -24411 -13744 -8570 -1872 -4137 -6566 4988 12239 -20204 -44650 -9277 3364 19335
15760 19335 40471 34285 39277 36428 23268 2748 -5796 -16215 -10013 -58823 -69496 -46764 -41412
15747 -41412 -24470 -26189 -50523 -25614 7831 -11188 -12607 -15187 -27502 -34244 -53013 -93068
15735 -93068 -95000 -61541 -42429 -28120 -1715 1910 -27285 -10281 14651 -3884 -19965 -9777
15723i777j2992k6199q584j2669J2889K8721j1709r817m252J9241r737K602j4631
15710e6914K5619K0969j1981R64q010K655Q112K531J6407J5669J7005J6676J5842
15697F5544j7123n1658k4728n711J9366L026R695J1499r719N105J5312R325k5959
15684C974J4093j5016k79K86K6586K4450j3914P129L062j1029l766k4123K2720
15671C4173J6388k6954m4122j8672K0162L0453J5857K0381J3222j9732k2647k2340
15659c831m188P590j2422P488M0726O586J481j7244l9976p181j3945K2339K1665
15646I088j1751O852j0221J198J5310J5960K0120j8418n236k0822j4290k0420
15634c2630m763q738L197p142J9306K7873J8526K992k5950r91K0488J4685r605
$$ plain form
15723 -9777 -22769 -48968 -57552 -70221 -57332 -28611 -40320 -50137 -54389 -35148 -44885 -42283 -56914
15710 -56914 -31295 -10326 -22307 -21343 -29353 -26698 -18586 -16055 352 16021 33026 49702 65544
15697 65544 48421 -3237 -27965 -33676 -14310 -11284 -1589 9910 191 5296 20608 29933 3974
15684 3974 18067 3051 2772 3058 29644 54094 40180 47309 50371 39342 35576 11453 34173
15671 34173 50561 23607 -20515 -39187 -19025 11428 27285 47666 60888 41156 18509 -3831
15659 -3831 -8019 -429 -12851 -5363 35363 41949 43430 26186 -13790 -20971 -34916 -12577 9088
15646 9088 -2663 4189 -6032 -4834 10476 26436 46556 28138 22902 2080 -12210 -32630
15634 -32630 -37393 -46131 -42934 -50076 -30770 -2897 15629 18621 -7329 -8320 12168 26853 17248
15621A7248j8970l2827J4223K3046j5102J713J6684J862m887n499j7116J1568
15609h057J3900l1634l7785J1639K2629L3138J2534M877j0946O911J5803j1120
15597B1889n29j2257N255L2419j7465o306R341J3043j7950j5773J5891J4837M483
15584D6878k6206j2117P670K529R606k7251k0678j015K7005J6098J990J994q679
15571A7824K752M150k0552k2070n231j5359l034J4039K5499M988j7611Q699k0256
15558b6162k3964k6494L2008J0267j0321J6572K1557K974p128k5214J692L6002
15546A789J2230n604m9857j2507J171R966K2234p225j0508N322J0254K972J894
15533a7869p23O417J0951K981Q160j591N477j5483j3933P563j7801l48J1616K9875
$$ plain form
15621 17248 -1722 -34549 -20326 2720 -12382 -10669 6015 7877 2990 -2509 -19625 -8057
15609 -8057 5843 -25791 -63576 -51937 -29308 3830 16364 21241 10295 17206 33009 21889
15597 21889 21360 9103 14358 46777 29312 23006 32347 45390 27440 11667 27558 42395 46878
15584 46878 20672 8555 16225 18754 28360 1109 -19569 -20584 6421 22519 24509 26503 17824
15571 17824 20576 24726 4174 -17896 -23127 -38486 -41520 -27481 -1982 3006 -14605 -5906 -26162
15558 -26162 -50126 -76620 -44612 -34345 -44666 -28094 -6537 -3563 -10691 -35905 -34213 1789
15546 1789 14019 8415 -41442 -53949 -52778 -42812 -20578 -27803 -38311 -32989 -22735 -19763 -17869
15533 -17869 -18592 -12175 -1224 1757 9917 8326 13803 -1680 -15613 -8050 -25851 -26199 -14583 15292
15519A5292q610J45j2002r886J7317p003r539K0906m629J0759L214J230q003r61
15505H230l2873R087l567J2229j1033J5048R645j7253N653K1158p931j2121j0786
15492a4514j1843J1806J4059l77j288J2744r626k5407M839l073N556j4702M4974
15479A3148J606m2409j276J3428J6355J2823k9492j2006n166K955l073j1686J6731
15466b8062Q340n019j0545j1934K1641J5299Q02Q494M099j6003J0055p34Q347
15453D780R713L881k9247m730p617Q26m089J6003Q401j4084J1016p259j4609J1557
15439a5458K0006j8240K2606J6317n556j3385j3025L601M802j5766q917Q665j3333
15426b7683K0028J3062k1062j4137J3183J0091q742m1600P948K2820N927k1967
$$ plain form
15519 15292 6682 6827 -5175 -15061 2256 -4747 -14286 6620 1991 12750 15964 17194 9191 8230
15505 8230 -24643 -15556 -19123 -6894 -17927 -2879 6766 -10487 -4834 16324 8393 -3728 -14514
15492 -14514 -26357 -14551 -492 -869 -2157 10587 961 -24446 -19607 -22680 -17124 -31826 13148
15479 13148 14754 -27655 -28931 -15503 852 13675 -15817 -27823 -32989 -30034 -33107 -44793 -28062
15466 -28062 -19722 -24741 -35286 -47220 -25579 -10280 -9478 -984 3115 -12888 -2833 -3567 4780
15453 4780 14493 18374 -10873 -15603 -23220 -22394 -26483 -10480 -2079 -16163 -5147 -12406 -27015 -15458
15439 -15458 4548 -13692 8914 25231 19675 6290 -6735 -3134 1668 -14098 -23015 -14350 -27683
15426 -27683 -7655 5407 -15655 -29792 -16609 -6518 -15260 -56860 -48912 -26092 -20165 -42132
15414d2132K640K961P824J4664j5584P230J7707J4911o966k0479m439m731L1520
15401E126J8753N311j0241j3921j5956k8057K8547K6513M066k0413j8600j2484
15389c1356R896J4154l0140M451K5314Q264k499m447j7181o582J8897J5813l0341
15376b5757j9785j0075o216K7987J0461J5557j0482O140J9118R685j7347p196
15364g910j8148k4090r235M301J1361K7202R473J0814L8279k6147l3412k5410
15352d2922k2287J3529J2373K3698J4127j3992P063J6747k540k8426r476J2862
15340a9244k1393k205J1218N8924K6100m529l1173j7704j9312o405J4522l85J2392
15327H06R561j8645n864K8408P059k3848J4022l526l992k366K1855l596k3369
$$ plain form
15414 -42132 -39492 -36531 -28707 -14043 -29627 -22397 -4690 10221 3255 -17224 -21663 -26394 5126
15401 5126 23879 29190 18949 5028 -10928 -38985 -10438 16075 20141 -272 -18872 -31356
15389 -31356 -21460 -7306 -37446 -32995 -7681 583 -1916 -6363 -23544 -30126 -11229 4584 -25757
15376 -25757 -45542 -55617 -61833 -33846 -23385 -7828 -18310 -12170 6948 16633 -714 -7910
15364 -7910 -26058 -50148 -59383 -55082 -43721 -16519 -7046 3768 42047 15900 -17512 -42922
15352 -42922 -65209 -51680 -39307 -15609 -1482 -15474 -8411 8336 5796 -22630 -32106 -19244
15340 -19244 -40637 -42842 -31624 27300 53400 48871 17698 -6 -19318 -25723 -11201 -11586 806
15327 806 10367 -8278 -14142 14266 21325 -2523 11499 7973 3981 1615 23470 19874 -3495
15314c495j6652N026R765r378n817L3839J1903p326r373j6866j2046l364Q984
15301a4800Q55J0692K975j4942k1720P39J3991J063J848j8578j0329k06p781J1098
15287d5095K2129J3662m836l973K41k027j7052K0486o265j2732n638m378Q277
15274c7201M134L2461n683O963J3871Q243J9082k9561p891l3919n385L044o349
15261c8191o776k1706k94K0658k556j9042p031M633k025L4385M5345J2497j201
15248A8696j2751J2753J8175j4477j9052o494q529j5401k675k6002J5257J9377
15236b1123N420k168m021J0272j1387P722p930k0860J9968J6361p343R351m854
15223a0592J2335m327j9105j1660j0251J0413J487K869K1155J5461j3140l7948
$$ plain form
15314 -3495 -20147 -15121 -5356 -14734 -20551 13288 25191 17865 8492 -8374 -20420 -23784 -14800
15301 -14800 -13945 -3253 -278 -15220 -36940 -36201 -22210 -21147 -19299 -37877 -48206 -48412 -56193 -45095
15287 -45095 -22966 -9304 -14140 -18113 -17872 -19899 -36951 -16465 -22730 -35462 -41100 -45478 -37201
15274 -37201 -33067 -606 -6289 674 14545 22788 41870 12309 4418 -29501 -34886 -31842 -38191
15261 -38191 -44967 -66673 -66967 -46309 -48865 -67907 -74938 -70305 -72330 -37945 7400 19897 18696
15248 18696 5945 18698 36873 22396 3344 -3150 -11679 -27080 -29755 -55757 -40500 -21123
15236 -21123 -15703 -17871 -21892 -11620 -23007 -15285 -23215 -44075 -24107 -7746 -15089 -5738 -10592
15223 -10592 1743 -2584 -21689 -33349 -43600 -33187 -31700 -28831 -7676 7785 -5355 -43303
15211d3303r392K8202O941o740M389J5100K5830j0773j2909j9490k26Q091l0377
15198d4657j8366K3735L3112J1368M571M398j2356j6114J2580J0747m443K552
15186G127Q752K069o717k249L578O915j4093j996j34k0340l384K4414j5642k8117
15172c9817J465R89j5215L301J5208k9403j784J2599J1147K4644L115j0089Q904
15159a4936K0099j7405l0577j2242K1158K6547P006J2958l4249l751J547j4125
15147c7970k102l327K6804k025k3491J6678K7060j2191l402q070j5331k1555J804
15134e7118j537J7282j7741r306M6417K9761p830l9019O753L2320L4684O833Q329
15121D9828Q323J635m8965k8522J7495P544J1495j1508m8836r072L1161K7048
$$ plain form
15211 -43303 -52695 -24493 -17552 -24292 -19903 -4803 21027 10254 -2655 -22145 -22371 -14280 -44657
15198 -44657 -63023 -39288 -6176 5192 9763 14161 1805 -14309 -1729 9018 4575 7127
15186 7127 15879 17948 11231 8982 12560 19475 5382 3386 3252 -17088 -20472 3942 -11700 -39817
15172 -39817 -38352 -37363 -52578 -49277 -34069 -63472 -65256 -52657 -41510 -16866 -13751 -23840 -14936
15159 -14936 5163 -12242 -42819 -55061 -33903 -7356 -350 12608 -21641 -25392 -23845 -37970
15147 -37970 -40072 -43399 -16595 -18620 -42111 -25433 1627 -10564 -13966 -22036 -37367 -58922 -57118
15134 -57118 -58655 -41373 -59114 -68420 -22003 7758 -72 -39091 -32338 -18 34666 41499 49828
15121 49828 58151 59786 10821 -17701 -206 7338 18833 7325 -41511 -50583 -19422 7626
15109G626M610L470K4428n456k8950j4888j5154K1661j8227j9655N772L9436n97
15096D076J5854K250n0908J2357O20j6460j1598l930k878R452L687K3058M3368
15083B8948q963j4298J8082K1474k6j948N637l7373j8431K234K6901j1215k3194
15070a2172j6262N846j2870K235O231K1279j3501j2506M180K1570o84J4008P011
15057A4365j772k0528K1682L561M193O064K9175m827j9517R037j9902j8054j0358
15044f881j4168O218L4313R606p729q8o530Q418N495j4766k840j2057k1556m892
15030b7457p714j2115J2132J2282K4238j1330j84K4903J8202k5034m529K3529
15018B6923L999l5588k6530n873k885j2057j3832N159k2699J9803K7609K3290
$$ plain form
15109 7626 12236 15706 40134 34678 5728 -9160 -24314 -2653 -20880 -40535 -34763 4673 4076
15096 4076 19930 22180 -28728 -16371 -15751 -32211 -43809 -47739 -50617 -41165 -37478 -14420 28948
15083 28948 19985 5687 23769 45243 45217 43269 48906 11533 -6898 -4664 22237 11022 -12172
15070 -12172 -28434 -22588 -35458 -33223 -26992 -5713 -19214 -31720 -27540 -5970 -6654 7354 14365
15057 14365 12593 -7935 13747 17308 21501 27565 56740 51913 32396 41433 21531 3477 -6881
15044 -6881 -21049 -14831 19482 29088 21359 21271 14741 23159 28654 13888 11048 -1009 -22565 -27457
15030 -27457 -35171 -47286 -35154 -22872 1366 -9964 -10148 14755 32957 7923 3394 26923
15018 26923 30922 -4666 -31196 -37069 -39954 -52011 -65843 -60684 -83383 -63580 -35971 -12681
15006a2681K0897J4537o58r539l4786q573K6720L4168k4042j3746K7157Q147K7366
14993E4967L792o531o618k2733m81K5308J6371k4384l4794J5415R466n794K036
14980B6020L1401K3645q832Q626m716k1125j0253q50j7126k139j5799M040j613
14967A1279J7753K8450J0872J769j9435j0153N433L4327J4648p316R12K351J8602
14954A09492l2237j8474j1605k7059j219K1258L2330L8189P119j1561j1100k2760
14942G2373o293R622L783o693j743k8940J5856J8965j7831R443K474J5292l732
14929H2576k0562j1790k0076J2246R864p3J9778K8653J2478j4715L531Q988L0345
14916A41243j6755q172j7487j7424j9689r559M1570J0545P83J3451K102K4490
$$ plain form
15006 -12681 8216 22753 22095 12556 -22230 -30803 -4083 30085 6043 -7703 19454 27601 54967
14993 54967 58759 52228 45610 22877 22396 47704 64075 39691 4897 20312 29778 23984 26020
14980 26020 57421 81066 72234 80860 76144 55019 44766 43916 26790 24651 8852 12892 11279
14967 11279 29032 57482 68354 70123 50688 40535 45968 80295 94943 87627 88539 90890 109492
14954 109492 77255 58781 47176 20117 18898 40156 72486 110675 117794 106233 95133 72373
14942 72373 66080 75702 79485 72792 71049 42109 57965 76930 59099 68542 71016 86308 82576
14929 82576 62014 50224 30148 42394 52258 52185 71963 100616 113094 98379 101910 110898 141243
14916 141243 124488 116316 98829 81405 61716 52157 93727 104272 105055 118506 120608 145098
14904A45098m520k0154M872j011K063k5123L458J226J236K3174j5171q681J4370
14891A20837K4609R5j7867k3565o840k7135k8872j1957O736J2431K5716r306P92
14878F5674M658n590j1326J1372J6458K1102J066K202k82k0363m640p506l857
14865F8968N669J7210O231j4111l5257N171K268N954J749M611N04K463P161P10
14851G9301J1262P458J9819l1227l0668K9879J1787p659j1496k0366k4110j1987
14839B1993J6859r176p30K2619R865K841j1701K5377j2362m003m238L195q867
14826E1672j2757n89Q2k929q261j727L51j408P559j0891n161j9488J5000K1722
14812C3175J8663j3403J870L468q886k6232R929L5827J1714k0444l0456k9742
$$ plain form
14904 145098 140578 120424 125296 124285 126348 101225 104683 105909 107145 130319 115148 106467 120837
14891 120837 145446 145541 127674 104109 97269 70134 41262 29305 36041 48472 74188 64882 65674
14878 65674 70332 64742 53416 64788 81246 102348 103414 105616 105334 84971 80331 72825 68968
14865 68968 74637 91847 98078 83967 48710 53881 56149 62103 63852 68463 68967 71430 78591 79301
14851 79301 90563 98021 117840 86613 55945 85824 97611 89952 78456 58090 33980 21993
14839 21993 38852 29676 28946 51565 61430 64271 52570 77947 65585 61582 57344 60539 51672
14826 51672 38915 38326 38408 35479 27218 25491 25842 24434 31993 21102 15941 -3547 11453 33175
14812 33175 51838 38435 40305 43773 34887 8655 18584 54411 66125 45681 15225 -14517
14800a4517k1695L4827K9971R804j0184k6999P652j6262O017L762j2256j1341
14788b1221J3789P622p856k0618L0812K404P548J0152r688q182j3516m167l1344
14775d4265j8192J8215J6823J0977K2251k1322p14R944j3371j0471J637p125j7156
14762e2769J7079j5328K777O06P142L4165m175J5132K3272M482p307K99J1766
14749C7141j288J49k431o060J1890j200o303n923j4576o367J3770l2837q434J0255
14735a2214K4036J607K1478l2775p955L196l613k204q512K0170J7666J4966j5156
14722B0690m9877j585J7876L880j5291j1957K2268K6003J5748j1551l2359N716
14710a0439K522j1533j029K5107j8576l4627J24J0869K248l414J6600j3191j8637
$$ plain form
14800 -14517 -36212 -1385 28586 38390 28206 1207 8859 -7403 -1386 2376 -9880 -21221
14788 -21221 -7432 190 -7666 -28284 2528 4932 12480 22632 12944 4762 -8754 -12921 -44265
14775 -44265 -62457 -44242 -27419 -16442 5809 -15513 -16227 -6283 -19654 -30125 -28488 -35613 -52769
14762 -52769 -35690 -51018 -48241 -47635 -40493 -6328 -10503 4629 27901 32383 25076 25375 37141
14749 37141 35853 36002 33571 27511 39401 38201 31898 25975 11399 5032 18802 -14035 -22469 -12214
14735 -12214 11822 13429 34907 2132 -5823 -2627 -6240 -8444 -16956 3214 20880 35846 20690
14722 20690 -29187 -30772 -12896 -9016 -24307 -36264 -13996 12007 27755 16204 -16155 -10439
14710 -10439 -7917 -19450 -20479 4628 -13948 -48575 -48451 -37582 -35334 -38748 -22148 -35339 -53976
14697e3976K1879J2574N823k770J3716q366k60K2092K1407r582J4035j1104l118
14684B2350j6227l2069j6163K144J1338K411K5390K0940J4353m767j1598K5008
14672D3110j1651j6949j232k2847j4735K7948J7474N264j6426L973R30J2768j816
14659B5811k7410K9828J4162K6291M618k1471m0750j0077p50O904N445l0254J4985
14646b668K1921L9664O844l7851k0174j0859j921p946o487p110J2894j280N419
14633i554j0292j1014K101O684n657k77N887j2754j8553J6047j96J2676J1715
14620a3187l388m604J7917R993j8673j1482J2335N547K3598n072j3496K0638q290
14607A1836m5710K011M321O932m465j9815P280l619K4998Q161K202R510j0509
$$ plain form
14697 -53976 -32097 -19523 -13700 -16470 -2754 -11120 -11380 10712 32119 22537 36572 25468 22350
14684 22350 6123 -25946 -42109 -39965 -28627 -26216 -826 20114 34467 29700 18102 43110
14672 43110 31459 14510 13278 -9569 -24304 3644 21118 26382 9956 13929 14859 27627 25811
14659 25811 -1599 28229 42391 68682 73300 51829 11079 1002 252 7156 12601 -17653 -2668
14646 -2668 19253 58917 65761 27910 7736 -3123 -5044 -12990 -19477 -26587 -13693 -14973 -9554
14633 -9554 -19846 -30860 -28759 -22075 -27732 -28009 -22122 -34876 -53429 -37382 -37578 -24902 -13187
14620 -13187 -16575 -21179 -3262 6731 -11942 -23424 -11089 -5542 18056 12984 -512 20126 11836
14607 11836 -33874 -31863 -27542 -20610 -25075 -44890 -37610 -41229 -16231 -8070 -5868 3642 -6867
14594f867o41M865L196K1837P843l944j1254j406J1505K34o901P364k455j5874
14580G502j8812J5878O325k3965j0212K7269M1472p53m0602J6756j2294k0338
14568a1774O973r483j195J730q663j9328J6187L4679K246k474n287R324p147j5143
14554i355k673J0791P257j9515K4249m677j5697m987J3829M559J9037N519r51
14541B7386j1444J6723J6196l2650j6103R5m47p17k714n5022n469L2306J704J0753
14527a9403N594K2756K8095J0334k1389j0299j8476R577L117k1318k3189J3767
14515b0834N69P021K7002M347Q274j2750J723K7445k925R106j9573m1380m067
14502a6042J8980L066J0065J2014q279j1020K0228j6014k2128j306L5967R229
$$ plain form
14594 -6867 -7508 -2643 553 22390 30233 26289 15035 13629 25134 25368 18467 25831 23376 7502
14580 7502 -11310 4568 10893 -13072 -23284 3985 45457 44704 4102 20858 8564 -11774
14568 -11774 -4801 -14284 -15479 -13749 -22412 -41740 -25553 9126 11372 8898 3611 12935 5788 -9355
14554 -9355 -12028 -1237 6020 -13495 10754 6077 -9620 -14607 -778 3781 22818 28337 27386
14541 27386 15942 32665 48861 16211 108 203 -244 -961 -3675 -58697 -64166 -31860 -30156 -19403
14527 -19403 -13809 8947 37042 47376 25987 15688 -2788 6789 9906 -11412 -34601 -20834
14515 -20834 -20265 -13244 13758 18105 26379 13629 15352 42797 39872 48978 29405 -11975 -16042
14502 -16042 2938 6004 16069 28083 19804 8784 29012 12998 -9130 -10436 25531 34760
14490C4760o995L178p263J655J12k1736l0954J6800P209J1641m813l1942R165
14477a9183Q663o135n12J482K5548J5669j5393j6713R333j2740l911j6772Q893
14464b1771J1570J1728L5878r082k9846J5613O057j4636l6806O4J2405j1272j2203
14451d2301R655j8423m697L0430L1434k6360j574J8767J4061Q992p568m353p618
14438D45j5292m326J0034L232L612K7872M756J9934j4751k2012j8563k6816j0313
14425d2188K2441r520K2201O556j8758j4066J2134J1373k925m903j2903Q045J1737
14412a0776j9090L0926J0038L656j9628n5l07L133l1513j0207J310p575M745O415
14398c8928j5802L958O300q264L2144N668L1154M62o495K021q598j1595l6842
$$ plain form
14490 34760 27765 30943 23680 25335 25447 3711 -27243 -10443 -3234 8407 3594 -28348 -19183
14477 -19183 -10520 -16655 -17167 -15685 9863 25532 10139 -6574 2759 -9981 -13892 -30664 -21771
14464 -21771 -10201 1527 37405 28323 -1523 14090 20147 5511 -31295 -31231 -18826 -30098 -42301
14451 -42301 -32646 -51069 -55766 -25336 6098 -20262 -21836 -3069 10992 19984 12416 8063 445
14438 445 -14847 -19173 -9139 -5907 -2295 25577 30333 50267 35516 13504 -5059 -31875 -42188
14425 -42188 -19747 -29267 -7066 -510 -19268 -33334 -21200 -9827 -12752 -17655 -30558 -22513 -10776
14412 -10776 -29866 1060 11098 14754 -4874 -4929 -5236 -2103 -33616 -43823 -42513 -50088 -45343 -38928
14398 -38928 -54730 -50772 -44472 -52736 -20592 -14924 16230 16692 10197 12218 3620 -7975 -44817
14385d4817K8606J6987l0325R602j850k3926J3611K2893K7470j4949j9177j2366
14373b8241k6061J8041K2787j1586J6562q641m52m657l2396Q022J9242O505k460
14360b3335J3765Q478L480K1942k941N714K107n238k809j0255j3232j1371j1009
14347b4704L529K8657L80K5912J8400k6131n984j1800o391J688p191j0053q077
14334b1765j0066j1899j0944O07K1239J4396N214K3231m156j6676k3774R639J9028
14321e926J1829R653R867k0154k6991J8937j1180O777L6232J4836k1642j3323
14309H915Q44P204N389N721l1286j7370K0029p774p897j1881Q212K9970J7402
14296B7478O64j2814k3971R208J3376K44j0415J0476k5044Q280j276l5373k811
$$ plain form
14385 -44817 -16211 776 -29549 -19947 -21797 -45723 -32112 -9219 18251 3302 -15875 -28241
14373 -28241 -54302 -36261 -13474 -25060 -8498 -17139 -17591 -22248 -54644 -46622 -27380 -20875 -23335
14360 -23335 -9570 -1092 2388 24330 21389 27103 29210 23972 21163 10908 -2324 -13695 -24704
14347 -24704 -21175 7482 7862 33774 52174 26043 20059 8259 1868 3556 -3635 -13688 -21765
14334 -21765 -31831 -43730 -54674 -54067 -32828 -18432 -13218 10013 5857 -10819 -34593 -24954 -5926
14321 -5926 5903 15556 25423 5269 -21722 -2785 -13965 -7188 29044 43880 22238 8915
14309 8915 9759 16963 22352 28073 -3213 -20583 -554 -8328 -16225 -28106 -19894 10076 27478
14296 27478 28142 15328 -8643 565 13941 14185 3770 14246 -10798 -2518 -3794 -39167 -41978
14283d1978J9890M717K0975P09l1481K4824K4093j2806j2969J8186l041j4914
14271c795j8784j7996o096J5016L8501M742r750M014M834l596k453j4474p118
14258a6955R388q778J1774l2210P846J8159J9782j7060r904J9597J8481J7900
14246C8020j2115n449P187m503m174k472j4692p268R340k7284o996k2598r736
14233f2740Q673L7211J5973M104o380k164O515K276j7564j9550n178K1626K7989
14220A0791K0592k8461K889J4021j0623K114k8804j3423R836m367O977J5405K2271
14207A9218q18j0298N823J3477k4315q92L247O885J947o11p342k0061O138J6951
14193I349O01j8760j190o263J2970j8787j2467J1409N789K7q81j31j478J818R31
$$ plain form
14283 -41978 -22088 -17371 3604 4313 -27168 -2344 21749 8943 -4026 14160 11119 -3795
14271 -3795 -22579 -40575 -46671 -31655 6846 11588 1838 5852 10686 7090 4637 -9837 -16955
14258 -16955 -7567 -16345 -4571 -36781 -28935 -10776 9006 -8054 -17958 1639 20120 38020
14246 38020 25905 20456 27643 23140 18966 16494 1802 -5466 3874 -23410 -30406 -53004 -62740
14233 -62740 -54067 -16856 -883 3221 -3159 -5323 1192 3468 -14096 -33646 -38824 -17198 10791
14220 10791 31383 2922 5811 19832 9209 11323 -17481 -30904 -21068 -25435 -18458 -3053 19218
14207 19218 18400 8102 13925 27402 3087 2195 5442 12327 14274 13663 6321 -13740 -7602 9349
14193 9349 9950 -8810 -10000 -16263 -3293 -22080 -34547 -23138 -17349 -17322 -18203 -18334 -19812 -17994 -17063
14178a7063k3570j5688J5354J7867m696J9212L416P00J0500r76j0879Q026O461
14165H664K6421J0412K2646j6788k9194j944j622r65k5105o774n637J2111J100
14152f675k2664K0826K7051p036k8182k9534m305J4707J4124J9206Q412j7478
14140a1548J0509l893J3491K8373k2033l4351k1260J4491J507o023L331K2944
14128d462P213o082J8065p714N406k3246k9466k1601J4485K4993J5831N921j0388
14115a1045K4624K3840j3295m807L140k0247n402q019l1521m6187L455M5061K0951
14102a9452J4602j9271J3912J4650J6834k9964k5635O543k234l5898N249K8643
14090c2021J8394J5982Q372o216j3146l2146Q613L4222P773j2166N606L755P41
$$ plain form
14178 -17063 -40633 -56321 -40967 -23100 -27796 -8584 -5168 -4468 6032 5056 -5823 2203 8664
14165 8664 35085 45497 68143 51355 22161 20217 18595 17630 -7475 -14249 -19886 -7775 -6675
14152 -6675 -29339 -8513 18538 11502 -16680 -46214 -50519 -35812 -21688 -2482 5930 -11548
14140 -11548 -1039 -4932 8559 36932 14899 -19452 -40712 -26221 -24714 -30737 -27406 -4462
14128 -4462 2751 -3331 14734 7020 12426 -10820 -40286 -61887 -47402 -22409 -6578 -657 -11045
14115 -11045 13579 37419 24124 19317 22457 2210 -3192 -11211 -42732 -88919 -85464 -40403 -19452
14102 -19452 -4850 -24121 -10209 4441 21275 -8689 -34324 -27781 -30015 -65913 -60664 -32021
14090 -32021 -13627 2355 10727 4511 -8635 -40781 -32168 2054 9827 -2339 3267 7022 7763
14077G763l9401P050K4222k762R737J4075r649k0633m681k27Q00N475J3154J4486
14063A9409J6703n119J1709n974q787L493l0044k6636K8372M4902J8109l2576
14051C3561k5363K1408Q784j6537M936L92j3519j1113K075j2535l5120m89K7562
14038a5958r739q687R717J9827j65J2539J3889l8786j4242L2416K2318l2504k7393
14025c6768O513L2472L678K0301j4339M710k6075k0688P115K1518M530l912K5555
14012B4610m843j5174k9937k744N010j4519J3644J9524l1024J491L725J7412j4807
13999b7632K0840L9133J7972j4806k3775N480K5796k9483l4868J7420N424J2549
13987A4050n637p306j8384M379j91j0340L1846p351J4797K3733j8981j0970j4962
$$ plain form
14077 7763 -31638 -24588 -366 -3128 6609 20684 11035 -9598 -14279 -14506 -13706 -8231 4923 19409
14063 19409 36112 30993 42702 36728 27941 31434 1390 -25246 3126 48028 66137 33561
14051 33561 8198 29606 38390 21853 26789 27181 13662 2549 4624 -7911 -43031 -43520 -15958
14038 -15958 -25697 -34384 -24667 -4840 -5005 7534 21423 -17363 -31605 811 23129 -9375 -36768
14025 -36768 -30255 2217 5895 26196 11857 16567 -9508 -30196 -23081 -1563 2967 -945 24610
14012 24610 19767 4593 -25344 -28088 -23078 -37597 -23953 -4429 -35453 -33962 -30237 -12825 -27632
13999 -27632 -6792 32341 50313 35507 11732 17212 43008 13525 -21343 -3923 1501 14050
13987 14050 8413 1107 -17277 -12898 -13089 -23429 8417 1066 15863 39596 20615 9645 -5317
13974e317J6873N075Q869j3890k848J3446K476j9921r309j1374k9047R808J9004
13961a6155R457J8141K4963N157j9646P434J0755K939k6601q752k9826m3237O841
13948e8530Q836R063J4827J1233K617j4159K579k837n575K9927N644n312j7621
13935a9308J518k727j2427K6509K1774J2789M54j2466q457r179m818J1224j8681
13922a3795L2363n985k5274j8261O102J7597k715j4943P699L508o387j3851R368
13909b4574K6183j2642N324J0714k4016J771K3962J1176J253K1298L680k4177
13897A9952m8728j2087L1424M3884o196J8099J0218j6834P857k3648p695N4120
13885G0366K4177j6721k7991k429K1957l312j491M080O998J7865M9218L1424J7890
$$ plain form
13974 -5317 11556 16631 25500 11610 8762 22208 24684 4763 -4546 -15920 -44967 -35159 -16155
13961 -16155 -6698 11443 36406 41563 21917 29351 40106 43045 16444 7692 -22134 -65371 -58530
13948 -58530 -49694 -40631 -25804 -14571 -11954 -26113 -23534 -26371 -31946 -2019 3625 -1687 -19308
13935 -19308 -17790 -20517 -32944 -6435 15339 28128 28582 16116 7659 -1520 -6338 4886 -13795
13922 -13795 18568 12583 -12691 -30952 -24850 -7253 -9968 -24911 -17212 -13704 -20091 -33942 -24574
13909 -24574 1609 -11033 -5709 5005 -19011 -17240 6722 17898 19151 40449 44129 19952
13897 19952 -28776 -40863 -9439 34445 28249 46348 56566 39732 47589 23941 16246 70366
13885 70366 94543 77822 49831 47402 69359 66047 64556 68636 75634 93499 142717 174141 192031
13872A92031J6307j4304j5734j3713j7395m9605m1829p902J4824j3770k0167j2509
13860A6234k2793j3397K6435L663J0976j7850O058K5130j0200J145J7343J7614
13848F0358K119j0962j4790J3092K8645j5331l7888k5850J9846Q806r861rl937
13835A4238m488R663j1173L138J9877m099Q57k3711L2107J1190k6804j2000M844
13822A3639P507j5965j785J5851Q173k0696j8483J7523L5055l4565l3756O707
13810b0795K9024n181L437L342K13K7585r356l535Q581k1951j6852j1284Q943
13797g829l396K7336R752Q156O530j8662J7505K1223k1140j1007k6321k3832L1718
13784A0033L158m574n767K6422K406j5023j105o977m343l3830J1025L9870m370
$$ plain form
13872 192031 208338 194034 178300 164587 147192 97587 55758 47856 62680 48910 28743 16234
13860 16234 -6559 -19956 6479 10142 21118 3268 9326 34456 24256 25401 42744 60358
13848 60358 62477 51515 36725 49817 78462 63131 25243 -607 19239 28045 18184 18175 14238
13835 14238 9750 19413 8240 11378 31255 27156 28013 4302 36409 47599 20795 8795 13639
13822 13639 21146 5181 3396 19247 27420 6724 -11759 5764 40819 6254 -27502 -20795
13810 -20795 8229 3048 6485 9827 10040 37625 28269 24734 33315 11364 -5488 -16772 -7829
13797 -7829 -11225 16111 25863 34019 40549 21887 39392 60615 39475 28468 2147 -21685 10033
13784 10033 13191 8617 2850 29272 31678 16655 15550 8573 4230 -29600 -18575 21295 16925
13771A6925j3449q728k34J2178K091J9419Q841K579K1794M493J2793k4593k4619
13758B9490l5328r558L0901M934n623N5R239j1375K521j589J7624K0444R593k1326
13744D0002l2272l0884j4734M603M8379J5943j1503j4229j7356J7727O595R369
13732B1640p062k520j9028k1361k688L8983M3453j296k7607j1600O028m439j6925
13719d422k7905K4095N564O517K0604J7797j6035J223J7174k3129m071P661j2972
13706A2101J7195k289j9718j8409j981P098m600J3755J2149R572P299j3092l2977
13693a3897q923J3717Q415N499m663p488J1273J9035K2350J619J0065j7007p514
13680C2481j1823m3206J4908J7141j7475Q63K2289L575J611j7646k3913m341K0020
$$ plain form
13771 16925 3476 -5252 -5486 6692 8783 28202 37043 39622 61416 65909 78702 54109 29490
13758 29490 -5838 -15396 15505 20439 14816 14871 24110 12735 15256 13667 31291 51735 61328 40002
13744 40002 7730 -23154 -37888 -33285 15094 31037 19534 5305 -12051 5676 12271 21640
13732 21640 14578 12058 -6970 -28331 -31019 7964 51417 50121 22514 10914 16942 12503 -4422
13719 -4422 -32327 -8232 -2668 3849 24453 42250 26215 27438 44612 21483 17412 25073 12101
13706 12101 29296 27007 7289 -11120 -13101 -6003 -10603 3152 15301 24873 32172 19080 -13897
13693 -13897 -22820 -9103 -688 4811 148 -7340 3933 22968 45318 46937 57002 39995 32481
13680 32481 20658 -22548 -7640 9501 -7974 -7111 15178 18753 20364 2718 -21195 -25536 -5516
13667e516J9045J7108n599J0088k7802k1849M573l065L048M975r68j5481j6756
13654c8199J0056J7283J5172J544K3827q483l825M824j1766M320j6579j7228L678
13641a5376J8401k91j0357J1212k910j1899K6086j6132K60Q948j507k6242J1583
13628h224J4609n922K0320L9956J1760o217m2143j0224j163o395q811J4572J4243
13615B6361P834m7614k5292K0118K4495j8748k284J1706N080K2558P097J4410
13603D5721Q470j9947j295j1991j0025O779K2826r271p640k5060K9885L5361p773
13590E6040j5890J0700L502k2710n042m447L415Q657j3920K064L5249k2111m167
13577C1340K4956L179j2164J0762r512q793q021l46j2353l2251J0278r78j0640
$$ plain form
13667 -5516 13529 30637 25038 35126 7324 -14525 -9952 -13017 -9969 -4994 -5962 -21443 -38199
13654 -38199 -28143 -10860 4312 5856 29683 21200 17375 22199 10433 14753 -1826 -19054 -15376
13641 -15376 3025 2734 -7623 3589 679 -11220 14866 -1266 -1006 7942 6435 -19807 -8224
13628 -8224 6385 463 20783 60739 72499 66282 24139 13915 12752 6357 -2454 12118 26361
13615 26361 34195 -13419 -38711 -18593 5902 -12846 -15130 -3424 1656 24214 31311 45721
13603 45721 54191 34244 32949 20958 10933 17712 40538 31267 23627 -1433 28452 63813 56040
13590 56040 40150 50850 54352 31642 26600 22153 25568 34225 20305 22369 57618 35507 31340
13577 31340 56296 59475 47311 58073 48561 39768 31747 31401 19048 -13203 -2925 -3903 -14543
13564a4543k711O412J9171L1931j6926k2602k2363K62l0925K877K6499J3834O298
13551b786J6768K6896J9311p195r096k8933M23n881J2070J871r294J9004L2196
13538F5354j9558k5082j3212n056j4129J5096j1637k455J5250L294l4627j5222
13526d1984M2481J479M315J3488J6330L319J6734r018k3714j9743M270n891k706
13513f40J8240R428j3978K5333J6654p456j5196j5189j825j5018r989K4516O5287
13500H0167j5381o489r443j4219j6959R996m048K0778J814j8989k877q252J4708
13487C0806J7779r903k1494j5567J244K8102K9246J505j7827k2057K3097K8540
13475G3471k2409n274k5193J4007R047R265p200L077L1925j0848k4359K33N3534
$$ plain form
13564 -14543 -17254 -10842 8329 40260 23334 732 -21631 -21369 -52294 -49417 -22918 -9084 -2786
13551 -2786 13982 40878 60189 52994 43898 14965 15388 9507 21577 23448 14154 33158 65354
13538 65354 45796 20714 7502 2446 -11683 3413 -8224 -10679 4571 7865 -26762 -41984
13526 -41984 497 1976 6291 19779 36109 39428 56162 47144 23430 3687 7957 2066 -640
13513 -640 17600 27028 13050 38383 55037 47581 32385 17196 15371 353 -9636 14880 80167
13500 80167 64786 58297 48854 34635 17676 27672 23624 44402 46216 27227 24350 16098 30806
13487 30806 48585 38682 17188 1621 2865 30967 60213 61718 43891 21834 44931 73471
13475 73471 51062 45788 20595 34602 43649 52914 45714 48791 80716 69868 45509 45742 99276
13462I9276K3073j5831q048L8381J9001K4654M2554J6414M595K3185L7540L9118
13450C43912M11Q047L6383K3677L000j9590k3493j4089n105P343J0064O973J2932
13437C90465j5627r342j7943j9972m710k7385m5214j8832J7296N136r258J1698
13425B56312N1823K3283j695J3951K4390j4746J4729j7234O078J4570R458K3999
13413D04918L1623k318M087j9150l3117l9194n2124k5057N923j2920m277l7190
13401B21204m2316j3528j3940r604j6643J183j7042m486M370J2538K1072j2712
13389A30096L723K1906K4245q12R265K4299M2638M3175L7333R552L727J0382L2517
13376C92046L5127L2521J7468l2071m5610j4974M4009R058Q170P18j983k328j3394
$$ plain form
13462 99276 122349 106518 98470 136851 155852 180506 223060 239474 244069 267254 304794 343912
13450 343912 344323 352370 388753 412430 415430 395840 372347 358258 353153 360496 370560 377533 390465
13437 390465 374838 365496 347553 327581 322871 295486 250272 231440 248736 253872 244614 256312
13425 256312 308135 331418 329723 343674 368064 353318 368047 350813 356891 371461 380919 404918
13413 404918 436541 434223 438310 419160 386043 346849 294725 269668 275591 262671 258394 221204
13401 221204 178888 165360 151420 141816 125173 126356 109314 104828 109198 121736 142808 130096
13389 130096 133819 155725 179970 179158 188423 212722 255360 298535 335868 345420 349147 359529 392046
13376 392046 427173 459694 477162 445091 399481 384507 428516 437574 445744 446462 444479 442151 428757
13363D28757j3374k1327j8556j674J2372k3604l283p711l822p417j3849O838K2051
13350C55401J9432R03L1132M5275O0541L0013J4243R663j3798j4128k5213K4659
13338E38123J1941l1401k1921q309k3674p0960m6389k4438n503k4898l2956k0878
13326B38737k9398l3837j2305J586l3684j9923k1273M749K4223L883j4482l3652
13314G4624q240L1435M0381o478l4567O91K1395J6505q25j9392n938m22L6644
13301A45813R158j1914m394m758J5713N662k4135k666K7439o833j8566M1617p603
13288A64533m0857L354j0545J6903l7916j4624M161L5436J0801J504J80j5449
13276A17481k539j4766k234J2963j6427k067L6833R886J1745K7207j0038m722
$$ plain form
13363 428757 415383 394056 375500 373826 386198 362594 359311 351600 347778 340361 326512 333350 355401
13350 355401 374833 375736 406868 452143 512684 542697 556940 566603 552805 538677 513464 538123
13338 538123 550064 518663 496742 488433 464759 393799 347410 322972 317469 292571 259615 238737
13326 238737 209339 175502 163197 164783 131099 111176 89903 94652 118875 122758 108276 74624
13314 74624 66384 97819 138200 131722 97155 97846 119241 135746 134921 115529 109591 109169 145813
13301 145813 154971 143057 138663 133905 149618 155280 131145 128479 155918 149085 130519 172136 164533
13288 164533 123676 127030 116485 133388 95472 80848 85009 120445 131246 132750 132930 117481
13276 117481 114942 100176 97942 110905 94478 92411 129244 139130 150875 178082 168044 163322
13264A63322K9494n211m278l6224j4912K98J2Q547J8029J3234K0962o014m458
13251A82801j1851j3079J0197J7315J3819j3298O788J8890k0383j1412k6666q918
13239A44203K2316O066J7067q590K3345L4253J9168k2632m7082j6516P516J2319
13227A91433n361l6571j5982j0640k1374J2662M4879N5775K7489j4406m4519l0755
13215A52630R506J7971N4076k1880k6387J9100K0253K6144n807k476j2302k4513
13203B06315J3199L4178K8458j828j3960l3625k5727n388K6299J191l5566o746
13191A86800k661J0801J9177k3883k3307j5204q587J3056Q915o503j8819o368
13179A33417K5424J1151j5710M479K2243L599R180K3669k557J4076o481J9031
$$ plain form
13264 163322 192816 187605 183327 147103 132191 132489 132501 141048 159077 172311 193273 187259 182801
13251 182801 170950 157871 168068 185383 199202 185904 192692 211582 191199 179787 153121 144203
13239 144203 166519 172585 189652 181062 204407 238660 257828 235196 188114 171598 179114 191433
13227 191433 186072 149501 133519 122879 101505 114167 159046 214821 242310 227904 183385 152630
13215 152630 162136 180107 234183 212303 185916 205016 225269 251413 245606 243130 230828 206315
13203 206315 219514 253692 282150 280322 266362 232737 207010 201622 227921 229112 193546 186800
13191 186800 184139 194940 214117 190234 166927 151723 143136 156192 165107 158604 139785 133417
13179 133417 158841 169992 154282 158761 181004 184603 193783 217452 214895 228971 222490 241521
13167B41521M5965K7494J5586r38l2530l7005J8807Q717l5444K967K2636M888
13155B82664p1277n5214j4777K1734N198K3766K4871r372j5123k2627N184J7112
13143A92139l1767l846R802K326R160K538K7051Q46l181J6312o200P849K666j7039
13129B08656O983k1824K2933K333R895k0020r995l166M3623J4207k6571k1300
13117B05754J3702k2068r646q886m7553l5712j3643J8168L1026J9066n201j1554
13105A33453l7L3166n699k0903r925L0266J9654K887k584j3847O485L7810L2100
13092B42826n666k1301j7998l8645j0878J2967k0936N132M6559J1384J2466n238
13080B10672m9707Q963l691l2252K537K4742K9883J6827P871L390k818n758L7368
$$ plain form
13167 241521 287486 314980 330566 329628 297098 260093 278900 287617 252173 255140 277776 282664
13155 282664 211387 156173 141396 163130 168328 192094 216965 207593 192470 169843 175027 192139
13143 192139 160372 156526 166328 168654 177814 180352 207403 208249 205068 221380 215180 223029 225695 208656
13129 208656 215639 193815 216748 219081 228976 208956 198961 195795 239418 253625 227054 205754
13117 205754 219456 197388 187742 178856 131303 95591 81948 100116 131142 150208 145007 133453
13105 133453 133416 166582 160883 139980 130055 160321 179975 182862 180278 166431 172916 210726 242826
13092 242826 237160 215859 197861 159216 148338 161305 140369 145501 192060 203444 215910 210672
13080 210672 160965 169928 166237 133985 136522 161264 191147 207974 215845 219235 216417 210659 248027
13067B48027j4196J302J1890K3101o612j8203M110J5953J1555K5809K317L581
13055C08634Q439N0709M2003K026k1642j6317o101M87J2732L4448J1120O125K3441
13042D56104k446N025j4571l016L6588L7955K5584J9614K2323M0584K5376M3187
13030F92307J0566M5445O1283N1434M2436Q4422J25325J21279J10863J00606J11040
13019A557006J41709J39493J52178J91668J87231K21312K08232K38935K83321
13010C321085L29984M14624N26001O03086P11293Q51629R98488J172492J470416
13001A0399098J860885K334830K914135L596664M371718N278545O220362O659759
12993D3635996O025352M462894K924451J986262J850746K018529J549730Q60425
$$ plain form
13067 248027 233831 235133 247023 270124 263512 245309 249419 265372 276927 302736 305053 308634
13055 308634 317073 367782 409785 411811 390169 373852 367751 368238 380970 415418 426538 432663 456104
13042 456104 453658 458683 444112 441096 477684 515639 541223 560837 583160 623744 649120 692307
13030 692307 702873 748318 809601 861035 903471 987893 1113218 1234497 1345360 1445966 1557006
13019 1557006 1698715 1838208 1990386 2182054 2369285 2590597 2798829 3037764 3321085
13010 3321085 3651069 4065693 4591694 5194780 5906073 6757702 7756190 8928682 10399098
13001 10399098 12259983 14594813 17508948 21105612 25477330 30755875 36976237 43635996
12993 43635996 49661348 54124242 57048693 59034955 60885701 62904230 64453960 65314385
12985F5314385N24381K58015n03758j415726j741107j293012j79443Q90076O01922
12976F2455733j284103l454434m511445m108224l271499k754780k246033j232475
12968C9592740K98422K155790M006045N370791N478319M200233K178026P67856
12960F4048222L16875N19939Q80951Q92945O78557M70588K84729l46291j367390
12951F6379125k047741j942104j075324q45190k499304m993537o367875o228498
12943D0379552n228971m421644m174872m220800l873115k927112j844529r79049
12935A2709460l82998J3813L40319O13064Q65493J149379J575644K088193K715250
12926B1687617L474317M289607N111019N731805N901420N950606O060318O290916
$$ plain form
12985 65314385 65838766 66096781 65593023 64177297 62436190 61143178 60963735 61853811 62455733
12976 62455733 61171630 57717196 53205751 49097527 45826028 43071248 40825215 39592740
12968 39592740 39891162 42046952 46052997 51423788 56902107 61102340 63280366 64048222
12960 64048222 64365097 64885036 65765987 66658932 67337489 67808077 68092806 67746515 66379125
12951 66379125 64331384 62389280 61313956 60468766 57969462 52975925 46608050 40379552
12943 40379552 35150581 30728937 26554065 22333265 18460150 15533038 13688509 12709460
12935 12709460 12326462 12340275 12680594 13293658 14159151 15308530 16884174 18972367 21687617
12926 21687617 25161934 29451541 34562560 40294365 46195785 52146391 58206709 64497625
12918F4497625N870341L992593J436488k11271l34639L30157J014888J221039
12910G7817221M76735r35484j749803j730768j471222j227358j058194j074896
12902F9046231j741860l302860m784997n208685m290832k615581o39566J502474
12894D7964324L298879M185344M491828M418873M289878M378162L271314R20054
12886G7218656q12945j282938k92054J423979J881563O57066p52918j623258k304039
12877G4113112k860406l190846l359718l400310l688946m967743o734753p799845
12869C8110545p741717o687953m973196l437164k505448j997875j576120j211189
12861G979883r30547o79727n18285m40268l58498l22195k91170k72531k26216
$$ plain form
12918 64497625 70367966 74360559 75797047 75585776 75251137 75581294 76596182 77817221
12910 77817221 78293956 77358472 75608669 73877901 72406679 71179321 70121127 69046231
12902 69046231 67304371 64001511 59216514 54007829 49716997 47101416 46461850 47964324
12894 47964324 51263203 55448547 59940375 64359248 68649126 73027288 76298602 77218656
12886 77218656 76405711 75122773 74830719 76254698 78136261 78793327 78040409 76417151 74113112
12877 74113112 71252706 68061860 64702142 61301832 57612886 52645143 45910390 38110545
12869 38110545 30368828 23680875 18707679 15270515 12765067 10767192 9191072 7979883
12861 7979883 7049336 6369609 5851324 5411056 5052558 4730363 4439193 4166662 3940446
12852C940446k01026j63694j31378j45903j45911j63492j51045j18126j24984
12843B594887j08536j34216j12607n6492p3833o6789q1953j00409o3293k0241
12833A776518m2845n8302p0204n2000n7564m1078n4811n6806n6090p3436n4724
12822A158658j4092l6023j5131k9545k7840l2011j2449N0m752l6742m1485l2608
12810H76030j6365l5470j1924j243J7862j6489k4924n948K6116J6719m657m1347
12798G78360j1334R226m212m544j5972p886j2884Q619J2934K677j2658p158O085
12785G41253j8866j4002r884j6864l9871l7447j6780j4595j7946J782j4402k7012
12773E15366J2366K9510k6565k7820j864K3661n925k174R559R524N53n823J0248
$$ plain form
12852 3940446 3739420 3575726 3444348 3298445 3152534 2989042 2837997 2719871 2594887
12843 2594887 2486351 2352135 2239528 2183036 2109203 2042414 1960461 1860052 1796759 1776518
12833 1776518 1733673 1675371 1605167 1553167 1495603 1454525 1399714 1342908 1286818 1213382 1158658
12822 1158658 1144566 1108543 1093412 1063867 1036027 1004016 991567 991617 986865 950123 908638 876030
12810 876030 859665 824195 812271 811028 828890 812401 787477 781529 807645 824364 819707 778360
12798 778360 767026 776252 772040 767496 751524 743638 730754 739373 752307 754984 742326 735168 741253
12785 741253 722387 708385 698501 681637 641766 604319 587539 572944 554998 556780 542378 515366
12773 515366 527732 557242 530677 502857 500993 524654 518729 516555 526114 535638 536191 530368 540616
12760E40616j6094m185j067k7895o440k8369j529K6738J0226l0038j1969J4214
12748D64208k1078k8192l1008k8784J3062K9164K8344J9209j2373l4056k2108
12737C76388l6192R251j0874j0679L2672J2307m937k7836q44J561j7869K493j6870
12724C08571l9304j3383R269J1477P121j6606k46L4639J9787j7507r768R206Q133
12711C11389L08J469o661k1953k4265n135j1206j2439l334j9911m478J2915r306
12698B07393J4241J0131K7185L414o539Q937p472j758J7716o621k0253j8093l33
12685B27948O288j7746L662k0304r463Q929L8925O759Q240J7147o930q769q816
12672B45870K2422j6828k7439j0237J2308l649o866J664j0463j0405J8955n536
$$ plain form
12760 540616 524522 520337 519270 491375 484935 456566 455037 481775 492001 461963 449994 464208
12748 464208 443130 414938 383930 355146 368208 397372 425716 444925 432552 398496 376388
12737 376388 340196 349447 338573 327894 360566 372873 367936 340100 339256 340817 322948 325441 308571
12724 308571 269267 255884 265153 276630 283751 267145 266899 301538 321325 303818 294050 303256 311389
12711 311389 311697 313166 306505 284552 260287 255152 243946 231507 228173 208262 203784 216699 207393
12698 207393 221634 231765 258950 262364 255825 264762 257290 255532 273248 266627 246374 228281 227948
12685 227948 234236 216490 220152 199848 190385 199314 238239 244998 253238 270385 263455 254686 245870
12672 245870 268292 251464 224025 213788 226096 222447 215581 217245 206782 196377 215332 209796
12660B09796k7695K371K3800n666j2460M729k671J6612j5930j4630J0855J9961
12648B09072J4784J8054j1474p230K56K9158K3275m992n534j193P979j2167N248
12635B65236j0903m8381l7952k1087l253K3485K834O356R785q744j1508j6817
12623A49051r089K1432O814P65J8576K534O908J2946J8296J561m6686j7917j3173
12610A52018M079j5064M926M2810L2488K3956P573m663j2700k8170k6781r514
12598A70958l9019j9239J7539P309Q92o435m1561j4814J2045J4849K3610J8809
12586A44943l4048k1966M043J8026J0262O870p81K6633J3716O6477M9122J5322
12574B98619j5930k5335o841l7611l1650J1703J9048J2879J0704R272J3594J3438
$$ plain form
12660 209796 182101 184472 208272 202606 190146 194875 192204 208816 192886 178256 189111 209072
12648 209072 223856 241910 230436 223206 223462 252620 275895 270903 265369 264176 272155 259988 265236
12635 265236 254333 205952 168000 146913 143660 167145 169979 176335 186120 177376 165868 149051
12623 149051 139962 161394 168208 168973 187549 190083 196991 209937 228233 229794 183108 165191 152018
12610 152018 156097 141033 145959 188769 221257 245213 252786 248123 235423 207253 180472 170958
12598 170958 131939 112700 130239 137548 138440 132005 90444 75630 87675 102524 126134 144943
12586 144943 110895 88929 92972 110998 121260 128130 127349 153982 167698 234175 283297 298619
12574 298619 282689 257354 250513 212902 181252 192955 212003 224882 235586 244858 258452 271890
12562B71890k8738l2008R526M798j4556j6592K08o820j8849j015j4843K317K9681
12549A84999J1019j7201L145K0583J1181J7915l253K2155q321K247Q263K3805
12537B76537j6700L8372M2844K6780J2353K1540M0764L0453J7895J7591N830J9545
12525E33804J4822J8845j5242o666j0020L5034Q272k5529K5085K1607L1516J5185
12513F46713j5624p784n927l3657m1886k0330l1199l4930l5603j0038k5129P395
12501C92001K3315m211L0879J9361r194J0822J5785J9484K3200M7805o453k9814
12489E32980j1021L140J5438l012Q738J7055J5257L0876M1999J4503r586r64J0225
12476F65628M1454K7036M7418M5120K6317J771p1526n5040n7163m5476k3203M14
$$ plain form
12562 271890 243152 211144 220670 225468 210912 194320 194528 187708 168859 167844 153001 155318 184999
12549 184999 196018 178817 181962 202545 213726 231641 228388 250543 242222 244469 252732 276537
12537 276537 259837 298209 341053 367833 380186 401726 442490 472943 490838 508429 514259 533804
12525 533804 548626 567471 552229 545563 535543 570577 578849 553320 578405 600012 631528 646713
12513 646713 631089 623305 617378 583721 541835 521505 490306 455376 419773 409735 384606 392001
12501 392001 415316 411105 441984 461345 452151 462973 478758 498242 521442 569247 562794 532980
12489 532980 521959 525099 540537 537525 546263 563318 578575 609451 651450 665953 656367 655403 665628
12476 665628 707082 734118 781536 826656 852973 854744 783218 728178 671015 625539 602336 602750
12464F02750K7838M2894K6421O618M7292Q3864O1756K7979j0130m4887k4414l9976
12452H08005n2091k5297k1580l7047n055n207o47p405q223J3079l807j349L210
12439F56586l351k9698k7318l0525j5530J0304j1954l555J6519J7688l0483k5028
12427E23655J2021J5678P762j381L2566N8382L9719K2267J5274L1842L9959L5733
12415H33477R466N251M0407M9847N0530J1119l6229l3220K665J7282L4504J4034
12403I99133J5152L8215N2135Q1653Q9510O1737K9389P660m7059r7518j24794
12392A105213j31112o2701k3279O987K3966K8191M6972O4346L1821j6010l2680
12381A041714m9954j04791j28400j16041q9712p7478n5778l8645k6328j1703J3299
$$ plain form
12464 602750 630588 673482 699903 706521 753813 837677 899433 927412 917282 872395 847981 808005
12452 808005 755914 730617 709037 671990 666935 661728 661081 653676 645453 658532 654725 653376 656586
12439 656586 653235 623537 596219 565694 550164 560468 548514 544959 561478 579166 548683 523655
12427 523655 535676 551354 559116 557735 590301 648683 688402 710669 725943 757785 797744 833477
12415 833477 842943 848194 888601 938448 988978 1000097 963868 930648 933313 950595 985099 999133
12403 999133 1014285 1052500 1104635 1186288 1275798 1337535 1366924 1374584 1327525 1230007 1105213
12392 1105213 974101 911400 888121 895108 919074 947265 994237 1058583 1090404 1074394 1041714
12381 1041714 991760 886969 758569 642528 552816 475338 419560 380915 354587 342884 356183
12370C56183o628J119J0397n099p524j1144l4146J5103L481r596j6246j2783l7624
12357B45493j3193N891l9813j5242J0559j2497j2226k9290j0345M674L658J3284
12345A50953K0353r642r747j2956j1662L0931L9940J0359l230R755R103L3924
12333B58081K7464J1024K8333L490k0379m497K3345L8242O0222O8899N9587L9902
12321E93713j8905l7923l3900l3087m0738k3139O89L2398L0761K5507P471J0482
12309E13329K1374J4237m4745n4574n2504l7117l6050l0226l8305k975P135O682
12297B66261l349k1426j2461j5658l536o373N366m505J7334M199l3893k281J7234
12284B06912j6412L2486P666k5364o437q30j0307L064K4298k2887m4416j4776
$$ plain form
12370 356183 349555 350674 361071 355972 348448 337304 303158 318261 321742 312146 295900 283117 245493
12357 245493 232300 238191 198378 183136 193695 181198 168972 139682 129337 134011 137669 150953
12345 150953 171306 161664 151917 138961 127299 158230 198170 208529 205299 215054 224157 258081
12333 258081 285545 296569 324902 328392 308013 303516 326861 365103 425325 494224 553811 593713
12321 593713 574808 536885 502985 469898 429160 406021 406710 439108 469869 495376 502847 513329
12309 513329 534703 548940 504195 449621 397117 360000 323950 293724 255419 252444 259579 266261
12297 266261 262912 241486 229025 213367 209831 203458 208824 204319 221653 225852 191959 189678 206912
12284 206912 190500 222986 230652 205288 198851 198021 187714 190778 215076 192189 147773 132997
12272A32997O54K9319j6147k1379q466P096J5504J3706k8630J420o937j7671R261
12259A10727N767K708M156J2603p562k2186J2801L4136o955j3958q471J3032Q32
12246A37630p129j9079J2593r376K929O820m0139k9205K5041K9205K8130M6108
12234A83528K4511j8774M80J1903n2050r202K0553k9945j5399n990L8749O8988
12222B17352K6035o383K0613n964r348J2557J5083L90P694J0974J2771m837j1299
12209B85638j3386J0609L0374m279k02K1448K2689O970n957r592m0796l4426j8734
12196B50356j7785R217r49J4592J2465j2087k9403p26K0384p487J1688K3138K2822
12183B96225J9999n27p298l0554j2453R788L7768O462J9346M520K2718N406k0950
$$ plain form
12272 132997 133651 162970 146823 125444 116978 124074 139578 153284 124654 126074 119137 101466 110727
12259 110727 116494 119202 123358 135961 128399 106213 119014 153150 146195 132237 123766 136798 137630
12246 137630 130501 111422 124015 114639 117568 124388 84249 55044 80085 109290 137420 183528
12234 183528 208039 189265 189745 201648 149598 140396 160949 131004 115605 109615 148364 217352
12222 217352 243387 237004 257617 251653 242305 254862 269945 270335 278029 289003 301774 296937 285638
12209 285638 272252 282861 313235 308956 308754 330202 352891 359861 353904 344312 303516 269090 250356
12196 250356 232571 241788 240839 255431 267896 255809 226406 225680 246064 238577 250265 273403 296225
12183 296225 316224 315697 308399 277845 265392 275180 312948 319410 338756 343276 365994 371400 350450
12170C50450p132j4546l1667j0807L1270M3404L9716J6677K1297R5636J06615
12159F40913J01606J60985J76057K52807K34175K16610J34642l8635k22880l04099
12149A352181k83790k37564j36826r3676p0666p2501n0819j1441k948J5341l436
12138D03855j3573j1833m7N95J9704K1690M3014L2035K0146M7140M0200J7246
12126F20172K8323J457P246L7897L5615M1297P2536J06779J16139J46241J97869
12115A411571J91337K21332J74542M4064p5347j67706k45290k37761k13937j66422
12105I36383q7566n9900n4142k8205k6272k4251j225k800l1868m079k1169r514
12093E85392m1985k356J1513k1363l288J7035J4134L6469O196M5281M4908L2295
$$ plain form
12170 350450 343318 328772 297105 286298 317568 360972 400688 417365 438662 534298 640913
12159 640913 742519 903504 1079561 1332368 1566543 1783153 1917795 1879160 1656280 1352181
12149 1352181 1068391 830827 694001 600325 529659 457158 406339 394898 391950 407291 403855
12138 403855 390282 378449 378402 378997 398701 420391 463405 495440 515586 562726 602926 620172
12126 620172 648495 649952 657198 695095 730710 772007 844543 951322 1067461 1213702 1411571
12115 1411571 1602908 1824240 1998782 2042846 1967499 1799793 1554503 1316742 1102805 936383
12105 936383 848817 788917 734775 706570 680298 656047 654822 652022 620154 616075 594906 585392
12093 585392 543407 541051 552564 531201 527913 544948 559082 595551 601747 647028 691936 724231
12081G24231J2351J5991M761L2050J4613L5424K9728P2114P8986O8413O2494J05716
12069A256872P4268Q0745J14003J08242J16177J23810J30419J71631K18085K76693
12059B670945L50513M17308M93523N89795P06300Q53543J047955J261292J496834
12050I888008J741045K096395K477990K677618K876080L524706M733750O305500
12042C6321092P886487R046147R669848R623757P355691J865465m508635p995991
12034F9263861p596098n336695l273680j567373L37578K579752M471457N234147
12026F4112949N093948M570631L144289m14302o025546j0984737j2534656j0798753
12018C6163823q004794n799972m379534l219725k358997j794408j435569j189326
$$ plain form
12081 724231 736582 752573 757334 789384 803997 839421 869149 941263 1020249 1088662 1151156 1256872
12069 1256872 1331140 1411885 1525888 1634130 1750307 1874117 2004536 2176167 2394252 2670945
12059 2670945 3021458 3438766 3932289 4522084 5228384 6081927 7129882 8391174 9888008
12050 9888008 11629053 13725448 16203438 18881056 21757136 25281842 30015592 36321092
12042 36321092 44207579 53253726 62923574 72547331 79903022 81768487 77259852 69263861
12034 69263861 61667763 56331068 53057388 51490015 51827593 54407345 58878802 64112949
12026 64112949 69206897 73777528 76921817 76507515 70481969 59497232 46962576 36163823
12018 36163823 28159029 22359057 17979523 14759798 12400801 10606393 9170824 7981498
12010G981498r01995p15664n23031l67095l03680k15842j71409j03550p7101p2755
12000D529376o4994o9379p7324l3720K3685N2311Q0217J02025Q8869J20748J67834
11989D919648K40368K89200L93782N05531N94746O71035P75780Q95761J066257
11980A0352108J300258J650631K065434K527347L066224L620756M364981N240208
11972C4187947N928163O709471Q063762J0017459J2313122J4113821J4505655
11965A05839400J3839153J2131865Q166036K707029k885704p646553j0031317
11958A22119909r590305o967076l143384R63418M516452O929931P610056O331996
11950A28770997L545237m72903n498397j0266954j3637002j5662021j6455630
$$ plain form
12010 7981498 7079503 6363839 5840808 5473713 5170033 4954191 4782782 4679232 4602131 4529376
12000 4529376 4464382 4395003 4317679 4283959 4307644 4359955 4440172 4542197 4631066 4751814 4919648
11989 4919648 5160016 5449216 5842998 6348529 6943275 7614310 8390090 9285851 10352108
11980 10352108 11652366 13302997 15368431 17895778 20962002 24582758 28947739 34187947
11972 34187947 40116110 46825581 54889343 64906802 77219924 91333745 105839400
11965 105839400 119678553 131810418 139976454 142683483 139797779 132151226 122119909
11958 122119909 112529604 105562528 102419144 103382562 107899014 114828945 122439001 128770997
11950 128770997 132316234 131843331 126344934 116077980 102440978 86778957 70323327
11943G0323327j5298991j2301316r096886o595075m798883l503696k638620k160741
11935A3929119j858555j582100j241306r24156o84067n38897m76432l64635k88645
11926E970326k02940j60459j73131j56045r2681p5078o9613m0208j2680J8972
11916E006463L7397N0267J05117J33655J34203J75511J95514K21721K39957L05378
11906F605183L53131M60258O67077R06100J154476J445344J766289K125754K529947
11897A8013559K923816L496901M319090N490735O721203P682934Q456677Q391727
11889F5496642O325300K610416j526755n153145o950736o566126m716097k437209
11881D7082290k07743J966755L671812M486935M233738L188772J895251L325l615658
$$ plain form
11943 70323327 55024336 42723020 33626134 27031059 22232176 18728480 16089860 13929119
11935 13929119 12070564 10488464 9247158 8323002 7638935 7100038 6623606 6258971 5970326
11926 5970326 5767386 5606927 5433796 5277751 5185070 5109992 5040379 5000171 4987491 5006463
11916 5006463 5043860 5094127 5199244 5332899 5467102 5642613 5838127 6059848 6299805 6605183
11906 6605183 6958314 7418572 8085649 8991749 10146225 11591569 13357858 15483612 18013559
11897 18013559 20937375 24434276 28753366 34244101 40965304 48648238 57104915 65496642
11889 65496642 71821942 74432358 72905603 67752458 60801722 54235596 49519499 47082290
11881 47082290 46874547 48841302 52513114 57000049 61233787 64422559 66317810 66321135 62705477
11872F2705477q244283j0911954j0531812q360525n868582l872735k581561j937464
11864A0396561j623328j305710r85610p28936o35230o18008n32501m14428l32560
11855C220250k28300j13357q5478r1899j01647q4305q6187q2455r6867j03628
11845B146127n4951n7899n1883l4500k3969j97j0022m6895o8069o7989q8100j47773
11833A493880j78955j35814p4638m8862l7503o735o111l0509M991K15j7827k4941
11821I37191r068O843j5433l5007l8679k1642j9813O871j0323j2617j4968R562
11809G82917r121j8409J1094K52Q244K7754L0990J6283L3454Q989n738j9319l1001
11796H36389n7346o1299o8610m9218o2204l2467M245K8793J5743K2122M0539M0729
$$ plain form
11872 62705477 54461194 43549240 33017428 24656903 18788321 14915586 12334025 10396561
11864 10396561 8773233 7467523 6481913 5752977 5117747 4499739 3967238 3552810 3220250
11855 3220250 2991950 2878593 2793115 2701216 2599569 2515264 2429077 2346622 2249755 2146127
11845 2146127 2091176 2033277 1981394 1946894 1922925 1922728 1912706 1865811 1797742 1729753 1641653 1493880
11833 1493880 1314925 1179111 1104473 1055611 1018108 1011373 1005262 974753 979744 979959 962132 937191
11821 937191 928123 934966 919533 884526 845847 824205 804392 811263 800940 788323 773355 782917
11809 782917 773796 755387 766481 766733 774977 802731 833721 850004 883458 892447 886709 867390 836389
11796 836389 779043 717744 649134 599916 537712 505245 509490 538283 554026 576148 616687 657416
11784F57416L1777K7424L6431Q692K4392J2021L6646J6299J8853J6106O069m477
11772H87649J3894J7764K2282K0266J9930M3514K3677j742n057m91L1459J8073
11760A091218l734L8392Q5150P3561N9555P1003K5630O8994Q4845Q8780J07041
11749A790435P7410M6810O6553M6753M6143M3255O4324J15543J45121J78738K27558
11738B848643K73162K42306K40756K80680L00428L16003M09849M71734N92918
11729E976479P36639Q32329R66993J240449J551026K001583K534274L149533L834755
11720B2824060M488645N152830N809287O506740P416055Q904512J1440934J5486510
11712H8029573K1306150K8457983L5923735M2852602M7003414M1075018J8889798
$$ plain form
11784 657416 689193 716617 753048 761740 786132 798153 834799 851098 869951 886057 892126 887649
11772 887649 901543 919307 941589 961855 981785 1025299 1048976 1047234 1042177 1041686 1073145 1091218
11760 1091218 1087484 1125876 1211026 1284587 1344142 1415145 1440775 1509769 1594614 1683394 1790435
11749 1790435 1867845 1914655 1981208 2027961 2074104 2117359 2181683 2297226 2442347 2621085 2848643
11738 2848643 3121805 3364111 3604867 3885547 4185975 4501978 4911827 5383561 5976479
11729 5976479 6713118 7545447 8512440 9752889 11303915 13305498 15839772 18989305 22824060
11720 22824060 27312705 32465535 38274822 44781562 52197617 61102129 72543063 88029573
11712 88029573 109335723 137793706 173717441 216570043 263573457 304648475 323538273
11705C23538273j3586022m2528021n7675445n7282752m6097806l1909899k0049550
11698E4408778j2143215p449003m703763l122584k285879j892687j763346j708079
11690A9340222j517648j197468p76764k98070J75360O74287J241173J872783K576190
11681B2090065L303591L968539M521176N026490N497876O131453P374295R553724
11673F7467209J2961869J7841555K3970566L0956819L8051838M2934841M1686268
11666B75870965L1269668J1176394j5450859l9962711n3936185n5145287m5957618
11659A07864367l2830644k1110388j2879302p914973n049731l392135k569856
11652B2117338k266020k222602k233424k141018j943564j632836j303073j015113
$$ plain form
11705 323538273 309952251 267424230 209748785 152466033 106368227 74458328 54408778
11698 54408778 42265563 34816560 30112797 26990213 24704334 22811647 21048301 19340222
11690 19340222 17822574 16625106 15848342 15550272 15725632 16399919 17641092 19513875 22090065
11681 22090065 25393656 29362195 33883371 38909861 44407737 50539190 57913485 67467209
11673 67467209 80429078 98270633 122241199 153198018 191249856 234184697 275870965
11666 275870965 307140633 318317027 302866168 262903457 208967272 153821985 107864367
11659 107864367 75033723 53923335 41044033 33129060 28079329 24687194 22117338
11652 22117338 19851318 17628716 15395292 13254274 11310710 9677874 8374801 7359688
11644G359688p42883n16373l70099k90665k58024k59794k56617l29009l58721
11635C977503l41231k88560k07480j31864q7545o1654l4897o9496q3997r6069
11625B574710j32886j51296j16741r9937j06171j03731q2272o7392m0302P900
11615A681882Q529L2945K0400j553M791j900j2337l18k7466J8688M8676N4970
11603A827307J26444J57019J57640J98270J73311J42232Q2656n9182j65057k51564
11593B389076k56893k17069j40775p0269l3279k3705k8408k3203K0165j2105R03
11582A604438P321k9275o4584q1358j35929j17570q1872r4368o7279m0794p5676
11571H23054l7776n303K2183J2211O3351N8547R427L735M6408Q3991J07718J57924
$$ plain form
11644 7359688 6616805 6100432 5730333 5439668 5181644 4921850 4665233 4336224 3977503
11635 3977503 3636272 3347712 3140232 3008368 2920823 2859169 2824272 2754776 2670779 2574710
11625 2574710 2441824 2290528 2173787 2073850 1967679 1863948 1781676 1714284 1673982 1681882
11615 1681882 1690411 1723356 1743756 1742203 1746994 1745094 1732757 1732439 1704973 1723661 1772337 1827307
11603 1827307 1953751 2110770 2268410 2466680 2639991 2782223 2864879 2805697 2640640 2389076
11593 2389076 2132183 1915114 1774339 1704070 1670791 1647086 1618678 1595475 1615640 1603535 1604438
11582 1604438 1611759 1582484 1517900 1436542 1300613 1183043 1101171 1006803 939524 898730 823054
11571 823054 785278 779975 802158 814369 877720 936267 945694 949429 995837 1079828 1187546 1345470
11559A345470J86523J88110J49808P9232k5096o8202j56455j75272j82050j52224
11549A189844j24517p8747l4975j0646j8372k1166p578o834J9503J7313j8920
11538I04905n6914o7600p8906o3368l8576k4123r741M192K9952L3035M0508O0599
11526G33963O1505J10155R9128Q7344Q6544Q4500P1035N9101K7429L9427M9309
11515A509440N0469K6535K246j3037o5400r2828q2913p1313p9089q8436p8809
11504A016865j24257j28394j15373q2706n7379m3817o2030k2231l269k1360j5855
11493C40194l9842l5037k7292j3902k3251Q009K9705J758j3617l563R575j4042
11481B18695N322K9958J2724K3285n699N62L415o273J3613N026M625L0770J5973
$$ plain form
11559 1345470 1531993 1720103 1869911 1949143 1924047 1855845 1699390 1524118 1342068 1189844
11549 1189844 1065327 986580 951605 940959 922587 901421 893843 887009 906512 923825 904905
11538 904905 847991 780391 701485 638117 599541 575418 565677 569869 599821 632856 673364 733963
11526 733963 795468 905623 1004751 1092095 1178639 1263139 1334174 1393275 1420704 1460131 1509440
11515 1509440 1559909 1586444 1588690 1575653 1510253 1417425 1334512 1263199 1184110 1095674 1016865
11504 1016865 892608 764214 648841 566135 508756 464939 402909 380678 377409 356049 340194
11493 340194 300352 265315 238023 224121 200870 208879 238584 240342 226725 223162 232737 218695
11481 218695 224017 253975 266699 289984 284285 284847 288262 281989 295602 300628 305253 336023 351996
11468C51996j4234l2467L001J7999L4678L0649k9268k8530J7686m298j0899k3006
11456C13307k8477N88L5717M8604J4614L7852K3797N2355Q0396M4246j0184l4564
11444E78251j3111m1879o1821k3250j0818k6701M074M8907L1144K6017L3256L0679
11432E74748Q54m7412n5363m4519k6072k8032l9546j8770R099k0749l4473q017
11420B61748j0401m0133O879j7206j7049j2563q017P7j2404p498K3991J1623J4393
11407A93440J2379K31j7799j2198m2142k6279K1733L0335k012p94L2754L0258
11395B19906j4452p680L2489N5355Q0887O2590M3566P7565m4990j50908o9254
11384B85074m9490p1490l5747K2355K0679j1728r008K4635K4065Q250q042l3734
$$ plain form
11468 351996 337762 305295 308296 326295 360973 391622 362354 333824 351510 347212 336313 313307
11456 313307 284830 285418 321135 369739 384353 422205 446002 498357 578753 622999 612815 578251
11444 578251 565140 523261 461440 438190 427372 400671 404745 453652 484796 510813 544069 574748
11432 574748 575602 528190 472827 428308 402236 374204 334658 315888 324987 304238 269765 261748
11420 261748 251347 211214 218093 200887 183838 171275 163258 163335 150931 143433 167424 179047 193440
11407 193440 205819 206050 188251 176053 133911 107632 129365 159700 157688 156894 189648 219906
11395 219906 205454 197774 230263 285618 366505 429095 472661 550226 505236 354328 285074
11384 285074 235584 164094 128347 150702 171381 159653 150645 175280 199345 207595 199553 165819
11372A65819j4778k8041k3019j1202O317L4052L0263K7695L2261J6155K7078n951
11360B56649m8750m0789k1374p121j7669l7535j8755K1656R910m116k5413j9573
11348D7120K5939J0066j6357k6436P3R915k2552L186J2652J2733L6780K8066J3251
11335A34436j775j0686l9220k04j0067j8493L659K1737k8722k1019K7523J7853
11323G5022J4875J8763k180j2335R77j3669K2215o022o682m668j9362O735K6211
11310I9880K6676K391o327J0320P49J2825N835k185K0204P820K5847L4499M0144
11297B78678N4578O7551P8380Q0180Q2086j8844j14463j52647j03650n3422l6123
11286A62304l6603r367K0176j8478k6568M888M129k8484K248j4541j7258K3225
$$ plain form
11372 165819 151041 123000 99981 88779 95096 129148 159411 187106 219367 235522 262600 256649
11360 256649 207899 167110 145736 138615 120946 83411 64656 86312 96222 92106 66693 47120
11348 47120 73059 83125 66768 40332 40405 50320 27768 30954 43606 56339 93119 121185 134436
11335 134436 132661 121975 82755 82551 72484 53991 57650 79387 50665 29646 57169 75022
11323 75022 89897 108660 106480 94145 95122 81453 103668 97646 90964 86296 66934 73669 99880
11310 99880 126556 128947 122620 132940 133689 146514 152349 150164 170368 178188 204035 238534 278678
11297 278678 333256 400807 479187 559367 641453 622609 508146 355499 251849 198427 162304
11286 162304 125701 116334 136510 118032 91464 96352 100481 71997 74245 59704 42446 65671
11274F5671J4475k490M575K9988K3197L1930L4682J6209N9836M9582J6324J3879
11262C57858M891J8897L9408M6407P1903J28537J68953K02034K49657K42121J70445
11251A701111M4328q8651k34720l04162k73745k35507j57978j00307o7573k6512
11241B56284j1950k2840l8052k0611J638k8283O476K8414M687k1309j272L5391
11229A88573K5774M107J9668J1476K7013M4355L9315L4698L9366Q4681J03137
11218F22163J26230J96055K17845K35144K69401J87752Q3437L8475n7279j62120
11208A757103k47941l03270l02070k35352j62148r5264m7028o2930n7976j0314
11198B32810j4204k5632m6451l7583J1256K2965m133l7473k7862k9445j7002M3795
$$ plain form
11274 65671 80146 77656 82231 112219 135416 167346 202028 218237 278073 327655 343979 357858
11262 357858 362749 381646 421054 467461 539364 667901 836854 1038888 1288545 1530666 1701111
11251 1701111 1745439 1656788 1422068 1117906 844161 608654 450676 350369 282796 256284
11241 256284 244334 221494 183442 162831 164469 136186 142662 171076 175763 154454 153182 188573
11229 188573 214347 218454 238122 249598 276611 320966 360281 394979 434345 519026 622163
11218 622163 748393 944448 1162293 1397437 1666838 1854590 1938027 1976502 1919223 1757103
11208 1757103 1509162 1205892 903822 668470 506322 411058 364030 301100 243124 232810
11198 232810 218606 192974 146523 108940 120196 143161 139028 101555 73693 44248 27246 71041
11186G1041j622k8177L421n627j9557M171Q720J1884M1854L514K413N393o046
11173I1382n664m844j5684j8080j3493M436K6174K8034J4633k886j2104r928j2042
11160F9934K6972n688k1611J1885K1530N408o762m690J5881O11l4206j6419r83
11147F1862j2333k115j8536j0560N674R0j0092K6535M5266Q98k4340J2683J961
11134G6993L74J6204m92j2523n485j7016r50k591K600r60j0707K1839p912j9302
11120D0072L486J9452j0937J0949J623j6896j9030J2974J2921j8030k0663P309
11108B3230J7213j8743j0403R659R178J4362j9946J2530j717L4635J0136k5845
11096E4289k2563J2182R047N846O858k091J996N706k0959l445L1661J819o50k0610
$$ plain form
11186 71041 69419 41242 44663 39036 19479 23650 32370 44254 86108 89622 92035 97428 91382
11173 91382 85718 80874 65190 47110 33617 38053 64227 92261 106894 104008 91904 81976 69934
11160 69934 96906 91218 69607 81492 103022 108430 101668 96978 112859 113470 79264 62845 61862
11147 61862 49529 47414 28878 18318 23992 24082 13990 40525 85791 86689 62349 75032 76993
11134 76993 77367 93571 93079 80556 75071 58055 57105 54514 57114 56154 45447 67286 59374 40072
11120 40072 43558 63010 52073 63022 64645 47749 28719 41693 54614 36584 15921 23230
11108 23230 40443 21700 11297 20956 30134 44496 24550 37080 35363 69998 80134 54289
11096 54289 31726 43908 52955 58801 65659 63568 65564 71270 50311 46866 78527 80346 79696 59086
11082E9086K6533R81l0639l4709k5620j0175K3378J1006O90M2635n170n520J8110
11069G0586n467k8334n057J1452M273K900p194k2004K0712K6846j5238q106k1188
11056B4181K3482J7071j0661j4673k857J9970J7278k3580j1772N124J6025J0074
11044F9662j2519k5212o52m071j3148p665k2926L3023J9933j0439K1291k4612
11032B2665j1250J0968J5949K7880J0593j4152j6801J12j852J1605K3173J2672
11020I1562j7428l9444j1005M3078R537l9841j2010k010P126K01R002J4228J1439
11007F4435N172k8929k2013J4551k3162J051J4354N983m688P079P771k4042r527
10994H035L5909J6804m41j352J3075n253l3251j7760M387k0859R851Q422J7785
$$ plain form
11082 59086 85619 86600 55961 21252 -4368 -14543 8835 19841 20531 63166 57996 52476 70586
11069 70586 65119 36785 31728 43180 47453 50353 43159 21155 41867 68713 53475 45369 24181
11056 24181 47663 64734 54073 39400 36543 56513 73791 50211 38439 43563 59588 69662
11044 69662 57143 31931 31279 27208 14060 6395 -16531 16492 36425 25986 47277 22665
11032 22665 11415 22383 38332 66212 76805 62653 45852 45964 44112 55717 78890 91562
11020 91562 74134 34690 23685 66763 76300 36459 24449 22439 29565 29766 38768 52996 64435
11007 64435 69607 40678 18665 33216 10054 11105 25459 31442 26754 33833 41604 17562 8035
10994 8035 43944 60748 60307 58955 72030 66777 33526 15766 20153 -706 9145 17567 35352
10981C5352K41n315K873J255K7910K0515K122k8155q141Q330J2597q503k778k3861
10967C4442j1269m138O090m528p331k0062N984K245M6042J5339j0417j7330j9520
10954A5547J915L75N15j8816q793Q445Q91J0497L3932N710K4852J0846l0659k4420
10940C0837P882p443N120J3626Q190o568j6393j9010J1748j7052j2507J4459J9349
10927C2238j6758k9579L235J7000P732J0069rk387j0837j6728j2794J1464K6160
10914A8806j2445k4060K3976K7001K607o951J1491J1114j7153j7427J2218O323
10902C5500J359j2597k260j3758K686n150m33j8976k0451L0042L1797L1805o07
10889E8957k0260n252j1526j4041J0996k257j7284p381j0344p877K2076J4285
$$ plain form
10981 35352 35593 30278 33151 34406 62316 82831 84953 56798 48657 56987 69584 61081 58303 34442
10967 34442 23173 19035 25125 20597 13266 -6796 -812 1433 47475 62814 52397 35067 15547
10954 15547 17462 17837 18352 -464 -9257 -812 79 10576 44508 50218 75070 85916 55257 30837
10940 30837 38719 31276 36396 50022 58212 51644 35251 16241 27989 10937 -1570 12889 32238
10927 32238 15480 -14099 -10864 6136 13868 23937 23928 21541 10704 -6024 -18818 -7354 18806
10914 18806 6361 -17699 6277 33278 35885 28934 40425 51539 34386 16959 29177 35500
10902 35500 36859 24262 22002 8244 10930 5780 5347 -13629 -34080 -4038 27759 59564 58957
10889 58957 38697 33445 21919 7878 18874 16617 -667 -8048 -18392 -26269 -4193 10092
10877A0092K4545j5937L3492J1143l1237K1783O650j0228J1376o052l0278J3324
10865C8673K093q323K3747J4430J2074J7973l9810q357Q52P300K4910M174J2317
10852A02053m795j4547j2452j3112k7424M117J731r146k7196J5786J2763r187
10840A8591k3879k4780J1896j1409k493J7308o378K316J9543L267J1983J3339
10828B9304l452N974O365j835l484n913Q687J0439m145j1775Q932J0082Q162j6721
10814D0620k2769L1125Q740r301N712p124l5750l931O854m414Q263K0503L400
10801D1928q715K968R553O822j6192m165j61O21M250K465l915J2161Q148J8404
10787G4172J595m1092j9621K893J6547J6319j2647p726j1008J3144J9078q555
$$ plain form
10877 10092 34637 18700 52192 63335 32098 53881 60531 50303 61679 55627 25349 38673
10865 38673 40766 32443 56190 70620 82694 100667 60857 52500 53352 60652 85562 89736 102053
10852 102053 97258 82711 70259 57147 29723 33840 35571 26425 -771 15015 27778 18591
10840 18591 -5288 -30068 -18172 -29581 -32074 -14766 -21144 -18828 715 3982 15965 29304
10828 29304 25852 31826 38191 36356 32872 26959 35646 46085 41940 30165 39097 49179 57341 40620
10814 40620 17851 48976 57716 48415 54127 47003 11253 7322 14176 9762 18025 38528 41928
10801 41928 33213 36181 45734 52556 36364 32199 32038 32659 36909 39374 35459 47620 55768 74172
10787 74172 75767 34675 15054 17947 34494 50813 38166 30440 19432 32576 51654 43099
10775D3099q155j0651l755R329K764J5949l610k46j987N531p616J3211j6421q864
10761B8578J2896j3093J9010K2046k751L412l015j3274j4668N110o251j7338k6639
10748e977J4491j056K569K9040j0716p337J6395J3324k6560j6023L149J552l955
10735H896J3347J4962L187J8609M3309j2392j8302j3047k643K0074L0180m128
10723A02052l5340K3394L2414j1338k0950j784L4046k2923k1888p442k0987j2359
10711C6895k3027j8223p624l280J1217K0253O228J7086L3610p012j0573K610j0965
10698D7195k6455k10K7574N6051j5354k4726L038j0451k5228l4201O924K542O447
10685A3146Q953P077K2998K6051J2716N216O813j0343k9288k7232K236k519n757
$$ plain form
10775 43099 34944 24293 20538 29867 32631 48580 44970 44724 42737 48268 40652 53863 37442 28578
10761 28578 41474 28381 47391 69437 66686 70098 67083 53809 39141 44251 38000 20662 -5977
10748 -5977 8514 7458 10027 39067 28351 21014 37409 50733 24173 8150 11299 12851 8896
10735 8896 22243 37205 40392 59001 102310 89918 71616 58569 55926 76000 106180 102052
10723 102052 66712 90106 122520 111182 90232 88448 122494 99571 77683 70241 49254 36895
10711 36895 13868 -4355 -11979 -15259 -4042 16211 22439 39525 73135 66123 55550 58160 47195
10698 47195 20740 20530 48104 104155 88801 64075 67113 56662 31434 -2767 4157 6699 13146
10685 13146 22099 29176 52174 78225 90941 96157 102970 92627 63339 36107 38343 35824 30067
10672C0067j98J4932M842k4837j795K3748J6972P583j1565k2792l713m880J7816
10659D6180K5386J7834l586j8966M334j3220j7464j400L670K048M806p942j2906
10646B8774k75J1144J5555n623K034K7331P482N21j7313j1235j4286r874j523
10633C2712O82O264J456k1297o517P634L2228P99l378P270j2211l731k642j2404
10619B6865r54O99o87J1494m494o000J5269J4660j4460k0363J1032P815r503q881
10605B2492p03j0832J5688L0957k325R062r430m292k865k61j9412j0367J1187
10592B8899J7490J8706n795k6839j4055R037L394M28O376Q60Q284j6159J9332
10579D9958M6482k4238l0132j5203J3935L4584L115j6794r758k5245j3431K084
$$ plain form
10672 30067 29869 44801 49643 24806 23011 46759 63731 71314 59749 36957 33244 28364 46180
10659 46180 71566 89400 85814 66848 71182 57962 40498 39098 42768 44816 49622 41680 28774
10646 28774 28499 39643 55198 49575 51609 78940 86422 86943 69630 58395 44109 34235 32712
10633 32712 33394 39658 41114 19817 13300 20934 53162 53961 50583 57853 45642 41911 39269 26865
10619 26865 25911 26610 25923 37417 32923 26923 42192 56852 42392 22029 33061 40876 31373 22492
10605 22492 21789 10957 26645 57602 55277 64339 54909 50617 47752 47491 28079 17712 28899
10592 28899 46389 65095 59300 32461 18406 27443 30837 31265 37641 38501 46785 30626 49958
10579 49958 96440 72202 42070 26867 40802 75386 78501 61707 51949 26704 13273 15357
10567A5357j5537M103L8607J9058j2124J3681L595m542J4775O93j2576j9578J2749
10554E8261j8921J0438K4046L568j2383k2018j3070M61O770r144R426J5844J665
10541E4943K382r350o703l583j1015R162k8782K0941L6476j237j1523o334o033
10528C9344j5335j5332j1876m482L6737L3113j1208l0803m4204M329M8179M7224
10516G5686J9168l884j4190j9508N66J6826J7354J4182j5579p136j6430k7815
10504C9240M052l337K1061L3705J3148j3583l281l6143M967L5693m132q099O621
10491H9912m876j330K061j2882J9956K2259j9330k3812q357j9793L3009K9573
10479A06390j1874k4655J1630M375P139J5022L302k8620l2548L6J1149o036J5365
$$ plain form
10567 15357 -180 3923 42530 61588 49464 63145 66740 62198 76973 77666 65090 45512 58261
10554 58261 39340 49778 73824 77392 65009 42991 29921 30382 37152 28008 37434 53278 54943
10541 54943 57325 47975 41272 37689 26674 35836 7054 27995 64471 63234 51711 45377 39344
10528 39344 24009 8677 -3199 -7681 29056 62169 50961 20158 -24046 -19717 28462 75686
10516 75686 94854 90970 76780 57272 57838 74664 92018 106200 90621 83485 67055 39240
10504 39240 43292 39955 61016 94721 107869 94286 91005 54862 59829 95522 91390 83291 89912
10491 89912 85036 83706 85767 72885 92841 115100 95770 71958 63601 43808 76817 106390
10479 106390 94516 69861 81491 85866 93005 108027 111329 82709 50161 50197 61346 55310 70675
10466G0675J4722J9987r532j6789J6413k1079l877M957P401J9485M407n83Q117
10453A14304J8765m638k0684l1974k0178R464j8248J0614p84k5884k5233j2089
10441f565O786K7768M6591J061p247K109j4504N688q60J7339M2225K8705k1268
10428A27828l7652k5093M391j0020k8090k0037K376J9664J9790K0632j0618k348
10416F0823L600j983J0374K362j2879o070J9594L890Q468J0557J811o903m5040
10403D8604k4722J1110J283j5188J4386J4824m974m013K8455K5834q030p51R022
10390I5840k201L8104K09l2274N558p238l2336L1968J9763j499K8759R005l2482
10377A21176k867K692N979J1928R893j8443l1071L2701J9142k4026j3213K8034
$$ plain form
10466 70675 85397 105384 95852 79063 95476 74397 70520 75477 82878 102363 106770 106187 114304
10453 114304 133069 128431 107747 75773 55595 65059 46811 57425 56641 30757 5524 -6565
10441 -6565 221 27989 74580 75641 68394 70503 55999 61687 60827 78166 120391 149096 127828
10428 127828 90176 65083 69474 59454 31364 11327 13703 33367 53157 73789 63171 60823
10416 60823 64423 62440 72814 75176 62297 56227 75821 79711 88179 98736 100547 93644 48604
10403 48604 23882 34992 36275 21087 35473 50297 45323 41310 69765 95599 87569 86818 95840
10390 95840 93639 131743 131952 99678 105236 97998 65662 97630 117393 115894 144653 153658 121176
10377 121176 118309 121001 126980 138908 148801 130358 99287 131988 151130 127104 113891 141925
10365A41925J2739j285O99K1148l890K0424k1766q480O222J0203K8876L3694N4718
10352B95227M8907K5507J9592P0914O3823O0677P1540P9898Q9683J06269J20214
10341A052251J33684J38712J66356K27778K36939L18917M22059M96503O74174
10332C867373Q89555J101142J424549J698585J719151J583133J512538J321053
10324A5117079Q15807Q6627m97346r07748j221380j651117j930340k007415j674223
10315F129944j369309j169534r80408p05288m28323k45191j43453j13571j01004
10306H73863p0622o2513p8657o9391n1084m4810o5853m3836m8224k2046k5095
10295B91732j8633o095j3051l9584j8079O892j3124J2855Q928q53j4083K5821
$$ plain form
10365 141925 154664 153379 154078 175226 171336 191760 169994 161514 167736 177939 206815 240509 295227
10352 295227 344134 369641 389233 460147 523970 584647 656187 736085 825768 932037 1052251
10341 1052251 1185935 1324647 1491003 1718781 1955720 2274637 2696696 3193199 3867373
10332 3867373 4756928 5858070 7282619 8981204 10700355 12283488 13796026 15117079
10324 15117079 15932886 16019513 15522167 14614419 13393039 11741922 9811582 7804167 6129944
10315 6129944 4760635 3591101 2610693 1905405 1477082 1231891 1088438 974867 873863
10306 873863 803241 740728 662071 592680 541596 496786 430933 387097 338873 316827 291732
10295 291732 273099 267004 253953 214369 196290 203182 190058 202913 211841 210988 196905 222726
10283B22726K1056j5462P387k7329o703k7519k4237K6304J337l1276k3384j0490
10271A12410K1423J9851M609r11J1603P112J1207J05j3737l396M46L288o522m795
10257A62693k337L9003Q908k4908j4811j1024q060k3166j6063J1318J3726r959
10245A25320j0021k099K161K6912K4691o685j7618j3667J48J430l3610j8994K2750
10232A00718L8718J0634m1340K6245R611m1699j0749J77o524P596J2392j1878
10220I3901j2056O344l189J314k7477L712J9981J7471J3649j1736j5961K3245
10208A09198J8886k977N535k4419R362j2450L173J2202j0024l168j3096N425J4600
10195A12247K7658L464J9367L387j4096l2285j7068p801L099k6539R820K4857
$$ plain form
10283 222726 243782 228320 235707 208378 201675 174156 149919 176223 177560 146284 122900 112410
10271 112410 133833 153684 158293 157382 168985 176097 187304 187409 173672 170276 170722 174010 167488 162693
10257 162693 160356 199359 208267 183359 168548 157524 149464 126298 110235 121553 135279 125320
10245 125320 115299 113200 115361 142273 166964 160279 142661 128994 129142 130572 96962 77968 100718
10232 100718 139436 150070 108730 134975 144586 102887 92138 92315 85791 93387 105779 93901
10220 93901 81845 88189 85000 86314 58837 62549 82530 100001 113650 101914 85953 109198
10208 109198 128084 125107 130642 106223 115585 103135 106308 118510 108486 105318 92222 97647 112247
10195 112247 139905 143369 162736 166123 152027 119742 102674 94873 97972 71433 81253 106110
10183A06110m757k3066J3670J4079j4846M671R499n171R004J3467k5282m8218
10171D9160K2704J1152j361J8887K7455J5078m71n058Q881m947K136M210k366
10158A45460r906j2534J0902J2957R976K6715N428m2162n335J3510R355l860j6948
10145A43558J780J5929q727l0574j6249l3799k9761p214q947q7J9583R546L0265
10132H5303M9868K0932j4295o323Q716J1695J546k5838J7053L2268J7625P864
10120B06414K582J432J2199j3268q81k8948l3683K923K1020o743k5644N439j7039
10107A25803p185j5290J6738K510j224l649M244L570j1672R330L4163k0683j3118
10094A23537q166j8957m680L4925J2636k216k1654J5555J4688J6222N18R680k9530
$$ plain form
10183 106110 101353 78287 91957 106036 91190 95861 105360 100189 109193 122660 97378 49160
10171 49160 71864 83016 81655 100542 127997 143075 142604 137546 146427 141480 143616 147826 145460
10158 145460 135554 123020 133922 146879 156855 183570 188998 146836 141501 155011 164366 160506 143558
10145 143558 145338 161267 152540 121966 105717 71918 42157 34943 25996 25909 45492 55038 85303
10132 85303 135171 156103 141808 135485 144201 155896 157442 131604 148657 180925 198550 206414
10120 206414 208996 210428 222627 209359 208478 179530 145847 148770 169790 163047 137403 142842 125803
10107 125803 118618 103328 120066 122576 121352 117703 121947 125517 113845 123175 157338 136655 123537
10094 123537 115371 96414 91734 126659 139295 137079 115425 130980 145668 161890 162408 172088 142558
10081A42558M975J5292k774k3232k6511J5255J5521k721l1612j6536J8934N762
10069A14911K2279N278j117q013k8298k883L881N532j36M0275O152p74L1650O302
10055A95039k8102K2534J1514j7331K6279L099J4584K0778j4833M445K8225J2701
10043B78932J0219J5949q902L025J3952J354J6015M5261M6905N0170O1571J02720
10031F37171J88893K5675k48337k07761j10149o8490m2247l3133k4529K0655R856
10020A47604L7614J0976J2653K56J593j3977k923k9758N417N748P316k8464j4180
10007A39875P469P480j2118l0109Q040J0933j7668j0545m151j4232K6006J2601
9995A23581O263J0814O090J2347P201l0853j7372O26l2979L548K9770K2637k1433
$$ plain form
10081 142558 147533 162825 160051 136819 110308 125563 141084 138363 106751 90215 109149 114911
10069 114911 137190 142468 141351 133338 105040 102157 106038 111570 111434 151709 157861 157087 188737 195039
10055 195039 166937 189471 200985 183654 209933 213032 227616 248394 233561 238006 266231 278932
10043 278932 289151 305100 296198 299223 313175 314529 330544 375805 422710 472880 534451 637171
10031 637171 826064 851739 603402 395641 285492 217002 174755 141622 117093 137748 147604
10020 147604 185218 196194 208847 209103 210696 196719 193796 164038 169455 175203 182519 154055 139875
10007 139875 147344 154824 142706 112597 120637 131570 113902 103357 99206 84974 110980 123581
9995 123581 129844 140658 146748 159095 166296 135443 118071 118697 85718 89266 119036 141673 120240
9982A20240k9793L2562o332K0323K0710k659j2666r743O820L1955J252r689q326
9969A54654k007q878J22k6255l2098p229N307L3212N687j6108k9322j192K6749
9956A02642J3559L1333K3318P21r777j2569J3168j3859j793l312j097J9780M1065
9943B03179P709k3098O572r855j9241j3982l65L723J4310J0915J4393N397K771
9930B02428K473J0639J4175J0829P377J4650k642j0395J1097J9660O805j1386
9918B75710k1123k2242j0380J4533j5286k4548L233Q588J0748r366J235Q439J830
9905B21371J9524J1590k5140k1445J5222K4043j7704o297J0566n280j3243k12
9893B12995K4242K613k9866R31k910n250k1954L5687P839p501k708J0984L8742
$$ plain form
9982 120240 90447 123009 116677 137000 157710 155051 142385 132642 139462 171417 172669 162980 154654
9969 154654 152647 143769 143891 117636 85538 78309 83616 116828 122515 106407 77085 75893 102642
9956 102642 116201 147534 170852 171573 161796 149227 162395 148536 146743 143431 142334 162114 203179
9943 203179 210888 187790 194362 184507 165266 151284 150919 154642 168952 179867 194260 199657 202428
9930 202428 204901 215540 229715 240544 247921 262571 259929 249534 260631 280291 287096 275710
9918 275710 254587 232345 221965 236498 221212 196664 199897 208485 219233 209867 211102 219541 221371
9905 221371 240895 252485 227345 205900 221122 245165 227461 221164 231730 226450 213207 212995
9893 212995 237237 239850 209984 210915 208005 202755 180801 216488 224327 216826 214118 225102 263844
9880B63844J8135j2913j9954J5066j0752n945l408N533j3099l9310L008L5053
9868B35258O778o123J5596Q557l0340J1937K1812j5179j2848j9965J8054L3190
9856B66727j3026k0686J5497K3625J2315j8173l5268r446j0617L035P444J891
9844B23318j1018L861J9360L3727J0093j6049j8629n031Q396L2132K8064R073
9832C17297J3443J8005m650k851j2589k3949p996l479j4319l2935R597j1391k419
9819B41764J3634j625l360k1922q749O511o917j8903o913J5311K0357K8056O555
9806B63799J6413K7478L2434J0132l9559l8178j1469K7633M7981r59k8171n079
9794C02455K822j1328J878k598j1262J7216J245P401J6599L238j4371q747m291
$$ plain form
9880 263844 281979 269066 249112 264178 253426 247481 244073 249606 236507 197197 200205 235258
9868 235258 242036 235913 251509 260066 229726 241663 263475 248296 235448 215483 233537 266727
9856 266727 253701 233015 248512 272137 284452 266279 231011 221565 210948 213983 221427 223318
9844 223318 212300 216161 235521 269248 279341 263292 244663 239632 248028 280160 308224 317297
9832 317297 330740 348745 344095 341244 328655 304706 296710 293231 278912 245977 255574 244183 241764
9819 241764 255398 253773 250413 228491 219742 226253 219336 200433 193520 208831 229188 257244 263799
9806 263799 280212 307690 340124 350256 310697 272519 261050 288683 336664 335705 307534 302455
9794 302455 305277 293949 295827 293229 281967 299183 300428 307829 324428 327666 313295 304548 300257
9781C00257j1550j6488N548K0083J5573m599k3119J722K4329J9036l3656j1765
9769B85371L0538L6137k885j5430m874K1841k1294m3745J2049j035L4004J5675
9757C46352Q789j594l064Q25O709j2146j8409j3516l617J0827K1011o683k1956
9744C13528p97P922m346J3805J9052R215k4441p358j918J9364M1889O57j3325
9731C73247j5646j0033j229l2633j3260l651M208l1417q448L2552K0858J6911
9719C31459K2839J1761j7861n454M3921K0690j9728m8150j9598J4515l620p802
9707C22972K6956j4342K7694J8441L246K2775J5306l783K1505m221r653J9963
9695D46859J0255j8130p194N642J1903j5994j0518k8726o679Q014J2026k07J4311
$$ plain form
9781 300257 288707 272219 277767 297850 313423 308824 285705 287427 311756 330792 297136 285371
9769 285371 315909 352046 349161 333731 328857 350698 329404 285659 297708 296673 330677 346352
9757 346352 355141 353547 350483 351308 358017 345871 327462 313946 310329 321156 342167 335484 313528
9744 313528 312731 320653 316307 330112 349164 358379 333938 326580 324662 344026 385915 386572 373247
9731 373247 357601 347568 346339 313706 300446 296795 301003 269586 261138 293690 314548 331459
9719 331459 354298 366059 348198 342744 386665 407355 387627 339477 319879 334394 330774 322972
9707 322972 349928 335586 363280 381721 384967 407742 423048 419265 440770 436549 426896 446859
9695 446859 457114 438984 431790 437432 449335 433341 422823 394097 387418 395432 407458 407251 421562
9682D21562J0405M5381Q05Q435K5744N190k9031r005k141J5133K3264l46M371
9669E19767L5570L7747R476r161J2811J6167L777K4516J8094K4526L6642K3529
9657G53461L6193K7302L3189M6127J8126J165J3006n993j1204l5775l2690l2934
9645H09973j3901k4620q505L537k020M950O569j0195l271J5537j7019K2762r073
9632G74724n4204k6337l7277l3490n4525l2890L773m0316J2069J7895k375J1041
9620E38088R930L135K7179M60j5468k1234o204M769K604q295j5081o837J918J2597
9606E27561K9077L0169K5287N253K3013K9358Q440J8469L2150K9200J8011J4510
9594G90498M4168O0110N3945P1360P1937N8129L3721N0734L9085N3736P2415J00343
$$ plain form
9682 421562 431967 477348 478153 486588 512332 517522 488491 479486 477345 492478 515742 515396 519767
9669 519767 555337 593084 602560 593399 606210 622377 626154 650670 668764 693290 729932 753461
9657 753461 789654 816956 850145 896272 914398 915563 928569 922576 911372 875597 842907 809973
9645 809973 796072 771452 762947 766484 764464 769414 775983 765788 762517 778054 761035 783797 774724
9632 774724 720520 694183 656906 623416 568891 536001 539774 499458 511527 529422 527047 538088
9620 538088 548018 551153 578332 578792 563324 542090 535886 540655 543259 534964 519883 513046 514964 527561
9606 527561 556638 586807 612094 617347 640360 669718 678158 696627 728777 757977 775988 790498
9594 790498 834666 894776 948721 1020081 1092018 1150147 1183868 1234602 1273687 1327423 1399838 1500181
9582A500181P7347J17152K17477K38717K57915L00918L34071L64565L47792K85597
9572D041732J35923q8078k76486l78394m34877l83499k54346j61589r4812o5488
9562B040086M3984P8031J09479J87089K44295K80127L79918M56760N50556O46432
9552E016757P80655Q32372P66778N98234K56622j57596n15020p57790q55696p78187
9542E187129n68928l39198j42504M3307J87796L87797N30901O40301P81027Q06792
9532G514420O94479L99653J19768j85794l43482l47110k27140j05370q9595k16521
9522G213308l77767m50114m67955l38689j16136J41361L08369N31163P34918J001871
9512H180329J284822J529368J666056J657156J369067P59198O9015n45202j004927
$$ plain form
9582 1500181 1577528 1694680 1912157 2150874 2408789 2709707 3043778 3408343 3756135 4041732
9572 4041732 4177655 4089577 3813091 3434697 2999820 2616321 2361975 2200386 2105574 2040086
9562 2040086 2084070 2162101 2271580 2458669 2702964 2983091 3363009 3819769 4370325 5016757
9552 5016757 5797412 6629784 7396562 7994796 8251418 8093822 7578802 6821012 5965316 5187129
9542 5187129 4618201 4279003 4136499 4179806 4367602 4755399 5286300 5926601 6707628 7514420
9532 7514420 8208899 8608552 8728320 8542526 8199044 7851934 7624794 7519424 7429829 7213308
9522 7213308 6835541 6385427 5917472 5578783 5462647 5604008 5912377 6443540 7178458 8180329
9512 8180329 9465151 10994519 12660575 14317731 15686798 16445996 16515011 15969809 14964882
9503A4964882j173528j000133n26549j30385M808j01415l28713n65237o45237
9494A0498493n66206l81126p7288K21446L77122M07854N33291O70712Q45963J029892
9484A3560153J084681Q95189N69907K55535J30599L42076P40517J166405J487571
9475B0232633J360695P51213j65066j054601j584757j649146j270876p50707l27909
9466A5541479n2248K9522K9196J18360L18468O83696J057519J276909J205204
9457B0208105P23444L5739n51906p74019p35133n16315k21693j07656k70949o09088
9447A7180529p22045n36232k10452K15221N57933Q21990J024670J204253J522763
9438B1058630K134048K848271L353034L462139K794466J263811q53110k924218
$$ plain form
9503 14964882 13791354 12791221 12264672 12134287 12139095 12037680 11708967 11143730 10498493
9494 10498493 9932287 9551161 9473873 9695319 10072441 10480295 11013586 11684298 12530261 13560153
9484 13560153 14644834 15540023 16109930 16365465 16496064 16838140 17578657 18745062 20232633
9475 20232633 21593328 22344541 22179475 21124874 19540117 17890971 16620095 15869388 15541479
9466 15541479 15489231 15518753 15547949 15666309 15984777 16668473 17725992 19002901 20208105
9457 20208105 20931549 20967288 20415382 19641363 18906230 18389915 18168222 18060566 17789617 17180529
9447 17180529 16458484 15922252 15711800 15927021 16484954 17306944 18331614 19535867 21058630
9438 21058630 23192678 26040949 29393983 32856122 35650588 36914399 36061289 33137071
9430C3137071m190884m357790l673760k602601j621361q65768m16794k93392k72958
9421A4841763j70863R4806N12823Q74835J056556J049438J020437J026989J201328
9412B1508112J394604J503735J344144Q11912j80375j226846j692591j540721
9404B1921974r96287l45426J65909L84063L12329m664l10217l39536j10096L12960
9394B0991009O28253O25705J56239n91815j361165j746949j584025j018692m00728
9385A5697832Q7876K69003J53862j16564l88039n14536l47472J6869K77635L17170
9375A5453636J87574L690j98J19997L69710O44779P64237O64306L40757Q5435
9365A8633923J17341N15914J031461J404884J346958P63578k32594j348675k274795
$$ plain form
9430 33137071 28946187 24588397 20914637 18312036 16690675 15824907 15408113 15114721 14841763
9421 14841763 14670900 14765706 15278529 16153364 17209920 18259358 19279795 20306784 21508112
9412 21508112 22902716 24406451 25750595 26562507 26382132 25155286 23462695 21921974
9404 21921974 20925687 20580261 20746170 21130233 21442562 21437898 21127681 20788145 20678049 20991009
9394 20991009 21619262 22244967 22401206 21809391 20448226 18701277 17117252 16098560 15697832
9385 15697832 15785708 16054711 16208573 16092009 15703970 15189434 14841962 14858831 15136466 15453636
9375 15453636 15641210 15644900 15644702 15764699 16134409 16779188 17543425 18207731 18548488 18633923
9365 18633923 18751264 19267178 20298639 21703523 23050481 23814059 23581465 22232790 19957995
9356A9957995k854738k952039k536541j904261j317158q40965m29330j30683J42914
9347G135194L70188N51834O85508P54451Q04409Q07530Q02928R11121J108048
9338A3931211J344873J348783R42337J05146q86563j796527k286202k148902j651799
9329H902357j093937n70519j69234J02308L36977N80485P29124P59257O14539
9320A0191357L02572j09347m43931o26027o88271q25740r55721r04714o73128
9311E267050m43485k37474j09771K0051J41498K27363L46555M30880N26999P32143
9301F901809R67888J190571J376877J535348J509962J250085O49163r0783n63639
9292A4727281n57507j04946N05400J024092J436206J665037J772517J842191K015393
$$ plain form
9356 19957995 17103257 14151218 11614677 9710416 8393258 7552293 7122963 6992280 7135194
9347 7135194 7505382 8057216 8742724 9497175 10301584 11109114 11912042 12823163 13931211
9338 13931211 15276084 16624867 17567204 17672350 16785787 14989260 12703058 10554156 8902357
9329 8902357 7808420 7237901 7068667 7170975 7507952 8088437 8817561 9576818 10191357
9320 10191357 10493929 10384582 9940651 9314624 8626353 7800613 6844892 5940178 5267050
9311 5267050 4823565 4586091 4476320 4496371 4637869 4865232 5211787 5642667 6169666 6901809
9301 6901809 7869697 9060268 10437145 11972493 13482455 14732540 15381703 15290920 14727281
9292 14727281 14169774 14064828 14570228 15594320 17030526 18695563 20468080 22310271 24325664
9283B4325664K229017K555079K920553L350841L891980M899961O467622Q204387
9275E8845104R822240R740771R788343J2746763O334761j2297349j6271340r061803
9267F9647490m394551k190604j004384k27462M03046J202731J660374J410173
9259F6506813N61395m86458j492871k247004k598944k559729j962949r23704J9361
9250E4815910M91368M33830J85570r7954l82429q67258j494604j923611k075932
9241D9084890k142062k297075j924300j027744p4967K34320l32728j431416k454471
9232C7634447k960183l004800k931206k883581k626763k124250j527094j054555
9224A8522015p01218l60556k22347l41840p07201r59647j010010r23004q17595
$$ plain form
9283 24325664 26554681 29109760 32030313 35381154 39273134 44173095 50640717 58845104
9275 58845104 68667344 78408115 88196458 100943221 107277982 94980633 78709293 69647490
9267 69647490 65252939 63062335 62057951 61830489 62233535 63436266 65096640 66506813
9259 66506813 67068208 66581750 65088879 62841875 60242931 57683202 55720253 54796549 54815910
9250 54815910 55307278 55741108 55926678 55828724 55446295 54579037 53084433 51160822 49084890
9241 49084890 46942828 44645753 42721453 41693709 41618742 41853062 41520334 40088918 37634447
9232 37634447 34674264 31669464 28738258 25854677 23227914 21103664 19576570 18522015
9224 18522015 17820797 17460241 17237894 16896054 16188853 15229206 14219196 13296192 12478597
9215A2478597o92475n11944k34046J79696O44408J107301J544462J969431K383455
9206A8868885K609130K659227K468313J996858J613161J363178J138246J248895
9198C3965893J776855K632683L598138M500026N285922N881587O085348N562287
9190F9288739M455237L062688J532977J78951p26872r72973l65272J039157K464788
9181G9957420L259941L289001K728341J982024J017111k03195j343414k182854
9173H8504375k718524l005262k880763k092310p88523N81249J555919J797414
9165H0953575J406987K60744j431680l149455m185239m043980k946324j627273
9157F5237355p30353o50142j172363j660478j933200k004682k045585k374595
$$ plain form
9215 12478597 11786122 11274178 11040132 11219828 11864236 12971537 14515999 16485430 18868885
9206 18868885 21478015 24137242 26605555 28602413 30215574 31578752 32716998 33965893
9198 33965893 35742748 38375431 41973569 46473595 51759517 57641104 63726452 69288739
9190 69288739 73743976 76806664 78339641 78518592 77791720 76818747 76453475 77492632 79957420
9181 79957420 83217361 86506362 89234703 91216727 92233838 92030643 90687229 88504375
9173 88504375 85785851 82780589 79899826 77807516 77018993 77600242 79156161 80953575
9165 80953575 82360562 82621306 81189626 78040171 73854932 69810952 66864628 65237355
9157 65237355 64507002 63856860 62684497 61024019 59090819 57086137 55040552 52665957
9149E2665957l070238l961834m679898m818128m370483l467032k465590j697486
9141B4135268j310214j378691j647325j913076j994267j862171j686974j497606
9133A0844944j348124j258740j145542r92801q50281o91399n18939m00029k90609
9124C348480k33110k16380j79031j34338q9323j05806o5660q6241p9806l2238
9114B126547m0913l1559j9951k4922k0470l7275m624J2922J3871o625J0505q594
9102A968912j7126o173k4225o6153k0109l8809r6306q9106n4051n5084l8493m0056
9090A423221n9771l6039J3546j403q74r337n480r362j175J5597O018J5792N194
9077A355927L9539L4679o842j3733j9916j0108l5808j3670j7656o4596n9301p1917
$$ plain form
9149 52665957 49595719 45633885 40953987 36135859 31765376 28298344 25832754 24135268
9141 24135268 22825054 21446363 19799038 17885962 15891695 14029524 12342550 10844944
9133 10844944 9496820 8238080 7092538 6099737 5249456 4558057 4039118 3639089 3348480
9124 3348480 3115370 2898990 2719959 2585621 2496298 2390492 2324832 2238591 2158785 2126547
9114 2126547 2085634 2054075 2034124 2009202 1988732 1951457 1946833 1959755 1973626 1967001 1977506 1968912
9102 1968912 1951786 1945613 1921388 1855235 1835126 1796317 1700011 1610905 1556854 1501770 1463277 1423221
9090 1423221 1363450 1327411 1340957 1339554 1338680 1329343 1323863 1314501 1313326 1328923 1334941 1350733 1355927
9077 1355927 1395466 1430145 1423303 1409570 1389654 1379546 1343738 1330068 1312412 1247816 1188515 1116598
9065A116598q3638m1842j2243l6208m8397m2548k4552Q554r069l1070k26K9447
9053H24806p932k6437J848r866K041l418j6805M000j4578q828r269k4891k4004
9040F86667J0156L0201m299L154L828N808L862L0528n768j6824r997O940j2655
9027G31601k6192j5755r381k5305l3126k9420m9594m5671k5070N000K2456j3130
9015D86413O105m622J3101R016L3344L2922k6590q320j3375J0454j7466p797k62
9002E12923M980K2122O179J4307o109k3558j8221r272l9388m0375Q347L5069j0196
8989D56808R313k6398l4108j0276m231k701j901n109K946J7019J3347J0571K1122
8976D46402k1031k8704J7358k2020k4945J4502k0945J3893J6436R818l905J6016
$$ plain form
9065 1116598 1032960 991118 978875 942667 894270 851722 827170 835724 826655 795585 795359 824806
9053 824806 816874 790437 792285 782419 784460 781042 764237 768237 753659 744831 735562 710671 686667
9040 686667 696823 727024 722725 725879 729707 735515 739377 769905 764137 747313 737316 744256 731601
9027 731601 705409 689654 680273 654968 621842 592422 542828 497157 472087 477087 499543 486413
9015 486413 492518 487896 500997 510013 543357 576279 549689 541369 527994 538448 520982 513185 512923
9002 512923 517903 540025 546204 560511 554402 530844 512623 503351 463963 423588 431935 467004 456808
8989 456808 466121 439723 405615 395339 391108 388407 386506 381397 384343 401362 414709 425280 446402
8976 446402 425371 396667 414025 392005 367060 381562 360617 374510 390946 400764 396859 412875
8964D12875l403q366J426J7638M1358L5401Q185l9408j9043n343l0105j4712r740
8951C86763j1686j6282j8658k2483M583J3971Q963J6535L8333O8940N1917L0677
8939E51573m563k6083k0528j4647j1831k1870J9083J2017n786K3351J9763j8843
8927E01636k1043M6315L5744J0330k984K8606L7500J7649k1812k1171l0554j240
8915E78976k3223k155L3906q313L514J5168K1875K9997J5275K8375L6508L3798
8903G63701K8657K8457L876J4436K5364k878Q761M0673P5347O2182L0228O3340
8891A142144O4550O9188J01022J04495J46349J57435J36598J55627J94338J81123
8881B452869K20730L14006L86736M17362M63449N41070O12421P47683R69482J174986
$$ plain form
8964 412875 409472 401106 402532 420170 461528 496929 505114 465706 446663 441320 411215 396503 386763
8951 386763 375077 358795 340137 317654 322237 336208 345171 361706 400039 468979 520896 551573
8939 551573 547010 520927 500399 485752 473921 452051 471134 483151 477365 500716 520479 501636
8927 501636 480593 526908 562652 572982 569998 598604 636104 653753 631941 610770 580216 578976
8915 578976 555753 553598 587504 579191 582705 597873 619748 649745 665020 693395 729903 763701
8903 763701 792358 820815 824691 839127 864491 861613 870374 911047 986394 1048576 1078804 1142144
8891 1142144 1206694 1275882 1376904 1481399 1627748 1785183 1921781 2077408 2271746 2452869
8881 2452869 2673599 2987605 3374341 3791703 4255152 4796222 5408643 6156326 7125808 8300794
8871H300794J418281J721305K066155K416417K705403L021093L402324L702556
8863B8754328L744749L436658K481893N20142j830193l185864l450076l441910
8855B7029727l442150l103146k408641j715916j432753j397865j169833p72865
8847A1586558l76952k2011K93306N80516Q20372J039889J246057J517640J926655
8838A8612030K374022K788279K983844K987942K915882K631172J768747o4850
8830C6997068k196980l343374l420883l050806k726313k430988k068753j759967
8822A5999004j616859j566445j542391j482145j260035r70761o65238m20841j98187
8813F276102r9605n6144o6493l0643M7079J29907K03202L82770N47971O88957
$$ plain form
8871 8300794 9719075 11440380 13506535 15922952 18628355 21649448 25051772 28754328
8863 28754328 32499077 35935735 38417628 38937770 37107577 33921713 30471637 27029727
8855 27029727 23587577 20484431 18075790 16359874 14927121 13529256 12359423 11586558
8847 11586558 11209606 11187595 11480901 12061417 12881789 13921678 15167735 16685375 18612030
8838 18612030 20986052 23774331 26758175 29746117 32661999 35293171 37061918 36997068
8830 36997068 34800088 31456714 28035831 24985025 22258712 19827724 17758971 15999004
8822 15999004 14382145 12815700 11273309 9791164 8531129 7560368 6895130 6474289 6276102
8813 6276102 6176497 6120353 6053860 6023217 6070296 6200203 6403405 6786175 7334146 8023103
8803H023103P94978Q80458R99245J161749J467012J860154K290358K799978L366769
8794B3643804L960961M632859N217559N714962O106576O389074O300391N472370
8786F7438556L944711K348998O82018j547315l714087m451923l789247k751790
8778E8159921k053973j976189k515050l331451m035172m366381l959471l024431
8770C2897803j960351j045242k50603N52584J542389K609367L630278M633947
8762D2610172N418167N904751O028554N565388M497155L152048J906648M07724
8754G5490607j731197l823798m991658n228405m816334m093202l471707l289027
8746D4045279l773918m409494m705070m561338m041776l275106k511288j944279
$$ plain form
8803 8023103 8818081 9698539 10697784 11859533 13326545 15186699 17477057 20277035 23643804
8794 23643804 27604765 32237624 37455183 43170145 49276721 55665795 61966186 67438556
8786 67438556 71383267 73732265 74414283 72866968 69152881 64700958 60911711 58159921
8778 58159921 56105948 54129759 51614709 48283258 44248086 39881705 35922234 32897803
8770 32897803 30937452 29892210 29641607 30194191 31736580 34345947 37976225 42610172
8762 42610172 48028339 53933090 59961644 65527032 70024187 73176235 75082883 75490607
8754 75490607 73759410 69935612 64943954 59715549 54899215 50806013 47334306 44045279
8746 44045279 40271361 35861867 31156797 26595459 22553683 19278577 16767289 14823010
8738A4823010j633625j412547j183584r63246p20854n54204l86369j69371k8537
8729G770673R1197K04948K66924L63711N36198P94352J098822J412103J725459
8720A4264387K001706K248307K593610K928242L332748L783002M172840M383068
8712C9707910M304098L710135K609063J384403L13767j43339J75021R26158J354871
8703E4342087J157146K78721j028694k347184l480129m323917m872674m766170
8695C4959186m069146l156030k279246j451805n33507M73279J372845K124922
8687B7440498K817489L438787L925201M105836L970366L523992K537501J108700
8679E2868370k86347j149701j072300j90846O82600R79661L67220r02433k237398
$$ plain form
8738 14823010 13189385 11776838 10593254 9630008 8909154 8354950 7968581 7799210 7770673
8729 7770673 7861870 8066818 8333742 8697453 9233651 10028003 11126825 12538928 14264387
8720 14264387 16266093 18514400 21108010 24036252 27369000 31152002 35324842 39707910
8712 39707910 44012008 47722143 50331206 51715609 52029376 51886037 52061058 52987216 54342087
8703 54342087 55499233 55777954 54749260 52402076 48921947 44598030 39725356 34959186
8695 34959186 30890040 27734010 25454764 24002959 23469452 23942731 25315576 27440498
8687 27440498 30257987 33696774 37621975 41727811 45698177 49222169 51759670 52868370
8679 52868370 52582023 51432322 50360022 50169176 50851776 51831437 52198657 51296224 49058826
8670D9058826l591183m752085n472616n630786n222670m422035l512555k806038
8662A3648858k285661j857261j450069j091966q19993o35693m57416l46703k88475
8653D415621k18347j78191j77434j23800m7804L1576Q6117J46792J70559K02717
8643D307806K50096K66836L28400M44460O35522Q16896J023073J216680J340335
8634A0630104J415844J455970J421760J365926J348695J302594J172960R94330
8626B1108183N89418j39404j145475k032167k585056k699479k433537j956579
8618H705904j411938q86642m97799k34229o3574Q5173J64002J91568L19402M96921
8608F868788P15223R28178J170749J405949J538419J584843J662671J700971J686298
$$ plain form
8670 49058826 45467643 40715558 35242942 29612156 24389486 19967451 16454896 13648858
8662 13648858 11363197 9505936 8055867 6963901 6143908 5508215 5050799 4704096 4415621
8653 4415621 4197274 4019083 3841649 3717849 3670045 3701621 3787738 3934530 4105089 4307806
8643 4307806 4557902 4824738 5153138 5597598 6233120 7050016 8073089 9289769 10630104
8634 10630104 12045948 13501918 14923678 16289604 17638299 18940893 20113853 21108183
8626 21108183 21697601 21558197 20412722 18380555 15795499 13096020 10662483 8705904
8618 8705904 7293966 6407324 5909525 5675296 5611722 5696895 5860897 6052465 6371867 6868788
8608 6868788 7584011 8512189 9682938 11088887 12627306 14212149 15874820 17575791 19262089
8599A9262089J393284Q40567K48897m92089j410308k312776k839598k825616k457664
8590I406786j979514j552426j124156p86072n73215m34366l11121k11355j41212
8581B293349j11429j47139j36666j10961j34223j41702j27427j32305j09948q6409
8571A055140p9138o6486k4512m824l560l10K2119P4664J01680J17000J28631J83286
8559A503690J98426J83550J64894J35569K7313l0428r3876j72317k07007j85605
8549A524209j95101j84053j62530j47284p5489q3210p4776m1599k7891p1584k8099
8538D32593q107l5094r700j2828K615J2490M0133L3722M2642O1342N3277O7439
8526F80524P3188J20268J20271J24700J46058J18566J11620J45943J24472R7760
$$ plain form
8599 19262089 20655373 21495940 21744837 21252748 19842440 17529664 14690066 11864450 9406786
8590 9406786 7427272 5874846 4750690 3964618 3391403 2957037 2645916 2434561 2293349
8581 2293349 2181920 2034781 1898115 1787154 1652931 1511229 1383802 1251497 1141549 1055140
8571 1055140 976002 909516 885004 880180 876620 876310 898429 973093 1074773 1191773 1320404 1503690
8559 1503690 1702116 1885666 2050560 2186129 2213442 2183014 2089138 1916821 1709814 1524209
8549 1524209 1329108 1145055 982525 835241 759752 676542 601766 560167 532276 460692 432593
8538 432593 424486 389392 379692 366864 369479 381969 422102 455824 498466 559808 613085 680524
8526 680524 753712 873980 994251 1118951 1265009 1383575 1495195 1641138 1765610 1863370
8516A863370K4769j7023r4270j65178j78819j47348j36591j49158j85452j70675
8506F43625j13446m0447m8316o5900j3595O537K8863j059k2618m7664n3958k3793
8494B48229J2131o765R564j5699k6368k0062k740q660k1782o633P675O321J1668
8481A86879K4233K5765K4578N5757O9779O0782K0570m7875r8453o5893k1382j5053
8469B19687L5529Q820J4748L4786M7570P2805O6170Q2292P6740L3978n2852q5419
8457E54854n7422n1466n7302m5095l9173l5881m7314k2679m855J1043l84k2533
8445A81793j5375j726j4139p282O802K7995j496j6303L359j81l515K3380K0598
8432B03910J8627N3079J1690J8680N704k7628j3212l1613m2635k2861n1919n0118
$$ plain form
8516 1863370 1888139 1871116 1776846 1611668 1432849 1285501 1148910 999752 814300 643625
8506 643625 530179 489732 441416 375516 361921 368458 397321 396262 373644 325980 272022 248229
8494 248229 260360 253595 263159 247460 221092 201030 198290 189630 167848 161215 168890 175211 186879
8481 186879 211112 236877 261455 317212 386991 447773 468343 420468 322015 256122 234740 219687
8469 219687 255216 264036 278784 313570 361140 433945 500115 582407 659147 693125 640273 554854
8457 554854 497432 445966 388664 343569 304396 268515 221201 198522 193667 204710 204326 181793
8445 181793 166418 164692 150553 143271 150073 178068 176572 160269 163628 163447 159932 183312 203910
8432 203910 222537 275616 287306 305986 311690 284062 270850 239237 196602 173741 121822 71704
8420G1704L025K1150p363P83j3577J3655M4182J1905k5036n9452m1503J5887j0646
8407B4714j4515j8621K7168P313r285k5697J3886J9325L989J1415n743N370K2354
8394F1673K8280K1240K4652o006o112J4783M4776M8399N5909O3445N9651L8400
8382D49090J5916J6879p000k9891l3433j8103r210n125l7162l1953k1924N81j3443
8369B75222n0945l945O570q575J7334O310N888J2253m509O615L7646K0570N7237
8356C77671L1687L0083M2354K5902j0152n1011m9360n3232m6952j2469k5388L06
8344B59439k8301j0311p505l8699k4122m0748k5234j0857j4316K473r5l0393j4529
8331A6802j4212K7064J1168m8921k6910K1907K2899O662j5380k6596r352M89K2505
$$ plain form
8420 71704 74729 95879 88516 89299 75722 89377 133559 145464 120428 60976 19473 35360 24714
8407 24714 10199 -8422 18746 26059 16774 -8923 4963 24288 28277 39692 33949 39319 61673
8394 61673 89953 111193 135845 129839 123727 138510 183286 231685 287594 351039 410690 449090
8382 449090 465006 481885 474885 444994 411561 393458 384248 379123 341961 310008 288084 288665 275222
8369 275222 224277 220332 226902 218327 235661 241971 247859 260112 255603 262218 299864 320434 377671
8356 377671 409358 439441 481795 507697 497545 446534 397174 343942 296990 284521 259133 259439
8344 259439 231138 220827 213322 174623 150501 109753 84519 73662 59346 61819 61724 31331 16802
8331 16802 2590 29654 40822 -8099 -35009 -13102 9797 16459 1079 -25517 -34869 -34380 -11875
8318a1875J1266J6082N346L4921L3068K7508O450L3479R769L6465K6009N4212
8306B82700J2113O687j5367M569o848K6768N0041n410o6210l6620j6693k4762
8294B10968n2641o0754j8749R850j2752m50n198k5913L0412N5970L4861M1543
8282B07147J4194p991L1954L5126J5243Q555p607q803J1971K720K1109J6121l66
8269C39373j9112l0553k2747n6465o9829l4190k9200k2728o771j4478q241k1796
8257C263P137j950r9J7828J5949J0376l98k0255l737J2274K2690j5261l9643j4242
8243f068j672j567P684J8970r646M674R164k669q886j3037q554p902O81J4402
8229d426K8180L0095J8400M4418L0079N32q330j5352r354k1499l8619k4644p15
$$ plain form
8318 -11875 -609 15473 20819 55740 88808 116316 122766 156245 166014 202479 228488 282700
8306 282700 294813 301500 286133 290702 283854 310622 360663 355253 289043 252423 235730 210968
8294 210968 158327 97573 78824 88674 75922 75472 70274 44361 74773 130743 165604 207147
8282 207147 221341 213350 245304 280430 295673 304228 296621 287818 299789 302509 323618 339739 339373
8269 339373 320261 289708 266961 210496 140667 106477 77277 54549 47778 33300 25059 3263
8257 3263 10400 8450 8351 26179 42128 52504 52106 31851 28114 40388 63078 47817 8174 -6068
8243 -6068 -7740 -9307 -1623 17347 7701 12375 21539 18870 9984 -3053 -11607 -19509 -18828 -4426
8229 -4426 23754 53849 72249 116667 146746 147278 138948 123596 114242 92743 54124 29480 28765
8216B8765k0112l6995k6916N694R242k06J8504N788p482K4379R253k317r888j2640
8202a4931J4995J6041L1593M3874K3844q655j8332K7784K6517J3111O122k8005
8190A33958o8610m2180j6138j6958P407J7419M0765R953j4424P957k389k9921
8178B6839M486L7053j6675j9428l6279r073J1712j3881Q134j2826r800l0825j174
8165f1737M3936K0273r017M515J5835J669l0219j8206k266n281L4742K1170M94
8152A5908o566l0342k5387j4058O84M3326J2046N915o656n923p087O89J1339J1180
8138E068j3437j5437M347m407m4J165o834J0181n380O108r1j9478J1213Q11p484
8123c3699L664K4488J1805J2134j5132j5608J0683P045j3096j1222J6585P674
$$ plain form
8216 28765 8653 -28342 -55258 -49564 -40322 -40528 -22024 -16236 -23718 661 9914 7597 -2291 -14931
8202 -14931 64 16105 47698 91572 115416 106761 88429 116213 142730 155841 161963 133958
8190 133958 65348 23168 7030 -9928 -2521 14898 55663 65616 51192 59149 56760 26839
8178 26839 31325 68378 51703 32275 -4004 -13077 -1365 -15246 -7112 -19938 -29738 -60563 -61737
8165 -61737 -17801 2472 -6545 -2030 13805 15474 -14745 -32951 -35217 -40498 -5756 15414 15908
8152 15908 9342 -21000 -46387 -60445 -59761 -16435 -4389 1526 -5130 -11053 -18140 -17451 -6112 5068
8138 5068 -8369 -23806 -19459 -23866 -23910 -22745 -29579 -19398 -24778 -18670 -18761 -38239 -27026 -26215 -33699
8123 -33699 -30035 -5547 6258 18392 3260 -12348 -1665 5380 -7716 -18938 -2353 5321
8111E321K397j579n015K0051O416j9707k9495j4584J0331J4785Q844o224M479
8098c980L148P703l529j52J3550k753k077N686j261n583j2770Q739R843j8618
8084b054j6769r429j2624j4593J0376M285L923Q754o928L1572N957k0368k8364
8071d6262J2062J5814M435L5881K5034J17j6844k7617j1902R280p952p228l7434
8058e2616m0040J2497K2059N162J016K3539J6191J1197j8869k0659p596L9873
8046h246J6502k9172l43J0810q475J9669K2412j8581j151J5843j6129J4156K3411
8033D0706p704k5683l743n266j3501J5159J8138R568q910k2713N211L927j7931
8020a2742j0553r702L859R177J6551k3840J1176L425k5853r1K0138j051n613k6338
$$ plain form
8111 5321 7718 6139 1124 21175 27591 7884 -21611 -36195 -25864 -11079 -2235 -8459 -3980
8098 -3980 -832 6871 3342 3190 16740 13987 11910 17596 16335 10752 -2018 6721 16564 -2054
8084 -2054 -18823 -28252 -40876 -55469 -45093 -40808 -36885 -28131 -35059 -3487 2470 -17898 -46262
8071 -46262 -34200 -18386 -13951 21930 46964 47081 30237 2620 -9282 -2 -7954 -15182 -52616
8058 -52616 -92656 -80159 -58100 -52938 -51922 -28383 -12192 -995 -19864 -40523 -48119 -8246
8046 -8246 8256 -20916 -21259 -10449 -18924 745 23157 4576 3425 19268 3139 17295 40706
8033 40706 33002 7319 3576 -1690 -15191 -32 18106 27674 18764 -3949 1262 5189 -12742
8020 -12742 -23295 -32997 -29138 -19961 -3410 -27250 -16074 -12649 -38502 -38593 -18455 -19506 -25119 -51457
8006e1457L067L0999K6201J9095o155j8700l5387j8884k709N3222K7939L918J4939
7993D6088p23N717L604k1776j7451J2052j820J639J9478l3002k0120K656K8815
7980B5157Q784j2144n437k592K3745j7699j6140O8N175p231j2286k2308J3644
7967a9264J5775Q571K8548l772L1729K0478J785j7542k1389j7752q377J2705K9925
7954F1420j6446n3709j347j9041J8448J1200q007J0354j3160J6519p953L061J5536
7941A6875l040j0493j893k4869l628l669n784R623K8800N264J4848j167l0239
7928i372k847J6353Q454j096j3115K188k0719m237m781P606K7744K3093J239j2472
7914A8038j0355N473j3584J4473L798m557o892k2545o800J3916K0662J2749K55
$$ plain form
8006 -51457 -48390 -17391 8810 27905 21750 3050 -32337 -51221 -53930 -708 27231 31149 46088
7993 46088 45365 51082 54686 32910 15459 27511 25691 27330 46808 13806 -6314 -3658 25157
7980 25157 33941 21797 16360 13768 37513 19814 3674 3742 8917 1686 -10600 -32908 -19264
7967 -19264 -3489 5082 33630 29858 61587 82065 83850 66308 44919 27167 18790 31495 61420
7954 61420 44974 -8735 -10082 -29123 -10675 525 -7482 2872 -10288 6231 -1722 1339 16875
7941 16875 13835 3342 1449 -23420 -27048 -30717 -36501 -26878 1922 7186 22034 20867 -9372
7928 -9372 -12219 4134 12588 11492 -1623 565 -20154 -24391 -29172 -21566 6178 29271 30510 18038
7914 18038 7683 13156 -428 14045 17843 13286 6394 -16151 -22951 -9035 11627 24376 24631
7901B4631j5993k25K0301j7730j0890J673J9163k884J0886j4191m2968l4081k4803
7888h7111L3265N3712L4148o821j3403j4580m00M577j6367j3698l205R240L61
7875b0282K916j047J0029Q284n428j252J2458J6425O120r813j2691k998L4232
7862C6953O904p283m752j0787k0917j5035M813R562j3900P176k2920J9435J9663
7849H912r727j5786O828K1454m23j0410k8062k5024K4385L2677j0701j2247J8587
7836D63k5226J9419m186j3873Q649J2285k5441k2844R026j910j3782J2584q524
7823e3360P044K2067j2504j2520J0382J0909J1746J6669k8883n384L7066j167
7811B065l1431J5220j787k0930k2289j9153J1966L2209L5266Q97P711J1747J2851
$$ plain form
7901 24631 8638 8413 28714 10984 94 1767 20930 18046 28932 14741 -28227 -62308 -87111
7888 -87111 -53846 -134 34014 27193 13790 -790 -1190 3387 -12980 -26678 -29883 -20643 -20282
7875 -20282 -17366 -18413 -8384 -100 -5528 -6780 5678 22103 28223 18410 5719 2721 36953
7862 36953 43857 36574 31822 21035 118 -14917 -10104 -542 -14442 -7266 -30186 -10751 8912
7849 8912 -815 -16601 -9773 11681 11258 848 -27214 -52238 -27853 4824 -5877 -18124 463
7836 463 -24763 -5344 -9530 -23403 -14754 -2469 -27910 -50754 -41728 -43638 -57420 -44836 -53360
7823 -53360 -46316 -24249 -36753 -49273 -38891 -27982 -16236 433 -28450 -33834 3232 2065
7811 2065 -29366 -14146 -15933 -36863 -59152 -78305 -66339 -34130 1136 2033 9744 21491 34342
7798C4342O084j5579l0686n2053l648O070Q925N140j8755J517J5007P314j2050
7785d8372L945K3930j9341j3585K129J8719K5183L1864J8283k6337l2588l164
7773a9334j5238p01O648l852L895n35p002J2685L455Q892k4607j4232p957J8519
7759c9364K9364P343j9949k6762l223M181N440Q586K6814L5621P824k4390p25
7746A0760J7166P902j8408k3269j2762j6540J4864K1825j1821j546k2687J3501
7734b1015m719j2241k5116J0368L7850J0416p722j6152j8951J6418R567J0968
7722a0329l463O492J0138j7186q204R521j0912K6526O2M475K507j0888k5720K904
7708b4077J019J202R818k552r259j0302j787M967p756j1175j7155Q5J4045J0050
$$ plain form
7798 34342 40426 24847 -5839 -57892 -61540 -55470 -46545 -41405 -60160 -58643 -43636 -36322 -48372
7785 -48372 -44427 -20497 -39838 -53423 -51294 -32575 -7392 24472 42755 16418 -16170 -19334
7773 -19334 -34572 -35273 -28625 -32477 -28582 -29117 -36119 -23434 -19979 -11087 -35694 -49926 -57883 -39364
7759 -39364 -10000 -2657 -22606 -49368 -52591 -48410 -42970 -34384 -7570 28051 35875 11485 10760
7746 10760 27926 35828 17420 -5849 -18611 -35151 -20287 1538 -10283 -11829 -34516 -21015
7734 -21015 -25734 -37975 -63091 -52723 -14873 -4457 -12179 -28331 -47282 -30864 -21297 -10329
7722 -10329 -13792 -7300 2838 -14348 -22552 -13031 -23943 2583 2645 7120 9627 -1261 -26981 -24077
7708 -24077 -23058 -21856 -12038 -14590 -23849 -34151 -35938 -30971 -38727 -49902 -67057 -66972 -52927 -42877
7694d2877l958j2977r530J7398J2525K437L006j1445j3575R375J5687M883j1033
7681d0084J0778j2220k4373K5922K5563J7891q354n788K0918J015J0728k4291
7669b295l5549N174m49J6523j7519K4898J2011K1795k550k4416k9015j2067P317
7656c6142m963j0676K233J9287r195l9691K3082Q413K001J9192J9862K339o15
7643d873P710k9378N853J4080q350J1019r870m0583j3921K995k1856M835J2187
7630g0152J605Q424l345N354J5600r575j3080J5922l131J546J892Q070N861M553
7616c0456o926l541J8816j0063J3494O159J9840j6493j5913J1139L709k5763L358
7603c2640J2569j6865k5006j1097J5123L2857J2544j8464J1474j4427K128m494
$$ plain form
7694 -42877 -46835 -59812 -69342 -51944 -39419 -36982 -33976 -45421 -58996 -49621 -33934 -29051 -40084
7681 -40084 -29306 -41526 -65899 -39977 -14414 3477 -4877 -10665 10253 11268 21996 -2295
7669 -2295 -37844 -32670 -33119 -16596 -34115 -9217 2794 24589 22039 -2377 -31392 -43459 -36142
7656 -36142 -41105 -51781 -49548 -30261 -39456 -79147 -56065 -47652 -45651 -26459 -6597 -4258 -4873
7643 -4873 2837 -26541 -20688 -6608 -14958 -3939 -13809 -54392 -68313 -65318 -87174 -82339 -70152
7630 -70152 -68547 -60123 -63468 -58114 -42514 -52089 -65169 -49247 -52378 -50832 -48940 -40870 -35009 -30456
7616 -30456 -37382 -40923 -22107 -32170 -18676 -12517 7323 -9170 -25083 -13944 -10235 -35998 -32640
7603 -32640 -20071 -36936 -61942 -73039 -57916 -25059 -12515 -30979 -19505 -33932 -31804 -36298
7591c6298j396n268k303Q022m517j090m9Q576J6282l1802J6598J1055j7550J4025
7577b5715N228j1654p792q398J0103p538l8951l9806J6527N4538J4447r682J0191
7564c8502K7577K1341N215p180j686k5901J3692l2707J6920K0981M703j37p833
7551c517j4051K0751j0900j6557L76M700k4324J3433L1473J2964j2238N07j2736
7538a0119J2481j0586k0148k0748K839R74R056j7337j816j2041m071K60J1784
7525e9472N939L66M48j213j2446j2341L3854J7594o553l0644O852J4278j4643
7512e7981j4445K4687L1624N474J715j4657j627n346L643N845m611J9506l6026
7499d2199j7589L0389K472k3698P393P617j0936l0628o845K8904L9194K443k1921
$$ plain form
7591 -36298 -37694 -42962 -45265 -37243 -41760 -42850 -42899 -34323 -18041 -49843 -33245 -22190 -39740 -25715
7577 -25715 -20487 -32141 -39933 -48331 -38228 -45766 -84717 -124523 -107996 -53458 -39011 -48693 -38502
7564 -38502 -10925 10416 15631 8451 6765 -19136 -5444 -38151 -21231 -250 4453 4316 -3517
7551 -3517 -17568 3183 -7717 -24274 -23898 -19198 -43522 -30089 1384 14348 2110 2617 -10119
7538 -10119 2362 -8224 -28372 -49120 -46281 -45307 -36251 -53588 -55404 -67445 -71516 -71256 -59472
7525 -59472 -53533 -53167 -52719 -53932 -66378 -78719 -44865 -27271 -33824 -64468 -57616 -43338 -57981
7512 -57981 -72426 -47739 -16115 -10641 -8926 -23583 -25210 -30556 -26913 -21068 -25679 -6173 -42199
7499 -42199 -59788 -29399 -26927 -50625 -43232 -35615 -46551 -77179 -84024 -55120 -15926 -13483 -35404
7486c5404N007l872m6059l5580K4387L95Q103J8717K7051K6044Q255q918j4577
7473b6451m639P285k0057j6660r619J6081M1752m382k1522K2068l1516k3649k102
7460g3411K3861L2643p25p712k853o305L338l799k7280K498j1051J301J1158j0614
7446f8951j6743K4876N928J4976L3113j461K454J536j3437p338J9256M6973L610
7433D4792Q620j4640l2655k4830k1954k8611K2804J8729k3737k3071l470K2138
7421e5885K6069n386j0893o207J5491m723J7414j1191J0349L4673J0908p548k3741
7408a0670j388j0721P614K0284O708k8501j3894P525r265k2499L8733K0926j6467
7395a1615L885o437j2634n272J0184n756J5388k4951k764j3822O168K3070j6267
$$ plain form
7486 -35404 -30397 -34269 -80328 -115908 -91521 -91126 -83023 -64306 -37255 -11211 -2956 -11874 -26451
7473 -26451 -31090 -23805 -43862 -60522 -70141 -54060 -12308 -16690 -38212 -16144 -47660 -71309 -73411
7460 -73411 -49550 -16907 -17632 -25344 -28197 -34502 -31164 -34963 -62243 -59745 -70796 -69495 -58337 -68951
7446 -68951 -85694 -60818 -54890 -39914 -6801 -8262 -5808 -4272 -17709 -25047 -5791 41182 44792
7433 44792 53412 38772 6117 -18713 -40667 -69278 -46474 -27745 -51482 -74553 -78023 -55885
7421 -55885 -29816 -35202 -46095 -52302 -36811 -41534 -24120 -35311 -24962 9711 20619 13071 -10670
7408 -10670 -12058 -22779 -15165 5119 11827 -16674 -30568 -23043 -32308 -54807 -16074 4852 -11615
7395 -11615 -7730 -14167 -26801 -32073 -21889 -27645 -12257 -37208 -39972 -53794 -47626 -24556 -40823
7382d0823k7624O329M438K0595L0559m452j5325O868Q670L830k0381k4796N012
7369d7100O87O071J0395j801q157O830m350R235M9759K6353k4498k3482J2644
7356A2586K484m0473q859l875l2058q171J9881J6219p993Q316k2554k855J0091
7343e7261j9651J7881O1922j348j6195j9275J229k1974l2684L355M486K5359O972
7330d7184j1738J0570O585k543M95j8050j8M4465j8527K058k672P030j6798M81
7316d5846L6510j1441k1405P420N668p790K139R016J4225K3026J4810p950m3235
7303b4853j3026J3853k9402J2583J5158O407J6583k0665K306J2110M56j3850P20
7290b1620r949O7K481l89J1574P479j7937k24j8272K057M152P277K251o859M420
$$ plain form
7382 -40823 -68447 -62118 -57680 -37085 -6526 -10978 -26303 -19435 -10765 -6935 -27316 -52112 -47100
7369 -47100 -46413 -40342 -29947 -31748 -39905 -33075 -37425 -28190 21569 47922 23424 -58 12586
7356 12586 15070 -25403 -34262 -38137 -70195 -78366 -58485 -42266 -50259 -41943 -64497 -67352 -57261
7343 -57261 -76912 -59031 2891 1543 -14652 -33927 -32698 -54672 -87356 -84001 -79515 -54156 -47184
7330 -47184 -58922 -48352 -41767 -44310 -43815 -61865 -61883 -17418 -35945 -33887 -36559 -29529 -46327 -45846
7316 -45846 -9336 -20777 -42182 -34762 -29094 -36884 -34745 -25729 -11504 11522 26332 18382 -24853
7303 -24853 -37879 -24026 -53428 -40845 -25687 -19280 -2697 -23362 -21056 -8946 -8490 -22340 -21620
7290 -21620 -31569 -31502 -29021 -29410 -17836 -10357 -28294 -28518 -46790 -44733 -40581 -33304 -31053 -37912 -33492
7275c3492R617j9844j7834M455K5671J1606p999o431j4428Q030p914J1648J4900
7262b2015j5610j9783J0023J6636o717K2706K8738K837R626j1416k1235l3744
7250c9954j1867J0882Q726R066r027j638j439K9806J88l665l0298j5536K293K4538
7236b7925J2807N398K061K2963q25J8783k4069k3990k3297J1232K5116J0306j6189
7223g629k4937L136O158R121L406O688k9196j9682j5716l443J1821J9082k451
7210d3642j8207j2715j0687K3143K2046J217R340j2266j9435M355J1008j8985
7198f4828q786P746J2041J6366L224N297K4299R345p562k8867l3371q002K9420
7185d3678K7630J3916r573j6627J6070J2647j3370l3426K536K4859J4153j0650
$$ plain form
7275 -33492 -23875 -43719 -61553 -57098 -31427 -19821 -27820 -34251 -48679 -40649 -48563 -36915 -22015
7262 -22015 -37625 -57408 -47385 -30749 -37466 -14760 13978 16815 26441 15025 -6210 -39954
7250 -39954 -51821 -40939 -32213 -23147 -32174 -33812 -35251 -5445 -5257 -8922 -39220 -54756 -52463 -27925
7236 -27925 -15118 -9720 -7659 15304 14479 33262 9193 -14797 -38094 -26862 -1746 8560 -7629
7223 -7629 -32566 -29430 -23272 -14151 -10745 -4057 -33253 -52935 -68651 -72094 -60273 -41191 -43642
7210 -43642 -61849 -74564 -85251 -62108 -40062 -38845 -29505 -41771 -61206 -56851 -45843 -64828
7198 -64828 -73614 -65868 -53827 -37461 -34237 -28940 -4641 4704 -2858 -31725 -65096 -73098 -43678
7185 -43678 -16048 -2132 -11705 -28332 -12262 385 -12985 -46411 -43875 -19016 -4863 -15513
7173a5513r010O689N732J0780r80M896q264J8504n643m9569m316J6348J2829J3432
7159d085p195J2908L3797J28m872j4428m928k1645j7264R017k6391j5183j5322
7146g5463J6141L7522J6101K769k219j3015p213p607j8851j8967N28l766J4410
7133e9630J4860K8647L7866P293m624O698K0442r018j7962j5903l8312q885m577
7120d3105j6413m794Q079O010O742J6183K6484J1004k2163j4963r782N416J2898
7107a8404J7848J7855P141l0506j6010j7353J5866M794k338l1204M401J0990Q252
7094b8668K304l303O377O275J9133J4084q463l648k2821j9385j6716j6962j282
7081g3075M375K4597J119j6492Q091k4912L2885K4488p578P526J0056j8652j8947
$$ plain form
7173 -15513 -24523 -17834 -12102 -1322 -2302 2594 -5670 12834 7191 -42378 -46694 -30346 -17517 -4085
7159 -4085 -11280 1628 35425 35553 30681 16253 11325 -10320 -27584 -18567 -44958 -60141 -75463
7146 -75463 -59322 -21800 -5699 -2930 -5149 -18164 -25377 -32984 -51835 -70802 -70274 -74040 -59630
7133 -59630 -44770 -16123 21743 29036 24412 31110 51552 42534 24572 8669 -29643 -38528 -43105
7120 -43105 -59518 -64312 -56233 -50223 -43481 -27298 -814 10190 -11973 -26936 -36718 -31302 -18404
7107 -18404 -556 17299 24440 -6066 -22076 -39429 -23563 -18769 -21107 -52311 -47910 -36920 -28668
7094 -28668 -26364 -29667 -23290 -17015 2118 16202 7739 4091 -18730 -38115 -54831 -71793 -73075
7081 -73075 -68700 -44103 -42984 -59476 -51385 -76297 -43412 -18924 -26502 -18976 -8920 -27572 -46519
7068d6519K0609j6678r092J1871N296J5048K046j1624j5888O103R96K0788p035
7055b4079j974m834Q168J2336J6848J8556J3830k2818j4151k7733k2219M5850
7043b220J0702N688J6661k7002j4002R050p430k0316o733j273M818J4597k5178
7030d2638l1752J824K365j3353K3672L9116K6655M657j5914M8L707k8133j2846
7017d2592L187L4964K1247p491P603J6430K5087q820k1140j2192j6892j4259j789
7004a6657R074R765j3788j1437j6183k4927J985J6880M5776j225o34k1239k3330
6991d5940Q530M4353J1578o026J0803k2746k0672J8745O132k2253K0324J4727
6979A7555n241j9520O356o102l148Q43K4741O621o623k5036k1973m169Q371Q800
$$ plain form
7068 -46519 -25910 -42588 -51680 -39809 -34513 -19465 -17419 -29043 -44931 -38828 -37832 -17044 -24079
7055 -24079 -26053 -30887 -22719 -10383 6465 25021 38851 16033 1882 -25851 -48070 -2220
7043 -2220 8482 14170 30831 3829 -10173 -1123 -8553 -28869 -35602 -36875 -32057 -17460 -42638
7030 -42638 -74390 -72566 -70201 -83554 -59882 -20766 5889 10546 -5368 -5320 -1613 -29746 -42592
7017 -42592 -39405 -4441 16806 9315 16918 33348 58435 49615 28475 16283 -609 -14868 -16657
7004 -16657 -7583 2182 -11606 -23043 -39226 -64153 -62168 -45288 488 -737 -1371 -22610 -45940
6991 -45940 -37410 6943 18521 12495 23298 552 -20120 -1375 4757 -17496 2828 17555
6979 17555 12314 -7206 -850 -6952 -10100 -9257 15484 22105 15482 -9554 -31527 -35696 -27325 -18525
6965a8525n20j8284j6382m130L4513K4386k0827j73r96Q301k721R558j0736j1555
6951b8091j152n675n142J3051k5768m583K8347R136J3954J5071l368k6469l0240
6938e0929L3019J5318J7771m362m0261k6617M184n557l6429J0128L6255J0054
6926c7426K9005P811r466q216J6510Q090Q899n519j5713k0893j8283K0795k1859
6913d6265j87J8921J7457j5643j4958L7866J4969m168J2229k2891j945P554k5325
6900b2386J0871k9020k937K2028Q743Q33l0571K0757K4053K0346O689J0260k3151
6887A6515j2171j2268r977L496n609J8288J2668J8049m222k7444o090k0640j174
6874c0579R333J7966R28j382P117J024J153N150k2406k7220J362q308j9228O113
$$ plain form
6965 -18525 -19045 -37329 -53711 -57841 -23328 1058 -19769 -19942 -20938 -12637 -15358 -5800 -16536 -28091
6951 -28091 -29243 -34918 -40060 -27009 -52777 -57360 -29013 -19877 -5923 9148 5780 -20689 -50929
6938 -50929 -17910 -2592 15179 10817 -29444 -56061 -51877 -57434 -93863 -83735 -47480 -37426
6926 -37426 -8421 -610 -10076 -18292 -1782 6308 15207 9688 -6025 -26918 -45201 -24406 -46265
6913 -46265 -46452 -27531 -10074 -25717 -40675 -2809 12160 7992 20221 -2670 -4615 2939 -22386
6900 -22386 -11515 -40535 -43472 -21444 -12701 -11868 -42439 -21682 2371 22717 29406 39666 16515
6887 16515 4344 -7924 -17901 -14405 -20014 -1726 10942 28991 24769 -2675 -8765 -29405 -30579
6874 -30579 -21246 -3280 -2352 -3734 3383 4407 5560 10710 -11696 -38916 -37554 -45862 -65090 -58977
6860e8977L0984M3941j4026J1510K0985m20m468j4852j7954n426R337j7116n689
6847b2171n705m056R727l141N622J4795j4227M952J1818p739J1475m939Q74J4064
6833A1349j3983M069K9843J3665r380j4246K1275j2689m0558m974m481M133j42
6820a6119j3329M946L736l851N75K2266K1711j4759l1230K737O122L59M884m185
6806a6137M61o701j2872n043j033j273K772q113Q194J8000L2039J2353J771q176
6792A6242l1563l4364K4493O6753J5288k3076k4302J177n218l0158k931J8075
6780i584M206l704p668J616L1005M33k4758j8069M016K3204j2720j61j7716l4783
6766f4683k519K5220L9613K8358j6345j7885l594j3811J6686j0112K053K7458
$$ plain form
6860 -58977 -27993 15948 1922 13432 34417 33997 29529 14677 -3277 -8703 634 -16482 -22171
6847 -22171 -27876 -31932 -22205 -25346 -19724 -4929 -19156 -14204 -2386 -10125 1350 -3589 -2715 11349
6833 11349 -2634 1435 31278 44943 35563 21317 42592 29903 -10655 -15629 -20110 -15977 -16119
6820 -16119 -29448 -24502 -20766 -24617 -24042 -1776 19935 5176 -26054 -23317 -17195 -16836 -11952 -16137
6806 -16137 -15676 -22377 -35249 -40292 -41325 -42598 -39826 -47939 -39745 -21745 10294 22647 24418 16242
6792 16242 -15321 -49685 -25192 41561 56849 33773 9471 10648 5430 -24728 -27659 -9584
6780 -9584 -5378 -9082 -16750 -15134 15871 16304 -8454 -26523 -22507 697 -12023 -12184 -29900 -64683
6766 -64683 -67202 -41982 -2369 25989 9644 -8241 -11835 -25646 -8960 -19072 -17019 10439
6754A0439r488j3628r076m27K0316K9552O529j131p589r279n056o163Q21j299
6740D521p499m691j0294L475k156l03K2953m234J9471L4431n733j9548k5404J6249
6726B1238K200j520L744K3424K2500J2852N2029K6980K0763O3991O2982N757k6278
6713B90662l7760j7136l7538p0018o7888n21o567l2563k3633j24J8728j824K805
6700A6623n322L4195Q080n146j6489l9249j766M703k1889N897J1867K8562O604
6687B6670r327r535k187j4192j3500K7056J0207j187j4344j3414j4578k4243J0271
6674d2303K5325P571N370q427k1605M141n892L144m974l4625J8119n38Q06L4809
6660a9079K4710L523K3n457J3810j5914k8944o3268N532N9151J5340j1083P015
$$ plain form
6754 10439 951 -12677 -21753 -22180 -1864 27688 34217 33086 25497 16218 11162 4999 5820 4521
6740 4521 -2978 -7669 -17963 -14488 -16644 -16947 6006 1772 21243 55674 49941 30393 4989 21238
6726 21238 23438 21918 25662 49086 71586 84438 136467 163447 184210 248201 311183 316940 290662
6713 290662 252902 235766 198228 128210 60322 59801 53234 20671 -2962 -3086 15642 13818 16623
6700 16623 11301 45496 53576 48430 31941 -7308 -9074 -4371 -26260 -20363 -8496 20066 26670
6687 26670 17343 7808 5621 -8571 -22071 4985 15192 14005 -339 -13753 -28331 -52574 -42303
6674 -42303 -16978 -9407 -4037 -12464 -34069 -29928 -35820 -32676 -37650 -72275 -54156 -54694 -53888 -19079
6660 -19079 5631 9154 9177 3720 17530 1616 -27328 -90596 -85064 -25913 -10573 -21656 -14641
6647a4641j882l691j745Q318Q288j5843j0410N427r9J6765J4587R018j966L092
6633A5218M526j0536j7767q298m349p751K0195p551k5253L564M6174L2784k4243
6620A6713j6946m755j1579J0927M2953J3717l4353j3796j7402n832q018L003r001
6607c4369Q65o544R172J2413J6393J4J9080q521j9099K721N605p481j2226q217
6593c0194O094J0461p266j0575R496R011L0942q082j4989k75L086l051o430O756
6579e016J4247j0880j7158p258k173k999J9010J32k8635N010L2915J1125M316
6566A2636K766J155q243p102j713l090j6363j0310P023J2919K1502J9060k3806
6553F434j3953L403j142j5627K111J6981j2261j0842q810j691J7782N638J476
$$ plain form
6647 -14641 -16523 -20214 -21959 -13641 -5353 -21196 -31606 -26179 -26278 -9513 5074 14092 12126 15218
6633 15218 19744 9208 -8559 -16857 -21206 -28957 -8762 -16313 -41566 -38002 8172 40956 16713
6620 16713 -233 -4988 -16567 -5640 37313 51030 16677 2881 -14521 -20353 -28371 -25368 -34369
6607 -34369 -33504 -40048 -30876 -18463 -2070 -2056 17024 8503 -10596 -7875 -2270 -9751 -21977 -30194
6593 -30194 -24100 -13639 -20905 -31480 -21984 -12973 17969 9887 -5102 -5377 -2291 -5342 -11772 -5016
6579 -5016 9231 -1649 -18807 -26065 -28238 -31237 -12227 -12095 -40730 -35720 -2805 8320 12636
6566 12636 15402 16557 8314 1212 -501 -3591 -19954 -30264 -23241 -10322 11180 30240 6434
6553 6434 -7519 -4116 -5258 -20885 -18774 -1793 -14054 -24896 -33706 -35397 -17615 -11977 -10501
6540a0501m104K9945J2949j7827k8719l21j07J2570q062r830r499J2262M0876
6527A9632r579j5422L632L889j8967j905J8239j4320J7480l097q747J4977K4742
6514C0554R051q899l4794l1613l0267j2980J5945J9628l859K1066K0480j019J978
6501d729j7816J639j6735R674J2852j8000j4967K2382K5079J4485J1443k2626
6489B681k5369J2361L6889o6k2673J4377n779l1720j0009J027L1677l9106k327
6476c8037L7702K0939j5715m725l741Q29J737k2264R045K8756j968l3906j4414
6463c5762R483M33J1557J9101Q170j7586Q859j0438j9571o044j1486k220r152
6450e4656o069P011Q382K0036o435k4731Q031J8743j0356J2711L5044J7078N058
$$ plain form
6540 -10501 -14605 15340 28289 10462 -18257 -18578 -18685 -6115 -14177 -24007 -33506 -21244 19632
6527 19632 10053 -5369 -1737 2152 -16815 -18720 -481 -14801 2679 -418 -9165 5812 30554
6514 30554 39605 30706 -4088 -35701 -65968 -78948 -63003 -43375 -47234 -26168 -5688 -6707 -4729
6501 -4729 -22545 -20906 -37641 -27967 -15115 -33115 -48082 -25700 -621 13864 25307 2681
6489 2681 -22688 -10327 26562 26496 3823 18200 12421 -19299 -29308 -28281 3396 -35710 -38037
6476 -38037 -335 20604 4889 164 -3577 -2748 -1011 -23275 -14230 14526 12558 -21348 -35762
6463 -35762 -26279 -25846 -14289 4812 12982 -4604 4255 -6183 -25754 -31798 -43284 -45504 -54656
6450 -54656 -60725 -53714 -45332 -25296 -31731 -56462 -48431 -29688 -40044 -27333 7711 24789 29847
6437B9847J5720R467m1258l0254k204j2814J371K7198K2535j5983k686j3111k8908
6424d1080K7371K9321K6906j8487l0847k9635m896J9258K1756m989j9338j5021
6412c9681o927J7180K7056m0j2434L722Q02r948m794m977K812j2993K087N422
6398c2713j4787J5555N0533q677j1111N157n146J5658k631J2767M348O361j0531
6385B4783m67k0803j2188J9456j0605l4831O271J5861j4053J587K9422k271j4716
6372a2554k7387P028K6930J8882j5019p949K732J8249o082j0162l0517K0726J2045
6359c078M558L2511L902l3709j5410j028J7487N049j1942o968M676j3211J1977
6346e186J821R473j1031J2176j4305M389k24r230J107L332k264k3826j1729R449
$$ plain form
6437 29847 45567 55034 13776 -16478 -18682 -31496 -30125 -2927 19608 3625 939 -12172 -41080
6424 -41080 -13709 15612 42518 24031 -6816 -36451 -41347 -22089 -333 -5322 -24660 -39681
6412 -39681 -46608 -29428 -2372 -2412 -14846 -11124 -10322 -20270 -25064 -30041 -27229 -40222 -38135 -32713
6398 -32713 -47500 -31945 18588 9911 -1200 3957 -1189 14469 11838 24605 28953 35314 24783
6385 24783 24316 3513 -8675 10781 176 -34655 -28384 -12523 -26576 -24989 4433 2162 -12554
6372 -12554 -39941 -32913 -5983 12899 -2120 -10069 -7337 10912 4830 -5332 -35849 -15123 -3078
6359 -3078 1480 33991 37893 4184 -11226 -12254 5233 10282 -1660 -8628 -3952 -17163 -5186
6346 -5186 -3365 6108 -4923 7253 -7052 -2663 -2887 -12117 -11010 -7678 -9942 -33768 -45497 -36048
6332c6048J3738J5752k4536o359O625L8597M282k4383p013O527R801j856J0794
6319E921n043j7627p393j298j836l468l5950j1985J0449J3564J4696K6270J2708
6306i92O835k4427n367J2679m772L601J5792K0496M07j0934j1045l923k5149j2223
6292c9022J6117q737K5948k906j3926L1744J8251k157j9939o366J124p008n963
6279a2840J8139K1192j9331p290K5256M175j6039Q916k258Q41r376j3977m2051
6266d4643k4547m375L5999O1000J8158k2936j4439j2460L098k1966j341j7509
6254d5961K080L5413K1184p675n883k0725L09J1259N186j6231l3908n722K5095
6241c5579k6603n723K1991K5475L8250M038l010r438l4561q441K4501o462k2640
$$ plain form
6332 -36048 -22310 -6558 -31094 -37453 -30828 7769 12051 -12332 -19345 -12818 -3017 -4873 5921
6319 5921 878 -16749 -24142 -25440 -27276 -30744 -66694 -78679 -68230 -54666 -39970 -13700 -992
6306 -992 5843 -18584 -23951 -11272 -16044 -12443 3349 23845 24252 13318 2273 -1650 -26799 -39022
6292 -39022 -22905 -31642 -5694 -8600 -22526 9218 27469 25312 5373 -993 131 -6877 -12840
6279 -12840 5299 26491 7160 -130 25126 29301 13262 22178 19920 20761 11385 -2592 -44643
6266 -44643 -69190 -73565 -37566 23434 41592 18656 4217 -8243 -5145 -27111 -28452 -45961
6254 -45961 -43881 -8468 12716 5041 -842 -21567 -21258 -9999 -4813 -21044 -54952 -60674 -35579
6241 -35579 -62182 -67905 -45914 -20439 17811 21849 18839 9401 -25160 -33601 -9100 -15562 -38202
6228c8202j9078Q288K0473O719l5299j1257K9159j4646P021J4779j880L3607P813
6215G497j3320J7547j5576O569m166j3519r028l0473Q224m523j7906L028K6432
6202c9214M3759L1901j659j8575p907n203q11j473J0939j1131K3915n178j6741
6189B622p596j60j9471K0751L3429j5664j4243J0942L8753R172k2293j8930J2902
6176C0214j0111j6338j5160K810J1252k0347J250k403p152n055Q945K1661J5055
6163A4621J8826M873l6184l5477r950J318J1664K8958j562l2270j3821J6247J3748
6150a9009k3262J5557K3160J9836J7467l5305l160J1051j3332l486K0164l3221
6138b3540o052k128O761j0320J2639L9992q395l003J7515q525m200L910J3070
$$ plain form
6228 -38202 -57280 -48992 -28519 -21800 -57099 -68356 -39197 -53843 -46822 -32043 -33923 -316 7497
6215 7497 -5823 11724 -3852 2717 -1449 -14968 -23996 -54469 -46245 -50768 -68674 -65646 -39214
6202 -39214 4545 36446 34787 16212 8305 3102 2291 818 11757 626 24541 19363 2622
6189 2622 -4974 -5134 -24605 -3854 29575 13911 -332 10610 49363 58535 36242 17312 30214
6176 30214 20103 3765 -11395 -8585 2667 -17680 -16430 -18833 -25985 -31040 -22095 -434 14621
6163 14621 33447 38320 2136 -33341 -43291 -41973 -30309 -1351 -2913 -35183 -49004 -32757 -19009
6150 -19009 -42271 -26714 -3554 16282 33749 -1556 -4716 6335 -6997 -10483 9681 -23540
6138 -23540 -29592 -31720 -24959 -35279 -22640 17352 8957 5954 23469 14944 10744 14654 27724
6125B7724j3021K930N888J8834k794k6737J5608J1078K0770k4243k9339k2784
$$ plain form
6125 27724 14703 17633 23521 42355 39561 12824 28432 39510 60280 36037 6698 -16086
$$ [...]
##END NTUPLES=NMR SPECTRUM
##END=
