##TITLE=Analysis number 328995
Compound Code cc 67423
Book Reference 511/170
Project Code adrs
Chemist Name stevem
##JCAMPDX= 6.0         $$ Bruker NMR JCAMP-DX V2.0
##DATA TYPE= NMR SPECTRUM
##DATA CLASS= NTUPLES
##ORIGIN= Bruker BioSpin GmbH
##OWNER= nmr
$$ XWIN-NMR		Version 3.5
$$ Tue Jul 24 10:53:13 2007 GMT Daylight Time (UT+1h)  MAYBRIDGE\nmr@NMR_250MHZ
##.OBSERVE FREQUENCY= 250.131544655141
##.OBSERVE NUCLEUS= ^1H
##.ACQUISITION MODE= SIMULTANEOUS (DQD)
##.ACQUISITION SCHEME= undefined
##.AVERAGES= 16
##.DIGITISER RES= 18
##SPECTROMETER/DATA SYSTEM= dpx250
##.PULSE SEQUENCE= zg30
##.SOLVENT NAME= CDCl3
##.SHIFT REFERENCE= (INTERNAL, CDCl3, 0, 16.522)
##AUDIT TRAIL= $$ (NUMBER, WHEN, WHO, WHERE, WHAT)
$$ ##TITLE= Audit trail, XWIN-NMR		Version 3.5
$$ ##JCAMPDX= 5.01
$$ ##ORIGIN= Bruker BioSpin GmbH
$$ ##OWNER= nmr
$$ C:\u/data/dgb/nmr/ADRS/1350/pdata/1/auditp.txt
$$ ##AUDIT TRAIL=  $$ (NUMBER, WHEN, WHO, WHERE, WHAT)
(   1,<2007-07-24 10:52:45.07 +100>,<MAYBRIDGE\nmr>,<NMR_250MHZ>,
      <created by zg, POWCHK disabled, PULCHK disabled
       configuration hash MD5:
       76 6E 9A 78 1E 09 19 81 EC 84 63 8F B0 6A 59 2D
       data hash MD5: 64K
       E8 58 72 AF 08 08 4B D3 5D 04 C9 67 33 D5 01 24>)
(   2,<2007-07-24 10:52:56.51 +100>,<MAYBRIDGE\nmr>,<NMR_250MHZ>,
      <Start of raw data processing
       ef LB = 0.3 FT_mod = 6 PKNL = 1 SI = 32K 
       data hash MD5: 32K
       40 F5 73 B6 CC DE DB 7A 05 DF 45 6E D6 F4 1E 52>)
(   3,<2007-07-24 10:52:58.59 +100>,<MAYBRIDGE\nmr>,<NMR_250MHZ>,
      <apk 
       data hash MD5: 32K
       87 B9 82 79 6D BD 8D 75 6A 58 92 8B B7 60 3A 3E>)
(   4,<2007-07-24 10:52:59.35 +100>,<MAYBRIDGE\nmr>,<NMR_250MHZ>,
      <abs ABSG = 5 
       data hash MD5: 32K
       0B 3C 80 CF 21 43 28 60 B0 B9 E6 C4 1C F9 60 5D>)
$$ ##END=
$$ 
$$ hash MD5
$$ D3 8A 30 75 BB C9 99 8A 8F AD 3C 3C 55 E4 6D 24
##$RELAX= 
##$RELAX= 
##$RELAX= 
##$RELAX= 
##$RELAX= 
##$RELAX= 
##$RELAX= 
$$ Bruker specific parameters
$$ --------------------------
##$DU= <C:\u>
##$EXPNO= 1350
##$NAME= <ADRS>
##$PROCNO= 1
##$TYPE= <nmr>
##$USER= <dgb>
##$AMP= (0..31)
100 100 100 100 100 100 100 100 100 100 100 100 100 100 100 100 100 100 
100 100 100 100 100 100 100 100 100 100 100 100 100 100 
##$AQSEQ= 0
##$AQ_mod= 3
##$AUNM= <au_zg>
##$AUTOPOS= <5 >
##$BF1= 250.13
##$BF2= 250.13
##$BF3= 250.13
##$BF4= 250.13
##$BF5= 500.13
##$BF6= 500.13
##$BF7= 500.13
##$BF8= 500.13
##$BYTORDA= 1
##$CFDGTYP= 0
##$CFRGTYP= 5
##$CHEMSTR= <none>
##$CNST= (0..31)
1 1 145 1 1 1 1 1 1 1 1 1 1 1 1 1 1 1 1 1 1 1 1 1 1 1 1 1 1 1 1 1 
##$CPDPRG= <>
##$CPDPRG1= <>
##$CPDPRG2= <>
##$CPDPRG3= <>
##$CPDPRG4= <mlev>
##$CPDPRG5= <mlev>
##$CPDPRG6= <mlev>
##$CPDPRG7= <mlev>
##$CPDPRG8= <mlev>
##$CPDPRGB= <>
##$CPDPRGT= <>
##$D= (0..31)
0 1 0 0 0 0 0 0 0 0.06 0 0 0 0 0 0 0.0002 0 0 0 0 0 0 0 0 0 0 0 0 0 0 
0 
##$DATE= 1185270763
##$DBL= (0..7)
120 120 120 120 120 120 120 120 
##$DBP= (0..7)
150 150 150 150 150 150 150 150 
##$DBP07= 0
##$DBPNAM0= <>
##$DBPNAM1= <>
$$ [...]
##$SUBNAM7= <"">
##$SUBNAM8= <"">
##$SUBNAM9= <"">
##$SW= 20.6930455092707
##$SWIBOX= (0..15)
0 0 3 0 0 0 0 0 0 0 0 0 0 0 0 0 
##$SW_h= 5175.983436853
##$TD= 65536
##$TD0= 1
##$TE= 297.16
##$TE2= 300
##$TE3= 300
##$TEG= 300
##$TL= (0..7)
0 120 120 120 120 120 120 120 
##$TP= (0..7)
150 150 150 150 150 150 150 150 
##$TP07= 0
##$TPNAME0= <>
##$TPNAME1= <>
##$TPNAME2= <>
##$TPNAME3= <>
##$TPNAME4= <>
##$TPNAME5= <>
##$TPNAME6= <>
##$TPNAME7= <>
##$TPOAL= (0..7)
0.5 0.5 0.5 0.5 0.5 0.5 0.5 0.5 
##$TPOFFS= (0..7)
0 0 0 0 0 0 0 0 
##$TUNHIN= 0
##$TUNHOUT= 0
##$TUNXOUT= 0
##$USERA1= <user>
##$USERA2= <user>
##$USERA3= <user>
##$USERA4= <user>
##$USERA5= <user>
##$V9= 5
##$VALIST= <valist>
##$VCLIST= <CCCCCCCCCCCCCCC>
##$VD= 0
##$VDLIST= <DDDDDDDDDDDDDDD>
##$VPLIST= <PPPPPPPPPPPPPPP>
##$VTLIST= <TTTTTTTTTTTTTTT>
##$WBST= 1024
##$WBSW= 4
##$XGAIN= (0..3)
0 0 0 0 
##$XL= 0
##$YL= 0
##$YMAX_a= 303422
##$YMIN_a= -472677
##$ZGOPTNS= <>
##$ZL1= 120
##$ZL2= 120
##$ZL3= 120
##$ZL4= 120
##$ABSF1= 16.522
##$ABSF2= -4.171173
##$ABSG= 5
##$ABSL= 3
##$ALPHA= 0
##$AQORDER= 0
##$ASSFAC= 0
##$ASSFACI= 0
##$ASSFACX= 0
##$ASSWID= 0
##$AUNMP= <proc_1d>
##$AZFE= 0.1
##$AZFW= 0.1
##$BCFW= 0
##$BC_mod= 0
##$BYTORDP= 0
##$COROFFS= 0
##$CY= 12.5
##$DATMOD= 1
##$DC= 0
##$DFILT= <>
##$DTYPP= 0
##$F1P= 14.0000005364418
##$F2P= -0.99999901652339
##$FCOR= 0.5
##$FTSIZE= 32768
##$FT_mod= 6
##$GAMMA= 0
##$GB= 0
##$INTBC= 1
##$INTSCL= 1
##$ISEN= 128
##$LB= 0.3
##$LEV0= 0
##$LPBIN= 0
##$MAXI= 10000
##$MC2= 0
##$MEAN= 0
##$ME_mod= 0
##$MI= 0
##$NCOEF= 0
##$NC_proc= -4
##$NLEV= 6
##$NOISF1= 0
##$NOISF2= 0
##$NSP= 0
##$NTH_PI= 0
##$NZP= 0
##$OFFSET= 16.522
##$PC= 1
##$PHC0= -47.63011
##$PHC1= 2.951978
##$PH_mod= 1
##$PKNL= yes
##$PPARMOD= 0
##$PSCAL= 4
##$PSIGN= 0
##$REVERSE= no
##$SF= 250.13
##$SI= 32768
##$SIGF1= 0
##$SIGF2= 0
##$SINO= 400
##$SIOLD= 32768
##$SREGLST= <1H.CDCl3>
##$SSB= 0
##$STSI= 32768
##$STSR= 0
##$SW_p= 5175.98343685301
##$SYMM= 0
##$S_DEV= 0
##$TDeff= 65536
##$TDoff= 0
##$TI= <Analysis number 999999
Compound Code 99
Book Reference 9
Project Code 9>
##$TILT= no
##$TM1= 0
##$TM2= 0
##$TOPLEV= 0
##$USERP1= <user>
##$USERP2= <user>
##$USERP3= <user>
##$USERP4= <user>
##$USERP5= <user>
##$WDW= 1
##$XDIM= 32768
##$YMAX_p= 441345121
##$YMIN_p= -180124
$$ End of Bruker specific parameters
$$ ---------------------------------
##NTUPLES= NMR SPECTRUM
##VAR_NAME=  FREQUENCY,     SPECTRUM/REAL,   SPECTRUM/IMAG
##SYMBOL=    X,             R,               I
##VAR_TYPE=  INDEPENDENT,   DEPENDENT,       DEPENDENT
##VAR_FORM=  AFFN,          ASDF,            ASDF
##VAR_DIM=   32768,         32768,           32768
##UNITS=     HZ,            ARBITRARY UNITS, ARBITRARY UNITS
##FACTOR=    0.157963299565203, 1,           1
##FIRST=     4132.6476996994, 0,             0
##LAST=      -1043.33573715361, 0,           0
##MIN=       -1043.33573715361, -180124,     0
##MAX=       4132.6476996994, 441345121,     0
$$ Real data points
##PAGE= N=1
##DATA TABLE= (X++(R..R)), XYDATA
$$ [...]
13816f6483n497J2431M971K6616P9224L1858J5056j5753r09m4460K7608J4176
$$ -66483 -71980 -59549 -54578 -27962 51262 83120 98176 82423 81514 37054 64662 78838
13804G8838k4242k6943j0637j1916j5208o8717L3754Q0105P604l96N147k1784
$$ 78838 54596 27653 17016 5100 -10108 -78825 -45071 35034 42638 42242 47389 25605
13792B5605m3392l5911K4598M6582J2377j5503q266J8746K7616r321j959m6139
$$ 25605 -17787 -53698 -29100 17482 29859 14356 6090 24836 52452 43131 41172 -4967
13780d967n2253o4515K3438K5687P5802O5234k5602n3940K885p486j9570Q962
$$ -4967 -57220 -121735 -98297 -72610 3192 68426 42824 -11116 -8231 -15717 -35287 -26325
13768b6325L7332j4816N95j9171m1478j2188l898L3463L2723L4456J5283n2143
$$ -26325 11007 -3809 -3214 -22385 -63863 -76051 -79949 -46486 -13763 20693 35976 -16167
13756a6167J2811L8585M683J5195L140J8199j3801k0690j9887q890k8200n9255
$$ -16167 -3356 35229 39912 55107 58247 76446 62645 41955 22068 13178 -15022 -74277
13744g4277L622k3622l6535j6381L2352N5489L3112K1924M4043N365l9857J1931
$$ -74277 -70655 -94277 -130812 -147193 -114841 -59352 -26240 -4316 39727 45092 5235 17166
13732A7166l9131j7613j1697o0799j0135M5223K4155q407m139j4522k0044M7810
$$ 17166 -21965 -39578 -51275 -112074 -122209 -76986 -52831 -61238 -65377 -79899 -99943 -52133
13720e2133K3490L0538l8074l7851L7985N9481L2011N876l027j2259k1264j0102
$$ -52133 -28643 1895 -36179 -74030 -36045 23436 55447 61323 58296 46037 24773 14671
13708A4671j8289o803L3505J1238L6044l6272k9343Q7593R684n7889q0230k4863
$$ 14671 -3618 -10421 23084 34322 70366 34094 4751 92344 102028 44139 -36091 -60954
13696f0954J2121q472N2940m2793J3699O7902R662k0992m8692J6813L936K9315
$$ -60954 -48833 -57305 -4365 -47158 -33459 34443 44105 23113 -25579 -8766 -4830 24485
13684B4485K6676J1316k3303N4974J01991P5559K4051J440m9619n3640n0573p9714
$$ 24485 51161 62477 39174 94148 196139 271698 295749 297189 247570 193930 143357 63643
13672F3643n6395l8445k5997r000P798K3550K4899L0164J6444j9254j3500K5431
$$ 63643 7248 -31197 -57194 -66194 -58396 -34846 -9947 20217 36661 17407 3907 29338
13660B9338L075l9396r026M0682K1716k5852m4496m3455p166L2284j478k1895
$$ 29338 32413 -6983 -16009 24673 46389 20537 -23959 -67414 -74580 -42296 -43774 -65669
13648f5669K3470K4953M8627J8287K2678L4174k2743J0777L6222L1609L2642M8973
$$ -65669 -42199 -17246 31381 49668 72346 106520 83777 94554 130776 162385 195027 244000
13636B44000Q5390J78683K15879J51527p061j33896k07714k05240j03999o5476
$$ 244000 329390 508073 723952 875479 868418 734522 526808 321568 217569 152093
13626A52093l6224p395j3479j1306k9530m5271k9139J8254m8814L73L4181J9861
$$ 152093 115869 108474 94995 83689 54159 8888 -20251 -1997 -50811 -50438 -16257 3604
13614C604j6511j4420J434k4747M4204N573r282m7282o197P0718J8364j5902k9598
$$ 3604 -12907 -27327 -25893 -50640 -6436 -863 -10145 -57427 -63624 7094 25458 9556 -20042
13601b0042O533Q744J9213O8572P097n313J1047L5235K9605P9061J34053J70090
$$ -20042 -13509 -4765 14448 83020 90117 84804 95851 131086 160691 239752 373805 543895
13589E43895J64009J34978L7178j41040k17897j71166r2793j30963p4359K2548
$$ 543895 707904 842882 880060 739020 521123 349957 257164 126201 51842 74390
13579G4390K5377n6151J0116k8779l6894m3739L1520M7740k203k7437j3225r285
$$ 74390 99767 43616 53732 24953 -11941 -55680 -24160 23580 21377 -6060 -19285 -28570
13567b8570l2980k5845L092N2731N1397q795j1290j2430L0980K8617r335M700
$$ -28570 -61550 -87395 -84303 -31572 19825 11030 -260 -12690 18290 46907 37572 42272
13555D2272p54K100O694J3938p105J4500j2636k2876r16M8854M6556N0871N1073
$$ 42272 41518 43618 50312 64250 57145 71645 59009 36133 35217 84071 130627 181498 232571
13542B32571m497n7137p8060o5042J9659K0182J366O330j9256N001k2737q179
$$ 232571 228074 170937 92877 27835 47494 67676 69042 75372 56116 61117 38380 30201
13530C0201m309l0109P040k1680j5601j8305M902j3886j0255L6658L1187O35j992
$$ 30201 25892 -4217 2823 -18857 -34458 -52763 -47861 -61747 -72002 -35344 -4157 -3522 -5514
13517e514k1825j822J1536j0340m0560j3163K4833L4523j5284J4838m08k2542
$$ -5514 -27339 -29161 -17625 -27965 -68525 -81688 -56855 -22332 -37616 -22778 -23186 -45728
13505d5728j441M706J6725m575N7554N8364m3854n2650K0422k447o4164M3266
$$ -45728 -47169 -42463 -25738 -30313 27241 85605 41751 -10899 9523 7076 -57088 -13822
13493a3822J9360Q122K9837j8995o8945k1389k985j0376r56M14K8451k4396J3461
$$ -13822 5538 13660 43497 24502 -44443 -65832 -68817 -79193 -80149 -79735 -51284 -75680 -62219
13480f2219K2241n928R080J3961k9960q503k697k7528l0070m163L6201J3283j3609
$$ -62219 -39978 -45906 -36826 -22865 -52825 -61328 -64025 -91553 -121623 -125786 -89585 -76302 -89911
13467h9911l1301N564J8614K6758J8271N1062l418L3704J7972m6103k4399n8653
$$ -89911 -121212 -115648 -97034 -70276 -52005 -943 -4361 29343 47315 1212 -23187 -81840
13455h1840L1411L1157M1867l503p1495l7286J5834L2623P3053m4847l5084M3993
$$ -81840 -50429 -19272 22595 19092 -52403 -89689 -73855 -41232 31821 -13026 -48110 -4117
13443d117M2495m2880l2000M560K6842k9735j4286M3370O6877k1697n5488l4432
$$ -4117 38378 -4502 -36502 -31942 -5100 -34835 -49121 -5751 61126 39429 -16059 -50491
13431e0491l4989q423j4594L6317L9580M0201N9158j8438k6113m1356o088r285
$$ -50491 -85480 -93903 -108497 -72180 -32600 7601 66759 48321 22208 -19148 -25236 -34521
13419c4521J7679k1572L4200O583l7534k4147J7455J4761k8007l5010N470J3769
$$ -34521 -16842 -38414 -4214 2369 -35165 -59312 -41857 -27096 -55103 -90113 -84643 -70874
13407g0874J240L0445O143k8143p725J4402J2563J4204J732M324j2931n1349J3149
$$ -70874 -69634 -39189 -33046 -61189 -68914 -54512 -41949 -27745 -26013 -21689 -34620 -85969 -72820
13394g2820o3310K348N6218n226l5410M1874L5380M0480K4165J0977R451j1876
$$ -72820 -136130 -133782 -77564 -82790 -118200 -76326 -40946 -466 23699 34676 44127 32251
13382C2251L7795L0833K3627L8841j8794l7135l8494k4909J8354M0707K8288m655
$$ 32251 70046 100879 124506 163347 144553 107418 68924 44015 62369 103076 131364 126709
13370A26709L2037m696l7402n606L7909K0453l5171n610j048p395j10J6701l844
$$ 126709 158746 154050 116648 111042 148951 169404 134233 128623 127575 120180 120070 136771 132927
13357A32927M575m3436l3297k2605K6780J3318n3790j8424N7885M4956j7426l858
$$ 132927 137502 94066 60769 38164 64944 78262 24472 6048 63933 108889 91463 87605
13345H7605L3869R2065K9669K4315k6259l3594L3026k4591l8158K2040N100m8131
$$ 87605 121474 213539 243208 267523 241264 207670 240696 216105 177947 199987 205087 156956
13333A56956l411k2104J0864M9829n5956m6217K1328L1730R820k7932k8692J1522
$$ 156956 153545 131441 142305 192134 136178 89961 111289 143019 152839 124907 96215 107737
13321A07737m6152J80J3058l9970m6915n8096m606J5723j283n0405r770N6338
$$ 107737 61585 61765 74823 34853 -12062 -70158 -74764 -59041 -60324 -110729 -120499 -64161
13309f4161M0589M579m3344j4121N3259M1816M2426L2401M3619J02725J25264
$$ -64161 -23572 -18993 -62337 -76458 -23199 18617 61043 93444 137063 239788 365052
13298C65052J35707N6401m4889n8352q8068o9194k2877K1739l9854Q626M5723
$$ 365052 500759 557160 512271 453919 365851 296657 273780 295519 255665 264291 310014
13287C10014J8361l1410n5791o226m750j1776J4296k8251j7494j6582k3182Q165
$$ 310014 328375 296965 241174 234948 230198 218422 232718 204467 186973 170391 147209 155374
13275A55374P776M6041j1566Q46j7798M4676K7913K1538J1135K5843L113L4167
$$ 155374 163150 209191 197625 198471 180673 225349 253262 274800 285935 311778 314891 349058
13263C49058k7353n4339r126J12399Q6316m6941j7516P0651N0827J19973J36960
$$ 349058 321705 267366 258240 370639 456955 410014 392498 463149 513976 633949 770909
13252G70909M6477m5626r4625m3031p0709p3788l420Q861j0119L3072N3033K8143
$$ 770909 817386 771760 677135 634104 563395 489607 486187 495048 484929 518001 571034 599177
13240E99177J3275L7703L3773K8700L7742N3412J12850J55863K16429L00185L01561
$$ 599177 612452 650155 683928 712628 750370 803782 916632 1072495 1288924 1589109 1890670
13229A890670L01770K80593L31155M62384P16516R18616J191654J857983L046983
$$ 1890670 2192440 2473033 2804188 3266572 3983088 4901704 6093358 7951341 10998324
13220A0998324N166184Q455240J2210564J3252956P461251l691664j2017349j2725418
$$ 10998324 16164508 24619748 36830312 50083268 57544519 53852855 41835506 29110088
13212B9110088r247877n699957l373291k049248j392109j089690q39462p09390
$$ 29110088 19862211 14162254 10788963 8739715 7347606 6257916 5418454 4709064
13204D709064o10442m75100l87101k97732k09849j04888m928j2700K1292J983
$$ 4709064 4098622 3623522 3236421 2938689 2728840 2623952 2619024 2606324 2627616 2629599
13194B629599J27903J44865Q6146R1488K02990K66201L30713M41181P00482Q82977
$$ 2629599 2757502 2902367 2988513 3080001 3282991 3549192 3879905 4321086 5021568 5904545
13184E904545Q97958Q02522J016841J402839J857631K497212L443249N191926
$$ 5904545 6802503 7605025 8621866 10024705 11882336 14379548 17822797 23014723
13176B3014723Q352710J4053274K3359755L5329187M2666880L1115186k985315
$$ 23014723 31367433 45420707 68780462 104109649 146776529 177891715 174906400
13169A74906400l5583674m3287435l2540290j9761395j1476041o839416m510328
$$ 174906400 139322726 96035291 63495001 43733606 32257565 25418149 20907821
13162B0907821l434394k586519k062996j807844j503265j300560r90415q02190
$$ 20907821 17473427 14886908 12823912 11016068 9512803 8212243 7221828 6419638
13154F419638n88286m21428k11695j11049q4429p197N9021o1932j02899m4006
$$ 6419638 5831352 5409924 5198229 5087180 5002751 4995554 5054575 4992643 4889744 4845738
13144D845738J33818L18350M62563O10094P50213Q72762Q27426Q92304J306418
$$ 4845738 4979556 5297906 5760469 6370563 7120776 7993538 8820964 9713268 11019686
13135A1019686J875297K460090L289111M821614P822085J3025108K1539976L3330502
$$ 11019686 12894983 15355073 18644184 23465798 31287883 44312991 65852967 99183469
13127I9183469M2814830L5970868M705437l1578927m4983079l6216223k2497434
$$ 99183469 141998299 177969167 182674604 151095677 106112598 69896375 47398941
13120D7398941j2937554p705531n054274l599277k593019j918289j591468j578701
$$ 47398941 34461387 26755856 21701582 18102305 15509286 13590997 11999529 10420828
13112A0420828j637069j395195j039962p86184n69596l84744k68847j69741r7632
$$ 10420828 8783759 7388564 6348602 5562418 4992822 4608078 4339231 4169490 4071858
13103D071858j91083k67724k01478o3996K6409J41058J76871R4665O1613J14879
$$ 4071858 3880775 3613051 3411573 3347577 3373986 3515044 3691915 3786580 3848193 3963072
13093C963072J82101K94762M41323N86545P82377J083864J636887K520606M088130
$$ 3963072 4145173 4439935 4881258 5467803 6250180 7334044 8970931 11491537 15579667
13084A5579667O766925J0466046J3776239J2293476L085224q702251j4266925
$$ 15579667 22346592 32812638 46588877 58882353 61967577 53265326 38998401
13077C8998401j2564965q277889m904450k964636j945902j281170p54283m90872
$$ 38998401 26433436 18155547 13251097 10286461 8340559 7059389 6305106 5814234
13069E814234l88924n60189q33585p62940m89026l89069k77483j49154j27043
$$ 5814234 5425310 4865121 4031536 3268596 2779570 2390501 2113018 1963864 1836821
13060A836821j41756r4076j19480j29037p2465L9299K4390P1956J5333j38384
$$ 1836821 1695065 1600989 1481509 1352472 1280007 1319306 1343696 1415652 1430985 1292601
13050A292601j75136j02030p1576l9509M574M3305l7713l9057j3843K8207K8656
$$ 1292601 1117465 1015435 943859 904350 908924 952229 914516 875459 861616 889823 918479
13039I18479K9033L9310P9762M3574j26632j65786q4121J0821l0389l8270Q195
$$ 918479 947512 986822 1066584 1110158 983526 817740 733619 744440 714051 675781 683976
13028F83976K7233J2623Q2999J43743P4744p7856j42810j15044l2956q619m4848
$$ 683976 711209 723832 806831 950574 1025318 947462 804652 689608 656652 648033 603185
13017F03185n1908l0205k5794l7240K3177j148M729n6878J506N9859j463l6663
$$ 603185 551277 521072 495278 458038 481215 480067 484796 427918 429424 489283 487820 451157
13005D51157l6325j9570J2190j1847p446N5400J8771r371k5274L823L7237K742
$$ 451157 414832 395262 407452 395605 388159 443559 462330 452959 427685 431508 468745 471487
12993D71487M7756P4263m3734o9999l3046j5808n0880l9869M568j3737N85L513
$$ 471487 519243 593506 549772 479773 446727 430919 380039 340170 344738 331001 331586 335099
12981C35099M85M891P453J0013j8656L8556j579K0366M7465N246k1487o4600p024
$$ 335099 335584 340475 347928 357941 339285 377841 376262 396628 444093 449339 427852 363252 356228
12968C56228N2109M4515L1125L9519k8640L5506L1390k3112j2994M382j5296R981
$$ 356228 408337 452852 483977 523496 494856 530362 561752 538640 525646 530028 514732 524713
12956E24713j4732j4310k369L3539K1587M3978R7351J4120j9850k3153J2932M0803
$$ 524713 509981 495671 493302 526841 548428 592406 689757 703877 684027 660874 673806 714609
12944G14609J06548P7398O2555J84615J27725Q9670K37287K89037K92738K01687
$$ 714609 821157 898555 961110 1145725 1273450 1363120 1600407 1889444 2182182 2383869
12934B383869O5053k4331l029L4680m1167k9048J2912P5890R1352Q4323J50251
$$ 2383869 2448922 2424591 2421562 2456242 2415075 2386027 2398939 2474829 2566181 2650504 2800755
12923B800755K85132L46397N56174P79832J006950J396234J924417K819898L603589
$$ 2800755 3085887 3432284 3988458 4768290 5775240 7171474 9095891 11915789 15519378
12914A5519378L856899L406307K627727J767215J309826J233200J074227Q19950
$$ 15519378 19376277 22782584 25410311 27177526 28487352 29720552 30794779 31614729
12906C1614729N61115N32328N73354M19455l8411m77628m50118L24730J467638
$$ 31614729 32175844 32708172 33281526 33700981 33662570 33184942 32734824 33059554 34527192
12897C4527192J660689O10453r71883k235474k613149k337854k034246j842086
$$ 34527192 36187881 36798334 35826451 33590977 30977828 28639974 26605728 24763642
12889B4763642j431027n44629P28055K081420K729989K401213J453515N39462
$$ 24763642 23332615 22787986 23516041 25597461 28327450 30728663 32182178 32721640
12881C2721640N0214Q7134K06526J93779K03276K79506N18777M64861K6209m74787
$$ 32721640 32771854 32858988 33065514 33259293 33462569 33742075 34260852 34725713 34751922 34277135
12871C4277135p38915l80921M15469N23368n11039j899809k691008k857289k641215
$$ 34277135 33538220 33157299 33572768 34096136 33585097 31685288 28994280 26136991 23495776
12862B3495776k582734k717859k742641k529848k073760j607214j212980p80680
$$ 23495776 20913042 18195183 15452542 12922694 10848934 9241720 8028740 7248060
12854G248060n02089k64480j27756r804J21192K44110M54558Q52274J416011K067571
$$ 7248060 6745971 6481491 6353735 6343931 6465123 6709233 7163791 8016065 9432076 11499647
12844A1499647K682268K975705L053524L401432L867460M119126L548373K212070
$$ 11499647 14181915 17157620 20211144 23612576 27480036 31599162 35147535 37359605
12836C7359605P61245j30345j35301K84181O23314P22987L91882k47496n67301
$$ 37359605 38120850 37990505 37855204 38139385 38762699 39485686 39877568 39630072 39062771
12827C9062771n20850l97383r3911L83402O22894J51178q81406k100805k904243
$$ 39062771 38541921 38144538 38050627 38434029 39056923 39208101 38326695 36225890 33321647
12818C3321647k867869k181335j146941O0121R41668J633135K221876K698058
$$ 33321647 30453778 28272443 27125502 27185623 28127291 29760426 31982302 34680360
12810C4680360K931634K323567P52413n13534r42012n56672K28167O61845M79880
$$ 34680360 37611994 39935561 40687974 40174440 39232428 38675756 38903923 39565768 40045648
12801D0045648R8474j80947m39490o27585p32645q20089p60638p48457j201805
$$ 40045648 40144122 39963175 39523685 38896100 38163455 37343366 36582728 35834271 34632466
12792C4632466k213234l293710m030072m321889m028399l402455k678045k126472
$$ 34632466 32419232 29125522 25095450 20773561 16745162 13342707 10664662 8538190
12784H538190j576843j089314q09602o07762m44542l72651l16756k63302k24668
$$ 8538190 6961347 5872033 5062431 4454669 4010127 3637476 3320720 3057418 2832750
12775B832750k08787j76645j60289j42559j19320j13407j01069j03206j06664
$$ 2832750 2623963 2447318 2287029 2144470 2025150 1911743 1810674 1707468 1600804
12766A600804j12208o9125m7989j04622p2409j01110q0465l1254n3352n2225j5410
$$ 1600804 1488596 1419471 1371482 1266860 1194451 1093341 1012876 981622 928270 876045 860635
12755H60635M6976k9921l7794J872n011L4780j1237J0629O3916M9112j78p9380
$$ 860635 907611 877690 839896 841768 836757 871537 860300 870929 934845 983957 983779 904399
12743I04399p7669n2249o3078m0975o319l921j6132J0802M732n7390p967n4198
$$ 904399 826730 774481 711403 670428 664109 660188 644056 654858 659590 602200 594233 540035
12731E40035n810j6742J6120j4768l9805j3346k6783k7202j9234J1948J1751k6782
$$ 540035 534225 517483 533603 518835 479030 465684 438901 411699 392465 404413 416164 389382
12719C89382j7411j537P077K8029M6645n760K9642L394o017J0619q261K119P9528
$$ 389382 371971 370434 377511 405540 452185 446425 476067 479461 473444 484063 475802 477921 557449
12706E57449L4091O5288J08427J59693K17928J59924j7145j64381k06674j72475
$$ 557449 591540 656828 765255 924948 1142876 1302800 1285655 1121274 914600 742125
12696G42125m9651m5813q6991r6719o9739Q70L8401q065m3078j6128j3787J1706
$$ 742125 692474 646661 559670 462951 393212 394082 432483 424418 381340 365212 351425 363131
12684C63131J2194J9983K0521L6249r135j9219n8333n8507l5118M0186K4390n9700
$$ 363131 375325 395308 415829 452078 442943 423724 365391 306884 271766 311952 336342 276642
12672B76642l9641j5024j9069M8909K9663K7027k4804J824P4021Q4473K2723N843
$$ 276642 237001 221977 202908 251817 281480 308507 283703 285527 359548 444021 466744 472587
12660D72587J6936J03700J43650K61197K18808O4445j00577k17445k08045j49200
$$ 472587 489523 593223 736873 998070 1216878 1281323 1180746 963301 755256 606056
12650F06056j29480j0496k6982p3639j8738L7983l374m3089k2628j6921j4289
$$ 606056 476576 466080 439098 365459 346721 384704 381330 338241 315613 298692 284403
12639B84403j4406k8430p681k5110k5168J1178K6654L5306m496l0469P823m288
$$ 284403 269997 241567 233886 208776 183608 194786 221440 256746 252250 221781 229604 225316
12627B25316j3958l7331m0889j6224L3837M4910N4718K8532M942k2734M535J6072
$$ 225316 211358 174027 133138 116914 150751 195661 250379 278911 283853 261119 265654 281726
12615B81726m646r558K1353Q6949P2397L4640j8450k5435m4168o3028l7336k1832
$$ 281726 277080 267522 288875 375824 448221 482861 464411 438976 394808 331780 294444 272612
12603B72612n6764J1781R173k6251J5081R868j7m7093R974L0833N576K0988m425
$$ 272612 215848 227629 236802 210551 225632 235500 235483 188390 198364 229197 234773 255761 251336
12590B51336K8879j1340J3462k9220j2439l1838J3196m637m5862k6202j9077K3923
$$ 251336 280215 268875 282337 253117 240678 208840 222036 217399 171537 145335 126258 150181
12578A50181J9111L805K177l64M6784J8986m618M2898L0862K9988j1628J6611
$$ 150181 169292 173097 175274 174910 221694 240680 236062 278960 309822 339810 328182 344793
12566C44793L666j2789P3702P2563J29740K36252L39928L21621l771l43962m23251
$$ 344793 348459 335670 409372 481935 611675 847927 1187855 1509476 1505705 1161743 738492
12555G38492k11674j20082r2408o179l4593k4150M6294M43j6926j744J1097P710
$$ 738492 526818 406736 314328 308149 273556 249406 295700 296143 279217 277473 288570 296280
12543B96280m3942j1073j2595m5539M1899J060K4543K270l0418K9290L4938P475
$$ 296280 252338 241265 228670 183131 225030 226090 250633 252903 222485 251775 286713 294188
12531B94188l4088n1648Q820M8669N6426j4186N1925P8404P7152J09942J55764
$$ 294188 260100 208452 217272 265941 322367 308181 360106 438510 515662 625604 781368
12520G81368K09331K40157M01070P69810J071390J178078O43061o10533j258616
$$ 781368 990699 1230856 1631926 2401736 3473126 4651204 5294265 4683732 3425116
12511C425116r15732n60493k99239j90747r7901m3778r830k8579o4412J1358K4885
$$ 3425116 2509384 1948891 1649652 1458905 1361004 1317226 1307396 1278817 1214405 1225763 1250648
12500A250648k2250j6865R4022N5100o2873j36318j17032r9244n7026n5261l2711
$$ 1250648 1228398 1211533 1305555 1360655 1297782 1161464 1044432 945188 888162 832901 800190
12489H00190k3085j7764L3061K9338M7306M9769n8097j943k1392k8396k7869J0461
$$ 800190 777105 759341 792402 821740 869046 918815 860718 858775 837383 808987 781118 791579
12477G91579Q5926J26511J91687L15001M75863Q12972J123320R72552n9715j117134
$$ 791579 877505 1004016 1195703 1510704 1986567 2799539 3922859 4895411 4835696 3718562
12467C718562j082772n94352l01289n8083P4470K8898q6694j45812k02022k11587
$$ 3718562 2635790 2041438 1740149 1682066 1756536 1785434 1698740 1552928 1350906 1139319
12457A139319j40923r8385o5163p3637q1014j6009O7430M1453K8392N0729J05925
$$ 1139319 998396 900011 834848 761211 680197 664188 731618 773071 801463 852192 958117
12446I58117R7574J21664J87791J62739N2615l501r1969j30633j12833r4225n3916
$$ 958117 1055691 1177355 1365146 1527885 1580500 1576999 1485030 1354397 1241564 1147339 1093423
12435A093423n9051k2680J1605J6045k7045N616J60796K28170K85728M61678J95801
$$ 1093423 1034372 1011692 1023297 1039342 1012297 1017913 1178709 1406879 1692607 2154285 2350086
12424B350086k86744l39937j42996j13671j32883k01470k50812j41953p7206k4117
$$ 2350086 2063342 1723405 1580409 1466738 1333855 1132385 881573 739620 662414 638297
12414F38297k0427j06722j8419m615j8762j5396j4532j8900l4670J3205N7783
$$ 638297 617870 511148 492729 488114 469352 453956 439424 420524 385854 399059 456842
12403D56842K6776l7741q81J8823P616l6808m8842p2281m3603o618o9860r860
$$ 456842 483618 445877 444996 463819 471435 434627 385785 313504 269901 263283 193423 183563
12391A83563K7691k4854K013l5746n2596k774K1805k877J3515O687j5533J4638
$$ 183563 211254 186400 188413 152667 100071 97297 119102 116225 129740 136427 120894 135532
12379A35532O3151O598M821L8799K2308J8965j0790P17O824L4338k1273m4137
$$ 135532 198683 205281 210102 248901 271209 290174 279384 280101 286925 321263 299990 255853
12367B55853o859O2761P6041P1345O7754J7614L8779j2818l9624n6078j7594k391
$$ 255853 248994 311755 387796 459141 526895 544509 583288 570470 530846 474768 457174 454783
12355D54783j3541l7434n7636j1502M0445N7428K7657P569j9201k2516J1186N2043
$$ 454783 441242 403808 346172 334670 375115 432543 460200 467769 448568 426052 437238 489281
12343D89281j1352m8839k0443K2929M2805j5523m1242J9583p712n7619j2398j3303
$$ 489281 477929 429090 408647 431576 474381 458858 417616 437199 429487 371868 359470 346167
12331C46167k2582K5012J5759k3924R827j016k6252p1128m4940o0857l1668j0042
$$ 346167 323585 348597 364356 340432 350259 349243 322991 251863 206923 146066 114398 104356
12319A04356n9086j6831L0508L4690j2689N839Q833o211R759M1086K3841l2759
$$ 104356 45270 28439 58947 93637 80948 86787 95620 89409 99168 140254 164095 131336
12307A31336n6277k3055K4920K6773r713M047j2604r662k0072N891l93m8789j6712
$$ 131336 75059 52004 76924 103697 93984 98031 85427 75765 55693 61584 61191 12402 -4310
12294d310L2103M6951j7196m3319l8807k4861K3444Q9287L2884r423p853j1099
$$ -4310 27793 74744 57548 14229 -24578 -49439 -25995 63292 96176 86753 78900 67801
12282F7801M5910j8785j9528j9206j3812P62l041K8750J7249J600K9275J3822
$$ 67801 113711 94926 75398 56192 42380 43142 40101 68851 86100 87700 116975 130797
12270A30797l0975m9377k456L4737J3633k3610j0224K6133k7558J0289L6150k685
$$ 130797 99822 50445 47989 82726 96359 72749 62525 88658 61100 71389 107539 104854
12258A04854J0177k199J3261k8264k9976p390N366O933j9539J501J8386k566J8849
$$ 104854 115031 112832 126093 97829 67853 60463 65829 72762 53223 54724 73110 70544 89393
12245H9393M792m551k0026k0763K1398L2221q692p5138k2889L7518K7957K159
$$ 89393 94185 89634 69608 48845 70243 102464 93772 18634 -4255 33263 61220 63379
12233F3379l9312K339J6036j1609k4139j0663k7268k0066K2899J0449J4140N5506
$$ 63379 24067 26406 42442 30833 6694 -3969 -31237 -51303 -28404 -17955 -3815 51691
12221E1691k7825l2693M2605K1577p200L5059M896n0422K1609O5065K9150k2959
$$ 51691 23866 -8827 33778 55355 48155 83214 88110 37688 59297 124362 153512 130553
12209A30553J0951L8517K0436l3905J9641M5008k3474k7847j6177J0788P803j2625
$$ 130553 141504 180021 200457 166552 186193 231201 207727 179880 163703 174491 182294 169669
12197A69669o7015m0092K3225L6539M5971j0384l7780Q519K0408j1028j8899m768
$$ 169669 102654 62562 85787 122326 168297 157913 120133 128652 149060 138032 119133 114365
12185A14365j7010L393j6269l8788j6781k6204j6845l9100J9430N7334O1152m971
$$ 114365 97355 100748 84479 45691 28910 2706 -14139 -53239 -33809 23525 84677 79706
12173G9706j266J9636l5204J4347L5711M0677J2601j405J5702k1657m7562K940
$$ 79706 78440 98076 62872 77219 112930 153607 166208 164803 180505 158848 111286 114226
12161A14226l7676m1190J9889K4351j525K4479l1403k9473J0348J3898p212L6079
$$ 114226 76550 35360 55249 79600 78075 102554 71151 41678 52026 65924 58712 94791
12149I4791N4343j6279l7832K7092N9279m8824l9971O56M7043L1328k8896L6562
$$ 94791 149134 132855 95023 122115 181394 132570 92599 93255 140298 171626 142730 179292
12137A79292J928K0851R536k604O7411N5477j2687Q3033J22566P1772O3886L8665
$$ 179292 181220 202071 211607 209003 276414 331891 319204 402237 524803 596575 660461 699126
12125F99126j3504l6249n3243r6581n7658m6936j0542J058R299M5200R4585N7434
$$ 699126 685622 649373 596130 499549 441891 394955 384413 385471 394770 439970 534555 591989
12113E91989j1672l5479l4677l4411M0989O9931J8752L5894L0410L1231N0896
$$ 591989 580317 544838 510161 475750 516739 586670 605422 641316 671726 702957 753853
12102G53853K7849Q4122J12436N3090P1866J01652J67171J91055J89586K14368
$$ 753853 781702 865824 978260 1031350 1103216 1204868 1372039 1563094 1752680 1967048
12092A967048K34091L88239N62165O73028Q72672J019659R17244R86829J568468
$$ 1967048 2201139 2589378 3151543 3824571 4697243 5716902 6634146 7620975 9189443
12083I189443K444823L620762N039217O580849P620655P097903M055666m38946
$$ 9189443 11634266 15255028 20294245 26875094 34495749 41593652 45649318 45210372
12075D5210372l847372m927838m317687l342709k467841j353464J67696J754081
$$ 45210372 41363000 36435162 32117475 28774766 26306925 24953461 25121157 26875238
12067B6875238L154513M186673M998577N193345L480864n57259n121562p512174
$$ 26875238 30029751 34216424 39215001 44408346 47889210 47331951 42210389 34698215
12059C4698215p243091n844382m382306l293249k495215j816834j359304j193981
$$ 34698215 27455124 21610742 17228436 13935187 11439972 9623138 8263834 7069853
12051G069853r94475q03693o64313m76745m08460k99047k19405j48832o4563l7210
$$ 7069853 6075378 5271685 4607372 4130627 3722167 3423120 3203715 3054883 2990320 2953110
12041B953110L5673Q8981J32801L9619k9017j93450k19795j85089j38240j32745
$$ 2953110 2988783 3077764 3210565 3250184 3221167 3027717 2807922 2622833 2484593 2351848
12031B351848j50552p7567J5421P5191Q6944J09041J14768J76805K20947J85883
$$ 2351848 2201296 2123729 2139150 2214341 2301285 2410326 2525094 2701899 2922846 3108729
12021C108729K29471L13394M03773N04851O31330Q20744J120839J405998J721655
$$ 3108729 3338200 3651594 4055367 4560218 5191548 6012292 7133131 8539129 10260784
12012A0260784J956329K174483K828001L997532N701811P621337R407616J0597202
$$ 10260784 12217113 14391596 17219597 21217129 26918940 34540277 43947893 54545095
12004E4545095J0761776R016627N079364J72947m201749o815184p191792o131777
$$ 54545095 65306871 74323498 79402862 79575809 75374060 68558876 61367084 55235307
11996E5235307m079973j405368J467427M094489N803094O416408O083495M463478
$$ 55235307 51155334 49749966 51217393 55311882 61114976 67531384 73614879 78078357
11988G8078357J342593k768603o955543j0145528j1174018j0146201q140587o067247
$$ 78078357 79420950 76652347 69696804 59551276 48377258 38231057 30090470 24023223
11980B4023223m428498l191663k509026k029276j749824j527216j210505r62648
$$ 24023223 19594725 16403062 13894036 11864760 10114936 8587720 7377215 6414567
11972F414567p75332o02267n33463n08061l96671l16272k84045k49231k03606
$$ 6414567 5639235 5036968 4503505 3995444 3598773 3282501 2998456 2749225 2545619
11963B545619j12969j02909m7106l0436o284N4668J9743p4563n0435K748k6155
$$ 2545619 2432650 2329741 2282635 2252199 2245915 2300583 2320326 2245763 2195328 2198076 2171921
11952B171921J9995J12767Q7819R8170Q7559P3004O5152R0428J10680J93322L43013
$$ 2171921 2191916 2304683 2392502 2490672 2578231 2651235 2716387 2806815 2917495 3110817 3453830
11941C453830M07283M98023O88368Q58277R71382J151442J554329K218458L156078
$$ 3453830 3861113 4359136 5047504 5905781 6877163 8028605 9582934 11801392 14957470
11932A4957470M347802N743375O647235O136016L698920L40873k802793m752118
$$ 14957470 19305272 25048647 31695882 37831898 41530818 41871691 39068898 34316780
11924C4316780m830625l740265k418975j012370M33009J730831K517286L138784
$$ 34316780 29486155 25745890 23326915 22314545 22747554 24478385 26995671 30134455
11916C0134455L662746L552161K368512j48709l346913o058442p039067n986717
$$ 30134455 33797201 37349362 39717874 39569165 36222252 30163810 23124743 17138026
11908A7138026m186483k752017j829911j193080r24790q17678o70008o65870o23147
$$ 17138026 12951543 10199526 8369615 7176535 6251745 5434067 4764059 4098189 3475042
11899C475042m64011l45539k79403k22908k18621k24956j68412p4520j08860r5687
$$ 3475042 3011031 2665492 2386089 2163181 1944560 1719604 1551192 1476672 1367812 1272125
11889A272125j04647p9082o2822q1468N106k2086m6712j7169l9124m0381m3547
$$ 1272125 1167478 1088396 1025574 944106 949212 927126 880414 863245 824121 783740 740193
11878G40193l9796j1J6743K8777m9068l8550m5789l1002p6891j7205M9765l337
$$ 740193 700397 700386 717129 745906 696838 658288 612499 581497 504606 487401 537166 533829
11866E33829N289l4625k6740j4370K807N619L197n512J2014k7801k2740k8641
$$ 533829 539118 504493 477753 463383 466190 471809 475006 469494 481508 453707 430967 402326
11854D02326k9973K6371k9091j2815l464k0664L726k3853j9286l418m1716J6151
$$ 402326 372353 398724 369633 356818 353354 332690 336416 312563 293277 289859 248143 264294
11842B64294L7236K3788o5609O3627Q4182l9783o2209Q975L3153k0888J948N7831
$$ 264294 301530 325318 259709 323336 407518 367735 305526 314501 347654 326766 328714 386545
11830C86545m6216o8843r41J8399M6014m268p0070m0571K2888M2599J902l8820
$$ 386545 340329 271486 270545 288944 334958 330690 260620 220049 242937 285536 287438 248618
11818B48618N9105K1602k4760j3783J449J938o2858k4141K1772O1544o755p0685
$$ 248618 307723 329325 304565 290782 292231 294169 231311 207170 228942 290486 283731 213046
11806B13046j5761J1435L608N4272l8495n0617K5604K4353P799l1849J2961k014
$$ 213046 197285 208720 212328 266600 228105 177488 203092 227445 235244 203395 216356 214342
11794B14342L1643p568l3500j3718lP40J5421N4531j82j9310m5748k5848l585
$$ 214342 245985 238417 204917 191199 191196 191936 207357 261888 261706 242396 196648 170800 167215
11781A67215j9471j7263L7346R752P662j7152P04m5540k517J013O306j7515m510
$$ 167215 147744 130481 167827 177579 185241 168089 168793 123253 120736 121749 128055 110540 106030
11768A06030J3719K8119L1287j5799J1388J155K6172q481K2445l0373m6436J5315
$$ 106030 119749 147868 179155 163356 174744 175899 202071 193590 216035 185662 139226 154541
11756A54541L8825O6625L246r4233N742N783k7044m7697l0909k3735p730K1563
$$ 154541 193366 259991 263237 169004 174746 180529 153485 105788 74879 51144 43414 64977
11744F4977J8647k2120j0254J518L9245J1768j0001L780j2532J3184J0241K7416
$$ 64977 83624 61504 51250 52768 92013 103781 93780 97560 85028 98212 108453 135869
11732A35869O3269J8282j8245k1665J5157k326K0746J7072j6299l5882m7559J0849
$$ 135869 199138 217420 199175 177510 192667 190341 211087 228159 211860 175978 128419 139268
11720A39268o07m686m4801o7435j410O4257M090k3453j6673k1317L9288O1843
$$ 139268 138661 133975 89174 21739 20329 84586 88676 65223 48550 27233 66521 128364
11708A28364P4885P693k0684p7181j1691K4586p0139O548M6965O1018j8525o2370
$$ 128364 203249 210942 190258 113077 101386 125972 55833 62381 109346 170364 151839 89469
11696H9469m2869N224O1434J8921l7909N0918K7804m5234J752j5101k7386l0963
$$ 89469 46600 51824 113258 132179 94270 145188 172992 127758 129510 114409 87023 56060
11684E6060l651N2374M761L188P807K646K2460L5930j3483K3364k5943q4001j1055
$$ 56060 52409 104783 109544 112732 120539 123185 145645 181575 168092 191456 165513 81512 70457
11671G0457K2582J1337j5607q643r608j4545k9609M430Q220L3332j6961j2980
$$ 70457 93039 104376 88769 80126 70518 55973 26364 30794 39014 72346 55385 42405
11659D2405K1822J2184o225r962q848j5530J2295r083N987M7671J53J6098k862
$$ 42405 64227 76411 70186 60224 51376 35846 48141 39058 45045 92716 92869 108967 106105
11646A06105P990r540M780n8124J4159R4441M8569M4738L6911P4055m248k1901
$$ 106105 114095 104555 109335 51211 65370 159811 208380 253118 290029 364084 359836 337935
11634C37935l7451o4228j8369K8421l6857k9141m7883l064L3821K7213J6518N0677
$$ 337935 300484 236256 217887 246308 209451 180310 132427 129363 163184 190397 206915 257592
11622B57592L0562J0277Q606j7890q3364m4246K476j7786j2289l8923j6906r113
$$ 257592 288154 298431 307037 289147 205783 161537 164013 146227 133938 95015 78109 68996
11610F8996n37L5402K5457m1689n5465k3925j6294L6363k6267q208Q728J4613
$$ 68996 68459 103861 129318 87629 32164 8239 -8055 28308 2041 -6167 2561 17174
11598A7174L08j0883l013L8440M4055Q366J8921M0652k780o4163k2885J4500m7897
$$ 17174 17482 6599 3586 42026 86081 94447 113368 154020 151240 87077 64192 78692 30795
11585C0795n3185R658J6325J1352J7920J8481J1111L9786k2614j6001L1242K912
$$ 30795 -22390 -12732 3593 14945 32865 51346 62457 102243 79629 63628 94870 97782
11573I7782K2995K7460j5388J3994K3833j8588R627N0698J18789O4908L9946K8372
$$ 97782 120777 148237 132849 146843 170676 152088 161715 212413 331202 396110 436056 464428
11561D64428o909N2627J2568n4605n2727K0181k2501n2524k7514L9248l5038L4189
$$ 464428 457519 510146 522714 468109 415382 435563 413062 360538 333024 372272 337234 371423
11549C71423O8668K7053K1942m621m9247r8543n5404o6794k7796j624J1596o225
$$ 371423 440091 467144 489086 484465 435218 336675 281271 214477 186681 185057 196653 190428
11537A90428j8474m8802j3653j0928J7476J141Q499N205K0539k0448n5605j7556
$$ 190428 171954 123152 109499 98571 116047 117188 125687 130892 151431 130983 75378 57822
11525E7822j0827K9649L0266N489r588k8382k7872m420L256k2892J4207K7935
$$ 57822 46995 76644 106910 112399 102811 74429 46557 42137 45393 22501 36708 64643
11513F4643K2354j2571p37k3602l3851q75R276O5180L213l492J8594K3189J3019
$$ 64643 86997 74426 73689 50087 16236 15361 24637 89817 93030 89538 108132 131321 144340
11500A44340j7552L4403k6380k2480Q650J990j3560K1939P2966J3492k1703M5
$$ 144340 126788 161191 134811 112331 120981 122971 109411 131350 204316 217808 196105 196150
11488A96150K2195Q960O600l4598o8697m2213L7296l9621o6798L08K2221L8875
$$ 196150 218345 227305 233905 199307 130610 88397 125693 86072 19274 19582 41803 80678
11476H0678K5872K5327R0427O8568k1377k3968m1399q6986n9596N7090m418m5120
$$ 80678 106550 131877 222304 290872 269495 245527 204128 117142 57546 114636 110218 65098
11464F5098J8402P654l3781k0584L7406L1216k6952q402J8608n5091q761j3620
$$ 65098 83500 91154 57373 36789 74195 105411 78459 70057 88665 33574 24813 11193
11452A1193J938r1K78O366K2269l7802m1287q266K3687K0946l436o109j766m5608
$$ 11193 13131 13040 13318 19684 41953 4151 -37136 -45402 -21715 -769 -4205 -10314 -12080 -57688
11438e7688L0746J026j2810N713j3920J383r853N336k211N1088M6653L6407J0292
$$ -57688 -26942 -25916 -38726 -33013 -46933 -45550 -55403 -50067 -52278 -1190 45463 81870 92162
11425I2162j452o1420o470n690k3580L5218o395J733J1258j033m6258p098L2218
$$ 92162 90710 29290 22820 17130 -6450 28768 22373 24106 35364 34331 -11927 -19025 13193
11412A3193j5678O5740K0280j4558o6207n491Q615P336J1834J7512K8582K1136
$$ 13193 -2485 63255 83535 68977 2770 -2721 5894 13230 25064 42576 71158 92294
11400I2294m082j0657J2536k929k9787M213l207k7268k0239J1824M624j3005J6183
$$ 92294 88212 77555 90091 87162 57375 61588 58381 31113 10874 22698 27322 14317 30500
11387C0500J4202Q36o718K4193n166k2247k6478O17N2735J3409j8470K498l2595
$$ 30500 44702 45538 38820 63013 57847 35600 9122 9739 62474 75883 57413 59911 27316
11374B7316L1129j0853J518K1057l8046l7205L8125J7186k775L6365J5626k9557
$$ 27316 58445 47592 49110 70167 32121 -5084 33041 50227 47452 83817 99443 69886
11362F9886j3854K0351J709j2325L5313L261p9276m2267j0180R001K4345M3994
$$ 69886 56032 76383 78092 65767 101080 104341 25065 -17202 -27382 -18381 5964 49958
11350D9958j0120J9883n398J6675O219l1007j0412k0082R297L8938l6985o5796
$$ 49958 39838 59721 54323 70998 77217 46210 35798 15716 25013 63951 26966 -38830
11338c8830O860K7701K9228J4342M553J3707K774k5078j1384M073K46j3974n231
$$ -38830 -31970 -4269 24959 39301 43854 57561 60335 35257 23873 27946 28192 14218 8987
11325H987j9371k7184N424Q884J525K5735M344L3788l02k0255k570l9356J067
$$ 8987 -10384 -37568 -32144 -23260 -21735 4000 8344 42132 41830 21575 19005 -20351 -19284
11312a9284J3722M3350L4694q962k6298k338k2841q928j2675l0281N0664J7630
$$ -19284 -5562 37788 72482 63520 37222 34884 12043 3115 -9560 -39841 10823 28453
11300B8453R516j1814j9260n47M4230R713l2637R572M6061R175N322j6285j1270
$$ 28453 37969 26155 6895 6348 50578 60291 27654 37226 83287 92462 97784 81499 70229
11287G0229J612J942l496M1005j9532l1478j1929J9022l9401k922J440l9859Q989
$$ 70229 71841 73783 70287 111292 91760 60282 48353 67375 27974 25052 26492 -13367 -4378
11274d378K0160L119l2592K7483j2583l3755R012K6313O3464Q092n4131j9286
$$ -4378 15782 18901 -13691 13792 1209 -32546 -23534 2779 66243 74335 20204 918
11262I18K6845L8136k4594m4940O50K1975L4787k5608j2617J3051N354j4263l9714
$$ 918 27763 65899 41305 -3635 -2985 18990 53777 28169 15552 28603 33957 19694 -20020
11249b0020M6804M4045l4371j0420L3396j218L609O410l0792L8853M7823j3273
$$ -20020 26784 70829 36458 26038 59434 58216 61825 68235 37443 76296 124119 110846
11237A10846Q387Q29J2172m4991l9848j9432k0865J4996J5022k3265l1030P3571
$$ 110846 119233 120062 132234 87243 47395 27963 7098 22094 37116 13851 -17179 56392
11225E6392N2119l8565l2521r455r695N223K1994m657n7155J8392l1634j9268
$$ 56392 108511 69946 37425 27970 18275 23498 45492 40835 -16320 2072 -29562 -48830
11213d8830l2962M0799L8454K5340l6412o7325J9405K1777M1032R167j5941l1692
$$ -48830 -81792 -40993 -2539 22801 -13611 -80936 -61531 -39754 1278 10445 -5496 -37188
11201c7188j449j4854J014L0596L3434j2986k5492k2195K139J7744O4012j1790
$$ -37188 -38637 -53491 -52477 -21881 11553 -1433 -26925 -49120 -46981 -29237 34775 22985
11189B2985n3615m1138j3493J5360M8590M694K2481J6475M43L2362P594j5021
$$ 22985 -30630 -71768 -85261 -69901 -21311 -16617 5864 22339 22782 55144 62738 47717
11177D7717k9864j1487j8521N9428J3966k5811K6132L7586J3132K1289M1328L921
$$ 47717 17853 6366 -12155 47273 61239 35428 61560 99146 112278 133567 174895 178816
11165A78816p4410o3422O277j082o3975m028j855j0512K9186n701J8569j5873
$$ 178816 104406 40984 47261 46179 -17796 -21824 -23679 -34191 -5005 -10706 7863 -8010
11153h010J8543k1151k6897l8339K8764O081O4017J6393K3356J2474l2194m6131
$$ -8010 10533 -10618 -37515 -75854 -47090 -41009 23008 39401 62757 75231 43037 -3094
11141c094j9444J7599J2281Q058q796J3593J9902j232j6848J2231n024q894l5592
$$ -3094 -22538 -4939 7342 15400 6604 20197 40099 38867 22019 34250 29226 20332 -15260
11128a5260n281O413k6782k8848J1987J2423j6967j2360M2391J5359K3381M31
$$ -15260 -20541 -14128 -40910 -69758 -57771 -45348 -62315 -74675 -32284 -16925 6456 6887
11116F887L3808J7207O308j4963l4448k4893J0888j6791l4562k9647N1491L1628
$$ 6887 40695 57902 64210 49247 14799 -10094 794 -15997 -50559 -80206 -28715 2913
11104B913j9410j1092R435L3915L8818L427l6573n2166M4107K1581m2340n5817
$$ 2913 -16497 -27589 -18154 15761 54579 58006 21433 -30733 13374 34955 -7385 -63202
11092f3202k5526K1852L6260J8777j218M1069M2122O956Q547J7116j3897r691
$$ -63202 -88728 -66876 -30616 -11839 -13057 28012 70134 77090 85637 102753 88856 79165
11080G9165n8796l826J4819n244M9052K1445k3945k6030l3004l145J6352K5268
$$ 79165 20369 16543 31362 26118 75170 96615 72670 46640 13636 10491 26843 52111
11068E2111K2574j0366j620o7296n0286j4495m5003j6755J2813N8117L9783q639
$$ 52111 74685 64319 62699 -4597 -54883 -69378 -114381 -131136 -118323 -60206 -20423 -29062
11056b9062N7380L505m3016l3593J2945K3908J0244L6344k3496J0610r570O30
$$ -29062 28318 31823 -11193 -44786 -31841 -7933 2311 38655 15159 25769 16199 16829
11044A6829l0930K4834O241l3925k4134O044L7807o636j0430m3468J7977L8097
$$ 16829 -14101 10733 16974 -16951 -41085 -35041 2766 -3870 -14300 -57768 -39791 -1694
11032a694j011p784l398M338J8276K7172J9454j8191q727K2917J3921L1965j5150
$$ -1694 -2705 -10489 -13887 -9549 8727 35899 55353 37162 28435 51352 65273 97238 82088
11019H2088L940l0321o531J2285J37l6064j6559k4411l6239l7289k1820N3269
$$ 82088 86028 55707 49176 61461 61598 25534 8975 -15436 -51675 -88964 -110784 -57515
11007e7515N8676j6177k5189L0139O3943l8115J3079L4106P240k7096o3838J6590
$$ -57515 1161 -15016 -40205 -10066 53877 15762 28841 62947 70187 43091 -20747 -4157
10995d157R526L2734m3409p6743K0197Q7565k900j670j0233L868j1296l4313K4121
$$ -4157 5369 38103 -5306 -82049 -61852 25713 22813 21143 10910 14778 3482 -30831 -6710
10982f710L0574N453l790j5600p367J3058j9231M0498K9264m6963k3352k9003
$$ -6710 23864 29317 25527 9927 2560 15618 -3613 36885 66149 19186 -4166 -33169
10970c3169K0464N9823M631k8814n0785K6567k5322j4367k6473O4308J8572M4555
$$ -33169 -12705 47118 51749 22935 -27850 -1283 -26605 -40972 -67445 -3137 15435 59990
10958E9990K7875m4815n607K9584Q235r198J319K0050k6486l7790j0610J4648
$$ 59990 87865 43050 37443 67027 75262 66064 67383 87433 60947 23157 12547 27195
10946B7195J4120j2260l4618k8204k3547K939l177K8275K6518j2461n8944j6489
$$ 27195 41315 29055 -5563 -33767 -57314 -54375 -57552 -29277 -2759 -15220 -74164 -90653
10934i0653J8539O1438k44J0777l7140K9483J7680j9423k4553K2171L8032L1709
$$ -90653 -72114 -10676 -10920 -143 -37283 -7800 9880 -9543 -34096 -11925 26107 57816
10922E7816M8432j9629l6447k4431j951o611j3688j1350P724M7238L2361l8563
$$ 57816 106248 86619 50172 25741 23790 17179 3491 -7859 -135 47103 79464 40901
10910D0901M6513K5188l6290n5169Q882J0958j2344J0338K6740K1543r584m3032
$$ 40901 87414 112602 76312 21143 30025 40983 28639 38977 65717 87260 77676 34644
10898C4644m5071L0021j2515m3788N864L6684k4864n296L2946j5926O215k3739
$$ 34644 -10427 19594 7079 -36709 -30845 5839 -19025 -24321 8625 -7301 -1086 -24825
10886b4825k5196p602L8944J7579K5663m6036J3870R866L0347L0390J7222o2175
$$ -24825 -50021 -57623 -18679 -1100 24563 -21473 -7603 2263 32610 63000 80222 18047
10874A8047o3670j3879K9257r991J065k9875O6158M6245J0795j7108r782j7336
$$ 18047 -45623 -59502 -30245 -40236 -39171 -69046 -2888 43357 54152 37044 27262 9926
10862I926k4375K5133N5108N5424n821r4371P62L9745l4257N999o501J0555l3520
$$ 9926 -14449 10684 65792 121216 115395 21024 21786 61531 27274 33273 26772 37327 3807
10849C807p019K5684m60L3922L1132k9453m1417k3981N47m6k4392k7638M4501
$$ 3807 -3212 22472 22012 55934 87066 57613 16196 -7785 -7238 -7284 -31676 -59314 -14813
10836a4813M3343j1948j0716j0090k1144j5473l747P280j553j6077k5247k6979
$$ -14813 28530 16582 5866 -4224 -25368 -40841 -44588 -37308 -38861 -54938 -80185 -107164
10824a07164L5998Q2831L4716k8020K571J8766J3521m0606k432r286r93k2356
$$ -107164 -71166 11665 46381 18361 20932 39698 53219 12613 10181 895 -98 -22454
10812b2454L2034L6269K1310k1353l5897l4554J905L7492N01p991R485k0322O2189
$$ -22454 9580 45849 67159 45806 9909 -24645 -22740 14752 15253 7262 16747 -3575 58614
10799E8614J6755j1222l4611K0417k5699J3681k8035m7389o598l2630n949N7061
$$ 58614 75369 64147 29536 49953 24254 37935 9900 -37489 -44087 -76717 -82666 -25605
10787b5605K0843j4190J619J3975N788l1441J9770j3640K3637N4891l8040l9227
$$ -25605 -4762 -18952 -17333 -3358 2430 -29011 -9241 -22881 756 55647 17607 -21620
10775b1620j1660k8962L8489j5087j3994j3206L0362R536l967J4230L5002O576
$$ -21620 -33280 -62242 -23753 -38840 -52834 -66040 -35678 -26142 -30109 -15879 19123 25699
10763B5699p3430l0289J2435K3837M8849K0691L1619j3714K329l8770l7456K3952
$$ 25699 -47731 -78020 -65585 -41748 7101 27792 59411 45697 48026 9256 -28200 -4248
10751d248p621L3887N63l6427m2070j6614k977M5270J5305l88n62K5688J495n5019
$$ -4248 -11869 22018 22581 -13846 -55916 -72530 -75507 -30237 -14932 -15320 -15882 9806 11301 -43718
10737d3718J2392J1552J4554o030p929j600k2751k9462p451k2743J1540R613Q112
$$ -43718 -31326 -19774 -5220 -11250 -19179 -20779 -43530 -72992 -80443 -103186 -91646 -82033 -73921
10724g3921j8951l4937M9605N8212j0518O434K6498o3397j2321L8078m961M5723
$$ -73921 -92872 -127809 -78204 -19992 -30510 -24076 2422 -60975 -73296 -35218 -40179 5544
10712E544K4100m9403K3635K7748L76M704q205j0266j7039O8120J7968J383o79
$$ 5544 29644 -19759 3876 31624 32000 36704 28499 18233 1194 69314 87282 88665 87986
10699H7986l451l0125l6182k7460j4329l77j0872j5663N09L934j4405N9131L3999
$$ 87986 84535 54410 18228 -9232 -23561 -23938 -34810 -50473 -49964 -46030 -60435 -1304 32695
10686C2695k7821l3652K2266K1547M6606K0696l012Q277m2475k8942m2612m7181
$$ 32695 4874 -28778 -6512 15035 61641 82337 79325 87602 45127 16185 -26427 -73608
10674g3608L8899M5829J5860o568k3931K4919J6163k4483l5005n0413l2530L2077
$$ -73608 -34709 11120 26980 20412 -3519 21400 37563 13080 -21925 -72338 -104868 -72791
10662g2791K9647L8921n401k3008R570J2439n3427l4947k1246L0415L0245P994
$$ -72791 -43144 -4223 -9624 -32632 -23062 -10623 -64050 -98997 -120243 -89828 -59583 -51589
10650e1589K0851J7403J913k3021J5856K2426j5633L1052K2804k3870k7366j1268
$$ -51589 -30738 -13335 -11422 -34443 -18587 3839 -11794 19258 42062 18192 -9174 -20442
10638b0442l4523l1155J917M4844J7834J0005K9617j847R192K8008R072l0547
$$ -20442 -54965 -86120 -84203 -39359 -21525 -11520 18097 16250 25442 53450 62522 31975
10626C1975j8478L4880J9000J5048L9992q21l8206k1667K4551L3937L4076M1606
$$ 31975 13497 48377 67377 82425 122417 121596 83390 61723 86274 120211 154287 195893
10614A95893M6676K7118O5109J08866J38742R8574J20051J12018J62375J28183
$$ 195893 242569 269687 334796 443662 582404 680978 801029 913047 1075422 1203605
10604A203605k3431j21298j04772n1109k2372k2033r0772j23307p1594r0332o7550
$$ 1203605 1180174 1058876 954104 902995 880623 858590 767818 644511 572917 482585 415035
10593D15035o3992n1734J6921K5858K8003K4269P0354J79005J88090K66949M61753
$$ 415035 351043 299309 316230 342088 370091 394360 464714 643719 831809 1098758 1560511
10582A560511O23547O77626M75229L7925l39443m68869l37562j07914r571M0915
$$ 1560511 2184058 2861684 3336913 3374838 3035395 2566526 2228964 2121050 2111479 2152394
10572B152394M0872p454Q2704J69650J72055J64425l2311k64682l60604k87244
$$ 2152394 2193266 2185812 2268516 2438166 2610221 2774646 2742335 2477653 2117049 1829805
10562A829805k93707k52829j98823j78219j58049j42999r3049p9727p9591J3652
$$ 1829805 1536098 1283269 1084446 906227 748178 605179 512130 432403 352812 366464
10552C66464p261j00150n6518j1853L2353j1869j6187m056k2800O6620M1405M176
$$ 366464 359203 259053 202535 190682 223035 211166 194979 190923 168123 234743 276148 280324
10540B80324Q5498O6800M9011R8240J31610K04515K19199J33244J44640J94883
$$ 280324 365822 432622 481633 579873 711483 915998 1135197 1268441 1413081 1607964
10530A607964K29473J47270P3037r0616k59197k61525k24178k81493k66614j55947
$$ 1607964 1837437 1984707 2057744 1967128 1707931 1446406 1222228 940735 674121 518174
10520E18174q2518l8442q3283j9278k963m696k1909o0856m6199j4127n7952j7674
$$ 518174 435656 397214 313931 294653 291690 286994 265085 204229 158030 143903 85951 68277
10508F8277n4846J8934O2491N4728l1869l6911j2849p1K5361K3720K9086m6569
$$ 68277 13431 32365 94856 149584 117715 80804 67955 67884 93245 116965 146051 99482
10496I9482p0354k1407J3185J2895O83O776m3356N76M7671K4245k9109J3658J1136
$$ 99482 29128 7721 20906 33801 34484 41260 -2096 -1520 46151 70396 41287 54945 66081
10483F6081j7824k7417P834j7272j3723O650J0684j7641N640l303K9353L207J564
$$ 66081 48257 20840 28674 11402 -2321 4329 15013 -2628 3012 -291 29062 32269 33833
10470C3833m995O859L709L4220K6243j6364k5496n0746k6615j876k6140k1321
$$ 33833 28838 35697 39406 73626 99869 83505 58009 7263 -19352 -21228 -47368 -68689
10458f8689M0257K9506J7653K7995j8038O344r694J2996O1937o662p488Q08K151
$$ -68689 -28432 1074 18727 46722 28684 35028 25334 38330 100267 93605 86117 86925 89076
10445H9076k9260k4729l2599j4890k6061r586K2641P7423P1530K6205k2704J47
$$ 89076 59816 35087 2488 -12402 -38463 -48049 -25408 52015 123545 149750 127046 127193
10433A27193L7995k1549m488n2228K3920L9252k971p871j8897o0259l5409J3294
$$ 127193 165188 143639 139151 86923 110843 150095 147124 139253 120356 60097 24688 37982
10421C7982l543j4686K8392J026j6581j5346L2745o626J1805J305p201K2576r512
$$ 37982 34439 19753 48145 49171 32590 17244 49989 43363 55168 56473 49272 71848 62336
10408F2336n805l0472Q69L382J0163K3091J035L8966j4226k660K4315J3610k2997
$$ 62336 56531 26059 26928 30310 40473 63564 64599 103565 89339 86679 110994 124604 101607
10395A01607n2659r6887j1269j8661L9711M1862K3245N2929K830k273K1375M7934
$$ 101607 48948 -47939 -59208 -77869 -38158 3704 26949 79878 82708 80435 101810 149744
10383A49744N2461J6210n5468m322k5179m3725M0868q002J5175J0007j889j9259
$$ 149744 202205 218415 162947 158625 133446 89721 130589 122587 137762 147769 145880 126621
10371A26621j0967J3248n0678l9313N190P358j816K0089O444k9272J0051l259
$$ 126621 115654 128902 78224 38911 44101 51459 49643 69732 76176 46904 56955 53696
10359E3696r503L3120j6369Q682l1830n095k656P549j2872p844k4111j7689k9211
$$ 53696 44193 77313 60944 69626 37796 32701 30045 37594 24722 16878 -7233 -24922 -54133
10346e4133L2921M2995L1154k1823n2704J6086J48k1978K0124L2848L8245J2572
$$ -54133 -21212 21783 52937 31114 -21590 -5504 -5356 -27334 -7210 25638 63883 76455
10334G6455l7380l0465k1726j4995j4297Q621j7535k3989l942K2035N8169N2358
$$ 76455 39075 8610 -13116 -28111 -42408 -33787 -51322 -75311 -79253 -57218 951 53309
10322E3309m7159n6323K7542N1139J5969L0021p6389j4843N8305K0771J2014K489
$$ 53309 6150 -50173 -22631 28508 44477 74498 -1891 -16734 41571 62342 74356 76845
10310G6845j8834j7045O2586Q224K895J1525k6758L8865K7614M6852Q6123R780
$$ 76845 58011 40966 103552 111776 114671 126196 99438 138303 165917 212769 298892 308672
10298C08672l314o482l8750m969k045l1911r097m2587l7071J859J7721j6244n1012
$$ 308672 305358 298876 260126 255157 253112 221201 212104 169517 132446 134305 152026 135782 84770
10285H4770l4901N8875O117j6474j443K8512l0803j8006K5785J1217m68n588j7831
$$ 84770 49869 108744 114861 98387 96944 125456 94653 76647 102432 113649 113181 107593 89762
10272H9762L150O0464M9286o8787l7957J3468j2376M6243O467O5773k9073l6282
$$ 89762 92912 153376 202662 133875 95918 109386 97010 143253 149720 215493 186420 150138
10260A50138j6052R3042O4936Q1431N9859P2537M3314q972j6251q1061m2851k4097
$$ 150138 134086 227128 292064 373495 433354 505891 549205 540233 523982 442921 400070 375973
10248C75973l1485J0849k6557l8580k3972K2438L9771N8123m0588m7263J155l741
$$ 375973 344488 355337 328780 290200 266228 288666 328437 386560 345972 298709 299864 296123
10236B96123O7519L32q068j944j3264R004J448R977K0438K0850M5150J8528j8450
$$ 296123 363642 363974 355906 353962 340698 349702 351150 361127 381565 402415 447565 466093 447643
10223D47643k4626K785K4940P2337L3123o548R365O593K2048K2199N079K2601
$$ 447643 423017 425802 450742 523079 556202 549654 559019 565612 587660 609859 614938 637539
10211F37539M0793Q3304J04167N4921R3280R1800P3309N3807J01937J25959J31080
$$ 637539 678332 761636 865803 920724 1014004 1105804 1179113 1232920 1334857 1460816 1591896
10200A591896J18620J90132K46588K80109L63155L54100K61905K48825K58398
$$ 1591896 1710516 1900648 2147236 2427345 2790500 3144600 3406505 3655330 3913728
10191C913728L35618M48352O03423P83475R23471R77320J055336J161045J477003
$$ 3913728 4249346 4697698 5301121 6084596 7008067 7985387 9040723 10201768 11678771
10182A1678771J982185L100139N044371Q167863J2769655J8588485K3762148K5389898
$$ 11678771 13660956 16761095 21805466 29973329 42742984 61331469 85093617 110483515
10174A10483515K1068380J1493362K62700q946247j4914197j8356850j9688288
$$ 110483515 131551895 143045257 143307957 134361710 119447513 101090663 81402375
10167H1402375j8757309j5792263j2058098q552459n706524l718348k485907j768876
$$ 81402375 62645066 46852803 34794705 26242246 20535722 16817374 14331467 12562591
10159A2562591j342440j097017q73679o87565m64889k74442j01337O2680K08410
$$ 12562591 11220151 10123134 9249455 8561890 8097001 7822559 7721222 7783902 7992312
10150G992312K62048K51336J78824J45170K05213L07768M23340O59262Q49794
$$ 7992312 8254360 8505696 8684520 8829690 9034903 9342671 9766011 10425273 11275067
10141A1275067R93068R91738J193865J643041K454795L808759O075626R780159
$$ 11275067 12268135 13259873 14453738 16096779 18551574 22360333 28435959 38216118
10133C8216118J5370300K2972284L1181739L6369519L4341367K3026152M980622
$$ 38216118 53586418 76558702 107740441 144109960 178451327 201477479 206458101
10126B06458101j3889343k7753078l3929632l2933067k7333458k0123743j3684969
$$ 206458101 192568758 164815680 130886048 97952981 70619523 50495780 36810811
10119C6810811q895120n789491l782530k627639j899907j499242j401607j254493
$$ 36810811 27915691 22126200 18343670 15716031 13816124 12316882 10915275 9660782
10111I660782j179635j054857q33767o53229m44723l23664k69513l61530k73577
$$ 9660782 8481147 7426290 6592523 5939294 5494571 5170907 4901394 4539864 4266287
10102D266287l08912l98136l82156l08391j80822j82579j83972j58189j44718
$$ 4266287 3957375 3559239 3177083 2868692 2687870 2505291 2321319 2163130 2018412
10093B018412r2871j17709q6346p4453o6736p1852l3574p641r430j1255j7953
$$ 2018412 1925541 1807832 1721486 1647033 1580297 1508445 1474871 1467230 1457800 1446545 1428592
10082A428592m0481m8870n3795n3387j07585r2417p707j9360j9324j5991L0338
$$ 1428592 1388111 1339241 1285446 1232059 1124474 1032057 1024350 1004990 985666 969675 1000013
10071A000013J2354J6000k8518m5349l255k2627j6478l3854m667J6884Q199O4943
$$ 1000013 1012367 1028367 999849 954500 951245 928618 912140 878286 873619 890503 898702 963645
10059I63645k3034M706k7K8749N587m5145r5237l1502l7759l4530k8967M2934
$$ 963645 940611 945317 945290 974039 979626 934481 839244 807742 769983 735453 706486 749420
10047G49420K3145K7895j3360k5477k2944n7320r1849p6868l9837j0017J0969
$$ 749420 772565 800460 787100 761623 738679 681359 589510 512642 472805 462788 473757
10036D73757L5898l253l0518l6114j0471j4167o9090m6089M2918r206J1301J1004
$$ 473757 509655 506402 475884 439770 429299 415132 346042 299953 342871 333665 344966 355970
10024C55970m2791j312J7571N7192L731K3001j6001j5482m5749k4422K0431n059
$$ 355970 313179 311867 329438 386630 390361 413362 397361 381879 336130 311708 332139 327080
10012C27080K4105l6171K256l3300Q913M307j4766j917J9966k6388L156J3697
$$ 327080 351185 315014 317270 283970 292883 297190 282424 280507 300473 274085 277241 290938
10000B90938K0467L5031J9140J0458r85m0285L2094Q277k7224j1442K071k1566
$$ 290938 311405 346436 365576 376034 375049 334764 366858 375135 347911 336469 338540 316974
9988C16974j4482j7185j6653m9235M114J9202j3922O7687J2410j4536m4949J2795
$$ 316974 302492 285307 268654 219419 223533 242735 228813 296500 308910 294374 249425 262220
9976B62220M6677J9535l50q861O334R266j4729K1679N1762j0153K170k8397N291
$$ 262220 308897 328432 328082 319221 325555 334821 320092 341771 393533 383380 385550 357153 362444
9963C62444m4556k2357L646L1935J0513N2945L8327J3534M1110M5296O5796O4873
$$ 362444 317888 295531 299177 331112 341625 394570 432897 446431 487541 532837 598633 663506
9951F63506R8742J54232J53633L04535L87911M72729M75459M01235J83491o3290
$$ 663506 762248 916480 1070113 1374648 1762559 2235288 2710747 3111982 3295473 3232183
9941C232183k60851l56500l90383m02722l30711j73889j06101j04583l5247J708
$$ 3232183 2971332 2614832 2224449 1821727 1491016 1317127 1211026 1106443 1071196 1072904
9931A072904j3339n606J21842K05144J73275K86804M39656N43523P72737R01187
$$ 1072904 1059565 1053959 1175801 1380945 1554220 1841024 2280680 2824203 3596940 4498127
9921D498127R05420P06960L45672q2474n08634p76114q63372q14363n82916l94483
$$ 4498127 5403547 6110507 6456179 6373705 5865071 5088957 4225585 3411222 2828306 2433823
9911B433823k58893j62780m5288O5847K16142K73585K93136L18828L53797K59565
$$ 2433823 2174930 2012150 1966862 2032709 2248851 2522436 2815572 3134400 3488197 3747762
9901C747762J30410J27161K04129M12025N74898M79754K83959k8139l61378n58504
$$ 3747762 3878172 4005333 4209462 4621487 5196385 5676139 5960098 5931959 5570581 5012077
9891E012077o25528n31519m43116l44403k71324j60310N5164K72688M60408O42983
$$ 5012077 4386549 3855030 3411914 3067511 2796187 2635877 2691041 2963729 3424137 4067120
9881D067120Q29796Q97492Q32810O81396N04245M16129M58996P54821R56265Q39811
$$ 4067120 4896916 5794408 6627218 7308614 7812859 8228988 8687984 9442805 10399070 11238881
9871A1238881L56571j91671p61951j270737j540986j367358j100471p56763m81927
$$ 11238881 11595452 11403781 10641830 9371093 7830107 6462749 5362278 4605515 4123588
9862D123588l14688j08168J03649L04091M97927O61011Q19505R05415Q66952R08311
$$ 4123588 3808900 3700732 3804381 4108472 4606399 5267410 6086915 6992330 7859282 8767593
9852H767593R70382J204276J512696J728580J469963Q58296j07792j211809j954733
$$ 8767593 9737975 10942251 12454947 14183527 15653490 16511786 16403994 15192185 13237452
9843A3237452k183554j997965j616120j110300p65902m11317j28260J18716M30167
$$ 13237452 11053898 9055933 7439813 6329513 5563611 5152294 5024034 5142750 5572917
9834E572917P18104J027167J300339J404979J160921Q04461M74914K70346K47415
$$ 5572917 6291021 7318188 8618527 10023506 11184427 11988888 12463802 12734148 12981563
9825A2981563L44694L80129J10994l32389q86633j402398j680188j445586j108103
$$ 12981563 13326257 13706386 13817380 13484991 12598358 11195960 9515772 8070186 6962083
9816F962083q01640m87821k82351k2077K16709O18113J086885J580717J935732
$$ 6962083 6160443 5672622 5390271 5368194 5584903 6203016 7289901 8870618 10806350
9807A0806350K191921K051637J559074R09500K80473K1497o032q0696k77713q66643
$$ 10806350 12998271 15049908 16608982 17518482 17798955 17820452 17814420 17733724 17456011 16589368
9797A6589368j518061j979696k103628j871634j502560j080597o61913l82508
$$ 16589368 15071307 13091611 10987983 9116349 7613789 6533192 5871279 5488771
9789E488771j24120J39378L16578O30502R14438J277050J569621J486277J141695
$$ 5488771 5364651 5504029 5820607 6451109 7365547 8642597 10212218 11698495 12840190
9780A2840190Q71023O61604N19043L81264K51926N8568l47434r16188j521695
$$ 12840190 13711213 14372817 14891860 15273124 15525050 15583618 15236184 14319996 12798301
9771A2798301j857002j778799j494054j098875p43826m38122j56902J23332L81605
$$ 12798301 10941299 9162500 7668446 6569571 5825745 5387623 5230721 5354053 5735658
9762E735658P48678J137981J544204J726203J619046J133495M95268j70348o20757
$$ 5735658 6484336 7622317 9166521 10892724 12511770 13645265 14140533 13970185 13349428
9753A3349428p92315p68011o54302o98571q21045r97241j061603j018897q75312
$$ 13349428 12557113 11789102 11134800 10436229 9615184 8617943 7556340 6537443 5662131
9744E662131o36206l80322j35374m9312j3704J87203N23312Q56083J239491J517878
$$ 5662131 5025925 4645603 4510229 4460917 4447213 4634416 5157728 6013811 7253302 8771180
9734H771180J656350J466075J003278M02132j28796n74902q50213r85695j057669
$$ 8771180 10427530 11893605 12896883 13299015 13170219 12595317 11745104 10759409 9701740
9725I701740j145247j189169j189726j021691q13854n98025m51603k50774j23932
$$ 9701740 8556493 7367324 6177598 5155907 4342053 3744028 3292425 3041651 2917719
9716B917719r0196l0992J96935L84543N70516P78913R52465Q60453O24243L41970
$$ 2917719 2827523 2796531 2993466 3378009 3948525 4727438 5679903 6540356 7164599 7506569
9706G506569K1212k13988m42389n87566o85136o88406o76437o11739n99649m92806
$$ 7506569 7527781 7313793 6871404 6283838 5598702 4910296 4233859 3622120 3022471 2529665
9696B529665k98452k36991j10902M572N0214J22331K36867L93844N97691P01829
$$ 2529665 2231213 1994222 1883320 1887892 1938106 2060437 2297304 2691148 3288839 3990668
9686C990668O77199M53928K01941k03784n45656p14251p36378n88165m60908k98785
$$ 3990668 4667867 5121795 5323736 5119952 4574296 3860045 3123667 2535502 2074594 1775809
9676A775809k86845k30043p1866o4590o9239j731j9195k7208K1268Q5135J48126
$$ 1775809 1488964 1258921 1187055 1122465 1053226 1051495 1032300 1005092 1026360 1111495 1259621
9665A259621K04533L18119L77228L57281L17141J89641k5088k00295l78626l95112
$$ 1259621 1464154 1782273 2159501 2516782 2833923 3023564 2998476 2798181 2419555 2024443
9655B024443l53326k99616j74091j70157j45812j36631j44261n4888J2014L1058
$$ 2024443 1671117 1371501 1197410 1027253 881441 744810 600549 545661 557675 588733
9645E88733k7494m4530J5416K3689L4020k5920n7620k8668j4567j7450n4156O6805
$$ 588733 561239 516709 532125 555814 589834 563914 506294 477626 463059 445609 391453 458258
9633D58258K4468j1266n0653j5713l5746m9049k6927J0431q354j0663o1275p217
$$ 458258 482726 471460 420807 405094 369348 320299 293372 303803 295449 284786 223511 216294
9621B16294N7632k0073Q591M4171M5867q0191O2J1237j7371k2666k4764L8822
$$ 216294 273926 253853 262444 306615 352482 272291 272353 283590 266219 243553 218789 257611
9609B57611j5058o388K3359K4292J0780q637J0576J0691k8767K8795R134j4063
$$ 257611 242553 236165 259524 283816 294596 285959 296535 307226 278459 307254 316388 302325
9597C02325k8880k3708k5852J6172l410M8339M4491J3104N4817n691k9944J1551
$$ 302325 273445 249737 223885 240057 236647 284986 329477 342581 397398 391707 361763 373314
9585C73314L157K2676K0836j4584j681L410J6729J5723L8903j5594k229P8420
$$ 373314 376471 399147 419983 405399 403718 407128 423857 439580 478483 462889 460660 539080
9573E39080K3387K7299K3209J8846l9334o9621L367K7315J8311N0685Q1823J3292
$$ 539080 562467 589766 612975 631821 592487 522866 526233 553548 571859 622544 704367 717659
9561G17659m3836p3318m0147j4025p744k3540K0553K5763r846j4371j4275N964
$$ 717659 673823 600505 560358 546333 538589 515049 535602 561365 551519 537148 522873 528837
9549E28837L3949Q667J556m0189j0358j0368m7322o7728k4018r354M53K6249m6140
$$ 528837 562786 571453 573009 532820 522462 512094 464772 397044 373026 363672 364125 390374 344234
9536C44234Q790P773J8952j3013m461k500l9966k5037k4035j4203K663k7548n8659
$$ 344234 353024 360797 379749 366736 362275 359775 319809 294772 270737 256534 259197 231649 172990
9523A72990k1952j0533N6114M2826k1760k8818K7655O183J9269K9316m2009K232
$$ 172990 151038 140505 196619 239445 217685 188867 216522 222705 241974 271290 229281 231513
9511B31513M4979j5420N16P7088L7126N0786L0400J7677j8306j2860j9491l8189
$$ 231513 276492 261072 261588 338676 375802 426588 456988 474665 456359 443499 424008 385819
9499C85819J9891j290L005M3093Q0598P892K2243P27M6059L5477M8026O3258j0458
$$ 385819 405710 404420 407425 450518 531116 539008 561251 561978 608037 643514 691540 754798 744340
9486G44340m1049K891p777m2318l6530J6197L1837m4073n844j0410j7400M807
$$ 744340 703291 706182 698405 656087 619557 635754 667591 623518 617674 607264 589864 594671
9474E94671M0445j4115o888M814J0812k9028j8504K4733m9430m7176l2283o766
$$ 594671 635116 621001 614113 618927 629739 600711 582207 606940 557510 510334 478051 471285
9462D71285n7405o4189k6973N159J2638k4126l3774L7810J1945O622m416l8806
$$ 471285 413880 349691 322718 327877 340515 316389 282615 320425 332370 338992 334576 295770
9450B95770k9850J8767J3771K1524M0777M1515P3491P6671P7351L7682L0212j527
$$ 295770 265920 284687 298458 319982 360759 402274 475765 552436 629787 667469 697681 696154
9438F96154l1972l3323Q44j1255j0369l3303n9774m340k0048k0921m3867o5367
$$ 696154 664182 630859 631703 620448 610079 576776 517002 512662 492614 471693 427826 362459
9426C62459k4853j4224n2936j061L7266N2749J9147J1040K2904p241k5504m3414
$$ 362459 337606 323382 270446 269385 306651 359400 378547 389587 412491 405250 379746 336332
9414C36332L787J208r4930m7261k984K2523K8834J5635n0150R6587P4339K941
$$ 336332 340119 341327 246397 199136 196152 218675 247509 263144 212994 309581 383920 386861
9402C86861N331K1932K4469Q3929O9331N0171J26738N3699J2232O3973P0738L0186
$$ 386861 392192 414124 438593 522522 591853 642024 768762 822461 834693 898666 969404 999590
9390I99590n0403r3612q2204q8135m9509m1690m067J6481J7024j8360k6248L7433
$$ 999590 949187 855575 773371 685236 635727 594037 589970 606451 623475 605115 578867 616300
9378F16300L2497N9826K9954l0047p63m5647q2201n5295O024j6241K1860N758
$$ 616300 648797 708623 738577 708530 707767 662120 579919 524624 530648 514407 536267 542025
9366E42025o2843o8568r5144k5954K1308L0737k1459j333K8396j5753J0270J7717
$$ 542025 479182 410614 315470 289516 310824 341561 320102 318769 347165 331412 341682 359399
9354C59399J3841N3949R0038Q969R375L565K4086K5731K0810O3505J0888L393
$$ 359399 373240 427189 517227 526196 535571 539136 563222 588953 609763 673268 684156 687549
9342F87549j7688J4294K1607l8124k3128K3984M413P724n8029l9740K6633P7354
$$ 687549 669861 684155 705762 667638 644510 668494 672907 680631 622602 582862 609495 686849
9330F86849L8851k1766J0845O0812L2820j913o1449n8451n9486m4554O854j7231
$$ 686849 725700 703934 714779 775591 808411 806498 745049 686598 627112 582558 589412 572181
9318E72181o226J08J2841L2318O0422n6287k2790J3519k2616K2247P6263R2627
$$ 572181 565955 566063 578904 611222 671644 615357 592567 606086 583470 605717 681980 774607
9306G74607K2839J0282K2868J2973J7661l37J751L012k2963K2395L5469Q2960
$$ 774607 797446 807728 830596 843569 861230 860893 862644 865656 842693 865088 900557 983517
9294I83517N685r83L9530J1447O8218Q0579L9815M3587P3615J64970J39673K19757
$$ 983517 989202 988219 1027749 1039196 1107414 1187993 1227808 1271395 1345010 1509980 1649653 1869410
9282A869410K72537L60086M02025M93105N79025P15962P53356P67342P30849O67285
$$ 1869410 2141947 2502033 2904058 3397163 3976188 4692150 5445506 6212848 6943697 7610982
9272G610982O77190O35102N63196M92559M81032N36257Q60010J242499J716800
$$ 7610982 8288172 8923274 9486470 9979029 10460061 10996318 11856328 13098827 14815627
9263A4815627K191158K478297K393268K006185J384984R48615L93424j9766j28098
$$ 14815627 17006785 19485082 21878350 23884535 25269519 26218134 26611558 26591792 26463694
9254B6463694j13348j39161n1849K85336Q54862J529032K005761J987313J399608
$$ 26463694 26350346 26211185 26159336 26444672 27299534 28828566 30834327 32821640 34221248
9245C4221248M66161m70465j187295j569943j488431r37105j72246M82867Q59686
$$ 34221248 34687409 34216944 33029649 31459706 29971275 29034170 28861924 29344791 30204477
9236C0204477Q90655Q08392O22705L71757j61660p02269r97380j267095j599415
$$ 30204477 31095132 31903524 32526229 32897986 32736326 32034057 31036677 29769582 28170167
9227B8170167j677631j188606l00501N13597P43001L80541l01293r93495j562321
$$ 28170167 26492536 25303930 25003429 25517026 26260027 26640568 26339275 25345780 23783459
9218B3783459k030385k232595k225937k008537j559367j181119q02498m80691
$$ 23783459 21753074 19520479 17294542 15286005 13726638 12545519 11743021 11262330
9210A1262330j94797k6869j16541l93992n22836n76655o39885p22515p52195o76157
$$ 11262330 11067533 11040664 10924123 10530131 10007295 9430640 8790755 8068240 7316045 6639888
9200F639888m39621k08599L0782K64501N35960R34811J275524J452177J458971
$$ 6639888 6200267 5991668 6022450 6286951 6822911 7757722 9033246 10485423 11944394
9191A1944394J326012J041193O91556M17706K46486J83401M08552Q80179J468895
$$ 11944394 13270406 14311599 15003155 15420861 15667347 15850748 16259300 17139479 18608374
9182A8608374K053214K697722L478027L937877L948406L292472K285813J240990
$$ 18608374 20661588 23359310 26837337 30775214 34723620 38016092 40301905 41542895
9174D1542895j9728q99443j185217o80202N24539J820733K507857K514761K197606
$$ 41542895 41523167 40623724 39438507 38758305 39282844 41103577 43611434 46126195 48323801
9165D8323801J880662J498771R06090J04281o32842j315242j786817j933731j327556
$$ 48323801 50204463 51703234 52609324 52713605 52080763 50765521 48978704 47044973 45717417
9156D5717417j65115J085405J959304K297574K078835J165509l20235j929338
$$ 45717417 45552302 46637707 48597011 50894585 52973420 54138929 53818694 51889356
9148E1889356k885782k917359k111955j029327k46692r3089k60952m84766m50757
$$ 51889356 49003574 46086215 43974260 42944933 42698241 42605152 42344200 41859434 41408677
9139D1408677m09525n59840j033114j747158k651377l361134l563389l264956
$$ 41408677 40999152 40439312 39406198 37659040 35007663 31646529 28083140 24818184
9131B4818184k581339j823372j158485p93740o97550q09859j065617j251211j243507
$$ 24818184 22236845 20413473 19254988 18461248 17763698 16953839 15888222 14637011 13393504
9122A3393504j180427j149764j060806j027914r16844q00631p52255o80061n26599
$$ 13393504 12213077 11063313 10002507 8974593 8057749 7257118 6504863 5824802 5298203
9113E298203m00625l31859k92756k42453k01134j50432j06942j13043j33142j81343
$$ 5298203 4897578 4565719 4272963 4030510 3829376 3678944 3572002 3458959 3325817 3144474
9103C144474j13219j21510j03516q1199j16471p7815q6088j01341o4248n8068
$$ 3144474 3031255 2909745 2806229 2725030 2608559 2530744 2444656 2343315 2279067 2220999
9093B220999o6301k8134q1318j21890q9146l4608n7067n0150r043n6734n4112
$$ 2220999 2154698 2126564 2045246 1923356 1834210 1799602 1742535 1692385 1683342 1626608 1572496
9082A572496j4993Q721m50l3878k6193L6368p043p6122j02626r0426r333r034
$$ 1572496 1557503 1566224 1565774 1531896 1505703 1542071 1535028 1458906 1356280 1265854 1256521 1247487
9070A247487m1619k7340k303P576L6650j7178j5196j5269o3867m3066m120K8624
$$ 1247487 1205868 1178528 1176225 1183801 1220451 1203273 1188077 1172808 1108941 1065875 1061755 1090379
9058A090379q929k8646L8028K5023k3705n8502p1868J2417M8851n4527l3648M6180
$$ 1090379 1081450 1052804 1090832 1115855 1092150 1033648 961780 974197 1023048 968521 934873 981053
9046I81053O4956N8426M5416J55911L16846K27447Q0183j52932k95274k28692
$$ 981053 1046009 1104435 1149851 1305762 1622608 1850055 1930238 1777306 1482032 1253340
9036A253340j34933j09727K216M7313m8630l6959m6532m8365m6204l2000L140
$$ 1253340 1118407 1008680 1010896 1058209 1009579 972620 926088 877723 831519 799519 802659
9025H02659L1253k1295l0001L0580o478r581k9125j7896k5945k1641m1572L370
$$ 802659 833912 812617 782616 813196 806718 797137 768012 750116 724171 702530 660958 664328
9013F64328k877j5081J1781J9110N3657K1532m7282j8980N1715P212l235M4565
$$ 664328 661451 646370 658151 677261 730918 752450 705168 686188 737903 745115 741880 786445
9001G86445K9879R6903J58620K68179N06857O08500L47084l32173o07964m39958
$$ 786445 816324 913227 1071847 1340026 1846883 2455383 2802467 2470294 1862330 1422372
8991A422372k14557j29720r6444j14750r6671r6638n200n0527J4573k6754n5186
$$ 1422372 1207815 1078095 981651 866901 770230 673592 668392 617865 632438 605684 550498
8980E50498m6634m515M32k2142K8837j4281K9874k2936j4394q569R057p693K3916
$$ 550498 503864 499349 499781 477639 506476 492195 522069 499133 484739 476170 485227 477534 501450
8967E01450K1045K5726L509L652j3873r678k6924m1627q811N0121N0524p945N6434
$$ 501450 522495 548221 551730 555382 541509 531831 504907 463280 454469 504590 555114 547169 603603
8954F03603R8049J30385K05408J98667J96905p2553k56631k57448j50710p8602
$$ 603603 701652 832037 1037445 1236112 1433017 1360464 1103833 846385 695675 617073
8944F17073r6888l5789J3999k4378q7433l8113J2521K0520O1815J3621q937k9672
$$ 617073 520185 484396 498395 474017 386584 348471 360992 381512 443327 456948 448011 418339
8932D18339L2870O770k7379q506j5372J2906M3838k32p2852n5528k726q331j5765
$$ 418339 451209 457979 430600 422094 406722 419628 463466 463234 390382 334854 332128 323797 308032
8919C08032M0476R3689l5688O504K7461r233k7868m6822M3545J9529o342J2987
$$ 308032 348508 442197 406509 413013 440474 431241 403373 356551 400096 419625 413283 426270
8907D26270P534N111k6838J1248K9124j4588N831k8624l7410L8072M2143K0221
$$ 426270 433804 438915 412077 423325 452449 437861 443692 415068 377658 415730 457873 478094
8895D78094N2979L0912L1064j1428q8097L301L6748O9136P3550N0176K8544O8566
$$ 478094 531073 561985 593049 581621 493524 496825 533573 602709 676259 726435 754979 823545
8883H23545K1616L3028P0896P7992P1207O3885O8644J01216J63144J53944R8831
$$ 823545 845161 878189 949085 1027077 1098284 1162169 1230813 1332029 1495173 1649117 1747948
8872A747948J26533J93596K32467K45208L63994M68506P50967R37994J243175
$$ 1747948 1874481 2068077 2300544 2545752 2909746 3378252 4129219 5067213 6310388
8863F310388J710473K118312K685747L317986L552450K884365J059803o56982
$$ 6310388 8020861 10139173 12824920 16142906 19695356 22579721 23639524 22982542
8855B2982542j642660j966738j943741j902820j794259j678269j401702j217834
$$ 22982542 21339882 19373144 17429403 15526583 13732324 12054055 10652353 9434519
8847I434519j118609j010319q16789o00977l57414j74860l0541J48783K38916
$$ 9434519 8315910 7305591 6488802 5887825 5530411 5355551 5325010 5473793 5712709
8838E712709L19548N69876Q33230J168899J605241J940913K199033K226595K137479
$$ 5712709 6032257 6602133 7435363 8604262 10209503 12150416 14349449 16576044 18713523
8829A8713523J629521N86093o41445j631766k060051j945328j543530j221024
$$ 18713523 20343044 20929137 20287692 18655926 16595875 14650547 13107017 11885993
8821A1885993j064916j008362j033798j014515j031779r23198p29528n70149m25185
$$ 11885993 10821077 9812715 8778917 7764402 6732623 5809425 5079897 4509748 4084563
8812D084563l29538j85445q9179j01627j97473j51816q9590l4079J8437Q2380
$$ 4084563 3755025 3569580 3480401 3378774 3181301 3029485 2939895 2905816 2924253 3006633
8802C006633J18345J38582K25121K60942K74852L07566L63020M67788O44423J034987
$$ 3006633 3124978 3263560 3488681 3749623 4024475 4332041 4695061 5162849 5807272 6842259
8792F842259J405641J769147K196482K665828L282842L793311M088009M040582
$$ 6842259 8247900 10017047 12213529 14879357 18162199 21955510 26043519 30084101
8784C0084101L555950K874243K013263Q17199p80388k186209k685237k170311
$$ 30084101 33640051 36514294 38527557 39344756 38564368 36378159 33692922 31522611
8776C1522611j167301k29222O4038o4551l27497q65727j516114j972830k349022
$$ 31522611 30355310 30126088 30190126 30125575 29798078 28932351 27416237 25443407 23094385
8767B3094385k585208k266318j553738p92831r5782P02973J582238K393385L187639
$$ 23094385 20509177 18242859 16689121 15896290 15800508 16503481 18085719 20479104 23666743
8758B3666743L656875L701244L301474K662794K115795J514328N17480r57465
$$ 23666743 27323618 31024862 34326336 36989130 39104925 40619253 41136733 40179268
8750D0179268k246023k789062k564755k062231j638858j131996j086194j326665
$$ 40179268 37933245 35144183 32579428 30517197 28878339 27746343 26660149 25333484
8742B5333484j820356k363011k680215k617897k182857j717281j341372j053477
$$ 25333484 23513128 21150117 18469902 15852005 13669148 11951867 10610495 9557018
8734I557018q58078n28715j15589L05795L28439l70976q98038o06947N4601O59874
$$ 9557018 8698940 8170225 8054636 8360431 8688870 8317894 7419856 6812909 6867510 7527384
8724G527384Q79032K91446p25047r69121m46372J12676M84872O69266P99895J073252
$$ 7527384 8406416 8697862 7972815 7003694 6557322 6669998 7154870 7824136 8624031 9697283
8714I697283J344956J651443K107799K651518K909255K767368K006157R70852
$$ 9697283 11042239 12693682 14801481 17452999 20362254 23129622 25135779 26106631
8706B6106631L8999k04577L71508J252597J804800J930552J667811O20219l99748
$$ 26106631 26145630 25941053 26312561 27565158 29369958 31300510 32968321 33588540 33188792
8697C3188792j060559j476580j823759k286381k562122k609405k431984j955220
$$ 33188792 32128233 30651653 28827894 26541513 23979391 21369986 18938002 16982782
8689A6982782j408416p69326P300P40378J264876J509157J815663K379200K862043
$$ 16982782 15574366 14805040 14812340 15552718 16817594 18326751 20142414 22521614 25383657
8680B5383657K912552K092380L39961j231468j801619j454132n20515O77445J490454
$$ 25383657 28296209 30388589 30728550 29497082 27695463 26241331 25720816 26398261 27888715
8671B7888715J609234J065113J50025p04464j402076j908957k372106k744440
$$ 27888715 29497949 30563062 30713087 30008623 28606547 26697590 24325484 21581044
8663B1581044k787506k490523j964992j350436q32099l30819k8596K65255N17845
$$ 21581044 18793538 16303015 14338023 12987587 12155488 11824669 11796073 12061328 12579173
8654A2579173L81333r9320j16754N64053J479031K437277L864749O165543J0236256
$$ 12579173 12960506 12861186 12744432 13308485 14787516 17224793 21089542 27255085 37491341
8645C7491341J7698883L0506272M7990776N6597802K4357140l5997618n8146636
$$ 37491341 55190224 85696496 133687272 190285074 214642214 178644596 120497960
8638A20497960m2904189k4807951j4084814q475026n193017l204552j924148j119671
$$ 120497960 77593771 52785820 38701006 30225980 25032963 21828411 19904263 18784592
8630A8784592n81386l64620j05826J86228M36752O56566Q23697P69238J89807
$$ 18784592 18203206 17838586 17732760 17918988 18355740 19012306 19836003 20605241 20795048
8621B0795048o75866j311209j448747j185931q73716k34814O49847J568562J322953
$$ 20795048 20119182 18807973 17359226 16173295 15299579 15064765 15714612 17283174 18606127
8612A8606127J85595J39041J189161J578344P30486N08033J543056L108118N048074
$$ 18606127 18791722 18930763 20119924 21698268 22428754 22936787 24479843 27587961 32636035
8603C2636035P591070J1513754J8494733L1635638N5347967R1208277J20739994
$$ 32636035 40227105 51740859 70235592 101871230 157219197 248427474 369167468
8596C69167468P2177653n8623034j20001800r3099526n5308186l2617447k0523195
$$ 369167468 441345121 382722087 262720287 169620761 114312575 81695128 61171933
8589F1171933j3571509r442541o773429n064916l841955k775244j861261j235232
$$ 61171933 47600424 38157883 31384454 26319538 22477583 19702339 17841078 16605846
8581A6605846j017985j301214j633849j347943r44455o54773m29916j59772K15427
$$ 16605846 15587861 14286647 12652798 11304855 10360400 9705627 9275711 9115939 9331366
8572I331366P04209J493588K634446K598628k06602k402369j826154n48456J30534
$$ 9331366 10035575 11529163 14163609 16762237 16555635 14153266 12327112 11778656 11909190
8563A1909190J40301R7478M85060J145238J942601L191630M991528Q092184J3774644
$$ 11909190 12049491 12146969 12632029 13777267 15719868 18911498 23903026 31995210 45769854
8554D5769854K3746483L8968376N3455363M1418803j2926465n4367116m9658246
$$ 45769854 69516337 108484713 161940076 203358879 190432414 136065298 86407052
8547H6407052l0568460j7246988j0213001o429333m273184k912601k148827j576539
$$ 86407052 55838592 38591604 28378603 21949270 17676086 14763485 12614658 11038119
8539A1038119j157788q22264n38391m24214n22898o83003o15338l77590k10022
$$ 11038119 9880331 9058067 8519676 8095462 7572564 6889561 6274223 5896633 5686611
8530E686611j09304o0588m1812J72974O10154R76795L04726j112599j418155r58550
$$ 5686611 5577307 5516719 5474907 5647881 6258035 7234830 7539556 6426957 5008802 4050252
8520D050252n79170l02089p3448M7117K9737j4879n8228j38970j37822j88708
$$ 4050252 3471082 3168993 3095545 3142662 3172399 3157520 3099292 2960322 2822500 2633792
8510B633792k09952j64991q7702R668P8124J11743M0506j64194j65296r3525n7818
$$ 2633792 2423840 2258849 2171147 2180815 2258939 2370682 2411188 2246994 2081698 1988173 1930355
8499A930355j49129j62545j44056o9677k9126n0349k2504P6493J20716J77157
$$ 1930355 1781226 1618681 1474625 1404948 1375822 1325473 1302969 1379462 1500178 1677335
8489A677335K56579L71202N20769N18455J50982l41809n70681n69879m05573k11724
$$ 1677335 1933914 2305116 2825885 3344340 3495322 3153513 2582832 2012953 1607380 1395656
8479A395656j22901r4673r6855k8234q876K9464N2918J2283N0528m668p3095r5583
$$ 1395656 1272755 1178082 1081227 1052993 1044117 1073581 1126499 1138782 1189310 1184642 1111547 1015964
8467A015964p2210n9880O982K6296o8161o988p371P902L5141O6237J22034P3404
$$ 1015964 943754 883874 890856 917152 848991 842003 834632 842534 877675 943912 1065946 1139350
8455A139350L5739j0807J732o908q79m6938n0595m436N3969O1371P3237J38489
$$ 1139350 1175089 1164282 1166014 1159106 1158227 1111289 1060694 1056258 1110227 1171598 1244835 1383324
8443A383324K31597K41256M3998j41354k27051k04725k01712o7935o0027j1676
$$ 1383324 1614921 1856177 1900175 1758821 1531770 1327045 1125333 1057398 997371 985695
8433I85695k0865j5803J3413j1208k4016J5928O2410P3983O3252J0444n6600j47847
$$ 985695 964830 949027 962440 951232 927216 943144 1005554 1079537 1142789 1153233 1096633 948786
8421I48786r7163p6363m9526J0274j2735J5667m5453o5410q1632j4733R4781J6041
$$ 948786 851623 775260 725734 736008 723273 738940 693487 628077 546445 531712 626493 642534
8409F42534K0215l1713m0923n5610k0166O087k4273j2463J1785l5867m9350M8798
$$ 642534 662749 631036 590113 534503 514337 520424 496151 483688 495473 459606 410256 459054
8397D59054O1696j9350p227L1695j4230o2828Q739O077K7939M4706j0161k6461
$$ 459054 520750 501400 494173 525868 511638 448810 457549 463626 491565 536271 526110 499649
8385D99649K6185P8478O6068P3554R0825J04553J82597K41782J71609J7946j34460
$$ 499649 525834 604312 670380 743934 834759 939312 1121909 1363691 1535300 1553246 1418786
8374A418786k04904j69724p0150j00638o5845k7139m8075l2059p2476j3632k6635
$$ 1418786 1213882 1044158 974008 873370 807525 780386 732311 700252 627776 614144 587509
8363E87509J377K0846N348m7540n5280q792Q182j825n1162N4881N1291J2657M106
$$ 587509 588886 609732 615080 567540 512260 503468 511650 509825 458663 513544 564835 577492 581598
8350E81598j7120k0941p148j6226P696L187J7080k1289L0595J3900j6751k2858
$$ 581598 564478 543537 536389 520163 527859 531046 548126 526837 557432 571332 554581 531723
8338E31723l2616n3481j4761k0394j1073L3035J04667O0888M9042M9703K5644
$$ 531723 499107 445626 430865 410471 399398 432433 537100 597988 647030 696733 722377
8327G22377p737m7825o7060l5545k6466N551k6765p4992k3129k2857p220M6049
$$ 722377 714640 666815 599755 564210 537744 543295 516530 441538 418409 395552 388332 434381
8315D34381J0811J5529j8433k3455j8917n984j9334j1330n6559j2457O2188K5838
$$ 434381 445192 460721 442288 418833 399916 393932 374598 363268 306709 294252 356440 382278
8303C82278L5938O7020M6865O11J5269L7678k1231J3126R752p293N307n0377m5099
$$ 382278 418216 485236 532101 532712 547981 585659 564428 577554 587306 580013 585320 534943 489844
8290D89844o9051m6483j3222m830j0050L780p169j9739j0749L7147N0700J3583
$$ 489844 420793 374310 361088 356258 346208 349988 342819 323080 312331 349478 400178 413761
8278D13761N1324L9153k5455l9140J7573j6005m1889L8907L2431J244l996J3520
$$ 413761 465085 504238 478783 439643 457216 441211 399322 438229 470660 471904 467908 481428
8266D81428K4216k7665o1594L6262m6507n6178k2207m4598r492L2834p277j8523
$$ 481428 505644 477979 416385 452647 406140 349962 327755 283157 273665 306499 299222 280699
8254B80699L9307L1571m738j6869k5070J0634P106K5716L9658j6206J446L5006
$$ 280699 320006 351577 346839 329970 304900 315534 322640 348356 388014 371808 373254 408260
8242D08260P7703L3531R3542J68225K64524K65209k1182k76673k61172j89793
$$ 408260 485963 519494 613036 781261 1045785 1310994 1289812 1013139 751967 562174
8232E62174p5665o7567o8918n0294p340K0628j2813n979l3977M8912N4800n23
$$ 562174 486509 418942 350024 299730 292390 313018 300205 294226 260249 309161 363961 363438
8220C63438n3816K4457l3646l4623m753L9N8171K7355P04J338q803p3577j7983
$$ 363438 309622 334079 300433 265810 261057 261096 319267 346622 347326 348664 339861 266284 248301
8207B48301j9498K6989J1530M9621k5644r286L2050Q960L4780O5337P7102J34980
$$ 248301 228803 255792 267322 316943 291299 282013 314063 323023 357803 423140 500242 635222
8195F35222K31837L90388N34213N51699R1668m69640o13594m31560k54145j62571
$$ 635222 867059 1257447 1791660 2343359 2435027 1965387 1351793 920233 666088 503517
8185E03517j00445p1892j3686k1466k1436K4003J3765M9733M8714n1836m7267
$$ 503517 403072 331180 317494 296028 274592 298595 312360 362093 410807 358971 311704
8174C11704l6740J8109K3305o0355k015J0362k1753p2274J2800M6801K5455J3021
$$ 311704 274964 293073 316378 256023 254008 264370 242617 170343 183143 229944 255399 268420
8162B68420K3879J4167LLn1651J9562J00553N6368J10804J39438K51349L70395
$$ 268420 292299 306466 306469 306472 254821 274383 374936 431304 542108 681546 932895 1303290
8150A303290L04979J02026p6731j3670j8306l26203l70142k47358j58861n8859
$$ 1303290 1608269 1710295 1633564 1619894 1601588 1275385 905243 657885 499024 440165
8140D40165o6483m6269j1564o640k697J4741o789r659m4079m2079m2147n289J197
$$ 440165 373682 327413 315849 309209 306512 321253 314464 304805 260726 218647 176500 171211 172408
8127A72408p148K0062R2279N7217O891k2280j2520n9329k0294K9396K9285k085
$$ 172408 165260 185322 277601 334818 341709 319429 306909 247580 227286 256682 285967 283882
8115B83882N150O7465N6430R8055J90675K02761J31648J2994j23971k11762j82548
$$ 283882 289032 356497 412927 510982 701657 904418 1036066 1049060 925089 713327 530779
8104E30779j26100j01864r1949j1466L1161K6358L8880J1359l6489o306M1824
$$ 530779 404679 302815 210866 199400 230561 256919 295799 307158 270669 264363 306187
8093C06187L6801L0627P348n8149l2897J3947R003l0027k3094M0811j5673p8358
$$ 306187 342988 373615 380963 322814 289917 303864 312867 282840 259746 300557 284884 206526
8081B06526l7999K6966J429m8790n8453K1231O4888Q7037K8417m900m4563k4855
$$ 206526 168527 195493 196922 148132 89679 110910 175798 262835 291252 286352 241789 216934
8069B16934j698L394K3492j4311J916K3553L1672j3247j0705P311K6538M8024
$$ 216934 215236 218630 242122 227811 229727 253280 284952 271705 261000 268311 294849 342873
8057C42873M731m9154J7108O003M837J7652J0397N2205K9374J2930O6731K3917
$$ 342873 347604 298450 315558 321561 326398 344050 354447 406652 436026 448956 515687 539604
8045E39604l6955P7599J13183N2563k531o0150K8432K4640j455l2508J1941K707
$$ 539604 502649 580248 693431 745994 743463 683313 711745 736385 734930 702422 714363 717070
8033G17070L0698L0988J2821N930K1713n3900m0015N75j3901n5759j1764j2106
$$ 717070 747768 778756 791577 797507 819220 765320 725305 725880 711979 656220 644456 632350
8021F32350m0276R536M3250j3923n992O17M662J0654K0623m07k3113m0221j0172
$$ 632350 592074 601610 644860 630937 624945 625562 630224 640878 661501 661094 637981 597760 587588
8008E87588Q1696O5295P4287P8066J21745J18508K58525L77720M36204L68540
$$ 587588 669284 734579 808866 886932 1008677 1127185 1385710 1763430 2199634 2568174
7998B568174P0325k47197l38838l35088k45897j54134o9499m8715K0828J0452
$$ 2568174 2638499 2391302 2052464 1717376 1471479 1317345 1247846 1199131 1219959 1230411
7988A230411P2325J16888O8214q7913k11428k11620j62967r1998k1469o9247p9965
$$ 1230411 1302736 1419624 1487838 1399925 1188497 976877 813910 721912 700443 631196 551231
7977E51231l3576k0422N51l423L7394J8887k2969j0215M312K4848K1221J8921
$$ 551231 517655 497233 497784 494361 531755 550642 527673 517458 521770 546618 567839 586760
7965E86760L2838K5494M1559O0787P3875L3489Q5125J29040J41023K15781J76219
$$ 586760 619598 645092 686651 747438 821313 854802 939927 1068967 1209990 1425771 1601990
7954A601990Q0364k6715q4619j59055j35767q3564m0710l7202M1948J08814l941
$$ 1601990 1682354 1655639 1571020 1411965 1276198 1192634 1151924 1114722 1156670 1265484 1261543
7943A261543j22868j88404j82287r5189n9323l1746m3120o4631l5021K702j2420
$$ 1261543 1138675 950271 767984 672795 613472 581726 538606 473975 438954 441656 429236
7932D29236k3892k9846o7367m8267J6549L2392K9406K3301k3932r8024m2514N2017
$$ 429236 405344 375498 308131 259864 276413 308805 338211 361512 337580 239556 197042 249059
7920B49059Q7127L8262J2721L268J3463N3909P3889J1774J9199P378k1028o1721
$$ 249059 336186 374448 387169 390437 403900 457809 531698 543472 562671 570049 549021 487300
7908D87300l9918n669N967J914j0780k0855l5795k0277j7626n2754M932Q976l5608
$$ 487300 447382 441713 447680 449594 438814 417959 382164 361887 344261 291507 296439 305415 269807
7895B69807j6606n3491l5023P027j0628k9060K4284J9600L7860p236j8547k3793
$$ 269807 253201 199710 164687 171714 161086 132026 156310 175910 213770 206534 187987 164194
7883A64194k3667J4781N287J3818L2548n174N893j8164L7727j3317j8944o6486
$$ 164194 140527 155308 160595 174413 206961 201787 207680 189516 227243 213926 194982 128496
7871A28496K8718L3638j5309J7303k7553o1339J1711O1598J1953j2257j3379k1065
$$ 128496 157214 190852 175543 192846 165293 103954 115665 177263 189216 176959 163580 142515
7859A42515k3741l1862M3685O003K1772K5358r786m0793j3495K3155k5934Q428
$$ 142515 118774 86912 130597 136600 158372 183730 173944 133151 119656 142811 116877 125305
7847A25305K6313J4095l3382k9980P904K0559k134M807J2595m6532j1187L327
$$ 125305 151618 165713 132331 102351 110255 130814 128680 133487 146082 99550 88363 91690
7835I1690l8095j6258R097K0223n0662j762P3405M8891L4774k2838m2055m4895
$$ 91690 53595 37337 46434 66657 15995 14233 87638 136529 171303 148465 106410 61515
7823F1515J3787j9380L7131M1358L5304k5019k5118Q355K1072R355K6800n2032
$$ 61515 75302 55922 93053 134411 169715 144696 119578 127933 149005 158360 185160 133128
7811A33128l9895p3542P025N6520J1183l304R693k3148k6767L300K3456K8990
$$ 133128 93233 19691 26716 83236 94419 91115 100808 77660 50893 54193 77649 106639
7799A06639K250l6113k7351M1484N7912K0981j5045j8517L0054M527K4440l1857
$$ 106639 108889 72776 45425 86909 144821 165802 150757 132240 162294 166821 191261 159404
7787A59404l9998j9392j5883k0837P694k589j0284P735l3689K2551K7481q310
$$ 159404 119406 100014 84131 63294 70988 68399 58115 65850 32161 54712 82193 73883
7775G3883l1631j4671M84l145J358O1297K4626J7450p653J691k4022l9154K0341
$$ 73883 42252 27581 28065 24920 26278 87575 112201 129651 121998 123689 99667 60513 80854
7762H0854J1662J3848j1187o218O910k4561J7135N1170n256k9552n1022l2083
$$ 80854 92516 106364 95177 88959 95869 71308 88443 139613 134357 104805 53783 21700
7750B1700k1776j8750J4436O1494L5046J4028k6688m3328l4951O886L4159k6559
$$ 21700 -76 -18826 -4390 57104 92150 106178 79490 36162 1211 8097 42256 15697
7738A5697k0950M7006k853J3771o0014j6426L9268M2154o284o288L024k9946J0263
$$ 15697 -5253 41753 38900 52671 -7343 -23769 15499 57653 51369 45081 48105 18159 28422
7725B8422N9649Q281q667L1735j7621m1212r924q561K5978o15K5614K4520j2493
$$ 28422 88071 96352 87685 119420 101799 60587 50663 42102 68080 67465 93079 117599 105106
7712A05106K0022L662m2988n5548R62N9738L8393l0950j0732o310n4746j4636
$$ 105106 125128 128790 85802 30254 31216 90954 129347 98397 87665 81355 26609 11973
7700A1973L9092Q554l0875l1304O9815M9138k7682l5640J8358j9175J405K1937
$$ 11973 51065 59619 28744 -2560 67255 116393 88711 53071 71429 52254 53659 75596
7688G5596N385j3332k3857L1127K807j4859k887j6363r351l4098L0291L6393J3147
$$ 75596 80981 67649 43792 74919 77726 62867 59980 43617 34266 168 30459 66852 79999
7675G9999j0430p89l2423k3749l0910K9368M3694K3275k3396P033p818j9346L1098
$$ 79999 69569 68780 36357 12608 -18302 11066 54760 78035 54639 61672 53854 34508 65606
7662F5606O31j2439m0393J6392J9025R589J0475K5813K2341Q700M0178r37o7298
$$ 65606 66237 53798 13405 29797 48822 58411 68886 94699 117040 125740 165918 164981 97683
7649I7683k0353j63q976j1669M2285M3559n9671m8994L9091M3570P940J3121l9246
$$ 97683 77330 77167 68191 56522 98807 142366 82695 33701 72792 116362 124302 137423 98177
7636I8177l5369J5781L3161K6163j7500j0540k4348p762k0906j6457p424K8071
$$ 98177 62808 78589 111750 137913 120413 109873 85525 77763 56857 40400 32976 61047
7624F1047M6639j3605J9372l710m0092j6745P281M1779N4751m8403r1849K761
$$ 61047 107686 94081 113453 109743 69651 52906 60187 101966 156717 108314 16465 19226
7612A9226N4832J8061M6591j688j5075j7128l5166Q805l310l4742k7599L5520
$$ 19226 74058 92119 138710 137022 121947 104819 69653 78458 75148 40406 12807 48327
7600D8327K5377j0986M3853j3571K8578j35k2216j5190M569J511l2866o107j230
$$ 48327 73704 62718 106571 93000 121578 121443 99227 84037 88606 90117 57251 51144 49914
7587D9914m1934Q421O8406J8724m1077l8266L5408K7675j6507K678J0202k083
$$ 49914 7980 16401 84807 103531 62454 24188 59596 87271 70764 73442 83644 81561
7575H1561k4896k2341l7995N6118L7946q889Q825m623J8082q8589l6270N1089
$$ 81561 56665 34324 -3671 52447 90393 81504 90329 85706 103788 15199 -21071 30018
7563C0018m371K6000N9314K2363q475l8770l6660R708k276k654o5500k5019L7454
$$ 30018 25647 51647 110961 133324 124849 86079 49419 59127 56851 54197 -11303 -36322 1132
7550A132j8437J2774M0766N057M7599J3869q936l7656n077k4219j7184L8829O9872
$$ 1132 -17305 -4531 36235 41292 88891 102760 93824 56168 51091 26872 9688 48517 118389
7537A18389m3841l8561J6273p1699l5053L9728O7138L7483L4376l675k3634j1686
$$ 118389 74548 35987 52260 -19439 -54492 -14764 52374 89857 124233 120558 96924 85238
7525H5238j1529m915k1510r017K3532k3817J1688q891l903J448l6081o407K9563
$$ 85238 73709 68794 47284 38267 61799 37982 49670 40779 36876 38324 2243 -4164 25399
7512B5399N70L9043O1903P487j6052k2954K6067J8431j6433n9438J1813J1541
$$ 25399 25969 65012 126915 134402 118350 95396 121463 139894 123461 64023 75836 87377
7500H7377l4316j1363j9801M7493R260J599J0456n6497l5504j9064K7286K8932
$$ 87377 53061 41698 21897 69390 78650 80249 90705 34208 -1296 -20360 6926 35858
7488C5858k365p381K2995J5546j8755k5275K129J5351Q988L3864j688j6180j3893
$$ 35858 33493 26112 49107 64653 45898 20623 22752 38103 47091 80955 79267 63087 49194
7475D9194K2830j698j9773Q711j6395j4517K2788M5306j6493m9616m6079j2988
$$ 49194 72024 70326 50553 59264 42869 28352 51140 96446 79953 30337 -15742 -28730
7463b8730j3329k1192o458K681L6293J009Q891L3276j5471l8423M1036K2560m6716
$$ -28730 -42059 -63251 -69709 -67028 -30735 -29726 -20835 12441 -3030 -41453 -417 22143 -24573
7450b4573j8676m1537L7771L2894K5995r982N756K4435K0995J5280Q748q964n5278
$$ -24573 -43249 -84786 -47015 -14121 11874 1892 7648 32083 53078 68358 77106 68142 12864
7437A2864k8679j601L7537p917N734L1172l8170j2433N5080K6728m0472K5719
$$ 12864 -15815 -17416 20121 12204 17938 49110 10940 -1493 53587 80315 39843 65562
7425F5562K0159K711m0748k0101l2603j8489K0702K2878l4439n3670n339N6904
$$ 65562 85721 88432 47684 27583 -5020 -23509 -2807 20071 -14368 -68038 -73377 -16473
7413a6473M4083j2678k0408N2928j8867m6176K5090o729J4887K1927l9572j955
$$ -16473 27610 14932 -5476 47452 28585 -17591 7499 770 15657 37584 -1988 -3943
7401c943Q069j760p679k7688M482N2465j7282l5291J7245j1902K5065O3746m3140
$$ -3943 4126 2366 -5313 -33001 -28519 23946 6664 -28627 -11382 -23284 1781 65527 22387
7388B2387k0640K9421n2470j7124L4749K4951j3850m2559l7517k0280K5300k2168
$$ 22387 1747 31168 -21302 -38426 -3677 21274 7424 -35135 -72652 -92932 -67632 -89800
7376h9800J6466L5965k064M6721K1093J3998k830j1301j0112j2468k881K6956
$$ -89800 -73334 -37369 -39433 7288 28381 42379 39549 28248 18136 5668 2787 29743
7364B9743P180K9190L3394K912k5676m0262M8121j3891m0918m5830K6000L0411
$$ 29743 36923 66113 99507 102419 76743 36481 84602 70711 29793 -16037 9963 40374
7352D0374J6789l1383j9196j717j5164O5931N9664l5095m3274N0556L3786o0350
$$ 40374 57163 25780 6584 4867 -10297 55634 115298 80203 36929 87485 121271 60921
7340F0921n4932m5831M3392L1454j095n658q640j831J6442K1374K9573m338m7658
$$ 60921 5989 -39842 3550 35004 33909 28251 19611 17780 34222 55596 85169 80831 33173
7327C3173j1540j4443l441K4095R768L5385j8653m6336k0685K4895m4272k5115
$$ 33173 21633 7190 3749 27844 37612 72997 54344 8008 -12677 12218 -32054 -57169
7315e7169J5379j8544N2971M1353L4559O450l2930M276J0709J7406j6802R14J1013
$$ -57169 -41790 -60334 -7363 33990 68549 74999 42069 46345 57054 74460 57658 58572 69585
7302F9585L3644l420j8811j9906N5400K5415m5866m8063m7990m2278k9551p881
$$ 69585 103229 99809 80998 61092 116492 141907 96041 47978 -12 -42290 -71841 -79722
7290g9722J9665P5745R2931J1301k817k9581R42R063J3988m6020n3628P0126J7332
$$ -79722 -60057 15688 108619 119920 117103 87522 88464 97527 111515 65495 11867 81993 99325
7277I9325j6257P37j0015K9954j718m5760p5946n118K6031L532j0007n314O967
$$ 99325 83068 83805 73790 103744 102026 56266 -19680 -24798 1233 4765 -5242 -10556 -3589
7264c589K8331j4369n6326k7774K1996J7667k2171J8778l5950K0538k3462j8188
$$ -3589 24742 10373 -45953 -73727 -51731 -34064 -56235 -37457 -73407 -52869 -76331 -94519
7252i4519L8032O1636N6118K244j9448o7945j0299j9177m3259J5401L9975o014
$$ -94519 -56487 5149 61267 63511 44063 -23882 -34181 -53358 -96617 -81216 -41241 -47255
7240d7255M1986Q396n624M1159j1786k146j3934L8675K7075m8987m3155j6471
$$ -47255 -5269 3127 -2497 38662 26876 24730 10796 49471 76546 27559 -15596 -32067
7228c2067k8982l041J9364K8436m313K5910J0271J3966K8829j2159q472K8789
$$ -32067 -61049 -64090 -44726 -16290 -20603 5307 15578 29544 58373 46214 37742 66531
7216F6531J9668k9469N541l205k944q499J9529q09R455m5224K695K5659K5683
$$ 66531 86199 56730 62271 59066 56122 47623 67152 66343 75798 30574 33269 58928 84611
7203H4611O293j188m6436m073Q845n590j911j5219L0413L8314m3923n117J1396
$$ 84611 90904 89716 43280 39207 48052 42462 40551 25332 55745 94059 50136 45019 56415
7190E6415K7033J1261J7054k3174O119l6961n0076r420L4251K5423j1399j7293
$$ 56415 83448 94709 111763 88589 94708 57747 7671 -1749 32502 57925 46526 29233
7178B9233O600j4642N5474M0026n456M1574L5041j3528n2894k8041m5618k7219
$$ 29233 35833 21191 76665 116691 111235 152809 187850 174322 121428 93387 47769 20550
7166B0550K9253L8125n268L007L2469q113o9448o1957m9603l497k460L6835r113
$$ 20550 49803 87928 82660 85667 118136 110023 40575 -21382 -70985 -74482 -76942 -40107 -49220
7153d9220p613J6500J1382K7835K1987K6767k7417M3156L985k9918l9662L5078
$$ -49220 -56833 -40333 -28951 -1116 20871 47638 20221 63377 67362 37444 -2218 32860
7141C2860o165k0423j9966K1865j9112l5309J1723j1050K2477K8162j9870J5665
$$ 32860 26695 6272 -13694 8171 -10941 -46250 -34527 -45577 -23100 5062 -14808 857
7129H57L063O108L5215K165k3995l5889j9034O0129L7364m0025l8906J3517J1369
$$ 857 3920 10028 45243 47408 23413 -12476 -31510 28619 65983 25958 -12948 569 11938
7116A1938J0845R431k6140l3373j9154M5420L1408m031j2358m2400l6280j6918
$$ 11938 22783 32214 6074 -27299 -46453 -1033 30375 26344 13986 -28414 -64694 -81612
7104h1612K1396N3510K6899m0053K2900K4180J8598n039m5386L8140J5049l2531
$$ -81612 -60216 -6706 20193 -19860 3040 27220 45818 40779 -4607 33533 48582 16051
7092A6051K1981p960o115K4447l311m2161k496l272K4464N859N484J0884Q791
$$ 16051 38032 30072 23957 48404 45093 2932 436 -2836 21628 27487 32971 43855 52646
7079E2646L5411n0929p9426l1906J2636k3965N41K6968N1895M3676N829K5200
$$ 52646 88057 37128 -42298 -74204 -61568 -85533 -84992 -58024 -6129 37547 43376 68576
7067F8576k75K7419k2446j827j1405k9919j6304k3307k0663J1813J5773j3075
$$ 68576 68301 95720 73274 71447 60042 30123 13819 -9488 -30151 -18338 -2565 -15640
7055a5640L0352J6070L792L4902o42l356j6511j2836K4246k8521n3444L46L7131
$$ -15640 14712 30782 34574 69476 68834 65478 48967 36131 60377 31856 -21588 -21242 15889
7042A5889L9835p9320O315K2029n1577N2918J3644m1068Q065J5108J7142K2581
$$ 15889 55724 -23596 -17281 4748 -46829 6089 19733 -21335 -13270 1838 18980 41561
7030D1561O8746L3215J897m9196l0712n1372l7762J4391K8340r536K5890J4673
$$ 41561 110307 143522 145419 96223 65511 14139 -23623 -9232 19108 9572 35462 50135
7018E0135R462k5064q4212Q782L78J4118j3950r084L6791L5414j0980k202n283
$$ 50135 59597 34533 -49679 -40897 -40519 -26401 -40351 -49435 -12644 22770 11790 9588 4305
7005D305M362L9981k2251K1668L3488j4041r20p720K7034r558j4622n6077j7627
$$ 4305 8667 48648 26397 48065 81553 67512 66592 58872 85906 76348 61726 5649 -11978
6992a1978k5806m3984N861M5125J7489N090N6560o1420k5393L1113K2365j5402
$$ -11978 -37784 -81768 -75907 -30782 -13293 -8203 48357 -13063 -38456 -7343 15022 -380
6980c80J0094L4224J9463j0863k1110J9742J0416K240J3903J4276K2018m5580
$$ -380 9714 43938 63401 52538 31428 51170 61586 63826 77729 92005 114023 68443
6968F8443m4354P219L1485k6698K567r774l629L9776P080j9429J5408k6099j8974
$$ 68443 24089 31308 62793 36095 38662 28888 25259 65035 72115 52686 68094 41995 23021
6955B3021k6204J8746M3506J0030l4596r0519q712O9l0971N266K0600M903O181
$$ 23021 -3183 15563 59069 69099 34503 -56016 -64728 -64659 -95630 -90364 -69764 -64861 -58680
6942e8680L5577J3203J6010m3164M773K1748J4038n668K1116J8242M2689j9182
$$ -58680 -23103 -9900 6110 -37054 -32281 -10533 3505 -2163 18953 37195 79884 60702
6930F0702m8152k0653j5881j853j414M2239L3703K2490o2661j4662J5591l8861
$$ 60702 12550 -8103 -23984 -25837 -27251 14988 48691 71181 8520 -6142 9449 -29412
6918b9412k3922k2912K6042M7404J8164N672m019M590j1769j0763O668j6462k8539
$$ -29412 -53334 -76246 -50204 -2800 15364 21036 17017 21607 9838 -925 5743 -10719 -39258
6905c9258K6497O867M4244o517M5240L5981K1092n7572n596j1241r024j9101k7292
$$ -39258 -12761 -5894 38350 31833 77073 113054 134146 76574 70978 59737 50713 31612 4320
6892D320k2518m9432L4182N3370J8534j7556q56M372J3746p403L7635l2496n5605
$$ 4320 -18198 -67630 -33448 19922 38456 20900 20044 24416 38162 30759 68394 35898 -19707
6879a9707k0100J845L0339k0868L73M7826J0411l4708K6900j4808j5634Q052J2013
$$ -19707 -39807 -37962 -7623 -28491 -28118 19708 30119 -4589 22311 7503 -8131 -79 11934
6866A1934j2806O421q629K9718K9307j2534p283M3010k1059k1726l0627o8513
$$ 11934 -872 5549 -3080 26638 55945 43411 36128 79138 58079 36353 5726 -62787
6854f2787k2207N2920q92l9409m121N6119j3525J733O5755M1602K8765l7281o0013
$$ -62787 -84994 -32074 -32966 -72375 -76496 -20377 -33902 -32169 33586 75188 103953 66672 6659
6841F659K1968K4233m762l272R357k3218j2118l0905o83K0300j8929K3757j8747
$$ 6659 28627 52860 48098 44826 54183 30965 18847 -12058 -12741 7559 -11370 12387 -6360
6828f360n3913k3085L3282L9404L3479L8933m577k733M671Q628n1715k9137J6142
$$ -6360 -60273 -83358 -50076 -10672 22807 61740 57163 54430 59101 67729 16014 -13123 3019
6815C019R510o605k750k7088r601K4778M3319j2209o5876j4680K5594O821L1986
$$ 3019 12529 5924 3174 -23914 -33515 -8737 34582 22373 -43503 -58183 -32589 -25768 6218
6802F218K5370m1445J0307Q187m567p546k1951K5566l1128Q228j2207l6259J4943
$$ 6218 31588 -9857 450 8637 4070 -3476 -25427 139 -30989 -22761 -34968 -71227 -56284
6789e6284K7305L8961j9274n374l024M726P512O2821M7855j6243j2944j057k1055
$$ -56284 -28979 9982 -9292 -14666 -17690 -12964 -5452 57369 105224 88981 76037 74980 53925
6776E3925j170j5776K0644Q001k1645n1636p130N4323R855j0872k2945K0642m2729
$$ 53925 52755 36979 57623 65624 43979 -7657 -14787 39536 49391 38519 15574 36216 -6513
6763f513j3562m036q973o2963P530N7239J5035M2996N531N3394o530k9570l8434
$$ -6513 -20075 -24111 -33084 -96047 -88517 -31278 -16243 26753 32284 85678 79148 49578 11144
6750A1144j4901M0784J8156n4105o22R075J6167L8965Q64j3600j7595q5661L9644
$$ 11144 -3757 37027 55183 1078 456 9531 25698 64663 65527 51927 34332 -51329 -11685
6737a1685J3049O755L0637J2118J6855r587n1183j7156m2016j3802K2532J5093
$$ -11685 1364 8119 38756 50874 67729 58142 6959 -10197 -52213 -66015 -43483 -28390
6725b8390M217J7042L4907K8648Q276J1889l8830J2136L5059l5065k8376M77K404
$$ -28390 -24173 -7131 27776 56424 64700 76589 37759 49895 84954 49889 21513 21990 24394
6712B4394K427k7670K377J3557Q303k3033K8469m124j0733O393J1722J4148l2874
$$ 24394 26821 -849 1528 15085 23388 355 28824 24700 13967 20360 32082 46230 13356
6699A3356j2235j6701K8275M6885N09l6447N052k1745j4490j0115J6779o06r762
$$ 13356 1121 -15580 12695 59580 60089 23642 28694 6949 -7541 -17656 -877 -1483 -11245
6686a1245L5570P529j4347l1109m1416K9724n669k860l056N363K1918K5855L8366
$$ -11245 24325 31854 17507 -13602 -55018 -25294 -30963 -33823 -36879 -31516 -9598 16257 54623
6673E4623J3650n9786J5372j4491j7607J550j6654k4644M400J1228K7307J9110
$$ 54623 68273 8487 23859 9368 -8239 -6689 -23343 -47987 -43587 -32359 -5052 14058
6661A4058K7695N0716K3783n3312k2806J7758n200k647M543K3906l022l4n288
$$ 14058 41753 92469 116252 62940 40134 57892 52692 50045 54588 78494 75472 75438 70150
6648G0150o8303n6304M3836L2132j6434j6240L7649j1361M178J6344k756k9232
$$ 70150 1847 -54457 -10621 21511 5077 -11163 26486 15125 19303 35647 32891 3659
6636C659n4369k8053J0301J6594L4946m995K8973k0808q981k1509L6849L7570
$$ 3659 -50710 -78763 -68462 -51868 -16922 -21917 7056 -13752 -22733 -44242 -7393 30177
6624C0177k3900j5078j1176K3043N2622l218j3750L92j0125l5573L434K0801n99
$$ 30177 6277 -8801 -19977 3066 55688 52470 38720 39112 28987 -6586 -3152 17649 17050
6611A7050k7284l9401J3444N1379K6643J964l3464l1641j8797J6581N373j0088
$$ 17050 -10234 -49635 -36191 15188 41831 43795 10331 -21310 -40107 -23526 -18153 -28241
6599b8241K384K6234j2888j8086J8688k828j1343K3901J4010k3756j5915L5032
$$ -28241 -25857 377 -12511 -30597 -11909 -14737 -26080 -2179 11831 -11925 -27840 7192
6587G192L1317l931l3525n2113k1583J4083M0829L1209J9974r32k8403k0477q074
$$ 7192 38509 34578 1053 -51060 -72643 -58560 -17731 13478 33452 32520 4117 -16360 -24434
6574b4434K9182N051j2501n2961j5853K8377M7835K3161k251q895j2861Q386l862
$$ -24434 4748 9799 -2702 -55663 -71516 -43139 4696 27857 25606 16711 3850 12236 8374
6561H374k6290m2632K09K1533P689J9974j2088K0589J1620L6633k9322J4810r831
$$ 8374 -17916 -60548 -60339 -38806 -31117 -11143 -23231 -2642 8978 45611 16289 31099 21268
6548B1268l5892J2394k7251J370P1991k8632q0933q717K4043L8700M6543L0513
$$ 21268 -14624 -2230 -29481 -28111 43880 15248 -65685 -74402 -50359 -11659 34884 65397
6536F5397k3017k1507m5283J8213K1120j6211j4005R406J0547K1666K0089j6548
$$ 65397 42380 20873 -24410 -6197 14923 -1288 -15293 -5887 4660 26326 46415 29867
6524B9867k1335j4770l0529K3658N082K8693J5154j0955K71r83L1574L09m621
$$ 29867 8532 -6238 -36767 -13109 -8027 20666 35820 24865 25136 24153 55727 56036 51415
6511E1415J3040m570k9080J0533J778j9791L7578l3433j1231j6685L3351M6353
$$ 51415 64455 59885 30805 41338 43116 23325 60903 27470 16239 -446 32905 79258
6499G9258k7794n0108Q148J7702k1960j4859J2575Q4634K5660m3096m930j5756
$$ 79258 51464 1356 9504 27206 5246 -9613 2962 87596 113256 70160 65230 49474
6487D9474k4234k0187K2007M0238k6933n907k0897k1191J9839J8846m7177n852
$$ 49474 25240 5053 27060 67298 40365 34458 13561 -7630 12209 31055 -16122 -21974
6475b1974K4260j9593l9234M4384O7672k7771L067k0456J173L4762n565J037j7414
$$ -21974 2286 -17307 -56541 -12157 55515 27744 30811 10355 11528 46290 40725 41762 24348
6462B4348p335M3399j205j1735k2016k7962j6857l4463L544L759J5630l4985k8648
$$ 24348 17013 60412 59207 47472 25456 -2506 -19363 -53826 -50282 -46523 -30893 -65878 -94526
6449i4526K1367K0331K5866K125J1244J3850J1419N1025J8414m1895j4230K7315
$$ -94526 -73159 -52828 -26962 -24837 -13593 257 11676 62701 81115 39220 24990 52305
6437E2305j1524p1423j9486L5976K2901Q000j2008j8794j4167l6190M0084M9649
$$ 52305 40781 -30642 -50128 -14152 8749 16749 4741 -14053 -28220 -64410 -24326 25323
6425B5323R677j1959n8031l5489J9338M4270K3199m5131j186R281K5831L5453
$$ 25323 35000 23041 -34990 -70479 -51141 -6871 16328 -28803 -29989 -20708 5123 40576
6413D0576j100M041J952j8385K1541K337k8722k0887k5017m557l2085o487P626
$$ 40576 39476 43517 45469 27084 48625 50962 22240 1353 -23664 -28221 -60306 -66793 -59167
6400e9167K1523K1912K6476p472K3578L6308l5891p302M409M6067l7390m0643
$$ -59167 -37644 -15732 10744 3272 26850 63158 27267 19965 24374 70441 33051 -7592
6388g592J6157K4567q388j9802M300J399K0686m3485n1781K4080M274l555K6190
$$ -7592 8565 33132 24744 4942 9242 10641 31327 -12158 -63939 -39859 -35585 -39140 -12950
6375a2950M0834l1686j793K5446j2966N1713M877n4889K728J8941N264j8981J3862
$$ -12950 27884 -3802 -5595 19851 6885 58598 63475 8586 11314 30255 35519 16538 30400
6362C0400k3198n3320K2078K8911M7477j7448M0590J6591K1131m0382j00198n6481
$$ 30400 7202 -46118 -24040 4871 52348 34900 75490 92081 113212 72830 -27368 -83849
6350h3849K1207O2493R30P909M9514k324k1494k7446L4320q71J8564L6620K7819
$$ -83849 -62642 -149 781 8690 58204 55880 34386 6940 41260 40389 58953 95573 123392
6337A23392m1244j00311p0112J4725L9804K9245K4411L5751j7504m2579l0067
$$ 123392 82148 -18163 -88275 -73550 -33746 -4501 19910 55661 38157 -4422 -34489
6326c4489k0243M6125J9988J2922K9966j2593k1938p498j2660J5189j1570J2645
$$ -34489 -54732 -8607 11381 24303 54269 41676 19738 12240 -420 14769 3199 15844
6314A5844M5388k9870k9092O482n333l6940n44K9207k7113k7295l9737q665N3213
$$ 15844 61232 31362 2270 8752 3419 -33521 -34065 -4858 -31971 -59266 -99003 -107668 -54455
6301e4455L71J5573j8889m9170R716K9527K9872P092J0936N1851O980o205l2935
$$ -54455 -54084 -38511 -57400 -106570 -96854 -67327 -37455 -30363 -19427 32424 39404 33199 264
6288B64m755k1660j1580m255J779K2024J9149K0395L3549J2012l3002J1431o780
$$ 264 -4491 -26151 -37731 -41986 -40207 -18183 966 21361 54910 66922 33920 45351 38571
6275C8571q619L2031j375l6402N756J8518J4978j9863o1461P8059N1097l1074
$$ 38571 29952 61983 60608 24206 29962 48480 63458 43595 -17866 60193 111290 80216
6263H0216o3753p2734J1094M5552J6405j968K7210O549K8487J0621l6871m7197
$$ 80216 16463 -56271 -45177 375 16780 14812 42022 48571 77058 87679 50808 3611
6251C611n353p080q047K831l631m898L1492J3806l5240K3426J3107j4094r136
$$ 3611 -1742 -8822 -16869 -14038 -17669 -22567 8925 22731 -12509 10917 24024 9930 794
6238G94n824j1486k2940N0604L5249j208p754n8228l7049j9302l995P1335j3667
$$ 794 -5030 -16516 -39456 11148 46397 45189 37435 -20793 -57842 -77144 -81139 -9804 -23471
6225b3471m4479Q648K1314r367m505M1822r73l7223j648N2988N759m0831j9354
$$ -23471 -67950 -59302 -37988 -47355 -51860 -10038 -11011 -48234 -49882 3106 8865 -31966 -51320
6212e1320J4800J8412K2330k5734j6037Q22l2047o3976N640K6212J7186J7877
$$ -51320 -36520 -18108 4222 -21512 -37549 -36727 -68774 -132750 -127110 -100898 -83712 -65835
6200f5835M1310J7513j6193j1864m1690k3202M3404N8878K6316l4721k6862k2401
$$ -65835 -24525 -7012 -23205 -35069 -76759 -99961 -56557 2321 28637 -6084 -32946 -55347
6188e5347j2898L0628M6148L1563j8965m3390k8417p438j3926J42J9434O5207
$$ -55347 -68245 -37617 8531 40094 21129 -22261 -50678 -58116 -72042 -71900 -52466 12741
6176A2741L2379L1383j1519o3792j0426L2551Q485l8944O839j9174J292M7840
$$ 12741 45120 76503 64984 1192 -9234 23317 31802 -7142 -303 -19477 -18185 29655
6164B9655L9277l3411k4914l3486n7670n882K2771M1102N3558J514P848K703N93
$$ 29655 68932 35521 10607 -22879 -80549 -86431 -63660 -22558 31000 32514 40362 43065 43658
6151D3658J9373j6049l9259l6613P829L8249j3600r229m213K3496k935N753m3563
$$ 43658 63031 46982 7723 -28890 -21061 17188 3588 -5641 -9854 13642 10707 16460 -27103
6138b7103j447M1517M2155J1011j3655J9254J4037o473k8873m2026m2487N2615
$$ -27103 -28550 12967 55122 66133 52478 71732 85769 79296 50423 8397 -34090 18525
6126A8525J3407J8482k5055J929L1049j2331m084J0423l7465k4650j4508K5945
$$ 18525 31932 50414 25359 27288 58337 46006 41922 52345 14880 -9770 -24278 1667
6114A667M6211O475l0911l9899j6905M4013N572j5429k7342j0623L847J2476M828
$$ 1667 47878 54353 23442 -16457 -33362 10651 16223 794 -26548 -37171 -33324 -20848 -16020
6101a6020j8284L219M4503O1081k4652k5134N8846M1214j6476q6633o2407k3874
$$ -16020 -34304 -31085 13418 74499 49847 24713 83559 124773 108297 21664 -40743 -64617
6089f4617M3671j2346k8267p815J6794M1897L2193j8410n487k7050J348o938j198
$$ -64617 -20946 -33292 -61559 -69374 -52580 -10683 21510 3100 -2387 -29437 -28089 -35027 -36225
6076c6225o991l0800M5430K7590l3662o015J4729K4634R052k4617j7252l9275
$$ -36225 -43216 -74016 -28586 -996 -34658 -40673 -25944 -1310 7742 -16875 -34127 -73402
6064g3402K4226p232L3217k01m8624l8640J85L8488L7602L9879N1586j673o1019
$$ -73402 -49176 -56408 -23191 -23392 -72016 -110656 -110471 -71983 -34381 5498 57084 55411 -5608
6051e608N605p569k24k4196O49p550n19k3487J8962M60k7815j7018O5568K8653
$$ -5608 -3 -7572 -7796 -31992 -31343 -38893 -39412 -62899 -43937 -43477 -71292 -88310 -22742 5911
6037E911l1317K0978L4805K287p8064K6693M1225k5448J6686l7868j9892L4148
$$ 5911 -25406 -4428 30377 32664 -45400 -18707 22518 -2930 13756 -24112 -44004 -9856
6025i856K2324n4339j9431J6K9958L7381n8459p3484O305M8733k1675K3118O7353
$$ -9856 12468 -41871 -61302 -61286 -31328 6053 -52406 -125890 -119585 -70852 -92527 -69409 -2056
6012b056j7828n370K9179k6011j9509L6969p561m255M09p679R351K3763J855J1785
$$ -2056 -19884 -25254 3925 -22086 -41595 -4626 -12187 -16442 -16033 -23712 -14361 9402 11257 23042
5998B3042j80k2400l3625j2616J8329J9719L4608l829P097k3472j8756J3040J8498
$$ 23042 22862 462 -33163 -45779 -27450 -7731 26877 23048 30145 6673 -12083 957 19455
5985A9455l1147k2920M057M6451o148J7692K1444k922J9656m7352p301L2309N2550
$$ 19455 -11692 -34612 -30555 15896 9748 27440 48884 45962 65618 18266 10965 43274 95824
5972I5824J2460k1824o979o0081l0973k1845l772k1779L8137O2702L1557j0679
$$ 95824 108284 86460 79481 19400 -11573 -33418 -37190 -58969 -20832 41870 73427 62748
5960F2748k6380l5088r734O6596m5697J414j5637R042M9188o1720p8275K1032
$$ 62748 36368 1280 -8454 58142 12445 13859 -1778 7264 56452 -5268 -83543 -62511
5948f2511N7296q804J4811j5549J0428j3161j2338P834J4493L5192k9790k3419
$$ -62511 -5215 -14019 792 -14757 -4329 -17490 -29828 -21994 -7501 27691 -2099 -25518
5936b5518J5069M0027L5703Q445m456m4012k7511j5954l6656O58P20N0632L6903
$$ -25518 -10449 29578 65281 73726 69270 25258 -2253 -18207 -54863 -54205 -53485 -2853 34050
5923C4050J3495n2708M1572j1276l7316j0368J3029J2500l2812l2601M4726J6852
$$ 34050 47545 -5163 36409 25133 -12183 -22551 -9522 2978 -29834 -62435 -17709 -857
5911h57J6103o715r9695l2736L1050O2745N0898M5649J8186m0656k3067k861n108
$$ -857 15246 8531 -91164 -123900 -92850 -30105 20793 66442 84628 43972 20905 18044 12936
5898A2936j5346j0212k9087K2278K9086m1459J535K7257J792k7908j2287j6850
$$ 12936 -2410 -12622 -41709 -19431 9655 -31804 -30269 -3012 -1220 -29128 -41415 -58265
5886e8265J6708J3650J6417n9311l2017N9054M4659M7035M819K5574l7455n2569
$$ -58265 -41557 -27907 -11490 -70801 -102818 -43764 895 47930 52749 78323 40868 -11701
5874a1701l927N226j1559M1955N0905J2869l5885n9080P011J0710K6523J973l6736
$$ -11701 -15628 -10402 -21961 19994 70899 83768 47883 -11197 -4186 6524 33047 35020 -1716
5861a716k1287J873p896q856J3602K1353l0562j3144K0299K5457n0207m4002k4059
$$ -1716 -23003 -21130 -29026 -37882 -24280 -2927 -33489 -46633 -26334 -877 -51084 -95086 -119145
5848a19145r179M1650N5882L5498J1872R037l2338n1667r530M2698J2729R65N0027
$$ -119145 -128324 -86674 -30792 4706 16578 25615 -6723 -58390 -67920 -25222 -12493 -11528 38499
5835C8499L0860J917o3752k0371K0361j0796k8542R429k3974Q807M8729j312l1401
$$ 38499 69359 71276 7524 -12847 7514 -3282 -31824 -22395 -46369 -37562 11167 9855 -21546
5822b1546J5672L7655L706l052n932j6069K551j1804K6032L066k4796o8126l1159
$$ -21546 -5874 31781 35487 32435 26503 10434 12985 1181 27213 30279 5483 -62643 -93802
5809i3802O5565K9006j8420n37j3677K6593j3164j4545K2804J9264m4950l4160
$$ -93802 -28237 769 -17651 -18188 -31865 -5272 -18436 -32981 -10177 9087 -35863 -70023
5797g0023N0351O6689M5932j2606l786p608l5601l8185k0768l3315r678O701O656
$$ -70023 -19672 47017 92949 80343 76557 68949 33348 -4837 -25605 -58920 -68598 -61897 -55241
5784e5241N9588K5827p9095n8917o722j0893M370R1939O0914L2408k2771N629
$$ -55241 4347 30174 -48921 -107838 -114560 -125453 -121083 -29144 31770 64178 41407 47036
5772D7036l3215L355N7703O151n9206k8630P713k9485k6713M0295k4634n732J4110
$$ 47036 13821 17176 74879 81030 21824 -6806 907 -28578 -55291 -14996 -39630 -45362 -31252
5759c1252j3432Q428O148K6210P1315J2655l7798k1209K6884R122J9260K667K118
$$ -31252 -44684 -36256 -30108 -3898 67417 80072 42274 21065 47949 57071 76331 78998 81116
5746H1116K6391l5997l4147K1962J7471k323J230l04l0325n768j0481n6809N0775
$$ 81116 107507 71510 37363 59325 76796 74473 75703 75399 45074 39306 28825 -27984 22791
5733B2791L6831j0774k8685n907K4222M8012k3473n9290m4495j8304J2585O8304
$$ 22791 59622 48848 20163 14256 38478 86490 63017 3727 -40768 -59072 -46487 21817
5721B1817j0787Q677M928o2050k2286L8240j3058n5314j7429J5178O6043K9296
$$ 21817 11030 19707 24635 -37415 -59701 -21461 -34519 -89833 -107262 -92084 -26041 3255
5709C255L6837j0771p4813k9731L7974L1631j3684P906n460K2600L2865J281n2387
$$ 3255 40092 29321 -45492 -75223 -37249 -5618 -19302 -11396 -16856 5744 38609 39890 -12497
5696a2497k3006K1960k3378j0787J5528P0798m185n6699j5825j0695L9763O954
$$ -12497 -35503 -13543 -36921 -47708 -32180 38618 34433 -22266 -38091 -48786 -9023 -2069
5684b069l2867m4564o2412k8037N2543N2683L5961P250j9822m86Q399K4146M4467
$$ -2069 -34936 -79500 -141912 -169949 -117406 -64723 -28762 -21512 -41334 -41820 -33421 -9275 35192
5671C5192P938M804j9773l3722J031L3622j9266k3033O131J2756M0367j0251L5079
$$ 35192 43130 47934 28161 -5561 -4530 29092 9826 -13207 -7076 5680 46047 35796 70875
5658G0875j9136j5704n2719m8372p297K249J3331M4714j7518l2808L891P6937
$$ 70875 51739 36035 -16684 -65056 -72353 -70104 -56773 -12059 -29577 -62385 -58494 18443
5646A8443L0866J2671P507L4974k1960p4249m5337K4615k161l7319N515N0872
$$ 18443 49309 61980 69487 104461 82501 8252 -37085 -12470 -14631 -51950 -46435 4437
5634D437l654l115q878k17Q581J8681r874k1168p537J0296m728k2471n800j0470
$$ 4437 783 -2332 -11210 -11427 -2846 15835 5961 -15207 -22744 -12448 -17176 -39647 -45447 -55917
5620e5917L6111J8544M4774k2124k4169l7234j8394M4367k06N560J9307Q355j4942
$$ -55917 -19806 -1262 43512 21388 -2781 -40015 -58409 -14042 -14248 -8688 10619 18974 4032
5607D032l7281l8756j6550L7594K0341j8749L4500O9905N25m5470m6087J0203
$$ 4032 -33249 -72005 -88555 -50961 -30620 -49369 -14869 55036 55561 10091 -35996 -25793
5595b5793L0364N030r835J770l020J3021m0169j4925J0012k261K4346J9225k2296
$$ -25793 4571 9601 -234 1536 -1484 11537 -28632 -43557 -33545 -35806 -11460 7765 -14531
5582a4531j3963k919k9912k9037P36k9261K0864j136P6393M7971o804k496K3022
$$ -14531 -28494 -31413 -61325 -90362 -89626 -118887 -98023 -99159 -22766 25205 18401 15905 38927
5569C8927J5594m8781j783m7000J4380K2623j0668k53J6304m8260R304J9724r655
$$ 38927 54521 5740 3957 -43043 -28663 -6040 -16708 -16961 -657 -48917 -39613 -19889 -29544
5556b9544L2758K5675L0782k0362m7842k4778k160J5520M7954p719l2840k111
$$ -29544 3214 28889 59671 39309 -8533 -33311 -35471 -19951 28003 20284 -12556 -14667
5544a4667o2374J6923N5654L8482K0993J4882K5683m5816k9447n6185j4426q231
$$ -14667 -77041 -60118 -4464 34018 55011 69893 95576 49760 20313 -35872 -50298 -58529
5532e8529l4647o2661j1920J5712N1830K2722L7502L9810J4885j804J2577J2526
$$ -58529 -93176 -155837 -167757 -152045 -100215 -77493 -39991 -181 14704 12900 25477 38003
5520C8003l1411m4545p872N8066M4600K3500n162r896k7504l564l5536p647J6737
$$ 38003 6592 -37953 -45825 12241 56841 80341 75179 65283 37779 34215 -1321 -8968 7769
5507G769R283m2453P794J6654k9188n7254J3785P9211J8674q308j7824Q345J773
$$ 7769 17052 -25401 -17607 -953 -30141 -87395 -73610 5601 24275 15967 -1857 6488 8261
5494H261l1962j0292L2132Q17q1750j3625M3906J4602P183K273J1711J8337k099
$$ 8261 -23701 -33993 -1861 -1044 -82794 -96419 -52513 -37911 -30728 -28455 -16744 1593 -506
5481e06q306n615l5165n7293K7479K2765J8083N0892L4999M773j0204p321l3629
$$ -506 -8812 -14427 -49592 -106885 -79406 -56641 -38558 12334 47333 52106 41902 34581 952
5468I52m1079k2847J5310Q005K1540r715K0368J290K6104r477j7985k624j6313
$$ 952 -40127 -62974 -47664 -39659 -18119 -27834 -7466 -6176 19928 10451 -7534 -10158 -26471
5455b6471j4177j0376R815L0638J4437J1662J7273r491l1557R60L3394M6100J3827
$$ -26471 -40648 -51024 -41209 -10571 3866 15528 32801 23310 -8247 -7287 26107 72207 86034
5442H6034o6675m5694k0494J8544J674l1647r90N7432p463j8767K4478K805k9298
$$ 86034 19359 -26335 -46829 -28285 -26611 -58258 -59248 -1816 -9279 -28046 -3568 -763 -30061
5429c0061j6077p969J0331j5731O078J9022L5630j8271j9275J3584K2999j986
$$ -30061 -46138 -54107 -43776 -59507 -53429 -34407 1223 -17048 -36323 -22739 260 -1726
5417a726k6275J5100j209N0486J8306k0354m0767K41p15q870J6306o7691l8153
$$ -1726 -28001 -12901 -14110 36376 54682 34328 -6439 -6198 -6913 -15783 523 -67168 -105321
5404a05321K4844L2614M1485L1672J3591j2752j79k5090J994P8881M2124l2450
$$ -105321 -80477 -47863 -6378 25294 38885 26133 25954 864 2858 81739 123863 91413
5392I1413l7170L3059q88L858j0427l6855l9251k0808J7658J6176l548J0498m787
$$ 91413 54243 87302 86414 90272 79845 42990 3739 -17069 589 16765 13217 23715 18928
5379A8928q5299J5689P5940K1672J5081j5898k1473m2531k5873M6760R351l7131
$$ 18928 -66371 -50682 25258 46930 62011 46113 24640 -17891 -43764 2996 12347 -24784
5367b4784R871k7081L529K9856j361K4051L704j8127j4169M4274j2571q1903k3223
$$ -24784 -14913 -41994 -38465 -8609 -9970 14081 17785 -342 -14511 29763 17192 -64711 -87934
5354h7934N7277O8749O0389k8104m8566l3677k0283J4313j4026J3856m1018j7415
$$ -87934 -30657 38092 98481 70377 21811 -11866 -32149 -17836 -31862 -18006 -59024 -76439
5342g6439J7716n742M9221P0135j8509j7562l6707l1861J0033J5829q046k2183
$$ -76439 -58723 -64465 -15244 54891 36382 18820 -17887 -49748 -39715 -23886 -31932 -54115
5330e4115L8889L4754P692l876m9375k3951O130K2807k139k1076J9587R99j3226
$$ -54115 -15226 19528 27220 23344 -26031 -49982 -43852 -21045 -23184 -44260 -24673 -23674 -36900
5317c6900k4529M5027L047K5262J0779k7283J3275L5616J0943j4406q338l4118
$$ -36900 -61429 -16402 -13355 11907 22686 -4597 8678 44294 55237 40831 32493 -1625
5305a625K9256J5771o9903J6136K7515J4426k2102m3838j314L2104O6134J2588
$$ -1625 27631 43402 -26501 -10365 17150 31576 9474 -34364 -35678 -3574 62560 75148
5293G5148l0495j0999o040q604q066J2937L4527j3336n3693j0459k0147m2672
$$ 75148 44653 33654 27614 19010 10944 23881 58408 45072 -8621 -19080 -39227 -81899
5281h1899L6354L8609K5357M344k4485o972J0250k1105P756j9157j4118j5569
$$ -81899 -45545 -6936 18421 22765 -1720 -8692 1558 -19547 -11791 -30948 -45066 -60635
5269f0635o695k102L95K3060M2086L1719j3353J6556k3843n3580j0526J2360J1409
$$ -60635 -67330 -69432 -69037 -45977 -3891 27828 14475 31031 7188 -46392 -56918 -44558 -33149
5256c3149M7663j0854m7301J5874j3371k2092k2215L4931M6290j2758k4969L3871
$$ -33149 14514 3660 -43641 -27767 -41138 -63230 -85445 -50514 -4224 -16982 -41951 -8080
5244h080K4790J1672m2046k8416o046K7384O1512N141l6719P397l1944j1138k8189
$$ -8080 16710 28382 -13664 -42080 -48126 -20742 40770 45911 9192 16589 -15355 -26493 -54682
5231e4682j8169M7291M6249J6071l8776j8139J2724m0561r160L9135O8781K3294
$$ -54682 -72851 -25560 20689 36760 -2016 -20155 -7431 -47992 -57152 -18017 50764 74058
5219G4058j4361K453L2365n4196l0421L855m750o750P875O911n722k8181q198
$$ 74058 59697 62150 94515 40319 9898 13753 9003 2253 10128 17039 11317 -16864 -25062
5206b5062K1839L8438k6273m2759K556k1767j1982J5179N6612K676n4996K0981
$$ -25062 -3223 35215 8942 -33817 -31261 -53028 -65010 -49831 6781 9457 -45539 -24558
5194b4558J0338R76j7770j0961j2243L0848Q258j9123p24k4107n1279K7215O6205
$$ -24558 -14220 -13244 -31014 -41975 -54218 -23370 -15112 -34235 -34959 -59066 -110345 -83130 -16925
5181a6925L8638j8591k2512j5748j4022L0471N4052K6637l1045p6437K1996J1626
$$ -16925 21713 3122 -19390 -35138 -49160 -18689 35363 62000 30955 -45482 -23486 -11860
5169a1860K0871M0480J4127o0424K5989O4404K0222l8291o3603k1443j4242q986
$$ -11860 9011 49491 63618 3194 29183 93587 113809 75518 11915 -9528 -23770 -32756
5157c2756L5169M484J8574k2002l3341K0752J7664K7716K9988p470q626k8299
$$ -32756 2413 6897 25471 3469 -29872 -9120 8544 36260 66248 58778 50152 21853
5145B1853l5353n8655l5829P74j4857L9528M4273O953J75N2006J0400K8810K8935
$$ 21853 -13500 -72155 -107984 -107210 -122067 -82539 -38266 -31313 -31138 20868 31268 60078 89013
5132H9013k9024j4439Q4732k067j9154m9227k6593k0133k1200j8951R753j6382
$$ 89013 59989 45550 130282 128215 109061 59834 33241 13108 -8092 -27043 -17290 -33672
5120c3672J6421j3304j129j5471o601L6567M3056K1886l0565k664l1596j8516
$$ -33672 -17251 -30555 -31684 -47155 -53756 -17189 25867 47753 17188 14524 -17072 -35588
5108c5588L3884N1046M6962m6377n2132O588k678k763j5591N988j2866Q650K9479
$$ -35588 -1704 49342 96304 49927 -2205 4383 1705 -1058 -16649 -10661 -23527 -14877 14602
5095A4602j6138o5363k7792J6705L1886m993K5107L0834j5054j3051M393K6138
$$ 14602 -1536 -66899 -94691 -77986 -46100 -51093 -25986 4848 -10206 -23257 -18864 7274
5083G274K2005L0255J488j3158l0336O081M097j4083m8141J0703p576l2463N2545
$$ 7274 29279 59534 61022 47864 17528 23609 27706 13623 -34518 -23815 -31391 -63854 -11309
5070a1309N2866j7644q5674k3021J0558J3987R624M9094M5551K988j3144J1036
$$ -11309 41557 23913 -61761 -84782 -74224 -60237 -50613 -1519 44032 47020 33876 44912
5058D4912j8581J5265J7955m8176o8176R953J6209q063R583j2848J0041k4350
$$ 44912 26331 41596 59551 11375 -56801 -46848 -30639 -38702 -29119 -41967 -31926 -56276
5046e6276j6883N3473J6028J2436K064K097m0818J8021r493k3889l827O0132j1340
$$ -56276 -73159 -19686 -3658 8778 10842 12939 -27879 -9858 -19351 -43240 -47067 13065 1725
5033A725m8251k1903L9548J6909l2972L0191L8998N4758J5477n3187q9767j1954
$$ 1725 -46526 -68429 -28881 -11972 -44944 -14753 24245 79003 94480 41293 -48474 -60428
5021f0428O3154J0682J5742l3165m0230N7209p992j6493J6023l5413m1165M1225
$$ -60428 2726 13408 29150 -4015 -44245 12964 4972 -11521 4502 -30911 -72076 -30851
5009c0851K7620k0015l6824j8319j2050j5238J7203J4473K6621M8818L3990J2005
$$ -30851 -3231 -23246 -60070 -78389 -90439 -105677 -88474 -74001 -47380 1438 35428 47433
4997D7433p0366l0558j8938k4165K8772l621M304J8716j4732m6226P384N1842
$$ 47433 -22933 -53491 -72429 -96594 -67822 -71443 -67139 -48423 -63155 -109381 -101997 -50155
4985e0155J1110k1103J9573K3433l4166l1521k2522J4608K8252J4371k1330K5334
$$ -50155 -39045 -60148 -40575 -17142 -51308 -82829 -105351 -90743 -62491 -48120 -69450 -44116
4973d4116Q835q576j6377l1072k6921M7180J8215K224L8433l3567J4577J1947
$$ -44116 -35281 -43857 -60234 -91306 -118227 -71047 -52832 -50608 -12175 -45742 -31165 -19218
4961a9218n665j1738k4810m0002k1800N2430M6218J9140l8615q168K0561M9554
$$ -19218 -24883 -36621 -61431 -101433 -123233 -70803 -24585 -5445 -44060 -52228 -31667 17887
4949A7887l0732l6834o947J9546K8344L4804N0003k3594m5470K2313M86K090l085
$$ 17887 -12845 -49679 -56626 -37080 -8736 26068 76071 52477 7007 29320 29806 31896 28811
4936B8811J0759p0328j2076N963K0711Q991m607N5793J746p2639l7598J8541J8256
$$ 28811 39570 -30758 -42834 -36871 -16160 -7169 -11776 44017 45763 -26876 -64474 -45933 -27677
4923b7677L848M027M5621j9808r698l0868m252K2397J2383K496j1830K5651l2962
$$ -27677 -23829 -19802 25819 6011 -3687 -34555 -38807 -16410 -4027 -1531 -13361 12290 -20672
4910b0672J2648P8978k8962l9630p201m4713k0877J6277K4306j754o890j524M867
$$ -20672 -8024 70954 41992 2362 -4839 -49552 -70429 -54152 -29846 -31600 -38490 -40014 -35147
4897c5147L1855J7409P694J400l2231m1253k6187L2176K2278N823k679K1652n7929
$$ -35147 -3292 14117 21811 23211 -9020 -50273 -76460 -44284 -22006 -16183 -18862 2790 -55139
4884e5139O449O2531P858m0156k0598o0065n303K0548M2760L4812K0625r445J602
$$ -55139 -48690 13841 21699 -18457 -39055 -99120 -104423 -83875 -41115 -6303 14322 4877 6479
4871F479l4684J6053J1493l8333J1558j5089k3825N7206K3352O45l3798j2928
$$ 6479 -28205 -12152 -659 -38992 -27434 -42523 -66348 -9142 14210 14855 -18943 -31871
4859c1871P940K3370j2142q968k0956M798J216N6134L652m947l465m890J7456
$$ -31871 -23931 -561 -12703 -21671 -42627 -37829 -36613 19521 23173 18226 14761 9871 27327
4846B7327O062m2332J4853M7108o543k8667J1715j4211M2829q720l8189j36N005
$$ 27327 33389 -8943 5910 53018 46475 17808 29523 15312 58141 49421 11232 11096 16101
4833A6101j1466o635k7302K2939L4720K161m1100j0441j4488o728N263Q582j0957
$$ 16101 4635 -2000 -29302 -6363 28357 30518 -10582 -21023 -35511 -42239 -36976 -28394 -39351
4820c9351j1126N97J1994j096L0951L8874l0163k8243k0130M1917J2800l5461
$$ -39351 -50477 -49880 -37886 -38982 -8031 30843 680 -27563 -47693 -5776 7024 -28437
4808b8437p781L1017k4178m1085J524L4898K8331K6793j3146l4871O576K7936
$$ -28437 -36218 -5201 -29379 -70464 -68940 -34042 -5711 21082 7936 -26935 -20359 7577
4796G577l1243R982m8318j6783k0068l1535K9328K3130m858n6007j0261P802L2829
$$ 7577 -23666 -13684 -62002 -78785 -98853 -130388 -101060 -77930 -82788 -138795 -149056 -141254 -108425
4783a08425P3946M6320J869j9557J1331K4859J319K4239n9317K92L6935N6980
$$ -108425 -34479 11841 13710 -5847 5484 30343 31662 55901 -3416 -3124 33811 90791
4771I0791j5137m9152k308J3703J4607l9604m7594Q650L8621J754l0719l280M3115
$$ 90791 75654 26502 24194 37897 52504 12900 -34694 -26044 12577 14331 -16388 -19668 23447
4758B3447j3440k1105J2749L1313K2720Q162k405M812k0275J8833q4289l2139
$$ 23447 10007 -11098 1651 32964 55684 63846 61441 66253 45978 64811 -19478 -51617
4746e1617K4585J5598K581m1492L1312q642n4954O930M1367M1702M1866R633r317
$$ -51617 -27032 -11434 -8853 -50345 -19033 -27675 -82629 -75699 -34332 7370 49236 58869 49552
4733D9552J7120K3576j7993J9788l4357l4486k7178l4241m8583n2056P1102Q1959
$$ 49552 66672 90248 72255 92043 57686 23200 -3978 -38219 -86802 -138858 -67756 14203
4721A4203M1000k9913L34k702J0921Q911j8354J2426k9851m70L6226j3321k5129
$$ 14203 55203 25290 25624 22922 33843 42754 24400 36826 6975 6505 42731 29410 4281
4708D281l4447k912L566J0529j731n673L5438N082O093M634l757q4109K0091K0805
$$ 4281 -30166 -33078 -29512 -18983 -20714 -26387 9051 14133 20226 24860 21103 -63006 -42915 -22110
4694b2110L359L7847J5478K812K064o5557l9255N6189L8141j317j8661l3466l5800
$$ -22110 -18751 19096 34574 37386 39450 -26107 -65362 -9173 28968 27651 8990 -24476 -60276
4681f0276m805J5414N9836j9850N537k0526j0616K3088k5303k2434L3235L8310
$$ -60276 -65081 -49667 10169 -9681 -4144 -24670 -35286 -12198 -37501 -59935 -26700 11610
4669A1610K7704J8630L2780j9591r588n767k1363k1714j7138L5659k6911m1232
$$ 11610 39314 57944 90724 71133 61545 55778 34415 12701 -4437 31222 4311 -36921
4657c6921k1361j254R87K3108J113J2346K591k8577J1303K5732J1976J1291N522
$$ -36921 -58282 -59536 -58549 -35441 -34328 -21982 -19391 -47968 -36665 -10933 1043 12334 17856
4644A7856r476K520m4021j3056L8699L9455j2035m4943l7767K3195K7365L369
$$ 17856 8380 10900 -33121 -46177 -7478 31977 19942 -25001 -62768 -39573 -12208 -8839
4632h839j8607K458O963k4227n2378j2935k291J6061N2798J5318j6383l2826K0022
$$ -8839 -27446 -24988 -18025 -42252 -94630 -107565 -109856 -93795 -40997 -25679 -42062 -74888 -54866
4619e4866J2706J7964M5098l3940m5448o448m2526K9377L4865K586K6143O5537
$$ -54866 -42160 -24196 20902 -13038 -58486 -64934 -107460 -78083 -43218 -40632 -14489 51048
4607E1048j3962l7479k9864N8190K5240j3840m7433o5488L811L9978N082P282
$$ 51048 37086 -393 -30257 27933 53173 39333 -8100 -73588 -69777 -29799 -24717 -17435
4595a7435L5196j0098m3302J1591J5433k3765l9911P22K6591K1961K0128k2034
$$ -17435 17761 7663 -35639 -24048 -8615 -32380 -72291 -71569 -44978 -23017 -2889 -24923
4583b4923J5811R808J574K3446J7714r089j4818k0279j9593J5302M2639j4683
$$ -24923 -9112 696 2270 25716 43430 34341 19523 -756 -20349 -5047 37592 22909
4571B2909J920M3312o4043J3907L9505J9473j7176l2319k2250l725n3651j3496
$$ 22909 24829 68141 4098 18005 57510 76983 59807 27488 5238 1513 -52138 -65634
4559f5634k638L1042P2902J4886l0381k0564J6972l6150n0522j0851K0898L3751
$$ -65634 -68272 -37230 35672 50558 20177 -387 16585 -19565 -70087 -80938 -60040 -26289
4547b6289K5785O1019n286j2523j7145l4889K46K469K8953L6330k1315n8892l9031
$$ -26289 -504 60515 55229 42706 25561 -9328 -9082 -6613 22340 58670 37355 -21537 -60568
4534f0568O9558L1386k1208r463K0354m609J2308N328k7187P246M157j7872J0180
$$ -60568 8990 40376 19168 9705 30059 25450 37758 43086 15899 23145 27302 9430 19610
4521A9610o824K389l1416l2971l302O91O3200L6595l410n0755J3173l2282l6816
$$ 19610 12786 15175 -16241 -49212 -52514 -51823 11377 47972 44562 -6193 6980 -25302 -62118
4508f2118R610N9855k5441m0823K5268L9676P6J731j8217n0678O363l397P23M134
$$ -62118 -52508 7347 -18094 -58917 -33649 6027 6103 7834 -10383 -61061 -54698 -58095 -57372 -53238
4494e3238k4271Q066K1497M2589J7727K0850j3526M089J2731K6899m5369l6773
$$ -53238 -77509 -69443 -47946 -5357 12370 33220 19694 23783 36514 63413 18044 -18729
4482a8729m6971K4930P717j2049L7165N163j0822J8106m75J3788K1041O699n1905
$$ -18729 -65700 -40770 -33053 -45102 -7937 -2774 -13596 4510 4035 17823 38864 45563 -6342
4469f342L945K4391K8993K8330N938M964k9697o4952l9904K7075R11q234j790
$$ -6342 -2397 21994 50987 79317 85255 90219 60522 -4430 -44334 -17259 -16348 -24582 -26372
4456b6372M49L478M88R460J8970n7964L3224K5386o664j5023J1404o6830q103
$$ -26372 -25923 -22445 -21957 -12497 6473 -51491 -18267 7119 455 -14568 -3164 -69994 -78097
4443g8097N919K8071j0359N997m09J6726r783l3411K1988O0900M400m190J146
$$ -78097 -72178 -44107 -54466 -48469 -48878 -32152 -41935 -75346 -53358 7542 11942 7752 8898
4430H898k1505m1710J2385K2434L3960J919K7843j3195j590k594j1310K279Q340
$$ 8898 -12607 -54317 -41932 -19498 14462 16381 44224 31029 29439 26845 15535 17814 26154
4417B6154l6099L276O6658l3970l5490l3026r529K0238N0281J1596k4243j1658
$$ 26154 -9945 -6669 59989 26019 -9471 -42497 -52026 -31788 18493 30089 5846 -5812
4405e812l512K5879K79k3139n6220M1313L4389L2060k1169j3339J9087o729J4807
$$ -5812 -9324 16555 16834 -6305 -62525 -21212 13177 45237 24068 10729 29816 23087 37894
4392C7894O172m8053p139j1902r663j8937J71j3286k4814q582R648k239K0076
$$ 37894 44066 -3987 -11126 -23028 -32691 -51628 -51457 -64743 -89557 -98139 -88491 -90730 -70654
4379g0654L3386M7656K1289m702J7071J324J4530O1468o9123o7419n781r322L6
$$ -70654 -37268 10388 31677 26975 44046 45370 59900 121368 52245 -15174 -20955 -30277 -30241
4366c0241K6371K7227L1005k6110l7006R298j3386L9123j7130n7449j0069n5307
$$ -30241 -3870 23357 54362 28252 -8754 544 -12842 26281 9151 -48298 -58367 -113674
4354a13674j9262K9101L5653q248O590J7541l8946N7354O1169L0015k6250k9639
$$ -113674 -132936 -103835 -68182 -76430 -69840 -52299 -91245 -33891 27278 57293 31043 1404
4342A404j7147j030R917k1660k6724P288l490M267M5l475j7427L4118M4102l3623
$$ 1404 -15743 -16773 -6856 -28516 -55240 -47952 -51442 -47175 -47130 -50605 -68032 -33914 10188 -23435
4328b3435K8870J7457K1307j9119N882j3751M3698M5690k7859k0341j7213l0786
$$ -23435 5435 22892 44199 25080 30962 17211 60909 106599 78740 58399 41186 10400
4316A0400l364n7467l6139M0621j8025q073Q445J232n8230K5191J3748L4844M3687
$$ 10400 7036 -50431 -86570 -45949 -63974 -72047 -63602 -62370 -120600 -95409 -81661 -46817 -3130
4303c130j4868K2196N561n081l0509k3987k6773l3346J715L8343j427l6951J5854
$$ -3130 -17998 4198 9759 4678 -25831 -49818 -76591 -109937 -108222 -69879 -71306 -108257 -92403
4290i2403K9387p81Q779N6996k6066K0448J2285n4613J5037N1912J8885K3235
$$ -92403 -63016 -63797 -55018 1978 -24088 -3640 8645 -45968 -30931 20981 39866 63101
4278F3101k7159O53j9433m4073J938j5603m575J2269M5988J1230m3181K5316K9471
$$ 63101 35942 36595 17162 -26911 -24973 -40576 -45151 -32882 13106 24336 -18845 6471 35942
4265C5942K0774l5921l369J3127j8866m6327K659P401l1255M4975K507J6153P111
$$ 35942 56716 20795 17426 30553 11687 -34640 -31981 -24580 -55835 -10860 -8353 7800 14911
4252A4911j3188l3794K6002J9141J4232j7358k4111m6698j8233O8658K6724n0016
$$ 14911 1723 -32071 -6069 13072 27304 9946 -14165 -60863 -79096 -10438 16286 -33730
4240c3730n1710j4330R963L3562N1566N758K1965L614m110K563J4722J6449O0643
$$ -33730 -85440 -99770 -89807 -56245 -4679 1079 23044 26658 22548 25111 39833 56282 116925
4227A16925l221k3508m5296r468j5933l2844k9966J3858K124o4765j6772J8072
$$ 116925 113704 90196 44900 35432 19499 -13345 -43311 -29453 -27329 -92094 -108866 -90794
4215i0794L8038L1665p084l3884l9959m3958N3541M9548J6413K4404L4857l180
$$ -90794 -52756 -21091 -28175 -62059 -102018 -145976 -92435 -42887 -26474 -2070 32787 29607
4203B9607j7801k1964k7867K4648N1111r341k7090O662m9798l5686M039L4266
$$ 29607 11806 -10158 -38025 -13377 37734 28393 1303 7965 -41833 -77519 -73480 -39214
4191c9214j7212l1762n4666L5588L3232N8080o584N105K3177O393K6891m586r610
$$ -39214 -56426 -88188 -142854 -107266 -74034 -15954 -22538 -17433 5744 12137 39028 34442 24832
4178B4832k689m3507k8944K4279J3572m4714o7513K5595L753n678K6140N9066
$$ 24832 22143 -21364 -50308 -26029 -12457 -57171 -124684 -99089 -95336 -101014 -74874 -15808
4166a5808j709j2014j7111J8769P4775K3394o5859n9812j1780L5310N6259K2640
$$ -15808 -17517 -29531 -46642 -27873 46902 70296 4437 -55375 -67155 -31845 24414 47054
4154D7054K3059O2885J5730l1020p0470k8752O392J0599j6049P28j8029N365j4784
$$ 47054 70113 132998 148728 117708 47238 18486 24878 35477 19428 20156 2127 7492 -7292
4141g292l0108K2499j9273l1027J2294O9213M860j5536M013l6641j377j585k7451
$$ -7292 -37400 -14901 -34174 -65201 -52907 16306 21166 5630 9643 -26998 -28375 -29960 -57411
4128e7411l2215J2151N4066J3600J0540N844m609J4785P018L5698k9731K204K380
$$ -57411 -89626 -77475 -23409 -9809 731 6575 1966 16751 23769 59467 29736 31940 34320
4115C4320J3440j1545k2982J6600n1246l1783j2807O5857M317J7765K1753j1967
$$ 34320 47760 36215 13233 29833 -21413 -53196 -66003 -146 4171 21936 43689 31722
4103C1722k8230l2743l7140R436J968M3959l567k1785K2815J4075k1955k1373
$$ 31722 3492 -29251 -66391 -56955 -54987 -11028 -14595 -36380 -13565 510 -21445 -42818
4091d2818k9459k682J1406K4509K2549q015l3558K8794M3666m447M130N778M4314
$$ -42818 -72277 -74959 -63553 -39044 -16495 -24510 -58068 -29274 14392 9945 14075 19853 64167
4078F4167j092m6764k8451l9260l3875R858L1405L9984K1310M5441P7153K4370
$$ 64167 63075 16311 -12140 -51400 -85275 -75417 -44012 -4028 17282 62723 139876 164246
4066A64246m3522n7468l6003k6777j5281L4484l6516k8403K147J1678m844K8401
$$ 164246 120724 63256 27253 476 -14805 19679 -16837 -45240 -43093 -31415 -36259 -7858
4054g858K2978m4934m0312J8931N299m316N9217K6952n3386n1013K1398L1637
$$ -7858 15120 -29814 -70126 -51195 -45896 -50212 9005 35957 -17429 -68442 -47044 -15407
4042a5407J8456K4968N735l3761J1715n860k41J4383l2015j601P216O09k5005
$$ -15407 3049 28017 33752 -9 11706 5846 5605 19988 -12027 -13628 -6412 -5803 -30808
4029c0808l6653K7844O818l0417k9772K4336P1026O7080o190p0630j6615N0855
$$ -30808 -67461 -39617 -32799 -63216 -92988 -68652 2374 69454 63264 -7366 -23981 26874
4017B6874M643n1309j3618L7016L5895j498p559l4089k3507l1992L6463J2637
$$ 26874 31517 -19792 -33410 3606 39501 38003 30444 -3645 -27152 -59144 -22681 -10044
4005a0044o171r789j1866J7618j0189j9285N8389m7661o1412K7819P2977R4021
$$ -10044 -16215 -26004 -37870 -20252 -30441 -49726 8663 -38998 -100410 -72591 386 94407
3993I4407p771p6483j1907o1470K1489k0971k9730L1784P3427M6124n7464m9780
$$ 94407 86636 10153 -1754 -63224 -41735 -62706 -92436 -60652 12775 58899 1435 -48345
3981d8345K4635J9114J472L7197l8010J601k056k0806J2291L8115M4419k9857
$$ -48345 -23710 -4596 -3124 34073 -3937 -2336 -4392 -25198 -12907 25208 69627 39770
3969C9770j0619J0993J498L0101k5368j7179k2488K6343l4922L2551M4581k7567
$$ 39770 29151 40144 41642 71743 46375 29196 6708 33051 -1871 30680 75261 47694
3957D7694o0507n3261n2904l1147J6879K1130L8994N6997M8612Q364m7723K5248
$$ 47694 -12813 -66074 -118978 -150125 -133246 -112116 -73122 -16125 32487 40851 -6872 18376
3945A8376j7K8830q808m4506j6967n8713k1382J7911N7171N2075K0897K385l6515
$$ 18376 18359 47189 38381 -6125 -23092 -81805 -103187 -85276 -28105 23970 44867 47252 10737
3932A0737m2627m5339J6394L1656J6777K7089O835l1732J5992m5082k8974K9681
$$ 10737 -31890 -77229 -60835 -29179 -12402 14687 21522 -10210 5782 -39300 -68274 -38593
3920c8593n76o0038m400J9143K4485J5677M538L6255o7767m8473L485J6964L2553
$$ -38593 -39169 -99207 -103607 -84464 -59979 -44302 -39764 -3509 -71276 -119749 -116264 -99300 -66747
3907f6747O2747k0142j1399N0241K6359n1877l1576j3968k9842m7261K4138o365
$$ -66747 -4000 -24142 -35541 14700 41059 -10818 -42394 -56362 -86204 -133465 -109327 -115692
3895a15692J5817L726K5722k6560j2867N7886P722q042o808L6051J9235J7120
$$ -115692 -99875 -96149 -70427 -96987 -109854 -51968 -44246 -52288 -59096 -23045 -3810 13310
3883A3310K2176o178L8837K1820K7161k0920l3769m0862o6119M022M7392R3373
$$ 13310 35486 29308 68145 89965 117126 96206 62437 21575 -44544 -40522 6870 100243
3871A00243k694m8060k8744L04K0596J9515m1832m0060O2234M5310k6967k3768
$$ 100243 97549 49489 20745 21049 41645 61160 19328 -20732 41502 86812 59845 36077
3859C6077r403J9525K0547k6770l4953n6460J2296P698M7177K4998l5606o247
$$ 36077 26674 46199 66746 39976 5023 -51437 -39141 -31443 15734 40732 5126 -1121
3847a121K2248j4995j3316k3426m3620J7587O2004M130O246k8851k1606l348n7057
$$ -1121 21127 6132 -7184 -30610 -74230 -56643 5361 9491 15737 -13114 -34720 -38068 -95125
3834i5125r914L5949L3319J8703p826N5577K6380n1172l7414K3319m567J2682
$$ -95125 -105039 -69090 -35771 -17068 -24894 30683 57063 5891 -31523 -8204 -12771 -89
3822h9O987m437j236K3984N7620L1172j5497l8029k699n934n9528l0063N0505
$$ -89 6898 2461 1225 25209 82829 114001 98504 60475 57776 51842 -7686 -37749 12756
3809A2756K0737r177p563l4931k838L0313n60K5559j5213k3878K6467M458P528
$$ 12756 33493 24316 16753 -18178 -21016 9297 8737 34296 19083 -4795 21672 26130 33658
3796C3658K3115k4030j271j0624j8551j1403K1872L1098J2098Q928k0370j133
$$ 33658 56773 32743 31472 20848 2297 -9106 12766 43864 55962 64890 44520 43387
3784D3387M26m213m6607n9677m2753L3629O1851J8408k5826q304k487M7616m460
$$ 43387 43813 39600 -7007 -66684 -109437 -75808 -13957 4451 -21375 -29679 -32166 15450 10990
3771A0990j6632K4056j6570l9429K8071J1008J2590j0457J5390L0982J7815l726
$$ 10990 -5642 18414 1844 -37585 -9514 1494 14084 3627 19017 49999 67814 64088
3759F4088k9632K2879j9876k4117J2089J323n4855l880j1002j7191p290K2537
$$ 64088 34456 57335 37459 13342 25431 26754 -28101 -31981 -42983 -60174 -67464 -44927
3747d4927L7560J3897k0570l2789k4774j703J3840N3059M6348j8589n534m015
$$ -44927 -7367 6530 -14040 -46829 -71603 -73306 -59466 -6407 39941 21352 15818 11803
3735A1803M140J9459k6713m8687k8206K0030N583K5566J3598L6990j6033o0943
$$ 11803 15943 35402 8689 -39998 -68204 -48174 -42591 -17025 -3427 33563 17530 -43413
3723d3413k5688K9736R668k2143L0460L1193L9187j2813k6968j6987m7293q121
$$ -43413 -69101 -39365 -29697 -51840 -21380 9813 49000 36187 9219 -7768 -55061 -63182
3711f3182L3847M731J1870k1221j8498K5471L3279k6090k9019O3623K8771l617
$$ -63182 -29335 -24604 -12734 -33955 -52453 -26982 6297 -19793 -48812 14811 43582 39965
3699C9965K3593P607n7183Q836M1114M7066n676m4022n8350j0002j9689j1787
$$ 39965 63558 71165 13982 22818 63932 110998 105322 61300 2950 -7052 -26741 -38528
3687c8528L9710K7195k3987j9937K7331R22m451m625o048M0184M1189j4953m7424
$$ -38528 1182 28377 4390 -15547 11784 12706 8255 3630 -2418 37766 78955 64002 16578
3674A6578n4122k6143j0766K8434j3146l168k4524K6012M1126L6163J3612n2812
$$ 16578 -37544 -63687 -74453 -46019 -59165 -62333 -86857 -60845 -19719 16444 30056 -22756
3662b2756l118K3086k1549j79l0549l3811J7578K760N2973J2408l3731J5207q495
$$ -22756 -25874 -2788 -24337 -24516 -55065 -88876 -71298 -68538 -15565 -3157 -36888 -21681 -30176
3649c0176K2271L2059K9882L6189J037j9644k3954j5877m0486L524l6739m809
$$ -30176 -7905 24154 54036 90225 91262 71618 47664 31787 -8699 -5175 -41914 -46723
3637d6723J7504L0271K4677l0615k1023o3630J9227M5449M4067K6860M8657l0059
$$ -46723 -29219 1052 25729 -4886 -25909 -89539 -70312 -24863 19204 46064 94721 64662
3625F4662j0446J5214n3472m2050J1854Q089L6392l5288j9987K7303N4492k8719
$$ 64662 54216 69430 15958 -26092 -14238 -6149 30243 -5045 -25032 2271 56763 28044
3613B8044m6341N833J6168p093J7195k519M4773L4106n0782p2725m2534J3535
$$ 28044 -18297 -12464 3704 -3389 13806 11287 56060 90166 39384 -33341 -75875 -62340
3601f2340L0579L9898L5945M4192k8005k7393k8112r417K9789O7889l5967k5404
$$ -62340 -31761 8137 44082 88274 60269 32876 4764 -4653 25136 93025 57058 31654
3589C1654J9060N905j3258m279J6864Q700Q905q701K0673M177l0538k3832l3623
$$ 31654 50714 56619 43361 39082 55946 64646 73551 64850 85523 89700 59162 35330 1707
3576A707l4494j1197k6062j4942O4209J0317k824j2942R00N804o936L9164j4083
$$ 1707 -32787 -43984 -70046 -84988 -20779 -10462 -13286 -26228 -25328 -19524 -26460 12704 -1379
3563a379p421N0526j5312l5458J2681M2520k1899o15j2610k1362j1078J4273L7408
$$ -1379 -8800 41726 26414 -9044 3637 46157 24258 23643 11033 -10329 -21407 -7134 30274
3550C0274J2721j7197M0327m8592k7652r444p846n131l1007K356j2558j4004K1073
$$ 30274 42995 25798 66125 17533 -10119 -19563 -27409 -32540 -63547 -61191 -73749 -87753 -66680
3537f6680j8004P420M1480K1973K2674L3672J4059l9560j9357J1580N647L1436
$$ -66680 -84684 -77264 -35784 -13811 8863 42535 56594 17034 -2323 9257 14904 46340
3525D6340l276q1060k3507M562L6845M2668K5058R816m5297k2446J5557J3771
$$ 46340 43064 -37996 -61503 -56941 -20096 22572 47630 57446 12149 -10297 5260 19031
3513A9031l386j1075j2052k5678M595M5142k6088l7268r098j3844L0915L1860
$$ 19031 15645 4570 -7482 -33160 -28565 16577 -9511 -46779 -55877 -69721 -38806 -6946
3501f946l588J7108N2530Q417j0183k1247j4651M449j7323J2687k7062k6788j1048
$$ -6946 -10534 6574 59104 67521 57338 36091 21440 25889 8566 21253 -5809 -32597 -43645
3488d3645k3199L9371k0039k1410Q019J7422M4307r607j4736n9094L1370M0636
$$ -43645 -66844 -27473 -47512 -68922 -60903 -43481 826 -8781 -23517 -82611 -51241 -10605
3476a0605k0321j0873j6789K6956N761k789o464k1085o018o185j8043L6519K77
$$ -10605 -30926 -41799 -58588 -31632 -25871 -28660 -35124 -56209 -62227 -68412 -86455 -49936 -49659
3463d9659k3423M5755N983L8579M0718p6906j4240K1838O319J1343l2499n5707
$$ -49659 -73082 -27327 -21344 17235 57953 -18953 -33193 -11355 -5036 6307 -26192 -81899
3451h1899O931J1681K3710L7845n548L566R673j4887J6285l5138m099M6037J8582
$$ -81899 -74968 -63287 -39577 -1732 -7280 -3714 5959 -8928 7357 -27781 -31880 14157 32739
3438C2739n612m2556p685l4863q621k9781o798L4792M5484J3387J6198K2830M16
$$ 32739 27127 -15429 -23114 -57977 -66598 -96379 -103177 -68385 -22901 -9514 6684 29514 29930
3425B9930j2551p4717R839L5630p635J6477K2567N9418M20k8632n8578j8696M8434
$$ 29930 17379 -57338 -47499 -11869 -19504 -3027 19540 78958 79378 50746 -7832 -26528 21906
3412B1906l108j6864r152M685J4044L867R530n663K9823N2977p365l2202k0025
$$ 21906 18798 1934 -7218 -2533 11511 15378 24908 19245 49068 102045 94680 62478 42453
3399D2453p350j0434j961p362l0568P838J1811m4820k9273j0884O2445J0223j3352
$$ 42453 35103 24669 22708 15346 -15222 -7384 4427 -40393 -69666 -80550 -18105 -7882 -21234
3386b1234l935o398K3198n418J9630R919n6897k919j9795l439k9960l5168J8159
$$ -21234 -25169 -31567 -8369 -13787 5843 15762 -41135 -44054 -63849 -67288 -97248 -132416 -114257
3373a14257K6639L1011M0333j3578m2194M913N3647O8538k1609p1041k4498O3021
$$ -114257 -87618 -56607 -16274 -29852 -72046 -67133 -13486 55052 33443 -37598 -62096 925
3361I25J5040J7367k5022P495R372k9132j3661M9226k8631m852L1363r801m1172
$$ 925 15965 33332 8310 15805 25177 -3955 -17616 31610 2979 -1873 29490 19689 -21483
3348b1483j9399j7066J3351p394k4373o423r306j0399j7245J1947P5433K5857
$$ -21483 -40882 -57948 -44597 -51991 -76364 -82787 -92093 -102492 -119737 -107790 -32357 -6500
3336f500l602j6943M7388K2306j0868j3200k2033j3750R669K5867K3288l0814
$$ -6500 -10102 -27045 20343 42649 31781 18581 -3452 -17202 -7533 18334 41622 10808
3324A0808n9465j0870L6241M5759n1381m4995p808J0018K0664O980L5738j4464
$$ 10808 -48657 -59527 -23286 22473 -28908 -73903 -81711 -71693 -51029 -44049 -8311 -22775
3312b2775l2953K0883N5510M621m3853j9790l061P031J897L567L6587L1494J5902
$$ -22775 -55728 -34845 20665 25286 -18567 -38357 -41418 -34387 -32490 -28923 7664 39158 55060
3299E5060j4544O026j3052o51M865j8671k2744K9904J3341k9293K0134M599q684
$$ 55060 40516 46542 33490 32839 37704 19033 -3711 26193 39534 10241 30375 34974 26290
3286B6290l2283n6346o06j740J9184M5734q017M7039N0913m88n6413j625m2449
$$ 26290 -5993 -62339 -62945 -64685 -45501 233 -7784 39255 90168 89680 33267 31642 -10807
3273a0807j6039L2039K4330K8756Q23Q136k4141j7697j0996k9059J7615K0397
$$ -10807 -26846 5193 29523 58279 59102 67238 43097 25400 14404 -14655 2960 23357
3261B3357K6607l2336l6708r543n0904n0681O7621O8217M7661L140j859k9351
$$ 23357 49964 17628 -19080 -28623 -79527 -130208 -62587 5630 53291 56431 54572 25221
3249B5221l663N267K6563j0561l0165j8036o037J2679L690j0016l0967K0417j6124
$$ 25221 21558 26825 53388 42827 12662 -5374 -11411 1268 4958 -5058 -36025 -15608 -31732
3236c1732k0024k4914l6732K7886O5635K9113j6628k5388J2474M8936r458n3323
$$ -31732 -51756 -76670 -113402 -85516 -19881 9232 -7396 -32784 -20310 28626 19168 -34155
3224c4155n0698N7335M6608j4784o6693J7876O8786L965j3046n4829j0895N6153
$$ -34155 -84853 -27518 19090 4306 -62387 -44511 24275 28240 15194 -39635 -50530 5623
3212E623M4569J2360l9779k1312M6107L7256m4709m8952m0671j5876n3821J5047
$$ 5623 50192 62552 22773 1461 47568 84824 40115 -8837 -49508 -65384 -119205 -104158
3200a04158L2278K8231O4981K2062m1696n4555J4395K5264Q841l8238j0387J421
$$ -104158 -71880 -43649 21332 43394 1698 -52857 -38462 -13198 -4357 -42595 -52982 -51561
3188e1561l2501M677p94K8580J8754j0626k6174O4403K2086l7429m574J1259n322
$$ -51561 -84062 -79385 -80179 -51599 -32845 -43471 -69645 -5242 16844 -20585 -25159 -13900 -19222
3175a9222L9893L4796J2444n2064n2948k3946O1009m739M376m9762P659J5634
$$ -19222 20671 55467 67911 15847 -37101 -61047 -38 -4777 -401 -50163 -42504 -26870
3163b6870k88K2258l7855L4165O2120Q50l3675K5297L1056l7139m1505J3192M874
$$ -26870 -27158 -4900 -42755 -8590 53530 54380 20705 46002 77058 39919 -1586 11606 16480
3150A6480l514J4152l762p040j2467J1978m8279J4819l2254N917M6955N450M1102
$$ 16480 12966 27118 23356 16316 3849 15827 -32452 -17633 -49887 -43970 2985 8435 49537
3137D9537j5830m2474l3513m0650j4720J1820R0653K0995l4114p343L3620J3747
$$ 49537 33707 -8767 -42280 -82930 -97650 -85830 4823 25818 -8296 -15639 17981 31728
3125C1728k2437L361J4139j3987l8627N212K7372K313j3999m5064o104k084L8341
$$ 31728 9291 12652 26791 12804 -25823 -20611 6761 9074 -4925 -49989 -56093 -58177 -19836
3112a9836K0438k909J141R839k2768J1707M8786K7589N483m9787r960J7926J079
$$ -19836 602 -2307 -1166 8673 -14095 -2388 46398 73987 79470 29683 19723 37649 38728
3099C8728n6850l7841J7360J9461Q05k3456k2287r255M9588N2043k0855J2944
$$ 38728 -18122 -55963 -38603 -19142 -18337 -41793 -64080 -73335 -23747 28296 7441 20385
3087B0385j8421j5067j0190j7687o078k9280J0105K8463M4162M3516j8113l39
$$ 20385 1964 -13103 -23293 -40980 -47058 -76338 -66233 -37770 6392 49908 31795 31456
3075C1456Q898o717n054k1985l2870k198j3810K7728L401j5434j4058K3726J8276
$$ 31456 40354 33637 28583 6598 -26272 -28470 -42280 -14552 -11151 -26585 -40643 -16917 1359
3062A359R851l0932K048L2428M0671j5769p860p152J27K1533K9999n7914j8155
$$ 1359 11210 -19722 -17674 14754 55425 39656 31796 24644 24771 46304 76303 18389 234
3049B34J4210m8711j4076K6708L569n254L1508J3172k1011l1440N578L8423k81
$$ 234 14444 -34267 -48343 -21635 -18066 -23320 8188 21360 349 -31091 -25513 12910 12629
3036A2629j5066l9848j9523k3897K8953l7948k5448O8402N5085L6044K8144N3179
$$ 12629 -2437 -42285 -61808 -85705 -56752 -94700 -120148 -51746 3339 39383 67527 120706
3024A20706o33o2886k9786k5281K0064J9298n9758o0977q267J9391M3779M1185
$$ 120706 120073 57187 27401 2120 22184 41482 -18276 -79253 -87520 -68129 -24350 16835
3012A6835l858j9410m408J2039l6483m5127j1731o911N7403L5526J8536j054K5494
$$ 16835 12977 -6433 -10841 1198 -35285 -80412 -92143 -99054 -41651 -6125 12411 11357 36851
2999C6851j7048m7027L039k4019K3612P645O3177m406l146r05k4038k1843J0613
$$ 36851 19803 -27224 -24185 -48204 -24592 -16947 46230 41824 38678 37773 13735 -8108 2505
2986B505K0556l1994K4567P275P106M0053p089l0487j6621O27m4036N877k3882
$$ 2505 23061 -8933 15634 22909 30015 70068 62979 32492 15871 16498 -27538 -21661 -45543
2973d5543j3015j1692l0094L7456L9776R860L2551o667l39k5345m5052K6660K9276
$$ -45543 -58558 -70250 -100344 -62888 -23112 -13252 19299 12632 12293 -13052 -58104 -31444 -2168
2960b168M3615L6520l2414j1015k1946j9617k1040j1098K4498l6126J9820L9933
$$ -2168 41447 77967 45553 34538 12592 -7025 -28065 -39163 -14665 -50791 -30971 8962
2948H962J0533k5941m9173j3004K9585J276L618j7912K8490L304M0116k2598J9815
$$ 8962 19495 -6446 -55619 -68623 -39038 -37762 -34144 -52056 -23566 -20262 19854 -2744 17071
2935A7071N7281j5278l6012M1792m2632j2303M1566L704n0465m3400K1220K0668
$$ 17071 74352 59074 23062 64854 22222 9919 51485 55189 4724 -38676 -17456 3212
2923C212M0084j5236k0058n695n409O2882J4693r453p744k5309m0670l8276J7588
$$ 3212 43296 28060 8002 2307 -3102 59780 74473 65020 57276 31967 -8703 -46979 -29391
2910b9391L6490L3903J3135k2737m3132k2933L1906J5148k246j9602M271p078
$$ -29391 7099 41002 54137 31400 -11732 -34665 -2759 12389 10143 -9459 -5188 -12266
2898a2266m7328j9759J0991K6358K8057J2390q0888J8683M1712P784n5548m713
$$ -12266 -59594 -79353 -68362 -42004 -13947 -1557 -82445 -63762 -22050 -14266 -69814 -74527
2886g4527O9814R2568P592j8645k6792m7449l5195j3982J4101P9844M5341m3537
$$ -74527 -4713 87855 95447 76802 50010 2561 -32634 -46616 -32515 47329 92670 49133
2874D9133m4061k5850N9L705j9119J3639j6760K9480j0229j2564l4399M3808J5888
$$ 49133 5072 -20778 -20719 -17014 -36133 -22494 -39254 -9774 -20003 -32567 -66966 -23158 -7270
2861g270o505K2385k6738J8449k545l760n7184J027L612K4750K5039K1661n650
$$ -7270 -13775 8610 -18128 321 -2224 -5984 -63168 -62141 -58529 -33779 -8740 12921 7271
2848G271j2972R345j89M607k547l9524M405k5247l582l8917J3672P0822K1276
$$ 7271 -5701 3644 3455 8062 5515 -34009 -29604 -54851 -58433 -97350 -83678 -12856 8420
2835H420j5017j4192k5209K266J8708L9287j3886L26N1138J9340k992l1318j2216
$$ 8420 -6597 -20789 -45998 -43732 -25024 14263 377 703 51841 71181 68189 36871 24655
2822B4655M456J1341l1313l8411j1301L2872K3136j4204k9368j0396R104J748
$$ 24655 29111 40452 9139 -29272 -40573 -7701 15435 1231 -28137 -38533 -29429 -27681
2810b7681N0160L0363j5059o5963k5095M5419K0217k6339J4342M236o4523k5446
$$ -27681 22479 52842 37783 -28180 -53275 -7856 12361 -13978 364 4600 -59923 -85369
2798h5369L4583M3642K9068P370j3293j0330m3832K1688J607k6634j0821L7185
$$ -85369 -50786 -7144 21924 29294 16001 5671 -38161 -16473 -14866 -41500 -52321 -15136
2786a5136L4501j7151Q010K1260M8176K0101m3226j2797p6507m1944J8673K7699
$$ -15136 19365 2214 10224 31484 79660 99761 56535 43738 -32769 -74713 -56040 -28341
2774b8341N6454K8802j866R477m894N40K0481p8294j6851J3228m7257m6954J7729
$$ -28341 28113 56915 55049 64526 59632 60172 80653 2359 -14492 -1264 -48521 -95475 -77746
2761g7746M6708n575j5306k949k2816m60J7188K5816R833K0880j2003k5878j5228
$$ -77746 -31038 -36613 -51919 -54868 -77684 -78144 -60956 -35140 -25307 -4427 -16430 -42308 -57536
2748e7536L4575O713j5401K2178M3165J1469O518K7159l281m9789n8904k271J7508
$$ -57536 -22961 -16248 -31649 -9471 33694 45163 51681 78840 75559 25770 -33134 -35405 -17897
2735a7897j4465M033O619o923J9444M2557M3050L676k6107j1436k1799K277k1623
$$ -17897 -32362 -28329 -21710 -28633 -9189 33368 76418 80094 53987 42551 20752 23029 1406
2722A406m513j4151q399J2710m220L8428K2065L9547J7136m7249l1260q293M1387
$$ 1406 -3107 -17258 -25657 -12947 -17167 21261 43326 82873 100009 52760 21500 13207 54594
2709E4594R473r945Q604N96R405j8068j9252m8695L0835K9913L9348j7590p5105
$$ 54594 64067 54122 62726 63322 72727 54659 35407 -13288 17547 47460 86808 69218 -5887
2696e887j1501L0474k0670j0468J7053k5605j7748k0177K2947M8612J3272k2122
$$ -5887 -17388 13086 -7584 -18052 -999 -26604 -44352 -64529 -41582 7030 20302 -1820
$$ [...]
##END NTUPLES=NMR SPECTRUM
##END=
