##TITLE=Analysis number 329740
Compound Code cc 67805
Book Reference 521/113
Project Code adrs
Chemist Name evam
##JCAMPDX= 6.0         $$ Bruker NMR JCAMP-DX V2.0
##DATA TYPE= NMR SPECTRUM
##DATA CLASS= NTUPLES
##ORIGIN= Bruker BioSpin GmbH
##OWNER= nmr
$$ XWIN-NMR		Version 3.5
$$ Wed Sep 26 09:46:44 2007 GMT Daylight Time (UT+1h)  MAYBRIDGE\nmr@NMR_250MHZ
##.OBSERVE FREQUENCY= 250.131544655141
##.OBSERVE NUCLEUS= ^1H
##.ACQUISITION MODE= SIMULTANEOUS (DQD)
##.ACQUISITION SCHEME= undefined
##.AVERAGES= 16
##.DIGITISER RES= 18
##SPECTROMETER/DATA SYSTEM= dpx250
##.PULSE SEQUENCE= zg30
##.SOLVENT NAME= CDCl3
##.SHIFT REFERENCE= (INTERNAL, CDCl3, 0, 16.4451)
##AUDIT TRAIL= $$ (NUMBER, WHEN, WHO, WHERE, WHAT)
$$ ##TITLE= Audit trail, XWIN-NMR		Version 3.5
$$ ##JCAMPDX= 5.01
$$ ##ORIGIN= Bruker BioSpin GmbH
$$ ##OWNER= nmr
$$ C:\u/data/dgb/nmr/ADRS/2340/pdata/1/auditp.txt
$$ ##AUDIT TRAIL=  $$ (NUMBER, WHEN, WHO, WHERE, WHAT)
(   1,<2007-09-26 09:46:16.21 +100>,<MAYBRIDGE\nmr>,<NMR_250MHZ>,
      <created by zg, POWCHK disabled, PULCHK disabled
       configuration hash MD5:
       76 6E 9A 78 1E 09 19 81 EC 84 63 8F B0 6A 59 2D
       data hash MD5: 64K
       4B 82 9C 5D 55 C3 C5 54 B5 5A 5E A9 FA 9E EF F6>)
(   2,<2007-09-26 09:46:31.35 +100>,<MAYBRIDGE\nmr>,<NMR_250MHZ>,
      <Start of raw data processing
       ef LB = 0.3 FT_mod = 6 PKNL = 1 SI = 32K 
       data hash MD5: 32K
       72 83 90 58 BC F1 57 26 20 53 74 99 2F 4B 2F AD>)
(   3,<2007-09-26 09:46:33.29 +100>,<MAYBRIDGE\nmr>,<NMR_250MHZ>,
      <apk 
       data hash MD5: 32K
       FB 91 52 CF E5 B4 48 66 E1 4F B1 29 6A 5D B8 C4>)
(   4,<2007-09-26 09:46:34.18 +100>,<MAYBRIDGE\nmr>,<NMR_250MHZ>,
      <abs ABSG = 5 
       data hash MD5: 32K
       F8 3B 49 DE BD A1 6C 55 8F B7 FC C5 DC 4B 14 44>)
$$ ##END=
$$ 
$$ hash MD5
$$ 09 2F 37 7B DB AB 4B A6 13 24 C3 2D 87 02 B5 BD
##$RELAX= 
##$RELAX= 
##$RELAX= 
##$RELAX= 
##$RELAX= 
##$RELAX= 
##$RELAX= 
$$ Bruker specific parameters
$$ --------------------------
##$DU= <C:\u>
##$EXPNO= 2340
##$NAME= <ADRS>
##$PROCNO= 1
##$TYPE= <nmr>
##$USER= <dgb>
##$AMP= (0..31)
100 100 100 100 100 100 100 100 100 100 100 100 100 100 100 100 100 100 
100 100 100 100 100 100 100 100 100 100 100 100 100 100 
##$AQSEQ= 0
##$AQ_mod= 3
##$AUNM= <au_zg>
##$AUTOPOS= <36 >
##$BF1= 250.13
##$BF2= 250.13
##$BF3= 250.13
##$BF4= 250.13
##$BF5= 500.13
##$BF6= 500.13
##$BF7= 500.13
##$BF8= 500.13
##$BYTORDA= 1
##$CFDGTYP= 0
##$CFRGTYP= 5
##$CHEMSTR= <none>
##$CNST= (0..31)
1 1 145 1 1 1 1 1 1 1 1 1 1 1 1 1 1 1 1 1 1 1 1 1 1 1 1 1 1 1 1 1 
##$CPDPRG= <>
##$CPDPRG1= <>
##$CPDPRG2= <>
##$CPDPRG3= <>
##$CPDPRG4= <mlev>
##$CPDPRG5= <mlev>
##$CPDPRG6= <mlev>
##$CPDPRG7= <mlev>
##$CPDPRG8= <mlev>
##$CPDPRGB= <>
##$CPDPRGT= <>
##$D= (0..31)
0 1 0 0 0 0 0 0 0 0.06 0 0 0 0 0 0 0.0002 0 0 0 0 0 0 0 0 0 0 0 0 0 0 
0 
##$DATE= 1190796375
##$DBL= (0..7)
120 120 120 120 120 120 120 120 
##$DBP= (0..7)
150 150 150 150 150 150 150 150 
##$DBP07= 0
##$DBPNAM0= <>
##$DBPNAM1= <>
$$ [...]
##$SUBNAM7= <"">
##$SUBNAM8= <"">
##$SUBNAM9= <"">
##$SW= 20.6930455092707
##$SWIBOX= (0..15)
0 0 3 0 0 0 0 0 0 0 0 0 0 0 0 0 
##$SW_h= 5175.983436853
##$TD= 65536
##$TD0= 1
##$TE= 296.16
##$TE2= 300
##$TE3= 300
##$TEG= 300
##$TL= (0..7)
0 120 120 120 120 120 120 120 
##$TP= (0..7)
150 150 150 150 150 150 150 150 
##$TP07= 0
##$TPNAME0= <>
##$TPNAME1= <>
##$TPNAME2= <>
##$TPNAME3= <>
##$TPNAME4= <>
##$TPNAME5= <>
##$TPNAME6= <>
##$TPNAME7= <>
##$TPOAL= (0..7)
0.5 0.5 0.5 0.5 0.5 0.5 0.5 0.5 
##$TPOFFS= (0..7)
0 0 0 0 0 0 0 0 
##$TUNHIN= 0
##$TUNHOUT= 0
##$TUNXOUT= 0
##$USERA1= <user>
##$USERA2= <user>
##$USERA3= <user>
##$USERA4= <user>
##$USERA5= <user>
##$V9= 5
##$VALIST= <valist>
##$VCLIST= <CCCCCCCCCCCCCCC>
##$VD= 0
##$VDLIST= <DDDDDDDDDDDDDDD>
##$VPLIST= <PPPPPPPPPPPPPPP>
##$VTLIST= <TTTTTTTTTTTTTTT>
##$WBST= 1024
##$WBSW= 4
##$XGAIN= (0..3)
0 0 0 0 
##$XL= 0
##$YL= 0
##$YMAX_a= 453906
##$YMIN_a= -532870
##$ZGOPTNS= <>
##$ZL1= 120
##$ZL2= 120
##$ZL3= 120
##$ZL4= 120
##$ABSF1= 16.4451
##$ABSF2= -4.248072
##$ABSG= 5
##$ABSL= 3
##$ALPHA= 0
##$AQORDER= 0
##$ASSFAC= 0
##$ASSFACI= 0
##$ASSFACX= 0
##$ASSWID= 0
##$AUNMP= <proc_1d>
##$AZFE= 0.1
##$AZFW= 0.1
##$BCFW= 0
##$BC_mod= 0
##$BYTORDP= 0
##$COROFFS= 0
##$CY= 12.5
##$DATMOD= 1
##$DC= 0
##$DFILT= <>
##$DTYPP= 0
##$F1P= 14.0000005364418
##$F2P= -0.99999901652339
##$FCOR= 0.5
##$FTSIZE= 32768
##$FT_mod= 6
##$GAMMA= 0
##$GB= 0
##$INTBC= 1
##$INTSCL= 1
##$ISEN= 128
##$LB= 0.3
##$LEV0= 0
##$LPBIN= 0
##$MAXI= 10000
##$MC2= 0
##$MEAN= 0
##$ME_mod= 0
##$MI= 0
##$NCOEF= 0
##$NC_proc= -3
##$NLEV= 6
##$NOISF1= 0
##$NOISF2= 0
##$NSP= 0
##$NTH_PI= 0
##$NZP= 0
##$OFFSET= 16.4451
##$PC= 1
##$PHC0= 160.5561
##$PHC1= 7.55706
##$PH_mod= 1
##$PKNL= yes
##$PPARMOD= 0
##$PSCAL= 4
##$PSIGN= 0
##$REVERSE= no
##$SF= 250.130019233645
##$SI= 32768
##$SIGF1= 0
##$SIGF2= 0
##$SINO= 400
##$SIOLD= 32768
##$SREGLST= <1H.CDCl3>
##$SSB= 0
##$STSI= 32768
##$STSR= 0
##$SW_p= 5175.98343685301
##$SYMM= 0
##$S_DEV= 0
##$TDeff= 65536
##$TDoff= 0
##$TI= <Analysis number 999999
Compound Code 99
Book Reference 9
Project Code 9>
##$TILT= no
##$TM1= 0
##$TM2= 0
##$TOPLEV= 0
##$USERP1= <user>
##$USERP2= <user>
##$USERP3= <user>
##$USERP4= <user>
##$USERP5= <user>
##$WDW= 1
##$XDIM= 32768
##$YMAX_p= 474784344
##$YMIN_p= -162214
$$ End of Bruker specific parameters
$$ ---------------------------------
##NTUPLES= NMR SPECTRUM
##VAR_NAME=  FREQUENCY,     SPECTRUM/REAL,   SPECTRUM/IMAG
##SYMBOL=    X,             R,               I
##VAR_TYPE=  INDEPENDENT,   DEPENDENT,       DEPENDENT
##VAR_FORM=  AFFN,          ASDF,            ASDF
##VAR_DIM=   32768,         32768,           32768
##UNITS=     HZ,            ARBITRARY UNITS, ARBITRARY UNITS
##FACTOR=    0.157963299565203, 1,           1
##FIRST=     4113.41337547663, 0,            0
##LAST=      -1062.57006137638, 0,           0
##MIN=       -1062.57006137638, -162214,     0
##MAX=       4113.41337547663, 474784344,    0
$$ Real data points
##PAGE= N=1
##DATA TABLE= (X++(R..R)), XYDATA
$$ [...]
$$ plain form
19343 39216114 49244711 52373216 49613444 44374587 39505747 37830989 40303278 47508622
19335 47508622 61082860 82870181 108625970 127988865 147845835 169738740 169620343
19328 169620343 145765832 115099148 82652616 57864608 42937067 34545418 29974872
19321 29974872 27897046 28033567 30216838 32115186 30076673 25694395 20505474 15635582
19313 15635582 12144164 9853620 8309755 7161084 6366616 5825040 5375647 4961942 4695499
19304 4695499 4489001 4197528 3910950 3673479 3457778 3171238 2851204 2609165 2408281
19295 2408281 2266902 2211909 2250004 2317860 2384246 2441090 2453645 2541221 2652479 2660284 2537184
19284 2537184 2397184 2265969 2111255 2006704 2015097 1952785 1800782 1623592 1468476 1325082
$$ packed form
19343C9216114J0028597L128505k759772n238857m868840j674758K472289P205344
19335D7508622J3574238K1787321K5755789J9362895J9856970K1892905j18397
19328A69620343k3854511l0666684l2446532k4788008j4927541q391649m570546
19321B9974872k077826J36521K183271J898348k038513m382278n188921m869892
19313A5635582l491418k290544j543865j148671p94468n41576m49393m13705k66443
19304D695499k06498k91473k86578k37471k15701k86540l20034k42039k00884
19295B408281j41379n4993L8095O7856O6386N6844J2555Q7576J11258P805j23100
19284B537184j40000j31215j54714j04551Q393o2312j52003j77190j55116j43394
$$ plain form
19274 1325082 1243591 1186614 1141965 1127546 1127863 1138056 1125678 1060718 972570 855152 758326
19263 758326 672505 611723 593757 510281 491810 487694 524943 541629 518295 498036 489438 459343
19251 459343 489849 506329 527969 603198 626968 633806 619142 581605 534812 529960 459916 449144
19239 449144 480449 458176 441687 404554 347027 384638 400992 377406 337731 324095 305817
19228 305817 268020 234133 255210 249329 225018 231345 243114 298791 297484 277094 277176 264289 281318
19215 281318 290882 329409 389202 390175 421881 343171 296088 272881 230862 231754 270003 298844
19203 298844 270156 232120 225916 207710 186538 181262 209391 214910 176142 185754 213459 193952
19191 193952 176018 175270 150149 143299 174133 159414 127209 115179 108876 148933 169183 192980
$$ packed form
19274A325082q1491n6977m4649j4419L17J0193j2378o4960q8148j17418r6826
19263G58326q5821o0782j7966q3476j8471m116L7249J6686k3334k0259q598l0095
19251D59343L0506J6480K1640P5229K3770O838j4664l7537m6793m852p0044j0772
19239D49144L1305k2273j6489l7133n7527L7611J6354k3586l9675j3636j8278
19228C05817l7797l3887K1077n881k4311O327J1769N5677j307k0390Q2j2887J7029
19215B81318R564L8527N9793R73L1706p8710m7083k3207m2019Q92L8249K8841
19203B98844k8688l8036o204j8206k1172n276K8129N519l8768R612K7705j9507
19191A93952j7934p48k5121o850L0834j4719l2205j2030o303M0057K0250K3797
$$ plain form
19179 192980 208047 216175 225768 196798 188097 206803 211891 228292 244764 279965 268287 222750
19167 222750 208851 258667 255779 272968 312776 368064 366933 320601 310889 353815 385143 409918
19155 409918 414426 407168 355475 346153 349472 350428 346150 349368 367412 398486 391364 393560 377851
19142 377851 342980 349073 376135 379289 326024 323380 320326 280610 259299 261726 267013 219072 184056
19129 184056 215499 234953 228926 182884 155587 181840 174541 152279 127580 148621 164421 218004
19117 218004 241266 261320 292590 307324 285499 283603 302743 337323 367680 402554 457009 463204
19105 463204 460190 499179 567848 613616 568822 534232 490986 425734 404167 471213 526756 535562
19093 535562 582621 578491 595621 624084 585338 510845 467081 478974 553948 567817 499614 476599
$$ packed form
19179A92980J5067Q128R593k8970q701J8706N088J6401J6472L5201j1678m5537
19167B22750j3899M9816k888J7189L9808N5288j131m6332r712M2926L1328K4775
19155D09918M508p258n1693r322L319R56m278L218J8044L1074p122K196j5709
19142C77851l4871O093K7062L154n3265k644l054l9716k1311K427N287m7941l5016
19129A84056L1443J9454o027m6042k7297K6253p299k2262k4699K1041J5800N3583
19117B18004K3262K0054L1270J4734k1825j896J9140L4580L0357L4874N4455O195
19105D63204l014L8989O8669M5768m4794l4590m3246o5252k1567O7046N5543Q806
19093E35562M7059m130J7130K8463l8746p4493m3764J1893P4974J3869o8203k3015
$$ plain form
19081 476599 499651 521366 548480 544508 585344 573825 565610 546941 567858 607121 616200 630933
19069 630933 631264 632090 643141 669733 698166 731901 747306 757766 759370 791962 817767 858186
19057 858186 897476 962877 1016543 1059434 1103087 1142641 1203186 1264712 1343223 1431567 1590689
19046 1590689 1766307 1959820 2230853 2497850 2730465 3036921 3301028 3585926 3860946
19037 3860946 4058926 4217221 4498717 4861674 5335132 6040093 7019359 8421270 10496392
19028 10496392 13656602 18322687 23976115 27215883 27059963 25719087 24412666 24935935
19020 24935935 28013111 33711124 42785423 57365677 81641527 119370860 155570788
19013 155570788 164585606 160696547 150095077 127394730 101372707 78755431 59421650
$$ packed form
19081D76599K3052K1715K7114l972M0836j1519q215j8669K0917L9263R079J4733
19069F30933L31Q26J1051K6592K8433L3735J5405J0460J604L2592K5805M0419
19057H58186L9290O5401N3666M2891M3653L9554O0545O1526P8511Q8344J59122
19046A590689J75618J93513K71033K66997K32615L06456K64107K84898K75020
19037C860946J97980J58295K81496L62957M73458P04961R79266J401911K075122
19028A0496392L160210M666085N653428L239768j55920j340876j306421N23269
19020B4935935L077176N698013R074299J4580254K4275850L7729333L6199928
19013A55570788R014818l889059j0601470k2700347k6022023k2617276j9333781
$$ plain form
19006 59421650 46522942 39863808 37927849 40013922 45972108 52913583 53779001 47897237
18998 47897237 39204959 29809684 22338350 17375377 14168401 12069529 10753936 9910772
18990 9910772 9236019 8724034 8375744 8103345 7877597 7689969 7510630 7428859 7531363 7667415
18980 7667415 7855542 8309546 9135555 10478393 12416525 15271791 19750545 26773490 36260706
18971 36260706 43550621 44199654 41257091 36878409 33827228 34312114 39310353 50109545
18963 50109545 67375390 83886820 93183120 104853198 121328093 125990684 110128559
18956 110128559 88516183 63720943 43805388 31730516 24901719 20955947 18854349
18949 18854349 18088915 18658536 20259441 20793919 18916537 16015016 12644468 9702821
$$ packed form
19006E9421650j2898708o659134j935959K086073N958186O941475Q65418n881764
18998D7897237q692278r395275p471334m962973l206976k098872j315593q43164
18990I910772o74753n11985l48290k72399k25748j87628j79339q1771J02504J36052
18980G667415J88127M54004Q26009J342838J938132K855266M478754P022945R487216
18971C6260706P289915O49033k942563m378682l051181M84886M998239J0799192
18963E0109545J7265845J6511430R296300J1670078J6474895M662591j5862125
18956A10128559k1612376k4795240j9915555j2074872o828797l945772k101598
18949A8854349p65434N69621J600905N34478j877382k901521l370548k941647
$$ plain form
18941 9702821 7724694 6538566 5770065 5115453 4567657 4200072 3883788 3501214 3155100
18932 3155100 2768776 2414294 2138904 1941298 1772279 1605102 1467709 1342714 1243061 1221655
18922 1221655 1147502 1050518 993771 918963 873011 840047 853556 898906 922157 910724 949136
18911 949136 994944 994564 954537 923995 899131 879912 908368 1014962 1208826 1503477 1786369
18900 1786369 1934943 2037722 2209934 2267408 2091439 1816981 1482187 1238277 1041807 890203
18890 890203 800604 789369 807427 826475 817496 734058 683240 594884 528593 464620 444249 418726
18878 418726 462154 457913 485030 525603 554109 634527 704915 765500 834526 890696 903317 880211
18866 880211 857578 855882 995224 1208494 1368030 1424460 1397860 1405708 1377278 1315677 1177122
$$ packed form
18941I702821j978127j186128p68501o54612n47796l67585l16284l82574l46114
18932C155100l86324l54482k75390j97606j69019j67177j37393j24995r9653k1406
18922A221655p4153r6984n6747p4808m5952l2964J3509M5350K3251j1433L8412
18911I49136M5808l80m0027l0542k4864j9219K8456J06594J93864K94651K82892
18900A786369J48574J02779J72212N7474j75969k74458l34794k43910j96470j51604
18890H90203q9599j1235J8058J9048q979q3438n0818q8356o6291o3973k0371k5523
18878D18726M3428m241K7117M0573K8506Q0418P0388O0585O9026N6170J2621k3106
18866H80211k2633j696J39342K13270J59536N6430k6600P848k8430o1601j38555
$$ plain form
18855 1177122 1014740 846403 785582 765901 761048 885711 965107 971409 1006410 1096861 1113072
18844 1113072 1019530 863401 672651 509118 410920 366026 378221 347033 308958 289579 307114
18833 307114 343102 382694 372173 407203 482023 497769 551937 558602 516966 523730 553759 518093
18821 518093 477396 429669 375995 344617 327466 326554 346540 394447 452304 507088 539841 538913
18809 538913 494469 451201 401398 349899 315933 299297 332899 376283 401130 433997 409016
18798 409016 346572 294976 282839 276334 260289 241364 222849 217380 209993 184878 168697 163154
18786 163154 214526 251159 255900 225367 202956 222864 184435 133683 165727 259128 311285 330026
18774 330026 310871 304763 374402 361709 372888 416693 495832 516663 426779 377377 309024 192542
$$ packed form
18855A177122j62382j68337o0821j9681m853J24663P9396O302L5001R0451J6211
18844A113072r3542j56129j90750j63533r8198m4894J2195l1188l8075j9379J7535
18833C07114L5988L9592j0521L5030P4820J5746N4168O665m1636O764L0029l5666
18821E18093m0697m7727n3674l1378j7151r12J9986M7907N7857N4784L2753r28
18809E38913m4444m3268m9803n1499l3966j6636L3602M3384K4847L2867k4981
18798D09016o2444n1596j2137o505j6045j8925j8515n469p387k5115j6181n543
18786A63154N1372L6633M741l0533k2411J9908l8429n0752L2044R3401N2157J8741
18774C30026j9155o108O9639j2693J1179M3805P9139K0831q9884m9402o8353j16482
$$ plain form
18762 192542 132395 123974 131939 121774 121659 174171 181601 134186 74493 108057 127391 88141
18750 88141 92050 93583 129010 104107 116319 157551 148311 147641 171576 192217 177141 136677 112573
18737 112573 129057 127652 134711 144930 146334 126963 89313 100824 144008 162626 198821 183281
18725 183281 174375 149936 100290 87473 112258 141520 101426 88542 85862 55276 46730 68553
18713 68553 702 -58222 -46006 3441 55736 16010 37558 115327 172781 200539 182575 190178
18701 190178 184414 161995 128243 121747 97300 119195 117637 76942 74513 95076 110681 103789
18689 103789 139251 122352 95174 139914 202305 217790 186556 192213 224108 228144 225926 245469
18677 245469 252615 301268 300482 286798 304324 378370 418247 424934 420708 406700 348581 309239
$$ packed form
18762A92542o0147q421P965j0165j15N2512P430m7415n9693L3564J9334l9250
18750H8141L909J533L5427k4903J2212M1232r240o70K3935K0641j5076m0464k4104
18737A12573J6484j405P059J0219J404j9371l7650J1511M3184J8618L6195j5540
18725A83281q906k4439m9646j2817K4785K9262m0094j2884k680l0586q546K1823
18713F8553o7851n8924J2216M9447N2295l9726K1548P7769N7454K7758j7964P603
18701A90178n764k2419l3752o496k4447K1895j558m0695k429K0563J5605o892
18689A03789L5462j6899k7178M4740O2391J5485l1234N657L1895M036k218J9543
18677B45469P146M8653p86j3684J7526P4046L9877O687m226j4008n8119l9342
$$ plain form
18665 309239 296649 268069 240245 265699 258110 244794 230288 266873 234121 176529 168916 176053
18653 176053 225156 248548 262617 236820 256082 261766 265930 232069 141928 83184 92255 88827
18641 88827 83783 92345 98220 71543 88803 101450 77723 112659 136130 174978 186808 189652
18629 189652 168238 166663 181466 199410 174177 151549 143453 147575 150310 150768 191479 206164 235847
18616 235847 304851 364568 362393 314489 243861 205573 207249 222760 196670 139056 119551 126083
18604 126083 129572 151178 123304 103935 59484 57997 87358 47354 30346 42623 -19562 2751
18592 2751 19211 5874 13486 30786 36721 31354 15988 23869 47782 42035 23803 10813 54696
18579 54696 51732 37638 54125 58946 56484 44685 34771 -8563 -15930 35710 101432 68772 56702
$$ packed form
18665C09239j2590k8580k7824K5454p589j3316j4506L6585l2752n7592p613P137
18653A76053M9103K3392J4069k5797J9262N684M164l3861r0141n8744R071l428
18641H8827n044Q562N875k6677J7260J2647k3727L4936K3471L8848J1830K844
18629A89652k1414j575J4803J7944k5233k2628q096M122K735M58M0711J4685K9683
18616B35847O9004N9717k175m7904p0628l8288J676J5511k6090n7614j9505O532
18604A26083L489K1606k7874j9369m4451j487K9361m0004j7008J2277o2185K2313
18592B751J6460j3337P612J7300N935n367j5366P881K3913n747j8232j2990M3883
18579E4696k964j4094J6487M821k462j1799r914m3334p367N1640O5722l2660j2070
$$ plain form
18566 56702 47537 54986 90992 129727 144390 123807 114009 84384 56538 43164 78976 97074
18554 97074 116630 142024 160768 122651 53559 17892 67836 118419 74143 83263 130535 154214
18542 154214 155566 130409 191482 223836 159581 185457 213621 222224 200270 231279 211532 171624
18530 171624 148178 165044 133200 126269 169167 228496 255931 227797 215280 204204 174597 149180
18518 149180 147069 147492 108824 121497 150803 149313 168500 169558 149737 126222 128423 137584 193128
18505 193128 273202 354312 426516 510509 548236 549865 527905 490181 504727 581355 612218 565074
18493 565074 574254 620021 738651 793775 751119 686485 632047 549930 481257 393902 318127
18482 318127 294445 297721 263676 213294 211865 203756 211569 186890 145282 156362 126932 116730
$$ packed form
18566E6702r165P449L6006L8735J4663k0583r798k9625k7846j3374L5812J8098
18554I7074J9556K5394J8744l8117o9092l5667M9944N0583m4276R120M7272K3679
18542A54214J352k5157O1073L2354o4255K5876K8164Q603k1954L1009j9747l9908
18530A71624k3446J6866l1844o931M2898N9329K7435k8134j2517j1076k9607k5417
18518A49180k111M23l8668J2673K9306j490J9187J058j9821k3515K201R161N5544
18505A93128Q0074Q1110P2204Q3993L7727J629k1960l7724J4546P6628L0863m7144
18493E65074R180M5767J18630N5124m2656o4634n4438q2117o8673q7355p5775
18482C18127k3682L276l4045n0382j429q109P813k4679m1608J1080k9430j0202
$$ plain form
18470 116730 155629 147520 125769 94214 88463 89982 114383 163859 176807 171883 124166 92847
18458 92847 76878 89049 139422 199023 232591 306725 392444 439562 463920 473863 493500 542484
18446 542484 537574 492818 416396 350297 340367 334337 324937 354362 378832 417492 462054 512545
18434 512545 592362 583881 537842 518768 494574 546501 605537 585516 520908 475846 389288 300209
18422 300209 190560 177641 181539 147583 173370 180210 129716 151249 193633 169612 106897 126328
18410 126328 159668 194600 182976 154809 127560 145607 162979 156411 136578 174565 254578 331669
18398 331669 418311 509621 595410 719252 887451 918561 866729 727495 587658 487615
18388 487615 413555 358816 336929 332749 290976 266693 220573 191545 212812 235334 279993 296565
$$ packed form
18470A16730L8899q109k1751l1555n751J519K4401M9476J2948m924m7717l1319
18458I2847j5969J2171N0373N9601L3568P4134Q5719M7118K4358R943J9637M8984
18446E42484m910m4756p6422o6099r930o030r400K9425K4470L8660M4562N0491
18434E12545P9817q481m6039j9074k4194N1927N9036k0021o4608m5062q6558q9079
18422C00209j09649j2919L898l3956K5787O840n0494K1533M2384k4021o2715J9431
18410A26328L3340L4932j1624k8167k7249J8047J7372o568j9833L7987Q0013P7091
18398C31669Q6642R1310Q5789J23842J68199L1110n1832j39234j39837j00043
18388D87615p4060n4739k1887m180m1773k4283m6120k9028K1267K2522M4659J6572
$$ plain form
18376 296565 315580 360229 366060 334686 338008 372375 354013 355569 375833 351259 393965 436896
18364 436896 437956 445245 406231 371029 334962 346637 353726 358025 363271 298836 304643 342276 367740
18351 367740 336737 323129 367319 395810 443945 476386 482502 536052 645700 904599 1153588
18340 1153588 1168613 1087172 950830 823198 746036 747864 760441 788254 827433 893935 999823
18329 999823 1142842 1199448 1241024 1306387 1337869 1369753 1503768 1682522 1870238 2012312
18319 2012312 2192131 2444574 2793217 3251032 3620139 3959180 4495280 5355044 6625985
18310 6625985 8342554 10669664 13990903 18339124 23996685 32711403 48589481 78225263
18302 78225263 113229834 115048791 97309417 72864502 46840105 29987620 20901045
$$ packed form
18376B96565J9015M4649N831l1374L322L4367j8362J556K0264k4574M2706M2931
18364D36896J060P289l9014l5202l6067J1675P089M299N246o4435N807L7633K5464
18351C67740l1003j3608M4190K8491M8135L2441O116N3550J09648K58899K48989
18340A153588J5025q1441j36342j27632p7162J828J2577K7813L9179O6502J05888
18329I99823J43019N6606M1576O5363L1482L1884J34015J78754J87716J42074
18319B012312J79819K52443L48643M57815L69107L39041N36100Q59764J270941
18310F625985J716569K327110L321239M348221N657561Q714718J5878078K9635782
18302G8225263L5004571J818957j7739374k4444915k6024397j6852485r086575
$$ plain form
18295 20901045 15824441 12637288 10578190 9240405 8295326 7549918 7128858 7026378 6949938
18286 6949938 6626122 6303921 6032986 5929707 6047961 6081274 6187131 6638153 7458946 8790093
18276 8790093 10698043 13456090 17528458 23094052 30677964 42336554 63867980 101963286
18268 101963286 136936503 129903647 107778587 77327358 49070972 31945053 22629888
18261 22629888 17199489 13628153 11185062 9493421 8254621 7302482 6615344 6173807
18253 6173807 5707135 5110196 4525855 3918322 3400320 2942620 2523636 2154047 1904341
18244 1904341 1740447 1586051 1451090 1430118 1505777 1685134 1762387 1648058 1492539 1264720
18234 1264720 1112819 1076578 1080299 1205397 1455405 1589741 1487969 1280459 967901 741106
$$ packed form
18295B0901045n076604l187153k059098j337785r45079p45408m21060j02480p6440
18286F949938l23816l22201k70935j03279J18254L3313J05857M51022Q20793J331147
18276H790093J907950K758047M072368N565594P583912J1658590K1531426L8095306
18268A01963286L4973217p032856k2125060l0451229k8256386j7125919r315165
18261B2629888n430399l571336k443091j691641j238800r52139o87138m41537
18253F173807m66672n96939n84341o07533n18002m57700m18984l69589k49706
18244A904341j63894j54396j34961k0972P5659J79357P7253j14329j55519k27819
18234A264720j51901l6241L721J25098K50008J34336j01772k07510l12558k26795
$$ plain form
18224 741106 603294 563011 564752 555645 530071 543943 569231 551089 498627 452828 432162 423674
18212 423674 420818 375335 385720 394865 350139 317416 318156 320055 265092 241988 231703 266708
18200 266708 294547 335686 362415 416778 460445 439478 405908 371855 330065 279546 276367 254439
18188 254439 246804 256422 267754 279378 325879 345933 305844 276954 229621 233159 255229 239902
18176 239902 240029 232121 254556 236314 208256 254216 257384 258730 265368 238916 212097 241238 279345
18163 279345 332622 311261 267260 283288 264797 264317 286103 324658 333316 329144 336137 334897 340304
18150 340304 394770 414937 399277 398470 391301 375978 350142 394017 431797 429465 448454 506352
18138 506352 560796 560005 530754 523647 572748 639809 652818 686041 670124 742445 823191 900924
$$ packed form
18224G41106j37812m0283J741r107k5574J3872K5288j8142n2462m5799k0666q488
18212D23674k856m5483J0385R145m4726l2723P40J899n4963k3104j0285L5005
18200B66708K7839M1139K6729N4363M3667k0967l3570l4053m1790n0519l179k1928
18188B54439p635R618J1332J1624M6501K0054m0089k8890m7333L538K2070j5327
18176B39902J27p908K2435j8242k8058M5960L168J346O638k6452k6819K9141L8107
18163B79345N3277k1361m4001J6028j8491m80K1786L8555Q658m172O993j240N407
18150C40304N4466K0167j5660q07p169j5323k5836M3875L7780k332J8989N7898
18138E06352N4444p91k9251p107M9101O7061J3009L3223j5917P2321Q0746P7733
$$ plain form
18126 900924 989853 1058322 1178504 1348975 1593000 1932971 2351431 2858740 3631177 4752665
18116 4752665 6339252 8461057 11252397 15282520 22357547 36224803 59257517 71966335
18108 71966335 63148032 50512344 33432916 20380250 13258501 9516420 7322451 5904290
18100 5904290 4917894 4194079 3617094 3123247 2601212 2208863 1972050 1761543 1588656
18091 1588656 1417912 1257034 1050690 888437 853149 813680 768758 709560 627962 628348 684856
18080 684856 745992 842131 886968 818774 688069 567565 466464 386098 348308 333806 265297
18069 265297 271600 279409 251145 234895 257310 240728 211663 211781 234533 219529 217673 197162
18057 197162 195538 173936 175834 191952 177855 184157 230216 273853 345353 466257 484383 478175
$$ packed form
18126I00924Q8929O8469J20182J70471K44025L39971M18460N07309P72437J121488
18116D752665J586587K121805K791340M030123P075027J3867256K3032714J2708818
18108G1966335q818303j2635688j7079428j3052666p121749l742081k193969j418161
18100E904290r86396p23815n76985m93847n22035l92349k36813k10507j72887
18091A588656j70744j60878k06344j62253l5288l9469m4922n9198q1598L86N6508
18080F84856O1136R6139M4837o8194j30705j20504j01101q0366l7790j4502o8509
18069B65297O303P809k8264j6250K2415j6582k9065J18K2752j5004j856k0511
18057A97162j624k1602J898J6118j4097O302M6059M3637P1500J20904J8126o208
$$ plain form
18045 478175 421943 333172 291585 255792 256542 236944 194241 171216 149873 138510 115148 150109
18033 150109 205910 236417 185223 147577 94678 99453 105568 170013 262653 389241 479262 465483
18021 465483 404484 315139 232196 215971 197709 185709 188477 163781 146845 139753 104858 106357
18009 106357 117875 123525 155391 164967 153287 176904 189994 192873 200955 226030 278848 330346
17997 330346 298630 247299 190971 156723 152805 189366 196550 195931 239457 259552 266088 237693
17985 237693 212307 163407 157798 113294 111100 145633 157743 146336 149696 203112 195481 179442
17973 179442 170191 181368 109289 87023 69382 125661 214751 211316 216137 219440 211356 219988 190243
17960 190243 164139 127054 163757 177698 190631 210580 240103 270073 263159 248792 239111 229572
$$ packed form
18045D78175n6232q8771m1587l5793P50j9598m2703k3025k1343j1363k3362L4961
18033A50109N5801L0507n1194l7646n2899M775O115O4445R2640J26588R0021j3779
18021D65483o0999q9345q2943j6225j8262j2000K768k4696j6936p092l4895J499
18009A06357J1518N650L1866R576j1680K3617J3090K879Q082K5075N2818N1498
17997C30346l1716n1331n6328l4248l918L6561P184o19M3526K0095O536k8395
17985B37693k5386m8900n609m4504k194L4533J2110j1407L360N3416p631j6039
17973A79442r251J1177p2079k2266j7641N6279Q9090l435M821L303q084Q632k9745
17960A90243k6104l7085L6703J3941J2933J9949K9523K9970o914j4367r681r539
$$ plain form
17948 229572 228966 219770 225003 206633 267599 294540 248055 218213 195059 218168 255627 235258
17936 235258 248164 283712 285231 261694 262476 258021 252247 263988 291872 298021 314398 304658 282678
17923 282678 263634 277800 329553 373495 390047 423950 453111 441332 463799 468215 457366 469678
17911 469678 510045 566436 623050 688658 721572 749160 739347 743798 814289 982298 1177175
17900 1177175 1412515 1698205 1879747 1907569 1852863 1791787 1819759 1960330 2211876 2441842
17890 2441842 2682277 2906374 3162908 3586819 4156150 4865682 5762498 7050316 8823977
17881 8823977 11258590 14638052 19267695 25451685 34943691 52283932 84926944 128344474
17873 128344474 137602958 117975261 90731559 58859531 37143932 25443146 19092309
$$ packed form
17948B29572o06r196N233j8370O0966K6941m6485k9842k3154K3109L7459k0369
17936B35258J2906L5548J519k3537P82m455n774J1741K7884O149J6377r740k1980
17923B82678j9044J4166N1753M3942J6552L3903K9161j1779K2467M416j0849J2312
17911D69678M0367N6391N6614O5608L2914K7588r813M451P0491J68009J94877
17900A177175K35340K85690J81542K7822n4706o1076K7972J40571K51546K29966
17890B441842K40435K24097K56534M23911N69331P09532Q96816J287818J773661
17881H823977K434613L379462M629643O183990R492006J7340241L2643012M3417530
17873A28344474R258484j9627697k7243702l1872028k1715599j1700786o350837
$$ plain form
17866 19092309 15482267 13404725 11871678 10462404 9222336 8096881 7305848 6929137
17858 6929137 6757706 6494765 6301794 6081279 5871885 5830570 6014077 6440042 7206369 8380096
17848 8380096 9908475 11990377 14867633 18838901 24414715 33462828 50458894 81834648
17840 81834648 116385528 115066204 96657906 70982160 44813692 28400076 19679935
17833 19679935 14906158 12000560 10120647 8700577 7512002 6508884 5646093 5045753
17825 5045753 4737934 4512460 4283362 4113895 3731137 3338679 3006288 2678597 2462312
17816 2462312 2424633 2454607 2355813 2385712 2668322 2768464 2404447 1995123 1469846 1116558
17806 1116558 930018 830231 728030 662065 640610 600311 583276 583323 550324 524859 512312
$$ packed form
17866A9092309l610042k077542j533047j409274j240068j125455p91033l76711
17858F929137j71431k62941j92971k20515k09394m1315J83507M25965P66327J173727
17848H380096J528379K081902K877256L971268N575814R048113J6996066L1375754
17840H1834648L4550880j319324j8408298k5675746k6168468j6413616q720141
17833A9679935m773777k905598j879913j420070j188575j003118q62791o00340
17825E045753l07819k25474k29098j69467l82758l92458l32391l27691k16285
17816B462312l7679K9974r8794K9899K82610J00142l64017m09324n25277l53288
17806A116558j86540r9787j02201o5965k1455m0299j7035M7l2999k5465j2547
$$ plain form
17795 512312 497376 505735 493810 467271 455487 466328 463827 475594 491368 493834 470312 431617
17783 431617 418165 379874 347444 354750 367715 349805 288969 219799 154681 146046 126038 150293
17771 150293 182286 187187 204785 203608 201113 236413 210556 179465 159528 193368 212115 165325
17759 165325 181267 150838 113367 117974 62063 66787 97704 60672 89352 92105 68753 83070
17747 83070 66840 42506 67257 69121 102294 142212 139325 168135 168863 135240 80485 71423 124921
17734 124921 117668 89599 81033 105671 113514 123890 117246 103735 100823 100805 74937 44276 83603
17721 83603 129607 162325 208980 254120 287591 229406 200611 188451 142388 111238 117998 139546
17709 139546 113352 98818 124092 128222 132823 157404 195476 278731 333545 429440 557879 761115
$$ packed form
17795E12312j4936Q359j1925k6539j1784J0841k501J1767J5774K466k3522l8695
17783D31617j3452l8291l2430P306J2965j7910o0836o9170o5118q635k0008K4255
17771A50293L1993M901J7598j177k495L5300k5857l1091j9937L3840J8747m6790
17759A65325J5942l0429l7471M607n5911M724L0917l7032K8680K753k3352J4317
17747H3070j6230k4334K4751J864L3173L9918k887K8810P28l3623n4755r062N3498
17734A24921p253k8069q566K4638P843J0376o644j3511k912j8k5868l0661L9327
17721H3603M6004L2718M6655M5140L3471n8185k8795j2160m6063l1150O760K1548
17709A39546k6194j4534K5274M130M601K4581L8072Q3255N4814R5895J28439K03236
$$ plain form
17697 761115 968501 1018506 920616 761193 527360 353044 264440 238239 199560 161157 161751
17686 161751 173799 210419 245777 249887 208020 201461 167714 137611 127935 81372 67465 60548
17674 60548 111296 135906 140335 136194 157820 198969 249628 270420 288680 374213 532469 706807
17662 706807 705323 615339 494486 342772 214060 156133 154609 125292 74607 68812 49324
17651 49324 58651 144599 142016 130858 129657 88855 61919 56792 70164 97980 110731 64286
17639 64286 47866 44426 10740 11264 16315 47546 44937 20277 49215 77284 100303 88088 88175
17626 88175 125835 119584 110296 52325 37637 71966 82297 77393 68902 59639 45277 25767 6409
17613 6409 26878 49117 46066 42115 13869 -36511 -30977 -17529 -4432 10042 12297 -32377 -16163
$$ packed form
17697G61115K07386N0005r7890j59423k33833j74316q8604k6201l8679l8403N94
17686A61751J2048L6620L5358M110m1867o559l3747l0103r676m6563j3907o917
17674F0548N0748K4610M429m141K1626M1149N0659K0792J8260Q5533J58256J74338
17662G06807j484q9984j20853j51714j28712n7927j524k9317n0685n795j9488
17651D9324R327Q5948k583j1158j201m0802k6936n127J3372K7816J2751m6445
17639F4286j6420l440l3686N24N051L1231k609k4660K8938K8069K3019j2215Q7
17626H8175L7660o251r288n7971j4688L4329J0331m904q491r263j4362j9510j9358
17613F409K0469K2239l051l951k8246n0380N534J3448J3097J4474K255m4674J6214
$$ plain form
17600 -16163 -1080 7616 10097 12433 -8059 -37092 -18578 -27929 -34725 -43410 26581 15769 1844
17587 1844 -11127 5993 85827 82202 68871 72250 76597 60045 46786 55815 80303 46068 51800
17574 51800 22730 -13994 -22459 -7155 -20987 6990 -227 -24195 -7788 -380 25148 27032
17562 27032 13898 13823 2634 262 38981 104626 136592 67938 25728 -9276 -38499 -41450 -41811
17549 -41811 -198 48366 60981 55285 27685 22549 13065 17105 25072 16614 8389 3070 24159
17536 24159 40241 43162 12679 -16217 -33203 -48268 -48358 -34261 -6943 -20058 -29064 3035 -122
17523 -122 -15565 -38163 6628 26429 -16905 -75723 -101730 -100879 -99059 -116657 -143322 -104712 -44408
17510 -44408 10453 18910 22023 5991 -15006 -6314 -17221 2352 24123 16833 -9451 -6741 2457
$$ packed form
17600a6163J5083Q696K481K336k0492k9033J8514r351o796q685O9991j0812j3925
17587A844j2971J7120P9834l625j3331L379M347j6552j3259R029K4488l4235N732
17574E1800k9070l6724q465J5304j3832K7977p217k3968J6407P408K5528J884
17562B7032j3134p5j1189k372L8719O5645L1966o8654m2210l5004k9223k951l61
17549d1811M1613M8564J2615n696k7600n136r484M040P967q458q225n319K1089
17536B4159J6082K921l0483k8896j6986j5065r0J4097K7318j3115r006L2099l157
17523a22j5443k2598M4791J9801m3334n8818k6007Q51J820j7598k6665L8610O0304
17510d4408N4861Q457L113j6032k0997Q692j0907J9573K1771p290k6284K710R198
$$ plain form
17497 2457 4916 -15638 -50492 -75726 -66758 -32325 -3332 -3444 -47290 -60474 -9545 21192 -3586
17484 -3586 -22272 -26536 -51165 -48942 -58856 -50256 -40100 -30312 17346 14251 -5952 -18379 -30198
17471 -30198 -59420 -54478 -35317 -32184 -27509 -3175 27864 39411 24665 21454 -9887 -78911
17459 -78911 -45750 1269 -14158 -26905 -48260 -60664 -68200 -53712 -7088 38733 54013 71137
17447 71137 85369 111094 182925 309239 407299 373975 272290 218443 162554 71095 1889
17436 1889 -26928 -33058 -50269 -46878 -18270 5638 28108 -4634 -4792 12103 6120 5004 5155
17423 5155 -1356 10481 -13827 -43329 -45709 -12991 14527 19874 7583 -14054 -8131 -20106 -22133
17410 -22133 -1873 -4626 -2291 -6417 -10433 -9393 -30743 -68814 -99348 -115914 -84015 -63406 -90400
$$ packed form
17497B457K459k0554l4854k5234Q968L4433K8993j12m3846j3184N0929L0737k4778
17484c586j8686m264k4629K223r914Q600J0156R788M7658l095k0203j2427j1819
17471c0198k9222M942J9161L133M675K4334L1039J1547j4746l211l1341o9024
17459g8911L3161M7019j5427j2747k1355j2404p536J4488M6624M5821J5280J7124
17447G1137J4232K5725P1831J26314R8060l3324j01685n3847n5889r1459o9206
17436A889k8817o130j7211L391K8608K3908K2470l2742j58J6895n983j116J51
17423E155o511J1837k4308k9502k380L2718K7518N347j2291k1637N923j1975k027
17410b2133K0260k753K335m126m016J040k1350l8071l0534j6566L1899K0609k6994
$$ plain form
17397 -90400 -114665 -74805 -54439 -62780 -70234 -44227 -23322 -45650 -24041 21010 18534 6711
17385 6711 50012 48116 62679 57559 29470 43867 67441 70972 73501 31718 29534 44443 49614
17372 49614 44215 61941 87770 57510 60334 32504 19627 31813 36213 -4164 -26388 -22380
17360 -22380 -39538 -23915 -20271 -7009 2364 20435 37204 22263 20972 9564 -23612 -38077
17348 -38077 -21159 -874 35164 53614 6078 -31435 -82585 -100055 -80034 -68908 -91419 -92303
17336 -92303 -91135 -66367 -41347 -23145 -39434 -61029 -47303 4990 41673 62402 54736 49891
17324 49891 65336 40917 43991 127585 170738 214407 345513 526354 581444 480435 379038
17313 379038 250195 166662 131315 109365 59310 20783 8499 -15631 28738 70714 80564
$$ packed form
17397i0400k4265L9860K0366q341p454K6007K0905k2328K1609M5051k476j1823
17385F711M3301j896J4563n120k8089J4397K3574L531K529m1783k184J4909N171
17372D9614n399J7726K5829l0260K824k7830j2877J2186M400m0377k2224M008
17360b2380j7158J5623L644J3262R373J8071J6769j4941j291j1408l3176j4465
17348c8077J6918K0285L6038J8450m7536l7513n1150j7470K0021J1126k2511q84
17336i2303J168K4768K5020J8202j6289k1595J3726N2293L6683K0729p666m845
17324D9891J5445k4419L074Q3594M3153M3669J31106J80841N5090j01009j01397
17313C79038j28843q3533l5347k1950n0055l8527j2284k4130M4369M1976R850
$$ plain form
17302 80564 103676 72132 37038 20487 641 -23679 -30761 1022 31680 24531 51047 93921
17290 93921 126373 133268 108008 125132 172549 245832 403678 588378 576961 479543 361766
17279 361766 206372 126374 143920 127298 69615 56081 32239 -34824 -23310 -1884 -11753
17268 -11753 5766 3004 24187 20815 -7324 -8013 5054 35905 58405 21666 -44620 -98930
17256 -98930 -71363 -33164 -9392 36970 30155 57593 47466 34476 32446 11747 27238 17386
17244 17386 31631 46562 17866 -16406 -23157 -38063 -43273 -30933 -17001 -5991 -6905 4601
17232 4601 57 -12975 4633 -50569 -76676 -86353 -56299 -27306 8111 30638 16686 8444
17220 8444 53910 93443 165605 343392 585345 722465 656654 552764 401922 227147 132715
$$ packed form
17302H0564K3112l1544l5094j6551j9846k4320p082L1783L0658p149K6516M2874
17290I3921L2452O895k5260J7124M7417P3283J57846J84700j1417r7418j17777
17279C61766j55394p9998J7546j6622n7683j3534k3842o7063J1514K1426r869
17268a1753J7519k762K1183l372k8139o89J3067L0851K2500l6739o6286n4310
17256i8930K7567L8199K3772M6362o815K7438j0127j2990k030k0699J5491r852
17244A7386J4245J4931k8696l4272o751j4906n210J2340J3932J1010r14J1506
17232D601m544j3032J7608n5202k6107r677L0054K8993L5417K2527j3952q242
17220H444M5466L9533P2162J77787K41953J37120o5811j03890j50842j74775r4432
$$ plain form
17209 132715 73464 54699 22073 28563 85374 77344 24130 17200 13428 31990 361 5458
17197 5458 1712 -24920 -46622 -46890 -14651 -59894 -63832 -54966 -45784 -43450 -15110 3490 12224
17184 12224 -6197 -10064 -16426 -21240 -42510 -37851 -15737 408 52061 61777 19095 19836 12658
17171 12658 36236 23735 5960 -7980 -35307 -47820 -21188 -15037 -6144 26409 -5355 -53001
17159 -53001 -35334 -26258 -39879 -47635 -41709 -49510 -57339 -58291 -79212 -70408 -80620 -68723 -49839
17146 -49839 -25196 11555 -18470 -21263 -39599 -66908 -43455 -49662 -76165 -57395 -24830 386
17134 386 -8166 -12856 -35768 -16972 -51515 -70745 -67252 -69477 -74632 -57712 -65110 -59365 -8774
17121 -8774 28200 73670 38469 5514 -1890 -7090 -6039 5113 -21708 -94214 -113562 -137149
$$ packed form
17209A32715n9251j8765l2626O490N6811q030n3214o930l772J8562l1629N097
17197E458l746k6632k1702k68L2239m5243l938Q866R182K334K8340J8600Q734
17184A2224j8421l867o362m814k1270M659K2114J6145N1653R716m2682P41p178
17171A2658K3578j2501j7775j3940k7327j2513K6632O151Q893L2553l1764m7646
17159e3001J7667R076j3621p756N926p801p829r52k0921Q804j0212J1897J8884
17146d9839K4643L6751l0025k793j8336k7309K3453o207k6503J8770L2565K5216
17134C86q552m690k2912J8796l4543j9230L493k225n155J6920p398N745N0591
17121h774L6974M5470l5201l2955p404n200J051J1152k6821p2506j9348k3587
$$ plain form
17109 -137149 -139950 -128743 -88024 -30072 26409 23105 -21639 -42672 -75560 -51632 -17977 -17156
17097 -17156 -21472 213 -8810 -25421 -23180 -34370 -50552 -73821 -64311 -58349 -73827 -75017 -34997
17084 -34997 11323 19886 -7654 -23691 -43864 -30475 -4639 10496 5015 21176 27917 24043
17072 24043 15618 4533 -9086 -26405 -57032 -57228 -43785 -38702 -20110 -27571 -9508 -8993 -4899
17059 -4899 -11736 -18056 1621 1729 -30567 -86711 -57891 -25391 -1749 14917 717 -16022 7789
17046 7789 7359 -899 6372 27344 33905 35579 13330 62793 65762 28862 35416 17916 -40029
17033 -40029 -44352 -109186 -120855 -80971 -25525 -3804 7983 50173 62890 -10490 -55945 -51320
17021 -51320 -40831 -24939 -50160 -26365 -33128 -7344 -1325 14000 -28400 -48630 -57569 -62286
$$ packed form
17109a37149k801J1207M0719N7952N6481l304m4744k1033l2888K3928L3655Q21
17097a7156m316K1685r023j6611K241j1190j6182k3269R510N962j5478j190M0020
17084c4997M6320Q563k7540j6037k0173J3389K5836J5135n481J6161O741l874
17072B4043q425j1085j3619j7319l0627j96J3443N083J8592p461J8063N15M094
17059d899o837o320J9677J08l2296n6144K8820L2500K3642J6666j4200j6739K3811
17046G789m30q258P271K0972O561J674k2249M9463K969l6900O554j7500n7945
17033d0029m323o4834j1669L9884N5446K1721J1787M2190J2717p3380m5455M625
17021e1320J0489J5892k5221K3795o763K5784O019J5325m2400k0230q939m717
$$ plain form
17009 -62286 -76738 -95342 -80335 -65737 -46898 -30544 1957 -10773 -47481 -11115 -22757 -78931
16997 -78931 -62186 -41101 -67740 -62427 -44448 -14590 17118 56010 57280 33034 23870 -24997
16985 -24997 -55873 -66422 -54488 -44149 -66993 -63820 -48415 -35530 8281 53220 39067 14563
16973 14563 17310 4935 -21141 -22424 -3911 5118 -17138 -53189 -40616 -15180 -24957 -7658
16961 -7658 4732 -19809 -22119 -5126 -8999 -34381 -84539 -56662 3826 44352 14888 36140
16949 36140 62291 94054 65429 45538 30531 -7941 -62900 -67048 -56952 -46387 -33885 -26880
16937 -26880 -32423 -13447 52664 35311 8898 -14271 -20804 -59571 -39361 -24636 -15167 25312
16925 25312 17279 -43649 -78441 -62344 -43805 10319 20144 27939 17201 -14646 -35780 -46211
$$ packed form
17009f2286j4452j8604J5007J4598J8839J6354L2501j2730l6708L6366j1642n6174
16997g8931J6745K1085k6639N313J7979K9858L1708L8892J270k4246r164m8867
16985b4997l0876j0549J1934J0339k2844L173J5405J2885M3811M4939j4153k4504
16973A4563K747j2375k6076j283J8513R029k2256l6051J2573K5436r777J7299
16961g658J2390k4541k310J6993l873k5382n0158K7877O0488M0526k9464K1252
16949C6140K6151L1763k8625j9891j5007l8472n4959m148J0096J0565J2502P005
16937b6880n543J8976O6111j7353k6413k3169o533l8767K0210J4725R469M0479
16925B5312q033o0928l4792J6097J8539N4124R825P795j0738l1847k1134j0431
$$ plain form
16913 -46211 -49098 -39850 1208 50288 10336 -28553 -9412 62379 57161 7084 12328 58116
16901 58116 66339 20353 14915 5383 -14377 -14407 14594 -13934 -33485 -12117 4555 -13869 19673
16888 19673 6145 -54839 -67168 -43513 -28383 -30276 -9370 -38499 -48607 -44903 -32338 -68243
16876 -68243 -132562 -60941 -7653 20849 54775 59414 4045 -28422 18261 14445 1307 -10064
16864 -10064 3662 -14044 -8288 26561 12590 -34113 -64896 -46559 -40043 -14732 -11535 -23248
16852 -23248 -29293 -46951 -30295 -28908 -33481 13299 77470 60758 1590 -49437 -41113 -32658 -82841
16839 -82841 -81959 -92950 -143203 -120972 -68818 -66043 -88093 -54873 -11957 -2404 18879 -2387
16827 -2387 -29148 -59971 -90123 -89871 -87786 -73451 -54172 -39890 -52994 -84379 -75830 -81322 -27441
$$ packed form
16913d6211k887R248M1058M9080l9952l8889J9141P1791n218n0077N244M5788
16901E8116Q223m5986n438r532j9760l0K9001k8528j9551K1368J6672j8424L3542
16888A9673j3528o0984j2329K3655J5130j893K0906k9129j0108L704J2565l5905
16876f8243o4319P1621N3288K8502L3926M639n5369l2467M6683l816j3138j1371
16864a0064J3726j7706N756L4849j3971m6703l0783J8337O516K5311L197j1713
16852b3248o045j7658J6656J387m573M6780O4171j6712n9168n1027Q324Q455n0183
16839h2841Q82j0991n0253K2231N2154K775k2050L3220M2916R553K1283k1266
16827b387k6761l0823l0152K52K085J4335J9279J4282j3104l1385Q549n492N3881
$$ plain form
16814 -27441 19450 23721 2377 -11504 -27393 -9305 16290 42864 18680 -2863 32072 15007
16802 15007 -15309 -31298 -33767 -60541 -45094 -61586 -80461 -66147 -52418 -28114 -19419 -25404
16790 -25404 -4638 8761 -3739 -5703 -4933 -55253 -66939 -65325 -19364 -55757 -71984 -43498
16778 -43498 -51606 -28657 -51904 -51451 -47528 -54777 -52288 -14112 -14347 -3758 -35715 -63378 -41989
16765 -41989 -37231 -57914 -65545 -60649 -52264 -17251 -20177 -57116 -77745 -55857 -37285 -3324 18626
16752 18626 14465 21651 15194 13718 7487 -23240 8766 46317 83413 97891 111636 44646 17294
16739 17294 1216 18699 21603 18868 -11801 -17331 -11486 -25344 14686 9434 -19177 -30042 -20151
16726 -20151 -20720 -19645 -20856 -14018 -15870 -15250 -22787 -59484 -73520 -64007 -57854 -52247 -70699 -71788
$$ packed form
16814b7441M6891M271k1344j3881j5889J8088K5595K6574k4184k1543L4935j7065
16802A5007l0316j5989k469k6774J5447j6492j8875J4314J3729K4304Q695n985
16790b5404K0766J3399j2500j964P70n0320j1686J614M5961l6393j6227K8486
16778d3498q108K2949k3247M53L923p249K489L8176k35J0589l1957k7663K1389
16765d1989M758k0683p631M896Q385L5013k926l6939k0629K1888J8572L3961K1950
16752A8626m161P186o457j476o231l0727L2006L7551L7096J4478J3745o6990k7352
16739A7294j6078J7483K904k735l0669n530N845j3858M0030n252k8611j0865R891
16726b0151n69J075j211O838j852O20p537l6697j4036R513O153N607j8452j089
$$ plain form
16712 -71788 -46346 -76840 -93525 -71957 -30730 -725 -16055 -15790 -33341 -33101 -29478 -10038 -694
16699 -694 24517 38499 25804 23811 23548 -25252 -33198 -31609 -31548 -64916 -74958 -102676 -87119 -62647
16685 -62647 -42206 -8583 -15197 -39882 -35025 -45129 -34190 -42550 -43298 -21352 -14799 -26917 25083
16672 25083 14366 -39199 -56583 -40998 -19862 -44199 -61295 -46818 -43460 -68332 -52064 12005
16660 12005 -12484 -53097 -79180 -62429 -2730 6422 -40795 -40203 -28370 -50218 -42537 -43416 -16286
16647 -16286 -17298 -9413 -18699 28921 31445 4098 -51593 -46440 -33987 -3764 10927 -831 -12540
16634 -12540 -50035 -62244 -28529 -6378 -11256 -18426 1084 3074 -2050 1208 -15075 -21095 -15485
16621 -15485 -42927 -47384 -24027 -36869 -85758 -98167 -103395 -104660 -114447 -82612 -71386 -75137 -46424
$$ packed form
16712g1788K5442l0494j6685K1568M1227L0005j5330K65j7551K40L623J9440R344
16699f94K5211J3982j2695j993k63m8800p946J589O1l3368j0042k7718J5557K4472
16685f2647K0441L3623o614k4685M857j0104J0939q360p48K1946O553j2118N2000
16672B5083j0717n3565j7384J5585K1136k4337j7096J4477L358k4872J6268O4069
16660A2005k4489m0613k6083J6751N9699R152m7217N92J1833k1848P681q79K7130
16647a6286j012P885r286M7620K524k7347n5691N153J2453L0223J4691j1758j1709
16634a2540l7495j2209L3715K2151m878p170J9510J990n124L258j6283o020N610
16621a5485k7442m457K3357j2842m8889j2409n228j265r787L1835J1226l751K8713
$$ plain form
16608 -46424 -40833 -36776 -22522 -28131 -12068 4060 33707 35797 6500 -24586 -46234 -34181
16596 -34181 -15380 -23564 -6011 9955 -26 33139 65920 60034 52149 51250 49445 18058 4634
16583 4634 18785 16807 -9122 6062 -21825 -544 17323 28386 21326 2794 9524 18334 28487
16570 28487 27554 28908 2565 8979 13808 -8031 -22487 -20131 24490 17469 44984 53730 13477
16557 13477 -23838 -9397 43242 75919 86805 51048 31958 23454 -25822 -29182 -44110 -45190
16545 -45190 -21928 33327 1001 -42539 -50345 -46666 -81574 -117009 -127003 -106213 -109874 -86145
16533 -86145 -47442 -20103 -52765 -51898 -58073 -21428 -9859 -14079 11206 26486 20984 36129 19162
16520 19162 -8335 -32803 -11048 32273 27901 -7147 -19620 16263 18122 5183 480 -49839
$$ packed form
16608d6424N591M057J4254n609J6063J6128K9647K090k9297l1086k1648J2053
16596c4181J8801q184J7553J5966r981L3165L2781n886p885q99j805l1387j3424
16583D634J4151j978k5929J5184k7887K1281J7867J1063p060j8532O730Q810J0153
16570B8487r33J354k6343O414M829k1839j4456K356M4621p021K7515Q746m0253
16557A3477l7315J4441N2639L2677J0886l5757j9090q504m9276l360j4928j080
16545d5190K3262N5255l2326m3540p806L679l4908l5435r994K0790l661K3729
16533h6145L8703K7339l2662Q67o175L6645J1569m220K5285J5280n502J5145j6967
16520A9162k7497k4468K1755M3321m372l5048j2473L5883J859j2939m703n0319
$$ plain form
16508 -49839 -54670 -60714 -58854 -66445 -89103 -47058 2348 -11974 -50554 -25717 -22913 -35223 -12363
16495 -12363 12995 3258 -25123 -27542 -78989 -112166 -113099 -27787 -20067 -31702 -13980 -39187 -69132
16482 -69132 -62591 -94266 -72692 -87199 -114181 -131927 -102091 -67210 -71218 -67866 -39978 -28949
16470 -28949 -23036 -25313 -18798 -26622 -50500 -75809 -64053 -21006 -271 -6366 -4122 22659 -217
16457 -217 -49232 -30315 -50852 -55203 -38938 -18047 -14580 66268 71094 41521 7776 25137 20789
16444 20789 -14854 -48408 -16678 4234 12077 -11073 -74519 -42173 -11726 -7205 -37060 -34081
16432 -34081 7550 13278 6736 -24686 -16233 20225 18885 32888 4815 1079 8172 -1510 -6791
16419 -6791 -23771 -52463 -52297 -65105 -71537 -68550 -59326 -56047 -8068 10388 32507 29153 -1091
$$ packed form
16508d9839m831o044J860p591k2658M2045M9406j4322l8580K4837K804j2310K2860
16495a2363K5358r737k8381k419n1447l3177r33Q5312P720j1635J7722k5207k9945
16482f9132O541l1675K1574j4507k6982j7746K9836L4881m008L352K7888J1029
16470b8949N913k277O515p824k3878k5309J1756M3047K0735o095K244K6781k2876
16457b17m9015J8917k0537m351J6265K0891L467Q0848M826k9573l3745J7361m348
16444B0789l5643l3554L1730K0912P843k3150o3446L2346L0447M521k9855K979
16432c4081M1631N728o542l1422Q453L6458j340J4003k8073l736P093r682n281
16419f791j6980k8692J66j2808o432K987R224L279M7979J8456K2119l354l0244
$$ plain form
16406 -1091 -24877 7837 -13465 -3654 14952 -19256 -17079 33219 58715 59128 2 -39568 -38492
16393 -38492 -33858 -36810 -31113 -33159 -17183 21042 17290 -6404 -6704 39718 72183 94437 61941
16380 61941 1120 -24509 -26987 -39993 -42377 -36465 -30640 -38869 -19759 -49428 -77375 -45027 -16237
16367 -16237 36237 35763 -19685 -18911 10062 22154 9501 2976 -9542 -26632 -64656 -54924 12456
16354 12456 12917 2699 385 7412 -15053 -58957 -39958 -57591 -21402 2298 -12019 -16532 -51040
16341 -51040 -83517 -89721 -58353 -32128 8068 44955 31090 14197 22103 29879 29181 3269 -29019
16328 -29019 -49514 -45637 -45344 -15176 -42709 -69316 -66628 -55817 -11104 -6839 -28323 -16042 -1330
16315 -1330 42400 4576 26413 26557 -1722 -20714 709 -12821 -13832 -28377 -67425 -21192
$$ packed form
16406a091k3786L2714k1302R811J8606l4208K177N0298K5496M13n9126l9570J076
16393c8492M634k952N697k046J5976L8225l752k3694l00M6422L2465K2254l2496
16380F1941o0821k5629k478j3006k384N912N825q229J9110k9669k7947L2348K8790
16367a6237N2474m74n5448P74K8973J2092j2653o525j2518j7090l8024R732O7380
16354A2456M61j0218k314P027k2465m3904J8999j7633L6189K3700j4317m513l4508
16341e1040l2477o204L1368K6225M0196L6887j3865j6893P906P776o98k5912l2288
16328b9019k0495L877K93L0168k7533k6607K688J0811M4713M265k1484J2281J4712
16315a330M3730l7824K1837J44k8279j8992K1423j3530j011j4545l9048M6233
$$ plain form
16303 -21192 19530 49132 56682 64485 37559 34537 6573 -16973 -25177 -31769 -48108 -1475 14958
16290 14958 -7162 -16139 20311 1685 23718 42618 30011 16969 2569 8795 22457 -33370
16278 -33370 -7219 53596 74286 41244 -39075 -23679 12783 25000 -18789 -39870 -26858 -21241
16266 -21241 -33440 -52738 -68906 -64981 -75831 -125212 -96746 -36731 3837 22200 35621 29575
16254 29575 14970 17306 13319 29835 43766 15121 -38594 -17443 20831 50167 60838 107384
16242 107384 111583 78755 25147 -30793 -4 23617 -6983 -45035 -27861 -28313 -23532 -7815
16230 -7815 28361 38018 41406 -7545 -16560 14024 30306 37256 5017 -25001 -17444 -43959 -53007
16217 -53007 -28227 -26692 -12356 2597 -12970 -18796 -37981 -56302 -30638 -35758 -70480 -63144
$$ packed form
16303b1192M0722K9602P550P803k6926l022k7964k3546q204o592j6339M6633J6433
16290A4958k2120q977L6450j8626K2033J8900j2607j3042j4400O226J3662n5827
16278c3370K6151O0815K0690l3042q0319J5396L6462J2217m3789k1081J3012N617
16266b1241j2199j9298j6168L925j0850m9381K8466O0015M0568J8363J3421o046
16254B9575j4605K336l987J6516J3931k8645n3715K1151L8274K9336J0671M6546
16242A07384M199l2828n3608n5940L0789K3621l0600l8052J7174m52M781J5717
16230g815L6176R657L388m8951r015L0584J6282O950l2239l0018P557k6515r048
16217e3007K4780J535J4336J4953j5567n826j9185j8321K5664n120l4722P336
$$ plain form
16205 -63144 -29161 -57316 -79041 -33976 19834 24527 3134 -36515 -24042 35487 44908 28447
16193 28447 24226 27902 11940 19281 48295 -12905 -19509 37148 31396 7928 -24423 -30189 -46052
16180 -46052 -47734 -55056 -63949 -101305 -123484 -79835 -52746 -25266 -37246 -45606 -19206 -19664 -51728
16167 -51728 -73001 -75736 -70806 -38732 18706 25428 -3541 -28017 -52855 -58917 12494 78507
16155 78507 48461 21827 -7007 138 -1207 -17338 -9413 20338 18238 -1318 4996 14125 6826
16142 6826 -6194 -1812 8535 12198 4168 -48815 -72172 -63378 -11039 27688 6123 4005 -14120
16129 -14120 -39022 -14929 11337 -19341 -30315 -28797 -12775 -12696 29371 48882 30876 3185
16117 3185 10112 -25775 -59563 -36959 -26513 -9118 8607 -19582 -47215 -71113 -83920 -58321
$$ packed form
16205f3144L3983k8155k1725M5065N3810M693k1393l9649J2473N9529R421j6461
16193B8447m221L676j5962P341K9014o1200o604N6657n752k3468l2351n766j5863
16180d6052j682p322q893l7356k2179M3649K7089K7480j1980q360K6400m58l2064
16167e1728k1273k735M930L2074N7438O722k8969k4476k4838o062P1411O6013
16155G8507l0046k6634k8834P145j345j6131P925K9751k100j9556O314R129p299
16142F826j3020M382J0347L663q030n2983k3357Q794N2339L8727k1565k118j8125
16129a4120k4902K4093K6266l0678j0974J518J6022P9M2067J9511j8006k7691
16117C185O927l5887l3788K2604J0446J7395J7725k8189k7633k3898j2807K5599
$$ plain form
16105 -58321 -26961 19827 -26138 -31746 16873 14334 26211 34681 29548 41129 59713 92185
16093 92185 105008 38422 -12209 10401 19123 21702 12527 55526 59914 65107 106517 115907 37259
16080 37259 37662 23093 -4240 -8233 2444 520 -30623 -41592 -27750 -16103 -32373 -27032 -34206
16067 -34206 -20356 -23052 -13797 25246 39305 21236 -4720 5771 23638 1578 -53255 -38303
16055 -38303 -29743 -19727 -38157 -50516 -18063 16141 -193 -7375 36773 38669 36712 -18924
16043 -18924 -48353 -76142 -53567 6105 64302 43677 -8948 -53248 -46720 -26383 -1229 -55502
16031 -55502 -71330 -59335 -55129 -44346 -44990 -80455 -80350 -64833 -5662 5582 -31872 -27236 -19660
16018 -19660 2582 4203 17503 2546 -24059 -33507 -33116 -27059 27052 62139 32393 51002 92074
$$ packed form
16105e8321L1360M6788m5965n608M8619k539J1877Q470n133J1581J8584L2472
16093I2185J2823o6586n0631K2610Q722K579r175M2999M388N193M1410R390p8648
16080C7259M03j4569k7333l993J0677j924l1143j0969J3842J1647j6270N341p174
16067c4206J3850k696R255L9043J4059j8069k5956J0491J7867k2060n4833J4952
16055c8303Q560J0016j8430j2359L2453L4204j6334p182M4148J896j957n5636
16043a8924k9429k7789K2575N9672N8197k0625n2625m4300O528K0337K5154n4273
16031e5502j5828J1995M206J0783o44l5465J05J5517N9171J1244l7454M636P576
16018a9660K2242J621J3300j4957k6605r448L91O057N4111L5087k9746J8609M1072
$$ plain form
16005 92074 86577 26827 -57134 -54095 -47075 -42652 -23273 -50189 -70763 -17647 -13729 1930 -12189
15992 -12189 -32086 -43334 -14029 -2481 -642 -9292 -2035 -4530 -11447 -12881 -16845 -50140 -19012
15979 -19012 19793 22870 18116 -27969 -45839 -55767 -38843 -10178 -42200 -22218 -182 6555
15967 6555 19274 14457 -27534 -36050 -31002 -30948 -10306 8539 16735 26638 40459 20810 -19165
15954 -19165 -13981 -484 27656 20944 -8026 -24015 -39511 -67881 -115212 -113841 -74678 -46220
15942 -46220 -33520 -42261 -58618 -57919 -51234 -30097 -38161 1174 54799 31464 -28648 -73993 -68530
15929 -68530 -40265 -19491 -21259 40046 6566 -25060 -30534 -49711 -72121 -36641 -12591 1613
15917 1613 1732 -3844 -6442 -20600 -22785 -25777 -25290 -22956 -24884 -31768 -26460 -18127 -17958 -37854 -100819
$$ packed form
16005I2074n497n9750q3961L039P020M423J9379k6916k0574N3116L918J5659j4119
15992a2189j9897j1248K9305J1548J839q650P257k495o917j434l964l3295L1128
15979a9012L8805L077m754m6085j7870r928J6924K8665l2022J9982K2036O737
15967F555J2719m817m1991q516N048N4K0642J8845Q196R903J3821j9649l9975
15954a9165N184J3497K8140o712k8970j5989j5496k8370m7331J371L9163K8458
15942d6220J2700q741j6357O99O685K1137q064L9335N3625k3335o0112m5345N463
15929f8530K8265K0774j768O1305l3480l1626n474j9177k2410L5480K4050J4204
15917A613J19n576k598j4158k185k992M87K334j928o884N308Q333J69j9896o2965
$$ plain form
15902 -100819 -100142 -51504 -14331 -6535 15231 33519 65208 54424 38972 22237 -1972 -5519
15890 -5519 13894 4828 -21779 -10943 2076 94 -5138 -10127 -21982 1334 9018 44698 65572
15877 65572 60796 33180 26651 34039 22407 -10889 -15277 -22859 -19371 -8273 -40606 -30655 -15297
15864 -15297 13247 21455 11859 -14212 11016 20473 13159 24530 10428 -32037 -72441 -60108
15852 -60108 -90713 -94424 -32732 -36967 -56436 -39761 -28650 7304 37600 20717 -19056 -24378
15840 -24378 -18373 -47194 -23539 -17055 -4597 28927 30605 33351 22811 -13605 7706 -3277
15828 -3277 -20530 -13209 -20641 -43150 -34961 9935 6516 6203 -15164 -12517 -25381 -33492 -16808
15815 -16808 -33145 -47998 -83653 -81411 -49987 -40323 -36904 -3200 12280 47440 43581 47525 11624
$$ packed form
15902a00819O77M8638L7173P796K1766J8288L1689j0784j5452j6735k4209l547
15890e519J9413r066k6607J0836J3019j982n232m989j1855K3316P684L5680K0874
15877F5572m776k7616o529P388j1632l3296m388p582L488J1098l2333R951J5358
15864a5297K8544Q208r596k6071K5228R457p314J1371j4102m2465m0404J2333
15852f0108l0605l711O1692m235j9469J6675J1111L5954L0296j6883l9773n322
15840b4378O005k8821K3655O484J2458L3524J678K746j0540l6416K1311j0983
15828c277j7253P321p432k2509Q189M4896l419l13k1367K647j2864q111J6684
15815a6808j6337j4853l5655K242L1424R664L419L3704J5480L5160l859L944l5901
$$ plain form
15802 11624 -21514 -21457 7341 11140 -19092 -30352 -22650 -25196 -31785 -48881 -70161 -31485 12847
15789 12847 -3726 -4680 19139 1065 -30943 -42021 7681 51861 58105 17271 -29315 -23205
15777 -23205 38594 32407 20895 7223 6648 8745 -13380 -19461 -24387 -32314 -74638 -88041 -68468
15764 -68468 -83218 -95106 -92486 -123292 -136269 -113703 -79883 -48991 -23999 -3391 -17434 -47376
15752 -47376 -61668 -55207 -97623 -112865 -120014 -71602 -34461 -50033 -54486 -35058 17181 42365
15740 42365 47070 44310 21052 -18991 -20290 -26125 -44726 -35869 -45102 -52179 -48207 -57935 -64963 -54713
15726 -54713 -47141 -13066 -4333 -5679 10274 36416 13071 -4382 -12535 274 25091 6173
15714 6173 -36098 -11639 31575 43246 20180 808 -36664 -48405 -43878 -31660 -19494 -38457
$$ packed form
15802A1624l3138N7K8798L799l0232j1260P702k546o589j7096k1280L8676M4332
15789A2847j6573r54K3819j8074l2008j1078M9702M4180O244m0834m6586O110
15777b3205O1799o187j1512j3672n75K097k2125o081m926p927m2324j3403J9573
15764f8468j4750j1888K620l0806j2977K2566L3820L0892K4992K0608j4043k9942
15752d7376j4292O461m2416j5242p149M8412L7141j5572m453J9428N2239K5184
15740D2365M705k760k3258m0043j299n835j8601Q857r233p077L972r728p028J0250
15726e4713P572L4075Q733j346J5953K6142k3345j7453q153J2809K4817j8918
15714F173m2271K4459M3214J1671k3066j9372l7472j1741M527J2218J2166j8963
$$ plain form
15702 -38457 -79888 -62976 21075 47172 13485 -26823 -39227 -12404 21167 28608 51680 24701
15690 24701 11659 5117 -2112 -3406 32820 65743 62418 5814 -11237 -30006 -68736 -64958 -40614
15677 -40614 -36562 -59064 -47893 -39461 -60618 -75431 -83063 -75904 -100106 -83289 3794 37485
15665 37485 46394 45790 42057 40819 -3002 -334 2830 -498 18199 40745 28682 29109 33066 -4255
15651 -4255 -33797 -13625 -20913 -51866 -35190 13953 20751 74123 82607 81068 12492 8735 48770
15638 48770 13420 13263 13999 6588 4015 2233 11654 7743 14321 26663 19469 -14446 -44575 -23845
15624 -23845 40688 58254 75915 57112 44463 16870 -28969 -9200 26158 32309 39353 47014
15612 47014 47507 7731 -9532 14938 -48896 -86526 -28655 38144 21232 -4957 13449 59987
$$ packed form
15702c8457m1431J6912Q4051K6097l3687m0308j2404K6823L3571P441K3072k6979
15690B4701j3042o542p229j294L6226L2923l325n6604j7051j8769l8730L778K4344
15677d0614M052k2502J1171Q432k1157j4813p632P159k4202J6817Q7083L3691
15665C7485Q909o04l733j238m3821K668L164l328J8697K2546j2063M27L957l7321
15651d255k9542K0172p288l0953J6676M9143O798N3372Q484j539o8576l757M0035
15638D8770l5350j57P36p411k573j782R421l911O578J2342p194l3915l0129K0730
15624b3845O4533J7566J7661j8803j2649k7593m5839J9769L5358O151P044P661
15612D7014M93l9776j7263K4470o3834l7630N7871O6799j6912k6189J8406M6538
$$ plain form
15600 59987 82709 73487 43566 46187 51321 24977 -5683 -20858 -21261 -4530 -4226 27849 19929
15587 19929 56015 45195 42097 14668 2737 24263 29336 41231 46431 25227 45234 48694
15575 48694 3163 1258 21976 -10046 -32883 -97097 -95477 -43734 -58720 -63159 -27103 9315
15563 9315 -16349 9754 26140 4497 -23528 -35859 -62170 -12553 48856 40813 -1777 -7522
15551 -7522 22325 50412 -15322 -14493 3297 -2304 -21498 -58269 -64772 -49236 -59539 -51380 -8521
15538 -8521 361 10867 -14235 -55573 -11249 66780 112607 96082 53308 56808 75387 81116
15526 81116 40524 22142 8469 -14938 -5845 35712 39505 -3738 -45006 -54999 -57352 -25245
15514 -25245 78 2922 15961 12371 21208 25379 -1686 -23678 323 30475 10226 -34085
$$ packed form
15600E9987K2722r222k9921K621N134k6344l0660j5175m03J6731L04L2075p920
15587A9929L6086j0820l098k7429j1931K1526N073J1895N200k1204K0007L460
15575D8694m5531j905K0718l2022k2837o4214J620N1743j4986m439L6056L6418
15563I315k5664K6103J6386k1643k8025j2331k6311M9617O1409q043m2590n745
15551g522K9847K8087o5734Q29J7790n601j9194l6771o503J5536j0303Q159M2859
15538h521Q882J0506k5102m1338M4324P8029M5827j6525m2774L500J8579N729
15526H1116m0592j8382j3673k3407R093M1557L793m3243m1268r993k353L2107
15514b5245K5323K844J3039l590Q837M171k7065k1992K4001L0152k0249m4311
$$ plain form
15502 -34085 -18798 22831 49837 54058 21973 -14829 3038 2429 -14943 37166 41169 31183 36050
15489 36050 39232 55049 65497 78428 93620 51480 -20159 -39384 -51420 -32295 14472 -6703
15477 -6703 -42263 -18105 2234 13769 -20763 -31973 -45098 -26952 7875 17178 782 -35479
15465 -35479 -17545 1998 19158 28933 7509 12314 29873 33957 10633 76612 76199 30247 18878
15452 18878 39325 33961 31234 16759 -34704 -37560 -55902 -53693 -53910 -70335 -40466 -55739 -63306
15439 -63306 -31310 -43813 -46315 -38591 -38720 -2043 15729 17769 13908 -4240 -15164 -20950 12733
15426 12733 17067 30217 8403 22365 10316 10668 7056 -23240 -39904 -43948 -24824 -22795 -47342
15413 -47342 -93512 -59964 -9554 23381 4217 -6916 7309 11530 37704 24810 -37083 -21140
$$ packed form
15502c4085J5287M1629K7006M221l2085l6802J7867o09j7372N2109M003r986M867
15489C6050L182J5817J0448J2931J5192m2140p1639j9225j2036J9125M6767k1175
15477f703l5560K4158K0339J1535l4532j1210j3125J8146L4827R303j6396l6261
15465c5479J7934J9543J7160R775k1424M805J7559M084k3324O5979m13m5952j1369
15452A8878K0447n364k727j4475n1463k856j8342K209k17j6425K9869j5273p567
15439f3306L1996j2503k502P724j29L6677J7772K040l861j8148j0924n786L3683
15426A2733M334J3150k1814J3962j2049L52l612l0296j6664m044J9124K029k4547
15413d7342m6170L3548N0410L2935j9164j1133J4225M221K6174j2894o1893J5943
$$ plain form
15401 -21140 -19533 -77508 -94253 -62783 -2061 42480 7174 5747 -18087 -44505 -39880 -42111
15389 -42111 -24408 -23639 -17272 -48982 -28100 36 34116 17982 31879 77592 69354 38475
15377 38475 47480 48492 47797 45812 56740 30486 9465 -21239 -3914 9553 20702 50124 69658
15364 69658 56989 58695 76515 98153 48142 35590 30253 52751 45654 14790 -19684 -57782
15352 -57782 -69080 -61590 -69214 -60586 -77040 -74101 -74761 -66840 -71297 -87138 -67748 -38284 -23734
15339 -23734 9361 45556 21604 -8851 -57886 -52392 -24932 -23486 -23206 -16950 -16371 -11153 8092
15326 8092 42096 203 -30743 -49833 -65917 -36158 12292 -4852 9564 1998 -15588 -36912
15314 -36912 -30787 -37486 -31781 6402 18107 12030 -30771 -43854 16863 14402 19470 -47272 -82677
$$ packed form
15401b1140J607n7975j6745L1470O0722M4541l5306j427k3834k6418M625k231
15389d2111J7703P69O367l1710K0882K8136L4080j6134J3897M5713q238l0879
15377C8475R005J012o95j985J0928k6254k1021l0704J7325J3467J1149K9422J9534
15364F9658j2669J706J7820K1638n0011j2552n337K2498p097l0864l4474l8098
15352e7782j1298P490p624Q628j6454K939o60P921m457j5841J9390K9464J4550
15339b3734L3095L6195k3952l0455m9035N494K7460J446K80O256N79N218J9245
15326H092L4004m1893l0946j9090j6084K9759M8450j7144J4416p566j7586k1324
15314c6912O125o699N705L8183J1705o077m2801j3083O0717k461N068o6742l5405
$$ plain form
15301 -82677 -81969 -78590 -51408 -86533 -74544 -64687 -96261 -111056 -83447 -48781 1360 44158
15289 44158 -4351 -51152 -44525 -11911 -9716 -10306 -24664 -43416 -20830 -32301 -36328 -21879 -33650
15276 -33650 1754 16489 21339 33190 77245 43560 1346 -54785 -41185 -62836 -62094 -50258
15264 -50258 -32170 -44874 -81255 -83319 -33662 5375 18987 -10200 16525 -10927 -2302 -23590
15252 -23590 -21231 31616 32418 2533 -7040 -16226 1843 -26426 -67699 -105366 -98345 -67197 -28547
15239 -28547 -4719 -23247 37566 48672 -497 -37364 -65043 -70583 -52066 -37143 2758 35455
15227 35455 26559 10311 8371 9529 4416 24186 17327 -10016 9590 19127 27846 24109 17012
15214 17012 24236 -5781 978 -10259 -8291 31631 23435 18968 -12774 13993 31808 -11327 -36025
$$ packed form
15301h2677P08L379K7182l5125J1989R857l1574j4795K7609L4666N0141M2798
15289D4158m8509m6801O627L2614K195n90j4358j8752K2586j1471m027J4449j1771
15276c3650L5404J4735M850J1851M4055l3685m2214n6131J3600k1651P42J1836
15264e0258J8088j2704l6381k064M9657L9037J3612k9187K6725k7452Q625k1288
15252b3590K359N2847Q02k9885r573r186J8069k8269m1273l7667P021L1148L8650
15239b8547K3828j8528O0813J1106m9169l6867k7679n540J8517J4923L9901L2697
15227C5455q896j6248j940J158n113J9770o859k7343J9606R537Q719l737p097
15214A7012P224l0017O759j1237J968L9922q196m467l1742K6767J7815m3135k4698
$$ plain form
15201 -36025 -21619 -488 33056 6883 -496 -321 -10676 -8078 -58318 -52858 -16005 2151 6871
15188 6871 -21268 2124 -20736 -27253 -21521 -38249 -17390 -31439 -63488 -73770 -72993 -30041 -15366
15175 -15366 -21500 -30602 -60661 -50089 -78765 -100357 -44601 6758 -13177 -79995 -65355 -4999
15163 -4999 28039 18811 -8249 -9765 36036 16421 -23591 -27680 -17108 9060 -5216 232 28821
15150 28821 6934 -16071 20096 44773 78668 54204 6030 -8040 -26900 -10509 16408 -13482
15138 -13482 -29728 -36575 -9403 -6944 -21263 -31319 -56339 -59464 -74592 -65483 -62513 -66920 -44781
15125 -44781 -36609 -26838 13154 -10486 -27208 20336 62449 46568 -6373 -40411 -54910 -42117
15113 -42117 -36817 -8679 10413 17417 22341 24019 60040 35323 11173 -7061 -42383 -47656 -39155
$$ packed form
15201c6025J4406K1131L3544k6173p379J75j0355K598n0240N460L6853J8156M720
15188F871k8139K3392k2860o517N732j6728K0859j4049l2049j0282P77M2952J4675
15175a5366o134r102l0059J0572k8676k1592N5756N1359j9935o6818J4640O0356
15163d999L3038r228k7060j516M5801j9615m0012m089J0572K6168j4276N448K8589
15150B8821k1887k3005L6167K4677L3895k4464m8174j4070j8860J6391K6917k9890
15138a3482j6246o847K7172K459j4319j0056k5020l125j5128R109K970m407K2139
15125d4781Q172R771L9992k3640j6722M7544M2113j5881n2941l4038j4499J2793
15113d2117N300K8138J9092P004M924J678L6021k4717k4150j8234l5322n273Q501
$$ plain form
15100 -39155 -41805 -16777 16145 -2588 -35906 2673 4483 24453 26094 17359 30871 4165
15088 4165 -23366 -16364 -12817 -49157 -102975 -87122 -91952 -72120 -15377 -10333 -10520 -16096 -7194
15075 -7194 -4909 -10564 -33174 -95016 -88376 -71613 -73042 -42937 15851 32051 16574 -21089 -25675
15062 -25675 9170 26096 20844 -17752 -14202 -36832 -26519 -35022 -25508 -16649 -25661 -6216 -27018
15049 -27018 3070 -8136 -14107 -28828 -25731 -24212 -22328 -30700 -24470 -41773 -39887 -57677 -27209
15036 -27209 -19266 -49074 -52170 -80188 -75703 9453 72380 20981 -19551 -48566 -101699 -67999
15024 -67999 -45851 -57595 -98916 -77465 -25616 4884 -8123 -18607 -22175 -32604 -32451 -10320
15012 -10320 44834 60332 79414 87639 87551 85983 122355 246289 474809 736154 812201 732379
$$ packed form
15100c9155k650K5028L2922j8733l3318L8579J810J9970J641q735J3512k6706
15088D165k7531P002L547l6340n3818J5853m830J9832N6743N044j87n576Q902
15075g194K285n655k2610o1842O640J6763j429L0105N8788J6200j5477l7663m586
15062b5675L4845J6926n252l8596L550k2630J0313q503R514Q859r012J9445k0802
15049b7018L0088j1206n971j4721L097J519J884q372O230j7303J886j7790L0468
15036b7209P943k9808l096k8018M485Q5156O2927n1399m0532k9015n3133L3700
15024f7999K2148j1744m1321K1451N1849L0500j3007j0484l568j0429J53K2131
15012a0320N5154J5498J9082Q225q8j568L6372J23934K28520K61345P6047p9822
$$ plain form
15000 732379 588977 364671 185685 134767 120417 98645 51016 -20652 -29515 34137 37871
14989 37871 37915 1879 -13326 -4038 46712 32250 15133 25645 20506 10498 58236 69708 87525
14976 87525 48107 2966 -2601 -13243 -35573 -55444 -40207 -8268 -15180 -12665 -10091 26681
14964 26681 3368 -41455 -24704 9976 -20264 -55393 -55709 -619 -23018 -96631 -64882 -52030
14952 -52030 -37603 -41649 -16629 -33511 -53792 -8339 -33311 -46620 21939 44750 26514 22130
14940 22130 37146 76362 73441 66264 55685 11315 6139 33117 35499 75301 63557 32058
14928 32058 -14550 -20860 -32996 -43241 -42611 -1445 -11392 -35903 -59390 -15345 -8006 18034 -10987
14915 -10987 -16980 -15936 290 -2635 38267 37923 43450 11917 -47045 -82077 -70813 -49418 -46604
$$ packed form
15000G32379j43402k24306j78986n0918j4350k1772m7629p1668q863O3652L734
14989C7871M4l6036j5205R288N0750j4462j7117J0512n139j0008M7738J1472J7817
14976H7525l9418m5141n567j0642k2330j9871J5237L1939o912K515K574L6772
14964B6681k3313m4823J6751L4680l0240l5129l16N5090k2399p3613L1749J2852
14952e2030J4427m046K5020j6882k0281M5453k4972j3309O8559K2811j8236m384
14940B2130J5016L9216k921p177j0579m4370n176K6978K382L9802j1744l1499
14928C2058m6608o310j2136j0245O30M1166r947k4511k3487M4045P339K6040k9021
14915a0987n993J044J6226k925M0902l44N527l1533n8962l5032J1264K1395K814
$$ plain form
14902 -46604 -44010 -15677 -5262 -22997 -2565 5730 -3755 -6712 3520 -49476 -100503 -67192
14890 -67192 -47175 10650 22366 -17311 -42310 -47833 -76723 -96849 -98905 -61093 -13240 -31156
14878 -31156 -40229 -19631 -5429 -6752 8365 -5598 -10503 -8737 20960 33449 6361 -21684
14866 -21684 -21455 -37829 -30396 -14795 -912 -23432 -33985 13152 15077 64521 71365 6257 -32890
14853 -32890 -41247 -62590 -66622 -58438 -60952 -13272 -5035 -9701 -8272 6957 27547 62092 35888
14840 35888 17635 2686 55013 62692 6923 -21306 -21635 -14510 20640 6159 3261 -16565 -7128
14827 -7128 39452 44659 26683 -31024 -40210 -14036 -29181 2527 9022 -11689 27088 42817
14815 42817 16577 43759 68238 33363 39040 48973 52525 2351 -38582 3410 -21463 -17126
$$ packed form
14902d6604K594K8333J0415j7735K0432Q295r485k957J0232n2996n1027L3311
14890f7192K0017N7825J1716l9677k4999n523k8890k0126k056L7812M7853j7916
14878c1156r073K0598J4202j323J5117j3963m905J766K9697J2489k7088k8045
14866b1684K29j6374P433J5601J3883k2520j0553M7137J925M9444O844o5108l9147
14853c2890q357k1343m032Q184k514M7680Q237m666J429J5229K0590L4545k6204
14840C5888j8253j4949N2327P679n5769k8229l29P125L5150j4481k898j9826R437
14827g128M6580N207j7976n7707r186K6174j5145L1708O495k0711L8777J5729
14815D2817k6240K7182K4479l4875N677R933L552n0174m0933M1992k4873M337
$$ plain form
14803 -17126 -47275 -96699 -138639 -141219 -91380 -39723 5655 25916 2459 -58365 -86378 -86049
14791 -86049 -61869 -62836 -75860 -42561 -27113 -13633 12289 56904 41114 -1457 -22742 -19803
14779 -19803 4077 5385 18845 11197 -9610 28550 26868 21523 24359 38276 23699 12124 -921
14766 -921 -25610 -30322 -24626 -17909 1601 2238 -2930 -2174 35151 44211 10585 13685 38349 34388
14752 34388 37601 12127 -10718 -910 30912 13746 4970 -8652 -12970 1672 -26701 -35236 -21365
14739 -21365 -36795 -67703 -69985 -44239 -23654 -32516 -54330 -28574 -15049 6794 1797 -17354
14727 -17354 -6269 -11015 -573 3676 -2569 18366 6985 -5366 -12346 -1578 -16409 -25391 1748
14714 1748 16878 31978 7464 -34204 -47478 1658 72574 91521 69111 41192 25123 17656
$$ packed form
14803a7126l0149m9424m1940k580M9839N1657M5378K0261k3457o0824k8013L29
14791h6049K4180r67j3024L3299J5448J3480K5922M4615j5790m2571k1285K939
14779a9803K3880J308J3460p648k0807L8160j682n345K836J3917j4577j1575j3045
14766i21k4689m712N696O717J9510O37n168P56L7325R060l3626L100K4664l961
14752C4388L213k5474k2845R808L1822j7166q776j3622m318J4642k8373q535J3871
14739b1365j5430l0908k282K5746K0585q862k1814K5756J3525K1843m997j9151
14727a7354J1085m746J0442M249o245K0935j1381j2351o980J0768j4831q982K7139
14714A748J5130J5100k4514m1668j3274M9136P0916J8947k2410k7919j6069p467
$$ plain form
14702 17656 22571 30314 49364 18778 -13632 -31397 -14898 -23298 -33475 13272 31562 7441
14690 7441 -1580 -695 -20292 -33072 -24372 -9201 29156 54464 32046 23540 -584 13663 9114
14677 9114 -32206 -67134 -83663 -66078 -22310 -47964 -12534 -20492 15534 70421 86174 58290
14665 58290 45026 58747 42980 18008 20817 37019 26350 6421 41512 29412 -6125 -16340
14653 -16340 -1739 -21867 -4878 54981 35450 -15236 -19165 -1116 21721 22981 47658 50032
14641 50032 41784 31164 38443 16660 -28384 -48422 -73068 -49804 -60564 -81560 -22459 5788
14629 5788 -39405 -41879 -67274 -97205 -100926 -42250 -7116 4698 -17922 -41962 -40024 -41104 -61697
14616 -61697 -62763 -67249 -52859 -61283 -44343 3743 18298 -1491 -21820 -16426 15873 -17448
$$ packed form
14702A7656M915P743J9050l0586l2410j7765J6499q400j0177M6747J8290k4121
14690G441r021Q85j9597j2780Q700J5171L8357K5308k2418q506k4124J4247m549
14677I114m1320l4928j6529J7585M3768k5654L5430p958L6026N4887J5753k7884
14665E8290j3264J3721j5767k4972K809J6202j0669j9929L5091j2100l5537j0215
14653a6340J4601k0128J6989N9859j9531n0686l929J8049K2837J260K4677K374
14641E0032q248j0620P279k1783m5044k0038k4646K3264j0760k0996N9101K8247
14629E788m5193k474k5395k9931l721N8676L5134J1814k2620k4040J938j080k0593
14616f1697j066m486J4390q424J6940M8086J4555j9789k0329N394L2299l3321
$$ plain form
14604 -17448 -11384 15417 27317 31957 19895 7488 42103 37258 1243 7487 -25933 -35720 -57333
14591 -57333 -47934 -11765 -36157 -27328 -33829 -64770 -21731 30554 22752 11168 5759 1288 35066
14578 35066 4930 30870 26056 4613 3615 17134 29636 26372 25569 40648 15262 539 49297
14565 49297 36122 33247 32782 38857 6184 -4315 -28045 685 28534 27898 2651 -27173 -10698
14552 -10698 1854 20655 34686 -7770 -41683 -46938 -28062 -13804 -588 22024 37833 15786
14540 15786 -13350 -22102 -36085 -16340 -28854 -59493 -32919 -13762 36685 45780 -3361 -39080
14528 -39080 -98269 -99838 -15932 15574 39036 39247 22062 11554 -1470 18428 -18204 -46105
14516 -46105 5943 59703 50049 7163 -5047 27156 8485 62343 87822 52254 6816 -46390
$$ packed form
14604a7448O064K6801J1900M640j2062j2407L4615m845l6015O244l3420r787k1613
14591e7333R399L6169k4392Q829o501l0941M3039N2285p802j1584n409m471L3778
14578C5066l0136K5940m814k1443r98J3519J2502l264q03J5079k5386j4723M8758
14565D9297j3175k875m65O075l2673j0499k3730K8730K7849o36k5247k9824J6475
14552a0698J2552J8801J4031m2456l3913n255J8876J4258J3216K2612J5809k2047
14540A5786k9136q752j3983J9745j2514l0639K6574J9157N0447R095m9141l5719
14528c9080n9189j569Q3906L1506K3462K11j7185j0508j3024J9898l6632k7901
14516d6105N2048N3760r654m2886j2210L2203j8671N3858K5479l5568m5438n3206
$$ plain form
14504 -46390 -53433 -58089 -27359 -26744 13816 21899 -13640 -28153 -17 2713 -11887 -36464 -43777
14491 -43777 -58921 -48314 -49842 -43816 -51828 -36814 -11277 -2429 6731 -17553 3252 14194 12192
14478 12192 -18158 -28502 -13959 -10509 -29846 -41790 15244 30831 15982 25710 44963 -29497
14466 -29497 -65656 -39346 -36948 -1002 58290 49648 20407 23957 11751 26507 41772 50677
14454 50677 43303 31573 -17959 -10808 29665 51494 -2763 8625 -6783 -16309 6963 35271
14442 35271 65855 20006 -92 3324 12078 39575 49872 60277 28436 10742 5178 16579
14430 16579 31303 2047 41346 48162 43036 44094 34275 2108 -18215 -2709 26090 46210
14418 46210 47409 83883 51595 3706 -13854 -53072 -69577 -27901 -22746 265 1632 37206
$$ packed form
14504d6390p043m656L0730O15M0560Q083l5539j4513K8136K730j4600k4577p313
14491d3777j5144J0607j528O026q012J5014K5537Q848R160k4284K0805J0942k002
14478A2192l0350j0344J4543L450j9337j1944N7034J5587j4849R728J9253p4460
14466b9497l6159K6310K398L5946N9292q642k9241L550j2206J4756J5265Q905
14454E0677p374j1730m9532P151M0473K1829n4257J1388j5408r526K3272K8308
14442C5271L0584m5849k0098L416Q754K7497J0297J0405l1841j7694n564J1401
14430A6579J4724k9256L9299O816n126J058r819l2167k0323J5506K8799K0120
14418D6210J199L6474l2288m7889j7560l9218j6505M1676N155K3011J367L5574
$$ plain form
14406 37206 88977 72051 59794 12056 -20333 605 3165 30222 91264 106323 113218 70030
14394 70030 44655 30222 10386 -22737 9358 -11997 11544 36058 32624 -349 21059 32363
14382 32363 31293 5888 -43802 -31592 9166 7217 -21795 -7083 -36699 -92053 -102573 -43807
14370 -43807 -17902 -45661 -41850 -3785 -35570 -31810 -13324 23064 48635 44371 56543 27406
14358 27406 14611 12521 32424 12519 -48103 -80857 -64916 -56111 -21516 -15888 -14551 30546
14346 30546 41283 27723 40897 20488 -14573 -17220 18976 31083 25645 45581 54497 58929
14334 58929 78384 102727 75945 37321 69132 78943 26731 -38533 -4228 -26284 7579 10089
14322 10089 -12633 -4691 -12044 -19030 -13483 -32222 -44661 -24560 11882 5579 11606 33382 58961
$$ packed form
14406C7206N1771j6926j2257m7738l2389K0938K560K7057O1042J5059O895m3188
14394G0030k5375j4433j9836l3123L2095k1355K3541K4514l434l2973K1408J1304
14382C2363j070k5405m9690J2210M0758j949k9012J4712k9616n5354j0520N8766
14370d3807K5905k7759L811L8065l1785L760J8486L6388K5571m264J2172k9137
14358B7406j2795k090J9903j9905o0622l2754J5941Q805L4595N628J337M5097
14346C0546J0737j3560J3174k0409l5061k647L6196J2107n438J9936Q916M432
14334E8929J9455K4343k6782l8624L1811R811n2212o5264L4305k2056L3863K510
14322A0089k2722P942p353o986N547j8739j2439K0101L6442o303O027K1776K5579
$$ plain form
14309 58961 76998 64564 72900 86682 107845 96078 39864 25063 24607 59906 48738 8632
14297 8632 19597 18119 19680 51584 19259 -21926 -11744 -7339 1001 -17077 -36214 4610 21607
14284 21607 -6194 -14407 -20195 -36516 -14111 37059 49070 20502 -7291 5849 41871 21809
14272 21809 -53792 -20905 -31940 -52666 -44784 4245 35091 13560 14765 -15323 -10699 34275
14260 34275 56335 36723 -2607 -32379 -66405 -24886 -33439 -50177 -34276 -20440 5729 -8788
14248 -8788 -35968 -29566 -40809 -25470 -12796 -4246 -16140 -31379 -3590 17897 495 -11930
14236 -11930 -10117 -4947 -4027 13417 44799 71340 92499 88544 62113 62881 -1856 -42595 -31483
14223 -31483 -53648 -38679 -16372 20892 53806 33392 8018 21482 7648 -22480 -8093 -29137
$$ packed form
14309E8961J8037j2434Q336J3782K1163j1767n6214j4801m56L5299j1168m0106
14297H632J0965j478J561L1904l2325m1185J0182M405Q340j8078j9137M0824J6997
14284B1607k7801q213n788j6321K2405N1170J2011k8568k7793J3140L6022k0062
14272B1809p5601L2887j1035k0726P882M9029L0846k1531J205l0088M624M4974
14260C4275K2060j9612l9330k9772l4026M1519q553j6738J5901J3836K6169j4517
14248h788k7180O402j1243J5339J2674Q550j1894j5239K7789K1487j7402j2425
14236a1930J813N170R20J7444L1382K6541K1159l955k6431P68o4737m0739J1112
14223c1483k2165J4969K2307L7264L2914k0414k5374J3464j3834l0128J4387k1044
$$ plain form
14211 -29137 -39963 -20231 -16141 -34198 381 40304 38019 18318 20291 29267 -2011 50135
14199 50135 91538 77025 63908 30778 56634 48660 37685 57506 58847 67619 70161 87356
14187 87356 98567 67030 50945 45612 53523 90349 89215 88657 112583 112340 163045 174947 175746
14174 175746 169349 243546 346948 477042 716266 986254 1369742 1928563 2392919 2404274
14164 2404274 2039927 1543517 1092594 754446 533670 384168 284107 255316 248508 214238
14154 214238 186986 158175 133870 125861 57672 31208 44078 86132 116360 105439 103671 49191
14142 49191 47298 65638 39486 26411 48076 87767 52087 37705 62981 33509 13318 14630
14130 14630 -7060 -4509 -8752 3783 6107 -202 14366 38284 70531 85052 90639 130884 104647
$$ packed form
14211b9137j0826J9732M090j8057L4579L9923k285j9701J973Q976l1278N2146
14199E0135M1403j4513j3117l3130K5856p974j0975J9821J341Q772K542J7195
14187H7356J1211l1537j6085n333P911L6826j134n58K3926k43N0705J1902P99
14174A75746o397P4197J03402J30094K39224K69988L83488N58821M64356J1355
14164B404274l64347m96410m50923l38148k20776j49502j00061k8791o808l4270
14154B14238k7252k8811k4305q009o8189k6464J2870M2054L0228j0921j768n4480
14142D9191j893J8340k6152j3075K1665L9691l5680j4382K5276k9472k0191J312
14130A4630k1690K551m243J2535K324o309J4568K3918L2247J4521N587M0245k6237
$$ plain form
14117 104647 82003 60483 8589 37800 127158 170370 224701 269915 303864 378993 480316
14106 480316 610935 778112 1065833 1542173 2394994 3528725 4014150 3608007 2845166
14097 2845166 1974747 1324850 948757 677871 513685 405650 352130 302499 302127 293357 277950
14086 277950 258567 189314 141849 118722 95237 61122 50865 57892 11165 -8937 36338 21018
14074 21018 5200 3181 15786 20065 27789 66517 64400 52066 39105 25788 10677 -5004
14062 -5004 -8453 -13573 27325 -2042 226 30282 81198 81521 96568 31513 54542 72182 97634
14049 97634 86102 65307 50904 38275 47438 -2951 -31826 -27387 -10738 -21123 -49585 -35888
14037 -35888 -55212 -59806 -53651 -13092 28230 -14922 -53623 -21662 -10825 -20815 -18178 -23830 -23123
$$ packed form
14117A04647k2644k1520n1894K9211Q9358M3212N4331M5214L3949P5129J01323
14106D80316J30619J67177K87721M76340Q52821J133731M85425m06143p62841
14097B845166q70419o49897l76093k70886j64186j08035n3520m9631l72q770j5407
14086B77950j9383o9253m7465k3127k3485l4115j0257P027m6727k0102M5275j5320
14074B1018j5818k019J2605M279P724L8728k117j2334j2961j3317j5111j5681
14062e004l449n120M0898k9367K268L0056N0916L23J5047o5055K3029J7640K5452
14049I7634j1532k0795j4403j2629R163n0389k8875M439J6649j0385k8462J3697
14037c5888j9324m594O155M0559M1322m3152l8701L1961J0837r990K637n652P07
$$ plain form
14024 -23123 -3726 15245 32236 39371 61239 40813 40215 57253 43506 14305 -6064 12192
14012 12192 48542 96118 89703 70622 92027 108253 86531 105235 82896 50623 54877 88347
14000 88347 66106 30427 -15539 -53623 -24967 46045 84912 106610 122999 162581 172120 114260
13988 114260 74993 62391 6316 873 9015 5836 285 -771 5245 28377 21312 35505 15028
13975 15028 8673 5955 19319 23282 27348 71262 83280 59885 38187 3929 -18678 -16637 44329
13962 44329 61761 11484 -55228 -29129 46720 24983 -11512 12510 19630 36500 67089 88724
13950 88724 127708 142806 160710 164769 183046 198740 203424 231249 246011 206778 133847 103977
13938 103977 82489 55912 52861 36334 52018 68010 115054 100963 65441 39059 38332 61441
$$ packed form
14024b3123J9397J8971J6991P135K1868k0426n98J7038j3747k9201k0369J8256
14012A2192L6350M7576o415j9081K1405J6226k1722J8704k2339l2273M254L3470
14000H8347k2241l5679m5966l8084K8656P1012L8867K1698J6389L9582R539n7860
13988A14260l9267j2602n6075n443Q142l179n551j056O016K3132p065J4193k0477
13975A5028o355k718J3364L963M066M3914J2018k3395k1698l4258k2607K041O0966
13962D4329J7432n0277o6712K6099P5849k1737l6495K4022P120J6870L0589K1635
13950H8724L8984J5098J7904M059J8277J5694M684K7825J4762l9233p2931k9870
13938A03977k1488k6577l051j6527J5684J5992M7044j4091l5522k6382p27K3109
$$ plain form
13926 61441 57755 56488 58767 38649 37027 37605 66765 39567 29404 12171 18691 33702 53459
13913 53459 66603 88483 107783 68429 63671 64661 54783 69366 111724 131011 195086 267679
13901 267679 257771 198411 123280 64476 52741 11153 1449 41227 86948 105618 116019 113853
13889 113853 139939 140236 100801 42238 4824 12485 60690 114413 125889 115383 126923 158191
13877 158191 197803 224145 180466 127914 103857 74615 35951 35027 59222 47222 82732 83363
13865 83363 104320 131215 149178 160723 146025 111390 56979 80928 67290 15565 -22601 11608
13853 11608 34133 23637 -17568 -37558 -13106 -47976 -48222 -61270 -108985 -117484 -97315 -27207
13841 -27207 54296 102231 103485 75003 90103 91929 49667 45990 54571 50192 87211 156561 149618
$$ packed form
13926F1441l686j267K279k0118j622N78K9160k7198j0163j7233O520J5011J9757
13913E3459J3144K1880J9300l9354m758R90r878J4583M2358J9287O4075P2593
13901B67679r908n9360p5131n8804j1735m1588r704L9778M5721J8670J0401k166
13889A13853K6086K97l9435n8563l7414P661M8205N3723J1476j0506J1540L1268
13877A58191L9612K6342m3679n2552k4057k9242l8664r24K4195j2000L5510O31
13865H3363K0957K6895J7963J1545j4698l4635n4411K3949j3638n1725l8166L4209
13853A1608K2525j0496m1205j9990K4452l4870k46j3048m7715q499K0169P0108
13841b7207Q1503M7935J254k8482J5100J826m2262l677Q581m379L7019O9350o943
$$ plain form
13828 149618 136606 197425 163793 145757 126715 120032 143589 138410 128912 138844 193963 341063
13816 341063 401797 318280 261553 213280 187881 186726 186134 198205 200890 232876 239821 212211
13804 212211 201747 242030 207357 177631 197422 168324 149582 105386 93497 139234 162967
13793 162967 143737 191868 228664 292831 308602 268888 273441 264134 247814 228327 226485 171091
13781 171091 203081 300421 329348 283731 274034 333817 403756 397395 381311 384804 401454 414153
13769 414153 433056 394236 357969 368811 351029 328338 374572 415544 444368 506753 504643 492750
13757 492750 497866 517520 517392 497853 484796 507215 515656 539470 542816 594656 652395 704050
13745 704050 743412 820328 958034 998751 940589 899095 936700 1028295 1087470 1153383 1241131
$$ packed form
13828A49618j3012O0819l3632j8036j9042o683K3557n179r498R932N5119J47100
13816C41063O0734q3517n6727m8273k5399j155n92J2071K685L1986O945k7610
13804B12211j0464M0283l4673k9726J9791k9098j8742m4196j1889M5737K3733
13793A62967j9230M8131L6796O4167J5771l9714M553r307j6320j9487j842n5394
13781A71091L1990R7340K8927m5617r697N9783O9939o361j6084L493J6650J2699
13769D14153J8903l8820l6267J0842j7782k2691M6234M0972K8824O2385k110j1893
13757D92750N116J9654j28j9539j3057K2419Q441K3814L346N1840N7739N1655
13745G04050L9362P6916J37706M0717n8162m1494L7605R1595N9175O5913Q7748
$$ plain form
13734 1241131 1266842 1298778 1385824 1514055 1638107 1725037 1744833 1769564 1847063 1996434 2151843
13723 2151843 2233096 2317164 2337420 2435846 2670231 2981516 3282858 3583392 3891648 4189775
13713 4189775 4459140 4821260 5253381 5831383 6588273 7633878 8997581 10490292 12089574
13704 12089574 13973153 16486920 20024087 24432893 29710519 36861148 46951668 61218318
13696 61218318 80736680 108153958 150991518 224553566 343378427 462103707 474784344
13689 474784344 410488228 314168404 212383638 140336462 97994213 73210866 57733758
13682 57733758 47430645 40319475 35194176 30940013 26798709 22951950 19591156 16888548
13674 16888548 14866581 13364445 12277692 11625585 11211294 10514255 9376925 8106251
$$ packed form
13734A241131K5711L1936Q7046J28231J24052Q6930J9796K4731P7499J49371J55409
13723B151843Q1253Q4068K0256R8426K34385L11285L01342L00534L08256K98127
13713D189775K69365L62120M32121N78002P56890J045605J363703J492711J599282
13704A2089574J883579K513767L537167M408806N277626P150629J0090520J4266650
13696F1218318J9518362K7417278M2837560P3562048J18824861J18725280J2680637
13689D74784344o4296116r6319824j01784766p2047176m2342249k4783347j5477108
13682E7733758j0303113p111170n125299m254163m141304l846759l360794k702608
13674A6888548k021967j502136j086753o52107m14291o97039j137330j270674
$$ plain form
13666 8106251 6853529 5820956 5039329 4532835 4216826 3987460 3746994 3405517 3124770
13657 3124770 2899155 2767967 2622766 2451649 2316472 2187910 2042925 1889792 1784280
13648 1784280 1738705 1713029 1668456 1622498 1549299 1559779 1534787 1538531 1592695 1704836 1844518
13637 1844518 1954895 2117347 2287070 2378623 2254493 2143899 2077990 2099969 2085658 1990767
13627 1990767 1885870 1685242 1481467 1239999 1040928 921863 816817 775512 718189 668848
13617 668848 644245 632253 650686 680379 658301 602659 570200 589347 554958 479624 506770
13606 506770 520366 550147 539445 501757 489979 487506 482737 494201 459577 422087 361903 339288
13594 339288 350155 345330 335683 356365 336897 350783 376507 356353 425202 465882 423569 434672
$$ packed form
13666H106251j252722j032573p81627n06494l16009k29366k40466l41477k80747
13657C124770k25615j31188j45201j71117j35177j28562j44985j53133j05512
13648A784280m5575k5676m4573m5958p3199J0480k4992L744N4164J12141J39682
13637A844518J10377J62452J69723R1553j24130j10594o5909K1979j4311r4891
13627A990767j04897k00628k03775k41468j99071j19065j05046m1305n7323m9341
13617F68848k4603j1992J8433K9693k2078n5642l2459J9147l4389p5334K7146
13606E06770J3596K9781j0702l7688j1778k473m769J1464l4624l7490o0184k2615
13594C39288J0867m825r647K0682j9468J3886K5724k0154O8849M0680m2313J1103
$$ plain form
13582 434672 463101 473407 427831 343977 316458 345243 294521 228699 186637 200833 234856
13571 234856 264101 298985 304519 308706 302514 274529 221598 197085 219572 211516 200950 189600
13559 189600 171774 173788 151581 117497 122477 201219 264704 237781 198387 136359 143279 158124
13547 158124 176588 207297 217401 216153 214339 240118 241233 247082 263085 271822 274047 295025 251831
13534 251831 224576 226648 233627 271705 254362 255291 230839 216846 213697 182307 153702 182645
13522 182645 194287 195906 143237 91708 92949 112598 127554 121168 104373 83684 73095 66821
13510 66821 87659 86315 69495 42829 -14029 -38039 2827 -104 21453 49513 65100 63620
13498 63620 22641 4906 15818 64173 61548 4725 -7779 5507 39074 62420 98084 114648
$$ packed form
13582D34672K8429J0306m5576q3854k7519K8785n0722o5822m2062J4196L4023
13571B34856K9245L4884N534M187o192k7985n2931k4513K2487q056j0566j1350
13559A89600j7826K014k2207l4084M980P8742O3485k6923l9394o2028O920J4845
13547A58124J8464L0709J0104j248j814K5779J115N849J6003Q737K225K0978m3194
13534B51831k7255K072O979L8078j7343R29k4452j3993l149l1390k8605K8943
13522A82645J1642J619n2669n1529J241J9649J4956o386j6795k0689j0589o274
13510F6821K0838j344j6820k6666n6858k4010M0866k931K1557K8060J5587j480
13498F3620m0979j7735J0912M8355k625n6823j2504J3286L3567K3346L5664J6564
$$ plain form
13486 114648 118848 113594 105039 58437 47625 49488 54213 49919 91081 81507 47903 32850 43744
13473 43744 25844 42732 62221 85090 97583 81710 89271 114915 136628 122568 116624 51645
13461 51645 18009 11613 31239 64167 56433 11703 49230 83082 53046 34950 56705 45158
13449 45158 40497 34250 -1542 19325 18301 27348 49017 52015 59461 83011 111075 135886 171447
13436 171447 142952 77650 59320 50731 66925 67989 38026 25648 51949 71854 96203 105387
13424 105387 90604 64475 63898 104633 88932 26927 -16470 -15041 10667 -3398 22211 25602
13412 25602 45954 51227 48897 52544 67578 64681 25878 24085 43243 60071 81511 31558 23085
13399 23085 16779 -9677 15959 42783 103922 127995 82461 48200 14771 -19778 -37795 -32967
$$ packed form
13486A14648M200n254q555m6602j0812J863M725m294M1162r574l3604j5053J0894
13473D3744j7900J6888J9489K2869J2493j5873P561K5644K1713j4060n944o4979
13461E1645l3636o396J9626L2928p734m4730L7527L3852l0036j8096K1755j1547
13449D5158m661o247l5792K0867j024R047K1669K998P446K3550K8064K4811L5561
13436A71447k8495o5302j8330q589J6194J064k9963j2378K6301J9905K4349R184
13424A05387j4783k6129n77M0735j5701o2005m3397J429K5708j4065K5609L391
13412B5602K0352N273k330L647J5034k897l8803j793J9158J6828K1440m9953q473
13399B3085o306k6456K5636K6824O1139K4073m5534l4261l3429l4549j8017M828
$$ plain form
13387 -32967 -17126 -2955 25927 47319 41814 33254 47658 10802 -17686 -23423 3251 4895
13375 4895 3982 6113 32278 68655 63938 13383 -28302 -24670 2050 25051 -3251 -26282 13925
13362 13925 36593 75832 120734 105013 77151 31473 5051 23358 26793 49945 80639 52106
13350 52106 14692 21401 34395 33448 34364 44748 51850 40386 -9024 -42361 -46511 -27950 -9942
13337 -9942 -1122 42504 25674 18465 28255 19928 22551 22436 19205 37960 44816 12981 11478 18897
13323 18897 23070 44081 34725 21607 69831 81934 105130 112717 61696 14664 -2106 -35162
13311 -35162 -38481 4670 17159 55211 54954 53683 48204 79 -951 3822 10567 17577 17953 1211
13297 1211 -24243 28000 23314 -23387 -47738 -31789 9773 24832 67770 84452 74784 34713
$$ packed form
13387c2967J5841J4171K8882K1392n505q560J4404l6856k8488n737K6674J644
13375D895r13K131K6165L6377m717n0555m1685L632K6720K3001k8302k3031M0207
13362A3925K2668L9239M4902j5721k7862m5678k6422J8307L435K3152L0694k8533
13350E2106l7414O709J2994r47R16J0384P102j1464m9410l3337m150J8561J8008
13337i942Q820M3626j6830p209R790q327K623j15l231J8755O856l1835j503P419
13323A8897M173K1011r356j3118M8224J2103K3196P587n1021m7032j6770l3056
13311c5162l319M3151J2489L8052k57j271n479m8125j030M773O745P010L76j6742
13297A211k5454N2243m686m6701k4351J5949M1562J5059M2938J6682r668m0071
$$ plain form
13285 34713 3624 -28730 -23631 30837 92852 87030 80877 80832 79028 103648 138206 104598 74227
13272 74227 57996 83383 86321 64716 3344 -1121 27534 20377 51246 48228 25500 37509
13260 37509 38558 9511 6099 40252 65410 73464 88507 68159 67183 26968 24051 29689 45490
13247 45490 57808 49001 63603 135213 145311 119872 91083 63663 51599 62528 82121 106986
13235 106986 116085 106655 125663 105042 88295 119965 160352 168123 121352 126393 118166 114029 80951
13222 80951 70591 101470 117569 140205 138205 218579 282961 413963 520451 653067 900968
13211 900968 1342508 1905759 2397426 2409370 2114723 1661117 1169978 823841 626534 460338
13201 460338 370269 333427 334975 305057 282120 247557 213984 213173 154430 130108 118647 104488
$$ packed form
13285C4713l1089l2354N099N4468O2015n822o153m5j804K4620L4558l3608l0371
13272G4227j6231K5387K938k1605o1372m465K8655p157L0869l018k2728J2009
13260C7509J049k9047l412L4153K5158Q054J5043k0348r76m0215k917N638J5801
13247D5490J2318q807J4602P1610J0098k5439k8789k7420j2064J0929J9593K4865
13235A06986R099r430J9008k0621j6747L1670M0387P771m6771N041q227m137l3078
13222H0951j0360L0879J6099K2636k000Q0374O4382J31002J06488J32616K47901
13211I00968M41540N63251M91667J1944k94647m53606m91139l46137j97307j66196
13201D60338r0069l6842J548k9918k2937l4563l3573q11n8743k4322j1461j4159
$$ plain form
13189 104488 77598 114107 123393 97920 91415 54661 -6242 21499 75971 92435 110290 108119
13177 108119 57676 60040 48845 16378 37653 60308 49210 58732 73121 69031 59712 32844
13165 32844 39026 25739 45046 33649 14092 6248 25 13543 75686 87930 56284 54824
13153 54824 79260 53691 8648 38036 40538 25775 7003 17922 -16189 -41901 -54725 -32575
13141 -32575 -12968 1986 3530 18889 15345 -4666 -15447 21431 23373 4238 25481 31069
13129 31069 63197 45916 19256 10230 27063 49438 81024 65057 76177 110044 58599 41534
13117 41534 28838 38282 25728 10117 42058 63816 37506 -36088 -54567 -19687 29116 -11373
13105 -11373 -55350 -14007 8394 -16832 10404 -2016 -34475 -26490 -11680 -30007 -16671 5541
$$ packed form
13189A04488k6890L6509R286k5473o505l6754o0903K7741N4472J6464J7855k171
13177A08119n0443K364j1195l2467K1275K2655j1098R522J4389m090r319k6868
13165C2844O182j3287J9307j1397j9557p844o223J3518O2143J2244l1646j460
13153E4824K4436k5569m5043K9388K502j4763j8772J0919l4111k5712j2824K2150
13141c2575J9607J4954J544J5359l544k0011j0781L6878J942j9135K1243N588
13129C1069L2128j7281k6660r026J6833K2375L1586j5967J1120L3867n1445j7065
13117D1534j2696R444j2554j5611L1941K1758k6310p3594j8479L4880M8803m0489
13105a1373m3977M1343K2401k5226K7236j2420l2459P985J4810j8327J3336K2212
$$ plain form
13093 5541 8577 261 26715 8360 -27712 6207 33417 18858 31424 -4392 -1532 -36962
13081 -36962 -23454 24491 -4369 -25438 -67884 -41881 2217 8926 30491 21525 54588 89102
13069 89102 83478 71780 87086 72302 57720 7089 -26108 11705 20893 6697 3818 7264
13057 7264 2177 -4296 -17106 -38021 -24509 2041 -17598 -22302 43323 72430 75147 11220 -11558
13044 -11558 -16127 -46921 -48645 -36388 -33913 -63494 -58189 -51933 -36272 -21225 -3496 13369 11300
13031 11300 11014 5461 27811 10325 -14044 -35374 -43908 -110 -4642 22777 32581 15245 29394
13018 29394 29614 1954 4921 18591 25815 34593 23833 19306 -9940 -20453 -17049 -3615 22869
13005 22869 47146 17021 -38328 -45546 -53861 -57402 -55398 -25071 20002 33795 27163 27808 21117
$$ packed form
13093E541L036q316K6454j8355l6072L3919K7210j4559J2566l5816K860l5430
13081c6962J3508M7945k8860k1069m2446K6003M4098O709K1565q966L3063L4514
13069H9102n624j1698J5306j4784j4582n0631l3197L7813R188j4196k879L446
13057G264n087o473j2810k0915J3512K6550j9639m704O5625K9107K717o3927k2778
13044a1558m569l0794j724J2257K475k9581N305O256J5661J5047J7729J6865k069
13031A1300k86n553K2350j7486k4369k1330q534M3798m532K7419R804j7336J4149
13018B9394K20k7660K967J3670P224Q778j0760m527k9246j0513L404J3434K6484
13005B2869K4277l0125n5349p218q315l541K004L0327M5073J3793o632O45o691
$$ plain form
12992 21117 16858 -28741 -40269 -5200 -2621 10825 373 -55012 -33226 -19177 32954 57892
12980 57892 62035 82964 47058 -11782 2638 8717 -21999 -57844 -106545 -162214 -157987 -150250
12968 -150250 -130198 -119051 -113921 -89708 -92947 -46317 -6144 -9517 -10868 -24979 -26406 -18691 15648
12955 15648 24518 -7745 5445 -6060 -21234 7366 11819 -18033 -34436 -66290 -86979 -49615
12943 -49615 9598 26084 35805 -11821 -41625 -12213 -33989 -26508 -44493 -13793 -16842 -39016
12931 -39016 -40184 1785 -7589 -13506 -28271 -35810 -43137 -43783 -24477 5358 33189 66716 17766
12918 17766 -8614 -17456 -32654 -60980 -41213 -35134 -26635 -40687 -50996 -51621 -27861 -15991 -21182
12905 -21182 -19969 -23440 -16959 -7396 -29347 -68441 -78840 -39672 21484 17673 -17840 -21097 -9978
$$ packed form
12992B1117m259m5599j1528L5069K579J3446j0452n5385K1786J4049N2131K4938
12980E7892M143K0929l5906n8840J4420O079l0716l5845m8701n5669M227P737
12968a50250K0052J1147N130K4213l239M6630M0173l373j351j4111j427P715L4339
12955A5648Q870l2263J3190j1505j5174K8600M453k9852j6403l1854k0689L7364
12943d9615N9213J6486R721m7626k9804K9412k1776P481j7985L0700l049k2174
12931c9016j168M1969r374n917j4765p539p327o46J9306K9835K7831L3527m8950
12918A7766k6380q842j5198k8326J9767O079Q499j4052j0309o25K3760J1870n191
12905b1182J213l471O481R563k1951l9094j0399L9168O1156l811l5513l257J1119
$$ plain form
12892 -9978 -1932 13289 49338 66824 42036 17262 -8421 -57810 -36754 -17372 -6267 -16998
12880 -16998 -23218 33588 72066 78839 64856 59635 76121 63364 64353 59997 42306 13292 -32474
12867 -32474 -22960 -34566 -62808 -65188 -43916 -1111 -414 -12323 -171 6561 10809 -2710 12905
12854 12905 1261 -9950 -19822 -37891 -45347 -31448 5414 34743 25091 43993 20626 17597
12842 17597 30321 71585 51274 3790 -40386 -31101 5237 33496 27974 18303 56555 62663
12830 62663 46476 32141 23122 68358 102379 88722 70724 30506 7423 32167 24544 23827
12818 23827 23160 21328 -6855 -14214 -14419 9835 34405 23502 -28633 -28941 -16593 -8114 -15697 -22403
12804 -22403 -27176 -16459 8630 16417 -7960 -2957 10389 -14140 -23580 -14307 -61325 -47589 -9219
$$ packed form
12892i978Q046J5221L6049J7486k4788k4774k5683m9389K1056J9382J1105j0731
12880a6998o220N6806L8478O773j3983n221J6486j2757R89m356j7691k9014m5766
12867c2474R514j1606k8242k380K1272M2805O97j1909J2152O732M248j3519J5615
12854A2905j1644j1211r872j8069p456J3899L6862K9329r652J8902k3367l029
12842A7597J2724M1264k0311m7484m4176R285L6338K8259n522r671L8252O108
12830F2663j6187j4335r019M5236L4021j3657j7998m0218k3083K4744p623p17
12818B3827o67j832k8183p359k05K4254K4570j0903n2135l08J2348Q479p583o706
12804b2403m773J0717K5089P787k4377N003J3346k4529r440R273m7018J3736L8370
$$ plain form
12791 -9219 3313 23692 29292 -12314 -20357 -17794 -23956 -44503 -48879 11502 32060 19039 -7972
12778 -7972 12902 -37975 -36854 -27726 -54386 -65314 -46545 -64206 -33731 -48471 -53623 -43286
12766 -43286 -15171 -2982 6110 24980 -1833 -38426 -38291 -6808 -5767 -43903 -32921 9910
12754 9910 31272 -22364 -57306 -54497 -46102 -47479 -20953 -13536 -30551 -12695 -28040 -10148 3950
12741 3950 3767 -26552 -41596 -78144 -35351 38483 54915 90884 72450 83489 92143 110322
12729 110322 77844 48460 35750 -8587 -38363 -67488 -43672 -20003 -27305 -56157 -59161 -60352
12717 -60352 -48793 -59684 -55892 -33207 -30065 -29098 -43693 -35049 2505 -2182 -12181 -22278 27564
12704 27564 26237 57960 79822 73538 42721 10782 232 -10775 -40084 -64448 -16212 -21771
$$ packed form
12791i219J2532K0379N600m1606q043K563o162k0547m376O0381K0558j3021k7011
12778g972K0874n0877J121R128k6660j0928J8769j7661L0475j4740n152J0337
12766d3286K8115J2189R092J8870k6813l6593J35L1483J041l8136J0982M2831
12754I910K1362n3636l4942K809Q395j377K6526P417j7015J7856j5345J7892J4098
12741C950j83l0319j5044l6548M2793P3834J6432L5969j8434J1039Q654J8179
12729A10322l2478k9384j2710m4337k9776k9125K3816K3669p302k8852l004j191
12717f0352J1559j0891L792K2685L142R67j4595Q644L7554m687r999j0097M9842
12704B7564j327L1723K1862o284l0817l1939j0550j1007k9309k4364M8236n559
$$ plain form
12692 -21771 -6846 -8993 -53251 -46277 -69341 -36891 -14868 -45395 -37193 -31106 -41773 -42441 -45826
12679 -45826 -25829 -38085 -46868 -38996 -33474 -17220 30007 54134 54214 1805 132 3611 32116
12666 32116 12942 -46914 -75108 -43933 -36979 -65081 -43218 -28759 -22632 -23621 -14078 38493 24080
12653 24080 -9546 -609 15319 15755 -3213 -4169 33943 22957 10367 -4144 -15214 -17592 26241
12640 26241 36290 7478 -40066 -38910 -28906 -19674 -48728 -57540 -31205 -21661 -35923 -37816 -22411
12627 -22411 22027 14455 -33199 -95280 -74656 -32035 -28337 -9038 2289 -3606 -4083 -22663 -14232
12614 -14232 5150 -13504 -38182 -27244 -7857 -14331 -29461 -18076 -33623 -49332 -48851 -38478
12602 -38478 -33361 -13629 6807 8178 29479 41179 36189 -26950 -37287 -41856 -39708 -13391 -228
$$ packed form
12692b1771J4925k147m4258O974k3064L2450K2023l0527Q202O087j0667o68l385
12679d5826J9997j2256q783P872N522J6254M7227K4127Q0n2409j673L479K8505
12666C2116j9174n9856k8194L1175O954k8102K1863J4459O127r89R543N2571j4413
12653B4080l3626Q937J5928M36j8968r56L8112j0986j2590j4511j1070k378M3833
12640B6241J0049k8812m7544J156J0004R232k9054q812K6335R544j4262j893J5405
12627b2411M4438p572m7654o2081K0624M2621L698J9299J1327n895m77j8580Q431
12614a4232J9382j8654k4678J0938J9387o474j5130J1385j5547j5709M81J0373
12602c8478N117J9732K0436J371K1301J1700m990o3139j0337m569K148K6317J3163
$$ plain form
12589 -228 -11262 -6543 -21524 -22510 32104 70688 24309 -27134 -35243 -25216 -42882 -27454 -12509
12576 -12509 -1780 1386 6677 14511 -4072 7427 36016 21615 -551 -22570 -47937 -152
12564 -152 20626 6470 9876 -4608 -11720 9083 -32502 -47172 -33939 -6760 35082 34999 23048
12551 23048 2493 -3241 -38788 -65442 -42090 2924 12976 4084 -35931 -14811 -203 30487
12539 30487 91968 79869 52929 79692 83983 44810 -15668 -24169 -4785 -26983 -18202 23121
12527 23121 56912 79902 70470 38636 50791 102684 109513 108868 76217 85003 25425 3683 4326
12514 4326 -18867 2684 23154 2495 3688 37217 49713 4808 -29899 -36895 -45594 -50040 -25810
12501 -25810 -28250 -41646 -9115 -5155 -35695 -28744 6594 -10374 21257 51480 7267 -14471
$$ packed form
12589b28j1034M719j4981r86N4614L8584m6379n1443q109J0027j7666J5428J4945
12576a2509J0729L166N291P834j8583J1499K8589j4401k2166k2019k5367M7785
12564a52K0778j4156L406j4484p112K0803m1585j4670J3233K7179M1842q3j1951
12551B3048k0555n734l5547k6654K3352M5014J0052q892m0015K1120J4608L0690
12539C0487O1481j2099k6940K6763M291l9173o0478q501J9384k2198Q781M1323
12527B3121L3791K2990r432l1834J2155N1893O829o45l2651Q786n9578k1742O43
12514D326k3193K1551K0470k0659J193L3529J2496m4905l4707o996q699m446K4230
12501b5810k440j3396L2531L960l0540O951L5338j6968L1631L0223m4213k1738
$$ plain form
12489 -14471 24735 25189 12013 24760 46577 32882 -3347 -1563 19176 73847 52006 37344
12477 37344 64612 47429 39952 20332 37765 9644 7001 24442 19596 57870 46687 66047
12465 66047 48688 28014 7433 3630 32596 40289 36334 8475 -5203 -2529 29016 -11685
12453 -11685 -23871 -18690 -10950 2415 -8944 -21844 10173 -4063 -24361 14278 26235 25250
12441 25250 39143 67923 78140 60364 45365 65406 75844 101276 104665 69872 -16161 -26073
12429 -26073 -19079 -16827 9493 53828 54294 -9690 -55447 -71558 -76662 -86760 -65607 -61904 -75208
12416 -75208 -29617 25935 44128 15984 -10546 -32132 -25540 -47273 12783 29955 27094 25977
12404 25977 27512 -25208 13234 3169 -18026 17591 27080 -3025 -59994 -75105 -49015 -49927
$$ packed form
12489a4471L9206M54j3176J2747K1817j3695l6229J784K0739N4671k1841j4662
12477C7344K7268j7183p477j9620J7433k8121k643J7441m846L8274j1183J9360
12465F6047j7359k0674k0581l803K8966P693l955k7859j3678K674L1545m0701
12453a1685j2186N181P740J3365j1359j2900L2017j4236k0298L8639J1957r85
12441B5250J3893K8780J0217j7776j4999K0041J0438K5432L389l4793q6033r912
12429b6073O994K252K6320M4335M66o3984m5757j6111n104j0098K1153L703j3304
12416g5208M5591N5552J8193k8144k6530k1586O592k1733O0056J7172k861j117
12404B5977J535n2720L8442j0065k1195L5617R489l0105n6969j5111K6090r12
$$ plain form
12392 -49927 -57593 -42465 38952 41139 9068 -22657 19177 87861 73881 53134 19824 -26376
12380 -26376 -37222 -33944 -35322 -5489 695 13705 34505 29419 47275 37258 13465 -21777
12368 -21777 5206 59358 76838 55732 10851 -20131 -7969 26935 40771 41269 18955 20019
12356 20019 -7990 -41523 -33278 -34980 -14590 -17863 9149 28138 53623 49837 -15405 -54060
12344 -54060 -70493 -65269 -37168 -6798 -13704 22561 27641 37502 30096 11445 -4685 -30460 -31511
12331 -31511 -41952 -44314 -54455 -32454 -24506 -25263 -11304 -13083 21731 6928 2269 -7127 -4438
12318 -4438 -1127 8573 38466 53020 8406 -19640 -903 -7815 -72705 -82358 2970 66435 64165
12305 64165 53098 46350 -6760 -49003 -42819 -28172 -31008 -19868 -39379 -13553 8751 6473
$$ packed form
12392d9927p666J5128Q1417K187l2071l1725M1834O8684j3980k0747l3310m6200
12380b6376j0846L278j378K9833O184J3010K0800n086J7856j0017k3793l5242
12368b1777K6983N4152J7480k1106m4881l0982J2162L4904J3836M98k2314J064
12356B0019k8009l3533Q245j702K0390l273K7012J8989K5485l786o5242l8655
12344e4060j6433N224K8101L0370o906L6265N080R861p406j8651j6130k5775j051
12331c1511j0441k362j0141K2001P948p57J3959j779L4814j4803m659r396K689
12318d438L311R700K9893J4554m4614k8046J8737o912o4890r653Q5328O3465k270
12305F4165j1067o748n3110m2243O184J4647k836J1140j9511K5826K2304k278
$$ plain form
12293 6473 25826 44807 46513 41866 54384 70423 74269 56666 13824 21316 39912 61488 83769
12280 83769 90693 58687 22024 51307 57349 40862 -21854 -93150 -70537 -49604 -61979 -68269
12268 -68269 -112136 -43865 12213 -7207 21265 42627 47963 55978 56303 51772 9535 607 74349
12255 74349 54864 2050 -37052 -78433 -96613 -61185 -52055 -22472 -45111 -28461 -1775 -2590
12243 -2590 -867 9860 33466 37735 64555 62162 68102 36381 -7534 -26097 -19716 -18006 29957
12230 29957 36650 21610 5748 5206 -12273 -18946 -10693 -6330 -16721 -29684 -32650 -38286 -8796
12217 -8796 8516 -8852 -58134 -85146 -42315 -26336 -4816 -24930 -34177 -85193 -89306 -89295 -43293
12204 -43293 -3226 -15077 11115 24062 8775 13270 38020 66067 44423 24158 -3989 2292
$$ packed form
12293F473J9353J8981J706m647J2518J6039L846j7603m2842P492J8596K1576K2281
12280H3769O924l2006l6663K9283O042j6487o2716p1296K2613K0933j2375o290
12268f8269m3867O8271N6078j9420K8472K1362N336Q015L25m531m2237q928P3742
12255G4349j9485n2814l9102m1381j8180L5428R130K9583k2639J6650K6686q15
12243b590J723J0727K3606M269K6820k393N940l1721m3915j8563O381J710M7963
12230B9957O693j5040j5862n42j7479o673Q253M363j0391j2963k966n636K9490
12217h796J7312j7368m9282k7012M2831J5979K1520k0114r247n1016m113J1M6002
12204d3293M0067j1851K6192J2947j5287M495K4750K8047k1644k0265k8147O281
$$ plain form
12192 2292 47457 11613 -12420 -26607 3411 -11331 -66471 -70345 -73841 -58768 -612 40142
12180 40142 34185 27259 26517 18032 22342 26284 39025 74866 45240 44862 35448 55212 59887 35049
12166 35049 16226 10611 -9510 -8111 11769 -14045 -5708 -34304 -68794 -63145 -4176 -7476 4693
12153 4693 59659 76951 85259 103384 76601 67794 69641 54357 36807 15482 20862 -5293 -2159
12140 -2159 18519 26474 23400 2873 -14766 -285 6551 36463 19819 5118 -4787 -10719 -20294
12127 -20294 -29865 -4504 13578 -7058 -29318 -44415 -23239 -682 2561 -5949 5063 10522
12115 10522 59609 59514 5643 -4569 27849 24637 25106 13074 6421 55581 49139 43952 12088
12102 12088 -9403 33662 34886 14988 -8812 -41879 -10900 7899 -12765 -64681 -87358 -72305
$$ packed form
12192B292M5165l5844k4033j4187L0018j4742n5140l874l496J5073N8156M0754
12180D0142n957o926p42q485M310L942J2741L5841k9626l78r414J9764M675k4838
12166C5049j8823n615k0121J399J9880k5814Q337k8596l4490N649N8969l300J2169
12153D693N4966J7292Q308J8125k6783q807J847j5284j7550k1325N380k6155L134
12140b159K0678P955l074k0527j7639J4481O836K9912j6644j4701r905n932r575
12127b0294r571K5361J8082k0636k2260j5097K1176K2557L243q510J1012N459
12115A0522M9087r5n3871j0212L2418l212M69j2032o653M9160o442n187l1864
12102A2088k1491M3065J224j9898k3800l3067L0979J8799k0664n1916k2677J5053
$$ plain form
12090 -72305 -32953 22906 32708 27921 53224 76462 89790 79654 43509 13575 -13336 -22550
12078 -22550 -49382 -76223 -99076 -52393 -22988 6078 3727 25200 36106 1380 -16226 26499
12066 26499 58242 7913 -10960 -1034 -24315 -51814 -31162 -54578 -69206 -45067 -58061 -34289
12054 -34289 -16111 2682 -7917 14237 44207 46891 58696 28414 24169 2342 -40837 -40367
12042 -40367 -32212 -16015 -13793 -23899 23904 15128 10125 24791 11271 11042 5428 18119 46106
12029 46106 50134 8724 442 61882 95796 79024 56483 40891 27629 23444 45790 92039
12017 92039 66971 45869 39546 -1028 12088 8747 5666 -4357 3921 30897 67196 70089 60994
12004 60994 58424 71372 54495 24088 8868 -3670 5463 23745 19542 20418 14339 132 -1292
$$ packed form
12090g2305L9352N5859R802m787K5303K3238J3328j0136l6145k9934k6911r214
12078b2550k6832k6841k2853M6683K9405K9066k351K1473J0906l4726j7606M2725
12066B6499L1743n0329j8873R926k3281k7499K0652k3416j4628K4139j2994K3772
12054c4289J8178J8793j0599K2154K9970K684J1805l0282m245k1827m3179M70
12042d0367Q155J6197K222j0106M7803q776n003J4666j3520k29n614J2691K7987
12029D6106M028m1410q282O1440L3914j6772k2541j5592j3262m185K2346M6249
12017I2039k5068k1102o323m0574J3116l341l081j0023Q278K6976L6299K893r095
12004F0994k570J2948j6877l0407j5220j2538R133J8282m203Q76o079j4207j424
$$ plain form
11991 -1292 -15602 -2558 28427 22427 4850 34367 40762 74823 41437 3553 -5024 77308
11979 77308 75614 25036 -1370 -5259 -38058 -2182 29501 14235 5392 -54346 -98166 -89077
11967 -89077 -89824 -66203 -70914 -84518 -102360 -79373 -35347 -794 16575 -1431 -32146 -33111 -22062
11954 -22062 -3504 -31156 6490 52773 34840 9887 16657 24989 48519 8726 -24904 -52431
11942 -52431 -61708 -28791 -31697 -45704 -30603 793 34087 8391 -26479 -80380 -31458 -33683
11930 -33683 -22595 -6048 -19805 3199 13554 32533 39320 15949 21278 13951 -31516 -33920
11918 -33920 -13063 -35453 -43750 -30504 -397 -10014 -42412 -14802 -19651 -8144 19825 24209
11906 24209 828 -18361 -42094 -33411 -12735 -27695 -43801 -69333 -19570 -13262 -30158 -23187
$$ packed form
11991a292j4310J3044L0985o000j7577K9517O395L4061l3386l7884q577Q2332
11979G7308j694n0578k6406l889l2799L5876L1683j5266q843n9738m3820R089
11967h9077p47K3621m711j3604j7842K2987M4026L4553J7369j8006l0715r65J1049
11954b2062J8558k7652L7646M6283j7933k4953O770Q332K3530l9793l3630k7527
11942e2431r277L2917k906j4007J5101L1396L3294k5696l4870n3901M8922k225
11930c3683J1088J6547j3757K3004J0355J8979O787k3371N329p327m5467k404
11918c3920K0857k2390q297J3246L0107r617l2398K7610m849J1507K7969M384
11906B4209k3381j9189k3733Q683K0676j4960j6106k5532M9763O308j6896O971
$$ plain form
11894 -23187 -9698 -23412 -1276 -4173 -49924 -40629 -5127 29148 20095 15415 -1407 1424 -19793
11881 -19793 -24329 -25798 -57457 -30144 -28081 13066 9500 -26244 -27947 -6230 -24754 -37235 -60062
11868 -60062 -21922 5331 -2073 -21053 -26524 -22872 -26673 -19984 -23034 -34677 -13863 22290 2326
11855 2326 -37271 -29076 -11522 -31664 -45452 -52223 -36987 -24673 -39269 -39743 -11578 -2186 -4974
11842 -4974 6760 -34 -9315 -6628 -12031 -64368 -74863 -9859 34351 70229 75203 34638 2712
11829 2712 -21408 -868 -20724 -30898 -61783 -58290 -24432 17908 11168 44993 40723 28716
11817 28716 11009 18662 42587 61150 42504 34369 -4000 -7366 -27069 -26136 13933 -6823 -22282
11804 -22282 27046 53170 6874 -47460 -71533 -56491 -32745 27329 17717 3959 -11947 -24718
$$ packed form
11894b3187J3489j3714K2136k897m5751R295L5502L4275r053m680j6822K831k1217
11881a9793m536j469l1659K7313K063M1147l566l5744j703K1717j8524j2481k2827
11868f0062L8140K7253p404j8980n471L652l801O689l050j1643K0814L6153j9964
11855B326l9597Q195J7554k0142j3788o771J5236J2314j4596m74K8165R392k788
11842d974J1734o794r281K687n403n2337j0495O5004M4210L5878M974m0565l1926
11829B712k4120K0540j9856j0174l0885L493L3858M2340o740L3825m270j2007
11817B8716j7707P653K3925J8563j8646q135l8369l366j9703R33M0069k0756j5459
11804b2282M9328K6124m6296n4334k4073J5042K3746O0074r612j3758j5906j2771
$$ plain form
11792 -24718 -24421 -12586 -22635 -41057 -39073 -63797 -61226 -48015 -36409 -64848 -77271 -101504
11780 -101504 -88655 -59868 -40960 -17474 55947 23675 -32032 -33910 -5687 -1336 678 18488
11768 18488 12205 8424 -22166 -21389 -14848 -32988 23976 6249 -27660 -50826 -76516 -91660 -66044
11755 -66044 -54336 -52852 -25661 -819 -493 -23720 -22641 -13575 -38402 -7805 15211 15235 -20423
11742 -20423 -40912 -23942 -61977 -54962 -17003 -54066 -30179 -35631 -52482 -42085 -83000 -119369
11730 -119369 -99364 -122666 -120328 -83610 -35415 -6914 61123 62392 20789 2688 -15678 -30585
11718 -30585 -29894 -7435 3474 -12840 1680 38465 7655 -25175 -44796 -32175 -23955 -19346
11706 -19346 5574 18019 5910 -4 -4465 31900 52488 34584 -21586 -51892 984 23219
$$ packed form
11792b4718K97J1835j0049j8422J984k4724K571J3211J1606k8439j2423k4233
11780a01504J2849K8787J8908K3486P3421l2272n5707j878K8223M351K014J7810
11768A8488o283l781l0590P77O541j8140N6964j7727l3909k3166k5690j5144K5616
11755f6044J1708J484K7191K4842L26k3227J079R066k4827L0597K3016K4l5658
11742b0423k0489J6970l8035P015L7959l7063K3887n452j6851J0397m0915l6369
11730a19369K0005k3302K338L6718M8195K8501O8037J269m1603j8101j8366j4907
11718c0585O91K2459J0909j6314J4520L6785l0810l2830j9621J2621Q220M609
11706a9346K4920J2445j2109n914m461L6365K0588j7904n6170l0306N2876K2235
$$ plain form
11694 23219 -7041 -81172 -90250 -3899 11801 26411 45426 29648 42862 26656 21350 31794
11682 31794 -9045 -1817 7220 15864 -31996 -58736 -37085 -21351 -36646 -57498 -28076 -25917
11670 -25917 3681 28692 -8653 -4212 29270 11555 20720 63121 27537 -15400 -14887 -478
11658 -478 -5979 -6384 -17583 -10952 -19931 -24079 12541 35507 -1392 -64758 -70390 -75285 -81824 -53030
11644 -53030 -24448 -45500 -46490 -47224 -25550 3750 40676 43008 10952 6608 11956 5923 13747
11631 13747 67980 66826 69771 2583 -37674 -42389 -54173 -43019 -24346 4785 7805 -48247
11619 -48247 -6114 28390 9955 -9547 9532 31567 29244 48742 60474 48548 50086 68970
11607 68970 96558 105710 71338 56082 37840 26108 -5501 10428 3994 38835 64621 48517
$$ packed form
11694B3219l0260p4131r078Q6351J5700J4610J9015j5778J3214j6206n306J0444
11682C1794m0839P228R037Q644m7860k6740K1651J5734j5295k0852K9422K159
11670b5917K9598K5011l7345M441L3482j7715R165M2401l5584m2937N13J4409
11658d78n501m05j1199O631q979m148L6620K2966l6899o3366n632m895o539K8794
11644e3030K8582k1052r90p34K1674K9300L6926K332l2056m344N348o033P824
11631A3747N4233j154K945o7188m0257m715j1784J1154J8673K9131L020n6052
11619d8247M2133L4504j8435j9502J9079K2035k323J9498J1732j1926J538J8884
11607F8970K7588R152l4372j5256j8242j1732l1609J5929o434L4841K5786j6104
$$ plain form
11595 48517 13986 -17868 -38612 -31270 146 38200 -4052 9403 29737 11419 -8034 -5926
11583 -5926 -3501 12757 7874 -6954 -32267 -34532 -34209 -19889 -2823 12061 -546 12486 41967
11570 41967 9245 -32705 -34734 -1089 -6449 -13516 -11908 -9517 -25482 -44214 -40289 -369 35887
11557 35887 32323 47459 63707 65502 42112 6222 -19318 -45474 -55054 -49169 -58015 -33409 -5502
11544 -5502 -20325 -31726 -24010 3746 23165 27658 -26465 -7339 5242 22996 -4692 -41918
11532 -41918 -59056 -53667 -7277 29037 13110 17187 9703 -13892 -47054 -32629 7552 24201
11520 24201 -10765 1381 20790 16833 -425 -27407 -28213 24863 34792 2333 -24563 -55924
11508 -55924 -46568 -16857 -22750 -55212 -49316 -37751 3318 18236 32642 28840 -2372 -7838 1417
$$ packed form
11595D8517l4531l1854k0744P342L1416L8054m2252J3455K0334j8318j9453K108
11583e926K425J6258m883j4828k5313k265L23J4320J7066J4884j2607J3032K9481
11570D1967l2722m1950k029L3645n360p067J608K391j5965j8732L925L9920L6256
11557C5887l564J5136J6248J795k3390l5890k5540k6156r580N885q846K4606K7907
11544e502j4823j1401P716K7756J9419M493n4123J9126J2581J7754k7688l7226
11532d1918j7138N389M6390L6314j5927M077p484k3595l3162J4425M0181J6649
11520B4201l4966J2146J9409l957j7258k6982q06N3076R929l2459k6896l1361
11508e5924R356K9711n893l2462N896J1565M1069J4918J4406l802l1212n466R255
$$ plain form
11495 1417 16332 -18812 -39486 -27064 -27987 -41195 -7849 12632 3532 -46979 -12622 11765
11483 11765 -4855 6926 17655 2518 -30820 -48639 -28738 -21405 -52906 -54894 -53405 9189
11471 9189 6049 17474 43487 34269 -13372 -6363 -39523 -25656 -5331 -9326 -35850 -44287 -42753
11458 -42753 -89230 -103886 -83711 -29241 -19368 -39374 -27990 -63639 -40443 -10511 17008 17001 -11159
11445 -11159 -37928 -46653 -6910 26112 17796 23195 59893 34945 -3526 -6639 -9413 -878 -12488
11432 -12488 -7104 15751 22693 32495 25402 13330 4724 41837 61826 48227 24200 43798 85723
11419 85723 78577 67236 50591 37168 7166 12845 28098 -7985 -58980 -74432 -69273 -7723
11407 -7723 6296 -10088 -60327 -65363 -13689 7197 53330 56400 19744 -14337 -21799 -3728
$$ packed form
11495A417J4915l5144k0674J2422r23j3208L3346K0481r100n0511L4357K4387
11483A1765j6620J1781J0729j5137l3338j7819J9901P333l1501j988J489O2594
11471I189l140J1425K6013r218m7641P009l3160J3867K0325l995k6524q437J534
11458d2753m6477j4656K0175N4470R873k0006J1384l5649K3196K9932K7519pk8160
11445a1159k6769q725L9743L3022q316N399L6698k4948l8471l113k774Q535j1610
11432a2488N384K2855O942R802p093j2072q606L7113J9989j3599k4027J9598M1925
11419H5723p146j1341j6645j3423l0002N679J5253l6083n0995j5452N159O1550
11407g723J4019j6384n0239n036N1674K0886M6133L070l6656l4081p462J8071
$$ plain form
11395 -3728 -5035 -25337 -15955 3350 -674 4551 21061 -8288 -48100 -31620 17202 26832 13132
11382 13132 -20685 -26320 22073 13162 -5244 -17610 -25060 -14892 -696 -12059 -31148 -18706
11370 -18706 -36332 11420 35685 -12381 -86081 -103725 -90949 -57883 -46229 -51006 -58909 -9274
11358 -9274 20868 4633 -8160 -1253 -34731 -25279 11173 12562 32905 46441 48931 25418 -1856
11345 -1856 -19104 -1756 8110 -54753 -82073 -66826 -22945 13521 -6503 -48992 -80777 -65186
11333 -65186 -73470 -44452 -60321 -70148 -79576 -51460 -7324 45254 28901 -28892 -21904 -22074 -43279
11320 -43279 -54285 -88837 -91940 -79960 -89125 -110376 -127591 -123112 -95288 -59127 -68770 -29465
11308 -29465 -28643 3446 33698 16708 -34492 -61785 -79014 -98817 -53606 -17349 -16462 17751
$$ packed form
11395c728j307k0302R382J9305m024N225J6510k9349l9812J6480M8822R630j3700
11382A3132l3817n635M8393q911j8406j2366p450J0168J4196j1363j9089J2442
11370a8706j7626M7752K4265m8066p3700j7644J2776L3066J1654m777p903M9635
11358i274L0142j6235j2793O907l3478R452L6452J389K0343J3536K490k3513k7274
11345a856j7248J7348R866o2863k7320J5247M3881L6466k0024m2489l1785J5591
11333f5186q284K9018j5869r827r428K8116M4136N2578j6353n7793O988j70k1205
11320d3279j1006l4552l103J1980r165k1251j7215M479K7824L6161r643L9305
11308b9465Q22L2089L0252j6990n1200k7293j7229j9803M5211L6257Q87L4213
$$ plain form
11296 17751 61166 10513 -14506 3020 2716 750 13462 -1791 7974 749 -341 26922 27408
11283 27408 22318 989 -15277 29651 62646 65738 40396 37624 35192 69895 82621 37391
11271 37391 1030 -4346 -32529 -54834 -40613 -15545 -19852 -13088 -25929 -48120 -57785 -46372
11259 -46372 -76808 -32661 9130 -2882 -44536 -4773 -13798 -31400 -8928 -796 1144 -22308
11247 -22308 -40522 -9547 20955 15065 7184 -14279 -35505 -66892 -46826 -11616 -7709 -23170
11235 -23170 -25195 -13887 -16247 4570 14651 9421 36183 62251 75563 94631 98550 108064 72674
11222 72674 42171 4450 15620 39757 16851 2566 -4183 5266 -2605 -26922 -17873 3947
11210 3947 -10010 -26727 2212 -13395 -7269 -33629 -57949 -47757 17258 17928 -16741 -4681
$$ packed form
11296A7751M3415n0653k5019J7526l04j966J2712j5253R765p225j090K7263M86
11283B7408n090k1329j6266M4928L2995L092k5342k772k432L4703J2726m5230
11271C7391l6361n376k8183k2305J4221K5068m307O764j2841k2191r665J1413
11259d6372l0436M4147M1791j2012m1654L9763r025j7602K2472Q132J940k3452
11247b2308j8214L0975L0502n890p881k1463k1226l1387K0066L5210L907j5461
11235b3170k025J1308k360K0817J0081n230K6762K6068J3312J9068L919R514l5390
11222G2674l0503l7721J1170K4137k2906j4285o749R449p871k4317R049K1820
11210C947j3957j6717K8939j5607O126k6360k4320J0192O5015O70l4669J2060
$$ plain form
11198 -4681 19233 24590 24447 -2460 -37270 4756 14854 37979 50594 17785 13159 40036 59260
11185 59260 6515 -41431 -73225 -72148 -45134 -8328 4737 33556 61043 48337 29884 44676
11173 44676 64832 39791 32442 15775 -36363 -67439 -38584 32182 29906 38636 37667 159 16128
11160 16128 26755 75522 109410 99216 78924 88336 80847 59038 49703 73037 74429 79762 38752
11147 38752 35458 28052 40301 30855 -2255 -46025 -43181 23624 44102 71532 88782 25221
11135 25221 -15188 -1268 25382 33626 19218 -3554 11545 32160 46887 -618 -25254 -26573
11123 -26573 -30351 -44692 -66041 -67514 -72100 -67762 -56837 -82471 -62811 -40940 -30966 -25716 13842
11110 13842 27902 20301 -126 -51623 -31479 -9110 25281 21218 15605 21139 5551 -35561
$$ packed form
11198d681K3914N357j43k6907l4810M2026J0098K3125J2615l2809m626K6877J9224
11185E9260n2745m7946l1794J077K7014L6806J3065K8819K7487j2706j8453J4792
11173D4676K0156k5041p349j6667n2138l1076K8855P0766k276Q730r69l7508J5969
11160A6128J0627M8767L3888j0194k0292R412p489k1809r335K3334J392N333m1010
11147C8752l294p406J2249r446l3110m3770K844O6805K0478K7430J7250o3561
11135B5221m0409J3920K6650Q244j4408k2772J5099K0615J4727m7505k4636j319
11123b6573l778j4341k1349j473m586M338J0925k5634J9660K1871R974N250L9558
11110A3842J4060p601k0427n1497K0144K2369L4391m063n613N534j5588m1112
$$ plain form
11098 -35561 -26645 -8296 -3223 -22194 -7677 -6579 -5256 21840 3873 11558 -33260 -44944 -58685
11085 -58685 -66428 -71358 -41118 -33202 -38484 -17957 4116 9067 -11107 -3250 17276 13514 17600
11072 17600 69643 29017 -15208 -9018 2593 -2071 -29778 24622 18016 34774 23602 52190
11060 52190 7818 -5364 8361 36701 64183 44664 9773 -33325 -40274 -37030 -38637 -42617
11048 -42617 -28384 8925 50776 55226 26805 4446 48912 72615 53291 11088 21291 44433
11036 44433 11431 1434 16298 6731 4635 24047 28829 55538 25685 26922 25672 48565 54832
11023 54832 44086 60937 67046 74588 76673 39010 -7021 -38374 -20665 26714 37939 51692
11011 51692 -861 -26523 -2749 -11266 -26883 -13497 -30642 -27465 -3407 7502 32838 7708
$$ packed form
11098c5561Q916J8349N073j8971J4517J098J323K7096j7967P685m4818j1684j3741
11085e8685p743m930L0240P916n282K0527K2073M951k0174P857K0526l762M086
11072A7600N2043m0626m4225O190J1611m664k7707N4400o606J6758j1172K8588
11060E2190m4372j3182J3725K8340K7482j9519l4891m3098o949L244j607l980
11048d2617J4233L7309M1851M450k8421k2359M4466K3703j9324m2203J0203K3142
11036D4433l3002r997J4864r567k096J9412M782K6709k9853J237j250K2893O267
11023E4832j0746J6851O109P542K085l7663m6031l1353J7709M7379J1225J3753
11011E1692n2553k5662K3774q517j5617J3386j7145L177K4058J0909K5336k5130
$$ plain form
10999 7708 14420 -7210 6859 23878 26822 3878 -8776 13942 52409 46067 16251 -30145
10987 -30145 -36174 -18731 -42879 -42563 -23406 -18145 -30340 750 20253 9347 6403 1062 10702
10974 10702 17133 40797 6148 -57195 -87375 -56494 -51105 -53876 14655 11332 -7165 -18559
10962 -18559 -27568 -9204 16418 18447 -36361 -43323 -31451 24957 64808 12904 9505 29528
10950 29528 19649 1637 -33288 -58078 -56912 -72473 -98605 -91236 -33757 28822 10115 -9161
10938 -9161 18919 41449 34234 27568 25416 47356 46283 27747 -36303 -30014 -33518 -32759 -47215
10925 -47215 -37938 -51055 -44023 -23263 -103 38647 41159 34706 32919 14766 -15001 -20496 -38072
10912 -38072 -59013 -42307 -47130 -61154 -46937 -62745 -35669 -27284 -12760 -617 11272 -24939
$$ packed form
10999G708O712k1630J4069J7019K944k2944j2654K2718L8467o342k9816m6396
10987c0145o029J7443k4148L16J9157N261j2195L1090J9503j0906k944n341R640
10974A0702O431K3664l4649o3343l0180L0881N389k771O8531l323j8497j1394
10962a8559r009J8364K5622K029n4808o962J1872N6408L9851n1904l399K0023
10950B9528r879j8012l4925k4790J166j5561k6132P369N7479O2579j8707j9276
10938i161K8080K2530p215o666k152K1940j073j8536o4050O289l504P59j4456
10925d7215R277j3117P032K0760K3160L8750K512o453j787j8153k9767n495j7576
10912c8072k0941J6706m823j4024J4217j5808K7076Q385J4524J2143J1889l6211
$$ plain form
10900 -24939 -23547 22356 1993 -11155 34255 39697 43220 97724 181582 243709 269705 409993
10888 409993 529201 514903 403608 277292 170937 111323 85185 38311 14128 -2019 -9224
10877 -9224 -24771 -40095 -76498 -60309 -38587 -24247 -40896 -54390 -57768 -42805 -3506 26249
10865 26249 -25211 -55832 -52001 -65177 -94593 -88600 -67896 -48376 -19219 28414 10715 11590
10853 11590 7040 -26947 -28016 -13272 -27850 -11400 29453 28346 29766 30210 30206 31445 5326 -27979
10839 -27979 -2517 1146 20730 4066 -15207 -31151 -39610 -57429 -41887 -28715 -17099 23326
10827 23326 48446 17167 23177 46553 33328 19772 58428 51524 47474 16814 8112 21550
10815 21550 19334 47790 72881 93072 113713 86443 103381 115124 115796 107569 83846 82656 56991
$$ packed form
10900b4939J392M5903k0363j3148M5410N442L523N4504Q3858O2127K5996J40288
10888D09993J19208j4298j11295j26316j06355n9614k6138m6874k4183j6147p205
10877i224j5547j5324l6403J6189K1722J4340j6649j3494l378J4963L9299K9755
10865B6249n1460l0621L831j3176k9416N993K0704J9520K9157M7633j7699Q75
10853A1590m550l3987j069J4744j4578J6450M0853j107J420M44mJ239k6119l3305
10839b7979K5462L663J9584j6664j9273j5944q459j7819J5542J3172J1616M0425
10827B3326K5120l1279O010K3376j3225j3556L8656o904m050l0660q702J3438
10815B1550k216K8456K5091K0191K0641k7270J6938J1743O72q227k3723j190k5665
$$ plain form
10802 56991 65140 104747 182950 220952 224373 284682 375791 579653 796745 1015055 1469443
10791 1469443 2286192 3465783 4078427 3704776 2946903 2031396 1293276 853912 606005
10782 606005 506602 440877 405650 369382 283800 216133 182371 197013 170241 126695 86479
10771 86479 123386 107432 88555 61158 82531 110771 107115 30641 -5408 22445 47537 59883
10759 59883 50121 30322 44904 86217 92095 72106 116501 113898 92896 80105 82506 33814
10747 33814 36347 53075 54099 66608 54778 18933 -12990 -3815 2430 5016 -24004 -20124 18756
10734 18756 55566 76308 86239 66104 45087 35712 32905 -10502 -31161 -10155 47993 21193
10722 21193 12288 21076 30782 -13889 -31604 -49735 -44263 -6447 -14075 11987 46205 66103 53964
$$ packed form
10802E6991Q149L9607P8203L8002L421O0309R1109K03862K17092K18310M54388
10791A469443Q16749J179591O12644l73651p57873r15507p38120m39364k47907
10782F06005r9403o5725l5227l6268q5582o7667l3762J4642k6772m3546m0216
10771H6479L6907j5954j8877k7397K1373K8240l656p6474l6049K7853K5092J2346
10759E9883r762j9799J4582M1313N878j9989M4395k603k1002j2791K401m8692
10747C3814K533J6728J024J2509j1830l5845l1923R175O245K586k9020L880L8880
10734A8756L6810K0742R931k0135k1017r375k807m3407k0659K1006N8148k6800
10722B1193q905Q788R706m4671j7715j8131N472L7816p628K6062L4218J9898j2139
$$ plain form
10709 53964 54159 120150 114070 97154 63733 46255 73376 55767 32924 42341 28579 2444
10697 2444 19686 21315 11882 67524 92486 81391 34182 -6576 10055 21251 -2835 1721
10685 1721 12868 -16155 43730 45010 1994 -24489 13460 39095 53557 17579 11054 32463
10673 32463 42634 46789 68422 95774 78963 33988 7 -38797 -38577 26527 53371 42053
10661 42053 43636 31074 23423 41034 -1870 -19933 -24880 -28050 -60333 -65900 -56580 -35479 8217
10648 8217 74255 68563 17332 -29990 -17150 -8917 24385 36388 36827 281 -9694 15797 21294
10635 21294 -3541 -44221 -65059 -83869 -65146 28 57421 15660 -14821 -24498 -46716 -37229
10623 -37229 1663 16485 18100 -21360 -30128 -35083 -16215 -18960 -51544 -51107 -48189 -55962 -39800
$$ packed form
10709E3964J95O5991o080j6916l3421j7478K7121j7609k2843R417j3762k6135
10697B444J7242J629r433N5642K4962j1095m7209m0758J6631J1196k4086M556
10685A721J1147k9023N9885J280m3016k6483L7949K5635J4462l5978o525K1409
10673C2463J0171M155K1633K7352j6811m4975l3981l8804K20O5104K6844j1318
10661D2053J583j2562p651J7611m2904j8063m947l170l2283n567R320K1101M3696
10648H217O6038n692n1231m7322J2840Q233L3302J2003M39l6546r975K5491N497
10635B1294k4835m0680k0838j8810J8723O5174N7393m1761l0481r677k2218R487
10623c7229L8892J4822J615l9460q768m955J8868k745l2584M37K918p773J6162
$$ plain form
10610 -39800 -23424 4761 50555 30336 41945 87896 78074 55563 42538 28007 17125 29444
10598 29444 50616 9261 9028 35845 25990 29276 29671 24619 48376 81096 79220 50471 41523
10585 41523 68760 65575 76442 69320 61009 53663 40011 34874 51442 63303 65519 53778 31855
10572 31855 22497 43994 34026 27661 18431 6112 -182 71421 108981 80479 35885 5790 -76
10559 -76 -12013 -19414 -2212 27915 62119 54840 57958 65523 39402 22627 615 -6371 2659
10546 2659 27229 39531 26783 22417 35609 48292 45657 64806 38206 52975 34012 23626
10534 23626 68809 64961 52014 15689 -7979 -4674 -19021 -8292 -25985 -26428 4181 37676
10522 37676 37919 2447 16275 42499 52495 6999 10518 27570 22694 -22217 -54306 -63922 -84024
$$ packed form
10610c9800J6376K8185M5794k0219J1609M5951r822k2511j3025j4531j0882J2319
10598B9444K1172m1355k33K6817r855L286L95n052K3757L2720j876k8749q948
10585D1523K7237l185J0867p122q311p346j3652n137J6568J1861K216j1741k1923
10572C1855r358K1497r968o365r230j2319o294P1603L7560k8502m4594l0095n866
10559g6j1937p401J7202L0127L4204p279L118P565k6121j6775k2012o986R030
10546B659K4570J2302j2748m366J3192J2683k635J9149k6600J4769j8963j0386
10534B3626M5183l848j2947l6325k3668L305j4347J0729j7693m43L0609L3495
10522C7676K43l5472J3828K6224R996m5496L519J7052m876m4911l2089r616k0102
$$ plain form
10509 -84024 -61940 -6580 -798 25401 15656 31259 65784 79377 106382 143932 138768 136543
10497 136543 101464 72125 53698 21451 16220 3571 -25520 -29814 9238 -21234 -13208 -22800
10485 -22800 4364 14965 -12221 27361 48605 71942 96671 81026 80482 75982 54307 78104
10473 78104 105627 86122 51368 44774 39665 61147 44743 72839 96193 58294 60435 61618
10461 61618 50819 9226 13267 47801 20662 -12747 5030 -26590 -18297 7340 19326 33246
10449 33246 4821 -2213 18470 11919 34261 46373 43504 28156 13045 35537 48929 33214
10437 33214 26354 33846 10448 6991 30813 58091 66544 74363 59467 60783 44657 43370 54315
10424 54315 85528 92248 81965 92696 94439 66512 65874 41841 27934 27495 48350 43108 8688
$$ packed form
10509h4024K2084N5360N782K6199r745J5603L4525J3593K7005L7550n164k225
10497A36543l5079k9339j8427l2247n231j2649k9091m294L9052l0472Q026r592
10485b2800K7164J0601k7186L9582K1244K3337K4729j5645n44m500k1675K3797
10473G8104K7523j9505l4754o594n109K1482j6404K8096K3354l7899K141J183
10461F1618j0799m1593M041L4534k7139l3409J7777l1620Q293K5637J1986J3920
10449C3246k8425p034K0683o551K2342J2112k869j5348j5111K2492J3392j5715
10437C3214o860P492k3398l457K3822K7278Q453P819j4896J316j6126j287J0945
10424E4315L1213O720j0283J0731J743k7927o38k4033j3907m39K0855n242l4420
$$ plain form
10411 8688 -11470 -3625 8753 18820 52628 68961 79828 81837 51284 4286 -10193 17943
10399 17943 46038 21134 1056 -7710 2589 732 24160 6674 15794 33823 -156 1794
10387 1794 4918 66348 133626 179737 140457 89660 82067 80533 89769 76105 92579 110077 122677
10374 122677 74331 26987 6133 -16521 -16012 48067 68163 54196 56862 21159 -35467 -23758
10362 -23758 -8904 -20949 -34908 -29869 133 27417 49817 38551 47445 66142 56670 73407
10350 73407 54499 45177 42883 37950 60082 63806 55416 62300 66997 107631 107621 135997 154907 157484
10336 157484 125854 131093 105288 93998 94009 113229 105321 122615 123832 101013 59663 39825 35579
10323 35579 22746 19107 -15071 -13545 6126 65404 103670 99578 61180 30792 25917 56121
$$ packed form
10411H688k0158P845J2378J0067L3808J6333J0867K009l0553m6998j4479K8136
10399A7943K8095k4904k0078q766J0299j857K3428j7486R120J8029l3979J950
10387A794L124O1430O7278M6111l9280n0797p593j534R236j3664J6474J7498J2600
10374A22677m8346m7344k0854k2654N09O4079K0096j3967K666l5703n6626J1709
10362b3758J4854j2045j3959N039L0002K7284K2400j1266Q894J8697r472J6737
10350G3407j8908r322k294m933K2132L724q390O884M697M0634j0K8376J8910K577
10336A57484l1630N239k5805j1290J1J9220p908J7294J217k2819m1350j9838m246
10323C5579j2833l639l4178J526J9671N9278L8266m092l8398l0388m875L0204
$$ plain form
10311 56121 61358 87340 109396 117357 99661 34539 25937 43324 66079 109506 93712 49625
10299 49625 94239 125305 91514 40425 -4622 61001 91235 143914 123757 73820 61671 130854
10287 130854 158822 135885 135230 97155 27632 22028 17985 23398 30919 27460 2606 -8553 -10398
10274 -10398 -17484 1940 -34468 -43230 30109 39714 57849 87450 58263 28435 14205 -47634
10262 -47634 -13940 -9602 8182 8833 8986 48870 24696 14476 27393 40309 28073 -10637 -18426
10249 -18426 -11256 12048 50392 70880 24743 -5901 -17745 -66712 -65834 -30553 33281 33205 33604
10236 33604 37403 62087 79175 90645 115877 147140 182915 167766 163208 179300 170442 167001
10224 167001 191397 209740 198384 150156 118235 130125 127455 126513 123800 139076 107807 97763
$$ packed form
10311E6121N237K5982K2056P961j7696o5122q602J7387K2755M3427j5794m4087
10299D9625M4614L1066l3791n1089m5047O5623L0234N2679k0157m9937j2149O9183
10287A30854K7968k2937o55l8075o9523n604m043N413P521l459k4854j1159j845
10274a0398p086J9424l6408q762P3339R605J8135K9601k9187k9828j4230o1839
10262d7634L3694M338J7784O51J53L9884k4174j0220J2917J2916j2236l8710p789
10249a8426P170K3304L8344K0488m6137l0644j1844m8967Q78L5281O3834p6L99
10236C3604L799K4684J7088J1470K5232L1263L5775j5149m558J6092q858l441
10224A67001K4396J8343j1356m8228l1921J1890k670r42k713J5276l1269j0044
$$ plain form
10212 97763 111207 108739 131021 118060 106653 89023 72929 65610 51570 47115 42934 29324
10200 29324 -17808 -38608 -22408 -2095 27667 49826 61186 63430 87711 38263 33297 27175
10188 27175 62138 51901 -14050 -12000 27770 49637 63726 63044 60269 35885 4213 -40305
10176 -40305 -12054 -13566 -307 56996 75932 68555 70648 25343 17337 25424 62448 93351 64390
10163 64390 18873 35380 60084 38691 24273 33761 69875 51676 5886 -10454 -20288 -21675
10151 -21675 -6341 27765 51880 -9364 -8629 19345 -8303 -52904 -43874 15579 23864 49345
10139 49345 47483 79226 67543 56412 25649 20368 -9542 -11633 25078 89690 81232 79088 130352
10126 130352 158314 146754 124374 64868 41772 56385 78048 101645 102653 66385 50795 41813
$$ packed form
10212I7763J3444k468K2282j2961j1407j7630j6094p319j4040m455m181j3610
10200B9324m7132k0800J6200K0313K9762K2159J1360K244K4281m9448m966o122
10188B7175L4963j0237o5951K050L9770K1867J4089o82k775k4384l1672m4518
10176d0305K8251j512J3259N7303J8936p377K093m5305q006Q087L7024L0903k8961
10163F4390m5517J6507K4704k1393j4418R488L6114j8199m5790j6340r834j387
10151b1675J5334L4106K4115o1244P35K7974k7648m4601R030N9453Q285K5481
10139D9345j862L1743j1683j1131l0763n281k9910k091L6711O4612q458k144N1264
10126A30352K7962j1560k2380n9506k3096J4613K1663K3597J008l6268j5590q982
$$ plain form
10114 41813 46044 49146 63792 56137 24745 15949 9765 19405 51598 66575 19495 17433 52593
10101 52593 29692 43685 64428 89213 106026 91626 55066 -3126 -76817 -95852 -66406 -66829
10089 -66829 -32814 -22716 -13670 -25073 -6088 28960 2392 -692 10068 28266 -2254 23823
10077 23823 29344 -5896 -45544 -52680 -50660 -27541 -40709 -51256 -7848 26560 12821 7993
10065 7993 8986 19049 62134 56759 53950 44123 31221 63628 124347 113693 83451 37544 57486
10052 57486 41044 18517 30109 65048 56173 52913 59456 74948 47946 62491 36171 12861
10040 12861 -25980 -33951 -30756 -11585 -5250 19087 7561 -6006 -13637 -20997 5327 30085 42352
10027 42352 6940 -21654 -25390 10478 87703 73952 -3931 -20027 -51476 -59986 -28754 10375
$$ packed form
10114D1813M231L102J4646p655l1392q796o184R640L2193J4977m7080k062L5160
10101E2593k2901J3993K0743K4785J6813j4400l6560n8192p3691j9035K9446m23
10089f6829L4015J0098R046j1403J8985L5048k6568l084J0760J8198l0520K6077
10077B3823N521l5240l9648p136K020K3119j3168j0547M3408L4408j3739m828
10065G993R93J0063M3085n375k809r827j2902L2407O0719j0654l0242m5907J9942
10052E7486j6442k2527J1592L4939q875l260O543J5492k7002J4545k6320k3310
10040A2861l8841p971L195J9171O335K4337j1526j3567p631p360K6324K4758J2267
10027D2352l5412k8594l736L5868P7225j3751p7883j6096l1449q510L1232L9129
$$ plain form
10015 10375 42234 52667 26699 43558 -4681 -39962 -6882 -4831 11 -6351 5131 710
10003 710 27236 15385 32843 90860 67940 56178 100257 75944 87018 127470 138941 93359
9991 93359 41134 10785 18869 19850 25619 35058 53554 49534 21175 32956 52524 63060 27825
9978 27825 -42219 -65272 -54051 -13841 17907 48572 36414 3755 28650 80745 64395 59918
9966 59918 51236 49818 39716 -6329 -59672 -106129 -45930 -31113 -45158 -78728 -74537 -88946
9954 -88946 -62720 1934 -17857 -44122 -36394 -24470 -3312 38698 54473 59942 43277 32614
9942 32614 51817 31682 16124 18881 54565 79609 76655 63758 38089 19603 -540 19524
9930 19524 35796 45580 60794 71366 51965 39393 53587 69239 75134 59407 13548 -4845
$$ packed form
10015A0375L1859J0433k5968J6859m8239l5281L3080K051M842o362J1482m421
10003G10K6526j1851J7458N8017k2920j1762M4079k4313J1074M0452J1471m5582
9991I3359n2225l0349Q084R81N769R439J8496m020k8359J1781J9568J0536l5235
9978B7825p0044k3053J1221M0210L1748L0665j2158l2659K4895N2095j6350m477
9966E9918q682j418j0102m6045n3343m6457O0199J4817j4045l3570M191j4409
9954h8946K6226O4654j9791k6265P728J1924K1158M2010J5775N469j6665j0663
9942C2614J9203k0135j5558K757L5684K5044k954j2897k5669j8486k0143K0064
9930A9524J6272R784J5214J0572j9401j2572J4194J5652N895j5727m5859j8393
$$ plain form
9918 -4845 1516 18691 60244 32282 56134 73535 43031 323 27530 33850 35436 36444 36485
9905 36485 50032 42314 57838 38819 35706 41252 34063 51261 57328 21895 -32906 16721 20777
9892 20777 3835 -15739 34825 43929 54254 79101 65002 33305 10642 38322 74742 38451
9880 38451 7084 -24923 -42058 -47313 -23659 35760 65101 61367 35726 12772 1596 -1762
9868 -1762 -22880 11519 67112 113618 97830 100228 115121 98879 112532 78817 87150 89937 133367
9855 133367 137913 112438 104022 131409 105762 94680 72022 50569 22867 70604 56943 29965
9843 29965 37468 44379 31557 25392 40686 30733 45376 81662 102525 82568 75088 77585 70890
9830 70890 78586 77168 39153 17912 -2836 -15410 -21505 -30378 18157 58677 62355 66990 73846
$$ packed form
9918d845O361J7175M1553k7962K3852J7401l0504m2708K7207O320J586J008M1
9905C6485J3547p718J5524j9019l113N546p189J7198O067l5433n4801M9627M056
9892B0777j6942j9574N0564R104J0325K4847j4099l1697k2663K7680L6420l6291
9880C8451l1367l2007j7135n255K3654N9419K9341l734k5641k2954j1176l358
9868a762k1118L4399N5593M6506j5788K398J4893j6242J3653l3715Q333K787M3430
9855A33367M546k5475q416K7387k5647j1082k2658k1453k7702M7737j3661k6978
9843B9965P503O911j2822o165J5294r953J4643L6286K0863j9957p480K497o695
9830G0890P696j418l8015k1241k0748j2574o095q873M8535M0520L678M635O856
$$ plain form
9817 73846 60102 75869 56303 31803 44657 44321 36201 24006 21461 20105 37614 30496 26024
9804 26024 34078 23643 -24578 -52107 -28895 33312 63492 55062 44534 19443 31185 18315
9792 18315 25245 78156 86369 73149 92481 49222 21529 16685 22666 22694 36115 54034 36770
9779 36770 32114 36524 56544 69277 90121 59375 -2832 12267 91538 114623 114237 93349 48994
9766 48994 40442 16645 -5585 10171 18394 -33645 -10834 39964 44644 28509 -11729 1640
9754 1640 22433 68804 100227 87329 51639 5838 7566 23889 16224 5685 27930 86377
9742 86377 103298 87873 40881 910 11825 24056 -22434 -19599 -20063 9527 11302 -1793 -869
9729 -869 -10624 -13634 -42632 -54488 -53247 -55669 -22497 11316 33973 30257 32611 12015 -542
$$ packed form
9817G3846j3744J5767j9566k4500J2854l36q120j2195k545j356J7509p118m472
9804B6024Q054j0435m8221k7529K3212O2207L0180q430j0528k5091J1742j2870
9792A8315O930N2911Q213j3220J9332m3259k7693m844N981K8J3421J7919j7264
9779C6770m656M410K0020J2733K0844l0746o2207J5099P9271K3085l86k0888m4355
9766D8994q552k3797k2230J5756Q223n2039K2811N0798M680j6135m0238J3369
9754A640K0793M6371L1423j2898l5690m5801J728J6323p665j0539K2245N8447
9742H6377J6921j5425m6992l9971J0915J2231m6490K835m64K9590J775j3095R24
9729h69r755l010k8998j1856J241k422L3172L3813K2657l716K354k0596j2557
$$ plain form
9716 -542 9963 35477 25263 1296 -46886 -5185 59926 57654 -5442 -31806 -53949 -54548 -31687
9703 -31687 8593 23502 64809 102823 83537 83556 90622 70632 46432 27485 55440 93102 147094
9690 147094 149386 116044 96320 66043 67163 71332 86368 92891 74673 75939 63460 43756 17606
9677 17606 -10942 18097 21962 4054 5915 56624 89645 63867 38372 22015 5558 34627
9665 34627 21947 28768 67116 84436 65233 87119 76111 72435 80358 95615 69843 17320
9653 17320 14408 77686 75053 34965 45943 91164 111271 66038 40316 -2347 -36333 -51295
9641 -51295 -27051 8451 24296 63140 11011 -6111 -16250 1117 51076 65603 65729 106546
9629 106546 96840 91476 97427 125558 113293 67751 29200 -2281 8793 10112 14229 36758 22960
$$ packed form
9716e42J0505K5514j0214k3967m8182M1701O5111k272o3096k6364k2143n99K2861
9703c1687M0280J4909M1307L8014j9286J9P066j9990k4200j8947K7955L7662N3992
9690A47094K292l3342j9724l0277J120M169J5036O523j8218J266j2479j9704k6150
9677A7606k8548K9039L865j7908J861N0709L3021k5778k5495j6357j6457K9069
9665C4627j2680O821L8348J7320j9203K1886j1008l676P923J5257k5772n2523
9653A7320k912O3278k633m0088J0978M5221K0107m5233k5722m2663l3986j4962
9641e1295K4244L5502J5845L8844n2129j7122j0139J7367M9959J4527J26M0817
9629A06546r706n364N951K8131j2265m5542l8551l1481J1074J319M117K2529j3798
$$ plain form
9616 22960 5354 -7960 13210 31017 37435 71400 76014 58263 63298 88287 89706 88101 67306
9603 67306 16905 33728 36024 64842 48915 52149 72644 56727 68797 70182 39094 71759
9591 71759 58482 631 -9343 -3046 8208 4944 16092 60832 63412 46300 75002 103049 90157
9578 90157 76068 42846 32796 50295 59524 76912 94165 133112 162449 113847 57558 43406
9566 43406 40423 49996 112373 103663 112262 119356 90139 62769 52069 38098 30241 39334 26376
9553 26376 24715 36682 44349 53486 42621 10861 25178 27243 30390 23811 39708 50836 69056
9540 69056 115768 102759 68805 52837 60800 69001 28599 -12307 3895 35575 57939 52906
9528 52906 6639 -14704 11918 86722 70466 65460 52161 27666 5110 1502 30244 92430
$$ packed form
9616B2960j7606j3314K1170J7807O418L3965M614j7751N035K4989J419j605k0795
9603F7306n0401J6823K296K8818j5927L234K0495j5917J2070J385l1088L2665
9591G1759j3277n7851r974O297J1254l264J1148M4740K580j7112K8702K8047j2892
9578I0157j4089l3222j0050J7499R229J7388J7253L8947K9337m8602n6289j4152
9566D3406k983R573O2377q710Q599P094k9217k7370j0700j3971p857R093j2958
9553B6376j661J1967P667R137j0865l1760J4317K065L147o579J5897J1128J8220
9540F9056M6712j3009l3954j5968P963Q201m0402m0906J6202L1680K2364n033
9528E2906m6267k1343K6622P4804j6256n006j3299k4495k2556l608K8742O2186
$$ plain form
9516 92430 94381 56063 72551 105665 123220 129995 92699 72793 102277 97094 109779 111038 105412
9503 105412 78163 82660 115523 89194 68556 79002 79026 71918 62201 77276 94939 121145 124869
9490 124869 108172 106367 77293 20104 631 15836 59948 56365 40962 28652 49214 71999
9478 71999 52735 16252 25417 47214 56448 59323 77979 82148 92275 119392 143166 130173 95146
9465 95146 84530 81583 71813 35085 41527 26726 21018 35737 74741 60887 74762 89510 110661
9452 110661 79502 70139 75539 79498 58744 67499 101722 105799 80306 73977 76810 53194 65744
9439 65744 62971 43712 58056 91225 99047 64972 40311 53301 43678 44150 46914 85213 109690
9426 109690 95031 43887 3996 16972 60841 65967 75743 127077 126361 114543 104578 125424 134308
$$ packed form
9516I2430J951l8318J6488L3114J7555O775l7296j9906K9484n183J2685J259n626
9503A05412k7249M497L2863k6329k0638J0446K4p108r717J5075J7663K6206L724
9490A24869j6697j805k9074n7189j9473J5205M4112l583j5403j2310K0562K2785
9478G1999j9264l6483R165K1797R234K875J8656M169J0127K7117K3774j2993l5027
9465I5146j0616k947r770l6728O442j4801n708J4719L9004j3854J3875J4748K1151
9452A10661l1159r363N400L959k0754Q755L4223M077k5493o329K833k3616J2550
9439F5744k773j9259J4344L3169P822l4075k4661J2990r623M72K764L8299K4477
9426A09690j4659n1144l9891J2976M3869N126R776N1334p16j1818r965K0846Q884
$$ plain form
9413 134308 88296 99413 91532 90945 79976 77947 68298 52428 50259 56741 61746 68025 38921
9400 38921 21876 23565 75645 118255 129235 110856 125148 139461 153867 119543 128052 150546
9388 150546 174901 195347 175840 123961 96444 106187 133432 141649 137576 110974 106606 121626
9376 121626 155432 136672 116850 111484 119425 159321 147688 117396 120384 126232 126770 127551 144600
9363 144600 167979 132169 117465 149699 143956 100201 98534 103324 132218 123201 82297 54495
9351 54495 85471 144660 132593 127578 122597 133197 119676 131863 127055 84196 94953 96240 141095
9338 141095 181838 198526 210450 168758 171756 206075 198234 144967 136562 145636 179095 178733 173386
9325 173386 152628 119870 114595 113454 148673 151528 165342 162153 125919 97964 29697 40548
$$ packed form
9413A34308m6012J1117p881n87j0969k029r649j5870k169O482N005O279k9104
9400C8921j7045J689N2080M2610J0980j8379J4292J4313J4406l4324Q509K2494
9388A50546K4355K0446j9507n1879k7517R743K7245Q217m073k6602m368J5020
9376A21626L3806j8760j9822n366P941L9896j1633l0292K988N848N38P81J7049
9363A44600K3379l5810j4704L2234n743m3755j667M790K8894r017m0904k7802
9351E4495L0976N9189j2067n015m981J0600j3521J2187m808m2859J0757J287M4855
9338A41095M0743J6688J1924m1692K998L4319p841n3267q405R074L3459l62n347
9325A73386k0758l2758n275j141L5219K855J3814l189l6234k7955o8267J0851
$$ plain form
9313 40548 56150 68528 104217 148616 196344 203567 209295 223586 172138 146120 192254 201292
9301 201292 153623 122943 138450 137768 150180 152231 167931 230759 236602 241629 262340 244798 276298
9288 276298 324101 286343 257445 246742 252448 255544 223403 212760 244218 222977 151614 124302
9276 124302 142504 166999 183604 256456 317034 314384 283117 254154 252209 220895 167119 160658
9264 160658 170135 139560 151020 143266 139604 139535 106226 127524 179170 182263 207946 241696 237475
9251 237475 251491 258954 252214 262399 271825 287360 277897 257336 226930 185941 193620 239527 280124
9238 280124 327573 321291 255451 236789 258393 247308 278911 303428 301934 258680 227491 265542
9226 265542 250410 234067 233118 240968 239878 244168 230200 209641 178590 167888 194538 252846 243181
$$ packed form
9313D0548J5602J2378L5689M4399M7728P223N728J4291n1448k6018M6134R038
9301B01292m7669l0680J5507o82J2412K051J5700O2828N843N027K0711j7542L1500
9288B76298M7803l7758k8898j0703N706L096l2141j0643L1458k1241p1363k7312
9276A24302J8202K4495J6605P2852O0578k650l1267k8963j945l1314n3776o461
9264A60658R477l0575J1460p754l662o9l3309K1298N1646L093K5683L3750m221
9251B37475J4016P463o740J0185R426J5535r463k0561l0406m0989P679M5907M0597
9238B80124M7449o282o5840j8662K1604j1085L1603K4517j494m3254l1189L8051
9226B65542j5132j6343r49P850j090M290j3968k0559l1051j0702K6650N8308r665
$$ plain form
9213 243181 229228 239491 259747 280496 285677 345429 362477 354991 320368 264696 260052 238360
9201 238360 260853 275385 307115 315146 326238 298897 288338 324372 336197 341836 331039 311098
9189 311098 301740 294475 294536 295924 296046 243464 240064 277437 303055 326939 312716 293154 276717
9176 276717 279741 299352 303687 286852 306097 266065 248620 260391 269765 276487 301176 294202 340516
9163 340516 327528 222474 205124 266964 292085 308110 299572 333014 405203 386935 368110 381136
9151 381136 395562 399791 406475 413341 394554 374889 420008 425401 428838 413497 397813 429051 441643
9138 441643 431412 432030 410172 395644 402412 454216 507264 524694 545367 535940 530591 561114 546416
9125 546416 532718 534746 553160 559502 589323 590555 621243 655896 725228 746153 795509 881770
$$ packed form
9213B43181j3953J0263K0256K0749N181N9752J7048p486l4623n5672m644k1692
9201B38360K2493J4532L1730Q031J1092k7341j0559L6034J1825N639j0797j9941
9189C11098r358p265O1J388J22n2582l400L7373K5618K3884j4223j9562j6437
9176B76717L024J9611M335j6835J9245m0032j7445J1771R374O722K4689o974M6314
9163C40516j2988j05054j7350O1840K5121J6025q538L3442P2189j8268j8825J3026
9151C81136J4426M229O684O866j8787j9665M5119N393L437j5341j5684L1238J2592
9138D41643j0231O18k1858j4528O768N1804N3048J7430K0673r427n349L0523j4698
9125E46416j3698K028J8414O342K9821J232L0688L4653O9332K0925M9356Q6261
$$ plain form
9113 881770 954114 1082618 1247154 1474815 1762120 2170497 2739767 3471488 4451894 5914634
9103 5914634 8389239 12650316 18343447 21261130 19475620 15873133 11388546 7729633
9095 7729633 5451113 4077847 3248073 2703666 2315961 2078663 1831415 1590578 1439100
9086 1439100 1299648 1162451 1089416 1017075 927613 866361 819088 772192 720027 650523 624382
9075 624382 600017 590509 594902 568207 480101 452510 452314 444282 407735 413153 438452 425865 401180
9062 401180 400379 452447 450299 426246 393527 413076 382204 368852 351876 370125 380356 385731
9050 385731 400778 401478 355798 358924 394741 381308 358000 336741 313877 289001 310764 318718
9038 318718 315639 295686 275211 313397 350566 343337 305980 315694 324598 277335 259759 297241
$$ packed form
9113H81770P2344J28504J64536K27661K87305M08377N69270P31721R80406J462740
9103E914634K474605M261077N693131K917683j785510l602487m484587l658913
9095G729633k278520j373266q29774n44407l87705k37298k47248k40837j51478
9086A439100j39452j37197p3035p2341q9462o1252m7273m6896n2165o9504k6141
9075F24382k4365r508M393k6695q8106k7591j96q032l6547N418K5299j2587k4685
9062D01180q01N2068k148k4053l2719J9549l0872j3352j6976J8249J0231N375
9050C85731J5047P00m5680L126L5817j3433k3308k1259k2864k4876K1763P954
9038C18718l079j9953k0475L8186L7169p229l7357R714Q904m7263j7576L7482
$$ plain form
9026 297241 338017 353304 363619 298137 291202 300962 279564 277299 277341 259626 248736 272242 271870
9013 271870 285970 323985 347344 322015 312619 346386 377234 390645 345061 328148 294629 299616
9001 299616 302382 288209 293508 275267 292645 276384 271208 228304 221120 223023 236244 268596 274235
8988 274235 291099 302412 303821 299955 248969 246623 269678 262413 255708 255311 221855 214861 206714
8975 206714 182581 176122 145460 153933 220464 265309 277732 273982 319287 324513 337147 312347
8963 312347 299250 258267 190524 155701 177081 192677 161988 180185 221189 210759 181617 234442
8951 234442 263536 246685 253364 275182 300452 296008 288045 238061 216334 184172 139481 134031
8939 134031 154492 164305 174459 193953 218279 233788 227014 231181 263317 269388 252700 200430
$$ packed form
9026B97241M0776J5287J0315o5482o935R760k1398k265M2j7715j0890K3506l72
9013B71870J4100L8015K3359k5329r396L3767L0848J3411m5584j6913l3519M987
9001B99616K766j4173N299j8241J7378j6261n176m2904p184J903J3221L2352N639
8988B74235J6864J1313J409l866n0986k346K3055p265o705l97l3456o994q147
8975B06714k4133o459l0662Q473O6531M4845J2423l750M5305N226J2634k4800
8963C12347j3097m0983o7743l4823K1380J5596l0689J8197M1004j0430k9142N2825
8951B34442K9094j6851O679K1818K5270m444p963m9984k1727l2162m4691n450
8939A34031K0461R813J0154J9494K4326J5509o774M167L2136O071j6688n2270
$$ plain form
8927 200430 205678 222832 216705 190502 186962 222529 223020 208226 215025 227714 208108 199847 152215
8914 152215 129624 131109 186026 259589 267205 263376 201789 170228 190247 138291 88889 113998
8902 113998 119192 170745 226289 227562 191663 163176 168378 166756 151231 196154 194922 150317 150602
8889 150602 156325 186040 230692 235858 225237 220272 222984 211556 199711 175489 141673 152654
8877 152654 188659 180538 150214 177516 198915 238703 288521 309273 287809 284796 322927 388486
8865 388486 393306 394240 376665 360660 378944 382079 298358 242946 229649 254887 283474 262329
8853 262329 266825 258155 234786 248647 273186 265112 250492 251193 211545 234398 245531 233334 208757
8840 208757 216682 196472 156721 218182 242840 211878 193856 156728 136782 162749 150774 146544
$$ packed form
8927B00430N248J7154o127k6203l540L5567M91j4794O799J2689j9606q261m7632
8914A52215k2591J485N4917P3563P616l829o1587l1561K0019n1956m9402K5109
8902A13998N194N1553N5544J273l5899k8487N202j622j5525M4923j232m4605K85
8889A50602N723K9715M4652N166j0621m965K712j1428j1845k4222l3816J0981
8877A52654L6005q121l0324K7302K1399L9788M9818K0752k1464l013L8131O5559
8865C88486M820R34j7575j6005J8284L135q3721n5412j3297K5238K8587k1145
8853B62329M496q670k3369J3861K4539q074j4620P01l9648K2853J1133j2197k4577
8840B08757P925k0210l9751O1461K4658l0962j8022l7128j9946K5967j1975m230
$$ plain form
8828 146544 170619 224542 208209 164397 165660 134627 100924 119934 167693 216502 197211 191928
8816 191928 234734 237062 222281 163731 124051 146514 113244 122445 139733 191690 176163 174570
8804 174570 167587 130447 152354 138488 128027 155896 142812 130718 142874 177057 246423 241288
8792 241288 161303 160352 200940 213391 174587 167551 195817 226719 204564 184076 159462 192478
8780 192478 201509 183981 220433 229311 247914 246315 214040 229958 251761 218677 208182 226012
8768 226012 225968 211663 196655 199297 255223 267206 254110 247069 247456 240947 282854 283071 192896 141375
8754 141375 155780 225261 223025 203632 247455 283405 286427 274710 304313 353397 336378 338092
8742 338092 326309 269407 294034 310703 326586 357247 381428 380509 369888 431737 485636 504942
$$ packed form
8828A46544K4075N3923j6333m3812J263l1033l3703J9010M7759M8809j9291n283
8816A91928M2806K328j4781n8550l9680K2463l3270R201J7288N1957j5527j593
8804A74570o983l7140K1907j3866j0461K7869j3084j2094J2156L4183O9366n135
8792B41288p9985r51M0588J2451l8804p036K8266L0902k2155k0488k4614L3016
8780A92478R031j7528L6452Q878J8603j599l2275J5918K1803l3084j0495J7830
8768B26012m4j4305j5008K642N5926J1983j3096p041L87o509M1907K17r0175n1521
8754A41375J4405O9481k236j9393M3823L5950L022j1717K9603M9084j7019J714
8742C38092j1783n6902K4627J6669J5883L0661K4181r19j0621O1849N3899J9306
$$ plain form
8730 504942 522398 552414 629239 674569 738804 783108 773248 692166 594830 560555 518083 468194
8718 468194 456727 431574 425261 462032 462269 437480 424752 431615 433183 410911 427978 457265 466751
8705 466751 452345 477485 451363 432896 451023 492643 505519 503512 510070 505942 496544 480843
8693 480843 498373 498365 529313 577349 596670 606680 601200 614314 627223 619043 650087 682394 671328
8680 671328 677005 698732 712275 724752 730077 732059 709322 717437 761273 767655 781174 771648 750315
8667 750315 753644 786112 839537 843767 876810 917626 928539 926665 965515 1024967 1026934 971427
8655 971427 954367 967989 987227 1054449 1079747 1111951 1196944 1248090 1346283 1460109 1582355
8644 1582355 1634186 1605039 1543219 1458905 1409301 1394362 1373968 1367065 1387553 1425672 1442752 1430801
$$ packed form
8730E04942J7456L0016P6825M5330O4235M4304r860q1082r7336l4275m2472m9889
8718D68194j1467k5153o313L6771K37k4789j2728O863J568k2272J7067K9287R486
8705D66751j4406K5140k6122j8467J8127M1620J2876k007O558m128r398j5701
8693D80843J7530qL0948M8036J9321J0010n480J3114J2909q180L1044L2307j1066
8680F71328N677K1727J3543J2477N325J982k2737Q115M3836O382J3519r526k1333
8667G50315L329L2468N3425M230L3043M0816J0913j874L8850N9452J967n5507
8655I71427j7060J3622J9238O7222K5298L2204Q4993N1146R8193J13826J22246
8644A582355N1831k9147o1820q4314m9604j4939k0394o903K0488L8119J7080j1951
$$ plain form
8632 1430801 1474023 1511481 1564873 1589869 1613053 1610640 1621697 1657523 1720069 1855935 1988336
8621 1988336 2113197 2222719 2313606 2449239 2591159 2683328 2844232 3071678 3314177 3563188
8611 3563188 3848457 4156862 4504503 4918838 5347980 5741067 6126126 6543580 6925286 7235043
8601 7235043 7499413 7719200 7860702 7927892 7889505 7651935 7201423 6602928 5917871 5211660
8591 5211660 4585007 4076394 3677438 3289804 2937260 2651504 2445239 2233596 2060770 1913423
8581 1913423 1807221 1711268 1620088 1552606 1479757 1435447 1433314 1364292 1304482 1258218 1245152
8570 1245152 1208626 1135890 1062469 1046128 1034535 973238 939449 932986 961213 923330 858616 842173
8558 842173 823601 808307 810721 801999 797010 796953 804352 799466 784605 794057 744885 755299 764437 765433
$$ packed form
8632A430801M3222L7458N3392K4996K3184k413J1057L5826O2546J35866J32401
8621A988336J24861J09522R0887J35633J41920R2169J60904K27446K42499K49011
8611C563188K85269L08405L47641M14335M29142L93087L85059M17454L81706L09757
8601G235043K64370K19787J41502O7190l8387k37570m50512n98495o85057p06211
8591E211660o26653n08613l98956l87634l52544k85756k06265k11643j72826j47347
8581A913423j06202r5953r1180o7482p2849m4310k133o9022n9810m6264j3066
8570A245152l6526p2736p3421j6341j1593o1297l3789o463K8227l7883o4714j6443
8558H42173j8572j5294K414q722m989n7P399m886j4861R452m9172J0414R138R96
$$ plain form
8544 765433 753734 699629 696485 722945 715293 714494 695594 672822 667066 669578 658303 674427 669552
8531 669552 686689 691494 646768 619411 618042 649292 681072 663857 624047 585736 578809 580198
8519 580198 601650 601869 582780 541687 524402 497126 519339 536782 552528 536707 527703 503924
8507 503924 506185 512184 475980 497593 542893 547203 504232 498869 495222 513725 514199 494909 522916
8494 522916 505489 465657 435686 452590 488109 470659 452482 461057 463811 455657 431595 391945
8482 391945 395848 393674 371125 382343 364294 362135 435403 477296 467994 421941 408255 390146
8470 390146 371253 401939 385767 386726 409453 429715 424699 432999 432719 417639 432391 426499 394423
8457 394423 368041 385342 415073 416570 431921 421395 385334 365919 349930 374808 355810 322202
$$ packed form
8544G65433j1699n4105l144K6460p652p99j8900k2772n756K512j1275J6124m875
8531F69552J7137M805m4726k7357j369L1250L1780j7215l9810l8311o927J389
8519E80198K1452K19j9089m1093j7285k7276K2213J7443J5746j5821r004k3779
8507E03924K261N999l6204K1613M5300M310m2971n363l647J8503M74j9290K8007
8494E22916j7427l9832k9971J6904L5519j7450j8177Q575K754q154k4062l9650
8482C91945L903k174k2549J1218j8049k159P3268M1893r302m6053j3686j8109
8470C90146j8893L0686j6172R59K2727K0262n016Q300k80j5080J4752n892l2076
8457C94423k6382J7301K9731J497J5351j0526l6061j9415j5989K4878j8998l3608
$$ plain form
8445 322202 314446 332697 292701 336632 364585 341315 342870 309960 269257 241556 226615 212620
8433 212620 240384 256432 269182 303831 337926 341535 324459 285364 298158 381932 404549 397657
8421 397657 409287 373894 334249 327525 335170 310627 273292 227340 210891 243490 285253 305145
8409 305145 307018 299789 324413 321010 283302 302728 315942 263933 273344 274442 270457 282333 274292
8396 274292 227658 224688 242691 276161 271148 251888 244629 197243 224939 311477 321212 279342
8384 279342 252489 253364 266605 258075 253158 237066 230122 192727 172944 154893 156867 213017 293879
8371 293879 299575 296307 316929 329503 339383 326534 315096 287938 250336 237892 232339 229511 233027
8358 233027 204921 209852 175266 169333 205987 241470 254812 234693 230761 244997 233661 221486
$$ packed form
8445C22202p756J8251l9996M3931K7953k3270J555l2910m0703k7701j4941j3995
8433B12620K7764J6048J2750L4649L4095L609j7076l9095J2794Q3774K2617o892
8421C97657J1630l5393l9645o724P645k4543l7335m5952j6449L2599M1763J9892
8409C05145J873p229K4624l403l7708J9426J3214n2009R411J098l985J1876q041
8396B74292m6634k970J8003L3470n013j9260p259m7386K7696Q6538R735m1870
8384B79342k6853Q75J3241q530m917j6092o944l7395j9783j8051J974N6150Q0862
8371B93879N696l268K0622J2574R880j2849j1438k7158l7602j2444n553k828L516
8358B33027k8106M931l4586n933L6654L5483J3342k0119l932J4236j1336j2175
$$ plain form
8346 221486 195838 177573 196319 214296 230909 219800 237972 222896 206916 154163 136245 164083
8334 164083 231671 261620 272519 253996 249257 252019 234408 204817 205906 248228 294087 279282
8322 279282 214690 181594 154640 193634 216369 219881 230060 253883 220645 190195 208985 218567
8310 218567 229568 239155 268286 234357 243275 250122 214020 213368 240282 194990 159884 215264 254391
8297 254391 219598 198632 213487 224605 216346 203153 211948 211238 264267 257074 255639 239250 244419
8284 244419 249677 253305 273331 264708 221624 227409 204574 213307 217564 213090 195908 191859 233669
8271 233669 232953 169215 126250 145967 163219 167925 160944 171615 181834 177596 212282 220397 173921
8258 173921 168899 168910 191782 219298 225724 218671 223322 244860 250159 265314 286486 279659 262720
$$ packed form
8346B21486k5648j8265J8746J7977J6613j1109J8172j5076j5980n2753j7918K7838
8334A64083O7588K9949J0899j8523m739K762j7611k9591J089M2322M5859j4805
8322B79282o4592l3096k6954L8994K2735L512J0179K3823l3238l0450J8790R582
8310B18567J1001R587K9131l3929Q918O847l6102o52K6914m5292l5106N5380L9127
8297B54391l4793k0966J4855J1118q259j3193Q795p10N3029p193j435j6389N169
8284B44419N258L628K0026q623m3084N785k2835Q733M257m474j7182m049M1810
8271B33669p16o3738m2965J9717J7252M706o981J0671J0219m238L4686Q115m6476
8258A73921n022J1K2872K7516O426p053M651K1538N299J5155K1172o827j6939
$$ plain form
8245 262720 289879 252528 215973 211899 231285 240528 263147 241677 229191 242335 267000 271224
8233 271224 265929 194410 187771 208498 198887 162133 147304 203224 209585 205732 183449 190676 222454
8220 222454 190089 197342 181522 219584 253344 242388 215654 192522 223970 269486 251789 263957
8208 263957 241293 186602 203634 209209 226369 272619 267517 286580 299078 282407 229938 201261
8196 201261 241970 256666 210449 236273 226980 241197 228330 199198 201327 186799 153675 132164
8184 132164 146078 186895 159095 124140 142382 213742 236603 224925 194494 213947 235847 181575
8172 181575 165081 171663 173684 226263 251946 167872 120065 113207 95727 145560 180290 219723
8160 219723 246602 225149 206873 216173 223567 217184 202304 199448 197392 155427 141437 139521 113906
$$ packed form
8245B62720K7159l7351l6555m074J9386R243K2619k1470j2486J3144K4665M224
8233B71224n295p1519o639K0727r611l6754j4829N5920O361l853k2283P227L1778
8220B22454l2365P253j5820L8062L3760j0956k6734k3132L1448M5516j7697J2168
8208B63957k2664n4691J7032N575J7160M6250n102J9063J2498j6671n2469k8677
8196B01261M0709J4696m6217K5824r293J4217j2867k9132K129j4528l3124k1511
8184A32164J3914M0817k7800l4955J8242P1360K2861j1678l0431J9453K1900n4272
8172A81575j6494O582K021N2579K5683q4074m7807o858j7480M9833L4730L9433
8160B19723K6879k1453j8276R300P394o383j4880k856k056m1965j3990j916k5615
$$ plain form
8147 113906 118653 172081 199545 186270 168898 143027 113580 148002 207448 212982 194646 185569
8135 185569 192320 198676 151410 166300 169422 184191 194358 225531 240986 206786 228333 251119
8123 251119 275885 283008 216569 179308 152637 113235 157025 179283 193552 162357 211252 234577
8111 234577 212100 223212 227643 166053 158659 203642 178025 168685 133857 160893 184065 198452
8099 198452 214230 224654 233189 190749 186306 236085 265907 256230 238985 248459 268207 229751
8087 229751 234139 267518 268262 259840 284516 336414 311584 258215 250672 250400 277387 292913 325569
8074 325569 344983 350091 334214 362222 325493 306196 324698 329670 308280 273803 290709 285312
8062 285312 339636 417582 461739 508406 497649 500600 508262 529523 573712 636550 667646 701309
$$ packed form
8147A13906M747N3428K7464j3275j7372k5871k9447L4422N9446N534j8336r077
8135A85569O751O356m7266J4890L122J4769J0167L1173J5455l4200K1547K2786
8123B51119K4766P123o6439l7261k6671l9402M3790K2258J4269l1195M8895K3325
8111B34577k2477J1112M431o1590p394M4983k5617r340l4828K7036K3172J4387
8099A98452J5778J0424Q535m2440m443M9779K9822r677j7245R474J9748l8456
8087B29751M388L3379P44q422K4676N1898k4830n3369p543k72K6987J5526L2656
8074C25569J9414N108j5877K8008l6729j9297J8502M972k1390l4477J6906n397
8062B85312N4324P7946M4157M6667j0757K951P662K1261M4189O2838L1096L3663
$$ plain form
8050 701309 728641 756476 809983 857193 855828 846698 818535 762249 745663 784832 860017 863256
8038 863256 833639 794422 765219 765775 764300 743288 741190 789156 813886 825892 788710 760232
8026 760232 747698 761693 810453 866110 900625 902273 913904 965694 1002567 1051741 1105228 1157594
8014 1157594 1204396 1215866 1308329 1388357 1441636 1547527 1716162 1932612 2134543 2322750
8004 2322750 2374929 2304472 2160607 2001234 1881923 1756373 1642016 1592669 1610594 1554774
7994 1554774 1480339 1371051 1225958 1124665 1052827 1019416 1020886 1040100 1013597 1038055 1108498
7983 1108498 1182075 1219145 1267981 1322082 1320307 1324562 1357240 1335988 1373574 1474358 1563320 1635929
7971 1635929 1654142 1673438 1738623 1809185 1909539 1975848 2046401 2114197 2155422 2205381 2303770
$$ packed form
8050G01309K7332K7835N3507M7210j365r130k8163n6286j6586L9169P5185L239
8038H63256k9617l9217k9203N56j475k1012k098M7966K4730J2006l7182k8478
8026G60232j2534J3995M8760N5657L4515J648J1631N1790L6873M9174N3487N2366
8014A157594M6802J1470R2463Q0028N3279J05891J68635K16450K01931J88207
8004B322750N2179p0457j43865j59373j19311j25550j14357m9347J7925n5820
7994A554774p4435j09288j45093j01293p1838l3411J470J9214k6503K4458P0443
7983A108498P3577L7070M8836N4101j775M255L2678k1252L7586J00784Q8962P2609
7971A635929J8213J9296O5185P0562J00354O6309P0553O7796M1225M9959R8389
$$ plain form
7960 2303770 2344271 2324932 2320536 2281134 2234696 2191553 2081255 1924240 1794866 1731843 1690944
7949 1690944 1581658 1493517 1446855 1376717 1344241 1352639 1324659 1325341 1291160 1239685 1242232 1236147
7937 1236147 1211801 1210341 1261721 1351202 1415974 1453008 1500006 1491475 1521122 1553750 1576790 1605226
7925 1605226 1592754 1559302 1537793 1537415 1561031 1576391 1574266 1594148 1595962 1555687 1494648 1411660
7913 1411660 1343047 1304698 1265479 1226020 1203489 1211357 1183329 1158174 1186006 1191658 1129039 1096167
7901 1096167 1095073 1074075 1002750 935420 904881 872036 828176 809777 800658 777692 710678 707242
7889 707242 695160 703846 662666 638335 622595 633117 642558 629469 577001 526001 528779 580161
7877 580161 560402 523845 505476 507325 529722 528690 513449 503307 500660 494309 467628 472432 472699
$$ packed form
7960B303770M0501j9339m396l9402m6438m3143j10298j57015j29374o3023m0899
7949A690944j09286q8141m6662p0138l2476Q398k7980O82l4181n1475K547o085
7937A236147k4346j460N1380Q9481O4772L7034M6998q531K9647L2628K3040K8436
7925A605226j2472l3452k1509l78K3616J5360k125J9882J814m0275o1039q2988
7913A411660o8613l8349l9219l9459k2531P868k8028k5155K7832N652o2619l2872
7901A096167j094k0998p1325o7330l0539l2845m3860j8399r119k2966o7014l436
7889G07242j2082Q686m1180k4331j5740J0522R441j3089n2468n1000K778N1382
7877E80161j9759l6557j8369J849K2397j032j5241j0142k647o351k6681M804K67
$$ plain form
7864 472699 457228 460808 459801 436280 426562 404254 382135 352195 366110 381837 381252 356588 337443
7851 337443 282612 239363 235503 223018 220947 238425 254489 232507 180874 198424 198856 201459 179896
7838 179896 172857 137295 151722 172910 168847 172051 176438 198395 192315 184039 167940 134120 122696
$$ packed form
7864D72699j5471L580j007k3521r718k2308k2119k9940J3915J5727n85k4664j9145
7851C37443n4831m3249l860j2485k071J7478J6064k1982n1633J7550M32K603k1563
7838A79896p039l5562J4427K1188m063L204M387K1957o080q276j6099l3820j1424
$$ [...]
##END NTUPLES=NMR SPECTRUM
##END=
