##TITLE=Analysis number 329240
Compound Code cc 67828
Book Reference 521/107
Project Code adrs
Chemist Name evam
##JCAMPDX= 6.0         $$ Bruker NMR JCAMP-DX V2.0
##DATA TYPE= NMR SPECTRUM
##DATA CLASS= NTUPLES
##ORIGIN= Bruker BioSpin GmbH
##OWNER= nmr
$$ XWIN-NMR		Version 3.5
$$ Tue Aug 14 08:50:24 2007 GMT Daylight Time (UT+1h)  MAYBRIDGE\nmr@NMR_250MHZ
##.OBSERVE FREQUENCY= 250.131544655141
##.OBSERVE NUCLEUS= ^1H
##.ACQUISITION MODE= SIMULTANEOUS (DQD)
##.ACQUISITION SCHEME= undefined
##.AVERAGES= 16
##.DIGITISER RES= 18
##SPECTROMETER/DATA SYSTEM= dpx250
##.PULSE SEQUENCE= zg30
##.SOLVENT NAME= CDCl3
##.SHIFT REFERENCE= (INTERNAL, CDCl3, 0, 16.4448)
##AUDIT TRAIL= $$ (NUMBER, WHEN, WHO, WHERE, WHAT)
$$ ##TITLE= Audit trail, XWIN-NMR		Version 3.5
$$ ##JCAMPDX= 5.01
$$ ##ORIGIN= Bruker BioSpin GmbH
$$ ##OWNER= nmr
$$ C:\u/data/dgb/nmr/ADRS/580/pdata/1/auditp.txt
$$ ##AUDIT TRAIL=  $$ (NUMBER, WHEN, WHO, WHERE, WHAT)
(   1,<2007-08-14 08:49:55.26 +100>,<MAYBRIDGE\nmr>,<NMR_250MHZ>,
      <created by zg, POWCHK disabled, PULCHK disabled
       configuration hash MD5:
       76 6E 9A 78 1E 09 19 81 EC 84 63 8F B0 6A 59 2D
       data hash MD5: 64K
       9D 85 D9 69 65 F9 AB DE 84 7E 44 2B FF 00 BC D6>)
(   2,<2007-08-14 08:50:14.89 +100>,<MAYBRIDGE\nmr>,<NMR_250MHZ>,
      <Start of raw data processing
       ef LB = 0.3 FT_mod = 6 PKNL = 1 SI = 32K 
       data hash MD5: 32K
       71 03 89 3E 7E 98 7C 17 EC 34 08 55 41 A8 CD 58>)
(   3,<2007-08-14 08:50:16.53 +100>,<MAYBRIDGE\nmr>,<NMR_250MHZ>,
      <apk 
       data hash MD5: 32K
       07 89 A8 9A FB BF 26 80 B9 60 56 01 82 BD B2 AB>)
(   4,<2007-08-14 08:50:17.26 +100>,<MAYBRIDGE\nmr>,<NMR_250MHZ>,
      <abs ABSG = 5 
       data hash MD5: 32K
       C5 AE B0 AC F5 16 15 9E F5 E3 8D CF 7A 88 E5 96>)
$$ ##END=
$$ 
$$ hash MD5
$$ 4E 39 0C 9F 74 8A 97 46 F9 0B DC 66 C8 5A 72 03
##$RELAX= 
##$RELAX= 
##$RELAX= 
##$RELAX= 
##$RELAX= 
##$RELAX= 
##$RELAX= 
$$ Bruker specific parameters
$$ --------------------------
##$DU= <C:\u>
##$EXPNO= 580
##$NAME= <ADRS>
##$PROCNO= 1
##$TYPE= <nmr>
##$USER= <dgb>
##$AMP= (0..31)
100 100 100 100 100 100 100 100 100 100 100 100 100 100 100 100 100 100 
100 100 100 100 100 100 100 100 100 100 100 100 100 100 
##$AQSEQ= 0
##$AQ_mod= 3
##$AUNM= <au_zg>
##$AUTOPOS= <4 >
##$BF1= 250.13
##$BF2= 250.13
##$BF3= 250.13
##$BF4= 250.13
##$BF5= 500.13
##$BF6= 500.13
##$BF7= 500.13
##$BF8= 500.13
##$BYTORDA= 1
##$CFDGTYP= 0
##$CFRGTYP= 5
##$CHEMSTR= <none>
##$CNST= (0..31)
1 1 145 1 1 1 1 1 1 1 1 1 1 1 1 1 1 1 1 1 1 1 1 1 1 1 1 1 1 1 1 1 
##$CPDPRG= <>
##$CPDPRG1= <>
##$CPDPRG2= <>
##$CPDPRG3= <>
##$CPDPRG4= <mlev>
##$CPDPRG5= <mlev>
##$CPDPRG6= <mlev>
##$CPDPRG7= <mlev>
##$CPDPRG8= <mlev>
##$CPDPRGB= <>
##$CPDPRGT= <>
##$D= (0..31)
0 1 0 0 0 0 0 0 0 0.06 0 0 0 0 0 0 0.0002 0 0 0 0 0 0 0 0 0 0 0 0 0 0 
0 
##$DATE= 1187077793
##$DBL= (0..7)
120 120 120 120 120 120 120 120 
##$DBP= (0..7)
150 150 150 150 150 150 150 150 
##$DBP07= 0
##$DBPNAM0= <>
##$DBPNAM1= <>
$$ [...]
##$SUBNAM7= <"">
##$SUBNAM8= <"">
##$SUBNAM9= <"">
##$SW= 20.6930455092707
##$SWIBOX= (0..15)
0 0 3 0 0 0 0 0 0 0 0 0 0 0 0 0 
##$SW_h= 5175.983436853
##$TD= 65536
##$TD0= 1
##$TE= 297.16
##$TE2= 300
##$TE3= 300
##$TEG= 300
##$TL= (0..7)
0 120 120 120 120 120 120 120 
##$TP= (0..7)
150 150 150 150 150 150 150 150 
##$TP07= 0
##$TPNAME0= <>
##$TPNAME1= <>
##$TPNAME2= <>
##$TPNAME3= <>
##$TPNAME4= <>
##$TPNAME5= <>
##$TPNAME6= <>
##$TPNAME7= <>
##$TPOAL= (0..7)
0.5 0.5 0.5 0.5 0.5 0.5 0.5 0.5 
##$TPOFFS= (0..7)
0 0 0 0 0 0 0 0 
##$TUNHIN= 0
##$TUNHOUT= 0
##$TUNXOUT= 0
##$USERA1= <user>
##$USERA2= <user>
##$USERA3= <user>
##$USERA4= <user>
##$USERA5= <user>
##$V9= 5
##$VALIST= <valist>
##$VCLIST= <CCCCCCCCCCCCCCC>
##$VD= 0
##$VDLIST= <DDDDDDDDDDDDDDD>
##$VPLIST= <PPPPPPPPPPPPPPP>
##$VTLIST= <TTTTTTTTTTTTTTT>
##$WBST= 1024
##$WBSW= 4
##$XGAIN= (0..3)
0 0 0 0 
##$XL= 0
##$YL= 0
##$YMAX_a= 515049
##$YMIN_a= -384457
##$ZGOPTNS= <>
##$ZL1= 120
##$ZL2= 120
##$ZL3= 120
##$ZL4= 120
##$ABSF1= 16.4448
##$ABSF2= -4.248373
##$ABSG= 5
##$ABSL= 3
##$ALPHA= 0
##$AQORDER= 0
##$ASSFAC= 0
##$ASSFACI= 0
##$ASSFACX= 0
##$ASSWID= 0
##$AUNMP= <proc_1d>
##$AZFE= 0.1
##$AZFW= 0.1
##$BCFW= 0
##$BC_mod= 0
##$BYTORDP= 0
##$COROFFS= 0
##$CY= 12.5
##$DATMOD= 1
##$DC= 0
##$DFILT= <>
##$DTYPP= 0
##$F1P= 14.0000005364418
##$F2P= -0.99999901652339
##$FCOR= 0.5
##$FTSIZE= 32768
##$FT_mod= 6
##$GAMMA= 0
##$GB= 0
##$INTBC= 1
##$INTSCL= 1
##$ISEN= 128
##$LB= 0.3
##$LEV0= 0
##$LPBIN= 0
##$MAXI= 10000
##$MC2= 0
##$MEAN= 0
##$ME_mod= 0
##$MI= 0
##$NCOEF= 0
##$NC_proc= -2
##$NLEV= 6
##$NOISF1= 0
##$NOISF2= 0
##$NSP= 0
##$NTH_PI= 0
##$NZP= 0
##$OFFSET= 16.4448
##$PC= 1
##$PHC0= -46.60461
##$PHC1= 4.886653
##$PH_mod= 1
##$PKNL= yes
##$PPARMOD= 0
##$PSCAL= 4
##$PSIGN= 0
##$REVERSE= no
##$SF= 250.130019307688
##$SI= 32768
##$SIGF1= 0
##$SIGF2= 0
##$SINO= 400
##$SIOLD= 32768
##$SREGLST= <1H.CDCl3>
##$SSB= 0
##$STSI= 32768
##$STSR= 0
##$SW_p= 5175.98343685301
##$SYMM= 0
##$S_DEV= 0
##$TDeff= 65536
##$TDoff= 0
##$TI= <Analysis number 999999
Compound Code 99
Book Reference 9
Project Code 9>
##$TILT= no
##$TM1= 0
##$TM2= 0
##$TOPLEV= 0
##$USERP1= <user>
##$USERP2= <user>
##$USERP3= <user>
##$USERP4= <user>
##$USERP5= <user>
##$WDW= 1
##$XDIM= 32768
##$YMAX_p= 448110684
##$YMIN_p= -58449
$$ End of Bruker specific parameters
$$ ---------------------------------
##NTUPLES= NMR SPECTRUM
##VAR_NAME=  FREQUENCY,     SPECTRUM/REAL,   SPECTRUM/IMAG
##SYMBOL=    X,             R,               I
##VAR_TYPE=  INDEPENDENT,   DEPENDENT,       DEPENDENT
##VAR_FORM=  AFFN,          ASDF,            ASDF
##VAR_DIM=   32768,         32768,           32768
##UNITS=     HZ,            ARBITRARY UNITS, ARBITRARY UNITS
##FACTOR=    0.157963299565203, 1,           1
##FIRST=     4113.33799724052, 0,            0
##LAST=      -1062.64543961249, 0,           0
##MIN=       -1062.64543961249, -58449,      0
##MAX=       4113.33799724052, 448110684,    0
$$ Real data points
##PAGE= N=1
##DATA TABLE= (X++(R..R)), XYDATA
$$ [...]
17267E1364K5866L7627N3373R4257R7859J8022r8699j02176m9718l3629k7994
17256F6152j7183k3725j3063n954J8736K836p881k0833o254N994O322n038l76
17243b67R131K0521k135j0853j9730m458J5770J6239j1168j5037p198M860N781
17230A456o4o822r075p911J15J97l364N001J3676K076P563J870p872j184J0132
17215E794M260m911k367J0000L455n431k3647j3532J3031N059k340o31j3230L137
17201b1353R87R225M520J2447R552j683j4387R13Q244J0643N438j0931r00J2511
17187B5226p393N993P635p385j9262m968j9759J704P598J855o475O721P291k0243
17173b1462j4600J1570J1130N620K623J2019K223j0335J58M868Q771k1069j7844
$$ y = [51364, 77230, 114857, 168230, 262487, 360346, 378368, 279669, 177493, 127775, 94146, 66152, 48969, 25244, 12181, 6227, 24963, 27799, 19918, -915, -7169, -1175, 5147, 109, -267, 8864, 29385, 27250, 16397, -3333, -7791, 7979, 24218, 13050, -1987, -9185, -4325, 1456, 1392, -5430, -14505, -22416, -22301, -22104, -25468, -20467, -6791, -4715, 2848, 4718, -3154, -4338, 5794, 10054, 5143, 2776, 12776, 16231, 10800, -12847, -26379, -13348, -8289, -10629, -11260, -24490, -21353, -20366, -11141, -6621, 5826, 15378, 13695, -692, 221, 8465, 19108, 24546, 13615, 12715, 25226, 17833, 23826, 31461, 24076, 4814, -154, -19913, -18209, -10611, -8756, -15231, -8510, -1219, -21462, -36062, -24492, -13362, -7742, -5119, 6900, 9123, -1212, -1054, 3814, 12585, -8484, -26328]
17160b6328J1377R704j0869k386L171N577J5225J0720q883q844j0161m676J726
17147a4647M170j256q963r016o969J3k164K2934J8045M339k1195k5402O779P745
17133b5587O439O267P52p851Q30Q769J4388j361j2583J1243N129J86L586j562
17119H645o799p35M11O200j977j084l71K775r874j2482j4562J2505J4863l769
17105f254L000p556N186J4142j7126l107k612J8409j864J673j686j2033q348j1145
17091b9321k987J9591k801n201l844P333K299m403k81Q971O23M410R19L55m651
17076h988M924l394o36M894J2964o83l167L194j1154o051P379J060o72J735L485
17061D890J623j2078K642j639l817k894Q620N657R718q913Q024P646q577j0342
$$ y = [-26328, -14951, -5247, -16116, -18502, -15331, -9754, 5471, 16191, 7308, -1536, -11697, -16373, -14647, -10477, -11733, -20696, -29712, -36681, -36668, -38832, -15898, 2147, 6486, -14709, -40111, -33332, -25587, -19148, -12881, -12129, -19980, -19150, -10381, 4007, 2646, -9937, 1306, 6435, 6621, 10207, 8645, 1846, 1111, 1522, 7722, 5745, 4661, 4290, 7065, -2809, -15291, -29853, -17348, -2485, -6254, -3254, -10810, -5624, 8518, -8608, -11715, -14327, 4082, 2218, 3891, 2205, -9828, -18176, -29321, -32308, -12717, -15518, -20719, -24563, -17230, -14931, -19334, -19615, -10644, -10021, -5611, -4692, -4337, -8988, -4064, -7458, -8094, -3200, 9764, 9081, 5914, 9108, -2046, -8097, -718, 342, -330, 1405, 4890, 6513, -5565, -2923, -4562, -8379, -11273, -2653, 3004, 12722, 3809, 11833, 19479, 10902, 560]
17047E60m001O280L883J379j7996o691p899n566J6283L175J0840J0979O013k106
17033A5133p02o143%j9358O778k727J154N657J1128M116M609P69j9017j881J0032
17018I548Q333q086j794j5528q404J0914r42n219J5794M039P433n465j0198o358
17004e933l807j117J1991J543q785q623l128M292M937J1614J795p564m871l407
16990a1063K4424J281m219j185J1257q965j8709M127R144J762K661J0029l03N11
16976B0752k82o163j1778j2899R009K696j096j1060J4747K028K708L053j208j5175
16962d668j8642k870M319J4033O28o381l299J0635L346P976J564q563N695Q290
16948A2063j0207J550K38q543r020l912l480J4384J8404N147m083k4356R405R507
$$ y = [560, -3441, 2839, 6722, 8101, -9895, -16586, -24485, -30051, -13768, -10593, 247, 11226, 17239, 15133, 14431, 8288, 8288, -11070, -4292, -7019, -5865, -208, 10920, 15036, 19645, 20414, 1397, -484, 9548, 17881, 9795, 8001, -7527, -15931, -5017, -5959, -11178, 4616, 8655, 16088, 10623, 425, -5933, -9740, -10857, 1134, 2677, -6108, -14731, -17859, -13567, -8630, 2984, 4779, -2785, -7656, -11063, 13361, 14642, 10423, 9238, 20495, 11530, -7179, -3052, 6092, 7854, 10515, 20544, 20241, 20752, 20470, 14307, 2529, -10370, -1361, 1335, 239, -10821, 3926, 5954, 8662, 11715, 10507, -4668, -23310, -26180, -21861, -7828, -7200, -13581, -16880, -6245, -2899, 5077, 6641, -1922, 3773, 12063, 1856, 3406, 3644, -4899, -13919, -17831, -21311, -6927, 11477, 16624, 12541, -11815, -2410, 7097]
16934G097r791N503R592R281L568k668k895n235N635j1813o793K53m851k6j5538
16919a8681q16J2794P882L1277L577j1281j2319j5069P193R869Q17m765k459K8
16905H047j4878Q80J4120J196O10j8604j2002k231P566Q961K49K592j2474p838
16891b3806J3221K807M111J4308Q439j065k728r322R57k222j0227J5280m989j2512
16877g748j430O851J90J0478k154n297O956Q595l813k708j2450K10K320k406J1016
16862H610j3468o37q886J16J3335R18q606n69P302R916R655j1827o884L515r664
16847g174q333M864K0484N409q061Q518N482j0458r145q084p622J8385O595Q438
16833A9298j1913l027j1300p907n962m262N650L759J0909J2893J0890j725j5614
$$ y = [7097, -2694, 2809, 12401, 21682, 25250, 22582, 19687, 14452, 20087, 8274, 1481, 1734, -3117, -3143, -18681, -19497, -6703, 1179, 32456, 36033, 24752, 12433, -2636, 4557, 14426, 15243, 10478, 8019, 8047, -6831, -5951, 8169, 9365, 9975, -8629, -20631, -22862, -15296, -6335, -6086, -3494, -15968, -23806, -10585, -7778, -3667, 10641, 19080, 18015, 15287, 5965, 6922, 4700, -5527, 9753, 4764, -7748, -9178, -2327, -2137, 8341, 6187, 890, 7846, 16441, 12628, 9920, -2530, -2320, 0, -2406, 8610, -4858, -5495, -14381, -14265, -930, -12, -8618, -9187, -1885, 8031, 17686, 5859, -1025, 2490, -7174, -15507, -10643, 9841, 15250, 7189, 15707, 21189, 10731, 1586, -6498, -14120, 4265, 10860, 19298, 7385, 4358, -6942, -14849, -20811, -25073, -19423, -15664, -4755, 8138, 19028, 17303, 1689]
16820A689q449k079R5Q194L118p133j3793j710K041L927K212l965Q034j788j8418
16805b8025P303O898J626K715m354j3812j725J4003O85N180p96J4904K62K437
16791G301K792k875o00L870J3532o704k0980N917l558Q134P293J2021n516k3130
16777b503m203J8866n730o96r560j1746J6175J74q852J890J3005J1374j033j5651
16763A510L346K3837O62j5465j9544J3158M237L164J5616M951n924L90k335p662
16749A9941N552N277j4113j3871J222N33j8943N523O69Q580K3629M863j7428p829
16735C605l061M934j2415j4750m688J3477K1147n996n449K959p249L330r30L507
16721a579J788r468j1857J1737J1284J4337p952o898r234m176N012M155P994Q77
$$ y = [1689, -6760, -8839, -8744, -550, 2568, -4565, -18358, -20068, -18027, -14100, -11888, -15853, -7819, -9607, -28025, -20722, -13824, -12198, -9483, -13837, -27649, -29374, -15371, -14686, -9506, -10302, 4602, 4864, 7301, 10093, 7218, 6618, 10488, 24020, 17316, -3664, 2253, -1305, 6829, 14122, 26143, 20627, -2503, -6706, 12160, 6430, 5734, -3826, -15572, 603, 777, -8075, -6185, 6820, 18194, 17161, 1510, 4856, 28693, 29355, 13890, -5654, 7504, 11741, 14905, 30521, 35472, 29548, 29938, 27603, 19941, 25493, 30770, 16657, 2786, 4008, 4541, -14402, -8879, -8210, 370, 23999, 28862, 11434, 3605, 544, 5478, -6937, -21687, -26375, -12898, 8249, 2253, -3196, -237, -7486, -4156, -5086, -1579, 209, -9259, -21116, -9379, 1905, 16242, 8290, 1392, -7842, -12018, -7006, -2851, 5143, 6020]
16707F020J2136K870j0396j0144R438l764p388m516J0675J2823m45m22j4567r381
16693g061j7208m045K2051M368o044k4571M715R4J5032J0571L922k440O711m091
16679B004K925n21j5322J3724P228p828r055p875K0693k808j3268O029M893j05
16665G14M599o79K690q0r294j5342k785J5457O918j0419j2463k260J6695K881
16651c368p844p279M574R304R021R863j025m047j0347l616j0241O466J2567M709
16637H737l370j1934j0295N404J3767n167l644q581p177R989K1698R529k900j9224
16623c168q436n64O163N682q493j830J132M822J0997K801N952J4841N932j0982
16609B4849j3500r335l151J973Q206n619j2655P304J4670k49m289P91K5O283K529
$$ y = [6020, 18156, 21026, 10630, 486, 9924, 6160, -1228, -5744, 4931, 17754, 17309, 16887, 2320, -7061, -24269, -28314, -6263, -1895, -7939, -32510, -27795, -27701, -12669, -2098, 1824, -616, 6095, 2004, 4929, 4408, -10914, 2810, 10038, 2210, -6845, -14720, 5973, 3165, -10103, -4074, 819, 714, 5313, 4634, 7324, 7244, -2050, -17392, -20177, -4720, 2198, -8221, -20684, -22944, -6249, -3368, -11212, -18491, -13917, -4613, 4408, 14271, 13246, 9199, -1148, -4764, -15005, -8539, 4028, 8737, 5367, -6567, -16862, -11458, 2309, -2858, -6502, -15083, -22260, -12271, 9427, 18956, 16056, -3168, -11604, -12168, -6005, -323, -8816, -10646, -9514, -4692, 6305, 9106, 15058, 29899, 35831, 24849, 11349, 2014, -1137, 836, 9042, 3423, -9232, -1928, 12742, 12493, 8204, 8995, 9020, 15303, 17832]
16594A7832q84q696j516j4516p307m570N473J0174j390K491j205m273j1563o392
16580b6342l855j1310J2387K4496J7110L705n193j2664j6178j3458m796J7687
16568a8411R786N801j1181O166J7523N055j5984L43p443m417J160N880J0657o744
16554a809K475J914k263J2028k0878n083J1513j7751k073N084Q577J3446J1392
16541A6572n08q085O374O591K484p512o622J3178M896k8682j3936Q712p165o535
16527b0238M459J3236K267k238M039j3198M98j3465J4747k179j8908m670K4027
16514a1623O497k879J0530M088M220j858L8j4223J850K190j0877o733J8208J2739
16500A2167q040n043R64p264j0113K4554J4648r197K16p821j0778K819J9607R918
$$ y = [17832, 16948, 8252, 6736, -7780, -15087, -19657, -14184, -4010, -5400, -2909, -4114, -8387, -19950, -26342, -30197, -41507, -29120, -4624, 12486, 16191, 10998, -1666, -17844, -31302, -36098, -18411, -8625, -2824, -14005, -7839, 9684, 14739, -1245, -902, -8345, -12762, -11602, -5722, 4935, -1809, 666, 2580, 317, 12345, -8533, -13616, -2103, -19854, -21927, -16843, -8266, 5180, 16572, 16064, 7979, 14353, 20944, 23428, 15916, 9294, 22472, 27368, -1314, -15250, -6538, -13703, -20238, -15779, -2543, -276, -2514, 1525, -11673, -11175, -24640, -9893, -12072, -30980, -35650, -11623, -5126, -8005, 2525, 6613, 10833, 8975, 9013, -5210, -3360, -1170, -12047, -18780, -572, 12167, 4127, -916, 48, -7216, -17329, 7225, 21873, 12676, 12892, 5071, -5707, -2888, 16719, 26637]
16486B6637j7030k6440L757J2507m235m540q101j837L771j9126J7587K0027j1486
16473h509L166n814j0251P835J7149J865j9293Q53J4467j819j644K765L309o631
16459b552m77l905o097J0857J0361j6018o803O985m361R34q095l037m614M199
16445b2623P847l821m492Q385J3606Q074m026j5117m442l223K823q144P701J7131
16431c21L523p257k0075k690J106n637M958O511J0467J4334k646l703L52o706
16417g784J1203n97l07L53j3117j7148J9279M791K605j1984J553J2796k162l280
16403c799N459K032J7069J5744n172j1361q519r923r65j0507N544J1028J3157
16390A9787j2506o237r78L438J713l360l215O601k972j772O180J640q562L713
$$ y = [26637, 9607, -16833, -13076, -569, -4804, -9344, -17445, -19282, -15511, -34637, -17050, 2977, -8509, -5343, -11157, -21408, -13573, 3576, 5441, -13852, -12999, 1468, -351, -1995, 770, 4079, -2552, -3029, -6934, -13031, -2174, 8187, -7831, -14634, -7649, -12010, -11076, -19171, -22208, -26822, -22623, -14776, -18597, -23089, -14704, -1098, 6976, 2950, -12167, -16609, -19832, -17009, -25153, -17452, -321, 3202, -4055, -24130, -26820, -25714, -31351, -26393, -19882, -9415, 4919, 2273, -1430, -1078, -7784, 3419, 2822, 2515, 2868, -10249, -27397, -8118, -3327, -722, -12706, -11153, 1643, -519, -3799, 1660, 3692, 20761, 36505, 31333, 19972, 11453, 1530, 565, -9942, -4398, 6630, 19787, 7281, 1044, 66, 3504, 5217, 1857, -1358, 5243, 2271, 499, 6679, 8319, -243, 3470]
16376C470q357q234O666q22k506J6465J3219N905l162k826M824Q958j0750k0210
16362B640j2592J3810P652j2694j3915K30O357P018j177j1916R187K0831J090
16349A6521r248N175O826J488j1454k0286j6384M042R51J1017Q128J867K611p298
16335f044P255P943r294L157J575p944m315M65Q117j442N089N645L461j0446r85
16320B237l346Q8M326j2173l980R614J7890J475j2994j5486p574R498M499j6461
16306b2387r984J0848K2939Q349q005j0314p868J2849J698J4359j0285J1122L742
16293A7063k75q592o147L984j1562j2664j961J2235J6784J2167P297o022r162
16280A3145J225M666p94j534j4749k8963P465J0244o09N924N583j251n793J071
$$ y = [3470, -4887, -13121, -6455, -7277, -9783, 6682, 19901, 25806, 22644, 19818, 24642, 33600, 22850, 2640, -9952, 3858, 11510, -1184, -15099, -14869, -8512, -1494, -2671, -14587, -5400, 15431, 16521, 7273, 12448, 19274, 20762, 9308, -10978, -27362, -23320, -22369, -11352, -3224, -1357, 1254, -6044, 1211, 9154, -140, 3017, 4592, -3352, -7667, -7202, 915, -527, 4562, 10207, 13668, 3222, 2237, -1109, -1021, 3305, -8868, -12848, -3234, 14656, 16131, 3137, -12349, -19923, -10425, -5926, -22387, -32371, -21523, 1416, 9765, 1760, -8554, -16422, -3573, -1875, 12484, 2199, 13321, 17063, 16788, 8196, 2049, 6033, -5529, -18193, -20154, -7919, 8865, 21032, 28329, 22307, 13145, 14370, 19036, 18242, 16708, 1959, -27004, -19539, -9295, -9904, -3980, 1603, 352, -5441, -4370]
16266d370O497j876O828M915r141j0996J320P633R698o754k308j3242L317m037
16252a2516J995l592j0846O863J8179m869m535O266m729O153k444q492K819L220
16238f528j894j0078O015Q522J1311J0080p032j3943j2979j6966q92p61K4856
16225a0289n155p060M781J3411L949k468j4708j1843P116K1978j5964l044J6728
16212b568J9708k444J898p70o175q459j3282j1760K4721q521j479k725Q497M221
16198H62L87N017O858j7811K317J3334J717n487P121p375p522R557l980j2771
16184g776j3569K1519J3194J454k172j0287k836q156l062J2828N155P743j2586
16171A449j1196J2599r157P53M833k999P813N023N049j829p635K370j2570M803
$$ y = [-4370, 2127, 251, 7079, 11994, 2853, -8143, -6823, 810, 10508, 3754, 1446, -11796, -8479, -12516, -10521, -14113, -24959, -18096, 83, -4786, -9321, -3055, -7784, -1631, -4075, -12567, -9748, -6528, -8422, -18500, -12485, -3963, 7348, 17428, 10396, -3547, -16526, -33492, -34384, -35145, -10289, -15444, -22504, -17723, -4312, -363, -2831, -17539, -29382, -22266, -288, -16252, -19296, -2568, 17140, 14696, 16594, 15824, 9649, 1190, -12092, -23852, 869, -7652, -9131, -11856, -3359, 862, 1249, 6266, 13124, -4687, -2370, 10964, 12681, 7194, 14315, 6940, -582, 8975, 4995, -7776, -21345, 174, 13368, 14822, 12650, 2363, -473, -8629, -11691, 1137, 6292, 14035, 1449, -9747, 2852, -6305, -5552, -719, -3718, 4095, 9118, 14167, 12338, 4703, 7073, -5497, -694]
16157f94m103p371N371N872L143k60L569m445l819k631M121m752m967M115Q980
16142B129p583Q131Q93r783j321J164M689p378J0262J527J0058O483m991n910
16128H370j2746j3340O698j536L913J7605r92k518Q834R380Q05k1449k0467J2978
16114d465J6915J891r891o445M653L124J446O78m310n797k31j382j1889r829J1419
16099a4113J5460J1583j736K424J258j7675M184Q026Q028J3816q951j3175l942
16086E187P466j073j6790p608k508j601Q621P784O175M822j2794n19K4928J3363
16072C5453k0906K418j2225k8814K085J9698J0679J0464m639Rm710P558J053j473
16058A6650p811n636p777Q624n862k088k160J812M378l62k198l463L64N997J2346
$$ y = [-694, -4797, -12168, -6797, -925, 2218, 1958, 5527, 1082, -2737, -5368, -1247, -5999, -10966, -6851, 2129, -5454, 2677, 3570, -6213, -7534, -6370, -1681, -9059, 1203, 2730, 12788, 19271, 14280, 8370, -4376, -17716, -11018, -12554, -8641, 8964, 7972, 5454, 14288, 23668, 24473, 3024, -17443, -4465, 12450, 14341, 4450, -1995, 2658, 5782, 7228, 7906, 3596, -2201, -2432, -3814, -15703, -25532, -14113, 1347, 12930, 11194, 13618, 14876, -2799, 1385, 9411, 17439, 31255, 22304, 9129, 5187, 12653, 11580, -5210, -12818, -15326, -16927, -8306, -522, 5653, 10475, -2319, -2838, 22090, 35453, 14547, 16965, 4740, -24074, -21989, -2291, 8388, 18852, 14213, 14222, 9512, 17070, 18123, 16650, 8839, 3203, -4574, 4050, -1812, -3900, -6060, -4248, 130, -232, -2430, -5893, -5529, 468, 12814]
16043A2814q644j6069J0413K6245m187j9811k6845k512m277o599Q817R341N478
16030a5836R568R626O688r222l322q486l644J1771J0795n664k164M307N427J92
16016A0036j4255q726J6771J0363o648j6369L90N769j3358J0273J3559m527n231
16003a953J4073M637O253o93l050j3652j5617Q18n708j378O748k05j3298O153
15989a6872Q357L853m608j514N782J4831J141o915N771m818j1727o677J1064Q999
15975F667n37M158J6344o312m451o154J713J1265j1543n356j59j911j8081j904
15961a6261O322r758M595n515J4503n804O67O326K0197J1375n907q874m764K401
15947I503p572r907J4000p560r93j916N347l568M416R820n087j9483j0008k662
$$ y = [12814, 4170, -11899, -1486, 24759, 20572, 761, -26084, -28596, -32873, -39472, -30655, -21314, -15836, -6268, 3358, 10046, 824, -2498, -10984, -14628, -2857, 7938, 2274, 110, 4417, 9844, 10036, -4219, -12945, 3826, 14189, 7541, -8828, -8438, -2669, -16027, -5754, 7805, 3278, -1953, 12120, 16757, 23010, 22317, 19267, 5615, -10002, -9184, -14892, -16270, -9522, -9727, -23025, -16872, -8515, -4662, -9270, -10784, -5002, 9829, 10970, 4055, 9826, 5008, -6719, -13396, -2332, 6667, 6130, 10288, 26632, 20320, 15869, 9715, 11428, 22693, 11150, 5794, 5635, 3724, -14357, -16261, -9939, -19697, -15102, -20617, -6114, -11918, -11251, -4925, 15272, 26647, 20740, 11866, 7102, 9503, 1931, -7976, 6024, -1536, -2529, -4445, 902, -2666, 1750, 11570, 6483, -13000, -23008, -25670]
15933b5670k328J6048K4181k193r129o721Q493q89J1208k004r588O81m563p842
15919a0316j3085L976J4984j0681o222K9058J5277N524j9420j8829l321J3044
15907a1K647o576R561J6173m425j3159j4455n863J0689k057J0158J578J497P431
15893A3188L846J736j5793k5979J6384Q916n324j2173j500m505p737J8328J3676
15880C063j830r773k2271j353J299J0108P63O548N768l530j3725o718L167K269
15866b6215K684N681L278J0215R621J245N969q498q503M332J4901K2j2463J868
15852D137K704j5562O874R960O591n75N88N418r265j0963j2355K154K539J594
15838f161n558l559M329J0053J1035m837k293n504j0964R47j3000n841l721K808
$$ y = [-25670, -27998, -11950, 12231, 10038, 909, -5812, 2681, 1792, 13000, 10996, 1408, 2089, -2474, -10316, -23401, -19425, -4441, -15122, -21344, 7714, 22991, 28515, 9095, -9734, -13055, -11, 2636, -3940, 5621, 21794, 17369, 4210, -10245, -16108, -5419, -7476, 2682, 4260, 5757, 13188, 17034, 18770, 2977, -23002, -6618, 2298, -3026, -15199, -16699, -21204, -28941, -10613, 3063, 1233, -8540, -30811, -32164, -30865, -20757, -19994, -13446, -7678, -11208, -24933, -31651, -28484, -26215, -23531, -17850, -14572, -4357, 5264, 6509, 12478, 3980, -4523, -191, 14710, 14732, 2269, 4137, 6841, -8721, -1847, 8113, 14704, 14129, 14717, 20135, 10870, -93, -12448, -10294, -7755, -6161, -11719, -15278, -10949, -896, 10139, 5302, 3009, -2495, -13459, -12512, -25512, -31353, -35074, -32266]
15824c2266J492J6261r974o366K571O374R91K831K9282J3696M707n470k4517o569
15810f957j251o3o294m722p246K0800K0508j5996q512O90J8627J4784K525l741
15796B3152L108j0142j8800N38M417P815j2014k403P69L03J1377j494j084j3249
15782g707l205j0909O1l314Q966Q105j92P383q63o764J4011J4329l860j1348k658
15767B035N097L46k0713j3925J6427M106j4070K7941J9323p74j4646m207J0877
15754A7817m572J541K503J0920l860j6228k1455P570J3402J0091o762p080O717
15741A0604O421J183J312k071q440o29l534n649O143J1730P499j4147j4922r041
15727a3541l061Q515J4426o777L499m755N433N250K494J1124R651p973k4223j2773
$$ y = [-32266, -30774, -14513, -24487, -30853, -28282, -21908, -20917, -18086, 11196, 24892, 29599, 24129, -388, -6957, -8208, -8271, -14565, -19287, -26533, -5733, 14775, -1221, -9733, -9043, 9584, 24368, 26893, 23152, 26260, 16118, -2682, -2144, 2273, 10088, -1926, -4329, -3560, -3257, 8120, 6626, 5542, -7707, -10912, -21821, -21760, -25074, -16108, -8003, -8195, -812, -1675, -8439, 5572, 19901, 16041, 4693, 2035, 7132, 7478, -13235, -27160, -10733, -6627, -20697, 7244, 26567, 25793, 11147, 6940, 17817, 13245, 14786, 17289, 28209, 24349, 8121, -13334, -5764, 7638, 17729, 10967, 3887, 10604, 17025, 18208, 19520, 17449, 9009, 8380, 4846, -803, 5340, 17070, 24569, 10422, -4500, -13541, -16602, -8087, 6339, -438, 3061, -1694, 3739, 8989, 11483, 22607, 32258, 24285, 62, -12711]
15713a2711Q214L859J3127j3555k855N300j4994j834R928M457N966N5O536l020
15699H473p443O303K936n592q17J2114j0074j4183k539l72L118K190J860N518
15685A492k295N758j769J992Q318M244r853L30J6410o32o722j0303K508p033j5971
15670a3526L92l912K3185J0914m536p130L789N445N476L852j185m302j0611j1703
15656c852j0219l042J8410l105p700R622O729j199p355m992j522K388K237J0696
15642G096J7314K548O208r220k5900q100J1592k135o687m5L982n24O130o407L129
15627a019J0626o524J551j257j0531p8m723l535J1886J3507K763j0209q217n087
15613a0847M302K7680J2629O910q896j7305j5583j0387J4499o006j854K330J623
$$ y = [-12711, -4497, -638, 12489, -1066, -3921, 1379, -13615, -15449, -5521, -1064, 4902, 4957, 11493, 8473, 1030, 7333, 10269, 4677, 3860, 15974, 5900, -8283, -10822, -11194, -8076, -5886, -4026, 1492, -803, 4955, 3186, 5178, 13496, 17740, 7887, 8217, 24627, 23995, 17273, 6970, 9478, 2445, -13526, -13134, -17046, 6139, 17053, 12517, 5387, 9176, 14621, 20097, 23949, 22764, 18462, 7851, -3852, -14071, -17113, 1297, -1808, -9508, 114, 6843, 5644, -1711, -6703, -8225, -5837, -3600, 7096, 24410, 26958, 33166, 23946, -1954, -10054, 1538, -597, -7284, -7329, -3347, -3871, 2259, -4148, -1019, 9607, 3083, 4634, 3377, -7154, -7232, -11955, -15490, -3604, 9903, 12666, 2457, -5760, -10847, -6545, 21135, 33764, 40674, 31778, 14473, -1110, -11497, 3002, -3004, -4858, -2528, -905]
15600i05m470R247J0624L957l808j0937M214p103j7636K142J1636k021p212N405
15586f867N01M621J8722p284r000J1741N0k0351l749J40Q645N550J1030j0399
15572C350j8419M035N742q468k787J9071J6009n508j5349J54j0250L728J2842
15559D150j128r077L793R810P772N63k4036Q777M046k814J372J1719o561j7176
15545h790m736j112j2353n386J5771P782j4228o642M521K0925J3299l255O869
15532A2665l116o028R425K037O380o522l469O223o132j576K870L900j911j9739
15518d993j8837J6233P932R499N973l008o562M198p808j1799n787N017Q300L121
15504A479n147L500J7685j0678j3674m534J0313Q145m348l990J16O298j2192R966
$$ y = [-905, -5375, 3872, 14496, 18453, 14645, 3708, 7922, 819, -16817, -14675, -3039, -5060, -12272, -6867, -6366, -1745, 16977, 9693, 693, 12434, 12484, -7867, -11616, -11476, -2831, 2719, 13749, 3350, -15069, -11034, -5292, -13760, -16547, 2524, 18533, 13025, -2324, -2170, -12420, -8692, 4150, 3022, -6055, -2262, 7548, 15320, 15883, -8153, 624, 4670, 1856, 3228, 14947, 8386, -8790, -13526, -14638, -26991, -32377, -16606, -8824, -23052, -29694, -25173, -4248, 9051, 5796, 12665, 9549, 3521, 12946, 14983, 21363, 14841, 11372, 17595, 11463, 9887, 12757, 16657, 14746, -4993, -23830, -7597, 335, 9834, 15807, 12799, 6237, 10435, 2627, -9172, -14959, -9942, -1642, 1479, -3668, -168, 17517, 6839, -6835, -11369, -1056, 7089, 2741, -1249, -1133, 5165, -7027, 2939]
15490B939J6539l140O58L23j6636k358n385J513k667o361n470M309L839J2213
15476C16R714K324L654p566o68O269l215J0609k4861j0347k008J109J727R155
15462c788p640N343J5503o605j1521Q702k31j0247q32O631K248J1354j658j9617
15448a2358J1303K5674J7447K1946j5786j3505j7121j6917J0827J9256J0262k753
15436C8275j0706j4552j0578j8669J585J3991Q465L34Q142j414p542J418L273
15423A2022Q800k051r97j8498o688J7202O519j4065n313n334m364M504J2947N015
15409I699O520N699m455n526l454m163q042J0940K368k255J1964J697k670J2095
15395C0417J0092j4341r839O100j5277j3246Q16l777j2075P980n45J0883L946
$$ y = [2939, 19478, 16338, 16996, 17319, 683, -1675, -7060, -5547, -8214, -14575, -20045, -15736, -11897, 316, 10030, 12354, 16008, 8442, 7774, 14043, 10828, 21437, -3424, -13771, -15779, -14670, -12943, -3788, -11428, -6085, 9418, 2813, -8708, -6, -237, -10484, -11316, -4685, -2437, 8917, 7259, -12358, -1055, 24619, 42066, 64012, 48226, 34721, 17600, 683, 11510, 30766, 41028, 38275, 27569, 13017, 2439, -16230, -14645, -654, 7811, 8145, 16287, 14873, 7331, 8749, 12022, 20822, 18771, 17774, -724, -7412, 9790, 16309, 2244, -3069, -8403, -12767, -8263, 4684, 9699, 16219, 21918, 17463, 11937, 8483, 4320, -3722, 7218, 9586, 7331, 19295, 20992, 18322, 30417, 40509, 26168, 16329, 22429, 7152, -6094, -5278, -9055, -21130, -13150, -13695, -2812, 1134]
15382A134j7158o920J6541K6518N444j0635n811L445k227J6210O848o290q143
15369A8956j2140j9718N431O602R58j1325n754Q606J6106j1926r258m16K915l928
15355a4891p208j246J2389J5089L828J1757L374R21j0926m834J7233N267J940
15342C2693n101j4341m103l781k328Q619j4448p604O647p482J975J8323J591o237
15328D423L570n485p829q025r334m894M452Q319k604J212J1655J8606l613Q80
15314A1333o431o901r282k16K3555P165j0996k100R266K474k812m098p109j6276
15300a2428J734Q696O938l031L361p89P031o005j273o403j7K590m872l757l198
15285a1423L490m272N67o627p263J5162K4624J6634r040o197r557j5984r086M109
$$ y = [1134, -16024, -22944, -6403, 20115, 25559, 14924, 9113, 12558, 10331, 26541, 33389, 27099, 18956, 6816, -12902, -7471, -869, 89, -11236, -16990, -8384, 7722, -4204, -13462, -13878, -10963, -14891, -22099, -23345, -10956, 4133, 7961, 19718, 23092, 24013, 13087, 8253, 25486, 30753, 32693, 27592, 13251, 9148, 5367, 3039, 11658, -2790, -10394, -3747, -11229, -9254, 9069, 10660, 4423, 7993, 2508, -5321, -13346, -22680, -27574, -23122, -14803, -17407, -16195, -4540, 14066, 10453, 11333, 4902, -1999, -11281, -11497, 12058, 19223, 8227, 6127, 15393, 17867, 15055, 10957, 3848, -12428, -10694, -1998, 4940, 1909, 5270, 4481, 11512, 5507, 4234, -2169, -2186, 404, -4468, -8225, -11423, -7933, -12205, -11638, -18265, -25528, -10366, 14258, 30892, 21852, 15655, 6098, -9886, -18972, -14863]
15271a4863N461J8464j9984q564q363L949J4125M852J836P213M631J140j0806
15258i09R060Q703p859m562J2622N17p356J059J0099P947l46o304n563j2708q658
15243d258j2989l391l728M851O649j267K266N361L553P3q204L012R108j4398o188
15228a9550J3104K258j2L389J2175O08J957N648p008K2054L521k6972p003J120
15214E289K261P030j171k483k0336r435L291J7376J0701J1779L748k73j553n644
15200B0580j5556O05o34j0177K400O56j9983J61J4071K351J315M243M343k018
15186B357O307p005P625k038j9492j3497N69J4877J5604r1m087k9L656o648m598
15171f490K276r635P01K016M258j408N752N998Q849l228p887J05N815p98j2106
$$ y = [-14863, -9402, 9062, -10922, -19486, -27849, -23900, -9775, -4923, -3087, 4126, 8757, 9897, -909, 8151, 16854, 8995, 4433, 17055, 17572, 10216, 11275, 21374, 29321, 28975, 22671, 17108, 4400, -4258, -17247, -20638, -24366, -19515, -12866, -14133, -11867, -6506, -2953, -2880, -11084, -8072, 1036, -13362, -19550, -6446, -4188, -4200, -811, 11364, 11972, 13929, 19577, 12569, 34623, 38144, 11172, 4169, 5289, 7550, 14580, 13409, 10926, -9410, -18845, -15554, 1822, 12523, 24302, 28050, 27777, 26224, 20580, 5024, 5629, 4995, -5182, -2782, -2126, -22109, -21948, -7877, -5526, -4211, 32, 4375, 2357, 8664, 1659, 9284, 7246, -12246, -25743, -25174, -10297, 5307, 5216, 1129, 1100, 4756, -1892, -6490, -4214, -13849, -13148, -11132, -6874, -8282, -2530, 3468, 12317, 9089, 1202, 1307, 7122, 6324, -5782]
15156e782q113R299O112p061J5378o811j437M027J2738j5758j9148K219K7341
15143A3004l5k0076Q263J4362N005p060m391O016n678r810j4465R691J1798m272
15129B352q384K385J078J1912O345j9322j2236P591Q271j03j194J835J112m015
15115b373j604M008q90m374K68k1788J761J9518M986o187N892l22j4645L179J1268
15100a303p939j383K865K881O731p026m133J218P282j4377p938n586L703K531
15086b2474J5979O707R098P204M161O395J1604o736k0089j0208k7546m817P871
15073b2851R09R858R040j0079k986J1828R555r621n535j1871J1789J4274K330
15060F640j148J2851J731m001k643j1640k505N518M098M85K914o268N069j8316
$$ y = [-5782, -13895, -4596, 1516, -5545, 9833, 3022, 1585, 5612, 18350, 2592, -16556, -14337, 13004, 12969, -7107, 1156, 15518, 20523, 13463, 9072, 15088, 9410, -400, -14865, -5174, 6624, 2352, -6032, -3647, -2569, 9343, 15688, -3634, -15870, -8279, -8, -111, -1305, 530, 1642, -2373, -3977, 31, -859, -5233, -4965, -26753, -24992, -5474, -488, -6675, -783, -1105, -15750, -12571, -1303, -9242, -10625, -7760, -4879, 1852, -5174, -9307, -8089, -807, -15184, -23122, -28708, -25005, -22474, -6495, 212, 9310, 16514, 20675, 27070, 38674, 31938, 11849, 1641, -25905, -30722, -22851, -21942, -12084, -3044, -13123, -16109, -4281, 5274, -4347, -9882, -21753, -9964, 4310, 6640, 5492, 18343, 20074, 16073, 13430, 1790, -715, 4803, 8901, 9386, 12300, 6032, 11101, -7215]
15046g215M99J2161j0207K552J4148J1575J2670K086m142n349j0461k627j905
15033A3785l602L029p051k698r988O602J6697j1052j903K545j707o029R738J5301
15019B3667j2140p031L680L250P736K834r127L855o528J4920P865o145P098M479
15005C8413J3064J8167j0808m120M319L2973P7154J51368K02334L3897j65829
14994C90932j79297q7607k6738j3687o625j0191k0609j6267m901j4996p011k462
14982E41R109j1672l1857O205K4624L181o912m587k816M523K1586M118l780J407
14968A3670k099O34j5255o94K1587j564j6216n73n46k039O735K292K096j541J32
14953F619K098P14p666J69j196q217J8735J2233m965l418n793M08j5251n359M368
$$ y = [-7215, -6716, 5445, -4762, -2210, 11938, 23513, 36183, 38269, 34127, 28778, 18317, 15690, 13785, 10183, 13212, 6161, 3463, -6525, 77, 16774, 5722, 3819, 6364, 4657, -1372, 8366, 23667, 11527, 4496, 8176, 11426, 19162, 21996, 12869, 16724, 10196, 25116, 32981, 26836, 33934, 38413, 51477, 69644, 58836, 54716, 59035, 92008, 169162, 320530, 522864, 556761, 390932, 211635, 124028, 97290, 83603, 76978, 66787, 46178, 29911, 25010, 10014, 3003, 541, 9650, -2022, -33879, -27674, -3050, 131, -6781, -11368, -14184, -9661, 11925, 16043, 12263, 13670, 11571, 12205, -3050, -3744, 17843, 16279, 63, -510, -1056, -3095, 3640, 5932, 8028, 6487, 6619, 8717, 9431, 1765, 1934, 738, -7479, 11256, 23489, 18524, 15106, 9313, 9721, -5530, -10889, -6521]
14938f521k051m887R557l063k3495K953K0310J0011n259J457m692n896M939n556
14924a2193q06m350Q281N535J080j986p157l976R568l286j1953k523Q078O001
14910i687j403J1246n60M940o887j7155l012J5170K798Q849n253n278m11n707
14896a2350M9J8807J3887Q243k991p483j704O960o837j6141j7182j0192n989J0039
14882b2884K0585J9310p045j6946j8366J693Q7J3676J2706L830m51j7360n469
14869a6634Q189J080L794P774q659j2150k0833N336J5201O901j6N837M130J8928
14855A8878Q165r210j2361j0326n65n392l707q53O736r249j165J5081J5342R206
14841B0580m918M869m779p47M276R93L76J000k653j0930j4116n294P203J111j0050
$$ y = [-6521, -8572, -13459, -3902, -6965, -30460, -27507, -7197, 2814, -2445, -988, -5680, -11576, -6637, -12193, -12999, -17349, -9068, -3533, -2453, -4439, -11596, -15572, -6004, -9290, -21243, -23766, -15688, -9687, -11090, 156, -404, 4536, -2351, -19506, -22518, -7348, -4550, 4299, -954, -6232, -6643, -12350, -12301, 6506, 20393, 28636, 25645, 18162, 16458, 23418, 16581, 440, -16742, -26934, -32923, -22884, -2299, 17011, 9966, -6980, -25346, -23653, -23566, -9890, 2816, 6646, 6195, -11165, -16634, -8445, -7365, -3571, 4203, -4456, -16606, -37439, -32103, -16902, -10001, -10017, -4180, -50, 18878, 27043, 17833, 5472, -4854, -5419, -10811, -14518, -15371, -8635, -17884, -19049, -3968, 11374, 20580, 15662, 20531, 15752, 15005, 19281, 20274, 20650, 21650, 18997, 8067, -6049, -11343, -4140, -3029, -13079]
14826a3079m963j825q883L900J1529O564n090O746o997o240L984j1470K157J4591
14812i076J4067l538r303M812l188J0042j0089P870Q600r816j4560m347J1975
14799f551K005J1039J4419J078j5723j0169j021K533N593o222J1385J1142q086
14786A1422n040j010l454j610J775J202K62m462l63O57O851j1083P064m320o20
14771b729K935J4180J5232k583j0842j2122k676M00O762j5543k078J1176J992
14758D104p6r365o238O204k963P163j550p215m381K066p009L425R076Q199q491
14743g051r044j066K0750m833j2130J4532P404k740j2718L200l305j5962J3289
14730i674J0595j0572j3742J2202J0261o484N627P788j105r765j459j186m601
$$ y = [-13079, -18042, -19867, -28750, -24850, -13321, -6757, -11847, -5101, -12098, -18338, -14354, -25824, -23667, -9076, 4991, 1453, -7850, -3038, -6226, 3816, -6273, 1597, 10197, 381, -14179, -18526, -6551, -4546, 6493, 20912, 21990, 6267, -3902, -4923, -2390, 3203, -3019, 8366, 19508, 11422, 6382, 5372, 1918, 308, 2083, 3285, 3547, -915, -1278, -621, 6230, -4853, 2211, -2109, -2729, 206, 14386, 29618, 27035, 16193, 4071, 1395, 1795, 8557, -6986, -9064, 2112, 4104, 4028, -5337, -11575, -5371, -8334, -1171, -2721, -9936, -14317, -12251, -19260, -15835, -6759, 1440, -7051, -16095, -17161, 3589, -1244, -13374, 1158, 8562, 5822, -6896, -3696, -7001, -22963, -9674, 921, -9651, -23393, -11191, -930, -7414, -1787, 6001, 4896, -4869, -6328, -7514, -12115]
14717a2115J3605k70k7802p372J2572N275J6763J4310P462p369k0651o789r847
14704b2228L500M144J3836M966m305K948Q322j5343m131R094N276J2569j9120
14691d72r587R729J1452o360j42O403r159k385J4831j280K461o264l445O264K556
14676A4602q334P874o561m208j0470j62J960l030j0743r293J9837P859j3672o609
14662b0950J0097J1592R289r332j6946P26L751K079J253R992M607r769j270M095
14648g86M85m923R484J5272p576j5032M536n449r207N097K945O310p966q56J436
14633f230Q201O377j4250O077p032Q495N259L184J1556L543n603j6521N813j4931
14619f062r351Q882R760P708n231L46K197j0352j933q083P40J7099K561M539m684
$$ y = [-12115, 1490, 1220, -26582, -33954, -21382, -16107, 656, 14966, 22428, 15059, -5592, -12381, -22228, -18728, -14584, -748, 4218, -87, 2861, 11183, -4160, -8291, 803, 6079, 18648, -472, -10059, -330, 11122, 4762, 4620, 11023, 1864, -521, 14310, 13030, 15491, 9227, 5782, 12046, 14602, 6268, 14142, 7581, 3373, -7097, -7259, -5299, -8329, -19072, -28365, -8528, -669, -14341, -20950, -10853, 739, 10028, 696, -16250, -15524, -11773, -9694, -8441, 1551, 6158, -3611, -4881, -786, -301, -5224, 4260, 19532, 11956, -3076, 1460, -3989, -13196, -8099, -5154, 1156, -6810, -7666, -6230, 1971, 8348, -5902, 175, -6857, 1638, 6897, 10081, 21637, 25180, 19577, 3056, 8869, -6062, -15413, -6531, 3229, 10937, 5706, 6052, 8249, -2103, -4036, -12119, -11379, 5720, 8281, 12820, 8136]
14604H136j1144K716J977q713M815J926K364J1206r161j37J1469J565j7874q590
14590i445L515K436R805R209k690k4196o957Q391j468r197o229R330m174k301
14576b3971M464K0903Q660m15j317O588Q953o55j1214n514L034J940Q69j5552
14562c227j1611Q779M255l767j0216P904J6402q161j5570M40L791M078q270o18
14548a5791l328O571l196M576J1528P115K4434N198m783p120L011m707r397j2626
14534A485j121J1765J044K286J5295o516j5134r606o566L84L622k548N82m136
14520i164m600J4351J851j5654L599J2850J278j4593K584n15l783N785R875O431
14506A0295K0528j555j7854r897L380j396q830j2130l536J2139J6091l595q887
$$ y = [8136, -3008, -292, 1685, -7028, -2213, -287, 2077, 13283, 4122, 3985, 15454, 17019, -855, -9445, -5930, -3494, 6311, 15520, 12830, -11366, -18323, -9932, -11400, -20597, -26826, -17496, -21670, -23971, -19507, 1396, 10056, 9641, 8324, 14912, 23865, 23210, 11996, 6482, 9516, 11456, 12325, -3227, -14838, -6059, -1804, -5571, -15787, -7883, 8519, 358, -15212, -14772, -10981, -6903, -15173, -15791, -19119, -12548, -15744, -11168, 360, 7475, 31909, 37107, 32324, 25204, 28215, 23508, 14111, 1485, 364, 12129, 13173, 15459, 30754, 24238, 9104, -502, -7068, -6684, -3062, -5610, -5028, -9164, -13764, 587, 2438, -13216, -9617, 3233, 4511, -10082, -7498, -8013, -11796, -6011, 3864, 10295, 30823, 29268, 11414, 1517, 4897, 3501, -5329, -17459, -20995, -8856, 7235, 3640, -5247]
14493e247l450k025R354R079k207J6524N329q468j6334n115n817p875r241J5495
14479i998R633J2681K310n383n976r913O156J3987o38k0216o197m204J2220l558
14465i096l99J0296L892Q04q104n957K408M125j040K494J3610L135o732q916j7772
14450a7252K710P42P872K2j9171K625R012K1542N487j9143j4595N076Q854P130
14436I11O993M221Q724k348K318O610j1656j0575m51q846p948j1889K468J1844
14422i624J5227P898j0784p864N065J4382Q025j3674m366l282J605Q183m55m181
14408F155M488N035j1754j0341J015R738j510j161o883j2052j035P583l228L406
14394a0544J699j029R939r19k6592Q401J0453l856q439m576j920J8902l779K799
$$ y = [-5247, -8697, -10722, -1368, 7711, 5504, 22028, 27357, 18889, 2555, -2560, -8377, -16252, -25493, -9998, -365, 12316, 14626, 9243, 3267, -6646, -490, 13497, 12859, -7357, -13554, -17758, -5538, -9096, -9495, 801, 4693, 5497, -2607, -8564, -6156, -2031, -3071, -577, 13033, 16168, 9436, 520, -17252, -14542, -13800, -5928, -5906, -25077, -22452, -13440, 8102, 13589, -5554, -20149, -15073, -6219, 911, 7904, 12125, 20849, 18501, 20819, 27429, 15773, 5198, 4747, -4099, -12047, -23936, -21468, -9624, 5603, 13501, 2717, -5147, -82, 14300, 22325, 8651, 4285, 1003, 2608, 10791, 10336, 6155, 10643, 15678, 3924, -6417, -5402, 4336, 2826, 1665, -5218, -17270, -18305, -10722, -13950, -10544, -8845, -9874, 65, -854, -27446, -19045, -8592, -12448, -20887, -25463, -27383, -8481, -12260, -9461]
14380i461p540r51P808K072J2073m959j6637o401P508J0169J1787K0135J2126
14367C7729j8399j5475k139p995j675J0805K822k003m83q940j600P448m353m277
14353h535J507P312J6866q225n011M347R277j3517K298J1248R239j7132r424r779
14339i529n448J0132R734o49L7j618O65n927P121R299Q241p808j7927J4J2694
14324I031L421k560m511N706j049j2478o587O270n543k416J0701K6848J2720j9770
14310A9783j00K531O31n93j10q570r015m137K601m73N273J1446k927j1574l440
14295A326j108j1843m973o846K0504j799N395M437j3891k5468J541J1803J5966
14282d956J6308j844j7663p234j715P2M956M709M360o984p845Q092J4252N176
$$ y = [-9461, -17001, -17952, -10144, -8072, 4001, -958, -17595, -23996, -16488, -6319, 5468, 25603, 37729, 19330, 3855, 1716, -6279, -7954, 2851, 5673, 3670, 3187, -5753, -7353, 95, -4258, -8535, -7028, 284, 17150, 8925, 3914, 8261, 17538, 4021, 6319, 17567, 26806, 9674, 250, -9529, -14977, -4845, 4889, 4240, 4277, 2659, 3324, -2603, 4518, 13817, 22058, 14250, -3677, -3663, 9031, 12452, 9892, 5381, 11087, 10038, -2440, -9027, -2757, -8300, -10716, -15, 26833, 39553, 19783, 19683, 22214, 22845, 22252, 22142, 13572, 4557, 420, 3021, 2548, 7821, 19267, 16340, 4766, 1326, 218, -11625, -16598, -23444, -2940, -4739, 656, 5093, -8798, -34266, -32725, -20922, -4956, 11352, 9508, -8155, -15389, -17104, -17032, -12076, -7367, -3007, -9991, -17836, -9744, 4508, 9684]
14268I684j007p026O388J8966j33K574p760r933j1588j689m139q772M522R352
14254e61o03R465J1464M670j1681j4862J991O027j7990j0680P885J915L44J0982
14240a634J1604j5607j1720p28j729j426K0293M091m786J0651j2106N236J76j841
14226D74J3191n963j696j5054M031K3614K441j3051k2249L349J284O122k750l497
14212i754p39J2336k541J4096N955j2530K928n44k158o249k495J3195R494O902
14198B7896p242m545r190j5669j373q695J0743Q485J0495P14k1142q575m769p787
14184c0654J540J101K5138J9851K821q166r822j253j1312k083J4063J7172k629
14171A5767j4829p784m935j044O61l468l798J0674Q329L117L736r613k893L107
$$ y = [9684, 8677, 1651, 8039, 27005, 26872, 29446, 21686, 11753, 165, -1524, -5663, -14435, -9913, -561, -1164, 8301, 19765, 24435, 12754, -2108, -117, 5910, -12080, -22760, -14875, -12960, -12616, -1634, 9970, -5637, -17357, -18085, -19814, -21240, -947, 3144, -1642, 9009, -3097, 2139, 2315, 474, 13665, 7702, 6006, -9048, -5017, 18597, 21038, 7987, -14262, -10913, -9629, -3507, -6257, -9754, -10493, 1843, -698, 13398, 19353, 6823, 9751, 9207, 7049, 800, -1695, 11500, 20994, 27896, 20654, 16109, 6919, -8750, -10123, -18818, -8075, 410, 10905, 11619, -9523, -18098, -22867, -30654, -29114, -28013, -2875, 16976, 19797, 11631, 1809, 556, -10756, -12839, 1224, 18396, 15767, 938, -6846, -11781, -12825, -12164, -15632, -19430, -8756, -427, 2690, 6426, -3187, -6080, -2973]
14157b973pO416P497O675J0241j0070j6804p443j5082K420J9305J7680n75p906
14143I374k213j0447k838Q166N102j772M990o636o792j477O455J8796n22q445
14129A1741j0374J1108R484n246m855N930l063j3384M910r356K624l448j0075
14116a4004J9791M527j5191R675J4348k898j3559k460J1570l838N359Q356j0373
14103A1303k991r96o254L306q733j3645P279P806O54j1932J1897Q387q930O674
14089C825K606k643m292o15O684m220P46M580K930R326K514m661K750n407k802
14074A1321K146n843p120J3784m318p369J0020J918q999p547R143p095r411o749
14060a6119o560K437j240J0174L542m886j4039K72N122Q837l619l576P780J8432
$$ y = [-2973, -2980, 3436, 10933, 17608, 27849, 17779, 975, -6468, -21550, -19130, 175, 17855, 17280, 9374, 7161, -3286, -6124, 2042, 7144, 5372, 10362, 3726, -3066, -4543, 1912, 20708, 20186, 11741, 1367, 12475, 21959, 16713, 11858, 17788, 14725, 1341, 6251, -3105, -481, -3929, -14004, 5787, 10314, -4877, 4798, 19146, 16248, 2689, 229, 11799, 7961, 13320, 21676, 11303, 8312, 7316, 1062, 4368, -4365, -18010, -10731, -2925, -2271, -14203, -2306, 6081, -2849, 3825, 6431, 3788, -504, -1119, 5565, 1345, 2091, 6671, 9601, 18927, 21441, 16780, 19530, 14123, 11321, 13467, 7624, 504, 14288, 9970, 2601, 12621, 14539, 5540, -2007, 7136, 41, -9370, -16119, -22679, -20242, -21482, -11308, -7766, -12652, -26691, -26419, -21297, -12460, -16079, -19655, -11875, 6557]
14046F557R727m19j7700j5163r112l930Q347o483J0474J0315l156m7Q647j053
14032b996o752L57R776p471k194l42J3252J1798L05K809j2231j7346j7056J2714
14018a5377J7170M969K719J408K779k206j0345J422J047k606M17Qj1469j0018
14004b0082J0593K054L805q895o922M090K86m192R813J4754J290o235J1352J875
13990A3586L477o057J4920j2027j0228q709R655R753r386j1543j8399m924O698
13977b3184J5103M267J4339p060j4511j0025J651J2383KL32K385J2351n11K158
13963I680J6083M910j8512L226M149l545K327k970n60j4685j4819J823M691O567
13949a635k523J255M224j3938m322Q425J16k189p871R067Q512O214n85o716k9636
$$ y = [6557, 16284, 15865, -1835, -16998, -26110, -30040, -21693, -28176, -17702, -7387, -10543, -10590, -1943, -2996, -9748, -9391, 385, -7086, -9280, -9622, 3630, 15428, 15733, 18542, 6311, -11035, -28091, -15377, 1793, 6762, 9481, 10889, 13668, 11462, 1117, 2539, 3586, 980, 1397, 1405, -10064, -20082, -9489, -7435, -3630, -12525, -19447, -15357, -15071, -19263, -9450, 5304, 6594, 359, 11711, 13586, 17063, 11006, 25926, 13899, 3671, -5038, 4617, 14370, 4984, -6559, -24958, -29882, -23184, -8081, -3814, 10525, 3465, -11046, -21071, -19420, -7037, -7035, -6703, -4318, 8033, 7522, 9680, 25763, 30673, 12161, 15387, 19536, 15991, 18318, 15348, 14788, 103, -14716, -12893, -8202, -1635, -4158, -2903, 1321, -12617, -16939, -8514, -8398, -10587, -18458, -9391, -879, 5335, 4750, -1966, -31602]
13934c1602N114K0171J7749r134m588j075J1111k701j116m0J6701N924k2727j0842
13920g055J4218J3615k463o359j3454j0305j1294l861J2931J6709m890K307J770
13907A869J910q021o053R581L677J2560L390q326k650Q462l530j0632j0224J1547
13893C560M836L545j285j9208l093J523J3032J907n362j3574p099O994K1011m777
13879B010j5302j31M310M84J505m624l345J3820L492l850J6369j557J0224P374
13865C0779l1076j4196O371L687j458l44k501o128J83K475J3367J6115K302p609
13851A1967M297N593q969j225o259m809n448R962J053n563O125m580k4700k213
13837b4769J1821j0874J6249O955j480R406K82k1122j668R090P925J4016Q610
$$ y = [-31602, -26488, -6317, 11432, 2298, -2290, -3365, 7746, 5045, 3929, 3889, 20590, 26514, 3787, -7055, 7163, 20778, 18315, 11956, -1498, -11803, -23097, -26958, -14027, 2682, -2208, 99, 1869, 3779, -4242, -10295, -714, 2963, 15523, 18913, 10587, 7937, 16399, 12869, 2237, -7987, 3560, 8396, 11941, 10656, -8552, -11645, -10122, 2910, 4817, -545, -14119, -21218, -14224, 6787, 2010, -13292, -13423, -9113, -8629, -7124, -11748, -15093, -1273, 2219, -1631, 14738, 13181, 23405, 30779, -297, -14493, -8122, -4435, -5893, -6237, -8738, -14866, -14683, -12208, 1159, 17274, 19576, 11967, 16264, 21857, 12888, 11663, 5404, 595, -4853, 5109, 6162, 599, 6724, 2144, -22556, -24769, -12948, -23822, -7573, -618, -2098, 7308, 7590, -13532, -15200, -6110, 1815, 15831, 24441]
13824B4441L60j0357q375o703k442J4691n167P200J1147O263K907j0514m333L973
13810B3091o441o780j3091j4223j1722J0871N440K4029Q563j5792q227k338K740
13797c880l042k0945L085J6332J4844j216k164j2254k722l778k294J2780R924
13784D670M764q665j8454K977K853K873J2714J0850Q756j5473K675N403K681j3461
13770E163m712J9023M640j0014n319j7553L057N233L004K839M525J3261O36q038
13756A5745K531M743Q724r809j3943k4335M14J1047N014Q173J2855r143j2624
13743f08p514l085J0676j1n010l458n482M542Q809R7J6245L468r902r550k0347
13728b1130O551O75N842r149K758J3365P455r462j0908o49L498J0705P242Q928
$$ y = [24441, 24801, 14444, 6069, -634, -3076, 11615, 6448, 13648, 24795, 31058, 33965, 23451, 19118, 23091, 16650, 9870, -3221, -17444, -29166, -18295, -12855, 11174, 19737, 3945, -4282, -6620, -3880, -6922, -27867, -24782, -8450, 6394, 5178, 3014, -9240, -11962, -15740, -18034, -5254, 4670, 9434, 769, -17685, -14708, -11855, -8982, 3732, 14582, 23338, 7865, 10540, 15943, 18624, 5163, 451, 19474, 24114, 14100, 8781, -8772, -5715, -482, 2522, 5361, 9886, 23147, 23783, 15745, 18276, 23019, 31743, 21934, 7991, -16344, -15930, -4883, 131, 8304, 21159, 12016, -608, -8122, -11207, -531, -542, -5552, -9010, -14492, -9950, -1141, -1044, 15201, 18669, 8767, -783, -21130, -14579, -13904, -8062, -17211, -14453, -1088, 6367, -3095, -14003, -14652, -11154, -449, 6793, 15721]
13714A5721J665j0068j5983l785R18J2875k523m065J554O067j5232p637J6532
13701c961P1l585l742k93j778P52L318R724J524Q757P42%o325L421j1290j2897
13685a5562J0196R670M802L162j0849J54J3672j00k0828k642N31q787J8687J622
13671C728j4817l067K209J0201o160m344L494J111P39l434J204j798M845J898
13657d191k349j374J0116L411n042j9381j2075q777N714K1131J4913p697o049
13644a1650O328N590l941o749n322R026N029j0739k337J1459M154j4160j0930
13631b4242j695J5566K3475j3709k3114N085J5761O502L659j1652j3902o658J1539
13618a3385J2696j1870j0236Q195R053l792l126P439o98l625m203K0278J7969
$$ y = [15721, 17386, 7318, -8665, -12450, -11532, 1343, -1180, -5245, -3691, 2376, -12856, -20493, -3961, -3890, -7475, -11217, -11510, -13288, -12536, -9218, 506, 2030, 10787, 11529, 11529, 5204, 8625, -2665, -15562, -5366, 4304, 9106, 12268, 1419, 1573, 15245, 15145, -5683, -8325, -7794, -16581, 2106, 3728, -11089, -14156, -11947, -1746, -7906, -12250, -8756, -7645, -6906, -10340, -9136, -10934, -6089, -4191, -6540, -7914, 2202, 5613, 571, -18810, -30885, -39662, -33948, -12817, 2096, -5601, -11650, -5322, 268, -3673, -10422, -15744, -6718, -1689, -12428, -14765, -3306, 848, -13312, -24242, -25937, -10371, 13104, -605, -23719, -18634, -2873, 3629, 7288, -4364, -18266, -24924, -13385, -689, -12559, -22795, -14600, -5547, -9339, -12465, -5026, -5724, -9349, -13552, 6726, 24695]
13605B4695j300J756r423j5262j9676o063L232l606J052N602K255J2685J0471
13592F418K582n9q208J509L164p913K88J4136o671j4073r496k985k697J5321J1419
13577B735j0054p372K896K606J571J2048K420N420o45j3427j0727k949k503R197
13563h784j526o569O055K417q017j4632O488J6545O016q45O165J7417o862j1306
13549B562O894J4733J0236k804Q771j0156j1908k1434L85J2105j1502o234o006
13536a4358r191K219J1312j561O463J0291p23k144J005j2471j1226N683k368R015
13522h054m669n660K267O86J5068n007j2325q057j379K7740L0279l091p449p917
13508A2432m11L214N142k3162j671J1889P314J4526k186m468r843k2252p181R489
$$ y = [24695, 23395, 25151, 15728, 466, -19210, -25273, -22041, -25647, -24595, -18993, -16738, -4053, 6418, 9000, 8941, 733, 2242, 5406, -2507, -2219, 11917, 5246, -8827, -18323, -21308, -24005, -8684, 2735, -7319, -14691, -11795, -9189, -7618, 4430, 6850, 12270, 11625, -1802, -12529, -15478, -17981, -8784, -10310, -16879, -10824, -8407, -16424, -31056, -24568, -8023, -2007, -2852, 3313, 20730, 13868, 2562, 9456, 24189, 34425, 31621, 40392, 30236, 18328, -3106, -2721, 9384, -2118, -8352, -14358, -23549, -21330, -10018, -11579, -5116, 5175, 4452, 2308, 3313, -9158, -20384, -14701, -17069, -8054, -12723, -18383, -16116, -15430, -362, -5369, -17694, -25751, -27130, 610, 30889, 27798, 20349, 12432, 12021, 15235, 20377, -2785, -4456, 7433, 14747, 29273, 27087, 22619, 12776, -9476, -16657, -7168]
13494g168m023J2981P703j4424L863k402N366l917o88m4Q698R516J4914j5007
13480A5368j3723j911j574J3668J3760o140j7818k897R15j393q466J7000K0885
13467B7674n983j7275k108m100L64r04m325N420J2036J3726j1421j1289k850j3778
13453a4813j0496J370J2871J5821m448Q96m363K285N321l306l223K944K861J7225
13439B0945n411j8260p177P264k8K272R812J046j2661L203k923o335K256R392
13425C395N101j0856j0961K375K326N431J13j2419r846o5J8879J163l485l786
13411a2635M146O772O052j952P924J3737r045o539j537j0910r369k75j431M220
13397a0842K720J1337M563q076j2908n308j018J2679M931K925J4387P372q196
$$ y = [-7168, -11191, 1790, 9493, -4931, -1068, -3470, 1896, -2021, -2709, -2753, 5945, 15461, 30375, 15368, 1645, -266, -1840, 11828, 25588, 19448, 1630, -1267, -352, -1745, -10211, 6789, 27674, 21691, 4416, 2308, -1792, -1428, -2332, -6657, -1237, 10799, 24525, 13104, 1815, -1035, -14813, -25309, -23939, -11068, 4753, 305, 1201, -3162, -877, 4444, 1138, -2085, 859, 3720, 20945, 15534, -2726, -9903, -2639, -2667, -395, 9417, 10463, -2198, 1005, -1918, -8253, -5997, 3395, 8496, -2360, -13321, -10946, -8620, -3189, -3076, -15495, -25341, -25406, -6527, -5364, -8849, -12635, -8489, -1717, 4335, 2383, 10307, 24044, 14999, 8460, 6923, -3987, -13356, -13631, -15062, -10842, -8122, 3215, 7778, -298, -13206, -18514, -19532, -6853, -1922, 1003, 15390, 22762, 14566]
13384A4566O994J3050r685r914r523o122p401J1933N943r02o265m848j0323j1547
13370b4044J262R490K894M469O053O09J784lq36k207K466R235l409j7636o612
13355a6485p00O446j290j8298J0483R590K674L091Q120J3517j2581m306j0275
13342a0014o831K81M219P888J637l558M493l177r427O361n051o601q619j2132
13328d0531r426P151J3723K0096Q151o011l213j049o78l423Q133J3882q681j5535
13314a7411j1217J5571K9594k927m405M860j8776j3555M59Q169n058R620M590
13301d86R803M95j380N222j625O25O009J003k1488M835J5241j438Q972M671k3660
13286F799n831N837J3030J4945m022j4738o529J4986K345n165j277l418j5399
$$ y = [14566, 21560, 34610, 24925, 15011, 5488, -634, -8035, 3898, 9841, 8939, 2674, -2174, -12497, -24044, -22782, -13292, -10398, -5929, 124, 733, 2517, 2514, 1678, -529, 1937, 11172, 7763, -9873, -16485, -17185, -10739, -12029, -30327, -19844, -10254, -7580, -4489, 3631, 17148, 4567, 261, -10014, -16845, -16564, -12345, -4457, -2820, -6378, -1885, -5062, -14489, -8128, -13179, -19780, -28399, -40531, -49957, -42806, -29083, -8987, -836, -6847, -10060, -11109, -11787, -15210, -7077, 6805, -1876, -17411, -28628, -13057, 16537, 13610, 9205, 14065, -4711, -18266, -17807, -9638, -14696, -5076, -486, 9317, 9812, 8432, 13654, 12029, 12654, 18663, 19666, -1822, 3013, 18254, 16816, 25788, 30459, 6799, 968, 6805, 19835, 34780, 30758, 16020, 9491, 24477, 26822, 21657, 20380, 16962, 1563]
13273A563p77Q809q917o001m795O481M698K182J292N901k621O519k5456q53J142
13258a0833k927k830k734P529N90J809P808J5598J941p777M095j3112M588q281
13244d536j0980Q156O761P922J1909K236j7562p581J5445P549k375l112J844l60
13230A5316o211J667M395k100j7130m054k248n270l355J871L660J2188L78l185
13216d078M175n564l407Q913k31j253l1897j9504R264N879J2375K726K299P825
13202a2478J2570J1432q69j1855o096J1549n712j9202J746J1572M377o085p32
13189i783j897N9J3523M840p230j962M454M975P742o460m577K080N18k4997p533
13174b6248J6707N720q714K629J4411K1668K689j4883q862Q602J8118N766k7500
$$ y = [1563, 786, 9595, 678, -5323, -10118, -3637, 1061, 3243, 4535, 10436, 7815, 14334, -11122, -11975, -10833, -13760, -16590, -19324, -11795, -11205, -9396, -1588, 14010, 15951, 8174, 12269, -843, 3745, -4536, -15516, -7360, -599, 7323, 19232, 21468, 3906, -3675, 11770, 19319, 16944, 13832, 15676, 15316, 9105, 10772, 15167, 13067, -4063, -8117, -10365, -15635, -18990, -17119, -13459, -1271, -893, -4078, 97, -5467, -8874, 39, -192, -1445, -33342, -52846, -43582, -37703, -25328, -22602, -20303, -12478, 92, 11524, 10655, -1200, -7296, 4253, -1459, -20661, -18915, -7343, -2966, -9051, -9783, -11680, -11621, 1902, 6742, -488, -2450, 2004, 6979, 14721, 8261, 3684, 5764, 6282, -18715, -26248, -9541, -3821, -12535, -9906, 4505, 26173, 28862, 13979, 5117, 13719, 31837, 37603, 10103]
13161A0103k4037K79m236r666J3136Q431L430j518j3933N995J3289J0097l753
13148G617j106n178j8517j5370O175J9331L805M356L43j80J2610n321k815K711
13134H461K089N43j4670M60O667j0805p69J4215R96N175k494Q417J337q204o855
13119D563Q35q427j1956J3076O393O932O11m745m682k0371L20J6367J2303m585
13105F634M413J1546l046l962J0662q432j1981p939J507J507K964j285j9535m99
13091a7446K1814N325n308L543p581j151j753m4K482O488j292q832M125K17j117
13076e30o129O657O472n979J2161P365j1310k781j0321m083J3386L036j0800n421
13062h277O648R563r519r948q436o340K1357J1928R298q870N272K87p322k078
$$ y = [10103, -13934, -13655, -17891, -27557, -14421, -5990, -2560, -4078, -18011, -12016, 1273, 11370, 7617, 6511, 1333, -17184, -32554, -26379, -7048, -3243, 1113, 1456, 1276, 13886, 8565, 5750, 8461, 10550, 11093, -3577, -3117, 3550, -7255, -8024, 6191, 7187, 12362, 9868, 18285, 19622, 11418, 4563, 5398, -3029, -14985, -1909, 4484, 11416, 12027, 7282, 2600, -17771, -17451, -1084, 11219, 6634, 11047, 22593, 19547, 15585, 26247, 17815, 5834, -2105, -598, 909, 3873, 2588, -16947, -17446, 4368, 9693, 4385, 7928, 347, -804, -2557, -2601, -119, 6369, 5077, -3755, 370, 587, -530, -6659, -2, 6470, 491, 12652, 20017, 8707, 5926, -4395, -8478, 4908, 7944, -2856, -8277, -1629, 7934, -1585, -11533, -19969, -26309, -4952, 6976, 16274, 7404, 12676, 12963, 5641, 3563]
13048C563N103J2561J871o099o252M160M938K510k630p063k024j1471L750O15
13034C532j0219k196O120P481L416J23m938q027J1219J479j6004J3841P317M597
13020A7741R270k3644l4505j4808K443K4143J9589J1559m210r343J334r064j5654
13007b5149J1512n98l356J4412J1670j839j2723k352R74o26O36Q80q597K701J6723
12992D268p879l482J7867J3264l27r661j3483j1134N726O158n039M586J7296l514
12978A4646l28j1402k3577j9104k818J9260J8406o393j3682q766O678J0859P323
12965h898L926K803R024m902j478k636p27m293q955l423K626J7230J0984o426
12951D855j2769J3880M756j7021j2996J764J6742K6715J3010p503o514l397k766
$$ y = [3563, 8666, 21227, 23098, 16999, 10747, 14907, 19845, 22355, 19725, 12662, 10638, -833, 2917, 3532, -6687, -8883, -2763, 4718, 8134, 8257, 3319, -4708, 6511, 7990, -8014, 5827, 13144, 17741, 27011, 3367, -31138, -45946, -43503, -19360, 229, 11788, 7578, -1765, -431, -9495, -25149, -13637, -14235, -17591, -3179, 8491, 6652, -6071, -8423, -7449, -8075, -7439, -6559, -15156, -12455, 4268, -3611, -7093, 10774, 24038, 23711, 14050, 567, -10567, -4841, 1317, -3722, 864, 18160, 14646, 14318, 2916, -20661, -39765, -42583, -23323, -4917, -11310, -24992, -33758, -27080, -16221, -8898, -4972, -2169, 6855, 1953, 475, -2161, -2888, -7181, -16136, -19559, -16933, 297, 11281, 4855, -7914, 5966, 10722, -6299, -19295, -17531, -789, 25926, 38936, 31433, 24919, 21522, 18756]
12938A8756M052P112j4402j6339o442K010K391r357p024J814J9168Q54j1431l242
12924a2080m301k489J5082M817M276j814j3462N214O130K235j0210j052L089m277
12910h842r666P219Q307N864K213o439K842O99l389m621R595N476j2317r800o94
12895a3553J6230J210j9786k04N310J3969O246n573r238j971L176R793o591l122
12881d104r776K461J5084L550o093j985j2086O414J0093p20O580K028O864K638
12867B0948o205m738n931o155n216N526j2165N877J2035L79j864r04K729O826
12853A1142k516k08r990M533P306J3741J5375L355k3612O946N302j5290k1882
12840e798l451q188j0888R133Q889j59l933Q737L079K698r059N192r333k924L713
$$ y = [18756, 22808, 29920, 15518, -821, -7263, -5253, -2862, -12219, -19243, -17429, 1739, 2593, -8838, -12080, -16381, -18870, -3788, 1029, 5305, 3491, -9971, -4757, 1373, 3608, -6602, -7654, -4565, -8842, -18508, -11289, -2982, 2882, 5095, -1344, 1498, 2197, -1192, -5813, 3782, 9258, -3059, -12859, -13553, 2677, 3887, -15899, -16103, -10793, 3176, 9422, 3849, -5389, -7360, -4184, 5609, -982, -4104, -13880, -11419, 3665, 7215, 1122, -863, -12949, -6535, 3558, 2838, 9418, 11446, 18310, 20948, 14743, 10005, 4074, -2081, -7297, -1771, -13936, -8059, 3976, 4355, 2491, 1587, 4316, 11142, 8626, 8418, -1572, 2961, 10267, 24008, 39383, 42738, 19126, 26072, 31374, 16084, -5798, -9249, -17437, -28325, -19192, -10303, -10462, -14395, -5658, -2579, 119, -8940, -3748, -13081, -16005, -12292]
12825a2292J8941K714L33j0659j4371p761L166J288M011n640L83l378m454J4406
12811a3313J0899M461j3048l612O337O818R525P629k1178q634l411J9648J9859
12798B1980J832j3689j0018Q965R121N909Q145k655k7787o671o112l727J479K160
12784a1068q524k407L603M231P686K656j1060J991o38p150Q279k089K216M243
12770h031k0145o575M674Q646N280M027p138R347N352Q27O263l154p016r3Q04
12755f932Q197J5802j0526n443Q042Q547l245J523J918K280r719q583j2798M226
12741f711N846j1523q636J4168J2774L472j231J208j3720j316m511j519L599K162
12727e938L472L483J2118j1425r842p155l92M044M299j782J3345R630N750j2425
$$ y = [-12292, 6649, 9363, 9696, -963, -15334, -23095, -19929, -18641, -14630, -20270, -19887, -23265, -27719, -13313, -2414, 2047, -11001, -14613, -8276, -1458, 8067, 15696, -5482, -14116, -17527, 2121, 21980, 23812, 10123, 105, 9070, 18191, 24100, 32245, 29590, 1803, -4868, -10980, -14707, -13228, -11068, -19592, -21999, -18396, -14165, -6479, -3823, -14883, -12892, -13530, -20680, -12401, -14490, -12274, -8031, -28176, -34751, -30077, -21431, -16151, -12124, -19262, -9915, -4563, -3736, 2527, -627, -7643, -7736, -6932, 1265, 17067, 6541, 1098, 9140, 17687, 14442, 15965, 17883, 20163, 10444, 1861, -10937, -6711, -865, -12388, -21024, -6856, 5918, 9390, 8159, 9367, -4353, -5669, -10180, -11699, -8100, -5938, -2466, 1017, 13135, 1710, -8132, -15287, -15679, -11635, -7336, -9118, 4227, 13857, 19607, 7182]
12713G182q476Q002J5317n031l58j552k0161j0941L810O412L804M99j805Q97L990
12698A589k874j7278j2220m559N104M510J4907J2757o095N409j962k299r304q433
12684b0748J6586K8193Q676j7791o517Q515L915l486l934o411J1416j3852k273
12671B289o05j859j2219l064J075R163q562J0098l564Q28n349O777N678m376q084
12656a1774P075j1041j2204O377M021O611j893J3167l565m540J1690J3070q691
12643H303r336m515k402R204r135J770K558Q873q44j1022N292J3243K0966r097
12629B3858j9882M301n634j0783R887l917j8675J618K8307J4516p029J0372L774
12616C0713p986r002j2309J40J5888l190j2564q941L306o718J173J6856M274j4054
$$ y = [7182, -1294, 6708, 22025, 16994, 16636, 15084, -5077, -16018, -12208, -5796, -1992, -1493, -3298, -2401, 1589, -1285, -18563, -30783, -35342, -30238, -25728, -10821, 1936, -4159, 1250, -712, -3011, -12315, -20748, -4162, 24031, 32707, 14916, 8399, 16914, 20829, 17343, 13409, 6998, 18414, 4562, 2289, 1684, -175, -12394, -15458, -14383, -5220, -13782, -3684, -7248, -6420, -11769, -4992, 686, -3690, -11774, -4699, -15740, -27944, -21567, -17546, -10935, -12828, 339, -3226, -7766, 3924, 16994, 8303, -1033, -5548, -7950, 1254, -7881, -6111, -3553, 5320, 4476, -6546, -1254, 11989, 32955, 23858, 3976, 8277, 2643, -8140, 1747, -2170, -20845, -19227, 9080, 23596, 16567, 26939, 30713, 22727, 13725, 1416, 1556, 17444, 14254, 1690, -7251, -3945, -10663, -9490, 7366, 11640, -2414]
12602b414q000k879M33K551J5526J0844J783k1132p512M246k420l580J6509J4908
12588A8863j6530J406L406M671p042j9027N492J2773K259n143L209p661j9574
12575b2898K487J6600r651K838J0093J5393j3998j9416N623M775P764M080r735
12562f045R671J1140l593j378p331k930O223L062m175j6313O108J1243l877p480
12548e675k087l757J4190J1205o431K667J1507j1367o732j4125p338O830m53l311
12534a4877N77L168n486K720j2976N676N427j904J239L519Q360K526k326o040
12520a0397q235R766N023P471j888Q185Q704J3509m123q714j746J6516R849j6435
12506B7485j0181p712j0139n347J1391K932j844r96R618J6343ql007k0944j1749
$$ y = [-2414, -10414, -13293, -12860, -10309, 5217, 16061, 17844, -3288, -10800, -6554, -8974, -12554, 3955, 18863, 2333, 3739, 7145, 11816, 4774, -14253, -8761, 4012, 6271, 1128, 4337, -3324, -22898, -20411, -3811, -13462, -10624, -531, 14862, 864, -18552, -12929, -8154, -390, 3690, -6045, 3626, 14766, 11173, 9795, 2464, -466, 5757, 8819, 4644, -11669, -5561, 5682, 1805, -5675, -7762, -11519, 2671, 13876, 7445, 10112, 21619, 10252, 3520, -10605, -17943, -11113, -11566, -14877, -14300, -11132, -16618, -13898, -26874, -21198, -15771, -17675, -16436, -12917, -4557, -2031, -4357, -10397, -18632, -8866, -3843, 3628, 1740, 9925, 18629, 32138, 28015, 19301, 17555, 34071, 43920, 27485, 17304, 9592, -547, -5894, 5497, 8429, 6585, 5589, 15207, 31550, 31542, 28535, 7591, -4158]
12492d158p360m004J7628L359J959j4073p445K291q090L441J4393J0759P203m455
12478A1448j3988o907n43q292N938q55P472O153j4579k1454J0715J2307J1528
12465a057J0679K608j331k262l499q493J490J1894L759j1324j451P431J0271J0652
12451B9367r116p433J1224Q937j0436m349j5780L973P599k485j3422n631m244
12438a1796P141l385L124K965r039p621k524J5396J0421M94j2541m844j085P581
12424e713J3530N748m412J1395J4654o684j2160o490J1075J546r221m82P697r534
12410A0949j1212j4762P388P295k398M565l78j2265m108J0590o257j024J1025
12397e92O489O338Q455Q22o835j1851J1924j3012r974l311n157L05O444J1045
$$ y = [-4158, -11518, -15522, 2106, 5465, 7424, -6649, -14094, -11803, -19893, -16452, -2059, 8700, 15903, 11448, -2540, -9447, -9990, -18282, -12344, -13199, -5727, 426, -14153, -35607, -24892, -12585, -1057, 9622, 12230, 10899, 8637, 5138, -3355, -1865, 10029, 13788, 2464, 1013, 8444, 18715, 29367, 20251, 12818, 24042, 32979, 22543, 18194, 2414, 6387, 13986, 11501, -1921, -7552, -11796, -4655, -8040, -4916, -1951, -10990, -18611, -21135, -5739, 4682, 5176, -7365, -12209, -13294, -5713, 7817, 13565, 9153, 20548, 35202, 28518, 16358, 9868, 20943, 22489, 13268, 12786, 20483, 10949, -263, -15025, -7637, -342, -2740, 1825, 1447, -10818, -14926, -4336, -10593, -11617, -592, 5897, 12235, 20690, 21512, 14677, 2826, 14750, 1738, -8236, -11547, -16704, -16399, -9955, 1090]
12383A090j9266r852R110R587J4948M200l049l309Q751k032q03K769j7372l521
12369h749j73J3136J210k479k78L496r780p580J3871J4843j9330L843M611L3p740
12354a066l221j0623r085J8499J6034j2808L706j588r454l016K2387M835n378
12341I222r587L850j698K762L136O066n286J6653N058k4358j6790N908O785N851
12327G572N821Q407J618r279p975j489M56O071q368o008O497M274j650L730n657
12312D020R47K608O682J1872q107j4248p050J7105M169j0516J5440j1706K393
12299A3609J4363j3286j4985J5069J1799J0767j1497k9716k888J4016m667k2473
12287a9889k732J3822K3190P616M656L650p307j5693r599M361R021J1177n614
$$ y = [1090, -18176, -28028, -18918, -9331, 5617, 9817, 6768, 3459, 12210, 10178, 9375, 12144, -5228, -8749, -8922, 4214, 5424, 2945, 2667, 6163, -3617, -11197, 2674, 17517, -1813, 2030, 6641, 6674, -1066, -4287, -14910, -23995, -5496, 10538, -2270, 1436, -152, -9606, -12622, 9765, 14600, 9222, -365, 3485, 1787, 4549, 7685, 13751, 8465, 25118, 30176, 5818, -10972, -5064, 1721, 7572, 13393, 21800, 23418, 14139, 6164, 4675, 5131, 11202, 2834, -3174, 3323, 7597, 5947, 9677, 4020, 4967, 7575, 14257, 26129, 18022, 3774, -3276, 13829, 17998, 7482, 22922, 11216, 13609, 27972, 14686, -299, 14770, 26569, 37336, 25839, -3877, -6765, 7251, 2584, -19889, -22621, -8799, 14391, 22007, 26663, 30313, 23006, 7313, -2286, 2075, 11096, 22273, 16659]
12274A6659k353j520J5663M420p025j7562r031P901L500P14n885r701J988l893
12260f125M934K872m417l987k039o845K574J3643P9K498k566M960j4375j3584
12246b2378J413L348J340j4405J7742o487n510j028O712J5962R919Q278p679j1526
12232d299o3p105j2523P267K0730P777l223M155J668q780J0200L812Q07j605j5846
12217B972j5120o526j355J7882J0488k2340K619P92P76j4701l681O291p866R421
12203b0348J4304n680K02q59j2763Q620J4639P773j3011p866m142J4604N109K453
12189C035J2350p179o906J059Q897J0446p124k2057k416o484k950k944R469R42
12175a1862l303N747O716m606L48p185p153J1965J2342M200k606l038l400J2681
$$ y = [16659, 14306, 12786, 28449, 32869, 25844, 8282, -749, 7152, 10652, 11366, 5481, -4220, -2232, -6125, -1191, 1681, -2736, -6723, -8762, -15607, -13033, 610, 689, 3187, 621, 5581, -8794, -22378, -20965, -17617, -16277, -30682, -12940, -19427, -24937, -25965, -19253, -3291, 6628, 14906, 7227, -4299, -4362, -11467, -23990, -16723, 4007, 11784, 8561, 12716, 14384, 5604, 15804, 19616, 20423, 18818, 2972, -12148, -18674, -20029, -2147, 8341, -13999, -11380, -10588, -9812, -24513, -28194, -21903, -29769, -20348, -6044, -11724, -11522, -12381, -25144, -16524, -1885, 5888, -7123, -14989, -19131, -4527, 582, 3035, 15385, 8206, 1300, 2359, 11256, 21702, 14578, -7479, -9895, -16379, -19329, -22273, -12804, -11862, -15165, -9418, -2702, -7308, -6960, -14145, -21298, -9333, 3009, 7209, 4603, 1565, -1835, 10846]
12161A0846o034M779m68j0291J1186J8967q15k0106l07O429m323j7789j0348K759
12147a5515R50p841L298P445L27N162j823O238l525J006J3022J4831P332q563
12133B2344p765r400l827J3332J8285l162n712r118k140k133j0350o9J3567J3572
12119B7424Q099j035m409o849j988k6067j7773J523J6706K837P311R534j6961
12106a648j5041J486L251M583m646L788q017O011Q378N325Q149O825o88o21m409
12091A2726k516j9308L412J8856j555o689L182K294j779q064j886m899p762j2586
12077b6574K1662K3009J8186m722j1506j7172J591J3248P31j9208n531L143p505
12064a0648r706K701J399J178N319J6798k81o829n879l028j4171j783J7390M437
$$ y = [10846, 4812, 9591, 9123, -1168, 10018, 28985, 28170, 8064, 7757, 14186, 9863, -7926, -18274, -15515, -14565, -22406, -19108, -11663, -11336, -6174, -7997, -1759, -5284, -4278, 8744, 23575, 30907, 22344, 14579, 5179, 1352, 14684, 32969, 29807, 24095, 14977, 12837, 10704, 354, 285, 13852, 27424, 35523, 34488, 30079, 23230, 21242, -4825, -22598, -21075, -4369, -1532, 5779, 15313, -1648, -16689, -15203, -11952, -7369, -12015, -8227, -16244, -10233, -1855, 3470, 11619, 18444, 17756, 17135, 12726, 10210, -9098, -5686, 13170, 11615, 4926, 8108, 10402, 8623, 559, -1327, -6226, -13988, -26574, -4912, 18097, 36283, 31561, 20055, 2883, 4474, 17722, 18453, -755, -6286, -3143, -10648, -20354, -17653, -16254, -15076, -9757, 7041, 6760, -69, -5948, -8976, -23147, -24930, -7540, -3103]
12050c103J1648l824j9127L84J6188M065L524L421O437n637j2657j276J3291q520
12036D814l972j837j5863j1020O069Q951P725J0983L378M543p11j5515q189O923
12022c721M569r11j6122o372P974J2123N117K816M03j6048j549J0507O225J5316
12008B0327N443k1986J003M896k306M387m967N567k218o96q24J822J2768K355
11994B5571P333l407R51j5794q485M879p076p449J2854J9885l654r279j91j2092
11980D046Q640J7674j06L548o530K260P790p008k1125R215Q224r267L898j40M066
11965B5185O608q854k205J508J344j772m224J4253r439k1761j3031M903J2110
11952D625M255r579k306n331J366p784n195J6732Q043l050j2030J813J3117M341
$$ y = [-3103, 8545, 4721, -14406, -14022, 2166, 6231, 9755, 13176, 19613, 13976, 1319, 43, 13334, 4814, 842, -995, -16858, -27878, -21809, -12858, -5133, 5850, 9228, 13771, 13060, -2455, -10644, -3721, 848, -63, -16185, -22557, -14583, -2460, 2657, 5473, 5876, -10172, -11721, -1214, 5011, 20327, 25770, 3784, 4787, 9683, 7377, 11764, 6797, 12364, 10146, 9450, 8626, 10448, 23216, 25571, 32904, 29497, 30448, 14654, 6169, 11048, 3972, -3477, 9377, 29262, 25608, 16329, 16138, 4046, 12686, 30360, 30254, 33802, 27272, 29532, 37322, 30314, 9189, 18404, 26628, 17361, 21259, 21119, 25185, 31793, 22939, 20734, 22242, 23586, 21814, 17590, 31843, 22404, 643, -12388, -7485, 4625, 8880, -699, -3005, -8336, -6970, -14754, -19949, -3217, 4826, 1776, -10254, -8441, 4676, 9017]
11938I017J193j2476N438j1034o954o29J995p369R652J1389l318O518M413o926
11924I09K767J4144o724j9738r096R666J5036M021k867o577L326L551o958j0243
11910h783L999J1558L826J6580p438q177j7581j8727O771J0684m36K144J0909
11897E329l476p095Q872P679n074j5281q5j971k1863K314J9683J1409q141o929
11883a4629m433j134J098K3713m594j6948k910L846Q992m16q75m623q666J5558
11869f021J4707j3924j3682N854O447J3748l082O736L437j5080m327J763J210
11856b214p53M633j1365j2499J063J4041K0046j1115j7253m665P780P726p087
11843a1662R433K094j882o488j5737N356J4859J0868m186k024k178L033J1475
$$ y = [9017, 10210, -2266, 3172, -7862, -14816, -15445, -13450, -20819, -11167, 222, -3096, 3422, 7835, 909, 3676, 17820, 11096, -8642, -17738, -8072, 6964, 10985, 8118, 1541, 4867, 8418, 1460, -8783, -4784, 6774, 10600, 27180, 19742, 11565, -6016, -24743, -17972, -7288, -7724, -5580, 5329, 1853, -5242, 3630, 11309, 6235, -9046, -9131, -11102, -32965, -30651, -10968, 441, -7700, -14629, -19062, -20196, -19098, 4615, 21, -16927, -19837, -15991, -6999, -7415, -8290, -12913, -21579, -6021, 8686, -5238, -18920, -13066, -6619, 7129, 4047, 10783, 14220, -860, -5187, -3424, -2214, -2967, 1666, -9699, -22198, -21135, -7094, 12952, 1837, -15416, -20081, -12301, -4575, -11662, -2229, -135, -2017, -8505, -24242, -18886, -4027, 6841, 2655, 631, -1547, 1486, 12961]
11830A2961J5693K934p533j1389o598J563R835o910q326l878O993j821Q078l594
11816H008O821n358j1613J1487k167J1601R938n904k204k61j808r324L832k613
11802A0435N60J4416N016o070l763n118j0767m523O863n882l276l351J4080l06
11788H314k681J0776K000j0268j1697k23Q173o667P83M663q554j3850j3579J547
11774c1263J0546Q519o796J7727Q369j895p249r139J3307J7222k2395j9199O106
11761a6140J0277m330L093O298M035K857J5152j5995r2J3152p384r892m724r938
11747a3631N397J3101J0072k747j0319m204m54j6506r445n068m418J3802K880
11734b1540J9282J3324o187n319k362m892j2019q747J173J3311J3873k817j086
$$ y = [12961, 28654, 31588, 24055, 12666, 6068, 7631, 17466, 10556, 2230, -1648, 5345, 3524, 11602, 8008, 14829, 9471, -2142, 9345, 7178, 18779, 28717, 22813, 20609, 20348, 18540, 9216, 13048, 10435, 10995, 25411, 30427, 24357, 20594, 15476, 4709, 186, 7049, 1167, -2109, -5460, 8620, 8314, 5633, 16409, 18409, 8141, -3556, -3779, 4394, -2273, -1490, 3173, -5381, -19231, -32810, -31263, -20717, -12198, -18994, -1267, 7102, 5207, -2042, -11181, 2126, 19348, -3047, -22246, -16140, -5863, -10193, -7100, -802, 3233, 6090, 21242, 5247, 5155, 18307, 10923, 1031, -3693, -13631, -8234, 4867, 14939, 12192, 1873, -2331, -2785, -19291, -28736, -33804, -38222, -24420, -21540, -2258, 11066, 4879, -440, -2802, -7694, -19713, -28460, -27287, -13976, -103, -2920, -4006]
11721d006p730k005K360K208R62N035M435N75q911Q994J0903L557j7588r04K855
11706G40q04N242j5252p886l384R272J1477R657l702L016l687r224P708K304q447
11691b970j0536K281R041J1992L399j8889o798j421l541N625Q778J9575K169k573
11677A6132R874J2r255k0610m894J7426J8370R212p413j1498J820n380j7078K431
11663h51R921j2579j3353k599K0329J3490q446j2849j3273O237N21M349J3071
11650C968J863p026K578J113N381k804p708j7162j81Q194J2343R907j559L051
11636A1958L964q413j1278r815n958L270K055k093O245K152L50j8676J548R137
11622a5554K96P19P798K266k995M306n939N519n334O589J4742R292J0521k0253
$$ y = [-4006, -11736, -13741, -11381, -9173, -8211, -3176, 1259, 1834, -7077, 1917, 12820, 16377, -1211, -2115, 740, -64, 5178, -10074, -17960, -21344, -12072, -595, 9062, 5360, 8376, 4689, -4535, 3173, 5477, -2970, -13506, -11225, -2184, 9808, 13207, -5682, -12480, -13901, -17442, -11817, -3039, 16536, 18705, 16132, 26006, 26018, 16763, -3847, -8741, 8685, 27055, 36267, 28854, 17356, 19176, 13796, -3282, -851, 9070, -3509, -16862, -19461, 868, 14358, 5912, -6937, -20210, -13973, -13452, -9103, 3968, 5831, -1195, 1383, 2496, 7877, 5073, -2635, -19797, -19978, -11784, 559, 10466, 8907, 11958, 15922, 7509, -3769, -13584, -19542, -16272, -14217, -16310, -10065, -7913, -7563, -26239, -24691, -15554, -15258, -14539, -6741, -4475, -7470, -3164, -9103, -3584, -8918, -2329, 12413, 21705, 32226, 11973]
11608A1973j6511r438p060N708l1M617Q29K184p0P39N892p092l057J1654N300
11593E637M482l803K735q873l629J1985J0944o377k390k43K358J016J004j298
11579A3548j0405n671k237p732J4808J182j5348k058p628k611N846P738n03n377
11565a6448N729Q187J0299J1462j1452o236M660J0275j2670p85O677n196j0364
11552e862k281o090N14J3852J9362K901J0015K923k715k9215j8250k316J0185
11539f977k630L052J6108L108o900o306K006j982P606k717P83J574n16q214J3916
11524A1911J1466q672k3719l142M479r629l124N17J0280Q740k146j4994K07M829
11510a2997L947j266n157R844N564r28M968m123j2244J996N77o491M846J41n209
$$ y = [11973, -4538, -13976, -21036, -15328, -15359, -10742, -9913, -7729, -7799, -7060, -1168, -8260, -11317, 337, 5637, 10119, 6316, 9051, 178, -3451, 8534, 19478, 13101, 10711, 10468, 12826, 13842, 14846, 13548, 3143, -2528, -4765, -12497, 2311, 3493, -11855, -13913, -21541, -24152, -18306, -10568, -11071, -16448, -10719, -2532, 7767, 19229, 7777, 1541, 6201, 16476, 3806, 3021, 9698, 4502, -5862, -8143, -14233, -13719, 133, 19495, 22396, 32411, 35334, 32619, 3404, -14846, -17162, -6977, -9607, -6555, 9553, 12661, 5761, -545, 1461, -521, 7085, 4368, 5151, 6725, 6209, -2005, 11911, 23377, 14705, -9014, -12156, -7677, -17306, -20430, -19913, -9633, -893, -3039, -18033, -17826, -12997, -9050, -10316, -15473, -5629, -65, -993, 3975, -148, -12392, -10396, -9819, -16310, -11464, -11323, -16532]
11495a6532M049M279l847o482J3839K0440N11K155K449p810o704p511k092K518
11481g38L544M553J215o483N101P826j552j1887J529R500J3813k894m413j7535
11467A579L415J0301j2766j3050p329J4511N545J714K8041J7307k8684j6936J0837
11454A4485o584j3280j7515J698P730n815l605j376L407L810K083Q097j216k577
11440a0658M420L17P787j897J4064K756k364j6054j4842j0929O918Q495J5165
11427C178O070q562n751L77O015K405l068Q037J3295r544j1673M879m774m072
11413c188J267J8603M073M133K013J2099j0871j6886o030J0615R400N190k905
11400B7513l217q284j930n218o498j2808j6668p622L460j321K0333J1696J5050
$$ y = [-16532, -12483, -8204, -12051, -18533, -4694, 15746, 16257, 18412, 20861, 13051, 6347, -1164, -3256, -738, 2806, 7359, 8574, 2091, 7192, 15018, 13466, 1579, 3108, 12608, 26421, 23527, 19114, 1579, 4994, 15295, 2529, -10521, -17850, -3339, 2206, 3920, 31961, 49268, 20584, 3648, 14485, 7901, -5379, -22894, -21196, -13466, -19281, -22886, -24262, -20855, -17045, -14962, -6865, -8081, -10658, -6238, -5921, 1866, -31, 14033, 16789, 14425, -1629, -16471, -27400, -20482, -11987, 3178, 9248, 686, -5065, -4688, 1327, 3732, 664, 8701, 21996, 12452, 779, 5658, 884, -3188, -1921, 16682, 20755, 24888, 26901, 39000, 28129, 11243, 5213, 15828, 25228, 30418, 27513, 24296, 16012, 14082, 8864, 2366, -10442, -27110, -34732, -31272, -32593, -12260, -564, 14486]
11387A4486l825q314j416j905m481Q549J1372m046r612J8037J8602P187j9429
11374B5205p316N830l183j4593q193m79j264P329j8674q707R536R41O63J0767
11360b138N328R637J794P072L249l040j4843q730k27q58j906K185Q294o376M967
11345D408N671j4697O236J3319p881j7281o232J0443o613P615K01j222M134J6119
11331A4220m932n276J4629J2648k390r871l961j5106m382l673m331J022O485P109
11317B191J5967K984O526m66j7701l971l108q456r689o574K3661j363n045J297
11303c747J5044J2663J017j1240J7734J2615j3927k5506j1684k674P916J1949
11291A0160J4926L35k974Q26j7146M9L062m841k70J7816R19J573r748m572L400
$$ y = [14486, 10661, 2347, 931, -974, -5455, 3094, 14466, 10420, 808, 18845, 37447, 44634, 25205, 17889, 23719, 20536, 5943, -2250, -2729, -3993, 3336, -15338, -24045, -14509, -13568, -12905, -2138, 3190, 12827, 14621, 21693, 24942, 21902, 7059, -1671, -1898, -2756, -4662, -2477, 5817, -559, 4408, 10079, -4618, 1618, 14937, 7056, -10225, -16457, -6014, -12627, -5012, -4811, -6033, -1899, 14220, 9288, 4012, 18641, 31289, 28899, 19028, 15067, -39, -4421, -8094, -12425, -11403, -4918, 2191, 18158, 21142, 27668, 27202, 9501, 5530, 2422, -6034, -15723, -22297, 1364, 1, -5044, -3747, 11297, 23960, 24977, 13737, 31471, 44086, 30159, 4653, -7031, -9705, -1789, 10160, 25086, 25421, 22447, 23273, 6127, 6176, 9238, 4397, 4127, 21943, 22862, 24435, 14687, 10115, 13515]
11276A3515J670l136l58j0088j0501O841P925M317o695J322P78N192J0932r844
11262A1870j724j380o20o381O497J9949o966p812l244M416j0983j1937m603J1003
11248a915O773R3r558J5828J9283l639j3481O391M871j3393q677L911L831k752
11234G566p014Q403K1119J4846k316k0514j1707j9790n809O894k14J0022J2521
11221A4007K987o599J1833R519r32k475j2355m224m617n807J3193J9551J3225
11208D7306j6423j5127J067J7883J8167J8762J5763j435j8247r140j648J2931
11196F9859N889J0993K0235K8723M9651O0661J04209J81000L13223N28822P06049
11185B079314K54966m93384o74566m36812k42702j43996j00598n8031n0705k3866
$$ y = [13515, 15185, 12049, 11691, 1603, -8898, -2057, 5868, 10185, 3490, 4812, 5590, 10782, 21714, 11870, 10146, 8766, 8146, 1765, 8262, 28211, 21245, 13433, 10189, 14605, 3622, -8315, -12918, -1915, 4858, 4951, -4607, 11221, 30504, 26865, 13384, 19775, 24646, 11253, 2576, 6487, 10318, 7566, 552, 8955, 30074, 44920, 42604, 22090, 10383, -9407, -15216, -8322, -8536, 1486, 14007, 16994, 10395, 22228, 31747, 30815, 28340, 15985, 11761, 7144, 1337, 14530, 34081, 47306, 30883, 15756, 16823, 34706, 52873, 71635, 87398, 85963, 67716, 58576, 56928, 69859, 75748, 86741, 106976, 135699, 185350, 246011, 350220, 531220, 844443, 1373265, 2079314, 2334280, 1840896, 1166330, 729518, 486816, 342820, 242222, 184191, 133486, 109620]
11175A09620j2009j3681J600l279o888R941O50m434q73j1719k1618p429o478j9064
11161A4339j4260o32J3333N466J553J305J3876O572m430k0418K962j0014k0581
11148a0929N691J3161J3116J703N848J1168l080l528k708n931q07l059M978j5401
11134A0222k320Q202J8571J0992l33j9903q429K262J53o346r244O785P447j821
11120A6238l111n357J0864j611L43R37L51j2542k663J2044Q990K854K950L676
11106C3963O948K796n287m018n466M145J6100j0479r860J0409J1528N050n503
11093E0326j1448j6576j2921J0975J6744K582O047j1037n190N328m681m977m370
11080B0802M241Q13j8722R955J791K257J6683J6637j1070j0306N074k255K1369
$$ y = [109620, 97611, 83930, 85530, 82251, 75363, 85304, 85954, 81520, 80647, 68928, 47310, 39881, 33403, 14339, 79, -553, 12780, 18246, 19799, 21104, 34980, 41552, 37122, 16704, 19666, 9652, -10929, -5238, 7923, 21039, 22742, 28590, 39758, 36678, 33150, 30442, 24511, 23704, 20645, 25623, 10222, 7902, 16104, 34675, 45667, 45334, 25431, 17002, 19264, 19417, 13071, 3827, 10612, 18059, 16238, 13127, 7770, 18634, 17023, 17366, 18303, 18654, 6112, 3449, 15493, 24483, 27337, 30287, 33963, 40911, 43707, 38420, 34402, 28936, 33081, 49181, 38702, 28842, 39251, 50779, 55829, 50326, 38878, 22302, 9381, 20356, 37100, 39682, 45729, 34692, 29502, 34830, 30149, 25172, 20802, 25043, 25856, 7134, 17089, 18880, 21137, 37820, 54457, 43387, 33081, 38155, 35900, 57269]
11067E7269j172j6031q087m500j6576r495O641K0318R588K150J1609l645M268
11054E2337O584m174n898j2525j2643J3029J9624Q952O422J0633J1219L445m269
11041I2736K4495P4932R6398O2577l5976j08146o4040k2467k0553j0350q837m207
11029G6562j7238J603J3465L190r529j983k1265k0594J701J3832j353j4213m748
11016A9430N75N882k255J0821J6953J3893R91j2951j8154j6144N545J1470M144
11003D0200P322j418n907Q185J9817J6118m870P978q315j2527p234k6662j5759
10990A6928m818J2763N024N700l101m773O99k1566q096K7292J422q480O624R461
10976C5079J8533K2705O097P86J393K238r937k9161o481J2053L294J7065Q787
$$ y = [57269, 56097, 40066, 31979, 27479, 10903, 1408, 8049, 28367, 37955, 40105, 51714, 48069, 52337, 58921, 54747, 48849, 36324, 23681, 36710, 56334, 65286, 71708, 82341, 93560, 97005, 92736, 117231, 192163, 288561, 351138, 315162, 207016, 142976, 120509, 99956, 89606, 80769, 76562, 59324, 60927, 74392, 77582, 68053, 66070, 44805, 24211, 25912, 39744, 38391, 24178, 19430, 20005, 25887, 23632, 34453, 51406, 65299, 66290, 53339, 35185, 19041, 24586, 36056, 40200, 47522, 46104, 40197, 48382, 68199, 84317, 79447, 87425, 79110, 66583, 59349, 32687, 16928, 12110, 24873, 29897, 35597, 32496, 27723, 28422, 6856, -1240, 26052, 27474, 18994, 25618, 35079, 53612, 76317, 82414, 83200, 84593, 86831, 76894, 47733, 41252, 53305, 56599, 73664, 82451]
10963H2451n276r668n614J997M346J6514P846k1849j2789k1727L347J1570N572
10950E6720J1640J4668L854m581j0886jN403K306n89j2588o579P407K5415K0880
10936A13069J044j3160j1245j913j0559j8680k942Q001J0218J3883r14N768N93
10923I3163n642k608n323J4770J4838R539L2863L5206M3702M5325P2443J09015
10911D57291Q8138k2237j05146j14063o4457j7367j0999o341P032P393m988j4128
10899B00128l1430r640K119m269j8760j1146K344K5396J6118J7775M4011K8009
10887B60655K8053R7031K22471L34985R5780k25705k41831j48016q9851m7495
10877B86077l0376q375M399M648l746j8955j2169L686K4349J6703j7787q146L0808
$$ y = [82451, 77175, 67507, 61893, 63890, 68236, 84750, 92596, 70747, 57958, 36231, 39578, 51148, 56720, 68360, 83028, 86882, 82301, 71415, 71414, 76817, 79123, 78534, 65946, 59367, 66774, 92189, 113069, 114113, 100953, 89708, 87795, 77236, 58556, 55614, 63615, 73833, 87716, 86802, 92570, 93163, 87521, 84913, 79590, 94360, 109198, 118737, 151600, 186806, 230508, 275833, 348276, 457291, 545429, 523192, 418046, 303983, 239526, 222159, 211160, 204819, 211851, 219244, 214256, 200128, 168698, 159058, 161177, 156908, 138148, 127002, 129346, 154742, 170860, 188635, 232646, 260655, 288708, 385739, 608210, 943195, 1038975, 813270, 571439, 423423, 333572, 286077, 255701, 247326, 251725, 256373, 252627, 233672, 221503, 225189, 249538, 266241, 248454, 240308, 271116]
10864B71116K9010J2742N75M291M596k5869m4033k0826J1248J5607R643L0854
10852B98954K0712J1492R363l438K149q040k3635j5681J6022K7506O0131P2045
10840D67580N5532M7646K0162m700k5722o739J2672P579L1196L7326L1721J5774
10828F90027R037L9945J00964J03216O6672K1231J9340N2089P9111J16833J54972
10817A453437J34938J00881P4637J03880J48366J31536Q7164J41594K49053K82539
10807B908025K73578L62542N54732Q94196J250087R08505J82194J87571N44379
10798H065809O87078Q78136J266745J778032K336927L282979M838143P121063
10790C0254912J0628303J6704076K8009095M9944115R0974916J36751107Q4844160
$$ y = [271116, 300126, 312868, 313443, 317734, 322330, 296461, 252428, 231602, 242850, 258457, 268100, 298954, 319666, 331158, 340521, 337083, 339232, 331192, 307557, 291876, 307898, 335404, 395535, 467580, 523112, 570758, 590920, 586220, 560498, 553759, 566431, 574010, 605206, 642532, 674253, 690027, 699064, 739009, 839973, 943189, 1009861, 1031092, 1050432, 1102521, 1181632, 1298465, 1453437, 1588375, 1689256, 1763893, 1867773, 2016139, 2147675, 2234839, 2376433, 2625486, 2908025, 3181603, 3544145, 4098877, 4993073, 6243160, 7151665, 7333859, 7521430, 8065809, 8752887, 9631023, 10897768, 12675800, 15012727, 18295706, 23133849, 30254912, 40883215, 57587291, 85596386, 135540501, 226515417, 363266524, 448110684]
10783D48110684o6450225j33298076r7932003n4542517l0855739j8674493j1806630
10776C4551001p757144n380882l965249l071234k429679j909519j490482j027887
10768G518925n22971j06001J66148K62497l61085j096614j113443p93801n33249
10759C420406l45405k47434k69079k50193j04919J8955o3289j98028j60342j4109
10749A786563Q7462Q0660M426j51892k86519k50218j43386m3610p052l1097o7440
10738I77897o7340n2534j2652m0438m9272m0785m4083m8395l6714j7962J143J920
10726E70785L874K3259J0294j5226l5407l5713j4009j1422k2677j2338j3954o703
10714D40763J6842m827O808K3163J0135l42j3564J1075N2926J37686K54825M53891
$$ y = [448110684, 381660459, 248362383, 150430380, 95887863, 65032124, 46357631, 34551001, 26793857, 21412975, 17447726, 14376492, 11946813, 10037294, 8546812, 7518925, 6995954, 6889953, 7056101, 7318598, 6957513, 5860899, 4747456, 3953655, 3420406, 3075001, 2827567, 2558488, 2308295, 2203376, 2222331, 2159042, 1961014, 1800672, 1786563, 1874025, 1954685, 1959111, 1807219, 1520700, 1270482, 1127096, 1083486, 1076434, 1045337, 977897, 910557, 858023, 845371, 804933, 755661, 714876, 670793, 622398, 585684, 567722, 568865, 570785, 574659, 597918, 608212, 592986, 557579, 521866, 507857, 496435, 473758, 461420, 447466, 440763, 457605, 452778, 459586, 482749, 492884, 492542, 478978, 490053, 542979, 680665, 935490, 1389381]
10702A389381N84594J98411l62667m41459j89649O9104J00245j14749k82554k63281
10692F87376j69880r3603p2989n0017j6882j2299k4613j4686M888K0569J1234
10681B69098m556j5262l8999q513J0386J6255o431j0169j5075k4371j4518Q26
10669A58671j9878j4319n937o761J492J8118K6589J8640M3631L6319M9341M7270
10657C53176K5946m8271o9011o3454l5431j6727p940p463O078J6342P229J648
10645A62122k168l2955k4945m406m303p13L885J5466K048P097j0116j0379j1411
10632H9222j064J1841J3118n996j9177j0924k32m610j4991m813J1569J080l165
10619F1858O175K7653L418o768j0647o785k486j888p926k667L598J6165k704k2670
$$ y = [1389381, 1973975, 2172386, 1809719, 1368260, 1178611, 1247715, 1347960, 1233211, 950657, 687376, 517496, 423893, 350904, 300887, 284005, 271706, 247093, 232407, 237295, 257864, 269098, 264542, 249280, 210281, 201768, 212154, 228409, 221978, 211809, 196734, 172363, 157845, 158671, 138793, 124474, 118537, 111776, 113268, 131386, 157975, 176615, 220246, 256565, 305906, 353176, 379122, 330851, 261840, 198386, 162955, 146228, 138288, 130825, 136903, 153245, 160474, 162122, 159954, 126999, 102054, 97648, 93345, 92632, 96517, 111983, 114031, 121128, 111012, 100633, 89222, 88158, 99999, 113117, 107121, 87944, 77020, 76788, 72178, 57187, 52374, 63943, 65023, 61858, 68033, 95686, 99104, 92336, 81689, 74904, 72418, 70530, 62604, 59937, 63535, 79700, 76996, 54326]
10605E4326k4185q958R415L727j5417m976J873J9147J703K053P45j3365k277J5132
10591C8943J9083K3909j993k0322j4701Q424Q258j2485k9487oN356N962J9301
10578E0242K2638J2010J8661r542k7627l1840l1702J3057J2332J889k126M050
10566C2042j2742N473N369j341J716M147l697J327k1822r322K9567K5732M840
10553F1289j4880j7003j6762M455Q206J407N809K618K020p353p870M70k617o714
10539A3075l663N843n466p35K286K134N837J2690L1893q063j6304l948R537M607
10525D9723j5217j5905l049J888N540O180Q033J581q924r272R33K230R48p677
10511A7012o75j077K2O531M13k989K532j3323m296L501J7181J1561M764L117r881
$$ y = [54326, 30141, 21183, 30598, 34325, 18908, 13932, 15805, 34952, 36655, 38708, 39453, 26088, 23811, 38943, 58026, 81935, 79942, 59620, 44919, 53343, 61601, 49116, 19629, 19623, 24979, 30941, 50242, 72880, 84890, 103551, 94009, 66382, 34542, 2840, 15897, 28229, 30118, 27992, 32042, 19300, 24773, 30142, 28801, 30517, 34664, 30967, 32294, 10472, 1150, 30717, 56449, 61289, 46409, 29406, 12644, 17099, 25305, 26712, 32521, 35139, 37159, 29806, 21936, 22406, 19789, 13075, 9412, 15255, 9789, 9054, 11340, 13474, 19311, 32001, 63894, 55831, 39527, 35579, 45116, 49723, 34506, 18601, 15552, 17440, 22980, 29160, 37193, 38774, 29850, 20578, 21511, 23741, 24689, 17012, 16337, 15260, 15282, 21813, 22226, 19237, 21769, 8446, 4150, 7651, 24832, 36393, 41157, 44274, 34393]
10496C4393j6634j5776L324P887m217N576N690l41j691N077j615l0255j5249J0329
10482a3502O988J4585O861j3434L868n836r167m402K825l506j8382j2312J1301
10469c4113K2219J1463J5486J5311j577p683Q894J8035k2810j2874o17o883J0808
10456A5659J5342k297n605o556N213l624p736o332J0573N040J4680q897j7907
10443G553R290j270j0333L751m553m3R364J3895J949Q127j3374l2043j7137J969
10429b2855k4J6782J6809q330Q920J8599j9584o44O521Q871N614n082j0066p228
10415H303L737J028p188P793K0478j119m202Q47n111K3847K445k0290p826J7742
10401D0484J4241N317j280M690O262j984k719Q605K4316J0141j504J4448K789
$$ y = [34393, 17759, 1983, 5307, 13194, 8977, 14553, 20243, 19902, 18211, 23288, 21673, -8582, -23831, -13502, -6514, 8071, 14932, 1498, 5366, -470, -9637, -14039, -11214, -14720, -33102, -45414, -34113, -11894, -431, 15055, 30366, 28789, 21106, 30000, 48035, 25225, 12351, 11734, 4851, 15659, 31001, 28704, 23099, 16543, 21756, 18132, 10396, 4064, 14637, 19677, 34357, 25460, 7553, 16843, 15573, 5240, 8991, 4438, 4395, 13759, 27654, 29603, 37730, 24356, -7687, -24824, -22855, -22879, -6097, 10712, 2382, 11302, 29901, 10317, 9673, 16194, 25065, 30679, 25597, 15531, 8303, 12040, 13068, 5880, 13673, 34151, 33032, 28830, 29677, 24566, 48413, 50858, 30568, 22742, 40484, 54725, 60042, 58762, 63452, 69714, 67730, 65011, 73616, 97932, 108073, 106569, 121017, 123806]
10388A23806j09J6366K9747K4649L6773N2677R9467K07905L86143O35388O37555
10377B250367j7338o44012o19110l62691k09559j21981n9189l6758l7917k6347
10367A15465j0516J582J0881q138j7061p999j1039j5414J8035J0591j6473j7048
10355E2866m636R335n027j2409k522o626j3736j406M150l994q121M027p121M772
10341I552O083K867j6524j1345m134q505p864k450J0464O011K23q001l526J3002
10327a4147N831m596l155q56R577j4512L980K0458m463j7622O372J2701M051M443
10313H062J994j1992j287K1074L195m063j6304l809k007m757o37K157q624j2443
10299b9441L746J2088J5031K717k124n770o447M573m003j4837R891O607j3176
$$ y = [123806, 123697, 140063, 169810, 194459, 231232, 283909, 383376, 591281, 977424, 1612812, 2250367, 2233029, 1589017, 969907, 607216, 397657, 275676, 216487, 179729, 141812, 115465, 104949, 106531, 117412, 109274, 92213, 84214, 73175, 57761, 75796, 86387, 69914, 52866, 48230, 57565, 52538, 40129, 37607, 30981, 17245, 15839, 19989, 15995, 7874, 11901, 4780, 9552, 15635, 18502, 1978, -9367, -13501, -22006, -29870, -32320, -21856, -15845, -15622, -23623, -27149, -14147, -8316, -12912, -16067, -16923, -7346, -21858, -17878, 2580, -1883, -19505, -13133, -432, 3619, 8062, 10056, -1936, -3223, 17851, 21046, 16983, 679, -3130, -5137, -9894, -10531, -8374, -16998, -29441, -25695, -13607, 1424, 4141, 2017, -3753, -10200, -5627, -9630, -24467, -14576, -7969, -21145]
10286b1145j3018R296J8985J0118k581j834o690K898R719j6513K492M09k065J4532
10272D603K631k063r851O247M947n507K447L856J2572R153m752r381o608M275
10258A2569R175K47j1238k853Q573J2159l283Q283J2070n895P19P555K677o217
10244D4541n610o82r604j5069j6498j16O974O325o06k191p322Q202J2809K521
10230B3674J5122M000j9991j0148K324L071J357j3056j6571L490Q594J1376m003
10217I239j572j5023n747K8392J7059j512M252J0084J071N510M146l255j3404
10204C9240q026J936j2464o456p252J17m280J2847P837j0046K631K833k161p823
10190H933J530N315o106j446J308L731K812K169P303q720j9550K635J4662J1545
$$ y = [-21145, -34163, -24867, -5882, 4236, 1655, -179, -6869, -3971, 5748, -10765, -8273, -7864, -9929, 4603, 7234, 5171, -4680, 1567, 6514, 1007, 3454, 7310, 19882, 29035, 24283, 14902, 8294, 12569, 21744, 21991, 10753, 7900, 16473, 28632, 25349, 33632, 45702, 39807, 40526, 48081, 50758, 44541, 38931, 38249, 28645, 13576, -2922, -3038, 3936, 10261, 9655, 7464, 142, 8344, 21153, 23674, 38796, 42796, 22805, 12657, 14981, 18052, 19409, 6353, -10218, -6728, 1866, 13242, 9239, 7667, -7356, -13103, 15289, 32348, 30836, 35088, 45172, 46243, 51753, 55899, 52644, 39240, 31214, 33150, 20686, 14230, 6978, 7095, 2815, 15662, 23499, 13453, 16084, 18917, 16756, 8933, 10463, 15778, 9672, 8226, 9534, 13265, 16077, 18246, 25549, 16829, -2721, -86, 14576, 26121]
10176B6121M440l727J531j1745j2804j0728q854J3896K1566p59k4757j5629J1416
10163a0033L15M10Q860J5306k69k0125p002K252J2172K219m471r725l921N372
10149h640P366l695p991j9110J1969J4019q54k70nn523J3273J2341j089J811j9543
10134e941m516Q228o748j0377P746J6991J0077P845m707N28m05j387n748j3545
10120a959K45q79p508p292O048K0686J763j205J4703o96K29j0493p423n610n546
10105d937J1234q163M721J160N750M205J0702j0780j1950J502M041J0082m53q271
10091H843l093P830j6020m526l416n472O427j925n620R151J2823n89q654j880
10077f121l523M090m986j3328K968R126O859J0360k831j276j2071l331n754k749
$$ y = [26121, 30561, 26834, 28365, 16620, 3816, -6912, -15766, -1870, 19696, 18937, -5820, -21449, -10033, -9718, -9308, -448, 14858, 14589, -5536, -12538, -10286, 1886, 4105, -366, -10091, -14012, -8640, -1274, -4969, -12960, -32070, -20101, -6082, -6936, -7206, -7211, -12734, 539, 12880, 11791, 13602, -5941, -10457, -2229, -8977, -19354, -11608, 5383, 15460, 23305, 18598, 19126, 18721, 17334, 11586, -1959, -1714, -2593, -10101, -17393, -11345, 9341, 11104, 9899, 24602, 23906, 24135, 13642, 6219, 609, -4937, 6297, -1866, 2855, 4015, 9765, 13970, 24672, 13892, 1942, 3444, 7485, 17567, 17114, 8843, 5750, 13580, -2440, -6966, -10382, -15854, -9427, -11352, -16972, -7821, 5002, 4413, -4241, -6121, -9644, -5554, -10540, -23868, -20900, -11774, -4915, 5445, 2614, 1338, -10733, -14064, -19818, -22567]
10063b2567K123k22K204J6562N8j5907j3244k217M911R739P992J0968J0924M313
10049A5637j2108N952K0018J6035N476k3467j2648j1465m980L89P242L153J226
10036A0460J832L804j2322n273P255L11m231N830M902K410n662k9411m210M912
10022a9393R790l781K949J055n644J3760n009l888p014L316J5760J489j4442j0891
10008b1943l981L910J7444J422l916Q14J0194k739p154m138O376k038p778o264
9994a9791J4664m181J863M204j849j4760l605J2303J327l052J0867j1874J878
9981a2006N119L512k788m385J3330Q451n676p686j837j1067P919O867j426n489
9967g162r058J530J0260j4270q950M625P345p042m921Q778n931J278N481R466
$$ y = [-22567, -20444, -20666, -18462, -1900, -1842, -17749, -30993, -33210, -28299, -18560, -10568, 400, 11324, 15637, 3529, 9481, 29499, 45534, 51010, 27543, 14895, 3430, -1550, -1161, 6081, 9234, 10460, 12292, 16096, 3774, -1499, 5756, 6067, 1836, 7666, 12568, 14978, 9316, -20095, -24305, -19393, -9603, -13384, -10435, -9380, -15024, -1264, -6273, -10161, -17175, -13859, 1901, 3390, -11052, -21943, -25924, -22014, -4570, -3148, -7064, -6250, 3944, 1205, -5949, -10087, -3711, -5749, -13527, -19791, -5127, -9308, -7445, -3241, -5090, -19850, -23455, -11152, -9825, -12877, -2010, -13884, -12006, -6887, -3375, -6163, -10548, 2782, 11233, 5557, -2129, -3966, -15033, -7114, -247, -1673, -7162, -16220, -14690, -4430, -18700, -27650, -23025, -15680, -22722, -27643, -18865, -24796, -23518, -18037, -8571]
9953h571P625J837j0454L809M552p800r714N429J5710l113j1190n3j0797M944
9939a7786L272o479j0204N736J9667J5470M04l277J1445p657r877J251k672L485
9925B778n229j3936J7091L040k4474l31J0515J2389J3703j4731m211m96k470J0110
9911C748r99n196p859P540J4321R24j560M792m181j3223J3198P122p032j0633
9897I62R590k343n69Q010O363j1492j5848J0469p490R564M653n766J4422N799
9883B6324R97j0935r826Q817L92k171J2484k087j1292p548j8073P428N690j0621
9869a0421k576k478j0331K0756Q201j1236m383L726q749M844L640J3298j0549
9856f258J4955K2198P535L552N684j6377p287o154j469p874L26j1355j919m88
$$ y = [-8571, -946, 891, -9563, -5754, -1202, -9002, -18716, -13287, 2423, -690, -11880, -11933, -22730, -17786, -14514, -20993, -31197, -25461, -5794, 9676, 10080, 6803, 18248, 10591, 714, 1965, -707, 2778, -2451, -16387, 704, 3744, -20730, -21061, -10546, 1843, 15546, 815, -3396, -3892, -6362, 3748, 2749, -2447, -10306, -2766, 11555, 12479, 10919, 15711, 11530, -1693, 11505, 18627, 11595, 962, 10552, 8209, 7640, 15650, 22013, 10521, -5327, 5142, -2348, 7216, 11869, 6103, 20525, 26324, 27321, 16386, 6560, 15377, 15769, 13598, 26082, 23995, 12703, 5155, -12918, -5490, 200, -10421, -12997, -15475, -25806, -5050, 3151, -8085, -12468, -8742, -17491, -12647, -9007, 4291, -6258, 8697, 30895, 38430, 41982, 47666, 31289, 24002, 17848, 16379, 8505, 8831, -2524, -4443, -4931]
9842d931Q329K819l36N448K41J9o725M964o728j2462j8678l943J8304K4118Q40
9827A1279k103n661m959K34j2549M602M584K223M369O450J314m205k7226k78J0391
9812a1535q774r247J8558J2418m339J417k138K553J727P184l035k2361m292J4153
9798g711J3172M573p564j3958J210R045J0749R413Q67k3494r354K911J9715m647
9784D927R582L047j3171O918l620k771R934M814J1292Q993j6288j9626n219k590
9770c778L544l524o215l423R796J3794N795l217N266n03L229j3992j4814j0183
9756a8225J4768J7837L480k13k1469J72j287j6137J0239p671j631L481O806J9755
9742I905p977j5449L498Q288m917R043j722j1315j7700P143J3014n364N143k94
$$ y = [-4931, 3398, 6217, 5881, 11329, 11570, 11589, 4864, 9828, 3100, -9362, -28040, -31983, -13679, 10439, 11279, 9176, 3515, -1444, -1210, -13759, -9157, -4573, -2350, 2019, 8469, 9783, 5578, -21648, -21926, -11535, -20309, -29556, -10998, 1420, -2919, -1502, -3640, -1087, 640, 7824, 4789, -17572, -21864, -7711, 5461, 10034, 2470, -11488, -10278, -1233, 9516, 18929, 19796, -3698, -13052, -10141, 9574, 4927, 14509, 17556, 4385, 11303, 7683, 4912, 14846, 19660, 30952, 39945, 23657, 4031, -1188, -3778, -234, -3758, -9973, -13396, -3600, 10194, 15989, 12772, 18038, 17535, 20764, 6772, -8042, -18225, -3457, 14380, 17860, 17647, -3822, -3650, -4937, -21074, -10835, -18506, -20137, -16656, -9850, 9905, 1928, -13521, -10023, -1735, -6652, 2391, 669, -10646, -28346, -21203, -8189, -13553, -8410, -8704]
9728h704L21J2827o109r30J3033O861M380n366o366n309j1692P046O894p413m807
9713e334K971O392j457q391p591Q719R070k088l483J4673K031k2456n28k866r535
9698a9873k353J1113L389N869L291j4858j4576j758J2557J2160K486j151m594
9685h298J1268J2054j0974j1517o801O889K461o244P139L891J18K633l356P369
9671F632o30L846J101j0376j5235n563R485P285J6303j7225r568J611N556M438
9657b340M33L589N653P196j267o472M642K804j0276q764Q979M088q602j4237J3150
9642a424J2800N593n746N339K601l773p817r854k954J3648K02j0039K144p126
9628f406q380L833O160J5957K3275P156k6536j3888j2356p236P698J2271L701
$$ y = [-8704, -8383, 4444, -1665, -2595, 10438, 17299, 21679, 16313, 9947, 4638, -7054, -8, 6886, -527, -5334, -2363, 4029, 2572, -5819, -13410, -4691, 4379, 2291, -1192, 13481, 15512, -6944, -7472, -10338, -19873, -22226, -11113, -7724, -1855, 1436, -13422, -27998, -29756, -17199, -5039, -2553, -3704, -8298, 2970, 15024, 4050, -7467, -14268, -7379, -4918, -11162, -4023, -132, -14, 2619, -737, 6632, 6002, 9848, 10949, 573, -14662, -20225, -10740, -3455, 12848, -4377, -13945, -12334, -6778, -2340, -1907, 1682, 7335, 14531, 13264, 6792, 11434, 14238, 3962, -4802, 4177, 8265, -337, -14574, -1424, 11376, 16969, 11223, 16562, 19163, 15390, 7573, -2281, -5235, 8413, 8615, -1424, 720, -6406, -14786, -10953, -4793, 11164, 34439, 41595, 15059, 1171, -11185, -18421, -10723, 1548, 5249]
9615E249r043o541L806j5341k0761j542J1929Q582L539J0718N083k196l893J6788
9601F377M685j0613p246m445J2571j0831j2014l708j3852q392P382K2200J4974
9588b912l040j433j7660K322R054N619L660o34j1519p97r725P130J0555J0225
9574H45n9k618j0161p063J095Q31l41P711n471j5229K109J9016q918m916K435
9559b0734n113o876J8993M223J09j2925R995N921j701R79r405P071O332n803N188
9544c746J876o104Q662j4733p653q377O366P603j301o772M893J6539j9305O754
9530a5298K2972K745N255J2078j2478r842j391N368P43j755j3582n930J3083l835
9516a867m835R64O598K573q626j1341j246k153o86K4125l757o123n05r441k1212
$$ y = [5249, -3794, -10335, -6529, -21870, -42631, -44173, -32244, -23662, -20123, -9405, -4322, -6518, -10411, 6377, 11062, 449, -6797, -11242, 1329, -9502, -21516, -25224, -39076, -47468, -40086, -17886, -2912, -5952, -7385, -25045, -22723, -13669, -8050, -4390, -5024, -16543, -17340, -27065, -19935, -9380, 845, 786, -1832, -11993, -19056, -17961, -17130, -17471, -9760, -15231, -30460, -28351, -9335, -18253, -23169, -20734, -25847, -32723, -13730, -9507, -9398, -22323, -12328, -6407, -8108, -7129, -16534, -9463, -3131, -8934, -3746, -1870, -7974, 688, -14045, -21698, -30075, -23709, -16106, -17407, -24179, -19286, -2747, -22052, -15298, 7674, 10419, 15674, 27752, 15274, 5432, 4041, 9409, 10152, 8397, -5185, -11115, 1968, -1867, -6702, -5738, 860, 3433, -5193, -16534, -17780, -19933, -20619, 3506, -251, -6374, -6879, -16320, -37532]
9501c7532r458J0525P103m859M769Q102L516K521J1258k0O30k066J5990J5705
9487B6184j2642j6328p226p04L09O636K9678J1101r738j6053j3619j14n464O66
9473g314l999J0048J0887K706R793Q737n155j3475j996k328j2628Q514m033j060
9459a303J9450R728j8219k5324K59J5912J1977L757j8046k153l254j001J7244
9446I027N174L85j4116r448r279J2136J6895k416P96j413j1016l444J19j0879
9432a7479J0384N334K585n258M250K432r487O603j924n503J3137K829o524l580
9418b201R049J2791r699L413m765R712r682j1228r884j4069P577L19J5173K650
9404h44m55J0896q561o108J5j680q667K424R597J7494n156o456K426J5927P115
$$ y = [-37532, -46990, -36465, -29362, -34221, -29452, -21350, -17834, -15313, -4055, -4075, -3445, -5511, 10479, 26184, 13542, -2786, -10012, -10716, -10407, -3771, 25907, 37008, 27270, 11217, -2402, -2516, -7980, -7314, -11313, -1265, 9622, 12328, 22121, 30858, 25703, 12228, 10232, 7904, -4724, 3790, -243, -1303, 18147, 27875, 9656, -15668, -15409, 503, 12480, 16237, -1809, -3962, -7216, -8217, 9027, 14201, 14586, 470, -8978, -18257, -6121, 10774, 8358, 9154, 7741, -3275, -6719, -6600, -17479, -7095, -1761, 824, -4434, -184, 2248, -7239, -636, -2560, -8063, 5074, 7903, 1379, -2201, 6848, 19639, 9940, 13353, 8588, 18300, 8618, -2610, -12494, -26563, -18986, -18667, -3494, -844, -1299, 9597, 1036, -5072, -5057, -6737, -15404, -12980, -3383, 14111, 8955, 2499, 4925, 20852, 27967]
9389B7967j0563O900j1659j8782j466N016o968r543L953R905r2j39O714j3111
9375a1868l390M912K658L591K867j1516N32K025J49Q896J4536j5897j259M65Q716
9360E417p134p017J0314J749N223J1598l831p272O8j3986j8912o849R296J9313
9346b023K1235q190o965j0965j199P304J0748N700q759q023o050k764n554j4834
9332c0339P210p543j218L2120J9968l792R167J985j7145M7q884P003P096K278
9318A7953o548P673J29j9702q606Q671j884j3370O297L600J919J0377N748N169
9304A7426o346j2605O915J2758j7289j0245J6714j954r831j80J7737j3228n951
9291f079R257J3927p378j0296J1099K233O20J3812m323j3819j0583j924J3261
$$ y = [27967, 17404, 24304, 12645, -6137, -7603, -2587, -9555, -19098, -15145, -5240, -5332, -5471, 1243, -11868, -15258, -10346, -7688, -4097, -1230, -12746, -12214, -10189, -10040, -1144, 13392, -2505, -3764, -3299, 5417, -1717, -8734, 1580, 3329, 8552, 20150, 16319, 9047, 9115, -4871, -23783, -30632, -21336, -2023, 19212, 11022, 4057, -6908, -8107, -803, 9945, 15645, 6886, -1137, -7187, -9951, -15505, -30339, -23129, -30672, -31890, 230, 20198, 16406, 25573, 27558, 10413, 10460, 1576, 8579, 15675, 17953, 11405, 19078, 19207, -495, -9101, -430, -2314, -15684, -9387, -5787, -3868, 6509, 12257, 17426, 11080, -1525, 5390, 18148, 859, -9386, 7328, 5374, -4457, -4637, 13100, -128, -6079, 3178, 17105, 9727, -569, 10530, 12763, 13383, 27195, 22872, 9053, -1530, -3454, 9807]
9278I807J7713j0690k0971n182M873J3194Q125j6266j1713M426R450P981L967
9265A4714j451O3k105j1144J6364j809j7961J779M038J428J3665n57k554N542
9251B0012p167J0738m453N341J2177o088j751q15j999L230q65k0689M846P725
9237B0242k501l205N281J4944n531N84N251j2564j1912M540P589O449K5986l357
9223E1796j0953o781Q67k504J765Q987R675J354q17m282M158k708j2697m262P609
9208D1207Q353r078n704j8124Q377L746R768O702R92J5197M499l513J4751J9970
9194I7143m48m234J0915N817R204k021J0933K6339L2665K3792J3428J3464K582
9181B39579O672L2263O7254M6793M7314N2553P2499R4230J33586J78942K41136
$$ y = [9807, 27520, 16830, -4141, -9323, -4450, 8744, 16869, 603, -11110, -6684, 2766, 10747, 14714, 13263, 13326, 11221, 77, 16441, 14632, -3329, -1550, 2488, 3916, 17581, 17024, 14470, 20012, 12845, 23583, 19130, 24471, 36648, 30560, 28809, 27994, 25995, 29225, 28360, 7671, 12517, 20242, 17741, 14536, 19817, 34761, 29230, 29814, 35065, 22501, 10589, 15129, 22718, 29167, 55153, 51796, 40843, 34062, 34929, 32425, 34190, 43177, 52852, 54206, 53389, 49107, 53265, 50557, 37860, 33598, 41207, 49560, 40482, 34778, 16654, 25031, 28777, 38545, 45247, 46239, 61436, 65935, 62422, 77173, 97143, 96695, 92461, 103376, 109193, 118397, 116376, 127309, 153648, 186313, 210105, 223533, 236997, 239579, 246251, 278514, 345768, 392561, 439875, 492428, 564927, 659157, 792743, 971685, 1212821]
9170A212821L39012M91022P62114J231902K025856L265341M108101K229211j840225
9161A3825155l910950l330392k159159j310222q19576n41171l63422k71992j99102
9152I19169j56892j28524j22652r2229n4141j9305j2518k8808k7465k6227l2105
9141B18303j0829p572k7045k4247j6607k6683j2277P539j100r467K205L244j297
9128I4167r727k3303l248R283r816o229K130M035L436O475L407j5137P417K073
9114F4963j3630p012P660j9125j4455K681J3188r084M071J3690k708M28K63K785
9100D3715j213J076j599r545o083K0317O999m287K042K166j5803j8018q155j0828
9086G84j535L15j784J4837P668j1061J1255N110J636k037K060Q148r572r719r438
$$ y = [1212821, 1551833, 2042855, 2804969, 4036871, 6062727, 9328068, 13436169, 15665380, 13825155, 9914205, 6583813, 4424654, 3114432, 2294856, 1753685, 1390263, 1118271, 919169, 762277, 633753, 511101, 418872, 364731, 345426, 332908, 304100, 276635, 250408, 218303, 207474, 199902, 172857, 148610, 132003, 105320, 93043, 100582, 99482, 90015, 92220, 95464, 94167, 84440, 61137, 57889, 67172, 57356, 51127, 53257, 57292, 60728, 67203, 70610, 55473, 62890, 64963, 51333, 44321, 51981, 32856, 18401, 21082, 34270, 25186, 29257, 42947, 40239, 40667, 40930, 43715, 42502, 43578, 41979, 32434, 26351, 46668, 53667, 49380, 51422, 53588, 37785, 19767, 11612, 784, -751, -436, -2220, 12617, 20285, 9224, 20479, 25589, 27225, 25188, 27248, 35396, 25824, 16105, 6667]
9071F667J4693R042j2304R086n521p448j3480j1000N717J242n280P133R529j25
9057G951j1550P314J6118J0140o118j9361m674J4742j4299K96J5298J2322q455
9044A9724K790K822r541K344O956K554k143l188K202j8018p64R214Q754L968N285
9029C2959j3511j6186J8718J558k8273m09O759q90n694K7770N950j969l576n820
9015A7386Q703R442j0108M813J4838J2147k7121k2007K097o325q192M344R608
9002I625o007m356J528k511K460Q301J1335n474k4N007R612j538r817M061j2159
8987A0043q028j5035r729J0298R971M143m164N938O860l988r794j266K1716N760
8973B2725m114O267j0113K637Q713o218j331M432p659j3231n045l946R962J286
$$ y = [6667, 21360, 30402, 18098, 27184, 21663, 14215, 735, -10265, -4548, -3306, -8586, -1453, 8076, 7951, -3599, 3715, 19833, 29973, 23855, 4494, -180, 14562, 263, 559, 15857, 28179, 19724, 22514, 25336, 15795, 18139, 25095, 27649, 25506, 22318, 24520, 6502, 5738, 14952, 23706, 27674, 32959, 19448, 3262, 21980, 23538, -4735, -5144, 1615, 725, -4969, 22801, 28751, 26782, 23206, 17386, 26089, 35531, 25423, 30236, 45074, 57221, 30100, 8093, 10190, 3865, -4327, 17, 9625, 3618, -738, 790, -1721, 739, 9040, 20375, 14901, 14877, 19884, 29496, 27958, 18141, 22202, 10043, 2015, -13020, -22749, -12451, -2480, 1663, -2501, 3437, 10297, 6309, -3485, -4751, 16965, 22725, 18611, 24878, 14765, 17402, 26115, 19897, 18566, 22998, 15339, 2108, -2937, -6883, 3079, 4365]
8959D365O112L23j518N458N872j8517N488j6m665l567N253k034l192J3758l086
8944A0034m612J0913P779J85j6368j2240R4L626J9899J2649L050m262m90m820
8930B5437j5045l764J2684J5421l708j4117r243m10L604N658o875o740J0565j4982
8916a515M103J8753j7600P435J7593l155J3438j1996k369l742r448p150N3p706
8902c306j1008P068J7061R297k891r653K3145q504j0061N882M333J49p073R493
8888B3932R739J081r164j1643q137p598p09r471k1540N509J4680L641q712K396
8874a5996k595q34l574J7081J8536O147r387P606q650o174N435M713N554j0275
8860G587j8637n578J4968P232O649N390L78J154K0414j2253k3384l851K485o008
$$ y = [4365, 10477, 10800, 9282, 14740, 20612, 2095, 7583, 7567, 2902, -665, 4588, 2554, -638, 13120, 10034, 5422, 16335, 24114, 24299, 7931, -4309, -4215, -589, 19310, 31959, 35009, 30747, 30257, 25437, 10392, 6628, 19312, 34733, 31025, 16908, 7665, 7255, 10859, 16517, 9642, 2902, 13467, -1515, 2588, 21341, 3741, 11176, 28769, 25614, 39052, 27056, 24687, 20945, 11497, 4347, 4400, -3306, -14314, -7246, 9815, 19112, 16221, 6568, 29713, 21209, 11148, 17030, 21363, 21512, 14439, 23932, 33671, 34752, 25588, 13945, 5808, -1790, -2499, -11970, -33510, -28001, -13321, -9680, -18392, -15996, -18591, -19425, -22999, -5918, 12618, 18765, 9378, 16984, 8334, 2160, 7595, 12308, 17862, 7587, -11050, -16628, -1660, 5572, 12221, 17611, 17989, 19143, 39557, 27304, 3920, 69, 2554, -3454]
8846c454J678N133o988Q421m871j455j1128l509P543J2542L355o243q413j1754
8832a9143J0993K0269L718q825j4040q144k360O971J0457n187L966R614J0285
8819A8574Q081J297k0441n595j2840l699J8974J140p721l747K629r374k323m493
8805a9538R253L297P813O326P271K953J174j0003N113O465j2093n606j101m072
8791b748K945J9087o287j0372Q843O317o113j0170j055m318q21l651N489J295
8777a559L117J459J0284J3760n115n328j3576j142Q164m258L714N987k498m438
8763H571j9819k354K0645J0537o262N78N895J3416N349l407k74K044O68k705J734
8748C4616J2466k061j7418r681j214O552J477j2335j0493R034j455P997n499K520
$$ y = [-3454, -1776, 3357, -3631, 4790, -81, -1536, -12664, -16173, -8630, 3912, 7267, 1024, -7389, -19143, -8150, 12119, 15837, 7012, -7028, -15172, -17532, -10561, -104, -5291, -1325, 8289, 18574, 26655, 27952, 7511, 1916, -10924, -14623, 4351, 5491, -2230, -5977, -3348, -12722, -15045, -19538, -10285, -6988, 825, 7151, 14422, 17375, 18549, 8546, 13659, 20124, 8031, 2425, 1324, -2748, 197, 19284, 12997, 2625, 11468, 17785, 11672, 1502, 447, -3871, -4692, -8343, -2854, -1559, 1558, 3017, 13301, 27061, 21946, 16618, 3042, 1900, 10064, 5806, 9520, 15507, 13009, 8571, -11248, -13602, 7043, 17580, 11318, 11896, 17791, 31207, 36556, 33149, 32875, 34919, 35587, 32882, 34616, 47082, 45021, 27603, 17922, 16708, 23260, 24737, 12402, 1909, 10943, 9488, 17485, 11986, 14506]
8734A4506J612N240O553r79k018J1128J5550j405N51P836j914j6092n920L816
8720C8464o58j643q129J669J733n864L154J2802J0209K831p297l930l957j311
8706C8073N754q189J558J3633p715k4452k715M466M015J587j380j5679O466J8140
8692C3562O084R721m929j5691n227R553J6042L396K724k809l101j0608R736Q528
8678E6981J1286r20n963K997n228n930j0136L744J3349L113l384P959l551p850
8664E6467n922k841N755J1969J9998P754o25j7807q914o549r076O101N07O704
8650F3521J4933k52j7059q452J0237Q938K4521J528j4615j5230J5765J7207j729
8637I9313n493p777J372M550J78j754j1419J4190J4113p98N290J1181Q597O442
$$ y = [14506, 16118, 21358, 27911, 26932, 24914, 36042, 51592, 50187, 50738, 58574, 56660, 40568, 34648, 38464, 37806, 36163, 28034, 29703, 31436, 25572, 28726, 41528, 51737, 54568, 47271, 43341, 39384, 38073, 43827, 35638, 37196, 50829, 43114, 18662, 15947, 20413, 24428, 26015, 24635, 8956, 15422, 33562, 39646, 49367, 44438, 28747, 23520, 33073, 49115, 52511, 55235, 52426, 49325, 38717, 48453, 56981, 68267, 67347, 61384, 64381, 59153, 53223, 43087, 46831, 60180, 63293, 59909, 67868, 64317, 56467, 50545, 47704, 53459, 65428, 85426, 93180, 92555, 74748, 65834, 59285, 50209, 56310, 56817, 63521, 78454, 78202, 61143, 52691, 62928, 71866, 96387, 97915, 83300, 68070, 83835, 101042, 99313, 93820, 86043, 87415, 91965, 92143, 90389, 78970, 93160, 107273, 106475, 111765, 122946, 131543, 137985]
8623A37985p590o770N348K5320J1542m121J0828R763J27J239L612K621K4164K5710
8609B39778J9575K3156J7191L2215L9103L9316K1642L1668M5171M2123K2396J0351
8597E83685J4899K3411o206l8408n2958n3704p5446n9780l7986l8048l1231m3878
8585A84350k8377j1530N309M46J3034M325j7517n482j5375k2444j0755R043J123
8572A06150q08n965j6744n746l797L065n953Q703km139l591k770j2299p119P461
8557E6446J2212k840k819j8976q431o335O593Q991m311k725R615J9352q552j8328
8543C9892m283j396J1882L702j0861J522r537m450N277Q979J669j0672k541l694
8529B5489N953L567p307j1398j0189P616Q74K870J4262M411k524k879r986O665
$$ y = [137985, 130395, 123625, 128973, 154293, 165835, 161714, 172542, 182305, 182432, 183671, 187283, 189904, 214068, 239778, 259353, 282509, 299700, 331915, 371018, 410334, 431976, 463644, 508815, 550938, 573334, 583685, 598584, 621995, 615789, 577381, 524423, 470719, 395273, 335493, 297507, 259459, 228228, 184350, 155973, 144443, 149752, 150198, 163232, 167557, 150040, 144558, 129183, 106739, 95984, 105027, 106150, 105342, 99377, 82633, 76887, 73090, 76155, 70202, 78905, 78903, 74764, 71173, 68403, 56104, 48985, 56446, 68658, 65818, 62999, 44023, 35592, 29257, 35850, 44841, 40530, 37805, 47420, 66772, 58220, 39892, 35609, 34213, 46095, 49797, 38936, 40458, 30921, 26471, 31748, 40727, 42396, 31724, 29183, 25489, 31442, 35009, 27702, 16304, 6115, 13731, 14605, 17475, 31737, 36148, 33624, 30745, 20759, 27424]
8515B7424L036R823O276j873o912M996r662j5040j1375P796K974L358n280j5782
8501b41L022J1482j033l426N549L711P795M714j326j0082L057N332q019j6784
8487C751J1297J3451K878L724q760n184O993n671l320k820q84j0075j694J0962
8473A4648K2806J1544r809m963q75j0970j0258j4373l189m323Q505J8553M368
8460B1664n857m410j5479K651J1080j570J086Q375J4782j332O036n866q144q257
8446A4759j2204m106M079L318J611m231k997l301L489J4592k332k9961J2118J5001
8432I835k876O382J1150Q35r358M396M179j3588n480Q30J925k279k178J0948j3087
8417A634q622R030j433p128J4520O685r752m41Q540j749o749M334n319O073J1335
$$ y = [27424, 30460, 40283, 46559, 44686, 37774, 42770, 33108, 18068, 6693, 14489, 17463, 20821, 15541, -241, 2781, 14263, 13230, 9804, 15353, 19064, 26859, 31573, 30247, 20165, 23222, 28554, 20535, 3751, 15048, 28499, 31377, 35101, 26341, 21157, 28150, 22479, 19159, 16339, 15455, 5380, 3686, 14648, 37454, 48998, 39189, 34226, 33351, 22381, 12123, -2250, -5439, -9762, -1257, 17296, 21664, 15807, 11397, -4082, -1431, 9649, 8079, 9165, 17540, 32322, 30990, 37026, 31160, 23016, 14759, 2555, -1551, 2528, 5846, 7457, 3226, 229, -3072, 417, 15009, 12677, -17284, -5166, 9835, 6959, 13341, 24491, 25326, 15968, 20364, 24543, 10955, 5475, 6305, 8230, 5951, 3773, 14721, 1634, -6988, 2042, 609, -6519, 8001, 14686, 4934, 4493, 13033, 11284, 4535, 8869, 3550, 9623, 20958]
8402B0958j8764R637J0681J607J666L978m781l435j2311r06j85j1461p806R540
8388a582J4459M535r979r699P43L731R9J0719j0084J243r037o406R705l406J4083
8373I124L747n354l251M18o128p428J0830N330J2174L043k689k5392k5058P640
8359b2994J4519J074l035O241J2018M573k748R818M411r347j0597l049N482N331
8345A1697J778k496m799M98N168R82Q3j976L686P056J4476m154j4035o931k0844
8330i811L37J6775m389P638J6128m484p490K04k4500j117J5774P864K587j812
8316A3704K2998M956K567p840l140j1563j0561l947k477L539m019k265O535R28
8302I415J142k0r558K023k527L804m545L223J1221O207m560m377M705J3231O437
$$ y = [20958, 2194, 11831, 22512, 24119, 25785, 29763, 24982, 21547, 9236, 8330, 8145, -3316, -11122, -1582, 12877, 17412, 7433, -2266, -1523, 2208, 2307, 13026, 2942, 4185, -4852, -11258, -1553, -4959, 9124, 12871, 7517, 4266, 4684, -1444, -8872, 1958, 7288, 19462, 22505, 19816, -5576, -30634, -22994, -8475, -7401, -10436, -4195, 7823, 12396, 9648, 19466, 23877, 14530, 3933, 884, 6366, 11697, 13475, 10979, 6180, 6678, 11846, 12828, 12911, 10935, 14621, 21677, 36153, 31999, 17964, 11033, -9811, -9474, 7301, 2912, 10550, 26678, 22194, 14704, 14908, -9592, -10709, 5065, 12929, 15516, 13704, 36702, 41658, 44225, 36385, 33245, 21682, 11121, 7174, 4697, 8236, 4217, 1952, 8487, 9415, 10557, 10537, 979, 3002, 475, 4279, -266, 2957, 14178, 20385, 15825, 11448, 16153, 29384, 35821]
8287C5821r899j0508p346J525n306n581J668P782M92K785K809r43j031O043j513
8272A6798k1327j4027M713J805J3040O802r758J9P866N139m49P130J827p629j0441
8257A508J3299J6303J0206o309k1118K32k686J8785M521j0996n500o79l436P569
8243B1699l851J0097N102J147k4085n670M235j559N932o181o05J429J468M64p935
8228A687M492J1034J0875J5219m687m135o211o253p490k080J320K151o744j5M848
8213A4011j477j371l645M832J284o613l698q800j2112Q469M684q44J0012R136
8199A3868k350M497J5137M710j3569j2009j134n849m128N180k882J442Q16o233
8185b504K282P527N540l39k3180k599K6434J7731j6099k628K75m127j0204l830
$$ y = [35821, 25922, 15414, 8068, 9593, 4287, -1294, 374, 8156, 8648, 11433, 14242, 13299, 12268, 18311, 16798, -4529, -18556, -13843, -12038, 1002, 7804, -1954, -1935, 5931, 11070, 10621, 17751, 19578, 11949, 1508, 14807, 31110, 41316, 35007, 13889, 14121, 11435, 30220, 34741, 23745, 18245, 17566, 14130, 21699, 17848, 27945, 33047, 34194, 10109, 4439, 8674, 7115, 13047, 6866, 6261, 7690, 9158, 9622, 1687, 6179, 17213, 28088, 43307, 38620, 34485, 28274, 22021, 14531, 12451, 13771, 15922, 9178, 9163, 14011, 12534, 11163, 7518, 12350, 13634, 7021, 3323, -5477, -17589, -9120, -4436, -5280, 4732, 13868, 11518, 16015, 31152, 35862, 22293, 10284, 9150, 3301, -827, 4353, 1471, 2913, 3729, -2504, -222, 7305, 12845, 12506, -10674, -13273, 13161, 30892, 14793, 12165, 12440, 8313, -1891, -5721]
8171e721o799l294O653J2496J0176p61p759L056J0244J204q824k2746r185p387
8157b8647J9656P241K755N174j902o939P105Q893K269j8479N623j1316p06K620
8143f653q374Q857O166l438l381J869M373L204J141Q233J0724k844r942j0134
8129a99K036n459o710j74J3975J2499o768J1884L694q975n420P633J1294K1355
8115E0665O655k838j4110k4451o500P631K363l477l860j1645j6991m7J2013J422
8101c170r19Q780Q772M334L703K452k752p11j473L999P833O490q427j2396n981
8086A0534M899Q643L193Q195R568o141k3915o813K078K535M732N436m45J1625
8072C4124j2047r589K195J4504N060j7323q460O934n066J955L958n806Q315J3453
$$ y = [-5721, -12520, -15814, -9161, 3335, 13511, 12750, 4991, 8047, 18291, 19495, 10671, -12075, -21260, -28647, -8991, -1750, 1005, 6179, 4277, -2662, 4443, 13336, 15605, -2874, 2749, -8567, -9273, -6653, -15027, -6170, -4, -3442, -6823, -4954, -581, 2623, 3764, 11997, 22721, 19877, 9935, -199, 1837, -3622, -10332, -10506, 3469, 15968, 9200, 21084, 24778, 15803, 10383, 18016, 29310, 50665, 57320, 54482, 40372, 15921, 9421, 17052, 19415, 15938, 12078, 433, -16558, -16605, -4592, -3170, -4089, 4691, 13463, 17797, 21500, 23952, 21200, 20489, 19016, 23015, 30848, 37338, 28911, 16515, 10534, 15433, 24076, 27269, 35464, 45032, 38891, 14976, 8163, 10241, 12776, 17508, 22944, 22499, 34124, 22077, 12488, 14683, 29187, 34247, 16924, 8464, 15398, 10332, 12287, 16245, 10439, 18754, 32207]
8058C2207m302j1123J7322O314J121j2559j991q474K721j0415N578K2310J4440
8045E3149p198j5725J010J5694R891Q262q899j2560R005n690j7105k514N584P618
8031D0522J6589Q342O278k664p237j2904j1279R785Q463j5286j1395N865O766
8018D1845J2005K851m022j5335j4567L47J8124J7236M656J2269N676L983N045
8005I0113L22l077o514J4158n071j9808k396J5267n28p249p543l915j4826Q754
7991E7687J2392m459m712o761k427Q206o321l837l1q43k379j045p073M107j911
7976D0593P559K1843N377m682n868J2343K252k2523P806M583N582K0094J5136
7963A10095j967k941o25k4960o925j421k13k379Q348R109J8084l569r087q048
$$ y = [32207, 27905, 16782, 34104, 40418, 41539, 28980, 26989, 18515, 21236, 10821, 16399, 38709, 53149, 45951, 30226, 31236, 46930, 56821, 65083, 56184, 43624, 52629, 46939, 29834, 27320, 32904, 40522, 57111, 65453, 71731, 69067, 61830, 48926, 37647, 47432, 55895, 40609, 29214, 35079, 41845, 53850, 56701, 52679, 37344, 22777, 23124, 41248, 58484, 63140, 75409, 81085, 85068, 90113, 90435, 87358, 80844, 95002, 89931, 70123, 67727, 82994, 82466, 75217, 67674, 63759, 48933, 57687, 70079, 65620, 60908, 54147, 51720, 59926, 53605, 49768, 49737, 48894, 46515, 45470, 38397, 42504, 40593, 48152, 69995, 75372, 70690, 64822, 77165, 79417, 56894, 64700, 69283, 74865, 94959, 110095, 108128, 105187, 104562, 79602, 72677, 71256, 71043, 68664, 77012, 86121, 104205, 100636, 91549, 83501]
7949H3501j0043l1810n663J4318K65m68P658J1957j7071j4887L50R685k379J3614
7935E9027N125N269p005k1868p468J5415j131q823K085J495K974j43m636r805
7921C0511n55P856J3601R168J6960K013j6685j6797r250L456P502o090m147J8648
7907E6191Q086l944p243N987j6616P783j1355j7892j9976M198J1410R682o977
7894A9334o263j161L922L844o124o991J4529P835j0461N176J735M069K560O16
7880C2620k204j850J0101J898n383j3413J0625J0348k969j7416m150L489J0220
7867C1916K375l652o480o641n23r85p827m288M800R173K296r893j2119R181J1431
7852A8764q605j7885N411N621k82L157l900L675N368j705j0214j0298P238l706
$$ y = [83501, 73458, 41648, 35985, 50303, 50568, 50100, 57758, 69715, 52644, 37757, 38107, 47792, 45413, 59027, 64152, 69421, 62416, 40548, 33080, 48495, 47364, 38541, 40626, 42121, 45095, 44952, 40316, 30511, 29956, 37812, 51413, 60581, 77541, 79554, 62869, 46072, 36822, 40278, 47780, 41690, 37543, 56191, 64277, 60333, 53090, 59077, 42461, 50244, 38889, 20997, 1021, 5219, 16629, 26311, 19334, 13071, 11910, 15832, 19676, 13552, 6561, 21090, 28925, 18464, 23640, 25375, 29444, 32004, 32620, 30416, 28566, 38667, 40565, 35182, 21769, 32394, 42742, 39773, 22357, 18207, 21696, 31916, 34291, 30639, 24159, 17518, 16995, 16010, 8183, 3895, 8695, 17868, 20164, 10271, -1848, 7333, 18764, 10159, -7726, -2315, 3306, 3024, 6181, 2281, 5956, 11324, 9619, -595, -10893, -3655, -7361]
7838g361m080J747K1808O41j0201j449k961O855J8046J784p443J311r874j5589
7824f766J192l137k292j7739q768o09J0825J7464K844J5795O149J926q415q929
7810d60k96Q66M708p478m554P063J8874J0741j498r117l269k4162p064P381J6606
7795H341K739r626j4625m543Q853J1425l008m056N269L027L112j5491o769L573
7781a1779J3130p263J738R498k10k253n962M012K056k0265p047J5670N360K146
7767a169l953m191N04M704O852o024o41P369p95j8579l347n669M909J6120R560
7752E650j3456r457J3186J1368K802R916r718j4049N312O705l010n787J1748j431
7738I779k546p150p06L53J988r589m364m691j2256P212J3165N367K376J0107O606
$$ y = [-7361, -11441, -9694, 12114, 12755, 2554, 1105, -1856, 4999, 23045, 24829, 17386, 18697, 8823, -6766, -5574, -8711, -11003, -28742, -37510, -38119, -27294, -9830, -6986, 8809, 14958, 16884, 8469, -460, -756, 110, 4818, -2660, -7214, -151, 18723, 29464, 27966, 18849, 15580, -8582, -15646, -8265, 8341, 11080, 1454, -13171, -17714, -8861, 2564, -444, -4500, 769, 3796, 6908, -8583, -15352, -11779, 1351, -5912, -4174, 5324, 5114, 2861, -3101, 911, 2967, -17298, -24345, -8675, -3315, -1169, -5122, -9313, -8809, -4105, 2747, -3277, -3918, 3451, 2656, -15923, -19270, -24939, -20030, -3910, 5650, -7806, -17263, -4077, 7291, 10093, 20009, 10291, -3758, 1554, 8259, 5249, -538, 11210, 9779, 7233, 83, -623, -270, 1718, -7871, -12235, -16926, -29182, -21970, -8805, -3438, -1062, 9045, 15651]
7723A5651j913N249l683J3439K109m839m174K002o074l1237j2969Q087L754l27
7709a4925K130l424N52J1718o46L470j5588j130J7259O992l862q042R091J4175
7695A7770K781j1852n051j5589m891J3988Q708j286r274j1857R490L660q367j488
7681a3258L971k28N165J3764J2206L366J4345k549l0709k4115p24Q427L155q298
7667a5482O592o17o850k887n93L157L2539Q259j6953q717j797J811j3965K396
7653a3107J5263J2825m14j7846r212L055Q1o472M286J7907J4883j2940j3812m075
7639i578N225L00K127m551j650j0111P026K864K243J412R189l967O301L460l186
7624G104O223N280J758K655j3582j6475L79Q730m94j0188j1407L086J5331M875
$$ y = [15651, 13738, 18987, 15304, 28743, 30852, 26013, 21839, 23841, 17767, -13470, -26439, -18352, -14598, -14925, -12795, -16219, -15667, -3949, -4595, -1125, -16713, -17843, -584, 6408, 2546, -5496, 3595, 17770, 20551, 8699, 3648, -11941, -16832, -2844, 5864, 4578, -4696, -16553, -7063, -3403, -11770, -13258, -9287, -9515, -4350, 9414, 21620, 24986, 39331, 36782, 6073, -18042, -18766, -10339, -7184, -15482, -8890, -9507, -16357, -19244, -19837, -16680, 15859, 24118, 7165, -1552, -3349, -1538, -15503, -13107, 2156, 14981, 14567, -3279, -12491, -9436, -9355, -15827, -11541, 6366, 21249, 8309, -5503, -9578, -4353, -4053, -1926, -6477, -8127, -18238, -11212, -8348, -6105, -4693, 4496, 529, 6830, 10290, 7104, 13327, 18607, 20365, 23020, 9438, -7037, -6658, 2072, 1578, -8610, -20017, -16931, -1600, 3275]
7610C275n231O799L020p323K900M128L325j359j3902j4359L983R093j89N834m807
7595d813l928j710J301N839Q350J0102j3922L226p112R742N371O335l079j134
7581A4568m557J598j0182m945j7604N62N403K370M167P524M432l568j871m959
7567g062j237l72N835o790j3466m641R031J7819N094n234j6344j3988Q779J4782
7553g794k936p269m282J1967N000q003j841j1551j150K2216J2356K156j2535k020
7539e686N644m57M249l793o28M039k3838o946p37R892J0577j1922n979K318J2407
7524a0860J4111k231L273r290j1546j518R241J9726N231M850j1244p858K436j405
7510B916m580Q711R571L489K74n613r400K438q807j1769j1269O221J2477N82M556
$$ y = [3275, -1956, 4843, 7863, 540, 3440, 7568, 10893, 9534, -4368, -18727, -14744, -5651, -5840, -6, -4813, -8741, -10451, -9150, -3311, 5039, 15141, 1219, 4445, -2667, 7075, 12446, 18781, 15702, 14568, 10011, 11609, 1427, -3518, -21122, -20560, -15157, -12787, -8620, -1096, 3336, -232, -2103, -7062, -8299, -8671, -2836, -9626, -23092, -27733, -18702, -883, 4211, -1023, -17367, -31355, -22576, -7794, -10730, -17999, -22281, -10314, -5314, -13317, -15158, -26709, -27859, -5643, 6713, 8869, -3666, -5686, -42, -499, 3750, -43, -671, 3368, -20470, -27416, -28153, -18261, -7684, -19606, -25585, -23267, -10860, 3251, 1020, 4293, -4997, -16543, -18061, -8820, 10906, 16137, 20987, 9743, 1885, 4321, 2916, -1664, 7047, 16618, 20107, 20381, 14768, 5368, 7806, -1001, -12770, -24039, -17818, -5341, -4759, -203]
7495b03J292o544k498L572J5838l714k604j99p841p427R315L021K540j2212j5131
7480b2795K885M753J2034n478P75K360j716M469R568N982k0122j2055o509J904
7466b3945L433l098q093J120o843K3487O72l693P788J689m711r047Q03J8687P707
7451E956j0533j5345P34J4593j718n926l709J5975L650n782j7214q955K2721N383
7437a70l516M857j1806j732J1903J0791p845j3522O38Q895k884L34J0817J4594
7423B1354N16q320R420j2825j0501p667K249m10J6835J3447j1014p945O583N788
7409A7510j0724r912j769J540j882K661l183j2364N887J3369K997k000p66M745
7395F109J487l508r71k581M963j2254q304k604Q98P807l38M183J931j6276O797
$$ y = [-203, 1089, -5455, -7953, -4381, 11457, 7743, 5139, 4940, -2901, -10328, -1013, 2008, 4548, -7664, -22795, -19910, -15157, -3123, -8601, -7826, -5466, -7182, -2713, 6855, 12837, -7285, -19340, -25849, -23945, -20512, -23610, -31703, -30583, -37426, -13939, -13267, -16960, -9172, -7483, -12194, -21241, -20438, -1751, 5956, -4577, -19922, -19188, -4595, -6313, -12239, -15948, 27, 3677, -2105, -19319, -28274, -5553, -170, -3686, 1171, -10635, -12367, -464, 10327, 2482, -11040, -10402, -1507, -4391, -4057, 6760, 21354, 21870, 13550, 22970, 10145, -356, -8023, -5774, -6184, 10651, 24098, 13084, 5139, 11722, 17510, 6786, -3126, -4895, -3355, -5237, -2576, -5759, -18123, -12236, 1133, 4130, 2130, 1364, 6109, 7596, 4088, 3117, 536, 5499, -6755, -15059, -17663, -16765, -8958, -9296, -5113, -3182, -19458, -12661]
7380a2661K2862J4101k1878j7115o619m198O846N629M185J2674j1476l102J5179
7367D427o785N86O996M936r533j0671M305j1347O299k398J4373J6597J401J2382
7353C1568K852k1028j0957K596O05j4430l541Q756P078J1580L932q856k3868o535
7339b0248J6823J6349J376j8996q11l353L644J4923k588r122L326j186j5863K393
7325a3333J4888l631R07K522n356L12N866J1355j5907K870j463j1504p567J4706
7311e335M373l486Q344M022R593p362j7785N004P926L63J078P354j2253k773M032
7296C095q157m649j2989O419l901m928m474L872J0135k072Q887K940k073l676
7282a1571j4471L793J4004J545n144o071K0979J7793j281j8366p669k829m822
$$ y = [-12661, 10201, 24302, 2424, -14691, -21310, -25508, -18662, -13033, -8848, 3826, -7650, -10752, 4427, -2358, -1772, 5224, 10160, 627, -10044, -5739, -17086, -10787, -13185, 1188, 17785, 19186, 31568, 34420, 13392, 2435, 5031, 5636, -8794, -12335, -3579, 3499, 15079, 19011, 10155, -13713, -20248, -3425, 12924, 14300, -4696, -5507, -8860, -5216, 9707, 7119, -2003, 1323, 137, -15726, -13333, 1555, -2076, -1169, 1353, -4003, -3691, 2175, 13530, -2377, 493, -970, -12474, -20041, -5335, -962, -4448, 3896, 7918, 17511, 10149, -7636, -2632, 5294, 5657, 6735, 14089, 1836, -937, 3095, -5062, -9711, -22700, -16281, -20182, -25110, -29584, -25712, -15577, -17649, -8762, -5822, -7895, -11571, -26042, -22249, -8245, -6700, -11844, -17915, 3064, 20857, 19576, 1210, -6459, -9288, -14110]
7269a4110J0618r41q961N914Q979Q37j740k4923L978J5641n917P258j2823J1491
7255d699J4698k663L459k363j0413P125j3571n107k385p518j223R489Q932Q37
7241e402L12P227J3889N845q049r008k46J1802M087r170j1945q047P162j5854
7227a7397j3409nJ4471j7K288J6480J1749j0878j8543P758J8619j620K208j0883
7213H21k3553l613K877j7858N513J1970j0703m971L261O519J1259M991n988J8211
7199a264k761k0519k630J5799J0800m929o87J034L253K0528J615o274j7274j2414
7185a5723K004J4133M126J3490J1137j1083j8249j1263L944j1808L094P921J1652
7172C375r211N627J4290l983j2468J122J789k554K771K997J074j0279q66m957
$$ y = [-14110, -3492, -4433, -13394, -7480, 1499, 2336, 596, -24327, -20349, -4708, -10625, -3367, -16190, -4699, 9999, 7336, 10795, 8432, -1981, 5144, -8427, -13534, -15919, -23437, -24660, -15171, -6239, -5402, -5090, 2137, 16026, 21871, 13822, 4814, 4568, 16370, 20457, 11287, -658, -8705, -1543, -17397, -30806, -30811, -16340, -16357, -14069, 2411, 14160, 3282, -15261, -7503, 11116, 9496, 11704, 821, -22732, -26345, -23468, -41326, -35813, -23843, -34546, -39517, -36256, -29737, -18478, -13487, -19475, -1264, -4025, -24544, -27174, -11375, -575, -5504, -6191, -5157, -1904, 18624, 20239, 13965, -3309, -15723, -13719, 414, 4540, 18030, 29167, 18084, -165, -11428, -7484, -19292, -16198, -8277, 3375, -5836, -209, 14081, 10098, -2370, -1248, 541, -2013, 758, 3755, 4829, -5450, -6316, -11273]
7158a1273J3456M975m063p9J0342l125k8858L397J9947j722m737j8461k1988J1869
7144c0320R841K228R43P447K5473j951j0246j2251J333L377J912m543j608p104
7130a5469n333K598K58o805o954Q369J1216J2690j139k565J84j2680J2167n508
7116h971R080Q529p240k42R760j0584j5225M91J4042L612j1006j3400K287J1891
7102f976J370j0333n901k985n415J7874J1020M101j4781l896o290m490J3277N234
7088h191L105o648j9124K130J1472j709L618k561r578j483n049j160R771Q953
7074a6454K192r578n974l130J730M173N722k204R397P364J0738L336j6816p105
7060a6609O565K106R8P060r199m299M07J3260J1058J7882m524j314j5688L835
$$ y = [-11273, 2183, 7158, 3095, 3016, 13358, 10233, -18625, -15228, 4719, 2997, -1740, -20201, -42189, -30320, -20479, -18251, -17308, -9861, 15612, 13661, 3415, -8836, -7503, -4126, -2214, -6757, -8365, -15469, -20802, -18204, -17946, -24751, -31705, -23336, -12120, 570, -569, -3134, -2950, -15630, -3463, -8971, 109, 8638, 1398, 1156, 10916, 332, -14893, -14402, -360, 3252, -7754, -21154, -18867, -6976, -5606, -15939, -21840, -24825, -30240, -12366, -1346, 2755, -12026, -15922, -22212, -26702, -13425, -8191, -5086, -11734, -30858, -28728, -17256, -18965, -15347, -17908, -27486, -28969, -34018, -35178, -25407, -16454, -14262, -23840, -29814, -32944, -31214, -27041, -21319, -23523, -14126, -6762, 3976, 7312, -9504, -16609, -10044, -7938, -7840, -780, -9979, -14278, -13871, -611, 10447, 28329, 23805, 22491, 6803, 10638]
7046A0638N499j9363j1678p544N347L183j3240M401M25M37O723K0246o472j953
7032c351o585p255j940P470o05L859j731o280r716j7504Q264J3874K0263M313
7018C076l373j1662n583M328n402J6473J7425r12m251k3335k2876K1526J1848
7005b718r31K880j520R88m682r136k684J2761J1657l961q922M538j111j9669j1620
6990c4130J0256O875p389l464J6123l686mM254m439M231Q117j6449o508R07J714
6975b3592J1936P175J0492Q403j6980j2228K015J1271K599o477r771o650J776
6962b0031j091O020J0804O314N241o691N820J3135M752j2489n520P392M616o747
6948A1525j2151j592O500J501J2630m992r705q300M803Q134n256k295j0214p913
$$ y = [10638, 16137, -3226, -14904, -22448, -17101, -13918, -27158, -22757, -22332, -21895, -15172, 5074, -1398, -3351, -9936, -17191, -19131, -11661, -12266, -8407, -10138, -16418, -26134, -43638, -35374, -21500, -1237, 3076, -297, -11959, -17542, -13214, -18616, -2143, 15282, 14370, 10119, -13216, -36092, -14566, -2718, -3649, -769, -2289, -1301, -5983, -15119, -17803, -5042, 6615, 2654, -6268, -1730, -2841, -22510, -34130, -23874, -16999, -24388, -27852, -11729, -15415, -15419, -11165, -15604, -11373, -3256, -19705, -26213, -25306, -23592, -11656, -4481, 6011, 14414, -2566, -14794, -12779, -1508, 1091, -5386, -15157, -21807, -20031, -21122, -15102, -4298, 2016, 7257, 566, 6386, 19521, 24273, 11784, 6264, 13656, 18272, 11525, -626, -2218, 4282, 5783, 18413, 13421, 3716, -4584, 219, 8353, 3097, 802, -9412, -17325]
6934a7325j025K302M304l575n647O178J1643N725j516q023M099o191L081j297
6920g267K618k466J737L897j168j273K551o796m816r012q660k459J5499P407m962
6905a5170J342l143j7231m314m365J5461J9613k550p338J0419K6479M079n641
6892A7641j1027r796j0730M633j403j0283l540J3368K937q844m100O090Q769L132
6878c153p385O342J1137P370j7067m080L491Q602J127m792J0441k594r08p791
6864G40j6326l579r017J3872J2386m126m830M993l402K103p511K860L544J393
6850f900o443k944M780R497R3l83N578j4405j7088L522j202R153J5513J970L07
6835A048r979Q75j1152L318K886N411l708O48J7089M173K263k0816j3115P890
$$ y = [-17325, -18350, -16048, -11744, -15319, -20966, -14788, -3145, 2580, 1064, -6959, -2860, -9051, -5970, -7267, -4649, -7115, -5378, -1481, -2649, -3922, -1371, -8167, -12983, -21995, -30655, -33114, -17615, -10208, -15170, -13828, -16971, -34202, -38516, -42881, -27420, -7807, -10357, -17695, -7276, 19203, 23282, 17641, 6614, -3182, -13912, -9279, -10682, -20965, -24505, -11137, -8200, -17044, -21144, -15054, -6285, -3153, -10538, -4196, 6941, 14311, -2756, -6836, -3345, 5257, 6384, 1592, 12033, 9439, 8531, 740, -15586, -19165, -28182, -14310, -1924, -6050, -10880, -5887, -9289, -7186, -14697, -11837, -8293, -6900, -13343, -16287, -11507, -2010, -1917, -2300, 3278, -11127, -28215, -24693, -25895, -16742, -1229, 741, 1048, -8931, -8056, -19208, -15890, -13004, -7593, -11301, -10653, 6436, 10609, 12872, -7944, -21059, -13169]
6821a3169L875N060M95j2779O512j2891N089P319J524J8110J0876k274p449j2443
6807b145J249J559q742n192m992r522J0616Q245R987m503j3762n055K689R269
6793a0299P942J940J877M913K529q580j2595N571J3962m013j2356J238r816J350
6779a6337o52J282l723j1086r415k545R597J5437k311J4301K685K962l671O344
6765B868P729j1237j4535j670j579l267O704J2179m570O219l460J010J2832L510
6751A2733J254m724j0525l587k088j3L601N656K04P682j973j2946o914J095J4513
6736C968O282J3579K8134K3931L0467N9012P5315J16505J26328J6601j06019j40900
6724B53203j04492o1384m5201k1050j1108j077N590o742p421M913q044j1046J7502
$$ y = [-13169, -9294, -4234, -3739, -16518, -10006, -22897, -17808, -10489, -8965, 9145, 20021, 17747, 10298, -2145, -896, 663, -8079, -13271, -18263, -27785, -17169, -8924, 1063, -3440, -17202, -22257, -19568, -10299, -2357, -417, 1460, 6373, 8902, 322, -12273, -6702, 7260, 3247, -9109, -7871, -17687, -16337, -16989, -15707, -19430, -30516, -39931, -42476, -32879, -17442, -19753, -5452, -2767, 195, -3476, 2868, 10597, -640, -15175, -16845, -18424, -21691, -14987, -2808, -7378, -1159, -4619, -3609, 9223, 12733, 13987, 9263, -1262, -4849, -6937, -6950, -3349, 2307, 2511, 10193, 8220, -4726, -11640, -10545, 3968, 10250, 23829, 51963, 75894, 106361, 165373, 240688, 357193, 483521, 500122, 394103, 253203, 148711, 87327, 42126, 21076, 9968, 8891, 14481, 7739, 318, 5231, -2813, -13859, 3643]
6711C643J8595j0906m213J2322Q167p1p086k007n550k228k842L438K969m80n798
6696G953N585j5292p625P809J2453q209p238K547J7531Q94J755n190j0561j8949
6682a6537Q862J4335N031R56j2527j1119j289R042O966O810J0786J827o294J620
6668A8469m363N450j0847r091J1808P263k950j7038J971J6321J347j6415j1146
6655i221O919M954L55p622j3669M63j708r847j538J8941J3083M493p099j8288
6641a9784n967K923n371L477P289j417Q131K875Q266l49n624k5291k184K1153
6627a1873J4040O4R09l611J1596Q966r143p848Q204n380K323n287n173L165R171
6612A0123J190j794M967j2648j6485p150K6308M19o770l686l4N89M484M198j3653
$$ y = [3643, 22238, 11332, 7119, 19441, 27608, 27537, 20451, 18444, 12894, 10666, 7824, 11262, 14231, 13751, 7953, 13538, -1754, -9379, -1570, 10883, 2674, -4564, -2017, 15514, 16408, 18163, 12973, 2412, -16537, -7675, 6660, 11691, 12647, 120, -10999, -12288, -3246, 3720, 10530, 21316, 23143, 16849, 18469, 14106, 19556, 8709, -382, 11426, 18689, 15739, -1299, 672, 16993, 18340, 1925, -9221, -2302, 2652, 3007, -4615, -18284, -17821, -19529, -29376, -30914, -11973, 1110, 5603, -1496, -19784, -25751, -22828, -28199, -24722, -17433, -18850, -10719, -7844, 422, 73, -5551, -30842, -33026, -11873, 2167, 2231, 3140, -471, 11125, 20091, 10948, 3100, 11304, 5924, 8247, 2960, -2213, 952, 10123, 11313, 9519, 14486, 1838, -14647, -21797, 4511, 4930, -1840, -5526, -5560, -4971, -487, 3711, -9942]
6597i942q342R063N198r770j2177p352J8375R203j1137J5117J149O294L499L909
6583A3087r159j4977l898J886K0349J0372q800l489J1821m566q683J941j150j1043
6569f309n810Q268O771l175j1604j7954l938K2562l687J2470r337j4254j066M229
6555b2834j617L207m342J3654n509Q57Q88J3696O242n688r365j8622p87J6858
6541a3362J1720J1764M459m529P17j3062m371k750n891q770j2084j2007Q125M712
6527c5329Q836J837n169l774J8736J6020p398N549L691K436j8490j4390M866R483
6513a3096J943o697M127l753r68j3169M146J5490J4395J1474q192p010j8968j0675
6499c0953p764P348J3697Q166J592j064K494J1455j136j492K937L414j0079K454
$$ y = [-9942, -18284, -9221, -4023, -13793, -25970, -33322, -14947, -5744, -16881, -1764, -615, 5679, 9178, 13087, 3928, -11049, -14947, -13061, 7288, 17660, 8860, 5371, 17192, 12626, 3943, 5884, 4734, -6309, -12119, -3851, 2920, -255, -11859, -29813, -33751, -11189, -14876, -2406, -11743, -25997, -27063, -22834, -24451, -21244, -25586, -11932, -17441, -16584, -15696, -2000, 4242, -1446, -10811, -29433, -30220, -13362, -1642, 10122, 14581, 10052, 10769, -2293, -6664, -9414, -15305, -24075, -36159, -48166, -40041, -35329, -26493, -24656, -29825, -33599, -14863, 1157, -6241, -692, 2999, 5435, -13055, -27445, -22579, -13096, -11153, -17850, -13723, -17476, -18444, -31613, -27467, -11977, 2418, 13892, 5700, -1310, -20278, -30953, -38717, -31369, -17672, -9506, -7914, -8978, -6484, 4971, 3835, 2343, 5280, 8694, -1385, 1069]
6485A069O913n8o584j6844L319O002m699k095K188Q215R906r840j4027O038k489
6470a2986p153R875J847N086j8341M538k339N526p709p60K222j0818l036p524
6456d1572J4309J4993J423J5806O126o436R389R486j7685n415p632j5646J4182
6443h672K09r748j2485J514m76J8850J7700K28k254o595j7158O353p341n168q047
6428c3090K181M659K663J8937l001j4635R863M880L584K48r71n37J2401j3239
6414f057r313j618L384o828j6564J804J0887K6810j220L181l133j6241P35O030
6400h143N531O930N876K189k63j9343j2008L764p354l450k482J0057J5354L97
6386b945K073N404j9743n294K687N51n605p41P016k763P857P004j5311L252N376
$$ y = [1069, 7982, 7924, 1340, -15504, -12185, -6183, -10882, -12977, -10789, -2574, 7332, -2508, -16535, -10497, -12986, -20139, -10264, -8417, -3331, -21672, -17134, -19473, -13947, -21656, -22416, -20194, -31012, -34048, -41572, -27263, -12270, -10847, 4959, 11085, 4649, 14038, 23524, 5839, 424, -7208, -22854, -8672, -8463, -18211, -30696, -29182, -29658, -10808, 6892, 7120, 4866, -1729, -18887, -12534, -19875, -25043, -33090, -30909, -26250, -23587, -4650, -7651, -22286, -12423, -7543, -3959, -3711, -4682, -5219, 7182, -6057, -15370, -16988, -13604, -20432, -36996, -35192, -24305, 2505, 1285, 4466, 1333, -14908, -14173, -8143, -2612, 4318, 10194, 12383, 12120, -7223, -19231, -15467, -22821, -26271, -28753, -18696, -3342, -2945, -872, 4532, -15211, -20505, -17818, -17267, -22872, -23613, -16597, -19360, -11503, -4499, -19810, -16558, -11182]
6371a1182P82N226k845O143K104l184j1152O168L690R429J4281p97j143k225P033
6356B2328K746j947j1300k817N21O080r76P239j6921n487Q272o051N64p472Q434
6341C213N591K218n974n56j750j1500j0222q696l95Q300J6749J2257j9454r312
6327a9531L6J3323o684Q73J0537L260m683Q07K315M229p245R223j522j2920J967
6312f015L974k884o105n31M067J0485o321j8624Q202Q840K533j733N956K604o414
6297a966j0079J607O33L79n077r416J7398j211j805L343Q259J2580n865o680j5451
6282a3351N915J7062r92j6035o738L958N789J752n70n553k813J607m689k49l532
6267a8439l09O876m270j1197K1153P304j436q851j1385J3168J0516M37J541j9314
$$ y = [-11182, -10400, -5174, -8019, -1876, 228, -2956, -14108, -7940, -4250, 5179, 19460, 18663, 17520, 15295, 22328, 25074, 23127, 11827, 9010, 9531, 15611, 14635, 21874, 4953, -534, 7738, 1687, 2251, -5221, 3213, 8804, 11022, 5048, 4492, 2742, -8758, -18980, -27676, -28071, -19771, -3022, 9235, -10219, -19531, -19495, -6172, -12856, -11983, -1446, 1814, -2869, -2062, 253, 4482, -2763, 6460, 4938, -7982, -6015, -2041, -4925, -11030, -11561, -7494, 2991, -3330, -21954, -13752, -4912, -2379, -4112, 1844, 4448, -1966, -12045, -10438, -9805, -9426, -14503, -23919, -6521, -7732, -9537, -6194, 2065, 14645, 8780, 2100, -13351, -7436, 9626, 8634, -7401, -14139, -10181, -4392, -2640, -3210, -8763, -11576, -9969, -14658, -14907, -18439, -18748, -11872, -16142, -27339, -6186, 1118, -318, -9169, -20554, -7386, 3130, 3567, 5108, -14206]
6253a4206Q658J9855o12m586m230j0699O018l255k3543o050J2214J0023J2138
6240A725j540K312j0284j5368J185K904Q252n529J1404J674J737p099K357l313
6226i583J0557J9794k121j8955j0510O056P634J833J3493r101k0492j4946o06
6213b6947N238Q961l654q193j735O512J1883m082n915M777k824k373m586K470
6199b0468J0521J5249J5484K261j4603o863p925j0421J3801k261k0032P641j093
6186a8709k300K3202m233n488m058K454q073N734r063k214R587m469n058R661
6172a3027O015j6911l152J1444J3720L188Q878m65k711p66L352L998m862k4797
6158a6096j3629L863p63K4350K195q350P726P757r805j6963k4986j0362J4691
$$ y = [-14206, -5548, 14307, 13695, 9109, 4879, -5820, 198, -3057, -26600, -32650, -20436, -10413, 1725, 185, 2497, -7787, -23155, -21970, -19066, -10814, -16343, -4939, -3265, -1528, -8627, -6270, -9583, 974, 20768, 18647, -308, -10818, -4762, 2872, 4705, 18198, 9097, -11395, -26341, -26947, -21709, -12748, -16402, -24595, -26330, -19818, -7935, -12017, -17932, -13155, -15979, -18352, -22938, -20468, -9947, 5302, 20786, 23047, 8444, 1581, -6344, -16765, -2964, -5225, -25257, -17616, -18709, -21009, 2193, -2040, -7528, -11586, -9132, -17205, -11471, -20534, -22748, -13161, -17630, -22688, -13027, -7012, -23923, -27075, -15631, -1911, 1277, 10155, 9690, 6979, 6213, 9565, 13563, 8701, -16096, -29725, -25862, -26625, -2275, -80, -8430, -704, 7053, -2752, -19715, -44701, -55063, -40372]
6145d0372J7641q35K022Q93J2735K3168p57M135q698j8423q594J6139N18j4050
6131a4478p406J038J1643J6150N3l169n815q411O429N766j3144j6412J3660J6792
6117B696j27j605M792j0386j0775q553O208p59j6207o405O960O385J5472k71j066
6102a3641O924O630K1330l65k3961o133R060L295k487o312J5356J983M798q413
6088H064k3971L409J258j421J7878j1749O155J6703R08R531P778J2278j6716k1930
6074H175j0099O806Q106R310p622q304M990N624o735j6571J7336L699P951l730
6060A8936j7511j6275L07N757j8654p214J0117J7417J1982M058q749j0060J3512
6047C623J3769j8147r577J2529Q297P910p520p693l659J891J236o572R609M120
$$ y = [-40372, -22731, -23566, -21544, -20651, -7916, 15252, 14495, 18630, 9932, -8491, -17085, -946, -428, -14478, -21884, -20846, -9203, 6947, 7000, 3831, -1984, -10395, -3966, 1800, -11344, -27756, -14096, 2696, 2569, 964, 5756, -4630, -15405, -23958, -17750, -18509, -34716, -41121, -34161, -27776, -12304, -12575, -13641, -6717, -87, 21243, 20878, -3083, -9216, -156, 3139, 652, -5660, 9696, 11679, 16477, 8064, -15907, -12498, -11240, -12661, 5217, -6532, -377, 16326, 17234, 26765, 34543, 46821, 30105, 8175, -1924, 4882, 12988, 22298, 14676, 6372, 11362, 16986, 10251, -6320, 11016, 14715, 22666, 18936, 1425, -14850, -14543, -8786, -27440, -34654, -24537, -7120, 4862, 8920, 171, -9889, 3623, 17392, -755, -10332, 2197, 10494, 18404, 10884, 3191, -468, 1423, 2659, -3913, 5696, 9816]
6033I816o531r448j3113L147K795O841Q687n223L225o784J4711J2099r227j1666
6019f71j8647Q79K232J366j36J6967N092n625j7141o886O033O751N818L709m228
6004d487q857N575J1994L808m579j1024J1j1495j9180Q251J6018j824q59l225
5990a9873J314J6116J1096J0406o108K005K190P460K782q131j1938j2634q602
5977a3917p545j361o814J0212O269j9848q013J1082N382J753p862q683R550J1592
5963a8203r25q356K758J5184j815K16N742Q898R694Q259j1604j3323o750q538
5949a8763j0933J2811K0008J2305N930j70j7240r060R699K564j0689j5851O895
5936a2494R825R705l142k5794L528P737L115n98J27M149J839J295N405m336J0367
$$ y = [9816, 3285, -6163, -19276, -16129, -13334, -6493, 2194, -3029, 196, -6588, 8123, 20222, 10995, -671, -19318, -18439, -16207, -14841, -14977, 1990, 7082, 1457, -15684, -22570, -16537, -9786, -3968, -259, -4487, -13344, -7769, 4225, 8033, 3454, -7570, -7559, -19054, -38234, -29983, -13965, -15789, -16648, -19873, -18559, -2443, 8653, 19059, 12951, 14956, 17146, 24606, 27388, 19257, 7319, -5315, -13917, -21462, -22823, -29637, -19425, -13156, -33004, -41017, -29935, -24553, -22800, -30662, -39345, -29795, -18203, -19128, -27484, -24726, -9542, -11357, -11141, -5399, 3499, 13193, 21452, 9848, -3475, -10225, -18763, -29696, -16885, 3123, 15428, 21358, 21188, 3948, -5112, 4587, 7151, -3538, -19389, -12494, -2669, 7036, 3894, -21900, -18372, -10635, -7520, -8118, -7991, -3842, -2003, -708, 4697, 361, 10728]
5921A0728L255p773J5067n925j9044r303P461N736j988j502L068P522K609o349
5907C562m466J0317J1599j7221p774K1080j8062K356K564j3357k2030r020J2004
5894b8448j388K3961Q500j0914p184J5615r505l361J737J765N919k709j1665O138
5880a1539K271M508j1667N586J258k0082q336J3264J1836J2821o89o44N111l694
5866Dk6155L558L322p474J518J1420R430l887j0219o726K454P22Q260J4843J0070
5851A1140K705l561P6j7379K158M342N284J1164j3663q156m019n563N325o617
5837a6764j0347j046J558M956n598N218j3107J1372J0538J2388N437R585N766
5824A9956k780p425J157Q418n002p535k261P304l336k536K244m654o026m353P231
$$ y = [10728, 13983, 6210, 21277, 15352, -3692, -12995, -5534, 202, -1786, -3288, -220, 7302, 9911, 3562, -904, 9413, 21012, 3791, -3983, 17097, -965, 1391, 3955, -9402, -31432, -40452, -28448, -29836, -5875, 2625, -8289, -15473, 142, -9363, -12724, -10987, -9222, -3303, -6012, -17677, -11539, -9268, -4760, -16427, -10841, -9583, -29665, -38001, -24737, -12901, -80, -769, -1413, 3698, 4, -26151, -22593, -19271, -26745, -25227, -13807, -4377, -8264, -18483, -25209, -22755, -22033, -13773, 1070, 11140, 13845, 10284, 10360, -7019, -4861, -519, 4765, 15929, 2266, -5890, -9909, -15472, -10147, -16764, -27111, -28157, -26599, -21643, -27241, -22023, -35130, -23758, -13220, -832, 4605, 14190, 19956, 17176, 9751, 10908, 19326, 14324, 6789, 4528, 11832, 8496, 5960, 8204, 3550, -2476, -6829, 402]
5809D02K049p469J917n829j1658P653P689m297L540J860n90L95r173j5806q099
5794c7416R118J5164J1313n67r34J2446n777l932J2851O059o246j457L352o369
5780G605p840j503j9910Q440J2032J452j3771J911J0158J1770q520j5994M057
5767a0113K125J950L85q992k0375P439J4637J291o502m496J0162R725J4393J4458
5753B6087l456J43k0018O21p980R44J091l289p092L667Q771q223l21J6945l985
5738C905r538m929p228N311p01l956N895J0638K368N907j734N180j824r583j291
5723a580M893N231N018q879K371O677l207j0627p660j240J790N445J2774N461
5709A6467p953r843j538J713o81j516p416M57N492K165j168R821R937j4335m162
$$ y = [402, 2451, -5018, -3101, -8930, -20588, -12935, -5246, -9543, -6003, -4143, -4733, -4338, -13511, -29317, -37416, -28298, -13134, -1821, -2388, -3322, 9124, 3347, -585, 12266, 18325, 12079, 10622, 13974, 7605, -235, -1738, -21648, -13208, -1176, 276, -13495, -11584, -1426, 10344, 1824, -14170, -10113, -7988, -6038, -5653, -14645, -35020, -27581, -12944, -11653, -18155, -22651, -12489, -2764, 11629, 26087, 22631, 22774, 2756, 3377, -4603, -3659, -2568, -5857, -12949, -9282, -511, -8734, -9055, 7890, 3905, -5633, -10562, -17790, -12479, -13180, -17136, -11241, -603, 1765, 7672, 5938, 11118, 9294, -289, -1580, 3313, 8544, 13562, 4683, 7054, 13731, 10524, -103, -7763, -9003, -7213, -1768, 11006, 16467, 8514, -1329, -2867, -1154, -1835, -3351, -10767, -10310, -4818, -2653, -3821, 6000, 15937, 1602, -2560]
5694b560r435K935Q809j5933q644l824J0929m657J45o15j244P393N58N610l03
5679a0836o95p992N268J6934k820l815P575l380j4075j1063K939P561j1845j644
5665b7888R091P91J5717J1763q014M286M91j1267O97j670o247Q404m859j4414
5651b3119P809J1376r315N275J6677M626j3552j7583j010J1627P010r270N892
5638c557J5282l864k0428q889J2927J6349L953j948M187K431j676j1161L824J2706
5624B0136j7546J904Q567j3456m798M688O971L750q921j4157q336o51R770l980
5610a6059n779J0900M264l602R107J4295j74j1358m855L298O469m426j9612N18
5596a7014Q812J945l115j7476J037J776J7423J1052r416j1402l307J826K476J0799
$$ y = [-2560, -11995, -9060, -251, -16184, -24828, -28652, -17723, -22380, -22235, -22850, -24094, -16701, -16143, -10533, -10836, -11531, -19523, -14255, 2679, -141, -3956, 3619, 239, -13836, -24899, -21960, -14399, -26244, -27888, -18797, -18006, -2289, 9474, 1460, 5746, 6237, -5030, -4333, -6003, -12250, -3846, -8705, -23119, -15310, -3934, -13249, -7974, 8703, 13329, -223, -17806, -18816, -7189, -179, -9449, -3557, 11725, 7861, -12567, -21456, -8529, 7820, 11773, 9825, 14012, 16443, 14767, 3606, 7430, 20136, 2590, 4494, 13061, -395, -5193, -505, 6466, 10216, 1295, -12862, -21198, -21849, -12079, -16059, -21838, -10938, -6674, -10276, -1169, 13126, 12952, 1594, -3261, 37, 6506, 2080, -17532, -17014, -8202, -6257, -9372, -26848, -25811, -24035, -6612, 4440, -4976, -16378, -19685, -17859, -15383, -4584]
5582d584Q96j260J1157l295O246n952k0725J3477L478l461q370j096n69Q772l845
5567i131k816J1018K616k82j36o931R539L746m645l084Q68P872J577J991k463
5552I739l434j749J3961Q179j973m048J216j0797k0745M570R23j704l335O947
5538b250K163O73j0372M744l660O542J159M618p53M382r763J088m437j8966K0429
5523d403K7172M924r009q450m523j50N836j659j3718K108P376P620j019j536j4347
5508c778m775J0259p01Q549l89N825j488K942k068L306R955j3195k4677j5895
5494b6130P330J1435R266J416L058N772L171K233Q598j7269j6107l899J5725k900
5480A699M96r952k905L765J5861M779R36q574l849q081J54m523l78J1090M346
$$ y = [-4584, -3688, -4948, 6209, 2914, 9160, 3208, -17517, -4040, -562, -4023, -12393, -13489, -14058, -5286, -9131, -11947, -929, 1687, 1405, 1269, -5662, 3877, 7623, 2978, -106, 762, 8634, 10211, 12202, 9739, 6305, 4556, 18517, 26696, 24723, 20675, 21891, 11094, -9651, -5081, -4158, -5862, -9197, -2250, -87, 586, -9786, -5042, -8702, -2160, -1001, 3617, 2864, 7246, -2517, -1429, -5866, -24832, -4403, 22769, 27693, 18684, 10234, 5711, 5561, 11397, 9738, -3980, -1872, 5504, 13124, 12105, 10569, -3778, -8553, 1706, 1005, 9554, 9165, 14990, 13502, 16444, 14376, 17682, 27637, 14442, -10235, -26130, -18800, -7365, 1901, 3317, 6375, 12147, 15318, 17551, 26149, 8880, -7227, -11126, 4599, 1699, 2195, -7757, -10662, -6897, 8964, 13743, 14679, 6105, 2256, -5825, -5671, -10194, -10572, 518, 4864]
5465D864M088l225J3135M894k065J303p248q228o236K02o702j118o319J5469J7349
5450B0163J941o856o643r241k0045L127N392K230P713J3173J924L164j2582j4569
5436a1109q268J3739J602p316r22Q496j872j0909l146O676Q077k603k320N022
5422d853k490j4801m358J4034R635J4412l747j1713P138l73q636L937q150j4539
5408b4504k903L509j972J6735o340P29n480j760J6957P333O48j10l585j0134P1
5393a0806k093l192j950k661j0J1015K881n487j189l207J0739J979l484P057P181
5378F773L188O280M626K17j0481q491q49Q06L770L745k436k503k3336m652J4418
5363h925R001l555p678P315J1788J2234k199j4351j6211o952n595J4472M041O656
$$ y = [4864, 8952, 5727, 18862, 23756, 21691, 22994, 15746, 7518, 1282, 1484, -5218, -6336, -12655, 2814, 20163, 22104, 15248, 8605, -636, -20681, -17554, -12162, -9932, -2219, 10954, 12878, 16042, 3460, -11109, -19377, -5638, -4036, -11352, -12274, -3778, -5650, -16559, -19705, -13029, -4952, -7555, -9875, -4853, -7343, -22144, -26502, -12468, -2833, 11579, 7832, -3881, 3257, 2884, -5752, -1815, -9965, -24504, -27407, -23898, -25870, -9135, -15475, -14746, -20226, -21986, -5029, 2304, 2952, 2842, -743, -10877, -10806, -12899, -16091, -18041, -20702, -20712, -9697, -6816, -12303, -13492, -16699, -5960, -3981, -7465, -408, 6773, 9961, 16241, 20867, 21084, 10603, 2112, 1263, 2069, 5839, 9584, 7148, 4645, -18691, -23343, -8925, 76, -3479, -11157, -3842, 7946, 20180, 17981, 3630, -12581, -19533, -25128, -10656, -6615, 41]
5349D1j113l047l943o47j6323p231j084R739K5413R623j9212k5794k50J3622J5208
5334d998P189r488n677N479M090l270Q315R052j18n532n087l400k824r971o78
5319a6918K096n439M303J6832O745k861n464m038p68j0257J2188R492j6451j0321
5305b0861o487n20J3642Q737J4394R182l977l339k885r02O143j7709p275p639
5291a9496j409K5259p025M105L579j197N508K331o701m995o611q652N318N254
5277d732J5222j2564o940J4444j9107M887J2553k042q470m08r21P355k599J261
5263b061l847J238J0419J6123j3758j4141J2203Q324q224j853n267k927p2M296
5249D53k357J5075o987p010J0626L07p966J760M852O155L007o368n417j3944k0904
$$ y = [41, -1072, -4119, -8062, -8709, -25032, -32263, -33347, -23608, 1805, 11428, -7784, -33578, -33828, -20206, -4998, 2191, -7297, -12974, -7495, -3405, -6675, 1640, 10692, 10574, 5042, -45, -3445, -6269, -16240, -16918, -14822, -20261, -15958, 874, 7619, 4758, -706, -4744, -5512, -15769, -3581, 5911, -10540, -20861, -27348, -27868, -14226, -5489, 8905, 18087, 14110, 10771, 7886, 6984, 13127, -4582, -11857, -19496, -20905, 4354, -2671, 1434, 5013, 3816, 9324, 11655, 4954, -41, -6652, -15304, -9986, -4732, 10490, -2074, -9014, 5430, -13677, -8790, 3763, 1721, -6749, -7157, -8078, -723, -3322, -2061, -5908, -4670, 5749, 21872, 8114, -6027, 6176, 14500, 6276, 4423, -844, -3771, -3843, 453, -1904, 13171, 6184, -826, 9800, 10107, 2141, 3901, 8753, 14908, 17915, 11547, 6130, -7814, -28718]
5234b8718K826L086J04l861j044K0551J5800O03q85K233J8369J2903o777j5913
5220A9277j4823p818J0247j0760P252Q78k272P626k230j1538j4262M179J4562
5207C18j120j0236o828M086J2702J0465J1853r828j5634M053K334K659J2874j4204
5193C494O73J2302r002j1019M955R181N855N281o097k472k859p10O132P864N104
5178B8682l956j2650K831n287m546J761r063p746j747L795O506j504P125J1161
5164A5362L164k833N928j86j7069j5641r468j367Q166K1985K766k0504j9437o667
5150c5801J0233J5590K0221J03j878J51O006j3098p559j2744J4961J0962J4366
5137B1513q01j5558n832L768l032J0012k699j0585o943j1704o99k88J455R714
$$ y = [-28718, -25892, -22806, -22702, -26563, -27607, -7056, 8744, 9347, 8462, 10695, 29064, 41967, 35190, 19277, 4454, -3364, 6883, -3877, 3375, 4253, 1981, 9607, 7377, -4161, -18423, -14244, 318, -802, -11038, -17866, -13780, -1078, 9387, 21240, 11412, -4222, -169, 2165, 4824, 17698, 3494, 4167, 16469, 7467, -3552, 1403, 10584, 16439, 21720, 15623, 13151, 10292, 9582, 15714, 23578, 28682, 24726, 12076, 14907, 9620, 5074, 6835, -2228, -9974, -11721, -7926, -1420, -2924, 4201, 15362, 18526, 15693, 21621, 21435, 4366, -11275, -20743, -22110, -13944, 8041, 10807, -9697, -29134, -35801, -25568, -9978, 10243, 10346, 8468, 8619, 14625, 1527, -6032, -18776, -3815, 7147, 21513, 20712, 5154, -678, 3090, 58, 10070, 7371, -3214, -10157, -21861, -22560, -22848, -21393, -11679]
5123a1679j3863j6231o770J4843M1986K143M473M037j0879m525p103j5631m577
5110b3776M283J0759R537K695K52j7563p053Q482n654N66K2394P865R498M002
5096B6287p530r597N31L806M737P771q767j1566k997J289N292O006M320O77n817
5081A4442l427j958P436p414j532n870r925L707R392j5805J2529J974J2964O34
5067A7147l524k172l350J3364J3040k4232j9156l206J4469Q283R424k0131r318
5054i362j1468o742Q944J1396O253o107o928p416p996K4674M384j8304O402L21
5040a1949q876o9J2114J8698J2329n922j6525j5949o022L050Q259J926M346Q224
5026C634m949m856N405J1488M351q341k802J0925j0227o805j5468k85j728K546
$$ y = [-11679, -25542, -41773, -48543, -33700, 8286, 10429, 14902, 18939, 8060, 3535, -3568, -19199, -23776, -19493, -8734, 803, 3498, 3750, -13813, -20866, -12384, -18038, -17472, 4922, 12787, 22285, 26287, 18757, 9160, 9691, 13497, 18234, 26005, 17238, 5672, 2675, 3964, 9256, 15262, 19582, 20259, 14442, 11015, 9057, 16493, 9079, 7547, 1677, -8248, -4541, 4851, -10954, 1575, 3549, 16513, 17147, 13623, 11451, 8101, 21465, 34505, 10273, -8883, -12089, 2380, 10663, 20087, -44, -9362, -20830, -27572, -18628, -7232, -979, -7086, -14014, -21430, -29426, -4752, -368, -18672, -12270, -11949, -20825, -20894, -8780, 9918, 22247, 16325, -200, -16149, -22171, -19121, -10862, -8936, -4590, 3634, -1315, -6171, -766, 10722, 15073, 6732, 3930, 14855, 4628, -2177, -17645, -17930, -19658, -17112]
5012a7112J0321J3989p525j63o775p572j242O808J1712l228M737L462j3260P029
4998A181J1183k733M721j1914j8565j7234K745K4909j064j3041m941l195R194
4985a8754P336L941P978j1616l299n471l887M66p812j533J7380K1708J6725R118
4971C2280j309r411j0588k2839m721J762m420p131N303J1054Q613M4J3082r659
4957B060o809j072R563o777O467l353j024K466j256n287j5551j0656m358J2352
4943b3235J3094j848j0032P032L499N321N350L689J636o688o256N370K7197M023
4929B8152q345p283J46q081q539R39Q970Q801j048j2778K604P29J298J1143j0450
4914F258j2713p451K551l744R734P134P879J7875l808q904p09j255K356j639q083
$$ y = [-17112, -6791, 7198, -327, -490, -7265, -14837, -16079, -9271, 2441, -787, 3950, 7412, -5848, 1181, 12364, 9631, 14352, 2438, -16127, -33361, -30616, -5707, -6771, -19812, -24753, -27948, -18754, -11418, -7477, 501, -11115, -14414, -19885, -23772, -23306, -31118, -32651, -15271, 6437, 23162, 32280, 30971, 21560, 10972, -11867, -16588, -14826, -19246, -26377, -21074, -10020, -1407, -1363, 11719, 2060, -4749, -5821, 3742, -3035, 3432, 79, -945, 1521, 265, -5022, -20573, -31229, -35587, -23235, -10141, -11989, -22021, -14989, -11490, -6169, -819, 2870, 4506, -2182, -8438, -3068, 24129, 28152, 19807, 12524, 12670, 4589, -3950, -3011, 5959, 14760, 13712, 934, 3538, 4267, 5565, 16708, 6258, -6455, -13906, -11355, -15099, -5365, 1769, 9648, 27523, 23715, 14811, 14102, 12847, 15203, 13564, 5481]
4899E481O797m349p574J310q201N843Q706J1664M85j4852j6301J946K3808l00
4885A4463k0038j0854J0023M369J2100J3351j577j1339k0933m326P526N842N793
4872D400K35j385J036r34p756J5556l761j4052k188O06N818j117n658R035J315
4857A150R666j3401P896R696l900r985M920J2000K166k0927j0282J2968K1599
4844B3566P952n843p721n812r292n192q459j9333m76J4151Q852J1771j630l396
4830h62J6490m485j9220j1851j715O722O900j57k810J0115J1419J1855P36j2899
4816A0238j1113o52o12J723k403K52K816N904n327j5485J4394J2890n533j5654
4802h562o748K622N326J1108N69M057l707q087J5500N770K116M452Q029N289o748
$$ y = [5481, 12278, 7929, 355, 1665, -6536, -693, 8013, 19677, 20162, 5310, -10991, -9045, 14763, 14463, -5575, -16429, -6406, -2037, 10063, 23414, 21837, 10498, -10435, -14761, -7235, -1393, 4400, 4635, 3250, 4286, 3352, -4404, 11152, 7391, -6661, -8849, -8243, -2425, -3542, -9200, -165, 1150, 10816, -2585, 5311, 15007, 11107, 1122, 6042, 18042, 20208, -719, -11001, 1967, 23566, 31518, 25675, 17954, 12142, 2850, -2342, -10801, -30134, -30610, -16459, -7607, 4164, 2534, -862, 15628, 11143, -8077, -19928, -21643, -14921, -8021, -8178, -10988, -873, 10546, 22401, 23137, 10238, -875, -1527, -2139, -416, -2819, -2567, 249, 6153, 826, -14659, -265, 12625, 7092, -8562, -15310, -12688, -7362, 3746, 4315, 8372, 4665, -3422, 12078, 17848, 19964, 24416, 32445, 37734, 30986]
4787C0986j2184m633j1898N958J0619n014j3045p050m012J0833M618l593L775
4774E360L045j2514k118J0646m409n062j3617K596Q065j1153M046R673Q568m599
4760a473j3840j1495J2723P450n559R193L251q213R306M052j2518J502K512M080
4746I71j7650j7587O808J3787J3944Q092j309j1111K304N541q10P619j3752N950
4732B797M157l460l659J0044L365j3396j2162J0112J8756l127n187l521o431P259
4718E547J288l113p215K1m93J0304J1986n488j0991j7026p039O112O730L013M714
4703a650K05k007O216Q354p309j0984K876j293p676Q4m819j46J0636J8975L299
4688A4761k574p098q333L048K550J9003L658l361q592K519k764k778n446O307
$$ y = [30986, 18802, 14169, 2271, 8229, 18848, 13834, 789, -6261, -10273, 560, 5178, 1585, 5360, 8405, -4109, -6227, 4419, 10, -5052, -18669, -16073, -8008, -19161, -15115, -5442, 3126, -1473, -15313, -26808, -14085, -6635, -12194, -3001, 250, -7963, 1343, 5395, -7123, -5621, -3109, 971, -16679, -34266, -27458, -13671, 273, 8365, 7056, -4055, -1751, 3790, 2980, 10599, -3153, 2797, 6954, 3494, -165, 9879, 13244, -152, -12314, -2202, 16554, 13427, 8240, 4719, -1712, 5547, 6835, 3722, -3493, -3472, -3965, 6339, 18325, 12837, 1846, -15180, -22219, -16107, -9377, -6364, -1650, -1445, -3452, 2764, 11118, 3809, -7175, -4299, -5592, -13268, -13184, -18003, -18149, -7513, 11462, 14761, 12187, 5089, -3244, -196, 2354, 21357, 25015, 21654, 13062, 15581, 12817, 10039, 4593, 10900]
4674A0900Q654j0821k821j6999L563J3912K226l881P03p422o586j0700O1K1261
4660B050J1599Q5q272j0170m366R203N135o960o653O372m435o662J0741J4098
4646A1765L940j0538r581l170M136J626J47M252K502m044q091j502l439n632N733
4631a1896k878P35M921Q75j5036J8666O596o251R010K1602J1968j0957o220o147
4617A4988k2291o375O327Q246Q59j0144o159R097j211j347J1700M917K949m667
4603F889Q18m784j6854n156J1338J2018n263n365p82K5615k386j1353j1071M949
4589a387J2359N46j0640o796j9946r438j074J154P906j4129Q074J0445J8081J0163
4575E318Q148J4953N938j4820L123k640k03N235j0622K483J904k908l691L07j2077
$$ y = [10900, 19554, 8733, 5912, -11087, -7524, 6388, 8614, 4733, 5436, -1986, -8572, -19272, -19211, 2050, 13649, 13734, 5462, -4708, -9074, 129, 5264, -1696, -8349, -1977, -6412, -13074, -2333, 11765, 15705, 5167, -4414, -7584, -3448, -1822, -1675, 2577, 5079, 1035, -7056, -8558, -11997, -17629, -11896, -14774, -14039, -9118, -8243, -23279, -4613, 1983, -4268, 4742, 26344, 38312, 27355, 21135, 14988, -7303, -13678, -7351, 895, 1754, -8390, -14549, -5452, -6663, -8010, 3690, 8607, 11556, 6889, 7707, 2923, -13931, -19087, -7749, 4269, -994, -6359, -7141, 18474, 16088, 4735, -6336, -1387, 10972, 11518, 878, -5918, -25864, -35302, -36376, -35222, -27316, -41445, -33371, -22926, -4845, 5318, 13466, 28419, 34357, 19537, 22660, 20020, 19817, 25052, 14430, 16913, 18817, 15909, 12218, 12525, 448]
4560D48k721P537K758p77o277Q424j752Q153k507m245q060n128j8170R862P220
4545e235q430K02J0852J8628M533l181r303j7284q289J1353o170K4043N940n412
4531A2247j910j730P112R670j599k717j6467j561N834K498l112j0125q288N861
4517d287J5937R101j1614k0211J1727r82p66Q572L572J131L211N559K43p967j5274
4502b048q398n874M977N850n487o23J9819L862j7391k65j1311L753O217K2593
4488A5674R894j0811k2483o702J1811J7575M424N120k066n101r782j1745J376
4475b816K195J9931J8791j6839j1672j7518P329j1581J29q101J3442K0437Q869
4462B2596m521o481q285l23n40l832p998O947j262M704N44l920n551P701Q648
$$ y = [448, -2273, 5264, 8022, 7245, 968, 9392, 7640, 15793, 13286, 9041, 981, -4147, -22317, -12455, -5235, -13665, -13463, -2611, 16017, 20550, 17369, 8066, -9218, -17507, -6154, -12324, 11719, 17659, 12247, 10337, 8607, 15719, 25389, 23790, 21073, 4606, 3045, 8879, 11377, 8265, -1860, -10148, -4287, 11650, 20751, 9137, -11074, 653, -329, -1095, 7477, 11049, 12180, 15391, 20950, 21193, 13226, -2048, -10446, -16320, -11343, -5493, -10980, -11603, 8216, 12078, -5313, -5578, -16889, -13136, -6919, 15674, 25568, 14757, -7726, -14428, -2617, 14958, 19382, 24502, 22436, 17335, 7553, -4192, -2816, -621, 19310, 38101, 21262, 9590, -7928, -599, -12180, -12051, -20152, -6710, 13727, 22596, 18075, 11594, 3309, 2986, 2446, -1386, -9384, -2437, -3699, 1005, 1549, -2371, -7922, -221, 8427]
4447H427J5233k006j7635j2619k394J8144o693j0676O883R330m642J1792l68R370
4433B2146j7680k2533Q583J6518j1924L245J8543J1992l290j2378o602j124j063
4420D433O91q6j001o865J001r409j1768q05J3294o63J575K1760n28n622j9173
4405a3166q919J2376L442q622o657n300K962j899J3156Q702j73M321J077j7785
4391a6485k0737K972J5248J3089o57j2634K775M954L321L260n132R589M045m792
4377a184L050Q987R443L947j0054j8068n736Q354k045k5j1228J004O279O622K826
4362B172O186l99j020J30l068m985l35R613q120k0531r19P685N778p700q295N449
4346a8359R872J2422j4456j1639m702K1704M96m95o150K236K632o085O800L900
$$ y = [8427, 23660, 21654, 4019, -8600, -10994, 7150, 457, -10219, -3336, 5994, 1352, 13144, 12776, 22146, 4466, -18067, -9484, 7034, -4890, -1645, 16898, 28890, 25600, 13222, 6620, 5496, 4433, 5124, 5038, 4037, -2828, -1827, -11236, -23004, -23809, -10515, -11178, -9603, 12157, 11629, 6007, -13166, -22085, -9709, -6267, -14889, -21546, -26846, -23884, -25783, -12627, -3925, -4098, 223, 1300, -16485, -37222, -34250, -19002, -5913, -6570, -19204, -16429, -11475, -8154, -4894, -10026, -437, 3608, -1184, 1866, 10853, 20296, 24243, 14189, -3879, -9615, -1261, -3306, -3331, -14559, -13555, -7276, -654, 2172, 8358, 7959, 6939, 7069, 4001, -984, -1319, 8294, 174, -20357, -21276, -13591, -7813, -15513, -23808, -18359, -8487, 3935, -10521, -22160, -26862, -5158, -4662, -5157, -11307, -9071, -6439, -12524, -5724, -1824]
4332a824k329L80l984P82P315O624J4544R744J530P407j5319j9758k373o693k069
4317f023L237L976n346p292J3427Q892j7348r735N863P303m73Q347k246j905K031
4302B708j552j6537j7435L006J0649J3875K5357P920p349q363m491L740k971j5964
4288g407m985j770o925j640M980R755n708K445N066J2074J6592K541j5858n868
4274C292k730o986J1939Q432M877P125j5908k566r457l743L063p366O101M620
4260F93M176m655m425J339J3652K219Q23l982l839o625p056m64l317l678N347
4245i792j584j0125J3805N545P589M481J4002j544j1537k856o292r013J0534J375
4231D588J6442j1826K074j16l552n201q061p016n606n27N492J7262L167k6024
$$ y = [-1824, -4153, -3773, -7757, -6975, 340, 6964, 21508, 31252, 32782, 40189, 24870, 5112, 2739, -3954, -6023, -2786, 1190, -4156, -11448, 1979, 10871, -6477, -16212, -10349, -3046, -3519, 4828, 2582, 677, 2708, 1156, -15381, -32816, -29810, -19161, -5286, 20071, 27991, 20642, 12279, 7788, 11528, 8557, -7407, -12392, -14162, -21087, -22727, -17747, -7992, -13700, -11255, -6189, 5885, 22477, 25018, 9160, 3292, 562, -6424, 5515, 13947, 18824, 25949, 10041, 7475, -1982, -5725, -2662, -10028, -3927, 693, 4869, 214, -4211, -2872, 10780, 12999, 13822, 9840, 6001, -624, -7680, -8144, -11461, -15139, -9792, -11376, -21501, -7696, -2151, 5438, 9919, 23921, 22377, 10840, 7984, 1692, -7321, 3213, 4588, 21030, 9204, 11278, 11162, 7610, 2409, -5652, -12668, -18274, -18801, -13309, 3953, 7120, -18904]
4217a8904j7262J7160P963j1959K790K1530J1994q924j2264m319L424O145m881
$$ y = [-18904, -36166, -19006, -11043, -23002, -20212, 1318, 13312, 4388, -7876, -12195, -8771, -2626, -7507]
$$ [...]
##END NTUPLES=NMR SPECTRUM
##END=
