##TITLE=Analysis number 329296
Compound Code cc 68203
Book Reference 546/16
Project Code adrs
Chemist Name craigr
##JCAMPDX= 6.0         $$ Bruker NMR JCAMP-DX V2.0
##DATA TYPE= NMR SPECTRUM
##DATA CLASS= NTUPLES
##ORIGIN= Bruker BioSpin GmbH
##OWNER= nmr
$$ XWIN-NMR		Version 3.5
$$ Fri Aug 17 10:01:34 2007 GMT Daylight Time (UT+1h)  MAYBRIDGE\nmr@NMR_250MHZ
##.OBSERVE FREQUENCY= 250.131544655141
##.OBSERVE NUCLEUS= ^1H
##.ACQUISITION MODE= SIMULTANEOUS (DQD)
##.ACQUISITION SCHEME= undefined
##.AVERAGES= 16
##.DIGITISER RES= 18
##SPECTROMETER/DATA SYSTEM= dpx250
##.PULSE SEQUENCE= zg30
##.SOLVENT NAME= CDCl3
##.SHIFT REFERENCE= (INTERNAL, CDCl3, 0, 16.522)
##AUDIT TRAIL= $$ (NUMBER, WHEN, WHO, WHERE, WHAT)
$$ ##TITLE= Audit trail, XWIN-NMR		Version 3.5
$$ ##JCAMPDX= 5.01
$$ ##ORIGIN= Bruker BioSpin GmbH
$$ ##OWNER= nmr
$$ C:\u/data/dgb/nmr/ADRS/800/pdata/1/auditp.txt
$$ ##AUDIT TRAIL=  $$ (NUMBER, WHEN, WHO, WHERE, WHAT)
(   1,<2007-08-17 10:00:16.11 +100>,<MAYBRIDGE\nmr>,<NMR_250MHZ>,
      <created by zg, POWCHK disabled, PULCHK disabled
       configuration hash MD5:
       76 6E 9A 78 1E 09 19 81 EC 84 63 8F B0 6A 59 2D
       data hash MD5: 64K
       66 F1 52 09 7E C0 C3 FC E7 89 78 6F CE C0 50 ED>)
(   2,<2007-08-17 10:00:46.34 +100>,<MAYBRIDGE\nmr>,<NMR_250MHZ>,
      <Start of raw data processing
       ef LB = 0.3 FT_mod = 6 PKNL = 1 SI = 32K 
       data hash MD5: 32K
       28 0D BA AE F0 34 18 27 FA BF E2 82 67 FB 4B 3B>)
(   3,<2007-08-17 10:00:51.65 +100>,<MAYBRIDGE\nmr>,<NMR_250MHZ>,
      <apk 
       data hash MD5: 32K
       4D 3F B6 69 E7 8A D3 A5 66 00 CF D3 84 BE 94 19>)
(   4,<2007-08-17 10:00:56.59 +100>,<MAYBRIDGE\nmr>,<NMR_250MHZ>,
      <abs ABSG = 5 
       data hash MD5: 32K
       1E 46 0D 97 73 02 3F 56 ED 53 E3 41 A6 51 3A F9>)
$$ ##END=
$$ 
$$ hash MD5
$$ EC 95 96 17 45 E6 B1 83 8C 99 0A C6 E3 F5 A9 CD
##$RELAX= 
##$RELAX= 
##$RELAX= 
##$RELAX= 
##$RELAX= 
##$RELAX= 
##$RELAX= 
$$ Bruker specific parameters
$$ --------------------------
##$DU= <C:\u>
##$EXPNO= 800
##$NAME= <ADRS>
##$PROCNO= 1
##$TYPE= <nmr>
##$USER= <dgb>
##$AMP= (0..31)
100 100 100 100 100 100 100 100 100 100 100 100 100 100 100 100 100 100 
100 100 100 100 100 100 100 100 100 100 100 100 100 100 
##$AQSEQ= 0
##$AQ_mod= 3
##$AUNM= <au_zg>
##$AUTOPOS= <8 >
##$BF1= 250.13
##$BF2= 250.13
##$BF3= 250.13
##$BF4= 250.13
##$BF5= 500.13
##$BF6= 500.13
##$BF7= 500.13
##$BF8= 500.13
##$BYTORDA= 1
##$CFDGTYP= 0
##$CFRGTYP= 5
##$CHEMSTR= <none>
##$CNST= (0..31)
1 1 145 1 1 1 1 1 1 1 1 1 1 1 1 1 1 1 1 1 1 1 1 1 1 1 1 1 1 1 1 1 
##$CPDPRG= <>
##$CPDPRG1= <>
##$CPDPRG2= <>
##$CPDPRG3= <>
##$CPDPRG4= <mlev>
##$CPDPRG5= <mlev>
##$CPDPRG6= <mlev>
##$CPDPRG7= <mlev>
##$CPDPRG8= <mlev>
##$CPDPRGB= <>
##$CPDPRGT= <>
##$D= (0..31)
0 1 0 0 0 0 0 0 0 0.06 0 0 0 0 0 0 0.0002 0 0 0 0 0 0 0 0 0 0 0 0 0 0 
0 
##$DATE= 1187341213
##$DBL= (0..7)
120 120 120 120 120 120 120 120 
##$DBP= (0..7)
150 150 150 150 150 150 150 150 
##$DBP07= 0
##$DBPNAM0= <>
##$DBPNAM1= <>
$$ [...]
##$SUBNAM7= <"">
##$SUBNAM8= <"">
##$SUBNAM9= <"">
##$SW= 20.6930455092707
##$SWIBOX= (0..15)
0 0 3 0 0 0 0 0 0 0 0 0 0 0 0 0 
##$SW_h= 5175.983436853
##$TD= 65536
##$TD0= 1
##$TE= 296.16
##$TE2= 300
##$TE3= 300
##$TEG= 300
##$TL= (0..7)
0 120 120 120 120 120 120 120 
##$TP= (0..7)
150 150 150 150 150 150 150 150 
##$TP07= 0
##$TPNAME0= <>
##$TPNAME1= <>
##$TPNAME2= <>
##$TPNAME3= <>
##$TPNAME4= <>
##$TPNAME5= <>
##$TPNAME6= <>
##$TPNAME7= <>
##$TPOAL= (0..7)
0.5 0.5 0.5 0.5 0.5 0.5 0.5 0.5 
##$TPOFFS= (0..7)
0 0 0 0 0 0 0 0 
##$TUNHIN= 0
##$TUNHOUT= 0
##$TUNXOUT= 0
##$USERA1= <user>
##$USERA2= <user>
##$USERA3= <user>
##$USERA4= <user>
##$USERA5= <user>
##$V9= 5
##$VALIST= <valist>
##$VCLIST= <CCCCCCCCCCCCCCC>
##$VD= 0
##$VDLIST= <DDDDDDDDDDDDDDD>
##$VPLIST= <PPPPPPPPPPPPPPP>
##$VTLIST= <TTTTTTTTTTTTTTT>
##$WBST= 1024
##$WBSW= 4
##$XGAIN= (0..3)
0 0 0 0 
##$XL= 0
##$YL= 0
##$YMAX_a= 307915
##$YMIN_a= -232402
##$ZGOPTNS= <>
##$ZL1= 120
##$ZL2= 120
##$ZL3= 120
##$ZL4= 120
##$ABSF1= 16.522
##$ABSF2= -4.171173
##$ABSG= 5
##$ABSL= 3
##$ALPHA= 0
##$AQORDER= 0
##$ASSFAC= 0
##$ASSFACI= 0
##$ASSFACX= 0
##$ASSWID= 0
##$AUNMP= <proc_1d>
##$AZFE= 0.1
##$AZFW= 0.1
##$BCFW= 0
##$BC_mod= 0
##$BYTORDP= 0
##$COROFFS= 0
##$CY= 12.5
##$DATMOD= 1
##$DC= 0
##$DFILT= <>
##$DTYPP= 0
##$F1P= 14.0000005364418
##$F2P= -0.99999901652339
##$FCOR= 0.5
##$FTSIZE= 32768
##$FT_mod= 6
##$GAMMA= 0
##$GB= 0
##$INTBC= 1
##$INTSCL= 1
##$ISEN= 128
##$LB= 0.3
##$LEV0= 0
##$LPBIN= 0
##$MAXI= 10000
##$MC2= 0
##$MEAN= 0
##$ME_mod= 0
##$MI= 0
##$NCOEF= 0
##$NC_proc= -3
##$NLEV= 6
##$NOISF1= 0
##$NOISF2= 0
##$NSP= 0
##$NTH_PI= 0
##$NZP= 0
##$OFFSET= 16.522
##$PC= 1
##$PHC0= -37.49632
##$PHC1= 5.666736
##$PH_mod= 1
##$PKNL= yes
##$PPARMOD= 0
##$PSCAL= 4
##$PSIGN= 0
##$REVERSE= no
##$SF= 250.13
##$SI= 32768
##$SIGF1= 0
##$SIGF2= 0
##$SINO= 400
##$SIOLD= 32768
##$SREGLST= <1H.CDCl3>
##$SSB= 0
##$STSI= 32768
##$STSR= 0
##$SW_p= 5175.98343685301
##$SYMM= 0
##$S_DEV= 0
##$TDeff= 65536
##$TDoff= 0
##$TI= <Analysis number 999999
Compound Code 99
Book Reference 9
Project Code 9>
##$TILT= no
##$TM1= 0
##$TM2= 0
##$TOPLEV= 0
##$USERP1= <user>
##$USERP2= <user>
##$USERP3= <user>
##$USERP4= <user>
##$USERP5= <user>
##$WDW= 1
##$XDIM= 32768
##$YMAX_p= 294274728
##$YMIN_p= -154933
$$ End of Bruker specific parameters
$$ ---------------------------------
##NTUPLES= NMR SPECTRUM
##VAR_NAME=  FREQUENCY,     SPECTRUM/REAL,   SPECTRUM/IMAG
##SYMBOL=    X,             R,               I
##VAR_TYPE=  INDEPENDENT,   DEPENDENT,       DEPENDENT
##VAR_FORM=  AFFN,          ASDF,            ASDF
##VAR_DIM=   32768,         32768,           32768
##UNITS=     HZ,            ARBITRARY UNITS, ARBITRARY UNITS
##FACTOR=    0.157963299565203, 1,           1
##FIRST=     4132.6476996994, 0,             0
##LAST=      -1043.33573715361, 0,           0
##MIN=       -1043.33573715361, -154933,     0
##MAX=       4132.6476996994, 294274728,     0
$$ Real data points
##PAGE= N=1
##DATA TABLE= (X++(R..R)), XYDATA
$$ [...]
16151a9214k8298j9998J5265r028J258L818L4369K8540p483l4533m953j1154K2766
16138b8645N3640L0396k3749k4570m879M9931m890r680l483J7350l3988L419J6832
16125C7684K4879P082l4215l4115l2750k3880K2220M3446J0764n3629k6691K8714
16113c0491L8199L424k0737l0369j2296J6438k733M166J0236O8245J3009n7600
16101e09m4940J6662K3032k3911l6471l4176L786L6129K0576M7103J9171K0705
16089D7157j3657j292R995n3725l7041q021l8294m1922L6846L5108L796l2193
16077i3243J9631L7445K3123m123M626l5045j2513k5986k4987m711K9018J8221
16065f8544K4390L3941k0294L9859N7470J0865k4476m5867p28j5364l6051k7190
$$ y = [-19214, -47512, -67510, -52245, -61273, -60015, -56197, -21828, 6712, -771, -35304, -40257, -51411, -28645, 24995, 55391, 31642, 7072, 2193, 52124, 47234, 37554, 34071, 51421, 17433, 20852, 37684, 62563, 69645, 35430, 1315, -31435, -55315, -33095, 10351, 21115, -32514, -59205, -30491, 7708, 11132, -9605, -39974, -52270, -35832, -38565, -34399, -24163, 44082, 57091, -509, -45449, -28787, -5755, -29666, -66137, -100313, -96527, -60398, -39822, 7281, 26452, 47157, 33500, 32208, 42203, -11522, -48563, -56584, -94878, -136800, -99954, -64846, -61050, -93243, -73612, -36167, -13044, -17167, -12541, -47586, -60099, -86085, -111072, -115783, -86765, -68544, -44154, -10213, -30507, 9352, 66822, 77687, 53211, 7344, 6616, -8748, -44799, -71989]
16053g1989K5611K4162Q975J6375J4447k0773J388q401l4663J0203k4000L7996
16041b0669r601r107p096j8126R295L7754J2012J7728O756K715k9526r28r371
16028a8164J228L7502J7163j0657j6388K2218K8184l9279l3527j1114J4951N5777
16016D7894K4038m1474L6261j5521k8089n608j3628k197K8019K0641J6922Q288
16004G5546J2221l9574n1900n2020m81L2216K3925k213k1745k2607J0627N1862
15992A5857M918m524j7786l1215J4260L1369J6274O77j2816j8818j5457q545J5813
15979i993j4483j4192k0797K9419J8239n720K175L2917j8699m659k7927K2398
15967a1322K1084J96l5798k2274j5577k4115m427J8026L448P010Q708p299J0347
$$ y = [-71989, -46378, -22216, -13241, 3134, 17581, -3192, -1804, -10205, -44868, -34665, -58665, -20669, -30270, -39377, -46473, -64599, -55304, -17550, -5538, 12190, 18946, 21661, -7865, -8793, -18164, -16936, 20566, 37729, 27072, 10684, 32902, 61086, 21807, -11720, -22834, -7883, 47894, 71932, 30458, 66719, 51198, 23109, 17501, 3873, 1676, 29695, 50336, 67258, 75546, 87767, 48193, -3707, -55727, -56208, -23992, -67, -2280, -24025, -46632, -36005, 15857, 20775, 16251, -1535, -32750, -18490, 12879, 29153, 29830, 17014, -1804, -17261, -25806, -9993, -24476, -38668, -59465, -30046, -11807, -17527, -15352, 17565, -1134, -5793, -33720, -11322, 9762, 9958, -25840, -48114, -63691, -87806, -92233, -74207, -70759, -63749, -55041, -62340, -51993]
15954e1993K2223K5634j0080o4887j1495L974j1444J5518N5599r09M477O582K5894
15941I093K5743M4283l2590l9213J0270j5769J384P791K691k3046k1321M8165
15929A7481J7289k594k7905k8277n800J5314p185j979j3023N584K4755M5597K8944
15916F8201k2787R282j4668l586j3661n652n4171k6656O8333J0747j9971K3093
15904A8504M796m9804l3510J0889J515j9645J9403J1446R558P904J4579J0438
15892F073K5898o749m4238o630K5900K8365q116J6542j1640l6358K7700O1732
15880G8479k3387m0459m633j4186L8000J7043k7861j6659K1070k8061k2579J3128
15868a0105K2597j8613m2096j958K1068q947k8075L3255K9501J4259o90K7093
$$ y = [-51993, -29770, -4136, -14216, -79103, -90598, -86624, -98068, -82550, -26951, -27860, -23383, -16801, 9093, 34836, 79119, 46529, 7316, 17586, 1817, 3201, 10992, 13683, -9363, -30684, 17481, 34770, 32176, 4271, -24006, -29806, -14492, -21677, -23656, -36679, -31095, -6340, 39257, 68201, 45414, 54696, 40028, 36442, 22781, 17129, -37042, -63698, 4635, 15382, -4589, 18504, 23300, -26504, -60014, -49125, -47610, -67255, -47852, -36406, -26848, -18944, -4365, 6073, 31971, 25222, -19016, -25646, 254, 28619, 20503, 37045, 25405, -10953, 16747, 78479, 55092, 14633, 10000, -4186, 33814, 50857, 22996, 6337, 27407, -654, -23233, -10105, 12492, -6121, -48217, -50175, -29107, -38054, -66129, -32874, -3373, 10886, 10196, 37289]
15856C7289J2555o1650j6294N6103j9615l3648k0085O533M2697K1080j7877l3107
15844b6019J1072M0041L737l0950K7980K8236j0113P161J4398k1844j8547J3298
15832C8450j4721n2197j7959k1433M0210M5029J9204p319O048k2964M434J469
15820A8251l0972l0921J8386l0871K0747K6427J8642L0287L936j0634j2490k2925
15808b137l3k2353k0127n182k0967L0936L1331J3948j6488q165o24l672j4577
15795c8110J1801N4286m13O294m242J809p3657k4919O0059J3202k3943j5137j1408
15782d4378K816L6289m388N048K7169Q829k3455k2577j2690j1527J9507N700j4776
15769b8433K15p273J9479j1228M407K8688j8225J8913N8599k215k9910r397J5924
$$ y = [37289, 49844, -11806, -28100, 28003, 8388, -25260, -45345, -38812, 3885, 24965, 7088, -26019, -14947, 25094, 28831, -2119, 25861, 54097, 43984, 51145, 65543, 43699, 25152, 38450, 23729, -28468, -46427, -67860, -27650, 17379, 36583, 29264, 35312, 12348, 16782, 18251, -12721, -43642, -25256, -56127, -35380, -8953, 9689, 39976, 43912, 33278, 20788, -2137, -2170, -24523, -44650, -49832, -70799, -39863, -8532, 5416, -11072, -19237, -19861, -23533, -38110, -26309, 27977, 27564, 33858, 29616, 31425, -42232, -67151, -7092, 6110, -17833, -32970, -44378, -41562, -5273, -9661, -4613, 22556, 31385, 7930, -14647, -27337, -38864, -19357, -13657, -28433, -28218, -35491, -16012, -27240, -22833, 5855, -12370, 6543, 65142, 62927, 33017, 23620, 39544]
15756C9544J7358l3336m6455M502J9979J063l5849j5550J5787J7972J5609p007
15744f383J1347J0137L6863M4831j3341m1905j2497j1607j6490M6194P272n0036
15732D385j4418K5239L7934k2112j5993M2452J3218r74m5996o8840k794L2791
15720a5108K2528J2155J0283l0719l9633r713K6293K4985J7123P5052J5980j2836
15708I6390K8689j325J9454K3579l6072n190O9053K3108L548P059J5338L3774
15696B77405j4979l8778Q582l8070n1748l6295J402l4321o034n2668l7989r308
15684c2801o873k7882J2390K0232M4083j0535j4611N3071J4205p909k1714k61
15672B1395k0149k5400l2346J0648j5231k4030R456l450j571l7290J3792L1075
$$ y = [39544, 56902, 23566, -22889, -18387, 1592, 2655, -33194, -48744, -32957, -14985, 624, -6383, 4964, 15101, 51964, 96795, 83454, 41549, 29052, 17445, 955, 47149, 54421, 4385, -10033, 15206, 53140, 31028, 15035, 57487, 70705, 69731, 23735, -45105, -47899, -15108, 7420, 19575, 29858, -861, -40494, -50207, -23914, 1071, 18194, 93246, 109226, 96390, 125079, 123754, 143208, 166787, 130715, 125525, 194578, 217686, 221234, 228293, 243631, 277405, 262426, 223648, 232230, 194160, 142412, 106117, 107519, 73198, 67164, 14496, -23493, -32801, -39674, -67556, -55166, -34934, 9149, -1386, -15997, 37074, 51279, 43370, 21656, 21395, 1246, -24154, -56500, -45852, -61083, -85113, -75657, -79107, -80678, -117968, -104176, -73101]
15660g3101L5534m1794l6115K3409j2348L944m687L0301j3327J4201J7846N302
15648e0835j7944M2715K5164K9760j7146j1516j6730J1243P855l2058J8995J6130
15636E633k1914J199l0161K3432M0769K3990k4272o7446l4513j3135K0617K0202
15624e5599m416l2329L7002J9977J4321J5546j761m1494k4848M7868M0108R195
15612B3570j0299l1958j0155j322M554J6079j4656K3568J7235L7546j2164m1015
15600I83l3459K6773J3469m935L881j6975q420l4868k4670j1810J4657J4006j1185
15587g2553j0106L5558M1189K0573k4958l0987J0574M5875R050p300j5791P929
15575I053P487M750p166K5209j7201l3994K7175Q557p519k3524o0530n5530K0099
$$ y = [-73101, -37567, -79361, -115476, -92067, -104415, -100471, -105158, -74857, -88184, -73983, -56137, -50835, -68779, -26064, -900, 28860, 11714, 198, -16532, -5289, 2566, -29492, -10497, 5633, -16281, -15082, -45243, -21811, 18958, 42948, 18676, -48770, -83283, -96418, -75801, -55599, -60015, -92344, -55342, -35365, -21044, -5498, -7259, -48753, -73601, -25733, 14375, 23570, 13271, -18687, -28842, -30164, -25610, -9531, -24187, -619, 16616, 54162, 41998, 983, -32476, -5703, 7766, 2831, 6712, -10263, -18683, -53551, -78221, -90031, -75374, -61368, -72553, -82659, -47101, -5912, 14661, -10297, -41284, -30710, 15165, 24215, 16915, 1124, 9053, 16540, 21290, 14124, 39333, 22132, -11862, 15313, 23870, 16351, -7173, -67703, -123233, -103134]
15562a03134J0798P643J9679j183K5592K7623J2723J823r379K050L6943K0019
15550E1197j2628J2711l6670L1156J6538N665k121M208j5704l1669j5249O1452
15538F8886j6545o8074R32n7100q835J6965O8634J6457l5453j8315K8135k2960
15526b7273l0768M511P877R072J1956K4045P195J7588M7902l4089o0662k1213
15514d3859L0190O486K5622j485k9123k6512l1021k7103P255L6085M841J1112
15502c7512M652J746L0389j7963J6240m5736Q884N6649j1R904L5885O757p250
15489F2634j8335j6363m1862j5053M796m1750r913M3007M2925L0798j561K6487
15477F5810j4571K8180p720l3482l8482l2550N803K1436N633L2589o73k4306L261
$$ y = [-103134, -92336, -84693, -65014, -66197, -40605, -12982, -259, 1564, -7815, -5765, 31178, 51197, 38569, 51280, 14610, 45766, 62304, 67969, 65848, 70056, 54352, 22683, 7434, 68886, 52341, -15733, -14801, -71901, -80736, -63771, 4863, 21320, -14133, -32448, -4313, -27273, -58041, -53530, -45653, -36581, -24625, -580, 6615, 24203, 72105, 38016, -22646, -43859, -13669, -7183, 18439, 16954, -12169, -38681, -69702, -96805, -89550, -53465, -48624, -37512, -32860, -31114, -725, -18688, -2448, -48184, -39300, 17349, 17338, 27242, 63127, 69884, 62634, 44299, 27936, -13926, -28979, -24183, -65933, -75846, -32839, 10086, 40884, 39323, 65810, 51239, 79419, 71699, 38217, -265, -32815, -27012, -5576, 57, 32646, 31973, 7667, 10928]
15464A0928J9708l2546k5329m88K5357k0248j1930K5698n600n9645J9331n197
15452e9961l6494O5160K508l8o688J5038J0466j3184J1231j8193k9113L1290L5091
15439G113J631N15k2081K1812K9549j3629n4733q276j122L6012l4654k0092j5729
15426g3684K7810j1971K1985L2405q361k763m0766J9935K3968j3644k0862K4012
15414b1936J3806J9783l920P166J2427K1115L3557k437k5318j8332k3942p292
15402D677j7089Q236m1362m6749J201M6955q223j5565j114L517j4517L0318J2024
15389c7691l491N481n215K3754J0083k4817J0335m862K3393P964K125J0247r080
15376H226j4860n4781k5370J2311K3541J5301k6459J2138M4401K583J6789j585
$$ y = [10928, 30636, -1910, -27239, -27727, -2370, -22618, -34548, -8850, -14450, -74095, -54764, -59961, -96455, -31295, -28787, -28825, -35513, -20475, -10009, -23193, -11962, -30155, -59268, -27978, 7113, 8744, 9259, -12822, 8990, 38539, 24910, -29823, -38099, -39221, -3209, -37863, -57955, -73684, -45874, -57845, -35860, -3455, -11816, -14579, -55345, -35410, -11442, -25086, -45948, -21936, -8130, 11653, 7733, 14899, 27326, 48441, 81998, 79561, 54243, 35911, 11969, 4677, -12412, -4176, -45538, -92287, -91086, -44131, -52354, -67919, -69033, -65516, -80033, -49715, -37691, -41182, -35701, -40916, -17162, -7079, -31896, -21561, -26423, -3030, 4934, 7059, 17306, 8226, -6634, -61415, -86785, -74474, -50933, -35632, -62091, -49953, -5552, -2969, 13820, 12235]
15364A2235J3470J4212p865p852m3258q802L9232k4030m7857J5895J8607K4226
15352a787K1844j9402j2934M2572K3463o4442j1024K7840L7094K5201j6227k5898
15340B6300l3860m530M0965k0176k4224J6815O116m368k5017k9868p593N936k2363
15327g5867K7729R411j3590o590L7530K3354J2705k5395j0493L9198j3051J2213
15315A7154R446q534o908p923q958m0203j1504N0747L0056k4288Q063m79k9019
15302b2350M5690N7008m3093m4414M930n7056J3132K1264k4302o7089L7479O952
15290g1849N287M3531L1985P75m0100j1502J6585K3855j1023P496j905j1429j3061
15277c1355J4263J7951k5936j283K1005Q666j8470j8838P177l3455P335N4758
$$ y = [12235, 25705, 39917, 32052, 24200, -19058, -27860, 11372, -12658, -60515, -44620, -26013, -1787, 20057, 655, -12279, 30293, 53756, -10686, -21710, 6130, 43224, 68425, 52198, 26300, -7560, -12090, 28875, 8699, -15525, 1290, 7406, 3038, -21979, -51847, -59440, -53504, -75867, -48138, -38727, -52317, -58907, -21377, 1977, 14682, -10713, -21206, 17992, 4941, 17154, 26600, 18066, 11158, 3235, -5723, -45926, -57430, -6683, 23373, -915, 7148, 6669, -22350, 23340, 80348, 37255, -7159, -2229, -59285, -46153, -24889, -49191, -116280, -78801, -71849, -66562, -23031, 8954, 9729, -30371, -41873, -25288, -1433, -12456, -4960, -6865, -18294, -31355, -17092, 859, -25077, -26360, -5355, 3311, -15159, -33997, -26820, -60275, -52940, 1818]
15265A818k7957q284N9112n818l9018k4233N606j8919J2600M0174l927n0691o307
15252f5844J3469K0188J3533k8360j9333M0722J2409K2196L225K4431q77o632
15240B9127j0481p271l6287q099R826j754j7097J639K6855J6142N213J0961L1670
15227E0444K199m9508o074J4172J6919m5409k1997K4343K7577M280k5017M11M0119
15214C2459l7518l3253j3563L0806j3001J728j63k1390K9651r722n1200l3667
15202a18833J0668O0279L6949J1015k5334l0548l2162l718N7426M5081J7621j548
15190B6896K071j5872J7029k0859k3317L1656K388l5850L7479J9252N1489k9408
15178F2954o5211k3933K934o02L9903J9069K2572k1252k7263K038K6342M7243
$$ y = [1818, -26139, -34423, 24689, 18871, -20147, -44380, -38774, -57693, -45093, -4919, -8846, -59537, -65844, -52375, -32187, -18654, -47014, -66347, -25625, -13216, 8980, 12205, 36636, 35759, 29127, 18646, 11375, -24912, -33011, -23185, -24939, -42036, -40397, -13542, 2600, 7813, 18774, 50444, 52643, 3135, -2939, 11233, 28152, -17257, -39254, -14911, 12666, 16946, -8071, -7660, 32459, -5059, -38312, -51875, -21069, -34070, -32342, -32505, -53895, -24244, -33966, -85166, -118833, -108165, -47886, -10937, 78, -25256, -55804, -87966, -91684, -34258, 10823, 28444, 26896, 28967, 13095, 30124, 9265, -14052, 17604, 19992, -15858, 21621, 40873, 92362, 62954, -2257, -26190, -23256, -23858, 16045, 35114, 57686, 36434, 9171, 11209, 37551, 84794]
15166H4794K387q588o2502o231J8203L7756K5297j0675m0129P873l286j3507k1174
15153A0218k5462j7965O037m500J5870J858j965K7414q079j955k1412l0368J9632
15140c0677m742n4212r83J3687K3180j9871j3308J9745K5846K8454J3473j7810
15128a7218m4591K8682P174R816Q6304q880n4062P992K4824O604R718l210k3809
15115B9344j8133K4725k4578k875l055o723M106k349O841K487k351m6773L794
15102c5540j1537j152P145r619K0896L5658j2700l9393j5041j9578K5935Q7900
15090C2974J9212m407k9444J5603k858L484L599m4634o3997k7674L3662K0299
15078d4181K0518J0903j0515j7493j563k51K8031J0716J4141P546M863J9902K3093
$$ y = [84794, 87181, 78593, 16091, 9860, 28063, 65819, 91116, 80441, 40312, 48185, 44899, 31392, 10218, -15244, -33209, -27172, -31672, -15802, -13944, -15909, 11505, 3426, 1471, -19941, -50309, -30677, -35419, -89631, -90614, -76927, -53747, -73618, -86926, -67181, -41335, -12881, 592, -17218, -61809, -33127, -25953, -16137, 70167, 61287, 7225, 15217, 40041, 46645, 56363, 53153, 29344, 11211, 35936, 11358, 8483, 5428, -1295, 2811, 462, 7303, 9790, 7439, -39334, -35540, -47077, -48229, -41084, -50703, -29807, 5851, -6849, -46242, -61283, -80861, -54926, 32974, 52186, 47779, 18335, 33938, 31080, 34564, 38163, -6471, -70468, -98142, -64480, -44181, -23663, -12760, -23275, -40768, -42331, -42582, -14551, -3835, 10306, 17852, 22715, 42617, 65710]
15065F5710Q968j2488l0992j7800r938j675M4987L746l2432l7657k9073K0513
15053b8131j5956p761J6644N405L0236L8851j5216k2543K337k309L3246J275L384
15040C9462r272n887J2791j3504k9961l9449p678L2930k43K2302K1083M768r522
15027A7820K0662n106J9206J1849j4400k8346r324k3128j4553M367M056O847m3807
15014e3857j0925L0251l80J0650P25L140m0214L404K5122q717l7785J7912P264
15001e3410O360L0279M6773q635l0398n3644P3L5857J2508N5715R354q406o633
14988C5793o324j1864l6200K264p181p6717j2138L9729K5071N5157P807k1070
14976e673n8904k1146J1653L97M881L1115L5523K9568L0583j0923n0189j8247
$$ y = [65710, 74678, 62190, 31198, 13398, 3460, 1785, 46772, 50518, 18086, -19571, -48644, -28131, -44087, -51848, -35204, -29799, 437, 39288, 24072, 1529, 3866, 1557, 34803, 36078, 39462, 30190, 24303, 37094, 23590, -6371, -45820, -53498, -20568, -20811, 1491, 22574, 27342, 17820, 38482, 33376, 52582, 64431, 50031, 21685, 12361, -10767, -25320, -20953, -16897, -10050, -53857, -64782, -34531, -34911, -24261, -23536, -20396, -60610, -57206, -32084, -40801, -78586, -60674, -53410, -47050, -16771, 30002, 21367, -9031, -62675, -62602, -26745, -14237, 41478, 50832, 42426, 35793, 29469, 17605, -18595, -16331, -23512, -100229, -112367, -72638, -47567, 7590, 15397, -5673, -64577, -85723, -74070, -73673, -68792, -37677, -2154, 27414, 57997, 47074, -3115, -21362]
14964b1362J2606K7541K0706k9244j7103k286R944Q34K0030Q255L6593j9901m8219
14951a606k0700j76k4020K3905M4498m622l2800P096j5429l1540J3964M93L4771
14938f166L0500M5795j4787m120l5417K7088l1443k2596K4896j0161J3328O838
14926B3755j7186l3608j8681K2341J491k3162K989J5410o181Q669N1767n342m4470
14913b2208J174q494M1812J8684m954m3342k06L5602J022J4078J1312K2152q909
14900E7723n5591n6061N513K0420k120J7505Q6894L3725l7565m6939l7536q849
14888b2881K1355J0399o087k8816J8857J1616m5901j783Q4307N475o0592k4008
14876c8059L1257J8007l4393l4051J7107N7175Q430j1985k6602k2315o47J7553
$$ y = [-21362, -8756, 18785, 39491, 10247, -6856, -9142, 802, 1636, 21666, 29921, 66514, 46613, -1606, -22306, -22482, -46502, -22597, 21901, 17279, -15521, -8425, -23854, -55394, -41430, -40937, -6166, 24334, 70129, 55342, 51222, 15805, 42893, 11450, -11146, 13750, 3589, 16917, 23755, 6569, -27039, -45720, -23379, -21888, -45050, -42061, -26651, -32832, -24163, 27604, 22262, -22208, -21034, -29528, 12284, 30968, 26014, -17328, -17534, 18068, 19090, 33168, 44480, 66632, 57723, 2132, -53929, -48416, -27996, -30116, -12611, 74283, 108008, 70443, 23504, -14032, -22881, -1526, 8873, 2786, -26030, -7173, 4443, -41458, -43241, 41066, 46541, -14051, -38059, -6802, 11205, -23188, -57239, -40132, 17043, 25473, 13488, -13114, -35429, -36076, -18523]
14864a8523L0023j1356J2130l8445m0965j3702K1918j759Q800M0143J4133k1867
14852a9470k0638o784P009K4295J8356K5983J6238q362k422k9744p5039L001L3892
14839c3685N0003J3515l983k7772J2820J453j380R159j0344k4808l4376o447P372
14826d8473K000J4496L4357K8230l8161P365j0344l702k7520m665l519J2043L249
14813c4644L7722r701o3176l190K8553K3114q700M4029M5752k9063j7955m6694
14801c3953J053L8772K1067J2070n4946k77O647k6279m2483J8589L3618K6326
14789B04o471m0406L9089q44k6478J939m480m3743k1806M8289K0097j2267R851
14776c7026O1674M0108J167m2000j3797j7100j204L4659L4483p562O429l1362
$$ y = [-18523, 11500, 144, 12274, -26171, -67136, -80838, -58920, -60679, -51879, -11736, 2397, -19470, -40108, -46892, -39883, -15588, 2768, 28751, 44989, 36627, 34205, 4461, -70578, -67577, -33685, 16318, 29833, 25850, -1922, 10898, 12351, 10971, 20130, 9786, -15022, -49398, -55845, -48473, -46473, -31977, 2380, 30610, -7551, -186, -10530, -14232, -41752, -46417, -49936, -37893, -34644, 3078, -6623, -69799, -72989, -44436, -21322, -30022, 14007, 59759, 30696, 12741, -33953, -32900, 5872, 26939, 39009, -15937, -16214, -9567, -35846, -78329, -59740, -26122, 204, -6267, -46673, -7584, -8428, -34906, -32967, -37447, -81190, -102996, -54707, -34610, -46877, -37026, 24648, 64756, 65923, 23923, 10126, -6974, -8178, 26481, 60964, 53402, 59831, 28469]
14764B8469j4483n485q623J3298j3693k9774j2984L6236p82j0313J1072K2457
14752A5395K1606r227l7751j4625J8590L2950k0614k7367J4954p182q902L1064
14740H891K6148K0140k3764k1445n4502j2174L7067M7138K8168j121O907l334
14728E8119m3536j3738L1487J197J9200K467J7508k3692L039K030m8232o7406
14716f1557j81j4811K3009M5506p380J8609K4883q10n488k4951j8914L5557O986
14703B0458j1949k7619M157M569p731J7702L3742k7530k8758J641Q581Q423J2013
14690G699L288l8588J956L3032o107l0415N939l8278l4803J0542N2654M4913K7367
14677C9199k6106j0454k9299M1639K4557r285p260k9162L0143L3146j1103j3403
$$ y = [28469, 13986, 8501, -122, 13176, -517, -30291, -43275, -7039, -7821, -18134, -7062, 15395, 37001, 27774, -9977, -24602, -6012, 26938, 6324, -21043, -6089, -13271, -22173, 8891, 35039, 55179, 31415, 9970, -44532, -56706, -19639, 27499, 55667, 54546, 61453, 58119, 14583, 845, 32332, 33529, 52729, 55196, 72704, 49012, 52051, 54081, 5849, -61557, -61738, -76549, -53540, -8034, -15414, 3195, 28078, 27268, 21780, -3171, -22085, 13472, 20458, 8509, -19110, -14953, -10384, -18115, -413, 33329, 5799, -22959, -21318, -12737, -4314, 7699, 10987, -27601, -25645, 7387, 1280, -29135, -23196, -61474, -96277, -85735, -33081, 11832, 39199, 13093, 2639, -26660, 14979, 39536, 30251, 22991, -6171, 23972, 57118, 46015, 32612]
14665C2612l8505J2427J0713K4038K2761Q680m191k525o4532j9939K817l2555
14653d8199J1488L2637K2475K2734j5809J8952J8776K3607k3269m6843k7250m940
14641a5641Q027K5271j7769J6853k0355r216k2973j0853O1159J1114j830m284
14629A9503k8543m0075m5623O462N016J0552J8268L246L2645K2185j276j9753
14617a7393K0527r270m5272N216N4336M6959j8156j5778k8166m3505q388P3375
14605A4485M6647K7860k8769l7396j7178m419K7571P458J0269r136l524J0363
14593D4231l2788p7801N129O7875N435m4171j8044M5928M624Q978j3639R95J6570
14580A3322M2370j1623K1595k9818k0763M630J4774K9616j6931j2804m4546k7819
$$ y = [32612, -5893, 6534, 17247, 41285, 64046, 72726, 68535, 66010, 1478, -18461, -15644, -48199, -36711, -4074, 18401, 41135, 25326, 44278, 63054, 86661, 63392, 16549, -10701, -15641, -7614, 17657, -112, 16741, -3614, -12830, -35803, -46656, 14503, 25617, 23787, 19503, -9040, -49115, -94738, -88276, -83260, -72708, -54440, -51194, -18549, 3636, 2360, -17393, 3134, -6136, -51408, -46192, 8144, 55103, 36947, 21169, -6997, -50502, -58890, 14485, 61132, 88992, 60223, 22827, 5649, 1230, 28801, 36259, 46528, 37392, 33868, 44231, 11443, -66358, -61229, 6646, 12081, -32090, -50134, -4206, 418, 9396, -4243, -3248, 13322, 55692, 44069, 65664, 35846, 15083, 19713, 34487, 64103, 47172, 34368, -10178, -37997]
14568c7997L6380L1107j7204r888k5204j736K2452J0128M787R252M832j432j6580
14555H897n0024l522N44N0281J3947Q020k2620P781K4352K6813J5884l4407j9975
14542B5971K244L0126L097j8860k2407l5964m6684K0038L1188K0161L6171n369
14530C9712Q363J855j0472K3113j4978l3639m106l3062L4185L8708J6196k1570
14518D4305l7949l180N1883m487m4425l4317N729J967M6951K2940k3871k9872
14506d326l2407j899O5885j981j2314L5720J0940m6400m4108L1752j5563P093
14494g608m2154k608J1505r957m4085J764j6778J2175M5599N7800K8843j1153
14482B3343j6584l0783k1689J4003j0315M049K0241J6090L1656k6708m208Q088
$$ y = [-37997, -1617, 29490, 12286, 2398, -22806, -24542, -2090, 8038, 12825, 22077, 26909, 25477, 8897, -41127, -44649, -44105, 6176, 20123, 28143, 5523, 13304, 37656, 64469, 80353, 45946, 25971, 28215, 58341, 61438, 42578, 20171, -15793, -62477, -42439, -11251, 8910, 45081, 39712, 48075, 49930, 39458, 62571, 47593, 13954, 9848, -23214, 10971, 49679, 65875, 44305, 6356, 3176, 55059, 50572, 6147, -28170, -22441, -20474, 26477, 49417, 25546, -4326, -36733, -38632, 27253, 25272, 12958, 48678, 59618, 13218, -30890, 862, -14701, -7608, -49762, -52370, -40865, -50822, -94907, -93143, -109921, -97746, -52147, 5653, 34496, 23343, 6759, -24024, -45713, -31710, -42025, -37976, -17735, -1645, 30011, 3303, -905, 7183]
14470G183J6620L3488k5471l4278J1255j5557K89J7393R978l1553J6365J0726
14458A6438J65L3757l6719n6914q094K1486J9254K3495k108k9956j6901K6457
14446i640J7269o73j7881K2588O976r733L4682J4805k4535K2011J9135l4381o4599
14433b3976j077J2716O393j357j8149M9105M3834J785j0547j6605k7358k2378
14421g614L1868M9475k0909J4043M0148K3469l0064k7276k2370l6294Q670j9701
14409C445J468L3033k9356j2496M750k73o62P678j6078k856l237L6492j4727j4086
14395f905K227l6538P815k6151K4028M1048L789l5755j0504M8332L312N746p315
14382A3129K9168N927J8527l9987n5427j1568K1371J7553R0904N8411j0756n7910
$$ y = [7183, 23803, 57291, 31820, -2458, 8797, -6760, -6471, 10922, 20900, -10653, 5712, 16438, 16603, 50360, 13641, -43273, -51367, -29881, -10627, 12868, 10760, -19196, -36097, -9640, 7629, 6956, -10925, 11663, 18639, 8906, 43588, 58393, 33858, 55869, 75004, 40623, -23976, -25053, -12337, -5944, -7301, -25450, 23655, 67489, 69274, 58727, 42122, 14764, -7614, 24254, 73729, 52820, 66863, 107011, 130480, 100416, 73140, 50770, 14476, 23146, 3445, 4913, 37946, 8590, -3906, 844, 571, -91, 7587, -8491, -11347, -14584, 21908, 7181, -6905, -4678, -41216, -33401, -59552, -35524, 5524, 9313, -26442, -36946, 11386, 14698, 20444, 13129, 42297, 48224, 66751, 26764, -28663, -40231, -18860, -1307, 89597, 148008, 137252, 79342]
14370G9342L198l236o3928m0468L2559J157L4896n012m4511j4315k6867k6462
14358g3647N736L1253N4461J3875J7414K613j9586m5734m1017j9197K9088M5450
14346G09j3648M612J7508K1575J8400j1844J4497o3190l1406K2858L827l0621
14334d6723o169J0049M7702J4151j9353K1062J5284j7165j4780m708Q973J5625
14322B3948K7103j3233l3050k3285J1407M3508j2282Q31p575L0254Q458l2727
14310B3357o8830J0749L0700k9022m59J4184r623K8807J5689n808n4152J9575
14298b4833M3354k8084m4191k5501J5706K4738R719L8111L5189o8468O53K6591
14286B984m8242j666J8664j8248j725L1356N6856K1025j7892K6580l1850j3870
$$ y = [79342, 82540, 79304, 15376, -25092, 7467, 8624, 43520, 38508, -6003, -20318, -47185, -73647, -67911, -36658, 17803, 31678, 49092, 51705, 32119, -13615, -54632, -73829, -44741, 709, -12939, -8327, 9181, 30756, 49156, 37312, 51809, -11381, -42787, -19929, -16102, -46723, -52892, -42843, 4859, 19010, -343, 20719, 36003, 18838, 4058, -650, 8323, 23948, 51051, 37818, 4768, -18517, -7110, 36398, 24116, 24947, 17372, 47626, 56084, 23357, -45473, -34724, -4024, -33046, -33505, -19321, -28944, -137, 15552, 9744, -44408, -24833, 18521, -9563, -53754, -79255, -63549, -38811, -29092, 9019, 44208, -24260, -23607, 2984, -45258, -46924, -28260, -46508, -48233, -16877, 39979, 61004, 43112, 69692, 37842, 23972]
14274B3972j9934m8368k828k9749L8093l964r331K7126j0233l3731O2138N8529
14262E1720J0811l1668p2817q493K1188p335k0171M6601N7713J2039K487m4651
14250A7424j8195M7174M763q130J7743O596l4448l6320K4116m937j0088J1514
14238A7212j7887k2119M3228j2230l8576J8849M355N240O249J643k5628l1697
14226e1361j1280K1387J4960L8393M3959K6216K1455K248l3319J0934j3335m3884
14214B6373l7225k2013k785L7659J0107m5854K1355M2806J0764Q336N128p26j3404
14201D0521p755k1583n5093Q40K9717j7930o069M200K3281J5047k7787j9440K2788
14188a9263r322J90j1764j201k7421L3778M098l877l7665K364K6409L3855J5360
$$ y = [23972, 4038, -44330, -47158, -76907, -38814, -42778, -52109, -24983, -35216, -68947, -6809, 51720, 62531, 30863, -41954, -50447, -29259, -36594, -56765, -10164, 47549, 59588, 62075, 17424, -771, 46403, 51166, 43036, 60779, 67375, 32927, -3393, 20723, 15786, 5698, 17212, -675, -22794, 20434, 8204, -30372, -11523, -7168, -1928, 4321, 5964, -19664, -51361, -62641, -41254, -26294, 12099, 56058, 82274, 103729, 105977, 72658, 83592, 70257, 26373, -10852, -32865, -35650, 2009, 12116, -33738, -12383, 30423, 41187, 49523, 54651, 53925, 40521, 32766, 11183, -43910, -43070, -13353, -31283, -37352, -33152, -9871, 5176, -22611, -42051, -19263, -28585, -28395, -40159, -41360, -68781, -35003, -30905, -34782, -72447, -70083, -43674, -9819, 5541]
14175E541k7151j0248M472M5493J9771p089J1789l6804j394K2871q245n1321P842
14162b4473j8608p464o123o750N966K5153K8169J170O202K5901K9158L6779k1833
14149G3247n2447k1217K4014q43n0468J0164j0654L1007M5244O446q998m8141
14137b646J5787j4314k2086m5032K3100M679j9543n388N5035l1296N595K3369
14125a2740J6660l0136k4946K4814j6627K8335J5213j761j8407R432N907M959
14113G03m1802K8490M3252L5704o268l3901j1250J1264J1695p380k4839j5277
14101i609k5639m9079J4967J7215L029J5615k8593j926K1161k2989J5938P7928
14089B8018L0436k587l5552J401J6789j7585l5925L5873N6823k0899n3987j7577
$$ y = [5541, -21610, -31858, -27386, 18107, 37878, 30789, 42578, 5774, 4380, 27251, 19006, -32315, -24473, -43081, -50545, -56668, -63418, -57452, -32299, -4130, -2960, 3242, 29143, 58301, 95080, 73247, 20800, -417, 23597, 22754, -27714, -17550, -28204, 2803, 48047, 54493, 45495, -2646, 13141, -1173, -23259, -68291, -45191, -40512, -60055, -65443, -10408, -41704, -36109, -12740, 3920, -26216, -51162, -26348, -42975, -14640, 573, -1188, -19595, -10163, -4256, 703, -41099, -12609, 30643, 66347, 60079, 26178, 14928, 26192, 37887, 30507, 5668, -9609, -35248, -84327, -69360, -52145, -49116, -33501, -62094, -64020, -42859, -65848, -49910, 28018, 58454, 55867, 20315, 21716, 38505, 20920, -15005, 20868, 77691, 56792, 2805, -14772]
14077a4772K6446K2488l0569K6671K9066J0705j436l4649l6929k3431J4165l6707
14065d8952k4081K0329k5822J9312K5115o298J8865K7955j9311j3491n860L0980
14053a259L0781J6264l7547k1297k4856J4462J0740k9815J8049O435r567k2721
14041e0331L5412M1445K1546r14L6689k7147m6341r436j5735K1002q988k5220
14029b8018j1189r821L927M0784J8996K3627J6866q3992l5860J3357P8569N9602
14017H6848Q46m7231o1362o3602K4894L5012L387j9610K6390J2606j5811K0826
14005C193k7299J779j2577m7542j716K6826L0304M1207N898J2452L4477j993l0970
13992C4039l2106k042l039l1417k032M9930K7408L9646r575q061k7829j9685l761
$$ y = [-14772, 11674, 34162, 3593, 30264, 59330, 70035, 68599, 33950, -2979, -26410, -12245, -48952, -73033, -52704, -78526, -59214, -34099, -40397, -21532, 6423, -12888, -26379, -32239, -1259, 29522, 45786, 8239, -13058, -37914, -23452, -12712, -42527, -24478, -18043, -27610, -50331, -14919, 26526, 48072, 47158, 83847, 56700, 10359, 923, -14812, 6190, -2798, -28018, -39207, -49028, -45101, -4317, 14679, 38306, 55172, -28820, -64680, -51323, 27246, 86848, 87694, 40463, -20899, -84501, -59607, -24595, -21208, -40818, -14428, -1822, -17633, 3193, -24106, -22327, -34904, -82446, -84162, -57336, -27032, 14175, 20073, 32525, 67002, 65009, 34039, 1933, -109, -3148, -34565, -36597, 13333, 40741, 80387, 70812, 62751, 34922, 15237, 11476]
13979A1476k6662j8695J2279k4472K5926L0732K5697k203Q757p763k053J28J6731
13966D9878o804N361l1589l0148Q346L7655M7461J1139j3300m0994k9815J1865
13954A9055N2526R135j7370n5550j5882O29j8621n1648j9069M2029P868p146P034
13941d7010M1769L2788j2669M5443J5103q495j3773j5830l3275k5766L025K4949
13929F259K3705k6227k5990K7395j7827l3447K3089L5153K9560L2370j9156n1433
13917C451q867k2018N362N2699K1009l296m112J2460L5427j3355l8813m3299k3752
13904b7104L5608l988k7107j9393K6723M4457M6710K6830k7177l5887j2043k1390
13892F239j7030k8141K1490R867J2642L9620L202m3239o031L1192L7738l5082
$$ y = [11476, -15186, -33881, -21602, -46074, -20148, 10584, 36281, 34078, 42835, 35072, 33019, 33147, 49878, 43074, 48435, 16846, -13302, -4956, 32699, 80160, 91299, 77999, 37005, 7190, 19055, 71581, 80716, 63346, 7796, -8086, -7457, -26078, -77726, -96795, -54766, -46898, -54044, -47010, -5241, 27547, 14878, 60321, 75424, 66929, 53156, 37326, 4051, -21715, -18690, 6259, 29964, 3737, -22253, 5142, -12685, -46132, -23043, 12110, 41670, 74040, 54884, 3451, -5416, -27434, -22072, 30627, 51636, 48340, 44228, 56688, 92115, 78760, 39947, -3352, -27104, 8504, 4516, -22591, -41984, -15261, 29196, 75906, 102736, 75559, 39672, 27629, 6239, -10791, -38932, -17442, -7575, 5067, 44687, 47889, 4650, -1381, 29811, 67549, 32467]
13880C2467p3380l5202L1417O4101O8430j5643m6854l3266N626m431L2582k7676
13868a829m7646j092L3933M2909J6088M440j9209k0599k9958k7407R531N0586
13856I747L4680r881m0614J0441J4105j4104p584N145l4227q43n530M546M3233
13843I114l6432j2315L5456K8992N572N13J6939J8089j5822j1913N3360J7016
13831A08569Q6O989p1416l5878l8516n6212r72M528L2885M8204k6064n798L0843
13818b752L8213J5299m835J8005n986l1320j4101k7878N959J4275j2109j0222
13806a7452K4768J9818j5459K3928Q229k7397L032K2626k6390j2574J0852M248
13794A8229m4735k6466K745q905j2517K7520K3828K4472k162k3364k251j9094
$$ y = [32467, -40913, -76115, -44698, 19403, 87833, 72190, 25336, -7930, -2304, -6735, 25847, -1829, -49475, -50567, -16634, 26275, 42363, 46803, 27594, 6995, -22963, -50370, -40839, 9747, 44427, 34546, -6068, 4373, 18478, 4374, -3210, 1935, -32292, -33135, -38665, -34119, 9114, -27318, -39633, -4177, 24815, 30387, 30900, 47839, 65928, 50106, 38193, 91553, 108569, 108655, 115644, 44228, 8350, -30166, -86378, -87350, -82822, -49937, -1733, -27797, -33595, -2752, 35461, 50760, 45925, 63930, 57944, 26624, 12523, -15355, -9396, 4879, -7230, -17452, 7316, 27134, 11675, 35603, 43832, 16435, 19467, 42093, 15703, 3129, 13981, 18229, -26506, -52972, -50227, -59132, -71649, -44129, -20301, 4171, 2009, -21355, -23606, -42700]
13782d2700l2870n090N0047Q135L45J0340j2620M808Q749K5642J6863J6259l235
13769D4673r3582J8740P1468j5588j7148J765k1205r527J0933m178J1996k1342
13757b2995J7678R706L781l358o01N204j389l825Q521J9077k348R968k82k3480
13743A5657k4304J2706M4460K0271j3429q295l4823l321O3874k4873n9706k6766
13731c8549L6629K9458L2604L9198l282m9266q451p811K9808k0797q606P9j0318
13718B0696j068K3637K4264l516k7829k8470m8357j2866P333K1504K8396K9554
13706C3278K6539j9953o5245m5691j8479N099J6479L2196K5420J2860j3963j4093
13694b5553l4669L768M4226N5256M61q502j1363L0484Q6o973l3097J9734k591
$$ y = [-42700, -75570, -80660, -30613, -22478, -22133, -11793, -24413, -19605, -10856, 14786, 31649, 47908, 44673, -48909, -30169, 41299, 25711, 8563, 10328, -10877, -20404, -9471, -13649, -1653, -22995, -5317, 4389, 8170, 4812, 4211, 9415, 8026, 4201, 12722, 31799, 29451, 39419, 39137, 15657, -8647, 4059, 48519, 68790, 55361, 47066, 12243, 8922, 72796, 47923, -11783, -38549, -1920, 27538, 60142, 99340, 96058, 46792, 38341, 30530, 60338, 39541, 30935, 31014, 20696, 19628, 43265, 67529, 64013, 36184, 7714, -40643, -53509, -46176, -24672, 3724, 33278, 59817, 39864, -25381, -71072, -89551, -84452, -67973, -35777, -10357, 2503, -11460, -25553, -60222, -56454, -12228, 43028, 43489, 34987, 23624, 54108, 54194, 47221, 14124, 33858, 31267]
13681C1267R206k8794m7206k0415k026L0785j6926j4229M7650J2581P747N637
13669A5277r859j540K7221J3924l112j0669P565j3657k5640k4003J8428k1389
13657b7454J425N1268p401j9579l3688q458k0874J519K6717J8391j5950J0244
13645b3840J9405l4836l4034N5804M1430k1772J7338K4975n12k5695p231j9685
13633h653j5790M89J3286J3740j7318m341P2529K737n9890m7432J0899m1689m6910
13620a28343n674K4747J5710K9358M5715P433q137k9020j1665K0925J1672L0206
13608B927J232k9385L437q10L0087k6887N118j9310K635J8164L4535M1569N947
13595F9259j6239j5008k2332k2603m3942N718L5883J6351K0466k9197j3056J4838
$$ y = [31267, 40473, 11679, -35527, -55942, -57968, -27183, -44109, -58338, -10688, 1893, 9640, 15277, 5418, 3878, 31099, 45023, 41911, 31242, 38807, 25150, -490, -24493, -6065, -27454, -26029, 25239, 17838, -1741, -35429, -43887, -64761, -63242, -36525, -18134, -34084, -23840, -4435, -39271, -73305, -17501, 23929, 2157, 19495, 44470, 43958, 18263, 11032, -8653, -24443, -23954, -10668, 3072, -14246, -18587, 53942, 56679, -3211, -50643, -39744, -81433, -128343, -134017, -109270, -93560, -64202, -18487, -11054, -19191, -48211, -59876, -38951, -27279, 2927, 4159, -25226, -21789, -22599, 7488, -19399, -14281, -33591, -30956, -12792, 21743, 63312, 69259, 53020, 38012, 15680, -6923, -50865, -45147, -9264, 7087, 27553, -1644, -14700, 138]
13583A38J0302P026J3358k70l8876r477L464L5927j3749k7901L7126l4756N616
13570a2072J8694m9522N79N7144K6107k7750j5780J1825J9091N419n049m133M114
13557B8667j5258k9398Q857l305k3971m2932k9048L5335K4411M75L0233q421k1286
13544d5641k3781j649J8466K292K9369N9629j8548o6722L2840K7321j5295j3065
13532a4784p923k3591J4274P5189j789k1315n033m904K393L9382Q796j1494n142
13519D4059r009Q068k4597k100l1021k4917K7697j9989L1716L7566k6275l6452
13507b5254l161O638N662m4263J6221L7384r023m5675L9351K9912j7747n0985
13495f0940l6310M0979J8639l49J2040J9322j1145j022R502j2118M9013K9706
$$ y = [138, 10440, 17466, 30824, 30554, -8322, -17799, -14335, 21592, 7843, -20058, 17068, -17688, -12072, 6622, -42900, -42321, 14823, 40930, 13180, -2600, 9225, 28316, 33735, 28686, 24553, 28667, 13409, -15989, -7132, -10437, -34408, -77340, -106388, -71053, -46642, -46167, -15934, -24355, -45641, -69422, -71071, -52605, -50313, -20944, 38685, 20137, -46585, -13745, 13576, -1719, -14784, -22707, -46298, -32024, 43165, 41376, 20061, 15028, 10124, 12517, 51899, 60695, 49201, 44059, 35050, 43118, 18521, 16421, -14600, -39517, -11820, -31809, -93, 37473, 11198, -25254, -28415, -21777, -16115, -60378, -44157, -6773, -15796, -61471, -22120, 7792, -9955, -60940, -97250, -56271, -37632, -37981, -25941, -6619, -17764, -18786, -9284, -21402, 27611, 57317]
13483E7317j7647K266j0659K3876k8447k8566J8929r602m6038j4362o620p882
13471f7435M0405k4602O847K3543j2307J2534L9955K1504m45P017k4127m478o418
13458A1993l8116p134J5914J99N2623K4821k6578j6787K3367M0641m5158k8046
13446G739m7813r278j5690K0450R246J5551J7273R057j1039l1808N720L8022Q812
13433A6242P551k5645m6737J258M5580j0717j9781l3360L3343K313J9445N0679
13421D0171j6665k7556N335K5736N1720K0363Lj8727k0812n97l1424k9779J7707
13408A5475J2239K9848O504j3848J6756K3092N0708l9033q3914K849k9152L1651
13396B3175L0946k2590l914j5246Q498Q644L8820J5985k1997p9220n3576J2975
$$ y = [57317, 39670, 41936, 31277, 55153, 26706, -1860, 17069, 7467, -38571, -52933, -59553, -67435, -27030, -51632, -44785, -21242, -33549, -21015, 18940, 40444, 39999, 47016, 22889, 18411, 11993, -26123, -33257, -17343, -17144, 35479, 60300, 33722, 16935, 40302, 80943, 35785, 7739, -40074, -49352, -65042, -44592, -35346, -19795, -2522, 6535, -4504, -36312, -30592, 7430, 16242, 23793, -1852, -48589, -47331, -1751, -12468, -32249, -65609, -32266, -29953, -10508, 40171, 23506, -4050, 1285, 27021, 78741, 99104, 99107, 80380, 59568, 58971, 27547, -2232, 15475, 27714, 57562, 64066, 50218, 66974, 90066, 140774, 101741, 17827, 20676, -8476, 23175, 54121, 31531, 27617, 12371, 20869, 29513, 68333, 84318, 62321, -16899, -70475, -57500]
13384e7500O5822N2138l651m6831K9275J71n3731m666N2225j0600Q353k4041K7778
13371C4742L2498k037j8361k7024L2824K214k8803N9248K9257j3140L923j1523
13359I3818o003R85k9624l6181k5172n060k3127L2432L7274K7959j9885l5073
13347A2343m1838J6583J0200j9805L088j137L637O844m092k125o702J8837k4169
13334b8336J598k0325J4626J4307L3853K9999k1020k1598k6699m1364J3822K9551
13322b1586K4690k8787j3146J9410J3213N816j7606k6472m9756j9753J3060L9612
13310f1305N2767L217J8j4276J2261R125M4158l011j0784J5569K9624p0030n4184
13297d6851j163L2350J9879L1330l799N375J9875j4144m4652p142J17086j0462
$$ y = [-57500, 8322, 60460, 56809, 9978, 39253, 39424, -14307, -18973, 33252, 22652, 31005, 6964, 34742, 67240, 65203, 46842, 19818, 52642, 54856, 26053, 85301, 114558, 101418, 105341, 93818, 87815, 88800, 59176, 22995, -2177, -7237, -30364, 2068, 39342, 67301, 47416, 12343, -29495, -12912, -2712, -22517, -19429, -20566, -16929, -10085, -14177, -16302, -23004, -4167, -28336, -26738, -47063, -32437, -18130, 15723, 45722, 24702, 3104, -23595, -64959, -51137, -21586, 3104, -25683, -38829, -19419, -6206, -390, -17996, -44468, -94224, -113977, -100917, -61305, -8538, -5321, -5303, -19579, -7318, 1807, 45965, 42954, 32170, 47739, 77363, 7333, -46851, -48014, -15664, 4215, 35545, 31746, 37121, 56996, 42852, -1800, -8942, 108144, 97682]
13285I7682n3209l1128o698L8475k5974L6851l0152p21P080R944L779k9839k1139
13272e049l3317n072J384J748N666K1862m434O578M6514J8063J298l0059j6397
13259H785J711O493K3028l8882j7768L9021l2392j8303O144N1820J374j4217J3698
13246C0512j2633M0624N2997M5709p2348k5076k6721n9908k412L6745j8805k7125
13234c8441P107O558L8475j8793J032K1264j8452l3472k558M442j4511K2930K8564
13221D145J4652j734Q788o33M89K378J9268P992P671l0455n9019Q77J2081O5332
13207E1832J4410l7588n8355N41K811Q465j4165m2657j18K5007M1862k4203n0938
13194h3096J0672L297K0358L5112K2756N1700L3362o236k1329O38l6667n552K4686
$$ y = [97682, 44473, 13345, 6647, 45122, 19148, 55999, 25847, 25126, 32206, 42150, 45929, 16090, -5049, -38366, -43438, -42054, -40306, -34640, -12778, -17212, -10634, 35880, 53943, 55241, 25182, 8785, 10496, 16989, 40017, 1135, -16633, 22388, -10004, -28307, -22163, 29657, 31031, 16814, 30512, 17879, 58503, 111500, 157209, 84861, 59785, 33064, -26844, -29256, 7489, -11316, -38441, -31334, -24776, 13699, -5094, -4062, 17202, -1250, -34722, -37280, -32838, -47349, -24419, 4145, 18797, 17063, 25851, 25218, 25707, 28085, 47353, 55345, 63016, 32561, -26458, -25581, -13500, 51832, 66242, 28654, -29701, -29160, -26349, -17884, -32049, -74706, -74824, -49817, -7955, -32158, -83096, -72424, -69127, -48769, -13657, 9099, 60799, 94161, 87925, 66596, 67234, 30567, 25015, 49701]
13181D9701l9606l815j3827P267n265M9223J614j7253k9410K5419j1605n177L923
13168A1189j4307o519j5399m600L7942K2682m0853l0447k32N0569j7228K798O867
13155B462j1197R012J0484O410J6967k2869K8328L65j3748M01k1926J3690P777
13142B6156j6633J3373M1777J1184j036k5382j487K3152J2552R498m351p980j7556
13129F3267q168n694j1809L289J970k4477J4025N980P00L690m0525R732M961o3409
13115d6468J1702J6513j9517L6613J126K579J0614L4301L6242l6827j9577l3036
13103e735k7098j7173M868K1030K5314j5742q50k521k4647L3353K0644k4680j1607
13090b4844k2477J1468J1130P989M7290R240k3939r090l3113k0905N5497kj9186
$$ y = [49701, 10095, 6280, -7547, -280, -5545, 43678, 45292, 28039, -1371, 24048, 12443, 7266, 11189, -3118, -9637, -25036, -29636, 8306, 30988, -9865, -40312, -40544, 10025, -7203, -4405, 2462, -8735, 277, 10761, 17171, 34138, 11269, 39597, 39962, 26214, 26615, 4689, 18379, 26156, 9523, 22896, 64673, 75857, 74821, 49439, 47952, 71104, 83656, 93154, 88803, 80823, 63267, 55099, 49405, 37596, 40885, 42855, 18378, 32403, 38383, 39083, 42773, 2248, 11980, 16941, -46468, -34766, -18253, -37770, -1157, -31, 2548, 13162, 47463, 83705, 46878, 27301, -5735, -32833, -50006, -45138, -24108, 1206, -14536, -15386, -17907, -42554, -9201, 11443, -13237, -24844, -47321, -35853, -24723, -16734, 30556, 39796, 15857, 6767, -26346, -47251, 8246, 8244, -10942]
13077a0942Q308K8185R56n9786k26J5647N5838K9848k2854k5805j3815j2721l441
13064a0808J6024L843m964J8637J9360p229j1208m343K0414l1485M980L4183l3744
13051A3660k3657j0615m9342L9986K6974J435L36o6445k6754j1017J0330N07J4105
13038h0497M1754Q705K4082M0852o106o04J4499k3318M04k6572K846J2765N3163
13025F1973J73Q767O624k7293q141P35o72j0461l092k9605j2612J4897M4504M9642
13011I5439j1553k7424j4942J1574K25j7488k9429K115M8350j0819P70o6418l0303
12998d9903j5798K2062L0523L5355k5247p072K9395j3904k8164L9321L5217j8219
12986C3566l0531O424J0599M2800j6209j4117j481J4721j7625m2850J2675L3876
$$ y = [-10942, -2634, 25551, 26507, -33279, -33505, -17858, 37980, 67828, 44974, 19169, 5354, -7367, -10808, 5216, 9059, 4095, 22732, 42092, 34863, 23655, 19312, 39726, 8241, 13221, 47404, 13660, -9997, -20612, -69954, -29968, -2994, -1559, -1223, -67668, -94422, -105439, -95109, -94602, -80497, -38743, -30038, -5956, 34896, 28790, 28186, 42685, 19367, 19771, -6801, -3955, 8810, 61973, 62146, 70913, 77537, 50244, 42103, 42838, 42166, 31705, 28613, -992, -13604, 1293, 45797, 95439, 83886, 56462, 41520, 53094, 53319, 35831, 6402, 8517, 56867, 46048, 46818, -19600, -49903, -65701, -43639, -13116, 22239, -3008, -10080, 19315, 5411, -22753, 16568, 51785, 33566, 3035, 9459, 20058, 62858, 46649, 32532, 31051, 45772, 28147, -14703, -2028, 31848]
12974C1848J778K485K8967q569k7939k7085k372J9027r251m4000K773l6276L0460
12961c8154J9645k0539R510L20m6264N390L9207P869M0454J7262j810k7472J1094
12948A6512n8375L4828L3413m8529k2199k0318K1395j6837L1068K3766j0604k6840
12936d2720J7739j7425m3335K7005M8244k0051p2648k6293K3547M0285J1643L9889
12924a4120K1317m3551J6308K4112j7342p734o802L7431j1336K4534K0890k882
12912D0825L934l0365j8881j8504m4657k992J7972n752j86L3686j1659R751N028
12899b1800K0925J4797Q297k5227j1449j1183m2445Q42K0546l183q877J4066P915
12886c6776j3728J6901k727j8832r98L6999p36l6372p15J4320J1816k0956K0093
$$ y = [31848, 33626, 36111, 65078, 56509, 28570, 1485, -887, 18140, 8889, -35111, -32338, -68614, -38154, -18509, -39048, -29538, -29218, -75482, -70092, -30885, -23016, 17438, 34700, 32890, 5418, 16512, -41863, -7035, 26378, -22151, -44350, -64668, -43273, -60110, -29042, -5276, -15880, -42720, -24981, -42406, -85741, -58736, -10492, -30543, -103191, -129484, -105937, -65652, -54009, -14120, 7197, -36354, -20046, 4066, -13276, -21010, -27812, 9619, -1717, 22817, 43707, 40825, 44759, 14394, -4487, -22991, -67648, -70640, -52668, -58420, -58606, -24920, -36579, -26828, -21800, -875, 13922, 22219, -3008, -14457, -25640, -68085, -67243, -46697, -49880, -58757, -44691, -36776, -50504, -33603, -36330, -55162, -56160, -19161, -19897, -56269, -56984, -42664, -30848, -51804, -31711]
12873c1711L4442j0368k2700J4995J5082J3692J462j847M3003q085j4896k2882
12861A0187r399L8867r81M2450m2934l9860J1987M6723o0983k3472J5566J1956
12849A07n882j8178J940m088L35j6467l7252J2162L9424K2136K855p825r046O169
12835a3610k8559n644M5301k6714l1704K9083O37k6046n177J8227O722j3024j5359
12822f5867K4692K7676K6715r26l547M639K6401m6918k7320j6002r280K8858L4324
12809C445R363o466m3160k9517K8047O398J6684O1105P194k8123j3952o310K216
12796F924J2443J7147l0719j1148O943q865J2028J9940N785R28R398K8994L1788
12783A01586o3949k6058J819l5253o372K3487K4630k4531m1226n2536K0111K0740
$$ y = [-31711, 2731, -7637, -30337, -15342, -260, 13432, 14894, 13047, 56050, 47965, 33069, 10187, 788, 39655, 38674, 81124, 38190, -1670, 10317, 57040, -3943, -27415, -11849, 107, -5775, -23953, -22013, -26101, -25766, -42233, -79485, -67323, -27899, -5763, -2908, -10733, -19779, -13610, -42169, -47813, -2512, -29226, -60930, -31847, -31210, -57256, -62433, -44206, -37484, -50508, -65867, -41175, -13499, 13216, 12290, 8743, 13382, 39783, -7135, -34455, -50457, -59737, -30879, 3445, 12808, 6342, -36818, -66335, -38288, -31890, -15206, 45899, 53093, 24970, 11018, 4708, 6924, 19367, 36514, 5795, -5353, 1590, -7275, 4753, 24693, 30478, 31406, 40804, 69798, 101586, 37637, 11579, 13398, -21855, -28227, -4740, 19890, -4641, -45867, -98403, -78292, -57552]
12771e7552J4063K1369k567r107j5020K4482N8156p83L397j2786p655j7450o167
12758g620m728K7795j7521p430k860J2694N2q249R814J8181k9117q906q911p008
12744c3814j5587R010K4830N6147m000o0015j2186M3189r303l3848O747J0166
12732a8664K4493l0384j4920R691L8632J1449j8715k0255m0341j1806M4499O3763
12720C7442K0476m9201m6247J0117J8596K950j878J7327K7099Q045K848n84P803
12707E4793L3472Q312J0290k506r425K67K1375k3039k8600k8936k9793r457M379
12694A132K714l6802M287J7386j6368l1166J1192K2347M3161p316o763j0878n4656
12681f1730J9451K8007m991k7674K634Q413J061m259L6069N974j6737K0124M5174
$$ y = [-57552, -43489, -22120, -24687, -33794, -48814, -24332, 33824, 33041, 36438, 23652, 15997, -1453, -7620, -12348, 15447, -2074, -9504, -12364, 330, 382, -7867, 1947, 20128, -8989, -17895, -26806, -33814, -49401, -40391, -15561, 40586, 36586, -23429, -35615, 7574, -1729, -35577, -28830, -18664, 5829, -24555, -39475, -29784, 8848, 20297, 1582, -18673, -59014, -70820, -26321, 37442, 57918, 8717, -37530, -27413, -8817, -5867, -7745, 9582, 36681, 44726, 47574, 46990, 54793, 88265, 96577, 106867, 104361, 94936, 95203, 116578, 93539, 64939, 36003, 6210, -3247, 1132, 3846, -32956, -28669, -11283, -27651, -58817, -47625, -25278, 17883, 10567, 3804, -7074, -61730, -42279, -14272, -19263, -46937, -44303, -35890, -34829, -39088, -3019, 2955, -13782, 6342, 51516]
12668E1516j1290r539n8099m2340q681O790K7659J3258r709J0243J5839k2614
12656c6967N284M960K0609k057J1044j7173n828l9794K5014m767k0935n921j1150
12643g7681J438j0419J6182M4933J396j4785j0279M7916N2661J6018J4049k0574
12631F0855m7196l1342r779M2455J2039K0671J7387l1568o7663K0131O4474k2746
12619B7718K5116L4819l6990k6181K7426K2187q220L2820J3810k5089K486m8098
12607D1804p6023j2567P1759k3897k3786J5736J9000J2581K607J5828j3436l5011
12595e405L417p267R224m815m605K876k1649J8793K7184k9637K749J0279m95M8619
12581D9268L336K4515K3762q554l3524n3641l513L6049J9605j185N979j7268j3986
$$ y = [51516, 40226, 30687, -27412, -69752, -78433, -71643, -43984, -30726, -40435, -30192, -14353, -36967, -31683, -26723, -6114, -8171, 2873, -14300, -20128, -59922, -34908, -39675, -60610, -66531, -77681, -76243, -86662, -70480, -25547, -24151, -38936, -49215, -1299, 51362, 67380, 81429, 60855, 13659, -17683, -27462, 14993, 27032, 47703, 65090, 33522, -34141, -14010, 50464, 27718, 52834, 87653, 50663, 24482, 51908, 74095, 65875, 98695, 112505, 87416, 89902, 41804, -34219, -46786, 24973, 1076, -22710, -6974, 12026, 24607, 27214, 43042, 29606, -5405, -1988, -9255, -31, -4846, -9451, -6575, -28224, -9431, 17753, -11884, -9135, 1144, 649, 49268, 52604, 77119, 100881, 92327, 58803, 5162, 1649, 37698, 57303, 56118, 62097, 44829, 30843]
12568C0843J9846j7759l1457J0026J7620J833M831J2960J4839K625j4034p220
12556D4953j7873L5823R426K2872o204o7803j5634k596m607m4205n1343J3704
12544h3487J6459K5503M6728J4964l262L708L5665O411k6846k6425K485M3172
12532E5075K2510n7283o2710K8687Q833M3971J5034Q29o166m369m377K086k2570
12519A9550L526M669k0520J691K288k3564k8838k6130j9653J2454O2594P8175
12507F6242K4743k7910m6097l008j3714O710P0384l0825k7610R964K3584N315
12495E7778J3757n4183m4890L0922Q029J6297J980O070l206j8098j8552K9428
12483B5332k4079k2284r72N8619J0211R711j499k8585m0548K5204K5975l8958
$$ y = [30843, 50689, 32930, 1473, 11499, 29119, 30952, 35783, 48743, 63582, 66207, 52173, 44953, 27080, 62903, 72329, 95201, 88997, 21194, 5560, 2964, -1643, -45848, -97191, -83487, -67028, -41525, 5203, 20167, 16905, 20613, 56278, 62689, 35843, 9418, 11903, 55075, 77585, 20302, -42408, -13721, -4888, 39083, 54117, 54946, 48780, 44411, 40034, 42120, 19550, 23076, 27745, 7225, 8916, 11204, -12360, -41198, -67328, -86981, -74527, -11933, 66242, 90985, 63075, 16978, 13970, 256, 6966, 77350, 46525, 18915, 28879, 52463, 57778, 71535, 17352, -27538, 3384, 11413, 27710, 29690, 35760, 32554, 14456, -4096, 25332, 1253, -21031, -22003, 36616, 46827, 56538, 55039, 26454, -14094, 11110, 37085, -1873]
12471a873l268L87j1573n236K0060N2154K8308l7298K0226j2611J1918J4880l1263
12458D4811q433r057p559p765Q443n0962n3377J3412K9459N6241P867j5052j6393
12445h365k1292j4108J9515K3855M431K0100M8734l0094l1390j1155K5960J4159
12433D0350j8620k4279O380J1924k5893l0214L8850Q690l049p867K1270n366l649
12420H527o840o747J0469K2380k515R688l7897n130j6462P362J0277J5876L2207
12407D1195J0254j6691J997k3291K432J5090k2836J675J6696m0847k3978j1824
12395e0128J2283j9894J4941k329L0272L7725Q594k3296j2279r177j8081P646
12383b3723Q488K0790K7229K8638r19k9622M496J2437o316k8876j2458K4783Q561
$$ y = [-1873, -5141, -4754, -16327, -21563, -1503, 50651, 78959, 41661, 61887, 49276, 61194, 76074, 44811, 36378, 27321, 19762, 11997, 20440, -30522, -83899, -70487, -41028, 15213, 23080, 8028, -8365, -29657, -43765, -24250, -395, 4036, 24136, 72870, 42776, 11386, 231, 26191, 40350, 21730, -2549, 3831, 15755, -10138, -40352, -1502, 7188, 4139, -3728, 17542, 12176, 8527, 1687, -5060, 5409, 27789, 25274, 34962, -2935, -8065, -24527, -17165, -6888, 8988, 41195, 51449, 34758, 36755, 13464, 15896, 30986, 8150, 9825, 26521, -14326, -38304, -50128, -37845, -57739, -42798, -45127, -14855, 22870, 31464, 8168, -4111, -13288, -31369, -23723, -15235, 5555, 32784, 61422, 60503, 30881, 35377, 47814, 41498, 12622, 164, 24947, 33508]
12370C3508L112j0337k563K8032L7031j2991j2114n468L595l5424k398K9725k970
12357E0738j8752m0559P44j0781L3154L6577p988l8006l3250l5453p166R1085
12345B0343L1396L619M0289k4599k8830k23K764O576j1828k7779L2072M0479k3569
12332F0710l5972j780M3939M385k1133j3045l6633M389J8161l933L781K699o4235
12319c8667K962K0401L0957J5667j5077j9587k315j0329N100l08k6294n8866j4617
12306a10973L4681M3381l462L3225K8642Q490m4190J8237O0753j4969J0752j9283
12294D5284j5211j3811J619l372r131q067J7304l7184K1523M4315q373L0126K6753
12281I1775M1276j8784k5871o6752n2098k0330k271O2213K6010K6447M407K7252
$$ y = [33508, 36620, 26283, 23720, 51752, 88783, 75792, 63678, 58210, 61805, 26381, 23983, 53708, 50738, 31986, -8573, -7829, -18610, 14544, 51121, 43133, 5127, -28123, -63576, -70742, 20343, 51739, 55358, 95647, 71048, 42218, 41995, 44759, 51335, 39507, 11728, 43800, 84279, 60710, 24738, 22958, 66897, 71282, 50149, 37104, 471, 4860, 23021, 19088, 22869, 25568, -38667, -35705, -15304, 15653, 31320, 16243, -3344, -5659, -15988, -10888, -11196, -37490, -96356, -110973, -76292, -32911, -36373, -3148, 25494, 33984, -10206, 8031, 68784, 53815, 64567, 45284, 30073, 16262, 17881, 14509, 5378, -2689, 14615, -22569, -1046, 43269, 34896, 65022, 91775, 133051, 114267, 88396, 21644, -30454, -50784, -53055, 9158, 35168, 61615, 66022, 93274]
12269I3274K3585J1106l8460j9191k540n385k7521j8145n1099N716M1494j4497
12257a663l4582J9773J4217j209m064k9397J1240P204J7265L3059K912J479J3139
12244D9373m332j669q206r158M1069J9018K1220j202l6240m198k6772o4786k2433
12231d8316j5288r076K5984K1328j3291q092L07J5632k6797k1335k362K6234K0705
12218c4367N365L5035n619l5844Q52j3941L3699J2436J9168L8066J200j0431m0944
12205D675N356J0274k9669L427l1910J8070K1280M1055j0012l2977m8120n079
12193e3630K0451N680M690r937J6529L7842N4393k1973k4572k7776k8958O240
12181b1021K2932K6635j0790l6332J9627k2423m1524O3076N4297n5448n2010J3553
$$ y = [93274, 116859, 127965, 89505, 70314, 67774, 62389, 34868, 16723, -34376, -28660, 12834, -1663, -36245, -16472, -2255, -3464, -7528, -36925, -25685, -18481, -1216, 31843, 34755, 36234, 49373, 45041, 43372, 35166, 26008, 67077, 86095, 107315, 106113, 69873, 65675, 38903, -25883, -48316, -63604, -72680, -46696, -25368, -38659, -46751, -46444, -30812, -57609, -78944, -81306, -55072, -34367, -29002, 6033, 414, -35430, -34578, -48519, -14820, -2384, 16784, 54850, 56050, 45619, 4675, 10031, 20305, -9364, -5937, -37847, -19777, 1503, 42558, 32546, -431, -48551, -53630, -33179, -27499, -22809, -32746, -16217, 21625, 76018, 54045, 29473, 1697, -27261, -21021, 1911, 28546, 17756, -18576, 1051, -21372, -62896, 180, 54477, -971, -52981, -39428]
12169c9428K7550K5477M899J381j5426J7639J436l1009k0505K2221M7978j0362
12157C1851O638L8488l9961j9256K813K5008R37j0257l6735M2160L3510m6440
12145B8756n4855P743J27K5225P9836j7882r344k929k4657j0471j3272m986J6105
12132A9396K5163L6614L3308n3299q9766l6203K8592L2174J4212J4485k1277p032
12120c633n206J0048J7616j8579L2814K1840k1653j824m536J477L0279J2869L481
12107G4993R22l0202l3367l4255k3905M3535Q9674J1922k3374l2667k0272K7436
12095E0440J9922P165o396R632o0429k8053j5752N834N16k7877J2573J958J7480
12082a2987K7448l6862k3586j2161M0372O1128J7563k0494k0810l0747k3264l2670
$$ y = [-39428, -11878, 13599, 18498, 19879, 4453, 22092, 23528, -7481, -27986, -5765, 42213, 31851, 38489, 76977, 37016, 17760, 20573, 45581, 46518, 36261, -474, 41686, 75196, 28756, -26099, -18356, -18229, 6996, 86832, 68950, 59606, 56677, 32020, 21549, 8277, 3291, 19396, 44559, 81173, 114481, 61182, -28584, -64787, -36195, -4021, 10191, 24676, 3399, -3633, -8839, 1209, 18825, 246, 33060, 54900, 33247, 31423, 26887, 28364, 58643, 71512, 74993, 75915, 45713, 12346, -21909, -45814, -2279, 87395, 99317, 75943, 43276, 23004, 50440, 70362, 77527, 71131, 80763, 20334, -7719, -23471, -17637, -17121, -44998, -32425, -30467, -12987, 14461, -22401, -45987, -58148, -17776, 43352, 60915, 40421, 19611, -11136, -34400, -67070]
12070f7070j7873K2770J4688L2835J4983P0762N938n6580m2953P298p444N469
12058a7177M3769l098j7092M3857J9554l8632k8394j295m3815L0907K2463L226
12046A4273J972k2285k1799j8978K2117l0141K7969M7534L7537o374J6679K7245
12034I5749k2974l1018l9551K2529j7198o642L5184K1634M430k4549o0899j9699
12022d3004o444L0588N4158Q6430q990k4388j6501k3909l7816K0000j0139l4487
12010a4502l205K5789J1993M2834j5756K1106N699k2175k2700K7678L764q364
11998E2161J9m0065o570j6945j4968j2125K6939M9416K5268O845Q799K751m6392
11985C5133j1712K5601K8626J3633P691k2998m1064l506J933J7088Q292k0373
$$ y = [-67070, -84943, -62173, -47485, -14650, 333, 71095, 77033, 20453, -22500, -15202, -22646, -17177, 26592, 23494, 6402, 50259, 69813, 31181, 2787, 1492, -42323, -11416, 11047, 14273, 16245, -6040, -27839, -46817, -24700, -54841, -26872, 20662, 58199, 51825, 68504, 95749, 72775, 41757, 2206, 24735, 7537, 895, 36079, 57713, 62143, 37594, -23305, -43004, -49448, -18860, 35298, 121728, 112738, 88350, 71849, 47940, 10124, 30124, 19985, -14502, -17707, 8082, 20075, 62909, 47153, 68259, 73958, 51783, 29083, 56761, 60525, 52161, 52180, 12115, 5545, -11400, -26368, -38493, -11554, 37862, 63130, 69975, 78774, 81525, 35133, 23421, 49022, 77648, 91281, 98972, 75974, 34910, 31404, 33337, 50425, 58717, 38344]
11973C8344l6645J0k6912j263K8834N445M6822M2407q566l4024m0568l0109k7903
11960d4128j7818L610l3396M0749P2589J4545j5132K6043J7379j8991M783j6369
11948C3864l2556q516j4150K5164j401m620M3257N848K6728P73k8908m5745l1305
11935c1567j7649o912K2485P059Q409j982r931L1296l2040k1881k3473l109M9070
11922c0225J7861l6544J0576J4965L5048n236j3481k5408l6530p403N3146K6265
11910C034l3795r541j7071P6033O2074k2159j6038N772n6221J9460j587J9167
11898B9128K426m5914j2069j4089o739N5366K6786Q583j9223m2106j6994L0808
11886d037Q038j7162L21L275J8285n81J8525N378J7060l8771k1929K685k001J513
$$ y = [38344, 1699, 1709, -25203, -26466, 2368, 7813, 54635, 97042, 88476, 54452, 13884, -16225, -44128, -61946, -58336, -91732, -50983, 21606, 36151, 21019, 47062, 64441, 45450, 50233, 33864, 1308, -7208, -21358, 3806, 2405, -2215, 41042, 46890, 73618, 74391, 45483, -262, -31567, -49216, -56128, -33643, -26584, -18175, -20157, -30088, 1208, -30832, -52713, -76186, -79295, -30225, -12364, -48908, -38332, -23367, 11681, 6445, -7036, -32444, -68974, -76377, -23231, 3034, -30761, -40302, -57373, 18660, 80734, 58575, 42537, 48309, -7912, 11548, 9961, 29128, 31554, -14360, -26429, -40518, -47257, 8109, 34895, 43478, 24255, -17851, -34845, -4037, 4001, -13161, -12840, -9565, 8720, 8139, 26664, 32042, 49102, 10331, -11598, -8913, -10914, -9401]
11872i401k4206L3690M3347l8896n383L1597J3574k1511j9476L0719K6647N865
11860F6566n1012k3999j3077R431J3628J5841K5255m855k152j2608Q744p750K7079
11847E1091m35k7475O501L7391M365K8354k8784l2861m0347j0934j1873k4519
11835d9526K7095N399j1083j7959l22M8361M5249k6875m328N6793M8411l174p3384
11822D4657m1649L4329O083k871m224M3810J047m7332l0688l882j5754m2674J3634
11809d5514L8137j1624m548N64J3753k3994j5775J8221K8482J1961J1614K677
11797B3954m3930l249J3049J0398k8824J3806M2176m3091m2086N9832J4170k6042
11785i837Q79M7790J605j3371l6571j6342N904j166J4733l8423K8491K9972j1103
$$ y = [-9401, -33607, 83, 43430, 4534, -849, 30748, 44322, 22811, 3335, 34054, 60701, 66566, 15554, -8445, -21522, -12091, 1537, 17378, 42633, 37778, 35626, 23018, 31762, 24012, 51091, 50656, 23181, 29682, 67073, 71438, 99792, 71008, 38147, -2200, -13134, -25007, -49526, -22431, -17032, -28115, -46074, -46396, 1965, 47214, 20339, 16011, 72804, 121215, 118041, 44657, 3008, 37337, 43420, 40549, 36325, 80135, 81182, 33850, 3162, -720, -16474, -59148, -45514, -7377, -19001, -23549, -22985, -9232, -33226, -49001, -30780, -2298, 9663, 21277, 23954, -19976, -23225, -10176, 222, -28602, -14796, 27380, -15711, -57797, 2035, 16205, -9837, -8958, 38832, 40437, 27066, -9505, -25847, -19943, -21109, -6376, -44799, -16308, 13664, 2561]
11772B561l160J6008L6097L0998J0434P327k6251L651k0040k0497q914k8840r17
11759a543j317P585K780l865l9661K8971J2247j8118J9667K5697J1758P769k471
11746D9499m9853L712L0466j3868k7820r767K5865j614k5608O495j9275l6434
11734f8202L5691J1535N8073o345J0028R513k9557j1884j5639N0314L0076j6328
11722E7275p6195j6676L407p658L7780M478L4496m3253k5778M7081J9443j4279
11710B0121m884K8307j1445j2642l4853n2510j4860j0879Q440L2355k2587L2538
11698d2899M2025L8744M922l0375n1377k0257j1854M3727M9523K3679K053k5462
11686B2449K468m264l3648O017M1135M9979l4218k4463M3841j5067k0065j3283
$$ y = [2561, -599, 15409, 51506, 82504, 92938, 100265, 74014, 77665, 57625, 37128, 28214, -626, -1543, -2860, 4725, 7505, 3640, -36021, -7050, 5197, -12921, 6746, 32443, 44201, 51970, 49499, -354, 3358, 33824, 19956, -7864, -17631, 8234, 6620, -18988, -12493, -31768, -68202, -32511, -20976, 37097, 30752, 40780, 50293, 20736, 8852, -6787, 43527, 73603, 57275, -18920, -35596, -32189, -39847, -2067, 2411, 36907, -6346, -32124, 14957, 34400, 20121, 15237, 43544, 32099, 19457, -15396, -67906, -82766, -93645, -85205, -52850, -75437, -42899, -874, 37870, 42792, 12417, -38960, -59217, -71071, -27344, 22179, 45858, 47911, 22449, 24917, 20653, -12995, -6978, 34157, 84136, 49918, 25455, 69296, 54229, 34164, 20881]
11674B0881j4070N026M914K3383j8750j4973m3585j2159N4010L5557J4842l0680
11662B4396j7705k8062l6140J344n458j3857N8953K5781M936L382J6751q428j5852
11649A0041q157k520J2395j6512j0979K2221J1064j9849N525j8537K6869J8499
11637C0060j0058P593L453n5000l7490o396L2472R261R462K2150p257K8778J2844
11624C9872k2392J6515J119j1303J9368k5066k8407L298L7846n611k1172l4026
11612b9959j9867K5373N8733L2005k3839k4300n014M3049o330k2611o180k9519
11600h459j6345J9406K3527j0851k9978k1577J1871j5269j4179L4397J3953k0751
11588c4255j4615R952N9305L6127K8728J8571j8753j7322l248j844m5686M58J5612
$$ y = [20881, 6811, 11837, 16751, 40134, 21384, 6411, -37174, -49333, 4677, 40234, 55076, 24396, 6691, -21371, -57511, -56167, -61625, -75482, -16529, 9252, 14188, 17570, 34321, 25893, 10041, 1884, -636, 11759, -4753, -15732, 6489, 17553, -2296, 3229, -15308, 11561, 30060, 20002, 27595, 31048, -23952, -61442, -67838, -35366, -26105, -16643, 5507, -1750, 27028, 39872, 17480, 33995, 35114, 23811, 43179, 18113, -10294, -6996, 30850, 25239, 4067, -29959, -49826, -24453, 34280, 66285, 42446, 18146, 13132, 56181, 49851, 27240, 21060, -8459, -24804, -5398, 18129, 7278, -22700, -44277, -32406, -47675, -61854, -27457, -13504, -34255, -48870, -38918, 20387, 56514, 85242, 103813, 85060, 67738, 64490, 62646, 16960, 17418, 33030]
11575C3030k4758n849l2868p1J2221M1462J9898k4585k2408M1111K0621j1265
11563D6539N061j6953J2871j0049L5611l1496n055K4340J1238n605k7372l3662
11551E468M01j193K8531o597p200j0983M9601L7637j9722O456j5706j0515j5343
11538D0835m28m1573K2077J2509o8608k5628j6413L8054K7582n532J0830k9829
11526c6124k5930N4608M7479j009R08K1497n0002j7862j947j2697p549N794L0242
11513G408L1750Q449j3293k9719K2158M1542k5269q958J4256m2066k8596J4245
11501h093q94j2658j0596K2197L2576K043r900j968N6396M6530j9316l3493J5588
11488G8412n541l0480m7047j5414k5372J2484O9702l930N9021L2274l5917j7041
$$ y = [33030, 8272, 2423, -30445, -30516, -18295, 23167, 43065, 18480, -3928, 37183, 57804, 46539, 51600, 34647, 47518, 37469, 73080, 41584, 36529, 60869, 72107, 66502, 39130, 5468, 5869, 4676, 33207, 26610, 19410, 8427, 58028, 95665, 75943, 82399, 66693, 56178, 40835, 40407, -1166, 20911, 33420, -35188, -60816, -77229, -39175, -11593, -17125, -6295, -36124, -62054, -7446, 40033, 39024, 39932, 61429, 11427, -6435, -8382, -21079, -28628, -22834, 7408, 39158, 47607, 34314, 4595, 26753, 68295, 43026, 34068, 48324, 6258, -22338, -8093, -8987, -21645, -32241, -10044, 22532, 24575, 14675, 12707, 69103, 115633, 96317, 62824, 78412, 72871, 42391, -4656, -20070, -45442, -32958, 36744, 32814, 91835, 124109, 88192, 71151]
11476G1151J2878l3179m781k3524k4992j9673l0202J0043L2027L1077K3086j9370
11464B4541k6808j3300n695L4248r774k9949j0100K081J0235J7172j6457J6344
11452g462J1129K3051q427r702k4184K8691J3551j2271j4991O953O9735r630l491
11439F2952n719j55Q27L2023M281k5546k5954k9358n939m551m1254k4577K916
11426f0054L5386L1486J5806k6474K2037K3314N290k5354k7231p24L4149K0228
11414D7859j5728r680k5252O147M6548p976k2787j2119l7348R246N3605J9870
11402E2385J6864L84j2239m819q81J0833j8657n311P426l0628m6692k0990j0007
11389f2332q69K887O8518P0542p548l9282p036N48J4932k1211n252l337K0483
$$ y = [71151, 84029, 50850, 46069, 22545, -2447, -22120, -52322, -42279, -10252, 20825, 43911, 24541, -2267, -15567, -21262, 12986, 3212, -26737, -36837, -34756, -24521, -7349, -23806, -7462, 3667, 26718, 18291, 8589, -15595, 13096, 26647, 14376, -615, 6338, 76073, 66443, 62952, 57233, 57078, 57905, 89928, 94209, 68663, 42709, 13351, 7412, 2861, -38393, -62970, -60054, -24668, 6818, 22624, -3850, 18187, 41501, 46791, 21437, -5794, -6518, 27631, 47859, 32131, 22451, -2801, 3346, 49894, 41918, 19131, 7012, -30336, -21090, 32515, 52385, 69249, 69633, 57394, 52575, 51694, 62527, 43870, 38559, 45985, 15357, -31335, -52325, -62332, -63201, -60314, 8204, 78746, 71198, 31916, 24880, 25428, 40360, 19149, 13897, 10560, 31043]
11376C1043K4955J1034L6011k2188o7582o2504K5714R43P897p21J6652K6496j2474
11363A5276l771j6932q879l0755o046J1012P101J687P3272M3597P922k4771k5356
11350D3357q347L4969N893k5670m1328k1169J8234r631l5020M5509M7605j2359
11338D2043k4070N1918j0089N900L481j364k6493j9131k2833k98K3448l1914P810
11325a592p476M338L8367j892j0727K0151J9311j410o1099k1679M4503j2058k4474
11312a5737Q445K141J2867l7197M1648J3161j7930j0336R109n060k8753K0058
11300g584L0136n335R244J4354o638O256M510j3441j6356K020l4759k7095k8796
11287g3484J7830k670K9234n624K7161L7779K7908p458o568p073l0137j6823L6077
$$ y = [31043, 55998, 67032, 103043, 80855, 13273, -49231, -23517, -22574, -14677, -15398, 1254, 27750, 15276, 11505, -5427, -14306, -45061, -51107, -40095, -32994, -31307, 41965, 85562, 93484, 68713, 43357, 35010, 69979, 75872, 50202, 8874, -12295, 5939, -3692, -38712, 6797, 54402, 42043, 17973, 69891, 59802, 65702, 69183, 67819, 41326, 22195, -638, -936, 22512, -9402, -1592, -9068, -4730, 33637, 31745, 21018, 41169, 60480, 59070, -2029, -23708, 20795, 8737, -15737, -7292, -5151, 7716, -29481, 12167, 25328, 7398, -2938, 6171, 1111, -27642, -7584, 22552, 17217, 26461, 40815, 34177, 40433, 44943, 31502, 15146, 17166, -17593, -44688, -73484, -55654, -58324, -29090, -34714, -7553, 30226, 58134, 50676, 44108, 37035, 6898, -9925, 26152]
11274B6152J9596n428j323J2355j7040l3644k2570L549K9489j8320O879k5227
11262b5532J2795J4824j5448o409o098L9796M522k288J3481M4628q039l8580n3121
11249b5469N073J7329P577J9241k6661J6736K2655j9521k0157Q319K649j2163
11237d392j1875J1716M0591K3156k0649k4149R848j2361l2734J5099N7645L5735
11225H7630p012j6619q457k3977Q798j1398l4108j0975L8972J885l9887L1999
11213A6851M8035L2131R744n8934l9852k511J3694k3652j1611J1758J6703K0882
11201C3238K9197j934q71R408L0640m313j5472n3586m1007L592K9124O235L983
11188B8234L1104L5272k8976p030J0454k1520l2683k376K0123K2868K9077k9436
$$ y = [26152, 45748, 40320, 38997, 51352, 34312, 668, -21902, -18353, 11136, -7184, -305, -25532, -12737, 2087, -13361, -19770, -25868, 13928, 18450, 16162, 29643, 74271, 66232, 27652, -25469, -20396, -3067, 4510, 23751, -2910, 13826, 36481, 16960, -3197, 5122, 7771, -4392, -16267, -4551, 36040, 59196, 38547, 14398, 24246, 11885, -20849, -5750, 51895, 87630, 80618, 63999, 55542, 31565, 40363, 28965, -5143, -16118, 22854, 24739, -15148, 16851, 64886, 97017, 106761, 47827, 7975, 5464, 19158, -4494, -16105, -4347, 12356, 33238, 62435, 60501, 59630, 69038, 99678, 95365, 79893, 26307, -14700, -11108, 18016, 24251, 28234, 59338, 94610, 65634, 58604, 69058, 47538, 14855, 12479, 32602, 55470, 84547, 55111]
11176E5111n1452l9537O8775L8029K255m1371l5958K3517N4212K1740l3424l865
11164E8032j0173o804j8304m6532k3194L8649K4537j7827K2194O5804P821l8848
11152E5355l919J8161j4346J4739j3950m3407m748K2878J5808K4237J7601O624
11140I5033M4567J7867l4178n1839n1877K0093l485k3564n5830J1056L3426L0661
11128C1930p997K0520M1280j7997l7708k533k0748j7126K4102K8977R141n759
11116D6082l8799k3747L5077M0402j1871k6161J3552J4877k70k4272Q580K7422
11104F0872K1052O242l2333n6553K5336L3878M6224p979l6294k4416p197m8479
11092a9647M1307J6062q660M1676K0947J7399n414N418P95j1782L161j0396l6155
$$ y = [55111, 3659, -35878, 32897, 70926, 73181, 31810, -4148, 19369, 73581, 95321, 61897, 58032, 47859, 41055, 22751, -23781, -46975, -8326, 16211, -1616, 20578, 86382, 94203, 55355, 51436, 69597, 55251, 69990, 56040, 12633, 7885, 30763, 46571, 70808, 88409, 95033, 139600, 157467, 123289, 71450, 19573, 39666, 36181, 12617, -43213, -32157, 1269, 31930, 23933, 44453, 85733, 67736, 30028, 27495, 6747, -10379, 13723, 42700, 51841, 46082, 7283, -16464, 18613, 59015, 47144, 20983, 34535, 49412, 49142, 24870, 33450, 60872, 81924, 88166, 55833, -720, 24616, 58494, 104718, 96739, 60445, 36029, 28832, -19647, 21660, 37722, 29062, 70738, 91685, 109084, 103670, 109088, 109883, 98101, 101262, 90866, 54711]
11079E4711r689p317l706n3173j7175O267N5863J5838J9156J2389j998l4622o951
11066B9593L0622L3729j0067O848j8488l6123K3799o926m3074J4475K9501J5555
11054F9444L844k6327m0570j5496N968K3887l5127j0804M2037R475K554R667j6985
11041B1567j0937k9786k418j6268J4690J9304k774K7492K2992j7890k2992j2236
11029i256L1123r327k5160K7167L3264l558J0629N1449J1188j4171l1413n0705
11017B1230p660O2217K8271m5973k0201M918k119p156p390j1752n072J3926M0633
11004F3872l5905k5054k5746K9091M2709k8636M0257L4253k4343o439J6654l0751
10992D9962J5379K1866j0525m2205j8290J3866j5966Q488k1107j9273m6380L3606
$$ y = [54711, 45022, 37705, 33999, -19174, -36349, -30082, 25781, 41619, 60775, 73164, 71166, 36544, 29593, 60215, 93944, 83877, 90725, 72237, 36114, 59913, 52987, 9913, 24388, 53889, 69444, 73288, 46961, 6391, -9105, -3137, 20750, -14377, -25181, 16856, 26331, 28885, 38552, 21567, 10630, -19156, -21574, -37842, -23152, -3848, -6622, 20870, 43862, 25972, 2980, -9256, 21867, 12540, -12620, 14547, 47811, 44253, 54882, 106331, 117519, 103348, 71935, 21230, 13570, 75787, 104058, 58085, 37884, 42802, 40683, 33527, 26137, 14385, 9313, 23239, 63872, 27967, 2913, -22833, 6258, 48967, 20331, 60588, 94841, 70498, 64059, 80713, 49962, 65341, 87207, 76682, 34477, 16187, 30053, 14087, 22575, 1468, -17805, -64185, -30579]
10980c0579M9049J4793K9014O8510K8685j5229j1062K8906j3660m3627o1231l6570
10968F999n989K5312L3030K8073k161r4K3802l6977j6499J5557K060O926j781
10955G8258k6246l628j0081k9795p580O6839p655j2856r87k2854M932k000M6984
10942G3331J6126j7711p665k6496J5377k334J8379k992K0267m532j3640k4254
10930D3856J2214j9435l457Q078k3900Q730K5789l5671J1179o344j7039J5955
10918A9955K5778K0030J5372j292j2619J3189o973M1912J5421M6035J07755J37289
10906D21852J06175K13478K04922J02045R9502m6033n6990O3009M0356n8269j53790
10895I36257k34218j60483r6321n7392o5135n9996k8219l7090l1200k1353l8254
$$ y = [-30579, 18470, 33263, 62277, 130787, 159472, 144243, 133181, 162087, 148427, 104800, 43569, 6999, 1010, 26322, 59352, 87425, 85264, 85170, 108972, 71995, 55496, 71053, 73113, 80039, 78258, 52012, 48384, 38303, 8508, 928, 67767, 60112, 47256, 46269, 23415, 28347, 26347, 73331, 89457, 71746, 64081, 37585, 52962, 50628, 69007, 66015, 86282, 81750, 68110, 43856, 56070, 36635, 33178, 41256, 17356, 26086, 51875, 16204, 27383, 21039, 4000, 19955, 45733, 65763, 81135, 79843, 67224, 80413, 73440, 115352, 130773, 176808, 284563, 421852, 528027, 741505, 946427, 1048472, 1147974, 1101941, 1044951, 1107960, 1148316, 1090047, 936257, 702039, 541556, 445235, 387843, 322708, 262712, 234493, 197403, 166203, 144850, 106596]
10884A06596J6555K8623K8847K4777j8926l4523J5460p239m4531o3615n65K6125
10872G7584L5141n956O6429L2917k7431J2366q256l9264j9697l0198j7281O892
10860H3246J5628j1158J573K8049j3872K1233J9607k6927K899k3606p7058m4104
10848b4490n165N9992J332l3051j5326L6368j2226j2810k9192K2314M7511l218
10836C2039l2670K7983M1990P1191L9408j0024l8172n4069j3203L252K6644O251
10824A00620J4580K0844q007l897k4334k1952J9661P054M6753O3753K3973l6452
10812B02596m4626o138j3966l447j3654j2628n478k3063k7939k1346q812L3223
10800E4722J2425L7083K34k4509j4960o779R954J464k8851j3000Q731J3328L0297
$$ y = [106596, 123151, 151774, 180621, 205398, 186472, 151949, 167409, 160170, 115639, 52024, 51459, 77584, 112725, 106769, 173198, 206115, 178684, 191050, 182794, 143530, 123833, 93635, 76354, 83246, 98874, 87716, 89289, 117338, 103466, 124699, 144306, 117379, 120278, 96672, 19614, -24490, -29655, 30337, 31669, -1382, -16708, 19660, 7434, -5376, -34568, -12254, 35257, 32039, -631, 27352, 69342, 140533, 179941, 169917, 131745, 77676, 64473, 67725, 94369, 100620, 115200, 136044, 128037, 124140, 99806, 77854, 97515, 104569, 151322, 215075, 239048, 202596, 157970, 151832, 137866, 134419, 120765, 108137, 102659, 79596, 51657, 30311, 21499, 54722, 67147, 104230, 104464, 79955, 64995, 58216, 68170, 69634, 40783, 27783, 36514, 49842, 80139]
10787H0139j2043L608K0080L0949K2269J0193l6906J629j7305K962n765J3914
10775A13724P898L1887j5565l3812k2432L28K8949J9806P051N9349l561k26m4497
10762A48899k8346l4351J9474M042k892K1653J0308J645l749j989n017L8716P946
10749A76339k1997n234J8072k5796k8033O373K4606K4258K8103K1981Q003l0356
10737A96319k8486j3310J2647m087l8026j2151J9803K5861L2227K3579r557k1060
10725A83759L899j3716n746J4455M7117k4920l7045j2980M2078M1641k9610k2632
10713A86300j0192n9106k4512m977K3364J5887j2282j0222K3152L5868q154m3856
10701A11270o3105M0207N9466K2169m0819j2894K0696J557K7413N371J4682R003
$$ y = [80139, 68096, 71704, 91784, 122733, 145002, 155195, 118289, 119918, 102613, 105575, 99810, 113724, 121622, 153509, 137944, 104132, 81700, 82028, 110977, 130783, 137834, 197183, 193622, 193396, 148899, 120553, 86202, 105676, 109718, 106826, 128479, 138787, 140432, 136683, 134694, 129677, 168393, 176339, 154342, 149108, 167180, 141384, 113351, 119724, 144330, 168588, 196691, 218672, 226675, 196319, 167833, 154523, 167170, 163083, 125057, 112906, 132709, 158570, 190797, 214376, 204819, 183759, 187658, 173942, 168196, 182651, 229768, 204848, 167803, 154823, 196901, 238542, 208932, 186300, 176108, 117002, 92490, 87513, 110877, 126764, 114482, 104260, 127412, 163280, 155126, 111270, 48165, 88372, 147838, 170007, 129188, 116294, 136990, 138547, 165960, 171331, 186013, 195016]
10689A95016P4170K5219m9271n3277n2572n7175j781q620J7257J3630j4185J5650
10677A04061L5512N6243K0568L4359J182j4899K9616M286J9059O0861R8346J57191
10665F06385K40938L34455L02950J99213N6403q7887k12696l60575l50955k16768
10655E11463q9479q5194n7577j2011J2547k0942k2372l8716K0453j8928n8472
10644A40772K6046r983q565k938K0207K3206j4524o040j7977R531J4579K2399
10632A96713L0032M4380j7975K7689L8212K2225N993j7672J848N3191O0071k7295
10620D17412l1651r378j9097k3945n4811j5031M2686N544k7724j9186L5879o995
10608B93703m5471r269J0200K5739N3162P618m088m1135k980J50m6113j9297j4398
$$ y = [195016, 269186, 294405, 245134, 191857, 139285, 82110, 80329, 71709, 88966, 102596, 88411, 104061, 139573, 195816, 216384, 250743, 251925, 237026, 266642, 270928, 289987, 350848, 449194, 606385, 847323, 1181778, 1484728, 1683941, 1740344, 1652457, 1439761, 1079186, 728231, 511463, 421984, 336790, 279213, 267202, 279749, 258807, 236435, 197719, 218172, 199244, 140772, 166818, 156835, 148270, 145332, 165539, 188745, 174221, 168181, 150204, 159735, 174314, 196713, 226745, 271125, 253150, 280839, 319051, 341276, 347269, 329597, 331445, 384636, 444707, 417412, 385761, 376383, 357286, 333341, 278530, 263499, 306185, 311729, 284005, 264819, 300698, 293703, 248232, 238963, 249163, 274902, 328064, 335682, 331594, 290459, 287479, 287629, 241516, 222219, 207821]
10595B07821n763M2724L3652L2747J0606m0088j2894L700K5906K6164J6951K7172
10583C68698p486r358j7589J1826K6365J6778l073m408K6023K3546j9524J32J6791
10570D28721K0739N6447M5500L5299L95K8489O5204q399j8432k9753k7192l9343
10558E57675K2464N9727m6093k2274K9852P1822M863L0237O4310L019N703L5452
10546H16757L9225J0276J200l2631n268N6393O5324M0604p132M9973N6972L8105
10534A129798L8160K3953N5043O0180Q1363R6217J00602J34089J61141J12517
10524A993063J56094K17376K58149K67019L36164L92378M14759M16041M34113
10515D885156M13425N11094O47879P58009Q37983Q73470R89574J267284J630942
$$ y = [207821, 202058, 244782, 278434, 311181, 321787, 281699, 268805, 272505, 298411, 324575, 341526, 368698, 361212, 351854, 334265, 346091, 372456, 389234, 386161, 381753, 407776, 431322, 411798, 411930, 428721, 449460, 505907, 551407, 586706, 587101, 615590, 680794, 672395, 653963, 624210, 597018, 557675, 580139, 639866, 593773, 571499, 601351, 673173, 678036, 708273, 772583, 775602, 781305, 816757, 855982, 866258, 867458, 834827, 829559, 885952, 951276, 991880, 984748, 1034721, 1091693, 1129798, 1167958, 1191911, 1246954, 1307134, 1388497, 1484714, 1585316, 1719405, 1880546, 1993063, 2149157, 2366533, 2624682, 2891701, 3227865, 3620243, 4035002, 4451043, 4885156, 5298581, 5809675, 6457554, 7215563, 8053546, 8927016, 9916590, 11183874, 12814816]
10506A2814816K253063L306829M951886P734220J2320825J9429335K8835106L8561619
10498A30207699M2675308L1004180O662957j0996452p208302O667915O254490
10491B05267795j5315340l8819375m4581146l2949995j8430100q077765j973661
10484D5120413k20979l084256p229767q821229p111577m600750k891626j951325
10476I208904j334029r71974q15352p02418m92684l28744l08113m69554n32916
10467C253120m78941l47901k34039j19024j21031j32524p8033q6803j13239j05697
10457A435888j41595r3266q7837o9735o9887k5673m9641q7514n9272l4609l4524
10446F82335m4079o3961p7724j9905j4504j2955M2r799j957k4882n165k337J5297
$$ y = [12814816, 15067879, 18374708, 23326594, 31060814, 43381639, 62810974, 91646080, 130207699, 172883007, 203887187, 210550144, 199553692, 192345390, 199013305, 205267795, 189952455, 151133080, 106551934, 73601939, 55171839, 47094074, 45120413, 44899434, 41815178, 34585411, 25764182, 18652605, 14051855, 11160229, 9208904, 7874875, 6902901, 6087549, 5385131, 4892447, 4563703, 4255590, 3786036, 3253120, 2774179, 2426278, 2192239, 2073215, 1952184, 1819660, 1741627, 1654824, 1541585, 1435888, 1294293, 1201027, 1113190, 1043455, 973568, 947895, 898254, 810740, 751468, 716859, 682335, 638256, 574295, 496571, 476666, 462162, 449207, 449249, 439450, 437493, 412611, 407446, 405109, 420406]
10433D20406k0389J444k6852l4343l0582K1406L1073J878K232O995J782k7744
10421C47306k1075j5689l7995n2285m0203O314J8763M6060L0900K2617L8354N1138
10409C94205m369l4362k9330n802J2465J6777j6214l0978l1789O125J8844Q506
10397C04078N3266L3125K8847o1098j3920M1537J2537k1358K0028P874j2030L1551
10385D24437L8563k4961o3027L209m176J7560j0290m3031P978K2066L7938k5458
10373C80808n9255K5792N7119M9233M5497J4889j7969k5253m1687j4144j6287
10362C98743n9319j0400k5645j2600n630j4472j3098J6768l850K1482L4584r825
10350C16738j0814l4182P159n940j0570n156K4825P4754M3529K4076K0306l2373
$$ y = [420406, 400017, 401461, 374609, 340266, 309684, 331090, 362163, 364041, 366273, 373268, 375050, 347306, 326231, 310542, 272547, 220262, 180059, 186373, 205136, 251196, 282096, 304713, 343067, 394205, 389836, 355474, 326144, 320342, 332807, 349584, 333370, 302392, 270603, 276728, 295572, 304078, 357344, 390469, 419316, 358218, 344298, 385835, 398372, 377014, 397042, 404916, 392886, 424437, 463000, 438039, 375012, 378221, 374045, 391605, 381315, 338284, 346262, 368328, 406266, 380808, 321553, 347345, 404464, 453697, 499194, 514083, 496114, 470861, 429174, 415030, 398743, 339424, 329024, 303379, 290779, 285149, 270677, 257579, 274347, 270497, 291979, 326563, 316738, 305924, 271742, 278901, 272961, 262391, 257235, 282060, 356814, 400343, 424419, 444725, 412352]
10338D12352L562K0547L6478j6800j6315J888j2437K1117L8341K7145R43q311
10326E08510N586O9184M1730j1750m608J9881K4803K5562l576K6208L4518L5996
10314G72044j5095J9508M4568L2527M7728o4134m8680q170L898Q3689N6473P8211
10302A002567N7015K1970Q50M4732O2335R7456J08333J09577J61332J83330J32990
10291A982487J66180J77994J55540J39320K15612K88003M50489N52623O82218
10282D810466P28151P01300N83992N42677N89991Q96924J475562K334910L679330
10273A6343303N392547P158971Q452259P496389L774651J020692L479887J1938265
10265F5056964K4262954L8999080N3037419N7454060M2128535J3335716j6985395
$$ y = [412352, 415914, 436461, 472939, 456139, 439824, 441712, 429275, 450392, 488733, 515878, 516821, 508510, 514096, 583280, 625010, 613260, 608652, 628533, 653336, 678898, 675322, 701530, 736048, 772044, 756949, 776457, 821025, 853552, 901280, 837146, 788466, 780296, 784194, 867883, 924356, 1002567, 1059582, 1081552, 1082402, 1127134, 1189469, 1286925, 1395258, 1504835, 1666167, 1849497, 1982487, 2148667, 2326661, 2482201, 2621521, 2837133, 3125136, 3575625, 4128248, 4810466, 5538617, 6239917, 6823909, 7366586, 7956577, 8853501, 10329063, 12663973, 16343303, 21735850, 28894821, 37347080, 44843469, 48618120, 49638812, 53118699, 65056964, 89319918, 128318998, 181356417, 238810477, 280939012, 294274728, 277289333]
10258B77289333m3321009n9431561n7031450m0904241k4971631j4637368q961104
10251B8030969n956229m203945l137387k482473k063787j648898j345707r94121
10243F198422o71848m05827j90520o4725j21754k14705l41709m74881n24054m77166
10233B711233l96440l28081k77078j68032o2921m0749n1081q7514j25144n6244
10223A117949m3877r2028j12193n7479p0579l5251j8408o0743r629m0042l1653
10212E46067l7998j3473o6395o2401n602J0309r352k7955Q933J8720l2965k0469
10200C07419J332k3179L046l2615m0020m0249K8924j4087l9791r785o232m776
10188A29987j657J3976J0388l4233l0852o0751J2150N9854M1690L1014J695l1459
$$ y = [277289333, 233968324, 174536763, 117505313, 76601072, 51629441, 36992073, 28030969, 22074740, 17870795, 14733408, 12250935, 10187148, 8538250, 7192543, 6198422, 5526574, 5120747, 4930227, 4865502, 4743748, 4529043, 4187334, 3712453, 3188399, 2711233, 2314793, 1986712, 1709634, 1541602, 1478681, 1437932, 1386851, 1299337, 1174193, 1117949, 1074072, 982044, 869851, 812372, 741793, 706542, 688134, 627391, 617762, 577720, 546067, 508069, 494596, 428201, 365800, 360198, 370507, 361155, 333200, 342133, 360853, 327888, 307419, 308751, 285572, 288618, 256003, 215983, 175734, 204658, 190571, 150780, 140995, 134763, 129987, 128330, 142306, 152694, 118461, 87609, 26858, 39008, 98862, 140552, 171566, 173261, 141802]
10176A41802J1928p22j2787Q925J3842M359m0605l2372K227K393j6598l587L3358
10163A12163Q464p268M845K6166R332j8779k4293j3489k7866j3955k2953o840
10151B5527j0036J8653R067k771J3751K5537O437j3515J5334K0041P962L3620
10139A49607K4319l054J600j1009J7233M7164j2866k5145J8062O127m5636j2753
10127A53649j0275j3222j8740k9486k3597J9503J6170o2042J1559j318m9630j4331
10115b1760M0867N983j9652J627m192j1896J7494J2928K3377Q578J7470J9371
10103I0195j2902n283P105J0248l0496P70P063k0496J0405M7834M0754J0475N0671
10090B06343Q7934J17163J77730J82983K00999R4310j3278k9208P2120L9545q767
$$ y = [141802, 153730, 153008, 140221, 149146, 162988, 167347, 126742, 94370, 96597, 98990, 82392, 78805, 112163, 120627, 113359, 118204, 144370, 153702, 134923, 110630, 97141, 69275, 55320, 32367, 25527, 15491, 34144, 43211, 40440, 54191, 79728, 86165, 72650, 87984, 108025, 115987, 149607, 173926, 170872, 172472, 161463, 178696, 225860, 212994, 187849, 205911, 212038, 166402, 153649, 143374, 130152, 111412, 81926, 58329, 77832, 94002, 31960, 43519, 42201, -7429, -21760, 19107, 25090, 5438, 7065, 2873, -9023, 8471, 21399, 44776, 53354, 70824, 90195, 77293, 72010, 79115, 89363, 58867, 59637, 66700, 46204, 56609, 104443, 145197, 155672, 206343, 294277, 411440, 589170, 772153, 973152, 1067462, 1054184, 1024976, 1097096, 1136641, 1127874]
10079A127874j18074k38167k11201j38166q1733o3118q4729m3348l3766L1006
10069A46578K4946J3719k1871n2227p769q787j3526j3386j940J8209J5640L9291
10057A38877K9315R051M6600R8982J36974K92816M63114O67620R61859l9904j230077
10046A575227p87218l43334j92706o9222k8944m6906l8522J8436l4746n6587l3247
10035c7769l2811L706K3005J5811L517J7680L4826l19l4828l1746N2860l424M67
10022A0975M216K0334N629l2648l571m493j8065J2307M8747n711j6422q206n0246
10009c7154l598j9553K4230M4070j8015l0184N660J2140l3107K331K0794k408
9997c4794o938M905k3230r48Q850N1915P150j878N696N783L7470j7069m3789j3629
$$ y = [1127874, 1009800, 771633, 560432, 422266, 340533, 277415, 192686, 149338, 115572, 146578, 171524, 185243, 163372, 111145, 103376, 94589, 81063, 67677, 65737, 83946, 99586, 138877, 168192, 177243, 223843, 322825, 459799, 752615, 1215729, 1883349, 2845208, 2805304, 1575227, 788009, 444675, 251969, 182747, 153803, 106897, 68375, 86811, 52065, -4522, -37769, -70580, -66874, -43869, -28058, -24541, -6861, 27965, 27646, -7182, -38928, 13932, 10508, 10975, 15191, 35525, 41154, 8506, 4935, 442, -17623, -5316, 43431, 37720, 21298, 13092, -37154, -40752, -60305, -36075, 7995, -10020, -40204, -34544, -22404, -55511, -53180, -32386, -34794, -41732, -36827, -60057, -61005, -52155, -240, 6910, 5032, 10728, 16511, 53981, 36912, -6877, -20506]
9983b0506L4870l2569j6201J0611k5678l1857o478M0528L7810j4378k687l3094
9971e9629n1332k2661K5765O4883P3517K9009l678k3867K591l6360m0329k0269
9959f2360p43j1468j5658K6548L9875M042K0322j6819k2123l543K7003L6670J3445
9946C5191j3045m8761m7836K4533L8274J9368J9940l7244k7173j897j3593P368
9934d4875R423N578L049J3624k928K3376m223j3021l7465M3921L4440k050j6910
9921A1939J1721L3541k5035j2716l3181J3068k3492L5200M7157L4604J6823k3349
9909H6280j0995l6872j1509k5212j9076q53M227O6216N5527j8436p2148j1811
9897E338j6039L2987J5077l9270j7400J6202K7666o2375j2154Q76J1622j8968
$$ y = [-20506, 14364, -18205, -34406, -23795, -49473, -81330, -87808, -47280, -9470, -23848, -26535, -59629, -110961, -133622, -107857, -42974, 30543, 59552, 55874, 32007, 34598, -1762, -42091, -62360, -63103, -74571, -90229, -63681, -23806, -19764, 558, -16261, -38384, -41927, -14924, 21746, 35191, 22146, -26615, -74451, -49918, -11644, 7724, 27664, -9580, -36753, -38650, -52243, -44875, -35452, -29874, -26825, -13201, -16129, 7247, 3024, -9997, -47462, -3541, 30899, 28849, 11939, 23660, 57201, 32166, 19450, -13731, -663, -24155, 11045, 58202, 92806, 109629, 86280, 75285, 38413, 26904, 1692, -17384, -18237, -14010, 52206, 107733, 89297, 17149, 5338, -10701, 22286, 37363, -1907, -19307, -3105, 24561, -37814, -49968, -49092, -37470, -56438]
9885e6438n0571N587N0099N8348K4724m103l3J2979K37M285j0581N973K3158p216
9871E6448l3686l5559n405N8978J8640K4511L4534N1244M4841L7346N1317R2803
9859C96012P9665J19568K30748L19355K53422J23518k5870j40242k76273l31286
9849G48617k67581j69613j17824l2808m3288l3335l3103l3318l2897m0646J196
9838e4600M7267J2751J9258J5198k6707m0281J5524L1222R874j6359L150L0826
9826D7123P637j3321o5555j6848Q6552J2370m8867k508j227k2934J2276K677j8003
9813b0628K4844k6412M4888m570j9063m3846n2357q999L6061K1487J4123K0846
9801a3626P335K388J1528k7294n5571n8096j2004J8584J3336N0127K889l366j0917
$$ y = [-56438, -107009, -101422, -51323, 7025, 31749, 27646, 27613, 40592, 40829, 45114, 34533, 40506, 63664, 56448, 22762, -12797, -18202, 40776, 59416, 83927, 118461, 169705, 214546, 251892, 303209, 396012, 475677, 595245, 825993, 1145348, 1398770, 1522288, 1496418, 1356176, 1079903, 748617, 481036, 311423, 193599, 160791, 117503, 84168, 51065, 17747, -15150, -55796, -54600, -7333, 5418, 24676, 39874, 13167, -27114, -11590, 19632, 29506, 13147, 16297, 47123, 54760, 41439, -24116, -40964, 45588, 57958, 9091, 6583, 5356, -17578, -5302, -2625, -20628, 4216, -22196, 22692, 18122, -941, -44787, -97144, -106143, -70082, -48595, -34472, -13626, -6291, -3903, 7625, -19669, -75240, -133336, -145340, -126756, -113420, -63293, -60404, -63770, -74687]
9788g4687K3737k552r400J0199L5157J3492m128j7720P462J4289M804k9409l0467
9775e9223O111j0291K2734P996o802j7816O714K4721k5860J8711N1365M274k7028
9762d394m2413K2391k6835r913M579N594K5887M7574L8800l427m3995l7616o744
9749c0512L4259K4384m2833J495n878P452l0018j0599N4168K6513j6109L052J9743
9736C5117k3588k6372m265L924J2165n3401o0311K3168M8789L6660K2068l5302
9724b1348j8767j9557o3069j9987N8617N8149K2758q223k1847m3270N693K6334
9712d4517J1523J7562K9166m66k6938m0902j1884K5623K4344J2794K2824m467
9700A4662k579l5419J8788L6958j1666m5878L4146M86p834j3850M149O890j303
$$ y = [-74687, -50950, -53502, -62902, -52703, -17546, -4054, -8182, -25902, -18440, -4151, 653, -28756, -59223, -53112, -63403, -40669, -32673, -39475, -57291, -50577, -25856, -51716, -33005, 18360, 22634, -4394, -46807, -24416, -51251, -61164, -56585, -50991, -25104, 22470, 61270, 57843, 13848, -23768, -30512, 3747, 28131, -14702, -13207, -19085, -11633, -41651, -52250, 1918, 28431, 12322, 15374, 35117, 11529, -14843, -19108, -15184, -3019, -56420, -116731, -93563, -44774, -8114, 13954, -21348, -40115, -59672, -122741, -142728, -84111, -25962, -3204, -11427, -33274, -76544, -70851, -44517, -32994, -15432, 13734, 13268, -13670, -54572, -66456, -40833, -16489, -3695, 19129, 14662, 12083, -23336, -4548, 32410, 20744, -25134, 9012, 9498, 1664, -12186, -8037, -1147, -2450]
9687b450l2157o093L4281O1338L9855l8355m6792l4541K1260L4728j1565n2129
9675c2620j9154M1740q040K1315k0955l5673J7800K2318k0334l9325K3899L1705
9663a7324o326j7948J0097K6039K4949j4653k8434L4032J3455k4559K0250j0134
9651I444l662o084K2105M7584j0706r717l4493m7042l4023n917N828J6725L0259
9638a9699k6247l552L2335n961j2592M744K5245R398k1022J511K8520L6010P422
9625E6112m479m9684j3034m1876k8408j8508m0730P619L0657K412J8422K6925
9613e4572J9411M1619L7483j8880o071j0053j359l0125no462K9154J6257P466
9600B3863j1850J0315j4215P954k3756l9490r201j6224j6416J610K5597L5736
$$ y = [-2450, -34607, -40700, -6419, 54919, 94774, 56419, 9627, -24914, -3654, 31074, 19509, -32620, -51774, -10034, -18074, 3241, -17714, -53387, -35587, -13269, -33603, -72928, -49029, -17324, -23650, -41598, -31501, -5462, 19487, 4834, -23600, 10432, 23887, -672, 19578, 9444, 5782, -302, 21803, 69387, 58681, 48964, 14471, -32571, -66594, -72511, -66683, -49958, -19699, -45946, -49498, -17163, -23124, -35716, -30972, -5727, 3671, -17351, -15840, 12680, 48690, 56112, 51633, 1949, -11085, -52961, -81369, -99877, -140607, -132988, -102331, -99919, -81497, -54572, -35161, 6458, 43941, 25061, 18990, 8937, 7578, -22547, -22552, -29014, 140, 16397, 23863, 12013, 22328, 8113, 16067, -7689, -47179, -56380, -72604, -89020, -87410, -61813, -26077]
9588b6077L0105l2980j9564l3577K2863l1148J5234J6265K338K3523N4686n359
9576A6309m3035k7930K6051O99j2056K6645L8024l9695Q301Q194O052j8302m4446
9563e5189l3720l5159j3517P3043P0742P626o36K3630J0032K161r9k4034l5252
9550a0372m3831j1003K0691J8460J9261K8512K0933j6873k2543j1614L6290M3483
9538G1394k9729l922J0971Q102j7367N235N113K6175L8350j2655m9970k040N447
9525E5104k0083j4674l525k7226k0920Q6718M6502o1378L971J2748k2135l4437
9513F65j960o355k8040L5680K272Q616m0885j630L5350n86j1092j0497j2789k0256
9499e1507J6757K1254k370L756J3505j4888j3904N7319L2452k2060p579j3766
$$ y = [-26077, 4028, -28952, -48516, -82093, -59230, -90378, -75144, -58879, -56541, -33018, 21668, 16309, -26726, -54656, -28605, -27906, -39962, -13317, 24707, -14988, -6687, 1507, 7559, -10743, -55189, -88909, -124068, -137585, -64542, 6200, 13826, 13190, 36820, 46852, 49013, 48914, 24880, -10372, -54203, -65206, -44515, -26055, -6794, 21718, 42651, 25778, 3235, -8379, 27911, 71394, 41665, 37743, 48714, 56816, 39449, 44684, 49797, 75972, 114322, 101667, 51697, 49657, 55104, 35021, 20347, 16822, -10404, -31324, 55394, 101896, 40518, 44489, 57237, 35102, 665, -1295, -7650, -35690, -10, 2262, 10878, -30007, -31637, 3713, 3127, -7965, -18462, -31251, -51507, -34750, -13496, -15866, -12110, 1395, -13493, -27397, 29922, 62374, 40314, 32735, 18969]
9487A8969N078n212k2425J6625L4975K4812k105p331K0828K4942n5844m4024J2513
9474B1801j1130O711L4135k4409k9316Q753N0471j182k2661J0325J9983J493j1793
9461E3181l0420k3099J1924M6698O6403J948k7109n9596n7212J5810j256j8776
9449b1504R269Q534L2105J7960l508L640M3231j5709m586j9014J4450L7819l373
9436I9314P680k2218j2758k1392J7305M3873k7323L787O3628N105l466n754m9025
9423I8756n9350j8565k02N6323J9399M0063M5824l4966l4533k4036N6289Q103
9411A53105m9303k3088K9777m8344q997K5341J7384M2340L9855j621Q040N593
9399A90082o99P083K5884O171k4901m1977q687J6948q146O13M999j6269M333N6655
$$ y = [18969, 24047, 18835, -3590, 13035, 48010, 72822, 70717, 63386, 84214, 109156, 53312, 9288, 21801, 10671, 17382, 51517, 27108, -2208, 6545, 57016, 55834, 33173, 43498, 63481, 64974, 53181, 22761, -338, 11586, 58284, 124687, 126635, 99526, 39930, -17282, -1472, -2728, -21504, -12235, -3701, 28404, 46364, 42856, 46496, 89727, 74018, 69432, 50418, 64868, 102687, 99314, 106994, 84776, 72018, 50626, 67931, 111804, 84481, 88268, 151896, 157001, 153535, 147781, 98756, 39406, 20841, 20639, 76962, 96361, 136424, 182248, 147282, 112749, 88713, 145002, 153105, 103802, 80714, 110491, 62147, 53150, 78491, 95875, 138215, 178070, 176449, 184489, 190082, 189383, 196466, 222350, 228521, 203620, 161643, 152956, 169904, 161758, 162371, 167370, 151101, 155434, 212089]
9385B12089Q04j6582l802r09k838P999j3405j7241K487R507k9834r735L38L4019
9371A72897j247r332l9440J4441P6327P4998J8789L7433M078j9727l2107p031
9359B90079o414L8432N3328L3923j8472O977o217k9131q785Q229j0560Q617M1579
9346D01585J3801J4361P758k5566m6160K4586K8129m420o817m088J1968N0543
9334D65680L3317O4167M3646j7903P780L1990R0M75m3593N995M2389P053n513
9321F35573J5858L9444M5279q711L511M5788O2917N0902P1303O1004k8040L4021
9309A028849K9655N6526P5130N1080K3141L1364K3381K0428P4631L4976K6315
9298A475476N4884R9823K9455K3184Q3530R1651L2113M4846J15229J38094M6034
$$ y = [212089, 212893, 196311, 192509, 191600, 188762, 196761, 183356, 166115, 168602, 178109, 148275, 138540, 138878, 172897, 171650, 162318, 122878, 137319, 213646, 288644, 307433, 344866, 348944, 329217, 297110, 290079, 283665, 322097, 375425, 409348, 390876, 397853, 391636, 362505, 353720, 361949, 351389, 360006, 401585, 415386, 429747, 437505, 411939, 365779, 390365, 418494, 414074, 407257, 403169, 415137, 465680, 498997, 563164, 606810, 588907, 596687, 628677, 628767, 629242, 585649, 591644, 634033, 641086, 635573, 651431, 690875, 736154, 727443, 730954, 776742, 839659, 890561, 961864, 1022868, 994828, 1028849, 1058504, 1115030, 1190160, 1241240, 1264381, 1295745, 1319126, 1339554, 1414185, 1449161, 1475476, 1530360, 1630183, 1659638, 1682822, 1766352, 1858003, 1890116, 1934962, 2050191, 2188285, 2234319]
9287B234319Q5749Q0103R5420R3026J08111P6379M4682P7223P3210Q4007O1402
9276C113631O3397Q8704P4441M7851O6612N6184m053J9416q445k6199n823l1600
9264C454116q8047o6385m1073l7852Q75p2484j05674o7478m7041j03446j00135
9253B725376r8418l4697p1378o1607o0177j01576j20072q9466q7888o3974r4702
9242A841421o4263l9288o0593k1274n7894p1770r901o3299p0513m8057o3511k4496
9230A246562l4406q7057n4194l4075k9707k6136k4546m0374m1051m0419k150K1157
9218H53604m3888j0287m2615j4455l454m6405l2256o501L2253J896l32l8548q6641
9205E62371r0057J3939O968m2252n367K0654m909M052J8902j6622r472l8863k0563
$$ y = [2234319, 2320068, 2400171, 2495591, 2588617, 2696728, 2773107, 2817789, 2895012, 2968222, 3052229, 3113631, 3177028, 3265732, 3340173, 3388024, 3454636, 3510820, 3506767, 3526183, 3517738, 3491539, 3485716, 3454116, 3366069, 3299684, 3258611, 3220759, 3221634, 3149150, 3043476, 2975998, 2928957, 2825511, 2725376, 2626958, 2592261, 2520883, 2459276, 2399099, 2297523, 2177451, 2087985, 2000097, 1936123, 1841421, 1777158, 1737870, 1677277, 1656003, 1598109, 1526339, 1516438, 1453139, 1382626, 1334569, 1271058, 1246562, 1212156, 1125099, 1070905, 1036830, 1007123, 980987, 956441, 916067, 875016, 834597, 832447, 853604, 809716, 799429, 756814, 742359, 738905, 692500, 660244, 653743, 685996, 687892, 687560, 649012, 562371, 472314, 486253, 493221, 450969, 445602, 466256, 461347, 465399, 484301, 467679, 458207, 419344, 398781]
9192C98781k6392J0963K8469j35j8605j2860m8745m6129j808r63O294m455M499
9179B88914j4524k0649K679J5056j4530k3000l0602n4476j365M0495N5528J6020
9167B59546l3897p8852J4759R8741j401m8939m6528K3669m688R903k819l4835
9155A54659j5127o043k4310J8297M5379j0734J062M320k1536M14r053l8851K6025
9142A24502K8375J862J0507M9137M5588R074k3860l3441l7822l8185m5792j9267
9130G0678J1940O0463l0554m3860o404L9269N861J639M2286k9810k4144M7246
9118A44610N848l6167J0578J6562L005k893l5614l7687p199N3723k8768j1983
9106G4015j6066p324k8557K1092L850K9771k140L4373K1138J487q271l9700K1643
$$ y = [398781, 372389, 383352, 411821, 411686, 393081, 380221, 331476, 285347, 283539, 282576, 288870, 284415, 288914, 274390, 253741, 256420, 271476, 256946, 233946, 203344, 148868, 147503, 187998, 243526, 259546, 225649, 146797, 161556, 260297, 258896, 209957, 163429, 187098, 182410, 192313, 189494, 154659, 139532, 133489, 109179, 127476, 172855, 162121, 163183, 167503, 145967, 146381, 137328, 98477, 124502, 152877, 154739, 165246, 214383, 259971, 269045, 245185, 211744, 173922, 135737, 89945, 70678, 82618, 143081, 112527, 68667, 62263, 101532, 107393, 109032, 151318, 121508, 97364, 144610, 150458, 114291, 124869, 141431, 144436, 141543, 105929, 68242, 61043, 114766, 85998, 74015, 57949, 50625, 22068, 43160, 47010, 76781, 74641, 109014, 130152, 131639, 123368, 83668, 105311]
9093A05311m078j6799j9379K5791j4290p141j7055k3709k8413J5533P3332K3095
9081A12198k3515m6653P84K98k9708K0213m3358K2116O1923N1245J8727l9347
9069A04923o4041M933J3887K075j5063J4585M737k418n3445k216m565k0077k3605
9056d0290k1480J3586L0006L3830L5003l9097o1716N997L6987M5292j0489k4084
9044C545J8674L5525p70J8361M8k6714J0218j0005m6003N5245M2055l1340n766
9031F3073J4292k7776j824J4925k3208J0174J8696j3126j9377K2322m50l8357
9019A9364R818k2152J0895O910J9327L6604m0430n9766M551K8447l0730j9669
9007c6831j3700N2378K6223j2174L719M1929J2865j3135N996j4719k1607m2631
$$ y = [105311, 101233, 84434, 65055, 90846, 76556, 69415, 52360, 28651, 238, 15771, 89103, 112198, 88683, 42030, 42814, 43112, 13404, 33617, -9741, 12375, 74298, 125543, 144270, 104923, 40882, 45815, 59702, 61777, 46714, 61299, 66036, 63618, 10173, 7957, 3392, -16685, -40290, -61770, -48184, -18178, 15652, 50655, 11558, -50158, -44161, -7174, 38118, 27629, 3545, 22219, 57744, 56974, 75335, 75383, 48669, 58887, 48882, 2879, 58124, 100179, 68839, 63073, 77365, 49589, 47765, 62690, 39482, 49656, 68352, 55226, 35849, 58171, 57721, 19364, 29182, 7030, 17925, 24835, 44162, 80766, 40336, -19430, -14879, 13568, -17162, -36831, -50531, 1847, 28070, 15896, 19615, 61544, 74409, 61274, 67270, 52551, 30944, -11687]
8995a1687j5176j043j6864N205k732J4331P8226R143l8955m7226m6949l125M9702
8982b7150L0640M041k0160J940Q01J4520J1784j1367K855r778j3864j6174K966
8969b8946O2293M4437o8561l3941R1230K5919o0980l9298j5855J7455J9490J3846
8957B7089L5256k3098n922K3504K226j6644j7974o383P135l327j049j6826J915
8944E902k883l934j5458N458Q685p153J5304r22L1760J2571j6327j6440K2175
8931C8738J3035M5413O820m4373n7716J2765K790k0759k8245L5469Q152n1347
8919c9258K886l6483L1014K8227j0775J2780J8850J7450K8869q738j9535n0602
8907b5315m5676o375J5117r485J0630J0579J3440K0609o152O981J2140l6253K607
$$ y = [-11687, -26863, -27906, -44770, -39565, -42297, -27966, 50260, 59403, 20448, -26778, -73727, -76852, -27150, 3490, 7531, -12629, -10689, -9888, 4632, 16416, 5049, 7904, -1874, -15738, -31912, -28946, 33347, 77784, 9223, -24718, 66512, 92431, 31451, -7847, -23702, -6247, 13243, 27089, 62345, 39247, 33325, 56829, 59055, 42411, 24437, 18054, 25189, 21862, 20813, 3987, 5902, 3019, -915, -16373, -10915, -2230, -9383, 5921, 4999, 36759, 49330, 33003, 16563, 38738, 51773, 97186, 104006, 59633, 1917, 14682, 17472, -3287, -31532, 3937, 12089, -39258, -36372, -72855, -41841, -13614, -24389, -11609, 7241, 24691, 53560, 44822, 25287, -25315, -70991, -77366, -62249, -71734, -61104, -50525, -37085, -16476, -22628, -15647, -3507, -39760, -37153]
8894c7153K4553K7870Q165k4901J8495k5032J5226J0044J6598J5156l8052k5101
8882a4132Q597K074l7337l5627m6067L0515K4070L3517M3175J8504Q879k748J5688
8869D9108l0433K0220M6032M5056J29k0414q723n3710j8806M7329J6083j7069
8857G4802l2768j6559j0534M186j921N2504K9373k0223k1408p17J4537j5679m3438
8844A2155j5270o972P450J5920j4025l4614L7951N2532j0745j7063j8138r231
8832e0m7910l2088K5293J6989L8661K5317j0554l7132m6625j0039M6212N7272
8820B5346N87q823Q005J3613Q125J7924k2997m1857l1015r541L987k1620m585
8807f2851J0311M1385O620L6443L167j56l0546n667k8288O23K6897K0205l899
$$ y = [-37153, -12600, 15270, 23435, -1466, 17029, -8003, 7223, 17267, 33865, 49021, 10969, -14132, -5535, -3461, -40798, -76425, -122492, -91977, -67907, -34390, 8785, 27289, 36168, 33420, 49108, 18675, 38895, 84927, 129983, 130112, 109698, 100975, 47265, 28459, 75788, 91871, 74802, 42034, 25475, 14941, 19127, 17206, 69710, 99083, 78860, 57452, 56735, 71272, 55593, 12155, -3115, -10087, -2637, 13283, -742, -35356, 2595, 55127, 44382, 27319, 9181, -50, -47960, -80048, -54755, -37766, 895, 26212, 15658, -21474, -68099, -78138, -31926, 25346, 25933, 17110, 25115, 38728, 46853, 64777, 41780, -77, -31092, -40633, -36646, -58266, -62851, -52540, -11155, -4535, 31908, 35075, 34919, 4373, -1294, -29582, -28959, -2062, 18143, 14244]
8794A4244J9296j8113O620k1923l4325K793J638r403K1960K2704O460J0975N128
8781B8054j9591J6920j777k7311O078l2581k783L4687k599P376J3646k3684R168
8768E603J2510K7705p331J4289r501j8038k9093m7834J5123J8889K6823R445j8453
8755A37L1438j8660r943J4398L653J6845r083m5149J3243j9086K2639M6931J5293
8742F2656j4207k2440K995J3544j4554l897m2213j7703K3632K4816J4285L10q65
8729B6359K6984r28p118k4630m4964J5959M0953K3043K0360J4791p369m238K9973
8716A09175l8468k1786k0221m2095n565K1550L6855q140k1454q239n500l345M5052
8703C7819K458l2167K6401M006J202N2672M261k3932K3428J5016l032l9031K675
$$ y = [14244, 33540, 15427, 22047, 124, -34201, -31408, -29770, -39173, -17213, 5491, 11951, 22926, 28054, 8463, 25383, 23606, -3705, 2373, -30208, -32991, 1696, -903, 6473, 20119, -3565, 5603, 18113, 45818, 38487, 52776, 43275, 25237, -3856, -51690, -36567, -17678, 9145, 18590, 137, 31575, 12915, 2972, 17370, 21023, 37868, 28785, -16364, -3121, -22207, 432, 47363, 62656, 48449, 26009, 29004, 42548, 27994, 24097, -18116, -35819, -12187, 12629, 26914, 27224, 26359, 53343, 52415, 45297, 20667, -24297, -8338, 32615, 55658, 76018, 90809, 83440, 79202, 109175, 70707, 48921, 28700, -13395, -18960, 2590, 39445, 31305, 9851, 1612, -3888, -7233, 37819, 40277, 8110, 34511, 38517, 39719, 92391, 96652, 72720, 96148, 111164, 108132, 69101, 71776]
8690G1776K7377J5779n913k9710j777K2131Q358j5008l1730k425L7634m418r570
8677H2504J0770j3981K3502k2330M518N543k8531k3231L4912K339L4480O003J1073
8664A27571m1692k1090M4409m193l0467k5592N054N6092l0492J2760k006R638
8652I9992J7170K0365n0633K3285j9001M3997m5139O080J4532j6723j663j0204
8640H2058j3710J848O1770J2071k3257k991L0881R499J0456J0195J632L8276K9728
8627B48456M0064k4634J6057J3186K5757O2202K0271K0291L0328J9144n913l4283
8615D30926N580k2458q793j9741J9301l2208o2043k7132j0047M393K6186j8065
8603B85899L1058n760o479k2623j6908j4237J8041k046q560j7152m1935O601l0445
$$ y = [71776, 99153, 114932, 109019, 79309, 77532, 99663, 108021, 93013, 61283, 58858, 96492, 92074, 82504, 93274, 79293, 102795, 80465, 84983, 90526, 61995, 38764, 73676, 76015, 110495, 116498, 127571, 85879, 64789, 109198, 105005, 74538, 48946, 54000, 110092, 79600, 92360, 90354, 99992, 117162, 137527, 86894, 110179, 91178, 135175, 90036, 96116, 110648, 93925, 92262, 82058, 68348, 70196, 131966, 144037, 120780, 117789, 148670, 158169, 168625, 178820, 180452, 218728, 248456, 288520, 263886, 279943, 293129, 318886, 381088, 401359, 421650, 451978, 471122, 465209, 430926, 436506, 414048, 405255, 385514, 404815, 372607, 310564, 283432, 273385, 277778, 303964, 285899, 316957, 311197, 304718, 282095, 265187, 250950, 268991, 266945, 258385, 241233, 199298, 205899, 175454]
8590A75454m201l173j3576l145n0961l6402L934J8964p620K1558K2639r589j6772
8577I7110O392R778n1742j3017k6775k6351j2080K0799L7562j3458Q33L110O098
8564C8259M2707K0309J3842L886k5830J882J3567k5724k7815k170p487k1812k2351
8551A263o480K228n565O685K6981K6408P578k8601j3231r288QQ892L4506m6253
8537E131l6091j5629k6167L7645M8001J3545j4692k2633k1180q815J632L919j4475
8524d9809j9881K8259j1358J147Q542J7009K6531J3880K2770k4074k3219j1879
8512b2082L2105N684K6944M621l973k0309j4040m509m065K1663M9873k8074l8224
8499E614j84n396K162k5125L9258L7516j4351O630l8258o5560m666N7176k4835
$$ y = [175454, 171253, 168080, 154504, 151359, 100398, 63996, 67930, 86894, 79274, 100832, 123471, 113882, 97110, 103502, 113280, 61538, 48521, 21746, -4605, -16685, 4114, 41676, 28218, 29051, 32161, 38259, 80966, 101275, 115117, 119003, 93173, 95055, 108622, 82898, 55083, 52913, 45426, 23614, 1263, -5217, -2989, -8554, -1869, 25112, 51520, 59098, 30497, 17266, 7978, 7986, 16878, 51384, 5131, -30960, -46589, -72756, -35111, 12890, 26435, 11743, -10890, -32070, -40885, -39253, -35334, -49809, -69690, -41431, -52789, -51642, -43100, -26091, 440, 14320, 37090, 13016, -10203, -22082, 10023, 15707, 42651, 47272, 43299, 22990, 8950, 4441, 376, 22039, 71912, 43838, 5614, 5430, 34, 2196, -22929, 16329, 53845, 39494, 46124, 7866, -57694, -62360, -5184, -30019]
8486c0019j1139j9668m1639J1243J9160K5021L6042J5446k77k056K2596q276k9132
8473a2698j6006L2734J8803j9882l8918j5077K4495J0566J2205J1502K2602J7770
8461D8096K5400m2461J772M316K5637j4435J7145k723j8313L493j8057J0413n2596
8448a2313k1685q76J1822K4588k03K4638j3912M942J6343k9543n025M5448P996
8435E2220k0935m6500j7161O874M4690J8401m9023k0879m908K6739Q55L1810L5386
8422E7569K3716K3044m1179m4833J0162N430N0931l8095m4133R320k4366j8547
8410c0981L3375K7804p120j2849J7764j5670n8399K8152L6266j6491n913j0892
8398a4954K8441m853J0784O122J7786j5720k7690o647Q323J9668k1989m9711J0138
$$ y = [-30019, -41158, -60826, -102465, -91222, -72062, -47041, -10999, 4447, 4170, 2114, 24710, 16434, -12698, -28704, 4030, 22833, 2951, -35967, -51044, -26549, -15983, -3778, 7724, 30326, 48096, 73496, 31035, 32807, 37123, 62760, 48325, 65470, 62747, 44434, 47927, 29870, 40283, -12313, -33998, -34874, -23052, 1536, 1333, 25971, 12059, 17001, 33344, 3801, -1224, 44224, 52220, 31285, -15215, -32376, -25502, 19188, 37589, -11434, -32313, -37221, -10482, -9627, 22183, 57569, 81285, 104329, 63150, 18317, 28479, 33909, 84840, 46745, 2612, 11932, -12434, -30981, 2394, 30198, 23078, 10229, 27993, 12323, -46076, -17924, 18342, 1851, -4062, -14954, 13487, 8634, 19418, 25540, 43326, 27606, -84, -6731, 1592, 21260, -729, -50440, -40302]
8385d0302J6395K0440L389L3193K8120m10J5352R263m5014j7124M1868M3279k2478
8372H5971k0570l3233j6834j5127l1653J139K5058m710p498Q640J8437J83k2374
8359a2571M28L3371P303k110k121j5278M122m977j8310L1792K3528j9997K3540
8346D8720L9596l1588l2679O983l0225L894K0796J2515J4733k0004k0725k4449
8334a2433K1987R579o423M2695L658k4621j4829R49J7356k5724j3485J7367p903
8321H173j9951P736M0104J2393n668l1674k4948L6888M0860p185K1269j5700k3563
8308C8734l3298K4679M6883k4390n6198n1349j775J0321J903j8851Q353k1282
8296g6270K7745K6919o809K453L6957K2430M55K1456K1448k5153l8212k3241Q375
$$ y = [-40302, -23907, -3467, -78, 33115, 61235, 60825, 76177, 85440, 40426, 23302, 65170, 108449, 85971, 65401, 32168, 15334, 207, -31446, -30307, -5249, -9959, -17457, -8817, 9620, 9803, -12571, -12143, 21228, 28531, 26421, 24300, 9022, 13144, 8167, -10143, 21649, 45177, 25180, 48720, 88316, 56728, 24049, 31032, 807, 4701, 25497, 38012, 52745, 32741, 12016, -12433, 9554, 19133, 12710, 55405, 59063, 34442, 19613, 20562, 37918, 12194, -1291, 16076, 8173, -11778, -4042, 36062, 48455, 42787, 11113, -13835, 23053, 63913, 56728, 77997, 62297, 38734, 5436, 30115, 76998, 52608, -3590, -54939, -56714, -46393, -44490, -63341, -54988, -76270, -48525, -21606, -28415, -25962, 10995, 33425, 33880, 55336, 76784, 51631, 13419, -9822, -1447]
8283a447k2212J7990K4997j3637j3393L5151k0317q818L3469M468P512K8982N172
8270G7917J1358k1243m8461n4845j7895k8954J6780L7047J5177m1351K4164N6182
8258B5876m3177m6517j7475M3253J4923P343J6284n230J6548m022q303J7739Q6237
8245A03479R485l7685l3774j8400k35m1117j1343L1678J3658j3640J8639N8624
8233G9369K459j3377k3609k4379j5848l5615R571l8690l5525J1060q17m9971j9561
8220a54933L9898O2654N8949J8762J3743j254K5004k3153R510N663R197k1247
8208D2793N516R068K9849n345r592k4936k4240M699j9357N097o455M332J0101
8195B1530l5147j3248N401K3316R213r940n962K3511O07K7217R822O596m475k2812
$$ y = [-1447, -23659, -5669, 19328, 5691, -7702, 27449, 7132, -1686, 31783, 36251, 43763, 72745, 77917, 89275, 68032, 19571, -35274, -53169, -82123, -65343, -28296, -13119, -54470, -30306, 25876, -17301, -63818, -81293, -38040, -23117, -15774, 510, -4720, 11828, 7806, -497, 17242, 103479, 112964, 75279, 41505, 23105, 22870, -18247, -29590, 2088, 15746, 2106, 20745, 79369, 81828, 68451, 44842, 20463, 4615, -31000, -21429, -60119, -95644, -84584, -85401, -135372, -154933, -115035, -52381, 6568, 25330, 39073, 37819, 62823, 39670, 49180, 54843, 64040, 42793, 48309, 57377, 87226, 81881, 72289, 47353, 23113, 27812, 8455, 13552, 7097, 11429, 21530, -13617, -26865, -21464, 1852, 11065, 1125, -4837, 18674, 19281, 46498, 56320, 62916, 58441, 35629]
8181C5629j7468J8412j2694L559K6350n4291j3741n343J0458J3711p823j0088
8169a3329L1512J2067n6041n0671M589M8225K1614n154j0403K5634L9644J9984
8157F7671N4327K2723o0303m9423n2459j7319L8522j5419M59K5766M18J2002M924
8144C1889P903n5211o488k679k4088J5930l4166j5080J6366k488K1500M2104K4983
8131B0475l2432K1741j9635l1196K5610K0374m4322K3996L0369L7456L2895k2231
8119F3100m1529K3636K178L6714j6198J3753P119j3516k8249k2998m2254l8605
8107e6849L3259l7881o088J6312j199m1130J2221M4164M4236K4351K2708k1409
8095C2695k5754p645k5891L1099K7151j6282q557k2348k6540J1673J5683Q749
$$ y = [35629, 18161, 36573, 23879, 27438, 53788, -503, -14244, -19587, -9129, 4582, -3241, -13329, 18183, 30250, -25791, -76462, -71873, -23648, -2034, -7188, -17591, 8043, 47687, 67671, 121998, 144721, 84418, 34995, -17464, -34783, 3739, -11680, -11221, 14545, 14963, 26965, 31889, 39792, -15419, -21907, -24586, -48674, -32744, -66910, -81990, -65624, -68112, -46612, -4508, 20475, -11957, 9784, -9851, -41047, -15437, 4937, -39385, -15389, 14980, 52436, 85331, 63100, 21571, 45207, 47385, 84099, 67901, 81654, 88773, 75257, 47008, 24010, -18244, -56849, -23590, -61471, -67559, -51247, -52446, -93576, -81355, -37191, 7045, 31396, 54104, 32695, 6941, -704, -26595, 4504, 31655, 15373, 6816, -15532, -42072, -30399, -14716, -5967]
8083e967J7844M359J5386l0361R489o553o050k8537K607o829J1366l16M9661J6034
8069D2133k3633N810J7958k5749m7088J8826L4533K7562k4080k3348M550M2062
8057D9536o923m561L1411K0187q57k6626Q204M7900K2782M8574L976j3327j962
8044A78314K6584k3943l4714j6670J1619L6754L2306J1330k119j4325J2062n3341
8032A63857o4743K7544K9867K172k3843r507N324q750K5292K3461j4190j8248
8020A38236p54J5843k3870l052Q890j4678K753M2257L5850J7232O4171P5263O9387
8007D27528J56489J41937L7301j08696j37465j46143j02969m5512l6011M2751
7997B29210R8812O8129O6729N9279L7189q3723j51540j43447j2423J0508l5498
$$ y = [-5967, 11877, 16236, 31622, 1261, 10750, 4197, -1853, -30390, -27783, -34612, -23246, -23562, 26099, 42133, 18500, 24310, 42268, 16519, -30569, -11743, 22790, 50352, 26272, 2924, 7474, 49536, 42613, 38052, 69463, 89650, 88793, 62167, 70371, 118271, 141053, 189627, 193603, 180276, 178314, 204898, 180955, 146241, 129571, 141190, 177944, 210250, 221580, 219461, 205136, 217198, 163857, 99114, 126658, 156525, 158697, 134854, 125347, 130671, 121921, 147213, 170674, 156484, 138236, 137482, 153325, 129455, 126403, 135293, 120615, 123368, 165625, 201475, 218707, 282878, 358141, 427528, 584017, 725954, 763255, 654559, 517094, 370951, 267982, 222470, 186459, 229210, 328022, 396151, 462880, 522159, 559348, 475625, 324085, 180638, 168215, 178723, 143225]
7986A43225j7341j3694m8879J6112M6838m2076k1339k4150J8771O3897M0764J8753
7974A80881o1521n40l2770l3043K4840O5151N4705J9129O439N5810Q0392R5484
7962D54957O2950L0463j3421n4234p1711m6860m5790n0587q887Q9253J31736M3754
7950E21623n5881j10664j05977o4534l6379l9909j766K154j8175k7652p1831p3491
7938h2482M5035J4308l7105M6835K5790M3997J4851l7683k2227k1557m3167O436
7926d6969K7254P2563k3946L5412Q7098J6939R54J192k2337l5575l0123M6560
7914A29022N523k8687l1168j5609j7271R864p712o001R168o496l7153k3838o433
7901b6791O935K9009n2458l3519j2827L6444N0632K3041k8602r933J8405J8186
$$ y = [143225, 125884, 112190, 63311, 79423, 126261, 84185, 62846, 38696, 57467, 121364, 162128, 180881, 119360, 118820, 86050, 53007, 77847, 142998, 197703, 216832, 223271, 279081, 359473, 454957, 517907, 548370, 534949, 480715, 409004, 362144, 316354, 265767, 256880, 346133, 477869, 521623, 465742, 355078, 249101, 184567, 148188, 108279, 106513, 108667, 90492, 62840, -8991, -82482, -37447, -23139, -60244, -13409, 12381, 56378, 71229, 33546, 11319, -10238, -53405, -46969, -19715, 52848, 28902, 64314, 151412, 168351, 169305, 170497, 148160, 112585, 82462, 129022, 134545, 105858, 74690, 59081, 41810, 51674, 43962, 37961, 47129, 40633, 3480, -20358, -26791, -19856, 9153, -43305, -76824, -89651, -53207, -2575, 20466, -8136, -18069, 336, 18522]
7889A8522J7039K2484k6849k3297j4277L6607K557j8599l109J1566J1044J3034
7877D6722j4159j3727J2108j395k9554r410k1320q368n961j2064L6898M6535r007
7864A7298k4059j9251J2069j9388q380J820L2330k9160p613K96j6050L7817J8115
7851d156j4995J1207M0778r941R07K4544J6774k19J1905p992k8755k273j4214
7838B3570M2313j2907l6649l6244N876K3676J8764p74j7849J362m7256l0770O740
7825f0148K0854m957n5854j134N2399K3873J5207n152j0911k6717k2448k0373
7813i5361l721N391K181J457J1366K3423j6238K0462L8087L116J7462J4211o8
7800B1768l0479R662J4190Q681J4432N229k4723k2873m0646j296M7003L0830K2071
$$ y = [18522, 35561, 58045, 31196, 7899, -6378, 30229, 32786, 14187, 11078, 22644, 33688, 46722, 32563, 18836, 30944, 29549, -5, -9415, -30735, -39103, -45064, -57128, -20230, 26305, 17298, -6761, -26012, -13943, -33331, -41711, -39891, -7561, -36721, -44334, -44038, -60088, -22271, -4156, -19151, -7944, 32834, 22893, 23800, 48344, 65118, 64899, 76804, 68812, 40057, 37784, 23570, 65883, 52976, 16327, -19917, -14041, 9635, 28399, 27625, 9776, 11138, -36118, -66888, -60148, -39294, -44251, -100105, -101239, -48840, -24967, -9760, -14912, -25823, -52540, -74988, -95361, -99082, -93691, -91510, -90053, -78687, -55264, -71502, -51040, -12953, -9837, 7625, 21836, 21768, -8711, 951, 15141, 23822, 38254, 43483, 18760, -4113, -44759, -46055, 948, 31778, 53849]
7787E3849l6534L5467K5554M851o2044l3101N055l7133o711l7044r217J0876L7131
7774d9001J2150K1478J0987r585N311K1939k4309k5372O107l5776q156r527k652
7761h6406K2555J7919K6424m770n337N1044M5523P670m5732j2633Q51r179L1541
7748C9470j2893l3283l5095K5247M861J7933j0001l772J9552o691p272K4605L6060
7735E8721l4072l9431r175K7926K2082k5880m4553K5510j1616J8006J069n2257
7723f3670m2298J01670O4322K9775K148o0435l4536J5255N1676l4089m1322k9034
7711d0538J7562N6010L1628q859o7974l585N5288n2316j4713L1849k1566K0488
7699C274k6093k8023m1385J9037N0030L4904r470o2184N553o278m8298L1438R0321
$$ y = [53849, 17315, 52782, 78336, 83187, 21143, -11958, -6903, -44036, -50747, -87791, -97008, -86132, -49001, -36851, -15373, -4386, -13971, -8660, 13279, -11030, -36402, -30295, -66071, -74227, -83754, -86406, -63851, -45932, -19508, -24278, -29615, 21429, 66952, 74622, 28890, 16257, 17108, 7929, 39470, 26577, -6706, -41801, -16554, -11693, 6240, -3761, -7533, 12019, 5328, -1944, 22661, 58721, 24649, -14782, -23957, 3969, 26051, 171, -44382, -18872, -30488, -12482, -11413, -63670, -105968, -4298, 60024, 89799, 91947, 31512, -3024, 12231, 63907, 29818, -11504, -40538, -22976, 33034, 64662, 55803, -12171, -15756, 39532, -12784, -27497, 4352, -17214, 3274, -22819, -50842, -92227, -73190, -23160, 11744, 2274, -59910, -54357, -60635, -108933, -77495, 12826]
7686A2826M4365j7535k0433m0961J0015l1829l4975K173J0471M0715R167k4002
7674d0003k1519K5169J82J2426k0983m5661L5277O8345K6769k2736j2179l7965
7662c2878k0969k0636o707J2519K6836O5501n538m1419l9729Q648M9863J0907
7650F398l9505l1815L4575j008o6240j1364P3164k2238j7281j380p194J0949k5176
7637i8115l692J0823J736N0670M7713j78J4537j5296M1757L5936k0297j8235l2548
7624A4811n0136P3106K6631n0195o6716n109J4466K2357m196r163J8145K9448
7612A3449k9194J505o961L6608K9262k3430l8948k1022k2325p843J0162R439J9053
7599c0245L7283n681l3223p020M4716L8145k9488m7451o535r050J0351k2539j7432
$$ y = [12826, 57191, 39656, 19223, -21738, -11723, -43552, -78527, -76354, -65883, -25168, -16001, -40003, -61522, -36353, -36171, -23745, -44728, -90389, -55112, 13233, 40002, 17266, 5087, -32878, -53847, -74483, -81190, -68671, -41835, 23666, 18128, -23291, -63020, -54372, -4509, 6398, -33107, -64922, -30347, -31355, -97595, -108959, -35795, -58033, -75314, -76694, -83888, -72939, -98115, -101807, -90984, -89248, -38578, 9135, 8957, 23494, 8198, 49955, 85891, 65594, 47359, 14811, -35325, 37781, 64412, 14217, -52499, -57608, -43142, -20785, -24981, -34144, -15999, 13449, -15745, -14240, -21201, 15407, 44669, 21239, -17709, -38731, -61056, -68899, -58737, -49298, -30245, 7038, 1357, -31866, -38886, 5830, 43975, 14487, -32964, -39499, -48549, -38198, -60737, -78169]
7586g8169K1235n496J9776J033j2364M2632J3146J3396K5170j7816R090M686O769
7573D3088k4240m9507j6562P514N431j2072p85j235k4411L545p990K6028j2280
7560f3476m7723o227j4297J6307K8925J0322l3473j3638n45K6041N613j6292L6275
7547g2188K7791l0129J2789M0604K16K432P978J293L6735J9341j5392j9308n9609
7534d7447k0879K2166J3026m035M7819k3763k7698n208J7618L3426L205J401M6250
7521E5881J2698m9062j4243J3287j7457j7426M2355L3523k9140P18k5037j5803
7509i706P118n8853q493J940J0074J2202K7103N081p611L0120N564M912J6688
7496C6139o590j1509p03p550R425K3359N163k5964J4407k4998o2432k3286O4302
$$ y = [-78169, -56934, -62430, -42654, -41621, -53985, -11353, 1793, 15189, 40359, 22543, 31633, 36319, 43088, 18848, -30659, -47221, -39707, -34276, -46348, -47133, -48368, -72779, -69234, -77224, -51196, -63476, -111199, -117426, -131723, -115416, -86491, -76169, -109642, -123280, -123825, -97784, -92171, -108463, -72188, -44397, -74526, -61737, -21133, -20917, -18485, -10507, -9214, 27521, 46862, 31470, 12162, -47447, -68326, -46160, -33134, -37169, 10650, -13113, -40811, -46019, -28401, 5025, 8230, 9631, 55881, 68579, 19517, 5274, 18561, 1104, -16322, 26033, 59556, 30416, 31134, 6097, -9706, -2588, -61441, -69934, -67994, -57920, -45718, -18615, -13534, -21145, 8975, 14539, 19451, 36139, 29549, 18040, 17337, 9787, 19212, 42571, 47734, 21770, 36177, 11179, -51253, -74539, -10237]
7483a0237M4521k5264l036m471k4646J5713K0680J6035l251J0724Q000l1295j1868
7470A605K7011r781k0191j668k0790K1749m7j3162j4217R805M8705N5070k5048
7457E9041l0682l9944l2791pj7121K0971K6076k6295j2007j0997m239J4886P103
7444d6006M921j7539l004M6216Q20O45M508J0085o0574l4906K4443M1224M4039
7431A4872M8900J9304j3200n1623K1295k8087l1394j055k1602j7698R349j1414
7419f2353O0416l3342j3293L6528K0821N1538O948k449l885M2330q212k2160j9731
7406E3156n4620m9677J0521K3060K7170P874k1906N934J1380j1707k9854L2666
7394C997K0204j8908l6869J9692N425n158k5905o6027k445K0695j9111J7706j24
$$ y = [-10237, 34284, 9020, 5984, 1513, -23133, -7420, 13260, 29295, 26044, 36768, 44768, 13473, 1605, 28616, 18835, -1356, -3024, -23814, -2065, -2112, -15274, -29491, -19686, 29019, 84089, 59041, 28359, -11585, -44376, -44383, -61504, -40533, -14457, -40752, -52759, -63756, -67995, -53109, -46006, -41085, -58624, -61628, -15412, -14592, -13947, -9439, 646, -59928, -94834, -70391, -29167, 14872, 63772, 83076, 69876, 18253, 39548, 11461, -19933, -20988, -42590, -60288, -50939, -62353, -1937, -35279, -48572, -12044, 8777, 60315, 67263, 64814, 60929, 103259, 95047, 72887, 53156, -1464, -51141, -40620, -17560, 9610, 17484, -4422, 1512, 12892, 1185, -28669, 3997, 24201, 5293, -31576, -11884, -6459, -11617, -37522, -103549, -105994, -85299, -104410, -86704, -86828]
7381h6828J0030K1842J9625J4072j6569k1078M9620L8525n8216l7142K7929J7516
7369b0674j2743r87K1582K4405m5981k0548L8484K0464p152k9556q108Q823K8053
7356c938j5687j9615o14l2134P485M7800N1242j1522k9266k5019P442J4162m567
7343a4231m0259P637N4325K3163O157q644n8512l397J1344Q599O330K1703L6824
7330E1039k6256j0579R736o72l6443j4757j5422l1556N1257L5178k7607J4512
7318a570J7573j1484p718J0685L330j613k0686l2213j314J6561L1097Q453J4743
7305B5844n788K8008K0018n4240n3856J735O647J9500l491k6396l838L3813L3635
7292B1591K8381o7915l6866N2088L3580l07j378j8246l7844j4772J5682R732K625
$$ y = [-86828, -76798, -54956, -35331, -21259, -37828, -58906, -9286, 29239, -28977, -66119, -38190, -20674, -33417, -34404, -12822, 11583, -34398, -54946, -16462, 4002, -3150, -32706, -40814, -31991, -3938, -19625, -39240, -39854, -71988, -64503, -16703, 34539, 23017, -6249, -31268, -23826, -9664, -14231, -54490, -46853, 7472, 30635, 36792, 28148, -30364, -33761, -22417, -13818, -7488, 14215, 51039, 24783, 14204, 23940, 23268, -13175, -27932, -43354, -74910, -23653, 11525, -16082, -1570, 16003, 4519, -3199, 7486, 10816, 9203, -11483, -43696, -45010, -28449, 2648, 11101, 25844, 20056, 48064, 68082, 13842, -40014, -38279, -31632, -12132, -15623, -42019, -45857, -12044, 21591, 49972, -17943, -54809, -2721, 30859, 30552, 29174, 10928, -26916, -41688, -26006, -16274, -13649]
7279a3649M0639L959k6562j9629l24L79m987K6539M7998L183m6763k8558l2693
7266e0468R570j2804J0313K1512J7060M0797o3492k0151L4225J7904M1470J1189
7254E7125k0493Q941p0029n0597O6480K7824r397Q20l7629p136K6893N8805l672
7241D7935j9158O338J6208l9193k2204k6868N334J4304j9603J7898M3926j7260
7229G657j2606K1383j2465j0839l311j0061l5677o943k2533n210K5400K1123l0659
7216g4741m3107J5926L9841L2856K8642P956m5949j1671J7415K8406r778m1425
7204e5629j6447Q823K1723q778m892K9536K8135J2068J8941K4460l9936m5798
7192b7794p480J4564m8842j1511J6027j7022o432N4597P979j5895J6505J3998
$$ y = [-13649, 26990, 30949, 4387, -15242, -15566, -15187, -20174, 6365, 54363, 57546, 10783, -17775, -50468, -40898, -53702, -43389, -21877, -4817, 35980, -27512, -47663, -13438, 4466, 45936, 57125, 36632, 45573, -24456, -75053, -8573, 19251, 9854, 10674, -26955, -34091, -7198, 51607, 47935, 28777, 35115, 51323, 12130, -10074, -36942, -31608, -17304, -36907, -19009, 24917, 7657, -4949, 16434, 3969, -6870, -10181, -20242, -55919, -62862, -85395, -90605, -65205, -44082, -74741, -117848, -101922, -62081, -29225, -583, 7373, -38576, -50247, -32832, -4426, -14204, -55629, -72076, -63253, -41530, -50308, -55200, -25664, 2471, 14539, 33480, 57940, 18004, -27794, -35274, -20710, -69552, -81063, -65036, -82058, -88490, -33893, -25914, -41809, -25304, -11306]
7180a1306j4677r336K0774K8200K7623K8362N221m171j7960K8008l8493k6509
7168A5736o773k481K0773Q979l2250k6300J9984k08q13j0902l9278J2132M48k7510
7154f8463J5574M648o91N2827N192j6825j420N0941m5197m2972k6415K0554j8810
7141g1057L2472K8760N1498j4531m7354j9669K1439L1129N4091l5205m1513J9147
7129I207L826l5452K59J4913o399l22l531l9107J2993O509j267q034Q456J6317
7115b1632K4334k82K578j2746o412L3354j7445l2945K0149J6389r06j1293k8847
7102c5704K6038P31j6635o828J1443J2071m359j3308K8420K472j3015O53j8795
7089b6816l2741K2214L728J2275K5286J0364L5146q635l5797j8239J2849K3669
$$ y = [-11306, -25983, -35319, -14545, 13655, 41278, 69640, 74861, 70690, 52730, 80738, 42245, 15736, 8963, 6482, 27255, 36234, 3984, -22316, -2332, -2540, -3353, -14255, -53533, -41401, -40953, -68463, -52889, -48241, -48932, 3895, 9087, -7738, -9158, 41783, -3414, -46386, -72801, -52247, -71057, -38585, -9825, 41673, 27142, -20212, -39881, -18442, 12687, 66778, 31573, -9940, 9207, 13033, -22419, -22160, -7247, -13646, -13968, -17499, -56606, -43613, -37104, -38371, -46405, -37949, -21632, 2702, 2420, 4998, -7748, -14160, 19194, 1749, -31196, -11047, 5342, 4436, -6857, -35704, -9666, -8935, -25570, -32398, -20955, -8884, -13243, -26551, 1869, 4341, -8674, -8021, -26816, -59557, -37343, -33615, -21340, 3946, 14310, 49456, 40821, 5024, -13215, -366, 23303]
7077B3303P462P959M2236p195m9228m9975k3165M189J1302K9145J1151r930J465
7064a281l5439o2264L816M8763K85P354K4938O4L5019J4374l7616j4387j163l8242
7050e5779j4223Q85O031O3521L142N164m0717n1948N1483N8797k5113n2066n9774
7037a10597L2137K2899k2782O0036M8129L0705l3151o566j137J3497j1457n0514
7025b8801j4388j9081j5340L6266O5012L8694N406j4044l3952p555j206j0474
7013E37L3562J8106p6626m7306M698K2114k0717r877n694J6405K8017K2613N573
7000h595l2447J4729N1211J0336k3170k1080l5554l7959q014L0145L682j2746
6988f9462K5843M6420K0736n6966l2961M6337R636o0924k6886K4657J9239K4099
$$ y = [23303, 30765, 38724, 80960, 73765, 24537, -25438, -48603, -44414, -33112, -3967, 7184, -2746, -1281, -36720, -98984, -95168, -46405, -46120, -38766, -13828, -13764, 21255, 35629, -1987, -16374, -17537, -55779, -70002, -69117, -63086, 435, 3577, 8741, -31976, -83924, -32441, 26356, 1243, -50823, -110597, -78460, -55561, -78343, -18307, 29822, 60527, 27376, 20810, 19673, 33170, 21713, -28801, -43189, -62270, -77610, -41344, 23668, 62362, 67768, 53724, 19772, 12217, 11011, 537, 34099, 52205, -24421, -71727, -67029, -44915, -65632, -75509, -81203, -64798, -36781, -14168, -8595, -41042, -26313, 24898, 35234, 12064, -9016, -44570, -82529, -90543, -60398, -56716, -69462, -43619, 2801, 23537, -33429, -66390, -20053, -10417, -71341, -98227, -73570, -54331, -30232]
6976c0232Q497L6299j7820k0699k2082N1016M0942l2761l1025j3339n338o210
6964d2752o680J6968K2436l527m43k2186K5190K720o333k8805R270K5652k176
6951a0666j881j2072K7794O462k3580l7189L4265J8558P29l4385j447P656L47
6938b5409J1570J5966L5309P886l8016j8833j3770L246J175M0769L8156N520j090
6925F2479n0108m6677j8911M7767L372n5539n3750K3941K4573K2455M3732L9349
6913D2683k6740j3365l3228K2992L6915m4974o696k1367K0301L30o137j411o714
6900c7411k1474Q02Q2583K5465J5106k2891l5061J4181o5060j2609P6461K5283
6888D5375n1184J1574K4013J1975j3856l7413l7043o828L3687J5742R154k5702
$$ y = [-30232, -21735, 14564, -3256, -23955, -46037, 4979, 45921, 13160, -17865, -31204, -36542, -42752, -49432, -32464, -10028, -13555, -13998, -36184, -10994, -8274, -14607, -43412, -34142, -8490, -10666, -12547, -24619, 3175, 9637, -13943, -51132, -16867, 1691, 2420, -31965, -33412, -25756, -25409, -13839, 2127, 37436, 45322, 7306, -11527, -25297, -22051, -20876, 19893, 58049, 63569, 62479, 12371, -34306, -53217, -5450, -2078, -57617, -111367, -87426, -62853, -40398, 3334, 42683, 15943, 2578, -30650, -7658, 29257, -15717, -22413, -43780, -23479, -23149, -29286, -30697, -37411, -58885, -58083, 24500, 49965, 65071, 42180, 7119, 21300, -43760, -56369, 20092, 45375, -5809, 5765, 29778, 41753, 27897, -9516, -46559, -53387, -19700, -3958, 5196, -20506]
6876b0506q337L5624J5189k5459l3118l711N2509j3162k6684l3024j1213j8467
6864i0359J0268J4191K3272L3162j386J777O354J7627l3880k2891j3014l845J2304
6851d6420L17J0924J9305L689m9326J1419M5989K8477M4536j737m9962j9569K6149
6838B3791o49k864n0845k6822L690J8536k677J5273Q044O93o184k2405K8885M7244
6824C3710l1449n6598j8320M3328P1956k8842J0448J0579n989J6106j3814N866
6812C6981q739o239k6564o138j4679J5429J2836n3510o0048O1620M1516m176O479
6799e232Q922P028m271n4909J948N7513M713P152k8159j3389M5668M876l4667
6786b807L4253L9235l873k3402j9907J8593k3432q683j9390N96L3828m6626n7653
$$ y = [-20506, -28843, 6781, 21970, -3489, -36607, -40318, 12191, -971, -27655, -60679, -71892, -90359, -80091, -65900, -42628, -9466, -10852, -9075, -2721, 14906, -18974, -41865, -54879, -58724, -46420, -46103, -35179, -15874, -12185, -61511, -50092, -4103, 24374, 68910, 67173, 17211, -2358, 23791, 23142, 20278, -30567, -57389, -53699, -35163, -37840, -22567, -14523, -13830, -20014, -42419, -13534, 33710, 2261, -54337, -72657, -29329, 42627, 13785, 24233, 34812, 28823, 44929, 31115, 36981, 28242, 22003, -4561, -10699, -25378, -9949, 2887, -50623, -110671, -49051, -7535, -11711, -5232, 3690, 10718, 6447, -48462, -46514, 10999, 15712, 22864, -5295, -18684, 26984, 31860, -2807, 31446, 70681, 66808, 43406, 23499, 42092, 18660, 9977, -9413, -8817, 25011, -21615, -79268]
6773g9268N7905O5212L0719m8566n3452K189K5079J7568q277k808j9803K2283
6761H781J4509n2929l9837J0825k3523K4811N734L1855J2112k8808k8457Q539
6749e6388k6252m4824K3768J8032j385R039N6934P732k1333l1196n0769J7927
6737i8715P7535M9506N3289j2540q720l3049l0713J7352L4669K0736l3122m5870
6725i642k8811l0307L361N4680J3674K318q723l1049K7825L8227k3047j3706J1541
6712F341M4134J7674n4148n7806K2535m930m9961m3561L8379K8981J331J7837
6700c3194K8258O088j5636j918K1311K611P513R701k0073J090J4944k2464J3768
6687A1999K440j1124l488K8831L10O599R454m221M408j1117k5600m8370O890K0157
$$ y = [-79268, -21363, 43849, 74568, 26002, -27450, -25261, -182, 17386, 9109, 6301, -13502, 8781, 23290, -29639, -69476, -58651, -82174, -57363, -51629, -19774, -7662, -36470, -64927, -56388, -82640, -127464, -103696, -85664, -87049, -78010, -21076, -13344, -34677, -65873, -116642, -98715, -21180, 28326, 81615, 69075, 60355, 27306, -3407, 13945, 48614, 69350, 36228, -9642, -38453, -68760, -65399, -10719, 2955, 5273, -3450, -34499, -6674, 31553, 8506, -5200, 6341, 50475, 68149, 14001, -43805, -21270, -26200, -76161, -119722, -81343, -52362, -51031, -33194, -4936, 1152, -14484, -16402, 4909, 7520, 15033, 24734, 4661, 5751, 20695, -1769, 11999, 14439, 3315, -173, 28658, 28968, 35567, 45021, 40800, 45208, 34091, 8491, -39879, -32989, -12832]
6673a2832m7433j5862Q6724L0024j3455j267O139j6653j8941L1546K2357j9760
6661C0587K6965o77n7086q0182K7213O3657j8492k1104K3823j3925m1486j434
6649f2141J3161L4334m4815J8043K5839r515q971l521j0238P936L9896k534j5818
6636a8344k7124l5096j1503K132M8130Q564k3723L0579K7517J4410K9239K8236
6624G3017m610j242m0369j9097k1967K2356j0179m1065J8435l565J7147O474L7163
6611C2498l663j0026k4740k4935L864Q310M5998K1691m0985m3649K2893J6260
6599C516j3603N867J7172L2415K772j5119J5298j8919m0402K0858K8169L227J443
6586D2694j8598j2660j8750j4319J1376J5236J394l0354k2584j0866o037R2j2826
$$ y = [-12832, -60265, -76127, 10597, 40621, 27166, 25899, 32038, 15385, -3556, 27990, 50347, 30587, 57552, 56875, -211, -80393, -53180, 10477, -8015, -29119, -5296, -19221, -60707, -62141, -48980, -14646, -59461, -41418, -15579, -25094, -34065, -37586, -47824, -39888, 8, -2526, -18344, -45468, -80564, -92067, -89935, -41805, -33241, -56964, -26385, 1132, 15542, 44781, 73017, 68407, 67165, 26796, 7699, -14268, 8088, -2091, -43156, -24721, -28286, -11139, -4665, 32498, 28835, 18809, -5931, -30866, -27002, -18692, 27306, 48997, 8012, -35637, -12744, 3516, -10087, -4220, 12952, 45367, 48139, 33020, 48318, 29399, -11003, 9855, 38024, 41251, 42694, 24096, 11436, -7314, -21633, -10257, 4979, 6373, -23981, -46565, -57431, -63468, -63376, -76202]
6573g6202L9624M3811K4405l3614n9565o112M2601j5322m284L2707K7198J0046
6561B5293j5616Q68l1433k6932K8226M2439k5285k9041o224K1540n942l8480r004
6548f9591l59o048K9417K5299M080j4149n257k973L4410L1468N019M218k4082
6535A1452j8138j4480K6601J4261K7339j7633j7312J8148J7772j5119n578N189
6523C2502J44J6146k5240m7630m543M6198L1379k1289M373r287K3863n1426k473
6510g283J9470j0463J7664o34j5169l0086j3802L3835o048m0833l1473K8080M0244
6497a6498N522m3758j262L9150j2604l9315k3225L1192L1596J8975M7667J2529
6485D9969J0694M088k65l8306j6869K8026K7050K9033K429k6905j4165j7395o4288
$$ y = [-76202, -36578, 7233, 31638, -1976, -61541, -67653, -25052, -40374, -44658, -11951, 15247, 25293, 9677, 10545, -20888, -47820, -19594, 22845, -2440, -31481, -37705, -16165, -22107, -60587, -69591, -69950, -75998, -46581, -21282, -17202, -31351, -36608, -39581, -5171, 26297, 31316, 35534, 11452, -6686, -21166, 5435, 19696, 47035, 29402, 12090, 30238, 48010, 32891, 27313, 32502, 32646, 48792, 23552, -24078, -28621, 17577, 48956, 27667, 32040, 22753, 46616, -4810, -7283, 12187, 1724, 19388, 18754, 3585, -26501, -40303, -6468, -12516, -53349, -84822, -56742, -16498, -10976, -54734, -55996, -16846, -29450, -68765, -91990, -60798, -29202, -10227, 37440, 49969, 60663, 64751, 64486, 26180, 9311, 37337, 64387, 93420, 95849, 68944, 54779, 37384, -26904]
6472b6904j9514j5912n327M413N4328L2805J0213R564M203m4288l8999r014K8945
6459a5487K8785k3322q319M7433N3151j6166j4196J6365k4525k9516J3713k0355
6447G561k9587J614J4001k5240L5465J352k2738L0293L9372n1741J13J3824J4417
6434B8706Q590j4543R389j56j0417r649P079K6732k394R46n5758r267n242k9392
6420e5376J5328j5892l0346m2297N403O2058J9740N234L4395J0816j0213J9615
6408A8465L77o4775j86K3730J888K0261j2020L019K9482K5351j4398j1829J4741
6395C4106q357J8192J5493l8591m90J339j5729J8758j9990j7194Q841m493l3556
6382d1671m6401M472J9176N0566O3981L7429m4736n2666j1781k8570o532K2601
$$ y = [-26904, -46418, -62330, -67657, -63244, -8916, 23889, 34102, 43666, 47869, 3581, -35418, -44432, -15487, 13298, -10024, -18343, 29090, 82241, 66075, 51879, 68244, 43719, 14203, 27916, 7561, -22026, -20412, -6411, -31651, 3814, 5166, -17572, 12721, 52093, 352, 465, 14289, 28706, 37296, 22753, 32142, 31986, 21569, 11920, 18999, 45731, 43337, 44283, -11475, -20742, -25984, -55376, -40048, -55940, -86286, -128583, -123180, -61122, -41382, -36148, -1753, 9063, -1150, 18465, 18842, -45933, -46119, -22389, -20501, -240, -12260, -9241, 20241, 45592, 31194, 19365, 34106, 25749, 43941, 59434, 20843, 20353, 21692, 5963, 24721, 4731, -12463, -3622, -8115, -41671, -88072, -83600, -64424, -13858, 50123, 87552, 42816, -9850, -21631, -50201, -56733, -34132]
6370c4132J5303M107j2120k5626k9046K8946M7988K7728M162j7653M3491Q757
6358F1905m7913k8025l6164k0685J2852k7571J7290N1853k2873q671j8105k1831
6346h7938L0375K0797n071R698j3835L4783M0086J1558K3665K531J2112m9779
6334B8982k2624L7599p275K4809k7874q456n9242j2609L4879M2585K221l982N420
6321C4433k7924k8104K4690M965k2821l7383j2422L7167J3728N1797k9379M470
6309A3217m728K5467o090l8406K502J4852J4675L1953j5656k7287o706P139O282
6296A7214J9184r75j563J0716l8948k8128J2817m294l5622O997L4864k515J8638
6283H385M7016l3692o1663k3805L711m650J9746L6450J1924J358r601L0501M4324
$$ y = [-34132, -18829, -14722, -26842, -52468, -81514, -52568, -4580, 23148, 27310, 9657, 53148, 61905, 13992, -14033, -50197, -70882, -58030, -85601, -68311, -16458, -39331, -48002, -66107, -87938, -57563, -36766, -41837, -32139, -45974, -11191, 28895, 40453, 64118, 66649, 78761, 28982, 6358, 43957, 36682, 61491, 33617, 25161, -34081, -46690, -11811, 30774, 32995, 29013, 34433, 6509, -21595, 3095, 8060, -14761, -52144, -64566, -27399, -13671, 38126, 8747, 13217, 8489, 33956, 27866, -10540, -8038, 6814, 21489, 53442, 37786, 10499, 3793, 10932, 17214, 36398, 35423, 33860, 44576, 5628, -22500, -9683, -13977, -49599, -42602, -7738, -10253, 8385, 55401, 21709, -39954, -63759, -60048, -64698, -44952, -8502, 3422, 4780, -4821, 25680, 70004]
6270G0004l889p409N320o1887j1953K1147K5445k2463m9167j7426L7709j1560
6258b6129K8566N3516j0380j6695n9721j1744K9634N8088k2071p34K109K1853
6246D6292k021k1484l1414j1552n9268K2778P6779k5637k2132n364k8733n473
6234f7229k596M9644O0527K0405m1222n1549K8219L0126J3854r270j1749o329
6222A2831k458m9195p321K0159N185P372n716o4580j2826p375J5974L0703J9048
6209c8199M1797k466n692K1551K2451J6318j4706m5400j0373K894J9209J1764
6197A9148J0783l9818k7388m936j1614j0444K7949J3320j3918O4952O9692m6832
6185E0894m8017j0048M7562k4259n4721j5478K6049J4439q75J6687J1804q675
$$ y = [70004, 66115, 58706, 64026, 2139, -9814, 11333, 36778, 14315, -34852, -52278, -14569, -26129, 2437, 55953, 45573, 28878, -30843, -42587, -12953, 45135, 23064, 22330, 24439, 46292, 44271, 22787, -8627, -20179, -79447, -56669, 20110, -5527, -27659, -33023, -61756, -67229, -69825, -20181, 40346, 60751, 19529, -32020, -3801, 26325, 40179, 30909, 19160, 12831, 10373, -38822, -46143, -25984, -20799, -13427, -19143, -83723, -96549, -103924, -87950, -57247, -38199, 3598, 1132, -4560, 16991, 39442, 55760, 41054, -4346, -14719, -11825, 7384, 19148, 29931, -9887, -37275, -42211, -53825, -64269, -36320, -23000, -36918, 28034, 97726, 50894, 2877, -7171, 40391, 16132, -38589, -54067, -28018, -13579, -14454, 2233, 14037, 5362]
6173E362j3383p135p077Q862K9257q671j0573n7870j7003L4910J2907M0381M4638
6160E4605k7137n0842j7303j6466j0105j3677O067r320N3639O8666L5011k6472
6148D6666l2475r199p390K6535j4850l6813k7871r212O349K3957l8756J0582J6940
6135d5537r132K7312K7659M707N903k3286P956l0809j0400j230Q467M1369O122
6122I101k1290J792n862J5458n471k5788m1807j2806j1875P4238O5761l3169m1266
6109c2984K2666o875J0286J0582O855O81l9129k4018j5355K0936j5215M550L3061
6096b3959m678M4798l3865l1403N6754J0063j1249o039J0949N2657O418l4634
6084C5812l2361l5348j594L9028P4143j3301p534j4044l6254k1910K5340K2561
$$ y = [5362, -8021, -15156, -22233, -13371, 15886, 7215, -3358, -61228, -78231, -43321, -30414, 9967, 54605, 27468, -23374, -40677, -57143, -67248, -80925, -74858, -84178, -30539, 38127, 73138, 46666, 14191, 4992, -2398, 24137, 9287, -27526, -55397, -64609, -58260, -34303, -73059, -62477, -45537, -54669, -27357, 302, 5009, 10912, -12374, -4418, -35227, -45627, -46857, -38390, 2979, 9101, -12189, -10397, -16259, -801, -6272, -32060, -73867, -86673, -98548, -24310, 41451, 8282, -32984, -10318, -17193, -6907, 3675, 10530, 11211, -27918, -51936, -67291, -46355, -61570, -57020, -23959, -28637, 16161, -17704, -49107, 7647, 17710, 6461, 422, 11371, 64028, 70446, 35812, 3451, -31897, -33491, 5537, 79680, 66379, 58845, 44801, 8547, -13363, 11977, 34538]
6072C4538K4648k8270o0809o1762j1985O1100K1269j1582j7762m7762M1517J6181
6060d0679M136L1463o771k9916k6967J5748N1216P675n271m821J216L398p260
6047f833m0910p035M622J3716J0746J6135J9921r36m313r825j1804K1443m3225
6034c8298k909L3921m192m3318l930k6440K8109K8441J0981Q242j1433l5654J5161
6021d1319N7167K7087q282k7407N968j9229n0263M821K5568L6360O314l6889r123
6008b9227J2505K6578N279n042K2919l7817l205P416K0636n4548k5258P385M5870
5995f509m094J8390l798J677J9001J8955j8370l9954J6997j1344k6501N365L8114
5982G929J5733K7259J26j2412P481K2252j3314m8475j7378L611O1369J2574l8850
$$ y = [34538, 59186, 30916, -29893, -91655, -103640, -42540, -21271, -32853, -50615, -98377, -56860, -40679, -36543, -5080, -11851, -41767, -68734, -52986, -1770, 5905, 634, -4187, -2971, 427, -6833, -47743, -54778, -50156, -36440, -25694, -9559, 10362, 9426, 5113, -4712, -16516, 4927, -38298, -41207, -7286, -11478, -54796, -58726, -85166, -57057, -28616, -17635, -9393, -20826, -56480, -41319, 15848, 42935, 34653, 7246, 13214, -6015, -56278, -51457, -25889, 10471, 16785, -20104, -29227, -16722, 9856, 15135, 10093, 33012, -4805, -8010, -594, 20042, -34506, -59764, -52379, -6509, -10603, 7787, 3989, 5666, 24667, 43622, 25252, -14702, 2295, -9049, -35550, -30185, 7929, 23662, 50921, 51047, 38635, 46116, 68368, 55054, 6579, -10799, -7188, 54181, 66755, 27905]
5969B7905n9060K9270K5530R277q748r102R295K4676k7989k5106J5437K9334l7509
5956C210k5319o287j0782m117k3931j065k1098k8445J0852R3952N0929J2350j8781
5943C1468l9101j2196L5014o333Q29K2501L620R247p169m3247m2019l3045J7047
5930f3384K3148K1908j2549N746L1340k6388r037L792j2373k4159k7454J4074
5918g5336N6713M6580K659O452J4967K9587j5366j8624k6864o986k2224J8117
5906I675j7365j6230L1099l6025k0003J8567K6643n804J7005J6133o7445k5363
5894f9113K4448P7300K2047n7159J5981J3110Q148l7775j2260J5696o992j7876
5882b4445L9770M9607k9601o0198n628j7831j5412p946k8297l2763K2791K3375
$$ y = [27905, -31155, -1885, 23645, 32922, 24174, 15072, 24367, 49043, 21054, -4052, 11385, 40719, 3210, -22109, -28396, -39178, -43295, -67226, -68291, -89389, -117834, -106982, -13030, 37899, 50249, 31468, -7633, -19829, 15185, 8852, 9681, 32182, 35802, 45049, 37880, -5367, -47386, -80431, -63384, -40236, -18328, -30877, -25131, 6209, -20179, -29216, -25424, -37797, -61956, -89410, -75336, -18623, 27957, 30616, 37068, 52035, 81622, 66256, 47632, 20768, 13782, -8442, 9675, -7690, -23920, 7179, -28846, -48849, -30282, -3639, -9443, 7562, 23695, -43750, -69113, -44665, 32635, 54682, -2477, 13504, 26614, 34762, -3013, -15273, 423, -6569, -24445, 15325, 64932, 35331, -24867, -30495, -48326, -63738, -71684, -99981, -132744, -109953, -86578]
5870h6578L6530l107j7919J3421L553K1928J9063P417p570J8861l6276Q794Q979
5857a2904N375k4488J4034R054J0591K5437K307m084j1753k0352j5452L2648R704
5844B0117j7300k165j3688p01o923j3335o5554K6099M7080j506K322l507Q383
5831b0678L4543K2998j9528k8930J2510K9885L3831m4041k4136N412r832N9491
5819E1525L055m6924k1748j2109J5137m822j4143l1041L5329l235L4106K3036
5807B8166n024J5508j2889o8805q697M6694K1243n2191o7178L9092O4113L584
5795C616J1844q678k992K5932j871j8063K0452j235l9564l6257L0196j4389J1421
5782a9588R178n786L3979o055r632k0592k4502K7353M9325p223l9686J3731L6055
$$ y = [-86578, -50048, -53155, -71074, -57653, -54100, -32172, -13109, -5692, -13262, 5599, -30677, -21883, -12904, -7529, -32017, -17983, -8929, 1662, 27099, 29406, 25322, 13569, -6783, -22235, 10413, 20117, 2817, 652, -13036, -13737, -20660, -33995, -99549, -73450, -26370, -27876, -25554, -29061, -20678, 13865, 36863, 17335, -11595, 915, 30800, 64631, 20590, -3546, 1866, -7966, 51525, 54580, 7656, -14092, -26201, -11064, -15886, -30029, -61070, -25741, -28976, 5130, 28166, 23142, 38650, 25761, -43044, -51741, -5047, 16196, -35995, -103173, -64081, 32, 3616, 15460, 6782, 3790, 29722, 27851, 9788, 30240, 29005, -10559, -46816, -16620, -31009, -19588, -10410, -16196, 17783, 11728, 2096, -18496, -42998, -15645, 33680, 26457, -13229, 502, 36557]
5769C6557L04m3919k3163k0832O77K209J0051J1128j0548l493l3011N381M0959
5756b7700J0277N4864K0058J6201k2525m1048J6657K2486j6562k4469l9358r302
5744d0421j8Q706O0187K6411k7174j5786o140n614n657l5646j4740J3501L3772
5731h619m119L5041k2262j3518l7277n988P881L1475J8317L8572k5765J8730J7673
5718E0141m318j6005k4386j5030j8190j004j7956L7243L912m02k1845k5640N1592
5705a888K9795L114Q750n8502r380K8174L430J8416j8812J0571k8512j6818M3668
5692A2006L9341j552j3007m4706l7649K7007N7594K4987k9861m3482j8592N2474
5680B4560R924K5908J0281n4886p5164o057L6738J3077j3090K3277Q694k1793
$$ y = [36557, 36861, -7058, -30221, -51053, -50376, -48167, -38116, -26988, -37536, -41029, -74040, -68659, -27700, -17423, 37441, 57499, 73700, 51175, 10127, 26784, 49270, 32708, 8239, -31119, -40421, -40439, -31733, 28454, 54865, 27691, 11905, 5765, 151, -5506, -41152, -55892, -42391, -8619, -12738, 22303, 41, -13477, -50754, -56742, -48861, -17386, 931, 39503, 13738, 32468, 50141, 45823, 29818, 5432, -9598, -27788, -28792, -46748, -9505, -5593, -5995, -27840, -53480, -1888, 27907, 31021, 39771, -18731, -28111, 63, 3493, 21909, 3097, 13668, -14844, -31662, 12006, 51347, 49795, 36788, -7918, -45567, -18560, 39034, 64021, 34160, -9322, -27914, 24560, 34484, 60392, 70673, 15787, -59377, -65434, -28696, -15619, -28709, -5432, 3262, -18531]
5668a8531k4788j614K9998O3350R673l0389k0171j6155p217j3303k0091K655j1963
5655e8546K9786J8993N3147O059j7826m0056k0495l22j2497L0357J1693L4323
5643C4616j7112l6796R621L0389N141j9849k2455K4809o705O95j2343q47j0601
5630b1437l358m37m136l1977m396M7914L2885j053n1769J3404O458J7333L1812
5617C1243j7248k1841J4864J8986J3367j3674j8481L928j9955L739J4332j1999
5605b739o3137j8998O3007J2539J5789l3521j2550L1278j6148Q46k2k7056L1902
5592a8810p668r423k7006M9763L3983k1847l5296n0483J3609P8597L3098L060
5580D1577l9924l144K2540M7853J3494m6087m5160j2687J8028L1034q882J9626
$$ y = [-18531, -43319, -44933, -14935, 48415, 58088, 27699, 7528, -8627, -15844, -29147, -49238, -46583, -58546, -28760, -9767, 43380, 49439, 31613, -8443, -28938, -29260, -41757, -11400, 293, 34616, 17504, -19292, -9671, 20718, 25859, 6010, -16445, 8364, 1659, 2354, -9989, -10836, -21437, -24795, -25232, -29368, -61345, -65741, -17827, 15058, 14005, -37764, -24360, -17902, -569, 31243, 13995, -7846, 7018, 26004, 39371, 25697, 7216, 11144, -8811, -5072, 9260, -2739, -65876, -84874, -21867, -9328, 6461, -27060, -39610, -8332, -24480, -23634, -23656, -50712, -18810, -26478, -35901, -62907, -13144, 20839, -1008, -36304, -86787, -73178, 5419, 38517, 41577, 1653, -1491, 21049, 68902, 82396, 36309, -8851, -21538, -3510, 27524, 18642, 38268]
5568C8268j0193K946J1089r600j1548k8073J0256p791p959N135J6890k9405J8084
5555a901K0913J0301l7337j8469p414l7262K1121l145p729K6398J4419L3131K9469
5542D2495n317l7175m1293P831L6685M864K0008K1545l3311k3952k1296J1511
5530a7405K8627j0839n0781n073O2105N819M536m0449m3473p457M0743L5398q829
5517g078l3083K998J2054k0017r969n019p897K599j5273O1394J2446m4529n077
5504e6451J03N3418M7107n001m522k2604q280J3811k174J3519J1698P24l5575
5491E773l3428k0049L0603o641M585K1245k33l0549l5181L2551R7042L1866o1873
5478C5711k0409l162k9540J9723L7590k4966o297J6245j6459m2496N176K5564
$$ y = [38268, 28075, 31021, 42110, 32510, 20962, -7111, 3145, -4646, -12605, -7470, 9420, -19985, -1901, 19012, 29313, -8024, -26493, -33907, -71169, -50048, -53193, -60922, -34524, -20105, 13026, 42495, 37178, 3, -41290, -33459, 3226, 8090, 28098, 49643, 16332, -7620, -28916, -17405, 11222, 383, -50398, -55471, 6634, 12453, 16989, -23460, -66933, -74390, -33647, 1751, -7078, -40161, -37163, -25109, -45126, -55095, -60114, -68011, -65412, -80685, -19291, -6845, -51374, -56451, -56348, -2930, 44177, 39176, 34654, 12050, 3770, 17581, 15407, 28926, 40624, 41348, 5773, -27655, -47704, -17101, -23742, -19157, 2088, 1855, -28694, -63875, -31324, 65718, 97584, 35711, 15302, 12140, -17400, 2323, 39913, 14947, 8650, 24895, 8436, -34060, -28884, -3320]
5466c320K3234J3974J6438k8961m4572k2949O820r442P325N527J8300M0470j212
5453B1632j4181j3021j9040j738L843K6142J4700N965J0909l5681k0256P1503
5441E0777J0648l6072k4266l5234j1443R714J9628j994L102N283O143L3603P8807
5428A08696L6903m6638o742j4809k8334j2638M0009L9506j7426q91j8923k7774
5416E0939J9252k4478m1464M022J8365J2291l0909k4240l4513k4687p346K0276
5404f2492O8378J6963k7214j011K416k3546j9651o080j2732r121j9081J14J1183
5391h1874N9395r780k5642R910O0671K3711K7289M830j7404j0550l126m5686k3709
5378c1965K0429M6523L5436p050m4838K891n3721j5346K3721J8031L7743K4620
$$ y = [-3320, 19914, 33888, 50326, 21365, -23207, -46156, -39336, -48778, -41453, -35926, -17626, 22844, 21632, 7451, -5570, -24610, -26348, -22505, 3637, 18337, 24302, 35211, -470, -20726, 50777, 61425, 25353, 1087, -34147, -45590, -35876, -16248, -18242, -15140, -9857, -3714, 29889, 108696, 145599, 98961, 92219, 77410, 49076, 36438, 76447, 115953, 98527, 97636, 78713, 50939, 70191, 45713, 4249, 8271, 26636, 38927, 8018, -16222, -50735, -75422, -82768, -62492, 5886, 22849, -4365, -5376, -2960, -26506, -46157, -52237, -64969, -74090, -93171, -93057, -81874, -22479, -32259, -57901, -47991, 12680, 36391, 63680, 68510, 51106, 40556, 37430, -8256, -31965, -11536, 34987, 70423, 63373, 18535, 21426, -32295, -47641, -23920, -5889, 31854, 56474]
5366E6474j9454n1405P210N6691j4750J9437J2108l237j3378o367N3947J9504
5354A16780l3581j8307M162m6858l2244J4447N7867o10j9643J2606k7291n6358
5342b9030k6415j9383K9445K7812j5054q559j3618NJ7431M5030J7093m335l6209
5329a5787M55m1065q053M4037L9339j561K0413R33j0835n069M195l8456l4914
5316d6368M0860J2635L5314K1933j8301l6140j9271K1598K4842j6159k3076k0226
5304b2359K0435k2246K385J0508L273J4099L751j3482J0498q905j1237N173J0439
5291B332j3178k5865J7481p745j5725j1177L1293K646j4343O828J7288r168j7780
5278c7113O0278L1837r03k0971m3905k9639M92M4931m939l3160M3714J0906k9435
$$ y = [56474, 37020, -14385, -7175, 49516, 34766, 54203, 66311, 63074, 49696, 43329, 97276, 116780, 83199, 64892, 69054, 22196, -10048, 4399, 62266, 61656, 42013, 54619, 27328, -29030, -55445, -74828, -45383, -17571, -32625, -41184, -54802, -54797, -37366, 7664, 24757, 20422, -15787, -15332, -56397, -64450, -20413, 18926, 17365, 37778, 38711, 27876, 22807, 27002, -11454, -46368, -5508, 7127, 42441, 64374, 46073, 9933, -9338, 12260, 37102, 20943, -2133, -22359, -1924, -24170, -21785, -11277, -8004, 6095, 9846, -3636, 6862, -2043, -13280, -8107, 2332, -10846, -36711, -19230, -26975, -42700, -53877, -22584, -19938, -34281, -27453, -10165, -19333, -37113, 23165, 55002, 54099, 33128, -10777, -40416, -39924, 5007, 68, -33092, 10622, 21528, -7907]
5265g907p720j5309k8971J7315K1411L1719j6076m5147J5237J4826K9244K4231
5253C2853K0149k3112j7567J1933m978J1463J0676O603l428n130r279j4578J7532
5240C3137l442j7386l121j5649k6665Q990m2654k413K445J6230J1431J6522K4690
5227B115o833k3614k3648R80J6816N374l3674k1531J5959M0258n66K710k0032
5214d5686J677L8803K2667j949m2363j3087o890j8568L6836L1722j488j5121O856
5201f591l1430k2468J8951O0783L4623J6729k2844m8689j2087K3180J6939n893
5189B1203k4957k9606Q578j3934K1310J219j8254K2146j0934j9118j9614O307
5177e5654J1149J2711k1225K1279K0127j3430K354L7057J297n7624k9951J4186
$$ y = [-7907, -15627, -30936, -59907, -42592, -21181, 10538, -5538, -50685, -35448, -20622, 8622, 32853, 53002, 29890, 12323, 24256, 19278, 30741, 41417, 48020, 44592, 39462, 30183, 15605, 33137, 29695, 12309, 9188, -6461, -33126, -24136, -66790, -69203, -66758, -50528, -39097, -22575, 2115, -4718, -28332, -51980, -51000, -34184, -28810, -62484, -84015, -68056, -27798, -28364, -25654, -45686, -44009, -5206, 17461, 15512, -26851, -39938, -46828, -65396, -28560, 3162, 1674, -13447, -6591, -38021, -60489, -41538, 19245, 53868, 70597, 47753, -936, -13023, 10157, 27096, 21203, -3754, -33360, -24782, -38716, -17406, -16187, -34441, -12295, -23229, -42347, -61961, -55654, -44505, -31794, -53019, -31740, -11613, -25043, -22689, 14368, 15665, -41959, -71910, -57724]
5165e7724K7930L5230m338o225N1692j3405K6114j7152j0226J3298l3122k5007
5153a2935k7286N6233L3494r557k2743m8727k7867J9347O928j5657k5382k2762
5141i6914J8739O6824l931m3234j0466M1845K9367j4400l0469r721m634J8269
5129c8725j1376J7857K4184M1778l2693K2975K3260n3171k9714j331j5981J4186
5117c8751M2138J1562k8385j5700J936k7502O48M3279J3705m2627j7167n213k8720
5104i0797L8871N2634M999n2569L2514M6357N941n6687l1128J2154K3067K3508
5092H864R85J6439k0561l4556r000J8194N6070k337j4907l350k056k3361K462
5079g114N1321J6622L89m9982n050N642j0773L7005J331R900k0807k914N466k2988
$$ y = [-57724, -29794, 5436, 1098, -5127, 46565, 33160, 59274, 42122, 31896, 45194, 12072, -12935, -40221, 16012, 49506, 39949, 17206, -31521, -59388, -40041, -33113, -48770, -74152, -96914, -78175, -11351, -15282, -58516, -68982, -27137, 2230, -12170, -42639, -52360, -56994, -38725, -50101, -32244, -8060, 33718, 1025, 24000, 47260, -5911, -35625, -36956, -52937, -38751, 3387, 14949, -13436, -29136, -27200, -54702, -54054, -10775, 2930, -39697, -56864, -62077, -90797, -51926, 708, 5707, -46862, -14348, 32009, 37950, -18737, -49865, -37711, -14644, 8864, 9849, 26288, 5727, -28829, -37829, -19635, 36435, 34098, 19191, 15841, 13785, -9576, -7114, 44207, 60829, 61218, 11236, 6186, 11828, 1055, 38060, 39391, 49291, 28484, 25570, 31036, 8048]
5065H048j4793J1897L207k5581J3366r329j2250L0100L9835J8557O883q287l6736
5052B4917L8626j8756M787J0482O488Q134k1459j1763l7202k7883K420J8466l5462
5039c8205m726K6953J011m847M574M3091l338q946M5600R713j9499j8438R351
5026D2294l7P365j4487j508l3438n0912j0417M2871M5067L1204j2237m8772m1273
5013d4280M955k5272q423l5585K984M5489Q536L473M724R109j5522K6533L5461
5000A2182J3773l4807j7992k7983J2405J6451j4721K290M5989K3155L9900j9671
4988E0971k0943j8071l5303Q780K472K470k5684J5283K4667r988j5457L7694K7227
4975D4118k0773l8181k015k380N719J6078L230J1342q995l4207J3465J2505k4214
$$ y = [8048, -6745, 5152, 8359, -17222, -3856, -13185, -25435, 4665, 44500, 63057, 69940, 61653, 24917, 63543, 44787, 49574, 60056, 66544, 74678, 53219, 41456, 4254, -23629, -21209, -2743, -38205, -42931, -15978, -14967, -19814, -15240, 27851, 24513, 15567, 61167, 70880, 51381, 32943, 42294, 42257, 49622, 35135, 33627, 189, -50723, -61140, -18269, 26798, 58002, 45765, -3007, -44280, -39325, -64597, -73020, -108605, -105621, -60132, -51596, -48123, -43399, -34290, -49812, -23279, 12182, 25955, -8852, -26844, -54827, -42422, -25971, -40692, -38402, 7587, 30742, 70642, 50971, 30028, 11957, -23346, -14566, -12094, -9624, -35308, -20025, 4642, -5346, -20803, 16891, 44118, 23345, -14836, -16851, -19231, -13512, 2566, 5796, 17138, 8143, -26064, -12599, -94, -24308]
4962b4308r527m824J2659K4453J5684k4091l152k829k036k8527n704J6170J9058
4949a6974M9249K3024K374l0319R771K9968j0557j5038l96J1237k5834l3085l8934
4936d5514k2729J0768Q584J5651k126m0957l0477L7745K9456j3035j1995J4931
4924d9698J4895M2960J6289r531l24k3657j4494p54K896k292m2627j4096J3563
4911f6870K5135J6761m5098J5719j0175K025J5977J4529j4011K9746K8347M7155
4899E9240J0642o9188l1339k3778m1320K9510K5926J888K2099m202L490R320L2026
4886B4314k4239k7206L965J9823j8017P039J2117J227J8589N193M451o039j7319
4873C898k9845J063k537j7012L2687K5056n7981k1923j7795L6293j0174M501J1905
$$ y = [-24308, -33835, -38659, -26000, -1547, 14137, -9954, -13106, -15935, -17971, -46498, -52202, -36032, -16974, 32275, 55299, 57673, 27354, 37125, 67093, 56536, 41498, 41102, 52339, 26505, -6580, -45514, -68243, -57475, -48891, -33240, -35366, -76323, -106800, -69055, -39599, -52634, -64629, -49698, -34803, 8157, 24446, 14915, 14591, -9066, -23560, -24314, -21418, -23710, -66337, -80433, -66870, -41735, -24974, -70072, -54353, -64528, -62503, -46526, -31997, -46008, -16262, 12085, 59240, 69882, 694, -30645, -54423, -95743, -66233, -40307, -38419, -16320, -20522, -17032, -7712, 24314, 75, -27131, -23166, -3343, -21360, -14321, -2204, -977, 17612, 22805, 27256, 21217, 3898, -25947, -24884, -27421, -44433, -11746, 13310, -44671, -66594, -84389, -48096, -58270, -53769, -41864]
4860d1864M5938N1569J9971R709q0421j4256k520L863l5540l1926K1654J5483
4848c8340L4401JL0270R519j1875O542M0596J2974P716q811p8070k4970k1766
4835d1813J8597K8468N048M982L2754L5247J7413l6362m2590P820J09j0577L874
4822B2970L967j0936k0139K552r538N725K4327J1625L7890j2874o2031k2337K9435
4809F36L8332K1690j2671k6437k2009K1059m302m0300q131J0951K3919j632j7875
4796a6770k8J2844L7053L6623r914J0671m957l5639j0512J3177N521n5980j6869
4783c4780L4250J277N1248r656p863n012j2889K0947K6627K2169l4787p716j2973
4770C0842l3459k3248L1326N3510l9370k289J5743K5515l85k7913K0375j4316
$$ y = [-41864, 4074, 55643, 75614, 85323, 4902, -9354, -11874, -8011, -43551, -75477, -53823, -38340, -3939, -3938, 26332, 35851, 23976, 30518, 71114, 84088, 91804, 82993, 4923, -20047, -41813, -23216, 5252, 10300, 15282, 48036, 83283, 100696, 64334, 21744, 29564, 29673, 19096, 22970, 26937, 16001, -4138, -1586, -11124, -5399, 18928, 30553, 68443, 55569, -6462, -28799, 636, 38968, 60658, 47987, 21550, -459, 20600, 16298, -24002, -32133, -21182, 2737, 1105, -16770, -16798, -3954, 33099, 69722, 59808, 70479, 65522, 29883, 19371, 32548, 38069, -17911, -34780, -530, 747, 51995, 42339, 34476, 29464, 16575, 37522, 64149, 86318, 51531, 43815, 30842, -2617, -25865, 5461, 58971, 19601, 17312, 33055, 58570, 58185, 30272, 50647, 36331]
4758C6331j7794p091N2550R231o5424l3974P680k6766l2938K1399n308J2268k2071
4745g1907M019K3585N6634J2843k9675J5092L5838k9792l5166k0289k886k6109
4733f7813k0803M5789P378L7759M5299j9018m607J6541j1836j6489K3272m355
4721C1117j3658p515k8125J5021r134k010K2505j8213Q393J9665p541J7964k675
4708B5794l154k070n036k1137k3408L544J2886m095j3793M7142J7781j3412k3676
4695b634L4047l447k7417j6779l849M2233M019M345l6744l3624n477K7521O030
4682a1776q288j7791k2168N698J730L8912K1727j6964K7486j775o2923m3698N0873
4669c8957L3668L0176j9461k446k9358r93L8802K483j5427l5049k6744M2103P4185
$$ y = [36331, 18537, 11446, 63996, 73227, 7803, -26171, -18491, -45257, -78195, -56796, -62104, -49836, -71907, -67888, -44303, 12331, 25174, -4501, 10591, 46429, 16637, -18529, -38818, -41704, -67813, -88616, -42827, -35449, 2310, 47609, 28591, 23984, 40525, 28689, 12200, 35472, 31117, 17459, 9944, -18181, -3160, -12294, -14304, 8201, -10012, -1619, 18046, 10505, 28469, 25794, 22640, 20570, 15534, -5603, -29011, -25467, -12581, -16676, -30469, 16673, 34454, 21042, -2634, 31413, 27966, 549, -16230, -20079, 22154, 26173, 30518, -6226, -39850, -45327, -17806, -11776, -20064, -37855, -60023, -54325, -52595, -13683, 8044, -8920, 18566, 16791, -46132, -89830, -38957, -5289, 24887, 5426, 2980, -26378, -27371, 11431, 13914, -1513, -36562, -63306, -21203, 52982]
4656E2982j6387l9164M7522M0934m4713m1628j5662J3912r178K0192n158J2613
4644A6265j571J9178J969r408o7214l7940J7237J2986J1533L3641K2859R801J200
4631C0536p183k3k407O424P591p608L234j8162o489k7294K1252m584p414J7969
4617E842j5328p744J9044J2334j1998o1835J1013M539k6044K1139k6425J2898
4605f2565N1589P904O380O883q209L053K4485m2666n5703j0344J7576M1049l8338
4592e8906J927K0059L2842J882J6794n044k7740l5721K9241K7598J5327k3474
4580e215j0780P743k9045N607O0113j6788m5548M401r050L7P36Q373k2962k658
4566e5036J4921r794q90P549Q391J3731K0978k6920p816J8576k6157l469l2515
$$ y = [52982, 36595, -2569, 44953, 85887, 41174, -454, -16116, -2204, -11382, 8810, 3652, 16265, 14694, 33872, 35841, 26433, -40781, -78721, -61484, -48498, -36965, -3324, 19535, 29336, 30536, 23353, 23330, 20923, 27347, 34938, 27330, 30564, 12402, 5913, -21381, -129, -4713, -12127, 5842, -9486, -17230, 1814, 14148, 2150, -59685, -48672, -44133, -70177, -49038, -75463, -62565, -10976, -3072, 3308, 10191, 1982, 5035, 29520, -13146, -68849, -79193, -61617, -20568, -58906, -56979, -36920, -4078, -2196, 14598, 9554, -18186, -53907, -24666, 2932, 18259, -5215, -15995, -8252, -37297, -31690, 28423, 11635, -33913, -29512, -38562, -38525, -37789, -29416, -52378, -55036, -40115, -49909, -50799, -43250, -34859, -21128, -150, -27070, -34886, -16310, -42467, -45936, -78451]
4553g8451j1598N6582K4905k2228l6792k9769l2636N5404M4109k3452l1195j136
4541h6257j687J8491J4835k1534m5169P0761M8462J2863j3139n3797l9398j1345
4529a06914O6789M6526P709q207j1761j9851J9441J5905k1655k1444m30J3279
4517b0613K6364J84J0814l7477n04K1038k5434O6963K2509J5172K311o062k8149
4504D7116N893J9962k5640m1823J1158M2676q503k0174J6396L3189K5634j6217
4492H9667l7927j475l9510l6751j8654N803j6650l1105k124K5575M7937L8959
4480B3745J8393Q774q252k1153l249k8224k261m5028N002J6550L4175K5789p980
4467A6281q522k0983j1792q522K6513L3141J2554j7592j7838r012m7189j8828
$$ y = [-78451, -90049, -33467, -8562, -30790, -67582, -97351, -129987, -74583, -30474, -53926, -85121, -86257, -87944, -69453, -54618, -76152, -121321, -50560, -2098, 10765, -2374, -56171, -95569, -106914, -40125, 6401, 14110, 5903, -5858, -25709, -6268, 9637, -12018, -33462, -33892, -20613, 5751, 5935, 16749, -20728, -21232, -194, -25628, 41335, 63844, 79016, 81327, 75265, 47116, 53009, 72971, 47331, 5508, 16666, 59342, 50839, 30665, 47061, 80250, 105884, 89667, 51740, 50265, 10755, -25996, -44650, -38847, -55497, -86602, -88726, -63151, -15214, 23745, 42138, 50912, 42660, 21507, 18258, -9966, -12227, -57255, -52253, -35703, -1528, 24261, 16281, 7759, -13224, -25016, -33538, -7025, 26116, 38670, 21078, 3240, -5772, -52961, -71789]
4455g1789J5292N1993J1834R363J1448k2768r102l9091J47J1477J5925L6026j6404
4442D351J80K1369j4540j1894k6391l456R088k5744N6722K8669m6590o49l207
4429a2092Q234J0174M4383J917J7243l6605q757j4716Q168J9463R676l8838j4711
4416f461N278N687J5991K506k5113L2852j5735n116j9735k0382l0176m0863L1782
4403f9485J7107M1417R612m536Q542M9114J0628j1374J2588J7100k3944q182R191
4390E7778k9272j3646P737L1341j1954n1715j9761J7325j6300j9319K6897N168
4378a5721Q538l6901N970J9256K9889L0643J7397l0887l9081K3751M3119k2683
4366C3290j0271k7283m8150K4251j4883j1080J946O2311J9896K5191K5774r930
$$ y = [-71789, -56497, -4504, 7330, 16693, 28141, 5373, -3729, -42820, -42673, -31196, -15271, 20755, 4351, 4531, 25900, 11360, -534, -26925, -30381, -21293, -47037, 9685, 38354, -8236, -8885, -12092, -3858, 6316, 50699, 52616, 69859, 33254, 24497, 9781, 17949, 37412, 47088, 8250, -6461, -1183, 4504, 20495, 23001, -2112, 30740, 15005, 9889, -9846, -30228, -60404, -101267, -69485, -52378, -10961, -1349, -5885, 2657, 51771, 62399, 51025, 63613, 80713, 56769, 48587, 57778, 28506, 14860, 22597, 53938, 41984, -9731, -29492, -12167, -28467, -47786, -20889, -15721, -7183, -44084, -38114, -18858, 11031, 41674, 59071, 28184, -10897, 12854, 55973, 33290, 23019, -4264, -52414, -28163, -43046, -54126, -52180, 10131, 30027, 55218, 80992, 71062]
4354G1062K1896l2575k8398l2287k9584r433J5490j9423l6821K3360K0170M6261
4342I718M333j8324l6761K6098M7026m012k9037p844o395K6434J6985M269l413
4329B9077k6472r510K1498L1330l8466r3019k0706J6129N5857j0240k554Q636
4317c8440L3612L2888Q446o7585j7368L7993o2744j9345L8036M4112K4568k6272
4305a2099K1580J7513m6950j7468K9756L7589l165L4604r504j8304J8638J7837
4293G0027k9427j7123J7919j9847K3470L131j7392N57M920l1486L030n693N514
4280G600J5206M8857K7689k3038j3120k2750l86K054j0699l6465k2119N4118K2016
4267D8963k5604j280r386k384N552k9973o336K665M5354j4344k3741N981k5895
$$ y = [71062, 92958, 60383, 31985, -302, -29886, -39319, -23829, -43252, -80073, -56713, -36543, 9718, 14051, -4273, -41034, -14936, 32090, 28078, -959, -8803, -15198, 11236, 28221, 32490, 29077, 2605, -6905, 14593, 45923, 7457, -85562, -106268, -90139, -34282, -44522, -47076, -38440, -4828, 28060, 36506, -31079, -48447, -10454, -73198, -92543, -54507, -10395, 14173, -12099, 9481, 26994, -19956, -37424, -7668, 29921, 26756, 61360, 51856, 33552, 52190, 70027, 40600, 23477, 41396, 21549, 45019, 48150, 30758, 31315, 36235, 4749, 7779, 2086, 7600, 22806, 71663, 99352, 76314, 63194, 40444, 40058, 42112, 31413, -5052, -27171, 26947, 48963, 23359, 22079, 12693, 10309, 15861, -14112, -20448, -17783, 27571, 13227, -10514, -4533, -30428]
4254c0428o0693j8928L4291J5881P929K3162K1314l4973j2488l660j4226k057
4242g4876J1204M2396L0074L319j4691j2443L5835j0875J1889k232j3417k2976
$$ y = [-30428, -91121, -110049, -75758, -59877, -51948, -28786, -7472, -42445, -54933, -58593, -72819, -74876, -63672, -21276, 8798, 12117, -2574, -15017, 20818, 9943, 21832, 19600, 6183, -16793]
$$ [...]
##END NTUPLES=NMR SPECTRUM
##END=
