##TITLE=Analysis number 329627
Compound Code cc 68206
Book Reference 546/26
Project Code adrs
Chemist Name craigr
##JCAMPDX= 6.0         $$ Bruker NMR JCAMP-DX V2.0
##DATA TYPE= NMR SPECTRUM
##DATA CLASS= NTUPLES
##ORIGIN= Bruker BioSpin GmbH
##OWNER= nmr
$$ XWIN-NMR		Version 3.5
$$ Wed Sep 19 09:41:06 2007 GMT Daylight Time (UT+1h)  MAYBRIDGE\nmr@NMR_250MHZ
##.OBSERVE FREQUENCY= 250.131544655141
##.OBSERVE NUCLEUS= ^1H
##.ACQUISITION MODE= SIMULTANEOUS (DQD)
##.ACQUISITION SCHEME= undefined
##.AVERAGES= 16
##.DIGITISER RES= 18
##SPECTROMETER/DATA SYSTEM= dpx250
##.PULSE SEQUENCE= zg30
##.SOLVENT NAME= CDCl3
##.SHIFT REFERENCE= (INTERNAL, CDCl3, 0, 16.522)
##AUDIT TRAIL= $$ (NUMBER, WHEN, WHO, WHERE, WHAT)
$$ ##TITLE= Audit trail, XWIN-NMR		Version 3.5
$$ ##JCAMPDX= 5.01
$$ ##ORIGIN= Bruker BioSpin GmbH
$$ ##OWNER= nmr
$$ C:\u/data/dgb/nmr/ADRS/1720/pdata/1/auditp.txt
$$ ##AUDIT TRAIL=  $$ (NUMBER, WHEN, WHO, WHERE, WHAT)
(   1,<2007-09-19 09:40:40.98 +100>,<MAYBRIDGE\nmr>,<NMR_250MHZ>,
      <created by zg, POWCHK disabled, PULCHK disabled
       configuration hash MD5:
       76 6E 9A 78 1E 09 19 81 EC 84 63 8F B0 6A 59 2D
       data hash MD5: 64K
       3F 1B CA 0A F6 BB 64 19 22 16 7C 2D 6E E6 76 F0>)
(   2,<2007-09-19 09:40:55.04 +100>,<MAYBRIDGE\nmr>,<NMR_250MHZ>,
      <Start of raw data processing
       ef LB = 0.3 FT_mod = 6 PKNL = 1 SI = 32K 
       data hash MD5: 32K
       E2 C5 56 60 4C A6 87 C7 39 77 F2 B5 CC 80 23 01>)
(   3,<2007-09-19 09:40:56.73 +100>,<MAYBRIDGE\nmr>,<NMR_250MHZ>,
      <apk 
       data hash MD5: 32K
       C6 24 DC 02 FD 03 A5 86 3F 08 69 58 51 29 7F B6>)
(   4,<2007-09-19 09:40:57.43 +100>,<MAYBRIDGE\nmr>,<NMR_250MHZ>,
      <abs ABSG = 5 
       data hash MD5: 32K
       FC 9D 0B 04 B0 EC C1 AB D2 BE 99 02 35 85 73 D8>)
$$ ##END=
$$ 
$$ hash MD5
$$ BA 83 AA 77 82 44 C3 79 E4 7B 5D 5A C6 05 DA 28
##$RELAX= 
##$RELAX= 
##$RELAX= 
##$RELAX= 
##$RELAX= 
##$RELAX= 
##$RELAX= 
$$ Bruker specific parameters
$$ --------------------------
##$DU= <C:\u>
##$EXPNO= 1720
##$NAME= <ADRS>
##$PROCNO= 1
##$TYPE= <nmr>
##$USER= <dgb>
##$AMP= (0..31)
100 100 100 100 100 100 100 100 100 100 100 100 100 100 100 100 100 100 
100 100 100 100 100 100 100 100 100 100 100 100 100 100 
##$AQSEQ= 0
##$AQ_mod= 3
##$AUNM= <au_zg>
##$AUTOPOS= <3 >
##$BF1= 250.13
##$BF2= 250.13
##$BF3= 250.13
##$BF4= 250.13
##$BF5= 500.13
##$BF6= 500.13
##$BF7= 500.13
##$BF8= 500.13
##$BYTORDA= 1
##$CFDGTYP= 0
##$CFRGTYP= 5
##$CHEMSTR= <none>
##$CNST= (0..31)
1 1 145 1 1 1 1 1 1 1 1 1 1 1 1 1 1 1 1 1 1 1 1 1 1 1 1 1 1 1 1 1 
##$CPDPRG= <>
##$CPDPRG1= <>
##$CPDPRG2= <>
##$CPDPRG3= <>
##$CPDPRG4= <mlev>
##$CPDPRG5= <mlev>
##$CPDPRG6= <mlev>
##$CPDPRG7= <mlev>
##$CPDPRG8= <mlev>
##$CPDPRGB= <>
##$CPDPRGT= <>
##$D= (0..31)
0 1 0 0 0 0 0 0 0 0.06 0 0 0 0 0 0 0.0002 0 0 0 0 0 0 0 0 0 0 0 0 0 0 
0 
##$DATE= 1190191239
##$DBL= (0..7)
120 120 120 120 120 120 120 120 
##$DBP= (0..7)
150 150 150 150 150 150 150 150 
##$DBP07= 0
##$DBPNAM0= <>
##$DBPNAM1= <>
$$ [...]
##$SUBNAM7= <"">
##$SUBNAM8= <"">
##$SUBNAM9= <"">
##$SW= 20.6930455092707
##$SWIBOX= (0..15)
0 0 3 0 0 0 0 0 0 0 0 0 0 0 0 0 
##$SW_h= 5175.983436853
##$TD= 65536
##$TD0= 1
##$TE= 296.16
##$TE2= 300
##$TE3= 300
##$TEG= 300
##$TL= (0..7)
0 120 120 120 120 120 120 120 
##$TP= (0..7)
150 150 150 150 150 150 150 150 
##$TP07= 0
##$TPNAME0= <>
##$TPNAME1= <>
##$TPNAME2= <>
##$TPNAME3= <>
##$TPNAME4= <>
##$TPNAME5= <>
##$TPNAME6= <>
##$TPNAME7= <>
##$TPOAL= (0..7)
0.5 0.5 0.5 0.5 0.5 0.5 0.5 0.5 
##$TPOFFS= (0..7)
0 0 0 0 0 0 0 0 
##$TUNHIN= 0
##$TUNHOUT= 0
##$TUNXOUT= 0
##$USERA1= <user>
##$USERA2= <user>
##$USERA3= <user>
##$USERA4= <user>
##$USERA5= <user>
##$V9= 5
##$VALIST= <valist>
##$VCLIST= <CCCCCCCCCCCCCCC>
##$VD= 0
##$VDLIST= <DDDDDDDDDDDDDDD>
##$VPLIST= <PPPPPPPPPPPPPPP>
##$VTLIST= <TTTTTTTTTTTTTTT>
##$WBST= 1024
##$WBSW= 4
##$XGAIN= (0..3)
0 0 0 0 
##$XL= 0
##$YL= 0
##$YMAX_a= 480943
##$YMIN_a= -507286
##$ZGOPTNS= <>
##$ZL1= 120
##$ZL2= 120
##$ZL3= 120
##$ZL4= 120
##$ABSF1= 16.522
##$ABSF2= -4.171173
##$ABSG= 5
##$ABSL= 3
##$ALPHA= 0
##$AQORDER= 0
##$ASSFAC= 0
##$ASSFACI= 0
##$ASSFACX= 0
##$ASSWID= 0
##$AUNMP= <proc_1d>
##$AZFE= 0.1
##$AZFW= 0.1
##$BCFW= 0
##$BC_mod= 0
##$BYTORDP= 0
##$COROFFS= 0
##$CY= 12.5
##$DATMOD= 1
##$DC= 0
##$DFILT= <>
##$DTYPP= 0
##$F1P= 14.0000005364418
##$F2P= -0.99999901652339
##$FCOR= 0.5
##$FTSIZE= 32768
##$FT_mod= 6
##$GAMMA= 0
##$GB= 0
##$INTBC= 1
##$INTSCL= 1
##$ISEN= 128
##$LB= 0.3
##$LEV0= 0
##$LPBIN= 0
##$MAXI= 10000
##$MC2= 0
##$MEAN= 0
##$ME_mod= 0
##$MI= 0
##$NCOEF= 0
##$NC_proc= -2
##$NLEV= 6
##$NOISF1= 0
##$NOISF2= 0
##$NSP= 0
##$NTH_PI= 0
##$NZP= 0
##$OFFSET= 16.522
##$PC= 1
##$PHC0= 153.9138
##$PHC1= 5.344996
##$PH_mod= 1
##$PKNL= yes
##$PPARMOD= 0
##$PSCAL= 4
##$PSIGN= 0
##$REVERSE= no
##$SF= 250.13
##$SI= 32768
##$SIGF1= 0
##$SIGF2= 0
##$SINO= 400
##$SIOLD= 32768
##$SREGLST= <1H.CDCl3>
##$SSB= 0
##$STSI= 32768
##$STSR= 0
##$SW_p= 5175.98343685301
##$SYMM= 0
##$S_DEV= 0
##$TDeff= 65536
##$TDoff= 0
##$TI= <Analysis number 999999
Compound Code 99
Book Reference 9
Project Code 9>
##$TILT= no
##$TM1= 0
##$TM2= 0
##$TOPLEV= 0
##$USERP1= <user>
##$USERP2= <user>
##$USERP3= <user>
##$USERP4= <user>
##$USERP5= <user>
##$WDW= 1
##$XDIM= 32768
##$YMAX_p= 273333690
##$YMIN_p= -27593
$$ End of Bruker specific parameters
$$ ---------------------------------
##NTUPLES= NMR SPECTRUM
##VAR_NAME=  FREQUENCY,     SPECTRUM/REAL,   SPECTRUM/IMAG
##SYMBOL=    X,             R,               I
##VAR_TYPE=  INDEPENDENT,   DEPENDENT,       DEPENDENT
##VAR_FORM=  AFFN,          ASDF,            ASDF
##VAR_DIM=   32768,         32768,           32768
##UNITS=     HZ,            ARBITRARY UNITS, ARBITRARY UNITS
##FACTOR=    0.157963299565203, 1,           1
##FIRST=     4132.6476996994, 0,             0
##LAST=      -1043.33573715361, 0,           0
##MIN=       -1043.33573715361, -27593,      0
##MAX=       4132.6476996994, 273333690,     0
$$ Real data points
##PAGE= N=1
##DATA TABLE= (X++(R..R)), XYDATA
$$ [...]
17166c06L438L351K786j0143j070L518j812n168O32K675p90j3Q598J812n098m930
17150b520m428l920K61N530R18K759J767n061o353L862l351K22k634m607J333
17135a6222M028Q8J0862l55o057R68K791R86P12L681o110m489j816p23K46O732
17119d678K363l952o520K451M838k64J566J001j682j228M595N142o15J50l098
17104F9k606N122k167n535L002k504n117k010J39R791P581J287N087j029o699
17089D411J020J792p504m966m563J326J678J765K15L028P344P703K153l532m341
17074G529N365J511n238q941P5m046M618M754m722p11j894l303P41N38N749L135
17058E160m209n409m19L301j23q18J083M677m912L420K176J449K0l543o682l355
$$ y = [-306, 3132, 6483, 9269, -874, -1944, 1574, -238, -5406, -4774, -2099, -2889, -2902, 5696, 7508, 2410, -2520, -6948, -10868, -10607, -5077, -4159, -1400, 367, -4694, -11047, -7185, -10536, -10314, -12948, -17555, -16222, -12194, -12106, -1244, -1599, -7656, -6688, -3897, -2911, -2199, 1482, -4628, -9117, -10933, -11656, -11410, -4678, -2315, -6267, -12787, -10336, -5498, -5762, -4196, -3195, -4877, -6105, -1510, 3632, 3017, 3167, 69, -2537, 2585, 418, -5117, -2115, -4619, -9736, -11746, -11607, -1816, 5765, 7052, 12139, 11110, 4411, 5431, 7223, -281, -5247, -9810, -8484, -6806, -5041, -4826, -1798, 5546, 13249, 15402, 11870, 7529, 12894, 14405, 9167, 226, 301, -3745, 873, 5627, 905, 194, -1700, -5003, -4262, -3724, 2025, 5160, 951, -4458, -4877, -1576, -1699, -2517, -1434, 3243, -1669, 1751, 3927, 5376, 5396, 1853, -4829, -8184]
17042h184N750N624N369L846Q7k191o250o35r789m414O728j197p14O467J588L351
17026E436M616l531r062r82J310o00K211M79l35L966J184p510m090q16L542M673
17010D91L253n140N01k512k46K392N296K877n603L414K586m684p106J72P071l96
16994B366J259L151n297q475l226j725j603N210J265M7L174M12O026j727J874
16979B731N005o020n721j386k583J569K109P6j243K472p57K171l852N28K358J860
16963f83L639L712j31k35o942P550L357m637k733o272m934N85p220K926M492J278
16947f248M331J759J100j012O934P586m387p058q91l1J938m049J393J725m275
16932a185j357k660P294j98J185J992Q22M477m923j887K290n425L113J910m988
$$ y = [-8184, -2434, 3190, 8559, 12405, 12492, 10301, 4051, 3416, -6373, -10787, -4059, -5256, -5970, 497, 2085, 5436, 10052, 6521, -2541, -3523, -2213, -2813, -602, -123, -458, 3508, 4692, -2818, -6908, -7724, -4182, 491, 3744, -1396, -895, -3407, -3653, -1261, 4035, 6912, 1309, 4723, 7309, 2625, -4481, -4309, 2762, 2366, 3625, 6776, 1479, -6996, -10222, -11947, -13550, -8340, -7075, -7028, -3854, -3442, 2584, 857, 2731, 7736, 1716, -4005, -5391, -7974, -6405, -4296, -4220, -5463, -2991, -3748, -1577, -5429, -4901, -2543, -683, 2956, 6668, 6537, 6302, -640, 6910, 10267, 5630, 2897, -3375, -8309, -7724, -14944, -12018, -7526, -6248, -1917, -158, 942, -70, 6864, 14450, 10063, 3005, 2114, 2083, 4021, -28, 1365, 3090, -1185, -2542, -5202, 2092, 1894, 3079, 5071, 5893, 10370, 5447, 3560, 5850, 425, 3538, 5448, 460]
16917D60o559m412k729J905J014O37O856r57k988M700O124k092j714l81j209O148
16901D803j546m181k450K993M760j950j79n04l256l431K14L750M930l35r65K153
16885D806j366j0917l067q5J737J848R90J761O492J349J676j824k506k50K254
16870B898k736L045k515j802M8J23M309N297o857o645M289J464J0199l14o818
16855C985l590M780N751J023P97j205M30j012J156m94q012m550l049j466J210
16840d246K191o022O96N374j04l877r41k387K513M856L330q803K825L674k11Q586
16824G454j113m397j222j44m668k681m53k240N282R156O932l372j783K502k871
16809F382q62k113K756o545k979O293L792K133M46P193n316j2340m715N104j011
$$ y = [460, -6099, -10511, -13240, -11335, -10321, -9684, -2828, -3785, -6773, -2073, 4051, 1959, 245, -136, -1345, 4803, 3257, -924, -3374, -381, 4379, 2429, 2250, 1746, -1510, -4941, -4727, -977, 3953, 3618, 2653, 4806, 3440, -7477, -10544, -10629, -8892, -7044, -6054, -4293, 2199, 3548, 5224, 3400, 894, 644, 2898, 162, 3207, 692, -1110, -1062, -939, 3370, 8667, 1810, -4835, -546, 918, 11117, 10803, 3985, 395, 5175, 10926, 11949, 12746, 11541, 11971, 10959, 12115, 11621, 3609, -941, -3990, -5456, -4246, -2055, -8077, -7381, -2007, -2111, -5988, -6929, -9316, -6803, -1947, 1383, -7420, -4595, -921, -1132, 7454, 6341, 1944, 722, 578, -4090, -6771, -7224, -9464, -4182, 4974, 11906, 8534, 6751, 9253, 6382, 5520, 3407, 6163, -382, -3361, 2932, 6724, 8857, 9303, 16496, 11180, -1160, -5875, -771, -1782]
16794a782R97n416l735Q0K468Q909l922j384P67L07R453J208k12j155m589k35
16778A759P700j407m174o286j546K397P97m618J136L664q031J026O552R27M85
16763C81l005o31n323n838j367J465O503O971N335Q146l38r588m311l703k83j616
16747g202N002N014k613L239j797l012l510L01Q918L094K43l368k507O5K593O17
16731E077N82L245N480m573r419n718j714j174R446P596n472m03j289m546j902
16716d784k930j703M000K015J947M602K368J280m085J546M529L426n163P13m600
16701C161n259Q347K615k714m041o544O242N225o498o929O680O220k293L603j859
16686E956n222p007k510N100p04K27j814L170O76J315O96j8j88J0j018k11L708
$$ y = [-1782, -785, -6201, -9936, -9856, -7388, 1521, -2401, -3785, -3018, -2711, 6742, 7950, 7738, 6583, 1994, 1759, 9459, 8052, 3878, -2408, -3954, -1557, -760, -5378, -4242, -578, -8609, -7583, -1031, -104, 381, -2624, -3255, -8578, -14416, -15783, -14318, -7815, -844, 4491, 12637, 12299, 2711, -1600, -5303, -5586, -7202, -2200, 2814, 201, 3440, 1643, -1369, -4879, -4578, 4340, 7434, 7677, 4309, 1802, 1867, 4460, 5077, 5659, 8904, 14384, 9811, 392, -5326, -7040, -8214, 1232, 8828, 3356, 2953, 1664, -2882, -4784, -7714, -9417, -5417, -3402, -1455, 3147, 5515, 6795, 2710, 4256, 8785, 12211, 7048, 7761, 3161, -2098, 6249, 8864, 6150, 2109, -4435, 1807, 7032, 534, -6395, 285, 6505, 4212, 7815, 5956, 734, -6273, -8783, -3683, -4387, -4160, -5974, -2804, -2128, -813, -117, -135, -323, -313, -1331, -1542, 2166]
16669B166O263j389k539R66M532k9K946j036L292M942K331N113M574J846N776
16654C9754Q927P848J4258J5691J6090J7945J4080K2092K8106K6044J7425J0512
16642B38772O87j787j377q336j5067k3998j9617j6233j6538j8469k6975k2622
16630F8440j5233j3108o628r861j569o92k20k888k758p747n396M917Q68k417K002
16615G710N639j748j0524K536N454M344j662o427l481j953r22R89o02N446R97
16600E796k045k91M931P917m823l406n932l405j08O175K304Q49p295l523M522
16585A666l700m576M328K775L413N437k185m95j906J998L413j391l288Q27l956
16570B360L958N35k720Q40K705l618P87m06q452o361L543N226P821j792J530l191
$$ y = [2166, 8429, 7040, 4501, 5467, 9999, 9970, 12916, 11880, 15172, 20114, 22445, 27558, 32132, 33978, 39754, 48681, 56529, 70787, 86478, 102568, 120513, 134593, 156685, 184791, 210835, 228260, 238772, 239459, 237672, 236295, 227959, 212892, 188894, 169277, 153044, 136506, 118037, 91062, 68440, 53207, 40099, 33471, 23610, 22041, 21349, 21129, 18241, 15483, 7736, 2340, 7257, 8125, 5708, 7710, 13349, 11601, 1077, 3613, 9067, 13411, 11749, 5322, 1841, -112, -1034, -45, -647, 4799, 5796, 3751, 3460, 8391, 16308, 11485, 8079, 2147, -1258, -1366, 4809, 7113, 7962, 667, -2856, 1666, -2034, -6610, -2282, 493, 3906, 9343, 7158, 6663, 4757, 6755, 10168, 8777, 5489, 6316, 2360, 6318, 6853, 4133, 4973, 7678, 4060, 4847, 4441, -4011, -10372, -6829, -1603, 6218, 4426, 5956, 2765]
16554B765o651M264Q80N780K56l013R69Q142j06j93o406j300k117j682L375J36
16538E099l085J254k940O641J448k35M673m821r828o906K333K592J1272J994l620
16523E871L736J891j408m038K336O499J716r084j8k11p869p348J819P940L544
16508E376K773N471l466j612l05L190j219j0440j772P212N21m103l221k752P82
16493c565K975k478K564Q013R10q284n19O262r37j21M415l494q182o137L297M840
16477d41P510K651L882M99q492k428K599J170o228q390m383M765K247M737K748
16462B446K749j598M00J0348L052j777m157j809r334q438j1L824j121J247J637
16447b542L638N470L417J378l09l194p55Q32M332J414p6o055j766l473L739J028
$$ y = [2765, -3886, 378, 1258, 7038, 7294, 4281, 5250, 13392, 13286, 13093, 6687, 5387, 3270, 1588, 4963, 5099, 2014, 3268, 328, 6969, 8417, 8182, 12855, 8034, -1794, -8700, -6367, -3775, 7497, 9491, 5871, 9607, 11498, 10090, 6052, 8388, 14887, 16603, 7519, 7501, 7290, -579, -7927, -6108, 1832, 5376, 8149, 13620, 10154, 8542, 8237, 11427, 10208, -232, -2004, 5208, 5729, 1626, -1595, -4347, -3565, -590, -3068, -504, 7509, 8419, 135, -384, 5878, 4941, 4820, 9235, 5741, -2441, -8578, -5281, -441, 7069, 9720, 13602, 14101, 5609, 3181, 5780, 6950, 722, -7668, -12051, -7286, -5039, -302, 2446, 5195, 3597, 3997, 14345, 17397, 15620, 11463, 9654, 320, -8118, -8129, -4305, -5426, -4179, -2542, 1096, 6566, 9983, 11361, 11052, 7858, 7103, 7935, 12267, 13681, 13605, 7550, 5784, 2311, 6050, 7078]
16431G078j944J207Q084j03n792o590m092L136Q613l495l21M415K722l578m374
16416D966j96L17J579P968J434o598l205k656n6J221L17r84R76P071K353N90p714
16399G383j1303o435P575O904J637J998l531O21K915M501j821n979J710K320K42
16384H737l784k339L41l029k185O06n999O823M777k330J910K844P149M764k35
16369A8050j310l72l260l840j968L886O812j456j070l994J297O517k105J17J99
16354A7503Q652R141M403P303M449j074L613n094o845r27n867j0309p35k585j746
16339A9882l846q037l291P921M255k139n302j556k55j115K68k439K155L842n942
16324D401m391j152O851K873q91L902P31n175q90R585K063k214j407J641o7L481
$$ y = [7078, 5134, 6341, 14425, 14322, 8530, 1940, -2152, 984, 9597, 6102, 5781, 10196, 12918, 9340, 4966, 4770, 5087, 6666, 14634, 16068, 9470, 6265, 3609, 3553, 4774, 5091, 4107, 5083, 12154, 14507, 15097, 7383, -3920, -10355, -2780, 4124, 5761, 7759, 4228, 4849, 7764, 12265, 10444, 4465, 6175, 8495, 8737, 4953, 2614, 2955, -74, -2259, -1653, -7652, -829, 3948, 1618, 3528, 6372, 13521, 18285, 18050, 16740, 16368, 13108, 9268, 7300, 11186, 17998, 16542, 15472, 11478, 12775, 19292, 17187, 17304, 17503, 26155, 35296, 39699, 47002, 51451, 50377, 53990, 48896, 42051, 41124, 35257, 24948, 24213, 21628, 19882, 16036, 7999, 4708, 12629, 16884, 14745, 9443, 7887, 7632, 6517, 6785, 4346, 6501, 10343, 4401, 10, -1142, 5709, 8582, 7691, 11593, 12324, 7149, 6259, 15844, 17907, 15693, 14286, 15927, 15860, 19341]
16308A9341l510j657J0819M832j137j158q144o669M106Q12n687R58L749j501k184
16293A2970o16k12M391n576r8K972Q323l70J921M567k87l876J197L067j508N01
16277B7366m448m707O08k779n33M068J614N291k528k761l940p140q215K097Q271
16262A2264K883n34J578K904k273J161j17l141J204J647L11q461q099L089N843
16247A0259J0250L540n454o824l302O65j369L687K877k915p33j586m066k866j5
16232B148j269L940M444L331N915P031N786L578L279M683L841k503K400J0128
16218E6732K848J1665M576k586l79m310n842k047N164N018j99j352L477M020L756
16203H0541k106J505p866k502K205O6n842j0088k875m619R688J855n862n391Q199
$$ y = [19341, 15831, 14174, 24993, 29825, 28688, 27530, 19386, 12717, 16823, 17635, 11948, 12906, 16655, 15154, 12970, 12354, 12142, 16533, 10957, 10859, 13831, 22154, 21784, 23705, 28272, 27985, 24109, 25306, 28373, 26865, 27366, 22918, 18211, 18819, 16040, 15507, 19575, 21189, 26480, 23952, 21191, 17251, 10111, 1896, 3993, 12264, 15147, 14613, 16191, 19095, 16822, 17983, 17866, 14725, 15929, 17576, 17887, 9426, 1327, 4416, 10259, 20509, 24049, 18595, 11771, 8469, 9134, 7765, 11452, 14329, 11414, 10681, 9095, 5029, 2163, 2148, 879, 4819, 9263, 12594, 18509, 25540, 31326, 34904, 38183, 42866, 46707, 44204, 46604, 56732, 59580, 71245, 75821, 73235, 72856, 68546, 62704, 60657, 65821, 70839, 70640, 69288, 72765, 76785, 80541, 78435, 79940, 72074, 69572, 71777, 71843, 66001, 55913, 53038, 48419, 58107, 59962, 54100, 48709, 56908]
16188E6908Q196n108j31p623J453K041J357Q248N089n632n246j818M966N937N580
16173G4217O502N156J971J365L393L79L584Q78P047Q61O212P474L286Q806J2707
16158A43838L856j2P566J1659Q188L017L762J1691R915O670L347J8565J5367K655
16144B50084R690J5687K0299K2119K3515K0081J9383K0591L3752L6677K8728L4056
16132E34662M9049N6149O0481O3320O6377P8656Q3720R7261J05459J14989J25899
16121A436022J44127J60539J89167K33171K56491L06010L75225M76516O06941
16112D184209P95585J056621J397875J794930K265930K822726L286157L710654
16104B1314687M122153M424480M580793L764307L013764K726999J638879N31226
$$ y = [56908, 65104, 59996, 59865, 52242, 53695, 55736, 57093, 65341, 70430, 64798, 59552, 57734, 62700, 68637, 74217, 80719, 85875, 87846, 89211, 92604, 92983, 96567, 97445, 104492, 105353, 111565, 119039, 122325, 131131, 143838, 147694, 147682, 155248, 166907, 175095, 178112, 181874, 193565, 203480, 210150, 213497, 232062, 247429, 250084, 259774, 275461, 295760, 317879, 341394, 361475, 380858, 401449, 435201, 471878, 500606, 534662, 583711, 639860, 700341, 763661, 830038, 908694, 992414, 1089675, 1195134, 1310123, 1436022, 1580149, 1740688, 1929855, 2163026, 2419517, 2725527, 3100752, 3577268, 4184209, 4979794, 6036415, 7434290, 9229220, 11495150, 14317876, 17604033, 21314687, 25436840, 29861320, 34442113, 38206420, 41220184, 43947183, 45586062, 46117288]
16096D6117288r69536k023304k417495l520954m245650m463935m415238m062764
16088A9998412l714433l243221k697410k179263j697225j284909r52001o93349
16080C536601n15859l91241l03845k29644j86339j54842j31630j12773r9227q7433
16070A323768o9365o6454n8548m5513m0172l2212l8075m1817m6994m3894m3061
16059G97663m7012n6665n7046m7485m7127n5232m3571m4784m0891k9291j9656
16048C08903k4317k5132j7016j1485j3799j4200o087j1094p365N96k345K155l495
16035A75319m781o595j0688j3208k464J230n505q932l584M67L283k204l504m040
16021A14794J755P191j047j0923j1376k183o752N685Q241k689n761PN0N575N09
$$ y = [46117288, 45147752, 43124448, 40706953, 37185999, 32940349, 28476414, 24061176, 19998412, 16283979, 13040758, 10343348, 8164085, 6466860, 5181951, 4229950, 3536601, 3020742, 2629501, 2325656, 2096012, 1909673, 1754831, 1623201, 1510428, 1411201, 1323768, 1254403, 1187949, 1129401, 1083888, 1043716, 1011504, 973429, 931612, 884618, 840724, 797663, 750651, 693986, 636940, 589455, 542328, 487096, 443525, 398741, 357850, 328559, 308903, 284586, 259454, 242438, 230953, 217154, 202954, 196867, 185773, 178408, 179004, 176659, 178814, 175319, 170538, 163943, 153255, 140047, 137583, 138813, 133308, 124376, 120792, 121259, 124542, 122338, 118834, 114794, 116549, 123740, 122693, 111770, 100394, 98211, 91459, 97144, 105385, 102696, 96935, 96942, 96992, 102567, 103076]
16006A03076j4161j4908j0384n114O064O569L380m848k354o25o048k732l492k567
15992E1856j465M550K169l975r497n039K476k971k759j462O018j806k555j407
15978C4133l339J57K988K934m033r43j329J153N706R971N330j924q169K75Q694
15963E1604K446p855m602O430J638j366l872n675J100J420m03Q020J783J157m525
15948D7300j0297l293J178L907o2j1135l743k074m006l044K307N485r3O44J603
15933B4677N407K14l576r338p18M350M69l223K862L027l209k805l33o668j052
15918A0084L434l9p662l545J253j511k260K699j665L712J240O055J269m424o017
15903B623k6L836L899J788M100l052o59j372l115o388L838P554L684k176n561
$$ y = [103076, 88915, 74007, 63623, 58509, 64573, 71142, 74522, 69674, 67320, 66695, 60647, 57915, 54423, 51856, 50391, 54941, 57110, 53135, 43638, 38599, 41075, 38104, 35345, 33883, 39901, 38095, 35540, 34133, 30794, 30951, 33939, 36873, 32840, 31897, 30568, 31721, 37427, 47398, 52728, 50804, 42635, 42910, 51604, 54050, 46195, 41593, 48023, 49661, 48295, 44423, 38748, 39848, 41268, 40865, 48885, 50668, 51825, 47300, 37003, 33710, 34888, 38795, 38733, 27598, 23855, 21781, 17775, 14731, 17038, 22523, 22430, 23074, 24677, 30084, 30298, 26722, 17384, 16666, 21016, 21485, 18262, 21124, 24151, 20942, 18137, 17804, 11136, 10084, 13518, 13479, 5817, 2272, 3525, 2014, -246, 2453, 788, 4500, 5740, 11795, 13064, 8640, 2623, 2597, 6433, 10332, 12120, 16220, 13168, 12509, 11137, 8022, 1634, 5472, 13026, 16710, 14534, 8973]
15888H973l184J859r44Q404R90k810m399m9j817J415J611q36R295R149J951n540
15872B4068q389k566k400l489Q50N205M360l018k163J125o05j391L331P9l614
15857A1383k253k567J455J078j361M777p63l895M807j142J504M597j283J634q54
15842A7117P98k144m50J380q5m955m867j26m405O79N456o835j433M205P340J941
15826A3616j099j324M225l845k541L545Q6K102l474k872L420K079r90j093l111
15811H724n681L555J2278L070r707p112P030P335j750m827L890k504n681o215
15797B405k34k780k198K639k64j598K589n148L435N400j470O335J155M475M774
15782A9515n431r524n655M186J266r48k366m550O112J0308o606p376Q346J294
$$ y = [8973, 5789, 7648, 6704, 15108, 16098, 13288, 8889, 8840, 7023, 8438, 10049, 9213, 18508, 27657, 29608, 24068, 15679, 13113, 10713, 7224, 8074, 13279, 17639, 14621, 12458, 13583, 12978, 11587, 14918, 14997, 11383, 9130, 6563, 8018, 9096, 7735, 12512, 11749, 7854, 12661, 11519, 13023, 17620, 16337, 17971, 17117, 17915, 15771, 15321, 16701, 16616, 11661, 6794, 6668, 2263, 2942, 8398, 1563, 130, 4335, 11675, 13616, 12517, 11193, 15418, 11573, 9032, 12577, 12663, 14765, 11291, 8419, 11839, 13918, 12928, 11835, 8724, 3043, 6598, 18876, 21946, 12239, 5127, 12157, 19492, 17742, 12915, 16805, 14301, 8620, 2405, 2171, -609, -2807, -168, -432, -2030, 559, -4589, -1154, 4246, 2776, 9111, 10266, 14741, 19515, 14084, 4560, -1095, 3091, 4357, 3409, 1043, -3507, 2605, 12913, 6307, -1069, 7277, 8571]
15768H571m460L821K858O66L149p069o276K121p56Q83J925l066L18r05k67p505
15752e992J190L752j895j101M234Q558m904L423L6q934L195J610k470m45p39L51
15736a31L493L589M124m147P81N094L302k866m876N67L15K857O986k061p180m657
15720E190n176M19L211P00m30l37L752J441K114l738q089q4N063K316p291j096
15704b035K704J790J408J984o143n125J855N643K903L120L38q333k713J13L486
15689I95q61k51l893%O823k23l018P43L801k059K618m64K686L459l046o326O93
15672A677K714J750j96n561j047O239J853N542K483L943p245j453Q05Rn21m167
15656F825l964n303j026N035j053N349k611o657q108J200M107R015l44r339N230
$$ y = [8571, 4111, 7932, 10790, 11456, 14605, 7536, 1260, 3381, 2625, 3508, 5433, 2367, 2685, 1780, 1513, -5992, -4802, -1050, -2945, -4046, 188, 8746, 3842, 7265, 7301, -1633, 1562, 3172, 702, 257, -482, -131, 3362, 6951, 11075, 6928, 7709, 12803, 16105, 13239, 8363, 8930, 9245, 12102, 19088, 17027, 9847, 5190, 14, 433, 3644, 4344, 3914, 3577, 7329, 8770, 10884, 7146, -943, -1027, 4036, 6352, -939, -2035, 669, 2459, 3867, 5851, -292, -5417, -3562, 2081, 4984, 8104, 8442, 109, -2604, -2491, 995, 134, -117, -4010, -4010, 2813, 2590, -428, 315, 4116, 2057, 4675, 4211, 6897, 10356, 7310, 984, 1677, 4391, 6141, 5945, 384, -663, 5576, 7429, 12971, 15454, 19397, 12152, 10699, 11504, 11513, 10992, 6825, 2861, -2442, -3468, 1567, 514, 5863, 3252, -3405, -11513, -10313, -6206, 2809, 2465, -6874, -1644]
15641a644L005J622O66J667L680j457k654K97q56k296K000j752m437o891j215
15626a0265Q112Q063m131k58k238j566K298m411J270O302n75k019j0950J276N517
15611c575M313j986n458J640Q172Q009M296K21k405J859L643l708q400n756m09
15596D56M948O470K842k015n134J096P70O544k736j523k831n04n693k714o86P58
15580D8j72J1818O995m719l866k716r89K698N359M030j770J446k325o031J421
15565A1227M16J732K502J805O859Q201J1208J3748J3583J0634J3527K4808K7338
15552A47588K2402K6230J3991J6522J2895P511j40j0356j1418j2254k4287k5362
15540A63322k5566j6296k4376k1165j1414j4402n851K924r587j3859j0087n449
$$ y = [-1644, 1361, 2983, 3649, 5316, 8996, 7539, 4885, 5182, 4326, 2030, 4030, 2278, -2159, -9050, -10265, -2153, 5910, 1779, 1521, -717, -2283, 15, -4396, -3126, 3176, 2601, 582, -10368, -9092, -3575, 738, -1248, -6706, -5066, 3106, 11115, 15411, 15632, 13227, 15086, 18729, 15021, 6621, 865, 456, 5404, 11874, 14716, 12701, 7567, 8663, 9433, 15977, 13241, 11718, 8887, 8383, 2690, -24, -710, 48, -124, 11694, 18689, 13970, 10104, 7388, 6399, 9097, 14456, 18486, 16716, 18162, 15837, 9806, 11227, 11643, 13375, 15877, 17682, 24541, 32742, 43950, 57698, 71281, 81915, 95442, 120250, 147588, 169990, 196220, 210211, 226733, 239628, 247139, 246999, 236643, 225225, 212971, 188684, 163322, 137756, 121460, 97084, 75919, 64505, 50103, 44252, 47176, 37589, 23730, 13643, 8194]
15528H194N563K546K187m258l838p744M189N304l775k741k824K36M194K777P82
15513A0792P41k072l122K22M632q772n946p25j228K4l499J232O157l875j826N225
15497b040n521k834M642O613J1535N046M324R34n458q285j4465J666K760j227
15483b310K030O991j628n369m378J97j569k811L778N530n666n413O340j312o197
15468a1787m80L153K486m558N093j357O299Q613m351r297j045N628L604n74N77
15453B004N339P1m980p818K99k48P340J288k293j939m123J194N35N24L254l39
15437A08m097l55K74K809R63p680J047N221L045P35j715r649j909Q632N802K038
15421E269M97J488k092L51J979J254n176n725j895P015N563M42q10L754o879l590
$$ y = [8194, 13757, 16303, 18490, 14232, 10394, 2650, 6839, 12143, 8368, 5627, 2803, 3039, 7233, 10010, 10792, 11533, 9461, 6339, 6561, 11193, 2421, -3525, -4250, -5478, -5454, -8953, -7721, -1564, -5439, -7265, -2040, -7561, -10395, -5753, 860, 12395, 17441, 21765, 22699, 17241, 8956, -5509, -3843, -1083, -2310, -280, 6711, 5083, -286, -4664, -4467, -6036, -8847, -5069, 461, -5205, -10618, -4278, -5590, -11787, -12267, -9114, -6628, -11186, -6093, -7450, -1151, 7462, 3111, -6186, -7231, -1603, 2001, 1427, 2004, 7343, 7414, 2434, -5384, -5085, -5333, 2007, 3295, 1002, -937, -5060, -3866, -3331, -2807, 447, 108, -3989, -4344, -4070, -1261, -298, -7978, -6931, -1710, 1335, 2070, 355, -9294, -11203, -2571, 3231, 5269, 5766, 7254, 5162, 5513, 7492, 8746, 3570, -2155, -4050, 2965, 8528, 8970, 8160, 11914, 5035, 1445]
15405A445L337J208j617r549o944M410O274L969R77p75j450q91m87o431o821L489
15389i856L558J890J796o28k76l940m424M325K819K839J566l537o003J616M414
15374c841J188n028M534O511l422q445l924l80K701L004J0521K296p456r799L957
15359g583O020O105L04k407j572O975o13p113k54j873n147l075K242M060k841
15344f772j527p50N32k047L23r7J610L88Q078M404j940O71R11j158K819N667k291
15327H821l270k234J89m224p170L468O729m019m0l492r046M22L073J022J952l274
15311a1093n778K679j728K536J0662L031J542L071m59K646L018n039k756N834
15297H166r264o329M14O185O676n173R13M594l883J457M967o410m492R19R227
$$ y = [1445, 4782, 5990, 4373, -5176, -12120, -7710, -1436, 2533, 3510, 2735, 1285, 394, -93, -6524, -13345, -9856, -6298, -4408, -2612, -3240, -3516, -7456, -11880, -7555, -4736, -1897, -331, -3868, -9871, -8255, -3841, -2653, -7681, -3147, 3364, -58, -8503, -12427, -12807, -10106, -7102, 3419, 5715, -1741, -11540, -7583, -1563, 4542, 4846, 2439, 867, 7842, 7229, 116, -138, -2011, -7158, -10233, -7991, -3931, -6772, -8299, -9049, -8517, -10564, -10241, -10338, -8728, -8340, -262, 4142, 2202, 2873, 3784, 2626, 5445, 11112, 8821, 5551, 3317, 3506, -718, -7888, -4420, 2309, -1710, -1750, -5242, -14288, -13866, -10793, -9771, -7819, -11093, -16871, -14192, -15920, -13384, -2722, 309, 1851, 4922, 4463, 7109, 10127, 5088, 2332, 8166, -1098, -7427, -7013, -828, 5848, 675, 1588, 6182, 2299, 3756, 8723, 2313, -2179, -1260, 7967]
15282G967N134o585j220JK111j013k649k400j107M222k806m310k925l82r66m38
15266g366j520K561n622J849O892K252o75L51J115L13K509m230q894J709M465
15251d291m310l168M501N451O133n357J820J998m840j02L021L136O80M67K802
15236G941Q2l521q23l414n804q34N224j264K685K832r73P35P03M42q236l814P924
15219a15K826k04K676j7j770J47N500n683N31k214M27K847m00L500o229o025N553
15202A350O795L31M821M113k9k81l994m123L984j005l639L834m996J518K199j209
15186I669L304n888j0180O79N096O534M271l816p759j902M934l516n605J455k116
15171d840J00M356N084j942l119r382m440J629j009J984R114N338K989j888n027
$$ y = [7967, 13101, 6516, 5296, 5297, 7408, 6395, 3746, 1346, 239, 4461, 1655, -2655, -5580, -5962, -6928, -7366, -8886, -6325, -11947, -10098, -3206, -954, -1629, -1278, -163, 150, 2659, -1571, -10465, -8756, -4291, -8601, -11769, -7268, -1817, 4316, -1041, 779, 2777, -2063, -2165, 856, 3992, 4672, 5139, 7941, 8023, 4502, 3679, 265, -5539, -6373, -1149, -2413, 272, 3104, 2131, 2866, 3569, 4011, -4225, -8039, -115, 2711, 2507, 5183, 5166, 3396, 3543, 9043, 3360, 3891, 1677, 2104, 4951, 4551, 8051, 1822, -4203, 1350, 8145, 8476, 13297, 17410, 17381, 17100, 13106, 8983, 12967, 11962, 8323, 12157, 7161, 8679, 10878, 9669, 12973, 7085, -3095, -2416, 2680, 9214, 13485, 9669, 1910, 8, 4942, 1426, -4179, -2724, -4840, -4740, -384, 4700, 2758, -361, -9743, -14183, -12554, -13563, -11579, -2465, 2873, 5862, 3974, -1053]
15156a053l398k368m254M291O849N793k498l406O238K751l146J640K998r87n381
15141D069L198P57m299k333J574J557k134l179o024L469j525P153M464n419L194
15126D522P412K135o887k314Q60o474o06L929q59l699N683L832k180m818r66L459
15110C029K187k0l649J254L70J881Q00k489j890n669k532J93K715K413Q10L998
15094C401m058m896J245N697O989J661n212l359q97m292k662J892Q49k309m255
15079a0206L932O685K242R329j813l817j804L71n809N250m102r049R9k593l127
15064a4412J903L126pM504m554m226M018Q889L884l586K825k10L90L6J114J323
15048E017m751r96M97k595O526N99J002q390p65L140k662N77O544J383l307n529
$$ y = [-1053, -4451, -6819, -11073, -6782, 67, 5860, 3362, -44, 6194, 8945, 5799, 7439, 10437, 9450, 4069, 7267, 8024, 3725, 1392, 2966, 4523, 2389, -790, -6814, -3345, -4870, 2283, 6747, 1328, 4522, 11934, 14069, 7182, 4868, 5728, -746, -1352, 2577, 1718, -1981, 3702, 7534, 5354, 536, -430, 3029, 5216, 5196, 1547, 2801, 3171, 5052, 5852, 3363, 1473, -4196, -6728, -6535, -3820, -1407, -597, 3401, -657, -5553, -4308, 1389, 8378, 10039, 4827, 1468, 571, -3721, -6383, -4491, -3642, -5951, -10206, -6274, 411, 2653, 11982, 10169, 6352, 4548, 4919, -890, 4360, 258, -8791, -8692, -11285, -14412, -12509, -9383, -9390, -4886, -9440, -13666, -9648, -759, 3125, -461, 2364, 2154, 2544, 2580, 3694, 5017, 266, -730, -233, -2828, 3698, 4297, 5299, -3091, -3856, -716, -3378, -2801, 3743, 5126, 1819, -3710]
15032c710J312k075Q01K72M02K26P188K787j108N520p299r722J717N867K037k271
15016A944L757J271p193M718K253l436M225j424j870M705m835m328J651O119m271
15001C286m008r370J215L452L165o34k143n088m177M581M204L698j557K997M281
14986C902Q360p531j1668m589l695N594k32k207J303Q332M083k86l061O484Q49
14971E638l695L076J80p92j867Q83O3l171M528J143l57J850k912l986L602J364
14955E547J91l808l324m163k424n95J809J0561N313j60o846l232j011k539O699
14940B018N435R49l583j816J175k129p002n353l904Q571P581O662l458R33j891
14925D188q914k269M552J453n098j0545L413M349M193K268N87J216o266m534N76
$$ y = [-3710, -2398, -4473, -3672, -3400, -2998, -2772, 4416, 7203, 6095, 11615, 4316, -5406, -3689, 2178, 4215, 1944, 5701, 6972, -221, 4497, 6750, 3314, 7539, 6115, 4245, 8950, 4115, -213, 1438, 7557, 3286, -722, -10092, -8877, -5425, -2260, -2894, -5037, -10125, -14302, -9721, -5517, -1819, -3376, -379, 3902, 12262, 4731, -6937, -11526, -15221, -9627, -9859, -12066, -10763, -2431, 1652, 1366, -1695, 4789, 5638, 1943, 5019, 5199, 4407, 2540, 3423, 3486, 315, 4843, 5986, 5629, 7479, 4567, 581, 4183, 5547, 5738, 1930, -1394, -5557, -7981, -8576, -6767, 3794, 9107, 8947, 2101, -1131, -2142, -4681, 2018, 7453, 8402, 4819, 3003, 4178, 2049, -4953, -10306, -14210, -5639, 1942, 8604, 5146, 6079, 4188, -4726, -6995, -2443, -990, -6088, -16633, -13220, -8871, -4678, -2410, -1823, -607, -6873, -11407, -10831]
14910a0831O957n057l362N499L681r54j268N902J136j499k223K014J508J671l403
14895b29P92m197j293Q591l142j027q85o507J972L024N568j002q04n5P32m224
14879b686l754r138o570Q731P913L801R19k199l922K810N719k085j040J609m166
14864d058K79j761j739K982J0m39j1J824J35N988J832m204J510k23k309j925m66
14847b575j672q889j056n385M599J1594R706k787l483j633j912O190o17k941o99
14832a560L334j05j247O55K775O439K168o768n55K083j922l502J129J653j257
14817C320m816j797L418J472p86K962j568n599M223O383K252l090o563o497L096
14802c590K838Q663k619q884o692Q04K747p313l228Q558M793N91L882l156Q90
$$ y = [-10831, -3874, -8931, -12293, -6794, -3113, -4067, -5335, 567, 1703, 204, -2019, -5, 1503, 3174, -229, 563, -3634, -4927, 3664, 522, -505, -1390, -7897, -5925, -2901, 2667, 1665, 861, 806, 1538, -2686, -6440, -15578, -22148, -13417, -5504, -1703, -784, -2983, -6905, -4095, 1624, -461, -1501, 108, -4058, -3779, -5540, -7279, -4297, -4287, -4726, -4737, -2913, -2778, 3210, 5042, 838, 2348, 2125, -184, -2109, -2575, -4247, -13136, -14192, -19577, -14978, -3384, 6322, 3535, 52, -1581, -3493, 2697, 2080, -861, -1560, 1774, 1669, 422, 1077, 3852, 10291, 12459, 5691, 5136, 7219, 5297, 1795, 2924, 4577, 3320, -1496, -3293, 125, 1597, 811, 3773, 2205, -3394, 829, 7212, 9464, 6374, -189, -6686, -3590, -752, 7911, 5292, -3592, -10284, -9480, -6733, -14046, -17274, -8716, -3923, -3332, 550, -2606, -1716]
14787a716N234J658j670k619P055M023n748M31N635l17r050o036L918l039m084
14772f325K114L300j604J94J27J9O405P51q353l815M313l665J423J0034J806q606
14756a882m625j630M362M850J502m026l179j438J265N6p22k32N91q11l169n682
14740a4770j951Q378M480j152K828n167N74O489N732M246j928j688o038k330J126
14725a171n06m196o177n743J1047N916j140K829P46m487j405l668P59L407n6j021
14709d866J9L849K831q813L290N287O83k848l383j636M561j507R42L963J45L735
14693F252M786k140p864j245q693j298J456L158Q616Q02J073j245P682j99k958
14678H183l03l34J959p38o862q89N278J652k585M621n843o485j83M908M40L953
$$ y = [-1716, 3518, 5176, 3506, 887, 7942, 11965, 6217, 6648, 12283, 11966, 2916, -3120, 798, -2241, -6325, -4211, -911, -2515, -2321, -2194, -2175, 4230, 4981, -3372, -7187, -2874, -6539, -5116, 4918, 6724, -1882, -6507, -8137, -3775, 1075, 2577, -1449, -4628, -6066, -4801, -4745, -5467, -5699, -5108, -5919, -9088, -14770, -16721, -8343, -3863, -5015, -2187, -7354, -6780, -291, 5441, 9687, 7759, 6071, 33, -2297, -1171, -1677, -5873, -12050, -17793, -6746, -830, -1970, 859, 1605, -2882, -4287, -7955, -7196, -3789, -3845, -4866, -4847, -998, 1833, -6980, -3690, 1597, 2280, -568, -3951, -5587, -1026, -2533, -1591, 2372, 2517, 6252, 11038, 8898, 1034, -211, -8904, -10202, -8746, -5588, 3028, 3830, 4903, 3658, 11340, 11141, 8183, 7880, 7546, 9505, 8767, 1905, 1016, 6294, 7946, 5361, 9982, 4139, -2346, -2529, 2379, 2819, 6772]
14662F772n51j942m662o36L799K81j646L665l106k746L92L274K771m583j830n565
14646f313P70K065K390j101k080j031J957K295l974J351K721L832J258q78J298
14631D560N322K255p143q328l061l570K433l453o04L530o25M484N349l635J010
14616a476L451k503K277K044n660m535n541J533N751O001J710k692K61k478m968
14601f825M504O895m754l157L270p75q28J513n964J287N487O4l722k303L901M01
14585a006N93K575L372L463j0958L407P406m521n19J290l403Q96K851O68l090
14570C024m112J279m659n329j368K758J148L329k135J327K284N022J415p15p47
14555B521J329Q297m352j4777k41k827n229R14NO92J0239Q508n326q239K081r48
$$ y = [6772, 6221, 4279, -383, -1019, 2780, 3061, 1415, 5080, 1974, -772, -380, 2894, 5665, 1082, -748, -6313, -5543, -3478, -1088, -2189, -4269, -5300, -3343, -1048, -5022, -3671, -950, 2882, 4140, 3262, 4560, 9882, 12137, 4994, -3334, -6395, -9965, -7532, -10985, -11589, -8059, -8684, -4200, 1149, -2486, -1476, 1975, -528, 1749, 3793, -1867, -6402, -11943, -10410, -4659, 1342, 3052, 360, 621, -1857, -6825, -2321, 4574, -180, -3337, -67, -842, -1670, -157, -6121, -4834, 653, 717, -3005, -5308, -1407, -1006, -413, 2162, 5534, 8997, -1961, 1446, 8852, 4331, 3812, 5102, 1699, 2595, 5446, 6114, 3024, -1088, 191, -4468, -9797, -11165, -8407, -7259, -3930, -6065, -4738, -2454, 2568, 3983, 3268, 2521, 3850, 12147, 7795, -6982, -7223, -10050, -15279, -14365, -14360, -13668, -3429, 5079, -247, -8486, -6405, -7353]
14539g353j708N170K157p87J936O213K031r427l989J813M461R31k764j402K347
14524c71l746l251j642M50j191O37k923J041O918j287n08j312L796N017l088r47
14508b407j125L174m422k888J636j332L870j589k82M691L192m30l550K945L958
14493E441r126n550j727Q66P128J078l14L223L176L759j507l086k835L992l934
14478E84Q07Q77k323o3p59J468o524n090M249L252M87N815M251l396m835J225
14462B5J124m167j073R065P98n45K58K716k936p835j58N697j871o894L187j177
14446c786J123l307m289K203p66n95p09l750M313N568J182j41K270k611Q888M472
14430A0065j463l769n139J549m3j374O997K237j1438m063L020j665N959l484n111
$$ y = [-7353, -9061, -3891, -1734, -2521, -585, 5628, 7659, -1768, -5757, -3944, 517, 1448, -1316, -2718, -371, -4117, -7368, -9010, -8560, -9751, -9114, -12037, -10996, -4078, -5365, -5873, -7185, -3389, 1628, -1460, -2407, -3532, -358, -4780, -7668, -6032, -7364, -3494, -5083, -5365, -674, 2518, 2088, -1462, 1483, 5441, -3685, -9235, -10962, -10096, -2968, -1890, -2204, 1019, 4195, 7954, 6447, 3361, 526, 4518, 584, 1391, 2268, -55, -118, -877, 591, -5933, -11023, -6774, -3522, -3035, 2780, 7031, 3635, -1200, 25, 1149, -3018, -4091, 4974, 5772, 5227, 5485, 8201, 5265, -2570, -2728, 2969, 1098, -5796, -2609, -3786, -2663, -5970, -10259, -8056, -8822, -9417, -10126, -13876, -9563, -3995, -2813, -2954, -684, -3295, 5593, 10065, 8602, 4833, -306, 1243, 1200, -174, 6823, 9060, -2378, -6441, -3421, -5086, 873, -2611, -7722]
14415g722l552J045L856L418j772J305N870L105n35M338j941N20j027K845o510
14400C243n544l642l505L097O97k636K223K547Q78m557J009n13J007K949m44n059
14384h250J101K823m052p95N578K10j4708l165R783j640K248L59p71O516O838
14369B075L604n286p253j614N507j033L119O182N91l047p39p247R02j704j170
14354g113M917K937O448k870m573l109m74L695J097L234q18m367N738l290r072
14339g620J727P088n9l346J725m86l434j320M323P110q87q442l802L334q83j37
14323e109j846K635N37j314l507q56j720k109m43K842K114N532j971m11j098j540
14307h264P67J379P678M831J119m873k580M255l163j440L156j994l081N414M09
$$ y = [-7722, -11274, -10229, -6373, -2955, -4727, -3422, 2448, 5553, 5018, 9356, 7415, 7935, 6908, 9753, 3243, -2301, -5943, -9448, -6351, -5654, -8290, -6067, -3520, -2642, -7199, -6190, -6703, -5696, -2747, -3191, -8250, -7149, -4326, -8378, -9173, -3595, -3385, -18093, -21258, -11475, -13115, -10867, -10508, -11279, -4763, 2075, 5679, 393, -6860, -8474, -2967, -4000, -881, 5301, 5892, 2845, 2106, -5141, -4239, -5943, -7113, -2196, 741, 7189, 4319, -254, -3363, -3837, -142, 955, 4189, 3371, -996, 4742, 1452, -7620, -5893, 1195, 1136, -2210, -485, -971, -4405, -5725, -1402, 5708, 4821, -3621, -7423, -4089, -4972, -5109, -6955, -4320, -3783, -5097, -8604, -9460, -11180, -13289, -13732, -10890, -8776, -3244, -5215, -5626, -6724, -8264, -7497, -6118, 1560, 6391, 7510, 2637, 57, 4312, 1149, -291, 2865, 871, -2210, 3204, 3613]
14292C613k799M138L1o207p31Q327P03q70K110L411m389n919K49R08J905L80n62
14275D298L664n42p694J542N909r839n148K570N321M135k495j461M728L882q145
14260G25m228o243r05J800j608J0371M283m611l332o948R5Q642K851j195o941
14245g244l041j583Q630K41l446K622k299O61M376J94N793M228K833r592k636
14230b63l194k363j045j108L07J875K665q41L534P706J224j888L25O895l188k953
14214G688j884k074K257M144o246j240j317r11p832k249J0825L546n967p330j331
14199i921J925J484L526r46L468L875L194l074p295j506M52J75M559L600j203
14184B313m876J634J761p79m349j172j386M176m032K945P091j715p026n09P108
$$ y = [3613, 814, 4952, 4983, -1224, -1955, 6372, 7075, 6205, 8315, 11726, 7337, 1418, 1667, 2575, 4480, 4860, 4298, 7962, 7420, -274, 1268, 7177, -2662, -7810, -5240, 81, 4216, 1721, 260, 4988, 8870, 725, -3503, -9746, -10651, -8851, -10459, -88, 4195, -416, -3748, -10696, -10601, -1959, 892, -303, -7244, -10285, -11868, -3238, -2997, -6443, -3821, -6120, -5459, -1083, -889, 4904, 9132, 11965, 2373, -263, -3457, -5820, -6865, -7973, -7666, -5791, -3126, -3967, -433, 7273, 8497, 6609, 6934, 13829, 10641, 7688, 5804, 3730, 5987, 10131, 3885, 2645, 1328, 417, -7415, -9664, 1161, 4707, -1260, -8590, -9921, -7996, -6512, -2986, -3932, -464, 3411, 6605, 3531, -3764, -5270, -4818, -4643, -84, 3516, 2313, -2563, -929, 832, 53, -4296, -5468, -6854, -2678, -6710, -3765, 3326, 1611, -5415, -5924, 1184]
14169A184m634k510m532q37k579L204N502J818L222P08m699n849M018N414o174
14154f744m139Q29K713O669j896K149J105j074k945K813m489l430M741k010j881
14139g589N62K959l647K766J571O938m56j682l73l399L916j043j019j14r15l100
14123d625m187M656M781j417k017K57J245K196M607L932l671k139j729K110J15
14108D114q496J876K213j026m045n295l360N869J0582Q410N40l913n287j658K378
14093B902m023m132o198K411L018L262n867o28Q53m578l820K436J165O188J011
14078f000o946Q23Q713Q857k641n88M969l727M42j972q849K968M470K077o87n052
14062c143j548L83P062K031J63m084k373j351M88K184R78m482L47R282p309K22
$$ y = [1184, -3450, -5960, -10492, -11329, -13908, -10704, -5202, -3384, -162, 546, -4153, -10002, -5984, -570, -6744, -10883, -10054, -7341, -672, -2568, -419, 686, -388, -3333, -520, -5009, -8439, -3698, -5708, -7589, -7027, -4068, -7715, -4949, -3378, 3560, 3104, 1422, 1049, -2350, 1566, 523, -496, -610, -1525, -4625, -8812, -4156, 625, -792, -2809, -2552, -1307, 889, 5496, 9428, 5757, 3618, 1889, 3999, 4114, -4382, -2506, -293, -1319, -5364, -10659, -14019, -8150, 2432, 10842, 11382, 7469, 2182, 524, 2902, -1121, -5253, -11451, -9040, -6022, -2760, -8627, -9255, -8402, -12980, -16800, -14364, -13199, -7011, -6000, -12946, -12123, -3410, 5447, 2806, 2218, 7187, 3460, 3902, 1930, -6919, -3951, 519, 2596, 1909, -3143, -4691, -4308, 2754, 4785, 4948, 864, -1509, -2860, -2372, -188, 790, -3692, -3345, 5937, -1372, -1150]
14046a150K529J310k477p724R22O896M430j727n283o371J220N83M155M271L269
14031D853l846m130m147L938N18K0K949k545o499K639M455k585L937k201k458
14016e102L350p966k435N78L625P736J710q375p199Q229K131k966P640N602J67
14001F725k695n002k791L20P215K736p57l999k920M376L413J563m950n159J240
13986f85l921M189J464N617m142q804l883q45M237N788M12K755L984l97N039j0371
13970D37o852n370j375O835J194P26K024N058k357o476l644L170L000k613j744
13955g987O535k20m355m000o712M179J946J073j518L628o762K876K118M288M635
13940b76J45m006o47m25o284L734O895M98l793j692m535j461N009m44m398J970
$$ y = [-1150, 1379, 2689, 212, -7512, -6590, 306, 4736, 3009, -2274, -8645, -7425, -6842, -2687, 1584, 4853, 1007, -3123, -7270, -3332, -2814, -2794, 155, -2390, -8889, -6250, -1795, -4380, -443, -2644, -5102, -1752, -9718, -12153, -11575, -7950, -214, 1496, -6879, -14078, -5849, -3718, -6684, 956, 6558, 6725, 4030, -972, -3763, -3443, 3772, 6508, 5751, 1752, -1168, 3208, 6621, 8184, 3234, -1925, -685, -4606, -417, 1047, 6664, 2522, -6282, -10165, -11010, -6773, -985, -573, 2182, 6166, 5769, 10808, 437, -6415, -11785, -13160, -6325, -5131, -4405, -2381, 2677, 320, -6156, -9800, -6630, -3630, -6243, -7987, -1452, -1672, -6027, -10027, -16739, -12560, -10614, -9541, -11059, -7431, -14193, -11317, -9199, -4911, -276, -131, -4137, -4784, -5209, -11493, -7759, -864, -366, -4159, -5851, -10386, -11847, -6838, -7282, -11680, -9710]
13924i710j122P345N334o503n219O27M262K407J1030L435o294m877K608n27l064
13909b68M638j559o381j282J656k151k117J569L482k331j07O95k871J292j011
13894f746O214j265o196k322J22K490r34Q229K499k180L031N522p643j1469J437
13879i211N831N397O618j391k86k94o585o549L631K420M337M524n518j658l371
13864b105k556k567j202k567O76M071R36p146Q61L662Q206L137j091j043n90j407
13848g25l1k43k54Q74R76L64K856K089M79n004K962N388q177j2644j17P926J357
13831a924k933k9k116l279Q45R847L200k635K050M076q907p484n50L188L358m35
13815c728k513j54L165O303N288l841n062K69m159j800N89Q79k102M109P663q92
$$ y = [-9710, -10832, -3487, 1847, -4656, -9875, -9248, -4986, -2579, 8451, 11886, 5592, 715, 3323, 2796, -268, 4370, 2811, -3570, -4852, -3196, -5347, -7464, -5895, -2413, -4744, -4851, -4156, -7027, -5735, -6746, -532, -1797, -7993, -10315, -10193, -7703, -8637, -408, 2091, -89, 2942, 8464, 821, -10648, -9211, -3380, 2017, 8635, 7244, 6958, 6664, 79, -6470, -2839, -419, 3918, 8442, 2924, 1266, -2105, -4661, -7228, -8430, -10997, -10321, -6250, -5314, -12460, -11599, -7937, 269, 3406, 2315, 1272, 682, -725, -756, -999, -1253, -379, 597, 961, 3817, 5906, 6385, 1381, 4343, 9731, 1554, -11090, -11207, -3281, -1924, -4857, -4886, -7002, -10281, -9436, 411, 3611, 976, 3026, 7102, -1805, -9289, -9839, -6651, -3293, -3728, -6241, -6395, -3230, 3073, 8361, 4520, -542, -273, -4432, -6232, -5643, -4764, -6866, -2757, 4906, 4014]
13799D014n365J887r21k862j258L008O829Q976m103n924n638n290m927l208k821
13784a7603O157M630j873l777J410K192K342J402L588l823j13r90l629R51K131
13769g005M559J175m846q375M498R260K085n996l527J201j070K95K154N829L311
13754C548N232K82n073l689j736m687L794P252L072N212J876j151m48m656q243
13739E85j0731l985R796K777k046K536j447J368J370L69r67M881k778O96N384
13724G808p893r20L373m497q313k846O164L899L118l03J4o223m14P80L686l71
13708b938R46l774j785m734p39j104p666P115M056L847J401N347M471n526m620
13693e703p158N926M821L25K403P421n821n496J459k821L729M411p112n315M819
$$ y = [4014, -1351, 536, -385, -3247, -4505, -1497, 5332, 14308, 10205, 4281, -1357, -6647, -11574, -14782, -17603, -11446, -6816, -8689, -12466, -11056, -8864, -6522, -5120, -1532, -5355, -5468, -6458, -10087, -9136, -7005, -2446, -1271, -6117, -14492, -9994, -734, 1351, -4645, -8172, -6971, -8041, -7746, -5592, 237, 3548, 8780, 9062, 3989, 300, -1436, -6123, -2329, 4923, 7995, 13207, 15083, 13932, 13484, 8828, 585, -10146, -14131, -4335, -1558, -3604, -1068, -2515, -1147, 223, 592, -375, 4506, 1728, 2424, 7808, -85, -1005, 2368, -2129, -10442, -13288, -7124, -3225, -107, -410, -396, -6619, -7033, -6253, -2567, -2938, -1992, -5766, -7551, -12285, -13024, -14128, -21794, -14679, -10623, -6776, -5375, -28, 4443, -1083, -5703, -12861, -6935, -2114, -1789, 614, 8035, 2214, -3282, -1823, -4644, -915, 3496, -3616, -8931, -4112]
13678d112M909n438p265l7N050M11j38j710k930M338K715m04Q24M42J820l58k933
13661d816m84o70j464p40L973J296k530K613M058K419O238L34K670J655k146J262
13645A3668l641p429k526m522j96q44J647j157l650L31L319N67N615O041l992
13630C231j031M739m362j024k190j649M091N277j119m286q172q763O293R712J517
13615B264k075l833n609j195P423K257K569o549k937P19j455k073J086M992R706
13600E290j064l626q050k90k791l03O390J0039J135Q8m216l132Q088K007r612
13585d7k611L798J724p61j09r52L932J020q468j2151P372J0729M335l843q358
13570d390m624N685J1111l525r90j525M187Q674N43j438k957m041k203K840p088
$$ y = [-4112, 797, -4641, -11906, -11943, -6893, -6482, -6620, -8330, -11260, -6922, -4207, -4611, -3787, -3345, -1525, -1883, -4816, -5300, -5970, -7434, -8174, -4201, -2905, -5435, -2822, 1236, 3655, 9893, 10227, 12897, 14552, 12406, 13668, 10027, 2598, 72, -4450, -4646, -5490, -3843, -5000, -8650, -8319, -5000, -4433, 1182, 7223, 3231, 2200, 6939, 2577, 1553, -637, -2286, 1805, 7082, 5963, 1677, -6495, -15258, -8965, 747, 2264, 189, -3644, -9253, -10448, -3025, -768, 1801, -4748, -7685, -6966, -8421, -10494, -9408, -4416, 5290, 4226, 600, -7450, -7740, -10531, -10834, -4444, 5595, 6730, 6818, 2602, -530, 7558, 9565, -47, -2658, 1140, 2864, 2103, 1994, 1042, 4974, 5994, -2474, -14625, -7253, 3476, 7811, 3968, -4390, -9014, -3329, 7782, 4257, 3267, 1742, 5929, 14603, 15146, 13708, 10751, 6710, 4507, 7347, 259]
13555B59j777j47J254J1q58k668m353K166N418N743n34r28m017N38P065K38l55
13538G055m69j3J07p613n488n189N765q79l543M01l522k301L233J46L274J878
13522g158L612L441m037k250r7n791n715j836O702P113K072L094J482J686m38
13507A880L87K84Q11J215m162k552j98K147p917q8O222K737R92l469M765J598
13491D652m623k579M70K386J295R78R53K638l696j314L167p591m185P15P741P614
13475H621j935p46j440o078k213k219j21J31P057K039k102j345L526J338j0768
13460f255o877K616N252p58o58J186j360L480M328O382J771j997k613l255n040
13445c798K096N790J654j286k701p222k792n14Q684L56L074N409j954p315m193
$$ y = [259, -1518, -1665, -411, -400, -1258, -3926, -8279, -6113, -695, 5048, 4514, 3586, -431, 107, 7172, 7410, 7055, 6586, 6573, 6680, -933, -6421, -11610, -5845, -6724, -10267, -9866, -13388, -15689, -12456, -12310, -9036, -7158, -3546, -105, -4142, -6392, -6489, -12280, -17995, -19831, -13129, -6016, -3944, -850, 632, 2318, 1880, 2267, 2551, 3362, 4577, 415, -2137, -2335, -188, -8105, -8193, -1971, 766, 1758, -1711, 3054, 4652, 29, -2550, -2080, 306, 1601, 2579, 3532, 6170, 2474, 1160, 4327, -3264, -7449, -6734, 1007, 8621, 6686, 5940, 4500, -1578, -3791, -6010, -6131, -6000, 1057, 3096, 994, -351, 3175, 4513, -6255, -13132, -10516, -5264, -6022, -6680, -5494, -6854, -3374, 954, 7336, 9107, 7110, 4497, 1242, -3798, -1702, 4088, 5742, 4456, 1755, -5467, -8259, -8773, -89, 267, 3341, 8750, 6796, -519, -4712]
13430d712K795m962M65L324J058m8l778J181R68n225r6K828O020M79q00O160m754
13413I03J040p49j683O71n961p552L723m44N685K01R43J166o33K328j103r76K731
13396B90o84l895J898J156q41n009l222N810l32o64O065M600N640L87r007l869
13380a677K21K485l99K808O07l015K96n537l098j067P09N454L534M518J576j261
13364F154K876L050m125m245q52n56m916l73j634O984K155o580n29L604n564j0360
13348a4911j365L141P027M865k854n66o839M284J833k831j0746m616J112L347
13334a9119R184J19K840l261l805K89l054K437L773J043J107L822L430j082j976
13319d253l311l855N910N802j06p515k493J0540M093p08r72O74l846L654k831
$$ y = [-4712, -1917, -6879, -6414, -3090, -2032, -2080, -5858, -4677, -3709, -8934, -9030, -6202, -182, 297, -503, 5657, 903, 1943, 1194, -489, 182, -5779, -13331, -9608, -10052, -4367, -4166, -3223, -2057, -2690, -362, -1465, -2441, 290, -394, -4289, -2391, -1235, -2076, -7085, -10307, -4497, -4829, -5493, 572, 5172, 10812, 11199, 2192, -1677, -1456, 1029, 630, 3438, 4045, 1030, 1326, -4211, -7309, -8376, -7667, -2213, 1321, 5839, 7415, 6154, 9030, 12080, 7955, 3710, 2858, 2302, -2614, -2987, -4621, 2363, 4518, -2062, -2591, 1013, -4551, -14911, -16276, -13135, -6108, -1243, -4097, -4663, -11502, -7218, -5385, -8216, -18962, -23578, -22466, -19119, -9935, -9816, -6976, -10237, -14042, -13753, -16807, -14370, -10597, -9554, -8447, -4625, -1195, -2277, -4253, -7564, -11419, -5509, 293, 187, -7328, -9821, 719, 4812, 4104, 3132, 3806, -40, 3614, 783]
13304G83Q13J000n23k743J031l977k149N121k755q834J422K317Q156L54n017L32
13288d669J428k366j930l99L871m14l193k06K779Q985R378j1125q66j533K051
13273A791P201j68n691r725m613M673l347l553J223O378j21q58O022j29Q33R458
13257I374Q743k864j3841p520j107j651K541M040L308j317n536P390O118l954
13243C724o139Q28K675k70p389l124j915O884N391M78k963n613m689K048K890
13228g184L350O860M905J841j190K106M604m118o755l901K721n448k365k995m793
13213a2362j288m564L235K527L905k221l053k923l102K178R558L231L877l369
13199d371q60m450M82O918O917j278n548M379n242m779Q49l134k586k263j65O62
$$ y = [783, 1596, 2596, 2073, -670, 361, -3616, -5765, -644, -3399, -12233, -10811, -8494, -338, 16, -5001, -4669, -3241, -5607, -7537, -7936, -4065, -4479, -7672, -7878, -5099, 3886, 13264, 2139, 1273, -260, 1791, 8992, 8824, 3133, -6592, -11205, -6532, -9879, -13432, -12209, -5831, -5952, -6810, -788, -917, -84, 9374, 18117, 15253, 1412, -6108, -7215, -8866, -6325, -2285, 1023, -294, -5830, 1560, 7678, 3724, -2415, -1587, 1088, 818, -6571, -9695, -11610, -4726, 665, 1143, -1820, -7433, -12122, -10074, -7184, -3834, 3026, 7931, 9772, 8582, 10688, 15292, 11174, 4419, 518, 3239, -2209, -4574, -7569, -12362, -13650, -18214, -14979, -12452, -8547, -10768, -13821, -16744, -19846, -17668, -8110, -4879, -1002, -4371, -5231, -9681, -9199, -2281, 4636, 3358, -2190, 2189, -3053, -7832, -6983, -10117, -12703, -14966, -15131, -14469]
13183a4469l359J657L031P320O095R88m566k995n516K293K576l17j874o451o396
13168b1983N878M259n132l97J0775R737j342l467n597L071L253K695J535N33j000
13153B818L737o701n701l772K837N742q76n485J342K222M270J807r82n157R55
13138b944L057K246N39l415M716J669p313m809k37J712k79k614Q034J226n21l283
13122b216l090n479N56J733J609l049N806Q576O26l434k994r54M451j092k933
13107a884M00k203p948m408O770M623Q437L154j359l821l37O62J148q98K574l967
13091I43k652K811M066j215k412N92N87o099q959j99M397N692L16M03j149o154
13075i032n694O279M375K110m345n495l75K041P821j462j1815M059k08M531J0436
$$ y = [-14469, -17828, -16171, -13140, -5820, 275, 1263, -3303, -6298, -11814, -9521, -6945, -7262, -9136, -15587, -21983, -16105, -11846, -16978, -17375, -6600, 3137, 1795, -1672, -7269, -4198, -945, 1750, 3285, 3818, 2818, 6555, -146, -5847, -9619, -6782, -1040, -1916, -7401, -6059, -3837, 433, 2240, 1258, -3899, -2944, 113, 2359, 2898, -517, 4199, 5868, -1445, -6254, -6491, -4779, -5058, -7672, 362, 1588, 1067, -2216, -5306, -10785, -10229, -8496, -6887, -9936, -4130, 4446, 5072, 1638, -1356, -2310, 2141, 1049, -1884, -1484, -3687, -11635, -16043, -9273, -4650, 3787, 6941, 5582, 1761, 1424, 2086, 3234, 2336, 4910, 943, -1709, 1102, 5168, 3953, 1541, 2133, 2720, -3379, -12338, -12537, -8140, -2448, -2132, -1729, -2878, -9032, -14726, -8447, -4072, -1962, -6307, -11802, -12177, -10136, -2315, -3777, -15592, -11533, -11741, -7210, 3226]
13060C226K974J66n95n489o310K190M311n21J23l12k412L662L835J499l639O638
13044I346J216k961o332n587n91K536J910l370k289n913k468K615P482M498k07
13029a15o262p049n33Q774Q20N81K83j755L08O152J283k740M176K169p576l268
13013d752M597k073q10J92l131l569J244K518K075j484j097Q012O29K147J3k141
12997B370K823M118j372j731o648K618M100Q33l073j0889j600J498J460L268j766
12982c991M14m405J713P851K127j525n224m696m107q77O673K877j47M682j210
12967A55K399J0341j302r033M39K54n340o904o196M138O062J493K701L660K77
12952C144P957K666j292q481k054L905m529n043k168l695J319l211O67J696R648
$$ y = [3226, 6200, 6366, 5771, 282, -6028, -3838, 473, -48, 75, -237, -2649, 1013, 4848, 6347, 2708, 9346, 10562, 7601, 1269, -4318, -4909, -2373, -463, -3833, -6122, -12035, -14503, -11888, -4406, 92, -115, -6377, -13426, -13959, -5185, -4365, -3784, -3501, -5256, -4948, 1204, 2487, -253, 3923, 6092, -1484, -4752, -155, -2228, -3038, -2846, -5977, -9546, -8302, -5784, -3709, -5193, -6290, 1722, 2351, 4498, 4511, 2370, 5193, 9311, 7939, 6208, -440, 2178, 6278, 7111, 4038, -6851, -8451, -6953, -5493, -2225, -3991, -3577, -7982, -6269, 1582, 3709, 2184, -3040, -7736, -11843, -12720, -6047, -3170, -3317, 1365, 155, 2554, 12895, 11593, 2560, 2999, 3253, -2087, -8991, -15187, -11049, -4987, -3494, -793, 2867, 3144, 11101, 13767, 12475, 3994, 1940, 5845, 1316, -3727, -5895, -9590, -8271, -11482, -10815, -9119, 529]
12937E29J001k953k075j134M396M105J797L156o348j2349k091J509N040O60l296
12922h053n636k905J267J577R070K9k398j144N197Q575J278p210j216P518M610
12907A0559L752j477j0097j759O99l310K716m22k034M539L385n15l974n078j635
12892d651j390j746K255N86Q36J838J555J795K811J278k432K755K451q11m228
12877B902O342k546n064n737o87j683O189L955k65m336K157P511Q47L826j2483
12862I28n638L588J754J005L621q857n384N039M02m98J859N748L352n466L066
12847D519K156M751m025j3065N4O108J395J975l515m726l599n10L544P37k862
12832g063K783O511K020m172j0968L34N590L477k826K049m251n190P632M274J628
$$ y = [529, 1530, -1423, -3498, -4632, -236, 3869, 5666, 8822, 2474, -9875, -11966, -10457, -5417, -4757, -8053, -13689, -16594, -15327, -13750, -4680, -4651, -7049, -8193, -2996, 5579, 6857, -353, -1569, 5949, 10559, 14311, 12834, 2737, 978, 1677, -1633, 1083, 661, -1373, 3166, 6551, 6036, 2062, -3016, -4651, -6041, -7787, -5532, -4946, -4110, -2272, -717, 1078, 3889, 5167, 2735, 5490, 7941, 7130, 2902, 9244, 6698, 1634, -4103, -4790, -6473, -284, 3671, 3406, -930, 1227, 8738, 9585, 13411, 928, -4710, -1122, 632, 1637, 5258, -3599, -8983, -3944, -3542, -4040, -2181, 3567, 6919, 1453, 4519, 6675, 11426, 7401, -5664, -5610, 498, 1893, 3868, 353, -4373, -7972, -8482, -4938, -4201, -7063, -4280, 2231, 4251, 79, -10889, -10555, -4965, -1488, -4314, -2265, -6516, -11706, -4074, 200, 1828]
12817A828k651k384n895j829L969q6O390K637K101N50j542l428o496o73K074Q994
12801C559j719j589K494p47j1048o744K005M976p19n233P229R820j4j589K333
12786C014k373q30m319p903J419K105O64L813L823l355n113q85L602N446M377
12771C485Q87J288k016p126m525l166P85k972k563N018O895l848q942N277L168
12756h355l484K008O165J540M815N45k195L713k825m399p057M377n336o033P342
12741i179Q138J717M224l340j694K883l008p574j132q63N835j546k227K384P579
12726B197Q034k378m780J227j030M82k370j614l996q463n057k681O964L631J822
12711h012L732p41o684j669m59M074L521R316O070k858n821o123L304l613j1157
$$ y = [1828, -823, -3207, -9102, -10931, -6962, -7048, -658, 1979, 4080, 4630, 3088, -340, -6836, -7509, -5435, 3559, 1840, 251, 2745, 1998, -9050, -15794, -13789, -8813, -9532, -14765, -7536, 2284, 2270, 681, 3014, 641, -189, -4508, -12411, -10992, -8887, -8223, -4410, -587, -3942, -9055, -9940, -6338, -892, 3485, 4372, 5660, 3644, -3482, -8007, -11173, -10388, -13360, -15923, -10905, -4010, -7858, -16800, -11523, -8355, -11839, -9831, -3666, -2126, 2689, 3234, 1039, 4752, 1927, -2472, -9529, -5152, -10488, -16521, -9179, -1041, 676, 4900, 1560, -134, 2749, -259, -7833, -8965, -9828, -3993, -5539, -7766, -5382, 2197, 10231, 7853, 3073, 4300, 3270, 3752, 1382, -232, -4228, -12691, -17748, -20429, -13465, -9834, -8012, -4280, -5021, -11705, -13374, -13833, -9759, -6238, 3078, 9148, 6290, 469, -5654, -2350, -5963, -17120]
12696a7120j406M095Q50N674N226K926l165Q71J479K926l605m187j651k461M520
12681e028J161K204L414j709k004l594M432M622L66q855J139l564O99M153O348
12666C784j102o492N568k132m326J696q146K301J0721N86q987k772L131M612n211
12651f769M369J699k247o599o767Q302M017L411m616l188j02N386l638J189j628
12636g181k613P305M772J882q101J106J085l656K924j70K615K803p17K402k157
12621B299j216K108m8l7o18K436O634K023n822n957p845q30M359j664J0574O424
12605A2820N95l778n677j957k996P01J216L34L434M812M86k939Q83k222j681k070
12589A961M379N269l447J578n595r14n170q095M906k541m600K950O768O265P159
$$ y = [-17120, -18526, -14431, -13581, -7907, -2681, 245, -2920, -2049, -570, 2356, -1249, -5436, -7087, -9548, -5028, -3867, -1663, 1751, 42, -1962, -5556, -1124, 3498, 3864, -4991, -3852, -7416, -6717, -2564, 3784, 2682, -3810, 1758, -374, -4700, -3004, -11150, -8849, 1872, 2458, -6529, -9301, -6170, -1558, -6769, -2400, -701, -2948, -9547, -16314, -8012, -3995, -584, -5200, -8388, -8490, -3104, -6742, -5553, -7181, -9794, -2489, 2283, 4165, -3936, -2830, -1745, -5401, -2477, -2647, -32, 2771, 2054, 4456, 2299, 1083, 3191, 3143, 3106, 2488, 4924, 11558, 13581, 7759, 1802, -6043, -6873, -2514, -4178, 6396, 12820, 13415, 9637, 3960, 2003, -993, -292, 924, 1258, 4692, 9504, 9990, 7051, 7934, 5712, 4031, 1961, 6340, 11609, 8162, 9740, 4145, 3231, -1939, -10034, -5128, -7669, -12269, -9319, -2551, 3714, 10873]
12574A0873m539q319n293l515M527J681k309l580l318J317N561M317J812K32j151
12559a704n94K227j143r12J688j591Q371L576L336r719r199j870N593J1832j205
12544H686K60J331m358o850q28k965R835o86l78l485k348r41o010K12L359J987
12528c179L050m784o849p74O17L915O54K643M987N874L862K393P20q426j102J84
12512C785K799K322n969p627k052L17J428J001J344R933L616l483o234o111M51
12497d480J106k565k432O127M45n122p685k359L685O862J565j936j477m48J495
12482g219j013k590M162N736M053l564O383J40M85n169k118n066J690m128l060
12467a1278o67P862J779p47K728Q16q35k647L733M490m757o437K753P121r69L925
$$ y = [10873, 6334, -1985, -7278, -10793, -6266, -4585, -6894, -10474, -13792, -12475, -6914, -2597, -785, -553, -1704, -2298, -71, -1214, -2126, -438, -2029, 6342, 9918, 13254, 3535, -5664, -7534, -1941, 9891, 8686, 8946, 10277, 5919, -931, -1759, -4724, 5111, 4425, 4047, 562, -1786, -2727, -8737, -8525, -5166, -3179, -129, -4913, -11762, -12536, -11919, -8004, -7350, -4707, 280, 6154, 10016, 12409, 13129, 4703, 3601, 3785, 6584, 8906, 2937, -4690, -6742, -6425, -4997, -3996, -2652, 7281, 10897, 7414, 1180, -4931, -4480, -3374, -5939, -8371, -2244, -1799, -6921, -14606, -16965, -13280, -6418, -4853, -6789, -8266, -8714, -7219, -8232, -10822, -6660, -924, 3129, -435, 5948, 6088, 6573, 1404, -714, -5780, -4090, -8218, -11278, -11945, -4083, -2304, -3051, -323, 493, -342, -2989, 744, 5234, 477, -5960, -3207, 3914, 2945, 6870]
12451F870p837j840R30L140M866J1n399l838L414J043J68L166O317r837j0174
12436i000l275L367K877k422N954N812M11l977p953N9O21L694L439O28n610l179
12420h554J70J330M414N79o894K312L478K310k726N749R6M18p080j078M092L206
12404A822p75o725r111m53L991M899R688Q04P40j049o094p027k546N145K474o20
12388d837Q6L500K345k977J920n82m818o9J830J2J25p19m570m80J572k257lN367
12370d555p91k510N07M031n2l822n401q476M127Q244J1149K281Q07J668m135l495
12354d23p92N959k486k223j317j031l256N664K365M943j299J700K165n211k702
12339B056p898o15L3O86L105k530j069n111q61J1759P423m319m394L054J341L839
$$ y = [6870, -967, -2807, -1877, 1263, 6129, 6140, 741, -3097, 317, 1360, 1528, 4694, 11011, 1174, -9000, -12275, -8908, -6031, -8453, -2499, 3313, 3724, -253, -8206, -8147, -7526, -3832, -393, 235, -5375, -8554, -8384, -7054, -2640, -2061, -8955, -6643, -3165, -855, -3581, 2168, 2264, 2682, -4398, -5476, -1384, 1822, 1047, -5678, -14789, -15242, -11251, -6352, 3336, 4140, 4880, 3831, -2263, -9290, -11836, -6691, -4217, -4837, -4751, -1251, 1094, -1883, 37, -545, -5363, -5432, -3602, -3590, -3465, -4184, -8754, -9234, -7662, -9919, -9922, -4555, -5346, -7856, -7349, -3318, -3370, -7192, -12593, -21069, -16942, -8698, 2451, 4732, 5539, 7207, 3072, -423, -1215, 4744, 2258, 35, -1282, -2313, -5569, 95, 2460, 7403, 6104, 7804, 9969, 4758, 2056, -5842, -6457, -6424, -5738, -2633, -5163, -6232, -11343, -12204, -445, 6978, 2659, -1735, 1319, 2660, 6499]
12323F499J24p649n364m257j774Q2Q777M942o561N996L122M604m80q556m07k964
12307c866m172k497K328N527J327m533n639j900K290O961L491m88l05L015L156
12292D695k057k042q65q73o358J998L470k799j2176K92R651N657N49J323O45p15
12276C95J993L607l908l746m467l167J240k339q77J828J269N852Q146N474l777
12261G523m440l978L448N76k151N852O031n313k667M557L310m656n942j599l134
12246b583j785O59K153j753J486J266m133j621L126O986L283L632m991o634l738
12231d647N514j3M39k008J318j428j68m328j096J439J040k779l519L689M739K602
12215G94m416m036O632M738K331N781n134l509r535p26R23m394l412J121O780
$$ y = [6499, 6623, -1026, -6390, -10647, -12421, -12339, -3562, 1380, -5181, 815, 3937, 8541, 8061, -495, -902, -3866, -8038, -10535, -8207, -2680, -1353, -5886, -11525, -13425, -11135, -4174, -683, -1171, -1476, 1539, 4695, 2638, 596, -269, -1142, -7500, -5502, -2032, -4831, -17007, -16715, -7064, -1407, -858, 465, 1110, 395, 2388, 5995, 2087, -1659, -6126, -9293, -8053, -10392, -11269, -9441, -8172, -2320, 5826, 11300, 7523, 3083, -895, 2553, 3129, 978, 6830, 12861, 7548, 4881, 9438, 12748, 8092, 2150, 551, -2583, -4368, -3709, -1556, -3309, -1823, -557, -4690, -6311, -3185, 3801, 7084, 10716, 5725, -909, -4647, 867, 854, 1293, -715, 603, -825, -993, -5321, -6417, -4978, -3938, -6717, -10236, -6547, -1808, 794, -3622, -7658, -1026, 3712, 6043, 11824, 6690, 3181, -6354, -7080, -6157, -10551, -13963, -12842, -6062]
12200f062M001Q836L574L164j985m959l766r21O926L375j933k076k498l711j0436
12185h471K661P836l749j470O179l85L058m691m692n758j243P91J498L256k037
12170g217P30L842m483l337j412L602J125L669L793n007j269L440J81P371o751
12155a723J729k233M5k646k54L686j309N58L82J242J232o51k82N288j558o737
12139c231K00j675l344n281k222M146Q515J0446l093m719J452L860o525l651j549
12124f671K991K630l466o42L065j203N711l986n972l735J687N749N492M476L780
12109I906K491P36j2407l355m229k528l326N866P907P429l599o116L91j390J514
12094g10q26j704k920J242J40J411n213q62k040P354J1842j676l731n82N976o737
$$ y = [-6062, -2061, 6775, 10349, 13513, 11528, 6569, 2803, 1882, 8808, 12183, 10250, 8174, 5676, 1965, -8471, -5810, 2026, -1723, -3193, 2986, 2601, 5659, 968, -3724, -9482, -10725, -9934, -8436, -5180, -7217, -6487, -2645, -7128, -10465, -11877, -8275, -7150, -3481, 312, -4695, -5964, -2524, -2343, 5028, -1723, 6, -2227, -2182, -4828, -5082, -1396, -2705, -2147, -1765, -523, 709, 58, -224, 5064, 3506, -3231, -3031, -4706, -8050, -13331, -15553, -11407, -2892, 7554, 4461, -258, 1194, 5054, -1471, -5122, -6671, -3680, -1050, -4516, -5158, -2093, -3296, 2415, -1571, -7543, -11278, -9591, -3842, 1650, 6126, 9906, 12397, 13133, 726, -2629, -6858, -9386, -12712, -6846, 1061, 8490, 4891, -1225, -834, -2224, -710, -1536, -3240, -6160, -4918, -4778, -3367, -8580, -9442, -11482, -4128, 7714, 6038, 2307, 1725, 7701, 964]
12078I64o315M861L285j737l904M091N979m076n502K40k661L093o06j650k112
12063f050J704K553Q792l14m041k870K014J568k381J506k084m30J315N549k031
12048D800P43l297l98R97J600l226j0911m092L464M556k80K899p94m39J964R23
12032a491o262j781p85N978J655p236K195l477k532O834L402k272J319M788j75
12017A60k967q312k722L14K594J267M68j037l77M791O256M23M957M915j1320j1283
12001a1873K702R360K912l583q177k549P38M579j688O260J183q625n261J88K92
11986a3542L937P560N117j95j14K614q544q275l77J63M897J009K215J0260L203
11971I928p923o501k521N753O480M658j1104n258K913K908k473K647p48k345K247
$$ y = [964, -5351, -490, 2795, 1058, -2846, 1245, 7224, 3148, -2354, -2114, -4775, -1682, -2288, -3938, -6050, -4346, -1793, 6999, 6685, 2644, -226, 1788, 3356, 975, 2481, 397, -33, 1282, 6831, 4800, 5543, 2246, 1848, 2845, 4445, 1219, -9692, -13784, -10320, -5764, -6044, -3145, -3939, -4378, -2414, -1491, -7753, -9534, -10319, -4341, -2686, -9922, -7727, -11204, -13736, -6902, -3500, -5772, -4453, 335, 160, -2807, -11119, -13841, -13527, -10933, -9666, -9198, -10235, -10612, -5821, 435, 858, 5815, 10730, -590, -11873, -9171, 189, 3101, -482, -8659, -11208, -10470, -5891, -7579, -1319, -136, -8761, -14022, -13834, -13542, -9605, -2045, 3072, 2877, 2763, 5377, -3167, -11442, -11819, -11656, -6759, -5750, -3535, 6725, 9928, 2005, -4496, -7017, -1264, 5216, 9874, -1230, -6488, -3575, -667, -3140, -493, -1241, -3586, -1339]
11956a339O836l177k580N760R88M80L337L096J579m535m24M710J931k491l977
11941A0194j1276j617k07N21j846p652j628N352J459O18n665M036R481M880m062
11926B588m633q170K238M943K752N227k845k342N500k69j869Q85M575J893j292
11911I181Q15j0374n416k657K797m99K943r64L158k467K638J57j691N308N123
11896H052j155r610r495L808K962M840j442r43o094l598P082O447L974k107Q631
11881A1352J874j217m333j461p52L632j012p152R00m870M500M324J609L78j454
11866F318l543J515k872l983j207K624J878j406j986k581O59L648L926k535l812
11851c357N44k285L212N228k202o449J158L120K12J181q22J645m69K738J615n653
$$ y = [-1339, 5497, 2320, -260, 5500, 6488, 6968, 10305, 13401, 14980, 10445, 10021, 14731, 16662, 14171, 10194, -1082, -2699, -2906, -2385, -4231, -11883, -13511, -8159, -6700, -6082, -11747, -7711, 1770, 6650, 2588, -2045, -10215, -7977, -3034, -282, 4945, 2100, -242, 5258, 4989, 3120, 4005, 8580, 10473, 9181, 9996, -378, -5794, -8451, -5654, -6153, -3210, -4174, -1016, -3483, -845, -688, -2379, 2929, 8052, 6897, -2713, -12208, -8400, -5438, -598, -2040, -2983, -9077, -12675, -5593, 854, 4828, 2721, 11352, 13226, 12009, 7676, 6215, 5463, 9095, 8083, 931, 1831, -3039, 1461, 5785, 7394, 7772, 6318, 2775, 4290, 1418, -2565, -3772, -1148, 730, -676, -2662, -5243, -4584, -936, 2990, 455, -3357, -2813, -5098, -1886, 3342, 1140, -5309, -4151, -1031, -819, 362, -460, 1185, 716, 3454, 5069, -584]
11835e84m608k496l516J330P737J615n436n923k155m194N291L672P74l131P146
11820d478L052j574M560j868p560J49l4L548Q65m320k619j17P652n6j14K578m551
11803d887O06Q20k855r85m033k55L302K600L686M57l679l075L21K616J624J465
11787b272J999j848J482M212J007k248m195J944N295M066k436n489n87J967m006
11772a109m468J067P718K406k701l133M398o1k373L30J726O308K037l287l613
11757E245r239j275N189J173J044j283m684j335k007Q23M879L49r509l823M311
11742a0142K279M120K959P792L384QL976n706k095l228r77j635l394O952m349
11727e6jJ258j01J132J282k671K98N654K518m261n637j392p55L591K79j042O04
$$ y = [-584, -5192, -7688, -11204, -9874, -2137, -522, -5958, -11881, -14036, -18230, -12939, -9267, -8493, -11624, -4478, -1426, -3000, 1560, -308, -7868, -7719, -7753, -4205, -3340, -7660, -10279, -10396, -2744, -2800, -2914, -336, -4887, -4281, -3461, -6316, -7301, -11334, -11589, -8287, -5687, -2001, -1544, -5223, -8298, -7977, -5361, -3737, -2272, -273, -2121, -639, 3573, 4580, 2332, -1863, 81, 5376, 9442, 7006, 1517, 930, 2897, -1109, -5577, -4510, 3208, 5614, 2913, -220, 4178, 4117, 1744, 2074, 3800, 10108, 12145, 8858, 5245, -3994, -5269, -80, 1093, 2137, 854, -3830, -5165, -7172, -6349, -1470, -1121, -10630, -14453, -10142, -7863, -3743, -784, 7008, 10392, 10400, 14376, 8670, 6575, 3347, 2370, 735, -2659, 4293, -56, -57, 1201, 1100, 2232, 3514, 843, 1141, 6795, 9313, 5052, -585, -1977, -2732, 859, 1138, 96, 700]
11710G00K819J621k900K685k722r656l17j715N283O056K597J852L77J96n778j618
11694e20L036J836l576k864N64n698K71K101K693K329k995P526l890l823l030
11679f040j886Q105R194j894n246M596n66n47Q679P89m458k320o72Q88q91l421
11663D310K20l832M346o111K588O580K077K200k428J297L789l086p839n442O27
11648g04M517k424l325L658k951Q85L345M525m493m594J642J321l193J781r72
11633i82L583J622r26n500n138O69M454m829R15l64k165L289O918R006j276n196
11617D080l240p743k868M586l756j985j815Q32M075L252Q664K653n579O159J099
11602H414l783j812n227o380k483j632k25K656P612k023R476O865o20l399j738
$$ y = [700, 3519, 5140, 2240, 4925, 2203, -7453, -7770, -9485, -4202, 1854, 4451, 6303, 6680, 6876, 1098, -520, 2516, 4352, 776, -2088, -1524, -7222, -6951, -4850, -2157, 172, -2823, 4703, 813, -3010, -6040, -7926, 179, 9373, 7479, 2233, 6829, 6263, 5716, 14395, 15184, 10726, 8406, 7734, 8622, 7731, 4310, 4530, 698, 5044, -1067, 1521, 8101, 10178, 12378, 9950, 11247, 15036, 11950, 4111, -1331, -704, 3813, 1389, -1936, 1722, -1229, -344, 3001, 7526, 3033, -1561, 81, 1402, -1791, -10, -982, 2601, 4223, 3297, -2203, -7341, -6672, -2218, -7047, -6132, -6496, -8661, -5372, 1546, 10552, 9276, 4080, 840, -6903, -9771, -5185, -8941, -10926, -12741, -11909, -7834, -4582, 4082, 6735, 1156, 7315, 8414, 4631, 2819, -2408, -8788, -11271, -12903, -13128, -10472, -2860, -4883, 4593, 11458, 10838, 7439, 5701]
11587E701J361j248n8L151j862l847j548J643N950o75o297r46k638o832L916L804
11571d25K276k432J0912L211j932m143L304j408K830l185o465J226L211n94k293
11556D093k371m487N348L400j6389p928O592Q439J308R9N99k418K49N059J821
11541C414M751j387n110m616O88P57n612O330K28l654J231K683K621N141o63M153
11525A0955m121j692J386K801q359j727J375L659l184n816L308M946L916Q39l476
11510D810K645J32n332n96j408L060N699L050p779k980o93l901K946J0112R73
11495A0738l344k203j929l424N33Q22m487o344J496Q222L118j58J023p656m083
11480g676L011q23k224o230P99J057N334P210N636L860k977k319k16l226K979
$$ y = [5701, 7062, 5814, 5756, 8907, 7045, 3198, 1650, 3293, 9243, 8568, 2271, 1325, -1313, -8145, -4229, -425, 1851, -581, 10331, 13542, 11610, 7467, 10771, 9363, 12193, 9008, 2543, 3769, 6980, 6386, 4093, 1722, -2765, 2583, 5983, -10406, -18334, -11742, -3303, -1995, -1896, -1297, -3715, -3466, 1593, 3414, 8165, 6778, 1668, -2948, -2260, -1503, -7115, -785, -557, -4211, -2980, -297, 2324, 7465, 6802, 10955, 6834, 5142, 6528, 9329, 970, -757, 618, 4277, 1093, -4723, -1415, 3531, 7447, 8286, 4810, 7455, 7587, 2255, 1659, 251, 3311, 9010, 12060, 4281, 1301, 608, -3293, -347, 9765, 10738, 7394, 5191, 3262, -162, 371, 1193, -3294, -9638, -8142, 80, 3198, 3040, 4063, -3593, -7676, -4665, -5488, -7712, -13942, -13143, -12086, -6752, 458, 6094, 9954, 6977, 4658, 4442, 1216, 4195]
11465D195J466Q94k063o511k514P111L827j733J350k749k267R26o94J716l362
11450d08m908K609o23l452M814K304k380L116o374n700O827j859k795Q338N933
11435E442m006j436M047K600K809m662J183Q449l995o852p26L968J156l316k969
11420A692K372J167k133Q434j061J126K649N214K643l130o773n076J222l933r59
11405C454l576K61M93p68L014n658m505N451J497K603n32R541j506m605K689K310
11389A0163N083P271l612r397r668M339Q327j589j1262l109j198L095M323j076
11375A690k499J322J270K018L409p30j475o373m58J627q8K930N83n991k848j575
11359g188P157L47K42o070M393N262L452k328m859l370L706L305L741p35K874
$$ y = [4195, 5661, 6555, 4492, -2019, -4533, 2578, 6405, 4672, 6022, 3273, 1006, 1932, 1238, 2954, -408, -5316, -2707, -3330, -6782, -1968, 336, -2044, 1072, -5302, -11002, -4175, -6034, -8829, -491, 5442, 1436, 0, 4047, 6647, 9456, 4794, 5977, 14426, 10431, 3579, 2853, 6821, 7977, 4661, 1692, 4064, 5231, 3098, 11532, 10471, 11597, 14246, 19460, 22103, 18973, 12200, 7124, 8346, 4413, 3454, -122, 139, 632, -136, 2878, -2780, -7285, -1834, -337, 2266, 1734, 11275, 9769, 5164, 7853, 10163, 15246, 22517, 18905, 9508, -160, 4179, 12506, 10917, -345, -3454, -4652, -1557, 2766, 1690, -809, 513, 1783, 3801, 7210, 6480, 5005, -1368, -1826, -199, -287, 2643, 3226, -2765, -5613, -7188, -31, 316, 558, -5512, -1119, 4143, 7595, 5267, 408, -2962, 744, 4049, 7790, 7055, 9929]
11344I929k419r318N591N071K92L602R57l186o69L415l175j2307K722N322r306
11329c479K231Q234M18Q54N31J903J001L44j634m028m97j81p918K406P561J260
11313I006k843j624M704m818j082j71j968l354J446l733j908P500L045j911R63
11298C252k255K536j2j136k184K557Q975M252j27M50J834n406K678k269l177L39
11282A0307k012L575M887p891k259L020j531p661k285l269K955M264J335k740
11268F95l869m28m3j229J428J069O91L729J219L491j623k634k131M00l311k990
11252e536P617j272j445L113L017m89n687O003j166j442J681m750R97O464j534
11237E571n097k668L677k507l053J35O919R008M293m626k717k40L945k254K051
$$ y = [9929, 7510, -1808, 3783, 8854, 9146, 12748, 13705, 10519, 9850, 13265, 10090, -2217, 505, 5827, -3479, -1248, 6986, 7404, 8258, 8789, 10692, 11693, 12037, 10403, 6375, 5878, 5697, -2221, 185, 7746, 9006, 6163, 4539, 9243, 4425, 3343, 3172, 1204, -2150, -704, -4437, -6345, 1155, 4200, 2289, 3252, 997, 3533, 3521, 2385, 201, 2758, 11733, 15985, 15858, 16308, 18142, 12736, 15414, 13145, 9968, 10307, 8295, 11870, 16757, 8866, 6607, 9627, 8096, 435, -1850, -5119, -2164, 2100, 3435, 695, -3174, -3602, -3645, -4874, -3446, -2377, -1686, 2043, 3262, 6753, 5130, 2496, 365, 765, -2546, -5536, 2081, 809, -636, 2477, 5494, 5005, -682, 5321, 4155, 2713, 4394, -356, 641, 7105, 5571, 474, -2194, 1483, -1024, -4077, -3942, 2977, 11985, 16278, 11652, 8935, 8695, 12640, 10386, 12437]
11222A2437M035l041m388m065m793J573P197L384K675o88L19m850k575P777K37
11207A5234p927j911n23L600R176N515n610n457n941l630K966j756o124l580j763
11192g731O98M162L303L708n470O076J162K397m23l067o071m09p23R38M293M347
11176G190m719J589k189q14n501L344N91L866K623N33j281J576J68K427J711K147
11160A3261P45n180r041M29j760k732j712L638K951L087j094J596K225k68j36
11145F009j650P27n3j085k233n573J702N325k828l067M271J815L770J959n417
11130C672k163M835L061j81k839M223J55P332k086m048j757k239k406l951j844
11115b36L79P865J0343q904p566K175Q304J447r761m499j836L513M468j36K500
$$ y = [12437, 16472, 13431, 9043, 4978, 185, 1758, 8955, 12339, 15014, 14326, 14645, 9795, 7220, 14997, 15234, 7307, 5396, 4873, 8473, 17649, 23164, 17554, 12097, 6156, 2526, 5492, 3736, -2388, -5968, -7731, -7033, -2871, 432, 4140, -1330, 4746, 5908, 8305, 7882, 4815, -1256, -1665, -2388, -1450, 2843, 7190, 2471, 4060, 1871, 1057, -4444, -1100, -509, 3357, 5980, 6513, 5232, 6808, 6976, 9403, 11114, 13261, 14006, 8826, -215, 214, -1546, -4278, -5990, -2352, 599, 3686, 2592, 4188, 6413, 6145, 6009, 4359, 5086, 5033, 3948, 1715, -3858, -2156, 3169, 341, -2726, 1545, 3360, 7130, 9089, 3672, 1509, 6344, 9405, 9224, 6385, 10608, 10763, 18095, 16009, 11961, 10204, 7965, 5559, 1608, -236, 143, 8008, 18351, 9447, 1881, 4056, 12360, 13807, 4046, -453, -2289, 1224, 5692, 5556, 8056]
11100H056j129l761k15K918J400J410K751L023n692j304M386K547l867r055K90
11085A758J882nJ629Q984Q518l711l915j836o213j372P539l215l753N85R692L957
11069B0524k166L04j108o807n618K240k418J260K683L944K334j724N2j480j215
11054A0805K580K178l801o492L390m26k389j971l79Q15J933k290J907K370O385
11039A4615O860K199p134o055M823K876n833m089l257K965K536o087l019O402
11025G802M007k776m470M108k146k265J343j932M33l654j004m82O67p93k39N830
11009D429Q83j630J923M50l30M899O610l945m486q93m959o124K969J2321O783
10994A8900K912K900J62l292o871l009n68K510j433k914K554q438n362Q07J1380
$$ y = [8056, 6927, 3166, 2951, 5869, 7269, 8679, 11430, 14453, 8761, 7457, 11843, 14390, 10523, 1468, 1758, 3640, 3635, 5264, 14248, 22766, 19055, 15140, 13304, 7091, 5719, 13258, 10043, 6290, 6875, 16567, 20524, 18358, 18662, 17554, 10747, 5129, 7369, 4951, 6211, 8894, 12838, 15172, 13448, 13500, 12020, 10805, 13385, 15563, 11762, 5270, 8660, 8234, 5845, 3874, 3495, 4310, 6243, 3953, 5860, 8230, 14615, 21475, 23674, 16540, 10485, 15308, 18184, 12351, 8262, 5005, 7970, 10506, 4419, 1400, 7802, 11809, 9033, 4563, 8671, 6525, 4260, 5603, 3671, 4104, 450, -554, -1036, -369, -1162, -1401, 4429, 5312, 3682, 5605, 6055, 5725, 10624, 17234, 13289, 8803, 7910, 2951, -3173, -204, 12117, 18900, 21812, 24712, 24874, 21582, 14711, 11702, 11134, 13644, 12211, 9297, 11851, 3413, -1949, -1142, 10238]
10979A0238P907M256l72j320R68j30O010k906n927l781j135O388M44q468m336
10964G836M823q45n551P59L676L977Q529p72L56n296l470o482J298J146n60k243
10948G181j373J266J692k620k42L15m531J039J011k750j030P073L688N884M83
10933A7086j928J111m141n054K603k195K891N260K496K066l991o184n611j457
10919B952j86M61R771J160o286M825P283j753L419J462m716m695l789K090L083
10904A5081n454m087K365j455m915M183M817P571P560j255l4k743r86L314p264
10889A6698n499J873L82j279p853J249P440Q95K481O165K813O0l898j2893o787
10874A847O227J3536k290p17m182m007J026j179k573O626J397N166n15l417n06
$$ y = [10238, 18145, 22401, 22029, 20709, 21677, 21547, 27557, 24651, 18724, 14943, 13808, 20196, 20640, 12172, 7836, 12659, 11814, 6263, 7022, 10698, 14675, 23204, 22432, 22788, 17492, 14022, 7540, 8838, 9984, 9424, 7181, 5808, 7074, 8766, 6146, 5904, 6219, 1688, 2727, 3738, 988, -42, 7031, 10719, 16603, 17086, 15158, 16269, 12128, 7074, 9677, 7482, 10373, 15633, 18129, 20195, 16204, 10020, 4409, 2952, 2766, 3227, 12998, 14158, 7872, 12697, 19980, 18227, 21646, 23108, 18392, 13697, 9908, 11998, 15081, 9627, 5540, 7905, 6450, 1535, 5718, 10535, 18106, 25666, 24411, 24377, 21634, 20648, 23962, 16698, 11199, 13072, 13454, 12175, 4322, 5571, 13011, 13906, 16387, 22552, 25365, 25425, 21527, 8634, 1847, 8074, 21610, 19320, 18603, 14421, 10414, 11440, 10261, 7688, 14314, 15711, 20877, 20362, 16945, 16439]
10859A6439M185j432k919k46K557M690Q45J093p079q096m098J461K404M192N228
10844A9224R924K262J126n900q022J927L996n45K0K04N32L646M24n35J053J518
10828C0854k485n568j1784j086N10N098L425L568O69j208N09P12P03l547K249
10813B2619M689k56l777k460n756N799k479Q02O002K852j683k762j08M467Q209
10798C6158P70m861r445n300N300M932M518o442j1414m22N969J462l915p817j345
10783H148R585R08o132n639O44K495Q341Q505J813q477p277J876M189J991P96
10768B1766o63M679J212M02K070j505k998J539O50o718K845L957K983J559N73
10753C2351j878k010o637O867R065J845k06j634l291J149K179j141k554L063j889
$$ y = [16439, 20624, 19192, 16273, 16027, 18584, 23274, 24119, 25212, 18133, 10037, 5939, 7400, 9804, 13996, 19224, 29148, 31410, 32536, 26636, 18614, 20541, 24537, 23992, 24012, 24216, 24748, 28394, 28818, 28283, 29336, 30854, 28369, 22801, 11017, 9931, 10441, 15539, 18964, 22532, 23201, 21993, 22502, 23214, 23917, 20370, 22619, 27308, 27052, 23275, 20815, 15059, 20858, 18379, 19181, 25183, 28035, 26352, 23590, 23482, 27949, 36158, 36928, 32067, 22622, 17322, 22622, 27554, 32072, 25630, 14216, 13794, 19763, 21225, 17310, 9493, 8148, 17733, 18641, 12509, 6870, 7514, 10009, 18350, 26855, 28668, 20191, 12914, 14790, 18979, 20970, 21766, 21103, 25782, 26994, 27396, 29466, 27961, 24963, 26502, 27152, 20434, 23279, 27236, 30219, 31778, 32351, 30473, 28463, 21826, 28693, 37758, 39603, 39397, 37763, 34472, 35621, 37800, 36659, 34105, 37168, 35279]
10738C5279n736j500q93j792L86J534J895N536n504q220J859N971j411j647j15
10723B5642q79j468k364k661M196J436j008J775J0708K435l90P42m632k084J076
10708C2524m391l051o39O128O505k096p939Q075N492M989k519J94O175j827m129
10693D3491q770J298k079J307n58N481Q3j2707K330N536O065J438L42j1109J151
10678C3299Q540j114l16q554j131N538L441m749L712O68N393Q35J759k227J051
10663D6145j849P190R706R239M512L703j850p83N48K383J879O301J1313K1220
10649A19657J7934J6210K3711K8167L8099O1510Q6300J23247J65589J68958J35292
10638I84674P1864J5725J4929K9778o913q0260j33711j30595p2294j478P7030
$$ y = [35279, 29543, 28043, 27150, 25358, 25744, 27278, 29173, 34709, 29205, 20985, 22844, 28815, 27404, 25757, 25642, 24763, 23295, 20931, 18270, 22466, 23902, 22894, 24669, 35377, 37812, 37422, 38164, 33532, 31448, 32524, 28133, 25082, 24443, 30571, 37076, 34980, 27041, 35116, 40608, 45597, 43078, 43272, 49447, 47620, 43491, 34721, 36019, 33940, 35247, 34689, 40170, 40253, 27546, 29876, 35412, 41477, 42915, 43257, 32148, 33299, 41839, 40725, 40409, 31855, 30724, 36262, 39703, 34954, 38666, 39334, 44727, 45562, 47321, 45094, 46145, 44296, 51486, 61192, 70431, 74943, 78646, 76796, 76013, 76561, 78944, 80823, 87124, 98437, 119657, 137591, 153801, 177512, 205679, 243778, 305288, 391588, 514835, 680424, 849382, 984674, 1056538, 1072263, 1087192, 1116970, 1110057, 1029797, 896086, 765491, 693197, 691719, 768749]
10627G68749J59940J99331J59464Q2792j2587j20975j99582k23254k01656j61441
10617D50781j10838o9745m3679l0432j8449j3120j6296k0648j4801o454j2074
10606I4245j2482p825q20N630nj2008o322O75QJ855N613N875M043j08l474q225
10590F6675l959k384k805jN026j251m615J887O707O511L345J388r79m293L21m722
10574F6851l304p69o290M186o257l688j175j472O49k708K012Q570O407O366j946
10559F7432m267r073j609K379L083J943m338k629O891O30J350k599n568n558K49
10544D8316N151P819j834K502M14N20R088r54n075r193l702J966J285K230j572
10529E6961l747l941n532m947N312O984p65j499j81J855N428K211P79J027j267
$$ y = [768749, 928689, 1128020, 1287484, 1370276, 1357689, 1236714, 1037132, 813878, 612222, 450781, 339943, 270198, 226519, 196087, 177638, 164518, 148222, 127574, 112773, 106319, 94245, 81763, 73938, 73118, 78748, 78743, 66735, 60413, 61088, 61096, 62951, 68564, 74439, 78482, 78374, 74900, 66675, 62716, 60332, 57527, 57526, 62552, 61301, 56686, 58573, 65280, 71791, 75136, 76524, 75545, 71252, 71573, 66851, 63547, 62778, 56488, 60674, 54417, 50729, 49554, 48082, 48731, 46023, 48035, 56605, 63012, 69378, 67432, 63165, 54092, 52483, 54862, 57945, 59888, 55550, 52921, 59812, 60442, 61792, 59193, 53625, 48067, 48316, 53467, 61286, 59452, 61954, 62368, 62888, 71976, 71022, 65947, 56754, 53052, 55018, 56303, 58533, 56961, 53214, 49273, 43741, 38794, 44106, 51090, 50325, 48826, 48645, 50500, 55928, 58139, 58918, 59945, 58678]
10514E8678p99L184M831J968k832L33M028r05m002m189j210j58J3119M28k806
10499F9668L372J907N185K810k62k77J2636J5439J3346K2949K2484K4252J8638
10486B12147N995Q184J6765K0462J3313P910J1202J2457J925l809q470k3608l6000
10473B38473m1278l2246j4790q879j4162j0636j1029q358R77Q575k707n816l363
10460I4761M859N635k314m842o873J454K19j087K259l43n464p321k256N019L840
10445H7546P750Q522O687O876J4238J0502J1639J6390J0646J0278Q775M93n07
10432A99835K041r640o673j123o895j6381o813n217l828O665O233P007M981K309
10418A72501p721n313J331J2802J2720N409J0267J1050P62r924l444r658k0262
$$ y = [58678, 57879, 61063, 65894, 67862, 65030, 65363, 69391, 68486, 64484, 60295, 59085, 58927, 72046, 72474, 69668, 73040, 74947, 80132, 82942, 82680, 82403, 95039, 110478, 123824, 146773, 169257, 193509, 212147, 218142, 226326, 243091, 263553, 276866, 284776, 295978, 308435, 310360, 306551, 298081, 274473, 238473, 197195, 164949, 150159, 141280, 127118, 116482, 105453, 97095, 98072, 106647, 103940, 98124, 94761, 99620, 105255, 102941, 98099, 91226, 92680, 92899, 91812, 94071, 93728, 88264, 80943, 78687, 83706, 87546, 95296, 103818, 110505, 117381, 131619, 142121, 153760, 170150, 180796, 191074, 199849, 200342, 199835, 201876, 192236, 185563, 184440, 177545, 161164, 154351, 149134, 145306, 151971, 158204, 165211, 170192, 172501, 164780, 159467, 160798, 173600, 186320, 191729, 201996, 213046, 213808, 203884, 200440, 190782, 170520]
10405A70520k0952q152p640p591p82l587o711J308J833K991R127Q007o16O256
10391A44011M36N4J199j867L860Q3l834M17p305p621J397K058m985p768k357m949
10375A12829l731o290N08O368J474J681P03J131j757J840J408M6J461J1034J8597
10360A47302K3523L3337L0665J4409R368J6825L1054K3197J2351J6174L4041L7350
10348D29596L2422J5131L639j2722k0405k3168r937q116q435k788n497J578k51
10335C91047o020N243K377L882O267J482L363K602O719J0118M266J188K589m17
10321D34706N53Q218M722P423M825J0867R335M696N783J3929P555P982J6786K9984
10307E67364L1557J9602J9202J7373J6866J7335J5500J5885K3071J7940J5578
$$ y = [170520, 149568, 141416, 133776, 126185, 125403, 121816, 115105, 116413, 118246, 121237, 130364, 138371, 137755, 144011, 144447, 144501, 145700, 143833, 147693, 147776, 143942, 144359, 137054, 129433, 130830, 132888, 127903, 120135, 117778, 112829, 109098, 102808, 103316, 109684, 111158, 112839, 113542, 114673, 112916, 114756, 116164, 116210, 117671, 128705, 147302, 170825, 204162, 234827, 249236, 258604, 275429, 306483, 329680, 342031, 358205, 392246, 429596, 462018, 477149, 480788, 468066, 447661, 424493, 414556, 406440, 398005, 395217, 389720, 391298, 391047, 385027, 390270, 392647, 396529, 402796, 404278, 407641, 410243, 416962, 427080, 431346, 432534, 435123, 434706, 435259, 443477, 448199, 455622, 460447, 471314, 480649, 485345, 491128, 505057, 512612, 520594, 537380, 567364, 598921, 618523, 637725, 655098, 671964, 689299, 704799, 720684, 743755, 761695, 777273]
10296G77273J5734K1227K8536K2744K3522L7786M7666M7268L8672M0067L9140
10285A139635M6255M6149N8199O1095O7407P3953P3003P2372Q3713R3077Q9535
10274A904393Q9210R5860J08991J16289J19771J24626J25503J36866J39067J46490
10264C107066J65897J86838K08129K38330K79798L35961M05544M97553O05527
10255F030643O88442P15273P30511P91305R40881J139489J333979J593630J955555
10246A5919708K343335K698311L075535L595083M385372N602575P609806J1022821
10238E6252546J6675284K4998464L3689295L5587067K5728632J0604805L859342
10231B07395435Q191195J3742603J2237945P107845P694200J0023501O940966
$$ y = [777273, 793007, 814234, 842770, 865514, 889036, 926822, 974488, 1021756, 1060428, 1100495, 1139635, 1185890, 1232039, 1290238, 1351333, 1418740, 1492693, 1565696, 1638068, 1721781, 1814858, 1904393, 1993603, 2089463, 2198454, 2314743, 2434514, 2559140, 2684643, 2821509, 2960576, 3107066, 3272963, 3459801, 3667930, 3906260, 4186058, 4522019, 4927563, 5425116, 6030643, 6719085, 7434358, 8164869, 8956174, 9897055, 11036544, 12370523, 13964153, 15919708, 18263043, 20961354, 24036889, 27631972, 32017344, 37619919, 45229725, 56252546, 72927830, 97926294, 131615589, 167202656, 192931288, 203536093, 207395435, 215586630, 229329233, 241567178, 248675023, 256369223, 266392724, 273333690]
10224B73333690n86627j2995279k9089273m1168294m3698792l7889394k8449053
10217G9456978j9526330j3040204q910378o358533m806136l850961l192667k642713
10209A7129056k147854j738355j430017j163779r11786p12663n90453n39077n40756
10200G354316n69524n82731n28587m30840l08898k15429j87184k18469k32732
10191D079922k13937j92322k00338k36108k71963k74064k47311k05070j72144
10182B066665j52308j17185r5899p6232o8818o4809n8068m3043m7230m1983m8633
10171A252457l9576l7686l0914l0992l2144l2527m2490l3225l0301k8462k4018
10160H90122j9832k0845j7050k1853k1626k2792k5165j2928j7437j7673j0303
$$ y = [273333690, 272747063, 259751784, 230662511, 189494217, 145795425, 107906031, 79456978, 59930648, 46890444, 37980066, 31621533, 26815397, 22964436, 19771769, 17129056, 14981202, 13242847, 11812830, 10649051, 9737265, 9024602, 8434149, 7895072, 7354316, 6784792, 6202061, 5673474, 5242634, 4933736, 4718307, 4531123, 4312654, 4079922, 3865985, 3673663, 3473325, 3237217, 2965254, 2691190, 2443879, 2238809, 2066665, 1914357, 1797172, 1701273, 1625041, 1556223, 1491414, 1433346, 1390303, 1343073, 1301090, 1252457, 1212881, 1175195, 1144281, 1113289, 1081145, 1048618, 1006128, 972903, 942602, 914140, 890122, 870290, 849445, 832395, 810542, 788916, 766124, 740959, 728031, 710594, 692921, 682618]
10149F82618j1278j7114k0501q421m566q751j5452j5005j3201j0252J316j1862
10137E47531j4010q510j4942j6234j1277j2788j3505j6265j7692j2532r580j0617
10125C89579j7593j1243q476o483j0773q156p435j4094j5339j1897j0153k0313
10113B47624j5454p274j1161j2815l618R782J6990O543o527j981L721Q689Q147
10100B42666O644J0347J7235K2327L0223K3874J6643J192j0957n601j0341o308
10088C37944m999j3217j0296n242p222o308n264j3889j1648n866r523j6258n326
10075B22886l605J059l049q455r974j1460p877j2049j764m152R48K314J955m455
10061A62322j971n134K456K31K668n69q014j1927o215p349j1482j4270j0151q389
$$ y = [682618, 671340, 654226, 633725, 625304, 620738, 611987, 596535, 581530, 568329, 558077, 559393, 547531, 533521, 525011, 510069, 493835, 482558, 469770, 456265, 440000, 422308, 409776, 400196, 389579, 371986, 360743, 352267, 345784, 335011, 326855, 319420, 305326, 289987, 278090, 267937, 247624, 232170, 224896, 213735, 200920, 197302, 207084, 224074, 230617, 224090, 222109, 225830, 234519, 242666, 249310, 259657, 276892, 299219, 329442, 353316, 369959, 371151, 360194, 354593, 344252, 337944, 332945, 319728, 309432, 304190, 296968, 290660, 285396, 271507, 259859, 253993, 244470, 228212, 222886, 219281, 220340, 217291, 208836, 198862, 187402, 179525, 167476, 165712, 161560, 162508, 164822, 166777, 162322, 160351, 155217, 157673, 157904, 160572, 160003, 151989, 140062, 133847, 126498, 115016, 100746, 90595, 82206]
10047H2206q284p568m992J104m009m169o567n611m971k072K667J0992Q695J2279
10033F9700P972O476N923K883q017o889n591q510j903J563N634L008R06p229L221
10018F9147J3467j116l887L209pR369P779k251o975l545L98M399p164q782N619
10003G9660L361K28k766N927J381m458M425j86K688J379k951l950r628o328k571
9988F6211o53J807m391m221J164Q618K176L988L214L464L7l395J39N310j082n867
9972G6519r395p1Q714M572o797p075Q53j025j0094o85p32J083K735J971O901r49
9956F6525P67J764k299p748o357J719k028O64P158n305M742Q795L59n274m600
9941E8882k372k578K412M940j452M016K415o993m003p185j431Q752o7o886Q27
$$ y = [82206, 73922, 66354, 61362, 62466, 58457, 54288, 47721, 42110, 37139, 35067, 37734, 48726, 57421, 69700, 77672, 84148, 90071, 92954, 84937, 78048, 72457, 63947, 62044, 63607, 69241, 72249, 73155, 65926, 69147, 82614, 81498, 77611, 80820, 80813, 90182, 97961, 95710, 88735, 85190, 85588, 89987, 82823, 74041, 79660, 83021, 83249, 80483, 86410, 87791, 83333, 87758, 87572, 90260, 91639, 88688, 84738, 75110, 68782, 66211, 65558, 67365, 62974, 58753, 59917, 68535, 70711, 74699, 77913, 81377, 81414, 78019, 78158, 83468, 82386, 76519, 67124, 67053, 75767, 80339, 73542, 66467, 67320, 66295, 56201, 55516, 54784, 55867, 58602, 60573, 67474, 66525, 67292, 69056, 66757, 59009, 52652, 54371, 52343, 53007, 60165, 54860, 59602, 68397, 68756, 63482, 58882, 56510, 53932, 56344, 61284, 59832, 63848, 66263, 59270, 55267, 48082, 46651, 55403, 55336, 48450, 49277]
9926D9277o160J897N137r363j679Q160j206p519n517r622k718k33L058Q056P750
9911C9318M878k179q992p84M914m504k54j716K038Q217O983q403l268K568n073
9896C3743o853J952o099j540r35L013j345j597J93K280O128m22o654J991K617
9881B6472P028K690m577p986L58K212k072J1717R723l732r054o767k324J691L534
9866B8913L026L438o565j822L312k322O856O044Q01M593Q201O565j352n5j488
9851E8145n008l06J939n986k561K107M296Q089J3169J4813P555Q218J1147L733
9837A19350j332L593J3917J6653J8772K6007L7731M6995N9898R5208J39600J96160
9825G72552K37777K24463J87512J85003K24403K22174J23463m2372k11439l33381
$$ y = [49277, 43117, 45014, 50151, 40788, 39109, 47269, 46063, 38544, 33027, 23405, 20687, 20454, 23512, 31568, 39318, 44196, 42017, 33025, 32241, 37155, 32651, 32397, 30681, 32719, 40936, 47919, 39516, 36248, 38816, 33743, 26890, 28842, 22743, 21203, 20268, 23281, 21936, 20339, 20532, 22812, 28940, 28518, 21864, 23855, 26472, 33500, 36190, 31613, 23627, 23985, 26197, 24125, 35842, 45565, 41833, 32779, 26012, 23688, 25379, 28913, 31939, 35377, 28812, 26990, 30302, 27980, 34836, 40880, 41681, 46274, 54475, 61040, 59688, 59633, 58145, 53137, 52831, 54770, 48784, 46223, 48330, 52626, 60715, 73884, 88697, 96252, 104470, 115617, 119350, 118018, 121611, 135528, 152181, 170953, 196960, 234691, 281686, 341584, 436792, 576392, 772552, 1010329, 1234792, 1422304, 1607307, 1831710, 2053884, 2177347, 2134975, 1923536, 1590155]
9815A590155l60529l24791k49749j64103j05513p5834n0046m3103l9631k8932
9805A47924j9948j4263j3597o758k082n023l135K360p81r068r511n910m591J971
9791E7588l804l875q352k742N465q25o135k298K543O218N172P741j519m487p666
9776D3024j023p171o221n286p841N31K04m984K488j068j607J304L615L32r25q09
9760A4563j309n793J023M93L250K704J483J349k612k41l416j002K820M891j235
9745A6968L02j673l193j939J394l684K665l948j316r31m320L150P549R540M643
9730B5207k397o012k215Q088K976l738j951k608K58j336J727k540O25L1m248N908
9714A7775J1050m370n752r89l585m254K351L33k577m22L91l462P887L808r795
$$ y = [1590155, 1229626, 904835, 655086, 490983, 385470, 309636, 259590, 216487, 176856, 147924, 127976, 113713, 100116, 93358, 91276, 86253, 83118, 85478, 84697, 75629, 66118, 60208, 55617, 57588, 53784, 49909, 41557, 38815, 44280, 43455, 37320, 35022, 37565, 43783, 48955, 56696, 55177, 50690, 43024, 42001, 34830, 28609, 23323, 15482, 16013, 16217, 11233, 13721, 12653, 11046, 12350, 15965, 16297, 15372, 14563, 13254, 7461, 8484, 8977, 12227, 14931, 16414, 17763, 15151, 14910, 11494, 10492, 13312, 18203, 16968, 17270, 15597, 12404, 10465, 11859, 8175, 10840, 6892, 5576, 4645, 325, 3475, 11024, 20564, 25207, 22810, 16798, 14583, 22671, 25647, 21909, 19958, 17350, 17608, 16272, 17999, 15459, 16084, 16115, 11867, 17775, 28825, 24455, 18703, 17714, 14129, 9875, 12226, 12559, 9982, 9560, 9951, 6489, 14376, 18184, 8389]
9699H389m273R99J147r33l675J183J1054J392J565p43m52L923j027o628m580l099
9683D242J402P400M134J004j145l032L761k99j410l201k238j410L387N208P871
9668B5674m752n194J257K686n209o825j150J233j630J555J229l780p80N569O090
9653A5973J389j063L491L011K395m66n224k983O000O488o304j0160r82P94M624
9638A6983J694m713j487N911J489m189N46k452M406L371n558l948j918J140Q493
9623A9768O418J421j980m845n606p225K433L235M819O698Q91j550l754j0310q499
9608A914N194N757J980o243m748P492O281k29J722K489R84J032k898k000K713
9593B1440k288J216J312J0653J659j1916n774m130K856k317Q49N741k21N994O69
$$ y = [8389, 4116, 5115, 6262, 5329, 1654, 2837, 13891, 15283, 16848, 16105, 15653, 19576, 18549, 11921, 7341, 4242, 5644, 13044, 17178, 18182, 17037, 14005, 17766, 17467, 16057, 12856, 10618, 9208, 12595, 17803, 25674, 20922, 15728, 16985, 19671, 14462, 7637, 6487, 7720, 6090, 7645, 8874, 5094, 4314, 9883, 15973, 17362, 16299, 19790, 22801, 25196, 24730, 19506, 16523, 22523, 29011, 22707, 12547, 11565, 12359, 16983, 18677, 13964, 12477, 18388, 19877, 15688, 16234, 13782, 18188, 21559, 16001, 12053, 10135, 11275, 19768, 26186, 27607, 25627, 20782, 15176, 7951, 10384, 13619, 18438, 25136, 26027, 24477, 20723, 10413, 1914, 7108, 12865, 14845, 8602, 3854, 11346, 17627, 17398, 19120, 21609, 22593, 23625, 20727, 18727, 21440, 19152, 20368, 21680, 32333, 33992, 22076, 16302, 12172, 15028, 12711, 13560, 19301, 19080, 25074, 25743]
9578B5743n276J127O079O592K33j549p394n167L437K928k965k802L063O845m05
9563C0489O802K459p467k075K658k386J392K986P875O125O009P75Q353P163J4408
9548H5566P983J0139J3495J2630J0584Q976K2841K8634L9054M3471M8152O3651
9536C95176P0689Q8886J10732J53881K50584M08486P24900J268870J918356J305588
9526F696148o38532j463681j492633j108723o61477l73327k28630j64129j17934
9517D47082q2994n8437m0989l9434l3434l0023k5470j7263k0034j8851r384J104
9505G1873l306p215l200j789P164n218j1443j2798K539J141o109k009l128k343
9491B4159K707j365M263j206m500k242M466L802j583n746k160P10J319j35K151
$$ y = [25743, 20467, 21594, 27673, 34265, 34498, 32949, 25555, 20388, 23825, 26753, 23788, 20986, 24049, 30894, 30489, 37291, 39750, 32283, 30208, 32866, 30480, 31872, 34858, 42733, 48858, 54867, 55642, 63995, 71158, 85566, 93549, 103688, 117183, 129813, 140397, 149373, 172214, 200848, 239902, 283373, 331525, 395176, 465865, 554751, 665483, 819364, 1069948, 1478434, 2203334, 3472204, 5390560, 6696148, 6057616, 4593935, 3101302, 1992579, 1331102, 957775, 729145, 565016, 447082, 364088, 305651, 264662, 225228, 191794, 161771, 136301, 119038, 99004, 80153, 70769, 71873, 68567, 61352, 58152, 56363, 63527, 58309, 46866, 34068, 36607, 37748, 31639, 29630, 26502, 24159, 26866, 25501, 29764, 28558, 24058, 21816, 26282, 30084, 28501, 22755, 20595, 21305, 22624, 22489, 24640]
9476B4640k803M839K099m952k593n499M733M499p380m866L341K388N029k169n730
9461A5576K8J529J047j455n028K566M499l623p650K374N297m895p402R897P610
9446B0370n710M931P01L74p70r782j207J947R42l193L318R13o667n697J802J977
9430D249L453L704M630j313l413l967j111J655J915l133j250l411j88P162O487
9415A5469M354l603n463l7L210K814O02m15L186O844q44n973l456P45o05L255
9399B0083p352l544N457K606J563l680n240l506l814M762O301l600k311m056k550
9384A119N397J973L709L838m319Q233q156p402k58L532J0806K805p045L489M533
9369B2254m639J347l775m958m721J681M666l461L742L671j398m305p083N968r41
$$ y = [24640, 21837, 26676, 28775, 23823, 21230, 15731, 20464, 24963, 17583, 12717, 16058, 18446, 23475, 21306, 15576, 15604, 17133, 18180, 16725, 11697, 14263, 18762, 15139, 7489, 9863, 15160, 10265, 2863, 12760, 20370, 14660, 19591, 20292, 20666, 19896, 10114, 8907, 10854, 11796, 8603, 11921, 12834, 6167, 470, 2272, 4249, 7702, 11406, 16036, 14723, 11310, 7343, 6232, 7887, 9802, 6669, 5419, 2008, 1820, 8982, 15469, 19823, 16220, 10757, 10720, 13930, 16744, 17346, 16931, 20117, 26961, 26117, 20144, 16688, 17433, 16828, 20083, 12731, 9187, 14644, 17250, 18813, 15133, 9893, 6387, 2573, 7335, 13636, 10036, 7725, 3669, 1119, 6516, 8489, 12198, 16036, 11717, 19950, 11794, 4392, 4134, 7666, 18472, 21277, 14232, 17721, 22254, 17615, 18962, 15187, 10229, 5508, 7189, 11855, 8394, 12136, 15807, 14409, 10104, 3021, 8989, 8048]
9354H048m67L458O582m027p887J488k057K77L604J943q17M190N217k351k772m951
9338I478k689L010q25L306Q67j244K395K565M37l084j924K53j693q64N168k202
9322A2954m252n536j947J533O549L665N071L04o774m182K351O834O552j920k567
9307A8635J595l765l828l533l357M623L782j862j488J315K030k358k277Q27N006
9292A5345N19k358J261K17L271p640k850K734J812l079M612O601M042n633m628
9277A4226o552r41J949J457J424K082M50O746j180o071k930l50L501J609m372
9262A1048m592M009q74J098L637M851k836q284n758J392N620L147M424L339j904
9247A8317m890k894L453K346m397n872L452K156j713J948O182j091m892J004M515
$$ y = [8048, 7581, 11039, 17621, 13594, 5707, 7195, 5138, 5415, 9019, 10962, 10145, 14335, 19552, 17201, 14429, 9478, 6789, 9799, 8974, 12280, 13147, 11903, 14298, 16863, 17300, 14216, 12292, 12545, 10852, 9988, 15156, 12954, 8702, 3166, 1219, 2752, 9301, 12966, 18037, 18341, 11567, 7385, 9736, 16570, 23122, 21202, 18635, 20230, 16465, 12637, 9104, 5747, 10370, 14152, 12290, 10802, 12117, 14147, 11789, 9512, 10339, 15345, 15864, 13506, 14767, 14984, 18255, 10615, 7765, 10499, 12311, 9232, 13844, 20445, 24487, 18854, 14226, 7674, 6733, 8682, 10139, 11563, 13645, 14095, 20841, 19661, 13590, 10660, 10310, 13811, 15420, 11048, 6456, 10465, 9591, 10689, 14326, 19177, 16341, 8057, 2299, 3691, 9311, 12458, 16882, 20221, 18317, 13427, 10533, 13986, 16332, 11935, 6063, 9515, 11671, 9958, 11906, 18088, 16997, 12105, 13109, 17624]
9232A7624K330j199o691m886Q346M901l877o315k706O338M737j700k374k979k110
9217I439j501o421N251M809j362k087J633R804l094l222o82J212n801q3o486l82
9201A027Q79J439j724O768J2239P696l422j574k038N38K127k347p78l84k348l05
9185A7793J056o511J448P759m020m092L270j721O8K617J211q689o372J761K642
9170H220M3R51j561N221O820K960k544M709M48l829j900K513Q84J759L541l473
9154B4762m078o419L577M174M986j840m209K911N895o915l614j286J020M325N88
9139B3877q099k143o39J924K940K815L397J770j113J062N716m71o417n595m900
9124A4124N038M134j863j215N206j241O31k89n66O175M107P44r628k330K676N40
$$ y = [17624, 19954, 18755, 12064, 7178, 15524, 20425, 16548, 10233, 7527, 13865, 18602, 16902, 14528, 11549, 9439, 7938, 1517, 6768, 11577, 10215, 8128, 9761, 19565, 16471, 13249, 12567, 13779, 7978, 7895, 1409, 1027, 1906, 3345, 1621, 8389, 20628, 28324, 24902, 23328, 21290, 21828, 23955, 21608, 20830, 20446, 18098, 17793, 18849, 12338, 13786, 21545, 17525, 13433, 16703, 14982, 15050, 17667, 18878, 10189, 3817, 5578, 8220, 8263, 9214, 7653, 12874, 19694, 22654, 20110, 24819, 25267, 21438, 19538, 22051, 22935, 24694, 28235, 24762, 20684, 14265, 17842, 22016, 27002, 25162, 20953, 23864, 29759, 22844, 19230, 17944, 18964, 23289, 23877, 15778, 13635, 12996, 14920, 17860, 20675, 24072, 25842, 24729, 25791, 31507, 31036, 24619, 19024, 14124, 19162, 23296, 21433, 20218, 25424, 24183, 24814, 24525, 23959, 30134, 34241, 34985, 25357, 23027, 25703, 26243]
9108B6243q9J934O586Q599n674r315k827j500L353L03k76j420o081j103N899M791
9092B9423K918q019q963k245j259P78P551P512J249M867J581p297q315k607M751
9077B1925Q815Q358l058n243p211q396l395k340K972K763K062l443K444K811o696
9062A2368K794O924N361L281n883l64m262l27r44K338J963N74L932K676L982m036
9046C0377o740k529j2376o086K020m08m765J895P37L68Q418N800L492l08j299
9031A8596K207j887K009n481n650l670m055P77K934K40O487O229L851n30n870
9016A6187l708J613J256K426O89M357m971q239n519M638O29R69N353m52k185j219
9000A1824P94j893j888j567k409K34k6L569K663M296L480J548O43l082p599l178
$$ y = [26243, 26154, 28088, 34674, 43273, 37599, 28284, 25457, 23957, 27310, 27613, 27337, 25917, 19836, 18733, 24632, 29423, 32341, 24322, 15359, 13114, 11855, 12633, 20184, 27696, 28945, 33812, 35393, 28096, 19781, 17174, 21925, 30740, 39098, 36040, 30797, 23586, 15190, 11795, 9455, 12427, 15190, 17252, 13809, 16253, 19064, 12368, 15162, 22086, 27447, 30728, 24845, 24481, 20219, 19892, 18948, 21286, 23249, 23823, 27755, 30431, 34413, 30377, 23637, 21108, 8732, 2646, 4666, 4258, -507, 1388, 2125, 2493, 10911, 16711, 20203, 19895, 18596, 20803, 18916, 20925, 15444, 9794, 6124, 2069, 2846, 5780, 6020, 12507, 18736, 22587, 22057, 16187, 12479, 14092, 15348, 17774, 18463, 22820, 17849, 9610, 4091, 8729, 9358, 10327, 15680, 15228, 13043, 11824, 12618, 10725, 8837, 7270, 4861, 5095, 5069, 8638, 11301, 15597, 19077, 20625, 21268, 18186, 10587, 7409]
8984G409J357K015O220p504m670J439q49n664k695N558M741j027j611m879L74
8969B14L094L498Q13m14K986O24k696j90K422N426L460o118k895j988N23n305
8953C454r48l975M284N161N583M327j77m815r659O75J044j920k279K976J827j011
8937D547j78k819K044P839M80L220k160l472m723j0252r87P202Q291J416m443
8922F005l085r702l887J763Q372Q030m273J661P336L273k757J846n438J51n06
8907H789L13j441L568K601n482M36O320O510m33k641o544p825K500K356J857J510
8891A2394k642o110J721M407P875n751p802J487K722M693p809m156R5L57N181
8876F662K375J33K363o47l842o722r267k20P225M997L310J693m271j042N422p67
$$ y = [7409, 8766, 10781, 17001, 9497, 4827, 6266, 5417, -247, -2942, 2616, 7357, 6330, 4719, -160, 214, 3308, 6806, 7619, 7205, 10191, 10815, 8119, 7929, 10351, 15777, 19237, 13119, 10224, 8236, 8759, 3454, 2506, -1469, 2815, 7976, 13559, 17886, 17709, 12894, 3235, 3910, 4954, 3034, 755, 3731, 5558, 4547, 4369, 1550, 3594, 11433, 11913, 15133, 12973, 9501, 4778, -5474, -6461, 741, 9032, 10448, 6005, 2920, -6782, -10669, -8906, -534, 7496, 3223, 4884, 12220, 15493, 12736, 14582, 9144, 9295, 8789, 9102, 7661, 11229, 13830, 8348, 8784, 15104, 21614, 21181, 18540, 11996, 4171, 6671, 9027, 10884, 12394, 9752, 3642, 5363, 9770, 17645, 11894, 4092, 5579, 8301, 12994, 5185, 1029, 1124, 1481, 6662, 9037, 9170, 11533, 10886, 7044, 322, -8945, -9165, -1940, 3057, 6367, 8060, 3789, 2747, 8169, 7402]
8860G402n99j951J35j862o620k446M583K430L266O14j815k567K404J869K331r288
8844b114o150R004P00K36o012O89l33L383N643l60m206M0n1K081p08M647K354
8827H843o28K305O047J878n80k87n94l757j279N790m584o804p94n282L221k917
8811E78o521P577M678j399J968k475j59M057o680j1735k391M217K465J819K149
8796a852k746n901N14l045O212M186R741J090j2033m933O114j309n15L330o041
8781g188M28J1719J478j0055l14L737R680l044j502P88m431o93M924R35l336l356
8765b30K817O591P88m720j1172M736M415k236l290L961N605j09Q5l095l884L791
8749D053M100n247J983L270k500k077J882o237J172N584N543L963l245r8M263
$$ y = [7402, 6803, 4852, 4987, 3125, -3495, -5941, -1358, 1072, 4338, 4952, 3137, 570, 2974, 4843, 7174, -2114, -8264, 740, 1440, 1676, -4336, -3647, -3980, -597, 5046, 4686, 480, 520, 469, 2550, 1842, 6489, 8843, 8215, 10520, 16567, 18445, 17865, 17578, 16984, 13227, 11948, 17738, 13154, 6350, 5556, 274, 3495, 578, -5943, 1634, 6312, 4913, 6881, 4406, 4247, 8304, 1624, -10111, -12502, -8285, -5820, -4001, -1852, -4598, -10499, -9985, -13030, -6818, -2632, 7109, 8199, -3834, -8767, -2653, -3962, -4477, -1147, -7188, -6760, 4959, 6437, -3618, -3932, -195, 9485, 6441, 4939, 5727, 1296, 603, 5527, 6462, 3126, -230, 2587, 9178, 9966, 5246, -5926, -1190, 3225, 989, -2301, 1660, 7265, 7156, 7241, 4146, 262, 4053, 8153, 2906, 4889, 8159, 5659, 3582, 5464, -773, 399, 5983, 11526, 15489, 12244, 12146, 16409]
8734A6409M327p406q765j793J490M468q255l549q31k772Q250J855J560l256M364
8719F096L081l871J715O05n065J388M617M187n810l132O2L128m575n942k515m449
8703a0480O554Q15L1L385N779L007k767M2L94O964M860k384p196k282K990J794
8687A1506K436J223o276j124M60K044j297l665M153j006l685l337J49O057L750
8672A1388q402L537M848m129l149o324O92K798O360R814J556n478n266l212Q954
8657A3987N393j631n49J309q045n780l684l913r53N037J881L458N800J142n529
8642G923l002K069L376q354L070N088O16p076L17n08m077L164O415n858m750R60
8626f27M978k013K133M484P319j294n785j306N19K762j295J630J164K704O824
$$ y = [16409, 20736, 13330, 4565, 2772, 4262, 8730, 475, -3074, -3905, -6677, 1573, 3428, 4988, 1732, 6096, 9177, 5306, 7021, 7626, 2561, 3949, 8566, 12753, 6943, 3811, 3873, 7001, 2426, -3516, -6031, -10480, -3926, -3111, -3080, 305, 6084, 9091, 6324, 6366, 6760, 13724, 18584, 16200, 9004, 6722, 9712, 11506, 13942, 15165, 8889, 7765, 8225, 10269, 8972, 5307, 9460, 8454, 4769, 1432, 1581, 7638, 11388, 2986, 6523, 11371, 7242, 4093, -2231, -1539, 1259, 7619, 17433, 18989, 13511, 8245, 5033, 13987, 19380, 17749, 17200, 18509, 10464, 4684, 1000, -2913, -3866, 1171, 3052, 6510, 12310, 13452, 7923, 4921, 6990, 10366, 2012, 5082, 10170, 10786, 3710, 4027, 3519, -558, 2606, 9021, 3163, -1587, -627, 4351, 2338, 4471, 8955, 16274, 14980, 9195, 7889, 8408, 11170, 9875, 11505, 12669, 15373, 22197]
8611B2197N437K069p618n038K025K319L780k340P69k408o018q604R49M504R481
8596B1504J696K111O047j492m167n531k420j369N567N065K841j238o455m453m878
8581A2828q120k613P043O439n907n532o72O2L908M491k001J357j187j034k697
8566F365p674M87K044J196j853L54J791l84L865L236j273o84N732K877P587p17
8550B2949j941j29m070q304n223j828n08n120M596O988j70n212L46O174l885l468
8534A195L866k262k956N228K92J178k282m041M390K66J726J165K172M057k390
8519A1604p420j130M318l047r78K82j780J193N206M803j0137j473M614K153j776
8504F432j71o108K207P202J787p153K570j359R67k44k771R169K710o539n566n525
$$ y = [22197, 27634, 29703, 22085, 17047, 19072, 21391, 25171, 22831, 23600, 21192, 15174, 6570, 7519, 12023, 21504, 23200, 25311, 31358, 29866, 25699, 20168, 17748, 16379, 21946, 27011, 29852, 28614, 22159, 17706, 12828, 4708, 2095, 9138, 15577, 9670, 4138, 3466, 3528, 7436, 11927, 9926, 11283, 10096, 9062, 6365, -1309, -822, 1222, 2418, 565, 919, 2710, 2326, 6191, 9427, 8154, 7470, 13202, 16079, 23666, 22949, 21008, 20879, 16809, 8505, 3282, 1454, 946, -4174, 422, 7410, 7240, 2028, 2374, 8548, 4663, 1195, 5061, 2799, -157, 5071, 5363, 6541, 4259, 218, 4608, 4874, 6600, 7765, 9937, 13994, 11604, 4184, 3054, 7372, 4325, 3347, 3629, 1849, 3042, 8248, 13051, 2914, 1441, 6055, 8208, 6432, 6261, 153, 2360, 9562, 11349, 4196, 6766, 5407, 6374, 6130, 3359, 12528, 15238, 8699, 3133, -2392]
8488b392K94J17J543l57j884r00N94J968K772L66K021J0205j86j361L647l067
8472A3380j678q258M38j911J570L880O3J201l645l180j926R82M078M052o59k059
8456F328M741k026k762m109l236P53J934P05j081o964M362N072k820o347L496
8441a954P7j810J623R7N785J974L66n420q51O819Q05j177j069L372m166q94K582
8424F159K24n833p54L388P679Q584L434j5807q405n672l219K440L563P39L762
8409B82k599l20J0051J039r867l224J654M693R136M64l927L220J02n481M89m228
8393A484M971K584L308K263m633k189l658p155k782P737L631q87m01K540J987
8378H800n735n548j196K370P687m419j635M245L06J424L793l850N73j203J803
$$ y = [-2392, -2098, -1981, -438, -795, -2679, -3579, -2985, -1017, 1755, 2121, 4142, 14347, 14161, 12800, 16447, 13380, 11702, 3444, 3882, 1971, 3541, 7421, 7484, 8685, 5040, 1860, -66, 916, 4994, 9046, 8387, 6328, 11069, 9043, 6281, 2172, -1064, -311, 1623, 2328, 1247, -5717, -1355, 3717, 897, -5450, -1954, -1877, -3687, -2064, -1967, 3818, 5792, 6158, 738, -113, 6706, 7511, 6334, 5265, 8637, 4471, 3577, 6159, 6383, 550, -204, 3184, 10863, 19447, 22881, 7074, -1331, -7003, -10222, -7782, -4219, -3480, 282, -2317, -2637, 7414, 8453, -1414, -4638, -2984, 1709, 10845, 11309, 7382, 10602, 10704, 5223, 5712, 1484, 6455, 9039, 12347, 14610, 9977, 7788, 4130, -3025, -5807, 1930, 5561, 4674, 4273, 6813, 8800, 3065, -2483, -3679, -1309, 6378, 1959, 324, 4569, 4875, 6299, 10092, 6242, 6815, 5612, 7415]
8363G415J538k686J186m339r548p720p9Q164K598j91r0l636K352M202J2188K431
8347A3785j862m367l456j244J979J566j583M596J574l150M415j79j568o286J633
8332E853J670j709k530l963J062M075j741M209M988k062j476j137m940j177o662
8317e540Q18j757L560L895n148o31N531L462K930K627p5k738J201j076n174k390
8301e05K644J616l545M2q651n47P827K579o066l055K124J0463M625n39j314n929
8285A769Q069R577j51o494p792l2Q181M981r405q712J756M122k605j142L596j064
8269D654Q37j218J65J525K633k70o773K170O481k823m839m370m590m879K173P096
8253b028K084m291O21K453j781q97K270J638n62K174k057l603L444L80K074k718
$$ y = [7415, 8953, 6267, 7453, 3114, -6434, -14154, -14233, -6069, -3471, -3662, -3752, -7388, -5036, -834, 11354, 13785, 11923, 7556, 4100, 2856, 4835, 6401, 4818, 9414, 10988, 7838, 12253, 12074, 10506, 4220, 5853, 7523, 5814, 3284, -679, 383, 4458, 2717, 6926, 11914, 9852, 8376, 7239, 2299, 1122, -5540, -4722, -6479, -2919, 976, -4172, -4803, 728, 4190, 7120, 9747, 9672, 6934, 8135, 7059, 1885, -505, 2139, 3755, 210, 252, -8399, -8946, -1119, 1460, -4606, -7661, -5537, 4926, 9551, 9012, 7698, 1769, 9838, 19415, 19264, 12770, 4978, 4946, 13127, 18108, 8703, -9, 1747, 5869, 3264, 2122, 5718, 4654, 5491, 4273, 4438, 5963, 8596, 8326, 1553, 3723, 10204, 7381, 2542, -1828, -6418, -11297, -9124, -2028, 56, -4235, -3614, -1161, -2942, -3839, -1569, 69, -493, 1681, -376, -3979, -535, -155, 1919, -799]
8237g99l645j312N422j56R62l80j810L669K715j426k666L449J695p456q474Q447
8221a765K636l949k162l958q68J723Q445k058l041O063L166K98k959n119M735
8206A187P013m303q714k678M458j018l897J30K551R316l204q673L520P302k066
8191I24n976N987P81J842j186l200j203r13l11K343L565l10J275n222p558O486
8175b676M204K219m078M26J691K751k483L334J650m777j067M978n29J105k289
8160D459P73j205J614K934m250L517K740k970n975n747l698k85j98L884L019M12
8144i76o822j350N27K393K53N008R49M548k87j657l692j153J0069J166j1806j905
8128d735K65L404J938o129K09Q511m730r161j440j348R975Q019P5K145n989j785
$$ y = [-799, -4444, -5756, -334, -490, 472, 92, -1718, 1951, 4666, 3240, 574, 4023, 5718, -1738, -10212, -1765, 871, -3078, -5240, -9198, -10066, -8343, 102, -1956, -4997, 1066, 4232, 4530, 1571, -3548, 1187, 8200, 3897, -4817, -7495, -3037, -4055, -7952, -7822, -5271, 4045, 841, -7832, -4312, 2990, 924, -5052, 935, 1716, 3558, 2372, -828, -2031, -2944, -3255, -912, 2653, 2343, 3618, -1604, -9162, -2676, 1528, 3747, -331, 95, 1786, 4537, 2054, 5388, 7038, 2261, 1194, 6172, 5643, 6748, 4459, 5232, 4027, 5641, 8575, 4325, 7842, 10582, 7612, 1637, -4110, -7808, -8093, -8291, -4407, -1388, -976, -7798, -9148, -8621, -6228, -5975, -967, -18, 4530, 4243, 2586, -1106, -2259, 7810, 8976, -2830, -4735, -4470, -1066, 872, -5257, -5048, 3463, -1267, -10428, -11868, -13216, -3241, 4778, 4853, 6998, 1009, -776]
8112g76q35J079J675L138K776p19M381K766o561j1962Q20L539K933Q69J11j494
8096A740k631l87J774L409J248K494J561K584L259l565q719L40j4O57l961k496
8080b707j486O72l555Q96O576k285J915K494m480j776P001l60J73j176M741m115
8064B528k036N319k816j338o87k693N563O89j126o00l94J775l039n847m76M898
8048b80N533J452M138o845k637L31M202n337n25j389m873L073M482L664j154N60
8032D395k271n621K723M600K985m815n856j581J201J806J381n125P17j383p697
8017a4541l967O204L514M035J1039K362O870P988n034o262o749l596K060n17m575
8002a169L762k404M11L411N143k232k451J142j370k907Q97O33j132K065M23k609
$$ y = [-776, -1611, -532, 1143, 4281, 7057, 6338, 10719, 13485, 6924, -5038, -4218, -679, 2254, 3123, 3234, 1740, -891, -1278, 496, 3905, 5153, 7647, 9208, 11792, 15051, 11486, 2767, 3107, 3093, 3750, -211, -2707, -4193, -3521, -7076, -6180, 396, -1889, 26, 2520, -1960, -3736, 3265, 2905, 3078, 1902, 6643, 2528, 492, 5811, 2995, 1657, 970, -1723, 3840, 4529, 3403, 2803, 2409, 4184, 1145, -4702, -5178, -280, 5253, 6705, 10843, 3998, 1361, 1692, 5894, 557, 32, -1357, -6230, -3157, 1325, 4989, 3835, 4395, 2124, -3497, -774, 3826, 6811, 1996, -3860, -5441, -4240, -2434, -1053, -6178, -5461, -6844, -14541, -18508, -12304, -8790, -4755, 6284, 8646, 15516, 23504, 18470, 12208, 5459, 1863, 3923, 3406, -1169, 2593, 189, 600, 4011, 9154, 6922, 4471, 5613, 4243, 1336, 2233, 2866, 1734, 3799, 4222, 1613]
7986A613m488l739m078j204R352Q67o113O464m67K448P329n813l530Q89J674l299
7970b095K931M931J896N346r05p129l98J715J478k873J708k526l890l697n025
7955h533M728J0644L890O028J11l064o615M428M103K341j440l788q608l918j215
7940i08j976M194p878L189J926q22K001J751N345j959n782J596J763J708N41j10
7924D579j113K976J44L43Q06J491M441l073j1122k647O979j50j952n22M353L868
7908I401K448K176Q30n444p285l074L034N234j36m80k789J160K675k875N153j118
7892H910n721J507k584n928o757K824R525N966n474o945K191M05j640m790K00
7877h311l941L930R616O010l547K658j382q51L267k690k031k016L005K30o262
$$ y = [1613, -2875, -6614, -10692, -11896, -2544, -1677, -7790, -1326, -1793, 655, 7984, 2171, -1359, -470, 1204, -2095, 836, 5767, 7663, 13009, 12104, 4975, 4577, 6292, 7770, 4897, 6605, 4079, 189, -3508, -8533, -3805, 6839, 10729, 16757, 16868, 13804, 7189, 11617, 15720, 18061, 16621, 12833, 4225, 307, -908, -2884, 1310, -6568, -3379, -1453, -2275, -274, 1477, 6822, 4863, -919, 677, 2440, 4148, 4689, 4579, 3466, 6442, 6586, 6929, 7735, 9226, 13667, 10594, -528, -3175, 3804, 3654, 1702, 1180, 5533, 9401, 11849, 14025, 14855, 9411, 2126, -948, 2086, 7320, 7184, 6704, 3915, 5075, 7750, 4875, 10028, 8910, 3189, 4696, 2112, -3816, -10573, -7749, 1776, 7742, 2268, -4677, -2486, -2081, -3721, -8511, -8311, -12252, -8322, 1294, 7304, 3757, 6415, 5033, 4182, 7449, 4759, 2728, 712, 3717, 3947, -2315]
7862b315k639N216m405k529L01M986J0301K017n072p87k819m962l29L069J358
7847A391J0141M15p445q203k408O150o064j402J0058L858m921m330M992r5p04
7832A433n401m072Q165K246n334P95M289k533l577J736k154l297N38O305N912
7817E051J324l45Q70l867l570m352Q89N216m88j933J628P310l205m749n052K205
7801c068O810j580q929k408j10O684J977J5N38J61r44J232o351m902j699M135
7785h439K253O818O593m699O544m28n517m57K980O61l59j0102o252N879L501O964
7769E940J810k450M426j046j977k050L810n26p16L421k349k890j110q871l120
7754g698M295K846n350j586K013O943L078r021M05k068N765O528k264n921k71
$$ y = [-2315, -4954, 262, -4143, -6672, -6371, -1385, 8916, 10933, 5861, 5074, 2255, -2707, -3036, 33, 1391, 11532, 11947, 4502, -3701, -6109, 41, -6023, -7425, 2633, 6491, 1570, -2760, 2232, 2137, 1433, -3968, -8040, 125, 2371, -2963, -2168, 2121, -412, -3989, -2253, -4407, -7704, -7166, -861, 5051, 6375, 6030, 6900, 3033, -537, -4889, -4000, 1216, 728, -1205, 423, 7733, 4528, -221, -5273, -3068, 3742, 2162, -6767, -9175, -9285, -2601, -624, -609, -71, 90, -854, 378, -5973, -10875, -12574, -8439, -6186, 632, 7225, 2526, 9070, 8642, 3125, 2668, 5648, 6309, 5950, -4152, -10404, -4525, -1024, 5940, 7750, 5300, 9726, 8680, 6703, 4653, 8463, 7937, 7221, 10642, 8293, 5403, 4293, -4578, -7698, -3403, -557, -5907, -7493, -5480, 1463, 4541, -4480, -4075, -6143, -378, 6150, 3886, -2035, -2306]
7739b306P008O02o808j136J81j022l635j9M162M843N115K764o099j097l65k738
7723e50J546O535k649o296n051P05n224q274J905Q295M561j391n27R82P498L165
7707E230o691m321r52R332L940o26k958J265J818l455o806o71J885p696k321J0723
7691b304O642J027n934n932j82n533L939J660R113J232j511P46j846p393o107
7676a2383Q29Q765n32l95K583j834j671N468K880m26J796r076l714J752j45q97
7660g000J592L808R518J189m09m593m699j448K567J071J009K441Q126L883p557
7645I498q485K979m741p340l478L96J878J822N958J072K61j513l219N476j486
7630i22j062L39l504O628l061k547J126k846n040j249m990k88Q575L341k423P390
$$ y = [-2306, 4702, 5304, -1504, -2640, -2459, -3481, -7116, -7135, -2973, 1870, 6985, 9749, 3650, 2553, 2188, -550, 996, 7531, 4882, -1414, -6465, -5760, -10984, -19258, -17353, -9058, -4497, -5888, -6415, -5433, 2065, 5230, -1461, -5782, -6734, 2598, 6538, 5912, 2954, 4219, 6037, 2582, -4224, -4895, -3010, -10706, -13027, -2304, 4338, 5365, -569, -6501, -6683, -12216, -8277, -6617, 2496, 3728, 2217, 2963, 1117, -6276, -12383, -11554, -2789, -3321, -3716, -1133, -2967, -4638, 830, 3710, 3284, 5080, -3996, -7710, -5958, -6103, -7000, -5408, -1600, 7918, 9107, 8698, 4105, -594, -2042, 525, 1596, 2605, 5046, 13172, 17055, 9498, 1013, 3992, -749, -8089, -11567, -11171, -9293, -7471, -1513, -441, -180, -1693, -4912, 564, -922, -1984, -1645, -5149, 1479, -1582, -4129, -3003, -5849, -10889, -12138, -17128, -17416, -8841, -5500, -7923, -533]
7614e33L991j770j73n394o246L671P567K34k680o053n388J251O998N920M020l951
7598A464p069J60J09N518l317l400j935N588L602k659n896J560K093K076k056
7583d162l036j779m488J191K754m278l765p65j129M365j410k703L377K906L318
7568i604L277M820J684M010J049o696L281K101M695m590q480J508m8r211k9k88
7552a2521k842j733L412j730K786r61j142L142N972N382M837L379R96l817P03
7537E863m880K252n125j627K121M27N12n320j798l727N080R023J297Q4n489j2281
7521a3588J868M5l172J299m077m471M423N307J408L40L530P190J065K444k112
7506A499L205l03j0130l681L993K906L595O49J774p46l376o140j440k580L417
$$ y = [-533, 3458, 1688, 1515, -3879, -10125, -6454, 1113, 1347, -1333, -7386, -12774, -11523, -4525, 1395, 5415, 1464, -5605, -5445, -5336, 182, -3135, -6535, -8470, -2882, 720, -1939, -7835, -6275, -4182, -2106, -4162, -7198, -8977, -13465, -12274, -9520, -13798, -17563, -18328, -19457, -15092, -16502, -19205, -15828, -12922, -9604, -6327, -1507, 177, 4187, 5236, -1460, 1821, 3922, 8617, 4027, -4453, -2945, -2993, -12204, -12233, -12521, -15363, -17096, -13684, -15414, -12628, -13589, -14731, -11589, -5617, -235, 4602, 7981, 8977, 5160, 5863, 983, 3235, -1890, -3517, -1396, -969, -457, -5777, -7575, -11302, -6222, 2801, 4098, 4182, -1307, -13588, -11720, -11675, -14847, -13548, -17625, -22096, -17673, -12366, -10958, -10618, -7088, 102, 1167, 3611, 1499, 4704, 4401, -5729, -9410, -5417, -2511, 1084, 1733, 3507, 2761, -615, -6755, -8195, -10775, -7358]
7491g358K598Q40j038K716M697n052k308k17O096j171J448j725L599k514m582
7476c971K794N185l111N29L231J531q662K33k803k366M210M762N434m891o786
7461d681m800o53L32k192j774M339K851Q334m945o609k193J624J075P419J521
7446c52j775m489M147P22J2181Q63j629p916l029j017N543K323K925m740m832
7431a075k442L27Q053J0988l78k338n988p462Q84L636L535M131k499o890n308
7416b826L59l083J636j695l039N261L12o35M852O430j366k966J918K576L709l906
7400G537p76l026l746L903L296o245n349L582k945L702O132N890P55j0571q014
7385e875M973O429n004P1k297m14L62K477o983r204J905J860m320o143N534j819
$$ y = [-7358, -4760, -3920, -4958, -2242, 2455, -2597, -4905, -5122, 974, -197, 1251, -474, 3125, 611, -3971, -1177, 4008, 897, 1426, 4657, 6188, -2474, -2241, -5044, -7410, -3200, 1562, 6996, 2105, -4681, -9481, -10134, -9802, -11994, -13768, -9429, -6578, 1756, -3189, -9798, -11991, -10367, -9292, -1873, -352, -2127, -6616, -2469, -1747, 10434, 11297, 9668, 1752, -1277, -2294, 3249, 5572, 8497, 3757, -1075, -3517, -3190, 4863, 15851, 15473, 13135, 7147, -315, 569, 4205, 7740, 11871, 9372, 2482, -2826, -2467, -5550, -3914, -5609, -8648, -3387, -3075, -3710, 1142, 7572, 6206, 3240, 5158, 7734, 11443, 7537, 6761, 3735, -11, 3892, 7188, 943, -4406, -824, -3769, -67, 6065, 11955, 12710, 2139, -5875, -902, 5527, 523, 594, -1703, -2117, -1755, 722, -6261, -15465, -13560, -11700, -16020, -22163, -16629, -18448]
7369a8448q41Q70Q512J0713Q024l383p143o302r71k676N554R013p92m240K802
7354F92l051m114l33k749P33P74m825n03k679K258M719j68j400J202K831L46O770
7337E03o08k445K397L271J008j371m052k30K532Q412o925o454L702L297k670P71
7321A138k734l833J878M61o06O36O332J493l350j879j4J594M526r14j2968K377
7305e863K353R288P291j52l602k42k667k218n170K278N760k464n497m896l000
7290h801P57K958J67R956n50o892l195L867J715j637M416k950l003k622m998K646
7274h166K370J640L561k779l148l645L134N008l861l437j092k183K177N191N174
7259e6J882n871q072M68M025pq112K843J346k84p34M41p35J056O913Q097L388
$$ y = [-18448, -19289, -18419, -9907, 806, 8830, 5447, -1696, -7998, -8969, -11645, -6091, 2922, 2130, -2110, 692, -2359, -6473, -6806, -9555, -8822, -8048, -12873, -13376, -16055, -13797, -9078, -9246, -10646, -9444, -6613, -6267, 503, -105, -2550, -153, 3118, 4126, 2755, -1297, -1527, 1005, 9417, 2492, -3962, -260, 3037, 367, 1138, -1596, -5429, -3551, -3090, -3696, -3060, 3272, 4765, 1415, -464, -478, 1116, 5642, 4728, -8240, -5863, -3510, 5778, 13069, 12917, 9315, 9073, 6406, 4188, -982, 1296, 7056, 4592, -905, -5801, -8801, -8044, -5086, -4919, 5037, 4487, -2405, -5600, -1733, -18, -1655, 2761, -189, -3192, -5814, -10812, -8166, -5796, -4156, -595, -3374, -6522, -10167, -7033, -2025, -5886, -9323, -10415, -12598, -10421, -5230, -56, 1826, -4045, -12117, -11649, -7624, -7631, -15743, -12900, -11554, -11838, -12572, -12131, -12866, -11810, -4897, 3200, 6588]
7242F588J235n863p734J182K910j353j206K612J80m404L46p20P32K805O623l770
7226A63n668p109J2057Q211m999q251K56M846R91J612P34L7l548L205N486l000
7210E023m050k124p49q18k898r27r06m111J348O050k246K357O473k731O71l2k870
7193b540J302J778R17l340o641k146P477K17N879k51J737o056k051J261l413n429
7177a1299M566j813l302N447M500K94n698p922K517M571o064m425k421K313M639
7162a4097L322K975J1022l997K263M077j2348o980M067O865m460J689N888M580
7148D866p371L372k343Q311M028r660N91J282m174j245r83K904k751M55L571m06
7132D47l31o75L582k624j782k573p443L71O296R269K347o255p073J566m36o54
$$ y = [6588, 7823, 1960, -5774, -4592, -1682, -3035, -4241, -1629, -1449, -5853, -5507, -6227, -5495, -2690, 3933, 163, -5505, -12614, -557, 7654, 2655, -5596, -5340, -494, 497, 2109, 2843, 2880, -668, 2537, 8023, 5023, 973, -1151, -1900, -2718, -5616, -6543, -7449, -11560, -10212, -4162, -6408, -4051, 2422, -309, 362, 330, -2540, -1238, 540, 1457, -1883, -8524, -10670, -3193, -2976, 2903, 2652, 4389, -1667, -3718, -2457, -5870, -11299, -6733, -8546, -11848, -6401, -1901, -1607, -7305, -15227, -12710, -8139, -14203, -18628, -21049, -18736, -14097, -10775, -7800, 3222, -775, 1488, 5565, -6783, -13763, -9696, -2831, -7291, -5602, 286, 4866, -2505, 867, -1476, 6835, 10863, 1203, 1794, 3076, -1098, -2343, -3326, -422, -3173, -2718, 853, 447, 116, -559, 3023, 399, -1383, -3956, -11399, -11028, -4732, 4537, 6884, 629, -6444, -4878, -5314, -5968]
7116e968R488l463j761N41L268k367o925j578M42N039j069j897m149J846M713
7101c840L867k255J584P64J623j457Q022M0k729j0218n647o549J439J1333K753
7086a270K263N938M18o658q527j78L149M437J983n223N214J082k638m021m427
7071h458j181Q756P001K912l212q817k244r385o441N25M198J072K594R02M862
7056f916L109J641j325q72L054L156N461o683l265J394O622K543l996k477P63
7041B209n022N750k21L775l73m441j348P09n131O546m96l289K259L924p175K158
7025a66m31r72k010L042l851k402n317K743K815q94J219K543j069Q70M756J953
7009B829K019n30r892m661K334L767M206N02n637j508L927j496m927j073O252
$$ y = [-5968, 3520, 57, -1704, -1163, 2105, -262, -7187, -8765, -8323, -3284, -4353, -6250, -10399, -8553, -3840, 27, -2228, -644, 120, 1743, 286, 8308, 8348, 5619, -4599, -10246, -16795, -15356, -4023, -1270, 993, 6931, 7349, 691, -7836, -8014, -4865, -428, 1555, -3668, 1546, 2628, -10, -4031, -8458, -9639, -883, 6118, 9030, 5818, -2999, -5243, -14628, -21069, -20544, -16346, -15274, -12680, -11778, -6916, -3807, -2166, -3491, -4363, -1309, 1847, 7308, 625, -2640, -1246, 5376, 7919, 3923, 1446, 2209, -2813, 2937, 2716, 6491, 6118, 1677, 329, 1038, -4093, 2453, 1957, -1332, 927, 4851, -2324, -166, -597, -1569, -3579, -537, -4388, -6790, -12107, -9364, -6549, -7443, -6224, -3681, -4750, -3880, 876, 2829, 4848, 4318, -5574, -10235, -7901, -4134, 72, 574, -5063, -6571, -2644, -4140, -9067, -10140, -3888]
6994c888L502Q31n556o641l855N298L669l257K903k634n454K489l373J456L584
6979a0926Q32L344p56m490L157Q04L525J50l10L242L691j29L062n068k380K097
6963a55l626n562N316M46J574Q301J18o028k063n898J720l759J556j78J58q67
6947h947n58L814J0005P545o170j0918K50O982J233k477O44k396r0m689J24L536
6931b112l57k589J444P92j273r49K46L364P590n90l583o935k438O104L991p340
6915d635l830n702n146K401q90P132J7228K088n467l400k347M692M939j976n683
6900e96m284J472k729r00K20m100L669L493l126l385j123J818J088K110N723p07
6884a357k504q528m01K360N186R405n73o092o284J784j745l381N865O087L251
$$ y = [-3888, -386, 445, -5111, -11752, -15607, -10309, -6640, -9897, -6994, -9628, -15082, -12593, -15966, -14510, -10926, -10094, -6750, -7506, -11996, -8839, -8035, -4510, -4360, -4670, -1428, 2263, 2134, 5196, 128, -2252, -155, -3781, -9343, -4027, -3581, -2007, 6294, 6412, 384, -1679, -7577, -5857, -9616, -8060, -8238, -8080, -8947, -9505, -5691, 4314, 11859, 5689, -5229, -4979, 2003, 3236, 759, 1403, -993, -1083, -5772, -5648, -2112, -2469, -5058, -3614, -2822, -4095, -5044, -4798, -1434, 6156, 5566, 1983, -4952, -7390, -1286, 2705, -4635, -8465, -14167, -19313, -16912, -17802, -10670, 6558, 8646, 3179, -221, -2568, 2124, 7063, 5087, -596, -4880, -3408, -6137, -7037, -6817, -10917, -7248, -3755, -6881, -10266, -11389, -9571, -8483, -6373, -650, -1357, -3861, -12389, -12790, -10430, -5244, 4161, 3588, -2504, -8788, -7004, -8749, -12130, -6265, -178, 3073]
6869C073L907l106Q04m319k397Q16K889M710K175q93M100o347k373P67l857j368
6853a419n606j355P592m980k252O484J124M925Q831k658n886n659n346J358n045
6838i892m956K468J627j836M556m485l53j156k207Q87N723M081L904N00o406J030
6822f515N265J560l140j43K967J41j249M918K625m908M200j037m208K866M333
6807G675J139K275l463j338l985l633m38k055J094J621J987k015k499m811K061
6792f385L303L835L252M275R05J745j372l253j0478m601L246J0612l384p910N833
6777c77j46l788k487K343J10L399M258L54k458P74J182j885j228k602l059O986
6761A376K148L39N763J614m393l358M271M71R14j326r14J577n59L980o673n775
$$ y = [3073, 6980, 3874, 4678, 359, -2038, -1222, 1667, 6377, 8552, 7659, 11759, 5412, 3039, 3806, -51, -1419, -7025, -8380, -788, -5768, -8020, -1536, -412, 4513, 13344, 10686, 4800, -859, -6205, -4847, -9892, -14848, -12380, -10753, -12589, -8033, -12518, -12871, -14027, -16234, -15347, -9624, -5543, -1639, -1139, -7545, -6515, -1250, 310, -2830, -2973, -6, 135, -1114, 3804, 6429, 1521, 5721, 4684, 476, 3342, 7675, 8814, 11089, 7626, 6288, 2303, -1330, -1768, -3823, -2729, -1108, 879, -1136, -3635, -8446, -6385, -3082, 753, 4005, 8280, 9185, 10930, 9558, 6305, -4173, -8774, -5528, 5084, 1700, -6210, -377, -523, -4311, -6798, -4455, -4345, -946, 3312, 3666, 1208, 1982, 3164, 1279, 51, -2551, -5610, 1376, 3524, 3863, 9626, 11240, 6847, 3489, 7760, 8231, 9145, 7819, 6905, 8482, 7923, 11903, 5230, -545]
6745e45j800l564K762L918j98o80j731J260N050N354Q247l405m1J370q298N67
6729H266K696J705K79k245n353m743l384O06n83J797q43r303m519L130O181P777
6713A464l86n814j152p517k12N39L841K312j111j483K341M927J804k692k656M463
6697a332R193K222k157J553k928k515k84m056R33l297l773m38J945m138j951n14
6681a1537O390j735J531O237N669p246q761r19j910l25o75M134Q500L697m350
6666a300k460J091M89R10k470q164L062o542M413J3066K569j2495n808K966J2039
6651A366j663n564j849O40m110k580P76J092K223K666L282J568r287J507L70Q73
6635h690k548R97Q987O803j244m820J669Q81l940k413J445K359m926j642O0O948
$$ y = [-545, -2345, -5909, -3147, 771, 573, -107, -1838, -578, 4472, 9826, 18073, 14668, 14627, 15997, 7699, 8266, 10962, 12667, 12946, 10701, 5348, 605, -2779, -2173, -2756, -959, -1802, -11105, -15624, -12494, -6313, 1464, 1078, -4736, -5888, -13405, -13617, -13078, -9237, -6925, -8036, -9519, -7178, -2251, -447, -3139, -5795, -1332, 7861, 10083, 7926, 9479, 6551, 4036, 3752, -304, 629, -2668, -6441, -6879, -4934, -9072, -11023, -11537, -5147, -6882, -5351, 886, 6555, -691, -9452, -10371, -12281, -12606, -13281, -9147, -647, 3050, -1300, -3760, -2669, -2180, -1270, -3740, -11904, -8842, -15384, -10971, 2095, 4664, -7831, -13639, -10673, 1366, -297, -5861, -7710, -7070, -11180, -13760, -12984, -11892, -9669, -7003, -3721, -2153, -11440, -9933, -9563, -8690, -11238, -10241, -1254, 5549, 4305, -515, 1154, 2035, -1905, -4318, -2873, -514, -5440, -7082, -7022, -74]
6619g4p47j919K019J08j0767j07N827K274k334j832J365J1060n198p317J619R959
6603C936K584m471l556K005k374N175m087l483J796l7K463L608J520l420K845
6588D504j906J888o90p108n768N508K162m75n457K561j400N901M228p59k815q164
6572g790k538M504M568o72J964r24J932m520J668O459K508j1289q904l544P819
6557h759K335m453L082j752N158K243m027j994P277M29m228R554m518n307M515
6542d45L926j605p527l47M845K193J165m984k474N666L047l827k632l268R05J312
6526d050p398M477N560L539N668q008n277O693K086l007m734j967K087m488k683
6511a1502j091k353N012O692J116K072N114O323j323j976m496q756m06J948p388
$$ y = [-74, -821, -2740, -721, -613, -11380, -11487, -5660, -3386, -5720, -7552, -6187, 4873, -325, -7642, -6023, 3936, 6520, 2049, -1507, 498, -1876, 3299, -788, -4271, -2475, -2512, -49, 3559, 5079, 1659, 4504, 2598, 4486, 3796, -3312, -9080, -3572, -1410, -1885, -7342, -4781, -6181, -280, 3948, 3189, 374, -7790, -10328, -5824, -1256, -1928, 36, -888, 1044, -3476, -1808, 4651, 7159, -4130, -13034, -16578, -8759, -6424, -10877, -7795, -9547, -4389, -2146, -6173, -8167, -890, -461, -4689, 4865, 347, -4960, -445, 3481, 1876, -5651, -5998, -1153, 1040, 2205, -2779, -5253, 413, 3460, -367, -2999, -6267, -5362, -4050, -11448, -6971, -1411, 2128, 7796, -212, -5489, 1204, 3290, 283, -4451, -6418, -4331, -8819, -11502, -12593, -14946, -9934, -3242, -2126, -54, 5060, 11383, 10060, 8084, 3588, -5168, -5574, -3626, -11014]
6496a1014l157K945N319P167k569m882l977j852j731k16j020O09k283N669J0540
6481d52L944k99N46j1030l750K08N045M205L828Q486n862j638N67k618k929n12
6465b261M574p8j0236m829l977K38P630J710M482J0182j91o006J391l436m477
6450e284J707J977j920J350m624k695k472l287N926M191P15K276K907O19q723
6435g337R64K508j979l025P870j327m011p769M90j671J988P201J3599q54o471
6420A76K272p051j062L626Q783R322j028p000N181n677o05j908j6474j365N772
6405g038K183k232l150K081L174K068k379k385l02K447J0413J223m563q898M229
6390c129L144j1153j960p80J869J523m511K918L485K947N926L518J747l666m860
$$ y = [-11014, -14171, -11226, -5907, 1260, -1309, -6191, -10168, -12020, -13751, -13967, -14987, -14378, -16661, -10992, -452, 3492, 3193, 3739, -7291, -11041, -10833, -5788, -1583, 2245, 10731, 4869, 3231, 3798, 1180, -1749, -2261, 2313, 2235, -8001, -12830, -16807, -16569, -8939, -7229, -2747, 7435, 7244, 1238, 2629, -807, -5284, -3577, -1600, -3520, -2170, -6794, -9489, -11961, -15248, -9322, -5131, -4416, -2140, 767, 1386, -7337, -6373, -3865, -5844, -8869, -999, -2326, -6337, -14106, -13616, -15287, -13299, -6098, 7501, 6647, 176, 2448, -4603, -5665, -2039, 6744, 16066, 15038, 8038, 13219, 7542, 6937, 5029, -11445, -12810, -7038, -4855, -7087, -10237, -8156, -4982, -2914, -5293, -7678, -7980, -5533, 4880, 6103, 1540, -7358, -3129, 15, -11138, -13098, -13878, -12009, -10486, -14997, -12079, -8594, -5647, 279, 3797, 5544, 1878, -2982]
6375b982l968o044L509Q693J1770q195m645l754j50L512j533j806j103j821L599
6360d918K554o18Q89q663J744K000k569l889L217K195m53J706j188j321J778m107
6344a1643N60P375N978q021J307L081q34N775K830k740P57K34k974k645K572R631
6328A1243m642j2092RM126n759j854J525J862j810j002k767L037o061o391J632
6313a8944M565K399J38O95L43J025M074k054J975J444P551L196N434k187r2r044
6297E18j031k265o75M114j368k623j47K903j050m358L426K981n090l611m261J822
6281a0715K255N693L493J07k114J617P822q217K802N91r339p793o164j436L909
6266a7489N173K875k704L134m736j139L293J120L875M445l59J39j624n324J136
$$ y = [-2982, -6950, -12994, -9485, -792, 10978, 2783, -1862, -5616, -5766, -2254, -3787, -5593, -6696, -8517, -4918, -2364, -2982, -2093, -10756, -9012, -7012, -9581, -13470, -10253, -8058, -8511, -6805, -7993, -9314, -7536, -11643, -11083, -3708, 2270, -5751, -4444, -1363, -2197, 3578, 6408, 3668, 4425, 4659, 1685, -960, 1612, 11243, 6601, -5491, -5482, -1356, -7115, -8969, -7444, -5582, -7392, -8394, -11161, -8124, -14185, -20576, -18944, -14379, -11980, -11842, -11147, -10804, -9779, -5705, -7759, -5784, -4340, 3211, 6407, 11841, 9654, 9562, 518, -513, -2778, -3453, 661, -707, -3330, -3477, -574, -1624, -5982, -2556, 425, -4665, -8276, -12537, -10715, -8460, -2767, 726, 833, -1281, 336, 8158, -59, 2743, 3334, -6005, -13798, -19962, -21398, -17489, -12316, -9441, -12145, -9011, -13747, -14886, -11593, -10473, -6598, -2153, -2512, -2373, -3997, -9321, -8185]
6251h185P97j718J285L888N8j453n823o898J859n55M964L406P414L94l708J556
6235b719O10m411o505j641L980Q727m702o142K013P444j157k754J691K18K615
6220b733M762j963J267m373J325l687O452M943n20p450k646M242O910j412L513
6205H630p35n678j415n026J352J324j89L047K811p012m217L202N27J193R06M602
6189C322M96r747o902J080k779N698l061r8j599N2Q747L851L672O848p079o876
6173d375k440N822l083J259q09J381L873m337k428L46k212K700k676J91L846m715
6157g657J990K304K85n514N18j939O125j105L795L923l677m953m79n93J117o17
6141f477M061k013L290Q251K076m015j0144K343J056P335L266N59m346j0607q220
$$ y = [-8185, -7388, -9106, -7821, -3933, -3875, -5328, -11151, -18049, -16190, -16745, -11781, -8375, -961, -567, -4275, -2719, -2109, -6520, -13025, -14666, -10686, -1959, -6661, -12803, -10790, -3346, -4503, -7257, -5566, -5348, -2733, 2029, 66, 1333, -3040, -1715, -5402, 1050, 5993, 5473, -1977, -4623, -381, 6529, 5117, 8630, 7895, 2217, 802, -4224, -2872, -1548, -1737, 1310, 4121, -2891, -7108, -3906, -3379, -2186, -1280, 3322, 3818, -5929, -12831, -11751, -14530, -8832, -11893, -11991, -13590, -13538, -4791, -940, 2732, 9580, 2501, -4375, -6815, -993, -4076, -2817, -3626, -2245, 1628, -2709, -5137, -4791, -7003, -4303, -6979, -6788, -2942, -7657, -5667, -3363, -3078, -8592, -8074, -10013, -3888, -4993, -1198, 2725, -952, -5905, -6384, -6977, -5860, -6477, -2416, -4429, -1139, 7112, 9188, 5173, -4971, -2628, -1572, 5763, 9029, 9588, 5242, -5365, -13585]
6126a3585q231l827P885J1704O472O3k849m492j349J343j640M369k650p207n274
6111a9268K337O277P70N495N244J80j436m020J619k576m212L835O243j86Q57K629
6095C788q037l628J431K636J464J340P07J20K576N62m47l575Q583K670j755j693
6079F742o73l386q419P73n50m443p232Q242L475J082J446L622j720O282k561m424
6063a744q5K949L720o958q257J961N197N20L1n223P636M076J74J178l558O76K554
6046D847p235j007J095l818P57M034M064j0011l798j73K196L100j172P72K119
6031d230j833p531L654m516j727J0971L556l37R957j51p065l995O898M477o221
6016A907k617Q449j526j73l354p08k519k173k231Q85O672K276p901l749j480N160
$$ y = [-13585, -21816, -25643, -17758, -6054, 418, 481, -2368, -6860, -8209, -6866, -8506, -4137, -6787, -13994, -19268, -16931, -10654, -9884, -4389, 855, 1035, -401, -4421, -2802, -5378, -9590, -5755, 488, 302, 1159, 3788, -4249, -7877, -6446, -3810, -2346, -1006, -299, -179, 2397, 2959, 2512, -1063, 7520, 10190, 8435, 6742, 6069, 2683, -5736, -4963, -5513, -9956, -17188, -8946, -5471, -4389, -2943, 679, -1041, 5241, 2680, -1744, -1829, 1120, 4840, -2118, -10375, -8414, -3217, -2697, -2666, -7889, -253, 3823, 3997, 5175, 1617, 2293, 4847, -2388, -3395, -2300, -6118, -5361, -1327, 2737, -7274, -11072, -11245, -9049, -5949, -7121, -6349, -4230, -6063, -13594, -9940, -14456, -16183, -5212, -1656, -1993, 7964, 7813, 748, -3247, 3651, 8128, 1907, -710, 7739, 6213, 6040, 2686, 1978, -541, -2714, -4945, -4060, 2612, 4888, -3013, -6762, -8242, -3082]
6000c082P204L899O76K716k384O59l219j413J196k851j859R273o7n576l137l808
5984a773m568j525M186K838M923n600K880O910m076o846m499M544l68k932n81
5969f487K952P059k98m008m214j649M707K037j4326P98Q978N759k104l079M102
5954B27k80l332M32L026L046q635o2J764n20M573L736m679k952o166n89R70K007
5937g434j269P61n262o124k542Q793r58M971N264N83N786p83j756m189n981j986
5921a2126M398Q248K67j341k047K845L943n38K729j264j1853l645o91J05L256
5906g714M946K459L128j032m188P41M346J334n939P40K915j837K737K372J367
5891F375o071m13o057n634L429K618p281l775N297L837r25J914j595k875M254
$$ y = [-3082, 4122, 8021, 8697, 11413, 9029, 9688, 6469, 5056, 6252, 3401, 1542, 10815, 10748, 5172, 2035, -1773, -6341, -7866, -3680, -842, 4081, -1519, 1361, 8271, 4195, -2651, -7150, -2606, -2974, -5906, -6487, -3535, 3524, 3226, -782, -4996, -6645, -1938, 99, -14227, -13429, -4451, 1308, -796, -3875, 227, -53, -3385, -2953, 73, 3119, -5516, -5578, -3814, -4334, 239, 3975, -704, -3656, -9822, -10411, -9441, -7434, -8703, -7942, -13204, -19328, -21870, -13077, -14035, -9064, -3800, -3217, 2569, 1786, 30, -4159, -10140, -12126, -7728, 520, 787, -554, -2601, 244, 4187, 3649, 6378, 5114, -6739, -10384, -11075, -10970, -7714, -2768, -309, 2819, 1787, -2401, -1660, 2686, 4020, -1919, -1179, 1736, -101, 2636, 5008, 6375, 304, -109, -6166, -11800, -8371, -5753, -13034, -16809, -11512, -7675, -8600, -6686, -8281, -11156, -6902]
5876f902o095l523J36K965R13L861M231P33K127m704J270J437J423k6k151O154
5860A849K538q880k575o110N093N626M775j141l5L884L0k969J555L366l941j629
5844A436L571m658J818J893J282m790n564o660k748N748J971J804L326l241J842
5829b970Q775L153j2646J062N23M552L844M041m577l078j964J182M556o114j055
5814g16k516k240K487L910L696j106l402K75M686N773J819l792l971m663J960
5799B200j786o037L018L127k304l251l920k145m568J861Q960J564l086K362k371
5784f376j724L800M982p79l557r55K017J077l535l97m234k006M506K131j718O90
5768f078K472K263N656o070k91n635n754N924M368l969l786l082p3Q109L637J181
$$ y = [-6902, -12997, -16520, -16384, -13419, -12506, -8645, -4414, -3681, -1554, -6258, -4988, -3551, -2128, -2154, -4305, 1849, 4387, -4493, -7068, -13178, -8085, -2459, 2316, 1175, 1140, 5024, 5054, 2085, 3640, 7006, 3065, 1436, 5007, 349, 2167, 4060, 5342, 552, -5012, -11672, -14420, -8672, -6701, -4897, -1571, -4812, -2970, 5805, 8958, -3688, -2626, -2103, 2449, 6293, 10334, 5757, 2679, 715, 1897, 6453, 339, -716, -3232, -5472, -2985, 925, 4621, 3515, 113, 388, 5074, 10847, 12666, 8874, 4903, 240, 2200, 414, -5623, -2605, 522, -1782, -5033, -8953, -11098, -15666, -13805, -4845, -3281, -6367, -4005, -6376, -8100, -4300, 682, -97, -3654, -4609, -2592, -1515, -5050, -5447, -9681, -11687, -7181, -5050, -6768, -6078, -3606, -1343, 4313, -1757, -2048, -7683, -13437, -7513, -3145, -7114, -10900, -13982, -14055, -5946, -2309, -1128]
5752a128j1l373q077j8K749O140L268L139O98m115O169K994j012p487p090J903
5736e251K64l026m090l028O571J1829k839l355M877M31n510j959J001N838l428
5721a675l064J370K20n379j449L663J664m794r02j594M701J987j499P173j764
5706a342k058L119j704L384K072J864m206q635j641M905N087O201k185k440j960
5691D61j381K408K091J127j361m385n373O137J714o554p759L105P864O04n866
5676g168k48K56L013L042O38L4j493M557J606M544k488Q2n142j369l527P92o51
5659c522o591J657q99k679j595n288R38P236P019j356l701N035Q214K156N796
5644A2420J904k053j003p147J856K74m685j197M076O250j223m676p998n020L497
$$ y = [-1128, -1139, -4512, -12589, -12607, -9858, -3718, -450, 2689, 3387, -728, 5441, 8435, 7423, -64, -7154, -5251, -4987, -8013, -12103, -15131, -8560, 3269, 430, -2925, 1952, 2383, -3127, -5086, -4085, 1753, -1675, -4739, -3369, -3149, -8528, -9977, -6314, -4650, -9444, -10346, -11940, -7239, -5252, -6751, 422, -1342, -3400, -281, -1985, 1399, 3471, 5335, 1129, -7506, -9147, -4242, 845, 7046, 4861, 2421, 461, -920, 1488, 3579, 4706, 3345, -1040, -6413, -276, 1438, -5116, -12875, -9770, -1906, -1302, -7168, -7416, -7160, -4147, -1105, -467, -433, -1926, 2631, 4237, 8781, 6293, 6375, 1233, -136, -3663, -2871, -3522, -10113, -8456, -9355, -12034, -13629, -18917, -17979, -10743, -3724, -5080, -8781, -3746, 4468, 6624, 12420, 14324, 12271, 11268, 4121, 5977, 6251, 1566, 369, 4445, 10695, 9472, 4796, -3202, -8222, -4725]
5629d725j278m50M438K461J932k329n219K195k262K269j237J056l83o055J068
5614h519L243R603K004j0841m72k001J252N300M09K300p799k915M72P647R17K145
5598B745M205m982l046N599L614m732p432j700K714P514Q302j42n337p244n46
5583d68M271J067m085K219M300k22l120L851m806p789j070l337M208K126J773
5568a082K64j722l133K636L697P51n502m081J977N351r64L602P567q84j477l544
5552C456r30k514N851M896n117m716L689L034K99J640n86j309k447o94j542L857
5536F867l599r537r590k40J531O265N023K500r416m69M511q59l614l792M07P167
5520f845K361M848N57j761m804l580L888M317L611J002j566J54m356M15j157p461
$$ y = [-4725, -6003, -6453, -2015, 446, 2378, 49, -5170, -2975, -5237, -2968, -4205, -3149, -3532, -9587, -8519, -5276, 4327, 6331, -4510, -4982, -6983, -5731, -431, -22, 2278, -5521, -8436, -7964, -317, 600, 2745, 6950, 1968, -1078, 4521, 8135, 3403, -4029, -5729, -3015, 4499, 12801, 12659, 7322, 78, -468, 3803, 4870, 785, 3004, 7304, 7082, 3962, 7813, 3007, -4782, -5852, -9189, -4981, -2855, -1082, -818, -2540, -5673, -3037, 660, 1411, -4091, -8172, -6195, -844, -1808, 1794, 9361, 8477, 7000, 3456, 2526, 12, 5863, 10759, 5642, 926, 4615, 7649, 7948, 9588, 9002, 7693, 5246, 4552, 3010, 6867, 3268, -6269, -15859, -16099, -14568, -8303, -3280, -780, -10196, -10665, -6154, -7013, -10627, -14419, -14012, -6845, -4484, 364, 921, -840, -5644, -9224, -5336, -1019, 2592, 3594, 2028, 2182, -2174, -1759, -2916, -10377]
5504a0377Q135j59o161L500j775P94K242j949L556J0065M637l804r474j524P25
5489a569n33k704l251k876m27R957O186K113p723q13q53k714R90l141J364M337
5473a657K306k058k257j367K475L09q340j091J0660L037O465o391K301N48K100
5458G040o692j820K005M358k0r174k734j914J712N031P37q667k368M163M706J279
5442b358N147k359j5J806L093l534k744J824K589J16q10N568L661n134j317l687
5426A846m308l798J945k018L180L225o024J01J333n641l248O854P073K248k706
5411F2R49m775o294j672M361K159m773K418J1617Q880k016m830k985k435q70K909
5395B705J0024P393l100n568r154l439L201K865m313j0783j539O12J580J0097
$$ y = [-10377, -2242, -2401, -8562, -5062, -6837, -6043, -3801, -5750, -2194, 7871, 12508, 8704, -770, -2294, -1569, -2102, -4806, -8057, -10933, -11360, -1403, 4783, 6896, -827, -1640, -2493, -5207, -4217, -7358, -5994, -1657, 649, -1409, -3666, -5033, -2558, -2249, -10589, -11680, -1020, 2017, 8482, 2091, 4392, 4940, 7040, 348, -1472, 533, 4891, 4871, -4303, -7037, -8951, -7239, -2208, -1471, -10138, -12506, -8343, -3637, -2358, 2789, 430, 415, 2221, 5314, 1780, -964, 860, 3449, 3565, 2755, 8323, 11984, 6850, 5533, 1846, -2462, -6260, -4315, -6333, -3153, 72, -5952, -5851, -4518, -10159, -13407, -6553, 520, 2768, 62, 1011, -3764, -10058, -11730, -7369, -5210, -9983, -7565, 4052, 12932, 10916, 6086, 3101, 666, -204, 2705, 12729, 20122, 17022, 11454, 2300, -1139, 2062, 4927, 614, -10169, -11708, -11096, -9516, 581]
5381E81M923l311l105J248K679k184O238L568r343j86N479J76J019L279p250l580
5365B31m820n519j58J468O161N438Q1L826J964r266m354k234N003L316k462m171
5349e496k68K088j560l006K572N688J257j0318r68J266m341K519J0214K581m925
5334b697n740J330n49J281R92m1q26Q365j929o534k304L850L711j553q704l77
5318a1725N538N257m51k458K213P739j346p048L301j79J015Q5J573J009j771k493
5302B59l377J173J079Q388P24l273r736r268K781O406j52J672L793N540k884m95
5286B630m936j912O037M428l647k843k051l612L802J090n833l068l437O57K327
5271a0368J863M899L429n720k816O989K024o64j29l147M109j844q9L393N706l459
$$ y = [581, 5504, 2193, -912, 336, 3015, 831, 7069, 10637, 1294, 1108, 6587, 6763, 7782, 11061, 3811, 231, -4589, -10108, -10266, -8798, -2637, 2801, 2882, 6708, 8672, -594, -4948, -7182, -2179, 1137, -1325, -5496, -5764, -3676, -5236, -8242, -5670, 18, 1275, -9043, -10011, -8745, -13086, -10567, -353, 2228, -2697, -8437, -7107, -7656, -6375, -5383, -5424, -6250, 2115, 186, -6348, -8652, -4802, -1091, -2644, -11348, -11725, -6187, -930, -1381, -3839, -1626, 6113, 4767, -2281, 1020, 841, 1856, 1941, 3514, 4523, 2752, 259, -3118, -1945, -866, 7522, 8246, 4973, -4763, -14031, -11250, -4844, -4996, -3324, 469, 6009, 3125, 2630, -2306, -4218, 1819, 6247, 2600, -243, -2294, -5906, -2104, -1014, -6847, -9915, -13352, -12695, -10368, -8505, -3606, -177, -5897, -8713, -1724, 300, -364, -493, -3640, 469, -1375, -1464, 1929, 7635, 4176]
5255D176j1974L540L347J559L830n941J222L525K148j40l299m688j747j066L410
5240b098O257j169j064K26k042j884l83J764l810L411P083k138K126o63k239k003
5224A374n023q60k32o5L470k950n860J296K427O979N855J25k211l116N848J368
5208H425o323j743N54l408r980n523N907N453j314p199j282J003J089N813M427
5193d101l196l252K40N391M506o565j0593m454N230O684P278k730J748N317o78
5178H25J825l823k053j531L459P975J977m014j918k147J116l511k277K806M617
5163C326n579l10R808j829n385p947l526L519K855n355j314M817O091N702j090
5148C783p447L522R260k136p874q688j589M062J363M619K053m044J124J862j403
$$ y = [4176, -7798, -4258, -911, 648, 4478, -1463, -241, 3284, 5432, 5292, 1993, -2695, -4442, -5508, -2098, 4159, 2990, 1926, 2152, 110, -1774, -2157, -393, -4203, -792, 6291, 4153, 6279, 5616, 3377, 1374, -3649, -4509, -4741, -4806, -1336, -4286, -10146, -8850, -6423, 556, 6411, 6536, 4325, 1209, 7057, 8425, 2102, 359, 913, -2495, -12475, -17998, -12091, -6638, -7952, -15151, -16433, -15430, -14341, -8528, -4101, -7297, -10549, -10309, -4918, -412, -6977, -17570, -22024, -16794, -10110, -2832, -5562, -3814, 1503, 825, 2650, -1173, -3226, -4757, -1298, 6677, 8654, 4640, 2722, 575, 1691, -1820, -4097, -1291, 3326, -2253, -2563, 7245, 5416, 31, -7916, -11442, -7923, -5068, -10423, -11737, -6920, -829, 4873, 3783, -3664, -142, 9118, 6982, -892, -9580, -11169, -7107, -5744, -1125, 928, -3116, -1992, -130, -1533]
5133a533q90K927k033l485J013K89j747M946r47p66k525k061J466J814L451k575
5117b656n771m030J640M864m21K493m575p81M29n80L421M672l255j109N618J949
5101A908k96p76N21o214r71M034K235K98n357o73Q81J2541l602j1370n101K707
5085i235M733J622l9m453K975N261j744K12N429N22m015o925k418p74l2j602o499
5068a6982K707L412J3322M667n480k570q32l302M132j328k01O276K653o22k323
5053C529l072l341J442M479l225o425K816j66L102J451j021k135N58M370J755
5038D117L79m330l601j789K088k149k295j344L073j076J480O987n81J542o067
5023c566J574J689N945p62p186l760L033l883j689N362j61L466n78l493p244o39
$$ y = [-1533, -2423, 504, -1529, -5014, -4001, -3712, -5459, -513, -1460, -2226, -4751, -6812, -5346, -3532, -81, -2656, -8427, -12457, -10817, -5953, -6374, -3881, -8456, -9237, -8808, -9388, -5967, -1295, -4550, -5659, -41, 1908, 1612, 836, 1357, -4857, -5828, -1794, 441, 739, -4618, -5291, -4410, 8131, 4529, -6841, -11942, -9235, -4502, -2880, -2919, -7372, -4397, 864, -880, -668, 4761, 5283, 1268, -5657, -8075, -8849, -8881, -10483, -16982, -14275, -10863, 2459, 7126, 1646, -924, -1756, -5058, -926, -2254, -2455, 3821, 6474, 5852, 3529, 457, -2884, -1442, 3037, -188, -6613, -3797, -3963, -861, 590, -431, -2566, -2008, 2362, 4117, 4496, 166, -3435, -5224, -3136, -5285, -7580, -8924, -5851, -6927, -5447, 1540, 959, 2501, -3566, -1992, -303, 5642, 4880, -2306, -6066, -3033, -6916, -8605, -3243, -3404, 62, -516, -4009, -11253, -11892]
5007a1892M576M936N539o372r60L337L236n002J425K180K497N259k09L358j617
4992A0291l800m003o445N507n470J011o75n751l420J1526N713q597n041P085M890
4977B821k206J56n53R77J271j796q11L985N228l288n365P41L541n120m214l332
4961g965K982M837L977M490L697p820k935K020l169R66p83m964j0080k694M486
4946a2955k862Q84L344L326N01n659J890P413K62L163J486l916P25K81k377m569
4930i063j1059L500q50Q91L979Q739P093J002r398K776O678N832j696p115m388
4915c079k292r32J059J569j527k695l443k340N39L729Q904K383O448J007q533
4900G97J748k324n755L589N810L962o153q772K240R843Q32n336j052K172M429
$$ y = [-11892, -7316, -2380, 3159, -3213, -4173, -836, 2400, -2602, -1177, 1003, 3500, 8759, 8550, 11908, 10291, 6491, 2488, -3957, 1550, -3920, -2909, -3584, -9335, -12755, -1229, 4484, -4113, -9154, -2069, 2821, 615, 771, 218, 1195, 2466, 670, -141, 3844, 9072, 5784, 419, 1160, 4701, -419, -4633, -7965, -4983, -146, 3831, 8321, 12018, 4198, 1263, 3283, 114, 1080, 297, -4667, -14747, -17441, -12955, -15817, -14933, -11589, -8263, -7762, -13421, -11531, -4118, -3856, -693, 793, -3123, -2398, -2117, -4494, -9063, -20122, -16622, -17472, -16581, -12602, -3863, 3230, 4232, -5166, -2390, 4288, 10120, 8424, 1309, -3079, -5371, -6303, -5244, -3675, -5202, -7897, -11340, -13680, -13141, -9412, -508, 1875, 8323, 9330, 797, 2545, 221, -5534, -1945, 3865, 7827, 1674, -7098, -4858, 4985, 5817, 481, -571, 1601, 6030]
4885F030k623j051L169l16J163j735k770k553Q95j714m875l084J304m27p68j934
4869a1289L792R81M494k414M89O95j745K57l041R1K95J377k611P424P108j58l264
4852B481K01o103p324r05O019M602K840j101n306k439J79j033m923k535J536P381
4836f430J404l925j172L762j356N269M96o608m531j916M889L106Q29m23J999P34
4820c873j547M972M03L786m831J102J970K395Q20P07k822j596K209P01P09O423
4804A1528J104j691l411n477R63N011O71k216k539L546K382k831o687n357J482
4789c522L26k209M812M5J070k396N231M12O067l989l495K902K49k057j516j306
4773F24m714q09L448K247O861N044K464m05m30n631q231Q41K583K115o28k321
$$ y = [6030, 3407, 2356, 5525, 5209, 6372, 4637, 1867, -686, 209, -1505, -6380, -9464, -8160, -8587, -9355, -11289, -7497, -6516, -2022, -4436, -3947, -3252, -4997, -4740, -7781, -7690, -7395, -6018, -8629, -1205, 5903, 5745, 2481, 2682, -3421, -10745, -11650, -5631, -1029, 1811, 710, -4596, -7035, -6856, -7889, -12812, -15347, -13811, -6430, -5026, -8951, -10123, -6361, -7717, -2448, -1952, -8560, -13091, -15007, -10118, -7012, -6183, -6606, -4607, -3873, -5420, -448, -45, 3741, -1090, 12, 1982, 4377, 5197, 5904, 3082, 1486, 3695, 4396, 5105, 11528, 12632, 10941, 7530, 2053, 3016, 8027, 8698, 6482, 3943, 7489, 9871, 7040, 353, -5004, -3522, -3196, -5405, -593, -548, 522, -1874, 3357, 3769, 9836, 5847, 2352, 5254, 5503, 3446, 1930, 624, -4090, -4899, -1451, 796, 7657, 12701, 15165, 14760, 14330, 8699, 468, 1309, 3892, 6007, 5379, 3058]
4757C058k32o283j67L628N75o094J276M170J200l141O374J815O58n239n434L637
4741a99J122j134j379J054O390q36j765n673K176P239l939m095M676n853k483
4726d699L075j358m52L339O201j480N5P36l652j188J416j403j0225l962k060o416
4710b2073M005L247P006L498p752J622O310J016j797k646o669l376L991R359P455
4695C196L149m74k679K405L50l025n910j688n32L058L670M363j189j0080J136
4680d250k63R60J252n207j658J233j260J012P942L634n417m032J090M455k96k970
4664c775j744K51j391p78j366J863r84M56Q01m685K89Q997M33j344k95j998j927
4647g197O45Q42j356J331K367m74J416m922k762K841k6M416M986M057N669o023
$$ y = [3058, 2826, -3457, -3624, 4, 579, -5515, -4239, -69, 1131, -2010, 4364, 6179, 6837, 1598, -3836, -199, 923, -211, -1590, -536, 5854, 5018, 3253, -2420, -244, 6995, 3056, -1039, 3637, -2216, -4699, -1624, -2982, -3434, -95, 6106, 4626, 4681, 5417, 1765, 577, 1993, 590, -9635, -13597, -15657, -22073, -18068, -14821, -7815, -4317, -12069, -10447, -4137, -3121, -4918, -7564, -14233, -17609, -13618, -4259, 3196, 6345, 5871, 3192, 5597, 5947, 2922, -2988, -4676, -5208, -2150, 1520, 5883, 4694, -5386, -4250, -4513, -3553, -2301, -7508, -9166, -7933, -9193, -8181, -239, 3395, -2022, -6054, -4964, -509, -805, -3775, -5519, -5268, -6659, -7437, -8803, -6940, -7924, -7468, -6667, -11352, -11063, -2066, -1633, -2977, -3272, -5270, -7197, -6552, -5710, -7066, -5735, -3368, -3842, -2426, -7348, -10110, -7269, -7295, -2879, 2107, 6164, 11833, 5810]
4631E810l504j506l367p988j542K134J0224L499m943j517K354K736n137m892n432
4616a3071K015M866J083k931K258O598K778m489k102N298K376K270q355q545L928
4601f023M271R193k346n676L449Q411K088j0367o56N015M443n731j1711J111N949
4586A420M103K049l326K457j9m275L712L066l215l280M053n391n942k150K228
4571d510J783j086L388J003K475M302l001m057m939l709n255P289O300N684O824
4556A2491l150K686J619l095K42l616l795L545l471p845l188o40O508J406J335
4541A032o84j498L073R74j775m644m163n496J279J1518K358j492L143L185M271
4526A1081l786j112l636q8J025j545q488j4L612M715K576j0377l755M0J895Q91
$$ y = [5810, 2306, 800, -2567, -10555, -12097, -9963, 261, 3760, -1183, -2700, -346, 2390, -2747, -7639, -13071, -11056, -6190, -5107, -8038, -5780, 818, 3596, -893, -2995, 2303, 4679, 6949, -1406, -9951, -6023, -1752, 7441, 5095, -581, 2868, 11279, 13367, 3000, 2344, 7359, 11802, 6071, -5640, -4529, 1420, 5523, 7572, 4246, 6703, 6684, 2409, 6121, 9187, 5972, 2692, 6745, 1354, -4588, -6738, -4510, -2727, -3813, -425, 578, 3053, 7355, 4354, 297, -4642, -8351, -13606, -6317, -17, 5667, 12491, 9341, 12027, 13646, 10551, 10793, 7177, 3382, 6927, 3456, -4389, -7577, -8217, -1709, -303, 1032, 348, -1150, 1923, 2897, 1122, -3522, -7685, -13181, -11902, -384, 1974, 482, 3625, 6810, 11081, 7295, 6183, 2547, 2459, 3484, 1939, -6549, -6563, -2951, 1764, 4340, -6037, -9792, -9752, -7857, -6966]
4510f966J174K497M704k89Q30K33m756K212K182O33P0Q2J05q847M10J319n052
4493i459o718Q41J1125O820M576J122l838n755r11P583L324p932j557N761K963
4478G945n223k191J007N742J954L576Q53m084n972k782r76k053q22J079N579j950
4462A682j478O76K002r39J368pl156p464J82O682j92l464k969N693J772n796j634
4445g042K146K740L86M312q97m393m397l856Q712R674M929K42p100j1806q950
4430a5300J650L510O170M184M82N08M551j594k610O218Q33q391P65N768L192m184
4414E752o880j337J582j246k610m027k46J27k839J010N629O281J141O09k01j612
4398A133n434j577l138k907N61Q752N027m860l679j800K535R496q832j1600q40
$$ y = [-6966, -5792, -3295, 1409, 1120, 1950, 2183, -2573, -361, 1821, 2454, 2524, 2606, 2711, -6136, -5726, -4407, -9459, -16177, -15336, -4211, 2609, 7185, 8307, 4469, -1286, -2197, 5386, 8710, 778, -779, 4982, 7945, 2722, 531, 1538, 7280, 9234, 12810, 13663, 9579, 3607, 825, -151, -2204, -3026, -1947, 3632, 1682, 204, 880, 2882, 1943, 3311, 3304, 148, -7316, -7134, -452, -644, -4108, -7077, -1384, 388, -5408, -7042, -4896, -2156, -1770, 2542, 1645, -2748, -7145, -11001, -2289, 7385, 12314, 12556, 5456, -6350, -15300, -13650, -10140, -3970, 214, 696, 1204, 5755, 4161, 1551, 7769, 8602, 211, 976, 6744, 9936, 5752, -1128, -2465, -883, -2129, -4739, -8766, -9012, -8885, -11724, -10714, -5085, 1196, 2337, 2946, 2745, 1133, -4301, -5878, -9016, -11923, -11362, -2610, 2417, -2443, -6122, -7922, -5387, 4109, -4723, -16323, -17163]
4383a7163M889Q015K911k032N045J477M766J603o248J376k132l371j526N968l362
4368B16o780j673N94k76m092K343O472O053L691m694o99k781J0421K945k869m922
4352C949l732mL432j004l585K907O60m713r49q32n854K333Q387n41L337n681l200
4335e090O196N89l650K988L749o355J452l512J271L086M774J369K481j458l787
4320D103R66J318p149k995K127N400J951k278N165L866j464l137m806l250J954
4305A771q417m943L216M92k150L235K441L45K717j12j515J700k368J898l183J439
4289c434L095p53Q35L610j029j144P446j561o273q469K436M648K409M617k176
4274D257j359r205M4O926j88q644K105L378l87k95N19N122L640r34k502l400J23
$$ y = [-17163, -12274, -4259, -1348, -3380, 1665, 3142, 7908, 9511, 3263, 4639, 2507, -864, -2390, 3578, 216, -6564, -8237, -7643, -7919, -12011, -9668, -3196, 2857, 6548, 1854, 1155, -1626, 8795, 11740, 8871, 3949, 217, 213, 3645, 2641, -944, 1963, 2623, -2090, -3039, -3871, -9725, -7392, 995, 454, 3791, -1890, -5090, 1106, 1695, -1955, 1033, 4782, -1573, -121, -3633, -2362, 724, 5498, 6867, 9348, 7890, 4103, 5069, 6387, -762, -3757, -1630, 3770, 5721, 3443, 8608, 12474, 11010, 7873, 3067, -183, 1771, -6646, -11589, -8373, -7881, -10031, -6796, -4355, -4010, -1293, -1405, -2920, -1220, -3588, -1690, -4873, -3434, -339, -1092, -257, 3353, 2324, 1180, 8626, 7065, 792, -7677, -5241, -593, 1816, 6433, 4257, 2898, -6307, -6263, 663, 475, -8169, -6064, -2686, -3073, -3368, -2849, 2273, 5913, 4979, 2477, -923, -800]
4257h00q379l222M479J287P632K436o142P45p63m693k906L128P939M424J630j634
4241E161j4397M140J105P31L757N862L994l787j688k777j010k535o922o9P305
4226a130L154k377r374L49M426L950j672l4J717j460P46O006L763m878R487N246
4210A7919n306j431o258m060j283L475l811k30k801j416K446J966l876M244j311
4195a733q107O188L196l5o451J796J768k953l796n238K716J386M072K728j102
4180e565n02L873K667k321O138J315j048k166r46J492k884j1052J91J0387L958
4165C537j4k322M575L383M74n281k471r11J52n358n70K105M560P00n21j464L893
4148D467m055r523O571J0479l815n661K139k672J768P16j0133n457j348N813R910
$$ y = [-800, -9179, -12401, -7922, -6635, 997, 3433, -2709, -1964, -2727, -7420, -10326, -7198, 741, 5165, 6795, 5161, -9236, -5096, -3991, -3260, 497, 6359, 10353, 6566, 4878, 2101, 1091, -1444, -8366, -8435, -1130, 2024, -353, -9727, -9378, -4952, -1002, -2674, -2708, -991, -2451, -1705, 4301, 8064, 3186, 12673, 17919, 12613, 11182, 4924, 864, -419, 3056, -755, -985, -3786, -5202, -2756, -790, -4666, -422, -1733, -9840, -3652, -456, -491, -6942, -5146, -3378, -6331, -10127, -15365, -12649, -11263, -7191, -4463, -5565, -6067, -2194, 473, -1848, 4290, 5605, 4557, 2391, 1445, 2937, 53, -10999, -10808, -421, 3537, 3523, 1201, 5776, 9159, 9633, 4352, 1881, 970, 1122, -4236, -4806, -2701, 1859, 2559, 2038, 574, 4467, 412, -9111, -2540, 7939, 4124, -1537, 602, -2070, -302, 414, -9719, -15176, -16524, -10711, -801]
4133h01M88l532j728n98N244L446j415l179L066M98M200O117j128o72j016k753
4117F237K665j932o821l9N620L002N291l973j2423l263M85L052K825N92Q14O65
4101B797Q63J174m46Q53n555l554n290N495j868M297q09n857J871M416j29J292
4085d50N621K442l057m216k61j440K440K905r6r194j953O224R509n62J806K035
4069A1753j175o478o836K980l372l961L065K003K803k002j050n26j761j025J65
4054e417l450N868O022m112N055L539k090l470p896J315P326L981l156m80j146
4039A889l883m437l168J389j285L232N585M461N53k134J692p69J382q245k039
4024e777M80M908M488r41n029o028p80k1O434j990j0882J071J0809J447j61K116
$$ y = [-801, -313, -3845, -5573, -6171, -927, 2519, 1104, -2075, 991, 1489, 5689, 11806, 10678, 10006, 8990, 6237, 8902, 6970, 149, 110, 5730, 8732, 14023, 10050, -2373, -5636, -5151, -2099, 726, 1318, 2132, 2797, 3660, 4834, 4388, 5241, -314, -3868, -9158, -3663, -5531, -1234, -2043, -7900, -6029, -1613, -1742, -450, 5171, 7613, 4556, 340, 79, -1361, 1079, 3984, 3888, -5306, -7259, -1035, 8474, 7912, 9718, 11753, 10578, 4100, -2736, 244, -3128, -7089, -4024, -2021, 782, -1220, -2270, -2796, -4557, -5582, -5417, -8867, -2999, 3023, -1089, 3966, 7505, 5415, 1945, -5951, -4636, 2690, 6671, 3515, 3035, 1889, -1994, -6431, -9599, -8210, -9495, -6263, -678, 3783, 4336, 2202, 3894, 3125, 4507, -3738, -5777, -5297, -389, 4099, 3158, -1871, -7899, -8679, -8700, -2266, -4256, -15138, -14067, -3258, -1811, -1972, 144]
4008A44k901k467l942j968o484M418P219J478k471M887P649P69m078o908L734
3993i21k081j694L246O999K169o028o69J699k392m263M93l74k070l2P68k478J841
3976e787P978K710N69J005N770p8r798j4893l629P433K428K259K293k369r181
3961a3290k86P447N945L084k207N574J584n744q786n068N480J4647k667N23J451
3946G687p780l761j94K791l122n108O014J0140n11r513n519m660J0964K889n485
3931e168k733J043K557L78r30J470J32J116k27J855P775O493l8o42n749j076r04
3914E352j65O44l94k761k310N85l635k500n847O95N045N830J0893J604o708j998
3898D330k940j818K037n87n44j949K468M66l715m00M172k249k306o750N28l072
$$ y = [144, -2757, -5224, -9166, -11134, -17618, -13200, -5981, -4503, -6974, -2087, 5562, 6331, 2253, -4655, -921, -3002, -4696, -1450, 5549, 7718, 1690, 1021, 2720, 328, -3935, -3442, -3816, -5886, -5918, -5150, -7628, -5787, 2191, 4901, 5470, 6475, 12245, 12167, 2369, -12524, -16153, -8720, -6292, -4033, -1740, -4109, -13290, -13576, -6129, -184, 2900, 693, 6267, 7851, 2107, -6679, -11747, -6267, 8380, 5713, 6236, 7687, -93, -3854, -4048, -1257, -4379, -9487, -3473, 6667, 6156, -3357, -8876, -13536, -2572, 317, -5168, -7901, -6858, -4301, -3923, -4853, -3383, -3251, -2135, -2362, -507, 7268, 13761, 13723, 13081, 7332, 6256, 5352, 5187, 5831, 5437, 2676, 366, 951, -2684, -5184, -11031, -10336, -5291, 539, 11432, 13036, 6328, 4330, 1390, -428, 1609, 1022, 478, -1471, 997, 1463, -2252, -2652, 1520, -729, -3035, -9785, -9257, -12329]
3882a2329l081L062M374J158m48N919K030m71l648O302M907j797K462P478o81
3867A5237K430q46o745K48k050o090o54j796j067r99k719M577N551j605j872r21
3851F79N406n43l864n722p4l101N622R439k970o165Q6O155r659j133q19k993N660
3834c996P317K425N004O511m834l234j879l708k918l789P76j375o90Q658K081
3819F349j502J754K902n269m448K773N322J333q263m794N441O182l436k940K405
3804C809N979l899m616j610q795l151l12N220N267R547K608L909m41j1837n687
3789d009L453m31J787K781J769j633L112R05k585k642p002j998Q326L748m43j71
3773D967q536L541P676k052j346M54m352j938L55q345l881M61O073L020P74k200
$$ y = [-12329, -15410, -12348, -7974, -6816, -7264, -1345, 685, 214, -3434, 2868, 7775, 5978, 8440, 15918, 15237, 17667, 16821, 10076, 10324, 8274, 2184, 1530, -266, -1333, -2332, -5051, -474, 5077, 3472, 1600, 679, 6085, 5542, 1678, -4044, -4118, -7219, -1597, 7842, 4872, -1293, -1207, 4948, -4711, -5844, -6663, -9656, -3996, 3321, 5746, 10750, 17261, 12427, 9193, 7314, 3606, 688, -3101, -2325, -3700, -4390, 4268, 6349, 4847, 6601, 9503, 4234, -214, 2559, 7881, 9214, 951, -3843, 1598, 7780, 4344, 1404, 3809, 9788, 5889, 1273, -337, -9132, -12283, -12595, -7375, -2108, 7439, 10047, 13956, 13515, 1678, -4009, -556, -987, 800, 3581, 5350, 3717, 6829, 7734, 5149, 2507, -4495, -6493, 1833, 5581, 5138, 4967, -3569, -28, 7648, 5596, 4250, 4704, 352, -1586, -1231, -9576, -13457, -12996, -6923, -3903, -3129, -5329]
3757e329J442n531J1824N875o088p191K173l88k523j953j727K315O030K268o21
3742E76r503n183J336O134K116J533M140N009M324k216o475l034m705N94P70O863
3726B279K915j980r430K048m293l717m359N98J4790K762P11k434L61P871J363
3711I485O57K159p24j232j0243j4831j560P13M35N861O381Q44K316M229k595j782
3695A13L621j279K881k187o102j772O30k994M569M52m645M02L546L855J39l567
3679b338r22P604P477k498k112o595J219k551j65K656n03m60j07j455J657n18
3663C89o934o607R20j33L959J3775k6j417K278l007k335M991Q71Jj411l740M69
3646B043j082M631R510l248q120n947K637O236k975n306k865P18K713n72J948
$$ y = [-5329, -3887, -9418, 2406, 8281, 2193, -4998, -2825, -3213, -5736, -7689, -9416, -7101, -1071, 1197, 576, -8927, -14110, -12774, -6640, -4524, -2991, 1149, 6158, 10482, 8266, 1791, -1243, -5948, -5354, -4584, 2279, 5194, 3214, -6216, -4168, -8461, -12178, -16537, -15939, -1149, 1613, 2324, -110, 251, 8122, 9485, 10142, 12301, 11577, 10345, 102, -14729, -16289, -15576, -15141, -9280, -2899, -2055, 261, 4490, 1895, 113, 3734, 2455, 5336, 3149, -2953, -4725, -4095, -7089, -2520, -2068, -6713, -6311, -2765, 1090, 1229, -2338, -3260, 4344, 11821, 9323, 7211, 616, 1835, -716, -881, 1775, 1272, 812, 705, -750, 907, 389, -6545, -13152, -12232, -12365, -8406, 5369, 5343, 3926, 6204, 3197, 862, 5853, 6724, 6725, 5314, 1574, 2043, 961, 5592, 15102, 11854, 3734, -2213, 424, 6660, 3685, -1621, -4486, -3768, -1055, -1627, 321]
3631C21N15L033L890n939L85O336L002k096l639L669k951l271O703k294r20r66
3615E778j746o428m78K538M219R60J131k375l389j528j693J469N96K154J868O1
3599C137k959j349k914L263r092J744J0575M398m655n911m40q9K604K760p62k547
3583b237m289n409K716M628K926o138l172l004j915L487R054L199m43L921M293
3568G617m640n414m73M290k036l561n509q585j816P777O145M898j167L199k67
3553D58l77J209o9r58m627J468P20J068M460l140o292Q20L561l853l833j624N367
3536e642p552q636Q817M772M483L908k558j611P97N090O00m164j709Q31P074k45
3520D255o227J062L461k293Q90J536Q58K720L789l450J790k531k572J377q58Q1
$$ y = [321, 836, 3869, 7759, 1820, 2205, 8541, 11543, 9447, 5808, 9477, 6526, 3255, 9958, 7664, 6744, 5778, 4032, -2396, -2874, -336, 3883, 4843, 5974, 3599, 210, -1318, -3011, -1542, -946, 1208, 3076, 3137, 178, -1171, -4085, -822, -9914, -8170, 2405, 6803, 2148, -3763, -4203, -4292, -1688, 1072, 310, -2237, -6526, -11935, -9219, -4591, -1665, -7803, -10975, -13979, -15894, -12407, -3353, -154, -597, 3324, 7617, 2977, -2437, -2910, 1380, -656, -4217, -9726, -18311, -20127, -12350, -6205, -1307, -2474, 725, 458, 81, 1290, 1221, 263, -4364, -2896, -2176, -1108, 3352, 212, -6080, -5260, -1699, -5552, -9385, -11009, -5642, -13194, -21830, -13013, -8241, -3758, 150, -2408, -4019, -3222, 1868, 2468, -1696, -3405, -2574, 4500, 4255, -1972, -910, 2551, 258, 1148, 2684, 3542, 6262, 10051, 6601, 8391, 5860, 3288, 4665, 3807, 3888]
3504C888k078o254P9L749P266L462n514r384L950Q335M805j04p84r701Q61J854
3488D430l466N275m027l869l16m584m648N137Q569O036N083Ll320j2391p751K799
3472g040K200P209J604n167k89N622n782n224J449k61K754M578N047J376J257
3457I333L188L156n527m691L360N259m089l069m456o085M535J472L043M022K012
3442A1463J840l349Q25l877p422L738j93n574q932l111j685L2M247P183L70l515
3426g960M854L888j069k350M69Q16j395J03Q86P337k755j724k086l752J468q08
3410d078k474k606J245L125M468K115J445l327K105L578J064n150q142K226L157
3395a249n833j249P844k255r27J375M86O155K093o665N34Q726l664l596l651P36
$$ y = [3888, 1810, -4444, -4365, -616, 6650, 10112, 4598, -4786, -836, 7499, 12304, 12200, 11416, 1715, 2576, 4430, 964, 6239, 2212, -1657, -1973, -6557, -11205, -6068, 2501, 8537, 13620, 13623, 10303, -2088, -9839, -7040, -4840, 2369, 3973, -1194, -1483, 4139, -1643, -6867, -5418, -5679, -2925, 1653, 6700, 8076, 9333, 12521, 15677, 10150, 5459, 8819, 14078, 9989, 6920, 2464, -3621, 914, 2386, 5429, 9451, 11463, 13303, 9954, 10779, 6902, -520, 3218, 3025, -2549, -11481, -14592, -16277, -16245, -11998, -4815, -4445, -7960, -3106, 782, -287, -2637, -2168, -1352, -2747, -2644, -1758, 5579, 2824, 1100, -986, -4738, -3270, -4078, -6552, -9158, -7913, -4788, -320, 1795, 3240, -87, 2018, 5596, 6660, 1510, -6632, -4406, -1249, -7082, -8331, -487, -2742, -3669, -2294, -1808, 4347, 6440, -225, 309, 9035, 5371, 1775, -1876, -1140]
3379a140n346K811L911R689l825n983k609o113N931N590Q91L91o145q6L998L554
3363E519k628l518L33L17L798l788j8R94L319J007m127o74j604m797o236O064
3347f039M538L884o20l083j544Q010K840l004n909j90j246K821J040k140K846
3332B204o06N25p486M24M618k997N725m43l985K05L017J341k389K025k058Q4K071
3315B275n342K007M765r27n245K742M03k303q6m995j286J104L791L615N20j520
3299d82L595J811j283O21k909Q38J081L155L190k402n500m084k489o575o531K713
3283a5251O335M733N852n915j1076m188k56L551M562K231Q099l453n601o97N441
3268e633N036K653P244r0p254j515K437m813l729L090n74J029m619n367L684K932
$$ y = [-1140, -6486, -3675, 236, 9925, 6100, 117, -2492, -8605, -2674, 2916, 3807, 4198, -1947, -2033, 1965, 5519, 2891, -627, -294, 23, 3821, 33, 15, 1009, 4328, 5335, 1208, 534, -1070, -5867, -12103, -6039, -1501, 2383, 1763, -1320, -2864, 5146, 7986, 4982, -927, -1117, -2363, 458, 1498, -642, 2204, 1598, 2123, -5363, -4939, -321, -3318, 2407, 1964, -2021, -1816, 1201, 2542, 153, 2178, 120, 204, 2275, -3067, -1060, 3705, 2778, -2467, 275, 678, -1625, -1711, -6706, -7992, -6888, -3097, 518, 1038, -482, 3113, 4924, 3641, 4262, 1353, 2191, 3272, 6427, 9617, 7215, 1715, -2369, -4858, -11433, -17964, -15251, -8916, -4183, 1669, -4246, -15322, -19510, -19766, -16215, -11653, -9422, -1323, -4776, -10377, -11074, -5633, -597, 2056, 9300, 9210, 1956, 441, 2878, -1935, -5664, -2574, -3148, -2119, -6738, -12105, -8421, -5489]
3252e489O47J1467O059n275n704n278K549J3404L901n330q25l050J84K019k131
3237G148M071o02p369J379l0o553m207J787n299k630J2965n91k429j064o680M19
3221i685K313L380L934k317n586k766k538K55L690L358l995M158M896M556M02
3206D055k350j529o521J738K546l839k23K590j417L380R49r60K211M690P340O81
3190A3341m475K310P101j558j074o795M2l156o982k685M015P12j157J840m720
3175c241K8K478K625L78k791R02m97l25o716K89M837J167P242m367l514L665j928
3158B32N841L065n580j0691L137L397k877l478J406O350L078M427J1q737n937
3143f356l053O60J571j019l000Q102N252l624q771K436J723Q08K087N593l36k892
$$ y = [-5489, -4842, 6625, 12684, 7409, 1705, -3573, -1024, 12380, 16281, 10951, 10126, 7076, 7260, 9279, 7148, 11219, 10617, 3248, 4627, 4597, -1956, -6163, -4376, -9675, -12305, 660, 69, -2360, -3424, -10104, -9685, -7372, -3992, -58, -2375, -7961, -10727, -13265, -13010, -9320, -5962, -9957, -5799, -903, 3653, 4055, 1705, 176, -6345, -4607, -2061, -5900, -6123, -3533, -4950, -1570, -621, -1581, 630, 5320, 12660, 13341, 8866, 11176, 18277, 16719, 15645, 8850, 8892, 5736, -1246, -3931, 84, 796, -361, 1479, -3241, -3213, -735, 1890, 2268, -523, 379, -118, -443, -7159, -6870, -2033, -866, 6376, 2009, -1505, 2160, 232, 6073, 9138, 3558, -7133, -3996, -599, -3476, -6954, -5548, 802, 3880, 8307, 8318, -419, -6356, -9409, -8749, -7178, -8197, -11197, -3095, 2157, -1467, -10238, -7802, -6079, -5271, -3184, 2409, 2073, -819]
3127h19m46L62n38j855o0J462O168J482l388J297k676k483R26q468q10J2641J181
3110C976l973l662J609R980J468o599l234M14K895O367L460k710p68O1p849K214
$$ y = [-819, -1265, -903, -1441, -3296, -3356, -1894, 4274, 5756, 2368, 3665, 989, -1494, -568, -9036, -9846, 2795, 3976, 3, -3659, -2050, 7930, 9398, 2799, -435, -21, 2874, 9241, 12701, 9991, 9223, 9284, 1435, 3649]
$$ [...]
##END NTUPLES=NMR SPECTRUM
##END=
