##TITLE=Analysis number 328948
Compound Code cc 68210
Book Reference 546/2
Project Code adrs
Chemist Name craigr
##JCAMPDX= 6.0         $$ Bruker NMR JCAMP-DX V2.0
##DATA TYPE= NMR SPECTRUM
##DATA CLASS= NTUPLES
##ORIGIN= Bruker BioSpin GmbH
##OWNER= nmr
$$ XWIN-NMR		Version 3.5
$$ Wed Jul 18 15:19:57 2007 GMT Daylight Time (UT+1h)  MAYBRIDGE\nmr@NMR_250MHZ
##.OBSERVE FREQUENCY= 250.131544655141
##.OBSERVE NUCLEUS= ^1H
##.ACQUISITION MODE= SIMULTANEOUS (DQD)
##.ACQUISITION SCHEME= undefined
##.AVERAGES= 16
##.DIGITISER RES= 18
##SPECTROMETER/DATA SYSTEM= dpx250
##.PULSE SEQUENCE= zg30
##.SOLVENT NAME= CDCl3
##.SHIFT REFERENCE= (INTERNAL, CDCl3, 0, 16.4488)
##AUDIT TRAIL= $$ (NUMBER, WHEN, WHO, WHERE, WHAT)
$$ ##TITLE= Audit trail, XWIN-NMR		Version 3.5
$$ ##JCAMPDX= 5.01
$$ ##ORIGIN= Bruker BioSpin GmbH
$$ ##OWNER= nmr
$$ C:\u/data/dgb/nmr/ADRS/1180/pdata/1/auditp.txt
$$ ##AUDIT TRAIL=  $$ (NUMBER, WHEN, WHO, WHERE, WHAT)
(   1,<2007-07-18 15:19:35.10 +100>,<MAYBRIDGE\nmr>,<NMR_250MHZ>,
      <created by zg, POWCHK disabled, PULCHK disabled
       configuration hash MD5:
       76 6E 9A 78 1E 09 19 81 EC 84 63 8F B0 6A 59 2D
       data hash MD5: 64K
       31 31 0D A6 FB 62 E5 5F 3D 22 03 C4 6B 10 DB 96>)
(   2,<2007-07-18 15:19:48.37 +100>,<MAYBRIDGE\nmr>,<NMR_250MHZ>,
      <Start of raw data processing
       ef LB = 0.3 FT_mod = 6 PKNL = 1 SI = 32K 
       data hash MD5: 32K
       F5 BD FE CB FA 69 73 F3 24 B8 91 C7 E6 67 16 6E>)
(   3,<2007-07-18 15:19:50.04 +100>,<MAYBRIDGE\nmr>,<NMR_250MHZ>,
      <apk 
       data hash MD5: 32K
       94 8D 1C 4B AF 8D 61 79 53 46 EF ED 2A 80 62 E6>)
(   4,<2007-07-18 15:19:50.77 +100>,<MAYBRIDGE\nmr>,<NMR_250MHZ>,
      <abs ABSG = 5 
       data hash MD5: 32K
       B7 28 49 50 7E B6 2C 62 8D AD E6 D9 F5 2C 76 D5>)
$$ ##END=
$$ 
$$ hash MD5
$$ 57 0D F4 46 02 FC 3C C9 93 AE 7C 61 44 36 92 B4
##$RELAX= 
##$RELAX= 
##$RELAX= 
##$RELAX= 
##$RELAX= 
##$RELAX= 
##$RELAX= 
$$ Bruker specific parameters
$$ --------------------------
##$DU= <C:\u>
##$EXPNO= 1180
##$NAME= <ADRS>
##$PROCNO= 1
##$TYPE= <nmr>
##$USER= <dgb>
##$AMP= (0..31)
100 100 100 100 100 100 100 100 100 100 100 100 100 100 100 100 100 100 
100 100 100 100 100 100 100 100 100 100 100 100 100 100 
##$AQSEQ= 0
##$AQ_mod= 3
##$AUNM= <au_zg>
##$AUTOPOS= <40 >
##$BF1= 250.13
##$BF2= 250.13
##$BF3= 250.13
##$BF4= 250.13
##$BF5= 500.13
##$BF6= 500.13
##$BF7= 500.13
##$BF8= 500.13
##$BYTORDA= 1
##$CFDGTYP= 0
##$CFRGTYP= 5
##$CHEMSTR= <none>
##$CNST= (0..31)
1 1 145 1 1 1 1 1 1 1 1 1 1 1 1 1 1 1 1 1 1 1 1 1 1 1 1 1 1 1 1 1 
##$CPDPRG= <>
##$CPDPRG1= <>
##$CPDPRG2= <>
##$CPDPRG3= <>
##$CPDPRG4= <mlev>
##$CPDPRG5= <mlev>
##$CPDPRG6= <mlev>
##$CPDPRG7= <mlev>
##$CPDPRG8= <mlev>
##$CPDPRGB= <>
##$CPDPRGT= <>
##$D= (0..31)
0 1 0 0 0 0 0 0 0 0.06 0 0 0 0 0 0 0.0002 0 0 0 0 0 0 0 0 0 0 0 0 0 0 
0 
##$DATE= 1184768374
##$DBL= (0..7)
120 120 120 120 120 120 120 120 
##$DBP= (0..7)
150 150 150 150 150 150 150 150 
##$DBP07= 0
##$DBPNAM0= <>
##$DBPNAM1= <>
$$ [...]
##$SUBNAM7= <"">
##$SUBNAM8= <"">
##$SUBNAM9= <"">
##$SW= 20.6930455092707
##$SWIBOX= (0..15)
0 0 3 0 0 0 0 0 0 0 0 0 0 0 0 0 
##$SW_h= 5175.983436853
##$TD= 65536
##$TD0= 1
##$TE= 297.16
##$TE2= 300
##$TE3= 300
##$TEG= 300
##$TL= (0..7)
0 120 120 120 120 120 120 120 
##$TP= (0..7)
150 150 150 150 150 150 150 150 
##$TP07= 0
##$TPNAME0= <>
##$TPNAME1= <>
##$TPNAME2= <>
##$TPNAME3= <>
##$TPNAME4= <>
##$TPNAME5= <>
##$TPNAME6= <>
##$TPNAME7= <>
##$TPOAL= (0..7)
0.5 0.5 0.5 0.5 0.5 0.5 0.5 0.5 
##$TPOFFS= (0..7)
0 0 0 0 0 0 0 0 
##$TUNHIN= 0
##$TUNHOUT= 0
##$TUNXOUT= 0
##$USERA1= <user>
##$USERA2= <user>
##$USERA3= <user>
##$USERA4= <user>
##$USERA5= <user>
##$V9= 5
##$VALIST= <valist>
##$VCLIST= <CCCCCCCCCCCCCCC>
##$VD= 0
##$VDLIST= <DDDDDDDDDDDDDDD>
##$VPLIST= <PPPPPPPPPPPPPPP>
##$VTLIST= <TTTTTTTTTTTTTTT>
##$WBST= 1024
##$WBSW= 4
##$XGAIN= (0..3)
0 0 0 0 
##$XL= 0
##$YL= 0
##$YMAX_a= 616605
##$YMIN_a= -649625
##$ZGOPTNS= <>
##$ZL1= 120
##$ZL2= 120
##$ZL3= 120
##$ZL4= 120
##$ABSF1= 16.4488
##$ABSF2= -4.244373
##$ABSG= 5
##$ABSL= 3
##$ALPHA= 0
##$AQORDER= 0
##$ASSFAC= 0
##$ASSFACI= 0
##$ASSFACX= 0
##$ASSWID= 0
##$AUNMP= <proc_1d>
##$AZFE= 0.1
##$AZFW= 0.1
##$BCFW= 0
##$BC_mod= 0
##$BYTORDP= 0
##$COROFFS= 0
##$CY= 12.5
##$DATMOD= 1
##$DC= 0
##$DFILT= <>
##$DTYPP= 0
##$F1P= 14.0000005364418
##$F2P= -0.99999901652339
##$FCOR= 0.5
##$FTSIZE= 32768
##$FT_mod= 6
##$GAMMA= 0
##$GB= 0
##$INTBC= 1
##$INTSCL= 1
##$ISEN= 128
##$LB= 0.3
##$LEV0= 0
##$LPBIN= 0
##$MAXI= 10000
##$MC2= 0
##$MEAN= 0
##$ME_mod= 0
##$MI= 0
##$NCOEF= 0
##$NC_proc= -3
##$NLEV= 6
##$NOISF1= 0
##$NOISF2= 0
##$NSP= 0
##$NTH_PI= 0
##$NZP= 0
##$OFFSET= 16.4488
##$PC= 1
##$PHC0= -51.23702
##$PHC1= 5.772563
##$PH_mod= 1
##$PKNL= yes
##$PPARMOD= 0
##$PSCAL= 4
##$PSIGN= 0
##$REVERSE= no
##$SF= 250.130018307182
##$SI= 32768
##$SIGF1= 0
##$SIGF2= 0
##$SINO= 400
##$SIOLD= 32768
##$SREGLST= <1H.CDCl3>
##$SSB= 0
##$STSI= 32768
##$STSR= 0
##$SW_p= 5175.98343685301
##$SYMM= 0
##$S_DEV= 0
##$TDeff= 65536
##$TDoff= 0
##$TI= <Analysis number 999999
Compound Code 99
Book Reference 9
Project Code 9>
##$TILT= no
##$TM1= 0
##$TM2= 0
##$TOPLEV= 0
##$USERP1= <user>
##$USERP2= <user>
##$USERP3= <user>
##$USERP4= <user>
##$USERP5= <user>
##$WDW= 1
##$XDIM= 32768
##$YMAX_p= 402690609
##$YMIN_p= -55853
$$ End of Bruker specific parameters
$$ ---------------------------------
##NTUPLES= NMR SPECTRUM
##VAR_NAME=  FREQUENCY,     SPECTRUM/REAL,   SPECTRUM/IMAG
##SYMBOL=    X,             R,               I
##VAR_TYPE=  INDEPENDENT,   DEPENDENT,       DEPENDENT
##VAR_FORM=  AFFN,          ASDF,            ASDF
##VAR_DIM=   32768,         32768,           32768
##UNITS=     HZ,            ARBITRARY UNITS, ARBITRARY UNITS
##FACTOR=    0.157963299565203, 1,           1
##FIRST=     4114.33842834368, 0,            0
##LAST=      -1061.64500850933, 0,           0
##MIN=       -1061.64500850933, -55853,      0
##MAX=       4114.33842834368, 402690609,    0
$$ Real data points
##PAGE= N=1
##DATA TABLE= (X++(R..R)), XYDATA
$$ [...]
16539B6054j514Q597m359o389p949J34k0019j0645J6147P997L399m055r768l621
16525e991J0100J3589j648j775N419J786o96J5747j71p632j1633o287m116M031
16511A0723P452l200O148j2229n671p684m536R188M191n468N824L496O896K128
16497A7258L276j108M4l957j42L525q796j7284O253O868j323Q641J2041m089k961
16482A8246N01j826m863p958P452M137O271p750r940K576M579P804Q518n171q866
16467A3710n795j484j141J059q293L124J5249l770j1626k908Q341j4031j5724
16454b3289N047J0050k945P393J2319O300N731j5431k0545k152J3112J2862J062
16441I514o275J0537j145k2069L11J3442J407J0364K364k6724j5222N130J0331
$$ plain form
16539 26054 24540 33137 28778 22389 14440 14574 -5445 -16090 57 8054 11453 7398 -2370 -5991
16525 -5991 4109 17698 16050 14275 19694 21480 20784 36531 36360 28728 17095 10808 6692 10723
16511 10723 18175 14975 21123 8894 3223 -4461 -8997 191 4382 -1086 4738 8234 15130 17258
16497 17258 20534 19426 19470 15513 15371 18896 10100 -7184 -931 5937 4614 13255 25296 21207 18246
16482 18246 18747 16921 12058 4100 11552 15689 21960 14210 4270 6846 11425 19229 27747 22576 13710
16467 13710 7915 6431 5290 6349 -1944 1180 16429 12659 1033 -1875 6466 -7565 -23289
16454 -23289 -18242 -8192 -11137 -3744 8575 14875 20606 5175 -15370 -17522 -4410 8452 9514
16441 9514 3239 13776 12631 -9438 -9127 4315 5722 16086 18450 -8274 -23496 -18366 -8035
16428h035P923k949Q365J2659R78j3857j1295K479J4711Q50l822J3202N349j3853
16414A2705j8739K965P136K899j235J2122J1322m724J348K990k0262k991j97Q65
16400F204M684Q342m383O611K951J972K974O989P677r191j7367n612J782l853
16386I780r48J7267J4591P250M682j0227p783j0481M692J146Q83k185J0411n566
16372C3512N274R852l803J8513k549j0257n579N584J8027J66m558J9684O139J2963
16358A02968O788o298J865J0215R007N961O718J2300Q899J5207r729M060k793
16345A65168j4999k5341j9299j3862j0601j6317p471O434Q863J479m355j0546
16333E9153q815q708K110K923m77n220M613J4915r117p975L798j8283j2508l765
$$ plain form
16428 -8035 -112 -3061 5304 17963 18941 5084 -6211 -3732 10979 11829 8007 21209 26558 12705
16414 12705 -6034 -3069 4067 6966 5731 17853 29175 24451 25799 28789 8527 5536 5339 6204
16400 6204 10888 19230 14847 21458 24409 26381 29355 36344 44021 34830 17463 11851 13633 9780
16386 9780 8832 26099 40690 47940 52622 42395 34612 24131 28823 29969 30852 28667 39078 33512
16372 33512 38786 48638 44835 63348 60799 50542 44963 50547 68574 68740 64182 83866 90005 102968
16358 102968 109756 103458 105323 115538 124545 130506 137224 149524 158423 173630 163901 167961 165168
16345 165168 150169 124828 105529 91667 81066 64749 57278 63712 72575 74054 69699 59153
16333 59153 50338 41630 43740 46663 46186 40966 45579 60494 51377 43402 47200 28917 16409 12644
16319A2644R548J1479N962M640j1325j4606j848M627j3623p411J16R385Q014R803
16305B7405O414P200K363n744o576q474m159P859K304p465j6707J5846K4977R20
16291D6163M94q812m040j3970j717j0298Q573O393n043j956k494l241J8388J420
16277B9860j8097p441L964M263J797K191Q952J2743N804O157J46n762l892q574
16263C2111J708O419Q069J5003K1225o427q42j0596o061J8308J1635j522o640
16250H2390n530M159K1727J1751j9286J3443J6231J2534k542J0634J9663l750
16238A61424J263K02J0104K3581L0507J1901N880J4980J3323J4423P007J2766
16226C07361J4106p357r853j1179q818j5276k2921k1770j9725j7084m060J242
$$ plain form
16319 12644 22192 33671 39633 44273 32948 18342 16494 21121 7498 87 203 9588 17602 27405
16305 27405 33819 41019 43382 37638 31062 22588 18429 26288 28592 21127 4420 20266 45243 46163
16291 46163 46657 37845 33805 19835 18118 7820 16393 22786 17743 15787 13293 10052 28440 29860
16277 29860 11763 4322 8286 12549 14346 16537 25489 38232 44036 50193 50339 44577 40685 32111
16263 32111 33819 40238 48307 63310 84535 78108 77266 66670 60609 78917 90552 89030 82390
16250 82390 76860 81019 102746 114497 95211 108654 124885 137419 134877 145511 165174 161424
16238 161424 162687 162889 172993 196574 227081 238982 244862 259842 273165 287588 294595 307361
16226 307361 321467 314110 304257 293078 284260 268984 246063 224293 204568 187484 183424 184666
16214A84666p097j7121l077l448q737k0278j2847r693P894Q673L789L737k025
16201A24436Q958J2108J9469r11p604l005O504J3612K536Q091O178R016K8159
16188B27547J7540o384j1421M668M974R27R638J6778R894R999J2314P650M838
16175C08962J613J9081K5889j099K18J3565J6982k716j4037P356K7676J8292L353
16162D25135K232J4094J8559J0424R882L081L3809L3173M621R469M783J6548K5459
16149F11269K9549L3019K9394K8377M1117L7684L7830L0767K9705M3480O5914
16138A018105N6902M8242Q0805Q4322P5418Q4198J02975J25135J39894J47672
16128A963668J52952J71827J77419J98892K21791K51380K78446L13255L65639
$$ plain form
16214 184666 177569 160448 157371 153923 145186 124908 112061 102368 110262 118935 122724 126461 124436
16201 124436 133394 145502 164971 164060 156456 153451 159955 173567 176103 184194 190372 199388 227547
16188 227547 245087 238703 227282 231950 236924 237851 247489 264267 274161 284160 296474 304124 308962
16175 308962 310575 329656 355545 354446 354664 368229 385211 382495 368458 375814 403490 421782 425135
16162 425135 427367 441461 460020 470444 480326 483407 517216 550389 555010 564479 569262 585810 611269
16149 611269 640818 673837 703231 731608 772725 810409 848239 879006 908711 952191 1018105
16138 1018105 1075007 1123249 1204054 1288376 1363794 1447992 1550967 1676102 1815996 1963668
16128 1963668 2116620 2288447 2465866 2664758 2886549 3137929 3416375 3729630 4095269
16119D095269M44197N12857O03000P14582Q78619J094402J361034J664471K028113
16110A3396544K436853K923260L504417M108867M732124N342912N880502O348329
16102D8673808O662868O685324O483868O035041N303170M090773K238645Q52638
16094H7026135m63932k228271l907511n424711o082967o512279p229249p274597
16086D7902618o797439o100956n334927m586150l780646l023985k371490j815670
16078A4091355j364933j044242p97380o45674n40627m35700l96282l47782l09665
16069H209070k61833k31082j96071j77595j50086j37443j48355j55279j50716
16060F600610j46518j50737j76303j86195k03303j99808k14853k12664k17154
$$ plain form
16119 4095269 4539466 5052323 5655323 6369905 7248524 8342926 9703960 11368431 13396544
16110 13396544 15833397 18756657 22261074 26369941 31102065 36444977 42325479 48673808
16102 48673808 55336676 62022000 68505868 74540909 79844079 83934852 86173497 87026135
16094 87026135 86562203 84333932 80426421 75001710 68918743 62406464 55177215 47902618
16086 47902618 41105179 35004223 29669296 25083146 21302500 18278515 15907025 14091355
16078 14091355 12726422 11682180 10884800 10239126 9698499 9262799 8866517 8518735 8209070
16069 8209070 7947237 7716155 7520084 7342489 7192403 7054960 6906605 6751326 6600610
16060 6600610 6454092 6303355 6127052 5940857 5737554 5537746 5322893 5110229 4893075
16051D893075k21186k19180k15680j94965j79150j79225j62297j61366j60815
16042C199211j40852j48046j45959j27739j22219j14345j00980r6386j05767j04499
16032A992419j04375r2387o7509o7558o3189o8741p7162o9912n0742o4967o1711
16021A204166n6387l7608l6790k9612m5878m5630m7709n2896l9691l3607m2385
16010G35973m1971j5487p291k8521l2301l1208l5979l1490k0899l946j1704j2763
15998D62413j4655j9964j4595j9842p365R3L116j2352k864Q665N376m868k423
15985C80735L063J4397J8471J0349R559J169j375J662k142M149p014j2969j735
15972D18319j0225j6833j3597j5343o629m044k3669l2286k9928r809j3002k1697
$$ plain form
16051 4893075 4671889 4452709 4237029 4042064 3862914 3683689 3521392 3360026 3199211
16042 3199211 3058359 2910313 2764354 2636615 2514396 2400051 2299071 2202685 2096918 1992419
16032 1992419 1888044 1795657 1728148 1660590 1597401 1528660 1451498 1381586 1330844 1265877 1204166
16021 1204166 1147779 1110171 1073381 1043769 997891 952261 904552 851656 811965 778358 735973
16010 735973 694002 678515 671224 642703 610402 579194 543215 511725 490826 486880 475176 462413
15998 462413 447758 427794 413199 393357 385992 386085 389201 376849 373985 382650 388026 383158 380735
15985 380735 383798 398195 416666 427015 436574 437743 436368 438030 435888 440037 433023 420054 418319
15972 418319 408094 391261 377664 362321 355692 351648 327979 295693 265765 255956 242954 221257
15960B21257l2442k2386j7139j5342k115N630l143q052m291o367l049k0263o67
15947I1631P093L664J674j248j377K630j303k417o044q399L120J2835J6123J0148
15933A28130j1315M903O094M860Q29N139m413k935J9797Q555p019n894J0800Q556
15919A66087J153n082M94K554m844O728J5956N922p86j1574P848N295j790j5566
15905A72395j4812L668R256n538r945q481J2924k313m035l004j5547j2340N905
15892A28133R132j516p399K700Q963J320J501J121p389m144r041m295L521n293
15878A17314J143j4929m727R310R495n735k2194p073l773l415O061L422j863J890
15864H4926o326l629m232J0417O90j0196j5968q151j767m213O456J0733P153k735
$$ plain form
15960 221257 188815 166429 149290 133948 131833 137463 134320 126268 121977 115610 112561 92298 91631
15947 91631 98724 102388 104062 102814 101437 104067 102764 100347 94303 85904 89024 101859 117982 128130
15933 128130 116815 121718 127812 132672 133501 138640 134227 131292 151089 159644 152625 146731 157531 166087
15919 166087 167240 162158 162652 165206 160362 167090 183046 188968 188182 176608 184456 189751 187961 172395
15905 172395 157583 161251 170507 164969 155024 146543 159467 157154 153119 150115 134568 122228 128133
15892 128133 137265 135749 128350 131050 140013 141333 142834 143955 136566 132422 123381 119086 122607 117314
15878 117314 118457 103528 98801 108111 117606 111871 89677 82604 78831 75416 81477 84899 83036 84926
15864 84926 78600 74971 70739 81156 81846 71650 55682 47531 45764 41551 48007 58740 65893 63158
15850F3158j5685j733L854J7841n280j3483j0837j0699J6909J787o334L342q552
15837C4288L258P458r195j5515R446j806j0549j2320J1163Q268J0362P094p535
15824C4417m830O557j3161j0578P878R361l881n928j0056k810n873R167J2483
15811B2746O387L185K62j7780j7390J143P439M769p972n240N435P828J4025O927
15797C1764J4028l434k587m166j1313o648J0683q331J688J5073k846k308m564
15784B7039J5006P066j8132k245m838k835J2803j000m917K369n080M004L546K476
15770C5262j6153r673J274j2389N783J6969J1057L732l420j605J782N6Q151M621
15756D5447q743k58M208j2798k262K4941J650m64N481R55N519j749n210m536j47
$$ plain form
15850 63158 47473 45740 49594 67435 62155 48672 37835 27136 44045 45832 39498 42840 34288
15837 34288 37546 45004 35809 20294 29740 27934 17385 5065 16228 24496 34858 41952 34417
15824 34417 29587 36144 22983 12405 20283 29644 25763 19835 9779 6969 1096 10263 22746
15811 22746 29133 32318 32580 14800 -2590 -1447 5992 10761 2789 -2451 2984 10812 24837 31764
15797 31764 45792 42358 39771 35605 24292 17644 28327 19996 21684 36757 33911 31603 27039
15784 27039 42045 49111 30979 28734 23896 21061 33864 32864 27947 30316 25236 29240 32786 35262
15770 35262 19109 9436 10710 -1679 4104 21073 32130 35862 32442 30837 32619 32675 40826 45447
15756 45447 36704 36446 40654 27856 25594 50535 52185 51721 57202 58157 63676 61927 56717 52181 52034
15741E2034j536j1790J668o683j4407p837J3804J6350Q117j7169j1634J1675N872
15728C8464q697o584k329o97O914k727M32Q725P667p683j682r594O883o037j6919
15713F136l053Q15J1426M035N37j4422o837j008J3492J1246N185J4206q305L218
15699C6671L445k650J319O181j4824j1916M945j78m547p174O265R985l14n531
15685B1677j2960q047J1183j318k255N014L699J4485j793j1791n210p806K296
15672G174N949m775j803o367n302L342J483J1809O671j613j057j943l243R824
15658B0149O858n871k760r120J040Q611R797j5088n171l089M37l677K542j0603
15644e945O755M869O295O679r237k819L347L71k813q481n346k844j0783k89J5920
$$ plain form
15741 52034 50498 38708 40376 33693 19286 11449 25253 41603 49720 32551 20917 32592 38464
15728 38464 29767 23183 20854 20157 27071 24344 24776 33501 41168 33485 31803 22209 29092 23055 6136
15713 6136 3083 3898 15324 19359 19896 5474 -1363 -2371 11121 22367 27552 41758 33453 36671
15699 36671 40116 37466 38785 44966 30142 18226 23171 22993 18446 11272 17537 27522 27208 21677
15685 21677 8717 670 11853 10535 8280 13294 16993 31478 29685 17894 12684 4878 7174
15672 7174 13123 8348 6545 178 -5124 -1782 -299 11510 18181 16568 15511 13568 10325 20149
15658 20149 27007 21136 18376 9256 10296 18907 28704 13616 8445 5356 5793 2116 4658 -5945
15644 -5945 810 5679 11974 18653 9416 6597 9944 10315 7502 -979 -6325 -9169 -19952 -20241 -4321
15629d321P034j498j066m666k418m477N497M637r419j3197L094J1157J2442r726
15615f927r485N89N869L250o031Q913J1954J1551L066m73Q958r772p169j376j0228
15600B689J1012Q327j083j1288p250m523r40l923k970M477O567l366j891l113
15586g275j406Q57O481P893Q949o414J000j477N646o402l883n521J1878J2468
15572B2794o130j0260j063O396N337J4584N266j3069j3693J0443J7054O038P746
15559E1443J2656J9340J2079K5440L3848L8862K6153L3808L7590M4144L5518M5334
15547D16215J2902J0311Q86N920r865j5582k0440k4226k2915l5612m3498l9025
15535B35071k9691k1163j9675l5464j505j2222k3442k0820l5742n526R672j5808
$$ plain form
15629 -4321 2713 1215 149 -4517 -6935 -11412 -5915 -1278 -10697 -23894 -20800 -9643 2799 -6927
15615 -6927 -16412 -15823 -9954 -6704 -12735 -3822 8132 19683 22749 22276 31234 21462 14293 12917 2689
15600 2689 13701 22028 20945 9657 2407 -2116 -3056 -6979 -9949 -5472 1095 -2271 -4162 -7275
15586 -7275 -8681 -7824 -1343 6550 15499 9085 10085 8608 14254 7852 3969 -1552 10326 22794
15572 22794 16664 6404 5341 11737 17074 31658 36924 23855 10162 20605 37659 43697 51443
15559 51443 64099 83439 95518 120958 154806 193668 219821 253629 291219 335363 370881 416215
15547 416215 429117 439428 440314 446234 436369 420787 400347 376121 353206 317594 274096 235071
15535 235071 205380 184217 164542 129078 127573 115351 91909 71089 35347 29821 39493 23685
15523B3685O194K846m102M760L17n092J766k115O699J4067N328o196O703J0336
15509F5196j0259r257K896k260j1865l250J861M297j1206j7388k645j874l50j191
15495B705O723l358j3571N978k932P28R687p959q977J367j284p73l911m042J0648
15480h971O667K002k149j0448m848k625J9834M837K69k622j3093j468Q314J0835
15466F534O54M551p152k993q18K7L863M021k015p619j3192J755j414P809J81R011
15450C203p78m35m504L63j328J9119J2842l578j1994O57j2365k3476P055Q933
15436f286m393J310J3158J554k375l074q65L735n904j0965Q243N265r263L51j52
15421i661o401K0518O660n249J0122o345k826J140j612J0706M956p067j1962o181
$$ plain form
15523 23685 29879 32725 28623 33383 33700 28608 30374 28259 34958 49025 54353 48157 54860 65196
15509 65196 54937 45680 48576 46316 34451 31201 33062 37359 26153 8765 6120 4246 3896 2705
15495 2705 9428 6070 -7501 -1523 -4455 -3727 5960 -1999 -10976 -9609 -10893 -11666 -15577 -19619 -8971
15480 -8971 -2304 -302 -2451 -12899 -17747 -20372 -538 4299 4568 1946 -11147 -12615 -4301 6534
15466 6534 7188 11739 4587 1594 776 803 4666 8687 6672 -947 -14139 -12384 -13798 -5989 -5808 3203
15450 3203 2425 1990 -2514 -2151 -3479 15640 28482 24904 12910 13567 1202 -22274 -15219 -6286
15436 -6286 -10679 -9369 3789 5343 2968 -106 -971 2764 -3140 -14105 -5862 -597 -9860 -9509 -9661
15421 -9661 -16062 4456 11116 5867 15989 9644 6818 7958 6346 17052 22008 14941 2979 -3202
15407c202l896l977l688N024k620J1303R919N214R769K701j7280o24l915j4474
15393i746L839j093o602o156K955J1130K960O75R941p33j3771j0982K090p847
15379b3340L841J5665N816J0241K409J10q407j4177q879r642J060Q171Q233k968
15365a1867o993p002l138J0254P4J1556N411O056P938r225k721J5043J0428k3733
15351B081j4223k862m684M053R345J5233m432j5457j0534Q200Q70J346L386r681
15337a7359M676R893k700L328P652J50j119M902R100l128p426n802j7687n189
15323b0709N065N253j200J0921R652L925o544j0784m941K074N422J196l41j544
15309b555p378n461O054p2O088L926o116o719O15P794l106r656K715j508l338
$$ plain form
15407 -3202 -7098 -11075 -14763 -9739 -12359 -1056 8863 14077 23846 26547 9267 8643 4728 -9746
15393 -9746 -5907 -7000 -13602 -19758 -16803 -5673 -2713 -2038 7903 7170 -6601 -17583 -15493 -23340
15379 -23340 -19499 -3834 1982 12223 14632 14742 6335 -7842 -16721 -26363 -25303 -17132 -8899 -11867
15365 -11867 -18860 -25862 -29000 -18746 -18672 -7116 -1705 4351 12289 3064 343 15386 25814 2081
15351 2081 -12142 -15004 -19688 -15635 -6290 8943 4511 -10946 -21480 -13280 -12410 -11064 -7678 -17359
15337 -17359 -12683 -2790 -5490 -2162 5490 5640 4521 9423 18523 15395 7969 2167 -15520 -20709
15323 -20709 -15644 -10391 -11591 -670 8982 12907 6363 -4421 -9362 -7288 -1866 -670 -1011 -2555
15309 -2555 -9933 -15394 -9340 -9412 -3324 602 -5514 -12233 -11618 -3824 -6930 -16586 -13871 -15379 -18717
15294a8717L261J3391P132p494r400n010j9223l872k48k428R103J4815M216J472
15280a3002K75m858k775l342J6907J1093J21j1057O60J169k324Q816r584j3821
15266b1722j618q75k071l760N653J842j034K796Q487j2745R945R419j758N880
15252a561K104j361K70o158j8890O67N695M85o308O238k101m564N547J2351l418
15237a1004n37k134p204k040J71O463J9467J284k277n963R908N075k930o093n620
15222c434l247j7741J461N201O432O219n775O100R75r495j8183K694J1652Q779
15208h362j990J310J525k642j507m140M44J0494J1118k07J4437q875j9741o736
15194a4872r276Q327K575P595M752q485M736Q608J187m396o000j223o697p042
$$ plain form
15294 -18717 -15456 -2065 5067 -2427 -11827 -16837 -36060 -39932 -40180 -42608 -33505 -18690 -14474 -13002
15280 -13002 -12727 -17585 -20360 -23702 -6795 4298 4419 -6638 -5978 -4809 -7133 1683 -7901 -21722
15266 -21722 -23340 -24215 -26286 -30046 -24393 -22551 -23585 -20789 -12302 -25047 -15102 -5683 -7441 -1561
15252 -1561 543 -818 -548 -6706 -25596 -24929 -19234 -18749 -25057 -18819 -20920 -25484 -19937 -7586 -11004
15237 -11004 -11541 -13675 -20879 -22919 -22748 -16285 3182 4466 2189 -3774 6134 11209 8279 2186 -3434
15222 -3434 -6681 -24422 -22961 -17760 -11328 -5109 -10884 -4784 -3809 -13304 -31487 -28793 -17141 -8362
15208 -8362 -10352 -9042 -7517 -10159 -11666 -15806 -15362 -4868 6250 6043 20480 11605 -8136 -14872
15194 -14872 -24148 -15821 -13246 -5651 -899 -9384 -4648 3960 5147 751 -5249 -6472 -13169 -20211
15180b0211O802M958K6j2452o074o458l100J7194J0108K477Q063R253N617j0453
15166E750j4153o405K085M361J0723L366j268P666k528p257J3639n551j2014m403
15152e989l970l5K178J94j0232L514J1139q370K72P135O444K800n401L856o366
15137b831j1542J1604J4074r788j3094o588j178m482q366M143J677q363L544R788
15123b1402m018J1023K0399J0914j389j7118J033j930j0066j215O966P245L510
15110C952m006N776N450N985M962J0466p792j0313p035k569m938m95k088j024
15096c669k13J5367K411j3475j0714l400n394n795J0796J6834J5199K863p790
15083A3020n290o555L749r823J3777Q656m690l662Q760J220j050r57Q234L957
$$ plain form
15180 -20211 -13409 -8451 -8425 -20877 -26951 -33409 -36509 -19315 -9207 -6730 1333 10586 16203 5750
15166 5750 -8403 -14808 -12723 -8362 2361 5727 4459 12125 9597 2340 15979 10428 -1586 -5989
15152 -5989 -9959 -9994 -7816 -7622 -17854 -14340 -3201 -11571 -11299 -4164 2280 5080 -321 3535 -2831
15137 -2831 -14373 -2769 11305 1517 -11577 -18165 -19343 -23825 -32191 -28048 -26371 -34734 -31190 -21402
15123 -21402 -25420 -14397 6002 16916 15527 -1591 -558 -2488 -12554 -13769 -6803 442 3952
15110 3952 -54 5722 11172 17157 22119 32585 24793 14480 7445 4876 -62 -557 -2645 -3669
15096 -3669 -3882 11485 13896 421 -10293 -13693 -19087 -24882 -14086 2748 17947 20810 13020
15083 13020 7730 1175 4924 -4899 8878 17534 12844 9182 17942 19162 18112 17155 25389 29346
15069B9346o691j3046n68M027n334J7103J3191k3612o766j4969j2880L314J9074
15056B189J7498R23j496n996k753J1509K604k3157l845N725N486k513J657L162
15042A0993L82L986M413q232m325j4780k396P203R939j490j2033k5490L766J8645
15028i419Q658J0015N607n048r963l985q144o759J5395o536j4335J0751P732j2143
15014a8174k040R290K329J965M146k685l139j4663L83P051o915n80Q977L790j781
14999a2046k534L350n410N273O900J239P136K553K037O874k366l664m339r572
14985d569m698o81Q719p216k733m901O319K4568K1468M154O995o249k0373j4053
14971F750n974l463K404q268r804o080J035P476P496J2559L47N121m142q945l937
$$ plain form
15069 29346 22655 9609 9041 13068 7734 24837 38028 14416 7650 -7319 -20199 -16885 2189
15056 2189 19687 20610 19114 13118 10365 21874 24478 1321 -2524 3201 8687 6174 7831 10993
15042 10993 11375 15361 19774 11542 7217 -7563 -9959 -2756 7183 5693 -6340 -31830 -28064 -9419
15028 -9419 -761 9254 14861 9813 -150 -4135 -12279 -19038 -3643 -10179 -24514 -13763 -6031 -18174
15014 -18174 -20214 -10924 -8595 -6630 -2484 -5169 -8308 -22971 -22588 -15537 -22452 -23032 -14055 -10265 -12046
14999 -12046 -14580 -11230 -16640 -11367 -4467 -3228 3908 6461 8498 15372 13006 9342 5003 -4569
14985 -4569 -9267 -9948 -1229 -8445 -11178 -16079 -9760 14808 36276 40430 47425 41176 20803 6750
14971 6750 776 -2687 -283 -8551 -18355 -24435 -23400 -15924 -8428 4131 4478 9599 5457 -3488 -7425
14956g425L230l508q716O798O997Q12j1745n164KQ118J886p18N538J2043q83j2639
14940e374k958j4464j0152M240J4086K843j9536j826J7428l96R758R515j0259
14927g095m035O941P841J3820m633m216p664o018Q527r191p503J2411j339j0912
14913a3066n21J7075O493J747n943j0537Q55l24p265J2568J1903o207q045k052
14899c319M597n349k049J0842J812j2238l886R387j2448n255m518K5561J1224
14886A4361l449m740k0477L747r56J900n858L151l294m159m382q852L293Q575
14872b1140n829q626J5629K0865m647Q722P49n253k418m907L136k646M944K041
14858F20K495q58p739P53k328P599L940q125q316J2678n012o762o823k985J066
$$ plain form
14956 -7425 -4195 -7703 -16419 -9621 -2624 -1812 -13557 -18721 -18719 -10601 -8715 -9433 -3895 8148 7265 -5374
14940 -5374 -8332 -22796 -32948 -28708 -14622 -11779 -31315 -33141 -15713 -16109 -6351 3164 -7095
14927 -7095 -11130 -4189 3652 17472 12839 8623 959 -5059 3468 -5723 -13226 -815 -2154 -13066
14913 -13066 -13587 3488 9981 11728 5785 -4752 -3897 -4221 -11486 1082 12985 6778 -1267 -3319
14899 -3319 1278 -4071 -6120 4722 6534 -5704 -9590 -203 -12651 -17906 -22424 3137 14361
14886 14361 10912 6172 -14305 -10558 -11514 -9614 -15472 -12321 -15615 -19774 -24156 -33008 -29715 -21140
14872 -21140 -26969 -35595 -19966 899 -3748 4974 5723 470 -1948 -6855 -3719 -6365 -1421 620
14858 620 3115 2257 -5482 -4729 -7057 542 4482 -3643 -11959 719 -4293 -11055 -17878 -20863 -19797
14843a9797r149J789J9525o327j1479K133M536L062J3020l995Q129J418r111n654
14829a1900JK063J0249J960M009K269K075j0877j0220m204p267j917L55J0881
14815a2523P012N267j7789j5052j0876l388J4296Q578R984J1434M911k801M615
14802C668J4365k908k160N446j0242p118p332o579K269j0774J0598J1675j3Q773
14788I668j028j3169j1247J4765J346j658k133n440L901K773n834J038M000M344
14774A326j244j1979j0372N735q481K852J0521n83j9453Q330J9206l151n946J0311
14760b928N63l69j0745n360N146o624m521M461K744N142j054P107oj9570J256
14745b4758L450Q850K1528P34N159l138q104m228M260k943o139J055M661J0139
$$ plain form
14843 -19797 -28946 -27157 -7632 -13959 -25438 -23305 -18769 -15707 -2687 -6682 1447 2865 -6246 -11900
14829 -11900 -11899 -9836 413 2373 6382 8651 10726 -151 -10371 -14575 -21842 -23759 -23404 -12523
14815 -12523 -5511 -244 -18033 -33085 -43961 -47349 -33053 -24475 -14491 -3057 1854 -947 3668
14802 3668 18033 15125 12965 18411 8169 1051 -6281 -12860 -10591 -21365 -10767 908 895 9668
14788 9668 8640 -4529 -15776 -1011 335 -1323 -3456 -8896 -4995 -2222 -8056 -7018 -3018 1326
14774 1326 82 -11897 -22269 -16534 -25015 -22163 -11642 -12225 -31678 -23348 -4142 -7293 -13239 -2928
14760 -2928 -2365 -2734 -13479 -18839 -13693 -20317 -24838 -20377 -17633 -12491 -13545 -6438 -6444 -26014 -24758
14745 -24758 -21308 -12458 9070 9804 14963 11825 3721 -507 3753 810 -5329 -4274 387 10526
14731A0526o644o965o391j618L380J4297M388j5251j0229l972J742N639K07r815
14717b0706n30O539j263j6881L383J0826L358M210j1489P226J0306O473n806o33
14703d987m530N629q642k362L555o270q592j453l621K310l43K499J9552K2975
14689A5720J0374r733j4473j8152l618J550j481l767p513K3591J2282j724n272
14676b216m951j867Q312j156j1248j0511Q174L686J527P182J0314P124k4751r421
14662a9802j589J0933P546P190r52k752j448q800K739R209J1909J2050j563p389
14648A7281r907j1007n435m872J1710P097j0736N991J0435j4603j2075Q029k823
14635a0915j2552j0321R643Q189N301m105L309N226J362J904N9k402j0869p164
$$ plain form
14731 10526 3882 -3083 -9474 -11092 -7712 6585 10973 -4278 -14507 -18479 -16737 -11098 -10891 -20706
14717 -20706 -21236 -14697 -15960 -32841 -29458 -18632 -15274 -11064 -22553 -15327 -5021 1452 -4354 -4987
14703 -4987 -9517 -3888 -12530 -14892 -11337 -17607 -26199 -27652 -31273 -28963 -29306 -26807 -7255 15720
14689 15720 26094 16361 1888 -16264 -19882 -18332 -19813 -23580 -31093 -7502 4780 3056 -2216
14676 -2216 -7167 -9034 -722 -1878 -13126 -23637 -15463 -11777 -10250 -3068 7246 14370 -10381 -19802
14662 -19802 -21391 -10458 -2912 4278 3326 574 -874 -9674 -6935 2274 14183 26233 24670 17281
14648 17281 7374 -3633 -9068 -13940 -2230 4867 -5869 122 10557 -4046 -16121 -8092 -10915
14635 -10915 -23467 -33788 -24145 -15956 -10655 -14760 -11451 -6225 -4863 -2959 -2900 -5302 -16171 -23335
14621b3335J740O346J5237j799k939m066k383j0892k268J3823k275p969J1307
14608i473J2092M344n3j6214j0483j1906r351O410J3404J2449J4469j0054k0258
14595b4624J738J4722O51P357J463m939k054j5486J481n64J0010P200p068O044
14581d069P726L240P258k647p363J414k52p522J226Q129L845n735m125K154R682
14566A2961l84q709j0479q193P800k18m470k54M489n099r449J223J3376K1781
14552A4375K150Q63P616J766n455p999l982p145p942n172k940N686J2584N254
14538I659l206m593j4862l848J3525M15Q82k308j0830P466J498n015j417P756
14524d878L18n035j2634k959M130J6058O680l510r296j2873j415j029L36J440
$$ plain form
14621 -23335 -21595 -15249 -12 -1811 -4750 -8816 -11199 -22091 -24359 -10536 -12811 -20780 -9473
14608 -9473 2619 6963 6910 -9304 -19787 -31693 -41044 -34634 -21230 -8781 5688 -4366 -24624
14595 -24624 -22886 -8164 -7513 -156 1307 -3632 -5686 -21172 -19691 -20255 -10245 -3045 -10113 -4069
14581 -4069 3657 6897 14155 11508 4145 5559 5307 -2215 -989 7140 10985 5250 1125 3279 12961
14566 12961 12577 3868 -6611 -14804 -7004 -7222 -11692 -11946 -7457 -12556 -22005 -20782 -7406 14375
14552 14375 16525 17388 25004 26770 21315 13316 9334 2189 -5753 -10925 -13865 -8179 4405 9659
14538 9659 6453 1860 -13002 -16850 -3325 -2910 -2028 -4336 -15166 -7700 -6202 -11217 -12634 -4878
14524 -4878 -4560 -9595 -22229 -25188 -21058 -5000 1680 -1830 -11126 -23999 -25414 -26443 -26107 -24667
14510b4667J3428Q486n623j0192n893O232K137r29p544O074J8230J0740M82j167
14496I794o171j1202J97J520L403J0002K289n697j5553j5048K791K515J2109K601
14482f450p100P177N396Q807p229N42K450O57p014r239J885L558J24m98j3942
14467b0876j143J1773K2204k884j0217l358m736r702n803l502q04K830Q784N094
14453a2340o723M347J740p683j0462O832P471P316Q298o256m378N794J175n022
14439i891O109m526n629n961P463P331r159J323m447N493k721r342j6472l447
14425d3876J5975R101J5478j0258p664k09P943q8M034K725R52n899l978j2710
14411b8474j283K0248J2602L590M619r799j2984n46J397K0734Q993j0178r677
$$ plain form
14510 -24667 -11239 -2753 -8376 -18568 -24461 -18229 -16092 -17021 -24565 -18491 -261 10479 10961 9794
14496 9794 3623 -7579 -7382 -5862 -2459 7543 9832 4135 -11418 -26466 -23675 -21160 -9051 -6450
14482 -6450 -13550 -6373 -977 7830 601 1143 3593 4250 -2764 -12003 -10118 -6560 -6436 -6934 -20876
14467 -20876 -22019 -10246 11958 9074 -1143 -4501 -9237 -18939 -24742 -28244 -29048 -26218 -17434 -12340
14453 -12340 -19063 -14716 -12976 -20659 -31121 -24289 -16818 -9502 -1204 -7460 -11838 -6044 -4869 -9891
14439 -9891 -3782 -8308 -13937 -19898 -12435 -5104 -14263 -12940 -17387 -11894 -14615 -23957 -40429 -43876
14425 -43876 -27901 -18800 -3322 -13580 -21244 -21453 -13510 -13598 -9564 -6839 -5887 -11786 -15764 -28474
14411 -28474 -29757 -9509 3093 6683 11302 1503 -11481 -12027 -10630 10104 19097 8919 -758
14398g58j759N796K957q584n397j8522k773m79J4018J972l430J2016J3431k411
14384F077l358P928P22j1194j650J0570N912n452p271j4305o596R731Q185O291
14370E590J4945j4787n310J777J0705j0584j0161P43P574O076r700l121Q326O446
14356H519n955j4714o163n649j0776R748P376K747O310L070J505l733m331l30
14342a2376M520R96p662r709K147M827M683l971R15J2122J5618M791l545j5156
14328a800j086j0656O387j656j7833n027K795J4371K988k234k979J0121j0707
14315a7316j589L864K770j1128j5073M29Q103P412J4344J775n294q460r403j898
14301c1464J5745Q686n558M314m577l278k905l463R94J693J1636L314N424k193
$$ plain form
14398 -758 -2517 3279 6236 -2348 -7745 -26267 -29040 -29519 -15501 -13529 -16959 -4943 8488 6077
14384 6077 2719 10647 11369 175 -1475 9095 15007 9555 2284 -12021 -18617 -8886 -701 5590
14370 5590 20535 5748 438 2215 12920 2336 -7825 -7082 492 6568 -3132 -6253 2073 8519
14356 8519 2564 -12150 -18313 -23962 -34738 -24990 -17614 -14867 -8557 -5487 -3982 -7715 -12046 -12376
14342 -12376 -7856 -6860 -14522 -24231 -22084 -17257 -12574 -16545 -15630 -3508 12110 16901 13356 -1800
14328 -1800 -2886 -13542 -7155 -8811 -26644 -31671 -28876 -14505 -11517 -13751 -16730 -6609 -17316
14315 -17316 -18905 -15041 -12271 -23399 -38472 -38043 -29940 -22528 -8184 -6409 -11703 -20163 -29566 -31464
14301 -31464 -15719 -7033 -12591 -8277 -12854 -16132 -19037 -22500 -21506 -19813 -8177 -4863 561 -1632
14287a632L328R646l413j2182j4120k121R968K216p872p392n07O09J679Q634N405
14272g754l125m770J1840K982j922N632j1761r981m684K813p24j1305L301q58
14258c0316K890K776J0496J2350n989J211n746j715p063j0390Q53P330M089P499
14244a1725k412j8932n448R367J0024k760L12j1650J4275J2544J9205O724n545
14231A3979j6431m798P73l533J0629J7006k4671m840O528M0j118K795n023o058
14217a4722j48L565n355m080l87Q862j320O190M219m508J180R338K605J21j4416
14202h856Q213L698m801k5159k3892n056J4905J3877L904J2283R618j981J844
14189a403o104r804J3345R153j6198r320k0325n277J1773O009j3218P72J6898
$$ plain form
14287 -1632 1696 11342 7929 -4253 -18373 -20494 -10526 -8310 -16182 -23574 -24081 -23472 -21793 -13159 -7754
14272 -7754 -10879 -15649 -3809 -827 -2749 2883 -8878 -18859 -23543 -20730 -21454 -32759 -29458 -30316
14258 -30316 -27426 -24650 -14154 -1804 -7793 -6582 -12328 -14043 -21106 -31496 -30643 -23313 -19224 -11725
14244 -11725 -14137 -33069 -38517 -29150 -19126 -21886 -21574 -33224 -18949 -6405 12800 19524 13979
14231 13979 -2452 -7250 -6477 -10010 619 17625 -7046 -11886 -5358 -5318 -6436 -3641 -8664 -14722
14217 -14722 -14870 -11305 -16660 -20740 -21127 -12265 -13585 -7395 -3176 -7684 -6504 2834 5439 5560 -8856
14202 -8856 -643 3055 -1746 -26905 -50797 -55853 -40948 -27071 -23167 -10884 -1266 -3247 -1403
14189 -1403 -7507 -17311 -3966 5187 -11011 -20331 -40656 -45933 -34160 -28151 -41369 -40597 -23699
14176b3699L60K157K651L497o904k382N976M921Q327j2270j7298N255K4094M84
14162d831K73p5o771m056J1330P487o383J336L273n192m549K261M286l285k4223
14147b9119o474J132J5175J5939q98j224r561j7289J318R266O428K697J0004j2947
14133a5553q122O725n158o598j715m789O259k678j1120r69L830Q757J0702J0561
14119i868l922k124j547K957L037J0122k320L750J9166m662j4910j3567k152P695
14105h345l652O145R027J2694L263j9624r646k947m44J4948j919j010k556n610
14091i676J806m230l921L725J1196P590q636q554o891j2236J3473R823m178p937
14077a8646k01K945o466J787N196m681m248k005q075J7933K0463M24p167K845
$$ plain form
14176 -23699 -23339 -21182 -18531 -15034 -21938 -24320 -18344 -13423 -5096 -17366 -34664 -29409 -5315 -4831
14162 -4831 -4558 -4633 -11404 -15460 -4130 3357 -3026 -1690 1583 -3609 -8158 -5897 -1611 -4896 -29119
14147 -29119 -35593 -34461 -19286 -3347 -4245 -5469 -15030 -32319 -31001 -21735 -15307 -12610 -2606 -15553
14133 -15553 -23675 -16950 -22108 -28706 -30421 -35210 -28951 -31629 -42749 -43718 -39888 -31131 -20429 -9868
14119 -9868 -13790 -15914 -17461 -14504 -11467 -1345 -3665 85 19251 14589 -321 -13888 -16040 -8345
14105 -8345 -11997 -5852 3175 15869 19132 -492 -10138 -13085 -13529 1419 -500 -1510 -4066 -9676
14091 -9676 -7870 -12100 -16021 -12296 -1100 6490 -2146 -10700 -17591 -29827 -16354 -6531 -10709 -18646
14077 -18646 -18847 -15902 -22368 -20581 -15385 -20066 -24314 -26319 -34394 -16461 4002 4426 -2741 104
14063A04N448N508m408o439j4683m407m451J0412Q619r839q716l038J791M845
14049a9254l546l642p119J6157J3740M749l879n486j301n881j3907q676J3479
14036b4566L818J146O907P582p321n82Q237J6443l812j4244j1250O65L117j7439
14022c1299Q410J2748O881o946j1029J3835J875K846p511o587l881J2890m66p354
14008a5588M708R697l613l070p365k378J5658q77j2162k409O618M862o018R589
13994b348R746q890m005j1323K750K447r72p976q687K551Q270L955O432N345k528
13979e233j3815M693M25J708O227q074J4918L209r387j1795r506J193L104o693
13965b9026R143K3933J5247N12r364m580j0695j2411l031J2370L150m416r192
$$ plain form
14063 104 5552 11060 6652 213 -14470 -18877 -23328 -12916 -4297 -14136 -22852 -25890 -24099 -19254
14049 -19254 -22800 -26442 -33561 -17404 -3664 1085 -2794 -8280 -9581 -15462 -29369 -38045 -24566
14036 -24566 -20748 -19602 -12695 -5113 -12434 -13016 -4779 11664 7852 -6392 -17642 -16977 -13860 -31299
14022 -31299 -22889 -10141 -3260 -10206 -21235 -7400 -5525 -2679 -10190 -16777 -20658 -7768 -8234 -15588
14008 -15588 -10880 -1183 -4796 -7866 -15231 -17609 -1951 -2828 -14990 -17399 -10781 -5919 -11937 -2348
13994 -2348 7398 -1492 -5497 -16820 -14070 -11623 -12595 -20571 -29258 -26707 -18437 -14482 -8050 -2705 -5233
13979 -5233 -19048 -14355 -13930 -12222 -5995 -14069 849 4058 -5329 -17124 -26630 -25437 -22333 -29026
13965 -29026 -19883 4050 19297 19809 10445 5865 -4830 -17241 -20272 -7902 -4752 -9168 -18360
13952a8360K398L461J0098n08j1467N995M100j4629l811r913P078P332n473m82
13938b4181p210L846K1688l220m01k420o517J027k871Q239R524j414j1233j3699
13924b8842Q976N558J0182J0411N200J809K11O719p689j4893O426M267p78L475
13910A1032J440n024j8504r015J3529o59L98M073n048j6402Q05P645J0292P64
13896d674J6415Q231J3187p343k1498q414P735j623q020r468j4124m087J1674
13883b2009K199p58r604l755J814P87nJ4123J3645P33K477n734p937K730K347
13868h947L789J0409J7575P880j7444j6513j2194n958O685J1763j552J893K402
13855b12k854j0283k544K764J2353P1j2102j795q620M969L929L812K053L046J080
$$ plain form
13952 -18360 -15962 -12501 -2403 -2911 -14378 -8383 -4283 -18912 -22723 -32636 -25558 -18226 -23699 -24181
13938 -24181 -31391 -27545 -5857 -9077 -9478 -11898 -18415 -17388 -20259 -12020 -2496 -3910 -15143 -28842
13924 -28842 -19866 -14308 -4126 6285 11485 13294 13505 20224 12535 -2358 4068 8335 7557 11032
13910 11032 12472 7448 -11056 -20071 -6542 -7201 -6803 -2730 -7778 -24180 -23375 -15730 -5438 -4674
13896 -4674 11741 19972 33159 25816 4318 -4096 3639 2016 -6004 -15472 -29596 -33683 -22009
13883 -22009 -19810 -20568 -30172 -33927 -32113 -31326 -31331 -17208 -3563 -2830 -353 -6087 -14024 -11294 -8947
13868 -8947 -5158 5251 22826 30706 13262 -3251 -15445 -21403 -14718 -2955 -4507 -2614 -212
13855 -212 -3066 -13349 -15893 -13129 -776 -705 -12807 -14602 -23222 -18253 -14324 -10512 -8459 -5413 -4333
13840d333N445m609Q253M757m322m541j6056o895Q976k985k52J2498L436k1339
13826b1967n427M522J7005R930j2194j3184L691M855K476J0897K107N177p663
13813B25q398n653j6073J3062J7532J844r303l592m33j1409n162K128L757L242
13799a8233L713M924p53M376Q289j459N985J4078L010j1255o615R304L313J0208
13785B8885j1837j6643q424n957o36J023M505J4106K1363n89p365j0497k4337
13772a6403o804Q503R24k655r967j75L94J0085q209N570k29N84j08k289O696L444
13756a0639k103q04K33J6896o831l806J240r989n113l123J835r04J6589K0392
13742A3873r084q484k393O217N529k594n739m971K766L878J0514j0622j4497m42
$$ plain form
13840 -4333 1112 -3497 4756 9513 5191 650 -15406 -22301 -13325 -16310 -16562 -4064 -628 -21967
13826 -21967 -27394 -22872 -5867 4063 -8131 -21315 -17624 -12769 -10293 604 2711 7888 225
13813 225 -8173 -13826 -29899 -16837 695 2539 -6764 -10356 -10789 -22198 -27360 -25232 -21475 -18233
13799 -18233 -14520 -9596 -10349 -5973 2316 857 6842 20920 23930 12675 6060 15364 18677 28885
13785 28885 17048 405 -8019 -13976 -14612 -13589 -9084 5022 26385 25796 18431 7934 -16403
13772 -16403 -23207 -14704 -13780 -16435 -26402 -26577 -26183 -16098 -24307 -18737 -18966 -18382 -18490 -20779 -14083 -10639
13756 -10639 -12742 -13546 -13313 3583 -3248 -7054 -5814 -15803 -20916 -24039 -22204 -23108 -6519 13873
13742 13873 4789 -3695 -6088 129 5658 3064 -2675 -7646 -4880 -1002 9512 -1110 -15607 -16049
13728a6049R589R870m897j648m558j476L884J5919l01j5191m048p685j1226J0899
13714a6918J3781J5860j639Q21R080J269k1242r412Q553n938j1761L645P204p400
13700a4097l812J1076R320k9554j2258J5497R100r18k358J1413J5229J762q556
13687A844r266j8299r726l824J1876P486N634p160n116O972R832N419j9089r702
13673c3119Q143m419r570J1667q875q796K191K2401j687j2620l02J0073K553k018
13659b4378P258r471M356M368J2853J2542p771L366R11l719O854n364p534q065
13645a3794j1993j35K0754q504j1848J0322k30k841N462j1085o709m813Q337J0416
13631a6661l201o310M341q17L147o23M436k614q115P042O069K178M596Q92K238
$$ plain form
13728 -16049 -6460 3410 -1487 -3135 -7693 -9169 -5285 10634 10333 -4858 -8906 -16591 -27817 -16918
13714 -16918 -3137 12723 11084 11905 20985 22254 1012 -8400 153 -5785 -17546 -13901 -6697 -14097
13700 -14097 -17909 -6833 2487 -27067 -39325 -23828 -14728 -15646 -18004 -6591 8638 10400 1844
13687 1844 -7422 -25721 -35447 -39271 -27395 -19909 -14275 -21435 -26551 -19579 -9747 -4328 -23417 -33119
13673 -33119 -24976 -29395 -38965 -27298 -36173 -44969 -42778 -20377 -22064 -34684 -34986 -24913 -22360 -24378
13659 -24378 -17120 -26591 -22235 -17867 -5014 7528 -243 3123 4034 315 7169 1805 -5729 -13794
13645 -13794 -25787 -25922 -5168 -13672 -25520 -15198 -15428 -18269 -12807 -23892 -30601 -35414 -27077 -16661
13631 -16661 -19862 -26172 -21831 -22648 -19501 -20124 -15688 -18302 -26417 -19375 -13306 -11128 -6532 -5640 -3402
13616c402K912q950q382N476P050M665q478K028J1023l065Q200O698k2220j7662
13602b4107J0906K49K193K481l45n885r215J1125P676o82j970J0497O192qj1729
13587b622q791p378J0961k111N233J6739k84j1837L046N780K657n818j5479j0988
13573b0892j218N751O298Q330o716O839Q068P871j5889k3844J0215J0683K3658
13560A9154p460j2284j5951q749M960J1313J7850M005k829l236q052j2478j0413
13547b4170j5730O881J4654J7584L992k326K200J095M285K597j5815q67K03n33
13533e950J97r763Q564O660K029j5633N16R284Q136n705Q934J1158j1139o290
13519I98k129K910K251n917j242J4895l572j2376L924K0563K568p695o946j3183
$$ plain form
13616 -3402 -490 -9440 -17822 -12346 -5296 -631 -9109 -7081 3942 877 9077 15775 -6445 -24107
13602 -24107 -13201 -12952 -10759 -8278 -8623 -14508 -23723 -12598 -4922 -5604 -7574 2923 9115 9107 -2622
13587 -2622 -11413 -18791 -7830 -9941 -4708 12031 11747 -90 2956 8736 11393 5575 -9904 -20892
13573 -20892 -22110 -16359 -10061 -1731 -8447 -1608 6460 14331 -1558 -25402 -15187 -4504 19154
13560 19154 11694 -590 -16541 -25290 -20330 -9017 8833 12838 10009 6773 -1279 -13757 -24170
13547 -24170 -39900 -33019 -18365 -781 3211 885 3085 4180 8465 11062 -4753 -5620 -5417 -5950
13533 -5950 -5753 -15516 -6952 -292 1737 -13896 -13380 -4096 4040 -1665 7269 18427 7288 998
13519 998 -1131 1779 4030 -1887 -3129 11766 8194 -4182 -258 20305 22873 15178 8232 -4951
13505d951o554J171Q462R331R743k5149k5088M866K1679k06p737l013l454m530
13491b5430M670Q881O607p76j775J173J4323J0485j252j7368n270R972R473j4434
13477g21r088N182J5834p246j5860j5406m354J5504Q475k75p158l490Q601J3477
13463C475L665j856j4852p608K85r93j953m799R805K534m573j935m168L19K388
13448b0266j931j0274N611K470O283l005L944N998J6195J4219j0966r724M5N293
13434C892L301L103r164n957p577m203J7698K879j5553J164J3002k390j932l490
13420e227r929k075P335r51L214J2514J3444N645q390j6918j4962p516p615P136
13406b4295n550J901J1417R885m720m108L60K319k227n887M094O719J3157o287
$$ plain form
13505 -4951 -11505 -10334 -1872 7459 17202 -7947 -33035 -28169 -6490 -6696 -14433 -17446 -20900 -25430
13491 -25430 -20760 -11879 -5272 -6048 -7823 -6650 7673 18158 16906 -462 -5732 4240 13713 -721
13477 -721 -9809 -4627 11207 3961 -11899 -27305 -31659 -16155 -7680 -7955 -15113 -18603 -10002 3475
13463 3475 7140 5284 -9568 -17176 -16891 -17884 -19837 -24636 -14831 -12297 -16870 -18805 -22973 -22654 -20266
13448 -20266 -22197 -32471 -26860 -24390 -18107 -21112 -17168 -11170 5025 19244 8278 -1446 -1401 3892
13434 3892 7193 10296 1132 -4825 -12402 -16605 1093 3972 -11581 -10417 2585 195 -1737 -5227
13420 -5227 -15156 -17231 -9896 -10847 -7633 4881 18325 23970 15580 -1338 -16300 -23816 -31431 -24295
13406 -24295 -29845 -27944 -16527 -6642 -11362 -15470 -15110 -12791 -15018 -20905 -16811 -10092 3065 -3222
13392c222M221j1847j2417j0884l810J3181N568P080Q345P787q781p038M702L050
13378d065J947L372M975L720j2661M650P325O640j674n851m064r256r296r643
13364b3881J7L334J1442k544j3506m900K3360N664q158m65k599j574n107j1113
13350c0030J6910K4827j4552j1290R664M524J0588j1313j2181k289J441J175J765
13337a0761K550J581Q253r468j8043q345N467K950j570j27J3458J2696j005n421
13323g785M51j471o04R965J638N05J924j582o289j2809O052l587N509o981N577
13308i487J7367j07l55p537o727j3706O955N622J767n887j3300n445N209J7644
13294g987k175J6681J3520L8r411q651p343O755j377j4667j6623k542J0304J0005
$$ plain form
13392 -3222 999 -10848 -23265 -34149 -37959 -24778 -19210 -12130 -3785 4002 -4779 -11817 -7115 -4065
13378 -4065 -2118 1254 6229 9949 -2712 1938 9263 15903 14229 8378 4314 -4942 -14238 -23881
13364 -23881 -23864 -20530 -9088 -11632 -25138 -30038 -6678 -1014 -9172 -9637 -12236 -13810 -18917 -30030
13350 -30030 -13120 11707 -2845 -14135 -4471 53 10641 -672 -12853 -15142 -13701 -12526 -10761
13337 -10761 -8211 -6630 1623 -7845 -25888 -34233 -28766 -25816 -27386 -27513 -14055 -1359 -2364 -7785
13323 -7785 -7334 -8805 -9409 556 2194 2699 4623 3041 -3248 -16057 -10005 -13592 -8083 -15064 -9487
13308 -9487 7880 7773 7418 -119 -6846 -20552 -13597 -7975 -6208 -12095 -25395 -30840 -25631 -7987
13294 -7987 -10162 6519 20039 20077 10666 2015 -5328 1427 50 -14617 -31240 -33782 -23478 -13473
13280a3473Q233O687j031m537j9152J2654R099n335L717j2492m718R038p22O6
13266a1966J1567K696R91j5324N712J3730l899l893j1390m758J512O798J1369
13253C145P648o326j4501J1983m107k0152n020N826N220p962l049k055L929O391
13239a9030J329J0456Q453p661j2160J2986J369L398L915j1836q919J2532Q191
13226C023J277l811N583P141P723m829m685o312o448r703m224J9790Q671O71j408
13211A2459K000m244j0096p183q1O072K059n670o131M27q770N399O869l816n30
13196a1236J3609J5917l37J529N573j3041j8922O385P076l818L269j619j2936
13183h551N383j761N825J0485M84n20j1763j3442N113M385J3353L575j0880j6271
$$ plain form
13280 -13473 -5240 1447 416 -4121 -23273 -10619 -1520 -6855 -3138 -15630 -20348 -11310 -12032 -11966
13266 -11966 -399 2297 3288 -12036 -6324 7406 3507 -386 -11776 -16534 -15022 -8224 3145
13253 3145 10793 4467 -10034 1949 -2158 -22310 -27330 -21504 -16284 -24246 -27295 -29350 -25421 -19030
13239 -19030 -17701 -7245 1208 -6453 -18613 -5627 -4258 -860 3055 -8781 -17700 -5168 3023
13226 3023 4300 489 6072 13213 20936 16107 11422 5110 -1338 -11041 -15265 4525 13196 13867 12459
13211 12459 14459 10215 119 -7064 -7145 -1073 986 -4684 -10815 -10388 -19158 -13759 -6890 -10706 -11236
13196 -11236 2373 18290 17953 19482 25055 12014 -6908 -523 6553 2735 6004 4385 -8551
13183 -8551 -3168 -4929 896 11381 11865 11345 -418 -13860 -8747 -4362 8991 12566 1686 -14585
13169a4585K391J614K815k625r19J295R964J2186l245o998o748K620Q83J4069
13155A2717l668o165R558M649j7850p737R816J3138J480n470M960m790P124J4402
13141C2164j8612k0423j391K176J670J0348J277j2136Q638l44o810p401P103q84
13127d625M034K058j849L232k185R946J106L395m477N561J3219L633q215P130
13113C1963L367j451p916j7310p603j2499j4076k576J3530J4322k169l033J3267
13100G816O086r221M16M954n199n368k20R164n689n110o287N99J558j5419O82
13085b1238P883m317j22N716l051K033M64L069n010J971J2227k999r843j0456
13071b3673Q127R470j10m562m037K32L650L166l371q542J4358m306J555Q117P02
$$ plain form
13169 -14585 -12194 -10580 -7765 -10390 -11309 -10014 -50 12136 8891 1893 -4855 -2235 -1352 12717
13155 12717 9049 2884 12442 17091 -759 -8496 1320 14458 15938 10468 15428 10638 17762 32164
13141 32164 13552 -6871 -8262 -6086 -4416 5932 7209 -4927 3711 3367 -3443 -10844 -3741 -4625
13127 -4625 -591 1467 -382 2850 665 10611 11717 15112 10635 16196 29415 33048 24833 31963
13113 31963 35330 33879 25963 8653 1050 -11449 -25525 -28101 -14571 -249 -2418 -5451 7816
13100 7816 13902 4681 5097 10051 4852 -516 -736 8428 2739 -2371 -8658 -8059 -6501 -21920 -21238
13085 -21238 -13355 -17672 -17794 -12078 -15129 -13096 -12632 -9563 -14573 -12602 -375 -3374 -13217 -23673
13071 -23673 -15546 -6076 -6186 -10748 -14785 -14553 -10903 -7737 -11108 -19650 -5292 -9598 -8043 74 776
13056G76j1874J2379J7450p248k329j365k562J5655K808l924j926q634p877J899
13042C228q541k494k406K700m348q905n636j0272j739J4419N612l33K413J0394
13028e908J8812j195j2754L033K852K37q297r544l569Q755K291j46R282j663j7957
13013a5771j1365J0872N425p891L887J2109J920j999n091k958o944l591j672J5947
12999g122L884j783J388r18l537j0038m784J242J881L833k899k378J7033P882
12985C684j7154j709k927l318N245P455N341J892N667J947j2535j1453L239J1625
12971c001m93j8921m044J5549j638N222P958j819l133K1O916O249K07q478j3136
12956a2541j0682o183O85J4510R091J3927P282j2081n924M438K582o585p994M595
$$ plain form
13056 776 -11098 1281 18731 11483 9154 7789 5227 20882 23690 19766 17840 9206 1329 3228
13042 3228 -5313 -7807 -10213 -7513 -11861 -20766 -26402 -36674 -38413 -23994 -18382 -18715 -16302 -5908
13028 -5908 12904 11709 -1045 1988 4840 5077 -3220 -12764 -16333 -7578 -5287 -5433 3849 2186 -15771
13013 -15771 -27136 -16264 -10839 -18730 -14843 -2734 -814 -2813 -7904 -10862 -17806 -21397 -23069 -7122
12999 -7122 -3238 -5021 -3633 -4551 -8088 -18126 -22910 -21668 -19787 -15954 -18853 -21231 -4198 3684
12985 3684 -13470 -15179 -18106 -21424 -16179 -8724 -3383 -1491 4176 6123 -6412 -17865 -14626 -3001
12971 -3001 -3494 -22415 -26459 -10910 -12548 -7326 632 -1187 -4320 -4299 2617 8866 9073 595 -12541
12956 -12541 -23223 -29406 -28721 -14211 -5120 8807 16089 4008 -1916 2522 5104 -1481 -9475 -4880
12942d880o129O3L926Q323q846m816M411k526K131Q957o29k954k782p129q18j0068
12926b3766J573M847R56N263K004j2963m591J625J0401K2275J6722N878k064q914
12912A9246j1896n822j6059r379L06o523o601J4772m170j301P466P093J3296l355
12898b927K445O691K644J607j1222j3652p62P870J1268J011l555o914k882R539
12884A161K651R411J0734n518k799o88q199q473p412l196Q024n581m281N352L865
12869d949l182M384J1604j4347l155J8104K960l41J133m276q37p393n107p779
12855a3181j405J2160J141n927K0389N769q121k2598O645Q156k03o48l581l251
12841d655N577J118L258Q055N24j1797L11r216r207M940L679O863J5370l651N73
$$ plain form
12942 -4880 -11009 -10946 -7020 1303 -7543 -12359 -7948 -10474 -8343 614 -15 -2969 -5751 -12880 -13698 -23766
12926 -23766 -22193 -17346 -16390 -11127 -9123 -22086 -26677 -25052 -14651 7624 24346 30224 28160 19246
12912 19246 7350 1528 -14531 -23910 -23604 -30127 -36728 -21956 -26126 -27427 -19961 -12868 428 -2927
12898 -2927 -482 6209 8853 10460 -762 -14414 -15176 -7306 3962 4973 1418 -5496 -8378 1161
12884 1161 3812 13223 23957 18439 15640 14952 6753 -1720 -9132 -12328 -4304 -9885 -14166 -8814 -4949
12869 -4949 -8131 -3747 7857 -6490 -9645 8459 11419 11078 12211 7935 7098 -295 -5402 -13181
12855 -13181 -14586 -2426 -1285 -7212 13177 18946 10825 -11773 -5128 3028 2825 2177 -1404 -4655
12841 -4655 922 2040 5298 13353 13877 2080 2391 -6825 -16032 -11092 -7413 -550 14820 11169 11742
12826A1742O293j0286j895J752J347l558N785K896J069l193o555p287K239J366
12812A715j0355j5032J2473J0409Q556j968k590j2599m68j536q718J701J7923
12799d89J89L876r350j4364q517K887K1740L959k3O533m567q622p649J784O182
12784f431R173N963L456j4321j5647Q937K744j184J45K060n877L363N820J5930
12770A4131j733j7956k0398j402M030O714O925n993p422K330O713q510p24J1090
12756a2205N156l694M468M15K919m612o163j3552P244j859O131r666N062J0411
12742i945K003n037l114K908j9000n57J5321J7825J399Q939j841j1661j1853N97
12728a4016K351N264N187P832O442o55Q87j694j085j6011l883J3880O273j1914
$$ plain form
12826 11742 18035 7749 5854 7606 8953 5395 11180 14076 15145 11952 5397 -1890 349 1715
12812 1715 -8640 -23672 -11199 -790 7766 5798 3208 -9391 -9859 -11395 -20113 -18412 -489
12799 -489 -300 3576 -5774 -20138 -28655 -25768 -4028 -69 -92 6441 1874 -6748 -14397 -12613 -6431
12784 -6431 2742 8705 12161 -2160 -17807 -8870 -6126 -7310 -7165 -5105 -10982 -7619 -1799 14131
12770 14131 12398 -5558 -25956 -27358 -23328 -16614 -9689 -15682 -23104 -20774 -14061 -22571 -23295 -12205
12756 -12205 -7049 -10743 -6275 -5860 -2941 -7553 -13716 -27268 -20024 -21883 -15752 -25418 -20356 -9945
12742 -9945 -7942 -12979 -16093 -13185 -32185 -32742 -17421 404 1803 10742 8901 -2760 -14613 -14016
12728 -14016 -11665 -6401 -1214 6618 13060 12405 13292 11598 10513 -5498 -9381 4499 10772 -1142
12714a142K719N257l550j3702O798m939K957o72m750M972K033K316N01m276L386
12699b092J99j0694J420P839o396j4945P434J3496P81l950J4140P366J6940L028
12685C4566j5355j9053j0679L625O429K049l584M281J676j1499o753k026Q395
12672g928J2399N932R245j5883k0235N54R687J5522m590m820J354Q971L937K468
12658A6613l903J1608N134j3877l194P920j7712j4745p575M861J1429K0058R045
12645B5662n158o307K273K06k725L794J0186M95j203m189q71K914R724r659q908
12630A6234j4886n677P528n769K332R028J441J966R876Q027j774k4826j0548P541
12616D93J0261j662j2935k537k625R515l268l224j0705q944M794J1726m4j776
$$ plain form
12714 -1142 1577 6834 3284 -10418 -3620 -8559 -5602 -6274 -11024 -6052 -4019 -1703 -1202 -5478 -2092
12699 -2092 -1893 -12587 -11167 -3328 -9724 -24669 -17235 -3739 -2958 -6908 7232 14598 31538 34566
12685 34566 19211 158 -10521 -6896 -467 1582 -2002 2279 3955 -7544 -14297 -16323 -7928
12672 -7928 4471 10403 19648 3765 -16470 -15916 -6229 9293 4703 -117 1237 10208 14145 16613
12658 16613 12710 24318 29452 15575 12381 20301 2589 -12156 -19731 -14870 -3441 16617 25662
12645 25662 20504 14197 16470 16676 13951 17745 27931 28426 27223 23034 22163 25077 34801 25142 16234
12630 16234 1348 -4329 3199 -2570 -238 8790 10231 12197 22073 30100 28326 3500 -7048 493
12616 493 10754 9092 -3843 -6380 -9005 510 -2758 -5982 -16687 -25631 -20837 -9111 -9155 -10931
12602a0931L527J2373p925j0130N447P414M177P2K992M523O636n643o776j2737
12588f981j1977o909M954J717N57J4075K24j167o106J2528R258J2191l909r261
12574I194k032j893j4940j1679M414P204J2049O177o687O230L884Q298J4226q915
12560B5530m530M814l537o302j0260j0300L691J0795J1363Q60r765M930P283j854
12546B2718k996M561k786j632M462j5629j0741n17M060J4582L63j0058j1765J724
12532c654J765O34m948J330P009j11N346N978m045n813M208J138J90p981j3216
12517a2170o9N615j0361r455J1877R230o99n214K918l306o426K044q123M103K1274
12502A238J897j659j9375n571R782k993M998J1612M501K603P180p751q098n216
$$ plain form
12602 -10931 -7404 4969 -2956 -13086 -7639 -225 3952 4024 7016 11539 18175 12532 5756 -6981
12588 -6981 -18958 -25867 -20913 -19196 -18639 -4564 -4340 -5507 -11613 915 10173 22364 18455 9194
12574 9194 7162 5269 -9671 -21350 -16936 -9732 2317 8494 1807 8037 11921 20219 34445 25530
12560 25530 21000 25814 22277 15975 5715 -4585 -894 9901 21264 22124 12359 17289 24572 22718
12546 22718 19722 24283 21497 19865 24327 8698 -2043 -2560 1500 16082 16445 6387 -5378 -3654
12532 -3654 -1889 -1255 -6203 -4873 2136 2025 7371 13349 9304 3491 7699 8837 9027 1046 -12170
12517 -12170 -12239 -6624 -16985 -26440 -14563 -5333 -6032 -11246 -8328 -11634 -18060 -16016 -24139 -20036 1238
12502 1238 3135 1476 -17899 -23470 -13688 -16681 -11683 -71 4430 7033 14213 6462 -1636 -6852
12488f852j4639K406o15Q983p89r62j696k858k273j1188l293J5042J7559j6372
12474a7547Q30K540l020P678o347l215J0395Q455o516N337R506m684p414Q495
12460D493N327Q726J705l596j4804R23j5074m90J1012L742j281r37L19R630O000
12445A5695O94m952m103N59j487n903m959Q45R880O336m202k926L676M616k89
12430A3480M126n650r263k258N184o66m906L574J167o963m925P680K920J804p285
12415a981m05K155k967P660J6182J0428q200m980l896k972J1156L692p817j3292
12401D763j4923L219M523N989k441M768n052M791J3150j5143r953n825L576Q358
12387b00M497j6333n669l777o85J3897P828n961m595L566J4152K865k1757L809
$$ plain form
12488 -6852 -21491 -19085 -19700 -10717 -11506 -12468 -14164 -17022 -19295 -30483 -33776 -18734 -1175 -17547
12474 -17547 -16717 -14177 -17197 -9519 -15866 -19081 -8686 -231 -6747 -1410 8096 3412 -4002 4493
12460 4493 9820 18546 20251 16655 1851 2774 -12300 -12790 -1778 1964 683 -254 65 9695 15695
12445 15695 16389 11437 7334 7893 6406 503 -4456 -3611 6269 12605 8403 5477 9153 13769 13480
12430 13480 17606 11956 2693 435 5619 4953 47 3621 4788 -2175 -7100 580 3500 5304 -1981
12415 -1981 -2386 -231 -3198 4462 20644 31072 22872 17892 13996 11024 22180 25872 18055 4763
12401 4763 -10160 -6941 -2418 3571 1130 5898 846 5637 18787 3644 -6309 -12134 -8558 -200
12387 -200 4297 -12036 -17705 -21482 -22167 -8270 -442 -6403 -10998 -7432 6720 9585 -12172 -8363
12373h363P819j8917p42k991J0898P847m688J3831J2539M043j4181n308m532N057
12359B312R90n21j814K692l34m118j0017n362J8759J8079j0841n952K161l906
12345B128n351l949o711m354P35L253q039M734J0039J1005J0567p270o444N804
12331F147K154q269q79m80j1311n226N388N103q719M759J5374j713n844j3357
12317a6873r677J275J943J0419j489j4674p381J0713R480P699p116N406J6691
12304F416K381m818O981j209L910m8nL010j1003Q688m257j2246K955R982J2295
12289B3032q153r780K422Q060N501k312N711r998r006j689J4784j0607n759M116
12275F322j3655r850J3069J6335J2076r361k0178j5000O446M766J254O113J3449
$$ plain form
12373 -8363 -544 -19461 -20203 -23194 -12296 -4449 -9137 4694 17233 21276 7095 1787 -2745 2312
12359 2312 3302 2781 967 3659 3325 -793 -10810 -16172 2587 20666 9825 3873 6034 2128
12345 2128 -3223 -7172 -13883 -18237 -17502 -14249 -22288 -17554 -7515 3490 14057 6787 343 6147
12331 6147 8301 32 -847 -1327 -12638 -17864 -12476 -7373 -16092 -11333 4041 2328 -3516 -16873
12317 -16873 -26550 -25275 -23332 -12913 -14402 -29076 -36457 -25744 -16264 -8565 -15681 -10275 6416
12304 6416 8797 3979 10960 9751 13661 13613 13608 16618 5615 14303 10046 -2200 755 10737 23032
12289 23032 14879 5099 7521 15581 21082 18770 24481 14483 5477 3788 18572 7965 2206 6322
12275 6322 -7333 -17183 -4114 12221 24297 14936 -5242 -20242 -13796 -9030 -7776 -1663 11786
12262A1786J27j7228j57M00k865Q146Q796R538q520o232j1251m118K072J0216
12248G10l986M21P127M563q394l567j0653q516J5972J336M607k427k305L030L130
12233A048j4280k236L773n90O605r49R396J507j4277J0962j0595r350N279J0818
12219b889J670m350J5420J5720J1700j2991j7368j618k870p294L754J2389k53
12206A1020o273J0482j1704j3237K40k424l858m237O125R695l093k808k874O436
12192f510L743j8223o316J1504J996p271p770Q514k220O59J7675K694o000K197
12178e328m897J0811J602M325k87J0291m994j9192K178N926O863K842o60J1676
12164B1156M999p224j4991l660j26q30O948M571k477J4200m66q234q576n202N024
$$ plain form
12262 11786 11913 -5315 -5472 -5072 -7937 209 9005 18543 10023 3791 -7460 -11578 -9506 710
12248 710 -3276 -2855 4272 8835 441 -3126 -13779 -22295 -6323 -4987 -380 -2807 -5112 -2082 1048
12233 1048 -13232 -15468 -11695 -12285 -5680 -6629 2767 4274 -10003 959 -9636 -18986 -13707 -2889
12219 -2889 -1219 -5569 9851 25571 37271 24280 6912 5294 2424 -4870 -1116 11273 11020
12206 11020 4747 15229 3525 -9712 -9472 -11896 -15754 -19991 -13866 -4171 -7264 -10072 -12946 -6510
12192 -6510 -2767 -20990 -27306 -15802 -13806 -21077 -28847 -20333 -22553 -21894 -4219 -1525 -7525 -5328
12178 -5328 -10225 586 2188 6513 6226 16517 11523 -7669 -5491 435 7298 10140 9480 21156
12164 21156 26155 18931 3940 280 154 -676 6272 10843 8366 22566 22100 13866 5290 88 5112
12149E112m349m995n162r054J5634Q866j9939L19P78k362r177J0686m453o930
12135b5026P091J290L017J7124O683o857J139J9160J2010j3616j7033o299j6394
12122a7711N786K877M147P263n662k0291l962p645O469L81K980N053P090P362
12108e863p108p948K965M373m774P753Q946N862K527l668k059k375J368j640o801
12093h442P681P471q720l450L681J288j6403k271j765j1627P01J7724J9516k728
12079B656J4O305J1461K006n908l899j2561o165l072l88J3697Q964O212j000j0514
12064G808o039j2361j9784o682L030j801J5757J1297R75P800J4016K437k5714
12051i261j9065P939K0895N439m13N471o429Q814O840R2m415O025O494l52n750
$$ plain form
12149 5112 763 -4232 -9394 -18448 -2814 6052 -13887 -13568 -12790 -15152 -24329 -13643 -18096 -25026
12135 -25026 -17935 -16645 -13628 3496 10179 3322 4461 23621 35631 22015 4982 -1317 -17711
12122 -17711 -11925 -9048 -4901 2362 -3300 -23591 -27553 -35198 -28729 -28348 -25368 -20315 -13225 -5863
12108 -5863 -12971 -20919 -17954 -13581 -18355 -10602 -1656 4206 6733 3065 1006 -1369 -1 -1641 -8442
12093 -8442 -761 6710 -2010 -5460 -1779 -491 -16894 -19165 -20930 -32557 -31856 -14132 5384 2656
12079 2656 2670 8975 20436 22442 16534 12635 74 -6091 -9163 -9551 4146 13110 19322 18322 7808
12064 7808 1769 -10592 -30376 -37058 -34028 -35829 -20072 -8775 -7800 0 14016 16453 -9261
12051 -9261 -28326 -20387 508 5947 5534 11005 4576 13390 20230 20322 15907 21932 28426 28074 22324
12036B2324k954K183K81J471n789j3508O871M439j2250K18m032n910p793k608
12022a7057J383O233N295O414L655q358P68p564o665P043k14Q07K445K045L693
12007g7p53J730l079m042p13J977m580k415N689N95k86O424J3260M046m781m033
11991H962o521k580q753j1338m439J0443K648M755R799M451n076m356O346m519
11977a78k356N158O055r345J012j0294r624P495L514p661P729Q542k255p473j5014
11962b4695L665L291J266P217R020J3528m946j9582N95J3489p428q065J0312l357
11948e690n079j1628M579J4975R107j1218N760J2900l041n486Q569l614K34l088
11934G280j0398J677p740K856K859j0668j0431J105J5773O335l235j5126n963
$$ plain form
12036 22324 19370 21553 21834 23305 17516 4008 10879 15318 3068 3286 -746 -6656 -14449 -17057
12022 -17057 -15674 -9441 -4146 2268 5923 -2435 -1667 -9231 -15896 -8853 -9067 -8260 -5815 -3770 -77
12007 -77 -830 900 -2179 -6221 -6934 -4957 -9537 -11952 -6263 -5668 -5954 470 13730 17776 12995 8962
11991 8962 2441 -139 -8892 -20230 -24669 -14226 -11578 -6823 2976 7427 2351 -2005 4341 -178
11977 -178 -2534 2624 8679 -666 346 -9948 -19572 -12077 -8563 -16224 -8495 47 -2208 -9681 -24695
11962 -24695 -21030 -17739 -16473 -9256 -236 13292 8346 -11236 -10641 2848 -4580 -12645 -2333 -5690
11948 -5690 -10769 -22397 -17818 -2843 6264 -4954 806 13706 10665 5179 13748 10134 10368 7280
11934 7280 -3118 -1441 -9181 -6325 -3466 -14134 -24565 -23460 -7687 -1352 -4587 -19713 -25676
11921b5676J8422J3881J4812p39o593K375r410r771m643j351P76L99J5464Q908
11907A6854j4094o600n674O632J68M782m007p780R393J0832J179M289o740o706
11893B528P732J0303J902n804J3257R157j2949p011P139o422j2067o720K1393
11880B2438l970j7633p591P849L118o956L176M743p286J461R820j395j267Q821
11866A5328k163k382o710j1869m530J0888J2510j733l208r074m021l49m858J0833
11852a338K488k358r424n498P709J5739R375j0431j1970m021l685m602J6431m863
11838f448n907q10L860P333J013m106r211k703J2988N521n305k544o778r910j4306
11823c7313R364J3647K20J5484J296l64K768K212k45J228j0633Q84J166J1989
$$ plain form
11921 -25676 -7254 6627 21439 20700 14107 16482 7072 -2699 -7342 -8693 -7917 -7518 7946 16854
11907 16854 2760 -3840 -9514 -2882 -2714 2068 -1939 -9719 -326 10506 11685 15974 9234 2528
11893 2528 10260 20563 22465 16661 29918 39075 26126 19115 26254 19832 7765 1045 22438
11880 22438 18468 835 -6756 1093 4211 -2745 431 5174 -2112 -651 9169 7774 6507 15328
11866 15328 13165 10783 4073 -7796 -12326 -1438 11072 9339 6131 -2943 -6964 -7313 -12171 -1338
11852 -1338 1150 -1208 -10632 -16130 -8421 7318 16693 6262 -5708 -9729 -13414 -18016 -1585 -6448
11838 -6448 -12355 -13165 -9305 -1972 -959 -5065 -14276 -16979 -3991 1530 -3775 -6319 -13097 -23007 -37313
11823 -37313 -27949 -14302 -14082 1402 2698 2334 5102 7314 7069 8297 -2336 -1452 -286 11703
11809A1703j1520q776k456n625k026Q898K695R310R450Mj0953O839P723r946q68
11794D452J2033O5j2838q514M546L332N812J57J6986O134m703j9992P364O08N11
11779A5953j3041M590j935J464J664J6619k757j1959k2239K842J1160n878P770
11766D253Q832L519j2980j2314J4219L643j2287K899q588k604P420O626K460j289
11752C809L795K134J841l188K825L16k143o301M912M500Q111n099j2275l697K312
11737A852M952j068p252j369K087m377j2643J1513N585j2119q618N163N194K0695
11723I595O824O165J9401j319r217o518r256K54n998l610R862O103j798k0398
11709I0j6100J969o146L894K711l351O181Q157o27P298J6112j317o473j2843j304
$$ plain form
11809 11703 183 -8593 -11049 -16674 -18700 -9802 -7107 2203 11653 11657 704 7543 15266 5320 4452
11794 4452 16485 16550 3712 -4802 -256 3076 8888 9045 26031 32165 27462 7470 14834 15442 15953
11779 15953 2912 7502 5567 7031 8695 25314 22557 10598 -11641 -8799 2361 -3517 4253
11766 4253 13085 16604 3624 -8690 5529 9172 -3115 -216 -8804 -11408 -3988 2638 5098 3809
11752 3809 7604 9738 11579 8391 11216 11532 9389 3088 8000 12500 20611 15512 3237 -460 1852
11737 1852 6804 5736 -1516 -2885 -798 -5175 -17818 -6305 -720 -12839 -21457 -16294 -11100 9595
11723 9595 16419 22584 41985 40666 31449 24931 15675 15929 9931 6321 16183 22286 20488 90
11709 90 -16010 -14041 -20187 -16293 -13582 -16933 -10752 -2595 -3222 4076 20188 18871 12398 -445 -1749
11694a749Kk321M199k394l400J312O24o991j0789O931L105r1N117l306q399Q480
11678i670K1627J3901P389P549k057j0910n889k907p575j3079l996l766n426n58
11664a5367QO669K724Q652l824N98J5194J1782j3975j9507k621K3040Q499n165
11650A6707q491R802R417o807r260q30n053m739o577q514j1714J3897Q35O489
11636d838J4137J411q898Q000N676o19j1456K568M421P267M568P706L193n565
11622B7571q893j3129J434K29l978R321Q778j4476k708J403M667r271j0111J6649
11608G486J8288j1636p37k847j1226p93J5950Q860n507j092R46o014j4605n953
11594h880J0386J781K727k666j0059l850P093O427L415N742m894K861r16j0088
$$ plain form
11694 -1749 -1747 -4068 131 -2263 -5663 -4351 -3727 -10718 -21507 -14576 -11471 -11562 -6445 -9751 -18150 -9670
11678 -9670 11957 25858 33247 40796 38739 27829 21940 19033 11458 -1621 -5617 -9383 -14809 -15367
11664 -15367 -15359 -8690 -5966 2686 -1138 -540 14654 26436 12461 -7046 -9667 13373 21872 16707
11650 16707 8216 18018 27435 20628 11368 10538 5485 746 -5831 -14345 -26059 -12162 -11327 -4838
11636 -4838 9299 10710 1812 9812 15488 14869 3413 5981 10402 17669 22237 29943 33136 27571
11622 27571 18678 5549 6983 7212 3234 12555 21333 6857 4149 5552 10219 948 -9163 7486
11608 7486 25774 14138 13401 10554 -672 -1465 14485 23345 17838 16746 17692 11678 -2927 -8880
11594 -8880 1506 3287 6014 3348 -6711 -10561 -3468 2959 6374 12116 7222 10083 9167 -921
11580i21J972Q008J6682J72j0468p867P468K271k734K96P48r379m181m647p164
11565i744J1662l472l851q631L860q92M311M297P09L87O089J906J0679M647j1140
11550A0817l93l433P38M991Q492j364j4549n550n447p695M650J7995J2074o651
11536A4675M975P949k292j1580o421L05O108J94J963j2126j5118L759J0390P716
11522A0497r234K906J0190J0039m962q950j0043j8015j1224J8268N496l051l278
11509a1361L621k613O287K548J2538J0257j1351q389J4526J1827O466j0767k2107
11496A482j1438J935J8249J9175n4j662r178K016l43N945M603j0761J1900P486
11482C9355j6215o286L46Q703L844r092m481o92L891j676j9231M001k303l031
$$ plain form
11580 -921 1051 9059 25741 25913 15445 7578 15046 17317 14583 14879 15627 6248 2067 -2580 -9744
11565 -9744 1918 -1554 -5405 -14036 -10176 -11068 -6757 -2460 -1751 -1364 4725 6631 17310 21957 10817
11550 10817 10424 6991 7729 12720 21212 19848 5299 -251 -5698 -13393 -8743 9252 21326 14675
11536 14675 19650 27599 25307 13727 7306 7611 13719 13913 15876 3750 -11368 -7609 2781 10497
11522 10497 1263 4169 14359 24398 19436 10486 443 -17572 -28796 -10528 -5032 -8083 -11361
11509 -11361 -7740 -10353 -4066 -1518 11020 21277 9926 1537 16063 27890 34356 23589 1482
11496 1482 -9956 -8021 10228 29403 29349 27687 18509 20525 20182 26127 30730 19969 31869 39355
11482 39355 23140 16854 17200 25903 29747 20655 16174 15482 19373 17697 -1534 2467 164 -2867
11468b867l679J574J894j0889O209K924l384l790j750R381R978P892N948O567
11454B6008K141o898L209m377n441j937Q661n729j3068n738Q909M563k318K129
11440A0114K33J3258r1j188l594k779J1907M94l997q771O677O252Q213M560j8652
11425B2636j0622O46L013r225l67Q903o964o798J6762J859k219j2706O986J2463
11411B4367Q066L518j5423k655R990O888J61j0368k4720N468R422l728L136R927
11397B4049K0509L243r557j2392k644Q166j320L774j4923j8082Q222M051O285
11384A9381L129j2789O576p035j003j861K842R096j363j5481k859P372J0829k788
11370A4046j2176O393O741Q661n06r592j8639k719J1219j290L309o94K561J821
$$ plain form
11468 -2867 -6546 -4972 -3078 -13967 -7758 -4834 -8218 -12008 -13758 -4377 5601 13493 19441 26008
11454 26008 28149 21251 24460 20083 14642 12705 21366 15637 2569 -3169 5740 10303 7985 10114
11440 10114 10347 23605 23514 22326 18732 15953 27860 28354 24357 15586 22263 28515 36728 41288 22636
11425 22636 12014 12660 15673 6448 6081 14984 8020 1222 17984 19843 17624 4918 11904 24367
11411 24367 32433 35951 20528 17873 27863 34751 34912 24544 -176 5292 14714 10986 14122 24049
11397 24049 44558 47801 38244 25852 23208 31374 30054 33828 18905 823 9045 13096 19381
11384 19381 22510 9721 16297 9262 8259 6398 9240 18336 16973 1492 -1367 6005 16834 14046
11370 14046 1870 8263 15004 23665 23159 13567 -5072 -7791 3428 2138 5447 4753 7314 9135
11356I135J4570M869p270p650L687L614O266J599j3151o985M363J1018J0367q267
11342B6165J0031J0274j2318j8446k260J3359j3306j6052j003J2855L189R62K036
11329A5486J663q598p536M753k820N263J045L509k058o298L265J850K517l531
11315H510k250l198R734O214J5110O456j288p315q752q339M822j0506k461m3k017
11300D677j963O249K796m193K766n779o730J2302J1912J914J0909P463J595l100
11286D0818j5862q28N851k701l573k603K18n820M341M327j4611p967M925J8736
11272B5251J1348m147l01L941j175m517n753J0230L211R204m156R020p074k3439
11258B1643m288o881p080j903R024J0913j150k585j5392J88J7155O983J3121j6062
$$ plain form
11356 9135 23705 28574 21304 13654 17341 20955 27221 28820 15669 8684 13047 24065 34432 26165
11342 26165 36196 46470 34152 15706 13446 26805 13499 -2553 -3556 9299 12488 13450 15486
11329 15486 17149 8551 1015 5768 2948 8211 9256 12765 10707 4409 7674 9524 12041 8510
11315 8510 6260 3062 12796 19010 34120 40576 39288 31973 23221 14882 19704 9198 6737 6694 4677
11300 4677 2714 8963 11759 7566 10332 4553 -2177 10125 22037 23951 34860 42323 43918 40818
11286 40818 24956 24128 29979 27278 23705 21102 21320 15500 19841 24168 9557 1590 6515 25251
11272 25251 36599 32452 32151 36092 34917 30400 24647 34877 38088 47292 43136 52156 45082 21643
11258 21643 17355 10474 3394 1491 10515 21428 20278 17693 2301 2489 19644 26627 39748 23686
11244B3686K706L145M835p15p913O09p992L009R540M048n377p970J9j9198R399
11229A1831J2166n021L971L933O408m760L323O259P623M979L000j3476p603j6645
11215A5988j4745j4546N528P249o125j772Q49J5230J9787O349p497j4916r860
11202A519L175j096k540N445J3650O827j518l848j1130o716o953n809J0865o270
11188d399j5677M170J2887L285O012n402l213j0749p212P273J7349P903j0430
11175A797J32N652l43L438N044P99j472j202n347p487l621J2428J7598j662l090
11160B2664j057L271Q666J725N492N090m516N809J295j157j2989k005N449N134
11146D2871k352l731j802j1208j6047M0K1730N714M47Q621k091j4893M781o997
$$ plain form
11244 23686 26392 29537 34372 33657 25744 26353 18361 21370 30910 34958 29581 21611 21630 2432 11831
11229 11831 23997 18976 22947 26880 33288 28528 31851 38110 45733 50712 53712 40236 32633 15988
11215 15988 1243 -13303 -7775 -526 -6651 -8423 -7574 7656 27443 33792 26295 11379 1519
11202 1519 4694 3598 1058 6503 20153 26980 25462 21614 10484 3768 -3185 -8994 1871 -4399
11188 -4399 -20076 -15906 -3019 266 6278 876 -2337 -13086 -20298 -13025 4324 12227 1797
11175 1797 1929 7581 7238 10676 15720 16519 15047 13845 8498 1011 -2610 9818 27416 25754 22664
11160 22664 21607 24878 33544 35269 40761 45851 41335 47144 48439 47282 34293 32288 37737 42871
11146 42871 40519 36788 34986 23778 7731 7771 29501 35215 35662 44283 42192 27299 32080 25083
11132B5083N09M257q572p853J183o282K2072J1857K704P513q082j0903j747r35
11118C0804n677J3706K343j3213P131J475j2809l559J3772J0891K717P103n848
11105D8836j5730o949j536J2863K266r005J3547J5207j4908j5990N392J1743o283
11092C9453j703P120j198K053l434q17J230J0284j657L678r127Q500j4794j0660
11078B8928j3049n795O780M943K0630L135p82m917l338l936K068N03k760r336
11064B3074L19J8813J933J581l742P53k816M488o253o431k1813J1669J1368O96
11050C3639R288N616N134j1763N137M353q960K41j3498l89q047k730Q95J280N861
11035B6057J5589R27p048k460N033k912M621N077j05M269j596m693K262j753j496
$$ plain form
11132 25083 25592 29849 21277 13424 14607 8325 30397 42254 44958 52471 44389 33486 31739 30804
11118 30804 25127 38833 41176 27963 35094 36569 23760 20201 33973 44864 47581 54684 48836
11105 48836 33106 26157 24621 37484 39750 30745 44292 59499 44591 28601 33993 45736 39453
11092 39453 37750 44870 43672 45725 42291 41474 42704 52988 51331 55009 45882 54382 39588 28928
11078 28928 15879 10084 16864 21807 42437 45572 44790 39873 36535 32599 34667 35170 32410 23074
11064 23074 23393 42206 44139 45720 41978 42731 39915 44403 38150 31719 9906 21575 32943 33639
11050 33639 42927 48543 53677 41914 47051 51404 42444 42685 29187 28798 20751 18021 18916 20196 26057
11035 26057 41646 42573 35525 33065 38098 35186 39807 44884 44779 49048 47452 42759 45021 43268 41772
11020D1772L572J4715Q944l545j0128k4405j3727J058J0410R666O476J3653L02
11007E8763j9115m925R084l723N142m432N845K383N956L670k414o444j1711j1428
10993B6651j4813O80M643K3763O146J612j407q704J1039L839l049J1209Q731k1591
10979D8749n233Q014J6343J790p962j4113K769M751j4368j3546O791P704n931
10966C5758o015M382K0659Q565r201l974l401o689Q060K576l476J1872j939r783
10952D7394r370L795o173m042J1445J0775q522j301P522m937J258R189j1963m144
10938D0926R604R87q190K057O799N073r140K038P8M777l979o191j2171J1620J2764
10923E7052J905r549j2522J0645J2344L523n189l438n016J083o045j828Q230K2655
$$ plain form
11020 41772 45344 60059 69003 65458 55330 30925 17198 18256 28666 38332 44808 58461 58763
11007 58763 39648 34723 43807 40084 45226 40794 46639 49022 54978 58648 56234 49790 38079 26651
10993 26651 11838 12518 17161 40924 47070 48682 47275 38571 49610 53449 50400 61609 70340 48749
10979 48749 43516 51530 67873 69663 61701 47588 50357 55108 40740 27194 33985 41689 35758
10966 35758 29743 34125 54784 63349 54148 50174 46773 40084 48144 50720 47244 59116 57177 47394
10952 47394 38024 41819 35646 31604 43049 53824 45302 44001 51523 46586 47844 57033 45070 40926
10938 40926 50530 51517 43327 45384 52183 57256 48116 50154 50232 55009 51030 44839 32668 44288 57052
10923 57052 58957 49408 36886 47531 59875 63398 58209 54771 49755 50838 44793 42965 51195 73850
10909G3850L36j6293r598m595P847N567L43J6711K2137j1209r664k034o438j440
10895F5520m282R47l323L089j320J4510J6174j1878k605K354N590J0150p419q545
10881G8962m991j1723l478J7203k93q228k732l778l325O220j498m870O423J0605
10867G4497L550j4347M321R055r219J951p010K154m917J213N17p483O666J0138
10853G1086l89J223p763P812Q318K137m879m618K678l751p452j2730L681O759
10839F2112R317R741k097o329l588O055q860n401l03K297J155j004K615j3244
10825E2466M622Q895M337J021K304j8762n454Q300K143j1212m655J2264J4941
10812G1210j3936l083L201Q003j9300j1178Q504P694J2227Q329m246M998o550
$$ plain form
10909 73850 74186 57893 48295 43700 51547 57114 57457 74168 96305 85096 75432 73398 66960 65520
10895 65520 61238 62185 58862 61951 60631 75141 91315 79437 76832 79186 84776 94926 87507 78962
10881 78962 73971 62248 58770 75973 75680 67452 64720 60942 57617 63837 62339 57469 63892 74497
10867 74497 78047 63700 68021 77076 67857 69808 62798 64952 60035 61248 61765 54282 60948 71086
10853 71086 70697 71920 64157 71969 80287 82424 77545 72927 75605 71854 64402 51672 55353 62112
10839 62112 71429 81170 79073 72744 69156 75211 66351 60950 60647 62944 64099 63095 65710 52466
10825 52466 57088 65983 70320 71341 73645 54883 49429 57729 59872 48660 44005 56269 71210
10812 71210 57274 54191 57392 65395 46095 34917 43421 51115 63342 71671 67425 72423 65873
10799F5873k030M458j606o956j1884l479K501N454L158l320j2715j047K0726R94
10785F0127J349J1601R160j74O170n875j1639l438J2520O122k774K789N44j691
10771H4791J2296j9201j1815K0818J3177N794j849j6983j63n333J990O359N830
10758I5711j3565p720J1473L302O773J4606K230K190P139o712K2887O671j3957
10745A31028m876P17N482J1450j6415j4892n806L271J3096L2L949r261j424Q07
10731A17158L997J0807J114R619m591j0973r417O18J2431J356l548j3340J0521
10718A25752R508M565J8631j4861p964p673p884o325M266Q384J058j7262j193
10705A09002L695j5280N278J3054J719M723J3839J272R06J0255R663R614P030
$$ plain form
10799 65873 63843 68301 66695 59739 47855 44376 46877 52331 55489 52169 39454 38407 59133 60127
10785 60127 61476 73077 82237 82063 88233 82358 70719 67281 79801 85923 83149 85938 86482 84791
10771 84791 97087 77886 66071 86889 100066 105860 104011 87028 86865 81532 83522 89881 95711
10758 95711 82146 74426 85899 89201 95974 110580 112810 115000 122139 115427 138314 144985 131028
10745 131028 126152 126869 132351 143801 127386 112494 106688 109959 123055 123087 127036 117775 116351 117158
10731 117158 121155 131962 133076 142695 138104 127131 117714 118332 130763 132119 128571 115231 125752
10718 125752 135260 139825 158456 143595 135631 127958 120074 113749 118015 126399 127457 110195 109002
10705 109002 112697 97417 102695 115749 117468 122191 136030 137302 138208 148463 158126 167740 174770
10692A74770K303N17o716l168K684N48J2551R901M92K142M46J0846K4707J4721
10678B46744J0470j9287k2804p249j2588r548j4339k0069j9657L309Q834L073
10666A46889p443L408K7682O165K3653J7598J3559J2167N671p77Q594J9149J4853
10653B91168L5530M3872N6253O9660P2251R1581J15333J17537J35862J57111J75595
10642A361753J91541J79031J57497Q2925j8754o9718q5751o8202j12828j97295
10632A420199k23022j90222j25779p4444o571M2056P0332J00536J14189J34442
10622A261716J51203J44094J58360J77584J92872J55803N9829n5035j74857k57663
10612A813906k90645k80921k35319j69132j13265p1128n0247l4660l2291l3527
$$ plain form
10692 174770 177073 177590 170874 167706 170390 170938 183489 193390 193882 196024 196470 207316 232023 246744
10678 246744 257214 237927 215123 207874 195286 185738 171399 151330 131673 134982 143816 146889
10666 146889 139446 142854 170536 176701 200354 217952 231511 243678 249349 248572 257166 276315 291168
10653 291168 326698 370570 426823 496483 568734 660315 775648 893185 1029047 1186158 1361753
10642 1361753 1553294 1732325 1889822 1972747 1953993 1884275 1798524 1730322 1617494 1420199
10632 1420199 1197177 1006955 881176 806732 800161 842217 912549 1013085 1127274 1261716
10622 1261716 1412919 1557013 1715373 1892957 2085829 2241632 2301461 2246426 2071569 1813906
10612 1813906 1523261 1242340 1007021 837889 724624 653496 603249 568589 536298 502771
10602E02771l0150k5384k2114k8766r524N556J5455o58j3462j8595k6470k4945
10590C23714j8525j8849k271k062m045j2848n961n80P325K644N457r805j602K127
10576B64719n708j2648n146O397j3589k0680j1654l273J501j0883m089J351L66
10563A86664m548P560K933K154O995j0992k308J1759Q04J42L40k59J9630O690
10549B27564k175J3587J5098R536j551M587K216L97K421Q532k1196J148j0104
10536B50060k5609N006J568p990O661O173J2552N208k0475j5977J2911J1978K754
10523B44820r699j0215l774M765j1940M857K1193M219j9898j8720Q710J3257K890
10510B30465o007j932O448P353K2239K3857K0514l707O474K4415K5660L6164K1449
$$ plain form
10602 502771 472621 447237 425123 396357 386833 392389 407844 407186 393724 375129 348659 323714
10590 323714 305189 286340 284069 282007 277962 265114 259153 258573 265898 268542 273999 264194 262592 264719
10576 264719 259011 246363 241217 247614 234025 213345 201691 198418 199919 189036 184947 186298 186664
10563 186664 182116 189676 192609 194763 201758 190766 188458 200217 201021 201163 201503 201244 220874 227564
10549 227564 225389 238976 254074 263610 262059 266646 268862 269259 271680 280212 259016 260164 250060
10536 250060 224451 229457 231025 223035 229696 235869 248421 253629 233154 217177 230088 242066 244820
10523 244820 235121 224906 221132 225897 213957 218814 240007 244226 224328 205608 214318 227575 230465
10510 230465 224458 222526 228974 236327 258566 282423 302937 299230 305704 330119 355779 391943 413392
10497D13392J7328K9040L8360L7847M4442K4995K5715N5629M9849L1002N692L419
10485G76710M083J0428k052k8651m3263j2815j2830o131P236N076k869Q728J9515
10472G23165N1902M3757K0237q198l4571m4974p1279o9475p1668o0813m6753l7693
10460C93637k3681k1359j0812J1876J0657n21O199K7325L4839J3795J1458J0092
10448D63505N106k0522n0285m7099m1297j7809j1525p710n537p314J096j0457
10436B50152l736o145L534J0271J0407j3414q945O945Q607r209j2361k6237o459
10423B03410J659M677m252J1657o64R181J6007J1328L870M976M506J567L293n673
10409B65542j0316j1492k3780n199J5922p616O884J2826K3373K6584J3041O750
$$ plain form
10497 413392 430720 459760 498120 535967 580409 605404 631119 686748 736597 767599 773291 776710
10485 776710 780793 791221 789169 760518 717255 704440 691610 685479 692715 697791 694922 703650 723165
10472 723165 775067 818824 839061 830863 796292 751318 680039 610564 538896 478083 431330 393637
10460 393637 369956 348597 337785 349661 360318 359797 365996 393321 428160 441955 453413 463505
10448 463505 468611 448089 397804 350705 309408 291599 280074 272364 266827 259513 260609 250152
10436 250152 246416 240271 243805 254076 264483 251069 242124 249069 257676 248467 236106 209869 203410
10423 203410 205069 209746 205494 217151 216487 225668 241675 253003 256873 261849 266355 267922 271215 265542
10409 265542 255226 243734 219954 214755 230677 223061 229945 242771 266144 292728 305769 312519
10397C12519K6446L5219K9456K4212L645J1395J2731J2056J5069K0114K0763Q545
10385E32170Q14J2985K3656K3014K6482K0461L8530L4531L2761O7978O1108O9910
10373I44400Q4691R1998P0583O9647Q4491O5424N6541N3527M1144J4698p893m2724
10361A526527j2114p27k0969k9275j4552j9650L155K7577N0419N9128M8410M7365
10349A665294O2332L5867J3373l5150n9886o5382p4570q3970p5142p2837n9563
10338A250366l2528k8228j8114j770j6122n590J2253J3552J6594K7896K9030K7565
10326A274904L0195L3998L3661M6687N2330N0433N0605M0415L8192L2418J8425
10315A702263L1500M3754P0099P4181N3864M3671L5515M9062N7443O1371P5074
$$ plain form
10397 312519 338965 374184 403640 427852 431497 442892 455623 467679 482748 502862 523625 532170
10385 532170 532984 545969 569625 592639 619121 639582 678112 712643 745404 813382 874490 944400
10373 944400 1029091 1121089 1191672 1261319 1345810 1411234 1467775 1521302 1562446 1577144 1569251 1526527
10361 1526527 1514413 1513686 1492717 1463442 1448890 1429240 1432395 1459972 1510391 1569519 1617929 1665294
10349 1665294 1727626 1763493 1776866 1741716 1681830 1616448 1541878 1457908 1382766 1309929 1250366
10338 1250366 1217838 1189610 1171496 1169726 1153604 1148014 1160267 1173819 1190413 1218309 1247339 1274904
10326 1274904 1305099 1339097 1372758 1419445 1471775 1522208 1572813 1613228 1651420 1683838 1702263
10315 1702263 1733763 1777517 1847616 1921797 1975661 2019332 2054847 2103909 2161352 2222723 2297797
10304B297797P4855P4888P3453P9152P8640Q7965R9199Q1352P4925Q2690O8049
10293C172965O6900P9183O0435O2343O5924P7228R3328J09868J35478J37974J44301
10282D205927J40481J64983J86486J64169J71714J78230K09955K14265K49604
10273E885814K74241L09013L39636L53296L69198M14605M73572N08748N55993
10264I484116O21672O94311P75337Q79701R84405J113861J271185J487879J764474
10255A9076941K038459K323079K660662L125923L781444M648524N660867O935254
10247E0251153Q636930J0806771J3486711J6357451J9035416K1269154K3328641
10240A63172227K5869855K9065248L2278639L4564035L4085734K7175003J1927245
$$ plain form
10304 2297797 2372652 2447540 2520993 2600145 2678785 2766750 2865949 2947301 3022226 3104916 3172965
10293 3172965 3239865 3319048 3379483 3441826 3507750 3584978 3678306 3788174 3923652 4061626 4205927
10282 4205927 4346408 4511391 4697877 4862046 5033760 5211990 5421945 5636210 5885814
10273 5885814 6160055 6469068 6808704 7162000 7531198 7945803 8419375 8928123 9484116
10264 9484116 10105788 10800099 11575436 12455137 13439542 14553403 15824588 17312467 19076941
10255 19076941 21115400 23438479 26099141 29225064 33006508 37655032 43315899 50251153
10247 50251153 58888083 69694854 83181565 99539016 118574432 139843586 163172227
10240 163172227 189042082 218107330 250385969 284950004 319035738 346210741 358137986
10233C58137986n132013j3138766j0890245r976067j8105456k8760829l0166608
10226B41968002k0218238o348463N426850J3711654J9397404K3549380K7081757
10219C04568346L0493523L1874307K5893400R861033j0677531k9976637m6468223
10212C15568218n6346969n4856509m4084932l1306644k1214813j4465362j0213512
10205H3079477p523914n790416m631620l825073l227582k742728k359782k035494
10197E0942868j776182j598986j532002j588621j700174j759375j742778j652656
10189C7592094j493802j300788j103395r31608p73525o72449o06114n84456o51120
10180B9474837p75519r09614j043638j106276j117105j113380j101195j056536
$$ plain form
10233 358137986 353005973 339867207 328976962 319000895 300895439 272134610 241968002
10226 241968002 221749764 215401301 220828151 234539805 253937209 277486589 304568346
10219 304568346 335061869 366936176 392829576 402690609 392013078 362036441 315568218
10212 315568218 259221249 204364740 160279808 128973164 107758351 93292989 83079477
10205 83079477 75555563 69765147 65133527 61308454 58080872 55338144 52978362 50942868
10197 50942868 49166686 47567700 46035698 44447077 42746903 40987528 39244750 37592094
10189 37592094 36098292 34797504 33694109 32762501 31988976 31316527 30710413 30125957 29474837
10180 29474837 28699318 27789704 26746066 25639790 24522685 23409305 22308110 21251574
10172B1251574j019657r70902r42811q71871p80313p25195o82209o49633o44028
10163A3964955o19265n98701n54393n36565n15957n17079m88594m60573m38847
10154I234981m01998l72952l33317l37612l10096k92781k91850k73034k69275
10145F352066k73365k60301k46428k39417k12857j99726j99722j76606j64124
10136D379520j64587j53960j31071j38033j39997j26661j21981r9958j04420n9685
10126C139167n3076o5862l2122k3457k3773j1259q444k6959l5882m0227k5815
10115B792291M231O339l3576m5943m3353m3499l2569j3545j4406l4101m9502q2596
10103B409771o0704k1801l0122n8609n8899m7108n0537l9124l6703k2067m9537
$$ plain form
10172 21251574 20231917 19261015 18318204 17446333 16666020 15940825 15258616 14608983 13964955
10163 13964955 13345690 12746989 12192596 11656031 11140074 10622995 10134401 9673828 9234981
10154 9234981 8832983 8460031 8126714 7789102 7479006 7186225 6894375 6621341 6352066
10145 6352066 6078701 5818400 5571972 5332555 5119698 4919972 4720250 4543644 4379520
10136 4379520 4214933 4060973 3929902 3791869 3651872 3525211 3403230 3303272 3198852 3139167
10126 3139167 3086091 3020229 2988107 2964650 2940877 2929618 2921174 2894215 2858333 2818106 2792291
10115 2792291 2796522 2802861 2769285 2723342 2679989 2636490 2603921 2590376 2575970 2541869 2492367 2409771
10103 2409771 2349067 2327266 2297144 2238535 2179636 2132528 2081991 2042867 2006164 1984097 1934560
10092A934560q9202j10228j22007j04978q6892q0905o7177n6087o5740p2388n6468
10081A022488o3443n8046m2325j9537k1643n769J627Q605K1116Q145J3960J3209
10069H78387L761O292R564Q797J6690J6985Q555J929Q687Q36K0856J8899J3439
10056A013677J7433J7203J9819P657K0256K0384J7459K1607K5258K5117Q822J1982
10044A226674L157m229j1123N193R066J2853j551k3942O123J5110j928Q92J1798
10031A248093J5334J7569K2758R58j0354Q774q949l1496l9084k9490l6565k3193
10019A134355l2848l9023l3649k4549l2780k0510j6276j088m209j1581k6005j9251
10007H72586j3524q825j7749k8083k6641k8084k6620k3979J633p164j7216J816
$$ plain form
10092 1934560 1845358 1735130 1613123 1508145 1421253 1340348 1273171 1217084 1151344 1078956 1022488
10081 1022488 959045 900999 858674 839137 817494 811725 813352 821957 843073 851218 865178 878387
10069 878387 882148 888440 898004 906801 923491 940476 949031 950960 959647 960483 981339 1000238 1013677
10056 1013677 1031110 1048313 1068132 1075789 1096045 1116429 1133888 1155495 1180753 1205870 1214692 1226674
10044 1226674 1229831 1225602 1214479 1219672 1228738 1241591 1240040 1216098 1222221 1237331 1235403 1236295 1248093
10031 1248093 1263427 1280996 1303754 1304712 1294358 1303132 1294183 1262687 1223603 1194113 1157548 1134355
10019 1134355 1101507 1062484 1028835 1004286 971506 950996 934720 933632 929423 917842 891837 872586
10007 872586 859062 850237 832488 804405 777764 749680 723060 699081 700714 693550 676334 678150
9995F78150p506Q332J1956O998o955j5594j2290j7547j8937l3589l4236j6125
9983E42657o383l240p339k8819j9945q227k14P434O343p164j4361K388L495r804
9969D56821q801o9p653j5506j9719k0865j4764k2494k0832j4232R50Q014j669
9956C19181q999o924P459J113n987q407M131J493n724k0663k5529j2633q930j0855
9942B18726p16J1834L216q996N33O719M048Q398K387j1802K354j4423o543O509
9928B22244m018O67j0737l649K0938J1855k439k525K909R735J2662n179r87L721
9914B55197K109J4000J5551R013P364p727m058j3504n615J1766N515r650J2364
9901B92325J4019O300l222j513M670K0915l898p42j4110r019J463k581M973J1666
$$ plain form
9995 678150 670644 678976 690932 697930 690975 675381 663091 645544 626607 593018 558782 542657
9983 542657 536274 533034 525695 496876 476931 468704 468490 475924 482267 475103 460742 463130 466625 456821
9969 456821 448020 447951 440298 424792 405073 384208 369444 346950 326118 311886 312836 320850 319181
9956 319181 310182 303258 310717 311830 305843 297436 301567 303060 297336 276673 251144 238511 229581 218726
9942 218726 218010 229844 233060 224064 224597 231316 235364 243762 246149 234347 236701 222278 215735 222244
9928 222244 218226 218893 208156 204507 225445 237300 234861 232336 235245 244980 257642 252463 251476 255197
9914 255197 257306 271306 286857 295870 303234 295507 291449 277945 272330 284096 289611 279961 292325
9901 292325 306344 312644 309422 307909 312579 333494 329596 328854 314744 305725 307188 304607 309580 321246
9887C21246R185J3614k037J3187K7536M518l816j3319Q655r132j2577p942k0689
9874C28429n221k3J2610m107j4498l950j1345j3245R73n461M169R91n297J1372
9860B95397r96J2l372l154M633Q603J1406J1138q019q204J5924J904J2705Q884
9846C46861j5766o617K4880K0110J2574J9238L2283M2554L2669N2732N6090O6853
9834F84461Q5169J10103J38613J33812J47709J67641J68238J85626J90265J67409
9824B179046J19837L9223k6432j0123L3988K6419n0524q1347p1080r866N3195
9813B202336Q9128J09438Q2994r514j32403k24653k93212l08264k72778k10578
9803A032494j56536j10347p8523m9515l7366l5805k8507l4804l1516k2185j7607
$$ plain form
9887 321246 330431 344045 342008 355195 382731 387249 383433 370114 378769 369637 357060 349118 328429
9874 328429 323208 323185 335795 331688 317190 313240 301895 288650 289623 284162 288331 289322 284025 295397
9860 295397 294401 294413 291041 287887 292520 301123 312529 323667 315648 307444 323368 325272 337977 346861
9846 346861 331095 324478 349358 369468 382042 401280 433563 476117 508786 561518 617608 684461
9834 684461 769630 879733 1018346 1152158 1299867 1467508 1635746 1821372 2011637 2179046
9824 2179046 2298883 2338106 2311674 2301551 2335539 2361958 2311434 2230087 2159007 2149141 2202336
9813 2202336 2291464 2400902 2483896 2474382 2341979 2117326 1824114 1515850 1243072 1032494
9803 1032494 875958 765611 687088 637573 600207 564402 535895 501091 469575 447390 429783
9792D29783q911P43q747p567j2416j0965o749J15m303J19l877n407r582K829R062
9777C64127o024k1121k7216L302l133op370j0743Q70o029L481o661r736K78N931
9762B79950n64n975m715K075k921r361M84j534J2549P452j0886l924k598l064
9748B56968m38j833J7650Q417j5374j3862J0376K2134O667k832J5654J4454J2932
9735C30913K1863K0517Q064j4529l3464k9025k4859k5286j7734n360m27j798M356
9722B33231K729j1374q975o859q306J1219l884j1203o01o180L011L76n223m322
9708A83639j3490N68P804L353j91J7066N814k498j4066r147o102J948p13n765
9694A68220Q794J8668J1754k489o190k670n505J2914J6458K997L423J9679J3618
$$ plain form
9792 429783 420872 421615 412868 405301 392885 381920 375171 375286 370983 371102 367225 361818 352236 355065 364127
9777 364127 358103 336982 309766 313068 309935 309929 302559 291816 292686 286657 290138 283477 273741 274019 279950
9762 279950 279386 273411 268696 270771 267850 258489 258973 257439 269988 277440 266554 262630 260032 256968
9748 256968 256530 254697 272347 280764 265390 251528 261904 284038 290705 287873 303527 317981 330913
9735 330913 352776 373293 381357 366828 333364 304339 279480 254194 236460 231100 230673 228875 233231
9722 233231 235960 224586 215611 208752 200446 211665 207781 196578 195977 189797 192808 193184 187961 183639
9708 183639 170149 170717 178521 181874 181683 198749 204563 202065 187999 178852 172750 174698 173985 168220
9694 168220 177014 195682 207436 204947 198757 196087 190582 203496 219954 222951 226374 246053 259671
9681B59671J1582N465J3317o733p400O707M000J5308J6786J5223J3534J6327J3310
9668C77097R228K6435K0920Q296J2595J6444J5344K1577L7413L0281J3773J8116
9656F07519L1834L1103K4400L6927L9921N7898O7420O8051O1447N8042O0327P6262
9644A221151Q9415J10409J21799J15920J08135J30929J36609J44172J54521J83106
9634B516166J84004J86347J85241J74798J71550J54425J43616J09363P8309M9840
9624C953659P105l3397o9178j05222j26977j48820j67220j72883j67679j84269
9614B785119j94913j69427j45125j26564j21911j20283j16244j09740r5472p4131
9604A511309o1249o8428o3386n7814n4204m5339m1852l9499m1768m5679k9567
$$ plain form
9681 259671 271253 276718 290035 283302 275902 282609 286609 301917 318703 333926 347460 363787 377097
9668 377097 386325 412760 433680 441976 454571 471015 486359 507936 545349 575630 589403 607519
9656 607519 639353 670456 694856 731783 771704 829602 897022 965073 1026520 1084562 1144889 1221151
9644 1221151 1310566 1420975 1542774 1658694 1766829 1897758 2034367 2178539 2333060 2516166
9634 2516166 2700170 2886517 3071758 3246556 3418106 3572531 3716147 3825510 3903819 3953659
9624 3953659 3960764 3927367 3858189 3752967 3625990 3477170 3309950 3137067 2969388 2785119
9614 2785119 2590206 2420779 2275654 2149090 2027179 1906896 1790652 1680912 1585440 1511309
9604 1511309 1450060 1381632 1318246 1260432 1206228 1160889 1119037 1079538 1037770 992091 962524
9593I62524k1699j2477k9366l9475k1852k6627l1882l5812k7520j9446p723j5028
9581F73617k0685j8118j1407k6903j2264n135j5266j1544j1572k5838l0759k0125
9569D64001k7720j3023m374K577p007r334r871k1215j9697k425m925j3806K930
9556C36111k044j5502j3513p513O526N900r597j896m386r231j6691k360k126n861
9542B57817M729r063j4614L958J570j1795j7590p672n130o075k337o259p292O115
9528A86362J1830j392j2737p34L341j7163o870O474R620k611J1252M729j1290
9515A80811j8790r258R508J373M030N24L603J3596K268j4487N150p405q661p181
9501A55081n366j2904o533o636l966P086L470r69O30n525L047O259o483k0255
$$ plain form
9593 962524 940825 928348 898982 859507 837655 811028 779146 743334 715814 696368 688645 673617
9581 673617 652932 634814 623407 596504 584240 579105 563839 552295 540723 514885 484126 464001
9569 464001 436281 423258 418884 421461 414454 405120 395249 374034 354337 351912 346987 333181 336111
9556 336111 334067 318565 305052 297539 304065 309965 300368 298472 294086 284855 268164 265804 263678 257817
9542 257817 262546 253483 238869 242827 244397 232602 215012 207340 202210 196135 193798 187539 180247 186362
9528 186362 198192 196800 184063 183329 186670 169507 162637 169111 178731 176120 187372 192101 180811
9515 180811 162021 152763 162271 163644 167674 168198 171801 185397 187665 173178 178328 170923 162262 155081
9501 155081 149715 136811 130278 123642 119676 126762 130232 129263 129893 124368 127415 133674 127191 106936
9487A06936m018L919Q840n250j1902o99p865m057l861L959J1820R527R842Q32
9473A18023j1778j2494P42l902L031j264r206O899J1158r60j0964R927k42j0176
9459H8794N024k17K149J2225j4593m551J859m758j9427j613O087R382p227q276
9445F4858L239N249L124j5920j4743q246K5p858J196J4211P996K768j819r0j7469
9430C6521p938j564o726J764J0343j079l660K114O362K5383m168j8848N557j2196
9416C1865R076M199k410q476J800N099K519J0221k749n019o28q659r227m898l64
9401B2349l047J2404P258J4369P076k374J371j1419l080j6823k498P441M338p788
9387B9577n334l240M121l098o178j453J6206J9676J0194n634o55J4480m570r289
$$ plain form
9487 106936 102918 106837 115677 110427 98525 97826 89961 85904 82043 86002 97822 107349 117191 118023
9473 118023 106245 93751 94493 90591 93622 92358 83152 90051 101209 100249 89285 99212 98970 88794
9459 88794 93818 93601 95750 107975 93382 88831 90690 85932 66505 64892 70979 80361 73134 64858
9445 64858 68097 73346 76470 60550 45807 37561 37586 29728 30924 45135 53131 55899 54080 53990 36521
9430 36521 28583 27019 20293 22057 32400 31321 27661 29775 36137 61520 57352 38504 44061 31865
9416 31865 40941 45140 42730 34254 36054 41153 43672 53893 51144 46125 45497 36838 27611 22713 22349
9401 22349 19302 31706 38964 53333 60409 58035 59406 47987 44907 28084 25586 33027 37365 29577
9387 29577 24243 21003 25124 22026 15848 14395 30601 50277 60471 54837 54182 68662 64092 54803
9373E4803k266j0900J2146m129o503M677N987k775k621n296K6J5720m774j413
9359E2682o958r910O907J7849J2257k69j2120p688K825j159K540j36l333P465
9345F0952M116q50j81l016Q279J0714N542K900l583O3J024k734m519m881J1765
9330H5591K2528q558j7562J3877j1129p919Q657m547K523o83k27l05J3422M640
9316A00308J357j5861j0607M9j476l098J1386O72l956L079j027j5700J893O546
9302G3565M712J5520J1233N116j2616Q152J461p733k675p869m349m949J758p841
9288G3485m781M855m866M045Q280J1078j693q584K722Q295n101n067p565O28n221
9273G0510k234M605j4525N721J6265P985l979j4822n710J2573N154o049q496n66
$$ plain form
9373 54803 52537 41637 53783 49654 43151 47828 53815 51040 48419 43123 43149 58869 54095 52682
9359 52682 45724 35814 42721 60570 72827 72558 60438 52750 55575 54416 56956 56820 53487 60952
9345 60952 65068 64218 64037 61021 69300 80014 85556 88456 84873 84936 85960 83226 78707 73826 85591
9330 85591 108119 99561 81999 95876 84747 76828 85485 80938 83461 82778 82551 82246 95668 100308
9316 100308 101665 85804 75197 75246 73770 70672 82058 82730 78774 81853 80826 65126 67019 73565
9302 73565 78277 93797 105030 110146 97530 105682 107143 99410 96735 88866 84517 79568 81326 73485
9288 73485 68704 73559 68693 72738 81018 92096 90403 81819 84541 92836 87735 82668 75103 75731 70510
9273 70510 68276 72881 58356 64077 80342 88327 84348 69526 63816 76389 81543 75494 66998 66432
9259F6432K915m624j3939o501R605Q914k421j130j980N496r36l222l563m711m738
9244D5597q81M170q832l051P021r001j673l1N260m129O251n350R37K966P660p47
9228D6167n782j1705J3246O920M201n798K877J019k291m861N473m274n49N536
9214E0179N884K839P593p597m567j9781j582J4379p002J1356O997K765m190P336
9200F4609l369o594M909l784J468J375L587o680j1994k980M417r786M66m5J4169
9185D9768J7483l123k613O509R922n991J5896n132p139L537P100O653j4227m588
9171G4055J3769l651j7575j6922r799L273R119N723j3682k328N99j2364J738K345
9157C4300m512r265j769P703j048N336M0J1994J2929O791j7806q849n124j937
$$ plain form
9259 66432 69347 64723 50784 44283 53888 62802 60381 59251 57271 62767 61831 58609 55046 50335 45597
9244 45597 44716 48886 40054 37003 44024 35023 33350 33319 38579 34450 40701 35351 36288 39254 46914 46167
9228 46167 40385 28680 41926 48846 53047 47249 50126 51145 48854 43993 49466 45192 44643 50179
9214 50179 56063 58902 66495 58898 54331 34550 32968 47347 40345 51701 58698 61463 57273 64609
9200 64609 61240 54646 59555 55771 57239 58614 62201 55521 43527 40547 44964 35178 35644 35599 49768
9185 49768 67251 64128 61515 68024 77946 71955 87851 82719 75580 79117 86217 92870 78643 74055
9171 74055 87824 84173 66598 49676 39877 43150 52269 57992 44310 41982 42581 30217 31955 34300
9157 34300 29788 20523 18754 26457 25409 30745 30785 42779 55708 62499 44693 35844 30720 28783
9143B8783k1270K067K993k767R624R056m654j4841J449O050J2202l801l955R013
9129B9949M013j4415Q486L152o354R763J790l564P871J696J148j5084k0579r886
9115b014k509J4018J0682L358l385n997OR835o21P45P850O021L297j1231l565
9100B6490L964M270N397j2046k0658M528K1227Q091j2709p132N980M273K724j3490
9086B0909K121j89R293O869j0114N89L481n333O313K3242M40j0134j673k872l842
9071C9100j9017n06J3348J7743R37O143O153J067k341q564m003N84L736O526N966
9056F6872o303k781k253J2696J4814n012j4259q424r518o829r697j2995j094K0690
9042C5907N393j4493L573P796L573j4494q666k379J3370Q230J837k645j3674k2537
$$ plain form
9143 28783 7513 9580 12573 9806 19430 28486 23832 8991 10440 16490 28692 24891 20936 29949
9129 29949 33962 19547 28033 31185 24831 34594 36384 32820 40691 42387 43535 28451 7872 -2014
9115 -2014 -4523 9495 20177 23535 20150 14153 14159 23994 23373 24118 31968 37989 41286 30055 26490
9100 26490 30454 34724 40121 28075 7417 11945 33172 41263 28554 21422 27402 31675 34399 20909
9086 20909 23030 22841 32134 39003 28889 29478 32959 27626 33939 57181 57621 47487 45814 42942 39100
9071 39100 20083 19577 32925 50668 51605 57748 63901 64968 62627 54063 50060 50644 54380 60906 66872
9056 66872 60569 57788 55535 68231 83045 78033 63774 55350 45832 39003 29306 16311 15217 35907
9042 35907 41300 26807 30380 38176 41749 27255 18589 16210 29580 37810 39647 37002 23328 791
9028G91R125K3068J2706R473K783j7088p354k557j6853l474m687o064J1389n342
9014E916J326l707m018R440k167p155m204J116J0260K1205J85N629N509k060m022
8999C3253n355Q79m855J304p424Q556j213k50n199K023J807O573l787k749M934
8984B8497m163p294l40K670J0629N138j8393n500j372p151N934J4530L742L86
8970B7313n534j2499j10O131j3863M841J0601j148k915O989M431M50K153m062
8956B2778j441P71L182M698p430P628J164j2623l397j413L522o563o12R927M996
8941B5187N658L58j2585p838J5449K0657Q614j4285k882K092j0924j3638K149
8928A8012o077j0143m042J3912m02j39o170P423o475o04n245o063o229l476J1061
$$ plain form
9028 791 9916 32984 45690 55163 57946 40858 33504 30947 14094 10620 5933 -131 11258 5916
9014 5916 7242 3535 -483 8957 6790 -365 -4569 -3453 6807 28012 28197 33826 39335 37275 33253
8999 33253 27898 28777 23922 25226 17802 26358 25145 24895 19696 21719 23526 30099 26312 23563 28497
8984 28497 24334 17040 16700 19370 29999 35137 16744 11244 9872 2721 8655 23185 26927 27313
8970 27313 21779 9280 9170 15301 1438 6279 16880 15732 12817 19806 24237 24687 26840 22778
8956 22778 21337 22108 25290 29988 22558 30186 31350 18727 15330 13917 17439 10876 10264 20191 25187
8941 25187 30845 31203 18618 10780 26229 46886 55500 41215 38333 40425 29501 15863 18012
8928 18012 11935 1792 -2250 11662 11260 11121 4951 12374 5899 5295 50 -6013 -12242 -15718 -4657
8913d657J4392J0268N43r881Q598n451Q186J4020O148m634j3085p842j449L260
8899A8416j406j3862n723J7837M985r243m169j0838K051n779O304L401J1924P975
8885B1873j8712p460k020J1888J6123R991L568l534j0221m66M496q758P911N622
8871C0301o052j4002l131N254r351l922M080J1615j905J1958o354o711J1189N891
8857B8860r635j6035O669J9962J4004j5192j8077j0726P130J5745K477j1505n018
8844H659J3631N584p031J964j294L290l30p29j4191M355N946k315L866r723j063
8829A0619J3970j3306J1726j0159n737M907m705k401n897O208p615J243J3571
8816A2424M864J152p322O449J0012Q288J2698R15j8190j4656k281O837j0758M222
$$ plain form
8913 -4657 9735 20003 20546 10665 19263 13812 21998 36018 42166 37532 24447 16605 15156 18416
8899 18416 17010 3148 -2575 15262 20247 11004 6835 -4003 -1952 -7731 -1427 1974 13898 21873
8885 21873 3161 -4299 -6319 5569 21692 31683 35251 31717 21496 21030 25526 16768 24679 30301
8871 30301 24249 10247 7116 12370 3019 -903 3177 14792 12887 24845 18491 11780 22969 28860
8857 28860 19225 3190 9859 29821 43825 28633 10556 -170 6960 22705 25182 13677 8659
8844 8659 22290 27874 20843 22807 21513 24803 24473 23744 9553 13908 19854 17539 21405 11682 10619
8829 10619 24589 11283 23009 12850 7113 12020 7315 4914 -983 5225 -2390 -1147 12424
8816 12424 17288 18440 11118 17567 27579 35867 48565 49480 31290 16634 14353 21190 10432 14654
8802A4654N704r8Q772N937O615j0498m444j2286M076Q361l360L322j56j5570P578
8787A8607J4634K470j379q17N002N4K262M31k932j7744n561K2638K613q034J0709
8772D2953M861o929Q609p386j0285o590N080O048L562R419J790j592j5725k620
8758C1195P301Q491l878k0294j25k359J083N679K038m687L081J4148R766N97N503
8743E7539n060o194J903n75J4169Q927q801n282L238m630P820K0992K3342M202
8729A11590L751J620J8398J6806q261j8910p539p56M777J1342J6893l144J744
8716A48311m458j6105k3051j5504p988q43J4053m826r428m290o2r448j296M007
8702F9072K272R994L398n710J3765O158o601k148J3905Q214o47j6565j3769L611
$$ plain form
8802 14654 20358 20260 29032 34969 41584 31086 26642 14356 18432 26793 23433 26755 26599 11029 18607
8787 18607 33241 35711 34332 33515 38517 38571 40833 41264 38332 20588 15027 37665 40278 32244 42953
8772 42953 47814 40885 49494 42108 31823 25233 30313 36361 39923 49342 51132 49540 33815 31195
8758 31195 38496 46987 43109 22815 22690 20331 21414 27093 29131 24444 27525 41673 51439 52036 57539
8743 57539 52479 46285 48188 47613 61782 70709 61908 56626 59864 55234 63054 84046 107388 111590
8729 111590 115341 116961 135359 152165 143904 124994 117455 116699 121476 132818 149711 146567 148311
8716 148311 143853 127748 104697 89193 81205 80362 94415 89589 80161 75871 75809 66361 65065 69072
8702 69072 71344 81338 84736 79026 92791 98949 92348 90200 104105 112319 111672 95107 81338 84949
8688H4949J6097J7773J4079o12R99J5236O039N29r728j3344j0564k531K1705P605
8674A48232j4958m892N806j0484j116J6050J3023J46n004o501J1546J4682L862
8661A70392p335j930K208J213j529l321J393Q04l79J3591O771J2011r862M543
8647A88570L013Q727P117L002L665O504r41j137p88j51J649L706P982J4321J9723
8632B64962K2247O843R42R45l981r385K530J8018J0649K86j788r787J6433L1512
8618C50426R959J0601K3447J0971J1709P250J0192J9818K5495K1580J8722o835
8606E13335K0344J6812K2804L4254K8274K2965Q215J7910L1575K0968J5994K6204
8594G79654K8835K1575J9417L301N825j4512k8029k6881l8382n7155n7387n5131
$$ plain form
8688 84949 101046 118819 132898 132286 133285 148521 154560 155089 145361 132017 121453 118922 140627 148232
8674 148232 133274 128382 134188 123704 122588 138638 151661 151807 146803 140302 151848 166530 170392
8661 170392 163057 161127 163335 164548 163019 159698 161091 161895 161516 175107 181878 193889 184027 188570
8647 188570 191583 200310 207427 210429 214094 220598 219657 218520 217732 217581 219230 222936 230918 245239 264962
8632 264962 287209 294052 294994 295939 291958 282573 285103 303121 313770 314056 312268 302481 318914 350426
8618 350426 360385 370986 394433 405404 417113 424363 434555 454373 479868 501448 520170 513335
8606 513335 533679 550491 573295 607549 635823 658788 667003 684913 716488 737456 753450 779654
8594 779654 808489 830064 849481 852782 858607 844095 816066 789185 750803 693648 636261 581130
8582E81130n7916l6345m7148l2748l7424l7669k8929k3499n31R477j7258j0574
8570B60566j8319m98n298j2326l789j8431p770p96M477J250J3123N268r976n87
8556B06894K795M427j1167j0554r34q816l108N023J8712N428p014r100Q34o637
8542A86783o512L678K103o48j0841j5239j1363r674j2296k0311l579P091J2397
8529A21589j7462o933o618n534o850L462L353R179O969n253L479j3310L362Q191
8515I7624k076k0133k166J6973m43q403o726j4898O588J5599J740r495P895J2164
8501I4243J0200m76n660j2460p660n979j5556J0116Q302P540j4301j2623n525
8488E0161k302k520N153M531M751j426j3027M246J2492j4617o334j88J919L858
$$ plain form
8582 581130 523214 486869 439721 406973 369549 331880 302951 279452 278921 288398 271140 260566
8570 260566 242247 241749 236451 224125 220336 201905 194135 193339 197816 199066 212189 217457 207481 206894
8556 206894 209689 214116 202949 192395 191461 182645 179537 184560 203272 208700 201686 192586 193420 186783
8542 186783 180271 183949 186052 185404 174563 159324 147961 138287 125991 105680 102101 109192 121589
8529 121589 104127 97194 90576 85042 78192 81654 85007 94186 101155 95902 99381 86071 89433 97624
8515 97624 95548 75415 73249 90222 89779 81376 74650 59752 66340 81939 83679 74184 82079 94243
8501 94243 104443 103967 98307 85847 78187 72208 56652 66768 75070 82610 68309 55686 50161
8488 50161 47859 45339 50492 55023 59774 58348 45321 49567 62059 47442 41108 40920 42839 46697
8474D6697J912N272p638l825Q946j6880r743r50m82Q854m899R1J6071P692n573
8459D5545j0122Q615K944o223O112J314j0558q328q078J0894J192p134J3661J459
8445D1293n362j909L427N174r985l507L855J6550J0078j1132j2305m664J001J0852
8431D3366J805j0732k751J6969J109k9756j9496J0232J2670n815l472J169J1771
8418B7069J4116k320k210j7219o320M958M587M961J89L940N067j459r720R494
8404C5133R87N314p559j016P371n728l194J3482r393q688j5952j2146j004l73
8390b766J2532K6470j5490j9155J2609J2062K399p276n274j3844R576O687j044
8377A7486N689o764j421Q090O439o505j7770K97M65oJ9023J8967M655n169p384
$$ plain form
8474 46697 48609 53881 46243 42418 51364 34484 24741 23791 23309 32163 27264 27355 43426 51118 45545
8459 45545 35423 44038 46982 40759 46871 48185 37627 29299 21221 32115 33307 26173 39834 41293
8445 41293 35931 34022 37449 42623 32638 29131 32986 49536 59614 48482 36177 31513 32514 43366
8431 43366 45171 34439 31688 48657 49766 20010 514 10746 23416 17601 14129 15298 27069
8418 27069 41185 38865 36655 19436 13116 18074 22661 27622 27811 31751 36818 35359 25639 35133
8404 35133 36120 41434 33875 32859 40230 34502 31308 44790 35397 26709 10757 -1389 -2393 -2766
8390 -2766 9766 36236 20746 1591 14200 26262 28661 21385 16111 2267 11843 18530 17486
8377 17486 23175 16411 14990 23080 29519 23014 5244 5541 6006 6000 25023 43990 48645 43476 36092
8362C6092p505o448r066j1286J5157K235r467P831q854L792j215r83j2445r520
8348a1682O003J952M066J2772P417j118o853j011p13m279M795J5814J5813j3802
8334B9174j7331j2800Q666l722J04J1339j525Q416O604j7182q282O447J0099J1341
8320C1348k661n791j6143m316j0672N853N301L462M406M395p731RJ3152Q363j1855
8305A7120J225j2935j1416K303J1477J1593n544j7454j777N677J2058J455L269
8292A7051L991m954m756j018k357l663n497o520R84J8455L907n043k025K082J0674
8277B1311r843p74M482M187k395o01o099p898M842J5645m072j523J381N25J351
8262B0519j1960N692j454j1891K597J136l654K139Q108J922o341L477p260n987
$$ plain form
8362 36092 28587 22139 13073 1787 16944 19179 9712 17543 8689 12481 11266 10283 -2162 -11682
8348 -11682 -5679 -3727 339 13111 20528 19410 12557 11546 10833 6554 11349 27163 42976 29174
8334 29174 11843 -957 7709 3987 4091 15430 13905 22321 28925 11743 3461 9908 20007 31348
8320 31348 28687 22896 6753 2437 -8235 -2382 2919 6381 10787 15182 7451 7460 20612 28975 17120
8305 17120 18345 5410 -6006 -3703 7774 19367 13823 -3631 -5408 269 12327 13782 17051
8292 17051 21042 16088 11332 10314 7957 4294 -1203 -7723 -6739 11716 15623 10580 8555 10637 21311
8277 21311 11468 10694 15176 19363 16968 16367 10268 2370 7212 22857 18785 17262 18643 19168 20519
8262 20519 8559 14251 12797 906 3503 4639 985 3124 11232 13154 6813 10290 3030 -2957
8248b957J580N752Q36j126O63J0215J722o045o209J258P439J4288K583m202P555
8233C3352l561J0169l953k0526J676l092J767M820K80p737p047Q709J6518N183
8219C6558j3701k030l028o703J2511q13j1888M556J928j060J3571J0392r300n471
8205B5522k147J5149n371j5610m610j300k0331J2376J5618n694p928j908p483
8192c717m6p176L942J9506J5502o337j1162M807k772n187q381K234n0L010J65
8177D338J097j431J3010m99L407K630j0741l278O414L829q380K31K718N820J10
8162A9275J520q79Q046J0284n384k0318m603J1618m267N718j746J8344k717n139
8148B9752q789o424l873P794J1670p750q191j0025m637o428o360M402J0894Q186
$$ plain form
8248 -2957 -1377 4375 5211 4085 4748 14963 16685 10640 4431 5689 13128 27416 29999 25797 33352
8233 33352 29791 39960 36007 15481 17157 14065 15832 20652 20932 13195 6148 14857 31375 36558
8219 36558 22857 20827 17799 11096 23607 22794 10906 15462 17390 16330 29901 40293 30993 25522
8205 25522 23375 38524 33153 17543 12933 11633 -8698 3678 19296 13602 5674 3766 -3717
8192 -3717 -3763 -10939 -6997 12509 28011 21674 10512 15319 12547 7360 -1021 1213 1163 4173 4338
8177 4338 5435 4004 17014 16515 19922 22552 11811 8533 14947 18776 10396 10627 13345 19165 19275
8162 19275 20795 19916 27962 38246 32862 12544 7941 19559 15292 21010 19264 37608 34891 29752
8148 29752 20963 14539 10666 18460 30130 22380 14189 4164 -473 -6901 -13261 -8859 2035 10221
8134A0221n817q062k963j9894J1068J2268k035k10J4401P726q54j048k925l230
8120H646M635K657l206j33k357Q538R848q193j0033Q558P825l553j2348J400J6366
8105B8650m176j477J101L373j8716j365P096N678p528m915M179J910l170J318
8091A1958j927j1854j0184m580O087R006l83l633l058K079J2382n424K499J400
8077D368N262J266k194J435O841N314M2K905l52n880q519J0659K00n381j7252
8062a286l660J0187R421m515M931J3376M901q25M557p068Q415k0m096O641J3507
8047E4466L650J1046R122l188m246p528L591j3790R900J8202J4856p581j224L008
8033I0284R11q377j1225N71J3643p11l630r699j3596q402N894l890K525J965j240
$$ plain form
8134 10221 4404 -3658 -6621 -26515 -15447 -3179 -5214 -5424 8977 16703 15849 14801 11876 8646
8120 8646 13281 15938 12732 12599 10242 18780 28628 20435 10402 18960 26785 23232 10884 12284 28650
8105 28650 24474 22997 24098 27471 8755 7390 14486 20164 12636 7721 11900 13810 10640 11958
8091 11958 10031 -1823 -12007 -16587 -10500 -1494 -1877 -5510 -8568 -6489 5893 469 2968 4368
8077 4368 9630 10896 8702 10137 16978 22292 22334 25239 24887 19007 10488 21147 21347 15966 -1286
8062 -1286 -4946 5241 14662 10147 15078 28454 33355 32530 37087 30019 38434 38414 34318 40959 54466
8047 54466 58116 69162 78284 75096 70850 63322 66913 53123 63023 81225 96081 88500 87276 90284
8033 90284 91195 82818 71593 72164 85807 85096 81466 71767 58171 49769 55663 51773 54298 56263 55023
8018E5023J594O861J99N507L152k56p248N67N542m239q1J832J8155L876l77Q03
8002I0910N290J874j767K313J208J6422J1366J563N980k563N6J0126j0727M75
7988A32526j2924q865n948j2089p770p411l426R20l921j166m388m95J5889r305
7974G1627k111K747j052l307l232N547l889l71L437k805N151Q855o865O268J0953
7959I0953J300n657N98O525k002R53L021J4813q39j092p485j3883L793m591j3452
7944G2955q557J29j485k0318P754J4696K200J613N163j4495k027J9276L31p991
7930F9244l045j1484m852L48j1520j097O298K014l208J4775K088j1589J9174J1156
7916G8302N193r418j0457k0964N57P120m338j2991Q839Q289N99R147o96j0370
$$ plain form
8018 55023 56617 63478 63677 69184 72336 72080 64832 65399 70941 66702 66621 68453 86608 90484 90107 90910
8002 90910 96200 98074 96307 98620 99828 116250 127616 129179 135159 132596 132652 142778 132051 132526
7988 132526 119602 110737 104789 92700 84930 77519 74093 75013 71092 69926 65538 65043 80932 71627
7974 71627 69516 72263 71211 67904 64672 70219 66330 65959 69396 66591 71742 80597 73732 80000 90953
7959 90953 92253 86596 87194 93719 91717 92670 95691 110504 109665 108573 101088 87205 90998 86407 72955
7944 72955 64398 64527 63042 42724 50478 65174 67374 68987 74150 59655 57628 76904 77235 69244
7930 69244 66199 54715 49863 50211 38691 37594 43892 45906 42698 57473 59561 47972 67146 78302
7916 78302 83495 74077 63620 42656 43213 50333 45995 33004 41843 50132 50731 59878 59182 48812
7902D8812l577k698k809j2977L531L844N879J106m117j001M870n951q998j3010
7888A2904q991J2289J7309l052P384L013N043j7840j0751M25P802n324j6155J1272
7874A5328J680m793j10N295q948O171j8465q598P300J3582J233o433k649J5990
7860A6583J1162L449m437N824N668k4630l699o926l730p573l719M608J3939m873
7846A646n271J70J2817n745j6109p158r041K927m558J1685J3452Q933P058j9843
7832i037l469J6716J1456P448J1881m888r150k1161J1008J2248J882K350l975
7819B3309q307M54L873j1027r894r032k660J6608J9004K739j0017j668p657k550
7805C175o866j4489m253k663J9759N182q953K754P388P17j027q144k958O628J2275
$$ plain form
7902 48812 45235 42537 39728 26751 30282 34126 40005 41111 36994 35993 40863 34912 25914 12904
7888 12904 3913 16202 33511 30459 37843 40856 45899 28059 17308 17733 25535 20211 4056 15328
7874 15328 17008 12215 12105 17400 8452 14623 -3842 -12440 -5140 8442 9675 3242 593 16583
7860 16583 27745 31194 26757 32581 38249 13619 9920 2994 -736 -8309 -12028 -7420 6519 1646
7846 1646 -3625 -3455 9362 3617 -12492 -19650 -28691 -25764 -30322 -18637 -5185 3748 10806 -9037
7832 -9037 -12506 4210 15666 23114 34995 30107 20957 -204 10804 23052 24934 27284 23309
7819 23309 15002 15456 19329 8302 -1592 -10624 -13284 3324 22328 25067 15050 13382 5725 3175
7805 3175 -3691 -18180 -22433 -25096 -5337 -155 -9108 -6354 1034 1751 724 -7420 -10378 -3750 8525
7790H525R909j8973j9091m231J2824l778q107J638O120J4550Q635K213o623n706
7776b095o934o503k789n859J225O18O35Q614N217j355j1251k294J2366L103N191
7761b111j730j266j1007p101P73L014J0754p446j761j2052M14J8637N573l746
7747i055j2895j0135q828R047K1488Q717J3314O734J0295Q520k879j1200l364
7734A9759r271k713L406J317j6955m447J7613K3116n262k1736Q305J7398J656
7721C2186j6360r170L033j3601p995l538Q681J455o86M147J764p97j1125M958
7707g048O893l948p550m816L6J1295J6256j6628j1576J4310p649m880K256N16
7693a2533k18J3475j8067j7199Q978O152Q753O097r681p954P662J52o323n49J1554
$$ plain form
7790 8525 18434 -539 -19630 -23861 -11037 -14815 -22922 -21284 -15164 -614 8021 10234 3611 -2095
7776 -2095 -9029 -15532 -18321 -24180 -22955 -22337 -21702 -13088 -7871 -9226 -20477 -22771 -10405 -7302 -2111
7761 -2111 -3841 -5107 -16114 -23215 -22442 -19428 -8674 -16120 -17881 -29933 -29519 -10882 -5309 -9055
7747 -9055 -21950 -32085 -40913 -31866 -10378 -1661 11653 18387 28682 37202 34323 23123 19759
7734 19759 10488 7775 11181 12498 -4457 -8904 8709 31825 26563 4827 13132 30530 32186
7721 32186 15826 6656 9689 -3912 -11907 -15445 -6764 -5309 -5995 -1848 -84 -881 -12006 -7048
7707 -7048 -155 -4103 -11653 -16469 -16433 -5138 11118 -5510 -17086 -2776 -10425 -15305 -13049 -12533
7693 -12533 -12751 724 -17343 -34542 -25564 -19412 -10659 -4562 -14243 -22197 -14535 -14383 -20706 -21255 -9701
7678i701l165Q125R428L77j828L320j393k645j2047j5584Q069J2428J4026l751
7664E659k184r635p905R838M384j181O595j483K469j551j5015l462q41J217r050
7649b2145j4254Q143J0084L060K267K045J7930J112K541p549P387J2239k676k2510
7635b326r425n989O586J2981J2713l103r026o936Q482N306J0163L952K283O54
7621B6315j3616o213L920m948j5142j4784J312K7283L817j2357j4240Q183Q133
7608b337K774N777Ll226j01Q176O581k773j1563L33j1476r50Q034n252j2279r025
7592b7304J0604J3273l981q105j142N14N847J1741N005j0810l398l404J834O967
7578b359j3966j532M303o841k862N901N455Q056L217L316N322j319j6294k797
$$ plain form
7678 -9701 -12866 -4741 4687 5064 3236 6556 5163 2518 -9529 -25113 -17044 -4616 9410 5659
7664 5659 3475 -6160 -14065 -4227 157 -1024 5571 4088 6557 5006 -10009 -13471 -14312 -13095 -22145
7649 -22145 -36399 -28256 -18172 -15112 -12845 -10800 7130 8242 10783 3234 10621 22860 20184 -2326
7635 -2326 -11751 -17740 -11154 1827 14540 11437 2411 -4525 3957 9263 19426 23378 25661 26315
7621 26315 12699 6486 10406 5458 -9684 -24468 -23156 4127 7944 -4413 -18653 -10470 -2337
7608 -2337 437 6214 6217 2991 2890 11066 17647 14874 3311 3644 -7832 -8782 -748 -6000 -18279 -27304
7592 -27304 -16700 -3427 -7408 -15513 -16655 -16141 -10294 1447 6452 -4358 -7756 -11160 -9326 -2359
7578 -2359 -16325 -17857 -13554 -20395 -23257 -17356 -11901 -3845 -628 2688 8010 6691 -9603 -12400
7564a2400O7M926J5322j0757j2005j0985J590N654K938N989m994M272J0582N011
7550E210j0537N529J648j5530J545p318q952K7828N744j6014K675K0042K2088
7537C3958m859j2464J523j4493l804K220o111l888m761l90n307P540N102K800
7523b934j0586n138J175J111j155J2358l293p527J3142O677K790l720n044o207
7509h351m363p586J917K813P215M659j1895q395j2906k52J8313J8739J860q580
7495f812l879J2211m670k372P602j0927k2964j0467J518O487Q89j144R913J0981
7481a3634j421q822K820Q231J0852n204k289K908O622J0579j782j1597r29j2515
7467a6181m319J78M415L707j3301o175R480r73O68J3484q112m915K412m413J2812
$$ plain form
7564 -12400 -12333 -7407 7915 -2842 -14847 -25832 -24242 -18588 -15650 -9661 -14655 -10383 199 5210
7550 5210 -5327 202 1850 -13680 -12135 -19453 -28405 -577 5167 -10847 -8172 11870 33958
7537 33958 29099 16635 18158 3665 -139 2081 -4030 -7918 -12679 -13069 -18376 -10836 -5734 -2934
7523 -2934 -13520 -18658 -17483 -16372 -17527 -5169 -8462 -15989 -2847 3830 6620 2900 -2144 -8351
7509 -8351 -12714 -20300 -18383 -15570 -8355 -3696 -15591 -23986 -36892 -37144 -18831 -92 1768 -6812
7495 -6812 -10691 1520 -3150 -5522 2080 -8847 -31811 -42278 -40760 -34273 -33384 -34528 -24615 -13634
7481 -13634 -15055 -23877 -21057 -12826 -1974 -7178 -9467 -6559 63 10642 8860 -2737 -3666 -16181
7467 -16181 -20500 -20322 -15907 -12200 -25501 -31676 -22196 -23169 -22501 -9017 -17129 -22044 -19632 -24045 -11233
7452a1233j888K43O23n70l622P765p606K859Q225p912n546n622P935j3639J2606
7437a7382K858K935J6225o731r339k582K700m841P794J0921n826J869L242l859
7423b016J3461J3725k929j5434r402J2928L967j3071j4484r51k1M733O53R479
7409F38N170k0454j6157j0065J4936L836J7507l391O507r486j7680j4190J424
7396d1405Q806R962J2126k432Q03K881J442J0660O426k441r683P937r312q936
7382a3166L634k894k919j443L221J415O563Q283L337K098o286k1584m475L06J0161
7367a3749O796R085p286o286p235m552k930J3975K366j5011j378k937q922Q229
7353b9835J0863L99J1355J3589N564o486L118j155r518o113Q148J1819K726n780
$$ plain form
7452 -11233 -13121 -12878 -12255 -12825 -16447 -8682 -16288 -13429 -5204 -13116 -18662 -24284 -16349 -29988 -17382
7437 -17382 -14524 -11589 4636 -2095 -11434 -14016 -11316 -16157 -8363 2558 -3268 -1399 1843 -2016
7423 -2016 11445 25170 22241 6807 -2595 10333 14300 1229 -13255 -14206 -14227 -9494 -8841 638
7409 638 5808 -14646 -30803 -40868 -25932 -22096 -4589 -7980 -1473 -10959 -28639 -42829 -41405
7396 -41405 -32599 -22637 -10511 -12943 -12140 -9259 -7817 2843 9269 6828 -2855 5082 -4230 -13166
7382 -13166 -9532 -12426 -15345 -16788 -13567 -12152 -5589 2694 6031 8129 1843 -19741 -24216 -23910 -13749
7367 -13749 -6953 2132 -5154 -11440 -18675 -23227 -26157 -12182 -9816 -24827 -26205 -29142 -38064 -29835
7353 -29835 -18972 -18573 -7218 6371 11935 5449 8567 7412 -2106 -8219 -71 11748 14474 8694
7339H694k2965J905L605L809p798j2569m34M997R191k589N837K1080L335j1756
7325D342L71O862O331n224j6481j0539M557Q568m283R817M98N833L823j3852j2384
7310a1761J6621O08j250l385J110l397k84l461j586j1605j1775k322J0220R063
7296a3204m590n574J1014O160n682j3546Q707J9651o403l558L346L772j109j851
7282b867j2802p609k333J1946O984j3266j1634J279J4943K7780l742j8365j3260
7269b2946K604J567o622o68M400J0421L362K027J693l548R989J3494J0801m570
7255B2004j0392J836Q477R79m605J922k600K084q677j2576j3715L825K357N247
7241c834l264j6588J635o296J3477N025l469n096R525J7242n735j7641p724M491
$$ plain form
7339 8694 -14271 -12366 -8761 -4952 -12750 -25319 -25753 -20756 -11565 -14154 -8317 12763 16098 4342
7325 4342 4713 11575 17906 12682 -3799 -14338 -9781 -1213 -5496 4321 4819 10652 14475 623 -11761
7310 -11761 4860 5468 4218 833 1943 -1454 -1738 -5199 -6785 -18390 -30165 -32487 -22267 -13204
7296 -13204 -17794 -23368 -12354 -6194 -11876 -25422 -16715 2936 -3467 -7025 -3679 93 -1016 -2867
7282 -2867 -15669 -23278 -25611 -13665 -6681 -19947 -31581 -30302 -15359 12421 8679 -9686 -22946
7269 -22946 -20342 -18775 -25397 -26065 -21665 -11244 -7882 -5855 -4162 -7710 2279 15773 26574 22004
7255 22004 11612 13448 21925 22904 18299 20221 17621 19705 11028 -1548 -15263 -11438 -9081 -3834
7241 -3834 -7098 -23686 -22051 -28347 -14870 -9845 -13314 -18410 -8885 8357 2622 -15019 -22743 -18252
7227a8252N027K305J2565l486p219j5261j302K280M659q90L653m789J479K42p338
7212b6327O361K2026J5604O040r445n086J524m381q361j4157Q523J9187L6j048
7198A0496n363p582q132p579M328J1093L351o35k0521l053J8606P124O057J223
7184I413L357k044L967K923j5309j1476k690Q078L945K252Q125r975j5634O94
7170a4374O431J826P08j3936r808J0128J7066k551L17k519j3076j791j485k794
7156b5858J0775L727k181N055l357J3843Q559p684k715k0490K395P616j4429l651
7142b8395Q845n772l117O546O591J5594P877n052p611M446k561j054R55K0658
7128A7950j399p823j1215j5534j0414n187M980J1471K08M252n28J1792R752n151
$$ plain form
7227 -18252 -13225 -10920 1645 -1841 -9060 -24321 -25623 -23343 -18684 -19574 -15921 -20710 -19231 -18989 -26327
7212 -26327 -19966 2060 17664 23704 14259 9173 10697 6316 -2045 -16202 -7679 11508 11544 10496
7198 10496 5133 -2449 -10581 -18160 -13832 -2739 612 -23 -20544 -23597 -4991 2133 8190 9413
7184 9413 12770 10726 14693 17616 2307 -9169 -11859 -3781 164 2416 10541 566 -15068 -14374
7170 -14374 -7943 -6117 -5409 -19345 -29153 -19025 -1959 -4510 -4193 -6712 -19788 -21579 -23064 -25858
7156 -25858 -15083 -11356 -13537 -8482 -11839 2004 10563 2879 164 -20326 -17931 -10315 -24744 -28395
7142 -28395 -19550 -25322 -28439 -21893 -15302 292 8169 3117 -4494 -48 -2609 -3663 -2708 17950
7128 17950 16551 8728 -2487 -18021 -28435 -33622 -28642 -17171 -16963 -12711 -13239 -1447 8305 3154
7114C154p376J9321o370j3928J0718J939p820N177n537n854L034J1372L955n071
7100F714q984N072o387l797p254j210N904N26Q102J180L92P82J4711m00j2966
7085B385p297L251p257P253J4273K907j0680j2880m989K3622Q775l605o412k0070
7071a0724j456J4282J3786L930j5223q555R518k645r99l561P173l422j0535q867
7057a7298K196P900j0952o743j0896J1682J3397N179N748Q742J0419p63n298r433
7043C880j7660n312J3236R049r380j0775N350J7623O140k0378L290J4610J1050
7030B0723J642p292q495j6576N164N88n585o29l166o690J5531J2180l433q42N837
7015H957j1232Q12n53j2279l121R12O766r521J640j1985k360N060R594J0240q70
$$ plain form
7114 3154 -4222 15099 8729 -5199 5519 7458 -362 4815 -722 -6576 -3542 7830 11785 6714
7100 6714 -2270 2802 -3585 -7382 -14636 -15846 -9942 -9416 -1314 -134 258 1040 15751 15351 2385
7085 2385 -4912 -1661 -8918 -1665 12608 15515 4835 -8045 -13034 10588 19363 15758 9346 -10724
7071 -10724 -12180 2102 15888 19818 4595 -3960 5558 2913 1914 -1647 5526 2104 -8431 -17298
7057 -17298 -15102 -7202 -18154 -24897 -35793 -24111 -10714 -5535 213 8955 19374 18611 13313 3880
7043 3880 -13780 -19092 -5856 3193 -6187 -16962 -11612 6011 12151 -8227 -4937 9673 20723
7030 20723 22365 15073 6578 -9998 -4834 -4246 -9831 -10460 -13626 -20316 -4785 7395 3962 3120 8957
7015 8957 -2275 -1463 -2016 -14295 -17416 -16504 -9738 -19259 -17619 -29604 -31964 -26904 -17310 -7070 -7940
7000g940o944J3458L397j0338o159J2023O743P93n448j3062L700J1434P612j00
6986I169j5807K014J3612M539L1k2356j2655Q561N986K255r992o463J5192J1518
6972E604k533O841Q481o355j2763q892N080m989o859K170Q495n066q32m989j0500
6957b7107n405P315M566m389J2447J2985k069j405k718k078O962n267j4866O834
6943a4195l322M518k050l465Q860j1344K87R274J0719J844K54P1L481n453j1041
6928a1562r25K249k693N198J824k213k935L925M478Q953L086j873j3121k542J3402
6913E251K1817L210j4361n310m563N108P647j1329k370p540p606o443L028J2120
6899a341L361r837q103m468J4219J0423J741P081j2135m014l313j1045l875J967
$$ plain form
7000 -7940 -14884 -1426 1971 -8367 -14526 -2503 4240 5033 -415 -13477 -9777 1657 9269 9169
6986 9169 -6638 -4624 8988 13527 13558 -8798 -21453 -12892 -6906 -4651 -14643 -21106 -5914 5604
6972 5604 3071 9912 18393 12038 -725 -9617 -4537 -9526 -16385 -14215 -5720 -10786 -11618 -16607 -27107
6957 -27107 -32512 -25197 -20631 -25020 -12573 412 -1657 -3062 -5780 -7858 -896 -6163 -21029 -14195
6943 -14195 -17517 -12999 -15049 -18514 -9654 -20998 -20711 -11437 -718 1126 1380 1451 4932 -521 -11562
6928 -11562 -12487 -10238 -12931 -7733 -5909 -8122 -11057 -7132 -2654 6299 9385 7512 -5609 -8151 5251
6913 5251 27068 30278 15917 10607 6044 11152 18799 7470 5100 -2440 -10046 -16489 -13461 -1341
6899 -1341 2020 -7817 -15920 -20388 -6169 4254 5995 13076 941 -3073 -6386 -17431 -21306 -19339
6885a9339m340N849J7011O261k3236k882J1924J038M451n402k851J915L447j995
6871h149L058J2923m875K871M968j2926L480k723o808N016j2400j9960k210K323
6857c5412J0327J0136N753k430N906J2604p770J6n735O784R505q913L001Q975
6843A2747n441j8268j0208J4596o539r778J0971P005P36M502o571j2224L131J222
6829a4119O405j1359M25M017N49O185K449O080J899l737j0735l30p288Q976m60
6814a1043Q768P150O380P607R368k2671j7560m900K023N541L621R646k519r760
6800h349K232K790J4358R409m64j591p467N015J036N55m857j6842K276L394j2882
6785a1387M721m312R085J1520q61J799n285j3651j3754J7348J2217j0801m459
$$ plain form
6885 -19339 -23679 -17830 -819 5442 -17794 -20676 -8752 -7714 -3263 -8665 -11516 -9601 -6154 -8149
6871 -8149 -5091 7832 2957 5828 10796 -2130 1350 -1373 -8181 -3165 -15565 -35525 -37735 -35412
6857 -35412 -25085 -14949 -9196 -11626 -5720 6884 -886 -870 -6605 179 9684 771 3772 12747
6843 12747 7306 -10962 -21170 -6574 -13113 -22891 -11920 -4915 -4179 323 -6248 -18472 -15341 -14119
6829 -14119 -7714 -19073 -18648 -14631 -14082 -7897 -5448 632 2531 -1206 -11941 -12271 -19559 -10583 -11043
6814 -11043 -2275 4875 11255 18862 28230 5559 -12001 -16901 -14878 -9337 -5716 3930 1411 -8349
6800 -8349 -6117 -3327 11031 20440 19976 18385 10918 15933 16969 17524 12667 -4175 -1899 1495 -11387
6785 -11387 -6666 -10978 -1893 9627 8766 10565 5280 -8371 -22125 -4777 7440 -3361 -7820
6772g820q296p896J1392m79q303q842Q256K4004k463k929K570M531J0653J0596
6758B4974k0013k957J3439Q594J4199K23k5265j3556j939P943K4269M438j9945
6745A4404N290J9495J2397P920j4017j3440r77N849J5027Q851L797M344J6664
6732H5604K0870J8496K6882K4041L1157L3758L6595M3409M5688M6227M9349K5298
6720D87374k8609q5706j05244p9990n5130k3960j3553k9856l0180q440J4265P085
6708D8056m184p754l345r437q27P358q711o202j579m77J1227Q166K810r268l813
6693B2020P11o295n340J345O533K118j970M928m228j1640J2955J0589n45J0626
6679D1807L78n460j5361k1751m833k755k666L962P540L045m318J191P273J677
$$ plain form
6772 -7820 -16116 -24012 -12620 -13099 -21402 -30244 -21988 2016 -447 -3376 -806 3725 14378 24974
6758 24974 4961 2004 15443 24037 38236 38459 13194 -362 -2301 5642 29911 34349 14404
6745 14404 19694 39189 51586 59506 45489 32049 31072 36921 51948 60799 64596 68940 85604
6732 85604 106474 124970 151852 175893 207050 240808 277403 320812 366500 412727 462076 487374
6720 487374 458765 373059 267815 187825 132695 108735 95182 65326 35146 26706 40971 48056
6708 48056 43872 36118 32773 23336 22509 29867 21156 14954 13375 12898 24125 32291 35101 25833 22020
6693 22020 22731 16436 11096 12441 18974 21092 19122 24050 19822 8182 21137 31726 31181 41807
6679 41807 42185 36725 21364 -387 -5220 -7975 -10641 -6679 861 3906 -412 779 8052 9729
6665I729q985R452k325r128J847r937O627n300M255N639L557k517k713l592M069
6650F78J2657j773p393q24q76j1523j3516J0299J0596K174k762o202j94j561K314
6635g906N547K511K452j211K588j3710j0760K134J9109j310j7379l384Q12j058
6621b1565L761LJ1964M525j0539r409K583J6270J1829j1989j0914KJ3263J8951
6607A8735k78R82J2567n365j290q456r937j5603k447R832L363j770q218j956m338
6592a4179l586m228O706J1680J0702L593m941j1014L830j102r961j0037J134N312
6578a6091j005K984j597J384J133J6099J341Q162O004K936L406j0177q141k576
6564C862p366J43l50O914N744l283K636l581J04J169p036K788p96j7875q089N67
$$ plain form
6665 9729 744 10196 7871 -1257 590 -9347 -2720 -8020 -3765 1874 5431 2914 201 -3391 678
6650 678 13335 11562 4169 3345 2469 -9054 -22570 -12271 -1675 499 -2263 -8465 -8659 -10220 -7906
6635 -7906 -2359 152 2604 1393 3981 -9729 -20489 -18355 754 -556 -17935 -21319 -20507 -21565
6621 -21565 -17804 -17801 -5837 -1312 -11851 -21260 -18677 -2407 9422 -2567 -13481 -13479 -216 18735
6607 18735 18457 19439 32006 26641 25351 16895 6958 -8645 -11092 -1260 2103 333 -7885 -9841 -14179
6592 -14179 -17765 -21993 -15287 -3607 7095 10688 5747 -5267 -1437 -2539 -12500 -22537 -21403 -16091
6578 -16091 -17096 -14112 -15709 -14325 -13192 2907 4248 12410 18414 21350 24756 14579 6438 3862
6564 3862 -3504 -3361 -3711 3203 8947 5664 8300 4719 4823 5992 -1044 1744 948 -16927 -25016 -24449
6548b4449L139J8613R341j8382q94J5837K4728k442m916n411k475M257n401p76
6534A0769n873o876j914J898J5564Q223r819q847j325O44r27K875L45l642n477
6519d382j5560q286N748J8680Q304n23p514r237P319p18M232m30j189l421L413
6504c564j4669k33l626o193R857p170J3327J1099j3495l176n159m12j888M4Q547
6489a6711P875p393j0409n192P877K3836J926q976K910N702J2596m752k0901l450
6475a5062N700R379J2532M768j474o257j259q759j4097J4787m09K111M897N524
6461A2381o572R659p139k4229j144n27n002N169J792M490N188J496n844J0516
6447B34q654j5394L93O480J1738J1522j2468j4970q042j04N392M306Q451Q786
$$ plain form
6548 -24449 -21310 -2697 6644 -11738 -12632 3205 27933 25491 20575 15164 12689 16946 11545 10769
6534 10769 4896 -1980 -3894 -1996 13568 21791 11972 3125 1800 2444 1517 4392 4737 1095 -4382
6519 -4382 -19942 -28228 -22480 -3800 4504 3981 -3533 -12770 -5451 -6169 -1937 -2367 -3556 -6977 -3564
6504 -3564 -18233 -18466 -22092 -28285 -18428 -25598 -12271 -1172 -14667 -17843 -23002 -23414 -25302 -25258 -16711
6489 -16711 -8836 -16229 -26638 -31830 -23953 -117 1809 -7167 -4257 1445 14041 9289 -11612 -15062
6475 -15062 -9362 17 12549 17317 15843 9586 8327 -432 -14529 258 -151 1960 6857 12381
6461 12381 5809 15468 8329 -15900 -17044 -17571 -22573 -17404 -15612 -11122 -5934 -4438 -10282 234
6447 234 -8420 -23814 -23421 -16941 -5203 6319 -6149 -21119 -29161 -29265 -23873 -19567 -11116 -2330
6433b330j131J753n689M788k174p446k118N393J236o739q690Q890L49O929p490
6418a4469J291J1346K841K54j0476j1043m058j0817M419P425N375O078j338o271
6404a9443J0505J770r36q339j16N948J1065k653j4271q31K874J6136L964P335
6390A3008k075j38j45l661n967q551R763j1687M742J5273K7r032q334O225j019
6375a571K298K2655L822j5608j2196L331J1952J10p826r399J0669M91j7807n778
6361a4857J7302q094p233R267L154o332N846P124L746k676j1584J4474J1148m541
6347A6744j8222j7936Q437J7324k996J289R300l786p631n052p93J4362K531k182
6333A1389j1582j2004N555J1659J5257n349l735j8517j1584K956k287L135K52
$$ plain form
6433 -2330 -3461 -1708 -7397 -2609 -4783 -12229 -14347 -8954 -7718 -14457 -23147 -14257 -13908 -6979 -14469
6418 -14469 -13178 -1832 1009 1263 -9213 -20256 -24314 -35131 -30712 -23287 -17912 -11834 -13172 -19443
6404 -19443 -8938 -7168 -8104 -16443 -16559 -10611 454 -2199 -16470 -17301 -14427 1709 5673 13008
6390 13008 10933 10795 10650 6989 1022 -7529 2234 -9453 -4711 10562 10589 1557 -6777 -552 -1571
6375 -1571 727 23382 27204 11596 -600 2731 14683 14793 6967 -2432 8237 8728 -9079 -14857
6361 -14857 2445 -5649 -12882 -3615 -461 -6793 -947 6177 9923 7247 -4337 10137 21285 16744
6347 16744 -1478 -19414 -10977 6347 3351 4640 13940 10154 2523 -2529 -3322 11040 13571 11389
6333 11389 -193 -12197 -6642 5017 20274 14925 11190 -7327 -18911 -15955 -18242 -15107 -14855
6320a4855m674J3102Q023q54l31r794r814Q55J4009M572L324j2267j0802L191
6306a6315j2901J0939K5971l387j4748M96k237q19P578P427O032K100j4170l600
6292g634l946L528M30j0002p476K838R859P942j363L478M934O219p348j0038J74
6277h405j618J151K510j798R276J9449j2404j5978j7040M415K637J5528j575j1955
6263a5807M624J5748O093o452l762j4836l466O46J6915J1122j0370k937O885l497
6249I06J50L471P647R68p33j4972m391L929L98O307k350J909p666j539L880P02
6233a384M379M525J2409J5243j0705j9047R91J978q028O537p381p996J1214j912
6219H23N77J2806j0454q380m236J7069J0808k2801j6629l242l887J0224J7401
$$ plain form
6320 -14855 -19529 -6427 1596 742 411 -9383 -19197 -18342 -4333 239 3563 -8704 -19506 -16315
6306 -16315 -29216 -18277 7694 4307 -10441 -9945 -12182 -13001 -5423 2004 8036 10136 -4034 -7634
6292 -7634 -11580 -8052 -7622 -17624 -25100 -22262 -12403 -4461 -5824 -2346 2588 8807 1459 -8579 -8405
6277 -8405 -10023 -8872 -6362 -8160 1116 20565 8161 -7817 -24857 -20442 -17805 -2277 -3852 -15807
6263 -15807 -11183 4565 10658 4206 444 -14392 -17858 -17212 -297 10825 455 -2482 4403 906
6249 906 1056 4527 12174 13142 12409 -2563 -6954 -3025 -2627 3680 1330 3239 -4427 -5966 -2086 -1384
6233 -1384 2995 7520 19929 35172 24467 5420 6411 8389 361 6898 -483 -8479 2735 823
6219 823 1400 14206 3752 -4628 -8864 8205 19013 -3788 -20417 -23659 -27546 -17322 79
6206G9J713o709n060O534M583k664J024l424j0022j0588O928k754l990j568N820
6191b0098M469p445j534r206P657J0540o00K981M690K097L663R580J8890N658
6177C1342j9465j7304P779K734Q343O406J0101o01n719n912q314j1051j2955J3804
6163h12m111j2743N349L728J3672R97p732K631L43m706N238N706R850J161o485
6148A2086L3r06l196n433j3076o098j0908j910O887j279m264Q085J2558o797j0500
6133b4718n028n85J4011L292O851o583r914j706M841j442K181J2288J6632k376
6119G744o397o231J2083o91J605K355n287p488p730J2267J7335j2925j1037K0943
6105A6546p348j7496p927P843J6051l281j3998l454p530J7141K0786q186J97o896
$$ plain form
6206 79 1792 -4917 -9977 -3443 1140 -1524 -500 -3924 -13946 -24534 -17606 -20360 -24350 -25918 -20098
6191 -20098 -15629 -23074 -24608 -33814 -26157 -15617 -16217 -13236 -8546 -6449 -2786 6794 25684 31342
6177 31342 11877 -5427 2352 5086 13429 19835 29936 29335 23616 17704 9390 -1661 -14616 -812
6163 -812 -4923 -17666 -12317 -8589 5083 6080 -1652 979 1322 -3384 1854 7560 17410 18571 12086
6148 12086 12119 11213 8017 2584 -10492 -16590 -27498 -29408 -22521 -23800 -28064 -19979 -7421 -14218 -24718
6133 -24718 -29746 -30331 -16320 -13028 -6177 -12760 -22674 -24380 -19539 -20981 -18800 -6512 10120 7744
6119 7744 1347 -4884 7199 6508 8113 10468 5181 -2307 -10037 2230 19565 6640 -4397 16546
6105 16546 9198 -8298 -16225 -8382 7669 4388 -9610 -13064 -20594 -3453 17333 9147 9344 2448
6091B448k961K08M654l840p071N281J1080L45k146l10j6183j442J9465m82j631
6076G415k2k483l085o461k858K360l307j2803J845J730L365J9627J6502M240j1335
6061A4730k0722N43J2210k174J868j1657O25k720Q846J837m71j0400j826J1068
6047A757M148j0200p772R485N892o96q255o006j1880J3412J798k985O511M485
6033c06o074l722M384q97N109m903q922q854Q152P822o75J956o329k040Q33J1462
6017c004M475M641n175J1002p247j3127N62O861j2398j1547R300O288o526j938
6003a7833M162m350l368j1071M649J5794J5325q413j1006j1417L989J6615J729
5990e195j1922K278Q303k42O892P721l850P299k619O97p686j2256J205L185L335
$$ plain form
6091 2448 -513 -305 4349 509 -6562 -1281 9799 10144 7998 7688 -8495 -9937 9528 9046 7415
6076 7415 7393 4910 1825 -4636 -7494 -5134 -8441 -21244 -19399 -17669 -14304 5323 21825 26065 14730
6061 14730 -5992 -5449 6761 4587 6455 -5202 -4577 -7297 1549 3386 2915 -7485 -9311 1757
6047 1757 5905 -4295 -12067 -2582 3310 2614 -5641 -11647 -23527 -10115 -8317 -11302 -4791 -306
6033 -306 -6380 -10102 -5718 -6615 -1506 -6409 -15331 -24185 -16033 -8211 -8886 -6930 -13259 -15299 -14466 -3004
6017 -3004 1471 6112 937 11939 4692 -8435 -7873 -1012 -13410 -24957 -15657 -9369 -15895 -17833
6003 -17833 -13671 -18021 -21389 -32460 -27811 -12017 3308 -5105 -16111 -27528 -23539 -6924 -5195
5990 -5195 -17117 -14839 -6536 -6778 114 7835 3985 11284 8665 9362 1676 -10580 -9375 -6190 -2855
5975b855R558l089j7967J495P434N301j0521q217J3598J5771n985k1220m428j588
5961b2713K868J3239J0356n572Q1K963Q570o938j7566O042M392j4507O697q696
5947b0784l522J5672K880o162J1850R507p953P526K808j324k3542j6388J023N089
5933b3320J1143q539j399J6443N993L049J727r766M816p7l94l93L97N756j701
5918C735j345J849q337R561P757K142n265P043R38p078M473j4816r148j5705l82
5903b4578J5459J0768q705J795J3708M764r662M061L260n961Q62m599j0902r905
5889a9635n444N088J1273o577j7107J6602J963p293j813K690R029M022o949j332
5875a5483l675k700l34O198m063R917N318j2427o023q30O021J3273R781j5034
$$ plain form
5975 -2855 6703 3614 -14353 -12858 -5424 -123 -10644 -18861 -5263 10508 4523 -16697 -21125 -22713
5961 -22713 -19845 -6606 3750 -1822 -1741 1222 9792 2854 -14712 -8670 -4278 -18785 -12088 -20784
5947 -20784 -24306 -8634 -5754 -11916 -66 9441 1488 9014 11822 10498 -13044 -29432 -28409 -23320
5933 -23320 -12177 -20716 -22115 -5672 321 3370 5097 -4669 147 70 -324 -717 -320 5436 3735
5918 3735 2390 4239 -4098 5463 13220 15362 10097 17140 18078 11000 15473 657 -8491 -24196 -24578
5903 -24578 -9119 1649 -7056 -5261 8447 13211 3549 7610 10870 4909 5771 1172 -9730 -19635
5889 -19635 -25079 -19991 -8718 -15295 -32402 -15800 -13837 -21130 -22943 -20253 -11224 -7202 -14151 -15483
5875 -15483 -19158 -21858 -22192 -15994 -20057 -10140 -4822 -17249 -23272 -24102 -18081 -4808 4973 -10061
5861a0061K232q42o23m618r33N462L900p342n749k716J1953J773m280p558K4475
5846E073K331k145M688K19q232j440j120j4868m755M725J133R717J620j0614o170
5831a9838J1799M987O316Q342j1171q701l864k8J6830J5819N542j9140k533j3035
5817h675n190N141K49J942m042J838J2488J3929n274o020r712N376J0474j4911
5803b387L192R72L940O388q712P954k583n55q5J11p80r536j423j2841j7371K0487
5787a3229J0054l808j3786J4274J4665r987L646J4792l705j8460m439j136m697
5774a5816l676P995J7544J764j7905o792J0014L605j4821Q68L900Q599Q450P854
5760A1583j2042m262n56n854k541J4176K559p980m659K591J4449Q47q585p82R26
$$ plain form
5861 -10061 -7829 -8671 -9294 -13912 -14845 -9383 -5483 -12825 -18574 -21290 -9337 -7564 -11844 -19402 5073
5846 5073 7404 5259 9947 10166 1934 494 -626 -15494 -20249 -15524 -14391 -4674 -3054 -13668 -19838
5831 -19838 -8039 -3052 3264 11606 435 -8266 -12130 -12158 4672 20491 26033 6893 4360 -8675
5817 -8675 -13865 -8724 -8475 -6533 -10575 -8737 3751 17680 12406 6386 -3326 2050 12524 -2387
5803 -2387 805 1777 5717 12105 3393 11347 8764 8209 8124 8235 7455 -2081 -3504 -16345 -33716 -13229
5787 -13229 -3175 -6983 -20769 -6495 8170 -1817 1829 16621 12916 -5544 -9983 -11119 -15816
5774 -15816 -19492 -11497 6047 7811 -10094 -16886 -6872 -3267 -18088 -17220 -13320 -4721 3729 11583
5760 11583 -459 -4721 -5277 -11131 -13672 504 3063 -4917 -9576 -6985 7464 8311 -274 -1056 -130
5745a30R823L509j9094j0825M943J296p449j784J000N574J0151p251o885K360
5731a4762K248Q386N726l079j0840k75j893p716L926r29K65n448N140P669J7056
5716E474l810q504j0553R225j691J5886J0249j092m561J963l61q185J0714o96
5702A4058p029j1263l942j74Q740M007j646j3952M405L393P1N552N475j1955k5911
5687c0171m973J5743L795J1865J1249P082n015j976j387k173J0080j419j4294
5674a594l347P455j213n405j290j5797j35K547k723j2236M557M417m981J0668
5660a9077J9773p233J590J470l08J1454K04m28m355j6376p404J3921J4194k2535
5646a5110o91M554L92J2649L341j102j169k046O08O284r294k963K239M863M395
$$ plain form
5745 -130 9693 13202 -5892 -16717 -11774 -10478 -17927 -19711 -18711 -13137 -2986 -10237 -17122 -14762
5731 -14762 -12514 -4128 1598 -1481 -12321 -12596 -14489 -22205 -18279 -19208 -18943 -24391 -19251 -11582 5474
5716 5474 1664 -6840 -17393 -8168 -9859 6027 16276 15184 10623 12586 12225 4040 14754 14058
5702 14058 7029 -4234 -8176 -8350 390 4397 2751 -11201 -6796 -3403 -3332 2220 7695 -4260 -30171
5687 -30171 -35144 -19401 -15606 -3741 7508 14590 9575 7599 6212 4039 14119 12700 -1594
5674 -1594 -4941 2514 1301 -4104 -5394 -21191 -21326 -18779 -21502 -33738 -29181 -24764 -29745 -19077
5660 -19077 696 -6537 -4947 -3477 -3785 7669 7873 7445 3090 -13286 -20690 -6769 7425 -15110
5646 -15110 -15801 -11247 -10855 1794 5135 4033 2864 818 1426 7710 -1584 -4547 -2308 2555 6950
5631F950K273k527m857n672J216N78j142j7048M452R864j1165R91J1311n322Q45
5616i253Q118J321o673m254N436k082m685n570l132l496n281L906L880r188j337
5601c2290J5570J6890J201O81J4560L836o657J74L201n225J532l919l213j2594
5587f253p935j1152K324L29J4906J1238J3176j2798J1024K1185p651j5973o401
5574F019M019M941q537k1038m983K0949J1708q918j0872N723J1400j493j5204
5561f286j2195j110L649J2456J0251L5L39P15l954j057R428K623q944k0934j5939
5546c0923J2260J7027r76j4022N308K2832O880r497P760k182j3795m276j084O495
5532A807l260l215q192k898m120m886R985k809N822J0707j1530j7424J169M002
$$ plain form
5631 6950 9223 6696 1839 -3833 -2617 -2039 -3181 -20229 -15777 -5913 -17078 -16087 -4776 -10098 -9253
5616 -9253 -1135 186 -6487 -10741 -5305 -7387 -12072 -17642 -20774 -24270 -29551 -25645 -21765 -30953 -32290
5601 -32290 -16720 170 1371 2052 16612 20448 13791 13965 17166 11941 13473 9554 6341 -6253
5587 -6253 -14188 -25340 -23016 -22687 -7781 3457 16633 3835 14859 36044 28393 12420 6019
5574 6019 10038 14979 6442 -14596 -19579 1370 13078 4160 -6712 -989 10411 8918 -6286
5561 -6286 -18481 -19591 -15942 -3486 6765 6800 7139 7854 3900 2843 12271 14894 5950 -14984 -30923
5546 -30923 -18663 -1636 -2612 -16634 -11326 11506 18386 8889 16649 14467 672 -3604 -4688 1807
5532 1807 -1453 -4668 -12860 -15758 -19878 -24764 -14779 -17588 -11766 -1059 -12589 -30013 -28844 -24842
5518b4842J0937n353o234Q15J4480J384k0195J2863M28L365p623j2229L806J2052
5504a6346J0257J2199J7613J2588j3138j6843p853j0355l510K655J672R452O034
5491D425k014Q498q710j6230j1891J0343J4428K900r348j4738J7929K2970M034
5478B2596o921j1386j2298j9554L743J4604J3481N232p309p617J384k291q811
5465a5147j5614k303J2924n328k88Q983K067q384J3417r98m363j075L603o354
5451a8860J2016O324R554M668j5203q681r7J3793m148j475J779J2042O155j4620
5437C247N14j3761j8200J1884l094J3603J2931j5107j0062J1039J2032p57M056
5424H325O686K7r098n555j17j0193N533J0733N297j7873j6885J3859J0704l130
$$ plain form
5518 -24842 -13905 -19258 -25492 -24677 -10197 -8813 -29008 -16145 -15717 -12352 -19975 -32204 -28398 -16346
5504 -16346 -6089 6110 23723 36311 23173 6330 -1523 -11878 -15388 -12733 -11061 -1609 4425
5491 4425 2411 10909 2199 -14031 -25922 -15579 -1151 1749 -7599 -22337 -4408 18562 22596
5478 22596 15675 4289 -8009 -27563 -23820 -9216 4265 9497 2188 -5429 -4045 -6336 -15147
5465 -15147 -30761 -33064 -20140 -25468 -25756 -16773 -14706 -23090 -9673 -10671 -15034 -16109 -12506 -18860
5451 -18860 -6844 -520 9034 13702 -1501 -10182 -10279 3514 -634 -2109 -330 11712 17867 3247
5437 3247 3761 -10000 -28200 -16316 -19410 -5807 7124 -7983 -18045 -7006 5026 4269 8325
5424 8325 15011 15038 5940 385 268 -9925 -4392 6341 11638 -6235 -23120 -9261 1443 -1687
5410a687N636N517j609o260J408o550j6495J108k1717j1669J4996J3786k812K838
5396b3510Q385j507n103m686P944J5239P079J6059P376j6448k8199o421J446M465
5382a7881J1235J6969O517J711j2150j5381l519n00n642O600Q57j0237K345n88
5368a9664J440J5010J6072J2588k551p841Q10L075j4589j1544n480O693O042K58
5354C19j2071l613r070o709r841k891J1349J6898l532n081J3082k830L930R269
5340g91M373j0532j1747R850O678R016m47k739j4820j6382O050M189J837Q718
5326f747K2793q603n467o44J3289q31k664m450J21J4207m599j0495j8619k005
5312a4714J4723P320j654k196O229n42k172m833n35j2050O090J5061L82j1425
$$ plain form
5410 -1687 3949 9466 7857 1597 3005 -3545 -20040 -18932 -40649 -52318 -37322 -23536 -26348 -23510
5396 -23510 -15125 -16632 -21735 -26421 -18477 -3238 3841 19900 27276 10828 -17371 -23792 -22346 -17881
5382 -17881 -6646 10323 16840 18551 6401 -8980 -12499 -12999 -18641 -12041 -11184 -21421 -19076 -19664
5368 -19664 -18224 -3214 12858 25446 22895 15054 15864 18939 4350 -7194 -12674 -5981 61 319
5354 319 -11752 -15365 -24435 -31144 -40985 -43876 -32527 -15629 -19161 -24242 -11160 -13990 -10060 -791
5340 -791 3582 -6950 -18697 -8847 -2169 6847 6400 3661 -11159 -27541 -21491 -17302 -15465 -6747
5326 -6747 16046 7443 1976 1332 14621 13790 11126 6676 6797 21004 16405 5910 -12709 -14714
5312 -14714 9 7329 5675 3479 9708 9166 6994 2161 1626 -10424 -4334 10727 11109 -316
5298c16r305j3301j5092L099M079K0663J3548q234n499p047P291O35m419K664
5284a1234J7156M276q313j1754L430o471k634N859R31p027m224k636O9P948o480
5269b1104k527J5208M13r232p185k190j52l95j428m225k460k30J5865O796K799
5254a0047J069k708n784J527K4509L581j3071J482p065n353M241O065J572P802
5240G820K509j1755O75J7732R12j0824j7171P753J2545M843j6866M343M359m836
5226B039k059M385L906Q177l248j1052N898k85n068m431m979o053j0196O899L815
5211a2252J1024n702o707J6048L970l923j4898l488R693Q61J2548M707q166j1686
5197g971j5219L169J5924J2684q49m538j4530l838n35j071J7504n935M412M291
$$ plain form
5298 -316 -9621 -22922 -38014 -34915 -30836 -10173 3375 -4859 -10358 -17405 -10114 -9479 -13898 -11234
5284 -11234 5922 10198 1885 -9869 -6439 -12910 -15544 -9685 -8754 -15781 -20005 -22641 -22572 -14624 -21104
5269 -21104 -23631 -8423 -8010 -17242 -24427 -26617 -26769 -27164 -28592 -32817 -35277 -35507 -19642 -12846 -10047
5254 -10047 -8978 -11686 -17470 -15943 8566 12147 -924 558 -6507 -11860 -7619 -1554 18 7820
5240 7820 10329 -1426 -751 16981 17893 7069 -10102 -2349 10196 15039 -1827 2516 6875 2039
5226 2039 -20 4365 8271 16448 13200 2148 8046 7761 2693 -1738 -6717 -12770 -22966 -16067 -12252
5211 -12252 -1228 -6930 -13637 2411 6381 2458 -12440 -15928 -6235 -5374 7174 11881 3715 -7971
5197 -7971 -23190 -20021 -4097 8587 7738 3200 -11330 -15168 -15703 -16774 730 -5205 -793 3498
5183C498m385j1529N048P524l299J0150k629j6890j1386r556k419N187J9130J6367
5169D811L408j1455q114m331o795L962R147M85j5236m971j733J0935q745l018
5155c1650O674J1349L680p560K954J6112j3962j4844o684L939J2498O52J0749
5142f093J2969k1850j2765J6240L109m366J5205M474j0296j0587K172l1L641p559
5128a5737l273K445K656J5711M919k443M528o136L814m802R374O771o478r819
5114A530l874L520j108o224M381n841j0082M968J6452N161j4665j1905N808p466
5100a9345o505k592j3296n960J8011K1050n75o394K093l245J4773L009j3225l835
5086a6036J9466J1715k1047r353j982L140K064L604N420j880q324J2272L414k822
$$ plain form
5183 3498 -887 -12416 -7368 156 -3143 7007 4378 -12512 -23898 -33454 -35873 -30686 -11556 4811
5169 4811 8219 -3236 -11350 -15681 -22476 -18514 -9367 -8882 -24118 -29089 -30822 -19887 -28632 -31650
5155 -31650 -24976 -13627 -9947 -17507 -14553 1559 -12403 -27247 -33931 -29992 -17494 -16842 -6093
5142 -6093 6876 -14974 -27739 -11499 -8390 -12756 2449 6923 -3373 -13960 -11788 -11819 -8178 -15737
5128 -15737 -19010 -16565 -13909 1802 6721 4278 8806 2670 6484 1682 11056 17827 11349 1530
5114 1530 -2344 1176 68 -6156 -1775 -7616 -17698 -12730 3722 8883 -5782 -17687 -11879 -19345
5100 -19345 -25850 -28442 -41738 -47698 -29687 -8637 -9212 -15606 -13513 -16758 -1985 1024 -12201 -16036
5086 -16036 3430 15145 -5902 -15255 -17237 -14097 -12033 -8429 -3009 -4889 -13213 -941 2473 -349
5072c49J0650O24r65R29j5707p635L127o470J552K022Q539J0984p185j5931R620
5057f195K0721n435j204N916J607r52n71R1j2081n425L673J2805m162m62m553
5042C773n710q76j901J6607Q13j1756m453j004m961k903p115J05n989l396O606
5027b2160k481j5806M709K0064K3446K175p040j7734n338q93R085J2368M76n444
5013d573J439O622l261j2855J4087j879j2210n096K0586L304n011j0311r436m953
4999b3547j776k789M505P639N536k577R647O661n069Q421K562l659p60p346j6438
4984a8990Q727O715o18M602m679q303J2921K822K830k928l948J110j4601m428
4970a8768L082j206M616o300m780J571j906o735L638O864L998K1327j0641p761
$$ plain form
5072 -349 10301 10925 9960 10889 -4818 -12453 -9326 -15796 -14244 -12222 -3683 7301 116 -15815 -6195
5057 -6195 14526 9091 7887 13803 15410 14458 13887 13978 1897 -3528 145 12950 8788 8326 3773
5042 3773 -1937 -2813 -4714 11893 12706 950 -3503 -4507 -9468 -12371 -19486 -19381 -25370 -28766 -22160
5027 -22160 -24641 -40447 -35738 -15674 7772 9947 2907 -14827 -20165 -21058 -11973 395 871 -4573
5013 -4573 -3134 3488 227 -12628 1459 -420 -12630 -17726 2860 6164 1153 -9158 -18594 -23547
4999 -23547 -25323 -28112 -23607 -15968 -10432 -13009 -3362 3299 -1770 6651 9213 5554 4794 -2552 -18990
4984 -18990 -10263 -3548 -4166 436 -4243 -12546 375 3197 6027 3099 -849 261 -14340 -18768
4970 -18768 -15686 -16892 -12276 -18576 -23356 -21785 -23691 -30426 -26788 -19924 -15926 5401 -5240 -13001
4956a3001Q839P532j4045r627M51J330J4020J3084k115m707j203l195Q994J2687
4942A9044J712j7776l563J6228J8950q986M280N121k588n463j5460l717L45p491
4928F36J4113J154l605j6480q714j918O386j229R202O972r156o358j0831o592
4914b6420Q877J2864P117J4553J880m467Q549q196q079q329J296j2091J382j50
4900a1214p296p792m930N854M501J0211O168P449N727n234j533m767k64j2994
4886a6114k291j837O173J5732q426m562m238j2655R698J1363J1089j1446K199
4873e315J5789j4735k5023n636J3320l778r554J3150K0930K15J718qk396n140
4859f463k2310o399P093J8297J1465J9101j231n62m432j0297N328p759j8824O06
$$ plain form
4956 -13001 -4162 3370 -10675 -20302 -19851 -18521 -4501 8583 6468 1761 558 -2637 6357 19044
4942 19044 20756 2980 -583 15645 34595 25609 29889 35010 32422 26959 11499 7782 8127 636
4928 636 14749 15903 12298 -4182 -12896 -14814 -8428 -9657 -455 6517 -2639 -8997 -19828 -26420
4914 -26420 -17543 -4679 2438 16991 18871 14404 22953 14757 6678 -1651 -355 -12446 -11064 -11214
4900 -11214 -18510 -26302 -31232 -25378 -20877 -10666 -4498 2951 8678 3444 1911 -2856 -3120 -16114
4886 -16114 -18405 -20242 -14069 1663 -6763 -11325 -15563 -28218 -18520 -7157 3932 -7514 -5315
4873 -5315 10474 -4261 -29284 -34920 -21600 -25378 -34932 -21782 -852 -637 1081 1073 -1323 -6463
4859 -6463 -28773 -35172 -28079 -9782 1683 20784 19553 18991 14559 4262 9590 1831 -16993 -16387
4845a6387Q654P86L695n676n015o131p478j875Q355L756r29J2686J0802m064j0947
4830i768N542L932j0086J876J5114J1467O104K952R137j1792k3995k2599P358
4817a4758J0968j000J243R262L408r01O065j1905p937M425J4051O230r759K036
4803A1428J1537m291k022J2154j395l043r756n097m767j45N5q033o80P682p243
4788c616j4444o780L560j888P304J1538L859j163k868L967J092m801k009R877
4774C628M231p704K481J3155j894J4115P535m540j8237o434Q301r321n718l24
4760g26P075j369M068k911j794n197j7222m639l861N067n795M343K525n473L2
4745b5877Q049k666L585j1033n13M995Q252o3Q85n639P773M516J2154Q140L61
$$ plain form
4845 -16387 -7733 -6947 -3252 -8928 -13943 -20074 -27552 -29427 -21072 -17316 -18245 -5559 5243 1179 -9768
4830 -9768 -4226 -294 -10380 -8504 6610 18077 24181 27133 36270 24478 483 -22116 -14758
4817 -14758 -3790 -4790 -3547 5715 9123 8222 14287 2382 -5555 -1130 12921 19151 9392 11428
4803 11428 22965 18674 16652 28806 27411 24368 14612 9515 4748 4603 4658 -3375 -4055 3627 -3616
4788 -3616 -18060 -24840 -21280 -23168 -15864 -4326 -467 -1630 -4498 -531 561 -4240 -6249 3628
4774 3628 7859 155 2636 15791 13897 28012 35547 31007 12770 6336 14637 5316 -402 -726
4760 -726 6349 4980 9048 6137 4343 -854 -18076 -22715 -26576 -21509 -27304 -22961 -20436 -25909 -25877
4745 -25877 -17828 -20494 -16909 -27942 -28455 -23460 -15208 -15271 -14386 -20025 -12252 -7736 4418 12558 12919
4730A2919L19j0818j4959j764j0645R397J0222J3316L906L466l532j8085L816
4717b442N544k920p204K969J339L046j3761N385k058p430L84J0268N363K2033
4703B0516K749j1095K356m240k574j1513p049r930N813J744J8366P765r06r988
4689B014j4294L887J8261P767m831l731j8979k714J992n055O826J6689Q109n232
4675A0709m582m256m391J56m383j5340R485J931Q246K785j1207L0P551N497R198
4660A1429R658k358o512o501j3574Q946N607l81P288Q98r724j3752m802o118J1762
4645h134J7744M813p651k641j5856j3854M104l976M238M116J3498k062m973j351
4631a1985Q161o672l854Q713q069m393K269j679J266J1525M30N918N410L731k212
$$ plain form
4730 12919 13238 2420 -12539 -14303 -24948 -15551 -5329 7987 11893 15359 11827 -6258 -2442
4717 -2442 3102 182 -7022 -4053 -2714 332 -13429 -8044 -10102 -17532 -17148 -6880 -1517 20516
4703 20516 23265 12170 14526 10286 7712 -3801 -10850 -20780 -14967 -13223 5143 12908 12002 2014
4689 2014 -12280 -8393 9868 17635 12804 9073 -9906 -12620 -10628 -15683 -8857 7832 15941 10709
4675 10709 6127 1871 -2520 -2364 -6747 -22087 -12602 -10671 -2425 360 -10847 -10817 -3266 2231 11429
4660 11429 21087 18729 12217 5716 -7858 1088 6695 6314 13602 14500 4776 -8976 -13778 -19896 -8134
4645 -8134 9610 14423 6772 4131 -11725 -25579 -21475 -25451 -21213 -17097 -3599 -5661 -10634 -11985
4631 -11985 -3824 -10496 -14350 -5637 -13706 -18099 -15830 -17509 -16243 -4718 -4288 1630 7040 10771 8559
4616H559Q031L382r050J286m947k2792j1392R31J066Q461Q773J5410R365l779
4602A3304M669m90q618P61p544N13Q464N752m618m602m511K417P408K0467j8663
4587A4709j6240o140M65n72M277n16L217K635q208M372R462j827J6877Q397j7654
4572A3254j4479n498P339m016m175P68l61j7353p424J2599R508Q85j712J387J4971
4557E693Q562l404k543J687j3137j9885m295J2022j272N577J0771J1736M021N995
4543B1528k890k1382n691j0489j2023o887J8104K5723N799l906J126r14J2632
4530B0730L938r889l447j6128j6462J3176K52J0994Q971k305n638j0131k46K052
4516d133K327k508J1132O510j2763m278J3211n562k007o721j4217r613K6234J0366
$$ plain form
4616 8559 16590 19972 10922 12208 7261 -15531 -26923 -25992 -24926 -16465 -7692 7718 17083 13304
4602 13304 17973 17483 8865 9626 2082 2595 11059 16811 12193 7591 3080 5497 12905 33372 14709
4587 14709 -1531 -7671 -7206 -7778 -3501 -4017 -800 1835 -6373 -2001 7461 5634 22511 30908 13254
4572 13254 -1225 -6723 616 -3400 -7575 -6807 -7168 -24521 -31945 -19346 -9838 -8953 -10665 -9278 5693
4557 5693 14255 10851 8308 9995 -3142 -23027 -27322 -15300 -16572 -10995 -224 11512 15533 21528
4543 21528 18638 -2744 -8435 -18924 -30947 -37834 -19730 5993 11792 7886 9012 8098 20730
4530 20730 24668 14779 11332 -4796 -21258 -8082 -7830 3164 12135 9830 4192 -5939 -6185 -4133
4516 -4133 -1806 -4314 6818 13328 565 -3713 9498 3936 1929 -4792 -19009 -28622 -2388 7978
4502G978M124K381l538K748N19j0517j7233k975P63L481K5606J1505j1592j7303
4488d053L757J42l204n590q697R696K850L650P926q857K962m933m96J183P45R186
4472F267P901l997K113o349j8005L463Q734j2706J4010L172j9734j118J6201J3344
4458A3296j079k987K373r391j3657r36L146o40P601l164k855L450J500o082R363
4443f2P300q506p03q268p637l576J5863r878N993J454n469q915K721K669o126
4428b3140p56j0135L987J5610M364M40l977j3350K273J8387R808p966j0976N795
4414i636Q081J3953k626O805M540p093k2851r396K814Q666J2132j0199p135P826
4400d119j967J049k049M605N399j1220Q82J0618m178N319M895j9020R072J5648
$$ plain form
4502 7978 12102 14483 10945 13693 14212 3695 -13538 -16513 -15750 -12269 13337 24842 13250 -4053
4488 -4053 -296 -154 -3358 -8948 -17645 -7949 -5099 -1449 6477 -2380 582 -4351 -4847 -3664 -2919 6267
4472 6267 14168 10171 12284 5935 -12070 -8607 127 -12579 1431 4603 -15131 -16249 -48 13296
4458 13296 12217 9230 11603 2212 -11445 -12381 -9235 -9875 -2274 -5438 -8293 -4843 -3343 -9425 -62
4443 -62 7238 -1268 -1971 -10239 -17876 -21452 -5589 -15467 -9474 -8020 -13489 -22404 -19683 -17014 -23140
4428 -23140 -23896 -34031 -30044 -14434 -10070 -9630 -13607 -26957 -24684 -6297 3511 -4455 -15431 -9636
4414 -9636 -1555 12398 9772 16577 21117 14024 -8827 -18223 -15409 -6743 5389 -4810 -11945 -4119
4400 -4119 -6086 -5037 -7086 -2481 2918 -8302 -7420 3198 -980 4339 9234 -9786 -714 14934
4386A4934j3890m677M74R454P144R272R419j948n734J1712m659p505j1696j0955
4372A345j4861q790M819j811M847J3915J0664o012j0133l49n578K151J0898J168
4358B273J901Q316L025l079j5751r67O282o538j0152j1344j1534R510P281J2969
4344g808M667p35j2508K872J3298O688p205k247R898J3092M736K055j0150M742
4330B1395N15j4024j9097j3328K147J1657k705j343l629J0527J7361j178j0194
4317a896j3239k274P61p383l345Q473J4072M980L0150J507q947n728p937j8915
4303i721K200J4089M550j0521k1873n697K587K974N718k824L831J6935J0742k864
4289A0126L982p28O341j0507j2380n426M636N906J4420q745o768O242j5959p368
$$ plain form
4386 14934 1044 -3633 -3159 6295 13439 22711 32130 30182 24448 36160 31501 23996 12300 1345
4372 1345 -13516 -22306 -17487 -19298 -14451 -536 10128 4116 -6017 -6366 -11944 -9793 1105 2273
4358 2273 4174 12490 15515 12436 -3315 -4282 2000 -4538 -14690 -26034 -37568 -28058 -20777 -7808
4344 -7808 -3141 -3876 -16384 -13512 -214 6474 -731 -2978 6920 20012 24748 26803 16653 21395
4330 21395 21910 7886 -11211 -24539 -22392 -10735 -13440 -14783 -18412 -7885 9476 8298 -1896
4317 -1896 -15135 -17409 -16648 -24031 -27376 -18903 -4831 149 30299 31806 22859 17131 9194 -9721
4303 -9721 -7521 6568 11118 597 -21276 -26973 -24386 -21412 -15694 -18518 -14687 2248 12990 10126
4289 10126 14108 13380 19721 9214 -3166 -8592 -3956 1950 16370 7625 857 7099 -8860 -16228
4275a6228k449n415O494M704R255r24q824K199J0481O226j1131o564N927J045
4261e204J1998l542r042J0261K380P660q087j54k161O393o6q605j92j44j983j815
4245b303Q205n969k449P948R449r040n670P744O969O471K120r985m956m477K482
4230F539r44L387p590m684J47J7412J4906j882n59J812o863j2999o081n25j028
4215A048L755J5295J0089j9575k6128q125m829M190N361J8471J3336N94n905j4275
4201f698J893M368J0495j3151J780N126K520n684O414R475m995J675j0568o060
4187c410J966j1311j506J8215K0501j2524N474n6j5352l457L006l664l535P187
4173A534K327m029J618o109J1300J094j3103j2816M093Q393J6047M217m023L33
$$ plain form
4275 -16228 -18677 -24092 -17598 -12894 -3639 -4563 -13387 -11188 -707 5519 -5612 -12176 -6249 -5204
4261 -5204 6794 3252 -5790 4471 6851 14511 6424 6270 4109 10502 10436 1831 1639 1495 -488 -2303
4245 -2303 5902 -67 -2516 5432 14881 5841 171 7915 14884 21355 23475 13490 8534 4057 6539
4230 6539 5595 8982 1392 -3292 -3145 14267 29173 27291 26732 28544 21681 8682 2601 2076 1048
4215 1048 4803 20098 30187 10612 -15516 -23641 -28470 -24280 -18919 -448 12888 13482 7577 -6698
4201 -6698 -4805 -437 10058 -3093 -1313 3813 6333 649 7063 16538 11543 13218 2650 -3410
4187 -3410 -1444 -12755 -14261 3954 24455 11931 17405 17349 1997 -1460 1546 -2118 -5653 1534
4173 1534 3861 -168 1450 -4659 6641 7735 -5368 -18184 -14091 -5698 10349 14566 10543 10876
4159A0876j038q002l025O180j1977n648P130P355R565k713p861j5392K104J9631
4145G185K509j5276K312P700p04M35o844j4867J3241P771o342j6876M75K157r609
4130b6733O44n029Q666O199j7562m009L641N373J1216L591J4036Q375j658j4698
4116g948j1488o62r54J4045J0008L655p696j0001P301l58M476k075p029M932N749
4101A955N322o780m494o829j902M883j865Q508j886Q570K009j8771r012J2936
4087g356J2039L112j353m735j801R210K722k267n672n725N812N816o402r239K218
4072c621J68K142N268l213q872p951J947o507O68M880k877j334p234L922N238
4057a7376J0478j1619j456M925O285K564m080O575K571p42o51O793j5108q67J1858
$$ plain form
4159 10876 9838 1836 -1189 4991 -6986 -12634 -5504 1851 11416 8703 842 -14550 -12446 7185
4145 7185 9694 -5582 -3270 4430 3726 4161 -2683 -17550 -4309 3462 -2880 -19756 -19281 -17124 -26733
4130 -26733 -26089 -31118 -22452 -16253 -33815 -37824 -34183 -28810 -17594 -14003 33 8408 6750 -7948
4116 -7948 -19436 -20098 -21052 -7007 3001 6656 -1040 -11041 -3740 -4098 378 -1697 -8726 -3794 1955
4101 1955 7277 497 -3997 -10826 -12728 -7845 -9710 -1202 -3088 5482 7491 -11280 -20292 -7356
4087 -7356 4683 7795 6442 1707 -94 9116 11838 9571 3899 -1826 3986 9802 3400 -5839 -3621
4072 -3621 -3453 -1311 3957 744 -8128 -16079 -14132 -20639 -19971 -15091 -17968 -19302 -26536 -22614 -17376
4057 -17376 -6898 -18517 -19973 -15048 -8763 -6199 -10279 -3704 -1133 -1875 -2526 4267 -10841 -11708 150
4042A50n19K671n168l997J893k681K389n0N596L574N709q775j0887J913J169M889
4026b124J4107J676l893j9655j808m068Q689M128P708n157r037O267K382l600
4012d385l343l78L957J5104J91j3906j803n159R638L284O200L031l915j1522j0206
3997a3212k290q233J2990J0504P600K396j444q088M7L555p657j604P069O902l196
3982E339o23q18j135l651q887J6213r56l764k939k853m916L341N001P369Q93o216
3966A398j2369N563M713r004k143k543j923q540J74J4135L928J0234P208N361
3952A6192J929J3416k718j425Q49j8977L380O670m682j2314j0039R091J1034O496
3938A8902N380l585j1080q085J66j145n496J4201k928j1116m896M361l716j2097
$$ plain form
4042 150 -369 2302 -2866 -6863 -4970 -7651 -5262 -5312 284 3858 9567 792 -10095 -8182 -7013 -2124
4026 -2124 11983 13659 9766 -9889 -11697 -15765 -7076 -2948 4760 -397 -9434 -3167 -785 -4385
4012 -4385 -7728 -8106 -4149 10955 11146 -2760 -4563 -9722 -84 3200 9400 12431 8516 -3006 -13212
3997 -13212 -15502 -23735 -10745 -241 7359 9755 8311 223 270 3825 -3832 -5436 1633 8535 5339
3982 5339 4716 3898 2763 -888 -9775 6438 5482 1718 -1221 -4074 -8990 -5649 -648 6721 7614 1398
3966 1398 -10971 -5408 -695 -9699 -11842 -14385 -16308 -24848 -24674 -10539 -6611 3623 10831 16192
3952 16192 18121 31537 28819 27394 28243 9266 12646 19316 14634 2320 -7719 1372 12406 18902
3938 18902 24282 20697 9617 1532 1698 553 -4943 9258 6330 -4786 -9682 -5321 -9037 -21134
3924b1134k454K45m359l068J717J3418K4905k658p335k417R99k789N51l59M53
3909d285O21M571J1843J458o18J2477J0383l15k0148j7577p764L820J3830R084
3895A7380j1849j7175l035K212l229J953J0212P313N363L095M524j866j1819q820
3881e741o809j53m672j3142J7075J6510q238k088J531N155l486R160L321J256
3867I679l002k798j0121O07n12N714M289J2348O978k225j0700j4916n435Q39J179
3852h076J2098J3625o952j1354L80O499K158n336q103L641m340J2691O68k914
3838D685j902J97M791j699m429m732l125L782J7973J3836n79j1013J24M000j4668
3823G241M594m607L281q09N697J669p914q87n447n778l880L558J5357J1173o615
$$ plain form
3924 -21134 -23588 -23343 -27702 -30770 -29053 -15635 9270 6612 -723 -3140 -2141 -4930 -4379 -4738 -4285
3909 -4285 -3664 907 12750 14208 13590 26067 36450 36135 15987 -1590 -9354 -5534 8296 17380
3895 17380 5531 -11644 -14679 -12467 -15696 -13743 -3531 3782 9145 12240 16764 14898 3079 -5741
3881 -5741 -12550 -12703 -17375 -30517 -13442 3068 -5170 -7258 -5727 -572 -4058 5102 8423 9679
3867 9679 6677 3879 -6242 -5635 -6147 -433 3856 16204 23182 20957 10257 -4659 -10094 -9255 -8076
3852 -8076 4022 17647 10695 -659 -279 6220 8378 3042 -5061 -1420 -5760 6931 7599 4685
3838 4685 2783 2980 7771 6072 1643 -3089 -6214 -2432 15541 29377 28798 17785 17909 21909 7241
3823 7241 11835 7228 10509 9700 15397 17066 9152 8265 2818 -2960 -6840 -3282 12075 23248 16633
3808A6633j3916r622l047J2689J0666k350R35K578K011N549P815q413j9238j3530
$$ plain form
3808 16633 2717 -6905 -9952 2737 13403 11053 11988 14566 16577 22126 29941 21528 2290 -11240
$$ [...]
##END NTUPLES=NMR SPECTRUM
##END=
