##TITLE=Analysis number 328981
Compound Code cc 68213
Book Reference 546/6
Project Code adrs
Chemist Name craigr
##JCAMPDX= 6.0         $$ Bruker NMR JCAMP-DX V2.0
##DATA TYPE= NMR SPECTRUM
##DATA CLASS= NTUPLES
##ORIGIN= Bruker BioSpin GmbH
##OWNER= nmr
$$ XWIN-NMR		Version 3.5
$$ Mon Jul 23 09:24:49 2007 GMT Daylight Time (UT+1h)  MAYBRIDGE\nmr@NMR_250MHZ
##.OBSERVE FREQUENCY= 250.131544655141
##.OBSERVE NUCLEUS= ^1H
##.ACQUISITION MODE= SIMULTANEOUS (DQD)
##.ACQUISITION SCHEME= undefined
##.AVERAGES= 16
##.DIGITISER RES= 18
##SPECTROMETER/DATA SYSTEM= dpx250
##.PULSE SEQUENCE= zg30
##.SOLVENT NAME= CDCl3
##.SHIFT REFERENCE= (INTERNAL, CDCl3, 0, 16.522)
##AUDIT TRAIL= $$ (NUMBER, WHEN, WHO, WHERE, WHAT)
$$ ##TITLE= Audit trail, XWIN-NMR		Version 3.5
$$ ##JCAMPDX= 5.01
$$ ##ORIGIN= Bruker BioSpin GmbH
$$ ##OWNER= nmr
$$ C:\u/data/dgb/nmr/ADRS/1320/pdata/1/auditp.txt
$$ ##AUDIT TRAIL=  $$ (NUMBER, WHEN, WHO, WHERE, WHAT)
(   1,<2007-07-23 09:24:26.26 +100>,<MAYBRIDGE\nmr>,<NMR_250MHZ>,
      <created by zg, POWCHK disabled, PULCHK disabled
       configuration hash MD5:
       76 6E 9A 78 1E 09 19 81 EC 84 63 8F B0 6A 59 2D
       data hash MD5: 64K
       E2 65 44 54 A0 D3 5E D7 BC 77 77 4D 14 91 AC 00>)
(   2,<2007-07-23 09:24:39.29 +100>,<MAYBRIDGE\nmr>,<NMR_250MHZ>,
      <Start of raw data processing
       ef LB = 0.3 FT_mod = 6 PKNL = 1 SI = 32K 
       data hash MD5: 32K
       68 56 5A B8 8F 6B B6 AA 3A 83 F7 78 7D F1 18 C5>)
(   3,<2007-07-23 09:24:40.91 +100>,<MAYBRIDGE\nmr>,<NMR_250MHZ>,
      <apk 
       data hash MD5: 32K
       CF 01 BD 09 6E 14 25 CF B6 3C F6 A2 1E F0 B3 35>)
(   4,<2007-07-23 09:24:41.65 +100>,<MAYBRIDGE\nmr>,<NMR_250MHZ>,
      <abs ABSG = 5 
       data hash MD5: 32K
       A7 B1 1A 46 9B 98 08 1F 3F A4 DD 35 C3 E5 BB 41>)
$$ ##END=
$$ 
$$ hash MD5
$$ CF FE D8 C9 57 11 52 33 42 9D CC 5D D3 C3 8C BF
##$RELAX= 
##$RELAX= 
##$RELAX= 
##$RELAX= 
##$RELAX= 
##$RELAX= 
##$RELAX= 
$$ Bruker specific parameters
$$ --------------------------
##$DU= <C:\u>
##$EXPNO= 1320
##$NAME= <ADRS>
##$PROCNO= 1
##$TYPE= <nmr>
##$USER= <dgb>
##$AMP= (0..31)
100 100 100 100 100 100 100 100 100 100 100 100 100 100 100 100 100 100 
100 100 100 100 100 100 100 100 100 100 100 100 100 100 
##$AQSEQ= 0
##$AQ_mod= 3
##$AUNM= <au_zg>
##$AUTOPOS= <4 >
##$BF1= 250.13
##$BF2= 250.13
##$BF3= 250.13
##$BF4= 250.13
##$BF5= 500.13
##$BF6= 500.13
##$BF7= 500.13
##$BF8= 500.13
##$BYTORDA= 1
##$CFDGTYP= 0
##$CFRGTYP= 5
##$CHEMSTR= <none>
##$CNST= (0..31)
1 1 145 1 1 1 1 1 1 1 1 1 1 1 1 1 1 1 1 1 1 1 1 1 1 1 1 1 1 1 1 1 
##$CPDPRG= <>
##$CPDPRG1= <>
##$CPDPRG2= <>
##$CPDPRG3= <>
##$CPDPRG4= <mlev>
##$CPDPRG5= <mlev>
##$CPDPRG6= <mlev>
##$CPDPRG7= <mlev>
##$CPDPRG8= <mlev>
##$CPDPRGB= <>
##$CPDPRGT= <>
##$D= (0..31)
0 1 0 0 0 0 0 0 0 0.06 0 0 0 0 0 0 0.0002 0 0 0 0 0 0 0 0 0 0 0 0 0 0 
0 
##$DATE= 1185179065
##$DBL= (0..7)
120 120 120 120 120 120 120 120 
##$DBP= (0..7)
150 150 150 150 150 150 150 150 
##$DBP07= 0
##$DBPNAM0= <>
##$DBPNAM1= <>
$$ [...]
##$SUBNAM7= <"">
##$SUBNAM8= <"">
##$SUBNAM9= <"">
##$SW= 20.6930455092707
##$SWIBOX= (0..15)
0 0 3 0 0 0 0 0 0 0 0 0 0 0 0 0 
##$SW_h= 5175.983436853
##$TD= 65536
##$TD0= 1
##$TE= 296.16
##$TE2= 300
##$TE3= 300
##$TEG= 300
##$TL= (0..7)
0 120 120 120 120 120 120 120 
##$TP= (0..7)
150 150 150 150 150 150 150 150 
##$TP07= 0
##$TPNAME0= <>
##$TPNAME1= <>
##$TPNAME2= <>
##$TPNAME3= <>
##$TPNAME4= <>
##$TPNAME5= <>
##$TPNAME6= <>
##$TPNAME7= <>
##$TPOAL= (0..7)
0.5 0.5 0.5 0.5 0.5 0.5 0.5 0.5 
##$TPOFFS= (0..7)
0 0 0 0 0 0 0 0 
##$TUNHIN= 0
##$TUNHOUT= 0
##$TUNXOUT= 0
##$USERA1= <user>
##$USERA2= <user>
##$USERA3= <user>
##$USERA4= <user>
##$USERA5= <user>
##$V9= 5
##$VALIST= <valist>
##$VCLIST= <CCCCCCCCCCCCCCC>
##$VD= 0
##$VDLIST= <DDDDDDDDDDDDDDD>
##$VPLIST= <PPPPPPPPPPPPPPP>
##$VTLIST= <TTTTTTTTTTTTTTT>
##$WBST= 1024
##$WBSW= 4
##$XGAIN= (0..3)
0 0 0 0 
##$XL= 0
##$YL= 0
##$YMAX_a= 418416
##$YMIN_a= -423138
##$ZGOPTNS= <>
##$ZL1= 120
##$ZL2= 120
##$ZL3= 120
##$ZL4= 120
##$ABSF1= 16.522
##$ABSF2= -4.171173
##$ABSG= 5
##$ABSL= 3
##$ALPHA= 0
##$AQORDER= 0
##$ASSFAC= 0
##$ASSFACI= 0
##$ASSFACX= 0
##$ASSWID= 0
##$AUNMP= <proc_1d>
##$AZFE= 0.1
##$AZFW= 0.1
##$BCFW= 0
##$BC_mod= 0
##$BYTORDP= 0
##$COROFFS= 0
##$CY= 12.5
##$DATMOD= 1
##$DC= 0
##$DFILT= <>
##$DTYPP= 0
##$F1P= 14.0000005364418
##$F2P= -0.99999901652339
##$FCOR= 0.5
##$FTSIZE= 32768
##$FT_mod= 6
##$GAMMA= 0
##$GB= 0
##$INTBC= 1
##$INTSCL= 1
##$ISEN= 128
##$LB= 0.3
##$LEV0= 0
##$LPBIN= 0
##$MAXI= 10000
##$MC2= 0
##$MEAN= 0
##$ME_mod= 0
##$MI= 0
##$NCOEF= 0
##$NC_proc= -2
##$NLEV= 6
##$NOISF1= 0
##$NOISF2= 0
##$NSP= 0
##$NTH_PI= 0
##$NZP= 0
##$OFFSET= 16.522
##$PC= 1
##$PHC0= -50.29856
##$PHC1= 6.820791
##$PH_mod= 1
##$PKNL= yes
##$PPARMOD= 0
##$PSCAL= 4
##$PSIGN= 0
##$REVERSE= no
##$SF= 250.13
##$SI= 32768
##$SIGF1= 0
##$SIGF2= 0
##$SINO= 400
##$SIOLD= 32768
##$SREGLST= <1H.CDCl3>
##$SSB= 0
##$STSI= 32768
##$STSR= 0
##$SW_p= 5175.98343685301
##$SYMM= 0
##$S_DEV= 0
##$TDeff= 65536
##$TDoff= 0
##$TI= <Analysis number 999999
Compound Code 99
Book Reference 9
Project Code 9>
##$TILT= no
##$TM1= 0
##$TM2= 0
##$TOPLEV= 0
##$USERP1= <user>
##$USERP2= <user>
##$USERP3= <user>
##$USERP4= <user>
##$USERP5= <user>
##$WDW= 1
##$XDIM= 32768
##$YMAX_p= 314003375
##$YMIN_p= -41771
$$ End of Bruker specific parameters
$$ ---------------------------------
##NTUPLES= NMR SPECTRUM
##VAR_NAME=  FREQUENCY,     SPECTRUM/REAL,   SPECTRUM/IMAG
##SYMBOL=    X,             R,               I
##VAR_TYPE=  INDEPENDENT,   DEPENDENT,       DEPENDENT
##VAR_FORM=  AFFN,          ASDF,            ASDF
##VAR_DIM=   32768,         32768,           32768
##UNITS=     HZ,            ARBITRARY UNITS, ARBITRARY UNITS
##FACTOR=    0.157963299565203, 1,           1
##FIRST=     4132.6476996994, 0,             0
##LAST=      -1043.33573715361, 0,           0
##MIN=       -1043.33573715361, -41771,      0
##MAX=       4132.6476996994, 314003375,     0
$$ Real data points
##PAGE= N=1
##DATA TABLE= (X++(R..R)), XYDATA
$$ [...]
16791a0731Q779K732J686M259J612o64M547q170K235k638L913m098p040K306L797
16776B525p539o183O099N623J508q77j017j542j443K763m834m984n661N663M629
16761e270J221J449j673P13r909J149Q291k489O739J1468J932j2104j1407n685
16747a5575p627Q839Q648k775K44m52L793Q866K289M125m803j8849j4235J853
16733b5659L744R410Q446P394J149j749l122P492K298M727M130p494p181K658
16719F243m401m266o842n129N822K975P619N607k50p01j557j199L641p874l878
16704d190j478q130Q20R875J6235M877l485j1753k614q507r162Q919J9836Q95
16690A2138j6750j4367k990P360R358R158L310L221k608j6120j632L780P574r28
$$ plain form
16791 -10731 -1952 780 2466 6725 8337 7673 12220 4050 6285 3647 7560 3462 -3578 -1272 2525
16776 2525 -5014 -11197 -5098 525 2033 1156 139 -1403 -2846 -83 -4917 -9901 -15562 -9899 -5270
16761 -5270 -4049 -2600 -4273 -3560 -13469 -12320 -4029 -6518 221 11689 13621 1517 -9890 -15575
16747 -15575 -23202 -14363 -5715 -8490 -8246 -8698 -4905 3961 6250 10375 5572 -13277 -27512 -25659
16733 -25659 -21915 -12505 -4059 3335 4484 2735 -387 7105 9403 14130 18260 10766 3585 6243
16719 6243 1842 -2424 -9266 -14395 -8573 -5598 2021 7628 7378 6677 5120 3921 7562 -312 -4190
16704 -4190 -5668 -13798 -12978 -3103 13132 18009 14524 2771 157 -8350 -17512 -8593 11243 12138
16690 12138 -4612 -18979 -21969 -14609 -5251 3907 7217 10438 7830 -8290 -9922 -6142 1432 504
16676E04O12N518k421m947j468l766m854L651O9j406R876L854J268l653P034P137
16660A7008n071n179M002o049m587R177O515n43q417o939m80M052q466j357Q004
16645A670q90J262j614j017L74L333N649Q413n33L245J035l145R84Q993R797J3594
16629E1150J4047J2151P949K3735J8962J9354J4000R542O448n158j1419m614j1437
16616A44710j3236j5357j9139j5302j9937j4968j1336n925M04o087q305l753J584
16603A3353l012m710k583m591N024L726O01K543m778J485K385J760O430L134J677
16588B2444o778n365O45K974K509n051j0489n026k025j511Q499m503r195O217
16574f655J3183M006L500n222q412q723K540P291M628m778n509J110K527J535
$$ plain form
16676 504 1116 6634 4213 -734 -2202 -5968 -10822 -7171 -7102 -8508 1368 5222 6490 2837 9871 17008
16660 17008 11937 6758 10760 4711 124 9301 15816 15273 6856 -83 -563 3489 -4977 -6334 1670
16645 1670 780 2042 428 -589 -215 3118 8767 17180 16647 19892 20927 17782 18766 27759 37556 51150
16629 51150 65197 77348 85297 109032 127994 147348 161348 170890 177338 172180 160761 156147 144710
16616 144710 131474 116117 96978 81676 61739 46771 35435 29510 29914 23827 15522 11769 13353
16603 13353 10341 5631 3048 -1543 3481 7207 7808 10351 5573 7058 9443 11203 17633 20767 22444
16588 22444 15666 10301 10946 13920 16429 11378 889 -4137 -6162 -7673 826 -3677 -12872 -6655
16574 -6655 6528 10534 14034 8812 400 -8323 -5783 1508 6136 1358 -4151 -3041 -514 1021
16560A021J1817O866o651q337L94M798K125n057J919K620j1863m710k64p515l171
16545a6008M008J301Q710l86r267l306M979O471J1817J028j4256k954J128K556
16531d179R692M58j389O374L27o250m902j1046K198Q160L321j2561m338J4824
16517F89K158j959L786M357R994m524o315j317n866N35K16j080j0364r170Q345
16502a0515R665J421J0413k226q886k208m002n781j897M113M262K883n935J026
16488g667J368j976J027M361O835P4k05j2280r340K032P310Q053o918J620K635
16473c071j944p324Q614J5214N492J257j0417j598J70p86K943j111m91j0449K685
16458h16k96o663Q251O349p337J3390J0651j3585j3320k06K456j41m378Q49j275
$$ plain form
16560 1021 12838 19704 13053 4716 5110 9908 12033 6976 8895 11515 -348 -5058 -5322 -12837 -16008
16545 -16008 -12000 -10699 -1989 -2375 -11642 -14948 -9969 -3498 8319 9347 -4909 -7863 -6735 -4179
16531 -4179 5513 5971 4582 10956 11283 5033 131 -10915 -8717 -557 2764 -9797 -14135 689
16517 689 2847 888 4674 9031 19025 14501 8186 6869 1003 1538 1754 674 -9690 -18860 -10515
16502 -10515 -850 571 10984 8758 -128 -2336 -6338 -12119 -14016 -9903 -5641 -2758 -8693 -7667
16488 -7667 -6299 -8275 -7248 -2887 3948 4022 3817 -8463 -17803 -15771 -8461 -408 -7326 -5706 -3071
16473 -3071 -5015 -12339 -3725 11489 16981 18238 7821 6223 6393 5607 8550 7439 6948 -3501 -816
16458 -816 -1112 -7775 476 6825 -512 12878 23529 9944 -3376 -3582 -1126 -1267 -5645 -4796 -6071
16443f071J500J1230N435l123J848O974l693k650j1487P87K830l436j0722p91
16429a1369O958j310j494j114J780M430Pk222J2227N01m040M515J1250L481k90
16414B3310n502o952r964q301L845Q013J99L781r221j716N614L620l407j0806
16400g487n664k600J563J3438J0862p925J259p043Q90P603P463q00r265l702R620
16385H212n09n549r399o383J618O761L560K581J236l283k921L465O438L135r891
16370i29l580R423m678j881P447m303K358O651K659K335Q523k468j7196o353m707
16355f699P841O825O394l112J975J658r077M068J3042Q98o774q825k948N702J1054
16340B2022P989J658q178n973n092K530Q490j0258j374J2845l577j7518m736M641
$$ plain form
16443 -6071 -4571 6659 12094 8971 10819 17793 14100 11450 -37 750 3580 144 -10578 -11369
16429 -11369 -4411 -5721 -7215 -8329 -6549 -2119 -2112 -4334 7893 8394 4354 8869 20119 23600 23310
16414 23310 17808 10856 892 -7409 -3564 4449 4648 8429 -792 -2508 3106 6726 3319 -7487
16400 -7487 -13151 -15751 -14188 -750 10112 2187 3446 -3597 -2707 4896 12359 11559 2294 -1408 8212
16385 8212 7703 2154 -7245 -13628 -12010 -5249 -1689 892 2128 -1155 -4076 -611 5827 8962 -929
16370 -929 -4509 4914 236 -1645 5802 1499 3857 10508 13167 15502 24025 21557 4361 -1992 -6699
16355 -6699 1142 7967 14361 11249 13224 14882 5805 9873 22915 23813 17039 8214 5266 10968 22022
16340 22022 30011 31669 23491 17518 12426 14956 23446 13188 11814 24659 21082 3564 -1172 3469
16326C469O321L79L074J452J353P321K671j0311j2956M986j864q82l136N343J366
16311H586K564m118l92k595p831q706P234o105k922O255O82l309j559L75j823
16296a3664N207O762O026m484J675J232R137j4868p345N667Q319m693q56J0024
16282H139J1182p03j0279p38l06k972j978o577k353J2067K191K656k531j2865
16268e067k395M157J58l705O186r077J31R647k586n134r79q223l041N451O403
16253h074R244O199J332L920N407j746m473l121j0748r658K62Q432O529K803K056
16238H364o321j1270J1577J3123q421n730j032m317M548k11P23K189K52j819M181
16223E836J982N280j549j31J247k309j594l502J125O521J0554L552p389k818O399
$$ plain form
16326 3469 9790 10169 13243 14695 16048 23369 26040 15729 2773 7759 5895 5013 1877 7220 8586
16311 8586 11150 7032 6640 4045 -3786 -12492 -5258 -11363 -14285 -8030 -7348 -10657 -12216 -11841 -13664
16296 -13664 -8457 -1695 4331 -153 1522 2754 11891 -2977 -10322 -4655 3664 -1029 -1885 8139
16282 8139 19321 18618 8339 7601 7295 4323 2345 -4232 -6585 5482 7673 10329 7798 -5067
16268 -5067 -7462 -3305 -3147 -6852 -666 -9743 -9612 35 -2551 -7685 -8664 -16887 -19928 -14477 -8074
16253 -8074 1170 7369 8701 12621 18028 16282 11809 8688 -2060 -11718 -11456 -3024 3505 6308 8364
16238 8364 2043 -9227 2350 15473 7052 1322 290 -4027 521 310 1033 3222 3474 1655 5836
16223 5836 7818 13098 11549 11418 12665 10356 8762 5260 6385 12906 23460 27012 19623 16805 23204
16208B3204L967K772M378J1649M619j993J203l931k117R578P106j1634J890j997
16194D8694o742p461L806j720j537l49M182k895N95l343j6255l977N786N122k569
16179B1337Q106j531r56L08q66p390O02R300p244R49R512J2215j274K363J1926
16164E7357J4426K666r527l71K670J3265J6520J1785J4155J3343J5967L630k349
16151A53537P667L322P45l787l039j997j403l448L12j577o567r765J3645K0105
16137A67750J6892J8285K6362K9821J7971P193J4434K3307O395j571k2824n387
16125B98628j4616j5287n269l808K212n788j2602q457M399K2131J5043K1263K4681
16112C22530K3241L6069L5379L7393M1941M6597M8257O0449M8007M9698O0067
$$ plain form
16208 23204 27171 29943 34321 45970 50589 48596 49799 45868 43751 53329 60435 48801 50691 48694
16194 48694 41952 34491 38297 36577 35040 34691 38873 35978 36573 33230 16975 12998 18784 23906 21337
16179 21337 29443 27912 26956 27264 26398 19008 19610 28910 21666 22615 32127 44342 43068 45431 57357
16164 57357 71783 74449 64922 64551 67221 80486 97006 108791 122946 136289 152256 155886 153537
16151 153537 161204 164526 165271 161484 158445 156448 155045 151597 151909 150332 143765 134000 147645 167750
16137 167750 184642 202927 229289 259110 277081 284274 298708 322015 328410 326839 304015 298628
16125 298628 284012 268725 263456 259648 261860 256072 243470 235013 239412 261543 276586 297849 322530
16112 322530 345771 381840 417219 454612 496553 543150 591407 651856 699863 749561 809628
16101H09628O7860P7661O7141R4382J24586J40343J71687K32966L29155M70110
16091B585519O83275R76207J293083J694400K201646K581066K838355L166476
16083A8020027L567973L663827K754640J865350K041603J414097q4058j401863
16075C1841596j975052j839978k758008l694187l496527l137116k845552k564462
16067I530714k154908j663245j297248r85701o93904m93166l47263k50843k00503
16058A443933j60894j30143j11227r7065q2193o3227n7608m5772l9000m7219n0711
16047E58874n2607m7785l3539l5506l3892m2293l2175l1509l1432j6498j4147
16036A87491r316m217j470j1998j5252p851j437K006m006p547J311q362q236l947
$$ plain form
16101 809628 877488 955149 1022290 1116672 1241258 1381601 1553288 1786254 2115409 2585519
16091 2585519 3268794 4245001 5538084 7232484 9434130 12015196 14853551 18020027
16083 18020027 21588000 25251827 28006467 29871817 31913420 33327517 33243459 31841596
16075 31841596 29866544 28026566 25268558 21574371 18077844 14940728 12095176 9530714
16067 9530714 7375806 5712561 4415313 3429612 2735708 2242542 1895279 1644436 1443933
16058 1443933 1283039 1152896 1041669 944604 862411 799184 741576 695804 656804 609585 558874
16047 558874 506267 458482 424943 389437 355545 313252 281077 249568 218136 201638 187491
16036 187491 178175 173958 172488 160490 145238 137387 135950 137956 133950 126403 127714 119352 111116 107169
16022A07169n724q178M095P514K581q821j3603n179r334p731j3775o7J854k183
16008D8618O172j144o264p390m109J1930q350p217P849O375k684k411m438L850
15994D0787P276L968o596j686L943J1865K37m794j2807o894l830N582N483n066
15980C7468r061n855K286J0754l224O324j22r566j2823J043m33j887L805J948
15966B0657L088k661l317l187q138j392N935O973P122P338m93J1271J0255K025
15952E5476m432Q10m021J993p57J309m166J653J133K701n588j1356q496p191O17
15937A9685Q591m156K391L38j5564M213J4221L073p968j0010k889N681J7991m36
15923C5161L00Q7j1732q470O3p34J0163L524m045k795K087o492k014J507j932
$$ plain form
16022 107169 101445 93267 97362 104876 107457 98636 85033 79854 70520 62789 49014 48947 50801 48618
16008 48618 54790 53646 47382 39992 35883 47813 39463 32246 40095 46470 43786 41375 36937 40787
15994 40787 48063 52031 45435 43749 47692 59557 59794 55000 42193 35299 31469 37051 42534 37468
15980 37468 28407 22552 24838 35592 32368 38692 38570 29004 16181 17224 16791 14904 18709 20657
15966 20657 23745 21084 17767 14580 6442 5050 10985 17958 25080 32418 31925 43196 53451 55476
15952 55476 51044 51854 47833 49826 49069 50378 46212 47865 48998 51699 46111 34755 26259 19068 19685
15937 19685 28276 24120 26511 26849 11285 15498 29719 32792 24824 14814 11925 17606 35597 35161
15923 35161 35461 35548 23816 15346 15409 14675 24838 28362 24317 21522 23609 17117 15103 16610 14678
15908A4678J435J745L901K689N09j472N072J197k241l74M992n141M98N674o498
15893B6664P06Q513K58j0269j2484k121P712R303L446j633n293o692j1184k789
15879D137K766l48J0481M101j25J0638Q58j714j0056j0105k458K606O260j388
15865A5653l50p230n547k959M467Q087L281n468j1449L527N337l727k75k492r999
15850i144l62J2052P775p388L575N997n396L814O865J0333L745l841q534l585
15836A5906N586l012l217L359K557p137p450Q571Q704M776K529q394n143r17N356
15821B2074J3995Q335J3005J3757J5915K4372L1878J8653O52R576K2548J5589
15809B10349k2377k0844l265j3164l0521j7421j3965k4190k1925j5586l757O142
$$ plain form
15908 14678 16113 17858 21759 24448 24957 23485 28557 29754 27513 27139 32131 26990 27488 33162 26664
15893 26664 27370 35883 36141 25872 13388 11267 18979 28282 31728 30095 24802 18110 6926 4137
15879 4137 6903 6555 17036 21137 21012 31650 32508 30794 20738 10633 8175 10781 17041 15653
15865 15653 15303 8073 2526 -433 4034 12121 15402 9934 -1515 2012 7349 3622 3347 855 -9144
15850 -9144 -9506 2546 10321 2933 6508 12505 7109 10923 17788 28121 31866 28025 19491 15906
15836 15906 21492 18480 15263 18622 21179 14042 6592 15163 23867 28643 31172 22778 17635 16718 22074
15821 22074 36069 44404 57409 71166 87081 111453 143331 161984 162636 172212 194760 210349
15809 210349 187972 167128 163863 150699 120178 102757 88792 64602 42677 27091 23334 29476
15797B9476J588m319n834k010O346Q142K341j362n47l80K085J370J1305O246o759
15782D7688k00Q647Q62j663m107j945m020o998n036j7842j5660o53M17Q842L703
15767A2035k93k978p783p973L728J1833J250m752K601M644j0462l609k051o873
15753a0683P249R93N098N906o094p523m23N406L832m032M01P746N101j6507j985
15738e515J713k43J1148m26j0968r991q6M617J2043K752k065m478R14N282J3346
15723A8043M499Q12q232p076l086n921J3017J1216q641j2838j5242M206M701m769
15709i311O902P426q11o205m541K395m092J391R670M038K340J70M991P16r528
15694E551q904r557J121L645N477J573r481n878k154L57N921Q345J519m971l732
$$ plain form
15797 29476 31064 26745 20911 18901 25247 33389 35730 34368 33821 33441 35526 36896 48201 54447 47688
15782 47688 47488 56135 56997 55334 51227 49282 45262 38264 33228 15386 -274 -927 -510 8332 12035
15767 12035 11742 8764 981 -6992 -3264 8569 9819 5067 7668 12312 1850 -1759 -3810 -10683
15753 -10683 -3434 -2441 2657 8563 2469 -5054 -5477 -71 3761 -271 130 7876 12977 -3530 -5515
15738 -5515 -3802 -4045 7103 6677 -4291 -14282 -14368 -9751 2292 5044 2979 -1499 -585 4697 18043
15723 18043 22542 23354 15122 8046 4960 -961 12056 23272 14631 1793 -13449 -9243 -4542 -9311
15709 -9311 -2409 5017 4206 -1999 -6540 -4145 -8237 -6846 2824 6862 9202 9372 14363 15079 5551
15694 5551 -3353 -12910 -11789 -8144 -2667 -1094 -10575 -16453 -18607 -18250 -12329 -3984 -2465 -7436 -11168
15679a1168J857N70m102N338M67L045R07J584N462j341j0766n060P545R802J906
15664F046l517q412j704R209k293q687Q065L14L683J3726J145m486m794j284q151
15649a140m909k70l455J016p519O512J4771N104j0272l229K570J903p684j4136
15635b0738j63J3920P900n84r128j278l292L466P627K374q363l012N865J299J066
15620c041K536P238R694j985j1585j0237p145O847J080j467K536q16L022J143
15606b180m16M669M713N565j213K530P634J260L899M131M876N480R080r842q150
15591C2036r305m973o77m135r159o626j190J0770K979j690J193J0693K014J01
15577B2031q917p653p977l242K151M454L240o63n082O13l14J1300J016k135K872
$$ plain form
15679 -11168 -9311 -8741 -12843 -7505 -7038 -3993 -3086 -1502 3960 2619 -8147 -13207 -5662 4140 6046
15664 6046 2529 -5883 -7587 1622 -671 -9358 -1293 -979 2704 16430 17575 13089 8295 7011 -1140
15649 -1140 -6049 -6319 -9774 -8758 -16277 -9765 5006 10110 -162 -3391 -821 1082 -6602 -20738
15635 -20738 -20901 -6981 919 335 -8793 -10071 -13363 -9897 -2270 104 -8259 -11271 -5406 -4107 -3041
15620 -3041 -505 6733 16427 14442 2857 -7380 -14525 -7678 -6598 -8065 -5529 -6345 -3323 -2180
15606 -2180 -2596 2073 6786 12351 11138 13668 21302 22562 26461 30592 35468 40948 50028 40186 32036
15591 32036 22731 17758 17081 12946 3787 -2839 -4029 6741 9720 8030 9223 19916 21930 22031
15577 22031 13114 5461 -2516 -5758 -3607 847 4087 3424 -1658 -1045 -1359 9941 10957 8822 11694
15562A1694Q009l416j3115n155N815M332L95P342Q277q1M54k67j3851j1190J229
15547D72j366k830M908L019J704O918L594N018J6469J4046J0900K1143J0174O910
15533A01079K1046K4746J6496O533K848O29j684j936j0689j1693q677k3069k6811
15520H8818j1268m977j2006o260j2734j0188k904l584j0312n057k114j045J476
15507G845n51O937K276p207o440m652M122M796L191N658p981r157j157l453n259
15492a1032k628Q178o69m242J0657j584p930l12O182N140N909N400m137M278o028
15477G182k449K238J0939p657k0704J657P600M543k253K409N39k554Q3j396L023
15462C200L778j278l276Q954l887l656N478p997l671K656m105N566j523K979K997
$$ plain form
15562 11694 19703 16287 3172 -1983 3832 8164 8559 15901 24178 24097 24551 24284 10433 -757 472
15547 472 -894 -3724 1184 4203 5907 12825 16419 21437 37906 51952 62852 83995 94169 101079
15533 101079 122125 146871 163367 169900 172748 173377 171693 169757 159068 147375 138698 115629 88818
15520 88818 77550 72573 60567 54307 41573 31385 28481 24897 14585 9528 7414 6369 7845
15507 7845 7294 14231 16507 9300 2860 -1792 2330 7126 10317 15975 7994 -1163 -2320 -5773 -11032
15492 -11032 -13660 -5482 -6151 -10393 264 -1320 -9250 -9562 -3380 1760 7669 13069 8932 13210 7182
15477 7182 4733 6971 17910 10253 -10451 -8794 -1194 3349 1096 3505 4044 1490 1573 177 3200
15462 3200 6978 5700 2424 11378 7491 3835 9313 1316 -2355 301 -3804 1762 239 3218 6215
15447F215k102m474L589O043P586l75o466l249j848o832j172o490m163l006j976
15432a8720N909L531r014P02J191J0056M106K16m131O88O060M286K711n210q090
15417e709J081n953J87J0967j243M021k063j801k642K813N084n275j032R772K838
15402A1045r570L646L309O091k833j2383k872O763K289R905q11p553j592K28j508
15387D154m30k559O558l485j5494p677O513L350n436j131P426M635L687P152P78
15372H041O066P13q285j0341q378J1891J2979J316n451n019M245M188j513l560
15358F892J201p510r98P272j6676r05n07P663r12O110N753M654j855o469j5677
15343a1964k077J0661O411n993K523n58j880m8K022P68O43o188m908O762P646
$$ plain form
15447 6215 4113 -361 3228 9271 16857 16482 10016 6767 4919 -1913 -3085 -9575 -13738 -16744 -18720
15432 -18720 -12811 -9280 -18294 -17592 -16401 -6345 -2239 -2023 -6154 -5466 594 4880 7591 2381 -5709
15417 -5709 -4628 -10581 -10394 573 -670 3351 1288 -513 -3155 -342 4742 -533 -1565 8207 11045
15402 11045 1475 5121 8430 14521 11688 -695 -3567 3196 5485 15390 14579 7026 5434 5662 4154
15387 4154 3724 1165 7723 4238 -11256 -18933 -12420 -9070 -14506 -15637 -8211 -3576 111 7263 8041
15372 8041 14107 14820 6535 -3806 -12184 -293 12686 14002 8551 3532 7777 11965 10452 6892
15358 6892 8093 583 -415 6857 -9819 -10724 -11231 -3568 -4480 1630 7383 12037 10182 3713 -11964
15343 -11964 -14041 -3380 3031 -2962 -439 -997 -2877 -2925 -903 -135 508 -5680 -10588 -3826 3820
15328C820N003q95K004m111l3L983k498n123n125N115M575M301m892p974l531
15313e381N960N727l926K731M088J263m899m439N4k312k132l495Q220N083p771
15298a229k177j094J679k195Q33j809l256k41K175m041J670p095r08J0135J004
15283f549q08M330M856n040J12N18k075l881o904N73k33m771m841O979L948k175
15267a5961K784J348o799j286M650L961l41R361J2625O89R162J5043m962j6224
15253A4050j4275J209P354P378j602j2374o577r2K676L95n406M764O481M88o957
15238b488L997P362M299n04j245k762K042j1404n521L497P697l522J667Q869o589
15223E395j0171r685l115j427L815O603M652K938K371L313J534k561j944J833
$$ plain form
15328 3820 8823 7928 9932 5821 5788 9771 7273 2150 -2975 2140 6715 11016 6124 -1850 -5381
15313 -5381 579 6306 2380 5111 9199 10462 5563 1124 1178 -1134 -3266 -6761 1459 6542 -1229
15298 -1229 -3406 -4500 -2821 -5016 -4183 -5992 -9248 -9489 -7314 -11355 -9685 -16780 -17688 -7553 -6549
15283 -6549 -7357 -3027 1829 -3211 -3099 -2581 -4656 -8537 -15441 -14868 -15101 -19872 -24713 -17734 -13786 -15961
15267 -15961 -13177 -11829 -18628 -19914 -15264 -11303 -11644 -2283 10342 11031 20193 35236 30274 14050
15253 14050 -225 984 8338 15716 14114 1740 -4837 -4929 -2253 -1858 -7264 -2500 3981 4469 -2488
15238 -2488 1509 8871 13170 12666 11421 8659 10701 -703 -6224 -2727 4970 1448 3115 11984 5395
15223 5395 -4776 -14461 -17576 -19003 -15188 -8585 -3933 -995 1376 4689 6223 3662 1718 3551
15209C551j641M906p953j647l37J071J594k909j308M335l493j2927J655P317K650
15194e136q438L134Q978l786J277l169r543p40Q110j836o40M053L935J689m549
15179f661l532P777J689P762m45r929l932M886n702r504p790J2474M184k07Q563
15164c67L219J171L480R23l836m114m590O03k251k711K251M140k773p875j63J929
15148a0964L256J1316K983j596n41q545N442Q6m867l346K866K632R135N657o58
15133A2856m33j0083j0158j548J904K231O821J070N863J3719M053m779p164p800
15119F552J889l833l864q666o202o571J881L29O509q752L203M343L821R966J0736
15104A1341M068O087k456m815r102J117L789L194O095K956n130p006k114M386
$$ plain form
15209 3551 1910 6816 -1137 -2784 -3121 -2050 -456 -3365 -4673 -338 -3831 -16758 -15103 -7786 -5136
15194 -5136 -13574 -10440 -1462 -5248 -3971 -7140 -16683 -17423 -9313 -11149 -11789 -7736 -3801 -2112 -6661
15179 -6661 -10193 -2416 -727 7035 6590 -3339 -7271 -2385 -8087 -17591 -25381 -12907 -8723 -8930 -367
15164 -367 2852 4023 7503 8426 4590 476 -4114 -3511 -5762 -8473 -6222 -2082 -4855 -12730 -12893 -10964
15148 -10964 -7708 3608 6591 4995 4454 -4091 1351 1437 -3430 -6776 -3910 -1278 7857 13514 12856
15133 12856 12423 2340 -7818 -9366 -7462 -5231 1590 2660 8523 22242 26295 21516 14352 6552
15119 6552 8441 4608 744 -7922 -14124 -20695 -18814 -18485 -11976 -20728 -17525 -13182 -9361 605 11341
15104 11341 15409 21496 19040 14225 5123 6240 10029 13223 19318 22274 17144 10138 8024 12410
15090A2410l448k093n769l573l850n126p782O527R296O49J699M212K389P261J19
15075A2921o776M886J9727J950j4010j0127l72O908L467Q205q901p999P382o09
15061A6652n924l63M211p925q45k639j098o270N86Q38N575j318q73M772O680Q480
15045B0539N909K529j7993p593J240J0936J0559o411p413m541J834P455L093n727
15031A4416j2359M906N237l652K518L555r02L463k777r104r515Q287J847k083
15017C837j0471j21o43m413r86R919r29j928o270L14L408P013P766j420m397R34
15001A613K57n637m426L747L303j256n931J3435J0775P060m6l114N749J4684K2298
14986F2511M4378P9824J60302K09210J7374j95171j65495r4487n6300k2615j7851
$$ plain form
15090 12410 8962 6869 1100 -2473 -6323 -11449 -19231 -12704 -3408 -2759 -1060 3152 5541 12802 12921
15075 12921 6145 11031 30758 32708 18698 8571 8199 15107 18574 26779 17878 9879 17261 16652
15061 16652 10728 10365 14576 6651 5806 3167 2069 -4201 -3615 -2777 2798 1480 607 5379 12059 20539
15045 20539 26448 28977 10984 3391 4631 15567 26126 19715 12302 7761 9595 17050 20143 14416
15031 14416 2057 6963 12200 8548 11066 14621 13719 17182 14405 5301 -4214 4073 5920 3837
15017 3837 -6634 -6755 -7398 -11811 -12797 -2878 -3807 -5735 -12005 -11691 -8283 -1270 6496 5076 679 1613
15001 1613 1870 -3767 -8193 -4446 -1143 -2399 -8330 5105 15880 22940 22894 19780 25529 40213 62511
14986 62511 106889 186713 347015 556225 573599 378428 212933 118446 62146 39531 21680
14975B1680j1562j306R39m12p287o459o24M738Q807m436m422j931O979J353m161
14960A896o430p994L626%R257K185o762n11K750n766j300L545P223N961R23K735
14944A1338q822j6762m866O482j782k807l979k84J1162N25k419L016M370M340
14930d88L864N029m73j864l411p156m118M46R48L694j336p77J3945r87J958N034
14914A4308k526q936o156N80k517p511o485O527N138l079n175o270L146L091P48
14899a5117r29Q780J061m310m034K507Q859O242m941n420J0156M509j123M062
14885A0302m427q006R18m18l735j2360M11k213o40Q192k812p222M619K490P200
14870g701J3482o379l59J276o381j3190P215m627J499L237N224L348k828p095
$$ plain form
14975 21680 10118 8812 9751 9339 2052 -4407 -5031 -293 8514 4078 -344 -2275 4704 6057 1896
14960 1896 -4534 -12528 -8902 -8902 355 2540 -4222 -4733 -1983 -7749 -9049 -5504 1719 7680 8603 11338
14944 11338 2516 -14246 -19112 -12630 -14412 -17219 -21198 -21482 -10320 -9795 -12214 -9198 -4828 -488
14930 -488 3376 8405 7932 6068 2657 -4499 -8617 -8171 -7223 -3529 -4865 -5642 8303 7316 9274 14308
14914 14308 11782 2846 -3310 -2730 -5247 -12758 -19243 -12716 -7578 -10657 -15832 -22102 -18956 -15865 -15117
14899 -15117 -16046 -7266 -6205 -10515 -14549 -12042 -3183 3059 -1882 -7302 2854 7363 6240 10302
14885 10302 5875 -2131 -1213 -1631 -5366 -17726 -17315 -19528 -20168 -11976 -14788 -22010 -17391 -14901 -7701
14870 -7701 5781 -598 -957 319 -6062 -19252 -12037 -16664 -15165 -11928 -6704 -3356 -6184 -13279
14856a3279k857O66L841k047L942Q639P364j395n484q175p29k54j0371O268O910
14841f961P961K481p786o557O022N262l103m56o978m614J1630L751J13k8q438
14826g701j735n773o169O039P632j686L750j410o30m356O61J2412L008R693n294
14811H441L41k646o606L188M754p471M897l695l714q9L879n248M633R510p728
14796B446l941R544L208j0247l328l601l563K248K072K263m367L92k294n183o652
14781b1003J1492N816l852p260o209J684l190O02Q10O86J507O622L900Q955K930
14766C490o675K971j2849j0077K627M864P108J0364m914k123M807j951k388Q458
14752C712R884k381n452q066J491p43K12k52j8632l275J3424p147K077J5016n081
$$ plain form
14856 -13279 -16136 -15470 -11629 -13676 -9734 -1095 6269 4874 -610 -8785 -9514 -9768 -20139 -13871 -6961
14841 -6961 1000 3481 -4305 -10862 -4840 422 -2681 -3137 -10115 -14729 -3099 652 765 737 -7701
14826 -7701 -9436 -15209 -21378 -15339 -7707 -9393 -5643 -7053 -7683 -12039 -11378 1034 4042 13735 8441
14811 8441 8782 6136 -470 2718 7472 1 4898 1203 -2511 -2600 1279 -3969 664 10174 2446
14796 2446 -1495 8049 11257 1010 -2318 -5919 -9482 -7234 -5162 -2899 -7266 -6874 -9168 -14351 -21003
14781 -21003 -9511 -3695 -7547 -14807 -21016 -19332 -22522 -21920 -21110 -20424 -18917 -12295 -8395 560 3490
14766 3490 -3185 -214 -13063 -23140 -20513 -15649 -8541 1823 -3091 -5214 -407 -2358 -4746 3712
14752 3712 13596 11215 5763 -2303 -812 -1555 -1343 -1595 -20227 -23502 -10078 -17225 -15148 -132 -5213
14737e213l425L570J1679n039K285M934j4960j1504l727N66Q965N228k1l444m647
14722a4753M700R763O086k474m573L163o52n9M442l434j341m621n053N128K029
14707a649M759o932O518P31q907O769n603L630m632K574J110m083m481J2159J3925
14692A5888K928n354n593o643q493N68l240n301k991J793j82N616k148p957L291
14677a7818J623l665J492L983M155P468J0990p848j2595m647J623N526m38M206
14663e945O091J889m278M810M584p385l681n089l910k692l1M890R031J2169m203
14648F250j0515j0060o72P207J449M488J409L482K36l004K905m609l583m535p255
14633a6807Q382N809n204L642O498j1081l181n096q300R594J163l70J2887J1577
$$ plain form
14737 -5213 -8638 -5068 6611 1572 3857 8791 -6169 -17673 -21400 -20834 -11869 -6641 -6662 -10106 -14753
14722 -14753 -10053 -290 5796 3322 -1251 1912 1260 1201 5643 2209 868 -3753 -8806 -3678 -1649
14707 -1649 3110 -3822 2696 3427 -5480 1289 -4314 -684 -5316 -2742 -1632 -5715 -10196 1963 15888
14692 15888 18816 13462 7869 1226 -7267 -6699 -9939 -15240 -18231 -16438 -16620 -11004 -13152 -21109 -17818
14677 -17818 -16195 -19860 -18368 -14385 -10230 -2762 8228 380 -12215 -16862 -15239 -9713 -10151 -5945
14663 -5945 146 2035 -2243 2567 7151 -234 -3915 -9004 -12914 -15606 -15637 -10747 -1716 10453 6250
14648 6250 -4265 -14325 -14997 -7790 -6341 -1853 -444 3038 3274 270 3175 -1434 -5017 -9552 -16807
14633 -16807 -8425 -2616 -7820 -4178 2320 -8761 -11942 -17038 -25338 -15744 -14581 -14951 -2064 9513
14619I513R6r010m675P389k277r473m152J3113L650L405p766r263N817L911m380
14604d102P670K719k303k736N286k870r418J115N2j0457P119P803m735j449o498
14589a2804j087J0199l366J514j641j193k442K271M080M477J232J158M998o005
14575A391J092M524k623q582n282O025K609k465k300m7K59j923l577L800K495
14560d604m195J245k738J353O063Q622p131j0741n978P629J2383N137n498k170
14546f23Q44L96j726o24l756M657M249j3573o380o668l118L740L813M811r89j1696
14530b6643q57R442J689R098J631n263R019l685l500l720M271k661o09l342K468
14515a2662R44K763l778j0024p548J0272Q895q44J553J13l551l372L392k108l390
$$ plain form
14619 9513 9609 599 -4076 3313 1036 -8437 -12589 524 4174 7579 -187 -9450 -3633 278 -4102
14604 -4102 3568 6287 3984 1248 6534 3664 -5754 -4639 -4587 -15044 -7925 -122 -4857 -6306 -12804
14589 -12804 -13891 -3692 -7058 -5544 -7185 -8378 -10820 -8549 -4469 8 1240 2398 7396 1391
14575 1391 2483 7007 4384 -4198 -9480 -3455 -846 -3311 -5611 -5658 -5399 -7322 -10899 -7099 -4604
14560 -4604 -8799 -7554 -10292 -8939 -2876 5746 -1385 -12126 -18104 -10475 1908 7045 1547 -623
14546 -623 221 617 -1109 -1733 -5489 -832 3417 -10156 -16536 -23204 -26322 -22582 -18769 -13958 -14947 -26643
14530 -26643 -27500 -18058 -16369 -7271 -5640 -10903 -1884 -5569 -9069 -12789 -8518 -11179 -11788 -15130 -12662
14515 -12662 -11718 -8955 -12733 -22757 -30305 -20033 -11138 -11982 -10429 -10316 -13867 -17239 -13847 -15955 -19345
14500a9345P465r38L606j36P281J090N127l042K547M654p717m375j076n264N214
14485d909O37n231P692N763L866J195J1713J2799r714o019r582j0375Q077o406
14471d94K105n117q470kM569N814N384r615J426J329p530R60R771M737k290O650
14455I227K070o605j3956o940m929O824l053K203N286N898R79m020M46L969M117
14440A516O91m408O822k301m055m885r439r11R716R46p499N701N139P112n76l387
14424A82l198m344N475r85M704J2616k948q677J6R30p008k696K169M625l464L688
14408A085p00J30L312k071n681P685P740R810J347l870L834l219q397o229l869
14393I07p405m165N440J134N340l438p707O462J2392M848m736r361J853k960J311
$$ plain form
14500 -19345 -11880 -12818 -9212 -9348 -2067 -977 4150 1108 3655 8309 592 -3783 -4859 -10123 -4909
14485 -4909 -4272 -9503 -1811 3952 7818 9013 20726 33525 23811 17792 8210 -2165 5912 -494
14471 -494 1611 -3506 -11976 -11978 -7409 -1595 3789 -5826 -4400 -3071 -10601 -9641 130 4867 2577 9227
14455 9227 11297 4692 -9264 -16204 -21133 -14309 -17362 -15159 -9873 -3975 -2996 -7016 -6570 -2601 1516
14440 1516 2207 -2201 4621 2320 -1735 -6620 -16059 -16970 -7254 -6308 -13807 -8106 -2967 4145 3569 182
14424 182 -3016 -7360 -1885 -2870 1834 14450 11502 2825 2841 3771 -3237 -5933 -3764 861 -2603 1085
14408 1085 385 515 3827 1756 -3925 3760 11500 21310 22657 18787 22621 19402 11005 4776 907
14393 907 -6498 -10663 -5223 -4089 1251 -2187 -9894 -3432 8960 13808 9072 -289 1564 -1396 -85
14378h5o287q709O160k602n99l329l103J02J1321J0161n166k489R515Q50k237
14363C503J128K896o015j0889p125M194O911Q406Q778l510Q955P08j637p331J634
14348A0606n53j734k825j232J1391J1184K3p67N810J1560j205l55J3273K7845
14334H3021K3690L5933M4235M1357L9258L3743K0762M353k6431j5904l790k41
14322B79986L678J5621R015p436k0108k8859m7716m8069l2878k9053j9215j3103
14310F1863j3951n034J711K6o525k431m314j2199l354j837l385l003J362k80J211
14295I860P459j795m529L911N067k70o702M47p834j166M455J398J278R402k260
14280A8721j728m437J22k373k184L734J999J3609O847Q487N186J0085J740J2296
$$ plain form
14378 -85 -6372 -15081 -8921 -11523 -12122 -15451 -18554 -18452 -7131 3030 -2136 -4625 4890 5740 3503
14363 3503 4631 7527 1512 -9377 -16502 -12308 -5397 3009 11787 8277 17232 17940 16303 8972 10606
14348 10606 10053 8319 5494 4262 15653 26837 26860 26093 31903 43463 42258 41903 55176 83021
14334 83021 106711 142644 186879 228236 267494 301237 321999 326352 299921 284017 280227 279986
14322 279986 283664 299285 308300 300864 280756 251897 204181 156112 123234 94181 74966 61863
14310 61863 47912 42878 44589 44615 38090 35659 31345 19146 15792 13955 10570 7567 8929 8649 9860
14295 9860 17319 15524 10995 14906 19973 19703 13001 13448 5614 4448 8903 10301 11579 20981 18721
14280 18721 16993 12556 12678 10305 8121 11855 13854 27463 34310 42797 47983 58068 59808 72104
14266G2104J7722J5810K6982K6245L141p508j7609k1046k5530j2326k0382q614
14254D8989k458q206j4235p959K51k503j2956N214k218N78K08N196O604j0982
14240E523m912j422K00m965k447J0047j256j3065l097J385N19K788R260Q737K698
14225I993J2253j0090q18l948K486N997l242L131l038j0560L135L580p452o908
14211e481m280J0238Q497O28m615M148m250r511J1186J2237Q715j057n648o036
14197A4771K948Q68k342j216m034l777q011J933J1007n628k950q808j3529K862
14183a5906K267R561N396M354J341l26q077k439j065m601N427O775l869J0145
14169H983N006m772R154o6j5211p742M27O264K547J292p845j0071N508Q374q302
$$ plain form
14266 72104 89826 105636 132618 158863 162004 154496 136887 115841 90311 77985 57603 48989
14254 48989 46531 38325 24090 16131 16382 13879 923 6137 3919 4497 4705 9901 16505 5523
14240 5523 611 -811 -611 -5576 -8023 2024 768 -12297 -15394 -14009 -13490 -10702 -1442 7295 9993
14225 9993 22246 12156 11338 7390 9876 15873 12631 15762 12724 2164 5299 8879 1427 -5481
14211 -5481 -9761 477 8974 9602 4987 9135 4885 -4626 6560 18797 27512 26455 20807 14771
14197 14771 17719 18587 16245 15029 10995 7218 -793 1140 12147 6519 3569 -5239 -18768 -15906
14183 -15906 -13639 -4078 1318 5672 7013 6687 -1390 -3829 -4894 -9495 -4068 2707 -1162 8983
14169 8983 13989 9217 18371 18305 3094 -4648 -4221 2043 4590 5882 -1963 -12034 -6526 1848 -6454
14154f454L174J162K113L460m810Q141M255j744k330N14k358L229j254j2492j511
14139f905L904p982n983M369O090N435m933k256p45P130O841J760l060j1140l748
14124a1223L217K121J2059j4190n955N4N717R191j63j4812L978O801r32j150r24
14109f211j709J543k534m559Q568J3393K422m074l593N766N795o941p871L70k386
14094b021k110K455K890L729l936o47R51m913m090p450K441k047P56R809O688
14079B505m838K469L245O847j910L757l759m893m031j005M123N196L510l780p282
14064A54j2819M01k254l714J863J1841P068k221p407M114j950j401P987k063k60
14049f61m007O20J1390O090K623K856q247j704P570J038P659J138m345m394q314
$$ plain form
14154 -6454 -3280 -2118 -5 3455 -1355 6786 11041 9297 6967 7481 5123 8352 7098 -5394 -6905
14139 -6905 -3001 -10983 -16966 -12597 -6507 -1072 -6005 -8261 -9006 -1876 4965 6725 3665 -7475 -11223
14124 -11223 -8006 -5885 6174 -8016 -13971 -13917 -8200 991 828 -13984 -10006 -3205 -4137 -5287 -6211
14109 -6211 -7920 -6377 -8911 -13470 -4902 8491 10913 6839 3246 9012 14807 7866 -5 365 -2021
14094 -2021 -4131 -1676 1214 4943 1007 360 1311 -3602 -7692 -15142 -12701 -14748 -13992 -4183 2505
14079 2505 -2333 136 3381 10228 8318 12075 8316 3423 -608 -1613 2510 7706 11216 7436 154
14064 154 -12665 -12264 -14518 -18232 -16369 -4528 2540 319 -7088 -2974 -4924 -6325 1662 -401 -661
14049 -661 -4668 -4048 7342 13432 16055 18911 10664 8960 16530 17568 25227 26365 22020 17626 9312
14034I312o510R454M350J784o208o046k314q153j3919M025Q108N847n79K765J288
14019C204n061o039Q791R997M184q106k579o790M601L709l915l511k993l41N440
14004E91P466r097r445k598L612M518Q215M16J127o63O361M433J766n125n029
13989F548p40M5K838J979q965q566L449M594P25M02m810O426M136m931J4166j246
13973A6050p823j0613j645q574n392Q140O793k032J055L227N943k731j1688p884
13959a7174K509Q629M004n184m422J016Q10J2351K444m939J2445m912j381p548
13945a352M99N079Q082N018k467n914r171K273N624M584J304l246q531p14Q379
13930I447n23o989l903M226n798J007N996r245o365J5464N335o066o912k602P654
$$ plain form
14034 9312 2802 12256 16606 18390 12182 6136 3822 -4331 -18250 -14225 -6117 -270 -849 1916 3204
14019 3204 -1857 -7896 895 10892 15076 6970 4391 -2399 2202 5911 1996 -1515 -4508 -4849 591
14004 591 8057 -1040 -10485 -13083 -9471 -4953 3262 3678 4805 4142 10503 14936 16702 11577 6548
13989 6548 5808 5853 8691 10670 1705 -6861 -3412 1182 1907 2309 -2501 3925 8061 3130 17296 16050
13973 16050 8227 -2386 -4031 -12605 -17997 -9857 -3064 -5096 -4041 -814 5129 2398 -9290 -17174
13959 -17174 -14665 -6036 -2032 -7216 -11638 -10622 -9812 2539 4983 44 12489 7577 6196 -1352
13945 -1352 -853 4226 12308 17326 14859 8945 -226 2047 7671 12255 13559 10313 1782 1068 9447
13930 9447 8924 1935 -1968 2258 -3540 -2533 3463 -5782 -12147 3317 8652 2586 -4326 -6928 726
13915G26N812J425q42j461l348O925j602Q13O53p130N146P207N594P540n584p064
13899A4810M285N227r610K261J1007l820p050k855k046J883J926j702P94j999
13885A3111p963K770j91k75j242l302J991J508m885m114K888J334j698q219l287
13870a1574Q814J2428k078k1555n033L939J1043L530p320K29J1843J2322M813
13857B1401j7989j0995K067l82j180j093j895K67o64P770Q37m307R96Q632j146
13842B319N80l104N463n877j3068J549P030l016Q459L755L171l749K578o712l219
13827c841r28P730l337m015l77l28K479O436o63o02K232N069l381j3405k053P028
13811a956j395N226m480l494L644N203R15n741n707J4033l527r37j31o166n093
$$ plain form
13915 726 6538 7963 7121 5660 2312 9237 7635 8448 9101 1971 7117 14324 19918 27458 21874 14810
13899 14810 19095 24322 14712 16973 27980 24160 17110 14255 12209 14092 16018 14316 15110 13111
13885 13111 5148 7918 7727 7452 6210 2908 4899 6407 1522 -2592 296 1630 -68 -8287 -11574
13870 -11574 -2760 9668 7590 -13965 -18998 -15059 -4016 -486 -7806 -7577 4266 16588 21401
13857 21401 3412 -7583 -5516 -5898 -7078 -8171 -10066 -9799 -10463 -2693 -1856 -6163 -5167 3465 2319
13842 2319 2899 -205 5258 -619 -13687 -12138 -5108 -8124 335 4090 7261 3512 6090 -622 -3841
13827 -3841 -4769 2961 -376 -4391 -4768 -5096 -2617 3819 3156 2554 4786 9855 6474 -6931 -8984 -1956
13811 -1956 -3351 1875 -2605 -6099 -2455 2748 3663 -2078 -7785 6248 2721 1784 1653 -4513 -9606
13796i606m151N933N473L679M133l92N41n655m651O12J609j058N405R731q18O267
13780A7052m990p524r60r126m197r89O336K652l223Q202k76L401O33J956N87k69
13764I265m139J727O25k079o020L784K116O447m940o925J174p814q72o596m626
13749a8873J0795K932O776M288m495J356J63J521r38k877l556m241Q32J993j284
13734e608k34Q812M113J430m395p117m223R070J1220P585p3p317l332J038l835
13719G134n310K843k121L797M177J832q406n230J1871l078p766N044J0935K189
13705A7911m48J568k264j764K657o833q756k264M25j738j572j220m325J983M991
13690a649L805K95m972K75K337R077j855j890M512P41l791R627j563j0185K435
$$ plain form
13796 -9606 -13757 -7824 -2351 1328 5461 5069 5610 -45 -4696 -4084 -2475 -3533 1872 11603 10785 17052
13780 17052 12062 4538 3578 -5548 -9745 -10734 -4398 -1746 -4969 3233 2957 6358 6991 8947 9534 9265
13764 9265 5126 6853 7478 5399 -621 3163 5279 11726 6786 -139 1035 -6779 -7651 -14247 -18873
13749 -18873 -8078 -5146 1630 5918 1423 2779 2942 4463 3525 648 -2908 -7149 -6317 -4324 -5608
13734 -5608 -5842 2970 7083 8513 4118 -2999 -7222 1848 13068 20653 20580 13263 9931 10969 7134
13719 7134 1824 4667 2546 6343 10520 12352 3946 -1284 10587 7509 -257 4787 15722 17911
13705 17911 17463 19031 16767 15003 17660 10827 2071 -193 232 -1506 -3078 -4298 -8623 -6640 -1649
13690 -1649 2156 2451 -2521 -2246 91 9168 7313 5423 9935 10676 6885 16512 14949 4764 7199
13675G199Q68J179n33K248j5544o460R898M498p252m299m307j184J2476M607l396
13660bk688n153N852p40n300J1167J3838p770j2046l01P114O547K163m483O137
13645A4335L377L915K336m097p348k97n298K082L501r36n938p407j0115O119K060
13630c711l5m374M38O214K378k842m176k321Q595N994k258M671J1648k667p318
13615A0236n718j0167j2551L786Q214n073L689O332J371j782j862l009o478L149
13601i863k955n116k035k375k316R828R760r305N253J6354k18m140R64l901q459
13586h524r918p052R753Q1N94J4450M354M635j1839q431O968k565l134M508r69
13571g089O419j223n809o027O971L788m739k555n489J454J2192M029j120L843
$$ plain form
13675 7199 8067 9246 8713 10961 -4583 -11043 -1145 3353 -3899 -8198 -12505 -13689 -1213 3394 -2
13660 -2 -2690 -7843 -1991 -2731 -8031 3136 16974 9204 -2842 -3143 3971 10518 12681 8198 14335
13645 14335 17712 21627 23963 19866 12518 12221 6923 9005 12506 11570 5632 -1775 -11890 -5771 -3711
13630 -3711 -3746 -8120 -7682 -1468 910 -1932 -6108 -8429 166 6160 3902 8573 20221 17554 10236
13615 10236 4518 -5649 -18200 -14414 -6200 -11273 -7584 -1252 119 -1663 -3525 -6534 -13012 -9863
13601 -9863 -12818 -17934 -19969 -22344 -24660 -14832 -5072 -14377 -9124 7230 7012 2872 3836 -65 -8524
13586 -8524 -18442 -25494 -15741 -15660 -15066 -616 3738 8373 -3466 -11897 -4929 -7494 -10628 -6120 -7089
13571 -7089 -670 -1893 -7702 -13729 -6758 -2970 -7709 -10264 -15753 -14299 -2107 1922 802 4645
13557D645R920L82n191j0219l157j567K227P100L797q831o169Q218J449J147o055
13542b304o240L294P577J136n654p209K395N10l803Q31R96j117N436M441J76O44
13526A109j520j118K35r987p59L236M296N598j300p851O67M932M930O859j741
13511G586j083o399p001m56J815n014N92L723l290o834n04l960N846O669j937
13496a0247K263J0789k081m789O662r79Q25M203l297n100nJ665j406j65k399L932
13480a29L843Q23j938m226l837j1711m069M961Q202L233j745k794l084M417k471
13465a0525J901P965J0710M699l668p912o079l373k676l040P581l665p628j167
13451a6877P652J2898P208L701l846k382j0042p54n227K823j322k960Q916Q353
$$ plain form
13557 4645 14565 14947 9756 -463 -3620 -5187 -2960 4140 7937 -894 -7063 1155 2604 3751 -2304
13542 -2304 -8544 -5250 2327 3463 -2191 -9400 -7005 -6495 -10298 -9467 -8471 -9588 -4152 289 465 1109
13526 1109 -411 -1529 -1294 -11281 -12040 -8804 -4508 1090 -210 -8061 -7394 -2462 2468 9327 7586
13511 7586 6503 104 -6897 -7353 -5538 -10552 -9960 -6237 -9527 -16361 -16865 -20825 -14979 -8310 -10247
13496 -10247 -7984 2805 724 -4065 2597 1618 2443 6646 3349 -1751 -1756 -91 -1497 -1662 -4061 -129
13480 -129 3714 4537 2599 -1627 -5464 -17175 -21244 -16283 -8081 -4848 -6593 -9387 -12471 -8054 -10525
13465 -10525 -8624 -659 10051 14750 11082 3170 -2909 -6282 -8958 -11998 -4417 -8082 -15710 -16877
13451 -16877 -9225 3673 10881 14582 10736 8354 -1688 -2442 -7669 -4846 -6168 -9128 -212 8141
13437H141O227J924p916p404l285j775m732J392Q597q54R084M697r014m324m068
13422c310k974l49L672N443R329q963l614K490K074N493K91o19j0760n879J1200
13407C524N864J76j01N90q640j086O439n795r833Q382k238n68k90j0318K035J1489
13391c70N876n328p94M777O752o504m731n525M042J917k171Q70Q4K439L459l067
13375A726M180o073j1191j2282j2834J0559M742j619j286O148R427R602P221J993
13361A0313r583L23K855M832q258J842m116L114O725J1395p885r170j1172N245
13347c540K924n293j219L719K226j004M452M184L202n892K982J563q934j2504
13333a3134K458P783M038J840P818K017j0987p407o78P8l349J361m265N070K709
$$ plain form
13437 8141 14368 16292 8376 972 -2313 -4088 -8820 -7428 1169 315 9399 14096 5082 758 -3310
13422 -3310 -6284 -6633 -2961 2482 11811 2848 -766 1724 3798 9291 9582 8963 -1797 -7676 3524
13407 3524 9388 9564 9463 10053 1413 327 6766 971 -8862 -480 -2718 -3286 -3576 -13894 -11859 -370
13391 -370 5506 178 -616 4161 10913 4409 -322 -5847 -1805 112 -2059 -1189 -1105 1334 4793 1726
13375 1726 5906 -167 -11358 -23640 -36474 -25915 -21173 -22792 -24078 -17930 -8503 1099 8320 10313
13361 10313 730 1053 3908 8740 482 2324 -1792 1322 8047 19442 11557 2387 -8785 -3540
13347 -3540 -616 -5909 -7128 -3409 -1183 -2187 2265 6449 9651 3759 6741 8304 -630 -13134
13333 -13134 -10676 -2893 1145 2985 10803 12820 1833 -5574 -6252 -6174 -9523 -8162 -12427 -7357 -4648
13318d648n84K241j479M505M065P823L518k868n444j556P62N341L212M143p347
13303A1684k237Q337O573q354j0878l633P14q768q273k60J1059J0147m670K209
13289C650k104k935R455O561o283P509O563q68m127r753J663M366j527o717n763
13274c10j014L346J975K867J505j0713q423L954Q595k130p07k233m942L056L416
13259a758J1947J5039O403l391m656J1K136K497j4557l327O211n476J271L809
13245A6159M129J0707R150k687j1091l699J4345J0440R806K2043K0707M2562O4829
13232B07400Q8052J22012J26802Q4454q44p8608j20083j23534r3440o3084m6066
13221A03061l1207j8513p653O02P042l111j6836j4177k585R089M215j6662m454
$$ plain form
13318 -4648 -5232 -2991 -4470 35 4100 11923 15441 12573 7129 5573 6335 11676 14888 19031 11684
13303 11684 9447 17784 24357 16003 5125 1492 2206 -6562 -14835 -15095 -4036 6111 1441 3650
13289 3650 1546 -1389 8066 14627 8344 15853 22416 21548 17421 7668 9331 13697 12170 5453 -310
13274 -310 -1324 2022 3997 6864 8369 -2344 -10767 -6813 1782 -348 -1055 -3288 -8230 -5174 -1758
13259 -1758 10189 25228 31631 28240 23584 23595 25731 28228 13671 10344 16555 11079 12350 16159
13245 16159 20288 30995 40145 37458 26367 22668 37013 47453 57259 79302 100009 142571 207400
13232 207400 295452 417464 544266 628720 627876 549268 429185 305651 212211 149127 103061
13221 103061 71854 53341 45688 46290 53332 50221 33385 19208 16623 25712 29927 13265 8811
13208H811m929l556J2469J1140k166j211O79K703K501J2344J9254n11j1148n160
13194D1220l459k481p206J1055J3904K543J635k393p245l016m536r035j7817o478
13180F691K925O384O336O169n021k135K269r061K167M471P357L83n043O952l864
13165B6980q307K753Q893m374q632Q887O665J913L986L537N408Q439M101n983
13151E4266m787j3772O68j448o981m369o258L855J1256M416n765k31m753j1747
13137A4350m189m153J0763J891J557l516m4M196m187k144j369J069m924O569L416
13122A9285m438o853K389r329k219P654J0696O411m96K726Q228O373K71l180N147
13107D2665k629l637j7949k773j063j36q016L874O892Q971o056n444N733J652
$$ plain form
13208 8811 3882 326 12795 23935 21769 20558 21237 23940 26441 38785 58039 57528 46380 41220
13194 41220 37761 35280 28074 39129 53033 55576 57211 54818 47573 44557 40021 30986 13169 6691
13180 6691 9616 16000 22336 28505 23484 21349 23618 14557 16724 21195 28552 28935 23892 30844 26980
13165 26980 18673 21426 30319 25945 17313 26200 32865 34778 38764 42301 47709 56148 60249 54266
13151 54266 49479 35707 36375 34927 27946 23577 17319 21174 32430 36846 31081 30850 26097 14350
13137 14350 10161 6008 16771 18662 20219 16703 16659 20855 16668 14524 13155 14224 9300 15869 19285
13122 19285 14847 7994 10383 1054 -1165 6489 17185 23596 23100 25826 34054 40427 40698 37518 42665
13107 42665 40036 36399 18450 15677 14614 14478 6462 10336 17228 26199 20143 14699 20432 22084
13093B2084k971M712l493J30O533L050n144j513J4197P55r67n665j8584m615J1140
13078A9649M176k040n465n934M379p259j984M086P280L309M468O657K931J5079
13064D9332K983n834n017LK962L534j923p86p989K945Q413m935M112p341j583
13049C8876K84k602q529q065M443K267N546j220j7946r298Q885M067j0462o583
13035c37n39R193O189j793j0512J618K792O160o35L16P98Q60n958p54M777J502
13019A3677p102n369k319k886J3337O368M813R119M38m638j4289J318o475l350
13005B642K355l576j0141r702J669R671O765j769m503o631l903O977K773l643
12991a1016O89j0289q179M977R900j495J371Q909k616l778O164O903Q824M746
$$ plain form
13093 22084 19113 23825 20332 20462 26995 30045 24901 23388 37585 38340 37373 31708 13124 8509 19649
13078 19649 23825 21785 16320 10386 14765 7506 5522 9608 16888 20197 24665 31322 34253 49332
13064 49332 52315 46481 41464 41467 44429 47963 46040 45254 37265 40210 48623 43688 47800 40459 38876
13049 38876 39160 36558 28029 19964 24407 26674 32220 31000 13054 3756 12641 16708 6246 -337
13035 -337 -876 8317 14506 12713 2201 3819 6611 12771 12136 12452 13250 14110 8152 7398 12175 13677
13019 13677 6575 1206 -1113 -3999 9338 15706 20519 29638 30076 25438 11149 12467 5992 2642
13005 2642 4997 1421 -8720 -18422 -16753 -7082 -317 -2086 -6589 -13220 -17123 -10146 -7373 -11016
12991 -11016 -10327 -20616 -28795 -23818 -13918 -15413 -14042 -5133 -7749 -11527 -5363 1540 10364 15110
12977A5110N71m447O498l696l862O053j851k761j426q498n902O818k021L532J169
12962E287J071L275N845M809J326J997j1006o331m38l126M188J1566J1386J544
12948C1393j621L669q111j0002k765m286N730K910P816Q496J0104J4494P150J5061
12934H0038J1159J850p705J202p613J302K2375J6872R798o247j2485j6852j1877
12921H1817j305J79m911L717M035j084p027L892j070n115o650L072L341k765o812
12906F3314l21j907N255M079M686Q660J1051K136j5479j2147o791L357K974Q916
12892G7783M093O286N757P557J935J1219L582J261M231j914N413J950q63k772
12878A25518O167j817J814J7166J3116K069O240M649j740k662N944P311R112K0157
$$ plain form
12977 15110 15681 11234 17732 14036 10174 16227 14376 11615 10189 1691 -4211 2607 586 4118 5287
12962 5287 6358 9633 15478 20287 21613 23610 12604 6273 5835 2709 6897 18463 29849 31393
12948 31393 29772 33441 25330 15328 12563 8277 14007 16917 24733 33229 43333 57827 64977 80038
12934 80038 91197 93047 85342 86544 78931 80233 102608 119480 129278 123031 110546 93694 81817
12921 81817 80512 80691 75780 79497 83532 82448 75421 79313 78243 73128 66478 69550 72891 70126 63314
12906 63314 62993 61086 66341 70420 75106 83766 94817 96953 81474 69327 62536 65893 68867 77783
12892 77783 81876 88162 93919 101476 103411 114630 118212 119473 123704 121790 127203 129153 128290 125518
12878 125518 131685 129868 131682 148848 161964 164033 170273 174922 173182 170520 176464 183775 192887 213044
12864B13044K5398K7098K1212K1500J2787J563j7470j5622q732J1775J4547O116
12852C13216K321J1592J3343R255J6746K6592K9013K9118K5977J9175K3876K2305
12840E42529J9803M1704N1487N8144P5812P1379M2121K4721K9392M7998O6514
12829A071604Q6170J18923J35478J45785J79396K39319L42375M50491N41558N51574
12819C862673N05088M70946M66752N32278O70598R31764J389138K145518L361583
12810A4336338N349922Q855359J5061652K4340354L2190262K8459492Q133033
12803A36726412j7743886l1640004k9201441j9853388j2025971p343230m667875
12796A4250617l036467j996223j328432r26733p21483o16142n36600m81708m94998
$$ plain form
12864 213044 238442 265540 286752 308252 321039 322602 305132 289510 280778 292553 307100 313216
12852 313216 315537 327129 340472 349727 366473 393065 422078 451196 477173 496348 520224 542529
12840 542529 562332 604036 655523 713667 789479 860858 902979 927700 957092 1005090 1071604
12829 1071604 1157774 1276697 1412175 1557960 1737356 1976675 2319050 2769541 3311099 3862673
12819 3862673 4367761 4838707 5305459 5837737 6508335 7440099 8829237 10974755 14336338
12810 14336338 19686260 28541619 43603271 67943625 100133887 128593379 136726412
12803 136726412 118982526 87342522 58141081 38287693 26261722 18918492 14250617
12796 14250617 11214150 9217927 7889495 6962762 6241279 5625137 5088537 4606829 4111831
12787D111831n47708n65038m94455l81748k98029k25634j62745j30134r6903r8886
12777A110551q8828p6060n9383m7293n0964n5616m8722m0017k8029k1825k5426
12766E68388q641j0206k1693j0636k0220k2516k2436j7359j0798l19J624K716
12754D27904j3384j6989r978l599N63l785j4827k2240l6872k8707k1437k4195
12742B32454j5168j7652k2758j6257p146n490l910K332j001r79l314K909n11j672
12728A41837p884r046m096K82p363o538k658k537O115O998M634m921J404O524
12714A22751L541q303r20r029p560O699L078n91N23J119J540l667M953N583r05
12699A18812P993K0779J2473J1929O750K5480L6136J9103J6181J3292J9873K1996
$$ plain form
12787 4111831 3564123 2999085 2504630 2122882 1824853 1599219 1436474 1306340 1209437 1110551
12777 1110551 1021723 945663 886280 838987 788023 732407 683685 643668 615639 593814 568388
12766 568388 559747 549541 527848 517212 496992 474476 452040 434681 423883 423564 425188 427904
12754 427904 414520 397531 387553 383954 384517 380732 365905 343665 306793 278086 256649 232454
12742 232454 217286 199634 176876 160619 153473 147983 144073 146405 145404 144425 141111 144020 143509 141837
12728 141837 133953 124907 120811 121093 113730 107192 104534 101997 108112 115110 119744 114823 116227 122751
12714 122751 126292 117989 117069 108040 100480 107179 110257 109666 110189 111308 112848 109181 114134 119717 118812
12699 118812 126805 147584 160057 171986 178736 204216 240352 259455 275636 288928 308801 330797
12687C30797K4932J0185K46j2841j0791J0491J8008k218j7419j8785j8375k1784
12675B92446l3572l8244k6241o139n630k2780k2448j2198m831m068j0007j0378
12663I5910o137j0097o268m308p88j939J1752M646j467P359J4865J1617K5566
12650A40711L7491L0189j05l5738l1938j4915j5669k709P074J1352J2705J962
12638A40410R61N743l691j0941q902k625n931n36J6431L1644L6777J7680J3933
12625B30953J9078J4890O803J459j105M921K7316M9079J02941J58338J26409l065
12613G38017j22687j33392j03930o8055m0624l1261l3935k7355k9754k2225j2376
12602A12423k1307j3378m053n060j2322l384M536J1520J4401k5o445p237j7210
$$ plain form
12687 330797 355729 365914 366160 353319 342528 353019 371027 368809 351390 332605 314230 292446
12675 292446 258874 220630 194389 188250 182620 159840 137392 125194 120363 116295 106288 95910
12663 95910 89773 79676 73408 69100 68312 66373 78125 82771 81304 88663 103528 115145 140711
12650 140711 178202 208391 208286 172548 140610 125695 110026 107317 114391 125743 138448 140410
12638 140410 141371 147114 143423 132482 123580 120955 115024 114488 130919 162563 199340 217020 230953
12625 230953 250031 264921 271724 273183 272078 276999 304315 353394 456335 614673 741082 738017
12613 738017 615330 481938 378008 309953 269329 238068 204133 176778 147024 124799 112423
12602 112423 91116 77738 73685 68625 56303 52919 57455 68975 83376 83351 76906 69669 52459
12589E2459j2164r334O697J0899J4271J4809J0050L096N048J2817L0496K3092
12577A62236L3683N288k9256l8254j9815J672j1801k5295r860L528m324j4939
12565E2863m162m200q288q103O608l257J2432J6737N149J484Q234J0039p113r134
12551F9289j2771j5432m610m344o683o382M256L804L74N438k685k453J3938J2634
12537E4373l064r02O354n396n284j674R94k263K717P633J3411O147r886O24J4589
12522G8373K0504K1349M253N385j1751j8318j3375j1793n697j2706j0851r870
12510C5503o655k888L491R634O529o007r740j4148j0270J023p269p514J7421J969
12496A1079M34J2511J775L88P587k180j0325J974K521J2122R25l141l893N730
$$ plain form
12589 52459 40295 30961 37658 48557 62828 77637 87687 90783 95831 108648 139144 162236
12577 162236 195919 201207 171951 133697 113882 115554 103753 78458 68598 72126 67802 52863
12565 52863 48701 44501 36213 28110 34718 31461 43893 60630 65779 67263 75497 85536 78423 69289
12551 69289 56518 41086 36476 32132 25449 19067 23323 27127 27501 32939 30254 27801 41739 54373
12537 54373 51309 50407 56761 51365 46081 44407 45401 43138 45855 53488 66899 73046 63160 63784 78373
12522 78373 98877 120226 124479 129864 118113 99795 86420 74627 68930 56224 45373 35503
12510 35503 28848 25960 29451 39085 45614 39607 29867 15719 5449 6472 -797 -8311 9110 11079
12496 11079 11513 24024 25799 26187 33774 31594 21269 23243 25764 37886 38811 35670 31777 37507
12482C7507J088k376m721p129n173k75Q949O693p393n630J932j3400j2595K079
12468d44M829K791K899P785R350J4154j331m280O782J0070O533J1077K0563L0865
12454A21643L0625J6838R578r923k0092k9697k8161k3266j6522j2476q308p850
12442B2389o35N700L145k303m627o399p943J0390K229m895N436J0203N641j2950
12428B5381j6590M407L117j955n011m872J492J0380J1182l185q443q388L690Q208
12414A9413Q349j2258q766p540k530J774Q660J1991L754R201P876K446n16J156
12400D3010O923Q346M462o388p419L984N825Q46K517J981L719L987P958P790J8195
12385A05736K4651L9232O0615Q9009J02118Q0250P390j3560L1372J02250J18502
$$ plain form
12482 37507 38595 36219 31498 24369 19196 18921 27870 34563 27170 21540 23472 10072 -2523 -444
12468 -444 4385 7176 10075 17860 27210 41364 40033 35753 42535 52605 59138 70215 90778 121643
12454 121643 152268 169106 178684 168761 148669 118972 90811 67545 51023 38547 30239 22389
12442 22389 21754 27454 30599 28296 23669 17270 9327 19717 21946 17051 22487 32690 38331 25381
12428 25381 8791 13198 16315 14360 9349 4477 5969 16349 27531 24346 15903 7515 11205 19413
12414 19413 27762 15504 6738 -802 -3332 -1558 7102 19093 22847 32048 39924 42370 41854 43010
12400 43010 49933 58279 62741 56353 48934 52918 58743 59589 62106 64087 67806 71793 79751 87541 105736
12385 105736 130387 169619 230234 319243 421361 501611 509001 495441 526813 629063 747565
12374G47565P0260k6791j13919j51833j23559p8447l2801J681J235j2062j4695
12363B66634K987K2310J6616J3618J946k028n705k1993k6182j1803m807l101J4566
12350B63058J0673J5035K8806P1154J25230J55769J45635O8680l0058j01583j43355
12339F09044j35470r1420m9923k8192l0735j9589l509P267M84K2032J3211o077
12327B87123j8947k0682j6691j6272k204K9303L2909K6850R28l0143m8681l9050
12315A84443k2955K51P121m859L288J7821L2682N6330P9585O0714j0201p9669
12303C24551r8191p2536m8838l0018j4445p909j1978p187n610j352L584j096P71
12290B9746k270o990K685R345k194j4204r512M384J6635J1666J0462J2883J4018
$$ plain form
12374 747565 817825 791034 677115 525282 401723 323276 290475 292156 293391 281329 266634
12363 266634 269621 291931 308547 322165 324111 322083 316378 294385 268203 256400 251593 248492 263058
12350 263058 273731 288766 317572 388726 513956 669725 815360 884040 853982 752399 609044
12339 609044 473574 382154 332231 304039 273304 253715 250206 257473 257957 279989 293200 287123
12327 287123 268176 247494 230803 214531 212327 241630 274539 301389 302317 272174 223493 184443
12315 184443 161488 161739 168860 164001 167289 185110 217792 274122 353707 414421 404220 324551
12303 324551 226360 153824 104986 74968 60523 52614 40636 33449 27839 26487 30071 28975 29746
12290 29746 27476 20486 23171 32516 30322 16118 6606 10990 27625 39291 49753 62636 76654
12277G6654j440j4401j1935p670j56J2402n135l323m87q336r997q704K072o654
12263A2890j843j913j1645o048M361J2406O27l83j364n362k010l43K450P490n130
12248D183M093M980o509m750J277j674M593M287N41M125o932m247n54N348M219
12233A2980j37P488l283n856j3661j3167l210K574l087J3777j552J068J710K74
12219d082P875Q150l142l135M571k074N25k153m977m744K093R18p364N71J794
12204e174n624M709N337q671O349M616J0383l28j350N939K439nj287l094p427
12189F812L561M396q123j0844K29J562j763k651j50Q781N763K001O387j0929l881
12174A151k618q424j317O562n371k969R851M065l232l544J0133p029n601N665
$$ plain form
12277 76654 75214 60813 48878 41208 41052 53454 48319 44996 44509 36173 26176 17472 19544 12890
12263 12890 11047 9134 -2511 -8559 -4198 8208 8835 8452 7088 1726 -284 -627 1823 9313 4183
12248 4183 8276 13256 6747 1997 3274 1600 6193 10480 11021 15146 8214 3967 3413 8761 12980
12233 12980 12843 20331 17048 11192 -2469 -15636 -18846 -16272 -19359 -5582 -7134 -6066 -4356 -4082
12219 -4082 3793 11943 8801 5666 10237 8163 8688 6535 1558 -3186 -1093 -175 -7539 -6968 -5174
12204 -5174 -10798 -6089 -752 -9423 -3074 1542 11925 11597 10247 16186 18625 18620 17333 14239 6812
12189 6812 10373 14769 6646 -4198 -3969 -2407 -4170 -6821 -6971 1810 7573 9574 15961 5032 1151
12174 1151 -1467 -9891 -11208 -4646 -10017 -12986 -3135 930 -2302 -5846 4287 -2742 -8343 -2678
12160b678Q159l73j0063P49J0950P720q88l290o859j051q08R200R298m341m298
12145A1427p09j561r046p181k053k833j424l026P531N312o011r357M367J9200
12131D636M18n732r09K9m866J3265P750n408l373N861M090r845j0547J013o2L168
12115e12m136m846j565J187J489j501K216L969J248l868p56j890p480o888N434
12100a7899O406N716L511L909m183K960J0871P217q709r982j868q8o436J315J763
12085e497m551l332j849L659L473q92k786J204J039M238J175k802o006Q164R300
12070D537N698j1850p833M233J1204k875p796M163K260Q312k340j3148p574P717
12056e292P978n617o948N87j898O02l44K021k29n60r56p308M297M180M788J1785
$$ plain form
12160 -2678 5481 5108 -4955 -4206 6744 14464 13576 10286 3427 2376 1568 10768 20066 15725 11427
12145 11427 10718 9157 111 -7070 -9123 -11956 -13380 -16406 -8875 -3563 -9574 -18931 -14564 4636
12131 4636 5054 -678 -1587 -1558 -6424 6841 14591 9183 5810 11671 15761 5916 -4631 -3618 -3680 -512
12115 -512 -4648 -9494 -11059 -9872 -8383 -9884 -7668 -3699 -2451 -6319 -7075 -8965 -16445 -23333 -17899
12100 -17899 -11493 -5777 -2266 1643 -2540 420 11291 18508 9799 -183 -2051 -2139 -8575 -7260 -5497
12085 -5497 -10048 -13380 -15229 -11570 -8097 -8989 -11775 -10571 -9532 -5294 -4119 -6921 -12927 -4763 4537
12070 4537 10235 -1615 -9448 -5215 5989 3114 -4682 -519 1741 10053 7713 -5435 -13009 -5292
12056 -5292 2686 -2931 -9879 -9292 -11190 -10588 -10932 -8911 -9140 -9700 -10656 -17964 -13667 -9487 -4699 7086
12040G086m268N303K176p669l639M695O847o596p339P202P911Q20m296L951K908
12025A5092p302m568q84m117o852P388O812K72j964o504m205O828N016J934M266
12010A1212k364m208n035p823K418k930L690q07m494j87Q063L019m224N420M84
11995B234r191J774P510M597k922K27r78j077L026k132k727K791l481m795K385
11980b759J464O22o18O236k075l338q359K377l849k790J70L829O94J361M769k193
11964d459k244m280K608O759J389l885K4M502J0264K45p317r495q38j041J195
11949f573O014J627j923l213J65L551j841m3L501m363M897J0724m149n435k734
11934B05j4873N50n273k427J5947Q157K029l335m048o919l712J0757K336L326
$$ plain form
12040 7086 2818 8121 10297 2628 -1011 3684 10531 3935 -3404 3798 11709 12529 8233 12184 15092
12025 15092 7790 3222 2338 -1779 -8631 -1243 5569 5841 3877 -2627 -6832 -4 5012 6946 11212
12010 11212 8848 4640 -395 -8218 -5800 -8730 -5040 -5847 -10341 -10528 -2465 554 -3670 1750 2234
11995 2234 -6957 -5183 2327 6924 4002 4229 3251 2174 5200 3068 341 3132 -349 -5144 -2759
11980 -2759 -1295 -673 -1291 4945 2870 -468 -8827 -6450 -10299 -13089 -12919 -9090 -8396 -7035 -2266 -4459
11964 -4459 -6703 -10983 -8375 -1616 -227 -4112 -4088 414 10678 10923 3606 -5889 -6727 -7768 -6573
11949 -6573 -559 1068 -855 -4068 -3903 -352 -2193 -2236 1265 -3098 1799 12523 8374 2939 205
11934 205 -14668 -14118 -19391 -21818 -5871 2286 4315 980 -3068 -9987 -13699 -2942 -606 2720
11920B720K788L25L360J21p056r865O328j854n424l75k375j156k535N716M757
11905d525P415K546N60k99r631L127J2099m160k745R775R03r53j6615n877M805
11890c575l718j1566J436L109q65m441N019Q549K07Q776J1459J393o594j0063
11876h74r544j1860K317K729M543M761P72K205O093M000O100n335K862m106j2348
11861g685n650K060r568j091J6699Q208n052j670N01J747P144K67k435n458j3535
11846a5518j1313P215J8512J0006j686r736q636Q064J4511L785j5142l515Q99
11833b554m357j532l267N11m93J768P116l013j491P151M807K295j334j707l843
11818E7k983r48k011k985K298R984K517p743q987M852j506l327J437P336J1610
$$ plain form
11920 2720 5508 5833 9193 9314 2258 -7607 -1279 -3133 -8557 -8932 -11307 -12463 -14998 -9282 -4525
11905 -4525 2890 5436 5996 5697 -3934 -807 11292 7132 4387 14162 15065 14112 -2503 -8380 -3575
11890 -3575 -7293 -18859 -17423 -14314 -15179 -19620 -14601 -6052 -5845 2931 14390 15783 9189 -874
11876 -874 -10418 -22278 -19961 -17232 -12689 -7928 -7156 -4951 1142 5142 11242 5907 8769 4663 -7685
11861 -7685 -13335 -11275 -20843 -21934 -5235 2973 -2079 -3749 -3248 -1501 5643 5910 3475 -1983 -15518
11846 -15518 -26831 -19616 -1104 8902 7216 -2520 -11156 -3092 11419 15204 62 -3453 -2554
11833 -2554 -6911 -8443 -11710 -11199 -11692 -9924 -2808 -5821 -7312 -161 4646 6941 5607 3900 57
11818 57 -2926 -3874 -5885 -8870 -6572 3412 5929 -1814 -10801 -5949 -7455 -10782 -9345 -2009 9601
11803I601l045j3771j200O83M511j054o773p793K48K918P575P058K205L4o469
11788e272M551J0087l296m207K865J806j258K51L826k701l488R56n506k489J92
11773c683m37j636J0196M401n107r027K819L743j076j901o84J442P443k28r200
11758b935j1961o237N655L739k296l242R704j370n304O275r77J772R746l082n329
11743e842k858j687N099N41p235L335R94K019m843P230P002j316o238m65N187
11728I23J1341M471j2350m818M144m656j5256m655J827N354K598J820K856L039
11714c362K732J468J574m396J880j887m163o911p427K385P832K147l763p936K435
11699a7392k602J920j681L310J278J719m418J4697R773J627k011q375j1332r263
$$ plain form
11803 9601 6556 -7215 -8415 -7732 -3221 -4275 -11048 -18841 -18593 -15675 -8100 -1042 1163 1197 -5272
11788 -5272 -721 9366 6070 1863 4728 6534 5276 5527 9353 6652 3164 4120 -1386 -3875 -3683
11773 -3683 -4120 -5756 4440 8841 3734 -5293 -2474 1269 193 -1708 -2392 -950 6493 6265 -2935
11758 -2935 -14896 -21133 -15478 -11739 -14035 -17277 -7573 -8943 -14247 -7972 -8949 -7177 2569 -513 -5842
11743 -5842 -8700 -10387 -5288 -4747 -11982 -8647 -7653 -5634 -10477 -3247 3755 2439 -3799 -4264 923
11728 923 12264 16735 4385 -433 3711 -945 -16201 -20856 -19029 -13675 -11077 -9257 -6401 -3362
11714 -3362 -630 838 2412 -1984 -104 -1991 -6154 -13065 -20492 -18107 -10275 -8128 -11891 -19827 -17392
11699 -17392 -19994 -18074 -19755 -16445 -15167 -13448 -17866 -3169 6604 8231 6220 -2155 -13487 -22750
11685b2750J0098R759N353K167O801l219j6545n790M087L320j065K656M841N495
11671E208m223l39m45j301q863o010R208O714l505m642m480r19J0313N622l493
11656a155n536j873L45P138o610j629M512r26j156k095m777l845Q422P437n444
11641g192m54o242M74P164N417O925J243k506L8j1324n333N872k45R794J0708
11626A4339l525n028j4925p319J2189J232P86p896m041l180J740J192P201k236
11612i471l364J380m645j832O015L436m755o26R23K374L080N72J1021O351m112
11597F347p42o530k305l642J693N884N114p167m497O809J2754n183r281m931K205
11582c472N728R376L909j1458j5746m879q4p6L152J4507M767j3004k213j0984
$$ plain form
11685 -22750 -12652 -2893 2460 4627 11428 8209 -8336 -14126 -10039 -6719 -7784 -5128 -287 5208
11671 5208 985 646 201 -1100 -9963 -15973 -6765 -51 -3556 -8198 -12678 -13597 -3284 2338 -1155
11656 -1155 -6691 -8564 -8219 -1081 -7691 -9320 -4808 -5734 -6890 -8985 -13762 -17607 -9185 -1748 -7192
11641 -7192 -7646 -13888 -13414 -6250 -833 6092 7335 4829 4867 -6457 -11790 -5918 -6163 3631 14339
11626 14339 10814 5786 -9139 -16458 -4269 -3037 -2251 -10147 -14188 -17368 -15628 -14436 -7235 -9471
11612 -9471 -12835 -11455 -16100 -17932 -11917 -8481 -13236 -13862 -12939 -10565 -7485 -6913 4108 10459 6347
11597 6347 5605 -925 -3230 -6872 -5179 705 5819 -1348 -5845 964 13718 8535 -746 -5677 -3472
11582 -3472 2256 11632 15541 4083 -11663 -16542 -16626 -16702 -13550 957 5724 -7280 -9493 -20477
11568b0477k69M474j323J979J848J512J0259J237N134p842r826J1085J0086M299
11554A2176p250l191J367j215q634J245M303M62L58J584J133j0270J502k140r241
11539a7811j84J1027M909M594l100j2149m944R310m822N954Q975n131j154q483
11525a3009j196J945M665R422p47k020P36J540j332q120j0830l569Q157M099J237
11510i022r26r295j295O344q78m749O905J0017M994J2464R34M47j0182j1583M659
11495a166P014Q883j0344l89N909Q59n945n677J026M295m061j597k0202p203J3886
11480a4712O917P53M443j884k372M533J499k266k99o445o088Q507P076N001Q23
11465E486m117n33j632o529o66J564M819l132M048O116j843O180l752q575l623
$$ plain form
11568 -20477 -20746 -16272 -17595 -15616 -13768 -12256 -1997 -760 4374 -3468 -13294 -2209 7877 12176
11554 12176 4926 1735 3102 1887 -6747 -5502 -1199 -737 -379 1205 2338 -7932 -6430 -8570 -17811
11539 -17811 -17995 -6968 -2059 2535 -565 -12714 -17658 -8348 -13170 -7216 1759 -3372 -4526 -13009
11525 -13009 -14205 -12260 -7595 1827 1080 -940 -204 1336 4 -8116 -18946 -22515 -14358 -10259 -9022
11510 -9022 -9948 -19243 -20538 -14194 -15072 -19821 -12916 -2899 2095 14559 15493 15940 5758 -5825 -1166
11495 -1166 5848 14731 4387 3998 9907 10766 4821 -856 170 4465 404 -1193 -21395 -28598 -14712
11480 -14712 -7795 -7042 -2599 -4483 -6855 -2322 -823 -3089 -3388 -9833 -15921 -7414 -338 4663 5486
11465 5486 1369 836 -796 -7325 -7991 -6427 -1608 -4740 -692 5424 3581 9761 6009 -2566 -6189
11450f189p901k24k836L259O256Q561l770j315n139J0484O145p115n219k963m994
11435a2960p31l820L39R050R415P264M474p253j2349K812J658o992K679J0306
11421C892n975L162J0553M996n034j0855k781l357l477L344J470o37L948P46N900
11406E895K249N612l941j1150j230O515J0333M760m86j0447p0K19n5r603L048
11391A649P508k087n735J374m9L65K198N75Q258N410k064L877k599J088n2p738
11375A1978M739l857k76p197R916J676Q012J1469Q979k718m344J977K419k602
11361D0171L301P95o654l304n767r341k135q927n565K870P240K679m782J6817
11347B7398L564j4447q191J205j378p493o653J617K216l537m540L393M928K543
$$ plain form
11450 -6189 -14090 -14314 -17150 -13891 -7635 926 -2844 -4159 -9298 1186 7331 216 -5003 -7966 -12960
11435 -12960 -13691 -17511 -17172 -8122 1293 8557 13031 5778 -6571 -3759 -2101 -9093 -6414 3892
11421 3892 -2083 1079 11632 16628 11594 739 -2042 -5399 -8876 -5532 -4062 -4699 -751 -5 5895
11406 5895 8144 13756 9815 -1335 -2565 3950 14283 19043 18557 8110 8040 8259 8204 -1399 1649
11391 1649 9157 7070 1335 2709 2660 3025 5223 5798 14056 19466 17402 21279 18680 19768 19716 11978
11375 11978 16717 12860 12584 5387 15303 16979 24991 36460 45439 42721 38377 40354 42773 40171
11361 40171 43472 44267 37613 34309 28542 19201 17066 8139 2574 5444 12684 15363 10581 27398
11347 27398 30962 16515 8324 9529 8151 658 -5995 -4378 -2162 -5699 -10239 -6846 -1918 625
11333F25L948J6m042J0573O632N90m563N153N023n950K883l800q717l914k660
11318A797j081m959J628J0442L729j754j847r034m180O154l04M9J3953k054r544
11303B995m236J817M074j800n640L877J20K855K99N659l810l25j1334N739O722
11288G012m796p260K299K104K226o033o96M715R950L656n796O049K678M103p62
11273A9449m742Q451m116l465P82K572k677m653n83n692m462J0065J277K153J5
11258A4374p057J04j0296m432J5722P234n053j5431o43M466L952J157l530J300
11244A867Q882P672M07p154M96J0911J6457O131p194n034j0378j5667J73M056
11230A1625K233J192m298N442K865q192o484o729l627l220J0685O407o073J567
$$ plain form
11333 625 4573 4589 547 11120 17752 18342 13779 18932 23955 18005 20888 17088 8371 4457 1797
11318 1797 716 -4243 -2615 7827 11556 9802 7955 -1079 -5259 895 591 640 14593 12539 2995
11303 2995 -1241 576 4650 2850 -2790 1087 1207 4062 4361 10020 6210 5885 -5449 290 7012
11288 7012 2216 -5044 -2745 -641 1585 -4448 -5144 -429 9521 13177 7381 13430 16108 20211 19449
11273 19449 14707 23158 19042 15577 16359 18931 16254 11601 11018 5326 864 10929 12206 14359 14374
11258 14374 7317 7421 -2875 -7307 8415 15649 10596 -4835 -5478 -1012 2940 4097 567 1867
11244 1867 10749 18421 18828 11674 12170 23081 39538 45669 38475 33441 23063 7396 7569 11625
11230 11625 13858 15050 10752 16194 19059 10867 4383 -2346 -5973 -9193 1492 7899 1826 3393
11216C393l712M247P120k286ok985q849p17N796j176j407j317L398p078m319O534
11200c364P892n103j933Q742R527n300p17o387r267r760m409K194J9726R935o356
11185E420o230k487M042n818l035J0867P326L523l506n803m91L572k039n441l548
11170c648L554J4046J6267p57j0041p882L767J214k278K439j805J392N027K068
11156B3363j0261j0884k107J532K739n72n003J340l527o044p227L137R649J1159
11142G294o556p018j400L882k55m961o201J6909J3931j063l147j0796M273M002
11128H894j3M223n096j1505J4592O95p200k787p65K759O675J724j1215j1861l389
11113a4269Q419K454L871q64N541M871o20o171r391J302o79O515P289Q70j0331
$$ plain form
11216 3393 -319 3928 11048 8762 8756 5771 -3078 -3795 2001 825 -582 -1899 1499 -5579 -9898 -3364
11200 -3364 4528 -575 -2508 6234 15761 10461 9744 3357 -5910 -15670 -20079 -17885 1841 11776 5420
11185 5420 -810 -3297 745 -5073 -8108 2759 10085 13608 10102 4299 3808 7380 5341 -100 -3648
11170 -3648 -94 13952 30219 29462 19421 11539 15306 16520 14242 16681 14876 16268 21295 23363
11156 23363 13102 2218 111 1643 4382 3810 -1193 147 -3380 -9424 -16651 -13514 -3865 7294
11142 7294 738 -6280 -7680 -3798 -4053 -9014 -15215 1694 15625 14562 11415 619 4892 8894
11128 8894 8881 13104 8008 -3497 11095 11790 4590 1803 1038 3797 10472 12196 981 -10880 -14269
11113 -14269 -5850 -3396 475 -389 5152 10023 9403 3232 -6159 -4857 -5536 979 8268 9138 -1193
11098a193m424M363K184J449k900l007l091r461J7205m0p488N304O971Q404m984
11083I292j3028r949k485l2R67O082O052Q884J2114K187k570m159l873J990k444
11068I028k499m918o468M659Q818M130l392n125r120k076P514J360K847P268J128
11053A3154o625l394n454j668L687m891m358p03O692P68k058J0228J698j5243
11039h167o134N187N257J1561K477M354L592n894o399l051M333l107o778K090
11025f79r024J659j067O17j424O860Q629m365m126k861l00j690n3Q058p785j302
11009h853J8155P221j0008r045o038n016O817J767l116n014P166M01m220L73J0357
10994I47l7p666M360J638K997O851K73k238q570K158l67n949n93J0266N359p984
$$ plain form
11098 -1193 -5617 -1254 930 2379 -521 -3528 -6619 -16080 1125 1085 -6403 -1099 5872 14276 9292
11083 9292 -3736 -13685 -16170 -16202 -15235 -9153 -3101 5783 17897 20084 17514 13355 9482 11472 9028
11068 9028 6529 1611 -4857 -198 8620 12750 9358 4233 -4887 -6963 551 1911 4758 12026 13154
11053 13154 6529 3135 -2319 -3987 -300 -5191 -9549 -10252 -3560 -2792 -4850 5378 7076 -8167
11039 -8167 -14301 -9114 -3857 7704 10181 14535 18127 12233 5834 2783 7116 4009 -2769 -679
11025 -679 -9703 -8044 -9111 -8494 -9918 -3058 5571 1206 -2920 -5781 -6081 -7771 -7824 234 -7551 -8853
11009 -8853 9302 16523 6515 -2530 -8568 -13584 -6767 -5000 -8116 -13130 -5964 -5563 -9783 -9410 947
10994 947 910 -6756 -2396 -758 2239 9090 9363 7125 -1445 713 346 -5603 -6196 4070 9429 1445
10978A445q212m228l903k369L751M54Q137J849L362O908O583n344o367q9O171
10963H148m964j1705j100L073m129p270N496N62K151l036J2574N266l593l743
10949b270n420n385p903J205j759J3445J2489r155K030Q131Q535K41j1711l29
10935B144J280N80n134J2982J0729j2222j8870j738p311M772J8303J6427N984
10922B7926n186l784j907L375N868o473o031m81J1336M059j543r200J409j267
10908A8101k626n650p469n028M367O744Q79j0470N909N759q582M944L341j2156
10894a937j0203J950k244P48N242O070L073k221j509O867J48Q306j001j993j0028
10879A268K960P103J009j763N277N89r352m899J3144p82p375J84j501Q102M685
$$ plain form
10978 1445 -6767 -10995 -14898 -17267 -13516 -13062 -4925 -3076 286 7194 13777 8433 2066 1977 8148
10963 8148 3184 -8521 -9621 -6548 -10677 -17947 -12451 -11889 -9738 -12774 -200 5066 1473 -2270
10949 -2270 -7690 -13075 -20978 -19773 -21532 -8087 4402 -4753 -2723 5408 13943 14184 2473 2144
10935 2144 3424 4004 -1130 11852 22581 10359 -8511 -10249 -17560 -12788 5515 21942 27926
10922 27926 22740 18956 17049 20424 26292 19819 13788 13307 24643 28702 27159 17959 19368 18101
10908 18101 15475 9825 2356 -2672 1695 8439 9318 -1152 4757 10516 1934 6878 10219 -1937
10894 -1937 -12140 -10190 -12434 -11686 -6444 -374 2699 478 -1031 5836 5984 14290 13289 11296 1268
10879 1268 4228 11331 12340 10577 15854 16443 7091 2192 15336 14554 7179 7363 5862 13964 18649
10864A8649p66o936P13M202k694M45p134q972j963q712J310N12j702j930k591
10849a7569J6026R743Q506n367l039J635j935l631L508P319L661m233j7501l265
10835f142N197R702R80j458J0090N489r776j1833P963R394K618K379j1314n807
10821G482Q434m98o159J392m576p121M778J833Q150O41j034R671m375n547k094
10806A0977j564l236l016O133R592j306m897K546L727O12M806M719j6721j0764
10792A608l327L239J6539M81j3125r782L778J0535L740j301j2813j1345L476P965
10778c32M695L631R72l887r207n552J1982J5172q214l649J185N646l598k965L091
10763H970O414L395k483K519k626o75p361o972Q364Q169k353k915O686L642m531
$$ plain form
10864 18649 17883 10947 11660 15862 13168 13613 6479 -2493 -4456 -13168 -11858 -11346 -13048 -14978 -17569
10849 -17569 -1543 8200 16706 11339 8300 9935 8000 4369 7877 15196 18857 14624 -2877 -6142
10835 -6142 -945 8757 9737 8279 18369 23858 14082 2249 10212 19606 22224 24603 13289 7482
10821 7482 15916 15418 9259 10651 6075 -1046 3732 5565 13715 14356 13322 22993 18618 13071 10977
10806 10977 9413 6177 3161 9294 18886 17580 12683 15229 18956 19568 24374 29093 12372 1608
10792 1608 -1719 1520 18059 18540 5415 -4367 -589 9946 13686 12385 -428 -11773 -8297 -332
10778 -332 4363 7994 8966 5079 -4128 -9680 2302 17474 9260 5611 6796 12442 8844 5879 8970
10763 8970 15384 18779 16296 18815 16189 15514 8153 1181 9545 17714 15361 12446 19132 22774 18243
10748A8243M000L692j381r370k785O918q654j3885P010M678M283n141J517L486
10734A2611l493q503j3081J2035J5481j449M121P712K541n262j2756m578K546
10721G925M976m673k302K045m769J2137J0442p451m37o781J200Q20j345m554n408
10706A825m752K185L350l395O034O010R52J1655K514q239q72o333j984r614L092
10691B428J233L692L8L248J425M467o75N313J803p945l198O593q202j80J1582
10676B1622Q052m364j487o211m292M008m123J956L975R874R040M021R882R569
10662F1522r68m137O024J809Q44m361k117m873r649M123N723L290R024L056J0892
10647H0202O681j620o928J3505J8242J0714J1921K1201M0413O4994Q9256J57498
$$ plain form
10748 18243 22243 25935 24554 15184 12399 19317 10663 -3222 3788 8466 12749 7608 9125 12611
10734 12611 9118 615 -12466 -431 15050 13601 17722 25434 27975 22713 9957 5379 7925
10721 7925 12901 8228 5926 7971 3202 15339 25781 18330 17893 11112 12312 13132 11787 7233 1825
10706 1825 -2927 -742 2608 -787 5247 11257 12209 23864 26378 18139 17267 10934 8950 -664 2428
10691 2428 3661 7353 7391 10639 12064 16531 15856 21169 22972 15027 11829 18422 10220 10040 21622
10676 21622 29674 25310 23823 17612 13320 17328 13205 15161 19136 29010 38050 42071 51953 61522
10662 61522 60554 56417 62441 64250 65094 60733 58616 53743 44094 48217 53940 57230 66254 69310 80202
10647 80202 86883 85263 78335 91840 110082 120796 132717 153918 194331 259325 348581 506079
10635E06079K60869L48781L24636J88416K6727p8776j18157j66264k31598k67124
10625G93589k43024j66529r7783o5300l7730j9839j4649k2927j8310j1686n160
10614I0652n890o507k713O47J997m756l357l287o119j0336K649N647r316m947
10600D4364n554n499Q200l556l040k709k2o662N459L156K107N001L066J293p890
10585C7714n009q154k305m661q097N033M047k845l888K366l692r693J1685J0994
10571B3495k76m17l63j281m953J467k416L790Q413N385l26n263M254M639r45L182
10555C8385m873j3709j1805M587J126K993J3106N894L815K982l06j687Q94j230
10541D0172K791K637K575R743P140P168Q184m275j2829j3841j8962n948L245J63
$$ plain form
10635 506079 766948 1115729 1440365 1628781 1655508 1576732 1458575 1292311 1060713 793589
10625 793589 550565 384036 286253 220953 183223 163384 148735 125808 107498 95812 90652
10614 90652 84762 78255 75542 76189 78186 73430 70073 66786 60667 50331 52980 58627 49311 44364
10600 44364 38810 33311 41511 37955 34915 32206 32184 25522 30981 34137 36244 41245 44311 45604 37714
10585 37714 32705 24551 22246 17585 9488 14521 18568 15723 11835 14201 10509 816 12501 23495
10571 23495 23219 22802 22439 21158 16205 17672 15256 19046 27459 32844 32518 27255 31509 36148 35203 38385
10555 38385 33512 19803 7998 12585 13711 16704 29810 35704 39519 42501 42195 40508 41402 40172
10541 40172 42963 45600 48175 57918 65058 72226 80410 76135 63306 49465 30503 24555 27800 27963
10527B7963J832k072M066K426p510q702r266M549N155K131k691o581q975j465
10513H60J264J0051R868Q775N958m620N136M579p373J047J0034M954O642J1277
10499F8452m161J397O128P7K109J4421R159J2474J4418R149R911l420M74j298
10485A39290o629J0294N37q869o105M331l678O026n066l321P92r583k161N091
10471A20949r781k2464o894o889m280j1564O43K093l616j2282j2740p410R042
10458C4807m309l534J46o56j454J689m578O975k908l584k389J149P783l303p421
10443A8413l518K816P43O085R941j541M868m023m70q635j3028j7650p480K662
10429a0817P195j054q614J645R263k613N27p823r683n939K321M647j056m190j2757
$$ plain form
10527 27963 29795 27723 31789 34215 26705 18003 8737 13286 18441 20572 17881 11300 2325 860
10513 860 2124 12175 22043 30818 36776 32156 37292 41871 34498 35545 45579 50533 57175 68452
10499 68452 64291 65688 71816 71893 74002 88423 97582 110056 124474 133623 143534 140114 140588 139290
10485 139290 132661 142955 143492 134623 128518 132849 129171 135197 130131 126810 127602 118019 115858 120949
10471 120949 111168 88704 81810 74921 70641 59077 59720 61813 58197 45915 33175 25765 34807
10458 34807 30498 26964 27110 26454 25000 26689 22111 29086 26178 22594 20205 21354 29137 25834 18413
10443 18413 14895 17711 18454 24539 34480 32939 37807 33784 33314 24679 11651 -5999 -13479 -10817
10429 -10817 -3622 -4676 -13290 -11645 -2382 -4995 -4468 -12291 -21974 -27913 -25592 -20945 -22001 -26191 -38948
10414c8948L309J2243N19j204N821P370M950J0931J8555J3189M535J3968r103
10401D6135J589Q080J0118m183K901P951K089n118j251j3590o544j367K436L961
10387E3207J1939J2970P557o43j0075l163o455M94L741j767K699Q157n330q070
10373F5261R0l426M610o457j3315j491J6352J0460P477J5276J1885K4525L0003
10360A61250K3942J0608J0378Q451K7757M8796L0592J5747J2849J7967j2470l2169
10348C23698k1575N712N210r56m969o246K544K5030N0519P0689P4285M8310M927
10335E77178k1606r828K0586K942m8341p1468o9022m5568k7716p974l763M160
10323B99580K1270K7888K9397M1657P1251J26170J88188K11461J35739J0699l5219
$$ plain form
10414 -38948 -35639 -23396 -22877 -24081 -18260 -10890 -5940 4991 23546 36735 41270 55238 46135
10401 46135 47724 55804 65922 61739 64640 72591 74680 69562 68311 54721 48177 46810 49246 53207
10387 53207 65146 78116 85673 85030 74955 71792 65337 65831 69572 67805 70504 78661 73331 65261
10373 65261 65351 61925 66535 60078 46763 45272 61624 72084 79561 94837 106722 131247 161250
10360 161250 185192 195800 206178 214629 242386 291182 321774 337521 350370 368337 355867 323698
10348 323698 302123 307835 313045 312089 307120 300874 303418 328448 378967 449656 523941 572251 577178
10335 577178 555572 545744 566330 569272 520931 449463 380441 334873 307157 299183 295420 299580
10323 299580 320850 348738 378135 419792 491043 617213 805401 1016862 1152601 1163300 1128081
10312A128081R216L6414k3033j25643j82181j56962j04290o1143j9871j0496n264
10301D84828k854k625P088L410K443M476R508K0725J2068J1702J7117Q612J7462
10288E93960N093J1512J7367P140K0841L6695K8225K9984K6886L0939M1050M3631
10276H93323L5735K7977L2397M9404M2923O3010P3767O5267P0814Q1764Q8398
10265A524779J01761J03455J13108J23082J37076J66359J67073K06816K60397
10256B903906L22227M17997M88793N04600M93150N12138N87695P04521Q22727
10247G757754Q75684R42608J140157J376562J597559J862562K345117L262408
10239B1160411M856733P564020J2361416K0486159L1631468M0720840M0184629
$$ plain form
10312 1128081 1137297 1173711 1150678 1025035 842854 685892 581602 520459 500588 490092 484828
10301 484828 481974 479349 486437 489847 492290 496766 506274 526999 539067 550769 567886 576498 593960
10288 593960 599053 610565 627932 635072 655913 692608 720833 750817 777703 808642 849692 893323
10276 893323 929058 957035 989432 1038836 1081759 1144769 1218536 1283803 1354617 1436381 1524779
10265 1524779 1626540 1729995 1843103 1966185 2103261 2269620 2436693 2643509 2903906
10256 2903906 3226133 3644130 4132923 4637523 5130673 5642811 6230506 6935027 7757754
10247 7757754 8633438 9576046 10716203 12092765 13690324 15552886 17898003 21160411
10239 21160411 26017144 33581164 45942580 66428739 98060207 138781047 178965676
10232A78965676L0034561J9909924J2753796K26163j8090581l0357934k6804305
10225A66637300j1137962j2717p046922k3848255l2171206k7902745j8898670
10218D5618823j1782195p541471n134465l679305k636720j855750j397030j238806
10210A0353081j157349j019900q35687p03190o48334o13522n17475l89402l31621
10201D136601l52552l86631l69488l05498k47891k09630j71898j51107j36511
10192A805395j30040r6055p9261o5003o0635o2730m4558n1690m0616l4421k8550
10181A111836k6144k5638l8541l6634l9175m4046m5821l8784k9208l7685k0789
10170G29371j2758l0830l5720k2560k0390j6898r574j1299j2383J040J0038K7199
$$ plain form
10232 178965676 209000237 228910161 241663957 241890120 223799539 193441605 166637300
10225 166637300 155499338 155486621 148439699 124591444 92420238 64517493 45618823
10218 45618823 33836628 26295157 21160692 17481387 14844667 12988917 11591887 10353081
10210 10353081 9195732 8175832 7340145 6636955 5988621 5375099 4857624 4468222 4136601
10201 4136601 3784049 3397418 3027930 2722432 2474541 2264911 2093013 1941906 1805395
10192 1805395 1675355 1579300 1500039 1435036 1374401 1311671 1267113 1215423 1174807 1140386 1111836
10181 1111836 1085692 1060054 1021513 984879 945704 901658 855837 817053 787845 750160 729371
10170 729371 716613 685783 650063 627503 607113 590215 580641 569342 556959 557999 568037 595236
10158E95236M9627N5036N7640L7257P180L850j2463j2530J6554Q8645K50760M65203
10146A601995M71440N5488j84132P9689J17999l07532n41843l69137k01430j16116
10136F06421p4334m9615k9395j3054j3951m654j1664k2858k5510k0863q608j1655
10124C20260k0832j0195j0014j7152j5777j7896r579j3092J211m194j279n273
10112A96188o131M085J9767M1995L9934K8313K3732M6865M2699L947j3141m091
10100D24162J6468N612j0187k0566j2842j3717k9098l0601l3088j6532K383j7099
10088B64895j7569j6563l799p668j4063o25n751n144j1731j1792l93m594l045
10075A62158R357J402l662k697n037l337k070j7246r448J952k796j0799m639l892
$$ plain form
10158 595236 644863 699899 757539 794796 801976 805826 793363 780833 797387 886032 1136792 1601995
10146 1601995 2073435 2128923 1944791 2024480 2142479 1834947 1293104 923967 722537 606421
10136 606421 532087 482472 453077 440023 426072 421418 409754 386896 361386 340523 331915 320260
10124 320260 299428 289233 279219 262067 246290 228394 218815 205723 206934 202740 201461 196188
10112 196188 190057 194142 213909 255904 295838 324151 347883 394748 437447 441394 428253 424162
10100 424162 440630 446242 436055 415489 402647 388930 359832 329231 296143 279611 281994 264895
10088 264895 247326 230763 226964 219296 205233 204608 198857 193713 181982 170190 169797 165203 162158
10075 162158 171515 172917 169255 166558 161521 158184 156114 138868 129420 131372 128576 117777 113138 109246
10061A09246J169K95L075p821q379L469N952K920K1316J6317J2521J2079P050
10048A79209n380R593J1205J937q093k39L25q054j1128m405o267j0548O574J6771
10034A71500N074M849J254j860j0836j5937p421J300K8586K8541L7191M8998M1170
10021C32409K8660j127j3391L360p62k6224o0776n3217l9828j1276j0399j2328
10009A35101j8799q223r302O28O765o198k332j1608L186O687j931J18l698j4360
9995G6034l654j994K111l608p192l042l578l963l352J4525J0127k670j262R945
9981G8427J422L7l969j542k99J926R78Q25o227k464l636k548j795o78j699l645
9965E5113L091R69L645m338p917K403N762P340j970r802R89L652Q388J529l457
$$ plain form
10061 109246 110415 110710 113785 105964 97585 101054 107006 109926 131242 147559 160080 172159 179209
10048 179209 173829 183422 194627 196564 188471 188232 188557 180503 169375 164970 158703 148155 154729 171500
10034 171500 176574 181423 182677 180817 169981 154044 146623 147923 176509 205050 242241 291239 332409
10021 332409 361069 359942 346551 349911 349149 322925 262149 208932 169104 157828 147429 135101
10009 135101 116302 108079 98777 99405 106170 99972 97640 86032 89218 95905 93974 94092 90394 76034
9995 76034 72380 70386 72497 68889 61697 58655 55077 51114 47762 62287 72414 69744 68482 78427
9981 78427 79849 79886 75917 74375 74076 76002 76980 77805 71578 69114 65478 62930 61135 60457 58758 55113
9965 55113 58204 59173 62818 58480 50563 52966 58728 66068 64098 54296 55285 58937 67325 68854 65397
9950F5397j2180p751l35J0198P828O61P706M243N42k682r20j1068R89L641M193
9935G0462R578l739l432j1175j0215o063m459n480n373k938o92p06j4474j566
9921I728j929L542m140K005J1477R567K863j225J592p578q371J619J7150O848
9907D3148j5737J845O695M949Q339k344L978J168o023j2911p469P707O757L056
9893D3158K066o076m142j295P781J0314N49q944p595m129r00K295L091L115J1837
9878E1125R564l655k830q50o126j0342k358r51j372o655n393N37P985m214n085
9863A9380O088R952K431K897r247p376J211j756L947Q022L691k694n06L270k074
9848C7236j845j573O307R608J1230N995Q897P651J8116J6569J1758o64j125Q539
$$ plain form
9950 65397 53217 45466 45131 55329 63157 63818 71524 75767 76309 73627 72707 61639 62628 66269 70462
9935 70462 80040 76301 72869 61694 51479 45416 40957 35477 30104 27166 26474 25768 11294 9728
9921 9728 7799 11341 7201 9206 20683 30250 33113 31888 33480 25902 17531 19150 36300 43148
9907 43148 27411 29256 35951 40900 49239 46895 50873 52041 46018 33107 25638 33345 40102 43158
9893 43158 45224 39148 35006 33711 41492 51806 52355 43411 35816 31687 30787 33082 36173 39288 51125
9878 51125 60689 57034 54204 53354 47228 36886 34528 33577 32205 25550 20157 20694 28679 24465 19380
9863 19380 25468 35420 37851 40748 31501 24125 25336 23580 27527 35549 39240 36546 36040 39310 37236
9848 37236 35391 33818 40125 49733 60963 66958 75855 83506 101622 118191 129949 129285 128160 136699
9834A36699J6651L0598N7603J09587J61768K07431J86449J05710J9615n5636j32943
9823H43532j61281j11972j9077O1253J15725R4319J6761k9500r791K3102j3799
9812H09272r8205j58445j65273j04186n1859m1098l4933j6674k389q54j0268j4572
9800A10516j9563j2702k206j1495n650n77L112L688k023n65L43M563j52m738m901
9785E7650m807m899o333M256O966N232o531K213R360N758m2k456L744m031o310
9770E9770Q77m343n383O142R224P609K00j0638M790L640r915m569QJ2154N804
9755G5370n649j5249j6254l003m52r097r491K644J912O451j400J205K875k068
9741B7794M778N978K871J4163O321q35j3673o623Q13q169p49K396R36o818M914
$$ plain form
9834 136699 153350 183948 241551 351138 512906 720337 906786 1012496 1032111 976475 843532
9823 843532 682251 570279 551202 612455 728180 822499 839260 809760 799969 823071 809272
9812 809272 711067 552622 387349 283163 231304 190206 155273 138599 136210 135356 125088 110516
9800 110516 90953 78251 76045 64550 58900 58323 61435 65123 63100 62535 62878 67441 67289 62551 57650
9785 57650 52843 47944 41611 45867 52833 58065 51534 53747 63107 68865 68823 66367 70111 66080 59770
9770 59770 60647 56304 50921 57063 66287 73896 74096 63458 68248 71888 61973 57404 57412 69566 75370
9755 75370 69721 54472 38218 35215 34763 25666 16175 18819 20731 27182 25782 26987 29862 27794
9741 27794 32572 38550 41421 55584 61905 61070 47397 40774 41587 33418 32669 35065 36001 29183 34097
9726C4097K052Q445m301m752J524J261k356m259k761j3393o292J979J3199R585
9712C4028m070j0648K600L422J614j290n40L838L893M268j334j1137l253MN363
9697B6758R493l037n934J7J261J633L535O148M519o863m112M30R92o510K871L825
9681C5026R95j383K23M299K164p702n465m004N61Q081L595l791j3729k683M162
9666B0349L705Q179J32o539J359J1463Q372j299j6992n450R82L932O190K236o960
9651B9659l310O99n586K098P768l91J590O993r68p004p482l258J1242P07n259
9636B7498M571K349K131m133Q57J259l110l762n707m627Q5j521O713J512M180
9621B8295O350J794j791M889P496l064n683n698N84l138l204L396R839j256O022
$$ plain form
9726 34097 36149 44594 40293 35541 37065 38326 35970 31711 28950 15557 9265 11244 24443 34028
9712 34028 29958 19310 21910 25332 26946 25656 25116 28954 32847 37115 35781 24644 21391 21395 26758
9697 26758 36251 33214 27280 27297 28558 30191 33726 39874 44393 37530 33418 33848 34840 28330 31201 35026
9681 35026 36021 34638 34861 39160 41324 33622 28157 24153 24714 32795 36390 32599 18870 16187 20349
9666 20349 24054 32233 32365 25826 27185 38648 47020 45721 28729 23279 24261 28193 34383 36619 29659
9651 29659 26349 27048 21462 23560 31328 30937 32527 39520 38552 31548 24066 20808 32050 32757 27498
9636 27498 32069 34418 36549 32416 33273 34532 31422 27660 21953 17326 17411 15890 22603 24115 28295
9621 28295 34645 36439 34648 39537 47033 43969 38286 32588 33172 30034 26830 30226 40065 38809 44831
9606D4831K613l531O457J485o402n866o028j349N876r38l434L588J604k142o688
9591C0076p327N44k011p032j162L253J3921N010J091j202l502L711M486o18J1035
9576E0273R252j350m867m781l294j030l243L07M913k054p511O35l714L386K490
9561C9412k016j994m125l141N392J1712N828J752j0948q371j12K569N7k677n656
9546B7682L182O244l233n109l200O579R221l7q972k10O432k34L485m466q282k252
9530B6830O962Q597M425O276J725Q46r41J54q503k0036q386R414M232o318o876
9515A8401K442n115o955P551N609m675K170M328O91P130K758m131K359O787N592
9500D4942j2386j3181M828j965L863N801k287p900J116R055N967J3895p03q874
$$ plain form
9606 44831 47444 43913 50370 51855 45453 39587 33559 32210 38086 37148 33714 37302 38906 36764 30076
9591 30076 22749 23293 21282 14250 13088 16341 30262 35272 36363 35161 31659 35370 39856 39238 50273
9576 50273 59525 58175 53308 48527 45233 44203 40960 41267 46180 44126 36615 37250 33536 36922 39412
9561 39412 37396 35402 31277 28136 33528 45240 51068 52820 41872 33501 33389 35958 36015 33338 27682
9546 27682 30864 37108 33875 28766 25566 32145 41366 41329 32357 32147 38579 38345 41830 37364 29082 26830
9530 26830 33792 42389 46814 53090 54815 55661 54720 54874 46371 26335 17949 27363 31595 25277 18401
9515 18401 20843 15728 8773 16324 21933 17258 19428 23756 24447 31577 34335 30204 32563 39350 44942
9500 44942 32556 19375 24203 22238 26101 31902 29615 21715 22831 31886 37853 51748 51045 42171
9486D2171n370Q27N573P21N895j126o911k962r131j354o505K915Q454M841k532
9471C5506j37o505J129K0206J4487L751j0293p477l285K932p100m143M490J632
9457D5193K278k307r929l080J3277m368l348J228L713N295J446N746l856j902
9443D9386n727N300J710k684P792Q695R060L01r03Q163J66J0715R558M759N704
9428A11995m036r590j5840j0970j2750j2709o105m904P474J8264K615j2273j2505
9415C8666P437J0571k232j516o165j668O999M732o763q92M145M132p537Q923L013
9400F1845Q231J558O890J6920J8814J5282J1691p610k2908j3947n884j3952k944
9387G3986R29Q568L948j2034n489k68j1289O02J0494j0807j0357l930O682J526
$$ plain form
9486 42171 36801 37628 43201 43922 49817 48691 41780 38818 29687 28333 21828 24743 33197 38038 35506
9471 35506 35369 28864 29993 50199 64686 68437 58144 50667 47382 50314 43214 39071 43561 45193
9457 45193 47471 45164 35235 32155 45432 41064 37716 38944 42657 47952 49398 55144 51288 49386
9443 49386 43659 48959 50669 47985 55777 64472 73532 73833 72930 81093 81259 91974 101532 106291 111995
9428 111995 107959 98369 82529 71559 58809 46100 39995 35091 42565 60829 63444 51171 38666
9415 38666 46103 56674 54442 52926 46761 45093 52092 56824 50061 49169 53314 57446 49909 58832 61845
9400 61845 70076 71634 78524 95444 114258 129540 141231 133621 110713 96766 90882 76930 73986
9387 73986 74915 83483 87431 75397 69908 69640 58351 58953 69447 58640 48283 44353 51035 52561
9373E2561M784K47j454J947J404j838P644Q777K903K301N8J2455M387J892L191
9358A01259N689j0029m27O540K416j5018j1471j148o841j0551M114P138L729K672
9344G8072j180j0000n760k484M981O716P897R856R442n628r69l880L323l450n443
9329H1493P273K392n102J201O347P132P438R59o009l239p433q417L363O828j317
9314I2909k470Q864N993L196J969J53l3M645l183k210Q05M973K825l210L997p452
9298A11771j868j665N716j577m900J008M671K894k117L546q41k850j993j109j7422
9283I3264O84L226Q187R231M784m659P677m046q980J362O510M038l428o546L28
9268A11632K993l420P821O393R148R473Q947R443J074j1037m902o760j3862p603
$$ plain form
9373 52561 57345 57592 56138 58085 59489 57651 65295 74072 76975 79276 79334 91789 96176 98068 101259
9358 101259 106948 96919 96492 103032 105448 90430 78959 77811 70970 60419 64533 71671 75400 78072
9344 78072 76892 66892 61132 58648 63629 70345 78242 88098 97540 91912 90943 87063 90386 86936 81493
9329 81493 88766 91158 86056 87257 93604 100736 108174 109133 103124 99885 92452 84035 87398 94226 92909
9314 92909 90439 99303 105296 108492 110461 110614 110581 115226 112043 109833 110638 115611 118436 115226 119223 111771
9298 111771 109903 108238 113954 112377 107477 108485 113156 116050 113933 117479 116638 113788 111795 110686 93264
9283 93264 93948 97174 105361 114592 119376 114717 122394 118348 109368 110730 117240 121278 117850 111304 111632
9268 111632 114625 111205 119026 125419 134567 144040 152987 162430 163504 152467 147565 140805 126943 119340
9254A19340P655J0893j1172j0510J0046J2772N736Q836l07p679m485L787o01J284
9240A45595L602N801O238q123J555K2975P557Q194K085O624K1695J6158J8090
9227B58046L8472M4277O0959P1525O1267K0277m8117o4342o1227m6725l0829j7583
9215B86000P19J1137L796O682J8766L6864N2917N2499M6084K0046M365J754j3091
9202E28538k1381j2874m374q222q933J741P647R443q52J2307J0038K7785O6120
9189F06983J09134J61230J95107J64879M8453j08055j77512j65660j14031o3227
9179F57301m0131k2846K191P797K385R222M947R967K2267J7579J2174K4090L2637
9166G39580J3657K050j1149l0159l5703l3322k9874r968j5541j0060n040R618
$$ plain form
9254 119340 126995 137888 126716 116206 126252 139024 144760 153596 153289 145610 141125 144912 144311 145595
9240 145595 149197 154998 161236 153113 154668 177643 185200 193394 195479 202103 223798 239956 258046
9227 258046 296518 340795 401754 473279 534546 554823 506706 442364 381137 334412 303583 286000
9215 286000 286719 297856 301652 308334 327100 363964 416881 469380 515464 535510 539875 541629 528538
9202 528538 507157 494283 489909 481687 472754 474495 482142 491585 490733 503040 513078 540863 606983
9189 606983 716117 877347 1072454 1237333 1285786 1177731 1000219 834559 720528 657301
9179 657301 617170 594324 596515 604312 606697 615919 620866 630833 653100 670679 682853 706943 739580
9166 739580 753237 755287 744138 713979 678276 644954 615080 605112 589571 579511 574471 584089
9154E84089K6635L9722N8264O6540Q2296O2886K595m2598m8250l5906k8968l1654
9142G35651k6393P26J2381J5534J5019J0639J3332J6605R207K2305K5534J2344
9130H62884J1733J8773K2338K8297L0244K1898K6763L7400K5886K8200L1220L2633
9118A178269K9815L6999M0631L1735L4541M9083M4556N0105N3981M9040M6187
9107A644942N3589N9498O5871O4843O8187O5047O8577P5796Q6987J01361R4339
9096B449037J06341J15218J16604J24390J34091J39769J44196J66872J77538J95242
9086C869298K05812K16150K35623K40191K67568K95101L13181L33303L52278L99374
9076F727879M54656M87330N16018N66024O20982O80938P37766Q16003Q85737R55312
$$ plain form
9154 584089 610724 650446 708710 775250 857546 920432 923027 880429 832179 796273 767305 735651
9142 735651 709258 709984 722365 737899 752918 763557 776889 793494 802701 825006 850540 862884
9130 862884 874617 893390 915728 944025 974269 996167 1022930 1060330 1086216 1114416 1145636 1178269
9118 1178269 1208084 1245083 1285714 1317449 1351990 1401073 1445629 1495734 1549715 1598755 1644942
9107 1644942 1698531 1758029 1823900 1888743 1956930 2021977 2090554 2166350 2253337 2354698 2449037
9096 2449037 2555378 2670596 2787200 2911590 3045681 3185450 3329646 3496518 3674056 3869298
9086 3869298 4075110 4291260 4526883 4767074 5034642 5329743 5642924 5976227 6328505 6727879
9076 6727879 7182535 7669865 8185883 8751907 9372889 10053827 10791593 11607596 12493333 13448645
9066A3448645J039333J120967J208178J285415J348415J394725J423563J422940
9058B3692181J363339J277632J127599R28888O69930L61577N0585k72566n76820
9049B8622345q31706j050665j206322j321351j398135j416072j394804j347268
9041A8656022j286915j222377j145832j060913r77903r12857q38322p75234p11970
9032I723699o51757n85531n47936m95777m46157m26444l87827l51815l29001l07766
9022E193688k85206k56253k37777k26384k06721j86419j69199j63878j64751j51570
9012C145530j31104j32582j28804j12682r4052r2967r4008p9577r0100q4846o8268
9001B036540p7381p8992o6094o5739n2151n8799n4675n1089m5647m9763m3380
$$ plain form
9066 13448645 14487978 15608945 16817123 18102538 19450953 20845678 22269241 23692181
9058 23692181 25055520 26333152 27460751 28389639 29059569 29421146 29471731 29199165 28622345
9049 28622345 27790639 26739974 25533652 24212301 22814166 21398094 20003290 18656022
9041 18656022 17369107 16146730 15000898 13939985 12962082 12049225 11210903 10435669 9723699
9032 9723699 9071942 8486411 7938475 7442698 6996541 6570097 6182270 5830455 5501454 5193688
9022 5193688 4908482 4652229 4414452 4188068 3981347 3794928 3625729 3461851 3297100 3145530
9012 3145530 3014426 2881844 2753040 2640358 2546306 2453339 2359331 2279754 2189654 2104808 2036540
9001 2036540 1959159 1880167 1814073 1748334 1696183 1637384 1582709 1531620 1485973 1436210 1392830
8990A392830m1988l2501l7681m2098l0238l6491l8383k9394k1658l9494m2011
8979A000893k3890j3374j7965k5881k5886l1321k8836l3014j2155l98q200j6069
8967G63904j7361o134j5407j0124j6607j8615k2243j5053J99j8805j7109j1564
8955E95081r280j741p445j2852r470j5744j3098j2442p262p751n797q851j2906
8942D70442j087l484o842j2171j1946j4545p841M961J05l151K3n003m293L034
8928D08202Q57j0020j3800j8001q811K040N021l7m283j2388k944m892j152j0812
8914C28980j3427l807R29J515M624k094q74j1507l369k608j1937j4959j3590l613
8900B54263m825n549m018L525L348m281k344Q868n723l315m073n007k842j6441
$$ plain form
8990 1392830 1350842 1318341 1280660 1238562 1208324 1171833 1133450 1104056 1082398 1042904 1000893
8979 1000893 977003 963629 945664 919783 893897 862576 833740 800726 788571 788173 779973 763904
8967 763904 746543 740409 725002 714878 698271 679656 657413 642360 642559 623754 606645 595081
8955 595081 585801 584060 576615 563763 554293 538549 525451 513009 505747 497996 492199 483348 470442
8942 470442 469355 465871 459029 446858 434912 420367 412526 417487 417592 414441 414464 409461 405168 408202
8928 408202 409059 399039 385239 367238 358427 360467 365488 365451 361168 348780 345836 340944 339792 328980
8914 328980 315553 311746 312675 314190 318814 316720 315846 304339 300970 298362 286425 271466 257876 254263
8900 254263 249438 243889 239871 243396 246744 242463 240119 248987 243264 239949 235876 230869 228027 211586
8886B11586m715N741N191J158k116p458k736k562L744m088j0537j1649n933J005
8872A76631O24M277J0727p431j2118q321N029L197L024Q821o70l91k182m770j0202
8857A66245p382m842M18K807o11r490l180K394k98O070O050M89q179q014O050
8842A48527N81J275L78j869r877o336m408r143j837J4781P240L704N378j1231
8828A37163p648j743n609N89J389K785J44r355j3897N829O358l379j098L54K113
8813A13995k24l05J497r11o608K59P701N303l690L286M68j7536n689P279j682
8798A03143n595m220K41Q10K605j797l391J541L025m218m740P08L457p436N42
8783H4675O880J277m315p633n194L856J200N562K859q058J757R9L956j252j025
$$ plain form
8886 211586 206871 212612 217803 218961 216845 209387 206651 204089 207833 203745 193208 181559 175626 176631
8872 176631 177255 181532 192259 184828 172710 164389 169418 172615 175639 184460 183790 183399 181217 176447 166245
8857 166245 158863 154021 154439 157246 156635 147145 143965 146359 146061 152131 158181 158670 150491 142477 148527
8842 148527 149108 150383 150761 148892 139015 132679 128271 119128 117291 132072 139312 143016 148394 137163
8828 137163 129515 127772 122163 122752 124141 126926 127070 117715 103818 109647 116005 112626 111528 111882 113995
8813 113995 113771 113466 114963 114052 107444 107703 115404 120707 117017 120303 120771 103235 97546 104825 103143
8798 103143 97548 93328 93569 94379 96984 95187 91796 93337 96362 92144 87404 88112 91569 84133 84675
8783 84675 91555 92832 88517 80884 75690 79546 80746 86308 89167 81109 82866 82965 86921 85669 84644
8768H4644J0955J425m492l979k596j50N497l538K083R051M796J102k046q742L36
8753I4346Q890L907j0554j9299k881O124L974m1N25n040o56m381M353P446J537
8738H8250K41j1376J225P066k579r126m713P258J911k173n337R728Q958J062j157
8723H9238N875J146N933p037k186Q343J211n430J474n159r860l744Q006J3401
8709A01211Q257n332l078j2440q9J0452J2444O440l513N120j531p443n113n503
8695I9882M185l855O431M934M040Q814k601r527j718O408O034j765m763L200J0313
8680A30012P520J475J3865l306j3878n121J058R297J6474J3095P729O990j802
8667A83408j2631j2257j541L945k166p186p203O060K298l873L268m74O87P265
$$ plain form
8768 84644 95599 97024 92532 88553 85957 85807 91304 87766 89849 98900 103696 104798 102752 94010 94346
8753 94346 103236 107143 96589 77290 74409 80533 84507 84466 84991 79951 79295 74914 79267 86713 88250
8738 88250 88491 77115 78340 85406 82827 73701 68988 76246 78157 75984 70647 80375 89333 90395 89238
8723 89238 95113 96259 102192 95155 92969 101312 102523 97093 98567 93408 83548 79804 87810 101211
8709 101211 109468 104136 101058 88618 88529 98981 111425 117865 114352 119472 117941 110498 105385 99882
8695 99882 104067 100212 106643 111577 115617 124431 121830 112303 110585 116993 123027 121262 116499 119699 130012
8680 130012 137532 139007 152872 149566 135688 130567 131625 140922 157396 170491 178220 185210 183408
8667 183408 170777 158520 156979 160924 158758 151572 144369 150429 152727 148854 152122 151648 152335 159600
8653A59600J2954N763J2188J0348o865O646J9738Q866k958r906j0234k351L847
8640B07636L290K710O141P284O982K578n393k769J3097J8333J35j753j979J7396
8626B73688L2403J8987l343j8076j1414m065O587K590l484l66N128J6751J7694
8613C33080L570M594K265N749J2561J5676J3138K0767J6814K0140K9511L0397
8601E08262Q159j8523k1669j1124r416j2927o502O207N446n193m978R754N686
8588D53182N963R095O753J1485j0897l2203k7385k3249k5372m1117m0909l7683
8576B47663m4100k8659j5909j8516k1104q067n065k533n007m13l912k89K684j0644
8562H6129j0224k082L857K577O454J042p048r920m291l749O96j008p255j0313
$$ plain form
8653 159600 172554 178317 190505 200853 193988 200634 220372 229238 226280 216374 206140 203789 207636
8640 207636 210926 213636 219777 227061 234043 236621 231228 228459 241556 259889 260024 258271 256292 273688
8626 273688 306091 325078 321735 303659 292245 288180 294767 297357 293873 293507 298635 315386 333080
8613 333080 336650 341244 343509 349258 361819 377495 390633 411400 428214 448354 477865 508262
8601 508262 516421 497898 476229 465105 455689 442762 436260 442467 447913 442720 437742 447496 453182
8588 453182 459145 468240 474993 486478 475581 443378 415993 392744 367372 326255 285346 247663
8576 247663 203563 174904 158995 140479 119375 111308 106243 103710 98703 98290 94378 94089 96773 86129
8562 86129 75905 73823 77680 80257 86711 87753 80705 70785 66494 62745 63441 62433 55178 44865
8548D4865q914n692n82q72O484J3002R30J599o907j840J230J358L28P785o51o161
8532D5962o330N378L369j719L4j17o156p461J146P422Q88m210k457L77J196J651
8516C8973n576l339J68k291K114J4050P160o624k702k236m128k345M817q61J327
8501C8507J0937L621n305j778p964J094J2895k060p884k105J312J629M951N214
8487E3064j042o411l080p744o223J919P601l856l137q958K228L086K918j686M91
8472B9170p152l058L10r50j16P296j896j4852j0528K865O204P359k295k453J3036
8457B2940j176N095M741M00m628q236k861K716k512j334L084L259Q774N307l581
8442C1988r251p177Q567N566o159j3965k097M715J470M806m610R756L45j088p543
$$ plain form
8548 44865 35951 30259 29677 28805 35289 48291 49221 50820 43913 42073 43303 44661 44989 52774 52123 45962
8532 45962 39632 45010 48379 46660 46694 46577 40421 32960 34106 41528 42416 38206 35749 36126 37322 38973
8516 38973 33397 30058 30226 27935 30049 44099 51259 44635 41933 39697 35569 33224 38041 37180 38507
8501 38507 49444 53065 47760 45982 38018 39112 52007 49947 42063 39958 41270 42899 47850 53064
8487 53064 52022 45611 42531 34787 28564 30483 38084 34228 31091 22133 24361 27447 30365 28679 29170
8472 29170 22018 18960 19270 18320 18204 25500 23604 8752 -1776 1089 7293 14652 12357 9904 22940
8457 22940 21764 26859 31600 32000 27372 19136 16275 18991 16479 15145 18229 21488 30262 35569 31988
8442 31988 22737 15560 24127 29693 23534 9569 7472 12187 13657 18463 13853 23609 23954 22866 15323
8427A5323p760J794n731l531R086J0715N491l387j603Q908O15L388p834j2288
8413A3186M10L11L398J7786O12o785q413o371l86L173p703k548p55k446L908l121
8397D256J699P22K54J588M570K757K5J944J4124K271p216l002n238r177k488N499
8381A2588L420J269l397r002J984O777J891n83K988J161j0977k220m294o282m5
8366d722K239L015K999m419k590L906J3070J1477P350n522r351j095L054K165
8352B1576p498o764n89q075K333j087K746N274N711N314L705L388J106l259m129
8337A9752p487k386l495Q084M374j034l143k533n102M232J572j126P021L097q907
8322A2919L719l427r228j1095L630J489M054l958k673J4393J1745P10n233k074
$$ plain form
8427 15323 7563 9357 3626 95 9181 19896 25387 22000 20397 29305 29920 33308 25474 13186
8413 13186 13596 13907 17305 35091 35703 28918 20505 14134 13748 16921 9218 6670 5915 3469 7377 4256
8397 4256 5955 6677 6931 8519 13089 15846 15871 17815 31939 34210 26994 23992 18754 9577 7089 12588
8381 12588 16008 17277 13880 4878 6862 13639 15530 14947 17935 19096 8119 5899 1605 -4677 -4722
8366 -4722 -2483 532 3531 -888 -3478 428 13498 24975 32325 26803 17452 16357 19411 21576
8352 21576 14078 7314 6725 -1350 983 -104 2642 7916 13627 18941 22646 26034 27140 23881 19752
8337 19752 12265 9879 6384 14468 18842 17808 14665 12132 7030 11262 12834 11708 18729 21826 12919
8322 12919 16638 13211 3983 -7112 -3482 -1993 2061 -1897 -4570 9823 21568 22278 17045 14971
8308A4971j711l782r189m575K099J78M474J899L878J912P952K028p776p649Q627
8293A3336n568r328K551K554J367L610o29j399J1N482N01K253n269L386J290j620
8277A2528j337n03L066l3K414j3859o76L597P199k795N909O917m876l795J868
8262A5624m16o543R495m628n330n568R49N222L602l288L714n501O90N104L059
8247A6185p111L102J2705l974O952O284j89r950j1351m179l494o53O197O237n13
8232A6248p169l279J400L299m679J158j400j223J395Q432L5j1481k645k043O451
8217D499q354j440L323N904n513l373L66N194j038l53r08P666J1263l076M68M843
8201A9471O121M2r850q312J990N319N511m951j3798j698J1151Q998L975J422j427
$$ plain form
8308 14971 13260 9478 289 -4286 -2187 -2009 2465 4364 8242 10154 18106 20134 12358 4709 13336
8293 13336 7768 -1560 991 3545 4912 8522 7893 6494 6505 11987 12488 14741 9472 12858 14148 12528
8277 12528 11191 10688 13754 13721 16135 2276 1600 5197 12396 9601 15510 22427 17551 13756 15624
8262 15624 15208 8665 18160 13532 8202 2634 3583 8805 12407 9119 12833 7332 8022 13126 16185
8247 16185 9074 12176 24881 20907 27859 34143 33954 24004 12653 8474 4980 4327 10524 16761 16248
8232 16248 9079 5800 7200 10499 5820 6978 5578 4355 5750 14182 14217 2736 91 -1952 4499
8217 4499 -3855 -5295 -1972 3932 -1581 -4954 -4588 606 -432 -785 -1693 5973 17236 14160 14628 19471
8201 19471 25592 25634 15784 7472 9462 14781 20292 15341 1543 -155 10996 19994 23969 25391 23964
8186B3964K092r940j7098K016N160M462j655l061m542j319J3741P160L73m691
8172A6662K442O869j1069q669K596L600k560l811J212P37J294N26o696o652N97
8157b922j265Q080J934j09k078o686o706L957M336R194O585L913n184l083P170
8142A7136L647J2176q390j8246n652N886n35L550J2492q017m055Q22n493j41L511
8127H691m813j165j611j736N923R475R46q004k421M140N248J6197O628j2264j2178
8112A3056J4l115j1244j227R576M142n36m787k363j532j610J007Q108L322l408
8097I403n40O979N280q683q386M299P347L169r31l147j854j418j929J325J22n697
8081E339J536J0031M374J292j0041q311q813p172P602M807R848L912m400l61M642
$$ plain form
8186 23964 26056 16116 -982 1034 6194 10656 9001 5940 1398 79 13820 20980 21353 16662
8172 16662 19104 25973 14904 6235 8831 12431 9871 6060 7272 8009 9303 9829 3133 -3519 -2922
8157 -2922 -4187 3893 5827 5718 3640 -3046 -9752 -5795 -1459 7735 14320 18233 13049 9966 17136
8142 17136 20783 32959 24569 6323 671 6557 6022 9572 22064 14047 9992 10814 5321 5180 8691
8127 8691 3878 2713 1102 -634 5289 14764 15710 7706 5285 9425 14673 30870 37498 25234 13056
8112 13056 13070 9955 -1289 -2516 7060 11202 10666 5879 3516 1984 374 1381 9489 12811 9403
8097 9403 8863 15842 21122 12439 4053 8352 15699 18868 17937 14790 12936 11518 9589 10914 11036 5339
8081 5339 6875 16906 21280 22572 12531 4220 -4593 -11765 -4163 644 10492 14404 10004 9643 14285
8066A4285P505p579l851o54l887j553Q753k013j270j211l612J111k611m943n354
8051f884O686K415p84O293P038j487J1166J834j0299k363Q204O778l675m28L545
8036B8039R255L542m819K867J0435k722o982K21L111j0594j0534O379L188q154
8022B3232O843R552P765j893K002K856o881n981q329p064J079J4757P457O39q88
8007D5146J886K014N04m624m792l299J2608N584p554j885P187M044Q448J0984
7993G6251J1655J9777J3097j716j1804j6499j7710j0215o410r23j1362n79k259
7980D1303o600l645n60k956m683P108O375N652m540m897l516L577J760o291m676
7965B3411n353M845Q457m840o51J0487J2947L585J525P72p06l999J440K844j353
$$ plain form
8066 14285 21790 14211 10360 9706 5819 4266 13019 11006 9736 8525 4913 6024 3413 -1530 -6884
8051 -6884 -198 2217 1433 7726 14764 13277 24443 26277 15978 13615 21819 28597 24922 24494 28039
8036 28039 37294 40836 36017 38884 49319 46597 39615 39836 42947 32353 21819 28198 31386 23232
8022 23232 30075 39627 47392 45499 47501 50357 43476 37495 29166 22102 23181 37938 45395 46034 45146
8007 45146 47032 49046 49550 44926 40134 36835 49443 55027 47473 45588 52775 56819 65267 76251
7993 76251 87906 107683 120780 119064 107260 90761 73051 62836 56426 55503 44141 43562 41303
7980 41303 34703 31058 30498 27542 22859 29967 36342 41994 37454 32557 29041 32618 34378 28087 23411
7965 23411 18058 22903 31360 26520 25869 36356 49303 52888 54413 55185 54479 50480 51920 54764 53411
7950E3411L792k905K392J2940m933j0330K881J112j6815m583m440l317m012M76
7936B5669L402o626n950l344j017M918M198Q201O182n269j1268k069K691q05k678
7921A6235J360Q544L804J783P90O490l690n844o439L097M81q044k198P212Q493
7906C2074J6500j318r875J966O087j248l499o692J353n778m585k972K860L205
7892B8078n645k018l038n969R563Q81l879J945k155j209J163O965o847j4387j259
7877B189K877J1955J1393O307j5316j1764K175l369j1209l245Q747Q632R48J689
7863A2009M232m626J745M829n545P108R75n878l929k401q772q738P629O430P692
7848A2760K725L76n150j1913m258Q592L155n601l693L224l006p59J2104Q57m854
$$ plain form
7950 53411 57203 54298 56690 69630 64697 54367 57248 58360 41545 36962 32522 29205 25193 25669
7936 25669 29071 22445 16495 13151 12134 17052 21250 29451 35633 30364 19096 17027 19718 18913 16235
7921 16235 17595 26139 29943 31726 32516 39006 35316 29472 23033 26130 26611 18567 16369 23581 32074
7906 32074 48574 47256 37381 39347 45434 44186 40687 33995 35348 29570 24985 22013 24873 28078
7892 28078 22433 20415 17377 11408 20971 21852 17973 19918 17763 16554 17717 24682 17835 3448 2189
7877 2189 5066 17021 28414 34721 19405 7641 9816 6447 -4762 -8007 740 9372 10320 12009
7863 12009 16241 11615 13360 18189 12644 19752 20727 14849 10920 8519 -253 -8991 -1362 5068 12760
7848 12760 15485 15861 10711 -1202 -5460 3132 6287 686 -3007 217 -2789 -3548 8556 9413 4559
7833D559k352L075Q464L113Q31K658K415m243n476l600r799p703R317P669j532
7818G396J860l318o670N309N941M417m967p784m535J56k533R76j480J700R994
7803F462L159j62n422J405L155M067l418j3037J817k718o703N073J794N404n106
7788d230m531K250K071J907k56n066K333N534j452m164R313M806R323m247o113
7773G478K788L030o306m709N589o126j307k327q111K71L175O282N934J921p218
7758C64m76k292J565k147l11l590j412M494N166M674L999K120j476m227j2089
7743e638o534J747J3234L32J565m073m681M173m950J1493J4434M209n628o301
7729A3382j2935k945L575R493j536K92o10K756J961l482J844j1938L095J0739
$$ plain form
7833 4559 2207 5282 13746 16859 17690 20348 22763 18520 13044 9444 -355 -8058 1259 8928 7396
7818 7396 9256 5938 -732 4577 10518 14935 9968 2184 -2351 -2195 -4728 -3752 -5232 -3532 6462
7803 6462 9621 9459 4037 5442 8597 12664 9246 -3791 -1974 -4692 -11395 -6322 -4528 876 -4230
7788 -4230 -8761 -6511 -4440 -2533 -2789 -7855 -5522 12 -1440 -5604 3709 8515 17838 13591 7478
7773 7478 10266 13296 6990 2281 7870 1744 437 -1890 -10001 -9730 -6555 -273 5661 7582 364
7758 364 -112 -2404 -839 -2986 -3297 -6887 -8299 -3805 1361 6035 10034 12154 10678 6451 -5638
7743 -5638 -12172 -10425 2809 3141 4706 633 -4048 125 -4825 6668 21102 25311 19683 13382
7729 13382 447 -2498 1077 10570 9034 9326 8716 11472 13433 9951 11795 -143 2952 13691
7715A3691Q36k883j135r00M005j029o130O79n933j029K608n570k545n419J1744
7700I90R479K457n47J120n817r0m565m265L305J6164L434j593q262p018J010K727
7684H529J023m856q385O069m97m694k770O972Q887L900j6357j3446J390J0666
7670c569P958M269n947L569p482o070N851N224O755J577l147o611QP879O889k667
7654A4486j2037l28M215J0712j892j3949n288L209M702j418j0667r079L9K396
7640a4899l252m140k710R982J4053n303J673j89m307o953m380J3401J2478m937
7626E17n203N885L483l113r58J0059K113K342o299q636l870q865q56Q191O170
7611I60k838K702P428M821r01p292j131M446O115n35l72M163l847q045j2113m371
$$ plain form
7715 13691 14527 11644 10509 9609 13614 12585 6455 7134 1201 172 2780 -2790 -5335 -10754 990
7700 990 10469 12926 12379 13499 7682 7592 3027 -1238 2067 18231 21665 20072 11810 4792 5802 8529
7684 8529 9552 4696 -3689 2380 1883 -2811 -5581 1391 10278 14178 -2179 -15625 -14235 -3569
7670 -3569 4389 8658 2711 6280 -1202 -7272 -1421 3803 10558 12135 8988 2377 2385 10264 17153 14486
7654 14486 2449 2121 6336 17048 15156 1207 -4081 -872 3830 2412 -8255 -17334 -17295 -14899
7640 -14899 -18151 -22291 -25001 -15019 -966 -6269 -4596 -4785 -9092 -16045 -20425 -7024 5454 517
7626 517 -4686 1199 4682 1569 611 10670 12783 15125 8826 190 -3680 -12545 -13401 -5210 960
7611 960 -1878 824 8252 13073 12172 4880 3749 8195 14310 13775 13403 17566 13719 5674 -6439 -10810
7595a0810K286O408P958j071p617l260K232k229K034K448m326K506O172M284r79
7580F036M416K174J314L03r170l061n65L808k484j1624p22M837K591L412n89n119
7564d443j1714n415o20L557P846J6113Q326L096r409n561p438m263Q470L921J260
7549C726n349r172M946Q078J0940J0723R38o656q100q231J368N387j950L014j2286
7534b624k026K997N85M257k629L65m987p340k07J1038J293j134j2l222n909l162
7518a2717K022J0338M757l232L122K766j0985m973R92J061O549N052l469k382
7504a099J782L545l627j1800M071N83N982r442o003M693J468m037m601o533M990
7489b0028O870J7005J1359p583m422R93p070l942Q108R02j849q533R006M905j373
$$ plain form
7595 -10810 -8524 -2116 5842 4771 -2846 -6106 -3874 -6103 -4069 -1621 -5947 -3441 2731 7015 6036
7580 6036 10452 12626 13940 14243 5073 2012 1447 5255 2771 -8853 -9575 -4738 -2147 1265 676 -4443
7564 -4443 -16157 -21572 -22192 -18635 -10789 5324 13650 16746 7337 1776 -5662 -9925 -1455 2466 3726
7549 3726 -1623 -10795 -5849 2229 13169 23892 24830 18174 10074 1843 3211 8598 6648 9662 -2624
7534 -2624 -4650 -1653 -1068 3189 560 925 -4062 -11402 -11609 -571 722 -412 -424 -3646 -9555 -12717
7518 -12717 -10695 -357 4400 1168 4290 7056 -3929 -8902 -7910 -6849 -300 4752 1283 -1099
7504 -1099 683 4228 601 -11199 -7128 -6545 -563 -10005 -16008 -11315 -9847 -13884 -18485 -25018 -20028
7489 -20028 -13158 3847 15206 7623 3201 4194 -2876 -6818 1290 2192 343 -8190 816 5721 4348
7474D348m02m53j473r695R59J0359o19m698L387M766n732O853j441p559J628P467
7458G695l763q243l392P099O196o19O213J530j5566o851O922J3798j671j0301
7444i53J913j266k996o56k621J069m953M213R6j0376N486J2308J768P426k584
7429G874k118j0159m517Q970k410m059J640m566R192J1166N873o918l896q463
7415b391m069P08J1328J739O581j336n271p379j116L64p7L033P020O244J077m094
7399A2361l181k105Q32K000l638p677R55J787m941J634P407J16j1966K581K927
7384i08k172n039P453O824R72n109l856k84J740k030o345p800K640P130J1148
7369D364K420o946j247k208M290l858o254o54J1680O765j364n072p9L782k10p886
$$ plain form
7474 4348 3946 3493 2020 -7675 -6716 3643 3024 -1674 1713 6479 747 7600 6159 -1400 228 7695
7458 7695 3932 -4311 -7703 -604 5592 4973 11186 12716 -2850 -9701 -2779 11019 9348 -953
7444 -953 960 -306 -3302 -3958 -6579 -5510 -10463 -6250 -6154 -16530 -11044 1264 3032 10458 7874
7429 7874 5756 -4403 -8920 50 -2360 -6419 -4779 -9345 -153 11013 16886 9968 6072 -2391
7415 -2391 -6460 -5752 5576 7315 13896 12560 7289 -90 -1206 -842 -919 2114 9134 15378 16455 12361
7399 12361 9180 7075 7907 9907 6269 -1408 -453 1334 -3607 -1973 5434 5550 -6416 -3835 -908
7384 -908 -3080 -8119 -666 6158 7130 2021 -1835 -2119 -379 -2409 -8754 -16554 -13914 -6784 4364
7369 4364 6784 -162 -1409 -3617 673 -3185 -9439 -10093 1587 8352 6988 1916 1837 5619 5409 -2477
7353b477k93q67L610K192o122q446J214j639R864J755M537j540k7j436l062N586
7337B849k243L349l07p913L086L344K66n556N055J034J346k324K34M806R904j846
7321A5084n02N504j0214q744P65m048p87r34L156n91j808k032J420j370m820l887
7305a3808l490M643m940J03J391K997O593Q502J888j5176l103J96N443P729l65
7290a397n225k209p96R401n6r362m07J3216J633r077k671n438l406j367Q003P801
7274a357M857N389R79q141m798Q65K882m151o770J296M27L302N324K497j571n235
7258d205j805n751O564L765L433N833K991k686J527k400j1477j487m55L812m086
7243f427l877K488j0296J816J3888P278K481J678l367l743q314J885n657p785
$$ plain form
7353 -2477 -2770 -3637 -27 2165 -3957 -12403 -11189 -12828 -2964 -1209 3328 1788 1761 325 -2737 2849
7337 2849 606 3955 3648 -4265 -1179 2165 2431 -3125 1930 2964 4310 1986 2220 7026 16930 15084
7321 15084 14582 20086 9872 1128 1893 -2155 -2942 -3876 -720 -1311 -3119 -5151 -3731 -5101 -9921 -13808
7305 -13808 -17298 -12655 -17595 -17492 -16101 -13104 -6511 1991 3879 -11297 -14400 -14204 -8761 -1032 -1397
7290 -1397 -6622 -8831 -9627 -226 -282 -9644 -10051 3165 4798 -4279 -6950 -12388 -15794 -17161 -9158 -1357
7274 -1357 3500 8889 9868 1727 -3071 -2206 676 -3475 -10245 -8949 -8522 -5220 104 2601 1030 -4205
7258 -4205 -6010 -11761 -5197 -1432 2001 7834 10825 8139 9666 7266 -4211 -5698 -6153 -2341 -6427
7243 -6427 -10304 -7816 -18112 -16296 -2408 4870 7351 9029 5662 1919 -6395 -4510 -10167 -17952
7229a7952J0204J3210L995k829m540J1736Q367q930j277J459q378K289j444j0502
7215d592n65J2002O661j3222k272Q316m570K269m86j006j474j074k978k142K698
7200b435m147o774k210p823Q304O790K459J533Q779R304o426o859J020l029J673
7185A59K580N183N315l882L719m66n655J283j640l389j472J1228M703n937J324
7170A3053n64r042K37K809m956o138j602r22J885J0538J6888j648k2814j3399
7156a5675P032k429M30J3575r069m325R71R195P723O901o298j848m482l960m623
7141f882O40R99K044m788q656m981K486L429J828O801O006J37j0394n014J1114
7126e231j996J359J9039M70k0486n571K895O23Q85K898J614j461O480M665o568
$$ plain form
7229 -17952 -7748 5462 9457 6628 2088 13824 22191 13261 11984 13443 5065 7354 5910 -4592
7215 -4592 -5157 6845 13506 284 -1988 6328 1758 4027 3541 2535 1061 -13 -2991 -5133 -2435
7200 -2435 -6582 -13356 -15566 -23389 -15085 -8295 -5836 -4303 4476 13780 7354 495 1515 -1514 159
7185 159 2739 7922 13237 9355 13074 12608 6953 8236 6596 3207 1735 12963 17666 11729 13053
7170 13053 12489 3447 3684 6493 1537 -4601 -6203 -7125 -5240 5298 22186 20538 -2276 -15675
7156 -15675 -8643 -11072 -10642 2933 -6136 -10461 -9490 -295 7428 14329 8031 6183 1701 -2259 -6882
7141 -6882 -6242 -5243 -3199 -7987 -16643 -21624 -19138 -15709 -13881 -7080 -1074 -937 -11331 -16345 -5231
7126 -5231 -7227 -5868 13171 13641 -6845 -12416 -9521 -8898 -8013 -5115 -3501 -4962 1518 6183 -385
7111c85q130j093K812m37m454j2189o800k413R642R815n92q567O802J3269K785
7096F5J688O91k909n347N833J3465j3735p116M496N249l137r89K362j640j038
7081b062m944K652R759l95j1239j826N91R428Q765o66J938m797r812r258o157
7066a8023k093R246M015K927p921q459N300J0488M087l529o14j887j2364j622
7052b0449Q294P224P55m581P19N531m163j165K001j0938l322O414O935J1924P849
7037A3028j813J600r476j2704j1101K470P655R59J478R01P275J610L545n349o415
7022f337K942Q56j0616j3170o36L757R721R281J430N652L8N098o748j0652j53
7007i537J4132K927n9p717j6065l798Q006k956K025O578J680Q508o014m045l183
$$ plain form
7111 -385 -8515 -9608 -6796 -7233 -11687 -23876 -30676 -33089 -23447 -13632 -14224 -22791 -15989 -2720 65
7096 65 1753 2444 -465 -5812 21 13486 -249 -7365 -2869 2380 -757 -1746 616 -1024 -2062
7081 -2062 -7006 -4354 5405 5010 -6229 -8055 -7464 1964 10729 10063 12001 7204 -2608 -11866 -18023
7066 -18023 -20116 -10870 -6855 -3928 -11849 -20308 -15008 -4520 -433 -3962 -4576 -6463 -18827 -20449
7052 -20449 -12155 -4931 -4176 -8757 -8038 -2507 -6670 -7835 -5834 -16772 -20094 -13680 -6745 5179 13028
7037 13028 11215 12815 3339 -9365 -20466 -17996 -10341 -9382 -7904 -7003 272 1882 5427 78 -6337
7022 -6337 -3395 -2539 -13155 -26325 -26961 -23204 -13483 -4202 -2772 2880 2918 8016 1268 -9384 -9537
7007 -9537 4595 7522 7463 -254 -16319 -20117 -12111 -15067 -13042 -6464 -4784 3724 -2290 -6335 -9518
6992i518P232K63m335j062l71r220n121j622N917L961N661Q489l671n067O570
6977a894M214Q04k401M826M190l803n963K618j196K873O146K969L940n738r671
6962A914q064m980n057K99J1651J668j06o625o8P197j35N29j021m225k447J1790
6946B320Q247p638o937J629M426M111l591q161m361J35M718R620Q774K199K484
6931A7975l801p97j459r025j0377K388M586N230L674k794N064o673K141N226o196
6916E162r55j858M776M930R081m777j3337o830m63k047K550j533O311K636p256
6901c610n28k031L133l614r980L47K73K606K298N207J4994p877n886j1004k987
6886a8659L865Q066J1166q561N587K487J712N61Q43r89K366j660k887m140J587
$$ plain form
6992 -9518 -2286 -2023 -6358 -7420 -7791 -17011 -22132 -23754 -17837 -13876 -8215 274 -3397 -8464 -1894
6977 -1894 2320 3124 723 5549 9739 5936 -27 2591 1395 4268 10414 13383 17323 11585 1914
6962 1914 -6150 -11130 -16187 -15888 -4237 -2569 -2675 -9300 -9368 -2171 -2306 -1777 -2798 -7023 -9470 2320
6946 2320 10567 2929 -4008 -2379 2047 6158 2567 -5594 -9955 -9820 -5102 4518 13292 15491 17975
6931 17975 14174 13377 11918 2893 -7484 -5096 -510 4720 8394 5600 10664 3991 6132 11358 5162
6916 5162 4207 2349 7125 12055 21136 16359 3022 -3808 -4271 -6318 -3768 -5301 1010 3646 -3610
6901 -3610 -4138 -6169 -3036 -6650 -16630 -16283 -16010 -13404 -11106 -5899 9095 1218 -4668 -15672 -18659
6886 -18659 -14794 -6728 4438 -4123 1464 3951 5663 6224 7067 6078 8444 6784 3897 -243 1344
6871A344M618k698l46J97q34l965o2L790j4989J080J2083l668m796p319P702L632
6855d231o079N354P235M407K924J953j483J310k140m099n461m922L163L646P84
6840B361p439o556Q304N951j180j69O336m642m741o516o002K589Q43n220m395
6825b0476J1484j080l533K555j6o611L950l080o140P724Q319q76L038O616m493
6810b619l204M726oo521n675R308J0000o135l562N75k674l039r357n93M413j231
6794a5594M332M165M089n289K060Q386N562K711m960j2236k60J0346N376K267
6780A0955p338n444j1300N339Q148m750p5M873n785J044Q470L333q411k567j781
6765e289N980L395k232k565n376l370n885r159N963J137p301m132M036O030P237
$$ plain form
6871 1344 5962 3264 2918 3115 2281 -1684 -1746 2044 -12945 -11865 218 -3450 -8246 -15565 -7863 -4231
6855 -4231 -10310 -4956 2279 6686 9610 11563 10080 11390 9250 5151 -310 -5232 -2069 1577 2361
6840 2361 -5078 -11634 -3330 2621 1441 1272 7608 2966 -1775 -8291 -14293 -11704 -10861 -16081 -20476
6825 -20476 -8992 -10072 -13605 -11050 -11066 -17677 -13727 -16807 -22947 -15223 -6904 -7780 -4742 1874 -2619
6810 -2619 -5823 -1097 -1103 -7624 -13299 -3991 6009 -126 -3688 -3113 -5787 -8826 -18183 -18776 -14363 -15594
6794 -15594 -11262 -7097 -3008 -8297 -6237 2149 7711 10422 5462 -6774 -7034 3312 8688 10955
6780 10955 3617 -1827 -13127 -7788 360 -4390 -4465 408 -5377 -4333 4137 7470 -941 -3508 -5289
6765 -5289 691 4086 1854 -711 -6087 -9457 -15342 -24501 -18538 -17401 -24702 -28834 -24798 -18768 -11531
6750a1531P670m56o856N494J280m94P216O861j858L502N765k555m40l363j2032
6735a797j197R048n070j3853j0185N121O957J298Q956R535l646m223r977p83P630
6720b186k969J1418m08L151K125J246J720n787k809J1542n575j4797r22l041l047
6705a0339J0399k488J989O97j967n395J786j979L83M218n140R84J395J1881K510
6690H934k949k047o012p07L329n189j002M882O769j604n050q576k297M123N811
6675a585J433r286r221k41J2991N239L490K479J099n140l905M1l828n443N718
6660f159l569J3638J95o872l086P682Q387j361n565m862L796J1235o691q913j5836
6645a7981k86M80J8665J0598M961p2j2068k656j0126j0578K025N550j382M745
$$ plain form
6750 -11531 -3861 -4317 -11173 -5679 -4399 -4893 2323 9184 7326 10828 16593 14038 13598 10235 -1797
6735 -1797 -2994 6054 984 -12869 -23054 -17933 -10976 -9678 -722 8813 5167 944 -9033 -9816 -2186
6720 -2186 -5155 6263 5855 9006 11131 12377 14097 8310 5501 17043 11468 -3329 -4251 -7292 -10339
6705 -10339 60 -2428 -439 258 -1709 -7104 -5318 -7297 -6914 -2696 -7836 -6852 -5457 6424 8934
6690 8934 5985 3938 -2074 -2781 548 -4641 -5643 -761 6008 4404 -646 -9222 -11519 -7396 -1585
6675 -1585 -152 -9438 -18659 -18900 -5909 -670 2820 5299 6398 1258 -2647 -2606 -6434 -11877 -6159
6660 -6159 -9728 3910 4105 -2767 -5853 1829 10216 8855 3290 -1572 2224 13459 6768 -2145 -17981
6645 -17981 -18267 -17787 878 11476 16437 16365 4297 1641 -8485 -19063 -17038 -11488 -12870 -8125
6631h125k203Q66L64O666k865j444M063r0M261m176L568K410J4N636M006n119
6615G832j706J709J433P051p758j29k907k04q14n984o221J329k809l54R614K23
6599C05o01o600q014N008j177O303l203Q40K995j7m597k232J098K789Q36J540
6583d727k603j378J0773K699l471K648K145j781n095j1045r695N545M921O135
6569d929Q672L677J231m667n78n001k901n662Q238R60j493L892P663q435k580
6554a913Q625J861l735q745n895J507J4660m802K939j0460r810j9J2254L168N179
6539D814j18o752j290k163K629N160l820j197l61O853R112n366j3611r846k656
6524a8612K275P702k18O481O936P71N616k97k191q706M156J190M242j875k65p098
$$ plain form
6631 -8125 -10328 -9462 -9098 -2432 -5297 -6741 -2678 -2768 1493 -2683 885 3295 3309 8945 12951 7832
6615 7832 6126 7835 9268 16319 8561 8432 5525 5321 4507 -1477 -7698 -6369 -9178 -9532 82 305
6599 305 -296 -6896 -14910 -9902 -11079 -4776 -7979 -7139 -4144 -4161 -8758 -10990 -9892 -7103 -6267 -4727
6583 -4727 -7330 -8708 2065 4764 1293 3941 6086 4305 -790 -11835 -21530 -15985 -11064 -4929
6569 -4929 3743 7420 8651 3984 3406 -1595 -4496 -10158 -1920 -960 -2453 1439 9102 667 -1913
6554 -1913 6712 8573 4838 -3907 -9802 -8295 6365 1563 4502 -5958 -15768 -15787 -3533 -365 4814
6539 4814 4696 -2056 -3346 -5509 -2880 2280 -1540 -2737 -3098 3755 12867 7501 -6110 -15956 -18612
6524 -18612 -16337 -8635 -8853 -2372 4564 5335 10951 10654 8463 -243 3913 5103 9345 7470 7205 107
6508A07r337K156l839k427l52q74L802O814Q610L81o378m927m995j03J3828J1088
6492A3554l224j915l413r113N052O988k358K370J197O689j389m954o959r699q165
6477a5339L310K717N814L375O59P051K19r21M034l631m53o595K958K597j1136
6462e341q287J0922O945J686J594L468j512J190o804L6k885j666K661M54K589
6447E050m451P662J7365J01p342j1594j925Q014M437J082j4069o062N038K544
6433E850q632n076n695J62M83M222Q843M067q480r03N0j076j067K828N182q266
6417g508q622L690L622Q510Q069o655q589L777j117j270O577J0031m645r264J107
6402b287j0503L297Q376r187m170m972M520m517P038J231l871R150J2645M467
$$ plain form
6508 107 -9230 -7074 -10913 -13340 -13692 -14566 -10764 -3950 4660 5041 -1337 -6264 -11259 -11362 2466 13554
6492 13554 10330 8415 5002 -4111 941 7929 5571 7941 9138 15827 14438 9484 2525 -7174 -15339
6477 -15339 -12029 -9312 -3498 -123 536 7587 7806 6885 10919 7288 6835 240 3198 5795 -5341
6462 -5341 -13628 -2706 4239 5925 7519 10987 9475 10665 3861 3897 1012 -654 2007 2461 5050
6447 5050 599 8261 25626 25727 18385 6791 4866 12880 17317 18399 4330 -1732 3306 5850
6433 5850 -2782 -7858 -13553 -13391 -12908 -8686 157 4224 -4256 -5159 -5109 -6185 -7252 -4424 758 -7508
6417 -7508 -16130 -12440 -8818 -308 7761 1106 -7483 -3706 -4823 -6093 484 10515 5870 -3394 -2287
6402 -2287 -12790 -9493 -1117 -10304 -14474 -19446 -14926 -19443 -12405 -11174 -15045 -5895 6750 11217
6388A1217j4594k983N600n670k087P903K771K688m812l244M492P05o121m653n529
6373a4317O49N158Q97K897j0673k143J3958M345R617Q699k130J549p005k376l253
6358E872O99J0443j3680q998k1P177L757l952j148K689n7m271p459l784M64o712
6342a8981J3061L781j09j107m151M572L224m487M887R733l616l919k236k897n951
6327h196L890M240j107j651j0550o627N465N901M174J268l339M360J703l330J94
6312c605N205L533q351n3O755Q704o914q456k85M834o59j386L974J0009o184j871
6296E250m602O87M697M597m625o710L18k797o160P22j585Q85k653L151N761j474
6280d538k084p796K376L889K657m980K104r33M870M186l766m69J125L775K488
$$ plain form
6388 11217 -3377 -6360 -760 -6430 -8517 -614 2157 4845 33 -3211 1281 1986 -4135 -8788 -14317
6373 -14317 -13668 -8510 -7613 -4716 -15389 -17532 -3574 771 10388 19087 16957 18506 11501 9125 5872
6358 5872 6571 17014 3334 -5664 -5685 1492 5249 1297 149 2838 2781 -1490 -8949 -12733 -12269 -18981
6342 -18981 -5920 -2139 -2248 -3355 -7506 -2934 290 -4197 690 10423 6807 2888 652 -2245 -8196
6327 -8196 -4306 -66 -1173 -2824 -13374 -20001 -14536 -8635 -4461 -3193 -6532 -2172 -469 -3799 -3605
6312 -3605 1600 5133 -3218 -3271 3484 12188 5274 -3182 -3467 1367 708 -678 3296 13305 7121 5250
6296 5250 648 1335 6032 10629 6004 -706 -388 -3185 -9345 -8623 -10208 -9323 -11976 -8825 -3064 -4538
6280 -4538 -6622 -14418 -12042 -8153 -5496 -10476 -8372 -9305 -4435 -249 -4015 -4484 -3359 416 2904
6265B904M194J028o751l708l350M691l06N076J422o299M035n218j819j827O673
6250G45m768o808K198J632o275L202k164m04M087j354r729L83O157J253j901j640
6234a5386P177O729R758M432Q92o68k552k439m284o462O79L869L833J3004J519
6219B0101j7006j189r779n222J3120N956o03r073m084K068J41n108j785n31N592
6204g402j240K365M955o009M025Q379R02n407q128M39K581m703O700l393M414
6189a522L771q92j33O42k122L393k437l155L726L290l899l987K711P034P484N667
6173A9571q137m619j05n108r991K416L05J384K533L989l104l749M831P717p978
6158d5r339n317j78M31M903R578M965M032J344p577l739q976l031K370j949L195
$$ plain form
6265 2904 7098 8126 1375 -2333 -5683 -992 -1298 3778 5200 -1099 2936 -2282 -4101 -5928 745
6250 745 -4023 -10831 -8633 -7001 -13276 -10074 -12238 -12642 -8555 -9909 -19638 -19255 -13098 -11845 -13746 -15386
6234 -15386 -8209 -1480 8278 12710 13602 12934 10382 7943 3659 -2803 -2124 1745 5578 18582 20101
6219 20101 3095 1906 -7873 -13095 25 5981 5378 -3695 -7779 -5711 -5570 -10678 -12463 -12994 -7402
6204 -7402 -8642 -6277 -1322 -7331 -3306 5073 5975 568 -7560 -7121 -4540 -9243 -2543 -5936 -1522
6189 -1522 2249 1357 1224 1866 -256 3137 700 -2455 1271 4561 662 -3325 -614 6420 13904 19571
6173 19571 11434 6815 6710 1602 -8389 -5973 -5668 -4284 -1751 2238 -866 -4615 216 7933 -45
6158 -45 -9384 -14701 -14879 -14448 -9545 33 4998 9030 10374 2797 -942 -9918 -12949 -10579 -12528 -9333
6142i333L376j592m987M452N057k241j1197m139N112L949J758R574L382j685K084
6127C570L313o351j0628n116L748L387P14j653Q618O220j244j223j146n654l385
6112f830J443m48K059l308J953m213Q60P867J0923o33p836j1274M600L612j511
6097b736M626K561k561o626N558M618l397o15J1303L018j8065m114L671Q51r55
6082b863J099P933Q59J382k770n139n366n028m070m029J380L547J2666k154o424
6067h977M244p023k002J7925j183r57k950J1946j181j1500j1512O592O130o187
6053f635J336K401j061K323p888m453P61J903j806q994J375L507O022M905O545
6038B41P237j323o930K915M051J221L319K762j768l446m175l042p282l766J2397
$$ plain form
6142 -9333 -5957 -7549 -12536 -8084 -3027 -5268 -16465 -20604 -15492 -11543 -9785 -211 3171 1486 3570
6127 3570 6883 532 -10096 -15212 -11464 -8077 -7363 -9016 -398 5822 4578 3355 2209 -3445 -6830
6112 -6830 -5387 -5835 -3776 -7084 -5131 -9344 -8484 -617 10306 9673 1837 -9437 -4837 -1225 -2736
6097 -2736 1890 4451 1890 -4736 822 5440 2043 1428 12731 15749 -2316 -6430 -2759 -1908 -2863
6082 -2863 -1764 6169 7028 8410 5640 501 -4865 -9893 -13963 -17992 -16612 -13065 -399 -2553 -8977
6067 -8977 -4733 -11756 -13758 4167 2984 2027 -923 11023 9842 -1658 -13170 -6578 -448 -6635
6053 -6635 -5299 -2898 -3959 -1636 -9524 -13977 -13216 -11313 -13119 -22113 -20738 -17231 -11209 -6304 241
6038 241 7478 6155 -775 2140 6191 7412 10731 13493 11725 8279 4104 1062 -6220 -9986 2411
6023B411L611J064l963J828k102n405l078p24J1779K85p950K091j776m090L554
6008b465K246N215j4k131L413k472j283k530P10l893K684K535j888P802q51n332
5992A746N445M150k40J810l439j1315k648J01M987M369l536K562n460q236o95
5977a0399R650L0k034L177J475k556j987l15J816K790j143j674K151p982q40l34
5961h175k081N61O519O136L295K682r200J629o392p64n496M99J061k83K92P75
5945h942K223L235nj728J576j1355M319P815k032p545L381l586j210l223L920
5930a3157M503J646j901j2054M05J1778j395M436P847n322q207j440p968K513
5916a8316L543N417N15K987J706O144k483j263m208L286J1384Q317n461k948J479
$$ plain form
6023 2411 6022 7086 3123 4951 2849 -2556 -5634 -6358 5421 5706 -2244 -153 -1929 -6019 -2465
6008 -2465 -219 4996 4982 2851 6264 3792 2509 -21 689 -3204 -520 2015 127 7929 7078 1746
5992 1746 7191 11341 11101 12911 9472 -1843 -4491 -4390 597 4966 1430 3992 -1468 -9704 -10399
5977 -10399 -749 -719 -2753 424 1899 -657 -2644 -2959 -1143 1647 504 -1170 981 -7001 -7841 -8175
5961 -8175 -10256 -9695 -3176 2960 6255 8937 -263 1366 -5026 -5790 -11286 -10787 -9726 -10009 -9717 -8942
5945 -8942 -6719 -3484 -3489 -5217 -3641 -14996 -10677 -2862 -4894 -12439 -9058 -12644 -13854 -17077 -13157
5930 -13157 -8654 -7008 -8909 -20963 -20558 -8780 -10175 -5739 2108 -3214 -11421 -12861 -20829 -18316
5916 -18316 -14773 -9356 -8841 -5854 -4148 1996 -487 -1750 -5958 -2672 8712 17029 11568 8620 10099
5901A0099q281j5838m330o37M521Q015N112N779M1l719o782r297o756J5610J1054
5886D591M520q525j1192P33K495P958l135j002l517M196K296o038o484o530P2
5871a9562L695m022J8721k842o504J0144k629M326O637J592Q704L3p079o236o993
5856b015L932Q96L007r538k123p306M299J4243N433k903L50p15l392l798l860
5841c490k775n205l861p869K399K518K994O746J0822k783j663L21n908q74R25
5826g703l549n681k239O278M832m524O83N446M300j832q91m945l402Q125O499
5811A397m587k240M144N164M79N980O024L853m041q695L287m917k836m603j37
5796a728R133k992j0796j0513N041P733R14p904j639j828m096K287J838R203P42
$$ plain form
5901 10099 1818 -14020 -18350 -18987 -14466 -6451 -1339 4440 4481 762 -6020 -15317 -22073 -6463 4591
5886 4591 9111 586 -10606 -9873 -7378 580 -2555 -3557 -7074 -2878 -582 -6620 -13104 -19634 -19562
5871 -19562 -15867 -19889 -1168 -4010 -10514 -370 -2999 1327 7964 9556 18260 18293 11214 4978 -2015
5856 -2015 1917 2813 5820 -3718 -5841 -13147 -8848 5395 10828 7925 8275 7560 4168 370 -3490
5841 -3490 -6265 -11470 -15331 -23200 -20801 -18283 -15289 -8543 2279 -504 -2167 -1846 -7754 -8628 -7703
5826 -7703 -11252 -16933 -19172 -12894 -8062 -12586 -11903 -6457 -2157 -3989 -4880 -9825 -13227 -5102 1397
5811 1397 -3190 -5430 -1286 3878 4357 10337 16361 20214 16173 7478 10765 5848 3012 -1591 -1728
5796 -1728 7405 4413 -6383 -16896 -11855 -4122 -3208 -11112 -12751 -14579 -18675 -16388 -14550 -5347 -4605
5781d605K256J72J0077P168k524O22j7263n314m24l287P335O179M212n083k699
5766c178O45K676j168L221j098k180N98k756m096K502k341J412K943N686N223
5751H089k881j9220l142J2429Q22j870k38K276j536r132j17M642O313l212m414
5736a1191j624O402O869K884m170K697j063m483p17K293L508m064q28O621J2211
5721A5345J859o304q965l529J643r69J41j954K901M652K582r877m578N098M822
5706B867K378L074j796l350l798L070N73R183J583n09J141L354r66n483o096J969
5690G194l681p188M309K602p094m344L743r300m027M875J6723n334j3969M106
5676a1385J3214K130Q25r870q064m631O445P403J2409M593k816o633n907j993
$$ plain form
5781 -4605 -2349 -2177 7900 15068 12544 13166 -4097 -9411 -9835 -13122 -5787 392 4604 -479 -3178
5766 -3178 -2533 143 -1025 2196 1098 -1082 -484 -3240 -7336 -4834 -7175 -5763 -2820 2866 8089
5751 8089 5208 -14012 -17154 -4725 -3903 -5773 -6011 -3735 -5271 -14403 -14520 -9878 -3565 -6777 -11191
5736 -11191 -12815 -6413 456 3340 -830 1867 804 -3679 -4396 -2103 1405 -2659 -3487 3134 15345
5721 15345 17204 10900 1935 -1594 49 -920 -779 -2733 168 4820 7402 -2475 -7053 -1955 2867
5706 2867 5245 8319 6523 3173 -625 2445 3018 12201 13784 13275 14416 17770 16804 11321 5225 7194
5690 7194 3513 -3675 634 3236 -3858 -8202 -4459 -13759 -17786 -12911 3812 -1522 -15491 -11385
5676 -11385 1829 3959 4784 -5086 -13150 -17781 -11336 -3933 8476 13069 10253 3620 -2287 -4280
5662d280L042N193J290m560k668N716O454O722J029k542l67j0304j074O639q134
5647B156j2978j407O085L769m174m17K125n45L181L699J327k526o757m048k438
5632a2948k271J3394J1578j73r336n882l879M212Q028p04m650l873M916J563j240
5617a265K898n158n862l859R4k596o386M033p684m081Q809J1309O72O96J970j306
5601g716L596K954k829n087j312N278j6092m997M945N198l184J7275Q349l286
5587C092n799n632k581p7O443l130R604j49o244j6813J817p83L629q38K277Q073
5571g111R302N612M294O77P320n015q825K374J156q758j4001k290O231K869Q697
5556B532J1177p217j3588l166O408J0805o90l661l717K825k618j225L005o231
$$ plain form
5662 -4280 -1238 3955 5245 685 -1983 3733 10187 16909 17938 15396 15029 4725 3651 10290 2156
5647 2156 -10822 -12229 -6144 -2375 -6549 -6966 -4841 -5386 -2205 1494 2821 295 -6462 -10510 -12948
5632 -12948 -15219 -1825 9753 9580 244 -5638 -9517 -5305 2723 2019 -2631 -6504 -1588 -25 -1265
5617 -1265 1633 -3525 -9387 -13246 -13152 -15748 -22134 -18101 -25785 -29866 -21057 -9748 -9076 -8380 -6410 -7716
5601 -7716 -4120 -1166 -3995 -9082 -10394 -5116 -21208 -26205 -21260 -16062 -19246 -1971 6378 3092
5587 3092 -2707 -8339 -10920 -10997 -4554 -7684 1920 1771 -4473 -21286 -19469 -20252 -16623 -17461 -15184 -7111
5571 -7111 2191 7803 12097 12774 20094 15079 6254 8628 9784 1026 -12975 -15265 -9034 -6165 2532
5556 2532 13709 6492 -7096 -10262 -3854 6951 6261 2600 -1117 1708 -910 -2135 870 -5361
5542e361Q99N287N603Q50n725m174L748Q807k796j0576r305M781R493Q87L52L275
5526F045O397J307M661n382k645L726l18o462N951N295J120m620l220Q83j942
5511A0796j4676K1J4566M623j6354R16n465N856R216j361k087J507o943n6P457
5496H016M418L772k024r525k768q457p733o001m248O681J4438J0591p079O616
5482F697m44m290K213m597K396J1576J027Q47j603L052k04j1107k337O9n559j189
5466c453n261l013L046N213P035p215J057P683J72N761K910r602r35k589M673
5451E482N486O029M671j3008j0234j919R131L414j464n568J772J559r336o918
5437a0903o55P068J0034p473l479o48m29M948N726m789m914K93q064k721L759
$$ plain form
5542 -5361 -4462 825 6428 7278 1553 -2621 1127 9934 7138 -3438 -12743 -7962 1531 2418 2770 6045
5526 6045 12442 13749 18410 13028 10383 14109 13791 7329 13280 18575 19695 15075 11855 12738 10796
5511 10796 -3880 -3859 10707 15330 -1024 -108 -5573 283 9499 8138 6051 7558 615 559 8016
5496 8016 12434 16206 14182 4657 1889 -6568 -14301 -20302 -24550 -17869 -3431 7160 81 6697
5482 6697 6253 1963 4176 -421 1975 13551 14578 15425 13822 16874 16670 5563 3226 3295 -2264 -3453
5466 -3453 -8714 -11727 -8681 -3468 3567 -3648 -2591 5092 5264 11025 13935 4333 3398 809 5482
5451 5482 10968 16997 21668 8660 -1574 -3493 5638 9052 7588 2020 3792 5351 -3985 -10903
5437 -10903 -11558 -4490 5544 -1929 -5408 -6056 -6485 -1537 4189 -600 -5514 -5221 -13285 -16006 -12247
5422a2247N215N635j244j345J6014o783j6299o500R941L017J4025P606n736j575
5408I724J87j1514l231J441J412L562j587L308M91p375j793k292n588R79M936
5393g340L49J855O940n245N794l248m242K428L418R852O377l423j0862k314O221
5378F560n611k032J0579M226P71j958q921Q15M000j912p152m557k292R034K054
5363C604o233J884p792K057N559q24l87j1244q10k325j405O930P835P5L847P517
5347H288k242j0663n687J443L765o201K264o791l736J1222O501q78R28M98L846
5332B557J112m615k421m103k782O224R054j1423q375J487O632K112M012J442Q814
5317I727O915r65k59m928L627m85m789p673n633K998p62j656m638j008O564M991
$$ plain form
5422 -12247 -7032 -1397 -2641 -3986 12028 5245 -11054 -17554 -7613 -4596 9429 17035 11299 9724
5408 9724 9911 -1603 -4834 -3393 -1981 1581 -6 3302 3793 -3582 -5375 -7667 -13255 -12276 -7340
5393 -7340 -6991 -5136 1804 -3441 2353 -895 -5137 -2709 709 10561 16938 13515 2653 339 6560
5378 6560 949 -1083 9496 13722 14493 12535 3614 4429 8429 6517 -635 -5192 -7484 1550 3604
5363 3604 -2629 -745 -8537 -6480 -921 -1745 -2132 -13376 -14186 -16511 -17916 -10986 -3151 -3076 771 8288
5347 8288 6046 -4617 -10304 -8861 -5096 -11297 -9033 -15824 -19560 -8338 -1837 -2715 -1787 -1289 2557
5332 2557 3669 -946 -3367 -7470 -10252 -4028 5026 -6397 -14772 -13285 -6653 -4541 -529 913 9727
5317 9727 16642 15677 15418 10490 14117 13632 8843 1170 -4463 -1465 -2227 -3883 -8521 -9529 -2965 2026
5301B026P267n857p382l002q73J798J086k245l141J8508K086j0143q831M782K302
5286a619O407J1106o186j922q523j3808J191N460L385j086M145k209j507J471
5272c695k986m451J53N019L983n732J49J8169P060n964J450p85j288n400J634
5257G316k368q640L627L073L467J0329n735q405q564k487R127m47L467P62k74
5242D248p618L560o714M721N237P7k19N698O088r181j4411l197P574P703L450
5227G016j924O005m448l773k385j0971l490n386Q118J5179k62r823k138O163L92
5212a727J134J403P960o084j755m285q381P589J333R837L442O01q86l207m609
5197B365M404P570j709j294j2248j388K203j148J312l849K833J1094j2299r034
$$ plain form
5301 2026 9293 3436 -3946 -6948 -7821 -6023 -4937 -7182 -10323 8185 10271 128 -8703 -3921 -1619
5286 -1619 4788 15894 9708 7786 -737 -14545 -13354 -7894 -4509 -5595 -1450 -3659 -5166 -3695
5272 -3695 -6681 -11132 -10979 -5960 -1977 -7709 -7560 10609 17669 11705 13155 12370 11082 5682 7316
5257 7316 4948 -3692 -65 3008 6475 16804 11069 2664 -5900 -8387 740 293 3760 4522 4248
5242 4248 -3370 190 -6524 -1803 3434 3511 3292 8990 15078 5897 -8514 -11711 -4137 3566 7016
5227 7016 5092 11097 6649 2876 491 -10480 -13970 -19356 -11238 3941 3679 -6144 -8282 -2119 -1727
5212 -1727 -593 810 8770 2686 931 -3354 -11735 -4146 -2813 7024 10466 11067 10181 6974 2365
5197 2365 6769 14339 12630 11336 -912 -2300 -97 -1245 67 -3782 -949 10145 -2154 -11188
5183a1188j486L855P508l22O91k51j960o770m35j426l077k135k445L788J005O899
5167g749J023k782j3401j330N852L944R234M504K454q632J494Q316J935Q893q183
5152E572o327n461J117m847m873K54K912N262m65k095M556M197L757k92K963J474
5136G704M882J3228K34j3142j2534p334O797j41r224k082N675O322q200o17J7642
5121I210R758k849j0526o710L910O640p69P23n342p472l542j315l106j024R953
5106b461k582N409M699p201j4144L532J856O82p820M493R225L111p900N298L03
5091c500j0221P539N772Q06k996l060j32P65m074n836Q717N650R607P305kj2457
5075C883o315m60L223N98k586k296O745P250K873p004j718o298l393k96Q642m720
$$ plain form
5183 -11188 -12674 -8819 -1311 -1633 -942 -1193 -3153 -9923 -10358 -11784 -14861 -16996 -19441 -15653 -14648 -7749
5167 -7749 -6726 -9508 -22909 -24239 -18387 -14443 -5209 -705 1749 -6883 -5389 2927 4862 13755 5572
5152 5572 -755 -6216 -5099 -9946 -14819 -14565 -11653 -6391 -6856 -8951 -4395 -198 3559 3267 6230 7704
5136 7704 12586 25814 26048 12906 372 -6962 -165 -306 -9530 -11612 -5937 385 -7815 -8432 9210
5121 9210 18968 16119 5593 -1117 2793 9433 8664 9387 4045 -3427 -6969 -8284 -11390 -12414 -2461
5106 -2461 -5043 366 5065 -2136 -16280 -12748 -10892 -10210 -18030 -13537 -4312 -1201 -9101 -3803 -3500
5091 -3500 -13721 -6182 -410 396 -2600 -5660 -5792 -5027 -9101 -14937 -6220 -570 9037 16342 16340 3883
5075 3883 -2432 -2892 331 929 -1657 -3953 2792 10042 12915 5911 4193 -2105 -5498 -5794 2848 -1872
5059a872N612J0222K79j074q308k853r966m168M292P301J784j170k728Q794j367
5044D778P847N58l01k858R40p60j635r271k189k497M945Q716M81l553l496K642
5028D347q18r480p499r75J155O402l496p303R55J4380J3597k888j8475o10n446
5013a6154J917O183L403k266m877r013N504Q808N917K272k653n620K048M277j0508
4998a0762o867L753L224O503p15l974J861j011n653P444Q264K951n718n061m890
4983a0651o82Q253L453Q196J346J727j784j4275J757j607k273R10O66o317K453
4968h828k09J617j69K648J2749O239p031r298J720j133K866j232m75o227p935
4953a4698l886R365J2298K656k297J142l973j153K401O351j250k960l22m588l025
$$ plain form
5059 -1872 3740 13962 14241 13167 4859 2006 -7960 -12128 -7836 -535 1249 79 -2649 6145 4778
5044 4778 12625 13183 12882 10024 10964 10204 8569 -702 -2891 -5388 -443 8273 8754 5201 1705 4347
5028 4347 3529 -5951 -13450 -14425 -13270 -6868 -10364 -17667 -16712 -2332 11265 8377 -10098 -10708 -16154
5013 -16154 -14237 -8054 -4651 -6917 -11794 -20807 -15303 -6495 -578 1694 -959 -6579 -4531 -254 -10762
4998 -10762 -17629 -13876 -10652 -4149 -4864 -8838 -6977 -7988 -13641 -6197 2067 5018 -700 -5761 -10651
4983 -10651 -11333 -3080 373 8569 9915 11642 9858 -4417 -2660 -4267 -6540 -5630 -4964 -11281 -8828
4968 -8828 -9037 -7420 -7589 -4941 7808 14047 7016 -2282 -562 -1695 1171 -61 -536 -6763 -14698
4953 -14698 -18584 -9219 3079 5735 3438 4580 607 -546 1855 8206 6956 3996 3674 -914 -3939
4938c939J058n37p400M364L854J102L517M372N955m384j1940r27Q339N926r48
4923H412L25k139l028j519k364j0226p763O873L531K965J5279N463l77j5156k57
4908A9j687p631p526P499K378j859J137R49M840O93J631K64o998o344N137j131
4892h629j475Q611J552n076k389R182j136r011N371J3424o986r718k723M446K671
4877a886R582N713L531k26j585j1942j5057o093K490R824J107J80n397k745L415
4862i089Q239Q250j3819j0285q29J1196J582k465l769L436J019J1605L690m821
4848C940k231P00k573p38o863M512J9038O921j2785j2946k435m094J1382o731
4834d903l598k74M43K080l364R513k366j1937J82L53J511K089K996J912q52k34
$$ plain form
4938 -3939 -2881 -3418 -10818 -6454 -2600 -1498 2019 6391 12346 7962 -3978 -4905 3434 9360 8412
4923 8412 8737 6598 3570 2051 -313 -10539 -18302 -11429 -7898 -4933 10346 15809 15432 276 19
4908 19 -1668 -9299 -16825 -9326 -6948 -8807 -7670 -6721 -1881 -1188 443 707 -6291 -12635 -7498 -8629
4892 -8629 -10104 -1493 59 -5017 -7406 1776 640 -8371 -3000 10424 3438 -6280 -9003 -4557 -1886
4877 -1886 7696 13409 16940 16714 15129 3187 -11870 -17963 -15473 -5649 -4542 -4362 -9759 -12504 -9089
4862 -9089 -850 7400 -6419 -16704 -17533 -6337 -4755 -7220 -10989 -7553 -6534 5071 8761 3940
4848 3940 1709 2409 -164 -902 -7765 -3253 15785 22706 9921 -3025 -5460 -9554 1828 -4903
4834 -4903 -8501 -8775 -8332 -6252 -9616 -103 -2469 -14406 -14224 -13871 -12360 -10271 -7275 -5363 -6215 -6449
4818f449r08K378j016J018j534J429k945R255J0764o811j1083j493K778J626L02
4803b689L682k121j958j3410L413N948J0234O947n674l741r60L355J507M180m676
4788D037m693l44L6N14J1605K14o934j1559k117O625J5607m106k2933k375R342
4773g081k428R832M249L878R24j064j4311r156n952J2600O931n776R328R062P439
4758A8475q388m047M078o264n297o12j860Q883j5012r292J632j908M781Q842P932
4743A943R005m17L960k142o300l260P833P651Q799m669j0119j1868p041m66L783
4728c308o219l443m527p11K074N542M212P007J2307o871j2927m926N901J0072
4714D183P650O316K301l238l112K371r03l939j0884o793j081o234O092N584p409
$$ plain form
4818 -6449 -7357 -4979 -5995 -4977 -6511 -5082 -8027 1228 11992 5181 -5902 -7395 -4617 -2991 -2689
4803 -2689 993 -1128 -3086 -16496 -13083 -7135 3099 10046 4372 631 -329 3026 4533 8713 4037
4788 4037 -656 -1000 -964 -450 11155 11369 4435 -7124 -9241 -2616 12991 8885 -14048 -16423 -7081
4773 -7081 -9509 323 4572 8450 9374 8310 -6001 -15157 -21109 -8509 -1578 -7354 1974 11036 18475
4758 18475 10087 6040 10118 3854 -1443 -2055 -3915 4968 -10044 -19336 -17704 -19612 -14831 -5989 1943
4743 1943 10948 10531 14491 12349 6049 2789 10622 18273 27072 22403 12284 416 -6625 -7091 -3308
4728 -3308 -9527 -12970 -17497 -18208 -16134 -10592 -6380 627 12934 6063 -6864 -11790 -5889 4183
4714 4183 11833 18149 20450 17212 14100 16471 15568 11629 745 -6048 -7129 -13363 -7271 -1687 -9096
4699i096n031P30l414L88J0986P198J590l960M052n34k54K681P564q03n618n950
4683E29O64N606n100j819L585k848o403O803j432l456m33L510J1159p030p697
4668d362q42n890n944M750J1563R161K297J253n085j8350p290O39O126J0570L758
4653B354l379m75J276J540J271r46l112Q65L942o792N528J0977o117r112M340
4638B160r81k629m14j1036r56O675m21m401M874R803m318R90q716M679N780Q276
4622I365l609j716K080J837j227O664j0970o804J580M369j194j59M540L554n301
4607C009k826J3290N429n635l851J826M342O84m757o883k541J063L520L07l506
4592C471M895n96q746m85N394r347m073K413N474K887l53K52r665J620k927K234
$$ plain form
4699 -9096 -14127 -13397 -16811 -16423 -5437 1761 3351 -609 3443 2909 2655 5336 12900 12097 6479 529
4683 529 1193 6799 1699 -120 3465 617 -5786 1017 -415 -3871 -4304 -794 10365 3335 -4362
4668 -4362 -5204 -11094 -17038 -12288 -725 8436 10733 11986 6901 -11449 -18739 -18100 -11974 -1404 2354
4653 2354 -1025 -1500 -224 1316 2587 1641 -1471 -606 3336 -3456 2072 13049 6932 -2180 2160
4638 2160 1179 -1450 -1864 -12900 -13856 -7181 -7602 -12003 -7129 2674 -1644 -654 -9370 -4691 1089 9365
4622 9365 5756 4040 6120 7957 6730 13394 2424 -4380 -2800 1569 375 216 4756 8310 3009
4607 3009 183 13473 18902 13267 9416 11242 15584 16268 11511 4628 2087 3150 6670 6977 3471
4592 3471 8366 7770 -976 -1461 3933 -5414 -9487 -7074 -1600 1287 934 1186 -8479 -6859 -9786 -7552
4576g552j678J1122P480j1142q999j531M09J334l299L18J754J0027O568j209o784
4561c182o911J802m006n553J2725Q667l513l669K203J191j745J779L721L676J087
4546H272M733q003r266j3294m019M860M936K562P574m063p992N357j773P76p35
4531a0075j293P419O098j513m638l237M200l318L658J7122N837j1265j0285n048
4517f338k71L641M911r96m891J1415J856J492J305o132o806k597k16N407p697
4502e917l970N594J0599P722m01J69k0310k417J684K712r887l377R24L118J0219
4487c538N893L687n679n500M098m233k485P813J904o376k943l168n411n580n81
4472b2099P087j272p95R149Q094K155N657M30q818r97L343N49M841M907N360k655
$$ plain form
4576 -7552 -9230 1892 9372 -1770 -10769 -12300 -11891 -10557 -13856 -13538 -11784 -1757 4811 3602 -3182
4561 -3182 -10093 -8291 -12297 -17850 -5125 3542 29 -3640 -1437 -246 -1991 -212 3509 7185 8272
4546 8272 13005 5002 -4264 -17558 -21577 -16717 -11781 -9219 -1645 -5708 -13700 -8343 -10116 -9340 -10075
4531 -10075 -11368 -3949 2149 636 -4002 -7239 -3039 -6357 -2699 14423 20260 8995 -1290 -6338
4517 -6338 -6609 -2968 1943 947 -3944 7471 9327 10819 12124 5992 -814 -3411 -3627 1780 -5917
4502 -5917 -9887 -4293 6306 14028 13627 13796 -6514 -8931 -7247 -4535 -14422 -17799 -16875 -13757 -3538
4487 -3538 2355 6042 363 -5137 -1039 -5272 -7757 56 1960 -4416 -7359 -10527 -15938 -21518 -22099
4472 -22099 -15012 -16284 -17079 -7930 164 2319 7976 8406 -412 -1409 1934 2483 7324 12231 17591 14936
4456A4936K696N058Q235k750j3266o770k192n345N637N369p417K207n423j849
4442h74K415M473N20j304n995O563N515j269o140r600M349l367o781l903l095
4427a8493K376J811J1618R081n790p061j779r777r303P52L256l92Q304m30P10
4412a5117r39M857M605Q235m08j116M400K760K569o0j5830m421J268J588J2420
4397D811K318k943j837m992p305L583J2276N833J8n898K567M064N219m536j365
4382A1813q036m272J1788L148q670M564k399m525m7L719r634q021Q745j764l123
4367f714q635J5L720J1883m463j2008R243J6489l81r066L04k291L626P372k22
4352H872l854n050l054m293l620k064J0041K334k296l445O361N202K703O350q675
$$ plain form
4456 14936 17632 22690 30925 28175 14909 8139 5947 602 6239 11608 4191 6398 975 -874
4442 -874 1541 6014 6534 5230 -765 5798 11313 10044 3904 -5696 -1347 -4714 -11495 -15398 -18493
4427 -18493 -16117 -14306 -2688 6393 603 -6458 -8237 -18014 -27317 -26565 -23309 -23701 -15397 -15827 -15117
4412 -15117 -16056 -11199 -6594 1641 1233 117 4517 7277 9846 9786 -6044 -10465 -9197 -7609 4811
4397 4811 7129 4186 2349 -2643 -9948 -6365 5911 11744 11762 5864 8431 12495 17714 13178 11813
4382 11813 3777 -495 11293 14441 5771 10335 7936 3411 3364 7083 -2551 -10572 -1827 -3591 -6714
4367 -6714 -15349 -15334 -11614 269 -4194 -16202 -6959 9530 9149 83 387 -1904 1722 9094 8872
4352 8872 5018 -32 -3086 -7379 -10999 -13063 -3022 -688 -2984 -6429 -68 5134 7837 14187 5512
4337E512r388J167k20L736O010m515K591o12K620Q347L246p773j778n618p809
4322d484K322M426j0675l917L647N839J1633L089r198r8J0126p561r117Q198o635
4307b405J30P89l655K015l790q898L821Q396M937K1P958K556n529K548p613N509
4291F790K297j754M1M841o307j0366j153k771Q988K08L663o348q113J717N870
4276b397J156k51Q048O655K175k729l439j595l81J857r896j9410L441N937J500
4261i329o635j363R748J10p399m884J619N963l838r381j564K94J7045R067o312
4246f859p971j289M241J3805P988l26m025o515q72M57L547L238M965K264o163
4231F485k036K042r310j61k613j0320K641J3272J752n149n687j1278J462J8227
$$ plain form
4337 5512 -3876 -2709 -2929 807 6817 2302 4893 4281 6901 15248 18494 10721 8943 3325 -4484
4322 -4484 -2162 2264 -8411 -12328 -8681 -2842 8791 11880 2682 2584 12710 5149 -3968 4230 -2405
4307 -2405 -2275 -1486 -5141 -3126 -6916 -15814 -11993 -3597 1340 1361 9319 11875 6346 8894 1281 6790
4291 6790 9087 7333 7374 12215 5908 -4458 -5611 -8382 606 814 4477 -1871 -9984 -8267 -2397
4276 -2397 -1241 -1492 6556 13211 15386 12657 9218 7623 7242 9099 -797 -20207 -16766 -10829 -9329
4261 -9329 -15964 -17327 -7579 -7469 -14868 -19752 -18133 -12170 -16008 -25389 -26953 -26659 -9614 -547 -6859
4246 -6859 -14830 -16119 -11878 1927 9915 9589 5564 -951 -1823 -1366 2181 5419 10384 12648 6485
4231 6485 4449 6491 -2819 -2980 -5593 -15913 -13272 0 1752 -3397 -9084 -20362 -18900 -673
4217f73p159k581K890O198n555l655L410J1278L64j3721n121L126O546K267m995
4202g381k115M145R985J0437n337j0294l610K888N842l73K46O644O971r785n130
4187C133p008j559J7914J919m923M95L02j0087k374j897o133q494K879O615J6864
4172G646O182l992m93k418n291m715K171J2242L315p463r214j957P072p183n38
4157d636K290l615K341L127R42l908r912j08O859K633N010J0973m842m412n874
4142c132L605n389l945j699L893M372k741o906j580K219M070K928k068m795k47
4127a1415J0727n363o596k034q11j899O603L399L243K135R72L44O439K539n305
4112B978l472m681n182k578n710M164Q385J761j03r98q592K286J385m506j741
$$ plain form
4217 -673 -7832 -10413 -7523 -1325 -6880 -10535 -7125 4153 4517 -9204 -14325 -11199 -4653 -2386 -7381
4202 -7381 -9496 -5351 4634 15071 9734 -560 -4170 -1282 4560 4187 4433 11077 18048 8263 3133
4187 3133 -3875 -5434 12480 14399 9476 9971 10273 186 -2188 -4085 -10218 -18712 -15833 -9218 7646
4172 7646 13828 9836 9343 6925 1634 -3081 -910 11332 14647 7184 -2030 -3987 3085 -4098 -4636
4157 -4636 -2346 -5961 -3620 -493 449 -3459 -13371 -13479 -6620 -3987 1023 11996 7154 2742 -3132
4142 -3132 473 -4916 -8861 -10560 -6667 -2295 -5036 -11942 -13522 -11303 -7233 -4305 -6373 -11168 -11415
4127 -11415 -688 -6051 -12647 -14681 -15492 -17391 -10788 -7389 -4146 -2011 -1039 -695 5744 8283 2978
4112 2978 -494 -5175 -10357 -12935 -18645 -14481 -6096 -4335 -4438 -5436 -14028 -11742 -10357 -14863 -16604
4097a6604M984L564J604j213m989l59L095J790k048N382P248o963o540L116l86
4082h319p34J476j2299o326J0667J776L909Q001O715m364o953l769j221P277j989
4067f153J358Q267j190J517J1203J977L437q571j1269M757r118L39k847o289k472
4052a5054l347N566j852K786J430O524k280j520L204L256j140m737P029R330J731
4037A0926M961n615j1048M094O024J628k200M629k169J152l67k316j2172m781
4023g254K099L482K168n746k693j474M97N214J709Q210M09l731n504m412p021
4008a4047L718L077Q610k513r004L55J99R497J0985N452o022n436r309k839n40
3993g817J62J204M027m410M118O075k168k232r734j2942l582J2980J9121k521
$$ plain form
4097 -16604 -11620 -8056 -6452 -7665 -12654 -13013 -9918 -8128 -10176 -4794 2454 -4509 -11049 -7933 -8319
4082 -8319 -9053 -7577 -19876 -26202 -15535 -13759 -9850 -1849 4866 502 -6451 -10220 -11441 -4164 -6153
4067 -6153 -4795 3472 2282 3799 15002 16979 20416 11845 576 5333 -3785 -3446 -6293 -12582 -15054
4052 -15054 -18401 -12835 -14687 -11901 -10471 -3947 -6227 -7747 -4543 -1287 -2427 -7164 -135 9195 10926
4037 10926 15887 10272 -776 3318 9342 10970 8770 13399 11230 12382 12015 9699 -2473 -7254
4023 -7254 -5155 -1673 495 -5251 -7944 -9418 -8921 -3707 -1998 6212 6621 2890 -2614 -7026 -14047
4008 -14047 -10329 -7252 1358 -1155 -10159 -9804 -9605 -108 10877 16329 10307 4871 -4438 -7277 -7817
3993 -7817 -7655 -6451 -2424 -6834 -2716 3359 1191 -1041 -10775 -23717 -27299 -14319 4802 2281
3979B281j3131j215J781N418N267M508r39J630O67o202q242j5Q239J598L710K570
3963G925k900q061r01Q54j373N636J402j2130O12R961j043o495L048j159n292
3948i916j53P837k343j004Q464q098q127j9k47Q189P765J642l418L640K096K809
3932I117j514n788l844K561M296M99M555K451l250N60q10l210Q13n020p708k409
3916h701J819R480M207q467m188N575J708j730p836J778K306P330J178l358o170
3901e069n578r95R731Q393r82O6l707j0456L791O249q956o747j363N957R251j223
3885a638j830m4N571K260q205k547L030M591l873l504n420j941J0903O429n561
3870a779k360M795j386k338P213Q066K68o151j0603l435J0963Q063O83L587j189
$$ plain form
3979 2281 -10850 -12065 -10284 -4866 401 4909 3970 5600 6267 65 -8177 -8192 47 1645 5355 7925
3963 7925 5025 -3036 -3937 -3083 -4456 1180 2582 -9548 -8936 1025 -18 -6513 -3465 -4624 -9916
3948 -9916 -10069 -2232 -4575 -5579 2885 -5213 -13340 -13359 -13606 -5417 2348 3990 572 4212 6308 9117
3932 9117 7603 1815 -2029 532 4828 5327 9882 12333 9083 9643 8833 5623 6436 1416 -6292 -8701
3916 -8701 -6882 2598 6805 -1662 -5850 -275 1433 -297 -8133 -6355 -4049 3281 4459 1101 -5069
3901 -5069 -10647 -11642 -1911 6482 5500 5566 1859 -8597 -4806 1443 -7513 -14260 -15623 -9666 -415 -1638
3885 -1638 -3468 -3512 2059 4319 -3886 -6433 -3403 1188 -2685 -6189 -11609 -13550 -2647 3782 -1779
3870 -1779 -4139 656 -730 -3068 4145 12211 12479 6328 -4275 -7710 3253 11316 11999 15586 14397
3855A4397j638l571r76l8j0070n984p94L858R930j375o012R73J1244J751l959
3840G736l716p56k005p886N593P002m783o253J21L895r641l102L827k708r99O727
3824f948M941l187l179j663J163r316k522J3615J3431n988q313K016L464K398
3810h8O98n530o073K987N11K804M19O129l470m649j680L042M128j703o286J903
3794f858j517J9n600L278J1786J0417j985j1308m002j717L705J768r20o360m758
3779a4052L239Q346L935p77n454o687j0654O489L433K711L208L656k112q31M047
3764a503J300J203o625L00p32O624J572j983l139n495L649M66m172j0431m573
3749b3539O867L829K855l00J6890m092j1124l696J272K505j145O441R538Q331
$$ plain form
3855 14397 12759 9188 8212 8174 -1896 -7880 -8674 -4816 5114 3739 -2273 -1300 9944 11695 7736
3840 7736 4020 3264 1259 -6627 -1034 5968 1185 -5068 -4947 -1052 -10693 -13795 -9968 -12676 -13675 -6948
3824 -6948 -2007 -5194 -8373 -10036 -8873 -18189 -20711 -7096 6335 347 -7966 -5950 -2486 -88
3810 -88 610 -4920 -10993 -8006 -7495 -4691 -4272 1857 -1613 -6262 -7942 -4900 -772 -2475 -8761 -6858
3794 -6858 -8375 -8356 -13956 -10678 1108 11525 9540 -1768 -5770 -7487 -3782 -2014 -2934 -9294 -14052
3779 -14052 -10813 -2467 1468 691 -4763 -11450 -22104 -15615 -12182 -9471 -6263 -2607 -4719 -5550 -1503
3764 -1503 -203 1000 -5625 -5325 -6057 567 2139 156 -2983 -8478 -4829 -4363 -8535 -18966 -23539
3749 -23539 -16672 -12843 -9988 -10288 6602 2510 -8614 -12310 -11038 -8533 -9678 -3237 6301 14632
3735A4632k16p189j0472n485n154N816Q937N392j273N086J604j611p429q712n851
3720a1925j654O645j756k657N868l112m36R14J394N669Q089m981k318n827q06
3705f893J46L316J958N100L532m098n319M95Q959N145r393J729l908r467k461
3690a1159M875L431J342q330M466N962K43q415k577K701m540n068N724Q157k044
3675e232l442P646M687M026q65m926K21l970K539l719r067k347n32J759Q459K691
3659b072O75j331k571k412N121J3536j439J871l645o838J34k756j723R69j666
3644d147o447j785Q163R732M684O240P24q67p657K631j946n667j636o30M879q04
3628E467k128o903j894o24k545K244o655L533K695k512L572P51j238M583q541
$$ plain form
3735 14632 14416 7227 -3245 -8730 -13884 -8068 869 6261 4988 10074 11678 10067 2638 -6074 -11925
3720 -11925 -13579 -6934 -8690 -11347 -5479 -8591 -9027 -8113 -6719 -1050 7039 2058 -260 -6087 -6893
3705 -6893 -6747 -3431 -1473 3627 7159 3061 -2258 -1763 7196 12341 2948 4677 769 -8698 -11159
3690 -11159 -6284 -2853 -1511 -9841 -5375 587 830 -7585 -10162 -7461 -12001 -17069 -11345 -3188 -5232
3675 -5232 -8674 -1028 3659 7685 6820 1894 2115 -1855 684 -3035 -12102 -14449 -14981 -13222 -4763 -2072
3659 -2072 -1397 -2728 -5299 -7711 -2590 10946 9507 11378 7733 895 1029 -1727 -3450 -2481 -4147
3644 -4147 -10594 -12379 -4216 5516 10200 16440 17164 16297 8640 11271 9325 3658 2022 1392 6271 5467
3628 5467 3339 -3564 -5458 -6082 -8627 -6383 -13038 -9505 -6810 -9322 -5750 -4999 -6237 -1654 -10195
3613a0195l855rq6k458j801O753J2545p26J143N886k949N408k522j630l266M4
3597B282O025m469m853O063l722j043k5L166K333o48m475p849N142J0378l69K217
3581A0153j630j2652k374N875L589J755m877N162M830J870n053o655k039K731
3567F85q383l877j24n178J737Q7r432J0602N465N406n655k286N588P975K413k448
3551B575q17j398Q69n775k941J2470L605m869o551k453J1473K435Q369K032q260
3536A0764p547R410L726r678k656P270k482l083L823Q227L46q557n889O15n597
3521a308K930m874j6538k356J1121j370K156p65L992L864M589M442O825l383K769
3506A2094k562k539K727J368j0157n381m089Q123R047K9Q46j2529j0096L451L970
$$ plain form
3613 -10195 -14050 -14059 -14145 -16603 -18404 -11651 894 168 1311 7197 4248 9656 7134 5504 2238 2282
3597 2282 8307 3838 -1015 5048 1326 283 258 3424 5757 5109 634 -7215 -2073 8305 7936 10153
3581 10153 8523 -4129 -6503 -628 2961 4716 -161 5001 9831 11701 6648 -7 -2046 685
3567 685 -7698 -11575 -11699 -16877 -15140 -15053 -24485 -13883 -8418 -3012 -8667 -10953 -5365 2610 5023 2575
3551 2575 1758 360 1229 -4546 -7487 4983 8588 3719 -2832 -5285 6188 8623 16992 19024 10764
3536 10764 3217 12627 16353 6675 4019 11289 8807 5724 9547 17774 18120 9563 3674 4289 -1308
3521 -1308 1622 -3252 -19790 -22146 -11025 -12395 -10239 -11004 -7012 -3148 1441 5883 12708 9325 12094
3506 12094 9532 6993 9720 11088 931 -4450 -8539 -416 8631 8660 9506 -3023 -13119 -9668 -5698
3491e698n671L871n794j4030L34J1389J0626P744M28k08q260p077K453O712J0310
3476G129j748n979j517O313O913J1164O711r824j0454m600J537J470r22o975l894
$$ plain form
3491 -5698 -11369 -7498 -13292 -27322 -26988 -15599 -4973 2771 3199 2991 -5269 -12346 -9893 -3181 7129
3476 7129 5381 -598 -2115 4198 11111 22275 28986 19162 8708 4108 5645 7115 6193 -782 -4676
$$ [...]
##END NTUPLES=NMR SPECTRUM
##END=
