##TITLE=Analysis number 328930
Compound Code cc 68216
Book Reference 494/196
Project Code adrs
Chemist Name craigr
##JCAMPDX= 6.0         $$ Bruker NMR JCAMP-DX V2.0
##DATA TYPE= NMR SPECTRUM
##DATA CLASS= NTUPLES
##ORIGIN= Bruker BioSpin GmbH
##OWNER= nmr
$$ XWIN-NMR		Version 3.5
$$ Tue Jul 17 11:14:52 2007 GMT Daylight Time (UT+1h)  MAYBRIDGE\nmr@NMR_250MHZ
##.OBSERVE FREQUENCY= 250.131544655141
##.OBSERVE NUCLEUS= ^1H
##.ACQUISITION MODE= SIMULTANEOUS (DQD)
##.ACQUISITION SCHEME= undefined
##.AVERAGES= 16
##.DIGITISER RES= 18
##SPECTROMETER/DATA SYSTEM= dpx250
##.PULSE SEQUENCE= zg30
##.SOLVENT NAME= CDCl3
##.SHIFT REFERENCE= (INTERNAL, CDCl3, 0, 16.522)
##AUDIT TRAIL= $$ (NUMBER, WHEN, WHO, WHERE, WHAT)
$$ ##TITLE= Audit trail, XWIN-NMR		Version 3.5
$$ ##JCAMPDX= 5.01
$$ ##ORIGIN= Bruker BioSpin GmbH
$$ ##OWNER= nmr
$$ C:\u/data/dgb/nmr/ADRS/1110/pdata/1/auditp.txt
$$ ##AUDIT TRAIL=  $$ (NUMBER, WHEN, WHO, WHERE, WHAT)
(   1,<2007-07-17 11:14:32.16 +100>,<MAYBRIDGE\nmr>,<NMR_250MHZ>,
      <created by zg, POWCHK disabled, PULCHK disabled
       configuration hash MD5:
       76 6E 9A 78 1E 09 19 81 EC 84 63 8F B0 6A 59 2D
       data hash MD5: 64K
       55 25 4C E9 89 2E 29 F1 76 36 31 98 FC 0F 43 DD>)
(   2,<2007-07-17 11:14:44.41 +100>,<MAYBRIDGE\nmr>,<NMR_250MHZ>,
      <Start of raw data processing
       ef LB = 0.3 FT_mod = 6 PKNL = 1 SI = 32K 
       data hash MD5: 32K
       06 77 69 C2 03 AE 61 50 F3 C4 D5 F8 BF E0 0F B3>)
(   3,<2007-07-17 11:14:46.05 +100>,<MAYBRIDGE\nmr>,<NMR_250MHZ>,
      <apk 
       data hash MD5: 32K
       15 9A 01 27 53 BF A7 AB 6E 94 07 9B 4F 1E DF 53>)
(   4,<2007-07-17 11:14:46.77 +100>,<MAYBRIDGE\nmr>,<NMR_250MHZ>,
      <abs ABSG = 5 
       data hash MD5: 32K
       3F A6 C5 A3 10 3C 2A A7 64 9E 23 97 8D 3F 4A AD>)
$$ ##END=
$$ 
$$ hash MD5
$$ 04 D6 DA EF E0 56 4F 61 45 A6 01 E3 B2 9F 8A 9B
##$RELAX= 
##$RELAX= 
##$RELAX= 
##$RELAX= 
##$RELAX= 
##$RELAX= 
##$RELAX= 
$$ Bruker specific parameters
$$ --------------------------
##$DU= <C:\u>
##$EXPNO= 1110
##$NAME= <ADRS>
##$PROCNO= 1
##$TYPE= <nmr>
##$USER= <dgb>
##$AMP= (0..31)
100 100 100 100 100 100 100 100 100 100 100 100 100 100 100 100 100 100 
100 100 100 100 100 100 100 100 100 100 100 100 100 100 
##$AQSEQ= 0
##$AQ_mod= 3
##$AUNM= <au_zg>
##$AUTOPOS= <20 >
##$BF1= 250.13
##$BF2= 250.13
##$BF3= 250.13
##$BF4= 250.13
##$BF5= 500.13
##$BF6= 500.13
##$BF7= 500.13
##$BF8= 500.13
##$BYTORDA= 1
##$CFDGTYP= 0
##$CFRGTYP= 5
##$CHEMSTR= <none>
##$CNST= (0..31)
1 1 145 1 1 1 1 1 1 1 1 1 1 1 1 1 1 1 1 1 1 1 1 1 1 1 1 1 1 1 1 1 
##$CPDPRG= <>
##$CPDPRG1= <>
##$CPDPRG2= <>
##$CPDPRG3= <>
##$CPDPRG4= <mlev>
##$CPDPRG5= <mlev>
##$CPDPRG6= <mlev>
##$CPDPRG7= <mlev>
##$CPDPRG8= <mlev>
##$CPDPRGB= <>
##$CPDPRGT= <>
##$D= (0..31)
0 1 0 0 0 0 0 0 0 0.06 0 0 0 0 0 0 0.0002 0 0 0 0 0 0 0 0 0 0 0 0 0 0 
0 
##$DATE= 1184667271
##$DBL= (0..7)
120 120 120 120 120 120 120 120 
##$DBP= (0..7)
150 150 150 150 150 150 150 150 
##$DBP07= 0
##$DBPNAM0= <>
##$DBPNAM1= <>
$$ [...]
##$SUBNAM7= <"">
##$SUBNAM8= <"">
##$SUBNAM9= <"">
##$SW= 20.6930455092707
##$SWIBOX= (0..15)
0 0 3 0 0 0 0 0 0 0 0 0 0 0 0 0 
##$SW_h= 5175.983436853
##$TD= 65536
##$TD0= 1
##$TE= 296.16
##$TE2= 300
##$TE3= 300
##$TEG= 300
##$TL= (0..7)
0 120 120 120 120 120 120 120 
##$TP= (0..7)
150 150 150 150 150 150 150 150 
##$TP07= 0
##$TPNAME0= <>
##$TPNAME1= <>
##$TPNAME2= <>
##$TPNAME3= <>
##$TPNAME4= <>
##$TPNAME5= <>
##$TPNAME6= <>
##$TPNAME7= <>
##$TPOAL= (0..7)
0.5 0.5 0.5 0.5 0.5 0.5 0.5 0.5 
##$TPOFFS= (0..7)
0 0 0 0 0 0 0 0 
##$TUNHIN= 0
##$TUNHOUT= 0
##$TUNXOUT= 0
##$USERA1= <user>
##$USERA2= <user>
##$USERA3= <user>
##$USERA4= <user>
##$USERA5= <user>
##$V9= 5
##$VALIST= <valist>
##$VCLIST= <CCCCCCCCCCCCCCC>
##$VD= 0
##$VDLIST= <DDDDDDDDDDDDDDD>
##$VPLIST= <PPPPPPPPPPPPPPP>
##$VTLIST= <TTTTTTTTTTTTTTT>
##$WBST= 1024
##$WBSW= 4
##$XGAIN= (0..3)
0 0 0 0 
##$XL= 0
##$YL= 0
##$YMAX_a= 420883
##$YMIN_a= -426869
##$ZGOPTNS= <>
##$ZL1= 120
##$ZL2= 120
##$ZL3= 120
##$ZL4= 120
##$ABSF1= 16.522
##$ABSF2= -4.171173
##$ABSG= 5
##$ABSL= 3
##$ALPHA= 0
##$AQORDER= 0
##$ASSFAC= 0
##$ASSFACI= 0
##$ASSFACX= 0
##$ASSWID= 0
##$AUNMP= <proc_1d>
##$AZFE= 0.1
##$AZFW= 0.1
##$BCFW= 0
##$BC_mod= 0
##$BYTORDP= 0
##$COROFFS= 0
##$CY= 12.5
##$DATMOD= 1
##$DC= 0
##$DFILT= <>
##$DTYPP= 0
##$F1P= 14.0000005364418
##$F2P= -0.99999901652339
##$FCOR= 0.5
##$FTSIZE= 32768
##$FT_mod= 6
##$GAMMA= 0
##$GB= 0
##$INTBC= 1
##$INTSCL= 1
##$ISEN= 128
##$LB= 0.3
##$LEV0= 0
##$LPBIN= 0
##$MAXI= 10000
##$MC2= 0
##$MEAN= 0
##$ME_mod= 0
##$MI= 0
##$NCOEF= 0
##$NC_proc= -3
##$NLEV= 6
##$NOISF1= 0
##$NOISF2= 0
##$NSP= 0
##$NTH_PI= 0
##$NZP= 0
##$OFFSET= 16.522
##$PC= 1
##$PHC0= -50.92254
##$PHC1= 6.931584
##$PH_mod= 1
##$PKNL= yes
##$PPARMOD= 0
##$PSCAL= 4
##$PSIGN= 0
##$REVERSE= no
##$SF= 250.13
##$SI= 32768
##$SIGF1= 0
##$SIGF2= 0
##$SINO= 400
##$SIOLD= 32768
##$SREGLST= <1H.CDCl3>
##$SSB= 0
##$STSI= 32768
##$STSR= 0
##$SW_p= 5175.98343685301
##$SYMM= 0
##$S_DEV= 0
##$TDeff= 65536
##$TDoff= 0
##$TI= <Analysis number 999999
Compound Code 99
Book Reference 9
Project Code 9>
##$TILT= no
##$TM1= 0
##$TM2= 0
##$TOPLEV= 0
##$USERP1= <user>
##$USERP2= <user>
##$USERP3= <user>
##$USERP4= <user>
##$USERP5= <user>
##$WDW= 1
##$XDIM= 32768
##$YMAX_p= 396263757
##$YMIN_p= -113497
$$ End of Bruker specific parameters
$$ ---------------------------------
##NTUPLES= NMR SPECTRUM
##VAR_NAME=  FREQUENCY,     SPECTRUM/REAL,   SPECTRUM/IMAG
##SYMBOL=    X,             R,               I
##VAR_TYPE=  INDEPENDENT,   DEPENDENT,       DEPENDENT
##VAR_FORM=  AFFN,          ASDF,            ASDF
##VAR_DIM=   32768,         32768,           32768
##UNITS=     HZ,            ARBITRARY UNITS, ARBITRARY UNITS
##FACTOR=    0.157963299565203, 1,           1
##FIRST=     4132.6476996994, 0,             0
##LAST=      -1043.33573715361, 0,           0
##MIN=       -1043.33573715361, -113497,     0
##MAX=       4132.6476996994, 396263757,     0
$$ Real data points
##PAGE= N=1
##DATA TABLE= (X++(R..R)), XYDATA
$$ [...]
16211D476930P09958R41430J339641J886308K551645L290720M066909M881663
16203B4145204N612111O324510O927163P250023P099140N965346M517200L621216
16195G1461913K104622J43042j705389l498564m486407n565943o906528p296104
16187D4250642p037518o479292n716204m997230m242786l431014k679511j946000
16179G721087j398322j036264p51209n48640m28524l08667k68047j95590j47539
16170B638285j30786j05760r3363m8621k6981l602N238n8631r0296r4718j35057
16159A855708j65352j54089j46564j41416j25365j27696j20806q0485q8587r6243
16149F09105p4539o0777m3864l2379m2563K8363K548j9354m3047O269p457l4539
$$ plain form
16211 4476930 5186888 6128318 7467959 9354267 11905912 15196632 19263541 24145204
16203 24145204 29757315 36081825 43008988 50259011 57358151 63323497 67840697 71461913
16195 71461913 73566535 73709577 72004188 68505624 64019217 58453274 51546746 44250642
16187 44250642 37213124 30733832 25017628 20020398 15777612 12346598 9667087 7721087
16179 7721087 6322765 5286501 4535292 3986652 3558128 3249461 2981414 2785824 2638285
16170 2638285 2507499 2401739 2308376 2259755 2232774 2229172 2234410 2175779 2085483 1990765 1855708
16159 1855708 1690356 1536267 1389703 1248287 1122922 995226 874420 793935 705348 609105
16149 609105 534566 473789 429925 397546 354983 383346 385894 366540 323493 329762 322305 287766
16137B87766j5724M105n940q712j3825k3044j3676K7911r373k3397q422M321N996
16124B07986n526l505k4160n127K4420o036j1629L013j8914l223q362n242k2796
16111A20899q18J7918j5140l0608L292O696Q429J933n867o566M468j8773k9838
16098E6025L2819J9296l1727j5664J1999L539J3280K1355K5944k3977l5321J6859
16086I4427K7184J541Q008k2494k0924k3935L0898K0626J8419P274K1445K5426
16074A87895J1575j6307j5766o679j9546L769l7101j6685p922J6434J5055n120
16062A09602k9106l7L3800l5576k1459J0954j2258j1348R864L986l0308o897j0924
16049A0293l5372J4344L8790j5261k055L0531P011J8731j3507K688J3974r236
$$ plain form
16137 287766 272042 276147 270207 261495 247670 224626 210950 238861 229488 206091 197669 201990 207986
16124 207986 202460 198955 174795 169668 194088 188052 176423 179436 160522 157299 148937 143695 120899
16111 120899 120081 137999 122859 92251 95543 102239 110668 112601 106734 100168 104636 85863 56025
16098 56025 88844 108140 76413 60749 72748 76287 89567 110922 136866 112889 77568 94427
16086 94427 121611 123152 131160 108666 87742 63807 94705 115331 133750 141024 162469 187895
16074 187895 199470 183163 167397 160718 141172 144941 107840 91155 83233 99667 114722 109602
16062 109602 80496 80459 114259 78683 57224 68178 55920 44572 54436 58422 28114 21217 10293
16049 10293 -25079 -10735 28055 12794 10739 41270 48281 67012 53505 56193 70167 60931
16037F0931l9848k8134l688J7920L9972K4556j9705l1616Q846J5270L1054J1926
16025H7484O426m2324j6446j466J0799J0556k0169q244J9073M0676j0126l5500
16013D0739o987J1607j00l7704M239L266J5901o214J805j644j5176k9632r069
16000b8969K5215L13j3690J3579L66n324l218l6767K09J9202R388K739j3745J4731
15986a5971P2642K0077j7326Q497l1118l7721m767j969O572J3062L2638m2543
15974B073j5464O0075P523K8628J6100j0888j7885M3411P362l2838r382k6827
15962E1888j8823N401j4366K3081j5n8044j188M3704j2209k8865K68L1312O768
15949B8912J0155K839J5377k2595n085l425K379J1010J6545k6868k6247J0238
$$ plain form
16037 60931 21083 -7051 -10739 7181 47153 71709 52004 20388 29234 44504 75558 87484
16025 87484 93910 51586 35140 33674 44473 55029 34860 26616 45689 86365 76239 40739
16013 40739 33752 45359 45259 7555 11794 15060 30961 24747 26552 24908 9732 -19900 -28969
16000 -28969 -3754 -3441 -17131 -3552 -3186 -8510 -11728 -48495 -48286 -29084 -19696 -16957 -30702 -15971
15986 -15971 56671 76748 59422 67919 36801 -920 -5687 -7656 -1084 11978 44616 2073
15974 2073 -13391 46684 54207 82835 98935 88047 70162 113573 120935 88097 78715 51888
15962 51888 33065 38466 24100 47181 47166 -10878 -12066 31638 19429 -9436 -9168 22144 28912
15949 28912 39067 41906 57283 34688 29603 26178 28557 39567 56112 29244 2997 13235
15937A3235j5598J4766M4555J6733k9230L470J74k8560J6291R512p857l9827j8092
15924b0428M3651K8165P547r472k2283L395j4412R546K0556J9510L2540k552n5233
15911D0530l8199Q900M778k6570L1190L7805n12m077M077O492Q160o519k8618
15898C7437Q855k0587m7768N802L7381j018o313n204j4553J5639K9346j3857j3337
15885A1823l0019j4231J3682Q911l1103J1806M8261L521p002p72n970K3013K8489
15872F0409N00k3707j952j7366L0613K6978o40k1266j1155R651J3791j5799L987
15859E4044L5611J1688k2091K1482M7509k0566J7518M9110L2726k0815n3267k0236
15847A32713J5210J4491R943J6305k6302j5627O598J169J2300j9533J847M5552
$$ plain form
15937 13235 -2363 12403 56958 73691 44461 47931 48105 19545 35836 45348 37491 -2336 -20428
15924 -20428 23223 51388 58935 49463 27180 30575 16163 25709 46265 65775 98315 95763 40530
15911 40530 2331 11231 16009 -10561 20629 58434 57922 53845 57922 64414 72574 66055 37437
15898 37437 46292 25705 -22063 -16261 21120 20102 13789 8585 -5968 9671 39017 25160 11823
15885 11823 -18196 -32427 -18745 -9834 -40937 -29131 19130 22651 15649 14877 8907 31920 60409
15872 60409 60909 37202 35250 17884 48497 75475 74835 53569 42414 52065 65856 50057 54044
15859 54044 89655 101343 79252 100734 148243 127677 145195 194305 227031 206216 152949 132713
15847 132713 147923 162414 172357 188662 162360 146733 153331 154500 166800 147267 149114 194666
15835A94666J0824r235k9645k9119m961K4883j1161J1831k9033l2665l1730J1170
15823G5825j8399j173J5229J1470J3040j9351j6593l1233J650J6226J854p311
15811D1234r541J0187J4426j0445l8117k437K0180L2249L359j44k071k5798j8757
15798A4325j9849M367M4356O266q016j6172J1639J7921O119j6548k9972k1829
15786g393m373Q535P370J7563J4012M23J819J9176k5605m6520k2555J625N083
15773c0840M7298M5140P940j5063l2623q418J615J5432l293K333R221J9303L7925
15760I5970n2923k9401O940R039J7360J3604j9736m678N804l1040l4937j2470
15748c6468L7224J442J4127L7638K4338k6018j0916j2449L634j849j9775k8429
$$ plain form
15835 194666 205490 196255 166610 137491 132530 157413 146252 158083 129050 96385 64655 75825
15823 75825 57426 56253 71482 82952 95992 76641 60048 28815 30465 46691 48545 41234
15811 41234 31693 41880 56306 45861 7744 5307 25487 57736 61095 60951 58880 33082 14325
15798 14325 -5524 -1157 43199 49465 41449 25277 36916 54837 60956 44408 14436 -7393
15786 -7393 -11766 -3231 4139 21702 35714 36137 37956 57132 31527 -14993 -37548 -35923 -30840
15773 -30840 16458 61598 69538 54475 21852 13434 15049 30481 27188 29521 38742 58045 95970
15760 95970 43047 13646 20586 29625 46985 60589 40853 36175 41979 10939 -23998 -36468
15748 -36468 756 2198 16325 53963 78301 52283 41367 28918 32552 30703 10928 -17501
15736a7501K828L6809K744r878J1093L9112r051l6565J7627Q225M588k7637M651
15723B7045P075q675m273J0868o176P56k3196j4497J1844L434l430l9780J3121
15710b5884K0768K3370J9897J0814k8401L687R982q439p287j8631Q536J1784K238
15697B2434j0608j749r698j5488M779P917J8940r473p378k1021j010K5696J7502
15684B0843L3707K23j1546m19k6602k6882k2795P051k0690O132K7719K3111m0087
15671c0235n365J0830J2322L1293o481l0752k4401L9722M7961L1616L2472J612
15659A10594Q85l5630o335J5478J5669K7301J5452j9056L2769K9392M8408L0687
15647B65614K8795M819K7969J3541O823M0228Q696K9O640n3118m8018k9652j7076
$$ plain form
15736 -17501 -14673 22136 24880 15002 26095 65207 56156 19591 37218 45443 50031 22394 27045
15723 27045 34120 25445 21172 32040 25864 26620 3424 -11073 771 4205 775 -39005 -25884
15710 -25884 -5116 18254 38151 48965 20564 24251 34233 25794 18507 -124 8412 20196 22434
15697 22434 11826 10077 379 -15109 -10330 -2413 16527 7054 -324 -21345 -22355 3341 20843
15684 20843 54550 54773 43227 42808 16206 -10676 -33471 -26420 -47110 -40978 -13259 9852 -30235
15671 -30235 -35600 -24770 -12448 18845 12364 -18388 -42789 -3067 44894 76510 108982 110594
15659 110594 111479 75849 69514 84992 100661 127962 143414 124358 157127 186519 234927 265614
15647 265614 294409 299228 327197 340738 347561 387789 396485 396514 403154 350036 302018 272366 255290
15634B55290j5169l9181j9578j3262m3250k3392J427k8273j0440j3827M026Q890
15622F3261K2407m619k4079J228Q217l8995l3721N551L9067P078K9611J2635j2143
15609G5498j7494q736q077l1850J1071Q9P78J5069n450j7324n04J1421O67j4144
15595A1014m184J5110j2825n288J9892l5982j7063J4970J6184J9854k4402n6315
15583e9035j0159j3423K0783L2886N4313L7070R658j7348j8781j9586j5251J5031
15571A6158J9439m973j3814j3258j7899q565N717O058q502J2560K3787o056Q148
15558A8800j512o927n040L916M578j3719j8638J8427k0037J4820J6875r896p989
15545f342J117L2386Q47p922J4022m507K6541k708k3695O308j5784K0549j9738
$$ plain form
15634 255290 240121 200940 181362 168100 124850 101458 102885 74612 64172 50345 54371 63261
15622 63261 85668 81049 56970 58198 66415 27420 -6301 -750 38317 45395 75006 87641 75498
15609 75498 58004 49268 41191 9341 20412 20501 21279 36348 30898 13574 13070 24491 25158 11014
15595 11014 6830 21940 9115 3827 23719 -12263 -29326 -14356 1828 21682 -2720 -59035
15583 -59035 -69194 -82617 -61834 -28948 25365 62435 72093 54745 35964 16378 1127 16158
15571 16158 35597 30624 16810 3552 -14347 -22912 -17195 -11137 -19639 -7079 16708 10652 18800
15558 18800 17288 10361 5321 9237 13815 96 -18542 -115 -20152 -5332 11543 1647 -6342
15545 -6342 -5225 27161 28008 20086 34108 29601 56142 53434 29739 36047 20263 40812 21074
15532B1074j9311N956n568J2879J8834K2779M7264M336k4329l7179k0302k1142
15520E291K5648o726J5511P097j9607j9091o441K3454j0295k125O764n265M788
15507A9003L016J0183P190J0868j012J1954R113j2384J4494K3584m0548k8991
15495B6470K6025J5997J451R781o06l642j670q286K2939L2687r608l7101o296
15482F8141r838K996k7255k723j7976j1457K2469P224J9386j8398j5915q344j5442
15469g132J64J0605N924K2296K218R019k0361J0292J7210K239j6904j7291L3591
15456E1870n047J1232J0619k3822n060L589l712l1083j1854K8196L966p144q57
15443B0893K2700j6345O134J7576J1321j1328j4352j4668J6031P49P196J6639
$$ plain form
15532 21074 1763 7719 2151 15030 33864 56643 103907 108243 83914 46735 26433 5291
15520 5291 30939 24213 39724 46821 27214 8123 1682 25136 14841 12716 19480 14215 19003
15507 19003 22019 32202 39392 50260 49248 61202 70315 57931 72425 96009 55461 26470
15495 26470 52495 68492 69943 79724 79118 75476 73806 65520 88459 121146 111538 74437 68141
15482 68141 58303 61299 34044 31321 13345 1888 24357 31581 50967 32569 16654 8310 -7132
15469 -7132 -6968 3637 9561 31857 34075 43094 22733 33025 50235 52474 35570 18279 51870
15456 51870 46823 58055 68674 44852 39792 43381 39669 8586 -3268 24928 28894 21750 20893
15443 20893 43593 27248 33382 50958 62279 50951 36599 21931 37962 38711 45907 62546
15431F2546o345J9526j0484l5033l5K5k4666j7252j5726k7650K4014J2284J0246
15418h550J5441j9556j9634J5155L8533p014p548L5535K9682l363j8024j4450
15406C6207R820J2082k2648j0542k421Q497Q822Q957O415l3511J4789K1340k8148
15393B9659p340j1732P989J4524q339j505o024l979k6990l3133J8759M8129N482
15380B5500Q346n509J0293J5079j19j627j189k9277j9174L5441K0571r205j6221
15367C2909k4106j7653p936L1251P682k5768J7230K5784P022J6649j1548r601
15355D1915k6332j777l5191l8136k026L9872J8356q832K9479K8423o892j3581
15343B5278p693K57j8042k2174J4962J6973K2541k1445k2413r844K5649L4953
$$ plain form
15431 62546 56201 75727 65243 30210 30175 30200 5534 -11718 -27444 -55094 -31080 -18796 -8550
15418 -8550 6891 -12665 -32299 -17144 21389 14375 6827 42362 72044 68681 50657 36207
15406 36207 46027 58109 35461 24919 22498 30995 39817 48774 55189 21678 36467 57807 29659
15393 29659 22319 10587 18576 33100 24761 23256 17232 13253 -13737 -46870 -28111 20018 25500
15380 25500 33846 28337 38630 53709 53590 51963 50774 21497 2323 37764 58335 49130 32909
15367 32909 8803 -8850 -16786 14465 22147 -3621 13609 39393 46415 63064 51516 41915
15355 41915 15583 13806 -21385 -59521 -61547 -21675 -3319 -12151 17328 45751 38859 25278
15343 25278 17585 17842 -200 -22374 -7412 9561 32102 10657 -11756 -21600 4049 39002
15331C9002R22j5296n810o896J4979J6020J1022k5261j2762J1754K8295o992o370
15318D2607J1952m391l177J2371l326n537j000j2304o309l226j1595j4221L8828
15305D0672q184j9106J4870o192k14l099k7261j2769J6789P27k4722K716M773
15292b1000N750Q116K3541J1813K3144l084n794J0152k4693L401j24J921M171
15279C7314o631k3688n67k5380n812K3836J1029J0373J5092L223o460J7297j3663
15266C5963J3374K068j5853j2384l5031k3530J473O1986j167j5388j0221n003
15254c713J9111j8640j6834l15J0535O479N651j4197J2720j0808J7645J5818j4029
15241I423k896K101k2912j0909O891L7469J8851K2926l362k4705q918j5765R974
$$ plain form
15331 39002 39924 24628 18818 11922 26901 42921 53943 28682 15920 27674 55969 48977 42607
15318 42607 54559 50168 46991 59362 56036 50499 49499 37195 30886 27660 16065 1844 40672
15305 40672 32488 13382 28252 22060 21846 18747 -8514 -21283 -4494 -3767 -28489 -25773 -21000
15292 -21000 -15250 -7134 16407 28220 51364 48280 42486 52638 27945 31346 31222 33143 37314
15279 37314 30683 6995 6428 -18952 -24764 -928 10101 20474 35566 38789 32329 49626 35963
15266 35963 49337 51405 35552 23168 -11863 -35393 -33920 28066 26899 11511 1290 -3713
15254 -3713 15398 -3242 -20076 -20391 -9856 -3377 2274 -11923 797 -10011 7634 23452 9423
15241 9423 6527 8628 -14284 -25193 -18302 19167 38018 60944 57582 32877 23959 8194 18168
15228A8168o464l429l033R502r958L523J65j8137L600L26j7372J2053M5836J2891
15214D7671J0012k6974l7642J736Q407J1265K0940Q829M712N550N426J9625K8083
15201A07640l486l9627n0643k8535r345p551K2301K3725k2761K554J1657J327
15189G256J9448K1948m356k2529K922M600q504m287k1839j7493J3353J5053m141
15176A431J1814R401n790J3564L1746r877l3850k6542j2458q779J5183K3517J0553
15163A9913l1459k738M294m505O289J2210J0090K2290l7454Q516N418j2239k1979
15150b1354k454M564J4133J385k089J4259J3908m2754r666L1908K7094O97M383
15137C4014k89K409J7404k946k7625N052j0437k1392N709K2818j8687j7292k4788
$$ plain form
15228 18168 11704 8275 5242 14744 4786 8309 8474 -9663 -6063 -5737 -23109 -11056 34780 47671
15214 47671 57683 30709 -6933 -5197 3210 14475 35415 44244 48956 54506 59932 79557 107640
15201 107640 104154 64527 13884 -14651 -23996 -31547 -9246 14479 -8282 -5728 5929 7256
15189 7256 26704 48652 44296 21767 24689 29289 20785 16498 -5341 -22834 -9481 5572 1431
15176 1431 13245 22646 16856 30420 62166 52289 18439 -8103 -20561 -29340 -14157 9360 19913
15163 19913 -11546 -14284 -9990 -14495 -8206 4004 14094 36384 -1070 7446 12864 625 -21354
15150 -21354 -23808 -19244 -5111 -3726 -5815 8444 22352 -20402 -30068 1840 28934 29631 34014
15137 34014 33725 36134 53538 50592 22967 28019 17582 -3810 1899 24717 6030 -11262 -36050
15124c6050k5287J5339L8834J2770Q33j6211M855o013L733J9813j9492q097j2570
15111b7543k3142K1489P46K775p369j0956K7174R485m231J0475K0288j7949j7616
15098a6374M686j9338r871q753P284K1178n811R249Q739j2053m881K3454j7149
15085a9640K3631L2756K3996j3238k384J5351l3576j5789J127r227m5211j5689
15073e7893J4094J5594j227k4269j4513J925K9927R634J4743M0203j2751k5824
15061a0357m403M402Q926j3424l376K4504J7350N543R973J3745k2768l5062l4778
15048c9725j5250Q247N448J4873J5735k3783J0810K2813j71J4831o501k5916J0942
15035g647K7444O0k3061k4866J5091N7316j3810J5317R714l4201l9103l0732k2848
$$ plain form
15124 -36050 -61337 -45998 -7164 5606 6439 -9772 -4917 -10930 -7197 12616 -6876 -14973 -27543
15111 -27543 -50685 -29196 -28450 -25675 -33044 -44000 -16826 -7341 -11572 -1097 19191 1242 -16374
15098 -16374 -11688 -31026 -40897 -49650 -42366 -21188 -26999 -17750 -9011 -21064 -25945 -2491 -19640
15085 -19640 3991 36747 60743 47505 45121 60472 26896 11107 12234 3007 -42204 -57893
15073 -57893 -43799 -28205 -29432 -53701 -68214 -66289 -36362 -26728 -11985 28218 15467 -10357
15061 -10357 -14760 -10358 -1432 -14856 -18232 6272 23622 29165 39138 52883 30115 -4947 -39725
15048 -39725 -54975 -46728 -41280 -26407 -10672 -34455 -23645 -832 -1003 13828 7327 -18589 -7647
15035 -7647 19797 19857 -3204 -28070 -12979 44337 30527 45844 55558 21357 -17746 -48478 -71326
15022g1326L3785K7711r559l2426j4018K3143L1322J558Q950m492k203R796n528
15009c287r053J1193L0257L808J6437p271j72J0808J0452j4287k6495j6086p468
14996a164j5400p840J1268R567n52l059r466r679k362j662J8071J6062Q758L585
14982A6127l125j1164l3874k4969k049L6171p764r856J8135m668Q072j821l345
14969b4130m336Q330J360m270P22J0018k237J9185j2383l7733m184J1355m510
14956d2813J0390K9321P634j7349J301n230l914o904j4483j1909K3995m905o202
14943d1068J9076J0313j8747O646M3505L1001l1005k4427k7813r865j4729J122
14931e5991K2558N413R222k2219k2450J6745K3146j3440K4385k422R980O518J463
$$ plain form
15022 -71326 -37541 -9830 -19389 -51815 -65833 -42690 -11368 -9810 -860 -5352 -7555 2241 -3287
15009 -3287 -12340 -1147 29110 32918 49355 42084 41912 52720 63172 48885 22390 6304 -1164
14996 -1164 -16564 -24404 -13136 -3569 -4121 -7180 -16646 -26325 -28687 -30349 -12278 3784 12542 16127
14982 16127 13002 1838 -32036 -57005 -59054 -22883 -30647 -40503 -22368 -27036 -18964 -20785 -24130
14969 -24130 -28466 -20136 -18776 -23046 -22324 -12306 -14543 4642 -7741 -45474 -49658 -38303 -42813
14956 -42813 -32423 -3102 4532 -12817 -11516 -16746 -20660 -27564 -42047 -53956 -29961 -34866 -41068
14943 -41068 -21992 -11679 -30426 -23780 19725 50726 19721 -4706 -32519 -42384 -57113 -55991
14931 -55991 -33433 -28020 -18798 -41017 -63467 -46722 -23576 -37016 -12631 -15053 -5073 1445 2908
14918B908K0051J8270j7280j3358m889j9294j1636q592J872M3800O604K377j0336
14905A0497J5593K0755m988o1034p892p669o583J7391K1520N11p466k9200O727
14892c1838K2849j1590R366J1403K2350K6734J880M628r474m0394p742J8850r938
14879G084r653q539M392k935Q832r411J561j9079J3373J5404J613k1860r827J8368
14865a0677J4237p592j2925J1304L4931p393k9574j0751J4726J966J9545J5443
14853C3240j6945j7219J3580j6519l3545J7965L0383l4424n336L409J6492J5269
14841F350k4818n7648Q031K4976Q403K3620J6300k5142p226j5120J7335L7866
14829A2927K9640j949k8960l3310j8813m085M341R971M017J8097R732J215j7099
$$ plain form
14918 2908 22959 41229 23949 10591 5702 -13592 -25228 -33820 -31948 11852 18456 20833 10497
14905 10497 26090 46845 41857 -19177 -27069 -34738 -41321 -23930 -2410 -1899 -9365 -38565 -31838
14892 -31838 -8989 -20579 -11213 190 22540 49274 51154 55782 46308 5914 -1828 17022 7084
14879 7084 -2569 -11108 -6716 -9651 -819 -10230 -8669 -27748 -14375 1029 2642 -19218 -29045 -10677
14865 -10677 3560 -4032 -16957 -5653 29278 21885 -7689 -18440 -3714 -1748 17797 33240
14853 33240 16295 -924 12656 -3863 -37408 -19443 10940 -23484 -28820 -25411 -8919 6350
14841 6350 -18468 -76116 -68085 -43109 -34706 -11086 5214 -19928 -27154 -42274 -24939 12927
14829 12927 42567 40618 11658 -21652 -40465 -44550 -40209 -30238 -26221 -8124 1608 2823 -14276
14816a4276j0732j1656J125q143o89P909J821L1384L3073j2404j4539l0513j0739
14803c8379M2376J4250j0248Q588m843j3246M141j1372n284P027l578l874J6382
14790A940k373J789p946J3391K2256n20P646p567L239N742j7829J1076P276j7395
14776B0725q352n579J0114J4890l2241K436Q631J5479J7960m0445j0297K097Q530
14763C948r656j3565k0537j0967n139O174R260K4227k297j2271R067L553K024
14750a6179j3735R927k5680q937Q895J9266J9413L595J1473J1447k2885Q532P461
14737A2593m596k5380j8580K0435r550m974r441O754J9118K6534R184j2256j7318
14724g477j5559k1983L987Q528k0639m594j0022J531K4840J9820J233j5499K9083
$$ plain form
14816 -14276 -25008 -36664 -35539 -43682 -44371 -36462 -34641 -3257 29816 17412 2873 -27640 -38379
14803 -38379 3997 18247 7999 16587 11744 -1502 2639 -8733 -14017 -6990 -10568 -14442 1940
14790 1940 -433 1356 -6590 6801 29057 28537 36183 28616 31855 37597 19768 30844 38120 20725
14776 20725 12373 6794 16908 31798 -443 1993 10624 26103 44063 3618 -6679 -4582 3948
14763 3948 -5708 -19273 -39810 -50777 -55916 -49742 -40482 -16255 -18552 -30823 -21756 -18203 -16179
14750 -16179 -29914 -19987 -45667 -54604 -45709 -26443 -7030 -3435 8038 19485 -3400 5132 12593
14737 12593 7997 -17383 -35963 -15528 -25078 -30052 -39493 -32739 -13621 12913 22097 9841 -7477
14724 -7477 -23036 -45019 -41032 -32504 -53143 -57737 -67759 -66228 -41388 -21568 -20335 -35834 -6751
14711f751n808o985m264k2271r072J0301l515j2171o429J7530M3726J6430j520
14698I201R66r849q144O474J2683J1653k2403J038o362K1763p376j239j674L940
14684A0671j4792j3010j5756q591J2173J3449L5601M4232O618j8368k9743j3942
14672H542P806J2305n408j3398j8407j9465j0766J7048k1478R599L441M0590J1084
14659B1493M698K167j9020P702J8453j9958J745k4560j8712r368J1886n60L319
14646b0715L3593l382m3862j4626O214K0541J0629l1124j353Q819J3839J4877
14634f550j6164k8341K9088n417j485j3128q944m61K3201K4400K5210L722o1725
14621c6594k9581O551J5437J2701j195K0114J5337k6230j1522K4150L2351k923
$$ plain form
14711 -6751 -12559 -19544 -23808 -46079 -55151 -44850 -48365 -60536 -66965 -49435 -5709 10721 9201
14698 9201 10167 318 -7826 -1352 11331 22984 581 1619 -4743 17020 9644 8405 6731 10671
14684 10671 -4121 -17131 -32887 -41478 -29305 -15856 19745 63977 70595 52227 22484 8542
14672 8542 16348 28653 23245 9847 -8560 -28025 -38791 -21743 -43221 -33622 -30181 10409 21493
14659 21493 26191 28358 9338 17040 35493 15535 17280 -7280 -25992 -35360 -23474 -24034 -20715
14646 -20715 12878 9496 -34366 -48992 -42778 -22237 -11608 -42732 -44085 -35266 -21427 -6550
14634 -6550 -22714 -51055 -21967 -27384 -28869 -41997 -50941 -51402 -28201 -3801 21409 25131 -36594
14621 -36594 -66175 -59624 -44187 -31486 -32681 -12567 2770 -23460 -34982 -10832 21519 18596
14609A8596l0270k6446L575L0972j5389N860L126j820l329l2490j2119l335P457
14596e5612j0416K1143o184J0130J8037J4054l627Q620R718j2305m528L612k025
14583i383K1647J4989j965o63o535k7172j5604J4415L621k5991K0572l0515l2052
14570g4636n844K4409K1009J5511J9165j0205j2224M918n41l940p270K3537P915
14557A804j2275J38Q344L053l5685M309K4461K4850k5921j0024o697j2034j4401
14544e0078J1767p05Q665K546k0516J4682K6298J2390j5059j3358J1376L9822
14532B7830p589j4543j2671O427o524J2067N742l089k9980j2671K0135K0641l067
14519B708q672k0838J2710p420J2212Q980N526p903j0819k7712J0804K4726j0262
$$ plain form
14609 18596 -11674 -38120 -34545 -3573 -18962 -13102 -9976 -11796 -15125 -47615 -59734 -63069 -55612
14596 -55612 -66028 -44885 -51069 -40939 -22902 -8848 -12475 -3855 5863 -6442 -10970 -7358 -9383
14583 -9383 12264 27253 25288 24625 18090 -9082 -24686 -10271 -6650 -32641 -12069 -42584 -74636
14570 -74636 -80480 -56071 -35062 -19551 -386 -10591 -22815 -17897 -18438 -22378 -29648 -6111 1804
14557 1804 -10471 -10333 -1989 1064 -34621 -30312 -5851 18999 -6922 -16946 -23643 -35677 -50078
14544 -50078 -38311 -39016 -30351 -27805 -48321 -33639 -7341 5049 -10010 -23368 -11992 27830
14532 27830 20241 5698 -6973 -546 -7070 4997 10739 7650 -22330 -35001 -14866 5775 2708
14519 2708 -5964 -26802 -14092 -21512 -9300 -320 5206 -2697 -13516 -41228 -30424 -5698 -15960
14506a5960M331j7960p274K2689J8765j375j5426j27K4702K8388q997k9449k760
14493d53N070k3944j4786K3534M018N385j4105J5575k7321J832o96k0090j7868
14480f3849K4114M4304O898J9001K005k9819k0416q481J0105m405M05l098J0641
14467a2595J3731j9958l4562K539J2341J1495j2708j5467K3923K1063L792n68
14455f974q154j4134r842n379J1323K3114J5414l5501j6387N514K6369K5240k7
14442A0576l692P170j0390q701q617p814k8902J4084P222L119j5985o465j4685
14429f3080Q159J458k486J7215K3157J9855k4400k3028p631J5038j9007N626N576
14416d3548P810R600p471K107K2539q060J018J5183N52l95J6516q448k0286j8187
$$ plain form
14506 -15960 -11629 -29589 -36863 -14174 4591 3216 -12210 -12337 12365 40753 31756 2307 -453
14493 -453 4617 -19327 -34113 -10579 -6561 -1176 -15281 294 -27027 -25195 -25891 -45981 -63849
14480 -63849 -39735 4569 11467 30468 32473 2654 -17762 -26243 -16138 -20543 -20138 -23236 -12595
14467 -12595 1136 -18822 -53384 -50845 -38504 -27009 -39717 -55184 -31261 -10198 -6406 -6974
14455 -6974 -15128 -29262 -39104 -44483 -33160 -10046 5368 -30133 -46520 -41006 -14637 10603 10576
14442 10576 6884 14054 3664 -5037 -13654 -21468 -50370 -36286 -29064 -25945 -41930 -48395 -63080
14429 -63080 -54921 -53463 -55949 -38734 -15577 4278 -20122 -43150 -50781 -35743 -54750 -49124 -43548
14416 -43548 -35738 -26138 -33609 -31502 -8963 -17023 -16005 -822 -270 -665 15851 7403 -12883 -31070
14402c1070j44P440j0911k455q473q561j7437J8760N6329O508j5998j6162k6349
14389d8523J3425r154R481j3146k264j026K0293J0267M3297k076j2112q588j1250
14376a1376p059j8921J4215K2269J0249j0631j7808K977M813j7037n474J3722
14364b0061r926q525O765L789L5115J9143R308P912k1525l0790o690J7153M0870
14351D2538K1502l2635l6976j815O299j5944j971J5442P51O612L9734Q422j8990
14338C2969l9395j9145k1556j0851M296L0196L8448k8242l243L979l694J7241
14326A003R702L129L870n116j4117O022P256l809J0511K681j8180J9114J5409
14313C7475k6143J118N814J0483k465J9180N263l7789m0570j0985M0476J0842
$$ plain form
14402 -31070 -31214 -23774 -34685 -37140 -45613 -54174 -71611 -52851 3478 9986 -6012 -22174 -48523
14389 -48523 -35098 -44252 -34771 -47917 -50181 -51207 -30914 -20647 22650 20574 8462 -126 -11376
14376 -11376 -18435 -37356 -23141 -872 9377 -1254 -19062 -16085 -11272 -28309 -33783 -20061
14364 -20061 -29987 -38512 -31747 -27958 7157 26300 35608 43520 21995 -8795 -15485 1668 42538
14351 42538 64040 31405 -5571 -7386 -1087 -17031 -19002 -3560 -2809 3803 43537 51959 32969
14338 32969 -6426 -25571 -47127 -57978 -53682 -23486 14962 -13280 -16523 -12544 -16238 1003
14326 1003 10705 13834 17704 12588 -1529 4493 11749 7940 18451 21132 2952 22066 37475
14313 37475 11332 12450 18264 28747 26282 45462 50725 12936 -27634 -38619 1857 12699
14301A2699M754J5659o935k0703J265J543O149K5186k8197q058r473l198K0848
14288A1539k0700j4702P173k971l500k785j6019N482N524J993K5282N6191R329
14275F1836K3353O253k4638n2669m1540p070J7111Q344Q98L976j1611m121J2358
14262g520Q203K3264l1447j9155l592R341J2240j5808P670K9041K4230o445j0226
14249A9796p480k437k0270k7797q018P63K8298J8500j859l306j573j4257r08L5287
14235A4739J7226q078j8575M598J1773m2124l669n27K1199j3890k3200k3032R7
14222f3463J4371J8966k12p779j094M385j5988j6911L0579M2117L152K19j6500
14209h158r875N990k7744O336M1798P035p868n024l6871R985J2111J6890k739
$$ plain form
14301 12699 17453 33112 26177 5474 6739 8282 14431 39617 11420 3362 -6111 -9309 11539
14288 11539 -9161 -23863 -16690 -19661 -23161 -25946 -41965 -36483 -30959 -28966 -3684 52507 61836
14275 61836 85189 91442 66804 14135 -27405 -34475 -17364 -9020 -8122 -4146 -15757 -19878 -7520
14262 -7520 683 23947 -7500 -26655 -30247 -20906 -8666 -24474 -16804 12237 36467 30022 19796
14249 19796 12316 9879 -10391 -38188 -46206 -45443 -17145 1355 -504 -3810 -5383 -19640 -20548 14739
14235 14739 31965 23887 5312 9910 21683 -20441 -24110 -24637 -3438 -17328 -40528 -63560 -63463
14222 -63463 -49092 -30126 -30338 -38117 -39211 -34826 -50814 -67725 -37146 4971 8123 8342 -8158
14209 -8158 -18033 -12043 -39787 -33451 8347 15382 7514 2490 -34381 -24396 -12285 4605 1866
14196A866q94j3758q28k9200p981J0613l809J9885L9282J7433j3240l9316N57
14183a9390l648J9692R319K0750j2683M340L272o920K790l1402j5650R644j0738
14170c0624Q186J1933j2149j5705j5889j8057J851J2091j2628o74L2310L1908
14158g447M150k4268j4706L076J2394K0686Q784J0464k3022k1225J2350J859K463
14145a4442k3048K0210K5386R392j5776k1766j428j6018j6152P61J0846J7967
14133b4068j756k0836j2836M1811O6840J8503l1546m9872m2572P160j0214k0941
14121h0327K277L7089J0352j2659q529K6303L6184L2992n095J2513j4755m4502
14109h157J0295J1780k3503q341O759J2399j5321o605L3342M804k1596J1229o780
$$ plain form
14196 1866 972 -12786 -13614 -42814 -50795 -40182 -43991 -24106 15176 32609 19369 -19947 -19390
14183 -19390 -23038 -3346 5973 26723 14040 18380 21652 14732 17522 -13880 -29530 -19886 -30624
14170 -30624 -22438 -10505 -22654 -38359 -54248 -72305 -70454 -58363 -70991 -71665 -39355 -7447
14158 -7447 -3297 -27565 -42271 -39195 -26801 -6115 2669 13133 -9889 -31114 -18764 -16905 -14442
14145 -14442 -37490 -17280 8106 17498 1722 -20044 -21472 -37490 -53642 -52881 -42035 -24068
14133 -24068 -25824 -46660 -59496 -17685 49155 67658 36112 -13760 -56332 -49172 -59386 -80327
14121 -80327 -78050 -40961 -30609 -43268 -51797 -25494 10690 43682 38587 51100 36345 -8157
14109 -8157 2138 13918 -9585 -17926 -11167 1232 -14089 -20694 12648 17452 -4144 7085 305
14096C05r601j927P825j6560J2657M0276m5286M843J8656j7132l987O447q920
14083a2404p176l204L241M335k201j0065m368K0884j1264K4506J2282k7953l0344
14070d3731J1486M610m9783J3900M1845K1715r213K908l82r152M522K8439K1479
14057C8643l1373j7919L6704P718k4014j2123o574J1395r447k7601n871J7718
14045b2744j283k4521M948m903j1823K2012J3478l1323n196K9511J7768J298k923
14032a5701q342q650M587J2211r437N718q420J9652K356K5010j9685l0858k868
14019c4427J3123o174n529R642o322L2538P353n745N675l870Q23l844K9596J0249
14005D3088k5044k471j7024R649J1275q328r279l332Q372K1212k1348o105J6075
$$ plain form
14096 305 -9296 -11223 -3398 -19958 -7301 32975 -12311 -7468 11188 -5944 -9931 -3484 -12404
14083 -12404 -19580 -22784 -19543 -15208 -17409 -27474 -31842 -10958 -22222 2284 14566 -13387 -43731
14070 -43731 -32245 -27635 -77418 -63518 -21673 42 -9171 -6263 -6645 -15797 -11275 17164 38643
14057 38643 7270 -10649 26055 33773 9759 -2364 -8938 2457 -6990 -34591 -40462 -22744
14045 -22744 -24027 -48548 -43600 -48503 -60326 -38314 -24836 -56159 -61355 -31844 -14076 -12778 -15701
14032 -15701 -24043 -32693 -28106 -15895 -25332 -19614 -28034 -8382 -6026 18984 -701 -31559 -34427
14019 -34427 -21304 -27478 -33007 -23365 -29687 2851 10204 4459 10134 6264 7087 3243 32839 43088
14005 43088 18044 15573 -1451 8198 19473 11145 1866 -1466 6906 28118 6770 665 16740
13992A6740J1078j1915k2752j9851N231m513l453j491J9856N522j2343O12J3003
13979d276p092K964J883j1534j0788O21n019j270J8864R498L0314P077k3706j3938
13965f402J4395k0183j2474J1364J9394k196J3877l7136k6301r853P339K5195
13953b2981L3568j123n098k1811j8119J376k0562k2109l611J1157L4474L6816
13941A977r935j517j0128q948p9J6338J4654J6006j1582j1006j0478o247L505
13928a7440j4744J7722j5521j0705k151O462k6749J8658M9354J6300J8862k661
13916C7387j9988j3943J0545M696J6997j0931j3719J8381q727k6957L244j3616
13904a6631j1321J0143J180j801J7815o458j138j6662N579L5200L5951j6664l7841
$$ plain form
13992 16740 27818 15903 -6849 -26700 -21469 -25982 -29435 -30926 -11070 -5548 -17891 -17279 -4276
13979 -4276 -11368 -8404 -6521 -18055 -28843 -28222 -33241 -34511 -15647 -6149 24165 31242 7536 -6402
13965 -6402 7993 -12190 -24664 -13300 6094 3898 17775 -19361 -45662 -55515 -48176 -22981
13953 -22981 10587 9464 4366 -17445 -35564 -34188 -54750 -76859 -80470 -69313 -34839 1977
13941 1977 -7958 -9475 -19603 -28551 -28630 -12292 2362 18368 6786 -4220 -14698 -20945 -17440
13928 -17440 -32184 -14462 -29983 -40688 -42839 -36377 -63126 -44468 4886 21186 40048 37387
13916 37387 17399 3456 14001 18697 35694 24763 11044 29425 20698 -6259 -3015 -16631
13904 -16631 -27952 -17809 -16629 -18430 -615 -7073 -8211 -24873 -19294 15906 51857 35193 -2648
13891b648j6802j6364l65J5499M0825J9770Q250j1802q154j0464n288k1800J0429
13878A086L570r099j028N210K697K3702j563m4161m482p510j1469Q398R21K3939
13864i789Q944k947j7567j5474K7581K0298N951K755J0489j2933p62K1497P747
13851D5790k7071k9887j0764r608K4492J358p062P699N738m32j5013l8715j6291
13838f9766J1845O043O553J7451R090J1128J2159j4676m103J6340N015k3897j8273
13825c5091Q990L3854K4422k4070k4378l755J9279r651l175O66j0379r252K276
13812c0264K782K4435J4422m4396j2225L655J9578k472k4947k0782K1247L8667
13800a0300K8039l549q136k1751m1743l690N36Q145Q020k7148M887R507L7521
$$ plain form
13891 -2648 -19450 -35814 -36179 -20680 20145 39915 48165 36363 28209 17745 12457 -9343 1086
13878 1086 4656 -4443 -5471 -261 2436 26138 24575 -19586 -24068 -31578 -43047 -34649 -33728 -9789
13864 -9789 -845 -3792 -21359 -36833 -9252 11046 16997 19752 30241 17308 16546 38043 45790
13851 45790 18719 -11168 -21932 -31540 -7048 -5690 -12752 -5053 685 253 -14760 -53475 -69766
13838 -69766 -57921 -51878 -45325 -27874 -18784 -7656 4503 -10173 -14276 2064 7079 -16818 -35091
13825 -35091 -26101 7753 32175 8105 -16273 -20028 -749 -10400 -13575 -12909 -23288 -32540 -30264
13812 -30264 -27482 -3047 11375 -33021 -45246 -41591 -22013 -24485 -49432 -70214 -48967 -10300
13800 -10300 17739 14190 6054 -15697 -57440 -61130 -60594 -52449 -44429 -71577 -66690 -57183 -19662
13787a9662M6763L147p280K5957R56l8585n830R643l03j8453M790J6851j5786
13774B208l8188R827J6316J0631L82j2063j1801r006J6164J264K0597L2391P000
13761D5722j2757k7958k618M431K2271j9437m2584k3897L2057J5912K2648q381
13749E409j121r598j5969k5405m275l042j0270J7070R256L1698J4089K311l458
13736F695q704k3534J0118J9364J1834k5329j8911M296R59K7347L6960R037j3275
13723C6857l2227j2060M110j1105j5191j0732J5228K5368j4345N790K7988L1533
13711E1214k521k3668Q258k3518r264j3959N551L2501k161j3833m741J6172l0149
13698a0118j9868o433R226p713J5418J3922L275r942k0674j677j4715J4761L4008
$$ plain form
13787 -19662 27101 30248 22968 48925 49881 11296 5466 15109 14806 -3647 1143 17994 2208
13774 2208 -35980 -26153 -9837 794 1176 -10887 -22688 -31694 -15530 -14266 6331 38722 45722
13761 45722 32965 5007 2389 6820 29091 9654 -32930 -56827 -24770 -8858 13790 5409
13749 5409 4288 -5310 -21279 -46684 -50959 -54001 -64271 -47201 -37945 -6247 7842 10153 6695
13736 6695 -2009 -25543 -15425 3939 15773 -9556 -28467 -24171 -23212 4135 41095 50132 36857
13723 36857 4630 -7430 -3320 -14425 -29616 -40348 -25120 248 -14097 -8307 19681 51214
13711 51214 48693 25025 33283 9765 501 -13458 -7907 24594 22433 8600 3859 20031 -10118
13698 -10118 -29986 -36419 -27193 -34906 -19488 -5566 -2291 -12233 -32907 -34584 -49299 -34538 -530
13685e30P588j6283O869J6384K8352j8026j4225n671K267J5837K182p629k7047
13672i932q945O196p732R560K3981j328L191M231J0826M766J114J9117j4102K710
13658D3653j346O623K0706m78l9807R441j7845l235L061k3750M4035K8591O501
13645G6150l6753o279l9936O903J7282q938k9735j0701M19j250J1679J6030j921
13632g050m0550j7980l86M1740O001o833K1629K515M023L89j5639J3432n305J0021
13618F007j9588Q720N795K0284J8009k2101j7316o328K2459L665k6292m288O084
13605d890j9726k040k680J3668L2963J0610n585P620j9487k0637j1547k2465M545
13592c9651M1850K6564l1074j5412L0428k5723n666J5045O869j5286j2745J8998
$$ plain form
13685 -530 7058 -9225 -2356 14028 42380 24354 10129 4458 6725 22562 24744 17115 -9932
13672 -9932 -18877 -12681 -20413 -10853 13128 11800 14991 19222 30048 34814 35928 55045 40943 43653
13658 43653 42307 48930 69636 69158 29351 38792 20947 17712 20773 -2977 41058 69649 76150
13645 76150 39397 33118 -6818 85 17367 8429 -21306 -32007 -31588 -32838 -21159 -5129 -7050
13632 -7050 -47600 -65580 -65966 -24226 -18225 -25058 -3429 -914 3109 3498 -12141 1291 -4014 6007
13618 6007 -13581 -4861 934 21218 39227 17126 -190 -6518 15941 19606 -6686 -10974 -4890
13605 -4890 -24616 -26656 -29336 -15668 17295 27905 22320 29940 10453 -10184 -21731 -44196 -39651
13592 -39651 2199 28763 -2311 -17723 12705 -13018 -18684 -3639 3230 -12056 -24801 -5803
13580e803L6495Q3o536M497k2179l9969J1549J0087J5899N048k1326m884K7035
13567I996Q59P064j1705K2799r09l3496O736J9805j7384j5677n8536J7702N1702
13554a044J4950m711k4290q327p730J3030K5969j7716Q50J8979j4817j9861P313
13541a7405K4832o372K5895k346j8338r394J0753j9388j1605P825L992P162o410
13528a0799k281J8415M162l1174L391K7487m372q30L301J2169k4786p413j5413
13515b8143K0131M1157J546O739l3969M5n109J102j8795m495L4831M1569k2457
13502C4152j0660l0810k4367K4001J4201O431k6903j4199q342L422K1356o624
13490a8342l1229m6K4589P025j4780Q729L088k4428J3052J9375J2494p48J671
$$ plain form
13580 -5803 30692 30775 24239 28736 6557 -33412 -21863 -11776 4123 9171 -12155 -17039 9996
13567 9996 10855 17919 6214 29013 28104 -5392 1344 21149 3765 -11912 -70448 -52746 -1044
13554 -1044 13906 9195 -15095 -23422 -31152 -18122 7847 -9869 -9019 9960 -4857 -24718 -17405
13541 -17405 7427 1055 26950 24604 6266 -3128 7625 -11763 -23368 -15543 -11551 -4389 -10799
13528 -10799 -13080 5335 9497 -21677 -18286 9201 4829 3999 7300 19469 -5317 -12730 -28143
13515 -28143 -8012 33145 34691 41430 7461 7506 2397 3499 -15296 -19791 15040 56609 34152
13502 34152 23492 -7318 -31685 -7684 6517 12948 -13955 -28154 -36496 -33074 -11718 -18342
13490 -18342 -49571 -49617 -25028 -18003 -32783 -24054 -20966 -45394 -32342 -12967 -473 -1221 450
13477D50Q971j5722K331j029J45j9224l4317J4395L4881J4095P590J3768O662
13464C2996K0401q132m5544k3222L3379L7796J8477j7101k8823j3672j6339j4812
13452b4596k327J0407Q434n4688k7415J7194L5286R248p338o880j0527j8634K8058
13439d3778K7562J7896J2574q890n952J383J396p970K3700K6672j4919q871k3630
13426b827l542K955q974J1237K6445j6104j6898j0700Q088L8270J6249k0451j5886
13413G862k2761l5499o668N6802J4955j8366M891k216n26o419O607j6408m277
13400b2023O266k1939j2700J2489O1478L3080j249k2194k739l932q291N063J5866
13387C9175K3107k5209n6626k2816o175R950J0350M070J4125q772K5938L6696
$$ plain form
13477 450 9421 -6301 -3970 -4999 -4854 -24078 -58395 -44000 -9119 4976 12566 26334 32996
13464 32996 53397 45265 -279 -23501 9878 47674 66151 49050 20227 6555 -9784 -24596
13452 -24596 -26923 -16516 -8082 -62770 -90185 -72991 -37705 -28457 -35795 -42675 -53202 -71836 -43778
13439 -43778 -16216 1680 14254 5364 -588 795 2191 -5779 17921 44593 29674 20803 -2827
13426 -2827 -6369 -3414 -12388 -1151 25294 9190 -7708 -18408 -10320 27950 44199 23748 7862
13413 7862 -14899 -50398 -57066 -264 14691 -3675 1216 -1000 -1526 -7945 -1338 -17746 -22023
13400 -22023 -15757 -37696 -50396 -37907 23571 56651 55402 33208 30469 26537 18246 23309 39175
13387 39175 62282 37073 -19553 -42369 -48544 -38594 -28244 -24174 -10049 -18821 7117 43813
13375D3813J299j1506n379k9725k3481r02J5062p327j1270j0617k299K7143L595
13362a1594J0591M175j5826j0422p212N238o480L1454L609m406j5975j1289N605
13349b2532K083k8478J7492L4937m404m912j6629j5234j3955L791p523l359R106
13336d9617J0896R188J9693J0918k485K5996q396k8762j0368j7812k382J2460
13324c0671l589l464o181j0444j4232P835M8124j0501L465K5660k1466m996J3852
13311f608Q990p897l626K2164j2164m224J6562j7067j2479j192k2035K4873P386
13298g317K1138J01j6578j9183J897p42k6967J4118m57L457p369R048J3478j0984
13284b6360p386K857L270J967R175Oj8864m802Q887Q411L573q362k6640K2386
$$ plain form
13375 43813 45112 33606 28227 -1498 -24979 -25881 -10819 -18146 -29416 -40033 -42332 -15189 -11594
13362 -11594 -1003 3172 -12654 -23076 -30288 -25050 -31530 -76 3533 -873 -16848 -28137 -22532
13349 -22532 -20449 -48927 -31435 3502 -902 -5814 -22443 -37677 -51632 -47841 -55364 -58723 -49617
13336 -49617 -38721 -29533 -9840 1078 -1407 24589 16193 -12569 -22937 -40749 -43131 -30671
13324 -30671 -34260 -37724 -43905 -54349 -68581 -60746 -12622 -23123 -19658 6002 -15464 -20460 -6608
13311 -6608 2382 -5515 -9141 13023 859 -3365 13197 -3870 -16349 -17541 -39576 -14703 -7317
13298 -7317 13821 13922 -2656 -21839 -19942 -20684 -47651 -33533 -33990 -30533 -37902 -28854 -15376 -26360
13284 -26360 -33746 -30889 -27619 -25652 -16477 -16471 -35335 -40137 -31250 -22839 -19266 -27628 -54268 -31882
13270c1882j0840o604r167m567K6734J9341L408l3428m0295n925N1017J4942m753
13257c2019Q018J1041j0613k1183p530R792K2297K2519J1106L657O900J415j6303
13244I097l7257m1012j5577N0452N9150K3480Q59j947k2772p20L352j3367m934
13231H804r270l5359O644J5603Q947K5676j7575l7033K0627l011k2879Q429J4351
13218a6046Q57p531l1770l378J8158J6524K8792j4551N24K1720k0444j1755P033
13205a1867M6811K7395j0655k0627k5167j174J8485k0035k7106q72j1691J2262
13193b4241J8780j4043L3660J8519j307r995P759r801K4732L4697j440m7808j698
13180B7814N384o466j5343m3101J081J4081R307j1510k3213k4969M238J7811N650
$$ plain form
13270 -31882 -42722 -49326 -58493 -63060 -36326 -16985 -13577 -47005 -87300 -93225 -42208 -27266 -32019
13257 -32019 -24001 -12960 -23573 -44756 -52286 -42494 -20197 2322 13428 17085 23985 25400 9097
13244 9097 -28160 -69172 -84749 -34297 24853 48333 49192 47245 24473 23753 27105 13738 8804
13231 8804 -466 -35825 -29181 -13578 -4631 21045 3470 -33563 -12936 -15947 -38826 -30397 -16046
13218 -16046 -15189 -22720 -54490 -57868 -39710 -23186 5606 -8945 -8421 13299 -7145 -18900 -11867
13205 -11867 34944 62339 51684 31057 5890 4716 23201 3166 -23940 -24812 -36503 -24241
13193 -24241 -5461 -19504 14156 32675 31368 21373 29132 19331 44063 78760 77320 29512 27814
13180 27814 33198 26732 11389 -31712 -30631 -16550 -7243 -18753 -41966 -66935 -62697 -44886 -39236
13167c9236m48O591J1077K5454q307J3013J0494j5803Q055o115k4173j2927K8200
13154d125n294J7054O027J3209J5289p93J92M153l2352k081K14j9609m269j927
13140a4312j4002J2169M2278K4946J0059k1312m5789l5739k2187q42L275L5574
13128b5882K4059j6596j3947k1079J8414L036j9285L1342K5095K2966j240k4433
13116B450J2282k2356J7232O948j9960l8414k3764J5148K2828J2908O614K8233
13104B0149j78j8605j3330l3932L753l3j5604P001j0172j2707P010M7230J9866
13091D48l3014q577K9506n990K8327q436n0263k915K2651P575J1446L621J272
13078d349L521q343o752j2039J8976J5242j3184N049L906q345K5771L4855j2176
$$ plain form
13167 -39236 -39684 -33093 -22016 3438 -4869 8144 18638 2835 10890 4775 -19398 -32325 -4125
13154 -4125 -9419 7635 13662 26871 42160 41367 41559 45712 13360 11279 11493 -8116 -12385 -14312
13140 -14312 -28314 -16145 26133 51079 61138 39826 -5963 -41702 -63889 -64731 -61456 -25882
13128 -25882 -1823 -18419 -32366 -53445 -35031 -31995 -51280 -19938 5157 28123 26883 2450
13116 2450 14732 -7624 9608 16556 -3404 -41818 -65582 -50434 -27606 -14698 -8084 20149
13104 20149 19971 1366 -11964 -45896 -42143 -42176 -57780 -50779 -60951 -73658 -66648 -19418 448
13091 448 -32566 -41143 -11637 -17627 10700 2264 -47999 -50914 -28263 -20688 -9242 -5621 -4349
13078 -4349 -828 -9171 -15923 -27962 -8986 6256 -6928 -1879 2027 -6318 19453 54308 42132
13065D2132k3615J5006l2191q560M189L6826J3277l767j0713n358R331J011k946
13052C4622J2374J7844k1497k9363k8429k5305J2367Q4K5389J5359K7046L4944
13040G5435j037l5717k6292j0362l317L3297k159j2800L05o597j0407L203K0305
13027B3857j0488k3624j2703O179K205J574J578j8065J2964J913J5426K668p158
13014c674J3150K4671j0271m4767J537J6969m9j0831L741J8945L4063j5008k7386
13001A090R370R721m688m304J013J1274J2228J5019J1070r923r68K747j5022l2386
12987F241J5378L545q519j6676j3655r602q360p572j4042o641K563K8794J4954
12974a3592J9079K3215M0252L107N322P177p390J9964p175k6800J0637Q682m0821
$$ plain form
13065 42132 18517 33523 1332 -7228 -3039 33787 47064 43297 32584 27226 36557 37568 34622
13052 34622 46996 64840 43343 13980 -14449 -39754 -27387 -27303 -1914 13445 40491 75435
13040 75435 74398 38681 12389 2027 -1290 32007 29848 17048 17353 10756 349 3552 23857
13027 23857 13369 -10255 -22958 -16779 -14574 -13000 -11422 -29487 -16523 -14610 816 3484 -3674
13014 -3674 9476 34147 23876 -20891 -19354 -2385 -2434 -13265 -9524 9421 43484 28476 1090
13001 1090 10460 20181 15493 11189 12202 23476 35704 50723 61793 51870 50902 53649 38627 6241
12987 6241 21619 25164 16645 -31 -13686 -23288 -31648 -39220 -53262 -59903 -57340 -28546 -13592
12974 -13592 5487 28702 68954 72061 77383 84560 77170 97134 89959 63159 73796 82478 41657
12961D1657k2641j240j8574R191j5197J6184m246P531o354j2246J5231j9382j9269
12948b9355J5032J3018J6752N633j416j2769k7759k7244L0562M7443L5405j3358
12936E1944J5670J114J182k4016q56j7856j0696J6946l858k1903m8981l2124J0407
12923f3027J9234J1433L9550K2705o785P945j6626j9969K7396R695j4953K978
12911A9576J5768L217j5800K446K2518j2950k968J1434k49p809k6629k0708J741
12898a0413L3990J3415k737j2073K817J7704j3490m6416k4385J7329P573l929
12886b0615J2557J5838j6179l270q801K827J6967j3542R518N534j2213j3465o157
12873c1001K3196J8504r365k1156r089J5647J1052J3913J0150O425m154J3871
$$ plain form
12961 41657 19016 17776 -798 8393 -6804 9380 5134 12665 6311 -5935 9296 -10086 -29355
12948 -29355 -14323 -1305 15447 21080 19664 6895 -20864 -48108 -17546 29897 65302 51944
12936 51944 67614 68728 69910 45894 45038 27182 16486 33432 29574 7671 -41310 -73434 -63027
12923 -63027 -43793 -32360 7190 29895 23110 31055 14429 -5540 21856 31551 16598 19576
12911 19576 35344 38561 22761 25207 47725 34775 31807 43241 42992 35183 8554 -12154 -10413
12898 -10413 23577 36992 34255 22182 24999 42703 29213 -17203 -41588 -24259 -16686 -20615
12886 -20615 -8058 7780 -8399 -11669 -20470 -17643 -676 -14218 -4700 834 -11379 -24844 -31001
12873 -31001 -7805 10699 1334 -19822 -28911 -13264 -2212 11701 21851 28276 24122 37993
12861C7993K5133L143k5914j4057k0567L202R436j746n615r220j9876L653O944
12848g491K1812J8918L578J4866P232l2430m6629j9329k1754J4967J6252J9897
12836a0111Q192R398O519M585Q719J0714J0656N394m5694j255J7856K2244J804
12823D9021Q138N087L337k2610m9124l5068j4459J0518L7990J164r69q847j8496
12810c4318q613K2670P982K0579J8796J3953n769o490k170j465j8892k5878K7397
12797G782J5880l2422Q386K5639J6125k741l996Q953J3744J50O461j4673j9834
12784B9454M146k4779j1697q08K1764J7847L7624j1285l224k9930N069p067j041
12771B6073m257J448l08j5622p55l725Q973l4200l499o481K7865q928l0966j7528
$$ plain form
12861 37993 63126 66269 40355 26298 5731 8933 18369 16623 11008 1788 -18088 -14435 -7491
12848 -7491 14321 33239 36817 51683 58915 26485 -20144 -39473 -61227 -46260 -30008 -10111
12836 -10111 -1919 7479 13998 18583 27302 38016 48672 54066 8372 7117 24973 47217 49021
12823 49021 57159 62246 65583 42973 -6151 -41219 -55678 -45160 -7170 -6006 -6975 -15822 -34318
12810 -34318 -42931 -20261 -12279 8300 27096 41049 35280 28790 26620 25155 6263 -19615 7782
12797 7782 23662 -8760 -374 25265 41390 38649 34653 43606 57350 57500 63961 49288 29454
12784 29454 33600 8821 -2876 -3684 18080 35927 73551 62266 59042 29112 34181 27114 26073
12771 26073 21816 23264 22956 7334 6579 2854 11827 -22373 -25872 -32353 -4488 -13416 -44382 -61910
12757f1910J7328j7157j4275N998K1354K8994L2521K6954K910J7091j4826o705
12745C8277K4149j9418j7570o383J3200j4096j0675j5546k650K4962M4523j0397
12733D8376p433K0440k4389p471r826j7233k9053P448K8408L547P651J5265M9891
12720H5621M9325K3654j2487m0553n0897m2320l406m260j39J945K0520j5303J8698
12707C0398r421l2404j8307m8346L339O695O824K5371l7J5159L1290j3900k7981
12694c1320N720N468J3450J3050p981n771L859l394Q614p472m931j7879M927J3551
12680a0109k4019k7870J7395K1180K8418p03k2480R539J3021L1626l922j1734
12668B0342q831l647q135J0935J1244k4854r396J6083k7828j1236Q10j1119M3627
$$ plain form
12757 -61910 -44582 -61739 -76014 -70016 -48662 -19668 12853 39807 42717 59808 44982 38277
12745 38277 62426 43008 25438 19055 32255 18159 7484 -8062 -10712 14250 58773 48376
12733 48376 40943 61383 36994 29523 19697 2464 -26589 -19141 9267 12814 20465 35730 85621
12720 85621 134946 158600 146113 105560 54663 12343 8937 4677 4538 6483 27003 11700 30398
12707 30398 20977 -11427 -29734 -78080 -74741 -68046 -61222 -35851 -35888 -20729 10561 -3339 -31320
12694 -31320 -25600 -20132 -6682 6368 -1613 -7384 -3525 -6919 1695 -5777 -10708 -28587 -23660 -10109
12680 -10109 -34128 -61998 -44603 -23423 4995 4292 -18188 -8649 4372 35998 32076 20342
12668 20342 11511 7864 -271 10664 21908 -2946 -12342 3741 -24087 -35323 -34513 -45632 -2005
12655b005K5364j746N2187J6147k7881m3101m5971l6236r461K4043N0856P033
12643I229j1088k0855q200j1993J7527O324J0058j2746K1232K9520k7216K4097
12631B5889r73j6789j4653R380o65M134r356k0597J496K1795J5216R39k7943O72
12617a1455o96M704J8700j0132P251J4210r523l364j0842j304J0688N914j3140
12604A011m3430O83R502N9243K2558j9342l5914P846q797l0467L342Q889k5764
12591e0640j0779r198K471J6017K0580K8111k1507k9296q844p693j3954J7429
12579f7303L4127k8878j1235K3012N4643K5335K7297K639k1851p472p610m3780
12567b1076r516n034L336J627J8860J3166J161r49j335J0963l6428L101J7046
$$ plain form
12655 -2005 23359 21613 73800 89947 62066 18965 -27006 -63242 -72703 -48660 2196 9229
12643 9229 -1859 -22714 -30914 -42907 -25380 -19056 -8998 -21744 -512 29008 1792 25889
12631 25889 24916 8127 -6526 2854 2189 6323 -3033 -23630 -22134 -339 14877 15816 -12127 -11455
12617 -11455 -12151 -7447 11253 1121 8372 22582 13059 9695 -1147 -2451 8237 14151 1011
12604 1011 -42419 -41736 -32234 27009 49567 30225 -5689 2157 -6640 -37107 -33765 -24876 -50640
12591 -50640 -61419 -70617 -68146 -52129 -31549 -3438 -24945 -54241 -63085 -70778 -84732 -67303
12579 -67303 -33176 -62054 -73289 -50277 4366 29701 56998 59637 37786 30314 22704 -21076
12567 -21076 -30592 -35626 -32290 -30663 -11803 1363 2524 1575 240 11203 -25225 -22124 -5078
12554e078k7129k4757L1498J0502J1775n199Q82j0048P656M866k7667o434J597
12541c7536J0714r539J6353J4403o961J5809l1111j9123K8467K4001J8467j3211
12529A0733K268J4094m3602j3125K626J4599N754O351J6968J731j8458L925j6946
12516a3082K517J3541J126J706m598m5737L4953K728m0564P305J0844p302l013
12503c9576J1272O582J5498K3594P976L669N95m300k4595l90J1091K7887L7395
12490G6698k7677n561O992k1124P997j0424m2671k6052K6546M0729n753K6176
12478D5876L3925m9320l3502j7403J9307J4860j4469k433j1366r707M169K126
12466a7937K5433R257L263r613J3040q490o785j6481p679j4985j3564J3256J1161
$$ plain form
12554 -5078 -32207 -56964 -25466 -14964 -3189 -8388 -7506 -17554 -9898 -5032 -32699 -39133 -37536
12541 -37536 -26822 -36361 -20008 -5605 -12566 3243 -27868 -46991 -18524 5477 23944 10733
12529 10733 13001 27095 -16507 -29632 -27006 -12407 -6653 -302 16666 18397 -61 3864 -13082
12516 -13082 -10565 2976 4102 5808 1210 -44527 -9574 -6846 -47410 -40105 -29261 -36563 -39576
12503 -39576 -28304 -21722 -6224 17370 25346 29015 29610 25310 715 325 11416 39303 76698
12490 76698 49021 43460 50452 29328 37325 26901 -15770 -41822 -15276 25453 19700 45876
12478 45876 79801 30481 -3021 -20424 -1117 13743 -726 -3159 -14525 -24232 -20063 -17937
12466 -17937 7496 16753 20016 10403 23443 14953 8168 -8313 -15992 -30977 -44541 -31285 -20124
12453b0124J0809J4106J0102r508l6561K1648K1612L549k6872k8630J4335J8400
12441g134J7571n363p019N925J819J7571K495j7059l872K0161K2706j7479j7914
12428A2408J9389k5778k5630j1995K2727K5748Q409k4159j4475r637q549M335
12416b7207k1228k3429J5540L0815K6390k626j4622j457M264R299J894L292k1801
12403b0876K2104L4927o318j0135j2997n766j7792l2783R475O510J2687l623J6809
12390g778R35n99J1644j6701O203O643j9569k8609K3420M8038m960n416j1726
12377A525Q224M708J3009q013j0008j0725K7240K7867n744l655k3698O230n971
12364B0989J3483j785k4098l509j7458l3325j2509J2047L793M222J0878O053Q669
$$ plain form
12453 -20124 -9315 4791 14893 5385 -31176 -9528 12084 15633 -11239 -39869 -25534 -7134
12441 -7134 10437 5074 -1945 3980 5799 23370 25865 8806 4934 25095 47801 30322 12408
12428 12408 31797 6019 -19611 -31606 -8879 16869 25278 1119 -13356 -22993 -31542 -27207
12416 -27207 -48435 -71864 -56324 -25509 881 -1745 -16367 -17824 -13560 -4261 -2367 925 -20876
12403 -20876 1228 36155 29837 19702 6705 939 -16853 -49636 -40161 -33651 -20964 -24587 -7778
12390 -7778 -6843 -7442 4202 -12499 -6296 347 -19222 -47831 -24411 23627 18667 13251 1525
12377 1525 9749 14457 27466 19453 9445 -1280 25960 53827 48083 44428 20730 26960 20989
12364 20989 34472 32687 8589 5080 -12378 -45703 -58212 -46165 -42372 -38150 -27272 -21219 -12550
12351a2550J3317L7490p819k3117J6340N810n672K8719j4085N715m364p375m340
12338B8069R096l5633k1073m508J4812J4173O456j8579j8118j2653k1331n901
12326f5190O12K1189J9895J4815L359j4055K481K0322J1093J1645J2629K5541
12314F4336k9897o2600j0006J3578j2655J5367J0678q42l072m14j280K1775j5602
12301a0634j9806J0691J4278m891j702N397N949J4196N670k6990l6924q357J1317
12288d1806L2812K320l5173j717m94J850L0014M0369o11L229K6437o837n1446
12275a053m0316k0723M331K00J8649J5866J2594J4341j4309j7318J2050N0590
12263C4902M0546k6189m8761j4855M866J4042j583p575M806p715j4951J0820P024
$$ plain form
12351 -12550 767 38257 30438 7321 23661 29471 23799 52518 38433 44148 39784 32409 28069
12338 28069 37165 1532 -19541 -24049 -9237 4936 11392 -7187 -25305 -37958 -59289 -65190
12326 -65190 -64578 -43389 -23494 -8679 -5320 -19375 -16894 3428 14521 26166 38795 64336
12314 64336 34439 -28161 -38167 -24589 -37244 -21877 -11199 -12041 -15113 -15527 -16807 4968 -10634
12301 -10634 -30440 -19749 -5471 -10362 -12064 -6667 -718 13478 19148 -7842 -44766 -53123 -41806
12288 -41806 -8994 -6674 -41847 -43564 -44058 -42208 -12194 28175 27564 30793 57230 50393 -1053
12275 -1053 -41369 -62092 -57761 -57561 -38912 -23046 -10452 3889 -10420 -27738 -15688 34902
12263 34902 75448 49259 498 -14357 -9491 4551 2968 -4607 199 -7516 -22467 -11647 -4623
12250d623J7793P072j5473m3354R699M565O069N669L2513k0962p020R030J5205
12237A6183k434q482k1109l0999o798R130M8097L0949j871l1895K163N524P04
12224I162p42m5058j3109n655j2723K2568M3999L9665j3018k1927P780K211j6591
12211c438k980m115J6468J3718J036L447L644R106l5950K43p819m2077k3869M4529
12197b8057J7345q013K3385l04j9863M3804K953m014K235M410M746r479j0754
12184A8394J8949K2999M475k2604l2627M397L614p270l597p63j3747l4177J3194
12171b8763M3475O894J9478o373J6532p268j2510p040J7412k3969L776n487l9594
12158b3437j3318Q68J7952J6800K2255N24j0811j3958m916m157J0343O664M621
$$ plain form
12250 -4623 13170 20242 4769 -38585 -28886 -24321 -18252 -12583 19930 -1032 -8052 978 16183
12237 16183 13749 5267 -15842 -46841 -53639 -44509 3588 34537 32666 771 2934 8458 9162
12224 9162 8420 -36638 -49747 -55402 -68125 -45557 -1558 38107 25089 3162 10942 13153 -3438
12211 -3438 -6418 -10533 5935 19653 20689 24136 27780 36886 936 1179 -6640 -48717 -72586 -28057
12197 -28057 -10712 -18725 4660 4356 -15507 28297 31250 27236 29471 33881 38627 29148 18394
12184 18394 37343 60342 64817 42213 9586 13983 17597 10327 6730 5967 -7780 -41957 -28763
12171 -28763 14712 21606 41084 34711 51243 43975 31465 24425 41837 17868 21644 16157 -23437
12158 -23437 -36755 -35887 -17935 -1135 21120 21644 10833 -3125 -8041 -12198 -1855 4809 9430
12145I430j7123k0468J2498K1483J7748j2112q424J7145l1478p569K9624L3995
12133D4749j3387k1385r760P941L549j4296J142j4220j9125j7165p545r820J7664
12120e1658K8674J4603L3955O83L239k3189P466K33j1294l461j1293k0508J935
12107c0615L5200J3498n28k5610k4568j2812K0982L1356L5869j6652l0278J738
12095b420m99L805j6779j5730M70j4751J0514q61J1747J0548K1145Q693K5379
12082D1261l9212k3518L3719p382k8305K2126K0055j4818j4604R401Q888o249
12070A362N594J127j4411m0624R792L786L0892K0536j6608m733n371j919K3384
12057A2807p975j5645L3712o050p366j0258M2964J0030j5595j4556j9283O859
$$ plain form
12145 9430 -7693 -28161 -15663 5820 23568 11456 3032 20177 -11301 -18870 10754 44749
12133 44749 31362 9977 217 8158 11707 -2589 -1447 -15667 -34792 -51957 -59502 -69322 -51658
12120 -51658 -22984 -8381 25574 26257 29496 6307 13773 14006 2712 -749 -12042 -32550 -30615
12107 -30615 4585 18083 17555 -8055 -32623 -45435 -24453 6903 42772 26120 -4158 -2420
12095 -2420 -2919 886 -15893 -31623 -31153 -45904 -35390 -36251 -24504 -13956 7189 15882 41261
12082 41261 2049 -21469 12250 4868 -23437 -1311 18744 3926 -10678 -1277 7611 1362
12070 1362 6956 8083 -6328 -46952 -37160 -33374 -2482 18054 1446 -3287 -8658 -10577 12807
12057 12807 4832 -10813 22899 16849 9483 -775 42189 52219 36624 22068 2785 9644
12045I644J8627j8592j1073R615L5500R898k7775l0899p442N891J0514N889r078
12032G19M665k0820O523L8120P401L354j5354q412k4445J0178K5733J5181K0713
12019F3556j6976m6035j8960J6380L543k1569K696K9812k0867k5784N537Q38J8367
12006i462J7005J7790j6050j2062l5448l210L3778J5919j363l5968k4278l530
11994e6879L651L5480J4360l590j9607K3834K7412N441j9569p510j4210k1579
11982c2766p59K1092J9934l756l804o509o424J9274J5300j2399j3368j0565O064
11969h686j6770j1923j320L8081J4921r708J2572K3540o395k2263j8036J03L6704
11956C0820q029j6914M931j7994k2086L2733L9383n171j4554l1247k9854k3997
$$ plain form
12045 9644 28271 9679 -1394 8221 43721 53619 25844 -5055 -12497 -6606 3908 9797 719
12032 719 5384 -15436 -8913 29207 36608 39962 24608 16196 -8249 1929 27662 42843 63556
12019 63556 46580 545 -18415 -2035 1508 -20061 -17365 12447 -8420 -34204 -28667 -27829 -9462
12006 -9462 7543 25333 9283 -2779 -38227 -41437 -7659 8260 6897 -29071 -53349 -56879
11994 -56879 -53228 -17748 -3388 -6978 -26585 -2751 24661 30102 10533 3023 -11187 -32766
11982 -32766 -33525 -12433 7501 3745 -59 -6568 -12992 6282 21582 9183 -4185 -14750 -8686
11969 -8686 -25456 -37379 -38699 -618 14303 4595 17167 40707 34312 12049 -5987 -5884 30820
11956 30820 22791 5877 10808 -7186 -29272 3461 42844 37673 23119 -8128 -37982 -61979
11944f1979J1992K2122J6493K3555J0621O567J4653K987o306p532J9465L0132
11932H2770j6318j4512j0519l0696k2426P526J024l395j7727J5696J5110k9176
11920b2643J6905j401J0489J4337j8511o704L7318K1687N428k7248j8641m911
11908F105K8671L2971K9138J5123j6107n6326m3415R684L0930J89j994J053l6047
11895b5j8572j8570J447K5679J0717l2105l3639K2824K5568L4853J4992L033j5034
11882B1168k4092K0383K3500J6129J3323q950l6723j4418J3384K0476N162O298
11870E5640k2031o965n405k2274J5521K891o338Q475o523j3010n062P756K1806
11857B4481r499p277Q268K1926k849j7026k336p990k5469j7403q49k293p222O280
$$ plain form
11944 -61979 -49987 -27865 -11372 12183 22804 29371 44024 47011 40705 33173 52638 82770
11932 82770 66452 51940 41421 10725 -11701 -4175 -3151 -6546 -24273 -8577 6533 -22643
11920 -22643 -5738 -7139 3350 17687 -824 -7528 29790 51477 56905 29657 11016 6105
11908 6105 34776 67747 96885 112008 95901 39575 -3840 5844 36774 36963 34969 36022 -25
11895 -25 -18597 -37167 -35720 -10041 676 -31429 -65068 -42244 -16676 18177 33169 36202 21168
11882 21168 -2924 17459 40959 57088 70411 61461 24738 10320 23704 44180 49342 55640
11870 55640 33609 26644 21239 -1035 14486 17377 11039 19514 12991 -19 -5081 2675 24481
11857 24481 14982 7705 15973 37899 35050 18024 15688 7698 -17771 -35174 -36023 -38316 -45538 -39258
11843c9258P558n089J7269M2737k939k4253l6996K350O826K8402K0418P867J1175
11830C6067j8286j2846j9370K5578k239m6163l5688j2324K5780K6362R428K242
11818b1459K6817K7859j458j3297l640K0168K5422J107k0570j2714n526N572j4563
11805A3718j1805P058N793k567J828K7751O761Q267O065n7034k0142P429J6603
11792I725R54P705K800P55j3869l5816l61L0985J3882J4220k439j8906k1964j0782
11778b3111J7871j9547P449k0836K4628j3744l859J772j0162L4138m373j2212
11766b1986O861k9757J0997J7619K09j2753J424M468J2067J3023j3749l263J4650
11753a90J1924M024K2893K9252k8564j8526l517k0567j4064K2216o263j4909n864
$$ plain form
11843 -39258 -31700 -36789 -19520 23217 20278 -3975 -40971 -38621 -31795 -3393 17025 24892 36067
11830 36067 17781 4935 -14435 11143 8904 -37259 -72947 -85271 -59491 -33129 -23701 -21459
11818 -21459 5358 33217 31759 18462 14822 34990 60412 61519 40949 28235 22709 28281 13718
11805 13718 1913 8971 14764 12197 14025 41776 48537 56804 62869 5835 -14307 -6878 9725
11792 9725 10679 18384 21184 21939 8070 -27746 -28107 2878 16760 30980 28541 9635 -12329 -23111
11778 -23111 -5240 -24787 -17338 -38174 -13546 -27290 -31149 -29377 -39539 -5401 -9774 -21986
11766 -21986 -15125 -44882 -33885 -16266 -16057 -28810 -27386 -22918 -10851 2172 -11577 -14840 -190
11753 -190 11734 15758 38651 67903 39339 20813 17296 -3271 -17335 4881 -1382 -16291 -22155
11740b2155R689N465kJ9921k5443L716j7145N649R989J8310J0880R681j3282j9936
11726d663J7859L1991k7387J1267k5293k5115K257K2411j6672J1903J9923j5259
11714C222q115M906j1954J12K1857P132k5758K3457O345j2312j0106j6175L115
11701a4274P707J8706k961j6438J341j7263j7009K2918K6219j2590l8469l1341
11689g3454J7379L8099K5064P879M976k7168j6373K1154L713j6362J9015L948
11677G870m88J3847J5536l513k2913j7495J1J4541Q730j7890r373J8545j7197
11664i789J5298L5240n895J1018J2291k0970l8094L070J8247j4821o285J3398
11652A2708O879j2400J656L80p300m896j9006j5106Q284J8694K371j0349m049
$$ plain form
11740 -22155 -12466 -7001 -7003 12918 -12525 -8809 -25954 -20305 -10316 7994 18874 28555 15273 -4663
11726 -4663 13196 45187 17800 29067 3774 -21341 -19084 3327 -13345 -1442 18481 3222
11714 3222 -4893 13 -11941 -11829 10028 17160 -8598 14859 21204 8892 -1214 -17389 -14274
11701 -14274 -6567 12139 9178 -7260 -5919 -23182 -40191 -17273 8946 -3644 -42113 -73454
11689 -73454 -56075 -17976 7088 14967 19943 -7225 -23598 -2444 1269 -15093 3922 7870
11677 7870 7382 21229 36765 33252 10339 -7156 -7145 7396 16126 -1764 -11137 7408 -9789
11664 -9789 5509 40749 34854 45872 58163 37193 -901 2169 20416 5595 -690 12708
11652 12708 19587 7187 8843 9223 1923 -2973 -21979 -37085 -28801 -10107 -7736 -18085 -22134
11639b2134L5068K650J661r509k2673J3920K2981P707J4829m1358l0918j1639
11627c9415j7846K6306L2614K2200K5022l065j3125k6453k2270K945o458n04K847
11614a7202J0582j1223J275j9835Q111j247l797Q989Q857r645M989K787L6072
11601A8713K4366j8026k7384l284K125k0118K2153J6340j7922m32k4897j519R764
11588b0121j5926j7112j3403K7061J5543k102Q963j0205R642q576K2232K5325
11576B1321N44J2937N720j242j0225j1827j0153M843L0220j1178k8000l651q515
11563i206K153j2268o311k0279r192L0675J5781n865R362n805J2302J4443l266
11550A2524L1136L5923l8928l7013k4914m875K7022M483j4602r027K4359N383
$$ plain form
11639 -22134 12934 15584 17245 7736 -14937 -1017 21964 29671 44500 3142 -27776 -39415
11627 -39415 -57261 -30955 1659 23859 48881 45816 32691 6238 -16032 -13087 -19545 -20049 -17202
11614 -17202 -6620 -17843 -16568 -36403 -28292 -29539 -33336 -24347 -15490 -25135 -20146 -17359 18713
11601 18713 43079 25053 -2331 -5615 -3490 -23608 -1455 14885 -3037 -3469 -28366 -29885 -20121
11588 -20121 -36047 -53159 -66562 -39501 -23958 -26060 -17097 -27302 -17660 -26236 -4004 21321
11576 21321 21865 34802 40522 39280 29055 17228 7075 11918 42138 30960 2960 -691 -9206
11563 -9206 -7053 -19321 -25632 -45911 -55103 -24428 -8647 -14512 -5150 -10955 1347 15790 12524
11550 12524 43660 79583 40655 3642 -21272 -26147 875 5358 -9244 -18271 6088 11471
11538A1471R959j1839k934J9424K291j1007n920l9054j0664R76p589r783J592
11525e3077J5915R264j638L2322q211L2836j3061k2787q65K0432R509r725l218
11512G696M854l1902J0291K4578R89k6363o349J4441P110J9377j7934m640q648
11499f500j296l848j4539l0712K3250J4818K3690j307l3532P324K5242j5513J2492
11486d31l0710J7331J9257K262p804K0326J020k6665J2171J2003n222r072k7005
11473b2539M751J0926J9298L2586n718K0554K4996K626j4113k8066k9487L767
11461A9581N581j3560n252l883J9826K1888k2677j0906j7221P728M528j0648J6330
11448A1315R138J2339l5456J0068J8295j8462k973L0445M079n4551N152J6570
$$ plain form
11538 11471 21430 9591 6657 26081 28372 17365 11445 -27609 -38273 -37297 -44886 -54669 -53077
11525 -53077 -37162 -27898 -29536 2786 -5425 27411 14350 -8437 -9302 11130 20639 10914 7696
11512 7696 12550 -19352 -9061 15517 16506 -9857 -16206 -1765 5345 24722 6788 2148 -6500
11499 -6500 -7796 -11644 -26183 -56895 -33645 -18827 4863 3556 -29976 -22652 2590 -12923 -431
11486 -431 -31141 -13810 5447 7709 -95 20231 21251 -5414 6757 18760 13538 4466 -22539
11473 -22539 -17788 -6862 12436 45022 39304 59858 84854 87480 73367 45301 15814 19581
11461 19581 25162 11602 6350 2467 22293 44181 21504 10598 -6623 1105 5633 -5015 11315
11448 11315 20453 32792 -2664 7404 25699 7237 4264 34709 38788 -15763 -10611 5959
11436E959J7560k663L105J5777L763j8382N545j791j6283n202m247J4474L445
11423B1060J1006J1662Q730k2753r024k6065O646k0855K9486j7871k0939J3486
11411a5431J1260m765r944j1755J4004L3848k611j8730n10k393L480j5685M664
11398a4568J0264j511m371L72j311j664J9608N3129o515j1594J4000p224l6514
11385A2101k0086K2085J7883m247j3980Q632l644K4277q925j0013K9818J1700
11373F5601m3519k7050P438R787K1300R091l107j3511m4322k392K5892K6951P449
11360C9608m0792p782J9312K9256n083k6951l11O985j2122J7041K0336K3747j6669
11347D6575m3250n578J5725J5857J1216J7554j6541j9902j8313r458k0619J2102
$$ plain form
11436 5959 23519 20856 23961 39738 43501 25119 30664 28873 12590 7388 3141 17615 21060
11423 21060 32066 43728 52458 29705 20681 -5384 1262 -19593 9893 -7978 -28917 -15431
11411 -15431 -4171 -8936 -18880 -30635 -16631 17217 14606 -4124 -4634 -7027 -3547 -19232 -14568
11398 -14568 -4304 -5815 -10186 -9814 -11125 -12789 6819 59948 53433 41839 55839 48615 12101
11385 12101 -7985 14100 31983 27736 13756 22388 18744 43021 34096 24083 53901 65601
11373 65601 22082 -4968 2470 12257 33557 42648 39541 26030 -18292 -20684 5208 32159 39608
11360 39608 -1184 -8966 10346 39602 34519 7568 7257 14242 2120 19161 39497 63244 46575
11347 46575 3325 -2253 13472 29329 40545 58099 41558 21656 3343 -6115 -26734 -14632
11335a4632K710n502q975o960L020K0630L4631k160l4038L809M52M874J7874K9562
11321D5295k3317p132Q576r594j1204j3280K5932J7265J748j4282N538k361n378
11308A7806j3976L303j1568K2942Q913K6909l4050l006q705L0786k790j3653n793
11295A7118k3248j3081j6153p856K7455K3428R917O620M023r489K2953Q830j3807
11282C6710j0587J547J6352j7934j9710j6027j5553J0385J7537q36j1536l6165
11270d5817L2482K4366p165j7686o757N331K9698L7077P873l24j3092q782R187
11257D6391m4219k3747K772j1113K6698J3996O210K0224M272n240J8067K2927
11245G7238j1823k3898l1930M872j0679p15k50q751J3770K8911R798k1911l153
$$ plain form
11335 -14632 -11922 -17424 -26399 -33359 -30339 -9709 24922 22762 -11276 -7467 -7015 -2141 15733 45295
11321 45295 21978 14846 23422 13828 2624 -10656 15276 32541 34289 20007 25545 23184 17806
11308 17806 3830 7133 -4435 18507 27420 54329 20279 17273 8568 39354 36564 22911 17118
11295 17118 -6130 -19211 -35364 -43220 -15765 7663 17580 24200 28223 18734 41687 50517 36710
11282 36710 26123 27670 44022 26088 6378 -9649 -25202 -14817 2720 1884 -9652 -45817
11270 -45817 -13335 11031 3866 -13820 -20577 -15246 14452 51529 59402 59078 45986 37204 46391
11257 46391 2172 -21575 -18803 -29916 -3218 10778 16988 37212 41484 36244 54311 77238
11245 77238 65415 41517 9587 14459 3780 3065 2815 -5936 7834 36745 46543 24632 21479
11232B1479R513J1842r693o370N847k040N006j6260j0841m039O50K351l2531R283
11218a5803K4085r785K819J0391K9245N104J5138p414r938m608k2234j754M485
11205A9731K1808K6280J6849N666k8515k0595k3656k4567L973O749R164K1866
11193C4753k2380R227q25R437j162m7773L314K6312R766M886R277o869k6451j7453
11179a5941K0240K0879O429k5085M901L7908r242o4319l744K5979J5320J4335
11167B7660R189q53L9244Q692n7256m8769j707K6077j2821j2639J7174n994K2892
11154A0889M941m965J2175k6803k9634K5351K1157R923K2545k0036J9544R521
11142E4608j9653j2398J6487j4187j5468m09o8K392J0241O17k231p574Q432j644
$$ plain form
11232 21479 30992 42834 33141 26771 32618 30578 35584 19324 8483 4444 5094 7445 -25086 -15803
11218 -15803 8282 -1503 1316 11707 40952 46056 61194 53780 43842 39234 17000 15246 19731
11205 19731 41539 67819 84668 90334 61819 41224 17568 -6999 -3026 3723 12887 34753
11193 34753 12373 21600 20775 30212 29050 -18723 -15409 10903 20669 25555 34832 27963 1512 -15941
11179 -15941 4299 25178 31607 6522 11423 49331 40089 -24230 -27974 -1995 13325 27660
11167 27660 36849 35996 75240 83932 26676 -22093 -23800 2277 -10544 -23183 -6009 -12003 10889
11154 10889 15830 10865 23040 -3763 -33397 -8046 13111 23034 45579 25543 45087 54608
11142 54608 34955 22557 39044 24857 9389 8980 8912 11304 21545 22162 19931 12357 20789 19145
11128A9145J810j3502j0695q528j2776K8149O886K2101m039K8431O447m512o153
11115E2764j1563j2639K0926J745J1097k4650Q049k1715J1815O444m586r601k2358
11102E728M027L18p463J4967M3302K0795m402J5281o866l0933l6640j6761J5625
11089A6978J0581j9479j871o649M4281M667r362R995j779K0986N170l9748n252
11076B8518q687j7951j9032J7553J6207N030n862N228Q620j7503Q802J0252j379
11063B9796j7410J252j4732j9002J3468M7424K514j6367j5645j9284j851K0565
11051A0728M617j5792J448J1367J0755J9185J0136J7304l1140n0490l175K2760
11039G703J1889J6844j0605j7498L996J4372J1733n578j8699r531P47l285l768
$$ plain form
11128 19145 20955 7453 -3242 -11770 -24546 3603 10489 32590 28551 56982 63429 58917 52764
11115 52764 41201 28562 49488 51233 62330 37680 45729 24014 35829 42273 37687 28086 5728
11102 5728 9755 10073 2610 17577 60879 81674 77272 92553 85687 54754 18114 1353 16978
11089 16978 27559 8080 6209 -440 43841 48508 39146 49141 47362 68348 73518 33770 28518
11076 28518 19831 1880 -17152 401 16608 21638 15776 21004 29624 12121 20923 31175 29796
11063 29796 12386 13638 -1094 -20096 -6628 40796 43310 26943 11298 -7986 -9837 10728
11051 10728 15345 -447 1001 12368 23123 42308 52444 69748 38608 -11882 -15057 7703
11039 7703 19592 36436 25831 8333 12329 26701 38434 32856 14157 4626 5373 2088 -1680
11026a680K33K9591N024l402J6747k2270j2425q374Q526K3384K7065L1688K3730
11013A17837n8140l5535j5174j2057k114p498k763p374R421J4067J2340j822J8820
11000C0008k0248M321J3524L1555J778o712k2186l1389J3570J0955J165k8007
10988a666L1379K4501J4279k097r628j7297J3904M0509Q642J1161m8243r569O201
10975F2076R37j0773l2176k5919K513K6014K7541l439L879J5708J4352J5493P39
10962I6945p938k8001j6777K6197k982o136l192J2694K2218j626O372k838k1859
10949G3077j6682J5243J8898j7923K9386K6362n5152k0582K0791q488j4603L795
10937E4122j2899k828J0036P616J0642k1675j6346J479j7616r542J2041m362J9398
$$ plain form
11026 -1680 -1447 28144 33168 29766 46513 24243 11818 3444 11970 35354 62419 94107 117837
11013 117837 59697 24162 8988 -3069 -5183 -12681 -15444 -22818 -13397 670 13010 11188 30008
11000 30008 9760 14081 27605 59160 60938 54226 32040 651 14221 25176 26341 -1666
10988 -1666 29713 54214 68493 66396 56768 39471 53375 93884 102526 113687 65444 55875 62076
10975 62076 63013 52240 20064 -5855 -3342 22672 50213 46774 50653 66361 80713 96206 96945
10962 96945 89007 61006 44229 70426 67444 61308 58116 70810 93028 91402 97774 94936 73077
10949 73077 56395 71638 90536 72613 101999 128361 73209 52627 73418 64930 50327 54122
10937 54122 41223 38395 48431 56047 66689 45014 28668 30147 12531 2989 15030 10668 30066
10924C0066J248J7207K6030m058J3689K791L0399R480j7022k2122j9092j2645
10912E5971J0432j9052o203J0008J0119l0076j2050N38J7277J6798J5943J1209
10900H0914O089k966k1795j4744l814J632k609J8080K1835k7460M605l7K966K3010
10886H5706m235j5867m452k9890n369q303j0663K1393J0396K6262j6031j2471
10874C6476J301j0845J8747o89l1551j03K199L2021K7996N160l4173o03j012M821
10860D9745L143R480l8l587n599p610K0186K5148k8906p845m328M625J1473j6981
10846D8906k2350j6063M6640J2333p799j6014J9884R499j609j0553k0745J1235
10834E3364K216K1842j032r648j3293m126N588L3407J7665J1138k0770k6943R012
$$ plain form
10924 30066 31314 48521 74551 70493 84182 86973 117372 126852 109830 87708 68616 55971
10912 55971 66403 47351 41148 51156 61275 31199 19149 19687 36964 53762 69705 80914
10900 80914 87003 84037 62242 47498 43684 45316 42707 60787 82622 55162 59767 59730 62696 85706
10886 85706 81471 65604 61152 31262 25893 17590 6927 28320 38716 64978 48947 36476
10874 36476 37777 26932 45679 44990 13439 13336 15535 47556 75552 80712 46539 45936 44924 49745
10860 49745 52888 62368 62330 58743 53144 45534 65720 90868 61962 54117 49789 54414 65887 48906
10846 48906 26556 10493 57133 69466 61667 45653 65537 75036 73427 62874 42129 53364
10834 53364 55580 77422 76390 66742 53449 49323 54911 88318 105983 117121 96351 69408 78420
10821G8420M506n111J4335J9929k503J1426M2204l545O160K0992K7102N0806N4333
10808C19054M7210R7416J40050J93303K97003K80102J83245N6172k0050j53M8246
10797A641598j1159j84393l10858k83388k23742j48279r7807q8874o5847l9412
10787A87839r61K3915l976n6310j2044j0635m209J4809j1184j1924l224j249n282
10774A05565j3961o303Q950J0181l0834k3738j288M1576j308l0395J0409J3824
10762H2678N499J6278J1700K2278J7614k5811m4875j2492J0133K0431k2801k8186
10750E2446q137L6406k1892j1566K2543m271j1401L935K3337L7590k1113k4627
10738G3250R663K158J3717J1311j6149k5181j2418Q472L3025p027k6796K4111
$$ plain form
10821 78420 82926 77815 92150 112079 109576 121002 163206 159661 165821 186813 213915 264721 319054
10808 319054 366264 463680 603730 797033 1094036 1374138 1557383 1613555 1593505 1593352 1641598
10797 1641598 1630439 1446046 1135188 851800 628058 479779 381972 293098 227251 187839
10787 187839 186878 210793 206817 150507 138463 127828 123619 138428 127244 115320 112096 110847 105565
10774 105565 91604 85301 94251 104432 73598 49860 48572 90148 88840 58445 68854 82678
10762 82678 88177 104455 116155 138433 156047 130236 85361 72869 83002 103433 80632 52446
10750 52446 44309 80715 58823 47257 69800 65529 54128 58063 81400 118990 97877 73250
10738 73250 82913 85071 98788 110099 93950 68769 56351 64823 97848 90821 64025 88136
10726H8136J3575J7716K97j5566j930j8325n449l1329k2589K0716L6948P030k3318
10713F5912l065j9528K879r031j3386q523J3496K7974K651J4594P954M724N490
10700I2141L655L11J3422k436J3491R203J0119j1962q370k3558o984L4210K273
10687A25515k0559P629o370j3894M720j2833N237Q408J9557Q561K3141j3276l5873
10674I9963l3729j6541L0522O2684K3654p17J8353p859j9929j3757N350J2990
10662A60984j6067K7644N0349O2272N901r349K8068K1749K5158q626j25j4970
10650C32988K4204M0632L6694L5178K5744R6184K13011K98208L49076L85110L39754
10639B176783J60285p7502k56524l41881l77599l04502k49783j74128q4512p5898
$$ plain form
10726 88136 101711 119427 119724 104158 102228 83903 78454 47125 24536 45252 82200 89230 65912
10713 65912 62847 43319 46198 37167 23781 15258 28754 56728 59379 73973 81927 86651 92141
10700 92141 95796 96107 109529 107093 120584 129787 139906 127944 119574 96016 89032 123242 125515
10687 125515 104956 112585 106215 92321 97041 84208 89445 97853 117410 125971 149112 135836 99963
10674 99963 66234 49693 80215 142899 166553 165836 184189 176330 156401 142644 147994 160984
10662 160984 144917 172561 222910 285182 291083 281734 309802 331551 356709 348083 347958 332988
10650 332988 357192 397824 434518 469696 495440 591624 804635 1102843 1451919 1837029 2176783
10639 2176783 2337068 2259566 2003042 1661161 1283562 979060 729277 555149 470637 394739
10629C94739n4976m2314l1403k9545m8191M988O796l288N907J4926K1892J1210
10617B50741l1057J1856k6150j105K933r843m6136j1211j1682m004J0573J7545
10605A52460K2896k4687k2627m952m195J5458N118N555J6665J8068q093J6967
10593A88633L2895K3991j2944Q001m503O794K7985p209l0028m2572k7411j8309
10581A45323j9654n481M1920Q385J0388P221J0738M7917J3161j9429n7171l0022
10569A53296K1116K7081J0374j1193O593Q848O006J226l5450K979M2025P760K0183
10556B60844K078l659K8678K4368K8614m45l101J067L0193K9460m117q192k5144
10543C60644l5099l3369l3766k1173J7686K4064j5776J466K5835L7438K1922L378
$$ plain form
10629 394739 339763 297449 266046 236501 188310 193298 200094 196806 202713 217639 239531 250741
10617 250741 219684 231540 205390 204285 207218 197375 151239 140028 128346 124342 134915 152460
10605 152460 175356 150669 128042 123090 118895 134353 139471 145026 161691 179759 171666 188633
10593 188633 221528 245519 232575 240576 236073 242867 270852 263643 233615 191043 163632 145323
10581 145323 125669 120188 162108 170493 180881 188102 198840 246757 259918 240489 183318 153296
10569 153296 174412 201493 211867 200674 207267 216115 222121 223347 187897 190876 232901 240661 260844
10556 260844 262922 259263 287941 312309 340923 340478 337377 338444 368637 398097 393980 385788 360644
10543 360644 325545 292176 258410 237237 254923 278987 263211 264677 290512 327950 349872 353250
10531C53250J0583L5656O2944O6767N9958L1503R908k7925l1339k5959K0533p49
10519E65130n5881q8168n0583j9227k2456J5408p564n7538m879K1526K7496J3935
10507C37199j6393K9678L1860P194M1962K8989J2849L2131M906N035J9425o01
10495E34234j1706N736o4470j376N4776K0727K8597K1362Q421j2322k3234j2413
10483E48332R988j6033K5415J7767P53O682P077j2254j4137M6862L6922P420k3029
10470F41765n46J8838J9713M0847K2208k2299K4740O8493M1889Q046j210O555
10458H69039K2859M606J628O948J0923L0151K3169L7958J5495L3991N6425J5044
10446A128236J1782M2836J6951L0073Q4045O9791Q4927O4798R0816J10468Q7535
$$ plain form
10531 353250 363833 399489 462433 529200 589158 620661 630569 602644 571305 545346 565879 565130
10519 565130 509249 421081 370498 351271 328815 344223 336659 279121 274242 295768 323264 337199
10507 337199 320806 350484 382344 389538 431500 460489 473338 505469 510375 515410 534835 534234
10495 534234 522528 528264 463794 462418 517194 537921 566518 587880 596301 583979 560745 548332
10483 548332 558320 542287 567702 585469 586222 592904 599981 587727 573590 620452 657374 664794 641765
10470 641765 641219 660057 679770 720617 742825 720526 745266 813759 855648 863694 862484 869039
10458 869039 891898 896504 898132 905080 916003 946154 969323 1007281 1022776 1056767 1113192 1128236
10446 1128236 1140018 1182854 1199805 1229878 1313923 1383714 1468641 1533439 1624255 1734723 1822258
10435A822258J05944J35724J32388Q9116J12418J14065J18649J08044R7487J47448
10425B983541J78040K02203K63021L14547L37180M00288N44896O72367O90708
10416F586791P07317O58322O73905Q76280J114532J262983J351628J519542J849134
10407A6600434K379119L148469M407025O339452R263752J3955221K1471881L2676901
10399A10242254M6246020N5721116N0060392K6667605J121255o955998J705782
10392B84808426M902819j2423069l9885682n5890952n2476217l8805929k5567767
10385F4661629j6352340j0706813p372935n282575l878768k907933k270517j831764
10377A4057984j491998j153071r31428q39598p94203o47700m84298m27988m75632
$$ plain form
10435 1822258 1928202 2063926 2196314 2285430 2397848 2511913 2630562 2738606 2836093 2983541
10425 2983541 3161581 3363784 3626805 3941352 4278532 4678820 5223716 5896083 6586791
10416 6586791 7294108 7952430 8626335 9502615 10617147 11880130 13231758 14751300 16600434
10407 16600434 18979553 22128022 26535047 32874499 42138251 56093472 77565353 110242254
10399 110242254 156488274 212209390 262269782 288937387 290058642 283102644 284808426
10392 284808426 289711245 277288176 237402494 181511542 129035325 90229396 64661629
10385 64661629 48309289 37602476 30229541 24946966 21068198 18160265 15889748 14057984
10377 14057984 12565986 11412915 10481487 9641889 8847686 8199986 7715688 7287700 6812068
10368F812068o16443o79500o51700n44560l90866l22982k26706j32406m6816N8152
10358C258241J88322L64854N40570N55173L74840M6865j30124q9199k7330j89727
10348D892485m72250o85378o51074m98005l63389k61012j79240j21827p7332q8742
10338A494236p9817l1726m3021p9606m1382l0080k6783o0277l9837k9552k058
10327A030097k6583j9618J4357L370M854J1287N931j0907n0736l3018j3340l3509
10315H82185l2791p507l1326O893P160L0544M8377M4724J2088N2949Q866K2544
10303A044706K3034J0676N999J1481R456J414J5784k8361r24m761J5684R673L5352
10290A149213J8672N7065P8922O2364O7793O1470N7371R5320R5513R0662J23729
$$ plain form
10368 6812068 6195625 5516125 4864425 4319865 3928999 3606017 3379311 3246905 3200089 3258241
10358 3258241 3446563 3811417 4351987 4907160 5282000 5328865 5198741 5109542 5082212 4892485
10348 4892485 4420235 3734857 3083783 2585778 2222389 1961377 1782137 1660310 1582978 1494236
10338 1494236 1414419 1382693 1339672 1260066 1218684 1188604 1161821 1101544 1061707 1032155 1030097
10327 1030097 1003514 983896 998253 1001623 1006477 1017764 1023695 1012788 962052 929034 915694 882185
10315 882185 849394 841887 810561 817454 824614 855158 903535 948259 960347 1013296 1022162 1044706
10303 1044706 1067740 1078416 1084415 1095896 1105352 1106766 1122550 1094189 1093265 1088504 1104188 1113861 1149213
10290 1149213 1167885 1224950 1303872 1366236 1434029 1495499 1552870 1648190 1743703 1834365 1958094
10279A958094J02948R8821J00521J26761J20284J43450J46934K03117J46416J90869
10269C338215K44367K25483K13819J76076K05369L65003N46402P10723Q72543
10260F898000R27952R04081Q67906Q48336R11635J163994J663021K259166K757495
10251A9201586L113026L324604L650595M385088N979622R182236J4728721K3721900
10243H7287378L7189944N4653616P0312163P2318746N3775306K0726604j6291614
10236C79972143m9909312p1166527p2238120n7327597l8967872k4773596j5666503
10229D9922616j0286850p178631n397127m319581l548462k868797k244208j744861
10221A2334099j279783r11657o35545m50131l85969n04190o17213p28536p64618
$$ plain form
10279 1958094 2061042 2159863 2260384 2387145 2507429 2650879 2797813 3000930 3147346 3338215
10269 3338215 3582582 3808065 4021884 4197960 4403329 4768332 5314734 6025457 6898000
10260 6898000 7825952 8730033 9597939 10446275 11357910 12521904 14184925 16444091 19201586
10251 19201586 22314612 25639216 29289811 33674899 39654521 48836757 63565478 87287378
10243 87287378 124477322 179130938 249443101 321761847 375537153 396263757 379972143
10236 379972143 330062831 258896304 186658184 129330587 90362715 65589119 49922616
10229 49922616 39635766 32457135 27060008 22740427 19191965 16323168 14078960 12334099
10221 12334099 11054316 10142659 9507114 9056983 8671014 8166824 7549611 6821075 6056457
10212F056457p41704o59198n62610m76751l75809k97610k29328j70177j52720
10203B390550j14332j05836j46548j23165j35177j05204o5521m0778l3944l6127
10193A483918l1191m413k9750q707l1052k1636R852Q796J0898J5049M7998J0162
10181A459924L0989J45040K28711L86138N32417O19898N99125L31430O7771m4927
10171D356516j31670m39314p07201o93438m88233l09394k37908j96717j61195
10162I91446j07537o9166p5504p1946k3560j8914p4492m2521O930J6953k207Q736
10150E38218k4821j0244j9616k5904j9220j266O321k1530j1141l8572j3389M110
10138C62946k0631k6781n488o620L7313J7238j7966j8067k7178K3062L5733K8174
$$ plain form
10212 6056457 5314753 4655555 4092945 3616194 3240385 2942775 2713447 2543270 2390550
10203 2390550 2276218 2170382 2023834 1900669 1765492 1660288 1594767 1553989 1520045 1483918
10193 1483918 1452727 1448314 1418564 1409857 1378805 1357169 1367021 1375817 1386715 1401764 1449762 1459924
10181 1459924 1490913 1635953 1864664 2250802 2783219 3403117 4002242 4333672 4401443 4356516
10171 4356516 4224846 3785532 3078331 2384893 1896660 1587266 1349358 1152641 991446
10162 991446 883909 814743 739239 667293 643733 624819 550327 507806 514736 531689 529482 538218
10150 538218 513397 503153 483537 457633 438413 437147 443468 421938 410797 372225 358836 362946
10138 362946 342315 315534 310046 303426 340739 357977 340011 321944 294766 317828 353561 381735
10126C81735k4493j8787o544k9980M658M274J1086L0186K8007M7720N2475N9817
10114E40154p509j6209j5410l9692n7002o1048m9121m1902k5925l5801j9884J2001
10102A82652K4705L827k5647r779j736l052J6739K2679n14k1462l3318l5232j2737
10089A07125O908j8532J0916M494J2279j9515l0807Q688K9295K9711j769j7472
10077A21321l6525k9005j6570q816j5041k718J4309L7107M6131K340l4950p97
10065G6786K3369l461k3504p322j2303J3302K0539Q347l2376J6381J8151J4919
10053A12828p579j3759k288j7279m3707k8328J0778j5131k2512R08M68k532J7382
10040a0751J5290J7190L8414Q096m485N801o141l0131K223j0090J9067J0121Q841
$$ plain form
10126 381735 357242 338455 331911 301931 306589 310863 321949 352135 380142 427862 480337 540154
10114 540154 532645 516436 501026 461334 404332 343284 294163 252261 226336 190535 170651 182652
10102 182652 207357 211184 185537 175758 174022 170970 187709 210388 209874 188412 155094 119862 107125
10089 107125 114033 95501 106417 110911 123190 103675 72868 81556 110851 140562 138793 121321
10077 121321 84796 55791 39221 30405 15364 12646 26955 64062 110193 112533 77583 76786
10065 76786 100155 96694 73190 65868 53565 66867 87406 95753 63377 79758 97909 112828
10053 112828 105249 91490 89202 71923 28216 -112 10666 -4465 -26977 -26069 -25601 -28133 -10751
10040 -10751 4539 21729 60143 68239 63754 69555 63414 33283 35506 25416 44483 54604 63445
10027F3445j141k3345N962R062J6634K0163j8628l2666l7482k5200P701J0978
10015d517L130j1631K6415J7957J0075J2413L5442K6417K488J2718L819k979K2167
10002A53914j7865l4973L818J133K1344J4892n25k309K6617J4582L3436Q0660
9990B94724R7783J88403K62224L04676K46275J46098N9503m0928m2913M0973j5883
9979A540935j77566k88873k77519k00589j13937j04334p0059o0296k4667l5449
9969A87646m3953k4114k0004j6362O541K5567j1821k1405J1957M975j538k7301
9957G0188l2863k930M614K8941j2226k3202Q635J0609l8028k4893J9033J4127
9945B2005j0838J9953J1577n70J1177J3410j0973j1850j6357Q988l831k6526l8022
$$ plain form
10027 63445 62304 38959 44921 53983 70617 90780 72152 39486 2004 -23196 -15495 -4517
10015 -4517 -1387 -13018 13397 31354 41429 53842 89284 115701 118189 130907 134726 131747 153914
10002 153914 136049 101076 104894 106027 127371 142263 141738 139429 166046 180628 214064 294724
9990 294724 392507 580910 843134 1147810 1394085 1540183 1599686 1558758 1515845 1556818 1540935
9979 1540935 1363369 1074496 796977 596388 482451 378117 308058 247762 223095 187646
9969 187646 143693 119579 99575 83213 89754 115321 103500 82095 94052 99027 97489 70188
9957 70188 37325 34395 39009 67950 55724 32522 41157 51766 13738 -11155 7878 22005
9945 22005 11167 31120 42697 42127 53304 66714 55741 43891 27534 36522 32691 6165 -31857
9932c1857k2158J2547j2448L3434j4036Q074K6133K5571o519N834l8939J3769
9920e95l444k5498R474L4413J1744P754L307p688p87l992O868J592k8122k0238
9906a5212J4938L965k9546R883O474K2995p59l1684K8620M1903L5986R357k9057
9893F7863k4189l8313j4090L7854J3077j3280j7164k2612P200K3267j631j5220
9881B762o213K3101M836r616K4091n138j2111Q090L3811J4105l056M741J3735
9868I3138j2817k4641j4995j2745K2955j7684j1032J214j5620k4134J3971K800
9856D10K126M1879K6902L3777K3269l3338K8582o704l4606J9231L7415K0893J8009
9843A77845J2556J8646M9856N0614M3244P9372J69339K61084M01435M08269L02151
$$ plain form
9932 -31857 -54015 -41468 -53916 -20482 -34518 -26444 -311 25260 18741 24575 -14364 -595
9920 -595 -4039 -29537 -20063 14350 26094 33848 37155 29467 28680 24688 31556 33148 5026 -15212
9906 -15212 -274 3691 -25855 -15972 -9498 13497 12738 -18946 9674 51577 87563 96920 67863
9893 67863 43674 5361 -8729 29125 42202 28922 11758 -10854 -3654 19613 17982 2762
9881 2762 -3451 19650 24486 14870 38961 33823 21712 29802 63613 77718 74662 79403 93138
9868 93138 80321 55680 40685 27940 50895 33211 22179 23393 7773 -16361 -2390 410
9856 410 2536 44415 71317 105094 128363 95025 123607 116903 82297 101528 138943 159836 177845
9843 177845 190401 209047 258903 309517 352761 432133 601472 862556 1263991 1672260 1974411
9832A974411J18378o4506k02939l35592m03663l31439k04406j67287j14782l6376
9822B31799m1675l7197m4418q178P388j0556m80k0590o837N492o128k5600n808
9809C7212J2276L891J4459J7506Q187j1887j6469n3441n0281k97J1966o992l845
9796c7715l921j435L8223K8132j914L1379j0989k8152j7745N263j5789J4146K2338
9783B1821n219k3633k7222O684N219R271N999J3105J3440R080j6345n167K3665
9770C0698Q59l3373J5654L8183K3991k2636k4320j8820k5071k5632K0708Q446
9758a1313q331k1177Q162L0356K6824K317k2633n431Q313N263k1383k7595j8196
9745e4824K8696N209N197j7101p439K2028J5742q956j9952j7603J5909J7051k6157
$$ plain form
9832 1974411 2092789 2028283 1825344 1489752 1086089 754650 550244 382957 268175 231799
9822 231799 190124 152927 108509 100331 107719 97163 96683 76093 69256 74748 68620 43020 37212
9809 37212 49488 53379 67838 85344 93531 81644 65175 11734 -38547 -38844 -26878 -33870 -37715
9796 -37715 -41636 -43071 -4848 23284 21370 52749 41760 13608 -4137 1126 -14663 -517 21821
9783 21821 16602 -7031 -34253 -27569 -22350 -13079 -7080 6025 19465 28545 12200 7033 30698
9770 30698 31557 -1816 13838 52021 76012 53376 29056 10236 -14835 -40467 -19759 -11313
9758 -11313 -19644 -40821 -32659 -2303 24521 26838 4205 -1226 7087 12350 -9033 -36628 -54824
9745 -54824 -26128 -20919 -15722 -32823 -40262 -18234 -2492 -11448 -31400 -49003 -33094 -16043 -42200
9732d2200Q794K852P862o956j9026J6775L7121R863L212K1147j2973j6406m398
9719E667j7917m147j0435j818r631J7048K2645L2687J0062k3533j5970k0200k7685
9706d3227L4544K1486P490j3851k8753J1055M600j8116k153N465J8778J3098j4862
9693d446J411l3467k8184k1366K6934K7998J206r329R255J3797J5592J1652j757
9680I296l061K0092J2228m482l0904k1858k889P987k7349R059P712L958M312j6413
9666c2312r668J0885j1825J1603j118j4163L8179J1437k341j6679J895Q122j1319
9653a7304P851k5123o118L3306J0571Q127q777N866j2844j0750O708p670J1590
9640d567j8080M255p033J0735L461J9787l0734l3273O280K2949J6644J2805k1343
$$ plain form
9732 -42200 -33406 -30554 -22692 -29648 -48674 -31899 5222 15085 18297 39444 26471 10065 5667
9719 5667 -12250 -16397 -26832 -28650 -38281 -21233 1412 34099 44161 20628 4658 -15542 -43227
9706 -43227 -8683 12803 20293 6442 -22311 -11256 -6656 -24772 -26925 -21460 -2682 10416 -4446
9693 -4446 -3035 -36502 -64686 -86052 -59118 -31120 -29914 -39243 -29988 -16191 -599 11053 9296
9680 9296 6235 26327 38555 34073 3169 -18689 -21578 -13591 -40940 -31881 -24169 -20211 -15899 -32312
9666 -32312 -41980 -31095 -42920 -31317 -32435 -46598 -8419 3018 677 -16002 -14107 -5985 -17304
9653 -17304 -9453 -34576 -40694 -7388 3183 11310 2533 8399 -4445 -15195 -8487 -16157 -4567
9640 -4567 -22647 -18392 -25425 -14690 -11229 8558 -22176 -55449 -49169 -26220 -9576 3229 -18114
9627a8114k2327R286K1158j0865o605K682J9939J4511l981K5033J7342p793l290
9614C6976L4446l8531l3402j0349J6766j0921K30o452l7K731Q055N133J0836j3280
9600B201mM3289r374k949n993l4729p716k2004K6563J5912J2691k848j4362j4735
9586a4058J9677j5967k872J1932J3639j7465j4270o295R496L6201J061N879j9294
9573G664K028K2677m13l4138l1348L1738J902j5300o11K6947K1996J0058o266
9560C6934l8193L795k3876K10J4669j3513j9702K2085J4445Q955q731m904K6512
9547A8686j4908O592J5368P405O635j4415l144k015N598P300J8467Q712r886k8121
9533B2274M91k4644k3971Q746K321m720P555M984K0181q317j189l161J156O036
$$ plain form
9627 -18114 -40441 -31155 -9997 -20862 -27467 -24785 -4846 9665 5684 30717 48059 40266 36976
9614 36976 71422 32891 -511 -10860 5906 -5015 -4785 -11237 -11274 -8543 -488 4645 15481 2201
9600 2201 2197 45486 36112 33163 27170 -7559 -15275 -37279 -10716 5196 17887 15039 677 -14058
9586 -14058 5619 -10348 -13220 -1288 12351 -5114 -19384 -25679 -16183 20018 21079 26958 7664
9573 7664 9692 32369 31956 -2182 -33530 -1792 110 -15190 -15801 11146 33142 43200 36934
9560 36934 -1259 2536 -21340 -21130 -6461 -19974 -39676 -17591 -3146 5809 -2922 -7826 18686
9547 18686 3778 10370 25738 33143 39778 25363 22219 20204 25802 33102 51569 60281 50395 22274
9533 22274 22765 -1879 -25850 -17104 -14783 -19503 -11948 -6964 13217 4900 3711 550 1706 7742
9519G742K2717j7030p574p500L920J3999j5460n652J4332J2965K5087l0354j4737
9506B455j0117P246j549j0024k754J5313L027p01K0192j8925j5726J2913j577
9493b27j0223K6186k055q726L0655P295N244p675o067k695N6N232O140O219L4201
9478H3560o874M433o194j6982J9068L2707l3259m1013O847J370j7410j4624l664
9465G965J3187J2502l3296j3319M4797J8906j4162q362L1859k8387j1050L5438
9453E6078J5482R786j9693r871p065o031p394N772J2289M749j4566k2149j405
9440A5982K0371L5728J4211k3900j6436L708j5601n970o809r694r890J3502q693
9427F509J242L2624K197k7192N606J5794K4014n909J3711M552l9807k4714K8274
$$ plain form
9519 7742 30459 13429 5855 -1645 2275 16274 814 -4838 9494 22459 47546 17192 2455
9506 2455 -7662 -416 -1965 -11989 -14743 570 3597 2896 23088 4163 -11563 1350 -227
9493 -227 -10450 15736 13681 4955 35610 42905 48149 40474 34407 31712 31768 37000 43140 49359 83560
9478 83560 76686 81119 74925 57943 77011 109718 76459 35446 42293 43663 26253 11629 7965
9465 7965 21152 33654 358 -12961 31836 50742 36580 28218 60077 31690 20640 56078
9453 56078 71560 81346 61653 51782 44717 38686 31292 37064 49353 54102 39536 17387 15982
9440 15982 36353 72081 86292 62392 45956 49664 34063 28093 21284 11590 1700 15202 6509
9427 6509 7751 40375 42572 15380 20986 36780 60794 54885 68596 73148 33341 8627 36901
9414C6901J5099J5467N15o039K1666l093k959k2310j6785m510K9326M0367N075
9401A08720q585j6779L4066k870m7473l1843j2745J7690M174j4492K5050K6051
9389H0964j1019o833K5728k32J6997Q914j2039k0873J739M270J8862K0018m7439
9376G9057l6176j7505L106O8306o525k5979J3771J5759O821n511J191J7705j4
9363A14006P799r226J4044J9188k0203j3120J099L218L2369k595l321l2505o437
9350A04316L1101K6127r628q65M7367R324j264k2000j8807J520L271k6643J22
9337A43941J3687J4695J9932O209K628L039j5640J59j5639L7630L326j2269k364
9324A99334k554K4886j5277Q163j794K3043L6027N431j9952m3723K5107O145j777
$$ plain form
9414 36901 52000 67467 67982 61943 83609 80516 77557 55247 38462 33952 63278 103645 108720
9401 108720 100135 83356 117422 114552 67079 35236 22491 40181 44355 29863 54913 80964
9389 80964 69945 63112 88840 88608 105605 114519 102480 81607 83346 87616 106478 126496 79057
9376 79057 42881 25376 28482 96788 90263 64284 78055 93814 100635 95124 96315 114020 114006
9363 114006 121805 112579 126623 145811 125608 112488 113587 116805 149174 146579 143258 110753 104316
9350 104316 135417 161544 151916 151051 198418 207742 206478 184478 165671 167191 170462 143819 143941
9337 143941 157628 172323 192255 198464 201092 204131 188491 188650 173011 210641 213967 201698 199334
9324 199334 196780 221666 206389 214552 212758 235801 271828 277259 257307 213584 238691 244836 243059
9311B43059K7533p457k0885L1186Q329m067K1455K692M0578R152J4044J188N947
9298C72754l847R165L4937M5701m8040j9833L8490K8797P210k71M65j7189Q89
9285D49228M0703L7470M1467K9552K6574n553m0400j0899o597L8086L4134J3654
9273F47419p31K8476K2634J7938K4496M469j5489K3097L0494L7485K4469R39J557
9260H47253P912J9865M8141M4871L7955M275K6301M1366M5632L1191L0759L1535
9248A217056N0093J8093K9586N4925L2780K0102K9156K234M2789O3225M3764K4427
9236A628230M8072N8059M5645K0612N0674M8231J6810J1153L4961M8120L6336
9225B046903J1068J3869p050L5336M5769L0476p012l387K1114K6565K7974r984
$$ plain form
9311 243059 270592 263135 242250 273436 281765 277698 299153 301845 342423 351575 365619 366807 372754
9298 372754 368907 378072 413009 458710 410670 390837 429327 458124 465334 465063 465528 448339 449228
9285 449228 489931 527401 568868 598420 624994 619441 579041 568142 561545 599631 633765 647419
9273 647419 646688 675164 697798 715736 740232 744701 729212 752309 782803 820288 844757 845696 847253
9260 847253 855165 875030 923171 968042 1005997 1010272 1036573 1077939 1123571 1154762 1185521 1217056
9248 1217056 1267149 1285242 1314828 1369753 1402533 1422635 1451791 1454025 1496814 1560039 1603803 1628230
9236 1628230 1676302 1734361 1780006 1800618 1851292 1899523 1916333 1927486 1962447 2010567 2046903
9225 2046903 2057971 2071840 2064790 2100126 2145895 2176371 2169359 2165972 2187086 2213651 2241625 2231641
9213B231641J1504j0194j4594n3651m1966l0875o358M791l028o9302n8794l7114
9201A922060j8380j9285j1396l0643m9663m2197m2296n1975p3325n0668l2803
9190A499429J4j6242l8406n6591l9629k5224o9113k5857m0618j8732k1329l6619
9178A111083j9983q284k5232m2208k9443j7154k0929j4766j6486j3690j4603k9781
9166H58524n5614k7887m721n4841l0097q167M744r798n695k7767j3619J0043l9401
9153E95704k7022j0736j7669j7925k6012m1393Q124L343l9734r876j155j6456
9141C99193j472J7382O23j9990k564j5808k4110Q425M940m2187k4482k5632j3809
9128B60509L2030J2568J2270j4561m450J9789j2230O536r604K322J3487J9148
$$ plain form
9213 2231641 2243145 2232951 2218357 2164706 2122740 2091865 2085507 2090298 2087270 2017968 1959174 1922060
9201 1922060 1903680 1884395 1872999 1842356 1792693 1750496 1708200 1656225 1582900 1532232 1499429
9190 1499429 1499443 1483201 1444795 1388204 1348575 1323351 1254238 1228381 1187763 1169031 1147702 1111083
9178 1111083 1091100 1082816 1057584 1015376 985933 968779 947850 933084 916598 902908 888305 858524
9166 858524 802910 775023 770302 715461 685364 677197 681941 672143 666448 638681 625062 635105 595704
9153 595704 568682 557946 540277 522352 496340 454947 463071 466414 426680 416804 415649 399193
9141 399193 397721 415103 415726 395736 393172 377364 353254 361679 366619 324432 299950 274318 260509
9128 260509 292539 305107 317377 302816 298366 318155 305925 312461 302857 305179 318666 337814
9116C37814M592k9034l1567q534J6175k7524o152M930Q411k3586l2801j4163j2709
9103A85852J8266J9017l0688k2995K245P103n7K3934j3524j6705k1591j7171J676
9090A35362J1478J2421m964J0498m96J4780Q685Q007k6227m3154P42j28j9583
9077A07421r430j3877j0587L5604M2057M150p890m773j4377k6193m110q077M646
9064I4564J6029J2103k1687k475K9389j3472k4228k1134L7220J3037r549P61j1413
9051I9145j2666k4180j0004K9158k92Q783K3180j031k344K300j819K3889R796
9038A43915j5774k7139J690j5074k1123j4212J6664L9321j2690l0970j34k2846
9026D1628J5550K4486j0348l0450l0692l5869J7626N1735K7460j2407K733O804
$$ plain form
9116 337814 342406 313372 281805 273271 289446 261922 255770 260700 269111 245525 212724 198561 185852
9103 185852 204118 223135 192447 169452 171697 178800 178743 202677 189153 172448 150857 133686 135362
9090 135362 146840 159261 154297 164795 164299 179079 187764 195771 169544 126390 127132 127004 107421
9077 107421 97991 84114 73527 109131 151188 155338 147448 142675 128298 102105 97995 89918 94564
9064 94564 110593 122696 101009 98534 127923 114451 90223 69089 106309 119346 109797 110558 99145
9051 99145 86479 62299 52295 81453 81161 89944 113124 112093 109749 112049 110230 134119 143915
9038 143915 128141 101002 102692 87618 66495 52283 68947 108268 95578 64608 64474 41628
9026 41628 57178 81664 71316 40866 10174 -25695 -8069 43666 71126 58719 61452 68256
9014F8256l7076k4221n214K9294N869P549k0490K7532K4204k1218M1026J1017
9002A06528k4105k0994M564J4315k0668L865K1934k2668l6105m9043j8323q857
8990d9557j81Q054M5589L3842K7073r802N368k7131k0695L51J6367l345K4500
8977E0433L3257j6493j8226M781j5153k2773n992K7463m039j6561J5935J5249
8965D7881l260J5939L305l5503J567J1168K1579o912l4432j4253K272K351J675
8952A3377K3335r823j3934J4352K367m1809J4452N069K5919m152Q408k132k0981
8939A4448O011J99j3845N026K585K9201j153j496J1971K1868p596j4457M432p623
8925D9571K0121j0102j3566l7465j1586N834J7059J5111J4677q606j9640R079
$$ plain form
9014 68256 31180 6959 1745 31039 36908 44457 23967 51499 75703 54485 95511 106528
9002 106528 82423 61429 65993 80308 59640 63505 85439 62771 26666 -22377 -40700 -49557
8990 -49557 -49738 -41684 3905 37747 64820 55018 60386 33255 12560 12911 29278 25933 50433
8977 50433 83690 67197 48971 53752 38599 15826 9834 37297 33258 16697 32632 47881
8965 47881 44621 60560 63865 28362 29929 41097 62676 55764 21332 7079 9351 11702 13377
8952 13377 36712 26889 12955 27307 29674 -12135 2317 7386 33305 29153 37561 35429 14448
8939 14448 20459 20658 6813 11839 14424 43625 42472 40976 52947 74815 67219 52762 57194 49571
8925 49571 69692 59590 46024 8559 -3027 2807 19866 34977 49654 41048 21408 30487
8913C0487J1292k6954j8196m625R70N253J5376J2764j0734J6245K3489m173j3033
8900C8161j3801k1002L208R750K2125J409j1804R513n734n165q918j6191L9393
8887D0944l39k767M369J4016l849j1217L392r6J3736Q40k0173k8405o584R379
8873A3246L769k0005p11J3160J1764j7967J6135K7719l7310j5469k394O27j8385
8860b5821L900K0480Q973k0460R630R338j3714J082J3326R800o984j664j7390
8847i504r902L1155L5156N968O862k5028m725j0154j4530Q751J2375j2952J8533
8834C2005K6226J820k1878j1434j8461n399j5945J8155M792K3032J6292j5433
8822C3772o301j0988j944j2298j0530K4918l118r454L1069L6145m5513l3245k1996
$$ plain form
8913 30487 41779 14825 -3371 -7996 -7026 -1773 13603 26367 15633 31878 55367 51194 38161
8900 38161 24360 3358 6566 16316 38441 39850 28046 37559 31825 26660 17742 1551 40944
8887 40944 40605 37838 42207 56223 52374 41157 44549 44453 58189 59029 38856 10451 3867 13246
8873 13246 17015 -2990 -3701 9459 21223 3256 19391 47110 9800 -5669 -8063 -7436 -25821
8860 -25821 -21921 -1441 7532 -12928 -3298 6040 -7674 -6592 6734 16534 9550 7886 -9504
8847 -9504 -19406 11749 46905 52873 59735 34707 29982 19828 5298 14049 26424 13472 32005
8834 32005 58231 60051 38173 26739 8278 2879 -13066 5089 9881 32913 49205 33772
8822 33772 27471 16483 14539 2241 -8289 16629 13511 4057 35126 71271 25758 -7487 -29483
8809b9483N742K1157K136o604r535r57j4179r718P297J4563K5636l962k9212k015
8795b9134M037K0127L0119J6332k7050k5724J2742J6357m731O644o789k6438N934
8782g574K9154q265l4459r415k1536J0474Q469L0580M323O889k2199j2260K4276
8769a543r722O428P280l072J1964j6910l6115j6323O176O318R932k229Q87J7000
8755a9929j3346M45K4121Q419j5379j5831r197p520J5191K233n161J6611j4905
8742c4248K1453K1187j9614l1997m930K7154K4315j1937K0569K0161J1979m60
8730D3632j1728j3612o212k197K6902l7042j5094N66o446Q682j0850k3357K6804
8717a9952J9384J7269K064r655K301p417O388K2624o470N345J1483o533j9358
$$ plain form
8809 -29483 -23741 -2584 -448 -7052 -16587 -17544 -31723 -41441 -34144 -19581 6055 2093 -27119 -29134
8795 -29134 -25097 -4970 25149 41481 14431 -11293 1449 17806 13075 19719 12930 -13508 -7574
8782 -7574 21580 13315 -21144 -30559 -52095 -41621 -33152 -2572 1751 8640 -13559 -25819 -1543
8769 -1543 -11265 -4837 2443 -629 11335 -5575 -41690 -58013 -51837 -45519 -35587 -37816 -36929 -19929
8755 -19929 -33275 -32830 -8709 -290 -15669 -31500 -40697 -48217 -33026 -30793 -35954 -19343 -34248
8742 -34248 -12795 8392 -11222 -43219 -48149 -20995 3320 -8617 11952 32113 44092 43632
8730 43632 31904 18292 12080 9883 36785 -257 -15351 -14785 -21231 -12549 -23399 -46756 -19952
8717 -19952 -568 16701 18765 9110 11411 3994 10382 33006 26536 31881 43364 36831 17473
8704A7473J0220j5828j8478P425p828O928J8879M850j6691j0934J0246J1028R218
8691B6508k0830q018j1151l3488K743J4000K2085J4710L6041L030l6134L387L5362
8678D8245j4469m503L156l318j5710k2168N378J3308m439K6282J0942j1427J6381
8665D7658q55k1718j9439K7276L4709J0840l285j4717k1671k9570M203q85r550
8652B996j8905J3543J2412r26Q139r30J1839k0920j6126k153J340J6461J4957
8639B1727p086m2889K661L0022J0895J8945O730L074J1738J0322o434j9891q291
8626C1523k2214j7532o16j040j6507L5498M1037R159l7874j7133J9927J5843k3796
8613A6275m2432K3680J1202r56J0533J1785o401n254k3697l7085M4476L4688J2730
$$ plain form
8704 17473 27693 11865 -6613 812 -7016 -88 18791 23641 6950 -3984 6262 17290 26508
8691 26508 5678 -2340 -13491 -46979 -44236 -30236 -8151 6559 42600 45630 9496 12883 48245
8678 48245 33776 29273 32429 29111 13401 -8767 -3389 9919 5480 31762 42704 31277 47658
8665 47658 46803 25085 5646 32922 67631 78471 75186 60469 38798 9228 13431 12546 2996
8652 2996 -15909 -2366 10046 9120 17259 16329 28168 7248 -8878 -11031 -9691 6770 21727
8639 21727 14641 -28248 -25587 4435 15330 34275 41005 44079 55817 66139 59705 39814 31523
8626 31523 9309 -8223 -8839 -9879 -26386 9112 50149 59308 21434 4301 24228 40071 16275
8613 16275 -26157 -2477 8725 7769 18302 30087 23686 18432 -5265 -42350 2126 36814 49544
8600D9544P633J3176J6473o288m1136R59r053l1993K01J5862j1876j066O038J9473
8586B7947k8823k2500J0999K637K5262J357k3916K4242J0243J1831J4205j8754
8574C4730k2372J4616m746J8202K507J41l629l5326j8559O03K879J6840k3609
8561a7723P033J6718M1242L573m3191j969q511P090j36M126R517j2297J7857k0092
8547C237r477K5842k0019j2247M583j4297K2268P858j7917O358j2368K6q149k638
8533b6940P377J349O392j2867l5427p544N745K0385J5434L8786K7697k7218j3407
8520b38k2195K340Q500J1505p584L910J445n463Q532K76k341J2220N66l1490m7425
8505f7442O694M6392n838p878L628j8829j5643P575L2160J4801j3612j6817K651
$$ plain form
8600 49544 57177 70353 86826 80538 39402 40361 31308 -685 -484 15378 3502 2436 8474 27947
8586 27947 -876 -23376 -12377 -9740 15522 16879 -7037 17205 27448 39279 53484 34730
8574 34730 12358 26974 22228 40430 42937 43078 39449 4123 -14436 -13833 -10954 5886 -17723
8561 -17723 -10690 6028 47270 50843 7652 5683 -2828 4262 4126 8252 17769 5472 23329 3237
8547 3237 -6240 19602 -417 -12664 -8081 -22378 -110 7748 -10169 -3811 -16179 -16153 -24302 -26940
8533 -26940 -19563 -18214 -11822 -24689 -60116 -67660 -61915 -41530 -26096 12690 40387 13169 -238
8520 -238 -22433 -20093 -11593 -88 -7672 -3762 -2317 -7780 752 1028 -1313 10907 11473 -20017 -67442
8505 -67442 -60748 -14356 -20194 -28072 -24444 -43273 -58916 -51341 -19181 -4380 -17992 -34809 -32158
8492c2158o070N4026K2418P856O77L1800J3919k9568n3746j9085J0437j995L981
8479B492o816j6276K881K4069M624j4548L816o525r062k5199K5376N2100k104
8466C4828P099j1783p135k3508l1029j2833n512K6850L3043J6795K598O187J5768
8453E1368k44R036O200k9278l7510j5795K2741P396j851L1050m409l0759j4167
8440f222k950k3941Q021J7884j0629j736j1764l0290J1261J6872N481J6394j3218
8427b4837n672P129L2890r388J1124K9877K2690J4937J1051j8349k6299N475j6475
8414C4153j8454N410j7608l2061o224K0146K9653j3226k9840k3899k0116L2850
8402c9216L0395m3017j7579Q691L7399K2269M115J1024J0501l2139j5386J8028
$$ plain form
8492 -32158 -38228 15798 38216 46072 46749 78549 92468 62900 9154 -9931 506 -1489 2492
8479 2492 -4324 -20600 -17719 6350 10974 -3574 242 -6283 -15345 -40544 -15168 36932 34828
8466 34828 41927 30144 23009 -499 -31528 -44361 -49873 -23023 10020 26815 29413 35600 51368
8453 51368 51124 60160 66360 37082 -428 -16223 6518 13914 12063 43113 38704 7945 -6222
8440 -6222 -9172 -33113 -25092 -7208 -17837 -19573 -31337 -61627 -50366 -33494 -28013 -11619 -24837
8427 -24837 -30509 -23380 9510 122 11246 41123 63813 78750 89801 71452 45153 50628 34153
8414 34153 15699 21109 3501 -28560 -34784 -14638 15015 1789 -28051 -51950 -72066 -39216
8402 -39216 -8821 -51838 -69417 -60726 -23327 -1058 3057 14081 24582 -7557 -22943 -4915
8390d915N764M742o977k411o272j4419n122K2078J0743K6608L550q352N229j2814
8376A7432j5039l118j0288j593j5207K742K292O677q93p692L2296k805J4551L314
8362B2669k4054j2922j9480j3800j228K6068J9121J5161J6458k1527m9223N531
8350c7226K4026J689J4446J5043J740l379J7940K6419j4010k8964j5639l2491
8338c0406Q28l451J0959J0901r503j8496R371M94k6506j7101J1730L2549P722
8325b0909J6616M789j2297J7489R671K9515K1427l614j6893j1978n786k047j1066
8312A4917j8488r483j1394k4935K6517k272R935J7152j7924J4393j5258K293O633
8299g914L0431r274k9399M850n138j5078j6804j9893j5561J6752L4389K1671Q043
$$ plain form
8390 -4915 849 5591 -1386 -3797 -10069 -24488 -29610 -7532 3211 29819 33369 25017 30246 17432
8376 17432 2393 -725 -11013 -12606 -27813 -25071 -22779 -16102 -16995 -24687 7609 4804 19355 22669
8362 22669 -1385 -14307 -33787 -47587 -48815 -22747 -3626 11535 27993 6466 -42757 -37226
8350 -37226 -13200 -11511 2935 17978 19718 16339 34279 60698 46688 17724 2085 -30406
8338 -30406 -29578 -33029 -22070 -11169 -20672 -39168 -29797 -29303 -55809 -72910 -61180 -28631 -20909
8325 -20909 -4293 496 -11801 5688 15359 44874 66301 62687 45794 33816 28030 25983 14917
8312 14917 -3571 -13054 -24448 -49383 -22866 -25138 -15203 1949 -15975 -1582 -16840 -14547 -7914
8299 -7914 22517 13243 -16156 -11306 -16444 -31522 -48326 -68219 -83780 -67028 -32639 -10968 -2925
8286b925k062O162K0465K61k855p196J4363O788m1911j8536M6130m346j4676r02
8272a240m820J7120L219J0079o766j3881R505J2387J486r890k628j9929L408q521
8258a0471K3674N2725j2686l2577k0163m946P623l5550Q228L1144o096J9223J141
8245B1269K8035N352N897k157o171j5121l5435K3276N520r945n938J4892k0338
8232I136k3480J9365M0016j0564j4321o658L749q669k3187j0342K3839O137J2831
8219A7852L1435P798l2411j5563q083N348J6192O599K476j2227l4684P248l097
8206a1117L9107R783N049J3709r298r872k9231l3410J0391L5728j5968q035L817
8193F53L2066P142m1200J4439M425l2152r092J8274K3001r017j0727r626J3885
$$ plain form
8286 -2925 -4987 1175 21640 21901 19046 11850 26213 33001 -8910 -27446 18684 14338 -338 -1240
8272 -1240 -6060 11060 14279 24358 17592 3711 13216 25603 27089 17199 14571 -5358 -1950 -10471
8258 -10471 13203 65928 53242 20665 502 -4444 3179 -32371 -24143 7001 905 20128 21269
8245 21269 49304 54656 60553 58396 52225 37104 1669 24945 30465 20520 14582 29474 9136
8232 9136 -14344 5021 45037 34473 20152 13494 17243 8574 -14613 -24955 -1116 5021 17852
8219 17852 49287 57085 24674 9111 1028 6376 22568 29167 31643 19416 -15268 -8020 -11117
8206 -11117 27990 37773 42822 56531 47233 37361 8130 -25280 -14889 20839 4871 -3164 653
8193 653 32719 39861 -1339 13100 17525 -14627 -23719 -5445 17556 8539 -2188 -11814 2071
8180B071O712k6057j4778j013K3421L777K9549J5964k4361m527j8782P498N457
8167D931j2363k8969j6709K82M3779L6385R804k9350n465J1968o191j4376N026
8154a248N519o911L669k701r995j4088O665m513J1876J8009k838m2648j411J0666
8140b9949L0982M4401J7838j0999J332k4283m174K7830k39l2122k6625n09O930
8127D13L1389L754k2412j6136P90O485K2047J5110O145j4348j4952k7350j8213
8114b7278K5321K7554n96k206k6125L588j8205Q708K4817J0735q524j0903l347
8101C539j6676j8826j1761j9528J3474J8582J7127p921N655J9756j9051n784K7109
8088E695m358j8984j4406J3507M0450K6331j86o021j9663j4327j0013L2675J5193
$$ plain form
8180 2071 8783 -17274 -32052 -33065 -9644 -5867 23682 39646 15285 10758 -8024 -526 4931
8167 4931 -7432 -36401 -53110 -52828 -9049 27336 37140 7790 2325 14293 8102 -6274 -1248
8154 -1248 4271 -2640 1029 -1672 -11667 -25755 -19090 -23603 -11727 6282 3444 -39204 -40615 -29949
8140 -29949 1033 45434 63272 52273 53605 29322 25148 52978 52739 20617 -6008 -6517 413
8127 413 31802 35556 13144 -2992 -2202 4283 26330 41440 47585 33237 18285 -9065 -27278
8114 -27278 -1957 25597 25001 22795 -3330 258 -17947 -9239 15578 26313 17789 6886 3539
8101 3539 -13137 -31963 -43724 -63252 -49778 -31196 -14069 -21990 -16335 3421 -15630 -21414 5695
8088 5695 1337 -17647 -32053 -18546 21904 48235 48049 42028 22365 8038 -1975 30700 45893
8075D5893k5380j2266j0382k981O404K285M4109J0572k1137k1258J7037j359k5811
8062E726J3500n462m453j7308J2883J4673J1361j808K874k4038k2578N130N396
8049d104K4941K8122j0196r036j7696j9380j958K7486L6354o716k6023k8135J3427
8036G086J6941M378k2276m4992l2214J7709M5468K2345J2135j9023k4349l497
8024b0289J3974R379j4677M0568L6079j8684k7668K063J5740k9660k8564r280
8012c1019k4118j2371P888L5467J4720j0497J006r949l7232l562J1238K6698J5256
7999a6475k0225P417K22j6621J0659K3402K0698j1120j8865K2789J1760Q831l8520
7986a6048k3181K650P153L581J6115K3268N115j4423J8070Q160q644K694j9563
$$ plain form
8075 45893 20513 8247 -2135 -5116 1288 3573 47682 58254 37117 15859 32896 31537 5726
8062 5726 19226 13764 9311 -7997 4886 19559 30920 29112 31986 7948 -14630 -9500 -4104
8049 -4104 20837 48959 38763 29727 12031 -7349 -9307 18179 54533 47817 21794 -6341 7086
8036 7086 24027 28405 6129 -38863 -71077 -53368 -7900 14445 26580 7557 -16792 -20289
8024 -20289 -6315 3064 -11613 28955 65034 46350 18682 20745 36485 6825 -21739 -31019
8012 -31019 -55137 -67508 -59620 -24153 -9433 -19930 -18924 -28873 -66105 -69667 -58429 -31731 -16475
7999 -16475 -36700 -29283 -29061 -45682 -35023 -11621 9077 -2043 -20908 1881 13641 22472 -16048
7986 -16048 -39229 -36579 -29426 -25845 -9730 13538 18653 4230 22300 30460 21816 24510 4947
7973D947j0555M269J376P77l3669j2171m71J6620K0560K9719K2350L966j8116
7960B9602j7842k7488k580J7782Q474p544L156P48k0416j8297R438Q005J1632
7947e330j914L429J719j8005j4491K1935j8499l6630K492K6203J9664j6113J4574
7934b0966r117j21j0883K5391L1187K3676J8916J054o906k314j4371O114J5114
7921E6774k4300l0565J430q435l811k4044j2338L3620J046L9610Q198l5175l3103
7908c1093j9441j1823K0434r829r68K1795R488l983J6287L1945K3777k687j5542
7895B8360O729k8667O226P343q685j0174j7266k162r092r309n910k0410J9899
7882d3118O4374J2899p646o597j5329m2873l748R424r034P642K9787K037j8741
$$ plain form
7973 4947 -5608 -1339 37 814 -32855 -45026 -45497 -28877 -8317 21402 43752 47718 29602
7960 29602 11760 -15728 -18308 -526 7948 404 3560 4308 -16108 -34405 -24967 -16962 -5330
7947 -5330 -7244 -3815 -2096 -20101 -34592 -12657 -31156 -67786 -65294 -39091 -19427 -35540 -20966
7934 -20966 -30083 -30204 -41087 -15696 15491 39167 58083 59137 52231 49917 35546 41660 56774
7921 56774 32474 1909 3339 -5096 -8907 -32951 -45289 -11669 -10623 28987 37185 2010 -31093
7908 -31093 -50534 -62357 -41923 -51752 -52720 -30925 -21437 -25420 -9133 22812 46589 43902 28360
7895 28360 35089 6422 12648 19991 11306 1132 -16134 -18296 -27388 -36697 -42607 -63017 -43118
7882 -43118 21256 34155 26509 19912 4583 -38290 -42038 -32614 -41648 -34006 -4219 -2182 -20923
7869b0923o644O964j5859K7691L8958L2406q700m4438l2377r244J0733k714j6711
7856d0858m017j3075o091l621R875O373K6993K1586J4666J379p63r465K209J8321
7842B3512l065q820j1803Q140K6940j4711j2043Q9M780j3989p763J25J085k1271
7828b8794k2757Q316J0182K8686J0279Q895j2624j8492l4957j5799K0340l306
7816e0031K14J7607N816K1953N380J7015J2292J7412j4839k9558j9149m4565J5228
7803d5225K6234L6001L2808j2903j4446R404k394J806r654r634j1580j6647k0463
7790c6693K4525J8807j0973k3200r176j2801q036j2139K9809N015L3459k3870
7778b5273j1415n304L928J5618k834M808K4522l496l4869R331J6015J4921N663
$$ plain form
7869 -20923 -27567 -20603 -36462 -8771 30187 62593 53893 9455 -22922 -32166 -21433 -24147 -40858
7856 -40858 -44875 -57950 -64041 -67662 -57787 -51414 -24421 -2835 11831 13210 12447 2982 5191 23512
7842 23512 20447 11627 -176 7964 34904 20193 8150 8239 13019 -970 -8733 -8608 -7523 -28794
7828 -28794 -51551 -43235 -33053 -4367 5912 14807 2183 -16309 -51266 -67065 -46725 -50031
7816 -50031 -49817 -32210 -26394 -4441 939 17954 30246 47658 32819 3261 -15888 -60453 -45225
7803 -45225 -18991 17010 49818 36915 22469 31873 29479 31285 21631 11997 417 -16230 -36693
7790 -36693 -12168 6639 -4334 -27534 -36710 -49511 -57547 -69686 -39877 -34862 -1403 -25273
7778 -25273 -36688 -41992 -38064 -22446 -25280 -20472 4050 554 -34315 -24984 -8969 5952 11615
7765A1615j8925k1109K498Q65p387l0415j9457N673M9037M5044J1010k5479j4741
7752a1771j2788O212n172N036J8600o325L0054N092k6393r159J653K0134l2212
7739a7039N617J6090K2895l0562K51j0255j1985j6214N350J3265L4404K3136N616
7726D0569l3404m3927l848M7424L888r905j5591o410j3985j7148Q509q587j43
7713e2558L1305P55Q053R150j346r243j0115l3368j7389K1054J8096J7292L2243
7700A3929K2721n045r142l739J4830r552k2920j4188k0490M316N356J8239O535
7687H50r513r900m172j1386M942m37j4967j0211O027o688P991J1320j127m325
7673d1596R536k062P527j3360K634L3938n605R503j6136j5553j2557r986O075
$$ plain form
7765 11615 -7310 -28419 -25921 -25056 -32443 -62858 -82315 -76642 -27605 17439 28449 2970 -11771
7752 -11771 -24559 -18347 -23519 -18483 117 -6208 23846 28938 2545 -6614 -4961 15173 -17039
7739 -17039 -11422 4668 27563 -2999 -2748 -13003 -24988 -41202 -35852 -22587 11817 34953 40569
7726 40569 7165 -36762 -40610 6814 10702 797 -14794 -21204 -35189 -52337 -43828 -52415 -52558
7713 -52558 -21253 -20498 -12445 -3295 -4641 -13884 -23999 -57367 -74756 -53702 -35606 -18314 13929
7700 13929 36650 31605 22463 18724 33554 24002 1082 -13106 -33596 -29280 -23924 -5685 850
7687 850 -8663 -18563 -22735 -34121 -29179 -29616 -44583 -54794 -48767 -55455 -47464 -36144 -37271 -41596
7673 -41596 -32060 -34122 -26595 -39955 -37321 -3383 -8988 515 -15621 -31174 -43731 -53717 -47642
7660d7642J7014k1120j4312p123p587L1563J6680p99K4950K5444M084l7943k7847
7647d4638K8015Q232m8086J1083N958m2241M6268L1511r917j5469J2922K3624
7635G262J1719r003p727K0411l2054J262K6794j4547r613l1357l7033L1635M3945
7622A694Q233q698n6780r302o621O545R987N2990K5137O456o542l1539J952O706
7608B18j734M873o249J3195j1801r433j8309j9154q475j002M1653M2217j7202
7595H797p907M191K2412J2562k1736k8184j3814J7392J4088k327k6145j9789j2925
7582e3385m88K3620K5959k9571j5538j0323K274K6117j6048o936K9721k00J0802
7569a3996J9603k6844k9515m249R77K2798k231J594J2342L0726j544j8373l4839
$$ plain form
7660 -47642 -30628 -51748 -66060 -73183 -80770 -49207 -32527 -33326 -8376 17068 21152 -16791 -44638
7647 -44638 -16623 -8391 -56477 -45394 -39436 -81677 -35409 -3898 -13815 -29284 -16362 7262
7635 7262 18981 9978 2251 22662 -9392 -8130 18664 4117 -5496 -36853 -73886 -42251 1694
7622 1694 9927 1229 -55551 -64853 -71474 -64929 -54942 -1952 23185 29641 23099 -8440 -6488 218
7608 218 -1516 3357 -2892 10303 -1498 -10931 -29240 -48394 -56869 -57871 -16218 25999 8797
7595 8797 890 5081 27493 40055 18319 -9865 -23679 -6287 7801 5474 -20671 -40460 -53385
7582 -53385 -53873 -30253 -4294 -33865 -49403 -59726 -57452 -31335 -47383 -54319 -24598 -24798 -13996
7569 -13996 5607 -21237 -50752 -55001 -54024 -31226 -33457 -31863 -19521 11205 9661 -8712 -43551
7556d3551p451L6907K6172k660j7278n786L3547j1356N390q723P060j4474q84
7543c087j229P552J6654j3259j9791j566j6537Q69J2632M450J9467J6090L237
7530B5482n868k2514l3626N702K3882K3104j5603K9017K0341j4696j1412l0442
7518f633j5391n926Q291K2926n65J3323j297P705r565k7459n78J9600J4800j233
7504A7998j1791L377R403J8341j0639k1826j2639r285J4935L7421J7281j9680
7492C2896J4307j5484m8059q863J6475J3799l307k2657j8360j2075j755K6031
7480b7052L2510R093n715M288k446J6920j3449r058M21J1233n136l62p409o12
7466C226j8035J2480K5912J5501j0696k3645l378J8652N812k2036O11L614k4332
$$ plain form
7556 -43551 -51002 -14095 12077 9417 -7861 -13647 19900 8544 13934 5211 12271 -2203 -3087
7543 -3087 -4316 3236 19890 6631 -13160 -14726 -31263 -30394 -17762 -13312 6155 22245 25482
7530 25482 19614 -2900 -36526 -30824 -6942 16162 559 29576 49917 35221 23809 -6633
7518 -6633 -22024 -27950 -19659 3267 2702 16025 14728 22433 12868 -14591 -15169 4431 19231 17998
7504 17998 6207 9584 18987 37328 26689 4863 -7776 -17061 -2126 35295 52576 32896
7492 32896 47203 31719 -16340 -25203 -8728 5071 1764 -20893 -39253 -51328 -53083 -27052
7480 -27052 5458 14551 8836 13124 10678 27598 14149 5091 5512 16745 11609 11247 3838 3226
7466 3226 -14809 -2329 23583 39084 28388 4743 1365 20017 25829 3793 4404 8018 -16314
7453a6314K655L04K587j6308k0720J198J2605P336L9476R204j575j902o682L814
7439A5678J1552l880k6329L37K3792N827K4862j7842l4689k6171o746P426J205
7426b4978O064K3355j3831N34K6533N353o947l7561k3749k5451J2342P164J5163
7413c6009J6386k3755k3437l524o446M4210M0087L009r778o817p089j5512j21
7400b8796Q835j4459K5066K5359J7434O022k5915k3603j3043j6023J3244l8712
7388f4591J77K3133J008l247J4915J0566n246j3001J2552K6286j419j9986r8k526
7374b1477n055K2711P650q372j0490J552L223m0006M287R892j7935k878J3528
7361d3370J8866K2995R976n184l5577K5809K1232J2469J7488k7382m0983j4125
$$ plain form
7453 -16314 -13659 -13355 -10768 -27076 -47796 -46598 -33993 -26657 12819 22023 20448 18546 11864 15678
7439 15678 27230 23350 -2979 -2642 21150 26977 51839 33997 -692 -26863 -33609 -26183 -24978
7426 -24978 -18914 4441 -9390 -8856 17677 23030 16083 -21478 -45227 -70678 -58336 -51172 -36009
7413 -36009 -19623 -43378 -66815 -70339 -76785 -32575 7512 10521 743 -6074 -13163 -28675 -28796
7400 -28796 -19961 -34420 -9354 16005 33439 39461 13546 -10057 -23100 -39123 -25879 -64591
7388 -64591 -64414 -41281 -40273 -43520 -28605 -18039 -23285 -36286 -23734 2552 1133 -18853 -18951 -21477
7374 -21477 -26532 -3821 3829 -4543 -15033 -13481 -10258 -50264 -45977 -36085 -54020 -56898 -43370
7361 -43370 -24504 -1509 8467 3283 -32294 -6485 14747 27216 44704 17322 -23661 -37786
7349c7786k706L2213J0721p04M095j0019k9929j9698K3762M2969j1123k2693j543
7336b2441J1201J5166K0382J3498Q65j1319q82K7707K4122K933q222R787p376
7323G5421k7306l1125k3743K356k5747m33L3974K491K152N50n181j9715j908q543
7309b6757K015L9969J1209J4400J0751K6037j8228j3445r685m397j99j7677o447
7296G546l45j9361K5793j0181k6711j8324L271L7320l3227j6903k078J5122J1076
7283b7002k824K731K2688j7552J4018J6680K486l3275l8482J3570J2372N044K3700
7270e846J9156l262q060j1835m715P241m068N12k0880J3632J7577j0504k7825
7257c8877P654K0725K6078k062n992J2085p597j2238P141K524k5042j2297O989
$$ plain form
7349 -37786 -40492 -8279 2442 1738 5833 -4186 -34115 -53813 -30051 12918 1795 -20898 -22441
7336 -22441 -11240 3926 24308 37806 38671 27352 26470 54177 78299 81232 73010 82797 75421
7323 75421 48115 16990 -6753 -4397 -30144 -30577 3397 5888 8040 8590 3409 -16306 -18214 -26757
7309 -26757 -24742 15227 26436 40836 51587 77624 59396 45951 36266 31869 31670 13993 7546
7296 7546 7201 -12160 13633 3452 -23259 -41583 -38312 -992 -34219 -51122 -53200 -38078 -27002
7283 -27002 -29826 -27095 -4407 -21959 -7941 8739 11225 -22050 -60532 -46962 -34590 -29546 -5846
7270 -5846 13310 10048 1988 -9847 -14562 -7321 -11389 -10877 -31757 -18125 -548 -11052 -38877
7257 -38877 -31223 -10498 15580 13518 7526 19611 12014 -224 6917 9441 -15601 -27898 -20909
7244b0909M2806O644j4713M708j8804j5313Q404j5507N733M540J335k6742o365
7231d4183R345J3827K3164k3231m638L8481J4921M966n0005k3408J3180N34r430
7218c6477j0655K0779p791J882j9389r986j2106q028J7491K7647J7186L950m67
7205a5964J5063j563r232L063j3098J1804L390K5162R474j4476m418j7909j1431
7192b0135k1441j4993J0047M056j6384j1354K9527j8697l3060J5844K8557K3571
7180b4462k815J2210J5908j648j811O772K2681J9020J7832j5993l6375K51J4151
7167B5721L357m757k0609L964J4484J3583j2965n1065m916J1285J9172K1450j7718
7154I86q996J131j6130L429k99J5771K820l1372q002j95M452j7345q549K7843
$$ plain form
7244 -20909 21897 28541 13828 18536 -268 -15581 -7177 -22684 -16951 -12411 -11076 -37818 -44183
7231 -44183 -34838 -21011 2153 -21078 -25716 12765 27686 32652 -17353 -40761 -27581 -27047 -36477
7218 -36477 -47132 -26353 -34144 -32262 -51651 -61637 -73743 -81771 -64280 -36633 -19447 -15497 -15964
7205 -15964 -901 -2464 -11696 -8633 -21731 -9927 -6537 18625 28099 13623 9205 -8704 -20135
7192 -20135 -41576 -56569 -46522 -42466 -58850 -70204 -40677 -59374 -92434 -76590 -48033 -24462
7180 -24462 -27277 -15067 841 -807 -2618 4154 26835 45855 63687 47694 11319 11570 25721
7167 25721 29078 24321 3712 7676 22160 35743 22778 -28287 -33203 -21918 -2746 18704 986
7154 986 -8010 -6879 -23009 -19580 -19879 -4108 -1288 -32660 -40662 -40857 -36405 -53750 -62299 -34456
7140c4456L4550J9886N990l8039m9469J4550J7208j4013J3163L1869J5407M00
7128A7046m5286K23J8972J8801N122J7537K121j5787J935j8534R973K5922k891
7115C5154r697k438j2201k1927K479J776j7946r222O705L0379R047j586J035r894
7101A664j3145k9626l114J2356K655n290K9173P919J0254j7238r333J076R11P871
7087c867j276l2049j020M570J1605j659L2l980J1112J5940J9616m335Q507J7540
7073D0736k5243j5260m040k287J3346j0927k9797P079N168j2463j4204J8230P845
7060b1817l149j2333j0949J762j4015k0937J3464J2603J4452M9531N1461J7800
7048G7873l5392k4029n70J2592P428j7381r588R877J3090j0995p084p925K9077
$$ plain form
7140 -34456 94 19980 25970 -12069 -61538 -46988 -29780 -43793 -30630 1239 16646 17046
7128 17046 -28240 -28017 -9045 9756 14878 32415 34536 18749 20684 2150 12123 38045 35154
7115 35154 25457 23019 10818 -11109 -8630 -6854 -24800 -34022 -27317 3062 12109 10523 11558 1664
7101 1664 -11481 -41107 -44221 -31865 -29210 -34500 -5327 2592 12846 -4392 -13725 -12649 -11738 -3867
7087 -3867 -5143 -37192 -38212 -33642 -22037 -23696 -23664 -27644 -16532 -592 19024 14689 23196 40736
7073 40736 15493 233 -3807 -6094 7252 -3675 -33472 -26393 -21225 -33688 -47892 -29662 -21817
7060 -21817 -24966 -37299 -48248 -46486 -60501 -81438 -67974 -55371 -40919 8612 60073 77873
7048 77873 42481 18452 17882 30474 37902 20521 10933 20810 33900 22905 15821 7896 36973
7035C6973K113k3036l0639j7380K2199J3915J4379J1517r739l0765j9798O532
7023b3729J2820J7035j0147p607j2352J9419K4321j2197p015N135k86O451o903
7010D945l5120J0442L0669p474k5119m211J5120r387P267r926K6127p256q897
6997a2820K0748O508j4384J4064j1401l770M0649K4058J5688k0506l6506j3824
6985H504j340j0548J5609J9775K604k3170k2676J2854O230O37k2409n375Q692
6972a0613L888j1295q80o195J6273l507k5562P966k1923N871K5511k89j2223J6364
6958a6614p358K5046J4926J865O447P194k9280k252K616L742n159L223Q961J4218
6944B7575J3576j2852M516L949P051L390k2139J0815j7409j6860N60R264Q729
$$ plain form
7035 36973 39086 16050 -14589 -31969 -9770 4145 18524 30041 20302 -10463 -30261 -23729
7023 -23729 -10909 6126 -4021 -11628 -23980 -4561 19760 7563 548 5683 5397 11848 4945
7010 4945 -30175 -19733 10936 3462 -21657 -25868 -10748 -20135 -12868 -22794 3333 -3923 -12820
6997 -12820 7928 14436 52 14116 2715 -1055 39594 63652 79340 58834 22328 8504
6985 8504 7164 -3384 12225 32000 34604 11434 -11242 1612 7842 8479 -13930 -19305 -10613
6972 -10613 -6725 -18020 -18900 -25095 -8822 -12329 -37891 -29925 -51848 -45977 -20466 -20755 -32978 -16614
6958 -16614 -23972 1074 16000 17865 24312 31506 2226 -26 2590 6332 1173 4396 13357 27575
6944 27575 41151 28299 32815 36764 43815 47205 25066 35881 18472 1612 2172 11436 20165
6931B0165j5993j576J633k0112j5167j41K848O685K2112K6592n054q787q112j8760
6917a3667J515R668J2298K0026j2881l808j4841k7246r214K509K8049J7392j081
6904H719j9305j6786J9339n620J52o527j7365N2920K9027J2060P670k3418o7178
6891b6312j0523J5608K1007K3244r45o548N280k522l3829j6506q355J5985L9333
6878A4917k1211o842J447k6090j5039K6514P985n200K112O035L3666q701k3744
6865a4151L5219j0992kP38N24J784Q963j2261m689J3925o301l61K782J656j7697
6850h63O040L643J1104K624J0433J062k9371J8893O335l2828k8490L4207J0128
6837A2917N982n708J3628R371k1307R967J2591J302k7940J9457P689k3203n07
$$ plain form
6931 20165 4172 2596 4229 -15883 -31050 -31191 -28343 -21658 454 27046 21992 13205 5093 -13667
6917 -13667 -12152 -2484 9814 29840 16959 13151 -1690 -28936 -38150 -35641 -7592 9800 8719
6904 8719 -10586 -27372 -8033 -13653 -13501 -20028 -37393 15527 44554 56614 64284 40866 -26312
6891 -26312 -36835 -21227 -220 23024 22079 15531 20811 18289 -15540 -32046 -40401 -24416 14917
6878 14917 -6294 -13136 -11689 -37779 -52818 -26304 -18319 -23519 -21407 -15372 18294 9593 -14151
6865 -14151 21068 10076 10074 10812 11336 13120 22083 9822 5133 19058 12757 12396 15178 16834 -863
6850 -863 5177 8820 19924 22548 32981 34043 4672 23565 29900 -2928 -31418 2789 12917
6837 12917 18899 13191 26819 36190 14883 24850 37441 38743 10803 30260 37949 14746 14239
6824A4239j7168k3155J4788m584p785n02k4756m811n614K2984K839N81L666O669
6810b2609j0381J1739J4099R032m543j6672j0579P346L0061K2507R08m569j6408
6797I931L867m00J1806M77j9142j0048K5481J7514l49Q124J7411K3099r448j3627
6783F4696l7344j4979k4759j1387K484Q389J4812r543j1386J6838K5719r703k4945
6770a1108R541M5331K4993m973j9479O763j3348p728j6750m8351j2220N499J9729
6757b2101K5646j822q922m009K7939q630j6402l2784K2208P192j9669L5227K3532
6744B7405k7082O333O908r046K206k1713j4793J132l2693K6110J7138J368K5812
6731I085K7771K9420M182o232k3273l077j1986K330N669l5711j7050m122K990
$$ plain form
6824 14239 -2929 -26084 -11296 -15880 -23665 -24167 -48923 -53734 -59348 -36364 -33525 -32944 -29278 -22609
6810 -22609 -32990 -21251 -7152 1880 -2663 -19335 -29914 -22568 7493 30000 30908 26339 9931
6797 9931 13798 13398 25204 25681 6539 -3509 21972 39486 39137 47261 64672 87771 78323 64696
6783 64696 27352 12373 -12386 -23773 -21289 -12900 1912 -7631 -19017 -2179 23540 13837 -11108
6770 -11108 -1567 43764 68757 63784 44305 51068 37720 29992 13242 -35109 -47329 -41830 -22101
6757 -22101 3545 1723 -7199 -11208 16731 8101 -8301 -41085 -18877 -11685 -31354 3873 27405
6744 27405 323 6656 13564 4518 6724 -14989 -29782 -28650 -61343 -35233 -18095 -16727 9085
6731 9085 36856 66276 70458 64226 40953 37876 25890 28220 33889 -1822 -18872 -22994 -20004
6718b0004O971n420p128J882J3557J2602P645j1581j995k2006j1759k3784K3906
6705c7114J6527p607n125K1374l306Q640R999l647M409p142M753k2336L058J4131
6691c386K736m411j1042o605J3247K7535q687l566L399j2749j6230J8154L1523
6678B9918O032m718k5324j0975P321O003L3932P46k8698k7995O954K9094j301
6665B0989j7262L0590Q555n0139p754J0831m646L135o032L4286o457j1751J3032
6652A7377J989J1472j6990k0726j3070k245L3566J6225m963J1589j9216l8050
6640b3042q416N162P031k154k8116j0751J6252J6088K326K0277k089l312r77J3321
6626A600Q944j0107r050Q844o443p199j2049P624J2625J2785j1881k4704J23K8703
$$ plain form
6718 -20004 -13033 -18453 -25581 -23699 -10142 2460 10105 -1476 -3471 -25477 -37236 -61020 -37114
6705 -37114 -20587 -28194 -33319 -11945 -15251 -6611 3388 -259 4150 -2992 1761 -20575 -17517 -3386
6691 -3386 -650 -5061 -16103 -22708 -9461 18074 9387 5821 9220 -3529 -19759 -1605 29918
6678 29918 35950 31232 5908 -5067 2254 8257 42189 42935 14237 -13758 -6804 22290 20989
6665 20989 3727 34317 42872 -7267 -15021 -4190 -8836 -5701 -11733 22553 16096 4345 17377
6652 17377 19366 30838 13848 -6878 -19948 -22193 11373 27598 22635 34224 15008 -23042
6640 -23042 -31458 -26296 -19265 -21419 -49535 -60286 -44034 -27946 -25620 -5343 -7432 -10744 -11721 1600
6626 1600 10544 437 -8613 231 -6212 -13411 -25460 -17836 -5211 7574 -4307 -29011 -28888 -185
6612a85J0303K1287l924m2698j61q8j5162k0030J3635N1476R368j5960J956L284
6598A3101j2404j4681l1567J9979J2869j0462k8233R977N306j8337Q928N3736
6586H212N340j7144L2900Q262j265j517p249M018k5080j2810K4466m396N19m822
6572I434j4280j7170k674k940K9177R060j5134j8316Q720P281q192O882k478m683
6558a5313K0769P718K4365r765j5127K066N390K3010j4433k4949p940J1566P789
6545A5146L864J302o666K61p989j5369k771n965o231L4079K0612N466j917l2072
6531A750k6993p898j9484O701K8944j7799R500M16j9500J3324M630k4046J5280
6518c5175P13J0227N175p391j1499K0037M5935r823l008l5610l8921O041J3669
$$ plain form
6612 -185 10118 31405 27481 -15217 -15378 -15466 -30628 -50658 -37023 14453 23821 7861 9817 13101
6598 13101 697 -13984 -45551 -25572 -12703 -23165 -51398 -41421 -36115 -54452 -45524 8212
6586 8212 13552 -3592 29308 37570 36305 34788 27539 31557 6477 -6333 18133 13737 14256 9434
6572 9434 -4846 -22016 -24690 -27630 1547 10607 -4527 -22843 -14123 -6842 -15034 -8152 -10630 -15313
6558 -15313 5456 13174 37539 27774 12647 14713 20103 43113 28680 3731 -4209 7357 15146
6545 15146 19010 20312 13646 13907 5918 -9451 -12222 -18187 -24418 9661 30273 35739 33822 1750
6531 1750 -25243 -33141 -52625 -45924 -16980 -34779 -25279 -24863 -44363 -31039 -26409 -50455 -35175
6518 -35175 -34462 -24235 -19060 -26451 -37950 -17913 28022 18199 15191 -20419 -59340 -53299 -39630
6505c9630K2795M188R574j159j4443k7165J4813J8260K1033k039m2186j2425K8218
6492b0166L5780N426K822p249j6m770j6017L2350J4098O117o657j1442j6123l8994
6478b4841p421J9194k3593m0006L7158J0434j2917J4638J5989M7863J2119P148
6466E5765l0030l9507p762j9579j1850K2828J6224k6962o494L627J2225r554o954
6453d8023q944J1885L9797K8580Q0l3192k8195K7883N1751J7080J567r022j1522
6440C9725j2694j3427j473j2655k6402N038l211J6836M340p877P254O853K3050
6427B5357l3319m0524J0325J2338P083J0036L0053M479m935k4494j9458J6240
6415f819J5106l208m4629R030J6404k0691q570o611L3860M3936J2589k6328j8637
$$ plain form
6505 -39630 -16835 -12647 -3073 -4232 -18675 -45840 -31027 -12767 8266 6227 -35959 -48384 -20166
6492 -20166 15614 21040 23862 16613 16597 11827 -4190 28160 42258 48375 41718 30276 14153 -24841
6478 -24841 -32262 -13068 -36661 -76667 -39509 -29075 -41992 -27354 -11365 36498 48617 55765
6466 55765 25735 -13772 -21534 -41113 -52963 -30135 -13911 -40873 -47367 -43740 -31515 -41069 -48023
6453 -48023 -56967 -45082 -5285 23295 23375 -9817 -38012 -10129 41622 58702 60269 51247 39725
6440 39725 27031 13604 12131 -524 -26926 -21888 -25099 -8263 -3923 -11800 -4546 2307 25357
6427 25357 -7962 -48486 -38161 -25823 -18740 -8704 21349 25828 20893 -3601 -23059 -6819
6415 -6819 8287 5079 -39550 -30520 -14116 -34807 -43377 -49988 -16128 27808 40397 14069 -4568
6402d568J9132K742k5365q176O163q667J9932R626o950k0447N308K4131J3926
6389B6787J905j3570r70J2352K2591J6334j3519o151j9103j4753J2299p919L277
6376A9560m6512k5876M966Q160R992M138J4001M3071J5193k4070k9382j783Q744
6363B02r269m78L339M4049K203k5699l8423j4315J4559J1501n030J3698j2877
6350a6540k562O699J133l578j1510J1295J8796O299j3770k745J4479O624J0941
6337B5561P095Q930J4886q449j9260k8795j6595J6443k2655j366J3991j6878J808
6324b5284j507k7201J5787L3663K0806m82j6276q588l351J6170j456J2134j1721
6311B694j6244o304n856n873j4219J4080K9034J5620j4211j6968J6250J2180j5673
$$ plain form
6402 -4568 14564 17306 -8059 -16235 -10072 -18739 1193 10819 3869 -16578 -11270 12861 26787
6389 26787 28692 15122 14152 26504 49095 65429 51910 45759 26656 11903 24202 16283 19560
6376 19560 -26952 -52828 -47862 -39702 -29710 -25572 -11571 31500 46693 22623 -6759 -8542 202
6363 202 -9067 -9545 -6206 37843 40046 14347 -24076 -38391 -23832 -12331 -17361 -3663 -16540
6350 -16540 -19102 -12403 -11270 -14848 -26358 -15063 3733 10032 -3738 -6483 7996 14620 25561
6337 25561 32656 41586 56472 48023 28763 -32 -16627 -184 -22839 -24205 -10214 -27092 -25284
6324 -25284 -26791 -53992 -38205 -4542 16264 15782 -494 -9082 -12433 3737 2281 14415 2694
6311 2694 -13550 -19854 -25710 -31583 -45802 -31722 -2688 12932 -1279 -18247 -1997 10183 -5490
6298e490k7413j852K0869J0434j0519Q020j1047k3787J5N426J857m95K064k831
6284c4749l2124K5150L719K4723O719j1124K1254J8362j0237p569q352j5603k1370
6271d1201k7911J7271p695j6858K3035K1465K4738K5804k4844l1784J179K0946
6259a5855L3399L534j4198L1890O697k5673l1605j7960K6509L4006K6854l0392
6247B7206k0303p223R344Q298j0991m013O034l457O30j7819j0656O333K2468p773
6233a922N56k3053J6938M1230n037l3207J3792l541K58j2795L121K1902J4730
6220C2972j8300k6427k0651P898J0752P376K831M501O312Q711j7230j2301n189
6207a8745l996j3626k297L0321o68q888Q988M662j0187K0131J121l0545O001L017
$$ plain form
6298 -5490 -32903 -34755 -13886 -3452 -13971 -5951 -16998 -40785 -40770 -35344 -33487 -33982 -31918 -34749
6284 -34749 -66873 -41723 -38004 -13281 -6562 -17686 3568 21930 11693 4124 -4228 -19831 -41201
6271 -41201 -69112 -51841 -59536 -76394 -53359 -31894 -7156 18648 -6196 -37980 -36801 -15855
6259 -15855 17544 21078 6880 38770 45467 19794 -11811 -29771 -3262 30744 57598 27206
6247 27206 6903 -320 9024 17322 6331 2318 8352 4895 5525 -12294 -22950 -16617 5851 -1922
6233 -1922 -1366 -24419 -7481 33749 28712 -4495 9297 5756 6014 -6781 -3660 18242 32972
6220 32972 14672 -11755 -32406 -24508 -13756 -6380 -3549 952 7264 15975 -1255 -13556 -18745
6207 -18745 -22741 -36367 -38664 -8343 -9011 -17899 -8911 -4249 -14436 5695 6816 -23729 -17728 -14711
6193a4711o509m191L512K102J826K2032j7806j0098K1613K3627j1209j03j1004
6180i19r390J4047M353J4953j0359m744Q146j0099J9874Q6o896k3043n229R989
6166G69j8563j9825L9887L0285J3197j7782k0058j5693J0975R386n252O763K42
6153A4331j4320J756L088j7481p479J953P773J8049K1004j455O166l1820k1398
6140a9833K6461J2522o155j3190j4621k3276J410J8880O827L2928P553k7789M452
6127F169K6402J4315J5589k5469m023J065j7634m505k0100L4199j6480j0989P420
6114E959l561j1575R909L7831p247m6779k8668J2902N3630O454j9171K6938l574
6101C3048j7669q564J8055N764j1977p563K400p609J596J5746J9856k1609j2203
$$ plain form
6193 -14711 -21220 -25411 -21899 -19797 -17971 4061 -13745 -23843 -2230 21397 10188 10085 -919
6180 -919 -10309 3738 8091 23044 12685 7941 16087 5988 25862 25948 19052 -3991 -9220 769
6166 769 -17794 -37619 2268 32553 45750 27968 7910 -7783 3192 12578 7326 14089 14331
6153 14331 11 1767 4855 -12626 -20105 -18152 -10379 7670 28674 27219 33385 1565 -19833
6140 -19833 6628 19150 12995 -195 -14816 -38092 -36682 -17802 -10975 21953 29506 1717 6169
6127 6169 32571 46886 62475 37006 32983 34048 16414 11909 -8191 26008 9528 -1461 5959
6114 5959 2398 -9177 732 38563 31316 -15463 -44131 -31229 22401 28855 9684 36622 33048
6101 33048 15379 6815 24870 30634 18657 11094 13494 5885 7481 23227 43083 21474 9271
6088I271Q82O617k0750M947k174k8654p055J6218j8953r670K395M879n337k725
6074e0109P572J5528o169J4448L753k164m907J112j6437j1078J7477L6374N290
6061A0690K7913n004k8213m3320j8768N2807L5611m396k1299m975o73J3993J1267
6048B5633k2675n824j5586j6182r767P536n94N340o529r703K4819p470J2357P098
6034a1547J236n503j3643j6724j9895K766J2308J1418J8738O513Q664l292o999
6021a5960k1786r769l7713l019j2776M609L2506J6139K043m865K4876M7821L8993
6008F1099k7883k670J4644j2869n1750l2203L6246K809J2423O703K0493J27K270
5995B9439J5466J4863k7756j6900L2596j6057j6798j4779O386j1387k4183J7644
$$ plain form
6088 9271 10153 16770 -3980 967 -1207 -29861 -36916 -20698 -39651 -49321 -46926 -42047 -47384 -50109
6074 -50109 -42537 -27009 -33178 -18730 -14977 -17141 -22048 -20936 -37373 -48451 -30974 5400 10690
6061 10690 38603 33599 5386 -37934 -56702 -3895 31716 27320 6021 1046 373 14366 25633
6048 25633 2958 -2866 -18452 -34634 -44401 -36865 -37459 -32119 -38648 -48351 -23532 -31002 -18645 -11547
6034 -11547 -10311 -15814 -29457 -46181 -66076 -63310 -51002 -39584 -20846 -14333 -5669 -8961 -15960
6021 -15960 -37746 -47515 -85228 -88247 -101023 -96414 -63908 -47769 -45726 -50591 -25715 22106 61099
6008 61099 33216 30546 45190 32321 -19429 -51632 -15386 -12577 -154 6549 27042 27169 29439
5995 29439 44905 59768 32012 15112 47708 31651 14853 74 6460 -4927 -29110 -11466
5983a1466K8236L3895K9017m0638n268j403m6234l297J6633o149k311Q607K6478
5970B6100k451j7505j995K1918r331k4153p344L2771J4801p024J6245L026J0250
5957E5308O504l248k6125p178l8129N850k250Q484M13Q901n671l2068q542M3796
5943F045P810j6934k255l1176J972J8145K4690J2466j0999j7666m823j0001k9393
5930e2119j1396K4850j2216L5373K3467J9889l3825O356M75L792p604P202m2914
5917c8670j6595J4661K1726K6688k5691r688M0140L1432r129k0587l1163J5610
5905a266j0837n140j3396n504r311J6549j2078q592M068p615p723J6760M9672
5892E587L8993j4824k4817k5466J4647K4o053O420K1700k445j1010j2775m292
$$ plain form
5983 -11466 16770 50665 79682 39044 33776 32373 -13861 -17158 -525 -6674 -8985 -378 26100
5970 26100 23649 6144 4149 26067 16736 -7417 -14761 18010 32811 25787 42032 45058 55308
5957 55308 61812 58564 32439 25261 -12868 -7018 -9268 -784 -371 8530 2859 -29209 -37751 6045
5943 6045 13855 -3079 -5334 -36510 -34538 -16393 8297 20763 9764 -7902 -12725 -22726 -52119
5930 -52119 -63515 -38665 -50881 -15508 7959 27848 -5977 379 854 4646 -2958 4244 -38670
5917 -38670 -55265 -40604 -18878 7810 -17881 -27569 12571 44003 34874 14287 -16876 -1266
5905 -1266 -12103 -17243 -30639 -36143 -45454 -28905 -40983 -49575 -45507 -53122 -60845 -44085 5587
5892 5587 44580 29756 4939 -20527 -5880 -5856 -11909 -5489 16211 13766 2756 -10019 -14311
5879a4311J805R63K6537k2272n072l217N680k6752J0097J1634J7787Q822o796
5866D905j9653l8191j8048M1923L3166n238j5787J0707j7027M953j7027l30K3223
5853a2424J5802p935j3511k4258R960O420M050M524k0209j257K3710J9316K2698
5840B6886m582j3023n778J6413J225k4745k0321J3357J727J3111J272m001J5840
5827A7381K1739Q575j4678l4945o702Q582k4680P646n140J6733j0708j947K1110
5814B966k4832J0784j2719j4534j1646n272J8212o169N448J1791k9447J469n508
5801e9457Q751K607J1765j1749K8177K2288K3766J6160k8620k755J2447L921J04
5788B7405J0099l3987j9193J2083k918L3679K1952o628k1314r614N741j3428j128
$$ plain form
5879 -14311 -12506 -11543 14994 -7278 -12350 -15567 -9887 -36639 -26542 -14908 2879 11701 4905
5866 4905 -14748 -52939 -70987 -29064 4102 -1136 -16923 -6216 -23243 -18290 -35317 -35647 -12424
5853 -12424 3378 -4557 -18068 -42326 -32366 -25946 -21896 -17372 -37581 -38838 -15128 4188 26886
5840 26886 22304 9281 3503 19916 21141 -3604 -23925 -10568 -8841 4270 5542 1541 17381
5827 17381 39120 47695 33017 -1928 -8630 -48 -24728 -17082 -22222 -5489 -16197 -18144 2966
5814 2966 -21866 -11082 -23801 -38335 -49981 -55253 -37041 -43210 -37762 -25971 -55418 -53949 -59457
5801 -59457 -50706 -48099 -36334 -48083 -19906 2382 26148 42308 13688 10933 23380 27301 27405
5788 27405 37504 3517 -15676 -3593 -6511 27168 49120 42492 21178 11564 17305 3877 2749
5775B749k1057j9949Q612j1944K1016J603j5692R779P542o885l0838j6197L7246
5762c4015J0781L6167J302k0037J4348J530j4132j6509K1959K2226L002k785r926
5749A3911j3841n014K7218M1232k3149k6764o826l0508L922K4652K5848k3485
5737G196m025L0862J1173j6827k3555J8015j332j9395j2209K6265K9180k7632
5725A7716R185l800j9493j541K587j0837J1392k13j746O804R22J5993J3697k7798
5711A2868j7446K0516J50k7623J024j1912l006K1707K2065L0341k962k1202m8056
5698b3536M704O563O497J9828k9084l1787M359K586J6107k580p250R367M948j1071
5684c0349M0296L9652r071L1213j6825o0403r115K3806K9152k4925j0470J2929
$$ plain form
5775 2749 -18308 -38257 -29645 -41589 -20573 -18970 -34662 -24883 -17341 -24226 -55064 -71261 -34015
5762 -34015 -23234 12933 14235 -5802 8546 10076 -4056 -20565 1394 23620 26622 23837 13911
5749 13911 70 -4944 22274 63506 40357 13593 6767 -23741 -19819 4833 30681 7196
5737 7196 3171 34033 45206 28379 4824 22839 21507 2112 -10097 16168 45348 17716
5725 17716 26901 23101 3608 2067 4654 -6183 5209 4996 3250 10054 10976 26969 40666 12868
5711 12868 -4578 15938 16088 -11535 -10511 -22423 -25429 -3722 18343 48684 45722 24520 -23536
5698 -23536 -18832 -12269 -5772 14056 -15028 -46815 -42456 -39870 -23763 -26343 -33593 -24226 -19278 -30349
5684 -30349 9947 49599 40528 71741 54916 -5487 -14602 9204 38356 13431 2961 15890
5672A5890l3739j9316k0245k7694L6181L6981J6366J6253J6786k0006k0445J2650
5660I662j5197p912j0703M96J6554m326J2148K8037l724j0690o798j2683m217
5647i353K916K118j1450o125M523n455L467m441k5896k4453Q542K4987L3293l8132
5633d5459J908O068L3018L4462K4696o704j8182k1428J1164j3031j8131J1040
5621e79j9702k4263o08k5224M303M917K0992L0622L0631O255k1529m657p685q594
5607a5121j4708J8768k033M200K1865K9839O651J1146n249j9486j9061q902Q063
5594A5972L0046n906j4214q05J0790J5396j4650J5014K2146j7772m5080k2720
5582a1783l32K2436k2709J2052k6653k131J7815J365M148J7305J2556J9864r09
$$ plain form
5672 15890 -17849 -37165 -57410 -85104 -48923 -11942 4424 20677 37463 17457 -2988 9662
5660 9662 -5535 -13447 -24150 -23654 -7100 -11426 722 28759 25035 14345 7547 -5136 -9353
5647 -9353 -6437 -4319 -15769 -21894 -17371 -22826 -19359 -23800 -49696 -74149 -65607 -40620 -7327 -45459
5633 -45459 -43551 -37483 -4465 29997 54693 47989 29807 8379 19543 6512 -11619 -579
5621 -579 -20281 -44544 -45152 -70376 -66073 -61156 -40164 -9542 21089 27344 5815 1158 -6527 -15121
5607 -15121 -29829 -11061 -13094 -8894 12971 42810 49461 60607 55358 35872 16811 7909 15972
5594 15972 46018 40112 25898 25093 35883 51279 36629 51643 73789 56017 10937 -11783
5582 -11783 -12115 10321 -12388 -336 -26989 -29120 -11305 -9940 -5792 11513 24069 43933 43024
5569D3024l6000j4037Q981m570j7405J6268K6272J7621J0665j1336k8662l3183
5557b2362j2555m817K9626n982j4567M975N814J3773K1849o494j1593J2616N057
5544A5340J9886L297k8218j5149K3499K234j9339q076J2390K7179j2261j4248
5532F534k1987J2648O705j5541k5076j3600K8241K1909j8074j3489l524K6689
5520h565J7824M152J2322n13r53l2693j9399j7299q879j966J4961Q405K2372N0542
5506D0311o999k2621r786J1695J6535o466k775q266k0178Q421M920k0086J903
5493a3392l6080M521R799M0453O018J2751p611l0121o688J0739j4402o11n591
5480c0215n020m739P451r527J0562J2253J9946M437q415L476O471K1372j748K4595
$$ plain form
5569 43024 7024 -7013 1968 -2602 -20007 -3739 22533 40154 50819 39483 10821 -22362
5557 -22362 -34917 -39734 -10108 -16090 -30657 -25682 -19868 -6095 15754 9260 -2333 10283 15340
5544 15340 35226 38523 10305 -4844 18655 20889 1550 -6526 5864 33043 20782 6534
5532 6534 -15453 -2805 3900 -11641 -36717 -50317 -22076 -167 -18241 -31730 -35254 -8565
5520 -8565 9259 13411 25733 25220 24267 -8426 -27825 -45124 -54003 -55969 -41008 -32603 -10231 40311
5506 40311 33312 10691 905 12600 29135 22669 19894 11628 -8550 -129 4791 -15295 -13392
5493 -13392 -49472 -44951 -35152 5301 11319 24070 16459 -13662 -20350 -9611 -24013 -24624 -30215
5480 -30215 -35235 -39974 -32523 -42050 -31488 -19235 711 5148 -3267 209 6680 28052 26304 50899
5466E0899K965j4924l4499k2736j384P762j5298q435N869M4503J848j3682k6219
5453b3331k672N115Q108o236m062q59J3467J9408M6744J6433k195l7629m2260
5440i969k6416J553J4241J8070O292j6678k540p717P599O01j0306l695J6783M50
5426a1732J406q308L028L4761N620j9424j3519j5585M075M0963M1136J601k2821
5413D1201j8262j8174J0747O703l1009j3121n76l4033P684J5984K2859K9144J4424
5400C3571p922j6430k2302l7435P884J4610K7019J5552O359O394k8307k7106l03
5387b8416J8100k705J1022o041j3000R328J1640j1708p281o100M0079K4075j3020
5374B5973j5907p074r494L8877J6703j8041m4544k7888l0737J3034L2405J856
$$ plain form
5466 50899 53864 38940 4441 -18295 -19679 -11917 -27215 -35650 -29781 14722 16570 2888 -23331
5453 -23331 -26003 -20888 -12780 -19016 -23078 -23937 -10470 8938 55682 72115 69920 32291 -9969
5440 -9969 -36385 -34832 -20591 -2521 3771 -12907 -15447 -23164 -15565 -14964 -25270 -28965 -12182 -11732
5426 -11732 -10326 -18634 -15606 19155 24775 5351 -8168 -23753 -19678 21285 62421 64022 41201
5413 41201 22939 4765 15512 22215 -8794 -21915 -22491 -56524 -48840 -32856 -9997 19147 33571
5400 33571 25649 9219 -13083 -50518 -42634 -28024 -1005 14547 20906 27300 -1007 -28113 -28416
5387 -28416 -10316 -13021 -1999 -8040 -21040 -11712 -72 -11780 -19061 -25161 14918 38993 25973
5374 25973 10066 2992 -6502 32375 49078 31037 -13507 -41395 -72132 -59098 -26693 -24837
5362b4837R64J9941n004l9379j7458r2J7172N50P584J5082j4914j5699l768N90
5348e9268M5653K1979R269k0292j8915J7989L5478N300k3792O121j0093P693o312
5335A0810j954k9854l012K6510l999K404j2064k913J8574k869j5268K0743J439
5322H547R322K260j1914K76j3061K7014P056Q908J7086j701j2280N198k3153r06
5308B2652J3764n775j9273j5864J0576N4204M26o063r526k4348k4696J6590P726
5295B0393k1907j6518J3599l855k6273k0389J9059N107J6506K0796L915l4631
5283b4198o071L7616M473j7503L907k6463L701J4871L623j015J0415j8799J894
5270a3549K0315J080K660m822P681J3446k9275m235l39k0377O967q963q467j3289
$$ plain form
5362 -24837 -23873 -3932 -8936 -48315 -65773 -65865 -48693 -48143 -40559 -25477 -40391 -56090 -59858 -59268
5348 -59268 -13615 8364 17633 -2659 -21574 -3585 31893 37193 13401 19522 9429 17122 10810
5335 10810 8856 -20998 -24010 2500 -1499 905 -11159 -14072 4502 1633 -13635 7108 8547
5322 8547 17869 20129 8215 8491 -4570 22444 29500 38408 55494 53793 41513 46711 23558 22652
5308 22652 36416 30641 11368 -4496 6080 60284 60710 54647 45121 20773 -3923 12667 20393
5295 20393 -1514 -18032 -4433 -8288 -34561 -54950 -35891 -30784 -14278 6518 10433 -24198
5283 -24198 -30269 7347 11820 -5683 -1776 -28239 -24538 -9667 -6044 -7059 3356 -15443 -13549
5270 -13549 6766 7846 10506 5684 13365 26811 -2464 -6699 -7038 -27415 -20448 -29411 -37878 -51167
5256e1167J4840R704M973o173j4080K7177O253L682J6884j0238q57K776J154J1587
5242A6515J9751L7521q899k6304k949O362k3926j8041n549l7778j621J8047K3401
5229c470J8111R110q261j3932j7836j3954K1104K8695J4418J2452l0369j9421
5217c353J8307j3741J0256J4344J7494R925J066p277J0388n657k3269j3701o02
5204A4180J7049j6163j1173K884j373L952k306L3739K3703j3257m6499j8160J5899
5191B475J4652j7198q776j0639k2337o514R10J3532M217k3609q353K0555J3409
5178b7676K3252K7871K605L551j18l7588k6781j3995M002K0995O1042K4606M780
5165F6546j8729j3309o542j3103k4084o208j404J777j2930K5265L6258k4400n235
$$ plain form
5256 -51167 -36327 -26623 -21650 -27823 -41903 -14726 -8473 -4791 12093 1855 998 3774 4928 16515
5242 16515 36266 73787 64888 38584 35635 41997 18071 30 -5519 -43297 -44918 -26871 -3470
5229 -3470 14641 23751 15490 1558 -16278 -30232 -9128 19567 33985 46437 16068 -3353
5217 -3353 14954 1213 11469 25813 43307 53232 54298 47021 57409 51752 28483 14782 14180
5204 14180 31229 15066 3893 6777 5404 9356 7050 40789 64492 51235 4736 -13424 2475
5191 2475 17127 -71 -8847 -19486 -41823 -48337 -47427 -33895 -29678 -53287 -61640 -41085 -27676
5178 -27676 -4424 23447 26052 29603 29485 -8103 -34884 -48879 -44877 -23882 37160 61766 66546
5165 66546 47817 34508 27966 14863 -9221 -15429 -16833 -15056 -27986 -2721 33537 9137 3902
5152C902J6127J385J2604N129O490K0934o611l2299m7754O184K5060N9051J1239
5139H1441k4466k9548l5473N15K2524n855j5764l590l553O814J0964o123Q075
5126E961L2124l423j5882p535Q47p840l625K4798J8333q629j0526J184J9049P495
5112E2331j7569j9089k838J4401j4888N634J038m596k2534j1079J664J5788K1936
5099B0199J6316l6581l1239L74M5K0028L020l261M706n237n30M722L24j9592q51
5084b7557k26k7888K0364J1743K0147K7487j4544k7307l2591k1871N6741J2653
5072b849j6102j164j1850P553j6972M29l458j0417L0598L6603j1560k2558j9909
5059d1656O092M241J9m68L2344K0143j8940J185j4658J0102p211R260R105l495
$$ plain form
5152 3902 20029 21414 34018 39147 45637 66571 59960 27661 -20093 -13909 11151 70202 81441
5139 81441 56975 27427 -8046 -7531 14993 9138 -6626 -10216 -13769 -6955 4009 -2114 5961
5126 5961 38085 34662 18780 11245 12092 4252 627 25425 43758 35129 24603 25787 44836 52331
5112 52331 34762 15673 12835 27236 12348 17982 19020 14424 -8110 -19189 -17525 -1737 20199
5099 20199 36515 -66 -31305 -30931 -30886 -10858 -7838 -11099 -6393 -11630 -12160 -7438 -7114 -26706 -27557
5084 -27557 -27783 -55671 -35307 -23564 -3417 24070 9526 -17781 -50372 -72243 -15502 -2849
5072 -2849 -18951 -20115 -31965 -24412 -41384 -40955 -44413 -54830 -24232 12371 811 -21747 -41656
5059 -41656 -35564 -31323 -31304 -31772 572 20715 1775 2960 -11698 -1596 -8807 453 9558 6063
5045F063J6167J4915m3191l1969L486l998j040J1019J8805J5683J6369j1142n90
5032A0577m594k525j3451j5069J9759K7723L6912p784l930m2933k3852m667j0209
5019c4043m0381K091M0754K2307Q02M837p900k0827r328j3433J8604M394M9402
5006A7279J6271l3670J1936J4635P64j8732Q613j3980k4187L279k714L1702Q270
4993A9466q782L847o754O396j132Q433q797j2090L8549k1190m2526J584j2896
4980c5892M5543M0042l829j6258k4876l2528j8813j70P534J1684J8981k1317P725
4967b2174K4766Q452m4324J3333P331j2445J0930p050J6235J2745j2419K6954
4955B2334j3214m4507J4558K1467j4134j2810K2395K4947K2731j6423k0731M693
$$ plain form
5045 6063 22230 37145 -6046 -38015 -34529 -38527 -39567 -28548 -9743 5940 22309 11167 10577
5032 10577 5983 3458 -9993 -25062 -5303 22420 59332 51548 47618 4685 -19167 -23834 -34043
5019 -34043 -74424 -72333 -31579 -9272 -8470 -3633 -11533 -32360 -41688 -55121 -36517 -32123 17279
5006 17279 33550 -120 11816 26451 27215 8483 17096 3116 -21071 -17792 -20506 11196 19466
4993 19466 10684 14531 7777 14173 13041 21474 12677 587 39136 17946 -24580 -22996 -35892
4980 -35892 9651 49693 45864 29606 4730 -27798 -46611 -46781 -39247 -27563 -8582 -29899 -22174
4967 -22174 2592 11044 -33280 -19947 -12616 -25061 -14131 -21181 -4946 7799 -4620 22334
4955 22334 9120 -35387 -20829 638 -13496 -26306 -3911 21036 43767 27344 6613 11306
4943A1306l91p796j3023J8931J9585J7935k7538j0377Q220n156J4963J2350q386
4930C0623j2123m203p626P179K575L790j9741j7433K0444J1294j9269J1774J0815
4917A8099q724j1537R608Q471Q996K433j3410R644j567J3015r949l1384K693R488
4903E876j857l0543k380J9232J4744j3656n455k3292J4527r135l1598p812M7692
4890b3657J5508j6438L933J6447J3841l6172J3406O731k9756J4084j0870m452
4878c7395K9764K5847J6884k7684o357O590J4654R707l3353q454q959J4707K1304
4865A7255j4459m677J9237k583M85j225k7L2276k3801l8966R397l4679k0273M1280
4851b0760K2696m1167l4958L4701M5489l2626k4774Q114M0813k963l0338K0031
$$ plain form
4943 11306 10915 3119 -9904 9027 28612 46547 19009 8632 16852 11696 26659 39009 30623
4930 30623 18500 14297 6671 13850 16425 20215 474 -16959 3485 14779 -4490 7284 18099
4917 18099 9375 -2162 7446 15917 24913 27346 13936 23580 22013 35028 25079 -6305 -3612 5876
4903 5876 4019 -26524 -28904 -9672 5072 -8584 -14039 -37331 -22804 -31939 -63537 -71349 -23657
4890 -23657 -8149 -24587 -20654 -4207 9634 -26538 -13132 -6401 -36157 -22073 -32943 -37395
4878 -37395 -7631 18216 35100 7416 1059 7649 22303 32010 -1343 -9797 -18756 -4049 17255
4865 17255 2796 -1881 17356 14773 15258 14033 14006 46282 22481 -16485 -7088 -41767 -62040 -20760
4851 -20760 1936 -39231 -74189 -39488 6001 -26625 -51399 -43285 -2472 -5435 -35773 -15742
4839a5742m238k3290J0869L5011n447n522o765N026j1965n883K7638J3543K0527
4826C3762J0740r084l1714j7304j5222Q134L7283p546l4706L2928M2573M0967
4814I0811k2977k1258k5070m4212j6652K3845K0031o459P242K0872j3539n996
4802F638o373O648R211M4787j0636l6108j7190o790j0570O586K1775J7884l4938
4789i076J3480J7747N921k8512j6845j7105n107M569J1194k8669n583K5843J1497
4776b0646N253N871r155p802K0891J4476j0175O227j021Q871J1777j2663l136
4763H768K2408K427l514M219k6807l255K0687J6250m823K893M11j6214l0700j7836
4749b5086J3161p608m015n267N338j4157m942O496J4393K6243J357k1832j5152
$$ plain form
4839 -15742 -19980 -43270 -32401 2610 -2837 -8359 -15124 -10098 -22063 -27946 -308 13235 33762
4826 33762 44502 35418 3704 -13600 -28822 -20688 16595 9049 -25657 7271 49844 90811
4814 90811 67834 46576 21506 -22706 -39358 -15513 4518 -1941 5301 26173 12634 6638
4802 6638 265 6913 16124 60911 50275 14167 -3023 -9813 -20383 -13797 7978 25862 -9076
4789 -9076 4404 22151 28072 -440 -17285 -34390 -39497 -34928 -23734 -52403 -57986 -32143 -20646
4776 -20646 -15393 -9522 -18677 -26479 -5588 8888 -1287 4940 3919 12790 24567 11904 8768
4763 8768 31176 33603 30089 34308 7501 4246 24933 41183 36360 39253 39664 23450 -7250 -25086
4749 -25086 -11925 -19533 -23548 -28815 -23477 -37634 -42576 -36080 -21687 4556 5913 -15919 -31071
4736c1071J2869m576L5354J887P293o831k4773m504J7614j6160l800k3801j6155
4723e6654L4900m614q019J3273M792P38o372M939J57j2297j8070r061p440K5502
4709c8226K4835k4250j0603M782K2461L0474L234k3696p587J7924l1073j7868
4697d9593K3063J4171O103j7804j0717O168m697J1430L9454j6934o672k726L2470
4684B3716k2796l3772Q471J4947K8525j0627p710k0043l1385p205j3147Q406L9027
4671b3593K9168M784k9402k082K7120l9432j5248j44K4081o677J5429m386J4822
4658e560L5917r71r079J4901J2765l2236k2514j6231o586J0396m322K7788K2839
4645B7107k4490P51k391m750r15l809J0131K3937J8080q101k6830J3949K784J4801
$$ plain form
4736 -31071 -18202 -22778 12576 14463 21756 14925 -9848 -14352 3262 -12898 -16698 -40499 -56654
4723 -56654 -21754 -26368 -34387 -21114 -16322 -15584 -21956 -17017 -16860 -29157 -47227 -56288 -63728 -38226
4709 -38226 -13391 -37641 -48244 -43462 -21001 9473 12707 -10989 -18576 -652 -31725 -49593
4697 -49593 -26530 -12359 -6256 -24060 -34777 -28609 -33306 -21876 17578 644 -6028 -8754 23716
4684 23716 920 -32852 -24381 -9434 19091 8464 754 -19289 -50674 -57879 -71026 -62620 -23593
4671 -23593 5575 10359 -19043 -21125 5995 -33437 -48685 -48829 -24748 -31425 -15996 -20382 -5560
4658 -5560 30357 29386 20307 35208 47973 15737 -6777 -23008 -29594 -19198 -23520 4268 27107
4645 27107 2617 3368 977 -3773 -4688 -8497 1634 25571 43651 35550 8720 22669 25453 40254
4631D0254o246p524j0586J9271N393J268l9903N174K0760L422k1575j6261L3913
4618B7360J7264J80k9741k0317O689l009j6904k0967k6275q576K7551J8929K326
4605b5490N316r870L709J5501J3826j0847L807J969J9578k923q687l70L3873p631
4591C1761n1258Q690K6547n267j2190Q852J7664l7097j5453K1699L4620m062k2469
4578B037o721J5696k7498o8m041j3293m385Q474J0078q088K1425r045k2390J1135
4564b6684J1990L1166J3661q144n559m5026J726K7392o52j35k0231n6p327J5991
4550a1888L8347Q676j3173k289P387l448l7799r088N2640j107n087k632J6288
4537C6827J218l1240j0611j5411J3877J7514N209j3500J6091M723l7577M646o080
$$ plain form
4631 40254 34008 26484 15898 35169 40562 41830 1927 7101 27861 31283 9708 -6553 27360
4618 27360 44624 44804 15063 -5254 1435 -1574 -18478 -39445 -65720 -74296 -46745 -27816 -25490
4605 -25490 -20174 -30044 -26335 -10834 2992 -7855 -4048 -2079 17499 14576 5889 5519 39392 31761
4591 31761 -19497 -10807 15740 10473 -1717 7135 24799 -12298 -27751 -6052 28568 24506 2037
4578 2037 -4684 11012 -16486 -16554 -20595 -33888 -38273 -29799 -19721 -27809 -6384 -15429 -37819 -26684
4564 -26684 -14694 16472 30133 21989 16430 -28596 -26870 522 -130 -265 -20496 -20552 -27879 -11888
4550 -11888 26459 35135 21962 19673 27060 23612 -14187 -23275 29365 28258 23171 20539 36827
4537 36827 38045 6805 -3806 -19217 -5340 12174 17383 3883 19974 24697 -12880 -8234 -14314
4524a4314n088k069O571M901J0935r219J1037J709P0p607k3989O825O672J6624
4510C058n893M482j2522J0861K632k5274r454J5737j3716O350N3781l935Q134
4497C4241j4763K002J6571j3159K720j048j3444j1960K0439J8163k828J0761j9297
4484B8398j3942j1744l0191k731M447j6567k2780K6542M4899N248k6436k37J2284
4471b810J7895p419l4689p056j2029Q938L6934J5521k6228k7567K348m977n517
4458d6656j0310J2861M1964J7963n465j3142j3143J300J1049k002J406K6339J2799
4445C4963k4670j4998L1736N735k4115Q051J4118K8071j3588k023k5438j3075
4433D767R882J8786j161q114J6317Q700j2560k7779n371k2523P757R744p176N063
$$ plain form
4524 -14314 -19402 -21471 -14900 -9999 936 -8283 2754 4463 4533 -3074 -27063 -20238 -13566 3058
4510 3058 -2835 1647 -10875 -14 2618 -22656 -32110 -16373 -30089 -23739 30042 26107 34241
4497 34241 19478 21480 38051 24892 27612 26564 13120 1160 21599 39762 36934 47695 28398
4484 28398 14456 2712 -27479 -30210 -25763 -42330 -65110 -38568 6331 11579 -14857 -15094 -2810
4471 -2810 15085 7666 -27023 -34079 -46108 -37170 -236 15285 -10943 -38510 -36162 -41139 -46656
4458 -46656 -56966 -44105 -2141 15822 10357 -2785 -15928 -14628 -3579 -5581 -4175 22164 34963
4445 34963 10293 -4705 27031 32766 8651 16702 30820 58891 45303 43280 17842 4767
4433 4767 14649 33435 32274 24160 40477 49177 36617 8838 3467 -19056 -11299 -1555 -8731 -3668
4419c668K3841o743J0928J0380Q642n926k0637p586k0167O372K2835l030Q228
4406B3469J2569R011j5954k7323O497m532m098L0820r94l9700k0798R592J7483
4393c958K7196K2011p736k4987k8316J5397J6411R208k1768j3097M41j4604J3711
4380a0091N0739r970m5914J4225L7718k6235Q543J1935L591l972j0269K700j1449
4367A1551m4270j4396K1029J3138k672J7847L6717l43k2643j7998K167J1081M111
4354A5319p904k8372N310j1745p000N82K6949K1571q044j6061j1765N944k234
4341a7450j9731j4869J6276K6352K861K9579J7953j7745o639o959m2569J1757
4329b1184L3317K5940m770l1108q967K7229J6324j3193j2186N88l861J053j510
$$ plain form
4419 -3668 20173 13430 24358 34738 43380 37454 16817 9231 -10936 -4564 18271 15241 23469
4406 23469 36038 45049 29095 1772 8269 3737 -361 30459 29465 -10235 -31033 -21441 -3958
4393 -3958 23238 45249 37513 12526 -15790 -393 16018 25226 3458 -9639 -9198 -23802 -10091
4380 -10091 40648 30678 -15236 -1011 36707 10472 19015 30950 34541 30569 20300 23000 11551
4367 11551 -32719 -47115 -26086 -12948 -15620 2227 38944 38601 15958 -2040 127 11208 15319
4354 15319 7415 -20957 -15647 -27392 -34392 -33810 -6861 14710 6666 -9395 -21160 -15216 -17450
4341 -17450 -37181 -52050 -35774 -9422 -6561 23018 40971 23226 16587 9628 -32941 -21184
4329 -21184 12133 38073 33303 2195 -6772 20457 36781 23588 11402 11990 8129 9182 7672
4316G672k5555o705K326j0046K4621J9396K6455K2239j4789j0655j6420k8957
4304a0418j2124J9095K5076j6945k8225o30J4106N764j2564L4206P063j204m0574
4291a7374K1959J5978J0077J1915o258k5626k8930K495N203L7634J6518Q882J3302
4278F5775l6652m9675J5296r883k7012m720M568J7433l651J1496L8809J5622J7885
4265E5291J2446j4151l5846j7055p248Q849L0265j6150m5661n563k7373n01L9211
4252b3486M2202J6174K182N368j7410r42L2439j7932m0192l999N298K3441k7509
4239d366k2160R512K1359J6526L654k7481K184m877L1723m712l5931J083J7125
4226C639k237m856J0365J1888j9399m949j3852J5746l324R004K6048r838J3863
$$ plain form
4316 7672 -17883 -24588 -22262 -32308 -7687 11709 38164 60403 45614 34959 18539 -10418
4304 -10418 -22542 -3447 21629 4684 -23541 -24171 -10065 -4301 -16865 17341 24404 23200 -17374
4291 -17374 4585 20563 30640 42555 36297 10671 -18259 -15764 -10561 27073 43591 52473 65775
4278 65775 29123 -20552 -5256 -15139 -42151 -46871 -42303 -24870 -28521 -17025 21784 37406 55291
4265 55291 67737 53586 17740 685 -6563 2286 32551 16401 -29260 -34823 -62196 -62697 -23486
4252 -23486 18716 34890 37072 42440 25030 24088 56527 38595 -1597 -5596 -298 23143 -4366
4239 -4366 -26526 -17014 4345 20871 24525 -2956 -772 -5649 26074 21362 -14569 -13486 3639
4226 3639 1402 -3454 6911 18799 -600 -5549 -19401 -3655 -6979 2025 28073 18235 32098
4213C2098m524j8905K016p560j0880K0742M8059l032k6365j8712J4185Q348L5797
4200G1267j5013J7340j4674k9366o420n7917j5242K7995J9725J247m530M509J4182
4187A3103K083O279j3835j0774J3214M404K2298L829J5523K7096m3677m0077m689
4174e223j112P106Q130n638q672j6192j5978j2577j7171J0618P201P439K2220
4161a9849J2135J93k6789r99K9935J7484m434j4667L3330L728l2953j1521n857
4148b0264m426N502J5157q41l43J0606k02q146k3106j8444J8499L740j24k237
4134b4629l062K7531J9880K4784k5856o133r763j3424k1804j9570j4569J9119
4122d7496J0401J2565j843J9361J4468j2413m641n582P521L548L166N900K1600
$$ plain form
4213 32098 27574 8669 10685 3125 -7755 12987 61046 58014 31649 12937 27122 35470 71267
4200 71267 56254 73594 58920 29554 23134 -34783 -50025 -22030 -2305 -1058 -5588 -1079 13103
4187 13103 15186 21465 7630 -3144 10070 14474 36772 40601 56124 83220 39543 -534 -5223
4174 -5223 -6335 771 8901 3263 -5409 -21601 -37579 -50156 -67327 -56709 -49508 -42069 -19849
4161 -19849 -7714 -7521 -34310 -35309 -5374 12110 7676 -6991 26339 30067 -2886 -14407 -20264
4148 -20264 -24690 -19188 -4031 -4872 -5215 5391 5189 -2957 -26063 -44507 -26008 -22268 -22392 -24629
4134 -24629 -27691 -160 19720 44504 18648 12515 2752 -10672 -32476 -52046 -66615 -47496
4122 -47496 -37095 -24530 -26373 -7012 7456 -4957 -9598 -15180 -7659 -4111 -945 4955 26555
4109B6555j3267j3104j3135j6063k2098K8400N6989m975j2561j5357j7313p225
4097b3154j7247K8052j7004j0982j7680k605J0995r50N498J954L8453K0302m189
4084A1443j6930R831k93j6226J0106K9590K2168k6753k4189J0483K311j7066K451
4071c074K2183q909j9531J0163O881M2850J831m2857M912J3441o474p945l2795
$$ plain form
4109 26555 13288 184 -12951 -29014 -51112 -22712 34277 29302 16741 1384 -15929 -23154
4097 -23154 -40401 -12349 -29353 -40335 -58015 -60620 -49625 -50575 -45077 -43123 -4670 15632 11443
4084 11443 -5487 4344 4051 -12175 -2069 27521 49689 22936 -1253 9230 11541 -5525 -3074
4071 -3074 19109 10200 -9331 832 7713 50563 52394 9537 14449 27890 21416 13471 -19324
$$ [...]
##END NTUPLES=NMR SPECTRUM
##END=
