##TITLE=Analysis number 329433
Compound Code cc 68226
Book Reference 546/22
Project Code adrs
Chemist Name craigr
##JCAMPDX= 6.0         $$ Bruker NMR JCAMP-DX V2.0
##DATA TYPE= NMR SPECTRUM
##DATA CLASS= NTUPLES
##ORIGIN= Bruker BioSpin GmbH
##OWNER= nmr
$$ XWIN-NMR		Version 3.5
$$ Fri Aug 31 10:27:23 2007 GMT Daylight Time (UT+1h)  MAYBRIDGE\nmr@NMR_250MHZ
##.OBSERVE FREQUENCY= 250.131544655141
##.OBSERVE NUCLEUS= ^1H
##.ACQUISITION MODE= SIMULTANEOUS (DQD)
##.ACQUISITION SCHEME= undefined
##.AVERAGES= 16
##.DIGITISER RES= 18
##SPECTROMETER/DATA SYSTEM= dpx250
##.PULSE SEQUENCE= zg30
##.SOLVENT NAME= CDCl3
##.SHIFT REFERENCE= (INTERNAL, CDCl3, 0, 16.448)
##AUDIT TRAIL= $$ (NUMBER, WHEN, WHO, WHERE, WHAT)
$$ ##TITLE= Audit trail, XWIN-NMR		Version 3.5
$$ ##JCAMPDX= 5.01
$$ ##ORIGIN= Bruker BioSpin GmbH
$$ ##OWNER= nmr
$$ C:\u/data/dgb/nmr/ADRS/1960/pdata/1/auditp.txt
$$ ##AUDIT TRAIL=  $$ (NUMBER, WHEN, WHO, WHERE, WHAT)
(   1,<2007-08-31 10:26:08.50 +100>,<MAYBRIDGE\nmr>,<NMR_250MHZ>,
      <created by zg, POWCHK disabled, PULCHK disabled
       configuration hash MD5:
       76 6E 9A 78 1E 09 19 81 EC 84 63 8F B0 6A 59 2D
       data hash MD5: 64K
       E7 E6 07 FB 4A E5 82 84 49 59 0F 52 73 33 63 E0>)
(   2,<2007-08-31 10:26:36.39 +100>,<MAYBRIDGE\nmr>,<NMR_250MHZ>,
      <Start of raw data processing
       ef LB = 0.3 FT_mod = 6 PKNL = 1 SI = 32K 
       data hash MD5: 32K
       80 F9 B9 05 DD 27 EA E5 79 BE AA 50 B2 07 C4 50>)
(   3,<2007-08-31 10:26:42.84 +100>,<MAYBRIDGE\nmr>,<NMR_250MHZ>,
      <apk 
       data hash MD5: 32K
       DE 31 56 D4 0C 8D 81 51 37 AD 9F 76 EA 7C 32 ED>)
(   4,<2007-08-31 10:26:47.39 +100>,<MAYBRIDGE\nmr>,<NMR_250MHZ>,
      <abs ABSG = 5 
       data hash MD5: 32K
       13 AB AD 25 25 72 87 61 44 0D E9 AA EB 8E 14 D9>)
$$ ##END=
$$ 
$$ hash MD5
$$ C9 88 F6 89 F4 EF 6E E5 19 ED 0A 01 0E 2F 45 FC
##$RELAX= 
##$RELAX= 
##$RELAX= 
##$RELAX= 
##$RELAX= 
##$RELAX= 
##$RELAX= 
$$ Bruker specific parameters
$$ --------------------------
##$DU= <C:\u>
##$EXPNO= 1960
##$NAME= <ADRS>
##$PROCNO= 1
##$TYPE= <nmr>
##$USER= <dgb>
##$AMP= (0..31)
100 100 100 100 100 100 100 100 100 100 100 100 100 100 100 100 100 100 
100 100 100 100 100 100 100 100 100 100 100 100 100 100 
##$AQSEQ= 0
##$AQ_mod= 3
##$AUNM= <au_zg>
##$AUTOPOS= <28 >
##$BF1= 250.13
##$BF2= 250.13
##$BF3= 250.13
##$BF4= 250.13
##$BF5= 500.13
##$BF6= 500.13
##$BF7= 500.13
##$BF8= 500.13
##$BYTORDA= 1
##$CFDGTYP= 0
##$CFRGTYP= 5
##$CHEMSTR= <none>
##$CNST= (0..31)
1 1 145 1 1 1 1 1 1 1 1 1 1 1 1 1 1 1 1 1 1 1 1 1 1 1 1 1 1 1 1 1 
##$CPDPRG= <>
##$CPDPRG1= <>
##$CPDPRG2= <>
##$CPDPRG3= <>
##$CPDPRG4= <mlev>
##$CPDPRG5= <mlev>
##$CPDPRG6= <mlev>
##$CPDPRG7= <mlev>
##$CPDPRG8= <mlev>
##$CPDPRGB= <>
##$CPDPRGT= <>
##$D= (0..31)
0 1 0 0 0 0 0 0 0 0.06 0 0 0 0 0 0 0.0002 0 0 0 0 0 0 0 0 0 0 0 0 0 0 
0 
##$DATE= 1188552366
##$DBL= (0..7)
120 120 120 120 120 120 120 120 
##$DBP= (0..7)
150 150 150 150 150 150 150 150 
##$DBP07= 0
##$DBPNAM0= <>
##$DBPNAM1= <>
$$ [...]
##$SUBNAM7= <"">
##$SUBNAM8= <"">
##$SUBNAM9= <"">
##$SW= 20.6930455092707
##$SWIBOX= (0..15)
0 0 3 0 0 0 0 0 0 0 0 0 0 0 0 0 
##$SW_h= 5175.983436853
##$TD= 65536
##$TD0= 1
##$TE= 295.16
##$TE2= 300
##$TE3= 300
##$TEG= 300
##$TL= (0..7)
0 120 120 120 120 120 120 120 
##$TP= (0..7)
150 150 150 150 150 150 150 150 
##$TP07= 0
##$TPNAME0= <>
##$TPNAME1= <>
##$TPNAME2= <>
##$TPNAME3= <>
##$TPNAME4= <>
##$TPNAME5= <>
##$TPNAME6= <>
##$TPNAME7= <>
##$TPOAL= (0..7)
0.5 0.5 0.5 0.5 0.5 0.5 0.5 0.5 
##$TPOFFS= (0..7)
0 0 0 0 0 0 0 0 
##$TUNHIN= 0
##$TUNHOUT= 0
##$TUNXOUT= 0
##$USERA1= <user>
##$USERA2= <user>
##$USERA3= <user>
##$USERA4= <user>
##$USERA5= <user>
##$V9= 5
##$VALIST= <valist>
##$VCLIST= <CCCCCCCCCCCCCCC>
##$VD= 0
##$VDLIST= <DDDDDDDDDDDDDDD>
##$VPLIST= <PPPPPPPPPPPPPPP>
##$VTLIST= <TTTTTTTTTTTTTTT>
##$WBST= 1024
##$WBSW= 4
##$XGAIN= (0..3)
0 0 0 0 
##$XL= 0
##$YL= 0
##$YMAX_a= 361774
##$YMIN_a= -255045
##$ZGOPTNS= <>
##$ZL1= 120
##$ZL2= 120
##$ZL3= 120
##$ZL4= 120
##$ABSF1= 16.44802
##$ABSF2= -4.245152
##$ABSG= 5
##$ABSL= 3
##$ALPHA= 0
##$AQORDER= 0
##$ASSFAC= 0
##$ASSFACI= 0
##$ASSFACX= 0
##$ASSWID= 0
##$AUNMP= <proc_1d>
##$AZFE= 0.1
##$AZFW= 0.1
##$BCFW= 0
##$BC_mod= 0
##$BYTORDP= 0
##$COROFFS= 0
##$CY= 12.5
##$DATMOD= 1
##$DC= 0
##$DFILT= <>
##$DTYPP= 0
##$F1P= 14.0000005364418
##$F2P= -0.99999901652339
##$FCOR= 0.5
##$FTSIZE= 32768
##$FT_mod= 6
##$GAMMA= 0
##$GB= 0
##$INTBC= 1
##$INTSCL= 1
##$ISEN= 128
##$LB= 0.3
##$LEV0= 0
##$LPBIN= 0
##$MAXI= 10000
##$MC2= 0
##$MEAN= 0
##$ME_mod= 0
##$MI= 0
##$NCOEF= 0
##$NC_proc= -3
##$NLEV= 6
##$NOISF1= 0
##$NOISF2= 0
##$NSP= 0
##$NTH_PI= 0
##$NZP= 0
##$OFFSET= 16.44802
##$PC= 1
##$PHC0= -35.7812
##$PHC1= 7.293363
##$PH_mod= 1
##$PKNL= yes
##$PPARMOD= 0
##$PSCAL= 4
##$PSIGN= 0
##$REVERSE= no
##$SF= 250.13001850247
##$SI= 32768
##$SIGF1= 0
##$SIGF2= 0
##$SINO= 400
##$SIOLD= 32768
##$SREGLST= <1H.CDCl3>
##$SSB= 0
##$STSI= 32768
##$STSR= 0
##$SW_p= 5175.98343685301
##$SYMM= 0
##$S_DEV= 0
##$TDeff= 65536
##$TDoff= 0
##$TI= <Analysis number 999999
Compound Code 99
Book Reference 9
Project Code 9>
##$TILT= no
##$TM1= 0
##$TM2= 0
##$TOPLEV= 0
##$USERP1= <user>
##$USERP2= <user>
##$USERP3= <user>
##$USERP4= <user>
##$USERP5= <user>
##$WDW= 1
##$XDIM= 32768
##$YMAX_p= 340599869
##$YMIN_p= -154932
$$ End of Bruker specific parameters
$$ ---------------------------------
##NTUPLES= NMR SPECTRUM
##VAR_NAME=  FREQUENCY,     SPECTRUM/REAL,   SPECTRUM/IMAG
##SYMBOL=    X,             R,               I
##VAR_TYPE=  INDEPENDENT,   DEPENDENT,       DEPENDENT
##VAR_FORM=  AFFN,          ASDF,            ASDF
##VAR_DIM=   32768,         32768,           32768
##UNITS=     HZ,            ARBITRARY UNITS, ARBITRARY UNITS
##FACTOR=    0.157963299565203, 1,           1
##FIRST=     4114.14378081522, 0,            0
##LAST=      -1061.83965603779, 0,           0
##MIN=       -1061.83965603779, -154932,     0
##MAX=       4114.14378081522, 340599869,    0
$$ Real data points
##PAGE= N=1
##DATA TABLE= (X++(R..R)), XYDATA
$$ [...]
16124A16409j8474J6346j5325m9014k8706J6331M0425L3720K2436j554O633l6501
16112A02726j2307j6031m370M829k0383J5311K3295j5646Q399p402M205P570k5014
16099F5182j5255m083k4709m8941K3972o104K0849J8612r504K1364L6245j6063
16087F1565j7923q101j4651P627L0248K8765k5642n5673L4133J9671j574j1162
16075D7283k4724N5932J0662m7427p379j1259L8684J2003m7408l6458p156K1550
16063D303L5405o217j2978M234p236P078K045q877l1213m0359P623P0852L5304
16050E9964m3384p18m653J0278P499q892N996K2969M821j462j2625j9674k5897
16037e778l4327j293L1940K9844L4834k7613l8085L2213J1219k7894r007K716
$$ plain form
16124 116409 97935 114281 98956 49942 21236 37567 77992 111712 134148 132594 139227 102726
16112 102726 90419 74388 70018 74847 54464 69775 93070 77424 85823 78421 82626 90196 65182
16099 65182 49927 45844 21135 -27806 -3834 -9938 10911 29523 20019 41383 77628 61565
16087 61565 43642 35541 20890 28517 58765 87530 61888 6215 40348 60019 58445 47283
16075 47283 22559 78491 89153 41726 34347 23088 61772 73775 26367 -10091 -17247 4303
16063 4303 39708 33491 20513 24747 17511 24589 26634 17757 -13456 -53815 -46192 24660 59964
16050 59964 16580 15862 11209 21487 28986 20094 26090 49059 53880 52418 39793 20119 -5778
16037 -5778 -40105 -41398 -9458 20386 55220 27607 -10478 21735 32954 5060 -3947 -1231
16025a231K3737J3604o557j7176R328O029j400j5090K7457m016r306K3989M336
16012E3704l3247k3290O7382J7682l5819k1854P330n3411k3899J2913m3052k2045
16000i7606K0713K3773Q033k531N938P1863L3405r384j4969l8735J3077K7856
15988D1433J2228l4098k2936N814L4819J943l825j0708K7103j6490n1539l5367
15976e1623K0100L9913J3397R194M1050K914o5933j0900N0094r81m2862N738m692
15963E409k1088L5378j987J6046j1970k3059J4074j4334O37L3447j8949n2714
15951c9110K3238K9970l131K0783J0123l4978l3781N8992O2188k1869m1494j3356
15939A7575J189M478L164j0390K3790K1025n988o019J4556j1063M883J0177p552
$$ plain form
16025 -1231 22506 36110 29553 12377 21705 27734 26334 11244 38701 34685 25379 49368 53704
16012 53704 20457 -2833 64549 82231 46412 24558 31888 -21523 -45422 -32509 -75561 -97606
16000 -97606 -76893 -53120 -45087 -47618 -41680 30183 63588 54204 39235 500 13577 41433
15988 41433 53661 19563 -3373 2441 37260 39203 35378 24670 51773 35283 -16256 -51623
15976 -51623 -31523 8390 21787 30981 72031 74945 9012 -1888 48206 47225 4363 10101 5409
15963 5409 -15679 19699 17712 33758 21788 -1271 12803 -1531 -894 32553 13604 -39110
15951 -39110 -15872 14098 10967 31750 41873 6895 -26886 32106 94294 72425 30931 17575
15939 17575 18764 23242 26406 16016 39806 60831 54843 48824 63380 52317 57200 67377 59825
15926E9825J921j822p783J8128m2571j7673m2256L0520N1657M6508k5823l3887
15914C6744m879p079L49L9262J0304k1849m2460J3698L4471K427L2652m2565o3119
15901a2044J1054J1676j1023k2802K549N2052L0594j2583j1532o5351l586K1440
15889i556k3855J8111M3585p810L133J5476q929m366J9549p729l2090k1820l363
15876a9664J894o66k3990N16K5290J2102K5150K2488k4593j0175k389L891l6707
15863b6853K8858K0930K6857J315l142J6016n149j7469J9613k6085o3499j4431
15851d3039K573L930K1039N320J2990N658k5887L4221L7670l2228k6645J3452
15839I054L2773J1129j5198Q078j4219k8866k4302j4310N2600Q459o47k3668M818
$$ plain form
15926 59825 61746 59924 52141 70269 27698 10025 -32231 -1711 49946 96454 70631 36744
15914 36744 31865 24786 25135 64397 74701 52852 10392 24090 58561 60988 93640 51075 -12044
15901 -12044 -990 10686 -337 -23139 -20590 31462 62056 49473 37941 -27410 -30996 -9556
15889 -9556 -33411 -15300 28285 20475 23608 39084 30155 25789 45338 37609 5519 -16301 -19664
15876 -19664 -17770 -18436 -42426 -41910 -16620 -4518 20632 43120 18527 8352 5963 9854 -26853
15863 -26853 2005 22935 49792 51107 47965 63981 58832 41363 60976 34891 -28608 -43039
15851 -43039 -40466 -36536 -15497 -10177 2813 8471 -17416 16805 54475 22247 -4398 9054
15839 9054 41827 52956 37758 45836 31617 2751 -21551 -35861 16739 25198 24551 883 5701
15826E701L4591j7635k1693k3991P633N246J44L441p814k8533j8681K7603J8378
15813a5610n0795m1445k2660L6023K0367j0648J5718k4930L2260J4082K9461j8071
15801c6248j5462J9968J4713L4473K377l0683j8606j9574K2741L5499n520n0017
15789d6339l9951q469K7675L1309Q18j5659L6411L056M0562n464O210j693j1915
15776A6551n322j7949k740k1479L2239k748l4559j2754j2798K0804k5156p872
15764g3783N3194J7024l8515j2851l0573L4565P5059p455k2391K3116N607Q149
15752C1146j4065O398j1454M023j7758j7481m4186k4596J8727J5750q747K8875
15740c3368N2199l9072k6230L7354p491L8764N7735j0760n8222j2174j8558O201
$$ plain form
15826 5701 40292 22657 964 -23027 -15394 -10148 -10004 -6563 -14377 -42910 -61591 -33988 -15610
15813 -15610 -66405 -107850 -130510 -94487 -74120 -84768 -69050 -93980 -61720 -47638 -18177 -36248
15801 -36248 -51710 -31742 -17029 17444 19821 -10862 -29468 -49042 -26301 9198 3678 -46339
15789 -46339 -86290 -94759 -67084 -35775 -34957 -50616 -14205 -11149 29413 23949 30159 28466 16551
15776 16551 11229 -6720 -9460 -30939 1300 -1448 -36007 -48761 -61559 -40755 -65911 -73783
15764 -73783 -20589 -3565 -42080 -54931 -85504 -50939 24120 16665 -5726 17390 22997 31146
15752 31146 17081 23479 12025 16048 -1710 -19191 -63377 -87973 -69246 -53496 -62243 -33368
15740 -33368 18831 -20241 -46471 -9117 -16608 22156 79891 69131 10909 -1265 -19823 -13622
15728a3622K6496J6190k4152L339K4994j4351R870J8252k0157l3782p051J7534
15716C560M4344m004k2235O439L4769L0729j6682k9885p00k9817L3193N8191N841
15703A13743m7512l8480j222J5302K8815j6525J5988O6140j0807n098N4008P087
15691A81439J8518O7450O6915M010l2979l2205j5957j5055m1872o098m3271o4245
15679H6650J2467J6036M079k7306l1640k3954q089l7012q78J4832j0421n186P82
15666i640K0799L1109k8843j6715L8143l3130j1590o09J1612R191K1500L1092
15654F2919l8367j0729J8743Q300K9174q508L0751J538o1600m0169o544r059q318
15641c1869k5747l20L7917J2724p388o6904q742J2782M1478K73Q041O259k367
$$ plain form
15728 -13622 12874 29064 4912 8251 33245 18894 28764 47016 26859 -6923 -13974 3560
15716 3560 47904 43900 21665 28104 62873 93602 76920 47035 46335 16518 49711 107902 113743
15703 113743 66231 27751 26529 41831 70646 54121 70109 136249 125442 120344 174352 181439
15691 181439 199957 267407 334322 338332 305353 273148 257191 242136 200264 194166 150895 86650
15679 86650 99117 115153 119232 91926 60286 36332 28243 -8769 -9647 5185 -5236 -10422 -9640
15666 -9640 11159 42268 13425 -3290 34853 1723 -9867 -10476 1136 10327 31827 62919
15654 62919 24552 13823 32566 40866 70040 61532 92283 93821 32221 -7948 -14492 -23551 -31869
15641 -31869 -57616 -57936 -20019 -7295 -14683 -81587 -90329 -77547 -36069 -35796 -27755 -21496 -23863
15628b3863M298R289K5206J0343K2605L2594j3625o9001j1358K1720J6169j6775
15616G602k9915M2312l6645j1337L2994r033l6432p978N1432O4227k1107k3485
15604B2635J3740p466J5404J0485J2578j1044k7032n7067n56M856J2020L0603
15592A9156l323M0642J7455m8526k2862j067K4332J640j1083M866k1530j3799
15580a4099L1938k1276p308M630k5114n737m6647r428M0738L4947P035K3186R419
15567B2284p570n450J602J1758N841k786o6384j725M1777J4845k7522K1246M0989
15554D8905j4455K0168m558P575J5859k2056k2070n957n230q737K4934l2K1434
15541E5780J2943k4169j8362J2397j659J4661R799m0427k4087L730j5628N6734
$$ plain form
15628 -23863 -19565 -10276 14930 25273 47878 80472 66847 -2154 -13512 8208 24377 7602
15616 7602 -22313 19999 -16646 -27983 5011 -4022 -40454 -48432 3000 67227 46120 22635
15604 22635 36375 28909 44313 54798 67376 56332 29300 -27767 -28323 -23467 -11447 19156
15592 19156 15833 56475 73930 25404 2542 1475 25807 27447 16364 21230 -300 -14099
15580 -14099 17839 -3437 -10745 -6115 -31229 -36966 -83613 -93041 -52303 -17356 -10321 12865 22284
15567 22284 14714 9264 10866 22624 28465 25679 -40705 -42430 -653 14192 -13330 7916 48905
15554 48905 34450 54618 50060 57635 73494 51438 29368 23411 18181 9444 34378 34346 55780
15541 55780 68723 44554 26192 38589 36930 51591 61390 20963 -3124 606 -15022 41712
15529D1712L2310k9254k7223k5037L873L214j8140J2j8240J148k8872R80J0827
15516e2690l3951J916N5326L7929k1149K1544L634L6805n478m0554K3896L3614
15504F0842r214j1658l814p532j499J3030K1870k2029j6083J5952r110m5928n0470
15491f5643j1799J8472L3494l0615k0584j2319L547k0992P903L0498L4471o463
15479d0030Q039m2119r799O1950M7609l2439r482J7266j0616j8509p030M0720
15467E560N7142k877j4470m3817m3596J4804J8101l6878k462L1321J0038J3531
15455F397L0695m1641m224L5687o6523J0721K1802l9244J8203K7195p354l321
15443a1607J9568K9482n26j6586l2079N585R292p720k9341j2832N795N0140L4159
$$ plain form
15529 41712 74022 44768 17545 -7492 -3619 -405 -18545 -18533 -36773 -35625 -64497 -63517 -52690
15516 -52690 -86641 -84725 -29399 8530 -12619 8925 12559 49364 43886 3332 27228 60842
15504 60842 51628 39970 36156 28624 27125 40155 62025 39996 23913 39865 30755 -15173 -65643
15491 -65643 -77442 -58970 -25476 -56091 -76675 -88994 -85447 -106439 -98536 -68038 -33567 -40030
15479 -40030 -31991 -74110 -83909 -21959 25650 -6789 -16271 995 -9621 -28130 -35160 5560
15467 5560 62702 59825 45355 1538 -42058 -27254 -9153 -46031 -48493 -17172 -7134 6397
15455 6397 37092 -4549 -8773 26914 -39609 -28888 -7086 -46330 -28127 -932 -8286 -11607
15443 -11607 7961 37443 36917 20331 -11748 -6163 3129 -4591 -33932 -46764 -40969 9171 43330
15430D3330o4927k7886o833J6093p560k6707K5979N3565j9644j8417M8373N976
15418B1342l0053l0858p514R219M5495K3679M0R882j5674k4820j1344L271q402
15405a5737o46K5655M6835j3840j1888J7054j6193j8509q96r3J710L644k192l906
15391A0998J5016l576K8725k7691m8968K077J7791K4797k853j2763M1857k2407
15379B3003l0015n6940L468J294k3954J8750M8441J5179j0667L1097J3400j7659
15367A5397r476l2108J8112M1528M4849K1166n6213k0599J190K4881M425j519
15355E1633n5366k6292O860J7619k5278R467J3805p736K903P63k0854m3757k312
15342g8545K3482J9326r158J2497J075J2708O6067K5696P982j9023l9765J4672
$$ plain form
15430 43330 -21597 -49483 -56316 -40223 -47783 -74490 -48511 5054 -14590 -33007 15366 21342
15418 21342 -8711 -39569 -47083 -37864 7631 31310 31350 41232 25558 738 -10606 -7335 -15737
15405 -15737 -16383 9272 56107 42267 30379 47433 31240 12731 11835 11742 13452 17096 14904 10998
15391 10998 26014 22438 51163 23472 -25496 -23419 -5628 19169 16316 3553 45410 23003
15379 23003 -7012 -63952 -60484 -59190 -83144 -64394 -15953 -774 -11441 19656 33056 15397
15367 15397 5921 -26187 -8075 33453 78302 99468 43255 22656 23846 48727 53152 51633
15355 51633 -3733 -30025 -23165 -5546 -30824 -21357 -7552 -15288 -12385 -11622 -32476 -76233 -78545
15342 -78545 -55063 -35737 -44895 -32398 -31323 -18615 47452 73148 81130 62107 22342 37014
15330C7014N1643J2726Q65k8739n0940k8774l292p598l8291O395M3098m710J3075
15317B472j8357k4451K5229K3255k8970j4694k5884m325O3366J6768l1677k1872
15305c9140M2654K3940l6630k0248o265K1344L7436O663n5209m0289j772K7735
15293c9781L4795M066L2489J2253k5519l1549O489L2957R252N079l9008k7371
15281b5848K2436M6208J9437L725J5054n1921j506O331k3761o642k3160J3292
15269f355L8302L496j7486k8777L166o852L8356N547o677k4460N681K5718J5254
15256D4913k2480k0279l1197N1744j12k1407j4065L3109k8919M282L7199J7447
15244E0235k6983l5582N901k233l0702O276m1763l603N5310O9235M8430l9005
$$ plain form
15330 37014 88657 101383 102248 73509 22569 -6205 -9497 -17095 -55386 -48991 -5893 -10603 2472
15317 2472 -15885 -40336 -15107 8148 -20822 -35516 -61400 -65725 -2359 14409 -17268 -39140
15305 -39140 3514 27454 -9176 -29424 -35689 -14345 23091 29754 -25455 -65744 -67516 -39781
15293 -39781 -4986 -920 31569 43822 18303 -13246 -6757 26200 35452 40531 1523 -25848
15281 -25848 -3412 42796 62233 65958 81012 29091 27585 33916 10155 3513 -19647 -6355
15269 -6355 31947 35443 17957 -10820 -7654 -14506 23850 29397 22720 -1740 3941 29659 44913
15256 44913 22433 2154 -29043 22701 22589 1182 -12883 20226 -8693 -4411 32788 50235
15244 50235 23252 -12330 -6429 -8662 -39364 -33088 -74851 -78454 -23144 46091 94521 55516
15232E5516m3883n2341L7890N2020J9382j2003k8232j0812l0659P43k0857j1499
15220d4735R709K8981K8100L2323p639J2249j5978k1163j7149j2856J0730n36
15208B036N335l9593j6102K9508N5888N707k1459m69O478Q460j2766P333l9791
15195i435m1745j9949r34L9754J0567l0015K2009K7522J2183l5069l2621O313
15183e1420K3515l9202O441O0492l8081k9437k537K5784N0609K2693J2346j1121
15171C0082j9909k6303j0462M2037K5851l888k8581k5671j0634K0061n85j3365
15159b1367J6138p813P242L720P0546j938j6097j9372l5678J1100j7324K1865
15147A1022N586J5980N428l3392l7613J7731K4642l3350K1790J1308Q334R639
$$ plain form
15232 55516 11633 -40708 -2818 49202 68584 56581 28349 17537 -13122 -12379 -33236 -44735
15220 -44735 -35026 -6045 22055 54378 46739 58988 43010 21847 4698 -8158 2572 2036
15208 2036 7371 -32222 -48324 -18816 37072 42779 21320 20851 27329 35789 23023 30356 -9435
15195 -9435 -51180 -71129 -72063 -32309 -21742 -51757 -29748 -2226 9957 -25112 -57733 -51420
15183 -51420 -27905 -67107 -60666 -174 -38255 -67692 -70229 -44445 6164 28857 41203 30082
15171 30082 10173 -16130 -26592 15445 41296 37408 8827 -16844 -27478 -7417 -8002 -21367
15159 -21367 -5229 -13042 -5800 -2080 68466 66528 50431 31059 -4619 6481 -10843 11022
15147 11022 16608 32588 38016 4624 -32989 -15258 9384 -23966 -2176 9132 17466 27105
15135B7105q10j4862l374k648O855N650n474J0973p376k4969L3332n596m4309
15122b5503k3724j2424j6796K2140K8136K1727J9907L274j3283n937j735K336
15110a882j5590P575K5725L2325j2348k3587N004J4778l7572k4065j4877l9645
15098h4159J0812J7727N4530R031l1376Q58P631q515M827O107j0848K3341l9144
15085c9178k2147j9995n552o881L2502P629Q0178K846J6974l5609l1844J8449
15073b628M0890K2333n0615o1228m665j7301L006M467M8909O945k6575M0704L9946
15060D4188m3736N018m479J002K0926N629m840J7519k8175K283J5077J4995k5106
15047B0301l9034k8106M4999N693j2842Q995n355K6784J8572N534m2036J4524
$$ plain form
15135 27105 26295 11433 8059 5411 12266 17916 12442 23415 16039 -8930 24402 18806 -25503
15122 -25503 -49227 -61651 -78447 -56307 -28171 -6444 13463 16737 3454 -2483 -4218 -1882
15110 -1882 -17472 -9897 15828 48153 35805 12218 17222 32000 -5572 -29637 -44514 -84159
15098 -84159 -73347 -55620 -1090 7941 -23435 -22577 -14946 -23461 -18634 -12527 -23375 -34 -39178
15085 -39178 -61325 -81320 -86872 -93753 -61251 -53622 26556 29402 46376 10767 -21077 -2628
15073 -2628 38262 60595 9980 -51248 -55913 -73214 -70208 -65741 -16832 -9887 -36462 4242 44188
15060 44188 452 5470 991 1993 22919 28548 23708 41227 13052 15335 30412 45407 20301
15047 20301 -18733 -46839 -1840 3853 -8989 6 -5349 21435 40007 45541 3505 18029
15035A8029k1342n8493q625k3484J2313J0273l558M6153Q1597R20l0960q4469
15023f1646l7162J8949O2817K5145r326j7058l6K3840L003j4694k7805J5985j9970
15010c7958j0874o46N1398K2884j0363N1828K7704l7326k9120J4350J2238n249
14998D8866k0377j1576l712J7133J4195l976m420K5760J3120K2560J972n8730
14986D0815R275Q946n115J1223n3795j4078J164k9930l6254J7413k1434K2579
14974d9191M5797L5397M8621R147l2678J8912k9977k6244j2452R991J7616L4590
14962F9529k7035p3787k998L3198J9323L7884l8479k3865J4515L7548j1083l3222
14950A528M7660N0853R010j825m7599j6702l0972J2873j9692R252m519j1014k6637
$$ plain form
15035 18029 -3313 -61806 -70431 -93915 -81602 -71329 -74887 -28734 52863 53783 22823 -61646
15023 -61646 -98808 -79859 -17042 8103 -1223 -18281 -18317 5523 8526 -6168 -33973 -17988 -37958
15010 -37958 -48832 -49478 1920 24804 14441 66269 93973 56647 27527 41877 54115 48866
14998 48866 28489 16913 13201 30334 44529 40553 36133 61893 75013 97573 99545 40815
14986 40815 50090 59036 53921 65144 11349 -2729 -1565 -31495 -67749 -50336 -71770 -49191
14974 -49191 -3394 32003 80624 89771 57093 76005 46028 19784 7332 17323 34939 69529
14962 69529 42494 -31293 -34291 -1093 18230 56114 17635 -6230 8285 45833 34750 1528
14950 1528 49188 100041 109051 107226 59627 42925 11953 24826 5134 14386 9867 -1147 -27784
14937b7784k6976K3058N1154L0969m538l9596l4670j1603N9722j135l3017j3462
14925b7878P281K0856L011l9534j3485j5214J4231R490K5188O526K5323J6720
14913C2515j4173J1948j0026j9793P817L3411L8746K5234p446o3956m2327j3005
14901b1055k1022k8420N826K1552J1816n139J0362J7427k4470l7461J3264K6236
14889c1084L7020j7651M06J2038l4257J5029J9117K5809l0335q885L7312K7916
14877E2435j4638j9953j3519m640K4558R175k4629k8295j8567N827M8338j9830
14865c738j1210q049R833j5664R212J2549J3817K2524J4680j4439k9654q308J6636
14852H189K3958K7310l648k4031j4894j2350j2361l5313k1695J9538N9312J5869
$$ plain form
14937 -27784 -54760 -31702 19452 50421 45883 6287 -28383 -39986 19736 18601 -14416 -27878
14925 -27878 -20597 259 3270 -36264 -49749 -64963 -50732 -41242 -16054 -9528 15795 32515
14913 32515 18342 30290 20264 471 8288 41699 80445 105679 98233 34277 -8050 -21055
14901 -21055 -42077 -70497 -64671 -43119 -31303 -36442 -26080 -8653 -33123 -70584 -57320 -31084
14889 -31084 5936 -11715 -11309 729 -33528 -18499 618 26427 -3908 -12793 24519 52435
14877 52435 37797 17844 4325 -315 24243 33418 8789 -19506 -38073 -32246 16092 -3738
14865 -3738 -14948 -22997 -13164 -28828 -19616 -7067 6750 29274 43954 29515 -139 -8447 8189
14852 8189 32147 59457 55809 31778 16884 4534 -7827 -43140 -64835 -45297 14015 29884
14840B9884k4672j4380P595R925l5656o581j267M71L2749K2029K1581l8290j5156
14827a1768Q352j2888p224j6234M1883O8882m5481q745J2318J1202j4915k5990
14815f08k6281n703K7157k1923n151N570L7144k8382J01j4690q018p594k5385
14802g3763J5714N173K2161J3834K1108J5490K8148M016m7321L4379P588L0841
14790G7368J4470p40l558l2762m5970j7874k8841l5490j2123L2326Q741j6544
14778f0997m8339J7903L8438K972L0749J7760L9443l8328m6072j6442J3282L3917
14766a5714O290P064L3304K8694J2235k9096j7778n3174N178N3191J4153l266
14754D1081O761J5639K1216M8879J5778m5233m0745m3693m9420j927L83K3153
$$ plain form
14840 29884 5212 -9168 -1573 8352 -27304 -33885 -35152 -34681 -1932 20097 41678 3388 -11768
14827 -11768 -3416 -16304 -23528 -39762 2121 71003 25522 16777 29095 40297 25382 -608
14815 -608 -26889 -32592 -5435 -27358 -32509 -26939 10205 -18177 -18076 -32766 -40784 -48378 -73763
14802 -73763 -58049 -52876 -30715 -16881 4227 19717 47865 51881 4560 38939 46527 77368
14790 77368 91838 91098 87540 54778 8808 -9066 -37907 -73397 -85520 -53194 -44453 -60997
14778 -60997 -109336 -91433 -52995 -50023 -19274 -1514 37929 -399 -46471 -62913 -49631 -15714
14766 -15714 -9424 -2360 30944 59638 71873 42777 24999 -28175 -22997 30194 44347 41081
14754 41081 47842 63481 84697 133576 149354 104121 63376 19683 -29737 -31664 -31281 -8128
14742h128K757J5349K5285K0291j497l8361n1337O362P2012P447m0599J9263K023
14729C0867m627K6842j5124n9825k2499P843R486L47R487J587k0043k03j5811
14716e1673L275L7458j0086N057K651N283j0594q964l9663K2355N3163L8925J0780
14703E7967j6148P374J8795k4809k9925m5296M1642K9208o813l8609j0950j8557
14691c6121O848M2856p225q451l1757K2547K7768q704m6032j4824o670L8267N8747
14678C7249l532j5618j5071r863j8334J9242l5013m5067K8536J8709L819m2224
14666g7167K9041K0180J5837k3600j5560K1205O386k5021j7143J3901M0554J3920
14654B533j4049k0070J0454M616M452J955j6586J0102N6763L8902l0494k9955
$$ plain form
14742 -8128 -5371 9978 35263 55554 54057 15696 -35641 -29279 42733 50180 9581 28844 30867
14729 30867 26240 53082 37958 -21867 -44366 -36523 -27037 -26690 -17203 -15616 -35659 -35862 -51673
14716 -51673 -48398 -10940 -21026 -15969 -13318 -8035 -18629 -27593 -67256 -44901 8262 47187 57967
14703 57967 41819 49193 67988 43179 13254 -32042 9600 38808 31995 -6614 -17564 -36121
14691 -36121 -29273 13583 6358 -2093 -33850 -11303 16465 7761 -38271 -53095 -59765 -21498 37249
14678 37249 33717 18099 3028 -6835 -25169 -5927 -40940 -86007 -57471 -38762 -34943 -77167
14666 -77167 -48126 -27946 -12109 -35709 -51269 -30064 -23678 -48699 -65842 -51941 -11387 2533
14654 2533 -11516 -31586 -21132 -16516 -12064 -10109 -26695 -16593 40170 79072 48578 18623
14642A8623K3026L2709Q35k2642j3144K361k4945n076m664j9020j1096j2421N0743
14629A5289M528l9598K3048J0619j3560n0638J8542M3363k5301k8220L2387J6838
14617G297m213k4033j4295J2624R556R029j6551J3689L0892P655m420j6417j3739
14604b926J6525m139M5398L5714M882j1457j8525l7353l0528J8453j540j257M7004
14591F0251J5930l2479k5068k7675j8744J0097K1124K712o379j9163L7562J7361
14579C5529l0481j2660J3646K6527J8637K6669m2352k9778n603j5162j0182k2323
14567d7533j06K7022J5049P811P955m2261l866K227J0169L8605J3390r316j0144
14554I002j7756l3581l3371L7631K1643J0046K7876L0959k676j9786P412L734
$$ plain form
14642 18623 41649 74358 75193 52551 39407 41768 16823 11747 7083 -11937 -23033 -35454 15289
14629 15289 19817 -19781 3267 13886 326 -50312 -31770 11593 -13708 -41928 -9541 7297
14617 7297 3084 -20949 -35244 -22620 -13064 -4035 -20586 -6897 23995 31650 27230 10813 -2926
14604 -2926 13599 9460 54858 90572 95454 83997 65472 28119 -2409 16044 14504 13247 60251
14591 60251 76181 43702 18634 -9041 -27785 -17688 3436 6148 -231 -19394 18168 35529
14579 35529 5048 -7612 6034 32561 51198 77867 35515 5737 134 -15028 -25210 -47533
14567 -47533 -47639 -20617 -5568 2243 10198 -32063 -35929 -33702 -23533 15072 28462 19146 9002
14554 9002 -8754 -42335 -75706 -38075 -16432 -6386 21490 52449 49773 29987 37399 41133
14542D1133k8273j2766k2962J042M0030J9714K530l3555k2151j1414q706l2072
14530f7450k4596K9325L1372K2993J8651k9041J1853m153k4062j5699L7274J0646
14518b887k3225o308p294L9538k8544l7604K2233K2102o204J3549k2965m4550
14506h2159j2688J2489q44q960J2760J5067n305M2460M8162L4255K0223m4936
14494C0524J3017J5615r295j5197P649K3585m3758J7213K4350j5774j9511o1224
14482c2806l4953M8708k680J9201J3614k7667k1820p143J9232K3034K109J4058
14470A2887J3215j5354K2839n7135l7604O9133L6766L6K6414k2635m5588j1052
14458h078J1146L7200K3820m2530J898N2779p254j7799j1614J2171n482J0709
$$ plain form
14542 41133 12860 94 -22868 -21826 18204 37918 40448 6893 -15258 -26672 -35378 -67450
14530 -67450 -92046 -62721 -31349 -8356 10295 -18746 -6893 -11046 -35108 -50807 -13533 -2887
14518 -2887 -26112 -32420 -39714 -176 -28720 -66324 -44091 -21989 -28193 -14644 -37609 -82159
14506 -82159 -94847 -82358 -83202 -92162 -79402 -64335 -69640 -27180 20982 55237 75460 30524
14494 30524 43541 59156 49861 34664 42313 65898 22140 39353 63703 47929 28418 -32806
14482 -32806 -67759 -19051 -21731 -2530 11084 -16583 -38403 -45546 -26314 -3280 -1171 12887
14470 12887 26102 10748 33587 -23548 -61152 7981 44747 44783 71197 48562 2974 -8078
14458 -8078 3068 40268 64088 21558 23456 76235 68981 51182 39568 51739 46257 56966
14446E6966k6773n5828j078L2623k0992L9105N776n5378j1593O9188R444j2836
14434B8624k9021k698k1291J3255j939M0300j3145l011l8482Q610K7432J0639
14422A9273R555j2847j6954K637O12J7640K0609j2377K0989j7819l0447j9772
14410a8901k1445R184R999Q419K298n18K3143J451k2754R297K4936O992l6996
14397d895L719J3264k9452j8006K1269j2446k5233n4042L1139L6511K4046J9298
14385E172Q424Q671K8111j7106m7061J1652K1531j980j1912m6258l150M3997M5126
14372D5217K1915m2038k9693j6377n2723J6823M1939l0172k0221K4877L2590K9792
14360B1929j0812L1234m0583m3205P1005K3231l4226k5127J464j0375K8557J5863
$$ plain form
14446 56966 30193 -25635 -26713 5910 -15082 24023 29799 -25579 -37172 32016 41460 28624
14434 28624 -397 -3095 -24386 -11131 -13070 27230 14085 11074 -27408 -18798 8634 19273
14422 19273 28828 15981 -973 1664 2276 19916 40525 28148 49137 31318 871 -18901
14410 -18901 -40346 -31162 -21163 -12744 -10446 -10964 12179 13630 -9124 173 25109 32101 -4895
14397 -4895 -1176 12088 -17364 -35370 -14101 -26547 -51780 -105822 -74683 -38172 -14126 5172
14385 5172 13596 22267 50378 33272 -13789 -2137 19394 17414 5502 -40756 -43906 91 45217
14372 45217 67132 25094 -4599 -20976 -73699 -56876 -14937 -45109 -65330 -40453 -7863 21929
14360 21929 11117 42351 1768 -41437 29568 52799 18573 -6554 -5090 -15465 13092 28955
14348B8955K8746K4177K0229N53k8403l2660m4984n9932K6069L0309J2800p338
14336a479k3585K068K1434j2357l1772N948M089J4503j7662q325J8372M1635J1204
14323B4073O739j3846O922j7494j5400q965K5464O8182j6716k5710m9090j8119
14311c3960j6512j7383K4320J9106r144j7871k3493Q4L6895J6090k1702j7445
14299f1015l1587L2133N7592K1564k112l4854J422J6795j3511j4662R55o34k9939
14286e7853j7826N4600L4691k6649j8332K1395K8228q725R858k4537m2357L7378
14274a0129J5944P845k2803K2466o018k8330m2354j3585M5573O2445m9608k3762
14262d2316j90m699j8378Q172L3798N9924J4274J7236l9885n7608R319K9130k3922
$$ plain form
14348 28955 57701 81878 102107 102660 74257 41597 -3387 -63319 -37250 -6941 5859 -1479
14336 -1479 -25064 -22996 -1562 -13919 -45691 -39743 -35654 -21151 -38813 -47138 -28766 12869 24073
14323 24073 30812 16966 23888 6394 -9006 -17971 7493 75675 58959 33249 -15841 -33960
14311 -33960 -50472 -67855 -43535 -24429 -33573 -51444 -74937 -74853 -37958 -21868 -43570 -61015
14299 -61015 -92602 -60469 -2877 18687 16575 -18279 -16857 -62 -13573 -28235 -27280 -27914 -57853
14286 -57853 -75679 -21079 13612 -13037 -31369 -9974 18254 9529 19387 -5150 -47507 -10129
14274 -10129 5815 13660 -9143 13323 7305 -21025 -63379 -76964 -31391 31054 -18554 -42316
14262 -42316 -42506 -47205 -65583 -57411 -23613 36311 50585 67821 27936 -29672 -20353 8777 -15145
14249a5145j687j6128J8913J2688P148j8456j2181o642k8942M8651J9815j9660
14237a1626l9570J3083P1390O6038k2662l8425k0853O165K3996l3167l5381K3394
14225B382K33p6467j2411L3464J1736M4403K2838J1546q264k7082j0175k1380
14213b9177K6395l673k0776L178L5200J8453M6518M629l9701k1433K031k1279
14201C65l016P399l450K9585j8094p2142j3550j869j8252J0118K9478K0397L5053
14188B022j90K857l711k2322l3818K775J3571K3124o091L1177O083n1856K764
14175c3615J541p418O6046K9998n9815n0563P120L3940Q890l996L2317k018k463
14162A9964J6524m1551k6796K6535K5428K1178k4624M513M2770l3049R749m2827
$$ plain form
14249 -15145 -16832 -32960 -14047 -1359 5789 -12667 -24848 -31490 -60432 -11781 8034 -11626
14237 -11626 -51196 -38113 33277 99315 76653 38228 17375 23540 47536 14369 -21012 2382
14225 2382 2615 -73852 -86263 -52799 -41063 3340 26178 37724 29460 2378 -7797 -29177
14213 -29177 -2782 -6455 -27231 -24053 11147 29600 76118 80747 41046 19613 21644 365
14201 365 -2651 4748 1298 30883 12789 -59353 -72903 -74772 -93024 -82906 -53428 -33031 2022
14188 2022 1832 4689 978 -21344 -55162 -52387 -38816 -15692 -21783 9394 15477 -36379 -33615
14175 -33615 -32074 -39492 26554 56552 -3263 -53826 -46706 -12766 -3876 -7872 24445 22427 19964
14162 19964 36488 -5063 -31859 -5324 20104 41282 16658 21171 63941 30892 40641 -2186
14150b186M807N594l9119L98N0375J6090J8552k3388l1591l5635j7411N0387K0873
14137A7746R502l7073m2193m721o298j1128L6661J0948j0243j2038J0564J6106
14125b2167K533l8089R642K0585k099q548M5233J3095j964L681k3060k3715l0794
14112e5667J5503J5317J3828j5817R401J0425J4376J2153J6009j25n082j8116
14100A2205J3094j7684l3257M0735J4069J3054n067J4299N116J4241o708j1851
14088E2246k9194j1343q647J150Q767j4554j1196o301M257K7212J3124j7754j1390
14075c623J1380l573J6423k1090l1595L5850M9206O490k2915P05N985o055p254
14062B9934N348N503K2911o0608l2720j9643J7469j4691k8000N034L0174L8954
$$ plain form
14150 -2186 2621 8215 -30904 -30506 19869 35959 54511 31123 -468 -36103 -53514 -3127 17746
14137 17746 27248 -9825 -52018 -56739 -63037 -74165 -37504 -26556 -36799 -48837 -38273 -22167
14125 -22167 -19634 -57723 -48081 -27496 -29595 -38143 7090 20185 18221 21902 -1158 -24873 -55667
14112 -55667 -40164 -24847 -11019 -26836 -17435 -7010 7366 19519 35528 35403 30321 12205
14100 12205 25299 7615 -25642 15093 29162 42216 37149 51448 56564 70805 64097 52246
14088 52246 23052 11709 3062 4212 12979 -1575 -12771 -19072 -14815 12397 25521 7767 -3623
14075 -3623 7757 4184 20607 -483 -32078 3772 52978 59468 36553 37258 43243 37188 29934
14062 29934 35282 40785 63696 3088 -29632 -49275 -31806 -46497 -74497 -69463 -39289 -335
14050c35R745l9347Q848J1626k3216l1014j1406m187J154J3426R264k7639J0905
14037g2176J8575P333N8005J4574l4471N83q109k1450K3779J8740J0406k0331
14025d542j7291J9461J2065N9088L0002k2606o4796r713J8748J1304j1762J6010
14013C5968o707o7589p126O0056J1472k7945K615K5311j6488l166O51l800M3400
14000D6652J8101J33J391n099j0186j2876j2717K2146l831n637k9380n772K4653
13987B7578J9189k8853k2690J6642J5529l810K0135j6413m2433m3523K7218o157
13975c7588M3425O904n5540n743M1112J3969m2111m7444j3379k745K2560k5525
13963a02105J2033J1162L3903K8065k2078J2934O533l1606k4940K5674n55m582
$$ plain form
14050 -335 9410 -29937 -21089 -9463 -32679 -63693 -75099 -79286 -78132 -64706 -55442 -83081 -72176
14037 -72176 -53601 -46268 11737 26311 -8160 -7577 -15686 -37136 -13357 5383 15789 -4542
14025 -4542 -21833 -2372 9693 68781 98783 76177 11381 1668 20416 31720 19958 35968
14013 35968 29261 -38328 -45454 14602 26074 -1871 744 26055 9567 6401 7052 3252 46652
14000 46652 64753 64886 66277 61178 50992 38116 25399 47545 43714 38077 8697 2925 27578
13987 27578 46767 17914 -4776 11866 27395 23585 43720 27307 -15126 -58649 -31431 -37588
13975 -37588 5837 12741 -42799 -48542 -7430 6539 -35572 -83016 -96395 -99140 -76580 -102105
13963 -102105 -90072 -78910 -45007 -16942 -39020 -26086 -19553 -51159 -76099 -50425 -50980 -55562
13951e5562R044n1930J8886O1688J7682n114j7314M538L09L9937M0537j2660m6728
13938C313K4184j7945j931K963R282O551k0685k9245j6322M45J2024J1328p808
13925b3846j5764K3418J6012J4027K6767q283l3762K0716O716j0816l7375j230
13913b3420K1263k6302m2767J7815N3830J4194p2363k9612J6046M0241J1943O7961
13901D8829N4842m4006M1579L5537m6592n5858m5581O22k3809l4462O730J4388
13889d7781L4772k127J7533J1396k238j3141j1262k0845o625L9087j8953k3015
13877d3199k7069K6200k830J9260L0261J9958K1634J5869j0176l0525j9787j8998
13865a9402k3024R256m049Q147K1555K8495K0151m4306k8524m697j2486m778k6308
$$ plain form
13951 -55562 -46518 -98448 -79562 -17874 -192 -5306 -22620 -18082 -17773 22164 62701 50041 3313
13938 3313 27497 9552 7621 10584 19866 26417 5732 -23513 -39835 -39390 -27366 -16038 -23846
13925 -23846 -39610 -16192 -180 13847 40614 32331 -1431 19285 26001 15185 -22190 -23420
13913 -23420 -2157 -28459 -71226 -53411 419 14613 -57750 -87362 -71316 -31075 -19132 48829
13901 48829 103671 59665 101244 136781 90189 34331 -11250 -10628 -34437 -68899 -62169 -47781
13889 -47781 -13009 -15136 2397 13793 11555 -1586 -12848 -33693 -40318 -1231 -20184 -43199
13877 -43199 -70268 -44068 -46898 -27638 2623 22581 44215 60084 49908 19383 -404 -19402
13865 -19402 -42426 -33170 -37219 -29072 -7517 20978 41129 -3177 -31701 -36398 -48884 -53662 -79970
13852g9970K5712M650k3328L4706R557J4298J4412J5635j7577j0777J5052J5152
13840A7522l965j7496r764j6122j5571Q584j170j6323O687P3092M588j7700q801
13827C561M386p172k759O300j3526r697M6018P062j4085p1525J3253J4454k3816
13814d7546r035L7485J9981k2055K941J5594J8886j8594p440K7310k4954p787
13802a5214K2497L4397p205l3311k4509k2949k457K3249n575K996J4320j1810
13790b5571O1011L7647j0192r837l2007k1963m760K8265L7051k3839l9907R73
13778c129J1323j2673j222l9738J5398l371Q127P606L7595K3887m5097k6954m533
13765c2781P172k5977P433O5572L5011k1667N83j8605J851j0817k7736M0548l573
$$ plain form
13852 -79970 -54258 -49608 -72936 -38230 -28673 -14375 37 15672 -1905 -12682 2370 17522
13840 17522 13557 -3939 -13703 -29825 -45396 -36812 -37982 -54305 -47618 25474 30062 12362 3561
13827 3561 7947 775 -1984 4316 -9210 -18907 27111 34173 20088 -51437 -38184 -23730 -47546
13814 -47546 -56581 -19096 885 -21170 -18229 -2635 16251 -2343 -9783 17527 -7427 -15214
13802 -15214 7283 41680 34475 1164 -23345 -46294 -48751 -25502 -31077 -28081 -13761 -25571
13790 -25571 35440 73087 62895 53058 21051 -912 -5672 22593 59644 35805 -4102 -3129
13778 -3129 8194 -4479 -5701 -45439 -30041 -33412 -25285 -17679 19916 43803 -1294 -28248 -32781
13765 -32781 -25609 -51586 -44153 21419 56430 34763 35346 16741 18592 7775 -19961 20587 17014
13752A7014m6017m1278O069P081Q77J111K9645K8609k35L9984L019n0844K2479
13739A7514Q487n0671m0477K5948M7195j1621l3381j8695J3710J7869L7991K8876
13727D2745P343K2922N4l0265j1168k3929k1428j9983k018J6937k6673L323J5571
13714b6569j039k916N9616K3194k9378n2751l5702n291R575J9455K0188l0731
13702e2349r221m219k9476j0477L4743N024L3833Q878j7116o734N883J219k3149
13689f3161J1768K0378K5268L6954o4880l2742L9975J7258L4215p530l4028k2332
13677c8857J011L5319L3200j8825M385l759j2715k737j2278l743J7486l4854j2805
13664d9172L1849R503J4918J3426r448L9342p943m2702J773L4120M642Q025m4258
$$ plain form
13752 17014 -29003 -70281 -64212 -57131 -56254 -55143 -25498 3111 2876 42860 45879 -4965 17514
13739 17514 26001 -24670 -65147 -39199 7996 -3625 -37006 -55701 -41991 -24122 13869 42745
13727 42745 50088 73010 73064 42799 31631 7702 -13726 -33709 -35727 -18790 -45463 -42140 -26569
13714 -26569 -27608 -30524 29092 52286 22908 -29843 -65545 -70836 -61261 -41806 -21618 -52349
13702 -52349 -61570 -65789 -95265 -105742 -70999 -65975 -32142 -23264 -40380 -47114 -41231 -40012 -63161
13689 -63161 -51393 -31015 -5747 31207 -33673 -66415 -26440 -9182 25033 17503 -16525 -38857
13677 -38857 -37846 -2527 30673 11848 16233 12474 -241 -2978 -15256 -18999 -1513 -36367 -49172
13664 -49172 -17323 -7820 7098 20524 11076 50418 42475 -227 1546 35666 40308 48333 4075
13651D075L836K3951L9292m6552m7712M0975N8199j3500m88k393l622n0007q3336
13638g7282K4035P1321L9552m3m4748n1856q894J7965p427M036J6338j1177j3133
13625d1313Q655R408L4673m862J0346J1766j811k888n435J2032J648m5850Q814
13612d817K1298R986l7277j6364m5661j2512J4376M2900J4794j7066k3480K0283
13600c3540J7196m783K2622j1163k3169j6723j6615m2273J8410O3014L6749R443
13588A9168q929Q368k1233Q644o068L2350K6155j4019p6329m795K0773n1744M5031
13575b2628J3901n8966l1605l0761N3088N2069J8081R680j5651n645K3901k1049
13563a5585l596k0052J4052K6064o309k1778l358R34K1575m528J1315r225n621
$$ plain form
13651 4075 7911 31862 71154 24602 -23110 17865 76064 62564 62076 59683 56061 6054 -77282
13638 -77282 -53247 18074 57626 57583 12835 -39021 -47915 -29950 -37377 -33341 -17003 -28180 -41313
13625 -41313 -32658 -23250 11423 6561 16907 28673 26862 23974 18539 30571 32219 -13631 -4817
13612 -4817 16481 26467 -10810 -27174 -72835 -85347 -70971 -28071 -13277 -30343 -53823 -33540
13600 -33540 -16344 -21127 1495 -9668 -32837 -49560 -66175 -108448 -90038 -27024 9725 19168
13588 19168 10239 18607 -2626 6018 -50 32300 58455 44436 -31893 -36688 -15915 -67659 -22628
13575 -22628 -8727 -67693 -99298 -130059 -76971 -24902 -6821 2859 -12792 -18437 5464 -15585
13563 -15585 -19181 -39233 -25181 883 -5426 -27204 -30562 -29628 -8053 -12581 -1266 -10491 -16112
13550a6112K0666J9981k3463j140J1745J8695L3397l2298l7177j4548L7044o300
13538A0490k5204j0717J4782j4701j013j6339L2854O440n325j7140J8270Q042
13526D39J3387N298k341Q86j6075j9239j0105P792M4761N345P420O268m6675k5419
13512b8258k9161m4763k351m1396O446O4507M8529L6357M0636J1695j9087j3386
13500B9768o1401k8731p41r409P111r588L0253K3810N482j3308K1621j3927m3866
13487f2926l082l936L2333M0185k5985n9998K705J3714N1387K7044k2065J2167
13475A543K982N0768L0319l8117k3654k4909o493o716M4012L1189M904k535j8594
13462D4699K768k1251k7399j1447q454k2222K8004M7028M739L2653j0966l099
$$ plain form
13550 -16112 4554 24535 1072 -68 11677 30372 63769 31471 -5706 -20254 16790 10490
13538 10490 -14714 -25431 -10649 -25350 -26363 -42702 -9848 -3408 -8733 -25873 -7603 439
13526 439 13826 19124 16783 17669 1594 -17645 -27750 -19958 24803 30148 37568 43836 -2839 -28258
13512 -28258 -57419 -102182 -104533 -145929 -139483 -74976 -26447 9910 50546 62241 43154 29768
13500 29768 -31633 -60364 -61105 -70514 -63403 -72991 -42738 -18928 -13446 -26754 -5133 -19060 -62926
13487 -62926 -66008 -69944 -37611 2574 -23411 -83409 -80704 -66990 -15603 11441 -10624 1543
13475 1543 4525 55293 85612 47495 23841 -1068 -7561 -14277 29735 60924 65828 63293 44699
13462 44699 47467 26216 -1183 -12630 -21084 -43306 -15302 31726 36465 69118 58152 55053
13450E5053m9191k5330M0732O501j7699j1374k0224L1321k0242l6830L6323K9349
13438A8389j1775L2281K777k4696k2250J304j6856L2282O938L2629q797k1887
13426B0339k8749j6832P972n69j5875J1119L7398M4918O713K1845R319j7117l9709
13413D0772O108o801N090J0863r296j8731k4152j2755K9308P774j6212K8366n4644
13400a4310n5532n127N6207L8146r899k6844k0177K0753l252p02L7088m2310M668
13387b1291r89p694L3843K5083k982p771m3006k3251J1806J032J0134K4715q28
13374a199j9572L0709j6220k531N2696L4534l3878n0879j166J7915L6829j4297
13362C2941k5047J869J9893J5292q720m4401p507j3900k378M9891K702j4064r363
$$ plain form
13450 55053 5862 -19468 21264 27765 10066 -1308 -21532 9789 -10453 -47283 -10960 18389
13438 18389 6614 38895 41672 16976 -5274 -3970 -20826 11456 18394 51023 42226 20339
13426 20339 -8410 -25242 -17270 -17839 -33714 -22595 14803 59721 66434 88279 97598 80481 40772
13413 40772 46880 40079 45169 56032 46736 28005 3853 -8902 20406 28180 11968 40334 -14310
13400 -14310 -69842 -74969 -18762 19384 9485 -17359 -37536 -16783 -20035 -20737 16351 -25959 -21291
13387 -21291 -22280 -29974 3869 28952 25970 18199 -24807 -48058 -36252 -35220 -25086 -371 -1199
13374 -1199 -20771 9938 -6282 -8813 43883 78417 44539 -6340 -7506 10409 47238 32941
13362 32941 7894 9763 29656 44948 36228 -8173 -15680 -29580 -31958 17933 20635 6571 -2792
13349b792K7579j8954l8619j0888L826J6414j6693K5919k7940N568J6766k3674
13337d3488m2407j0208J0609L9571L555n2028J6293N2658K3144j360l315j5377
13325b2353m2687L0839L5858J7783k2229J9794l515k2558l2114J1115J4498j4995
13313c0564K0007L5236j0824J6460L6513j1375q8112j0592M6190J5781k2384k558
13301f222m381r252K2582J7578j3529n1341J663M7457L1015R499m9320l6907j5455
13288e6613K7160L8120j431j838q933J5949o800o1413j2498K3983k5629R423l03
13275f0823K8983M6365K2117k1494J1679L4226J2609j1574K963K163l7135m038
13263B6041j9320L499j3374k047l1763k4431K4139N169L7066N3916J8351J1467
$$ plain form
13349 -2792 24787 5833 -32786 -43674 -39848 -23434 -40127 -14208 -42148 -36580 -19814 -43488
13337 -43488 -85895 -96103 -85494 -45923 -42368 -94396 -78103 -25445 -2301 -3661 -6976 -22353
13325 -22353 -65040 -34201 1657 19440 -2789 17005 13490 -9068 -41182 -30067 -15569 -30564
13313 -30564 -10557 24679 13855 30315 66828 55453 -32659 -43251 2939 18720 -3664 -6222
13301 -6222 -10603 -19855 2727 20305 6776 -44565 -42902 4555 35570 45069 -4251 -41158 -56613
13288 -56613 -29453 8667 7236 5398 -3535 12414 5614 -55799 -68297 -44314 -69943 -60520 -60823
13275 -60823 -31840 14525 36642 15148 26827 61053 73662 62088 65051 67214 30079 26041
13263 26041 6721 10220 -3154 -5201 -36964 -61395 -37256 -32087 4979 58895 77246 88713
13251H8713J6127m2022j1547n413l9203k7149p826j2082p775l5162j703K9081
13239e5961l2884P951Q854N6879L9622L3645J1106m8808k2228l3018P986K8305
13227A449N9244K2673k5730J0400j6141j7139l1753j5592m1720p200k409J7299
13215d6619L7785N4837j2861j737J3049K2083O734N5232Q2506K4599l5947n219
13203A94442o2837r3038j7432K5262Q287l7564m2650K770K3737l9914Q116m488
13191c5309j4321O3624q443Q133j6713k0462k574M1109J6659J777K713n5232r187
13178b8226j3291k638J8541P377k1626n3032j4627N2224K8719L291Q682N5990
13166D1384K5381N2757J24548J23259J93964R2567j17463j44819j28729j16710
$$ plain form
13251 88713 104840 62818 51271 45858 6655 -20494 -28320 -40402 -48177 -83339 -85042 -55961
13239 -55961 -88845 -80894 -72040 -15161 24461 58106 69212 20404 -1824 -34842 -26856 1449
13227 1449 60693 83366 57636 68036 51895 34756 3003 -12589 -54309 -61509 -63918 -46619
13215 -46619 -8834 46003 33142 31405 44454 66537 73271 128503 211009 235608 199661 194442
13203 194442 131605 38567 21135 46397 54684 17120 -25530 -22760 977 -38937 -30821 -35309
13191 -35309 -49630 13994 5551 13684 -3029 -23491 -26065 15044 31703 33480 36193 -19039 -28226
13178 -28226 -41517 -44155 -25614 -18237 -39863 -92895 -107522 -55298 -26579 -23288 -14606 41384
13166 41384 66765 119522 244070 367329 561293 653860 536397 391578 262849 146139
13156A46139m7106l7581K6810M729r836j7751k9210K5218n213m391j6798K707
13144C7717M38J2171k6149j9797J6094J1606j1169j3678J6122K9704J0560o3654
13132c5j0540k5403J5243K9462k1569j9006J5667K9346L8677J0937J561L0437
13120I4777P5670N8490J41901J47355P4100m7659j27273j43488j20305o1886l4196
13109E7486k7341Q218j1852j9962o274O9384K8403l7591l6090j7971L797n0723
13097d0516L9967N2503O851L7785J2597k571p978k2610j4718q654K472O299k6349
13084C5078M248K2526l449J1596o153l7822J217K772k1016O415L4184K9257P7511
13071A56364R9248K6654m4124n9240k0354m3231J4121p1577n3996M8813P470k3913
$$ plain form
13156 146139 99033 61452 88262 92991 83155 65404 36194 61412 56199 51808 35010 37717
13144 37717 38155 50326 24177 4380 20474 32080 20911 7233 23355 53059 63619 -35
13132 -35 -10575 -35978 -20735 8727 -12842 -31848 -16181 13165 51842 62779 64340 94777
13120 94777 170447 228937 370838 518193 592293 544634 417361 273873 153568 91682 57486
13109 57486 30145 38363 26511 6549 275 69659 98062 60471 24381 6410 10207 -40516
13097 -40516 -549 51954 58805 96590 109187 106616 98638 76028 61310 52656 55128 61427 35078
13084 35078 39326 61852 58403 69999 63846 26024 27241 30013 8997 15412 49596 78853 156364
13071 156364 255612 282266 238142 178902 158548 115317 129438 57861 3865 52678 60148 36235
13059C6235k2581j7459n4543j1862M3230p029P608J9279k1138J3822K3473j1341
13047b306K4531k541k7454k788O326k2944o786Q72K1295K6830k6666q520J1812
13034h339P2156J2873n2683O62O167j0738k6605k5748q889J9379j6729R38l564
13021d1120k1255o292J9334K4295K0634Q77k9397N023j9572J7808J3366k0356
13009c6655M400l033k6908k647L3003J4316M201K784M47J611n992J5866K8906
12996C0299J5289l119L462l4125k4045O530M5205N7305j449K248j2822R715k2464
12983G2029k0101K567m0006n0411l1640L8780K309J8289j2680J7867O890k600
12971A293K139j2566j5482K512J4736l1287J8391M850m8493j4362J7677M3011
$$ plain form
13059 36235 13654 -3805 -58348 -70210 -26980 -34009 -26401 -7122 -28260 -14438 9035 -2306
13047 -2306 22225 19684 -7770 -10558 -4232 -27176 -33962 -33090 -11795 15035 -11631 -20151 -8339
13034 -8339 63817 76690 24007 24669 30836 20098 -6507 -32255 -41144 -21765 -38494 -37556 -41120
13021 -41120 -62375 -68667 -49333 -25038 -4404 -3527 -32924 -27901 -47473 -29665 -16299 -36655
13009 -36655 -32255 -35288 -62196 -64843 -31840 -17524 -13323 -10539 -10092 -8481 -14473 1393 30299
12996 30299 45588 42469 45931 11806 -12239 -5709 39496 96801 95352 97600 84778 94493 72029
12983 72029 51928 54495 14489 -35922 -67562 -28782 -26473 -8184 -20864 -2997 3893 1293
12971 1293 3432 -9134 -24616 -22104 -7368 -38655 -20264 -15414 -63907 -78269 -60592 -17581
12959a7581N154J2198j9200L1313J7530P2182m768p4763j0864L030k5487m988
12947a6244L4964N151J5793M638j7925j8413k4635L0793J9204o358l9858R681
12935c209j2563n6013J8174O0099J4930m0461j2962O9352L7230m1347n0762J5417
12923b115m882p423J6421j0120m6813q169q946L0019j41K5634M4485n527n765
12910A6658p32k9919O639m237k7803j1447J6635m976k5061M4070k3420k029J8417
12897b7205J4261L0497j1186O5424k4179p1382k7951J82p976J9642n57J0124r975
12884d0281O845K0073R918Q558M2580P64k2292j9433k0813K4901j0249j6006N434
12871a0001M682J5886o6627m5059N3556M2988K657J2702k4085n03J2699p341j9038
$$ plain form
12959 -17581 -12427 -229 -19429 11884 29414 101596 96828 22065 11201 14231 -11256 -16244
12947 -16244 18720 23871 39664 44302 26377 7964 -16671 14122 33326 26968 -12890 -3209
12935 -3209 -15772 -71785 -53611 6488 21418 -19043 -32005 37347 74577 33230 -17532 -2115
12923 -2115 -6997 -14420 2001 -8119 -54932 -63101 -72047 -42028 -42169 -16535 27950 22423 16658
12910 16658 15926 -13993 -7354 -11591 -39394 -50841 -34206 -39182 -64243 -20173 -43593 -45622 -27205
12897 -27205 -12944 17553 6367 71791 47612 -23770 -51721 -51539 -59515 -39873 -40430 -30306 -40281
12884 -40281 -33436 -13363 -3445 5113 47693 48457 26165 6732 -14081 10820 571 -15435 -10001
12871 -10001 -5319 10567 -56060 -101119 -47563 -4575 -1918 10784 -13301 -13804 -1105 -8446 -27484
12858b7484o667q381N074K2069J4144L410k5446j1331L6302L5792k4559o1775
12846d8852m999K5137K7568K5558j9045k3470k2944j1494j4786j246M9232K1125
12834A784m6072j7958M0838N1592q114J4384J880M583k6526L102L0739M2582q776
12821H4038k3670P594k3438k4584p3267m392O9869Q007q308l3829L362J2260K2243
12808A5885j2542o304J5359o943j2532J6111j7173j0598L0409K4675j1458J2043
12796C6932K7574J8450M203J833m2178q3812R390L0855M659J0935O484O593k1113
12783A0805j1173j7021L65l3069j1969j0033R259J3753K3043l4627K5L7754K1821
12770a067J3878r921L5338K0398n6378m6442K4602J9265K0953n836k5437j1405
$$ plain form
12858 -27484 -34151 -42532 -37458 -15389 -1245 2165 -23281 -34612 1690 37482 12923 -48852
12846 -48852 -53851 -28714 -1146 24412 5367 -18103 -41047 -52541 -67327 -68573 -19341 1784
12834 1784 -44288 -62246 -21408 30184 22070 36454 38334 42917 16391 19493 50232 92814 84038
12821 84038 60368 67962 44524 19940 -53327 -57719 12150 20157 11849 -21980 -18618 -6358 15885
12808 15885 3343 -2961 12398 5455 -7077 9034 -8139 -18737 11672 36347 24889 36932
12796 36932 64506 82956 87159 88992 46814 -36998 -27608 3247 7906 18841 25325 31918 10805
12783 10805 -368 -17389 -17024 -50093 -62062 -72095 -62836 -49083 -26040 -60667 -60642 -22888 -1067
12770 -1067 12811 2890 38228 58626 2248 -44194 -19592 -327 20626 14790 -10647 -22052
12758b2052M393K0278K7265j0452k5017K0380K5680K0084J264l7519p4847J1070
12746c9473N8141J7747J404j8187j9205j973M3605j4631P563J6578M648R280k2262
12733D3235l0771l8984M39l9913j3028K0734j2438J3646M7995K7866l6308k3185
12721d0712L5441j886l733j4026J5794K92K1275L3436K0750l6245l815n102K0409
12708D1878k0223J6846K6097j0752m6814m4091l9216j8636j1253L3594M8659M9416
12696B5505m1597j8183r330j253N0421K2005k1242n8935J0281Q681J6822R25m6210
12683f2110J2839J7885Q170J4142k929K7212j3048l64J8194L430K271l1858j7634
12670b3800j749J1960O6229L2386j7882n5812r4476N5216L3967k4047j2743r525
$$ plain form
12758 -22052 -17659 2619 29884 19432 -5585 14795 40475 60559 61823 24304 -50543 -39473
12746 -39473 18668 36415 37819 19632 427 -1546 42059 27428 34991 51569 56217 65497 43235
12733 43235 12464 -26520 -26081 -65994 -79022 -58288 -70726 -57080 -9085 18781 -17527 -40712
12721 -40712 -5271 -7157 -10890 -24916 -9122 -8830 12445 45881 66631 30386 26571 21469 41878
12708 41878 21655 38501 64598 53846 7032 -37059 -76275 -94911 -106164 -72570 -23911 25505
12696 25505 -16092 -34275 -43605 -44858 5563 27568 6326 -52609 -42328 -33647 -16825 -15900 -62110
12683 -62110 -49271 -31386 -23216 -9074 -12003 15209 2161 1797 19991 23421 25692 -6166 -23800
12670 -23800 -25549 -13589 52640 85026 67144 11332 -83144 -27928 6039 -18008 -30751 -40276
12658d0276m933J4133j0400N581K5225J8685o173q999L9652l940j9546L1625J5413
12645E6047k7839l1008k1373j9007R902K2850j742J7818L156Q441l899j5125J4063
12632A2284j0970o7547K8268L2541j453j6810k6391m085N4719J6650L1394k0513
12620B8087k6403j8584J3254k5305J7590o904J8501K0118m6688L323K5262M922
12608G173l5876l2369q05j148K2492p095j252L3817m2600k9489J2653L9465j5800
12595e0834Q98M0006M7396j9451k853N7142J4201k0970o1668k5643k8665J523
12583d8918P6054L5886K0577m4694k3356l1505n0577k4012J2012k507L1164K8779
12571b1097K9729k431P16m1257j3671j607q361L6037J7951k7702k5888Q457M3627
$$ plain form
12658 -40276 -45209 -31076 -41476 -35895 -10670 8015 1842 -7157 32495 28555 9009 40634 56047
12645 56047 28208 -2800 -24173 -43180 -33278 -10428 -12170 5648 8804 17245 13346 -1779 12284
12632 12284 1314 -66233 -37965 -5424 -6877 -23687 -50078 -54163 556 17206 48600 28087
12620 28087 1684 -16900 -3646 -28951 -11361 -18265 236 20354 -26334 -23011 2251 7173
12608 7173 -28703 -61072 -61877 -63025 -40533 -47628 -48880 -15063 -57663 -87152 -74499 -35034 -50834
12595 -50834 -49936 -9930 37466 18015 15162 72304 86505 65535 3867 -21776 -50441 -48918
12583 -48918 27136 63022 83599 38905 15549 -15956 -66533 -90545 -78533 -81040 -49876 -21097
12571 -21097 8632 6201 6917 -34340 -48011 -49618 -57979 -21942 -3991 -31693 -57581 -49124 -5497
12558e497L4806j050j7551m2177r38J2760N8484K6902n2341k4502j3399j9676
12546d4179j4916J3755k2086k4666P339o848J0635L9982M7330J9270k4672k7069
12534b6125j2356j7406J4907K6777M0669L9006J6954N644O342l3016n9326k3270
12522b1200K11J4881J2400K5743l4059n8644K5038L4900J3438j7516M287k0696
12510b1217K1037K7523O435k3613P6439L4303j0117l1862l1157l3240j6773K3655
12498B1413q565o2633O481K2094K4467K2830j3804K3448J7530j9513j6922l4046
12486a7220l9720L7619J9418J2301j1153k9744K0860M8497M3121K227k0143J7555
12474H3618k5549k0676K5771l3831l4108j6286J2040L1532N2528l9832q702M5326
$$ plain form
12558 -5497 29309 28259 10708 -31469 -32407 -19647 38837 65739 13398 -11104 -24503 -44179
12546 -44179 -59095 -45340 -67426 -92092 -84753 -91601 -80966 -40984 6346 25616 944 -26125
12534 -26125 -38481 -55887 -40980 -14203 26466 65472 82426 88070 94412 61396 2070 -21200
12522 -21200 -20989 -6108 6292 32035 -2024 -60668 -35630 -730 12708 -4808 -521 -21217
12510 -21217 -180 27343 33778 10165 86604 120907 110790 78928 47771 14531 -2242 21413
12498 21413 12848 -49785 -43304 -21210 3257 26087 12283 35731 53261 33748 16826 -17220
12486 -17220 -56940 -19321 97 12398 1245 -28499 -7639 40858 83979 86206 66063 83618
12474 83618 58069 37393 63164 29333 -4775 -21061 -9021 22511 75039 35207 26505 71831
12462G1831j8053j6317M0522p499n5290k9118L087o492K7291M4240r27K8646r874
12449G2047j3448m9997j6903j242K2710K1315l0895o0786K1514L1678J566N614
12437C173p572K7817K659j1461j1175k2212j4244J3859K2185j6738j6288M8983
12425A8986L4998j3071m0106j1877L0711L4377j5193m8905J2870k5047N263k0487
12413c7481p502J0288M3243K023J9539M858J1361n1237J7592j3704k4709m2699
12401f8428j5763M287K5007o258J4948K9470N672j0289R337J3837o774l343J4394
12388F097j2592M0700J6210j5802j1260p367K2040m851p170j9955r029L5365o326
12375B6060m9331m6412l083K8638Q830K3036L7992l904J8605o244n882j6648l2553
$$ plain form
12462 71831 53778 37461 77983 70484 15194 -13924 -10837 -17329 9962 54202 53275 81921 72047
12449 72047 58599 8602 -8301 -9543 13167 34482 3587 -57199 -35685 -4007 -2441 3173
12437 3173 -4399 23418 26077 14616 3441 -18771 -33015 -19156 3029 -13709 -29997 18986
12425 18986 53984 40913 807 -11070 19641 54018 38825 -10080 2790 -22257 -16994 -37481
12413 -37481 -44983 -34695 8548 10571 30110 34968 46329 -4908 12684 -1020 -25729 -68428
12401 -68428 -84191 -79904 -54897 -61155 -46207 -16737 -11065 -21354 -12017 1820 -4954 -8297 6097
12388 6097 -6495 34205 50415 34613 23353 15986 38026 33175 26005 6050 -2979 32386 26060
12375 26060 -23271 -69683 -72766 -44128 -35298 -12262 25730 21826 40431 34187 28305 11657 -20896
12362b0896k270J3732k2498L078R206k0183J102J3252L9012l6206k9415N2877
12350G91k1283k1908n303j3945l1078r426M1842O2395K8420j0139m6350m2705
12338f8689j5725K5457M6629J5033k6632O822j4732K4906M2462o75j2140J62j4994
12325G884j2067j3907q742J2327l974j4640J1610J5766J4816L910j4178j9527
12313b0722K6870K9447J4346l6739n211K8384K8759o756j0056k5855r775l6689
12301b3997k1374j412Q452N7422J3730j2789m0577M4030K4503q584k8046N3797
12289F5155J041l9502k1101N685q780M9521K2685n9495l9135K101J0251K2170
12277A0596J8685k8101J2271j1686l0857p993J9861K6675J6839o530K4725j7199
$$ plain form
12362 -20896 -23166 -9434 -31932 -28854 -19648 -39831 -38729 -25477 13535 -22671 -52086 791
12350 791 -20492 -42400 -47703 -61648 -92726 -102152 -60310 2085 30505 20366 -25984 -68689
12338 -68689 -84414 -58957 -12328 2705 -23927 -17105 -31837 -6931 35531 34856 22716 22878 7884
12325 7884 -4183 -18090 -26832 -14505 -18479 -33119 -21509 -5743 9073 12983 -1195 -20722
12313 -20722 6148 35595 49941 13202 7991 36375 65134 58378 48322 22467 12692 -23997
12301 -23997 -45371 -46783 -38331 19091 32821 20032 -20545 23485 47988 39404 11358 65155
12289 65155 66196 26694 5593 11278 2498 52019 74704 15209 -23926 -21825 -11574 10596
12277 10596 29281 1180 13451 1765 -29092 -37085 -17224 9451 26290 19760 44485 27286
12265B7286k9945j3753m751K0795m7151n094Q558L9620K7617L975j6608k1960
12253a1411J2826M557j6173J6389J4833j1297j5549L9925J0543m4314N433K7666
12241C3428m5471j0929J5214j8744m566R781K5361L9856m9370m9218K0608P148
12229b6902Q184k6187J4346M9354K0004K2757o959m3815l3415j8472K7518K917
12217a0670l5168m8030L8152K9814q388K1353k3858N703k417j4415J7586k6348
12205e6686R871L9364J5408M548k2479K890p664m494J0107K8352l3548j2670Q235
12192a8766L0564J8527k8072k5205j9575K7537j3514k6635J4483r263j5239j8499
12180h3657L4038K3267K384O453J3040j8975k8714J2894L1409R743l345K6048
$$ plain form
12265 27286 -2659 -16412 -21163 -368 -47519 -52613 -44055 -4435 23182 27157 10549 -11411
12253 -11411 1415 5972 -10201 6188 21021 9724 -5825 34100 44643 329 5762 33428
12241 33428 -12043 -22972 -7758 -26502 -31068 -21287 4074 43930 -5440 -54658 -34050 -26902
12229 -26902 -18718 -44905 -30559 18795 38799 61556 54597 10782 -22633 -41105 -13587 -10670
12217 -10670 -45838 -93868 -55716 -25902 -34290 -12937 -36795 -31092 -33509 -47924 -30338 -56686
12205 -56686 -46815 -7451 7957 12505 -9974 -7084 -14748 -19242 -9135 19217 -14331 -27001 -18766
12192 -18766 11798 30325 2253 -22952 -42527 -14990 -28504 -55139 -40656 -49919 -65158 -83657
12180 -83657 -49619 -26352 -23968 -17515 -4475 -23450 -52164 -39270 -7861 1882 -1463 24585
12168B4585L8766K5390m098n2375m7447m579k1508r018L570J6737j1627K5428
12156a6176K8026P190o964j6088K1995J9541l4950n788N082k4902J4996K0149
12144A2111l0889l7454k3443L7015O8986L2721N147l4525O226P141k6120k0137
12132c221n3874J2351J1443l881o124q640J3498O506J1023L5759o346K614J3719
12119B4827J203n80k1302J2394J9323M6812n787k4481n917p575n0672j9489J1545
12106a9699N0010J4153o850n267p7070j4935K5526L565J6851K6714k8158l182
12094a8342R650M1307N8020L173m5573k0645j4934l6533K3631J7074J2511K356
12082C1695p631k8167k2310K4023o195q153J1004m9688L5014M3513j0182l230
$$ plain form
12168 24585 63351 88741 84643 32268 -15179 -19758 -41266 -50284 -46714 -29977 -41604 -16176
12156 -16176 11850 19040 12076 -4012 17983 37524 2574 -3214 1868 -23034 -8038 12111
12144 12111 -18778 -56232 -79675 -42660 26326 59047 64194 29669 35895 43036 16916 -3221
12132 -3221 -57095 -44744 -33301 -37182 -43306 -51946 -38448 -31942 -20919 14840 8494 11108 24827
12119 24827 26030 25450 4148 16542 35865 82677 76890 52409 46492 38917 -11755 -31244 -19699
12106 -19699 30311 44464 37614 32347 -44723 -59658 -34132 -30567 -13716 12998 -15160 -18342
12094 -18342 -8692 32615 90635 93808 48235 27590 12656 -23877 -246 16828 29339 31695
12082 31695 24064 -4103 -26413 -2390 -8585 -16738 -5734 -55422 -20408 23105 12923 9693
12070I693J707j4604L9417j1029l6300k6763k3236J4495L9240M4517N3485m5035
12058D5587k9354k7018r949N0250l1133m2709J0416M562j7429J0958K4874O658
12046d287j8504P342q653l337M0205K8685L6678M038k5181l3679l0052M346j0485
12033a2884P149j0055J4499M529q757K1208N9387j6945k1582l8706k9547k2823
12021e4527l9512K0707J9829L2108m392r155J7361K4171k7457m1189J7525K0756
12009b3775k2270j9119J896O126J6913J7618J4162j4820k4488J2195J5218j0874
11997c1218K109L0594r161j2354m8461J0468J9659r650J2856L1772j7055k9080
11985d9521l8447J2324R308L497J6839J8381N1069P247J5641k9831o718R299k5091
$$ plain form
12070 9693 11400 -3204 36213 25184 -11116 -37879 -61115 -46620 -7380 37137 90622 45587
12058 45587 16233 -10785 -20734 29516 -1617 -44326 -33910 -29348 -46777 -35819 -10945 -4287
12046 -4287 -22791 -15449 -24102 -27439 12766 41451 78129 82167 56986 23307 -6745 -2399 -12884
12033 -12884 -5735 -15790 -1291 3238 -5519 15689 75076 58131 36549 -2157 -31704 -54527
12021 -54527 -94039 -73332 -53503 -21395 -25787 -34942 -17581 6590 -20867 -62056 -44531 -23775
12009 -23775 -46045 -65164 -63268 -57142 -40229 -22611 -8449 -23269 -47757 -35562 -20344 -31218
11997 -31218 -29109 1485 -7676 -20030 -68491 -58023 -38364 -48014 -35158 -3386 -20441 -49521
11985 -49521 -87968 -75644 -66336 -62839 -46000 -27619 23450 30697 46338 16507 9789 19088 -6003
11972f003k0083K304k1836o156j9875m024K6846L4502l4085m183K9208J9583J3296
11959I494j8497j5472R840J1064J6508L0018K3174k3614n404k7580l7834r933
11947c8236K5245L6894J7985L9466k8916m5362K0246M1753J6090j7495q776k8886
11935C0008m1887l2628L6986N0194L0877k0599k1318j7824l4170K584n257J671
11923b1363j337O700j5621N0144J5124l2747r453J3316p684j0772J0262K7705
11911B4274J0247j5065j1956m9767m1872K8195N1934K360Q914K7849k4172p508
11899C433o112j0614k8459l382J1370K2784K3490r550l2501L0686K3305K71k2803
11886A918j036K06p174k1893o956Q268R558K2309P237K1627L617R951k071k4534
$$ plain form
11972 -6003 -26086 -23782 -45618 -51774 -71649 -75673 -48827 -14325 -48410 -52593 -23385 -3802 9494
11959 9494 -9003 -24475 -14635 -3571 12937 42955 66129 42515 37111 9531 -28303 -38236
11947 -38236 -12991 23903 41888 81354 52438 7076 27322 69075 85165 67670 58894 30008
11935 30008 -11879 -44507 -7521 42673 73550 52951 31633 13809 -20361 -17777 -23034 -21363
11923 -21363 -22700 -16000 -31621 18523 33647 900 -8553 4763 -2921 -13693 -3431 24274
11911 24274 34521 19456 7500 -42267 -84139 -55944 -4010 -1650 7264 35113 10941 3433
11899 3433 -2679 -13293 -41752 -45134 -33764 -10980 12510 2960 -29541 1145 24450 24721 1918
11886 1918 882 1088 -6086 -27979 -34935 -26667 -17109 5200 12437 34064 37681 47632 45561 21027
11872B1027N758l9404j7118n0049J3863K2824l8614J9821M4256L2820K8650j4459
11860B9375m1300m5551j6418K4963M1001j0413k1473J3365O1679N8185M512k7123
11848G0802n1801q9673J9823K6019K067N4029K3137k8951q131n860P3K078k1235
11835g623r256j8372l3783J2290R858Q157L89l2719j0971L2806N432J9930j8771
11822d2633q258N1343L0591l678K670j4572m4141o53m756K6816J7536J1219J533
11809B3017L3106j5443l4344R220L9781m0064J4794K2766J2346n3688m7691M609
11797c1591L9111J1393l3321r98L6647J0007m942k0017r45k8640N08k0475j0036
11784e3299k3786o901P678K9767M8419J7725K557o5366k826l4527J2870J4849
$$ plain form
11872 21027 26785 -12619 -29737 -79786 -65923 -43099 -81713 -61892 -17636 15184 43834 29375
11860 29375 -11925 -57476 -73894 -48931 -7930 -18343 -39816 -26451 35228 93413 97925 70802
11848 70802 19001 -70672 -50849 -24830 -22763 31266 54403 25452 17321 11461 11534 13612 -7623
11835 -7623 -16879 -35251 -69034 -56744 -46886 -38729 -38340 -71059 -82030 -49224 -43792 -23862 -42633
11822 -42633 -50891 452 31043 27365 30035 15463 -28678 -29331 -34087 -7271 10265 21484 23017
11809 23017 56123 40680 6336 15556 55337 15273 30067 52833 65179 11491 -36200 -31591
11797 -31591 7520 18913 -14408 -15406 21241 31248 26306 6289 5344 -23296 -22788 -43263 -53299
11784 -53299 -77085 -83986 -76308 -46541 1878 19603 22160 -43206 -46032 -80559 -67689 -52840
11772e2840K6376L815R492j2496P911K0474N617K3644N246j4886l1166j5304j86
11759b4303J2348K3861J4256R863l726l7568l7579O463K2678N5428P150m1424
11747G447l4115o6997N543L5283k6061m1689K9901Q6006P027l8570k422N963J4411
11734a8273L6295j9469j8116j0055j1072K2195q548l0380j3799J5917J6326l287
11722d2266j0986K483J819Q384J7725J3849K0645Q778j5978L8147J0176l1327
11710B1449M047l6220j1275K1815p24l8556k6748L0780L4278m018j0163j0099
11698b5434K5701l674P033J5745r266J7979k7029l0487J5652k305P973R964O82
11685B534l2645p54M999k8587N1566J8920K9491N002j3457l189M0620j4345m4424
$$ plain form
11772 -52840 -26464 -22649 -13157 -25653 -17742 2732 8349 31993 37239 22353 -8813 -24117 -24303
11759 -24303 -11955 11906 26162 36025 32299 -5269 -42848 -36385 -13707 41721 48871 7447
11747 7447 -26668 -93665 -88122 -52839 -78900 -120589 -90688 -4682 2345 -36225 -38647 -32684 -18273
11734 -18273 18022 -1447 -19563 -29618 -40690 -18495 -27043 -57423 -71222 -55305 -38979 -42266
11722 -42266 -53252 -50769 -48950 -40566 -22841 -8992 11653 20431 4453 42600 52776 21449
11710 21449 25496 -10724 -21999 -184 -908 -39464 -66212 -35432 -1154 -5172 -15335 -25434
11698 -25434 267 -3407 3626 19371 10105 28084 1055 -29432 -13780 -16085 -8112 1852 2534
11685 2534 -30111 -30865 -25866 -54453 -2887 16033 45524 50526 37069 33880 74500 60155 15731
11672A5731l202J978J1406J0744n3196k3748K5522k4459J1538l6338k668M6007
11660b0685L8229k1918l7255J0794J6169J470K6806K0373o422k1431P004k7381
11648a4247q120M2893k2527p527k3951K481K2559M0465R443j3336k8593M904K187
11635F631j1626L3811K2043n2132o4761j9413J3111K0387J7230j2406k8969j0291
11623h6385j09Q208k9422K3317J0588l4078K8814P6283K0153j2265k7282q284
11611c0462j6426n457J021J2691J3982M941k8606N4842O0484k3763l6855K280
11599H672l4047l7425k4886O3798L8013M247J4534k8651j8817L4674k3689n982
11587i559l11k9196j1506m539k1678N4745L2444m095j0328j9159j8158K6409N8950
$$ plain form
11672 15731 12529 14507 25913 36657 -16539 -40287 -14765 -39224 -27686 -64024 -66692 -20685
11660 -20685 17544 -4374 -41629 -30835 -14666 -13196 13610 33983 27561 6130 13134 -14247
11648 -14247 -22367 20526 -2001 -9528 -33479 -30998 -8439 32026 41469 28133 -460 4444 6631
11635 6631 -4995 28816 50859 -1273 -66034 -85447 -72336 -51949 -34719 -47125 -76094 -86385
11623 -86385 -86494 -78286 -107708 -84391 -73803 -107881 -79067 -2784 17369 5104 -22178 -30462
11611 -30462 -46888 -52345 -51324 -38633 -24651 -19710 -48316 6526 67010 43247 6392 8672
11599 8672 -25375 -62800 -87686 -23888 14125 18372 32906 4255 -14562 20112 -3577 -9559
11587 -9559 -9870 -39066 -50572 -55111 -76789 -22044 10400 6305 -4023 -23182 -41340 -14931 44019
11574D4019l307l9087o2924P848M8486K7431L0675k4261n37n186k5773l1703k0172
11561e4491N876K562j8475K2521K056J9053L4901K4359r652r117j2582k1159k5875
11548d0023j1263n406K3895J981j0477j1836M424R669m095j0359o475K1154J7260
11535b1551J499m9013j5541L3679j097L745K5810K4141J3863K7909l37K1240n1215
11522A3132l6210M612R616l6129k1193L0640J9015k930K3054m175o217K621j5108
11509a9272l5311K0243J6264k546J1178j7412k2970m294n673J4769k4958j9598
11497h9580J9125M4404l8550k1130j7453K5985J7330j5998m474J592q726k9936
11485a17411P935M6293K3744K8754L8285j3994k2855j915O238m1593j8151j0403
$$ plain form
11574 44019 40712 1625 -61299 -53451 -4965 22466 53141 28880 28343 23157 -2616 -34319 -54491
11561 -54491 -48615 -46053 -64528 -42007 -39951 -20898 14003 38362 28710 19593 7011 -14148 -40023
11548 -40023 -51286 -56692 -32797 -30816 -41293 -53129 -48705 -39036 -43131 -53490 -59965 -38811 -21551
11535 -21551 -20052 -69065 -84606 -50927 -52024 -48279 -22469 1672 15535 43444 43107 64347 13132
11522 13132 -23078 -18466 -8850 -44979 -66172 -35532 -16517 -19447 3607 -568 -6785 -4164 -19272
11509 -19272 -54583 -34340 -18076 -20622 -9444 -26856 -49826 -54120 -59793 -45024 -69982 -89580
11497 -89580 -70455 -26051 -64601 -85731 -103184 -77199 -59869 -75867 -80341 -78749 -87475 -117411
11485 -117411 -109476 -63183 -39439 -10685 27600 13606 -9249 -11164 -4926 -46519 -64670 -75073
11473g5073k2141L0069j8870m6742k2175L4970n456K5979M6410J4467J3331N763
11461a9468m6186J903L1203L3046K3127j0305j3529j0277N2470O238L2853l8329
11449D2746l832J1640k4881n5818p410M1744k2416k111K5389k6790j0462l56k9214
11436f1771P987P519N283m3827M172L8315j8518k7406L3445M2752K3696p114L8397
11423D2930j406J1364M2600j1611k5039k4029L526K2484J666l6013K6009L1512
11411H3993m4242n4065k0268j7194l422N054N1820l5920j0968L1229M2497K727
11399C1241M206k6944m3081J0066K4394J0785k0751K7079L014l599p6940R171
11387e1359K4905K5501m528m848K3540l1134p459K7430K1456l1697j2022m6956
$$ plain form
11473 -75073 -97214 -67145 -86015 -132757 -154932 -119962 -125418 -99439 -53029 -38562 -25231 -19468
11461 -19468 -65654 -63751 -32548 498 23625 13320 -209 -10486 41984 48222 81075 42746
11449 42746 38914 50554 25673 -30145 -37555 4189 -18227 -20338 5051 -21739 -32201 -32557 -61771
11436 -61771 -53784 -46265 -40982 -84809 -80637 -42322 -60840 -88246 -54801 -12049 11647 4533 42930
11423 42930 41524 52888 95488 83877 58838 34809 38335 60819 62485 26472 52481 83993
11411 83993 39751 -14314 -34582 -51776 -55198 -50144 1676 -34244 -45212 -13983 28514 31241
11399 31241 35447 8503 -34578 -24512 -118 10667 -10084 16995 20009 16410 -60530 -51359
11387 -51359 -26454 -953 -5481 -10329 13211 -17923 -25382 2048 23504 -8193 -20215 -67171
11375f7171j1162L2162N3888q857l3978j2731Q420M1675O250M977k3480k9599
11363c9606J2547L7675K9393q0584m2385k9580j0243J2985K5772L0132N091K276
11351d6527M7683k5935k1582k0603L5097P5573N155m4198m700M418J0073k2951
11339h497l5524k0883j1691J5838j259j9181P644M4013M4517L597k6424j6250
11327b4100m5162l6278J448K1994K4906M5491K1567j046m085l558k6322J0070
11315a5075K6356l6815l9473K5930N4959j8727n4598l1185K5348M0093K9222j4351
11303h316j8874j7990L295J1994o43K3134L6919J2415l6911o4705l0434L1083
11291e9033M563L2850M4566l5484p944j1897j9134p696R184q282L9475M0397k9754
$$ plain form
11375 -67171 -78333 -46171 7717 -1140 -35118 -47849 -39429 2246 8496 13473 -10007 -39606
11363 -39606 -27059 10616 40009 -40575 -82960 -112540 -122783 -109798 -84026 -53894 -48803 -46527
11351 -46527 1156 -24779 -46361 -66964 -31867 43706 48861 4663 -37 4381 14454 -8497
11339 -8497 -44021 -64904 -76595 -60757 -62016 -81197 -73553 -29540 14977 18574 -7850 -24100
11327 -24100 -69262 -105540 -104092 -82098 -57192 -11701 9866 8820 4735 1177 -25145 -15075
11315 -15075 11281 -25534 -65007 -39077 15882 -2845 -57443 -88628 -63280 -23187 6035 -8316
11303 -8316 -27190 -45180 -41885 -29891 -30534 -7400 29519 41934 5023 -59682 -90116 -59033
11291 -59033 -54470 -21620 22946 -12538 -20482 -32379 -51513 -59209 -50025 -58307 -18832 21565 -8189
11278h189k1324K8092L1612k3521K0482J4370r654p794k7378k2341K917J8086
11266d642j4412L28n644J0589K2650l1832L2763r176m2592k7001k5960j0012M279
11253a00662L5461M3546k0789L8146r445J7778K8314O073j5015p4003q556K7822
11241c1330N378J964j7236L460K3901J1355m2373l380J8387L1068N8159J0459
11229F9812P346k165l3361l6052M920M960j4765l7893J8697J1597J203P908j9256
11216a7049l4078n081m439L8556K3286j7438J0839J2442K8636j1774k298m1392
11204a9790N546L9911m7490n3778K0928J6438j595J3960j738K2167o459j428j8697
11191c2025l0454J776m354l209J3122O996J0995r177k8585L8265J6911J674M4382
$$ plain form
11278 -8189 -29513 -1421 30191 6670 27152 41522 31868 24074 -3304 -25645 -22728 -4642
11266 -4642 -19054 -18726 -24370 -13781 8869 -22963 9800 624 -41968 -68969 -94929 -104941 -100662
11253 -100662 -65201 -21655 -42444 -4298 -13743 4035 32349 38422 23407 -50596 -59152 -31330
11241 -31330 -25952 -23988 -41224 -37764 -13863 -2508 -44881 -48261 -29874 1194 59353 69812
11229 69812 77158 74993 41632 5580 10500 15460 695 -37198 -18501 -6904 -5701 2207 -17049
11216 -17049 -51127 -56208 -60647 -22091 1195 -16243 -5404 7038 35674 23900 21602 -19790
11204 -19790 -14244 25667 -21823 -75601 -54673 -38235 -39830 -25870 -27608 -5441 -11900 -13328 -32025
11191 -32025 -62479 -60703 -65057 -68266 -55144 -48148 -37153 -46330 -74915 -36650 -19739 -18065 26317
11178B6317o3704k6818J1334o491n233q54j702O7219K686m5171k4872j6457o841
11165i0587K1955J9585M1138K1593m938j8094j7328p197P0414R883q188J7785
11153E6021j2124k9082J51m1352o4219k2939K7632M9906K3913j6102J4257K3555
11141I617J9399m01j3424k107j1858L3282K4735m4989l7990r386N5721M7733m060
11128F6272o7719k9823k8562j984K2800J3497K2043P292J8990k602P138o46r434
11115A7262j8067l437n8495M468L716j1715K2930q730n5589j9887L3131Q115K3866
11102f2432k0310P529l222O676j9460L74J3597J8129M7526L0738J537L831l8293
11089a3780k1796L6221M6070j7230n9458J409j2131l3330N1696L0650l9670k1509
$$ plain form
11178 26317 -37387 -64205 -52871 -59362 -64595 -65449 -67151 68 2754 -42417 -67289 -83746 -90587
11165 -90587 -68632 -49047 -7909 13684 8746 -9348 -26676 -33873 36541 46424 38236 56021
11153 56021 43897 14815 14966 -26386 -90605 -113544 -85912 -36006 -12093 -28195 -13938 9617
11141 9617 29016 28615 15191 13084 1226 34508 59243 14254 -23736 -33122 22599 70332 66272
11128 66272 -1447 -31270 -59832 -61816 -39016 -25519 -3476 3816 22806 20204 27342 26696 17262
11115 17262 -805 -4242 -62737 -58269 -54553 -66268 -43338 -52068 -107657 -127544 -94413 -86298 -62432
11102 -62432 -82742 -75213 -78435 -71759 -91219 -90845 -77248 -59119 -11593 19145 20682 24513 -13780
11089 -13780 -35576 645 46715 29485 -29973 -28564 -40695 -74025 -22329 8321 -31349 -52858
11077e2858K3638J0445K3100J7034K0079m779m2481n7203L103J690J3275M8425
11065C468M1492n4311l0897Q742M1403Q204j0304k3415j241K6962j6892m956j641
11052a3386n1232j9949L4796L7182j9219J2485j8620j0456r857k4895l9383K7806
11040i4728L001j4885k711J427J5130K4470J177J7870J7707j8592J9407j5928
11028d6655j3045k0296M1571J2748n730K5333l8342j4234J00J4504L3305k7005
11016c7746l8227n173J2314L858K1988o232J9526K909j340M2580J5543k0077n4899
11003d4976j0801L7266J805k7676k9776Q806M4200J3736k9953j9639l0070j8419
10991a05497k0882N6705j3165J5850L1967Q138P26J6781J1576l0373r07J2537
$$ plain form
11077 -52858 -29220 -18775 4325 21359 41438 36659 -5822 -63025 -59922 -58232 -44957 3468
11065 3468 44960 -9351 -40248 -31506 9897 18101 7797 -15618 -16859 10103 -6789 -11745 -13386
11052 -13386 -64618 -84567 -49771 -12589 -31808 -19323 -37943 -48399 -58256 -83151 -122534 -94728
11040 -94728 -91727 -106612 -109323 -107896 -92766 -68296 -67119 -49249 -31542 -50134 -30727 -46655
11028 -46655 -59700 -79996 -38425 -25677 -31407 -6074 -44416 -58650 -58550 -44046 -10741 -37746
11016 -37746 -75973 -81146 -68832 -64974 -42986 -49218 -29692 -26783 -28123 14457 30000 9923 -44976
11003 -44976 -55777 -18511 -16706 -44382 -74158 -65352 -21152 -7416 -37369 -57008 -87078 -105497
10991 -105497 -126379 -69674 -82839 -66989 -35022 -26884 -26158 -9377 2199 -28174 -29081 -16544
10979a6544l9118O066m665k4908N5006L2352n4908k7337J5754k9664P312K5596
10967e5058L4770J5936n9342l8494J7246m002R504K3391j3878l690l6665j1153
10955a21435O0417N2293J1698j0309j0239K9459j1560m8716n9874J6446M1579
10944e0241O091J6485j6948j0448J3905m572l8750M898M2041L928L410k215N216
10931b7200o112M9387k0320m5128j8555M3506N963P421j6209l2712k8198K8611
10919e9546O6264N754j5521K9452j3886l0762K6918K9098K9546n9076m0188k3099
10907e5046O08j6551k8545K4549P006P81J149J2283K8506p479R484J4984M588
10894c683J6800J0015p470J0240l0067K2248r365j9197j3985q817K5776q722k3402
$$ plain form
10979 -16544 -55662 -49596 -54261 -79169 -24163 8189 -46719 -74056 -58302 -87966 -80654 -55058
10967 -55058 -20288 -4352 -63694 -102188 -84942 -88944 -79440 -56049 -69927 -73617 -110282 -121435
10955 -121435 -61018 -8725 2973 -7336 -17575 11884 324 -48392 -108266 -91820 -50241
10944 -50241 -44150 -27665 -44613 -55061 -41156 -45728 -84478 -79580 -37539 -33611 -30201 -32416 -27200
10931 -27200 -33312 16075 -4245 -49373 -67928 -24422 -18459 -11038 -27247 -59959 -88157 -59546
10919 -59546 6718 12472 -3049 26403 12517 -18245 8673 37771 67317 8241 -31947 -55046
10907 -55046 -54438 -70989 -99534 -74985 -67979 -67198 -66049 -53766 -25260 -32739 -23255 -8271 -3683
10894 -3683 13117 23132 15662 25902 -4165 18083 8718 -10479 -24464 -33281 -7505 -16227 -39629
10881c9629k4258P007J5638k0828R111N1236K8351j1381k3854j6278M0885L3903
10869D9903O358J9500J4199J633J7317J1423K6187O1010P9841J08950K10016K39832
10857H46169K31374J63757M9860m9519K3322P9501m261j75432k43381k11528j56981
10846E52881j20385p9645r5561j02073o6141l9315k4510J4731K2751m3365l9921
10835b0553L7647J5643r535L6421J0698k5965o0358l0707k937j7916o257K0241
10823e3578J2095k686J6042J9684J285j6265O633O192O986k258l6095L6264K3301
10810A7600n8379m941j366J9860M3649q746m0510j556J3729k902k3840j8326N1935
10797a3793R470N041k8382J0308J970J4993j3476j4491J6006P711M010m678k93
$$ plain form
10881 -39629 -63887 -56880 -41242 -62070 -52959 -1723 26628 15247 -8607 -24885 16000 49903
10869 49903 56261 75761 89960 91593 108910 120333 146520 207530 287371 396321 606337 846169
10857 846169 1077543 1241300 1291160 1241641 1264963 1344464 1340203 1164771 921390 709862 552881
10846 552881 432496 352851 257290 155217 89076 49761 25251 39982 62733 19368 -20553
10835 -20553 17094 32737 23202 59623 70321 44356 -16002 -46709 -49646 -67562 -73819 -53578
10823 -53578 -41483 -44169 -28127 -8443 -7158 -23423 -16790 -10598 -3612 -5870 -41965 -5701 17600
10810 17600 -40779 -45720 -47086 -27226 16423 7677 -32833 -34389 -20660 -23562 -47402 -65728 -13793
10797 -13793 -4323 718 -27664 -17356 -15386 -393 -13869 -28360 -12354 -4643 -633 -5311 -5604
10784e604k710L0612J8677l1696p5196k9358K3725O531k8048J5620J3485J2907
10772e1055N728L0943r946j7158L8448K375k0754k6688o359J1937k2394l7684
10760a02607J1632j8322n488M5474J2928L243n537L2714K3627J6852k2582P144
10748i22K1706k9085m1344n3534N8M3509M5897L998k7449k390J4116q703m725
10735c8868k1324l739m405L7675L9883L3699j1602p2059N978j7036m0622r323
10723a01743j185J9674K5633j1874p424K1547J5893R734j4667K0257j4041j4014
10711e2210n715J5652l1859M3954J7958N0570J3958K0457K5063K3860J2315L6718
10699A70721J6886l3421K0098j2432n8233J6254j5789J0177K7563L3403P9657
$$ plain form
10784 -5604 -8314 22298 40975 9279 -65917 -95275 -71550 -65019 -93067 -77447 -63962 -51055
10772 -51055 -45327 -14384 -24330 -41488 -3040 -665 -21419 -48107 -54466 -42529 -64923 -102607
10760 -102607 -90975 -109297 -114785 -69311 -56383 -53140 -58677 -25963 -2336 14516 -8066 -922
10748 -922 20784 -8301 -49645 -103179 -103121 -59612 -13715 -9717 -37166 -39556 -25440 -34143 -38868
10735 -38868 -60192 -63931 -68336 -30661 9222 42921 31319 -40740 -34762 -51798 -92420 -101743
10723 -101743 -102928 -83254 -57621 -69495 -76919 -55372 -39479 -29745 -44412 -24155 -38196 -52210
10711 -52210 -57925 -42273 -74132 -30178 -12220 38350 52308 72765 97828 121688 134003 170721
10699 170721 187607 154186 174284 161852 103619 119873 104084 114261 141824 175227 254884
10688B54884Q7226J12434K02057K27310L47031M11162K22728k6628k08896l23816
10678A305492l43790k69996j72225j62755j16789j4972l8363l8026q7143j7642
10668D3791J4941K9026k0432m2550k1160m448k8451L2654l360J9589K8652j5697
10656C2555o628P462p2470k5930K3187O7359L538l5939K9012J4021j066n448J078
10643C0731J9240k887m7003J978k0820J4092l743K1242K4j5302L2787p1806o0913
10630a02380n956L518J0082O1932L2417m235k7630k3601k4841K0192N8300J600
10618f02k5614j765J8873l791q181O130l776K76j0148Q661k0520r356n2126m5033
10604a46972L1211M6976M7649k879j3828m7410K4636K8972j1181j38M17J6215
$$ plain form
10688 254884 342110 454544 656601 883911 1230942 1642104 1864832 1838204 1629308 1305492
10678 1305492 961702 691706 519481 356726 239937 224965 186602 148576 61433 43791
10668 43791 58732 87758 67326 24776 3616 -832 -29283 3371 11 19600 48252 32555
10656 32555 25927 33389 -39081 -65011 -41824 25535 29073 -6866 22146 36167 35101 29653 30731
10643 30731 49971 47084 81 2059 -18761 -4669 -8412 12830 12854 -2448 30339 -41467 -102380
10630 -102380 -108336 -104818 -94736 -32804 -387 -4622 -32252 -55853 -80694 -60502 -2202 -602
10618 -602 -26216 -27981 -9108 -12899 -21080 -14950 -18726 -18450 -28598 -19937 -40457 -49813 -101939 -146972
10604 -146972 -115761 -68785 -21136 -24015 -37843 -85253 -60617 -31645 -42826 -42964 -42547 -26332
10592b6332L659j6006k2563J2972L8704J0282R987K5116Q981j7370J1132R8328
10580A36890P5316J6315M08N9261k6915Q900Q585m2969o2068l7655n6094m6382
10568C3592l9724k0614k7774k0239K3028m3632K3137j4091j5980j1775l5223J1075
10556a38220M5438N4561o344j5666M033M0860L8675N5807j6800l4314k8388n886
10544f244Q622p7779K7718O5382K6975J6197L6089J03571Q1743k3247K1879K9806
10532C10712m5019l2688k7617m2769n1215m3720N489J5003q296k7750q365M7932
10520I1697J1377p889j4291j6599j8324J5989j7368M5444M7423l9748K737M1264
10508A41712J00639J1614j7926L938J9265N4859J9120N16K2615J8808L3198J2394
$$ plain form
10592 -26332 -22673 -38679 -61242 -48270 -9566 716 10703 35819 44800 27430 38562 136890
10580 136890 212206 228521 228929 288190 261275 270175 278760 235791 173723 136068 79974 33592
10568 33592 -6132 -26746 -54520 -74759 -51731 -95363 -72226 -86317 -102297 -114072 -149295 -138220
10556 -138220 -92782 -38221 -44565 -60231 -56198 -15338 23337 79144 62344 28030 -358 -6244
10544 -6244 2378 -75401 -47683 17699 44674 60871 96960 200531 282274 259027 280906 310712
10532 310712 265693 233005 205388 162619 111404 67684 73173 88176 79880 52130 43765 91697
10520 91697 103074 95185 80894 64295 45971 61960 44592 90036 137459 97711 100448 141712
10508 141712 242351 253965 236039 239977 259242 314101 333221 333737 356352 375160 408358 420752
10496D20752K7446J6146P825J9306Q204N5638k17J5302N8961Q0903Q5289O8149
10484H63704N9097O4961M3550J09015J41327J19749J32297J55496J77452J80930
10474B047578L05510M44886M81878N57193M36965L31631M06066O43538P88394
10465F443639Q15071Q73842R44204J235904J649080K264322L200946M607356O760267
10456B8794631J0376889J6625915K6869086M0943402N2934425M8698568K3032649
10449B48275565m041218q180529O777343J1157822j0466807m0438169n3092765
10442A49991242m4751883l0461219j9359258j2557163q535638o117324m566776
10435B3641981l451686k660609k162616j867432j506350j147669r09160q52909
$$ plain form
10496 420752 448198 464344 472169 491475 499679 555317 555100 570402 629363 710266 795555 863704
10484 863704 922801 987762 1031312 1140327 1281654 1401403 1533700 1689196 1866648 2047578
10474 2047578 2353088 2797974 3279852 3837045 4274010 4605641 5011707 5655245 6443639
10465 6443639 7258710 8132552 9076756 10312660 11961740 14226062 17427008 22034364 28794631
10456 28794631 39171520 55797435 82666521 123609923 176544348 225242916 248275565
10449 248275565 244234347 236053818 242831161 253988983 243522176 203084007 149991242
10442 149991242 105239359 74778140 55418882 42861719 34326081 28208757 23641981
10435 23641981 20190295 17529686 15367070 13499638 11993288 10845619 9936459 9083550
10427I083550q18687p11777n37419m37189n00050n61298n59914m95786m18896
10418D042534l94665l09786j82355k12265r2358r6246o1444p5288q4082p0169
10408B463876p6876j24129j25788j64566k00070j08684j07118p8680r7388m1724
10398A338853m6940q6988q7358m5739l9642L57j2937l6467j0961k1847j0725k0951
10386I18655R096P474n977j8347l4674p6102m4008j3424j004n3720p6766o5256
10374E45947K7715J512q911M5103j6988o0300K7788J2556m2883N0440K3402Q369
10362F13750P287k7284k2728j8259M2113J6529j0467J4632J8500L654k0627m8420
10350E68680J3388j5841N252m659l1848P744L125k2646M9071P1114P1778M7953
$$ plain form
10427 9083550 8264863 7553086 7015667 6578478 6078428 5517130 4957216 4461430 4042534
10418 4042534 3647869 3338083 3155728 2943463 2851105 2754859 2693415 2618127 2534045 2463876
10408 2463876 2387000 2262871 2137083 1972517 1772447 1663763 1556645 1477965 1380577 1338853
10398 1338853 1291913 1204925 1117567 1071828 1032186 1032543 1019606 983139 972178 950331 939606 918655
10386 918655 927751 935225 929248 910901 876227 800125 756117 742693 741689 687969 611203 545947
10374 545947 573662 575174 566263 611366 594378 534078 561866 574422 531539 581979 605381 613750
10362 613750 621037 593753 571025 552766 594879 611408 600941 615573 634073 637727 617100 568680
10350 568680 582068 566227 571479 566820 534972 542716 545841 523195 572266 643380 715158 763111
10338G63111M8402K8846J5353l9111j3405M31k0856M963L7595O6611O3273R4470
10326A049683q414K8858j7183k2450O480j8196P1709O2999M3419P4797P0930N596
10314A348228J1250O8293J02632J14082J45837J23206K08010K46951K84945M37487
10304C090921O26193P13676O80677N31080L85578L33257L12854M65054P60063
10295G899353J148337J536877K082845K616119L375134M493783O261221R470386
10287C8884055J5014909K4538988L9526824N8109162P0033128O1201362L3291441
10280C40599869j88224l3387731o0085762o7499892n4751333l6731589k3110217
10273F4845121j4748758r907377o998023n222504m176916l502303k969325k423312
$$ plain form
10338 763111 811513 840359 855712 816601 803196 803627 782771 787734 825329 891940 955213 1049683
10326 1049683 1041269 1070127 1052944 1030494 1036974 1018778 1090487 1153486 1196905 1271702 1342632 1348228
10314 1348228 1359478 1427771 1530403 1644485 1790322 1913528 2121538 2368489 2653434 3090921
10304 3090921 3717114 4430790 5111467 5642547 6028125 6361382 6674236 7139290 7899353
10295 7899353 9047690 10584567 12667412 15283531 18658665 23152448 29413669 38884055
10287 38884055 53898964 78437952 117964776 176073938 246107066 307308428 340599869
10280 340599869 340411645 307023914 246938152 179438260 124686927 87955338 64845121
10273 64845121 50096363 40188986 33190963 27968459 23791543 20289240 17319915 14896603
10265A4896603j937244j466506j052255p13519n11784m48367m17294n14527o43314
10256G191793p32208p00605o33710m97650m03334l50121k84443k28411k23892
10247C137419k33440j55836q9139o5267j00097q8320q2132j41130q1668j43735
10237A956655j00334j15484q6347m9203o0144r7794j7965K2343n6513j03327o6432
10226A225455n0250j9151J1775j809j7291k0830l3400j5395L4804j009J8230L30
10214A131459k8568m1210p4114l4555l5441p4111k5223K7845l225J0896j2763
10203H40990J3743m733k6603k0150j9563j7281k1424l3708m3606k6670J6292K1509
10191F78796j0241R035M5185J1397R77m3545m9862J9595J0301k8978k5354K558
$$ plain form
10265 14896603 12959359 11492853 10440598 9727079 9215295 8766928 8349634 7835107 7191793
10256 7191793 6459585 5758980 5125270 4627620 4224286 3874165 3589722 3361311 3137419
10247 3137419 2903979 2748143 2659004 2593737 2493640 2405320 2323188 2182058 2100390 1956655
10237 1956655 1856321 1740837 1654490 1605287 1545143 1447349 1429384 1451727 1395214 1291887 1225455
10226 1225455 1175205 1156054 1167829 1166020 1148729 1127899 1094499 1079104 1113908 1112899 1131129 1131459
10214 1131459 1102891 1061681 987567 953012 917571 843460 818237 846082 842857 853753 840990
10203 840990 854733 850000 823397 803247 783684 766403 744979 711271 667665 640995 657287 678796
10191 678796 668555 677590 722775 734172 735149 691604 641742 661337 671638 642660 617306 619864
10179F19864k8140L8192K04J3809l766p591K1381m3215p4539n1635O59L8621L2444
10166E56288k6904n689o897j29O2283M0570J0040R233J8375L960l7609l0213o51
10153E92657K388J981r697k0255n8995l0463k86K502J0741k2589m4504l0104J0108
10140D03484L8574o1392m9459j5035L4315L2716P526J4762J1361q928r694J037
10128C99267l36j2172R72l215k5439L734K3212K0243K6588J3371r275Q572p329
10115D38193J2149j3812l9394j3251K9142L522j3924l742k3188j5939K4575j6304
10103C68027l3518j0409J2728k1487k3572p038P735L4328K0457J3044j1238K2888
10091C71945k8039l6724m597k2683j1912l888L246j1522k7091j0141L5829j6795
$$ plain form
10179 619864 591724 629916 630120 643929 640163 632572 653953 610738 536199 484564 485223 523844 556288
10166 556288 529384 523695 516798 516669 578952 619522 629562 638795 657170 661130 623521 593308 592657
10153 592657 595045 597026 587329 567074 508079 477616 477330 479832 490573 467984 423480 393376 403484
10140 403484 442058 380666 331207 316172 350487 383203 390729 405491 416852 407924 398230 399267
10128 399267 398931 386759 387731 384516 359077 362811 386023 406266 432854 446225 436950 445522 438193
10115 438193 450342 436530 397136 383885 413027 416549 402625 398883 375695 359756 384331 368027
10103 368027 334509 324100 336828 315341 291769 284731 292466 326794 347251 360295 349057 371945
10091 371945 343906 307182 302585 279902 267990 264102 267348 255826 228735 218594 254423 237628
10079B37628k4011k663o313Q770L3418K5108M96m410K3194J4540l5223m1629J7490
10066B46395M6073p399j8472M3553j4744j6036n956m124N848O228J07j053J3858
10053B94278N766J615J3917j7798m8070L0960R0973P8314L3416P9005J21561J47289
10041H31226K49707K64577J35718K1088J121M869N4314l6400j30956k69087k66649
10030H59528j78240q5427m7406m7714l5655k5143m8739o6719n0006k0381O6484
10019C20582n518n8980j2055k0875P530k7090j72j700j0786j2361l290l1791L5539
10006A79033K3004j4468J1792N7893N568o6513j8712N831L0460N2311K6700n1351
9994B41548j9978j1892Q483L913q276j4945K865k2946l5719K6020L9992R61L2967
$$ plain form
10079 237628 213617 210954 204641 213411 246829 271937 272433 268023 291217 305757 270534 228905 246395
10066 246395 292468 285069 266597 310150 295406 279370 273414 269290 275138 281366 281473 280420 294278
10053 294278 300044 301659 315576 297778 249708 280668 371641 449955 483371 562376 683937 831226
10041 831226 1080933 1345510 1481228 1502316 1503437 1508306 1562620 1526220 1395264 1126177 859528
10030 859528 681288 595861 548455 500741 465086 439943 391204 324485 274479 254098 320582
10019 320582 315064 256084 244029 223154 230684 203594 203422 201722 190936 178575 175285 143494 179033
10006 179033 202037 187569 199361 257254 262822 196309 177597 183428 213888 266199 292899 241548
9994 241548 221570 209678 218161 222074 213798 198853 201718 178772 143053 169073 209065 210026 242993
9981B42993K3028m623J2430J718n4488P612j5775n2714l2434J3523M6663O0377
9969B48310j1301m0234j2308r452R417l5222k280O0572M4774J7146l8891q748
9957B21783L3875J0321m0416K152K056j3235P118o506k1082l8415r757M331M484
9944A56709J1619J255k7256j2557J3524q495L3919L8861J1553n214j3372Q630
9932B09176p2404k6565L7255L5463R018k6187k1155j0572r579L0294K1091J2200
9920A88035J3542J9534m589o562J2158j0340M3562l2268l7997K7206J5030j3745
9908B13566J9887J2629N2492k5054j4969j7501k2193p02l100j9191K9001L2821
9896B57686M7982M0603K5311l4214k2385k5214k1877p142K3521K1497J9228m997
$$ plain form
9981 242993 266021 261398 273828 275546 221058 228670 212895 160181 127747 141270 187933 248310
9969 248310 237009 196775 184467 175015 184432 149210 146930 207502 252276 269422 230531 221783
9957 221783 255658 265979 225563 227715 229771 216536 223654 217148 196066 157651 147894 152225 156709
9944 156709 168328 169583 142327 129770 143294 134799 168718 207579 219132 213918 200546 209176
9932 209176 136772 110207 147462 182925 191943 165756 144601 134029 124450 154744 175835 188035
9920 188035 201577 221111 216522 209960 222118 211778 255340 223072 185075 212281 227311 213566
9908 213566 233453 246082 298574 273520 258551 241050 218857 218155 215055 195864 224865 257686
9896 257686 305668 346271 371582 337368 314983 289769 267892 260750 284271 305768 324996 319999
9884C19999j6828l121M1418L7357J23398J89508L03796L54404L42649K12094J03978
9873B008652m7175k52779l80295l22588j98840j57676j22310o4796m8564j2249
9863D01380K709j832M471N8263O9426N9280J62571K91935M75857P62056O66708
9852B952824J5032o55118p60797n20406k90641j35793p8181p4344m1876m7488
9842C63212n1236J2434q970r800K0834q329k2248K2758j082n3288m2125r557M3540
9829B56143N1565j6168j8889p780j8997k7867J5305K6614k510k1587k2632L0693
9817B43890J2581j0735l980o170N264J4703K7671r135k7397L74J9597n612j3054
9804B47997J0889R135m0286o405m3442P671O4988L086j254j5660o3612j2087N1744
$$ plain form
9884 319999 303171 300050 341468 378825 502223 691731 995527 1349931 1692580 1904674 2008652
9873 2008652 1961477 1708698 1328403 1005815 806975 649299 526989 462193 413629 401380
9863 401380 404089 402257 406728 464991 534417 593697 756268 1048203 1524060 2286116 2952824
9852 2952824 2967856 2312738 1551941 1031535 740894 605101 526920 452576 410700 363212
9842 363212 311976 324410 315440 305640 326474 318145 295897 318655 317573 264285 222160 212603 256143
9829 256143 307708 291540 272651 264871 245874 218007 233312 259926 257416 235829 213197 243890
9817 243890 256471 245736 241756 235586 240850 255553 283224 274089 246692 247066 266663 261051 247997
9804 247997 258886 268021 227735 221330 177888 185559 250547 253633 252379 236719 173107 161020 212764
9791B12764L3821J7693K9116k8535j8590r208k2226l8785n877M7581P4340P699
9779B99793l1593j9484o297l4589K0201L6921k6813K3700o250J141l6684J1686
9767B31732L0415M7354J9259l3876o235J849l4845j8419k1661j2468L1189q336
9755B25958J9035k5004K2396K0780q842L1561k534k802P254L0934j7794j5252
9743B85690P086l7149J7309K9305J7261q294m7359k1870K2143R916k4601J5012
9731B64449K7847Q144k2474M893K4938K2275r895M856j3878O228l1841k1071K4977
9718B89448K7573k7430K0421l814j8950R351K7749J1194J3942p012l4037l3409
9706B75026k2348P721J6711L6017K8260j1935j6162j93j179J0563O543P826q102
$$ plain form
9791 212764 246585 264278 293394 264859 246269 237061 214835 176050 170173 217754 292094 299793
9779 299793 268200 248716 242419 207830 228031 264952 238139 261839 255589 256730 220046 231732
9767 231732 262147 309501 328760 294884 288649 290498 255653 237234 215573 203105 234294 225958
9755 225958 244993 219989 242385 263165 254323 285884 283350 280548 287802 318736 300942 285690
9743 285690 292776 255627 272936 302241 319502 311208 263849 241979 264122 274038 249437 264449
9731 264449 292296 300440 277966 282859 307797 330072 320177 325033 311155 317383 285542 264471 289448
9718 289448 317021 289591 310012 306198 287248 296599 324348 335542 349484 342472 308435 275026
9706 275026 252678 260399 277110 313127 341387 329452 313290 313097 311918 322481 329024 336850 328748
9693C28748r3n0462n999j4139K4532M2669J9248q588k4969m8723M383K3698j8180
9680B72125k2209r45N957K3871K9744L0428N503R474j7538l1363k8664J1660k828
9667B85215K9345j1603J0186l9169l898O0873M874l6248J7037j2475k8868L6272
9655C11541K3912k0446K1595K4393j6791l5535j3821j27N8904N0095r122p478
9643C87120j862M4414K2024k3341p6347l8450M3966J8393J3934j017N611k1291
9631C73154L7559k1033r769J8455O65J546K613j1023K8919J6890o4053l3037J9135
9618C60021K7894l117j5492r690j200K8665k8102K6459o693r253j7248J1308K0797
9605C84349K6908J8803J624m4929l1356l7027k511J0606k5277j0712m381L2495
$$ plain form
9693 328748 328655 278193 272194 258055 282587 325256 344504 335916 310947 262224 266607 290305 272125
9680 272125 249916 248971 254928 278799 308543 338971 344474 353948 336410 305047 276383 288043 285215
9667 285215 314560 302957 313143 273974 270076 330949 335823 299575 316612 304137 275269 311541
9655 311541 335453 315007 336602 360995 344204 308669 294848 294721 353625 403720 394598 387120
9643 387120 385258 429672 451696 428355 352008 313558 357524 375917 389851 388834 394445 373154
9631 373154 410713 389680 379911 398366 399031 400577 403190 392167 421086 437976 373923 340886 360021
9618 360021 387915 384798 369306 359616 358416 387081 358979 385438 378745 369492 352244 363552 384349
9605 384349 411257 430060 431684 386755 355399 318372 315861 326467 301190 290478 286097 318592
9593C18592L4674j4567K2054M765K1367j3949J570L5841j442j9252n2356j6768
9581C20529N3968K7795k5192j5702l3851K749J1195m9529k3248L6723k576L9212
9569C42073L7662j0943q537l335k601J0596k8151J9384j3601q495k9211j0379
9557B94462L7626N2391j7002o0487m5326K6100L2693K6078j2977L1879k5106N270
9545C45601k759J1262j0184j2017P265M689n0375K4737L2005K4344J4706K620
9533C91894L6662P098k4632k2482j5860J5757O2248r669l5488l8442j3570O614
9521C60130M263o056n253K3727k1062m1883J1703J0261r263k2148L1191R735J155
9508C46500k7695K709M3846j4860m037R2182K8671n0692l7793p262k4753K2092
$$ plain form
9593 318592 353266 338699 360753 365518 386885 372936 374506 410347 408905 389653 337297 320529
9581 320529 374497 402292 377100 361398 327547 330296 341491 291962 268714 305437 302861 342073
9569 342073 379735 368792 360255 356920 354319 364915 336764 356148 342547 334052 304841 294462
9557 294462 332088 384479 367477 306990 261664 287764 320457 346535 333558 365437 340331 345601
9545 345601 342842 354104 343920 331903 339168 343857 293482 318219 350224 374568 389274 391894
9533 391894 428556 435654 411022 388540 372680 388437 450685 441016 405528 367086 353516 360130
9521 360130 364393 358337 353084 376811 355749 313866 325569 335830 326567 304419 335610 345345 346500
9508 346500 318805 321514 365360 350500 346463 438645 467316 416624 378831 371569 346816 368908
9496C68908J7837m479N4989N902l1057J8442K1865l1210L0193q429o646L7235
9484D73550n3068l2724J1160j3107K0210J4304k2767J1419n470N613L678k0739
9472C92059J9721J8540R815j760K4248l2420n1599l113P686M3271M1433J1718
9460D79599J0738k630j9163j9419K4672k5670k0451J6839J5866l454j5144P925
9448D49708L2279L4506r181o1328k621O4165O0912L7925l5599j0675J3759m5522
9436E28328k6787J9164L3998o841p853p571k2339j8951R700n942k763n572q626
9423D77945q042K4856J3340l6130k6755J3975O6506L2537O524q298m9647J6276
9411E23087M044m2900K2166O0334L3222j1548m4957N39K1158J4708k6577L6705
$$ plain form
9496 368908 386745 382266 437255 443157 412100 430542 452407 421197 451390 442961 436315 473550
9484 473550 420482 387758 398918 385811 406021 420325 397558 408977 403507 409120 412798 392059
9472 392059 411780 430320 440135 438375 462623 430203 378604 375491 383177 426448 467881 479599
9460 479599 490337 487707 468544 449125 473797 448127 427676 444515 460381 456927 441783 449708
9448 449708 481987 516493 507312 445984 443363 507528 568440 606365 570766 560091 573850 528328
9436 528328 501541 520705 554703 547862 540009 532438 510099 491148 500848 494906 492143 486571 477945
9423 477945 469903 494759 508099 471969 445214 459189 525695 558232 564756 556458 506811 523087
9411 523087 527131 484231 506397 566731 599953 588405 543448 543987 565145 579853 553276 589981
9399E89981K3975k9495k5302k1516n685j5048K7286R122N396K984J2875P454m168
9386E77859O0275L7876p5339n6176k5861L8045P5789M2510l303n0987q275K5156
9374F37569K4961J8244q886j5699l5539L4710J2168M412m1044J1205O9450K8441
9362G39992k4789k9050k8494K4167r548l9067P925L4358j0911k9341K3200k5674
9350F32768q776j986k6191N091L6226K7442O0965J2396m6963o2338n361O652j4327
9337F15598j7589L9996K7162p172L6986L8207j5993j3341l4753j8973J0443L2846
9325F93417R040l227r44o926j1096m2245J4468Q949j754L7709p583R202L654K1830
9311G24494k4954k9696J8535P306P254J1011k3508m1751j4918j2386j876k8158
$$ plain form
9399 589981 613956 584461 559159 537643 531958 516910 544196 553318 558714 561698 574573 582027 577859
9386 577859 638134 676010 600671 544495 518634 556679 632468 674978 671675 620688 612413 637569
9374 637569 662530 680774 671888 656189 620650 655360 667528 671940 630896 642101 711551 739992
9362 739992 715203 686153 657659 681826 672278 633211 641136 675494 664583 635242 658442 632768
9350 632768 623992 622006 595815 600906 637132 664574 725539 737935 690972 628634 623273 629925 615598
9337 615598 598009 638005 665167 657995 694981 733188 717195 703854 669101 650128 660571 693417
9325 693417 702457 699230 698286 691360 680264 638019 652487 661436 659682 697391 689808 699010 702664 724494
9311 724494 699540 669844 688379 695685 702939 713950 690442 648691 633773 621387 619511 591353
9299E91353j7065J0141N497M9537Q362J302J3522k439j1558j5380J1962O0376
9287G05610K7178k0650J3412l6066j133Q490M69k190m7745l3060J4621j5753l260
9274F09923J6105n570L585O2014K6925j988k8558j076J3713K571K8002k1569n4845
9261F49232Q432j29J2469o280K4686L9210K1235j9716j5912m1026j4652k6670
9249F30879j1764Q617J6328J760j0130k0223L0875L6525j5242k3041J0731L1065
9237F86380L972J7904L9739L3466l8893m1070k4032j0583K529J090k4449p221
9225F38832J8090R261k7443P30k3951K573Q49O98J8908O560J6443j1926L4571
9212F84195l138O142J5145O048j0796k4399J917q85j1110O5425M3648m0436m8079
$$ plain form
9299 591353 574288 584429 589926 639463 647825 649127 662649 660210 648652 633272 645234 705610
9287 705610 732788 712138 725550 689484 688351 696841 697310 695120 647375 614315 628936 613183 609923
9274 609923 626028 620458 624043 686057 712982 710994 682436 681360 695073 697644 725646 704077 649232
9261 649232 657664 657535 670004 663724 688410 727620 748855 729139 713227 672201 657549 630879
9249 630879 619115 627732 644060 645820 635690 615467 646342 682867 667625 644584 655315 686380
9237 686380 690352 708256 747995 781461 742568 701498 677466 666883 669412 670502 646053 638832
9225 638832 656922 666183 638740 639470 615519 618092 618941 619639 638547 645107 661550 649624 684195
9212 684195 681057 687199 702344 708392 697596 673197 675114 674229 663119 728544 772192 731756 683677
9199F83677j684j1715k037j8228P798L3479L0890r270j3633J1742K5895m0493
9187F96421M516J0167j3943N9j6858j0842k3619J4371L0650O757n0000n0841k9440
9174E67398K1834K3385J1262K5711L3017L0035l4767n9185l1507J8581j8130N7342
9162F44976J6622O615j3342l5920r585K2682J8152k0758j3729j0294o3583j4860
9150E26976R809r679M2346N9064O944K5853p172l1142k1693J4878j8620j0629
9138E86935M877j1275J0055M0446k1679n4759j2182M9513R940r720O294j4041
9126E84404j1826l942J2279L3402J9796R87k015j0560l7627n2005L2698M0621
9114F06212o350M884J9574o578j0786j5649L618J2589j7083N7745J9836l2656
$$ plain form
9199 683677 681993 670278 668241 650013 657811 691290 722180 712910 699277 711019 736914 696421
9187 696421 700937 711104 697161 697220 680362 669520 645901 660272 690922 697679 647679 596838 567398
9174 567398 589232 612617 623879 649590 682607 712642 677875 618690 587183 605764 587634 644976
9162 644976 661598 668213 654871 618951 609366 632048 650200 629442 615713 605419 541836 526976
9150 526976 536785 527106 569452 628516 635460 661313 654141 622999 601306 616184 597564 586935
9138 586935 591812 580537 590592 631038 609359 554600 542418 591931 601871 592151 598445 584404
9126 584404 572578 568636 580915 614317 634113 635100 633085 622525 584898 532893 565591 606212
9114 606212 599862 604746 624320 617742 606956 591307 594925 607514 590431 648176 668012 635356
9102F35356m1365l0172r69k2318l2213j64J4813J9005L9583p737k3500j3763K7645
9089E64201l3337P541j4900m3937L8374L0600o27j3665j0622l6799k8646r750
9077D48433N90L6467J7516J0321N0206m7447m9204O000J9785J3433p506N675K9519
9064E33788k1100k4309l1312K9297M1136K8257J0307k9761n1933j4283j6878M1023
9052D94232P4274p6156k6293o987l1297J8431J8723j777k8034J2756j960j7282
9040D28630k2699L0979J7286K8959L8575q054o729j1572K198j2424k6527j2011
9028D46611K856j8352j4223j7132j1191J4137m0867J6781Q810L9095N2499J3976
9016D93000j2370j4953m6194q4065q859M4182J1531M9595K444j7321j2922l8583
$$ plain form
9102 635356 593991 563819 562850 540532 508319 508155 522968 541973 581556 573819 550319 536556 564201
9089 564201 530864 538405 523505 479568 517942 548542 547915 534250 523628 486829 458183 448433
9077 448433 449023 485490 503006 513327 563533 516086 466882 472882 492667 506100 498594 504269 533788
9064 533788 512688 488379 457067 486364 527500 555757 566064 536303 484370 470087 453209 494232
9052 494232 568506 492350 466057 459070 427773 446204 464927 463150 435116 447872 445912 428630
9040 428630 405931 436910 454196 483155 521730 513676 506947 495375 497573 485149 458622 446611
9028 446611 449467 431115 416892 399760 388569 402706 361839 378620 387430 426525 479024 493000
9016 493000 480630 465677 419483 335418 326559 370741 382272 431867 434311 416990 404068 365485
9004C65485R129K1408L907k660R656j5986j1606p507M485K8367J7919r498j9750
8991C93349J6889N0714K359m5313k2580j1211K6347r89m698l5400n6984k7636
8979B84847L2050q769q698J545J718j1304O814M069j6419k5337J4129K9497O9715
8966C73857j9698l1072k6250R934O089L8756L0542J9387n2463n355k7448m905
8954C11374O934K8498O207O838j9959l1843J0037L4204L1034J7419m629j3870
8942C82244k9975J8828j5733O08J1475j0414J0611J7260L1924k8406l0474j672
8930C56276l8976k2567j3759R95M759m5293j9078L4066M2825j6988m3490K8333
8918B67103j3901Q589N1345j8276J7106L509l6453L433L9114J1903m3657n182
$$ plain form
9004 365485 374614 396022 399929 397269 406925 390939 379333 371826 376311 404678 422597 413099 393349
8991 393349 410238 460952 463311 417998 395418 384207 410554 409565 404867 369467 312483 284847
8979 284847 316897 308128 299430 300975 302693 291389 298203 302272 285853 260516 274645 304142 373857
8966 373857 354159 323087 296837 306771 312860 351616 382158 401545 349082 343727 316279 311374
8954 311374 318308 346806 353013 359851 339892 308049 318086 352290 383324 400743 396114 382244
8942 382244 352269 371097 355364 355972 367447 357033 367644 384904 416828 388422 357948 356276
8930 356276 317300 294733 280974 281969 286728 241435 222357 256423 299248 282260 238770 267103
8918 267103 253202 261791 313136 294860 311966 315475 279022 282455 321569 333472 289815 284633
8906B84633K9612J0063K69m5287j441O761j3207J3515k140J0842N211k083M844
8893C01592q070L3288M779k3086J5461J4262J8017L270m476q676l6315N275N4196
8880C69517n851n3212j2635j568p2742K9677P200o42j1688l354N872K052l619
8867B49007J4975p420J4550K3133l504J5670o867J758k6443J68k4621k1248K9262
8854B58420M01j3234m324O769J0594L6877L2490j8738J3413m7821j1390K1659
8842B85116m399K1964K0656r004k2777j3211o2900J3554O6300M5335L129l5928
8830C07835L593k4831k0344M9109j6055M1094j1583K1913l5033k5606l9763r963
8818B40366K001m1653l6087J5448K9614k4125q491J0820k5129P068N3529K6316
$$ plain form
8906 284633 314245 324308 324577 279290 277849 284610 271403 284918 282778 293620 298831 296748 301592
8893 301592 293522 326810 331589 308503 323964 338226 356243 359513 355037 346361 310046 315321 369517
8880 369517 363666 310454 297819 296251 223509 253186 260386 259744 248056 244702 250574 252626 249007
8867 249007 263982 256562 271112 294245 290741 306411 299544 301302 274859 275027 250406 229158 258420
8854 258420 258821 245587 241263 248032 258626 295503 327993 309255 322668 274847 263457 285116
8842 285116 280717 302681 323337 314333 291556 278345 215445 228999 295299 340634 343763 307835
8830 307835 311428 286597 266253 315362 299307 340401 328818 350731 315698 290092 250329 240366
8818 240366 242367 200714 164627 180075 209689 185564 177073 187893 162764 169832 223361 249677
8806B49677j0146j1629m1221K8286K1231J0239P988j1500K4018l603J2151O0450
8794C35941J2570m6191k8315l131Q52j5263L5099L329j2384j2529j0820K6952
8782B86110M0956N259l0216L5391K2386q974J7624k1054m7707n6681l0498Q197
8770B20793k5708j006K6279M3123P442m1041r315O397N7892k4678k2131k6173
8758B11874K336L0544L0576L3636k3629k3950L2978K8133K3285j2595k4370l0407
8746B78411J8785M2844R952l1207n0185o677J9549j3322P9242L2125k1935j9614
8734C37968j9445k4907r707N7596J4737M730o188j5682K1820M1818j5180k5153
8722C62407K4005l1574j9487K9546L2772p189k6503J436q091r178O758q245m410
$$ plain form
8806 249677 239531 227902 186681 214967 236198 246437 254425 242925 266943 263340 275491 335941
8794 335941 348511 302320 274005 270874 271726 256463 291562 294891 282507 269978 259158 286110
8782 286110 327066 332325 302109 337500 359886 350912 368536 347482 299775 243094 212596 220793
8770 220793 195085 194079 220358 263481 270923 229882 220567 226964 284856 260178 238047 211874
8758 211874 214210 244754 275330 308966 285337 261387 294365 322498 345783 333188 308818 278411
8746 278411 297196 340040 349992 318785 268600 261923 281472 268150 347392 379517 357582 337968
8734 337968 318523 293616 283909 341505 356242 360972 354784 339102 360922 402740 387560 362407
8722 362407 386412 354838 335351 364897 397669 390480 363977 365413 357322 348144 354902 346657 342247
8709C42247K4664J8236l2980k3166k4558q430K0609L3578M4384R310k8472N764
8697C81186J1551K1404P691l7821J5429L5716J8378j7356K0354j5205J8891R806
8685D70024n593k0429L721M4035P257O571m3206n269R819j8585k7636o992N1606
8672D65323J981n094m5488k0783j1405j3299j881K0368L1011k0623l3954K687
8660C68843L3023R075J7273J2739N7330M4191L8954O6563J55701K23950J58136
8649A185778o7459k08032j25847q8770m1545k5098k0044k6862R103L8481j8405
8638F11300k4340M171K377J8051k3072j3354j4018P5964M9854p661L2954L7868
8626G50094M0736M2103K0089L7201M9899M9253J0665K0609M5044R998J2715R866
$$ plain form
8709 342247 366911 385147 352167 329001 304443 296013 316622 350200 394584 403894 375422 381186
8697 381186 392737 414141 421832 384011 399440 435156 453534 436178 456532 441327 460218 470024
8685 470024 464431 444002 447723 491758 499015 505586 462380 457111 466930 448345 420709 413717 465323
8672 465323 467304 462210 416722 395939 384534 371235 369354 389722 420733 400110 366156 368843
8660 368843 401866 410941 428214 440953 498283 542474 581428 647991 803692 1027642 1185778
8649 1185778 1118319 910287 784440 695670 654125 629027 608983 582121 591224 629705 611300
8638 611300 586960 591131 593508 611559 588487 575133 561115 637079 686933 679272 712226 750094
8626 750094 790830 832933 853022 890223 940122 989375 1000040 1020649 1065693 1075691 1088406 1098272
8614A098272k7645J3525N8174M1894J0558Q8605J50944K13792M51935M68860j10019
8603B458895m57831l29398j87222o5250j1296J5034j5524l1439l0740q2191j13379
8592A149659j06070q6197j44887o9026l0506m5216n4462o8531r3686n3039j573
8581C96466L8124Q490j3621n9078q987m926j4228k3144O231l966L381n206P407
8568C26943K0215L8770M3976N4550K0552K4632Q5658J31570J56292L3977k06543
8557G30592k27168j03572o4196m462J6216k4610k4329l1896k2543l26K0838j1381
8545B53163j8319L7763j2184k3652L9344K249o744j0256j5114r485J3314n544
8533B44535k4051m270j4047j5573K694L012K4299k388q858J2401j3706j9339J5519
$$ plain form
8614 1098272 1070627 1084152 1142326 1184220 1194778 1283383 1434327 1648119 2100054 2568914 2458895
8603 2458895 2001064 1671666 1484444 1419194 1407898 1422932 1407408 1375969 1345229 1263038 1149659
8592 1149659 1043589 957392 812505 743479 712973 667757 613295 544764 451078 398039 396466
8581 396466 434590 443080 429459 370381 361394 356468 342240 319096 325327 321361 324742 319536 326943
8568 326943 347158 385928 429904 484454 505006 529638 615296 746866 903158 937135 730592
8557 730592 503424 399852 335656 331194 347410 322800 298471 266575 244032 243706 264544 253163
8545 253163 234844 272607 260423 236771 276115 278364 271620 261364 246250 236765 250079 244535
8533 244535 220484 216214 202167 186594 189288 192300 216599 214211 205353 217754 204048 184709 200228
8520B00228j7117o283M0817K4693k5499j9287k6664o78j6185L678J4033J7181
8508A88917j1758N031K1189k144K1266n8973J3378K1641K7458L7587Q332m1350
8496B30574N84K5404j4563r280l9425k2113N097m52j7874l3709r598M9757L4520
8483A98922j5591n2495j8892M7322K3333K3887O846j0481J8370M580M343l2788
8471A97356m7048J2451L1908k8961o5153O3336K8074k181O593L4333J5859m7698
8459A98869j9557j7507k3948M1626J2802l4572L357l1209k1909K433K859j667
8447A11577j700n1775l4174R66K4135K5250L6321O2640K9443n0439o6606l1277
8435E4361L6862L9567J6365J4106j3853K6757L939K0205n668l9770l6129n4501
$$ plain form
8520 200228 183111 176828 217645 242338 216839 197552 170888 170210 154025 157703 171736 188917
8508 188917 177159 182190 203379 201235 222501 163528 176906 198547 226005 263592 271924 230574
8496 230574 231158 256562 241999 232719 193294 171181 176278 175826 157952 124243 114645 164402 198922
8483 198922 183331 130836 111944 159266 182599 206486 213332 202851 221221 225801 230144 197356
8471 197356 150308 162759 194667 165706 100553 163889 191963 189782 196375 230708 246567 198869
8459 198869 179312 161805 137857 179483 192285 157713 161070 129861 107952 110385 113244 111577
8447 111577 109877 58102 23928 24894 49029 74279 110600 173240 202683 152244 85638 54361
8435 54361 91223 130790 147155 161261 147408 174165 178104 198309 192641 152871 116742 62241
8423F2241P580K8024J1270o5122j223L0302K0032K293m763j9831J2755M2103n698
8410A19963K0973L6191l1168m019N917j4150n068k7608J4763M1188n838J9980
8398A71124J7969J1522M027k3981o50k1786k9014k7649j0849L0392O4961J5623
8386B01689j7139k0289J7909K2304J7415l1569l1743K0881K537J1298M563j3423
8374A84433n6610j1095J1409K5599L9486J6034J5246k0240l2476j9752N998j9
8362A58013J4401n145m9331j9172l867J1653K4053N12R609n727m2576j3884j662
8349G6877j2352K4706N858l2040K8009J7886O83m7349l1812j6733m583k1532L7068
8336B4686N5286J9222m0242J3084N2332j4996l0497o044L4324P3413l19k5629
$$ plain form
8423 62241 69821 97845 109115 43993 42770 73072 93104 95397 90634 70803 83558 125661 119963
8410 119963 140936 177127 145959 141940 147857 133707 128639 101031 115794 156982 151144 171124
8398 171124 189093 200615 204642 180661 180011 158225 129211 101562 90713 121105 186066 201689
8386 201689 184550 164261 182170 204474 221889 190320 158577 179458 181995 193293 197856 184433
8374 184433 127823 116728 128137 153736 193222 209256 224502 204262 171786 152034 158032 158013
8362 158013 172414 167269 117938 98766 94899 106552 130605 131117 140726 134999 92423 78539 76877
8349 76877 64525 89231 95089 63049 91058 108944 109627 62278 30466 13733 9150 -12382 24686
8336 24686 79972 99194 58952 72036 124368 109372 78875 72831 107155 180568 180249 154620
8324A54620j9184J6284K3469J7897j396k1265k2877J1816n9802O555K5770Q449
8312A40336l1128q296K8945p270J3551o582J9372O644k3222K720q439k0025M372
8299A10978N4255L4201m5112k0683J1617K9854k68o7104l4614j3017j2312p794
8287D0001J4249k1105N982M337K4786J8639l177J5430K6818q389j4520L0394l5363
8274I8082Q549n642j6932L2299J8436m8126l4652K770j5607R088L63p380J1671
8261E2919M757j5014k3999K1190L3024k6401j9421L428J0278j653J7298J5561
8249G1967O043j5149p673J0521J8443n802K7532q358m3975O796o732k2181j7065
8236A4367J5801N9310K4782J6207p656J55j526J0132L7018n1954m9271J7155n234
$$ plain form
8324 154620 135436 151720 175189 193086 191690 170425 147548 159364 99562 106117 131887 140336
8312 140336 109208 100912 129857 122587 136138 129556 148928 155572 132350 135070 126631 106606 110978
8299 110978 165233 199434 154322 133639 145256 175110 174842 107738 73124 60107 47795 40001
8287 40001 54250 33145 39127 43464 68250 86889 83712 99142 125960 117571 103051 133445 98082
8274 98082 106631 100989 84057 116356 134792 86666 52014 54784 39177 48265 48628 41248 52919
8261 52919 57676 42662 18663 39853 72877 46476 27055 30483 40761 39108 56406 71967
8249 71967 78010 62861 55188 65709 84152 78350 105882 97524 53549 60345 53613 31432 14367
8236 14367 30168 89478 114260 130467 122811 122966 121440 131572 168590 116636 67365 84520 79286
8223G9286K3848O570k2450j7044j9851j963J1402j3530k2694K7122K3859L3574
8211A08129k7106J1646O836Q579J373k132r708j8481l08J9560k1602l2493J9426
8198F3719K2776k4416k5385O577K2262O6079J2583j9075K9232J0350r3406j8791
8186E2505q410O0244j1868k4842K980o233k9643N7970j289l2299p055q453j1626
8173C1981J1250m018j1723L3698J209m31J8007J9814m0518l3053j409J605L4247
8160F0659K9434j5739L0288J6752l719m6502j3920J6187l0199l7355K4441J4398
8148D4725m1361j7618J7265M3969J3880q108l2862O958M0664O4754N945n1747
8136H6464j6619k8104m5255O694J9508P172N470P708k5132l139K3978J5810j8737
$$ plain form
8223 79286 103134 109704 87254 70210 50359 48396 59798 46268 23574 50696 74555 108129
8211 108129 81023 92669 99505 108084 109457 107325 97617 79136 78828 98388 76786 44293 63719
8198 63719 86495 62079 36694 43271 65533 131612 144195 125120 154352 164702 71296 52505
8186 52505 44095 104339 92471 67629 70609 64376 34733 92703 91414 59115 52060 43607 31981
8173 31981 43231 39213 27490 61188 62397 61966 79973 99787 59269 26216 24807 26412 60659
8160 60659 90093 74354 104642 121394 117675 71173 57253 73440 43241 5886 30327 44725
8148 44725 3364 -14254 3011 46980 60860 52752 19890 26848 67512 132266 138211 86464
8136 86464 69845 41741 -3514 3180 22688 29860 35330 43038 17906 14767 38745 54555 35818
8123C5818k7181K1764J2054j4009q609j1874p225J2023R662L0461M5552L1233
8111A29669M790l5747l9704Q417K2510n6577k0167J2903K4301J0609k7298l5310
8099a604L1842N0256M842J9737J4558J1918j9034j1292K6113j009k4944j1857
8087H9526m3995k1269J4003N9267L1199n1696q096L370K6514J9732k2675O704
8075A02584M54J5554j0929m3269l6045J3233J6536J7431M8494K0752J2527l7428
8063A19894j9028j3366l065N453L7826N02J114P602K4162j0573j9662k8126O7671
8050A70404K6462O5275N7734L3491K3254k1072n7903m9449n4611j9532M3743J5701
8038B33497L1323J361k4852k048K4490J7171m5140j2423n437l2346J6378L4020
$$ plain form
8123 35818 8637 30401 42455 28446 19837 7963 738 12761 22423 52884 98436 129669
8111 129669 134459 98712 59008 67425 89935 33358 13191 26094 50395 61004 33706 -1604
8099 -1604 30238 80494 85336 105073 119631 131549 112515 101223 127336 126327 101383 89526
8087 89526 45531 24262 38265 97532 128731 77035 68939 72309 98823 118555 95880 102584
8075 102584 103038 118592 107663 64394 28349 41582 58118 75549 124043 144795 157322 119894
8063 119894 100866 87500 84435 89888 127714 128216 129330 136932 161094 150521 130859 102733 170404
8050 170404 196866 262141 319875 353366 376620 355548 297645 248196 193585 174053 217796 233497
8038 233497 264820 266181 241329 239281 263771 280942 235802 223379 217942 185596 201974 235994
8026B35994J8807K0435J6800l2461k2162J9634k51J4537Q114j0042O57K4272P558
8013C01892J7806N5238K7329j0122N2260J07067K04001J65447n351j25983j12032
8002F77552p9416r8179m3192n745o5037q0859j707O632j6971j4830j2542k483
7990B63223k3407J3674O43q5159k3742M6070K144j3165o8051o327N0490J9856
7978A76249k4835j4569J9183K9137L0299K6224O23k4656L9660R674k069j497k705
7965B60718K7263M5224l785J4700j3358J490n817m8779o2239J0499K6957k4460
7953B28413j9259K413l9342j3967r639k6151J6028K7193j1010Q04m783J0195N37
7940A61432P665J5494R476j4744l2933K314P039L459k7459k1374j1175j8576J8043
$$ plain form
8026 235994 254801 275236 292036 259575 237413 257047 256796 271333 279447 269405 270062 294334 301892
8013 301892 319698 374936 402265 392143 444403 551470 755471 920918 915567 789584 677552
8002 677552 598136 499957 456765 451020 385983 305124 303417 310049 293078 278248 265706 263223
7990 263223 239816 253490 254133 168974 145232 191302 193446 180281 112230 105903 156393 176249
7978 176249 151414 136845 156028 185165 215464 241688 242311 217655 257315 266989 264920 263423 260718
7965 260718 287981 333205 329420 344120 330762 332252 326435 277656 215417 225916 252873 228413
7953 228413 209154 211567 172225 158258 148619 122468 138496 165689 154679 155483 150700 160895 161432
7940 161432 169097 184591 194067 179323 146390 148704 155743 159202 131743 110369 99194 80618 98661
7927I8661p667K4586M3579J285k4422m1102l624K4601K003M246j3858N5822J6655
7914A80765r544l2724k8000n020N811k0976K2077M6963j8325o3279j1332L5654
7902A02070q615m3317M2512O7755l920m6799l2158k075J8948N838l2151J2598
7890H0686j8693l1078K2408M4686L827J5139K0195K157k3918m7993J6651m645
7878G9422J8902M6819O336J7828P887l0943k7688m088j3287j9851m8483j440M1458
7865G2872L2036K231l1282k0500K9653l1473m7616L8691M2521Q444m012J2098
7853A03663k1744n3576J2116M7781k3025m611K2651O718l600k0067J1070J7487
7841I4863j2656J076J5682L4483n4561L828K4075k7605N54L7341k4004L126p892
$$ plain form
7927 98661 90994 115580 159159 160444 136022 94920 91296 115897 117900 122146 108288 164110 180765
7914 180765 171221 138497 110497 105477 111288 90312 112389 159352 141027 77748 66416 102070
7902 102070 93455 50138 92650 160405 156485 109686 77528 75453 94401 100239 68088 80686
7890 80686 61993 30915 53323 98009 101836 116975 137170 139327 115409 67416 84067 79422
7878 79422 98324 145143 151479 169307 177194 146251 118563 114475 101188 81337 32854 31414 72872
7865 72872 104908 107139 75857 55357 85010 53537 5921 44612 87133 95577 91565 103663
7853 103663 81919 28343 40459 88240 65215 60604 83255 89973 86373 66306 77376 94863
7841 94863 82207 83283 98965 133448 78887 82715 106790 79185 79739 117080 93076 96202 88310
7828H8310l3187P938O322K3281j4674m0630l5608M786k4013K956Q457m993J2756
7815A701O461k8791J4310l635J5919L0398O026l9664j9927Q081K7572j3994o397
7802a940J7314O2618J8416k7037Q182L912m5162n0680K1240m2o874J3342L5744
7789D9033K6323J7365o1991k0248M1241P972m9519r962N9347J9017l3270M933
7777E0241K6426j5314j1945k5358k4632j8368J5629k4514J8558M0158N451r764
7765B6568N484N817r98j1043N369o054k174k631j9481j4994J267o346L0497j0447
7751H34L997J0658J2023L824K5496j7962L1030K2989k4727p0089Q727K0659M9152
7738G6611N5455j233k2930k0507k9154m0864L9550j2611m4577L2128K9247J3076
$$ plain form
7828 88310 55123 63061 69383 92664 77990 37360 1752 6538 -17475 -14519 -6062 -11055 1701
7815 1701 8162 -20629 -6319 -9954 5965 36363 42389 2725 -17202 -9121 18451 4457 -1940
7802 -1940 15374 77992 96408 69371 77553 81465 36303 -14377 6863 6821 -53 13289 49033
7789 49033 75356 92721 30730 10482 51723 59695 10176 214 59561 78578 45308 50241
7777 50241 76667 61353 49408 24050 -582 -18950 -3321 -27835 -9277 30881 36332 26568
7765 26568 32052 37869 36871 25828 31197 25143 22969 20338 857 -14137 -12870 -19216 11281 834
7751 834 4831 15489 27512 31336 56832 38870 69900 92889 68162 -1927 6800 27459 76611
7738 76611 132066 130833 107903 87396 58242 17378 56928 44317 -260 31868 61115 74191
7726G4191k0942L571m954L0905Q045m8000K5211k6687l1258l919K1213K290L0553
7713F0219L0027L09l1078j8809O768q05P879l5496Q876J6696N618K9254n144m2674
7699C1640k2063K3518K1340q673k4547m5144L4731K6799J01L021j4944J7950J8255
7686F1984j5008k5378K8750J9392K7542J8855l8535k5136k038l401k6913j9580
7674E34j0284n138j0827l3488L5576k035K1886N4624K7104m068j0398m495K5842
7661H4833k6429l7751k025L3712Q33j9804J3964M554k2402k4708R847j1040k6127
7648b2543j2359K2668L9031J1636q998p767N2457K24j4723k6690k285M161M777
7635C9589k1378n920J6568R07j4510J1475J7311J5651j9919L5160J0142q0290
$$ plain form
7726 74191 53249 56820 51866 82771 90816 42816 68027 41340 10082 6163 27376 29666 60219
7713 60219 90246 90555 59477 40668 47436 46631 54510 19014 27890 44586 50204 79458 74314 31640
7699 31640 9577 33095 54435 45762 21215 -23929 10802 37601 37702 40723 25779 43729 61984
7686 61984 46976 21598 50348 69740 97282 116137 77602 52466 50428 47027 20114 534
7674 534 -9750 -14888 -25715 -59203 -23627 -25662 -3776 50848 77952 73884 63486 58991 84833
7661 84833 58404 20653 18628 52340 53173 33369 47333 51887 29485 4777 14624 3584 -22543
7648 -22543 -34902 -12234 26797 38433 29435 21668 74125 74349 59626 32936 30651 34812 39589
7635 39589 18211 12291 28859 29766 15256 26731 44042 59693 39774 74934 85076 4786
7623D786o074n433J7074K3458j3919k0583J247J907l8674k746M2879P779m2755
7610c1054J1893R669J0856K5375p224k0750O3212J942O331j0957j9935j2261J4905
7597D2002m1679K4083L301J655r505l0697K300J4909J4969L3173L9597L4157l4355
7584I3910k5045n6691m7565J9657J8312o256Q991K2088j331j2950l163q269K0420
7571B2108o22l560L0455J1848N156j1968l8192l1184O430k6052L312J8916k5840
7558c9193j2633L6188J3115j1195J3474p673o96m973J3512M49k7820j040L4479
7545E994j5298l7658K2121K1740L5184k7706r420k106O3122N7038j4346l8722
7533E9943l3025O263j4087N113M733m7874k5307j7274J0763K1247j0442l132M6778
$$ plain form
7623 4786 -1288 -6721 10353 33811 19892 -691 556 2463 -36211 -38957 3922 11701 -31054
7610 -31054 -19161 -9492 1364 26739 19515 -1235 61977 63919 70250 59293 39358 27097 42002
7597 42002 323 24406 27707 29362 19857 -10840 -8540 6369 21338 54511 94108 128265 93910
7584 93910 68865 12174 -35391 -15734 2578 -3678 5313 27401 26070 13120 9957 1688 22108
7571 22108 21486 17926 48381 60229 65385 53417 15225 -15959 -9529 -35581 -32269 -13353 -39193
7558 -39193 -51826 -15638 -2523 -13718 -244 -7917 -8613 -13586 -74 375 -27445 -28485 5994
7545 5994 -9304 -46962 -24841 -3101 32083 4377 -5043 -7149 55973 113011 98665 59943
7533 59943 26918 33181 19094 24207 28940 -18934 -44241 -61515 -50752 -29505 -39947 -43079 3699
7520C699K2605J2856r234j3323k0595j174l760k6650K5673j545J7591R014k9916
7507a4759J8482N1886J7088j0264m3525J8093O055l1657m7495L479O6188K6217
7495E9788n3315k0216j917O131K1687N1791L712k7810m4480k4795J8815J9422
7483H813N598M1963n287o0288L1253N3813p440l1993k0259k0395k6736Q173J2296
7470a0489j8946m0159j8899M8147J5587K8386L7415K1611k8768r066j9444r430
7458d055L189N31K7433k288J3903n890k7253n5564Q441m634J0081L4607j8612
7445b0111J360M557N7702N015k9083j5609M4379P620l1449j3716m0538p205j7816
7432e4894L0566K4343q214k9827k1990M9008L9749K5602m303Q123M0559l4708
$$ plain form
7520 3699 26304 39160 29926 16603 -3992 -5166 -8926 -35576 -9903 -11448 6143 15157 -14759
7507 -14759 3723 55609 72697 62433 18908 37001 43056 11399 -36096 -32617 33571 59788
7495 59788 6473 -13743 -15660 -9529 12158 63949 67661 39851 -4629 -29424 -10609 8813
7483 8813 14411 56374 51087 -9201 22052 75865 68425 36432 16173 -4222 -30958 -22785 -10489
7470 -10489 -29435 -69594 -88493 -40346 -24759 3627 41042 62653 33885 24819 5375 -4055
7458 -4055 -866 -335 27098 24810 38713 32823 5570 -49994 -41553 -46187 -36106 -1499 -20111
7445 -20111 -18751 -14194 43508 48523 19440 3831 48210 55830 24381 10665 -29873 -37078 -54894
7432 -54894 -24328 15 -8199 -38026 -60016 -11008 28741 54343 50040 58163 98722 64014
7420F4014J0783L558l3757k9294K276j3997J0532l855k6084O3925J6669o493j2412
7407D5865K5632R255k0903j3656L659J0674J1739j4814m1874k5989J0124Q339
7395H051K0206J9668j7698R16K7302l99l2783L1642M283k1027K1778j0065o714
7382D5160J3338J2942k0122R480J4324m1897m5890M0216k2529k7925J595l74M6396
7369B4714L1324J4109l3881n6614k5085m4551l244R764m571J0815j1271L8810
7357d9681j4492L9088N6589N7566J7988J1976j1161k6801l2217k0047L785K8461
7345F1054Q941J8489N66j8641R527l6383j4924j2629Q742K6342K3964J6983k8089
7332F3942l3965n789l3691n5833K8280J4663k7622oL8055Q67O616J9908N66K4633
$$ plain form
7420 64014 74797 78355 44598 15304 17580 3583 14115 10260 -15824 48101 64770 58277 45865
7407 45865 71497 80752 59849 46193 49852 60526 72265 57451 15577 -10412 -288 8051
7395 8051 28257 47925 30227 31143 58445 58046 25263 56905 61188 40161 61939 51874 45160
7382 45160 58498 71440 51318 60798 75122 33225 -12665 27551 5022 -22903 -21308 -21682 24714
7369 24714 56038 70147 36266 -20348 -45433 -89984 -93228 -83464 -88035 -77220 -88491 -49681
7357 -49681 -64173 -25085 31504 89070 107058 119034 107873 81072 48855 28808 32593 61054
7345 61054 69995 88484 89050 70409 79936 43553 28629 16000 24742 51084 75048 92031 63942
7332 63942 29977 24188 -9503 -65336 -37056 -22393 -50015 -50021 -11966 -11099 -4483 15425 15991 40624
7318D0624j703j3124J4416m7235l6286M4789J5396J3165L652Q77k0030l7666k8856
7305e1981J2045j0717L062N689k3073j9600N5479N5819j4421m0775J9071Q015
7293a387P6895J002m1735k869M279l8266l60p849J5107r246k8785j9888k8010
7280h1112K9711K3132J5738J7903K5337j2909k4899N804j81M810K9876J1604o1015
7267a6201j2579K3792K1576K1373N152K5309L3780R901k7573k3267R626j7880
7255E3009l6442l531R395J7584l1590o308j1351k9905j722J3550M666N6268L3890
7242F7513m4075k3006L4805J7567l3741o8780J6850N2494L199K916Q625O439j6273
7229B4533k9806j7479m403j0084J5470P246j0264K6869L8959o618L6121O192K8329
$$ plain form
7318 40624 38921 25797 40213 -7022 -43308 1481 16877 30042 33694 34571 14541 -23125 -51981
7305 -51981 -39936 -50653 -47591 -41902 -64975 -84575 -29096 26723 12302 -28473 -9402 -1387
7293 -1387 75508 76510 34775 31906 36185 -2081 -2441 -10290 4817 -4429 -33214 -53102 -81112
7280 -81112 -51401 -28269 -12531 5372 30709 17800 -7099 -1295 -1476 3334 33210 44814 -16201
7267 -16201 -28780 -4988 16588 37961 43113 68422 102202 112103 84530 61263 70889 53009
7255 53009 16567 13036 22431 40015 8425 2117 -9234 -39139 -40861 -27311 -22645 33623 67513
7242 67513 23438 432 35237 52804 19063 -49717 -32867 19627 22826 25742 34367 40806 24533
7229 24533 -5273 -22752 -27155 -37239 -21769 -14523 -24787 2082 41041 34423 70544 76736 105065
7216A05065k087k1881l6115K1800l4564n287j610k3816n170K4665J1734J5883
7204D8617j0865j6665J8131K2772K1433N4530k9498n3221L376N0503M4804m1057
7192A12860m5658K5991m085j9869j3007k4028O980q698k6002m5832j3157M7266
7180g239j2201K2799N5403K430m4724k9224K6643K0719k4467k9820L3500M6034
7168E9853k8113l9276K7254K9328m6453l3330l7903p258M2440M1104r314J7404
7156A5736L693J7473m6332j7169N0393J6973j7511r320L5941l6102R083J6333
7144C9191j0445m0593k5886K4575J4643k9176k4607O583j9672L4338M2714M629
7132A6294j8857L1770K2387K6803k0728k0461l8454k4008J5413M5626k5553k7741
$$ plain form
7216 105065 102978 81097 44982 66782 32218 26931 25321 1505 -3665 21000 32734 48617
7204 48617 37752 21087 39218 61990 83423 137953 108455 55234 58610 109113 153917 112860
7192 112860 67202 93193 89108 69239 56232 32204 39184 30486 4484 -41348 -54505 -7239
7180 -7239 -19440 3359 58762 61192 16468 -12756 13887 34606 10139 -19681 13819 59853
7168 59853 31740 -7536 19718 49046 2593 -30737 -68640 -75898 -33458 7646 -1668 15736
7156 15736 19429 36902 -9430 -26599 23794 40767 23256 13936 49877 13775 22858 39191
7144 39191 28746 -11847 -37733 -13158 1485 -27691 -52298 -45715 -65387 -31049 11665 16294
7132 16294 -2563 29207 51594 78397 57669 37208 -1246 -25254 -9841 35785 10232 -17509
7120a7509J1970k1772m299J0168q477K946l9733O4626K3774l751J21j8006k6768
7107b6710o874L4593L0927R324l5268l3545L623J3269M4197K0282m0135O5160
7095G8843l333p1510k5566L8975J9296k3058k1214P626o865J5189j4183J2288
7083F488M6539J3600m3306k7205n988p321L0705O013j2874N9386K2172k1139K575
7070F9645l1792J2236p284n062J3904j671k3972j2865l4688k1535L3632K184l501
7057a0769L5059K4955k0217l6063j2572n7229j0991K2523J2570k7614K6088J7238
7045c7022J3070J199L092K438p530O600K0759J4947j2305P234J0977j1237J8737
7032C0959M0699j0419l5027k6127N52k7788j4648K423J2721K7097J2528R863J1239
$$ plain form
7120 -17509 -5539 -27311 -31610 -21442 -29919 -26973 -66706 -2080 21694 17943 18064 58 -26710
7107 -26710 -33584 1009 31936 41260 5992 -27553 -23930 -10661 33536 53818 13683 78843
7095 78843 75510 4000 -21566 17409 36705 13647 -7567 59 -6806 8383 -5800 6488
7083 6488 53027 66627 23321 -3884 -9872 -17193 13512 19525 6651 66037 88209 67070 69645
7070 69645 37853 50089 42805 37743 51647 49976 26004 13139 -21549 -43084 -9452 -7268 -10769
7057 -10769 24290 49245 29028 -7035 -19607 -76836 -87827 -65304 -52734 -80348 -54260 -37022
7045 -37022 -23952 -22753 -19661 -17223 -24753 -18153 2606 17553 5248 12482 23459 12222 30959
7032 30959 71658 61239 26212 85 637 -27151 -41799 -39376 -26655 442 12970 22833 34072
7019C4072k4749k9275l208J6211j8307L9353J1512p546m4038n0773J3259J5927
7007d7562L4262M8040j2448N031j2130L5544K809k8652l7239j8515K0721K2585
6995A2446R183L4001L4037k2990l4815n3378J039L4464Q738M091J0602m079o904
6982B6435j3011j9040k0363N448K6976j6969q50j6952k6030J7060N5501l1858
6970a3653O849m100k9471r22J5054M1800J5288L6299j0829l9176K5066J8715P580
6957F8500l7676l5741Q419j522j7572N757N4697j258j7109k0208n014K644K0560
6944B4477j7022k7325M408M4144L9064N353J4575k9431k5634l1498J2851M7553
6932F1515l4071m2947q58K5460K7832J7558q202r2k1339j4077j0984q237N5574
$$ plain form
7019 34072 9323 -19952 -23160 -6949 -25256 14097 25609 18063 -25975 -76748 -63489 -47562
7007 -47562 -13300 34740 22292 27323 15193 50737 53546 24894 -12345 -30860 -10139 12446
6995 12446 21629 55630 89667 66677 31862 -21516 -20477 13987 22725 26816 37418 33339 26435
6982 26435 13424 -5616 -25979 -20531 6445 -10524 -11374 -28326 -54356 -37296 18205 -13653
6970 -13653 -6804 -10904 -40375 -41297 -26243 15557 30845 67144 56315 17139 42205 60920 68500
6957 68500 30824 -4917 3502 1980 -15592 -9835 44862 43604 26495 6287 1273 3917 24477
6944 24477 7455 -19870 -15462 28682 67746 73099 87674 58243 32609 1111 13962 61515
6932 61515 27444 -15503 -16361 9099 36931 54489 46287 46195 24856 10779 -205 -8442 47132
6919D7132k3518m3835K340M8981j4110o4010N066O1669J8645K5443K250k0439
6907D5614l5706k378N865K1914Q995p6098l4945R128R730J2398J0553J4062J0012
6894h56j8749J4905K2687m367l1972m7333N3670K9472k5206K1272L843l4886k5478
6881d2998N722j283L9892J4589p81J9627J7791k1479j1569k4091m9635K5826j921
6868c0310j2539K648k572m18J3702M4954Q951l2996j9011m7744k1381J2421M0161
6855d4134j0860J9834M9397n488p409K9672M142j5237k0734J0282J4045k6112
6843b602j9900J5988J2776L1495N048l9552o5909J5511M3144J0166N355J6837
6831B8357L9416l2524k8679J6256m353l8850J0399l3588m081q529L9229N7402
$$ plain form
6919 47132 23614 -20221 -17881 31100 16990 -47020 -41954 19715 38360 63803 66053 45614
6907 45614 9908 7530 13395 35309 44304 -31794 -66739 -57611 -47881 -35483 -24930 -10868 -856
6894 -856 -19605 -4700 17987 13620 -18352 -65685 -12015 17457 -7749 13523 17366 -17520 -42998
6881 -42998 -37276 -38559 1333 15922 15141 34768 52559 31080 19511 -4580 -54215 -28389 -30310
6868 -30310 -42849 -40201 -42773 -43191 -29489 15465 24416 -8580 -27591 -75335 -96716 -84295 -44134
6855 -44134 -54994 -35160 14237 8749 1340 31012 35154 19917 -817 9465 23510 -2602
6843 -2602 -22502 -6514 6262 37757 42805 3253 -62656 -47145 -4001 6165 11520 28357
6831 28357 67773 35249 6570 22826 18473 -20377 -9978 -43566 -47647 -56176 -16947 40455
6819D0455K3465L170j5632o0537k7220Q529K8190j5275K0859L6640m459n2616
6807a4431l184M3003J7262k0005j032K7159L989p903L2464p946N194J620q842
6794F7348m1384r917k4148l2413M365K4309K1233J5404q049J1480J5308M612m7851
6781B97l4947k4892l7507K3948J6622J126k772R636K4476R928K8866M4M5068Q856
6767F8749k5290J9181q988j5003Q703l0265l1341M642J8602J9060L6820l5033
6755B9837j8602K8260j8602j6583M184L9312P1856l1185r897N807m5890m0189
6743a692r234K7945L5663k2373k0129J4764K405L2037M9903M0564m4260m3350
6731F2243J0415M3692P9413N3060J34113J81741L73159N65200O09617J64172n44600
$$ plain form
6819 40455 63920 67090 51458 -9079 -36299 -27770 420 -14855 6004 42644 38185 -14431
6807 -14431 -17615 25388 42650 22645 21613 48772 52761 44858 77322 69376 74570 76190 67348
6794 67348 25964 16047 -8101 -40514 -36149 -11840 9393 24797 16748 28228 43536 48148 297
6781 297 -34650 -59542 -97049 -73101 -56479 -55353 -58125 -48489 -24013 -14085 14781 14825 59893 68749
6767 68749 43459 62640 53652 38649 47352 17087 -14254 -9612 8990 28050 64870 29837
6755 29837 11235 39495 20893 4310 8494 47806 119662 88477 78580 84387 38497 -1692
6743 -1692 -10926 17019 52682 30309 10180 24944 27349 59386 109289 149853 105593 62243
6731 62243 72658 116350 195763 248823 382936 564677 937836 1503036 2112653 2276825 1732225
6720A732225o25142m07138k10082j71591j03845l4423p926l412J7728m128n7983
6709A24283l3221k3684j0078L8490J9916L519l5592k3524K0171p833M924p266
6697G0105j4747L4437k6158l6318j0915k0062p054P225j526j6567M7075J477J6156
6684D3128j6991J1673J0779o14j1910j7665K9424J0077m682j3797n698r17k277
6671C0530N951k7707j0886j746k0422J944K7652M5084l2784m3112K2138r247L544
6658i061N878j7256k6108P907K6603K6617O5574M0920j1784m4526j2219j3488
6646C9057n854j1567k0270r446M463n723j5930M4774L9826J2797p878k3387k9740
6633A1122J3449j501k5232p993M711J0188J5182q852N5941l235k5122R844L75
$$ plain form
6720 1732225 1107083 699945 489863 318272 214427 180004 172078 168666 186394 182266 124283
6709 124283 91062 67378 57300 95790 115706 119225 83633 60109 80280 72447 77371 70105
6697 70105 55358 89795 63637 27319 16404 -3658 -10712 -3487 -5013 -21580 25495 26972 43128
6684 43128 26137 37810 48589 47975 36065 18400 47824 57901 53219 39422 33724 32807 30530
6671 30530 36481 8774 -2112 -3858 -24280 -22336 5316 50400 17616 -25496 -3358 -12605 -9061
6658 -9061 -3183 -20439 -46547 -38640 -12037 14580 80154 121074 109290 64764 52545 39057
6646 39057 33203 21636 1366 -8080 -3617 -9340 -25270 19504 59330 72127 64249 40862 11122
6633 11122 24571 23070 -2162 -10155 -5444 4744 19926 11074 67015 63780 38658 48502 48877
6620D8877j2125M05j7683p511k1962J4266L5437k3548J3773j7306j1061L1597
6608C3159Q99K188J2091m2431j9225m0759K4307K7125J2468j3578J8598L5542
6596E0384J2214J9571M997m6063m9295k0881J6824p720j2535j5175J0591K7933
6584i155J0174j3508K2674Q258L7791K5723m4435m7054Q649M319k677K7322m0278
6571a2197k2505K2482L5680J2885o962q009n744m121M6935K6642m2842r57k5511
6558A5776l94j7389J0818N130o513K4633j4031n771m3683p497J8366J7771k1179
6545b3963l3072L1873p748j5258J4643N8366K8632l7730l383j1436k0957J668
6533a8365M4960O84l094j7347j5436o978M646L7188O3360r886k9902j3862M9097
$$ plain form
6620 48877 36752 37157 19474 11963 -9999 4267 39704 16156 29929 12623 1562 33159
6608 33159 34058 36246 48337 5906 -13319 -54078 -29771 -2646 9822 -3756 14842 50384
6596 50384 62598 82169 87166 41103 -8192 -29073 -12249 -19969 -32504 -47679 -37088 -9155
6584 -9155 1019 -12489 10185 18443 56234 81957 37522 -9532 -883 3436 759 28081 -12197
6571 -12197 -34702 -12220 23460 36345 29383 21374 15630 11509 58444 85086 42244 41287 15776
6558 15776 15382 -2007 8811 13941 7428 32061 18030 12259 -31424 -38921 -20555 -2784 -23963
6545 -23963 -57035 -25162 -32910 -48168 -33525 24841 53473 15743 12360 924 -20033 -18365
6533 -18365 26595 27279 24185 6838 -8598 -15576 -10930 26258 89618 79732 49830 35968 85065
6520H5065J0995l2134m7285l937K585K3353k6884n642J8213l1546n6808j3714
6508g7739N4239J9812J0715j183R72l282K0565J8938j3917j5158l8204N728j0215
6495b8729J6122j3750O022k3851n838L1571j3987J4824J4643L7422L2583j1773
6483E5259j3117j4235m879R151n127m7933J9071J2830J9103l0260l682M3264K7173
6470F6618l6357m0227l0603K8836N4257j846k4660K4369L2260j6898k7020j4549
6458A4180p87M2173L7513N059l5007P129k9209p442n999K1685m5634j952J8929
6445B0638K474j1617l1341j9762M723K7534p943n3700J4928M2123K8650M688l1315
6432i920r705O363k0500l657K4139R333k8073k7076K1431L911k2072M3209K9556
$$ plain form
6520 85065 96060 63926 16641 12704 15289 38642 11758 6116 24329 -7217 -64025 -77739
6508 -77739 -23500 -3688 7027 5844 6816 3534 24099 43037 29120 13962 -24242 -18514 -28729
6495 -28729 -12607 -26357 -20335 -44186 -50024 -18453 -32440 -17616 -2973 34449 67032 55259
6483 55259 42142 27907 23028 32179 27052 -20881 -1810 11020 30123 -137 -3819 39445 66618
6470 66618 30261 -9966 -40569 -11733 42524 40678 16018 40387 72647 55749 28729 14180
6458 14180 13393 55566 93079 98138 63131 70260 41051 33609 27610 49295 3661 1709 20638
6445 20638 23112 11495 -19846 -39608 -34885 -7351 -15294 -68994 -54066 -11943 16707 21395 -9920
6432 -9920 -19625 -13262 -33762 -37419 -13280 -3947 -32020 -59096 -37665 -33754 -55826 -12617 16939
6419A6939L7454J587m7236L5318p665L099o410j0670j5549P551M1607O917N579
6406F8521k4703K3351J5675j2197j2387m734l2327l1159O954J5796N0901P761
6394G1452j8601m3107p951M3175K2984p31Q12o986J4723j4189m0691j0568K6031
6381C6353l037J1551q038l9687N904L960j3342N191K9988J8125J296p053J2425
6368E3636l7079m122j4432k945J9230R449J2849O154K3178j2177k3989l990j8463
6355G299l938K6366N0846j2155P528l1799j0952K3219K4575K4532K641l9518n139
6342F3505K132L9372L0637l5070k5990l620j3582q220J0194n2239k6747k0021
6330c9649m0958k1407K6570P289J0486L8249J8991J1976N5431R999l0810K277
$$ plain form
6419 16939 54393 55980 8744 44062 36397 39496 33086 22416 6867 14418 56025 62942 68521
6406 68521 43818 67169 82844 70647 58260 53526 21199 -9960 -3006 12790 63691 71452
6394 71452 52851 9744 1793 44968 67952 67221 68033 61047 75770 61581 20890 10322 36353
6381 36353 33316 44867 36829 -2858 3046 7006 -6336 -1145 28843 46968 48264 41211 53636
6368 53636 16557 12435 -1997 -4942 14288 23737 36586 42740 65918 53741 29752 25762 7299
6355 7299 3361 29727 80573 68418 75946 44147 33195 56414 80989 105521 108162 68644 63505
6342 63505 65637 105009 135646 100576 74586 70966 57384 49164 59358 7119 -19628 -39649
6330 -39649 -80607 -102014 -75444 -68155 -57669 -19420 -429 11547 66978 76977 46167 48444
6318D8444L439j7917m2113R831Q294J6545l223k8774J4115J1930k4726P72j4892
6305a8275j7481r824K2555j2913M946O9532L4828k8907l9708jK2185L7258j7997
6292D6198o3410l4702l6168K8965K9965L8841J1532J7824j8002M403K1540q251
6280C8735j8022l3003n885J1245j2109L9453K7705J6725l2045K3119R628j6668
6268D8878l4788M634K007j2181k0015j5767O621L1277l6836k7222R692J6380L7510
6255A0190K2586m2432m3341j0028K7914K8177M962n1280j7748q909J9692O2019
6243A802Q793j1218l1669n5524L4025N6221K1183M019J0532k7155r150R84K7535
6230C0378j653m3963m159M6319N557l8313o3948O199o546K9086J9566j3004K5773
$$ plain form
6318 48444 51883 33966 -8147 1684 9978 26523 23300 -5474 8641 20571 -4155 -3383 -18275
6305 -18275 -35756 -45580 -23025 -35938 -30992 38540 73368 44461 4753 4752 26937 64195 46198
6292 46198 -17212 -51914 -88082 -59117 -29152 9689 21221 39045 21043 25446 46986 38735
6280 38735 20713 -12290 -18175 -6930 -19039 20414 48119 64844 32799 55918 65546 48878
6268 48878 14090 18724 20731 8550 -11465 -27232 -20611 10666 -26170 -53392 -43700 -27320 10190
6255 10190 32776 -9656 -52997 -63025 -35111 -6934 -1972 -53252 -71000 -79909 -60217 1802
6243 1802 10595 -623 -32292 -87816 -53791 2430 23613 27632 38164 11009 1859 2843 30378
6230 30378 28725 -15238 -19397 26922 32479 -5834 -69782 -63583 -70129 -41043 -21477 -34481 -8708
6217h708M2435L6442J5643k3534P282K3484k9870j5078l8688m3906j0075n778
6205e0351L818L0632R743l5378L464o814j3074L8044L43J0813L1606J662j1363
6192A3145j1632J8917Q60k3293k201K1459J696k176P055o4604m0797K3139K6888
6179c1544L3967O9042k1305j2913M7172j6403k4785M096P161J7039j5479k864
6167E3184p045K4819k4615K2036J0493o1914k6461L4543l9489l7649L4408k292
6155a9982k1842L155L0709j064l0697n3188m236K8309K6043J3222l609J1906L1625
6142A0351P115m961j4413K9219J8771J6458N79k9330m8033j8576j7024k9516k5019
6129a04379J7635P6110o635l111L65n766J7798K24j8636o486k4637j7918N3165
$$ plain form
6217 -8708 33727 70169 85812 62278 69560 93044 63174 48096 9408 -34498 -44573 -50351
6205 -50351 -46533 -15901 -6158 -41536 -38072 -44886 -57960 -19916 -19573 -8760 22846 24508 13145
6192 13145 1513 20430 21290 -2003 -4204 17255 18951 16775 23830 -40774 -81571 -58432 -31544
6179 -31544 2423 71465 50160 37247 84419 68016 43231 47327 54488 71527 56048 53184
6167 53184 46139 70958 46343 68379 78872 16958 -9503 25040 -14449 -52098 -17690 -19982
6155 -19982 -41824 -38669 -7960 -9024 -39721 -92909 -97145 -68836 -42793 -29571 -33180 -21274 10351
6142 10351 17466 12505 -1908 27311 46082 62540 63119 33789 -14244 -32820 -49844 -79360 -104379
6129 -104379 -86744 -10634 -17269 -20380 -20015 -25781 -7983 -7759 -26395 -32881 -57518 -75436 -22271
6116b2271L8779J3770J9697k6564p960M67K1742q915j0170J1734K691j307j2970
6103A8723j3167K4628J9140n980l5982k7726L543M9513J0182m3489r479J346K4575
6090A5827L9437J075m9849K8338M6370r539k2409k0125l432L2838k7651o721Q698
6077C2857R928o426j984J0358j0728l2248L2552J3020m6306k3563k992K3870M419
6064B757M625j7885j8754M2779R789K2866j1115j1845k7495r738K353L7456j4312
6051A1481m1523j8562k4584o503M0786K2598O495Q503J6809J8605o828j5930J7072
6038B8419L9960l6673o2566j369K2824J5593j5935k4103J0665L814O685J9170
6026F484k5181l6607K1204K9334k668k1686j4852M3681K5336j4708K9430P092
$$ plain form
6116 -22271 16508 30278 49975 23411 15451 15918 37660 28745 18575 30309 33000 31693 18723
6103 18723 5556 30184 49324 43344 7362 -20364 -16821 32692 42874 -615 -10094 -8748 15827
6090 15827 55264 56339 6490 34828 81198 71659 49250 29125 25693 58531 30880 24159 32857
6077 32857 42785 36359 34375 44733 34005 1757 34309 47329 1023 -22540 -25532 -1662 2757
6064 2757 7382 -10503 -29257 13522 23311 46177 35062 23217 -4278 -14016 -11663 25793 11481
6051 11481 -30042 -48604 -73188 -79691 -38905 -16307 -9812 -1309 15500 34105 27277 11347 28419
6038 28419 68379 31706 -30860 -32229 -9405 6188 -9747 -33850 -23185 -19371 -12686 6484
6026 6484 -18697 -55304 -34100 -4766 -7434 -29120 -43972 -291 25045 10337 39767 46859
6014D6859l5794o931K6464j5172l0571l930K3948L5030K4753j7094j1785j6742
6002A9035k4068j2309j1812m7341l700o18M0361K5952J3621L1197Q220m1717j0421
5989a3600n306j8981M9739K6492J705l2581l8867J9295L3426j0280K5297K5629
5977F1968K5644O877P20m6616j5572J1690q480J4857k8582j7835j619k163n4319
5964e3430L8528M1977L4291J1920K6219j8520l0775k1192J3592j7920n1934r137
5952c6381j2445k6481L7818J7109L1622K632L0500j4592j7743K1714l1418J573
5940C908j2022q973Q864L6018k9765j5997k957Q493j0095m0433l006O8806J0025
5927A2866l0161M586o187k7183j0503L1133N9213k2061q660J6869P883l3238k5446
$$ plain form
6014 46859 11065 4134 30598 15426 -15145 -19075 4873 39903 64656 47562 35777 19035
6002 19035 -5033 -17342 -29154 -76495 -80195 -80813 -40452 -14500 -879 30318 38538 -3179 -13600
5989 -13600 -18906 -37887 11852 38344 40049 7468 -31399 -12104 21322 11042 36339 61968
5977 61968 87612 94489 95209 48593 33021 44711 36231 51088 22506 4671 3052 889 -53430
5964 -53430 -14902 27075 61366 73286 99505 80985 50210 29018 42610 24690 -27244 -36381
5952 -36381 -48826 -75307 -37489 -20380 11242 13874 44374 29782 12039 33753 2335 3908
5940 3908 -8114 -17087 -8223 27795 -1970 -17967 -20924 -12431 -22526 -62959 -65965 2841 12866
5927 12866 -17295 -12709 -18896 -46079 -56582 -25449 33764 11703 3043 19912 27795 -5443 -30889
5914c0889M6926K6261J1100l588k3519p635o780J6500L8357q353Q72k6k2228j3200
5900B3798R665l2370L514J6258R190J2376k1088M421m4241j9270J0707O1467K8465
5887F2892M5988J877j9859j2152r860j4724j8115P328K704m1856K0140K6114l9149
5874A1328l4738n402j59J1757n958O686L2148P3228j2917n6441o8924J537M3815
5861d040M517k0034j8903j4339K6464N0907J6631k0807j9926j6520J8436J2945
5849A5331k5660o614p658J3315r230m9669K9900M1740O198p032n965l6794Q967
5836c3171O0166p279m946n2854k8275l793J8717k0006j9342K3379P4410l1925
5824b4919n5590L6162J1121m8694J9741J0123o133M2269K4125J848j9597K8511
$$ plain form
5914 -30889 16037 42298 53398 49810 26291 18656 11876 28376 66733 58380 59252 59226 36998 23798
5900 23798 33463 1093 4607 20865 30055 42431 21343 25764 -18477 -37747 -27040 34427 62892
5887 62892 108880 110757 90898 78746 68886 54162 36047 43375 46079 4223 24363 50477 11328
5874 11328 -23410 -28812 -28971 -17214 -23172 -16486 15662 88890 75973 19532 -49392 -47855 -4040
5861 -4040 477 -19557 -38460 -52799 -26335 24572 41203 20396 470 -16050 2386 15331
5849 15331 -10329 -16943 -24601 -11286 -20516 -70185 -40285 1455 7653 621 -5344 -42138 -33171
5836 -33171 26995 19716 14770 -38084 -66359 -70152 -51435 -71441 -90783 -67404 7006 -24919
5824 -24919 -80509 -44347 -33226 -81920 -62179 -52056 -58189 -15920 8205 10053 -9544 18967
5812A8967k4239l6049J2366J8850l8804m9006L3550K6783j1762K9241L5157N881
5800B0935k9871j0617k3022J3771Q694J11l0843k0311K4377R316J1294K7588J6978
5787A8400j2308q803j2979p067M0477k460n7723r557M0608M1655K9284L2833o1995
5774C0365l4294k1461j3000K9864K7276j9187n609K6962N9793j6168j1153j6346
5762C7042n0830l665j4114K1263K5424J155J2560p9767k6645L3954L2071j393
5750a2945K3361J3075L5732j7548j2651J9284R952R350j8015k1904l9112L1396
5738A9975j925k1181L1045J7495l0757r011o731m0554m1057k4909l674J9361M5557
5725d6366M8792J5160j0283J543j8385l2688k2853N4484L7692r425l1878J7674
$$ plain form
5812 18967 -5272 -41321 -28955 -10105 -48909 -97915 -64365 -37582 -49344 -20103 15054 20935
5800 20935 -8936 -19553 -42575 -28804 -20110 -19999 -50842 -71153 -46776 -37460 -26166 1422 18400
5787 18400 6092 -2711 -15690 -22757 17720 15260 -42463 -52020 -11412 30243 59527 92360 30365
5774 30365 -3929 -25390 -38390 -8526 18750 -437 -6046 20916 80709 64541 53388 37042
5762 37042 -13788 -17453 -31567 -10304 15120 16275 28835 -50932 -77577 -43623 -11552 -12945
5750 -12945 10416 23491 59223 41675 29024 48308 58260 67610 49595 27691 -11421 19975
5738 19975 18050 -3131 27914 45409 14652 5641 -1090 -41644 -82701 -107610 -111284 -91923 -46366
5725 -46366 2426 17586 7303 8846 -9539 -42227 -65080 -10596 27096 17671 -14207 3467
5713C467L1604O747j0978j6163L4532K130n4728K897j8432N481K1956k494j9063
5700a3044J0263M7810q452l4151l6j8813j8796N015K4955N498R549j1832j5810
5687a7844O194k939j1596k7516N1515L1272j8878r221r605J3377L3449J0966L9231
5674H8405N2163o7659p4664o499j1067J4569M0405M4269J204j3972K5406J0486
5662A03046Q52J2703k7710p0611k0200L0996r431J8026K5526j6117k4706k2112
5650B62j2049l6819o2925l1675M8035M5380K9500J5655l3281L9222J0686N28R596
5637B2115n4628J6726L988K484j4899o973l1821j8641L3117M6331J7097K5009
5625C9905K364m1361j5918J1691j0827j4299M6183O2453m913k8052n321M01k2082
$$ plain form
5713 3467 35071 41818 30840 14677 49209 51339 -3389 -492 -18924 -13443 8513 6019 -13044
5700 -13044 -2781 45029 36577 2426 2390 -16423 -35219 -30204 -5249 249 9798 -2034 -17844
5687 -17844 -11650 -14589 -26185 -53701 -2186 29086 10208 987 -8618 4759 38208 49174 88405
5674 88405 140568 72909 -1755 -8254 -19321 -4752 35653 79922 81126 67154 92560 103046
5662 103046 103898 116601 88891 18280 -1920 29076 19645 37671 63197 47080 22374 262
5650 262 -11787 -48606 -111531 -143206 -95171 -49791 -20291 -4636 -37917 1305 11991 12519 22115
5637 22115 -32513 -15787 -11799 -9315 -24214 -31187 -63008 -81649 -48532 -2201 14896 39905
5625 39905 42269 908 -15010 -3319 -14146 -28445 17738 80191 75278 47226 41905 42306 20224
5612B0224n8212r728o263o545r321K7379M3685J3145k2824P17J1707L1083K824
5599C7871k0648j6346l9090q1305k966O9221N3505R877m4L9856j5499k5270N802
5586A4964k390P2J3038l3525m6392K112N7734K8660j1152j7261Q647N000r467
5573A0040j8427M253Q885n901K4141k3928P345J5056L4337L1879n773j3869j2826
5560E5212j9865L338J7880j0599j374j1340k3653q905O810q8803K2031M6871J36
5547a2261o610K5162o09K1875l431J4212k4656m361N4313L620k2358L0850N674
5534H1420k1902j3502J7916J2450j4015m0199J473L2009m4143m0619m573M8924
5522A5239J1788K3618K01L340r650n4709O80J270K5880j7623J0572J3190L0960
$$ plain form
5612 20224 -37988 -47716 -53979 -60524 -69845 -42466 1219 14364 -8460 -7743 3964 35047 37871
5599 37871 17223 877 -38213 -119518 -122484 -53263 242 10119 10075 49931 34432 9162 14964
5586 14964 12574 12646 25684 -7841 -54233 -52121 5613 34273 23121 5860 14507 19507 10040
5573 10040 -8387 -4134 4751 -1150 22991 -937 6408 21464 55801 87680 81907 68038 55212
5560 55212 35347 38685 56565 45966 44592 33252 9599 694 7504 -81299 -59268 -12397 -12261
5547 -12261 -18871 6291 5682 27557 24126 38338 13682 9321 63634 67254 44896 75746 81420
5534 81420 59518 46016 63932 76382 62367 22168 23641 55650 11507 -29112 -33685 15239
5522 15239 27027 50645 50846 54186 44536 -10173 -9493 -8223 17657 34 10606 23796 54756
5509E4756J0621l8102j9549M450j4185k5149M0890N798L2844J2026k5008m8486
5497i094N108N652J5145j0469m1295k383l390K4536L6943n677l1273j8159J2631
5484b1725K1254q17M0698M006n8997k4722P301K195J5418N4358j8361k9226k3034
5471c1652K4459R953J9704J2150j5058j6816p458R979K3842R538J0668L0008j2495
5458F6822k2408n44m2721K422K9038L696k1571j0786k3691m2264p597J6265K4361
5445b8978L2366p730j5971l9683j3886o662K2155L5257O466J827O271K7396J0385
5432B9213k381j6718j423J9608J826m049K22L674O23m38l4329J6145O006j2558
5418E421j2641K8799J6232K9766l4604o6902j0867K7730k3310O2K7311l4214J9415
$$ plain form
5509 54756 65377 27275 7726 12176 -2009 -27158 13732 19530 52374 64400 39392 -9094
5497 -9094 -3986 1666 16811 6342 -34953 -37336 -40726 -16190 20753 15076 -16197 -34356 -21725
5484 -21725 -471 -1288 39410 43416 -15581 -40303 -33002 -30807 -15389 38969 20608 -8618 -31652
5471 -31652 -7193 2760 22464 34614 19556 2740 -4718 5261 29103 38641 49309 79317 66822
5458 66822 44414 43870 1149 3571 32609 36305 14734 3948 -19743 -62007 -69604 -53339 -28978
5445 -28978 3388 -4342 -20313 -59996 -73882 -80544 -58389 -23132 -16666 -14839 -8568 18828 29213
5432 29213 26832 10114 8691 28299 30125 26076 26298 29972 30595 30157 -4172 11973 17979 5421
5418 5421 -7220 21579 37811 67577 32973 -33929 -44796 -17066 -40376 -40314 -13003 -47217 -27802
5405b7802K0868N942K797q923p935l5736K1750L5296M1841l222o2991n3691Q271
5392f3535N8351M6276J8053M8370Q89k3963l4323k2247J9037j4125j6406m0777
5380b4400k2860O179J4417K3588J131j1347j5354k0700j7495j7010q609M4821
5368d7639P118L348j3065M380J1617p118L87r771R181J4855L6239J3830k1655
5355A707K316j9922J3573J4649j2856m3579j231o18K1144k2732K2628p646L1843
5342g24R368k5973J1794k6130n453O8064j2098m9494L578r910j1080r016N3736
5329c338M2028j5641N027n301j0460K709J7338j9886k1543L1820J1069j8286k8192
5316a2656J5997k534J5496K9396l81j0106K0110l0753n5241l127n688M853N604
$$ plain form
5405 -27802 -6934 -992 1805 -7118 -15053 -50789 -29039 6257 48098 44876 -18115 -71806 -63535
5392 -63535 -5184 41092 59145 107515 108404 84441 50118 27871 46908 32783 16377 -24400
5380 -24400 -47260 -41081 -26664 -3076 -1945 -13292 -28646 -49346 -66841 -83851 -92460 -47639
5368 -47639 -40521 -37173 -50238 -45858 -34241 -41359 -40972 -50743 -41562 -26707 9532 23362 1707
5355 1707 4023 -15899 -2326 12323 -533 -44112 -45343 -45961 -24817 -47549 -24921 -32567 -724
5342 -724 8644 -17329 -5535 -31665 -37118 30946 18848 -30646 -27068 -36978 -48058 -57074 -3338
5329 -3338 38690 23049 28076 22775 12315 15024 32362 12476 -9067 22753 33822 15536 -12656
5316 -12656 3341 807 16303 45699 45318 35212 55322 24569 -30672 -33799 -39487 -34634 -29030
5303b9030Q815N6304J5399j0807K6563p324l3083r13R374L839r409J5614j4439
5290C0903J214m570l6494m2244O899K5713k145K298q875k2501M7127R060j2319
5277e934M393N818j2103k5708j4940l8349P687M8590J7777L6714J4509j5473k938
5264B0043J4215N6k1794j1799J5244k3623m620j6697o517M3828J1086q5685j4845
5251h1108J6677M7714L0922m095m2372j4356k7106j5481K8885R096L2843J1498
5239f883R134q406N132l2285j0383o842K1608K3521L0864j2429l7269M206K4449
5226D417l5680j1460M9056N9228j7229l8024m62j7334J1951j1745q617J4089j0356
5213a2166L6444J9867j9870M481L2021J2573p0741r853J6941M387P84K2442j4162
$$ plain form
5303 -29030 -20215 36089 51488 40681 67244 59920 26837 25924 35298 39137 29728 45342 30903
5290 30903 32117 27547 -8947 -51191 -44292 -18579 -20724 -18426 -27301 -49802 -2675 6385 -5934
5277 -5934 -1541 4277 -7826 -33534 -48474 -86823 -79136 -30546 -12769 23945 38454 22981 20043
5264 20043 34258 34314 12520 721 15965 -7658 -12278 -28975 -35492 8336 19422 -66263 -81108
5251 -81108 -64431 -16717 14205 10110 -32262 -46618 -73724 -89205 -60320 -51224 -18381 -6883
5239 -6883 2251 -6155 -1023 -33308 -43691 -50533 -28925 -5404 25460 13031 -24238 -20032 4417
5226 4417 -31263 -42723 6333 65561 48332 10308 9846 -7488 4463 -7282 -15899 -1810 -12166
5213 -12166 24278 44145 24275 28756 60777 73350 2609 -7244 9697 14084 14868 37310 23148
5200B3148o171j563m779j7343J653M6247K8814n68m9447n0812j9099K1245J403
5187b7272O94n717J7613L7097j0576J5867k5936K461k367p52p682j7590J3550
5174a0610j6127j7199J2307j2182N983L2584M1597K5546j2519l5345K7849j3502
5162B8382Q705j7887J4632q072m3664r386L9218k9725P76L7573K6180R386L3330
5149H9448R319o0112m3204M490J3260k1705p8071m3685J1311K2336L7068M3057
5137a6488L451M631k387J0725J8882k0878p0716j037L2518m4744J3432J3833j9607
5124g8385k566K436k5053M34L2499M668J1256R025k766j2251L920k0485J264J4539
5110f1465L5110N5780n5115k8884K1060J3629l2967k9951L3611K9503j4825P229
$$ plain form
5200 23148 16977 15414 10635 -6708 -5055 41192 70006 69438 19991 -30821 -49920 -28675 -27272
5187 -27272 -26578 -32295 -14682 22415 11839 27706 1770 4231 1864 1112 -6570 -24160 -10610
5174 -10610 -26737 -43936 -31629 -43811 -37828 -5244 36353 61899 49380 14035 41884 28382
5162 28382 37087 19200 33832 25760 -17904 -27290 11928 -17797 -17021 20552 46732 56118 89448
5149 89448 98767 38655 -4549 -59 13201 -8504 -86575 -130260 -118949 -96613 -59545 -16488
5137 -16488 -13037 -8406 -10793 -68 18814 -2064 -72780 -73817 -41299 -86043 -72611 -58778 -78385
5124 -78385 -80951 -78515 -103568 -103134 -70635 -65967 -54711 -45686 -48452 -60703 -56783 -77268 -76004 -61465
5110 -61465 -26355 29425 -25690 -54574 -33514 -19885 -52852 -82803 -49192 -19689 -34514 -27285
5098b7285M9670N80n0287j1371K8103M447l7607K981J1082p716J2166J7503N509
5085b225j0474K8950p508K33K13J5640l660O398R811k9927k7173k768k6979J9867
5071b9602L0545J9214l5354k2273m844L3226M9256k6825m9170j834L099J8729
5059a5833m2262M444K8834q275P525J181L9371M418l3627J8010k224j003K5510
5046B6069p1400r628J5057p123j6625L6032K5115j2240K5909j3257j8358K1497
5034A048K1755K1232J8716k266J8207m7748l7605j4470n923R27J7929K4401k0059
5021c856J2604K3221o104k8195J8121O21j9729j8088j1685L3608K5749k1509k4632
5008a9874L3476K8810j3621k9952O276k3549P038J6945J952K4239K2375q695n8994
$$ plain form
5098 -27285 22385 22965 -27322 -38693 -10590 -6143 -43750 -40769 -29687 -37403 -25237 -7734 -2225
5085 -2225 -12699 16251 8743 8976 9189 24829 21169 27567 37378 7451 -19722 -22490 -49469 -29602
5071 -29602 943 20157 -15197 -37470 -42314 -9088 40168 13343 -35827 -37661 -34562 -15833
5059 -15833 -58095 -53651 -24817 -33092 -25567 -24386 14985 19403 -14224 3786 1562 559 26069
5046 26069 -45331 -54959 -39902 -47025 -63650 -27618 -2503 -14743 11166 -2091 -20449 1048
5034 1048 22803 44035 62751 60485 78692 30944 -6661 -21131 -27054 -26127 -8198 16203 -3856
5021 -3856 8748 31969 25865 -2330 15791 16412 -3317 -21405 -33090 518 26267 4758 -19874
5008 -19874 13602 42412 28791 -1161 5115 -18434 -11396 5549 7501 31740 54115 45420 -13574
4995a3574J1563L19j8522N214J427L2843j7332l2527o892L8808M6961K2474p3632
4982b870Q320K8303l374k0187j1790m6412J0090L5686J1414j1238M371m5919K381
4969d1225N4335J2010K2216J0766J7645K0724k763k8495n3003n2614N602L4242
4957e60J2032j4964m1863K5817j3671K0138J727J2798K8379k9372q619j3605L1169
4944I406L8409m468n0389l479N7592l4298J198l0646m9459J9140j1988L536K7801
4931b7645P9Q874K7611L0097Q124O0574K4831k8499l3784j9902J0113Q428R111
4918G8012n5548m5219J5846j5759J3321k35k6099l5894L9624J2764R385J3740
4906C938J1103j1857R546K1719l3011P832k6864j5146J2603k9746K1616K8360
$$ plain form
4995 -13574 -2011 -1692 -20214 -15000 -13573 19270 1938 -30589 -37481 1327 48288 70762 -2870
4982 -2870 5450 33753 30379 10192 -1598 -48010 -37920 -2234 9180 -2058 2313 -43606 -41225
4969 -41225 13110 25120 47336 58102 75747 96471 93708 65213 12210 -40404 -34802 -560
4957 -560 11472 -3492 -45355 -19538 -33209 -13071 -11344 1454 29833 461 -8158 -21763 9406
4944 9406 47815 43347 -7042 -10521 47071 12773 13971 -16675 -66134 -46994 -58982 -55446 -27645
4931 -27645 -27566 -18692 8919 39016 47140 107714 132545 104046 70262 50360 60473 68901 78012
4918 78012 22464 -22755 -6909 -22668 -9347 -9582 -35681 -71575 -31951 -19187 -9802 3938
4906 3938 15041 3184 12730 34449 1438 9270 -17594 -32740 -20137 -49883 -28267 93
4894I3J469l0506k634M4430l263j5923j8119l892j1207m550q3K162J892O227N0513
4879A6609K8244P259l064j1702n149l357j1997j2885n454j5553K003L1563l496
4866A3021j5918m865J431M219n489j8628J3997l5776k6956q639J0331K4523L8388
4853a0361K7756N027O231J2941l9534n8225k5479o035J4805L8934M4071Q286l2510
4840a4093l3526J2034J5133J1381l7494j6950q145J4187M3668J8106K1460j6836
4828H925K3326P492J7592k116q610K1421j6879l2853p401k2577J1899N262J769
4815G250J0245L1740J6717k885l7585l858m078l16n584j0728k959l7k4567j1546
4801c8191J7002Q997m7499J4681M527k602M5409O4314r303j2416l5839K4922R634
$$ plain form
4894 93 1562 -28944 -31578 12852 9589 -6334 -24453 -28345 -39552 -44102 -44185 -42023 -40131 -33904 16609
4879 16609 44853 52112 49048 37346 32197 28840 16843 3958 -1496 -17049 -15046 16517 13021
4866 13021 -2897 -7762 -6331 -2112 -7601 -26229 -12232 -48008 -74964 -83603 -73272 -48749 -10361
4853 -10361 17395 22422 28653 41594 2060 -56165 -81644 -87679 -72874 -33940 10131 18417 -14093
4840 -14093 -47619 -35585 -20452 -9071 -46565 -63515 -71660 -57473 -13805 4301 25761 8925
4828 8925 32251 39743 57335 55219 46609 68030 51151 18298 10897 -11680 219 5481 7250
4815 7250 17495 49235 65952 63067 25482 21624 17546 17230 11646 918 -2041 -2078 -26645 -38191
4801 -38191 -21189 -12192 -59691 -45010 -40483 -43085 2324 66638 57335 44919 9080 34002 43636
4788D3636J1562n4874j6584J0964l2411J0988M6241j391j2194l5835P669L620
4776a8609J6622j6927M7216M5914n900Q295K8824r519n8031j5140L7277j9338
4764D0684p9024K936k420J031M5704L28q198j2109J8137J4175j708Q377K3927
4751E1840J275m9537k2082J0189R500j7915l3910j5989l861J154L2814K5471K4919
4738A3868L6815J1626j2339l149J0235p3334M025K2682N2047k5585R020J1418
4726E7329m3l0678k8714k8693K2610J3076k4884j3287P836M1344K7706M0689m0135
4713D4156n825L0082J275q18l6609M215l7206j6451J4981K3519k4066p278j5730
4700b5755J3635J2259J588M9210l8364n2197K9064j4841M8841J8057N25k0729
$$ plain form
4788 43636 55198 324 -16260 -5296 -37707 -26719 19522 18131 5937 -29898 -22229 -18609
4776 -18609 -1987 -18914 28302 74216 68316 76611 105435 95916 37885 22745 60022 40684
4764 40684 -38340 -35404 -37824 -36793 8911 9239 1041 -11068 7069 21244 19536 27913 51840
4751 51840 53115 3578 -18504 -8315 1185 -16730 -50640 -66629 -70490 -69336 -36522 -11051 13868
4738 13868 50683 62309 49970 46821 57056 -16278 -12253 10429 62476 36891 45911 57329
4726 57329 57286 26608 -2106 -30799 -8189 4887 -19997 -33284 -25448 15896 43602 84291 44156
4713 44156 38331 68413 69688 68870 32261 36476 -730 -17181 -2200 21319 -2747 -10025 -25755
4700 -25755 -12120 139 1727 50937 12573 -39624 -10560 -25401 23440 41497 42022 21293
4688B1293l4818J4603M0348K1629m528k8424J3551l5548O125J0473O068k9124
4676A648l4684m5496L2046O5944L1445L9627j4312o0645l7895p434L596K006J4754
4663i400k0307k3225J8676K5795K2767L5139Q60l9708o5644l5377J1197J5886
4651f3341M260J1743K6228O6045R988l9227K1171m146k6566k8415J3081J8107
4639H928J7725P803m4872j3570K4612M2074L2012m6780o94k3235n8147j7201M022
4626f7323J0140L9607K2638Q827J3896r479q961k7821k6535K7538K668k2822M4932
4613G305J7987n38j3576K8637j2739l0822j1939l9210J935K169K1264j6495J3628
4600c2394l717J1876O501l2990k4917K1274N6963N812l9997j3073k1928O513k316
$$ plain form
4688 21293 -13525 1078 41426 63055 58527 30103 43654 8106 14231 24704 30772 1648
4676 1648 -33036 -78532 -46486 19458 50903 90530 76218 15573 -22322 -29756 -26160 -24154 -9400
4663 -9400 -29707 -52932 -34256 -8461 14306 49445 50305 10597 -55047 -90424 -79227 -63341
4651 -63341 -59081 -47338 -21110 44935 54923 15696 36867 32721 6155 -22260 -9179 8928
4639 8928 26653 34456 -10416 -23986 626 42700 74712 27932 27238 4003 -54144 -71345 -67323
4626 -67323 -57183 -17576 5062 13889 27785 18306 9345 -18476 -45011 -17473 -14805 -37627 7305
4613 7305 25292 24754 11178 39815 27076 -3746 -15685 -54895 -52960 -50791 -29527 -46022 -32394
4600 -32394 -36111 -24235 -17734 -50724 -75641 -54367 2596 8408 -31589 -44662 -66590 -60077 -62393
4587f2393N0504J1402p927j7523n939J3962l8187l6582j5950K241L9964M7669
4575a8759J5216J7839j6583j4512L586j1963j1028J6014m003K6373O77m3400K0092
4562b0451L1243k3133k5749N5222j7992j555N739k9122r196K1428j8140M3095
4550A1389L5586j4481k6432J9312q689m7115k7172P123K6506k81j2216j1731m316
4537e2517K537j2023P765K24P865m3561j1371j0508J2863K0821J2484J4127J839
4524d9455j2967l542K5149K5672K0431J68j1222M796j4289j3566j4582M0263L729
4511E85j3446j1742j2007L7126Q808j5567m1542J6474K0584K5739J2538L674K2311
4498E3535J3453k3599k2421j3360j9766j9019J5759j1956m408P607k724j5149
$$ plain form
4587 -62393 -11889 -487 -8414 -25937 -31876 -17914 -56101 -92683 -108633 -106392 -66428 -18759
4575 -18759 -3543 14296 -2287 -16799 -13213 -25176 -36204 -20190 -24193 2180 2857 -40543 -20451
4562 -20451 10792 -12341 -38090 17132 -860 -2415 3324 -25798 -34994 -13566 -31706 11389
4550 11389 46975 32494 6062 25374 16685 -30430 -57602 -50479 -23973 -24254 -36470 -48201 -52517
4537 -52517 -49980 -62003 -54238 -54014 -46149 -89710 -101081 -111589 -98726 -77905 -65421 -51294 -49455
4524 -49455 -62422 -65964 -40815 -15143 5288 5456 -5766 -970 -15259 -28825 -43407 -3144 585
4511 585 -12861 -24603 -36610 516 9324 -6243 -47785 -31311 -10727 15012 27550 31224 53535
4498 53535 66988 43389 20968 7608 -12158 -31177 -15418 -27374 -31782 -24175 -26899 -42048
4486d2048Q368k407M976L3411J5080L0255l0843N433K6002j438j4267l9359N09
4473f328J3832J840j8126Q180L8896J1068r049K8141L1373k8736n8562n5332j5014
4460e7817L4717J0136k672l6059K1124J2821J9153M2519j5382J707L2027R872
4448G2146m0444j4658j0858k0884m5012J0598L8525r892J5616j8166o165j1316
4436d0510J3554p983j1027L0214L0531J4384K4141j5833k7171j3767L4189K8677
4424E9399j0998m4439l3677K1543J4273N586r68k3529P748j4919k5586k4599J6681
4411e3485L1188L3609K4803k3596j1504N1273J7965o397l3193j7090l315J2994
4399B3252o925o285O686j6206k101M1k5038o113M1278J6296L476n0928k0623J1161
$$ plain form
4486 -42048 -33680 -36087 -31111 2300 17380 47635 16792 22225 48227 46789 32522 -6837 -6328
4473 -6328 7504 9344 -8782 -602 38294 49362 40313 68454 99827 71091 12529 -42803 -57817
4460 -57817 -23100 -12964 -15636 -51695 -30571 -17750 1403 43922 28540 30247 62274 72146
4448 72146 31702 17044 6186 -14698 -59710 -49112 -10587 -20479 -4863 -23029 -29194 -40510
4436 -40510 -26956 -34939 -45966 -15752 14779 29163 53304 37471 10300 -3467 30722 59399
4424 59399 48401 3962 -29715 -8172 6101 11687 10719 -12810 -5062 -19981 -45567 -70166 -53485
4411 -53485 -22297 11312 36115 12519 1015 52288 70253 63856 30663 13573 10258 23252
4399 23252 16327 10042 16728 522 -1579 -1538 -26576 -32689 8589 24885 28361 -22567 -43190 -32029
4385c2029K5025K3068o711K060j7659k1757j8797Q172J002r607R938O644p437
4372c8088J0492q525o05O267r868M2279K9796l0972j7920J5965K5612N7695l835
4359G8293o0022l0721j7963L6070K8272j3760M675P430q293o671K0159J6461K9821
4346H3751O1869k0409o2030m7431k6337m184M561k2342N4259J514j4853Q325L4194
4333E0887K5360k8855o6736k5267M9972M3685N4676o871n9613l2400J391k0881
4321a4652j8185l7576K3908k62K2250J8296M2468L0745K2267K2142k9611l2400
$$ plain form
4385 -32029 -7004 16064 9353 11413 -6246 -28003 -46800 -38628 -37626 -47233 -37295 -30651 -38088
4372 -38088 -27596 -36121 -36726 -30459 -40327 1952 31748 776 -17144 -1179 24433 82128 78293
4359 78293 18271 -12450 -30413 5657 33929 20169 24844 32274 23981 17310 37469 53930 83751
4346 83751 145620 125211 63181 15750 -10587 -14771 -10210 -32552 21707 23221 8368 16693 50887
4333 50887 76247 47392 -19344 -44611 5361 49046 103722 96851 37238 4838 6229 -14652
4321 -14652 -32837 -70413 -46505 -46767 -24517 -6221 36247 66992 89259 111401 81790 49390
$$ [...]
##END NTUPLES=NMR SPECTRUM
##END=
