##TITLE=Analysis number 321546
Compound Code mo 00181
Book Reference 382/190/1
Project Code adrs
Chemist Name simons
##JCAMPDX= 6.0         $$ Bruker NMR JCAMP-DX V2.0
##DATA TYPE= NMR SPECTRUM
##DATA CLASS= NTUPLES
##ORIGIN= Bruker BioSpin GmbH
##OWNER= nmr
$$ XWIN-NMR		Version 3.5
$$ Wed Aug 16 09:42:01 2006 GMT Daylight Time (UT+1h)  MAYBRIDGE\nmr@NMR_250MHZ
##.OBSERVE FREQUENCY= 250.131544655141
##.OBSERVE NUCLEUS= ^1H
##.ACQUISITION MODE= SIMULTANEOUS (DQD)
##.ACQUISITION SCHEME= undefined
##.AVERAGES= 16
##.DIGITISER RES= 18
##SPECTROMETER/DATA SYSTEM= dpx250
##.PULSE SEQUENCE= zg30
##.SOLVENT NAME= CDCl3
##.SHIFT REFERENCE= (INTERNAL, CDCl3, 0, 16.4549)
##AUDIT TRAIL= $$ (NUMBER, WHEN, WHO, WHERE, WHAT)
$$ ##TITLE= Audit trail, XWIN-NMR		Version 3.5
$$ ##JCAMPDX= 5.01
$$ ##ORIGIN= Bruker BioSpin GmbH
$$ ##OWNER= nmr
$$ C:\u/data/dgb/nmr/ADRS/960/pdata/1/auditp.txt
$$ ##AUDIT TRAIL=  $$ (NUMBER, WHEN, WHO, WHERE, WHAT)
(   1,<2006-08-16 09:41:25.96 +100>,<MAYBRIDGE\nmr>,<NMR_250MHZ>,
      <created by zg, POWCHK disabled, PULCHK disabled
       configuration hash MD5:
       E2 DF 36 D8 04 B2 41 60 5A D7 A3 38 5A 4B D0 FE
       data hash MD5: 64K
       D8 72 8C 96 D6 C9 5E 9C 8C 59 4F 61 A8 84 14 80>)
(   2,<2006-08-16 09:41:46.63 +100>,<MAYBRIDGE\nmr>,<NMR_250MHZ>,
      <Start of raw data processing
       ef LB = 0.3 FT_mod = 6 PKNL = 1 SI = 32K 
       data hash MD5: 32K
       36 F9 9C A5 24 CC E6 10 F2 08 A3 9B C0 23 0F F1>)
(   3,<2006-08-16 09:41:50.76 +100>,<MAYBRIDGE\nmr>,<NMR_250MHZ>,
      <apk 
       data hash MD5: 32K
       27 71 A9 16 65 BB FC 00 94 9A D5 63 44 DC 55 D4>)
(   4,<2006-08-16 09:41:52.18 +100>,<MAYBRIDGE\nmr>,<NMR_250MHZ>,
      <abs ABSG = 5 
       data hash MD5: 32K
       9E D0 59 1C 29 F8 46 8A D8 B1 CA 23 90 52 58 52>)
$$ ##END=
$$ 
$$ hash MD5
$$ 11 C8 A9 97 F0 A1 B0 CF 56 EE A8 C0 81 C0 18 5A
##$RELAX= 
##$RELAX= 
##$RELAX= 
##$RELAX= 
##$RELAX= 
##$RELAX= 
##$RELAX= 
$$ Bruker specific parameters
$$ --------------------------
##$DU= <C:\u>
##$EXPNO= 960
##$NAME= <ADRS>
##$PROCNO= 1
##$TYPE= <nmr>
##$USER= <dgb>
##$AMP= (0..31)
100 100 100 100 100 100 100 100 100 100 100 100 100 100 100 100 100 100 
100 100 100 100 100 100 100 100 100 100 100 100 100 100 
##$AQSEQ= 0
##$AQ_mod= 3
##$AUNM= <au_zg>
##$AUTOPOS= <4 >
##$BF1= 250.13
##$BF2= 250.13
##$BF3= 250.13
##$BF4= 250.13
##$BF5= 500.13
##$BF6= 500.13
##$BF7= 500.13
##$BF8= 500.13
##$BYTORDA= 1
##$CFDGTYP= 0
##$CFRGTYP= 5
##$CHEMSTR= <none>
##$CNST= (0..31)
1 1 145 1 1 1 1 1 1 1 1 1 1 1 1 1 1 1 1 1 1 1 1 1 1 1 1 1 1 1 1 1 
##$CPDPRG= <>
##$CPDPRG1= <>
##$CPDPRG2= <>
##$CPDPRG3= <>
##$CPDPRG4= <mlev>
##$CPDPRG5= <mlev>
##$CPDPRG6= <mlev>
##$CPDPRG7= <mlev>
##$CPDPRG8= <mlev>
##$CPDPRGB= <>
##$CPDPRGT= <>
##$D= (0..31)
0 1 0 0 0 0 0 0 0 0.06 0 0 0 0 0 0 0.0002 0 0 0 0 0 0 0 0 0 0 0 0 0 0 
0 
##$DATE= 1155717683
##$DBL= (0..7)
120 120 120 120 120 120 120 120 
##$DBP= (0..7)
150 150 150 150 150 150 150 150 
##$DBP07= 0
##$DBPNAM0= <>
##$DBPNAM1= <>
$$ [...]
##$SUBNAM7= <"">
##$SUBNAM8= <"">
##$SUBNAM9= <"">
##$SW= 20.6930455092707
##$SWIBOX= (0..15)
0 0 3 0 0 0 0 0 0 0 0 0 0 0 0 0 
##$SW_h= 5175.983436853
##$TD= 65536
##$TD0= 1
##$TE= 295.16
##$TE2= 300
##$TE3= 300
##$TEG= 300
##$TL= (0..7)
0 120 120 120 120 120 120 120 
##$TP= (0..7)
150 150 150 150 150 150 150 150 
##$TP07= 0
##$TPNAME0= <>
##$TPNAME1= <>
##$TPNAME2= <>
##$TPNAME3= <>
##$TPNAME4= <>
##$TPNAME5= <>
##$TPNAME6= <>
##$TPNAME7= <>
##$TPOAL= (0..7)
0.5 0.5 0.5 0.5 0.5 0.5 0.5 0.5 
##$TPOFFS= (0..7)
0 0 0 0 0 0 0 0 
##$TUNHIN= 0
##$TUNHOUT= 0
##$TUNXOUT= 0
##$USERA1= <user>
##$USERA2= <user>
##$USERA3= <user>
##$USERA4= <user>
##$USERA5= <user>
##$V9= 5
##$VALIST= <valist>
##$VCLIST= <CCCCCCCCCCCCCCC>
##$VD= 0
##$VDLIST= <DDDDDDDDDDDDDDD>
##$VPLIST= <PPPPPPPPPPPPPPP>
##$VTLIST= <TTTTTTTTTTTTTTT>
##$WBST= 1024
##$WBSW= 4
##$XGAIN= (0..3)
0 0 0 0 
##$XL= 0
##$YL= 0
##$YMAX_a= 421122
##$YMIN_a= -654105
##$ZGOPTNS= <>
##$ZL1= 120
##$ZL2= 120
##$ZL3= 120
##$ZL4= 120
##$ABSF1= 16.45494
##$ABSF2= -4.238232
##$ABSG= 5
##$ABSL= 3
##$ALPHA= 0
##$AQORDER= 0
##$ASSFAC= 0
##$ASSFACI= 0
##$ASSFACX= 0
##$ASSWID= 0
##$AUNMP= <proc_1d>
##$AZFE= 0.1
##$AZFW= 0.1
##$BCFW= 0
##$BC_mod= 0
##$BYTORDP= 0
##$COROFFS= 0
##$CY= 12.5
##$DATMOD= 1
##$DC= 0
##$DFILT= <>
##$DTYPP= 0
##$F1P= 14.0000005364418
##$F2P= -0.99999901652339
##$FCOR= 0.5
##$FTSIZE= 32768
##$FT_mod= 6
##$GAMMA= 0
##$GB= 0
##$INTBC= 1
##$INTSCL= 1
##$ISEN= 128
##$LB= 0.3
##$LEV0= 0
##$LPBIN= 0
##$MAXI= 10000
##$MC2= 0
##$MEAN= 0
##$ME_mod= 0
##$MI= 0
##$NCOEF= 0
##$NC_proc= -3
##$NLEV= 6
##$NOISF1= 0
##$NOISF2= 0
##$NSP= 0
##$NTH_PI= 0
##$NZP= 0
##$OFFSET= 16.45494
##$PC= 1
##$PHC0= 147.6284
##$PHC1= 7.824607
##$PH_mod= 1
##$PKNL= yes
##$PPARMOD= 0
##$PSCAL= 4
##$PSIGN= 0
##$REVERSE= no
##$SF= 250.13001677264
##$SI= 32768
##$SIGF1= 0
##$SIGF2= 0
##$SINO= 400
##$SIOLD= 32768
##$SREGLST= <1H.CDCl3>
##$SSB= 0
##$STSI= 32768
##$STSR= 0
##$SW_p= 5175.98343685301
##$SYMM= 0
##$S_DEV= 0
##$TDeff= 65536
##$TDoff= 0
##$TI= <Analysis number 999999
Compound Code 99
Book Reference 9
Project Code 9>
##$TILT= no
##$TM1= 0
##$TM2= 0
##$TOPLEV= 0
##$USERP1= <user>
##$USERP2= <user>
##$USERP3= <user>
##$USERP4= <user>
##$USERP5= <user>
##$WDW= 1
##$XDIM= 32768
##$YMAX_p= 325009817
##$YMIN_p= -59833
$$ End of Bruker specific parameters
$$ ---------------------------------
##NTUPLES= NMR SPECTRUM
##VAR_NAME=  FREQUENCY,     SPECTRUM/REAL,   SPECTRUM/IMAG
##SYMBOL=    X,             R,               I
##VAR_TYPE=  INDEPENDENT,   DEPENDENT,       DEPENDENT
##VAR_FORM=  AFFN,          ASDF,            ASDF
##VAR_DIM=   32768,         32768,           32768
##UNITS=     HZ,            ARBITRARY UNITS, ARBITRARY UNITS
##FACTOR=    0.157963299565203, 1,           1
##FIRST=     4115.87461727087, 0,            0
##LAST=      -1060.10881958214, 0,           0
##MIN=       -1060.10881958214, -59833,      0
##MAX=       4115.87461727087, 325009817,    0
$$ Real data points
##PAGE= N=1
##DATA TABLE= (X++(R..R)), XYDATA
$$ [...]
18810b5280P461n397j2888J5352j7313q553K1546o0P544J517o254R698J161k770
18796a4236k323n368o826R040K0330J0916j4519j4440k306J801N339O652m200
18783a0140K776Q16l841R4L825k850j997n625o376O371K2217o230p580J1201l711
18768a050K922K0839J5943K1077J4091j08j9714j7400J278o058j4894j9927j6523
18755a9524J8062J901Q580L341j2360j2504j033P375L552O001R924j234N78j1047
18741A612k703k0019J239J6287p687p916n574L785M606o395Q54J6085J1264J9575
18727B5013K031q851o075j2682o212K230J1182r333j7259L148Q631L680m989J723
18713g763q024R96p076o692J153l671O974J2221J3070o730K05J064j241j0341
$$ y = [-25280, -17819, -23216, -36104, -20752, -38065, -46618, -25072, -25132, -17588, -16071, -22325, -12627, -11466, -14236, -16559, -21927, -28753, -19713, 617, 11533, -2986, -17426, -19732, -17931, -12592, -5940, -10140, -7364, -6548, -10389, -10295, -6470, -9320, -11317, -16942, -23318, -16947, 5270, -960, -8540, 2661, -1050, 1872, 22711, 38654, 59731, 73822, 73714, 54000, 36600, 37878, 31820, 16926, -3001, -19524, -1462, 439, 9019, 12360, 0, -12504, -13537, -6162, -2610, 3391, 13315, 12081, 12659, 1612, -1091, -21110, -19871, -3584, -11271, -19187, -24761, -20976, -16370, -22765, -21911, -5826, 5438, 25013, 27044, 18193, 12118, -564, -6776, -4546, 6636, -2697, -19956, -16808, -8177, -4497, -9486, -7763, -15787, -14791, -21867, -28559, -27406, -31077, -24103, -11882, 1188, -5542, -5337, -4273, -5514, -15855]
18699a5855N285J3493N535J287n288j1716q325r969J6839J3199K3968r989r846
18686H618r420q306O356M150j2962j470J3727J1842p627j7726r977j424J3088
18673a1131o098M968n229P538J4451J482M01o045J47J0902N221l457j4335j2761
18659a3946j3381l743J2108O153L382N790L830n22p754Q809K3051M404o852j5793
18645E536l973O371J1235K976J242m115j8985q278l41J985k966k431N779r889
18631a5854j2934J1827P02r245M778Q283j345o769J0372K940m149l933l23k491
18617a8141n459J682k956J4891J0388o423o680K032M399J4914m81j4338j0044
18604a6216J3423J3284O264k300n634k284p819r185j2164j7078p888J0611J0802
$$ y = [-15855, -10570, 2923, 8458, 9745, 4457, -7259, -15584, -25553, -8714, 4485, 28453, 18464, 8618, -802, -9108, -2752, 1398, -11564, -13034, 693, 12535, 4908, -12818, -22795, -24219, -11131, -17229, -12261, -17490, -9952, 4499, 5981, 6382, 337, 484, 11386, 16607, 13150, -1185, -13946, -27327, -31070, -18962, -12809, -9427, -3637, 193, -329, -8083, 726, 23777, 28181, 21329, 5536, 1563, 7934, 19169, 22145, 23387, 19272, 287, -7991, -8332, -6347, -9313, -11744, -5965, -15854, -28788, -16961, -16259, -25504, -20726, -12443, -13788, -20557, -10185, -7245, -11394, -15327, -15650, -18141, -23600, -21918, -24874, -9983, 405, -6018, -12698, -10666, -6267, 8647, 8166, -6172, -16216, -2793, 10491, 16755, 14455, 8821, 6537, -1282, -10467, -22631, -39709, -47597, -36986, -26184]
18591b6184J761M972P560J6314O601N876O759j3556K801L0430J2067K863P193
18578F5457P80k668j6385j1516j1031j7628j3773P447J8240N378n715L956k946
18565A9596k219L973L750j7410p949L314l344o908o920k865J359N452o141M502
18551a1810K489j604R21K0358J0255j2614p139L691J5763P170p235j0305K1K716
18537A2677o99j1709j559l565j3654O194j387L856J0901P949k058j7515j5274
18524b5843J0660J8847q107R44q307o617M097J0711j0897p991N865N730j1236
18511b2144L187J5843J8854q35l720r864j3632l525p93N339Q857O509j873j227
18497I76j3126N022j2507J633q06q289R47O742J0227P618M490o334J713O137l346
$$ y = [-26184, -24423, -19451, -11891, 4423, 11024, 16900, 23659, 10103, 12904, 43334, 55401, 58264, 65457, 66237, 63569, 47184, 35668, 24637, 7009, -6764, 683, 18923, 24301, 18586, 22542, 19596, 17377, 21350, 25100, 7690, -259, 3055, -289, -7197, -14117, -16982, -15623, -10171, -16312, -11810, -9321, -10925, -10004, 10354, 20609, 7995, 856, 4547, 20310, 27480, 20245, 9940, 9961, 12677, 11978, 269, -1290, -4855, -18509, -12315, -13702, -9846, 1055, 9004, 6946, -10569, -25843, -15183, 3664, -4443, -3499, -11806, -18423, -14326, -3615, -14512, -22503, -16638, -10908, -22144, -18957, -3114, 15740, 14905, 11185, 1321, -12311, -15836, -16629, -11290, -2433, 4076, 2203, 976, -12150, -7128, -19635, -18002, -18808, -27097, -26150, -19408, -9181, -1563, 2927, -3407, -1694, 4443, 1097]
18482A097r602j1728J997J1519m276j8740j148O291L956K046P340N982l106K057
18468f315m484j1341l354k282N949N582m617r557j769M67Q050J0058P823o008
18454a1798j0038L625j928o058J3723R227J574J3608M539j3702m628j27L300Q585
18440I902N752q523r725n004L498j15m863q547L641J9329L280r205j4057j3600
18426b8237l886J0900J6860q023L918k957j3457J4482M083K776M479N310R672
18413A5920j0177n841Q529j1369m550Q133q640J098J0190J6286j1232j2778P496
18400C065J7342l807r685j4459J292J9277J3726l568o562J322j0426q936k118
18387c537R715M939j3787j710J2513j3190m761n005J4371l811J56K562Q901p274
$$ y = [1097, -8505, -20233, -18236, -6717, -10993, -29733, -30881, -24590, -20634, -18588, -11248, -5266, -8372, -6315, -10799, -22140, -25494, -27776, -21827, -16245, -20862, -30419, -32188, -31721, -23671, -13613, -5790, -11798, -21836, -18211, -20139, -26197, -12474, -3247, -1673, 11935, 16474, 2772, -1856, -1983, 1317, 9902, 15654, 7131, -2594, -7598, -4100, -4215, -9078, -17625, -13984, 5345, 8625, -580, -14637, -28237, -32123, -21223, -4363, -12386, -8468, -11425, -24882, -10400, -6317, -3541, 938, 6248, 15920, 5743, -98, 8431, -2938, -7488, 645, -7995, -6897, 3293, 19579, 8347, -4431, 3065, 20407, 16600, 6915, -7544, -6252, 13025, 26751, 23183, 16621, 17943, 7517, -1419, -3537, 6178, 11117, -2670, -4380, 8133, -5057, -9818, -14823, -452, -4263, -4107, -1545, 7356, 82]
18373H2o58l625K035Q965p732j3350L916p11K1199L637k4042r01M241J3538m611
18358A983j0526p55L196j0429k412P73M307N903j0664m182M245m534q161o710
18344c7966J8009J4715N348P00o61o018j1967J3360K4743k25m498o372Q10j0044
18330f6K771J050n473m429L195K32q351l79m441o70K623P186O563j4363K163l739
18314a6128p040K104p634N897O63K949R629l122o457R694J2113Q62p795J855l577
18299e987J1185L019j1727j2764K542J5606O513J743O535O811j229k103j2638
18286G506P913k529p531J0429O361r057j4155l747P451J1002j41n779q199k805
18272c281o638o826P043R962J4837Q373n606k0249r724M69J1927M527R282J318
$$ y = [82, -576, -4201, -2166, 6799, -933, -14283, -10367, -11078, 10121, 13758, -10284, -11185, -6944, 6594, 1983, -8543, -9298, -6102, -16531, -18943, -18170, -13863, -7960, -18624, -22806, -18561, -23095, -31256, -37966, -19957, -5242, 106, 806, 145, -5873, -17840, -4480, 20263, 20038, 15540, 9168, 9978, -66, 2705, 3755, -1718, -6147, -2952, -2720, -11071, -11450, -15891, -16561, -13938, -6752, -189, -14552, -12389, -16128, -23168, -21064, -28698, -22801, -22138, -19189, -9560, -12682, -19139, -9445, 2668, 3530, -4265, -2410, -5987, 5198, 8217, -3510, -16274, -13732, 1874, 8387, 10130, 16665, 23476, 22247, 20144, 7506, 15419, 12890, 5359, 15788, 22149, 13092, -1063, -4810, 2641, 13643, 13502, 7723, -476, -3281, -9919, -16745, -9702, 260, 15097, 23470, 17864, -2385, -12109, -11640, 287, 4814, 14096, 15414]
18258A5414L667q43n23M485o351j4061M13J415n187K239R362P08p147p352j350
18243e111L715k995N258Q343Q682j829j2007k765n186L914k564j0632o711K97
18229a9591N551p345O443N414K616M87J126l375O391K494l174p084R962o38O750
18214F027j684J494J6687O654Q812k070l725J842k1994o720j247j403m21J0642
18200A2894J3504J501j017j0704j8521r251J3362J0660K546n467o945o605K346
18187a697P469K920P8P309P958p480j1904M889n459N85L369m841j1737L145P641
18172B245p980Q34P186J27L429J055R99J851l595j908J2920r602p146Q003J0867
18157A9285M22P612j3285o034K34R737n719R843R818n527M689J5233m716q104
$$ y = [15414, 19081, 18238, 17715, 22200, 15849, 1788, 2201, 3616, -1571, 668, 10030, 10738, 3591, -3761, -5111, -1396, -4391, 867, 9210, 17892, 16063, 4056, 1291, -3895, 19, -2545, -13177, -19888, -19591, -14040, -21385, -14942, -9528, -6912, -6425, -5299, -8674, -2283, 211, -2963, -10047, -85, -723, 6027, 4343, 5837, 22524, 29178, 37990, 35920, 32195, 34037, 12043, 5323, 4076, 2673, 2252, 12894, 26398, 27899, 26882, 16178, -2343, -11594, 1768, 12428, 14974, 9507, 2562, -4043, -1697, 5772, 8692, 8770, 16079, 24037, 16557, 4653, 9542, 4083, 4668, 8037, 3196, -8541, -5396, 2245, -5735, -4901, 2285, 2412, 5841, 6896, 7895, 9746, 6151, 4243, 17163, 7561, 415, 8418, 19285, 19707, 27319, 14034, 8000, 8234, 17971, 12252, 22095, 31913, 26386, 31075, 46308, 41592, 33488]
18143C3488N754r86k400r426k993R254j785N945N460P880l293M656Q573N169J0110
18128G5406j571O118Q109J5292K1407L2636J9450J2219M7452O0461M9022N5586
18116D01587N8506Q1814J31329J92828K86014M76844Q25154J512227K729563L947128
18106A0642994M007469K829394k347804n734694l432524j732436r50183n32284
18098B749932l21098k28279k16362k07880j81220j64827j25551j03418r9927q8838
18088A012532o7817m5284m9460m1043j3292j8904j9880j8431j6761l0298m4794
18077F46568j6575j8177k9792j3621M56k4513l7473l3256j6183k815j5787k5291
18065D13541j8320k740j5613n784j1696k6745j1012j239j5229j5049j1413j1642
$$ y = [33488, 39242, 38256, 35856, 26430, 23437, 32691, 30906, 36851, 42311, 50191, 46898, 51554, 60127, 65296, 75406, 73835, 79953, 88062, 103354, 124761, 157397, 176847, 189066, 236518, 296979, 346001, 401587, 460093, 541907, 673236, 866064, 1152078, 1628922, 2454076, 3966303, 6695866, 10642994, 14650463, 17479857, 15132053, 9397359, 5964835, 4232399, 3282216, 2749932, 2428834, 2200555, 1984193, 1776313, 1595093, 1430266, 1304715, 1201297, 1101370, 1012532, 944715, 899431, 849971, 808928, 795636, 776732, 756852, 738421, 721660, 691362, 646568, 629993, 611816, 582024, 568403, 568859, 544346, 506873, 473617, 457434, 454619, 438832, 413541, 395221, 392481, 376868, 371084, 359388, 332643, 321631, 320392, 305163, 290114, 278701, 267059]
18053B67059j251J1739J5684n642j2127n859n510j8812j9285j4364P924Q790m121
18040B24225k3087O433J0807n891j2227j7478j79j2917j6976l831N749j6552L675
18027A41751J1003N11j8297m206J0129n760j2499M338R617n890j1036m376m963
18014A10322J532K13l028k1405m970k861O284n795m882j0018l188P540n615j5258
18000D8871o788J0664J3440K127N178L313Q20P59r016q643m282P699N033l755
17986F5420r131o763O912K60j8570P68N845R010R865J514j8728k999m748j6935
17972B1720K074k640p726O335J3067L725j6861n861j855K067j7Q416J5748P006
17958D5198J2200l529j6679k025m6k2571r238j2794R701J4062K023J2102J2750
$$ y = [267059, 265808, 277547, 293231, 287589, 275462, 269603, 264093, 245281, 225996, 211632, 219556, 228346, 224225, 201138, 207571, 218378, 212487, 200260, 182782, 182603, 169686, 152710, 148879, 154628, 138076, 141751, 152754, 153265, 134968, 130762, 140891, 135131, 122632, 126970, 136587, 130697, 119661, 115285, 110322, 111854, 112067, 109039, 87634, 82664, 79803, 86087, 80292, 75410, 65392, 62204, 69744, 64129, 48871, 42083, 52747, 66187, 68314, 73492, 76805, 77625, 78384, 69368, 60725, 56443, 64142, 69175, 65420, 56289, 49526, 56438, 56698, 38128, 38896, 44741, 53751, 63616, 65130, 46402, 43403, 38655, 21720, 23794, 21154, 13428, 19763, 32830, 36555, 19694, 13833, 11978, 14045, 14028, 22444, 38192, 45198, 57398, 53869, 37190, 35165, 35119, 12548, 3310, -9484, 217, 14279, 16302, 28404, 41154]
17945D1154n400n581j1676m450n043j3961K299J1869R401K1875o030j8187j261
17932A5009l42M553m182m549N374o798J3193M775M06k1704j6027J2588J729r781
17918e756l627m264j4855J973J3901K0880L037L46Q176j5319L226J106j8597L083
17904f690J47R409J7719L461p148j645o011n348J4364K491n42k323j6649k340
17890a105J6122J145r147j2329O410J6220K710o435n844J841q006l707O564l611
17876H28N449R02R390J0376j520K485j3719p367l632q814N225J1342N256r54l475
17861A1772l898q07n522J965R877m377P66R009L896n484J3720O924r541j2420
17847A5880P177P282K572m49o123j7157J011p462L167N685o601o785k219J0732
$$ y = [41154, 35754, 30173, 18497, 14047, 9004, -4957, -2658, 9211, 18612, 40487, 34457, 16270, 15009, 14667, 19220, 15038, 10489, 15863, 9065, 22258, 27033, 27439, 5735, -10292, 2296, 4025, -5756, -9383, -13647, -28502, -26529, -12628, 8252, 11289, 11635, 19811, 4492, 7718, 8824, -9773, -6690, -6543, 2866, 20585, 24046, 16898, 15253, 9242, 3894, 18258, 20749, 20207, 17884, 1235, -1105, 15017, 16162, 7015, -5314, 1096, 17316, 20026, 13591, 7747, 9588, 1582, -2125, 4439, 828, 6277, 7179, 16569, 26945, 25425, 27910, 14191, 6824, 3192, -5622, -397, 10945, 16201, 15247, 11772, 7874, 7067, 1545, 3510, 13387, 9010, 9776, 18785, 22681, 17197, 30917, 37841, 28300, 15880, 23057, 30339, 32911, 32462, 26339, 9182, 10193, 2731, 5898, 11583, 4982, -1803, -4022, 6710]
17833F710J63K357N920P402l577j8913K09L151k360n911K813J2708Q257p323r286
17818B320j3027p95J2793N947m076q19J8452K0749J2415q45j2165j7073m455k794
17804A6627k0483l707J4241O78J028p94Q920J8708j0977j2693L439p957j3550
17791f520m722K579Q619J0708Q448Q277l809K722N612o174J5024Q635J0216J1459
17777G1074O555K3085K6880K0402J3032P494J4929K5758K0969M4611M5295L6509
17765C56593J2099p416q573M96Q517K2329K2477j637m426j9095j5366j7724j505
17752C46769P939K877N889M189M868K4117L1216L3322O013k1340l0255k6467N986
17739C95123J7949J9331J6985j49l5419m7419l5050l0259k9077j9071q408j3411
$$ y = [6710, 6873, 9230, 15150, 22552, 18975, 62, 271, 3422, 1062, -4849, -2036, 10672, 18929, 11606, 2320, -10707, -11502, 1291, 7238, 3162, 2343, 20795, 41544, 53959, 53114, 40949, 23876, 19421, 16627, -3856, -7563, 6678, 7356, 8384, 7590, 16510, 35218, 24241, 11548, 14987, 7030, -6520, -11242, -8663, -44, 10664, 19112, 27389, 23580, 26302, 31914, 25740, 40764, 49399, 59615, 71074, 77629, 100714, 127594, 147996, 161028, 168522, 183451, 209209, 230178, 274789, 320084, 356593, 368692, 361276, 352703, 353199, 361716, 384045, 406522, 404885, 400459, 381364, 365998, 348274, 346769, 354708, 357585, 363474, 367663, 372531, 396648, 427864, 461186, 467199, 445859, 415604, 389137, 395123, 413072, 432403, 449388, 449239, 413820, 366401, 331351, 301092, 272015, 252944, 244536, 231125]
17727B31125j6929k4743j7474k7777k2863k1952m529J495r73n015K203J368j1951
17714H1985j4907R674R437j444q624P216k459N69q110k3028k211Q872P025O888
17700G0883J4780l801k8751j9521l245q09k506q050n987L941l877R999L995L650
17686C0701j130R502P458o819M610K513Q645M191j0144l903n460r527N420l138
17672C2919j1291m26O183J2450m350q371j708L874J0582n471j9665q122o126J584
17658B062J9890J7586l399n501l384j391L442j14j0904n778J4l996J801J2396
17644B2724Q184o351p871K012J0918O028j7683j5230M787k653J3908o654k983
17631I136O705J178k281j0099j792J2106k911J354L847l21o09J1167M941p8K939
$$ y = [231125, 214196, 189453, 171979, 144202, 121339, 99387, 94858, 96353, 95380, 90365, 92568, 93936, 81985, 67078, 76752, 86189, 84745, 76121, 83337, 80878, 81447, 73337, 50309, 48098, 56970, 63995, 70883, 85663, 81862, 53111, 33590, 30345, 29536, 27030, 18980, 12993, 16934, 13057, 23056, 27051, 30701, 29571, 39073, 46531, 39712, 44322, 46835, 55480, 59671, 49527, 45624, 40164, 30637, 36057, 32919, 21628, 21202, 27385, 39835, 35485, 27114, 25406, 29280, 39862, 34391, 14726, 6604, 478, 2062, 21952, 39538, 36139, 30638, 27254, 25863, 29305, 29191, 18287, 12509, 12523, 8527, 10328, 22724, 30908, 24557, 16686, 18698, 29616, 35644, 17961, 2731, 7518, 4865, 18773, 12119, 9136, 15841, 17019, 14738, 4639, 2847, 14953, 12042, 13396, 17243, 16922, 16313, 27480, 32421, 32343, 35282]
17616C5282r657j6935K760j4467L18O474J1344L520O721l750m037J8036J2982
17603D8591Q699j2100j6338p409j323Q253k42j0664m122j631L240k019n107r32
17589F896K742j2807M691J6975N698j5800j3926M401k417O591jk265M903K532
17575H213j025J3510j105m83P080l564j2174q171M650o368L579j991k98j720J3906
17560A4039J2959L573o700J1072P069q045j2684j0834O011J441k005j3390r885
17547g379k231N311P670J9017J4219j6647o905Q965O796n205j6122n113l992L910
17533B294J4521P03j0833n807J8007J4590j2292j6679k218o738l891K228M426
17520a689M573O657r709p777R696J5117j89j5977P237P307l516l066k822j0232
$$ y = [35282, 25625, 8690, 11450, -3017, -2699, 3775, 15119, 18639, 25360, 21610, 17573, 35609, 48591, 57290, 45190, 28852, 21443, 20120, 28373, 28131, 17467, 13345, 11714, 14954, 12935, 7828, 6896, 9638, -3169, 1522, 18497, 24195, 8395, -5531, -1130, -3547, 3044, 3043, 778, 5681, 8213, 7188, 20698, 19593, 19110, 26190, 22626, 10452, 2281, 6931, 563, 4142, 2151, 1853, 133, 14039, 26998, 30571, 23871, 34943, 42012, 33967, 21283, 10449, 16460, 17901, 15896, 2506, -7379, -9610, -4299, 3371, 22388, 36607, 19960, 13055, 22020, 28816, 23611, 7489, 2376, -1616, 2294, 16815, 17518, 6685, 878, 18885, 33475, 21183, 4504, 2286, -4452, -8343, -6115, -1689, 2884, 9541, -168, -7945, 1751, 16868, 16679, 702, 7939, 15246, 11730, 8664, 5842, -4390]
17506d390m005J409q88N682J3963Q353n638j6224k483L918j0433N576J7822l84
17492A2278j0349p126l420K571M936j418n56J266M818N624l03J3835r197j3598
17478f39N851J0300J822O406J1029k490q584N369K652j1699N88L470Q95N255K555
17463C2780Q615M482m088J2657J6496J2089K7072J3699O528J6612J9915n422k3474
17450A37961j4143p789l200q039L169M006K093P346M403J4935J1660J0518P388
17437A70308j1403l4358j2052r474J63Q579o716r863j724j583J5008K657q873
17424A00669o318l894n365P545k770j7555l293O28N616M198L59r824K964j7024
17410E5936J6824m901p636N462J0357m60k73P45q374q26N942O835n111L513o325
$$ y = [-4390, -8395, -6986, -7874, -2192, 11771, 20124, 14486, -1738, -4221, -303, -10736, -5160, 12662, 12278, 1929, -5197, -8617, -6046, -1110, -2528, -3084, -1818, 3000, 8624, 8321, 22156, 12959, -639, 5212, 15512, 17334, 23740, 34769, 32279, 23695, 29064, 31716, 20017, 20605, 24075, 24970, 30225, 32780, 41395, 45877, 41789, 54446, 70942, 83031, 110103, 123802, 130330, 146942, 166857, 161435, 137961, 123818, 116029, 112829, 104790, 107959, 111965, 114058, 121404, 125807, 140742, 152402, 162920, 170308, 158905, 124547, 112495, 103021, 103184, 111763, 105047, 95184, 93460, 91877, 106885, 109542, 100669, 94351, 90457, 85092, 92637, 89867, 72312, 69019, 69647, 75263, 79461, 79820, 69996, 72960, 55936, 72760, 67859, 60223, 65685, 76042, 75582, 75309, 76054, 67680, 66854, 72796, 79631, 74520, 78033, 71708]
17395G1708L833J1534o390j3158J3481N444m059J912N627r343o262j0822j1552
17382E1953P059J6369J8290k191j3511j2927p239m61N145j0317J0687K3577L709
17369I0143j1476j3898j0561J332l46O536n371J2656K536r939J0559J5544O543
17356I4258N618M116p828j4029l163J9545J8230L041q104p277n296j4903J2074
17343I6282M792O558J0443j486J0717q14j0180k072M13O258J5295Q938q547R46
17329A37543L399P477R665J1466J780m762l624j3133J4052R374j4538M612l185
17316A60126k335L441M101Q844J0344l478J104J4170M513L597L022j0366k380
17303A94703N148J0648R552j170q24J459n67j6533M745K094M854J0719O525O299
$$ y = [71708, 75541, 87075, 80685, 67527, 81008, 86452, 82393, 84305, 89932, 80589, 74327, 63505, 51953, 59012, 75381, 93671, 91480, 77969, 65042, 57803, 57342, 62487, 52170, 62857, 86434, 90143, 78667, 64769, 54208, 55540, 55194, 61730, 56359, 69015, 71551, 61612, 72171, 87715, 94258, 99876, 103992, 96164, 82135, 78972, 98517, 116747, 119788, 111684, 104407, 99111, 84208, 96282, 101074, 107632, 118075, 116589, 127306, 126492, 116312, 114240, 114653, 120911, 136206, 145144, 136597, 137543, 140942, 148419, 158084, 169550, 171330, 166568, 162944, 149811, 163863, 173237, 158699, 163311, 160126, 157791, 161232, 165333, 174177, 184521, 181043, 182147, 196317, 200830, 204427, 207449, 197083, 194703, 199851, 210499, 220051, 218881, 218057, 219516, 218949, 202416, 207161, 209255, 214109, 224828, 231353, 237652]
17289B37652N571O369n092Q231N655J295N608R493J1812O411K667j4179J421K204
17275B85118k470J1019k643N469k521j1889J3422J5911N314O184J4144Q540N32
17262C46130j2263K710J3720n981J0419J4905K7196J2184j49J618N720J3325K0282
17249D49816J3452J591J5181K4428K4761L5910K7897J8272J9096M0877N7364O1769
17237G90414P3931O8912P2973P8901J02770J30466J31680J56663J73547J72209
17227A952466J69367J72469J78942K36542K93742L47195M18224N39517P08318
17218E016782J022835J546803K257920L082027L805241L993166L502530K862946
17210B7090250J930370K036694L680126N850479Q080287Q506458O446731L527867
$$ y = [237652, 243223, 249592, 244500, 252731, 258386, 259681, 265289, 274782, 286594, 293005, 295672, 281493, 282914, 285118, 282648, 293667, 291024, 296493, 293972, 282083, 295505, 311416, 316730, 322914, 337058, 345598, 346130, 333867, 336577, 350297, 344316, 354735, 369640, 396836, 409020, 408871, 410489, 416209, 429534, 449816, 463268, 464859, 480040, 504468, 529229, 565139, 593036, 611308, 630404, 671281, 728645, 790414, 864345, 933257, 1006230, 1085131, 1187901, 1318367, 1450047, 1606710, 1780257, 1952466, 2121833, 2294302, 2473244, 2709786, 3003528, 3350723, 3768947, 4308464, 5016782, 6039617, 7586420, 9844340, 12926367, 16731608, 20724774, 24227304, 27090250, 29020620, 31057314, 34737440, 40587919, 48668206, 57174664, 63621395, 67149262]
17202F7149262j136070l092755j770519N90344L972837N414234M173482J835554
17194G7136369k281963l665979k822031j863033j28122N24957J53577P75930J622264
17185F9451969L577236N210658M300965K340213j306116m764723l917550j792165
17177G3100487J567219M111366L305623P53540l837297p826462p958186p069828
17169E6146462m789991k574908j876459k203966l432990m383851m354383l991892
17161B8538022l204865k329884j747312j378266j141986r70742q25792p19450
17153A6219725o44205n98052n81244n52698n22168m65335m41249m15693l90771
17144A1608310l91290l83192l74257l61613l32459l16787l16568l06009k84808
$$ y = [67149262, 66013192, 62920437, 61149918, 61740262, 65713099, 71127333, 75300815, 77136369, 74854406, 71188427, 68366396, 66503363, 66375241, 66900198, 67053775, 67829705, 69451969, 73029205, 78239863, 82540828, 84881041, 83574925, 78810202, 74892652, 73100487, 74667706, 78779072, 82084695, 82838235, 79000938, 71174476, 63216290, 56146462, 51356471, 48781563, 46905104, 44701138, 41268148, 36884297, 32529914, 28538022, 25333157, 23003273, 21255961, 19877695, 18735709, 17764967, 16939175, 16219725, 15575520, 14977468, 14396224, 13843526, 13321358, 12856023, 12414774, 11999081, 11608310, 11217020, 10833828, 10459571, 10097958, 9765499, 9448712, 9132144, 8826135, 8541327]
17135H541327k74176k64596k39467k29325k22661k19337j89640j89330j90787
17126F522008j73794j67860j59603j57581j58619j41220j44964j38010j31778
17117E148579j34365j28682j15400j01687j03958j12487r4512j17030j06390r7243
17107D036825r9582r9990q9103j05041r0482p7929o8494p6958p0924r2382p6730
17096C089210o0114p1155o5175o8120n4742n6160o1808m4493n6938n4845o4276
17085B431384o3774n1010m2308m2677m7659m1553l8300m9005m8119n0752l7736
17074A918491m0755k9728l2923k3335m2133n0277l4200l3916k1634l4460l4942
17063A540188l4430l6236m0356l1614l9585l5009k2406l0233j4730k0173k3328
$$ y = [8541327, 8267151, 8002555, 7763088, 7533763, 7311102, 7091765, 6902125, 6712795, 6522008, 6348214, 6180354, 6020751, 5863170, 5704551, 5563331, 5418367, 5280357, 5148579, 5014214, 4885532, 4770132, 4668445, 4564487, 4452000, 4357488, 4240458, 4134068, 4036825, 3937243, 3837253, 3748150, 3643109, 3552627, 3474698, 3406204, 3329246, 3258322, 3165940, 3089210, 3029096, 2957941, 2892766, 2824646, 2769904, 2713744, 2651936, 2607443, 2550505, 2495660, 2431384, 2367610, 2316600, 2274292, 2231615, 2183956, 2142403, 2104103, 2055098, 2006979, 1956227, 1918491, 1877736, 1848008, 1815085, 1791750, 1749617, 1699340, 1665140, 1631224, 1609590, 1575130, 1540188, 1505758, 1469522, 1429166, 1397552, 1357967, 1322958, 1300552, 1270319, 1255589, 1235416, 1212088]
17052A212088k3680k4053l6685k3068j0049k6984l8410l0906j4151k0091j8049
17041I45962n098j1482k0712l0706j5861j9188j3599k0497j8765j7320k2496j4577
17029G35661r928k3030k2456o924j0964M320J1817j6775k3095M590j4746l0322
17017E98148j5752m015j310r465o502o856j3336j5015j7954N801l988R66j1174
17004D99548k668p870M025P552N096O542K990J0600K0513J9365K8312J9038K3088
16991F36131J7238L2093O3299M9846J7794j1794r841r495K093R024k7244l3655
16979G35489k7946j7612k2293k6816k4965k1960j2394Q066J2531o580q47M353
16967E99026J1481L6549J1268j5396j1162k61K0459k4180n9976m3098j3710k2602
$$ y = [1212088, 1188408, 1164355, 1127670, 1104602, 1094553, 1067569, 1029159, 998253, 984102, 964011, 945962, 940864, 929382, 908670, 877964, 862103, 842915, 829316, 808819, 790054, 772734, 750238, 735661, 725733, 702703, 680247, 673323, 662359, 666679, 678496, 661721, 638626, 643216, 628470, 598148, 582396, 578381, 577071, 567606, 561104, 554248, 540912, 525897, 507943, 513744, 509756, 510722, 499548, 496880, 489010, 493035, 500587, 505683, 512225, 515215, 525815, 546328, 565693, 594005, 613043, 636131, 653369, 685462, 748761, 798607, 816401, 804607, 794766, 785271, 787364, 796388, 769144, 735489, 707543, 689931, 667638, 640822, 615857, 593897, 581503, 589569, 602100, 595520, 594673, 599026, 610507, 647056, 658324, 642928, 631766, 631505, 651964, 627784, 567808, 524710, 511000, 488398]
16955D88398k8695l7829m3221k8752r898r514l0562k1743j0522L687m901o391
16943B60057j9099j5866k722Q062l380j4280j1329m574R970N30r758K023j736
16930A97898j0831n560j5469j346p370l039O913j0374r272m855N412M055j7261
16917A28901N132k32M765P315N965J2616l700J820j333m815m803k284j1075l867
16903A34405N147R29o273r706J0655j57n530Q473R286n590j5121q092R214j097
16889A26543p8J3948o273Q003M79L536J526q128j3019j8157k6706N144L977P390
16875I8185P934r319o380R14M79m89j030j1800O707J7943K6177l15N479J0667
16861A45152j5740n207l574q653j6789j6673J035J0385j343k8R847J815q590l992
$$ y = [488398, 459703, 421874, 378653, 349901, 340003, 330489, 299927, 278184, 267662, 271349, 266448, 260057, 240958, 225092, 222370, 230432, 227052, 212772, 201443, 196869, 206839, 207369, 197611, 199634, 197898, 187067, 181507, 166038, 164692, 157322, 154283, 161196, 150822, 141550, 136695, 142107, 146162, 128901, 134033, 133801, 138566, 145881, 151846, 164462, 160762, 162582, 161249, 156434, 151631, 149347, 138272, 134405, 139552, 140481, 134208, 124502, 135157, 135000, 129470, 137943, 147229, 141639, 126518, 118426, 127640, 126543, 126465, 140413, 134140, 142143, 142622, 146158, 147684, 139556, 126537, 108380, 81674, 86818, 90795, 98185, 106119, 96800, 90420, 91334, 91813, 91324, 90294, 78494, 85201, 103144, 129321, 129006, 134485, 145152, 129412, 124205, 120631, 111978, 95189, 78516, 79551, 89936, 88593, 88565, 98412, 100227, 91637, 87645]
16847H7645j3940n658J540O349m745J319p482P722l403q438j42J8182l302n927
16833F9720n299j1523k717l771j0036N53J1046j904k0383M619J7641K288k0760
16820B9474j2838M320J1047J1151j4501o959l579O267N326O682L261o152J2534
16807D6033J1679j3112j5792K4862R612P298q462j2106o100q20j3897J1885R285
16794E0365J555j2030j0576j658J0209N016O89j201j459N545Q963o96j2153j7782
16780B4787j2396l413j879k647m484R758q301j216J5806n029P337J6422n397l64
16766B8984l134Q570l343J158R80P1o700p744N281J1261J0967R343k2857o736
16752B6101j909J252n326J2154K803j3567P363R014j6805l382Q022J261j2333
$$ y = [87645, 73705, 68047, 69587, 75936, 71191, 72510, 65028, 72750, 69347, 60909, 60767, 78949, 75647, 69720, 64421, 52898, 50181, 46410, 36374, 36927, 47973, 46069, 25686, 30305, 47946, 50234, 29474, 16636, 20956, 32003, 43154, 28653, 21694, 18115, 24382, 29708, 36390, 39651, 33499, 46033, 57712, 44600, 28808, 53670, 63282, 70580, 62118, 50012, 43912, 43092, 29195, 41080, 50365, 51920, 39890, 29314, 27656, 37865, 42881, 43570, 42369, 40910, 46455, 55418, 54722, 42569, 24787, 12391, 8978, 7099, 4452, -32, 9726, 1425, 209, 16015, 10986, 18323, 34745, 29348, 28984, 25850, 34420, 31077, 32235, 33215, 33286, 26586, 18842, 24123, 35384, 46351, 55694, 32837, 26101, 24192, 25444, 20118, 32272, 35075, 21508, 28871, 37885, 21080, 17698, 25720, 26981, 14648]
16739A4648p545n521j5333J478N775k423J8566K6898p038j1748M744j973j4275
16726F253m119M279n733R019n55k420q499J7986J8187q226q392l53m441N208R972
16711B8166n283l318k866m786J127R541Q77L516L985J4196o720k621j738m149
16697B9927O239Q046j391L852p835j397J00J1003l755Q174J2605n532q839O715
16683E7912J2392J0243j3733N034m764p651Q915O532k563L463k956J0311J035
16670H4170J754R11J140J96j2897R752J1596P071Q15J4072L611m021j586n869
16656A10715L197n086R607J9058j2103j3998j4046J8476J3176N802J0418K7111
16644A72327K9080M691J2201J0494J4791K3546L8465N2788L2988J6669n580j3186
$$ y = [14648, 7103, 1582, -13751, -12273, -6498, -8921, 9645, 36543, 29505, 17757, 22501, 20528, 6253, 2134, 6413, 680, 9699, 9144, 6724, -1775, 16211, 34398, 26172, 17780, 17427, 12986, 18194, 28166, 22883, 19565, 16699, 11913, 13040, 22581, 23458, 26974, 30959, 45155, 38435, 35814, 34076, 29927, 36166, 44212, 42821, 46673, 38838, 37441, 37541, 48544, 44789, 52963, 65568, 60036, 51197, 57912, 70304, 80547, 66814, 71848, 67084, 59433, 68348, 74880, 72317, 75780, 72824, 83135, 84170, 85924, 86835, 87975, 88171, 75274, 85026, 96622, 103693, 104508, 118580, 122191, 118170, 116584, 110715, 113912, 108826, 118433, 137491, 125388, 111390, 97344, 115820, 128996, 134798, 145216, 172327, 201407, 206098, 218299, 228793, 243584, 267130, 305595, 358383, 391371, 408040, 402460, 389274]
16632C89274o348N917R844K8644J9936R906n984j3890j971r712j805j240Q732
16619D31303m436J570J8822J4175K7503M1221K9135k0050k7346j2500o006J2751
16607E06142L1634K2203k7831l6880m6630n4891l9355m033k0618l2205o658l007
16595B87871j1981j1414k0591l1480j1481p718j4721j1619o635L3m154n898j3579
16582A36633j274J6877J1772O41o838N881j0440J1388l767q088J6501K170R34
16569A72390J476Q261L732J1485J1864Q112l284P411J9322K8204M3684J4804J1813
16556C39274K7576K1426R604q989j5565N127K6836K3481j2552k6150j5560j2536
16544C61972n415M73n814P1J598L796O868q62M109J2953K3229M1067J1049k0363
$$ y = [389274, 382926, 388843, 398687, 427331, 447267, 457173, 451189, 437299, 435328, 425616, 423811, 422571, 431303, 426867, 428437, 447259, 461434, 488937, 530158, 559293, 539243, 511897, 499397, 493391, 506142, 537776, 559979, 532148, 495268, 448638, 393747, 354392, 350359, 329741, 297536, 290878, 287871, 275890, 264476, 243885, 212405, 200924, 193206, 178485, 166866, 160231, 160264, 156110, 150212, 136633, 135359, 152236, 164008, 164649, 157811, 163692, 153252, 164640, 160873, 152785, 169286, 171456, 172390, 173866, 182127, 185859, 197344, 209208, 217320, 214036, 221447, 240769, 268973, 312657, 327461, 339274, 366850, 388276, 397880, 388891, 373326, 378453, 405289, 428770, 416218, 390068, 374508, 361972, 356557, 357030, 351216, 351287, 352885, 356681, 363549, 362687, 366796, 379749, 402978, 444045, 455094, 434731]
16530D34731j0443L098J4548K726k7651j6439r925o228m543L89k2888j2602n525
16517C39248n289k924J506m886K982O77l281M381L769o232q382J3900J5092P245
16503C57806J0012J750l446l945j2182O460l769J0221J0830J0031J3561J2542
16491D09871J5953r205l898R877K1665J0896M07m34O164O055J1857J5503Q203
16478E02914o524L617J2207J6369K1075M8614M7873L3550M9249L9353M7758R0529
16466I06584Q1943O6134P4893J23881J25239J26174J06717P8752J05846J52818
16456A948981J75595J73873J39241J29620K04567L06595L61283L95189M75160
16447D310104O71009J008255J444471J942499K411642K868651L297444L947724
$$ y = [434731, 424288, 427386, 441934, 444660, 417009, 400570, 390645, 384417, 379874, 380263, 357375, 344773, 339248, 333959, 331035, 332541, 327655, 330637, 331314, 328033, 332414, 336183, 329951, 321569, 335469, 350561, 357806, 367818, 369568, 366122, 362177, 349995, 356455, 352686, 362907, 373737, 383768, 397329, 409871, 425824, 416619, 412721, 422598, 444263, 455159, 455566, 455132, 461296, 467351, 479208, 494711, 502914, 496390, 500007, 512214, 528583, 549658, 598272, 646145, 679695, 728944, 768297, 816055, 906584, 988527, 1054661, 1129554, 1253435, 1378674, 1504848, 1611565, 1690317, 1796163, 1948981, 2124576, 2298449, 2437690, 2567310, 2771877, 3078472, 3439755, 3834944, 4310104, 4981113, 5989368, 7433839, 9376338, 11787980, 14656631, 17954075, 21901799]
16439B1901799N360502O796779P294898O277276M360566N416983Q245244Q998814
16431G4652861O131824l41627k113230J712838L787558J770693m714149q046097
16423G2840671m586107j235659o16954k698012m209485j793645J673385L594705
16415F2968899L412824J574900J652035M796230O955374O016862R32941l338710
16407H4971355q61400K236742J916504k928745q678285p660711m331448l055354
16399F1608658m458084p034309o861362m936010l582795l074538l088664k830745
16391B5742151k264822j768646j438752j175464r72015q38666p70252p12964o28068
16382A5172502n48790m92786m98835m93370m48685l79612l67248l96467l92168
$$ y = [21901799, 27262301, 34059080, 41353978, 47631254, 51991820, 57408803, 65654047, 74652861, 80784685, 80443058, 78329828, 80042666, 83830224, 85600917, 80886768, 72840671, 68254564, 67018905, 66401951, 63703939, 59494454, 57700809, 59374194, 62968899, 66381723, 67956623, 69608658, 74404888, 81360262, 87377124, 88310065, 84971355, 84109955, 86346697, 88263201, 85334456, 76656171, 68995460, 64664012, 61608658, 57150574, 50116265, 43254903, 38318893, 34736098, 31661560, 28572896, 25742151, 23477329, 21708683, 20269931, 19094467, 18122452, 17283786, 16513534, 15800570, 15172502, 14623712, 14130926, 13632091, 13138721, 12690036, 12310424, 11943176, 11546709, 11154541]
16373A1154541l50879l30722l28758l42526l28251l08639k74054k75540k83438
16364H331734k93575k57203k28920k30363k11519k12320k11925j97855j93352
16355F294702j72663j54458j51395j48194j57416j42338j36470j30631j10839
16346D990298j25342j12045j07143r3902j02972j17148j16876j04130r3744r6835
16336C920161r7367q0819q4265q7092r3610p7917o7660p4706q7242p0196q3668
16325C015619q0034m9901n3953p1191n5110n8876n4780m6995o5530n7161n5012
16314B367076m2656m0624n1083m2479m7725l7115l1166n0727m4667k8197m1078
16303A909559n0016k8565l2038l6297n1313m3754m1508k9456l5683l0972l2674
$$ y = [11154541, 10803662, 10472940, 10144182, 9801656, 9473405, 9164766, 8890712, 8615172, 8331734, 8038159, 7780956, 7552036, 7321673, 7110154, 6897834, 6685909, 6488054, 6294702, 6122039, 5967581, 5816186, 5667992, 5510576, 5368238, 5231768, 5101137, 4990298, 4864956, 4752911, 4645768, 4551866, 4448894, 4331746, 4214870, 4110740, 4016996, 3920161, 3822794, 3741975, 3657710, 3570618, 3477008, 3399091, 3331431, 3256725, 3169483, 3099287, 3015619, 2935585, 2885684, 2831731, 2760540, 2705430, 2646554, 2591774, 2544779, 2479249, 2422088, 2367076, 2324420, 2283796, 2232713, 2190234, 2142509, 2105394, 2074228, 2023501, 1978834, 1950637, 1909559, 1859543, 1830978, 1798940, 1762643, 1711330, 1667576, 1626068, 1596612, 1560929, 1529957, 1497283]
16292A497283k8790n952l3886l8057l9633l4792k8870l3344l1762k3667k0513
16281A178017k7522k1964k9345q448j6819l1683l0996k6760l0404j0763n149o515
16269I31649j9788l0981k3475k3958k5090j361j0177k4203j5270j1508k2646j0574
16257G12618j1924k2853k7817n368J476p940j0264j0882N454K350m863l537q739
16244F07711j3357j3775j7048j4826j0248j4435j1100p683P0k1758j7329r914
16232D56308K946M33j577J518j4162q103j1560j1745j2211O04m579j1625p235
16219C79012q174P662j2602j9757o493j3343J651r377q137j3829k176q243l628
16206B82566K964p266n789O336k912j6166M999l164O763o758n300q631j2121r788
$$ y = [1497283, 1468493, 1462541, 1428655, 1390598, 1350965, 1316173, 1287303, 1253959, 1222197, 1198530, 1178017, 1150495, 1128531, 1099186, 1090738, 1073919, 1042236, 1011240, 984480, 954076, 943313, 938164, 931649, 911861, 880880, 857405, 833447, 808357, 806996, 796819, 772616, 757346, 745838, 723192, 712618, 700694, 677841, 650024, 644656, 646132, 638192, 627928, 617046, 622500, 624850, 619987, 616450, 607711, 594354, 580579, 563531, 548705, 538457, 524022, 512922, 505239, 505309, 483551, 466222, 456308, 459254, 459687, 458110, 459628, 445466, 437363, 425803, 414058, 401847, 402451, 397872, 386247, 379012, 370838, 378500, 365898, 346141, 339648, 326305, 327956, 318579, 310442, 296613, 294437, 286194, 282566, 285530, 278264, 272475, 278811, 275899, 259733, 264732, 261568, 268331, 261573, 256273, 247642, 235521, 225733]
16192B25733j476j0602m882p965r956k492k056L290n77j1776j782L640P402r756
16178A76745k455o800j30O31r593k0058o960k743J0433n386M729J0932p463j305
16164A40577N3k462k424N541n240j59j0159J508P202j2146o010R004r200N653
16150A21738j2352r897N269M266k836m337n555j4668J1867J4258M752K988p334
16137A08159j5585r074M875K090L17l273j2724P90J6210J448r562N848j168o589
16123H1762R985J6906L849k992j3186P946P667j9407q383n420J3457m215o578
16110H1391p812J4879n353P256L885r478p098K496K607j652Jn641j0570l372R902
16095G1441R804J807r079o997J3700J6971N594j7095k1978r089J670j692r3K837
$$ y = [225733, 224257, 213655, 208773, 200808, 190852, 188360, 186304, 189594, 189017, 177241, 175459, 179099, 186501, 176745, 174290, 167490, 167360, 167991, 158398, 138340, 131380, 128637, 139070, 133684, 138413, 149345, 141882, 140577, 140630, 138168, 135744, 141285, 136045, 135886, 125727, 127235, 134437, 122291, 116281, 125285, 116085, 121738, 109386, 99489, 104758, 109024, 106188, 101851, 96296, 81628, 93495, 107753, 112505, 115493, 108159, 92574, 83500, 88375, 90465, 90782, 87509, 74785, 75575, 91785, 93233, 83671, 89519, 88351, 81762, 91747, 108653, 112502, 109510, 96324, 104270, 111937, 92530, 84147, 78727, 92184, 87969, 81391, 73579, 88458, 83105, 90361, 94246, 84768, 77670, 80166, 82773, 81121, 81122, 75481, 64911, 61539, 71441, 81245, 83052, 73973, 66976, 80676, 97647, 103241, 86146, 64168, 55079, 56749, 55057, 54964, 57801]
16081E7801O134R392l37q315o647j0930r17p376M403O579k752p704q39O842l710
16066D1624j066P47j1247M839M708O869N314m301m095j6671M482P217j1272O852
16052C4000M255q310p534L707J4429J4589M21j7697j0808m149l726K356O174N651
16038C3358k590m473N238m102q505N055J1904p884l150J1322J5805N640L501K336
16024F3455k3208k1270k135N411M419l230n632Q277j994p450M542p097J703j1298
16010D493K93J3511Q261P650l52k374J400j3527j7588m08L286r054k656K2986
15996A5921Q918j1322P900L317n753r952j0437J071J6637J1613J144P327o88p735
15982B7961o555J496N759j1312k077J8301M555m575j0224k605m203j3051j365
$$ y = [57801, 63935, 73327, 72990, 64675, 58028, 47098, 46181, 38805, 43208, 49787, 47035, 39331, 38492, 45334, 41624, 40558, 41305, 30058, 34897, 39605, 46474, 51788, 47487, 43392, 26721, 31203, 38420, 27148, 34000, 38255, 29945, 22411, 26118, 40547, 55136, 55557, 37860, 27052, 22903, 19177, 21533, 27707, 33358, 30768, 26295, 31533, 27431, 18926, 23981, 35885, 28001, 24851, 36173, 51978, 57618, 61119, 63455, 40247, 18977, 16842, 22253, 26672, 23442, 17810, 26087, 24093, 16643, 21185, 14088, 15791, 4493, 4786, 18297, 26558, 34208, 33856, 31482, 32882, 19355, 1767, 1359, 4645, -4409, -7065, 15921, 24839, 13517, 21417, 24734, 18981, 9029, -1408, -337, 16300, 27913, 29057, 36384, 35696, 27961, 21406, 22902, 28661, 17349, 15272, 33573, 38128, 33553, 23329, 20724, 16521, 3470, 2105]
15969B105Q950j161J788n587Q401j0043R660L154J2431L980j0889o142J3071O458
15955C6176j4392j5001r797M062P20j3080M884P207J3499R587o566j0414k378
15942D507N61J0578J529n019L962M635p112n137j673j1067l852J7125o94n71L209
15927A0981m649L053R401J0074L686m511n073l150k492j358q808L273J323j0616
15913A134j7059M141n77N438O033R352J852n522K575J1165N742l027l4K952O431
15898C0596l415K864j0194n854O808J116r703M818Q662n016Q648P791J1230r0
15884D8261k772O096M733N002N911J5313K6193J5311J2736K9481L5647L4300L1906
15871B68118K3254L6026N0500M5944J783r699J5884J0493L709k0127k8828l1246
$$ y = [2105, 11055, 9894, 11682, 6095, 14496, 4453, 14113, 17267, 29698, 33678, 22789, 16647, 29718, 36176, 21784, 6783, -3014, 1048, 1768, -11312, -6428, 779, 14278, 23865, 17299, 6885, 4507, 5068, 15646, 17175, 12156, 16118, 20753, 13641, 8504, 6831, -4236, -8088, 9037, 8343, 7772, 10981, 6332, 9385, 18786, 28860, 32546, 28035, 22962, 19812, 17320, 15962, 7154, 10427, 11750, 1134, -15925, -11784, -12361, -6923, -890, 8462, 10314, 4792, 7367, 18532, 24274, 21247, 21213, 24165, 30596, 27181, 30045, 19851, 13997, 20805, 21921, 12218, 17036, 25698, 20682, 29330, 37121, 48351, 48261, 45489, 51585, 56318, 61320, 67231, 82544, 108737, 124048, 136784, 166265, 201912, 236212, 268118, 291372, 327398, 377898, 423842, 425625, 415926, 431810, 442303, 446012, 425885, 397057, 365811]
15859C65811r848l008J907j4743j7731L580J6488J3697N918J283J9074M0316L3984
15846D56728Q366j1642m749J3409J4166j3794m3943m1259l3261k5283l2638k8994
15834B57106l0921k8548j4332k0517j3622l715j7487o404o690r522r441j1930
15822H3977L345p500n680O899L777l486m05L110k848j6693n86R456o955j600J5326
15807H0137q944j2271Q104Q20j2491j913Q301L657o374K726O917R9J25j6087j8340
15792C4466O926o16l617J2437L009J541r80k629k333k418r896P412m697N360m932
15777C9033j2902K5j036Q714n836p141J3096J8590J630n905k547m876l396l671
15763C3778j692m927J762n355m983r208p333J838P802J114j25P990k391o713N861
$$ y = [365811, 355963, 352955, 354862, 340119, 322388, 325968, 342456, 356153, 362071, 363354, 382428, 422744, 456728, 465094, 453452, 448703, 462112, 476278, 462484, 418541, 377282, 344021, 318738, 286100, 257106, 226185, 197637, 183305, 162788, 149166, 145451, 127964, 121560, 114870, 105348, 95907, 83977, 87322, 79822, 74142, 81041, 84818, 81332, 80927, 84037, 81189, 64496, 63910, 73366, 66411, 64811, 80137, 71193, 58922, 67026, 67846, 55355, 53442, 61743, 65400, 59026, 61752, 68669, 68768, 68893, 52806, 34466, 41392, 40776, 37159, 49596, 52605, 54146, 53166, 50537, 48204, 45786, 35890, 43302, 38605, 43965, 39033, 26131, 26156, 25120, 33834, 27998, 20857, 33953, 52543, 54173, 48268, 45721, 40845, 37449, 33778, 32086, 27159, 28921, 23566, 18583, 9375, 2042, 3880, 11682, 12796, 12671, 20661, 18270, 11557, 17418]
15748A7418m512k2012j762K201J7006K2287P770j5643j1575J0577L901J3198K451
15735D1305o080j7334K448Q332j2139r552j1639M947K4465K1736p450j0024j5580
15722A3435n22n315k266O502J7151O910j3093l379J165j2918m862l004J5547Q393
15708B3744o316o76r688M60J5533J1567r789q883j0247N368J711p145o479N443
15694D603p470j3524J018J0770j867o33J4473L331j0672j998j8907p831J0275
15681a8432P068j3178m408r148n26R871J8288J3013J590r80J643Q904L634j3930
15667C409p777N957P167J6285k207o395j4456p103p346M283J7811J9388m131k4406
15653D79K715J3909l57q947j7469P073K4205r45j1952m873r844k334n703p550
$$ y = [17418, 12906, -9106, -10868, -8667, 8339, 30626, 38396, 22753, 11178, 21755, 25656, 38854, 41305, 35225, 17891, 20339, 28671, 16532, 6980, -4659, 288, 24753, 46489, 39039, 29015, 13435, 12913, 7598, 5332, 11834, 28985, 35895, 22802, 19423, 20588, 7670, 2808, -196, 15351, 23744, 17428, 16752, 7064, 7524, 23057, 34624, 24835, 15952, 5705, 11073, 12784, 5639, -840, 4603, -2867, -16391, -15373, -4603, -6470, -7103, 7370, 10701, 29, -1969, -20876, -28707, -18432, -11364, -24542, -28950, -38098, -38624, -28753, -10465, 2548, 4138, 3158, 4801, 13705, 17339, 3409, -4368, 1589, 8756, 25041, 22834, 16439, 1983, -5120, -12466, -8183, 9628, 29016, 24885, 479, 3194, 17103, 16746, 7799, -9670, -2597, 21608, 20663, 8711, 3838, -6006, -8340, -14043, -21593]
15639b1593m689K774K0681J7328n947o155K336j3655j934j756M636J5830N719
15626A3575j3839l440R748J319j75k400j0377r892j3219l754K782J0717Q269p395
15612a8081q297J2546N837J3393Q782J503j0928P234N018j9105o890R743J1104
15599A1859l598l156j447O704o324o296L245L757n792m842K599J1103L052k986
15585G878O00J968P218J957L407J216N709j4858j3183k649j0751l565O782K600
15571e671Q618k283n690J92o156j116Q041M835n573j4820m60N738K988o856L682
15556a4531j0503j323J8615R269q26p462J9179P805K506M550k266M47k5792j0060
15542a0392n50l535J484J1103j4969j520R45p177R41R190O993j197M877L902N001
$$ y = [-21593, -26282, -23508, -2827, 14501, 8554, 2399, 4735, -8920, -10854, -12610, -7974, 7856, 13575, -264, -3704, 6044, 7363, 7188, 4788, -5589, -15481, -28700, -32454, -29672, -18955, -10686, -18081, -26378, -13832, -7995, 5398, 14180, 15683, 4755, 11989, 17007, -2098, -8988, 755, 11859, 8261, 5105, 3658, 10362, 4038, -2258, 987, 4744, -1048, -5890, -3291, 7812, 10864, 7878, 8478, 10446, 17664, 19621, 23028, 24244, 29953, 15095, 1912, -737, -11488, -15053, -8271, -5671, 2947, 664, -5026, -4834, -10990, -12106, -4065, 770, -4803, -19623, -20083, -14345, -11357, -18213, -14531, -25034, -26357, -7742, 1527, 701, -6761, 12418, 20223, 22729, 27279, 25013, 25460, -332, -10392, -10942, -14477, -12993, -1890, -16859, -18379, -17434, -24611, -23670, -14480, -7487, -8684, -3807, 95, 5096]
15527E096L353L886m403pN436o313j6414Q353J8080p919n613l380O508K406k8943
15512a9874q840K3596O72p754p090J4031Q957j696M838N378q234o715n10o827
15498a0068n434J276K413q468P358O428j6191m404J1976Q56j3265R433K6856Q133
15484A6899j6666j4833p421L627l678M436Q512J0027R898j801n828l621n214Q296
15470B633J3740J5510K729k3500j1173l356P099J74j2002r861n154J0138N617
15457g406M015K973j4838k864M389r59L740Q869j9036j1594J0240l119O616J4495
15443d479j142L370k198n960J910p817J583Q769j0723l619J2165l635m57r419
15429b1652l207R09O767k781m653N418K6036K551j1461l750r939O534Q510o538
$$ y = [5096, 8449, 12335, 7932, 7925, 13361, 7048, -9366, -1013, 17067, 9148, 3535, 155, 6663, 9069, -19874, -28714, -5118, -4446, -12200, -19290, -5259, 3698, 2002, 6840, 12218, 3984, -2731, -3241, -10068, -15502, -14226, -11813, -20281, -12923, -6495, -22686, -27090, -15114, -14258, -27523, -18090, 8766, 16899, 233, -14600, -22021, -18394, -22072, -17636, -9124, 903, 10801, 9000, 3172, -449, -5663, 2633, 16373, 31883, 34612, 11112, -61, -3417, 3682, 3856, -8146, -18007, -23161, -13023, -7406, -3391, -418, -15256, -18120, -13731, -14690, -10950, -2081, -21117, -32711, -22471, -25590, -18974, -4479, -5621, -2251, -4449, -10409, -8499, -16316, -14733, -5964, -16687, -20306, -8141, -11776, -12233, -21652, -24859, -23950, -17183, -19964, -24617, -19199, 6837, 9388, -2073, -5823, -15762, -9228, -718, -7256]
15415g256r81j700M824m541m123N244k091j0478m376M312L979n903m360j0115
15401c7565j590J3881R69M215R129q645J739Q1n19K1449q88j8888j787J5463J1007
15386H051j0719l544P673J987j3344r397N361J4245n617p345J1729N185p05n121
15372a561j796n106M577J510n159p52o980q432M35J188J5283N783o364j4006j2188
15357c3568r22J4216J3042Q588o81j5733k942Q01o112J025N193M057L320P972
15343a744k0138k40J0034J1500J482p379o234n271K555L514M64o29r643N280P211
15328i238M758O370o511j2884o106N759J1388N723L026M07l640n726J288o847
15314a2233q838M225J0039J0967j3599l989P193R031k57m980N34M754O620O509
$$ y = [-7256, -8237, -9937, -5113, -9654, -13777, -8533, -10624, -21102, -25478, -21166, -17187, -23090, -27450, -37565, -39155, -25274, -24305, -20090, -10961, -19606, -17867, -17786, -18305, 3144, 2256, -16632, -18419, -2956, 8051, -2668, -6212, 1461, 3448, -9896, -19293, -13932, 313, -5304, -12649, -920, 4265, 3560, -1561, -3357, -8463, -3886, -2376, -7535, -8287, -15267, -23699, -23264, -22076, -6793, -1010, -7374, -21380, -33568, -34490, -20274, -7232, 1356, 675, -15058, -18000, -17199, -23311, -22286, -17093, -13036, -9716, -1744, -21882, -22122, -12088, -588, 894, -6485, -12719, -17990, -15435, -11921, -11457, -12086, -21729, -16449, -9238, -4480, 1890, -4621, -17505, -23611, -17852, -6464, -741, 2285, 2692, -948, -6674, -5386, -12233, -21071, -16846, -6807, 4160, -9439, -13428, -6235, 2796, 2539, -2441, -1907, 2847, 9467, 15976]
15300A5976k217k933j7092j6892J2255P878K084j2036r509j196M255K425M250
15287a2752J2312l307m534K808m322p354j0433j0753m436K218L578o005K870K0319
15273a9791K1831q992q289j4215L110J1154o858N608n453n157m207j1429M249
15260c8439M601o678Q477j980j1679q87P036K792O323J527Q541K1886Q168o953
15246B735j0148q443M901N545p719M26j2340j062l78J1636o71J6739n224L590
15232d13M929r899n574O171K4246j0255j2052r885l5L789K2282J630j5387j2215
15218a2668K203J1872j1280p410R669O750m034q273L280J1764N845K402j7888
15205g768k734N829K612N486j3753o003m077r606K594M368K983J5451J5285m032
$$ y = [15976, 13759, 10826, -6266, -23158, -10903, -3025, -941, -12977, -22486, -23682, -19427, -17002, -12752, -440, -3747, -8281, -5473, -9795, -17149, -27582, -38335, -42771, -40553, -36975, -42980, -40110, -19791, 2040, -6952, -15241, -29456, -26346, -15192, -22050, -16442, -21895, -27052, -31259, -42688, -38439, -33838, -40516, -32039, -34019, -45698, -46585, -39549, -36757, -30434, -28907, -20366, 1520, 9688, 2735, -7413, -15856, -10955, -5410, -13129, -12703, -25043, -26105, -26483, -14847, -15518, 1221, -4003, -413, 4516, -5383, -10957, -4786, 19460, 9205, -2847, -12732, -12767, -8978, 13304, 14934, -453, -12668, -10465, 1407, -9873, -17283, -7614, -864, -4898, -13171, -9891, 1873, 7718, 10120, -7768, -10502, -4673, -2061, 3425, -10328, -16331, -20408, -30014, -27420, -23052, -20069, -4618, 10667, 6635]
15191F635r712m678K42N81n758j4044R463K9320N28j765q048j1128j9140k670
15177c0174k004J4713o614l663N587Q523L961O490n859r07k144m437j92m618J0401
15162a0937L559r51J6264L622l266m489p106j0527j3149l61N991K271n706L63
15148b4422P468o607q40J7317O803K833N05n0J553r992n213q67N203K858j0182
15133a3633r323J309j969M064J979l316p915j662L731J122J0256q567n275Q629
15119b0570j131j0143N739M128J2466Q147p594K060m432O947o174j2378n565L793
15105b4707O393J1367K107N835k652K175K127p451j6431O148R732m536K585O576
15091g32J1599o596o729k346q322p789Q0P07p24M617N71N590K945L653k936Q943
$$ y = [6635, -3077, -7755, -7513, -6932, -12690, -26734, -17271, 12049, 12577, 10812, 2764, -8364, -27504, -30174, -32178, -17465, -24079, -27742, -22155, -13632, -9671, -3181, -9040, -9947, -12091, -16528, -16720, -21338, -10937, -7378, -8329, 7935, 11557, 8291, 3802, -3304, -13831, -26980, -27341, -21350, -19079, -24785, -24422, -16954, -23561, -24401, -7084, -281, 2552, 3057, 3007, 4560, -5432, -10645, -11512, -6309, -3451, -13633, -22956, -21647, -23616, -19552, -17573, -20889, -28804, -30466, -26735, -25613, -15357, -23924, -29199, -20570, -21701, -31844, -26105, -21977, -9511, -1364, -8958, -6898, -11330, -4383, -10557, -22935, -28500, -24707, -18314, -6947, -4840, 995, -1657, 518, 2645, -4806, -21237, -15089, -5357, -9893, -7308, -732, 10867, 4271, -2458, -4804, -13126, -20915, -20835, -20128, -20852, -16235, -15664, -10074, -7129, -3476, -6412, 2531]
15075B531O488j4849k048p333n477n86r850N978N359L538O209j2704j2291M332
15061c0703n25M493Q099l118J1813k377j0195k263J0718P631M398l325O72J0993
15047F311j1754j869j0671j88R353J7177J1828m43j3928n724n834j524p23o75
15033h664M249j565o131q325N808J3128k798j1306J54J8509R497j055q90r005
15019A606j4771j6480L581l583m563K654J7570j0617n484J1598J0796O793j269
15006b169L228o855p478L609m037o337K19P121o237o144R18K297K68p019J6496
14991a2120R937Q740j987n66J291j5275o857m352L736P839m538j1227J2682m60
14977a3157J146J7415m210j549J1047J302m835K038M910k970R95q648j8976j4421
$$ y = [2531, 9019, -5830, -7878, -15211, -20688, -21274, -31124, -25146, -19787, -16249, -10040, -22744, -35035, -30703, -31228, -26735, -18636, -21754, -9941, -12318, -22513, -24776, -14058, -6427, -2029, -5354, -4682, 6311, -5443, -7312, -17983, -18171, -8818, 8359, 20187, 19744, 5816, 92, -5742, -7266, -7989, -8664, -4415, -5980, -12111, -20436, -14628, -1500, -4298, -15604, -15450, 3059, 12556, 11501, 10611, 1606, -13165, -29645, -26064, -29647, -34210, -31556, -13986, -24603, -30087, -18489, -7693, -900, -2169, 1059, -5796, -13274, -9665, -13702, -20039, -19820, -12699, -18936, -25080, -24162, -21865, -21597, -28616, -12120, -2183, 6557, 4570, 4004, 5295, -9980, -16837, -21189, -17453, -9614, -14152, -25379, -12697, -13157, -12011, 5404, 1194, -355, 10692, 11994, 7159, 9197, 14107, 11137, 12132, 3484, -15492, -29913]
14963b9913P646l406J4658Q824L142J5467K2829J6613K276K9642N1871P0556O0122
14950B70327l8670j04681n5093j5642j2626j2079N219J694q693j0204r017l647
14938F888r296L296K583j5137M359R339P721J101P351Q759k563j2073o00O26p690
14923D664j0937j0791O858N872n948n841K165M886L404J0778R499J0509j0000
14910A5118k425n273q905o089P32J7526m918j6295j8308j2999J3564K930M000
14897b1342J613j313j0690O130l857O76J2631P403J6896K300j0004m060n168j6450
14883b5235J749l26K0166J2773l82j762n851k357L702j1349l806J436K952k77
14869h567q221L289r309k235m117R262J983O061J2432R45n95n485R758n671k2563
$$ y = [-29913, -22267, -25673, -11015, -2191, 951, 16418, 39247, 55860, 58136, 87778, 139649, 210205, 270327, 231657, 126976, 71883, 56241, 43615, 31536, 36755, 38449, 29756, 19552, 10535, 6888, -2408, 888, 3471, -11666, -7307, 2032, 9753, 10854, 18205, 26964, 24401, 12328, 11728, 12354, 4664, -6273, -17064, -10206, -4334, -10282, -16123, -13958, -9072, -5668, 5110, 14609, 25118, 15118, 12693, 7420, -1485, -7574, -6842, 10684, 5766, -10529, -28837, -41836, -28272, -25342, -21342, -19729, -21042, -31732, -25602, -29459, -28783, -16152, -8749, 8147, 10447, 443, -3617, -8785, -25235, -23486, -23812, -3646, 9127, 8745, 6983, 1132, -1225, 2477, -8872, -12678, -11242, -8290, -8567, -16788, -13499, -22808, -25043, -29160, -19898, -17915, -11854, 578, 1523, 928, -4557, 5201, -470, -23033]
14854b3033m557J9685J259Q381j530j6165n200l255J233l95O065R740q125l700
14840a9597k663q519J3145O987j436j785k610r532k774J1103Q095L70R414O532
14826F730p44p885j3851L910L889n73l400R453o371r738N488M141K168P706p441
14811f518o117M783P129k572P881M271j1433l614N057l423o047n408J2376m211
14797g846L323K2466O23k0049o600q753R73j38j310j3422J2057N520K755j8162
14783b8563L087N742O503K653P831Q630n02k1335N763Q955q125j3391P580J6863
14769A691J791m496N984o735L008j922N673j193j189M75q027j3762L25J9621l154
14754a910O182p535m069J0635J527o997q053m613O774p803l654L866N950l444
$$ y = [-23033, -27590, -7905, -6646, 1735, 205, -15960, -21160, -24415, -23182, -23577, -17512, -7772, -15897, -19597, -22260, -30779, -17634, -10647, -12083, -13868, -16478, -26010, -28784, -17681, -9586, -9216, 198, 6730, 5986, -1899, -15750, -11840, -7951, -8524, -11924, -2471, -8842, -18580, -13092, -8951, -6783, 923, -6518, -12635, -7852, -723, -3295, 4586, 8857, -2576, -6190, -1133, -4556, -10603, -16011, -3635, -7846, -4523, 17943, 18566, -1483, -8083, -16836, -15863, -16001, -17311, -30733, -18676, -13156, -10401, -28563, -25476, -19734, -13231, -10578, -2747, 5883, 5381, -15954, -10191, -1236, -9361, -22752, -15172, 1691, 3482, -1014, 4970, -1765, 1243, -679, 4994, 3801, 2612, 3087, -4940, -18702, -18377, 1244, -1910, 4272, -3263, -7332, 3303, 4830, -2167, -10220, -14833, -8059, -15862, -19516, -15650, -9700, -13144]
14740a3144M983J2004q751R686l776j7313J0507L719L807N518L796q88j2056l770
14726e678q309l660j307j9067r394J0916J1712L272n395l923N363J1763Q553L445
14712a709m026K507L954m153m212M601j818j699o411j207k254m803M312l365N625
14697a4658P73Q581L287q393l076N446m767p296l021N579J4217n529p570L060
14683a3367L834O107l577O463O563j089q565M916J823N505l24j4381q707P877
14669f922N268K964J3157n48k0799j8941J0969K015L431P777l509R095J628j0399
14655d814q725j5818J2477P94P69l365p208O498J0418n483p433O569M385K176
14641h760k149p576K177Q29M828q839j2583j776L775r11R885j936m658m079P347
$$ y = [-13144, -8161, 3843, -4908, 4778, 1002, -16311, -5804, -2085, 1722, 7240, 11036, 10148, -1908, -5678, -13987, -17647, -18954, -38021, -47415, -36499, -24787, -21515, -26910, -30833, -25470, -13707, -5154, -1709, -5735, -3228, 726, -3427, -7639, -3038, -4856, -6555, -12966, -14173, -16427, -21230, -16918, -20283, -14658, -13885, -5304, -2017, -10410, -13486, -8040, -12807, -20103, -23124, -17545, -3328, -8857, -16427, -13367, -9533, -3426, -7003, -540, 6023, 4934, -3631, 1285, 3108, 8613, 8289, -6092, -14799, -6922, -1654, 1310, 14467, 13919, -6880, -25821, -14852, -12837, -9406, -1629, -5138, 3957, 5585, -4814, -13539, -29357, -16880, -16086, -15317, -18682, -25890, -19392, -8974, -14457, -21890, -15321, -10936, -8760, -10909, -18485, -16308, -15479, -10651, -19490, -32073, -33849, -30074, -30985, -21100, -23036, -27694, -31773, -24426]
14626b4426Q905Q654J9354m694p452J0987J759m921j3883j6600N315Q649m66J458
14612g361n390P755o213l551J529M572j6254O003m821j2225L633P252J6405J1026
14598B360q173p228J392p579m259J608j400O679J9861K670j1285j5309j0456J6001
14584a5118J6434R474j0969l99k420J3001O408p587m869j6406J618J7972J0128
14571A7267j1425q072N451j0712r611p96J5600j588m399j362K526k699o67M227
14557f260P441p349L39k615N241K3823r462j2357r659n784K116N038N655l732
14543g565q962N990J786q488m470J9261P634k239j0609j3472N184o216l81P341
14529a5206Q141m229r133n292j4563L156J2184M863R831N70l860M443M612r475
$$ y = [-24426, -15521, -6867, 12487, 7793, 341, 11328, 13087, 8166, -5717, -22317, -17002, -8353, -8819, -7361, -12751, -4996, -11209, -14760, -13231, -8659, -24913, -18910, -23731, -35956, -32323, -25071, -8666, 2360, -5813, -13041, -11649, -19228, -23487, -21879, -23279, -16600, 3261, 5931, -5354, -20663, -31119, -15118, 1316, 10790, -179, -578, -2998, 10003, 16411, 8824, 3955, -12451, -10833, 7139, 17267, 5842, -2230, 3221, -7491, -17102, -17898, -2298, -3886, -8285, -9647, -7121, -9820, -10487, -6260, 1181, -6168, -5829, -8444, -3203, 20620, 11158, -1199, -10858, -16642, -14526, -9488, -3833, -7565, -16527, -10537, -8751, -17239, -21709, -2448, 5186, 2947, -7662, -21134, -15950, -22166, -22547, -15206, -7065, -11294, -20427, -25719, -40282, -37126, -24942, -20079, -10248, -9678, -13538, -9095, -4483, -13958]
14515a3958p600p280L533P326J24J3024k882n967J6110J356j8048j2227k68L804
14501b2953M330L914j0721j1236J7360J2056m587q513M878r717j60R181J0499
14488e669K586p537m67J3218p234n769K142R294q10j6076J386L082n092j2732
14474b9678J9107K019R45J6831M75r390j4964m850J716k871m615J513Q629p439
14460b2572J7092J9836M633j3151k0610l333K3222J6104j4082j4295R1J0690K844
14447F469O062k865q25o266m836L775r89j0777l41R876N182l678m494r886M164
14432i429P448J032j816K807r606k237n117M857J842m140N174J2856k140k950
14418a419r13R30q41r111j7701k667Q112J0160L943M82l757m321O987O873K730
$$ y = [-13958, -21558, -28838, -25305, -17979, -17855, -4831, -7713, -13680, 2430, 3786, -14262, -26489, -26757, -22953, -18623, -14709, -25430, -36666, -19306, -7250, -11837, -20350, -15472, -25189, -25349, -16168, -5669, -3083, -10620, -11087, 2131, -5103, -10872, -8730, 564, -246, -16322, -14936, -11854, -16946, -29678, -10571, -8552, -7607, 9224, 9699, 309, -14655, -19505, -17789, -20660, -25275, -23762, -15133, -22572, -5480, 14356, 18989, 5838, -14772, -18105, 5117, 21221, 7139, -7156, -7065, 3625, 6469, 12531, 9666, 8841, 2575, -2261, 1514, 525, -10252, -10593, -717, 4465, 787, -3707, -13593, -9429, -1981, -949, -2765, 42, -9564, -11801, -16918, -12061, -10219, -14359, -9185, 3671, 1531, -1419, -2332, -1402, -2243, -11354, -29055, -31722, -23610, -13450, -9507, -9025, -12782, -17103, -10116, -3243, -513]
14403e13M509J901o20k3067r589J3147J095J696j0630l764P44J2702J7346P725
14389A2682O338o193j1016q182l791Q053r247R531P726P86l044j110O113O719
14375A5365l172r176N435k21m487k189o704J95n031J3053n413n414J393n206K352
14360i220L998R993J4473N350q784j757n900l91Q070n829j394p008k443K988R305
14345A1451r645p259K86n095J2523M816p738M477j0457j317M727J3541k377l472
14331D461K941O736N287N039j6794o991N572J1140Q181J245o419r946K924M707
14317A8083O35O086j536o379J6610j1505j98N708J3799L916j1909q005R08m181
14303B2032l709R055j8137p584N655R970p691l735n385O289P881k41j10p906J798
$$ y = [-513, 3996, 5897, 5277, -17790, -27379, -14232, -13137, -11441, -22071, -25835, -25091, -12389, 4957, 12682, 19020, 12827, 1811, -6371, -10162, -2109, -11356, -1825, 5901, 6687, 3643, 2533, 8646, 15365, 12193, 3017, 8452, 8231, 3744, 1555, -5149, -4954, -9985, 3068, -2345, -7759, -6366, -11572, -9220, -5222, 4771, 19244, 24594, 15810, 14053, 8153, 7762, 15832, 10003, 8609, 1601, -842, 2146, 11451, 1806, -5453, -5167, -10262, 2261, 7077, -661, 3816, -6641, -7958, -3231, 10310, 7933, 4461, 7402, 14138, 19425, 24464, 7670, 679, 6251, 17391, 25572, 26817, 20398, 10452, 13376, 18083, 18718, 24804, 23268, 16889, 33499, 21994, 21796, 27504, 41303, 45219, 33310, 25305, 26213, 22032, 18323, 27378, 9241, 1657, 7312, 17282, 9591, 5856, 471, 6760, 14641, 14400, 14290, 6384, 8182]
14288H182K875K830J1830O796q501O690P331M967J406m210L221m464k674N176
14274D1455p234P272N762o544j566j7027o694K086J5045J5448p246q354m708m663
14260B3032M539K232j427N626J4416j2849n919J225J0021N22j0941l054k832q60
14246B3731M719j162j583j4818J038L844J3988J7883J0568o210k1740j5638P561
14233B2181r05o586N778p390N63L596j178M611M532o701J305Q437N819J1073J97
14218D5332j7649j4397l217J0445J3569J4322P756j1317j3942j5844j737m166
14206I155l588m023J856L978j831l832J3874P207r40R34J1956N811m318k31M173
14191D0181n135n609N531q8j0728M819J95n898K220o594Q00l576l737R819J7606
$$ y = [8182, 11057, 13887, 25717, 32513, 24012, 30702, 38033, 43000, 44406, 40196, 43417, 38953, 36279, 41455, 34221, 41493, 47255, 40711, 39145, 22118, 15424, 17510, 32555, 48003, 40757, 32403, 27695, 23032, 27571, 29803, 28376, 34002, 48418, 35569, 29650, 30875, 40896, 41418, 30477, 27423, 24591, 23731, 28450, 27288, 25705, 10887, 11925, 15769, 29757, 47640, 58208, 51998, 30258, 14620, 22181, 21276, 14690, 20468, 13078, 13641, 17237, 16059, 20670, 25202, 18501, 19806, 28243, 34062, 45135, 45332, 27683, 13286, 10069, 20514, 34083, 48405, 56161, 44844, 30902, 15058, 13321, 9155, 5567, 1544, 3400, 7378, 5547, 1715, 15589, 22796, 21856, 22790, 34746, 40557, 36239, 36008, 40181, 35046, 29437, 34968, 34880, 24152, 28971, 29166, 23268, 25488, 18894, 19694, 16118, 12381, 22200, 39806]
14176C9806j012q789p152J089N346L047k97j606p318o897J8690o047J983r944
14162B0899o459O133K483p782M176p986j0349r15o052j835N083J8973j7961q751
14148a0343R918L81P364J7638m178k9N174p17q119j1376m526K448J934R6Q325
14133A3990M095q945M018J1147K765Q656l807l164N984r919j7461j596L264M61
14119I488J6176p910j2263L153j1703k747N477J1636k527O829J30O032j2546o098
14105C127L074j756r946j5031O085q6k412L044J0504o03K225R393N532P47J0643
14090B4540L887p012R457J2843k0405j1432m457j3547j8546K082K519J1344L600
14077e127L175L65O47M282j921q930l604J2090k570j5663l760o51J1793K04j526
$$ y = [39806, 38794, 30005, 22853, 23942, 29288, 32335, 32038, 30432, 23114, 16217, 34907, 28860, 30843, 20899, 14440, 20573, 23056, 15274, 19450, 11464, 1115, 200, -5852, -7687, -2604, 16369, -1592, -10343, -425, -44, 7320, 24958, 20780, 20751, 25925, 25208, 17089, 5713, 1187, 3635, 5569, 5665, 13990, 18085, 9140, 13158, 24305, 27070, 35726, 31919, 28755, 34739, 24820, 7359, 5763, 9027, 9488, 25664, 17754, 5491, 8644, -3059, -5806, -329, 11307, 8780, 15609, 15739, 21771, 9225, 3127, 6201, 4445, -5501, -20532, -14447, -14533, -16945, -13901, -3397, -4000, -1775, 7618, 13150, 13897, 24540, 28427, 21415, 30872, 43715, 23310, 11878, 7421, -6126, -24672, -22590, -20071, -8727, -5127, -1952, -1587, -940, 3342, 1421, -7509, -11113, 977, -1593, -17256, -21016, -21667, -9874, -9670, -11196]
14062a1196n574O255k440M417k134J3892J0536r006m374P069k625j9734j1875
14049b6789J05q66N777J2615M637j9930K735L144J2053J5704K353p08n924J2203
14035A7109o391m570o823r27K1012r937j4449j0474r111R96K7472M058p810P739
14021G894n98p737j2895m042P77J211J1715j2306p48l212R409p970j4087m57K1533
14006a1513Q364m859M552K356J877R83l623k353m947m042L926M073O518O455m029
13991C738m411q386N83k788o233R411K380k109J016J4108q877n520j5537j201
13977b3826N91K022m554J408K529N947O204M960Q327P899J88m770j1824j025L137
13962b787q339K129K21p295l874m100O902J1932j0889j9684J02l14m023R959K2296
$$ y = [-11196, -16770, -10515, -12955, -8538, -10672, 3220, 13756, 4750, 376, 7445, 4820, -14914, -26789, -26684, -27550, -21773, -9158, -4521, -24451, -21716, -18572, -6519, 9185, 11538, 10830, 4906, 17109, 10718, 6148, -675, -1602, 19410, 9473, -4976, -15450, -24561, -23565, 3907, 7965, 155, 7894, 7296, -441, -13336, -17378, -16601, -15390, -3675, -15981, -16729, -19941, -10532, -18502, -32589, -33046, -11513, -3149, -8008, -3456, -1100, 777, 1760, -1863, -4216, -9163, -13205, -9279, -5206, 1312, 7767, 3738, -673, -9059, -8476, -11264, -17497, -8086, -5706, -7815, -6799, 7309, -1568, -7088, -22625, -23826, -23235, -21213, -25767, -24359, -21830, -15883, -9679, -4719, 3608, 11507, 11695, 6925, -4899, -5924, -2787, -11126, -8997, -8776, -16071, -19945, -24045, -17143, -5211, -16100, -35784, -35682, -35996, -40019, -30060, -7764]
13947g764j619j263K031k18l080J0875l902j9737P00J0870L52R224k502J884k023
13932f172J377K926J0554p968j5171K594O763M781o365m991o029O765P520R713
13918F297o49j1084P571j030p766j3366n27J1213L903O356j0683j9373L425O245
13904a9468O487J934m120j7425Q712n025j0650L171R999o750q674K326N613Q217
13890b5653Q643O088Q06Q662m525R669K29j4403l730j0127n257N490l225M062
13876b3271q060N090R784O144q342J761j566l544J504r991J5363J3792j1268K0378
13862G774M250k1575j1796m528q897r337N98J1719L621l988O450K11k659P057
13848b1100m252K848P795J1028R497j7061L58l086J10k107m833J136L07K943r163
$$ y = [-7764, -9383, -10646, -8615, -8833, -11913, -1038, -4940, -24677, -23977, -13107, -12755, -3531, -6033, -4149, -6172, -4795, -1869, 8685, 717, -14454, -11860, -5097, -316, -6681, -11672, -17701, -10936, -3416, 6297, 5648, -5436, 2135, 1105, -6661, -20027, -20554, -9341, -5438, 918, -9765, -29138, -25713, -19468, -12981, -11047, -15167, -32592, -23880, -28905, -39555, -36384, -26385, -33135, -41809, -39483, -33870, -25653, -17010, -10922, -10116, -1454, -5979, 3690, 3919, -10484, -14214, -24341, -29598, -24108, -27333, -23271, -31331, -26241, -16457, -10313, -18655, -16894, -18460, -22004, -20500, -30491, -15128, -1336, -12604, 7774, 12024, -9551, -21347, -25875, -34772, -44109, -43511, -31792, -28171, -32159, -25709, -25498, -28157, -21100, -25352, -22504, -14709, -3681, 5816, -11245, -10887, -13973, -13863, -15970, -20803, -19667, -19360, -16417, -25580]
13833b5580O10mj481Q349M733J1805J2598M446j1802l775k234n628K590k554K477
13818e450M064r138m145N632J0030n9j5485k4965Q1R740k052O680n387n386O257
13803b9583J3617K209Q760r909j301J395n373J607Q119Q025K373j5832q403o560
13789c0856l033J2479L790R897j454k781K093m848L701J8024m780j0884j4080
13776b2732m173J1041K393J0634j25L274k0309j2276J1748K979j6306M333O693
13763b2826p477J7168O177q336O627M477m534O822O45n576j2852m572j444M387
13749b1314N073l699j0880m489K700J0726J5948N048O74J324q266j0930L097J701
13735a3287o954j5164l148J1975J0675l263j0033m925K2993R899J857m70j920
$$ y = [-25580, -24970, -24974, -26455, -18106, -13373, -1568, 11030, 15476, 3674, -101, -2335, -7963, -5373, -7927, -5450, -1386, -10524, -14669, -9037, 993, 934, -14551, -39516, -39435, -29695, -31747, -25067, -30454, -35840, -29583, -15966, -13757, -4997, -14906, -16207, -14812, -20185, -18578, -10459, -2434, -61, -15893, -24296, -30856, -33889, -21410, -17620, -7723, -9177, -11958, -9865, -14713, -11012, 7012, 2232, -8652, -22732, -26905, -15864, -13471, -2837, -2962, 312, -19997, -32273, -20525, -17546, -33852, -29519, -22826, -30303, -13135, -6958, -15294, -8667, -4190, -8724, -1902, -1257, -6833, -19685, -24257, -25701, -21314, -16241, -19940, -30820, -35309, -32609, -21883, -5935, -887, -213, 1111, -7155, -18085, -14988, -13287, -20241, -35405, -38553, -26578, -15903, -19166, -29199, -34124, -11131, -1232, 625, 155, -1765]
13722a765j7092q922l644R526K2428L060p445r005k2912j5144M752P431n04Q566
13708c0670O916R907j2281N86j2117r556J5472K581M34R928O092L559M310N036
13694A97m351n345K195P576l816K739p715j8792P343J0609l752j4206K75Q74j0633
13679c6802j273J5006R155j0277l000Q586M976L393J4059o26j8587k3490J1016
13666b7864J7151P991l768j923o083l038k879o876j0503o00Q807M38m002L338
13652b9811o04l208K677q869P70J5164j975l28Q812k191M034J2335k453j0970
13638a6617j672k975j446L150m273J4337m327J098m555m024J271N305J1619L305
13624A96p080k910q70j857n84P977o579O79O374Q06k403m125j0707j0162P565
$$ y = [-1765, -18857, -27779, -31423, -21897, 531, 3591, -3854, -12859, -35771, -50915, -46163, -38732, -39236, -30670, -23754, -13847, -26128, -25542, -37659, -47215, -31743, -29162, -28728, -18800, -12708, -9149, -4839, 197, -4154, -9499, -7304, 272, -3544, -805, -8520, -27312, -19969, -9360, -13112, -27318, -27043, -26169, -36802, -38075, -23069, -13914, -24191, -27191, -18605, -13629, -10236, 3823, 3197, -15390, -38880, -27864, -10713, -2722, -6490, -8413, -14496, -17534, -20413, -27289, -37792, -38392, -29585, -29147, -33149, -29811, -30415, -33623, -30946, -39815, -39045, -23881, -25856, -26184, -17372, -19563, -15529, -3194, -5647, -16617, -18289, -21264, -22710, -19560, -23833, -9496, -13823, -12725, -17280, -21304, -20033, -14728, -3109, 196, -6884, -9794, -10664, -12521, -13105, -5128, -11707, -11028, -4654, -3848, -6251, -10376, -21083, -31245, -23680]
13609b3680R99o831P521k582J472O042Q97r577N063J1090J891J8987O990j507
13595A6775J5751J7343K234L461K384J0871J5070K5324L1638L0920K2327K6085
13583B20183L0148L5176M1102K2137J9006M0024L8051K6908J3278K3643K3302
13572E32958J0731M919K2795L591p49N055l208j2429k1156j7095n231k0438l4049
13559D65694k8275k6478l0784k9489k2461k2604k5798k7746k5485k6745j6077
13548A83752m180j7625k4167j3804k788p224j6118r357j3158q116P829O332p624
13535G3752k630O637j6898p205m278j948j3868j800l204l866J848m250J013Q236
13521C1539K375j1490J638J3102L483m282k999O771o627l563j099m146j0844r400
$$ y = [-23680, -22681, -29512, -21991, -24573, -23101, -17059, -16162, -25739, -20676, -9586, -7695, 11292, 18282, 16775, 32526, 49869, 52103, 55564, 57948, 68819, 83889, 109213, 140851, 171771, 194098, 220183, 250331, 285507, 326609, 348746, 367752, 407776, 445827, 472735, 486013, 509656, 532958, 543689, 548608, 571403, 574994, 574245, 579300, 576092, 563663, 542507, 525412, 520181, 499743, 465694, 437419, 410941, 380157, 350668, 328207, 305603, 279805, 252059, 226574, 199829, 183752, 179572, 161947, 137780, 123976, 121188, 113964, 97846, 88489, 75331, 67215, 75044, 81376, 73752, 71122, 77759, 60861, 53656, 49378, 47430, 33562, 31762, 28558, 24692, 26540, 22290, 23303, 31539, 33914, 22424, 24062, 37164, 40647, 36365, 33366, 40137, 33510, 29947, 28848, 24702, 13858, 4458]
13507D458n767Q589P505k296l51Q937L868q137j0263m201k049j2728J6501N278
13493I344n369M077N79q999o759j118P373J939j60Q228N735j0847n766l672O601
13478A186o268k232L743m792j4013k924o035j019J9990J0814J051J5975L276k790
13464A5962r485j1414o066J0158M541m853j712o097J1037M948q042l954q551Q502
13450e026J1073k1362j7814n72j215J7419J3163N476j1583l362K0158J7874j6989
13437G240j7380M253K2322j935k1920M430m527K353Q034m173k523P931j3343L343
13423e895O003J138N379l691q552J72j3752q503M771L218M678O567l288k957j6827
13408c1539l607J374P708Q013M72j2897q525J4009L600l345K254J2483J6446m986
$$ y = [4458, -1309, 7280, 14785, 12489, 12138, 21075, 24943, 16806, 6543, 2342, 293, -12435, 4066, 9344, 3975, 8052, 8631, -368, -7127, -8245, -872, 1067, 907, 9135, 14870, 4023, -1743, -5415, 1186, -5082, -7314, -3571, -8363, -22376, -25300, -31335, -32354, -12364, -1550, -499, 15476, 18752, 15962, 6477, -4937, -11003, -845, 3696, -1157, -2869, -8966, 2071, 7019, -1023, -4977, -13528, -5026, 6047, -15315, -33129, -33701, -34916, -17497, -4334, 1142, -10441, -13803, 6355, 24229, 7240, -10140, -5887, 16435, 14500, -7420, -2990, -7517, -5164, 2870, -1303, -3826, 4105, -9238, -5895, 108, 1246, 6625, 2934, -5618, -5446, -19198, -27701, -22930, -19712, -15034, -8467, -11755, -14712, -31539, -35146, -33772, -26064, -18051, -17579, -30476, -39001, -24992, -21392, -24737, -22483, -10000, 6446, 1460]
13394A460M236k648j3010J1190J4765L489j4641p240J0592J948m486p244K480
13381H91j871r865n868p96o025J2661P133q216j4698j2574j152J6916Q188J5309
13367C3K624j4422l416M227N300r314j55J42M105J6180N472L985j763p607L071
13352H462J381J626r961L444n434j796M788J290l920P357N480n813J19k929N114
13337I208l976j2277M089k281r039p071O502P203R405Q648o599l901n931l515
13323i535J6497L673P928m465n539n494j4129n562J872J895K966J3769O022l92
13309I506j1300k2824l28J0280J3423K5842o706j7018j5712M900J2165k600K249
13296A877J607l900o017j735J3870Q47r452j1935j934J7877J3364R15n614j2688
$$ y = [1460, 5696, 3048, -9962, 1228, 15993, 19482, 4841, -2399, 8193, 10141, 5655, -1589, 891, -980, -10845, -16713, -17509, -23534, -10873, -3740, -11956, -26654, -39228, -40380, -23464, -15276, 33, 2657, -11765, -15181, -10954, -5654, -14968, -15123, -14981, -10876, 5304, 10776, 14761, 12998, 5391, 8462, 9843, 11469, 1508, 4952, -482, -2278, 2510, 3800, -120, 7237, 12717, 6904, 7023, 4094, 9208, 5232, -7045, -2956, -5237, -14276, -21347, -14845, -7642, 1763, 10411, 3812, -89, -6020, -9535, 6962, 10635, 18563, 14098, 8559, 3065, -11064, -16626, -14754, -12859, -9893, 3876, 9898, 9506, -1794, -24618, -24946, -14666, -1243, 24599, 17893, 875, -14837, -9937, 2228, -372, 1877, 3484, -416, -6433, -8168, 5702, 6549, -2903, -14838, -16772, 1105, 14469, 15384, 9770, -2918]
13282b918j0619J100k847J7434Q593J084N634J633l278j2331j0576K983M80k0642
13268b4270r16J5584j580Q42m801k092j3375r479K4028J500L023n440j4777j3116
13254d4869j471J8127J6592q357o890N882M005n292n428K583J506j3894R510J6305
13240a1691N86p744n284K404K853j3246M222J3139l723j4385O761m754R057J8048
13226c757K790j5057m949j335N506j437k789J331p456J3597r304l804P108J3586
13212e970q928r368J953l310J9612J1956M174m066J5385j3134j4997O471J745
13199A523N65J088l115j7273P566L997n470k465N437M336Q95O493m188j5974K169
13184a4416N723J785m629l982k121R156R340J92k273r575K589J0142K209p819
$$ y = [-2918, -13537, -12437, -15284, 2150, 10743, 11827, 17461, 19094, 15816, 3485, -7091, -4108, -3628, -24270, -25186, -9602, -11182, -10340, -15141, -17233, -30608, -40087, -16059, -14559, -11536, -16976, -31753, -44869, -46340, -28213, -11621, -19978, -26868, -20986, -16981, -22273, -27701, -25118, -23612, -37506, -27996, -11691, -11105, -18849, -24133, -21729, -18876, -32122, -27900, -14761, -18484, -32869, -26108, -30862, -21805, -3757, -967, -16024, -20973, -22308, -16802, -18239, -21028, -19697, -27153, -13556, -22860, -26664, -19556, -5970, -14898, -24266, -22313, -25623, -6011, 5945, 10119, 6053, 21438, 8304, -6693, -222, 1523, 2088, 3176, 61, -17212, -9646, -5649, -11119, -13584, -8147, -3811, -2916, 3577, -611, -16585, -14416, -8693, -6908, -11537, -15519, -17640, -8484, 856, 1048, -1225, -10800, -8211, 1931, 4140, -3679]
13170c679k066j233j5750m756k877O184P513N420j039N862J7405n336m600O378
13156G426M396m24M757j1215j0553N934K908j182J11J5869J1189l639j1328j3670
13142E79j315K053J6895K1543J206p635j091J0238K5225K8337J8107J4240K9472
13129A57854N7160R3475J00019J05927J18057J34161J48556J57612J58351J25601
13119A356773J21041J21153J02639O7117J2116k8156p1703p7087p4725j11310
13109A417858j29706j39535j47401j20212r3951r0313q0539q3716o7058m2458
13099D22969m3057n1726j0576k2443l0156j4427j5502o765k977j2879j0324l026
13087A99111o684j2946m29p432j2349q171j1013r213L863Q751J080n587j1998
$$ y = [-3679, -5745, -6978, -22728, -27484, -30361, -24177, -16664, -11244, -12283, -6421, 10984, 5648, 1048, 7426, 11822, 11398, 16155, 4940, -5613, 321, 3229, 2047, 2158, 18027, 29216, 25577, 14249, 579, -736, 1317, 18212, 39755, 40961, 33326, 32235, 42473, 67698, 96035, 114142, 128382, 157854, 215014, 308489, 408508, 514435, 632492, 766653, 915209, 1072821, 1231172, 1356773, 1477814, 1598967, 1701606, 1768723, 1780839, 1752683, 1680980, 1603893, 1529168, 1417858, 1288152, 1148617, 1001216, 881004, 787053, 696740, 616201, 532485, 465427, 422969, 379912, 328186, 317610, 295167, 265011, 250584, 235082, 228317, 225340, 212461, 202137, 199111, 192427, 179481, 179052, 171620, 159271, 151100, 140087, 130874, 134737, 143488, 144568, 138981, 126983]
13074A26983R813J4683n307j7476j7956J056o832R767j7942j5396Q059L79n339
13061H4492k787lr664L473J4124l081j4388o386p494k561J1505J5244J5578j4795
13047H3257j2829J483L931m896k213j0508j4794M71k826M760J6717O514L15j3926
13033E5456p430K943j3346q551r967n279J0656J8056l078j175L151K719n218p1
13019C8866q251p106q633P620O31o382R8J284j613Q045L935L875r573k2776l968
13004c948m46n810q671m727k0454k714j790n685P99o387P451K2297J580k176n455
12989c6136l605J2541J9050J1840j120j2763j56p018K856J1474Q140L285o479
12976A909N491l120m472P545J0929k467k033R133Q207p253j1834O880J729j2582
$$ y = [126983, 136796, 151479, 146172, 128696, 110740, 111796, 104964, 114731, 96789, 81393, 89452, 89831, 84492, 81705, 81702, 72038, 75511, 89635, 86554, 72166, 65780, 58286, 55725, 67230, 82474, 98052, 83257, 70428, 71911, 75842, 70946, 68733, 58225, 43431, 43902, 41076, 45836, 62553, 69067, 69382, 55456, 48026, 50969, 37623, 29072, 19105, 13826, 24482, 42538, 39460, 38285, 41436, 44155, 38937, 38866, 30615, 23509, 14876, 22496, 23127, 16745, 16843, 18127, 16514, 24559, 28494, 32369, 22796, 20, -3948, -4394, -10204, -18875, -23602, -44056, -46770, -48560, -54245, -53446, -59833, -52382, -30085, -28505, -30681, -36136, -39741, -27200, -8150, 3690, 2570, -10193, -10349, -17367, -14511, -3037, 5103, 8388, 1909, 7400, 4280, -192, 7353, 18282, 15815, 13782, 22915, 31122, 23869, 12035, 18915, 20644, 8062]
12962H062Q445J5539L818o295m61p256m3o593Q429J7005L352m894N002N684R077
12947E8871m808j0448R051J8028K6749J8460R926J7454K9268J4487J692j0769
12935A77961O618p135K679k351j1998K403j2001k2179j8357L82J0151J2138m579
12922A33732j0302k819P384O392K680o640m977j086p460R783M991k818K928q803
12908A22985J260R826j5240n823L163O565r767j4338k776j39m999l339m925P660
12894I0113j2721m346L297P790K718J6251J6944Q522O126P988q9p120N225J0034
12880A50732P854k015O997r983j590J962N599r234j1114q617L936p752j0066j144
12866A15565N757n15L994R955j1603r077m981j025P265m785k44j2845o054k56
$$ y = [8062, 16507, 32046, 35864, 29569, 29108, 21852, 21809, 15216, 23645, 40650, 44002, 39108, 44110, 49794, 58871, 54063, 43615, 52666, 70694, 97443, 115903, 125829, 143283, 172551, 187038, 188730, 177961, 184579, 177444, 180123, 177772, 165774, 168177, 156176, 133997, 115640, 116022, 126173, 138311, 133732, 123430, 120611, 127995, 134387, 137067, 130427, 125450, 124364, 116904, 126687, 131678, 128860, 131788, 122985, 124245, 134071, 118831, 113008, 116171, 122736, 112969, 98631, 95855, 95716, 90717, 87378, 82453, 90113, 77392, 73046, 76343, 84133, 86851, 103102, 120046, 128568, 134694, 142682, 142593, 135473, 140698, 150732, 158586, 156571, 163568, 153585, 151995, 153957, 159556, 150322, 139208, 130591, 134527, 126775, 116709, 115565, 121322, 120807, 124801, 134756, 123153, 114076, 109095, 108070, 115335, 110550, 110306, 97461, 91407, 91151]
12852I1151K960L635j2601Q680Q798N968J3727O888J5946N025J3942J9941K4562
12839B08622J3178R950L384Q257O456j211J1864J2934j265m807p560n63j2689
12826B46550M963n801J89m219o878k83L965n964m255Q437K3553J7043J7893r14
12812B94279O493n583n540Q877J6096R401J0952p89p640o615Q749L52J205K0058
12798C50295L487J5363J2232O292j324L9304L2496K6182J4476J3171M018J0631
12786E26623N844J3539J8416J6072o547N147J3510J0759O434q282j9666j0654
12774E71195J5205J0799J7253K9700J4124K921N249K2642L221K123J8585J1730
12762G24747R495J784K366J852k802j219R555O356M954J5213K0368K2062M347
$$ y = [91151, 94111, 97746, 85145, 93825, 102623, 108591, 122318, 129206, 145152, 150177, 164119, 184060, 208622, 221800, 231750, 235134, 243391, 249847, 248636, 260500, 273434, 272169, 267362, 259802, 259239, 246550, 251513, 245712, 245901, 241682, 234804, 234521, 238486, 232522, 228267, 236704, 260257, 277300, 295193, 294279, 300772, 295189, 289649, 298526, 314622, 324023, 334975, 334186, 326546, 319931, 328680, 329032, 330237, 350295, 353782, 369145, 381377, 387669, 386345, 425649, 458145, 484327, 498803, 511974, 515992, 526623, 532467, 546006, 564422, 580494, 573947, 579094, 592604, 603363, 609797, 601515, 581849, 571195, 586400, 597199, 614452, 644152, 658276, 661197, 666446, 689088, 692309, 694432, 713017, 724747, 734242, 736026, 738392, 740244, 737442, 736223, 745778, 752134, 757088, 772301, 792669, 814731, 819078]
12749H19078K6568K4667L7841M0488L8671K9185L4464M2436L3688L9337M6571
12738A212994N8264M4345M1276N5216N1561P3039P2253O5424N3092O2183Q0073
12727A869720Q9370Q8623J07955J00215R9092J19787J63356J90215J95835K29850
12717C254018K59182L14263L82040M48903N23613O02973P06598Q46711R89442
12708H327743J168401J382670J599042J895911K316117K872137L706472M924017
12700B8192510O721121R145987J1920207J4720264J7093879J9334489K3072192
12693A30200649K7083927K9611318K9225797K4749420K2538324K1369238J8568719
12686C03347392J5310694O351731j720510p721838j4232355j5323707j7419040
$$ y = [819078, 845646, 870313, 908154, 948642, 987313, 1016498, 1050962, 1093398, 1127086, 1166423, 1212994, 1271258, 1315603, 1356879, 1412095, 1463656, 1536695, 1608948, 1674372, 1727464, 1789647, 1869720, 1959090, 2047713, 2155668, 2255883, 2354975, 2474762, 2638118, 2828333, 3024168, 3254018, 3513200, 3827463, 4209503, 4658406, 5182019, 5784992, 6491590, 7338301, 8327743, 9496144, 10878814, 12477856, 14373767, 16689884, 19562021, 23268493, 28192510, 34913631, 44059618, 55979825, 70700089, 87793968, 107128457, 130200649, 157284576, 186895894, 216121691, 240871111, 263409435, 284778673, 303347392, 318658086, 325009817, 323289307, 315567469, 301335114, 286011407, 268592367]
12679B68592367k0870395k3629629k6851363k4853428k0596758j7653757j5786067
12672A18350970j4764248j2683946r896704p625745o071340m984313m169582l576940
12664E4578152l129782k766462k464704k202220j996939j845676j676095j524431
12656C6971843j431159j361024j283064j220950j165786j090032j035152r72544
12648B7412132r27353q93916q59383q15896p74259p69553p22518o65826o51599
12639B0331829o47570o07185n71193n23516n04873m92551m77656m35751m25735
12630A5645799m17387l80226l82243l64320l49574l23695k99878l01419l01950
12621A2525107l00352k85251k87960k78220k83366k76341k64694k64828k68242
$$ y = [268592367, 247721972, 224092343, 197240980, 172387552, 151790794, 134137037, 118350970, 103586722, 90902776, 81006072, 73380327, 67308987, 62324674, 58155092, 54578152, 51448370, 48681908, 46217204, 44014984, 42018045, 40172369, 38496274, 36971843, 35540684, 34179660, 32896596, 31675646, 30509860, 29419828, 28384676, 27412132, 26484779, 25590863, 24731480, 23915584, 23141325, 22371772, 21649254, 20983428, 20331829, 19684259, 19077074, 18505881, 17982365, 17477492, 16984941, 16507285, 16071534, 15645799, 15228412, 14848186, 14465943, 14101623, 13752049, 13428354, 13128476, 12827057, 12525107, 12224755, 11939504, 11651544, 11373324, 11089958, 10813617, 10548923, 10284095, 10015853]
12612A0015853k69162k49611k45998k36497k17882k18454k14451k08435k05053
12603G950310j97031j70361j74387j62665j54279j67054j46578j40111j43204
12594F494640j43098j36751j34949j27723j52417j37345j18924j06759j02186
12585E334488j06666j16937j05918p9034r6802j02742q8279r4079r0675p5980
12575D377376p8610q4778q4110o0928o1913p1749o8295o4332o8026n8874o7478
12564C608283o5634o8207o4627o7423n8536n5858q8910r1516p3153o7133o0756
12553B846530m2556n8908p0395o4817n7738l9040l4797l2229l2000m4916n2227
12542B316907m6498m4892m4823m2409m8373n0518n1777n2672l7477m1539k7598
$$ y = [10015853, 9746691, 9497080, 9251082, 9014585, 8796703, 8578249, 8363798, 8155363, 7950310, 7753279, 7582918, 7408531, 7245866, 7091587, 6924533, 6777955, 6637844, 6494640, 6351542, 6214791, 6079842, 5952119, 5799702, 5662357, 5543433, 5436674, 5334488, 5227822, 5110885, 5004967, 4925933, 4829131, 4726389, 4638110, 4544031, 4453356, 4377376, 4298766, 4213988, 4129878, 4068950, 4007037, 3935288, 3866993, 3802661, 3734635, 3675761, 3608283, 3542649, 3474442, 3409815, 3342392, 3283856, 3227998, 3139088, 3047572, 2974419, 2907286, 2846530, 2803974, 2745066, 2674671, 2609854, 2552116, 2513076, 2478279, 2446050, 2414050, 2369134, 2316907, 2270409, 2225517, 2180694, 2138285, 2089912, 2039394, 1987617, 1934945, 1897468, 1855929, 1828331]
12531A828331m1173l0757l6024j3588j3127m4402l1694k4468k5908j7587k8710
12520A520893j9356j0614j3642j7294l7129k9410k0271k6914k1935j9718j6890
12509A287720k1326l5179k7995j4857k6518k9664k2616j3883r127k3702k3627
12498A039226k6197j5880j3225o821j1606j8639j4519j2300k4918k4180j3410
12487H57531j8721k995J328j3997j5679r100m87K300M541k866L286k3311j1727
12474G70103j6185k6925j4753j2951k1228k1601l5637l6772k103r887r170k7482
12462E35409j2509j6449j6057o141j2831j6035j3865Q043K706j1484j2060j4231
12450D14496L473k802j4796N772M32J2615P255p422j0954k1058k0983q289M49
$$ y = [1828331, 1787158, 1756401, 1720377, 1706789, 1693662, 1649260, 1617566, 1593098, 1567190, 1549603, 1520893, 1501537, 1490923, 1477281, 1459987, 1422858, 1393448, 1373177, 1346263, 1324328, 1304610, 1287720, 1266394, 1231215, 1203220, 1188363, 1161845, 1132181, 1109565, 1095682, 1086555, 1062853, 1039226, 1013029, 997149, 983924, 977103, 965497, 946858, 932339, 920039, 895121, 870941, 857531, 838810, 835815, 837143, 823146, 807467, 798367, 797880, 800180, 804721, 801855, 805141, 781830, 770103, 753918, 726993, 712240, 699289, 678061, 656460, 620823, 584051, 581948, 572061, 562891, 535409, 522900, 506451, 490394, 484253, 471422, 455387, 441522, 449565, 452271, 440787, 428727, 414496, 417969, 415167, 400371, 406143, 406575, 419190, 426445, 419023, 408069, 387011, 366028, 357739, 358188]
12437C58188r64m186J915O220Q425m032m539l530N483J1863J8888J0192p50k240
12423D00933k2444k2568k0415j6272k725L486k06j1049k0257J2642q224p863j477
12410B83561l536N919r594n946K226J840K837L249p35j18P858P44j1129J316J602
12395B80094p209n048j3174r354J439R539l419k490o899j4498L77J6598N239j5946
12381B35249j669L001J277l853J9214R425N609J5740L208j4729k209k495j5174
12368B52594j5462p564m842r660M219l189l473o093k221l269K940P964q130j5844
12354A87970l014o335J246J3324J0434p93p817p914j0469j6297m957j855J5311
12341A68834J7364j1042j7561j254j3207r779O347M165j1609r327j1650N57N153
$$ y = [358188, 357224, 353038, 354953, 361173, 369598, 365566, 361027, 357497, 362980, 374843, 393731, 403923, 403173, 400933, 378489, 355921, 335506, 319234, 316509, 319995, 319789, 308740, 288483, 301125, 292901, 285038, 283561, 280025, 285944, 276350, 270404, 272630, 274470, 277307, 280556, 279821, 279703, 287561, 288305, 277176, 278492, 280094, 272885, 267837, 254663, 245309, 246748, 256287, 252868, 250378, 243479, 228981, 229358, 245956, 251195, 235249, 233580, 236581, 237858, 234005, 253219, 262644, 268253, 283993, 287201, 272472, 270263, 267768, 252594, 237132, 229568, 224726, 215066, 219285, 216096, 212623, 206530, 204309, 201040, 203980, 211944, 203814, 187970, 184956, 178621, 179867, 193191, 203625, 202832, 195015, 187101, 176632, 160335, 155378, 153523, 168834, 186198, 175156, 157595, 156341, 143134, 133355, 139702, 143867, 132258, 122931, 111281, 111838, 116991]
12328A16991O397j932Q606o186J296j1513n727j4187k861P694j103m261R956n07
12314A02663n683j5358L387P617R113m919J350Q148j0677j3331J1858R497K565
12301A06230q792m924J0367l662m246q983j4116j046L305J0348M217j649J1172
12288I8221J1175M858k2835P247Q054m403J4389p985r764p77l344J8533N561p455
12274A11475p488J3155N450L698m31n399J8503R541Q734J0246L3114L8339N1467
12261B90404N5332N6504Q3790J06308J38338J54962J62317J56765J26592J20888
12251A452200J14256J12322Q4932M7252p069m2024o5157q2064j16314j17902j06540
12240A273892j34128j39929j02946p3769p5401r6076q3563n6756l5161l0686j5831
$$ y = [116991, 123388, 121456, 130062, 123876, 125172, 113659, 107932, 93745, 90884, 98578, 97475, 93214, 103170, 102663, 96980, 81622, 85009, 92626, 101739, 96820, 98170, 106318, 95641, 82310, 94168, 103665, 106230, 97438, 92514, 102881, 99219, 94973, 85990, 71874, 70828, 74133, 84481, 88698, 87049, 98221, 109396, 114254, 91419, 98666, 106720, 102317, 116706, 108721, 98957, 98180, 94836, 113369, 118930, 111475, 103987, 117142, 122592, 126290, 125859, 120460, 138963, 148504, 157238, 167484, 200598, 238937, 290404, 345736, 402240, 486030, 592338, 730676, 885638, 1047955, 1204720, 1331312, 1452200, 1566456, 1678778, 1763710, 1810962, 1803893, 1761869, 1696712, 1614648, 1498334, 1380432, 1273892, 1139764, 999835, 896889, 823120, 747719, 651643, 568080, 511324, 476163, 445477, 429646]
12229D29646j6991l1337j1719k1727l9032k0674n66o444p303r343j0495j7887
12217B36128p080o349o655p845K127m253j1977J1458l658j0329l922k65p630j0002
12203A69748o468M504N820j1929p434K479Q582j1163m403j910K6l13j485k248
12189A43806P554r80j674j1429m193m610kJ424p474j1661n303n956P849L783k1541
12174H9593k948J882r63N644P184l914M347R971l900l010o447o553Q003q07k225
12159I5857J3223j2395J87N69k035P691n787r247m842J278L951M783p47j1859
12145H0627p030j623p167P773n276O880Q520r316o862M619P962R565K749n622
12131H5799k0610p986J2250n673j8200L069J7219N254o571J069J627m867j0935
$$ y = [429646, 412655, 381318, 369599, 347872, 308840, 288166, 287600, 281156, 273853, 264510, 254015, 236128, 229048, 222699, 216044, 208199, 210326, 206073, 194096, 205554, 201896, 191567, 187645, 187380, 179750, 169748, 163280, 167784, 173604, 161675, 154241, 156720, 165302, 154139, 149736, 147826, 147852, 147539, 146054, 143806, 151360, 150380, 148706, 137277, 133084, 128474, 128472, 129896, 122422, 110761, 105458, 99502, 107351, 111134, 89593, 86645, 88527, 87564, 93208, 100392, 96478, 100825, 110796, 106896, 103886, 97439, 90886, 98889, 98082, 95857, 109080, 96685, 96872, 97441, 95406, 103097, 97310, 88063, 83221, 84499, 88450, 93233, 92486, 80627, 73597, 71974, 64807, 72580, 67304, 74184, 82704, 73388, 66526, 71145, 79107, 88672, 91421, 85799, 65189, 57203, 69453, 63780, 45580, 48649, 65868, 71122, 64551, 65620, 67247, 62380, 51445]
12118E1445N800J4178p309j3154m152J4012J721j6886M681J3505O664j0670o584
12105E3251Q118P990J420j9627j6213j3945R040R171L560L122l612j3726Q614
12092C7163K0663j649j0322o935M81M911P536j0528K169J1042j139n135j2467
12079C5790j3146m373J4754N284j451Q939M510l892Q722Q180L320O132L183o637
12065F9315K958P865J359j1065l71p631j0251j2634J4598J475j134J0895k268
12052F3111o671q489j7005J0324J6243r996j5355J535J4072j733j8144r177N583
12039B4298P617J6074M728j6867n077k749o654J3237k014j4904L808j721j6022
12026C754k426j711m963o00P765m029M315J2259K231r914o433l783K230K399p340
$$ y = [51445, 57245, 71423, 64114, 50960, 46808, 60820, 62541, 45655, 50336, 63841, 70505, 59835, 53251, 61369, 69359, 70779, 51152, 34939, 20994, 30034, 39205, 42765, 45887, 42275, 28549, 37163, 57826, 56177, 45855, 38920, 39401, 44312, 51848, 41320, 43489, 54531, 53392, 48257, 35790, 22644, 18271, 33025, 38309, 36858, 45797, 50307, 46415, 55137, 63317, 66637, 72769, 75952, 69315, 72273, 80138, 81497, 70432, 70061, 62430, 52179, 39545, 54143, 55618, 54484, 65379, 63111, 56440, 47951, 30946, 41270, 57513, 47517, 32162, 33697, 47769, 46036, 27892, 18715, 24298, 31915, 47989, 52717, 35850, 30773, 28024, 21370, 34607, 32593, 17689, 21497, 19776, 3754, 1328, -383, -5346, -5946, 1819, -2210, 2105, 14364, 16595, 6681, 248, -3535, -1305, 1094, -6246]
12011f246O518Q760L728N662Q095M85j0216q118J0213M924n977l273j0434L486
11997G607J313j7654J7307K6426K231m717k35L371n458j0895k737O00j242J3670
11983B9587K218J0830K833J270j2921j6005M077P87L30N686q997q011q41K3022
11969C3865m46J0527n83n342j0589j2888J0470J669j3168j2611M944J0013J338
11956A7199M587R732q842J57l68n141N126M110n625q332o40Q652J084L218q780
11941A6137L869p482Q939J3309k576J2674L045q312K306m386j1153j38J3654o421
11927C3465o016M603N67N414L779K841r05J97l899p320l597K693K1332J14o222
11912D7046j5343M217j0993r205j363j139P734L145M077j2256q106Q043K829k942
$$ y = [-6246, 272, 9032, 12760, 18422, 26517, 27002, 16786, 8668, 18881, 23805, 17828, 14555, 4121, 7607, 8920, -8734, 8573, 34999, 37230, 32513, 32278, 35649, 30191, 19296, 16559, 17159, 15917, 29587, 31805, 42635, 45468, 46738, 33817, 17812, 21889, 22676, 23006, 28692, 19695, 11684, 10843, 33865, 33419, 43946, 43363, 38021, 27432, 14544, 25014, 26683, 13515, 904, 5848, 15861, 17199, 21786, 31518, 22676, 22833, 22465, 17324, 22450, 26560, 20935, 12603, 11963, 20615, 21699, 24917, 16137, 20006, 12524, 21463, 34772, 32196, 44870, 47915, 39603, 41909, 37523, 26370, 26232, 39886, 33465, 27449, 32052, 32619, 38033, 41812, 44653, 43748, 43945, 40046, 32726, 29129, 31822, 53154, 53268, 47046, 31703, 35920, 24927, 15722, 14359, 13220, 20954, 24099, 28176, 15920, 7814, 15857, 18686, 15744]
11898A5744M247J3863j1891M22L508J1430N919l530K453j4169k288M743j606o609
11884B2236O324k128j5086K763Q162M344q263J4861j377p510o371J288N870J067
11870B6180M136m324Q141M263j7847k739j879m845o51K618j272k752N981n564
11856I446K795R432J5959p659R541N29J210K778p813m106j2756O779J2327j303
11842C7159j4703J083O57J0798n069l255j2968n025p836m762L344n289J227Q475
11828C836L671n11p427P551J669m939K671k0078j6198R311M07p437J1120J1315
11814e039K285J1633n020L373R010M378o030j7916j349L532p60L547j683l893
11800c932r363j0907K2504J6687K930P11k573l871k598N751L192n52P53O460Q722
$$ y = [15744, 19991, 33854, 21963, 22385, 25893, 37323, 43242, 39712, 42165, 27996, 25708, 30451, 28845, 22236, 28560, 26432, 11346, 14109, 22271, 26615, 18352, 33213, 31836, 24326, 17955, 19243, 25113, 26180, 30316, 25992, 34133, 38396, 20549, 17810, 15931, 11086, 10435, 13053, 11781, 9029, 15010, 9446, 12241, 21673, 37632, 29973, 39514, 40043, 41253, 44031, 36218, 32112, 19356, 26135, 38462, 37159, 22456, 23539, 24196, 34994, 29925, 26670, 13702, 8677, 841, -3921, -577, -5866, -4639, 3836, 7507, 6996, -431, 7120, 8789, 3850, 6521, -13557, -29755, -20444, -20037, -27474, -16354, -5039, -2754, 8879, 3859, 7232, 16242, 20620, 14590, -3326, -4675, -1143, -1903, 1644, -39, -3932, -13295, -24202, -1698, 14989, 17919, 18630, 16057, 12186, 9588, 15339, 18531, 17979, 18732, 25192, 33914]
11785C3914N999j2018j0692k85k465q811j869N96N498Q594J8846l481j1278q227
11771A4321J0139J2802j4817M750L996m159q1q551p196O010l351j5314n078q866
11757a5395J4948L761J5076Q806L426k77K111N592j473k3662p515l777J1712J2049
11743B5382R95j0053j9979J91J2839L882J1571J415j3613o888o700O465q936o958
11729a0387R752P293m936J83M015N367p75j8248q932l073J2614M751p633R493
11715e16O262K476k677O984r990R819J0172q804k059k477M244M519o424J62q112
11700C579m548K827L271R71L017N980j917k002l25l916J0628L150L470j638j5382
11685G165r724j65j2274q34q846N312J4392J0092J0420K267o378n431O073J4275
$$ y = [33914, 39913, 27895, 17203, 16918, 14453, 5642, 3773, 4369, 9867, 18461, 37307, 33826, 22548, 14321, 24460, 37262, 22445, 27195, 31191, 27032, 26951, 18400, 11204, 17214, 13863, -1451, -6529, -15395, -447, 3314, 18390, 27196, 30622, 30345, 32456, 38048, 36575, 12913, 5398, 1621, 13333, 25382, 26377, 16324, -3655, -3464, 9375, 13257, 24828, 26243, 12630, 5742, -958, 5507, -3429, -10387, -635, 6658, 1722, 1905, 5920, 11287, 10512, -7736, -16668, -19741, -7127, -2376, -10009, -516, 5746, 8222, 5545, 12529, 2539, 12358, 22530, 13726, 11667, 9190, 13434, 17953, 11529, 11691, 3579, -969, 1858, 5129, 6100, 9117, 15097, 13180, 11178, 10853, 6937, 17565, 20715, 24185, 22547, 7165, -2559, -2724, -14998, -15832, -24678, -19366, -4974, 5118, 15538, 17805, 11427, 5996, 12069, 26344]
11671B6344P163J86j4408j2852j765q934n073N258Q710o012j249J0263Q508N84
11657A6723j4551o031r87J818P018j1160o644J1381Q557N236m715j0787j0460
11644a4602p848Q193N412o268J1155P976N249k457p281O694n30j7708K35K288
11630i492M179R557J0773P953j690k5919q773k6O618K35n754k073k894M483J6290
11615C467M720l437j679N191j4552J52p943j336Q427J620K600P974J1102P687
11601B3993q071j2290k075L456J357O300K410K0207j3420j1217n812k362Q551
11588A1027K2384j2203n510P000q003q616q332o25J0274K952k544j727k747P350
11574A0680J0356k535L675j4269n510q193J245p60m642r705j634j04L636J5919
$$ y = [26344, 33507, 33693, 19285, 6433, 4668, -4266, -9339, -4081, 4629, -1383, -2632, 7631, 16139, 16723, 2172, -3859, -4846, -3028, 3990, -7170, -13814, -2433, 6124, 11360, 6645, -4142, -14602, -22450, -14257, -8845, -15113, -3958, 4018, 9267, 6810, -471, 6223, 5693, -12015, -11780, -9492, -5313, 4244, 15017, 22970, 21280, -4639, -13412, -13438, -6820, -6585, -12339, -14412, -17306, -12823, 3467, 8187, 4750, 3071, 8262, -6290, -6138, -14081, -15417, -6990, -5370, -2770, 5204, 16306, 23993, 15922, 3632, 1557, 5013, 6370, 12670, 15080, 35287, 21867, 10650, 4838, 2476, 11027, 33411, 21208, 15698, 22698, 14695, 6079, -2253, -2878, 7396, 10348, 7804, 6077, 3330, 10680, 21036, 18501, 22176, 7907, 2397, -5796, -4551, -5311, -9953, -19658, -21292, -21396, -17760, -1841]
11560a841N194j0992q413j301J7008J0951P196n336K122k446j2398l152o369j091
11546a0868R581J2629J2224N273q893j189k694j0276r202q763Q396R283N086M394
11532A4981k114l529R583p062j0920l404j637k919M456J0006J8986O075k8Q5K077
11517C4636L022j1791j2723j1019N634J276J318j407q661l029L469P143N159j3762
11503g35m710P88l033N009P718k428l969j9205j523M284R321L647P731L332O852
11488A3079l721J961L945j703j3116o038l102P136M312l79k572j239N294n184
11474a327j2068j1284J7323K5560J3703m615k1169K443j926n196K53J3038o334
11461H401n517r704M16j414Q8Q381Q583M41Q051J0198j7446j135R244j289j980
$$ y = [-1841, 3353, -7639, -16052, -17353, -345, 10606, 17802, 12466, 14588, 12142, -256, -3408, -9777, -10868, -1287, 11342, 23566, 28839, 19946, 18757, 16063, 5787, -3415, -12178, -3782, 5501, 10587, 14981, 12867, 9338, 18921, 11859, 939, -2465, -4102, -7021, -2565, 7441, 26427, 32502, 32474, 32559, 34636, 37658, 25867, 13144, 2125, 7759, 9035, 10353, 8946, 285, -2744, 725, 7868, 13027, -735, -5445, -4657, -7690, -2681, 5037, 2609, -1360, -20565, -22088, -17804, -8483, -4836, 2895, 6227, 13079, 9358, 11319, 15264, 13561, 445, -5593, -8695, -1559, 2753, 2374, -198, -1437, 3857, -1327, -13395, -24679, -7356, 18204, 31907, 27292, 6123, 8566, 6640, 1444, 1697, 14735, 8401, 2884, -6820, -6404, -7818, -7730, 651, 9234, 9675, 17726, 27924, 10478, 9343, 18587, 17298, 15318]
11446A5318q003j4852j4864Q984O835m91j3625j099K0031r90q223O87K676n590
11432a3206J4123K1454J5457o985j3445o222j676j0819m138n999K372R411J0003
11419A0330l988L482P535l225l011p272o694L546O431M424j1396K633j073R0J0375
11404A2187N872J1766l317q197j2793J2420R398k3186j2499J0010J3672P049n572
11391A6810j4246L345m825N413Q870J0685j0293k2532p591K644m24P169M810J794
11377A629R691R538Q4j4265j6407N543Q001M73J2348J1888P02r227N564r04r897
11362A4761p273l596l725O707J2423j3339j7935j1699J6506L526J3238J1336k2352
11349a422m397j355Q60l005P721l765P608R928q93L776k180r957k853K530N172
$$ y = [15318, 7315, -7537, -22401, -13417, -6582, -7073, -20698, -21797, -1766, -2756, -10979, -10292, -7616, -13206, 917, 22371, 37828, 30843, 17398, 11176, 9500, -1319, -5457, -11456, -9084, 327, 10330, 6342, 9824, 17359, 14134, 11123, 3851, -2843, 703, 7134, 11558, 162, 2795, 1722, 1812, 12187, 18059, 29825, 26508, 18311, 5518, 17938, 27336, 4150, -8349, 1661, 15333, 22382, 16810, 2564, 5909, 1084, 6497, 15367, 26052, 15759, -6773, -14364, -11720, -12144, -4975, -165, 1629, 11320, 20858, 20942, 6677, -9730, -4187, 3814, 4287, 16635, 28523, 29225, 19998, 25562, 24658, 14761, 7488, 3892, 167, 6874, 19297, 5958, -11977, -23676, -7170, -3644, 9594, 20930, -1422, -5819, -7174, -6314, -9319, -1598, -5363, 2245, 12173, 11280, 15056, 12876, 2919, 66, 2596, 7768]
11334G768P78J4157L025j5421j2674j600L854r793l491N384K603J4599N178Q616
11320B2983k892j5178p600N962k05j1219n976R770l922K508j426M795N368k07
11306B761J055J516M714n176k345p832r045P606M582k671j3022N878P380m795
11292i394k779m413J406k671J7663L02k346p078o293m974J42J6430R111L240r848
11277a502j4430j501J4825O670n136k350P689J576o434o836J779J2274r5j8329
11263a1800j758L216J0027O751q076p961k182K310P959k372k639r678o196O297
11249a6102q703p354J043l012K366J5134J6707J3079j710J3074l95M771J771j910
11235B8759k133l758O331J0785K829j0832j2658K91m20j1073m487N88R390l443
$$ y = [7768, 8546, 22703, 25728, 10307, -2367, -3967, -113, -9906, -13397, -8013, -5410, 9189, 14367, 22983, 20091, 4913, -2687, 3275, 3070, -8149, -14125, -4355, -8277, -5769, -7195, -2400, 2968, 2761, 3816, 5332, 10046, 4870, 2525, -5307, -14352, -6746, -2164, -4835, -17857, -11979, -4599, -9394, -12173, -16586, -15180, -17851, -188, 114, -2232, -9310, -15603, -20577, -20435, -4005, 5106, 8346, -1502, -15932, -17433, -2608, 4062, -1074, -3424, 4265, 5841, -593, -7429, -5650, 6624, 6529, -11800, -13558, -10342, -315, 6436, -1640, -9601, -11783, -9473, -1514, -3886, -6525, -16203, -22399, -16102, -24805, -32159, -31116, -34128, -31762, -16628, 79, 13158, 11448, 24522, 24127, 28898, 30669, 28759, 26626, 22868, 29199, 39984, 42813, 31981, 19323, 19614, 19194, 8121, 3634, 4222, 13612, 10169]
11221A0169k483Q506n433J2424Q363M093p60q040r343j794O235Q957M950j4376
11207B1468r553l832K448m730j2363j872o60j063N806M31k478m352j4306Q435
11193a6621J2384P467r77l264K737M53N895N805L324n659L50J666L757k643q314
11178F360k715M991o369k410o86r693j3086J6608L354J6668O592l90r789j375
11164H060L061M218q716m356N126J0135L376r405q148m579Q583k48j3610j2457
11150a8960n971Q804J2321J0884r314m22L06j563O673o893J4813J6444K830k0604
11136I348j343O39j2674J4202j694j4690m986N570N958j028o910K456N078k134
11122b208J2167O462J4580O273q9j792q212J578r749j5649P453r98l961n823P447
$$ y = [10169, 7686, 16192, 10759, 23183, 31546, 35639, 34879, 26839, 17496, 15702, 21937, 30894, 35844, 21468, 11915, 8083, 10531, 5801, -6562, -8434, -9094, -10157, -4351, -3920, -6398, -10750, -25056, -16621, -4237, 3230, 2253, -1011, 1726, 2179, 8074, 13879, 17203, 11544, 11894, 13560, 17317, 14674, 6360, 3645, 8636, 2267, -143, -829, -10522, -23608, -7000, -3646, 13022, 19614, 19224, 9435, 8060, 11121, 15339, 6623, 2267, 7393, 17528, 20904, 11499, 3351, -1228, 7355, 7107, -6503, -18960, -24931, -16127, -3806, 7078, -2236, -2658, -2352, -3915, 2758, -4135, 10678, 27122, 29952, 9348, 8005, 8644, -4030, 10172, 8478, -6212, -11198, -5628, 330, -698, -7608, -5152, -74, -2208, 9959, 16421, 31001, 37274, 37185, 35393, 27181, 28759, 19010, 3361, 10814, 9816, 5855, 32, 7479]
11107G479l544n448K150J47p77L074P590l38P100r859p057l92l684J8Q708j1836
11091f669l261N864Q988J966j2571K168m401o333l803J3806J1575m950J178m961
11077a404K561m739p836K030Q540J3318j061m924j171M245Q323L985L295j9068
11063F094j6431j591J0387n890J891K683j2911p11R110J4129J5952j159N281n052
11049B1782r590J910J4849K835j5648j3423R203R04j3795p393J2104q861m883
11036a0006J7784J8820K726j1693K462Q727p795k2785j3207R273J7097Q709j0057
11023A0055k49P13q238o785J938N02o081j471Q158R225j1787m141J423N030m41
11008b149n627k846R815P453p158N279M030L829K017J3630j0491j6057K998M641
$$ y = [7479, 3935, -1513, 637, 784, 7, 3081, 10671, 10333, 17433, 7574, 517, 125, -3559, -3541, 5167, -6669, -9930, -4066, 4922, 6888, -5683, -3515, -7916, -14249, -18052, -4246, 7329, 2379, 3557, -1404, 1157, -3582, -11418, -9388, -848, 12470, 11409, 6485, 5314, 9559, 17882, 21867, 25162, 6094, -10337, -11928, -1541, -7431, -5540, -2857, -15768, -16479, -7369, 6760, 22712, 21553, 26834, 21782, 12192, 14102, 28951, 31786, 16138, 2715, 11918, 12822, -973, -8366, 3738, -5123, -10006, 7778, 26598, 29324, 17631, 20093, 28820, 21025, -1760, -14967, -5694, 11403, 20112, 10055, 9806, 10519, 2281, -4504, -2566, -2064, -8145, -9616, -1458, 7767, -4020, -8161, -6738, -1708, -2149, -7776, -10622, -807, 6646, -512, 4767, 8797, 12626, 14643, 28273, 17782, 1725, 4723, 9364]
10994I364n520n711Q395m54M955p247l70J5575r810j0919J940k794J209q44M974
10979B743M25k873j7348q31L781l426o175k153l368N687J5613J2879Q531J444
10965A4929p252P431k898q103m821p029P530L77m919J295o275j2544k090J8656
10951e713m89J269J2356J8116q668k879l599n790P047K1313m440j8286m871P226
10937A2592o844o309M54J3079j9890k738N934P148q547j867j906l897l366J2955
10923c202J1944N002J142j969r126m185m334j355r813k451O927Q913n936q650
10909a7093N040Q498L82L498R43j352j2459P670M863K366N989N645j3345j6352
10895a5707M499K1518L145O601o812o286J5385K1387q821k0002p984M447O946
$$ y = [9364, 3844, -1867, 6528, 6074, 11029, 3782, 3412, 18987, 9177, -1742, 198, -2596, -1387, -2231, 2743, 3168, 295, -17053, -17884, -14103, -17529, -23704, -25857, -29225, -23538, -7925, 4954, 13485, 14929, 7677, 15108, 12210, 4107, -714, -7743, -213, 164, -4755, -3460, -9735, -22279, -24369, -5713, -6202, -4933, 7423, 25539, 16871, 13992, 10393, 4603, 11650, 32963, 28523, 10237, 5366, 12592, 5748, -561, -107, 12972, -6918, -9656, -3722, 3426, -5121, -6988, -8894, -12791, -16157, -3202, 8742, 13744, 14886, 12917, 3791, -394, -4728, -6083, -15896, -18347, -11420, -2507, -8443, -17093, -12053, -3555, -3173, 325, 1268, -84, -12543, -4873, -10, 2356, 8345, 13990, 645, -15707, -11208, 10310, 13455, 20056, 13244, 6958, 22343, 43730, 34909, 14907, 6923, 11370, 18316]
10882A8316k982j8682P07j5779J0119j2407j225J7707k094J438r372K405J302
10869a0547O871n790j063K973j5304n079q288M746L338O630J5646N374K10j499
10855a782J086J195p056p291J3807Q995o090j1360J230k016J114J4384Q660l573
10841A1303j0255q48k41m753j473J0953O364k640q362K590R39J0554M295n265
10827A3161o858o238j4939O226J1094j0994K211k677J059J066N76n285k181j967
10813a5746P284k681K581q792k346P862J6168N56M357J1522o550k2185l319N026
10799f263j2112K403J3694n072l493k978J5191j120J0812P785o392j4136p259
10786h940o009K063q25J264J6125m431r017Q165J416Q809p965M744m777m434O76
$$ y = [18316, 15334, -3348, -2641, -18420, -8301, -20708, -21933, -4226, -6320, -4882, -14254, -11849, -10547, -3676, -9466, -10529, -7556, -22860, -27939, -36227, -31481, -28143, -21513, -5867, -493, -283, -1782, -696, 499, -6557, -13848, -41, 8954, 2864, -8496, -7266, -9282, -8168, 6216, 14876, 11303, 1048, 200, -41, -4794, -6267, 4686, 11050, 8410, 48, 2638, 3577, 14131, 18426, 13161, 6303, 65, -14874, -8648, 2446, -8548, -6337, -9014, -7955, -6889, -6313, -11598, -13779, -15746, -8462, -11143, -8562, -17354, -19700, -11838, 4330, 4886, 9243, 20765, 14215, -7970, -11289, -6263, -18375, -15972, -2278, -7350, -10843, -13821, 1370, 250, 11062, 18847, 12455, -1681, -8940, -14949, -12886, -13711, -12447, 3678, -753, -9770, -1605, -189, 8620, 655, 5399, 622, -3812, -3136]
10771c136j430j499J1228J1114j1506j3520K816l69P34R632n635m058N442L050
10757B863p92L162j0806K964J2354l504m061o954J744N803O21O05N125J404o563
10742C965m627j048J1847J5479Q553m438p514j9975n129L223N483M793M048o729
10728G931j2928j0011J2084m2L600j2819n789J2709J2347P267k4464l016n79m92
10714a4202N594P793o624j0849J857O359J5662n55Q726J257o3K699p703j3358
10700c407p418j3172J001J9271O803Q212N655J445k2514n611K5076J6072j2061
10687A9352o824R648q792j602j234L200q250j3589Q56J4878K434J028P67j588
10673A0284j548R13j849j59K831n23Q05R523m731m358p646j3922O031R244J985
$$ y = [-3136, -4566, -6065, 5163, 16277, 4771, -8749, -5933, -6302, -5568, 4064, -1571, -5629, -187, 2863, 2071, 5233, -5573, -2609, 9745, 6241, 2180, -4774, -3030, 2773, 3394, 3999, 9124, 10528, 3965, -662, -1710, 10137, 25616, 34169, 29731, 22217, 2242, -2887, 336, 5819, 10612, 14660, 7931, -4997, -15008, -2924, -2966, 634, -12185, -17974, -5265, 7082, 14349, -10115, -13131, -13710, -14202, -8608, -815, -7439, -18288, -16431, -10072, 5590, 5035, 13761, 15018, 14955, 17654, 9951, -3407, -10825, -23997, -22996, -3725, 3078, 11290, 16945, 18390, -4124, -9735, 15341, 31413, 19352, 12528, 22176, 13384, 11782, 10548, 13748, 5498, -8091, -7235, 7643, 10077, 11105, 11872, 10284, 8736, 9649, 7800, 7641, 10472, 9949, 10754, 20277, 15546, 11188, 3542, -10380, -4349, 4895, 6880]
10658F880q6l246J698K180K161L577q938m570O821n115m98M396R81k752J2806
10643A6295q637o550n033Q620N477M537k260q306m645K660l034L513J2924J8377
10629C3938j5308o703l073j1885l593m49J2711p887q445M416J1210J1085L714
10616A9731j4573j3617r103j683O910J4558L845K799J652J722j217J633l782m466
10602D409k937r823o06M850o810J0870M941j566M545o521j7650n708J0022R272
10588b712O510L862J0802K788j263n883j2533M741o959N536R565m855J0374R075
10574B9048N29N323j975n40o894j1542p219P576j0012L883m99j5906j1339N954
10560a3613O123Q128j169j0597J501R028J040N107L150o20J3851j2325r497M257
$$ y = [6880, 6794, 3548, 5246, 7426, 9587, 13164, 4226, -344, 6477, 1362, 864, 5260, 6241, 3489, 16295, 7658, 1108, -3925, 4695, 10172, 14709, 12449, 4143, -502, 2158, -876, 2637, 15561, 33938, 18630, 11927, 8854, -3031, -6624, -7073, 5638, -2249, -10694, -6278, 4932, 16017, 19731, 5158, -8459, -17562, -19245, -12335, 2223, 6068, 8867, 10519, 12241, 11024, 12657, 8875, 4409, 1472, -8351, -8957, -4107, -10917, -47, 4894, 3328, 7873, 1352, -16298, -22006, -11984, -2712, 3798, 7660, 18462, 21250, 19987, 14104, 1571, 6312, -647, 4889, 14454, 9599, 19973, 29048, 29577, 34900, 32925, 32385, 25491, 13949, 6730, 14306, 4294, 8177, 7678, -8228, -19567, -13613, -7490, 638, -531, -11128, -9627, -599, 441, 5548, 8698, 8078, 21929, 9604, 107, 4364]
10546D364L165r406J617K95L287O829j4654q138M490R700N633l534O278J876o32
10531A1170l659L435M674M94q677l801m102M032P708l658m141o140p178n899P773
10516g969J4514j229M035O366p928n202L078k793r403J776O999N674l347K0727
10502B5298O51j4920N878k610N07O403r79q559o82J1277M016j2686q936l88L396
10487G666l814p740J3147K355O414J2210Q957j177j0377j786j1611j5278J0288
10474I254J2578j133o749J92J0480j910j2118j0428K525j564Q373j193q922K113
10460A498j764J823L185k570j623P786p598k447J7054L23n589K899J853l546J2603
10445B3887J2652N609k936o8N222M2179L7114N5202R6494J11598J16895P9298
$$ y = [4364, 7529, -1877, -260, 35, 3322, 10151, -4503, -12641, -8151, 1549, 7182, 3648, 9926, 11802, 11170, 7511, 10946, 15620, 16114, 7437, 3636, -466, 3566, 11274, 7616, 3475, -2665, -9843, -15742, -7969, 6545, 5316, 9351, 15717, 7789, 2587, 5665, 2872, -6531, -4755, 2244, 7918, 4571, 25298, 25949, 11029, 16907, 14297, 14804, 21207, 20228, 11669, 10987, 22264, 26280, 13594, 4658, 4270, 7666, 3852, -3888, 9259, 11614, 18028, 30238, 39195, 38018, 27641, 25855, 14244, -1034, 9254, 21832, 20699, 13950, 14142, 24622, 22712, 10594, 166, 2691, 1127, 9500, 8307, -615, 1498, -266, 1557, 4742, 2172, 549, 8335, 737, -1710, 15344, 15667, 10078, 12977, 14830, 11284, 23887, 36539, 42148, 39212, 39144, 44366, 86545, 123659, 178861, 275355, 386953, 503848, 583146]
10433E83146n2186j21175j20251q4419l6238k5204l0541k0813j9820n041k230
10422F5228o73K577L269J883K096q191j0666j338j1547j3890l687L037J0461M766
10408D3325l356K572K825L107p029j0130j4017O85j3081k805J3581K6792O751
10395D9220n406K522p17J538j3281j3408j475M261J1152r784p423m985n250m761
10381B203J4735j42J2140K240P35N609%J0019J493j1379o114L329q898p167P824
10366B6627m104q418K427J9196M229j2221j2661m071L410m468O869n498k268P049
10352A6098J2135L35j472j1859J933m179L778J0837M121k587q309q900n193n368
10338A370J0073L340J384p053N711J2833l356r425N161O643r276q016q218j508
$$ y = [583146, 530960, 409785, 289534, 205115, 168877, 143673, 113132, 92319, 72499, 67458, 65228, 64555, 67132, 70401, 72284, 74380, 66189, 55523, 54185, 42638, 28748, 25061, 28098, 38559, 43325, 39969, 42541, 45366, 48473, 41444, 31314, 17297, 17982, 4901, 2096, 15677, 42469, 49220, 43814, 46336, 45619, 47157, 33876, 20468, 18993, 23254, 34406, 24622, 17199, 12214, 6964, 2203, 16938, 16796, 28936, 31176, 31911, 37520, 37520, 47539, 49032, 37653, 31539, 34868, 25970, 18803, 26627, 22523, 14105, 16532, 35728, 39957, 27736, 15075, 11004, 14414, 9946, 16815, 11317, 9049, 16098, 28233, 28568, 27096, 15237, 17170, 12991, 16769, 27606, 31727, 29140, 20831, 11931, 6738, 1370, 11443, 14783, 16167, 9114, 14825, 27658, 24302, 14877, 20038, 26681, 17405, 9389, 1171, -337]
10324c37J2637N273l07O641j642R832K920o083m76K941j4215q009j2781r626R997
10309c235J0097J0522J6647J2225n880j7858l591M460L676l256M713r854m532
10296A4134p548l950J768P045J733p637K2672J8421j0490j6340M069l711r450
10283A0716l380O077k753Q30L138p38K083q731n809J5243Q452Q298L909j1840
10269B5495m065L408q830N757P020L601l2j2364j1205L407J0973j457p67J1172
10255C2113Q234k200p130r046r097J843K900M655j040K280m797J201q133N252
10241A7035K080J2396N321O81O897j1502j4786p891n1n707k204l163P602n79o513
10226c84J6933J7595j0167j3604N191k604k057M723J9745J0387m429k311N490
$$ y = [-337, 12300, 17573, 17266, 23907, 22265, 32097, 35017, 28934, 28458, 31399, 17184, 9175, -3606, -13232, -3235, 6862, 17384, 34031, 46256, 40376, 22518, 18927, 23387, 27063, 23807, 28520, 18666, 14134, 6586, 2636, 4404, 11449, 13182, 5545, 28217, 46638, 36148, 19808, 23877, 20166, 10716, 7336, 13413, 10660, 11490, 14628, 13890, 15973, 7242, 1433, 16676, 25128, 33426, 37335, 25495, 21430, 24838, 16008, 21765, 28785, 32386, 32354, 19990, 8785, 12192, 23165, 21708, 20941, 32113, 40347, 38147, 31017, 21971, 12874, 14717, 17617, 22272, 21232, 23512, 18715, 19916, 11783, 17035, 19115, 31511, 36832, 37513, 44410, 32908, 18122, 10231, 10180, 4473, 2269, -894, 6708, 6129, -384, 16549, 34144, 23977, 10373, 15564, 12960, 10903, 15626, 35371, 45758, 41329, 39018, 44508]
10213D4508K939K15j7678k0765o970k444J3560J0149m094N015o779j1506K249
10200H399K430m596J7142K3716N29j0168K401P661p077l739j8095k707r81k289
10186A2626J1150q547O574M462R636m905P347J546j6296p676N009k321J251K874
10172B2730K173p864l246J5079k791r067L4J7281n510o115O469L678M249r203
10158B7897k128p030J3901P311o294p004l153J5030J6798J6786J5989P210J9296
10145A14609J9985J3876P07j2993k9449l2126j3922q787k823K88m636j5976L84
10132B9137l809N2J5588N016q672j1184j065J0207L394j2683L307N940M264M649
10118D4141o983j1020j5999J0282K1132O370R55o404N14m543l68o588l46k296
$$ y = [44508, 47447, 47662, 29984, 9219, 2249, -195, 13365, 23514, 19420, 24435, 17656, 6150, 8399, 10829, 6233, 23375, 47091, 47620, 37452, 39853, 47514, 40437, 36698, 18603, 15896, 14915, 12626, 23776, 15229, 21803, 26265, 35901, 30996, 38343, 39889, 23593, 15917, 20926, 18605, 19856, 22730, 24903, 17039, 13793, 28872, 26081, 17014, 17048, 34329, 28819, 22704, 29173, 32851, 37100, 27897, 25769, 18739, 32640, 39951, 33657, 26653, 23500, 38530, 55328, 72114, 88103, 95313, 114609, 134594, 148470, 149177, 136184, 106735, 74609, 60687, 51900, 49077, 49365, 44729, 28753, 29137, 25328, 25380, 40968, 45984, 37312, 26128, 25063, 35270, 38664, 25981, 29288, 35228, 39492, 44141, 37158, 26138, 10139, 20421, 41553, 47923, 48878, 42474, 42988, 38445, 38077, 31489, 31143, 28847]
10104B8847M398L812J7791J0018j8359j9201q110n749J6226O067j0603J249r92
10091B5394j5029M713N788j881L483Q140l583J733K800M261j2415l064J1570J8298
10077E0208R73p461j531r454p942O771J0891l563p408o940L912J1906L117k3415
10063B0064j5565L750J3980J5336m831j1633j2907r220J6982N211m379j1339K1826
10050B7275K0115J2808n663j4578j1247j0435P594J0411k983R283O822l122j2775
10037C3505m062n166J767r347M450k448O393J0656q708o250K114M295J0709L833
10023D1741n600L113q60k57L818k941p515k552L247l20J621L653P214j1908o210
10008B6244M690J3977P324j5363p052J3771J7746o851J6427J1831j0551q548K2277
$$ y = [28847, 33245, 37057, 54848, 64866, 46507, 27306, 19196, 13447, 29673, 35740, 25137, 26386, 25394, 10365, 15078, 20866, 18985, 22468, 30608, 27025, 28758, 31558, 35819, 23404, 20340, 31910, 50208, 51181, 43720, 42189, 32735, 24793, 31564, 42455, 38892, 31484, 24544, 28456, 40362, 43479, 20064, 4499, 8249, 22229, 37565, 32734, 21101, 8194, -1026, 15956, 21167, 16788, 5449, 27275, 47390, 60198, 54535, 39957, 28710, 18275, 25869, 36280, 33297, 42580, 49402, 46280, 33505, 29443, 24277, 26044, 16697, 21147, 18699, 25092, 35748, 27040, 20790, 22904, 27199, 37908, 41741, 36141, 39254, 38394, 38137, 41955, 39014, 31499, 28947, 32194, 31874, 33495, 37148, 44362, 32454, 26244, 30934, 44911, 52235, 36872, 29820, 43591, 61337, 54486, 70913, 82744, 72193, 63645, 85922]
9995H5922J4030K214J664K9825Q3916J16659J39285J23241O060j78098j49389
9984B75329o9995n2286k7839m131q40k479O639n378j2617O419J7355Q459K868
9971A41504j3038j9154j2037l952O257L071J010k1966j2447q283J013O88p558
9958E5108m828J9147M407l41J21j1719o62J4091q659L286J803j888n049o308L308
9943F1817L423l165p71M577K293o881l311J6207O410L165J361k3803q80R167M75
9928G0084J3924M258j1773p755n89j270q542N431Q736j1299j1993R756J3888o418
9914F6438J504P273R182k157n500Q776K0372K8448M0695N9426Q3573P5331K8966
9901D22327l2686o1596m1617m3395o3826l4390j2549Q189M630r362o200j2865
$$ y = [85922, 99952, 102166, 103830, 133655, 217571, 334230, 473515, 596756, 602816, 424718, 275329, 205334, 153048, 125209, 121078, 120238, 117759, 124398, 119020, 106403, 112822, 130177, 138636, 141504, 128466, 109312, 97275, 93323, 99580, 102651, 103661, 81695, 69248, 60965, 61978, 62666, 55108, 50280, 69427, 73834, 73493, 73614, 61895, 61233, 75324, 66665, 69951, 71754, 69866, 64817, 58509, 61817, 65240, 62075, 61304, 65881, 68174, 61293, 57982, 74189, 80599, 83764, 85125, 61322, 60442, 69609, 70084, 84008, 88266, 76493, 68738, 68149, 66879, 58337, 63768, 72504, 61205, 49212, 58968, 72856, 66438, 67942, 75215, 84397, 82240, 76740, 85516, 105888, 134336, 175031, 234457, 318030, 393361, 422327, 389641, 328045, 286428, 243033, 179207, 144817, 132268, 140457, 145087, 135725, 129525, 116660]
9889A16660k846n023O576q586j619N729J0628K1396J7957J0531J8448L5788N9956
9876B85595Q9765J34967J79996J87320J44393P605r8547o2185R974R8762K35325
9865A212970K92145K29897K0156k85898l07162j95481q5586K1726R1740Q4492
9855A078999L2246r6947j85834j63611j15875p0317n4152l7343l3896r290j5064
9844C28916L93j2626k0817o764k127j10j7848j7589l266l102r448j2849p816j5948
9830A98999m891J601L754j5568j3074p282J2541K411N077j8946r317q336j2006
9817A34963L680J948M544J23k128J744Q1O472P012L622l400q75M711r83r888r66
9801A50660O870k293n087q858J7943N238l040n272j726J1102J4981J5413j966
$$ y = [116660, 113814, 108791, 115367, 106781, 105162, 110891, 121519, 142915, 160872, 171403, 189851, 225639, 285595, 375360, 510327, 690323, 877643, 1022036, 1029641, 931094, 868909, 878883, 977645, 1212970, 1505115, 1735012, 1755168, 1469270, 1162108, 966627, 881041, 902767, 994507, 1078999, 1111245, 1014298, 828464, 664853, 548978, 478661, 424509, 387166, 353270, 343980, 328916, 329309, 316683, 295866, 289102, 286975, 286865, 269017, 251428, 248162, 245060, 235612, 222763, 214947, 198999, 194108, 195709, 199463, 183895, 170821, 163539, 176080, 178491, 183568, 164622, 155305, 146969, 134963, 138643, 140591, 145135, 145258, 143130, 144874, 144955, 151427, 158439, 162061, 158661, 157786, 162497, 161514, 151626, 150660, 157530, 155237, 150150, 141292, 159235, 164473, 161433, 156161, 154435, 165537, 180518, 195931, 193965]
9788A93965j1138J220k682r178k278J2557K198j5570k909l937k2622n559J5286
9775A49353K0611K5062M377Q315J3593J7510K4920K9042M3764N4539M7040K4864
9763D62990L0226L8044M6465P0560Q7736J10970J36438J51783J86234K46976L44301
9752A912723N21699Q16923J346112K261963L661188N192490N682735M293323m8668
9743B5640488n609635o060365l994700k428648j461510q94537n85365m29104l90087
9734C786537l58572l16202k93642k54176j97201j71704j48191j05700o6918m9931
9724A824300l2772k3361l3536n6250o8097p0824p5102r3532q0728n5638m4608
9713A189852l1574k3667l1401k0026k5105l5246k2045j8988l4992l1327l9186
$$ y = [193965, 182827, 184047, 181365, 172187, 169909, 182466, 184664, 169094, 166185, 162248, 139626, 134067, 149353, 169964, 195026, 199403, 207718, 221311, 238821, 263741, 292783, 336547, 391086, 438126, 462990, 493216, 531260, 577725, 648285, 736021, 846991, 983429, 1135212, 1321446, 1568422, 1912723, 2434422, 3251345, 4597457, 6859420, 10520608, 15713098, 21395833, 25689156, 25640488, 20030853, 13970488, 9975788, 7547140, 6085630, 5191093, 4605728, 4176624, 3786537, 3427965, 3111763, 2818121, 2563945, 2366744, 2195040, 2046849, 1941149, 1874231, 1824300, 1791528, 1768167, 1734631, 1678381, 1610284, 1539460, 1464358, 1370826, 1290098, 1234460, 1189852, 1158278, 1134611, 1103210, 1083184, 1058079, 1022833, 1000788, 981800, 946808, 915481, 876295]
9702H76295l3089k1199j3504j5092l1957k7227k8775j1123j5127k5831j0195j1678
9690F31498q767j0719o544p85j8488j9211n258q972o622k201m399j2620j7753
9677E09159j9260M470L55o321r794l312k90m95j4606k1534p172Q166J9370J4352
9663D73088J5001K2321K8905O1001Q8551J31420J91470K23667K23891J71203J36469
9652A766987K17931K52878J30551j93070k78384j51644q4089j31286k48722k51025
9642A030127j54422r3542o9805n0305l7379l2860k4379j6884l3203k5062r797
9631D82489k0861k2721q444J186r82o288j0709R032p694q389j746K126K012k449
9617D06562L102K006j2520j0297k863p8J6578K4896J0258J3177J2275J7859N1883
$$ y = [876295, 843206, 822007, 808503, 793411, 761454, 734227, 705452, 694329, 679202, 653371, 643176, 631498, 622731, 612012, 605468, 604683, 586195, 566984, 561726, 552754, 546132, 543931, 539532, 526912, 509159, 489899, 494369, 494724, 488403, 478609, 475297, 475007, 474512, 459906, 438372, 431200, 439366, 458736, 473088, 488089, 510410, 539315, 600316, 688867, 820287, 1011757, 1235424, 1459315, 1630518, 1766987, 1984918, 2237796, 2368347, 2175277, 1896893, 1745249, 1661160, 1529874, 1281152, 1030127, 875705, 782163, 712358, 662053, 624674, 591814, 567435, 550551, 517348, 492286, 482489, 461628, 438907, 430463, 431649, 430667, 424379, 413670, 422702, 415008, 406619, 404873, 406999, 409011, 406562, 409664, 411670, 399150, 388853, 385990, 385912, 402490, 427386, 437644, 450821, 463096, 480955, 532838]
9604E32838O9407Q1355J27626K00701K95502L50141L13442K29110J8356j74662
9594B043816l08528l39442k91765k01718j25475q2304n8966l7427l5573j6958
9584E45660j664j8012l4276m1157j5104m504M889r390j0706j1456p479M56L328
9571D00585j2646q428j1557j9959r363K235n3J850m661n651n919k1392m634O694
9557C07101q657j9253q997K489J2857J6262o530o587K0701q594j9310o566M391
9544B79307j17K618q813r480r57O202O541J4255P087o587j4895j9253j0783R858
9530B54983J1983P103p820j0435r183l446K309R305J1604j4346p142j660K05j5127
9516B28333m122J8915J9484j4958N137K835k155O356J640o046p493J26K1412J0759
$$ y = [532838, 602245, 683600, 811226, 1011927, 1307429, 1657570, 1971012, 2200122, 2218478, 2043816, 1735288, 1395846, 1104081, 902363, 776888, 694584, 635618, 598191, 562618, 545660, 543996, 525984, 491708, 450551, 435447, 430943, 435832, 426442, 415736, 404280, 396801, 397257, 400585, 387939, 379511, 367954, 347995, 338632, 340867, 340814, 342664, 338003, 332352, 326433, 305041, 300407, 307101, 298444, 279191, 270194, 272683, 285540, 301802, 295272, 288685, 309386, 300792, 281482, 274916, 279307, 279190, 281808, 272995, 263515, 262558, 268760, 275301, 289556, 296643, 290056, 275161, 255908, 245125, 254983, 266966, 274069, 266249, 255814, 246631, 243185, 245494, 254799, 266403, 252057, 244915, 243255, 243460, 228333, 224211, 243126, 262610, 247652, 252789, 255624, 253469, 259825, 261465, 255419, 247926, 248052, 269464, 280223]
9502B80223O771p914j0946J5855J1215J694J3425J4143M258J0826J8844M6337
9490D04731M4213M3034N0567N2131N5125K2510K6081M9044Q7089J23018J41127
9479A098670J51821K15931K86706M24838O83283J159170J964988L316572N088287
9470A4390266O129368N296223J710731n051503p051440m753680k798655j618229
9462F253081r40090n96237m26013l68961l59401l57926k98864k39075j89021j51016
9452B326477j30251q7780o2653p1454p0533o8417o7419n5984n1214n2268p3407
9441A535097o2916n7311n4358l1516k9693q890o948k5408m2528m4376m3165m4250
9429A083738k8512k5074j9963l0465l5066l0058k6525j7147K822j2775m559l786
$$ y = [280223, 286994, 279080, 268134, 283989, 295204, 296898, 310323, 324466, 328724, 339550, 358394, 404731, 448944, 491978, 542545, 594676, 649801, 672311, 698392, 747436, 834525, 957543, 1098670, 1250491, 1466422, 1753128, 2177966, 2861249, 4020419, 5985407, 9301979, 14390266, 20519634, 25815857, 27526588, 22475085, 15423645, 10669965, 7871310, 6253081, 5312991, 4716754, 4290741, 3921780, 3562379, 3204453, 2905589, 2666514, 2477493, 2326477, 2196226, 2108446, 2045793, 1974339, 1903806, 1835389, 1767970, 1711986, 1660772, 1608504, 1535097, 1472181, 1414870, 1360512, 1328996, 1299303, 1290413, 1283465, 1258057, 1215529, 1171153, 1127988, 1083738, 1055226, 1030152, 1010189, 979724, 944658, 914600, 888075, 870928, 873750, 860975, 856416, 852630]
9417H52630j4813j7510n662j2801j8395k4731k2217k2477k334O326r850j4648
9405F93518o021j3673n108j4664j5602j4165o674L576J628m507j9058j6352k358
9392E80540q822j8515q086K348L408J2557k708r786j1955K246j4029j0782o349
9379E10067j0470P318M06N718R318P923q195r677O606J538k190M462M111Q259
9365E35194K2053J8827K285J4760L9686M8586O6860J17924J87626K86806L68133
9354A708740L82925L21275R1471j28749k97578l83200l18507k27189j33796q3064
9344I32328l9546j5720j0092q127j2526m8258m2312l3110m0018k1995k1702r629
9332F29293j4508l094p856l312k841r509j3478j6638O98N000m640K241j90o555
$$ y = [852630, 837817, 820307, 814645, 801844, 783449, 758718, 736501, 714024, 711690, 718016, 708166, 693518, 687497, 673824, 668716, 654052, 638450, 624285, 617611, 621187, 622815, 618308, 599250, 582898, 580540, 571718, 553203, 545117, 547465, 550873, 563430, 560722, 550936, 538981, 541227, 527198, 516416, 510067, 499597, 506915, 507321, 513039, 522357, 530280, 522085, 512408, 519014, 520552, 518362, 522824, 526935, 535194, 557247, 576074, 578359, 593119, 632805, 681391, 748251, 866175, 1053801, 1340607, 1708740, 2091665, 2412940, 2504411, 2375662, 2078084, 1694884, 1376377, 1149188, 1015392, 932328, 892782, 877062, 866970, 858843, 846317, 798059, 755747, 722637, 682619, 660624, 638922, 629293, 614785, 611691, 603835, 600523, 597682, 588173, 574695, 558057, 558755, 563755, 559115, 561356, 561166, 554611]
9318E54611j3247K409J0272k587n046j531j2283p36j759J715l153q889R807o326
9304E23257j6978m55J8749K321k664J713Q660J7899l097q252j2267J4061Q621
9291E51568p512m126k071j4163O212J3557j6993p200K1304K811j1500j1452m79
9278E19956J978R654P098K439J278r094J0218N322m136o812K589j2276q382O879
9264E26711J8604M192j392k152J0661J5330M930J281l894n590J5667P412L108
9251E94868J4354N943R838m026j0594L513N856j1095j5948J518P05k971n405J5031
9237F01587m063j0748K2692K4900j101l43J1047L530L836q590j7653j3455R97
9224F12636K2857K2427M619J1592n838M617J0687j6106k471J0085l043Q129K3557
$$ y = [554611, 541364, 543773, 554045, 551458, 546412, 544881, 532598, 531862, 530103, 531818, 528665, 519776, 529583, 523257, 506279, 505824, 524573, 526894, 524230, 525943, 534603, 552502, 549405, 541153, 528886, 542947, 551568, 544056, 539930, 537859, 523696, 529908, 543465, 526472, 519272, 540576, 543387, 531887, 520435, 519956, 521934, 531588, 538686, 541125, 542403, 533309, 543527, 548849, 544713, 537901, 540490, 528214, 519832, 526711, 545315, 549507, 548115, 545963, 556624, 571954, 576884, 578165, 574271, 568681, 584348, 591760, 594868, 609222, 615165, 625003, 620977, 610383, 613896, 619752, 608657, 592709, 594227, 594932, 591961, 586556, 601587, 597524, 586776, 609468, 634368, 633267, 632924, 643971, 647501, 651337, 642747, 625094, 611639, 612636, 635493, 657920, 662539, 674131, 668293, 672910, 683597, 667491, 665020, 675105, 672062, 680191, 703748]
9211G03748J3830j4384l6003j5744J1764K2013R558J1786n302M709K654l366J6958
9198G22221R264K768n993J3134j017L442J2124J3087J2316K324j612P550k594
9185G87014R99k716Q052J6635R231P870R893K846Q403Q214M204K664K029J1378
9171H76716Q546o345J2484P588j451M939L556K96J6472P864Q173J7503J5915K641
9157I74897l0N202M730k194K4489P656M410M472J5638J4016j390L111J4053J2462
9143A081522Q151J2386p32M260J938K1900L3091J4235N448J530K610Q434l359
9130A191414R208J5575J9512J3706m267P958N486J6862J4532J1868m53J0137R800
9117A321338J0049J8049J1114N256Q241J9951J4753L84J5962J8428J4395J3911
$$ y = [703748, 717578, 703194, 667191, 651447, 663211, 685224, 694782, 706568, 701266, 705975, 708629, 705263, 722221, 731485, 734253, 728260, 741394, 740377, 743819, 755943, 769030, 781346, 783670, 782058, 789608, 787014, 788013, 785297, 793349, 809984, 819215, 827085, 836978, 839824, 848227, 856441, 860645, 863309, 865338, 876716, 885262, 878917, 891401, 898989, 897538, 902477, 906033, 906329, 922801, 930665, 938838, 956341, 972256, 974897, 974867, 980069, 984799, 982605, 1007094, 1014750, 1019160, 1023632, 1039270, 1053286, 1051896, 1055007, 1069060, 1081522, 1089673, 1102059, 1101327, 1105587, 1107525, 1129425, 1162516, 1176751, 1182199, 1183729, 1186339, 1194773, 1191414, 1200622, 1216197, 1235709, 1249415, 1245148, 1253106, 1258592, 1275454, 1289986, 1301854, 1301401, 1311538, 1321338, 1331387, 1349436, 1360550, 1365806, 1374047, 1393998, 1408751, 1409135, 1425097, 1443525, 1457920, 1471831]
9105A471831K060J3550K3898J8868J1060r907J9062J5851J0995J1835L835L5650
9093A628588K0879l540n540J4407K5126K5522J5154J9399J1947m311M758J7741
9081A770130L2866J3113J6863K1801O499K3430L8474J5153J2427J4775K7482J6290
9069B009303K6355L0783K2288K0478M2643N2194O8176N9448J8102j8328j1691
9058B319751q122N694J4327J0581L2897L6958P502J853K2302K6683L2477L6812
9046B539715M0413K8451K7155L7902L8691L2227J9425L0474M6590L3082K3750
9035B897875L1719L4835M2798L3183L9754M2480L9727L6570L6981L3713M9414
9024C319049M5920L8157N2582M1805K9014M5165O0944M5646N0058L9242N2453
$$ y = [1471831, 1473891, 1487441, 1511339, 1530207, 1541267, 1531360, 1550422, 1566273, 1577268, 1589103, 1592938, 1628588, 1649467, 1645927, 1640387, 1654794, 1679920, 1705442, 1720596, 1739995, 1751942, 1747631, 1752389, 1770130, 1802996, 1816109, 1832972, 1854773, 1861272, 1884702, 1923176, 1938329, 1950756, 1965531, 1993013, 2009303, 2035658, 2066441, 2088729, 2109207, 2151850, 2204044, 2272220, 2331668, 2349770, 2331442, 2319751, 2311629, 2317323, 2331650, 2342231, 2375128, 2412086, 2419588, 2421441, 2443743, 2470426, 2502903, 2539715, 2580128, 2608579, 2635734, 2673636, 2712327, 2744554, 2763979, 2794453, 2841043, 2874125, 2897875, 2929594, 2964429, 3007227, 3040410, 3080164, 3122644, 3162371, 3198941, 3235922, 3269635, 3319049, 3364969, 3403126, 3455708, 3497513, 3526527, 3571692, 3632636, 3678282, 3728340, 3767582, 3820035]
9013C820035N9275N8383N5231N7391N3484N9984N6898O6445N6226M8904N6519
9002D448775O9107P3304P7054O3921P2940P8423Q7097Q6654P8010Q2225P6124
8991E293634Q5491R5710Q0463Q0222R4806J00023R2623Q2785J04672J22236J18514
8980F351179R5697R2348J25893J25039J09278J20907J40539J50379J43642J37336
8970G592237J37036J56414J57962J53273J58988J59103J66132J74181J71736J94585
8960I221647J91758J98227J99867K06496K17348K16297K24933K33495K39580K51374
8950A1401022K67373K78173K93591K83427K95625L16725L30905L48393L43428
8941A4158662L54971L58408L85308L92867M11756M34899M58491M57638M67705
$$ y = [3820035, 3879310, 3937693, 3992924, 4050315, 4103799, 4163783, 4220681, 4287126, 4343352, 4392256, 4448775, 4517882, 4591186, 4668240, 4732161, 4805101, 4883524, 4970621, 5057275, 5135285, 5217510, 5293634, 5379125, 5474835, 5555298, 5635520, 5730326, 5830349, 5922972, 6005757, 6110429, 6232665, 6351179, 6446876, 6539224, 6665117, 6790156, 6899434, 7020341, 7160880, 7311259, 7454901, 7592237, 7729273, 7885687, 8043649, 8196922, 8355910, 8515013, 8681145, 8855326, 9027062, 9221647, 9413405, 9611632, 9811499, 10017995, 10235343, 10451640, 10676573, 10910068, 11149648, 11401022, 11668395, 11946568, 12240159, 12523586, 12819211, 13135936, 13466841, 13815234, 14158662, 14513633, 14872041, 15257349, 15650216, 16061972, 16496871, 16955362, 17413000, 17880705]
8932A7880705N04047N27746N29978N58649N88737O03229O29553O60752O75555
8923B3158951P13526P27710P50440Q05210Q24550Q58628Q77278R27000R75968
8914C0619261J003708J047719J095972J123538J147030J207777J243370J293646
8906C9782021J334734J386333J441567J460278J488237J526350J566775J591672
8898E1577967J611005J631028J638343J670460J665172J632516J634587J607367
8890F4668445J575505J511720J449538J395765J303993J208799J101892J001720
8882G5217377Q81585P59729O15414M55471L02084J65202K4831j28202k47900l95572
8872G7650019n19082o40271p46346q51256r45268j039886j101156j139980j191867
$$ y = [17880705, 18384752, 18912498, 19442476, 20001125, 20589862, 21193091, 21822644, 22483396, 23158951, 23872477, 24600187, 25350627, 26155837, 26980387, 27839015, 28716293, 29643293, 30619261, 31622969, 32670688, 33766660, 34890198, 36037228, 37245005, 38488375, 39782021, 41116755, 42503088, 43944655, 45404933, 46893170, 48419520, 49986295, 51577967, 53188972, 54820000, 56458343, 58128803, 59793975, 61426491, 63061078, 64668445, 66243950, 67755670, 69205208, 70600973, 71904966, 73113765, 74215657, 75217377, 76098962, 76858691, 77474105, 77929576, 78231660, 78396862, 78421693, 78293491, 78045591, 77650019, 77130937, 76490666, 75744320, 74893064, 73947796, 72907910, 71806754, 70666774, 69474907]
8863F9474907j237952j286704j309361j323765j340630j338451j345236j355273
8855E8937535j319964j315915j301040j282093j256911j231276j210382j179804
8847D8840150j167811j136952j115790j086279j045126j009086r92608r79639
8839D0306859r48476r20839q92573q67521q49264q24252q07823p84416p63479
8830C2648216p35065p10157o91505o73044o63199o41081o24439o18280n99016
8821B6692430n68316n50838n35699n29691n09218n03429m80380m61521m57348
8812B2095990m57334m31757m08898m14552m09693m11704l86735l50409l47679
8803A8477229l47746l47117l36322l39435l19133l04923l13146l01564k96975
$$ y = [69474907, 68236955, 66950251, 65640890, 64317125, 62976495, 61638044, 60292808, 58937535, 57617571, 56301656, 55000616, 53718523, 52461612, 51230336, 50019954, 48840150, 47672339, 46535387, 45419597, 44333318, 43288192, 42279106, 41286498, 40306859, 39358383, 38437544, 37544971, 36677450, 35828186, 35003934, 34196111, 33411695, 32648216, 31913151, 31202994, 30511489, 29838445, 29175246, 28534165, 27909726, 27291446, 26692430, 26124114, 25573276, 25037577, 24507886, 23998668, 23495239, 23014859, 22553338, 22095990, 21638656, 21206899, 20798001, 20383449, 19973756, 19562052, 19175317, 18824908, 18477229, 18129483, 17782366, 17446044, 17106609, 16787476, 16482553, 16169407, 15867843, 15570868]
8794A5570868k93384k82667k85283k69117k65047k62210k31188k34596k41214
8785A3206162k34633k25532k20430j96975k06254k11318j99306k00031j93735
8776A1317948k04294j96841j87619j70819j66702j73707j52261j66456j75321
8767I723928j57364j40407j56721j50937j38030j39335j40843j29010j21138j37966
8757H312177j27557j19626j19278j15641j02305j19119j23966j20344j09183j15509
8747G139649j14028j04339j05321r3913j00095r4491j02939r9237q0625p5209
8737F169452q4382q5807r0146p7051p9739r0353r0417o4461p3376r9613p5465
8726E258642p6694p0602n9673o6692o4664o6424n4858p0833o3901n3960o0938
$$ y = [15570868, 15277484, 14994817, 14709534, 14440417, 14175370, 13913160, 13681972, 13447376, 13206162, 12971529, 12745997, 12525567, 12328592, 12122338, 11911020, 11711714, 11511683, 11317948, 11113654, 10916813, 10729194, 10558375, 10391673, 10217966, 10065705, 9899249, 9723928, 9566564, 9426157, 9269436, 9118499, 8980469, 8841134, 8700291, 8571281, 8450143, 8312177, 8184620, 8064994, 7945716, 7830075, 7727770, 7608651, 7484685, 7364341, 7255158, 7139649, 7025621, 6921282, 6815961, 6722048, 6621953, 6527462, 6424523, 6325286, 6244661, 6169452, 6085070, 5999263, 5909117, 5832066, 5752327, 5661974, 5571557, 5507096, 5433720, 5334107, 5258642, 5181948, 5111346, 5051673, 4984981, 4920317, 4853893, 4799035, 4728202, 4664301, 4610341, 4549403]
8715D549403o5605m6375n5402n4123m8095o3688n0170m5792n4115n5757p3973
8704C936308n1039l3335k8561l1942n2431n7388m5102n3331k8487m6593n0654
8693C457445m3157m2304l1808k9855l9531l9890l3096l1797l9527l1441l9350
8682C055689l6715m1948l1329m0878k8153k5738k8614m0873m4198j4970k1724
8671B700549l0102k1864k0541m6330m2072l5214k2968j3114k0251l3597k9114
8660B385382k2970l0035j9431k9508l1209j5833k0602k4301j6627k4565j6621
8649B133680k0289k6910k7941k8576j8157j0608j7904j7254j9240k6075k1058
8638A899668r508k7791j1997k4796k6411k2469j2963j7389k0305r697j8610j6709
$$ y = [4549403, 4483798, 4437423, 4382021, 4327898, 4279803, 4216115, 4165945, 4120153, 4066038, 4010281, 3936308, 3885269, 3851934, 3823373, 3791431, 3739000, 3681612, 3636510, 3583179, 3554692, 3508099, 3457445, 3414288, 3371984, 3340176, 3310321, 3270790, 3230900, 3197804, 3166007, 3126480, 3095039, 3055689, 3018974, 2977026, 2945697, 2904819, 2876666, 2850928, 2822314, 2781441, 2737243, 2722273, 2700549, 2670447, 2648583, 2628042, 2581712, 2539640, 2504426, 2481458, 2468344, 2448093, 2414496, 2385382, 2362412, 2332377, 2312946, 2283438, 2252229, 2236396, 2215794, 2191493, 2174866, 2150301, 2133680, 2113391, 2086481, 2058540, 2029964, 2011807, 2001199, 1983295, 1966041, 1946801, 1920726, 1899668, 1890160, 1862369, 1850372, 1825576, 1799165, 1776696, 1763733, 1746344, 1726039, 1716342, 1697732, 1681023]
8626A681023K30r564k5078M943o550k4580k9420j2725J48j133o758j5339q766
8613A546431j4062j2220k2880k7354k302k0273r606L20o708j4001l1683j9495
8601A366167m793k762j8743j5598M637M03j1560j3318j7081J911M666j7773l0477
8588A245679p922n088k051N100k2214j3630r475j4798j1034o078M70j5579j1913
8575A131467k645m497r97L996r341j7701q53m006j3468l319j3371j4963J440j6356
8561A035386O818m773j2181j3547r417L21k459N627J664q582r215M460j135j1707
8547I81260r452k6356j3107j4484M218j0899n313k521n538O134L5463J7238n609
8534I51034k6326l3303k4085j4588j2849l760j4185m171n181j5919K404o079q163
$$ y = [1681023, 1681253, 1671689, 1646611, 1651554, 1645004, 1620424, 1591004, 1578279, 1578427, 1577294, 1570536, 1555197, 1546431, 1532369, 1520149, 1497269, 1469915, 1467613, 1447340, 1437734, 1438054, 1431346, 1417345, 1385662, 1366167, 1361374, 1358612, 1339869, 1324271, 1328908, 1329311, 1317751, 1304433, 1287352, 1289263, 1293929, 1276156, 1245679, 1237757, 1232669, 1230618, 1235718, 1213504, 1199874, 1190399, 1175601, 1164567, 1158489, 1158959, 1143380, 1131467, 1128822, 1124325, 1123328, 1127324, 1117983, 1100282, 1099429, 1095423, 1081955, 1078636, 1065265, 1050302, 1051742, 1035386, 1042204, 1037431, 1025250, 1011703, 1002286, 1002607, 1000148, 1005775, 1007439, 998857, 989642, 994102, 992967, 981260, 971808, 945452, 932345, 917861, 922079, 911180, 905867, 903346, 897808, 903942, 939405, 956643, 951034, 924708, 891405, 867320, 852732, 839883, 836123, 821938, 817767, 812586, 796667, 799071, 792992, 784829]
8521G84829l544j7090l415O655k985l679j1222j0256j3530p556N786k840j4411
8508G06742l947N085o886j1756l148j7604j174J6537j0690j3871l197m457q556
8495F43078o292J4077L466k462q050J827O80M769K552q815j1390r077m834O91
8481F20220k0082r460L980J819j6118j2638J0903J1004r246j513k836r625q512
8468E57896k802J812P269m689p275K609j542L137r996j1964Q476j2279j1552m696
8454E14404o685j4870L000R295o330O961O242l110J328r889j3049N166J2519K217
8440E07199j8502j3606p429L746J1871l027n316J882M252M721j6243j7122j2330
8427D40096l030N529j627j848m662n722N203Q702J2299J3434j4527j5667Q63j360
$$ y = [784829, 781285, 764195, 760780, 767435, 764450, 760771, 749549, 739293, 725763, 718207, 723993, 721153, 706742, 702795, 707880, 700994, 689238, 686090, 668486, 667312, 683849, 673159, 659288, 656091, 651634, 643078, 636786, 650863, 654329, 651867, 643817, 645644, 646324, 651093, 653645, 644830, 633440, 624363, 619529, 620220, 600138, 590678, 594658, 596477, 580359, 567721, 578624, 589628, 580382, 578869, 576033, 566408, 557896, 555094, 556906, 564175, 559486, 552211, 554820, 553278, 556415, 546419, 534455, 542931, 530652, 519100, 514404, 507719, 492849, 495849, 505144, 498814, 505775, 512017, 508907, 510235, 500346, 487297, 492463, 504982, 507199, 488697, 475091, 467662, 471408, 483279, 480252, 474936, 476818, 481070, 485791, 469548, 452426, 440096, 437066, 442595, 440968, 439120, 434458, 428736, 433939, 442641, 454940, 468374, 453847, 438180, 439043, 437683]
8413D37683n740j593L826l002m780K100j5001o629J2512j1854q036n68p008J894
8399C93804O552J6240m18j1339r121O415j6402j3570R063N708J368J4536K662
8386D05498n920j7633L517K700j3663k813r86J2517K498k252n087k680r753l31
8372C65612K0883m792j6291o781K2062J1839k205k770q275p570j5998P225J3614
8359C76553J2294r333j0205r811M766o596p750N130J1880K203j8151q971p325
8346C34684O132O824n285j4529j3728N283K963O352j574j1279L944K456Q763N100
8332C36106j0914q835L164r31n013P756o589N266J9244j775m987m678o479j9077
8318C02258k1212M127p54R504k942m063J418j1466K003L675K601J2679J0644O862
$$ y = [437683, 431943, 430350, 434176, 431174, 426394, 428494, 413493, 406864, 419376, 407522, 399486, 398918, 391910, 393804, 400356, 416596, 416178, 404839, 395718, 402133, 385731, 372161, 381224, 386932, 388300, 402836, 405498, 399578, 381945, 385462, 388162, 374499, 371686, 370700, 383217, 385715, 383463, 378376, 375696, 365943, 365612, 386495, 381703, 365412, 358631, 380693, 392532, 390327, 387557, 379282, 371712, 355714, 362939, 376553, 388847, 379514, 369309, 359498, 364264, 357668, 349918, 355048, 366928, 369131, 350980, 342009, 334684, 340816, 347640, 342355, 327826, 314098, 319381, 322344, 328696, 327122, 315843, 319787, 322243, 331006, 336106, 325192, 316357, 319521, 318590, 313577, 321333, 314744, 320010, 339254, 337479, 332492, 327814, 321335, 302258, 281046, 285173, 284419, 293923, 290981, 286918, 288336, 276870, 278873, 282548, 285149, 297828, 308472, 315334]
8304C15334J1659P557p732n808K0456Q390j1374M899K431m951q206j7601r616
8291C05438j0922k0990k359K876L040m450L198K184O443r93p994o704o416r593
8277B52758J658R676k953j3401k946M326J0186L775n046n67O696M582n000J465
8263B65209J3958o45Q449J806M051J1538J7734o110j9581l0536k746J0988J418
8250B75533k952l062j1966n023J1161J2286j9411N057q692k4174k4807J3288J3370
8237B30608j881L413j1612K175J5513l660j1271N96j480n680q539K118J6523P577
8223B34400K0489p99p308j9933k88P947K653J0372k747L050L164j0564j2974q86
8209B26576M51j1512k722l578L631K355J000l499r140o955K460Q872J5536L30
$$ y = [315334, 326993, 334550, 326818, 321010, 341466, 349856, 338482, 343381, 345812, 340861, 332655, 315054, 305438, 294516, 273526, 271167, 274043, 277083, 272633, 275831, 278015, 284458, 283465, 275471, 268767, 262351, 252758, 254416, 264092, 261139, 247738, 244792, 249118, 259304, 263079, 258033, 257466, 264162, 268744, 263744, 265209, 279167, 278522, 286971, 288777, 292828, 304366, 322100, 315990, 296409, 265873, 263127, 274115, 275533, 272581, 269519, 257553, 252530, 263691, 275977, 256566, 261623, 252931, 228757, 203950, 217238, 230608, 228727, 232140, 220528, 222703, 238216, 234556, 223285, 223881, 222401, 216721, 208182, 210300, 226823, 234400, 254889, 254090, 246782, 226849, 226561, 234508, 237161, 247533, 244786, 247836, 251000, 240436, 227462, 226576, 227027, 215515, 212793, 209215, 212846, 215201, 216201, 212702, 203562, 196607, 199067, 207939, 223475, 223805]
8195B23805q004k498r767L409K489J621o692q067j0209o934J3358Q651J524Q153
8181B10839O49j0411l08R745M03j3960r38J4715Q633J216r101j3798p282J667
8167A92069J455n90n583o751n152J055m434p98R523m306j3748K296o545O140J6135
8152A80766l755n663m383J083Q393J1264L965k0579k880K70K046q991r550j2601
8138A39385N993P628m390K00J5079Q591l439p429Q087j180j0709J1744R339j0096
8124A68803j4152O48l057J341L156k257k834J1140M961p257pJ3903K697j6777
8110A60308o439m270j536L45j005r040P651J6298J0074R59j0672j4400o42n2q050
8095A39529j165J4256p349k5202l495Q348J2625R227n172j2259m146K873M409
$$ y = [223805, 215801, 213303, 203536, 206945, 209434, 211055, 204363, 196296, 186087, 179153, 192511, 201162, 202686, 210839, 211488, 201077, 200769, 210514, 210917, 196957, 196019, 210734, 219367, 220583, 211482, 197684, 190402, 192069, 193524, 192934, 187351, 180600, 175448, 176503, 172069, 171271, 180794, 176488, 162740, 165036, 158491, 164631, 180766, 177011, 171348, 166965, 168048, 176441, 187705, 191670, 171091, 168211, 168481, 170527, 161536, 151986, 139385, 145378, 153006, 148616, 148816, 163895, 172486, 169047, 161618, 169705, 168525, 157816, 169560, 178899, 168803, 154651, 155299, 152242, 153583, 156739, 154482, 151648, 162788, 167749, 160492, 160485, 174388, 177085, 160308, 153869, 149599, 148063, 148408, 147403, 138363, 146014, 162312, 172386, 173345, 162673, 148273, 147631, 147579, 139529, 138364, 152620, 145271, 120069, 116574, 124922, 137547, 146774, 141602, 129343, 125197, 128070, 132479]
8082A32479P974p864M927J911k637o67l007j0135j309M362n435R847J1715j5077
8068A27084J335j2821k420o43Q075J0911j844j1119K576L595n436N32K681j649
8054A20857j506M925N525R583J0462K257p650q667r202q769M568R510N243l569
8040A33567k374l063q711r95p0J748P332M960j107N148P159L500J434r053j3266
8025A26209k399j1741j878M100J0387l079j6052J746J873k313J983o855q498n458
8011H8025R873J0308J2042L138j9806J1693J1623j5918q359Q260O63J3236m49
7998A24329K064m950n229j1768m380j68O221J3202M854j1202l804J5676l90L369
7984A27824J9490n237j6772k522j398K874O628j684j2765m951R560n286j2403
$$ y = [132479, 140453, 132589, 137516, 139427, 136790, 136123, 133116, 122981, 121672, 126034, 120599, 130446, 142161, 127084, 128419, 115598, 113178, 112535, 120610, 131521, 129677, 118558, 121134, 124729, 119293, 119825, 122506, 120857, 119351, 124276, 129801, 139384, 149846, 152103, 144453, 135786, 126584, 117815, 122383, 131893, 137136, 133567, 131193, 128130, 119419, 118424, 118354, 120102, 127434, 132394, 131287, 136435, 143594, 147094, 148528, 139475, 126209, 123810, 112069, 110191, 114291, 124678, 121599, 105547, 107293, 109166, 106853, 108836, 101981, 93483, 88025, 97898, 108206, 120248, 123386, 103580, 115273, 126896, 110978, 102619, 110879, 111542, 124778, 124329, 126393, 121443, 116214, 104446, 100066, 99898, 106119, 119321, 124175, 112973, 109169, 124845, 124455, 127824, 147314, 142077, 125305, 122783, 121385, 124259, 130887, 129203, 116438, 111487, 121047, 115761, 103358]
7971A03358j3829r54O516L387L596J5464l347O84M250Q454P758M208j80p219j4639
7956A17507P318N302L886J831k1474m902J8j5871o173m364M386K5184P306n048
7942A14906k062q995p292P592M955O614K702o130m710p67R205M790J680N442j438
7927A26492n379j989m761m652M433J7435j4349j4176J0065P038p928j0855M592
7914A05966l767L108J7062J671j292O660p475n418k3503L66l17R316l813o354
7900I2210p672q096N061m781J749O366n638n390J4185P368r542J2505K313j4172
7886H6466Q586J7386J4033J0170p346j3791m774l395p891j5744J967K241m775
7873H3133j43P114Q022p422o094L701k988k571J795J6090J1865k993o309M293
$$ y = [103358, 89529, 88575, 95091, 98478, 102074, 117538, 114191, 114875, 119125, 127579, 135337, 139545, 139365, 132146, 117507, 124825, 130127, 134013, 135844, 114370, 109468, 109486, 93615, 87442, 83078, 87464, 112648, 119954, 114906, 112844, 103849, 96557, 104149, 109104, 115718, 118420, 112290, 107580, 106813, 116018, 120808, 122488, 127930, 126492, 121113, 119124, 114363, 109711, 114144, 131579, 117230, 103054, 113119, 120157, 112229, 101374, 105966, 102199, 105307, 122369, 124040, 122748, 129408, 121933, 116515, 93012, 93378, 93061, 102377, 98564, 92210, 84538, 76442, 81503, 76722, 78471, 84837, 79199, 73809, 87994, 95362, 85820, 98325, 100638, 86466, 95052, 112438, 126471, 136641, 129295, 115504, 110730, 107335, 99444, 83700, 85667, 87908, 83133, 82990, 90104, 98126, 90704, 84610, 88311, 85323, 82752, 84547, 100637, 112502, 109509, 103200, 107493]
7859A07493o035j5800o614O240j429l17p850n833K622j127o386L770J2271J1802
7845I2807J237L966n270q670k99j4185j3876n024J0416J7496O992k348k409j342
7831G9491N232N478M540m427N177M787l000m661N397K016N40J176r07k365m163
7816I4311j0884q649n08M427p823j012k706j5881L767J0174K545P971j055p894
7802F6783r652o96P487J700J0121P18m332Q13q158k713m580P187k788j538J8647
7787G8999Q927q297k368J2173p558j3256n581n94k437O076L577K714M962l255
7773G4082k379M484j35P001O008j7328j4224n79J0478N04l86j72R985k357j40
7758G4842j9774L50J8162o250p144p137j1073N862K5222Q671j3265j5559O580
$$ y = [107493, 101458, 85658, 79044, 85284, 83855, 83538, 75688, 69855, 72477, 71350, 64964, 68734, 81005, 92807, 94044, 98010, 92740, 84070, 83771, 69586, 55710, 50686, 61102, 78598, 85590, 83242, 80833, 79491, 84723, 90201, 94741, 90314, 95491, 100278, 97278, 92617, 98014, 100030, 100570, 101746, 100839, 98474, 94311, 83427, 74778, 74270, 78697, 70874, 69862, 67156, 51275, 55042, 65216, 67761, 75732, 74677, 66783, 57131, 56435, 63922, 65622, 75743, 76461, 72129, 72942, 64784, 62071, 57491, 64678, 61890, 60352, 78999, 87926, 79629, 77261, 89434, 81876, 68620, 63039, 62445, 60008, 66084, 69661, 72375, 77337, 74082, 71703, 76187, 76052, 83053, 89061, 71733, 57509, 56930, 67408, 67912, 67526, 67354, 77339, 74982, 74842, 55068, 55418, 73580, 67330, 60186, 53049, 41976, 47838, 73060, 81731, 68466, 52907, 59487]
7745E9487M062j4050k1892K288J0241Q467O760j0117P369k942J1762M338j1841
7732E3932k372j154n526p885j213J4593o360n950J6812L226j334q233j8372K841
7718C3005J5975K927o309J3824J2080j1376r567l627N400J6794M505j0648K0000
7705H2983q164J0008K1843q704j4443j0848J09K644k866N73P261j358j4357j0095
7691E4586k811K856K1535R729j685n973p410j2945j8811R896R915j1568j846J7522
7677F2990J0034L426j4540j0393L785K647O220j0783j2306n96K139M568M046N449
7663E6686K759P703O237r189n013O98r802q251j1082P414L959K252K056n196N939
7648D7170P643l179r383j6739M719j809n826J1681J4462J1782K967J846j9571
$$ y = [59487, 63549, 49499, 27607, 29895, 40136, 48603, 55363, 45246, 52615, 49673, 61435, 65773, 53932, 51560, 50406, 44880, 36995, 35782, 50375, 44015, 38065, 54877, 58103, 56769, 48536, 30164, 33005, 48980, 51907, 45598, 59422, 71502, 60126, 50559, 46932, 52332, 69126, 73631, 62983, 82983, 74819, 84827, 106670, 97966, 83523, 72675, 72784, 75428, 72562, 73135, 80396, 79038, 64681, 54586, 51775, 54631, 76166, 85895, 84210, 78237, 70827, 57882, 39071, 48967, 58882, 47314, 45468, 62990, 73024, 76450, 61910, 51517, 55302, 57949, 64169, 53386, 41080, 40484, 42623, 47191, 51237, 56686, 59445, 67148, 73385, 64196, 59183, 59881, 50079, 41828, 30746, 38160, 42119, 44371, 46427, 41231, 47170, 54813, 51634, 42251, 25512, 30231, 28422, 22596, 34277, 48739, 60521, 63488, 65334, 45763]
7635D5763j4708J612J3859K303L380k826K025N312P923j618j0039J322M140k933
7621E5515q138O136R62L030j2885O20r810p267m875P259J7824j917r106j0132
7607B7216J590K111n653j076L199J459q247n162K1952K169j3157M913K216L353
7593C6883K831p870r516N994J0906R094Q33q659n003k261M142Q813j467j7892
7579B6828j1413K1509J8879P866n748l456N889n630R823K963p662l477k0467J1831
7565D7735J1357J2834j2071j3703q652j11L784Q909j519m249R660j702n059J0151
7551E7364k7817j3114J5851P400m530l434r966o943Q985J1373M269L782R478K907
7537E5605k1869r637L758m760q841K506J608M531m303L112r602K45p59l334L010
$$ y = [45763, 31055, 32667, 46526, 48829, 52209, 49383, 51408, 56720, 64643, 63025, 52986, 54308, 58448, 55515, 47377, 53513, 54475, 57505, 44620, 45240, 35430, 28163, 23288, 30547, 48371, 46454, 37348, 27216, 28806, 30917, 25264, 24188, 27387, 28846, 20599, 15437, 37389, 39558, 26401, 31314, 33530, 36883, 39714, 31844, 22328, 28322, 39228, 48322, 49155, 40496, 35493, 33232, 37374, 46187, 44720, 26828, 15415, 36924, 55803, 63669, 57921, 54465, 60354, 54724, 64547, 67510, 59848, 56371, 35904, 47735, 59092, 71926, 59855, 46152, 37500, 37389, 41173, 50082, 48563, 44314, 53974, 52272, 47213, 57364, 29547, 16433, 32284, 39684, 35154, 31720, 21754, 14811, 23796, 35169, 39438, 43220, 52698, 55605, 33736, 24099, 27857, 23097, 14256, 16762, 18370, 22901, 18598, 21710, 12108, 12353, 11594, 8260, 11270]
7522A1270L742K675J7583J045J279P070Q538l265K464o157j6545j055K4782O117
7508E9543j3565l951j3303K300R652k225K855M60L234N511k249o696m579k35q41
7493C5911l063J1878n770k265N862P301j267o615M26n36K130J5458J0535o206
7479F3779p909j6224q38o896P876k964J9443J3022j2905p133N717j1443l593o750
7465C3182O158P260j3767k150j387K631N160j900o406k233J1329P274k834n805
7451C6512O006r971n301K907J5971K491j3706p483k226m230J0063J6048l28j640
7437D5113j0062o825Q668K966r856j8237o865N942l038J3689K652k402K202J888
7423B5835J568N581O089j814J31M932k032k208j788J985O427l888P646N654K246
$$ y = [11270, 15012, 17687, 35270, 36315, 37594, 44664, 53202, 49937, 52401, 46244, 29699, 28644, 53426, 59543, 45978, 42027, 28724, 31024, 40676, 38451, 41306, 41766, 45000, 50511, 48262, 41566, 36987, 36752, 35911, 32848, 44726, 38956, 36691, 42553, 49854, 48587, 41972, 42398, 41862, 43992, 59450, 69985, 63779, 55870, 39646, 38808, 31912, 39788, 36824, 56267, 69289, 56384, 49251, 54968, 43525, 39932, 33182, 39340, 46600, 32833, 30683, 29296, 31927, 37087, 35187, 28781, 26548, 37877, 45151, 42317, 36512, 42518, 32547, 27246, 30153, 46124, 48615, 34909, 27426, 25200, 20970, 31033, 47081, 46753, 45113, 35051, 28226, 36894, 39860, 30004, 11767, 4902, 10844, 7806, 21495, 24147, 21745, 23947, 25835, 27403, 32984, 39073, 37259, 37390, 42322, 40290, 38082, 36294, 38279, 44706, 40818, 48464, 54118, 56364]
7408E6364j800l149l931n768j0759k140K915M262m433J5690J9043K611k4752j7038
7394B7115M326L689j6381l424l422k188K793J045j4653K3462K4366p207o957q011
7380B4553j1419N12J372J7258k494m493J2731j1187j2362O186N59r782K205l682
7366I957K142J1144J1661J1007j04k63m654L599m920p083r225k62J0102N741r380
7351B9462o956L202J1013m325j0206k046J211R02L420J3096J4127M014O446l964
7337E9396j8935j0764n901p550p805K824p586j1507R650L2683R893r289j6783
7324A8326O586P494M125n337J7289Q773j2947j6909m153L611M831m906r724J801
7310A8860m000m68O674J5523L916N712r62o701j1760j560j1939N453M436r723
$$ y = [56364, 54564, 51415, 47484, 41716, 30957, 28817, 31732, 35994, 31561, 47251, 66294, 68905, 44153, 27115, 31441, 35130, 18749, 15325, 11903, 9715, 12508, 13553, -1100, 22362, 46728, 39521, 32564, 24553, 13134, 13646, 15018, 32276, 29782, 25289, 38020, 26833, 14471, 20657, 21216, 11434, 13639, 9957, 12099, 23243, 34904, 45911, 45807, 45544, 40890, 44489, 39569, 32486, 23261, 22999, 33101, 38842, 29462, 22506, 25708, 36721, 32396, 22190, 20144, 21355, 22257, 25677, 38773, 52900, 56914, 63360, 59396, 40461, 29697, 23796, 16246, 8441, 11265, 3679, -7828, 1822, 34505, 44398, 35109, 18326, 24912, 32406, 36531, 31194, 48483, 57256, 44309, 27400, 23247, 26858, 31689, 26783, 17059, 18860, 14860, 14392, 21066, 36589, 40505, 46217, 45255, 38554, 26794, 25234, 13295, 18748, 23184, 13461]
7296A3461j218o26J3688Q172j660n272J2409j574m313k348p561Q554L989O61k193
7281C4169J965K796L461l885M956J96L092k1133K643J5729O303r028j1371l615
7267B6278n159M67Q939N143j042m180j967J1144N652j8130j6896j464K0428M005
7253C3218m076L124O291J335O104m878k3620k506J9686J3680l697N423p340m300
7239C8444n860o091J427m003O73J2096K856r184K485O035k124q971o507j020J150
7224B1406P095K315K968Q753k840o479J198o634k5401r695J1030N388N074J0904
7210B5082N631Q53p906N137K79k695j272q550m81P246m056j5932o178J718K2707
7195B1583J5771j17K010j303m858j248O012J695l114j1697m542Q028l096q268
$$ y = [13461, 12243, 11617, 25305, 33477, 31817, 26545, 38954, 37380, 33067, 30719, 23158, 31712, 35701, 36362, 34169, 36134, 38930, 42391, 38506, 43462, 43658, 46750, 25617, 28260, 43989, 50292, 41264, 29893, 26278, 21119, 21586, 30525, 35668, 34626, 30446, 28479, 39623, 45275, 27145, 10249, 8785, 29213, 33218, 29142, 32266, 38557, 39892, 45996, 41118, 17498, 14992, 34678, 48358, 44661, 50084, 42744, 38444, 32584, 26493, 27920, 23917, 24590, 36686, 39542, 30358, 32843, 38878, 36754, 27783, 21276, 20256, 21406, 28501, 30816, 33784, 42537, 39697, 33218, 34416, 27782, 2381, -7314, 3716, 9104, 14178, 25082, 30713, 31566, 23660, 28797, 29076, 26381, 25109, 16559, 16078, 23324, 19268, 3336, -2842, -1124, 21583, 37354, 37237, 39247, 37944, 33086, 31838, 37850, 39545, 36431, 24734, 20192, 28220, 25124, 16856]
7181A6856N224J0046M27p185K073M852j828k454Q450j2597R46J4689J3262j853
7167E0908k373j5685j8726m272Q872l717J2726J1685j0044j0380j662n586P71
7154A2517p131J0501M492K484j681l221M409l594L557M887j9217q626J3568J0419
7140B3364o779J4721O458M40N359j5049j7360j065R936l666P135K188q174P6o825
7125A0759n50R338J4645o962n829M562j013M647j3226j0186R340P373J4737N227
7111D2862P53k738q170j2241k555o751L56o216J096k317j7019L137J1495J4226
7097A5918j122m548J3134O914N087m896K13K093P00j4635K235P263j2533J869
7083A7692o701J5201L139m066l830J686O863P260J6945o182o855j8195r66q266
$$ y = [16856, 22080, 32126, 32553, 25368, 27441, 32293, 30465, 28011, 36461, 23864, 24810, 39499, 52761, 50908, 48535, 32850, 14124, 9852, 18724, 15007, 27733, 39418, 29374, 18994, 17332, 11746, 12517, 5386, 15887, 20379, 22863, 21182, 17961, 22370, 18776, 22333, 27220, 8003, -623, 12945, 23364, 16585, 31306, 37764, 38204, 43563, 28514, 11154, 10089, 20025, 16359, 23494, 25682, 17508, 17584, 10759, 10209, 19547, 34192, 27230, 21401, 25963, 24950, 29597, 16371, 6185, 15525, 22898, 37635, 42862, 43615, 40877, 32707, 20466, 17911, 11160, 11516, 5300, 6396, 4079, -12940, -9803, 1692, 15918, 14796, 10248, 23382, 30296, 35383, 30487, 30700, 32793, 33493, 18858, 21093, 28356, 15823, 17692, 10991, 26192, 29331, 25265, 21435, 23121, 29984, 37244, 54189, 48007, 41152, 22957, 21991, 13725]
7069A3725o81k031K363J806R362O922J1972L734o719o098j2161M293P527J1346
7055D5360j3726j8844j5370N541P875J0810P465J149N389r075q107J0139k458
7042B6148Q14J760Q376N605l974K467j3785O082j3021j4767Q437n68O30J2575
7028B6779j659j8426K026k172l259n600M797K1252J2461O102j6320j3405P455
7015B0031J302O457m515o320J3414m212p388q597K88J2026K49j228n335K122N463
7000B3757n237j7194M862N882Q623m864k666N579J5078J327N37o443o366M280
6986B7155N163O11n202m264p016q416P25M953l712J1203Q445j4481j4076p039
6972e951J1027N826j0310M659J141R552N790j1952k690N147O457J207R07j4085
$$ y = [13725, 13044, 11013, 13376, 15182, 24544, 31466, 43438, 47172, 40453, 34355, 22194, 26487, 34014, 45360, 31634, 12790, -2580, 2961, 10836, 21646, 29111, 30260, 35649, 26574, 18467, 28606, 26148, 26962, 28722, 37098, 42703, 38729, 41196, 27411, 33493, 20472, 5705, 14142, 13574, 14204, 26779, 25120, 6694, 8720, 6548, 3289, -2311, 2486, 23738, 36199, 42301, 25981, 12576, 20031, 21333, 27790, 23275, 16955, 30369, 26157, 18769, 10172, 10460, 22486, 22735, 21507, 16172, 18294, 23757, 18520, 1326, 6188, 12070, 20693, 15829, 13163, 18742, 33820, 35147, 35684, 29241, 22875, 27155, 32318, 32929, 27727, 23463, 16447, 8031, 8756, 13709, 9997, 21200, 29645, 15164, 1088, -5951, 5076, 10902, 592, 5251, 6392, 15944, 21734, 9782, 7092, 12239, 18696, 19903, 20810, 6725]
6958F725j129J5131J4853n150m359M885Q90M838L325J548o537j5547k403m82m26
6943A6162N97j892L587j099j165o108J637J7746n029k055o72k58r664j3697j0219
6928a2129L820P890M320l812r432k3693j171N715L407n491J1326K8216J4898j2156
6914A1708L750Q102m154j1308p855N429o536J6019J3843k679j530L713K469o406
6900B4565k0823n351N725Q786J3144j232q295N850R904J6853j696j4721j1455
6887B1254j117N071J4220j2531j1980r662n2O935k112k94J5255O369j1554p434
6873A2368J0886n985K755J480j1584q471r404M974N320J5819Q312P05M490j451
6859C0214Q731k1874j3756K044J2816N482K432j399j6262r068q919J2278Q138
$$ y = [6725, 5596, 20727, 35580, 30430, 26071, 30956, 31846, 36684, 40009, 41557, 35020, 19473, 17070, 16588, 16162, 16759, 14867, 18454, 17355, 16190, 10082, 11719, 29465, 24436, 22381, 21709, 21451, 11787, -1910, -12129, -8309, -419, 3901, 89, -9343, -33036, -34207, -28492, -25085, -30576, -19250, 8966, 23864, 11708, 15458, 23560, 19406, 8098, 243, 5672, -864, 15155, 28998, 26319, 24789, 28502, 30971, 24565, 3742, -1609, 4116, 12902, 26046, 24814, 16519, 22369, 32273, 49126, 47430, 32709, 21254, 20137, 25208, 39428, 26897, 14917, 5255, 5203, 12138, 10026, 9732, 24987, 31356, 19802, 12368, 23254, 17269, 20024, 21504, 9920, 1449, -7955, -2981, 2339, 18158, 26470, 27175, 31665, 30214, 38945, 17071, 3315, 5359, 18175, 23657, 26089, 24690, 8428, -640, -9559, 2719, 10857]
6846A0857k597M762M747k424j4245p754N476L950p231o041P948Q020N823M249
6832A5540J1307Q68L217j0932n314R404j1737p722N672N468r500n428R156J6617
6818B6616J4031J2823l999j7141j0108P436j990p839q148o259n896j6352R176
6805g650O250O170R283p734p32l280J763o235j848J698p594p092J986K3218N891
6790A4094L902k432j2078m035M549P404M231k565J989J9107J3547K6189Q704l0952
6776E1654k1378j3687r404P005M218P067k876j0084k321M766j265j475J2429M438
6762B9087n141p918J6446J7560O658J209j897K174N098K026O549n634j4199j0159
6748D1859j1171n712J1992R555m671M566Q227N663k668k603p880K3493J4620r
$$ y = [10857, 8260, 13022, 17769, 15345, 1100, -6654, -1178, 2772, -4459, -10500, -2552, 5468, 11291, 15540, 26847, 27715, 30932, 20000, 14686, 24090, 12353, 4631, 10303, 15771, 6271, 843, 9999, 26616, 40647, 53470, 49471, 32330, 22222, 29658, 27668, 19829, 11681, 5422, -474, -16826, -7650, -1400, 4770, 14053, 6319, 5587, 2307, 4070, -2165, -4013, -2315, -9909, -17001, -15015, 8203, 14094, 17996, 15564, 3486, -549, 4000, 11404, 15635, 13070, 15059, 34166, 47713, 73902, 82606, 51654, 30276, 16589, 7185, 14190, 18408, 25475, 22599, 12515, 10194, 14960, 13695, 12220, 24649, 29087, 23946, 16028, 32474, 50034, 56692, 57901, 56004, 58178, 63276, 65302, 71851, 66217, 52018, 41859, 30688, 24976, 36968, 46523, 41852, 46418, 54645, 60308, 57640, 55037, 47157, 70650, 85270, 85261]
6734H5261o631j7564j3075K616j2114k435J1201K4876J6095l976k587J1726m704
6721H8689M90J3449L3765N0091P7356J25830K33786L63710M33587M04847J07290
6710A932890m75329n08302k88523j60022r3635n8699m9104j6563j3396o929j9144
6699B43244k0861l253k615r124k3236O068L3658P7704J13320R7902R4350o121
6687F01036j30185r6554o8674l4697l7630k8962j4796q654j4187j4779j7079j1219
6675A23620m478r22L381L451p021k397J48L838N781m181j2898r759N674P095p049
6660A04283o227j035j9598J580p24q261N703N289j554j0423p533L013j305j2968
$$ y = [85261, 78630, 61066, 47991, 50607, 38493, 36058, 47259, 72135, 88230, 84254, 81667, 93393, 88689, 89179, 102628, 136393, 186484, 263840, 389670, 623456, 987166, 1420753, 1825600, 1932890, 1457561, 949259, 660736, 500714, 407079, 348380, 299276, 282713, 269317, 262388, 243244, 222383, 219130, 216515, 207391, 184155, 190223, 223881, 301585, 414905, 512807, 607157, 601036, 470851, 374297, 305623, 270926, 233296, 204334, 189538, 180884, 166697, 151918, 134839, 123620, 119142, 118220, 121601, 125052, 118031, 115634, 115782, 119620, 125401, 121220, 108322, 98563, 104237, 111332, 104283, 98056, 97021, 77423, 79003, 78279, 70018, 75721, 81010, 79456, 69033, 61500, 64513, 63208, 50240]
$$ [...]
##END NTUPLES=NMR SPECTRUM
##END=
