##TITLE=Analysis number 321691
Compound Code mo 00885
Project Code adrs
Chemist Name prosynth
##JCAMPDX= 6.0         $$ Bruker NMR JCAMP-DX V2.0
##DATA TYPE= NMR SPECTRUM
##DATA CLASS= NTUPLES
##ORIGIN= Bruker BioSpin GmbH
##OWNER= nmr
$$ XWIN-NMR		Version 3.5
$$ Tue Aug 22 14:23:56 2006 GMT Daylight Time (UT+1h)  MAYBRIDGE\nmr@NMR_250MHZ
##.OBSERVE FREQUENCY= 250.131544655141
##.OBSERVE NUCLEUS= ^1H
##.ACQUISITION MODE= SIMULTANEOUS (DQD)
##.ACQUISITION SCHEME= undefined
##.AVERAGES= 16
##.DIGITISER RES= 18
##SPECTROMETER/DATA SYSTEM= dpx250
##.PULSE SEQUENCE= zg30
##.SOLVENT NAME= DMSO
##.SHIFT REFERENCE= (INTERNAL, DMSO, 0, 16.522)
##AUDIT TRAIL= $$ (NUMBER, WHEN, WHO, WHERE, WHAT)
$$ ##TITLE= Audit trail, XWIN-NMR		Version 3.5
$$ ##JCAMPDX= 5.01
$$ ##ORIGIN= Bruker BioSpin GmbH
$$ ##OWNER= nmr
$$ C:\u/data/dgb/nmr/ADRS/1420/pdata/1/auditp.txt
$$ ##AUDIT TRAIL=  $$ (NUMBER, WHEN, WHO, WHERE, WHAT)
(   1,<2006-08-22 14:23:34.26 +100>,<MAYBRIDGE\nmr>,<NMR_250MHZ>,
      <created by zg, POWCHK disabled, PULCHK disabled
       configuration hash MD5:
       E2 DF 36 D8 04 B2 41 60 5A D7 A3 38 5A 4B D0 FE
       data hash MD5: 64K
       E8 8A 8E 07 7B B6 3E 4F 61 97 C9 B0 C9 27 99 67>)
(   2,<2006-08-22 14:23:46.30 +100>,<MAYBRIDGE\nmr>,<NMR_250MHZ>,
      <Start of raw data processing
       ef LB = 0.3 FT_mod = 6 PKNL = 1 SI = 32K 
       data hash MD5: 32K
       6D 11 1B 8F 41 B0 F5 12 F0 1A 67 AC 7E 38 FD 21>)
(   3,<2006-08-22 14:23:48.07 +100>,<MAYBRIDGE\nmr>,<NMR_250MHZ>,
      <apk 
       data hash MD5: 32K
       49 66 69 03 72 BB FB 25 CF 9A C0 29 AD 99 C1 B3>)
(   4,<2006-08-22 14:23:48.83 +100>,<MAYBRIDGE\nmr>,<NMR_250MHZ>,
      <abs ABSG = 5 
       data hash MD5: 32K
       D6 D8 15 11 57 0F A7 B6 3D 69 FC 2B 09 5D C6 76>)
$$ ##END=
$$ 
$$ hash MD5
$$ 8B E9 78 D0 37 6D 01 22 23 02 F3 B2 C2 FC 22 BD
##$RELAX= 
##$RELAX= 
##$RELAX= 
##$RELAX= 
##$RELAX= 
##$RELAX= 
##$RELAX= 
$$ Bruker specific parameters
$$ --------------------------
##$DU= <C:\u>
##$EXPNO= 1420
##$NAME= <ADRS>
##$PROCNO= 1
##$TYPE= <nmr>
##$USER= <dgb>
##$AMP= (0..31)
100 100 100 100 100 100 100 100 100 100 100 100 100 100 100 100 100 100 
100 100 100 100 100 100 100 100 100 100 100 100 100 100 
##$AQSEQ= 0
##$AQ_mod= 3
##$AUNM= <au_zg>
##$AUTOPOS= <43 >
##$BF1= 250.13
##$BF2= 250.13
##$BF3= 250.13
##$BF4= 250.13
##$BF5= 500.13
##$BF6= 500.13
##$BF7= 500.13
##$BF8= 500.13
##$BYTORDA= 1
##$CFDGTYP= 0
##$CFRGTYP= 5
##$CHEMSTR= <none>
##$CNST= (0..31)
1 1 145 1 1 1 1 1 1 1 1 1 1 1 1 1 1 1 1 1 1 1 1 1 1 1 1 1 1 1 1 1 
##$CPDPRG= <>
##$CPDPRG1= <>
##$CPDPRG2= <>
##$CPDPRG3= <>
##$CPDPRG4= <mlev>
##$CPDPRG5= <mlev>
##$CPDPRG6= <mlev>
##$CPDPRG7= <mlev>
##$CPDPRG8= <mlev>
##$CPDPRGB= <>
##$CPDPRGT= <>
##$D= (0..31)
0 1 0 0 0 0 0 0 0 0.06 0 0 0 0 0 0 0.0002 0 0 0 0 0 0 0 0 0 0 0 0 0 0 
0 
##$DATE= 1156253013
##$DBL= (0..7)
120 120 120 120 120 120 120 120 
##$DBP= (0..7)
150 150 150 150 150 150 150 150 
##$DBP07= 0
##$DBPNAM0= <>
##$DBPNAM1= <>
##$DBPNAM2= <>
$$ [...]
##$SUBNAM7= <"">
##$SUBNAM8= <"">
##$SUBNAM9= <"">
##$SW= 20.6930455092707
##$SWIBOX= (0..15)
0 0 3 0 0 0 0 0 0 0 0 0 0 0 0 0 
##$SW_h= 5175.983436853
##$TD= 65536
##$TD0= 1
##$TE= 296.16
##$TE2= 300
##$TE3= 300
##$TEG= 300
##$TL= (0..7)
0 120 120 120 120 120 120 120 
##$TP= (0..7)
150 150 150 150 150 150 150 150 
##$TP07= 0
##$TPNAME0= <>
##$TPNAME1= <>
##$TPNAME2= <>
##$TPNAME3= <>
##$TPNAME4= <>
##$TPNAME5= <>
##$TPNAME6= <>
##$TPNAME7= <>
##$TPOAL= (0..7)
0.5 0.5 0.5 0.5 0.5 0.5 0.5 0.5 
##$TPOFFS= (0..7)
0 0 0 0 0 0 0 0 
##$TUNHIN= 0
##$TUNHOUT= 0
##$TUNXOUT= 0
##$USERA1= <user>
##$USERA2= <user>
##$USERA3= <user>
##$USERA4= <user>
##$USERA5= <user>
##$V9= 5
##$VALIST= <valist>
##$VCLIST= <CCCCCCCCCCCCCCC>
##$VD= 0
##$VDLIST= <DDDDDDDDDDDDDDD>
##$VPLIST= <PPPPPPPPPPPPPPP>
##$VTLIST= <TTTTTTTTTTTTTTT>
##$WBST= 1024
##$WBSW= 4
##$XGAIN= (0..3)
0 0 0 0 
##$XL= 0
##$YL= 0
##$YMAX_a= 264490
##$YMIN_a= -382481
##$ZGOPTNS= <>
##$ZL1= 120
##$ZL2= 120
##$ZL3= 120
##$ZL4= 120
##$ABSF1= 16.522
##$ABSF2= -4.171173
##$ABSG= 5
##$ABSL= 3
##$ALPHA= 0
##$AQORDER= 0
##$ASSFAC= 0
##$ASSFACI= 0
##$ASSFACX= 0
##$ASSWID= 0
##$AUNMP= <proc_1d>
##$AZFE= 0.1
##$AZFW= 0.1
##$BCFW= 0
##$BC_mod= 0
##$BYTORDP= 0
##$COROFFS= 0
##$CY= 12.5
##$DATMOD= 1
##$DC= 0
##$DFILT= <>
##$DTYPP= 0
##$F1P= 14.0000005364418
##$F2P= -0.99999901652339
##$FCOR= 0.5
##$FTSIZE= 32768
##$FT_mod= 6
##$GAMMA= 0
##$GB= 0
##$INTBC= 1
##$INTSCL= 1
##$ISEN= 128
##$LB= 0.3
##$LEV0= 0
##$LPBIN= 0
##$MAXI= 10000
##$MC2= 0
##$MEAN= 0
##$ME_mod= 0
##$MI= 0
##$NCOEF= 0
##$NC_proc= -5
##$NLEV= 6
##$NOISF1= 0
##$NOISF2= 0
##$NSP= 0
##$NTH_PI= 0
##$NZP= 0
##$OFFSET= 16.522
##$PC= 1
##$PHC0= 138.6648
##$PHC1= 19.09254
##$PH_mod= 1
##$PKNL= yes
##$PPARMOD= 0
##$PSCAL= 4
##$PSIGN= 0
##$REVERSE= no
##$SF= 250.13
##$SI= 32768
##$SIGF1= 0
##$SIGF2= 0
##$SINO= 400
##$SIOLD= 32768
##$SREGLST= <1H.DMSO>
##$SSB= 0
##$STSI= 32768
##$STSR= 0
##$SW_p= 5175.98343685301
##$SYMM= 0
##$S_DEV= 0
##$TDeff= 65536
##$TDoff= 0
##$TI= <Analysis number 999999
Compound Code 99
Book Reference 9
Project Code 9>
##$TILT= no
##$TM1= 0
##$TM2= 0
##$TOPLEV= 0
##$USERP1= <user>
##$USERP2= <user>
##$USERP3= <user>
##$USERP4= <user>
##$USERP5= <user>
##$WDW= 1
##$XDIM= 32768
##$YMAX_p= 375951153
##$YMIN_p= -948112
$$ End of Bruker specific parameters
$$ ---------------------------------
##NTUPLES= NMR SPECTRUM
##VAR_NAME=  FREQUENCY,     SPECTRUM/REAL,   SPECTRUM/IMAG
##SYMBOL=    X,             R,               I
##VAR_TYPE=  INDEPENDENT,   DEPENDENT,       DEPENDENT
##VAR_FORM=  AFFN,          ASDF,            ASDF
##VAR_DIM=   32768,         32768,           32768
##UNITS=     HZ,            ARBITRARY UNITS, ARBITRARY UNITS
##FACTOR=    0.157963299565203, 1,           1
##FIRST=     4132.6476996994, 0,             0
##LAST=      -1043.33573715361, 0,           0
##MIN=       -1043.33573715361, -948112,     0
##MAX=       4132.6476996994, 375951153,     0
$$ Real data points
##PAGE= N=1
##DATA TABLE= (X++(R..R)), XYDATA
$$ [...]
25657b0621o3624k1435J08284J87495m2254l55625j82795M9911J13824J672j31429
25646c56597r0973K34536M26691J5706l8856o9760J2083l6734j20830j2796k40856
25635b78386k03326J49790J97823J30150M0341k6723J10326j02100k06079M5797
25625a42387J08328M9816k05529j21013K69795j78787j46375j26246J58478o0395
25615c94315M0228q9011K80899K45660q0166j64263J45084j4061J38023m9605
25605E8473N3742j84689j16977J89810M1088k76374j2206L23383n2113j9162R2523
25594I7498r3258j94082J33381j1374r4399n3302j78763J38585J59583o1899P7190
25583h0840O8133k50023l41524Q59J04431N25657J55808j07563K00123R3846l29595
$$ y = [-20621, -84245, -105680, 2604, 190099, 147845, -207780, -390575, -340664, -226840, -225168, -356597, -447570, -213034, 213657, 229363, 190507, 120747, 132830, 96096, -24734, -37530, -278386, -481712, -331922, -134099, -3949, 36392, 9669, 119995, 17895, -188184, -142387, -34059, 15757, -189772, -310785, -40990, -219777, -366152, -492398, -333920, -394315, -354087, -443098, -162199, 83461, 3295, -160968, -15884, -29945, 108078, 58473, 112215, -72474, -189451, 359, 41447, -234927, -247133, 76250, 24137, 4975, 97498, 4240, -189842, -56461, -67835, -162234, -215536, -394299, -255714, -96131, -158030, -80840, -12707, -262730, -604254, -603395, -498964, 26693, 182501, 74938, 275061, 368907, 39312]
25572C9312M7949j40292j27763r850J81038K13113Q3362l03961j62553J34305
25562d5340k7875J12714J16863k37055k30374O3279J24858j30233n523J77483
25552h1203o237j67663j02314k25091J30697n723l9979J12831K35669K89351q1580
25541E8758k26388J2173M2147M6468J44616P2320k56413K85685J77982k33164
25531A24184j45271q143P987Q2630j5995q8147k38022J30844K62631j41414n2879
25520h1595K82130J4306o8160j50349r4404p4431J46154K9189k12788j29580R3367
25509b46161j40202P4897J78821L78344J51350q2591L7978J70322j74179j79953
25499A68626o2258J5550O3468J73353p975q2855L110j12281L2075j38494k715
$$ y = [39312, 87261, -53031, -180794, -190644, -9606, 203507, 286869, -17092, -179645, -45340, -73215, 39499, 156362, -80693, -311067, -247788, -122930, -253163, -258686, -81203, -87440, -255103, -357417, -582508, -451811, -457534, -497513, -384682, -149013, 140338, 58758, -167630, -155457, -113310, -66842, 77774, 150094, -106319, 179366, 357348, 124184, -21087, -29230, -21243, 61387, 45392, -42755, -280777, -149933, 112698, -28716, -81595, 200535, 214841, 146681, -3668, -98072, -172503, -26349, 2840, -209948, -339528, -246161, -386363, -311466, -132645, 245699, 397049, 314458, 352436, 522758, 348579, 168626, 106368, 121918, 185386, 358739, 350764, 267909, 271019, 158738, 190813, 52319, 49604]
25488D9604R1543o1898l2590J45734q9367j7201j00490k51439o865m9501m9851
25477c72321J08533L35837j35647j21097J26356J2261O3104N2206l23643o5566
25467c19977L12916J8816j67544J61850J08017M5384J14417o8221k05586j82367
25457a82295l3757J39579Q1042j73155Q0042K64231J63018Q9493j0568l64128
25447E3502j71542R4502J46326m8927k91598j06512J34639P8918j7704J62184
25437C3788K08687O3881j51517j66608L060q7828j17285J6935l3218M6117J94186
25426A0198K04950r6119j68776R1922j29175Q3182m8484R1336N5532N5429o7737
25415H2258p2083n948p6661J1763J00500k16507J354J36486N0134M0416k90957
$$ y = [49604, 141147, 79249, 46659, 192393, 103026, 85825, -14665, -266104, -272969, -322470, -372321, -263788, 72049, -63598, -184695, -58339, -46078, 17026, 69232, -254411, -319977, -7061, 11755, -155789, 6061, 114078, 159462, 273879, 205658, 72, -182295, -216052, -76473, 4569, -168586, -88544, 175687, 338705, 428198, 417630, 53502, -118040, -23538, 122788, 73861, -217737, -324249, -189610, -110692, -128396, 33788, 242475, 306356, 154839, -11769, -8709, -96537, -213822, -196887, -230105, -183988, 10198, 215148, 119029, -49747, 42175, -87000, -3818, -52302, 39034, 94566, 149995, 82258, 10175, 4227, -72434, -60671, 39829, -176678, -175324, -38838, 11296, 51712, -239245]
25404b39245j58339K62969j0053J75921L69342k48188m07701l43304K77325J89116
25394a32157O0982M2960P6309K933j64671O5035L50319K95704j03325k16512k54067
25383B3510j89558J2829p5756m1631j95050K17703K76086J82203Q0638l88236
25373i7262j13587J40880J64072q7272M9364l4152J01918K00953p2425j84623
25363F7866o5318K16089J26143p4385l31011l611J78669j70594M2515J48684K8459
25352A63506K11153K2993J4260k5608j34026P0772j59539J9009K9845j77770j15143
25341h0548o3744j49179k26105Q7997k758K58851K75666j24533o521Q1034O7538
25330A17698Q8500k08702j86172K09769J1753j06853k50256k02750L6517J59508
$$ y = [-239245, -397584, -134615, -144668, 31253, 400595, 152407, -255294, -598598, -321273, -132157, -71175, -28215, 48094, 51027, -113644, -48609, 301710, 597414, 494089, 277577, 23510, -166048, -153219, -228975, -270606, -465656, -247953, 28133, 210336, 290974, -97262, -210849, -69969, 94103, 6831, 56195, 22043, 123961, 324914, 252489, 67866, 2548, 218637, 344780, 270395, -60616, -64227, 114442, -56152, -13637, 135047, 163506, 374659, 397652, 411912, 386304, 252278, 323050, 163511, 182520, 212365, 34595, -80548, -144292, -293471, -519576, -431579, -434337, -175486, 100180, -24353, -30874, 50160, 117698, 206198, -2504, -188676, 21093, 32846, -74007, -324263, -527013, -490496, -330988]
25320c30988K186j71906N2416K5545J87897J96545K50667q4514K1677o294j63300
25309b0069n9597q6148K88603J55506j82031l47547j76481k22496N1742J46442
25299d52076L6689L63162m5852j62351k50559P6394K59041Q2641j09300L7798
25289a64413J24664j27482n0238r2307o9626p4838j3987L8519K24230Q1900J21154
25278b424L8133Q2790q8586j13260K62738O3317j57559r4586J31798J21682J93749
25267D37792J82930l05783j65789k36279r7697l9548m2215l1037o0720J88770
25257a69576Q0024j03906o4919J70396J42045K11628p1597j41381q3098l86640
25247d17024j13325K28994J61116J29168Q5341l5134j12539j50271M08376K7690
$$ y = [-330988, -328802, -500708, -448292, -422747, -234850, -38305, 212362, 127848, 149525, 143231, -20069, -79666, -165814, 122789, 278295, 96264, -251283, -427764, -650260, -598518, -452076, -415387, -52225, -98077, -260428, -510987, -434593, -175552, -92911, -202211, -164413, -39749, -167231, -217469, -309776, -379402, -454240, -468227, -429708, -205478, -123578, -2424, 35709, 118499, 29913, -83347, 179391, 242708, 85149, -9437, 122361, 244043, 437792, 620722, 314939, 149150, -87129, -184826, -224374, -266589, -297626, -358346, -169576, -89552, -193458, -258377, -87981, 54064, 265692, 194095, 52714, -30384, -417024, -530349, -301355, -140239, -11071, 74270, 39136, -73403, -223674, 184702, 212392]
25237B12392k65579l9044K27210q5659j94722k7900J31715J48345o8988j10382
25227g2612L6373R9002q2404j70703q8328j26899K54483J89822J62912J61491
25217C63137R9386j29107k21010J45420q3884k14878j00348L4909K03283J02401
25207A99309j81455k55079k10855N6627J60266J89609J03721l89794l98787K62050
25197d64388L58327q0462j05377j70051j81568K92302J88761J42980N4679O3633
25187I8836k78j26515N1330o5714k1828j7385L9952j59636J810R7287J96153P5326
25175A69338J0464r8438j11696o2730j98787p8772N9601l9702j01050K94095K28356
25164G0679p5330o9409m7236j7050m1117J67331J00124K8504k68542q5865L09228
$$ y = [212392, -53187, -92231, 134979, 49320, -145402, -173302, -41587, 106758, 37770, -72612, -36239, 62763, -19641, -190344, -278672, -405571, -151088, 38734, 201646, 363137, 462523, 333416, 112406, 257826, 173942, -40936, -141284, -106375, 96908, 199309, 17854, -237225, -448080, -391453, -231187, -41578, 62143, -327651, -726438, -464388, -106061, -186523, -291900, -461951, -643519, -351217, -162456, -19476, 35203, 98836, 98558, -27957, 23373, -42341, -64169, -81554, -41602, -201238, -199428, -102141, 94012, 169338, 179802, 81364, -30332, -93062, -291849, -370621, -311020, -350722, -451772, -157677, 70679, -4651, -74060, -121296, -138346, -179463, -12132, 87992, 116496, -152046, -237911, 71317]
25153G1317O4192j32442l0890J24463q4590j77105k1R8498o7683n9519j09353
25142c03133L1227O9929K45210K66893j27584j81857l4517q5539l6088J31453
25132b4006p5022k14964j71896p0906R6174M57922J49773J25314P1191o5194j3894
25121B64492r0504k98680K5770k5946J61480M1034K6399J3337j02270J08999n5811
25110F8300j16046j87535J35739J18939p1901K1192P0225m6518q95o8570j28133
25099b05203n9562n005r2923K12732J89102Q1893j44866O7261l08290L7090K1084
25088b06687k1469J35605K97344J59332j27590J3870j69260j56580o4038K9778
25078a09695j67297k50546J06060m0177Q7521J57723j51116M159m4878O0860R3448
$$ y = [71317, 135509, 3067, -27823, 96640, 12050, -165055, -165076, -66578, -134261, -193780, -303133, -271906, -201977, 43233, 310126, 182542, 685, -33832, -119371, -155459, -24006, -99028, -313992, -485888, -556794, -460620, -2698, 147075, 272389, 343580, 278386, 264492, 173988, -124692, -98922, -124868, 36612, 77646, 104045, 117382, 15112, 124111, 68300, -47746, -235281, -99542, 19397, -52504, -31312, 38913, -7605, -8500, -77070, -205203, -264765, -269770, -362693, -149961, 39141, 121034, -23832, 43429, -264861, -227771, -206687, -228156, -92551, 204793, 364125, 236535, 250405, 81145, -75435, -139473, -109695, -276992, -527538, -421478, -461655, -374134, -216411, -367527, -363368, -408246, -347386, -253938]
25067b53938N1235R6825j00517L0161K01235j25058q5290o1226j29831o6513J2706
25056d30211J11408L31981O4202R8924m415n2930o5357r2024j61029k4303q266
25045b32020q4598k3989K41113m7198k3795Q8144K12350J17829j87762n0033O4987
25034G5028J80539O4781j01004m05791k6408L39924J50153K6116r4612j43953
25024F4773m09415j44958K84633J10206q9880K1112k8026n1525J02666K28784
25014H8370j1907J23387k9122j44201M9301K43242j24671l87820l3017Q8590O4046
25003g3802J32690L2635j34641n5270l0696j18409N7533O680N4595n7155p3121
24992b58961O4624o6867k28306N5208L45710J97456j18487j27854k8691O707Q0303
$$ y = [-253938, -202703, -105878, -206395, -176234, 25001, -100057, -185347, -246573, -376404, -442917, -430211, -318803, 13178, 77380, 176304, 171889, 118959, 53602, -38422, -199451, -223754, -232020, -316618, -340607, -99494, -146692, -170487, -82343, 130007, 247836, 60074, 10041, 75028, 255567, 320348, 219344, -186447, -212855, 127069, 277222, 303338, 208726, 64773, -344642, -489600, -204967, -94761, -184641, -163529, -191555, -243080, -140414, 88370, 76463, 199850, 170728, 26527, 75828, 319070, 194399, -193421, -226438, -137848, -73802, 58888, 91523, -43118, -98388, -129084, -247493, -189960, -183280, -128685, -185840, -258961, -194337, -261204, -489510, -434302, -88592, 108864, -9623, -137477, -166168, -159461, -79158]
24981g9158K04579J19213j43444j37133l4354J06180K61583N2982l43010Q4013
24971I1451L3259J65550Q4852j41566j01885l9518r7037K11944J25332m0460k41687
24960E0235j63080K08477J02502k68183L5683j22801k23901k6059R1673J05456
24950b09998j41486K02315O4741N3843J70483k09017j97944j63707j32469r2951
24940f56190L26794K73360J49570j2569J58762k6444l09969j83039k4031k18295
24930e22051K35940Q3791J9228j11653K47864Q5993J22519r1248r8729j16665
24920a45011k42924K65592J85299l6970j29967j21971l434N0782j12772j9867
24910c11243O6960j46464j28169L30054R5688l13308j96290J99363j386J7758
$$ y = [-79158, 125421, 244634, 101190, -35943, -70297, 35883, 297466, 350448, 7438, 91451, 124710, 290260, 375112, 233546, 131661, 92143, -4894, 207050, 332382, 291922, 50235, -112845, 95632, 198134, -70049, -34366, -157167, -381068, -407127, -315454, -209998, -351484, -149169, -84428, -30585, 139898, -69119, -267063, -430770, -563239, -656190, -329396, -56036, 93534, 80965, 239727, 213283, -96686, -279725, -303756, -522051, -286111, -202320, -183092, -294745, -46881, 39112, 161631, 70383, -28346, -145011, -387935, -122343, 62956, 25986, -103981, -225952, -229386, -178604, -291376, -311243, -244283, -390747, -518916, -188862, -93174, -406482, -602772, -403409, -404795, -387037]
24900c87037R6445K1696J79323k3703L7017j30616o9095J02318R3646Q0315O4242
24889F4551K39020n0115k41206k73421J18148L26434r4638q2664J2927j29617
24879a10581j9696R7468J30871q7528j00966j88164j16576J17432k6828Q4272
24869b20296J32233J02744L1782m3805K3333o1992j91039M5513P6132p5893L7867
24858a43421K49748L94365m7157l33680J0316Q4259j75577Q0917M951R3339J7013
24847B35073j42056l26653M8302J58990P9929j8114l00474P714L8642o8588J10186
24836a77049J00581n369k6124J92958j03052n1180L2822j33168R2713K6838P2004
24825B1974k83498k94695m4382K14527k6478j16226K96420J00927n892j08767
$$ y = [-387037, -290592, -268896, -89573, -113276, -76259, -206875, -275970, -173652, -80006, 309, 64551, 303571, 253456, 12250, -261171, -143023, 183411, 88773, 6109, 19036, -110581, -130277, -32809, 98062, 10534, -90432, -278596, -395172, -277740, -304568, -220296, -88063, 14681, 46463, 2658, 25991, -36001, -227040, -181527, -105395, -181288, -143421, 106327, 500692, 453535, 119855, 130171, 214430, 38853, 119770, 124721, 218060, 235073, 93017, -233636, -185334, -26344, 53585, 35471, -265003, -257289, -218647, -287235, -177049, -76468, -81837, -107961, 84997, -18055, -69235, -36413, -169581, -76868, -50030, 21974, -261524, -556219, -600601, -386074, -412552, -528778, -232358, -131431, -137323, -246090]
24815b46090R4038J50010J20967n7060q4922J40553J48521j38667o522J12981
24805B33809M5826R3358k30521m13966k35305P5200l623K48840O1449q3365O795
24794b01503J16465J59910Q0761J37253j08982k00966N6481K25311q9360j96597
24784b1227P8273J15689j79356k04074p8162L0422n4433Q8661P359J4043J58034
24773d4771J10082P9091q7937j82304k97102p7169Q4832K5659J25976j20644K61729
24762a22558K94344j24045k16882J06743k5689j37853o699J28443N0205o6760
24752a20751j7197P439K29988m0351M7759l4823J8159L9787j29650n1624j37005
24741a88269J83610m994j54565l08341J56611J74204J26240j65101K05942j53421
$$ y = [-246090, -152052, -2042, 118925, 61865, -23057, 117496, 266017, 127350, 120828, 233809, 279635, 372993, 142472, -271494, -506799, -431599, -435222, -186382, -124933, -208298, -201503, -85038, 74872, 155633, 292886, 183904, -17062, 39419, 264730, 175370, -21227, 57046, 172735, -6621, -210695, -288857, -258435, -312868, -224207, -216848, -202805, -44771, 65311, 144402, 56465, -125839, -422941, -500110, -415278, -389619, -263643, -384287, -122558, 171786, 47741, -169141, -62398, -88087, -225940, -232639, -104196, -53991, -120751, -137948, -130509, 99479, 59128, 106887, 72064, 90223, 130010, 360, -51264, -188269, -4659, -9653, -164218, -472559, -315948, -141744, -15504, -180605, 25337, -128084]
24731a28084j26612J61002k24417k44344L36363j11361k32614j69975j7080l5927
24721g93049K06923J16489J41071P9386q6256J51757O1538l5654J16321R2222
24711E0748M1522J2792Q1420j23589k15842r0059k80463Q1082Q9107q6164q750
24700d48196k07894r2318q7701J77164K52013O5239j15737j38857Q1685J06198
24690d08404J42100J98406k25380j11687J77672J79254M73j29196P6163M3493
24680e7106P0609r9083j68245j18849J95898N1340j18518K00887L81051Q4361
24670D22345j48234j33453K47449N6933k17284j5134k41374k93333l40899M2193
24660f20791N9830n6200J96735J07931J20326J3590k52935J22961K24664J52462
$$ y = [-128084, -254696, -93694, -318111, -562455, -226092, -337453, -570067, -740042, -757122, -793049, -586126, -469637, -328566, -249180, -335436, -183679, -122141, -157795, -41474, 50748, 92270, 105062, 186482, 62893, -152949, -243008, -523471, -442389, -353282, -439446, -448196, -656090, -748408, -836109, -658945, -406932, -341693, -457430, -596287, -514602, -408404, -266304, -67898, -293278, -404965, -227293, -48039, -47566, -176762, -100599, -57106, 13503, -85580, -253825, -372674, -176776, -125436, -243954, -43067, 337984, 422345, 274111, 140658, 388107, 445040, 227756, 212622, -28752, -322085, -662984, -620791, -560961, -617161, -420426, -312495, -192169, -178579, -431514, -308553, -83889, 68573]
24650F8573j55690j92331J33961p70j43018r7657K51979n7773Q5305M0131P8501
24639A1211N7696O989K8249Q9697l857j30336l2202J10336k0291J8767k50925
24628a14666k41909K7586l2375K80518J20394N4226r7535P537p9141k68607n577
24617c49549r0198k0976J35790J28200j23939N0204J50575K09286p3235l3513
24607a7355n2736Q0135j08537j71262N6414K9130J80377k8742k19024M3232J23595
24596h4773K10400L4152j92197o3141Q795k63084o4618K01751J03999J80181j13444
24585d1979l3869k8531Q0505j33088j92367p6267k2239j30669K99878K62127J60791
24574A44292K85063j86506K517o8048Q2121o2094j42179m9825K2739k3041P908
$$ y = [68573, -87117, -279448, -145487, -146257, -289275, -386932, -134953, -192726, -107421, -67290, 11211, 68907, 75896, 104145, 193842, 189985, 59649, 27447, 137783, 117492, 136259, -114666, -356575, -328989, -361364, -80846, 39548, 93774, -3761, 3776, -75365, -343972, -349549, -439747, -460723, -324933, -196733, -320672, -270468, -119893, 89393, 16158, -17355, -70091, 10044, -98493, -269755, -213341, -184211, -3834, -32576, -251600, -208368, -84773, 125627, 159779, -32418, -95559, -86764, -349848, -414466, -212715, -108716, 71465, -41979, -75848, -104379, -23874, -156962, -349329, -425596, -447835, -578504, -278626, -16499, 144292, 429355, 242849, 245366, 177318, 259439, 197345, 55166, 5341, 28080, 5039, 12947]
24563A2947J42692M6492j40132R431j30898l99811K71450J75587k12453k63123
24553d87818J77052L43294J63478P1652l43077k94387Q0054l2849K04611J31597
24543A3607k6231R3753J43189o9895j82093r9206m4442q283j64956q6817K43577
24532a87797j48847p85J44042J35945j40519k48853J98078K48249p6594N1686
24522b5395p5639j35893J4203O1315J66961K34207k4737j8934J65233r590k10831
24511A40900j84332p4200k4246j1064J41990m9212J36040q5823r4768r5232k70148
24500d70095K38321J77366j34112M2191k35068k45326O5609l8339j00322R6305
24490f03470m3711M15554K93851J63660p2226r7628J96480o5837n4725j32822
$$ y = [12947, 155639, 202131, 61999, 71430, -59468, -459279, -187829, -12242, -224695, -487818, -310766, 32528, 196006, 267658, -75419, -369806, -289752, -322601, -117990, 13607, -12624, 81129, 224318, 154423, -27670, -126876, -171318, -179601, -344557, -431374, -187797, -336644, -337429, -193387, -57442, -197961, -446814, -248736, -487, -77081, -25395, -101034, -236927, -222724, -161409, 5552, 239759, 215022, 196088, 361321, 351731, 140900, -43432, -117632, -141878, -152942, -10952, -60164, 75876, -9947, -104715, -199947, -470095, -231774, -54408, -188520, -146329, -381397, -626723, -561114, -599453, -699775, -603470, -647181, -231627, 62224, 225884, 153658, 56030, 252510, 186673, 131948, -874]
24480h74K3989J49436k2323j84438j3647R3620k24930k95164M8985J79782K11103
24469c4461j11247m2571J84344J93069M0023J61545m2711j37391j92552K7447
24459D5495P4853j03981r0372J71214l1388j55563J06318K35056P5008l58493
24449c1853Q2140Q1336j30947j42619o6432Q6886k10233J03657J84411j49530
24439a93184J18910n4667J69985L0359j92200j86975Q8950J20133L6486Q6511
24429B4308J34166k59129k16544J03639K9181K4317n4315K21947K23149j08163
24419A22556P5676j4870L4861l3132m8329P3456j5298j13534j50495q3344R5282
24408e7171p2096j51500j31790J57915P7640p5140q4495R1677n8641p880J61181
$$ y = [-874, 23115, 172551, 150228, -34210, -47857, 45763, -179167, -474331, -425346, -245564, -34461, -145708, -188279, -3935, 189134, 229157, 390702, 347991, 210600, 18048, 45495, 120348, 16367, -74005, 97209, 65821, -89742, 16576, 251632, 326640, -31853, 50287, 131623, 676, -141943, -208375, -121489, -331722, -228065, -43654, -193184, -74274, -128941, 41044, 71403, -120797, -307772, -218822, -98689, -62203, 24308, 158474, -100655, -317199, -213560, -184379, -160062, -214377, 7570, 230719, 122556, 198232, 183362, 218223, 185091, 136762, 210218, 194920, 81386, -69109, -152453, -57171, -129267, -280767, -412557, -254642, -177002, -252142, -336637, -244960, -303601, -311481, -150300]
24397a50300O8726r5628k13030r3668J68461n9329J61158l4006j15661m6056Q9694
24386c19639Q7389K87302N7869j80217j04735K7037j17657j58747J39191j11919
24376c94126O1525J77832L1782K15683J68400P0454m4917j27248J48420j30675
24366A77130q0602j28404k15707k49245K76879K01020j2163j2551r062k21422
24356b74127j71935J99204J66732J05128m9289j2887J11350K2613k86838o3092
24346b53141j8193J55434J77591j76496j01575J25315j44696J60941J91837j77695
24336f0678n02758m7833J94343L21852r2426k83519j45511J26716J69978N184
24326c14652J56776J68139k40418k00082J52333P1491N5164J08287j5325J19867
$$ y = [-150300, -81574, -177202, -390232, -483900, -315439, -374768, -213610, -247616, -363277, -409333, -319639, -232250, 55052, 112921, -67296, -172031, -144994, -262651, -421398, -282207, -394126, -332601, -154769, -122987, 92696, 261096, 331550, 286633, 159385, 307805, 177130, 96528, -31876, -247583, -496828, -219949, -18929, -31092, -43643, -52705, -274127, -446062, -246858, -80126, 25002, -24287, -37174, 74176, 96789, -190049, -253141, -271334, -115900, 61691, -114805, -216380, -91065, -235761, -74820, 117017, -60678, -563436, -611269, -416926, -95074, -187500, -471019, -616530, -489814, -319836, -314652, -157876, 10263, -230155, -430237, -277904, -206413, -151249, -42962, -58287, 61580]
24316F1580J26980N7757j69655k46980J14915J01669q9753J64382M7138R5045
24306B63078k20944k36566J33052K6256J19552J08282m5233k76257k37808j35661
24296e02249K72703O7343k34625n230J41121q6217J67627P0527j810k27471n0298
24285c88579j63754K37403K73181j84323P441J31679J15041l08537o6824K22330
24275a24942J85347L7698j76885k45790o5600m585J54733K19388j02408m0908
24265a63952K30970P496l95738J56747N556p7208L215L02674O361k48920k13435
24254c86234l9339q3869J20286K2728R6836K02051Q5339P4275N5606J11367k30413
24243B8633j84981l04343J15748J8025J35620J37885J39327q9865L2596O5928
$$ y = [61580, 188560, 246317, 76662, -170318, -55403, 46266, -43487, 120895, 168033, 263078, 42134, -194432, -61380, -35124, 84428, 192710, 147477, -128780, -366588, -502249, -229546, -162203, -396828, -402058, -260937, -347154, -179527, -109000, -110810, -338281, -388579, -552333, -314930, -41749, -226072, -218631, -86952, 28089, -280448, -347272, -124942, 60405, 98103, -78782, -324572, -390172, -394757, -240024, -20636, -123044, -163952, 67018, 74514, -321224, -164477, -158921, -236129, -232914, 69760, 76121, -172799, -386234, -425573, -509442, -389156, -366428, -269592, -67541, 17798, 92073, 147679, 259046, 28633, -156348, -460691, -344943, -326918, -191298, -53413, 85914, -3951, 28645, 94573]
24233I4573p9350j32279l3791K2483J25382P253N3519J11406M7396N4033J73365
24222D43990O8922o1979k08251j3113k81002j18911L18084J02248K4302j61603
24212A12687j52040j88100k22041M2546J57331K24970Q5391M3893p4927P3065
24202A02775K16713m2140k47878j99163k86629j42902J60562P8723J00876N9805
24192a99258p2069l3633Q6955N2935j03636j57775J72730K12196J1073n3187K7913
24181e5756J61022N5119J5785R3504J2208K2505L9540K05860m2126l41345o5642
24170A00674J42581P788k09196Q1298l9829l78080j56858J79667J91094R2019
24160A1158k5761L671M1702L4577k852j61460q3739K06519K26042J75525r191
$$ y = [94573, 15223, -117056, -150847, -128364, -2982, 4271, 57790, 169196, 216592, 270625, 443990, 512912, 450933, 242682, 229569, -51433, -170344, 147740, 249988, 274290, 112687, -39353, -227453, -449494, -406948, -249617, -24647, 60744, 104637, 29710, 102775, 319488, 277348, 29470, -169693, -456322, -599224, -438662, -359939, -259063, -199258, -271327, -304960, -218005, -165070, -268706, -426481, -253751, -41555, -30482, -83669, -55756, 105266, 160385, 176170, 269674, 281882, 304387, 343927, 549787, 507661, 166316, 100674, 243255, 251043, 41847, 123145, 83316, -294764, -451622, -271955, -80861, 11158, -14603, -10932, 30770, 65347, 62495, -98965, -182704, 23815, 249857, 425382, 416191]
24149D16191l57418n9717j32459J63404L2538j35165j17620m946M0486J37187
24139a7519N5840k50234j40293K68734O3034q0306n5278n7501m0414k83660K2558
24128e15039J04677J20677J71166n7078r9550J83001P1919o4345L2956n5057Q3676
24117b2997K58641J94609j35638l44449r5188J17334K66283L8458R2572q4m3982
24106C25559j09148j47637k36218j26707k59754P5648O7214J08052r0702M4096
24096c49597m1237M3123K39252J17202p1325Q8820j86061J62471P057q0448N9629
24085a1114L1537l3244k2534p0306k50704L7114J90670l0136r8619k0885J57075
24074a21146J00092j78170k74450R1479J46367N8628K27819M4715Q2146L5566
$$ y = [416191, 58773, -944, -133403, 30001, 62539, -72626, -190246, -195192, -154706, -17519, 38321, -211913, -352206, -83472, -20438, -100744, -156022, -213523, -253937, -537597, -515039, -410362, -289685, -118519, -175597, -275147, -92146, -20227, -84572, -51616, -106673, -22997, 235644, 430253, 294615, -49834, -145022, -27688, 238595, 277053, 369625, 369541, 325559, 216411, 68774, -167444, -294151, -553905, -478257, -411043, -302991, -393693, -349597, -390834, -347711, -108459, 8743, -62582, 26238, -159823, 2648, 9705, -70743, -11114, 20423, -12821, -35355, -105661, -356365, -319251, -128581, -158717, -257336, -278221, -121146, -21054, -199224, -473674, -382195, -235828, -177200, 50619, 95334, 177480, 213046]
24064B13046K9081o9476k91695O1506J82565j15225j79001q9742N4353p1778J2029
24053b64337K82229M1043Q5709J00910r183j19226k50317J94169Q5907K5614J01683
24042B74201j83765P0300j980j66669k23461J35374J84385j38650j53578K2765
24032a81078J76527J65742q0889j2654n1541l14504k10211J28638J56634Q6260
24022a37076J18534l11481j94774J66053P6099J29314K06635L6590j79135j15929
24012b05170k998L8027j7367j38804J6282l9924K1809K83136L03816k79441j58241
24001a78875J39623J34563j83154j83649j19206q7959k55613j98582J95626m2224
23991g79450M9811J29284J36833M11910J66054J86793n6887q053J01658k7851
$$ y = [213046, 242127, 172651, -119044, -57538, 125027, 9802, -169199, -258941, -204588, -276366, -264337, 17892, 58935, 144644, 245554, 236371, 117145, -133172, 60997, 146904, 172518, 274201, 90436, 160736, 158756, -7913, -231374, -96000, 88385, -50265, -203843, -181078, -4551, 161191, 80302, 67648, 16107, -298397, -508608, -379970, -223336, -137076, -18542, -330023, -524797, -358744, -282645, -153331, 53304, 89894, -89241, -205170, -208168, -170141, -187508, -326312, -310030, -349954, -328145, -45009, 258807, -20634, -178875, -39252, 95311, -87843, -271492, -390698, -478657, -734270, -932852, -737226, -779450, -729639, -600355, -463522, -51612, 114442, 301235, 244348, 236295, 337953, 310102]
23981C10102k81355J00796K15877m5036o4370j51802k30715p2239J08674J27619
23971A7551m7446j00889k2901K1353j03995j7564o342J10589Q7658k1946L9452
23960d4480k04543o4681K01040J64271K9171R6531j21604n838J00707j29050k41323
23949b19799n1468N1088j7265j37504j11892L2818J09399K91843l4815J64815
23939G7220K72135K56718m4973k85008k59896r5033L2747o0024j28679m5610J22356
23928a58047j86621k11715j21616J94002P1563J23147Q7813L0538j59087j08001
23918d38024K73409q4534p933r3283o8525j3655J40597k8718J10793J86156M8159
23907B4442J5443j39343J09408n2789p7148K5128K4975k80463n7474J19793N9731
$$ y = [310102, 28747, 129543, 345420, 300384, 236014, 84212, -146503, -218742, -110068, 17551, -29895, -130784, -153685, -132332, -236327, -253891, -260233, -149644, -61986, -83932, -44480, -249023, -313704, -112664, 51607, 80778, 177309, 55705, 49867, 150574, 21524, -219799, -271267, -220179, -237444, -374948, -486840, -454022, -344623, -52780, -87595, 77220, 349355, 606073, 561100, 276092, 16196, -78837, -46090, -106114, -234793, -280403, -158047, -344668, -556383, -677999, -483997, -412434, -289287, -201474, -170936, -330023, -438024, -164615, -249149, -257082, -350365, -418890, -432545, -291948, -320666, -209873, -23717, 24442, 39885, -99458, 9950, -42839, -119987, -94859, -69884, -350347, -407821, -288028, -228297]
23896b28297O8165J32666k9404m47184r1344J74255n4441J3818N6208N7768p1127
23885d18917O7836L30771L76915j73778m46058q7767J6863N0312Q8525J9308K00414
23874B4424m0146k06929n8553J7638R0290J52712P4892q5373m3582K3122j03946
23863a55451j28414Q8182L80590J20262l24566j44195Q5890J20544m3684j45822
23853a46664k08586l937O8725L38685n982j08348L3302m2369j44582J82506J41515
23842A04265j19740j47453L332n5388K05462L921j19612J01170P1774N3912O155
23831A07798j08101j22360j69263j36508R4935K12202K32622P2184j0369J79002
23821C52142j30588k56515p8540j48995l8145J69997K48884L11192l8037j38961
$$ y = [-228297, -160132, -27466, -56870, -504054, -595398, -421143, -475584, -461766, -405558, -347790, -418917, -351081, -20310, 356605, 182827, -263231, -350998, -334135, -283823, -195298, -175990, 24424, -15722, -222651, -281204, -263566, -173276, -20564, 54328, -31045, -74627, -51505, -155451, -283865, -195683, 184907, 305169, -19397, -163592, -77702, 42842, -842, -146664, -355250, -359187, -290462, 48223, 42241, -66107, -32805, -75174, -219756, -37250, 104265, -15475, -162928, -159596, -214984, -9522, -5601, -125213, -24043, 47731, 101643, 107798, -303, -122663, -291926, -428434, -333499, -121297, 111325, 183509, 173140, 352142, 221554, -34961, -113501, -262496, -300641, -130644, 118240, 429432, 391395, 252434]
23811B52434k18523l6841J69012o9581o947k18891j37891Q495N0730J5792K71557
23800G9346J5380o0730j14751q5925l55626p4843J34388K24362l1248K08049K74097
23789B12499n2464k2598p9081j0068p3816q8789J29363J73730K21228k4330m0685
23778C44989j62720k22951j59831O2342O0825l8013k12482J07123j85106p9750
23768d85574L02684K89481R0916o5175k52019r2752N9488R9803J71493K59395
23758C77740j35744k85278q2333j96207j69748K35321K12771P5359j2474Q6692
23748A06099p6591k11949J96916N5295J2689q0428j6998j07378k27999m3687J65007
23737b29024L1102L5951K2294n2329N0735K35984J83913j53637k58218J51109
$$ y = [252434, 33911, -2930, 166082, 96501, 89554, -129337, -267228, -258733, -208003, -192211, 79346, 94726, 33996, -80755, -166680, -522306, -597149, -462761, -238399, -269647, -61598, 212499, 160035, 137437, 58356, 48288, -25528, -114317, 15046, 188776, 410004, 385674, 344989, 182269, -40682, -200513, -138171, -77346, -115359, -327841, -220718, -405824, -485574, -182890, 106591, 197507, 132332, -119687, -212439, -152951, -53148, 118345, 377740, 241996, -43282, -125615, -321822, -491570, -256249, -43478, 31881, 19407, 106099, 29508, -182441, 14475, 69770, 82459, 2031, -14967, -122345, -350344, -394031, -229024, -197922, -161971, -139677, -192006, -141271, 94713, 278626, 124989, -133229, 17880]
23727A7880J2618j68727J08936P9904K27954P21r2022k14687J10429J48302q1111
23716A50197l27058R7634o6470k07679J91095K56015Q4403q216j2216j37154N7324
23705G7875k0983J01589k035m1585q4104n1545j35957j26775m4176q3601q124
23694d19421R3387J98276o2233m1118L01196q6128j53675m5152l0458L8075p6871
23683b84122k0646J58649m6847M0400j48692k2101j4761J7602L48724N4523l87604
23672c04875k6894K32399J87944l012p0434J07650O6948k6340j1996j17847M3169
23661G6712k07471j28065J79427K66613k7626O6503k17917l10484J250P0043L8033
23650a92982R136J66600O7780m5291n2017K00156J24212q0406p386J0037k90490
$$ y = [17880, 30498, -138229, -29293, 50611, 278565, 279286, 187264, -27423, 83006, 231308, 150197, -176861, -79227, -145697, -353376, -162281, 93734, 178137, 169921, 157705, 20551, 77875, 56892, 158481, 156446, 114861, 30757, -20788, -156745, -283520, -327696, -411297, -419421, -326034, -127758, -189991, -231109, 70087, -16041, -169716, -214868, -245326, -207251, -284122, -304768, -146119, -192966, -152566, -301258, -323359, -338120, -320518, 28206, 82729, -304875, -331769, -99370, 88574, 85562, 15128, 122778, 189726, 163386, 151390, 33543, 76712, -130759, -258824, -79397, 187216, 159590, 226093, 8176, -302308, -301058, -231015, -192982, -183846, -17246, 50534, 5243, -46774, 153382, 277594, 197188, 189802, 199839, -90651]
23639i0651m56580N8218L65718Q1769m9600l8015Q4496j67915k81577j88454k1208
23628g03799K27712L68384n7132J02163r8509N3691O6339M8032j50773r593J06275
23617d7210Q0710M5879J25303J25396j57926j69421R093j15988j77972M4439K20240
23606a7457J34607J21100N476k09007k66067J95603j39483j0763P4939J33941
23596B2889q0335j85592j75153r7420J13940P8483k4180j41594J3156J4941J6031
23585d44834J09132J7245o8648K33542N3921j38873J16393J29114o0828j0359
23575f4195k5228J62544N4982q1388m4002J11148j1687j99955J82208J96037K8839
23564C09303p6966m62085j13382J31611K33321N0785q6511P164N7986m685n215
$$ y = [-90651, -547231, -489013, -123295, -41526, -91126, -129141, -44645, -212560, -494137, -682591, -703799, -476087, -107703, -164835, -62672, -161181, -107490, -41151, 6881, -143892, -153485, -47210, 33500, 79379, 204682, 330078, 172152, 2731, 11824, -104164, -282136, -237697, -17457, 117150, 238250, 243726, 34719, -231348, -35745, -175228, -185991, -111052, 22889, -57446, -243038, -418191, -515611, -401671, -323188, -347368, -488962, -475806, -460865, -444834, -335702, -318457, -387105, -153563, -99642, -238515, -122122, 6992, -53836, -64195, -89423, 73121, 128103, 46715, 2713, 113861, 102174, -97781, 84427, 280464, 309303, 232337, -229748, -343130, -211519, 21802, 72587, -13924, -6760, 51226, 46541, 41326]
23553D1326j35120o3726O4699l2704L5275k9857m894l6876k24176r3775k731K3510
23541d59049L49428J23291n2573k33924k06835j904J31476j85042J44999J70032
23531b20101J76055M6826m8897Q8647R384k18937K3662R0579j6998M794j09480
23520a74466j20920j81102m0036J25253K73672J14601j78999R1425J28897j3657
23510B4668J31918k0010q9382n0831j3654N8446j9273j53421L28299J80702l09679
23499F7783l19475J27837K32402o2129r9206K69561P3718m6645j2467j62804J8838
23488H7413R7894J68154p8976k94574j57484Q5193L7392Q5229m5682J25569m8032
23477F2096R7449m045r0211j46373M288J63236J06773P3287q5450k45559m924
$$ y = [41326, -93794, -157520, -92821, -125525, -90250, -120107, -125001, -161877, -386053, -479828, -482559, -459049, -109621, 13670, -38903, -272827, -479662, -481566, -350090, -535132, -390133, -220101, -44046, 2780, -46117, 42530, 51914, -167023, -143361, -52782, -69780, -64986, -174466, -295386, -476488, -516524, -391271, -117599, -2998, -181997, -90572, 38325, 24668, 156586, 136576, 47194, -3637, -17291, 41155, 21882, -131539, 196760, 377462, 67783, -251692, -123855, 108547, 46418, -52788, 216773, 290491, 243846, 231379, 68575, 87413, 185307, 353461, 274485, -20089, -177573, -92380, -54988, 30241, -15441, 110128, 62096, 159545, 155500, 65289, -81084, -76796, 86440, 193213, 266500, 181050, -64509, -69433]
23466f9433M3327p1012n1506k46175L2687q5619J84198K44319k04334o0310J25274
23455a58584J15761k2359j15633r942Q1064L9992j35888R0304r9939n5045L13970
23444D3701K0639j45788l904K30510K705K4626j390j59053j60038J151L1904j20415
23432b35352N8258J74466j12911Q664M0170j31421j25996K43925K62419p0282
23422A11940j57060Q6696J05820j48522j31976J3618r3838Q424j8508L55799r0134
23411D2259j5638k2645q9103j11088M9029K42503j29805k66770o4587K85269J77244
23400I6668r2952j77956q4141M0066J01265N1813j80432j80451P3664l4506Q0930
23389c06032Q5399J53591L72344j0647M8611m208j51482j88997j33956j06201
$$ y = [-69433, -26106, -97118, -148624, -394799, -362112, -447731, -263533, -19214, -223548, -283858, -158584, -42823, -65182, -180815, -190757, -109693, -69701, -205589, -115285, -215224, -270269, 43701, 64340, -81448, -85352, 145158, 147863, 172489, 171099, 12046, -147992, -146841, -114937, -235352, -177094, -2628, -115539, -106875, -66705, -198126, -324122, -80197, 182222, 111940, -45120, 41576, 147396, -1126, -133102, -119484, -213322, -204898, -223406, 132393, 42259, 26621, 3976, -85127, -196215, -147186, 95317, -34488, -301258, -365845, -80576, 96668, 3716, -174240, -258381, -218315, -117050, -65237, -245669, -426120, -352456, -386962, -306032, -220633, -67042, 305302, 294655, 343266, 339058, 187576, -1421, -135377, -241578]
23379b41578l8894J60226j37463j6344J03308n2939l16927o3365J05066o230J93675
23368c11465J20867O4650j05825j72209J05555Q8857J38931p3907J04686o2138
23358a01998P7088j99684j03109J05638k6027R9402K87116J05522k86082k95029
23348c37163l08562Q3013L2478K03786J86821O4136P7128j09050N1807N0929n8122
23337f2799j06594K3096J67704j99311j53058O3933l1150j06291J07061l28702
23327f26111j93157J85974J32896R7711K25490J16681Q9661K07166Q1261j8902
23317B98670j52181n24206l59398L31530K89721j33629Q6699J89512j91539j25584
23307b90405l7703j58464M1102K93804J91284J29997k02229m50928J7628L53531
$$ y = [-241578, -280472, -120246, -257709, -274053, -170745, -223684, -540611, -603976, -498910, -505140, -311465, -190598, -125948, -231773, -403982, -298427, -209570, -70639, -144546, -39860, -101998, -24910, -224594, -327703, -222065, -248092, -148690, 138426, 243948, -42134, -337163, -645725, -562712, -530234, -326448, -139627, -75491, 1637, -107413, -55606, -4677, -62799, -169393, -146297, 21407, -177904, -330962, -267029, -298179, -404470, -297409, -626111, -819268, -633294, -500398, -402687, -177197, -60516, 29145, 236311, 317572, 298670, 146489, -377717, -737115, -405585, -115864, -249493, -162794, 26718, -164821, -290405, -328108, -486572, -445470, -151666, 39618, 169615, -32614, -483542, -465914, -112383]
23297a12383J60529l58402j4456j9918O1344o391j11910O8833J01448O603J58369
23286f6334m985M8655O9813M5545o1489K8027Q028l8574R1l8264R0263l6881j20666
23273g6771q5449j90436j01038J69406M05385j21593j60477K69000J7519q6951
23263C8595K7334J51473k8332q8583o5464p0671j94645j68688J06801J93600K85336
23252A86756J86985p3582j36120j09887K62873j34266p8717q7567j84496l9974
23242b07995Q8221o699n7084k37121j2103L98374J15736J18034L6772o3398m7645
23231A25092k32862J08673J59975j05240j81435J18905j2099r4801l64998r1983
23221e70773K31044L44999P3043J34787j57238j24388K2127k18413j97290J06855
$$ y = [-112383, 48146, -310256, -324712, -344630, -283286, -289677, -401587, -332754, -231306, -224703, -66334, -71319, -22664, 47149, 92694, 31205, 59232, 67260, 28686, 28777, -9487, 80776, 43895, -76771, -162220, -352656, -453694, -284288, 121097, -496, -160973, 108027, 125546, 38595, 65929, 217402, 189070, 100487, 35023, -35648, -230293, -398981, -292180, -98580, 186756, 373741, 300159, 164039, 54152, 317025, 182759, 104042, 16475, -168021, -207995, -119774, -126473, -183557, -420678, -432781, -34407, 81329, 199363, 236135, 172737, 125092, -107770, 903, 160878, 55638, -125797, -6892, -18991, -113792, -478790, -570773, -339729, 5270, 78313, 213100, 55862, -68526, -46399, -264812, -462102, -355247]
23211c55247L40604k0950k23094L588P1340J7166j7940O101q1010M0553k7951
23200b46840k5196q1453J24151K66573m971j71753k20302k09771R8821K43883
23190b26858J43604l7856l5381K07018j8513r1170r1357L0068j33781j4760K04742
23179f4244m1694l13178q7318K98235J47238K82284j07890m54006r4767J51095
23169b84245l6252O858K80775J09800m4541j56132l9777j22254p7262n9111J5208
23158d06933J77535L38572l4295p1831J6918K3897M0979k39345j4804L1619M0174
23147i7514O6289p5578l3797J25957J61573j17319p9718j2286j5014K5113j86094
23136b38388J05436J33154Q6789j39166q7445J66662r0193K9672k3712j03340
$$ y = [-355247, -14643, -35593, -258687, -255099, -183759, -166593, -184533, -178432, -259442, -218889, -246840, -272036, -353489, -229338, 37235, 32264, -139489, -359791, -569562, -470741, -226858, -83254, -121110, -156491, 50527, 32014, -59156, -150513, -120445, -254226, -268986, -64244, -105938, -419116, -506434, -208199, -60961, 221323, 113433, -340573, -435340, -284245, -320497, -313639, -32864, 76936, 32395, -123737, -163514, -285768, -363030, -422141, -406933, -229398, 109174, 74879, 3048, 19966, 43863, 84842, -154503, -169307, -137688, -97514, -31225, -106803, -140600, -14643, 146930, 29611, -50107, -62393, -77407, -52294, -238388, -132952, 202, 86991, -52175, -139620, 27042, -63151, -33479, -57191, -160531]
23126a60531j58951k9470M4426q0408n38L03368J70923j88776k42039l70649K54409
23115d58236J58785k26480M6719K82754J9111J33194j61113q0099p2163J22521
23105b35007o4669p7L24890K75444l00872j23716L8443J01354j14025j63670k28057
23094d89962J89553M5631J11301m1184j48340O7787L11218R3799l1214o7334k17111
23083a75856j08331K08238l7647r8849J07535k74287k09932M632O0779J29449
23073c94269K60613K12707J01060r6172j64220j70305j49421n1186N9132J04374
23063b87687J34749j2796J3595M8348l0266O8652k00885j55507J74508K74984
23053B7695Q0497m4942k19463P968K6593K5874j29818k10331j65489O6838L05517
$$ y = [-160531, -319482, -348952, -304526, -384934, -385472, -82104, 88819, -99957, -341996, -712645, -458236, -299451, -525931, -479212, -196458, -177347, -44153, -205266, -285365, -357528, -235007, -299676, -299753, 25137, 300581, -291, -124007, -85564, 15790, -98235, -261905, -489962, -300409, -254778, -143477, -184661, -333001, -265214, 46004, 139803, 108589, 41255, -175856, -284187, -75949, -113596, -212445, -104910, -379197, -589129, -584497, -523718, -394269, -133656, 79051, 180111, 83939, -80281, -250586, -400007, -451193, -392061, -287687, -152938, -165734, -152139, -103791, -134057, -65405, -266290, -421797, -247289, 27695, 108192, 63250, -156213, -148245, -121652, -95778, -225596, -435927, -601416, -534578, -229061]
23042b29061J51771n5735N4949k1089J3413J03853J38914k75077j91200j68948
23032d78210J70547K18047J1600k84383M4159J10547o0783r43P1307J5980J07350
23021g4782L37810j2702j50789l1155q5222k39296J28558J2041k09107j0976K28039
23010a07581P9711r232p4510J22256J2468O4968n3844j41249j49939J06423j67701
22999c18230J0122P7771J22324J20848p0910L4682J45108L6341k93193j97703
22989c32840l9458K12936J18252R5311j00566k36222L3026J83939J85497J46511
22979B66386p7028j31550j38649n0886j96026M1329J79895N0964k4819p7899q6573
22968b44856J33802J72667K35920P3472k87376l07017O2173o7814j57895Q3049
$$ y = [-229061, -77290, -133025, -78076, -99165, -85752, 18101, 157015, -118062, -309262, -478210, -307663, -89616, -78016, -362399, -318240, -207693, -268476, -269419, -198112, -182132, -74782, 263028, 250326, 99537, 68382, -16840, -256136, -127578, -115537, -324644, -335620, -107581, -27870, -37102, -111612, 10644, 23112, 88080, 34236, -107013, -256952, -150529, -318230, -308108, -230337, -108013, 12835, -58075, -23393, 121715, 158056, -135137, -332840, -372298, -159362, -41110, 54201, -46365, -282587, -249561, -65622, 119875, 266386, 189358, 57808, -80841, -131727, -327753, -286424, -106529, -55565, -80384, -158283, -244856, -111054, 61613, 297533, 371005, 83629, -223388, -161215, -229029, -386924, -303875]
22958c03875L69587R9059J40880l67766l73375l8181L14709P1275j98871k55936
22948e42494J56117O7427M701J34555K68979J38650j45248j69538J44725n3094
22938D780j64662j42446J7470M663J14241J16785j75533j62741M99281J43809
22928B55647j05871J20256j17809j15141p5241n1995l5967j42708j66274N6008
22918c79095N6344K15083N0954Q786N811J2866k1978K6724K2093Q3154j48496
22907f7754n5760P4534n151J08148M9727k42865j53110n3270K22678J11416L09531
22896B98124j2912m58952n6184l8397K53584P5933p633j597P4795q8974k40130
22885b02343j09141j37604J33451J5734M2320j4321n6440j13182R9980j81254
$$ y = [-303875, 65712, 164771, 305651, -62115, -435490, -473671, -158962, -87687, -286558, -542494, -386377, -318950, -314249, -179694, 89285, 227935, 82687, -86851, 57874, 4780, -159882, -302328, -284858, -280195, -165954, -49169, -224702, -387443, 111838, 255647, 149776, 270032, 152223, 37082, -38159, -90154, -126121, -268829, -435103, -379095, -322751, -107668, -56714, -47928, -42117, -29251, -51229, -24505, -2412, 80742, -67754, -123514, -48980, -54131, 54017, 103744, -139121, -292231, -345501, -122823, -11407, 298124, 285212, -173740, -229924, -268321, -14737, 61196, 53563, 51966, 126761, 37787, -202343, -311484, -449088, -315637, -299903, -257583, -271904, -328344, -441526, -341546, -522800]
22875e22800Q7814R4967L68391J76009j55079j42471J2421m7763k83497k7686
22865d39694L07639K39478k4247j61471j1158M8750r999J98879k6307m111K11644
22854C29403l13585m53659k9664J50240l5283L3963j14470p0301Q7492k1202K90494
22843a46572P8324N3287j02705P1578J24738q0903j8809o0549J82675J98463j16099
22832A83428j15982j55174K0895k21812m6858K58519J51089j05195k71665J66875
22822a35880j39547j3231K28447j52694L3417J25159o2209l3242j91741J93131
22812a48390J24829k14971l0002K37152j39267k68452p8151K9607J13789J60888
22802b12968J0420n5695k4621J13937r6348J27970P4985Q769J50641K02061j72613
$$ y = [-522800, -434986, -340019, 28372, 204381, 49302, -93169, -80748, -128511, -412008, -439694, -132055, 107423, 83176, -78295, -89453, -40703, -50702, 148177, 121870, 117759, 329403, 15818, -437841, -467505, -317265, -352548, -318585, -433055, -503356, -415864, -437066, -146572, -68248, -14961, -117666, -46088, 78650, -2253, -21062, -81611, 101064, 299527, 183428, 67446, -87728, -66833, -288645, -335503, -76984, 74105, -31090, -302755, -135880, -275427, -288658, -60211, -212905, -179488, -54329, -116538, -149780, -341521, -148390, -23561, -238532, -268534, -31382, -170649, -439101, -517252, -487645, -373856, -212968, -202548, -258243, -282864, -168927, -265275, -137305, -62320, -53551, 97090, 299151, 126538]
22791A26538q3521M7889M0526J04624L2165k1915J05265m4473k77677k52503j44637
22780c67719K93012K21644L3630j64183k15960j8432O6041l8729R9937j62913
22770b53672j25088R0641p330N3705N3779J84927o4973j09409k26121r2661J34684
22759c61518L06472o9111j17108j96575j65709L47985j51891k63794P8004J75988
22749d17257K81460K32648J15499p6557l25831k34615O6346L2845j9887J09592
22739b35757R3803L4010o6362L5238K62630j60385j48257M22864O5725r3498R1594
22728C01605j42746k31753L5780O0548k39145J5388K00690j87189J77827O628
22718b367R2466P8026m0749j08699m7569j55591j17892j78173J93100P4896P693
$$ y = [126538, 43017, 90906, 131432, 236056, 268221, 246306, 351571, 307098, 29421, -223082, -367719, -74707, 146937, 180567, 16384, -199576, -218008, -151967, -190696, -90759, -253672, -378760, -288119, -295449, -241744, -187965, -3038, -68011, -177420, -403541, -496202, -361518, -55046, -124157, -241265, -437840, -603549, -255564, -407455, -671249, -593245, -417257, -135797, 96851, 212350, 135793, -190038, -424653, -358307, -325462, -345349, -235757, -141954, -107944, -174306, -139068, 123562, -36823, -185080, 237784, 303509, 210011, 301605, 158859, -72894, -37114, 23434, -215711, -200323, 367, -186822, -8995, -2367, 90099, 168125, 127376, 18677, -28892, -184483, -302375, -480548, -287448, -212552, -204859]
22707b04859M7863Q7396K40889R9937j49160j52921n5127j96621j80255j6857
22697d79715L81520L81904K9441j72828P1468k68803J9710J55216o891J22374
22687B33396l6023j54416p3288j93841k76199M951L1397j1881J10629L37249J35833
22676A07807j6362j73638l13500J2544L09465K05528r7006K169j13026O6863j23205
22665a32361N9868j41534l78708m821K00935J00110J86730J00271L652j27366
22655a33224K6556K7044K10503M9615l30238M678K37534j081J09686j43237k32266
22644a74430n6913R3375O3660J30525J9359R4292n2281j67984K3874J19686Q4667
22633A77830K70305j7831k55887j58187k08145J51706p7714K1915M7138j48831
$$ y = [-204859, -156996, -69600, 171289, 271226, 122066, -30855, -85982, -282603, -462858, -479715, -98195, 283709, 313150, 140322, 211790, -57013, -37303, 117913, 111022, 233396, 197373, 42957, -30331, -224172, -500371, -495420, -464023, -475904, -365275, -28026, 107807, 91445, -82193, -395693, -383149, -73684, 131844, 34838, 37007, -76019, -9156, -132361, -72493, -214027, -592735, -597556, -396621, -296511, -109781, -9510, -5858, -133224, -106668, -79624, 130879, 180494, -149744, -145066, 92468, 91387, 201073, 57836, -174430, -231343, -137968, -74308, 56217, 75576, 169868, 117587, -50397, -26523, 93163, 177830, 448135, 430304, 174417, 16230, -191915, -40209, -117923, -96008, -48870, -197701]
22623a97701J59729P2931l0645l30592l549j519j87528J074J55179J49514J33936
22612g9171K35425j13683j71515j22837K49947n4130o2627Q4594L876R508m6292
22601f6905o9994O1014K16704j37555n3256j25377k50252J4140J13453m7438K99362
22590d6104K30757K8012J79421K32227k26174m34336k19361N3839K0882P4488
22580a06349k0469j00349q9149R4825Q6992J13941o0732m7346J21503J0840j95696
22569a91989P2245j07204K6228P7562J54811O4326r0409P466K63183Q3509J9790
22558C79518m1569j16463J54435L2110j49650j02465Q6871M1940j21069l48218
22548a84560j36605J25086J6537j00198k5838K36631M8857j66514J80561K28124
$$ y = [-197701, -37972, 34959, 4314, -326278, -329827, -331346, -518874, -517800, -362621, -213107, -79171, 156254, 42571, -128944, -251781, -1834, -55964, -118591, -33997, -30121, -20613, -66905, -136899, -75885, 140819, 3264, -49992, -175369, -425621, -411481, -298028, -345466, -46104, 184653, 212665, 392086, 624313, 398139, -36197, -255558, -201719, -180837, -106349, -126818, -227167, -316316, -221491, -134499, -20558, -81290, -128636, -7133, 3707, -191989, -119744, -226948, -200720, -123158, 31653, 95979, 5570, 13036, 276219, 359728, 379518, 337949, 221486, 375921, 408031, 258381, 155916, 242787, 284727, 163658, -184560, -321165, -196079, -179542, -279740, -305578, -68947, -20090, -186604, -6043, 222081]
22538B22081k60279l72807j1757N5252K30513K52287j4683L1395J13267j65260
22528H0009k68867k10660M81288J37911J23049k03996K4844q0931k06884j2050
22518a36287j24501j26057m0519J04029n8791Q0047K52359K23536J3978p2605
22508A15189p1171j59113P8256J56635J28021j2941l90780l21968m8582R0570
22498d35884k20J99620K07646J16778M9330n5421M6780j28766J5906N3043N8133
22487A26945M5791l16821j15045j82320K33628J84683r333J66987k92701j76785
22477c34971J40026P4772n5762L7527J78134N6116p031J51965M9202K9159k68864
22466E0273p4097Q4019o6299j86471m7823J84497L41591j2938k43360n2970L05050
$$ y = [222081, -38198, -411005, -422762, -367510, -136997, 115290, 100607, 132002, 245269, 80009, -188858, -399518, 81770, 219681, 342730, 138734, 163578, 82647, -124237, -136287, -260788, -386845, -427364, -323335, -382126, -302079, -49720, 173816, 187794, 115189, 44018, -115095, -36839, 119796, 247817, 234876, -155904, -477872, -526454, -435884, -436104, -236484, -28838, 87940, 137270, 81849, 128629, -137, 15769, 68812, 126945, 172736, -144085, -259130, -441450, -207822, -23139, -32472, 134515, -158186, -334971, -194945, -120173, -175935, -138408, 39726, 95842, 88811, 240776, 289978, 319137, 50273, -23824, 60195, -6104, -192575, -240398, -55901, 285690, 272752, 29392, -23578, 281472]
22455B81472p1j08317k66262j98574p6331J08802L22289K0708j28468o8251r7395
22444b10398J25987P6987l2400J64027J41139m528M9870r560j90124r7655n8412
22433d5067K14314Q3874j00801K89158J81134j27970j79743l44194j13183r331
22423a51809O1708j8821Q1740k7713P5252q9366l3361j57545J17766K23362l21079
22412b39866k19296K9023J98870j43952L5363J34533k0057O5935K03896J9340
22402F3789R199J08895l41645q7368J56297R0280Q4407Q2468k06201k9797K24235
22391A54559k6722k1661k58962o925r8129n7863L15179K71009J20566k19692J3388
22380A84747q1645k71419J5965r7568J30130R1672J54794k33763k34404j30374
$$ y = [281472, 281401, 173084, -93178, -291752, -368083, -259281, 63008, 83716, -44752, -113003, -210398, -84411, -7424, -39824, 124203, 265342, 260814, 310684, 301124, 111000, 13345, -45067, 169247, 253121, 152320, 441478, 622612, 494642, 314899, -29295, -142478, -151809, -90101, -108922, -27182, -54895, 20357, -69009, -102370, -259915, -142149, 81213, -239866, -459162, -430139, -231269, -375221, -339858, -205325, -225382, -159447, 44449, 63789, 72988, 181883, -159762, -247130, -90833, -553, 83854, 166322, -39879, -69676, 154559, 127837, 106176, -152786, -159711, -257840, -315703, -524, 270485, 391051, 171359, 184747, 103102, -168317, -152352, -249920, -119790, -28118, 126676, -107087, -341491, -471865]
22370d71865L7189K16952K43680r826j97983J24174N0136r2239k2287J50848l7244
22359h465j4464l9067m214N0261j74469J24722J87191R9120j18519k83795j16537
22348b98236n9780N0747p145N1505J50238K4400K39267q7893j72255k9841M375
22337a34618o5202q0643j53921M3165K2654r1856M7894L38819J21205j98326k1947
22326a72776r0776j29278q7020J8831L47220K40137l17609j39378K44257O4700
22316b1692R5173k5359l4674j15350j0040M2495J36052j12462N075j1854n3065
22305a05701K28530M2839k15613k92328p8414J41225K716k12664J64009K72982
22295e2419k82524K9664J20327j8638J56928R9428L4611j08883p0559l46857j27645
$$ y = [-471865, -434676, -217724, 25956, 16130, -181853, -57679, -7543, -99782, -122069, 28779, -8465, -22929, -61996, -66210, -15949, -190418, -65696, 121495, 220615, 102096, -181699, -298236, -358016, -307269, -314414, -262909, -112671, -88271, 150996, 63103, -109152, -138993, -134618, -199820, -280463, -434384, -391219, -368565, -460421, -412527, -73708, 47497, -150829, -172776, -263552, -392830, -479850, -461019, -113799, 126338, -191271, -330649, -86392, -21692, 73481, 48122, 13448, -101902, -111942, -69447, 66605, -45857, -40782, -52636, -105701, 122829, 165668, -49945, -342273, -420687, -279462, -276746, -489410, -325401, -52419, -334943, -305279, -184952, -203590, -46662, 52766, 87377, -21506, -92065, -438922, -566567]
22284e66567K73414J34233n8702O3095M7137J6976J3583J15601J08241j09198
22274C7813J02883j3403l24890j26974J54319o8589J4471J57901J29192M9252
22264A11975j38563Q70J38355Q6753j58394p4920J24622l5185l4564j91397l58779
22253e29227J45417L13553n127j62788K231j70944J31719Q7341Q9552P9463J28586
22242A09776J27697L33643m9420l82898k07045q256K132K9029N7839o8072O8262
22231A2687p4448j75591j83295p7335J11770K33528j03777K21645J57370J52752
22221B75306j07178j14573l79504n6110J93726K65008o5890l66031j72968R8571
22211d29643N03710M5176j76280k62050p8982J53017J70412J39576k0584l3598
$$ y = [-566567, -293153, -158920, -217622, -154527, -107390, -90414, -76831, 38770, 147011, 37813, 140696, 127293, -197597, -324571, -170252, -238841, -224370, -66469, 62723, 111975, -26588, -25718, 112637, 199390, 40996, -33924, 90698, 55513, 20949, -170448, -529227, -383810, -70257, -75384, -238172, -235941, -406885, -275166, -187825, -98273, -18810, 109776, 237473, 571116, 521696, 138798, -68247, -76503, -74371, -45342, 12497, -55575, 12687, -61761, -237352, -420647, -497982, -386212, -152684, -256461, -34816, 122554, 275306, 168128, 53555, -325949, -382059, -188333, 76675, 10785, -355246, -528214, -429643, 74067, 119243, -57037, -319087, -398069, -245052, -74640, 64936, 44352, 10754]
22201A0754p4198O1702k8562M7923J60903J5529j34463R3141J66875J7943k43472
22190I4075r7436n4465j4365m1363j51372J02714J95884p2999j31276j69685Q5221
22179b55067O9300J65641j0602j00017J07387O0260k41945k24193J80875J77412
22169g0949o2526j98197J00775K58887M21198j19942j08354k8398o9640k27817
22159a04963j63613K10970m348L1764R4725j00509j83792m0871P3815N6263J59904
22148B9345m7251K25378J05937k06367q5011P0985m7263Q1607K68267k6123k57537
22137A11967Q7497J27226p5223m10268p3089J92795l3771j38110k5824Q3955J4632
22126a38213N0810j54784R7416K52320J77183l79028l02059J93656J53855K09485
$$ y = [10754, -63444, -1742, -30304, 17619, 178522, 194051, 59588, 152729, 319604, 337547, 94075, -3361, -57826, -72191, -113554, -264926, -162212, 33672, -39327, -170603, -340288, -255067, -185767, -20126, -30728, -130745, -23358, 36902, -205043, -429236, -248361, -70949, -133475, -331672, -230897, 27990, 449188, 329246, 220892, 192494, 122854, -104963, -268576, -57606, -61954, -30190, 64535, -35974, -219766, -260637, -186822, -130559, 29345, -17906, 207472, 313409, 107042, 22031, 93016, 45753, 127360, 395627, 369504, 111967, 199464, 326690, 251467, -158801, -231890, -39095, -72866, -210976, -236800, -152845, -138213, -87403, -242187, -144771, 107549, 284732, -94296, -396355, -202699, -48844, 160641]
22116A60641j75605j52693K18858o3691K4035j6600J02263l85167k53531j1550
22106e53040J28481P466R4484J7411N3565L019J35655n6363P7404K8828j07934
22095a71024l02019q7115o0399M17144L98406K18311k7119k98306l20726j76371
22085d09218l7666J78553J85832Q8161j94641j37118J05870q0297J21119J2376
22075a67029Q2599J5131J08716J18741L2599Q9502m5084k39076J46377N8521p94
22064B00203k20946j84534m6212L6238K51277r70j88861j26337j97840j42114
22054f20096R527L42355J49199l9949O5974k13940J35317L58185p5456l65090
22044b53974J13934L03896j19430q3446J76400R2871j15860j0394k30599O7629
$$ y = [160641, -14964, -167657, 51201, -12490, 11545, -5055, 97208, -287959, -541490, -553040, -424559, -417093, -322609, -305198, -251633, -248614, -112959, -169322, -91918, -63090, -171024, -473043, -560158, -620557, -203413, 194993, 413304, 386185, 87879, -232847, -409218, -446884, -268331, -82499, 5662, -188979, -326097, -220227, -300524, -179405, -167029, -84430, -69299, 39417, 158158, 190757, 280259, 235175, -3901, 142476, 200997, 200203, -20743, -205277, -251489, -215251, 36026, 35056, -153805, -280142, -477982, -620096, -610569, -268214, -119015, -158964, -92990, -306930, -171613, 186572, 111116, -253974, -140040, 163856, 44426, -39020, 137380, 230251, 114391, 103997, -126602, -58973]
22034e8973J38029J51427P9601j71746J93502n6318o2613K6065k7240o6202J26701
22023B72233q3421o1803k31374j87764K03563J29780K5419k41045j49714l3957
22013c58083M2929Q064N85J34706p3914O2467J31967J19689l7279K6912j09065
22002e1022j96896j01493K01092O6525M6174J65361N6088r0314k86815j91848
21992c83148P6826K27399j15728k16727N0839j26999L3137K10982n9365K6618
21982b76166M5965J42647k84442k84926K67526J4077K6644J03809J30781Q8228
21972b5857k3491j73317K48838R1058j05658j77590j9075l7169J21490J61509
21962F0738k0730K2239M3256O0483j23100O9834K32868m142j57975k40383k52020
$$ y = [-58973, 79056, 230483, 310084, 138338, 331840, 275522, 212909, 238974, 211734, 145532, 272233, 188812, 127009, -104365, -292129, -88566, 41214, 66633, -174412, -324126, -358083, -315154, -307090, -306505, -171799, -245713, -183246, -51279, 68410, 31131, 58043, -51022, -247918, -349411, -148319, -81794, -35620, 129741, 185829, 95515, -191300, -383148, -306322, -78923, -194651, -411378, -360539, -487538, -454401, -243419, -302784, -276166, -230201, -87554, -371996, -656922, -389396, -375319, -348675, -244866, -114085, -25857, -49348, -222665, 26173, 117231, 11573, -166017, -185092, -222261, -100771, 60738, 40008, 62247, 105503, 165986, 42886, 112720, 345588, 341446, 183471, -56912, -308932]
21951c08932j21790K32204J80268N9988Q4762k60103k42144K6801J35286P5897
21941a37763j39024J47336J69533r6868j4108L5896R8236L0885j78043M3736Q6466
21930D6282l48449q4267J2063q8123J77111k7182K38039L94862m6730k9270q7739
21919A56597J4295j44265j20433J03329K92066p3707j65469j45484R5043j31688
21909a19716J3407J46259L696J03311n0720o6313k434J19058L6794j90200j28269
21898a35127K26149L37254k9898l14275j77993j11035j80851j39807M1724J75754
21888c08105L69548K567P3070j41754k55033J01564l1533j40226L3079J02320
21878a94503l4750L992J07292J76875j42154p6929M8516j33156K11209K22845
$$ y = [-308932, -430722, -198518, -18250, 41738, 126500, -133603, -375747, -348946, -213660, -137763, -276787, -129451, 40082, -56786, -70894, -34998, 63238, 94123, -83920, -40184, 46282, -302167, -386434, -374371, -462494, -285383, -312565, -74526, 320336, 273606, 244336, 156597, 170892, 26627, -93806, 9523, 301589, 227882, 62413, -83071, 11972, -119716, -106309, 39950, 43646, 146957, 96237, 29924, 27490, 146548, 183342, -6858, -135127, 91022, 428276, 398378, 84103, -93890, -204925, -385776, -525583, -483859, -308105, 61443, 64010, 137080, -4674, -259707, -158143, -189676, -329902, -296823, -194503, -229253, -225261, -117969, 58906, -83248, -160177, -111661, -244817, -33608, 189237]
21868A89237J75067j63806o1990O883p9095K2275J98070l90270l9780L05963r8180
21857F4374j06338m830k23297j41416N7275J789K39566K40367K13874k52057l04861
21846b15554j71744J23732Q0790N5029K4971J40892J74234N8451j5139o6100O5141
21835B54703j02049j13774j32115q301N1960k1871m5838J6868K5061P2648P0470
21824F7762k19902K33210n7085j35874j02800Q2102R2556O1399J2136J10466K21046
21813C65016L220k00225r9992j5897K41K38456j7954q6195l3152K7144K5247j50163
21801E5746j82004J03735J37694O0426L1251m4858K0864j03434m19605Q9008L97990
21790A46813J47931K4999j41973R5228l4717j35579J01847K06547Q6281k13708
$$ y = [189237, 364304, 200498, 138508, 145391, 66296, 88571, 286641, -103629, -143409, 162554, 64374, -41964, -46794, -270091, -411507, -354232, -352443, -112877, 127490, 341364, 89307, -215554, -387298, -263566, -182776, -127747, -102776, 38116, 212350, 270801, 255662, 189562, 254703, 152654, 38880, -93235, -101536, -49576, -71447, -117285, -100417, -75356, -2708, 67762, -152140, 81070, 23985, -111889, -214689, -132587, -40031, 21368, 33504, 143970, 365016, 368236, 168011, 68019, 52122, 52363, 290819, 272865, 186670, 153518, 180662, 205909, 55746, -126258, -22523, 115171, 175597, 206848, 161990, 182854, 79420, -340185, -251177, 146813, 294744, 319743, 177770, 272998, 238281, 102702, 204549, 411096, 497377, 283669]
21780B83669k0190q6716J08148j52059o0070J2169K3351k48977m1000N5540J72265
21769D6130K59334k4966j6765K1695k65004R0793p3142j60462p0029J7738M3635
21758a31043o6047J21628o6074j03930Q2834K87596J70172j25891k59875k17329
21748c07959l5148k6636K6909K2842R2395J22159J2478k19333j42955L7869q270
21737d25649j5823K7126M6442J39879L40964j34693j55848l1391R339K7955K3526
21726a48173J25943K27728p7919N1693r3684j79029j59638k01696P6408K82962
21716i5405K73563J08718K6681k73649n8366J10249O2824K6674J15232p5207k58280
21705c6966P8063P9632r4012j02326k5312J15636O0714L7936m9014J7014q5915
$$ y = [283669, 263479, 176763, 284911, 132852, 72782, 84951, 108302, -140675, -181675, -126135, 46130, 305464, 280498, 263733, 285428, 20424, 111217, 38075, -122387, -192416, -174678, -131043, -197090, -75462, -141536, -245466, -162632, 124964, 295136, 169245, -90630, -307959, -343107, -369743, -342834, -319992, -227597, -105438, -92960, -312293, -455248, -417379, -425649, -441472, -414346, -367904, -228025, 112939, -21754, -177602, -208993, -199654, -171699, -148173, -22230, 205498, 127579, 179272, 85588, -93441, -253079, -454775, -378367, -95405, 178158, 286876, 313557, 39908, -18458, 91791, 154615, 181289, 296521, 221314, -36966, 41097, 120729, 26717, -75609, -100921, 14715, 75429, 113365, 64351, 81365, -4550]
21694d550O7982J14837J04461r3504Q5191j59193j23069J4068n1527j00630J975
21683a43959J17467K10461J65038k9586j20707J07565J18454k91502p5101J81143
21673B39273j60985j03753R5391J92021l1822L73q3713l5461J21953J36304N622
21662C75203j71393k77151l99403N2796M6916J08402K30328K51141j86010O8768
21652I9597m0039L7494M338j41420l26204K33509J08556m2484M8454R0588l6370
21641C6019n1640J18917R8350k17562j67629J58492j4606o7039N9987P4293P2020
21630I9602J74418Q3808j57749j48826j39446J5336K25508q1772j45415m4807
21620a19343j64553p9044K12944J43213j50608j37628J24744K65083Q9268k48698
$$ y = [-4550, 63432, 178269, 282730, 189226, 274417, 115224, -7845, 6223, -45304, -145934, -143959, -26492, 183969, 349007, 319421, 198714, 306279, 424733, 133231, 58130, 239273, 78288, -25465, 69926, 261947, 230125, 230498, 146785, 111324, 233277, 369581, 375203, 203810, -73341, -472744, -419948, -373032, -264630, -34302, 216839, 30829, 99597, 59558, 97052, 101390, -40030, -366234, -132725, -24169, -66653, -18199, 72389, 36019, -15621, 103296, 201646, -15916, -183545, -25053, -39659, -106698, -46711, 27582, 99602, 274020, 357828, 200079, 51253, -88193, -72857, 152651, 70879, -74536, -119343, -283896, -362940, -149996, -6783, -157391, -295019, -170275, 94808, 184076, -64622]
21610f4622J37736k72242m8759j54655K1775J43819O8362L1002j34308R0433j25177
21599c06636o0035K11914M1764J06349o5805k98942Q6040P6567j89246K1830J72597
21588b03603K3369j821K52773P4691k92461j16673K7346J03007J53795J17713
21578A38136J06730K4436j92364k06542P0639N2368l8139J40040l9207j76811
21568a20714R3174R7282J18584J2159j33100j12210o295p2216J36316j89213O7439
21557a08794P136r1127l608J05312J27832n120M2361l1086J1314K08550q9463
21546A73307r9234k4805j77087j50797j11451K09022L01347k21009P0508K81114
21536B50915J2138l75101n8296M6739L8336k2794J3561q419p3120k5078J64212
$$ y = [-64622, 73114, -199128, -247887, -402542, -380767, -236948, -168586, -137584, -271892, -181459, -306636, -366671, -154757, -112993, -6644, -72449, -371391, -285351, -208784, -398030, -376200, -203603, -180234, -182055, 70718, 145409, -147052, -263725, -236379, -133372, 20423, 138136, 244866, 269302, 76938, -129604, -58965, -6597, -44736, 95304, 56097, -120714, -27540, 69742, 188326, 200485, 67385, -44825, -51120, -123336, 12980, -176233, -108794, -101658, -192785, -196393, -91081, 36751, 31631, 73992, 42906, 54220, 262770, 173307, 74073, 49268, -127819, -278616, -390067, -181045, 120302, -100707, -30199, 250915, 263053, -112048, -170344, -123605, -85269, -108063, -94502, -102921, -176041, -201119, -36907]
21525c6907L1595j71247l35293N2746k5950J56653J44556J05412J01998L851P2013
21514I9427m0347Q0605J39214O268p1315L1589k81173j58408N1295J4873L09012
21503A81040m8178k39080j06288Q8805J9945p6922Q0797J16430k35354l0025M9883
21492a98947K7908R0992M6519P453Q7219n5965J3966R1697J43768L0789j49654
21481A35745p941j40731q8196Q5164K73365N8541k38809K1044J68947j593Q959
21470B74495j64134J63244j40689l35606K0967J51171J92015M2789L2741l4192
21460B02801l8878J4049n2003j3197j46141O0680K45701N7177m1106j78118J36767
21449B47732j8434q6090J3281J94541l7834l39697k81825l3452J41006J95060
$$ y = [-36907, -5312, -176559, -511852, -459106, -485056, -328403, -183847, -78435, 23563, 27414, 99427, 59080, 139685, 278899, 285167, 213852, 245441, -35732, -194140, -142845, -127972, 181040, 132862, -106218, -212506, -123701, -103756, -180678, -99881, 16549, -218805, -248830, -198947, -171039, -80047, -33528, -26075, 61144, 5179, 19145, 110842, 254610, 285399, 135745, 127804, -12927, -101123, -15959, 257406, 315947, 77138, 98182, 267129, 265536, 274495, 110361, 273605, 132916, -202690, -181723, -30552, 161463, 204252, 236993, 202801, 163923, 177972, 125969, 112772, -33369, 27311, 273012, 330189, 289083, 110965, 247732, 229298, 143208, 156489, 351030, 313196, -26501, -308326, -341778, -200772, -5712]
21439e712P2517k0223J17933j3929k38968k8570J1090j27607J89586O0912j55012
21428a37983K33566K28780j91475o9244K01310j0009k5042o0271N1390J04616
21418C25638M3198j27699k91845M3303K84836J23580J952l28643q3669L78850
21408C69501J13015k24658k63369P2833l4107K70058O2359O562j14079j41357
21398A16758J89757J55349J1168K3520l2269k77119r4707k5669l0764q0536j21351
21387a65863M51714L2801P147J37566q081p0399j57855j28378j52683j9484k7701
21376a01216L9797K7277O138L08946N1014k14615j76117N8499J46643N8037k67542
21365f3139j4958P2541j9007m9653M257N6748K18464J9950j22721j46700p5562
$$ y = [-5712, 66805, 46582, 164515, 150586, -88382, -116952, -105862, -233469, -43883, 17029, -137983, 95583, 324363, 132888, 63644, 264954, 254945, 229903, 169632, 221022, 325638, 368836, 241137, -50708, -7405, 277431, 401011, 402963, 74320, -9349, 369501, 482516, 257858, -5511, 67322, 33215, 303273, 365632, 372194, 258115, 116758, 306515, 461864, 473032, 496552, 464283, 187164, 92457, 66788, 36024, -44512, -165863, 285851, 318652, 325799, 463365, 455284, 384885, 227030, 98652, -54031, -73515, -101216, -61419, -34142, -28004, 280942, 331956, 117341, -58776, -277, 146366, 204403, -63139, -78097, -5556, -24563, -74216, -69959, -13211, 205253, 225203, 102482, -44218, -119780]
21354a19780J06447m9157j49304o5548K36498n7497P0094J40359m2167k1023J0108
21343E9030j19093P4970J42890J67800p245j65350j09064R057Q9247k8705r3632
21332A9905r8072L7486J4408J93699J3975j64080M9795J33827Q1223R5085K8704
21321D05955J6303j31226r5747j61513k17671J85640K53822R921l04699J12144
21311G2929k7027L8777j01852R887N0866L794K01816j06840k43157j40481K99079
21300E7791J82626o4056K1620j01977J62263L1434k78804q1421J07134J80536
21290B17146j8061n2816j62855j75618J62811K12815k4049K18885k9244l05737
21280D3277k51364J85586R5111l2307K17576k2146j72935L3319r3467j35554J75069
$$ y = [-119780, -13333, -62490, -211794, -277342, -40844, -98341, -28247, 112112, 69945, 48922, 59030, -60063, 14907, 157797, 325597, 318352, 153002, 43938, 52995, 142242, 113537, 19905, -78167, -40681, -26273, 167426, 181401, 17321, 67116, 200943, 282166, 377251, 405955, 422258, 291032, 195285, 33772, -183899, 1741, 255563, 265484, -39215, 72929, 45902, 84679, -17173, -7286, 43580, 47374, 249190, 142350, -100807, -241288, 57791, 240417, 176361, 197981, 96004, 258267, 289701, 10897, -70524, 36610, 217146, 199085, 146269, -16586, -192204, -29393, 183422, 159373, 378258, 349014, 43277, -208087, -22501, 72610, 40303, 257879, 235733, 62798, 96117, 2650, -132904, 42165]
21269D2165N1002q4395j11909P1681j06105R2766J99985J80833P2434l91898k04830
21258a88271N1972J11510L02032N6169k24993j72107j52529K35947K29055J53509
21248D02294J82727k15373l18079j07257J56804J41330p5265n8662K01531O1861
21238C71911j91505q5872L76385J10916K3350J28442o6413q2422o2276M0250J07683
21227F70449K18461K14222K84648L07457R6146P5137N8742p8040M0884P0100j48905
21216A809301k03406q8326k33579m85254o1738k3089r4959K9648j43036R386r6341
21205D18607j18228J44383K8443k97195j79940J74507K95546L0891R2660r8845
21195D90829j34596O5044j2382k33209k41034o4013N4529J28736J83055R3046
$$ y = [42165, 93167, 8772, -103137, -31456, -137561, -44795, 155190, 336023, 408457, 16559, -188271, -136299, -24789, 277243, 333412, 108419, -63688, -216217, 19730, 248785, 402294, 585021, 369648, 51569, -55688, 101116, 242446, 167181, 108519, 310050, 371911, 180406, 94534, 470919, 581835, 605185, 733627, 667214, 584792, 522516, 562766, 670449, 888910, 1103132, 1387780, 1695237, 1791383, 1866520, 1925262, 1847222, 1888106, 1958206, 1809301, 1605895, 1517569, 1283990, 798736, 736998, 713909, 618950, 648598, 505562, 514948, 418607, 300379, 444762, 473205, 176010, -3930, 170577, 466123, 497014, 589674, 490829, 356233, 421277, 408895, 175686, -65348, -129361, -74832, 53904, 236959, 330005]
21185C30005J2541P3969J36072j40680j71362n3460n4448j09176L413k29329K28676
21174B6221L05772L8990j31506J168K12562j23017j37031j69336J85083J38922
21164C47828P459j31475K3007K29636j08824q4109K19057J26075r3271j79564
21154C55819j86492M5574J94940N6524n3424l08824k09187k00541j21902L33747
21144i3766R9353J19152J36315M0984j24674j11080j38040R1586L88494J07177
21134E15501k32122l9090Q3554J6592j6197J45626Q1980k24349n8419L34623r0250
21123E17449J2619r6328j92974j2924K10571j80152j57750N5949K7941J2108k34794
21112c8285m0512r1364N6610j7888K45608L37613J77363k73992j91119k69981
$$ y = [330005, 342546, 416515, 552587, 411907, 240545, 187085, 132637, 23461, 26874, -202455, 26221, 331993, 370983, 239477, 240645, 453207, 330190, 193159, 23823, 208906, 347828, 355287, 223812, 246819, 476455, 367631, 283522, 502579, 628654, 535383, 355819, 169327, 214901, 409841, 466365, 412941, 104117, -105070, -305611, -427513, -93766, 5587, 124739, 261054, 302038, 177364, 66284, -71756, 19830, 408324, 515501, 283379, 244289, 327843, 344435, 328238, 473864, 555844, 331495, 273076, 607699, 517449, 530068, 433740, 240766, 227842, 438413, 258261, 100511, 156460, 184401, 196509, -38285, -78797, -170161, -113551, -131439, 114169, 451782, 629145, 355153, 164034, -105947]
21102a05947n0133J65463J88763q607j7839L9705M8066n7147K07164R0393k19252
21091B80629m174j21266N4704o4680m9493k8370L1919p0540j14039n1013n6661
21080a92984j2234j08983q429J45734J69006k3059M5694K05901K83899m955k4563
21069D75027k2960K0989m677p3247j92789j93456o0170l2481J03651J06744K23852
21058C50483J20890j43627j56253J09408K7675j46973l60296M0829K59185K06826
21048C08147L7690j22989j15049J79281j53134j50719M4949j29441N1338K94819
21038B44892K3078k48432J3501J50492M748r8846r0105k46452J52117L29052J69991
21027D04036k2664J19817K63608Q2459j69328l20749j15743j28849J16612r7737
$$ y = [-105947, -156080, 9383, 198146, 189539, 171700, 211405, 259471, 202324, 409488, 499881, 280629, 276455, 155189, 209893, 145213, 95720, 67350, 99269, 28729, -85310, -136323, -192984, -205218, -314201, -322630, -176896, -7890, -30949, 14745, 220646, 504545, 499590, 475027, 452067, 473056, 468379, 395132, 202343, 8887, -51283, -83764, 19887, 126631, 350483, 471373, 327746, 171493, 280901, 308576, 161603, -198693, -157864, 101321, 308147, 345837, 222848, 107799, 287080, 133946, -16773, 28176, -101265, -49927, 244892, 267970, 19538, 33039, 183531, 188279, 89433, -672, -247124, -95007, 234045, 404036, 381372, 501189, 764797, 847256, 677928, 357179, 241436, 112587, 229199, 131462]
21017A31462J31166J78383K45067R8761J11814j53837l23625k0209j1804j94547
21007A92631l8969j12543n3211O5740J75442K60422O4151j16609r6878j19025
20997B21151J9386O7560j93433l8867O0175r86k5033j77604J87706L45570J15124
20986E80749l42366l1903J17943R4505r6674J05129k06761j71470k24972k14471
20976c90291Q9949K31044Q0773J02087J21495n4495j9694J4052j65055k22727
20966b12862L3007J27169J99918j80888n6824K31011K31151o379j3801J20730
20956D72232n0807l02888j81254j62701J26274J29083P2995q2003L2835P7044
20946A30810J71130K52714N3779l56982k34010J49829K58235m3524k07445N007
$$ y = [131462, 262628, 441011, 686078, 784839, 896653, 742816, 419191, 398982, 387178, 192631, 153662, 41119, -12092, 53648, 229090, 489512, 553663, 437054, 340176, 221151, 240537, 308097, 114664, 75797, 135972, 134986, 109953, -67651, 120055, 465625, 580749, 238383, 206480, 324423, 418928, 322254, 427383, 220622, 49152, -175820, -390291, -300342, -69298, 11475, 113562, 235057, 180562, 160868, 174920, 9865, -212862, -179855, -52686, 147232, -33656, -90480, 140531, 371682, 365303, 351502, 472232, 421425, 118537, -62717, -225418, -99144, 29939, 102934, 20931, 53766, 130810, 301940, 554654, 608433, 251451, 17441, 167270, 425505, 381981, 174536, 179543]
20936A79543q8727j89002k8547J80939J24865J28318j35828j1045K64913O7851
20926D93280r6637l10703j05308J11256O2510J40961K26419j85629j25338J13978
20916C24789m9571k53572j74754K31587J77617k0032J41690J94609N9518J1453
20906F43334o8740l542J6296j24622l07847K39407n1264q1151P0096Q4749j27438
20895B89278j14932j63894m6019P3007j47845j15796Q9985J29946n0032j5908
20885g2210K92530J34448L4611O6071j30199k63418Q5956K54244k47038j6795
20875A38200J44720m6083N068o5293O8609O8183k18484K2548J04935J04747m7394
20864B79756K48593J31592k0532j69359P1482l49073j3767J70484O624j7590j8603
$$ y = [179543, 90816, -98186, -126733, 54206, 179071, 307389, 171561, 160516, 425429, 493280, 396643, 85940, -19368, 91888, 154398, 295359, 521778, 336149, 210811, 324789, 275218, 21646, -153108, 78479, 256096, 236064, 377754, 572363, 631881, 643334, 574594, 571052, 587348, 462726, 154879, 394286, 343022, 261871, 331967, 416716, 289278, 174346, 10452, -35567, 37440, -110405, -226201, -136216, -6270, -56302, -72210, 220320, 354768, 389379, 455450, 325251, 61833, 147789, 402033, 154995, 138200, 282920, 236837, 241905, 176612, 245221, 313404, 94920, 117468, 222403, 327150, 279756, 528349, 659941, 639409, 470050, 541532, 192459, 178692, 349176, 355800, 338210, 319607]
20853C19607k3701J04615N4530q5514o7450L27876m6792J38035J37255r5768Q5950
20842H48643o8161j15711J59949p8674j28952j9765p9021j22512J59489p62N5992
20831F10515j02203k20365j48168M9402j01952J54901J97601J30514K7929M7756
20821F45930J96200k055q5762k4703n1334j9124j75577R4236K43614j32251J38971
20810H28145q8879l79529j30986J0815J75640J55377k7082j46907M9005k5084
20800D20515k51M1038J53149n6079r3487j7816J34740q5168k14833O0770J0397
20789C52975P2203O7424m6341j95606R0930Q0672J79836r4525J6858J33078J04892
20778G62396m2938n5347M7783j75825Q7152J75103j5852L8761O9856J32063J47746
$$ y = [319607, 295906, 400521, 455051, 369537, 302087, 629963, 583171, 721206, 858461, 762693, 848643, 780482, 664771, 824720, 746046, 617094, 597329, 518308, 395796, 555285, 554523, 610515, 508312, 287947, 139779, 189181, 87229, 242130, 439731, 570245, 598174, 645930, 842130, 840075, 754313, 729610, 678276, 659152, 483575, 577811, 821425, 689174, 828145, 739266, 359737, 228751, 239566, 415206, 570583, 543501, 396594, 445599, 420515, 420264, 461302, 614451, 558372, 464885, 447069, 581809, 496641, 281808, 342578, 352975, 425178, 492602, 446261, 250655, 341585, 422257, 602093, 507568, 524426, 657504, 762396, 719458, 664111, 711894, 536069, 623221, 798324, 782472, 821233, 891089, 1023152, 1170898]
20767A170898Q4248J84142L0753j24785j73195K2900j82171n3121J43475R2558
20757A195702k59710K964K1723j83237O1289J30499R3034M2222j20664k08256
20747G75566K5087Q0135J99654n8567l2870N9136j2992p1373J24043R3656N2310
20736A233785j53497P2423J08411j68808L7699Q6283j89754j7923N3161j57721
20726I04059J09125q0061j71588L21701q785J63966K28664J03042M2709N8552
20716A671384L4250J42832P7127L46726M1232k20563j71995O3314K4795l9275
20706A969827l0385j36596j24113J53541l8509r0753J54966P485k04884m0910
20696A619669Q0779j80298N4545J27117l020R5340o4553j32969j85943J0446J86492
$$ y = [1170898, 1255146, 1439288, 1470041, 1345256, 1172061, 1194961, 1012790, 959669, 1103144, 1195702, 935992, 938956, 960679, 777442, 838731, 969230, 1062264, 1104486, 983822, 775566, 800653, 880788, 1080442, 1021875, 989005, 1048141, 1035149, 963776, 1087819, 1181475, 1233785, 1080288, 1152711, 1261122, 1092314, 1130013, 1216296, 1026542, 1008619, 1061780, 904059, 1013184, 933123, 761535, 1083236, 1074451, 1238417, 1467081, 1570123, 1612832, 1671384, 1705634, 1848466, 1925593, 2272319, 2313551, 2092988, 1920993, 1984307, 2009102, 1969827, 1939442, 1802846, 1678733, 1832274, 1793765, 1703012, 1857978, 1865463, 1660579, 1619669, 1700448, 1520150, 1574695, 1701812, 1698792, 1794132, 1729579, 1596610, 1410667, 1421113, 1607605]
20685A607605P5928J44459M4851K1292m0934L5477J67995J42501k09092J91960
20675B182042k10634n1582L16718J7914J59247N9089n9911J94391O9553P3611
20665B750438j17028k81768Q3324L10087R2282j17089K1222J21106m6577j93628
20655B622369o904J64350O6782O9901J79724K63837J01964J06294J9216J09691
20645C697224L8345R571J59093J30225J3060R3798K32464N1374M00392L91087
20635E216633N4294K50410m81K96419K33224L17850K95065L84736J23361K56878
20625G428389L82279J38782M84907L15893L75791N69512O33454R02539P94731
20616A2026277J048679R65930R79990J339139J373560J551876J422987J384020
$$ y = [1607605, 1683533, 1827992, 1872843, 1894135, 1853201, 1888678, 2056673, 2199174, 1990082, 2182042, 1971408, 1919826, 2236544, 2254458, 2413705, 2472794, 2412883, 2607274, 2676827, 2750438, 2633410, 2351642, 2434966, 2745053, 2837335, 2720246, 2741468, 2862574, 2815997, 2622369, 2615465, 2779815, 2846597, 2916498, 3096222, 3360059, 3462023, 3568317, 3587533, 3697224, 3735569, 3745140, 3904233, 4034458, 4047518, 4141316, 4373780, 4425154, 4825546, 5216633, 5270927, 5521337, 5520856, 5817275, 6050499, 6368349, 6663414, 7048150, 7171511, 7428389, 7810668, 7949450, 8434357, 8750250, 9126041, 9695553, 10329007, 11231546, 12026277, 13074956, 14040886, 15020876, 16360015, 17733575, 19285451, 20708438, 22092458]
20608B2092458J649969J790230J981110K188065K578149K978241M198520N015846
20600D4472588N836352P230387R296638J1668785J5294921J9911840K6182915
20593A39894426L3278897L9272323M1602008M0196937L7126390K8798487J4436267
20586C74605735J345418n441795j2339865k5151304l7758536m0509567l4916705
20579B19833381k8570888k4763545k2039693j8484817j5142024j1898206r749652
20572H9184556q152813o712282n636399m747829m155395l755538l374680k671030
20564D9978590k415225k394831k205939k465811k284165k033909j914296j846926
20556C2417488j536303j387449j430761j521670j522278j137577q53175j118884
$$ y = [22092458, 23742427, 25532657, 27513767, 29701832, 32279981, 35258222, 39456742, 44472588, 50308940, 57539327, 66835965, 78504750, 93799671, 113711511, 139894426, 173173323, 212445646, 254047654, 294244591, 331370981, 360169468, 374605735, 375951153, 370509358, 358169493, 333018189, 295259653, 254750086, 219833381, 191262493, 166498948, 144459255, 125974438, 110832414, 98934208, 89184556, 81031743, 74319461, 68683062, 63935233, 59779838, 56024300, 52649620, 49978590, 47563365, 45168534, 42962595, 40496784, 38212619, 36178710, 34264414, 32417488, 30881185, 29493736, 28062975, 26541305, 25019027, 23881450, 23028275, 21909391]
20548B1909391r06661q47686q04964p97104o10089m79950p67483m72882k69458
20539A5953114k84984o01380l90211k41851l00741k61496j57078l27574j96749
20530A3191050m65907m76311k6335j44377k47050m33853j73853j22644p8422k38392
20520A0783906l55929m23880k78846j52473j30577j27596k80546o12287l87070
20511H034702k07596k15530j11247k63148l16333n12075l60513j32236K942j03040
20501E815926J4601j41168k09022k73909p0775j43476r9547m48Q2623j65513j69920
20490D639372k9047J17989j79755l97931l02103M4005K4431j97654k51065k84929
20480C183313M5200r304q6498L380K85029j17958j57772J2173l9829j38754k16435
$$ y = [21909391, 21002730, 20155044, 19350080, 18552976, 17942887, 17462937, 16695454, 16222572, 15953114, 15668130, 15066750, 14676539, 14434688, 14133947, 13872451, 13715373, 13387799, 13191050, 12725143, 12248832, 12222497, 12078120, 11831070, 11397217, 11223364, 11100720, 11022298, 10783906, 10427977, 10004097, 9725251, 9572778, 9442201, 9314605, 9034059, 8421772, 8034702, 7827106, 7611576, 7500329, 7237181, 6920848, 6408773, 6048260, 5916024, 5918966, 5815926, 5830527, 5689359, 5480337, 5206428, 5135653, 4992177, 4892630, 4892182, 4974805, 4809292, 4639372, 4610325, 4728314, 4548559, 4150628, 3848525, 3892530, 3916961, 3719307, 3468242, 3183313, 3228513, 3219209, 3132711, 3136091, 3421120, 3303162, 3145390, 3157563, 3117734, 2978980, 2762545]
20469B762545j02663j41426M0298R3950J50684j82139l96895r7512K85260k05885
20459B206217j51988J94588J11167j02510j81721N1710J03253j36289j21365j14841
20449A858221K58540M9898k56787n8667l930q6374m9717M2096l5582K42632J84909
20438B145239l5734k96637l09433q4259Q1311J03437p3254j12913O8163L16621
20428A802541k13867k23741j28958Q671Q8360R515k54859j36853j51179l11297
20418D88333j64376L4547j3007J71230j1846m6429J23826J08723R7701j20946
20408F67756j68958J84787j48365q4355l2565j48377L3416j92169J83316J18359
20398D12845J25354l276j24690K24408M7343j04761P1723J96646J56463j30263
$$ y = [2762545, 2659882, 2518456, 2558754, 2652704, 2803388, 2621249, 2224354, 2126842, 2412102, 2206217, 2054229, 2248817, 2359984, 2257474, 2075753, 2127463, 2230716, 2094427, 1973062, 1858221, 2116761, 2166659, 1909872, 1851205, 1847275, 1760901, 1711184, 1753280, 1717698, 1960330, 2145239, 2109505, 1812868, 1503435, 1419176, 1500487, 1603924, 1530670, 1417757, 1485920, 1802541, 1588674, 1364933, 1235975, 1244646, 1333006, 1342521, 1087662, 950809, 799630, 488333, 323957, 358504, 345497, 516727, 504881, 458452, 582278, 691001, 788702, 667756, 498798, 683585, 535220, 450865, 418300, 269923, 303339, 111170, 294486, 412845, 538199, 534923, 410233, 634641, 681984, 577223, 648946, 845592, 1002055, 871792]
20388H71792j2825l8914l39978j48047P0611K00225J88457j84729k03845P1655
20378D74402j51473O6568J19236J14764Q4000j89966O357j07854p5641Q1740J98846
20367F20979J75890p7688j14505j10053Q1828j1324k48751r666k8950N7132R3189
20356D28081P0988K681j06767k12249J20603J45534J20151J30717J07122k04617
20346F02244j27686m881J48769J550r3848M4659k94167J03117j7172J39275K59731
20335G61591j24966P1758J19582k05578K2843L02803M2610n987k83368r9180J47051
20324G49159J73093K00225L7171R5200k53024m2806q7320j33692k77494K991J54103
20313F17606M8533k4542q4411o2983M6456J99832p8917J30375j99046k21228r8066
$$ y = [871792, 858967, 820053, 480075, 332028, 402639, 602864, 791321, 606592, 402747, 474402, 322929, 389497, 508733, 623497, 707497, 517531, 523888, 416034, 340393, 422133, 620979, 796869, 719181, 604676, 494623, 576451, 565127, 316376, 306710, 277760, 334892, 428081, 499069, 501750, 394983, 182734, 303337, 448871, 569022, 699739, 806861, 602244, 474558, 469677, 618446, 619996, 526148, 570807, 276640, 379757, 362585, 501860, 761591, 636625, 708383, 827965, 622387, 645230, 948033, 990643, 984656, 701288, 602108, 749159, 922252, 1122477, 1159648, 1254848, 1001824, 959018, 871698, 738006, 460512, 463503, 617606, 666139, 641597, 557186, 494203, 540659, 740491, 661574, 791949, 592903, 371675, 273609]
20302B73609N2295K0990K8127J5769n245K4643j04663L8935J13022j47545k93587
20291A6350j13466J85255N3962j9112J61340O5166Q9459r1696j63515m3211N6274
20280A96806p6674q5601j19414O5688J20980J35501J16650K2277k8790J44260
20270D91683J09867j03698l2015K1511j9516J6288M9373J52664j02298q9185k8095
20259D66579o9200J56370J9445J5462r4167j03411k05187J32358q4528o1410L0787
20248B03098r6704r699L2762P915J06960o9613r182J38437J70526L8504j36977
20237C76027j09539q7806j87475q3888J57524J33918o7934J23312L4487q1795
20227B06831J04234m2531k37522r9109M4926K47461r211m5135K02606J59608l9954
$$ y = [273609, 325904, 346894, 375021, 390790, 385545, 410188, 305525, 344460, 457482, 309937, 16350, -97116, 88139, 142101, 122989, 284329, 349495, 438954, 347258, 183743, 140532, 196806, 120132, 34531, -84883, -19195, 101785, 237286, 353936, 376213, 347423, 491683, 601550, 497852, 465837, 487348, 467832, 484120, 533493, 686157, 583859, 494674, 466579, 397379, 553749, 573194, 588656, 494489, 391078, 185891, 318249, 233721, 172311, 203098, 106394, 96695, 129457, 137372, 244332, 174719, 165537, 303974, 474500, 513004, 376027, 266488, 178682, -8793, -92681, 64843, 198761, 130827, 254139, 288626, 206831, 311065, 268534, 31012, -68097, -23171, 224290, 215079, 169944, 372550, 532158, 492204]
20216D92204J0523j63562j77997m1999r1942J27132K5830j11955q0600L26512
20206C14146L01055k5166k42206j9597K30822m184j63362j10013J49985N6790
20196D88270K0023N3704J7024J33750p5487k30594k5400J65057j393k46978l1390
20185B66586J44848j75505j63097j9236K23707j6592J40534Q7056n9329m3041
20175C85931m8592J68753p0225J16972k37574q5184l06073K6249K1177j631J3473
20164a6724R0253J8955N5366J10413K1824j6246J98377M5862r7008J00577j342
20153E10307r2749j93389J01164o3429l8606L2246J58146K41411R7836k60520
20143D92417m07060k53294l2199J78804J95629J8039J78728k595j07007q9486
$$ y = [492204, 502727, 339165, 161168, 119169, 27227, 154359, 180189, 68234, -12366, 314146, 615201, 590035, 347829, 328232, 559054, 554870, 391508, 281495, 431480, 488270, 508293, 561997, 579021, 712771, 637284, 406690, 381290, 546347, 544954, 297976, 266586, 411434, 235929, 72832, 53596, 277303, 260711, 401245, 488301, 428972, 385931, 337339, 506092, 435867, 552839, 315265, 230081, -75992, -49743, -28566, -30197, -16724, 73529, 92484, 147850, 258263, 280087, 263841, 462218, 508080, 411072, 511649, 510307, 417558, 224169, 325333, 261904, 223298, 255544, 413690, 655101, 752937, 492417, 85357, -167937, -200136, -21332, 174297, 192336, 371064, 368469, 261462, 171976]
20133A71976N7432n2321m4623J37085J49440k36873k65344J22482o9592j37595
20123a67933j15873L28056J91411J73032J5272j73462K1170J35625O8074n3767
20113D21605r5963R2661j13338k9647j84953J17947L6529k31233j03802M1150
20103d9044j54951L1310P6958L60967K34768N0088K39540J09581k08879Q0666
20093G71004k19821k69103j4293J24178K70942j1907R8689K12626K60445M93377
20083A716137N56759K64219q4279j23189j98039n08652k21905j43016n9587j24095
20073A074353l6133j10738p2378j57866j02472j10188N6923K67133J23385j46590
20063G85429j0622j8276o1331M6094M7221r6693k58110p2678k3633m4856J33943
$$ y = [171976, 229408, 177087, 132464, 269549, 418989, 182116, -83228, 39254, -30338, -167933, -283806, 44250, 235661, 408693, 423965, 250503, 271673, 407298, 475372, 421605, 325642, 418303, 304965, 275318, 90365, 208312, 244841, 13608, -90194, -49044, -203995, -172685, -95727, 265240, 500008, 550096, 789636, 899217, 690338, 771004, 551183, 282080, 267787, 391965, 662907, 651000, 749689, 962315, 1222760, 1716137, 2272896, 2537115, 2452836, 2329647, 2131608, 1622956, 1401051, 1258035, 1198448, 1074353, 1038220, 927482, 855104, 697238, 594766, 484578, 541501, 808634, 932019, 785429, 774807, 756531, 695200, 741294, 788515, 691822, 433712, 361034, 337401, 292545, 426488]
20052D26488N2477m1757M6464n3291n235r5651k80418K79231K43069n854j093
20041E64430J41750r8771r7775k62176j48516J39726J58744J52831l9101m8444
20031D62698J37626K47250q1179k47966j63403j2577K6535j31422j00956J60994
20021B97600R0204J00462J76830n7586r7782j3596J8606J97694L2602R8336J06611
20010I49981j64853k01854j86173j23162O3818j65481Q3220J45744m0690p6032
20000B84518J47828K50815N353N9140j44931J00130k46991k57881J61583K47833
19990F07397J29406J4288j83517J15915l2359R1422K0048J16850J16034P795j41765
19979H61514p0629j25738L4911K61131J42023j7367m5482J16215L5424J22564
$$ y = [426488, 478965, 437208, 483672, 430381, 425146, 329495, 49077, 328308, 571377, 565523, 564430, 706180, 607409, 509634, 247458, 98942, 238668, 397412, 550243, 511142, 462698, 600324, 847574, 766395, 518429, 355026, 342449, 368984, 237562, 136606, 297600, 387804, 488266, 665096, 607510, 509728, 496132, 514738, 712432, 745034, 843370, 949981, 785128, 583274, 397101, 273939, 337757, 172276, 255496, 401240, 360550, 284518, 432346, 683161, 688514, 747654, 602723, 702853, 455862, 197981, 359564, 607397, 736803, 751091, 567574, 683489, 651130, 742552, 762600, 879450, 995484, 1003279, 861514, 790885, 665147, 700058, 961189, 1103212, 1085845, 1040363, 1156578, 1192002, 1314566]
19969A314566L7367J32080q6539k42645j80403R7810L13562L24793K91082o1060
19959A940613M2468P763N10410K45722J12439Q1608O1808M67640M44824L13078
19949D228373R23317P17296O72697P71920J180704J306902J685224J980087K331966
19940A5798486K142354J853218J508814J071162L75920l49156p82906j329528
19932B0288364k104827k360986k049169j598543j467133j327298j226710j250570
19924F903128p28359k69295m03587k06896k83191l13258k84555k33094k79919
19915C900974l51297o3055M3549j48148l37907m20211O0379K08936O15j01514
19905B792321j34311q2932Q0491L8047n9850M437J6219k03393k73863J04074P5166
$$ y = [1314566, 1351933, 1484013, 1397474, 1154829, 974426, 1072236, 1385798, 1710591, 2001673, 1940613, 1983081, 1990844, 2501254, 2746976, 2859415, 2941023, 3002831, 3470471, 3915295, 4228373, 5151690, 5868986, 6541683, 7313603, 8494307, 9801209, 11486433, 13466520, 15798486, 17940840, 19794058, 21302872, 22374034, 22749954, 22400798, 21617892, 20288364, 18183537, 15822551, 13773382, 12174839, 10707706, 9380408, 8153698, 6903128, 6174769, 5905474, 5501887, 5294991, 5011800, 4698542, 4413987, 4180893, 3900974, 3549677, 3486622, 3530171, 3382023, 3044116, 2623905, 2684284, 2893220, 2893835, 2792321, 2658010, 2575078, 2655569, 2693616, 2633766, 2638203, 2654422, 2451029, 2177166, 2281240, 2356406]
19894B356406M7104j53545j5868P8458j07361k6838k56692l30290L307J40240
19884A734921J0521o4551J72356n3695j44385r4816N1140O2847j44277j2345P0303
19873A588019K1483j43950j09362K68720K85196J5676R6950J54850k518k65371
19863A909693j38195l363Q2167r0683J12658l7132k63991O6285J14738O9068M19686
19852B240931P506r6329r7306J58161r785j20823J27992l174J04266N6350O5466
19841B433255O9454q1898j10107n9395J82512J42935L42911J9890J9219P6826
19831C035602j33946K84151M0985L2911Q0759O8269J86971j18952r0432o2006
19821C324312J49768L73496J41465P2798J30885K78313J29441J66044K68774M45258
$$ y = [2356406, 2403510, 2249965, 2234097, 2312555, 2205194, 2178356, 1921664, 1591374, 1594681, 1734921, 1745442, 1680891, 1853247, 1799552, 1655167, 1560351, 1611491, 1674338, 1530061, 1517716, 1588019, 1609502, 1465552, 1356190, 1624910, 1910106, 1925782, 2022732, 2177582, 2175064, 1909693, 1771498, 1768135, 1850302, 1759619, 1872277, 1835145, 1571154, 1637439, 1752177, 1821245, 2240931, 2248437, 2152108, 2054802, 2212963, 2203178, 2082355, 2210347, 2207173, 2311439, 2367789, 2433255, 2502709, 2420811, 2310704, 2251309, 2433821, 2576756, 2919667, 2939557, 2958776, 3035602, 2901656, 3185807, 3226792, 3259703, 3340462, 3408731, 3595702, 3476750, 3386318, 3324312, 3474080, 3847576, 3989041, 4061839, 4192724, 4471037, 4600478, 4766522, 5035296, 5480554]
19811E480554P9778J07000K80799K33607L11418J20663J05455J86117J97347K65531
19801G368269M83224M05585J18008L82356K48938L99234N71254Q05955P89552
19792A1572375R70704J412200J522493J435438J852176K162438K439374K845728
19784B6212926L628513M503945N855388O828295Q597467J0719143J3347347J5965913
19776I5658937J7507910J7503408J6317736J3579218Q910471L354796n79055l296773
19768A68956648p336189j2990144j6099777j5543512j3477067j1780176j0488929
19761H1240854r234005p862798o560460n275253m404472l697700l062715k798159
19753C8345292k407194k019332j635044j454977j318357j208217j197554j048219
$$ y = [5480554, 5560332, 5667332, 5948131, 6181738, 6493156, 6613819, 6719274, 6905391, 7102738, 7368269, 7851493, 8257078, 8375086, 8757442, 9006380, 9405614, 9976868, 10782823, 11572375, 12543079, 13955279, 15477772, 16913210, 18765386, 20927824, 23367198, 26212926, 29841439, 34345384, 40200772, 47029067, 55626534, 66345677, 79693024, 95658937, 113166847, 130670255, 146987991, 160567209, 169477680, 172832476, 172253421, 168956648, 161620459, 148630315, 132530538, 116987026, 103509959, 91729783, 81240854, 72006849, 64144051, 57583591, 52308338, 47903866, 44206166, 41143451, 38345292, 35938098, 33918766, 32283722, 30828745, 29510388, 28302171, 27104617, 26056398]
19745B6056398p95262q57179p34328n93875m52590o68179k42937J02409J08198
19736B1922655J71510Q0084J37578K60031L74945M89888R12176J070861J518182
19727B6937910J679280J848145K566300L123149L602382M827973N865507P478988
19719E7929634R562472J1874150J4960933J7843020J9248868J8789586J7218107
19712A67426770J4427249Q994128L295960p89045m074694q664733j4449955j7872885
19704A48292795j7837448j5472093j3386080j1694802j0325612q600379p334177
19697F3642204o002648n182263m575162l585596l059278l052282k798731k249856
19689C3136388k128136j722473j574159j636204j428226j213888q22015q63907
$$ y = [26056398, 25261136, 24403957, 23669629, 23075754, 22623164, 21954985, 21712048, 21814457, 21922655, 22094165, 22174249, 22311827, 22571858, 22946803, 23436691, 24348867, 25419728, 26937910, 28617190, 30465335, 33031635, 36154784, 39757166, 44585139, 50450646, 57929634, 67492106, 79366256, 94327189, 112170209, 131419077, 150208663, 167426770, 181854019, 190848147, 194144107, 193355062, 189280368, 180615635, 166165680, 148292795, 130455347, 114983254, 101597174, 89902372, 79576760, 70976381, 63642204, 57639556, 52457293, 47882131, 44296535, 41237257, 38184975, 35386244, 33136388, 31008252, 29285779, 27711620, 26075416, 24647190, 23433302, 22611287, 21747380]
19681B1747380q29876j061340r21249p10558l84301j78603l38528r84134r08767
19672A5430024p50363l79652n65319m63529n39427l93650l02010j69896k44273
19663A1621905m27582l59205j33714j72726m11060k43250j37739l14057k32109
19654I190463n3154l90671m21923k87405j89283K0007k28604j02076l45037m40348
19644F751969j46504r2410j74584r8490R859k34668K862k96153k85207m1697K8859
19633E423836j15360k75977j1922P8861l05105l80176k92792j99329k16846P0576
19623C775766Q5176q6567p2722p1927l34735r5826K1943o7492R088j4600K0112
19612C168216l9323L6298j59801P984j22158r3580n2720o7452m5327p852k55635
$$ y = [21747380, 20917504, 19856164, 18934915, 18224357, 17840056, 17661453, 17322925, 16338791, 15430024, 14679661, 14300009, 13734690, 13271161, 12731734, 12338084, 12036074, 11866178, 11621905, 11194323, 10835118, 10701404, 10528678, 10117618, 9874368, 9736629, 9422572, 9190463, 9137309, 8746638, 8324715, 8037310, 7848027, 7868034, 7639430, 7537354, 7192317, 6751969, 6605465, 6513055, 6338471, 6239981, 6249840, 6015172, 6018034, 5721881, 5436674, 5394977, 5423836, 5308476, 5032499, 5020577, 5099438, 4794333, 4414157, 4121365, 3922036, 3705190, 3775766, 3860942, 3774375, 3701653, 3629726, 3294991, 3199165, 3221108, 3153616, 3162704, 3148104, 3168216, 3128893, 3165191, 3005390, 3013374, 2891216, 2797636, 2744916, 2677464, 2632137, 2624285, 2368650]
19601B368650j19812k1001J69211j30378l92236j10206K86743J1230O3157k23742
19591A901616l9176r0764m20978p519K69832j40676k03754K3313r8779N055j01647
19580A096523M5021K9115P0774Q9589K9778j34474l4201J2859o4313J67223N2245
19569A360139N8065j35235j36283J48134J14164j18874k04413r8241k7164J48491
19559A108783p5190l1035J13300P1790k57157r4568K3685J01315j79090J40700
19549I22533K14348O3435k19467q9588Q3756p3715r6381j14802j75772j49869
19539C64478J51415N4197j17927l7859J30657K45905J9628k21207j78320L9828
19529D50795P5500P825p67n7305L28576j30341l97296l9639K45316J78178J46784
$$ y = [2368650, 2248838, 2227837, 2397048, 2266670, 1874434, 1764228, 2050971, 2062201, 2125358, 1901616, 1862440, 1771676, 1350698, 1343179, 1613011, 1472335, 1268581, 1291894, 1193115, 1198170, 1096523, 1141544, 1170659, 1241433, 1331022, 1360800, 1226326, 1192125, 1204984, 1140671, 1307894, 1360139, 1418204, 1282969, 1146686, 1294820, 1408984, 1290110, 1085697, 987456, 960292, 1108783, 1033593, 1002558, 1115858, 1187648, 930491, 835923, 859608, 960923, 781833, 922533, 1136881, 1200316, 980849, 891261, 975017, 901302, 804921, 690119, 514347, 364478, 515893, 570090, 452163, 414304, 544961, 790866, 810494, 589287, 410967, 450795, 526295, 534120, 533353, 476048, 804624, 674283, 276987, 237348, 482664, 660842, 807626]
19518H07626k72924l70464j13375Q3182P9131J00846K74187K3862m7650k7913
19508E36508Q058K45997n6915n4932J1974l5738j03275j19416M4581j27375r5443
19497B54024m3628j03016J29166M6359k11239L00546R3177Q8486j65740k60183
19487A27952o43497n6996L20681j17630Q1510K3145j69724K27359R5506r3963
19477b05657J24212J18970Q5531j64609J34082P9097j93959j09395K00819J14963
19467A84054j38915j62832R0541Q8375Q5981J18376N7453q4028L2935P8380R692
19456C60012J50630k50979k75748J12069Q008j09714J11053J80447Q0611n7543
19446C08846k75286K63169J69407k38569O7314J03627j22346j32515l60982q6763
$$ y = [807626, 534702, 164238, 50863, 134045, 213176, 314022, 588209, 612071, 564421, 536508, 544566, 790563, 733648, 678716, 690690, 654952, 551677, 432261, 476842, 349467, 254024, 210396, 107380, 236546, 282905, 71666, 372212, 465389, 553875, 388135, 127952, -515545, -572541, -251860, -369490, -287980, -264835, -434559, -207200, -111694, -205657, -81445, 37525, 123056, -41553, 92529, 171626, -22333, -131728, 69091, 184054, 45139, -117693, -27152, 61223, 147204, 265580, 323033, 239005, 271940, 350320, 360012, 510642, 259663, -16085, 95984, 103992, -5722, 105331, 285778, 366389, 308846, 33560, 296729, 466136, 227567, 294881, 398508, 276162, 143647, -217335, -304098]
19436c04098J62558o5728L1505L9158k0023j0851N4000R1491p2447j2897o1312
19425a68644l2257K58145Q5469j02508P2196m04696j39241n1339K33230L82305
19415A32660J83677j5748N1899n0858n1978J08137J58794j25694Q0555o8549J5310
19404D18205J21201j56519n6487R293k07092r4326O1931K61370K01415Q640n8246
19393E09385R4694K24839L17590K3193k22928j65522n2240M0901j02818k31222
19383D35872O0294r8860j55248N1902L04124M621l24378k74758k27994L82800
19373A58375L01548J33644p663N6310L34224j45326k82631r5076O3129N3274j63479
19362D06329j58584j24805J50819p371n6079R1956J4156l6005k57420l3024n6239
$$ y = [-304098, -141540, -207268, -175763, -136605, -156628, -167479, -113479, -21988, -94435, -107332, -168644, -200901, 57244, 142713, 40205, 112401, -292295, -431536, -482875, -249645, 132660, 316337, 300589, 352488, 301630, 249652, 357789, 516583, 390889, 471444, 402895, 418205, 539406, 382887, 326400, 335693, 128601, 34275, 96206, 357576, 558991, 567631, 509385, 604079, 828918, 1146508, 1169701, 946773, 781251, 729011, 769912, 667094, 435872, 496166, 397306, 242058, 293960, 598084, 602705, 278327, 3569, -224425, 158375, 459923, 593567, 585904, 642214, 976438, 831112, 548481, 453405, 516534, 569808, 406329, 247745, 122940, 273759, 266388, 210309, 302265, 316421, 280416, 22996, -10028, -66267]
19351f6267L27441M7127j39025J18483L1866k6125p4247j91802O6428O0918K11037
19340C65834K56688j02683k40562J55814K80408P7469J97101N16456L65183J62439
19330B034147R5319L34291L20889L24958L23786M29370K19458M22553O58723O31342
19320E794836Q81045J018395P63730N93615N53810L82386p6903l87531j63887
19311I359496n57266r61023j055684p81863m03288m29911l94014o87850l77145
19302C711452m45332m55566k71140k49416j41683k33254O3922M8069j73370j05668
19292A748014k21727j21422J9070p7409l76798K3387K74324j37223j83982K28946
19282A175180j55664j44293r3177q547j6403J21943M21182J24466m5395r7557
$$ y = [-66267, 261174, 308301, 169276, 287759, 319625, 293500, 219253, 27451, 93879, 154797, 365834, 622522, 519839, 279277, 435091, 715499, 792968, 990069, 1506525, 1871708, 2034147, 2129466, 2463757, 2784646, 3109604, 3433390, 3862760, 4082218, 4504771, 5163494, 5794836, 6675881, 7694276, 8458006, 9051621, 9605431, 9987817, 9910914, 9523383, 9359496, 8802230, 7841207, 6785523, 6003660, 5600372, 5170461, 4776447, 4088597, 3711452, 3266120, 2810554, 2539414, 2289998, 2148315, 1915061, 1978983, 2027052, 1853682, 1748014, 1526287, 1404865, 1423935, 1346526, 969728, 993115, 1267439, 1130216, 946234, 1175180, 1019516, 875223, 782046, 773499, 757096, 879039, 1300221, 1424687, 1379292, 1281735]
19272A281735L2360K54251L2579J52234p2431L37823L12343M39970K62611K81869
19262C315344N37639N68958O75330J023343P66757R54430J037797Q42459O04442
19253A0326499L49437J1670n03140l74463p37335r34371r00860r48985n72146
19244E716306n61429p86537l91748m81534m01814l00994k03191j35840o5915k43494
19234B143810k23699k39181n5074j55301K7692K6862K01284l0905n6933q9731
19224A548824J29260J18313k04673l9922j72930m9904L1645k1935J33626K71423
19214A743727l1510j48397k49654K6852j64133n0369o2162K175Q8980L4678k20426
19203I69761r6848j13648j32880k7621P925L135k440J66261K2883j10611j71777
$$ y = [1281735, 1314095, 1568346, 1600925, 1753159, 1680728, 2018551, 2330894, 2770864, 3033475, 3315344, 3852983, 4421941, 5097271, 6120614, 6887371, 7841801, 8879598, 9722057, 10326499, 10675936, 10687606, 10184466, 9810003, 9072668, 8138297, 7237437, 6288452, 5716306, 5154877, 4368340, 3976592, 3495058, 3093244, 2792250, 2589059, 2453219, 2387304, 2143810, 1920111, 1680930, 1625856, 1470555, 1498247, 1525109, 1726393, 1695488, 1638555, 1548824, 1678084, 1796397, 1591724, 1551802, 1378872, 1328968, 1360613, 1338678, 1472304, 1743727, 1712217, 1563820, 1314166, 1341018, 1176885, 1126516, 1064354, 1066529, 1155509, 1190187, 969761, 872913, 759265, 626385, 598764, 606689, 609824, 607384, 773645, 796528, 685917, 514140]
19192E14140l69159r8203L2734K09575j0312R2836M1531j20669j30337k25339
19182f3203j72316R0964K48541O8231j95385R2326q932k19582J14733L61106j72104
19171A44379J88283O6806j08871l1756J18178R6650o7647j3142K52493q6492J23959
19160F82840Q4595R2750O8513L57151m8222r5680k0960p2980j8526j19442P1121
19149I81160K64948l1030j32252k75180j44498j25265P1361m7619n04917N5552
19139A12260J01292R0741J81468M5658j9481j04038q2676j23738o2783j10198
19129B8505n4844N6561j09530j19347N162J67990M8436n2480K0337J11552J50200
19118B52542k03212l25928J46500J95268K9299j42379j34202l4138k0070P5620
$$ y = [514140, 144981, 46778, 79512, 289087, 278775, 371611, 413142, 292473, 162136, -63203, -235519, -144555, 103986, 172217, -23168, 69158, 60226, -159356, -44623, 316483, 144379, 332662, 399468, 290597, 258841, 377019, 473669, 406022, 392880, 645373, 558881, 682840, 767435, 860185, 928698, 1285849, 1237627, 1141947, 1120987, 1048007, 1029481, 910039, 981160, 1246108, 1215078, 1082826, 807646, 663148, 537883, 609244, 561625, 56708, 112260, 213552, 304293, 485761, 531419, 511938, 407900, 325224, 201486, 138703, 28505, -26339, 30222, -79308, -198655, -193493, -25503, 22933, -29547, -9210, 102342, 252542, 49330, -276598, -130098, 65170, 94469, -47910, -182112, -216250, -236320, -160700]
19108a60700K55144J29342n3183j10274m9206P3690N5966k9147N0464j12415k02687
19097a53006R7862Q3661J68165M5424J20672j18949l7581J4769Q7190K10952j46412
19086C72747k32891N582M0976O4148j22052j98013L86582J60858j31339n9764
19076B86834k22787J58351k7173j97039j063J24274P423k60952j87674n1919J51075
19065b20650L64744J61051k11890M9269P1448K3715L3479Q279j214R7846J03066
19054D79143L37057J65951J87049j0590J10072k16890k53544O4782r341r1406
19044G62283l59770j98226N250j8844J95281K13931k08730m51756k6049j70385
19034b57015J36716N3173P8737K3526j02767k72686J24629L5614L6193J13821
$$ y = [-160700, 94444, 223786, 170603, 60329, 11123, 84813, 140779, 111632, 162096, 49681, -153006, -55144, 28517, 196682, 242106, 362778, 243829, 206248, 221017, 308207, 519159, 372747, 139856, 145438, 186414, 250562, 128510, -69503, 317079, 477937, 346598, 286834, 64047, 222398, 195225, -1814, -2877, 121397, 128820, -132132, -319806, -371725, -220650, 144094, 305145, 93255, 142524, 213972, 237687, 271166, 279445, 278231, 376077, 479143, 816200, 982151, 1169200, 1158610, 1268682, 1051792, 798248, 863030, 853689, 762283, 402513, 204287, 209537, 190693, 385974, 599905, 391175, -60581, -86630, -257015, -120299, -67126, 11611, 35137, -67630, -340316, -215687, -180073, -143880, -30059]
19024c0059r7562o3783J60280J80766j9393P4018J66892J96490k82469k74818
19014A0362j60181J3370L9521j2533j4577l8931R1283n0162N8384J50438k8694
19003E8280k26704R6329J0979J87436K45401K45764K36535j39427n8558K45984
18993I02019M6910J55996J54565j44059j91807j3244N3542k69313k92845q8837
18983C12927o9364k03260j10761K6902L787P3559l982p429k8130k26182k03755
18972d35688K46398J11444K2252K47627K41791J46468k48976k31269r6254n1860
18962d8067j72533J4556L3812p0477J04204K03672J50800k9813o0233J00992j46496
18951H0417k0584k7554J00585n9483j16556k84319p0318N2748j0014K58406J38532
$$ y = [-30059, -127621, -191404, -31124, 149642, 130249, 204267, 371159, 567649, 285180, 10362, -149819, -136449, -96928, -109461, -124038, -162969, -71686, -121848, -63464, 86974, 58280, -168424, -72095, -61116, 126320, 371721, 617485, 854020, 714593, 656035, 902019, 948929, 1104925, 1259490, 1115431, 923624, 910380, 963922, 694609, 401764, 312927, 243563, 40303, -70458, -43556, -39769, 33790, 29808, 22379, -5751, -231933, -435688, -189290, -77846, -55594, 192033, 433824, 580292, 331316, 100047, 3793, -48067, -220600, -206044, -172232, -242709, -138505, 65167, 215967, 186154, 125921, 226913, 80417, 59833, 32279, 132864, 73381, -43175, -327494, -397812, -345064, -355078, -96672, 41860]
18940D1860m1326L1998R1557Q5239k12087j51272J40112p0623k02077J94287J09650
18929A7318j03228j567M402Q690p5869q2860R8689M0341R5721J99331J59175J23516
18917D83659L3254n1510j68215j75419j29755J50577O3089m4359K52068n0518
18907C62871k03160k68110J89494J7281J70644j40531N5352J18378o5576N2416
18897B89059j21787j25396m8134L7873L2833O1721q2257J17259L10136J92285
18887F63592q9294j42977j3427q7639j58631l18933l0440K41599J15093j12001
18877F6942q7462k13589L961J30933M3442K6710j2433Q8042M2437l4940n3414
18866F29P7363r768q3991J03323N2783J27175J09747J55813j71881k20685k39211
$$ y = [41860, 534, 32532, 124089, 209328, -2759, -154031, -13919, -84542, -286619, -92332, 17318, -85910, -87477, -83075, -74385, -150254, -233114, -134425, -94084, 1637, 200968, 360143, 483659, 516913, 465403, 297188, 121769, -7986, 142591, 205680, 161321, 413389, 362871, 159711, -108399, 81095, 98376, 269020, 128489, 183841, 302219, 236643, 289059, 167272, 41876, -6258, 31615, 64448, 126169, 43912, 161171, 471307, 663592, 574298, 431321, 417894, 330255, 171624, -147309, -177749, 63850, 178943, 66942, -20520, -234109, -230148, -99215, -55773, -29063, -41496, 46546, 88983, 54043, 629, 77992, 68224, -15767, 87556, 140339, 267514, 377261, 533074, 361193, 140508, -98703]
18855i8703j9947J11079L54385K53781l03641k83159R9173J58806K71963r2896
18845D50841j43045k4216j04602l20638j60329J56799J98628r0900N8183P0964
18835I1685J24027J59893j88699k17176J98595O5620j48429q5097J70701Q3505
18825B54625P1206Q1760o9117O6576j20720j48706P4611J69899j4812l34401k09244
18814a78323j047O3244N9276l2421N6555J58008J61272k8286j54324l4029j56658
18803h6733O117J87405j23479j37730K20377K35344M4936p2354J18680J03952
18793D96515j55193j25521j7933j52346n4251M9860J0843o9708l5708O347J7603
18782b9492N7725K27229J05649p1700k11905k4676o0658o2940L10057J34322N0217
$$ y = [-98703, -118650, -7571, 346814, 600595, 296954, 13795, 112968, 271774, 543737, 450841, 307796, 283580, 178978, -141660, -301989, -145190, 53438, -37462, 20721, 91685, 215712, 375605, 186906, -30270, 168325, 233945, 85516, 419, 171120, 254625, 325831, 407591, 338474, 405050, 284330, 135624, 210235, 380134, 365322, 30921, -178323, -179370, -116126, -56850, -89271, -32716, 125292, 286564, 258278, 103954, 69925, -86733, -80616, 106789, -16690, -154420, 65957, 301301, 346237, 273883, 392563, 496515, 341322, 215801, 197868, 45522, -8729, 41131, 51974, -17734, -53442, -47095, -29492, 28233, 255462, 361111, 289411, 77506, 52830, -7828, -70768, 239289, 373611, 423828]
18771D23828j27027k65307J87294l5334n4462j31577l0935J28230J6385J68538
18761B79633P8998o444N3193j59113p1567M3159J89858P7836L7032P765J12393
18750F42743k3301O1015l0948l06467Q6r6299O5989M487k2692n9274l10742N5014
18738b0389J82462J05572J47501j17872O575R6400m3015m3400j29102k97609J43843
18727C0966K61332J38954j03735j43518p42r0177N2024R1843n9116j46043N2090
18716H3878Q8538j97314l3361J92896P5100L3624k0851m1526j14367k64777k22262
18705d20422K37043K53099M9155K4993j20496M9971j68922J67469L77848P9750
18695E29488j67963O4543J6911j8541j72974J40169J47914j17879M2618R0287
$$ y = [423828, 296801, 31494, 218788, 183454, 128992, -2585, -33520, 94710, 111095, 279633, 358631, 352187, 405380, 246267, 174700, 217859, 407717, 485553, 522585, 530350, 642743, 619442, 680457, 649509, 343042, 343128, 246829, 312818, 317305, 294613, 235339, -75403, -20389, 162073, 267645, 415146, 297274, 303849, 400249, 357234, 313834, 184732, -112877, 30966, 292298, 431252, 327517, 183999, 183257, 93080, 145104, 236947, 177831, 31788, 83878, 172416, -24898, -58259, 134637, 209737, 243361, 222510, 180984, 66617, -198160, -420422, -183379, 69720, 118875, 143868, 23372, 73343, -95579, 71890, 449738, 529488, 361525, 426068, 442979, 424438, 251464, 391633, 539547, 421668, 464286, 554573]
18685E54573j62633j75707j25345K33862K07158M1777q0623R0552P8962j76667
18675D85909k44573q5214J68347J20605k23249o4133P9501J58700j19306r79J97866
18664D73474j79480j02610L778K34998j3253Q6842q3165j64189j22294j36907
18654b806k799j8022j62777L66620L06467k0788J4626j29426l6952L4043J23181
18643D71367N897j17051j9171P1422o9002J26258L6664l21520J07390Q2660l8773
18632C36141M041j8348J54140j0319K4388k7672M244J9426K14778j05754K1227
18621F16292P8294k41038N3185L39820J63455l738J90015j33724p5010R6024o3161
18610A020414j31287k89304j9492L47713L72395J93086j38158l69388k00029K06452
$$ y = [554573, 391940, 216233, 90888, 324750, 531908, 573685, 493062, 583614, 662576, 485909, 241336, 156122, 324469, 445074, 221825, 157692, 237193, 395893, 276587, 275608, 473474, 293994, 191384, 195162, 430160, 416907, 503749, 420584, 256395, 134101, -2806, -5605, -23627, -186404, 180216, 486683, 465895, 480521, 351095, 314143, 348186, 471367, 477264, 360213, 341042, 412464, 343462, 469720, 506384, 184864, 292254, 374914, 336141, 340182, 321834, 475974, 465655, 490043, 462371, 466615, 486041, 700819, 595065, 616292, 694586, 453548, 506733, 846553, 1010008, 1006270, 1196285, 1062561, 987551, 1083575, 1020414, 889127, 599823, 580331, 928044, 1300439, 1493525, 1355367, 985979, 785950, 992402]
18600I92402J67180L2987R8118L8641R0180o1762n7263j06208J30715K69564j04436
18589A490118k20776l04906j51964Q4L2283L4382n2093j28699J37536L2663r7151
18578G71477N904O6106l3408q4380Q0906J64864K8082J2925J38896j03004J09977
18567A158345K07981Q5860L709J79422k1973k29471P1400O7509L32878O3712k2434
18556A896938K48233J69225K6097l1262P5946n2631k08134R7302O5383J45214
18546B432311m3936k01613J9776J04529n6626R3051J61500L3334q7702p1504J22242
18535B505362J12952J20851L54570J67703L87145J95096L29991L19249L8280J0165
18525D541364J43381K26561K90645J74269N91130L99211L96712L03686L49260
$$ y = [992402, 1159582, 1192569, 1290687, 1329328, 1419508, 1357746, 1300483, 1194275, 1324990, 1594554, 1490118, 1269342, 964436, 812472, 812556, 844839, 879221, 827128, 698429, 835965, 868628, 771477, 777381, 843487, 810079, 725699, 806605, 971469, 999551, 1012476, 1151372, 1048368, 1158345, 1366326, 1452186, 1455895, 1635317, 1613344, 1383873, 1455273, 1522782, 1855660, 1919372, 1896938, 2145171, 2314396, 2340493, 2309231, 2385177, 2332546, 2124412, 2221714, 2287097, 2432311, 2388375, 2186762, 2206538, 2311067, 2254441, 2347492, 2508992, 2542326, 2454624, 2383120, 2505362, 2618314, 2739165, 3093735, 3261438, 3648583, 3843679, 4173670, 4492919, 4531199, 4541364, 4684745, 4911306, 5201951, 5376220, 5967350, 6366561, 6763273, 7066959, 7416219]
18516G416219M94132K77346J34734O43098N18968N14012N77064R21394J026580
18507A2523547J292326J533791J789109K112838K444377L044466L644339M603799
18499C2988592N706392P467187R796404J3107424J7621227K3798978L0737108
18492A41223312L5780780L3977555K6148267J6303688p84388k2243261l1722728
18485A98683225k8137503k2250822j9655369j8729077j6416345j3075042j0032178
18478G0386889p929357o163940m978089m149900l752865l289515k806427k324432
18470C4992364j832885j755370j642266j379322r50131r98991j029287o98740
18462B4705372o99837p08863n48996m10094l18544j93390m23911m62100m32443
$$ y = [7416219, 7910351, 8187697, 8322431, 8965529, 9484497, 9998509, 10575573, 11496967, 12523547, 13815873, 15349664, 17138773, 19251611, 21695988, 24740454, 28384793, 32988592, 38694984, 46162171, 55958575, 69065999, 86687226, 110486204, 141223312, 177004092, 210981647, 237129914, 253433602, 252649214, 230405953, 198683225, 170545722, 148294900, 128639531, 109910454, 93494109, 80419067, 70386889, 62457532, 56293592, 51315503, 47165603, 43412738, 40123223, 37316796, 34992364, 33159479, 31404109, 29761843, 28382521, 27432390, 26433399, 25404112, 24705372, 24005535, 23296672, 22747676, 22337582, 22019038, 21825648, 21401737, 20939637, 20507194]
18453B0507194m19490l39226j40074j18706M44728L13492M64782J028745R43341
18444B2684786J124906J423730J968417K646021L381683M397446N007748O548087
18436D9182824Q709813J1805886J6238326K1847323K8473155L2662919L0418240
18429A99338486K3161482J4002795k182952k1948235k9640780k5290931j9966875
18422A37472990j7974359j7376878j5084260j1732083r279915p042696n704376
18415E3278423m901717m110086l550693l008403k610961k388755k148358j559926
18407B8999524j352053j395088j304855j112224j324388r77418p70316q11421
18399A9951761p97310q86717p53752q63421q22957p41017n71329o27767n20568
$$ y = [20507194, 20087704, 19748478, 19608404, 19489698, 19934426, 20247918, 20712700, 21741445, 22684786, 23809692, 25233422, 27201839, 29847860, 33229543, 37626989, 42634737, 49182824, 57892637, 69698523, 85936849, 107784172, 136257327, 168920246, 199338486, 222499968, 236502763, 234319811, 212371576, 182730796, 157439865, 137472990, 119498631, 102121753, 87037493, 75305410, 66025495, 58982799, 53278423, 48376706, 44266620, 40715927, 37707524, 35096563, 32707808, 30559450, 28999524, 27647471, 26252383, 24947528, 23835304, 22510916, 21533498, 20763182, 19951761, 19154451, 18267734, 17513982, 16650561, 15827604, 15086587, 14515258, 13887491, 13366923]
18390A3366923l95624n35216n56928m41993m29740k87838l06833k05625j85378
18381A0021748l39120l85813j35444J02107p4771j39879k90894p9875r2260k03313
18371H382486m16882l98636k18461j17758l41872j13367k65029j51458k4098q1554
18361F253371j85199K9903q0624k45212k17533L1015o9196O3632n0076l19391
18351E210690k91338k35217j16642j16246k32767k58909O2774J31282K6493j15705
18341D064415l96994o5337j25642j72763m8503J79021j21324k4520m1457Q8113
18331C335009k64237j50399l40500k06460o8259j59731P8016j38168n1200J60583
18321B194654o651l5327J40654J04068J97785q1116k85512k7527L0895J55895
$$ y = [13366923, 12971299, 12436083, 11879155, 11437162, 11007422, 10719584, 10412751, 10207126, 10021748, 9682628, 9296815, 9161371, 9263478, 9188707, 9048828, 8757934, 8678059, 8585799, 8382486, 7965604, 7566968, 7348507, 7230749, 6888877, 6775510, 6510481, 6359023, 6334925, 6253371, 6068172, 6098075, 6017451, 5772239, 5554706, 5585721, 5516525, 5580157, 5530081, 5210690, 4919352, 4684135, 4567493, 4451247, 4218480, 3959571, 4022345, 4153627, 4180120, 4064415, 3667421, 3602084, 3476442, 3303679, 3255176, 3434197, 3312873, 3288353, 3246896, 3335009, 3070772, 2920373, 2579873, 2373413, 2305154, 2145423, 2223439, 2085271, 2034071, 2194654, 2188003, 2152676, 2293330, 2397398, 2595183, 2514067, 2228555, 2201028, 2231923, 2387818]
18311B387818r6473k3265m8432p5845j39410j71720q2010r296J58284k48029l01328
18300A350294Q6453n6604n4794L0187N1266m2993n0744o3898m9255J96571K86161
18289A682644J7013l20197k21422q6074J84851R9823J18111j00938j36146m7166
18279A190499j8695M2518o2272k43694k59866j24467k22813P6230M71374K61362
18269A110176k3965q3012J11379L69574l32952m51326j41286L07000R3866j97609
18259G61845j51227l3995J59327j17830J12638j02469j23739N8944J28099K36867
18249I28460j39335k15417P7067L2801K5870k72232j98088K7860M8818J59572
18239D75376J51034J19955p769O7953j82252l05598j663n2278N4374P7089p6776
$$ y = [2387818, 2291345, 2268080, 2219648, 2143803, 2004393, 1832673, 1750663, 1741367, 1899651, 1651622, 1350294, 1436747, 1380143, 1325349, 1355536, 1406802, 1363809, 1313065, 1249167, 1199912, 1396483, 1682644, 1699657, 1379460, 1158038, 1071964, 1256815, 1356638, 1474749, 1373811, 1237665, 1190499, 1171804, 1214322, 1152050, 908356, 648490, 524023, 301210, 377440, 848814, 1110176, 1086211, 1003199, 1114578, 1484152, 1151200, 699874, 558588, 865588, 959454, 761845, 610618, 576623, 735950, 618120, 730758, 628289, 504550, 563494, 691593, 928460, 789125, 573708, 650775, 683576, 709446, 437214, 239126, 266986, 315804, 475376, 626410, 746365, 738596, 806549, 624297, 318699, 317036, 264758, 319132, 396221, 319445]
18228C19445j45102L50697J17242k82265Q1763L5473k13210j77993M7931K23211
18218C57192J22580j8674O6065j33984k7335j128l35406j23109R7034K77452K57202
18207E37889P0811m495q4737j50654k42824Q207R63q5025N386J94664J1996L676
18195B65857j549J6885k07453m2118m6761j33384L838P021J49218J44528J44818
18184C00900Q2142J09406l7016R0907p3756l31753k00669K8947P6762p2794k3920
18173e0844J6526N4830J39580q1474j9748R461Q5065O527p7477l7144j42608l6620
18161a33926K03104P9748P0698M2794n9193J33841j24681m4683R5249j57931o3239
18150D1781o1400j16053q9291l0916P0776R7289J38388q101Q1287J52511M206
$$ y = [319445, 174343, 525040, 642282, 360017, 441780, 477253, 264043, 86050, 133981, 357192, 479772, 461098, 527163, 393179, 365844, 364716, 29310, -93799, 3235, 280687, 537889, 608700, 604205, 519468, 368814, 125990, 134197, 135160, 50135, 55521, 250185, 262181, 265857, 264308, 281193, 73740, 31622, -15139, -148523, -144685, -137664, 11554, 156082, 300900, 383042, 492448, 455432, 546339, 472583, 140830, -59839, -30892, 45870, -26924, -50844, -34318, 20512, 160092, 78618, 58870, 68331, 153396, 159923, 82446, 45302, -97306, -133926, 69178, 148926, 219624, 262418, 203225, 337066, 212385, 167702, 262951, 105020, 41781, -19619, -135672, -224963, -255879, -185103, -87814, 50574, 42473, 123760, 276271, 280477]
18139B80477k12768j12641n2275q9155K41940J4736k5936p7838m2935J77852o2291
18128C9166k72767j65779J27627O9565P9326j45197j18042j61262J4941J1252
18118e21170J89330J25014J41286P6686J40257j03932j76727j31539J03972K29032
18108G2209j18009k20774Q9154J40560J38640j83945j05683L4814j9473r5767
18098b68274r2872N2792J44819K2532N4914n4537n6366L3763P8842Q2403J65074
18087A63090p4416r4260k40161l16353J14855K33521J88440K66648o9228k26808
18077e4672k07452j437J10583L9747M3930J84770K27592O1162k17097k42388j6352
18066g1614j17813K47Q4932J6479j14799K3509k17411K02914Q9730l18077r7311
$$ y = [280477, 67709, -44932, -97207, -186362, 55578, 70314, 44378, -33460, -76395, 101457, 39166, -233601, -399380, -271753, -202188, -122862, -268059, -386101, -547363, -532422, -521170, -331840, -206826, -65540, 11146, 151403, 47471, -129256, -260795, -156823, 72209, -45800, -266574, -177420, -36860, 101780, -82165, -187848, -153034, -172507, -268274, -361146, -308354, -163535, -141003, -86089, -140626, -196992, -163229, -84387, -1984, 163090, 88674, -5586, -245747, -562100, -447245, -213724, -25284, 241364, 172136, -54672, -262124, -263561, -152978, -113231, -69301, 115469, 343061, 404223, 187126, -55262, -71614, -189427, -189180, -104248, -87769, -202568, -179059, -396470, -193556, -103826, -421903, -519214]
18055e19214L06923K05919j85560m19602m7952K19711J04870J37411K7502J03972
18045f6020N1305j68871J03693M1068j06278J97017L19316J9630k55013l79707
18035b43860k04543J16128J40178o0349K75197P0323j34011K52720N3804j31149
18025A34438k39287o0168J05154o0838j55156L8316J00208l5343J34210n3305
18015i1771j11101l8271Q7136l8479j48906K7757L02138J81335k42279j29919
18005b02360m7380n782k01903l59050m9016J67181K28594m0451K2827k7142j38392
17994f52874J35973J03845J83620m894q3728J18521K3374j90803k5611J68265
17984b24312j4796M1199r8240Q1617M9558J63336L04228p7902j82871l7031j38657
$$ y = [-519214, -212291, -6372, -191932, -611534, -659486, -439775, -334905, -197494, -169992, -66020, -14715, -183586, -79893, -38825, -145103, 51914, 371230, 390860, 135847, -243860, -448403, -332275, -192097, -252446, 22751, 93074, -40937, 211783, 265587, 134438, -104849, -165017, -59863, -120701, -275857, -237541, -137333, -172676, -38466, -91771, -202872, -241143, -154007, -192486, -341392, -313635, -11497, 169838, -72441, -202360, -249740, -255522, -457425, -816475, -865491, -698310, -469716, -510167, -487340, -514482, -652874, -516901, -413056, -229436, -234330, -318058, -199537, -176163, -366966, -392577, -224312, -239108, -197909, -296149, -214532, -164974, -1638, 302590, 224688, 41817, 4786, -133871]
17973a33871j50390J5548Q4492J03048J47484r7438M9918K26905j71084j54369
17963g9757j03829N3779k16500m1912j32748l3631Q4243J2308J4050N2598K91065
17952a00334j49593j18388J61639K84459o2560p4413j56531K5438k4651N5296
17942a59638p7870R080J57763J44521O4505j10119k11951j91481J1453K38063
17932a25674R8131J50496j0989o5182k57770j05365J88132P9446K03296K36392
17922C90913K04859L23815K92727L3640j6174j03292q5598k28817j17248j04074
17912E90751j22873m2315j01072l0959R7445l30135p6146L1436M1284K8421o9891
17901A5946J09545k01800O0016M6811O6107m4283q660L3679l21849q7569L05061
$$ y = [-133871, -284261, -268713, -184221, -81173, 66311, -31127, 18791, 245696, 74612, -79757, -183586, -129807, -346307, -388219, -520967, -554598, -470355, -458047, -443997, -391399, -100334, -249927, -368315, -206676, 77783, 15223, -59190, -215721, -190283, -214934, -159638, -237508, -228428, -70665, 73856, 138361, 28242, -183709, -375190, -363737, -125674, -27543, 122953, 111964, 46782, -210988, -316353, -128221, -48775, 154521, 390913, 595772, 919587, 1212314, 1245954, 1229780, 1126488, 1040890, 812073, 694825, 590751, 467878, 425563, 324491, 293532, 390977, 60842, -15304, 16132, 57416, 85837, 15946, 125491, -76309, -16293, 30518, 96625, 52342, 43682, 77361, -244488, -332057, -26996]
17890b6996J41879k35117j56101M7150K21788L15061o8791k05290J1734k50486
17880b05169J1697Q6434L79m4103J00679K96877K88621j17433k86218K3433l4515
17869A20682J24066J80732K70612k27445j41036J35799j0077P5316n3883k8998
17859D45768P1610J79273J62606J74191j19762j71927M909j0606r0271k5852L3347
17848F53286j70672j57226j20109J02405j8851j45956k90849R6312K38704J6882
17838B03926j06315j35175j26511M2176l9196j63935j67154J87272J36178m2918
17828b11652j88185K68704L54412N3383j36582q7421j31426Q6484L13269L9211
17818C60197j55359j31823r6746j17434P9256O7123r9431k21586J31479J44422
$$ y = [-26996, 114883, -120234, -276335, -229185, -7397, 307664, 238873, 33583, 45317, -205169, -193472, -107038, -106659, -150762, -50083, 246794, 535415, 417982, 131764, 155197, 120682, 244748, 425480, 696092, 468647, 327611, 463410, 453333, 528649, 474766, 445768, 517378, 696651, 859257, 1033448, 913686, 741759, 746668, 736062, 645791, 619939, 653286, 482614, 325388, 205279, 307684, 288833, 142877, -147972, -51660, 187044, 203926, 97611, -37564, -164075, -121899, -161095, -325030, -492184, -304912, -168734, -211652, -399837, -131133, 223279, 276662, 140080, 52659, -78767, 7717, 320986, 360197, 204838, 73015, -23731, -141165, -61909, 5214, -94217, -315803, -184324, -39902]
17808c9902J26591N2969k2727Q814l4841l23207k16728k878r3595R5237K39617
17797b10650k34326j97729j72658K17874N56790K1513q4209J82202J71293o0861
17787A89239O7868k90023J09593N5990j8643l2208J64657J63901l8402j4839j06796
17776B50337j68591j67266j39587k19200j31728J43296J54628P1714j4033q9709
17766c10139j78933j20851J88220K1258j22429M3548L35481J32841p2140n5490
17756a38634K8998l11960L2710K58699N4976k10951k27116J22065o2845K1299
17746d32759J73350P3695J64800k3955M2336j9270k53847j39489m6495K09842
17736b51792K61730J15227l02508k2741K5981j93678j3807M7121R1087J13344
$$ y = [-39902, 86689, 139658, 116931, 125745, 90904, -232303, -449031, -451909, -545504, -450267, -210650, -444976, -642705, -815363, -597489, -40699, -19186, -103395, 78807, 250100, 189239, 257107, -32916, 76677, 132667, 114024, 81816, 246473, 410374, 371972, 357133, 250337, 81746, -85520, -225107, -444307, -576035, -432739, -278111, -206397, -220430, -310139, -489072, -609923, -421703, -400445, -522874, -479326, -143845, -11004, -83144, -138634, -109636, -421596, -388886, -130187, -75211, -286162, -513278, -391213, -454058, -432759, -259409, -185714, -20914, -44869, -2533, -21803, -275650, -415139, -461634, -251792, 9938, 125165, -177343, -200084, -174103, -367781, -381588, -334467, -243380, -130036]
17726a30036J06772j12554J64978l3572R1551j24706J69405Q9145j72907o3697
17716a5621m1172k12775J42390K67513R6036n5760m3929j97087j86861J96844
17706e0422N03909L32171K47661Q7211j13065K36896L53446j03168K6650L7003
17696A558292k14828j39547o1183l75522k76467j57986P411J38036q2563L5463
17686D31106K5450j84884l0087J34281j70567r5835j22861L0147J73906N029J38961
17675C34646q1577J21189j11544k75876p1148P1052Q2080n8371k31104J91091
17665b9562j12833j70370k0660K10542k4852J42043K3927k3882q9489P8149L9281
17654B2294j15817q4568J24877J91372Q8272J75614j72540k54118Q1315P1826
$$ y = [-130036, -23264, -135818, 29160, -4412, 87139, -37567, 131838, 220983, 48076, -15621, -56793, -269568, -127178, 140335, 236371, 180611, 136682, -60405, -247266, -50422, 453487, 785658, 1033319, 1120530, 1007465, 1244361, 1597807, 1494639, 1521289, 1558292, 1343464, 1203917, 1142734, 767212, 490745, 332759, 340170, 478206, 395643, 431106, 456556, 271672, 241585, 375866, 205299, 109464, -13397, 16750, 190656, 195685, 334646, 253069, 374258, 262714, -13162, -84310, -13258, 68822, 10451, -220653, -29562, -142395, -312765, -333425, -122883, -147735, -5692, 18235, -5647, -95136, -16987, 22294, -93523, -178091, -53214, 138158, 226430, 402044, 229504, -24614, 56701, 128527]
17644A28527K10817L43291K37037J2408k15321O9170q0003j0050M275N5701j17924
17633F37928k39600R6724J01832j4363m6321k66719L6524M9629k08814l06789
17623a59969K211K01944N9951j22712l7951j9917K0240N6633p716P7804k1170
17612D9348J1281o1967k31682K06037K05254J38916j24770o5610j45151j59123
17602a77467L7599M8152j26573J81167L9603l1262k11930j05646J00658L66190
17592A20491P529l65126m9941J05977Q7355J68788J31426j11808j8412K2783k6133
17581G2929r4M5482J84796k2230j1793j66299k27562l5954M7282J05652l1767
17570c9558j55320l9056O2105n5318k7896k4297Q0119K78744J45791J11548j37135
$$ y = [128527, 339344, 682635, 919672, 932080, 716759, 785929, 705926, 695876, 700151, 755852, 637928, 398328, 495052, 596884, 582521, 536200, 269481, 306005, 355634, 146820, -159969, -157758, 44186, 104137, -18575, -56526, -76443, -56203, 430, -7286, 70518, 49348, 60629, -1338, -233020, -26983, 178271, 317187, 192417, 126807, -18344, -177467, -139868, -91716, -218289, -37122, 2481, -28781, -240711, -346357, -245699, 120491, 128020, -237106, -287047, -181070, -93715, 75073, 206499, 94691, 76279, 99062, 72929, 72835, 118317, 303113, 280883, 269090, 102791, -124771, -160725, -113443, -7791, -39558, -194878, -233934, -171829, -227147, -255043, -279340, -199221, 79523, 225314, 336862, 199727]
17559A99727l61888K5686K94157j63880j10935K43569L21037K65991J31669p0885
17549G74248L09843K47800K39207J30854k06813p2745J85671J94069N77243O64356
17539C043733N64920Q14385Q31469J270660J521276J535295J530855J371572O27061
17530A3111226l11987j144374j156200j326231j243110j073737r57349j064448
17522D833790q27899l86880l30182m23434n59083k84542k62450j84339j00972
17513A474009L9631j02742M0756j21036k72442P7163J44107j32082j08913j39506
17503H98945J6704P6049K31611N8065j93322L8104M0013n2095n1076J11422J80064
17492A354484p4787j41433J7298l0757J08299R9093m272J52344J04571K39792
$$ y = [199727, -162161, -136475, 157682, -6198, -117133, 126436, 447473, 713464, 845133, 774248, 1084091, 1331891, 1571098, 1701952, 1495139, 1422394, 1608065, 1802134, 2379377, 3043733, 3608653, 4423038, 5254507, 6525167, 8046443, 9581738, 11112593, 12484165, 13111226, 12799239, 11654865, 10498665, 9172434, 7929324, 6855587, 5898238, 4833790, 4005891, 3619011, 3288829, 2865395, 2306312, 2021770, 1759320, 1574981, 1474009, 1513640, 1410898, 1451654, 1330618, 1058176, 1135339, 1279446, 1147364, 1038451, 898945, 915649, 991698, 1223309, 1281374, 1088052, 1126156, 1166169, 1114074, 1062998, 1174420, 1354484, 1279697, 1138264, 1155562, 1124805, 1233104, 1332197, 1327925, 1480269, 1584840, 1824632]
17482A824632L41011J57797Q1746K15740M94688P21223J026155J060383J052767
17473F976142J392322J765751J330153Q42287M21357n38961j188710j379653j224650
17464H396038j061117j119926j003140q10623o05153l79773j92960l87235k17879
17455B618232j67519n3656k0144l1967k24042j48504j13438p4940M2992k88434
17445A538580l17180j13902j61696j24182l6673m2830j75357k11081J5713J96096
17435E67488K5796l4339j08543J23300j93041k6383P1093J1657j07144j3330M8806
17424C65360J70301l0500J23923O3792k03872P1501J6985k05791l00310L9063
17414A10452O9745P0537J18665o415j82436k28534K01781R3617J66544J30645
$$ y = [1824632, 2165643, 2323440, 2405186, 2620926, 3115614, 3836837, 4862992, 5923375, 6976142, 8368464, 10134215, 11464368, 12306655, 12728012, 12189051, 11000341, 9620688, 8396038, 7334921, 6214995, 5211855, 4401232, 3796079, 3416306, 3223346, 2836111, 2618232, 2450713, 2397057, 2376913, 2344946, 2120904, 1972400, 1858962, 1784022, 1827014, 1538580, 1221400, 1107498, 945802, 821620, 784947, 742117, 566760, 355679, 371392, 567488, 593284, 558945, 450402, 573702, 380661, 354278, 425371, 437028, 329884, 316554, 365360, 535661, 505161, 629084, 692876, 489004, 560505, 577490, 371699, 71389, 110452, 180197, 250734, 369399, 362984, 180548, -47986, 153795, 247412, 413956, 544601]
17404E44601R2677N38j72584p7628l6189j19525l2533N10l0280J42929R3960j54064
17392B52412l38396k38424J38052m057P6479J72246Q6412J51336p6888J68834
17382C88006L26632O977j61686j19319j07783Q690J60497n0706j78163P9259j71476
17371A80928k27867J39161O2027j01111j23930J67423N5120l7288k03304k66474
17361c55315N6583K9219K5928K8499n5933o7785l5722l7173J86974M7947j49648
17350c26426N1613K72625J52340n8652J83459l7743j60797K7974J09248P6496
17340B90137j34872j37754p3967p5352j68166O8004M18840K59065j28701j80317
17330A36917k4553k30679q2414P7696k4421M5746R0277J31458k2579j4309l2709
$$ y = [544601, 637278, 637816, 465232, 387604, 351415, 231890, 199357, 199867, 169587, 312516, 406476, 252412, -85984, -324408, -186356, -190413, -113934, 58312, 144724, 296060, 219172, 388006, 714638, 721615, 559929, 440610, 332827, 341517, 502014, 451308, 273145, 352404, 180928, -46939, 92222, 154249, 53138, -70792, 96631, 151751, 114463, -88841, -355315, -298732, -269513, -243585, -215086, -271019, -338804, -374526, -411699, -224725, -176778, -326426, -274813, -2188, 150152, 91500, 274959, 237216, 76419, 104393, 213641, 290137, 155265, 17511, -56456, -131808, -299974, -231970, 186870, 445935, 317234, 136917, 112364, -118315, -200729, -123033, -147454, -101708, -11431, 120027, 97448, 83139, 50430]
17319E0430k09118J31234L4157j72782o411J59575j32110P0646M4220J20347j0912
17308G9276k37843o6146J11755N9267m2628p4625K6684j21247j5039n5802l2445
17297c68793K58903J22912M1721j20850m13l7594o4667k95244j17568K39958J61630
17286a80005J90635L7702k76515q7980M1847l361J28971p9088K0536P4711J14289
17275a8258Q938J30236Q9884N4491l08733r5304k5381q7356j74600j33633j37999
17264f97715J74225J47253j76307N2157K86158O7998K8888j54935L6571J27276
17254a08431l4820M3827j34953J19356J7657j01572N7226l9273J25774j13767
17244a68976k29452j97669J25663O6945Q5192l6090q616L2874K04169K81674j30189
$$ y = [50430, -158688, -27454, 6703, -166079, -172490, -12915, -145025, -74379, -30159, 90188, 79276, -158567, -224713, -112958, -53691, -96319, -170944, -144260, -265507, -280546, -336348, -368793, -109890, 13022, 54743, -66107, -66520, -104114, -168781, -464025, -581593, -341635, -180005, 10630, 48332, -228183, -316163, -274316, -277677, -148706, -227794, -207258, -132547, -18258, -9320, 120916, 210800, 265291, -43442, -138746, -164127, -251483, -426083, -559716, -697715, -523490, -376237, -552544, -500387, -214229, -146231, -117343, -272278, -235707, -108431, -143251, -99424, -234377, -115021, -97364, -198936, -141710, -180983, -55209, -168976, -398428, -596097, -470434, -403489, -318297, -354387, -363003, -330129, -125960, 155714, 25525]
17233B5525k87829q4198J1327K891J81705J1562j33147p9823L8257m7936j30811
17222d92477L0986J74270j63653j6134L9336o4376P8367J64989j45618P2525J55863
17211a65922r3284o2919L01650L30005m527k76242l64132j8882K9900n3725k33666
17200f11744R7281J20734r6632J0216M6160J62104L1249k32498J41446K21307
17190a10377K37116j56662M0000Q4935k12733k45796K2555R1954j63775j08607
17180e21390J19146L03826P4126K687j71123j53305J06695k04086k23973K4163
17170f43234J67420L3932K15626j17042j5097K46726J96492k5444L3685n0486
17160D2578k57574k8947L7712k02583j26397M28284K23921k44171l03185m9573
$$ y = [25525, -262304, -346502, -335175, -332284, -150579, -139017, -272164, -351987, -313730, -361666, -492477, -461491, -287221, -450874, -467008, -427672, -492048, -413681, -248692, -394310, -321785, -165922, -259206, -322125, -20475, 309530, 305003, 28761, -335371, -354253, -324353, -378078, -611744, -514463, -393729, -490361, -480145, -433985, -271881, -240632, -473130, -331684, -110377, 126739, -29923, 10077, 95012, -117721, -363517, -340962, -249008, -412783, -521390, -402244, -98418, -24292, -21605, -192728, -346033, -239338, -443424, -667397, -643234, -475814, -441882, -226256, -343298, -358395, -111669, 84823, 59379, 93064, 42578, -214996, -243943, -206231, -408814, -535211, -106927, 116994, -127177, -430362, -479935]
17150d79935j2175J64971M15164K89828k55691k35008P9014j35993q8984J06488
17140a52321p040q1455K4840m6048m409P4082k7698J7376l8368j1211q7544q5820
17128d25616p2320Q979j8382j42219o7278K72867J31248j36156j48044J90394
17118d06527P9050J2622j24100l5951J80467J29738N7923J25436p5363k76209
17108c32914L1427j3903k6290K04637O4946j30078M5390K47377K7636K2381J65958
17097C06567m3602q8518j43819j75147k13471K9367J13772M968p687P7163n2084
17086a92491Q5004J14857J53967k05516R8439M1938j48646j73347j90703r795
17076d26293K87446O6415J63435k4618m13643o2752O8900P4730P0823j08242K08843
$$ y = [-479935, -492110, -327139, 88025, 377853, 122162, -112846, -33832, -169825, -258809, -152321, -159361, -240816, -215976, -262024, -266433, -192351, -220049, -202673, -241041, -252252, -339796, -425616, -497936, -488957, -507339, -649558, -716836, -443969, -312721, -448877, -596921, -406527, -327477, -314855, -438955, -474906, -294439, -164701, -106778, 18658, -56705, -332914, -301487, -315390, -341680, -137043, -72097, -202175, -156785, 90592, 118228, 140609, 306567, 262965, 174447, 30628, -144519, -357990, -328623, -214851, -209883, -217570, -140407, -192491, -107487, 7370, 161337, -44179, 54260, 96198, -52448, -225795, -416498, -426293, -138847, -72432, 91003, 66385, -347258, -410010, -341110, -266380, -195557, -303799, -94956]
17065i4956k9682L348L2403j9074J16703J3203j29701Q4976j02381j41392j14698
17054c81251P8078J41671J43633J14641j05223K64326K63899q743p1234o4754
17044C75043n1577j74134k11069k27268k1048M8000r0084J04657L921Q9481j6469
17033a70547J27449L5670k79422k29200J32135J33843Q7775K17075M988k38155
17023a78389j05947L14453J05808l55740j88033K8066J14046K28846K17724q8935
17013I1899l31713l05968R6088R8035N0012m6399q6317J82743J40995J5492J31643
17002C6510n8040k06593q6223j18795n8439Q4897J78896J03427k00072j08021
16992d32453J06421q5134k28795K98760J37205j0706Q7374L5744j62902r475K0761
$$ y = [-94956, -124638, -121290, -88887, -107961, 8742, 21945, -107756, -22780, -125161, -266553, -381251, -303173, -161502, -17869, 96772, -8451, 255875, 519774, 511031, 439797, 375043, 323466, 149332, -61737, -289005, -310053, -262053, -352137, -247480, -243559, -154078, -170547, -43098, -7428, -286850, -516050, -383915, -250072, -162297, 54778, 59766, -178389, -284336, 30117, 135925, -219815, -407848, -379782, -265736, -36890, 180834, 91899, -239814, -545782, -449694, -351659, -301647, -348046, -434363, -251620, -110625, -95133, 36510, -21530, -228123, -314346, -433141, -491580, -406683, -227787, -124360, -324432, -432453, -326032, -411166, -639961, -341201, -203996, -214702, -127328, -91584, -254486, -263961, -243200]
16981b43200Q9506q5374K8255J56102O6854J22128o8826j14459N7648j53443k36168
16970c80977l287J53282l0563j9606j92534o4062r552L7302J33163J91298m0308
16959b25844J39510K2701j55012j9280q0643k05888L36308J09380l8587O7579
16949d9776r7581j03423N2921L8826l17431j48986r3131J5399M20786K98667Q3870
16938A00141R8123o0147k69245N9717Q199j22737K0319K2555j7435o4697k3483
16927b48690n5962o3154J0375O6757j09478j0246L99134K67241o9622L2105J84700
16916D03160J6646k12282k76548l6988n6736k23883n8491J29271Q4078j20805
16906c52578j09643j08886L52345J23792j54737Q0936K66224N6146j15896l42539
$$ y = [-243200, -153694, -239068, -210813, -54711, 12143, 134271, 65445, -49014, 8634, -144809, -380977, -384264, -230982, -261545, -281151, -473685, -537747, -547299, -509997, -376834, -185536, -225844, -86334, -63633, -218645, -237925, -318568, -524456, -188148, -78768, -117355, -49776, -147357, -250780, -197859, -159033, -476464, -625450, -718581, -703182, -282396, 16271, 100141, 198264, 138117, -131128, -71411, -63212, -185949, -165630, -143075, -160510, -225207, -248690, -304652, -367806, -357431, -290674, -400152, -410398, -11264, 255977, 186355, 218460, 403160, 419806, 207524, -69024, -106012, -162748, -386631, -445122, -315851, -231773, -352578, -462221, -571107, -218762, -94970, -249707, -168771, 97453, 153599, 37703, -304836]
16896c04836k55087J78835J88943J06056Q5845l43089k51105l36823J15338J37121
16886f78802K11229K51845j29252L8168J0J2064j03455L452o2655Q3351j15645
16875d89690p1604K41947J86705L6529J8911k893r4636j25252K81811l6903n3809
16864a08884p8428K5447p4447j6177J95435L55303j68280k93689p144J54974j34766
16853a50656L8287j8808K6363n0389l2764J33161k02104r1480P7022J53100j23972
16842b42240n7959K25418J05391j92302l64423J57000K64908J79999L3623m5331
16832F4084k7884J16854j86858r4872p7303o6935J21526k571j23786n4704J15711
16821b16738J18792p6996k19629J09725l4030J66974Q1279n0235N3607R2925l4600
$$ y = [-304836, -559923, -381088, -192145, -86089, -244, -343333, -594438, -931261, -815923, -678802, -467573, -215728, -344980, -306812, -306802, -294738, -398193, -394741, -457396, -374045, -489690, -561294, -319347, -132642, -96113, -77202, -80095, -174731, -299983, -18172, -55075, -108884, -187312, -161865, -236312, -252489, -57054, 298249, 129969, -163720, -170864, -15890, -150656, -112369, -131177, -104814, -155203, -187967, -54806, -256910, -348390, -271368, -118268, -242240, -300199, -74781, 30610, -161692, -526115, -369115, -104207, 75792, 109415, 64084, 36200, 153054, -33804, -128676, -205979, -272914, -151388, -153959, -277745, -332449, -216738, -97946, -174942, -394571, -284846, -318876, -151902, -70623, -120858, -67251, 25674, -8926]
16810h926k32363j53611j1281O122l6621K90181J47625N4304j15979j13250j03411
16799b77210k40963J33752R5090j8503R5876k4156n1549J22830J66001j18878
16789a17710j75073K8669K4048j72671n8050K62738J07757p2322O5826N3506p9028
16778a32310m6960J83965K53628M8693m39164q1319L51055J24706k34572j68289
16768a40567j61589L1225J53539J54206J46062J9373r3498L4771j28846k80694
16758b66018O3316K0768l5093K18724J26945J54565l134m0354j4518n4466o568
16747A64167j63288l93572j02674p7309j61838k13598J82862J84973M0651J43807
16737c95819m1146Q4495K9042M907j59903o2677N6454J17046L6869N4295J70872
$$ y = [-8926, -241289, -394900, -406181, -400059, -436680, -146499, 1126, 55430, -60549, -173799, -277210, -518173, -384421, -289331, -307834, -211958, -236114, -287663, -164833, 1168, -117710, -292783, -264114, -240066, -412737, -470787, -208049, -100292, -172614, -106788, -53282, -132310, -179270, 4695, 258323, 307016, -132148, -213467, 137588, 262294, 27722, -140567, -302156, -270931, -117392, 36814, 182876, 202249, 108751, 143522, 14676, -266018, -202702, -181934, -217027, 1697, 128642, 283207, 280073, 239719, 225201, 170735, 164167, 879, -392693, -495367, -572676, -734514, -948112, -765250, -580277, -539626, -395819, -436965, -352470, -323428, -318521, -478424, -541101, -484647, -367601, -330732, -276437, -105565]
16726a05565r065j27452q9909N8625J76257M9159O4191j36362j71329k8792K29105
16715i1137K89600N239j09847m28604j08545N5227L7706K17169K17438P7892k21863
16704e9725k53708O7219J14904R6602P538K5816P0035k03231j15870j37611R6312
16693b91719J38842N2358n1671j5928j23975r8537J50643J73371K67485l9j06899
16682I3931J61889K09260k59406j84041J62717O8197p469J00808j10375k40878
16672e367r8716K23810J19980K4245P0436j12737o361j20950k43455O3888q9452
16661a74679j3527M894p6303R8389J11639J04619O2620j04281l86008l2246K31494
16650a73389j28430j42949K50357K03750J88659l9084p1704j04062o2465O458
$$ y = [-105565, -114630, -242082, -331991, -273366, -97109, -47950, 16241, -120121, -291450, -320242, -91137, 198463, 203702, 93855, -334749, -443294, -388067, -350361, -133192, 84246, 162138, -59725, -313433, -246214, -131310, -34708, -27170, -1354, 68681, -134550, -250420, -388031, -291719, -152877, -100519, -152190, -168118, -292093, -390630, -239987, -66616, 200869, 200830, 93931, 255820, 465080, 205674, 21633, 184350, 252547, 245078, 345886, 235511, -5367, -104083, 119727, 239707, 263952, 334388, 221651, 215290, 94340, -149115, -85227, -174679, -188206, -183312, -259615, -161226, -49587, 55032, 117652, 13371, -372637, -404883, -173389, -301819, -444768, -194411, 9339, 197998, 158914, 87210, -16852, -79317, -72859]
16640g2859K24794l9058N4289k13743R212j14313j11660J53331K57808J04780
16630B52581j59698q8544j7989j55184J46832J96614J85113k80041k98490o1184
16620b79990J53343J37767j33781k63511l49266K11436L21585J72297k7507L8579
16610a9048k5479k35796l03486O7611J04899K07344P4734o9796J31121L6274j92336
16599b23958p5042J4378J52702Q3450m9437j7670J16400P2239o394j02847k51422
16588b87601J99307O7553j16227K97917J42025n7665j39400k68729l42889m1905
16578e47614K2676J20897L2723N7948k42114j58001M59687M10179K6265j48535
16568C4111j87222j20505K4679J01152N4062J45563k50348j73439J7518L23865
$$ y = [-72859, 151935, 112877, 167166, -46577, -37365, -151678, -263338, -110007, 147801, 252581, 92883, 4339, -13650, -168834, -22002, 174612, 359725, 79684, -218806, -279990, -126647, 11120, -122661, -386172, -735438, -524002, -202417, -30120, -57627, -19048, -44527, -280323, -583809, -516198, -411299, -203955, -129221, -199017, -67896, -31622, -223958, -299000, -284622, -131920, -48470, -97907, -115577, 823, 73062, 66668, -36179, -287601, -88294, -20741, -136968, 160949, 302974, 245309, 105909, -162820, -505709, -547614, -524938, -404041, -371318, -313370, -555484, -713485, -253798, 156381, 182646, 34111, -153111, -273616, -248937, -147785, -93723, 51840, -198508, -371947, -354429, -30564]
16558c0564j01792o9234L34317N3572k67504J57486Q0820J782n2648k9607j30023
16547e3395j6824P9017j52587l56829j75267m7568J36937Q5620J05941J60118
16537b34837J48141j86623K5250J03154n9812J25749K3050l7751o809n2835l25551
16526d78874j89830J62536N4018K91525m5474L9626K3085L7605m5665k00053j25661
16515d77162J31887P1312L9902N3080J35289n0935j63651j65853M2560M6438K98301
16504c8832O669J11894r4936N1896r2361L624m886l1617o8942j31685J05387j0020
16492a93809P8498M9114k21242r0657K18j9143k8668K9492m5890L1164n5594K9425
16480d37092q1113N8354J49743l3983k6687j32966L5083Q5454L0752K8502l2572
$$ y = [-30564, -132356, -201590, 132727, 186299, -81205, 76281, 157101, 158883, 106235, 76628, -53395, -70219, 8798, -143789, -500618, -675885, -723453, -586516, -500896, -394955, -234837, -86696, -273319, -248069, -144915, -204727, -78978, -55928, -93679, -100488, -153323, -478874, -668704, -506168, -452150, -160625, -206099, -166473, -143388, -105783, -151448, -351501, -477162, -345275, -273963, -234061, -180981, -45692, -96627, -260278, -426131, -383571, -337133, -38832, -32163, 79731, -15205, 36691, -55670, -52046, -56932, -88549, -157491, -289176, -183789, -193809, -115311, -66197, -287439, -378096, -377878, -397021, -425689, -396197, -442087, -410923, -466517, -437092, -518205, -459851, -310108, -344091, -370778, -503744, -468661, -383207, -352455, -323953, -356525]
16469c56525M1387J20181P01P8278L14489J3535j08051j97933m769K36194j26389
16458A1098J76882M1135R1713p9509k43841j11915m5350J97986l1112k00878q6344
16447b80135n9379K22195Q6037M3034j28193j15170j1870J89262R0754l5666N4141
16436E5010J32496l46511p2001r3304k0r3045J14756o2630q1608J78455O1950
16425b06452J03986Q070j34445J04690j62297q4157K15392R4151J32144k2615
16415D8467j86588L0769p2286n8186q3521N4855N3912J85766P6486J6578N433
16404G1685O3565k00691k88637N7129N0954O3280o3555o6130K63014J85301m8792
16393H7123j42686j82003j21702o0785K2215O8583N4337j19705m8170M9938M3903
$$ y = [-356525, -315138, -194957, -194256, -115978, 198511, 212046, 103995, -93938, -98707, 137487, 11098, 187980, 229115, 320828, 241319, -2522, -114437, -159787, 38199, 7087, -193791, -280135, -339514, -117319, -31282, 11752, -116441, -231611, -243481, -54219, 36535, 869, 55010, 187506, -159005, -231006, -324310, -324330, -417375, -302619, -365249, -446857, -268402, -206452, -102466, -94396, -228841, -124151, -286448, -370605, -155213, -61062, 71082, 48467, -138121, -107352, -179638, -237824, -321345, -266490, -212578, -26812, 49674, 66252, 71685, 135250, -65441, -354078, -296949, -245995, -182715, -246270, -312400, -49386, 135915, 87123, -55563, -237566, -359268, -420053, -397838, -329255, -274918, -394623, -442793, -392855, -348952]
16382c48952P7688l4396r7098K41565p5117O4198J13270P5858m2439j42442J1448
16371a56417L15937m3594k89799q9109J88472o8442j84936m5995M0896J13031
16361b19956J97760m9866j72805k10161K26749J95859L431m1816k15264j83655
16351d69724N0122J73774J52921o3908J16924O5714J46956j10776j48365N4331
16341c2031k2312k87851N2516P1579K03224Q7160j86526k11806K45140J18054
16331C7147l5141l8706Q3466k75884j41170L25029K75212j64751l30021j5991
16321b80810j31854n7965j8473l1750Q6286Q0333M6933J73512R4127k4861p4938
16310a39460J03609R3183m8404j36747j9934R2928J13904k31121l15191k50362
$$ y = [-348952, -271264, -305660, -402758, -161193, -236310, -172112, -58842, 17016, -25423, -167865, -156417, 159520, 115926, -173873, -262982, -74510, -142952, -327888, -373883, -332987, -219956, -22196, -72062, -244867, -455028, -228279, -32420, -28989, -70805, -286069, -469724, -419602, -245828, -92907, -156815, -39891, 25823, 172779, 62003, -86362, -32031, -54343, -342194, -289678, -218099, -14875, 72285, -114241, -326047, -80907, 37147, 2006, -36700, 46766, -229118, -370288, -45259, 229953, 65202, -264819, -280810, -412664, -470629, -489102, -520852, -434566, -354233, -307300, -133788, -39661, -64522, -139460, -35851, 57332, 8928, -127819, -147753, -54825, 59079, -172042, -487233, -737595]
16300g37595n9676J81186J65520K03082L59110P0518l0968j36327k9211j9167
16290c3528j47981j37102j69418L2521j5303j2422P8476O9081J7082J46567J40046
16279c1981J3896m9552K0596q1266M8210m6695l026M5273J58551r1778L4481q3755
16267f7046k33949M0549J83384k1789p5692j7689k27930l3206M33834K03295k00533
16256a6772j02547j19775j28299j4160l972K17895n038L8966J26515N8904m880
16245D6837l33228L4122K7626j56908L55798L73470J4346j59937m9559j74270
16235b1703j23772L5356m993R7366o0161p5276k00064l3686j17674J06421L30457
16224f7729J64976r2446n3388K77826J20654M5405L6394J60676l2196m45276k83738
$$ y = [-737595, -797271, -616085, -450565, -247483, 111627, 182145, 151177, 14850, -14361, -33528, -181509, -318611, -488029, -455508, -470811, -483233, -404757, -335676, -318594, -172027, -31981, -18085, -67637, -47041, -128307, -80097, -126792, -129818, -84545, 74006, -17772, 16709, -67046, -300995, -260446, -77062, -98851, -174543, -192232, -420162, -453368, -19534, 183761, -16772, -119319, -239094, -367393, -381553, -385525, -167630, -172668, -133702, -7187, 51717, 46837, -286391, -252269, -224643, -381551, -25753, 347717, 362063, 202126, 152567, -21703, -145475, -110119, -115112, -17746, -77907, -153183, -353247, -386933, -504607, -398186, -67729, 97247, 4801, -48587, 229239, 349893, 395298, 431692, 592368, 560172, 114896, -168842]
16213a68842j19454O3102J25632M609q7233r494j03800J29342l2199J9614k22172
16202d00895o275J93010K0633M8048R0255j24849j12281j9042j6196j45392L12841
16191a60143J12073m4891r4498j55008n6549J56723J23326k7270n1266q5639L8621
16180b44521J18418l4544j7411J50066j64180o4502J70595p0404n5912m9161N484
16169b56072J6927K13538j60095m9192m680j83302j28883R1114O9283l8370J0949
16158d18783K86545P8863q6107J9783J70153r3481K2226K8853k10913j14901o6886
16147c84648Q9634K29516K27919K31001j38009m77550k23990J83540J50144Q6572
16137b5871j65143m8453K48401j66211J2940Q6026O4696m11489l31846Q4449J85085
$$ y = [-168842, -288296, -225194, -99562, -94953, -182186, -191680, -295480, -166138, -198337, -178723, -400895, -407170, -214160, -193527, -145479, -55224, -180073, -292354, -311396, -327592, -472984, -160143, -48070, -92961, -187459, -342467, -399016, -242293, -118967, -146237, -197503, -283142, -244521, -126103, -160647, -178058, -27992, -192172, -256674, -86079, -156483, -212395, -261556, -256072, -239145, -25607, -185702, -234894, -239574, -422876, -551759, -460645, -391362, -429732, -418783, -132238, -53375, -139482, -119699, 50454, -43027, -20801, 8052, -202861, -317762, -384648, -295014, -65498, 162421, 393422, 255413, -222137, -446127, -262587, -112443, -25871, -191014, -239467, 8934, -157277, -144337, -58311, 6385, -405104, -736950, -652501, -467416]
16126d67416N358K7871K51783K14988J32545r4074q7500r9779j00417n8588M6645
16115b28584K70399N5922m498k53504J5296J63483K9220k43121j27956p3554j54918
16104e51815J39215P1877O838k46446n3482L00302j09042k4339L3188J00948R4112
16093b38644J549j84407k9998J65003J33549j7185j70328j36130J80354k3261
16083c19498q787J57895j47017N2197O8277N8692J5746J05681j3807P4297l1501
16072A2175Q973J12939P819k11437J00208J15579j65777j29257K17649j10327
16062d1456j82407K1358n9961n638J75478J1684L24022J02916k57820o2911J986
16051B7251k1734p790R9191j18640j67495j36043l4941R1794J61222J05662n9797
$$ y = [-467416, -462058, -434187, -182404, 32584, 165129, 71055, -16445, -116224, -216641, -275229, -228584, 41815, 97737, 93239, -160265, -144969, 18514, 47734, -195387, -323343, -396897, -551815, -412600, -340723, -333885, -580331, -633813, -333511, -442553, -466892, -433704, -332756, -238644, -237095, -421502, -451500, -286497, -152948, -170133, -340461, -476591, -296237, -319498, -328285, -170390, -317407, -265210, -196933, -138241, -122495, -16814, -30621, 43676, 12175, 21148, 134087, 141906, -69531, 30677, 146256, -19521, -148778, 68871, -41456, -223863, -202505, -262466, -268104, -92626, -80942, 243080, 345996, 88176, 25265, 27251, 5517, -2273, 96918, -21722, -189217, -325260, -360201, -268407, -107185, -1523, -61320]
16040f1320j66067J1992N0561k08636Q8531K03236p3379o0671M6023L00525r1289
16029C9506k86452m1088J18857j8460k7805J2691N4849J51391j37141j41348J06966
16018a68034M5235K71091M06824M6551K7258j16620k99538r0903J3874j58340
16008b2602j16815j27696J51628J444j56874L3699J87499J88339J5562l62806
15998b08622k04870n3223L0019K19508O432l8434p362J18475J75494o5424l8461
15987f6468P4549r9009R8546J52175l09462l3249r4677m3604N4313J17770J03681
15976d5435P1898j30445q8376J34531o1492q7304J76166Q4458j14858j4256R1954
15965A6841q9924l81779J8278K77520K74434J15353k62197r9305J01051j83006
$$ y = [-61320, -227387, -215395, -164834, -373470, -284939, -81703, -155082, -215753, -169730, 130795, 39506, -246946, -288034, -169177, -187637, -215442, -202751, -147902, 3489, -133652, -275000, -168034, -122799, 148292, 555116, 601667, 628925, 512305, 212767, 121864, 135738, -22602, -139417, -267113, -115485, -114041, -270915, -237216, -49717, 138622, 154184, -208622, -413492, -466715, -436696, -217188, -210756, -249190, -256552, -138077, 37417, -28007, -66468, 8081, -90928, 7618, 159793, -149669, -182918, -277595, -321199, -266886, -149116, -45435, 26463, -103982, -192358, -57827, -119319, -206623, -30457, 54001, -60857, -75113, 16841, -73083, -454862, -436584, -159064, 115370, 230723, -31474, -130779, -29728, -212734]
15955b12734j42711m3905p0957K3737j78794J85065K34256K71517J52570j04128
15945A13916l44490j54010J35968R3383K9526o1066r6699M355o8488r8939K47087
15934a99457J49992K50073p4537l1260n7481l9781L24539o2690m64831P5121P983
15923a22329j3030j19207o0206j5455J6835l997n2076k424K06767J04923O3115
15912B916P2017P1578P2562k60626k0034Q5568r7924j33044M3469L8570J16296
15901h652k58822j41046j48134L80667J06456P5526J69234N7226O5345j0302q3046
15890B04452j82326q0508l19796N8371K47862J74977r0283k98651m82293L9207
15880g28988L47399j1972J02099r7515K17093K0362l19178l5594N5770K61189
$$ y = [-212734, -355445, -399350, -470307, -446570, -625364, -440299, -206043, 65474, 218044, 113916, -230574, -384584, -248616, -155233, -125707, -186773, -283472, -279117, -347605, -446544, -199457, -49465, 200608, 126071, 94811, 37330, -2451, 322088, 259398, -205433, -130312, -122329, -135359, -254566, -314772, -330227, -313392, -317389, -369465, -371889, -165122, -60199, 2916, 74933, 146511, 219073, -41553, -61587, 23981, -73943, -206987, -163518, -124948, -8652, -267474, -408520, -556654, -175987, -69531, 5995, 175229, 232455, 297800, 287498, 204452, 22126, -58382, -378178, -319807, -71945, 103032, 12749, -285902, -768195, -728988, -381589, -393561, -291462, -388977, -171884, -151522, -470700, -506294, -450524, -189335]
15870a89335j22359j37391m2357K58860J27142P0782j6994N542J8333L5258j66027
15859a58546j31986m6233K27240N3531P6008P9122j93455p2468j19045J4903J63031
15848a07898j03904j08279J7329R1946J56026L81024J29477m0912k25787k02859
15838a3837J1894n6091l7110J2259J27065R4572J11756J76134j19196r8026m1141
15827A68279j89806j13593J56961L9266Q0377M6964N2829l29572k68469J34504
15817b22260l2800j14056Q0873J32300j11993J5370K89867L9365j83697J7868
15807h9163Q9073N0675j39164j15319J19141o501O3480j23053k61304J36248K25128
15796e0759j94482r9843R2288K99438P0477j302J81847k03781l14395k12258k2247
$$ y = [-189335, -311694, -449085, -491442, -232582, -105440, -34658, -51652, -46110, -27777, 7481, -158546, -290532, -336765, -109525, -55994, 20014, 99136, -94319, -166787, -285832, -270929, -107898, -211802, -320081, -302752, -210806, -54780, 326244, 455721, 414809, 189022, -13837, -1943, -58034, -95144, -82885, 44180, 138752, 250508, 426642, 307446, 209420, 168279, -21527, -135120, 21841, 61107, 141484, 188448, 241277, -88295, -356764, -222260, -255060, -369116, -288243, -155943, -267936, -252566, 37301, 76666, -107031, -89163, -90, 50585, -88579, -203898, -84757, -91258, -27778, -150831, -412135, -275887, -50759, -245241, -345084, -252796, 46642, 117119, 115817, 297664, 93883, -220512, -432770, -455017]
15785d55017K16511J63671P8047j59441j37347K58788J5717J13810j31144q1481
15775a17886j3915m8040j60869J75519J63339r3785m8264P0195r8721J14828J15365
15764E7766k02826k8509J12460N6027P838k99r5011j67204R8712j0016j57161
15753c28223J89771J89221o3369N9209k3765L6914K9627J13068k04810n2971M1409
15742a3919m4338o9053N4284L5422Q017j54635j50920k64839o9534o2424K788
15731g29151J06527O5344J30843q5499j58758j02195J51145K53816k7796o8847
15721d64571L3340K36610K26404R689J51622K03173p4397l32554n1371J84395
15711A22340j37219L6221K19267K55554j71107k27067j56457J73441P400r1263
$$ y = [-455017, -238506, -74835, 3212, -156229, -293576, -34788, -19071, 94739, -36405, -117886, -131801, -179841, -340710, -165191, -1852, -95637, -143901, -73706, -172427, -57599, 57766, -145060, -173569, -61109, -5082, 2756, 2457, -92554, -259758, -161046, -171062, -328223, -138452, 50769, -12600, 46609, 22844, 59758, 89385, 202453, -2357, -55328, -13919, -58257, -127310, -73026, -37604, -29587, -184222, -335142, -599981, -669515, -731939, -729151, -622624, -557280, -426437, -511936, -670694, -772889, -621744, -367928, -395724, -464571, -431231, -194621, 31783, 41472, 193094, 396267, 321870, -10684, -62055, 122340, -14879, 21342, 240609, 496163, 325056, 97989, -58468, 114973, 122373, 31110]
15701C1110n1721j2777j00618J30394k909j57620K3174p1803K5392J19748k74140
15690c41770J36239J62581K37549q9058q9589K66780l4543j66562k70266n7867
15680b46506K00998k3106p4540Q6181J03541n7322j17981p4392j02078K49265
15670e5940Q0126k12610k22354J70929K99199j14278q1014r9300M262n0419m4420
15659c25819P6591R5386Q1172l3023p07J12421p6259j21193O8924Q1549R2J73953
15647A33087p5194r3698j33786k10715O6925p1453K10282J50605l3007J18482
15637F1528K02197j00947q3430l2742J222j87916L503K53484K72168k74938k94829
15626a80700j3001p1013m4578j30216K8680M3185O7059J8496K90563J24252o3005
$$ y = [31110, -20611, -33388, -134006, -3612, -6521, -164141, -140967, -212770, -187378, -67630, -341770, -205531, -42950, 194599, 105541, 15952, 282732, 248189, 81627, -188639, -246506, -45508, -68614, -143154, -56973, 46568, -10754, -128735, -203127, -305205, -55940, 24186, -188424, -410778, -239849, 59350, -54928, -135942, -235242, -230980, -281399, -325819, -249228, -153842, -72670, -105693, -106400, 6021, -70238, -191431, -122507, -40958, -40866, 133087, 57893, -35805, -169591, -380306, -313381, -384834, -174552, -23947, -56954, 61528, 263725, 162778, 79348, 46606, 47828, -140088, -136585, 116899, 389067, 114129, -180700, -193701, -264714, -309292, -439508, -410828, -367643, -300584, -282088, 8475, 132727, 69722]
$$ [...]
##END NTUPLES=NMR SPECTRUM
##END=
