##TITLE=Analysis number 321556
Compound Code mo 01102
Project Code adrs
Chemist Name hixia
##JCAMPDX= 6.0         $$ Bruker NMR JCAMP-DX V2.0
##DATA TYPE= NMR SPECTRUM
##DATA CLASS= NTUPLES
##ORIGIN= Bruker BioSpin GmbH
##OWNER= nmr
$$ XWIN-NMR		Version 3.5
$$ Wed Aug 16 09:57:03 2006 GMT Daylight Time (UT+1h)  MAYBRIDGE\nmr@NMR_250MHZ
##.OBSERVE FREQUENCY= 250.131544655141
##.OBSERVE NUCLEUS= ^1H
##.ACQUISITION MODE= SIMULTANEOUS (DQD)
##.ACQUISITION SCHEME= undefined
##.AVERAGES= 16
##.DIGITISER RES= 18
##SPECTROMETER/DATA SYSTEM= dpx250
##.PULSE SEQUENCE= zg30
##.SOLVENT NAME= CDCl3
##.SHIFT REFERENCE= (INTERNAL, CDCl3, 0, 16.4546)
##AUDIT TRAIL= $$ (NUMBER, WHEN, WHO, WHERE, WHAT)
$$ ##TITLE= Audit trail, XWIN-NMR		Version 3.5
$$ ##JCAMPDX= 5.01
$$ ##ORIGIN= Bruker BioSpin GmbH
$$ ##OWNER= nmr
$$ C:\u/data/dgb/nmr/ADRS/980/pdata/1/auditp.txt
$$ ##AUDIT TRAIL=  $$ (NUMBER, WHEN, WHO, WHERE, WHAT)
(   1,<2006-08-16 09:56:41.01 +100>,<MAYBRIDGE\nmr>,<NMR_250MHZ>,
      <created by zg, POWCHK disabled, PULCHK disabled
       configuration hash MD5:
       E2 DF 36 D8 04 B2 41 60 5A D7 A3 38 5A 4B D0 FE
       data hash MD5: 64K
       27 25 16 F7 85 4A 4C AC AB 87 94 B5 97 DC 6C 0D>)
(   2,<2006-08-16 09:56:53.66 +100>,<MAYBRIDGE\nmr>,<NMR_250MHZ>,
      <Start of raw data processing
       ef LB = 0.3 FT_mod = 6 PKNL = 1 SI = 32K 
       data hash MD5: 32K
       CD 74 51 37 9B BF 8B BA 90 4D B8 64 B7 6F 33 ED>)
(   3,<2006-08-16 09:56:55.80 +100>,<MAYBRIDGE\nmr>,<NMR_250MHZ>,
      <apk 
       data hash MD5: 32K
       A7 58 6F B7 C3 37 82 11 32 56 4D 1B 79 53 8B 06>)
(   4,<2006-08-16 09:56:56.47 +100>,<MAYBRIDGE\nmr>,<NMR_250MHZ>,
      <abs ABSG = 5 
       data hash MD5: 32K
       CE E1 43 5A 6D 5C 79 EF 13 3D F6 03 ED 61 ED FA>)
$$ ##END=
$$ 
$$ hash MD5
$$ E7 16 EA EA E5 77 4F E8 80 7F BA 51 21 C9 12 15
##$RELAX= 
##$RELAX= 
##$RELAX= 
##$RELAX= 
##$RELAX= 
##$RELAX= 
##$RELAX= 
$$ Bruker specific parameters
$$ --------------------------
##$DU= <C:\u>
##$EXPNO= 980
##$NAME= <ADRS>
##$PROCNO= 1
##$TYPE= <nmr>
##$USER= <dgb>
##$AMP= (0..31)
100 100 100 100 100 100 100 100 100 100 100 100 100 100 100 100 100 100 
100 100 100 100 100 100 100 100 100 100 100 100 100 100 
##$AQSEQ= 0
##$AQ_mod= 3
##$AUNM= <au_zg>
##$AUTOPOS= <6 >
##$BF1= 250.13
##$BF2= 250.13
##$BF3= 250.13
##$BF4= 250.13
##$BF5= 500.13
##$BF6= 500.13
##$BF7= 500.13
##$BF8= 500.13
##$BYTORDA= 1
##$CFDGTYP= 0
##$CFRGTYP= 5
##$CHEMSTR= <none>
##$CNST= (0..31)
1 1 145 1 1 1 1 1 1 1 1 1 1 1 1 1 1 1 1 1 1 1 1 1 1 1 1 1 1 1 1 1 
##$CPDPRG= <>
##$CPDPRG1= <>
##$CPDPRG2= <>
##$CPDPRG3= <>
##$CPDPRG4= <mlev>
##$CPDPRG5= <mlev>
##$CPDPRG6= <mlev>
##$CPDPRG7= <mlev>
##$CPDPRG8= <mlev>
##$CPDPRGB= <>
##$CPDPRGT= <>
##$D= (0..31)
0 1 0 0 0 0 0 0 0 0.06 0 0 0 0 0 0 0.0002 0 0 0 0 0 0 0 0 0 0 0 0 0 0 
0 
##$DATE= 1155718599
##$DBL= (0..7)
120 120 120 120 120 120 120 120 
##$DBP= (0..7)
150 150 150 150 150 150 150 150 
##$DBP07= 0
##$DBPNAM0= <>
##$DBPNAM1= <>
##$DBPNAM2= <>
##$DBPNAM3= <>
$$ [...]
##$SUBNAM7= <"">
##$SUBNAM8= <"">
##$SUBNAM9= <"">
##$SW= 20.6930455092707
##$SWIBOX= (0..15)
0 0 3 0 0 0 0 0 0 0 0 0 0 0 0 0 
##$SW_h= 5175.983436853
##$TD= 65536
##$TD0= 1
##$TE= 295.16
##$TE2= 300
##$TE3= 300
##$TEG= 300
##$TL= (0..7)
0 120 120 120 120 120 120 120 
##$TP= (0..7)
150 150 150 150 150 150 150 150 
##$TP07= 0
##$TPNAME0= <>
##$TPNAME1= <>
##$TPNAME2= <>
##$TPNAME3= <>
##$TPNAME4= <>
##$TPNAME5= <>
##$TPNAME6= <>
##$TPNAME7= <>
##$TPOAL= (0..7)
0.5 0.5 0.5 0.5 0.5 0.5 0.5 0.5 
##$TPOFFS= (0..7)
0 0 0 0 0 0 0 0 
##$TUNHIN= 0
##$TUNHOUT= 0
##$TUNXOUT= 0
##$USERA1= <user>
##$USERA2= <user>
##$USERA3= <user>
##$USERA4= <user>
##$USERA5= <user>
##$V9= 5
##$VALIST= <valist>
##$VCLIST= <CCCCCCCCCCCCCCC>
##$VD= 0
##$VDLIST= <DDDDDDDDDDDDDDD>
##$VPLIST= <PPPPPPPPPPPPPPP>
##$VTLIST= <TTTTTTTTTTTTTTT>
##$WBST= 1024
##$WBSW= 4
##$XGAIN= (0..3)
0 0 0 0 
##$XL= 0
##$YL= 0
##$YMAX_a= 251575
##$YMIN_a= -391821
##$ZGOPTNS= <>
##$ZL1= 120
##$ZL2= 120
##$ZL3= 120
##$ZL4= 120
##$ABSF1= 16.45456
##$ABSF2= -4.238613
##$ABSG= 5
##$ABSL= 3
##$ALPHA= 0
##$AQORDER= 0
##$ASSFAC= 0
##$ASSFACI= 0
##$ASSFACX= 0
##$ASSWID= 0
##$AUNMP= <proc_1d>
##$AZFE= 0.1
##$AZFW= 0.1
##$BCFW= 0
##$BC_mod= 0
##$BYTORDP= 0
##$COROFFS= 0
##$CY= 12.5
##$DATMOD= 1
##$DC= 0
##$DFILT= <>
##$DTYPP= 0
##$F1P= 14.0000005364418
##$F2P= -0.99999901652339
##$FCOR= 0.5
##$FTSIZE= 32768
##$FT_mod= 6
##$GAMMA= 0
##$GB= 0
##$INTBC= 1
##$INTSCL= 1
##$ISEN= 128
##$LB= 0.3
##$LEV0= 0
##$LPBIN= 0
##$MAXI= 10000
##$MC2= 0
##$MEAN= 0
##$ME_mod= 0
##$MI= 0
##$NCOEF= 0
##$NC_proc= -5
##$NLEV= 6
##$NOISF1= 0
##$NOISF2= 0
##$NSP= 0
##$NTH_PI= 0
##$NZP= 0
##$OFFSET= 16.45456
##$PC= 1
##$PHC0= 132.7259
##$PHC1= 62.12558
##$PH_mod= 1
##$PKNL= yes
##$PPARMOD= 0
##$PSCAL= 4
##$PSIGN= 0
##$REVERSE= no
##$SF= 250.130016866428
##$SI= 32768
##$SIGF1= 0
##$SIGF2= 0
##$SINO= 400
##$SIOLD= 32768
##$SREGLST= <1H.CDCl3>
##$SSB= 0
##$STSI= 32768
##$STSR= 0
##$SW_p= 5175.98343685301
##$SYMM= 0
##$S_DEV= 0
##$TDeff= 65536
##$TDoff= 0
##$TI= <Analysis number 999999
Compound Code 99
Book Reference 9
Project Code 9>
##$TILT= no
##$TM1= 0
##$TM2= 0
##$TOPLEV= 0
##$USERP1= <user>
##$USERP2= <user>
##$USERP3= <user>
##$USERP4= <user>
##$USERP5= <user>
##$WDW= 1
##$XDIM= 32768
##$YMAX_p= 329778396
##$YMIN_p= -1196191
$$ End of Bruker specific parameters
$$ ---------------------------------
##NTUPLES= NMR SPECTRUM
##VAR_NAME=  FREQUENCY,     SPECTRUM/REAL,   SPECTRUM/IMAG
##SYMBOL=    X,             R,               I
##VAR_TYPE=  INDEPENDENT,   DEPENDENT,       DEPENDENT
##VAR_FORM=  AFFN,          ASDF,            ASDF
##VAR_DIM=   32768,         32768,           32768
##UNITS=     HZ,            ARBITRARY UNITS, ARBITRARY UNITS
##FACTOR=    0.157963299565203, 1,           1
##FIRST=     4115.77920178501, 0,            0
##LAST=      -1060.204235068, 0,             0
##MIN=       -1060.204235068, -1196191,      0
##MAX=       4115.77920178501, 329778396,    0
$$ Real data points
##PAGE= N=1
##DATA TABLE= (X++(R..R)), XYDATA
$$ [...]
25914A17304j23674J22373L9053O4384k2210m1188n1871J37362q2915l99108L4137
25903b06353O6023M5606J95635o312k16128J53231j28938j03169Q9790K23802
25893A13187J79463k35224j16871R7235r3061l7627n9928o4358J65818K81089
25883B29723j05037o2694p2033N649R1078j28512j20427j68971J12215O3470J22145
25872c3394J94817j31396n5446L03666L03421k48978K0007J31263K3407k78006
25862B29361L9698Q3696m1509k62321N7596N7550M8365j46199k31809k43467P1369
25851c37670K83801R9042J60100J21947P3250o9817j44256j6365J00932M6144
25841C17108r9093p3742o0820o0323J5156K07728j2412l66851k21622j90769J89522
$$ y = [117304, -6370, 116003, 155056, 219440, 197230, 156042, 104171, 241533, 158618, -240490, -206353, -140330, -94724, 100911, 94599, -121529, 31702, -97236, -200405, -110615, 113187, 292650, 57426, -59445, 37790, -55271, -92898, -152826, -217184, -51366, 229723, 124686, 61992, -10041, -4392, 86686, -41826, -162253, -331224, -219009, -155539, -33394, 161423, 30027, -25419, 278247, 581668, 332690, 352697, 483960, 507367, 229361, 269059, 352755, 311246, 48925, 106521, 164071, 212436, 66237, -165572, -409039, -337670, -53869, 45173, 205273, 327220, 400470, 330653, 186397, 170032, 270964, 317108, 218015, 144273, 83453, 23130, 38286, 246014, 233602, -133249, -354871, -545640, -356118]
25830c56118N01681K71572k78466k94292J2048q6338k42760K36734L3613L15034
25820A12708J31408J50591L0692m004k45519J46802J65535l7455k24916q3494
25810A42348L02489l40743j33989K0633k3356O2691o5268R9254q1296j11084j38813
25799b67134n1539l52373j3734K13027J64874K4694J40669J47866J41045k3106
25789A24289l00234J15548K89117J95492k9719k23823k76450O1871J73717N8861
25779A88669q7227p1194j61470R2024J84516J13052q8657r4554Q527j29862J45002
25768I8826j42850m34731P9587K90925J60065J02171J99188q3292k71062j87988
25758a89161j16078K7909J04538J93050N0575J73027P2323N9238j75945J0015
$$ y = [-356118, 145563, 417135, 138669, -155623, -143575, -229913, -472673, -235939, -202326, 112708, 244116, 394707, 425399, 421395, 175876, 322678, 488213, 450758, 225842, 142348, 444837, 104094, -29895, -9262, -32618, 30073, -35195, 64059, -17237, -128321, -267134, -318673, -671046, -684780, -471753, -306879, -282185, -141516, 6350, 147395, 124289, -175945, -60397, 228720, 424212, 394493, 170670, -105780, -43909, 129808, 188669, 101442, 30248, -131222, -39198, 145318, 258370, 169713, 75159, 83686, -46176, 98826, -44024, -478755, -399168, -108243, 51822, 153993, 353181, 269889, -1173, -189161, -305239, -277330, -172792, 20258, 70833, 243860, 316183, 375421, 199476, 209491]
25748B09491J70973j99628k9119J17614j12667q6451P7210J7663j79554K6842
25738A2374j06641m19971J08574J27966J06666Q5214j36071k7224j33392j38259
25728e20764M8707K54101J8176q0413p6318j0792N2930K14696J4310j01198r6298
25717b82863J30617J9634N2497j38137J32932r3735j37378J09506N5822M2365
25707a08740J72382R4201M9368J5389q1485j62550J22771J8246j02561J06871
25697A23892j66131Q5818M4692k7150N1773r2632J98350P4261j01142q6312k9780
25686G5639M5851J46558k39549l6771r2746j57861j2155k27753J36817M60325
25676I8355k9767K7826j2241L065J29871o0260j54414J6560M7345n6391P3622
$$ y = [209491, 380464, 180836, 151717, 269331, 156664, 70213, 147423, 165086, -14468, 12374, -94267, -514238, -405664, -277698, -171032, -85818, -221889, -249113, -382505, -520764, -472057, -217956, -199780, -280193, -356511, -367303, -314373, -99677, -85367, -186565, -282863, -152246, -132612, -80115, -218252, -85320, -179055, -316433, -206927, -151105, -108740, 63642, 157843, 207211, 222600, 141115, -21435, 101336, 119582, 17021, 123892, -42239, 43579, 88271, 61121, 112894, 20262, 218612, 292873, 191731, 105419, 75639, 121490, 268048, 28499, -8272, -101018, -258879, -271034, -498787, -361970, 98355, 68588, 96414, 84173, 87238, 217109, 156849, 2435, 18995, 66340, 9949, 83571]
25665H3571J76239m1934j68471k0116P2055q12N9444J28615k39881L3986j07697
25654b5001K50248K47596m7045j48777K7484p8636j32812r2012J94437r9515k03553
25643a07586K74797R4924j40054q9447j1253k4289j12988n1838l3144K22058n2455
25632c1275n2044j10077O8909J6087j85451J38924j33336p8348P8900J62711J71556
25621D6556J01325n3168j12094j9859K14565j86878m00352N7626L72464P3524
25611I3709m8197j55295O1696L540P2555Q687P5372R5262j29569k32464O5110
25600h9594L0729J39041l9373J4148K179o4017P6813l19347r3258Q6361J43247
25589a13071J12662k8238J09667K47033l15090j83949k95775J50062J04737L5367
$$ y = [83571, 259810, 217876, 49405, 29289, 101344, 100532, 159976, 288591, 48710, 82696, -25001, 225247, 472843, 425798, 277021, 304505, 225869, 93057, 1045, 195482, 95967, -107586, 167211, 262135, 122081, 32634, 21381, -2908, -115896, -167734, -200878, 21180, -31275, -83319, -193396, -124487, -108400, -293851, -154927, -288263, -366611, -287711, -125000, 46556, 147881, 94713, -17381, -37240, 177325, -9553, -409905, -352279, 20185, 93709, 45512, -109783, -48087, -44547, 28008, 36695, 112067, 207329, 77760, -154704, -89594, -58865, 80176, 40803, 54951, 57130, -6887, 69926, -249421, -342679, -256318, -113071, -409, -28647, 81020, 328053, 12963, -170986, -466761, -316699, -211962, -176595]
25579a76595L09937q0667o6911j36877j3005j31012O9790K36864j52674j0247
25569a51397K69955K3562j13140j08977m2532J45232j15730L4476J14832J70179
25559B26460q7759q2468k47044k22071K12353L41155J16455n4399o655q0537l271
25548A12219k91188k75355k4195J06357J38226O9962K4817q6846R0085J07413
25538b8505n4652j66708k37616J42987K09318j6166J69905N02959n3159j22232
25528C46131j92107j21052J28321o4585j99967r9367j5133J36057J51291J78507
25518B48096k1258q1510j05821j0300m9663N0419L7976j63130l8225K12658L3590
25507A12832l6665J6007J07505m4585k44902j07506K67960L1499j35749N6649
$$ y = [-176595, 133342, 52675, -14236, -151113, -164118, -295130, -225340, 11524, -141150, -151397, 118558, 142120, 28980, -79997, -122529, 22703, -93027, -58551, 56281, 226460, 138701, 56233, -190811, -412882, -200529, 140626, 257081, 202682, 196027, 115490, 112219, -178969, -454324, -478519, -372162, -233936, -163974, -139157, -226003, -135918, -28505, -83157, -249865, -487481, -344494, -135176, -151342, 18563, 521522, 468363, 346131, 154024, 32972, 161293, 96708, -103259, -202626, -217759, -81702, 69589, 248096, 226838, 145328, 39507, 29207, -20456, 29963, 67939, -95191, -133416, 79242, 112832, 76167, 92174, 199679, 155094, -89808, -197314, 70646, 102145, -33604, 23045]
25497B3045j67565j49441K8052J55509n0544j52515L07450J43606J71268J8533
25487C27398n6725q8250j23344j34492k13510k86328l28651K00942N00252L16509
25477A13801o4100Q7863R2894l6797l96164j02524K35384L35335m4262J408K41506
25466D64344m4224m7246j34117j49141P3581P5674k77072j82869J4261m0593k18807
25455d66209Q3607j39754j72084J48739J21995J22539j6702j18553K89308L85659
25445B38545J29190j55826Q619J45149P9159j39099k14441n2199J57823J73214
25435C70134j23175k29649j7915K9849k08916P4411n8990j49262J81406J89895
25425E7788j49633j10198R0582j34947j01469M5839K10865K77502m8909k00942
$$ y = [23045, -144520, -293961, -265909, -110400, -160944, -313459, -6009, 137597, 308865, 327398, 270673, 182423, 59079, -75413, -288923, -575251, -903902, -702960, -202708, 113801, 49701, 137564, 230458, 193661, -202503, -305027, -69643, 265692, 221430, 222838, 464344, 420120, 372874, 238757, 89616, 163197, 238871, -38201, -221070, -206809, -247402, -466209, -382602, -522356, -694440, -545701, -423706, -301167, -317869, -436422, -147114, 238545, 367735, 211909, 220528, 365677, 444836, 305737, 91296, 39097, 196920, 370134, 246959, 17310, -605, 29244, -179672, -105261, -164251, -313513, -132107, 57788, -91845, -202043, -111461, -246408, -347877, -302038, -91173, 186329, 137420, -63522]
25415f3522p3754J50409L84797n4829j47266k35671j91631l7554P7141J32419
25405e9461k12228k01042J31829L90956K71349l6160j40121l2130j22086k15317
25395b24411l25945N8276K13080J46573L1583r450j26986k42462j18902J12810
25385d85834K60984L42586J52634o1519j49672J82818K13062J2350J96179j34589
25375E28999l30126q1751N7582k58589k87788Q1136J23799J81403r6355O1563
25365b0127K48023n0872o4071p900n3484Q7897k228k14417k00665M8310m208J52777
25353h0965L22011J65539k11355o5025n4641J3168j10001J89256o5423l0020m4770
25342B7774l7222k89102K16498M37992M9543J659K06539n00015j54448J41030
$$ y = [-63522, -137276, 13133, 397930, 343101, 195835, -39836, -231467, -269021, -191880, -59461, -271689, -472731, -340902, 50054, 321403, 285243, 145122, 112992, -9094, -224411, -550356, -492080, -279000, -132427, -100844, -110294, -237280, -479742, -598644, -485834, -224850, 117736, 270370, 208851, 59179, 241997, 455059, 467409, 663588, 528999, 198873, 117122, 174704, -83885, -371673, -290537, -166738, 14665, -81690, -20127, 227896, 177024, 112953, 105053, 51569, 139466, 137238, -77179, -277844, -229534, -233742, -80965, 241046, 406585, 195230, 130205, 75564, 88732, -21269, 167987, 102564, 72544, 27774, -9448, -298550, -82052, 355940, 405483, 407142, 613681, 113666, -40782, 100248]
25332A00248K52375L37361N5610n3522j11057j21414j3974J30948j44689m95849
25322f3963k28541o4150n5285K96815J84075r5834j5837l2305J33733J51678J39771
25311C50157o5073p9998k4417K64928J13704l48381q9509L92986l3318j67504
25301C13575l18636k4784n0648p68m4625J17428M8411P0154K3313R1705l40630
25290a15505L2189J41475p0610L3927R2633k1766r6524j2060j0377n1558J8035
25279f0141J20592J34025J10600j20965j38530j68671o0438J57030M4693N0898
25269F9093j16380j27677O6378K47478K11932R1871k41094j23502o7222J96598
25259B07475K95890j57309k96017j65079J95988K88677J890j67113R2719J14380
$$ y = [100248, 352623, 689984, 745594, 692072, 581015, 459601, 445627, 576575, 431886, -63963, -292504, -356654, -411939, -115124, 68951, -26883, -42720, -75025, 58708, 210386, 350157, 285084, 205086, 180669, 445597, 559301, 210920, 121411, 514397, 481079, 313575, -5061, -29845, -80493, -81261, -125886, -8458, 39953, 110107, 133420, 225125, -115505, -83316, 58159, -12451, 21476, 114109, 92343, -4181, -16241, -26618, -78176, -60141, 60451, 194476, 305076, 184111, 45581, -123090, -183528, -26498, 18195, 69093, -47287, -174964, -108586, 138892, 350824, 442695, 201601, 78099, 10877, 207475, 503365, 346056, 50039, -115040, 80948, 369625, 371515, 204402, 297121, 411501]
25249D11501j09683k66511o0699M01071J70969l35472l12349q583J63265j5772
25239C7737j53046J38861q0629j87642k04983N3357K77711J50761J28040J69712
25229C29879p3350o6724L16189K03399j1096J4220l17323J4619j50112j19886
25219A39815M5565l45231p0419J99059J27613K32195K20164p2465J19636m0983
25209E54949l01939j11339N582J04026m78383j8380K43791Q5341M4348n8431M4567
25198A14132K54711K0741j88789j39928j21585K37440R9805j9000j13743K8633
25188A72417J41376K3887p7291q0516j26437m4625m5608p1955j7230J36312J34157
25177A44487p5281P395k17505J3672M1646P9785J19521p6300r620K83556j43877
$$ y = [411501, 301818, 35307, -25392, 375679, 546648, 211176, -101173, -109756, 53509, 37737, -115309, 23552, -57077, -244719, -449702, -396345, -118634, 32127, 160167, 329879, 256529, 189805, 505994, 709393, 698297, 712517, 395194, 409813, 259701, 139815, 185380, -159851, -230270, -31211, 96402, 328597, 548761, 476296, 595932, 554949, 253010, 141671, 147253, 251279, -227104, -245484, -1693, 83648, 127996, 69565, 114132, 368843, 389584, 200795, 60867, -60718, 176722, 276527, 257527, 143784, 172417, 313793, 337680, 260389, 179873, 53436, 8811, -36797, -108752, -125982, 10330, 144487, 69206, 76601, -140904, -127232, -85586, -5801, 113720, 37420, 27800, 311356, 167479]
25166A67479k25072P3864K7232N7405p2207k01139J56419J32278l47970J82691
25156d9020K90848k26035k02369K18730M2825J42146N0933j03381q1186j02165
25146a8674p8715J32051K772J11505O0540j56608j11459J01591j13490k6171m7643
25135a44301j99176J29453K40288l0956j98541p294L1129n9553j58551J38411
25125b59091L2130j64545J15375K68260J13549j03859J42810K43851K65149j62160
25115D91469n13773j63382J72364n8512J74104O9787k69472O3174J77831m830
25105A38760j49766k3748K61564K4453R5091J6013R2538j9124k99991j61745k18848
25094b44803k35195J76051J6740K43265o423J26811J94827P1023j98000J09413
$$ y = [167479, -57593, 16271, 43503, 100908, 28701, -172438, -16019, 116259, -231711, -49020, 241828, 15793, -186576, 32154, 74979, 217125, 268058, 164677, 83491, -18674, -97389, 34662, 37434, 148939, 209479, 52871, -58588, 43003, -70487, -96658, -144301, -343477, -214024, 26264, -4692, -203233, -210527, -179398, -238951, -397502, -259091, -226961, -391506, -276131, -7871, 105678, 1819, 144629, 388480, 653629, 491469, -22304, -185686, -13322, -71834, 102270, 172057, -97415, -34241, 143590, 138760, -11006, -34754, 226810, 251263, 346354, 362367, 454905, 435781, 135790, -25955, -244803, -479998, -303947, -287207, -43942, -50365, 76446, 271273, 342296, 144296, 253709]
25084B53709m1540K9484O202l38328J69560N34476N5146l1926k12576N5176P2117
25073E51500k53639N3332J9690j78402r2163K75125J86140J07226k16407j72247
25063B80155j74679l3045K03687p0579J2182q8821O8140K5698n5020q7897j99477
25052a19656k37953k22299J11667L28243n7891J52453j39000r4540R8799L98886
25042B18709n6999k81171J31631L19934J03803k77625q5112L01487J07862J70967
25032F53486j53140j72553n0811j82434k61377M0210J77205l2794n0535k9700
25022f2443L6997J63260o5023k22358k0950J76679r1014L707r5485J31996K70247
25011B25613L39193N0149q1183l9460q2512L64q1997O161j49631j24832L188J9898
$$ y = [253709, 212169, 241653, 247855, -90473, 79087, 613563, 668709, 636783, 424207, 479383, 551500, 297861, 351193, 370883, 192481, 100318, 375443, 561583, 668809, 452402, 280155, 105476, 72431, 276118, 205539, 217721, 128900, 197040, 222738, 167718, 79821, -119656, -357609, -579908, -468241, -139998, -197889, -45436, -184436, -278976, -180177, 218709, 161710, -119461, 12170, 332104, 435907, 158282, 73170, 374657, 482519, 653486, 500346, 327793, 276982, 94548, -166829, -126619, 50586, 17792, -32743, -62443, -25446, 137814, 72791, -149567, -170517, 6162, -84852, -81145, -176630, -44634, 225613, 564806, 614955, 533772, 494312, 411800, 412164, 330167, 336328, 186697, 61865, 65053, 84951]
24999H4951J34624k60016k19164L35722L59502k10771J03646Q0975o8352l56971
24989a5854j92040K86864K52585k2723j04928j47788r2159j20659K2201K83287
24979A48786K46231j39992k48132P8354K70692J00265R4503J5132q4653k7917
24969D53269J20714o4999n6892j108L5110P5970J7216j52115l18839K58749O058
24958C73133k42920J49105j8926j39622K33009L35925l10158k68100J51694M97759
24948G60899K44591l81619m20473Q335K17252j9042J58612q6890j60422K75901
24938E97144J25135n9065L3294M1405J50774M6565m46803k07813K2301o8247j4683
24927B20007J5921n3594K8199k9699N5184P048k58083M1703K15360J42444j01070
$$ y = [84951, 219575, -40441, -259605, 76117, 435619, 224848, 328494, 409469, 341117, -15854, -207894, 78970, 331555, 308832, 203904, 56116, -36043, -156702, -134501, 148786, 395017, 255025, 6893, 85247, 355939, 456204, 550707, 565839, 481186, 453269, 573983, 508984, 452092, 450984, 486094, 562064, 579280, 427165, 108326, 367075, 373133, 130213, 279318, 260392, 120770, 353779, 689704, 379546, 111446, 263140, 760899, 1005490, 623871, 203398, 211733, 428985, 409943, 568555, 481665, 321243, 597144, 722279, 663214, 696508, 737913, 888687, 935252, 488449, 280636, 302937, 234690, 220007, 235928, 182334, 210533, 180834, 236018, 243066, -15017, 26686, 242046, 384490, 283420]
24916B83420K47838j401j52288N4006J55739J06734k5993J17887j00465p8520
24906F06957Q0249n5420L71119J99418l71581l29044M9645j1185J69468N786p0435
24895F44977N6652o6296J4904j05452q0149K45733K67547M2779j91811r2158K19543
24884I56269K53484j09319j63495J52378J32850r1229j67720m61980o4578J19169
24874E55829K82133M35634J75313r0509j75348O4409m5684j63286j48361q4577
24864H05553j91019R1449K63098L48049L36697J0520j84619k83931K09124K21742
24854A626663k52664m22405J44515N6466j70888j67655J49425J63219k19265k3557
24844H83854Q0060j8539J226J67558M48379K8116k84598O4521K15632Q1301l1988
$$ y = [283420, 531258, 529857, 377569, 431575, 587314, 694048, 668055, 785942, 685477, 606957, 687206, 631786, 1002905, 1202323, 830742, 501698, 551343, 540158, 709626, 715412, 644977, 701629, 635333, 650237, 544785, 464636, 710369, 977916, 1020695, 828884, 736726, 956269, 1209753, 1100434, 936939, 1089317, 1222167, 1130938, 963218, 501238, 436660, 555829, 837962, 1273596, 1448909, 1358400, 1183052, 1247461, 1201777, 1038491, 890130, 805553, 614534, 705983, 969081, 1317130, 1653827, 1664347, 1479728, 1195797, 1404921, 1626663, 1373999, 951594, 1096109, 1152575, 981687, 814032, 963457, 1126676, 907411, 883854, 963914, 945375, 946601, 1114159, 1562538, 1590654, 1306056, 1370577, 1586209, 1667510, 1635522]
24833A635522j63610j02712q4737J47244J02015n823L5909J45512n8342j24380
24823A526598o7828j90892o7601L96631O9523j47233J1740j3245Q282N9250K22012
24812A807237P4072q9217L994J95018O3096l16456k07073j06379M7831m7119q9680
24801A335324n7500K58673n0284Q8321r2546M0868r9845m6126j77059k31694r5576
24790H72556q2599K57709J56220M8631J50064P7501j45100j6300j37558q1387
24780A099737J49927J87016q6638o1667L4588k17055k83917p1235Q9484J38682
24770I78922K0203k94153o6291L19196N2910j2537M6905o6126k88412J5601j05961
24759F00257J05438j76162J52781m6508p8707q9768j07468q8932K62905p8125
$$ y = [1635522, 1471912, 1369200, 1284463, 1431707, 1533722, 1527899, 1563808, 1709320, 1650978, 1526598, 1458770, 1267878, 1200277, 1596908, 1666431, 1519198, 1530938, 1517693, 1525975, 1585225, 1807237, 1881309, 1792092, 1796086, 1991104, 2054200, 1737744, 1530671, 1424292, 1472123, 1425004, 1335324, 1277824, 1536497, 1486213, 1574534, 1481988, 1522856, 1423011, 1376885, 1199826, 968132, 872556, 789957, 1047666, 1203886, 1252517, 1402581, 1480082, 1334982, 1318682, 1181124, 1099737, 1249664, 1436680, 1350042, 1288375, 1322963, 1105908, 821991, 750756, 840240, 978922, 999125, 704972, 638681, 957877, 1010787, 998250, 1045155, 979029, 690617, 706218, 600257, 705695, 529533, 682314, 635806, 557099, 467331, 359863, 270931, 533836, 455711]
24749D55711J0271K85542j28411Q3684R0669j6895l0285o1926o9789J82097J83048
24738I83716m7113k73784J76590J61204O4858J79979l53845l32693l71619Q0932
24728B68225K27310J78411o8397j43369J23379j46510q7018p6642r9388K07160
24718C83161K5505j24685k27240J116J24508J56998O2657M7128k4919k92515m3971
24707H7743J46927j73662P0172l613M5446M3145J14894n5349l29120L09832j39789
24696A16626P842J6341J12486j40190k17508J53086J24442K42392M5297j40399
24686C20415p9228l43035j69138m4748L4293J03661K80956L67334L8828j9413
24676D89925j03966k81505M3680J26556R7083k92700q3176m8245J25926k15086
$$ y = [455711, 465982, 751524, 623113, 706797, 797466, 780571, 750286, 688360, 618571, 800668, 983716, 936603, 662819, 839409, 1000613, 1065471, 1245450, 891605, 558912, 187293, 268225, 495535, 673946, 605549, 462180, 585559, 439049, 352031, 275389, 176001, 383161, 408666, 283981, 56741, 57857, 182365, 339363, 402020, 449148, 424229, 131714, 87743, 234670, 61008, 131180, 127567, 173013, 216158, 331052, 275703, -53417, 256415, 116626, 124468, 140809, 253295, 113105, -104403, 48683, 173125, 415517, 460814, 320415, 241187, -101848, -270986, -315734, -281441, -177780, 103176, 470510, 509338, 489925, 385959, 104454, 148134, 274690, 371773, 79073, -4103, -52348, 73578, -141508]
24666a41508j61482M0421M71946K14353J4569k80958P6992L04825J27502p0648
24656E96012K5645Q4909K9897j22334j94618J08990l686r6715K30897l0471j44177
24645D84349k48024n2693Q6845j27569j18758J71364K53896J0171j30559O8248
24635C97270J02344r3367j39590Q5324K2325k23932r2815j09057J77040J4764
24625A40306O0214J53430j16989n7221j93035o3255N01573L2493M5582K0821j07367
24614D16552l2902j2800q3712J4312j73509j29204J0265Q0069J40180J31648j21986
24603B38913m9717j36547O204J15504J625p9502j48245k98638J85269N74115L51596
24592G60577j72926j95773l69301j28424r5304q4545J22663M6366K95425L29007
$$ y = [-141508, -302990, -262569, 209377, 423730, 438299, 157341, 234333, 539158, 666660, 596012, 621657, 706566, 736463, 614129, 419511, 528501, 524815, 428100, 658997, 628526, 484349, 236325, 183632, 270477, 142908, 24150, 195514, 449410, 459581, 329022, 397270, 499614, 406247, 266657, 351981, 374306, 150374, 57559, -51498, 125542, 140306, 200520, 353950, 236961, 179740, -13295, -76550, 425023, 457516, 503098, 523919, 416552, 383650, 370850, 287138, 301450, 127941, -1263, 9002, 89071, 229251, 360899, 238913, 189196, 52649, 58853, 174357, 175982, 96480, -51765, -350403, -165134, 408981, 760577, 587651, 391878, 22577, -105847, -201151, -285696, -163033, -116667, 178758, 507765]
24582E07765O4786j24279l97618k49149J24986J1391J21045k52836r2109M1263
24572b44755K78779j47098k45478J86588K25107j9715j84369j1579m4241k3784
24562b30545M0758N2486j78294O6023M6020J3749q6053K34137L70347J88399p4089
24551D42938j46334r9752j21649j05093R4560k91609r6665R3496J46608j23325
24541b06825K50550L31068K5143k89142j11279J0002K02353L6817k5315k43603
24531b0231o3791k009L9737R3066R448k9032j39291j87452j18343L60392M59854
24520D02348J65594m881k50486p128R3463n0322r7602j1250r378q4410J60250
24509C06198N1877l39046k53785M7207p5235K61326l5059J36288J19842m5982
$$ y = [507765, 572551, 448272, 50654, -198495, -73509, -62118, 58927, -193909, -286018, -244755, 34024, -113074, -358552, -171964, 53143, 33428, -150941, -162520, -206761, -230545, -189787, -137301, -315595, -249572, -203552, -189803, -275856, -41719, 328628, 517027, 442938, 296604, 196852, 75203, -29890, 64670, -226939, -323604, -230108, -83500, -206825, 43725, 374793, 399936, 110794, -485, 9517, 211870, 248687, 223372, -20231, -84022, -86031, -46294, 46772, 56220, 27188, -112103, -299555, -417898, -57506, 402348, 567942, 563061, 312575, 305447, 398910, 348588, 250986, 239736, 230358, 145948, 306198, 358075, 19029, -234756, -187549, -262784, -1458, -36517, 99771, 219613, 173631]
24499A73631m14520k6795J58539j99404J06024K40036J73127m9601p5818J6636
24489A01855n6532J35255j40545N0209K21733J07280r0355r9873q3356j6321j41276
24478a1926p5057K08592k1292O732l1219N1683j19890l46844j9660j79939q9038
24467f27858K49352L29876J37701j71581J11279J45707N4640j48479J06354j11336
24457G5655J04108R2513k39804o6381L82508k3765k57740l49580m6973J26589
24447b02870L41627o9260j48695K31721L9976k78309j46838O5748K5207J57801
24437A6108M2476J8159J69133Q868j82501k74391k67601M9065l1534n8859K95933
24426b15144M27797j2461J13686j05358m8987Q0375K17684J34405j60871l37660
$$ y = [173631, -240889, -267684, -109145, -308549, -202525, 37511, 210638, 161037, 85219, 101855, 45323, 180578, 40033, 90242, 311975, 419255, 328900, 229027, 145671, 129350, -11926, -86983, 121609, 100317, 107049, 75830, 127513, 7623, -339221, -358881, -538820, -627858, -378506, -48630, 89071, -82510, 28769, 174476, 229116, 80637, 186991, 75655, 179763, 272276, 32472, -33909, 348599, 324834, 67094, -282486, -329459, -202870, 138757, 69497, -79198, 152523, 192499, -85810, -232648, -166900, -141693, 16108, 58584, 76743, 245876, 254744, 72243, -202148, -469749, -420684, -452218, -511077, -215144, 212653, 200192, 313878, 208520, 159533, 239908, 457592, 591997, 431126, 93466]
24416I3466k0199j65771L68624K30440l00757K80766j7800j27715J6294J06834
24406D64182j00848k24104N2285Q2185J54920o9159j82337N8942O4224l73554
24396g3264J23476L75422k9756l41795M1576j33566M0436j20045k89363L3130
24386c73749Q3619M4292J31142M41750J76811j29673m8079j72822j41035j25740
24376a13484J73018n3181J28674Q4314j3942o8986J59274O1061l49007j06052
24366i8311o3390L5124m2511k9742K34111r748k70422J94512J42677j37742N2359
24355F917M2035p6981J11422J15530J47064m27638k90106J28752J83147j4669
24345g4527l7588o7266o9695j43842J21627k976P8817q5152K1378O0133k074J35620
$$ y = [93466, 73267, -92504, 276120, 506560, 205803, 486569, 468769, 341054, 357348, 464182, 363334, 139230, 191515, 273700, 428620, 359461, 177124, 236066, 300290, -73264, 50212, 425634, 395878, 54083, 95659, -37907, 2529, -117516, -406879, -373749, -290130, -245838, -114696, 327054, 503865, 374192, 326113, 153291, 12256, -113484, 59534, 6353, 135027, 219341, 205399, 136413, 295687, 356748, 7741, -98311, -161701, -126577, -169088, -198830, 35281, 25533, -244889, -50377, 92300, -45442, 6917, 48952, -28029, 83393, 198923, 345987, -81651, -371757, -243005, -59858, -74527, -112115, -179381, -249076, -392918, -271291, -274267, -195450, -280602, -259224, -199091, -201165, -65545]
24333f5545k4471N7324R1350j8413l39844j06512K57091K02961N2584j52949j82868
24322b29292K3767n4063j15756j51211J38675J54152j11854k4937M7921K60600
24312f1998J18182k51458l3866j06510N3204K46581q88l3014P3882j49451L3969
24301a11367N583O5564K56927j87705j67241j76447K1876L10736k5817r1496L98787
24290B99400K615j70122j77695P9960R0204k75753J28683k31462R201J0698M6009
24279a88262l6178J48095L55207J3557K4049M7513r7647l49963M929L00535q667
24268B13168K0803k65145r8008j27564j13372L26490J56938p0091J0395R7207
24258A50821n6909j45051j36146O7816J16602L48148o5034k61057j13201m6495
$$ y = [-65545, -90016, -32692, 58658, 40245, -299599, -406111, -149020, 53941, 106525, -46424, -229292, -205525, -259588, -375344, -526555, -387880, -233728, -345582, -370519, -322598, -61998, 56184, -195274, -229140, -335650, -282446, -35865, -36753, -69767, 4115, -145336, -111367, -105784, -40220, 216707, 29002, -138239, -314686, -292810, 17926, -7891, -99387, 299400, 302015, 131893, -45802, 34158, 124362, -151391, -22708, -254170, -244969, -234271, -188262, -224440, -76345, 278862, 292419, 316468, 363981, 266334, -83629, -78700, 221835, 213168, 233971, -31174, -129182, -256746, -370118, -43628, 113310, 43219, 53614, 150821, 93912, -51139, -187285, -119469, -2867, 345281, 280247, 19190, -94011, -140506]
24248a40506J05086j74127j43110J8474J38808N3897N7267j19924L03973j06419
24238f581J03130j16148j19358Q391K19792J56215k52973k07680K52828J37124
24228A74740l13252R5516K35928j57042k65201L544K37151K9299Q6677J80659
24218C08019R2863l2646j19802k74705r2358K15313J13728K03313Q3274l6588
24208D60411K13084l5031k79160j18576J04909J15784q3188k0685M9563q7678
24198C19433J7371o7082O5514j46635k80185P1847K9690r0547m9218J8177k2558
24187a34193R1474p5853M0417P2760j90493K0678N1669K3167k7565k11957J96875
24176a43021J58739Q7939j4832O3301j38537l660k52255K32262J71631K6452n1316
$$ y = [-140506, -35420, -209547, -352657, -334183, -195375, -141478, -84211, -204135, 99838, -6581, 96549, -19599, -138957, -130566, 89226, 245441, -7532, -215212, 37616, 174740, -138512, -42996, 192932, 35890, -229311, -225767, 11384, 40683, 127360, 308019, 400882, 368236, 248434, -26271, -118629, 96684, 210412, 413725, 496999, 460411, 673495, 638464, 359304, 240728, 345637, 461421, 378233, 357548, 407111, 319433, 336804, 269722, 335236, 188601, -91584, -19737, 9953, -80594, -129812, -111635, -134193, -42719, -118572, -78155, -5395, -195888, -175210, -123541, -100374, -127939, -339896, -143021, 15718, 103657, 88825, 152126, 13589, 9929, -242326, -10064, 161567, 188019, 136703]
24165A36703k37905k17919n7535J5132J27228K8216q6576N1306J10883N9296J07670
24154C6499M8833j02894J16550M4486n6262j25266j80944P2793M50683j02517
24144B01961j92499k37154R7907J28230J3295n9808j42761J84742K69856J81859
24134D45628j46504k1295m10421j36452J52308J53341K1686J9188J52770j08653
24124A21596o5012j26927q0922O7294K69249l3531P2517k02638l25303O5375K2684
24113b15618m5809J94992l6078j19937m0130J4136K18248M13890P9042j72605
24103B90131L9952J08015k43196l17607l6808r749J34611n6213k09159j42751
24093d42774K8149n035k7649J73351M21768J02892r5436l79595l12435K17956
$$ y = [136703, -101202, -319121, -376656, -361524, -234296, -206080, -292656, -241350, -130467, -71171, 36499, 85332, -17562, 98988, 143474, 87212, -38054, -218998, -146205, 304478, 201961, 9462, -227692, -129785, -1555, 11740, -48068, -190829, -6087, 263769, 445628, 299124, 277829, -132592, -269044, -116736, 36605, 58291, 77479, 230249, 121596, 56584, -70343, -151265, -83971, 185278, 151747, 224264, 21626, -303677, -238302, -215618, -261427, -66435, -102513, -222450, -262580, -248444, -30196, 383694, 462736, 290131, 330083, 438098, 194902, -122705, -159513, -169262, -34651, -90864, -300023, -442774, -414625, -419660, -447309, -273958, 147810, 250702, 155266, -224329, -536764, -318808]
24083c18808K01613J7149M7169J62256j02228O6673J88075k2692j35167J135R8488
24072B03663M0028k45017j80326J63996J10877r108j66782J13541j01961l241
24062g4330l20813j52570k8090K91893J86489j28761j00319M00963J74674q5653
24052A63483j98118k6936p5503k25106J32850J54958K99056n1374j62940p5797
24042f5427J9791J53039N6608J90723P1607K14765j57357k61984n2132j30233
24032C9400j9588L81J9096j99587j38966L646N0781p7219j07092K77641J74795
24021B3288J91657k37488j90289J25679J3057j3713Q0457J42941j37427p9382
24011h1220O0918p0453j4640K5201j85222j07929J72256J25524Q6793j70743j04632
$$ y = [-318808, -117195, -100046, -52877, 109379, 7151, 73824, 261899, 239207, 104040, 105175, 203663, 243691, -1326, -181652, -17656, 93221, 84113, -82669, 30872, -71089, -74330, -395143, -547713, -575803, -283910, -97421, -226182, -326501, 74462, 249136, 163483, -34635, -61571, -137074, -362180, -229330, -74372, 224684, 173310, 10370, -65427, -45636, 107403, 164011, 354734, 426341, 641106, 483749, 221765, 169633, 39400, 19812, 20193, 39289, -160298, -299264, -295618, -244837, -322056, -429148, -151507, 23288, 214945, -22543, -212832, -87153, -74096, -87809, -7352, 135589, -1838, -81220, -20302, -90755, -105395, -80194, -265416, -373345, -201089, -75565, 11228, -159515, -264147]
24000b64147J4596m00529o3600L74077r1860J58720O0841R1050N4936L7486O3972
23989C5542l11522k3599K43928J62747m454L5901K9561n4415J43415J16674j35362
23978B38416p4375k6810j72324l56033r803k0036K3636L45666k0298L8169q5747
23967a19539j65851K2403K21225j54545k52187J46262J69572l07127l6658J55633
23957c20812M3521J92628J71250n8013k66385M2877n18L02429O9834k16511j92109
23946b31809j98222j20989K92607N42397K43225k02359p6774k6465l647k71639
23936e3675L2122l2448j73087J94832l1463p9643M3145J35328M6939m4833J27237
23925A64454m6670n697r7288l32739j22462K28315k03408N780J96827L01104Q0067
$$ y = [-264147, -249551, -650080, -713680, -339603, -431463, -272743, -211902, -120852, -65916, -28430, 35542, -275980, -299579, -55651, 107096, 102642, 138543, 168104, 113689, 257104, 373778, 238416, 164041, 137231, -35093, -391126, -400929, -420965, -397329, -51663, -71961, -33792, -119539, -285390, -262987, -41762, -196307, -448494, -302232, -132660, -439787, -476445, -320812, -277291, -84663, 86587, 28574, -237811, -194934, -195452, 106977, 176811, -39700, -231809, -430031, -551020, -258413, 283984, 527209, 324850, 248076, 221611, 217964, -53675, -21553, -54001, -227088, -32256, -63719, -143362, -100217, 35111, 82050, 37217, 164454, 117784, 112087, 14799, -317940, -440402, -212087, -415495, -409715, -212888, 88216, 168283]
23914A68283j39247k89152l02478J08993J89300K24901j77795j40827p6398M86445
23904E2025K14809r5136k98416j94821p7838k02252j07513K32786L32382J25355
23894a8619O5191J60943k86534j44341K11182J43640j00681j83766J4346p922
23884a46561P7363J39003L38669M9296q5481j71510l0649K027n746L3745k86145
23873h5989j11052O8309R7061p0286j3033K19299n0568k3260m857N6243j68035
23862h6168o2944P1192q1089k37860l7994n5214L34686J68431L7756n5037r5193
23851i9434m50406j12210K38195K14957J89500K4049J15410J70166j7954k69170
23841C103l8287k29138j57567J66433j7651o1338K64621M05539J44557j68083
$$ y = [168283, 29036, -260116, -562594, -453601, -264301, -39400, -217195, -358022, -434420, 52025, 266834, 171698, -126718, -321539, -399377, -601629, -709142, -476356, -143974, -18619, 46572, 207515, -79019, -223360, -12178, 131462, 30781, -152985, -138639, -146561, -69198, 69805, 408474, 457770, 372289, 200779, 170130, 172157, 166411, 200156, -85989, -197041, -128732, -31671, -101957, -114990, 104309, 53741, 30481, 25624, 81867, -86168, -149112, -77920, -159009, -396869, -434863, -490077, -155391, 13040, 50796, -4241, -99434, -549840, -662050, -423855, -208898, -19398, 4651, 120061, 290227, 272273, 3103, -35184, -264322, -421889, -255456, -273107, -334445, -69824, 335715, 480272, 312189]
23831C12189j76782j04949j66273J30312j55294k90117J55171J92690K61256P4455
23821B32658r3251j87436J85972O4003M2217j35611K1337l45033m4056K05990
23811e3210J22824j30853j10476J2541J27564J8505q1444m4956L03334j13013
23801E0816J37121n0445j52803j14701j4255Q6383k7943K0747o3599l2585j88238
23790c49502K21991P5992J15062P339r8026J5876K01741p3943j62727J50684R4858
23779A99345j09980J85848R6970p4398N2328J00388l28655O7125Q3566r3460l32037
23768a52960j76890O7777j06465J82915J60004K0035J61049k44892j37822M6750
23758a80499L2690k50j14830P1038J20706o9748J68227J14256R1006j15737R2293
$$ y = [312189, 135407, 30458, -135815, -5503, -160797, -450914, -295743, -103053, 158203, 232658, 139407, -48029, 137943, 201946, 244163, 108552, 129889, -215144, -259200, -53210, 69614, -61239, -171715, -159174, -31610, -13105, -94549, -139505, 163829, 50816, 187937, 137492, -15311, -130012, -144267, -57884, -85827, -65080, -128679, -161264, -349502, -127511, -51519, 63543, 70882, -27144, -11268, 190473, 116530, -46197, 104487, 199345, 89365, 275213, 372183, 297785, 350113, 450501, 121846, 188971, 272537, 179077, -152960, -329850, -262073, -368538, -185623, -25619, -5584, 155465, -89427, -227249, -180499, -147809, -148059, -262889, -191851, -71145, -140893, 27334, 141590, 232596, 116859, 209152]
23747B09152J4725k47462J25491n3998M5403J896j08629k2480M6549L6318l28472
23736b81507l09341J18775j441j81423K93726K98608K6875l4207p1545j81292
23726c22772L57310j46913l06640K9358j39720l4515K79612J35276l2750N7195
23716a24559J32750r5235k85056j21352J11249L08794J58856l3958j88798J00219
23706c7090M74954j84243k42583l8176k8959k30404j8397J72014R5438K27135
23696A89689M8099q5359k64293M3610j19721j9914P2947J38353j34811N7780J05478
23685C1858N0145j10591J7322K98338j18811j77327N2016j14495j3126N3045L862
23674b7764J20041N9311j18724j21241O1862J0357N0595L47273L36821k61714
$$ y = [209152, 223877, -23585, 101906, 47908, 93311, 95207, -13422, -35902, 10647, 46965, -281507, -590848, -472073, -473514, -654937, -361211, -62603, -35728, -69935, -141480, -322772, 34538, -112375, -419015, -389657, -529377, -563892, -284280, -149004, -181754, -124559, 8191, -87044, -372100, -493452, -382203, -73409, 85447, 51489, -137309, -37090, 437864, 253621, 11038, -27138, -56097, -286501, -304898, -132884, -37446, 189689, 237788, 152429, -111864, -68254, -187975, -207889, -134942, 3411, -131400, -73620, 31858, 82003, -28588, -11266, 287072, 168261, -9066, 42950, -71545, -84671, -31626, -27764, 92277, 151588, 32864, -88377, -26515, -16158, 34437, 381710, 718531, 456817]
23664D56817l83808M2403l13655k35013J31580p6047o0685J49894j31248M5997
23654c73765K99904O9472P9821K24734M9701k88357p6700K78777Q6438j88464
23644A61561L0534J58800j42533k61886O2073j82669k45144J91177Q1399R1535
23634e5153K22703j18686m2204m8466J46079j90699r2138J63285R0074l58217
23624b83422k73885J08113P781J8883N72088p3441k24434K55641m8659m4708n2936
23613c8979O3698j72877l25860p5630K79663J07481J16722R4760m76729J14689
23603c13062J61732k41331L174L50250k9794k9602j75035J3857J35162J45146
23593B0497j4675O1140J91852j32183k4831j13089K8167n2359n332J39162j14367
$$ y = [456817, 73009, 115412, -198243, -433256, -301676, -377723, -438408, -288514, -419762, -373765, -73861, -4389, 75432, 300166, 349867, 61510, -15190, 263587, 350025, 161561, 192095, 350895, 208362, -53524, 8549, -174120, -419264, -228087, -146688, -55153, 167550, 48864, 6660, -41806, 104273, -86426, -178564, -15279, 74795, -283422, -557307, -449194, -441413, -422530, 149558, 76117, -148317, 107324, 58665, 13957, -38979, 24719, -148158, -474018, -549648, -269985, -162504, -45782, 48978, -427751, -313062, -151330, -392661, -389487, -39237, -69031, -98633, -273668, -259811, -124649, 20497, 5822, 66962, 258814, 126631, 101800, -11289, 16878, -35481, -40813, 98349, -16018]
23582a6018k2680N012r0451k55886K32169J4793j13568N0061L12310O7895j78463
23571E174N6564j10936J5124J28510J43349p3205j05233o113j45243O6933j0536
23560c5612J17579l5872j524j47891l85698K30385K01333q4782L82078j7769m33228
23549b11001J5254M2549k6291J50072K2374M8670l8402j14395l33737K0902J5253
23538d08752L1195Q9972m7513j69450k466k55345N2487m6298J51317L94578j25408
23527c35683q3936R1723Q8966j3192K3181j07058O5663q5256J06723K54926R9095
23516A05152k11828m6813K33036j02048j642K75581J47098K0699m1105j66697
23506B11433n0139j06777j38282N5506J26422j29837k46604M6839M59421J86702
$$ y = [-16018, -38698, -33686, -124137, -380023, -147854, -133061, -246629, -196568, 115742, 183637, 5174, 61738, -49198, -34074, 94436, 237785, 164580, 59347, 53234, -92009, -25076, -35612, 81967, 46095, 44571, -103320, -489018, -258633, -57300, -142082, 239996, 222227, -211001, -195747, -153198, -179489, -29417, -7043, 41627, 3225, -111170, -444907, -424005, -408752, -377557, -287585, -335098, -504548, -507014, -762359, -709872, -756170, -604853, -210275, -335683, -419619, -327896, -238930, -252122, -228941, -335999, -270336, -355592, -248869, 6057, 105152, -106676, -153489, 79547, -22501, -24143, 251438, 398536, 419235, 378130, 211433, 161294, 54517, -83765, -28259, 98163, -31674, -278278, -231439, 227982, 414684]
23496D14684k18786j88593k5373J28817L576k0024K45646j76581r9372O9556K59495
23485C93045p9809l30763p0556o1329k38642K5223K27771j00077J08105r288N5499
23474h0821N2030k19593k4804j353K62310K09750M5876j97677j20878K3176N6
23463e1928J02749q0634j31119L16183K15336l51338j59080L27410j79675l83809
23453c75905N1327J10278K88908n8452k24280j15166J72798N88045K13976k58652
23443C92877j70408n5077N5113K00965j46067l4424k4763j0733q1406j389M6330
23432A71018j62411k14142J78302q6263J56978K46372j65589j42991o6474j23774
23422b08974N1714m9530L8481J02537K03506J18183P8855P7379J12923k34715
$$ y = [414684, 195898, 7305, -18068, 110749, 114325, 94301, 339947, 163366, 63994, 133550, 393045, 313236, -17527, -88083, -149412, -388054, -362831, -135060, -235137, -127032, -136320, -80821, -28791, -248384, -273188, -274541, -12231, 197519, 243395, 45718, -75160, -51984, -51928, 50821, -29813, -160932, 155251, 370587, 19249, -139831, 187579, 7904, -375905, -324578, -214300, 74608, 16156, -208124, -323290, -150492, 437553, 651529, 392877, 222469, 167392, 222505, 423470, 277403, 242979, 218216, 207483, 126077, 124688, 171018, 8607, -205535, -27233, -113496, 43482, 289854, 124265, -18726, -85200, -208974, -157260, -206790, -168309, -65772, 137734, 255917, 334772, 412151, 525074, 290359]
23412B90359j85280m8493k53406q5209l25376Q6759K50872m3461N9617P2211J57032
23401b4375n2292J14741M7639J64671j41521n336o3708j36267j59765l48785M15548
23390a89450K93226R5405n5963k28881j75790n5605M6885N5817N4725n8345j42692
23379c60668K12361K81219L540l26568p5135k4087J50905J19411j25849m0195
23369a85066k42142J7436L2517m9787L76194K15436j49611j82795P4138J86936
23359I3256M295j05155j88571k5051r2636L14549J54024k51812k29124j96166
23349e22391J53344K18053K67664o3026k05675p2027j05489K89468K55836O6797
23339B82554m4383k46873R7603J19220l53806q1017n0049k01642L57486J96752
$$ y = [290359, 105079, 56586, -196820, -282029, -607405, -520646, -269774, -313235, -253618, -181407, -24375, -76667, 38074, 85713, 250384, 108863, 103527, 39819, -96448, -256213, -604998, -189450, 103776, 199181, 143218, -85663, -261453, -317058, -270173, -214356, -159631, -217976, -360668, -148307, 132912, 136452, -190116, -265251, -289338, -138433, -19022, -144871, -185066, -427208, -409772, -377255, -427042, -50848, 164588, 14977, -167818, -93680, 93256, 97551, -7604, -196175, -221226, -313862, 687, 154711, -97101, -326225, -522391, -369047, -150994, 116670, 53644, -152031, -224058, -329547, -40079, 215757, 282554, 238171, -8702, 88901, 208121, -145685, -226702, -276751, -478393, -120907, 75845]
23329G5845J67541J38043k9080j21558k0147Q945l89821o15j3517K85845N2946
23318A54427m89414o639J73147l03970P2171N46438M9617k80364M8576Q8870J37778
23307A90637l72793k12927J71288l7513j67833J14876j56166k49352P83o128J10560
23296f14568K86207j5878K01832m5881j40312k06337Q8132j28107j96370K35286
23286e35996L36344J65039r6049k8185m45418N3680K94061J27166r235P178j49604
23275b81019j60300J75090K46341m2880J02077J19206k41739l00901J41977K78634
23265C6486m1571k47825p6070J5347j17290J75058J52446R563J9869J4663k54440
23254c13764k96783K44150M70868J21610N6125k36159R5603J58479j52353p9593
$$ y = [75845, 243386, 381429, 352349, 230791, 210644, 219589, -170232, -170847, -184364, 101481, 154427, -334987, -341626, -168479, -472449, -400278, 146160, 195777, -84587, -36011, 52859, 190637, -182156, -395083, -223795, -261308, -429141, -314265, -470431, -719783, -719000, -725128, -614568, -328361, -344239, -142407, -188288, -328600, -534937, -446805, -574912, -771282, -535996, -199652, -34613, -130662, -158847, -604265, -550585, -256524, -129358, -138593, -131415, -281019, -441319, -266229, -19888, -62768, 39309, 158515, -83224, -384125, -242148, 36486, -5085, -252910, -328980, -313633, -430923, -255865, -103419, -93856, -73987, -59324, -313764, -610547, -366397, 104471, 226081, 282206, 46047, 141650, 300129, 147776, 68183]
23244F8183n09496J78467M45594M4762r8839K455J31669j0864k92953j04323J93482
23233D8137K79013j53708j42493j0718j24555K8756j1972o6272K48595j09896
23223a5113j55767L7031K10644j30943j19023l13551K70062M46900J0701m92784
23213b51843j43076L1369J07072q2999o5168K90551L67591K34994n1531j34606
23203C02354j20315R861j52427j37976K7719J77227k4367K6933P0910k83925L1901
23192g2105j6663R9841K04900L8201O6428J05656q0832J5641p270J54104m4127
23181D63774k611r2270l15536k8736r7261J17276j87482M6709J96930m9923m8102
23170B768J29582l7218k96108M897k4651q5751J02093K21641Q0265K22405M6764
$$ y = [68183, -441313, -262846, 182748, 227510, 128671, 131126, 262795, 251931, -41022, -145345, 48137, 327150, 173442, 30949, 20231, -104324, -75568, -87540, -153812, 94783, -15113, -170880, -133849, 76795, -54148, -173171, -486722, -216660, 230240, 240941, -251843, -394919, -363550, -256478, -339477, -404645, -114094, 253497, 488491, 436960, 302354, 182039, 191900, 39473, -98503, -70784, 106443, 82076, 109009, 179919, -104006, -72105, -88768, 11073, 215973, 254174, 320602, 426258, 345426, 361067, 353797, 507901, 463774, 461163, 368893, 53357, 24621, -72640, 44636, -142846, -96137, 100793, 50870, 2768, 132350, 95132, -200976, -196079, -220730, -306481, -204388, 17253, 97518, 319923, 366687]
23159C66687k64458p4455K36243j99136m39952j16052Q7036j9039J44989Q8170
23149a89967K6888k3894J27230m2968J74876J06377R0747m9762j27878j65653
23139g4004j75126N9576M27547J43113m16545k17448J67779K68091k9964m6568
23129A06451k63345j92728R4028p6704j118J79838K77017j22359L01947L57160
23119F60187j91271m40636k96659J12970K71847N9525K0446J70528j21447j04502
23109A40988j39896p3245j34928J35830J58384j31561o5856o3586K12550K35384
23099B74064l57975n7281J01035L8818p0916l4532M30l14073L1719K52509J45175
23088H973Q28k94275k73682j42875K02665L06331N174m7553O3528j80428L31250
$$ y = [366687, 102229, 27774, 264017, 64881, -375071, -491123, -404087, -423126, -278137, -189967, -163079, -186973, -59743, -102711, 72165, 178542, 269289, 219527, 91649, -74004, -249130, -189554, 237993, 381106, -35439, -252887, -85108, 182983, 153019, 106451, -156894, -349622, -255594, -332298, -333416, -153578, 123439, 1080, 303027, 660187, 468916, 28280, -268379, -155409, 116438, 175963, 196409, 366937, 245490, 140988, 1092, -72153, -207081, -71251, 87133, -44428, -110284, -173870, 38680, 274064, -83911, -141192, -40157, -1339, -72255, -106787, -106357, -420430, -388711, -136202, 8973, 9801, -284474, -558156, -701031, -498366, -192035, -186861, -234414, -170886, -351314, -20064]
23077b0064J50394j6969l01761n7469k26913j7248R3378n4958j17137j64287p487
23066g40521K43392L68594P0054L04048L2805k12951k40998k02831K0416m7517
23056d05509N8317J21455k3513j04211j2591J8180Q9586j04869L7577K77010j08614
23045a57182j64176K33799J15889m81032j38090M8430J23136P1752J87942p5133
23035b34665J0570j7193O5630J91162J1130J20636R8923m25015N6216J06665J1062
23024d879j68621j15492j02288l7399M12515L51342j58598k56528l25140q1354
23014d86442J25436O5928q530j6436j89336j55069J96916j92633Q0338L95826
23004a84002L05775K4304p5012J18247L9834j07800j66105q3454M63227l8847
$$ y = [-20064, 130330, 113361, -188400, -245869, -472782, -490030, -396652, -451610, -568747, -733034, -740521, -497129, -128535, -58481, 245567, 278372, 65421, -175577, -378408, -357992, -405509, -347192, -225737, -249250, -353461, -366052, -347872, -258286, -363155, -325578, -48568, -157182, -321358, -87559, 28330, -452702, -590792, -542362, -419226, -347474, -159532, -234665, -224095, -241288, -175658, 15504, 26634, 147270, 246193, -178822, -122606, -15941, -4879, -173500, -288992, -391280, -428679, -16164, 335178, 176580, -79948, -405088, -486442, -361006, -295078, -303608, -320044, -509380, -664449, -467533, -660166, -579828, -184002, 121773, 146077, 71065, 189312, 229146, 121346, -44759, -128213, 335014, 296167]
22994B96167R3481n8480j48054l20819R1230K4364m3125m4559J07127k56613j08025
22983c67306R3501J78879j5177j43248n9218J69782M73441k11772j31722j26099
22973a38939J59284J2708K5680K44043J85858l82411k89086r5499j68810K8331
22963d18841Q4352J26515L44917J85737j18468q4141k2379J11956k34855k7246
22953e2453P1532j23549J27482r2621L23518J94785J66333J76659r7923k70894
22943D22869m32951j09946J05039l4880k20246J03891P168o5390O0016J21552
22933d2878k01347k36464l8892r3280J92558K80237j440K096j78673k9327K70129
22922g7281J74276j72576j49536J42114o4760m9858Q914O5599J64740Q3463J76201
$$ y = [296167, 389648, 331168, 183114, -137705, -46475, -22111, -65236, -109795, -2668, -259281, -367306, -273805, -94926, -110103, -253351, -312569, -142787, 330654, 118882, -12840, -138939, 20345, 33053, 58733, 302776, 488634, 106223, -182863, -278362, -447172, -418841, -334489, -207974, 136943, 322680, 204212, 120071, 97692, 209648, -25207, -52453, 19079, -104470, 23012, -69609, 253909, 448694, 615027, 791686, 693763, 422869, -10082, -120028, -14989, -49869, -270115, -166224, -159056, -224446, -164430, -42878, -244225, -480689, -519581, -612861, -420303, -140066, -141506, -139410, -318083, -347410, -77281, 96995, -75581, -225117, -83003, -147763, -197621, -188707, -123108, 41632, 125095, 301296]
22911C01296p2275l8962q2157j55313J2707k5075k00103p7405K41360J13994q8921
22900g0854j41628K21169O4570k48859M629Q9261O2089K07185m657J40255j00451
22889B22709k33756j1867O7800J35151J68159k47548k38521J0333j57377j44793
22879d29710K79480Q4857p0968j24802n6691P1433J91344K23985r7656K8181k36145
22868a36692j61335p3126K06542P8950P0815J70164J2452n6568j06189k07395
22858b02382Q4398K10579J29945k01402k087L97601K5577n7270l10733k69124
22848a94898j34511J44700K1252j72374J65401J86929K5271j33056J6502K97661
22838B22877j33998j09303J33105j59233l12097l07519n8554L43264J00427Q651
$$ y = [301296, 229021, 190059, 107902, -47411, -34704, -59779, -259882, -337287, -95927, 18067, -70854, -212482, 8687, 73257, -175602, -170973, -81712, -19623, 187562, 182905, 323160, 222709, -11047, -22914, 44886, 180037, 348196, 100648, -137873, -127540, -284917, -429710, -150230, -65373, -136341, -261143, -317834, -246401, -55057, 168928, 71272, 99453, -136692, -298027, -371153, -164611, -85661, -14846, 155318, 167770, 111202, 5013, -202382, -117984, 92595, 222540, 21138, 19051, 416652, 442229, 384959, 74226, -194898, -329409, -184709, -163457, -335831, -170430, 16499, 41770, -91286, -74784, 222877, 88879, -20424, 112681, -46552, -358649, -666168, -724722, -381458, -281031, -272380]
22828b72380K7292m2571J25083j12738k99309R997L99723j73031P7224K21591
22818c9119j44941o9801r9719K02700M4405n7997J39663K23810q2849j59394p7924
22807a21166l44976J30706J13617J01646j08105J43442R7450p8352l1712j45076
22797b42526L9962J11742J65347k6713j50561k554J33093J6817k43737n6747m5910
22786c01787N4978o3555n0599q1576O2833L9866J66216J45723J23188j25700K1949
22775h464J41083J1545k24429K72m122j42486k76367K92498L25990N1743r0906
22764G6357k06308j79466j09396K31662p9584K34660j34104l80971j43270J21242
22754e69178J19607O0285K6329K05393r5459p177j13128K45287K13404K61150
$$ y = [-272380, -245088, -287659, -162576, -275314, -574623, -564626, -164903, -337934, -260710, -39119, -184060, -253861, -353580, -150880, -106475, -164472, -24809, 199001, 116152, -43242, -121166, -466142, -335436, -221819, -120173, -228278, -84836, 12614, -65738, -97450, -242526, -202564, -90822, 74525, 47812, -102749, -105303, 27790, 44607, -199130, -255877, -301787, -246809, -310364, -360963, -442539, -379706, -339840, -173624, -27901, 95287, -30413, -8464, 132619, 144164, -80265, -79993, -84115, -226601, -502968, -210470, 115520, 167263, 76357, -129951, -309417, -418813, -187151, -266735, -32075, -166179, -547150, -690420, -569178, -449571, -389286, -362957, -157564, -253023, -260200, -373328, -128041, 85363, 346513]
22744C46513J25867K33366J06793j48951k53928Q3226J39725j76551m43625o7854
22734e5419k3538K65631k56107l0303K60014J27865n3412j0650k66962k45373
22724b88254n6298o5632K60713R6861j50679J45691J24715P8514o5917r1982o5749
22713g8017r2885j71370J90887L88534R9975k72443k41501n3264J23173K54747
22703A47836K15562o3927k62783j67745Q2094q9705j06508K5546q8964q2260J43045
22692b47809K27808M8747n1650j04424N3586J05718L09668R6912j23459j53491
22682A61606j5439r3333m5765o0543j3518j88638J52301J51926K62496j1733j65188
22671A34172J1541j7274j80324J15866M0254j74183N9153J84784K7322K12296
$$ y = [346513, 472380, 705746, 812539, 663588, 409660, 492886, 632611, 456060, 12435, -55419, -78957, 186674, -69433, -99736, 160278, 288143, 234731, 224081, -42881, -288254, -344552, -410184, -149471, -52610, -203289, -57598, 67117, 145631, 79714, -12268, -78017, -170902, -342272, -151385, 237149, 337124, 64681, -176820, -230084, -106911, 147836, 363398, 299471, 36688, -131057, -48963, -138668, -245176, -219630, -308594, -390854, -247809, -20001, 28746, -22904, -127328, -73742, 31976, 341644, 438556, 315097, 161606, 146167, 52834, 7069, -53474, -66992, -255630, -103329, 48597, 311093, 299360, 134172, 145713, 128439, -51885, 63981, 104235, -69948, -10795, 173989, 201311, 413607]
22661D13607J36802o8277n0773j76732J92608N9558l74947j06845L47388J46431
22651E18820k66804k44302r4066j06819r9273j5176K63873J73302p8113N7407
22641A08849K98918O0798k17646j99378k13958k19871J4112L71346J51954k59881
22631a04757J6799J39479R9954r6788k06423j95685K85616Q4744j22976r7236
22621a97273J63588j49314m29111j13558Q0620K21668J11010J35933K91301J03989
22611B18853o0537j05792j12342k06187q9668K35030K82455N4549j8988p4635
22601A22738n6718j25625n0623j84229j47476m7865P856J29093p0054K15060L3868
22590a73975j85264j09056J96429L28212m0822j55233J33263P4167J6389O025
$$ y = [413607, 550409, 482132, 431359, 254627, 447235, 506793, 131846, 25001, 372389, 518820, 252016, 7714, -86352, -193171, -292444, -307620, -43747, 129555, 51442, 108849, 407767, 468565, 250919, 51541, -162417, -382288, -368176, 3170, 155124, -104757, -87958, 51521, 151475, 54687, -151736, -347421, -61805, 22939, -100037, -197273, -33685, -182999, -612110, -725668, -645048, -423380, -312370, -176437, 114864, 218853, 158316, 52524, -59818, -266005, -355673, -120643, 161812, 216361, 197373, 122738, 66020, -59605, -110228, -294457, -441933, -489798, -481942, -352849, -422903, -207843, -173975, -359239, -468295, -271866, 56346, 15524, -139709, -6446, 67721, 84110, 90135]
22580I0135J46856j64832j10715k22843L13018Q7044k81436j84898k62069j99596
22570g89336R408M4388O7136m3434J16579K98813Q5256r2399o9810K1917j17210
22559d68692K4119k2648K76410M5657j71260J49209K76154R1975k0948R9024J56421
22548D35421j07278j82354l96984q3086j0039l4418r1053j23889L62672J60360
22538g0648J76911j06956k74689r3761m3540J68560o3801J62597P6654j3759P1567
22527a0865J39073K67760j82062n5013k54716J10814N4241j8578k22427k51470
22517d23243p7678K23430M7484k25930J23343J87567R9506L0271k433j00105j00758
22506b18546L3065Q4862J74249j05575k20056j46819j71937n2715M64136J29699
$$ y = [90135, 236991, 72159, -38556, -261399, 51619, 138663, -142773, -327671, -589740, -789336, -779928, -735540, -668404, -711838, -595259, -296446, -211190, -303589, -373399, -351482, -468692, -444573, -467221, -190811, -145154, -316414, -167205, 108949, 200924, 179976, 279000, 435421, 328143, 145789, -251195, -334281, -344320, -378738, -469791, -593680, -231008, -70648, 106263, -693, -275382, -369143, -412683, -244123, -307924, -145327, -68673, -82432, -10865, 128208, 395968, 213906, 158893, -95823, 14991, 69232, 50654, -171773, -423243, -500921, -277491, -230007, -455937, -332594, -145027, -45521, -15250, -17683, -117788, -218546, -185481, -100619, 73630, -31945, -252001, -398820, -570757, -623472, -159336, -29637]
22496b9637j70992M9348O3456J7072J10262K6459J51588Q7416j21497p7194k05968
22485i9687J71794q6803J85801K06926N2201m0294q0773j25364m8861N1610m2872
22474A43678k06227O2001j62548L0679j00013k3141R2845m4338l3251j9692R2982
22463a67025K8366j96893J63911J05293r0747p2784Q5958J13967N1244M7414k4645
22452D4059N0948K02284q0742m8448J74446K43730j59880k05389k01096R3440
22442A13352p4869L691j3994q0768j92435k18700P7343J80022j06924J2312l0622
22431c31592J5762p5158P6237K31531J53705L17008k8465m55523j19960j77353
22421c93808j9833L01403k62048j30126P7100J91461k13589K13853M26020P2489
$$ y = [-29637, -200629, -151281, -87825, -70753, 39509, 65968, 217556, 304972, 183475, 106281, -99687, 72107, -14696, 171105, 378031, 430232, 389938, 309165, 183801, 134940, 186550, 143678, -62549, -548, -163096, -132417, -232430, -255571, -162726, -207064, -240315, -260007, -167025, -138659, -335552, -171641, -66348, -157095, -229879, -143921, -29954, 21290, 68704, 44059, 95007, 297291, 216549, 168101, 342547, 586277, 426397, 221008, 19912, 113352, 38483, 42174, 28180, -52588, -245023, -463723, -386380, -206358, -313282, -300970, -331592, -315830, -390988, -314751, -83220, 70485, 387493, 359028, -96495, -216455, -393808, -413641, -112238, -374286, -504412, -427312, -235851, -449440, -235587, 190433, 262922]
22411B62922j47296k22748K33206k67039j8719Q4479rJ04333l1798M0968j32125
22400i3826k5529k56935M0504N9757J45439P3462J4819j4253j11956K48470K0042
22389I9994M3384O3847K8521j01716l24388o0746J27710K75834J72007m4113l11942
22378c1608j75330l2030J76102j8362k49531J19383K09818j32839k7241j94386
22368c56024j87743J16599R9140j55572J45065K83583P0564j18115n4515m1489
22358a98507j54541J28314K25461j079o3389o6638J853J00641J70216M3773k08440
22347b2336k75069k71967J53556M46387p2676k01604O2275J46933j40684j02746
22337b77931j28149L25382j39483J0810n7620J02988L64619k65467j99166J69208
$$ y = [262922, 115626, -107122, 126084, -140955, -159674, -75195, -75204, 29129, -2669, 38299, -93826, -119355, -376290, -335786, -276029, -130590, -57128, -42309, -56562, -168518, 79952, 99994, 143378, 207225, 235746, 134030, -190358, -251104, -123394, 152440, 324447, 280334, -31608, -206938, -238968, -62866, -81228, -330759, -211376, -1558, -134397, -161638, -356024, -543767, -427168, -328028, -483600, -338535, -54952, 15612, -102503, -157018, -198507, -353048, -224734, 727, -352, -63741, -130379, -128526, -27885, 142331, 186104, -22336, -297405, -569372, -415816, 30571, -42105, -243709, -181434, -34501, -175185, -277931, -406080, -80698, -220181, -209371, -266991, -164003, 200616, -64851, -264017, -94809]
22327i4809K16833K873j83517o7017Q6961N9420M2561K18486J23800j87964k82486
22316f4859k86249j14664J04218K4417k36248Q8137J90235K19168K56301K54737
22306D35193j2618j68827k60611j94858K67958J66417l5403j1327r0336J5343
22296A10931j58282k73856K26300J11434j09267P46j35940k15921K53000J31201
22286e9654j93278J26894J46048m9179O7468l4399J18954J60567j00632Q8716
22276B71505j90587k23948l29197J66787J8373q4963J30629K74373J3002o4177
22266a8203r8469r9861j49118j06372J78239J82765L00420J28810n6711j45659
22256A15841l23128m31609L4908L86887J77683J09701K28137m9577K40484j3405
$$ y = [-94809, 122024, 124897, -58620, -125637, -38676, 20744, 63305, 281791, 405591, 217627, -64859, -351108, -465772, -361554, -337137, -573385, -485248, -295013, -75845, 180456, 435193, 422575, 253748, -6863, -201721, 66237, 232654, 197251, 185924, 95588, 110931, -47351, -321207, -94907, 16527, -92740, -91994, -227934, -443855, -190855, -59654, -252932, -126038, 20010, -29169, 38299, 3900, 122854, 283421, 182789, 271505, 80918, -143030, -472227, -305440, -287067, -372030, -241401, 32972, 45974, -18203, -116672, -216533, -365651, -472023, -293784, -111019, 189401, 318211, 261500, 115841, -207287, -638896, -603988, -217101, -39418, 70283, 298420, 248843, 489327, 475922]
22246D75922k21202j19241j58517j70185K15419j7848j49999J72636j44162j01215
22236b18392J0819p9919k54183J90997L49093J33137J07527k40564k28929k3401
22226b53815R3128k2437M2463L4238J76106l24594j35194J30738J52335k6417
22216a33449j80047J48366K24722m2297k45313j35806L05771M2911o2313j64696
22206b42151K02076J7361L32307j99274j61667n625n0083r9890L62498O3715K4213
22195B43480K4725J6455j41248L8342j69698j90276J17522q7951N4118J59037
22185F4506k14134j04740j63084p4800L1880O2554m8206J59481L18454L03600
22175C35511J14973l69236l26867j34212R2435L33686p1947L69005L05370j8976
$$ y = [475922, 254720, 135479, -23038, -193223, 22196, 4348, -145651, 26985, -117177, -218392, -207573, -287492, -541675, -350678, -1585, 131552, 239079, -1485, -230414, -253815, -160687, -183124, -140661, -106423, 69683, -254911, -390105, -259367, -107032, -133449, -313496, -165130, 59592, 17295, -228018, -363824, -58053, -15142, -77455, -242151, -40075, -22714, 309593, 110319, -51348, -56973, -107056, -206946, 155552, 219267, 243480, 268205, 284660, 143412, 181754, 12056, -178220, -60698, -148649, -94531, 64506, -149628, -254368, -417452, -492252, -460372, -397818, -446024, -286543, 31911, 335511, 450484, 81248, -245619, -379831, -287396, 46290, -25657, 343348, 648718, 629742]
22165F29742j5384P2581j35717l07683p956p963M1244R0724j88081j6089j95118
22154c9700R0699n8084k01698q9444J55658k41206m9310K69086L62780o4846k58248
22143a24313K21325K47624j22707l51705o1875J32979N4279j32375Q288j58871
22133b87351p0238M990k37398M15214L50355J77888n3941R761m3416k88906m7412
22122g0454k4627j27813J80933J88474l39085k97334J6507J33586j33840O6169
22112d07484Q8319N641j30907M19743J66408J99998L8714n4948q1643k23475p7514
22101e7148j00061M0379m796L0563j21916P7530l3135J46696k55243k10540R4261
22090c93410J17589Q5959P82K27341J51269l00837p7639J87263K57085N562k01157
$$ y = [629742, 614358, 686939, 551222, 243539, 235583, 227620, 268864, 359588, 171507, 155418, -39700, 50999, -7085, -208783, -298227, -142569, -383775, -433085, -163999, 198781, 133935, -124313, 97012, 344636, 221929, -129776, -191651, -58672, -4393, -136768, -128480, -287351, -357589, -352599, -589997, -174783, 175572, 353460, 299519, 309280, 265864, -23042, -70454, -95081, -222894, -41961, 146513, -192572, -489906, -473399, -339813, -473653, -407484, -319165, -313524, -444431, -24688, 141720, 341718, 380432, 325484, 243841, 20366, -57148, -157209, -116830, -121626, -91063, -212979, -135449, -168584, -21888, -277131, -487671, -393410, -275821, -189862, -189080, 38261, 189530, -111307, -188946, -1683, 255402, 260964, 59807]
22079E9807j83680N9211J01104j2603J45089j12770j72252J56644K29137J06016
22069C75703J0515p1569P9351j75068j68314k8299k16154j67105O3541J14774
22059a82625K42469j74269J64454l24495j9152J61472k18702j73741j9222L8772
22049e05039J31317K6423m5916p5966q0133K4063K96171M30883J48115L3386j70495
22038B12809l6487k40145k98937j05212j0422l0279L73455O4687M8813N029k68319
22027b85008j89175L02444K55414M6162j67053l11640Q1614J22336J6063K37314
22017A08471R340o3929n2971k5201J2847j58284L5847m8606M308j99770J38901
22006b39047p7713o023J86564Q5164j50553K3047L0709J00554K18446j08086n5077
$$ y = [59807, -123873, -64662, 36442, 23839, 168928, 56158, -116094, 40550, 269687, 375703, 386218, 314649, 394000, 218932, 50618, 22319, -193835, -360940, -297399, -182625, 59844, -114425, 50029, -274466, -293618, -132146, -350848, -524589, -543811, -505039, -373722, -347299, -393215, -469181, -549314, -525251, -229080, 201803, 349918, 383304, 212809, 176322, -63823, -362760, -467972, -478394, -508673, -135218, -70531, -21718, -16689, -285008, -474183, -171739, 83675, 129837, -37216, -348856, -267242, -144906, -128843, 108471, 117811, 53882, 911, -24290, -11443, -169727, -133880, -182486, -178178, -377948, -239047, -316760, -322783, -136219, -51055, -201608, -178561, -147852, -47298, 171148, 63062, 7985]
21995G985j47366p3891J22364J50746j76441j77569l7140J45082R9228J53486
21985F6484J32678l51406k18624k0488L12113P185k19827J18622R7138l1186j71689
21974b79000J19991Q6681m11876N2207J12253J61396P2803p1597J61007j16976
21964a13111r8521k85J35975J26804K01659K63057k40073l63890r4882o5356p0853
21953c19476j42208O2243J10905J16739n1828M5904n3557q6057J36122K15349
21943C4136M13800L13481J2379l61472o8060j41596l11085q4398J50915J29444
21933H7544K4237j0387N3516J003J08035m6026l84202J99879J74987m53774p2601
21922c17789K37803n1498o1570K677L04973K14570j30991m08971k67518K27089
$$ y = [7985, -139381, -213272, -90908, 59838, -116603, -294172, -331312, -186230, -87002, 66484, 199162, -152244, -370868, -391356, -79243, -72058, -291885, -173263, -76125, -107311, -279000, -159009, -72328, -484204, -431997, -319744, -158348, -85545, -157142, 3865, -113111, -211632, -211917, -75942, 50862, 252521, 515578, 275505, -88385, -183267, -248623, -319476, -461684, -399441, -288536, -171797, -223625, -177721, -231278, -317335, -181213, 34136, 447936, 761417, 773796, 412324, 344264, 202668, -108417, -192815, -41900, 87544, 111781, 101394, 154910, 155913, 263948, 217922, -166280, 33599, 208586, -245188, -317789, -79986, -131484, -193054, -190377, 114596, 329166, 198175, -210796, -478314, -251225]
21912b51225J27914J89343k8068k65812K13858j3614J244K57312Q5232j8165j32509
21901A65510k4253N2912L4237K0194m3894j85244K1692J48085k14279k86978P5617
21890b36401K23197j50384m1384J11491J12217K15915J32057N6473j87018l63354
21880a27191K1046j15311q8235J00724L19560J59745k8791p6123Q4006p7297n01003
21869c28870k66668K66733N44311L1375k17428j10199j8154N8865o2488p3297
21859a75820J15803q1353k5148p942n9074K62623j21597r9207J49037K3825K0396
21848A543j72745r8075J64547K38307K00471j58998j23309q0828l16127J08343
21838b36871J21613q576J68297K11394j48587k76433l44205J42922L4017m427
$$ y = [-251225, -123311, 66032, 37964, -227848, -13990, -27604, -26360, 230952, 316184, 298019, 165510, 141257, 194169, 228406, 248600, 204706, 19462, 41154, 189239, -25040, -312018, -236401, -13204, -163588, -204972, -93481, 18736, 234651, 366708, 423181, 236163, -127191, -106145, -221456, -309691, -208967, 110593, 270338, 241547, 165424, 249430, 172133, -328870, -595538, -328805, 215506, 246881, 29453, -80746, -98900, -40035, -102523, -175820, -60017, -141370, -166518, -174460, -233534, 29089, -92508, -191715, -42678, -18853, 1543, -171202, -269277, -104730, 133577, 334048, 175050, 51741, -29087, -345214, -236871, -115258, -123834, 44463, 255857, 107270, -169163, -513368, -370446, -336429, -340856]
21828c40856j47379j37778P0059J56612Q2471K19938J41242k67563l20903n4804
21818e98961P5469K19269K50451Q2265K87496j09654j97444k5752Q877M9511k1974
21807A9553N64j4037j66231k7926O1465O7353j36293n9179p9222Q4842p915L9738
21795b17288o485J6615k1030l5069m3303L47380K24190n1345M9710p8218j84589
21784E68j35254Q6581K62163O9686k26585l05408r4690j82967N4233K31108J23442
21773a17123l6154l6142J18465K53446l5o4421r5874o9923j5089k59413j16644
21762d38907L07443K50468J7770j5984j93006k03525j69087q8116K37036Q872
21752b87036m3948q906j44482k39698k24112L6194L09850J20358K45252K3079
$$ y = [-340856, -488235, -626013, -555954, -399342, -316871, -96933, 44309, -223254, -544157, -598961, -523492, -304223, -53772, 28493, 315989, 206335, 8891, -16861, -7984, 41527, 19553, 20117, 6080, -160151, -188077, -126612, -59259, -195552, -254731, -333953, -249111, -257026, -217288, -223773, -207158, -228188, -263257, -306560, 40820, 265010, 213665, 263375, 185157, 568, -134686, -48105, 214058, 283744, 57159, -248249, -342939, -525906, -471673, -240565, -117123, -153277, -189419, -70954, 182492, 182457, 118036, 22162, -47761, -62850, -322263, -438907, -131464, 119004, 136774, 120790, -72216, -275741, -444828, -532944, -295908, -287036, -330984, -339890, -484372, -724070, -948182, -911988, -602138, -481780, -236528, -213449]
21742b13449Q2925J4514k78375j7730J17376J27705J01774J52719L8875j95155
21732f8821Q2484J32176j46225M3759Q7982l52392j32448P9917R7668n4253j27794
21721c57947O0923j4001J12460J94274j63007J83452n1775j01011M6426j52920
21711b43126J47482m3056j99128J59748j28247L147j10978j09437R9606Q7502
21701c36487P8201Q6655J86085p6453j32065j62077J36846n510l1811L3601o7590
21690b90605L2587j33030j1530N1868L834J84349L31497j79618r3474J28545j59044
21679a34621J4275O4231j10511J1752J28235N3442k9136l6100O1344k7672q2267
21668h7028J27647L03198P2808K7741k27853l7238j33083K4929j16279k47821
$$ y = [-213449, -130524, -116010, -394385, -412115, -294739, -167034, -65260, 87459, 126334, -68821, 13663, 145839, -386, 43373, 131355, -221037, -353485, -273568, -175900, -230153, -357947, -297024, -311025, -198565, -4291, -167298, 16154, -35621, -136632, -90206, -243126, -95644, -138700, -337828, -178080, -306327, -303180, -414158, -523595, -423989, -336487, -258286, -171631, 14454, -61999, -194064, -356141, -219295, -224805, -256616, -223015, -290605, -258018, -391048, -402578, -350710, -346876, -162527, 168970, -10648, -104122, 24423, -134621, -120346, -56115, -166626, -154874, -26639, 26803, -2333, -38433, 22911, -4761, -87028, 40619, 343817, 416625, 444366, 216513, 179275, 46192, 71121, -45158, -292979]
21658b92979j7462j0207J07011r9707L5110J41610K09482M1885J35303q0170O4668
21647B34544P8061K41890j01772l57529l79099j19359J99766M4909L8818Q2771
21637c7000M4658j12979p8524K8807K82269L53835k8245l46589j56432K658K5370
21626b2172J07037j04588j18193p1680J99701p8968k0754Q3023J0837K90015Q8285
21615C62543j82769j89785r3954L50573n9375J62457Q3745r5962k95090j79955
21605a37572l06100J71424L55542K38613J15622J83273j36709N4411j6179j81259
21595C41066l01029k6145R2642K01402k04410l12674q3862J43553j47656K9890
21585b67223J45588J85483L7032r7505J03641n5753p3752j2483m7815K5781o9745
$$ y = [-292979, -310441, -320648, -213637, -313344, -278234, -136624, 72858, 114743, 250046, 169876, 234544, 312605, 554495, 452723, 95194, -283905, -403264, -203498, -158589, -119771, -37000, 7658, -105321, -183845, -155038, 127231, 481066, 452821, 106232, -50200, -47542, -22172, 84865, -19723, -137916, -209596, -9895, -88863, -109617, -26594, -15757, 274258, 362543, 179774, -10011, -103965, 246608, 187233, 349690, 433435, 337473, 42383, -137572, -443672, -272248, 83294, 321907, 437529, 620802, 484093, 538504, 522325, 341066, 40037, 13892, 106534, 307936, 103526, -209148, -293010, -149457, -297113, -267223, -121635, 63848, 100880, 3375, 107016, 51263, -22489, -34972, -82787, -57006, -126751]
21574a26751O7179J81528M54383l6664j51191O7418J74540k1081k37396j09385
21564B62580o9132o8004L67243L28986Q344n46563j89384j75941K02190K7162
21554A47481j09258L22896J76365l86957j90732k16619L08956M02931O4022j51240
21544C67845J37840p8133k40781j34618K22084K05437O7630p0681k86242j80062
21534A0319l41662j36348L43846M7680r0493j24685P8623K67937J68673p2107
21524A51783p9333J23947k77304j22257L70788N9211o5879j7890K05073M5434
21514C93573j33496m24431j18242n9949R9079j327J68742K59767J31327o9490
21504B45553k67871k14602J51287J98742N7965k03328L8666K7739p0111j77774
$$ y = [-126751, -59572, 121956, 576339, 539675, 388484, 455902, 630442, 609361, 371965, 262580, 193448, 125444, 492687, 821673, 830017, 283454, 94070, -81871, 120319, 147481, 38223, 361119, 537484, 150527, -40205, -256824, 52132, 455063, 519085, 367845, 505685, 427552, 186771, 52153, 274237, 479674, 547304, 476623, 190381, 10319, -331343, -467691, -123845, -76165, -166658, -291343, -212720, 55217, 223890, 151783, 72450, 196397, -80907, -203164, 167624, 226835, 160956, 143066, 348139, 393573, 260077, -164354, -282596, -342545, -243466, -244793, -76051, 183716, 315043, 245553, -22318, -236920, -85633, 113109, 171074, -32254, 6412, 34151, -35960, -213734]
21494b13734j45697n4774L16697J53267n9932L9833r372J47063J87388j22939
21484B37800j65081p6320j31242j08912q2406K19268J34374K43273k11620j74452
21474a15318j22684j31345j15631K00646M83363J15046k137l3446j4763J01090
21464C64821R2412l13214p8127J4665J96452K41455k98126j37592p5932J20015
21454A26829J56850k87206j54695L41611J75783L34794J73901n3838o9239l61373
21444C83417o2602j40564J6627k32067N754L60639o664K37693J26396k57242n7646
21433C73741O0859K67047m0939L3528j60504j21093Q5920j69777j6365L5536J01815
21422D49768o6841j90666j61116J41083L00998K33183J22645K0109j31210j79385
$$ y = [-213734, -359431, -414205, -97508, 55759, -4173, 35660, 26288, 173351, 360739, 237800, 72719, -3601, -134843, -243755, -326161, -106893, 27481, 270754, 59134, -115318, -238002, -369347, -484978, -284332, 199031, 314077, 311940, 278494, 263731, 364821, 457233, 144019, 65892, 80557, 277009, 518464, 220338, 82746, 6814, 126829, 283679, -3527, -158222, 183389, 359172, 693966, 867867, 814029, 744790, 383417, 320815, 180251, 196878, -35189, -29435, 331204, 324540, 562233, 688629, 431387, 373741, 434600, 701647, 660708, 694236, 533732, 412639, 498559, 328782, 312417, 347953, 449768, 382927, 192261, 31145, 172228, 473226, 706409, 829054, 849163, 717953, 538568]
21412E38568l39033J62462M54311J18607M2480O5182J37636m4772L37901O4511
21402A537853l1763J83584J28071m17140j11715J84067r5011j36474l56606l36133
21392E48733j9170J50269k11829n6655J10633K5148O2207O8842j56563O253J40834
21381F68702J23328m51952k60123M1131K25543J67350j33462p6145q7252l0424
21371A86696j3383k59808J81045L48443j66494l39268K96793J070k4374j57213
21361E3507J23162O576n1059K02264J36094j80485l6248J25667o6713j34452o4686
21350A13627N5990k77649J4313l1059o5795J7629J38928J98505J57799j9457K2200
21339C25031R720l98358P569L6049m8733J40419K2223j20178J52349J2673K6710
$$ y = [538568, 199535, 361997, 816308, 934915, 977395, 1042577, 1180213, 1135441, 1473342, 1537853, 1506090, 1689674, 1817745, 1400605, 1288890, 1472957, 1377946, 1241472, 884866, 548733, 529563, 679832, 468003, 411348, 521981, 547129, 609336, 678178, 521615, 527868, 668702, 792030, 340078, 79955, 121086, 346629, 513979, 380517, 304372, 217120, 186696, 173313, -86495, 94550, 442993, 276499, -62769, 234024, 235094, 210720, 53507, 176669, 183245, 132186, 334450, 470544, 290059, 253811, 379478, 312765, 178313, 113627, 169617, -108032, -93719, -124778, -190573, -172944, -34016, 164489, 322288, 302831, 325031, 334751, -63607, -56038, -19989, -68722, 71697, 93920, -26258, 126091, 138764, 165474]
21328A65474M8810k28455O2483P0791J49322k77707j28336K02214J35095k67219
21318f7528k98674J35556L54729j31763k03020m6181J46151J50065l0258J06257
21308A15334K9797q6497q9941m5460j89354k34100N3903K00050L55594m3603l0061
21297C5662j5215k06929j4784l933J84062K27637j14766J94797K92820m7137j44583
21286C87631l91258k91876J44428K80325q5325j2352K04241j48428J53891J83193
21276D24470O7455m8539r1506K27798k06676k9125P8285J05283O8293l16776k70741
21265H221j1887l2740L790L8794M3515J58950m945j06951l33975N1597R1304K76129
21253A81802O012R5642O2557k21985k14877n1290r5073k86565K51432M21845J40884
$$ y = [165474, 214284, -14171, 48312, 119103, 268425, -9282, -137618, 64596, 199691, -67528, -366202, -230646, 124083, -7680, -210700, -256881, -110730, 39335, 9077, 115334, 145131, 58634, -31307, -76767, -266121, -500221, -446318, -246268, 109326, 65723, 35662, 20447, -186482, -201266, -205199, -21137, 206500, 91734, 286531, 579351, 532214, 387631, -3627, -295503, -151075, 129250, 43925, 31573, 235814, 87386, 241277, 424470, 491925, 443386, 351880, 579678, 373002, 343877, 422162, 527445, 595738, 278962, 8221, -3666, -36406, -32616, 6178, 49693, 208643, 203698, 96747, -237228, -185631, -94327, 181802, 187814, 283456, 346013, 124028, -90849, -142139, -237212, -523777, -272345, 149500, 290384]
21242B90384r1993n1904R9123N0018l2685L3599p3390j29333m288k43328j29357
21231b83154K22827K14301J91871J07451m0736L1786p803n6970M9878k28575k15997
21220a5121j18841j87272K2088L40791Q1843j82886J790M6060k9514k93029N5054
21209b79037J75124o361j89982J91200O3937L02499K81146J01586J81859Q3370
21199I05341m36857l10713M2372j22793o1384K17051M6357j4460o7033j16070
21189H1811J22297N8597o7368M42401J9617j83240Q9670K07596P7702j35661j14844
21178E98578k27754p6928k7592n9906J02522j5922K92619J33395j30746k13843
21168C74423k61605J09131L69079K6857q6717j47737R5927q04J65752r8219k7897
$$ y = [290384, 198391, 146487, 245610, 295628, 262943, 296542, 223152, 93819, 89531, -153797, -283154, -60327, 153974, 345845, 453296, 412560, 444346, 436543, 379573, 429451, 200876, -15121, -133962, -321234, -299146, 41645, 123488, -59398, -57608, -11548, -41062, -334091, -279037, -103913, -110274, -300256, -109056, -45119, 257380, 538526, 640112, 821971, 905341, 468484, 157771, 200143, 77350, 15966, 233017, 279374, 264914, 197881, 81811, 204108, 262705, 195337, 637738, 657355, 474115, 563785, 771381, 849083, 713422, 598578, 370824, 293896, 266304, 206398, 308920, 292998, 585617, 719012, 588266, 374423, 112818, 221949, 591028, 617885, 531168, 383431, 479358, 478554, 644306, 546087, 518190]
21157E18190k3540J31143K05219j78448k28166K606K73100J8004k78453o9801
21147C69854K88624J81203K04240r3690m81533j91997J4373J10077K85016J99249
21137H85416j8084l66549J2036j22759J89931J45183q7699m05919j45247J52729
21127B39038K69552L9272j45461O4075K00921m16540k09302O6988n7894J07727
21117A58376n832P6529J24724J19069K0344J62906p9076l4694K4375L0354P8344
21106F75419j22098j18622J17275K90352r2984k55160p3378J42086J00003K7439
21096F90332n6335J02306q9678j99330M22545K09110k25402r3640k2492j13880
21086F23536K14396p1080k97781j80669o0273M1441J03899j16739j14890K54816
$$ y = [518190, 494650, 625793, 831012, 652564, 424398, 427004, 700104, 718108, 439655, 369854, 658478, 839681, 1043921, 950231, 468698, 276701, 291074, 401151, 686167, 885416, 867332, 500783, 512819, 390060, 579991, 725174, 637475, 231556, 86309, 239038, 508590, 547862, 402401, 466476, 667397, 250857, 41555, 108543, 50649, 158376, 152544, 229073, 353797, 472866, 493210, 656116, 577040, 542346, 566721, 597075, 675419, 553321, 434699, 551974, 842326, 749342, 494182, 420804, 562890, 662893, 690332, 633997, 736303, 646625, 447295, 869840, 1078950, 853548, 759908, 737416, 623536, 837932, 766852, 469071, 288402, 228129, 269570, 373469, 256730, 141840, 396656]
21076C96656K52195j30772j22075J99436k612j25456N4280K0946J80892R8652
21066H22142j42243r9875M7812j69525r0343J91899K29731J34788N128L7028j366
21055I65176L4749J59793J96268M80896L16005j01011j26284L5163l02207R5048
21045A753596K98666m7748m0M20921O4655l9883j37118l71953j69561J41586l54355
21034A558766j94849J9201L4187J44512k0307k997J41294j58591J44676Q8376
21024A754268L0394n6746O6432J71314j22663k34900J1623R3709M0434O3038K69838
21013B086741M58378R0697m17304m26593M05290K21069k70860n8652k0219j13547
21003A955000J76164J51421q4550P7643Q9716P5017J55086J24919N8126J890K12441
$$ y = [396656, 648851, 518079, 396004, 595440, 592828, 467372, 521652, 542598, 723490, 822142, 679899, 580024, 627836, 458311, 367968, 559867, 789598, 924386, 929514, 966542, 965176, 999925, 1159718, 1355986, 1836882, 2152887, 2051876, 1925592, 1960755, 1658548, 1753596, 2052262, 2004514, 2004474, 2425395, 2490050, 2450167, 2313049, 1941096, 1771535, 1913121, 1558766, 1363917, 1383118, 1417305, 1561817, 1541510, 1538513, 1679807, 1521216, 1665892, 1754268, 1784662, 1727916, 1794348, 1965662, 1842999, 1608099, 1619722, 1713431, 1753865, 1816903, 2086741, 2545119, 2635816, 2218512, 1791919, 2197209, 2418278, 2147418, 2088766, 2068547, 1955000, 2131164, 2282585, 2198035, 2275678, 2365394, 2440411, 2595497, 2720416, 2778542, 2780432, 2992873]
20992B992873J16204o2092k83550J25510J95582K46820J86960K2683P9323p126
20982C613187N0202k20956l58328l89800m5946J86524J09495P777J96683j89166
20972B959672j04707n1062K1660K47906O2887k04874K44912j3405Q4316R5990
20962C343295l9976l29791j89559k46235L03519M4751j82103J10509J80268q57
20952B993821p3041P8306L61954J26110j13487r1802K81182L2687N0858K72711
20942C919299J12835K39930J12419K10503N7748k6730K58608K05330M23858L91732
20932E905532K05569O5925K14633K21061J12716L87462J98436L74548O86924M49703
20922H822509P9220K40692P90624Q11371R23198J350014J368202J388648J609902
$$ y = [2992873, 3109077, 3046985, 2763435, 2888945, 3084527, 3331347, 3518307, 3540990, 3620313, 3613187, 3663389, 3442433, 3084105, 2694305, 2648359, 2834883, 2944378, 2952155, 3148838, 2959672, 2854965, 2803903, 2825563, 3073469, 3136356, 2931482, 3176394, 3162989, 3247305, 3343295, 3303319, 2973528, 2783969, 2537734, 2841253, 2886004, 2703901, 2814410, 2994678, 2993821, 2920780, 2999086, 3361040, 3487150, 3373663, 3281861, 3563043, 3595730, 3646588, 3919299, 4032134, 4272064, 4384483, 4594986, 4652734, 4626004, 4884612, 5089942, 5513800, 5905532, 6111101, 6177026, 6391659, 6612720, 6725436, 7112898, 7311334, 7685882, 8372806, 8822509, 8901729, 9142421, 9933045, 10744416, 11667614, 13017628, 14385830, 15774478, 17384380]
20913A7384380J864240J901466J865798J865248J599545J108126L50399K9614
20905B7968816J65664J40325k24916K43835O69056P42716P99235J477862J705608
20896C3688201K119975J832830K347068L041543L578885M672957N406595O923020
20888F3611074Q823443J1458714J5134117J9625138K4235002K8667964L1865684
20881B03421136L3165546L2805862K8240612K0295532J0913107R36601p784123
20874C21994273j5165257k1677262k7833741l2584484l4441051l2187478k6517574
20867A31587426k0468263j5613371j2372293r695407p519671n861942m726195
20860E5330284m039937l203554k351708k081535j778627j754692j474142j535194
$$ y = [17384380, 19248620, 21150086, 23015884, 24881132, 26480677, 27588803, 27939202, 27968816, 28134480, 28274805, 28049889, 28293724, 28962780, 29705496, 30504731, 31982593, 33688201, 35808176, 37641006, 39988074, 43029617, 46608502, 51281459, 56688054, 63611074, 72434517, 83893231, 99027348, 118652486, 142887488, 171555452, 203421136, 236586682, 269392544, 297633156, 317928688, 328841795, 329778396, 321994273, 306829016, 285151754, 257318013, 224733529, 190292478, 158105000, 131587426, 111119163, 95505792, 83133499, 73438092, 65918421, 60056479, 55330284, 51290347, 48086793, 45735085, 43653550, 41874923, 40120231, 38646089, 37110895]
20852C7110895j669904j726725j423615j308745j652794j506997j298432j301766
20844B5221917j580948j533965j001175r93834r67083p02682o21884p97415q84281
20835A6138650q17066m02655o08425m16288k48345l80472k68295o11881k38614
20826A2146609k60979l21637k90047k58112l72383k87252n75797m30048J17641
20817I467995j31566m23792l51951m94932k81237j1841l83714m97724o02j16598
20807F774038j8952N9787J50201J58283j32585K22935J55013O786K32288J79615
20797G787409k56170j42665M4529k95433k04339m27788o27770j22341l47475k80330
20787E127627k67944j28823K85385k61650r3187j30079k27324o9302J5492j15722
$$ y = [37110895, 35440991, 33714266, 32290651, 30981906, 29329112, 27822115, 26523683, 25221917, 23640969, 22107004, 21105829, 20111995, 19144912, 18442230, 17820346, 17022931, 16138650, 15321584, 14918929, 14310504, 13894216, 13645871, 13265399, 12997104, 12385223, 12146609, 11885630, 11563993, 11273946, 11015834, 10643451, 10356199, 9780402, 9350354, 9467995, 9336429, 8912637, 8560686, 8065754, 7784517, 7772676, 7388962, 6891238, 6890636, 6774038, 6755086, 6814873, 6965074, 7123357, 6990772, 7213707, 7368720, 7375506, 7607794, 7787409, 7531239, 7388574, 7433103, 7137670, 6933331, 6505543, 5877773, 5755432, 5407957, 5127627, 4859683, 4730860, 5016245, 4754595, 4661408, 4531329, 4304005, 4234703, 4250195, 4134473]
20777D134473k09380j9106J98876M55825p8034J4495J96142J79118J62289M16686
20767E451384J01634J86022O38318O55664N98790Q37019R08946J190020J296163
20758A1863960J063438J278501J580920J359088P61296K36469l28146p91822j005708
20749A6017996j169458j290956j270355j439997j087667j037728k90747r8423
20741H332665j52863k1082j01667J5198L14961J09834K76609L94439N51969J54403
20731I874466j47472L0804n0439m13473k09996m00160p38548p92226q62994p43390
20721E546572m46826n29419m70937j24215l19965l87785l82995J0077r5417p2839
20711B726251j4241l08417k93787j89423l29715L7335K96273m0108l462m7692
$$ y = [4134473, 3925093, 3905987, 4104863, 4560688, 4482654, 4497149, 4693291, 4872409, 5034698, 5451384, 5553018, 5739040, 6377358, 7033022, 7631812, 8468831, 9377777, 10567797, 11863960, 12927398, 14205899, 15786819, 17145907, 17907203, 18143672, 17815526, 17023704, 16017996, 14848538, 13557582, 12287227, 10847230, 9759563, 8721835, 8431088, 8332665, 8179802, 8158720, 8057053, 8072251, 8387212, 8497046, 8773655, 9168094, 9720063, 9874466, 9726994, 9757798, 9707359, 9293886, 9083890, 8683730, 7945182, 7152956, 6289962, 5546572, 5099746, 4570327, 4099390, 3975175, 3655210, 3267425, 2884430, 2894507, 2799090, 2726251, 2712010, 2403593, 2109806, 1920383, 1590668, 1628003, 1924276, 1884168, 1880706, 1833014]
20701A833014k41902r5830J2387N2187q7578j96712k62757Q5642j0551j94957
20691H92943J32288j63j16179j81915j64723J87171K205l66926l6636K18408J91506
20680G57979Q8283K10850j63276k82793j95916R9001J46046N198j71359k01783
20670B92230k0567J89116J53657J11063l907K0385j56187j89991j23185j43285
20660A29329J5187R3041n0734o175p8482k10947j10414J62630J9071O5983o4138
20649c5649L2202L0908p912q9268R5449L87652j69468j87209L1915L6985j27875
20638b270P4070k7757l99721K4411M21636j44085Q7907P3364r9862P0266K28618
20627C06577J3716j49007j2298p4061p7093j15816l5908J9156L7074j97789M3872
$$ y = [1833014, 1591112, 1495282, 1507669, 1559856, 1472278, 1275566, 1012809, 1098451, 1087900, 892943, 1025231, 1025068, 908889, 726974, 562251, 749422, 751627, 384701, 348065, 566473, 757979, 846262, 1057112, 893836, 611043, 415127, 514128, 660174, 665372, 494013, 292230, 271663, 460779, 614436, 725499, 721592, 741977, 585790, 395799, 272614, 129329, 144516, 237557, 186823, 180648, 102166, -108781, -219195, -56565, -37494, 28489, -35649, -3447, 27461, 19549, -69719, 25730, 413382, 243914, 56705, 88620, 125605, -2270, 71800, 44043, -355678, -331267, 90369, -53716, 34191, 107555, 7693, 77959, 306577, 320293, 171286, 158988, 84927, 7834, -107982, -143890, -124734, -87660, -285449, -241577]
20616b41577L0696j10283O3887K03023j68544q1008J02887L36041j6146k59874
20606a40898J2739j58267K0193J54932j31555k33989m488R8147J56540J17424
20596a09222k22914k9447K68974K34898o5936k07789J98500o7046j6221k58133
20586b74336o8315j66425L38853J36664J81625l1542m12938j26245K67170l4884
20576a90373m4525J77557K3444r773J8884O4979k04009n1678O0298n663p0839
20565b31698J8326j39650J75233Q1305n6480l05380K39933J92376K64695j10544
20555A28116k64773n8476k03242J60409K135l80368n9988R1525K0239J34116J97692
20544b32615m8432o8872K8315p525k1808m8822K52385J95974k16893j58150j12023
$$ y = [-241577, -210881, -321164, -257277, -54254, -222798, -303806, -200919, 135122, 118976, -140898, -128159, -286426, -266233, -111301, -242856, -476845, -481333, -383186, -226646, -109222, -332136, -361583, -92609, 142289, 76353, -131436, 67064, 18, -16203, -274336, -342651, -509076, -170223, -33559, 148066, 116524, -296414, -422659, -155489, -190373, -234898, -57341, -33897, -43670, -24786, 40193, -163816, -215494, -155196, -160859, -231698, -213372, -353022, -177789, -96484, -152964, -458344, -218411, -26035, 238660, 128116, -136657, -195133, -398375, -237966, -235831, -616199, -676187, -584662, -564423, -430307, -232615, -281047, -349919, -321604, -329129, -350937, -399759, -147374, 48600, -168293, -326443, -438466]
20533d38466L10896K72651M2217J90333k26884m14725J85490j5951j25005r5214
20523c14658j34024L82546P1746q2211P4260R5300L49247J03207j44543l9781
20513C61089L2889O5083j26985k40945k16672n2097O5888N781N188n0247p7972
20502b29000K62352k12153O0016J4844O6147O8847N6391K34606k26399J14280
20492B09931J20739J33941K47691P4189J31775j21833m2734L24691j22751l23650
20482F31989k42818R6820J93443L1283j11439K60314K47660l8351j4573K01472
20472A255800n8988m5054k57811m74536k47630N2927K58668l05104m5837L13033
20462D45468J79528p1089n13790r8707Q7949J03169K9371o8281j8910J66428j32918
$$ y = [-438466, -127570, 145081, 187298, 377631, 150747, -263978, -78488, -94439, -219444, -314658, -448682, -66136, 5610, -76601, -2341, 92959, 442206, 545413, 400870, 361089, 393978, 459061, 332076, 91131, -125541, -177638, -111750, -105969, -100781, -151028, -229000, 33352, -178801, -118785, -103941, -37794, 31053, 87444, 322050, 95651, 209931, 330670, 464611, 712302, 786491, 918266, 796433, 753699, 1078390, 955639, 631989, 389171, 485991, 679434, 710717, 599278, 859592, 1107252, 1068901, 1054328, 1255800, 1196812, 1151758, 893947, 419411, 171781, 224708, 483376, 178272, 132435, 445468, 624996, 553907, 40117, -58590, 29359, 132528, 161899, 93618, 74708, 241136, 108218]
20451A08218Q3967N6774K1604J33776q5763k13372j70248q1954m714n2822j25028
20440c29562q0336L1273J32715L1112K03508j13259j72932J60153K00951N6796
20430A20419k4244j51045N3186j87975J46124Q253l33934J50764K34107j94221
20420a78566j37652j70683P4998K18760j0566L45738K70401k84672j83917K38361
20410A82202P2493n0884n0476J35743j19808o4930K17327K64064J27239j44250
20400E68720L39672L35954m1383j00088j54548J18826p3375n781L17080R9177
20390A404254m64231m36818r6706K98291L25262R1370J7238Q0566n2885k00301
20380I66040k38831l42129J32848R2625j67492N3303l44287l40221j17563J16217
$$ y = [108218, 192185, 248959, 270563, 404339, 318576, 105204, -65044, -146998, -151712, -204534, -329562, -409898, -378625, -245910, -214798, -11290, -124549, -297481, -137328, 63623, 120419, 96175, -54870, -1684, -189659, -43535, -35282, -369216, -218452, 15655, -178566, -316218, -486901, -411903, -193143, -203709, 142029, 412430, 127758, -56159, 182202, 254695, 203811, 153335, 289078, 169270, 104340, 321667, 585731, 712970, 568720, 908392, 1244346, 1202963, 1102875, 948327, 1067153, 993778, 987997, 1305077, 1404254, 940023, 503205, 406499, 704790, 1030052, 1121422, 1138660, 1219226, 1166341, 966040, 727209, 385080, 517928, 610553, 443061, 496364, 152077, -188144, -305707, -189490]
20370a89490M5288O0290P5330K7657j90701j12969p8099j39934N0278L74415K01147
20359A23212j7696M396J32049J19700K88997J73863J14749K26430K48632J6508
20349A430840k7483K65024m2224m02952n7532k52616l15603J28112p768K09048
20339I26846q2168l16419l28298j18721k23321L815J18607p54k2619k09191j66040
20328d18263J74730K56003j56214m00764K84009K10510j47827j05194J66785j81873
20318c18098m5684j0415K38569L13543j48208m7042j328J9601M4999k26107J49065
20307c1105J29660m0973l03345m1236j01044P2087J67247L6367J62795J05411
20297A55864m9355n3515k6976n2374j4639j97603k9102J37132m7351p8335j50932
$$ y = [-189490, -144202, -83912, -8582, 19075, -171626, -284595, -362694, -502628, -452350, -77935, 123212, 105516, 109912, 241961, 361661, 650658, 824521, 939270, 1165700, 1414332, 1430840, 1403357, 1668381, 1626157, 1223205, 1165673, 913057, 597454, 725566, 717798, 926846, 844678, 528259, 199961, 81240, -142081, -138266, -19659, -20413, -43032, -252223, -418263, -243533, 12470, -143744, -544508, -260499, -49989, -197816, -303010, -136225, -318098, -363782, -374197, -135628, 177915, 29707, -17335, -18663, 938, 45937, -180170, -31105, 98555, 57582, -245763, -286999, -388043, -315956, -148709, -112342, 50453, 155864, 106509, 52994, 26018, -26356, -40995, -238598, -267700, -130568, -177919, -256254, -407186]
20286d07186k31341J40979k9330q9219l5712K28202r1449j25005J56132j04406
20276e88335M7387M30319K81183O9160j43461j43323j17258R7698j54797k9798
20266b51225L415j93588J1889J6971n6706J32935k10819k59327K39312J74501
20256c92642J85462n0283K0124j00630Q086J456L38043m7818p9550j49037P3244
20245a93545L09148J13159r4245q7784J76877j83038J25938J80449j97746l26757
20235a77544M5150o8229j42349j50781K2996O6443L12583J23420p4095k6501J18981
20224E0074j55286j04385P8705R7047J06283J1399j44123R0902k50407k66145
20214d85936J80720j50499O525o7230j02954J00227J75045L076K42783k8582J20932
$$ y = [-407186, -638527, -497548, -526878, -616097, -651809, -423607, -515056, -640061, -483929, -588335, -540948, -110629, 170554, 239714, 96253, -47070, -164328, -66630, -221427, -251225, -247810, -441398, -429509, -412538, -469244, -336309, -547128, -806455, -567143, -392642, -207180, -257463, -237339, -337969, -329883, -328427, 9616, -38202, -117752, -266789, -193545, 115603, 228762, 134517, 46733, 223610, 40572, 166510, 346959, 149213, -177544, -132394, -200623, -342972, -493753, -470757, -404314, -91731, 31689, -42406, -68907, 50074, -105212, -209597, -130892, -33845, 72438, 83837, -60286, 30616, -219791, -485936, -305216, -455715, -449190, -516420, -619374, -519147, -344102, -341026, -98243, -126825, -5893]
20203e893L704p756Q852m30233j89437L07331N6147J41790L15015J52620j64971
20192A87169l5517j39349K30164R5752J76554M3052N9158K79073n982n3041Q7750
20181I24783o6028k55679j60783k59318j57815j33212M4416j56406J14724K20056
20171A14738n4340j98603K76358K16784k24547l25805n0251k5650j2490M6107
20161b37699Q5926l39111M263M7369J07227J70900R1667r9874J70005J9112r0866
20150g1081j25022M5109L1477J04691K53271n435k87624l18636o714k5022L5854
20139c69132K06949k64314k19183Q5501K52397L2363L6651L7990J11801j02565
20129a91542j32999P9028j46249p9206j57470l4898K30760K49972J54837P7840
$$ y = [-5893, -2189, -9945, -1093, -431326, -620763, -313432, -257285, -115495, 199520, 352140, 187169, 151652, 12303, 242467, 338219, 514773, 557825, 616983, 896056, 890074, 837033, 924783, 858755, 603076, 442293, 182975, 25160, -108052, -63636, -220042, -105318, 114738, 60398, -138205, 138153, 354937, 130390, -195415, -245666, -271316, -283806, -237699, -151773, -490884, -486621, -439252, -332025, -161125, -69458, -169332, 673, 19785, -71081, -196103, -150994, -119517, -14826, 238445, 233010, -54614, -373250, -379964, -404986, -369132, -162183, -426497, -645680, -560179, -307782, -275419, -238768, -200778, -88977, -191542, -324541, -245513, -391762, -470968, -628438, -663336, -432576, -182604, -27767, 50073]
20119E0073J30243j98230J15775K23217r6701m40200L7341L24697J40455M9462
20109C36132K95936J29626j75666j25884M30524K46514j22699J87914k9041k83316
20099H90040n720P799J76097J63696k32161m3633J50382j27115K46812j15326
20089A110871l21891k22834O0527R022l07011j89000j61208k0502j3343K06196
20079A50827K03485K09601m9755p956k97200K0349j2427o2019L1580k166J66496
20068C50815j0780l07710L5035L88502K3712q0307j32340k05262k88313J06469
20058a20179J05812K5958J32868J63437j92786q5276K24062P8339J29802K61422
20048G23459R7941j24473j56835k32538o847l0935M3376j29997j30044k01452
$$ y = [50073, 180316, -17914, 97861, 321078, 224377, -215823, -178482, 146215, 286670, 336132, 632068, 761694, 586028, 460144, 890668, 1137182, 1014483, 1202397, 1173356, 890040, 884320, 892119, 1068216, 1231912, 999751, 956118, 1106500, 979385, 1226197, 1110871, 788980, 566146, 626673, 635695, 328684, 139684, -21524, -42026, -55369, 150827, 354312, 563913, 514158, 506202, 209002, 229351, 216924, 154905, 186485, 184319, 350815, 340035, 32325, 67360, 455862, 479574, 399267, 266927, 61665, -226648, -120179, -14367, 11591, 144459, 307896, 115110, 29834, 253896, 332235, 462037, 723459, 821400, 696927, 540092, 307554, 300707, 269772, 313148, 183151, 53107, -148345]
20038a48345j64167j22220J36217J26345R2132J86128J65007m34721j13833j61812
20028d39269j0774k29425J03515J59496K28737J41878J41823j41259J21510K98405
20018C74637K08215j10571j95839j91059m3660K89386p9644n2570J45068J27841
20008D71804P6864L0203l5191P005k81209o3146O1930q4769r1193J83349P4736
19997C50383P8240p1098J7598j48861J66557P900p6123N7505k09213k30551o0862
19986a18525J81053R5886l37065k87255J11122j22075l1111M29040R9547L45634
19976C66251P4927r148n9887J46049J3159k36024M1785J79116Q8399k09188J67817
19965E63256K56099R1600l18002k51453k36747M8614r1333r2859K51543K32605
$$ y = [-148345, -312512, -434732, -298515, -172170, -80038, 106090, 271097, -163624, -277457, -439269, -450043, -679468, -575953, -416457, -187720, -45842, 95981, -45278, 76232, 374637, 582852, 472281, 276442, 85383, 41723, 331109, 251465, 198895, 343963, 471804, 548668, 578871, 543680, 550685, 269476, 206330, 268260, 183491, 92298, 275647, 350383, 428623, 357525, 375123, 226262, 392819, 400719, 324596, 382101, 172888, -57663, -118525, 62528, 158414, -178651, -465906, -354784, -476859, -507970, -78930, 20617, 366251, 441178, 432030, 372143, 518192, 531351, 295327, 337112, 516228, 604627, 395439, 563256, 819355, 910955, 592953, 341500, 104753, 153367, 62034, -30825, 220718, 453323]
19955D53323J10460p7412K47745L2312J52468J06011n0002q1702j85582P7538
19945G85159k53028j75066J9542k382K087r4987K54411o6670m7259K17958L09979
19934I49744p739l90344n9922j87536j55938j23122J15059k6575J68416J99263
19924D81306K00372l637k736J22933p7605K54638J99263R3420j33524j6297n4957
19913A063176J5023l6083k28013j63588M0299j01506p9296O4428k24897j79067
19903A70476K1563Q0016j68003J10913Q8124k1706j52128j79719l2305p4605O6128
19892i1246L19159J15669r5755k5874K0583J34246m4202k86234j03246j00328
19882a57228R6340M74574K75930j5050j98614k54476j46339j44680L4974J83356
$$ y = [453323, 563783, 486371, 734116, 766428, 918896, 1024907, 974905, 893203, 707621, 785159, 532131, 357065, 376607, 374225, 376312, 281325, 535736, 469066, 421807, 639765, 949744, 942005, 551661, 491739, 304203, 148265, 25143, 140202, 113627, 282043, 481306, 681678, 678041, 675305, 798238, 720633, 975271, 1174534, 1267954, 1134430, 1118133, 1063176, 1078199, 1042116, 814103, 650515, 690814, 589308, 510012, 574440, 349543, 170476, 192039, 272055, 104052, 214965, 303089, 281383, 129255, -50464, -82769, -157374, -91246, 227913, 343582, 247827, 221953, 242536, 376782, 332580, 46346, -56900, -157228, -60888, 413686, 689616, 674566, 475952, 221476, 75137, -69543, -34569, 148787]
19872A48787K8543l14795K16410K52437P853P9048j38271k06042l38927K94074
19862B9117P63007K45858M7567n7373J14625L23261K7414J68973K46104O5303
19852A973856j19075m83010j04646J46938Q8885L98967o0376j53319K20425n4706
19842A853939q8j412k03609O0044k29244m18955k54087k51414N7273j37706N9913
19831E34654q0983J48749K85750L076M8236j39605l50604K6850J77015J52815
19821H05953j01414k62905l0373J93824j43605O5996J04307J98084J87050J48976
19811A165893l775Q6391k68776j05519O0054J61395L0085L4285L36774j00993
19801A395814k42505k5904J70325R6660k4551k34689j55736M6058n7904l48981
$$ y = [148787, 177330, -137465, 78945, 331382, 339235, 418283, 280012, 73970, -264957, 29117, 792124, 1037982, 1085549, 1028176, 1142801, 1466062, 1493476, 1662449, 1908553, 1973856, 1854781, 1371771, 1267125, 1414063, 1502948, 1901915, 1841539, 1688220, 1908645, 1853939, 1853851, 1852439, 1648830, 1708874, 1479630, 1060675, 806588, 555174, 612447, 474741, 534654, 453671, 602420, 888170, 891246, 939482, 799877, 449273, 476123, 653138, 805953, 704539, 441634, 411261, 605085, 461480, 527476, 631783, 829867, 1016917, 1165893, 1162118, 1248509, 979733, 874214, 934268, 1095663, 1125748, 1160033, 1496807, 1395814, 1153309, 1127405, 1297730, 1394390, 1369839, 1135150, 979414, 1025472, 967568, 618587]
19791F18587Q4512J88252J80457K13092j26872k31168J08369J5445q3030N595
19781I73239K18015q8099m8159K89682J68671J20965J02839Q7267K51983J06539
19771B182942J32028K44498o3012j12515k83765j60542r7573K6638P5854p7760
19761A866793r3278k27558L1698K61531j21755j5393j40146l51090n8882Q2817
19751A234737L50741J93142L6183J27304j07182j28141l8561K9831K9953r4559
19741A633448j88067j61531K4991j08314M4177L0922j32582k98420J29335J584
19731I75543j86000K0780J40127l6132P2180p291j29046j2162m447J12845L54697
19720A301094m2946K84298K36881M9551l28024o2756K38421O6436O4022k77785
$$ y = [618587, 703099, 891351, 1071808, 1284900, 1158028, 926860, 1035229, 1050674, 967644, 973239, 1191254, 1103155, 1054996, 1344678, 1513349, 1634314, 1737153, 1824420, 2076403, 2182942, 2314970, 2559468, 2496456, 2383941, 2100176, 1939634, 1842061, 1868699, 1944553, 1866793, 1773515, 1545957, 1577655, 1839186, 1717431, 1702038, 1561892, 1210802, 1151920, 1234737, 1585478, 1778620, 1814803, 1942107, 1834925, 1706784, 1668223, 1698054, 1728007, 1633448, 1445381, 1283850, 1308841, 1200527, 1244704, 1275626, 1143044, 844624, 973959, 975543, 789543, 810323, 950450, 914318, 986498, 979207, 850161, 837999, 833552, 946397, 1301094, 1258148, 1542446, 1779327, 1828878, 1500854, 1438098, 1676519, 1742955, 1806977, 1529192]
19710A529192j93011J21321k29014j61624J78560r2513k49914j58444M8443J52872
19700I45868j47468n3376J93590K10120j60046k31262o5612l3659O7555l3866
19690F91844J34638K05741m5526l97723r0294p359J04909J58242j41200k31084
19680C82188n4990j7075K07114Q1124O0254k74605p7386J07523j91708n7989j40959
19669B3491k3241j57184m55600J56923O13119J13942l65395m5618L07974L86826
19659E55237L73591m0246k39801k71143j48171J00434L38215K25329J57132k01349
19649H49228j20156J51179P8803j26174r7635l0107K89919O4501j65146m50852
19639D43560J55689K23601j32994l22376k07524N7290J828k23220J13180m4579
$$ y = [1529192, 1336181, 1457502, 1228488, 1066864, 1245424, 1152911, 902997, 744553, 792996, 945868, 798400, 745024, 938614, 1148734, 988688, 757426, 691814, 658155, 725710, 691844, 826482, 1032223, 986697, 588974, 498680, 491321, 596230, 754472, 613272, 382188, 327198, 310123, 517237, 598361, 658615, 384010, 306624, 414147, 222439, 164450, 23491, 250, -156934, -612534, -455611, 157508, 271450, -93945, -139563, 168411, 555237, 928828, 888582, 648781, 377638, 229467, 329901, 668116, 893445, 1050577, 849228, 729072, 880251, 959054, 832880, 735245, 705138, 995057, 1059558, 894412, 443560, 599249, 822850, 689856, 367480, 159956, 217246, 219074, -4146, 109034, 64455]
19629F4455j63454j96343J12016k4468n3226M0346K51876p100n6337J39056j19771
19618a2950J7034J5907K70413J75835Q9121j07813m6096k56404k62658N8498J1942
19607d7171J15799J00758p0865k12656R2535K54040j68661q9785K20750K28166
19597D22910j57393k51167q5725M6623M43560J42810N2796J68589Q9549m8923
19587H23629k29895o854R5779m05052n1602Q8099J05965R5990k71474k69590j23106
19576a48111j05556J49708J75014K27331J45304P6922O3027l90852k17295Q7234
19566F2726P8548J87684K06892j30128l5462Q8603L2811J80164j48879K59201
19556G82160p3019R5260m5685k73403k29084j3422J82210l3334J11356L8565L21779
$$ y = [64455, -98999, -295342, -183326, -207794, -261020, -220674, 31202, 24102, -32235, 106821, -12950, 4084, 19991, 290404, 466239, 555360, 447547, 401451, 145047, -117611, -59113, -47171, 68628, 169386, 98521, -114135, -21600, 232440, 63779, -26006, 194744, 422910, 265517, 14350, -71375, -24752, 418808, 561618, 614414, 783003, 872552, 823629, 593734, 586880, 682659, 277607, 226005, 314104, 420069, 516059, 244585, -25005, -148111, -253667, -103959, 71055, 298386, 443690, 520612, 583639, 192787, -24508, 62726, 141274, 328958, 535850, 405722, 370260, 458863, 491674, 671838, 522959, 782160, 709141, 804401, 758716, 485313, 256229, 242807, 425017, 391683, 503039, 541604, 863383]
19545H63383J19768j40552j73275k33991n1881L14536L49957L64573P7679j52705
19535A337492j07916k68421j55263j58331J8652L67336l1O500M8553K37546M15205
19524A741322J52940L3714M6499J66763K51756M31442J60392M1650M35031L51764
19514C813273L63988J05825K34765J83987K27605J96395q6480J14798o171l43127
19504D804858l30211N727l31907l30390j44399l13483p673J09290j12951M6611
19494C395472q6403O9948K51258q8998J72656K59927J7280n7277N8179J09601
19484D101643L86692M50976L66208K90823j47524M9595K87564N67071L97043M32343
19474G182434M74708N72576O85468N91475O12657J018801J088622R68024J496841
$$ y = [863383, 983151, 842599, 669324, 435333, 383452, 697988, 1047945, 1412518, 1490197, 1337492, 1229576, 961155, 805892, 647561, 666213, 1033549, 1033518, 1040018, 1088571, 1326117, 1741322, 1894262, 1927976, 1974475, 2141238, 2392994, 2824436, 2984828, 3026478, 3461509, 3813273, 4177261, 4283086, 4517851, 4701838, 4929443, 5125838, 5039358, 5154156, 5147985, 4804858, 4474647, 4480374, 4148467, 3818077, 3673678, 3360195, 3352522, 3461812, 3348861, 3395472, 3309069, 3379017, 3630275, 3541277, 3713933, 3973860, 3991140, 3933863, 3992042, 4101643, 4488335, 4939311, 5305519, 5596342, 5448818, 5498413, 5785977, 6353048, 6750091, 7182434, 7657142, 8229718, 8915186, 9506661, 10119318, 11138119, 12226741, 13194765, 14691606]
19465A4691606J322861J775933K314475K804631L591146M663762M933772N673998
19457D1772184O386867P106863P657923P512450O598080O395003O772416O356502
19449I6558288M129557K059748J174575O54407o83171k284788l365607m157734
19441I4085275n605885p144489p371903o426207n955751o271448o355943n791811
19433D3161838m804386l690673k892349k000651j745621j438614j104837q09574
19425B4675133q40058n90116k73632j67625k51200N6324N484K06150M39115O59442
19415B3919017P40905P77033J306398J701401J841695K194615L103776L840085
19407C9424925M868947O429996P462823Q853821R881258J1136143J2356308J1940396
$$ y = [14691606, 16014467, 17790400, 20104875, 22909506, 26500652, 31164414, 36098186, 41772184, 48159051, 55265914, 62923837, 70436287, 77034367, 83429370, 90201786, 96558288, 100687845, 102747593, 103922168, 104576575, 103893404, 101608616, 98243009, 94085275, 88479390, 81334901, 73962998, 67536791, 61581040, 55309592, 48953649, 43161838, 38357452, 34666779, 31774430, 29773779, 28028158, 26589544, 25484707, 24675133, 23835075, 23244959, 22971327, 22803702, 22552502, 22608826, 22614310, 22820460, 23259575, 23919017, 24659922, 25436955, 26743353, 28444754, 30286449, 32481064, 35584840, 39424925, 44293872, 50723868, 58186691, 67040512, 76921770, 88057913, 100414221, 112354617]
19399A12354617J0602442J0181558J0767471R697345O318243K823131J485222
19392A64230029k00458k097401m391466n814697p300608j0285069j2283984j1380782
19384A10475564j0099739r676755j0312855r941005q596675p020957n610767m738262
19376D4478549l912401l217775k227811k086377j744788j766368j117000j101967
19368B7304062r95172j173341j074984o67784o17291q28512r48104o84855o40378
19359A9673641r15992p71748o61931m70416k73855m55015l99090n63521m68053
19350A4694020k87094j96786R6080j27078k61341m28124j57901j89165l60752
19341A2781859O1087L28048J48304k52855L5725J70062K96984L4665P3786K49300
$$ y = [112354617, 122957059, 133138617, 143906088, 153603433, 159921676, 162744807, 164230029, 164029571, 161932170, 157540704, 151726007, 144425399, 134140330, 121856346, 110475564, 100375825, 90699070, 80386215, 70445210, 61848535, 54827578, 49216811, 44478549, 40566148, 37348373, 35120562, 33034185, 31289397, 29523029, 28406029, 27304062, 26308890, 25135549, 24060565, 23392781, 22775490, 21946978, 20998874, 20314019, 19673641, 18757649, 17985901, 17323970, 16853554, 16579699, 16124684, 15725594, 15162073, 14694020, 14406926, 14210140, 14306220, 14179142, 13917801, 13489677, 13331776, 13142611, 12781859, 12842946, 13170994, 13319298, 13066443, 13102168, 13272230, 13569214, 13603879, 13677665, 13926965]
19331A3926965M75393N52153J54365K87004N31751N97374O02838R25177J155256
19322A9208276J604082J377337J702516K328652K782557L894929M914337N761833
19314D3574519O654021P774652Q453665Q552308Q246527P484192O165399N149697
19306A02054980M112046L238458K362266J972496J724261J181830k17437k030296
19298A14398604l404308n131546o726342q135698q825181r159537q814358p601372
19290E6600262o146846m763544l642837k909689k283147j529059j079289r38815
19282C3307036p34751o78871p95718m98553k23052m30195q4533K84035M26719
19273C0572117P50326O88533J069463J537707K216923K421241K699696L262803
$$ y = [13926965, 14402358, 14954511, 15108876, 15395880, 15927631, 16525005, 17127843, 18053020, 19208276, 20812358, 22189695, 23892211, 26220863, 29003420, 32898349, 37812686, 43574519, 50228540, 58003192, 66456857, 75009165, 83255692, 90739884, 96905283, 102054980, 106167026, 109405484, 111767750, 113740246, 115464507, 116646337, 116428900, 114398604, 110994296, 105862750, 99136408, 91000710, 82175529, 73015992, 64201634, 56600262, 50453416, 45689872, 42047035, 39137346, 36854199, 35325140, 34245851, 33307036, 32572285, 31893414, 31097696, 30599143, 30376091, 29945896, 29861363, 30145398, 30572117, 31322443, 32010976, 33080439, 34618146, 36835069, 39256310, 41956006, 45218809]
19265D5218809M647595N981253P416330Q554051R492000J0302902J0422505R622798
19257A11658243Q451026P487904O638770O038397N205183M606258M068533K996342
19249A57150656K058193J15153j830960l154015m472363n626183n354110m638327
19241A34248044l811385k627838j418902n98954n50752k204628n749937p713673
19233A09571975o077708l200477r16803L27775M90809l51361k010140n474882
19225I2359188q954108r487657p940479o379051n113242l911634l209773k693960
19217D4669284k110951j913930j610152j271856q78141o69229k66158j65444M0528
19208C5823951k2522J57796P61958J280042J403584J651665K316279L528436M819426
$$ y = [45218809, 49866404, 55847657, 63263987, 71818038, 81310038, 91612940, 102035445, 111658243, 120109269, 127597173, 134235943, 140274340, 145479523, 150085781, 154154314, 157150656, 159208849, 159324002, 157493042, 154339027, 149866664, 144240481, 138886371, 134248044, 130436659, 127808821, 126389919, 125790965, 125240213, 123035585, 117285648, 109571975, 103494267, 100293790, 99376987, 99704762, 100195571, 99844210, 97834070, 92359188, 83405080, 73917423, 65976944, 59597893, 54484651, 50573017, 47363244, 44669284, 42558333, 40644403, 39034251, 37762395, 36884254, 36215025, 35948867, 35783423, 35823951, 35801429, 35959225, 36721183, 38001225, 39404809, 41056474, 43372753, 46901189, 51720615]
19199E1720615O076400Q232492R852355J0713906J0595403R156611P579666N062831
19191A18990279K11110l862231l629855m67613L443826N006823M620275L860242
19183A28172856J836715k996771r259828j1931556j0487059p278491m341714k957271
19175H0756881k267139k208093l111731n231887o584932o408466n537432m665868
19167D4741333l303666k444638k077826j616635j415910j209205j197596j034957
19159C0440900m04166p02819k62684k40665m10955K6264L24962N6870j0288N59536
19149B9376955J141536J361356J871476K937473L926666M831969N913692O739814
19141E8100937O283906M897940L528858J163309k777241m812677l670877j405516
$$ y = [51720615, 57797015, 66029507, 75881862, 86595768, 97191171, 106347782, 113927448, 118990279, 119201389, 115339158, 111709303, 111241690, 114685516, 119692339, 124312614, 128172856, 130009571, 127012800, 117752972, 105821416, 95334357, 88055866, 83714152, 80756881, 78489742, 76281649, 73169918, 67938031, 61353099, 54944633, 49407201, 44741333, 41437667, 38993029, 36915203, 35298568, 33882658, 32673453, 31475857, 30440900, 30036734, 29333915, 29071231, 28830566, 28419611, 28445875, 28770837, 28827707, 28817419, 29376955, 30518491, 31879847, 33751323, 36688796, 40615462, 45447431, 51361123, 58100937, 64384843, 69282783, 72811641, 73974950, 71197709, 66385032, 62714155, 61308639]
19133F1308639K56747J156519N66398j61477j295263l835005o219777o801974
19125D4974807o020124m895030l311019k667964k113797k006091j827257j267822
19117B0865703p58974p76616p58099o42370l47622j48142k71318j59260k69078
19108A6734224m56679l25803p1484j11880l54360k46666l93093m29353l59660
19099A3985246l52436n97767m77830m78919n57196l87724m38676n75495m28200
19090I691003j04774k27113l59896k65150n53522j80688p5139k79547J00811l580
19080G742405l2264j09860k9320q7850j09640j97103l9842L28396j43275m65507
19070F856140k20873j7653k59595m28043m9031N35800O23802L08277m8434J84853
$$ y = [61308639, 61565386, 62721905, 63288303, 63126826, 61831563, 57996558, 51776781, 44974807, 38954683, 34059653, 30748634, 28080670, 25966873, 23960782, 22133525, 20865703, 20106729, 19330113, 18572014, 17929644, 17582022, 17433880, 17162562, 17003302, 16734224, 16277545, 15951742, 15880258, 15768378, 15414018, 15167352, 14774259, 14344906, 13985246, 13632810, 13035043, 12557213, 12078294, 11521098, 11133374, 10694698, 10119203, 9691003, 9586229, 9359116, 8999220, 8734070, 8180548, 7999860, 7924721, 7645174, 7745985, 7742405, 7710141, 7600281, 7570961, 7483111, 7373471, 7176368, 7136526, 7464922, 7321647, 6856140, 6635267, 6617614, 6358019, 5929976, 5880945, 6416745, 7040547, 7348824, 7300390, 7485243]
19060G485243M15291L11277J48700K98711K37256M11662L05385J67744j55253
19051I626016L18407L36080J8861l90852l04910j45716l90856m58237l74052m95523
19041G739218k82192k81886k55147k68567l66404p21401p1631p3104j28037j01231
19031E189618J19362J51862m57653k84669J5015n1232k84399k5327J29294K51632
19021D753503N9215J50313R7627j17074l06988L16405K04100J8421p1096K67811
19011E372237K37904J5852M26096K71705N8984M58196l2566K13677L54344L20736
19001G697165r2432Q2142J36869J38489K82563J34788k28552k91061K65160K7733
18991H152864p91750o07909j817l73642m91042M4010K69505K92136j77612m32071
$$ y = [7485243, 7900534, 8211811, 8360511, 8659222, 8896478, 9308140, 9613525, 9781269, 9626016, 9944423, 10280503, 10299364, 9908512, 9603602, 9457886, 9067030, 8608793, 8234741, 7739218, 7457026, 7175140, 6919993, 6651426, 6285022, 5563621, 5491990, 5418886, 5290849, 5189618, 5308980, 5460842, 5003189, 4718520, 4733535, 4682303, 4397904, 4372577, 4501871, 4753503, 4812718, 4963031, 5060658, 4943584, 4636596, 4953001, 5157101, 5175522, 5104426, 5372237, 5610141, 5625993, 6052089, 6323794, 6382778, 6840974, 6808408, 7022085, 7376429, 7697165, 7604733, 7686875, 7823744, 7962233, 8244796, 8379584, 8151032, 7859971, 8125131, 8152864, 7361114, 6753205, 6751388, 6377746, 5886704, 5930714, 6200219, 6492355, 6314743, 5882672]
18981E882672q373M9940J38333Q4498L40531M96305L8046M35986N71937N70784
18971H600659P42978M12452J45123L90081L96759m9842O1501K55056j70729j57765
18961A0626273j39828n23656j49415k94779n12970k75865k69850k00376m13415
18952G846119j32666l3287m9807k66317j24425j15576k10456j92501K82556J67703
18942G171343Q7602J61314K05201l8233q4067j26583L41370N94719K85957L00383
18932H899006J42771M29492P8736q2778M67577M50959M09984N71931P84518P78993
18922A2931189O69484R18802Q02709L11328L98394L99494J00705M1229N5830P1138
18912A6700302j14135k57199n68444l81792l88771j82598m18595p27422l93000
$$ y = [5882672, 5874299, 5924239, 6062572, 6147070, 6487601, 6983906, 7021952, 7457938, 8029875, 8600659, 9343637, 9756089, 9901212, 10291293, 10688052, 10638210, 10699711, 10954767, 10784038, 10626273, 10486445, 9962789, 9813374, 9518595, 9005625, 8729760, 8459910, 8259534, 7846119, 7713453, 7680166, 7630359, 7364042, 7239617, 7124041, 6913585, 6721084, 7003640, 7171343, 7258945, 7420259, 7625460, 7587227, 7503160, 7376577, 7717947, 8312666, 8598623, 8899006, 9041777, 9471269, 9550005, 9467227, 9934804, 10385763, 10795747, 11367678, 12152196, 12931189, 13600673, 14519475, 15322184, 15633512, 16031906, 16431400, 16532105, 16573334, 16629164, 16700302, 16586167, 16328968, 15760524, 15378732, 14989961, 14807363, 14388768, 13661346, 13268346]
18903A3268346q9434j88847m30847o3290M4949K96036K08764j35020k87537J02023
18893A2725143O48673P15887L09215M72209M20981K27043L90974O41537O21548
18884A7173210N84457R21366J037880J407106J462020K053155K585595L007594
18876C0232383L731196N379576O807262P912217Q631562Q899282Q308981O915825
18868H6818284M681143J777243p08924j227195k37928N77254P46793l70058k747012
18859H9309600o144364r660270j0387316q314005o585322n260548l918789k934233
18851C6104753k395223j419480j273294j364268j029835m05320k11939l11777
18843B7693617l58643j44045J67720M51068O15162R15572J108081J087932J216410
$$ y = [13268346, 13178912, 12990065, 12559218, 12495928, 12540877, 12836913, 13045677, 12910657, 12623120, 12725143, 13373816, 14089703, 14398918, 14871127, 15292108, 15519151, 15910125, 16551662, 17173210, 17757667, 18679033, 19716913, 21124019, 22586039, 24639194, 27224789, 30232383, 33963579, 39343155, 46150417, 54062634, 62694196, 71593478, 79902459, 86818284, 91499427, 93276670, 92567746, 91340551, 91102623, 91679877, 92426670, 92056612, 89309600, 83165236, 73504966, 63117650, 54803645, 48218323, 42957775, 39038986, 36104753, 33709530, 32290050, 31016756, 29652488, 28622653, 28217333, 28005394, 27693617, 27334974, 27190929, 27358649, 27809717, 28424879, 29340451, 30448532, 31536464, 32752874]
18834C2752874J576243K333483L232475M113470N284195O487127Q020653Q274564
18826G2075084Q273458Q339572Q024617O938260N453800N761884O360259O253240
18818A27480174N830642L914842k42129n208105q646732q401436o326294m545146
18810A03855816l698693m059422n712612q450778r513520q825127p113520n747703
18802E0734441m256908l320734k653200k437162k166303j544921j417336j223291
18794C1714586j232093p20950p19632q62428o46245k39825q9252k69824J71354
18785B7105691K53330L75698O00615J312012J772627K440774L258595M374236
18777D1493578M837042M874042M879880N143274L806788J947196N9678j236673
$$ y = [32752874, 34329117, 36662600, 39895075, 44008545, 49292740, 55779867, 63800520, 72075084, 80348542, 88688114, 96712731, 103650991, 109104791, 114866675, 121226934, 127480174, 133310816, 137225658, 136983529, 131775424, 123128692, 114727256, 108400962, 103855816, 100157123, 96097701, 90385089, 81934311, 72420791, 63595664, 56482144, 50734441, 46477533, 43156799, 40503599, 38066437, 35900134, 34355213, 32937877, 31714586, 30482493, 29761543, 29041911, 28179483, 27533238, 27293413, 27204161, 26934337, 27105691, 27359021, 27734719, 28335334, 29647346, 31419973, 33860747, 37119342, 41493578, 46330620, 51204662, 56084542, 61227816, 65034604, 66981800, 67041478, 65804805]
18769F5804805q83667Q9240L22865J64198q91611k814549n129368n996144n892227
18760D4773542n025503m262638l277294k584765k144139j658554j753752j116384
18752B2950513r68927j127892q73419q64477l88620p03018p64235j012426n13797
18743A5733702k94560m10585o17816n66992m51621m95833n4344m49426p53227
18734A1639298o57432n63942k61771j35120r8254l6147k33110k1495j82261o60067
18724H789699o50299l25358J31599m7383o2013o3024j36879Q5948L1553O3971
18714G817814k14594k06150k04623k09495p9571j4876k8829l59563K25342O9980
18704F795435k26905j49349l16658j95424k30428j05210M9719o0712k48354J38038
$$ y = [65804805, 64921138, 65010378, 65333243, 65497441, 64605830, 61791281, 56661913, 50665769, 44773542, 39748039, 35485401, 32208107, 29623342, 27479203, 25820649, 24066897, 22950513, 21981586, 20853694, 19980275, 19115798, 18727178, 18024160, 17259925, 16247499, 15733702, 15439142, 15028557, 14410741, 13843749, 13392128, 12896295, 12841951, 12392525, 11639298, 10981866, 10417924, 10156153, 10021033, 9922779, 9886632, 9653522, 9632027, 9449766, 8789699, 8139400, 7814042, 7945641, 7898258, 7836245, 7773221, 7636342, 7722290, 7753843, 7817814, 7603220, 7397070, 7192447, 6982952, 6903381, 6888505, 6859676, 6500113, 6725455, 6795435, 6568530, 6419181, 6102523, 5907099, 5676671, 5571461, 5621180, 5560468, 5312114, 5450152]
18694E450152l07630m93438k81220p6004j82428M3035q8993j98776q8326k51879
18684C524493j10737K90397L49106r8788j65456j03474o3280L6070P7094j1202
18674C724223j62730j96611k49898p671J7165m3668L9684k71267r1507K68915
18664C026635j3853p5j25267j42191j61135J44232o3656K20913p1652J0758k52554
18653B572155m20669j02973j0063Q2925N4464n4775l09157J6287p675K00940J92628
18642B214087j08594k05266r0571K65485j5599k97402K8261M5765O4815M5268
18632A946249l177j7143l5971o6191k09608J7959q1125K8678r1327J26345J16897
18621A731586J67512P9110l13804j15162j29941K18617J01066n6828J8227j58124
$$ y = [5450152, 5142522, 4649084, 4367864, 4291860, 4109432, 4152467, 4063474, 3864698, 3776372, 3524493, 3413756, 3704153, 4053259, 3954471, 3789015, 3685541, 3622261, 3658331, 3735425, 3724223, 3561493, 3364882, 3114984, 3107313, 3124478, 3080810, 3120494, 2849227, 2757720, 3026635, 3012782, 3012707, 2887440, 2745249, 2584114, 2728346, 2664690, 2885603, 2813951, 2824709, 2572155, 2151486, 2048513, 2038450, 2121375, 2175839, 2121064, 1811907, 1828194, 1820519, 2021459, 2214087, 2105493, 1900227, 1809656, 2075141, 2059542, 1762140, 1790401, 1836166, 1900981, 1946249, 1943072, 1925929, 1889958, 1823767, 1614159, 1632118, 1550993, 1579671, 1488344, 1614689, 1731586, 1899098, 1978208, 1664404, 1549242, 1419301, 1637918, 1738984, 1682156, 1700383, 1542259]
18611A542259j18138l44315J70769L31350J6520j7912M248j07092r9555N1596
18601A429730Q7550J27678K06813j76629l5548j09097O3637P9311j89524k12803
18591A271118M529K55838K16123p6513l01960J16644j01994k11021o386N1464
18581A217842N9221m9614Q1735J14934n5140j44721p555K88958n6373j98340k3428
18570A227519J89969K37126j61391k51935N3433m4432q2260j34437L9840k14151
18560H59281q2633k0029L15391K82733j95966j80264N1059O0832J93483J27220
18550A411107Q0942k41978j78424m1955n130j142O4865j8274K22886k5473o3416
18539A204008J7394j44590K39868J14424M5680k24002J02461o6740l97844l67170
$$ y = [1542259, 1424121, 1079806, 1250575, 1581925, 1598445, 1580533, 1584781, 1477689, 1378134, 1429730, 1517280, 1644958, 1851771, 1675142, 1639594, 1530497, 1594134, 1673445, 1483921, 1271118, 1275647, 1531485, 1747608, 1671095, 1369135, 1485779, 1383785, 1172764, 1166378, 1217842, 1277063, 1227449, 1309184, 1424118, 1368978, 1224257, 1216702, 1505660, 1449287, 1250947, 1227519, 1417488, 1654614, 1493223, 1241288, 1294721, 1250289, 1168029, 1033592, 1073432, 859281, 776648, 756619, 1072010, 1354743, 1158777, 978513, 1029572, 1090404, 1283887, 1411107, 1492049, 1250071, 1071647, 1029692, 1024562, 1023420, 1088285, 1070011, 1292897, 1267424, 1204008, 1221402, 1076812, 1316680, 1431104, 1476784, 1252782, 1355243, 1288503, 890659, 523489]
18529E23489R1187J99243N33916K28751O3491n5215r5794L05795P1648j26866
18519A739645O4626K32622J02752q2366k23755N2539K9397r5359P9201M0447K13804
18508B153553L75261K28509Q6571J58422J84674K06542K33062J36090K38697M3736
18498D045117L9275L40874K79236L32150J73330L35398J86465p2689k40837k36323
18488E181996k44497k79239L02204K74341k37498m97678p6744J40560k0239k10212
18478D332994m31395M602L3921k37068m84771k68609j54968k5004Q2316L3837
18468B885855M8714R9922K6218K4476k37625k71951P9953J43190L7923K44809
18458C081484O9315K42991M06669O37387L63543J13220L73559M89096K22016Q9915
$$ y = [523489, 614676, 813919, 1347835, 1576586, 1640077, 1584862, 1489068, 1794863, 1866511, 1739645, 1804271, 2036893, 2139645, 2057279, 1833524, 1886063, 1915460, 1820101, 1899302, 1939749, 2153553, 2528814, 2757323, 2843894, 3002316, 3186990, 3393532, 3626594, 3762684, 4001381, 4045117, 4084392, 4425266, 4704502, 5036652, 5209982, 5545380, 5731845, 5659156, 5418319, 5181996, 4937499, 4658260, 4960464, 5234805, 4997307, 4499629, 4422885, 4563445, 4543206, 4332994, 3901599, 3906201, 3940122, 3703054, 3218283, 2949674, 2794706, 2769702, 2852018, 2885855, 2934569, 3034491, 3060709, 3085185, 2847560, 2575609, 2655562, 2798752, 2836675, 3081484, 3150799, 3393790, 3800459, 4437846, 4801389, 4914609, 5288168, 5777264, 5999280, 6089195]
18448F089195M53822M42909L70322M37479L43764J18080N8381j78631j04137k0307
18438H010877q4936m11842m62364k74836n05872k64258l15211j89046j62381N5774
18428E395905j43294k37354K02836J72452N3488o8202m0378j11964j40072m47044
18418D636373k46418k18313K0237K79792o737k24336k27456N7077L48439L4551
18408D453209N0120J52186M88114L02178J68563L36022Q39906O22220L25573L83360
18398H121451K04879J79494o2829j94582l07834j07588l94568l43166k21089r1210
18388F782958j77273l46518N9125R5799O995k20491l34314l52173k57909j61994
18378E094205q5495l27945j97882P5216j28018N1343J28612p2661j13207L7233
$$ y = [6089195, 6543017, 6985926, 7356248, 7793727, 8137491, 8255571, 8313952, 8135321, 8031184, 8010877, 7925941, 7514099, 7051735, 6776899, 6271027, 6006769, 5691558, 5502512, 5340131, 5395905, 5252611, 5015257, 5218093, 5390545, 5444033, 5375831, 5335453, 5223489, 5083417, 4636373, 4389955, 4171642, 4191879, 4471671, 4464934, 4240598, 4013142, 4070219, 4418658, 4453209, 4503329, 4655515, 5143629, 5445807, 5614370, 5950392, 6790298, 7412518, 7738091, 8121451, 8326330, 8505824, 8442995, 8248413, 7940579, 7832991, 7438423, 7095257, 6874168, 6782958, 6605685, 6259167, 6318292, 6414091, 6421086, 6200595, 5866281, 5514108, 5256199, 5094205, 5008710, 4680765, 4482883, 4558099, 4430081, 4481424, 4610036, 4537375, 4424168, 4461401]
18368D461401N0922K36581K92675K56035L59253Q8648J37275N73870R2999Q6429
18358F636088Q7946P9468K69504L4817K27076J57803J7694J61190L05846N80728
18348H558160J62008k6909l28J59834L16651j1662j4379j74450l23221J81830
18338H827534L68952j0341o6320j69294J9248R2755K1386L06297R2257k44231
18328I238243j84295n16185m39546R5977O5747j67249j45399k24340o08016m90837
18318F624100k37461N7074Q6778j79296j13055k13818k97288J4616J78980Q1065
18308F001695O2507K15594m4409K05608J94918K63754j90070j09047K42513K67201
18298G110264K93489J43600K20038K69584p8004p6583N9842N43250M29889J65441
$$ y = [4461401, 4512323, 4748904, 5041579, 5297614, 5656867, 5745515, 5882790, 6456660, 6549659, 6636088, 6724034, 6803502, 7073006, 7107823, 7334899, 7492702, 7510396, 7671586, 7977432, 8558160, 8720168, 8693259, 8692931, 8852765, 9169416, 9157754, 9143375, 8968925, 8645704, 8827534, 9196486, 9186145, 9119825, 8950531, 8969779, 9062534, 9083920, 9390217, 9482474, 9238243, 9053948, 8537763, 8098217, 8194194, 8259941, 8092692, 7947293, 7722953, 7114937, 6624100, 6386639, 6443713, 6530491, 6351195, 6238140, 6024322, 5727034, 5741650, 5920630, 6001695, 6064202, 6279796, 6235387, 6440995, 6635913, 6899667, 6709597, 6600550, 6843063, 7110264, 7403753, 7547353, 7767391, 8036975, 7958971, 7882388, 7942230, 8485480, 8915369, 9080810]
18288I080810L12118M60942L37278N66931N20734K26546P9229j36690l7037k59605
18278A1151256m08060n66606q62849n30446m39589m11676k94454o02321k71915
18269F763340j82570m23094k03782l16678q6561j05380m66006n30531k20579j3554
18259D214605j3185J87412l83396Q9242M6561O3810k72500j28158p5592j30167
18249C598632n4963J52736K53708m5331M099j88003J32333K88274J95552j8887
18239D318150k1798K27663J42917R6866L10600L03224O1305K27751K1165n63979
18229E123864n93145k84203j59098k56275j81920J67169O1297m88705k88641l46755
18219B753588m03743j83944o4666r9700k6417K32966K11327P3902k26154K950
$$ y = [9080810, 9392928, 9853870, 10191148, 10758079, 11278813, 11505359, 11584588, 11447898, 11410861, 11151256, 10743196, 10176590, 9313741, 8783295, 8343706, 7932030, 7637576, 7035255, 6763340, 6580770, 6157676, 5953894, 5637216, 5550655, 5445275, 4979269, 4448738, 4228159, 4214605, 4201420, 4388832, 4005436, 4094678, 4141239, 4205049, 3932549, 3804391, 3728799, 3598632, 3543669, 3696405, 3950113, 3904782, 3908881, 3720878, 3853211, 4141485, 4337037, 4318150, 4296352, 4524015, 4666932, 4763798, 5074398, 5377622, 5438927, 5666678, 5687843, 5123864, 4530719, 4246516, 4087418, 3831143, 3649223, 3816392, 3877689, 3388984, 3100343, 2753588, 2349845, 2165901, 2101235, 2001535, 1975118, 2208084, 2419411, 2493313, 2267159, 2270109]
18209B270109J25699R1674k6860l19978r7047J4740j10461k51040l71641J79217
18199A504412M9526O4683P3662n3045M8147m9153j24190k82015o6872J33661J55253
18188A454069K47939M3990j21131q322k51719k39233j96470J73040J86854K38139
18178A527156l9430j51198j37372L2119p8151P6756K774j96914j05519m6285R6992
18167I80928N0655n4796j44440k0102L25837K00636j8325j90420n3078J18164
18157A195059K09538j16678J86097J27496N6592K72053J98503J77979J42859l45219
18147B104279r3362L47868K84427J9502q0558j54628K25706Q6683M6573K26092
18137C012582M6717M71332J01319n3518N84233K39315K03470J6143K80803N20758
$$ y = [2270109, 2395808, 2487482, 2460622, 2140644, 2043597, 2058337, 1947876, 1696836, 1325195, 1504412, 1553938, 1618621, 1692283, 1639238, 1687385, 1638232, 1514042, 1232027, 1165155, 1298816, 1454069, 1702008, 1745998, 1624867, 1616545, 1364826, 1125593, 929123, 1102163, 1289017, 1527156, 1487726, 1336528, 1199156, 1231275, 1153124, 1229880, 1232654, 1035740, 930221, 883936, 980928, 1031583, 976787, 832347, 812245, 1138082, 1338718, 1320393, 1129973, 1076895, 1195059, 1404597, 1287919, 1474016, 1601512, 1658104, 1930157, 2128660, 2306639, 2449498, 2104279, 2010917, 2358785, 2643212, 2662714, 2582156, 2427528, 2653234, 2739917, 2786490, 3012582, 3059299, 3530631, 3631950, 3578432, 4162665, 4401980, 4605450, 4621593, 4902396, 5423154]
18127E423154P30193P08097N73254P98001N33183O74008J309520J244740J158994
18118A3153144J701391K278783K428519K925332L867838M997370O645657Q648325
18110D6646359J1768331J5920199K1707291K8200820K9712710K4201836K0319134
18103A98476680J6791222K700418k4398209l7575909l2046177k3292830j6660633
18096H3994562j2505220r532954p505627o172873n277733m474219l709444k988604
18088C1827888k453862j709829j398325j073257j249679j281418r36167p13581
18080B1011770p38227r61044j008236j257828q32815n83925o60654o80489o36977
18071A3651575n89319k71600m35423n88581l21968k94254r7514j5534m3844K926
$$ y = [5423154, 6153347, 6861444, 7434698, 8232699, 8765882, 9439890, 10749410, 11994150, 13153144, 14854535, 17133318, 19561837, 22487169, 26355007, 31352377, 37998034, 46646359, 58414690, 74334889, 96042180, 124243000, 153955710, 178157546, 198476680, 215267902, 217968320, 193570111, 155994202, 123948025, 100655195, 83994562, 71489342, 61956388, 54450761, 48277888, 43000155, 38525936, 34816492, 31827888, 29374026, 27664197, 26265872, 25192615, 23942936, 22661518, 21725351, 21011770, 20273543, 19312499, 18304263, 17046435, 16213620, 15629695, 14969041, 14288552, 13651575, 13062256, 12790656, 12355233, 11766652, 11444684, 11150430, 11052916, 11037382, 10993538, 10996464]
18061A0996464l93481k50879l59690p493j79696k87248j82070L5259K43380J07956
18051I722502J12893K32140k04163m6891m4948j98089q347j33301k25803m16416
18041H789577l88639l2809l27446k22159J32937k29877j92809j28802l07105l61141
18031F731727m76034n19693j15271l79590j40023k24384l51632n0919J41086J68796
18021D784063j12200O586L72664q8372k9088n9528N2342l061p0618K46766m3881
18010E055673k39603j3097k60623k96120k4270p5530J58422p2544j90948J29089
18000D170449J88825J21992K38190J4538j5434l50553j63281O6326O1569R2781
17990D425402M00191L72060l9229n300K22616L0840P037K02981L07961M25610
$$ y = [10996464, 10602983, 10352104, 9992414, 9984921, 9805225, 9517977, 9335907, 9371166, 9614546, 9722502, 9835395, 10067535, 9863372, 9816481, 9771533, 9573444, 9565097, 9431796, 9205993, 8789577, 8400938, 8368129, 8040683, 7818524, 7951461, 7721584, 7528775, 7399973, 7092868, 6731727, 6255693, 5736000, 5620729, 5241139, 5101116, 4876732, 4525100, 4474181, 4615267, 4784063, 4671863, 4678449, 5051113, 4962741, 4933653, 4874125, 4926467, 4923406, 4852788, 5099554, 5055673, 4816070, 4802973, 4542350, 4246230, 4221960, 4146430, 4304852, 4232308, 4041360, 4170449, 4359274, 4481266, 4719456, 4733994, 4718560, 4368007, 4204726, 4271052, 4332621, 4425402, 4825593, 5197653, 5158424, 5153124, 5375740, 5406580, 5413617, 5616598, 5924559, 6350169]
17980F350169l2005K00725P4031M95063o3191l47041j07060j85414m79192m91591
17970E414494n08821j94326j62622m48690m31154k02149k8808k34975j66799k0306
17960C015844k02471j98168O2672j21250n0325L6404J0186m0386L5010n9166L38328
17949B826678J25107j15308O2243L00481o8637l652q725l8954J39946J12555J08248
17938C439982o5947K0979K73822J65371r0O7777j49287k87641r9771K8624K4503
17927C418322k68525k09337j52748j68802j54940n3110K03597k48584l82445k70647
17917A712781R4780N9494j854J94593Q7145j45076J48901J66506j32091N0167
17907B235346R0265L64487q738k71835k34137K2491j84453l12247j32169K18735
$$ y = [6350169, 6318164, 6518889, 6592920, 7087983, 7024792, 6677751, 6570691, 6385277, 5906085, 5414494, 4905673, 4711347, 4548725, 4100035, 3668881, 3466732, 3437924, 3202949, 3036150, 3015844, 2813373, 2615205, 2677877, 2556627, 2506302, 2542706, 2552892, 2512506, 2547516, 2488350, 2826678, 2951785, 2836477, 2898720, 3199201, 3130564, 3126912, 3118187, 3079233, 3219179, 3331734, 3439982, 3374035, 3395014, 3668836, 3834207, 3834117, 3901894, 3752607, 3464966, 3365195, 3393819, 3418322, 3149797, 2940460, 2787712, 2618910, 2463970, 2410860, 2614457, 2365873, 1983428, 1712781, 1807561, 1867055, 1865201, 2059794, 2146939, 2001863, 2150764, 2317270, 2185179, 2235346, 2325611, 2690098, 2681360, 2409525, 2175388, 2197879, 2013426, 1701179, 1569010, 1787745]
17897A787745j40455j16056K1957O9811n4878j7339J113k533q6667j824j18683
17886A342191l12584j19651J41777K38301L53670O7349l02436n6599R2421j82475
17876A261964J4805K928J68207q8681k01854o6239o6611l0350k0065J6232O4144
17865A054480J46093K24146j81494k60129j18050k4665l762q2306K73265J7860
17855A045438j01973j15301j50521J45714P7707R6688K34745j68469p8417J9626
17845A005237j03934j66393k63381L9836J16856J53075j02758JL9974j23375K456
17834E97594M31891J09993j32374J31349j73186j55379k32507K26575o6629L17
17824G37644K44880k0971k2484J07009l8382l53157j9866L53957m9614j01044
$$ y = [1787745, 1647290, 1531234, 1553191, 1623002, 1568124, 1550785, 1551898, 1549365, 1462698, 1460874, 1342191, 1029607, 909956, 1051733, 1290034, 1643704, 1711053, 1408617, 1352018, 1444439, 1261964, 1276769, 1279697, 1447904, 1359223, 1157369, 1091130, 1024519, 994169, 974104, 990336, 1054480, 1200573, 1424719, 1243225, 983096, 865046, 840381, 836619, 754313, 1027578, 1045438, 943465, 828164, 677643, 823357, 901064, 997752, 1232497, 1064028, 985611, 1005237, 901303, 734910, 471529, 511365, 628221, 781296, 678538, 678539, 718513, 595138, 597594, 1029485, 1139478, 1007104, 1138453, 965267, 809888, 577381, 803956, 737327, 737644, 982524, 961553, 939069, 1046078, 1007696, 654539, 634673, 988630, 939016, 837972]
17814H37972m8924l0864K77926N7976J5421j65192l21739P2298J6334j56293K9511
17803E84426J83905J16793k01641p5368J57796K63160k9825l06481k90181J2837
17793D15421r8956k16439L9522J13283l0198m3454K26435K05804K57052o1058
17783H07412k16183j11107K5997m2824k68092K14084P3627L1988J64440j30489
17773E48853j00160O0614l0937K51652K8336k31389j27529j0344j73888j0567
17763B04641o5004K27837L156n6171J00585J86415L5564k277j69746j55667m9425
17752B59908K18667J80741J59154l7736K2941k25801M0772J86450m02027j38452
17742B64617J67085j23519K4208J67893j20718k95669P7291K30040j43095l32425
$$ y = [837972, 789048, 758184, 1036110, 1094086, 1109507, 944315, 622576, 694874, 711208, 554915, 584426, 768331, 885124, 683483, 608115, 765911, 1029071, 999246, 692765, 402584, 415421, 316465, 100026, 139548, 252831, 222633, 179179, 405614, 611418, 868470, 807412, 591229, 480122, 506119, 463295, 195203, 409287, 482914, 514902, 679342, 548853, 448693, 509307, 478370, 730022, 758358, 526969, 399440, 389096, 215208, 204641, 139637, 367474, 370630, 314459, 415044, 601459, 637023, 634746, 465000, 309333, 259908, 478575, 659316, 818470, 780734, 803675, 577874, 618646, 805096, 403069, 264617, 431702, 308183, 332391, 500284, 379566, 83897, 161188, 391228, 248133, -84292]
17732h4292K1294J34959L0197J82310m9280J21373q4439j83987k54208k68839
17722d34912J7093K56517R9987K3126q4648N4934r0962J17805R4099k181J97292
17711B48150K85641J82023j36812Q1427j60949J643j66448n7822J07481O7800
17701D52134j7765K09270j33132o4287p6884l98149o1512K31693m6053m0053j25349
17690g0087m5505J39451R519j40311M5210J42229J64647L23393J38038p2112l4247
17679F00225p3382k99060j44162J50575j04767j18252k28885J06758J87508J1020
17669H7578m1759L20771J23026K074N4287j08724j08496k51317J26554J41144
17659C45138k6700m924j46339K01320L17303R9982r9824j19003j18648k01231
$$ y = [-84292, -62998, 71961, 102158, 284468, 235188, 356561, 272122, 88135, -166073, -434912, -417819, -161302, -61315, -38189, -122837, -67903, -158865, -41060, 53039, 50858, 248150, 533791, 715814, 579002, 660429, 499480, 501123, 334675, 276853, 384334, 452134, 434369, 643639, 510507, 446220, 369336, -28813, -90325, 141368, 95315, 55262, -70087, -115592, 23859, 33378, -106933, -61723, 80506, 245153, 568546, 706584, 634472, 600225, 526843, 227783, 83621, 234196, 129429, 11177, -217708, -110950, 76558, 87578, 45819, 366590, 489616, 491690, 545977, 437253, 328757, 77440, 203994, 345138, 318438, 313514, 167175, 368495, 685798, 785780, 685956, 566953, 448305, 247074]
17649B47074j47612J86083O1286k03193O5617j39892j42672K78604l3877m63079
17639b91661P9320O6695O8971N05962J19462l5286K2658J38148Q2857j15256k00000
17628D41870k60783n2878K62298J33603o8347J34151N2267K07223m8779l08591
17618D92034k71929J03302m4997l5164j4548j04112n6623K6985J75031M1102J48213
17607D59294N0998j56813k48520J48838J21016p2718J7828J639L9915K9180j24431
17596B66226J15081j00627p2665K59249P8175j64421l615K60989L8063l00284
17586C76171J59638R9747J34012N635l47859l61038j76736O8571j58707J66668
17576c3898J86076O0698K86761R9810j00131j80361L4334J8970j52441l2001j66263
$$ y = [247074, 99462, 285545, 346831, 143638, 209255, 69363, -73309, 205295, 171418, -291661, -212341, -145646, -76675, 429287, 548749, 513463, 536121, 674269, 757126, 641870, 441870, 181087, 128209, 390507, 524110, 455763, 589914, 642181, 849404, 800625, 492034, 220105, 323407, 278410, 243246, 228698, 124586, 67963, 94948, 269979, 311081, 459294, 510292, 353479, 104959, 253797, 374813, 302095, 319923, 321562, 361477, 390657, 266226, 381307, 280680, 208015, 467264, 545439, 381018, 377403, 638392, 676455, 376171, 535809, 635556, 769568, 775203, 427344, 66306, -110430, -41859, -200566, -33898, 152178, 212876, 499637, 599447, 499316, 318955, 353289, 372259, 219818, 187817, 21554]
17565B1554J6653N3763o6343p246k64194K04697L63145J78563k06872k57514o1786
17554b5580O65187R8510j54088P3157j64385m2226J6017j81584Q5734M0578L2610
17543D43930M7975k6691k00629r463n621o3342J08129q8398m4632k52616j78420
17532b69778J63198L57699m6768J04555J07672J65521j95135m20791m02089J3884
17522d22032K89856j22980k1416J69968K04768n7425k20717o4390L2622J09442
17512a02304J02887q3681m75554J61831M25200L53744P9559m78119k72532J85340
17502a03629J22074j3376K34640K887R0234m8163J19261j60097k31754j48285
17492a36208K43815N77700O0881n742q9548j62709j47024j00655k56889k15039
$$ y = [21554, 38207, 91970, 25627, 18381, -245813, -41116, 322029, 500592, 293720, 36206, -25580, 639607, 738117, 584029, 657186, 492801, 450575, 466592, 285008, 370742, 411320, 443930, 491905, 465214, 264585, 255122, 249501, 186159, 294288, 205890, 161258, -91358, -269778, -106580, 251119, 204351, 308906, 416578, 582099, 386964, -33827, -435916, -422032, -132176, -255156, -276572, -106604, 98164, 40739, -179978, -244368, -211746, -102304, 583, -83098, -558652, -396821, 28379, 382123, 461682, -16437, -288969, -103629, 18445, 5069, 239709, 242596, 332830, 284667, 403928, 243831, 12077, -136208, 107607, 685307, 746188, 740446, 650898, 488189, 341165, 240510, -16379, -231418]
17482b31418J8284K03346k09547j37595O2903J8459L30645K62413J53412k26206
17472B44696k32836P1085M829N9084P5648J10814L3051l9777O6491J07310j46761
17461C53634j56783N6620o7272j89505j15369l3463k23857K95536K30638K25217
17451C75396Q668j17992p3715O8204J04121n2038m5248k7037r5928K11079L48528
17440G04038L84822J47712K13598K96277R2346r7793k51347o49547j47721m010
17430F88375J91994j14604m73895k21458M2120K70604O7568l2208R029j80356
17420B47169j3845k34270O2223J35810O5444K37440P8582k64539J5191N9154K59685
17409F48044j11207j62902j06218j57370k06518Q4695k43848j02411K63653o2635
$$ y = [-231418, -213134, -9788, -219335, -356930, -294027, -275568, 55077, 317490, 470902, 244696, 11860, 82945, 87774, 146858, 222506, 333320, 366371, 326594, 393085, 500395, 353634, 196851, 253471, 186199, -3306, -118675, -152138, -375995, -80459, 150179, 375396, 384064, 266072, 192357, 260561, 364682, 312644, 267396, 240359, 144431, 355510, 704038, 1088860, 1236572, 1450170, 1746447, 1838793, 1741000, 1489653, 840106, 692385, 688375, 880369, 765765, 291870, 70412, 112532, 383136, 450704, 418496, 427525, 247169, 233324, -946, 61277, 197087, 262531, 499971, 578553, 314014, 329205, 388359, 648044, 536837, 373935, 267717, 110347, -96171, -11476, -255324, -357735, -94082, -156717]
17399a56717O1481J37151o8154J11262J10953K13283j01123J20767K5995j53784
17389C01114n6221l6837R8261L9755k1515j63013o9218r885J36413P1278k05984
17378H4148J88367Q9109j42726J67219q8307K5723k04271l58163j49109q2340
17368d70350J28405M05753J0934P6321J48429J38104J19210k15269L1798O563
17358C79898l5481N336L1046O2130m8286N7540J51732k91723k38027J62739L44412
17347E81316m4262l04422j7404j17511m6654m4476p0420K7833J42870M50544j25427
17336D31987j99604j03340j44870k87125m3304J49238R3284K06953O470o7631
17326D2058L26493L26023j0897m81354j41717j099L9090j29782m4740J86274n0536
$$ y = [-156717, -95236, 41915, -26239, 85023, 195976, 409259, 308136, 428903, 454898, 301114, 244893, 208056, 306317, 346072, 324557, 161544, 92326, 82441, 218854, 290132, 84148, 272515, 361624, 218898, 386117, 297810, 323533, 119262, -238901, -388010, -470350, -341945, 63808, 74742, 151063, 299492, 437596, 556806, 341537, 373335, 379898, 344417, 349753, 380799, 442929, 394643, 452183, 603915, 312192, 74165, 236904, 581316, 537054, 232632, 215228, 97717, 51063, 6587, -63833, -36000, 106870, 557414, 431987, 232383, 129043, -15827, -302952, -346256, -197018, -103734, 103219, 109689, 42058, 368551, 694574, 683677, 202323, 60606, 59507, 98597, -31185, -75925, 110349, 59813]
17315E9813j20819o5856J64128K47452p846j85255O0740K92392j636r8532R3875
17304D38456j93112k85934J62946O0061J91258l6321p17k35913m9871j90893J29530
17293a0510R4585n3963J06804K63117K08544L4898q9799N6650j03402k54304q7167
17282A65453n7672J82699J33027J12647k54513o8145j42612n1296M6406N3673
17272A19667J44845R618m4047p7271O3284Q9418k34588K50658K25105J14713l91
17261F61011j11417j03538o2697j23480j07663K1424q6451L25206L1134n2306
17251C91223l2352r2426O9040k04954r8461K91957M07380k88356j55498k75182
17241A2371m2965J94688N8272L33892k0174J22658O5666K5729J13344o1977k62695
$$ y = [59813, -61006, -126862, 37266, 284718, 276872, 91617, 152357, 444749, 443113, 344581, 438456, 245344, -40590, 122356, 182417, 373675, 337354, 336637, 100724, 50853, -140040, -10510, 84075, 30112, 136916, 400033, 608577, 643475, 553676, 610326, 506924, 252620, 165453, 107781, 290480, 423507, 536154, 281641, 213496, 70884, 19588, 65994, 119667, 264512, 274130, 230083, 152812, 216096, 305514, 70926, 321584, 546689, 661402, 661011, 549594, 446056, 383359, 259879, 152216, 173640, 87189, 412395, 443529, 391223, 358871, 266445, 335485, 130531, 32070, 324027, 731407, 443051, 287553, 12371, -30594, 164094, 222366, 556258, 536084, 658742, 724408, 750137, 863481, 801504, 538809]
17230E38809m51911j30147k55995L19514L12967j12870p897j30903k95011j51425
17220c64869L48113j13719j48707J11213n4605l5913K27775J73611J0612q7735
17210F5776l01244m3165J45468K38107M82648L43104l8330l91933m05114j49284
17200e3967J3799L16501J42520j84837o6422j82167J25684M6969p6175m6120O7613
17189A03398J95625P6683j76101j78283n990J4301k6100n478K69642M25754o0014
17178F33437j6008q7524j22644k75522j75772M7625J19232K21947K60099M2763
17168F47633k98369l30735J04373q6333k54080R486R2375K10184O8920q2079j75418
17157i4043j7088K09793P2637N0653l5046J44636k26621l49323q6839J09710K17575
$$ y = [538809, 86898, -43249, -299244, 20270, 333237, 220367, 212470, 81567, -213444, -364869, -16756, -130475, -279182, -167969, -222574, -258487, -30712, 142899, 153511, 65776, -235468, -278633, -133165, 104942, 587590, 930694, 892364, 500431, 95317, -53967, -40168, 276333, 418853, 234016, 167594, -14573, 111111, 158080, 81905, 35785, 103398, 299023, 375706, 199605, 21322, 15332, 29633, 3533, -1945, 267697, 693451, 633437, 617429, 529905, 407261, 131739, -44033, 3592, 122824, 344771, 604870, 647633, 349264, 18529, 122902, 36569, -217511, -208025, -115650, 94534, 163454, 81375, -94043, -111131, 98662, 171299, 221952, 186906, 331542, 104921, -244402, -331241, -221531, -3956]
17146c956o5107l11678Q378K16291J80511N6846j01387j95962N8023Q3427K99295
17135B24681l3034m3325M8010k7034j14401o5706Q5238r3720p0018Q643j36418
17124b17084L44364Q0072L5083k76629k00997n630N1120k67774n0622M06022Q032
17113i4043k90459j1969J38836J41028Q1097K20788L6612m82401j32600K62814
17103a30297J37315L4640k23616l5318k3011J07546L16240P3506J63455l020j31795
17092B85645j39486j86960k1022j6126J0773j27596R622P0166Q8870J81846K31663
17081C87395j64167p8343j01870r8723k98609k65228O6689J35869J96891L12283
17071I2187P6949l50989k4989P0208J5800o8310j0264K55842Q6894K48382k88656
$$ y = [-3956, -69063, -380741, -372363, -156072, 24439, 81285, -20102, -216064, -158041, -74614, 224681, 191647, 148322, 196332, 169298, 54897, -10809, 74429, -19291, -89309, -80666, -217084, 127280, 207352, 242435, -34194, -235191, -240821, -189701, -457475, -508097, -102075, -94043, -384502, -396471, -257635, -116607, -35510, 185278, 221890, -260511, -393111, -130297, 7018, 41658, -181958, -217276, -240287, -132741, 183499, 257005, 420460, 417440, 285645, 146159, -40801, -61823, -77949, -67176, -194772, -185150, -114984, -26114, 155732, 387395, 223228, 144885, 43015, -55708, -354317, -619545, -552856, -416987, -220096, 92187, 169136, -181853, -206842, -136634, -120834, -189144, -199408, 56434, 143328, 391710, 103054]
17060A03054j02637O522l8110k10387N6902J40408L75956Q4082J4048L7415j10630
17049C56623j39847j70847L8784L8789K47006j125r7442J86007j59254k43710
17039E4984K42688J51023J03590r8222k64285j46234J44935j1750J86920l6550
17029C27099l47278j34164L39774K35399k6895j83149k36979j71214J51351J10777
17019F4721l7267J0985L4266J02355N7620n2575j27923N9447P7674r5061l22032
17008b27790j5271J79582K1428j22339k9229p2427J78828J33622j14671K0999
16998d7268j1521q924j82857j56893k82399K81041K11822m1592K48962J2548K5858
16987D8777J63240M5398o2138j56133N9335l7377K10849o1736M305J74426j52693
$$ y = [103054, 417, 6939, -31171, -241558, -184656, -44248, 331708, 415790, 429838, 467253, 356623, 216776, 45929, 84713, 123502, 370508, 369383, 271941, 457948, 298694, 54984, 297672, 448695, 552285, 454063, 189778, 43544, 188479, 176729, 363649, 327099, -20179, -154343, 185431, 420830, 393935, 210786, -26193, -197407, -46056, 64721, 27454, 38439, 72705, 175060, 232680, 180105, 52182, 111629, 189303, 94242, -227790, -243061, -63479, -42051, -164390, -193619, -266046, -87218, 46404, -68267, -47268, -58789, -67713, -250570, -407463, -689862, -408821, -196999, -238591, 10371, 22919, 48777, 212017, 257415, 195277, 39144, 98479, 61102, 271951, 210215, 214520, 388946, 236253]
16976B36253l75052p5934M2406L04688M5459j79217m16290k54237R1634K05423
16966c74867P2451K51977K49834J5654K17160P7025j84310k08806k44605J58112
16956B9625m6497J36943J58873Q825J63057o0273K9195p9447j05601k71415J95819
16945A59104R2747J23005r5872j37386J91491j31214N3785j61244m9335k1569
16935B3512q1854j10064K75766J33236q6559k57583j94984l9730K40060O2521
16925c5679j92577m9876j59255l5752K49587J71618n0955k43871K898L6144j8658
16914c26376L28685J53532m5458J58975K27099K22166k34212l73029O0176l9404
16904A32154L64603P0833m66726m8415l09602j78910m1376J13121j17225r4365
$$ y = [236253, -138799, -214733, -172327, 132361, 177820, -1397, -417687, -671924, -580290, -374867, -302416, -50439, 199395, 215049, 432209, 509234, 324924, 116118, -128487, 29625, -16872, 120071, 278944, 287769, 450826, 390553, 419748, 340301, 234700, -36715, 159104, 251851, 374856, 278984, 141598, 333089, 201875, 255660, 94416, 45081, 23512, -58342, -168406, 107360, 240596, 154037, -103546, -298530, -338260, -98200, -35679, -228256, -278132, -437387, -473139, -223552, -51934, -102889, -346760, -343862, -307718, -326376, 2309, 155841, 110383, 269358, 496457, 718623, 484411, 111382, 171558, 132154, 496757, 567590, 100864, 52449, -257153, -436063, -477439, -364318, -481543, -575908]
16894e75908L1361J66889n4348J46387J53174K30310N2657J23504k03690j25096
16884e4760J93770O2250j52667r7929k44515L5141j6999p569L57869m8588M1229
16873F7232p8125K3983K1704J66375m5139J19421j1178J52830P3728j69107j06736
16862B14988K24318p1749j17191k06930M1256K14977k47369r4448J06877K04830
16852B69559k65166p4836K40617M2519P3145j0785J29373j91296n6030k52749
16842i5649j01882k24309J48156K05253M6033Q2813O7042K92226k5374k54953
16832A39356L1416j36044j7998P0004j87365L6402m6895k77908K05187M70373
16822B86528J07077k06137J1419R9652k00949q7362J80529m5792k6089J61650
$$ y = [-575908, -544547, -377658, -432006, -285619, -132445, 97865, 150522, 274026, 70336, -54760, 139010, 201260, 48593, -49336, -293851, -258710, -275709, -283278, 74591, 26003, 67232, -10893, 13090, 34794, 201169, 156030, 275451, 264273, 417103, 490831, 321724, 214988, 439306, 367557, 250366, 43436, 84692, 299669, 52300, -42148, 64729, 269559, 4393, -70443, 170174, 212693, 285838, 275053, 404426, 213130, 157100, -95649, -197531, -421840, -273684, -68431, -22398, 60415, 127457, 419683, 394309, 139356, 170772, 34728, 16730, 86734, -100631, -64229, -111124, -389032, -183845, 286528, 393605, 187468, 198887, 298539, 97590, 10228, 190757, 144965, 118876, 280526]
16812B80526J55567L6110j8066P9273R6456Q1749k11323k79923J1026k08858P0724
16801I3261M9328o89J8049j31271J64252k17293o3441j46700l52L35204m6640
16790E3708K01776L00824o9854j78652o4039k05967j78736J29742J21290k0095
16780H9997P104j1140L333j33349j09423J98987K503l42742q6217K01136L05974
16769A26163p6043l56865K3431P2742K11720K25983o926L4695O2542j44518j32488
16758D0436j8975k41893j52998K46778K64081n1662L1026K36274L08960k04059
16748D57968N499j16284l13731j33537K2521R5844K2775j04290l03978l3727K87594
16737a13346Q6810k59685r0966K13637J12325O4850J77251M5125J9605q3093k5339
$$ y = [280526, 436093, 472203, 454137, 533410, 629866, 711615, 500292, 220369, 231395, 22537, 93261, 142589, 141900, 159949, 28678, 192930, -24363, -87804, -234504, -234856, 100348, 53708, 255484, 556308, 486454, 307802, 243763, 37796, -140940, -11198, 110092, 89997, 97101, 85961, 89294, -44055, -153478, 45509, 48012, -294730, -380947, -179811, 126163, 50120, -306745, -283314, -210572, 1148, 227131, 220205, 254900, 317442, 172924, 40436, 21461, -220432, -373430, -126652, 137429, 85767, 116793, 353067, 662027, 457968, 463467, 347183, 33452, -100085, -77564, 18280, 41055, -63235, -367213, -400940, -113346, -26536, -286221, -377187, -163550, -51225, 13625, 190876, 236001, 255606, 172513, 147174]
16726A47174m7823n6597P0748R0494j06744k7112J77204j40501q833L01053M8793
16715D47856k90482p3211p8164k00935Q6301p7293J40010J15037O7261R6327m3497
16704A89210k75932k76779M9549L00402K71795k73930j77871R6085l9188K5240
16694a11419J70989n590K0958j09625M2158j81449m1473K91569J47775j05133
16684A18760n116q983r2113J04987J47534J44355m12340j40853J3779J25398k13546
16673b18138q089Q9815R4829M6865L1925J8521l7084l1002L61628m0849j21979
16662A86442j37682R147O8164m89253l8335J86066M66291J764J03846O1092m1865
16651C75677j28081k20202m13045k31509K37436K47179M3336k345K2573l5314
$$ y = [147174, 99351, 42754, 113502, 203996, 97252, 70140, 247344, 106843, 98010, 399063, 447856, 157374, 84163, 5999, -194936, -108635, -185928, -45918, 69119, 136380, 232707, 189210, -86722, -363501, -313952, -13550, 258245, -15685, -193556, -97471, -136659, -111419, 59570, 53980, 74938, -34687, 7471, -173978, -215451, 76118, 223893, 118760, 113644, 104661, 12548, 117535, 265069, 409424, -2916, -143769, -129990, -4592, -218138, -226227, -136412, -41583, 5282, 37207, 55728, 18644, -12358, 349270, 308421, 186442, 48760, 57907, 126071, -363182, -401517, -215451, 250840, 252604, 356450, 417542, 375677, 247596, 27394, -385651, -617160, -379724, -132545, -89209, -91554, -68981, -104295]
16641a04295R9273l817M4513Q4639J50722j11348k20341J1851j20715P1037K94436
16630A95955J88069q1666J15364q7715M1377L25959j47094j61018J793J28843
16620E19867Q772k42452j93399k84928J25413K33029M9692j6206j43598M4884
16610A01074N7858j28133k80253K9755J38710P1270J55867J46000N7263l65862
16600a6451J59511K40267L6498l49944J07223J21136n5530l86836j7986L10590
16590A48478Q9716k05966j40214o2781J09205k7656K10838J22639P626k66624
16580a4739o4228Q315K14376J39269l32054l02934N2564K18254L18939R1803K3952
16569C53517M1332J06991k37341j75605R9247J24230r2306O9101k15473m51553
$$ y = [-104295, -5022, -8839, 35674, 120313, 271035, 159687, -60654, -48803, -169518, -98481, 195955, 384024, 302358, 417722, 330007, 371384, 697343, 550249, 389231, 391024, 519867, 528639, 286187, 92788, -192140, -66727, 166302, 215994, 199788, 56190, 101074, 158932, 30799, -249454, -219699, -80989, -9719, 146148, 292148, 349411, -16451, 143060, 383327, 419825, 69881, 177104, 298240, 242710, -144126, -162112, 148478, 238194, 32228, -107986, -170767, -61562, -89218, 121620, 244259, 251885, -14739, -78967, -70652, 143724, 282993, -49061, -351995, -299431, -81177, 237762, 329565, 353517, 394849, 501840, 264499, 88894, 188141, 312371, 220065, 289166, 73693, -377860]
16559c77860M2364L79142J76900m7690j45650j98944J8077M8712L66405K43476
16549E04932n6171k8711j66318j31236j17555l45091J34579J01302P3041J28581
16539I7353Q9900j5669j02077l4402r2692L02584K46098k46585j38469j72974
16529f6933j71298m0952K09957L40000J533l21093k07911R0008J83079J25492
16519A41882p3382J02100J01955j80990k45489O5743J4725J65664l0434J21104
16509A82878K25308J89393k42910k38812P2400J80275p8283r5025n8430j00243
16499C6551q7749q7052p7433J78491O7045K05403o4387k83065p7712M06602K8771
16488B45465K8473J50245K26573q3651j47234j29465l21475o7527K22189N9176
$$ y = [-377860, -335496, 43646, 220546, 172856, 27206, -171738, -153661, -104949, 261456, 504932, 448761, 420050, 253732, 122496, 4941, -340150, -205571, -104269, -31228, 97353, 187253, 171584, 69507, 35105, -57587, 244997, 491095, 244510, 106041, -66933, -238231, -279183, -69226, 270774, 272307, -48786, -256697, -166689, 16390, 141882, 68500, 170600, 272555, 91565, -153924, -88181, -73456, 92208, 61774, 182878, 408186, 597579, 354669, 115857, 188257, 368532, 290249, 195224, 136794, 36551, -51198, -138250, -215683, -37192, 29853, 235256, 170869, -112196, -189908, 216694, 245465, 273938, 424183, 650756, 567105, 419871, 290406, -31069, -98596, 123593, 182769]
16478A82769K7394j27179j9082j04413K75731L79219q4227O9778j13108k84615
16468B02267j75452O917J17660L0926j00497R7951j80143o0841P6955j14975k02207
16457c01439Q5698M0027k97879O5489K70638Q5836K30590k16708p5860R3990j50423
16446a70041M8084J57286K68716P3845j49007l12254q1494l3378J7891K66891
16436H6539L33865J29769j90163l64595k48611J06892J08371j28281p7905J61914
16426h2205R8134j87037l9069J2085r7706P4141R9930K29458j24519j44080J6706
16415a44162L37382M24501q051n3888q5856n6251K46767k32285l81683o5949r2827
16404a12302J22716r6404j98256J16812K45494O4544J14654j63448k11506O780
$$ y = [182769, 210163, 82984, 63902, -40511, 235220, 614439, 530212, 599990, 486882, 202267, 26815, 33732, 151392, 182318, 81821, 179772, -371, -61212, 15743, -99232, -301439, -215741, -175714, -473593, -408104, -137466, -51630, 178960, -37748, -113608, -19618, -170041, -121957, 35329, 304045, 377890, 228883, -83371, -164865, -198243, -180352, 86539, 420404, 550173, 360010, -4585, -253196, -146304, -37933, -166214, -244119, -82205, 15929, -171108, -210177, -198092, -295798, -221657, -121727, 107731, -16788, -160868, -144162, 193220, 617721, 609670, 555782, 469926, 413675, 660442, 428157, 46474, -19475, -112302, 10414, -85990, -284246, -167434, 78060, 142604, 257258, 93810, -117696, -110916]
16394a10916J61333J08847k99292j87036P360r351K8798n5554n5531J6766J48914
16383b45662m5920k0650J12738M7464k2891R5109K2896K4203m844j00483N4587
16372h3453J96549l36q1146r6916k28656j42940Q6468L4805j2187r2786J03217
16361c17381L12503J54479k09593j73073K21757j2964K20507J41629O1414L3368
16351D32646k62861j84749o3202J81562L4220J26535R24j97795k87645J37656
16341h2709K56713P7069m5082p0878l88981j25868K8946J0587J87363m907J97804
16330D0057K95683O5905k38891J01571J12160k2910l68196j32205L03182j82148
16320b5792k69779j39175P536J76247O7803j52350j59426J80979m4774j03687
$$ y = [-110916, 50417, 159264, -140028, -327064, -319704, -329055, -300257, -355811, -411342, -394576, -245662, -291582, -312232, -199494, -152030, -174921, -79812, -56916, -32713, -37557, -138040, -83453, 113096, 112760, 31614, -65302, -293958, -436898, -350430, -315625, -327812, -420598, -317381, -4878, 149601, -59992, -233065, -11308, -24272, 196235, 337864, 399278, 432646, 169785, -14964, -78166, 103396, 137616, 264151, 265075, 67280, -220365, -82709, 174004, 251073, 205991, 135113, -253868, -379736, -350790, -340203, -152840, -157747, 40057, 335740, 401645, 162754, 264325, 376485, 353575, -14621, -146826, 156356, -25792, -295571, -434746, -427210, -250963, -183160, -335510, -494936, -313957, -358731, -462418]
16310d62418j19323J6127K55819J63613J05761j1652j53655M6929k6817l09322
16300d94938n689K86817K33277p9137Q0038L28407J71085k59205j17083k01439
16290e7867j68030Ml6288J93451k14810k15153K50889q4277J02273K59584K17251
16279B47027J07380j17913k3974Q3952j69742j30500j8688l25906j0805J49733
16269b09436L72219K06979m06196l33333J27086Q4367J68927o4934j50175j74563
16259c79059K39523L07077O3648K62288M0619j30813k13402P3269j69386k46987
16249a53223k38978R3248K03841N0986K6158M2979j04244r5181Q2193j53541J88405
16238e7357J92878o0903j79643R3305r044j11269n76189j5024L03092J48656K6225
$$ y = [-462418, -581741, -565614, -309795, -146182, -40421, -52073, -205728, -158799, -185616, -494938, -500627, -213810, 19467, -59670, 20368, 348775, 519860, 260655, 143572, -57867, -225897, -225893, -262181, -68730, -283540, -498693, -247804, -332081, -229808, 29776, 247027, 354407, 236494, 212520, 296472, 126730, -3770, -22458, -348364, -359169, -209436, 162783, 369762, -36434, -369767, -242681, -158314, 10613, -54321, -204496, -379059, -139536, 167541, 231189, 493477, 534096, 403283, 189881, 263150, 93764, -153223, -392201, -298953, -95112, -44126, -17968, 25011, -79233, -174414, -92221, -245762, -57357, 135521, 74618, -105025, -11720, -20764, -132033, -708222, -723246, -420154, -271498, -245273]
16227b45273J20893O9593l50529k83019J91027M31590N73819N6034k79891r922
16217B74322j22835k63366K27169p5916j46461K593K28766q6222L9672n5508p6832
16206e4618k13539K75212K06294l9620j21669o4999J41140J51164q537l4862k76117
16195d0151j71686j89030l3997k8809K4091Q1132N1395K87719J5906j01681L1667
16184g3444p7235j63236K5216J40929O4843k16510L9577R2812R3613J92364K61835
16173C80764n1275l43327j58945j47540m2059J95835k8217j09155j98203p980
16163e10102J85609L04918J81367K36259l64043m26924l29378j0963P0925K36768
16153d25564J41548j7507J29486p574O7592J02462j06043k7601J25952l0573Q7469
$$ y = [-245273, -124380, -54787, -405316, -688335, -497308, -65718, 508101, 564135, 284244, 274322, 151487, -111879, 115290, 39374, -107087, -104494, 124272, 38050, 77722, 22214, -54618, -268157, 7055, 213349, 173729, 52060, -12939, 128201, 279365, 270828, 235966, -40151, -211837, -400867, -434864, -463673, -439582, -358450, -307055, -19336, -3430, -105111, -73444, -150679, -313915, -288699, -147770, -82927, -299437, -259860, -167048, -73435, 118929, 380764, 329489, -13838, -172783, -320323, -362382, -166547, -194764, -303919, -502122, -510102, -324493, -19575, 161792, 398051, 34008, -392916, -722294, -733257, -662332, -425564, -284016, -301523, -172037, -179611, -112019, -9557, -115600, -143201, -17249, -47822, 39647]
16142C9647K8555O5242j89819M2032N5747M6941N9214n2369J59186o9439l34328
16131a49391n6590K07620J13469J36135J6021m2172j7206J78618o2554k92246
16121C1704j98798O4392K63150q186k91900K5608k98542j74555K12295J66246
16111b08586L31615O2252j81571j43840M58038j19043k28551l35158k20589Q1159
16101e04274K19106l6994J97469J92904J3960L1042J2605Q9100k76458l11945
16091c73485J29747J69624l1457J88722K13296p6172j13285K6721k5961j76264
16081f8514k39458k09397J73466K31672J285O8699o7925Q5224J41036j38268m869
16070b7049p5032L14871N682L17354r0933k80622l83194k17741L00850M16425
$$ y = [39647, 68202, 133444, -56375, -14343, 41404, 88345, 147559, 95190, 254376, 184937, -149391, -205981, 1639, 115108, 251243, 267264, 225092, 207886, 386504, 323950, 31704, -167094, -102702, 160448, 152262, -139638, -114030, -412572, -587127, -374832, -208586, 123029, 185281, 3710, -140130, 317908, 198865, -29686, -364844, -585433, -504274, -285168, -322162, -124693, 68211, 82171, 113213, 125818, 214918, -61540, -373485, -243738, -74114, -105571, 83151, 296447, 220275, 106990, 133711, 107750, -68514, -307972, -517369, -343903, -112231, -110946, -42247, -110172, -24948, 116088, -22180, -27049, -102081, 212790, 218472, 535826, 444893, 164271, -218923, -436664, -135814, 280611]
16060B80611j17055j60780k42455k09649l22777K41096L70720O09335M0955j62553
16050C27448j56913j15498J45869k93120J89837J63983J93813r294j87613m63749
16040b05237Q3773L18803O476K6379J75054o3828m6244K01078o014j92273J15905
16029D13872j99021j89615O9789K87331m2034k04890J20701P0007j15784l39058
$$ y = [280611, 163556, 2776, -239679, -449328, -772105, -531009, -160289, 449046, 490001, 327448, 170535, 55037, 200906, -92214, 97623, 261606, 455419, 446125, 258512, -205237, -121464, 197339, 203815, 230194, 405248, 341420, 295176, 496254, 490240, 297967, 413872, 214851, 25236, 95025, 382356, 340322, 135432, 256133, 326140, 210356, -128702]
$$ [...]
##END NTUPLES=NMR SPECTRUM
##END=
