##TITLE=Analysis number 321527
Compound Code mo 01212
Project Code adrs
Chemist Name iflab
##JCAMPDX= 6.0         $$ Bruker NMR JCAMP-DX V2.0
##DATA TYPE= NMR SPECTRUM
##DATA CLASS= NTUPLES
##ORIGIN= Bruker BioSpin GmbH
##OWNER= nmr
$$ XWIN-NMR		Version 3.5
$$ Tue Aug 15 08:59:44 2006 GMT Daylight Time (UT+1h)  MAYBRIDGE\nmr@NMR_250MHZ
##.OBSERVE FREQUENCY= 250.131544655141
##.OBSERVE NUCLEUS= ^1H
##.ACQUISITION MODE= SIMULTANEOUS (DQD)
##.ACQUISITION SCHEME= undefined
##.AVERAGES= 16
##.DIGITISER RES= 18
##SPECTROMETER/DATA SYSTEM= dpx250
##.PULSE SEQUENCE= zg30
##.SOLVENT NAME= DMSO
##.SHIFT REFERENCE= (INTERNAL, DMSO, 0, 16.522)
##AUDIT TRAIL= $$ (NUMBER, WHEN, WHO, WHERE, WHAT)
$$ ##TITLE= Audit trail, XWIN-NMR		Version 3.5
$$ ##JCAMPDX= 5.01
$$ ##ORIGIN= Bruker BioSpin GmbH
$$ ##OWNER= nmr
$$ C:\u/data/dgb/nmr/ADRS/860/pdata/1/auditp.txt
$$ ##AUDIT TRAIL=  $$ (NUMBER, WHEN, WHO, WHERE, WHAT)
(   1,<2006-08-15 08:59:23.89 +100>,<MAYBRIDGE\nmr>,<NMR_250MHZ>,
      <created by zg, POWCHK disabled, PULCHK disabled
       configuration hash MD5:
       E2 DF 36 D8 04 B2 41 60 5A D7 A3 38 5A 4B D0 FE
       data hash MD5: 64K
       49 A4 3F 35 31 F3 17 61 11 F9 73 F7 19 0C 3C 17>)
(   2,<2006-08-15 08:59:35.27 +100>,<MAYBRIDGE\nmr>,<NMR_250MHZ>,
      <Start of raw data processing
       ef LB = 0.3 FT_mod = 6 PKNL = 1 SI = 32K 
       data hash MD5: 32K
       C6 C1 33 F2 CF 13 FA 8B 2F 19 68 8B FB CD 76 11>)
(   3,<2006-08-15 08:59:37.00 +100>,<MAYBRIDGE\nmr>,<NMR_250MHZ>,
      <apk 
       data hash MD5: 32K
       AB 66 12 B1 F3 78 53 D2 A4 88 4D 76 6C 2A 14 9F>)
(   4,<2006-08-15 08:59:37.81 +100>,<MAYBRIDGE\nmr>,<NMR_250MHZ>,
      <abs ABSG = 5 
       data hash MD5: 32K
       62 08 DC DA 8F C1 E2 A3 7A 05 EC 31 03 B5 8A FB>)
$$ ##END=
$$ 
$$ hash MD5
$$ D6 19 0D 17 6A 28 DA F2 15 32 6B 82 87 6D 1C DF
##$RELAX= 
##$RELAX= 
##$RELAX= 
##$RELAX= 
##$RELAX= 
##$RELAX= 
##$RELAX= 
$$ Bruker specific parameters
$$ --------------------------
##$DU= <C:\u>
##$EXPNO= 860
##$NAME= <ADRS>
##$PROCNO= 1
##$TYPE= <nmr>
##$USER= <dgb>
##$AMP= (0..31)
100 100 100 100 100 100 100 100 100 100 100 100 100 100 100 100 100 100 
100 100 100 100 100 100 100 100 100 100 100 100 100 100 
##$AQSEQ= 0
##$AQ_mod= 3
##$AUNM= <au_zg>
##$AUTOPOS= <8 >
##$BF1= 250.13
##$BF2= 250.13
##$BF3= 250.13
##$BF4= 250.13
##$BF5= 500.13
##$BF6= 500.13
##$BF7= 500.13
##$BF8= 500.13
##$BYTORDA= 1
##$CFDGTYP= 0
##$CFRGTYP= 5
##$CHEMSTR= <none>
##$CNST= (0..31)
1 1 145 1 1 1 1 1 1 1 1 1 1 1 1 1 1 1 1 1 1 1 1 1 1 1 1 1 1 1 1 1 
##$CPDPRG= <>
##$CPDPRG1= <>
##$CPDPRG2= <>
##$CPDPRG3= <>
##$CPDPRG4= <mlev>
##$CPDPRG5= <mlev>
##$CPDPRG6= <mlev>
##$CPDPRG7= <mlev>
##$CPDPRG8= <mlev>
##$CPDPRGB= <>
##$CPDPRGT= <>
##$D= (0..31)
0 1 0 0 0 0 0 0 0 0.06 0 0 0 0 0 0 0.0002 0 0 0 0 0 0 0 0 0 0 0 0 0 0 
0 
##$DATE= 1155628762
##$DBL= (0..7)
120 120 120 120 120 120 120 120 
##$DBP= (0..7)
150 150 150 150 150 150 150 150 
##$DBP07= 0
##$DBPNAM0= <>
##$DBPNAM1= <>
##$DBPNAM2= <>
##$DBPNAM3= <>
$$ [...]
##$SUBNAM7= <"">
##$SUBNAM8= <"">
##$SUBNAM9= <"">
##$SW= 20.6930455092707
##$SWIBOX= (0..15)
0 0 3 0 0 0 0 0 0 0 0 0 0 0 0 0 
##$SW_h= 5175.983436853
##$TD= 65536
##$TD0= 1
##$TE= 295.16
##$TE2= 300
##$TE3= 300
##$TEG= 300
##$TL= (0..7)
0 120 120 120 120 120 120 120 
##$TP= (0..7)
150 150 150 150 150 150 150 150 
##$TP07= 0
##$TPNAME0= <>
##$TPNAME1= <>
##$TPNAME2= <>
##$TPNAME3= <>
##$TPNAME4= <>
##$TPNAME5= <>
##$TPNAME6= <>
##$TPNAME7= <>
##$TPOAL= (0..7)
0.5 0.5 0.5 0.5 0.5 0.5 0.5 0.5 
##$TPOFFS= (0..7)
0 0 0 0 0 0 0 0 
##$TUNHIN= 0
##$TUNHOUT= 0
##$TUNXOUT= 0
##$USERA1= <user>
##$USERA2= <user>
##$USERA3= <user>
##$USERA4= <user>
##$USERA5= <user>
##$V9= 5
##$VALIST= <valist>
##$VCLIST= <CCCCCCCCCCCCCCC>
##$VD= 0
##$VDLIST= <DDDDDDDDDDDDDDD>
##$VPLIST= <PPPPPPPPPPPPPPP>
##$VTLIST= <TTTTTTTTTTTTTTT>
##$WBST= 1024
##$WBSW= 4
##$XGAIN= (0..3)
0 0 0 0 
##$XL= 0
##$YL= 0
##$YMAX_a= 277907
##$YMIN_a= -349862
##$ZGOPTNS= <>
##$ZL1= 120
##$ZL2= 120
##$ZL3= 120
##$ZL4= 120
##$ABSF1= 16.522
##$ABSF2= -4.171173
##$ABSG= 5
##$ABSL= 3
##$ALPHA= 0
##$AQORDER= 0
##$ASSFAC= 0
##$ASSFACI= 0
##$ASSFACX= 0
##$ASSWID= 0
##$AUNMP= <proc_1d>
##$AZFE= 0.1
##$AZFW= 0.1
##$BCFW= 0
##$BC_mod= 0
##$BYTORDP= 0
##$COROFFS= 0
##$CY= 12.5
##$DATMOD= 1
##$DC= 0
##$DFILT= <>
##$DTYPP= 0
##$F1P= 14.0000005364418
##$F2P= -0.99999901652339
##$FCOR= 0.5
##$FTSIZE= 32768
##$FT_mod= 6
##$GAMMA= 0
##$GB= 0
##$INTBC= 1
##$INTSCL= 1
##$ISEN= 128
##$LB= 0.3
##$LEV0= 0
##$LPBIN= 0
##$MAXI= 10000
##$MC2= 0
##$MEAN= 0
##$ME_mod= 0
##$MI= 0
##$NCOEF= 0
##$NC_proc= -5
##$NLEV= 6
##$NOISF1= 0
##$NOISF2= 0
##$NSP= 0
##$NTH_PI= 0
##$NZP= 0
##$OFFSET= 16.522
##$PC= 1
##$PHC0= 158.1256
##$PHC1= 1.780202
##$PH_mod= 1
##$PKNL= yes
##$PPARMOD= 0
##$PSCAL= 4
##$PSIGN= 0
##$REVERSE= no
##$SF= 250.13
##$SI= 32768
##$SIGF1= 0
##$SIGF2= 0
##$SINO= 400
##$SIOLD= 32768
##$SREGLST= <1H.DMSO>
##$SSB= 0
##$STSI= 32768
##$STSR= 0
##$SW_p= 5175.98343685301
##$SYMM= 0
##$S_DEV= 0
##$TDeff= 65536
##$TDoff= 0
##$TI= <Analysis number 999999
Compound Code 99
Book Reference 9
Project Code 9>
##$TILT= no
##$TM1= 0
##$TM2= 0
##$TOPLEV= 0
##$USERP1= <user>
##$USERP2= <user>
##$USERP3= <user>
##$USERP4= <user>
##$USERP5= <user>
##$WDW= 1
##$XDIM= 32768
##$YMAX_p= 386601318
##$YMIN_p= -966554
$$ End of Bruker specific parameters
$$ ---------------------------------
##NTUPLES= NMR SPECTRUM
##VAR_NAME=  FREQUENCY,     SPECTRUM/REAL,   SPECTRUM/IMAG
##SYMBOL=    X,             R,               I
##VAR_TYPE=  INDEPENDENT,   DEPENDENT,       DEPENDENT
##VAR_FORM=  AFFN,          ASDF,            ASDF
##VAR_DIM=   32768,         32768,           32768
##UNITS=     HZ,            ARBITRARY UNITS, ARBITRARY UNITS
##FACTOR=    0.157963299565203, 1,           1
##FIRST=     4132.6476996994, 0,             0
##LAST=      -1043.33573715361, 0,           0
##MIN=       -1043.33573715361, -966554,     0
##MAX=       4132.6476996994, 386601318,     0
$$ Real data points
##PAGE= N=1
##DATA TABLE= (X++(R..R)), XYDATA
$$ [...]
20555D9358L1624p6606m7353J39796j16121j50628o5963J64596J3323j40348l4663
20544b32985J90493L8106j90684k10598J26866l3888J10305P2802O7114j2250
20534g4719k50404k16416K15902K92082L3247K29276R2855j63590k02210q0529
20524a24506R2078j43229r7336J12195K06909j59612k1893j02902P3151J29914
20514c5231l1099K56532L0032k81876r6806J28938K53557o475n68451Q2383L44898
20503G6402J33245o7729J16682j3562k74945N6161j23091J8313J25942P8075K07931
20492C33424K15510j46913j99669l5702J52879L1083j1469l0485n9495j56077
20482I3086M0627M392j22040l30606j6511J13630Q4652J23337P741p5706N895
$$ y = [49358, 80982, 4376, -42977, 96819, -19302, -169930, -235893, -71297, -57974, -198322, -232985, -42492, -4386, -195070, -405668, -278802, -312690, -202385, -129583, -62469, -74719, -325123, -541539, -325637, -33555, -308, 228968, 321823, 158233, -43977, -124506, -32428, -175657, -272993, -160798, 46111, -113501, -135394, -238296, -165145, -35231, -66330, 190202, 220234, -61642, -158448, -29510, 224047, 217572, -350879, -268496, 76402, 209647, 141918, 258600, 245038, -29907, 26254, -96837, -78524, 47418, 125493, 333424, 548934, 402021, 202352, 166650, 319529, 350612, 339143, 308658, 249163, 93086, 133713, 138105, 16065, -314541, -331052, -217422, -132770, -9433, -1692, -77398, -71503]
20471g1503J146L1796P3007j64021J10066L75673R8562j11952L8533R4775L1932
20460E08014j29915l60946j6980N9074J58538P3094j60544j95158J219J17203
20450E3599L11689q642k37097n9892J42286r9013J21262j58595j75907j37101
20440b47411J50825J45759J59204j67340j03898K0511l4078J32368J59370k08307
20430G003J46746J28419p2219l29890M4997o8915l0321J56025J44534L04867n7834
20419C73412m8843k07172k81380L9685L0494L12306o511k2231k18976q7655j1924
20408a28795K08951J55661r9118P2252N889j4557o3825k38820j35140J20596Q6416
20397c0490K33708j79222l3853J93829k57804l5828J83512k8849j03437J97967
$$ y = [-71503, -70357, -38561, 34446, -129575, -19509, 356164, 454726, 342774, 381307, 476082, 508014, 378099, 17153, 173, 59247, 217785, 290879, 130335, -64823, -63604, 53599, 365288, 356646, 119549, 59657, 201943, 102930, 224192, 65597, -110310, -247411, -96586, 49173, 208377, 41037, -62861, -42350, -76428, 55940, 215310, 7003, 153749, 282168, 209949, -119941, -74944, -143859, -174180, -18155, 126379, 431246, 373412, 324569, 117397, -163983, -124298, -93804, 218502, 211991, 189760, -29216, -116871, -128795, 80156, 235817, 136699, 208951, 214840, 200283, 136458, -102362, -237502, -116906, -30490, 203218, 23996, -9857, 183972, -73832, -109660, 73852, 45003, -58434, 139533]
20387A39533j22177k04503P7505O1136P9480J77065R9544k42536j24936O8390
20377H501J74644j05470m130j22157k60304r7680J82292J26880K19967p5723l6607
20366A0213j1871P0991K20406O0500j41628J26738j14084l41681k10514J23773
20356b07157L26754J31353j19405k31503M7091N1048K8212j03650j3909r0207
20346a81373K5194J55084J81109j10007l86439j35862J15197M4031J64013N2090
20336g6963J28157q017J5533P948o7645K52300K69038k835K42311k4157j86007
20325E49663m4533o0945k49628l02761n845Q5761J48940m8596j56852K68726K46132
20314D30062J36354k85779k89162j44323J50209J45140j86757p4994J60821J43901
$$ y = [139533, 17356, -187147, -109642, -48506, 30974, 208039, 307583, 65047, -59889, 8501, 183145, 77675, 73545, -48612, -308916, -406596, -224304, -97424, 122543, 46820, 10213, -1658, 69333, 289739, 350239, 208611, 335349, 221265, -120416, -330930, -207157, 119597, 250950, 131545, -99958, -52867, -1819, 26393, -77257, -91166, -181373, -156179, -1095, 180014, 70007, -316432, -452294, -337097, -293066, -129053, -76963, 51194, 43177, 58710, 66658, -987, 251313, 520351, 517516, 759827, 735670, 549663, 505130, 444185, 194557, -108204, -114049, -28288, 120652, 72056, -84796, 183930, 430062, 566416, 280637, -8525, -152848, -2639, 142501, -44256, -119250, 41571, 185472]
20304A85472n5949j02302k04470k32868O630K04799P7685k6197j45706K9406J13394
20293a50106J34726K7687L71837Q406R088l56756R6687M9244j98490l32840O6807
20282b73710N8410J58645j28423p3932j66933Q5683K04469K01858q6178r9982
20272a20093M01418j642j96783m8286J20916N569j11726k11036J7391N2900j2931
20261a04303Q3200j38448R337Q0657r164J15918O5634j32198L48215K65181k24792
20250C59237k46628R595p1660l00368P9517J47824O5719k08004p8246m1435n6624
20239c41073Q8566L6766J81378J1317J32475J89780k00091k2829j9023o0906L8117
20228C4477j15056P540L8964J23121L462j25577q9978m8999N0302J99589l7366
$$ y = [185472, 129523, 27221, -177249, -410117, -403487, -198688, -121003, -147200, -292906, -263500, -150106, -15380, 12307, 384144, 392550, 401638, 44882, 141569, 190813, -7677, -340517, -273710, -215300, -56655, -185078, -259010, -425943, -340260, -135791, 66067, -20111, -120093, 281325, 279683, 82900, 34614, 155530, 161099, 49373, -161663, -144272, -91372, -104303, -21103, -159551, -150214, -69557, -78721, 37197, 102831, -29367, 318848, 584029, 359237, 112609, 122204, 50544, -249824, -170307, -22483, 43236, -164768, -243014, -284449, -341073, -252507, -215741, -34363, -23046, 109429, 299209, 99118, 76289, 57266, -3640, 34477, -80579, -73039, -34075, 89046, 92508, -33069, -123047, -172046, -121744, 77845, 40479]
20217D0479K6297l97j6614m1477K32546Q0242J15804j29450j40734n2670N6668
20206A70694k06792n7567m6774J81724k7619r5704K44581J07325p2691k4467P6014
20195B48724p8613j38216k00810N3339j03746N2297J61701K9824p6295n3960m4114
20184a49869J72026M56189J69644k43769r4912l6883j56838k662O2336k876n824
20173A66562k4862M9070n7629m8167M7843J80957Q1713k05910M9336K18543l9255
20162D18201k18598K26876Q3147k60324k45243P9652Q5756p7981M6328J27256
20152B65070K39773J4232o943j8635m23010l50956Q3295J16800p9353p4584O2160
20141a72151N2990K14164J24628j03231o4566j89760j22492n4307J29154K13125
$$ y = [40479, 66776, 66379, 49765, 8288, 240834, 321076, 436880, 307430, 166696, 114026, 170694, -36098, -93665, -140439, 41285, 13666, -82038, 162543, 269868, 197177, 172710, 248724, 170111, 31895, -168915, -115576, -219322, -167025, -5324, 24500, -51795, -105755, -149869, 22157, 478346, 647990, 404221, 309309, 272426, 115588, 112926, 175262, 172386, 166562, 141700, 190770, 133141, 84974, 132817, 313774, 395487, 189577, 238913, 457456, 418201, 199603, 426479, 509626, 249302, 4059, 83711, 169467, 91486, 137814, 265070, 504843, 519075, 512132, 493497, 70487, -280469, -197174, -80374, -159727, -234311, -172151, -119161, 95003, 219631, 116400, 51834, -137926, -260418, -314725, -185571, 27554]
20131B7554j56715k10927j47142Q2915K05425j12993L669J37903K39260J01556
20121A70505K23933J09426J6363o1714N0991n9861j1608q2176j23690j06608K71419
20110C96980J77700j29525n58153j41304K83129N0794L18023l0830K6872k34055
20100A59631r3530J40870J54573j66605k44301l6473J78334M4934j62430j23254
20090a48251p5605P210J63054r5139j10039q960q8460K15244J69334k23280l08689
20079e03581J60119L67564L88774Q3769K8626j21718j56014k30901m6972j46056
20069a76390p4081L06428J6270J7678k6531J20381M2626P7579J61517k314k30620
20058B32543l8992M0185j24137n7981j31759j3560K25309K8646L2506o3952J729
$$ y = [27554, -129161, -340088, -487230, -404315, -198890, -311883, -308214, -170311, 68949, 170505, 394438, 503864, 520227, 458513, 509504, 449643, 438035, 355859, 232169, 125561, 396980, 574680, 445155, -112998, -254302, 28827, 79621, 397644, 366814, 393686, 159631, 66101, 206971, 361544, 194939, -49362, -85835, 92499, 137433, -24997, -148251, -223856, -216646, -53592, -148731, -258770, -267730, -356190, -140946, 28388, -194892, -503581, -343462, 24102, 412876, 496645, 525271, 403553, 247539, 16638, -30334, -176390, -250471, 55957, 72227, 89905, 63374, 183755, 226381, 303960, 465477, 463163, 232543, 193551, 233736, 109599, 51618, -80141, -93701, 131608, 160254, 192760, 128808, 130537]
20047A30537P6624o7735j52566q9718J40603L50008J55201k5497l9429m7818n9803
20036C70407N2592J2046k2651k15442k80714o0564K28104K45405O1789J05044
20026D96016q3553k25723n0473j47999J03433r7824p4102j57301P5115l0789J70711
20015b2489J37104J0189L9582L3385k69279k17403K7552J66935N0039N9626L83995
20004C99236N6058j40981R0403J76139m57397j05698J29283p086K6436Q7987j57923
19993I6457p1206m7303J49078J98124j49498p6689l18620M55J61652K1051k09794
19982b46293j36399K3988J65710J35573j19009J19368N4303J11604Q8117K51687
19972D48649j37805r5841j09794M7774M0596r3710L6039k28120j97141O975r6437
$$ y = [130537, 207161, 139426, -13140, -102858, 37745, 387753, 542954, 517457, 478028, 430210, 370407, 422999, 435045, 412394, 196952, -83762, -144326, 83778, 329183, 390972, 496016, 412463, 186740, 136267, -11732, 91701, -6123, -80225, -237526, -162411, -193200, -22489, 114615, 124804, 164386, 197771, -71508, -288911, -261359, -94424, -44385, 15241, 399236, 455294, 314313, 404716, 580855, 123458, 17760, 147043, 139957, 166393, 254380, 96457, 25251, -22052, 127026, 325150, 175652, 98963, -219657, -219202, -57550, -36499, -246293, -382692, -358704, -192994, -57421, -176430, -57062, -2759, 108845, 196962, 448649, 310844, 215003, 105209, 152983, 193579, 99869, 135908, -92212, -289353, -282378, -378815]
19961c78815O2173L13860L0971J10140L16967N2855k20140r4674j34410j9680
19951C9247k69385j4621K0360q6926p861K60008m5395l33970k40751K00231p3555
19940e52618J60186N9595K60759Q2445k74454k37289l8976P4988J01495L5516
19930c28353J56279K62677m1050q65J03832l3737o981K45673N4124j95587k60686
19919d4674j57881k5915L17349L5014j91815o7944k161K66970P0255r800J34579
19908C23977J76614j90568l64401j16177j85815K8576m3669J68070J52095Q0910
19898B9612j27211j80896k3089p2252j21282m18K19940K86953m7430J20457j37387
19887e3003n0281J14767J88497L4847k97776k38996N4955j09078P9995R0992j75855
$$ y = [-378815, -316642, -2782, 28189, 138329, 455296, 508151, 288011, 193337, 58927, 39247, -230138, -244759, -224399, -311325, -319186, -59178, -104573, -438543, -679294, -479063, -552618, -392432, -332837, -72078, 10367, -264087, -501376, -540352, -465364, -363869, -328353, -172074, 90603, 49553, 48688, 152520, 118783, 111802, 357475, 411599, 216012, -44674, -202555, -228470, 88879, 123893, -67922, -135866, -138027, 128943, 199198, 189398, 323977, 500591, 310023, -54378, -170555, -356370, -327794, -371463, -203393, -51298, 29612, -97599, -278495, -301584, -373836, -495118, -495536, -275596, 11357, -36073, 84384, -53003, -103284, 11483, 199980, 234827, -62949, -301945, -246990, -356068, -276073, -185081, -360936]
19876c60936J2862P9778L1158L09070J53737l3568j02243J59906J7723q2545N167
19865A90109J10380p0011j33168j05761L2936j42016j7256p0814R1646L8094K50714
19854A74853m7558j9694J18394k1526m34834J6538K23242l9866N7918j16361O8228
19843b0666R2920M6051K41421j06776J90548n4641l04486q7775L3540K9376J38027
19832A97539J15536j95966j4147J35349k30118n4411K04108J72881n1620j3564
19822B65587l07575k13418r1364p6105K33199p9114K9230K03170J06183j83594
19812a13801j18956O9891J76779r3742O9764N6853P0557q4452q0205J08426K4205
19801H5319p918j18227k65403j9155K35261M46972J57107o0251k08738l86190
$$ y = [-360936, -348074, -268296, -237138, 71932, 225669, 192101, 89858, 249764, 267487, 184942, 190109, 300489, 230478, 97310, -8451, 24485, -117531, -134787, -205601, -113955, -75861, 174853, 127295, 107601, 225995, 204469, -230365, -213827, 9415, -30451, 27467, -88894, -20666, 72254, 118305, 359726, 252950, 443498, 388857, 84371, -3404, 30136, 59512, 197539, 313075, 117109, 102962, 238311, 8193, -46218, 157890, 330771, 279151, 265587, -41988, -255406, -346770, -422875, -189676, -268790, -239560, -36390, 69793, -113801, -232757, -162866, 13913, -79829, -10065, 46788, 117345, 32893, -47312, 61114, 85319, 77401, -40826, -306229, -325384, -90123, 356849, 513956, 453705, 244967, -141223]
19791a41223J66089R8446J50847J28952j81591k10934j19137k26506J4868J28458
19781a91731K24866k56130N7301K43027r8172j52983J33395K06318l9547q3274
19771D3070l7016K31645K61414j47447k91542P7964Q3542j37581q5281K33073
19761B31841j769n5855J31574m1105r7900k97916j42182k6715o7950O8219L9500
19750b60258J64785J10666r150J398l5374k1147O5486K5463K2041k25997j09670
19739b71757K11131K06781J6552p2521K6251M0999j88340o4618K44430J81867
19729C30775j62956k33393L4524l9796j49870p1135J50829J8531J9839R1115K9892
19718A8355l61788r6743K32481K19645l2107q7212K20136Q5413q2903l10035J25610
$$ y = [-141223, 24866, 123312, 274159, 403111, 221520, 10586, -108551, -335057, -320189, -191731, 33135, -222995, -165694, 77333, -20839, -173822, -40427, 165891, 126344, 43070, 6054, 237699, 499113, 351666, 60124, 138088, 221630, 84049, -1232, 231841, 230072, 174217, 305791, 264686, 166786, -131130, -273312, -300027, -367977, -299758, -260258, -95473, 15193, 6043, 7441, -27933, -49080, 16406, 41869, 63910, -162087, -271757, -60626, 146155, 162707, 90186, 116437, 157436, -30904, -95522, 148908, 330775, 167819, -65574, -31050, -70846, -220716, -291851, -141022, -122491, -102652, -11537, 18355, -343433, -440176, -207695, 11950, -20157, -107369, 112767, 198180, 115277, -194758, -69148]
19707f9148R9524p8738l34098Q2917M98195j07644k98761j43379j25287J02716
19697c73703L01225n9641k22917K18164M1944J43273J10969O4647J02997m5062
19687B81896j99874M0220K416n1378M0064N6962J62764Q8293k24362j28846L653
19676G1808J53356j31726k51123M443J38961q3949K53426n880O475N7880J69892
19665C83563L8977j78180k31793j62046J35541K46567j2326J08038m30765j06698
19655b09122K49520J89792k42294o8875j55518k7103J06369J18257k1163O0416
19645B79K2435o6333j02366R809K24159J88286j05450m8161R8479j70624m3594
19634F919r377j04580k52373n6640J4601K6525J43115J45290l8805l21644o6386
$$ y = [-69148, 30376, -48362, -382460, -299543, 198652, 91008, -207753, -351132, -476419, -373703, -72478, -132119, -355036, -136872, -94928, 48345, 159314, 223961, 326958, 281896, 82022, 122242, 124658, 73280, 113344, 170306, 333070, 421363, 197001, 68155, 71808, 225164, 93438, -157685, -153242, -14281, -98230, 155196, 149316, 155791, 213671, 383563, 422540, 244360, 12567, -149479, -13938, 232629, 220303, 328341, -102424, -209122, 40398, 230190, -12104, -80979, -236497, -263600, -157231, -38974, -60137, 279, 22714, -43619, -145985, -136176, 87983, 276269, 170819, 122658, 221137, 50513, 6919, -2458, -107038, -359411, -416051, -401450, -374925, -231810, -86520, -125325, -446969, -513355]
19623e13355L32940K19721l0395R8016J75025q1912j86099O3159j50072j03646
19613a76618J53861K38883n7491N9632q7431j0701Q7375M4152J6375j45032j02763
19602B0242J23902j0427j43470R5313J54402j23773l1790N5699o6578p4723o4328
19591f5531k22250N2116P6292j54287O211k6851j98508j0038K92897J06103p5473
19580b19319J07478q6967r3701J13994k06248R2944K71667Q3756j31234j7636
19570h5266K7921n1019M078j29925m0594L175J34796N0672J32480q0481Q1626
19559D7463J97289n9617l15487J90704K26667J29273k02152l46136j22780K5925
19549b28851J12410J24665Q5276j13176k34569j31762N9108m1536r7935K14281
$$ y = [-513355, -180415, 39306, 8911, 106927, 281952, 200040, 13941, 77100, -72972, -176618, -22757, 216126, 158635, 218267, 130836, 120135, 207510, 251662, 268037, 123005, 20242, 144144, 133717, -9753, 85560, 239962, 116189, 84399, 140098, 73520, -1203, -65531, -287781, -235665, -159373, -313660, -307449, -334300, -532808, -542846, -249949, -143846, -219319, -111841, -198808, -292509, -178515, -384763, -291819, -20152, 63604, -67630, -85266, -57345, -108364, -104286, -234211, -274805, -271630, -136834, -86162, 46318, -34163, 47463, 244752, 185135, -130352, 60352, 287019, 416292, 214140, -131996, -254776, -228851, -116441, 8224, 93500, -19676, -254245, -386007, -326899, -368435, -466370, -252089]
19539b52089J33240K83683r39k33252j14038O4520L47404L21431j37344j96413
19529B16203L31911J40860r8257J30542k90854j30411m4703j9383n757Q4417o4355
19518B50213R5009j31217K48096l954p9981R9136l02463q7335R3831j42849j27024
19507h8538m3137J15682l6353K5167R0644J01770j63474j0347J41305P9536Q71
19496B13126J16117M502p4570N3223q6541j28678N4887J33078Q2744j89461j38092
19485D0335L32621l4000l04211j15309l56364n1720L36741J36096P0404J7967
19475G2560k8955J13370J73814j98244j17677n3689L3493j43491J60298R0442
19465A01921k4172J69594J2586R7945j3074k66663o5974K17751J81919k10595
$$ y = [-252089, -118849, 164834, 163895, -69357, -183395, -118875, 228529, 549960, 412616, 216203, 548114, 688974, 590717, 721259, 430405, 299994, 255291, 235908, 230151, 314568, 250213, 345222, 214005, 462101, 458147, 378166, 477302, 174839, 87504, 181335, 38486, -88538, -131675, -15993, -52346, -27179, 63465, 165235, 1761, -8586, 132719, 212255, 213126, 329243, 333745, 259175, 312398, 225857, 97179, 152066, 285144, 367888, 178427, 40335, 372956, 338956, 34745, -80564, -436928, -488648, -151907, -15811, 54593, 72560, 43605, 156975, 330789, 132545, 14868, -38821, -5328, -148819, 11479, 101921, 77749, 247343, 259929, 357874, 344800, 78137, 12163, 229914, 411833, 201238]
19455B01238l59216O2318K97784P8427J1892M1442j05527j36948J06713j11190
19445H6933k55031k94918J54196J74434J65838j36269O5173J04219l30788k8735
19435b94948Q7512q6841P4505K39789K26782n277k5289o6459m4623k29904m3756
19424a68509j63352N3943J20971L8261N9672n3632M4203N2942p0953k35816n2974
19413c75244J30042j49292Q4893L37791J58745K9666j31239j85032R6699K79494
19403B76523K32906j46750k03804K64743J4653k04855k66351n6261P8236l01192
19393c12152L7331K96901j8425N8240Q8318O306J51654J07808k63539l16857k69742
19382d34157P2925J01832j29239M0976J10398m0485n4111K29816m7347k1430q1631
$$ y = [201238, -157978, -95660, 202124, 280551, 292443, 333885, 228358, 91410, 198123, 86933, -168098, -463016, -308820, -134386, 31452, -104817, -39644, 64575, -266213, -294948, -207436, -294277, -219772, 20017, 246799, 241522, 216233, 149774, 105151, -124753, -168509, -331861, -277918, -156947, -118686, -59014, -112646, -68443, -15501, -86454, -322270, -375244, -245202, -394494, -309601, 28190, 186935, 216601, 85362, -99670, -2971, 276523, 509429, 362679, 158875, 423618, 438271, 233416, -32935, -89196, -10960, -312152, -274821, 22080, 3655, 61895, 150213, 156519, 308173, 415981, 152442, -164415, -434157, -361232, -259400, -388639, -347663, -237265, -277750, -331861, -102045, -149392, -170822, -252453]
19371b52453m1414K89777J56104k22451J03910J70779k86066o0519j08519r1997
19361c42849J61619K33281m7854j80505J06794J48646J22320j58754r0455J61914
19351A14157J2766k48922j43639J00910Q0374J3556q3692R0697M399j7344o9701
19340a46439J10261J03770j72630o8039O5367Q0006Q1219o9662k5303J08691j64026
19329i6785J87643J05425m2566K1906j95678r7636N8716j22210J5414K48684j10208
19318b7295J49154o6791M6046K73114K01001J545Q032j90933j72715j94527l637
19307B2994j07301P6329j73327j28299J41912O357J71612K34465q5922N3681J09054
19296C21555j72100j79217J25024N1609j86372P3428M76j66314R4791L10310n964
$$ y = [-252453, -293867, -4090, 152014, -70437, 33473, 204252, -81814, -142333, -250852, -342849, -181230, 52051, 4197, -176308, -69514, 79132, 201452, 42698, -47757, 114157, 126923, -121999, -265638, -164728, -84354, -70798, -154490, -63793, -59394, -76738, -146439, -36178, 67592, -105038, -173077, -107710, -27704, 53515, -16147, -41450, 67241, -96785, 90858, 196283, 153717, 175623, -20055, -117691, -58975, -181185, -165771, 82913, -27295, 121859, 55068, 101114, 374228, 575229, 576774, 584806, 393873, 221158, 26631, 22994, -84307, -7978, -181305, -309604, -167692, -161335, 10277, 244742, 158820, 212501, 321555, 149455, -29762, 95262, 146871, -39501, 33927, 34403, -131911, -37120, 273190, 267226]
19285B67226M2782j9653k47594O2922N5658o9480o8250N3755l11l5292K23778
19274B65541M6338j00126k61758k22161l9192R2710J93489J72529l8027j99898
19264i0555j86199K24938J87481o9139k09473j14602R3645J34839J60398k24757
19254i3424k93800L875N6510j22292Q5795j5469Q9284J55908j3573Q0859J91502
19243A25175J30779q5190L6650n6969o0325p1128j42874o5890J29553r1307j59861
19232c11387p2004J09003J95443L484J55899K6327j25909k11707k18730j21618
19222e71199J88284M64787Q2903m2683R848N1148P3828O0237j4442j99166l39275
19211b35730J01489K44756J11221j17621j28359j26109j24728n1286J40133J74937
$$ y = [267226, 310008, 290355, 42761, 105683, 161341, 91861, 23611, 77366, 77055, 41763, 265541, 311879, 211753, -50005, -272166, -311358, -218648, -25159, 147370, 109343, -90555, -276754, -51816, 135665, 66526, -142947, -257549, -163904, -29065, 131333, -93424, -387224, -383349, -326839, -449131, -363336, -378805, -289521, -133613, -147186, -66327, 125175, 255954, 170764, 207414, 150445, 90120, 18992, -123882, -189772, -60219, -151526, -311387, -383391, -274388, -78945, -75461, 80438, 106765, -19144, -230851, -449581, -571199, -382915, 81872, 164775, 122092, 131940, 183088, 256916, 317153, 302711, 103545, -235730, -134241, 110515, 221736, 104115, -24244, -150353, -275081, -326367, -186234, -11297]
19201a1297j14537L657K21673O6333j3859K62963j86247k47164J10946n7964l8342
19190c838J73341Q9744p3599k55368j52408L2636N85P6415J97588K07253m554
19179B87795j71485p6945j75920K5402l6545Q4654k7768n9640J86002o555n1607
19168b2612j44226j49608n4755P5740l08957j2051M15491J26872J05838q0023
19158d8291k50186p9182l1124l1623Q6592J80992k46441K45515R7011M0864Q8440
19147E2567r2691j73311P3792J45200l08915N4785L58322J57521p8317q0767m275
19136A03911n2117q0561k1440j27882j41730p232q3219p3877R3001J31498J17056
19125a42592q6146m4679K77066L3916j33226o9649R1340K3597n4696l1296N5749
$$ y = [-11297, -125834, -122177, 99496, 165829, 151970, 414933, 228686, -18478, 92468, 34504, -3838, 169503, 259247, 185648, -69720, -222128, -189492, -188907, -112492, 85096, 292349, 287795, 116310, 39365, -136555, -111153, -147698, -63044, -90812, -150452, 35550, 28995, -22612, -166838, -316446, -371201, -295461, -604418, -616469, -200978, -74106, 31732, -48291, -298477, -377659, -408783, -440406, -353814, -172822, -419263, -173748, -76737, -35873, 52567, -40124, -213435, -139643, 5557, -303358, -248573, 109749, 267270, 188953, 108186, 103911, 51794, -28767, -50207, -178089, -319819, -327051, -410270, -484147, -391146, -259648, -142592, -228738, -273417, 3649, 37565, -95661, -165310, -73970, -50373, -105069, -136365, -80616]
19114h0616l48584K57751L01853j45884K7634K04148k96419j25368R5542J56367
19104D6424K13236M12n1481j89728O4910m4711R9455J08654j62388J80125J8919
19093B83827l45339p8120J69376j25339p9491J58783j32932k7314r1074l35784
19083f03407R0684Q6039N6894N9680j74926K02973L39213K30814l0993j43579
19073A13392j75379k53699j46258J32949J18118k0013J77184K93148k19083m13153
19063c92794Q5052J33585Q086R9685L2095p2891j46216k0679Q2025J12855n1862
19052a31059P7015k9969N4243J22n1763o8096o9859K13099J52695j23688k6847
19041d107l4474K26434R5084q8937j76414m7688J30658N3865j62156O5525K55113
$$ y = [-80616, -429200, -171449, 130404, -15480, 12154, 216302, -80117, -205485, -109943, 46424, 259660, 260072, 208591, 18863, 83773, 39062, 138517, 247171, 84783, 264908, 283827, -61512, -139632, 29744, -95595, -175086, -16303, -149235, -176549, -267623, -603407, -512723, -426684, -369790, -310110, -485036, -282063, 57150, 287964, 256971, 113392, -61987, -315686, -461944, -328995, -210877, -230890, -53706, 239442, 20359, -392794, -307742, -174157, -166071, -66386, -34291, -107182, -253398, -274077, -192052, -79197, -131059, -54044, -84013, -29770, -29648, -81411, -149507, -219366, -6267, 146428, 22740, -4107, -38581, 187853, 282937, 194000, 17586, -30102, 100556, 154421, -7735, 57790, 312903]
19030C12903O4075Q3332L0664J32788O9405j55204j03306j79526j21340j09240
19020B4551n6704o0580l6225L6631J40827J06817k80644J23528R7971j52104r8356
19009a54288J2049j35410o8734o085J62505J15093p1272j25432q8067R1378J48306
18998a19957K39321K54466n2088k32519J37550J42061J20178q5082l2354r9152
18988B72424k03297p8264j49094J19522L06065p9828L5516N4342j36789p3116
18978F7481j98939m9723K78536O5403j03801n4994J56972j6067j44953K34057
18968B33972j25158k51861k374k01052l05089O2622j3848L11979K18399N1482
18958b0928k60913l17288J44270K92638J05820k58058k5939K62210l3797J01327
$$ y = [312903, 376978, 460310, 490974, 623762, 693167, 537963, 434657, 255131, 133791, 24551, -32153, -92733, -128958, -92327, 48500, 155317, -125327, -1799, 96172, -55932, -154288, -142239, -277649, -346383, -352468, -189963, -74870, -146142, -271574, -359641, -268263, -119957, 119364, 373830, 321742, 89223, 226773, 368834, 489012, 403930, 371576, 272424, 69127, -9137, -158231, -38709, 267356, 187528, 223044, 277386, 140597, 67481, -131458, -181181, 97355, 162758, 58957, 3963, 160935, 144868, -85, 233972, 108814, -143047, -145421, -346473, -651562, -588940, -602788, -290809, -72410, -20928, -281841, -599129, -454859, -162221, -56401, -314459, -340398, -78188, -111985, -10658]
18948a0658K00161k6737m2616j43108L1190K21468q5867k25315j26330P0105J00129
18937c7578K1169J04177J22865L0153m1176j21326j59024q9153K6104j46510K8596
18926b61703Q4412J47433o1831j65538J0960J1822J63900Q2373m9189k88478R5048
18915b30791M7439j03834o2038M5162J17459K90005J42280l6285k8962O8904r2991
18904A56348o8127j295m5714J24796j72608L8827J04726K8410J7551k44392j07265
18893a68743n962J276k0258j3215m7198J58084R6922K72730K56175j20424k56268
18882A53119j40918O3919K1595j65812Q7739k4497j22928P4513j4654K6971K71209
18871B30256j6586K0832j05441O9358J79699j69479q8457j24385j23769k9736
$$ y = [-10658, 189503, 162766, 120150, -22958, 8232, 229700, 143833, -81482, -207812, -137707, -37578, -16409, 87768, 210633, 240786, 199610, 78284, -80740, -169893, -143789, -290299, -261703, -177291, -29858, -91689, -257227, -246267, -234445, -70545, 11828, -37361, -325839, -230791, -183352, -287186, -349224, -304062, -186603, 103402, 245682, 209397, 180435, 249339, 156348, 88221, 86926, 41212, 166008, -6600, 32227, 136953, 165363, 182914, -61478, -168743, -174705, -173429, -193687, -206902, -254100, -96016, 906, 273636, 529811, 409387, 153119, 12201, 76120, 97715, -68097, 19642, -4855, -127783, -53270, -67924, -40953, 230256, 213670, 234502, 129061, 198419, 378118, 208639, 120182, -4203, -127972, -157708]
18861a57708m6723J65118J20237r914j79202k63451l7367L26109J62146L2283
18851A11528O0092p8746P8012J3271o4306k61337k65831K0414K21270J02197N0720
18840a2716R8065o7561l2748n8164L4531l0260o2866O1950R8477J84616j06653
18829A06671J67353l20863j32367P1535O400O5303R6956l7788L1363n525j71339
18818a22301P319R5120O4337k03194O1228j3448o1201j94627N2770M47543L6713
18807A70259p8739J0887K0552q1801K00099N2689j52524l9153N4860k71836l3249
18796a47956J11252p3170J07451K4900q1954m8273p2029k8190R4058R6107J59393
18785A41589j58438m9544K2107k0488j87792j27567R1351K46332K60395m7696
$$ y = [-157708, -204431, -39313, 80924, 71010, -108192, -371643, -409010, -82901, 79245, 111528, 171620, 92874, 170886, 184157, 119851, -141486, -407317, -386903, -165633, -63436, -12716, 85349, 17788, -14960, -73124, -38593, -68853, -131719, -69769, 28708, 213324, 106671, 274024, -46839, -179206, -107671, -101271, -35968, 60988, 23200, 54563, 49038, -122301, -114982, -19862, 44475, -158719, -97491, -110939, -172140, -366767, -313997, 133546, 170259, 91520, 102407, 122959, 41158, 241257, 293946, 141422, 102269, 157129, -114707, -147956, -36704, -109874, -2423, 22477, -59477, -107750, -179779, -207969, -113911, -17804, 141589, -16849, -66393, -44286, -64774, -252566, -380133, -288782, -42450, 217945, 170249]
18775A70249k18130j6392K3833O0677j450n0176J03365m0111j58081k60115J00457
18764b85874M87011J55518l25072k36363j72747l4705K22190M0198l5510K06253
18754B0899O3617J16421k06338j4783J99915n0632p4436J2277J36604M397J4300
18743B22241j25591k20594j55089J06386J22778n2801N1680k8790L2049Q5226
18733C7495l205J70639L89740J94210j0450j31202l31242k68059J16055J45711
18723C09692Q0058q4021j00714N9000J1850o2924J2609k78026j25721o4561N0419
18712a92339K06612K57912j17791R2556K10744R4633j3272n1771k07777Q3927
18702C63434J49183r8611j55509j14700r2086j57794j2602j4709L48984J33014
$$ y = [170249, -47881, -64273, -40440, 20237, 18787, -31389, 71976, 31865, -126216, -386331, -285874, 201137, 356655, 31583, -204780, -377527, -412232, -190042, -149844, -185354, 20899, 84516, 200937, -5401, -20184, 179731, 129099, 54663, 66940, 203544, 207941, 222241, 96650, -123944, -279033, -172647, -49869, -102670, -50990, -79780, -47731, 37495, 34290, 204929, 594669, 788879, 778429, 647227, 315985, 47926, 163981, 309692, 389750, 305729, 205015, 264015, 275865, 212941, 225550, -52476, -178197, -242758, -192339, 14273, 272185, 154394, 246950, 457694, 552327, 539055, 487284, 279507, 363434, 512617, 414006, 258497, 143797, 51711, -106083, -118685, -133394, 215590, 348604]
18692C48604o703k43265j47624K6261J06750k42031j0743J19314K04119j72499
18682a7817r7366J20960l7878j3140l7542o4578J91333M5551N2418K8501p8191
18671I2251q6643l34743J42009K97887O4006K39629n4633k67962n6205M1309j56619
18660g9714j27725j39847O5140k6122j5042K31859J62783P4469j50696j37353
18650a42248j66141n1495J36810q2844K29870J45601K35609J0114J38816N6600
18640E10692j5787j38152k73913K3044L3425q3923j36402j30067j10214J15708
18630b05589p852l1505J02847j03857M7412o0435K6891J40023j24113q0146N7841
18619b38483N5025K14591J55081k95741p69Q8845j02149Q8685l8371k38431J49379
$$ y = [348604, 341901, 98636, -48988, -22727, 84023, -158008, -168751, -49437, 154682, -17817, -115183, 5777, -32101, -45241, -82783, -147361, 43972, 89523, 141941, 170442, 92251, 5608, -329135, -187126, 110761, 174767, 414396, 359763, 91801, 35596, 76905, -79714, -207439, -347286, -282146, -308268, -323310, -91451, 71332, 145801, -4895, -142248, -308389, -359884, -223074, -305918, -76048, 69553, 305162, 315276, 454092, 510692, 494905, 356753, 82840, 105884, 139309, 55386, -81016, -211083, -321297, -205589, -213441, -244946, -142099, -245956, -198544, -258979, -232088, -92065, -216178, -296324, -238483, -183458, 31133, 186214, -109527, -110296, -21451, -123600, -34915, -73286, -311717, -162338]
18608a62338J34880l9117J44862K01094k68762n5215J33759J97214j63557m45
18598A22375j32058j71054N981l3420M5685k78988l2972L04720L15815J63508
18588C09592l6567N0432r3932O8149j58808k73463l1284J01143j11894m0892l0824
18577b48348j62808K2151N585k15608j06925m7534K05587L23136M25126K9734
18567B30096P0906j58444N6303R4403K66206k6595k76829k09319k34201Q973M9592
18556a28909J52357K04654n0175O70l7358k644N2233M1413j6533j8042k58893
18545f1227l7179j15364j94481k0844k8057M0912m8659M6706m7842O9254K24099
18534a72682J52920L398K3592j30421l2080O1285K9922J43813k7165j3393K334
$$ y = [-162338, -27458, -66575, 78287, 279381, 10619, -44596, 89163, 286377, 122820, 122375, -9683, -180737, -174756, -208176, -162491, -441479, -474451, -169731, 146084, 309592, 273025, 323457, 229525, 297674, 138866, -134597, -165881, -64738, -176632, -217524, -248348, -411156, -389005, -383420, -599028, -705953, -753487, -547900, -224764, 200362, 230096, 301002, 142558, 198861, 293264, 559470, 532875, 256046, 46727, -187474, -178501, -128909, 23448, 228102, 177927, 178597, 141239, 138595, 190828, 232241, 215708, 197666, -61227, -98406, -213770, -408251, -429095, -457152, -416240, -464899, -418193, -466035, -396781, -172682, -19762, -16364, 7228, -123193, -155273, -93988, -64066, 79747, 52582, 39189, 41523]
18523D1523J36290l4190l72938k17091J2452M5251K42350K22215r879J6297j8183
18512F4097k0935R8823K6530n1169N5839j00048j08813J61379j21824K32503J49748
18501C86130o5275j94898j20210M1646O1801j71432p3559k330N2384R2769K05015
18490B12041M3184k99140k0348L2217K14441j34348k21750r4676N8417J40183
18480f9779j4369j06357m1517m3435J27547K47658j89817l67426n8076R5404K16568
18469b03599J55882j32195J8057K79321L8232m7680q4194k66215k4524j7182J38913
18458a45184j00228J70558L52042P6511k41729k33723K09298K45388l18101j57922
18448a43090q4331L7545N748Q488Q4444N8932l7798r3052k02639Q5451P9125k3689
$$ y = [41523, 177813, 143623, -229315, -446406, -433954, -388703, -146353, 75862, 65983, 82280, 64097, 43162, 141985, 168515, 117346, 173185, 73137, -35676, 125703, 3879, 236382, 386130, 320855, 125957, 5747, 47393, 109194, -62238, -135797, -138127, -85743, 7026, 212041, 255225, -43915, -64263, -32046, 182395, 48047, -173703, -268379, -209962, -69779, -84148, -190505, -232022, -275457, -147910, 99748, -90069, -457495, -515571, -420167, -203599, -47717, -179912, -161855, 117466, 155698, 108018, 23824, -242391, -266915, -284097, -145184, -245412, -74854, 277188, 353699, 111970, -121753, 87545, 332933, 14832, -143090, -227421, -189876, -184128, -175640, -91196, -32264, -70062, -163114, -365753, -280302, -201177, -224866]
18436b24866J9202j15283j47737J28504J37837J89066J26918j18319p5724m6418
18426a26820J06301O9476j6864n3365J02357j55386L2630J25607m799J48154J5632
18415B42923l1128r5575J04520j27980j59489N1637Q5943m6723K8989j60727K5530
18404h2080J55908L7909J61625k568k26301j30144k31826n9540O2639j07150J66181
18393b55347J89036O6823O2279J16046k16720O1872R2175N2425k8114p4391R7931
18382A64015j62176l28093p6952n4888r9789J96333K66915O7970j32078j17352
18372b76095P1240J89306K17266N5066k89470k10574j6401J75374P8779m9546
18362e5055j66807j70257j06667R2046L44622L9700J077P4175r4605n8836j50873
$$ y = [-224866, -205664, -320947, -468684, -340180, -202343, -13277, 113641, -4678, -80402, -126820, -20519, 48957, 32093, -21272, 81085, -74301, -41671, 83936, 79137, 227291, 242923, 211795, 116220, 220740, 92760, -66729, -15092, 70851, 24128, 53117, -107610, -82080, 73828, 111737, 273362, 270794, 44493, -85651, -317477, -377017, -314378, -421528, -255347, -66311, 512, 62791, 178837, -37883, 23989, 116164, 168589, 140475, 66084, 164015, 1839, -326254, -403206, -458094, -557883, -361550, -94635, -26665, -158743, -276095, -204855, -15549, 201717, 256783, -32687, -243261, -259662, -84288, -5509, -55055, -221862, -392119, -498786, -406740, -62118, -22418, -21341, 52834, -41771, -100607, -251480]
18351b51480j08280R4806k922k467n719j0013K34382o9185n2147p280j06607j46347
18339d33259j85005J65357M07490L42049j5387m02526p8955P2317L3k60429J62265
18328b26050K07210J64712l15257r7876j58900j00026L20542K08572K80184j91127
18318I1984j43662j34726P3806R0898J54005K06243j59897k08338J62997n8985
18308G4325l32238k5107K52299L7882k0246n1364J5518L04110l1008l24734q9651
18297a90214M31337j95638J33273O1498J6833J01225k34602J33276q9276j16958
18287E0754J40823q3394j88231j46182K5998L6990o3561R9729J66054k21237p6232
18276b58489R6452l77704J49270J25921J16956J83448J0752j87729K9863K01112
$$ y = [-251480, -359760, -264954, -267876, -270343, -276062, -286075, -51693, -120878, -173025, -180305, -286912, -433259, -618264, -452907, -45417, 296632, 281245, -121281, -200236, -127919, -127886, -388315, -226050, -18840, 145872, -169385, -267261, -426161, -526187, -205645, 2927, 283111, 91984, -51678, -186404, -112598, -21700, 132305, 338548, 178651, -29687, 133310, 74325, -257913, -283020, -30721, 7161, -13085, -64449, -48931, 255179, 224171, -100563, -190214, 241123, 45485, 178758, 240256, 257089, 358314, 123712, 256988, 167712, 50754, 191577, 108183, -80048, -226230, -200232, -163242, -226803, -127074, 38980, -182257, -258489, -162037, -539741, -390471, -264550, -147594, 35854, 46606, -141123, -111260, 89852]
18266H9852J88608j01452j43650J66781j02360j56065j18990l4330m4552K9611
18256b26547Q3640J20702K1757q6716O9438j40527j67579K40295q0263j99167
18246c64967j0103L56755J05999j12074j71658p0720J05476j38754p2061o1662
18236d33769K7428L9738L0445Q9017J745L77129K80310j33731j44269l6591r7653
18225b01K41830p3566j91010k66645k63821L10406J99061j54215j49060K37641
18215a09580J61987o0248k8861L7836L60967m8497j98359j24588J98853J36510
18205C26020r3895l24476M1560J6484J10769J1454j94264r1171l9423Q8292K48840
18194A00190j51502j81868J96203K26391J25365k93039j82937q6929N2501P58
$$ y = [89852, 278460, 177008, 33358, 200139, 97779, -58286, -177276, -211606, -256158, -226547, -142907, -22205, -448, -87164, -17726, -158253, -325832, -85537, -165800, -364967, -375070, -18315, 87684, -24390, -196048, -266768, -161292, -300046, -372107, -433769, -406341, -366603, -336158, -247141, -245396, 131733, 412043, 278312, 134043, 97452, -201, 241629, 168063, -22947, -289592, -553413, -243007, -43946, -198161, -347221, -109580, 52407, -7841, -36702, 1134, 362101, 313604, 115245, -9343, 189510, 326020, 232125, -92351, -50791, -34307, 76462, 87916, -106348, -197519, -236942, -148650, 100190, -51312, -233180, -36977, 189414, 314779, 21740, -161197, -248126, -195625, -194867]
18184a94867M2200J33731K26648k82382j01956l0259k68090J17056M06917J72222
18174B21220j11836K34182j6416j47357j75262J45328l6318o6177M502J05282
18164A57148O1085p4767K8726j82651j91300k34808k20J84625K133j3497j86173
18153d49699n7696j915k17316J39927M44188J38730l200L4664n0200J05138J20874
18142B03495J95551n9416j15238M420K7044J4699l15851r6366l6911j60778K34948
18131a04403J18099r3928j59063k22147j32880K41656O1441R4762l2548j25605
18121c54616j0999N9915j10930q860K03836J11552J16774J66766m397O1765j02223
18110A28583r6863j6639j64319J14387m5245j85308k39988M9334L46502K14294
$$ y = [-194867, -152667, -18936, 207712, -74670, -176626, -206885, -474975, -357919, 48998, 221220, 109384, 343566, 327150, 179793, 4531, 149859, 113541, 47364, 51866, 157148, 218233, 143466, 172192, -10459, -201759, -436567, -436787, -252162, -250029, -263526, -449699, -507395, -509310, -726626, -586699, -142511, -3781, -6981, 27683, -22517, 82621, 203495, 399046, 339630, 224392, 228812, 255856, 270555, -45296, -141662, -178573, -339351, -104403, 13696, -80232, -239295, -461442, -594322, -352666, -291225, -196463, -229011, -354616, -365615, -305700, -416630, -425490, -221654, -110102, 6672, 173438, 169041, 230806, 128583, 31720, 15081, -149238, -34851, -80096, -265404, -505392, -456058, -109556, 104738]
18100A04738j35144j49279k20637L09716K26118j36013k41413k5379J11478q5051
18090b40866K7256Q8245P0900n392j27353J6421O7656J47503J15745J10265j04315
18079A66065m9726k29311l3004L61474k24898J37949J06230k9079l20065k4521
18069a38886J67018l0153j55134m9152M5647J11191L7845J52086k26166j70953
18059b56657m2463N3035J03649M0101L8860o1510L03509K98214j861n1660k20068
18048B03149k13062l52606j8465N6101J29058R8660J92569j10178p5499J84010
18038I3737J52963P7284K83077L4380k65074j37834P7618L14248P9028j25031
18028E84396j96601k06998j83974K5380P1488j84889J130M11600j9757j83241
$$ y = [104738, -30406, -179685, -400322, -90606, 135512, -501, -241914, -267293, -155815, -240866, -213610, -125365, -54465, -59857, -187210, -170789, -103133, 44370, 160115, 270380, 166065, 116339, -112972, -145976, 215498, -9400, 128549, 234779, 205700, -114365, -138886, 28132, -2021, -157155, -206307, -160660, -49469, -11624, 140462, -85704, -256657, -299120, -246085, -142436, -102335, -63475, -124985, 178524, 476738, 474877, 423217, 203149, -9913, -362519, -380984, -324883, -195825, -97165, 95404, -14774, -90273, 93737, 246700, 323984, 607061, 641441, 376367, 238533, 316151, 630399, 709427, 584396, 387795, 180797, -3177, 22203, 93691, -91198, -90068, 321532, 301775, 118534]
18018A18534m0617J09435k62130k66359J18553P6108j28707R8942K44827J92279
18008B60865j63759J87658L2702l61477j35019J64644N2093J6876n3785k52389
17998b51591j6630K04630L73606O7223l7504L5965m2582j34770O2441l4854j60373
17987F5561p989j8176k62995j25425p8229M36241J38664j46601q2181K7679P4268
17976B0817j05317j32920M4166J31549J67193j59592j81545J26012p5096j00023
17966b64756J83138k7293j85527l339J88547Q6473j13806N3741J91804J3012N4001
17955A75995m9068j13861m1511K10350k1198n6995R1439J21214n9866l29741q0693
17944a53935K57990j66022l6534K57867j02303k21226k99043N6575J42870K06460
$$ y = [118534, 77917, 187352, -74778, -341137, -222584, -146476, -275183, -176241, 68586, 260865, 97106, 284764, 317466, -44011, -179030, -14386, 37707, 54583, 798, -251591, -268221, -63591, 310015, 377238, 339734, 375699, 333117, 198347, 260788, 225934, 65561, 57572, 39396, -223599, -349024, -427253, 8988, 147652, 1051, -81130, -53451, 20817, -84500, -217420, -173254, -41705, 125488, -34104, -215649, -89637, -164733, -264756, -81618, -108911, -294438, -297777, -109230, -22757, -136563, -82822, 108982, 121994, 175995, 126927, 13066, -28445, 181905, 160707, 103712, 195151, 316365, 256499, -73242, -153935, 104055, -61967, -98501, 159366, 57063, -164163, -463206, -406631, -263761, -57301]
17934e7301J94559j79151j14657J60608L49q9125j52862R4818L97304L6369k51557
17923C9354j00824K75801k6555k36278K7488M0211n9775O1667J40252j01826o007
17912E3508j37939M216P2890j80996l50484N0829L88446Q6481r8515J41308M2667
17901G2411j36974K1292r5264l5479J00396Q5979l5466j38188L1327K94183p590
17890A56627j68331j4265j06143N1141k61054j22075J6774J37707P2999l3312
17880b69932k9869n8332p3833R9876M8260J11814J02670j9986j00859j33466O5883
17869b57774k3312M6449j58159Q0262Q5569p6999q6438K1357J18010M94997l6089
17858B07873L9189K4252k01347k22777J14550P6386q4227j80521J48392O5959
$$ y = [-57301, 137258, -41893, -156550, 4058, 4407, -84718, -237580, -142762, 254542, 290911, 39354, -61470, 214331, 187776, -48502, -21014, 19197, -40578, 21089, 161341, 59515, 53508, -84431, -80215, -7325, -188321, -538805, -487976, -99530, -13049, -111564, 29744, 72411, -64563, -43271, -138535, -174014, -73618, 12361, -23105, -161293, -129966, 164217, 156627, -11704, -25969, -132112, -80971, -342025, -464100, -447326, -309619, -236620, -269932, -299801, -358133, -431966, -332090, -283830, -172016, -69346, -89332, -190191, -323657, -257774, -281086, -234637, -392796, -312534, -226965, -303964, -390402, -369045, -251035, 243962, 207873, 247062, 271314, 69967, -152810, -38260, 38126, -46101, -226622, -78230, -12271]
17848a2271K07896R1206K8941j66021j58133r1114j14778J50032J54344r8752
17838h650k12616j10263j72784J45702J56491J65793J99009Q7191p2580m6132
17828A31161K11925N6276l90560j74633j88066k1326j15445m5414J33566K60664
17818a41852l7211J00936J77664J33805J06100m7241p0027j11608j04556j91402
17808a85392j26489J04509K59426J35710j06700q2719p1134j54407k22014O1739
17798c87471R7504k34976K3821J05974J18191J49984J1991J87482J60551N9050
17788B92101k6698j96015k39690k26820L17695k0139k5783K24569L3094l86502
17778b54188l4531J12641j35195R6281J54592J51217o0843k24626k8311j3622
$$ y = [-12271, 195625, 286831, 315772, 149751, -8382, -99496, -214274, -64242, 90102, -8650, -221266, -331529, -504313, -358611, -202120, -36327, 162682, 249873, 177293, 131161, 343086, 399362, 8802, -165831, -353897, -375223, -490668, -536082, -402516, -141852, -179063, -78127, 99537, 233342, 339442, 292201, 222174, 110566, 6010, -185392, -311881, -207372, 52054, 187764, 81064, -1655, -72789, -227196, -449210, -387471, -289967, -524943, -501122, -395148, -276957, -126973, -114982, 72500, 233051, 292101, 265403, 69388, -170302, -397122, -79427, -99566, -125349, 99220, 132314, -254188, -288719, -176078, -311273, -214992, -60400, 90817, 29974, -194652, -222963, -236585]
17768b36585J14295j33758n9758L4263Q0597J46628P1441J22593j55453p2139
17758h7876R8829k9367K66144j22412k36538O2832j15100N1671J31523K55446
17748B75152p0652o7615R4786j86248j66249j8447K825O8071k4069L907R0970
17737B431Q3706J10447j08989j39676J63613k46993j48959j60351j03784J39088
17727d09467J59077r1447j51311q3009K97980M34223p159j65320j62320p1051
17717b49804p515j2896R8645J15850J73111j34874j7943n6020k4046j89681Q8762
17706b16411K72285j13071q0916o1675l2776O3759R4919J99584J76213j86580
17696A15331O8961J50592p1866m1392o5116j13818k5580j17735O4183J57297J18305
$$ y = [-236585, -122290, -256048, -315806, -281543, -200946, -54318, 17123, 139716, -15737, -87876, 10953, -18414, 247730, 125318, -111220, -48388, -163488, -111817, 19706, 275152, 204500, 136885, 231671, 45423, -120826, -139273, -136448, -68377, -92446, -88539, 2431, 86137, 196584, 87595, -52081, 111532, -135461, -284420, -444771, -548555, -409467, -250390, -341837, -493148, -576157, -278177, 156046, 148887, -16433, -178753, -249804, -257319, -270215, -171570, -55720, 117391, -17483, -35426, -91446, -115492, -305173, -216411, 55874, -57197, -138113, -199788, -232564, -168805, -73886, 125698, 301911, 115331, 184292, 334884, 263018, 221626, 156510, 42692, 17112, -100623, -36440, 120857, 239162]
17685B39162r4701j19627k81264J14647j7041J05859J43249P7230p5503l34815
17675b42804l454J64425r5489j36263J71814L19096r4133o5035k4392N3699l7094
17664A0370o6738j74480j47218K20571K51171j33854j73931J5130J61181P6938
17654C9140K8374k30636q6602o1138K5773k2529N2366J26181R2447j96443j8200
17643b51267j52704n5613j52825R3915J66547N5246N1568k10774J35093L69963
17633D9149P4078o5711l9530j88181j1887J76518K14505R5784l1343l11716j95777
17622b34111K5126R8520J59097l05709r9637R2909J47181q3977N726J10025Q5957
17611A107Q715j57096J18638J40910j71471j17121L42996o1533k54876p7835J19194
$$ y = [239162, 144461, 24834, -256430, -141783, -158824, -52965, 90284, 167514, 92011, -242804, -246258, -81833, -177322, -313585, -141771, 177325, 83192, 18157, -6235, 47464, 10370, -56368, -230848, -378066, -157495, 93676, -40178, -214109, -198979, -37798, 39140, 67514, -163122, -249724, -310862, -285089, -307618, -255252, -129071, -36624, -233067, -251267, -403971, -459584, -612409, -518494, -351947, -296701, -245133, -455907, -320814, 49149, 123227, 57516, 17986, -170195, -182082, -5564, 208941, 304725, 273382, -38334, -234111, -208985, -110465, 48632, -257077, -356714, -263805, -116624, -200601, -194875, -84850, 1107, 9822, -147274, -28636, 112274, -59197, -176318, 166678, 105145, -149731, -227566, -108372]
17600a08372R5434Q0490L0861J12254o1669l39608j12191J01590J29415P013Q1564
17589A6781j19069k21737Q7661L34696J21397J6013k62862J10877J2840p0216
17579B6381O1855n570l3078q9456j20449J9140J87277j63219p0925O3459J029
17568a23556o0469k42516k82039L89432L43439j64913j47244m691L09466J52037
17558A68946j34862k11519N9829K06890J06106j16733j71394j2168J65331O9267
17548A29693L6726j129r8653L06525J16972j45704o3056n3694J03476J74058j56951
17537C48263m1178j24388j38577r0139O348o861j29253P2304q6103m6366j03795
17526c39745J39723J58267j27000q1692J85911J02752j28848M18K4481K27876
$$ y = [-108372, -12938, 67552, 98413, 210667, 148998, -190610, -302801, -201211, -71796, -64783, 16781, -102288, -324025, -236364, 98332, 219729, 235742, -27120, 83757, 96597, 26381, 88236, 82666, 49588, -39868, -160317, -141177, 46100, -117119, -188044, -124585, -123556, -184025, -426541, -708580, -319148, 24291, -140622, -287866, -292557, 16909, 168946, 34084, -177435, -117606, 89284, 195390, 78657, -92737, -104905, 60426, 129693, 166419, 165290, 66637, 373162, 490134, 344430, 281374, 227680, 331156, 505214, 348263, 307085, 182697, 44120, -46019, -39671, -46532, -175785, -103481, -189584, -235950, -339745, -200022, -41755, -168755, -250447, -64536, 38216, -90632, -90214, -65733, 162143]
17516A62143R5386N9028K58143p8033m31076J99775R0466k34176j45734Q528k043
17505a7593n5920j68178O7496Q6659J16645N5082K07026j67725j77991J21818
17495F7319L14686R4713j53960n0516J29945j5313p6484K6836J87119j55415j40752
17484B28178m1763k8528j73872j07134Q1731j04035Q2519K1820n5545J20754P5554
17473I9679k73021l39900R7040L93515j0734j16093P7999M1477j10318k25074
17463c65430k2655J4o2024L5884R6643J58937m5886J23080j8957o6286Q7335R4124
17451A4779q9872n1061O4693J49030o1438K6134n5950J04955k15589k78271J66547
17440b26043J64810J43479J7565M6704n9625r9456K5731J6374j79960q0516k6075
$$ y = [162143, 257529, 316557, 574700, 496667, 65591, 265366, 355832, 121656, -24078, -15550, -17593, -73513, -241691, -174195, -87536, 29109, 84191, 291217, 123492, -54499, 67319, 382005, 476718, 322758, 272242, 402187, 386874, 310390, 337226, 524345, 368930, 228178, 186415, 157887, -15985, -123119, -41388, -145423, -62904, -41084, -96629, 24125, 99679, -173342, -513242, -416202, -22687, -33421, -149514, -71515, -30038, -140356, -365430, -388085, -388071, -450095, -414211, -317568, -158631, -204517, -81437, -100394, -166680, -79345, 14779, -75093, -126154, -61461, 87569, 26131, 52265, -3685, 101270, -114319, -392590, -226043, -61233, 82246, 99811, 146515, 86890, -12566, 13165, 29539, -150421, -230937, -257012]
17429b57012j78053j31009J65875J39781m412Q5170L8649l97256J1034J90334
17419c36899k7865o8915P0888K74705j50960n4972K03933j9224J81022R9572J42599
17408C13884j3005j61786k59156k16989J40650p901j10937r4012K8968J44885
17398b35399m2659J88686J79626o3317K7729K5865j09209r429K17080K03314k21230
17387A61057j86923Q9942k82510J5512j3664K2649P238J64263K09465R5344j27604
17376A54769J806O7346J37554L0502j46535L9301J19162k77712l35836p5874j12911
17365c98428k40911L4539R5392K5583J02077K53132J58629M5744J8042m1841j80062
17354a28104j18144P2275j0358l1935j65229M4370l08542Q5050M00979J56170
$$ y = [-257012, -435065, -566074, -400199, -260418, -264830, -179660, -141011, -538267, -527233, -336899, -364764, -433679, -362791, -88086, -239046, -294018, -90085, -109309, 71713, 171285, 313884, 300879, 139093, -120063, -337052, -196402, -204303, -315240, -409252, -380284, -235399, -278058, -89372, 90254, 26937, 54666, 80531, -28678, -38107, 178973, 382287, 161057, -25866, 64076, -218434, -202922, -216586, -193937, -186699, -22436, 187029, 282373, 154769, 156575, 223921, 361475, 391977, 245442, 284743, 403905, 126193, -209643, -285517, -398428, -639339, -604800, -509408, -483825, -381748, -128616, 30013, 75757, 93799, 51958, -128104, -246248, -173973, -184331, -216266, -381495, -337125, -645667, -560617, -159638, -3468]
17344c468J2466j25979K81318j42639n301J85654K5619k07992j7899K0718M0548
17333F3045K677q0673J7934Q3676K04363j64070j36323P4573K5436o2518J52776
17322A80896j49286R683N9338k22285j7289R4316J08045q5139r562n2154K8889
17311e4548j03262K41630J01823k18152k82635j39026K2351J63432K25512q3849
17301a26724l9915j39370j54217r0187K35114J51744o1396L6029M0385l5557j19412
17290c03506O6784n6450K3613j7002P814o9830P3340K51553J48113Q315J41266
17279B74010j31149o5572J34258K33807J40713k55211l00219n0259n2491J7486
17269e4627J17593j2354j35564k05205K9216K63645r8236m8421Q9959J05423R6856
$$ y = [-3468, 8998, -116981, 164337, 21698, 16397, 202051, 227670, 19678, 1779, 22497, 63045, 65722, -14951, 2983, 86659, 291022, 126952, -9371, 65202, 90638, 28120, 180896, 31610, 41293, 100631, -121654, -138943, -44627, 63418, -21721, -31283, -83437, -54548, -157810, 83820, 185643, -32509, -315144, -454170, -431819, -268387, -42875, -126724, -166639, -306009, -460226, -550413, -315299, -163555, -224951, -188922, -148537, -184094, -303506, -236722, -293172, -269559, -286561, -278747, -348577, -275237, -23684, 124429, 132744, 274010, 142861, 77289, 211547, 445354, 586067, 330856, 30637, -19622, -72113, -54627, 62966, 50612, -84952, -290157, -260941, 2704, -95532, -143953, -53994, 51429, 148285]
17258A48285q4732l7252O1178l0931k82231j11984J26293K9228j57127k54872
17248e94145R7578L79210K6744J11069M1872N1787J42173k2756L2255J36074j23913
17237B77948k22419n5533P7079J21519J5408K4278k24029K9867J89285O3980o6527
17226B30856m4800J69381k58921l10997j31454L36K62951J56023j13229j05117
17216a44971n3612j15084J51718J44403J76828k19612r9175J1963M1617K15360
17206A09435P2766j40237k06963k2218J95330O5813q6573j59001k0350r3030J11521
17195a73507j8508p8499K8757L81716K6908k26442P2306R647o277N4022k7864
17184D2259J43930K56384n2849l64993j6479K17969K56586j72144k73958p6774
$$ y = [148285, 63553, 26301, 87479, 56548, -225683, -337667, -211374, -182146, -339273, -594145, -496567, -117357, -90613, 20456, 62328, 114115, 256288, 233532, 265787, 401861, 277948, 55529, -4, 77075, 198594, 214002, 238280, 14251, 44118, 233403, 297383, 230856, 186056, 355437, 96516, -214481, -345935, -345599, -82648, 73375, -39854, -144971, -198583, -313667, -161949, -17546, 159282, -60330, -159505, -147542, -105925, 109435, 182201, 41964, -164999, -187217, 8113, 73926, -12647, -171648, -191998, -285028, -173507, -192015, -270514, -241757, 139959, 166867, -59575, 12731, 22378, 16101, 70123, 42259, 186189, 442573, 389724, 24731, 8252, 226221, 482807, 310663, 36705, -40069]
17174d0069m5764j17115j15776q3180j74028K58207K84629M4726J01154j37457
17164b4673L2475R2330R9213o2950m5721j08637r7408n0455q4177j73221J19865
17153c03359J96474M05039q0359l34980j76670m3910m878J32735O207o6646J27706
17142a42641j51687M8770N4948k319o2723K29791j31295j14896j12050J7380K62309
17131a04413K69321q4905J36325p2051j58660J65751O0175p2619K402L788m818
17120A40296r1610J49304K12499k30095j05671j37755l0639k80309r6028K70799
17110a99209N6749m5590j7934P7513N1066n2971R7385j9355j15716J2257J95321
17099C9516P3166q9407K58486j25396M7924J31077l1321r1540k75322j74926J32087
$$ y = [-40069, -85833, -202948, -318724, -401904, -575932, -317725, -33096, 11630, 112784, -24673, 7802, 100132, 199345, 136395, 90674, -17963, -115371, -165826, -250003, -423224, -303359, -106885, 298154, 217795, -117185, -293855, -337765, -342643, -209908, -203701, -270347, -142641, -294328, -245558, -190610, -192929, -255652, -25861, -157156, -272052, -384102, -366722, -104413, 164908, 80003, 216328, 144277, -14383, 151368, 211543, 138924, 141326, 145114, 140296, 48686, 197990, 410489, 180394, 74723, -63032, -93671, -373980, -470008, -199209, -142460, -188050, -205984, -128471, -77405, -130376, -32991, -52346, -168062, -155805, 39516, 112682, 23275, 281761, 156365, 204289, 335366, 304045, 212505, -62817, -237743, -105656]
17088a05656p121J6336M4736K9586j54914J41778O2634M3257j25406m9631J62017
17077E7616R861J3167K05406n8208j38770k92290m606N4054M3302j17710O963
17066b21215K43940J69838J6272k19825j58065m4286j04651n97j83319K03659
17056b98249L55466j73681L1852O0529j08087R9132q4281M2274J69082N487j16158
17045a6634j88254Q6054J5387J43151R7073R0196J9524j2043j84570j87119j416
17034a38651J14631O9602J08762p769o4593j17933J23870J7899r4689j08752j00871
17023a98494k08156Q6674M4505q372l19j55980m6742K02511L13413K54222k49407
17012C3855k23877L00679K49333Q17j62058k65776J17497p8961P9225K07998j07649
$$ y = [-105656, -112777, -96441, -51705, -22119, -177033, -35255, 27379, 70636, -54770, -104401, 57616, 67477, 80644, 286050, 227842, 89072, -203218, -207824, -153770, -110468, -228178, -221215, 22725, 192563, 208835, -10990, -169055, -213341, -317992, -318589, -501908, -298249, 57217, -116464, -84612, -24083, -132170, -33038, -117319, -75045, 94037, 99524, -16634, -204888, -118834, -103447, 39704, 136777, 226973, 246497, 234454, 49884, -137235, -138651, -24020, 45582, 154344, 146575, 81982, -35951, 87919, 105818, 11129, -97623, -198494, -406650, -319976, -275471, -283843, -284162, -440142, -486884, -284373, 29040, 283262, 33855, -190022, 110657, 359990, 360807, 198749, -67027, 50470, -28491, 50734, 258732, 151083]
17001A51083j98244j05272K14621j75238k58257j45647J56898R4884K3713K2202
16991b19257K33535j22648j90911P3528J26923J80366K46206j78896m20953j22364
16981c94471o975J84685k5505q6011L87735k8850l12909K56771L21893M6973j95852
16970A47484K0844j25311j72524Q7162j42435k06353M80508J89638q5680l14344
16960a21011r3016M3467J90883Q7769j27831k07769j69591k26354k22425p5588
16950i21466J70263K37758M13356O3857j03310K33607K4947M1614k6272J91652
16940C26006p3271j9914j12915n5135J75668p6397p1061p2635j41840J6453J53292
16929D8251m9728j58104o4783J44243n5945J54k1833k6894l4729j23623K45612
$$ y = [151083, -47161, -152433, 62188, -113050, -371307, -516954, -360056, -265172, -241459, -219257, 14278, -108370, -299281, -225753, -98830, 81536, 327742, 148846, -272107, -394471, -401446, -216761, -242266, -328277, 59458, 30608, -282301, -25530, 296363, 343336, 147484, 168328, 43017, -129507, -42345, -184780, -391133, 89375, 279013, 193333, -121011, -214027, -170560, 20323, 108092, -19739, -227508, -397099, -623453, -845878, -921466, -751203, -513445, -100089, -36232, -139542, 94065, 119012, 160626, 134354, 326006, 252735, 232821, 119906, 64771, 240439, 164042, 92981, 20346, -121494, -105041, 48251, -1477, -159581, -224364, -80121, -136066, -135912, -157745, -184639, -219368, -342991, -97379]
16918i7379J06406j66920j43756J92298k31020j45698K19380K39351p7886J03279
16908a945k0304O8701N4607N1485P039m3671q0904l9418J42853m9825k40105J00274
16896e1213J55305J05487R8057j30656j05761r1396L2754J25503j12122j02839
16886g6881J12680J2017J18139N4754j94654l11026J46662j6832l4331J42932
16876d6540N6315q9962m6228k1189m2919o0781J86357L5419j37607P9848P1628
16865a5659j59397j28184L60153J16534j99244l79592q0808J69295p9554k28870
16855f25326K1393J20571J17917J33848J98986j34014J89628M2191n8213j22082
16845a15101J77442j45337l65339j3606R6128k3241J33911L41086n9330j89098
$$ y = [-97379, 9027, -157893, -301649, -109351, -340371, -486069, -266689, -27338, -105224, -1945, -22249, 46452, 101059, 152544, 159583, 115912, 35008, -4410, 138443, 88618, -151487, -51213, 104092, 209579, 307636, 176980, 71219, -20177, 12577, 138080, 25958, -76881, 35799, 47816, 165955, 220709, 26055, -284971, -138309, -155141, -189472, -46540, 9775, -80187, -126415, -147604, -190523, -251304, -64947, -29528, -167135, -87287, -15659, -175056, -303240, 56913, 173447, -25797, -405389, -486197, -316902, -396456, -625326, -603933, -483362, -365445, -231597, -32611, -166625, 23003, 65194, 6981, -115101, 62341, -82996, -448335, -461941, -365813, -389054, -255143, 85943, 26613, -162485]
16835a62485j03143J12954P1005j66434j9262K8696J02003J8430K1254J46733
16825D9751l5104j37785j40827p2033j19393j3344J76240J32584n9055J1264J03136
16814a04566R5470m4887j97727k17038K12327K31496P4933l05897r8031r8045
16804d51965O0929J72262K10486k9025o2074p9313k01745j26943K66729J10958
16794a29701K4729K04579J18520L23355l2357l06519k19476N3015o0435k8060
16784e2350r9817J13645L38007P1551l46836j59562N35J17905r417M5736L7857
16773E7254J2626n0785j76820k3201j3153J0286r8069J6414J44280N9275K4125
16762c7768r9325L3264j32686j14994j88131J66027K97162J36326L7942j85923
$$ y = [-162485, -265628, -152674, -81669, -248103, -267365, -238669, -136666, -118236, -96982, 49751, 14647, -123138, -263965, -335998, -455391, -468735, -292495, -159911, -218966, -207702, -104566, -9096, -53983, -251710, -468748, -256421, -24925, 50008, -255889, -353920, -451965, -391036, -218774, -8288, -37313, -99387, -178700, -380445, -507388, -240659, -129701, -104972, 99607, 218127, 541482, 509125, 202606, -16870, 36145, -24290, -52350, -152167, -38522, 299485, 371036, 24200, -135362, -134827, -16922, -26339, 19397, 57254, 69880, 19095, -157725, -180926, -194079, -183793, -281862, -265448, -121168, -61893, -37768, -137093, -103829, -236515, -351509, -539640, -373613, -76451, 59875, 97817, -88106]
16752h8106k3408J05997r3128N2257M7231k3109k8881m5686Q2555j74889n4795
16741b43962Q6593Q1094P2545k79533k83236o0650L47730N13998j57581m40786
16731c63788j2157L2370M3196R3897R3804M5892j39818j43476J64043J93374J10525
16720A17862k04959k16230J09790J28861K1638L8348p8944J8563p2102j85918
16710c23091q0744r3329n5276J99185J17003J39807j87575L0892M3451o6919j05272
16699c81868j86222j50691Q6611K77856O4378p5771j23900J14811L54921J64897
16689A45022k76360k54495L45727Q4499q6469l5002P5101r8526r9951J63097P0381
16678C3024j07843k7119O0885j32035j34419j15471L9366J78953P2235J92678
$$ y = [-88106, -111514, -5517, -98645, -46388, 843, -22266, -51147, -96833, -14278, -189167, -243962, -157369, -76275, -3730, -283263, -566499, -627149, -279419, 234579, 76998, -363788, -375945, -343575, -300379, -206482, -112678, -66786, -206604, -350080, -186037, 7337, 117862, -87097, -303327, -193537, -64676, -43038, -4690, -83634, -65071, -137173, -323091, -403835, -497164, -552440, -353255, -236252, -96445, -284020, -253128, -209677, -276596, -381868, -568090, -718781, -632170, -354314, -289936, -365707, -489607, -374796, -19875, 145022, -131338, -385833, -40106, 44393, -42076, -77078, -1977, -100503, -200454, -37357, 33024, -74819, -101938, -41053, -173088, -307507, -422978, -383612, -204659, -132424, 60254]
16668F0254J5214K3572m7084R964K565J35069R2433l20386k4802j58200k7736
16657b39137k7874o0277O9556n2630p2061K2722K14707j07982m8757L34761M7097
16646H0125k64665k46042J77666P3340K5890Q1021M4704p597j64577M2349J6157
16635a41629L1672J78541J7470j65071o4253J83423M2926J00916p8323q5559k64022
16624b43909k71104j22765M7228J60857J13132j94776J77003O8834r6141P5174
16614b86467L06770O3712J11649m3377n2188n5616j08335j21076J79776J05094
16604I9942k77850j69678K6280K03450j08518j90852k7649l5272O45J51145Q6827
16593b41530K2534J16446K9826p4603r050M7143J50528R2609l42707j31914L02079
$$ y = [60254, 75468, 99040, 51956, 61920, 64485, 199554, 291987, -28399, -53201, -211401, -239137, -267011, -327288, -257732, -310362, -382423, -359701, -144994, -252976, -301733, 33028, 80125, -184540, -430582, -252916, -179576, -153686, -72665, -27961, -35558, -200135, -157786, -141629, -109957, 68584, 86054, -79017, -143270, 40153, 83079, 183995, 105672, 20113, -243909, -515013, -637778, -590550, -429693, -316561, -511337, -334334, -265500, -361641, -286467, 20303, 84015, 195664, 152287, 100099, 44483, -63852, -184928, -5152, 99942, -177908, -347586, -321306, -117856, -226374, -417226, -444875, -480147, -479502, -328357, -241530, -218996, -102550, -72724, -147327, -156377, -109234, 41294, 133903, -208804, -340718, -38639]
16582c8639K9834L9265J17173j49012j17856P8362K49471L7449L1317J11577J68961
16571E57902k59237j11613j31910j4288n1174J10740j27176j68397L0276O4232
16561a00645Q9291l4231j07077k62615j42151K49164K73063k24452q511K32661
16551c5503L8055L1666R0919j00784K2968N6483j30094j66299J21527n7675o2588
16540a91325L9109P6121J21396o160J34763J92187k5774K4253O7911r3664j29417
16529B09400k20221k57320J3997K90672K4581j47938M7146J52004j73127k19590
16519b80396n0346R3897J48174o5917j83202J03979l6069J84990J42084K11110
16509B68304K03738J30271p3539k14314j22624j74628k76777k49854j9605K22059
$$ y = [-38639, -8805, 30460, 147633, -1379, -119235, -40873, 208598, 246047, 277364, 388941, 557902, 298665, 187052, 55142, 40854, -10320, 100420, -26756, -195153, -164877, -100645, -11354, -45585, -152662, -415277, -557428, -308264, -35201, -259653, -268164, -35503, 2552, 34218, 125137, 24353, 47321, 103804, -26290, -192589, -71062, -128737, -191325, -152216, -76095, 45301, 39141, 173904, 366091, 340317, 364570, 432481, 338817, 209400, -10821, -268141, -254144, 36528, 61109, -86829, -39683, 112321, -60806, -280396, -330742, -236845, -88671, -154588, -337790, -233811, -269880, -84890, 57194, 268304, 472042, 602313, 528774, 314460, 191836, 17208, -259569, -509423, -529028, -306969]
16499c06969o1443K30890J49860k21554m4769K21124K0960j14053q5593j69089
16489c80636R2871J1635J48409J23827j726k03262M5073R9391l63411j7791L8015
16478d07605O5305K32378m2164n3471R8843Q6178R2457l3418k46940j82767J56770
16467b34434J45418o3206L226J43416J39452J10681j74087m6399J29453m3603
16457A09917k17523q5274m4302M038j08773M1724j78282L2113n1063J97354O0054
16446b40017K79035M2669k45888l74701j50028K00467L20243J19280K19523k08871
16436c8288o7174M0150q1075M7107m5882j27073k2109Q8826L6996k9164M6099
16425a51587Q113R8192j33750p5453L01819L4612j46245P0246Q3484j64067J5811
$$ y = [-306969, -368412, -137522, 12338, -209216, -253985, -32861, -11901, -125954, -211547, -380636, -287765, -276130, -127721, -3894, -5620, -208882, -163809, -64418, -427829, -445620, -407605, -342300, -109922, -152086, -205557, -106714, -20536, 71921, 38503, -208437, -391204, -234434, -89016, -152222, -148996, -5580, 133872, 244553, 70466, 24067, 153520, 109917, -107606, -192880, -237182, -233144, -341917, -300193, -478475, -446362, -497425, -300071, -240017, 39018, 81687, -164201, -538902, -688930, -488463, -168220, -48940, 170583, -38288, -105462, -65312, -146387, -99280, -145162, -272235, -294344, -205518, -168522, -197686, -151587, -143474, -45282, -179032, -254485, 47334, 81946, -64299, 5947, 89431, -74636, -58825]
16414e8825q841N9936K05658k7929O6476o813K4649l96474l65705j78740j19621
16403h06229R6491P6067K4238j44570k217K02768K86518o2566k90291j0389Q3475
16392e46705K91479K93195J43287m0680j06287k55808l31044N7496K87220P5613
16382a32234n1477k3266K8723j0175n6252j85213j43429o3558J17148J74149O3624
16371b81960K30025K04707N3223k98242j97900l9031m6882j50242j2598J00880
16361d38020J56699J00714k33810L60K12617K71499r6971L408N3730j49711P7414
16350d2071j34770N3000L92910j01660k59226j0214J47302N6358q8254l9816r3171
16339a19612k94867j83964K1780K01282K49316l9791j02580M6794O7283j47595
$$ y = [-58825, -67666, -7730, 197928, 169999, 236475, 229662, 254311, -142163, -507868, -686608, -806229, -709738, -633671, -609433, -754003, -756220, -553452, -266934, -329500, -619791, -630180, -546705, -255226, 37969, 181256, 140576, 34289, -221519, -552563, -495067, -207847, -132234, -183711, -206977, -178254, -188429, -244681, -429894, -573323, -636881, -519733, -345584, -281960, -51935, 152772, 205995, -92247, -290147, -329178, -376060, -526302, -538900, -438020, -281321, -180607, -414417, -414057, -201440, 70059, -26912, -23504, 30226, -119485, -42071, -176841, -123841, 269069, 167409, -91817, -102031, 45271, 101629, 13375, -26441, -119612, -414479, -598443, -576663, -375381, -126065, -165856, -268436, -221642, -154359, -301954]
16329c01954K18945M22344J08755j39267k0447l25245j67530P7595o8253l3603
16319b28660p5331j42531l4797J84618K4996p3791m08166l7059M57801L77609
16309D4689J54108j33351K30n5427o926n2956j33308n3996O398J33910J84419
16298H7790O1417J58964J2259j11389p765J02632j54191l65868j95735l9534M3406
16287d08014N6017K16170J20485J8142j15227N8273J69832k4321j88174j1381
16277a08198o1490n7242K3221K42968Q5707j44906j10706j56261M0973l6165j27704
16266d09803j66840j2276J81282O5382J16816r0552l12542p8138K77428J45072
16256b84171j17486J8228L30671J22375k01522J1492Q7787k12969M4292M6949
$$ y = [-301954, -83009, 339335, 448090, 308823, 288376, -36869, -204399, -126804, -195057, -228660, -303991, -446522, -481319, -296701, -271705, -345496, -753662, -790721, -332920, 44689, 198797, 65446, 65676, 10249, 3323, -49633, -182941, -236937, -230539, -96629, 87790, 149207, 308171, 320430, 209041, 201276, 303908, 149717, -216151, -411886, -451420, -408014, -351997, -135827, -15342, 2800, -112427, -54154, 115678, 91357, -96817, -108198, -169688, -226930, -203709, 39259, 124966, -19940, -130646, -286907, -245934, -282099, -409803, -576643, -588919, -407637, -342255, -225439, -315991, -628533, -706671, -429243, -284171, -401657, -383429, -52758, 69617, -131905, -120413, -32626, -245595, -201303, -154354]
16246a54354j55648Q469J36208R807j19190N9685J45067j4112o6091j65686j3990
16235c29835N6946J45460L1927k5831J6698o0248j32336J9073j03304j55526l8759
16224e75735p312Q0522j41551N8489J31144j9076J49486J60105J85931P6114o1809
16213C6308k57155j29001K65904K01780o6974p0879P2135L14783J33158J8663
16203E18722j28319k86762k72522j51835O5497J38691L3782j33413M6010J22157
16193d7992j40412J01545K62835n3986j02750k40536k65130n644j08536J93818
16183d06788K09641N8843k03493j05257K62724R673K6818J11852j03346k17160
16173c56493j69419m1950R2551M22528K22436M3606j47340p8448J6138O4252Q0040
$$ y = [-154354, -310002, -301533, -165325, -155518, -274708, -215023, -69956, -84068, -150159, -315845, -329835, -272889, -127429, -95502, -121333, -104635, -164883, -297219, -278146, -381450, -536976, -575735, -583047, -502525, -644076, -585587, -454443, -473519, -324033, -163928, 22003, 98117, 36308, -220847, -349848, -83944, 117836, 50862, -20017, 52118, 366901, 500059, 518722, 390403, 103641, -168881, -320716, -255219, -116528, -82746, -216159, -170149, -47992, -188404, -86859, 175976, 121990, 19240, -221296, -486426, -492070, -600606, -406788, -197147, -138304, -341797, -447054, -184330, -174657, -147839, -35987, -139333, -356493, -525912, -567862, -475311, -52783, 169653, 213259, 65919, -12529, 3609, 67861, 147901]
16162A47901k3490M8962j77032k49173k21858K88506K28008L7259K8230j26896
16152a9583l3633k0490J5327K86912J5297k9396K6969j61865j92803j57472q8534
16141c59271p8566K64068K11546O4053J99272o2107j5285J34448k3669j950J13739
16130D46278j84561j583k5699j1036r2160J69485K1073o4611J00660j39964k26066
16119h184j9274q8358j09446O5771N7380n4745l714N9881q2917J61501K38600
16108B16495q4187j6417l02182l8554L0072k88427M329k1389K49299J18929M4022
16097h8010k527P1426p1020l89395J03179J11993j14569K1800J84639j42499R3159
16086b21824K10916M9660j51478R4387k93227k67495K9832K03380L02998j96490
$$ y = [147901, 124411, 173373, -3659, -252832, -474690, -186184, 41824, 79083, 107313, -19583, -53216, -73706, -58379, 228533, 243830, 214434, 241403, 79538, -113265, -270737, -359271, -437837, -173769, 37777, 101830, 301102, 238995, 223710, 358158, 334489, 332539, 446278, 261717, 260134, 234435, 223399, 131239, 300724, 321797, 257186, 357846, 217882, -8184, -27458, -115816, -225262, -159491, -102111, -156856, -160570, -100689, -183606, -22105, 216495, 132308, 115891, -186291, -224845, -194773, -483200, -478871, -500260, -250961, -132032, -88010, -90537, -19111, -90131, -479526, -376347, -264354, -378923, -357123, -172484, -314983, -221824, -10908, 38752, -112726, -18339, -311566, -579061, -549229, -345849, -42851, -239341]
16076b39341M5116q8617j18918J69760J85836K83396L94610K26047R5418K28306
16066A181613L60471K86732J97498j72632k66399L04776L08957n8014n36927o21366
16056I84709k45246j01315k75102Q709J10613k57770N7824Q4728k58041q9758
16046A9351j72562j35984n1501M34699J37180k69536j56464n8579l11528J32949
16036d31975K71610n7011Q531n6298l759l12K5678j52096j55699K55317J68876
16025a27138R6318j51659J15049J38067o5691J6481K83800j70696J1475m2570
16015A03436k34409j44274m4841J68338J98089j08872j66788J57563M32809j46482
16005B14569l15812k01938j9254N7140k42042L2478l709j11906j76833L9715M21396
$$ y = [-239341, -194225, -282842, -401760, -232000, -46164, 237232, 631842, 857889, 953307, 1181613, 1542084, 1828816, 2026314, 1853682, 1587283, 1892059, 2201016, 2143002, 1606075, 984709, 739463, 638148, 363046, 371755, 482368, 224598, 282422, 367150, 109109, 19351, -153211, -289195, -340696, 94003, 231183, -38353, -194817, -253396, -564924, -431975, -160365, -217376, -208845, -265143, -268902, -269214, -243536, -395632, -551331, -296014, -127138, -30820, -182479, -67430, 70637, 4946, 21427, 305227, 134531, 146006, 103436, -130973, -275247, -320088, -151750, 46339, -62533, -229321, -71758, 361051, 214569, -101243, -303181, -322435, -265295, -507337, -474859, -478568, -590474, -767307, -727592, -306196]
15994c06196p7696J49306J41319o4273j34385l09677M8988M03285J93843j35291
15984i0777r5923j0193K44324J61262j11847j03662o6423L661k32514l3289M2018
15973b93363n8858J6573K56547j1449M9431Q8110n1703Q5960p8529j05967p6049
15962a79297j15967r3231K52209P3389O7056r6384J9670J51334O7341O1496p5452
15951A32164J2063P657k11004j35905k45419K93408J84745O0508J19130k38108
15941b0761j09985j72300q3256M0803J39129J20878m2119J17846r9531J46672
15931C7376j17382k07713j95379L00123K1180n0746J97508J24276l3954p7140
15921a851q7232j98575M3691J63058j43958n3261r825O2969P1023m4966m9119
$$ y = [-306196, -383892, -234586, -93267, -157540, -291925, -601602, -552614, -149329, 44514, -90777, -186700, -196893, 47431, 208693, 96846, -6816, -73239, -69578, -302092, -335381, -293363, -352221, -335648, -79101, -90550, -41119, 46991, -4712, 81248, 2719, -103248, -179297, -295264, -388495, -136286, -62897, 4159, -92225, -72555, 78779, 146120, 207616, 132164, 144227, 151884, -59120, -195025, -440444, -147036, 37709, 98217, 217347, -20761, -130746, -303046, -386302, -345499, -206370, -85492, -127611, -9765, -109296, 37376, -80006, -287719, -483098, -182975, -161795, -212541, -15033, 109243, 75289, -1851, -89083, -287658, -243967, -80909, -224867, -278128, -287953, -224984, -153961, -198927, -248046]
15910b48046J33392j09318L0891j00985l08307J36110L45648j29732j9650l9247
15900c09244P1264O9196k6825J57226q6504l81457j31868m8711J73774N8450q393
15889d63092K7575K12052K7424k4935L4572k45573J46501O4614j33226j2552K9359
15878c37281m8187J61054K3441R7599P873J76748j53325n0424J411j21169m4944
15867b87204j2282j8311N2529p7569k23528P0438J00154O732J1912J88458J60694
15856b7977l29317l98874M5532K57297J58095K73158m6138N1727n4653J03927
15846C2777j34106q8578l43962m0375K80161J29391j25507M0697j31540k33159
15836f14201M3318l1665O3666l8741N9926J29293J51629L7880N3138j27999j35221
$$ y = [-248046, -114654, -223972, -193081, -294066, -602373, -466263, -120615, -250347, -269997, -309244, -237980, -168784, -195609, -38383, -124887, -506344, -638212, -686923, -513149, -454699, -463092, -435517, -223465, -196041, -220976, -186404, -431977, -285476, -220862, -354088, -366640, -337281, -385468, -224414, -200973, -103374, -95501, 81247, -72078, -122502, -121091, -242260, -287204, -299486, -317797, -265268, -342837, -566365, -495927, -395773, -389041, -377129, -188671, -27977, -357294, -756168, -710636, -453339, -295244, -22086, -68224, -16497, -71150, 32777, -101329, -189907, -533869, -574244, -294083, -164692, -290199, -249502, -381042, -614201, -570883, -602548, -538882, -577623, -517697, -388404, -236775, -198895, -145757, -273756, -408977]
15825d08977L0955Q7251R6136l4552j928j37189n1463P5802Q2967K6740j03172
15814c37430m3056J42907j38213j41875K58867K64315k21874m33260o3340P9685
15804f33274N8812m8102K61271J43579R813j32773j42848J54583J64460j07208
15794b71687R472J84663r5323j05363L0406O3299j19905j42415K99728K25581
15784G8456L6243l14969j59335J21544J02272j31177k4910k05984k6533j30866
15774f55259j0295Q0120K75180K14814J34394J2057l11327m8247J49543K16426
15764E7406N8247j11117j62739j15274J00715J28639j13855q6277q2179j16465
15754d42899p0443P7335K94498M4858l7667N6588j16940l96076R2472j63590J04783
$$ y = [-408977, -378022, -290771, -194635, -229187, -231115, -368304, -419767, -343965, -260998, -234258, -337430, -380486, -237579, -375792, -517667, -258800, 5515, -216359, -649619, -712959, -633274, -574462, -622564, -361293, -217714, -207901, -340674, -483522, -328939, -164479, -271687, -262215, -77552, -172875, -278238, -247832, -184533, -304438, -446853, -147125, 78456, 114699, -200270, -359605, -238061, -135789, -266966, -291876, -497860, -524393, -655259, -665554, -585434, -310254, -95440, 38954, 51011, -260316, -308563, -159020, 57406, 115653, 4536, -158203, -273477, -172762, -44123, -157978, -244255, -326434, -442899, -513342, -436007, -141509, -96651, -134318, -77730, -194670, -590746, -498274, -661864, -557081]
15743e57081J87722p5268J16385K91594J99261K9330K9076n5158k16929k98334
15733c49402j16063p4028J49451o4389L2620M2908K84203M512j96412p4178k5059
15722c85837Q7902K3763O2314Q9608r4790j07273K418j44974J43467L599j05957
15711d25760Q3320k24423n1427K1279O5536O4071o2534J11290J77904K2860j7819
15700b35703J53305j52770l5239N1833J96995q5771P474L2069p982r2653O1977
15689a06465j12097k51837k24684n0011L5812R6587P844K7622K62985N3928K5429
15678b34887j04594m6461m5030k04625j05240J99184J45104k0371p8202R070K23610
15667b62442k0178L4294m6876P9129J68431j12502n8878J08822m594j73508j81558
$$ y = [-557081, -369359, -444627, -328242, -36648, 162613, 191943, 221019, 165861, -51068, -349402, -465465, -539493, -390042, -454431, -421811, -378903, -94700, -90188, -286600, -360778, -385837, -297935, -274172, -211858, -122250, -217040, -324313, -321895, -466869, -323402, -319803, -425760, -342440, -566863, -618290, -597011, -531475, -467404, -529938, -418648, -240744, -217884, -235703, -82398, -235168, -270407, -218574, -21579, -107350, -99876, -67807, -75789, -168442, -106465, -218562, -470399, -695083, -745094, -709282, -612695, -604851, -577229, -314244, -260316, -234887, -339481, -385942, -430972, -635597, -740837, -541653, -396549, -416920, -495122, -486052, -262442, -282620, -248326, -295202, -216073, -47642, -160144, -219022, -110200, -114794, -288302, -469860]
15656d69860J19879K73930K0515k19880k79080o389J54083Q0369J77393J72667
15646B3627j42228j40879k67853l0962J26801Q6506j77492j90581k36592J07778
15636h41875M49866J68587j07717j13099j59003P9311J03734N3542J74271j52157
15626c44540j66751K27849P9100L6327n6523K09615P4989n61j14257j21975J27621
15615d9106p7910k61662J11835j69860K6791l6432K9960J73629L93227K08245
15605C48717r6120l62200K425j1274J17036j17203R6067L05076q859l30500r7858
15594a54693r0084k04443J65614Q8486O6922j4675n8430Q0326O7295r9209j93172
15583c46063j42657J65559K01269k12865k32479K30939Q4935J21254J36354m8212
$$ y = [-469860, -349981, -76051, -55536, -275416, -554496, -560885, -406802, -326433, -149040, 23627, -118601, -259480, -527333, -558295, -431494, -344988, -522480, -713061, -949653, -841875, -392009, -223422, -331139, -444238, -603241, -523930, -420196, -366654, -192383, -344540, -511291, -283442, -204342, -168015, -224538, -14923, 60066, 59505, -54752, -176727, -49106, -127016, -388678, -276843, -446703, -419912, -456344, -426384, -252755, 140472, 348717, 252597, -109603, -107178, -118452, -1416, -118619, -22552, 282524, 273665, -56835, -154693, -244777, -449220, -283606, -195120, -128198, -142873, -201303, -120977, -53682, -152891, -346063, -488720, -323161, -121892, -334757, -567236, -336297, -251362, -130108, 6246, -41966]
15573d1966k79637k04831N9482O0387J01783Q7974l0318P487j4314j95834J78326
15562b71461J63074L13994N22204O11597L10639K59438M60555k87280n54271l1208
15552A497281L13339J58547k02049m38217n57439m58928k53892j18828k06482
15543b66668O677J02814R0324k38418p8945J80617j39807k91127O8534K39220
15533c26779J69000m4809J3711j89564R3574N50188J52172j66483j3939l4674
15523B02397J04556K2919j08837j22469k1533J30598K06173L174j00067J92096
15513E09007K40506o6437n7476J28765M45641M27877L85589L30734k8312K19251
15503B535145J58733K47547L02615M11089L84852P98576J175197J133471J864963
$$ y = [-41966, -321603, -526434, -466952, -406565, -304782, -216808, -247126, -239639, -253953, -449787, -271461, -108387, 205607, 727811, 1339408, 1650047, 1909485, 2370040, 2082760, 1528489, 1497281, 1810620, 1969167, 1767118, 1328901, 771462, 312534, 58642, -60186, -266668, -259991, -157177, -66853, -305271, -384216, -203599, -343406, -634533, -565999, -326779, -157779, -202588, -188877, -378441, -284867, 265321, 417493, 251010, 237071, 202397, 306953, 329872, 221035, 98566, 77033, 207631, 413804, 416978, 316911, 509007, 749513, 683076, 625600, 754365, 1200006, 1627883, 2013472, 2344206, 2315894, 2535145, 2693878, 2941425, 3244040, 3655129, 4039981, 4838557, 6013754, 7147225, 9012188]
15494I012188K378457K744490L862017N111443P296637J2320653K2966688M4208478
15486A09901051P1870590P7227156O5585405M8493065j9514195m5484486O574327
15479C14652913L3216486L2228327O503592p3271059r8689179o1486638l4077904
15472A19076538k0064701j2170395q378300o563265n788723n714131n261954m490712
15464E0644357l632438k989678k721744k366822k310962k139826j759020j226379
15456C1497488j223790j246221j116877q57322p37300q89298p91734p77798o97293
15447B3159855n01759o53347q64390r42003m94595o67783m87289l29695m16729
15438A7802265p66998o53137j81767l40520l13813n31301m61820q5047j82128
$$ y = [9012188, 11390645, 14135135, 17997152, 23108595, 30405232, 42725885, 65692573, 109901051, 181771641, 258998797, 324584202, 373077267, 353563072, 308078586, 314652913, 347869399, 380097726, 386601318, 313330259, 214641080, 153154442, 119076538, 99011837, 86841442, 78463142, 71899877, 66111154, 60397023, 55135069, 50644357, 47011919, 44022241, 41300497, 38933675, 36622713, 34482887, 32723867, 31497488, 30273698, 29027477, 27910600, 27053278, 26315978, 25426680, 24634946, 23857148, 23159855, 22658096, 22004749, 21140359, 20198356, 19703761, 19035978, 18548689, 18218994, 17802265, 17035267, 16382130, 16200363, 15859843, 15546030, 15014729, 14552909, 14467862, 14285734]
15429A4285734k87388k75948m3636q5564k61509l83745n91797n66675n15371J1316
15419A1285417l14641m29368k37144j63252j89725k59362l06204l7029L0796N4992
15409I434480J69316K2463m79110m20085k62424J37633q5317j36422k80356l96684
15399G703494m66978n18565k98023p9813r9621r8310j08613k06218n4795k07792
15389E564766m0424j98217j89730l27335Q2810q9183P5577j6423l04907l88447
15379D168487l22323k18496J03786J02676j59920k15967J5780K44006J31077j1957
15369C837149L413k07699R0874J2751j0998j24322j86436k65723j88047K373k74933
15358B688402o3935j7048Q2859k08155k31719l3230L55368J73722l51866j45984
$$ y = [14285734, 13998346, 13722398, 13678762, 13593198, 13331689, 12947944, 12356147, 11789472, 11274101, 11285417, 10970776, 10541408, 10304264, 10141012, 9951287, 9691925, 9385721, 9348692, 9379488, 9434480, 9603796, 9626259, 9147149, 8727064, 8464640, 8602273, 8516956, 8380534, 8100178, 7703494, 7236516, 6717951, 6419928, 6340115, 6240494, 6142184, 6033571, 5827353, 5772558, 5564766, 5524342, 5326125, 5136395, 4809060, 4891870, 4802687, 4878264, 4861841, 4556934, 4168487, 3846164, 3627668, 3731454, 3834130, 3674210, 3458243, 3474023, 3718029, 3849106, 3837149, 3840562, 3632863, 3723737, 3736488, 3725490, 3601168, 3414732, 3149009, 2960962, 2963335, 2688402, 2624467, 2607419, 2690278, 2482123, 2250404, 2217174, 2572542, 2746264, 2394398, 2248414]
15348B248414k76466N0640J21974p8195j53766k35890N776M0809K4271P748n8042
15337A697273P834J9616J77406J96609k58172o6544K5896j12823l21264j43478
15327A222353L54763K09696j21905j82387m1355O7481K7551R934J63041n2550
15317A656622j74261j57429K5655J93184J44275o5445j30432l25794j08538k63838
15307G93999L19698K36070L9424n3774k22934j38518j65719j04580J15564k6704
15297G92526k27946p2963J49786J32161n78j30127k48458J3158P9692R2302k3615
15286E55938K157j56910j97221l3165L2659j28067K26860M3366K57338j58943
15276D44012J11611J66099j58117J30885p1497j60435K553K53385l90j60467k90302
$$ y = [2248414, 1971948, 2022588, 2144562, 2066367, 1912601, 1676711, 1682487, 1723296, 1747567, 1755315, 1697273, 1705107, 1724723, 1902129, 2098738, 1840566, 1774022, 1799918, 1687095, 1365831, 1222353, 1577116, 1786812, 1664907, 1482520, 1441165, 1508646, 1536197, 1546131, 1709172, 1656622, 1482361, 1324932, 1350587, 1543771, 1688046, 1622601, 1492169, 1166375, 1057837, 793999, 1113697, 1349767, 1389191, 1335417, 1112483, 973965, 808246, 703666, 819230, 792526, 564580, 491617, 641403, 773564, 772986, 642859, 394401, 407559, 487251, 579553, 555938, 558095, 401185, 203964, 170799, 203458, 75391, 302251, 345617, 602955, 444012, 555623, 721722, 563605, 694490, 622993, 462558, 465111, 718496, 718106, 557639, 267337]
15265B67337J28876m1501O5155Q5045R2994J70535m3052k89783K3158N2363K06905
15254G18032j02915P5489J73678k2797l05538Q1002J57896J26317m0539k24506
15244F36119q179K7330j2165j65931j69340l0611Q0658R1101j05901M8423q5481
15233C06023m1805m1395L2898k6861o1450M6422N4867J47806K83352J94977N1301
15222I46135K29924r2743k37170m44202n8336l7687K0895q4178J34932J41531
15212E19101m0059l17248j12068l2868k48312J8444J97171q3848J5337r1840J27405
15201d8785L81319K0129j2825j03326j4262K5031R0450r3195N0535l54199n5642
15190a14770J26107L41656J45784j34053j69173j23956K0211J36819p0059m5815
$$ y = [267337, 396213, 354712, 419867, 504912, 597906, 768441, 725389, 435606, 458764, 511127, 718032, 615117, 690606, 864284, 841487, 535949, 616951, 774847, 901164, 860625, 636119, 627940, 655270, 643105, 477174, 307834, 277223, 357881, 448982, 343081, 391504, 306023, 264218, 222823, 255721, 228860, 167410, 213832, 268699, 416505, 699857, 894834, 946135, 1176059, 1083316, 846146, 401944, 343608, 305921, 326816, 242638, 377570, 519101, 479042, 161794, 49726, 16858, -231454, -213010, -15839, -99687, -84350, -176190, -48785, 332534, 352663, 339838, 236512, 222250, 247281, 337731, 244536, 295071, -59128, -114770, 11337, 352993, 498777, 364724, 195551, 71595, 91806, 228625, 158566, 112751]
15180A12751j19720L2835M5999L88389j1650p0105N0755j76427p5711P2143J21300
15169C70559q0613l22859J04296L56618j89108l15001j5390p8086J07104p514
15159f9994J99451j83632n8273J69089O8923m8537k19493j7795J6482M29858K57910
15148E43989J70914j00624j3053k74872k41636Q5J55785j69983J2434N9479Q3262
15137B25780Q037K45834m8874k06870K403p122m07033M5232P7749L6041J93901
15126A65078n2406j38831L5215N5993K05912l2865j39881j1327R5395q162j32536
15115D1585q2850p6345K8330J01631P8741P6406r7394k01175n6867k5169m39019
15104f52126Q8159K43222K05215j4284l009k65063J46015O9734M8983K22314j4261
$$ y = [112751, -6969, 25866, 71865, 460254, 448604, 378499, 429254, 252827, 177116, 249259, 370559, 289946, -32913, 71383, 428001, 238893, -76108, -91498, -169584, -62480, -69994, 129457, -54175, -112448, 56641, 125564, 77027, -142466, -160261, -143779, 286079, 543989, 714903, 614279, 601226, 326354, 84718, 84803, 240588, 70605, 83039, 142518, 225780, 233817, 479651, 430777, 223907, 226310, 219188, -187845, -142613, -64864, -28823, 165078, 112672, -26159, 9056, 65049, 270961, 238096, 98215, 86888, 182283, 174121, 41585, -41265, -117610, -89280, 12351, 91092, 167498, 70104, -131071, -187938, -213107, -652126, -563967, -320745, -115530, -129814, -132823, -397886, -251871, -182137, -133154, 89160, 74899]
15093G4899r6913p395M5435p3568k31492N7877J71047K32567k470k32559n7607
15082a20179J07596N2289J41087J67549J4821P1396L9198k08120r5257l4319j0164
15071A25897j68335j0476K89525J43148P3843P0495k18495j24843j37743r1196
15061d8180P2442k11571q0525j46119p1257J99472K84017q1302k0107k38498j41747
15050d83375J36305p3203K9033K04886K25631O1764P629j30586j86718K11253
15040B619L39624J93563j22939k094o214j07912j27827j76803n3169j43073M2667
15029a61558P3352M5145M2798J43927j62975j88181K82414R4160K58963L0482
15019D58527j04399k7311J8995j84277l4698R297K4004K2858j03364k732J81631
$$ y = [74899, -22014, -29409, 16026, -57542, -289034, -231157, -60110, 172457, 169987, -62572, -120179, -12583, 39706, 180793, 348342, 363163, 434559, 473757, 265637, 170380, 136061, 125897, -42438, -52914, 236611, 379759, 453602, 524097, 305602, 180759, 43016, -48180, 24262, -187309, -267834, -413953, -485210, -285738, -1721, -83023, -103130, -341628, -483375, -347070, -420273, -391240, -186354, 39277, 101041, 108670, -21916, -208634, 2619, 342243, 535806, 412867, 410773, 404559, 296647, 168820, -7983, -61152, -204225, -161558, -88206, -43061, -263, 143664, -19311, -207492, 74922, 169082, 428045, 458527, 354128, 326817, 345812, 161535, 126837, 136134, 160138, 182996, 79632, 76900, 258531]
15008B58531K2835k27400j28307J66279K53839l7382j16505j01018j04397l0291
14998d3816K20791J26690j13015l02945p5102P6836N8958P3451l1787j5126k07449
14987b32514k31236J35621J95849L90425K04991j22780l38898Q4928R5641j24166
14977E7861Q6431k484N2844j87313q8398m9893R656q3521J15925K11757K8202
14966A51067r7628p5438j43230n2789K84413l3951m328j86573k42993j06384J5906
14955d91928Q5312l1823J12834P3647o6805M5737K33278K26039R4103l3440R5831
14944C42785p4024k52110r6704l9305J14941L50893l7556j90888k14274n6931
14934a53173J91631K59053p6169k37963J35712o1364P9596K59610k12178l24060
$$ y = [258531, 281366, 53966, -74341, 91938, 345777, 308395, 191890, 90872, -13525, -43816, 176975, 303665, 190650, -112295, -187397, -110561, -51603, 21848, -9939, -25065, -232514, -463750, -328129, -132280, 258145, 463136, 340356, 1458, 86386, 182027, 57861, 144292, 141808, 194652, 7339, -81059, -130952, -121296, -204817, -88892, 122865, 151067, 53439, -21999, -165229, -218018, 66395, 32444, 28116, -158457, -401450, -507834, -491928, -406616, -438439, -325605, -251958, -318763, -273026, -39748, 186291, 280394, 246954, 342785, 268761, 16651, -80053, -119358, -4417, 346476, 308920, 118032, -96242, -153173, 38458, 297511, 221342, -16621, 119091, 57727, 137323, 396933, 184755, -139305]
14924a39305M5940l6773L5915m0061J15090j44005j99943O0477K60501J19165
14914G7001q6759j61201M9884J1290O895J05896m6000k5250q1753M9399J16723
14903A6125J10047M3695Q1400p9164L251K279p3719J23427L59469M40978N37505
14892A565293L42324q3004r4590p523J72360R8387K19404k89960l73743m34548
14882A114400k30009k12899k77679k29898P8826J58411Q579k07564k9702J61592
14872C34057n5917m08181j66169K40448J5573K30272J71222K4247m1127k8592
14862C15833l9013o2622M2050K9011k28394j18057l4748K8371J20655k64860l08092
14851e19866m862K45336L6098R2736r5517k27060K00423J76030K55450j6226j15653
$$ y = [-139305, -93365, -130138, -94223, -134284, -19194, -163199, -363142, -302665, -42164, 77001, -9758, -170959, -121075, -109785, -102890, 3006, -42994, -68244, -149997, -100598, 16125, 126172, 169867, 251267, 172103, 175354, 177633, 103914, 227341, 586810, 1027788, 1565293, 1907617, 1824613, 1730023, 1722500, 1894860, 1993247, 2212651, 1922691, 1548948, 1114400, 884391, 671492, 393813, 163915, 242741, 401152, 409731, 202167, 172465, 334057, 278140, -130041, -296210, -55762, -40189, 190083, 361305, 385552, 344425, 315833, 276820, 214198, 256248, 285259, 56865, -61192, -95940, -67569, 53086, -211774, -519866, -524728, -279392, -243294, -150558, -246075, -473135, -272712, -96682, 158768, 142542, 26889]
14840B6889M6628j2283j33360n6859K4727K12022M651M081Q2521M3497p2235o2402
14828A07877j75092o542P0327L57475k63359j70123L1622N8449J457j95266M083
14817a79092q9405p8028J08259k8508n808q034j27760J60879L32198p2884l60957
14806c49140k8669K03421M9633j02038j17640q2259o1685M9181L83756K99033
14796B43593Q7642j77296j48620p2771R3539J5074o2407K6501K1727j39865k34089
14785c46972n774J31634j17796P5967K09053K37100N5076k47941M0621J37586
14775A68554j9434m3752l5433j7199J09007j25399n888K35325l34872J04321L48808
14764C84038K1883L3258j06396l61376l27255L2086K46625J92055N2904J14339
$$ y = [26889, 73517, 61234, -72126, -128985, -104258, 107764, 112415, 116496, 199017, 242514, 170279, 107877, -67215, -73757, -3430, 354045, 90686, -79437, -47815, 10634, 12091, -183175, -179092, -268497, -346525, -238266, -266774, -272582, -280616, -408376, -247497, 84701, 11817, -349140, -377809, -174388, -124755, -226793, -344433, -426692, -488377, -439196, -55440, 243593, 331235, 153939, 5319, -67452, 26087, 41161, -21246, 5255, 26982, -112883, -346972, -352746, -221112, -338908, -262941, -53888, 183212, 238288, -9653, 30968, 168554, 149120, 105368, 69935, 52736, 161743, 36344, 30456, 265781, -69091, 35230, 384038, 405921, 439179, 332783, -28593, -355848, -323762, -77137, 114918, 167822, 282161]
14754B82161j9434r3498j66297n70416j84014Q6304L42917J39585o3741j98104
14744d44537p8220q1933L1379J62356J05126k7598J67587J59848M7120j40533
14734i9405P0103J09519k97781k16281J96723J68529J7715k45043j40003K36114
14724a99810j30122l7951K20986K07245M9044j17438n7393j4700P8431j1436j88259
14713b01403m5994k17489k03282K13328K71305J00654j39480O4938K7504l2537
14703a62456J37226N2738J03557J06438J10153k94596k8790N8823j43022q7574
14693a47503j98262O3825J27126K13151K80124J25666k13657l7793o8466P548
14683A51759n9080J13905J62075r9269j91817k32292J95264M3594j2472q0032
$$ y = [282161, 262727, 169229, 2932, -567484, -751498, -665194, -322277, -182692, -246433, -444537, -522757, -604690, -573311, -410955, -305829, -333427, -165840, -5992, 41128, -99405, -29302, 80217, -217564, -433845, -237122, -68593, -50878, -295921, -435924, -199810, -329932, -367883, -146897, 60348, 109392, -8046, -65439, -80139, -1708, -13144, -201403, -247397, -464886, -668168, -454840, -183535, -82881, -222361, -157423, -129919, -162456, -25230, 27508, 131065, 237503, 347656, 53060, 24270, 83093, -59929, -147503, -345765, -281940, -154814, 58337, 338461, 464127, 250470, 212677, 144211, 151759, 92679, 206584, 368659, 269390, 77573, -154719, 40545, 84139, 71667, -8365]
14673h365r5534l1035Q6444q5009J09066q485j81705K23065m1132r966M7322j63302
14661a58636k38156j46759m4149j6057K64364K36715K81338j63177k20530R2864
14651a12183j97171j17494J04357p3809K80640k7427l61308R2177K18076J35969
14641e8173N4338j72638j02612O1553m5742Q4614L4087L4619l4309r0792k02277
14630d37332q6991P5743O4102j6353M1538L5673K8870L776k6360J2563J34889
14619a69882l0639O7287O9389K9771p361J3458j91313l6623J01422J37224O0684
14608D3417Q2911j94634n8105J18996q579j24012j50535K0478J49594P8061J01896
14597E9488O5139j13887n0905j25296m2578P883R1339k38467k51247M5364Q7539
$$ y = [-8365, -103899, -134934, -48490, -133499, -24433, -32918, -214623, 8442, -32690, -42656, 4666, -158636, -396792, -543551, -587700, -603757, -339393, -102678, 178660, 15483, -205047, -112183, -309354, -426848, -322491, -396300, -115660, -143087, -504395, -412218, -194142, -58173, -3835, -176473, -279085, -217532, -263274, -178660, -144573, -109954, -144263, -235055, -437332, -524323, -448580, -384478, -400831, -359293, -323620, -294750, -290974, -317334, -304771, -169882, -200521, -133234, -63845, -34074, -41435, -27977, -219290, -255913, -154491, -17267, 43417, 126328, -68306, -126411, -7415, -15994, -140006, -290541, -270063, -120469, -42408, 59488, 124627, 10740, -40165, -165461, -208039, -200156, -108817, -347284, -598531, -553167, -465628]
14586d65628J98093Q5512J72951M7469j69646k05568q6305m7010m3360J14944
14576c98548Q7332O0288R6327r0505j11887P5052k56433j12853K45701L40197
14566f5329J57493J06567j04451j82364N7759l7901j31063p8360j92651j14220
14556e84520K4568M591L1564M29218J83261j18875j65137j26029j67197K6509
14546d62047K73641J59375J5179J0604J53864j70470r0372J21202J30269O9785
14536B11030j77585k24329r8213J15306J07581o1197k69805J12262o9407j64956
14526e19313J25339J4947j03251o4808j38955Q0338J76871L8621o3950m8934q8083
14515e91178o4954L14667l1065q3958J43025N1528l8447L586K87619J90244k65569
$$ y = [-465628, -267535, -182023, -9072, 38397, -131249, -336817, -423122, -470132, -513492, -398548, -311216, -250928, -154601, -245106, -356993, -281941, -538374, -651227, -405526, -65329, 92164, 198731, 94280, -88084, -30325, -68226, -199289, -277649, -470300, -584520, -559952, -555361, -523797, -94579, 88682, -30193, -195330, -321359, -488556, -462047, -188406, -29031, -13852, -3248, 150616, -19854, -110226, 10976, 141245, 211030, 33445, -190884, -289097, -173791, -66210, -127407, -397212, -284950, -354357, -519313, -393974, -379027, -482278, -547086, -686041, -605703, -428832, -390211, -454161, -503095, -591178, -656132, -341465, -372530, -456488, -313463, -261935, -300382, -296796, -9177, 181067, -84502]
14504h4502p3404J33171M2297j4603L1814l27425j22434J57805q9548r1088N5519
14493c82398P6668L13145K14245n1602n1212j08044J66805J26401l2458j35094
14483A36456o4800J28656O2185j85129o9203j55290J4490J48968J32258m5905
14473A02686j33599P9722J16696K2961j04919k74878n548J91872O7476j7981k44934
14462b00446J1681O7821N6561j07253J1233k20698N3631j64573M4113m1895l9483
14451e29308L14847R1889K0813L1280o493j0499K0644j51352Q2957J24761K02489
14440A92028j18255j00599k9115k3646J50126j39712k58869j76960O340J67505
14430c31157J14456J76842N8682P9038Q3196J77054j10061j29933j5082M4285
$$ y = [-84502, -157906, -24735, 17562, 2959, 34773, -292652, -415086, -257281, -346829, -437917, -382398, -305730, 7415, 221660, 170058, 118846, 10802, 177607, 304008, 271550, 136456, 71656, 200312, 262497, 77368, 8165, -147125, -132635, 16333, 148591, 102686, -30913, 48809, 165505, 188466, 83547, -191331, -196879, -5007, 62469, 44488, -200446, -188765, -120944, -64383, -171636, -160403, -381101, -327470, -492043, -447930, -489825, -529308, -214461, -122572, -101759, -70479, -76972, -87471, -66827, -218179, -135222, -10461, 192028, 73773, -26826, -55941, -79587, 70539, -69173, -328042, -505002, -498662, -331157, -216701, -39859, 18823, 97861, 181057, 358111, 248050, 118117, 103035, 147320]
14420A47320q7751k74464k32000K9403K68597J1308j32025K4472J05903K40090
14410A00853L74792l2464k8729j18997R7312J00273J11079N7499o1677j28483
14400D71458N0112l7699k63896J35010J37883M6506J0287o327K16726L21775K5450
14389A107285m0934m87257j83166K9114j48922J29915P5606o6236M7644J21284
14379E84333P6438J43745L6457n0427k92179j55067o0667j32397k44248p0015
14369a64027J43209L89407L28010K25011J03955r068j51494j84963k48998k5788
14359D05254P5463j6618j66249O0206M1641o1208J77367K32j89406j56005j38096
14348C2581k50403l2565K35234P4066M08368J07422K9760o3102l55593j40266
$$ y = [147320, 59569, -214895, -446895, -417492, -148895, -137587, -269612, -245140, -139237, 100853, 475645, 443181, 414452, 295455, 392767, 493040, 604119, 661618, 599941, 471458, 521570, 483871, 219975, 354985, 492868, 539374, 549661, 543334, 760060, 1081835, 1107285, 1066351, 579094, 395928, 425042, 276120, 406035, 481641, 415405, 463049, 584333, 660771, 804516, 840973, 790546, 498367, 343300, 282633, 150236, -94012, -164027, -20818, 368589, 696599, 921610, 1025565, 1016497, 865003, 680040, 431042, 405254, 480717, 464099, 297850, 358056, 399697, 338489, 515856, 516088, 326682, 170677, 32581, -217822, -250387, -15153, 58913, 467281, 574703, 604463, 541361, 185768, 45502]
14338D5502q0742J26285r5029Q1917J8655K186l1758j0589j67663n6638M1117
14327a26757R5676N6784O3863k5895j42465K4057K46942r0814l86019M1717M1759
14316b01152m5137N4907Q6162J94296J36736k23103r4070j32707o5183J53432
14306a35819K16261J29748m7068j29348j96802M0895p4616k3531J80830r3435
14296a32885j16813K39540J49390j52537M4930P4039j98114j02874J83737m2218
14286e3805p3175k12980J19924m1719j19438J33278r5076J67754j59080p6434
14276d10751J64479J77243J00033J6899l8554j7827n3816o9710M8310Q5953j5855
14265a3596J95592j45868j63960j65926j66412j63253J53985J03896J19553l2225
$$ y = [45502, -35240, 91045, -3984, 77933, 96588, 98774, 67016, 56427, -111236, -167874, -126757, -31081, 25703, 89566, 63671, -78794, -54737, 192205, 101391, -284628, -242911, -201152, -246289, -191382, -105220, 89076, 225812, 2709, -91361, -224068, -289251, -135819, 80442, 210190, 163122, 33774, -163028, -122133, -196749, -220280, -39450, -132885, -249698, -10158, 139232, -13305, 31625, 105664, -92450, -195324, -11587, -53805, -126980, -339960, -220036, -261755, -381193, -247915, -342991, -175237, -334317, -410751, -246272, -69029, 31004, 47903, 9349, -8478, -62294, -132004, -83694, 2259, -13596, 181996, 36128, -127832, -293758, -460170, -623423, -469438, -365542, -245989, -278214]
14255b78214o220j6725R0393Q7260o3685q0236J0096K4863j2208J83102K41160
14244A79586m3301J4241R5264R8879l05220l30610M0831r089j34283N5381K2347
14233c15974N6523J33006J17633J47809N4440j89055J46852M6848j36215j46637
14223h4770K5763o535M4029j89867p0355j20029k31777K74087L88504j53412K9092
14212i5270K04004r5449q7911N4046M0490J56288r7919L2816K2776j07721j69816
14201a43666M8572r5885j0031j43592P3388k33626j92790K31045L47293K7558
14191i1734r1507L7203j80291j43628p6988k8050j955M5106J56799j9326K10381
14180a83990m4947K7022J32268l837j9771k05528k46720L2581K55313J30930L4200
$$ y = [-278214, -284434, -301159, -210766, -123506, -187191, -267427, -257331, -232468, -244676, -61574, 179586, 136285, 150526, 245790, 344669, 39449, -291161, -250330, -259419, -393702, -338321, -315974, -259451, -126445, -8812, 138997, 193437, 4382, 151234, 198082, 61867, -84770, -59007, -65542, -21513, -211380, -281735, -401764, -633541, -359454, 29050, -124362, -95270, 108734, 13285, -74626, -20580, 19910, 176198, 78279, 111095, 133871, 26150, -143666, -95094, -190979, -201010, -344602, -271214, -504840, -697630, -466585, -119292, -91734, -183241, -146038, -326329, -469957, -546945, -574995, -576950, -531844, -375045, -394371, -183990, -228937, -201915, -69647, -73484, -93255, -298783, -545503, -512922, -257609, -126679, -92479]
14169i2479M1195J43377J73048o2963n1015p5693l13998p7604R0709L08101K30661
14158C13339J70531O2819r3996k51659j74322j80122o6551J5229p1515J25082
14148a51165J78511l0817R1127m0853n9274L3494P1938J16359k27632j17907O1977
14137g4242J70125k75388j21209j6324m2996L6693J53275J86136K6099m5772p3834
14126g7437O9430M4914p6908j30236k1630J92217J88848J7458j02145p6062k19368
14115a90919Q3557P9446J13601K68415K48387K8025m4726r1614m24628k93429
14105b23885L6652K09020k61929j44338J9322K6248N5582q0912J57071J30899
14095g6270k05512r995P2388m2925J46424R5843j57026n500n7296R180K42875
$$ y = [-92479, -51284, 92093, 265141, 202178, 151163, 75470, -238528, -316132, -225423, 82678, 313339, 483870, 546689, 452693, 201034, 26712, -153410, -219961, -204732, -276247, -151165, 27346, -3471, 87656, 46803, -12471, 21023, 92961, 209320, -18312, -136219, -74242, 95883, -179505, -300714, -317038, -360034, -323341, -170066, 16070, 42169, -3603, -77437, -8007, 36907, -40001, -170237, -191867, 350, 189198, 206656, 104511, 28449, -190919, -107362, -27916, 85685, 354100, 602487, 630512, 585786, 494172, 69544, -223885, -187233, 21787, -240142, -384480, -365158, -338910, -283328, -364240, -207169, -76270, -281782, -291777, -219389, -262314, -115890, -20047, -177073, -182573, -239869, -230689, 12186]
14084A2186j45120o7306J4818o3739j16664k05159L31881L77739J6405j5440j93964
14073e4363l24685n0402R2435K091J8785o0550J9887J27333J14179J93995L392
14062H2097j77467k07568k20526O8484J0764J84001m4938j7054K42700N5329l5172
14051e9350n4574j90059O6577j36465j69524P2607n250q2205J54448K83209R7561
14040b3025J5477J04317L1641l13974o0031J19887J70615j36592j82382K08160
14030f5907J78863m8887k95707J56602K68737q1370j01755j50603n2391L12962
14020A20544J39734j42019k39359p182K12120N9884k49724m0476j9065j64070
14010c29613k51445k7406K49042J06846P6757j97136M499j2487j17972K7124J79346
$$ y = [12186, -132934, -200240, -185422, -249161, -365825, -570984, -239103, 138636, 155041, 139601, -54363, -379048, -429450, -337015, -334924, -316139, -376689, -356802, -229469, -115290, 78705, 82097, -95370, -302938, -523464, -454980, -444216, -260215, -305153, -322207, -79507, -24178, -59350, -113924, -303983, -237406, -373871, -543395, -470788, -476038, -558243, -403795, -120586, -23025, -7548, 96769, 128410, -185564, -245595, -125708, 44907, -91685, -274067, -65907, 112956, 64069, -231638, -75036, 193701, 112331, 10576, -140027, -192418, 120544, 260278, 118259, -121100, -128282, 83838, 143722, -106002, -146478, -165543, -329613, -581058, -608464, -359422, -252576, -175819, -372955, -368456, -380943, -498915, -471791, -292445]
13999b92445J83838k92461k35657q6331J25332P7973L3749P1949L00906m1049
13989a54196j9758j81285m50209Q596M06539O3174n6207K6571k6698L0515K90457
13978f2501J3295k27854k01032Q2315Q3451k742j0514j46446J44095K5877l02347
13967f04403O8005P3488J5335Q0328o1172j31801J44740K20741L5724k43855j35043
13956e37913M8002J41565J94022K0149r981J0334n3223Q0598N4173k0018m2550
13945a14842j10375k32532J17426L19652K27067K7067j94767j28838J50175Q064
13935F8097j78206M2925J06547o9049P0460Q7624L1391J5782M7951J90505k257
13924D11770j98799q2986J98698J40091J14925j64410k16873K1438Q5915p9702
$$ y = [-292445, -108607, -401068, -636725, -723056, -597724, -519751, -486002, -414053, -113147, -154196, -173954, -355239, -805448, -796852, -390313, -327139, -383346, -356775, -383473, -352958, -62501, -49206, -277060, -478092, -395777, -312326, -315068, -325582, -472028, -327933, -302056, -604403, -536398, -462910, -447575, -367247, -428419, -560220, -415480, -194739, -159015, -402870, -537913, -489911, -348346, -154324, -134175, -144156, -133822, -187045, -106447, -52274, -72292, -114842, -225217, -457749, -340323, -20671, 206396, 233463, 38696, -90142, 60033, 68097, -110109, -67184, 39363, -29686, 40774, 128398, 159789, 175571, 223522, 414027, 411770, 212971, 129985, 328683, 468774, 583699, 419289, 202416, 223854, 309769, 230067]
13914B30067p5139L6624j78531M0650K95098L284l38341q5195P0505P6662J68521
13903B44205R7712J14902j28819j25495l6256k00728j39639n3477R5168J7784
13893a14643J22424m2259O0768J03349n9309J91219J90327M6470k40660p8836
13883A78850K60754p0961Q2107L57009J16916J9216J41572J24352J58427K4470
13873A392712m4487j80529J7093J07031J31020K9523J51865J54973J35685M12730
13863B307616M11102J38190j63524l29242O3990M59968J77366j0858J73511L66072
13853C594191K83035L21173K43540K10049N54606O41516P25192J053757J242499
13844H869558J571940K242738K853812M175226O383630J0247952J5898232K1722310
$$ y = [230067, 154928, 191552, 13021, 53671, 348769, 352053, 13712, -71483, -978, 75684, 244205, 341917, 456819, 328000, 202505, 166249, -34479, -174118, -227595, -132427, -114643, 7781, -34478, 26290, 129639, 70330, 261549, 451876, 498346, 257686, 178850, 439604, 368643, 450750, 807759, 924675, 943891, 1085463, 1209815, 1368242, 1392712, 1348225, 1167696, 1184789, 1291820, 1422840, 1452363, 1604228, 1759201, 1894886, 2307616, 2718718, 2856908, 2693384, 2364142, 2428132, 2888100, 3065466, 3054608, 3228119, 3594191, 3877226, 4198399, 4441939, 4651988, 5206594, 5848110, 6573302, 7627059, 8869558, 10441498, 12684236, 15538048, 19713274, 26096904, 36344856, 52243088, 73965398]
13836G3965398K4414258K2076776J2016626l474917j6460390k1199600j7296423
13829G4041728j0132570l888616J759799Q423624J5545716K0953434K2378352
13822A29081467J7105570L937451j1659052k2380037k2956166j6545794r846157
13815F6737282m614086k76694M043979R352277J5959908K1417324K2437803J7098274
13807A52156067L712510j1642936k1816177k2289333j5382758q010426k070127
13800G4656820M192860J1122776J7630674K1322474K0052758J1094382m506897
13793A55565847j8873588k5559349k2748708j6241923j0589395p465988n140961
13786D8945935m117024l078731k506216k268856j881030j694019j586838j278789
$$ y = [73965398, 98379656, 120456432, 132473058, 128998141, 112537751, 91338151, 74041728, 63909158, 60020542, 61780341, 70203965, 85749681, 106703115, 129081467, 146187037, 150124488, 138465436, 116085399, 93129233, 76583439, 66737282, 62123196, 61846502, 65890481, 75242758, 91202666, 112619990, 135057793, 152156067, 155868577, 144225641, 122409464, 100120131, 84737373, 76726947, 74656820, 78849680, 89972456, 107603130, 128925604, 148978362, 160072744, 155565847, 136692259, 111132910, 88384202, 72142279, 61552884, 54086896, 48945935, 44828911, 41750180, 39243964, 36975108, 35094078, 33400059, 31813221, 30534432]
13778C0534432j505017j166886r04041j351270j222139r65493j057720r48681
13770B1413185o91457m65852l51532m57650m33480l06538n91230m88730n29490
13761A7097226n30028o45912n75971m34567o77192j48684k63234m24752m11349
13752A2985537k92796k52287k69753k78260o4627k18390m75896n43096n67180
13743A0023252k93290k68997p4518M4186k58885l70852j58242l53270k59860j290
13733H028234l65284l30631q6978k36790l01099k44530j60567J63973O806j6516
13723F456618k52826k88213j38478O0120k19292l87502k78688O1475j33096P2746
13713D952864m528M5252j71501M80q946k48677k19942j15538j31544j727r5739
$$ y = [30534432, 29029415, 27862529, 26958488, 25607218, 24385079, 23419586, 22361866, 21413185, 20721728, 20255876, 19904344, 19446694, 19013214, 18706676, 18115446, 17626716, 17097226, 16567198, 15921286, 15345315, 14910748, 14233556, 14084872, 13821638, 13396886, 12985537, 12692741, 12440454, 12170701, 11892441, 11827814, 11609424, 11133528, 10590432, 10023252, 9729962, 9460965, 9386447, 9430633, 9171748, 8800896, 8642654, 8289384, 8029524, 8028234, 7662950, 7332319, 7245341, 7008551, 6707452, 6462922, 6302355, 6466328, 6473134, 6456618, 6203792, 5915579, 5777101, 5837221, 5617929, 5230427, 4951739, 5013214, 4880118, 4952864, 4948336, 4993588, 4822087, 4822567, 4813621, 4564944, 4345002, 4229464, 4097920, 4096193, 4000454]
13702D000454k93055j51143R0494M1148j48427l7596R715K8700j59657o7906l6415
13691C276312j83239o154k36501j18252m2407j15504q7553r1140J8810N3088J31825
13680B599285N8242o4239j09739J6850J94066n2301k53558k85374j0695M7770
13670B140307j10745K840m7439L3574p3779j12504o9075p9876j67095M0255J25301
13659A681764J17276m5576M8704J89695J46127m3088p2020j31620j72915L76610
13649B094957L63797j94522m6280j08095j15040o286l1070j35937K2456R717P072
13638A860769L4047n3243l83616j95373J38594N2655J12256o4968j27267K59436
13628A633290J46231J1930P0237P1609o6770j06781k2740J32713L1261j79109
$$ y = [4000454, 3707399, 3556256, 3646750, 3687898, 3539471, 3501875, 3511590, 3540290, 3380633, 3312727, 3276312, 3093073, 3086919, 2850418, 2732166, 2689759, 2574255, 2486702, 2395562, 2414372, 2467460, 2599285, 2657527, 2593288, 2483549, 2500399, 2694465, 2642164, 2388606, 2103232, 2092537, 2140307, 2029562, 2032402, 1984963, 2018537, 1944758, 1832254, 1763179, 1683303, 1516208, 1556463, 1681764, 1799040, 1753464, 1802168, 1991863, 2137990, 2094902, 2022882, 1891262, 1718347, 2094957, 2458754, 2264232, 2217952, 2109857, 1994817, 1988531, 1957461, 1821524, 1843980, 1853697, 1860769, 1894816, 1841573, 1457957, 1262584, 1401178, 1453833, 1566089, 1501121, 1373854, 1633290, 1779521, 1791451, 1861688, 1933297, 1866527, 1759746, 1737006, 1869719, 1900980, 1721871]
13618A721871P4634j48393m2189K0354n2806K8069K75094K65575J24697j58185
13608B108721k95979j27557j29064Q9589N1060L67M9693N5819M0563L042K1231
13597A867485n9958j60425K6238j49016k07893M6318P6877J29279q5495j69809
13587A313601M6796j03725J01060L459l2720k08785L441J94939K48373M8587k53581
13576A361445j13069m5305j38978k17071J08657L03452J3036J03062j50586k5267
13566A199376q337m7006k54445m3795j2696n7353q6507j24986K29604J90752K55788
13555A240395J6699k10278o9411O1165R9293K4160q9239K05542J65982l3290k21118
13544A189900k60660n0845M014j1590j0837K620K33691k47116Q3026P3779K00090
$$ y = [1721871, 1796505, 1648112, 1605923, 1626277, 1573471, 1601540, 1876634, 2142209, 2266906, 2108721, 1812742, 1685185, 1556121, 1645710, 1696770, 1697137, 1746830, 1802649, 1843212, 1846254, 1867485, 1807527, 1647102, 1673340, 1524324, 1316431, 1362749, 1439626, 1568905, 1483410, 1313601, 1360397, 1256672, 1357732, 1361191, 1328471, 1119686, 1123127, 1318066, 1566439, 1615026, 1361445, 1248376, 1203071, 1064093, 847022, 955679, 1259131, 1272167, 1375229, 1224643, 1199376, 1191039, 1144033, 889588, 845793, 833097, 775744, 689237, 564251, 793855, 984607, 1240395, 1257094, 1046816, 977405, 1038570, 1137863, 1162023, 1072784, 1278326, 1444308, 1411018, 1189900, 929240, 878395, 882409, 870819, 859982, 862602, 1096293, 849177, 932203, 1005982, 1206072]
13533A206072q431j31873n5869j84672q5568J33505J45708l3740K29066J32261
13523A346459L1495j75260K10400J34897p9763j2550m0463J37283o6854J56739
13513A642383r7494k37874k09096p8646j1902L0973o5965J34381K01630k2007
13503A286383M7906j49492K7110m0515m0831k11691J304O9210j08922L4422L3000
13492I47884J67992J65271L12234J18403m075j49687k7487J47681k9371j49171
13482A499674k85481O6775n1071n4837j10490k4563J03014J6103K52554j29970
13472A281708k39739j046K37817m2089q4453l59710k44971j53448P0706J56095
13462F20870J64134J32964K419q5760J22638L0105j00567j9263K30429J05146
$$ y = [1206072, 1197641, 1065768, 1009899, 825227, 739659, 873164, 1018872, 985132, 1214198, 1346459, 1377954, 1202694, 1413094, 1547991, 1468228, 1455678, 1415215, 1552498, 1485644, 1642383, 1544889, 1307015, 1097919, 1019273, 1007371, 1038344, 972379, 1106760, 1308390, 1286383, 1334289, 1184797, 1211907, 1171392, 1130561, 918870, 920174, 989384, 880462, 914884, 947884, 1115876, 1281147, 1593381, 1711784, 1707709, 1558022, 1530535, 1678216, 1648845, 1499674, 1214193, 1280968, 1229897, 1175060, 1064570, 1040007, 1143021, 1159124, 1411678, 1281708, 1041969, 1040923, 1278740, 1236651, 1152198, 792488, 547517, 394069, 464775, 620870, 785004, 917968, 920387, 834627, 957265, 987370, 886803, 867540, 1097969, 1203115]
13452A203115q6258K70581R032k44106j13438j12418j553j29169P4038L4837J0607
13441I15268j87007l24446l4529J21316k9274n4395J32120L9560J37933J18411
13431H34957o3378j66191j02881J66896L0784j80050p785k94074K1100L05082
13421E44460K42567o6283j71951j08693J57903r2331L069K59218L3019k1951l2013
13410G47014J19491j99298m4470R7055N7829k4695R3406J12093l10128l23079
13400C25218K12387P3527K75257l4425k2992p1464k9012p1196J42003j09053j27654
13389E62596m9568J39443K07553j48555q8076J1264K49870J75147o4553p5065
13379I20056j33700N3054o6212J53207r5970Q9025K577k64815k54603J84472K21496
$$ y = [1203115, 1116857, 1387438, 1396470, 1152364, 1038926, 926508, 924955, 795786, 869824, 904661, 915268, 728261, 403815, 369286, 490602, 461328, 406933, 539053, 578613, 716546, 834957, 771579, 605388, 502507, 669403, 700187, 520137, 512352, 218278, 239378, 544460, 787027, 720744, 548793, 440100, 598003, 505672, 508741, 767959, 800978, 779027, 747014, 866505, 667207, 622737, 719792, 777621, 752926, 846332, 958425, 648297, 325218, 537605, 611132, 886389, 851964, 828972, 757508, 728496, 657300, 799303, 690250, 562596, 513028, 652471, 860024, 711469, 623393, 634657, 884527, 1059674, 995121, 920056, 786356, 839410, 773198, 926405, 830435, 919460, 922037, 657222, 402619, 587091, 808587]
13368H08587j6487j59877n3501j64635J08887Q831r3898r7860j41418o9558n1112
13357G7959L8559n807J25966M1721J7953m7581j35558j47302k3951j39003R3458
13346a03586J76076L23295K76374k853j75030K15496r710r5661k5304R9216L3272
13335G11585r5934o6055j84035K7457P2599p2039J89381O8768p6568J45944q789
13324G12314L6988J43888n8123j55566l25572j31794j41002j47439J46570J60840
13314B41104N6063j49928n5584J89187L29887l5500k12986n334M1592K6096Q5819
13303E10416l83065r1465j31824J50974Q9337L15821m0030j19165m5556P1459
13293C26902N3338k6324J17533J05746j3680j31311K7419j05548j82707J88845
$$ y = [808587, 792100, 632223, 578722, 414087, 522974, 531805, 437907, 340047, 198629, 129071, 77959, 116518, 110711, 236677, 278398, 296351, 248770, 113212, -34090, -58041, -197044, -103586, 72490, 395785, 672159, 669306, 494276, 709772, 700062, 604401, 579097, 678313, 711585, 615651, 549596, 365561, 393018, 465617, 393578, 582959, 651727, 575159, 721103, 712314, 749302, 893190, 835067, 679501, 353929, 222135, 81133, -66306, 80264, 241104, 297167, 147239, 91655, 280842, 610729, 575229, 362243, 356909, 398501, 424597, 510416, 127351, 35886, -95938, 55036, 144373, 460194, 420164, 300999, 255443, 326902, 380240, 353916, 471449, 577195, 563515, 432204, 459623, 354075, 171368, 360213]
13283C60213J45797J04509k4333j6041J01571p2903n4509p9757K07032P5946m3962
13272G03563k57615M1685J1951r4327R3121M9734m7748O4950k4801m079j96593
13261C39841j26660O9710L32412L75396k28501k89319J56586P4977j13999J49273
13251G39716k83576j65494J01705J93554j23560K20591J66591J02361J06580m6467
13241A012001J88897j16966l91444k08191L1997K1458j89000J33077K1279L5794
13231E38902J62297J75691j06920o6874r5597J72587j24210j54457m5444L9691
13221D95666K22200K35944j15244n4710m218k01600r7884R136k68556q0107Q6347
13210B26974j08316o3283P3825J29840o9670k21165q8934k1945J12452j12547
$$ y = [360213, 506010, 610519, 586186, 570145, 671716, 598813, 544304, 464547, 671579, 747525, 703563, 445948, 487633, 499584, 405257, 498378, 548112, 500364, 565314, 540513, 536434, 339841, 213181, 282891, 615303, 990699, 762198, 472879, 629465, 704442, 590443, 739716, 456140, 290646, 392351, 585905, 462345, 682936, 849527, 951888, 1058468, 1012001, 1200898, 1083932, 692488, 484297, 516294, 537752, 348752, 481829, 503108, 538902, 701199, 876890, 769970, 703096, 607499, 780086, 655876, 501419, 455975, 495666, 717866, 953810, 838566, 783856, 779638, 578038, 480154, 489290, 220734, 140627, 226974, 118658, 55375, 129200, 259040, 189370, -31795, -120729, -142674, -30222, -142769]
13200a42769k20125p6728J76827J10898J10828K3427J91405K17235j30001k44960
13190A6037j20854n3935J43962N1380J2524j01945Q575J27103J09709K07486k34954
13179A65088k52851M2641k26089l6895K78955Q6880K3826L0487k33899R0127J06030
13168G4300M4513O918R651J06257p830p5440J37525p8875q6220M7438Q6761l32195
13156f7197q0388K53097J41059j57952p3286n1556K4349J35361p9428l6798L2059
13145C9320L6252k26838p8515n0374J07485J63496p7413M2647N2039N12j69104
13134a60493l04891K09160K69196K68594m118m0888j35704k07321J1191j06185
13124b01459p9887o0747N3605m3281k14496K12587J15306J88104J81306n8465
$$ y = [-142769, -362894, -439622, -262795, -151897, -41069, -17642, 173763, 390998, 260997, 16037, -104817, -158752, -14790, 36590, 49114, -52831, -44256, 82847, 192556, 400042, 165088, -87763, -45122, -271211, -308106, -29151, 57729, 81555, 112042, -121857, -31730, 74300, 118813, 125731, 135382, 241639, 233809, 158369, 295894, 217019, 130799, 178237, 264998, -67197, -147585, 105512, 246571, 88619, 15333, -36223, -11874, 123487, 44059, 7261, 39320, 75572, -151266, -229781, -280155, -172670, -9174, -86587, -43940, 8099, 8611, -160493, -465384, -256224, 12972, 281566, 277448, 236560, 100856, -106465, -95274, -201459, -281346, -342093, -288488, -331769, -546265, -333678, -218372, -30268, 151038, 92573]
13114I2573R5619J56041j97416j06272p2729l9472m601J89543J65282K5743k13762
13103I0549j55315J08943J05207p83k24141k21143l73J38387L15170P6471n2976
13092A79996R222N328j87155L2669k4952o9087K05928j21210j64882J1337L7797
13081h5009K75114K45048l6792j43543k5441j47051K21173P404j12552j80748
13071A7603n2235l5229K12869J18784J46993k16093l08059k7850K51296Q2976
13061A91055L9321j66129j32312R6938m5335j28953p6701M1585j3123J59487K3385
13050a0782j11905P2427j0842j14837j9492J63795j45796p4536J61301J98628
13040A07961p4240n0572j59381k00690J91270k4356Q9923j1902k9715P1812P7500
$$ y = [92573, 188192, 344233, 146817, 40545, -32184, -71656, -76257, 113286, 278568, 304311, 90549, -64766, 44177, 149384, 148601, -75540, -296683, -297056, -158669, 156501, 232972, 179996, 189218, 194546, 7391, 40060, 15108, -53979, 151949, 30739, -134143, -122806, -85009, 190105, 435153, 398361, 254818, 229377, 82326, 303499, 310903, 198351, 17603, -34632, -69861, 143008, 261792, 408785, 192692, -115367, -143217, 108079, 191055, 230376, 64247, -68065, 28873, -16462, -145415, -222116, -180531, -193654, -34167, -10782, -122687, -50260, -61102, -175939, -195431, -31636, -177432, -251968, -90667, 107961, 33721, -16851, -176232, -376922, -185652, -210008, -120085, -131987, -161702, -89890, -12390]
13029a2390l41757J10414M00592M044K6541l02060J3422J1514Q0766k4593N6515
13018B3008R1483J34839K57418K58608p1446j17878j71929J09855k2733J05157
13008E96382o9293q5481j39454J01823L9710L32597L48564J9268k13323k95238
12998F35555j99022j26167J89587j28526p0177n5157j70351r9212j0866J95297
12988A60961J79640J52392N249j8105K26138J39316J54705P1642r5364k31151
12978G45423N2696P9005j8765J08321J85180K40269K8598m2200k88495l87488
12968G02544j03632J07025j36919k15754M6767K31660j50143k33675k7140J99918
12958D20651J5781k81367j54790j58198J01548j3187J66319O0971q962P0909J77469
$$ y = [-12390, -354147, -243733, 156859, 160903, 187444, -114616, -101194, -89680, -8914, -33507, 23008, 114491, 249330, 506748, 765356, 693910, 576032, 404103, 513958, 491225, 596382, 527089, 441608, 302154, 403977, 443687, 776284, 1124848, 1144116, 930793, 635555, 436533, 310366, 499953, 371427, 301250, 246093, 75742, -23470, -34336, 160961, 340601, 492993, 498242, 480137, 706275, 845591, 1000296, 1071938, 976574, 745423, 798119, 877124, 858359, 966680, 1151860, 1392129, 1420727, 1378527, 1090032, 702544, 598912, 705937, 569018, 353264, 400031, 631691, 481548, 247873, 220733, 420651, 436432, 155065, 275, -157923, -56375, -69562, 96757, 157728, 148766, 219675, 397144]
12947C97144j03410j83727j12872K5583M9539J33416j00886n119J31360P3716
12937C04744k16946j74258L4959J73095K71651P5252Q1788K88254J04535o205
12927I36869K22505L03422j25193p5812q2669k78256l16662r0777r0993j83095
12917B19339j36709M1805o3942l11085L98780M04940q3907p6422k50849j73543
12907c1593J13233P8839j70136j12982j2337P5956K53945K4965k16178j59172
12897a55460j7043J47175J24273j03719M8180J12832L17377N289k02846k72000
12887D058k1067K04099N6512j51128l4235r9722N4594K16908K4155j27412k6352
12876A00410j84063j03559L21047J41767l7106l9980j08650k6049J00177K06979
$$ y = [397144, 293734, 110007, -2865, 22718, 72257, 205673, 104787, 99668, 231028, 304744, 87798, -86460, -51501, 121594, 393245, 468497, 550285, 838539, 943074, 936869, 1159374, 1462796, 1337603, 1261791, 1179122, 900866, 584204, 493427, 402434, 219339, 82630, 124435, 60493, -250592, 148188, 553128, 469221, 392799, 141950, -31593, 81640, 160479, -9657, -122639, -134976, -59020, 194925, 219890, 3712, -155460, -172503, -25328, 98945, -4774, 43406, 156238, 473615, 478904, 276058, 4058, -17009, 187090, 243602, 92474, 58239, -41483, 13111, 230019, 254174, 126762, 100410, -83653, -187212, 133835, 275602, 238496, 198516, 89866, 63817, 163994, 370973]
12866C70973k97410k20463k58852j36067O9233R8862J64477L24959n0137k19994
12856a54419o982J39412P2800j38957J83687Q0652k37361J06793L8563P9677K32300
12845C96165q6574k14718Q0301J12419J66165j7312q7404K99378r098k62794k83846
12834I2682k19087J79402J34604k8570K43738K4152r0922P0119J3811j89399q8479
12823A42051j31146O3422J91063N9965k49465j43127j15176J7557K71017K47998
12813C54159J46190N120J6017J18638l11253q0249P0509j14055j73280J48929
12803A80725k1583K7793J90615R129k65144m3101K5437o9286M7899J89957J98277
12792D70718K25683o9622k01957K3464K6336Q1561K73557l7603k47579j82691
$$ y = [370973, 73563, -146900, -405752, -541819, -472586, -373724, -209247, 115712, 65575, -154419, -161401, -21989, 50811, -88146, 95541, 176193, -61168, 45625, 84188, 163865, 396165, 309591, 94873, 175174, 287593, 453758, 436446, 349042, 648420, 639322, 376528, 92682, -126405, 52997, 187601, 159031, 402769, 426921, 335999, 406118, 419929, 230530, 142051, 10905, 74327, 265390, 325355, 75890, -67237, -182413, -164856, 106161, 354159, 500349, 505469, 521486, 640124, 328871, 248622, 319131, 205076, 31796, 180725, 159142, 186935, 377550, 386679, 121535, 78434, 103871, 34585, 82484, 272441, 470718, 696401, 626779, 424822, 448286, 474622, 556183, 829740, 792137, 544558, 361867]
12782C61867K172K62449J8092n3711K7004N6202L5837p1660k01842N0956j42015
12771C45351j28237n5659j30051P9892J41659Q1816N9493n1772J0688R464j5086
12760C47558J7868n9241j25054k143j48573j01310j85442k2275K6500Q0424J33949
12749c7739O7368J27338l29624q680K75939K09408r6347k79464J56082R9523k09627
12738b5823q4682J9485k80921j34150j34441k986K64268O4336L6849J23880K42941
12727H8756J27101j02767J20630j17130k27101j48863R0346J49955p9013O5907
12717c2179R5861j61036j33528R6527J78926j36841j54521Q0223K23206j07939
12707e1301k58776k66296K41500K34603J08902j5818j05868J90858N5272j48767
$$ y = [361867, 364039, 626488, 644580, 590869, 617873, 674075, 709912, 638252, 436410, 487366, 345351, 217114, 161455, 31404, 111296, 252955, 334771, 394264, 342492, 353180, 362644, 347558, 365426, 306185, 181131, 178988, 30415, -70895, -256337, -278612, -252112, -171688, -37739, 29629, 156967, -172657, -181337, 94602, 304010, 207663, -71801, 84281, 183804, -25823, -110505, -91020, -371941, -506091, -640532, -643518, -379250, -314914, -278065, -154185, 88756, 215857, 113090, 233720, 116590, -110511, -259374, -169028, -19073, -98086, -32179, 63682, -97354, -230882, -134355, 44571, -92270, -246791, -166568, 56638, -51301, -310077, -576373, -334873, -100270, 8632, -7186, -113054, 77804, 133076, -15691]
12697a5691J07613O4153N7J9066k5715k79278Q7560K87611L1834k28735L098J89762
12685B41335K7203l35983p8523J4588K81378R0472J00666k75944l17824k05662
12675d58294J23138K90966j60025J42730R4745J17699M755k26467q7955J57029
12665a679j38778n3475K32358K66022Q0822o7469q6235j89168m8303j65858j14379
12654b86142P7669K43527K80244j73490j96557P4701j5692Q2818K72036N14497
12644H73611M25060L36333K06845n5746l53420m42366l38428o8575j32599r5979
12634C54736O1606N8240N8941k6912o5818l3532j74747J980k24060N8202M6457
12623A15093l7826K48888k13483P6284J47437Q4634R4270L4662K6718M6770K8954
$$ y = [-15691, 91922, 156075, 156132, 175198, 149483, -129795, -42235, 245376, 277210, 48475, 51573, 241335, 268538, -67445, -145968, -131380, 149998, 240470, 341136, 65192, -252632, -458294, -335156, -44190, -204215, -61485, 33260, 150959, 155714, -70753, -158708, -1679, -140457, -193932, 38426, 304448, 385270, 317801, 231566, 42398, -5905, -171763, -286142, -208473, 35054, 315298, 141808, -54749, 19952, 4260, 87078, 359114, 873611, 1298671, 1635004, 1841849, 1786103, 1432683, 990317, 651889, 583314, 450715, 354736, 416342, 474582, 533523, 506611, 440793, 407261, 232514, 234494, 10434, 68636, 115093, 77267, 326155, 112672, 188956, 336393, 421027, 515297, 549959, 576677, 623447, 652401]
12612F52401j62303j09754r5108P1226J41640K02486n1417L0224j37664N4628
12602E96359K22865K89623n2695Q0318L32331K53138K94827J78480K16969L80704
12592B792919L30335N28751N78929J93725k11496o66771p26474p80888k92443
12583A746587j23250k00412l8745o9850j98555j84753o5306k29806l33125j23250
12573A79535J37679P8531J51152j43672L2093J22265K01490K95022l02151m51403
12563C00541j00581M1441M6130j27749k1717J93870K09907Q5541j08066m6946
12553D72371O9707R2785Q8j22244J38622J97916K95769N20560M81350K59129J92828
12542B598881K5444n33487m55245m02193m3253L5850k30263j22264k65280p6401
$$ y = [652401, 490098, 380344, 285236, 356462, 498102, 700588, 649171, 679395, 541731, 596359, 819224, 1108847, 1056152, 1136470, 1468801, 1721939, 2016766, 2195246, 2412215, 2792919, 3123254, 3652005, 4230934, 4424659, 4213163, 3546392, 2819918, 2039030, 1746587, 1623337, 1422925, 1384180, 1314330, 1115775, 931022, 865716, 635910, 302785, 179535, 317214, 395745, 546897, 403225, 435318, 557583, 759073, 1054095, 751944, 300541, 199960, 241401, 287531, 159782, 138065, 331935, 541842, 627383, 519317, 472371, 542078, 634863, 634951, 512707, 651329, 849245, 1145014, 1665574, 2146924, 2406053, 2598881, 2624325, 2090838, 1635593, 1233400, 1190147, 1225997, 995734, 873470, 608190, 531789]
12532E31789l1002K15783J6510k49245K05497M3110l7961p6757P1410m6804p3407
12521E68923j35838j39860N2047k9287J34871K4289n9299K7221K81616J28593
12511H53276l1537M13759L95275K10693L79939R19612Q03721Q59775M91272m39236
12501D856549j043802r83825p42665n02805j23617J82299J42517R8498l4276J93637
12491B042510P641J35379J89330K29514J72349K56114L91910L67446L17148J36496
12481D245837J43828K66086L17878L09036J98826L31258L27372O15975J442322
12472H198418J600769K332367L280054N086301R226522J5330188K1444706K6320191
12464I2819516K6742008J9424630R387434J103170p54037K300398N079390K21953
$$ y = [531789, 500787, 716570, 733080, 483835, 689332, 732442, 694481, 617724, 689134, 642330, 568923, 433085, 293225, 345272, 315985, 450856, 475145, 415846, 443067, 724683, 853276, 821739, 1235498, 1630773, 1841466, 2221405, 3141017, 3944738, 4804513, 5295785, 4856549, 3812747, 2828922, 2086257, 1583452, 1459835, 1642134, 1784651, 1883149, 1848873, 2042510, 2050151, 2185530, 2374860, 2604374, 2776723, 3032837, 3424747, 3792193, 4109341, 4245837, 4389665, 4655751, 4973629, 5282665, 5481491, 5812749, 6140121, 6756096, 8198418, 9799187, 12131554, 15411608, 20497909, 29724431, 45054619, 66499325, 92819516, 119561524, 138986154, 148373588, 149476758, 148722721, 151023119, 156102509, 156324462]
12456A56324462j0239610k0989133k5137030k3169728j5956489r587589o401920
12449D4842963m640050l844828l054697l020085k370843j707913j821184j312199
12441B3071164j123941j006209q51549o77494m76168m68605l87711l48710j69003
12432A7561774l9243k45613q8623j39274k21239J35148K14229K51155N35744N26385
12422A8490443M21848O44244J105279J948548L299435N384177R209837J5865559
12414E6369370K4152288L1300746L5307374L0485853J8479348N903608j533128
12407B00465459n66372M052718L930233n824993k0953230l1461213l3179713k6654592
12399H9808297j6610878j0065870o739881m871952m111943l553734l171740k530937
$$ y = [156324462, 146084852, 125095719, 99958689, 76788961, 60832472, 51244883, 44842963, 40202913, 36358085, 33303388, 30283303, 27912460, 26204547, 24383363, 23071164, 21947223, 20941014, 20089465, 19411971, 18935803, 18467198, 18079487, 17730777, 17561774, 17522531, 17276918, 17188295, 17049021, 16827782, 16962930, 17177159, 17428314, 17964058, 18490443, 18912291, 19556535, 20661814, 22610362, 25909797, 31293974, 40503811, 56369370, 80521658, 111822404, 147129778, 177615631, 196094979, 201998587, 200465459, 199899087, 203951805, 207882038, 202057045, 181103815, 149642602, 116462889, 89808297, 73197419, 63131549, 56391668, 51519716, 47407773, 43854039, 40682299, 38151362]
12391C8151362k278497j977837j608707j658311j702202j373665j285401j407974
12383B4858768r21787p98999p07611p28861p12935n73946o49244n10159n92875
12374A8662351o24262l25193l17356k75871m51050o12023q43784o79632l35166
12365A4198014l68676l00845k22048l39716j95337K39317P7825p0154l08242l39565
12355A2370573k47803j10443k16868N5360O0024k72632J21871J84825k31578m57043
12345A1256286k72816o1034k53020M9931J51213L04306Q6469K28470K19427O48045
12335A2357277P00412N11032P87891R68662K004325L264475N139384R239022J5709404
12326E0681884K2255955K6894393K6202490J5576288m37416j5895931k3457179
$$ y = [38151362, 35872865, 33895028, 32286321, 30628010, 28925808, 27552143, 26266742, 24858768, 23936981, 23137982, 22430371, 21701510, 20988575, 20414629, 19765385, 19255226, 18662351, 18038089, 17712896, 17395540, 17119669, 16668619, 16056596, 15212812, 14533180, 14198014, 13829338, 13528493, 13306445, 12966729, 12771392, 13010709, 13088534, 13018380, 12710138, 12370573, 12122770, 12012327, 11795459, 11850819, 11910843, 11638211, 11760082, 11944907, 11713329, 11256286, 10983470, 10922436, 10669416, 10719347, 10870560, 11174866, 11261335, 11489805, 11709232, 12357277, 13057689, 13568721, 14356612, 15325274, 17329599, 20594074, 25733458, 34972480, 50681884, 72937839, 99832232, 126034722, 141611010, 141173594, 125277663, 101820484]
12319A01820484k3506023j5945903p075462K3572P710624J5537337K1801440K5678819
12311A26044888K0852192P097502r207832k2230199k6541286k3671124j5702764
12304E6641377r326873n767684l743001k903546k032374j545583j432411q96295
12296B8993610q67744j121321j279041j339283r54106r59059n80229n01556m23626
12287B0967645k1575k1548L01675J61492Q1839J73318K45240J177999K354340
12278B5420425L740579N886820J0072330J6859284K3903272K9103030K8926633
12271A43912373J7654204O20708j6897736k6374546k6457013j8339428q359156
12264F5759406m5426P738585J6213964K3385242K7325636K2836938Q797163q557169
$$ y = [101820484, 78314461, 62368558, 55293096, 55316668, 63027292, 78564629, 100366069, 126044888, 146897080, 153994582, 144786750, 122556551, 96015265, 72344141, 56641377, 47314504, 41546820, 37803819, 34900273, 32867899, 31322316, 29889905, 28993610, 28125866, 27004545, 25725504, 24386221, 23432115, 22473056, 21892827, 21391271, 20967645, 20946070, 20924522, 21226197, 21387689, 21469528, 21642846, 21888086, 23066085, 25420425, 29161004, 35047824, 45120154, 61979438, 85882710, 114985740, 143912373, 161566577, 162187285, 145289549, 118915003, 92457990, 74118562, 65759406, 65713980, 73452565, 89666529, 113051771, 140377407, 163214345, 172011508, 163454339]
12256A63454339k3591313k9312717k6916996j7708238j0417435o566587m430583
12249D4510470l297327k871577k497123k007358j724032j701389j380811j121967
12241B7908886j236292j298911j213275j083191q88950j034964o89390m70643
12233A9993270l91806q58037p99991o38528m94563m59940l33536m12534o16869
12224A4987466p01335m58815j24461j04498l65359k89439k72791k14554j27865
12215A2328349l41539n67634n61023l39623o8594j62781j56030l62132l23199
12206I445794o3158Q5209M4880M1953j2791k25175q5584J08875q3443M6958L5554
12195I339072o60367n49631l54774j78935j57011L6188k45454o9958M5262j32025
$$ y = [163454339, 139863026, 110550309, 83633313, 65925075, 55507640, 48941053, 44510470, 41213143, 38341566, 35844443, 33837085, 32113053, 30411664, 29030853, 27908886, 26672594, 25373683, 24160408, 23077217, 22188267, 21153303, 20463913, 19993270, 19601464, 18743427, 17943436, 17304908, 16810345, 16350405, 16016869, 15604335, 14987466, 14286131, 13827316, 13702855, 13598357, 13232998, 12943559, 12670768, 12456214, 12328349, 11986810, 11419176, 10858153, 10518530, 10449936, 10287155, 10131125, 9768993, 9445794, 9382636, 9467845, 9512725, 9554678, 9541887, 9316712, 9231128, 9340003, 9256560, 9303518, 9339072, 8678705, 8129074, 7774300, 7595365, 7438354, 7474542, 7229088, 7159130, 7204392, 7072367]
12185G072367p5784l4625j73573l3614j28759l93665k95849j67410j56613j96061
12175E416414j65814J1930M4213j81192k87166j96452k67488k7282M11362j9133
12165D739392j23749j52673j40872m218J2083j20731o2889O0326J65664N8642
12155D430975J95861n7712N8773l3081k02236J3455L33893M61558J60235N0439
12145E412160j17654j987n0375j60309k46971j22375k67406k11926n3812j30393
12135D048952N6393M1650k11349p3069J37743j41707p0618J87670k4917m7231
12125C903517P6704j91486j00816j15631r2604k74883k02169j84405j83316j28644
12115B506267q0108r4288K60426L39283O8496M8917p9927j14540J83879o0343
$$ y = [7072367, 6996583, 6961958, 6788385, 6754771, 6626012, 6232347, 5936498, 5769088, 5612475, 5416414, 5250600, 5262530, 5306743, 5125551, 4838385, 4641933, 4374445, 4347163, 4758525, 4739392, 4615643, 4462970, 4322098, 4317880, 4329963, 4209232, 4146343, 4206669, 4372333, 4430975, 4626836, 4569124, 4627897, 4594816, 4392580, 4406035, 4739928, 5201486, 5361721, 5412160, 5294506, 5292519, 5242144, 5081835, 4834864, 4712489, 4445083, 4233157, 4179345, 4048952, 4105345, 4146995, 3935646, 3862577, 4000320, 3858613, 3787995, 3975665, 3950748, 3903517, 3980221, 3788735, 3687919, 3572288, 3479684, 3204801, 3002632, 2818227, 2634911, 2506267, 2426159, 2331871, 2592297, 2931580, 3000076, 3048993, 2969066, 2854526, 3038405, 2978062]
12105B978062P7352p872n1993J76389M04157L71320K52773J20305k10423l94937
12095C715133l36754p4999J27196q0223k73180j68594m1244N4115L67347N80088
12085C868885O15108L20324M58516N53685K10735j09130j92333k71597j80886
12076E273307k62930k85538K90562O20773O89903Q03335O98394J376700J759976
12067A0964482K153309L158660M656122O699824J0457873J7388912K9349927M5735896
12059A30565005O0652060O5790726N2309267J8347292k5418295n8544302o5776711
12052A77925042n1252310l1457502j8091619j0617245o985778n511384m945129
12045D9064075m412205l846868l601313k620786k178065k240754j912274j623451
$$ y = [2978062, 3055414, 3047542, 2995549, 3171938, 3576095, 3947415, 4200188, 4320493, 4110070, 3715133, 3378379, 3303380, 3430576, 3350353, 3077173, 2908579, 2867335, 2921450, 3288797, 3868885, 4483993, 4804317, 5262833, 5816518, 6027253, 5918123, 5725790, 5454193, 5273307, 5010377, 4724839, 5015401, 5636174, 6326077, 7129412, 7827806, 9204506, 10964482, 13117791, 16276451, 20932573, 27632397, 38090270, 55479182, 84829109, 130565005, 191217065, 257007791, 309317058, 327664350, 302246055, 243701753, 177925042, 126672732, 95215230, 77123611, 66506366, 59520588, 54009204, 49064075, 44651870, 40805002, 37203689, 34582903, 32404838, 30164084, 28251810, 26628359]
12037B6628359j385770j156894p56780l90812j63166j18918j75284n08226o63348
12028B1309161o25075p91118m67751o87211q24555p66832l53649o2619O8473q7629
12018A6711195K49328M56719R36053J261705J871749K942114L957881O339880
12010C4726624J0332561J7605067K8863854M1539746M9883410M7254305K8478204
12003B58683771l712250l5787787n0910718m6429184l1474384j8279405j0828342
11996F1261701p110862m885915m301897l680492l231399l117191k772482k223087
11988B9938376j647435j342559j403237j542693j056530p89310l55079l61105
11980B1440428o66548o24668p68219p83415o72766p58491o35610m98219n48393
$$ y = [26628359, 25242589, 24085695, 23328915, 22938103, 22774937, 22656019, 22480735, 21972509, 21309161, 20684086, 19892968, 19425217, 18738006, 17913451, 17146619, 16792970, 16730351, 16798824, 16711195, 16960523, 17417242, 18353295, 19615000, 21486749, 24428863, 28386744, 34726624, 45059185, 62664252, 91528106, 133067852, 182951262, 230205567, 258683771, 254971521, 219183734, 168273016, 121843832, 90369448, 72090043, 61261701, 54150839, 49264924, 44963027, 41282535, 38051136, 34933945, 32161463, 29938376, 28290941, 26948382, 25545145, 24002452, 22945922, 22156612, 21801533, 21440428, 20773880, 20149212, 19380993, 18597578, 17924812, 17166321, 16530711, 16032492, 15484099]
11971A5484099m02129m43203m79798l74442k55925k26404l57939m32608m05209
11962A2106442l66158j70862m16673q8143J7305j98566l97956k52146k19208j54756
11952I859279j48584j69826l66430p3417k86743k67208J16756r3420k41398L0032
11942H359041J93238M85614M5905l19674m48186m93283n40860k59426J28897k28008
11932F923258N205L9077R7599j18058N8684j69089k68410q2344j66705k93540
11922F025677k08382k16602j87937j48317k68819R1245j9052k70811p8160q0295
11912D638547l13518o3385q4155j26550K24300j18406j6854q1812j80165j76795
11902C701207j69427O9360N7632j19541j39268j25432o1846L06547p599N5837
$$ y = [15484099, 15081970, 14638767, 14158969, 13784527, 13528602, 13302198, 12944259, 12511651, 12106442, 11740284, 11569422, 11152749, 11064606, 11081911, 10883345, 10485389, 10233243, 10014035, 9859279, 9710695, 9540869, 9174439, 9101022, 8814279, 8547071, 8663827, 8570407, 8329009, 8359041, 8552279, 9037893, 9083798, 8764124, 8315938, 7822655, 7281795, 7022369, 7151266, 6923258, 6928463, 6967540, 7065139, 6947081, 7005765, 6836676, 6568266, 6485922, 6319217, 6025677, 5817295, 5600693, 5412756, 5264439, 4995620, 5086865, 5067813, 4797002, 4718842, 4638547, 4325029, 4261644, 4177489, 4050939, 4275239, 4156833, 4139979, 4058167, 3878002, 3701207, 3531780, 3601140, 3658772, 3539231, 3399963, 3274531, 3212685, 3519232, 3511633, 3567470]
11892C567470J50637K58876L67301K70399J14297r3719J26026n28786p10097j76558
11882C345846j13723N5107o86L9714j26915N9231L82847j24771k00585K204k8500
11871C289769j23416J18380o1323l71000k17356M3697N7842m05589l65172J07510
11861B073342O5956p8713l3645O4177l4098N8813k0795k02717K8938J06383m8045
11850A979596J5125p716k41420n7024n5417J04705J71431J74371j01195L048j10131
11839A875373k77885k6395K45640K60534N5880j24156p0683j78710l6133j8865
11829A704600k17916j09798n501J13891J8279o9000j54197L5900M77315R975j13662
11818A689886j32615M157k6137N09p5529k9002O159Q6798j09224M7988R2281n101
$$ y = [3567470, 3718107, 3976983, 4344284, 4614683, 4728980, 4635261, 4761287, 4232501, 3522404, 3345846, 3232123, 3287230, 3286544, 3326258, 3199343, 3258574, 3641421, 3516650, 3316065, 3318269, 3289769, 3166353, 3284733, 3223410, 2852410, 2635054, 2678751, 2736593, 2331004, 1965832, 2073342, 2139298, 2060585, 2026940, 2091117, 2057019, 2115832, 2095037, 1892320, 1921258, 2027641, 1979596, 1994721, 1987005, 1745585, 1688561, 1633144, 1737849, 1909280, 2083651, 1982456, 1985504, 1875373, 1597488, 1571093, 1816733, 2077267, 2133147, 2008991, 1938308, 1759598, 1723465, 1704600, 1486684, 1376886, 1371385, 1485276, 1503555, 1434555, 1280358, 1316258, 1793573, 1803548, 1689886, 1557271, 1561428, 1535291, 1535800, 1460271, 1431269, 1437428, 1524226, 1415002, 1462990, 1555271, 1550170]
11806A550170M4417J34496L4110j6092N3309K99652N46490L83645K14917l35770
11796B909344l36988N4331l5036k38683n2128j40418j10221J0690K50030J32176
11786B443097m7793o1861j73940l5082n7310J63871M8355K17536j37953k33332
11776B125588r4179m9569j2897O5795O2924Q0545Q2981P1166k8180j27240J2898
11765B189832j63481j81132o4564m27258J72310Q9428k79912l1524J33779J34435
11755A571913q1612j05149k3691J01276J94901M20242J01696J8246K07500K13997
11745B619319J16121P8874M7597k50536l44426J328K5140k13074p8826K51774
11735B253291K99436l410j58982j83757k62569K17144j10435k38088k8027R8595
$$ y = [1550170, 1594587, 1729083, 1763193, 1747101, 1800410, 2100062, 2646552, 3030197, 3245114, 2909344, 2572356, 2626687, 2591651, 2352968, 2300840, 2160422, 2050201, 2060891, 2310921, 2443097, 2395304, 2333443, 2159503, 2124421, 2067111, 2230982, 2279337, 2496873, 2358920, 2125588, 2031409, 1981840, 1968943, 2034738, 2097662, 2178207, 2261188, 2332354, 2304174, 2176934, 2189832, 2026351, 1845219, 1780655, 1353397, 1525707, 1615135, 1335223, 1303699, 1437478, 1571913, 1490301, 1385152, 1361461, 1462737, 1657638, 2077880, 2179576, 2197822, 2405322, 2619319, 2735440, 2814314, 2861911, 2611375, 2266949, 2268277, 2293417, 2080343, 2001517, 2253291, 2552727, 2549317, 2390335, 2206578, 1944009, 2161153, 2050718, 1812630, 1784603, 1883198]
11725A883198l65331j67987n6862o3466M9211J71822J82452J04976K78067r6546
11715A919534l56047k23247j49353J19356n2860m0293L7438j34800M7706J69111
11705A336545j59497J24004R6671Q1590P1822j80990l2710k32621j23933j63560
11695H17321p123K99614R6192R5359j91401n7285j99085m7380J89423m080K6873
11684A018428O4256j8741k3645j37775k62571j97131J00152L06313n421l28303
11674E15562k11961M8625L8006J3021K0064J36409k44577o8798K94673J39139
11664F80163Q1630J57552j87095P5266K29521l5383r3618l16212J3049L91993
11654I96866j46634k1801o6588J34638n4589J87084J74038j21532k35619l38292
$$ y = [1883198, 1517867, 1349880, 1293018, 1229552, 1278763, 1450585, 1633037, 1738013, 2016080, 1919534, 1563487, 1340240, 1190887, 1310243, 1257383, 1217090, 1254528, 1119728, 1167434, 1336545, 1177048, 1301052, 1397723, 1479313, 1551135, 1370145, 1337435, 1104814, 980881, 817321, 810198, 1109812, 1206004, 1301363, 1109962, 1052677, 853592, 806212, 995635, 991555, 1018428, 1082684, 1063943, 1040298, 902523, 639952, 442821, 542973, 849286, 843865, 515562, 303601, 352226, 390232, 403253, 423317, 559726, 315149, 246351, 541024, 680163, 761793, 919345, 732250, 807516, 1037037, 1001654, 908036, 591824, 604873, 996866, 850232, 828431, 761843, 896481, 841892, 1028976, 1203014, 1081482, 845863, 507571]
11644E07571j15854J78236M4824J8984K0468K80840J38222k37117j54656m8455
11634F33063j399L7428J14070k13715q3267N3763L21533K6078j88025j12644r7153
11623D89732j13802P0913J39827K63410M38478J26681P4397l9671j85395p1420
11613A193150j11924j49139k32508p8402k8789L42786J86265k15288J75372k06272
11603H75251m69792p7117j17330L38199K57409J80019m4991M3414r474J07078
11593A082666J63142m6665j29352R2536Q1820j03255j04659j83176K02127l1623
11583A023561o6020P8496K09331K33429r2177j76473n3228J52806l04321k46157
11573G59247o1399p5294M6436J11549j45041j94135K11889J75172n6836k21611
$$ y = [507571, 391717, 569953, 614777, 633761, 654229, 935069, 1073291, 836174, 681518, 633063, 631664, 669092, 783162, 569447, 486180, 539943, 861476, 887554, 699529, 586885, 489732, 375930, 446843, 586670, 850080, 1288558, 1415239, 1489636, 1449965, 1264570, 1193150, 1081226, 932087, 699579, 621177, 592388, 935174, 1121439, 906151, 1081523, 875251, 405459, 328342, 211012, 549211, 806620, 986639, 941648, 985062, 975588, 1082666, 1245808, 1199143, 1069791, 1162327, 1244147, 1140892, 1036233, 853057, 1055184, 1023561, 957541, 1036037, 1245368, 1478797, 1386620, 1210147, 1156919, 1309725, 1005404, 759247, 697848, 622554, 668990, 780539, 635498, 441363, 653252, 828424, 771588, 549977]
11563E49977l5585n6548j26465K63345K20841K75904K65345J99200J09113l34261
11553A330866l44507k58079L1290J17880M7628j0102M1776L08240Q1162O4663
11543A410817L06172K01450n9502m6707J17510k67906l60859k20961L5955K30063
11533A346032J97896N1097J3306J98632K91864K54109k177j38239k79115o0755
11523A872650K37172K35547J67569j3500l0327k15870k83360j09345l78958k07482
11513A274096P7132Q5084j50168j56972Q6912M5546k06402k15K63657j43298J2216
11502A187588J84696J2557K90397J01221l82800m97697j37650J4339K220K17420
11492I92291J49989p738l5288K730p2119Q4410J51528M897J18472J6700k97964
$$ y = [549977, 514392, 457844, 331379, 594724, 815565, 1091469, 1356814, 1556014, 1665127, 1330866, 986359, 728280, 759570, 877450, 925078, 914976, 956752, 1264992, 1346154, 1410817, 1716989, 1918439, 1858937, 1812230, 1929740, 1661834, 1300975, 1080014, 1115969, 1346032, 1543928, 1595025, 1608331, 1806963, 2098827, 2352936, 2350759, 2212520, 1933405, 1872650, 2109822, 2345369, 2512938, 2499438, 2469111, 2253241, 1969881, 1860536, 1481578, 1274096, 1351228, 1436312, 1286144, 1129172, 1216084, 1261630, 1055228, 1055013, 1318670, 1175372, 1187588, 1372284, 1384841, 1675238, 1776459, 1393659, 895962, 758312, 772651, 774871, 992291, 1142280, 1134542, 1099254, 1101984, 1029865, 1114275, 1265803, 1270700, 1389172, 1405872, 1107908]
11481A107908j97073l454R2713K57440j1143M5121K78283K40989K22201L83425
11471B416410K64544J85213Q8931m8199P5167o9251l20913l74948k66059l3362
11461A917533j43720k78538k38543J49188J83794O5815Q263K8714k50312k02852
11451A239342O1141k62930l64506m2330K47765j35733r8954K23213K3905J726
11441H92639Q184O5598r3978n4981L6916o194O2009p9283L8524O3467K29167M975
11429A167043j60117q1032j87913j1402p289J31415m5166J28239N9573q9343j03275
11418H00733L2318R6532n0292L4180j40586j81007j84097k4232k3366K02865J95531
11407G58579Q8349l19139k37203O6195O6876K45140L39502J82020j22707j31457
$$ y = [1107908, 910835, 907381, 1000094, 1257534, 1246391, 1291512, 1569795, 1810784, 2032985, 2416410, 2680954, 2866167, 2955098, 2906899, 2982066, 2912815, 2591902, 2216954, 1950895, 1917533, 1773813, 1495275, 1256732, 1405920, 1589714, 1655529, 1663792, 1692506, 1442194, 1239342, 1300483, 1037553, 673047, 630717, 878482, 742749, 643795, 867008, 890913, 892639, 900823, 966421, 872443, 817462, 854378, 848184, 910193, 830910, 869434, 932901, 1162068, 1167043, 1006926, 925894, 737981, 726579, 719290, 850705, 805539, 933778, 993351, 904008, 800733, 833051, 929583, 879291, 913471, 772885, 591878, 407781, 383549, 360183, 563048, 758579, 846928, 527789, 290586, 356781, 423657, 668797, 1008299, 1190319, 1067612, 936155]
11397I36155k522n0313l3839Q3880p2484j82815j24045j66837J22487M0047K2283
11386E71997J83374j87621j72889Q1416J12278J36661N7801j29088j3380k6912
11376F13637j48135Q518J43071r9735K9678K45178l32565m9977r1820m3884K81417
11365E55383Q2496j85321o6853J11703K17328K6085j16916l8463K8331P230M80844
11354A101847O02194M67366J81750p9866j95862m57383k64355p9494n5952l64770
11344H55475q7217j5051R0559M0130k27302j9607P3659j88030k09119j0195K04268
11333E07570J87042J99840L99620N1897J54006L46324L04625K54972L44143J34576
11323B884615n04036n82168l76516R5789j80559j56493j01050J12046K66071J29077
$$ y = [936155, 933633, 883320, 849481, 933361, 860877, 678062, 554017, 387180, 509667, 549714, 571997, 755371, 567750, 394861, 476277, 588555, 725216, 783017, 653929, 640549, 613637, 465502, 474020, 617091, 517356, 547034, 792212, 459647, 409670, 317850, 273966, 555383, 637879, 452558, 385705, 497408, 714736, 740821, 623905, 585442, 613773, 621003, 1101847, 1704041, 2171407, 2353157, 2273291, 2077429, 1620046, 1355691, 1276197, 1220245, 855475, 768258, 753207, 843766, 883896, 656594, 636987, 710646, 522616, 313497, 303302, 507570, 694612, 894452, 1294072, 1345969, 1499975, 1846299, 2150924, 2405896, 2750039, 2884615, 2380579, 1798411, 1421895, 1517684, 1337125, 1180632, 1079582, 1191628, 1457699, 1586776]
11313A586776K8574j7040M5217j73638k16372j23785j36179O8077J21314K20011
11303A402955O58230M25549P36812N74093K75157J98170n6767k14539m20951k49531
11293C329178k7972O46734N86647M47804L80993Q9382J77559O64092J076379J278647
11283H649443J671775K276364L612578O119319J1387198K0505071L0016967L4367362
11275A18606077L0335461J5409555r262375l0781046l5544345k5792919j5102262
11268D7868146q648401n348689l538191k745493j714938j064560j031119p43642
11260B3033113m98150m39277R4798N27584R11802K109133M098820P769670J4777644
11251E2385137K3706554L1190122L2229632K3731759L981909k0764654l5057021
$$ y = [1586776, 1615350, 1598310, 1643527, 1469889, 1253517, 1129732, 993553, 1061630, 1182944, 1402955, 2061185, 2486734, 3223546, 3797639, 4072796, 4270966, 4214199, 3999660, 3578709, 3329178, 3301206, 3947940, 4534587, 4982391, 5363384, 5452766, 5630325, 6294417, 7370796, 8649443, 10321218, 12597582, 16210160, 22329479, 33716677, 54221748, 84238715, 118606077, 148941538, 164351093, 155088718, 124307672, 88763327, 62970408, 47868146, 39219745, 33871056, 30332865, 27587372, 25872434, 24807874, 23776755, 23033113, 22534963, 22095686, 22190484, 22718068, 23629870, 25739003, 29837823, 37607493, 52385137, 76091691, 107281813, 139511445, 163243204, 167225113, 146460459, 111403438]
11244A11403438l1643002k0095719j1478147o647400m222913l143277k529773
11237C1643207j679272j125716q14541q21303n79691k04340L24432J275332K487480
11228C0505588N060884R677649J7436641K5963339L0123917K7191306J3954612
11221A59913936q183256k7980537l2679965k3848553j4229282q352346m880582
11214C9759415l251510k565376j837300j580435j530488j245742q68512n03236
11206B6376816r3077L65381O53170J754148L518505O561381J2640235K0928039
11198G2704598K8016064K9208763K1929465L795625j8656576l1913237k9262819
11191G5821883j8547104j0708678o403775m227630k967415k088965j979679j848967
$$ y = [111403438, 79760436, 59664717, 48186570, 41539170, 37316257, 34172980, 31643207, 29963935, 28838219, 28023678, 27202375, 26622684, 26418344, 26742776, 28018108, 30505588, 35566472, 45244121, 62680762, 88644101, 118768018, 145959324, 159913936, 151730680, 123750143, 91070178, 67221625, 52992343, 44639997, 39759415, 36507905, 33942529, 32105229, 30524794, 28994306, 27748564, 26880052, 26376816, 26283739, 26649120, 27302290, 29056438, 32574943, 39136324, 51776559, 72704598, 100720662, 129929425, 151858890, 155654515, 136997939, 105084702, 75821883, 57274779, 46566101, 40162326, 35934696, 32967281, 30878316, 28898637, 27049670]
11183B7049670j687069j587021j555496j105866r18030j010109j238745p43884
11175A7203450m87215n75264m25401m10394k52478j93162o26162o65100o56809
11166A2911465m07855J9842j5271O266m18966n61025m07082m01931m01697m29747
11156I893999k70430k80422j89687m48400j10134k46393m56575j61971r7060m9845
11146G583082j66484j91434q4907j92365j76218l3071L2416k51321j21052j36149
11136F262497k41691o0557j56336n7634J47539r6664j13837l94243j99273P0816
11126E160617K32660Q5346k19985l46679j0984m9252j61620j96391j51852r2187
11116D249673n0632j18892r9386n699m3677Q6991j17352J29450J37686k8738n29471
$$ y = [27049670, 25362601, 23775580, 22220084, 21114218, 20196188, 19186079, 17947334, 17203450, 16716235, 16140971, 15715570, 15305176, 15052698, 14859536, 14233374, 13568274, 12911465, 12503610, 12523452, 12508181, 12514447, 12095481, 11534456, 11127374, 10725443, 10323746, 9893999, 9623569, 9343147, 9153460, 8705060, 8594926, 8348533, 7891958, 7729987, 7632927, 7583082, 7416598, 7225164, 7140257, 6947892, 6771674, 6738603, 6771019, 6519698, 6398646, 6262497, 6020806, 5960249, 5803913, 5746279, 5893818, 5797154, 5683317, 5289074, 5089801, 5160617, 5393277, 5478623, 5258638, 4911959, 4900975, 4851723, 4690103, 4493712, 4341860, 4249673, 4199041, 4080149, 3980763, 3975064, 3931387, 4018378, 3901026, 4030476, 4168162, 4139424, 3609953]
11105C609953k61995o5449n3149O1680k364N5578j36565m8997Q2111J46907q2295
11094C305415j63660j75432M28511p3776j03232j62055k4349p4157j9645r8668
11084B838952l10150j46873l5264r7443K37030l47094j06934P1259K85663J73733
11074B562879k42570l22861K25350K35219J69987J85164K5249k3197j85280p7557
11064B552383J18729Q8855k63689j68926k99711K2072J41125J43189j67705k55510
11054A910812J0556L7630O6279j94270j18433K03775J62401q7483Q7058J87612
11044B265937K60241k0502l11081J77319m78j18003l07930l48656p7451J29367
11034A648763K99376m622j29402j11157M3248k38784j73348j98023J38436M07787
$$ y = [3609953, 3347958, 3282509, 3229360, 3291040, 3288676, 3344254, 3207689, 3158692, 3240803, 3387710, 3305415, 3141755, 2966323, 3394834, 3321058, 3217826, 3055771, 3031422, 2957265, 2937620, 2838952, 2528802, 2381929, 2346665, 2249222, 2486252, 2139158, 2032224, 2103483, 2389146, 2562879, 2320309, 1997448, 2222798, 2458017, 2628004, 2813168, 2838417, 2815220, 2629940, 2552383, 2671112, 2759967, 2496278, 2327352, 2027641, 2049713, 2190838, 2334027, 2166322, 1910812, 1921368, 1958998, 2025277, 1831007, 1712574, 1916349, 2078750, 1991267, 2078325, 2265937, 2526178, 2505676, 2194595, 2371914, 2371436, 2253433, 1945503, 1596847, 1519396, 1648763, 1948139, 1943517, 1814115, 1702958, 1746206, 1507422, 1334074, 1136051, 1274487, 1682274]
11024A682274K60877l4832j13970J25612j8192j04916J4161K3312N7268O0375
11014A951969n5549K2857m464p1198k29270r1983J03019k08864j47626P2026J07979
11003A448896J87764J0354N103O3600k43153k83283j17522K62471K87232O0239
10993A681701M2834J6794L9410k21912j57733j22917l8807J49562J36470N2650
10983A578052j09262j59398j10953r7520K30653R6163k44406j87607L1442J86519
10973A213683m421p733N4144j76523K25537K54874K4370j91605N2864l40332J29289
10962A234147O094J50536n8458l1212o8013l4613j66022P8747L905J38821J1088
10951A265020J21586K72817J87812m4084M9028k73121j13776k65771N7512M40756
$$ y = [1682274, 1943151, 1908319, 1794349, 1919961, 1901769, 1796853, 1811014, 1834326, 1891594, 1951969, 1896420, 1919277, 1914813, 1843615, 1614345, 1522362, 1625381, 1416517, 1268891, 1340917, 1448896, 1636660, 1647014, 1652117, 1715717, 1472564, 1189281, 1071759, 1334230, 1621462, 1681701, 1724535, 1741329, 1780739, 1558827, 1401094, 1278177, 1239370, 1388932, 1525402, 1578052, 1468790, 1309392, 1198439, 1100919, 1331572, 1427735, 1183329, 995722, 1027164, 1213683, 1209262, 1201529, 1255673, 1079150, 1304687, 1559561, 1583931, 1392326, 1445190, 1104858, 1234147, 1240241, 1390777, 1332319, 1301107, 1233094, 1198481, 1032459, 1111206, 1115111, 1253932, 1265020, 1386606, 1659423, 1847235, 1803151, 1852179, 1579058, 1465282, 1199511, 1257023, 1697779]
10941A697779N58572L86987M4806l63101m92852k55970j37887j06956k74615J64700
10931A221463o8564o5573K52111j09227j49999j84966J5264K7381k6302J18257
10921A029845J78962J68590l65823j66018L3216K99463K12637K08245M0218j5286
10911A624049N9058J14341j4725k6664o700j09462O4480j01556k37185J38327
10901A503963j6868j42457j8909j65531k92452P3291J02252j07777j20900J45411
10891I60023K79636j41023K32739O05234M1910j96440p1696r2603j08008m44173
10881A065599j70240J09255j12830j22179m7282K6446R6578J43758p4918O2835
10871I77022J07796p7462q1734M0039L1926o3279L6590K97894Q5993j2546K28702
$$ y = [1697779, 2256351, 2643338, 2688144, 2325043, 1832191, 1576221, 1438334, 1331378, 1056763, 1221463, 1152899, 1087326, 1339437, 1230210, 1080211, 895245, 910509, 937890, 911588, 1029845, 1208807, 1377397, 1011574, 845556, 878772, 1178235, 1390872, 1599117, 1639335, 1624049, 1683107, 1797448, 1782723, 1756059, 1749359, 1639897, 1704377, 1602821, 1365636, 1503963, 1487095, 1344638, 1325729, 1160198, 867746, 941037, 1043289, 935512, 814612, 960023, 1239659, 1098636, 1331375, 1936609, 1978519, 1782079, 1710383, 1617780, 1509772, 1065599, 895359, 1004614, 891784, 769605, 722323, 748769, 845347, 989105, 914187, 977022, 1084818, 1007356, 925622, 965661, 997587, 934308, 970898, 1268792, 1354785, 1342239, 1570941]
10860A570941q5452l99815L510J91560M1360j27424k24563p2747L01982L69383
10850A568735J04617j17904J14617L21071L00509K2953l76025l11571k57537k47783
10840A121682K1626K24828J15548j70013k77021J34528J30028j65870P5645J00081
10830A311062M8946j87165l14452J16857K82640P1715o5768J71683J40873n2159
10820A524232m48184K4122M977k32747j98634N1224J48876J44937r1302q2712
10810H44789K87562j92041n9019L6355j94616r6283N852L41737j4916K54384K08814
10799A422618N8748J83506L21251L20341K24453L29775j02485j91261m49990m41393
10789A675563m14214l47245N8152j43525q9807J43528J47304l05702N5403K68163
$$ y = [1570941, 1485489, 1085674, 1089184, 1280744, 1322104, 1194680, 970117, 897370, 1199352, 1568735, 1673352, 1555448, 1670065, 1991136, 2291645, 2314598, 1938573, 1627002, 1369465, 1121682, 1143308, 1368136, 1483684, 1313671, 1036650, 1171178, 1301206, 1135336, 1210981, 1311062, 1360008, 1172843, 858391, 975248, 1257888, 1329603, 1263835, 1435518, 1576391, 1524232, 1076048, 1100170, 1105147, 872400, 673766, 724990, 873866, 1018803, 927501, 844789, 1132351, 940310, 881291, 917646, 723030, 626747, 632599, 974336, 959420, 1213804, 1422618, 1481366, 1664872, 1986123, 2306464, 2530917, 2860692, 2758207, 2566946, 2116956, 1675563, 1261349, 914104, 972256, 828731, 738924, 882452, 1029756, 724054, 779457, 1047620]
10779A047620K94902o5052J07430J43494O633k7148R6165q2864j52619P5923L2097
10768A476581J65305j53733j73567R4577q7911n5660N0775Q6629p724j74985R9209
10757A319496j6683J41971L4198J7529r9920J14659n9184j23960R2951K78455
10747A699512K35937L85171J52554K40908k44180q6756O0425j56196j47750k86917
10737A852708n1760O0308j01534j82003m294J49604j9441m7294l6150Q0151n0712
10726A649583r1837J07730J25736j02403j07508J59702N4594M4149J60053k40176
10716A759623l27080p8628J44385J48609J32570j671J9264o1143n9059J14368
10706A791238j8955L3768J84806O4450j73856j67233k84655k57963p2173J38173
$$ y = [1047620, 1342522, 1277470, 1384900, 1528394, 1535027, 1507879, 1604044, 1521180, 1368561, 1444484, 1476581, 1641886, 1488153, 1314586, 1409163, 1321252, 1265592, 1316367, 1402996, 1395272, 1220287, 1319496, 1302813, 1444784, 1478982, 1496511, 1396591, 1511250, 1452066, 1328106, 1421057, 1699512, 1935449, 2320620, 2473174, 2714082, 2469902, 2383146, 2443571, 2287375, 2139625, 1852708, 1800948, 1861256, 1759722, 1577719, 1573425, 1723029, 1703588, 1656294, 1620144, 1700295, 1649583, 1557746, 1665476, 1791212, 1688809, 1581301, 1741003, 1795597, 1839746, 1999799, 1759623, 1432543, 1353915, 1498300, 1646909, 1779479, 1777808, 1797072, 1735929, 1676870, 1791238, 1772283, 1806051, 1990857, 2055307, 1881451, 1714218, 1429563, 1171600, 1099427, 1237600]
10696A237600P0523P8736L19775j59797j31391o5782k66281j77491J14153K87077
10686A307122J42848j09948k05502j46414K50214p650k25285j65387O846j70844
10676F76000J02767N70735M0510K2915J44954j96461j49292L88604L02850m778
10666A898804j45983j48715m08964q7766J9818j06086K65074O4409Q9924L09773
10656A750288K98798K11019K48373O500l3164L3009J74983j36865L73492M17466
10646C343899M13717M45779Q99255J107697J495899J656161K038220K936779M405313
$$ y = [1237600, 1308123, 1386859, 1706634, 1546837, 1415446, 1349664, 1083383, 905892, 1020045, 1307122, 1449970, 1340022, 1134520, 988106, 1238320, 1230670, 1005385, 839998, 846844, 676000, 778767, 1349502, 1390012, 1412927, 1557881, 1361420, 1212128, 1600732, 1903582, 1898804, 1752821, 1604106, 1195142, 1107376, 1127194, 1021108, 1286182, 1350591, 1440515, 1750288, 2049086, 2260105, 2508478, 2514978, 2481814, 2514823, 2689806, 2552941, 2926433, 3343899, 3757616, 4203395, 5102650, 6210347, 7706246, 9362407, 11400627, 14337406, 18742719]
$$ [...]
##END NTUPLES=NMR SPECTRUM
##END=
