##TITLE=Analysis number 321283
Compound Code mo 07901
Book Reference 497/40
Project Code adrs
Chemist Name avrilr
##JCAMPDX= 6.0         $$ Bruker NMR JCAMP-DX V2.0
##DATA TYPE= NMR SPECTRUM
##DATA CLASS= NTUPLES
##ORIGIN= Bruker BioSpin GmbH
##OWNER= nmr
$$ XWIN-NMR		Version 3.5
$$ Wed Aug  2 15:34:07 2006 GMT Daylight Time (UT+1h)  MAYBRIDGE\nmr@NMR_250MHZ
##.OBSERVE FREQUENCY= 250.131544655141
##.OBSERVE NUCLEUS= ^1H
##.ACQUISITION MODE= SIMULTANEOUS (DQD)
##.ACQUISITION SCHEME= undefined
##.AVERAGES= 16
##.DIGITISER RES= 18
##SPECTROMETER/DATA SYSTEM= dpx250
##.PULSE SEQUENCE= zg30
##.SOLVENT NAME= DMSO
##.SHIFT REFERENCE= (INTERNAL, DMSO, 0, 16.522)
##AUDIT TRAIL= $$ (NUMBER, WHEN, WHO, WHERE, WHAT)
$$ ##TITLE= Audit trail, XWIN-NMR		Version 3.5
$$ ##JCAMPDX= 5.01
$$ ##ORIGIN= Bruker BioSpin GmbH
$$ ##OWNER= nmr
$$ C:\u/data/dgb/nmr/ADRS/90/pdata/1/auditp.txt
$$ ##AUDIT TRAIL=  $$ (NUMBER, WHEN, WHO, WHERE, WHAT)
(   1,<2006-08-02 15:33:36.88 +100>,<MAYBRIDGE\nmr>,<NMR_250MHZ>,
      <created by zg, POWCHK disabled, PULCHK disabled
       configuration hash MD5:
       E2 DF 36 D8 04 B2 41 60 5A D7 A3 38 5A 4B D0 FE
       data hash MD5: 64K
       C6 37 A6 9B 7D 69 4E 74 2C 8C 90 A7 EC 6A D9 20>)
(   2,<2006-08-02 15:33:54.61 +100>,<MAYBRIDGE\nmr>,<NMR_250MHZ>,
      <Start of raw data processing
       ef LB = 0.3 FT_mod = 6 PKNL = 1 SI = 32K 
       data hash MD5: 32K
       09 F6 5D A5 88 0B 52 A5 17 FB 25 D2 91 66 0C 9E>)
(   3,<2006-08-02 15:33:56.46 +100>,<MAYBRIDGE\nmr>,<NMR_250MHZ>,
      <apk 
       data hash MD5: 32K
       68 A8 2A 16 A0 83 F3 DE 88 1E 15 33 F0 C9 24 FB>)
(   4,<2006-08-02 15:33:57.19 +100>,<MAYBRIDGE\nmr>,<NMR_250MHZ>,
      <abs ABSG = 5 
       data hash MD5: 32K
       88 CE 8D A0 27 9C B0 90 8E 07 6D 1C 02 F5 EA B5>)
$$ ##END=
$$ 
$$ hash MD5
$$ 2F AA EE 30 F7 7C BF 3C 4F C1 5E 80 7C 5F 59 78
##$RELAX= 
##$RELAX= 
##$RELAX= 
##$RELAX= 
##$RELAX= 
##$RELAX= 
##$RELAX= 
$$ Bruker specific parameters
$$ --------------------------
##$DU= <C:\u>
##$EXPNO= 90
##$NAME= <ADRS>
##$PROCNO= 1
##$TYPE= <nmr>
##$USER= <dgb>
##$AMP= (0..31)
100 100 100 100 100 100 100 100 100 100 100 100 100 100 100 100 100 100 
100 100 100 100 100 100 100 100 100 100 100 100 100 100 
##$AQSEQ= 0
##$AQ_mod= 3
##$AUNM= <au_zg>
##$AUTOPOS= <27 >
##$BF1= 250.13
##$BF2= 250.13
##$BF3= 250.13
##$BF4= 250.13
##$BF5= 500.13
##$BF6= 500.13
##$BF7= 500.13
##$BF8= 500.13
##$BYTORDA= 1
##$CFDGTYP= 0
##$CFRGTYP= 5
##$CHEMSTR= <none>
##$CNST= (0..31)
1 1 145 1 1 1 1 1 1 1 1 1 1 1 1 1 1 1 1 1 1 1 1 1 1 1 1 1 1 1 1 1 
##$CPDPRG= <>
##$CPDPRG1= <>
##$CPDPRG2= <>
##$CPDPRG3= <>
##$CPDPRG4= <mlev>
##$CPDPRG5= <mlev>
##$CPDPRG6= <mlev>
##$CPDPRG7= <mlev>
##$CPDPRG8= <mlev>
##$CPDPRGB= <>
##$CPDPRGT= <>
##$D= (0..31)
0 1 0 0 0 0 0 0 0 0.06 0 0 0 0 0 0 0.0002 0 0 0 0 0 0 0 0 0 0 0 0 0 0 
0 
##$DATE= 1154529215
##$DBL= (0..7)
120 120 120 120 120 120 120 120 
##$DBP= (0..7)
150 150 150 150 150 150 150 150 
##$DBP07= 0
##$DBPNAM0= <>
##$DBPNAM1= <>
$$ [...]
##$SUBNAM6= <"">
##$SUBNAM7= <"">
##$SUBNAM8= <"">
##$SUBNAM9= <"">
##$SW= 20.6930455092707
##$SWIBOX= (0..15)
0 0 3 0 0 0 0 0 0 0 0 0 0 0 0 0 
##$SW_h= 5175.983436853
##$TD= 65536
##$TD0= 1
##$TE= 295.16
##$TE2= 300
##$TE3= 300
##$TEG= 300
##$TL= (0..7)
0 120 120 120 120 120 120 120 
##$TP= (0..7)
150 150 150 150 150 150 150 150 
##$TP07= 0
##$TPNAME0= <>
##$TPNAME1= <>
##$TPNAME2= <>
##$TPNAME3= <>
##$TPNAME4= <>
##$TPNAME5= <>
##$TPNAME6= <>
##$TPNAME7= <>
##$TPOAL= (0..7)
0.5 0.5 0.5 0.5 0.5 0.5 0.5 0.5 
##$TPOFFS= (0..7)
0 0 0 0 0 0 0 0 
##$TUNHIN= 0
##$TUNHOUT= 0
##$TUNXOUT= 0
##$USERA1= <user>
##$USERA2= <user>
##$USERA3= <user>
##$USERA4= <user>
##$USERA5= <user>
##$V9= 5
##$VALIST= <valist>
##$VCLIST= <CCCCCCCCCCCCCCC>
##$VD= 0
##$VDLIST= <DDDDDDDDDDDDDDD>
##$VPLIST= <PPPPPPPPPPPPPPP>
##$VTLIST= <TTTTTTTTTTTTTTT>
##$WBST= 1024
##$WBSW= 4
##$XGAIN= (0..3)
0 0 0 0 
##$XL= 0
##$YL= 0
##$YMAX_a= 427421
##$YMIN_a= -320459
##$ZGOPTNS= <>
##$ZL1= 120
##$ZL2= 120
##$ZL3= 120
##$ZL4= 120
##$ABSF1= 16.522
##$ABSF2= -4.171173
##$ABSG= 5
##$ABSL= 3
##$ALPHA= 0
##$AQORDER= 0
##$ASSFAC= 0
##$ASSFACI= 0
##$ASSFACX= 0
##$ASSWID= 0
##$AUNMP= <proc_1d>
##$AZFE= 0.1
##$AZFW= 0.1
##$BCFW= 0
##$BC_mod= 0
##$BYTORDP= 0
##$COROFFS= 0
##$CY= 12.5
##$DATMOD= 1
##$DC= 0
##$DFILT= <>
##$DTYPP= 0
##$F1P= 14.0000005364418
##$F2P= -0.99999901652339
##$FCOR= 0.5
##$FTSIZE= 32768
##$FT_mod= 6
##$GAMMA= 0
##$GB= 0
##$INTBC= 1
##$INTSCL= 1
##$ISEN= 128
##$LB= 0.3
##$LEV0= 0
##$LPBIN= 0
##$MAXI= 10000
##$MC2= 0
##$MEAN= 0
##$ME_mod= 0
##$MI= 0
##$NCOEF= 0
##$NC_proc= -5
##$NLEV= 6
##$NOISF1= 0
##$NOISF2= 0
##$NSP= 0
##$NTH_PI= 0
##$NZP= 0
##$OFFSET= 16.522
##$PC= 1
##$PHC0= 132.942
##$PHC1= 2.888941
##$PH_mod= 1
##$PKNL= yes
##$PPARMOD= 0
##$PSCAL= 4
##$PSIGN= 0
##$REVERSE= no
##$SF= 250.13
##$SI= 32768
##$SIGF1= 0
##$SIGF2= 0
##$SINO= 400
##$SIOLD= 32768
##$SREGLST= <1H.DMSO>
##$SSB= 0
##$STSI= 32768
##$STSR= 0
##$SW_p= 5175.98343685301
##$SYMM= 0
##$S_DEV= 0
##$TDeff= 65536
##$TDoff= 0
##$TI= <Analysis number 999999
Compound Code 99
Book Reference 9
Project Code 9>
##$TILT= no
##$TM1= 0
##$TM2= 0
##$TOPLEV= 0
##$USERP1= <user>
##$USERP2= <user>
##$USERP3= <user>
##$USERP4= <user>
##$USERP5= <user>
##$WDW= 1
##$XDIM= 32768
##$YMAX_p= 406483593
##$YMIN_p= -299548
$$ End of Bruker specific parameters
$$ ---------------------------------
##NTUPLES= NMR SPECTRUM
##VAR_NAME=  FREQUENCY,     SPECTRUM/REAL,   SPECTRUM/IMAG
##SYMBOL=    X,             R,               I
##VAR_TYPE=  INDEPENDENT,   DEPENDENT,       DEPENDENT
##VAR_FORM=  AFFN,          ASDF,            ASDF
##VAR_DIM=   32768,         32768,           32768
##UNITS=     HZ,            ARBITRARY UNITS, ARBITRARY UNITS
##FACTOR=    0.157963299565203, 1,           1
##FIRST=     4132.6476996994, 0,             0
##LAST=      -1043.33573715361, 0,           0
##MIN=       -1043.33573715361, -299548,     0
##MAX=       4132.6476996994, 406483593,     0
$$ Real data points
##PAGE= N=1
##DATA TABLE= (X++(R..R)), XYDATA
$$ [...]
17665 371094 354109 295035 276499 274691 301911 359717 418726 407639 446747 491147 513153 518462
17653 518462 541254 466142 467720 433612 374822 360013 441337 471826 517640 575190 585003 646126
17641 646126 654484 630300 704664 820463 834548 894349 905734 969828 1044795 1091928 1186565
17630 1186565 1257348 1367712 1446002 1593160 1661220 1755222 1887022 2104669 2371898 2694498
17620 2694498 3081024 3570215 4110013 4776854 5577410 6553096 7623489 8844950 10165133
17611 10165133 11559119 12865845 14123073 15393387 16479706 17388616 18175915 18840042
17603 18840042 19418817 19834548 20142396 20323306 20290983 20116352 19757228 19189431 18379156
17594 18379156 17459750 16334360 15016011 13664793 12324804 11109880 10068048 9130883
17586 9130883 8305413 7620840 7159635 6753576 6451969 6143108 6103454 6018368 5968441 5972139
17576 5972139 6086432 6225435 6490141 6793897 7087275 7577353 8216798 8891762 9751144
17567 9751144 10878885 12211500 13873031 15840812 18049932 20539533 23130427 25810352
17559 25810352 28515494 31158718 33684901 35944004 37962860 39726422 41152906 42257148
17551 42257148 42992042 43481643 43653555 43475245 42905071 41966526 40584179 38752637 36519927
17542 36519927 33943220 31089308 28084718 25218234 22469319 19995885 17823432 15994270
17534 15994270 14436237 13130427 12034622 11194228 10517472 9954237 9407774 9029341 8729599
17525 8729599 8523924 8444894 8391452 8265272 8191052 8343342 8584862 8772973 9061985 9536581
17515 9536581 10147722 10820532 11732793 12793350 14014062 15413804 16772418 18047081 19326506
17506 19326506 20582878 21724194 22807749 23717749 24318051 24816984 25150523 25254069 25240557
17497 25240557 25109356 24767972 24195213 23409530 22362840 21005502 19469169 17789272 16055537
17488 16055537 14324955 12743941 11373990 10141292 9032368 8113393 7339694 6710744
17480 6710744 6149815 5723673 5333547 4983451 4802783 4565463 4217509 4026513 3985206 3922151
17470 3922151 3714570 3500245 3374691 3281367 3106220 2958532 2897238 2844608 2703515 2606247
17460 2606247 2575483 2486132 2307666 2150172 2082076 2050423 2001190 1921025 1803869 1716821 1671951
17449 1671951 1642816 1628557 1620765 1495827 1334041 1292308 1297376 1303105 1269088 1294802 1221433
17438 1221433 1169935 1173761 1151691 1097010 1184804 1157897 1052219 1057419 1045310 1004577 896380
17427 896380 816908 846302 905031 888202 843771 805707 795013 764313 654305 568303 563632
17416 563632 555350 559025 599888 655428 696852 629338 577419 513276 579127 598902 512674 518224
17404 518224 542709 513196 433082 411026 473100 537875 518970 489344 445932 437026 407065 383967
17392 383967 423949 413645 480502 470497 399963 337938 345847 276239 181862 159313 176228 260763
17380 260763 312377 326080 304860 325466 337647 317657 252354 256390 295782 338153 353072 360603
17368 360603 350244 388171 393762 420233 406077 445726 478558 424569 393402 353075 327264 364658
17356 364658 359896 295476 263546 227005 167777 195832 245884 225375 266388 309110 204032
17345 204032 183653 227502 216683 239240 219302 192386 149593 169649 155231 162104 186519 178814
17333 178814 230303 260085 207999 167366 172470 167011 227970 241951 286654 295855 268274 304756
17321 304756 284580 269156 177131 140198 177442 208589 216281 243145 211359 251689 226117 159374
17309 159374 168966 150172 120571 162947 204276 225481 219455 226269 185586 168233 176677 226090
17297 226090 280452 323846 268783 187762 145046 191442 220022 181966 164850 164638 172127 142876
17285 142876 154261 255521 308851 344985 344010 332780 407052 471894 536890 492371 411463 437132
17273 437132 388381 295086 293150 308514 290750 314160 342750 276352 219937 228541 263410 289572
17261 289572 313093 290195 228587 172619 169820 199816 137783 121317 136271 139091 192393 221071
17249 221071 172591 215382 191516 127533 115695 55911 35580 51350 160705 209179 179371
17238 179371 183071 212708 140960 33107 21144 24871 34199 8434 -7999 57413 147909 216885
17226 216885 355601 373526 311481 221705 201274 136530 106284 190425 216063 168596 206788
17215 206788 158955 132176 178963 170099 118919 74626 4793 -21546 45729 47935 44812 103326
17203 103326 139640 55912 38536 32191 -9032 -5662 6294 -14942 18187 108904 178928 58015
17191 58015 83466 136800 143599 139384 21161 15703 25928 16228 28216 56549 7104 -47924
17179 -47924 73612 59213 72772 80817 10024 -40647 -22532 34592 38526 68754 19661 13418
17167 13418 -89607 -131074 -140520 -65686 -101230 -79579 -41194 -22743 -18979 58639 129069 115967
17155 115967 135443 120165 24830 21818 27229 52939 122042 160335 212530 193619 96513 49675
17143 49675 79422 132698 127521 37397 91302 104333 106209 23024 18700 -13624 492 9862
17131 9862 24382 44873 65666 77639 15591 -69916 -70516 -2102 43690 174070 183601 103330
17119 103330 64734 -12761 7394 95266 93467 103775 58357 18669 -994 65970 122466 143157
17107 143157 118766 128896 152007 79396 46673 50711 95093 54396 81371 142686 143083 142579
17095 142579 160615 173599 138677 85019 50206 55054 95635 50589 66902 60120 32608 90087
17083 90087 95339 86955 79715 147923 198382 182159 201247 176917 138836 136706 96636 72309
17071 72309 111754 165518 190930 168539 88238 154222 276769 295650 211099 123759 99252
17060 99252 127598 135003 164762 247713 301344 291307 275964 280600 318209 313100 244241 232725
17048 232725 308335 234062 218180 195000 238544 245977 172971 134042 38177 -12558 -85367 -27394
17036 -27394 31221 10570 -6530 37929 53736 105520 96146 77789 75025 23580 -32918 -44561
17024 -44561 -59483 -16785 54009 125293 162682 169723 157627 136030 126942 155192 121538 178658
17012 178658 191902 157396 212046 275734 303551 319284 291930 251286 275152 264160 196570
17001 196570 187123 209494 248523 271246 186828 138285 126046 191645 229898 231880 197005 138161
16989 138161 87517 131735 134976 167284 238666 192559 158229 150352 91170 37547 50786 47551
16977 47551 63122 49173 -62508 -58677 -17931 -69839 -44063 -64771 -40836 41137 74309 139268
16965 139268 214549 122144 200 17459 -33269 -15246 -9583 12527 106788 121914 45725
16954 45725 24692 82929 129199 148062 144888 154227 140149 56523 -3193 -67704 -70845 -161494
16942 -161494 -142614 -86026 20458 94337 64207 73173 52267 -13734 -20894 34430 41930 87485
16930 87485 85443 92040 66838 -43228 -23208 57505 105074 99096 62778 129607 193230 227233
16918 227233 278404 237849 199912 107808 33066 47213 101096 74541 72647 49428 29859 5122
16906 5122 54723 64654 91281 86227 138708 186579 121020 119259 185646 168208 213023 254872
16894 254872 196502 132349 207201 237836 197840 124855 58074 79529 51933 57655 76358 56516
16882 56516 -12223 39514 76655 108416 184249 182007 168271 224329 252358 252989 216484 207186
16870 207186 206112 168679 99689 82085 117295 148600 143600 149665 85068 98206 99748 134879
16858 134879 90633 77849 42080 8308 20084 86949 139439 179046 187917 208026 201214 174446
16846 174446 189623 159558 203467 204364 197735 176014 83709 13747 64238 55605 32431 53172
16834 53172 104049 98259 149232 161815 174325 132317 82865 72725 122279 154827 138799 39219
16822 39219 4066 -27245 -4072 82854 91351 16767 -14296 10151 21423 7840 3751 13910
16810 13910 81500 155594 156259 158422 196904 198866 201650 194006 133465 45761 46110 101673 165062
16797 165062 155264 153773 154089 165745 199389 182300 142532 115974 128279 160061 179996 170993
16785 170993 204970 176392 219360 194276 122816 177737 270238 259073 245549 298864 262409
16774 262409 258756 308963 334079 322206 249312 131385 112765 199371 221598 192136 210199
16763 210199 180170 184783 274665 260847 242471 218815 201276 214616 118158 102327 145519 277791
16751 277791 354922 327331 312985 291965 306245 259948 214336 216895 227983 182649 129669 58776
16739 58776 97075 152742 94032 68945 169057 195471 197154 169669 89109 19370 -35628 -54367
16727 -54367 -44880 -43352 -46481 -49586 -133314 -177048 -118034 -68426 20242 120553 74819 101432
16715 101432 207483 209074 117664 55455 49093 398 -29284 2273 5419 31826 81993 115703
16703 115703 131646 151454 83287 127543 190268 148381 73044 13179 29181 98783 212158
16692 212158 217459 210456 154214 148848 152080 105420 133914 125173 125055 132938 144247 160253 188699
16679 188699 172546 171338 155878 143377 161715 175362 310776 312094 295394 253664 238017 291917
16667 291917 327801 311009 251989 180076 179691 184635 92004 -29159 -31156 9918 -4036 -1522
16655 -1522 67627 107451 103108 78425 126341 101484 39581 70673 75604 45779 53030 74568
16643 74568 51225 28606 58405 80071 110670 143164 151114 208544 218107 182405 134251 114705
16631 114705 182178 253802 262614 303508 407535 419061 401336 367881 365410 349303 438855 474210
16619 474210 391589 332486 321163 362267 287305 252012 263701 303286 289359 260677 318518
16608 318518 309164 312110 194015 184402 203929 178096 245088 342382 331425 201143 200731 180265
16596 180265 183578 182075 140316 173488 229931 238984 279998 225965 208728 234230 181996 113821
16584 113821 94924 149049 139919 110240 153428 204853 159142 173867 146839 152021 166494 141033
16572 141033 138986 88786 125281 172585 231173 197149 124825 141365 186735 153915 163959 98420
16560 98420 6408 -44114 63579 161322 143661 49013 -9797 -27582 102058 180251 160231
16549 160231 202185 180539 112835 69397 137800 207038 188412 148485 95260 63612 72190 80865
16537 80865 104988 99443 97687 71709 59197 113140 183121 215761 161706 132658 133173 139313 112816
16524 112816 127748 149480 226387 256521 219787 190402 158320 210952 226126 206030 240465
16513 240465 236075 206851 222858 205052 123104 85334 127577 201223 190750 145228 159837 251031
16501 251031 296102 304090 342965 276635 274693 208116 91309 70817 83368 199397 256920
16490 256920 254804 298441 310721 350595 398440 309482 213319 217606 318818 337025 372968 455730
16478 455730 405734 379612 414297 402865 380631 421467 464369 479687 406803 336189 364127
16467 364127 340776 350123 351398 355257 501477 623588 592320 577680 543362 546542 566465 509163
16455 509163 524265 578592 621686 680372 685876 743088 833206 835901 797939 888060 974840 1043376
16443 1043376 1108537 1249718 1300163 1405839 1539217 1623624 1761413 1891411 2043839 2200014
16433 2200014 2402991 2604729 2849992 3130611 3559558 4086906 4527958 5104873 5706352
16424 5706352 6388388 7171539 7952889 8798080 9648523 10438222 11241783 12120556 12967192
16415 12967192 13714661 14454875 15164150 15804640 16495567 17190363 17872734 18611290 19426864
16406 19426864 20312214 21205519 22054804 23004313 23904398 24700927 25528285 26276692 26899441
16397 26899441 27354662 27623926 27751230 27795293 27618868 27379037 27012808 26554359 26093262
16388 26093262 25644628 25260752 24981251 24740671 24464487 24317161 24236668 24137411 24018902 23880308
16378 23880308 23696486 23294226 22832311 22412574 21925542 21361905 20849079 20348508 19828091
16369 19828091 19337377 18968917 18747457 18696867 18663242 18664157 18739444 18881509 19065401 19308874
16359 19308874 19566705 19917959 20361003 20840022 21406531 22070928 22696755 23424065 24264479
16350 24264479 24994322 25625288 26261158 26861630 27285708 27554907 27702829 27794227 27775358 27515147
16340 27515147 27182547 26786379 26359418 25970865 25561799 25236088 24980237 24812620 24630409
16331 24630409 24573829 24513848 24497169 24355679 24244673 24073306 23693822 23135949 22511874 21909382
16321 21909382 21283109 20716781 20113257 19425196 18875807 18591846 18506525 18628509 18928248
16312 18928248 19400204 20118712 20915986 21787581 22663568 23598420 24496368 25435480 26382541
16303 26382541 27396312 28385356 29545486 30856418 32231293 33742151 35354648 37031656
16295 37031656 38746697 40553777 42410138 44085379 45489609 46756662 47795766 48565920
16287 48565920 49096104 49513997 49733057 49919701 50015497 50052528 50137625 50223350 50315399 50412766
16277 50412766 50500027 50542475 50421979 50209779 49785400 49051175 48015270 46683608 45230735
16268 45230735 43410526 41451529 39500862 37538819 35735736 34064710 32541403 31158468
16260 31158468 29973479 28808121 27635178 26406894 25175180 23969283 22691695 21409803
16252 21409803 20069338 18692282 17295784 15948425 14823151 13812958 12821668 11943052
16244 11943052 11101771 10430956 9827110 9293458 8773987 8370177 8083860 7780989 7404570
16235 7404570 7025014 6696387 6410504 6190455 6024782 5827864 5621951 5402904 5193068
16226 5193068 4994629 4748245 4655535 4568914 4483561 4445154 4333551 4206262 4087227 3988576
16216 3988576 3862344 3766983 3785334 3744631 3622933 3580254 3625675 3647156 3561057 3474415 3444898
16205 3444898 3499746 3535988 3569574 3605150 3657987 3609377 3715238 3921032 4078430 4156868 4369138
16194 4369138 4593735 4900792 5311379 5783895 6387063 7180409 8237164 9492261 11058047
16185 11058047 13217063 15818805 18864818 22219189 25691843 29233451 32816634 36208832
16177 36208832 39168597 41346099 42610988 42979112 42744168 42221014 41581066 40753376 39878457
16168 39878457 39161774 38659708 38468433 38557431 38735343 38523203 37805729 36551295 34673290
16159 34673290 32369737 29763463 27031389 24150066 21279216 18617461 16398447 14589235
16151 14589235 13190067 12154138 11318666 10686187 10165643 9817116 9646968 9533685 9453145
16142 9453145 9505634 9685916 9993006 10456527 11218588 12196421 13472167 15162986 17481400
16133 17481400 20282260 23311110 26414443 29542227 32562125 35421598 37927530 39726203
16125 39726203 40679337 40920150 40561488 39894705 39320890 38844609 38375335 37998339 37793475
16116 37793475 37802371 37929072 37998670 37745510 36948765 35475121 33283365 30765560 28121413
16107 28121413 25406530 22582485 19812180 17236118 14984872 13209675 11787016 10570813
16099 10570813 9583908 8789232 8125667 7580626 7129932 6778888 6506901 6184629 5924924
16090 5924924 5689588 5466973 5240717 5017341 4803378 4586974 4374666 4228084 3990165
16081 3990165 3871757 3706324 3588167 3486076 3362934 3242334 3141126 3001845 2890907
16072 2890907 2739866 2629918 2638626 2651994 2528562 2423399 2314327 2197281 2157979 2124775
16062 2124775 2024701 1984813 1971405 1866237 1829863 1829437 1773085 1732971 1709400 1639508 1608919
16051 1608919 1600898 1544557 1470264 1459346 1454043 1406104 1387943 1392980 1344483 1242373 1194221 1186474
16039 1186474 1212469 1166213 1097138 1106015 1142749 1098354 977037 925488 964616 1002653 1006402
16028 1006402 1032709 904444 807233 735694 799118 854828 855356 892703 842900 755470 753672 734380
16016 734380 745521 636415 538729 565568 694709 748359 780193 751162 783984 755368 773428
16005 773428 815205 771391 781194 793649 810992 775523 655256 623615 628538 561714 519307 557008
15993 557008 508720 438375 450743 532524 493411 483658 535707 655000 609916 443233 433894
15982 433894 483989 444235 376983 362429 393409 409311 404187 372409 353690 321520 327764 365582
15970 365582 335454 304539 334102 374962 331448 303253 255509 324233 297502 199267 255193
15959 255193 312969 324429 308886 349305 405980 396783 407422 371572 336866 385433 410613 400739
15947 400739 419789 338550 227445 101360 115416 140518 177909 241281 192156 165749 224393
15936 224393 265118 254726 211280 256039 259768 292104 389679 415523 341025 271164 216555 221201
15924 221201 163928 259717 294022 246127 329103 350562 328331 303576 301220 295124 324444 366717
15912 366717 325936 329026 273465 223778 299501 322717 276944 299055 297205 314329 236613 279391
15900 279391 286334 218729 195647 258661 330189 318162 360257 356585 344381 228671 201941 274578
15888 274578 310739 289088 283463 244340 246949 191661 263481 294470 251934 263093 263570 313788
15876 313788 271215 213100 242369 291289 305563 216479 192372 263861 283769 366772 409187
15865 409187 329716 262679 248131 159596 180819 185749 134282 108052 219539 271432 272264 223496
15853 223496 169361 139721 195737 269888 351433 350463 279582 259268 184973 118738 83218 132959
15841 132959 176352 192349 164199 195320 230277 165990 132647 135189 198178 259783 218346 250189
15829 250189 236442 240293 241647 290059 322055 263840 228198 320331 346026 329998 352666 413864
15817 413864 481068 479057 422884 356944 298174 295220 393309 379296 379971 438442 469041 472836
15805 472836 468979 355603 342487 402891 345485 296073 296998 336722 387598 415917 389578 440432
15793 440432 446044 440097 538704 531668 535239 527965 498264 391878 367962 358978 327530 284678
15781 284678 252170 203141 241958 292215 250436 265226 313513 255854 203365 146522 210597
15770 210597 233719 259860 299473 354318 306538 245810 107877 105315 103922 155495 231108 209671
15758 209671 144282 131485 209262 259341 291507 267021 212322 235502 261050 201852 196771 186414
15746 186414 221839 341006 385643 358600 342878 391985 399250 335573 346659 263603 160361
15735 160361 126443 57719 58724 106861 116421 102729 -1384 -16607 -14034 5553 57278 79973
15723 79973 85314 32711 82477 182235 184363 170174 117876 50234 41790 19287 -19500 30035
15711 30035 139481 143587 105448 102288 46576 69253 102196 126259 121776 132888 90442 52219
15699 52219 43767 49079 -13416 6348 24973 63386 92083 41358 -4209 326 42625 1010
15687 1010 -106341 -90641 -37578 -27892 -42805 -61997 -89319 -48899 78763 121914 187953 251527
15675 251527 237125 149202 148556 226281 263595 247784 323139 350344 344175 357283 375297 335955
15663 335955 264863 156253 212811 337861 352854 339697 281812 293587 273067 253418 287055
15652 287055 353972 278653 218241 207682 259228 210999 254372 261718 226149 251262 193168 150813
15640 150813 109835 163084 219323 255740 166784 49027 -11083 108742 183602 142929 142387
15629 142387 186342 234525 108490 68152 199422 246747 247743 254784 251273 321950 284662 205886
15617 205886 203426 213935 196289 195819 179176 229119 334251 328085 288800 269430 297783 256814
15605 256814 207399 178077 161931 219928 232104 177582 116191 56793 28105 82426 72185
15594 72185 41810 18778 33650 12553 -41537 -16774 36426 28943 45393 80831 122509 67439
15582 67439 36560 95170 107644 45108 65166 99903 85802 48637 131866 74458 3160 6565
15570 6565 30199 112170 100430 -14646 -84891 -81603 -27632 5622 93557 98121 30478 -31116
15558 -31116 -48694 -18286 -27448 -9421 -53569 11741 73489 45072 -10842 43732 54149 46916
15546 46916 17420 26186 63544 37365 22641 31956 36675 -15643 -108274 -49021 -10792 -28346
15534 -28346 14020 84344 80231 102533 108505 45730 -43306 -43080 -39556 6238 24033 64388 24006
15521 24006 31969 4710 -17602 -29111 -22276 -34698 -27792 33627 67837 74319 70119 32015 -4945
15508 -4945 4647 9704 15241 -38005 -39193 -35707 -22859 -17312 36704 80282 122587 167079 253116
15495 253116 149010 56254 -2697 -6728 -9140 -11942 1663 -35543 -58715 -77715 -25267 -53778
15483 -53778 -109615 -94230 -77367 -77375 -91299 -30713 73994 100469 80321 15376 35944 7925
15471 7925 -55909 -90376 -7176 88748 81427 70986 72813 96751 100045 52747 28572 104612
15459 104612 102249 33947 84231 70128 32863 -1840 -42760 -18255 36188 78880 35457 -6408
15447 -6408 26957 71308 73396 87382 -3222 -42664 -36646 38034 80067 44906 51356 62754
15435 62754 70689 41505 20156 -11739 -58857 -78309 -40140 35392 84654 66054 45714 90857
15423 90857 41104 14427 28438 39083 12187 3203 -32820 -22883 39089 115128 27113 -63675
15411 -63675 -30427 25788 57105 47685 -3864 49550 89337 51059 19641 22037 54676 -50186
15399 -50186 -41085 -17434 -68859 -89451 -89094 -58381 20876 52777 73104 91741 -15799 -98359
15387 -98359 -91733 -118180 -40382 36774 -27718 -52993 -68834 -26252 53326 30153 -46217 -71870
15375 -71870 -37972 8285 -1238 -80728 -92065 -11972 8265 -38515 13384 23404 24024 72167
15363 72167 41959 84274 66809 100117 66110 -41093 -55492 4102 32534 33045 29299 -12630
15351 -12630 -22416 -29906 -28506 -56929 -7912 36740 84147 93501 34412 15650 -2029 -40424
15339 -40424 41565 99620 125076 73982 43624 1284 -4109 32179 27052 -11675 -81451 -89230
15327 -89230 -72907 -73027 -100263 -57745 -40199 -48081 -16467 36404 46352 47949 -81210 -113007
15315 -113007 -55179 -1580 14919 -51288 -44989 -2701 -3637 -36319 -44498 -87666 -136202 -126085
15303 -126085 -121282 -124078 -123443 -86674 -32652 23115 26645 -41600 -12698 31578 58107 -19826
15291 -19826 -81497 -74401 -99342 -82480 -87266 -136819 -163041 -163765 -118274 -36623 -17469 -20247 14855
15278 14855 75925 84542 79981 87905 80499 -27374 -122605 -86848 281 70150 81798 60306
15266 60306 19303 70470 105416 79524 31057 4739 19837 70978 48984 -10045 -68447 -109771
15254 -109771 -120111 -75736 -43916 -53346 -75071 -26952 24263 33542 30815 55646 67296 65805
15242 65805 4052 21081 30055 -7265 -13761 36741 45850 126745 151053 77894 36767 50889
15230 50889 31065 -31689 -33766 -22446 -25450 71613 84831 49536 -58386 -56999 8683 18542
15218 18542 -36781 -12466 45196 60861 144128 215496 221481 155823 24581 -61617 -11354 64111
15206 64111 74428 94262 52186 -1919 -92337 -71631 -80705 -84849 -56624 -71041 -37433 -67006
15194 -67006 -89821 -66028 -12309 -28654 -44045 -3435 14200 82792 133335 55057 71590 58434
15182 58434 123379 110062 25113 48036 2361 -99184 -117184 -97628 -48824 42219 73452
15171 73452 35115 -23199 -80301 -23263 -36429 -60894 -5916 55428 134387 88724 52900 145021
15159 145021 68544 71296 103412 35817 2517 -46822 -36926 27691 163728 127622 24431
15148 24431 13432 12441 -37426 -25501 63310 41843 49939 88202 77634 38664 41843 69040
15136 69040 66522 18260 -23458 -4688 45671 38370 67141 -9259 -72512 -52345 -9189 -39182
15124 -39182 -71394 -55350 -24337 -37472 -6226 -13059 -9611 -2912 -10327 -6649 59420 94800 85758
15111 85758 -2919 -52995 -45261 5321 51157 47562 41058 92202 189368 132957 24760 -27744
15099 -27744 -14364 5947 29533 24800 56625 33618 38193 2798 -35089 -26132 12806 14267
15087 14267 49970 -4713 -81381 -29815 63639 -10246 -40597 -44612 436 8598 -45609 -48066
15075 -48066 -26918 -13725 -937 54065 43302 60209 52070 59341 22855 -15052 46463 71227
15063 71227 21587 22708 -72176 -111098 -77909 -46695 -19932 45069 65201 24093 -73956 -157377
15051 -157377 -161328 -81026 -54966 -80415 -187481 -164109 -120614 -94999 -133222 -107989 -103493 -72297
15039 -72297 -53393 -163533 -193601 -86535 -21616 35525 862 -29373 13208 19187 1188
15028 1188 -116347 -163780 -123369 -108578 -89671 -60180 -42901 -12129 1130 -32357 10709 -21680
15016 -21680 -29771 -30749 -72224 -85491 -79489 -97000 -49677 -7894 -35235 -44066 -19247 47146 49727
15003 49727 40336 84686 119560 82640 86679 94013 78879 129664 55092 -55064 -77537 -102637
14991 -102637 -51894 4988 3921 -14211 -51424 -127703 -123658 -75348 -103475 -115879 -55722 -11014
14979 -11014 -8901 37543 31640 8962 36568 89196 92624 32782 10476 20087 -19587 -94977
14967 -94977 -94357 -64129 -131166 -122169 -52540 14856 3973 -8356 -45346 -58440 -18150 -19265
14955 -19265 42051 68321 54505 19366 -3437 25116 2593 -29000 -89328 -128776 37294
14944 37294 122165 170038 224003 194423 140424 39270 35288 9908 47272 60028 -38039 -47179
14932 -47179 -79895 -80684 7667 -37299 -108655 -63237 -46479 2826 94164 157698 91142 21256
14920 21256 -26733 41615 121507 114870 11981 11345 16587 -20535 16677 -405 -47909 -28089
14908 -28089 -39271 -116097 -83057 -21010 -10214 -4340 -21739 -51779 -31927 -40953 -14209 42140
14896 42140 34372 -59485 -108405 -126509 -108802 -66075 -46371 -30901 -23786 35784 24492 18428
14884 18428 52684 107050 110013 64768 66186 5653 -25784 -61490 -58270 -30961 -62552 -82388
14872 -82388 -66769 -2418 7069 -79523 -76177 -111521 -139656 -83137 -118888 -117702 -75460 -59233
14860 -59233 -30279 -19671 5954 -68645 -146226 -115019 -100302 -100647 -67869 -81094 -151824 -68198
14848 -68198 -27373 -126437 -89629 -59549 -62981 -99608 -13571 23817 -49632 -96827 -80726 -155824
14836 -155824 -148071 -128589 -42459 -16596 14813 828 -15481 -27798 -69089 -14633 35023 -6121
14824 -6121 -69086 -42667 -19344 -18193 -46085 -76471 -71442 -113221 -130994 -31370 -21227 -96000
14812 -96000 -199983 -159059 -49036 -98168 -67159 -14107 40857 -15389 -73251 -127559 -52251
14801 -52251 68886 95007 58874 -27572 -84618 -117433 -64239 32952 -5779 -51090 -63558
14790 -63558 -128011 -117627 -134580 -142588 -75636 -100451 -122395 -74761 -65280 -84759 -87475 -106252
14778 -106252 -149841 -219997 -122068 -70956 -43831 -76841 -132575 -120709 -79446 -149088 -136051
14767 -136051 -109547 -121361 -60976 -16326 48660 4557 -17929 -64861 -29588 -17737 -36370
14756 -36370 -42431 -68675 -105158 -26407 45026 78893 65421 135362 66296 7159 30371 116805
14744 116805 114037 71352 1542 7301 -15850 -48660 -83833 -1281 36311 3805 13013 124969
14732 124969 120256 19804 -56889 -77419 -69725 -76267 -66971 -48819 47708 107206 107185 99592 22098
14719 22098 -25910 -55072 -71384 -79083 17823 49502 14384 -33079 -27174 18487 52126 36350
14707 36350 43 -31300 47857 92688 138949 142172 85642 115653 113436 78795 -102086 -173840
14695 -173840 -138419 -194747 -211313 -105204 -40848 -68670 -51569 -89594 -52682 17698 34417
14684 34417 1100 -46540 -60853 -65440 -28239 -22220 -74324 -115983 -111841 -6843 26757 -42264
14672 -42264 -61144 -106027 -113227 -93445 -21670 28646 47763 23829 -37512 -85146 -160322 -209816
14660 -209816 -104878 -55594 -30926 51783 59692 60564 84423 16672 8864 -56205 -16203 -13637
14648 -13637 -17790 -25701 12799 -50565 -124653 -114858 -163195 -91647 -72524 -52250 -60947 -76626
14636 -76626 -46038 36282 -66436 -134177 -169577 -139559 -142147 -141615 -126120 -106275 -97683 -101093
14624 -101093 -102770 -109573 -87458 -108586 -70685 -75253 23666 148152 106777 -15181 7601 -11136
14612 -11136 -49508 -82519 -50914 1367 871 43250 145232 157637 131622 135332 107792 49788
14600 49788 71529 74857 -6469 -16290 -40633 -57607 -107150 -98023 -156523 -102948 -44937 -52301
14588 -52301 -34459 -60635 5562 68050 -11981 -151047 -132042 -61566 -45068 -48016 -31485 -34574
14576 -34574 -91271 -73215 -72737 -84744 -67712 4509 27223 59889 86670 37102 -24581 -51314
14564 -51314 -22838 -12306 15048 18971 10232 32909 -11661 -342 -30672 -69249 -53572 -7462
14552 -7462 5190 13731 29592 18586 -36484 2868 22730 31524 46278 66274 65248 13669
14540 13669 1377 66405 102774 50675 6264 -29972 80371 148358 55634 -2616 40028
14529 40028 6010 -35651 -152691 -108732 -24007 -71990 -48711 -18627 -48383 -52463 43628 80769
14517 80769 67966 -28909 -90486 -60688 24206 80773 121287 102390 55093 -84680 -72775
14506 -72775 -35918 -43555 -82812 -69128 -28717 -70016 -101013 -79358 -35498 -43318 11692 41210
14494 41210 30186 24605 -46879 -130184 -181566 -203411 -190277 -134403 -135269 -94341 -72231 -33431
14482 -33431 -49494 -82913 -115334 -94149 -26476 -31413 -20631 12035 -28147 -63246 -70368 -95835
14470 -95835 -126239 -121525 -38706 42371 47933 -7253 -71674 -143840 -118067 -41768 -49768 -52117
14458 -52117 -19119 24875 -34 51286 62995 22403 -42993 -60742 -5402 14703 21219 61704
14446 61704 137940 164734 67757 -37537 -96381 -73008 -86581 -72406 -73129 -108421 -147378 -142015
14434 -142015 -132820 -162188 -125347 -47559 17556 7771 13893 24523 26080 -24146 -20225 -46048
14422 -46048 -89 66530 69115 19250 -69216 -34389 -3357 -11054 -6725 -25021 -90629 -99001
14410 -99001 -107509 -55054 -23988 4567 30981 -22694 -100706 -106897 -94613 -102228 -108970 -132305
14398 -132305 -142638 -59511 -69694 -47493 -41287 -42398 -107097 -82434 -8910 4817 56080 110673
14386 110673 97399 355 -5964 -10600 -66717 -90352 -121110 -145129 -147815 -141403 -183967 -230986
14374 -230986 -197697 -136662 -88595 -56268 8639 -2028 -39148 -30973 -94121 -179141 -154501 -62593
14362 -62593 -4560 -28361 -28419 -81960 -150282 -118240 -85335 -41873 -3910 18144 -36923 -60961
14350 -60961 -140772 -149040 -100944 -86421 -47326 19077 80815 -21123 -11159 -40483 -18698 31855
14338 31855 46397 24009 -21950 -52577 -69977 -36841 -58250 -45165 33840 35797 -27383 -3781
14326 -3781 -35473 -71022 -86640 30884 -31693 -95191 -140075 -88059 -10592 -619 -17748 -7349
14314 -7349 -69472 -12394 35182 35853 14611 66213 80205 32991 -5059 12294 34876 -2491
14302 -2491 -116110 -82829 -37273 -32442 63639 58689 4101 -1314 5585 -11058 -76392 -72760 -66546
14289 -66546 -2638 -33971 -88037 -79182 -55056 -31208 69764 51465 10737 35925 37938 79396
14277 79396 100732 13987 -88363 -102585 -79307 -44756 -8445 46637 48644 41374 65183 32409
14265 32409 13443 40564 21834 55771 97890 108670 107802 50972 -48235 -31587 -19192 -29143
14253 -29143 -87620 -82140 -55518 -74443 -45274 -4083 -20531 -48126 -35076 -83754 -108623 -94017
14241 -94017 -148321 -180048 -209391 -269813 -236405 -136952 -64663 -9507 1348 -20687 42313 51489
14229 51489 5547 -25682 17707 -2101 43956 141424 185818 109996 11342 -22096 -8648 27089
14217 27089 1363 19791 18817 -5834 -25268 -13577 108865 138463 120234 83608 128314 174826
14205 174826 128366 62000 34892 -18571 -33658 -67929 -103396 -75279 44549 24005 -22221
14194 -22221 -69565 -149215 -112865 -48766 -98673 -81518 -52740 -94519 -111112 -146589 -147002 -123225
14182 -123225 -41217 -91973 -61231 -47859 -44695 -46174 -100257 -130054 -145102 -146991 -146750 -113577
14170 -113577 -92693 -77251 -32830 -51832 -69746 -34131 -47680 -148917 -102164 -89074 -76470
14159 -76470 5440 2379 -51843 -90270 -66801 -76049 -48022 -48788 -81237 -94171 -138977 -115638
14147 -115638 -81302 -17777 2318 -35271 -45140 -14512 24742 10630 12954 57726 42103 50343
14135 50343 -11036 8001 24299 -3863 -15978 -27977 -23282 6143 1972 -49282 -83828 -38249
14123 -38249 50137 61970 41085 21941 -34851 -56291 -31601 26602 -592 24502 -7711 -65194
14111 -65194 -93519 -42658 -43520 -128978 -113837 -51398 -56738 -78490 -17968 -22286 -66318 -86432
14099 -86432 -83247 -37002 -28605 -21462 -21170 25488 -7128 -46339 -118312 -153599 -73955 -61240 -39041
14086 -39041 -106345 -88955 -27216 -54312 -119334 -101618 -70561 1332 83107 169354 170491 85957
14074 85957 -8188 -12234 6916 -47683 -19598 -8367 35151 52081 -80718 -134952 -107957 -44326
14062 -44326 -59403 -112550 -46544 -35351 -50636 -47721 -104102 -169083 -139533 -80694 -125274 -108170
14050 -108170 -66623 -54314 -30091 -2376 -37452 -57271 -89316 -44691 -41987 -39385 -23056 -43513
14038 -43513 -109315 -155896 -127727 -98225 -67749 -71373 -96364 -76859 -106327 -19227 16358 -41351
14026 -41351 -30298 -5608 -70926 -70866 -92015 -33059 50952 30702 16628 19936 47533 37533
14014 37533 33959 -6808 -51283 -91862 -66310 6097 35252 -25126 -44732 -80734 -119473 -79782
14002 -79782 -82419 -139710 -126126 -77136 -39333 12439 -13545 -64751 45006 60257 82710 92154
13990 92154 21485 -22200 -117623 -84355 -70292 -73426 -65237 -40665 51997 22146 -46997 -48960
13978 -48960 -109746 -89794 -51048 -76791 -71065 -26654 62193 89288 49376 -40133 -26063 87191
13966 87191 51847 -20035 38 96596 32012 -39744 7554 258 -11719 -91769 -88897 -59747
13954 -59747 -33683 -40991 -65919 -69129 1848 62779 43274 25929 -33431 -103891 -69071 -72690
13942 -72690 -104473 -17058 -20303 -30329 -25757 -10754 32007 -2501 -27730 -17903 -22798 -99274
13930 -99274 -145510 -105081 -79020 -106802 -63740 -98799 -126389 -153434 -163923 -179516 -146383 -108126
13918 -108126 -58942 -33271 -30105 -40426 -102072 -153442 -137975 -83069 -135959 -60093 64157
13907 64157 34858 15914 48922 21840 -41594 -55654 -85324 -92096 -111350 -120800 -143199 -142306
13895 -142306 -108482 -69033 -64201 -32668 2370 -32994 29768 50974 4852 -11653 -24421 -39548
13883 -39548 -135795 -136427 -42934 -88672 -70855 -106454 -114283 -132570 -137760 -91419 -112860 -81575
13871 -81575 -18423 28305 27738 -66667 -69110 -14369 42066 -11665 -34836 -66447 -97152 -95566
13859 -95566 -92346 -47786 47719 81250 80354 28972 -3830 -71232 -103725 -96030 -114948 -79902
13847 -79902 -62837 -33370 -102828 -119947 -79589 -42501 -137154 -164879 -167539 -112222 -94958 -17738
13835 -17738 -7121 -57958 -138715 -186774 -157415 -155416 -110262 -53471 -49782 -131628 -135957 -101299
13823 -101299 -53359 -61510 -60822 -62445 -25615 50611 42695 40600 78176 107481 24162 -17194 19768
13810 19768 59629 81535 -964 -73498 -110529 -69042 -59559 -74135 -138231 -109819 -60060 -3907
13798 -3907 14559 -45316 -74523 -108777 -136780 -168555 -221344 -241613 -210795 -176029 -140122 -140725
13786 -140725 -77149 -52080 -66609 -116890 -59426 7044 -25601 -84925 -115709 -55643 -57275 -202982
13774 -202982 -221601 -136099 -94456 -32688 19250 27741 -28703 -66056 -48249 -86136 -66667 -12968
13762 -12968 -2896 -31640 -48894 -49419 -112486 -72869 1883 -5176 2571 4374 -59718 -88400 -41241
13749 -41241 -19400 -140292 -156469 -83168 -84031 -65319 -12476 -77869 -179531 -184123 -126610 -36153
13737 -36153 11837 -44213 -47951 -60503 -53142 -60288 -22341 -44179 -163397 -201195 -137056 -72263
13725 -72263 -76221 -39935 -14213 -19886 -3107 12163 -63266 -95358 -46311 -65926 -179736 -242319
13713 -242319 -247570 -127755 -90963 -68581 -111709 -140973 -136071 -189493 -131985 -50006 6182 48170
13701 48170 25182 53928 58821 -6968 -55391 -33398 6117 -17676 -128012 -145422 -77330 -56465
13689 -56465 -29258 16384 34817 45158 118074 149018 136067 93460 65649 16693 42114 -28289
13677 -28289 -59283 -63922 -50625 -16040 26075 3231 -74362 -89560 -81561 -17754 -64572 -85320
13665 -85320 -107785 -101192 -41733 -9419 -10413 -7496 38764 968 -10241 39174 5323 -74969
13653 -74969 -105614 -91663 -6495 -3971 -34428 29424 16749 -53662 -44297 50888 63054 19798
13641 19798 59396 -703 -33413 -81731 -146874 -72913 -6028 -5198 -46156 -87016 -78668 -84653
13629 -84653 1204 12165 -5960 25178 58286 37139 -268 -73715 -73069 -157677 -110876 -37242
13617 -37242 -91863 -149317 -148901 -161108 -134651 -147579 -145735 -148532 -111120 -22083 33952 15314
13605 15314 -57531 -59137 -98181 -154146 -151851 -155223 -142507 -111806 -6130 -18241 -145400 -111903
13593 -111903 -17132 -23173 -115564 -66152 -21469 -92014 -138450 -84078 -77414 -97791 -93477 -109684
13581 -109684 -127856 -76415 -14420 -56 21040 743 -87587 -147049 -101058 -57937 -76939
13570 -76939 -102608 -94778 -78642 -103595 -121191 -117263 -90886 -62057 -33670 -9932 -2684 -19010
13558 -19010 -92755 -70504 -36527 12983 16669 -4004 -23537 -28960 -51644 -34975 14877 4714
13546 4714 -38138 13699 39651 -48158 -75585 -63044 -23118 5966 58493 109969 60220 -27915
13534 -27915 -24596 -41867 -80402 -59975 -116029 -150490 -116975 -63364 -71601 -49034 -13540 20137
13522 20137 18342 -48808 24291 55808 -53377 -98688 -122274 -173780 -203307 -163806 -136758 -83754
13510 -83754 -54893 -58638 -38139 -48709 -981 -32274 -30809 -90520 -107633 -59818 -138712 -110962
13498 -110962 -74489 -40132 11661 20821 281 -59839 -32102 -82971 -83342 -41896 -5862 -48901
13486 -48901 -88906 -134032 -104407 -41708 -92068 -67029 -105762 -65921 27209 62044 5423 46848
13474 46848 46620 -18109 -38426 -58156 -40571 -64281 -104873 -68706 4478 -41103 -92504 -45239
13462 -45239 -20994 -31857 -61911 -32249 -83020 -100128 -180843 -215865 -109403 -94487 -73347
13451 -73347 -93929 -69902 7448 -45656 -158770 -200894 -125737 -57470 -25839 -12505 -31694
13440 -31694 -47639 -16290 -84732 -97680 -27109 -12096 -43914 -70652 -51894 -42412 -79544 -103731
13428 -103731 -128914 -160452 -160148 -121077 -114314 -79545 -95199 -127202 -49665 20512 -19051 -65853
13416 -65853 -15054 6205 -34554 -6837 -54294 -147145 -173313 -102757 40859 5957 -19411
13405 -19411 -14644 -97543 -118646 -110118 -134578 -117229 -96541 -42953 7256 -80217 -182711 -158783
13393 -158783 -20875 48130 38015 -35549 -29125 -58966 -96683 -108533 -114424 -162069 -154009 -150987
13381 -150987 -75997 -83164 -53486 -39845 -91915 -28077 -24700 -49475 -81482 -80861 -77080 -114202
13369 -114202 -138000 -145203 -132575 -96072 -51904 -6454 -47524 -90937 -63524 -39389 -13374 -45679
13357 -45679 -121066 -195669 -161627 -21149 25498 -3547 -57593 -105731 -104411 -48904 71692
13346 71692 87465 -47825 -95974 -28233 37621 30999 -49795 -116355 -148288 -113225 -30850 92593
13334 92593 21683 -90413 -115765 -82445 -40028 17985 -28636 -65201 -81766 -37010 -12037
13323 -12037 -26960 -22843 -13695 -13860 -44703 -18261 12955 4408 -34951 -53067 -17507 -53492 -60087
13310 -60087 1686 -4272 -31019 -20746 -18108 11646 26692 -265 -47549 6305 17184 35456
13298 35456 7904 27550 23003 -24882 -36577 -20003 16587 39620 -52418 -48647 5126 -59356
13286 -59356 -100338 -132558 -86813 -15324 -15028 -50226 -63652 -12781 9982 5298 39055 -6451
13274 -6451 -27130 39205 -2392 105213 96496 -10094 5210 -10696 -71055 -124175 -143814 -129815
13262 -129815 -134241 -167168 -116646 -80482 -67597 -93249 -141540 -126636 -13664 -11059 -3286 -91864
13250 -91864 -112783 -55296 -6156 90227 183193 143177 86111 61739 30246 98999 88535 57406
13238 57406 29519 -82996 -150236 -175214 -175071 -82034 -93456 -50824 -106305 -120555 -118631 -104826
13226 -104826 -65633 -78927 -110269 -35766 -24049 -6802 -40755 -62268 -42007 16258 -35478
13215 -35478 -83873 -104878 -57905 -14638 16105 -78767 -25045 -47392 -154286 -126967 -70878
13204 -70878 -31319 -36500 -109370 -139680 -116585 -72448 -75700 -105674 -108992 -96054 -64245 -94622
13192 -94622 -140008 -93156 23364 80920 108518 31426 -88081 -108110 -108771 -115870 -12949 45764
13180 45764 -69009 -119862 -66660 7857 -84416 -122025 -134692 -148475 -111588 -79736 -85352 -76138
13168 -76138 -74879 -73643 -31323 -34042 -35284 -70918 -115296 -140459 -161417 -153019 -165076 -91148 -12138
13155 -12138 14546 7100 -2368 -15373 92694 118998 29817 -17215 -40077 -76470 -117362 -87559
13143 -87559 -79848 -94483 -85260 -108039 -90668 -33431 25479 -17612 -13112 -35336 -75562 -143425
13131 -143425 -79763 -47475 53884 103552 24528 -23599 -20295 -18784 -41581 -75179 -51786 -34740
13119 -34740 10729 -27099 -33683 -43662 -117849 -78051 -73790 -37957 -38796 -49659 -40315 -71984 -141691
13106 -141691 -83333 -73749 -175266 -142765 -118306 -72506 -141563 -127593 -71954 -36146 -15584
13095 -15584 199 42648 22153 -44194 -110228 -107226 -81741 -54286 -20224 -27330 21103 35868
13083 35868 62811 89691 18319 -55121 -19002 69652 101123 40419 25813 -18980 -18184 92947
13071 92947 140930 126895 85256 153540 160278 170509 149876 126599 85762 85579 98509 62716
13059 62716 73982 56484 44015 -35858 -71830 -27567 -25290 -72558 -149121 -82294 -13146 -318
13047 -318 53450 52967 6684 40240 -9632 -72276 -21139 25302 -8116 -4751 28792 16766 30324
13034 30324 35688 92101 147929 158748 169793 221101 243544 368090 515307 674214 724037
13023 724037 711106 666719 655961 648153 566738 472715 330921 175830 157429 151055 161857
13012 161857 180002 222192 235197 159061 45995 2571 4331 58648 67005 71059 84066 72641
13000 72641 50009 26748 -12777 17412 53920 86046 108881 63681 10085 -702 63356 55818
12988 55818 35473 72322 79064 91381 96194 195409 360011 492886 643729 753379 874260
12977 874260 881536 786776 774544 733427 575456 442837 284258 158657 162862 97505 105648
12966 105648 114535 58729 14785 -27593 -74267 -65642 -25299 -61055 -85206 -75743 -47085 -38961
12954 -38961 -12475 -70827 -122634 -60442 -55888 -17325 101749 144127 46784 2452 -51459 -43852
12942 -43852 -29835 -49342 -1662 36847 104236 11694 19392 89002 106242 168421 138409 111443
12930 111443 125288 174315 197892 201400 135623 35590 -3436 29289 40758 35356 30292 19817
12918 19817 -43596 -84365 -37561 12470 50473 95015 92479 89575 32474 -42009 -20560 -2925
12906 -2925 -45757 -72763 -1886 77808 26979 -87276 -132358 -75885 -37764 -78978 -92366 -92675
12894 -92675 -13926 -38351 -105268 -121273 -58281 -48596 -62431 -60883 -45374 -1288 17344 54398
12882 54398 100396 105973 61667 94907 45249 -24038 -46103 -11371 16438 -40819 -3022 33340
12870 33340 -51696 -44783 -16535 37443 -6260 -78417 -113589 -141825 -153580 -45033 2165 48363
12858 48363 78247 56282 40724 -35323 -47354 -2993 -20139 -27979 -66590 -85258 -53863 -8464
12846 -8464 -50690 -99071 -83657 -47146 -77147 -7617 -16862 -79319 -75095 -32494 -26962 -53609
12834 -53609 -65011 -50160 -18400 51071 161165 107688 23271 -21621 29516 61051 79535
12823 79535 68494 -15453 6809 -30138 -73782 -15954 -10846 -23936 -36684 -33293 -54100 45264
12811 45264 111763 97325 6658 -68614 -79956 -119209 -86040 -62787 -83324 -96439 -15747 50039
12799 50039 6514 -24395 -35309 189 16856 19832 31807 3715 -13951 28091 120505 90342
12787 90342 29257 38372 108226 65012 80647 99781 57161 93104 144043 187004 209089 201522
12775 201522 278585 260466 173931 147724 139606 114740 175496 213019 210243 127992 101971 107798
12763 107798 113666 45260 -4952 -24594 27580 82961 96901 37308 53094 24500 -52860 -55072
12751 -55072 -28053 19912 56609 59824 98734 83491 90991 112362 117934 122481 61844 806
12739 806 26152 65594 106209 111177 34810 -18362 -337 46232 -4410 -3387 52363 133648
12727 133648 168295 96782 1796 -5005 32053 56196 80391 104627 160180 172130 170291 54203
12715 54203 14032 88125 91737 83196 116640 67450 38964 -23739 -80714 -24016 7341 30876
12703 30876 75572 109895 149714 104791 137680 171574 132053 26730 9536 31479 29673 -15108
12691 -15108 -29507 -39931 10414 27432 74215 105470 92458 116052 160267 212830 182805 67711
12679 67711 -6581 -32762 29526 91679 108332 56308 34160 128416 221767 200368 226061 197277
12667 197277 152101 115602 102365 114917 58473 89716 96611 69633 61444 16338 -34383 -23785
12655 -23785 16952 67707 134204 94241 59004 4438 18618 5956 23104 63237 67111 107752
12643 107752 130955 139655 122345 171767 202980 234141 167008 128422 164083 187888 198957 210555
12631 210555 233008 259764 199886 196675 208374 252839 289061 243084 248180 312136 292798 298920
12619 298920 344488 335623 350740 308151 340006 424388 364330 333117 311942 385646 366204 325650
12607 325650 323318 386839 419316 396418 360544 338373 371570 408995 373337 335691 336280 333449
12595 333449 347946 320250 269078 294933 336328 348084 383500 417325 415006 402478 360135 333726
12583 333726 377141 387442 340528 385082 475606 482903 436871 449579 433455 339867 307455 280356
12571 280356 323242 411611 341741 325968 300044 226243 180182 246143 281659 325672 398444
12560 398444 406584 415041 412095 367189 314691 303192 260083 302663 390909 398034 374891 350174
12548 350174 288221 264430 256210 312007 425833 399266 367567 381042 381681 369809 305075 331681
12536 331681 373245 390722 367609 341999 363935 347496 358902 415247 420992 420665 468813 473072
12524 473072 454952 466024 500281 503173 456728 468451 504599 435052 413105 511779 501791 467233
12512 467233 483599 490893 496027 460185 533311 632307 636926 652699 624318 573149 505719 484728
12500 484728 539230 625411 626662 637390 586423 612264 653230 676165 674720 735610 693986 653414
12488 653414 659837 633133 645070 651883 704562 721242 690278 718081 723691 737975 762153 785620
12476 785620 707793 753476 693463 595602 552305 563689 509355 498770 521240 557478 602695
12465 602695 627588 619145 615113 613859 589908 580256 572586 593387 650524 648879 681227 689641 700655
12452 700655 672288 674238 652434 628280 635823 650943 609471 634913 692518 642197 563160 580755
12440 580755 575555 511630 520981 519868 496006 525621 534752 604985 640830 592529 648365 683975
12428 683975 649769 596362 618886 634674 667583 687136 614353 595172 584926 661313 695935
12417 695935 668860 658304 656584 619316 520236 457295 406510 370970 305521 363598 462647 523981
12405 523981 547567 536845 509277 499269 513931 442778 425167 411718 364385 394604 420314
12394 420314 448354 522455 520927 458953 427243 346967 347777 442265 495552 481885 428765 412195
12382 412195 348101 276535 297920 380407 444589 528695 524007 496443 487840 482017 473987 536742
12370 536742 578157 583570 516995 529170 512221 555288 664472 769895 792090 777675 733614
12359 733614 631533 664529 682226 672082 650715 658502 673800 691067 669890 666256 646691 649726
12347 649726 654689 663593 645332 672555 642387 748418 719061 750896 754693 727675 671446 711442
12335 711442 717526 791067 834893 870056 894723 823117 838333 886678 934270 1004691 1048899 1136987
12323 1136987 1195249 1219276 1233806 1204177 1144856 1151649 1126638 1054942 1063409 1071474 1128614 1165930
12311 1165930 1099278 1054812 1026779 1108844 1229574 1263551 1222420 1215298 1223460 1228375 1266000 1321172
12299 1321172 1360734 1327413 1322290 1300809 1303723 1373025 1392226 1416133 1428477 1384096 1454033 1530985
12287 1530985 1500122 1438418 1453309 1583642 1678700 1718164 1696912 1724583 1781606 1782765 1807389
12276 1807389 1770684 1732485 1724762 1719976 1741647 1792609 1805228 1825474 1876362 1862563 1892702 1969129
12264 1969129 2029714 2034331 2049219 2095168 2130732 2130009 2114650 2180662 2257178 2266175 2292979 2361041
12252 2361041 2440516 2494313 2573923 2649843 2645684 2686507 2785202 2898070 3017896 3136089 3187370
12241 3187370 3168709 3215156 3280177 3371698 3469068 3571580 3626035 3654603 3757172 3806459 3822759
12230 3822759 3928223 4140962 4309833 4413848 4570734 4707026 4899325 5045452 5098835 5233425
12220 5233425 5409753 5647329 6008073 6273780 6527444 6778615 7085469 7427304 7763126
12211 7763126 8088710 8445024 8773161 9143885 9565373 9975832 10353513 10660695 11167827
12202 11167827 11669134 12325145 13081946 13764030 14481932 15308931 16336670 17393824 18587284
12193 18587284 19893549 21370472 22997877 24795916 26857446 29094703 31519482 34251704
12185 34251704 37303116 40664502 44374549 48394430 52814309 57578652 62755696 68416835
12177 68416835 74585709 81119162 88083045 95419514 102871437 110292786 117381905 123904126
12169 123904126 129597347 134258765 137582503 139516221 139894542 138711810 136186018 132456034
12161 132456034 127746426 122385928 116574782 110528221 104464819 98466932 92719982 87295162
12153 87295162 82270221 77559468 73267820 69353303 65727431 62368728 59230563 56418063
12145 56418063 53916033 51671591 49528781 47624877 45913714 44316285 42823376 41475852
12137 41475852 40303361 39347718 38450304 37588357 36846671 36177480 35608948 35086606 34564183
12128 34564183 34156470 33835040 33496341 33147954 32905344 32733850 32522290 32474422 32499212 32561852
12118 32561852 32700273 32901242 33159402 33435640 33779693 34132185 34690942 35440649 36224116
12109 36224116 37099822 38055972 39139698 40415710 41834490 43385010 44920970 46515915
12101 46515915 48231399 50055686 51913594 53880956 55791592 57728573 59736827 61755519
12093 61755519 63899449 66101937 68347913 70684014 73182002 75783036 78560515 81371520
12085 81371520 84340674 87604758 91015907 94663764 98422141 102235965 106175982 110071065
12077 110071065 113704143 117241268 120516056 123426737 125921266 127945009 129329941 130159644
12069 130159644 130504753 130371866 129732561 128565307 127024201 125287237 123447864 121483949
12061 121483949 119417781 117177500 114967729 112730203 110435002 108102547 105693225 103273504
12053 103273504 100817254 98333261 95973652 93603873 91338767 89186378 87135102 85154814
12045 85154814 83321765 81691892 80340807 79106432 77917929 76913065 76052939 75311478
12037 75311478 74726163 74189572 73705045 73210376 72682328 72203957 71596695 70977544 70344871
12028 70344871 69643332 68886156 68013267 67077936 66086895 64972525 63899142 62824522 61700240
12019 61700240 60543229 59280669 58044300 56829564 55583056 54257806 52918504 51571766
12011 51571766 50265105 49015727 47861296 46708418 45720532 44792807 43828949 42922848 42189309
12002 42189309 41550315 40916515 40267546 39794459 39351318 38856790 38338313 37731976 37067649
11993 37067649 36295257 35442859 34520076 33466499 32389376 31193348 29927363 28732222
11985 28732222 27440299 26169339 24941756 23841195 22748718 21680507 20691718 19749762
11977 19749762 18845366 18001108 17199006 16505531 15857285 15171371 14617517 14125849 13630466
11968 13630466 13191996 12761274 12425163 12077563 11668307 11271245 10939283 10680335 10399676
11959 10399676 10189637 10025609 9861617 9625450 9410192 9190847 9029974 9011418 9083588 8994800
11949 8994800 8863893 8683293 8630767 8650149 8701560 8734770 8754016 8788047 8854291 9027254 9235417
11938 9235417 9447770 9778044 10188978 10586855 11096584 11710514 12447650 13351522 14461175
11929 14461175 15852772 17553737 19658982 22226801 25560141 29872723 35698089 44030623
11921 44030623 56030269 73440166 97845112 127769733 155721556 174909919 186502916
11914 186502916 194040291 198880329 201080573 196447095 176242619 142129707 108331473
11907 108331473 83183805 66186438 54584655 46460196 40495533 35985799 32400611
11900 32400611 29564098 27179103 25256903 23619636 22231422 21116501 20191283 19440457
11892 19440457 18813890 18323159 17959481 17625807 17400258 17368190 17525551 17764609 18073235
11883 18073235 18581766 19243010 19901281 20508048 21072716 21445395 21604071 21417912 21033542
11874 21033542 20397278 19501236 18509604 17262090 15938325 14645862 13490558 12408084
11866 12408084 11524823 10733030 9995573 9358561 8817839 8330915 7927845 7611589 7362602
11857 7362602 7123911 6843011 6650848 6481957 6253916 6098701 5899444 5715109 5613704
11848 5613704 5470237 5286688 5159928 5121723 4994835 4898358 4758946 4669213 4633766 4516501
11838 4516501 4371831 4350891 4230917 4118016 4051725 4002882 4021116 3969831 3908144 3839835 3706525
11827 3706525 3632003 3537375 3497396 3447113 3340966 3237884 3170181 3154302 3097215 3113424 3189900
11816 3189900 3206349 3164337 3083208 3068903 3058577 3022528 2993040 2943011 2935473 2864436 2803536
11805 2803536 2787517 2858954 2897497 2929929 2988873 3073954 3066100 3028006 2990894 3012653 2974803
11794 2974803 2939400 2951629 2975384 3065814 3080782 3072827 3199162 3227474 3348427 3345821 3372933
11783 3372933 3411776 3459577 3507296 3599808 3665526 3767806 3839623 3887452 4110904 4307847 4467737
11772 4467737 4639462 4884267 5090336 5418573 5751543 6062398 6387972 6822622 7270277
11763 7270277 7721343 8171843 8709426 9437244 10160976 10871880 11644086 12475384 13347788
11754 13347788 14363671 15456620 16474427 17417418 18285075 19032671 19618786 20058940 20490779
11745 20490779 20672060 20643874 20573621 20443730 20179094 19901667 19689859 19505240 19353928 19236442
11735 19236442 19153992 19133196 19270009 19595722 20064123 20562613 21114863 21801695 22590148 23433842
11725 23433842 24368439 25251351 26326359 27398217 28298134 29186559 30145176 30948926 31757679
11716 31757679 32389497 32895201 33317000 33683304 33977963 34147753 34136424 34073235 33935364 33754036
11706 33754036 33485798 33104869 32660780 32137407 31631439 30946844 30173751 29422299 28661756
11697 28661756 27921642 27130775 26338203 25630884 25018134 24503524 24061590 23755501 23584934
11688 23584934 23418971 23299677 23408249 23616055 23950528 24252341 24624589 24975398 25309248
11679 25309248 25735853 26028924 26149441 26220778 26111010 25921903 25499513 24938553 24260467
11670 24260467 23514723 22685123 21795038 20848536 19963328 19090778 18159155 17353245 16609558
11661 16609558 15883335 15271629 14768594 14291656 13864380 13432421 13006074 12617771 12254202
11652 12254202 11975193 11864544 11688550 11495931 11380901 11274486 11139962 11067556 11030279 10970180
11642 10970180 10931757 11011332 11146177 11299424 11416840 11472564 11617432 11936396 12298271 12587689
11632 12587689 12947185 13349063 13702315 14133683 14618663 15212034 15832034 16514279 17082255
11623 17082255 17662210 18316749 18883820 19343721 19708520 20016077 20260387 20360416 20331408
11614 20331408 20224835 20050009 19908686 19711742 19457481 19178132 18963225 18795332 18622938
11605 18622938 18520909 18409028 18431678 18483908 18612305 18816341 19051934 19338901 19753095 20266502
11595 20266502 20872580 21733062 22543159 23329081 24224777 25212794 26162414 27157738 28097667
11586 28097667 29087888 29978144 30771828 31473561 32058647 32477084 32702328 32817483 32702310
11577 32702310 32368403 31923404 31418569 30791375 30044798 29152963 28174697 27150761 26153167
11568 26153167 25156620 24203032 23319513 22397943 21580792 20842390 20173821 19607678 19107647
11559 19107647 18742105 18489504 18277469 18214220 18188981 18099671 18134692 18261630 18448407 18679004
11549 18679004 18813708 19026131 19334108 19571554 19758664 19880505 19875568 19810545 19579656 19293710
11539 19293710 18920771 18437202 17764057 17090890 16427412 15656235 14924696 14155551 13402156
11530 13402156 12692866 12071965 11434269 10798931 10190106 9639752 9157388 8661800 8243497
11521 8243497 7848181 7436817 7199388 6956358 6644846 6320271 6045923 5817522 5602528
11512 5602528 5453240 5221313 5058451 4907544 4749864 4594395 4456200 4311458 4140572
11503 4140572 3942529 3791140 3768474 3678740 3575070 3498926 3361401 3268569 3125071 2975051
11493 2975051 2896355 2938091 2892880 2755875 2633480 2538596 2455955 2340629 2297220 2242727 2237709
11482 2237709 2278948 2244658 2166820 2042753 1942010 1951917 1962716 1924572 1889663 1883791 1849457
11471 1849457 1825930 1844430 1797688 1714095 1635363 1574546 1518821 1494418 1547214 1559361 1553791
11460 1553791 1552678 1490695 1450382 1352430 1255130 1199760 1165184 1244848 1278869 1244965 1201150
11449 1201150 1212254 1261384 1272078 1285668 1296930 1384398 1323484 1293052 1263805 1252567 1236133
11438 1236133 1191725 1144439 1110727 1093677 1079659 1078593 1067119 1024427 956189 893731 934049
11427 934049 980560 970546 1027342 1033470 1028198 1001725 1020135 1032481 1010871 1028660 1050162 1031881
11415 1031881 972796 944211 912528 884240 825076 865632 919818 890255 887956 793561 748346
11404 748346 803936 862734 923831 1001281 952588 823132 783674 818344 792859 771929 807323
11393 807323 792705 770044 828200 796996 785951 811562 791711 701942 623708 630619 698377 697280
11381 697280 760946 797937 746087 689791 707967 690649 657836 662776 681910 673198 642718 602611
11369 602611 528038 470182 445742 442685 479371 520900 478897 437131 436348 548545 670318 643312
11357 643312 589004 490536 473363 497129 530937 509805 509233 514744 558591 573596 535187 449353
11345 449353 445935 444615 479482 512138 594117 555818 476182 381052 353537 361085 403055 454452
11333 454452 421125 417118 482367 453374 400981 326828 314175 317512 392573 366831 352937 380967
11321 380967 286964 255951 340707 386044 303995 262673 360017 404189 425266 459774 451576 460722
11309 460722 438116 389401 351293 292027 338416 367355 375533 367196 318819 287570 368253 436910
11297 436910 441902 451127 427182 402481 453931 390574 321331 394842 366177 435362 419615 443053
11285 443053 503690 472419 398236 378875 458330 489937 415906 437450 446411 528662 572073 560783
11273 560783 524913 355275 289577 265990 313433 259322 258048 226085 259449 282147 303020
11262 303020 368797 394689 411031 432101 370979 344211 385390 390307 360404 330145 349870 390931
11250 390931 346277 288816 238491 140218 207925 270537 387334 426050 379378 384795 384334 415229
11238 415229 376105 379609 357294 265631 233049 291048 331062 364586 405680 399993 408633 444757
11226 444757 487024 463510 408064 325375 246731 324630 347017 347337 360649 350832 343430 351341
11214 351341 377270 326084 291777 237627 194690 277760 377086 355836 337446 333125 272222 229670
11202 229670 207134 313637 383441 327834 329195 343887 334351 280992 246905 235342 187335 147988
11190 147988 144190 228995 269631 292250 315463 310926 216921 125584 153426 189441 309499 316290
11178 316290 334517 311690 281819 260459 278487 262246 204441 150675 101354 119824 121878 180186
11166 180186 186833 270368 296008 301236 354826 338028 267204 269895 228965 155002 159118 210111
11154 210111 194922 249563 293691 358001 366881 370117 379171 359609 312432 316130 407067 375651
11142 375651 352236 395661 414173 371918 321200 267275 246792 213661 243641 228632 262599
11131 262599 353333 358814 298943 247089 183311 169114 266178 273725 229085 218421 256853 270610
11119 270610 306556 336185 354196 398696 350746 235594 146364 148792 172372 209467 269898
11108 269898 290372 249676 209192 159721 177808 148072 151772 231497 244119 255628 295435 269016
11096 269016 143921 149329 156385 173200 157598 101436 112749 170185 130759 83404 71145 119191
11084 119191 165439 170506 117231 158828 145867 72808 58560 54626 8299 36260 9717 42183
11072 42183 67387 133888 183831 176428 171424 161748 81926 61745 35156 9519 1561 18562
11060 18562 105364 115861 81294 92884 164253 148941 139812 140070 98822 41924 58190 103210
11048 103210 82055 94638 206752 276919 206750 233303 232087 225060 179329 216844 305628 346153
11036 346153 323314 303909 300240 292620 333128 421488 431900 414031 367781 380835 425743 458731
11024 458731 469371 509850 536772 517181 498570 547780 520094 503876 521185 484121 491905 506455
11012 506455 478631 485401 490269 444526 388913 436398 446506 464219 486718 497278 486221 481862
11000 481862 527402 520653 477374 439784 362423 281408 307322 222174 185418 214055 232459 178728
10988 178728 182039 240060 232623 261221 237244 232588 245377 241038 237414 118044 90441 102242
10976 102242 190450 237690 157573 99930 114727 122976 71555 95413 106449 116660 181747 157427
10964 157427 86481 95601 167503 222629 216907 225904 218515 206051 193668 150010 225781 271606
10952 271606 232510 189721 139115 100450 120359 93326 65685 52400 101757 108562 134525 125764
10940 125764 105071 111735 102047 154976 216113 206663 168561 211724 227240 241146 213810 124089
10928 124089 121192 162727 150959 121819 103748 116454 50203 13999 35350 113788 133516 115994
10916 115994 128939 154517 192988 143868 166351 180847 122815 117305 85405 77590 90666 53745
10904 53745 13138 -63150 -71646 -24386 56696 53384 5501 -39362 -98777 -53651 15899 22549
10892 22549 67781 73560 63774 134785 137256 104231 137594 111064 60882 45744 71231 108960
10880 108960 166284 129800 65220 84538 96478 65891 67894 63692 47847 90182 172371 158988
10868 158988 158770 93007 99061 169716 179604 134648 81009 119508 185990 216637 256165 285908
10856 285908 275146 240867 183278 178324 130952 109494 168725 237331 228716 176356 184434 169997
10844 169997 169863 115876 67454 64158 30370 91356 155376 204976 182078 150591 127420 126437
10832 126437 153839 137854 196190 263407 240882 137612 89609 70840 101400 135281 107219
10821 107219 123322 184510 212573 201435 175941 146722 168318 109408 177064 207496 162723
10810 162723 158101 94020 110154 134540 177409 171602 100289 45265 33695 102603 186005 200975
10798 200975 176974 75772 55499 147425 179963 197289 211146 234342 143377 101201 43431
10787 43431 7422 49984 71121 50171 42436 28483 -25796 19417 80736 86896 173903 172023
10775 172023 149372 50795 41082 108129 174461 151962 53882 -13682 17870 46266 69050 37786
10763 37786 58178 127421 156272 207354 201377 216555 275791 320871 256061 214232 176133 197181
10751 197181 166578 90815 42896 119822 165456 111758 105367 37254 -5813 -8058 50198 100201
10739 100201 122142 164943 130244 53331 55664 29035 15777 21271 6489 -3747 15916 67504
10727 67504 78070 102879 157128 202606 219982 235529 221056 255808 274479 321732 351386 272978
10715 272978 211435 224582 216352 230052 204856 164416 126155 118775 128890 135520 206097 206313
10703 206313 222900 272184 192467 152947 187866 236086 219752 333844 306338 273389 233409
10692 233409 311777 350850 345532 398033 412230 337424 350533 363604 336304 349411 375651 471673
10680 471673 426966 412087 381793 307466 337970 370061 361965 358579 364284 340536 369165 398042
10668 398042 439191 503082 484934 442159 460953 531707 487637 446913 386856 404674 353300
10657 353300 321602 327110 360967 424588 555658 604935 642384 642396 605575 544962 456804 431486
10645 431486 583813 671426 648427 593640 590302 697486 785536 847092 903731 926092 898820
10634 898820 899539 951940 973719 1105625 1265954 1410700 1522341 1669134 1833139 1953913
10624 1953913 2044770 2215448 2395643 2689501 3043971 3372039 3786185 4401157 5187660 6221049
10614 6221049 7476554 9188304 11416172 13966047 16645327 19213474 21474521 23498549
10606 23498549 25409897 27199335 28711028 29881141 30971606 32653824 35435870 39253701
10598 39253701 43475331 47390332 50667381 53403288 55681121 57644387 58951607 59142279
10590 59142279 58583053 58622972 60358784 63852571 68085948 71858226 74633874 76550082
10582 76550082 77676276 77907681 76716586 73412151 68567665 64148912 61550355 60845534
10574 60845534 61189885 61471870 61354078 60900816 59960054 58461833 55977704 52058349 47257381
10565 47257381 42850429 39556184 37485868 36208127 35182275 34147255 33036099 31666513
10557 31666513 29895871 27703393 24997282 21939176 19038783 16574235 14581112 13112723
10549 13112723 12015651 11117045 10357915 9723691 9175145 8702353 8253808 7821227 7479963
10540 7479963 7112344 6783435 6597604 6381356 6100856 5869997 5643299 5411819 5170288
10531 5170288 4999898 4799824 4651729 4651634 4433174 4290696 4165384 3995394 3886748 3760643
10521 3760643 3602621 3485066 3416334 3265378 3081087 2940405 2943361 2852515 2730796 2682992
10511 2682992 2635616 2484348 2415985 2443062 2403533 2312451 2161995 2105571 2102603 2023795 1975211
10500 1975211 1903332 1867118 1764147 1745725 1780871 1716201 1617002 1524673 1469860 1478926 1438036
10489 1438036 1428601 1415430 1326708 1253350 1217151 1217874 1273422 1283685 1170802 1110976 1054555 1004674
10477 1004674 1035616 1016687 1020797 980476 940322 966776 970801 940477 942365 927826 938106 866640
10465 866640 825724 836170 808038 765939 734478 706298 671756 654647 692085 721219 747840
10454 747840 682537 653559 629441 577586 541712 524691 492035 505235 555646 561349 525860 551493
10442 551493 562689 499156 573571 564422 538477 485501 427304 393679 360482 394116 411881 373318
10430 373318 424542 461844 454735 454629 390955 336043 367359 370095 345196 321556 310754 295563
10418 295563 341375 324221 323598 355377 337106 373085 383047 334561 338947 356485 365246 350236
10406 350236 341665 305394 261637 322181 358254 304801 345610 309914 311610 241959 174969 163715
10394 163715 253377 253811 305291 352941 341578 274269 235605 274662 260338 193902 187069 296727
10382 296727 297724 193544 173622 216879 230380 229489 236830 182957 208638 236955 204068 215459
10370 215459 243094 251481 267354 341522 339255 305660 257937 279067 320218 315587 273271 170647
10358 170647 141686 197059 117630 62622 86937 109535 168002 215196 125809 28521 31279 74629
10346 74629 117767 202216 214840 185824 244428 183187 137984 164781 240823 329312 356313 328646
10334 328646 228490 234564 218667 173534 149355 210177 212168 141650 112927 103955 79432 39021
10322 39021 94684 121384 87727 147720 137339 148177 168139 123612 160735 170272 182755 194031
10310 194031 200881 225745 198249 174924 239075 256346 184672 125501 73722 27142 19762 1059
10298 1059 26364 71882 97986 88962 156332 224227 250280 214737 133875 146019 160775 182501
10286 182501 138897 47037 21984 67191 70455 116453 195085 267102 227071 99694 72987
10275 72987 52508 40257 -9428 84237 109768 148884 233638 189834 146960 133309 107744 124605
10263 124605 146971 80927 72700 122803 160692 131902 74122 117559 165421 159769 131540 138029
10251 138029 123759 142918 112308 54447 -4190 40984 31420 15625 -35338 -12897 14292 50366
10239 50366 16491 -16441 -884 14798 12533 89821 46568 25199 94024 177722 212405 183458
10227 183458 155876 136698 87419 40877 72065 101301 61258 145484 166162 61415 8844
10216 8844 52051 86910 64862 80212 78675 90029 70250 56329 -28236 -104079 -103758 -35165
10204 -35165 12334 99374 130995 27957 26224 111075 85825 67210 26036 32406 96736 139835
10192 139835 163756 161214 116378 75184 51824 111464 222218 226081 125557 86699 142218
10181 142218 180995 147098 93559 65765 56742 148131 221033 221374 281505 367563 324038 268954
10169 268954 198957 222473 198134 92150 90901 202209 201132 181658 232378 262145 336987
10158 336987 465042 494547 459249 476759 511523 504067 464752 395872 411103 408708 454274 469819
10146 469819 460778 409587 376108 440111 462456 339781 285388 307665 300394 307729 300909 309563
10134 309563 276876 315191 301540 300293 305955 272843 216553 185524 240123 316083 375434 420169
10122 420169 393047 352511 215207 146908 115168 82578 79430 173339 221349 272928 328824
10111 328824 279226 204662 235369 221109 110434 130769 161414 208394 219028 243269 216269
10100 216269 230617 221214 123394 66766 29854 -59002 -101046 -49428 -41127 -22149 -4723 39112
10088 39112 19532 -15248 -21441 4349 -24642 19350 54608 43239 -6503 -77499 -78388 -17237
10076 -17237 -14504 4465 11267 25234 61188 62840 68514 51165 59874 120056 102475 115557 59011
10063 59011 9988 -5758 -33493 -1677 24477 61072 51621 89014 153392 64577 35695 12034
10051 12034 126444 160597 130108 80986 111286 111802 127020 105695 103079 126957 145288 147637
10039 147637 148037 118298 72044 13170 -29574 -35360 14606 56151 72685 95840 85550 80537
10027 80537 77105 109184 92681 60966 116050 101110 51109 122028 223090 225265 237105 244449
10015 244449 206869 188548 153819 130557 115516 80774 61336 87920 55444 37560 26518
10004 26518 81891 19409 -36276 -27730 40503 39428 153703 199247 135345 102219 146341 151193
9992 151193 161448 168761 109639 128077 84115 76084 113758 200644 191801 116856 80435 95708
9980 95708 113615 123918 75239 54603 115050 110422 52539 4260 -44073 -31675 41194 140143
9968 140143 212921 133924 110119 60423 36372 92625 114809 107762 83139 35453 49623 105008
9956 105008 124419 65244 26662 26702 -972 28773 28753 19893 148373 135787 129297 193554 156614
9943 156614 188565 224300 184529 105493 69254 62288 118551 165462 181633 180911 191041 216293
9931 216293 243504 181555 114064 108582 123904 164311 199260 190598 252894 246831 202548 182535
9919 182535 175666 136866 136896 261865 282314 238911 243435 233619 193755 194690 228590 203751 156884
9906 156884 97331 122662 235085 260013 188194 200029 183127 179801 185387 228841 172768 164441
9894 164441 196517 161891 113341 119412 172055 220547 225522 280697 280467 162113 98104 103255
9882 103255 85513 139694 163010 102523 143331 138047 76420 112786 149011 121602 134822 188833
9870 188833 181716 206187 226059 295934 408281 327319 221634 243477 271164 242696 313198
9859 313198 310372 258769 216760 260792 263628 237089 199962 157486 131478 147499 225334 281556
9847 281556 257917 252267 226875 257224 273888 247413 256522 328701 361705 273910 289347 275541
9835 275541 328667 320308 269030 244717 217633 195750 205957 211465 198965 112355 76844 76589
9823 76589 183510 236901 237972 254111 269484 310577 277265 332291 337977 317332 292722 321260
9811 321260 432634 467042 474432 377487 323566 330965 360355 331291 381253 414039 318868 262916
9799 262916 292499 283373 233853 245233 304900 356460 349726 329709 344088 405014 460841 525618
9787 525618 500933 477561 457206 465566 479336 496812 524240 554077 633909 786844 1025675
9776 1025675 1461758 2076230 2726913 3191841 3367052 3384958 3414759 3508186 3542908 3227259
9766 3227259 2536819 1786147 1361354 1067552 859207 707022 583734 525910 537075 587149
9756 587149 565150 476537 409294 484092 596181 620084 583297 503529 460200 470682 509033
9745 509033 506169 495648 470957 407698 327355 328153 362264 376168 360307 382306 456704 483270
9733 483270 512120 504649 464440 390218 407257 415049 396239 380489 365166 317244 335679 387315
9721 387315 385197 356105 302389 297758 396946 443787 407158 372909 398637 420875 403324 337128
9709 337128 299154 326638 307439 407928 380120 409352 397232 392733 402150 380896 374289 394929
9697 394929 371213 323451 374793 426419 367484 372052 465313 513265 496081 481154 468722 529861
9685 529861 597055 644642 667887 692970 683180 627274 617177 608084 612637 580002 554422 607456
9673 607456 558845 494500 527050 549824 565949 619632 625771 619280 652538 648565 635877 645904
9661 645904 700443 739043 743001 760923 860492 912374 914920 920147 1006614 997767 931221 899281
9649 899281 879946 902924 867301 924747 1025052 1038452 1039331 1086825 1160668 1223946 1256346 1290539
9637 1290539 1359217 1394425 1436351 1459553 1512168 1536312 1570876 1645826 1697880 1832321 1918834
9626 1918834 2048563 2191737 2243664 2317883 2425428 2501600 2569047 2697331 2818495 3006374
9616 3006374 3202235 3360060 3537187 3717606 3946224 4105961 4235453 4413701 4607932 4768237
9606 4768237 4993187 5108248 5127186 5262708 5394805 5452526 5485287 5583719 5722729 5771979
9596 5771979 5776144 5807882 5929558 6105692 6245686 6423380 6652620 6833230 6952292 7145872
9586 7145872 7425986 7752412 8091957 8412497 8785535 9300754 9754279 10226568 10750543 11252217
9576 11252217 11776836 12304811 12775342 13272076 13788111 14361374 14827465 15168841 15462339
9567 15462339 15723187 16005367 16267612 16381350 16362685 16278145 16100817 15947283 15821747 15708187
9557 15708187 15631294 15563912 15423703 15288655 15253931 15144684 15096914 15163823 15243734 15354339
9547 15354339 15565320 15825555 16069576 16418171 16820870 17269347 17684979 18281480 18887194
9538 18887194 19496605 20074292 20712701 21325975 21806123 22295892 22729999 23125820 23426178
9529 23426178 23646054 23796331 23799294 23811796 23717017 23477503 23088314 22610060 22132436 21648108
9519 21648108 21170167 20704589 20241050 19765836 19365729 18970564 18607955 18305178 17982946
9510 17982946 17752613 17611418 17432559 17298984 17284210 17313285 17397064 17498231 17590375 17730140
9500 17730140 17939885 18231554 18464911 18720109 18942770 19182327 19366994 19616857 19725826
9491 19725826 19758260 19737829 19676380 19577221 19506834 19402858 19186579 18876322 18592940 18305770
9481 18305770 17934077 17631670 17367348 17118641 16986520 16844652 16596228 16350115 16226396
9472 16226396 16152634 16093680 16054501 16003210 15886834 15670683 15639112 15641395 15602587 15569810 15575436
9461 15575436 15597013 15628131 15668241 15721810 15709126 15789357 15891234 16025014 16188572 16334889
9451 16334889 16535334 16770314 16991539 17275556 17588371 17818603 18084293 18399956 18777942
9442 18777942 19047744 19312948 19664792 19985702 20288752 20563543 20716113 20897037 21137839
9433 21137839 21342254 21545803 21695228 21778550 21866252 21933048 21909467 21830023 21809447 21714083 21571061
9422 21571061 21434291 21418154 21398325 21352817 21290469 21240834 21272040 21278831 21432269 21639007 21795328
9411 21795328 21959488 22252830 22630323 23022547 23357215 23739002 24020987 24326680 24743014
9402 24743014 25107853 25324663 25485587 25698182 25893879 25987334 26057010 26012809 26121014 26044649
9392 26044649 25923717 25772870 25504595 25259345 24980085 24622167 24243332 23887400 23517264
9383 23517264 23098307 22683544 22226731 21820790 21448596 20996265 20629696 20319803 20031614
9374 20031614 19857529 19775674 19687458 19696805 19631921 19581062 19588352 19579819 19557344 19552967 19576044 19514954
9362 19514954 19363408 19282209 19171067 19018318 18824549 18483160 18146129 17815875 17462230 17097199
9352 17097199 16716356 16240190 15785044 15309825 14804246 14347812 13770719 13247049 12794780
9343 12794780 12332892 11869888 11461726 11086219 10697307 10310160 9993620 9754038 9475724
9334 9475724 9260748 9071860 8871246 8780494 8599110 8449087 8385357 8341050 8145094 8016147
9324 8016147 7904399 7749307 7574035 7416684 7240239 7049760 6904197 6717760 6434196 6114610
9314 6114610 5846882 5649189 5431740 5280337 5112514 4909191 4670264 4497491 4265243 4032018
9304 4032018 3842004 3622544 3511588 3376047 3224126 3181391 3106163 2993120 2874248 2793554
9294 2793554 2657722 2609617 2540872 2462384 2385663 2331445 2235476 2188997 2191753 2100208 2013809
9283 2013809 1998086 2012600 1976810 1906103 1730050 1643043 1667304 1652673 1686546 1561941 1460500
9272 1460500 1444375 1498413 1491856 1413881 1396087 1375165 1331148 1269686 1247010 1240572 1235836 1210918
9260 1210918 1160489 1171220 1112603 1064092 1028067 1070103 1118082 1109307 1080917 1045380 1025460 965872
9248 965872 918803 1001011 961759 925244 842680 823069 767057 683520 704427 727932 704302 685540
9236 685540 667392 786296 874296 850537 866517 858103 755378 690869 710267 757847 730362
9225 730362 736321 739637 767819 759352 864038 868413 830559 757821 745716 709957 614982 678784
9213 678784 732859 719691 695512 728585 777978 756485 809981 897448 909661 861493 723625
9202 723625 710070 662524 721807 775223 735507 684317 680784 666847 672878 700350 711392 717558
9190 717558 747837 720821 680997 661245 748091 788475 766755 723108 800359 936461 1007259
9179 1007259 999828 1040772 1179835 1224294 1225714 1241795 1291423 1410585 1533072 1680900 1779779
9168 1779779 1854598 1976029 2080607 2160651 2207108 2235449 2159789 2142655 2154913 2120731 2047169
9157 2047169 1960133 1831549 1732998 1643860 1555492 1504784 1389379 1267619 1182787 1051442 1017621
9146 1017621 1072300 1126720 1165539 1106600 1047625 967393 993087 919679 886003 898820 852665
9135 852665 791453 772028 762008 808552 874798 864628 813389 795363 791927 729590 672195 689870
9123 689870 682387 748033 763458 714038 648685 585882 508228 523637 581484 657054 697587 701816
9111 701816 664934 639654 683631 666638 622654 600139 677137 606346 612798 598727 583850 566374
9099 566374 574652 596373 615732 592621 598808 558955 587178 603482 552302 500505 469473 509465
9087 509465 577835 568407 590343 589331 560781 538257 527078 454984 452943 456222 452439 519993 560013
9074 560013 512759 409221 452497 524528 581785 467737 481963 560124 655959 700955 706393
9063 706393 628096 573338 633001 625549 534180 482277 475497 521402 576509 581477 622045 586142
9051 586142 588612 585826 548574 515885 549219 639326 586271 576485 617393 643326 597442 614298
9039 614298 639174 747728 704769 601587 619135 681775 644577 721180 740202 732403 721260
9028 721260 711128 692462 738349 833940 931543 960853 999251 1002409 1012207 926436 883992 926614
9016 926614 939993 896750 858024 901912 899944 953583 964422 951031 934370 955208 1007505 1037757
9004 1037757 1039762 1070876 1024619 982174 956498 967572 1005064 950265 1008499 1035120 1021647 1041072
8992 1041072 1139691 1195126 1242160 1307029 1325042 1356061 1342917 1344901 1441528 1530274 1592240 1705547
8980 1705547 1720735 1775051 1831008 1997136 2140375 2195133 2343172 2421194 2476363 2534309 2553583
8969 2553583 2583994 2652554 2682494 2627804 2557632 2511135 2437484 2391249 2230241 2107475 2042913
8958 2042913 1978272 1907796 1776180 1694392 1560853 1464668 1462522 1470425 1411764 1346347 1280830
8947 1280830 1288289 1282036 1229370 1201936 1198601 1186161 1151775 1178326 1139719 1091773 1176677 1167838
8935 1167838 1103940 1076371 1111399 1074407 1095536 1123730 1149237 1149946 1149516 1131552 1171291 1249781
8923 1249781 1255223 1213949 1276711 1315770 1283699 1223713 1216733 1197636 1261530 1308514 1317941 1308212
8911 1308212 1367677 1343994 1345747 1375609 1413693 1397017 1443301 1452361 1494912 1533927 1540726 1556298
8899 1556298 1653086 1676340 1625210 1606781 1717493 1798353 1806640 1813152 1826102 1905460 1917698 2023258
8887 2023258 2032994 2034019 2089339 2136406 2140213 2221515 2263034 2301939 2279795 2395763 2492838 2601187
8875 2601187 2732878 2773668 2829780 2892778 3049145 3176270 3304017 3566946 3874840 4077452
8865 4077452 4212954 4407197 4613969 4819375 4971664 4979576 4844187 4679602 4425267 4180516
8855 4180516 4052488 4019313 3896536 3799692 3784480 3791809 3767452 3812355 3921707 3902743 3932425
8844 3932425 3998959 4095482 4163315 4320440 4385619 4535422 4662129 4649976 4685758 4840559 4988791
8833 4988791 5104592 5269713 5503348 5710169 5896581 6075485 6243627 6402882 6555627 6876981
8823 6876981 7144307 7306304 7454199 7595965 7787141 8030963 8315712 8677014 9019629 9358558
8813 9358558 9693867 10097563 10432291 10785660 11142002 11572854 12150999 12693264 13273465 14003545
8803 14003545 14755706 15573496 16487971 17389331 18471885 19604640 20789280 22106356 23547264
8794 23547264 25230200 27087266 29133907 31367599 33904782 36710642 39881442 43438640
8786 43438640 47469060 51889958 56957730 62744407 69241787 76663622 85129561 94904528
8778 94904528 106122784 119005724 133774461 150638068 169673178 191216521 214978130
8771 214978130 240311145 266192448 291235471 314100771 333052211 346988793 355179023
8764 355179023 356959101 352109098 340827174 324044595 303195837 280085280 256382495
8757 256382495 233456503 212153085 192970811 175968243 160939538 147768121 136268707
8750 136268707 126191345 117325146 109393607 102355044 96025533 90309428 85113848 80440328
8742 80440328 76196705 72289380 68664016 65413858 62488476 59717511 57182998 54862792
8734 54862792 52661215 50549831 48648244 46907822 45260135 43613638 42095788 40614128
8726 40614128 39184159 37825694 36471865 35250158 34121496 33003138 31855759 30803980
8718 30803980 29798964 28852431 28003629 27192628 26436393 25711198 24992410 24316732 23768816
8709 23768816 23297237 22777362 22244335 21744290 21288591 20789493 20405613 20002313 19616487
8700 19616487 19278261 18872554 18434106 18118140 17810853 17522197 17137076 16850961 16589336
8691 16589336 16343038 16113224 15889306 15644193 15450020 15192057 15000727 14784671 14605074
8682 14605074 14477167 14303442 14073324 13893888 13753214 13632171 13483668 13375298 13237187
8673 13237187 13043373 12893052 12674890 12516531 12432438 12373601 12250375 12119649 12005297 11913778
8663 11913778 11849766 11916941 11983406 11926338 11879169 11811848 11790971 11779499 11814780 11920893 11883479
8652 11883479 11754255 11792132 11837852 11851275 11854226 11907220 12048230 12198096 12249124 12258677 12388873
8641 12388873 12518870 12684228 12801611 12899809 13047424 13111227 13209289 13311314 13444360 13670844
8631 13670844 13866275 14068136 14261873 14498506 14792832 15126875 15442371 15727673 16067570
8622 16067570 16526112 16918002 17267481 17705220 18178099 18650002 19171275 19834306 20513813
8613 20513813 21158594 21875717 22703068 23562919 24421752 25369083 26497891 27747049 29076198
8604 29076198 30496276 32056432 33767586 35656323 37724368 39996712 42574950 45419654
8596 45419654 48546631 52042458 55955187 60345003 65253158 70784095 77043919 84086892
8588 84086892 91969429 100968689 111223184 122991368 136388320 151711084 169372535
8581 169372535 189515502 212350032 237783059 265395232 294330302 323093698 349941294
8574 349941294 373062597 390884809 402289575 406483593 403052635 391880306 373671875
8567 373671875 349821812 322266274 293381855 264929486 238428563 214634572 193573084
8560 193573084 175234825 159295746 145572223 133568437 123030136 113765311 105505687
8553 105505687 98232617 91706846 85900565 80594150 75784533 71360041 67330521 63678855
8545 63678855 60368560 57332514 54510811 51895250 49556762 47314578 45217156 43313782
8537 43313782 41542755 39874670 38297319 36800251 35313750 33901936 32651145 31511462
8529 31511462 30541585 29556224 28488767 27466421 26542183 25646691 24848165 24159515 23345823
8520 23345823 22380279 21508068 20766688 19987465 19314716 18800792 18314824 17828766 17429465
8511 17429465 16970416 16569332 16179783 15720644 15211277 14750190 14283097 13800941 13355823
8502 13355823 12926009 12560155 12178434 11822476 11530326 11219868 10845029 10508410 10214928
8493 10214928 9950197 9691936 9419085 9168639 8968095 8800541 8603226 8464889 8444376 8575916
8483 8575916 8743057 8741591 8622767 8505555 8388576 8242713 8119007 7672709 7078148 6617377
8473 6617377 6271644 6020068 5803925 5679010 5560386 5425171 5305334 5189274 5022537 4930605
8463 4930605 4843151 4749889 4591625 4428574 4320684 4329449 4295741 4229110 4189896 4151221 4122829
8452 4122829 4067382 3958878 3860235 3788324 3797315 3758586 3650151 3592911 3594472 3541477 3502794
8441 3502794 3476880 3466708 3520149 3619942 3688231 3687911 3622339 3573101 3589834 3578294 3411435 3092627
8429 3092627 2897342 2686757 2611900 2559956 2451388 2390975 2326387 2256671 2180424 2084444 2131987
8418 2131987 2201427 2173923 2108475 2076571 2032380 1972046 1938266 1864212 1847227 1931651 1976985
8407 1976985 1972784 1897931 1891379 1920789 1995035 1968751 1904965 1825690 1746156 1725071 1738168 1711974
8395 1711974 1724688 1759473 1773992 1847744 1814179 1730020 1708528 1632992 1605144 1632635 1651246
8384 1651246 1674213 1714238 1688703 1777270 1839534 1785412 1771973 1759821 1884219 1956723 1937557
8373 1937557 2025711 2093181 2138808 2219690 2288448 2357986 2420652 2459188 2495859 2510386 2547323
8362 2547323 2685629 2814125 2830350 2769283 2651679 2574363 2526096 2342743 2205590 2125629
8352 2125629 2043523 1997793 1910802 1797349 1735217 1755551 1667553 1512264 1439463 1411987 1407968
8341 1407968 1346386 1357066 1388552 1357420 1384134 1362431 1295583 1207318 1143523 1069068 1102030
8330 1102030 1148324 1107146 1064520 1046365 1047650 1002017 892390 930845 989686 961906 899382
8319 899382 792770 714228 714208 718486 743119 712019 720632 685632 670055 748296 797094 748030
8307 748030 725716 773556 848761 793746 759224 628866 532442 607781 693834 668826 658340
8296 658340 684609 711543 689260 649932 627015 634538 666852 697423 687535 643980 647260 623029
8284 623029 689748 671303 640374 593831 512446 392925 392085 409590 464641 477724 395193 440812
8272 440812 584507 614090 597055 549970 473212 493015 634891 668738 652321 664925 694844
8261 694844 735728 724267 702645 704900 638075 601372 539764 451990 476276 470329 469676 547057
8249 547057 606751 666576 680455 636367 590515 601289 536459 513466 517850 527132 493924 480486
8237 480486 441778 479456 474127 491084 547042 588041 553925 565367 579113 536978 431109 368754
8225 368754 332952 335529 411623 476861 477328 491800 441734 428960 452696 480306 482058 523885
8213 523885 572079 591631 486504 458929 492442 499617 541719 558221 544809 627369 664317 660853
8201 660853 708122 779670 825383 832653 833609 851227 827587 801841 765601 767676 805325 829926
8189 829926 804415 786731 787323 829921 953234 1015657 1035376 1055271 1121968 1232182 1363833
8178 1363833 1518643 1644614 1708172 1789873 1883855 2029255 2141982 2330851 2420332 2502048
8168 2502048 2572457 2596483 2633448 2555084 2480677 2431221 2274870 2073876 1971323 1829509 1683739
8157 1683739 1525019 1370004 1307944 1256229 1172097 1150184 1100816 1034126 943068 884936 852261
8146 852261 777090 675978 616966 551101 516680 473225 501366 548797 575848 480268 421950
8135 421950 482529 414266 350286 348828 352675 370182 397831 483205 497527 439331 448828 399300
8123 399300 434920 472441 406677 374257 328744 287562 236942 253902 292655 362324 473925
8112 473925 398696 415168 398795 358749 366024 279594 296853 349596 377675 377032 413361 386703
8100 386703 399954 414800 404874 311077 277707 297971 330057 360244 408978 414348 380445 261650
8088 261650 213265 197206 196992 145351 196667 283687 312264 319361 325561 320429 294830 288359 322173
8075 322173 367664 374801 269022 159212 169226 227783 284957 281127 237141 155629 148377 195235
8063 195235 158800 189172 264093 276501 284839 218744 208021 222443 304344 324153 258866 258989
8051 258989 286325 196935 168618 139193 104598 124590 136727 125235 141042 231439 283794 299061
8039 299061 246346 214595 183217 266381 301882 302159 256765 214106 210995 295875 336278 292063
8027 292063 262058 189178 110433 101472 165744 168078 176667 224577 151360 125234 193917 226416
8015 226416 210130 189382 177666 232131 253778 182824 170734 216474 304809 291427 283198 242020
8003 242020 247353 158911 91716 146645 141567 131593 156746 113010 142491 209675 239415 316954
7991 316954 348801 360352 362553 338941 285794 283531 301157 309082 304567 281871 298586 339325
7979 339325 322958 296297 184652 127589 142580 176429 142170 134314 211871 225101 231522 223841
7967 223841 205508 176065 226305 215918 209783 220420 219837 133201 151049 259068 318499 315193
7955 315193 321652 339047 366587 326972 248728 224778 274079 274499 262853 235346 238479 304420
7943 304420 294673 253908 291219 309683 298301 304075 231221 221191 257739 208262 124072 144507
7931 144507 116087 120401 150207 218765 171099 112837 174192 212199 185325 120627 88464 190909
7919 190909 216726 222336 170396 84594 51802 102905 110125 37821 131396 184465 140937 91389
7907 91389 49657 109522 149769 129964 130815 93725 71064 101612 88281 85860 75013 80523 51399
7894 51399 61663 140057 217677 208365 154699 150849 205896 182094 182439 206053 164739 224013 270120
7881 270120 235758 211313 192296 161605 137808 83064 96481 149120 117956 87430 97806 57283
7869 57283 37941 85283 64894 26790 1638 -53467 -53651 8047 42898 127911 74866 61010
7857 61010 114936 144182 181971 212502 142346 125735 152230 179676 100537 29276 30010 83820
7845 83820 160024 196031 84656 47984 98435 77625 45988 27811 39830 33090 74267 72248
7833 72248 8634 49361 119001 123227 104158 82590 113196 142711 203035 136539 33633 32039
7821 32039 67002 51200 85934 76709 4520 49455 69240 101663 143830 136519 104704 136739
7809 136739 179827 177711 187847 130644 125116 175022 82037 -1114 -5261 24406 60296 129142
7797 129142 196837 214969 152460 137797 93424 81115 102421 130057 133776 109669 66562 37222
7785 37222 108018 128204 121210 51459 4134 61456 104683 18559 32718 107352 123527 114067
7773 114067 149082 159131 138615 72534 6783 -40983 9150 137185 154790 74783 -55
7762 -55 -86028 -116948 -148684 -150278 -131333 -67795 -1435 -12565 107591 94136 39045 10971
7750 10971 56254 74103 39394 13573 14626 30297 119324 93861 -2214 -7881 -36226 -51534
7738 -51534 -21489 49498 115813 102469 32369 18046 45533 44179 40105 38373 17251 -11944
7726 -11944 31942 65213 35157 15329 -32560 -67385 -36708 25029 25537 19646 11711 57627 108677
7713 108677 135603 161673 167690 181786 129006 151156 178302 156238 133439 144744 157016 208326
7701 208326 168202 138715 95499 115916 78715 -41 94218 183301 137446 108995 53115 4353
7689 4353 -5454 11182 -37680 -11141 100860 101925 -3354 -40798 -51665 -33478 59195 80535
7677 80535 108497 70031 65987 125157 172356 159815 119677 79009 107458 78198 137495 140711
7665 140711 165062 119998 4726 -66760 -11736 77109 138363 120958 153876 98288 16196
7654 16196 72659 85143 117354 88432 25231 47723 142642 101044 66330 106807 220843 225502
7642 225502 152212 122672 171632 217018 193689 200838 193691 146570 194488 198182 106765 116627
7630 116627 136697 70748 72696 96737 103629 78049 11214 -24768 -631 42875 -39866 -55672
7618 -55672 -35147 -892 -14089 27995 33078 86158 137508 118632 34437 21359 3192 -2205
7606 -2205 8059 -78002 -92569 -73736 -38937 -70373 -63084 -35065 26248 31242 6703 -1544 -42612
7593 -42612 11903 9958 -6730 -53353 -74676 -13480 -16862 12342 -11232 10819 23091 46775
7581 46775 77617 117632 142244 72764 -28723 -64080 -38627 -44588 -45899 42137 134817 69876
7569 69876 2176 -17015 -1354 -28281 -19040 10344 -14744 -8381 29744 51204 26066 57158
7557 57158 -43649 -31128 34807 41301 18803 -11108 -31087 492 12306 70610 69043 88965
7545 88965 119849 98433 80043 75068 68162 63595 19709 64546 129414 122729 72305 35005 18651
7532 18651 37232 18958 -24301 -49994 -133617 -157234 -67118 12851 21885 91133 89310 19150
7520 19150 -21288 -51266 -53487 70423 72424 17424 115032 124672 75228 101899 125887 129408
7508 129408 107345 12850 -936 111251 189665 189696 119797 121833 122932 151812 208071 183974
7496 183974 88804 69871 56608 23054 22960 41448 78209 108307 103357 55215 34639 31144 38411
7483 38411 -67261 -70776 -32627 -30095 -73232 -76378 -78686 -82141 -80244 -33095 -899 9547 -32486
7470 -32486 29756 46814 17722 5537 32340 -8750 -6236 35136 25931 21322 -27331 30866
7458 30866 118478 111620 77684 48996 6706 71870 104211 88287 58434 -41154 51555 128709
7446 128709 128295 56201 44219 108752 127594 52605 -22995 -31554 -22314 -28620 32916 1177 -66338
7433 -66338 -51593 1612 89426 80968 63632 19374 -55729 -66598 341 116592 141079 153154
7421 153154 120746 2188 -30592 -26807 -27217 68175 92973 95867 72449 4453 -45175 -95978
7409 -95978 -70298 -37257 21006 51956 70707 41725 54469 82092 61278 88914 42052 -12407
7397 -12407 -29990 -43352 -347 37784 -21276 -12604 21463 33163 -26872 -97608 -73920 -76684
7385 -76684 -105389 -71576 -22054 2962 38949 56974 11511 -20643 -62601 -46751 -1663 33058
7373 33058 -2277 -45567 -90945 -98896 -100955 -24405 -37709 71738 90268 33156 40516 62632
7361 62632 88804 92824 97600 27160 -47880 -46965 -41898 -47926 -54935 -19785 -29104 20441 27920 -33142
7347 -33142 -64572 -47185 -51469 -72492 -20265 7025 -27533 -14664 117449 131489 13584 11672
7335 11672 99716 105366 62872 81376 114467 202408 241758 237447 162699 103510 28979 88256
7323 88256 113979 24068 5669 -16692 -29229 -45390 -50761 -9177 -25298 -41947 -34621 -43382
7311 -43382 11825 -21302 -27100 22987 20552 9051 50536 27004 7693 79764 160391 88886
7299 88886 50193 66702 67199 -20217 -30679 -32408 81263 135139 61530 32651 29531 63781
7287 63781 114795 132709 82149 115788 124686 129743 95860 134633 150372 81002 -15735 -26624
7275 -26624 -72576 -60372 -108831 -150921 -102010 -72775 -76083 -117556 -60092 24938 73518 23368
7263 23368 23980 23819 11760 -17129 -26257 37209 41962 50019 44346 -32792 -39154 -38721 -14571 20361
7249 20361 49053 50450 43134 -17699 -12113 63789 110543 91737 24628 88820 138245 143781 144373
7236 144373 98564 3032 -11817 9365 107732 75589 94143 179591 136657 58672 9828 45179
7224 45179 65350 59018 36683 25568 -16698 3968 36630 -13703 -51629 -105031 -114076 -9892
7212 -9892 -23631 -5045 8642 -17346 -34986 5200 31554 62051 129313 80551 41140 72424
7200 72424 25389 -11382 -48 20438 -43079 -71073 -5842 49001 90777 56335 40317 82025
7188 82025 66220 -13288 22946 60706 119405 110184 61459 20871 21706 31817 27985 -11814 32771
7175 32771 30559 -12263 -13525 -92041 -38732 -1617 8073 9514 10405 7883 -47775 -67429 -47231
7162 -47231 -72753 -98499 -69163 -47566 -39126 -527 115068 193179 165833 92109 65295 45552
7150 45552 63245 59841 30956 15355 -18459 -80828 -45059 33638 -28555 -3692 -26280 -19490
7138 -19490 -29648 -5977 13295 12429 9540 26048 59899 9101 -18650 -17683 -12418 52819 42885
7125 42885 -29646 20122 97141 81635 12574 -24789 -31935 -3295 -9052 35999 39045 7950
7113 7950 -33138 -50826 -30268 16622 112177 161084 163111 113573 71024 55280 -28710 -14196
7101 -14196 -12575 46438 72839 27850 -7037 16094 8570 -14563 -37450 -26900 31814 83232
7089 83232 61036 89680 105317 68527 51731 94001 92633 115003 58348 -51904 -52025 -39619
7077 -39619 13095 14237 12370 15180 10001 41865 -52657 -64300 -45772 -79375 -82091 -38451 14151
7064 14151 54210 60257 61633 126428 187745 104085 89389 121924 105477 91030 125866 53981
7052 53981 -22627 -115538 -164702 -127763 -111744 -61531 -41305 -78336 -22734 -25881 901 -50482
7040 -50482 -72113 -27635 -6309 -41472 8995 55635 -24421 -16020 -25935 -20851 -29116 30770 50863
7027 50863 51713 87780 127625 109803 125337 50350 -86288 -101920 -118324 -50987 58410 126486
7015 126486 157192 68919 1983 10241 36795 34167 15904 9062 -22559 28545 -243 -31751
7003 -31751 -34659 8849 12794 -77880 -132344 -101488 9532 8326 20579 42652 51492 -309
6991 -309 21536 46033 54539 46408 56382 78444 121438 109377 110924 98819 64913 20484 -31695
6978 -31695 -6431 3212 24521 64468 62524 19521 14566 51037 70318 7069 -37636 -34416 12057
6965 12057 -14867 -54175 -37839 -31193 -17181 -72163 -65407 -48930 -14121 11222 31034 75787
6953 75787 78920 1101 -80380 1280 51207 72739 6291 -3529 -11113 -48743 45303 110094
6941 110094 38134 -16655 19576 -3411 -87355 -62590 -39747 8871 -8618 -70230 -66638 -1552
6929 -1552 -18864 -67767 -137444 -178625 -120730 -80255 -95849 -121362 -75616 -18753 1759 -43270
6917 -43270 -18656 31662 50538 37302 27720 30701 -2390 -102047 -103212 -13246 -1355 -28336
6905 -28336 -21237 16458 30595 -5767 3902 56395 35587 17590 29730 27173 8044 45757
6893 45757 65747 70972 38309 67543 19667 2789 -102659 -175936 -116518 -78812 -20935 -31540
6881 -31540 -34357 -11716 22915 85499 111504 92454 41426 20988 22076 48187 61080 13076
6869 13076 44096 102586 152453 123784 19874 97144 71090 7566 -37787 -22429 35373 19013
6857 19013 -61507 -43740 -44943 6074 45985 -20432 -21389 34279 25813 -27004 -98653 -161373 -67444
6844 -67444 -25630 -6028 113470 171808 108868 125550 147534 138399 96929 47991 19999 52056
6832 52056 46670 55105 19817 -61437 -35802 -24855 -55342 -6685 71463 97902 44691 2368
6820 2368 -51959 -41027 37080 41767 28641 -16364 -23701 -59845 4129 -21789 -47630 -33646
6808 -33646 -78927 -75170 -61517 -75137 -100801 2053 103890 61232 72597 2777 -109184
6797 -109184 -113918 -32885 43847 78012 73582 17028 -18439 14359 20700 12377 -14095 -61440
6785 -61440 -94230 -89629 -72291 -38336 5939 -29003 -31611 7214 13657 43082 45358 52387 28152
6772 28152 77169 71985 33019 6596 25063 -103237 -122487 19385 70219 29818 24840 119959
6760 119959 131778 126094 96288 22673 33544 94150 138372 173170 101121 70269 52204 -19604
6748 -19604 -34593 31046 -14648 -19778 25129 61736 46873 68327 34196 43739 26701 -5703
6736 -5703 2520 -13839 -41015 -79881 -18516 -10540 -29713 -15603 -23537 -34170 37224 32434 31090
6723 31090 22787 -5718 -32134 18970 7272 -74610 -73048 -14313 86203 159 -98892 -75034
6711 -75034 -8669 -30526 7658 21506 -40240 -21485 -39018 -10211 -21816 14046 -23237 -55687
6699 -55687 -18465 -56123 -78705 -24255 13423 39414 6739 -4346 -48920 -82518 -68052 -137686
6687 -137686 -252066 -251218 -144082 -70224 -38966 41667 -8135 -23263 -70398 -76323 14674 70816
6675 70816 114916 117738 100269 13269 9152 -31320 -96891 -174609 -177355 -138279 -149047 -154753 -150849
6662 -150849 -100239 -18299 -9662 -43586 -67244 -76420 -38633 -47315 -68609 -86562 -35088 57507
6650 57507 112562 34236 -62051 -27456 -19731 -32783 -804 73908 94410 59532 73508 67149
6638 67149 2279 -67600 -13067 -25524 -5400 15776 30997 -16200 -52685 -76915 -84046 -12203
6626 -12203 -13300 -44757 -53769 74337 76793 11484 -55273 -121857 -69857 -58542 -62061 12227
6614 12227 74456 -423 -2589 7045 -15071 -35831 -79151 -108959 -45740 57902 49773 -3826
6602 -3826 -56788 -38611 82329 152611 109982 80121 27765 31167 120540 88265 10046 -65094
6590 -65094 -16894 -27034 -32659 -65932 -46679 -88126 -80491 -4630 21738 50387 89897 58108
6578 58108 49142 85252 95926 167923 165592 74405 26147 -22454 63841 31847 -108750 -186141
6566 -186141 -122293 -33103 -4973 -45224 11266 28881 -15708 -19884 -73434 -101194 -88777 24795
6554 24795 98084 61709 17978 28154 92459 75516 68472 23459 -11059 44778 98278 111156
6542 111156 116720 47443 45943 -9724 -44625 -95534 -68820 -34234 -10803 -19098 -25930 55311
6530 55311 107027 61959 77800 36800 53675 15665 -25666 -82794 -43417 -12185 -1607 2935
6518 2935 -57504 -36183 -13482 -31184 -8679 73122 59851 110048 140132 57976 -4028 14638
6506 14638 46265 21421 -45006 -64150 -29640 -39577 -80027 -67189 5340 10328 11529 -23989
6494 -23989 -90090 -66543 -125590 -127500 -160177 -112766 -36847 58127 119744 102045 -7403 -45220
6482 -45220 -52373 -41360 -41339 -61404 -25308 -28682 -38935 -38793 -9264 20364 2436 -18887 29272
6469 29272 61525 3887 -9822 -55293 -94167 -143472 -88813 -58526 -52801 9837 50453 4791
6457 4791 -44948 -144322 -91671 -55854 -100494 -43443 33526 21704 -29030 -31068 -11766 52918
6445 52918 53850 37734 17439 -7746 -65002 -140177 21993 102533 85259 34610 -16586 -91063
6433 -91063 -96978 -38526 -28128 -68685 -59252 -46581 53289 45142 5562 41624 28481 48202
6421 48202 81043 39581 19689 6155 -30378 -53075 -49602 5797 -16309 3148 30622 -36212
6409 -36212 -38586 -94047 -84449 -47803 -53692 -128608 -104014 -20113 -77101 -119737 -120799 -179426 -157869
6396 -157869 -142109 -130337 -64560 -70567 -93416 -111578 -99021 -140553 -105243 -6667 47630 65129
6384 65129 60031 62093 53173 47871 -6501 -53002 -75799 -7355 7002 35575 62609 96549 128548
6371 128548 125176 76990 13337 -10665 -20463 30700 27309 46623 50844 60879 36712 25070
6359 25070 -18879 -35773 3423 23832 14835 -37160 -77741 -106523 -98133 -91975 -54498 -50147 -14252
6346 -14252 -13723 10978 15776 58260 86905 29270 -6418 16489 891 -39958 17626 -6720
6334 -6720 -32897 -54738 -22302 -36527 -56971 49461 -31960 -2433 15036 -3289 68110 31006
6322 31006 -51321 -38509 48298 96731 82964 49706 -25636 -7863 30169 39627 -26474 11859
6310 11859 62390 116572 144995 130564 97556 43546 -10201 22072 55255 85014 35991 -77756
6298 -77756 669 31069 -9301 -17515 -22318 -39097 -77830 -86706 33247 87205 28524 -18967
6286 -18967 -6320 -63448 -57812 26275 100913 176733 129397 113777 120250 112450 83653 62583
6274 62583 -6682 -82914 -85816 4887 12785 14627 62408 69971 15802 -50236 -118485 -97789 -64429
6261 -64429 15584 119791 150295 119986 35724 -64686 -48868 -37690 -58371 -438 25536
6250 25536 -11022 -48268 -59762 -11472 -29013 -54022 -58261 -33918 -28456 -85973 -66243 -36189
6238 -36189 -40805 -69613 -26273 -19235 -40577 -78976 -58585 3919 57008 3066 -83649 -85337
6226 -85337 -107138 -99805 -147984 -141438 -96767 -4700 63232 82070 35318 -30579 -37874 -38342 11896
6213 11896 18628 31604 25730 -3162 57384 71165 5497 -31839 -102103 -161056 -227206 -188622
6201 -188622 -90785 7637 13495 28145 73286 46294 27943 35887 -130 -8359 624 -30205
6189 -30205 -112023 -129103 -70070 -33243 -47938 -5819 32969 7412 63397 101239 40376 -78
6177 -78 -35391 -51139 -37418 -35012 -18002 -5209 18303 19703 6556 68045 150768 137748 69030
6164 69030 65642 22380 -26412 -30734 15433 29515 -14893 -62139 -119371 -93076 -66352 17314
6152 17314 44229 -36349 3253 105868 178856 206512 154257 148155 86321 62768 65114 68564
6140 68564 46683 43169 1764 54840 57637 27860 14293 -52452 -43236 1715 -100839 -123871
6128 -123871 -85821 -101988 -94076 -12224 -44493 -81359 -66243 -19227 -33865 -2933 26957 -15942
6116 -15942 18404 52894 34447 -4438 -48952 -48385 25764 90904 100748 63888 6490 -6909
6104 -6909 -14604 -79770 -75144 -110489 -146334 -193112 -140376 -154070 -81187 -54125 -93215 -59981
6092 -59981 -35794 -78250 -61907 -13408 14954 -15309 -64458 -161123 -191885 -152402 -159151 -157768
6080 -157768 -126998 -109003 -48991 -11080 29826 90587 41571 -25158 -30808 -14795 11616 67022
6068 67022 106793 93806 22788 -6692 -53307 -31362 -11976 -75800 -44667 -24858 -24316 -2696
6056 -2696 -42835 -59022 -65574 -19985 72067 113592 71157 47181 -8724 -98692 -164859 -167596
6044 -167596 -117906 -39535 -28289 -69940 -39485 28449 90745 52570 -7354 -92139 -93901 -33795
6032 -33795 7878 -36549 -49597 -29210 -55345 -6633 -13415 -20914 -827 27267 33144 43608
6020 43608 19035 -44536 -87410 -112070 -53541 -3099 48583 58683 37666 -9905 -102246 -120536
6008 -120536 -36405 46787 6268 57401 67118 103905 48525 36320 25725 60983 91783 16475
5996 16475 -25689 -11579 -69373 -93422 -95340 -25446 -22139 4229 11814 -9848 64430 55124 68823
5983 68823 140822 189468 182363 184225 193978 132703 76019 29731 831 72257 67633 132431 167675
5970 167675 155520 90243 77604 54431 28872 -29865 -56040 -64370 -83881 -62747 -110896 -87769
5958 -87769 -8532 42273 42940 30596 95006 50693 -81746 -114458 -62903 -11779 27684 33338
5946 33338 31537 53744 97893 51699 -47796 -41065 -11124 9642 -14714 -22567 -48923 -67018
5934 -67018 -84906 -106666 -120550 -106554 -49942 -12962 -58771 -66894 -81768 -71978 -74860 47033
5922 47033 15572 -118136 -50318 6505 -36793 -66496 -64013 -40984 -25706 -32362 -26821 -49857
5910 -49857 -15568 101292 88269 6424 9237 -38986 -55587 -63514 -15438 71521 100222 101556
5898 101556 25638 13630 122844 159318 120039 100583 99414 106838 130792 144227 135671 105384
5886 105384 90176 83690 133153 120460 143791 85306 12571 7193 -38138 -31030 -9994 32376
5874 32376 6808 37451 -44196 -144404 -117914 -91717 -46543 6412 -51252 -68882 -24624 63512
5862 63512 51033 -10045 5159 36213 34880 44206 16486 -72841 -177410 -181884 -188313 -126517
5850 -126517 -101803 -76129 -139204 -130980 -49703 -36487 573 -37407 -55181 -38539 49637 113941
5838 113941 90048 146539 113447 46493 33972 5430 -22584 -51387 -95754 -91083 -76060 -91323
5826 -91323 -72841 -68675 -107465 -114235 -115589 -69235 -43367 -47256 -57342 -12203 7389 -1163 32176
5813 32176 29274 11373 28470 -2132 -32656 -27368 -6099 -35034 17669 35019 40669 35125 -41111
5800 -41111 -48101 39602 59350 58017 57366 58484 -10192 -84410 -90482 -126208 -99931 -104731 -105720 -20220
5786 -20220 -17828 -18552 -23195 -25799 11596 36833 70274 84184 70405 72632 77431 99027 32712
5773 32712 -49735 -174835 -193990 -154798 -85285 -24157 -30010 -67232 -93527 -113304 -108484 -93832
5761 -93832 -81987 -39404 53373 49647 25225 31309 71695 70519 59009 -12988 9205 3326 -28473
5748 -28473 44339 58342 37884 52267 73219 129496 92094 92245 20408 1891 10530 56534
5736 56534 79409 164650 75144 17674 23833 -11665 -42752 -71589 -90056 -144979 -152762 -104138
5724 -104138 -55552 -67052 -88886 -80952 -6078 -6491 -48378 -95847 -162803 -171180 -108772 -89781
5712 -89781 -64637 -1753 32233 25425 -24585 1637 -45981 -85180 -107620 -70459 -58193 -112116
5700 -112116 -109782 -107717 -136045 -43643 68600 83636 55498 26872 -29095 -108708 -92497 -120767
5688 -120767 -109115 -145873 -163293 -37120 -11183 23470 71753 -75496 -138112 -134095 -163002
5677 -163002 -137700 -47254 -19778 -60751 -88359 -83625 -31146 14143 28947 32897 -262 -30610
5665 -30610 -48847 -76794 -68755 -59151 -82477 -120969 -145288 -81272 -13785 10524 -23873 915
5653 915 -31966 -50220 -45998 -51150 -91129 -95942 -1433 97030 103412 12201 -115926 -148596 -136388
5640 -136388 -52533 -34549 48588 53298 -68148 -119761 -151870 -174770 -96507 -107163 -57649 -78823
5628 -78823 -85108 -24642 -47337 -62256 -54529 20070 20680 -25151 -29535 -66423 -101784 -51529 37724
5615 37724 34257 -9956 -43651 -16071 -39413 -108567 -79320 -24862 -146987 -156692 -51450 23123
5603 23123 6821 -43717 -100360 -99953 -54745 -14649 -27077 -95683 -57313 -85338 -90698 -96516 -153077
5590 -153077 -180755 -113321 -44786 -55791 -133802 -140808 -97039 -36275 -35701 -24293 -47870 -45293
5578 -45293 -8948 17011 30338 -21786 -25098 -52379 -71873 -76181 -34632 -126760 -124392 -28656
5566 -28656 97859 90656 24511 -811 28754 -28732 -71283 -94833 -31600 103313 91288 70061
5554 70061 39725 -11258 -12197 82011 86588 -3726 -20740 938 10859 2452 -40249 -93839 -68517
5541 -68517 -108375 -87756 -49016 -79655 -24484 15799 32276 9710 56753 4451 -58445 -81873
5529 -81873 -34301 -20967 -4183 -32625 -28237 14799 6311 -28031 6286 -8650 -53834 -92305
5517 -92305 -60400 -76991 -115183 -95701 -6488 -27769 -29555 -55894 -21257 50291 103704 124818
5505 124818 74863 37347 60714 121660 67612 75817 52170 24153 14200 -35475 50505 76646
5493 76646 22606 -3738 -38372 -69491 -57200 -52023 42605 -11248 -57061 -12201 10450 -6049
5481 -6049 -31906 -49650 -18735 126170 174194 154178 108897 74032 42301 12402 -69930 -81741
5469 -81741 -39685 -35879 -74480 -104934 -10104 1831 -36026 -52668 -75085 -167353 -138560 -3388
5457 -3388 44896 14500 12673 40148 -14631 -39631 -53286 -61156 10990 -19284 -44516 -48699 -34438
5444 -34438 -101761 -131769 -93611 -94212 -99201 -63277 -90264 -77882 -50095 -27346 -46170 -13101
5432 -13101 -4810 -24697 -15461 15314 55410 96586 74553 86380 65995 56446 128029 115841
5420 115841 92553 -8742 -21298 -111230 -118500 -108060 -85548 -60831 -45163 -34538 -72344 -108120
5408 -108120 -104683 -134436 -72668 -55666 -27951 -37108 -39163 -37894 -24201 53072 41388 26528
5396 26528 9602 16024 -25541 -7949 68979 85294 73962 16141 -40402 -50303 -76086 -96246
5384 -96246 7220 -16136 -71782 -71952 -24613 -24724 6532 -26134 -28534 -48412 -100715 -125055 -103001
5371 -103001 -55973 -25302 -47277 -18328 61977 115514 137689 78616 30370 -18054 -50920 -76019
5359 -76019 -115980 -108852 -128361 -68492 413 4813 -52392 -123211 -96698 -42105 28814 -23408
5347 -23408 -34957 8510 21282 86325 62456 48669 47892 104282 139082 92893 83199 52592
5335 52592 72795 6404 -33229 35195 24196 -29378 49584 78602 71852 64498 -14256 -107555
5323 -107555 -127747 -69168 13294 29262 -1315 32250 -21617 -57222 -117627 -92657 -71537 -62588
5311 -62588 -46345 4518 36670 17270 -33638 -102076 -104074 -90353 -105562 -192206 -182590 -95936
5299 -95936 7467 -20088 -14435 1563 -2948 -21651 -20426 36133 71971 -22363 -61636 -148446
5287 -148446 -69159 -26489 23022 17819 39853 63420 74490 53723 25408 674 8468 17088
5275 17088 23919 51912 -2819 47445 58429 -1549 -59259 -30461 -21251 -35840 -79315 -108953
5263 -108953 -36176 -828 52763 114537 96666 49712 -11720 -18115 -48435 -30707 41316 23292
5251 23292 -14070 -62308 -67024 -73023 -110934 -90456 -104385 -65697 -90486 -135325 -85699 -11002
5239 -11002 56671 50203 65529 76419 19922 6831 39860 118207 118895 110845 120562 61132 -4499
5226 -4499 -72070 1345 -34191 -79962 -174256 -193251 -150074 -56777 7816 -54931 -104631 -72402
5214 -72402 -50012 -41924 -26200 -93372 -47177 -14480 6766 7409 -45386 -62956 -121082 -166032
5202 -166032 -142464 -100598 -139795 -82581 -78935 -120164 -127498 -60447 -27910 -23835 -59814 -67390
5190 -67390 -76459 -93131 -46208 -17206 37484 58431 49528 90499 99268 37636 29114 66882 50580
5177 50580 -17397 -38363 -27961 -10344 -22041 -68648 -16637 40722 42584 -5315 -50481 -3244
5165 -3244 77783 27498 97836 130448 104120 61716 101429 47805 -27653 -52224 -9229 59587
5153 59587 82313 19554 34884 128870 173836 128420 35192 18962 13663 -17543 -11406 50592
5141 50592 62093 -3780 13608 38435 31315 -15810 -62349 -17985 17221 19040 68688 22713
5129 22713 29708 -12612 -50325 -43016 20724 15430 13771 51959 89562 31859 50984 95798 122120
5116 122120 114207 1802 70318 97837 2716 -10181 -18953 -21922 45872 79727 50128 85381
5104 85381 18105 -42214 13303 30824 33543 61649 30181 -68460 -128918 -112384 -35846 -2017
5092 -2017 30982 -12249 -3977 44270 66342 22647 -19969 -16601 -51291 -68292 -88668 -114455
5080 -114455 -160334 -164855 -155243 -142481 -58192 -20483 14101 35623 -49009 -99902 -83881 -112363
5068 -112363 -71207 13096 -29183 -27333 91193 82995 79570 70540 59759 91335 97708 109777
5056 109777 78246 99509 86698 47164 -5077 3522 54720 76227 76558 56829 63057 78875
5044 78875 66074 14188 823 -30817 7108 69140 115351 20413 -62123 -92751 -137209 -145866
5032 -145866 -67021 -28559 -37151 9587 15259 -742 -40734 -124822 -100636 31858 120763 133082
5020 133082 63481 -18813 1733 39485 92869 70642 102531 122838 88186 83250 115927 72943
5008 72943 50407 124542 111069 10711 10117 16882 -6986 -91237 -116816 -15502 45101 51438
4996 51438 43592 34384 -26597 -29142 -10379 46309 4443 -11468 -64944 -69919 -44565 -33956 -35318
4983 -35318 -57703 -35836 7221 17985 -26605 -72996 -101857 -97509 -79985 -79077 -2842 89053
4971 89053 163033 123814 85066 61975 15278 29572 39322 69705 81393 14796 -33155 -15769
4959 -15769 5729 -24907 -48574 -20103 -80498 -99499 -11823 106829 135544 136873 129805 86745
4947 86745 22334 -5079 -77645 -173502 -90813 -44468 -24248 -61667 -46520 -49826 -35489 4135
4935 4135 -20569 -101570 -119921 -104311 -121578 -116957 -54250 550 -46613 -40802 21519 -57826
4923 -57826 -70150 -97101 -74364 -79427 -108194 -130431 -121761 -94923 -78638 -91493 -89683 -147153
4911 -147153 -122248 -72777 -91667 -85196 -85913 -53107 -67244 -104005 -114629 -49059 -53963 -38038
4899 -38038 -7328 29971 -57171 -94106 -73220 3890 32939 31882 -8994 -48557 -915 108079
4887 108079 82362 -4970 -331 21968 -35156 -39645 17571 17326 -6559 4982 16734 61906
4875 61906 80354 92764 54477 17971 8191 45195 21595 -50752 -132891 -105840 -106667 -99293 -82170
4862 -82170 -53753 -15163 -74971 -94472 -56448 -44450 -59283 -67512 -147580 -73293 12801 80552
4850 80552 36161 13173 32771 21946 -2433 -428 86047 43827 11154 -63799 20723 126586
4838 126586 136640 88804 59841 72140 33001 -15303 6656 30372 47488 -32582 -76943 -61117
4826 -61117 -91738 -65607 -46525 -68531 -71449 -26347 31282 -21401 -11846 -6811 -21465 -32330
4814 -32330 -35470 11057 38185 4695 16141 25390 33481 7882 65255 96456 29099 -43910
4802 -43910 -36883 65165 23458 3545 15972 49764 26412 -20460 -6779 36752 -922 -3677
4790 -3677 29300 42898 4350 -79862 -115369 -115177 -87320 -86876 -114187 -53385 -61166 -32810 -60129
4777 -60129 -115159 -98800 -103861 -50479 3725 -22814 -94418 -93688 -60169 -8758 19029 12100 -9441
4764 -9441 20817 -2116 -33759 -12435 -24967 2696 5346 -42352 -28341 -31642 -19192 59888
4752 59888 -592 -95019 -97069 -54155 29086 19806 -92109 -44054 -13114 -24063 -33869 -3490
4740 -3490 -51712 -31233 40676 31794 10172 -13472 5068 -796 -20499 -62366 -85276 -96406
4728 -96406 -62814 -111277 -156462 -137355 -90538 -31657 36197 62434 -12685 -22267 -22951 -26445 -12470
4715 -12470 7702 40477 110769 92622 -34406 -79306 -58049 -31573 32514 48313 108242 141205
4703 141205 88749 68637 60697 101248 125427 91828 68098 58436 -19861 -171323 -161490 -50313
4691 -50313 -17513 26812 44438 82271 117749 117403 70746 -5615 -30953 -99899 -103115 -41943
4679 -41943 -80568 -59853 -40815 -62635 6038 50050 63163 -13620 -22735 -19940 -70972 -40817
4667 -40817 -52737 -91307 -12323 27580 -23130 10026 66755 60011 101146 102577 87109 52051
4655 52051 -29780 -86391 -113830 -77099 -21745 -9445 -2041 -5783 28876 -28819 -44298 12393
4643 12393 42102 -4426 -22617 -31591 -2508 78930 107277 72972 -9449 -39817 -44376 -48462
4631 -48462 -1825 28509 -20872 -11182 29003 -27352 -68636 -86421 -57509 -121918 -38189 -23788
4619 -23788 -41759 -52442 -56547 -80825 -103099 -16431 51611 10257 8791 35190 -62834 -129555
4607 -129555 -152311 -154558 -98733 -77852 -83858 -105346 -46941 -88954 -103144 -60908 -8110 18115
4595 18115 -10488 -64726 -72581 -38672 -39177 -58704 -61973 -1588 47891 104312 144366 84904 -18517
4582 -18517 -59755 -67632 30642 135171 188668 102459 36347 69572 57212 73637 51372 -45582
4570 -45582 -83551 -101084 -124451 -57836 -40787 -107072 -128385 -98701 -9262 46225 -56029 -122739
4558 -122739 -82405 -118074 -104807 -43279 50001 20633 -54720 -37436 -32102 352 26662 -16749
4546 -16749 14425 22998 34528 96365 32374 -9102 -34962 -27593 16382 19200 76064 86975
4534 86975 150621 109095 76062 62811 -47053 -108401 -115180 -105399 -110521 -101121 -124691 -137818
4522 -137818 -147374 -146529 -127649 -74236 -92381 -62144 721 -6389 -66774 -51079 7421 -7938
4510 -7938 -21928 -12869 25956 68341 41186 -68922 -79143 -101497 -109437 -114934 -65133 -11113
4498 -11113 -21661 -46164 -64503 -72388 -126298 -113829 -96710 -65973 -58953 -14314 -34868 -4421
4486 -4421 14291 -57864 -131488 -121065 -73595 -8004 31874 1428 -67323 -72890 -80397 -55218
4474 -55218 -20325 -91609 -170162 -148823 -80397 -54729 -63382 -17667 -15088 -11023 -82164 -104850
4462 -104850 -87100 -72579 -121770 -138789 -113357 -77219 -55420 -68696 -100655 -69115 -73952 -96179
4450 -96179 -19462 40509 57659 -8236 -65147 -59755 -108852 -63001 -2686 -3842 -16021 -29380
4438 -29380 -79593 -35034 -25001 -105676 -158997 -187389 -152069 -122031 -97568 -79577 -17298 -18983
4426 -18983 -61519 -183301 -191228 -153643 -165251 -146873 -59789 -51600 -93706 -18020 5195 -33645
4414 -33645 -38143 18278 82626 128141 124856 163841 122615 32953 -6763 -38276 -54362 -83342
4402 -83342 -32684 30579 55138 -38053 -35106 -4861 -18516 -1902 23740 92763 73330 1822
4390 1822 -12020 20404 50437 22358 -27303 -42784 -90905 -73814 -14678 -1164 20335 20197
4378 20197 7844 -40475 -73500 -37105 38607 -4334 47806 84618 62555 51443 43239 -1700
4366 -1700 17715 29617 -5344 -82498 -90346 -64657 11370 92433 48567 -19942 -69403 -88677
4354 -88677 -110163 -151269 -124435 -48984 -32749 -27462 -34366 -104754 -80158 -35212 -89296 -51809
4342 -51809 -50840 -64019 -51813 -2368 46079 24725 5786 13657 51743 -22078 -36214 69388
4330 69388 108488 53308 5682 23414 12058 -10408 -69585 -104680 -90582 -134404 -150363 -72073
4318 -72073 5489 38703 32378 6990 15994 23717 6807 -16024 -1588 15387 -53676 -60969 17394
4305 17394 43984 55017 74748 42253 23217 55685 -8656 -15877 5777 -31885 3222 49590
4293 49590 57397 -37620 -50274 -40232 -47897 -54651 22172 -8610 -43468 -64442 -54707 36613 70998
4280 70998 74142 -4292 -78673 -83363 -86623 -67525 -14615 43976 9986 -40812 -26560 -25852 -37887
4267 -37887 -2503 -63983 -33042 2904 47507 74576 6575 -33322 15148 67560 40249 -57476
4255 -57476 -95669 -87520 -129325 -140782 -109902 -71420 -14191 16669 -32363 -23608 9938 -87141
4243 -87141 -68138 23845 -30507 -50854 -3708 35497 102243 26976 -29780 -141260 -115570 -63726
4231 -63726 -78346 27407 62768 -10675 -97261 -163650 -168449 -37722 -35016 -69948 -83327 -100288
4219 -100288 -108267 -53280 933 -22266 -104425 -181112 -140128 -69075 -17076 11833 -17731 -70681
4207 -70681 -47579 -114466 -88004 -12586 -72128 -43163 -14486 60832 63633 13972 13664 10191 2245
4194 2245 70623 80319 59227 2669 -16621 -1469 5501 77270 105343 84277 24793 -2656
4182 -2656 35338 61104 -54382 -104845 -66390 -23109 -37980 -71817 -67742 1484 -79376 -167693
4170 -167693 -162378 -122469 -76140 -45893 -95341 -146316 -74517 -64785 -109820 -72607 -17856 17267
4158 17267 -15078 9036 3337 -59542 -106472 -124962 -76259 18410 40042 -22711 -62753 -35783
4146 -35783 -88691 -38560 10386 -51548 -101547 -82316 -111009 -149041 -124682 -166841 -161810 -36009
4134 -36009 -34557 -77824 -124316 -140335 -55259 26536 49084 114663 72774 -60920 -76205 -46797
4122 -46797 -48504 -60413 -52918 -55140 -43690 -23847 -27602 -29132 -81323 -66914 -60589 25288 27233
4109 27233 -72565 -77500 -10821 10167 -20411 -4247 -13243 -82502 -80629 -161500 -132558 -76483
4097 -76483 -88982 -109644 -59124 32123 -19835 -16213 33184 44795 20534 -49893 -57213 -66008
4085 -66008 -34161 -62471 -769 16387 23586 -7178 -14242 -25679 -76721 -83302 -79442 -97340 -59091
4072 -59091 7071 76837 81603 8248 2173 66530 34361 27284 16464 20428 59203 55331 14265
4059 14265 -36224 -18464 -55093 -160121 -128549 -115060 -118738 -105895 -112088 -125751 -111448 -139371
4047 -139371 -98173 -157598 -113435 -38024 -4985 -2560 -56164 -21948 -23317 -1725 34290 36668
4035 36668 -22784 -18413 -86524 -106750 -6291 13753 25114 40640 100193 110173 50126 61132
4023 61132 119050 68443 65798 116310 27959 58784 71008 72276 23402 -42681 -8195 -2980
4011 -2980 -31147 -43803 -1455 54084 -3756 -77489 -50059 30249 86641 1591 41175 81089
3999 81089 2997 -10063 4488 22414 -7538 29045 94047 55014 -56866 -116164 -106611 -148114
3987 -148114 -130137 -96927 -25105 66215 49038 17401 29042 -14 -24958 9101 41284 103620
3975 103620 79055 -93030 -114426 -84718 20102 18034 -46499 -43071 -4017 30558 42511 53680
3963 53680 -13557 -63571 -117148 -142860 -54504 -9816 18884 -22526 3498 -45328 2174 124
3951 124 11288 19312 -20200 -47633 -37141 -62087 -43678 -4914 50120 124550 149183 75165
3939 75165 -22084 660 80157 133076 36381 -450 -56480 -52309 63438 55584 -32960 -115740
3927 -115740 -159827 -149726 -48143 -31453 -100890 -56265 6268 -5490 -45432 -62288 -108953
3916 -108953 -56674 44829 73509 25464 -62136 -39061 12126 11162 29152 15402 -78792 -140274
3904 -140274 -44852 -35310 -99886 -93983 -84812 -76475 -84645 4162 12383 15284 10211 -7918 -24276
3891 -24276 -51994 -11552 109367 107308 104555 144298 101912 74918 90234 102361 71479 78294
3879 78294 45765 61103 68534 -1234 -42845 31341 37565 25755 -21251 -40834 39508 30643
3867 30643 18351 -21112 -67254 -65519 -15758 69296 116051 114943 85132 14986 -7049 -11647
3855 -11647 -18349 -1786 -11551 -63651 -54131 -22434 -13215 -9792 -107791 -193011 -201737 -192253 -145330
3842 -145330 -107307 -51359 40006 89358 46342 36100 30046 18669 21837 51591 47514 35399
3830 35399 -3587 -46920 -34577 -75380 -155262 -81414 62329 37842 14163 -49069 -50824 -125591
3818 -125591 -49958 11855 -25248 -32495 -99062 -197681 -208727 -146419 -109981 -85156 -46167 -47139
3806 -47139 -73976 -42892 -44035 -104193 -94772 -34938 -88166 -83239 -103428 -79845 -40780 -53038
3794 -53038 -52882 -78455 -74001 -8509 17089 -922 16498 -6305 -59091 -25509 36904 44906 5060
3781 5060 -3403 -46890 -116413 -75914 -69646 -59917 -61655 -109974 -52969 4701 -13017 -34202 -24100
3768 -24100 -21038 15463 41893 14274 -10260 -27993 11219 -11518 -29390 -101410 -30636 -3012
3756 -3012 -16892 14448 18924 -83320 -176275 -161067 -129116 -120800 -108639 -83716 -50775 -58638
3744 -58638 -35813 -101390 -172940 -160275 -113106 -44991 -35855 -31150 -108866 -118481 -122687 -43851 7217
3731 7217 -11115 9278 25850 51007 115798 121719 129605 15387 -95978 -36244 79822 58990
3719 58990 63563 56923 -16900 9250 55301 129196 132942 94107 -12538 -128328 -134309 -70860
3707 -70860 -121809 -138082 -50523 10787 30458 51209 29426 -30152 -14457 17272 -19658 -11048
3695 -11048 -37423 -112651 -159989 -145074 -171619 -216172 -203764 -158755 -71919 -59960 -39078 -32006
3683 -32006 2863 26775 48332 -5765 -2637 -22702 -34654 -67744 -85691 -33748 -41857 -92152
3671 -92152 -30146 -74726 -135142 -87436 -50500 13048 36661 26471 32581 37172 26526 -44011
3659 -44011 15614 29844 29678 42498 68922 28822 22443 -8785 -29843 -5155 14539 8488 -84763
3646 -84763 -113061 -73634 -22415 76415 -1172 -61976 -74086 -104140 -151647 -187928 -166524 -159026
3634 -159026 -181873 -158466 -81154 -52173 8468 15537 68804 52170 10290 -87138 -98256 -26207
3622 -26207 -58755 -69157 -62788 -52909 -10946 28788 29788 53867 52216 55895 -4151 -102533 -126790
3609 -126790 -129238 -112181 -109684 -53431 -55405 -77808 2652 52304 69129 59430 23407 -5258
3597 -5258 19914 -8043 -52834 -10091 93104 96288 82988 55855 15536 10197 -35776 -11998
3585 -11998 2670 18746 -19906 -75765 -123349 -82135 -10038 24667 8932 3364 39152 24053
3573 24053 52707 75937 70093 45953 -10312 9132 78450 121358 155530 86715 51857 12830
3561 12830 -2059 19875 34968 65430 6869 -32461 -7338 107279 153521 52979 -67119
3550 -67119 -102966 -130417 -142427 -18401 21610 1030 -17656 -1631 -7957 -7458 -5735 -15065 -1160
3537 -1160 40013 -30816 -53173 -35115 -10110 -18860 14492 68513 31430 -4397 21882 10526
3525 10526 -8267 -83958 -108924 -101154 -37481 39109 62256 -25814 -84498 -56985 20485 53544
3513 53544 45760 31051 9117 -82431 -107854 -73433 -83118 -102934 -90553 -71849 -37118 -28644
3501 -28644 -55425 -52884 31073 31621 19662 -20381 -54487 -48890 -74824 -106386 -99397 -45698 -18661
3488 -18661 -54928 -73783 -84055 -31995 -58995 -97575 -98031 -175772 -238468 -254308 -217101 -193711
3476 -193711 -177813 -206434 -236736 -195254 -100312 8896 64020 39850 34915 53660 45049 -7006
3464 -7006 -2543 26454 32955 -4127 38890 77876 57938 78760 102252 54707 -23047 -34901
3452 -34901 -59470 -67098 -62845 -1329 49739 19077 -84979 -130403 -123647 -71862 -19576 -7058
3440 -7058 18565 35827 28607 -29344 -18703 -38376 -15735 -60994 -89835 -143460 -97111 -14331
3428 -14331 -22053 -55693 -29593 27428 32286 43979 97415 113384 87424 52297 64488 35416
3416 35416 2295 17794 -38491 22806 21981 18063 -38202 -1633 8938 21889 98147 102099 86367
3403 86367 28381 -18248 -7337 -80185 -154010 -147039 -154473 -125431 -72593 -47069 -13517 51328
3391 51328 41659 25541 1832 -14350 -51763 -16006 61488 48840 -31824 -52323 -33705 -22954
3379 -22954 -53126 -33574 -50544 -102493 -95657 -23354 -22651 -74536 -24471 100034 71700 26858
3367 26858 23640 44502 44298 41832 16611 -33213 -77408 -9228 23475 114 -19905 -67758 -94828
3354 -94828 -125845 -122023 -91136 -55871 -28983 -42273 -35175 42693 35915 6344 117274 90724
3342 90724 13327 -19630 -54155 -42180 -354 -39664 -37379 -2761 88547 85968 27469 43682
3330 43682 47989 -59355 -80748 -128131 -185772 -149050 -40634 -39048 -57956 -43821 -21059 -78059
3318 -78059 -63328 -92 5880 -93241 -146786 -136061 -74945 5411 12220 8328 -49202 -81517
3306 -81517 -130634 -143941 -140257 -92062 -47876 -31562 -3725 -16258 -57990 -112548 -110096 -81012
3294 -81012 -79124 -52843 -39194 -66880 -15215 15787 52932 27467 -32631 -52022 -20419 11119
3282 11119 -60514 -49949 -5185 33816 59717 36147 -7100 -17490 -97039 -46879 15758 74362
3270 74362 146989 139907 27732 -53130 -15337 36640 -7749 -19306 35670 94063 116486 82919
3258 82919 46044 64010 96008 131785 124169 63155 -18653 -70843 -81762 -61994 25217 3391
3246 3391 -36590 -55409 37410 -31298 -106877 -42725 11313 -7149 -84812 -135908 -84918 -89019
3234 -89019 -68949 -16426 -41771 -69801 -89954 -25040 10128 -38046 -70134 -82461 -69264 3030
3222 3030 7579 -55446 -70709 -63997 -86157 20588 87975 34466 -10795 -56133 -76385 -115969
3210 -115969 -150683 -131619 -66666 -68467 -24591 37798 34798 7753 -69786 -57329 26523 54283
3198 54283 71207 55125 -10041 -15263 80046 99741 117160 105912 90815 129223 116103 34841
3186 34841 -32312 19924 -22192 -143232 -115490 -23453 -13463 -124205 -150387 -148216 -179651 -162485
3174 -162485 -97664 -26492 46798 61656 -2463 5612 -11668 99472 87278 22998 -33526 20662
3162 20662 76929 97245 29841 44195 39632 17278 17765 50080 80231 46036 39486 22276 37443
3149 37443 33182 -21338 8463 76812 83123 7273 -81269 -91698 -94804 -54744 -29021 -53149
3137 -53149 -17389 47181 28510 -65749 -79610 -155398 -116870 -30856 45149 34337 139680 128362
3125 128362 82034 16304 -85215 -160840 -196016 -153614 -158939 -123427 -62993 -7809 -32617 -72374
3113 -72374 2344 40530 83927 69202 35525 9466 -1109 36700 77888 109315 157977 142025
3101 142025 130031 139655 97415 66762 24867 45604 46356 81095 73598 81170 52723 49344 89268
3088 89268 35537 -48598 -90182 -58238 -82726 -78942 -50044 44159 134672 139515 79193 49092
3076 49092 39748 78679 98630 79056 58903 23301 -7452 -30039 -8426 27953 31183 -6901
3064 -6901 -66898 -74557 -68457 -26229 -3179 9851 17950 83765 76830 50621 82215 124398 110742
3051 110742 7688 -24121 -21621 18644 91768 20988 -50782 -101919 -133906 -102957 -143681 -132502
3039 -132502 -56393 -31101 5063 41725 34036 74789 114471 144810 182946 82821 30197 -2846
3027 -2846 -40878 -13916 -11522 -11486 27182 -17421 -65354 -80218 -88930 -22063 -41019 -42253 15049
3014 15049 -57628 -62508 -30071 -91050 -92841 -95211 -94032 -106294 -98876 -126322 -41873 36156 -4384
3001 -4384 -86907 -167876 -95406 -31041 43817 88003 24932 14185 -1811 -81737 -102953 -68695
2989 -68695 -67037 -77047 -35451 -79537 -17628 -24271 -53145 -51429 -30367 -45045 -63876 5662
2977 5662 -23991 -89454 -9018 7579 -43224 -131616 -99498 -27334 52350 68561 38811 -11127
2965 -11127 -56033 -8761 49646 55571 -12808 -3468 -24440 -93991 -119803 -89618 -72435 -76994
2953 -76994 -28339 -18496 -10608 -75210 -82977 -76764 -22301 38145 40513 55048 82506 78503 -21291
2940 -21291 -72531 -90066 -43052 -3891 31323 75146 19006 -60651 -35835 -53975 -72634 -96567
2928 -96567 -65646 -48296 -29137 -19362 -65102 -85232 -75078 -3091 45231 75856 119395 52773
2916 52773 19998 44283 12479 58806 118356 118550 51097 48445 161788 150479 57477 44348
2904 44348 34482 21140 50497 111278 151976 185045 44128 -111323 -120677 -104756 -107331 -68504
2892 -68504 -86842 -62552 -78048 -108128 -84681 -32277 -31280 -45916 -43815 -46236 -6182 36449 9834
2879 9834 60981 41908 34613 8126 22773 34075 33382 -4218 -19841 34977 115342 9043
2867 9043 -20686 20453 19707 -42521 6314 -37383 -33569 -4837 15193 54366 49032 56212 70470
2854 70470 25046 -48569 -155799 -150162 -128236 -84544 -90098 -89712 -54926 -38293 -52096 2730
2842 2730 83141 124133 66244 33703 46489 36601 -2227 -32091 -58728 -123172 -99168 -39750
2830 -39750 29173 85883 27122 -85381 -137806 -42081 35738 86145 123550 69553 123994 126411
2818 126411 92819 45663 35180 57881 22183 1404 25943 55008 20310 -11223 39481 105542
2806 105542 90249 20904 -46743 -51072 -77517 -60139 -101339 -118601 -107899 -51873 -15339 -38402
2794 -38402 -34257 -22624 -6183 -53720 -7260 54811 117501 120221 47449 -8585 -8634 2931 -41379
2781 -41379 -56671 -40280 -93869 -88739 -57708 13335 26780 -64026 -123501 -127071 -104180 -93744
2769 -93744 -166651 -194062 -108361 -49405 -22296 -9419 38639 43650 43955 91022 35312 -1978
2757 -1978 -11469 -4175 -41903 -24076 -13095 21093 20919 53037 106989 45275 3668 5501 30672
2744 30672 -33877 -97512 -37294 -36096 -103843 -129184 -187034 -184132 -107727 -81425 -60813 20234
2732 20234 -17956 -71269 -37340 -18452 24590 -7389 -31395 -92367 -113076 -92335 -110607 -77899
2720 -77899 -104346 -97831 -89560 -42486 -15993 -91024 -186469 -115766 30143 20291 -76718 -190128
2708 -190128 -214031 -147686 -45797 -40120 -128600 -109138 11182 67215 52399 -34879 -39693 -40209
2696 -40209 -136293 -128101 -106291 -160412 -162432 -125886 -112835 -88699 12979 -14021 -73418 -46327
2684 -46327 18954 12665 -14781 -68808 -55191 -32942 27930 45206 4492 -10775 90040 74302
2672 74302 51553 33640 -1713 48465 42138 94354 120294 49463 67284 -5605 -49369 -57472
2660 -57472 -76620 -85612 55845 12280 12544 56214 60806 80763 127734 128048 60080 -21162 18833
2647 18833 -1909 -36921 -24067 -20432 -19164 -33740 9687 63621 24079 -3533 -92102 -212593
2635 -212593 -145792 -78098 -85666 -45435 -505 7101 -7980 -5853 -62370 -115754 -110963 -61280
2623 -61280 3601 9164 -6452 -50555 -43452 -30308 -32637 -24528 2046 -46728 -23370 29421 6990
2610 6990 50809 122126 125807 129154 71523 29695 -34320 41966 37711 -33546 -64259 -37146 -27880
2597 -27880 61994 97220 9016 -44587 -72494 -71994 -25438 -16113 -4136 -17145 2641 44162
2585 44162 66617 105010 120307 111677 76673 52110 11882 13350 35311 47345 -14035 42551
2573 42551 75208 84601 144135 77764 -8133 5791 62918 144790 79678 -38789 -104261 -40785
2561 -40785 -29561 -19896 -33796 -1593 -20353 -29541 20248 53488 29530 36399 107722 142597
2549 142597 74378 50066 88092 128629 185035 125775 58766 73750 53852 12953 24901 -6997
2537 -6997 37913 67233 9929 -38841 -109380 -81098 55725 115324 79849 83496 103275 124826
2525 124826 98590 54373 10792 65807 58778 -11536 -55646 -94586 -65380 15819 43465 24247
2513 24247 38462 4056 23066 82323 74258 41541 59555 48776 29281 17646 9401 43794
2501 43794 26519 17092 -12151 -42040 -55431 -68452 -68927 -62411 -28283 -29283 -78818 -129217 -127940
2488 -127940 -99740 -49199 -25297 -1670 61985 81802 69035 5708 -56337 -73685 12065 36192
2476 36192 1477 -28877 -118108 -82278 -76720 -68094 -95582 -110581 -119870 -181970 -209424 -150614
2464 -150614 -106061 -50201 -37867 23634 3822 15664 -70683 -80393 -73025 -76413 -37891 -26595
2452 -26595 -42117 23333 77637 96302 104181 91084 100999 76849 18448 -30735 -1757 94916
2440 94916 92916 15482 -34047 -4239 49442 51689 -5877 -18763 31419 90581 62100 44337
2428 44337 61211 84411 58509 -26263 -71100 -39710 -13380 55602 11764 -41992 -76258 -8484
2416 -8484 27605 49828 104858 110043 80758 35613 34509 -15401 -86766 -132831 -65857 -89413
2404 -89413 -94162 -58766 8012 23475 9876 35946 107564 101382 52881 -1285 -38077 -43462
2392 -43462 -33448 -37926 -7816 99485 88899 31284 -23879 -41646 -13903 14187 -38794 51803
2380 51803 23621 16490 70044 -8564 23108 15585 -37157 -91550 -92221 -37826 51017 82234 133879
2367 133879 113275 38749 57066 25072 -25031 -52690 -3195 -25935 -39334 19441 -28974 -35054
2355 -35054 -14720 -2282 -25124 26132 45776 36807 -36766 -143903 -104400 -66439 -97874 -117420
2343 -117420 -112569 10293 94739 49314 3977 32262 111405 124962 119757 78623 -14363 -66804
2331 -66804 -75695 -61746 -72428 -64853 -75164 -97189 -33279 13492 58522 60487 66085 -18131 -56357
2318 -56357 -26736 -19020 -58921 -43599 1628 5437 43029 66281 51162 -22617 -8593 -41324
2306 -41324 -48259 19187 7482 -33141 84852 38388 -29722 33501 136401 158474 6603
2295 6603 -62707 -10376 -26027 26076 7249 327 48514 59506 21842 -59780 -147670 -172045
2283 -172045 -107603 -12904 10840 -72287 -131250 -74253 -11787 10553 -21202 -22147 -55870 -63193
2271 -63193 -18486 -48797 -5558 -8725 -65035 -71268 -21925 35499 78606 41756 56974 90496
2259 90496 13042 -80897 -116300 -31209 99664 93745 119960 150399 130508 73326 98686 96314
2247 96314 91982 62159 81416 7821 -14718 35821 48515 -22917 -55341 -107419 -148360 -151393
2235 -151393 -109136 -136536 -134524 -45977 -10259 -98233 -89049 -6921 12285 84187 80475 33597
2223 33597 -66948 -27719 10625 4767 25810 111593 67397 62987 5789 41963 72631 72133
2211 72133 135909 189675 110008 48754 -55174 -81827 -123998 -125717 4630 63081 103876 111175
2199 111175 99252 38744 -7157 101876 127165 87664 2628 70121 81016 72118 96237 36232
2187 36232 -26385 -74275 -80639 -69750 -64558 -137790 -159351 -136872 -71624 -63548 -92724 -41524
2175 -41524 -21318 -29104 -27032 -94208 -110340 -95535 -84336 -65436 9928 33030 -22769 -64152
2163 -64152 -95893 -57808 -28545 14221 44303 55023 -29453 -49217 45126 148890 119466 20224
2151 20224 -33126 810 -19227 -32986 -102359 -14992 48316 -34235 -24293 -3047 -8060 47811
2139 47811 120661 44042 27076 35926 -14726 -35076 -31888 -8361 8387 24746 -10304 -1291
2127 -1291 -70569 -71981 -48171 -7472 -11789 -42087 -19647 4068 43294 60599 -11049 -85053
2115 -85053 -136953 -128925 -121822 -95723 -69794 -9507 -14575 1137 37937 51138 30323 28839 9509
2102 9509 16693 94999 127347 17786 4966 22170 -34208 17864 100533 81120 86542 57137
2090 57137 21396 -25779 -42873 -1982 -18475 -70022 -102217 -102221 -56150 -32875 -61838 -32988 5503
2077 5503 -13555 -8087 15371 12545 14527 19256 68469 116214 90365 55740 64521 86718 29626
2064 29626 15106 97149 96275 -4475 -13525 65866 127812 142545 77691 52195 13515 -29549
2052 -29549 -5091 23511 50082 53515 67084 49397 28574 -45750 -67146 -102972 -77597 4009
2040 4009 27557 19490 -15781 18296 65597 86710 85363 48658 53951 -7429 -11073 3316 22552
2027 22552 27825 -35971 -80052 -52004 -17965 -25078 32298 -1565 25733 49986 14418 -1608
2015 -1608 26707 70891 124632 90126 29366 -35814 -83841 -101635 -75657 -83623 4189 -55022
2003 -55022 -44497 54622 54690 67779 18585 25133 112680 117406 127095 151575 195508 157841 95086
1990 95086 -6573 -82292 -76631 -31660 -83157 -96621 -40961 -43056 -32769 13416 -51257 -85204
1978 -85204 -70126 -43386 -35973 6787 77588 60794 -28861 -59072 -46125 10746 27586 74529
1966 74529 15327 -37925 38355 161475 118995 52217 33069 48869 39215 11652 -27335 -80672
1954 -80672 -109845 -81400 -27287 -16856 -84700 -27601 -4997 46280 34046 21171 -30038 69241
1942 69241 45202 15739 53296 75759 66619 57255 49282 17899 26642 49765 21297 -39115 34944
1929 34944 76174 7926 -56432 -56691 15701 96817 171211 138050 61773 44529 95567 94812 69524
1916 69524 58051 34617 66840 107267 81180 83604 100889 167972 154183 80463 48801 51242
1904 51242 80361 75148 25948 -34523 -17055 37866 56456 33874 -4949 -24452 -53638 -62347
1892 -62347 -32515 -9403 -44149 -10449 -30959 -24533 4131 -55124 -26518 6408 -62348 -41917
1880 -41917 16598 -12433 -23064 -56329 -15949 13341 64162 43214 58738 54650 3914 -22388
1868 -22388 79963 131553 149447 58946 -17316 7042 25041 -60094 -93683 -38869 -82614 -41795
1856 -41795 19536 109235 165667 122253 70260 12738 2832 16441 3502 84455 89487 60994
1844 60994 54735 28332 24273 54037 24246 18029 37464 -871 -58871 -17494 57655 57536 15250
1831 15250 21371 77862 78894 77689 76185 101256 97590 126889 58448 106317 123496 56998 -5398
1818 -5398 9536 14948 -38046 -77059 -34007 -22424 -50395 -16953 4996 81861 36786 -30888
1806 -30888 -9551 42300 49904 24597 10190 -29026 -42434 -41005 1226 39612 22840 17291
1794 17291 22556 -16798 -25641 -92514 -71121 2512 45766 124861 103939 107638 87671 57002
1782 57002 24014 -10390 -1591 -34601 -19250 62911 45548 42195 127552 56591 -57310 -59557
1770 -59557 -71364 -9181 -31146 -91474 -40019 34585 65654 75674 27351 25249 4964 2203
1758 2203 -25527 -85451 -67312 -116548 -75986 27315 61313 52391 128273 157971 158822 147059
1746 147059 84377 68213 31154 135490 172928 78918 79291 137563 140811 101509 -25500 -76029
1734 -76029 -40987 1938 80510 72373 35291 57300 50694 8282 25497 74965 99934 103026
1722 103026 126006 47874 15967 74608 163443 256425 237345 190586 151518 85269 64935 45872
1710 45872 77877 115213 51613 33895 120517 42224 -49459 -39504 -4701 15312 -50756 -100747
1698 -100747 -30163 85591 89667 78287 -13442 -64364 -65659 -40031 26653 75941 110566 146407
1686 146407 101656 91967 85461 -7991 17408 38408 44403 31785 -10375 32682 5758 -6044
1674 -6044 7504 1061 -19559 -33628 -31824 29504 94711 115658 71499 54645 97183 126474
1662 126474 68439 -10914 -67031 -109978 -131916 -144603 -56389 -11008 -14370 -10174 -8180 12810
1650 12810 44459 57336 26198 32347 10743 42416 118420 122185 75246 79466 9551 -54611
1638 -54611 -125654 -47174 -33869 -89324 -74191 -46209 -68960 25111 53959 -9893 -40453 -29776
1626 -29776 58332 77569 -37552 -127230 -24146 28809 14441 -31491 -36205 -23128 -23189 -47026
1614 -47026 -51032 -79524 -58318 10594 35481 -2674 -29895 14536 92075 123485 38081 17425
1602 17425 -7092 -10449 -15523 27020 112402 96836 103483 136504 108307 18402 -13535 80003
1590 80003 61511 34201 83828 51451 89633 85627 9774 -61045 -62225 -22092 -62275 -70471
1578 -70471 -7261 -16214 -44023 -56116 -77489 -71685 -132268 -153832 -121562 -42464 -50861 -52832 -4048
1565 -4048 79638 45835 -4906 -5207 -32824 -12619 47230 127336 164579 151924 39847 -21930
1553 -21930 37913 82504 118642 48137 3719 16407 55869 49386 78880 42232 65 -14097
1541 -14097 -30149 -50780 -28845 -44368 -63039 -37373 23873 71719 121072 88497 31269 112447
1529 112447 126307 164700 121496 57048 -2844 27548 4268 -22462 -71148 -60786 -12891 12893
1517 12893 19191 90636 171191 165213 103922 105731 164727 207793 243591 153030 85632 73535
1505 73535 6352 26417 53286 31709 22579 -15601 50074 57921 74291 22646 16288 -92674
1493 -92674 -164165 -54607 92729 160407 103717 107890 116181 114005 104379 7330 -36510 -70978
1481 -70978 -61718 -71275 -92817 -17741 -7908 27246 66674 21043 -36298 -5088 18889 37240
1469 37240 72899 -60850 -119850 -128451 -104429 -71619 -56765 -30391 -34368 -73026 -88186 -71135
1457 -71135 -64214 15526 79073 72233 -1755 -26117 8648 51866 91370 87993 113427 79247
1445 79247 131560 75266 7396 -30318 9381 16980 73186 96584 104451 105486 61472 42243
1433 42243 42866 5113 -52821 -1619 -14963 -30117 -32448 -93666 4701 105101 140027 100346
1421 100346 159739 167549 166124 152109 127531 80157 10062 59082 95752 123744 94369 71495
1409 71495 78564 16606 -10163 -26849 -39582 6060 59779 167770 239021 156963 101612 66730
1397 66730 56253 47794 -49246 -82174 -53143 19800 77705 62594 27623 -17665 -58349 -168761
1385 -168761 -139011 -90349 -39884 -58555 -51662 1954 76096 138899 181752 141420 107582 75299
1373 75299 53634 54670 36706 5039 -44768 -35687 -75475 -136321 -93873 -53250 21419 45922
1361 45922 38431 1557 -2947 -22674 -74944 -96824 -45160 -21559 -7148 -1919 -23238 33193
1349 33193 67735 17938 23379 70474 34552 -79748 -119274 -63404 -31780 4059 70999 103241
1337 103241 101513 100871 -1953 -18735 41132 42304 25258 26225 13167 -11758 40443 20519 -11190
1324 -11190 -6974 10849 13617 6703 14320 27181 -1414 -35774 -28896 -47232 -44880 6656 71431
1311 71431 17306 -26671 22601 43077 12411 -44119 -37665 -30681 18439 52661 70429 24454
1299 24454 1633 744 42973 39104 41486 14718 30546 86325 67411 31755 44381 -19581 -599
1286 -599 104163 136867 147470 107607 93333 123977 145140 161066 121181 78270 65144 26863
1274 26863 -12501 1861 -7171 -48203 -61211 41156 144531 165768 108963 6596 2009 27157
1262 27157 -21581 -45137 -68214 -75044 -59559 -44427 -37891 30217 78879 40759 6787 -26370
1250 -26370 -28346 -8593 -18980 -79634 -65113 -36419 18004 76730 90459 83625 56344 -6591
1238 -6591 -10697 45750 50282 38549 14433 26391 25376 75971 88961 13303 -23069 -14075 49644
1225 49644 126386 138971 101015 -42283 -68285 29130 27803 12964 28089 70270 52778 43078
1213 43078 39309 643 -34720 -45495 12319 28035 -20050 -58598 -50056 -18158 -15449 30235
1201 30235 54988 -8182 -22509 -62535 -116459 -102830 -151046 -195732 -83341 -51606 -78400 -48023
1189 -48023 -69893 -76596 -80160 -99012 -61734 46837 23717 -25578 -97187 -64280 -26415 -82590
1177 -82590 -66872 -51126 -127436 -163004 -72460 -8808 54502 -26245 -62221 -54465 -50890 4221
1165 4221 38394 34231 -4727 52213 72644 53569 -3615 -7246 -12928 8156 -3608 -34083 -95700
1152 -95700 -52241 -56099 -138948 -111361 -67471 -34484 -56836 -27546 57643 64966 103386 107555
1140 107555 82009 38068 -8626 58507 695 -14531 -133011 -132666 -27240 26376 31093 65219
1128 65219 79456 98082 118995 127896 71460 -42173 -89964 -80693 -81337 -52199 -16398 64003
1116 64003 60761 128703 132558 25162 1520 -28258 -25982 24390 5905 35790 28984 55817
1104 55817 64282 1195 -60951 -127730 -71417 -31763 -29757 -97670 -38864 -68892 -125009 -73626
1092 -73626 -56619 6730 62461 102965 101615 83881 86420 83120 50810 77475 26858 -29228
1080 -29228 -19291 19921 23193 4714 -41600 -17494 -16247 -3599 41203 52426 25128 66044
1068 66044 71428 32408 -7629 -122559 -191191 -118975 -6721 45088 69052 48588 -7491 -13106
1056 -13106 16405 21137 -9067 -9802 24865 14337 -25261 -108853 -111654 13462 -38444 -48358 33118
1043 33118 15864 3206 67560 19384 -51997 -58763 -69345 5074 33060 38391 60210 60579 30869
1030 30869 -6446 -27804 46428 108835 64407 50393 1832 -1584 -45470 -7772 78311 46694
1018 46694 53689 36893 72488 119616 36581 -43190 2965 -10795 12554 37126 -14198 -18491
1006 -18491 6331 91335 88580 12159 -33340 -43659 -931 -33889 -37147 4080 63014 138932
994 138932 108932 47489 -28338 66582 130803 84630 97087 107424 56638 35838 36421 114534
982 114534 155811 185790 178993 87228 44499 85952 70915 80760 145582 164598 135646 121830
970 121830 112502 72525 27014 -11137 2729 68135 63790 76062 55374 -35702 -35604 -20678 -79680
957 -79680 -157242 -155967 -107302 24990 106255 79411 19224 18695 727 39013 60403 66681 33220
944 33220 -6383 -3462 -26140 510 110437 129506 116840 42384 15501 144207 217079 181419
932 181419 148895 72110 -11597 -73529 62430 169433 75742 21639 19465 55997 93917 77863
920 77863 30338 51538 132224 144310 132091 94320 22697 -11853 -64867 -41478 -1044 56612
908 56612 110464 84900 76168 69515 -23772 -105906 -70320 -21261 -22795 -51235 -74852 -105385 -82585
895 -82585 -28873 25833 27862 23914 -2300 -93997 -114215 -47211 -11867 -25138 -20339 -29738 -6557
882 -6557 24810 33577 13477 -62552 -106561 -96056 -104026 -47430 -22731 -4317 -8801 -36315 -34009
869 -34009 -22666 65161 102767 29716 53356 36138 -11733 -58343 -40327 49592 136378 126079
857 126079 76878 150941 70689 47739 78755 37766 -57811 -73743 -119519 -145556 -168075 -135538
845 -135538 -67825 -49322 -43993 38976 103630 100581 66443 -80652 -103165 -32605 93361 195271
833 195271 177501 40071 -61749 -16432 2234 -28094 -41135 874 -50281 -79081 -67896
822 -67896 -2565 34045 -10232 14075 50566 82460 96243 135061 126277 90260 19928 47988
810 47988 93276 49091 13627 35680 87368 99698 11312 -8643 99952 106043 50691 -4941
798 -4941 45051 58919 54459 28557 -16347 -82096 -83312 -40178 -31820 -27964 108359 143654 176238
785 176238 156806 133268 161674 178040 187065 180038 160191 152190 99396 11357 7677 14503 -13092
772 -13092 -14059 47809 72568 50357 40728 73452 68429 66922 133034 205341 173300 135196 83762
759 83762 80599 130925 127807 75344 98518 111817 49503 90300 159434 48814 28059 69670
747 69670 100331 128954 112833 98350 109603 90541 37418 85695 166417 178747 103434 90544
735 90544 71262 46371 62117 39445 5236 19329 4302 -11697 93458 87143 12554 62090
723 62090 194966 172174 135611 44905 20860 53278 52092 66176 51352 124436 112605 54867
711 54867 28572 -12119 -42471 -67765 -29964 67941 -40914 5470 84247 134500 140548 158457
699 158457 221809 226579 134938 111435 86799 76691 94934 48464 25413 64165 117443 99284
687 99284 84723 75637 77550 29498 75853 128180 60886 46219 119922 172653 178235 138640 128008
674 128008 88448 93900 131763 123471 61133 62894 76120 44611 73369 103748 110895 55476 84027
661 84027 29646 -54826 -23550 41367 3875 -5747 59305 171139 169979 123541 65319 -10203
649 -10203 -62456 -31052 110124 151851 82248 69308 82095 119858 157930 109869 17985 42215
637 42215 24733 -26192 -55318 19093 15597 39612 66149 43761 30971 70236 133941 144066
625 144066 140061 82724 27478 -34271 -28902 65863 48734 57793 148648 140429 102698 46463 26850
612 26850 96701 145379 175092 149144 43213 -43262 -12857 -17283 4731 6307 50700 106321
600 106321 43497 -22535 -54000 -78447 -104651 -70659 -12571 128620 158977 87182 31334 42959
588 42959 54949 52964 103059 79353 102409 101417 99214 123496 109001 98183 103666 134971 111637
575 111637 102363 119966 135020 127997 123311 117990 67102 47179 32255 -71315 -64482 -127388 -103751
562 -103751 -39620 37592 52759 26697 11252 45891 40273 7693 8475 65935 29921 56250
550 56250 70774 33048 38646 105798 121599 60525 -12794 -3165 51437 5776 -23617 54161
538 54161 130454 142173 79063 64517 111670 67979 9164 -19356 -3958 -11008 18950 60115
526 60115 87769 44929 4161 97901 164808 172616 111745 70955 109093 138123 150750 138559
514 138559 161292 165274 151886 134192 83210 13839 -3856 80960 116608 76451 76854 67137 125949
501 125949 200628 179126 94730 45183 -6675 19286 72577 156111 199368 146652 105246 59831
489 59831 109046 190683 194541 223064 188928 148946 104208 75572 79465 35835 52687 95050
477 95050 131341 116590 109589 137395 139185 128779 187794 232226 146868 99542 81974 80323 41432
464 41432 -17142 -34125 -33441 -5892 31573 18678 30406 35337 9174 -3712 23778 18508 45224
451 45224 82183 51458 36841 45242 101609 63198 36245 22228 62425 80446 68494 23239
439 23239 -19394 -32468 -19875 -1690 12361 38081 45501 36625 119740 83128 18756 -7150
427 -7150 -27077 34972 119698 144641 111991 119347 114911 78402 86699 114094 43304 22760 60576
414 60576 60088 38392 82279 73874 36473 77838 128718 149001 153756 125121 145870 189206 146168
401 146168 142125 78762 116384 210901 203720 147485 74315 83115 119947 126134 92376 88588 61688
388 61688 30309 73476 116976 162149 151090 137594 88723 40924 74892 67436 44594 39681
376 39681 56584 69730 92177 91567 49907 46759 75509 155225 115360 37598 748 -13076 -12492
363 -12492 -61844 -52083 250 28213 89616 138461 86267 83119 88934 80020 95737 99608 65287
350 65287 84831 105766 82864 81296 48404 125924 146049 132344 105487 66454 46018 3195
338 3195 -16348 29379 41559 7896 52968 99256 99748 39263 45643 24 -28207 -35614 -15993
325 -15993 22933 81431 153137 107575 57156 74181 77806 125867 92587 78535 89332 145691
313 145691 124108 74418 59555 54335 57285 65169 69108 15122 -14023 42315 59634 18002 29671
300 29671 69038 112879 91566 84376 83698 12800 -39491 -7502 -23232 -11261 -24339 26458 72814
287 72814 10944 99 13711 6901 -7975 -17247 17898 60318 80424 161875 133536 92624
275 92624 136038 192714 159988 90965 115885 101664 145256 137836 103218 109443 87956 38488
263 38488 4038 73696 78517 25048 -13311 -10088 14474 -9905 24363 52181 80452 78864 103412
250 103412 100664 103574 112183 117420 138892 116571 103907 64109 23660 69068 86898 84026 109158
237 109158 98442 89328 78745 39648 86986 173644 123883 58630 48497 50248 50005 9059 -16358
224 -16358 37036 95168 123187 123673 92862 7387 -8353 71441 126964 145402 139367 113631 172783
211 172783 120772 25319 37618 57071 96571 116649 120695 103628 83612 77898 70594 53574
199 53574 -7962 -34236 -34686 -70343 -47181 -59286 -21002 2617 17524 22264 23190 9045 48739
186 48739 115300 80753 8388 2755 35717 45460 33925 87468 112376 63445 34728 -1372
174 -1372 39488 146002 196037 173752 97632 68227 59345 14751 233 1494 18331 43567
162 43567 51280 68550 34087 33001 42231 -5442 50385 158157 168088 145129 116626 124517 127399
149 127399 94921 93778 79609 149726 157664 92491 79527 12432 48065 123447 117980 32311
137 32311 4976 22635 92368 132711 107670 108756 113755 83104 98456 155019 139858 55719
125 55719 59342 96701 87983 69987 56676 101015 104425 71975 53355 2618 -19643 15483 28913
112 28913 46479 76074 109159 148607 119180 8343 -45626 -4446 58166 27968 4954 -24394
100 -24394 46498 102273 146382 125024 105477 84033 92602 45867 7746 36745 70852 87460
88 87460 55238 63111 70787 72320 86400 100282 144115 122811 101173 74965 89041 21343 14614
75 14614 52158 67163 88519 114239 80979 92123 75757 72511 13487 10739 117298 135963
63 135963 96748 90472 101683 109361 136884 171882 143932 106012 57012 20542 51265 79330
51 79330 23540 24800 17129 -6859 -25297 34204 48629 36011 38023 -3960 11735 109237 182253
38 182253 152416 85016 73357 93253 51628 56773 75188 77816 85763 110973 80529 54847 52001
25 52001 79463 88093 19803 -29610 9815 10871 25525 42103 20374 58699 99762 120747 120334
12 120334 88884 104217 87842 10114 19272 45188 78394 85536 82180 81741 72592 27197
0 27197
$$ Imaginary data points
##PAGE= N=2
##DATA TABLE= (X++(I..I)), XYDATA
32767 206696 187951 150957 141044 111456 95069 93242 130161 152946 119686 100408 145607 137030
32755 137030 148318 203083 238074 246226 285055 264663 248050 247596 222810 221685 259431 233186
32743 233186 208426 214235 263700 261236 224859 245640 276299 290957 237314 232849 266955 275213
32731 275213 278074 289515 302566 272692 256973 278125 288750 284610 301887 322023 316198 289991
32719 289991 266260 278234 260195 241944 254988 261349 287171 323878 311539 315403 293259 283659
32707 283659 320310 333783 295570 292463 296340 323330 344673 359775 381074 371280 400021 461716
32695 461716 501433 485048 430360 375089 377991 374221 354734 401737 432676 350225 325980 350823
32683 350823 421172 501175 502655 501266 507297 484848 464440 489273 491177 443806 439812 394577
32671 394577 446113 520170 509119 467656 427739 421691 437997 471974 467031 414701 431809 430640
32659 430640 420154 438299 523880 551327 544397 504215 499193 490682 474185 467753 518949 526126
32647 526126 563021 631281 635184 653075 693744 650705 629848 686336 670222 631850 587041 569743
32635 569743 538790 512244 521988 574883 583535 592979 610755 645312 677104 683066 682249 659348 615660
32622 615660 566092 549627 547906 612102 607091 626556 661364 658144 632150 648700 681267 711336
32610 711336 771663 784384 719311 631453 632547 620123 615007 626206 616798 691740 731499 709048
32598 709048 716262 647807 630085 690837 725046 728068 764246 799555 747124 668776 707359 706181
32586 706181 686793 718431 733308 751786 797188 794499 811522 805022 726438 732231 786653 793634
32574 793634 765004 753897 778426 795116 819254 766812 760150 786712 743612 741066 658438 616625
32562 616625 637696 721974 767441 802190 809820 804190 751764 750855 847115 849339 858981 880563 881301
32549 881301 764712 755200 812652 844373 822274 801531 808884 804359 787920 799178 786707 831913
32537 831913 860108 850488 847610 828486 811323 839352 845938 856274 818477 814978 826786 890202
32525 890202 910207 895995 862739 889649 875621 862256 868579 824803 899865 883304 856182 910896
32513 910896 922194 870693 839648 871787 832864 737023 731303 818112 841042 748375 709804 792115
32501 792115 806328 860630 845240 865678 871239 859515 871259 979307 988068 917422 917114 901801
32489 901801 848448 861529 880193 842057 849497 909800 951942 912879 916877 940376 947541 977503
32477 977503 995691 913129 864756 897979 900041 887449 916427 956076 1008037 1051676 1048611 1035449
32465 1035449 1016240 1006358 997710 1035937 1017509 988303 1005046 1006887 1025071 1029798 1030584 1040825
32453 1040825 976473 985277 1011899 1004237 1090618 1079446 1022429 1014241 946101 934057 984311 1005324
32441 1005324 1030808 1065303 1050891 1058906 1003073 959066 1026295 1074927 1078673 986132 1012712 1048164
32429 1048164 1060422 1042518 1033989 981796 970921 967178 926226 934934 968932 973179 1059616 1098542
32417 1098542 1061985 990611 1009441 1077117 1163035 1155789 1126769 1043324 945716 943461 974556 994078
32405 994078 1002905 1018616 1049542 1033635 1117026 1174047 1109438 1062331 959421 997833 1024028
32394 1024028 1032760 1047074 1067309 1098684 1052242 1049655 1021618 1040109 1069552 974799 887397 927510
32382 927510 1053098 1066669 1047370 975839 958270 1020977 1088229 1119936 1125223 1036933 1037580 1096821
32370 1096821 1156706 1135840 1056348 1031313 1118552 1110740 1094036 1118863 1095605 1078395 1120191
32359 1120191 1116953 1011657 1130193 1155645 1065995 1082729 1114528 1133261 1083324 1067124 1130298
32348 1130298 1118009 1094398 1129260 1143027 1109137 1109809 1112836 1118043 1150774 1216887 1171173 1134048
32336 1134048 1128473 1098346 1036003 1052135 1092311 1122791 1145857 1120902 1118280 1129723 1183475 1180341
32324 1180341 1192544 1201313 1249120 1225491 1098063 1154840 1211463 1195561 1180813 1171641 1137548
32313 1137548 1136466 1157308 1146065 1087953 1086477 1045889 1055140 1041026 1096074 1095311 1171160 1235053
32301 1235053 1182004 1056510 1036658 1080158 1043943 1112178 1149502 1171739 1217444 1219070 1146386
32290 1146386 1129071 1129377 1160260 1231605 1202810 1163603 1131017 1187835 1282415 1360127 1345828 1381027
32278 1381027 1351144 1263929 1177427 1141946 1176842 1178644 1154122 1149115 1174278 1182368 1205771 1184991
32266 1184991 1164312 1132392 1161941 1161918 1086356 1104687 1088915 1080879 1083568 1096094 1107017 1078055
32254 1078055 1080515 1056726 1073548 1032569 1087757 1165360 1094309 1123328 1141956 1133523 1126259 1059911
32242 1059911 1108134 1141253 1116101 1122290 1134421 1143801 1100220 1060586 1097446 1151192 1171488 1197943
32230 1197943 1189459 1158080 1207759 1206972 1128262 1102287 1043865 1094929 1199825 1214557 1268847 1283150
32218 1283150 1291987 1283996 1246053 1246814 1272615 1244725 1299379 1303531 1238834 1249024 1236396 1271039
32206 1271039 1241246 1249031 1289968 1309540 1251393 1205398 1180734 1166162 1167929 1247391 1329749 1368016
32194 1368016 1350904 1310667 1324365 1350377 1307529 1343610 1313851 1214178 1262461 1197395 1198965
32183 1198965 1210299 1180866 1239100 1222953 1155965 1120760 1110677 1063641 1080810 1144433 1219251
32172 1219251 1185171 1259766 1245866 1216099 1208680 1230346 1307510 1310640 1293224 1324728 1320510 1249375
32160 1249375 1259789 1241911 1232816 1240167 1222016 1219499 1220468 1267324 1227539 1133188 1085973 1160475
32148 1160475 1236156 1282918 1247582 1223655 1245191 1253646 1217732 1261047 1260552 1199655 1185143 1202522
32136 1202522 1200248 1252473 1283416 1325526 1279573 1219867 1228949 1233484 1177909 1191415 1246505 1163574
32124 1163574 1156462 1115853 1125895 1149119 1230709 1243685 1161766 1105698 1071260 1148666 1182444
32113 1182444 1161601 1122900 1124394 1131618 1162954 1177568 1169708 1157007 1128239 1115059 1097026 1169742
32101 1169742 1283620 1356167 1330683 1282729 1244648 1271530 1354978 1327115 1321811 1334085 1305505
32090 1305505 1396437 1418492 1389872 1326825 1240391 1270818 1332689 1345056 1376242 1473834 1488636
32079 1488636 1449158 1388972 1374059 1366417 1351586 1299806 1282461 1246231 1219667 1209261 1160652
32068 1160652 1269124 1257106 1198378 1245158 1276977 1191808 1249221 1319184 1275962 1192180 1175227
32057 1175227 1170402 1167871 1152411 1173245 1207698 1293366 1353242 1385856 1388667 1396340 1381888 1336978
32045 1336978 1289666 1286801 1286816 1311442 1292943 1278036 1220556 1220335 1235698 1229903 1162964 1087573 1062360
32032 1062360 1130435 1184469 1200487 1213272 1190472 1229624 1310147 1292029 1279672 1328404 1241361
32021 1241361 1179825 1266619 1261550 1191965 1163420 1195610 1297313 1285190 1263331 1296382 1293890
32010 1293890 1274604 1246197 1243413 1227472 1222000 1253835 1230661 1221575 1204063 1201244 1284868 1308494
31998 1308494 1261937 1279580 1274012 1295722 1275372 1247619 1218475 1242887 1244382 1266183 1278428 1327170
31986 1327170 1306701 1292988 1305877 1285092 1180524 1182966 1191597 1220021 1085141 1037475 1160863
31975 1160863 1248989 1208906 1219515 1249655 1253506 1225159 1225729 1219217 1169856 1210901 1264073 1272177
31963 1272177 1228746 1234869 1223221 1245972 1284081 1332057 1307516 1265291 1289964 1260126 1161849
31952 1161849 1122384 1188182 1214133 1241284 1256122 1293444 1286995 1282158 1266139 1270063 1160738 1197190
31940 1197190 1217855 1175980 1236702 1289675 1314627 1240741 1140035 1175231 1237161 1190429 1192730
31929 1192730 1260411 1290422 1291778 1309604 1310486 1258482 1331258 1383210 1325320 1336900 1332859 1385157
31917 1385157 1512891 1480703 1381333 1375906 1419282 1382746 1388006 1401720 1325142 1242523 1225725
31906 1225725 1202959 1195584 1257570 1357707 1390761 1326592 1300627 1241209 1190668 1143148 1242430
31895 1242430 1261644 1186165 1112132 1102547 1216058 1191034 1164330 1198699 1153570 1195019 1224105
31884 1224105 1200483 1178017 1185524 1220050 1241842 1242704 1195927 1174990 1242285 1270156 1277579 1289284
31872 1289284 1312722 1308616 1257783 1293798 1297866 1274651 1229842 1283959 1357402 1351466 1280010 1261757
31860 1261757 1273319 1304009 1266962 1289105 1296736 1331552 1338499 1325347 1300839 1373721 1340380 1266666
31848 1266666 1338238 1407033 1414208 1390810 1340176 1331557 1287084 1273417 1196290 1250517 1397077
31837 1397077 1430062 1357577 1306632 1268634 1291762 1318413 1313033 1379366 1409791 1291656 1195172
31826 1195172 1265793 1353248 1373355 1352422 1353419 1348908 1324167 1267783 1286449 1262235 1189613 1141335
31814 1141335 1139959 1156012 1202513 1222647 1224764 1204699 1161776 1209831 1271057 1248034 1234245 1152530
31802 1152530 1133475 1136012 1189295 1218692 1239337 1257189 1316325 1261877 1254550 1296191 1276185 1214474
31790 1214474 1262095 1356856 1406147 1401099 1378821 1383472 1329302 1268451 1251253 1255768 1307253 1256201
31778 1256201 1242901 1301111 1357139 1343775 1260378 1278549 1254990 1231889 1209475 1283194 1333028
31767 1333028 1277401 1210594 1212714 1249324 1295563 1252530 1201460 1163281 1161048 1224396 1282244 1252409
31755 1252409 1259446 1349976 1366666 1326209 1381892 1403409 1360624 1301521 1235391 1159888 1172303
31744 1172303 1224589 1304990 1299067 1277994 1257731 1211966 1219374 1234611 1242337 1206800 1199009 1216122
31732 1216122 1148547 1154729 1221912 1189349 1157231 1189352 1176375 1203086 1208368 1197088 1130301 1109098
31720 1109098 1167157 1272502 1372415 1339570 1309797 1317587 1245753 1212354 1262473 1300063 1267870
31709 1267870 1207537 1275118 1364902 1372796 1314396 1260332 1237720 1215238 1181417 1156202 1242082
31698 1242082 1300934 1345493 1311202 1318714 1326584 1271256 1232960 1220415 1272772 1289736 1294405 1278901
31686 1278901 1185793 1214670 1256742 1219322 1151356 1145161 1221783 1297468 1256782 1243023 1201598
31675 1201598 1220558 1251816 1300552 1287182 1278074 1236680 1226836 1289164 1301341 1269298 1242453 1212867
31663 1212867 1139148 1197684 1208778 1251536 1273601 1240287 1245462 1239411 1177017 1224056 1338722
31652 1338722 1343911 1303945 1396087 1464099 1406461 1318285 1250418 1239120 1247131 1253090 1285077 1313872
31640 1313872 1279950 1240205 1216239 1219155 1233565 1265251 1320760 1310957 1310662 1338570 1422578 1439619
31628 1439619 1369936 1327079 1274952 1227226 1217835 1285560 1389886 1351605 1259633 1293350 1260324
31617 1260324 1202360 1227460 1257241 1215667 1272780 1267522 1204934 1220477 1249944 1202169 1218604
31606 1218604 1273277 1269608 1272608 1307611 1248279 1184381 1255150 1319900 1245238 1252794 1405181 1455313
31594 1455313 1407858 1334697 1256915 1220180 1208514 1152357 1074066 1117331 1159142 1215964 1222701
31583 1222701 1224440 1163619 1145090 1153558 1115317 1223539 1255580 1247084 1234562 1248237 1248882 1208960
31571 1208960 1154488 1193343 1222039 1260697 1279639 1278758 1315961 1298925 1257531 1261188 1253854 1292220
31559 1292220 1301017 1222392 1273362 1309486 1281733 1322376 1369671 1338318 1278347 1219778 1232878
31548 1232878 1297200 1295154 1301205 1244570 1255449 1219036 1196733 1207466 1167934 1164226 1226609 1208202
31536 1208202 1210509 1164778 1205932 1296128 1291141 1290352 1237782 1245990 1328757 1308335 1298461 1307879 1259060
31523 1259060 1200026 1203931 1212518 1240820 1243387 1294645 1300085 1245224 1235911 1274794 1286892 1268684
31511 1268684 1239106 1264294 1315747 1343181 1314942 1243729 1287860 1290660 1214086 1189318 1183816 1229781
31499 1229781 1219454 1173218 1179411 1194075 1269394 1269839 1324504 1293043 1298221 1312987 1247194 1195591
31487 1195591 1163747 1231118 1244870 1213961 1269167 1276517 1277217 1289825 1320508 1350130 1417785 1388315
31475 1388315 1381050 1401261 1321213 1282484 1271203 1252101 1240266 1340570 1402165 1330989 1308287
$$ [...]
##END NTUPLES=NMR SPECTRUM
##END=
