##TITLE=Analysis number 321320
Compound Code rh 00766
Book Reference b
Project Code adrs
Chemist Name stores
##JCAMPDX= 6.0         $$ Bruker NMR JCAMP-DX V2.0
##DATA TYPE= NMR SPECTRUM
##DATA CLASS= NTUPLES
##ORIGIN= Bruker BioSpin GmbH
##OWNER= nmr
$$ XWIN-NMR		Version 3.5
$$ Thu Aug  3 13:47:03 2006 GMT Daylight Time (UT+1h)  MAYBRIDGE\nmr@NMR_250MHZ
##.OBSERVE FREQUENCY= 250.131544655141
##.OBSERVE NUCLEUS= ^1H
##.ACQUISITION MODE= SIMULTANEOUS (DQD)
##.ACQUISITION SCHEME= undefined
##.AVERAGES= 16
##.DIGITISER RES= 18
##SPECTROMETER/DATA SYSTEM= dpx250
##.PULSE SEQUENCE= zg30
##.SOLVENT NAME= CDCl3
##.SHIFT REFERENCE= (INTERNAL, CDCl3, 0, 16.522)
##AUDIT TRAIL= $$ (NUMBER, WHEN, WHO, WHERE, WHAT)
$$ ##TITLE= Audit trail, XWIN-NMR		Version 3.5
$$ ##JCAMPDX= 5.01
$$ ##ORIGIN= Bruker BioSpin GmbH
$$ ##OWNER= nmr
$$ C:\u/data/dgb/nmr/ADRS/250/pdata/1/auditp.txt
$$ ##AUDIT TRAIL=  $$ (NUMBER, WHEN, WHO, WHERE, WHAT)
(   1,<2006-08-03 13:46:43.95 +100>,<MAYBRIDGE\nmr>,<NMR_250MHZ>,
      <created by zg, POWCHK disabled, PULCHK disabled
       configuration hash MD5:
       E2 DF 36 D8 04 B2 41 60 5A D7 A3 38 5A 4B D0 FE
       data hash MD5: 64K
       02 32 5B 86 E2 BA 04 53 2E 70 6E 7C 13 62 D5 07>)
(   2,<2006-08-03 13:46:56.20 +100>,<MAYBRIDGE\nmr>,<NMR_250MHZ>,
      <Start of raw data processing
       ef LB = 0.3 FT_mod = 6 PKNL = 1 SI = 32K 
       data hash MD5: 32K
       E5 70 EC FB 1B 99 8D 72 39 3D FF 13 4A 98 2F A0>)
(   3,<2006-08-03 13:46:57.81 +100>,<MAYBRIDGE\nmr>,<NMR_250MHZ>,
      <apk 
       data hash MD5: 32K
       4A 60 9E BA 57 D2 A1 20 DC 86 CE F2 A2 C7 88 D3>)
(   4,<2006-08-03 13:46:58.54 +100>,<MAYBRIDGE\nmr>,<NMR_250MHZ>,
      <abs ABSG = 5 
       data hash MD5: 32K
       B0 ED B2 79 3F 20 2B A4 33 CB 51 91 80 8B 2F 58>)
$$ ##END=
$$ 
$$ hash MD5
$$ 64 E2 75 8F 29 EA F5 F0 7F 6A 9F 23 E0 C5 A3 3E
##$RELAX= 
##$RELAX= 
##$RELAX= 
##$RELAX= 
##$RELAX= 
##$RELAX= 
##$RELAX= 
$$ Bruker specific parameters
$$ --------------------------
##$DU= <C:\u>
##$EXPNO= 250
##$NAME= <ADRS>
##$PROCNO= 1
##$TYPE= <nmr>
##$USER= <dgb>
##$AMP= (0..31)
100 100 100 100 100 100 100 100 100 100 100 100 100 100 100 100 100 100 
100 100 100 100 100 100 100 100 100 100 100 100 100 100 
##$AQSEQ= 0
##$AQ_mod= 3
##$AUNM= <au_zg>
##$AUTOPOS= <36 >
##$BF1= 250.13
##$BF2= 250.13
##$BF3= 250.13
##$BF4= 250.13
##$BF5= 500.13
##$BF6= 500.13
##$BF7= 500.13
##$BF8= 500.13
##$BYTORDA= 1
##$CFDGTYP= 0
##$CFRGTYP= 5
##$CHEMSTR= <none>
##$CNST= (0..31)
1 1 145 1 1 1 1 1 1 1 1 1 1 1 1 1 1 1 1 1 1 1 1 1 1 1 1 1 1 1 1 1 
##$CPDPRG= <>
##$CPDPRG1= <>
##$CPDPRG2= <>
##$CPDPRG3= <>
##$CPDPRG4= <mlev>
##$CPDPRG5= <mlev>
##$CPDPRG6= <mlev>
##$CPDPRG7= <mlev>
##$CPDPRG8= <mlev>
##$CPDPRGB= <>
##$CPDPRGT= <>
##$D= (0..31)
0 1 0 0 0 0 0 0 0 0.06 0 0 0 0 0 0 0.0002 0 0 0 0 0 0 0 0 0 0 0 0 0 0 
0 
##$DATE= 1154609203
##$DBL= (0..7)
120 120 120 120 120 120 120 120 
##$DBP= (0..7)
150 150 150 150 150 150 150 150 
##$DBP07= 0
##$DBPNAM0= <>
##$DBPNAM1= <>
$$ [...]
##$SUBNAM7= <"">
##$SUBNAM8= <"">
##$SUBNAM9= <"">
##$SW= 20.6930455092707
##$SWIBOX= (0..15)
0 0 3 0 0 0 0 0 0 0 0 0 0 0 0 0 
##$SW_h= 5175.983436853
##$TD= 65536
##$TD0= 1
##$TE= 296.16
##$TE2= 300
##$TE3= 300
##$TEG= 300
##$TL= (0..7)
0 120 120 120 120 120 120 120 
##$TP= (0..7)
150 150 150 150 150 150 150 150 
##$TP07= 0
##$TPNAME0= <>
##$TPNAME1= <>
##$TPNAME2= <>
##$TPNAME3= <>
##$TPNAME4= <>
##$TPNAME5= <>
##$TPNAME6= <>
##$TPNAME7= <>
##$TPOAL= (0..7)
0.5 0.5 0.5 0.5 0.5 0.5 0.5 0.5 
##$TPOFFS= (0..7)
0 0 0 0 0 0 0 0 
##$TUNHIN= 0
##$TUNHOUT= 0
##$TUNXOUT= 0
##$USERA1= <user>
##$USERA2= <user>
##$USERA3= <user>
##$USERA4= <user>
##$USERA5= <user>
##$V9= 5
##$VALIST= <valist>
##$VCLIST= <CCCCCCCCCCCCCCC>
##$VD= 0
##$VDLIST= <DDDDDDDDDDDDDDD>
##$VPLIST= <PPPPPPPPPPPPPPP>
##$VTLIST= <TTTTTTTTTTTTTTT>
##$WBST= 1024
##$WBSW= 4
##$XGAIN= (0..3)
0 0 0 0 
##$XL= 0
##$YL= 0
##$YMAX_a= 328854
##$YMIN_a= -559276
##$ZGOPTNS= <>
##$ZL1= 120
##$ZL2= 120
##$ZL3= 120
##$ZL4= 120
##$ABSF1= 16.522
##$ABSF2= -4.171173
##$ABSG= 5
##$ABSL= 3
##$ALPHA= 0
##$AQORDER= 0
##$ASSFAC= 0
##$ASSFACI= 0
##$ASSFACX= 0
##$ASSWID= 0
##$AUNMP= <proc_1d>
##$AZFE= 0.1
##$AZFW= 0.1
##$BCFW= 0
##$BC_mod= 0
##$BYTORDP= 0
##$COROFFS= 0
##$CY= 12.5
##$DATMOD= 1
##$DC= 0
##$DFILT= <>
##$DTYPP= 0
##$F1P= 14.0000005364418
##$F2P= -0.99999901652339
##$FCOR= 0.5
##$FTSIZE= 32768
##$FT_mod= 6
##$GAMMA= 0
##$GB= 0
##$INTBC= 1
##$INTSCL= 1
##$ISEN= 128
##$LB= 0.3
##$LEV0= 0
##$LPBIN= 0
##$MAXI= 10000
##$MC2= 0
##$MEAN= 0
##$ME_mod= 0
##$MI= 0
##$NCOEF= 0
##$NC_proc= -4
##$NLEV= 6
##$NOISF1= 0
##$NOISF2= 0
##$NSP= 0
##$NTH_PI= 0
##$NZP= 0
##$OFFSET= 16.522
##$PC= 1
##$PHC0= 147.2581
##$PHC1= 11.91162
##$PH_mod= 1
##$PKNL= yes
##$PPARMOD= 0
##$PSCAL= 4
##$PSIGN= 0
##$REVERSE= no
##$SF= 250.13
##$SI= 32768
##$SIGF1= 0
##$SIGF2= 0
##$SINO= 400
##$SIOLD= 32768
##$SREGLST= <1H.CDCl3>
##$SSB= 0
##$STSI= 32768
##$STSR= 0
##$SW_p= 5175.98343685301
##$SYMM= 0
##$S_DEV= 0
##$TDeff= 65536
##$TDoff= 0
##$TI= <Analysis number 999999
Compound Code 99
Book Reference 9
Project Code 9>
##$TILT= no
##$TM1= 0
##$TM2= 0
##$TOPLEV= 0
##$USERP1= <user>
##$USERP2= <user>
##$USERP3= <user>
##$USERP4= <user>
##$USERP5= <user>
##$WDW= 1
##$XDIM= 32768
##$YMAX_p= 359565608
##$YMIN_p= -264300
$$ End of Bruker specific parameters
$$ ---------------------------------
##NTUPLES= NMR SPECTRUM
##VAR_NAME=  FREQUENCY,     SPECTRUM/REAL,   SPECTRUM/IMAG
##SYMBOL=    X,             R,               I
##VAR_TYPE=  INDEPENDENT,   DEPENDENT,       DEPENDENT
##VAR_FORM=  AFFN,          ASDF,            ASDF
##VAR_DIM=   32768,         32768,           32768
##UNITS=     HZ,            ARBITRARY UNITS, ARBITRARY UNITS
##FACTOR=    0.157963299565203, 1,           1
##FIRST=     4132.6476996994, 0,             0
##LAST=      -1043.33573715361, 0,           0
##MIN=       -1043.33573715361, -264300,     0
##MAX=       4132.6476996994, 359565608,     0
$$ Real data points
##PAGE= N=1
##DATA TABLE= (X++(R..R)), XYDATA
$$ [...]
23637D9718k2194J3861n215l4317o9892M82N2992K7821N43l6552M39m8281q528
23624g9123P2318k7473K6601N3318l7272k1000l9474M6572L0805q869l2063m9398
23612f5058P714K7798K2814l8690K6189k5296m4588j193P1797K6789p630o247
23600e601p0248L0332O0167n5712m1096L0376k6232k0580J6407N2815l9578O814
23588f2136k8844l3025K1025J3916q682m3662k4004N0713P8101K9416K251q2135
23576h7066K3794J2390K9470P8537j469J0986n0313m663L5148q8P75l5322k4496
23563a2317Q31j3741n9584o0618L7938K5943L8634M6160l620k4336m3688L7406
23551c0992N7304k6261L2736m9101k6549M2334N2654l528j0053j863j20K9747
$$ y = [49718, 27524, 41385, 36170, 1853, -68039, -67557, -14565, 13256, 13799, -22753, -22314, -70595, -79123, -6805, -34278, -7677, 45641, 8369, -12631, -52105, -5533, 25272, 16403, -15660, -65058, -57344, -29546, -6732, -45422, -19233, -44529, -89117, -90310, -18513, 8276, 646, -5601, -75849, -45517, 14650, -41062, -82158, -51782, -78014, -98594, -82187, -29372, -68950, -62136, -90980, -124005, -102980, -89064, -97746, -141408, -165412, -114699, -36598, -7182, -4931, -87066, -63272, -50882, -21412, 57125, 55656, 66642, 16329, 11666, 46814, 46726, 47501, 12179, -12317, -11486, -25227, -84811, -145429, -107491, -81548, -42914, 3246, -374, -24710, -68398, -30992, 26312, 51, 32787, -16314, -42863, -529, 52125, 48597, 38544, 36681, 36561, 66308]
23539F6308K5758n937o5300m7784j4216k2810n9383P7390R6040O6179j2546k3301
23527H0398k0878k2864M7089q061q5598L8769j992j17641N018l513l4419M8132
23515g5560K4497n7860j7955K9245n17n4627O6020R4076K3393j8350k9585O501
23503a0722O9826o880k9130L068k5059O9694j1393l2137k5419n7358m308k7248
23491h7066l9201N7454O1838L1922j9010n8474k9193J4781L55J8916m9467N285
23479i1860K4424M1913m8603o234m167J8183O8540K382l4171J4048l0427N5435
23467I463L9078L229R287K0186k3341p6946j4736n622N6548q901p8322P010K1175
23454d1892p905p0296j3008Q1288N3632R190p5094N403N1726j8494J295j8606
$$ y = [66308, 92066, 86129, 20829, -26955, -41171, -63981, -123364, -45974, 50066, 116245, 103699, 80398, 59520, 36656, 83745, 75684, -9914, 28855, 26863, -90778, -85760, -89273, -123692, -75560, -51063, -108923, -126878, -97633, -98150, -152777, -86757, 7319, 30712, 12362, -17223, -10722, 59104, 52224, 23094, 26162, 1103, 70797, 59404, 27267, 1848, -55510, -59818, -87066, -126267, -68813, -6975, 24947, 5937, -52537, -81730, -66949, -66594, -47678, -97145, -91860, -67436, -25523, -74126, -80360, -84527, -66344, 2196, 4578, -29593, -15545, -45972, 9463, 48541, 51770, 61057, 81243, 57902, -19044, -33780, -39402, 17146, 8245, -70077, -63067, -41892, -49797, -120093, -133101, -51813, 1819, 11009, -64085, -58682, -6956, -25450, -24155, -42761]
23442d2761J8874K8759j2769q016Q7514p370p1194j5564l2118j9663j1870L0667
23430e5511J4780L2106N3783k6729N124K6901n6904q2145L325K3179o974P297
23418f1768K7733L1431J0375k4173J5593k3194j787K8102j9559Q3151k3071L2745
23406G5578m5064n9630n132O0605M3162r8138J1723k159N1701K3716l853J0771
23394F3280p361k3012k280p947l5835k8457r723m0427L1329j7831j1200L7680
23382e1784O9493M9618q7831r444L2268k929J317J10853k0928o2380J7002L0867
23370G6122k2038J3662O0655M542k1076J684k1077N2110J6608n630l9921J8888
23358A34529J6667p287k303n9099o8022m8772k1287N4175P784m2953k4485l249
$$ y = [-42761, -23887, 4872, -7897, -15913, 71601, 64231, -6963, -22527, -54645, -74308, -86178, -55511, -40731, -8625, 45158, 18429, 23553, 50454, -6450, -88595, -85270, -62091, -69065, -61768, -34035, -2604, 7771, -16402, -809, -24003, -25790, 2312, -17247, 65904, 42833, 75578, 30514, -29116, -34248, 26357, 69519, -28619, -16896, -19055, 32646, 56362, 52509, 63280, 55919, 32907, 30627, 22680, -13155, -41612, -51335, -91762, -60433, -78264, -89464, -51784, 17709, 67327, -20504, -29948, 2320, -609, 708, 111561, 90633, 28253, 45255, 76122, 54084, 67746, 128401, 132943, 111867, 113551, 92474, 144584, 161192, 155562, 115641, 134529, 151196, 143909, 141606, 82507, 14485, -34287, -55574, -1399, 6385, -36568, -61053, -64302]
23346f4302n3550L1944O1994l088L2100O2142n6200m106Q704l1460J0074M2457
23334C6709k0895o739l9492K3876l2364J1049O307l7489Q745L8296Q2773J5705
23322H6481R454n5450q4943k6351K1276P422O4884K5779j0747k0320K5435J4838
23310E7758j3803m3936M7578N1080L1534M300O333l6943q3745J10q551k591J614
23297A0738N8095n465j37562l7311O8673P7373J4579n060l5323L5070k5164m8540
23285b9897O183Q95J1217l37K503K7857k2531K4220l7844J6255K9313p980k5985
23272f131J9265l1858n3694J79K5323Q408P7337l3007n003m8473l2103J374O7667
23259a0716Q3716K5743J1462j0504J4632n4662j2855J5461K36p142r420J1574
$$ y = [-64302, -117852, -85908, -23914, -27002, 5098, 67240, 11040, 6934, 15638, -15822, -5748, 36709, 15814, 9075, -30417, -6541, -38905, -27856, -21549, -59038, -50293, -11997, 70776, 86481, 95935, 40485, -44458, -70809, -49533, -42111, 22773, 48552, 37805, 17485, 42920, 57758, 43955, 19, 47597, 98677, 130211, 134511, 140844, 103901, 20156, 20266, 11715, 9124, 10738, 68833, 63368, -74194, -111505, -42832, 34541, 49120, 44060, 8737, 43807, 18643, -29897, -23714, -22819, -11602, -11939, -9436, 18421, -4110, 20110, -17734, -1479, 27834, 19854, -6131, 13134, -18724, -72418, -72239, -46916, -38508, 38829, 5822, 819, -47654, -79757, -78383, -10716, 73000, 98743, 110205, 99701, 114333, 59671, 46816, 62277, 62513, 55371, 45951, 57525]
23247E7525j2944J1651J7487l6418K0162k368N3276k3068p9761o859L9277K0578
23235E8538o767q940J3659q4728k3201J7251K7841J8833J3370Q0799M8567o0568
23223I4654l7192L4604N589m423l1416n382P316J0275n4789K7804k2594n8642
23211c4196P423K5185n6501m7929P1204M2146r961L4742k0525k2599k1245n0703
23199h2959N8946Q1410k0540K756J1855k1777K5715L260k4502k0430o1701m2313
23187i0280L4521M3568J0230k5617l6500J150O5929j0468L6081m047k376Q1571
23175A03762M0255o2044L5803J4321k5659j10301j1683m6655o0714m992M3251
23164h4656O4483P489N5757J6013j3334o9253j2591M0795r899j4782k8067l6224
$$ y = [57525, 44581, 56232, 73719, 37301, 57463, 55095, 108371, 85303, 5542, -1317, 37960, 58538, 51771, 42831, 56490, -28238, -51439, -34188, -6347, 12486, 25856, 106655, 155222, 94654, 57462, 92066, 97655, 93232, 61816, 56434, 63750, 74025, 19236, 47040, 24446, -34196, -26773, -1588, -58089, -106018, -34814, 7332, -2629, 32113, 11588, -11011, -32256, -82959, -24013, 57397, 36857, 39613, 51468, 29691, 55406, 58666, 34164, 13734, -47967, -90280, -55759, -12191, -1961, -27578, -64078, -62928, 3001, -7467, 28614, 24567, 22191, 103762, 144017, 81973, 117776, 132097, 106438, -3863, -15546, -62201, -122915, -127907, -84656, -20173, -12684, 43073, 59086, 45752, -23501, -36092, 4703, -5196, -19978, -48045, -84269]
23152h4269J8370j0221P0523k8856L3385M2363L4180l3849o0140n74J4774n1305
23140e5619O0341M898m0268J9834m4902Q6014L8743p427q805J3729j931n4012
23128A0595j4403J02412j159j43675j08014L7651M6367K3591J00903l9176m2343
23117b7251P6193L5913j9930j07305k2026p721Q0594K8687l111k5022J5860M1696
23105F6577k6184l0246K7449K3947p259n4199j6182l37m1152m3900K0817k7080
23093a07749L0046O2540N3417K2330j9046l5889j779k3950m4273k7543P4328N8694
23081D1126j0734M248M9568k1438j4699k3631M470j4850q721K0093j3568l5889
23069b4025R568K1184p780k3690k1747L0596L4602n6963L0075J0730p2820K4433
$$ y = [-84269, -65899, -76120, -5597, -34453, -1068, 41295, 75475, 41626, -18514, -19088, -4314, -55619, 4722, 9620, -30648, -10814, -55716, 30298, 69041, 61614, 52809, 66538, 64607, 10595, -3808, 98604, 97445, -46230, -154244, -116593, -70226, -46635, 54268, 15092, -27251, 48942, 84855, 64925, -42380, -64406, -72127, 8467, 37154, 34043, 9021, 24881, 66577, 40393, 10147, 37596, 61543, 54284, 85, -16097, -16434, -57586, -101486, -80669, -107749, -77703, -15163, 38254, 60584, 41538, 5649, 3870, -20080, -64353, -91896, -17568, 41126, 30392, 34640, 84208, 62770, 48071, 24440, 28910, 14060, 5339, 25432, 11864, -24025, -14457, 6727, -1053, -24743, -46490, -15894, 18708, -38255, -8180, 2550, -70270, -45837]
23057d5837J9230q3199k855K4937L3055n1308J5009P8072R7822J5564m0563n1115
23045H812k4194j1249L104j0584J8245M507L8724K8636N2165n5435j8193O52k2916
23032A2274k8494l3672O949n1272K228M3044j2644j5354J5189l8247J9767K4672
23020e5560L0605K2527N208k4231L0814M1912o4237n2062m8968r258L9857O5434
23008a7959J4272K8220j3785j03869k3413Q7530l410o9485l2671L8943L3831M9316
22996a2480N8467m4085k2536J7392N8425K2946j3220r264m6822n718k0046J1237
22984e704R66K8820P3183K9819k8094o360o072r676j6644O687n3791k9109L0798
22971A4823Q4774l6961m6621L5605j9247m1112j542j0036m411m2938j656J4432
$$ y = [-45837, -26607, -109806, -112661, -87724, -54669, -105977, -90968, -12896, 84926, 100490, 59927, 8812, -15382, -26631, -23527, -34111, -15866, -11359, 27365, 56001, 108166, 52731, 34538, 35190, 12274, -16220, -49892, -42943, -94215, -91987, -48943, -61587, -76941, -61752, -99999, -80232, -55560, -24955, -2428, 2780, -21451, 9363, 51275, -12962, -65024, -113992, -123250, -83393, -17959, -3687, 24533, 10748, -93121, -116534, -29004, -32414, -101899, -134570, -95627, -61796, -12480, 45987, 1902, -20634, -3242, 55183, 78129, 64909, 55645, 8823, 3105, -16941, -5704, -4738, 24082, 97265, 127084, 98990, 92630, 86558, 76882, 60238, 66925, 13134, -15975, 14823, 99597, 62636, 16015, 51620, 32373, -8739, -10281, -20317, -24728, -67666, -69322, -54890]
22959e4890N2486k4125q894M441L8516m8482K2185K6270k1677L5398J0904j02026
22947f9894P837L5172O0338M4255n0225n7362K7419k4664O4824k6052L2377L3469
22935G7494Q962J2271j9328j12038k7077l5719J8798L2253L0351j5213J5181o011
22923b0076K3434K562l7987o0834n294P3068O9660k2857j2550O0356K9038O626
22911A05146l3738k0835L8048j2963K4771k8748r0412K2289M3526J4960r697M02
22899E2749L7372o3462r9504n889K4068j2513J7843l2949O532l2826M441L1351
22887g2787J719J0977p698l6965J2660M5606k244R081l7054K2149M1799N2586
22875C9829K8438K1213J123l576J0152M5827M966l9554j23180j01715P8708N8320
$$ y = [-54890, -2404, -26529, -35423, -30982, 7534, -40948, -18763, 7507, -14170, 21228, 32132, -69894, -62057, -26885, 33453, 77708, 27483, -29879, -2460, -27124, 37700, 11648, 44025, 77494, 86456, 98727, 79399, -32639, -59716, -95435, -76637, -44384, -14033, -29246, -14065, -20076, 3358, 5920, -32067, -92901, -98195, -25127, 44533, 21676, 9126, 69482, 98520, 105146, 71408, 50573, 88621, 75658, 100429, 71681, -18731, 3558, 47084, 62044, 52347, 52749, 90121, 26659, -72845, -78734, -54666, -67179, -49336, -82285, -75753, -108579, -104138, -72787, -71068, -60091, -67789, -104754, -92094, -46488, -48732, -39651, -76705, -54556, -12757, 39829, 68267, 89480, 90603, 87027, 97179, 143006, 147972, 108418, -14762, -116477, -37769, 20551]
22863B0551M2708K5238j4189O2266L697o67k5657o099j8333j6602k1189p8015
22851b6291k3568M3737K7235m8663m659J15028K4128j4249L8542m1052k1546O824
22839G5466l5196l4668j7095m7737P1748L9393n0505k9423J8758k5392L0461O2322
22827E8132L9086m4902k8894k2010j1297l1221o6096k1709n9730J10151J14009
22816C5519M59n9142J0368N793n6024J0504N5768L4455J4411r94k7757p8374J4956
22803d0058O3335m33o2797K2879M9436J8686j4200r9489k7690J3938p198R903
22791g3688r056M0546J2644O536J6111L1227K9506j9032n3626L7476L7220O675
22779F2539J6858k3646n8380n1607j7085L2621K4232q263R4310J7882o4305r9057
$$ y = [20551, 63259, 88497, 74308, 136574, 140271, 139604, 113947, 107848, 89515, 72913, 51724, -26291, -49859, -6122, 21113, -27550, -32209, 82819, 106947, 92698, 131240, 90188, 68642, 75466, 40270, 5602, -11493, -59230, 12518, 51911, 1406, -28017, -9259, -34651, -4190, 58132, 97218, 52316, 23422, 1412, -9885, -41106, -107202, -128911, -188641, -78490, 35519, 35978, -23164, -12796, -7003, -63027, -52523, 3245, 37700, 52111, 51117, 23360, -55014, -40058, 23277, 22844, -39953, -17074, 32362, 51048, 36848, -62641, -90331, -76393, -83591, -73688, -82744, -42198, -29554, -23018, -6907, 24320, 53826, 34794, -18832, 18644, 55864, 62539, 79397, 55751, -2629, -54236, -71321, -38700, -14468, -22731, 71579, 89461, 25156, -73901]
22767g3901n2155M9606Q9835O7965n249L0713l4505p6501j5802r210l5813k2719
22755h7736O7427O7598j4889n7594k5679M4744L5598m278q3696K1726O9101P281
22743C9603L2157L7250j7380n1347p7884K271m2540j9158n517K016L3910l205
22731f9824m0041o527J8848K6585J7958J9810Q8393m4522j6849K7413l2509R845
22719a420k0161J8680J0806K1700j3182L254p106N7991O2788m112k3802L3223
22707A38659r6737j18836K7472L5797J0571l2615l4074L9266J4885m5049k5657
22696h6318P5540L3909J8053L077k3364m0910j2913k2703j9815j146m014J5924
22684f4680M4414M094N691m7643m3538L2138L3096M5456P9931k9786r1016l1206
$$ y = [-73901, -126056, -76450, 13385, 81350, 76101, 106814, 72309, -4192, -19994, -29204, -65017, -87736, -20309, 47289, 32400, -25194, -50873, -6129, 29469, 25191, -58505, -36779, 32322, 39603, 71760, 109010, 91630, 40283, -37601, -35330, -77870, -97028, -102545, -100529, -66619, -69824, -109865, -116392, -97544, -70959, -53001, -33191, 55202, 10680, -6169, 21244, -11265, -1420, -21581, -2901, 7905, 29605, 16423, 19677, 12571, 70562, 133350, 129238, 105436, 138659, 41922, -76914, -49442, -13645, -3074, -35689, -69763, -30497, -15612, -60661, -86318, -10778, 23131, 41184, 44261, 20897, -20013, -32926, -55629, -75444, -76590, -80604, -64680, -20266, -16172, -10481, -58124, -101662, -69524, -36428, 9028, 88959, 59173, -31843, -63049]
22672f3049q975M8036m3340p676O5462J6051K3979m754L3531N2587l9817o0307
22660A1728J7272O973m0010L921N461M1533j4219k9879n3487L1630j207K6220
22648E936P902l9900j5184K8044O215K9430j7402l9698L5664N0543o0198K5664
22636A7016n3453L3550n067q0594J3740N6946j6405M0594K333r91J8517O6408
22624I2594K170m7153n4254k7015K1827l8294O3548K0156m2865n3719J7653M8262
22612B910K2961K3607L7922j7310o2862l2592O0895N2819q9067n1694K0671M636
22600b7104r205K8956N614j2842K377J480M5898o6275l542M8228m648j9014m3274
22587e3351J5784j0851K4345m0603P1826J8392j6776o5277Q066M4126j1124j8754
$$ y = [-63049, -72024, -23988, -67328, -75004, -9542, 6509, 30488, 25734, 59265, 111852, 72035, 11728, 29000, 35973, -4037, -116, 5345, 46878, 32659, 2780, -50707, -19077, -20284, 5936, 13838, -26062, -41246, -13202, -6987, 22443, 5041, -34657, 1007, 51550, -8648, 17016, -36437, -2887, -7954, -88548, -74808, -17862, -34267, 6327, 8660, 7669, 26186, 92594, 94764, 47611, -6643, -33658, -11831, -50125, 13423, 33579, -9286, -63005, -45352, 2910, 25871, 49478, 87400, 70090, 7228, -25364, 35531, 88350, -717, -52411, -31740, -27104, -36309, -7353, -1739, -14581, -12204, -10724, 35174, -31101, -34643, 13585, 8937, -10077, -53351, -37567, -48418, -24073, -64676, 7150, 25542, 8766, -56511, -48445, -4319, -15443, -34197]
22575c4197M4815l913J1477q685L293O1043m3822q2268m0068O0227n639J3760
22563b3977l5754m5492K8047P8805Q0954Q065p1516o3281j5265k4557m308N8372
22551b9907K2446L0781L426j2222J9828m6403N4351Q712J5295k4742J2687k9064
22539B5188l9176m3012J6715N1744p8955j4085l3806M1940R9846P7868m818k7397
22527G2052l6224k2760J0808R7928L5752J7817m2970l227k6010k2911o8188m0643
22515b8576n698K9076m2804k7514m8919k8164O8995O1899Q4314R0425O7325J8658
22503B39017m2785o3111n7424n2644k9599M251K9860q891j3082K2967L2753j6188
22491D5124J9831n5667J8606k4603n9084j194k5859J079L5419K3367N6205J0347
$$ y = [-34197, 10618, 6705, 18182, 9497, 12790, 73833, 30011, -52257, -92325, -32098, -37737, -23977, -59731, -105223, -77176, 1629, 82583, 90648, 19132, -44149, -59414, -83971, -88279, -29907, -7461, 23320, 26746, 14524, 34352, -12051, 42300, 51012, 66307, 41565, 54252, 25188, -13988, -57000, -40285, 11459, -67496, -81581, -115387, -73447, 26399, 104267, 99449, 72052, 35828, 13068, 23876, 121804, 157556, 175373, 132403, 129176, 103166, 80255, 12067, -28576, -34274, -5198, -48002, -75516, -124435, -152599, -83604, -21705, 62609, 153034, 220359, 239017, 196232, 133121, 75697, 23053, -6546, -2295, 27565, 18674, 5592, 28559, 61312, 45124, 64955, 9288, 27894, 3291, -55793, -56987, -82846, -81767, -46348, -22981, 33224, 43571]
22479D3571l2835L1673N3555k4584k6710J4762p4889q5329N5855J16303M465l2901
22467D2936K6181l3188l0044N3691n2989n0560k9012k2628K8949M9993n3267j1736
22455h1674k0084Q522O2071J1839r4244m1872j8272K8636P3164J9838L2753N8861
22443C9538q814N9057K0225r124n3253o9570K8474O8655K9027p6600m5296K5431
22431G750L1255m782k5733J5508K3106Q237K5944k019j2639O3567M2614k2439
22419A50369q2792k57M3331K7320q5567j14962r925R8558l1303o0896o0973O100
22407a20997J43406O0644n2476L5509P6504l2023j16656n8617M0863O9164k5088
22396B0233q5930k606K6569L4706R458n2332r818p1008J6488M9846n6029J6015
$$ y = [43571, 10736, 42409, 95964, 71380, 44670, 59432, -15457, -100786, -44931, 71372, 75837, 42936, 69117, 35929, 5885, 59576, 6587, -43973, -72985, -95613, -66664, -16671, -69938, -81674, -101758, -93236, -31165, -19326, -113570, -155442, -173714, -145078, -71914, -52076, -19323, 39538, 30724, 89781, 110006, 100882, 47629, -21941, 6533, 75188, 104215, 27615, -17681, 7750, 39005, 34223, 8490, 23998, 47104, 55341, 81285, 79266, 66627, 130194, 172808, 150369, 67577, 67320, 110651, 137971, 52404, -62558, -72483, 26075, -5228, -66124, -127097, -120997, 22409, 83053, 30577, 66086, 142590, 110567, -6089, -64706, -23843, 45321, 20233, -65697, -68303, -41734, -7028, 2430, -49902, -59720, -130728, -114240, -64394, -120423, -104408]
22384a04408J3209l5345L8434O1729k4971m7425j9499K5723M7225O24k586k0314
22372f7604m0860O1709K425L8921N4710K3005o1496O336k0126k6269l7759l4647
22360a01655M8019K622J3144O3374k3493j8524O9391M3891K7306l6646p8925o6441
22348e7937Q8903N4335N4165R34m4912K1581k5756o8735L555K9981O1797N5388
22336A73299m1892q7647q3530L1690k5033l0994N6904K8655p945L0419L399k1406
22324B5919K6220L4347J6288o3601p1386O5624J0878n4865n1870p087K5910L7190
22312f433k0140M0345L2164k7736o3505k2425l1888J7021L8319M109j963j6736
22300e8868j3526J3585n835L6763N2888K0019m3622m0215m1141K2636j134N6660
$$ y = [-104408, -91199, -126544, -88110, -26381, -51352, -98777, -118276, -92553, -45328, -44704, -47290, -67604, -108464, -46755, -44330, -5409, 49301, 72306, 10810, 17146, -2980, -29249, -67008, -101655, -53636, -51014, -37870, 25504, 2011, -16513, 52878, 96769, 124075, 87429, 8504, -57937, 30966, 85301, 139466, 140400, 95488, 117069, 91313, 22578, 26133, 56114, 117911, 173299, 131407, 43760, -39770, -8080, -33113, -64107, -7203, 21452, 13507, 43926, 47325, 25919, 52139, 86486, 102774, 39173, -32213, 33411, 44289, -10576, -62446, -69533, -43623, -6433, -26573, 13772, 45936, 18200, -45305, -67730, -99618, -82597, -44278, -40169, -42132, -58868, -72394, -58809, -64644, -27881, 25007, 45026, 1404, -38811, -79952, -57316, -58450, -1790]
22288a790R4074l6404o467J9492P655p3390n3707Q65K8253m571L2641n696q4959
22275h4004J2883L0292L4607l090n3714k502J2843P1479J4110r459m1650M1720
22263B3515L3285j9365k5036m59L6023o0325n0783N575j9237J763J3952L2250
22251b8842j9799k2357N2658j2695j7989N1854k665r394m488P2428K9810q401
22239H0120L1666J3687N258l4641j0622k0058M540M9852l3685o86N0866K982j2784
22226A26495J1866k5946o9645q1007O347N4420J9162P571J8399R704M9277j3916
22214A12727r7130p9085J5114O8500L907n6486r127l886L0422P598r155l3570
22202e0171K2756P5861L05n0119N1468m492o6923J1043J9633r98J4061K5662M9534
$$ y = [-1790, 92284, 55880, 49413, 68905, 76560, 3170, -50537, -49672, -21419, -25990, 6651, 955, -84004, -71121, -40829, -6222, -9312, -63026, -65528, -52685, 18794, 32904, 23445, -18205, 23515, 56800, 37435, 12399, 11940, 47963, -12362, -63145, -57570, -76807, -75044, -61092, -28842, -48641, -70998, -18340, -31035, -49024, 2830, 165, -9229, -13717, 58711, 88521, 80120, 111786, 125473, 130731, 96090, 85468, 65410, 69950, 119802, 86117, 85431, 136297, 139279, 126495, 138361, 112415, 42770, -38237, -31890, 22530, 41692, 49263, 67662, 77366, 126643, 112727, 15597, -63488, -48374, 20126, 24033, -32453, -41580, -45466, -15044, -7446, -16601, -50171, -27415, 48446, 48751, -1368, 50100, 45608, -21315, -10272, 9361, 8363, 22424, 48086, 97620]
22189I7620p0737p2050J048k304k8667L0140j7420L1013O5309L2599n145j279
22177F0127O2331k2480m2244o2878q061O3999k2289m4056o3796L057L8831N0681
22165A3222n034o920M9653K3404K1945l0570m1181k1967R288j599m302n315k1476
22152b0852O138R2638J925n1431M9323N5112l3091n7382m1549m2325j1212n5082
22140a07788M2890L0680j3497j0312O5952M3403N659O0122P12M584j02357J5667
22128C5715L7370J2634o2326K565M2254M5312j6777o4288j21793q5870N189O6793
22116a03222Q5596j9452l9533L2114K4989N1712j9684J3708O7795q383n8213k7858
22104d31p355j3368K7446m5353l0559K1573N8032P1479k0995J3999J2988p967
$$ y = [97620, 26883, -45167, -44119, -46423, -75090, -44950, -62370, -31357, 33952, 66551, 61406, 60127, 122458, 99978, 57734, -5144, -13205, 50794, 28505, -15551, -79347, -76290, -37459, 13222, 8188, 1268, 50921, 74325, 96270, 65700, 24519, 2552, 11840, 10241, 5939, 624, -20852, -14714, 77924, 79849, 28418, 77741, 132853, 99762, 42380, 831, -41494, -52706, -107788, -64898, -34218, -47715, -58027, 7925, 51328, 56987, 117109, 117821, 122405, 20048, 35715, 73085, 85719, 23393, 25958, 68212, 113524, 96747, 32459, -89334, -175204, -170015, -103222, -17626, -37078, -76611, -44497, -19508, 32204, 12520, 26228, 94023, 85640, 27427, -431, -7786, -21154, 6292, -39061, -69620, -48047, 9985, 81464, 60469, 74468, 87456, 79489]
22092G9489m1159j1253k9692K0530n853n6664P877Q789k491K0365L7889N915L2290
22079F6032Q720L8610l7469k0237o2303n9303J5176o6313k98L528O9926L4132
22067i799L9063J7412L2389k4859n7874K4928K7855R7571L0826r7871j3192L5819
22055A02268l0624q0759j3700J6687l3596j2711N2991M9022l7301m0026K5220
22044b529j2238m5442r033M2503L2864l791q1059K383L6672L6860M2970k793R977
22031D7344k1874o3480m4942n0455N4334J4233L0363M1148L5571L9951l8572m0578
22019C043J0311K2718j8403p7818l6713M8237N9166K8473m5738K968L2662o0432
22007c1526P199j5267j1384O6449r819j9621J195p7921m7055L8613R564J04575
$$ y = [79489, 38330, 27077, -2615, 17915, 12062, -44602, -36725, -27936, -30427, -10062, 27827, 33742, 66032, 74752, 113362, 75893, 55656, -6647, -65950, -50774, -117087, -117385, -113857, -43931, -9799, 29264, 46676, 79065, 54206, -3668, 21260, 49115, 146686, 177512, 79641, 66449, 102268, 71644, -9115, -22815, -6128, -39724, -52435, 556, 49578, 12277, -27749, -2529, -14767, -60209, -69242, -26739, 6125, 2334, -78725, -76342, -39670, -2810, 40160, 37367, 47344, 25470, -38010, -82952, -133407, -79073, -64840, -34477, 6671, 42242, 82193, 43621, 3043, 13354, 36072, 17669, -60149, -96862, -48625, 10541, 39014, -6724, -3756, 28906, -31526, -24327, -39594, -50978, 15471, 5652, -13969, -12774, -90695, -137750, -99137, -89573, 15002]
21995A5002j4117m3707n4344J1142O1823K279J1355k7856P2355L2153l1821K8826
21983F3090J5739l7042j9495n247K3673k897k2402O7316k516l5364m4769L7031
21971C7117K9297r676M1906J2897r423k2467l727p7232k1641J1817m4398l2052
21959h7582L5355l3740M2393L9619K9266K7733l7025j6056L9407O4395j7342k3719
21947F2704j5813J0149j1576j7584N8039o567m0162q987l0306Q4000L1223K2309
21935A37429j932m3799r382J6713k5815n9770J4016Q9869k4551l7732j3168j00155
21923e8277m0397J187L8440L9146p50m8705l4086p214R8602L0797r548o067k0155
21910a7027K1595Q380l1724l0610o2643j2033O4333o011N8345l5030m8206K4790
$$ y = [15002, 885, -42822, -97166, -86024, -24201, -21922, -10567, -38423, 33932, 66085, 34264, 63090, 78829, 41787, 22292, 17045, 40718, 37821, 15419, 82735, 80219, 44855, 86, 37117, 66414, 56738, 98644, 111541, 102118, 79651, 75924, -1308, -22949, -11132, -55530, -87582, -52227, -85967, -43574, -3955, 25311, 53044, 16019, -37, 39370, 103765, 86423, 62704, 46891, 57040, 45464, 27880, 85919, 79352, 39190, 30203, -103, 83897, 115120, 137429, 135497, 91698, 82316, 99029, 73214, 13444, 27460, 117329, 92778, 55046, 41878, -58277, -98674, -97487, -59047, -19901, -20651, -69356, -103442, -110656, -12054, 18743, 9195, 3128, -17027, 4568, 12948, -18776, -49386, -112029, -124062, -59729, -65740, -7395, -42425, -90631, -65841]
21898f5841L2379J2752j7788l0759k3658j4744M0750Q3709J4776l4516l1313k1310
21886e5563R317L6248j4669p001L8418N6743K0658Q406l3052L5258k131q1087
21874A1545l9512L2232N740m5033K773J0807J6878K3241j4099p2296k0065n129
21862i2918p337J7022M0758O0376K07j2923K6915j6069J8816j7757j7561j7392
21850a7863N6204M0609k8187k8322k9286j19590p348K2656j6876O1493N4210k7662
21838c9962l3049J1582M6099Q2063l5058l2459J8546J1476n4876O647j8020l7381
21826g4392K3349m987J2237N0691n9739j6826R3405L9055J002N5618J8455N486
21814A43354p2936l3945m115j6978j6402l0151L2299K3074J421k1092R3106k3031
$$ y = [-65841, -33462, -20710, -38498, -69257, -92915, -107659, -66909, 16800, 31576, -2940, -34253, -55563, -46246, -9998, -24667, -31668, 6750, 63493, 84151, 92557, 59505, 94763, 92632, 11545, -27967, 4265, 10005, -35028, -32255, -21448, -4570, 18671, 4572, -67724, -87789, -92918, -100255, -83233, -42475, 17901, 18108, 5185, 32100, 16031, 34847, 17090, -471, -17863, 38341, 78950, 50763, 22441, -6845, -126435, -133783, -111127, -128003, -66510, -12300, -39962, -73011, -61429, -15330, 66733, 31675, -784, 17762, 29238, -25638, -18991, -37011, -74392, -51043, -56030, -43793, 6898, -52841, -69667, 23738, 62793, 63795, 119413, 137868, 143354, 70418, 36473, 32358, 15380, -1022, -31173, 1126, 24200, 25621, 4529, 97635, 74604]
21802G4604l6616m770J5910k2897k3030J7301j672l5311n8233M4695J5353k888
21790a7554m9245j477N4078L0369o3214O2549M7399l2979m6102j4797L6919O9737
21778G5683J9035l3304j1565J7908L6491O928p715m3855q0482o9657N6155l497
21766c7875M9278N7069k9530m3543L3774O0879m1360m1597M7201o0067k1463L7811
21754A0577N0771L8652m7221l4652L8075L3571J0948q7820r3542N4814O1360j2841
21742B2692j8097L2184L4565J2294m920j9601l1321J3443N996q3826k5520J7458
21730d4653O3806M0961r196l7565N5224M7092N9458l7234r8730l9395L39K520
21718B627K8802Q201K0675L6834k4781J765K8905l1626o6179P316P4856O6343
$$ y = [74604, 37988, 33218, 49128, 26231, 3201, 20502, 18830, -16481, -74714, -30019, -14666, -17554, -66799, -68276, -14198, 16171, -47043, 15506, 62905, 29926, -16176, -30973, 5946, 75683, 94718, 61414, 49849, 67757, 104248, 111176, 103461, 59606, -20876, -90533, -34378, -37875, 11403, 68472, 38942, -4601, 29173, 90052, 48692, 7095, 54296, -5771, -27234, 10577, 61348, 100000, 52779, 18127, 56202, 89773, 100721, 12901, -80641, -25827, 35533, 22692, 4595, 36779, 71344, 83638, 78718, 59117, 27796, 41239, 47235, -36591, -62111, -44653, 19153, 60114, 50918, 13353, 68577, 115669, 175127, 137893, 39163, -232, 107, 2627, 31429, 39630, 60305, 97139, 72358, 74123, 103028, 71402, 5223, 12539, 87395, 153738]
21706A53738q9229n5184j5339l1992o0876k7710M2989J6213l8887K6778M9229
21695c0270P4758O0252r727K4446J3908p9637k9066J6559R8800L3138q1689j07396
21683a5924n6478j6739L3307M2129J8303q632j4269r675N3373N4774J9467n7365
21671D2271m7538K2584k156q9967L6977K8415l0465L9018L6670p195M262L7323
21659G0199k7635j7176n2674k6989L9038P2101K5936j9194o5539o0463m590N2290
21647a4696L5934K3033q690m8775o9263J2725J05189M5249j6259p5211j6342K7012
21635i4J6325m8419m6843L2659N536L4161j0276k4385J6450L6404Q382K8636K9910
21622G8446k4764m9106p74O373M7620Q0854j7402j9502j6200q6223p489j6574
$$ y = [153738, 64509, 9325, -6014, -38006, -98882, -126592, -83603, -67390, -106277, -79499, -30270, 44488, 104740, 95013, 119459, 133367, 53730, 24664, 41223, 140023, 173161, 91472, -15924, -72402, -89141, -55834, -13705, 4598, -4034, -18303, -27978, 25395, 80169, 99636, 42271, -5267, 17317, 15161, -74806, -37829, -9414, -39879, -861, 35809, 28614, 32876, 70199, 42564, 25388, -27286, -54275, -15237, 56864, 82800, 63606, -1933, -62396, -66986, -14696, 21238, 44271, 35581, -13194, -82457, -69732, 35457, 80706, 64447, -10764, -27106, -94, 16231, -32188, -79031, -46372, -40836, -6675, -16951, -41336, -24886, 11518, 19900, 48536, 78446, 53682, 4576, 3802, 10175, 57795, 138649, 121247, 101745, 85545, -678, -8167, -24741]
21610b4741k587M4184k1157O0034J0084J7089L961m2623k9267J1631N2020k2941
21598E5687n3478m4639j3750M0159L4519q717O1173J15212m8873q5897n3148m5108
21586d6860K0116M4203k35l4818j1499Q4793j1191j8868m3414l6947L6708M740
21574a3272k730o290J6406n661j7378j1440Q7292N570r3986l439L5106L8903k1379
21561G702m0358M1440M7210j0008l8307K1283L8805K6342o0505l1915m6966K9398
21549a5879Q3019M1231J2463O175L4270K3489q9349p8708p8834l1617Q067L6369
21537d9304P8492l915O829k4268K1955J7561j4464j6959L4641O588R496m0465
21525B6187l130k047j8434r848K5941K6701O8737K5022m7461k2034O460J4417
$$ y = [-24741, -27328, 16856, -4301, 55733, 65817, 82906, 86867, 44244, 14977, 26608, 78628, 55687, 2209, -42430, -56180, -16021, 18498, 9781, 70954, 186166, 137293, 51396, -1752, -46860, -26744, 17459, 17224, -17594, -29093, 55700, 44509, 25641, -17773, -54720, -18012, -13272, -16002, -22292, -5886, -11547, -28925, -40365, 46927, 52497, -41489, -44928, -9822, 29081, 7702, -32656, 8784, 55994, 45986, 7679, 28962, 67767, 94109, 33604, 1689, -45277, -15879, 67140, 108371, 120834, 127009, 161279, 184768, 95419, 16711, -62123, -93740, -85673, -49304, 29188, 25273, 32102, 7834, 29789, 47350, 32886, 15927, 50568, 57156, 66652, 26187, 23057, 21010, 2576, -7272, 18669, 45370, 114107, 139129, 91668, 69634, 76094, 90511]
21513I0511K4613k2957j9469j4595k991k4159K9003K9488m3075K1839M9135n5294
21501F2049q7070r955M8621L0593L1125k3297q1960L5646K2194L4903J2283J7741
21489I2873q774o8069q552M9679k8052k3385J9299o441l1942k8527O141L4150
21477a600J2046P381J486J7596m561K0476l7965o642j2339l0180O6448q693l758
21464A9695J6796K5965j4468j1397k5879j0612Q5786J5679j01145m6257Q398k4715
21452f2154k5009J8517K8760K0715l7333n9059O7716J9660o147j5804M4434M5826
21440D0122P0700K1993m9921o2905n2098l8845k1164L2738J3393l7249l7282K6148
21428i4370M5874J9529n757o1241J9530L3227Q3873O9382m1136j2288J502N462
$$ y = [90511, 115124, 92167, 72698, 58103, 55112, 30953, 59956, 89444, 46369, 68208, 117343, 62049, -25021, -34976, 13645, 44238, 75363, 52066, -29894, 5752, 27946, 62849, 75132, 92873, 84099, 16030, 7478, 57157, 29105, 5720, 25019, 18578, -13364, -41891, -35750, -1600, 10446, 17827, 19313, 36909, 32348, 52824, 14859, 8217, -4122, -34302, 32146, 23453, 19695, 36491, 62456, 47988, 36591, 10712, 100, 85886, 101565, 420, -45837, -37439, -62154, -87163, -68646, -39886, -19171, -56504, -115563, -47847, -28187, -34334, -50138, -5704, 40122, 110822, 132815, 82894, 19989, -32109, -70954, -92118, -59380, -45987, -83236, -120518, -94370, -48496, -28967, -34724, -95965, -76435, -43208, 40665, 110047, 68911, 56623, 58125, 63587]
21416F3587P363m0184J2182o87n5025m606M608j6999k479J8202J14072J001m0236
21403F0799K7097J3142m1035q7662n5967P6143k358l8507M936n6720P326N2443
21391d0363R7921M9121q880K338j8877M600l2019o4024p2195p464J07899O6043
21379H4100o2430K6345j978l1250L018j3108O552J2898n828J1653L5134j9319
21367D5787l3277N8003J3486k547q4759J7310N9173J1487j9350p0389N4764K776
21355E2464j06362j02965j5590P3724M5374n812P9857l7352m6289j054n3058L2268
21343h4795P9376p833P80j3401J5892K5004J8571N3468R762m8740o2775L0513
21331A5822K3362J4291K6437L7844l9430k1869M6927j5674o7300J0074K1368L1454
$$ y = [63587, 70950, 30766, 42948, 42261, -12764, -17370, -12762, -29761, -32240, -14038, 100034, 101035, 60799, 87896, 101038, 60003, -27659, -83626, -7483, -9841, -48348, -43412, -100132, -92806, -40363, 57558, 106679, 97799, 100137, 81260, 85860, 53841, -10183, -82378, -89842, 18057, 84100, 21670, 48015, 46037, 14787, 17805, 4697, 11249, 24147, 18319, 29972, 65106, 45787, 12510, 70513, 83999, 81452, -3307, 14003, 73176, 84663, 65313, -5076, 49688, 52464, -53898, -156863, -172453, -98729, -53355, -59167, 20690, -16662, -62951, -64005, -117063, -84795, -5419, -13252, -12472, -25873, -9981, 15023, 33594, 87062, 96824, 48084, -14691, 15822, 39184, 53475, 79912, 117756, 78326, 56457, 103384, 87710, 20410, 30484, 51852, 83306]
21319H3306j8777q8523j838l0321N838k7037M5218J5182N0191j2438q043j2701
21307E7j0375M0083Q7570K1n7865l6104l0563j7078q328J5139R8636n353l2333
21294D3507K6805o7044l3885J381P0371l6285l993k3426K1114o5700k1839j4258
21282a03252m1128L5829J06866J02487l0161o0862J4381k4464L745k5067k1229
21271d2855Q3967l949j2454k9697l774O2804l15K1711j5196J6239m8105o2282
21259c3906M3737j0129k6219L5185O1406K6401m571k0035m4206o6374J4051N4332
21247B9672J8864o1711m7392l2995j720J10536Q2008P4623M0533l2778r585p1497
21235I8558o128J9183q835J606K5742k0302l6072P0062p2234m3174p841P273M1611
$$ y = [83306, 64529, -23994, -25832, -56153, -50315, -77352, -32134, -16952, 33239, 20801, 12758, 57, -10318, 29765, 117335, 117356, 59491, 23387, -7176, -24254, -32582, -17443, 81193, 75840, 43507, 70312, 3268, -30617, -29236, 41135, 4850, 857, -22569, -1455, -67155, -88994, -103252, -144380, -108551, -1685, 100802, 70641, 9779, 24160, -304, 3441, -21626, -42855, 41112, 37163, 24709, -4988, -8762, 54042, 53727, 75438, 60242, 76481, 28376, -33906, 9831, -298, -26517, 8668, 70074, 96475, 91904, 71869, 27663, -38711, -24660, 29672, 48536, -13175, -60567, -93562, -95282, 15254, 97262, 171885, 212418, 179640, 170055, 98558, 92430, 111613, 102778, 104384, 130126, 109824, 73752, 143814, 71580, 28406, 20565, 27838, 69449]
21222F9449K9092m1828l2077k6826N2978j4896K5018N5145q0745m441k2743o2693
21210e4567r750L8985L5960J6515j8031J1093N5313M0711K6531L7208o7404j5217
21198I7347K8652j1454j5554J74L1050k919p4702R35J2959m5429m5931M7238N2368
21185G4734j1937N599k2376J4177k1749q9188J1177R0183O1574l0114o3057j8843
21173A80k0542M3260m4030j4371k9132l0730K3557P0755J5153L0685M2043J29
21161H6957N5309k2469r1363M4723L9097J9451O9355R187j8872j3406m7348k5404
21149A05217m9181j5099L2447K9085m400N5436o6206k4717J1319m7656L8337j2330
21137E2252J152m178L8123k240j1555K1267j7902K0876N4349k8517k400j3999
$$ y = [69449, 98541, 56713, 24636, -2190, 50788, 35892, 60910, 116055, 35310, 30869, 8126, -54567, -64317, -25332, 10628, 27143, 9112, 20205, 75518, 116229, 142760, 179968, 112564, 97347, 125999, 114545, 98991, 99165, 130215, 127296, 52594, 53529, 66488, 21059, -24872, 22366, 74734, 62797, 68396, 46020, 60197, 38448, -50740, -39563, 50620, 112194, 82080, 19023, 180, -20362, 22898, -21132, -35503, -64635, -95365, -71808, -1053, 14100, 44785, 86828, 86957, 142266, 119797, 28434, 73157, 112254, 131705, 201060, 210247, 191375, 177969, 130621, 105217, 56036, 40937, 73384, 102469, 98069, 153505, 87299, 62582, 73901, 26245, 64582, 52252, 53404, 49226, 87349, 85109, 73554, 94821, 76919, 97795, 152144, 123627, 121227, 107228]
21125A07228o8354k8190P2336k0825m1517K5593j0200m022J2375N6274J8902q8096
21113C1504o060l4790k836P6387K1144k6943j4569o7619J2590O3831J6388j3543
21101E5484o049M3555Q206k3767l7334N5693j9724N3312M7627q949J6117l9625
21089A44546k6094l7725n7365m897j8534M3394P2886P039J5568Q265p8142q0401
21077a1460K7120l4519l8640k3237l1322j0160O8291P1530N2727N7858j9659m6875
21065F1654M381m413J403l9588m372n85J5825p5554l8215R7088K9640L4884J9388
21052A01536l3274J7987n328k322J2691K186N056n7954k0731m8122l6655O1759
21040c171j2185o0100N0058M5534K0722N4405L2227o3355L9092O1262J8711j304
$$ y = [107228, 38874, 10684, 83020, 62195, 20678, 46271, 36071, 32049, 44424, 100698, 119600, 31504, 25444, -9346, -12182, 64205, 85349, 58406, 43837, -23782, -11192, 52639, 69027, 55484, 49435, 92990, 101196, 77429, 40095, 95788, 76064, 129376, 177003, 168054, 184171, 144546, 118452, 80727, 23362, 18465, -69, 43325, 116211, 123250, 138818, 147083, 68941, -11460, 15660, -18859, -57499, -80736, -112058, -122218, -53927, 17603, 70330, 128188, 108529, 61654, 66035, 61622, 63025, 23437, 19065, 18480, 34305, -41249, -79464, 17624, 47264, 82148, 101536, 68262, 86249, 80921, 78599, 91290, 93476, 98532, 40578, 19847, -28275, -64930, -3171, -15356, -75456, -25398, 20136, 40858, 95263, 127490, 64135, 103227, 164489, 183200, 181896]
21028A81896L5591m7993q3128k4102K991j4132j6006Q750j5208N8607O690q648
21016H5308P4322O3446L7886n7465q6651k478m9621m8294k1711O6693M0241j9750
21004H1926K3434k8007J9555p337m341l5090m2025j7986m5154k9795m300J04580
20992A5460P0678m4564j8816K782m0146L2749N1315K9013p0851o228P7132k0046
20980G8478l3172L2404M3341j2282K5312L733r543j1127J0859j2852p5525m8074
20968h448M019L4793N2759K8064L1216r272q3122K3987M264K6367P996p4815k9386
20955H422M7704M1847J2178L4448J3181l0064l4557k2893M7359L1751k2284J3017
20943A40109J2107k0217m3038R32M7463o518m1248o245j1512j5520M1503L2885
$$ y = [181896, 217487, 169494, 86366, 62264, 65255, 51123, 35117, 43867, 28659, 87266, 93956, 85308, 159630, 223076, 260962, 203497, 116846, 114368, 64747, 16453, -5258, 61435, 101676, 81926, 105360, 77353, 96908, 89571, 85230, 50140, 8115, -9871, -55025, -84820, -89120, 15460, 86138, 41574, 22758, 25540, -14606, 18143, 69458, 98471, 27620, 21392, 98524, 78478, 45306, 77710, 121051, 108769, 134081, 137814, 128271, 117144, 128003, 115151, 39626, -8448, -4429, 30364, 83123, 111187, 142403, 133131, 50009, 73996, 78260, 104627, 112623, 37808, 8422, 56126, 97973, 110151, 144599, 157780, 127716, 93159, 70266, 117625, 149376, 127092, 140109, 152216, 131999, 88961, 89893, 137356, 130838, 89590, 83345, 71833, 56313, 97816, 130701]
20931A30701n0966q00O6660j5739m8336j5593J3809q693k1058j2018Q1539m2661
20919G6845j4235L3872Q5204K3959l8781n1954j7400J4983K6074k5840k4379L9627
20907A27975J23r021P045L887o7002R961J6829J8310K4384j3832o0274M1272M5208
20894A44865k7216m8419K9798o8798m6112P9918J7616J3050K6262m0631j02822
20883b2489m6470L2638K8544L8590J4683K6735k5090m411j4724l0719l3277J8329
20871a7661p1021k3352M5733O1242K6708K7405L779M8715J5487L6814M6441j0666
20859A89624p9984j2171K0218j5912j6590p941k8114L483K034L7456M3823k2485
20847A13441p1079l1079k7529j5284M3219k9578k379J0529K3597n0544k6694N8000
$$ y = [130701, 79735, 78935, 145595, 129856, 81520, 65927, 79736, 71043, 49985, 37967, 119506, 76845, 62610, 96482, 181686, 205645, 166864, 114910, 97510, 112493, 138567, 112727, 88348, 127975, 128098, 119077, 126122, 130009, 63007, 72968, 89797, 108107, 132491, 118659, 58385, 99657, 144865, 117649, 69230, 99028, 30230, -15882, 64036, 81652, 94702, 120964, 80333, -22489, -68959, -36321, -7777, 30813, 45496, 72231, 47141, 42730, 28006, -2713, -35990, -17661, -88682, -112034, -66301, -5059, 21649, 49054, 52833, 101548, 117035, 153849, 200290, 189624, 109640, 97469, 117687, 101775, 85185, 77244, 49130, 52613, 54647, 92103, 135926, 113441, 42362, 11283, -16246, -31530, 11689, -17889, -20268, -9739, 13858, -36686, -63380, -5380]
20835e380Q8740L679p2109J3215N1387J9140j8489J040M38r350k3755o6451n7948
20822g5843l206K1862P9436M8549K8229K9327k3619O246j3920J4807L9766k0641
20810A30993n8791q5568p7959O1371Q5564O3450o5825m3868M5624l2926L6607
20799E8672N0490K7606N651O037p2068k9508j4303P0473M6099l8115n9349q4799
20787c3114j833N7840M1514m8203J540M1392m4916p216K2650M3555p2313n9823
20775e8927p325K6914P5236L2626r072K31j2545K3650L7980J9080M469L486k4207
20762A11596n7975Q22j3272L3446k2694l1879M4898P0558j6006m3944O82l3293
20750D2939j5357j404Q1115K47n1870J2867O108R09n3464p5491J9543M8761j3109
$$ y = [-5380, 83360, 87039, 14930, 28145, 79532, 98672, 80183, 81223, 81661, 72311, 48556, -17895, -75843, -79049, -57187, 22249, 70798, 99027, 128354, 104735, 110981, 97061, 111868, 151634, 130993, 72202, -13366, -91325, -29954, 55610, 119060, 53235, 9367, 54991, 22065, 58672, 109162, 136768, 142419, 148456, 76388, 46880, 32577, 103050, 149149, 111034, 51685, -33114, -34947, 22893, 64407, 16204, 17744, 59136, 14220, 7004, 29654, 73209, 896, -58927, -66252, -39338, 35898, 68524, 59452, 59683, 47138, 70788, 108768, 127848, 132317, 135803, 111596, 53621, 54443, 41171, 74617, 51923, 20044, 64942, 135500, 119494, 75550, 76232, 42939, 27582, 26178, 107293, 107540, 55670, 68537, 74645, 75554, 22090, -53401, -33858, 14903, 1794]
20737A794J9968O5546K314L7520K1198m0309j7805K4899Q2444j6284j2886k7368
20725A41031O635k3778k7847l304M8977k1635p1177K0320O8616j4421k4380J4135
20713A13172l8286k2190M5124m7485N7116N98k3820M1483K0716L9039j6914l9650
20701A28903r439k5475L869m1704O1217K904m1742l5295n2668N4229P8636m6905
20689G6530J3754J860O2553R1610K6476l4578J0084k6707l2433l1045m3181l1666
20677H3257Q1086P6787q19l1074n8765l2830o320K6660M9122l0274j2956N2127
20665A96001P1986l4038p6244k6397l479k6263q3732n6609K2884Q0148M1908m1188
20653F4977m706k9213j7141j2324Q8089N3565l082n1407N5913L529l6585m4647
$$ y = [1794, 21762, 87308, 89622, 127142, 148340, 108031, 90226, 115125, 197569, 181285, 168399, 141031, 147666, 123888, 96041, 92737, 141714, 120079, 48902, 69222, 137838, 123417, 99037, 113172, 74886, 52696, 97820, 50335, 107451, 108049, 84229, 125712, 146428, 185467, 168553, 128903, 119464, 93989, 97858, 56154, 117371, 120275, 78533, 43238, -9430, 44799, 123435, 76530, 90284, 92144, 154697, 246307, 272783, 238205, 248289, 221582, 189149, 158104, 114923, 83257, 164343, 241130, 240311, 209237, 150472, 117642, 111322, 137982, 187104, 156830, 143874, 196001, 267987, 233949, 157705, 131308, 127829, 101566, 17834, -38775, -15891, 64257, 106165, 64977, 60271, 31058, 13917, 1593, 89682, 143247, 140165, 88758, 144671, 148200, 111615, 66968]
20641F6968n7814Q5166M0091k8160k3745K6455L112J0488o5943N6023N6541n102
20629A64080K3136J5215N5443K0551m2666k1747o9350O60L7864K1494Q950n5434
20617A58196N996m65N8932P023k1061O9704n621l4578l0810l1533K0237l5885
20605A60135L8765K4398k3883M658J7450r364n594j9487J9551P6358R427p2791
20593B19623n0976P2650N6575j329j7920l2051j4477l6322l5070O329n138j5806
20581A46088J590j6991q0193j24O2853J07992M1514n1077n2615k3242k2990k692
20569A10113k3142k248M7644M0530j8118k1277m9781j2575N2986K4194K8116K8962
20557B05404K0460N26N428k3883K770j7682J0863Q290L2591n6029q3744j2291
$$ y = [66968, 9154, 94320, 134411, 106251, 82506, 108961, 112073, 122561, 56618, 112641, 169182, 164080, 187216, 202431, 257874, 278425, 235759, 214012, 144662, 145322, 183186, 204680, 213630, 158196, 164192, 163727, 222659, 229682, 208621, 278325, 272704, 238126, 207316, 175783, 196020, 160135, 198900, 223298, 199415, 204073, 221523, 212159, 206565, 187078, 206629, 282987, 292414, 219623, 168647, 241297, 297872, 296543, 278623, 246572, 232095, 195773, 160703, 167032, 161894, 146088, 147678, 130687, 50494, 50370, 113223, 221215, 262729, 211652, 159037, 135795, 112805, 110113, 86971, 84723, 132367, 172897, 154779, 133502, 83721, 71146, 124132, 148326, 176442, 205404, 225864, 226390, 231818, 207935, 210705, 193023, 203886, 212176, 244767, 188738, 104994, 92703]
20545I2703N2162J2118J0235k1653M9939L5550M956l7308l1479J670l1227J2710
20533A50376N0217J9560r816p700j2545r4840J755J01602L8087p453m7374N8260
20521B40129m2744n2341J6317L8815n4680N0538j3410m7874L7020P9803K9291
20510B80864p1648l0905K655K3098K431J1117J9555L3722Q1507J227q5007n6608
20498B12008l0843L7020n697j9798n5439q7341j6853p4190K6581J06448J8529
20487A10425Q140l5364L3820J07988N7800r427q0225m8383K2025l2527M0314M7711
20475B22297M17j0410j5637q696M4696O51N0915J4822n7278m8404m0568k0826
20463A31979M9877k4993k731m2849K4778O8522j289o8900l6268L4604N9496m3868
$$ y = [92703, 144865, 156983, 167218, 145565, 195504, 231054, 236010, 198702, 167223, 168893, 137666, 150376, 200593, 220153, 210337, 202637, 190092, 95252, 97007, 198609, 236696, 229243, 181869, 240129, 197385, 145044, 161361, 200176, 145496, 196034, 182624, 134750, 171770, 251573, 280864, 209216, 178311, 180966, 204064, 206495, 217612, 237167, 270889, 352396, 353623, 268616, 212008, 181165, 218185, 212488, 192690, 137251, 49910, 33057, -41133, -14552, 91896, 110425, 118565, 83201, 117021, 225009, 282809, 273382, 193157, 144774, 166799, 134272, 174586, 222297, 222714, 212304, 196667, 187971, 232667, 233318, 284233, 299055, 241777, 193373, 152805, 131979, 181856, 156863, 154132, 111283, 136061, 204583, 203294, 134394, 98126, 132730, 192226, 148358]
20451A48358l402j5747J2284P3130P7470k8936k0917j4022o2728k2233J0991M9645
20439B03893o7731L901l137K2012J0283k5757L8230l994m997J2147R8859N0632
20427C34341p0177q6132k0610L1798J8863O49r536O9754l8910q2842m8845R3451
20415A91804J08564Q5099j1448n4213p2509J308j0172K7964m2030l1664M3152
20404B35855O3904L6020J0944m707n339l4650m8132k1278L1682k3495k3181J2009
20392B29632j9278O77J4170m9904j7884j1009J9541N2690P127L0745m481J4912
20380B66938O6048R032K487o3869K3895J6202R992k9155L6917j3877m0588O06
20368B84628L3928o8881n4718J5130L4953K3157j6818j3162L174n2720P1973L500
$$ y = [148358, 144956, 129209, 141493, 214623, 292093, 263157, 242240, 228218, 165490, 143257, 154248, 203893, 136162, 140063, 136926, 158938, 169221, 143464, 181694, 177700, 172703, 184850, 283709, 334341, 264164, 178032, 157422, 189220, 208083, 208732, 199196, 268950, 230040, 147198, 98353, 191804, 300368, 385467, 374019, 319806, 247297, 248605, 238433, 266397, 224367, 192703, 235855, 299759, 335779, 346723, 342016, 336677, 302027, 253895, 232617, 264299, 240804, 217623, 229632, 210354, 211031, 225201, 175297, 157413, 146404, 165945, 218635, 225762, 256507, 252026, 266938, 332986, 342018, 344505, 280636, 304531, 320733, 330725, 301570, 338487, 324610, 284022, 284628, 318556, 249675, 194957, 210087, 245040, 268197, 251379, 238217, 241391, 188671, 260644, 264144]
20356B64144L1243P563Q9795K3650k6917l3166j4599l2940K6442J1657r25j7l8699
20343C07231l4724l2463j1651l497Q2963J00378l0950j3090m0190m3522O1861
20332C42346l613k5663J7390m3940q9665J1065j2043N6085J01163k025m4729q473
20320B97898n0991n1031L3120J0941J7464m5669n4794N9236R881J1791L2048N9885
20308C29779L8106k7967m6300o0826k4750M2358L0057j2258l5134p753K0987K7131
20296B73430Q9441o5770j0997M4972O4585O6796l3234n1798k6940n902J3009j0042
20284C47550J396q281j030J126N2575l374l6569l9M422k741m296R2233Q3259j8001
20270E08230k0551q4943o0716q368L8240o5641K9095M6743L6819p4323k6663k9930
$$ y = [264144, 295387, 302950, 392745, 416395, 389478, 356312, 341713, 308773, 335215, 346872, 345947, 345930, 307231, 272507, 240044, 228393, 224896, 307859, 408237, 377287, 364197, 324007, 280485, 342346, 338733, 313070, 330460, 286520, 196855, 207920, 195877, 251962, 353125, 351100, 306371, 297898, 246907, 195876, 228996, 239937, 257401, 211732, 156938, 216174, 226055, 237846, 269894, 329779, 367885, 339918, 293618, 232792, 208042, 250400, 280457, 268199, 233065, 225312, 246299, 273430, 362871, 297101, 286104, 331076, 395661, 462457, 429223, 377425, 350485, 344583, 357592, 347550, 348946, 340665, 339635, 340761, 393336, 389962, 353393, 353354, 357776, 355035, 350739, 442972, 526231, 508230, 487679, 402736, 342020, 333652, 371892, 306251, 335346, 382089, 418908, 344585, 317922, 287992]
20258B87992N8682N7774m6416o8226N6037O576R007n864l7021k7370M8277P9805
20246D19253k5353p000L2183m5331k5712O2531j7118p8503k4667k1644K551O3360
20234C34550L0530L2179j3507l1800r2155j4121k5165O2522P4363P8586L6300
20223D72282k5103p7479m4251M03K0156J488q610N4561J2582j1420p118o6299
20211C21192J817L3093k0674m4703M4329o464M6778k970J1352k2452Q827m7034
20199C23091j6372L9780R359m6317K1937N8198k0253O0367o020q1032n9522K1993
20187C05209L8392O814j186N9573p696K0863N170L5207J325j5652O6626N5580
20175E70225j5143j06854o2962J29663P2444m7757m3779j3856L6296J4278J8372
$$ y = [287992, 346674, 404448, 358032, 289806, 345843, 352419, 361426, 355562, 318541, 291171, 339448, 419253, 393900, 386900, 419083, 373752, 348040, 410571, 393453, 314950, 290283, 268639, 271190, 334550, 365080, 397259, 383752, 351952, 259797, 245676, 220511, 283033, 357396, 435982, 472282, 447179, 369700, 325449, 325852, 346008, 347496, 338886, 393447, 406029, 394609, 387491, 321192, 323009, 356102, 335428, 290725, 335054, 328590, 375368, 372398, 383750, 361298, 370125, 323091, 306719, 346499, 355858, 309541, 331478, 389676, 369423, 429790, 423770, 342738, 283216, 305209, 343601, 350415, 349229, 408802, 401106, 421969, 427139, 462346, 463671, 448019, 514645, 570225, 555082, 448228, 385266, 514929, 587373, 539616, 495837, 481981, 518277, 532555, 550927]
20164E50927J8927l5664L357k3528k9353k5987j3145J2652M6922k4364K3065P6042
20152E79851J4201n5013j5510O2202k5209o6831o473P5839N393J9005J6227j2553
20140E91129k4031J6026K8684j2722j7125M514p0378o3193J2125M6037o781o505
20128D97780J8008O3864Q540j04551n17M7711l1214L1524K3383q4285r059l989
20116D57195P8684J6761j495p2859n131K0991M9114J1449J5680j1949k5475k5023
20104E07942M4478L6809j6284q1740M1779K0748K5500n0957Q783N6576j6396O8668
20092F45906J7830L8923N3806k0883p9969k9376p3629N052K5657k1205M056M9586
20080F15754M8790K690o3273m2816q148N4311K9811r3379K3265P925Q302O3031
$$ y = [550927, 569854, 534190, 537547, 514019, 484666, 458679, 445534, 458186, 505108, 480744, 503809, 579851, 594052, 539039, 523529, 585731, 560522, 493691, 487218, 563057, 568450, 587455, 603682, 591129, 567098, 583124, 611808, 599086, 581961, 586475, 516097, 452904, 465029, 511066, 504285, 497780, 515788, 579652, 588192, 483641, 483124, 530835, 499621, 531145, 554528, 470243, 461184, 457195, 535879, 552640, 551145, 478286, 473155, 494146, 543260, 554709, 570389, 558440, 532965, 507942, 552420, 589229, 572945, 491205, 532984, 553732, 579232, 528275, 537058, 593634, 577238, 645906, 663736, 702659, 756465, 735582, 655613, 626237, 552608, 557660, 583317, 562112, 566168, 615754, 664544, 667234, 603961, 561145, 552997, 607308, 637119, 543740, 567005, 574930, 583232, 646263]
20068F46263N4994n2592j3202L6455J5205K5574M8894k2936m379o3042m5141l2622
20056E93471o0734J9421R1465j8712Q2441Q2213J1717l4051L4150n4317j0250
20045G36814k6590L8256N6873P0023k6216k4404J2972n9105j06359n1338K2588
20034F43514K4973N6624P0394k2810l174L7638J9175M5352J2599K1938m2598j14230
20022G49395P813P3873M2075k1865J0543J6908q738p7981n8899k7370j1484L1230
20010G25500m2524P4754O5298J8954Q8549M1375n4812J8748p866p2312n8287L0482
19998H27859J1102K1872l304p7154K8401N3440R403K4975m5246p891J5280j8478
19986H40259l712J9414L8367m6806l4841L0298M2548M8969K6014l155K5789j2813
$$ y = [646263, 701257, 648665, 635463, 671918, 687123, 712697, 761591, 738655, 734276, 671234, 626093, 593471, 532737, 552158, 643623, 624911, 707352, 789565, 801282, 767231, 801381, 747064, 736814, 710224, 748480, 805353, 875376, 849160, 824756, 837728, 778623, 672264, 620926, 643514, 668487, 725111, 795505, 772695, 769521, 807159, 826334, 871686, 884285, 906223, 863625, 749395, 757208, 831081, 873156, 851291, 861834, 878742, 870004, 792023, 733124, 705754, 694270, 725500, 682976, 757730, 823028, 841982, 930531, 971906, 917094, 935842, 927976, 855664, 797377, 827859, 838961, 860833, 857529, 780375, 808776, 862216, 871619, 896594, 851348, 843457, 858737, 840259, 836547, 855961, 894328, 847522, 812681, 842979, 885527, 934496, 960510, 957355, 983144, 970331]
19974I70331n9981L271j4221K2070P0962K4160N9868n7570q2114L5897N3836r714
19962A016795l7595o508j931L7332j6994l8430N5559Q8539P7659j2520m5304o7105
19950A049497l7973m9572m9010O1358j5387m410P4027P1998l4599r2304K9173
19939A002798N4808M318j7533n381K9824n8910L6626O6863P9213K2834l9262J7716
19927A193914o292k4249n6086m5990K5256Q5407N3250J5504J1117N570P389J2100
19915A276890n8612J2883K8304r582k9291j5185N16L8803k0349J8257K2263Q036
19903A272933K2748N0666L7197K0421m7001L7205L4703k4577j01720j9205j0679
19892A272691N8410j6213K3777N3703R606n5955J0867J01917L5513j7760J4336
$$ y = [970331, 910350, 913621, 899400, 921470, 992432, 1016592, 1076460, 1018890, 936776, 972673, 1026509, 1016795, 979200, 972692, 970761, 1008093, 991099, 952669, 1008228, 1096767, 1174426, 1161906, 1116602, 1049497, 1011524, 961952, 912942, 974300, 958913, 954503, 1028530, 1100528, 1065929, 973625, 1002798, 1057606, 1061924, 1044391, 1039010, 1068834, 1009924, 1046550, 1113413, 1192626, 1215460, 1176198, 1193914, 1187622, 1163373, 1107287, 1061297, 1086553, 1171960, 1225210, 1240714, 1251831, 1257401, 1264790, 1276890, 1218278, 1231161, 1259465, 1249883, 1220592, 1205407, 1205923, 1244726, 1224377, 1242634, 1264897, 1272933, 1295681, 1346347, 1383544, 1403965, 1356964, 1394169, 1428872, 1404295, 1302575, 1283370, 1272691, 1331101, 1314888, 1338665, 1392368, 1401974, 1346019, 1356886, 1458803, 1494316, 1476556, 1490892]
19881A490892j788n8612n7613r4569O3287O2455M368O0699J26798L3860l8974
19870A590803k5384o352K4283P9039N4305K0046J0038K0120k517N987k2259k1617
19858A726492K9173L3322K7903J1444M9966J1194J9739j5390J381l3453O8499
19847A930270O6588j8267j3895L7156j4887K3942N3563O6360r431n8391n8643
19836B004365k4099J5349M2590p113L1861L5202l7234l0056J8703N1423k6112
19825B074879j6252J33849N2110K4430k357n5368m9305R239l1487N8557L4238
19814B232533L246L9579k3863j1436j4734J9269N5508M660K5178m2051P855L5223
19802B330967L0596j6993N1148O1948k295l2100l6483M4605O1692N381o3535k0333
$$ y = [1490892, 1489104, 1430492, 1372879, 1278310, 1341597, 1404052, 1408420, 1469119, 1595917, 1629777, 1590803, 1565419, 1559067, 1583350, 1662389, 1716694, 1736740, 1746778, 1766898, 1764381, 1770368, 1748109, 1726492, 1755665, 1788987, 1816890, 1828334, 1878300, 1889494, 1909233, 1893843, 1895224, 1861771, 1930270, 1996858, 1978591, 1964696, 2001852, 1986965, 2010907, 2064470, 2130830, 2121399, 2063008, 2004365, 1980266, 1995615, 2038205, 2031092, 2062953, 2098155, 2060921, 2030865, 2049568, 2100991, 2074879, 2058627, 2192476, 2244586, 2269016, 2266659, 2211291, 2161986, 2171225, 2139738, 2198295, 2232533, 2235779, 2275358, 2251495, 2240059, 2225325, 2244594, 2300102, 2304762, 2329940, 2287889, 2295744, 2330967, 2361563, 2344570, 2395718, 2457666, 2455371, 2423271, 2386788, 2431393, 2493085, 2498466, 2434931, 2414598]
19790B414598N3196L1709N6768J2614p3463k3727R0674Q2701m570r028M4736k508
19778B673700J9109j3139N949K5279l4094M8320L9184L2629M1789p418O8411M5053
19766B944772r527J5421O3912K7834N5771P1849K1011n0079q712k3036r415J4136
19754C113937K5771Q2960N8530o440K9361M7283N5862l7241m1569M3249Q7481
19743C459184n8435O8835K4488k2211R364P6104M6548P7485N2648N1921K7349
19732C813280p694L7716J06286l7891l1306O2207L7283M9331J8765k1390M1562
19721D068149N7343O8771j4387j2041j1220J00961Q0685M8325J7887j3589P1835
19710D462719Q4782k3173M2806N0457M1612R9054M3041K819L9798J5736K4766
$$ y = [2414598, 2467794, 2499503, 2556271, 2568885, 2495422, 2471695, 2562369, 2645070, 2640500, 2631472, 2676208, 2673700, 2692809, 2679670, 2685619, 2710898, 2676804, 2725124, 2764308, 2796937, 2838726, 2831308, 2899719, 2944772, 2935245, 2950666, 3014578, 3042412, 3098183, 3170032, 3191043, 3140964, 3132252, 3109216, 3099801, 3113937, 3139708, 3222668, 3281198, 3274758, 3304119, 3351402, 3407264, 3370023, 3328454, 3371703, 3459184, 3400749, 3469584, 3494072, 3471861, 3481225, 3557329, 3603877, 3681362, 3734010, 3785931, 3813280, 3805586, 3843302, 3949588, 3911697, 3880391, 3942598, 3979881, 4029212, 4047977, 4026587, 4068149, 4125492, 4194263, 4179876, 4167835, 4156615, 4257576, 4338261, 4386586, 4404473, 4390884, 4462719, 4547501, 4524328, 4567134, 4617591, 4659203, 4758257, 4801298, 4804117, 4843915, 4859651, 4884417]
19699D884417M7563m270Q2640O9548O5334M2590k539P5212R4775O2362N043L3079
19687E455754K5864N0344Q5373M2952Q6185M8557P9197N0782O8676N042l9243
19676E959483O1033J22569K8520K6805R8092O9243O5459J24962N4221J8033N4652
19665F683072J12174M2641P5682Q6478N9409N1122M8399O3580J01466O7251R3957
19654G485231R5811R5287J15526O4121K7033J27676P2874P0960J5766J48342O9437
19643H388064M889L4247R9773Q2351J14133O2010J14069Q3114J21755J08097J5891
19632I228393J20307O1622J69116J13081J411Q9100J86398K15524J12696J32689
19622A0430337Q8513Q2300P0280Q4074J46309J45586J20024O9958J30021Q8294
$$ y = [4884417, 4931980, 4927710, 5010350, 5079898, 5145232, 5187822, 5185283, 5260495, 5355270, 5417632, 5422675, 5455754, 5481618, 5531962, 5617335, 5660287, 5746472, 5795029, 5874226, 5925008, 5993684, 5998726, 5959483, 6020516, 6143085, 6171605, 6198410, 6296502, 6365745, 6431204, 6556166, 6610387, 6628420, 6683072, 6795246, 6837887, 6913569, 7000047, 7059456, 7110578, 7158977, 7222557, 7324023, 7391274, 7485231, 7581042, 7676329, 7791855, 7855976, 7883009, 8010685, 8083559, 8154519, 8170285, 8318627, 8388064, 8392953, 8427200, 8526973, 8609324, 8723457, 8785467, 8899536, 8982650, 9104405, 9212502, 9228393, 9348700, 9410322, 9579438, 9692519, 9693930, 9783030, 9969428, 10184952, 10297648, 10430337, 10518850, 10601150, 10671430, 10755504, 10901813, 11047399, 11167423, 11237381, 11367402, 11455696]
19612A1455696K4577J16047J73010R2334J05648J12415M4766J16680Q7000R9982
19602A2428155J93925J28501J54720J39688J53263J69938J20174J23118R9805
19593A3711287P3596M3000R3526J97121J59739J63123R1807J42295J61338J45260
19583A4982092J47017J14705J33691Q4029p040J20854J82547J42295J65091J60242
19573A6225523J17407J25128J63654J04240J37905O4333J10200J11975J01014
19564A7261379O7175J15831J51125P5274O3511J07248J41005R4678J42096J50003
19554A8369325J02187n061K1549J33840R4334M2672Q0407L9495J4639O7975J18345
19543A9079707Q5915P7282O4403j9934L2177L9020Q0259O6779m4835r290N8375
$$ y = [11455696, 11480273, 11596320, 11769330, 11861664, 11967312, 12079727, 12124493, 12241173, 12328173, 12428155, 12622080, 12750581, 12905301, 13044989, 13198252, 13368190, 13488364, 13611482, 13711287, 13784883, 13827883, 13921409, 14118530, 14278269, 14441392, 14533199, 14675494, 14836832, 14982092, 15129109, 15243814, 15377505, 15461534, 15454494, 15575348, 15757895, 15900190, 16065281, 16225523, 16342930, 16468058, 16631712, 16735952, 16873857, 16938190, 17048390, 17160365, 17261379, 17328554, 17444385, 17595510, 17670784, 17734295, 17841543, 17982548, 18077226, 18219322, 18369325, 18471512, 18466451, 18488000, 18621840, 18716174, 18758846, 18839253, 18878748, 18893387, 18961362, 19079707, 19165622, 19242904, 19307307, 19287373, 19319550, 19358570, 19438829, 19505608, 19460773, 19451483, 19509858]
19532A9509858N0227p891N1849n449L7929K3684l8850j4042R301q6195j14537
19521A9415884k0213P3109L2718o9160o2769r8353p9774j06757l7875k4166J2634
19510A9035278l9355q2653r8942j18347q3081j28282j71708m3116k484p6471j05239
19499A8085600j75735n7162n9517l7581o7616j25463o1834r5084j03494r1527
19489A7210587j40457j06241j59471j54175o1172r7374j05451q7238j12227p8066
19479A6108715r9621j39238q7466j19536j15011j73498j41559o8592o2602q3235
19469A5018357j48827j00795q0070j33769l8682j9155o5157q4477j33232p8687
19459A4135506q7098j01582k7996m0860j40298r5046j39815j45685n8421j36361
$$ y = [19509858, 19560085, 19552194, 19604043, 19598594, 19636523, 19660207, 19621357, 19607315, 19616616, 19530421, 19415884, 19395671, 19468780, 19501498, 19432338, 19369569, 19271216, 19191442, 19084685, 19046810, 19022644, 19035278, 18995923, 18913270, 18814328, 18695981, 18612900, 18484618, 18312910, 18269794, 18267310, 18190839, 18085600, 17909865, 17852703, 17793186, 17755605, 17687989, 17562526, 17500692, 17405608, 17302114, 17210587, 17070130, 16963889, 16804418, 16650243, 16589071, 16491697, 16386246, 16299008, 16186781, 16108715, 16009094, 15869856, 15782390, 15662854, 15547843, 15374345, 15232786, 15164194, 15101592, 15018357, 14869530, 14768735, 14688665, 14554896, 14516214, 14497059, 14431902, 14347425, 14214193, 14135506, 14048408, 13946826, 13918830, 13877970, 13737672, 13642626, 13502811, 13357126, 13298705, 13162344]
19449A3162344r3858j70318j77399j34366j66544j94480j78809j05104j30627
19440A1810839k07220j84231j20507k17907j55795j92624j38882k9578m6025q2188
19430A0435882j72200j36114m0018n3894q5263j89452j57104r8541n8540j32680
19420I312076j54366l9366o1162j36234p2493m5145q5603j01384q3532j42531
19410H390260j44048k9647n7099j66014j52847n1663n0375j6634m8869l8027l2768
19399G602269q7217o6637j20612j14845p6513j14038o3650j17943n9606l0704
19389F750504p8306l6964l0305m6720j15916j28586j18114o7621j3896n1111J8615
19378F081580o474q0599r0082j16312k9061l0515m3653k2303P884o6014q1320
$$ y = [13162344, 13068486, 12898168, 12720769, 12586403, 12419859, 12225379, 12046570, 11941466, 11810839, 11603619, 11419388, 11298881, 11080974, 10925179, 10732555, 10593673, 10564095, 10518070, 10435882, 10263682, 10127568, 10087550, 10033656, 9948393, 9758941, 9601837, 9503296, 9444756, 9312076, 9157710, 9118344, 9057182, 8920948, 8848455, 8803310, 8717707, 8616323, 8532791, 8390260, 8246212, 8216565, 8159466, 7993452, 7840605, 7788942, 7738567, 7721933, 7673064, 7635037, 7602269, 7515052, 7448415, 7327803, 7212958, 7136445, 7022407, 6958757, 6840814, 6781208, 6750504, 6672198, 6635234, 6604929, 6558209, 6442293, 6313707, 6195593, 6127972, 6114076, 6062965, 6081580, 6075106, 5994507, 5904425, 5788113, 5759052, 5728537, 5684884, 5662581, 5670465, 5604451, 5523131]
19367E523131m0232q6898p4503l6050J6159k7590j7501l1072o3777j42049k7247
19356D992371k4275k0775k3376j4970k3558m5520j59002k6683Q323n8513k2162
19345D581860O9675n9846p6177o7538j28966m3340M4192L5848p0065r7105m9679
19334D138859p4855l4155m0675l0716l7740m0565o4851j53Q5442K6930j06836
19323C820685n0834j15610q1803q109K4496j546n5989k5129r4627N6445M1442
19312C509421J9622O324n4048p8514l1210o9456q0220M013K4069k6276k8979l2051
19300C162695j1390q048k4170q5344k4647L2129j108k1740n5540m8498m3467l640
19288B867232j5949L2191j962m6185J6617j1918r690P157l1386k7978q9233n2168
$$ y = [5523131, 5482899, 5396001, 5321498, 5285448, 5301607, 5274017, 5256516, 5225444, 5161667, 5019618, 4992371, 4968096, 4947321, 4923945, 4908975, 4885417, 4839897, 4680895, 4654212, 4662535, 4604022, 4581860, 4651535, 4591689, 4515512, 4447974, 4319008, 4275668, 4319860, 4355708, 4285643, 4188538, 4138859, 4064004, 4029849, 3989174, 3958458, 3920718, 3880153, 3815302, 3815149, 3900591, 3927521, 3820685, 3769851, 3654241, 3572438, 3564329, 3588825, 3587279, 3531290, 3506161, 3411534, 3467979, 3509421, 3529043, 3535367, 3481319, 3402805, 3371595, 3302139, 3221919, 3225932, 3250001, 3223725, 3194746, 3162695, 3151305, 3143257, 3119087, 3033743, 3009096, 3041225, 3040117, 3018377, 2962837, 2914339, 2870872, 2867232, 2851283, 2883474, 2881512, 2835327, 2851944, 2840026, 2830336, 2837493, 2806107, 2778129, 2688896, 2636728]
19276B636728J8248M4050m225n5777m6758o049N4957o4415n0021M4414k815J2630
19264B580967N3059k0714j20873j07143j7172K9520K5589J5917Q5565k8898l8818
19253B456999o5433o8783P026l0028k7964m91N0542K1108J4764J4414J2995O982
19241B392131j9241j2991M692j1242o5967p3156K7573K9674k1231p1536J3645
19230B192351N4498o9735p1910j876P5336P2387K1503J7852p5003R413K3021K5888
19218B273725j3684q0274j00155l7629p0468j6403O0253Q3387j6883m3639l4707
19207B003523l4678j3463j744l4265k2484n081n4256L3256K4292k7256J9235j152
19195A885927j4126O4986L7069j02629o1386j3220k362j7367m9315K0811L0386
$$ y = [2636728, 2654976, 2699026, 2694801, 2639024, 2592266, 2586217, 2641174, 2576759, 2526738, 2571152, 2568337, 2580967, 2634026, 2613312, 2492439, 2385296, 2368124, 2397644, 2423233, 2439150, 2524715, 2495817, 2456999, 2391566, 2322783, 2329809, 2299781, 2271817, 2271326, 2321868, 2342976, 2357740, 2372154, 2385149, 2392131, 2372890, 2359899, 2364591, 2353349, 2287382, 2214226, 2241799, 2271473, 2250242, 2178706, 2192351, 2246849, 2177114, 2105204, 2103328, 2178664, 2251051, 2272554, 2290406, 2215403, 2224816, 2247837, 2273725, 2260041, 2179767, 2079612, 2041983, 1971515, 1955112, 2015365, 2098752, 2081869, 2038230, 2003523, 1968845, 1955382, 1953638, 1919373, 1896889, 1891808, 1837552, 1870808, 1895100, 1867844, 1887079, 1885927, 1871801, 1936787, 1973856, 1871227, 1809841, 1796621, 1794259, 1776892, 1727577, 1748388, 1778774]
19184A778774k5384J2680m295m6107l8594R251l4718n0526J3942L7157L6558M8235
19172A736973k7330l9431m42M4740K6744n2085j05464j539r184K0837K7122L745
19160A624686l3316k5826J6718L5799k1644n0287L35O3798K8816O3785j07207
19149A595657j24349l7993l1938k3059l0428j5463K1894m0823N1896Q476r82J2499
19137A385387K584O075l2859M9924n6920j389J4666L7203j4100k4744M1208K5099
19125A432134k1903m3961N107L7497L771l0669Q702n2622R783K3078l9947o246
19113A324724N001M8657P358K030l649M288M5444J075k0254P9744K2699L3696
19101A550813k0437J1491n5261p5223k7632M4438M8098l0304j5133m1962R649
$$ y = [1778774, 1753390, 1766070, 1761775, 1715668, 1677074, 1686325, 1651607, 1601081, 1615023, 1652180, 1688738, 1736973, 1709643, 1670212, 1669770, 1714510, 1741254, 1689169, 1583705, 1582166, 1572982, 1593819, 1620941, 1624686, 1591370, 1565544, 1582262, 1618061, 1596417, 1546130, 1546465, 1610263, 1639079, 1702864, 1595657, 1471308, 1433315, 1401377, 1378318, 1347890, 1332427, 1354321, 1313498, 1365394, 1373870, 1372888, 1385387, 1387971, 1394046, 1361187, 1411111, 1354191, 1352802, 1367468, 1404671, 1390571, 1365827, 1407035, 1432134, 1410231, 1366270, 1371377, 1408874, 1412645, 1381976, 1390678, 1338056, 1347839, 1370917, 1330970, 1324724, 1329725, 1378382, 1385740, 1387770, 1384121, 1388409, 1433853, 1434928, 1414674, 1494418, 1517117, 1550813, 1530376, 1541867, 1486606, 1411383, 1383751, 1428189, 1476287, 1445983, 1430850, 1388888, 1398537]
19090A398537N7417K0176M7934n2354p2869j7147M627k0969M1628M3587O647k5919
19078A431295L0242K3534L8260r265j7364j2233L5329j9752j5014j6319j9071
19067A449642M5111Q0349J05017K2324m8002o9119r674L5974K4298J0520k6937
19056A619503j7111k5654Q6625N3223r655P3006l2966K1813M4450p718k0265K154
19044A787405n232n9431l5992J9203L1488L4812L6611R8233l2317M453o581l2143
19032A840509P5254k3256j6716N8138J13571O7290m4729o550J7736J9104L1210
19021B131561K4448M5099m0248L2440K4405N3594O546J4067K0250K3354J2817
19010B348333M1272O8310J9462K2847L3756L0623J27691Q7000j3905J2258M3045
$$ y = [1398537, 1455954, 1476130, 1524064, 1471710, 1398841, 1381694, 1386321, 1365352, 1406980, 1450567, 1457214, 1431295, 1461537, 1485071, 1523331, 1514066, 1496702, 1484469, 1519798, 1500046, 1485032, 1468713, 1449642, 1494753, 1575102, 1680119, 1702443, 1654441, 1585322, 1575648, 1611622, 1635920, 1646440, 1619503, 1602392, 1576738, 1663363, 1716586, 1706931, 1779937, 1746971, 1768784, 1813234, 1805516, 1785251, 1787405, 1782173, 1722742, 1686750, 1705953, 1737441, 1772253, 1808864, 1907097, 1874780, 1879233, 1872652, 1840509, 1915763, 1892507, 1875791, 1933929, 2047500, 2114790, 2070061, 2063511, 2081247, 2100351, 2131561, 2156009, 2201108, 2160860, 2193300, 2217705, 2271299, 2277845, 2291912, 2312162, 2335516, 2348333, 2389605, 2457915, 2477377, 2500224, 2533980, 2564603, 2692294, 2779294, 2765389, 2777647, 2820692]
18999B820692N3716M2467P795N4245O5452P6619J02428N6269P042P7582R3535
18988C457842R2211O4520L8630M5995J03711J00044J10690J30018J05962N8499
18978D308122K31837L34411L05049K15407K52291K96184L45599L56722L16284
18969F961906M51751M40895N16268O24834N17367O40958P48079Q17947Q99536
18960A2619541R47536J061311J237149J343984J505429J780539K224995K501352
18952B5221836L053826L734418M602309N726922P013007Q254564R225409R762134
18944G6594425J0063218J0570691J0781092J0431351R460969Q587874Q110003
18937A44599623P518187O080474M058749K187727J391984Q87823k37337k240962
$$ y = [2820692, 2874408, 2916875, 2924670, 2978915, 3044367, 3120986, 3223414, 3279683, 3286725, 3364307, 3457842, 3550053, 3614573, 3653203, 3699198, 3802909, 3902953, 4013643, 4143661, 4249623, 4308122, 4539959, 4874370, 5179419, 5394826, 5647117, 5943301, 6288900, 6645622, 6961906, 7413657, 7854552, 8370820, 8995654, 9513021, 10153979, 10902058, 11720005, 12619541, 13567077, 14628388, 15865537, 17209521, 18714950, 20495489, 22720484, 25221836, 28275662, 32010080, 36612389, 42339311, 49352318, 57606882, 66832291, 76594425, 86657643, 97228334, 108009426, 118440777, 127901746, 136489620, 144599623, 152117810, 158198284, 162257033, 164444760, 165836744, 166724567, 166487230, 164246268]
18929A64246268m218275n457756o246442p394689q832492j0041902j0378354r952475
18921A01723883r559713r416855r114998q370173p137449n949188m966524l947168
18913D3261815l334566k884911k431481k094113j849004j669210j569903j386237
18905B6042390j206313j100450r84611r82241r31233q13966p65624p21511o51335
18896A7885106o93088o50218n91015m31094n14436n50040m73521n26705n38061
18887A2916928n60874m75159m52723l34024l74802m72016l54597l66636k89328
18878I236769k66293k92666l63011k12644k42260k52725k63631k55251k15873
18869F872415k22099k14712j85120j98429j45689j37378k01920j84885j66486
$$ y = [164246268, 160027993, 154570237, 148323795, 140929106, 132096614, 122054712, 111676358, 101723883, 92164170, 82747315, 73632317, 65262144, 58124695, 52175507, 47208983, 43261815, 39927249, 37042338, 34610857, 32516744, 30667740, 28998530, 27428627, 26042390, 24836077, 23735627, 22751016, 21768775, 20837542, 20023576, 19257952, 18536441, 17885106, 17192018, 16541800, 15950785, 15519691, 15005255, 14455215, 13981694, 13454989, 12916928, 12356054, 11880895, 11428172, 11094148, 10719346, 10247330, 9892733, 9526097, 9236769, 8970476, 8677810, 8314799, 8102155, 7859895, 7607170, 7343539, 7088288, 6872415, 6650316, 6435604, 6250484, 6052055, 5906366, 5768988, 5567068, 5382183, 5215697]
18860E215697j75156j06778j11417j37655j07038q2947j11066p8622j41801j73122
18850C990095q2093m2983j42397j31014j56158l5854q3960p5915n0243J0337o6195
18839C133620j59071j07657j05760j57072n9436r5511r4844q1289q9874p3002
18829B110104k8235j6486N244r4901j14466p5525q4044k6003q4953m6240M401
18818A548896l6146o8648q8790l2575J7934n5184n8667n5746n010p868J2506l4331
18806A136371m479K8721j0538j0912L3098l4704q2458l138n1767m6449R183K1894
18794I84822M9243m2749r3416k4576L9451l5178r864k6188R4270P8347o7762k7429
18782I18971k4879r7176K4000Q5184k0347l9271K3850k870K5101M9245M8998m4645
$$ y = [5215697, 5040541, 4933763, 4822346, 4684691, 4577653, 4494706, 4383640, 4305018, 4163217, 3990095, 3908002, 3865019, 3722622, 3591608, 3435450, 3399596, 3315636, 3239721, 3189478, 3199815, 3133620, 2974549, 2866892, 2761132, 2604060, 2544624, 2449113, 2354269, 2272980, 2183106, 2110104, 2081869, 2065383, 2070627, 1975726, 1861260, 1785735, 1701691, 1675688, 1590735, 1544495, 1548896, 1512750, 1444102, 1355312, 1322737, 1340671, 1285487, 1226820, 1171074, 1166064, 1158196, 1170702, 1136371, 1131892, 1160613, 1150075, 1139163, 1172261, 1137557, 1055099, 1051961, 1000194, 953745, 962928, 984822, 1034065, 991316, 897900, 873324, 912775, 877597, 867733, 841545, 935815, 1014162, 946400, 918971, 894092, 796916, 820916, 906100, 885753, 846482, 870332, 867462, 892563, 941808, 990806, 946161]
18770I46161j4971n91m002j9928q825Q100L0099J1852k425N3937L317j887m1105
18757I59732j33272n1734j633L632l6634N5794N5959m0147o1809J7501K4375J5546
18745H07310l7408J2322k4484j0656J2079K8513k7365O553J0670L9776l0252k6081
18733G60977j5131k2732J4730l1700j7011J5448J3428m6919j010J22251M6189
18722H38520m2905m392m109L519l890N0074M0997j1336n498M076k4658j9178J1904
18709H33124R10m93Q548O3754K4629M1801K1048l7139N2464O844m3521k9920k2090
18696I19959o1572J2686P2962P0557J07693j0610l4742Q379r637j57075q6400
18685H32200K777o4830m1024m1698m2832j8698K5798l4433k2152L9340L0601K534
$$ y = [946161, 931190, 930599, 926597, 906669, 897844, 905944, 936043, 947895, 945470, 999407, 1002724, 1000837, 959732, 826460, 774726, 773093, 776725, 740091, 795885, 851844, 811697, 749888, 767389, 791764, 807310, 769902, 782224, 757740, 747084, 759163, 787676, 760311, 766864, 777534, 817310, 787058, 760977, 745846, 723114, 737844, 706144, 689133, 704581, 718009, 671090, 670080, 792331, 838520, 795615, 791223, 787114, 790633, 786743, 836817, 877814, 866478, 860980, 865056, 840398, 821220, 833124, 834034, 833541, 842089, 905843, 930472, 972273, 993321, 956182, 1008646, 1015490, 971969, 942049, 919959, 858387, 871073, 944035, 1014592, 1122285, 1111675, 1076933, 1085312, 1075675, 918600, 832200, 834977, 770147, 729123, 687425, 644593, 625895, 651693, 617260, 595108, 634448, 665049, 667583]
18673F67583L49j057J1831k5995m6979p9862K6847Q3013P1744j7178m7026Q745
18661F52015N7345K8503J3179J16669J29485N2944M7420N5885m9581L3994M7405
18650A185263M1054J05476P9886n803o7436m6319J2829k6603k5567m8218q0386
18639A124176l0100L4949l7187q3958N6508J04694q229m0277O131j2611j122n5833
18627A057141j52942M172Q9658P4243k495q3717O868N200k4344P885l3340m8553
18615H99776k2549K9932Q1104Q2048L8235N7512Q7265O6331N0620N5187L7492
18604A462953J8596L4327j5741K6154L7860O2235j3158o8526l9291k3172k3223
18593A459014o0704n3093l1013l4881K356J2848m5637o4456r0841r2302j30720
$$ y = [667583, 667932, 666875, 678706, 652711, 605732, 525870, 552717, 635730, 707474, 690296, 643270, 652015, 709360, 737863, 751042, 867711, 997196, 1050140, 1097560, 1153445, 1103864, 1137858, 1185263, 1226317, 1331793, 1411679, 1405876, 1338440, 1292121, 1304950, 1278347, 1252780, 1204562, 1124176, 1094076, 1129025, 1091838, 1007880, 1064388, 1169082, 1160853, 1120576, 1126707, 1114096, 1112974, 1057141, 904199, 908371, 998029, 1072272, 1069777, 986060, 992928, 998128, 973784, 981669, 948329, 899776, 877227, 907159, 988263, 1070311, 1108546, 1166058, 1253323, 1319654, 1370274, 1425461, 1462953, 1481549, 1515876, 1500135, 1526289, 1564149, 1626384, 1613226, 1544700, 1505409, 1482237, 1459014, 1398310, 1345217, 1314204, 1279323, 1281679, 1294527, 1248890, 1184434, 1093593, 1001291, 870571]
18582H70571m480n046R157l1304o3438m9131K4161l8375o3781J5618Q7122n5216
18570F95858j25006o1088p0002N4336K244J4244L8138l4762K9211Q7533J3077
18559F43783l4887o7862j5652O0044k3057J3244l3115P523K8836J1959n6667n6498
18547D77651M900O06P8401J6522J5046P6081l4551j0173N7462K6568m8209o5137
18535E95167p1l0047k1521o184j6581n9938j9615K4181k7384L7618J0482k141
18523D83966Q593L6765n9273K7062M9912L5203k4422L5454L1519j6859q6034o5718
18511D56168M4881O6745j9248n4005l0125O733J1686n7201O3030J3223J7194L793
18499E22874R201r5974p0257O4137M4761M9085K1344R149n9023k808J7682o073
$$ y = [870571, 866091, 861045, 870202, 838898, 775460, 726329, 750490, 712115, 648334, 663952, 751074, 695858, 570852, 509764, 439762, 494098, 496342, 510586, 548724, 513962, 543173, 630706, 643783, 608896, 541034, 525382, 585426, 562369, 575613, 542498, 550021, 578857, 590816, 534149, 477651, 482551, 483157, 561558, 578080, 593126, 669207, 634656, 624483, 681945, 708513, 660304, 595167, 595096, 565049, 543528, 537344, 520763, 460825, 441210, 465391, 438007, 475625, 486107, 483966, 492559, 529324, 470051, 497113, 547025, 582228, 557806, 593260, 624779, 607920, 521886, 456168, 501049, 567794, 548546, 494541, 464416, 471149, 482835, 425634, 488664, 501887, 519081, 522874, 532075, 436101, 365844, 429981, 474742, 523827, 545171, 554320, 495297, 492489, 510171, 504098]
18487E04098J7113J7785L33o4676M061L429P5105J3414j2252j1073L1942P141
18475E86420L5387k0589p1529j7573l0980k1632J0777L1386J9160M5519m4753
18464E21593r5348l3336K7474O6826P6404O1377j4024J5419M3021M781P521J3027
18452F94735o1042p1663K6668m2348N432J1919J8369m7745K4794Q4175j5695q5597
18440E42002o4888J00826Q4444k1551m6894K8686M4830M9100L7738l0637j3997
18429G09659j7778j8559J7638m9583J4369J01222N8161N9313Q1142J63O5826R3503
18417A115076Q4672R6923O4314Q2202J08287J827m1346P5261j530q505k3962o0760
18405A492459k4469N9221K1431J4942k4153m3639j12109m5954p3429p1978J9266
$$ y = [504098, 521211, 538996, 539329, 474653, 478714, 482143, 557248, 570662, 558410, 547337, 579279, 586420, 621807, 601218, 529689, 512116, 481136, 459504, 470281, 501667, 520827, 566346, 521593, 426245, 392909, 420383, 487209, 563613, 624990, 610966, 626385, 669406, 674187, 681708, 694735, 633693, 562030, 588698, 546350, 551782, 563701, 582070, 534325, 559119, 643294, 627599, 542002, 477114, 577940, 662384, 640833, 593939, 622625, 667455, 716555, 754293, 723656, 709659, 691881, 673322, 690960, 641377, 655746, 756968, 815129, 874442, 955584, 955747, 1021573, 1115076, 1199748, 1296671, 1360985, 1443187, 1551474, 1553301, 1511955, 1587216, 1585686, 1577181, 1553219, 1492459, 1467990, 1527211, 1548642, 1563584, 1539431, 1495792, 1383683, 1337729, 1264300, 1192322, 1211588]
18394A211588J3266m894r9343l3466N1556n4603l0419m5211l621L113J6358o1046
18382I63278K2909O1394j6424K337J3010j9209n5180j972K9244L7671m5907N777
18370I96928L7878o9040k1369m3038n0096L2351k0190L6088L8483O8193J572n8642
18358I49118m8870L5561k0394K3033m6565l7361P7339O5979Q494j0827k3216K083
18346I74374r355k903j8027k2578j9013l0623m4847r404J2921L6094O6813N531
18334I38983k0080k5590L1653k6082O3776O3107N7070j6653L5983j9416j5752
18323A066999j3968l2713P0323J19122K8679n9167Q0883N0360N8006Q5071Q763
18312A462358K8208K4477K6878j3129j4784n7244r1387j0608J5746P8340M4312
$$ y = [1211588, 1224854, 1219960, 1120617, 1087151, 1138707, 1084104, 1053685, 1008474, 1004853, 1007966, 1024324, 963278, 986187, 1047581, 1031157, 1033494, 1046504, 1027295, 972115, 970143, 999387, 1037058, 991151, 996928, 1034806, 965766, 944397, 901359, 851263, 883614, 863424, 899512, 937995, 1006188, 1007760, 949118, 900248, 935809, 915415, 938448, 891883, 854522, 931861, 997840, 1006334, 995507, 972291, 974374, 965019, 962116, 944089, 921511, 902498, 871875, 827028, 817624, 830545, 866639, 933452, 938983, 918903, 893313, 924966, 898884, 962660, 1025767, 1082837, 1066184, 1102167, 1082751, 1066999, 1053031, 1020318, 1090641, 1209763, 1238442, 1179275, 1260158, 1310518, 1368524, 1453595, 1462358, 1490566, 1515043, 1541921, 1528792, 1514008, 1456764, 1365377, 1354769, 1370515, 1448855, 1493167]
18301A493167P933K5049P7111M1333j3400p7610L6127P5439M4314m6741k5718
18290A637004j4279q8414N985J1574p1949L1675M2535M3890P3083j6083l4348
18279A620673J7703J4707j5046P0680N4096N7299R8998L8785K392N6950j7860
18268A999377N9564J03395O9917M6784K9184P2307P9080J21038N5237k4629j3055
18257B598199M6157N3026j7212J0100j3183l3578q4519J0241m802l4497k8132
18246B501800P2887j6530j2860K7427P5512k5322R545j5588r978m6224K5885J01951
18234B688505R4505P0123J18178J09216R1399J0992j8472O2189J16664N2934J9961
18223C416194J21041J06259J59707J14718J24838Q9452P4802J34271J16335J10884
$$ y = [1493167, 1501100, 1526149, 1603260, 1644593, 1631193, 1553583, 1589710, 1665149, 1709463, 1662722, 1637004, 1622725, 1534311, 1540296, 1551870, 1479921, 1511596, 1554131, 1598021, 1671104, 1655021, 1620673, 1638376, 1653083, 1638037, 1708717, 1762813, 1820112, 1919110, 1957895, 1960287, 2017237, 1999377, 2058941, 2162336, 2232253, 2279037, 2308221, 2380528, 2459608, 2580646, 2635883, 2611254, 2598199, 2644356, 2697382, 2680170, 2690270, 2677087, 2643509, 2558990, 2569231, 2564429, 2529932, 2501800, 2574687, 2558157, 2545297, 2572724, 2648236, 2622914, 2632459, 2616871, 2606893, 2560669, 2586554, 2688505, 2783010, 2853133, 2971311, 3080527, 3171926, 3182918, 3164446, 3226635, 3343299, 3396233, 3416194, 3537235, 3643494, 3803201, 3917919, 4042757, 4132209, 4207011, 4341282, 4457617, 4568501]
18213D568501J47182J58816J20655J03589J43665J75679K20215J30050K57285
18204F025637M20135L98205M25928O54918Q31343J020826J152838J420122J586292
18195A3936244J436750J194250P72591L22357n7568m75634n56070n06693k74882
18186A5791345K3053J51323J98893N2593k8355k94260o09180o29916n87842m61114
18176A3606540k96804k07930q6188n7793M5814K03933K97593M32717M83373O42623
18166A5063878O32736O78722P07774P70629Q85511R09757R77267J109099J279140
18157B3014513J526219J724609J952688K257559K559273K892893L433788M089874
18149D3451416M942093O025122P434403R244043J1652355J4413790J7421585J9874622
$$ y = [4568501, 4715683, 4874499, 4995154, 5098743, 5242408, 5418087, 5638302, 5768352, 6025637, 6445772, 6843977, 7269905, 7924823, 8756166, 9776992, 10929830, 12349952, 13936244, 15372994, 16567244, 17339835, 17662192, 17604624, 17128990, 16572920, 16066227, 15791345, 15814398, 15965721, 16164614, 16217207, 16188852, 15894592, 15285412, 14655496, 14067654, 13606540, 13309736, 13101806, 13015618, 12957825, 13003639, 13207572, 13505165, 13937882, 14421255, 15063878, 15696614, 16375336, 17083110, 17853739, 18739250, 19649007, 20626274, 21735373, 23014513, 24540732, 26265341, 28218029, 30475588, 33034861, 35927754, 39361542, 43451416, 48393509, 54418631, 61853034, 71097077, 82749432, 97163222, 114584807, 134459429]
18141A34459429K0725888J9783506J7329752J4132786J0945859Q843524Q781789
18134B35002533J1183747J5161472J9141980K1591680K1828170J9130194J2698857
18127C55738633L826975n006271j2167134j7346794k1124977k3971646k5252391
18120B54696395k4500672k2857552k1442364k0201516j8324999j5445636j2288993
18113A19634663r528200p077874m999035l047199j148558Q69004K590475L235152
18105A00528428K231261L16116j507227l616467o074124q008842q444019p400095
18097F8025031n943970m624272l536856k911396k585727k242442j852394j664795
18089D2663179j455319j301187j141770j042205r62008q24059n66715m50180k38797
$$ y = [134459429, 155185317, 174968823, 192298575, 206431361, 217377220, 226220744, 235002533, 246186280, 261347752, 280489732, 302081412, 323909582, 343039776, 355738633, 359565608, 354559337, 342392203, 325045409, 303920432, 279948786, 254696395, 230195723, 207338171, 185895807, 165694291, 147369292, 131923656, 119634663, 110106463, 103028589, 98029554, 94982355, 93833797, 94702801, 97293276, 100528428, 102759689, 103075805, 101568578, 97952111, 91877987, 83869145, 75425126, 68025031, 62081061, 57456789, 53919933, 51008537, 48422810, 46180368, 44327974, 42663179, 41207860, 39906673, 38764903, 37722698, 36760690, 35936631, 35369916, 34919736, 34680939]
18080C4680939k7833J33049K42598L55671M49901O38239N83540L63147J30483
18071C7549734p9062k33416m87865p34544j015118j092435j068066j011745r77604
18062C0849879p96470n31245j88580R7037M92667P95061J225276J781672K364299
18053C6089596L085844L964011N157079O254992P390914Q013075P712071O265352
18045H3932934M119887J615975j006500l306173m760968m953739m056250k285142
18037F9300024j47421K024706M202213O338467Q166522R259996R591767R055382
18029A17791656P892332O172154L782923Q38848k221702m733060o714326q210101
18021A14598724r146963r268629q440252o711081m614106k346122j63065J898569
$$ y = [34680939, 34653106, 34786155, 35028753, 35384424, 35834325, 36472564, 37056104, 37419251, 37549734, 37470672, 37237256, 36749391, 36014847, 34999729, 33907294, 32839228, 31827483, 30849879, 30053409, 29522164, 29333584, 29430621, 29923288, 30718349, 31943625, 33725297, 36089596, 39175440, 43139451, 48296530, 54551522, 61942436, 69955511, 77667582, 83932934, 88052821, 89668796, 88662296, 85356123, 80595155, 75641416, 71585166, 69300024, 69152603, 71177309, 75379522, 81717989, 89884511, 99144507, 108736274, 117791656, 125683988, 131856142, 135639065, 136477913, 134256211, 129523151, 122808825, 114598724, 105451761, 96183132, 87742880, 81031799, 76417693, 74071571, 73908506, 75807075]
18013G5807075L683909M711226M617039L545955J566811q83541l536722n918512
18005H3593240p603784q234951p892332o782431n618706m581346l798021l209322
17997C5872347k703004k395485k115930j802845j549055j305144j190818j007964
17989B1802102r09365o84745n96530o23146o22549o41895o08631p03488o68776
17980A5742977o28039o66824o11365o08145n53401m84548l88890m38438l69231
17971A0994096k67581k99757l57753k71919l11206l39449l10085l09656k93189
17962H233501k64096k66544l10151k41760j95847k97792k25187j93942k18908
17953F019274k07294j25009q1348j25641r2756j44279j54991q4266k11468k25469
$$ y = [75807075, 79490984, 84202210, 88819249, 92365204, 93932015, 93048474, 89511752, 83593240, 75989456, 67754505, 59862173, 53079742, 47461036, 42879690, 39081669, 35872347, 33169343, 30773858, 28657928, 26855083, 25306028, 24000884, 22810066, 21802102, 20892737, 20207992, 19611462, 18988316, 18365767, 17723872, 17115241, 16411753, 15742977, 15114938, 14448114, 13836749, 13228604, 12675203, 12190655, 11801765, 11363327, 10994096, 10726515, 10426758, 10069005, 9797086, 9485880, 9146431, 8836346, 8526690, 8233501, 7969405, 7702861, 7392710, 7150950, 6955103, 6657311, 6432124, 6238182, 6019274, 5811980, 5686971, 5605623, 5479982, 5387226, 5242947, 5087956, 5003690, 4792222, 4566753]
17943D566753o4039n4041j77222j54740j52676r8293q3667j13235p0194l8628
17933C560018j0051l2273n2482m7728q4992j10066m6976j60394j82746n6830n4291
17922B721189n7325o6347o6444q3581j26854r2009q7172p1932P1518J2242j05786
17911B047499j18014o9255m7253n8102k1192m4643n9026n2255J900j427j1798
17900A566434n7795p3386l6668k5786o896p1495r0374m4744p9578J4721M1465
17889A135898q942m9933J4823M3371r2199n3565k4764l7137K2464o121l7536n8332
17877H48027K193L202k1160K2274j1504N2357J8617l8656m1698o1904l0607j8434
17865G22707l4123J0704M8315l2568q5426j4079L5883p1657l7577k048j8441l4076
$$ y = [4566753, 4502714, 4448673, 4271451, 4116711, 3964035, 3865742, 3782075, 3668840, 3598646, 3560018, 3549967, 3517694, 3465212, 3417484, 3332492, 3222426, 3175450, 3015056, 2832310, 2775480, 2721189, 2663864, 2597517, 2531073, 2447492, 2320638, 2228629, 2141457, 2069525, 2141043, 2153285, 2047499, 1929485, 1860230, 1812977, 1754875, 1733683, 1689040, 1630014, 1577759, 1579659, 1578232, 1566434, 1508639, 1435253, 1398585, 1372799, 1365903, 1294408, 1204034, 1159290, 1079712, 1094433, 1135898, 1126956, 1077023, 1091846, 1135217, 1043018, 989453, 964689, 927552, 950016, 943895, 906359, 848027, 850220, 853422, 832262, 854536, 843032, 895389, 914006, 875350, 833652, 771748, 741141, 722707, 688584, 699288, 747603, 715035, 629609, 615530, 651413, 579756, 542179, 540131, 521690, 487614]
17853D87614J399J0402K8869J0342N2416K0655l622l636k4325M026J1238k6549
17841E68829l5258M585L2497l347R847l8979q7017L2354O9487L4374n97m4510
17829E42265j6688L2083L4500O4991r0809j17103L2571K158l089M2584L1623Q895
17817E63981j72p1870m6264l2144N0732L0303n3029K7341Q743M7421J07611o0140
17805E72513m5867R8524P4148J0491K6840L5793p708n3092q279N5033O7898k6852
17793G99442o0869m6595r873o033k6358k5003K8408l5435j18116q611m8347j1620
17781D30990L4913k4917R0467M415o8077m5413m6987O263l464m6734m2213O1566
17769C50809Q444k1647n2013k7829J6177k5640j3218N1072N5962N1655L5787K1834
$$ y = [487614, 489013, 499415, 528284, 538626, 591042, 611697, 608075, 604439, 580114, 584140, 595378, 568829, 533571, 538156, 570653, 567306, 577153, 538174, 451157, 483511, 552998, 587372, 586775, 542265, 525577, 557660, 592160, 657151, 566342, 449239, 481810, 483968, 480879, 523463, 555086, 563981, 563809, 491939, 445675, 413531, 464263, 494566, 441537, 468878, 477621, 525042, 632653, 572513, 526646, 625170, 699318, 709809, 736649, 772442, 764734, 711642, 703363, 758396, 826294, 799442, 738573, 691978, 682105, 676072, 649714, 624711, 653119, 617684, 499568, 490957, 442610, 430990, 465903, 440986, 531453, 535868, 467791, 422378, 375391, 381654, 378190, 331456, 289243, 350809, 359253, 337606, 285593, 257764, 273941, 248301, 235083, 286155, 342117, 393772, 429559, 451393]
17757D51393J0569j082L905j8729L4104L0668N7476O506k5011M9732J4833M3701
17745F58065J1572r8091o7408L7391o805K6858m3160j45806l7333n082K2640K1661
17733C74502k9052K873m9628k8079k4290n4037M845M7061M6733m3490q041O1572
17721C00969p1125o8757r3697o3Q1676O5037M2550o6908k6474j2984N7979J0737
17709B18940j3494n4789m0175j9847R500J00893J2428n1022N1646N4753j922m2308
17697B24603o393m7014m246K015q1992j8842N8369l3526o1652K699J5290j0812
17685C8499J6894L2097l9112k6568N8817L2640M2101J9920O6080Q8172l055j4613
17673C11872j0438K0226m6042p4909q2887K1257M1552L4273l7161K0692J8219
$$ y = [451393, 461962, 460880, 464785, 446056, 480160, 510828, 568304, 574810, 549799, 599531, 614364, 658065, 669637, 571546, 504138, 541529, 534724, 561582, 518422, 372616, 335283, 330201, 352841, 374502, 345450, 348323, 298695, 270616, 246326, 192289, 197134, 244195, 290928, 247438, 239397, 300969, 229844, 161087, 67390, 67327, 149003, 214040, 256590, 189682, 163208, 150224, 208203, 218940, 205446, 150657, 110482, 90635, 100135, 201028, 213456, 162434, 214080, 268833, 266911, 224603, 218210, 171196, 166950, 168965, 86973, 68131, 126500, 92974, 31322, 34021, 49311, 38499, 55393, 87490, 48378, 21810, 80627, 113267, 155368, 175288, 241368, 329540, 326485, 311872, 301434, 321660, 275618, 200709, 117822, 139079, 180631, 214904, 177743, 198435, 216654]
17662B16654O9312M5625O1822k4983j8880l9957L8341K0207R0448J34459K2301
17651F15349n5347j5198K6606j5581J03031K8655J0388q0007o7784p818M8479
17640E90773P3730M5838J10252q022j9173O646Q091P563J6963O8082O9149j7665
17628I52227J8630O923K38m7112r793L0476n0438j12015l1033J6229j45947r7509
17616E30876q3616q8359o7034r3009M6244j030q2719K3330J16993M8309R013l291
17604C55707M6357p561m8808N2048P6023O3170K0457L4725M5003Q5952l2333j5058
17592F75682o7435q414J2980P067L9525L3988L3680M8689M0206j7327j6879K6908
17580H08670M1226K6402j1267J4879o8601k9762j0371K5162j4144J9479l7029
$$ y = [216654, 285966, 331591, 393413, 368430, 349550, 309593, 347934, 368141, 458589, 593048, 615349, 560002, 544804, 571410, 555829, 658860, 687515, 697903, 617896, 550112, 542294, 590773, 664503, 710341, 820593, 812571, 793398, 800044, 808135, 815698, 832661, 900743, 969892, 952227, 970857, 977780, 978018, 930906, 921113, 951589, 901151, 789136, 758103, 774332, 628385, 530876, 447260, 358901, 291867, 198858, 245102, 244072, 161353, 184683, 301676, 349985, 358998, 355707, 402064, 394503, 345695, 397743, 473766, 536936, 557393, 592118, 637121, 723073, 690740, 675682, 608247, 599833, 612813, 619880, 659405, 693393, 727073, 775762, 815968, 798641, 781762, 808670, 849896, 876298, 865031, 879910, 811309, 781547, 771176, 796338, 782194, 801673, 764644]
17569G64644o6635p1885j0146j494k3128q5140r0859j06772l9960k0304N5381
17558C03702J701o8785j26109o2248J15787L4862r662m8666M3821O0950l9448
17547B05905m2040n2997L1537k2184L3335J5607J6674j1448m2376L9096m601l6026
17535A30482j2573M811Q2944J3116k4722p8197n9717o2381J4939J631K9787l6597
17523C523K9373M2882J8210M2111L3088n8026J440M3085N9974l0784l1501N110
17511A58485m5207J2251j5037q127K835m1397K8535J8131L5857K8664K0538l1453
17499A64075m3863n2006J1958Q2213J0434P68L2193J9716k1759K4219J0762j4143
17487B24567L7135R1029k8200k7336Q7155P4464j0884J5202P258j4148l8153Q764
$$ y = [764644, 698009, 626124, 615978, 614484, 591356, 506216, 415357, 308585, 268625, 248321, 303702, 305403, 236618, 110509, 48261, 164048, 198910, 189248, 140582, 184403, 245353, 205905, 163865, 110868, 142405, 120221, 153556, 169163, 185837, 174389, 132013, 171109, 166508, 130482, 117909, 122720, 205664, 218780, 194058, 115861, 56144, -6237, 8702, 10333, 40120, 3523, 32896, 75778, 93988, 136099, 169187, 111161, 112601, 155686, 215660, 184876, 153375, 158485, 113278, 125529, 110492, 102365, 105200, 63803, 92338, 110469, 146326, 174990, 195528, 164075, 120212, 68206, 80164, 162377, 172811, 173579, 205772, 225488, 203729, 227948, 238710, 224567, 261702, 352731, 324531, 297195, 384350, 458814, 447930, 463132, 470390, 456242, 418089, 426853]
17475D26853k7220j0980l789K7957Q6361J04652M3207o04l7947J08223R7926J29059
17463I43698P8307M1909j989K7953m0854l5559l0998N2740l3522M027K8937o7279
17451I67370l4078Q790L7757L8773k076P8986J32287P6984K8367K652j5499m5997
17439A274316J3392K2183o3741r5990l7492r3102j7117n6817r8611j63455j13665
17428E69901L9690N8696j1438O6448m101k6362k1077o6269n3833j21370K3250
17417D53535N1300L576l5272m6222j5778o5821m1415m3776k850j0362l8944J1772
17405B19743K1700m5455k804M3407p890J2188K3121L1103j9379l3730m3515p369
17393A91120k2407J8830J9810m2559o1115j9558j0329J6023K3258l7275L8910
$$ y = [426853, 399633, 388653, 384864, 412821, 499182, 603834, 647041, 646437, 608490, 716713, 814639, 943698, 1022005, 1063914, 1061925, 1089878, 1049024, 1013465, 982467, 1035207, 1001685, 1005712, 1034649, 967370, 933292, 942082, 979839, 1018612, 1016536, 1095522, 1227809, 1304793, 1333160, 1335812, 1320313, 1274316, 1287708, 1309891, 1246150, 1150160, 1112668, 1019566, 1002449, 945632, 847021, 683566, 569901, 609591, 668287, 656849, 723297, 719196, 692834, 671757, 605488, 551655, 430285, 453535, 504835, 508411, 473139, 426917, 411139, 345318, 303903, 260127, 257277, 246915, 207971, 219743, 241443, 195988, 193184, 236591, 228701, 240889, 264010, 295113, 275734, 242004, 198489, 191120, 168713, 187543, 207353, 164794, 103679, 84121, 73792, 89815, 113073, 75798, 114708]
17382A14708K5000l0452J647R746K1431P0846j7077k3603K4051M3434n7427n0732
17370A31572n4069j860L1583J1253n5750L7887K8351n4033J0927k1211J1382m3123
17358C2909J5610L0506J3455J0910m1821j01912J9659N2894O8713K2925N3102
17347A76950k4550r9147j9674M2950J10571l9446n6165k1240j6026P1597J6348
17336A42168j1914m0016k6809j7816O5767j2723j7768l0656M2168M8989k974k1127
17324A17289j4887j7853J9804k903j0890J6296k3010J2096j03451p3759j0381
17313i1649P5883J914k6439L8818M4868M4112m1422m0441l0608M7408M4823m3736
17301B3531J1624J4849j0301l7460k5472K0088J8646q1P8944N8009l1608q3770
$$ y = [114708, 139708, 109256, 110903, 120649, 142080, 212926, 195849, 172246, 196297, 239731, 182304, 131572, 77503, 75643, 107226, 118479, 62729, 100616, 128967, 74934, 85861, 64650, 76032, 32909, 48519, 79025, 92480, 103390, 61569, -40343, -20684, 32210, 100923, 123848, 176950, 152400, 53253, 33579, 76529, 187100, 147654, 91489, 70249, 54223, 125820, 142168, 130254, 90238, 63429, 45613, 111380, 98657, 80889, 50233, 92401, 141390, 138416, 117289, 102402, 84549, 104353, 101450, 90560, 106856, 83846, 95942, -7509, -81268, -91649, -15766, -13852, -40291, -1473, 43395, 87507, 46085, 5644, -24964, 22444, 67267, 23531, 35155, 50004, 39703, 2243, -23229, -3141, 15505, 15424, 94368, 152377, 120769, 36999]
17289C6999m5961K1288N5286N0483O0983k5445j6126L0701l2138m0282J9079M54
17277A15321o710o568j5764l3322q0337J9708J5494K9152L6229K3867M2402n755
17265A33717l1036m2271K396j8206k2655j4154J1705j1029p80M1802m2310l2663
17253b5484P9579j824j0219K4033J7347J797L0591m239l5457l1692M6308j4060
17241G6680O3057J01905K5162q359n4355j14300L0878n2377L7099M0385O579m850
17229A47504M640k5110j1738n576N7855M4136j1964L6919L6948l0899m1924J4094
17217B14885k2394j3795o5746m3246m2355m4191P1030O9452q714L0550N4582J1245
17205B11303N8857P783l6123m5640n4542j0862K4425M4335j7856p2998k4293M4800
$$ y = [36999, -8962, 12326, 67612, 118095, 179078, 153633, 137507, 168208, 136070, 95788, 114867, 115321, 108611, 102043, 86279, 52957, -27380, -7672, 7822, 36974, 73203, 97070, 139472, 133717, 102681, 60410, 62806, 44600, 21945, 7791, 19496, 8467, 7687, 49489, 7179, -25484, 54095, 52271, 42052, 66085, 83432, 85229, 115820, 111581, 76124, 44432, 90740, 76680, 139737, 241642, 266804, 258445, 204090, 89790, 120668, 68291, 105390, 145775, 152354, 147504, 152144, 127034, 115296, 109720, 167575, 211711, 199747, 236666, 273614, 242715, 200791, 214885, 192491, 178696, 112950, 69704, 27349, -16842, 54188, 123640, 114926, 145476, 200058, 211303, 270160, 277943, 241820, 196180, 141638, 130776, 155201, 199536, 181680, 108682, 84389, 129189]
17193A29189L8706n2340l5008k5130L8238O4427N2252J6052p1330J1614j7790
17182A48880K3O2954J5200K7724P0605m2770n3298j3240K667m490l4182L2070
17170B12143K7168l5574J6908l1678J5466M4618l965m0711L2245N3942J3674L396
17158C07632l3558j1936K3510L0301n249J8506O938m1296k9046j8496J4211M5824
17146C07341k0062k2247P2566O1155n5721n1405m8400r3818J2098P5890L4958
17135B72355m6420L360k3134n4191k312Q388k112Q305k8471J3151Q8778l2942
17123B04755L7817j6654q777L5080p2175l2605M4971l53J5012N9268M2970J239
17111C10548j13304K2334J19952P26j12284l5745P1676P6243j1276n4299L5958
$$ y = [129189, 167895, 115555, 80547, 55417, 93655, 158082, 210334, 226386, 155056, 166670, 148880, 148903, 211857, 227057, 254781, 325386, 282616, 229318, 216078, 218745, 214255, 180073, 212143, 239311, 203737, 220645, 188967, 204433, 249051, 245086, 204375, 236620, 290562, 304236, 307632, 274074, 262138, 285648, 315949, 310700, 329206, 336144, 294848, 265802, 247306, 261517, 307341, 287279, 265032, 337598, 398753, 343032, 291627, 243227, 149409, 161507, 237397, 272355, 225935, 229295, 206161, 151970, 149658, 158046, 155934, 164239, 135768, 148919, 237697, 204755, 242572, 225918, 217141, 252221, 180046, 147441, 192412, 192059, 207071, 266339, 309309, 310548, 197244, 219578, 339530, 340256, 227972, 192227, 263903, 340146, 328870, 274571, 310529]
17100C10529M4285l2284j6493O678M5826L4402m1139j06295k3479J5363J384K7494
17088B66271l4358Q0736L1839j7400k7967L336L9705N4408J08462M6146j1474
17077E39704n6430m2472O8702mL4192j04n2706o3560j0954k3741k665N2853P804
17064D50619M0335L760k379N196j2941k1174M7182M2450O3083Q5461j8061n603
17052F77928n1687k4810K3429L572j5384K6003n3035j8905m518N8998N5827L2092
17040G09510p4158l1652P5774Q2839n328O3241k0716l6368N7799L18n4364M98
17028G67393P8201O8078o3339p594R2102J9812O09O277P4444P1675J0953n0848
17016A067763m1102J1342O4258k8100j9335J2915L7831K5534K7543O2268L8715
$$ y = [310529, 354814, 322530, 306037, 312715, 358541, 392943, 351804, 245509, 222030, 237393, 238777, 266271, 231913, 312649, 344488, 327088, 299121, 302457, 342162, 396570, 505032, 551178, 539704, 483274, 440802, 509504, 509500, 543692, 543588, 490882, 427322, 416368, 392627, 389962, 442815, 450619, 490954, 494714, 492335, 497531, 484590, 463416, 510598, 553048, 616131, 701592, 683531, 677928, 626241, 601431, 624860, 628432, 613048, 639051, 586016, 567111, 562593, 621591, 677418, 709510, 635352, 603700, 679474, 762313, 756985, 820226, 799510, 763142, 820941, 821259, 766895, 767393, 845594, 913672, 850333, 842739, 934841, 954653, 955262, 961539, 1035983, 1107658, 1118611, 1067763, 1026661, 1038003, 1102261, 1074161, 1054826, 1067741, 1105572, 1131106, 1158649, 1220917, 1259632]
17005A259632k6137J323j1260m1284P4925J22456j4035k6113N3273O1438L7663
16994A491881K4037N1884j2706P1974P6837M4405N241K3995N1652j0794J7744
16983A836150K2933Q6175P6997Q3677Q2599M7377o821J21028M0182L0935M5055
16972B466287J13112Q2102J02749J13659Q0209O2659J29878J63086J31880J91115
16962C636736K04989J67643K06397K52948J92356L35620L61657L30587L46163
16953F035096M31586M37298M59681N17333M96403N39736O98617P96868P95184
16944A1207802J011735J155487J260537J489165J796516K204781K773360L409538
16936B6308921M172419N237150O231170O876024P101384O962751O332595N331692
$$ y = [1259632, 1233495, 1234818, 1223558, 1182274, 1257199, 1379655, 1365620, 1339507, 1392780, 1454218, 1491881, 1515918, 1567802, 1555096, 1627070, 1703907, 1748312, 1753553, 1777548, 1829200, 1818406, 1836150, 1859083, 1945258, 2022255, 2105932, 2188531, 2235908, 2229087, 2350115, 2390297, 2421232, 2466287, 2579399, 2661501, 2764250, 2877909, 2958118, 3020777, 3150655, 3313741, 3445621, 3636736, 3841725, 4009368, 4215765, 4468713, 4661069, 4996689, 5358346, 5688933, 6035096, 6466682, 6903980, 7363661, 7880994, 8377397, 8917133, 9615750, 10412618, 11207802, 12219537, 13375024, 14635561, 16124726, 17921242, 20126023, 22899383, 26308921, 30481340, 35718490, 41949660, 48825684, 55927068, 62889819, 69222414, 74554106]
16928G4554106L894336K128241M61057n22649p52262o34062r2863J114505K619941
16919H2770350L794034M532937M911366N002440M484771L597222K698437J932812
16911A13724369J045196J199j084440k029283k918394l878740m454269m530778
16903I5874860m188329l527313k355323j004516L64356J091555J313256J042360
16895H8610906J79238j351918l117129m651132n570517o178481o536424o602005
16887E4782538o011093n096699m233575l508556k906791k259758j971138j825815
16879B6969113j605267j418373j319319j131661j030232r15327q73728q67691
16871A7807515p01088o61879n98384o01190o58947o42236n09064m68051m83121
$$ y = [74554106, 78448442, 80576683, 81037740, 80515091, 79762829, 79128767, 79035904, 80150409, 82770350, 86564384, 91097321, 96008687, 101011127, 105495898, 109093120, 111791557, 113724369, 114769565, 114770764, 113686324, 111657041, 108738647, 104859907, 100405638, 95874860, 91686531, 88159218, 85803895, 84799379, 85163735, 86255290, 87568546, 88610906, 88790144, 87438226, 84321097, 79669965, 74099448, 67920967, 61384543, 54782538, 48771445, 43674746, 39441171, 35932615, 33025824, 30766066, 28794928, 26969113, 25363846, 23945473, 22626154, 21494493, 20464261, 19548934, 18675206, 17807515, 17106427, 16444548, 15846164, 15244974, 14586027, 13943791, 13434727, 12966676, 12483555]
16862A2483555m61582n31045m88687m28347l38626k92965l16616l49880l32683
16853H943124k95748k55809l06925l05075k80636k95645k72328k39090j84241
16844F507627j72299k44969k52177j50447j32919k09624j40283j43066j20669
16835D941174j31557k00960j00695r7165j77285j69433q0006j69027j71065j43761
16825C500220o0373j4223r7074j53988j31492q3084l3401j00435j01511j27109
16815B597530j14425k5585n767p0718j31999r9283m7894q2773r7489j14055n2513
16804A755029l1358p7095n2462m0090o2889k324k6513j26987r4940j9416Q950
16793A229905o0508q0605j09594j986N6811Q181j04161n7275j6878k7731o2219
$$ y = [12483555, 12021973, 11490928, 11002241, 10573894, 10235268, 9942303, 9625687, 9275807, 8943124, 8647376, 8391567, 8084642, 7779567, 7498931, 7203286, 6930958, 6691868, 6507627, 6335328, 6090359, 5838182, 5687735, 5554816, 5345192, 5204909, 5061843, 4941174, 4809617, 4608657, 4507962, 4410797, 4233512, 4064079, 3984073, 3815046, 3643981, 3500220, 3439847, 3425624, 3328550, 3174562, 3043070, 2959986, 2926585, 2826150, 2724639, 2597530, 2483105, 2457520, 2451753, 2381035, 2249036, 2149753, 2101859, 2019086, 1921597, 1807542, 1755029, 1723671, 1646576, 1594114, 1554024, 1491135, 1488811, 1462298, 1335311, 1240371, 1220955, 1229905, 1169397, 1088792, 979198, 977212, 1034023, 1042204, 938043, 880768, 863890, 836159, 773940]
16782G73940L4601r3515r4207m3027R8061M4982l621n6870q8578M2327M7803K5345
16770F87241k319k7540j3071o6074r1463L7203L7537k76o151n254L0221K3653
16758F03707p1252p1077l2794L9245l2031N436J5003j2553k547K9935J8303P108
16746D96483j2879j2893o561l6903m2662M0133q5451K4O1000p820j1664K9214
16734D10021m970l0110P2483K7514o9122m8190O223k253k4995O1061k7090q051
16722C62521L0579L6000j3071n6339n5854l6284J9635o1484j0731P909N2367L9007
16710C14255N1895P048q502N28L7665l8237l3335R1915k111m8684j4442o721l2276
16697C18998J9137k6338J2443M3453j9334n1497j1772P2301K7541Q012J3035r239
$$ y = [773940, 808541, 715026, 620819, 577792, 675853, 720835, 717214, 660344, 571766, 614093, 661896, 687241, 684922, 657382, 644311, 578237, 486774, 523977, 561514, 561238, 555087, 549833, 580054, 603707, 532455, 461378, 428584, 467829, 435798, 441234, 456237, 443684, 441137, 471072, 489375, 496483, 483604, 470711, 464150, 427247, 384585, 424718, 339267, 339291, 400291, 392471, 380807, 410021, 405051, 374941, 447424, 474938, 405816, 357626, 363849, 361596, 336601, 397662, 370572, 362521, 393100, 429100, 416029, 359690, 303836, 267552, 287187, 225703, 214972, 222881, 275248, 314255, 366150, 373198, 364696, 365224, 402889, 364652, 331317, 423232, 421121, 372437, 357995, 351274, 318998, 338135, 311797, 324240, 367693, 348359, 296862, 285090, 357391, 384932, 392944, 405979, 396740]
16685C96740q7735l8983J3550M0312L8737o7655k2371L0764j7327n8191l3647
16674A94194j3249j7096n7385l4709k4095M6731K4495J3785L2924p6498q9233
16663a36Q5167P0359k5642l4741L6577o5280r2594N3413J4475k1440J9095L8782
16651G8035N5751l235m0926Q728l6283n3180n417k772j0411O6835Q6619K0248
16639A63992O0938J0935j05071j9437N6985J1557j13250r851n4820l9362M6710
16628I326L3477L7259j5344p6525K6687M5734n2703j1865J436M2941M0551K037
16616H3011r3300j0846j2943L6903M4494l610J8364j9188r433k9796J7777k7679
16604f246K0242K635k8947q6963K1463K7069O2003N2316M9710m6437m0923j4701
$$ y = [396740, 309005, 270022, 283572, 323884, 362621, 294966, 272595, 303359, 286032, 227841, 194194, 180945, 163849, 106464, 71755, 47660, 94391, 118886, 132671, 165595, 89097, -136, 85031, 155390, 129748, 95007, 131584, 66304, -26290, 27123, 41598, 20158, 39253, 78035, 133786, 130551, 89625, 98353, 62070, 8890, 3473, 701, -9710, 57125, 143744, 163992, 224930, 235865, 130794, 111357, 168342, 179899, 66649, 56798, 1978, -37384, 9326, 42803, 80062, 64718, -11807, 14880, 60614, 7911, -3954, -2518, 40423, 80974, 83011, -10289, -21135, -34078, 2825, 47319, 43709, 62073, 42885, 33452, 3656, 21433, -6246, 13996, 16631, -12316, -99279, -77816, -50747, 11256, 63572, 113282, 66845, 25922, 11221]
16592A1221p5687j8527L0263K5920Q350M5517L9525K9229p9380l3877j0651l1506
16580e9603j4151L4621O5955l3827K4135O325m9260l6923K6673K3498M7196j5997
16568A8642q3502j1026K0562P4043O6061O0026K2109L678l6841n3723j7658k2910
16556C9461J364M3071J7367m1119l8208P9061m7332P537L8748k8672q916n3480
16544H882n9236M1583J316K4767J4382P014o414k4965M2947K641l6027J211j5582
16531B519J7598J2867k8554l7899M653M2994l534K8046N4675l4531j00210k2326
16519f3702j1245J8610J7761K0356M3935J6480P078j2813K9022K1089L974n8727
16507C1818m1287Q5238p163L9399J0776k5537o4881o078K0995P26R364J5327K7544
$$ y = [11221, -64466, -82993, -52730, -26810, -18460, 27057, 66582, 95811, 16431, -17446, -28097, -59603, -73754, -39133, 26822, -7005, 17130, 23455, -25805, -62728, -36055, -12557, 34639, 18642, -64860, -75886, -55324, 18719, 84780, 144806, 166915, 170593, 133752, 80029, 62371, 39461, 40825, 83896, 101263, 60144, 21936, 100997, 53665, 61202, 99950, 71278, 62362, 8882, -50354, -8771, -7455, 17312, 31694, 38708, 32294, 7329, 50276, 52917, 16890, 18101, 2519, 20117, 32984, 4430, -33469, -28816, 14178, 10644, 38690, 93365, 58834, -41376, -63702, -74947, -56337, -38576, -18220, 25715, 42195, 49273, 36460, 65482, 86571, 90545, 31818, -9469, 75769, 68606, 108005, 118781, 93244, 28363, 22285, 43280, 44006, 53370, 68697, 96241]
16494I6241J861l4826K743N0806r488n1609j7467l3276l1020o0138M459K8042
16482e3672P2998R2203j3039j429q5427p2072M6044K0945O478Q6418P2886r890
16470A62443r788k0898l1889J2705n0434k5375l3552L983M0170L5537n3127q2279
16458e2504N4559Q1527R747n8588l9060n625M4580j6858r483P4746Q4668n1002
16446A16707j32043n0377J6592J9138K1333Q1852o3360O445L9546K2056n4429
16435B3460n8165l0204R820O3636K3031R248J3653j5266o0814L140P611R312k972
16422d510L6121Q309j7300J4492k4429P605l19j12690n4567O0482R2351M055J3591
16409B3191M9108j6377l2502k7759k118l8216n3758r891K2114m944K2841Q795
$$ y = [96241, 98102, 63276, 66019, 116825, 107337, 55728, 38261, 4985, -26035, -86173, -81714, -53672, 19326, 111529, 98490, 97061, 11634, -60438, -14394, 6551, 13029, 99447, 172333, 162443, 152655, 131757, 99868, 112573, 62139, 36764, 3212, 7195, 47365, 82902, 29775, -52504, 2055, 83582, 93329, 34741, -4319, -9944, 34636, 17778, 8295, 83041, 167709, 116707, -15336, -65713, -49121, -29983, -8650, 73202, 9842, 16287, 55833, 77889, 23460, -34705, -64909, -55089, 8547, 31578, 40826, 54479, 39213, -21601, -18461, -10850, -1538, -4510, 31611, 39920, 22620, 37112, 12683, 20288, 19969, -92721, -147288, -86806, 5545, 9600, 23191, 72299, 55922, 23420, -4339, -6457, -44673, -98431, -108322, -86208, -91152, -68311, -59516]
16397e9516L0523L9795N74l3329J5710L12L7228L1461n8767m7652M2611N8068
16385E7018l5007m3988J9797L5717Q0613J5074O0571N0593N7344Q0790n3840M1578
16373C66260M6518j7547P1962J01213l2914k7631n8895k6721P5341M460J3952
16362E15998O7754L8183R326l6076j0822n6745J3160J4845O3406P9086m7703j00170
16350E50242Q7N2347N2267j654l7451k9780n4691L7443P6584r4795j08497K4623
16338D66725N835k611N4488o4761p0708o6942r7286n496n3111o6156J5754j1658
16326A04073j8713L172O0511L4867n119n0917N2759n5653j7202K3167P0414r4073
16314A07286r6919k5905J6418l2401N694P8746K7915m4308R12k1979k1537p095
$$ y = [-59516, -28993, 10802, 11376, -21953, -6243, -5931, 31297, 62758, 3991, -43661, -1050, 57018, 22011, -21977, -2180, 33537, 114150, 129224, 189795, 240388, 297732, 378522, 324682, 366260, 412778, 395231, 467193, 568406, 535492, 507861, 448966, 422245, 497586, 502046, 515998, 583752, 621935, 631261, 595185, 584363, 527618, 540778, 555623, 619029, 698115, 650412, 550242, 550329, 602676, 654943, 653289, 615838, 586058, 531367, 568810, 645394, 550599, 442102, 466725, 472560, 469949, 524437, 459676, 388968, 322026, 224740, 219244, 166133, 99977, 115731, 104073, 85360, 88532, 149043, 183910, 178791, 127874, 180633, 124980, 107778, 130945, 201359, 107286, 10367, -15538, 880, -31521, -25827, 52919, 80834, 36526, 37438, 15459, -6078, -13173]
16302a3173N348r0719k6800K0032M4147N4229L2117l3067L4029N6790J5766n9806
16290C8893j08999j7376K8784N8072M0860O1567K8971j03145o9692l7044n038
16279h4147M3328L9941m8581m6759M096m5265J7180R1961L8749m0977K5436K0523
16267A5485K8310l9744n706K8869L7762n9090p8560O6956J14912J9286m6955J8937
16255A00462M9590q650l6790L227k038p370p865m9447N4323k5934m8105o4332
16243d2929N9494P6787j6391m2120n8492r625M7970M011r709K8786J7336L4537
16231H9655P948n5283j4306K1182j0735k020l5579j5024K0607k1629M9108J8975
16219E2899l9530M945k6128l3823k7123j5630k9976M1648N0607R866P307L355
$$ y = [-13173, -7825, -98544, -125344, -105312, -61165, -6936, 25181, -7886, 26143, 82933, 98699, 38893, -70106, -87482, -58698, -626, 40234, 101801, 130772, 27627, -42065, -79109, -84147, -40819, -878, -49459, -96218, -92122, -137387, -120207, -28246, 10503, -30474, -5038, 15485, 43795, 4051, -1655, 27214, 64976, 5886, -72674, -5718, 109194, 128480, 81525, 100462, 150052, 141402, 104612, 107839, 105801, 98431, 90566, 41119, 95442, 69508, 21403, -42929, 16565, 93352, 76961, 34841, -23651, -33276, 14694, 18705, 8996, 37782, 55118, 89655, 97603, 42320, 28014, 49196, 38461, 36441, 862, -14162, 6445, -15184, 33924, 52899, 13369, 18314, -7814, -41637, -68760, -84390, -114366, -72718, -22111, -12245, -4938, -1583]
16207a583l5689j8262L1896J4202Q3344k1791K546M7867o3486o6417k5796K369
16195e0800R1232K4417q39r2170k853m4186k4497J33196P8576j8131n9967l2921
16183A057m134o5344l4936N8273j641P523J14530P760m1128l5572m1850j1137
16171d6599K7412k1231K9113J3433J0766K4747k9590r8859l1219J7573l678K2275
16159h5857M4950M0890M2884K3412k9067j0798m8806q555M4524m7000o724J01863
16147F1716M9880N517k9681r9986n3373L7333N0797M1931l9783j01723l3320L1976
16135g8716N5801L907k3153o982K1905j8948j8022l9169O9812Q6417J9719q20
16123G1751K3256l7119m6925q2400o251j5588K9248P3834J4076M900L1364q357
$$ y = [-1583, -37272, -55534, -23638, -9436, 73908, 52117, 54663, 102530, 39044, -27373, -53169, -50800, 40432, 64849, 64010, -28160, -31013, -75199, -99696, 33500, 112076, 93945, 33978, 1057, -3077, -68421, -103357, -45084, -46725, -39202, 75328, 83088, 41960, 6388, -35462, -46599, -19187, -40418, -11305, 2128, 12894, 37641, 8051, -90808, -122027, -104454, -108132, -85857, -40907, -17, 42867, 66279, 37212, 26414, -22392, -30947, 13577, -33423, -40147, 61716, 111596, 117113, 87432, -12554, -65927, -28594, 22203, 64134, 24351, -77372, -110692, -78716, -22915, -19008, -42161, -49143, -27238, -46186, -64208, -103377, -33565, 52852, 72571, 71751, 95007, 57888, 10963, -71437, -77688, -93276, -64028, 9806, 23882, 28782, 60146, 51789]
16111E1789k8968j9318M2962K1968J9111J561j0522m9388M581k0578J4372L4641
16099F2211J5152K5498R257n3220m074Q2118J8524n7784j2562j3016j1403O4788
16087A25489N555m8723q4283q9327M6570P5753K0308Q051k9513Q834k7416j8028
16075f730k2885m1946K4071j5203q701p699K5368L6328m466J0438O8078N3251
16063A09904l2254n9461J086L274m1088K6309M1282p68r614m2755j0208L8176
16051B3883p3969K4649N8087j7613n2184L7661M7944K1956j1772j162J6036p3046
16039D70k3128Q477J3529j9960L8909m3624K5840M8163j5394K6224J3569m1434
16027C1641q582M2952J7747p8040j21520j2930K1478N5173K7905o7843K7135L9797
$$ y = [51789, 22821, 3503, 46465, 68433, 87544, 89105, 78583, 29195, 33776, 13198, 27570, 62211, 77363, 102861, 112118, 58898, 54824, 136942, 155466, 97682, 85120, 72104, 60701, 125489, 131044, 82321, -1962, -91289, -44719, 31034, 51342, 59393, 29880, 38714, 11298, -6730, -29615, -71561, -47490, -62693, -71394, -79093, -53725, -17397, -21863, -11425, 56653, 109904, 77650, 18189, 19275, 22549, -18539, 7770, 49052, 48284, 38670, -4085, -14293, 23883, -50086, -25437, 32650, 15037, -37147, 514, 48458, 70414, 58642, 57480, 73516, 470, -22658, -14181, -652, -20612, 18297, -25327, 513, 48676, 33282, 59506, 73075, 31641, 23059, 66011, 83758, 5718, -115802, -128732, -107254, -52081, -24176, -92019, -64884, -25087]
16015b5087M6066L023j3166o091M9925M0633p0669l4236r865L9376L4722J586
16003E6217o1111L5641j4272L3408J1004k1422l3326j4986k7720l5042N3970R540
15991h099k3791l9931L4470K6230j256R2769j9077j2469j596R709O0683l6236
15979H1406K1431j5933o5786p4736m8846m46K1044K7482L7816j3154Q4427L143
15967E7848p5619J0262J6091J5742j8110N41k4886L5159M3652k0314n15Q2232
15955A22083M9219K2962j7774j7852j605n2803l3449p2522l9588J6778j088q7162
15943a12801K5996P1883K9754k3538N8284L3542k7959M515n7581r528L3708L9179
15931F5454L76N7096L1569J6985k1128l8431L2539R477o477n0464j3096K978L1485
$$ y = [-25087, 20979, 24002, 10836, 4745, 54670, 95303, 24634, -9602, -19467, 19909, 54631, 56217, -4894, 30747, 16475, 49883, 60887, 39465, 6139, -8847, -36567, -71609, -17639, -8099, -31890, -71821, -37351, -11121, -12377, 80392, 61315, 48846, 47250, 56959, 117642, 81406, 102837, 86904, 21118, -53618, -102464, -102910, -81866, -54384, -16568, -29722, 54705, 57848, -17771, -7509, 8582, 24324, 6214, 6755, -18131, 17028, 60680, 40366, 39851, 122083, 171302, 194264, 176490, 158638, 157033, 104230, 70781, -1741, -41329, -24551, -25639, -112801, -86805, -14922, 14832, -8706, 49578, 83120, 55161, 59676, 2095, -7433, 26275, 65454, 65830, 122926, 154495, 171480, 150352, 111921, 144460, 153937, 147460, 96996, 83900, 86878, 118363]
15918A18363j06312o1804N2477J7122l2621J7991N2842m8163k8723k4082M5576
15907B666j0233o3391R260K0331l7728R087R5884N4629o4485n3597k598L1282
15895h893Q3791M1703l8240n6178j9855M4465K853k7985J7504p7327n9178J12481
15883A5141K7453j8124k1946n9564j09687K247J05663r655J6031K7809P3401L4114
15871H2883j3266n8942m0359o9915m5770m5324J20524O2513j29892k1542J16648
15860d2442Q1232j28801o6983M7990M9273K2321k1232M4070L2303P0381M438l4357
15848E8193n56J9262L0780L756n0282j9852K8634n0132L4871L6641m4694o5224
15836a8603j7067J286Q324r41P361N0985k6085N3459M5829j0777j5166l4541o7180
$$ y = [118363, 12051, -49753, 2724, 19846, -12775, 5216, 58058, 9895, -18828, -42910, 2666, -7567, -70958, -61698, -41367, -79095, -70008, 25876, 80505, 16020, -37577, -40175, -8893, 74898, 116601, 78361, 22183, 2328, 46793, 49646, 21661, 39165, -38162, -97340, 15141, 42594, 24470, 2524, -57040, -166727, -164480, -58817, -68472, -52441, -24632, 48769, 82883, 69617, 10675, -29684, -99599, -145369, -190693, -70169, -7656, -137548, -159090, -42442, 38790, -90011, -156994, -109004, -59731, -37410, -58642, -14572, 17731, 88112, 92550, 58193, 57637, 76899, 107679, 111435, 61153, 41301, 69935, 19803, 54674, 91315, 46621, -18603, -35670, -34384, -26060, -27001, -19640, 31345, 5260, 58719, 104548, 93771, 78605, 44064, -23116]
15823b3116k7745M698P48K8936P977j4163m964j5001M6301j9449j1715m4749Q9041
15810A6799P7132K7543k225k4766m8233o2753o7116J5886N5676K1547l6098j3310
15798c9918K7544R557l1571K4529j0643k2212J679M9030k1606Q123m2596N92j5120
15785f2612q274J7730k7819O427O4216J0096j7747m7716n5148Q9298L2331o6257
15773f5475m1201K6902J8845n176J8592k0658Q885O929n482K3230Q3017L5613
15761H4021n8677m4165l7141N4634K3344o6502m6565o0461K2902N4585K4008K9069
15749b0948J1494M954K0955R525L4919k6043j6384M8761n2235k9819K2242k6256
15737a8835m5377l7138J9490M9210n051k8875N273N6204O1694J644j0578n9529
$$ y = [-23116, -50861, -46163, -45415, -16479, -8502, -22665, -27629, -42630, 3671, -15778, -27493, -72242, 16799, 93931, 121474, 119249, 94483, 46250, -16503, -83619, -67733, -12057, 9490, -26608, -39918, -12374, -2817, -34388, -9859, -20502, -42714, -41035, 7995, -13611, -5488, -48084, -47492, -62612, -70886, -53156, -80975, -74548, -10332, -236, -17983, -65699, -120847, -31549, 782, -65475, -106676, -79774, -60929, -66105, -47513, -68171, -59286, -52357, -57839, -34609, 48408, 84021, 25344, -18821, -55962, -1328, 22016, -44486, -91051, -151512, -128610, -74025, -50017, -20948, -9454, -4500, 16455, 25980, 60899, 34856, 18472, 67233, 14998, -14821, 7421, -18835, -64212, -101350, -81860, -32650, -37701, -66576, -61303, -5099, 56595, 58239, 47661, -11868]
15725a1868k7713K4542M3324L0517k6789l4853n9027q657N7283K3178n5369m2179
15713h7611m5045j1003N6060M9694L3591l4349n3122M388P0710M9751m8168p8506
15701i3610J9266N5464k5455r506N2696L5519j8530Q155M510K8519l816n106O633
15688E4739k2616L6907l9707k2020Q9400J8683N9200N0421k3266j0910l4959p5169
15676H0703q7757j2510N8261J1580Q689M2456j0968o3555n1185K2716m7426o3336
15664a12332J6032M5906M3689j6469k0778L6989O3971N7874n6568p3808k1859
15653c7353K9110Q603Q478L7388n1707j5250o280J6847J8914N6747J5902l5902
15641D5497o9768m2325m3430Q439N7704k7072j0608L1184M9619L3676m7973J5947
$$ y = [-11868, -39581, -15039, 28285, 58802, 32013, -2840, -61867, -70524, -13241, 9937, -45432, -87611, -132656, -143659, -87599, -37905, -4314, -38663, -91785, -87397, -16687, 33064, -15104, -93610, -74344, -18880, -44335, -53841, -1145, 34374, 15844, 23999, 28509, 57028, 53212, 48106, 54739, 32123, 69030, 29323, 7303, 96703, 115386, 174586, 225007, 201741, 190831, 155872, 80703, -7054, -19564, 38697, 50277, 58966, 101422, 90454, 26899, -24286, -1570, -48996, -112332, -96300, -50394, -6705, -23174, -43952, -6963, 57008, 114882, 58314, -15494, -37353, -8243, 360, 8838, 46226, -5481, -20731, -27011, -10164, 8750, 65497, 81399, 45497, -24271, -66596, -110026, -101587, -43883, -70955, -81563, -50379, -760, 32916, -15057, 890]
15629H90j096L5345j1937N9783N9k5555K8477j2363k6846n6565o4469L3027J5269
15616b5981j5770J1475J1245o0291m6133L8047J8406Q1374J5189k2817j9856n7398
15604g2510r1638k3423q491N0279K5547K8670M6334M6059K1988L6733k343m3232
15592A3973j6385r063M3103P5968L7973J0611r0735r8219o1093R705l9129n8734
15580a82025J3784q531K1001Q0938M4763K787M0869k3975n5428o16L4156L6792
15568D515k9333j6468N369p916m605N7007J04425K9107m3118k4518J1151j9854
15556F5762P489K1054j54L5227m5311o3710q552p692P157n6171n4192K7161M6563
15543b5369J6473k8422M748J0887m13q2409k5766O3653M9912k4622k0833J7496
$$ y = [890, -206, 35139, 23202, 82985, 83044, 57489, 85966, 73603, 46757, -9808, -74277, -41250, -25981, -41751, -30276, -19031, -79322, -125455, -87408, -69002, 12372, 27561, 4744, -15112, -72510, -164148, -187571, -196062, -145783, -120236, -91566, -45232, 827, 22815, 59548, 57205, 13973, -2412, -11475, 31628, 107596, 145569, 156180, 65445, -32774, -93867, -84162, -123291, -182025, -168241, -176772, -155771, -74833, -30070, -27283, 13586, -10389, -65817, -66433, -32277, 4515, -24818, -41286, -35917, -43833, -48438, 8569, 112994, 142101, 98983, 74465, 85616, 65762, 73251, 94305, 94151, 129378, 84067, 20357, 11805, 4113, 11270, -44901, -99093, -71932, -25369, -8896, -37318, -32570, -21683, -22096, -104505, -130271, -66618, -16706, -41328, -62161, -44665]
15531d4665K1163L5287J6451j6574p100L4406R107J2051j02306l6458J7961j0734
15519g1411K4260m6966q659L6442N4117O6118j2807k6247j9719n7940l0815k0762
15507a14389N9737l6860j216j7329J8720L4257m858m406Q523J9912N7234J7020
15495C6345k994M6701o1477q6881N3615j2P014R7770j2061j1985K6119l7681r7392
15482d2919p1395K0554k1810J8951P7609L153p5065n4651N4042R0968n1623j25129
15470a77315q104L1952J155P014K5083M0670R147r229j1909M834K447P6078J535
15457f642l9605K5389L2173J1287m3089p493K1155l3387L3027K217J2345q292
15445i15l483J6366L445o6336n6675j9631J11135K6616l5066j3519l3439M6886
$$ y = [-44665, -23502, 11785, 28236, 11662, 4562, 38968, 48075, 60126, -42180, -78638, -60677, -71411, -47151, -94117, -102776, -66334, -12217, 53901, 41094, 14847, -4872, -62812, -93627, -114389, -54652, -91512, -92728, -110057, -91337, -57080, -61938, -66344, -57821, -37909, 19325, 36345, 33351, 80052, 18575, -68306, -14691, -14703, -7689, 90081, 78020, 66035, 92154, 54473, -42919, -114314, -93760, -115570, -96619, -19010, -15857, -90922, -145573, -91531, -563, -52186, -177315, -185419, -153467, -152312, -145298, -120215, -79545, -70398, -79627, -91536, -86702, -84255, -8177, -6642, -46247, -20858, 11315, 22602, -20487, -27980, -6825, -40212, -7185, -4968, 7377, -915, -4398, 11968, 15413, -50923, -107598, -127229, -16094, 10522, -24544, -38063, -71502, -24616]
15433b4616K6480q1602p7876k1675Q1007R4856L3497o297N373o679L3119J2536
15421F8123o2438k4914j7575n9912L1696j8836O1006L0418m3669l4346m976j2932
15409h8355R3110R2887k3481r3938K9944K841m0946j1826M4898j024m0369K10
15397c6049J3842Q60M5648k792O990j3595l7164K4040j6054K7703O5140K7152
15385A05721M5527l4930j07447m6652N3084J6795j1011j7863j6669J0889j1178
15374a3734P0672M8807J1504k3200k3582l1780q151J8658M3429j5005p7941k6977
15362b7300j6097l5024j4883L8700N5035J4508n2664k2306L3514L8613k9051R449
15350g506n0320l0629k0021l329m6602P2260J7185J8535K4305O9056l466J685
$$ y = [-24616, 1864, -79738, -157614, -179289, -98282, -3426, 30071, 23774, 29147, 22468, 55587, 68123, 5685, -19229, -36804, -96716, -65020, -83856, -22850, 7568, -36101, -70447, -75423, -88355, 4755, 97642, 74161, -19777, 10167, 13008, -27938, -39764, 5134, 4110, -36259, -36049, -22207, -21347, 24301, 21509, 28499, 14904, -22260, 1780, -14274, 13429, 78569, 105721, 151248, 116318, 8871, -37781, 15303, 32098, 21087, 3224, -13445, -2556, -13734, 56938, 105745, 117249, 94049, 70467, 38687, 30536, 49194, 92623, 77618, -323, -27300, -43397, -78421, -93304, -54604, 431, 14939, -37725, -60031, -26517, 12096, -16955, -7506, -57826, -88455, -108476, -111805, -158407, -86147, -68962, -50427, -26122, 42934, 39468, 41153]
15338D1153J62n4175L763m0978j425J1210L5064k1484M020m382n2344M5131O7392
15325C3107r0162J3888N0945l27L2360N2563j3975k9150M3941o559j6236k0591
15313D9804J0858J9312N78p3347k513N5980J1759k9397m3326L4875L4074l7437
15301C1220P5581j9487k6699o877k10M0551j7539k0815j1510q4570P8411Q0634
15289A18690m3060l8908J168J5625N1765O3471j8584q8070m2475l6665M9132M7918
15277H0007J1691O2711N149q1054q0159o5400N9317J02508N0706m4896r9940j1765
15265a1125M4610M4602l6154o6825M8663K897l5247M568n2551L9816L4269L1045
15253D8568o3813Q986N6338K2690m8895l8149n3981j6735m8739L2531O1587j4440
$$ y = [41153, 41315, -12860, -9097, -50075, -51500, -40290, -5226, -26710, -22690, -27072, -79416, -34285, 33107, -57055, -43167, 7778, 7451, 39811, 92374, 78399, 49249, 93190, 86631, 70395, 49804, 60662, 79974, 80552, 7205, 4692, 60672, 72431, 43034, -292, 34583, 68657, 31220, 106801, 87314, 60615, 53738, 53528, 94079, 76540, 55725, 44215, -40355, 38056, 118690, 75630, 36722, 37890, 53515, 105280, 168751, 150167, 62097, 19622, -17043, 32089, 80007, 91698, 154409, 159558, 78504, -1655, -67055, -7738, 94770, 145476, 100580, 640, -11125, 33485, 78087, 41933, -24892, 23771, 26668, -8579, -4011, -56562, -16746, 17523, 48568, -15245, -6259, 50079, 72769, 23874, -14275, -68256, -84991, -133730, -101199, -39612, -54052]
15241e4052p1229k9083n5Q2047O2840M7007o0631l177J16637p8293o0407Q0967
15229C2571l8036p2490n1291P898M1277P7980j0790K7123J1619k2948j7961L2211
15217A7163n6601M320o160n4635L62j4809j9709j2075K3579L4646J7845l229L4245
15204c5058R6352L3535l804k0156j5638k0991k749K6098o5719q2322N428J9520
15192f5504L0911O7637p8197m5347k6630m8317p938J06431J6794O5829O275M0829
15180F2773Q153J2836k092m7271j9544L040k9954k1771j3694m747K1486M4837
15168A4052j626p1648j6220J0983j6047K4380L7972L046N6160N0751o1100r7308
15156f6605j3625m4600n6227J26640Q2069M0434O1915L2637p2036p3599K9097
$$ y = [-54052, -125281, -154364, -154419, -72372, -9532, 37475, -23156, -26333, 90304, 12011, -48396, 32571, -5465, -77955, -129246, -121348, -80071, -2091, -12881, 14242, 25861, 2913, -15048, 17163, -39438, -35118, -41278, -95913, -95551, -110360, -130069, -142144, -118565, -83919, -66074, -69303, -35058, 61294, 94829, 91025, 70869, 55231, 34240, 31491, 57589, -8130, -90452, -85024, -65504, -34593, 33044, -45153, -90500, -117130, -165447, -173385, -66954, -50160, 15669, 21944, 62773, 70926, 83762, 81670, 34399, 14855, 17895, -12059, -33830, -47524, -52271, -30785, 14052, 12426, -59222, -75442, -64459, -80506, -56126, -18154, -15108, 41052, 91803, 30703, -66605, -80230, -124830, -181057, -54417, 27652, 68086, 130001, 162638, 90602, 17003, 46100]
15145D6100j3459k2749m3335j3398J9673J0488K543j5609M0499P3986P1763L253
15133A59755j7964p5911j2529Q663J3024l1685l9871l5231R4486M6475l3994M3831
15121A19049r683j6073j0521L174o7396m5705L6673Q5280K4540k2765l6242m8167
15109A2164m2490J9495N3853k2888k1313l3848O3030l900J792j3889l3086N2390
15097C1310O4799M7154m5004k5093k9885l3523K5499l6088o2482m886k7495K5707
15085f9987K479J1467l7853j8691N3766r836N0637j4204l1133M5372K2969l9494
15073c4508q4J27687K4829q4890o8432n1561M289K3581L6927L5530k1391o9789
15061g7812L0750R455K5243L9828l8118o6716l8600n7711m2512M0499O4433o2937
$$ y = [46100, 32641, 9892, -33443, -46841, -27168, -16680, -14137, -29746, 10753, 84739, 156502, 159755, 141791, 65880, 53351, 62014, 75038, 43353, 3482, -31749, 62737, 109212, 75218, 119049, 109366, 93293, 82772, 85946, 18550, -27155, 9518, 94798, 119338, 96573, 60331, 12164, -30326, -10831, 43022, 20134, -1179, -35027, 28003, 24103, 25895, 12006, -21080, 31310, 96109, 143263, 98259, 73166, 43281, 9758, 35257, -831, -63313, -68199, -95694, -69987, -67508, -56041, -93894, -112585, -58819, -68655, -18018, -32222, -63355, -17983, 4986, -34508, -34592, 93095, 117924, 33034, -35398, -86959, -82670, -59089, -22162, 13368, -8023, -77812, -47062, -37607, -12364, 27464, -10654, -77370, -115970, -173681, -216193, -175694, -111261, -174198]
15049a74198j7706O3176M0743M3735M2276K9835L8948j7787J4088n6283o8777
15038f1950p152J8815K5570m561J3024j4451k5m3971m738O487R3816Q9359o7806
15025D2417j07655J3434L3123k0499q74Q003N4607M9967p5997o8731M0717n936
15013c7424k0557k2483k2446N0618P6168K3234m8790K931q288j1260p1456M3209
15001d6544K8842J5423R2258J566L3960m2460n8352L0159l7135o0242l9606p116
14989h9247N1932o645N3481J02796p8289r1853K0111J6886k5727k8187J6490l1173
14977h9425J4658m3317m9899P7062M2461K4558J890j5079K5239L3931k9955k4255
14965c2131k5991K8603J0393M6295p284l7704j0981k6461J4774J2444J0327j2738
$$ y = [-174198, -191904, -128728, -87985, -44250, -1974, 27861, 66809, 49022, 63110, 6827, -61950, -69102, -50287, -24717, -29278, -16254, -30705, -30730, -74701, -79439, -72952, 20864, 110223, 42417, -65238, -51804, -18681, -39180, -40054, -32051, 22556, 72523, -3474, -72205, -31488, -37424, -57981, -80464, -102910, -52292, 23876, 47110, -1680, 1251, -7037, -18297, -89753, -46544, -17702, -2279, 89979, 91545, 125505, 83045, 24693, 54852, 17717, -42525, -82131, -89247, -37315, -43960, 9521, 112317, 34028, -57825, -37714, -20828, -46555, -74742, -58252, -89425, -74767, -118084, -167983, -90921, -48460, -23902, -22012, -37091, -11852, 22079, -7876, -32131, -58122, -29519, -19126, 27169, 19885, -17819, -28800, -55261, -40487, -28043, -17716, -30454]
14953c0454J2317N3433q435p2078K231r892J8165k3204j8181n1867J3053M2535
14941g2377p6070j0255M2476J5687K9164K2700J3343q0059J0257L9197O0020K0630
14929A4713P456J0735j0129k0295L9576Q679o395k900k5840n3272J1415r687K516
14916c3428L9532P71m5478N2431L1585k496M257m7414Q7988O8426p2107l5752
14904D8315M4055J7457l383K1435k1393m5359O5720J085j9675k1854q7687j856
14892c140J4047k9001k8503J7651k1260M3432J3188R095K8574l4469l4977q0558
14880a05921N133K3188m733K436M702L3781Q8573l067n5206q526M5422o320O063
14867B5525L7029l9769q9715l0391L8967M2394L8056J4404k6651k8490K8574p4343
$$ y = [-30454, -18137, 35296, 26861, -45217, -42986, -52878, -34713, -57917, -76098, -127965, -114912, -72377, -148447, -158702, -116226, -100539, -71375, -48675, -35332, -115391, -105134, -65937, -5917, 14713, 22169, 32904, 22775, 2480, 42056, 50735, 44340, 41440, 15600, -37672, -26257, -35944, -33428, 6104, 6875, -38603, 13828, 45413, 42917, 47174, -240, 87748, 156174, 84067, 48315, 92370, 109827, 106444, 127879, 106486, 61127, 126847, 127932, 108257, 86403, -1284, -3140, 10907, -18094, -46597, -28946, -50206, -6774, 6414, 15509, 44083, 9614, -25363, -105921, -100788, -77600, -82333, -79897, -75195, -41414, 47159, 44092, -11114, -19640, 25782, 19462, 25525, 62554, 22785, -66930, -97321, -58354, -15960, 22096, 36500, 9849, -18641, 9933, -64410]
14855f4410Q037O1079J2872J9161l0040k903j6483R586O5347l4996l7466J1835
14843A619j8415O283K654j3173K3190L0625M5728j7425N6258k4237n4582j7082
14831B1443P214n0181M0503J0447l8079N908l118k5520L0947L2084O916L0119
14819F8683j8784k91O3517l2590R646n115q965J7864m4888p2854n0466k0174K8483
14806f5934L1951L5691o931J9923O1466k77J8820L3446M2337p8171j02688M4374
14794C4007O548K0978M7798L3737J5655n6682o8977l6871J9041m638p8667K3571
14782d4500M477L4826k2427nL395J095l6453J2726J1147j770K2372m1176j2039
14769f8332K9558M3063L2848k7026o4213n2403o5565K21K6156J0620Q471k3135
$$ y = [-64410, -56373, 4706, 17578, 36739, 6699, 3796, -12687, -3101, 62246, 27250, -10216, 1619, -16796, -10513, -7859, -21032, 2158, 32783, 78511, 61086, 117344, 93107, 38525, 21443, 28657, -21524, 18979, 29426, -8653, -2745, -5863, -31383, -436, 31648, 38564, 68683, 49899, 49608, 113125, 80535, 90181, 85066, 76101, 93965, 49077, -23777, -74243, -94417, -65934, -33983, 1708, -5223, 14700, 76166, 75889, 94709, 128155, 170492, 92321, -10367, 34007, 40555, 61533, 109331, 143068, 158723, 102041, 33064, -3807, 15234, 10596, -68071, -44500, -40023, -5197, -27624, -27629, -24234, -23139, -59592, -46866, -35719, -37489, -15117, -56293, -68332, -38774, 4289, 37137, 10111, -54102, -106505, -172070, -171849, -145693, -135073, -126602, -149737]
14757a49737M964R7682P1770J683o1256q1582n4281K3420R0445N5720J2629l6977
14745b5520m9438l9889K5509O1039O3745L3068o4188n7775K3361N0642L6955M5239
14733A02748j0363K03p0523n7154L2998P072Q763k3260J5036L9847L3606K7758
14721A06731l7519O5812J5953k7608q2096k7463O380k7382l5482K1078N4938K3010
14709E6352n4718K728J7056R0639k8723k1189l009k8681m3964k1592l8344J0792
14697f2653j0168j3344M4463n886m46m6480J2973N3042M7122m1134L2147n269
14685D367j6733P7359l2014q7993m1195N644L8859J7054L0137N7700k1829q443
14673B2913J771l5833o4521L8541Q0525P1220p6973l1384K8976l152O7164j274
$$ y = [-149737, -144773, -47091, 24679, 26362, -34894, -116476, -170757, -147337, -56892, -1172, 11457, -25520, -74958, -114847, -89338, -28299, 35446, 68514, 4326, -53449, -30088, 20554, 57509, 102748, 92385, 92588, 22065, -35089, -2091, 4981, 13744, -9516, 5520, 45367, 78973, 106731, 69212, 135024, 150977, 123369, 41273, 13810, 20190, -7192, -42674, -21596, 33342, 56352, 1634, 4362, 21418, 112057, 83334, 62145, 59136, 30455, -13509, -35101, -73445, -62653, -72821, -86165, -41702, -47588, -48034, -94514, -81541, -28499, 18623, -22511, 9636, 4367, -12366, 64993, 32979, -55014, -96209, -90565, -51706, -34652, -4515, 53185, 31356, 22913, 24684, -11149, -75670, -37129, 43396, 114616, 37643, 6259, 35235, 32083, 99247, 97973]
14661I7973J962m5750m0883o7039M390j1697m7352J7198K0960M343o096J6536
14649e5455O0011L6720p1280j8029R890O5280Q199j0794P7022J1986j709q4022
14637B7819l1786O2689k3213q0215K733Q0375K2626m8142m3875L3530K0137M7439
14625G0117K5201M0685j0463n9840m4109q477l6938K7672K1973j2926J7225L3118
14613F3238K2678l7659p8874L9070N0238j0099J3403J589Q517j4103J3019J2023
14601H3040m981p4479k0230N3776m2375j8875J800P3382J8304q4952l9782j5596
14589g0968M594n550M2080K905L193j8537n4176j0455L0399n9105L0606O0358
14577d4656j0423n491O2552m4020Q5047L6076J613K8049m8924k0417o5518j0909
$$ y = [97973, 99935, 54185, 13302, -53737, -49347, -61044, -108396, -91198, -70238, -65895, -71991, -55455, 4556, 41276, -30004, -48033, -38143, 27137, 35336, 24542, 101564, 113550, 111841, 27819, -3967, 58722, 35509, -44706, -41973, 38402, 61028, 12886, -30989, 2541, 22678, 70117, 95318, 136003, 125540, 65700, 21591, 13114, -23824, 3848, 25821, 12895, 30120, 63238, 85916, 48257, -30617, 8453, 58691, 48592, 61995, 63584, 72101, 57998, 71017, 83040, 78059, 3580, -16650, 37126, -5249, -24124, -22324, 51058, 69362, -15590, -55372, -70968, -66374, -71924, -29844, -26939, -23746, -42283, -96459, -106914, -76515, -135620, -105014, -44656, -55079, -60570, 1982, -42038, 43009, 79085, 80698, 108747, 59823, 39406, -26112, -37021]
14565c7021j7156Q443N9385l710L662l7977k8516P2655l7879J7687n7098m2662
14553a00187L3104J6643k4408m056j6187J1479K2670L1040o587M0970l2676J0129
14541a8066k6875j8798L5354l8024L8269O5274K5234M7567l5823k2705m9765j4989
14529a3347m5543M849k8451k6459R1007O6690l0860r339K2319j8296q738J2286
14517A6118q366K5391K8128o3677l7541k418k0051J9432j5379p0964l543J3489
14505a19381l0565J8584P8424N5945P3390l285j6743m175m9087m3025k9438K7155
14493d2201Q1306K2584k7946o500k7492j6413l2944M4104J2070j9910o5071o857
14481h5270K8023L0047M7792j0951O597M9479K9409R396p8394q2291j2484k820
$$ y = [-37021, -54177, -45734, 13651, 9941, 13603, -24374, -52890, 19765, -18114, -427, -57525, -100187, -67083, -50440, -74848, -78904, -95091, -83612, -60942, -29902, -36489, 4481, -28195, -18066, -44941, -63739, -28385, -66409, -28140, 37134, 62368, 109935, 74112, 51407, 1642, -13347, -58890, -54041, -82492, -108951, -17944, 48746, 17886, 8547, 30866, 12570, 3832, 16118, 7752, 33143, 61271, -2406, -39947, -42365, -62416, -42984, -58363, -129327, -132870, -119381, -149946, -131362, -52938, 3007, 76397, 73112, 56369, 52194, 3107, -39918, -69356, -42201, 39105, 61689, 33743, 27243, -249, -16662, -49606, -5502, 6568, -13342, -78413, -85270, -57247, -27200, 20592, 9641, 16238, 65717, 95126, 104522, 26128, -56163, -68647, -71467]
14469g1467O0209L331n6340k7205N4937J3941j8784l2040l7251n1093j90j3926
14457a75878J3543J760J6210J02605k4450m402K3043Q4837J6956j09493n5264
14446a10533l2974M3125j7184K7215L3678Q9011j7336l7989n5172m19L366O337
14434f8875N3052P373J06099q182j4222l2005q2343J2242N8392p5609o0571K3978
14422h0671J3091K9371k7626m4538o099M1490K5404M4186Q26l4026K0073J2938
14410e581j0460m6276J354N2684M8489r980q8314o1695R2276K4334L3371K6421
14398E6623L1736l6379r277J1951r738n5369l1587n6252n1927N7350P2718R743
14386a0408o1679j56802K1029J08418J7557J1558J6682P5434L9023p4284j3973
$$ y = [-71467, -11258, -7927, -64267, -91472, -36535, -22594, -41378, -73418, -110669, -161762, -161952, -175878, -162335, -160575, -144365, -41760, -66210, -70612, -47569, 37268, 54224, -55269, -110533, -143507, -100382, -117566, -90351, -56673, 32338, 15002, -22987, -78159, -78578, -75212, -68875, -15823, -8450, 97649, 89467, 75245, 43240, -39103, -26861, 31531, -44078, -104649, -80671, -67580, -38209, -65835, -110373, -116472, -74982, -49578, -5392, -4566, -38592, -18519, -5581, -16041, -62317, -60963, -8279, 40210, 30230, -58084, -119779, -27503, -3169, 30202, 56623, 88359, 51980, 42703, 54654, 44916, -10453, -42040, -98292, -150219, -92869, -20151, -10408, -72087, -228889, -207860, -99442, -81885, -70327, -53645, 21789, 60812, -13472, -27445]
14375b7445L2971J3663l7558K0555j1788r790J0825l5738n9569j509Q4779O2713
14363D2109l8017L0934k5000k0105M31k2983K2655P1886L1186l7348K7600J728
14351H5076j13273L2609K7826m6579J2234J5860l1084R307P5260p0760k1892K3208
14339b208P533r627o0027m3291J4014K8013K6062R3818L5776l6464k1635L8040
14327G0004k0520j3339l8826P5108k4547m9986L0643l2J9954k1514K1246N7062
14315A05253m875l4219j033r1419p831j0883j3101N7417m9436P060J2013j9709
14303e0763n7155M6668L0883k1509r8207J9195N1054O1112O7836j0204k7299N537
14291A7148j1329j7452l3690j9666k260J9391M5513P0357K6818j02984l1657J8109
$$ y = [-27445, 5526, 19189, -18369, 2186, -9602, -19392, -8567, -44305, -103874, -105383, -20604, 42109, 4092, 35026, 10026, -10079, -9648, -32631, -9976, 61910, 93096, 55748, 83348, 85076, -28197, 4412, 32238, -14341, -2107, 13753, -17331, -8024, 67236, -3524, -25416, -2208, 5325, -4302, -64329, -107620, -93606, -65593, -39531, 54287, 90063, 53599, 31964, 70004, 49484, 36145, -2681, 72427, 47880, -2106, 28537, 28505, 48459, 26945, 48191, 105253, 100378, 66159, 65126, -26293, -34124, -45007, -58108, -691, -50127, -43067, -31054, -50763, -107918, -61250, -30367, -51876, -150083, -130888, -79834, -18722, 49114, 38910, 11611, 17148, 5819, -11633, -45323, -64989, -67249, -47858, -2345, 68012, 94830, -8154, -39811, -21702]
14279b1702J7595j0822m1165O6391N7043l5311n2376M2782j1058j6472j2241p329
14267b4665L0855P1285l127q9145M1692O1754L1377k5932q9205j7036J1912J8351
14255A8116J8443J1293K0868k3899J0023n4445O291P2799m3761m8336l8623K4165
14243b7066K2911r825j0696j6619j9266j9697P263J1518K7266m7497k3754N4756
14231e0706N9698J2651O2301k4327k3764R977m2177n0092K5479N4861k3181k3671
14219a2951L6187L0123l8771L7339M6064r6997o2036M8711J1139r3128M2226R417
14207d2677l8298J6289n3333l7407K6434L4395M8926P422O4376L1159J2410K1139
14195I0835K6415q4253q1257L2470N4990k618k4404N4989K7525M343J2746L7070
$$ y = [-21702, -4107, -14929, -56094, 10297, 67340, 32029, -20347, 22435, 11377, -5095, -17336, -24665, 6190, 77475, 74348, -14797, 26895, 88649, 120026, 94094, 4889, -12147, -235, 18116, 36559, 47852, 68720, 44821, 54844, 399, 6690, 79489, 35728, -12608, -51231, -27066, -4155, -13980, -24676, -41295, -60561, -80258, -72995, -61477, -34211, -81708, -105462, -50706, 8992, 21643, 83944, 59617, 35853, 45830, 3653, -46439, -20960, 33901, 10720, -12951, 23236, 53359, 14588, 51927, 97991, 994, -61042, -12331, -1192, -94320, -52094, -42677, -80975, -64686, -118019, -155426, -128992, -94597, -45671, -38249, 26127, 57286, 69696, 90835, 117250, 32997, -48260, -15790, 39200, 36582, 12178, 67167, 94692, 99035, 111781, 148851]
14183A48851L1487r6186j06244K7763M5605j9917L4361K5980l0183n1663K2551
14172C2405O7323m4496m4148p9852j5725N0175P6571j4576k6558o2206p1749n2911
14160a85747m6678K0008J5861Q2492Q9666L1072m3280Q552Q4284J7455k4305K71
14148D9651n1595J087l2569p5071K1761O7471k3590o6327J3411O5702r932P465
14136c2536L8318K7552k4087j2364Q53l179r160m3852L0406L396o3252P0417O0031
14123D2543J7628k5408j9230o756k8066j8241n750o5042n023k8311L3477p071
14111a15250l1138O8058K9938M3570J9380l2812l8678k6772j4681L7637L7283
14100b3465P82j0842k3769n0109M3138R0732L7798J0729M0402q7853m4094J6717
$$ y = [148851, 180338, 84152, -22092, 5671, 51276, 31359, 65720, 91700, 61517, 9854, 32405, 99728, 55232, 11084, -68768, -84493, -34318, 42253, 27677, 1119, -61087, -132836, -185747, -232425, -212417, -196556, -114064, -24398, 6674, -36606, -28054, 56230, 73685, 49380, 49651, -1944, -857, -33426, -108497, -86736, -19265, -42855, -109182, -95771, -30069, -40001, -32536, 5782, 33334, 9247, -3117, -2264, -5443, -14603, -58455, -28049, -24653, -87905, -17488, 42543, 60171, 34763, 15533, 8777, -19289, -37530, -43280, -108322, -113345, -141656, -108179, -115250, -146388, -78330, -48392, -4822, 14558, -18254, -56932, -83704, -98385, -60748, -23465, -22683, -33525, -57294, -107403, -64265, 26467, 64265, 74994, 115396, 27543, -16551, 166]
14088A66l8943n1899O9477N951p1156M2529n031j2903J5655K644o0783n9294N3903
14075a09684Q1461k1225l4973L4738q653k625m5480k3485j9587l4235K2391Q2162
14063g9195J06846n738p9792O5133Q2206j09431j08350k9385P6242R868k9003
14052a00599J09078J1667p8642K4133J0129n761K9442R246j6490j8804J7576M2918
14040C3893L8014O43k3112j4386j15424n9277M8415O5829P0831n3754q5073l6767
14028a30168J2757N3597N0395J7050o726P4288N7918p2176l8798p931m9056p2067
14016a10917o8776Q0621N8419q233J0330J0390J9591J5078l1872L5783K9696m5228
14004e118J7086K5068J6554m4230O32j775K8022L1251j9884l3351o8397n9367
$$ y = [166, -38777, -90676, -21199, -15248, -86404, -43875, -48906, -61809, -46154, -43510, -104293, -163587, -109684, -28223, -49448, -84421, -49683, -58336, -60961, -106441, -129926, -149513, -183748, -161357, -79195, 27651, 21913, -57879, 7254, 89460, -19971, -128321, -157706, -81464, -71596, -100599, 8479, 20146, -58496, -34363, -24234, -29995, -553, 8693, -7797, -26601, -9025, 33893, 71907, 72550, 49438, 35052, -80372, -139649, -91234, -25405, 45426, -8328, -93401, -130168, -117411, -63814, -13419, 3631, -3095, 71193, 129111, 56935, 18137, 10206, -38850, -110917, -179693, -99072, -40653, -48886, -38556, -28166, -8575, 6503, -25369, 10414, 40110, -5118, 11968, 37036, 53590, 9360, 9992, 8217, 36239, 67490, 47606, 14255, -54142, -113509]
13992a13509O5080O6547j4904r976j4692Q19L2195l808J2878K1554o503J4752
13980E0433k4033m0096L6956R8243L5358Q75j5402m7697m6612K4368j2963p5135
13968a5705j06974R1128M5451n9355M200M3055K365p7137k7723J4851Q0656Q6315
13956H1127L4371K499r2372n0019J1197m8827m8000K1893M5160j2322m305k2090
13944h1688Q766L8692Q7041j00934n0097K3050M6354M2962M9505j5405J0194K0736
13932G9176N0418o4515k6418k2511m4244J2155J68L7544L4163M2201R811N500
13920A13448n317J8952o0031q1461Q834M5772p3738l179M9010M3379L703k0325
13908C9047n9667l4698j8066l780M9828R829M1154j4898o7100N2721J50147m6043
$$ y = [-113509, -48429, 18118, 3214, -6762, -21454, -20635, 11560, 7752, 20630, 42184, 35681, 50433, 26400, -13696, 23260, 121503, 156861, 157736, 142334, 94637, 48025, 72393, 59430, -15705, -122679, -31551, 13900, -45455, -41255, 1800, 4165, -72972, -100695, -85844, -5188, 81127, 115498, 117997, 25625, -24394, -13197, -62024, -110024, -88131, -42971, -55293, -59598, -81688, -72922, -34230, 52811, -48123, -98220, -75170, -28816, 14146, 63651, 48246, 58440, 79176, 129594, 65079, 38661, 16150, -28094, -15939, -15771, 21773, 55936, 98137, 107948, 113448, 108131, 127083, 67052, -14409, -5575, 40197, -33541, -36720, 12290, 55669, 59372, 39047, -20620, -55318, -73384, -77164, -27336, -17507, 23647, 8749, -58351, -5630, 144517, 98474]
13896I8474o1042N7856l9112k0870P553K4678N7154j5494p9694k7451j3218L2263
13884B1097n614l2560p974n4834n3981N418K4567J14235M6614l8317o7379J348
13872d7380L7320R4843L2586j9964k8770J7982L0379j4300n7781K2607p8498o9646
13860h0622J4685N4382Q205l3617J4100o695L5858L708m5474N8519N4608l4533
13848D3124o8230k652M998K708k8795J7006M3417k0468k4824O0398N238k7916
13836D004k5467O2972L0226j6956q4707p7946j5118o693M2137K0779K227L4924
13824b9618K7337n5121P2496J0638n5560k835J4917n122L1493k5295j3590n3070
13812h3330N672L8641j701m3177L8934R449n5320r5573j1214R0866K7637q809
$$ y = [98474, 37432, 95288, 56176, 35306, 42859, 67537, 124691, 109197, 29503, 2052, -11166, 21097, 15483, -17077, -25051, -79885, -133866, -128448, -103881, 10354, 56968, 18651, -48728, -47380, -10060, 84783, 117369, 97405, 68635, 86617, 116996, 102696, 44915, 67522, -10976, -80622, -65937, -11555, -3350, -36967, -22867, -29562, 6296, 10004, -35470, 23049, 77657, 43124, -25106, -27758, -22760, -20052, -48847, -31841, 11576, -8892, -33716, 26682, 31920, 4004, -21463, 41509, 71735, 54779, -29928, -107874, -122992, -129685, -87548, -66769, -64542, -29618, -2281, -57402, 15094, 25732, -29828, -32663, -17746, -22868, 8625, -16670, -30260, -83330, -77658, -39017, -40718, -83895, -44961, -35512, -90832, -186405, -197619, -106753, -79116, -87925]
13800h7925O1113N3404J2363n280l4908o247J1682J403m4404m4391P1740K5409
13788A3959J0393k9023K4098j7015j2594m4929M2671O1729N1548L713k7383l3823
13776D3344j03230q078n3614N0429J21581K0823k5843M0538m1877m7237l5906
13765c9070K6070p045o3148P8919M453p600K812K3735L5013L1322J9700j04733
13753D28j09942P787N1465K1325K3301j9877l8191K2298L1984j8776L9930M0629
13741E2361K7686L7993j309m3249j06827J6542J567k5433K8461R276R616k020
13729D664j9453j1228J739l9786k7702L2666M334M9422J143M094n4128K7522k5767
13716e2480m9352J4736m3231o695M6613k3972M5977R3365R0387l1505p2320l2394
$$ y = [-87925, -26812, 26592, 38955, 33675, -1233, -7480, 4202, 5605, -38799, -83190, -11450, 13959, 24352, -4671, 19427, 2412, -10182, -55111, -12440, 49289, 100837, 104550, 77167, 43344, -59886, -67964, -121578, -71149, 50432, 71255, 45412, 85950, 44073, -3164, -39070, -13000, -20045, -83193, -4274, 179, -7421, -4609, 19126, 54139, 85461, 105161, 428, -109514, -101727, -50262, -28937, -5636, -25513, -63704, -41406, -9422, -28198, 11732, 52361, 80047, 118040, 116731, 73482, -33345, -16803, -15236, -40669, -12208, -2932, 6684, 4664, -14789, -26017, -24278, -64064, -91766, -59100, -54766, -5344, -4201, -107, -54235, -26713, -52480, -101832, -87096, -130327, -137022, -90409, -114381, -68404, 24961, 115348, 83843, 11523, -20871]
13704b0871m5856n0609K0476J07218L3547N798R834k4294j3563m1351L6706l9064
13692b2029K3046P9567O610o1699k5821M753n388L0837K2465m9001J6890j238
13680A8992n2787P372r019j2026j1044l6279q170Q772P6471j9593N735O5653L6392
13667G0469q1193r585K857R374j0602J5288M1765N338L7086N632j6158l0394l8788
13654A089r549p4924o5576j7249o69K6953K0333R8678M2828L2749J2021N469j0773
13641F1380l4595L0770n9129p7874p9478P1060M5499L0280q514R588l141l8755
13629e2909l0405P285L5092M3451P5519J4865o3610k6255K3658K3962j1055m1694
13617b096L1698O9053o4240r152J3890p1219j4063k7716j2406j3532K5569J2380
$$ y = [-20871, -66727, -117336, -96860, 10358, 43905, 49703, 59537, 35243, 21680, -19671, 17035, -22029, 1017, 80584, 87194, 25495, -326, 4427, -961, 29876, 52341, 3340, 20230, 18992, -33795, -26423, -35442, -47468, -58512, -94791, -102961, -94189, -17718, -37311, -31576, 34077, 70469, -10724, -20309, -17452, -8078, -18680, -3392, 38373, 43711, 80797, 86429, 70271, 39877, 1089, -8460, -83384, -148960, -166209, -166878, -139925, -119592, -20914, 21914, 54663, 66684, 72153, 61380, 26785, 57555, -1574, -79448, -158926, -87866, -42367, -12087, -20601, -11013, -14154, -52909, -83314, -76029, -40937, 2514, 78033, 92898, 29288, 3033, 26691, 50653, 39598, -2096, 29602, 98655, 34415, 25263, 39153, -32066, -46129, -73845, -86251, -99783, -74214, -61834]
13605f1834L0132P0976J8462k6618n7435J0490l1048O3043M7842R196L0523k1808
13593H1921m4405K2754M3510p0547m8236L0905N6385J5161r060n3979O0353j9359
13581F5403K621k6509m6647p795J7548P320O1966N441K2380L0100k4618k2408
13569H4802q8703J8628M5392J969n4084j15212l2219P3018q205p118K212p014
13557h6534M7015L0461O192L2038R6884L1378o8769k6969P056o7826l6264q804
13545d4142O74n601J8273R812L8354N997K661K4656p405n026o1264o187L431K3915
13531a852j7849J6096L9487J9905j781m3194k3194N3986Q36l4265n1036l0439
13519g3300o6255l2064N3562O8651K1544n0765P392P994j9169J486M7569L7037
$$ y = [-61834, -31702, 39274, 57736, 31118, -26317, -15827, -46875, 16168, 64010, 73206, 103729, 81921, 37516, 60270, 103780, 33233, -15003, 15902, 72287, 87448, 78388, 24409, 84762, 65403, 68024, 41515, -5132, -12927, 4621, 11941, 73907, 79348, 101728, 131828, 107210, 84802, -3901, 14727, 60119, 62088, 8004, -107208, -139427, -66409, -74614, -81732, -79520, -86534, -39519, -9058, -2866, 29172, 126056, 157434, 88665, 61696, 68752, 926, -35338, -44142, -43468, -49069, -30796, -20984, 17370, 23367, 26028, 50684, 43279, 38253, -23011, -29198, -25767, -1852, -19701, -3605, 35882, 55787, 54006, 10812, -12382, 41604, 42440, 8175, -42861, -73300, -139555, -171619, -118057, -49406, -27862, -78627, -71235, -63241, -82410, -80924, -33355, 3682]
13507C682O5195j0329m9147o4899n2037k1303J8851K2151M2280R5551K3790n6654
13495A7131k344j6062M6379l3423l669l4763K2937M2830K6257N3532k0992L400
13483A01213L9882n0542J5269j4874q135l4326n4038N6709k0897r0949K6943N4434
13471B0689L2833R948J92q1429p8047q381M6019M4892K9800o1765k5814R3002
13459B1939M9614p3666k7673J7811J7162L9069O5630m9275l6356k5042P7469M6556
13447A23238p9614o3947m843K012J6946J2689o1592k7245R4525L3316M8167P1919
13435A65571o4883j41762j4863R2262J0475q6657l0256L8222L4918M8597l3008
13424A8616j9657J5371R577m7003k5191o0478r8560P7848J12902Q5232j4262l6722
$$ y = [3682, 68877, 58548, 9401, -55498, -107535, -128838, -109987, -87836, -45556, 49995, 73785, 17131, 14787, -1275, 45104, 11681, 8012, -26751, -3814, 39016, 65273, 118805, 97813, 101213, 141095, 90553, 105822, 90948, 82813, 48487, -5551, 51158, 30261, -60688, -33745, 20689, 53522, 63470, 63662, -17767, -95814, -104195, -58176, -13284, 16516, -45249, -71063, 21939, 71553, -2113, -29786, -11975, 5187, 44256, 109886, 60611, 24255, -787, 76682, 123238, 43624, -20323, -25166, -23154, -6208, 6481, -55111, -82356, 12169, 45485, 93652, 165571, 100688, -41074, -55937, 36325, 46800, -39857, -70113, -31891, 3027, 51624, 18616, -1041, 14330, 23907, -23096, -48287, -108765, -207325, -129477, -16575, 68657, 54395, 17673]
13412A7673O697k5308p002k6443m5476k5381P5375k3814n8605j7730j5982n5251
13400b01247L1440O4964j4639M2115R661O4310j2525r3300k2579l0619j7602O0207
13388a19814N2586j3618O5508L5252n9205j5420J17963K0643j4454O35P913p7737
13376B52k4056K4850J8085j8687j2035N5494P4730J8835p1098J7594K2081J5587
13364A21632j4391l5432m1087q3143K8863J5144L998l2840k0239J1513j4936j8398
13352g9316n067K2339m6536p738o2066M5136L0254M5487O4594m6056J4399K1033
13340c537N8583J6508l5034m274O30J0401J5951M1179k6284L1115o281r3451o961
13327a455j006m0633K1411Q8775o4278n2344O7881R8965J5175o2161k2222K7977
$$ y = [17673, 24370, -938, -7940, -34383, -79859, -105240, -29865, -53679, -112284, -130014, -145996, -201247, -169807, -104843, -119482, -77367, -67706, -3396, -15921, -109221, -131800, -162419, -180021, -119814, -67228, -80846, -15338, 19914, -39291, -54711, 63252, 83895, 69441, 70076, 77989, 252, -23804, 1046, 19131, 444, -11591, 43903, 118633, 137468, 66370, 83964, 106045, 121632, 107241, 71809, 30722, -52421, -23558, -8414, -4416, -37256, -57495, -45982, -60918, -79316, -84383, -62044, -108580, -116318, -178384, -133248, -102994, -57507, 7087, -38969, -24570, -3537, 55046, 71554, 36520, 32246, 32876, 43277, 59228, 100407, 74123, 105238, 98957, 5506, -1455, -2461, -43094, -21683, 67092, 2814, -49530, 18351, 117316, 132491, 70330, 48108, 76085]
13315G6085M5996n2923o8085j3952k114J6443N7439m4088p5240j4413N3558j5655
13303c6949j783K8829P6445k8047k0593r2140l4042L4529P2470K6317J5707K5518
13291F6261K7857l9545j5089j2563k2916m296M4776J09702J1191j36955n6048
13280b7625o982K8704M5620j6917n897R053n1640l7334K6292N9395l3879m6702
13268e7912j9321N31J8307J31018j1536o7392J4874J08914J5783n1318n8898k8682
13256e632j7917J5405K275K4825J891o808p685k9046k7817j1297p3115L982K868
13243a28071L8609N8653N7579j4867j2576N5228r766n5199j4756J1827k2790l8069
13231g4198K3895j3766K283r229l2132M2541N3669j314p618N6108P679r0543q5955
$$ y = [76085, 122081, 69158, 1073, -12879, -14993, 1450, 58889, 14801, -60439, -74852, -21294, -36949, -38732, -9903, 66542, 38495, 17902, -74238, -108280, -73751, -1281, 25036, 40743, 66261, 94118, 54573, 39484, 26921, 4005, -291, 44485, 154187, 165378, 28423, -27625, -34607, -5903, 39717, 22800, 16903, 25956, -25684, -63018, -36726, 22669, -11210, -57912, -77233, -76702, -58395, 72623, 61087, -6305, 8569, 117483, 133266, 81948, 23050, -5632, -23549, -8144, -5869, 18956, 20847, 14039, 6354, -22692, -50509, -61806, -134921, -130939, -128071, -89462, -30809, 26770, 11903, -673, 54555, 44789, -10410, -25166, -13339, -36129, -74198, -50303, -64069, -61786, -71015, -103147, -60606, -6937, -8251, -15869, 40239, 47918, -42625, -128580]
13218a28580L6900J5721O4988K9059k3786J6843M760j7989k1314l5622K0454k527
13206d1093J5321M2704K8320k2974m1528m1263M414O370J2529Q3630L6500m1987
13194D0943l5225N3466N4498O40k7570m5345j12258l0005N9370J473J0483N6525
13182B6995R04m8808k9729P85P7965M3098l0235k0199J7832K7519k1885l4367
13170I875K8079O502k2018o5847P816P6138N9795m6064o6052k1051j5883n5398
13158a04108m830N4933M1854J1597M4906r220K7394j2234Q43N8649q773k2353
13146G8658o185p0584j6299N4268O6313L5304l0510m3909q5601k0894L4263L0639
13134B5463J2177l5468j9729M9108M024K6593J1953K8669o1137m3996M1547k1329
$$ y = [-128580, -91680, -75959, -10971, 18088, -5698, 11145, 15905, -2084, -23398, -59020, -38566, -41093, -25772, 16932, 45252, 22278, -19250, -60513, -56099, -49729, -37200, 46430, 82930, 40943, 5718, 59184, 113682, 114322, 86752, 41407, -70851, -100856, -41486, -40013, -29530, 26995, 27899, -20909, -50638, -49853, 28112, 71210, 40975, 20776, 38608, 66127, 44242, 9875, 37954, 44456, 22438, -43409, -35593, 40545, 100340, 54276, -11776, -32827, -48710, -104108, -108938, -54005, -12151, -554, 44352, 35132, 62526, 50292, 51135, 109784, 101011, 78658, 72473, 1889, -14410, 39858, 106171, 141475, 110965, 67056, -18545, -39439, -5176, 25463, 37640, 2172, -17557, 31551, 35575, 62168, 74121, 102790, 41653, -2343, 39204, 17875]
13122A7875j0693n21J1587p274k5345o859q613r3120J04344J04805N8829n828
13110A39187q4138j1465n568J3205j7657k9612j2158k2971k7263L0616r072P4746
13098C7850O3010J2704n9450j1689o408n7041j1081M517n8871j583l379j9591
13086a11012R034N2678K6839M6032J371k3683m0908o3048l556L8199P1645l3163
13074b9572p8024K9870N8580q0190r0372J889N2569k1778k173j2468N2990Q2544
13062c6135L7771p3327l1310M7492P1292L8267j7208k823K9965K2304J8357J8781
13050A23426n7420q1536j3031l8555L3993J5964m0217j4039L9429P3531N139j4332
13038C2352l20j8760p0800J5684K103L8490L497l3935j9751R7956N680l411p9972
$$ y = [17875, 7182, 6661, 18248, 10974, -14371, -21230, -29843, -122963, -18619, 86186, 145015, 139187, 55049, 43584, 38016, 51221, 33564, 3952, -8206, -31177, -58440, -27824, -36896, 37850, 100860, 113564, 54114, 42425, 36017, -21024, -32105, -27588, -86459, -88042, -91421, -111012, -101978, -49300, -22461, 23571, 24942, 1259, -39649, -102697, -106253, -68054, 3591, -29572, -107596, -77726, -19146, -99336, -189708, -187819, -135250, -157028, -159201, -171669, -118679, -36135, 1636, -71691, -103001, -55509, 15783, 54050, 36842, 34019, 63984, 86288, 104645, 123426, 66006, -15530, -28561, -67116, -33123, -17159, -57376, -71415, -31986, 41545, 46684, 32352, 32032, 13272, -57528, -41844, -39741, -1251, 2246, -31689, -51440, 46516, 52196, 48785, -31187]
13025c1187o7498J9708J0281L0009j2734L7161p850O7907Q0265p5751j01751N4826
13013C386O893J3208L3794j9985n8283j7524N5502l2064J138n3658q5894M1575
13001a11912L4332l1996O9676R2717L599N0281k5527l8199K6144Q01Q665J9263
12989I7844L3525o3013J9714j0724p646k1373j0712n1363l4292o9619m8113R241
12977a56531N4399O0809k5901j325J6328j1143l7240m3807o998O6419P360K8418
12965d9212J18110O6048q0421o3464J7795k3704p4096p8142o8518Q9118J12277
12954c4209N4461J6902m9894l2253l4375L9315L3946o3601R030M4736L8453o4506
12942d1995k4892M1203N4427q191j3455J7282K1836J7470j0052m4080L4767Q8641
$$ y = [-31187, -98685, -78977, -68696, -38687, -51421, -14260, -22110, 45797, 126062, 50311, -51440, 3386, 10279, 23487, 57281, 37296, -20987, -38511, 16991, -15073, -13935, -67593, -153487, -111912, -77580, -109576, -39900, 52817, 56416, 106697, 81170, 42971, 69115, 69916, 78581, 97844, 131369, 68356, 88070, 77346, 69700, 48327, 37615, -13748, -48040, -117659, -165772, -156531, -102132, -41323, -67224, -68549, -52221, -63364, -100604, -144411, -151409, -84990, -77630, -49212, 68898, 134946, 54525, -8939, 8856, -14848, -88944, -167086, -235604, -146486, -34209, 20252, 37154, -12740, -44993, -79368, -40053, -6107, -69708, -60678, -15942, 22511, -41995, -66887, -25684, 28743, 20552, 7097, 24379, 46215, 63685, 53633, 9553, 44320, 132961]
12930A32961k3405m7665Q370m5031p6443j6286O5983J00073p1470k5163r650j1302
12918a9028M1387J0907o2731j599N8393K3410m7081N2441K1726l0519k9381k3255
12906e330M768o7618j0337O3758K1741p8381n6770K7169R5221n365L1804q708
12894A1952n8873j5857K7759j3127J2743L5964l9868k5350k1578J431M1334k0296
12882f3766n50K3504l01m0633j0005K7171m8606j151O9130P2072m81k0157o4377
12869e8150p172m6085p59K7791k3284J2490O1723K5546j8231l5832P6844M65j9785
12856d439j331q889K2751K1486m4893q469M4936j9914l9637K989J1617J0044O3191
12843D9442o128N2709k6163N3228j5533l7969K1362L8336J042l976O077k5410
$$ y = [132961, 109556, 61891, 70261, 25230, -51213, -67499, -1516, 98557, 27087, 1924, -7726, -19028, 22359, 33266, -29465, -31064, 27329, 50739, 3658, 56099, 77825, 47306, 17925, -5330, -562, -68180, -78517, -14759, 6982, -71399, -128169, -101000, -5779, -11144, 20660, 11952, -46921, -62778, -35019, -48146, -35403, 561, -39307, -64657, -86235, -84804, -43470, -63766, -64316, -40812, -41113, -81746, -91751, -64580, -113186, -114337, -45207, 26865, 26384, 6227, -58150, -65322, -111407, -112166, -84375, -107659, -95169, -33446, -7900, -26131, -61963, 14881, 15346, -4439, -5770, -14659, 8092, 29578, -15315, -23784, 21152, 1238, -38399, -35410, -23793, -13749, 49442, 43314, 96023, 69860, 123088, 107555, 69586, 90948, 129284, 130326, 126350, 132427, 107017]
12831A07017l0487o8421n1754R02m6131m9875L7585J14285N1241J2062r874Q440
12819G4990k5665M187j550l0140p0896q0518M4901J03162O5646n1297j1915L6790
12807E7695l1042m8127l8241O570N5580L873K5919k2916o6348K693L2430K7569
12795E655m8154n939n287N768L1948j212R71P4215L9782m7212q5905m5770O4696
12782a6444R6321M3402q1251k0517K9656l2887k10l418l5735j9399O6752j2249
12770A4021l8600o0984J4076j9694L1019O8520o810l2062M790N1655m430n9383
12758c7882j1280J9398n1153j0899O866K2825M3323K224L044j7469O775l5571
12746e9799k018J05079O0418L4839j9287n2036m8441J1123M1552r088l161j0915
$$ y = [107017, 76530, 8109, -43645, -42743, -88874, -138749, -101164, 13121, 64362, 76424, 66550, 74990, 49325, 53512, 51962, 21822, -49074, -129592, -84691, 18471, 84117, 32820, 20905, 57695, 26653, -21474, -59715, -53145, 2435, 6308, 32227, 9311, -57037, -54344, -21914, 5655, -42499, -48438, -53725, -47957, -16009, -17221, -16250, 57965, 97747, 50535, -35370, -81140, -16444, 79877, 123279, 42028, 21511, 51167, 18280, 18070, 14652, -21083, -40482, 26270, 14021, -24579, -85563, -71487, -91181, -60162, 8358, 1548, -30514, -25724, 25931, 21501, -37882, -49162, -29764, -80917, -91816, -84950, -62125, -18802, -16578, -13534, -31003, -24228, -59799, -61817, 43262, 103680, 138519, 119232, 67196, 18755, 29878, 71430, 62342, 59181, 48266]
12734D8266m5100l5607j48M1232M384j6650L154m3542m3428O9024L5027l628m1397
12721b8413l5917N0800N1253P1134k5210l6446o7427o1253N5982O6728j2238p6061
12709d7068K0723J39865P5193j28549o2557K107j8184L8554K0114K5698l124k3334
12697C9438R145L6042n0442m1657j928l691M907L8545j4537Q806l3245n0104k9125
12684h7846K4990j0129N6068N6484m2515Q8588j7431k8380L4848k4322j8977m9037
12672a7659o3123j1220K9960K0668K5052J7934M0464J0127j7500j6552J0275o6088
12660c7662k6903m1942N2586O0998K9052m5599k5877J2832J2154M400K4681N4021
12648G2741k5494l1695J0696k9051j1721M0054p187j10571J4796O0989R470o824
$$ y = [48266, 3166, -32441, -32589, 8643, 13027, -3623, -469, -44011, -87439, -18415, 16612, 12984, -28413, -64330, -13530, 37723, 108857, 83647, 47201, -20226, -81479, -25497, 41231, 28993, -47068, -26345, 113520, 188713, 60164, -2393, -286, -18470, 20084, 40198, 65896, 62772, 39438, 48583, 84625, 34183, -7474, -9402, -13093, -8186, 30359, 15822, 24628, -8617, -58721, -87846, -62856, -72985, -16917, 39567, -2948, 85640, 68209, 39829, 74677, 50355, 31378, -17659, -80782, -92002, -62042, -41374, -16322, 1612, 42076, 52203, 34703, 18151, 28426, -37662, -64565, -106507, -53921, 7077, 36129, -9470, -35347, -22515, -10361, -5961, 18720, 72741, 47247, 15552, 26248, -2803, -14524, 25530, 18343, -92228, -77432, -16443, -6973, -13797]
12636a3797J5533N4380K9828k6700p5329J2646p088K6071k498J2113K3246k7165
12624B1240o4987N16J2781K1414M0959N5523Q702j6608j4383j7998j1004l5138
12612A017l6568k5615K7713M928J0161J5549m414Q992M9294K6960r731l2748J9178
12599E4716P5277L1961o0445m7994n4306L383m920j9710K5557q967o5904n7425
12587a28777Q1506k6676j9759O6541J7276l2148j1045J9673K2382j0210l0129
$$ y = [-13797, 1736, 56116, 85944, 59244, -16085, -3439, -10527, 15544, 13046, 25159, 48405, 21240, -43747, -43231, -30450, -9036, 31923, 87446, 96148, 79540, 65157, 47159, 36155, 1017, -35551, -61166, -33453, -28525, -18364, -2815, -7229, 1763, 51057, 78017, 68286, 35538, 54716, 129993, 161954, 101509, 53515, -791, 2592, -2328, -22038, 3519, -5448, -71352, -128777, -47271, -73947, -93706, -27165, -9889, -42037, -53082, -33409, -11027, -21237, -51366]
$$ [...]
##END NTUPLES=NMR SPECTRUM
##END=
