##TITLE=Analysis number 321256
Compound Code rh 01025
Project Code adrs
Chemist Name cyclan
##JCAMPDX= 6.0         $$ Bruker NMR JCAMP-DX V2.0
##DATA TYPE= NMR SPECTRUM
##DATA CLASS= NTUPLES
##ORIGIN= Bruker BioSpin GmbH
##OWNER= nmr
$$ XWIN-NMR		Version 3.5
$$ Tue Aug  1 13:03:57 2006 GMT Daylight Time (UT+1h)  MAYBRIDGE\nmr@NMR_250MHZ
##.OBSERVE FREQUENCY= 250.131544655141
##.OBSERVE NUCLEUS= ^1H
##.ACQUISITION MODE= SIMULTANEOUS (DQD)
##.ACQUISITION SCHEME= undefined
##.AVERAGES= 16
##.DIGITISER RES= 18
##SPECTROMETER/DATA SYSTEM= dpx250
##.PULSE SEQUENCE= zg30
##.SOLVENT NAME= DMSO
##.SHIFT REFERENCE= (INTERNAL, DMSO, 0, 16.522)
##AUDIT TRAIL= $$ (NUMBER, WHEN, WHO, WHERE, WHAT)
$$ ##TITLE= Audit trail, XWIN-NMR		Version 3.5
$$ ##JCAMPDX= 5.01
$$ ##ORIGIN= Bruker BioSpin GmbH
$$ ##OWNER= nmr
$$ C:\u/data/dgb/nmr/ADRS/20/pdata/1/auditp.txt
$$ ##AUDIT TRAIL=  $$ (NUMBER, WHEN, WHO, WHERE, WHAT)
(   1,<2006-08-01 13:03:37.56 +100>,<MAYBRIDGE\nmr>,<NMR_250MHZ>,
      <created by zg, POWCHK disabled, PULCHK disabled
       configuration hash MD5:
       E2 DF 36 D8 04 B2 41 60 5A D7 A3 38 5A 4B D0 FE
       data hash MD5: 64K
       19 EC 91 1D 32 10 01 5E CC 7E 29 98 14 C9 8F 41>)
(   2,<2006-08-01 13:03:48.97 +100>,<MAYBRIDGE\nmr>,<NMR_250MHZ>,
      <Start of raw data processing
       ef LB = 0.3 FT_mod = 6 PKNL = 1 SI = 32K 
       data hash MD5: 32K
       D4 85 1B 82 72 92 EC CE 80 81 E4 C7 BD 6C 36 4F>)
(   3,<2006-08-01 13:03:50.67 +100>,<MAYBRIDGE\nmr>,<NMR_250MHZ>,
      <apk 
       data hash MD5: 32K
       B4 9A AC 53 4C 5A D2 C3 76 23 AA 7B 5C C8 4C 82>)
(   4,<2006-08-01 13:03:51.43 +100>,<MAYBRIDGE\nmr>,<NMR_250MHZ>,
      <abs ABSG = 5 
       data hash MD5: 32K
       CE E2 DA FC 94 21 13 ED 6A 11 BC C6 A1 89 95 6B>)
$$ ##END=
$$ 
$$ hash MD5
$$ E7 9D 28 A3 BE 12 FB 3B 48 49 4F 87 47 F1 7C 1D
##$RELAX= 
##$RELAX= 
##$RELAX= 
##$RELAX= 
##$RELAX= 
##$RELAX= 
##$RELAX= 
$$ Bruker specific parameters
$$ --------------------------
##$DU= <C:\u>
##$EXPNO= 20
##$NAME= <ADRS>
##$PROCNO= 1
##$TYPE= <nmr>
##$USER= <dgb>
##$AMP= (0..31)
100 100 100 100 100 100 100 100 100 100 100 100 100 100 100 100 100 100 
100 100 100 100 100 100 100 100 100 100 100 100 100 100 
##$AQSEQ= 0
##$AQ_mod= 3
##$AUNM= <au_zg>
##$AUTOPOS= <47 >
##$BF1= 250.13
##$BF2= 250.13
##$BF3= 250.13
##$BF4= 250.13
##$BF5= 500.13
##$BF6= 500.13
##$BF7= 500.13
##$BF8= 500.13
##$BYTORDA= 1
##$CFDGTYP= 0
##$CFRGTYP= 5
##$CHEMSTR= <none>
##$CNST= (0..31)
1 1 145 1 1 1 1 1 1 1 1 1 1 1 1 1 1 1 1 1 1 1 1 1 1 1 1 1 1 1 1 1 
##$CPDPRG= <>
##$CPDPRG1= <>
##$CPDPRG2= <>
##$CPDPRG3= <>
##$CPDPRG4= <mlev>
##$CPDPRG5= <mlev>
##$CPDPRG6= <mlev>
##$CPDPRG7= <mlev>
##$CPDPRG8= <mlev>
##$CPDPRGB= <>
##$CPDPRGT= <>
##$D= (0..31)
0 1 0 0 0 0 0 0 0 0.06 0 0 0 0 0 0 0.0002 0 0 0 0 0 0 0 0 0 0 0 0 0 0 
0 
##$DATE= 1154433816
##$DBL= (0..7)
120 120 120 120 120 120 120 120 
##$DBP= (0..7)
150 150 150 150 150 150 150 150 
##$DBP07= 0
##$DBPNAM0= <>
##$DBPNAM1= <>
##$DBPNAM2= <>
##$DBPNAM3= <>
$$ [...]
##$SUBNAM7= <"">
##$SUBNAM8= <"">
##$SUBNAM9= <"">
##$SW= 20.6930455092707
##$SWIBOX= (0..15)
0 0 3 0 0 0 0 0 0 0 0 0 0 0 0 0 
##$SW_h= 5175.983436853
##$TD= 65536
##$TD0= 1
##$TE= 295.16
##$TE2= 300
##$TE3= 300
##$TEG= 300
##$TL= (0..7)
0 120 120 120 120 120 120 120 
##$TP= (0..7)
150 150 150 150 150 150 150 150 
##$TP07= 0
##$TPNAME0= <>
##$TPNAME1= <>
##$TPNAME2= <>
##$TPNAME3= <>
##$TPNAME4= <>
##$TPNAME5= <>
##$TPNAME6= <>
##$TPNAME7= <>
##$TPOAL= (0..7)
0.5 0.5 0.5 0.5 0.5 0.5 0.5 0.5 
##$TPOFFS= (0..7)
0 0 0 0 0 0 0 0 
##$TUNHIN= 0
##$TUNHOUT= 0
##$TUNXOUT= 0
##$USERA1= <user>
##$USERA2= <user>
##$USERA3= <user>
##$USERA4= <user>
##$USERA5= <user>
##$V9= 5
##$VALIST= <valist>
##$VCLIST= <CCCCCCCCCCCCCCC>
##$VD= 0
##$VDLIST= <DDDDDDDDDDDDDDD>
##$VPLIST= <PPPPPPPPPPPPPPP>
##$VTLIST= <TTTTTTTTTTTTTTT>
##$WBST= 1024
##$WBSW= 4
##$XGAIN= (0..3)
0 0 0 0 
##$XL= 0
##$YL= 0
##$YMAX_a= 488717
##$YMIN_a= -423637
##$ZGOPTNS= <>
##$ZL1= 120
##$ZL2= 120
##$ZL3= 120
##$ZL4= 120
##$ABSF1= 16.522
##$ABSF2= -4.171173
##$ABSG= 5
##$ABSL= 3
##$ALPHA= 0
##$AQORDER= 0
##$ASSFAC= 0
##$ASSFACI= 0
##$ASSFACX= 0
##$ASSWID= 0
##$AUNMP= <proc_1d>
##$AZFE= 0.1
##$AZFW= 0.1
##$BCFW= 0
##$BC_mod= 0
##$BYTORDP= 0
##$COROFFS= 0
##$CY= 12.5
##$DATMOD= 1
##$DC= 0
##$DFILT= <>
##$DTYPP= 0
##$F1P= 14.0000005364418
##$F2P= -0.99999901652339
##$FCOR= 0.5
##$FTSIZE= 32768
##$FT_mod= 6
##$GAMMA= 0
##$GB= 0
##$INTBC= 1
##$INTSCL= 1
##$ISEN= 128
##$LB= 0.3
##$LEV0= 0
##$LPBIN= 0
##$MAXI= 10000
##$MC2= 0
##$MEAN= 0
##$ME_mod= 0
##$MI= 0
##$NCOEF= 0
##$NC_proc= -5
##$NLEV= 6
##$NOISF1= 0
##$NOISF2= 0
##$NSP= 0
##$NTH_PI= 0
##$NZP= 0
##$OFFSET= 16.522
##$PC= 1
##$PHC0= 133.9159
##$PHC1= 2.939174
##$PH_mod= 1
##$PKNL= yes
##$PPARMOD= 0
##$PSCAL= 4
##$PSIGN= 0
##$REVERSE= no
##$SF= 250.13
##$SI= 32768
##$SIGF1= 0
##$SIGF2= 0
##$SINO= 400
##$SIOLD= 32768
##$SREGLST= <1H.DMSO>
##$SSB= 0
##$STSI= 32768
##$STSR= 0
##$SW_p= 5175.98343685301
##$SYMM= 0
##$S_DEV= 0
##$TDeff= 65536
##$TDoff= 0
##$TI= <Analysis number 999999
Compound Code 99
Book Reference 9
Project Code 9>
##$TILT= no
##$TM1= 0
##$TM2= 0
##$TOPLEV= 0
##$USERP1= <user>
##$USERP2= <user>
##$USERP3= <user>
##$USERP4= <user>
##$USERP5= <user>
##$WDW= 1
##$XDIM= 32768
##$YMAX_p= 468807523
##$YMIN_p= -313478
$$ End of Bruker specific parameters
$$ ---------------------------------
##NTUPLES= NMR SPECTRUM
##VAR_NAME=  FREQUENCY,     SPECTRUM/REAL,   SPECTRUM/IMAG
##SYMBOL=    X,             R,               I
##VAR_TYPE=  INDEPENDENT,   DEPENDENT,       DEPENDENT
##VAR_FORM=  AFFN,          ASDF,            ASDF
##VAR_DIM=   32768,         32768,           32768
##UNITS=     HZ,            ARBITRARY UNITS, ARBITRARY UNITS
##FACTOR=    0.157963299565203, 1,           1
##FIRST=     4132.6476996994, 0,             0
##LAST=      -1043.33573715361, 0,           0
##MIN=       -1043.33573715361, -313478,     0
##MAX=       4132.6476996994, 468807523,     0
$$ Real data points
##PAGE= N=1
##DATA TABLE= (X++(R..R)), XYDATA
$$ [...]
$$ plain form
14774 -60626 -44100 -32242 11729 24540 54445 65281 56599 54576 25035 14887 -71261 -95089
14762 -95089 -114065 -90066 -25126 4977 51952 -4269 -93224 -163781 -145198 -125362 -93035 -58545
14750 -58545 -5482 7036 -5775 22872 -9354 13540 35121 -35157 -72894 35869 53534
14739 53534 -4676 29725 58212 9219 -96010 -52210 3147 -42134 -37234 42493 -32528 -18208
14727 -18208 20788 -34378 -55869 -34797 -67857 -46880 -57179 -187063 -203861 -113958 -113852 -40772
14715 -40772 44732 -12256 -27701 -57496 -95889 -41918 -36106 -68442 -51024 -61906 -15302 36584
14703 36584 44576 52810 36691 -19858 -7245 -28167 -15784 -37570 -4482 63235 28732 -51526
14691 -51526 -22238 -48217 -126542 -145205 -94241 38139 120361 72210 35032 -83463 -109593
$$ packed form
14774f0626J6526J1858M3971J2811K9905J0836q682k023k9541j0148q6148k3828
14762i5089j8976K3999O4940L0103M6975n6221q8955p0557J8583J9836L2327L4490
14750e8545N3063J2518j2811K8647l2226K2894K1581p0278l7737J08763J7665
14739E3534n8210L4401K8487m8993j05229M3800N5357m5281M900P9727p5021J4320
14727a8208L8996n5166k1491K1072l3060K0977j0299j29884j6798Q9903J06P3080
14715d0772Q5504n6988j5445k9795l8393N3971N812l2336J7418j0882M6604N1886
14703C6584P992Q234j6119n6549J2613k0922J2383k1786L3088O7717l4503q0258
14691e1526K9288k5979p8325j8663N0964J32380Q2222m8151l7178j18495k6130
$$ plain form
14680 -109593 -105095 -99428 -139132 -191434 -154351 -119420 -96176 -49578 -67885 -47031 -22139 -13511
14668 -13511 -64245 -60402 -24129 -17349 22949 98108 113842 -51232 -125040 -53716 36486 46245
14656 46245 9273 -15611 31909 12021 -33095 1742 29407 -54919 -65727 -42471 -35814 -63175
14644 -63175 -35041 -40875 -18659 15781 -43568 -3605 -12242 -40740 -24973 -19696 -29899 -44560
14632 -44560 -64798 -84545 -20295 38576 -4745 -36791 2237 18026 5759 -682 -9921 -71550
14620 -71550 -86798 -32548 -5372 52820 27369 -15964 -92892 -114333 -30502 -4041 48194 -13977
14608 -13977 -90423 -70670 -25277 44560 20592 -4675 -19494 32756 73469 44617 29858 47740
14596 47740 19062 -5580 7839 -25160 -33009 -13886 -97131 -122609 -125401 -144799 -164942 -181129
$$ packed form
14680a09593M498N667l9704n2302L7083L4931K3244M6598j8307K0854K4892Q628
14668a3511n0734L843L6273O780M0298P5159J5734j65074p3808P1324R0202R759
14656D6245l6972k4884M7520j9888m5116L4837K7665q4326j0808K3256O657k7361
14644f3175K8134n834K2216L4440n9349L9963q637k8498J5767N277j0203j4661
14632d4560k0238j9747O4250N8871m3321l2046L9028J5789j2267o441r239o1629
14620g1550j5248N4250K7176N8192k5451m3333p6928k1441Q3831K6461N2235o2171
14608a3977p6446J9753M5393O9837k3968k5267j4819N2250M0713k8852j4759J7882
14596D7740k8678k4642J3419l2999p849J9123q3245k5478k792j9398k0143j6187
$$ plain form
14584 -181129 -128837 -102141 -59809 -18322 -12976 7345 7699 25402 3165 -8346 33120 39750
14572 39750 51191 12167 109146 146843 133660 105224 122785 97820 328 -23012 36400 50467
14560 50467 51616 60422 -1913 14534 23520 18459 4455 -43791 -92847 -89882 -61443 -53146 -32527
14547 -32527 -60862 -92262 -115956 -82964 7563 -13559 6932 57344 48579 -732 4274 2662
14535 2662 9959 -73652 -130395 -5731 53259 646 33037 15520 -42201 -50016 -53692 -9108
14523 -9108 34874 18645 -30604 -43917 36110 106895 101672 -28870 -5656 -3014 -48108 -46069
14511 -46069 -47085 -45557 -28153 1066 18897 -22004 -22758 -24385 32699 79912 94095 55561 10915
14498 10915 5426 -30108 -53990 -12883 -32843 -18166 14096 57524 31415 26239 48996 -40182
$$ packed form
14584a81129N2292K6696M2332M1487N346K0321L54J7703k2237j1511M1466O630
14572C9750J1441l9024R6979L7697j3183k8436J7561k4965r7492k3340N9412J4067
14560E0467J149Q806o2335J6447Q986n061j4004m8246m9056K965K8439Q297K0619
14547c2527k8335l1400k3694L2992R0527k1122K0491N0412q765m9311N006j612
14535B662P297q3611n6743J24664N8990n2613L2391j7517n7721p815l676M4584
14523i108M3982j6229m9249j3313Q0027P0785n223j30542K3214K642m5094K039
14511d6069j016J528J7404K9219J7831m0901p54j627N7084M7213J4183l8534m4646
14498A0915n489l5534k3882M1107j9960J4677L2262M3428k6109n176K2757q9178
$$ plain form
14486 -40182 -97998 -60215 -48901 -79565 -25487 1039 41823 37276 18845 1214 4560 -39575
14474 -39575 -12870 -17826 -4177 60365 110059 138529 78085 1492 -23611 18393 10989 14859
14462 14859 -34827 -44368 -59801 -30348 46052 141399 179718 80113 86557 88294 87316 66904 16152
14449 16152 15791 -16082 -32632 3434 -32966 -62792 -24785 -7056 32733 101587 76159 13878
14437 13878 -60494 -48684 -11210 47386 11832 -37647 -20977 87810 158971 152326 102445 7851
14425 7851 -55963 -123550 -81949 -9259 -14282 -12601 -28020 -59622 -131376 -111199 9865 30596
14413 30596 -8757 -53102 -50996 -32053 14503 59127 34349 54877 33323 23544 75324 43067
14401 43067 -1248 -78372 -116072 -91685 -82356 -107600 -108951 -118895 -95472 -22885 -2403 -27665
$$ packed form
14486d0182n7816L7783J1314l0664N4078K6526M0784m547j8431j7631L346m4135
14474c9575K6705m956J3649O4542M9694K8470o0444p6593k5103M2004p404L870
14462A4859m9686r541j5433K9453P6400R5347L8319r9605O444J737r78k0412n0752
14449A6152l61l1873j6550L6066l6400k9826L8007J7729L9789O8854k5428o2281
14437A3878p4372J1810L7474N8596l5554m9479J6670J08787P1161o645m9881r4594
14425G851o3814o7587M1601P2690n023J681j5419l1602p1754K0177J21064K0731
14413C0596l9353m4345K106J8943M6556M4624k4778K0528k1554r779N1780l2257
14401D3067m4315p7124l7700K4387R329k5244j351r944K3423P2587K0482k5262
$$ plain form
14389 -27665 16288 -35396 -22918 -55276 -71900 -56554 3421 13674 -28545 -59082 19042 1555
14377 1555 -7352 80097 87725 87700 111988 115602 49689 -18714 -82420 -77461 -129362 -125676 -57479
14364 -57479 -50608 -83119 -141579 -163550 -187344 -147502 -85325 -129754 -153999 -94806 -107982 -87588
14352 -87588 -15718 24556 -14852 -36791 -20466 40101 41618 -45322 -66485 -77482 -62099 -95367
14340 -95367 -82415 -108582 -59049 -23482 1972 7795 -38255 -68346 -21964 -6197 -58653 -115623
14328 -115623 -106644 -21016 51483 75325 31635 10735 32820 49385 49346 53123 -37768 -35728 36742
14315 36742 -59840 -136035 -177222 -204392 -116404 -17073 6890 13121 4831 -11822 -36718 -7925
14303 -7925 26112 -40997 -57091 -71077 -22440 -61467 -95622 -65110 28587 -9363 -283 67048
$$ packed form
14389b7665M3953n1684J2478l2358j6624J5346N9975J0253m2219l0537P8124j7487
14377A555q907Q7449P628k5K4288L614o5913o8403o3706M959n1901L686O8197
14364e7479O871l2511n8460k1971k3794L9842O2177m4429k4245N9193j3176K0394
14352h7588P1870M0274l9408k1939J6325O0567J517q6940k1163j0997J5383l3268
14340i5367J2952k6167M9533L5567K5454N823m6050l0091M6382J5767n2456n6970
14328a15623Q979Q5628P2499K3842m3690k0900K2085J6565l9L777r0891K040P2470
14315C6742r6582p6195m1187k7170Q7988R9331K3963O231q290j6653k4896K8793
14303g925L4037o7109j6094j3986M8637l9027l4155L0512R3697l7950R080O7331
$$ plain form
14291 67048 29390 22744 -37435 4029 117571 106758 -21808 -61518 -35725 68066 88070
14280 88070 -56884 -111510 -77301 -50036 -32931 -50300 -54206 -11973 63322 46120 -46867 -63540
14268 -63540 -17103 -86124 -92116 -110442 -104073 -64429 -78487 -64473 -74012 6391 -14761 -62497
14256 -62497 -48413 -51640 -59140 -23298 21223 15664 -11490 -18231 17541 13262 39264 -7252 -82251
14243 -82251 -56546 -38681 -9090 -8014 -33366 36597 27382 -28364 -41955 -53953 -52529 -90857
14231 -90857 -58359 21994 32051 37426 25165 21545 7785 -107522 -114245 -43979 15537 79176
14219 79176 44298 35261 -26941 1797 7479 -27869 -44726 -3640 -1400 -29339 -30478 40096
14207 40096 31683 -35654 -40914 -43477 -95803 -127171 -110245 -58688 -13174 -19103 -40676 -35339 -28924
$$ packed form
14291F7048l7658o646o0179M1464J13542j0813j28566l9710K5793J03791K0004
14280H8070j44954n4626L4209K7265J7105j7369l906M2233P5295j7202r2987j6673
14268f3540M6437o9021n992j8326O369L9644j4058J4014r539Q0403k1152m7736
14256f2497J4084l227p500L5842M4521n559k7154o741L5772m279K6002m6516p4999
14243h2251K5705J7865K9591J076k5352O9963r215n5746j3591j1998J424l8328
14231i0857L2498Q0353J0057N375j2261l620j3760j15307o723P0266N9516O3639
14219G9176l4878r037o2202K8738N682l5348j6857M1086K240k7939j139P0574
14207D0096q413o7337n260k563n2326l1368J6926N1557M5514n929k1573N337O415
$$ plain form
14194 -28924 -48484 -84334 -91198 -109494 -144774 -118659 -114469 -137750 -44319 -80071 -134463 -95137
14182 -95137 -80711 52751 101249 23313 -27756 28474 37612 -19642 -28589 -70685 3157 -4431
14170 -4431 -71128 -93930 -157351 -191726 -164929 -178776 -72787 -40183 -76348 -31022 -1869 104361
14158 104361 118705 154445 80100 -36683 -37853 -7223 16002 -66778 -70989 829 -15783 -46156
14146 -46156 -51222 -35076 -3895 33423 -20935 -30299 10421 40185 1879 -6627 11659 34075
14134 34075 -84415 -131397 -89880 38673 94822 -15309 -59735 -55002 -34867 -81140 -96921
14123 -96921 -56266 -40039 139 20770 10110 325 -9432 -38953 -11816 15591 -17154 -2364
14111 -2364 13447 34195 -1339 75759 97242 38142 48965 -25920 -95986 -66897 9714 35320
$$ packed form
14194b8924j9560l5850o864j8296l5280K6115M190k3281R3431l5752n4392L9326
14182i5137J4426J33462M8498p7936n1069N6230R138n7254q947m2096P3842p588
14170d431o6697k2802o3421l4375K6797j3847J05989L2604l6165M5326K9153J06230
14158A04361J4344L5740p4345j16783j170L0630K3225q2780m211P1818j6612l0373
14146d6156n066J6146L1181L7318n4358r364M0720K9764l8306q506J8286K2416
14134C4075j18490m6982M1517J28553N6149j10131m4426M733K0135m6273j5781
14123i6921M0655J6227M0178K0631j0660r785r757k9521K7137K7407l2745J4790
14111b364J5811K0748l5534P7098K1483n9100J0823p4885p0066K9089P6611K5606
$$ plain form
14099 35320 -26867 -15479 30418 49245 -31784 -40721 -522 23128 38217 6391 -16656 -10274
14087 -10274 -34238 -38908 -116154 -126089 -37982 -20256 -7086 -13982 -44340 -56972 -41958 394
14075 394 11978 -1816 33031 18095 1200 -11796 22020 -28481 -25580 -58779 -54786 -85871
14063 -85871 -24844 3923 -15674 -30370 -15190 41513 69997 13364 -33963 -100451 -146897 -90741
14051 -90741 26977 102172 77863 -51281 -105515 -88461 -69617 -62258 -48923 -38644 -40676 -8859
14039 -8859 18054 65067 66664 71292 17653 -5263 10270 1814 37779 19431 -68254 -77196 -72983
14026 -72983 -53904 -1871 -11682 13679 -19141 32080 51174 75213 -30677 -6041 45054 -43663
14014 -43663 -1301 27747 -33983 -46971 -40388 -98637 -109099 -57314 57631 60528 35985 77112
$$ packed form
14099C5320o2187J1388M5897J8827q1029q937M0199K3650J5089l1826k3047O382
14087a0274k3964m670p7246r935Q8107J7726J3170o896l0358j2632J5014M2352
14075C94J1584j3794L4847j4936j6895j2996L3816n0501K901l3199L993l1085
14063h5871O1027K8767j9597j4696J5180N6703K8484n6633m7327o6488m6446N6156
14051i0741J17718P5195k4309j29144n4234J7054J8844P359J3335J0279k032L1817
14039h859K6913M7013J597M628n3639k2916J5533q456L5965j8348q7685q942M213
14026g2983J9079N2033r811K5361l2820N1221J9094K4039j05890K4636N1095q8717
14014d3663M2362K9048o1730j2988O583n8249j0462N1785J14945K897k4543M1127
$$ plain form
14002 77112 47627 -38073 -38706 53162 100733 165928 138587 74749 112145 154481 90476 21419
13990 21419 -38699 -76276 -24697 -55561 -93451 -135540 -121834 -111479 -47731 -26754 -8999 -13744
13978 -13744 -859 33544 62619 134813 59036 4153 -5768 10410 -37393 -59357 -124854 -105629
13966 -105629 -48431 -100725 -172446 -136291 -56966 70844 121915 116326 40375 -24290 -41715
13955 -41715 -43195 -2730 -1527 -27022 22243 33226 59942 18403 15937 -848 -52261 -82464
13943 -82464 -60266 8910 59140 74924 -34447 -59027 -46128 -14402 29176 23181 6695 -7396
13931 -7396 -38456 -77704 -48155 -48854 -42929 40502 89177 71740 61557 104787 127862 105350
13919 105350 29055 2519 38418 42145 -6741 7870 20302 17621 -2863 45321 14083 26999
$$ packed form
14002G7112k9485q5700o33R1868M7571O5195k7341o3838L7396M2336o4005o9057
13990B1419o0118l7577N1579l0864l7890m2089J3706J0355O3748K0977J7755m745
13978a3744J2885L4403K9075P2194p5777n4883r921J6178m7803k1964o5497J9225
13966a05629N7198n2294p1721L6155P9325J27810N1071n589p5951o4665j7425
13955d1715j480M0465J203k5495M9265J0983K6716m1539k466j6785n1413l0203
13943h2464K2198O9176N0230J5784j09371k4580J2899L1726M3578n995j6486j4091
13931g396l1060l9248K9549o99N925Q3431M8675j7437j0183M3230K3075k2512
13919A05350p6295k6536L5899L727m8886J4611J2432k681k0484M8184l1238J2916
$$ plain form
13907 26999 63172 87596 118534 82023 48479 74184 54194 5595 -93634 -82087 -39229 12365
13895 12365 20407 49180 136474 132585 106717 210610 121929 -3128 -34078 -19380 -25915 -69619
13883 -69619 -4705 46145 -19325 -64887 -3924 1046 -44478 34408 52902 -17438 9200 28579
13871 28579 -18138 -42731 -103014 -92834 -141044 -139727 -82059 -41884 -27461 -19533 -43008 2161
13859 2161 37900 -21553 45078 92242 62955 -17717 8891 17622 -54896 -67170 -43010 -42518
13847 -42518 139 90186 111182 28975 -5424 15844 -13003 -3846 67504 125134 128972 50930
13835 50930 28969 82970 7066 -93289 -45964 -34815 -8349 20952 5646 26317 -28950
13824 -28950 -63670 -144257 -159351 -35006 33488 113418 54252 75618 102491 66019 48517
$$ packed form
13907B6999L6173K4424L0938l6511l3544K5705j9990m8599r9229J1547M2858N1594
13895A2365Q042K8773Q7294l889k5868J03893q8681j25057l0950J4698o535m3704
13883f9619O4914N0850o5470m5562O0963M970m5524P8886J8494p0340K6638J9379
13871B8579m6717k4593o0283J0180m8210J317N7668M0175J4423P928k3475M5169
13859B161L5739n9453O6631M7164k9287q0672K6608Q731p2518j2274K4160M92
13847d2518M2657R0047K0996q2207l4399K1268k8847R157P1350N7630L838p8042
13835E0930k1961N4001p5904j00355M7325J1149K6466K9301j5306K0671n5267
13824b8950l4720q0587j5094J24345O8494P9930n9166K1366K6873l6472j7502
$$ plain form
13813 48517 -5447 -56008 -29784 41662 33450 1467 48451 114120 97795 78716 38945 13913
13801 13913 -23165 -87575 -60945 76260 122601 67190 57828 -4416 -1803 26282 69416 83168
13789 83168 -18867 -19579 -2205 -5333 55352 47918 -29217 -28596 16686 20468 21388 15339 43450
13776 43450 77450 89065 52567 137880 159608 165730 85168 89353 43984 67531 55092 48501
13764 48501 121365 64302 44637 48472 58101 19282 -681 55420 83553 126524 114161 75496
13752 75496 -8998 -12967 1419 12187 24367 19445 14554 -9522 -32711 32135 10519 -46463
13740 -46463 -101084 -156794 -132167 -131850 -123982 -39262 26328 -20229 -52264 -15077 -67687 -67884 -62488
13727 -62488 -17296 19694 33170 26269 4774 83972 104872 47570 45724 79990 77134 63591
$$ packed form
13813D8517n3964n0561K6224P1446q212l1983M6984O5669j6325j9079l9771k5032
13801A3913l7078o4410K6630J37205M6341n5411r362o2244K613K8085M3134J3752
13789H3168j02035p12J7374l128O0685p434p7135O21M5282L782R20o049K8111
13776D3450L4000J1615l6498Q5313K1728O122q0562M185m5369K3547j2439o591
13764D8501P2864n7063j9665L835R629l8819j9963N6101K8133M2971j2363l8665
13752G5496q4494l969J4386J0768J2180m922m891k4076k3189O4846k1616n6982
13740d6463n4621n5710K4627L17P868Q4720O5590m6557l2035L7187n2610j97N396
13727f2488M5192L6990J3476o901k1495P9198K0900n7302j846L4266k856j3543
$$ plain form
13715 63591 48462 17255 51466 120619 155752 62255 39853 60165 73008 41967 -25589 31326
13703 31326 43455 58161 -114 -33491 -10354 34805 124438 125471 74438 -2340 -37809 -66211
13691 -66211 -48007 26940 32166 -19262 -50469 -119340 -124163 -94061 -33323 -9920 -12778 -6725
13679 -6725 2005 -56709 -96501 -73458 -46289 -24671 45702 75151 77700 101873 80630 11180
13667 11180 38512 91362 143164 136931 83079 80164 67946 -14934 6789 65309 39298 65312
13655 65312 34172 68667 99583 37052 44527 64389 65440 29915 11239 3751 59053 130960
13643 130960 166067 139636 115667 55848 -12617 24135 104461 166119 242010 220618 162376
13632 162376 113905 69676 -18252 -41933 38294 19470 20100 29156 28921 46973 27777 -4956
$$ packed form
13715F3591j5129l1207L4211O9153L5133r3497k2402K0312J2843l1041o7556N6915
13703C1326J2129J4706n8275l3377K3137M5159Q9633J033n1033p6778l5469k8402
13691f6211J8204P4947N226n1428l1207o8871m823L0102O0738K3403k858O053
13679f725Q730n8714l9792K3043K7169K1618P0373K9449K549K4173k1243o9450
13667A1180K7332N2850N1802o233n3852k915j2218q2880K1723N8520k6011K6014
13655F5312l1140L4495L0916o2531P475J9862J051l5525j8676p488N5302P1907
13643A30960L5107k6431k3969n9819o8465L6752Q0326O1658P5891k1392n8242
13632A62376m8471m4229q7928k3681Q0227j8824O30R056k35J8052j9196l2733
$$ plain form
13620 -4956 25610 93789 89479 52640 80623 133050 154017 122588 82597 36384 83539 10395
13608 10395 -74379 -51475 -64564 -116609 -65433 -57671 -33292 6804 79459 13638 88239 80421
13596 80421 121224 149061 97070 47229 30662 57826 55591 -23503 -38269 6983 118304 151223
13584 151223 164797 174248 176094 184610 175735 118106 119497 123679 104115 123936 129021 212071 290180
13571 290180 187620 109599 110175 142180 167853 160737 173632 184964 101492 41225 38413 42421
13559 42421 68452 65431 102915 145919 147047 134618 95293 113226 88080 -14300 2914 66942
13547 66942 26454 -64986 -52843 -65023 52668 131030 123437 30072 -18879 -42227 -28899 104353
13535 104353 96886 76729 67821 46976 59922 113158 108434 111899 173548 185613 123891 84267
$$ packed form
13620d956L0566O8179m310l6839K7983N2427K0967l1429l9991m6213M7155p3144
13608A0395q4774K2904j3089n2045N1176P762K4379M0096P2655o5821P4601p818
13596H0421M0803K7837n1991m9841j6567K7164k235p9094j4766M5252J11321L2919
13584A51223J3574R451J846Q516q875n7629J391M182j9564J9821N085Q3050P8109
13571B90180j02560p8021N76L2005K5673p116J2895J1332q3472o0267k812M008
13559D2421K6031l021L7484M3004J128j2429l9325J7933k5146j02380J7214O4028
13547F6942m0488r1440J2143j2180J17691P8362p593r3365m8951k3348J3328J33252
13535A04353p467k0157q908k0845J2946N3236m724L465O1649J2065o1722l9624
$$ plain form
13523 84267 53536 2008 71079 70417 -38490 -26648 25027 44189 74443 60225 53906 73381
13511 73381 98478 167510 88254 44171 60532 102569 168209 208628 146625 68087 26481 92997
13499 92997 127710 109737 143869 240663 191523 188180 156174 124339 110432 82157 149489 157074
13487 157074 138574 168689 200135 214042 181468 172731 216016 213968 193867 192100 191609 135578
13475 135578 95317 12603 51186 161245 145889 66035 24570 4665 47654 114040 101569
13464 101569 57544 107461 184666 171782 165149 220612 209337 174111 132689 154142 135913 71174
13452 71174 70564 87722 135140 137895 132951 69647 98005 104508 92209 201846 232633 236853 182311
13439 182311 176323 137976 125536 197349 194217 179062 112772 125795 170721 245507 308150 277060
$$ packed form
13523H4267l0731n1528O9071o62j08907J1842N1675J9162L0254j4218o319J9475
13511G3381K5097O9032p9256m4083J6361M2037O5640M0419o2003p8538m1606O6516
13499I2997L4713j7973L4132R6794m9140l343l2006l1835j3907k8275O7332P585
13487A57074j8500L0115L1446J3907l2574q737M3285k048k0101j767m91n6031
13475A35578m0261q2714L8583J10059j5356p9854m1465j9905M2989O6386j2471
13464A01569m4025M9917P7205j2884o633N5463j1275l5226m1422K1453j8229o4739
13452G1174o10J7158M7418K755m944o3304K8358O503j2299J09637L0787M220n4542
13439A82311n988l8347j2440P1813l132j5155o6290J3023M4926P4786O2643l1090
$$ plain form
13427 277060 252090 254516 284991 317107 294722 256102 305340 376245 261993 197417 234380
13416 234380 298005 296756 286971 270335 254302 265663 279842 274552 285492 313046 274736 257628
13404 257628 306727 333041 338624 294683 319906 363140 423545 403365 328731 296971 341140 312573
13392 312573 296850 366813 401850 403945 380729 395218 392464 388366 470605 458843 454793 431134
13380 431134 458775 464271 496755 394651 289122 314842 349121 334289 341675 310713 319740 367341
13368 367341 453895 463600 413627 357087 348838 358885 356973 364396 391464 375451 380835 363631
13356 363631 394969 386264 393102 429610 471127 432130 434444 378125 378388 427037 477859 450795
13344 450795 378387 423467 529667 516937 496779 499581 555799 579006 547059 535300 565888
$$ packed form
13427B77060k4970K426L0475L2116k2385l8620M9238P0905j14252o4576L6963
13416B34380O3625j249r785j6636j6033J1361J4179n290J0940K7554l8310j7108
13404B57628M9099K6314N583m3941K5223M3234O0405k0180p4634l1760M4169k8567
13392C12573j5723O9963L5037K095k3216J4489k754m098Q2239j1762m050k3659
13380D31134K7641N496L2484j02104j05529K5720L4279j4832P386l0962R027M7601
13368C67341Q6554R705m9973n6540q249J0047j912P423K7068j6013N384j7204
13356C63631L1338q705O838L6508M1517l8997K314n6319K63M8649N0822k7064
13344D50795p2408M5080J06200j2730k0158K802N6218K3207l1947j1759L0588
$$ plain form
13333 565888 558535 533305 519076 540638 532614 487482 458440 468595 437541 529674 591847 609361
13321 609361 610198 624880 524564 491727 476816 472424 527522 551704 605753 590117 553710 611752
13309 611752 610803 640632 641237 617573 588345 559207 560491 560418 575750 580371 611327 637313 725187
13296 725187 721516 741086 741778 759608 629713 638163 658193 795580 830880 825583 775018 718302
13284 718302 744633 769011 866165 908530 948342 999181 977786 951177 920061 894493 861331
13273 861331 859717 853222 858904 937697 987258 999516 1046538 1115845 1150312 1079762 1099941 1147010
13261 1147010 1171718 1172646 1189939 1196559 1237443 1360484 1450155 1456082 1449236 1435677 1456812 1511589
13249 1511589 1577593 1611177 1677725 1730570 1750851 1763121 1711886 1739168 1777407 1867240 1928717
$$ packed form
13333E65888p353k5230j4229K1562q024m5132k9042J0155l1054R2133O2173J7514
13321F09361Q37J4682j00316l2837j4911m392N5098K4182N4049j5636l6407N8042
13309F11752r49K9829O05k3664k9228k9138J284p3J5332M621L0956K5986Q7874
13296G25187l671J9570O92J7830j29895Q450K0030J37387L5300n297n0565n6716
13284G18302K6331K4378R7154M2365L9812N0839k1395k6609l1116k5568l3162
13273H61331j614o495N682P8793M9561J2258M7022O9307L4467p0550K0179M7069
13261A147010K4708R28J7293O620M0884J23041Q9671N927o846j3559K1135N4777
13249A511589O6004L3584O6548N2845K0281J2270n1235K7282L8239Q9833O1477
$$ plain form
13238 1928717 1928982 1958723 1965738 2027989 2065454 2134369 2172382 2133683 2218040 2272705 2257107 2267434
13226 2267434 2264590 2248583 2319008 2431928 2507367 2561382 2649515 2701565 2805774 2887409 2934093
13215 2934093 3014241 3143737 3176912 3230555 3293502 3378179 3485126 3573703 3677940 3805067
13205 3805067 3956245 4031746 4113769 4250514 4430803 4615923 4866028 5088330 5211897 5287608
13195 5287608 5372779 5589430 5885495 6144932 6382773 6593370 6864876 7058325 7331056 7687310
13185 7687310 7976008 8192506 8604949 9031767 9466057 10015315 10543178 11021828 11480043
13176 11480043 11959628 12524546 13112173 13848634 14558639 15340318 16256505 17266405 18312193
13167 18312193 19451522 20630824 21931819 23424941 24939489 26598792 28546048 30730329
$$ packed form
13238A928717K65K9741P015O2251L7465O8915L8013l8699Q4357N4665j5598J0327
13226B267434k844j6007P0425J12920P5439N4015Q8133N2050J04209Q1635M6684
13215B934093Q0148J29496L3175N3643O2947Q4677J06947Q8577J04237J27127
13205C805067J51178P5501Q2023J36745J80289J85120K50105K22302J23567P5711
13195E287608Q5171K16651K96065K59437K37841K10597K71506J93449K72731L56254
13185G687310K88698K16498M12443M26818M34290N49258N27863M78650M58215
13176A1480043M79585N64918N87627P36461P10005P81679R16187J009900J045788
13167A8312193J139329J179302J300995J493122J514548J659303J947256K184281
$$ plain form
13159 30730329 33102700 35646896 38477459 41577689 44990496 48729034 52916692 57555557
13151 57555557 62689888 68287661 74466557 81133045 88412741 96228848 104505083 113022748
13143 113022748 121606635 130135531 138287047 145644979 151999380 156993501 160372378 161932130
13135 161932130 161570811 159476875 155747723 150584926 144559554 137753488 130587895 123320994
13127 123320994 116177153 109193434 102530920 96280041 90449944 85034364 80036327 75471871
13119 75471871 71263566 67335690 63700265 60414190 57381806 54565416 51918292 49406177
13111 49406177 47079472 45057423 43163862 41407014 39837708 38263405 36668383 35242705
13103 35242705 34015695 32815073 31676161 30623045 29578917 28636211 27721182 26808676
$$ packed form
13159C0730329K372371K544196K830563L100230L412807L738538M187658M638865
13151E7555557N134331N597773O178896O666488P279696P816107Q276235Q517665
13143A13022748Q583887Q528896Q151516P357932O354401M994121L378877J559752
13135A61932130l61319k093936l729152n162797o025372o806066p165593p266901
13127A23320994p143841o983719o662514o250879n830097n415580m998037m564456
13119G5471871m208305l927876l635425l286075l032384k816390k647124k512115
13111D9406177k326705k022049j893561j756848j569306j574303j595022j425678
13103C5242705j227010j200622j138912j053116j044128r42706r15029r12506
$$ plain form
13095 26808676 25917236 25072621 24242922 23476886 22790109 22109318 21472343 20901790 20290134
13086 20290134 19688693 19069092 18548334 18103700 17582750 17065243 16660416 16256459 15821869
13077 15821869 15357127 14865687 14404256 14011698 13725159 13327880 12924794 12639199 12344079
13068 12344079 12094125 11801451 11540193 11223550 10897522 10605781 10374179 10137797 9900305
13059 9900305 9633223 9313840 9053480 8887124 8740557 8566457 8383912 8208837 8006330
13050 8006330 7714783 7564828 7465354 7284847 7116045 6950357 6844603 6633104 6411610 6243592
13040 6243592 6177360 6047846 5844868 5700631 5588446 5483098 5362029 5268281 5110802 4917967
13030 4917967 4851047 4792964 4701761 4600316 4417571 4249597 4144929 4066996 3996924 3939214
$$ packed form
13095B6808676q91440q44615q29699p66036o86777o80791o36975n70553o11656
13086B0290134o01441o19601n20758m44634n20950n17507m04827m03957m34590
13077A5821869m64742m91440m61431l92558k86539l97279m03086k85595k95120
13068A2344079k49954k92674k61258l16643l26028k91741k31602k36382k37492
13059I900305k67082l19383k60360j66356j46567j74100j82545j75075k02507
13050H006330k91547j49955r9474j80507j68802j65688j05754k11499k21494j68018
13040F243592o6232j29514k02978j44237j12185j05348j21069r3748j57479j92835
13030D917967o6920n8083r1203j01445j82745j67974j04668p7933p0072n7710
$$ plain form
13020 3939214 3955090 3874898 3776186 3637449 3582034 3539419 3479232 3455343 3415469 3405338 3465033
13009 3465033 3412142 3368578 3308466 3229732 3175917 3119816 3034972 2935789 2823512 2720677 2726756
12998 2726756 2671306 2726305 2731079 2710309 2550631 2452346 2398355 2372898 2455797 2405663 2336046
12987 2336046 2393070 2414067 2378541 2318692 2282966 2226195 2187056 2163204 2135554 2068139 2068788 2045664
12975 2045664 1946755 1945024 1971012 1897864 1851227 1815564 1843398 1817425 1792651 1780812 1825593
12964 1825593 1802632 1772202 1780186 1728710 1615497 1583597 1567248 1538826 1514842 1478035 1579226
12953 1579226 1548209 1512500 1535746 1508007 1422197 1279978 1237900 1292928 1267600 1189720 1111455
12942 1111455 1051560 1005498 1010555 1025021 1091274 1032379 964604 908448 906350 905653 927804 920267
$$ packed form
13020C939214J5876q0192r8712j38737n5415m2615o0187k3889l9874j0131N9695
13009C465033n2891m3564o0112p8734n3815n6101q4844r9183j12277j02835O079
12998B726756n5450N4999M774k0770j59678r8285n3991k5457Q2899n0134o9617
12987B336046N7024K0997l5526n9849l5726n6771l9139k3852k7650o7415O49k3124
12975B045664r8909j731K5988p3148m6637l5663K7834k5973k4774j1839M4781
12964A825593k2961l0430P984n1476j13213l1900j6349k8422k3984l6807J01191
12953A579226l1017l5709K3246k7739q5810j42219m2078N5028k5328p7880p8265
12942A111455n9895m6062N057J4466O6253n8895o7775n6156k098o97K2151p537
$$ plain form
12930 920267 835768 829471 820092 825382 860400 912830 927999 848571 775005 757439 774754 801440
12918 801440 734150 686863 735311 703833 616008 636632 692136 675373 642088 643468 627587 614816
12906 614816 620118 648557 638947 629925 678913 648770 559118 540430 628241 650689 699483 687517
12894 687517 577379 538241 509451 501254 599605 617338 655255 632494 624837 654667 585951 611074
12882 611074 620098 558555 482178 544973 626352 651331 609894 476777 490403 500471 483826
12871 483826 480048 438247 524672 516025 542954 545118 519706 490510 494318 512481 460495 434451
12859 434451 384906 407754 366233 347095 331526 372000 358564 320636 320562 395808 431928 434177
12847 434177 429909 431211 408325 443970 472756 496622 410210 326811 362060 416144 437274 412860
$$ packed form
12930I20267q4499o297r379N290L5018N2430J5169p9428p3566j7566J7315K6686
12918H01440o7290m7287M8448l1478q7825K0624N5504j6763l3285J380j5881j2771
12906F14816N302K8439r610r022M8988l0143q9652j8688Q7811K2448M8794j1966
12894F87517j10138l9138k8790q197R8351J7733L7917k2761p657K9830o8716K5123
12882F11074R024o1543p6377O2795Q1379K4979m1437j33117J3626J0068j6645
12871D83826l778m1801Q6425q647K6929K164k5412k9196L808J8163n1986k6044
12859D34451m9545K2848m1521j9138j5569M0474j3436l7928p4P5246L6120K249
12847D34177m268J302k2886L5645K8786K3866q6412q3399L5249N4084K1130k4414
$$ plain form
12835 412860 432097 399075 320158 328273 301971 338229 329770 241765 196672 182267 217507 273124
12823 273124 332226 359722 322254 373249 390113 250693 255087 269282 283224 284273 296419 312257
12811 312257 247818 277892 271193 317400 318309 284385 271394 262847 221275 163623 170322 194357
12799 194357 227108 224208 192131 219917 238889 209504 227251 194120 248509 228270 169625 156548
12787 156548 149707 117469 119458 75420 91814 122340 141773 114206 119726 99181 164272 206513
12775 206513 168994 123881 172554 236988 288393 204423 162284 216218 314388 291414 255451
12764 255451 319074 239230 170929 259906 258923 239292 181202 163918 118560 119782 108379 155704
12752 155704 162715 96235 100338 105478 49839 103061 131867 143476 238907 237002 126372 99243
$$ packed form
12835D12860J9237l3022p8917Q115k6302L6258q459q8005m5093j4405L5240N5617
12823B73124N9102K7496l7468N0995J6864j39420M394J4195J3942J049J2146J5838
12811C12257o4439L0074o699M6207R09l3924j2991q547m1572n7652O699K4035
12799A94357L2751k900l2077K7786J8972k9385J7747l3131N4389k0239n8645j3077
12787A56548o841l2238J989m4038J6394L0526J9433k7567N520k0545O5091M2241
12775B06513l7519m5113M8673O4434N1405q3970m2139N3934R8170k2974l5963
12764B55451O3623p9844o8301Q8977r83j9631n8090j7284m5358J222j1403M7325
12752A55704P011o6480M103N140n5639N3222K8806J1609R5431j905j10630k7129
$$ plain form
12740 99243 77518 58006 88828 139775 181787 167520 99303 32064 -16364 -25193 20583 81699
12728 81699 177657 207572 234155 213832 153902 90909 136960 192137 226729 206633 216439 225407
12716 225407 168521 132681 101523 65669 44527 59873 137165 149551 134887 113849 78384
12705 78384 54205 124354 190636 87275 38254 41442 11975 -16091 -19778 82450 160099 120397
12693 120397 96513 178033 261901 253238 208821 180902 198344 98315 11897 71553 100679
12682 100679 90284 120014 69816 49776 49302 62997 9811 17916 8095 -14229 -52637 -17896
12670 -17896 63504 -18506 -47723 -1200 71126 61664 37584 31583 82631 96077 21942 -16140
12658 -16140 -7645 74117 86342 56832 24103 -10302 -20631 46416 104503 38503 3382 120881
$$ packed form
12740I9243k1725j9512L0822N0947M2012j4267o8217o7239m8428q829M5776O1116
12728H1699R5958K9915K6583k0323n9930o2993M6051N5177L4592k0096R806Q968
12716B25407n6886l5840l1158l5854k1142J5346P7292J2386j4664k1038l5465
12705G8384k4179P0149O6282j03361m9021L188k9467k8066l687J02228P7649l9702
12693A20397k3884Q1520Q3868q663m4417k7919J7442j00029q6418N9656K9126
12682A00679j0395K9730n0198k0040m74J3695n3186Q105r821k2324l8408L4741
12670a7896Q1400q2010k9217M6523P2326r462k4080o001N1048J3446p4135l8082
12658a6140Q495Q1762J2225k9510l2729l4405j0329O7047N8087o6000l5121J17499
$$ plain form
12646 120881 124703 80427 8534 -48524 -6109 104739 134010 191816 191506 133588 134879 67259
12634 67259 22851 -10191 15031 92091 179739 198913 162924 155482 133031 16534 -32238 -46960
12622 -46960 -42377 -97888 -88725 27638 93247 120448 160078 94773 81388 67098 -3913 9030
12610 9030 17776 3204 55743 19924 52967 47808 6322 61696 -64082 -74888 36604 73073
12598 73073 102059 195451 260822 151142 89609 21046 -24453 -18509 -85624 10902 78118 57354
12586 57354 13694 67434 59871 61737 72990 81492 49386 31140 970 -18536 -18264 -25474 3285
12573 3285 40736 107300 154404 182864 231788 156185 112044 155205 138597 71803 110906 63862
12561 63862 46929 137357 167293 112823 88413 50413 27256 48014 22370 27565 79314 33133
$$ packed form
12646A20881L822m4276p1893n7058M2415J10848K9271N7806l10n7918J291o7620
12634F7259m4408l3042K5222P7060Q7648J9174l5989p442k2451j16497m8772j4722
12622d6960M583n5511R163J16363O5609K7201L9630o5305j3385j4290p1011J2943
12610I030Q746j4572N2539l5819L3043n159m1486N5374j25778j0806J11492L6469
12598G3073K8986R3392O5371j09680o1533o8563m5499N944o7115R6526O7216k0764
12586E7354m3660N3740p563J866J1253Q502l2106j8246l0170j9506K72p210K8759
12573C285L7451O6564M7104K8460M8924p5603m4141M3161j6608o6794L9103m7044
12561F3862j6933R0428K9936n4470k4410l8000k3157K0758k5644N195N1749m6181
$$ plain form
12549 33133 -12690 -51035 -37978 -12675 10501 -9249 18275 47210 88053 147134 133760 151554
12537 151554 148557 139035 157377 86203 -22307 25412 41794 77329 99771 47711 55468 110527
12525 110527 152872 154448 104221 87097 48221 57686 117214 124784 66926 62968 145196 200568
12513 200568 119792 72173 51027 23300 5242 -20158 2905 103493 106734 63876 20137
12502 20137 5532 16668 18144 16865 10928 -11105 57618 123684 187916 160358 169532 109566
12490 109566 -4046 23951 30441 4125 -1120 -15785 -59681 -105956 -31550 -15786 21512 44275
12478 44275 87503 154062 124450 47226 45182 105269 143093 141305 227648 231318 109515 71173
12466 71173 28557 -42764 -51390 7693 -12231 -66649 -58283 3835 30834 40961 -38873 -75143
$$ packed form
12549C3133m5823l8345J3057K5303K3176j9750K7524K8935M0843N9081j3374J7794
12537A51554k997r522J8342p1174j08510M7719J6382L5535K2442n2060P757N5059
12525A10527M2345J576n0227j7124l8876R465N9528P570n7858l958Q2228N5372
12513B00568q0776m7619k1146k7727j8058k5400K3063J00588L241m2858m3739
12502B0137j4605J1136J476j279n937k2033O8723O6066O4232k7558R174n9966
12490A09566j13612K7997O490k6316n245j4665m3896m6275P4406J5764L7298K2763
12478D4275M3228O6559k9612p7224k044O0087L7824j788Q6343L670j21803l8342
12466G1173m2616p1321q626N9083j9924n4418Q366O2118K6999J0127p9834l6270
$$ plain form
12454 -75143 -55695 45147 121424 96227 23584 5793 18042 23756 -16409 -33603 -45839 -29269
12442 -29269 57289 46926 12294 30686 56338 52328 68831 81663 64994 41325 34166 53564
12430 53564 108534 170427 145487 157174 104838 42973 13026 16099 61756 166821 219884 194536
12418 194536 166847 143479 164388 231554 244278 157731 121602 132325 45518 27879 26406 37600
12406 37600 11969 61650 95502 42170 -8408 12911 27911 124034 160239 148535 70316 -34059
12394 -34059 -99928 -123199 -68117 -18039 4379 19572 -41879 -123072 -19130 51028 -8679
12383 -8679 -15228 -35890 -162 -17758 69836 78342 10806 5274 -16098 8153 52438 42253
12371 42253 87951 181968 216823 164092 72260 46090 78546 68496 32361 77963 135830 152525
$$ packed form
12454g5143J9448J00842P6277k5197p2643j7791J2249N714m0165j7194j2236J6570
12442b9269Q6558j0363l4632J8392K5652m010J6503J2832j6669k3669p159J9398
12430E3564N4970O1893k4940J1687n2336o1865k9947L073M5657J05065N3063k5348
12418A94536k7689k3368K0909O7166J2724q6547l6129J0723q6807j7639j473J1194
12406C7600k5631M9681L3852n3332n0578K1319J5000R6123L6205j1704p8219j04375
12394c4059o5869k3271N5082N0078K2418J5193o1451q1193J03942P0158n9707
12383h679o549k0662L5728j7596Q7594Q506o7536n532k1372K4251M4285j0185
12371D2253M5698R4017L4855n2731r1832k6170L2456j0050l6135M5602N7867J6695
$$ plain form
12359 152525 178955 117479 99047 107141 94422 44579 32470 -7477 28057 95731 121698 131512
12347 131512 149257 203665 166895 199817 202200 133435 170306 173515 79608 39217 71428 127454
12335 127454 170329 108436 119210 50825 61855 30810 11661 14550 -19804 -50602 -45628 -14271
12323 -14271 3118 -70133 -119523 -77696 -14019 20074 -48215 -34504 64452 103127 99580 98712
12311 98712 111339 131380 166189 130482 121773 159863 130173 105089 44271 9000 -359 -5988
12299 -5988 -23538 -36953 -62169 -32994 62619 31935 22526 57461 109857 114775 16740 -30047
12287 -30047 38388 114495 107863 21797 -41270 -34479 15914 61654 78331 503 -51432 -49465
12275 -49465 1767 -4360 55994 163426 186598 209009 187676 127614 116426 40787 80242 166405
$$ packed form
12359A52525K6430o1476j8432Q094j2719m9843j2109l9947L5534O7674K5967R814
12347A31512J7745N4408l6770L2922K383o8765L6871L209r3907m0391L2211N6026
12335A27454M2875o1893J0774o8385J1030l1045j9149K889l4354l0798M974L1357
12323a4271J7389p3251m9390M1827O3677L4093o8289J3711R8956L8675l547q68
12311I8712J2627K0041L4809l5707q709L8090k9690k5084o0818l5271r359n629
12299e988j7550j3415k5216K9175R5613l0684r409L4935N2396M918r8035m6787
12287c0047O8435P6107o632q6066o3067O791N0393M5740J6677p7828n1935J967
12275d9465N1232o127O0354J07432K3172K2411k1333o0062j1188p5639L9455Q6163
$$ plain form
12263 166405 191784 101377 83459 101824 47759 -10770 -26276 -22484 54389 99931 46244 37135
12251 37135 87956 91048 39444 10643 -24919 -13975 2208 16529 91362 80399 66461 88684
12239 88684 152682 135661 70363 28492 68401 72977 91029 138389 108659 76875 82668 96828
12227 96828 90749 110234 63833 87317 140694 150451 66418 9401 -10841 -2014 13802 -15335
12215 -15335 -39516 -46243 -18197 15612 55393 46507 43955 -78612 -16426 20253 1362 7610
12203 7610 5867 18568 100531 113525 34645 9484 36996 119472 104889 -37804 -3196 55599
12191 55599 37414 -40148 -43653 -35076 -3895 39749 83139 111619 50780 49418 89021 92947
12179 92947 18727 17048 43359 58751 92862 131168 104176 92620 79854 68062 112754 90925
$$ packed form
12263A66405K5379r0407j7918J8365n4065n8529j5506L792P6873M5542n3687r109
12251C7135N0821L092n1604k8801l5562J0944J6183J4321P4833j0963j3938K2223
12239H8684O3998j7021o5298m1871L9909M576J8052M7360k9730l1784N793J4160
12227I6828o079J9485m6401K3484N3377R757q4033n7017k0242Q827J5816k9137
12215a5335k4181o727K8046L3809L9781q886k552j22567O2186L6679j8891O248
12203G610j743J2701Q1963J2994p8880k5161K7512Q2476j4583j42693L4608N8795
12191E5599j8185p7562l505Q577L1181M3644M3390K8480o0839j362L9603L926
12179I2947p4220j679K6311J5392L4111L8306k6992j1556j2766j1792M4692k1829
$$ plain form
12167 90925 101099 74244 16260 4344 51263 138419 153468 143249 114013 88676 94860 141079
12155 141079 141662 119344 108397 104079 91187 131800 180995 172684 102212 138904 139201 69041 77349
12142 77349 59710 67930 68037 10632 26 53309 112272 126831 109511 226603 242724 222148
12130 222148 135212 122474 189419 169095 181893 208118 197542 183665 171953 175006 201706 197583
12118 197583 162756 101063 115364 89184 126739 135491 126904 177292 194387 188705 116301 139449
12106 139449 156350 124993 106053 64259 61100 140259 139170 40235 31659 36907 22697 -9612
12094 -9612 4350 81784 159137 198196 154779 75988 91285 125970 77507 27823 71896 38278
12082 38278 31727 22919 108224 147659 62737 54492 143192 218207 192296 140227 116495 123350
$$ packed form
12167I0925J0174k6855n7984j1916M6919Q7156J5049j0219k9236k5337O184M6219
12155A41079N83k2318j0947m318j2892M0613M9195q311p0472L6692K97p0160Q308
12142G7349j7639Q220J07n7405j0606N3283N8963J4559j7320J17092J6121k0576
12130B22148q6936j2738O6945k0324J2798K6225j0576j3877j1712L053K6700m123
12118A97583l4827o1693J4301k6180L7555Q752q587N0388J7095n682p2404K3148
12106A39449J6901l1357j8940m1794l159P9159j089r8935q576N248j4210l2309
12094i612J3962P7434P7353L9059m3417p8791J5297L4685m8463m9684M4073l3618
12082C8278o551q808Q5305L9435q4922q245Q8700P5015k5911n2069k3732O855
$$ plain form
12070 123350 131520 120243 90669 89284 43173 80552 139851 189174 181398 202661 207935 114110
12058 114110 122142 140032 159397 176569 247503 269441 278534 287319 208179 203385 213703 148851
12046 148851 62777 59526 58146 51652 103176 80773 109601 48595 10320 82396 131390 109246
12034 109246 147213 238508 278117 233955 231442 318084 355954 361813 378740 414441 364642 355770
12022 355770 376413 388167 347685 340637 350132 268838 260593 301453 365241 399941 357601 348965
12010 348965 345749 361149 460526 533898 500653 424911 359916 378306 375995 325659 243105 329100
11998 329100 392563 405506 393856 448990 471645 431753 402202 533961 558114 565450 498060
11987 498060 466305 453212 478385 527888 559903 625460 655232 610336 605849 699718 721592 718189
$$ packed form
12070A23350Q170j1277k9574j385m6111L7379N9299M9323p776K1263N274r3825
12058A14110Q032J7890J9365J7172P0934K1938R093Q785p9140m794J0318o4852
12046A48851q6074l251j380o494N1524k2403K8828o1006l8275P2076M8994k2144
12034A09246L7967R1295L9609m4162k513Q6642L7870N859J6927L5701m9799q872
12022C55770K0643J1754m0482p048R495q1294q245M0860O3788L4700m2340q636
12010C48965l216J5400R9377P3372l3245p5742o4995J8390k311n0336q2554Q5995
11998C29100O3463J2943j1650N5134K2655l9892k9551J31759K4153P336o7390
11987D98060l1755j3093K5173M9503L2015O5557K9772m4896m487R3869K1874l403
$$ plain form
11975 718189 743291 807357 771356 734310 790516 753024 740657 833175 843892 847948 872979 877114
11963 877114 967264 994773 993881 1032187 1126458 1266265 1344761 1355390 1358837 1397050 1441867 1477064
11951 1477064 1477009 1517512 1545188 1577353 1688243 1797290 1877978 1915912 2007455 2122853 2262186
11940 2262186 2418911 2620159 2773487 2886572 3121643 3348615 3529648 3823340 4156644
11931 4156644 4417656 4665651 5052732 5538048 6095203 6686766 7365532 8280955 9419237
11922 9419237 10648808 12091741 13783062 16066585 18789490 22259327 26855692 32943611
11914 32943611 41160223 52275169 67563179 87400563 110647500 134690875 156913792
11907 156913792 177238955 195230611 204297564 195305296 168623496 135812170 107039868
$$ packed form
11975G18189K5102O4066l6001l7046N6206l7492j2367R2518J0717M056K5031M135
11963H77114R0150K7509q92L8306R4271J39807P8496J0629L447L8213M4817L5197
11951A477064n5M0503K7676L2165J10890J09047Q0688L7934R1543J15398J39333
11940B262186J56725K01248J53328J13085K35071K26972J81033K93692L33304
11931D156644K61012K47995L87081M85316N57155N91563O78766R15423J138282
11922I419237J229571J442933J691321K283523K722905L469837M596365O087919
11914C2943611Q216612J1114946J5288010J9837384K3246937K4043375K2222917
11907A56913792K0325163J7991656R066953q992268k6681800l2811326k8772302
$$ plain form
11900 107039868 85539991 70177793 59073230 50849118 44612359 39714721 35818353
11893 35818353 32656967 29993095 27716235 25749344 24092544 22640706 21343501 20297400
11885 20297400 19276863 18367562 17660358 17076226 16498765 16095771 15723070 15372057 15166653
11876 15166653 15042265 14926957 14780667 14718614 14630501 14545488 14425730 14279186 14060357 13714060
11866 13714060 13296741 12724356 12207344 11669310 11095469 10525182 10026342 9646565 9238751
11857 9238751 8768231 8371219 8004688 7689801 7422002 7184851 6950320 6672291 6466674
11848 6466674 6232605 6020645 5874894 5665624 5462996 5293820 5206595 5072605 4896935 4701881
11838 4701881 4583461 4499718 4386581 4332277 4251241 4161144 4056287 3871047 3863631 3809666 3639398
$$ packed form
11900A07039868k1499877j5362198j1104563q224112o236759m897638l896368
11893C5818353l161386k663872k276860j966891j656800j451838j297205j046101
11885B0297400j020537r09301p07204n84132n77461m02994l72701l51013k05404
11876A5166653j24388j15308j46290o2053q8113q5013j19758j46544k18829l46297
11866A3714060m17319n72385n17012n38034n73841n70287m98840l79777m07814
11857I238751m70520l97012l66531l14887k67799k37151k34531k78029k05617
11848F466674k34069k11960j45751k09270k02628j69176q7225j33990j75670j95054
11838D701881j18420q3743j13137n4304q1036r0097j04857j85240p416n3965j70268
$$ plain form
11827 3639398 3593814 3535359 3408992 3320528 3338409 3265905 3219955 3155573 3015179 2965053 2915367
11816 2915367 2831152 2689480 2554084 2437963 2324574 2200312 2177834 2133766 2024180 2046652
11806 2046652 2000938 1937047 1901594 1975485 1951420 1869118 1761318 1674768 1665219 1625899 1626780 1565694
11794 1565694 1528427 1446279 1404250 1366422 1374996 1305930 1225375 1221936 1260337 1219689 1178043 1145024
11782 1145024 1102356 1192289 1164868 1147211 1128252 1131399 1089385 1080798 1099036 1133175 1153158 1123371
11770 1123371 1087120 1068906 1004126 918064 832693 840742 819122 810884 841612 857688 786317 790185
11758 790185 754424 757476 763526 712540 692134 618849 635112 706930 751392 732438 770741 802683
11746 802683 806346 761295 779191 723396 650533 633640 609848 664164 687389 629914 604623 627839
$$ packed form
11827C639398m5584n8455j26367q8464J7881p2504m5950o4382j40394n0126m9686
11816B915367q4215j41672j35396j16121j13389j24262k2478m4068j09586K2472
11806B046652m5714o3891l5453P3891k4065q2302j07800q6550r549l9320Q81o1086
11794A565694l7267q2148m2029l7828Q574o9066q0555l439L8401m0648m1646l3019
11782A145024m2668Q9933k7421j7657j8959L147m2014q587J8238L4139J9983k9787
11770A123371l6251j8214o4780q6062q5371Q049k1620q238L0728J6076p1371L868
11758G90185l5761L052O050n0986k0406p3285J6263P1818M4462j8954L8303L1942
11746H02683L663m5051J7896n5795p2863j6893k3792N4316K3225n7475k5291K3216
$$ plain form
11734 627839 625328 617329 593584 539196 519897 454398 376026 427954 516410 523661 501652 473027
11722 473027 421223 409409 378344 346215 365131 389286 417619 413749 383370 325042 337202 437855
11710 437855 394284 399589 317481 241717 239774 224385 266770 322475 365966 373826 322250 274337
11698 274337 268472 325915 317790 317132 266474 243927 209207 200014 209901 135240 106230 117699 84213
11685 84213 119763 154649 128263 95940 97081 63907 112427 153275 218411 201047 210811 160696
11673 160696 170801 138058 91502 100942 72263 144826 166221 146553 125578 79314 42760 47363
11661 47363 103007 159262 208296 174827 132720 171762 210972 132949 49921 90937 135897 174270
11649 174270 219773 221245 167245 142434 104006 87964 17181 -45472 2975 86747 82739 116091
$$ packed form
11734F27839k511p999k3745n4388j9299o5499p8372N1928Q8456P251k2009k8625
11722D73027n1804j1814l1065l2129J8916K4155K8333l870l0379n8328J2160J00653
11710D37855m3571N305q2108p5764j943j5389M2385N5705M3491P860n1576m7913
11698B74337n865N7443q125o58n0658k2547l4720r193R887p4661k9010J1469l3486
11685H4213L5550L4886k6386l2323J141l3174M8520M0848O5136j7364R764n0115
11673A60696J0105l2743m6556R440k8679P2563K1395j9668k0975m6264l6554M603
11661D7363N5644N6255M9034l3469m2107L9042L9210p8023q3028M1016M4960L8373
11649A74270M5503J472n4000k4811l8428j6042p0783o2653M8447Q3772m008L3352
$$ plain form
11637 116091 172967 226400 165186 72740 49035 46357 91298 80732 56546 71465 94478 62712
11625 62712 50505 103588 66309 27151 13057 -30508 -82201 -53339 -11046 -14090 -6665 36892
11613 36892 52104 18603 4753 -13816 21524 47281 42458 53565 106584 169099 157763 72363
11601 72363 75829 105306 134635 127442 63264 45894 87213 87641 71012 49293 61846 147419
11589 147419 169088 115175 55807 9830 6498 -17268 70630 116490 123567 118822 26043 24650
11577 24650 82966 116937 105668 114621 41155 84573 140783 181079 121137 36962 12805 4269
11565 4269 -39753 -13330 37162 143988 102537 7391 -10213 -18766 14455 -3019 24598 19900
11553 19900 -36795 3775 81104 24927 -8025 48210 69570 79471 93707 158360 155827 171929
$$ packed form
11637A16091N6876N3433o1214r2446k3705k678M4941j0566k4186J4919K3013l1766
11625F2712j2207N3083l7279l9158j4094m3565n1693K8862M2293l044P425M3557
11613C6892J5212l3501j3850j8569L5340K5757m823J1107N3019O2515j1336q5400
11601G2363L466K9477K9329p193o4178j7370M1319M28j6629k1719J2553Q5573
11589A47419K1669n3913n9368m5977l332k3766Q7898M5860P077m745r2779j393
11577B4650N8316L3971j1269Q953p3466M3418N6210M0296n9942q4175k4157q536
11565D269m4022K6423N0492J06826m1451r5146j7604q553L3221j7474K7617m698
11553A9900n6695M0570P7329n6177l2952N6235K1360R901J4236O4653k533J6102
$$ plain form
11541 171929 155067 94799 57890 3747 25871 1286 24405 54024 -40814 -44465 -64372 -42335
11529 -42335 34642 12556 -28444 -104116 -149745 -137351 -93580 -86047 -69196 24587 -29764 -64826
11517 -64826 -18613 29324 149855 189840 98985 48558 -25516 7723 33034 66717 110485
11506 110485 115588 104243 15707 22846 -21231 -72989 -48651 -3261 70819 57085 77431 190756
11494 190756 243502 244477 193365 118048 71927 48394 47478 16687 -10751 11954 76311 100742
11482 100742 149812 101317 111869 138889 36255 -88794 -88843 -3274 -46853 -47261 -4759 31986
11470 31986 17403 5693 35300 87915 80368 -34063 -51235 34405 109093 108413 66343 18530
11458 18530 48978 79265 81635 100419 67649 26035 -89957 -65937 -40350 -27104 -37721 -30311
$$ packed form
11541A71929j6862o0268l6909n4143K2124k4585K3119K9619r4838l651j9907K2037
11529d2335P6977k2086m1000p5672m5629J2394M3771P533J6851R3783n4351l5062
11517f4826M6213M7937J20531L9985r0855n0427p4074L3239K5311L3683M3768
11506A10485N103j1345q8536P139m4077n1758K4338M5390P4080j3734K0346J13325
11494A90756N2746R75n1112p5317m6121k3533r16l0791k7438K2705O4357K4431
11482A00742M9070m8495J0552K7020j02634j25049m9Q5569m3579m08M2502L6745
11470C1986j4583j1710K9607N2615p547j14431j7172Q5640P4688o80m2070m7813
11458A8530L0448L0287K370J8784l2770m1614j15992K4020K5587J3246j0617P410
$$ plain form
11446 -30311 -54607 15660 37849 15385 -22237 -73591 -26039 58270 78168 66783 60097 54820
11434 54820 27265 57101 87600 43349 5610 -8888 11509 56805 116559 95286 30235 9369
11422 9369 37744 -1801 -20325 26007 68819 -462 -12280 2064 7119 -6007 -16688 -41855
11410 -41855 -47610 -75051 -96556 -105773 -133510 -131203 -54350 390 17788 -34573 -25767 49484
11398 49484 29327 16585 23878 26574 25892 41436 67311 54021 88188 77394 83668 126225 109553
11385 109553 69765 92043 130663 158075 180852 195716 182338 89588 111408 149473 100594
11374 100594 114142 140875 114920 77755 72640 78134 36335 -35839 -47242 -106362 -129534 -34243
11362 -34243 79304 43489 42052 14880 44893 87034 88216 63770 62427 113323 161661 192681
$$ packed form
11446c0311k4296P0267K2189k2464l7622n1354M7552Q4309J9898j1385o686n277
11434E4820k7555K9836L0499m4251l7739j4498K0397M5296N9754k1273o5051k0866
11422I369K8375l9545j8524M6332M2812o9281j1818J4344N055j3126j0681k5167
11410d1855n755k7441k1505r217k7737K307P6853N4740J7398n2361Q806P5251
11398D9484k0157j2742P293K696o82J5544K5875j3290L4167j0794O274M2557j6672
11385A09553l9788K2278L8620K7412K2777J4864j3378r2750K1820L8065m8879
11374A00594J3548K6733k5955l7165n115N494m1799p2174j1403n9120k3172R5291
11362c4243J13547l5815j437k7172L0013M2141J182k4446j343N0896M8338L1020
$$ plain form
11350 192681 172140 159127 112879 88011 159316 231999 254846 180672 128913 136968 118794 83070
11338 83070 59275 -8403 -28879 48375 67938 76556 53941 53270 59709 82344 131045 137285 103015
11325 103015 22129 69391 95974 30275 38653 111928 92930 85328 80583 56062 33620 30479
11313 30479 46808 69457 102610 121426 83735 47369 28454 7271 49906 31909 -24716 -76695
11301 -76695 17099 80828 -7201 -20513 -24304 -63784 -48578 -50259 63587 132000 158805 78133
11289 78133 85304 65256 98954 100314 148673 57845 -5987 -34537 -41091 -78190 -97822 -144680
11277 -144680 -59878 4798 62913 77638 83940 78966 71536 70327 93975 54992 53954 27692
11265 27692 -28151 -13896 85297 76278 40612 101539 168973 136837 136439 122066 67584 11125
$$ packed form
11350A92681k0541j3013m6248k4868P1305P2683K2847p4174n1759Q055j8174l5724
11338H3070k3795o7678k0476P7254J9563Q618k2615o71O439K2635M8701O240l4270
11325A03015q0886M7262K6583o5699Q378P3275j8998p602m745k4521k2442l141
11313C0479J6329K2649L3153J8816l7691l6366j8915k1183M2635j7997n6625n1979
11301g6695R3794O3729q8029j3312l791l9480J5206j681J13846O8413K6805q0672
11289G8133P171k0048L3698J360M8359r0828o3832k8550o554l7099j9632m6858
11277a44680Q4802O4676N8115J4725O302m974p430j209K3648l8983j038k6262
11265B7692n5843J4255R9193r019l5666O0927O7434l2136l98j4373n4482n6459
$$ plain form
11253 11125 -31706 -95800 -72271 -47252 2429 61760 116686 134888 121881 59145 27501 43833
11241 43833 118024 60435 -51738 -86992 -40861 -60417 -71006 -95477 -107784 -13441 101488
11230 101488 104336 135650 98834 44666 73581 169619 173639 147080 99489 100648 59352 20766
11218 20766 13151 21142 18634 -25740 -22351 -13900 43772 95490 73774 11603 11206 51696 32001
11205 32001 21934 -16817 -35591 -47809 93 60248 33156 59069 107430 64653 44659 98874
11193 98874 145429 63905 -33287 -50261 -91485 -145671 -139934 -99770 -41650 36651 60006 143469
11181 143469 203396 230573 231340 106319 35002 26404 31709 24617 40121 15284 -11403 -11951 47504
11168 47504 57733 31772 5615 -48553 -73784 -5661 -63837 -99271 -34836 75423 41481
$$ packed form
11253A1125m2831o4094K3529K5019M9681N9331N4926J8202j3007o2736l1644J6332
11241D3833P4191n7589j12173l5254M6131j9556j0589k4471j2307R4343J14929
11230A01488K848L1314l6816n4168K8915R6038M020k6559m7591J159m1296l8586
11218B0766p615P991k508m4374L389Q451N7672N1718k1716o2171l97M0490j9695
11205C2001j0067l8751j8774j2218M7902O0155k7092K5913M8361m2777j9994N4215
11193I8874M6555q1524r7192j6974m1224n4186N737M0164N8120P8301K3355Q3463
11181A43469N9927K7177P67j25021p1317q598N305p092J5504k4837k6687n48N9455
11168D7504J0229k5961k6157n4168k5231O8123n8176l5434O4435J10259l3942
$$ plain form
11157 41481 27128 50550 32703 31088 52045 89691 99912 58032 40746 21418 -26130 -20206
11145 -20206 -33020 -39127 33390 51779 -11344 -47134 -58010 -1965 -28194 -79094 -63239 -75744
11133 -75744 -69518 -51150 -70933 -56285 65362 78035 22041 -30650 -40446 -56046 -26089 58847
11121 58847 135438 172861 76922 49765 22402 -27289 -33377 -106300 -87793 -48607 -5042 -60448
11109 -60448 -51131 -5933 -7354 65342 71692 61253 64732 44686 7795 83106 91951 102038 133816
11096 133816 123277 87666 135970 110153 74007 -6986 -26076 8185 -32675 -98156 -73013
11085 -73013 -66043 -64475 -23680 -21322 -43784 -39037 -27756 -7790 -60334 -45358 26657 38464
11073 38464 27851 119712 109049 120296 110144 86890 13992 -17708 -41256 2342 49643 113076
$$ packed form
11157D1481j4353K3422j7847j615K0957L7646J0221m1880j7286j9328m7548N924
11145b0206j2814o107P2517J8389o3123l5790j0876N6045k6229n0900J5855j2505
11133g5744O226J8368j9783J4648J21647J2673n5994n2691r796j5600K9957Q4936
11121E8847P6591L7423r5939k7157k7363m9691o088p2923J8507L9186M3565n5406
11109f0448R317M5198j421P2696O350j0439L479k0046l6891P5311Q845J0087L1778
11096A33816j0539l5611M8304k5817l6146q0993j9090L4261m0860o5481K5143
11085g3013O970J568M0795K358k2462M747J1281J9966n2544J4976P2015J1807
11073C8464j0613R1861j0663J1247j0152k3254p2898l1700k3548M3598M7301O3433
$$ plain form
11061 113076 116927 129701 125189 95031 97879 75416 52839 60908 81607 112544 127990 45524
11049 45524 74040 126747 138453 79939 141856 112128 85238 135527 156233 99726 89675 104522
11037 104522 193521 261172 268826 224078 165073 197158 219786 243399 315289 293990 380190 454146
11025 454146 472024 495996 461028 427732 361915 351093 372270 397511 350589 370152 451978
11014 451978 506861 572695 560941 537779 488026 487387 487006 419560 370056 359282 305047 292890
11002 292890 359721 366615 269516 294747 261105 165764 141797 156562 193074 183704 159943 128257
10990 128257 125894 173716 239343 249633 204780 177906 169471 180869 163067 187544 201276 136627
10978 136627 131908 159721 147442 110663 158910 184467 148883 182221 188350 152140 125556 127975
$$ packed form
11061A13076L851J2774m512l0158K848k2463k2577Q069K0699L0937J5446q2466
11049D5524K8516N2707J1706n8514O1917k9728k6890N0289K0706n6507j0051J4847
11037A04522Q8999O7651P654m4748n9005L2085K2628K3613P1890k1299Q6200P3956
11025D54146J7878K3972l4968l3296o5817j0822K1177K5241m6922J9563Q1826
11014D51978N4883O5834j1754k3162m9753o39l81o7446m9504j0774n4235j2157
11002B92890O6831O894r7099K5231l3642r5341k3967J4765L6512r370k3761l1686
10990A28257k363M7822O5627J0290m4853k6874q435J1398j7802K4477J3732o4649
10978A36627m719K7813j2279l6779M8247K5557l5584L3338O129l6210k6584K419
$$ plain form
10966 127975 73895 52976 114423 104329 100005 130827 123896 202625 232728 187771 178607 111275
10954 111275 148229 152467 106022 99218 110086 63854 85180 109697 201141 303930 256076 174147
10942 174147 107158 84667 31473 24079 39000 7647 -22672 23170 39361 51680 8363 11141
10930 11141 29034 7428 -2192 -14424 18829 -11123 -50563 -63398 -14666 -49875 -37143 574
10918 574 27485 12854 8997 -1640 -46270 -62722 -20317 -36316 -56434 42334 54396 108876
10906 108876 117013 88461 155805 136551 80055 71866 81891 100405 141651 123101 67413 67850
10894 67850 82605 139315 134717 138533 68468 -14342 -69952 -38156 57540 50816 15977 46223
10882 46223 42603 35673 12855 5497 46583 43490 40629 29572 53604 129856 89886 65045 42209
$$ packed form
10966A27975n4080k0919O1447j0094m324L0822o931P8729L0103m4957r164o7332
10954A11275L6954M238m6445o804J0868m6232K1326K4517R1444J02789m7854q1929
10942A74147o6989k2491n3194p394J4921l1353l0319M5842J6191J2319m3317K778
10930A1141J7893k1606r620j2232L3253k9952l9440j2835M8732l5209J2732L7717
10918E74K6911j4631l857j0637m4630j6452M2405j5999k0118R8768J2062N4480
10906A08876Q137k8552O7344j9254n6496q189J0025J8514M1246j8550n5688M37
10894F7850J4755N6710m598L816p0065q2810n5610L1796R5696o724l4839L0246
10882D6223l620o930k2818p358M1086l093k861j1057K4032P6252l9970k4841k2836
$$ plain form
10869 42209 53083 60522 67084 104136 134416 139089 34081 40173 91489 116858 144904 177579
10857 177579 189134 126257 32508 43750 126197 166284 98293 -12682 -54823 -7755 17983
10846 17983 32119 86504 93963 205118 210402 130830 122065 174206 190560 141320 98592 182466
10834 182466 176088 148335 113211 127637 145919 150955 160840 129204 159494 191991 158057 174102
10822 174102 116579 81289 96977 85248 54616 58839 47676 443 -26963 66849 120192 155168
10810 155168 187307 225600 167724 183368 127892 76690 104646 151908 242405 247877 263292 270071
10798 270071 153997 93536 82348 115619 155976 158748 36579 24214 114412 162102 112058
10787 112058 95693 132570 172554 111112 106622 147012 232686 200405 148269 120173 85938 -19854
$$ packed form
10869D2209J0874P439O562L7052L0280M673j05008O092N1316K5369K8046L2675
10857A77579J1555o2877r3749J1242Q2447M0087o7991j10975m2141M7068K5738
10846A7983J4136N4385P459J11155N284p9572q765N2141J6354m9240m2728Q3874
10834A82466o378k7753l5124J4426J8282N036R885l1636L0290L2497l3934J6045
10822A74102n7523l5290J5688j1729l0632M223j1163m7233k7406R3812N3343L4976
10810A55168L2139L8293n7876J5644n5476n1202K7956M7262R0497N472J5415O779
10798B70071j16074o0461j1188L3271M0357K772j22169j2365R0198M7690n0044
10787A12058j6365L6877L9984o1442m490M0390Q5674l2281n2136k8096l4235j05792
$$ plain form
10775 -19854 27456 57643 58438 12866 -19592 -13398 40629 84083 47740 69933 133523 85723
10763 85723 67181 47475 110827 100215 74482 37545 17524 60546 107181 82547 101930 117618
10751 117618 167724 222205 204974 133479 100723 99934 118816 100331 45151 -44010 -17942 -2666
10739 -2666 18235 34301 7314 28606 99385 124352 110911 145279 89185 62113 59301 118349
10727 118349 129152 120499 73586 105816 88565 76826 169493 169871 149924 246827 272071 264670
10715 264670 222245 236055 205569 228021 145534 70519 57712 114043 114674 157277 185736 130038
10703 130038 97435 154730 147554 96251 91210 208280 312108 299707 213136 246391 204314
10692 204314 127243 96565 137779 173702 127358 126406 104920 154775 220188 203226 257766 252839
$$ packed form
10775a9854M7310L0187P95m5572l2458O194N4027M3454l6343K2193O3590m7800
10763H5723j8542j9706O3352j0612k5733l6937k0021M3022M6635k4634J9383J5688
10751A17618N0106N4481j7231p1495l2756p89J8882j8485n5180q9161K6068J5276
10739b666K0901J6066k6987K1292P0779K4967j3441L4368n6094k7072k812N9048
10727A18349J0803q653m6913L2230j7251j1739R2667L78j9947R6903K5244p401
10715B64670m2425J3810l0486K2452q2487p5015j2807N6331O31M2603K8459n5698
10703A30038l2603N7295p176n1303n041J17070J03828j2401q6571L3255m2077
10692B04314p7071l0678M1214L5923m6344r52k1486M9855O5413j6962N4540m927
$$ plain form
10680 252839 212726 254728 371781 412002 344835 357194 321194 280945 313845 292594 320510
10669 320510 386184 391929 348590 294506 281054 231122 200476 265823 373451 434940 432725 409418
10657 409418 318596 349855 357886 375549 380947 463289 506253 491601 485789 551523 590087 614888
10645 614888 684488 598151 522591 582152 688873 722512 726301 747397 736914 772790 795297
10634 795297 848660 926515 1118277 1166501 1177141 1282791 1431604 1553977 1646045 1825223
10624 1825223 2036673 2190562 2394403 2650763 2910348 3229754 3666191 4239120 5029444
10615 5029444 6126617 7431617 9170826 11364286 13967296 16755843 19591099 22292823
10607 22292823 24754625 26441321 27080461 26971948 26994765 27862239 29936555 33299183 37633944
$$ packed form
10680B52839m0113M2002J17053M0221o7167J2359l6000m0249L2900k1251K7916
10669C20510O5674N745m3339n4084j3452m9932l0646O5347J07628O1489k215k3307
10657D09418r0822L1259Q031J7663N398Q2342M2964j4652n812O5734L8564K4801
10645F14888O9600q6337p5560N9561J06721L3639L789K1096j0483L5876K2507
10634G95297N3363P7855J91762M8224J0640J05650J48813J22373R2068J79178
10624A825223K11450J53889K03841K56360K59585L19406M36437N72929P90324
10615E029444J097173J305000J739209K193460K603010K788547K835256K701724
10607B2292823K461802J686696O39140j08513K2817Q67474K074316L362628M334761
$$ plain form
10598 37633944 42371176 47151739 51867128 55859932 57842506 56976145 54162249 51594810
10590 51594810 50707754 52098393 55715489 60675191 66148220 71454287 76409397 79990173
10582 79990173 80048660 75640819 68640760 61885157 57272316 55134748 55100577 56479681 58413743
10573 58413743 60306387 61899356 62561238 60725322 56013837 49737630 43961365 39760663
10565 39760663 37187521 35841629 35262921 35165688 35109226 34789627 33928961 31977605 29012174
10556 29012174 25478149 22166773 19479558 17419727 15810068 14550734 13520161 12683122
10548 12683122 11999996 11416737 10954591 10518846 9965643 9504728 9139227 8867954 8590168
10539 8590168 8201145 7982418 7765090 7534355 7327317 7134634 6903789 6810387 6721859 6587364
$$ packed form
10598C7633944M737232M780563M715389L992804J982574q66361k813896k567439
10590E1594810q87056J390639L617096M959702N473029N306067M955110L580776
10582G9990173N8487m407841p000059o755603m612841k137568l4171J379104J934062
10573E8413743J892644J592969O61882j835916m711485o276207n776265m200702
10565C9760663k573142j345892n78708r7233n6462l19599q60666j951356k965431
10556B9012174l534025l311376k687215k059831j609659j259334j030573q37039
10548A2683122o83126n83259m62146m35745n53203m60915l65501k71273k77786
10539H590168l89023k18727k17328k30735k07038j92683k30845r3402q8528j34495
$$ plain form
10529 6587364 6304892 5988878 5790286 5631660 5457073 5334919 5178992 5044493 4864803
10520 4864803 4750882 4629874 4541859 4388861 4308617 4205338 4197186 4139859 4016169 3910942
10510 3910942 3705977 3560859 3484865 3465470 3373960 3396286 3379171 3313948 3219673 3110451 2965843
10499 2965843 2864646 2803917 2791551 2712591 2681031 2621369 2566307 2521666 2450544 2343588 2292548
10488 2292548 2280738 2275589 2197901 2163911 2117886 2011790 1926115 1857559 1747569 1642656 1650806
10477 1650806 1677738 1652119 1624132 1575962 1497072 1458143 1459451 1455282 1331111 1210346 1212436
10466 1212436 1234085 1267543 1249431 1250985 1231267 1152440 1191327 1184251 1150347 1122573 1062978 1056423
10454 1056423 1034793 1083704 1129933 1128415 1123310 1064614 932599 939224 976313 944771 903629 900785
$$ packed form
10529F587364k82472l16014j98592j58626j74587j22154j55927j34499j79690
10520D864803j13921j21008q8015j52998q0244j03279q152n7327j23690j05227
10510C910942k04965j45118p5994j9395r1510K2326j7115o5223r4275j09222j44608
10499B965843j01197o0729j2366p8960l1560n9662n5062m4641p1122j06956n1040
10488B292548j1810n149p7688l3990m6025j06096q5675o8556j09990j04913Q150
10477A650806K6932k5619k7987m8170p8890l8929J308m169j24171j20765K090
10466A212436K1649L3458j8112J554j9718p8827L8887p076l3904k7774n9595o555
10454A056423k1630M8911M6229j518n105n8696j32015O625L7089l1542m1142k844
$$ plain form
10442 900785 832704 805512 731309 697568 678830 677953 737303 700393 633417 629995 689030 694095
10430 694095 701486 731753 642210 612049 700153 837774 909764 765285 612735 581104 630645
10419 630645 661014 707150 669147 665203 677802 696314 670051 571403 516093 475612 427702 468391
10407 468391 480665 517843 494706 469287 468994 410630 383117 434227 443029 414357 399477 442355
10395 442355 480359 463391 403349 351139 240920 287064 386212 393822 377160 358148 384066
10384 384066 384486 318683 298379 393767 421381 359433 319300 324094 377719 302028 206468 212027
10372 212027 262026 264575 284096 288886 235913 157533 188987 203929 187352 142227 150380 198487
10360 198487 239718 343627 348390 325577 255439 185863 153554 184598 242347 287187 252482
$$ packed form
10442I00785o8081k7192p4203l3741j8738q77N9350l6910o6976l422N9035N065
10430F94095P391L0267q9543l0161Q8104J37621P1990j44479j52550l1631M9541
10419F30645L0369M6136l8003l944J2599J8512k6263r8648n5310m0481m7910M0689
10407D68391J2274L7178k3137k5419k93n8364k7513N1110Q802k8672j4880M2878
10395D42355L8004j6968o0042n2210j10219M6144R9148P610j6662j9012K5918
10384C84066M20o5803k0304R5388K7614o1948m0133M794N3625p5691r5560N559
10372B12027M9999K549J9521M790n2973p8380L1454J4942j6577m5125Q153M8107
10360A98487M1231J03909M763k2813p0138o9576l2309L1044N7749M4840l4705
$$ plain form
10349 252482 165808 105815 133037 180253 242320 226470 270517 277760 201333 209215 203610 184740
10337 184740 161096 192992 198327 200169 183811 216278 312941 307422 242347 181351 202354 173998
10325 173998 130370 230805 308801 275898 237627 308620 360445 318094 182401 142170 171533
10314 171533 215002 221184 230425 243544 160641 169787 170104 195181 268213 335238 305778 272708
10302 272708 209353 251742 226464 146168 186259 180415 198509 190307 262152 348228 390232 356792
10290 356792 276614 284688 295314 295914 275992 270856 305363 268224 223262 244869 216300 182468
10278 182468 184520 265734 269498 245476 258316 242843 167843 145136 148304 255107 215895 121056
10266 121056 89013 133542 139764 127982 156032 186028 232271 196632 155769 173964 191571 313953
$$ packed form
10349B52482q6674n9993K7222M7216O2067j5850M4047P243p6427P882n605j8870
10337A84740k3644L1896N335J842j6358L2467R6663n519o5075o0996K1003k8356
10325A73998m3628J00435P7996l2903l8271P0993N1825m2351j35693m0231K9363
10314A71533M3469O182R241J3119q2903R146L17K5077P3032O7025k9460l3070
10302B72708o3355M2389k5278q0296M0091n844J8094q202P1845Q6076M2004l3440
10290C56792q0178Q074J0626O00j9922n136L4507l7139m4962K1607k8569l3832
10278A82468K052Q1214L764k4022J2840j5473p5000k2707L168J06803l9212r4839
10266A21056l2043M4529O222j1782K8050K9996M6243l5639m0863J8195J7607J22382
$$ plain form
10254 313953 357670 311015 242523 169495 193163 260714 280459 307124 211260 115887 124990 179214
10242 179214 165697 165502 221667 210314 188943 215406 214289 256801 276984 310996 347012 298746
10230 298746 309606 198659 123036 127595 126477 102093 71703 148555 155940 110396 133047 194753
10218 194753 201239 187505 174697 140307 160545 232531 265763 340690 368190 345327 295654 184656
10206 184656 227746 320908 340393 304948 273495 270372 275774 305269 379205 333371 208496 230416
10194 230416 272804 285783 260811 217798 199549 206978 261802 293144 318553 258061 254522 283124
10182 283124 311399 211739 188209 205512 210782 160332 182653 184430 236580 340858 373257 378848
10170 378848 445093 458247 455428 392113 398858 417719 457102 460865 502150 557290 592384 562074
$$ packed form
10254C13953M3717m6655o8492p3028K3668O7551J9745K6665r5864r5373R103N4224
10242A79214j3517j95N6165j1353k1371K6463j117M2512K0183L4012L6016m8266
10230B98746J0860j10947p5623M559j118k4384l0390P6852P385m5544K2651O1706
10218A94753O486j3734j2808l4390K0238P1986L3232P4927K7500k2863m9673j10998
10206A84656M3090R3162J9485l5445l1453l123N402K9495P3936m5834j24875K1920
10194B30416M2388J2979k4972m3013j8249P429N4824L1342K5409o0492l539K8602
10182B83124K8275r9660k3530J7303N270n0450K2321J777N2150J04278L2399N591
10170C78848O6245J3154k819o3315O745J8861L9383L763M1285N5140L5094l0310
$$ plain form
10158 562074 609406 667184 710561 716925 686351 663182 684766 739901 752950 821972 855792 918690
10146 918690 943490 882948 782803 714888 754462 737701 767714 745190 796233 797637 808485
10135 808485 862556 862449 847640 886977 922821 943560 933437 936789 941513 927171 1001466 978434
10123 978434 931143 992542 1043215 997467 911486 877165 883042 903460 946580 1024667 978066 909763
10111 909763 895364 969876 1057129 1123328 1082432 1074146 1038319 1011896 1020299 1060840 1075026 990546
10099 990546 898354 930521 1051862 1108405 1122701 1081042 1015443 909201 915484 1005121 1021185
10088 1021185 1025047 1036486 1065776 993024 973235 979020 999149 953175 980934 985909 987982 1001484
10076 1001484 900724 817798 751829 784861 763683 753849 795481 802458 804981 799494 723583 677827
$$ packed form
10158E62074M7332N7778M3377O364l0574k3169K1584N5135J3049O9022L3820O2898
10146I18690K4800o0542j00145o7915L9574j6761L0013k2524N1043J404J0848
10135H08485N4071j07j4809L9337L5844K0739j0123L352M724j4342P4295k3032
10123I78434m7291O1399N0673m5748q5981l4321N877K0418M3120P8087m6601o8303
10111I09763j4399P4512Q7253O6199m0896q286l5827k6423Q403M0541J4186q4480
10099I90546r2192L2167J21341N6543J4296m1659o5599j06242O283Q9637J6064
10088A021185L862J1439K9290p2752j9789N785K0129m5974K7759M975K073J3502
10076A001484j00760q2926o5969L3032k1178r834M1632O977K523n487p5911m5756
$$ plain form
10064 677827 704952 698466 598062 565978 622627 597291 630052 591351 539699 513246 563410
10053 563410 513239 437935 434553 434730 515735 551377 501005 388045 371674 440098 503723 551980
10041 551980 597697 591635 491550 442850 395126 403758 380355 336862 304094 338921 369919 374657
10029 374657 350205 417654 499944 500603 418362 407900 433361 427853 400940 389097 410162 421619
10017 421619 340162 350813 373268 330111 307066 279580 283035 296547 294388 256693 307253 368984
10005 368984 380484 396200 399466 448449 452664 386505 424183 413529 337672 342171 328470 257895
9993 257895 312900 277069 257592 258864 248131 209933 254207 367513 418549 345923 342601 305380
9981 305380 316645 398877 375001 404295 454641 395489 395133 413030 436057 411449 403998 380339
$$ packed form
10064F77827K7125o486j00404l2084N6649k5336L2761l8701n1652k6453N0164
10053E63410n0171p5304l382J77Q1005L5642n0372j12960j6371O8424O3625M8257
10041E51980M5717o062j00085m8700m7724Q632k3403m3493l2768L4827L0998M738
10029C74657k4452O7449Q2290O59q2241j0462K5461n508k6913j1843K1065J1457
10017D21619q1457J0651K2455m3157k3045k7486L455J3512k159l7695N0560O1731
10005C68984J1500J5716L266M8983M215o6159L7678j0654p5857M499j3701p0575
9993B57895N5005l5831j9477J272j0733l8198M4274J13306N1036p2626l322l7221
9981C05380J1265Q2232k3876K9294N0346n9152l56J7897K3027k4608p451k3659
$$ plain form
9969 380339 455691 478650 454734 485176 481488 407935 407288 421548 365284 323235 376289 405309
9957 405309 460901 457226 463544 492574 511310 406778 383534 455483 554617 508237 526487 536890
9945 536890 570583 646908 615486 622770 637103 597196 612621 673506 673779 617201 636061 611218
9933 611218 555910 623153 672905 686529 692046 754331 861410 914585 911915 919909 945994 921366
9921 921366 942009 859794 804988 780251 791775 707421 685835 741978 642263 638067 709516 741892
9909 741892 733593 747892 728664 710789 681328 725033 734772 768970 797297 816871 769440 705252
9897 705252 696856 716642 730093 694639 676028 717686 755754 712584 572467 567625 615005 644744
9885 644744 645690 633450 643485 620185 668287 683532 650768 667631 781372 821435 869123 882135
$$ packed form
9969C80339P5352K2959k3916L0442l688p3553o47J4260n6264m2049N3054K9020
9957D05309N5592l675O318K9030J8736j04532k3244P1949R9134m6380J8250J0403
9945E36890L3693P6325l1422P284J4333l9907J5425O0885K73n6578J8860k4843
9933F11218n5308O7243M9752J3624N517O2285J07079N3175k670P994K6085k4628
9921I21366K0643q2215n4806k4737J1524q4354k1586N6143r9715m196P1449L2376
9909G41892q299J4299j9228j7875k9461M3705R739L4198K8327J9574m7431o4188
9897G05252q396J9786J3451l5454j8611M1658L8068m3170j40117m842M7380K9739
9885F44744R46j2240J0035k3300M8102J5245l2764J6863J13741M0063M7688J3012
$$ plain form
9873 882135 839894 809688 774603 742636 676919 744634 805693 738043 688719 750018 754000 700176
9861 700176 686488 707588 700471 678521 705191 706780 689351 734447 767871 799486 772684 711008
9849 711008 730590 759617 827174 850062 818383 764164 736713 744835 721801 781725 781249 743040
9837 743040 745885 749752 753726 778392 817367 822453 815233 872307 901944 940441 955348 1041920 1107791
9824 1107791 1137546 1113522 1185366 1298652 1257309 1308820 1414191 1532622 1703289 1806624
9814 1806624 1984854 2138719 2280124 2373431 2487823 2646375 2689272 2700237 2769758 2942674
9804 2942674 3048865 3072376 3104261 3135383 3213110 3295060 3379089 3389844 3430333 3521005 3534497
9793 3534497 3578841 3670285 3725898 3846800 3976432 4036368 4108108 4166811 4223339 4189641 4096407
$$ packed form
9873H82135m2241l0206l5085l1967o5717O7715O1059o7650m9324O1299L982n3824
9861G00176j3688K1100p117k1950K6670J589j7429M5096L3424L1615k6802o1676
9849G11008J9582K9027O7557K2888l1679n4219k7451Q122k3034N9924m76l8209
9837G43040K845L867L974K4666L8975N086p220N7074K9637L8497J4907Q6572O5871
9824A107791K9755k4024P1844J13286m1343N1511J05371J18431J70667J03335
9814A806624J78230J53865J41405R3307J14392J58552M2897J0965O9521J72916
9804B942674J06191K3511L1885L1122P7727Q1950Q4029J0755M0489R0672J3492
9793C534497M4344R1444N5613J20902J29632N9936P1740N8703N6528l3698r3234
$$ plain form
9782 4096407 4106566 4021402 3884860 3844436 3786086 3664217 3574244 3565376 3508151 3488987 3485385
9771 3485385 3478347 3527182 3483301 3526370 3546808 3669031 3867403 4044876 4263418 4562990 4912643
9760 4912643 5170651 5406192 5725815 6112869 6570171 7086564 7600086 8175731 8752949 9252786
9750 9252786 9889594 10588777 11249000 12008717 12822567 13770596 14883948 16071438 17326082
9741 17326082 18660720 20123374 21717189 23430945 25272350 27197673 29160732 31247757
9733 31247757 33336697 35394541 37413616 39528911 41711777 43816458 45904642 48031103
9725 48031103 50190227 52542206 54943176 57508623 60357617 63306030 66549661 69927348
9717 69927348 73510486 77238452 80972239 84703286 88283775 91808133 95214127 98334192
$$ packed form
9782D096407J0159q5164j36542m0424n8350j21869q9973q868n7225j9164l602
9771C485385p038M8835m3881M3069K0438J22223J98372J77473K18542K99572L49653
9760D912643K58008K35541L19623L87054M57302N16393N13522N75645N77218M99837
9750I252786O36808O99183O60223P59717Q13850R48029J113352J187490J254644
9741A7326082J334638J462654J593815J713756J841405J925323J963059K087025
9733C1247757K088940K057844K019075K115295K182866K104681K088184K126461
9725D8031103K159124K351979K400970K565447K848994K948413L243631L377687
9717F9927348L583138L727966L733787L731047L580489L524358L405994L120065
$$ plain form
9709 98334192 101183449 103853988 106364860 108575972 110620564 112585499 114420842 116292926
9701 116292926 118355816 120657080 123084993 125597542 128200318 130905812 133732121 136435371
9693 136435371 138876347 141021914 142727950 144022818 144762007 145036739 144855222 144318557 143435370
9684 143435370 142319271 141127955 139866901 138636436 137582555 136595943 135673263 134806656
9676 134806656 134016467 133273575 132445970 131475604 130312431 128964430 127222179 125166419 122867258
9667 122867258 120270394 117409927 114288644 110953272 107454285 103928355 100533456 97385320
9659 97385320 94355315 91466841 88838194 86295844 83796738 81457554 79064270 76691424
9651 76691424 74423973 72133603 69804258 67408388 64938098 62406469 59847315 57342909
$$ packed form
9709I8334192K849257K670539K510872K211112K044592J964935J835343J872084
9701A16292926K062890K301264K427913K512549K602776K705494K826309K703250
9693A36435371K440976K145567J706036J294868P39189K74732j81517n36665q83187
9684A43435370j116099j191316j261054j230465j053881r86612r22680q66607
9676A34806656p90189p42892q27605r70366j163173j348001j742251k055760k299161
9667A22867258k596864k860467l121283l335372l498987l525930l394899l148136
9659I7385320l030005k888474k628647k542350k499106k339184k393284k372846
9651G6691424k267451k290370k329345k395870k470290k531629k559154k504406
$$ plain form
9643 57342909 54895586 52533515 50254223 48016037 45869067 43948117 42164538 40406071
9635 40406071 38783888 37243524 35785494 34530121 33296510 32104127 30946606 29741860
9627 29741860 28564077 27369304 26223990 25226589 24166068 23162387 22315781 21468493 20669873
9618 20669873 19810748 19073769 18469438 17922701 17364786 16813699 16313348 15843759 15329056
9609 15329056 14858692 14453175 14095157 13670247 13374337 13082974 12744951 12347735 11957190
9600 11957190 11601861 11342629 11016355 10657205 10355982 10134262 9971850 9648024 9340821
9591 9340821 9056198 8784183 8598341 8410492 8231735 7953958 7790063 7689396 7526715 7392525
9581 7392525 7156953 7024358 6987528 6815793 6605196 6491913 6419419 6311849 6176712 6038706
$$ packed form
9643E7342909k447323k362071k279292k238186k146970j920950j783579j758467
9635D0406071j622183j540364j458030j255373j233611j192383j157521j204746
9627B9741860j177783j194773j145314r97401j060521j003681q46606q47288p98620
9618B0669873q59125p36979o04331n46737n57915n51087n00351m69589n14703
9609A5329056m70364m05517l58018m24910k95910k91363l38023l97216l90545
9600A1957190l55329k59232l26274l59150l01223k21720j62412l23826l07203
9591I340821k84623k72015j85842j87849j78757k77777j63895j00667j62681j34190
9581G392525k35572j32595l6830j71735k10597j13283p2494j07570j35137j38006
$$ plain form
9571 6038706 5918806 5762812 5584452 5503054 5436006 5304447 5139428 4966250 4783457 4717253
9561 4717253 4659744 4623931 4533172 4537472 4546631 4496022 4442668 4425423 4478024 4402826 4329624 4333131
9549 4333131 4267416 4193609 4135026 4094226 3984804 3932519 3910908 3848405 3710350 3653440 3512385
9538 3512385 3487594 3419135 3343612 3298608 3319771 3426864 3379780 3355156 3422937 3512774 3448716
9527 3448716 3347640 3373610 3398892 3474382 3487916 3446367 3426896 3414251 3414462 3434343 3465044 3514001
9515 3514001 3578167 3570113 3566654 3546394 3571102 3585524 3621746 3693132 3842636 3897573 3900323 4010498
9503 4010498 4112463 4147243 4194330 4275511 4316388 4393358 4522778 4636732 4739922 4711829 4754698
9492 4754698 4839749 4788937 4769958 4701176 4694308 4746806 4883693 4864861 4855508 4877474 4935479 4982128
$$ packed form
9571F038706j19900j55994j78360q1398o7048j31559j65019j73178j82793o6204
9561D717253n7509l5813r0759M300R159n0609n3354j7245N2601p5198p3202L507
9549D333131o5715p3807n8583m0800j09422n2285k1611o2503j38055n6910j41055
9538C512385k4791o8459p5523m5004K1163J07093m7084k4624O7781Q9837o4058
9527C448716j01076K5970K5282P5490J3534m1549j9471j2645K11J9881L0701M8957
9515C514001O4166q054l459k0260K4708J4422L6222P1386J49504N4937K750J10175
9503D010498J01965L4780M7087Q1181M0877P6970J29420J13954J03190k8093M2869
9492D754698Q5051n0812j8979o8782o868N2498J36887j8832r353K1966N8005M6649
$$ plain form
9480 4982128 5050614 5060631 5060787 5227050 5327502 5407082 5476998 5466710 5433884 5378196 5380199 5395427
9468 5395427 5418064 5424443 5499763 5533001 5509469 5640927 5778198 5892178 5927951 6014402 6093383
9457 6093383 6145773 6266283 6467763 6577208 6692748 6847303 7051139 7194831 7340091 7550076
9447 7550076 7731065 7980441 8288726 8548917 8910313 9201376 9589396 9988980 10478418 11033238
9437 11033238 11649056 12285306 13007314 13776747 14653830 15709019 16889135 18247448 19854869
9428 19854869 21527367 23286420 25557662 28228752 31260260 34820557 39053230 43942750
9420 43942750 49653409 56442166 64520342 74160625 85916954 100153350 117426574 138120666
9412 138120666 162537699 190949345 223078574 258231562 295338175 332704338 368412285
$$ packed form
9480D982128O8486J0017J56J66263J00452P9580O9916j0288l2826n5688K003J5228
9468E395427K2637O379P5320L3238k3532J31458J37271J13980L5773Q6451P8981
9457F093383N2390J20510K01480J09445J15540J54555K03836J43692J45260K09985
9447G550076J80989K49376L08285K60191L61396K91063L88020L99584M89438N54820
9437A1033238O15818O36250P22008P69433Q77083J055189J180116J358313J607421
9428A9854869J672498J759053K271242K671090L031508L560297M232673M889520
9420D3942750N710659O788757Q078176R640283J1756329J4236396J7273224K0694092
9412A38120666K4417033K8411646L2129229L5152988L7106613L7366163L5707947
$$ plain form
9405 368412285 400632552 427697637 448329990 461907625 468583899 468807523 463685867 454593842
9397 454593842 443286774 431420864 420601778 411985561 406295456 403923851 405004827 409549592
9389 409549592 416884827 426244687 436725269 447171308 456371102 462900090 465480990 462770331
9381 462770331 453743434 438466386 417441331 391819280 363131046 332676737 302110738
9374 302110738 272674288 245437709 221150207 200086868 182124604 166825172 153717686
9367 153717686 142452012 132696804 123988662 116307401 109485702 103367877 97898139 92931431
9359 92931431 88412304 84287073 80547075 77164372 74235411 71606981 69239705 67084181
9351 67084181 65084997 63257123 61643634 60268381 59084856 57993232 57053549 56306990
$$ packed form
9405C68412285L2220267K7065085K0632353J3577635O676274K23624n121656r092025
9397D54593842j1307068j1865910j0819086q616217n690105k371605J080976M544765
9389D09549592P335235R359860J0480582J0446039R199794O528988K580900k710659
9381D62770331r026897j5277048k1025055k5622051k8688234l0454309l0565999
9374C02110738k9436450k7236579k4287502k1063339j7962264j5299432j3107486
9367A53717686j1265674r755208q708142p681261o821699o117825n469738m966708
9359I2931431m519127m125231l739998l382703k928961k628430k367276k155524
9351F7084181j999184j827874j613489j375253j183525j091624r39683p46559
$$ plain form
9343 56306990 55607090 55076539 54700897 54344108 54083505 53897038 53813082 53689952 53566131 53322291
9333 53322291 53039244 52796130 52527270 52317161 52095876 51828454 51449329 51130504 50967953
9324 50967953 50699168 50473051 50308447 50257309 50354680 50504783 50677089 50766664 50810412 50898529
9314 50898529 50949007 50918201 50791419 50422252 49876995 49151987 48402789 47407862 46290689 45110671
9304 45110671 43884703 42636101 41422725 40364042 39278778 38313088 37514727 36846632 36182014
9295 36182014 35511554 34899843 34254929 33583593 32810809 32094364 31407702 30738908 30030476
9286 30030476 29270075 28586341 27888506 27307777 26816453 26477288 26288600 26152361 26123428 26218449
9276 26218449 26443074 26912006 27546269 28346729 29455596 30726617 32255155 34084258 36304676
$$ packed form
9343E6306990o99900n30551l75642l56789k60603j86467q3956j23130j23821k43840
9333E3322291k83047k43114k68860k10109k21285k67422l79125l18825j62551
9324E0967953k68785k26117j64604n1138R7371J50103J72306Q9575M3748Q8117
9314E0898529N0478l0806j26782l69167n45257p25008p49198r94927j117173j180018
9304D5110671j225968j248602j213376j058683j085264r65690p98361o68095o64618
9295C6182014o70460o11711o44914o71336p72784p16445o86662o68794p08432
9286C0030476p60401o83734o97835n80729m91324l39165j88688j36239k8933R5021
9276B6218449K24625M68932O34263Q00460J108867J271021J528538J829103K220418
$$ plain form
9267 36304676 38989942 42047687 45559938 49666055 54209697 59200551 64675926 70566672
9259 70566672 76748663 83073050 89554322 95860897 102072156 108099982 113970204 119727213
9251 119727213 125400981 131057567 136886563 143006836 149639106 156877956 164929077 174001909
9243 174001909 183894230 194460087 205568151 217083920 228672654 239908277 250537592
9236 250537592 260316586 268724684 275620831 280949702 284849445 287500178 289022119 289645378
9228 289645378 289569557 288952763 288146346 287504134 287298061 287630102 288628818 290127261 292153837
9219 292153837 294545040 296975205 299325074 301351159 302575417 302696423 301491445 298865705
9211 298865705 294766116 289342346 282866434 275428421 267328773 258836448 249943221 240858572
$$ packed form
9267C6304676K685266L057745L512251M106117M543642M990854N475375N890746
9259G0566672O181991O324387O481272O306575O211259O027826N870222N757009
9251A19727213N673768N656586N828996O120273O632270P238850Q051121R072832
9243A74001909R892321J0565857J1108064J1515769J1588734J1235623J0629315
9236B50537592R778994Q408098O896147N328871L899743K650733J521941O23259
9228B89645378p5821o16794q06417o42212k06073L32041R98716J498443K026576
9219B92153837K391203K430165K349869K026085J224258J21006j204978k625740
9211B98865705m099589n423770o475912p438013q099648q492325q893227r084649
$$ plain form
9203 240858572 231628802 222366248 213107075 203919479 195101654 186929337 179559656 173039348
9195 173039348 167337806 162409121 158037564 153940851 149819654 145418539 140535475 135261544
9187 135261544 129864504 124502230 119159396 113453296 107190205 100526797 93735298 87181399
9179 87181399 81227471 75825515 71031725 66827708 63250653 60097198 57348820 54916910
9171 54916910 52774769 50913770 49289514 47816411 46605075 45502647 44620002 43974465
9163 43974465 43443639 43057287 42923716 42864935 42836657 42831580 42849946 42749176 42481152 42195004
9153 42195004 41767168 41201245 40562826 39850558 39253445 38688316 38098317 37781802 37662731
9144 37662731 37735669 37939387 38298871 38748391 39299804 39889453 40450413 40884690 41042328 40955741
$$ packed form
9203B40858572r229770r262554r259173r187596q817825q172317p369681o520308
9195A73039348n701542m928685m371557m096713m121197m401115m883064n273931
9187A35261544n397040n362274n342834n706100o263091o663408o791499o553899
9179H7181399n953928n401956m793790m204017l577055l153455k748378k431910
9171E4916910k142141j860999j624256j473103j211336j102428q82645o45537
9163D3974465n30826l86352j33571n8781k8278n077J8366j00770k68024k86148
9153D2195004m27836n65923o38419p12268n97113n65129n89999l16515j19071
9144C7662731P2938K03718L59484M49520N51413N89649N60960M34277J57638q6587
$$ plain form
9134 40955741 40715253 40239031 39573925 38719135 37686392 36469606 35332110 34203261 33100354
9125 33100354 32129583 31172274 30278090 29450805 28694231 28114064 27652742 27303649 26856645
9116 26856645 26399061 25796953 25272435 24735231 24073331 23401269 22662091 21696354 20722499
9107 20722499 19814804 18898413 18028465 17155073 16359382 15542257 14778224 14150005 13539957
9098 13539957 12964369 12548501 12137810 11740952 11262785 10883244 10582168 10274531 9992343
9089 9992343 9701684 9452263 9228120 8974068 8675971 8532008 8385676 8178896 7949890 7821898
9079 7821898 7750265 7600163 7394800 7164626 7042648 6910239 6720864 6625322 6530355 6484402
9069 6484402 6347444 6250194 6077822 5896713 5725402 5593358 5449760 5255968 5225338 5180071
$$ packed form
9134D0955741k40488m76222o65106q54790j032743j216786j137496j128849j102907
9125C3100354r70771r57309q94184q27285p56574n80167m61322l49093m47004
9116B6856645m57584o02108n24518n37204o61900o72062p39178r65737r73855
9107B0722499r07695r16391q69948q73392p95691q17125p64033o28219o10048
9098A3539957n75588m15868m10691l96858m78167l79541l01076l07637k82188
9089I992343k90659k49421k24143k54052k98097j43963j46332k06780k29006j27992
9079G821898p1633j50102k05363k30174j21978j32409j89375r5542r4967m5953
9069F484402j36958r7250j72372j81109j71311j32044j43598j93792l0630m5267
$$ plain form
9059 5180071 5071050 4994156 4907623 4831386 4788700 4738839 4590845 4447947 4396602 4246710 4145309
9048 4145309 4098571 3987225 3851313 3772585 3725477 3671796 3534303 3467532 3536496 3431927 3245560
9037 3245560 3214846 3218333 3175211 3058632 2997774 2925016 2847803 2752255 2670348 2660152 2649078
9026 2649078 2639763 2599913 2623205 2548746 2474464 2413229 2393805 2356495 2311265 2269256 2205572 2083318
9014 2083318 2036779 2131189 2195866 2256904 2262995 2240533 2228100 2213397 2329589 2362039 2407882
9003 2407882 2495323 2653075 2874017 3031762 3107158 3160756 3237951 3345781 3428127 3504291 3524819
8992 3524819 3534239 3546303 3514478 3393455 3382746 3384472 3326929 3336896 3276316 3209089 3288555 3327503
8980 3327503 3322394 3335866 3368420 3379780 3373371 3353377 3314902 3278103 3205932 3101042 3007172 2887144
$$ packed form
9059E180071j09021p6894q6533p6237m2686m9861j47994j42898n1345j49892j01401
9048D145309m6738j11346j35912p8728m7108n3681j37493o6771O8964j04569j86367
9037C245560l0714L487m3122j16579o0858p2758p7213r5548q1907j0196j1074
9026B649078r315l9850K3292p4459p4282o1235j9424l7310m5230m2009o3684j22254
9014B083318m6539R4410O4677O1038O091k2462j2433j4703J16192L2450M5843
9003B407882Q7441J57752K20942J57745P5396N3598P7195J07830Q2346P6164K0528
8992C524819R420J2064l1825j21023j0709J726n7543R967o0580o7227P9466L8948
8980C327503n109J3472L2554J1360o409j9994l8475l6799p2171j04890r3870j20028
$$ plain form
8968 2887144 2691824 2648996 2596502 2422732 2332088 2214467 2179034 2027887 1934208 1827356
8958 1827356 1678668 1565896 1513603 1528236 1483553 1444462 1372672 1279758 1295405 1285727 1220441
8947 1220441 1253432 1312600 1259973 1227001 1210950 1189622 1157745 1084165 1024585 988180 1015321
8936 1015321 953931 913683 846190 912867 1006280 961215 961222 1000591 942431 857063 811843 816387
8924 816387 840234 876270 870999 922589 929893 924186 842996 739101 752681 749024 724774 723163
8912 723163 710598 655704 617831 682269 686080 699528 705902 630674 618530 576922 595128 621104
8900 621104 620800 591569 573348 533631 487487 495682 507325 513400 502768 559400 558584 496192 569020
8887 569020 599201 517953 499110 421344 353752 410610 484973 515107 473440 350574 333857
$$ packed form
8968B887144j95320m2828n2494j73770r0644j17621l5433j51147r3679j06852
8958A827356j48688j12772n2293J4633m4683l9091p1790r2914J5647r678o5286
8947A220441L2991N9168n2627l2972j6051k1328l1877p3580n9580l6405K7141
8936A015321o1390m0248o7493O6677R3413m5065PL9369n8160q5368m5220M544
8924H16387K3847L6036n271N1590P304n707q1190j03895J3580l657k4250j611
8912G23163j2565n4894l7873O4438L811J3448O374p5228j2144m1608J8206K5976
8900F21104l04k9231j8221l9717m6144Q195J1643O075j0632N6632q16o2392P2828
8887E69020L0181q1248j8843p7766o7592N6858P4363L0134m1667j22866j6717
$$ plain form
8876 333857 364189 336528 339548 394450 430867 366455 343473 337613 350056 362431 321448 371571
8864 371571 443051 485397 530322 606332 591623 534407 548885 639583 737977 760512 747853 788299
8852 788299 801620 852260 884383 898310 880216 864014 903100 962227 1019906 1108699 1214806
8841 1214806 1245713 1185237 1133232 1225488 1375708 1467687 1509642 1593432 1584895 1559018 1599984
8830 1599984 1637477 1696563 1768991 1741366 1679415 1652950 1588313 1594953 1621949 1625192 1569864 1564034
8818 1564034 1577677 1608387 1644331 1731168 1835344 1845570 1766390 1777262 1775162 1765634 1718381 1587493
8806 1587493 1507834 1468348 1536860 1489366 1465769 1478479 1413036 1348172 1367700 1250480 1176816
8795 1176816 1146197 1204175 1184529 1053505 998846 996702 935058 896604 839464 841569 932363 896187
$$ packed form
8876C33857L0332k7661L020N4902L6417o4412k2982n860J2443J2375m0983N0123
8864C71571P1480M2346M4925P6010j4709n7216J4478R0698R8394K2535j2659M0446
8852G88299J3321N0640L2123J3927j8094j6202L9086N9127N7679Q8793J06107
8841A214806L0907o0476n2005R2256J50220R1979M1955Q3790q537k5877M0966
8830A599984L7493N9086P2428k7625o1951k6465o4637O640K6996L243n5328n830
8818A564034J3643L0710L5944Q6837J04176J0226p9180J0872k100r528m7253j30888
8806A587493p9659l9486O8512m7494k3597J2710o5443o4864J9528j17220p3664
8795A176816l0619N7978j9646j31024n4659k144o1644l8454n7140K105R0794l6176
$$ plain form
8783 896187 816227 736612 729320 715083 719651 621060 643777 649585 579852 585363 632309 630266 622391
8770 622391 565418 541265 515255 425172 336634 261933 251209 239461 344451 356334 343922
8759 343922 317041 299837 332833 371845 308514 268028 268008 253055 235491 242924 244332 245946 189550
8746 189550 194721 243042 240603 195030 202040 222659 214983 202467 263642 324856 302739 231542
8734 231542 223696 217093 228904 253769 246249 282884 273965 255278 285357 346563 295830 279842
8722 279842 301052 303651 182550 200796 225847 198160 149557 134967 97466 157385 164844 170499
8710 170499 205387 256265 224275 217041 279506 263947 194050 158880 150167 134789 140947 140679 89999
8697 89999 98565 122316 88266 70198 107697 95789 80852 60949 53012 103999 133026 121246
$$ packed form
8783H96187p9960p9615p292j4237M568r8591K2717N808o9733N511M6946k043p875
8770F22391n6973k4153k6010r0083q8538p4701j0724j1748J04990J1883j2412
8759C43922k6881j7204L2996L9012o3331m0486k0j4953j7564P433J408J614n6396
8746A89550N171M8321k439m5573P010K0619p676j2516O1175O1214k2117p1197
8734B31542p846o603J1811K4865p520L6635q919j8687L0079O1206n0733j5988
8722B79842K1210K599j21101J8246K5051k7687m8603j4590l7501N9919P459N655
8710A70499L4888N0878l1990p234O2465j5559o9897l5170q713j5378O158k68n0680
8697H9999Q566K3751l4050j8068L7499j1908j4937j9903p937N0987K9027j1780
$$ plain form
8685 121246 183334 206051 209313 189138 149632 110130 197552 216758 166564 144200 105463 59196
8673 59196 67669 91218 95980 91644 49532 40714 63661 122256 217249 205191 178332 131393 185836
8660 185836 145358 85505 108703 116819 76722 106820 54526 -8205 -99786 -30708 77780 105210
8648 105210 131820 110623 18975 -51866 -70875 -101822 -41803 -30198 36021 83644 145834 168033
8636 168033 72136 -9023 -67278 -89222 -47222 10879 98960 75285 85086 91650 109342 137036
8624 137036 154481 134102 51844 3873 10316 13664 102480 37091 24346 45402 95592 110139
8612 110139 72317 78936 25738 -49459 63429 111859 99981 13314 -46679 -41817 -33422 7302
8600 7302 90488 82109 36082 23501 18186 19404 12120 92659 72937 93058 37977 25150 128796
$$ packed form
8685A21246O2088K2717L262k0175l9506l9502Q7422J9206n0194k2364l8737m6267
8673E9196Q473K3549M762m336m2112q818K2947N8595R4993j2058k6859m6939N4443
8660A85836m0478n9853K3198Q116m0097L0098n2294o2731r1581O9078J08488K7430
8648A05210K6610k1197r1648p0841j9009l0947O0019J1605O6219M7623O2190K2199
8636A68033r5897q1159n8255k1944M2000N8101Q8081k3675R801O564J7692K7694
8624A37036J7445k0379q2258m7971O443L348Q8816o5389j2745K1056N0190J4547
8612A10139l7822O619n3198p5197J12888M8430j1878q6667n9993M862Q395M0724
8600G302Q3186q379m6027j2581n315J218p284Q0539j9722K0121n5081j2827J03646
$$ plain form
8587 128796 112339 80649 105592 66963 30522 65605 102368 47775 39277 42807 -24286 -84678
8575 -84678 -13291 18883 -45182 16798 35212 28569 -4928 -40283 -71546 -21893 55346 74626
8563 74626 121780 131711 -22271 -36531 13015 43264 18536 -17841 28139 33622 5962 10111
8551 10111 44074 36475 -339 -57048 -36743 -4497 46155 121375 86151 56770 32419 55528
8539 55528 -6039 -68260 -19026 48662 43295 21819 1471 8247 -44956 -41836 -37811 -49846 62449
8526 62449 93778 29156 -29617 -11383 42853 -32846 -69316 -28349 -55301 -77392 -24993 19265
8514 19265 52076 67296 50977 44622 -11334 555 7840 56064 93384 67702 9740 17409
8502 17409 6898 -12251 -15748 38555 20931 -31909 -122387 -171991 -105085 -36065 56667 74743
$$ packed form
8587A28796j6457l1690K4943l8629l6441L5083L6763n4593q498L530o7093o0392
8575h4678P1387L2174o4065O1980J8414o643l3497l5355l1263M9653P7239J9280
8563G4626M7154R931j53982j4260M9546L0249k4728l6377M5980N483k7660M149
8551A0111L3963p599l6814n6709K0305L2246N0652P5220l5224k9381k4351K3109
8539E5528o1567o2221M9234O7688n367k1476k0348O776n3203L120M025j2035J12295
8526F2449L1329o4622n8773J8234N4236p5699l6470M0967k6952k2091N2399M4258
8514A9265L2811J5220j6319o355n5956J1889P285M8224L7320k5682n7962P669
8502A7409j0511j9149l497N4303j7624n2840r0478m9604O6906O9020R2732J8076
$$ plain form
8490 74743 27710 -24905 24740 32450 10815 3097 14674 14349 -3080 -25815 -51548 6210 4992
8477 4992 -16604 -22893 22019 116898 171578 152822 90398 73729 34040 -20391 -7854 30099
8465 30099 129 20713 12277 72474 47238 -2990 -25030 -55505 -162691 -174140 -28428 65750
8453 65750 45426 36170 -1871 -32408 -2317 90583 105939 85991 140508 250694 198206 149607
8441 149607 102908 26387 32163 35744 33111 104694 103353 49996 63370 121613 159284 189453
8429 189453 110794 118194 96207 124621 128914 109410 48636 -39187 -63215 -55104 -8485 -32034
8417 -32034 -42706 12316 56306 74624 26952 30390 14669 109157 195765 193131 142432 135847
8405 135847 12091 -53593 -73387 -76571 -25576 -8801 -54103 -55643 -70858 -49494 -6498 37742
$$ packed form
8490G4743m7033n2615M9645P710k1635p718J1577l25j7429k2735k5733N7758j218
8477D992k1596o289M4912R4879N4680j8756o2424j6669l9689n4431J2537L7953
8465C0099k9970K0584q436O0197k5236n0228k2040l0475j07186j1449J45712R4178
8453F5750k0324r256l8041l0537L0091R2900J5356j9948N4517J10186n2488m8599
8441A49607m6699p6521N776L581k633P1583j341n3357J3374N8243L7671L0169
8429A89453p8659P400k1987K8414M293j9504o0774q7823k4028Q111M6619k3549
8417c2034j0672N5022M3990J8318m7672L438j5721R4488Q6608k634n0699o585
8405A35847j23756o5684j9794l184N0995J6775m5302j540j5215K1364M2996M4240
$$ plain form
8393 37742 71742 51184 114814 60617 7116 -77118 -60657 -69720 -98710 47825 110998 120620
8381 120620 69587 33763 9991 -14560 -56070 26930 124164 87434 62813 31778 64275 63542
8369 63542 10723 40793 148710 167384 82323 71885 5575 -24503 -12495 39625 107185 74679
8357 74679 37886 20594 -13424 194 71005 1010 4357 29936 46750 55875 36300 13227
8345 13227 -43110 -25510 59072 49602 -28268 50448 75818 18827 20423 17486 7723 3490 8202
8332 8202 62629 115174 105366 50486 -44876 -70898 -50451 -14006 58420 15953 -5778 1809
8320 1809 17584 35859 -21715 11586 26537 -31389 -24452 15399 -12738 -23709 -26673 -78999
8308 -78999 -76129 -11459 -23397 13863 63086 41470 -10033 -143884 -97030 32391 51054 -2479
$$ packed form
8393C7742L4000k0558O3630n4197n3501q4234J6461r063k8990J46535O3173R622
8381A20620n1033l5824k3772k4551m1510Q3000R7234l6730k4621l1035L2497p33
8369F3542n2819L0070J07917J8674q5061j0438o6310l0078J2008N2120O7560l2506
8357G4679l6793j7292l4018J3618P0811o9995L347K5579J6814R125j9575k3073
8345A3227n6337J7600Q4582r470p7870P8716K5370n6991J596k937r763m233M712
8332H202N4427N2545r808n4880r5362k6022K0447L6445P2426m2467k1731P587
8320A809J5775J8275n7574L3301J4951n7926O937L9851k8137j0971k964n2326
8308g8999K870O4670j1938L7260M9223k1616n1503j33851M6854J29421J8663n3533
$$ plain form
8296 -2479 -47747 27336 94537 29942 -76042 -101585 -66290 -4164 426 26756 52530 23638
8284 23638 15690 47970 -55962 -86703 -83173 -32436 78493 91536 70268 36053 -27968 -46660
8272 -46660 -59102 -13385 65285 73888 40813 201 38808 85888 37594 87493 92780 120964
8260 120964 162640 120646 136781 110042 79260 42367 -6780 -48024 -130563 -162905 -135561 -70229
8248 -70229 -38338 25811 28388 -15978 -7843 10254 66941 111542 135903 132181 107649 -4514
8236 -4514 -18936 67975 122966 86327 42098 13454 27109 22121 11037 16575 26348 75310 146871
8223 146871 177206 116452 7466 -78210 -40134 27053 73511 89256 113026 64336 47570
8212 47570 106465 155077 241838 237914 171290 122823 87869 59758 68489 40208 19398 -6223
$$ packed form
8296b479m5268P5083O7201o4595j05984k5543L5295O2126M590K6330K5774k8892
8284B3638p948L2280j03932l0741L530N0737J10929J3043k1268l4215o4021j8692
8272d6660j2442M5717P8670Q603l3075m0612L8607M7080m8294M9899N287K8184
8260A20964M1676m1994J6135k6739l0782l6893m9147m1244q2539l2342K7344O5332
8248g0229L1891O4149K577m4366Q135J8097N6687M4601K4361l722k4532j12163
8236d514j4422Q6911N4991l6639m4229k8644J3655m988j1084N538R773M8962P1561
8223A46871L0335o0754j08986q5676L8076O7187M6458J5745K3770m8690j6766
8212D7570N8895M8612Q6761l924o6624m8467l4954k8111Q731k8281k0810k5621
$$ plain form
8200 -6223 187 -48087 24583 57775 14786 -59269 -10034 73708 94289 17979 -7358 -18946
8188 -18946 -34085 -49985 15231 -690 -23054 -11720 4698 -3079 627 -18671 -16355 29796
8176 29796 67692 42473 -50236 -95058 -110694 -64790 2871 -7694 10711 -15322 -93667 -29023
8164 -29023 -103030 -93484 -60395 -8091 32951 -35611 -66922 21948 47394 53854 11572 -50784
8152 -50784 -6999 45446 92876 154479 156308 146198 121439 85431 73850 85226 48960 41828
8140 41828 22998 32256 -22233 -59700 -83624 -9466 40831 -19566 -47668 -44609 10339 -14148
8128 -14148 -12786 -29246 -29396 10912 40294 -22793 -37613 -32653 -10865 20992 58938 -6737 -17243
8115 -17243 39040 55118 43953 11474 -51448 -85545 -93831 -67154 1205 -36480 -27484 -35539
$$ packed form
8200f223O410m8274P2670L3192m2989p4055M9235Q3742K0581p6310k5337j1588
8188a8946j5139j5900O5216j5921k2364J1334J6418p777L706j9298K316M6151
8176B9796L7896k5219r2709m4822j5636M5904O7661j0565J8405k6033p8345O4644
8164b9023p4007R546L3089N2304M1042o8562l1311Q8870K5446O460m2282o2356
8152e0784M3785N2445M7430O1603J829j0110k4759l6008j1581J1376l6266p132
8140D1828j8830R258n4489l7467k3924P4158N0297o0397k8102L059N4948k4487
8128a4148J362j6460j50M0308K9382o3087j4820M960K1788L1857L7946o5675j0506
8115a7243N6283J6078j1165l2479o2922l4097q286K6677O8359l7685Q996q055
$$ plain form
8103 -35539 -85502 -98911 -70004 -38797 -41449 -34136 1481 30185 12116 -20220 -67396 -90284
8091 -90284 -124188 -94851 -62042 -8855 -10303 -48072 -3535 60480 114789 66706 24722 14332
8079 14332 -72010 -99273 -45123 -52354 -127765 -181106 -184104 -81853 10771 56677 48976 103
8067 103 -65361 -78837 -48518 -38447 -9666 -23085 -46237 -63438 -88447 -50504 -67084 19353
8055 19353 -191 -129674 -202685 -155094 -35119 -62023 -95034 -43468 -23406 -21331 -16114 -69212
8043 -69212 -85276 -38464 -34916 -101152 -126836 -65521 14008 11752 -7355 -57031 -157952 -173142
8031 -173142 -175047 -175850 -141658 -103455 -137246 -164670 -80557 45896 54556 -25675 -2958 44152
8019 44152 -34909 -83738 -54121 -8701 -26367 -39774 -64233 3964 61740 73276 -9090 -38532
$$ packed form
8103c5539m9963j3409K8907L1207k652P313L5617K8704j8069l2336m7176k2888
8091i0284l3904K9337L2809N3187j448l7769M4537O4015N4309m8083m1984j0390
8079A4332q6342k7263N4150p231p5411n3341k998J02251R2624M5906p701m8873
8067A03o5464j3476L0319J0071K8781j3419k3152j7201k5009L7943j6580Q6437
8055A9353j9544j29483p3011M7591J19975k6904l3011N1566K0062K075N217n3098
8043f9212j6064M6812L548o6236k5684O1315P9529k256j9107m9676j00921j5190
8031a73142j905q03L4192L8203l3791k7424Q4113J26453Q660q0231K2717M7110
8019D4152p9061m8829K9617M5420j7666j3407k4459O8197N7776J1536q2366k9442
$$ plain form
8007 -38532 29005 145496 142593 98405 137450 143548 26635 -84230 -62407 -33939 -59839 -21493
7995 -21493 80770 63584 71699 101757 40820 59718 38840 37107 29404 31951 -73265 -64466
7983 -64466 -47471 -117141 -103421 -67804 -55760 -75797 -143466 -136968 -133534 -138873 -106809 -87681
7971 -87681 -91534 -119263 -130520 -108612 -46543 -16073 -51254 -43353 -91808 -84284 -38381 22531
7959 22531 61221 92984 95399 29351 -15622 -48494 -27061 -1955 -20158 19742 -43573 -70331
7947 -70331 -50262 -69906 -12455 21285 608 -36185 -3920 45822 31452 -7257 23763 42485
7935 42485 -4825 -22204 -22421 -16544 -10897 -3504 32584 69999 26750 -20173 -110818 -94143 -46779
7922 -46779 -436 14963 41492 64625 -275 -2859 -33437 12270 25316 -7744 -31565 -89975
$$ packed form
8007c8532O7537J16491k903m4188L9045O098j16913j10865K1823K8468k5900L8346
7995b1493J02263j7186Q115L0058o0937J8898k0878j733p703K547j05216Q799
7983f4466J6995o9670J3720L5617J2044k0037o7669O498L434n339L2064J9128
7971h7681l853k7729j1257K1908O2069L0470l5181P901m8455P524M5903O0912
7959B2531L8690L1763K415o6048m4973l2872K1433K5106j8203L9900o3315k6758
7947g0331K0069j9644N7451L3740k0677l6793L2265M9742j4370l8709L1020J8722
7935D2485m7310j7379k17N877N647P393L6088L7415m3249m6923r0645J6675M7364
7922d6779M6343J5399K6529K3133o4900k584l0578M5707J3046l3060k3821n8410
$$ plain form
7910 -89975 -120668 -108251 -70961 -74211 8231 69333 95045 32828 -25654 -18408 -25139 -63254
7898 -63254 -9470 -44872 -32276 -10857 13586 54735 30482 16797 16158 94818 97235 53789
7886 53789 3091 -59427 -63439 -62745 -59813 -46574 -58322 -110328 -127576 -143088 -177362 -106241 -56150
7873 -56150 -31395 -30028 14680 1041 14715 -635 7974 69962 15406 161 -10380 14886
7861 14886 6636 -81101 -84552 -85660 -101308 -149143 -130304 -59505 -36172 -17843 3084 40386
7849 40386 4621 27594 -77117 -153935 -90812 -104984 -105718 -91565 7388 -22746 -78573 -85752
7837 -85752 -41957 5034 4648 3620 35868 15135 -35279 -105010 -110002 -89741 -117060 -137552 -62799
7824 -62799 -32059 -40710 -41567 -27491 7844 31513 -47758 -96285 -105860 -78012 -85291 -77259 -92290
$$ packed form
7910h9975l0693J2417L7290l250Q2442O1102K5712o2217n8482P246o731l8115
7898f3254N3784l5402J2596K1419K4443M1149k4253j3685o39P8660K417m3446
7886E3789n0698o2518m012O94K932J3239j1748n2006j7248j5512l4274P1121N0091
7873e6150K4755J367M4708j3639J3674j5350Q609O1988n4556j5245j0541K5266
7861A4886q250q7737l451j108j5648m7835J8839P0799K3333J8329K0927L7302
7849D0386l5765K2973j04711p6818O3123j4172p34J4153R8953l0134n5827p179
7837h5752M3795M6991l86j028L2248k0733n0414o9731m992K0261k7319k0492P4753
7824f2799L0740q651q57J4076L5335K3669p9271m8527r575K7848p279Q032j5031
$$ plain form
7811 -92290 -84302 -7773 -16313 -55031 -23998 -40493 -30801 15668 228 -7123 5599 -991 -30939
7798 -30939 71515 21 -34298 16598 -15594 -63033 -41618 24593 122147 113548 50369 12552
7786 12552 26512 -79881 -169159 -185837 -163405 -140339 -148173 -112024 -113485 -30819 158890 239738
7774 239738 177044 81894 71505 60932 19070 49648 58938 52095 74478 107111 94200 128855
7762 128855 93886 67064 68655 7757 -16372 41591 89510 16064 33587 20544 -44459 -41708
7750 -41708 -24629 -6773 -30223 -54149 -37551 -144937 -84490 5357 34947 8092 -25874 -111510
7738 -111510 -193588 -139796 -69236 -95896 -97768 -63265 -46063 -52747 -98622 -118801 -118500 -150828
7726 -150828 -67846 45854 102944 92747 78786 111083 108556 166644 136149 98994 66801 4068
$$ packed form
7811i2290P988P6529q540l8718L1033j6495R692M6469j5440p351J2722o590k9948
7798c0939J02454p1494l4319N0896l2192m7439K1415O6211R7554q599o3179l7817
7786A2552J3960j06393q9278j6678K2432K3066p834L6149j461Q2666J89709Q0848
7774B39738o2694r5150j0389j0573m1862L0578R290o843K2383L2633j2911L4655
7762A28855l4969k6822J591o0898k4129N7963M7919p3446J7523j3043o5003K751
7750d1708J7079J7856k3450k3926J6598j07386O0447Q9847K9590k6855l3966q5636
7738a11510q2078N3792P0560k6660j872L4503J7202o684m5875k0179L01l2328
7726a50828Q2982J13700N7090j0197j3961L2297k527N8088l0495l7155l2193o2733
$$ plain form
7714 4068 -64640 -33915 29591 32642 52859 108282 56624 -64242 -57921 -33247 -1818 -68862
7702 -68862 -97091 -129764 -72641 -5762 42864 105162 67527 -6219 36352 -33552 -113102 -128917
7690 -128917 -15958 127187 151813 86655 82327 37916 52430 132361 157050 41386 7341
7679 7341 -4927 31187 58565 70271 -14629 -45899 -110764 -90714 -8532 -20636 -80684 -83241
7667 -83241 -41743 -25146 -40888 25991 63866 103431 133000 57773 76103 104930 117132 136912
7655 136912 51200 86665 -37399 -134078 -71020 -35594 10670 11572 11670 24618 -34329 1387
7643 1387 20850 83701 61010 -19252 -108313 -125967 -156732 -195705 -96458 -41889 -62118 -169692
7631 -169692 -179283 -192537 -98207 -27402 2786 -19376 11720 55594 30783 -87281 -143227 -147351
$$ packed form
7714D068o8708L0725O3506L051K0217N5423n1658j20866O321K4674L1429o7044
7702f8862k8229l2673N7123O6879M8626O2298l7635p3746M2571o9904p9550j5815
7690a28917J12959J43145K4626o5158m328m4411J4514P9931K4689j15664l4045
7679G341j2268L6114K7378J1706q4900l1270o4865K0050Q2182j2104o0048k557
7667h3241M1498J6597j5742O6879L7875L9565K9569p5227J8330K8827J2202J9780
7655A36912q5712L5465j24064r6679O3058L5426M6264R02R8J2948n8947L5716
7643A387J9463O2851k2691q0262q9061j7654l0765l8973R9247N4569k0229j07574
7631a69692r591j3254R4330P0805L0188k2162L1096M3874k4811j18064n5946m124
$$ plain form
7619 -147351 -147261 -106388 -7698 7650 -22144 49128 59870 47855 77054 6057 -44236 832
7607 832 -40395 -77875 -76790 -36172 -89407 -112098 -36656 -38698 -125577 -154529 -166145 -171107 -161146
7594 -161146 -219458 -194422 -162672 -208837 -146796 -51177 40382 52631 -3330 -25262 38322 118874
7582 118874 102589 -5433 -2104 59103 7294 -67054 -98844 -91618 -108062 -71417 -60367 -107197
7570 -107197 -106926 -134450 -96439 -35679 33291 79040 69348 81224 100375 107858 76431 140083
7558 140083 98599 43379 -29490 -96413 -83715 -101349 -64344 26101 84518 101782 63471 5404
7546 5404 -35555 -48857 -32980 7969 35231 60079 8299 -61350 -118689 -82963 -27461 -12712
7534 -12712 -13320 -6374 -92846 -200230 -175492 -72780 -31837 -98408 -120513 -84455 -81114 -46723
$$ packed form
7619a47351R0M0873R8690J5348k9794P1272J0742j2015K9199p0997n0293M5068
7607H32m1227l7480J085M0618n3235k2691P5442k042q6879k8952j1616m962R961
7594a61146n8312K5036L1750m6165O2041R5619R1559J2249n5961k1932O3584Q0552
7582A18874j6285j08022L329O1207n1809p4348l1790P226j6444L6645J1050m6830
7570a07197K71k7524L8011O0760O8970M5749r692J1876J9151P483l1427O3652
7558A40083m1484n5220p2869o6923J2698j7634L7005R0445N8417J7264l8311n8067
7546E404m0959j3302J5877M0949K7262K4848n1780o9649n7339L5726N5502J4749
7534a2712o08O946q6472j07384K4738J02712M0943o6571k2105L6058L341L4391
$$ plain form
7522 -46723 3526 -38516 -142236 -162534 -105866 -22756 -27558 2606 7055 -34114 -82423 -50439
7510 -50439 -61089 -32195 -3148 -13009 -33960 -12474 -29366 -76736 -127320 -170449 -144879 -103247
7498 -103247 -66424 -94056 -59588 4732 -38851 -28418 -59980 -32363 -54804 -91950 -137388 -146594
7486 -146594 -125926 -124721 -150169 -174453 -114588 -107478 -78676 -57962 -75614 9729 44375 116412
7474 116412 31817 -25696 -85953 -61971 80227 130953 16901 -20183 23067 69390 54421
7463 54421 -29913 -79941 -155774 -164535 -150820 -119744 -109256 -58218 54635 84495 68640 18886
7451 18886 -19867 12207 69569 -62026 -105126 -72909 -72104 -95274 -68066 -32886 -67600 -108167
7439 -108167 -105860 -49530 -45629 -22858 7545 -87884 -79690 -44837 19265 56895 -30558 -10622
$$ packed form
7522d6723N0249m2042j03720k0298N6668Q3110m802L0164M449m1169m8309L1984
7510e0439j0650K8894K9047r861k0951K1486j6892m7370n0584m3129K5570M1632
7498a03247L6823k7632L4468O4320m3583J0433l1562K7617k2441l7146m5438r206
7486a46594K0668J205k5448k4284N9865P110K8802K0714j7652Q5343L4646P2037
7474A16412q4595n7513o0257K3982J42198N0726j14052l7084M3250M6323j4969
7463E4421q4334n0028p5833q761J3715L1076J0488N1038J12853K9860j5855m9754
7451A8886l8753L2074N7362j31595m3100L2217Q05k3170K7208L5180l4714m0567
7439a08167K307N6330L901K2771L0403r5429Q194L4853O4102L7630q7453J9936
$$ plain form
7427 -10622 34096 -6727 26839 8717 -22636 22190 79775 63843 78753 74680 134387 182148
7415 182148 131288 109085 41791 98738 97311 93285 72464 1088 -39044 -78117 -136785 -92391
7403 -92391 -27731 -17006 -7051 -20316 -26899 -26595 -1085 -4065 -74501 -89225 -103769 -100964 -59450
7390 -59450 -80843 -119758 -172609 -94497 -107471 -97015 -40991 -48003 -52214 21746 24636 50683
7378 50683 71794 -8277 -47973 -57346 -8772 8141 -9558 -16254 -29284 -53759 -66508 -69386
7366 -69386 -12036 10246 22486 20799 -34078 -28584 24875 36780 5160 39685 96508 14260
7354 14260 -27908 -7628 22990 -53966 -94309 -48235 -30436 -91308 -134166 -125928 -53956 28936
7342 28936 2684 -35292 -62141 -42662 -41713 -41889 26030 9659 -39193 -13548 28435 -15949 -66665
$$ packed form
7427a0622M4718m0823L3566j8122l1353M4826N7585j5932J4910m073N9707M7761
7415A82148n0860k2203o7294N6947j427m026k0821p1376m0132l9073n8668M4394
7403i2391O4660J0725R955j3265o583L04K5510k980p0436j4724j4544K805M1514
7390e9450k1393l8915n2851P8112j2974J0456N6024p012m211P3960K890K6047
7378E0683K1111q0071l9696r373M8574J6913j7699o696j3030k4475j2749k878
7366f9386N7350K2282J2240j687n4877N494N3459J1905l1620L4525N6823q2248
7354A4260m2168K0280L0618p6956m0343M6074J7799o0872m2858Q238P1972Q2892
7342B8936k6252l7976k6849J9479R49j76O7919j6371m8852K5645M1983m4384n0716
$$ plain form
7329 -66665 -15903 -17430 -21152 -51421 -66341 -30161 54899 76596 39930 14900 10874 -6701
7317 -6701 -32959 -10954 -43483 -38705 -42739 -84576 -112862 -90161 -120210 -157054 -125891 -67285
7305 -67285 -6493 -30452 -34616 -32005 -90127 -164018 -192268 -171782 -128518 -86266 -20958 -24335
7293 -24335 -42391 -30605 14053 -8164 22694 -6985 -12721 -13048 66953 39118 -28454 -68405
7281 -68405 -17196 2517 4322 -7507 28417 39555 36120 6233 -69381 -115166 -111368 -73617
7269 -73617 -37893 -18164 -64158 -86645 -61221 -37183 26867 3538 -48035 -67022 -31822 37908
7257 37908 -8072 -68180 -83824 -65520 -35357 -25723 4144 4922 -35646 -31666 47641 652 -59414
7244 -59414 -62081 -41260 -42489 -9070 -52847 -99750 -40878 52274 -12192 -807 14145 51592
$$ packed form
7329f6665N0762j527l722l0269j4920L6180Q5060K1697l6666k5030m026j7575
7317f701k6258K2005l2529M778m034m1837k8286K2701l0049l6844L1163N8606
7305f7285O0792k3959m164K611n8122p3891k8250K0486M3264M2252O5308l377
7293b4335j8056J1786M4658k2217L0858k9679n736l27Q0001k7835o7572l9951
7281f8405N1209J9713J805j1829L5924J1138l435k9887p5614m5785L798L7751
7269g3617L5724J9729m5994k2487K5424K4038O4050k3329n1573j8987L5200O9730
7257C7908m5980o0108j5644J8304L0163R634K9867P78m0568L980P9307m6989o0066
7244e9414k667K0821j229L3419m3777m6903N8872R3152o4466J1385J4952L7447
$$ plain form
7232 51592 13129 -43329 -48334 -80539 -136955 -131928 -135564 -137934 -106157 -26326 35640 112410 125904
7219 125904 51784 93966 54473 42475 35316 -89546 -163680 -111889 -55695 -72571 -138723 -131902
7207 -131902 -91356 -65659 -42857 -33600 -35611 -34921 -177640 -186713 -138663 -76723 4874 70540
7195 70540 156006 204490 142720 89354 88918 122238 127338 92967 76142 78176 15391 26022 89305
7182 89305 26290 -47880 16645 47480 34951 2098 48578 91679 -10327 -162396 -109914
7171 -109914 -79805 -116957 -45266 16218 -43442 -127254 -73481 -15287 42478 291 -54584 -27447
7159 -27447 -23795 -40866 -13610 5606 -1190 19213 -46616 -140069 -191706 -170835 -112290 7566
7147 7566 79117 117973 93534 75264 -16132 584 -82760 -80822 -43303 -88249 -21255 -25713
$$ packed form
7232E1592l8463n6458n005l2205n6416N027l636k370L1777P9831O1966P6770J3494
7219A25904p4120M2182l9493j1998p159j24862p4134N1791N6194j6876o6152O821
7207a31902M0546K5697K2802R257k011O90j42719r073M8050O1940Q1597O5666
7195G0540Q5466M8484o1770n3366m36L3320N100l4371j6825K034o2785J0631O3283
7182H9305o3015p4170O4525L0835j2529l2853M6480M3101j02006j52069N2482
7171a09914L0109l7152P1691O1484n9660q3812N3773N8194N7765m2187n4875K7137
7159b7447L652j7071K7256J9216o796K0403o5829r3453n1637K0871N8545J19856
7147G566P1551L8856k4439j8270r1396J6716q3344J938L7519m4946O6994m458
$$ plain form
7135 -25713 -37610 -54439 -12524 -26867 -14117 -89492 -109826 -100969 -100922 -86843 -41540 -36968 -30240
7122 -30240 21820 19844 -66536 -36153 -28544 -21093 -36168 -76062 -63969 -60098 -50980 -104869 -99613
7109 -99613 -98410 -63522 -59632 -114627 -105531 -46104 -118400 -209091 -143809 -118454 -76955 -62700
7097 -62700 -86141 -97922 -85368 -26919 734 26375 42607 1240 13808 36477 38699 -20011
7085 -20011 -86581 -31990 58107 119349 90517 63328 44574 58883 30037 -46662 -83034 -102400
7073 -102400 -21808 -12109 17321 21417 85912 -9242 -48140 7169 22301 -21459 -127925 -79176
7061 -79176 -23717 -54853 -18530 -58557 -89394 -86660 -128148 -151070 -146963 -108060 -55506 -82460
7049 -82460 -87600 -112682 -114082 -147472 -118715 -50449 -38691 14441 109787 93766 25796 -30332
$$ packed form
7135b5713j1897j6829M1915j4343J2750p5375k0334Q857M7J4079M5303M572O728
7122c0240N2060j976q6380L0383P609P451j5075l9894J2093L871R118n3889N256
7109i9613J203L4888L890n4995R096N9427p2296r0691O5282K5355M1499J4255
7097f2700k3441j1781J2554N8449K7653K5641J6232m1367J2568K2669K222n8710
7085b0011o6570N4591R0097O1242k8832k7189j8754J4309k8846p6699l6372j9366
7073a02400Q0592R699K9430M096O4495r5154l8898N5309J5132m3760j06466M8749
7061g9176N5459l1136L6323m0027l0837K734m1488k2922M107L8903N2554k6954
7049h2460n140k5082j400l3390K8757O8266J1758N3132R5346j6021o7970n6128
$$ plain form
7037 -30332 -66159 -8446 27758 -33455 -142099 -167685 -153867 -139423 -105117 -61167 -56514 -99898
7025 -99898 -116717 -94674 -81223 -77340 -90265 -63759 -31029 -58854 -77550 -96607 -21417 14715
7013 14715 -19733 -31727 -92418 -61053 -66080 -109031 -100154 -123769 -119471 -46807 -885 -39546
7001 -39546 -77859 -130212 -85804 -96543 -161941 -85647 -11467 -2917 -24301 -74720 -54098 -4511
6989 -4511 61001 40650 18929 -34443 -12090 33221 29318 -62268 -80571 -77408 -101361 -121761
6977 -121761 -139042 -87798 -19074 -61706 -62998 -6513 -22903 -164153 -196191 -102593 -120715 -136328
6965 -136328 -116980 -141548 -138935 -73646 -62860 -7464 2785 -8103 -3528 12261 17063 -88076
6953 -88076 32179 47736 11886 -42559 -13365 27261 39683 17259 -10807 -74009 -126474 -122067
$$ packed form
7037c0332l5827N7713L6204o1213j08644k5586J3818J4444L4306M3950M653m3384
7025i9898j6819K2043J3451L883j2925K6506L2730k7825j8696j9057P5190L6132
7013A4715l4448j1994o0691L1365n027m2951Q877k3615M298P2664M5922l8661
7001c9546l8313n2353M4408j0739o5398P6294P4180Q550k1384n0419K0622M9587
6989d511O5512k0351k1721n3372K2353M5311l903r1586j8303L163k3953k0400
6977a21761j7281N1244O8724m2632j292N6485j6390j41250l2038R3598j8122j5613
6965a36328J9348k4568K613O5289J0786N5396J0249j0888M575J5789M802j05139
6953h8076J20255J5557l5850n4445K9194M0626J2422k2424k8066o3202n2465M407
$$ plain form
6941 -122067 -116677 -138265 -85943 -39928 -29527 -39153 -48195 -43983 -10297 56824 78643 78713 67900
6928 67900 42102 -80232 -137266 -84512 -4304 -29881 -108709 -200237 -180437 -115313 -50224 -81788
6916 -81788 -76632 -175276 -196513 -169324 -177480 -140547 -75327 -52347 -53456 -62928 1991 24627 -22482
6903 -22482 -57311 -3680 35137 -25876 31173 -17829 -58758 -82164 6454 24861 -16870 -55763
6891 -55763 -24001 -5479 24376 45738 27249 21294 -18702 -42737 -3760 30800 29715 53511
6879 53511 -27153 -60939 -3607 671 -8571 -43143 -125078 -46663 -50576 -127594 -138733 -123052
6867 -123052 -106248 -80951 -9829 -14005 -580 -36378 -59425 -1138 16161 5177 5733 -28817
6855 -28817 -52329 -59675 -76699 -36869 -25176 38359 -20464 -132330 -132129 -128195 -106399 -60531
$$ packed form
6941a22067N390k1588N2322M6015J0401r626r042M212L3686O7121K1819P0j0813
6928F7900k5798j22334n7034N2754Q0208k5577p8828r1528J9800O5124O5089l1564
6916h1788N156r8644k1237K7189q156L6933O5220K2980j109r472O4919K2636m7109
6903b2482l4829N3631L8817o1013N7049m9002m0929k3406Q8618J8407m1731l8893
6891e5763L1762J8522K9855K1362j8489n955l9996k4035L8977L4560j085K3796
6879E3511q0664l3786N7332M278r242l4572q1935P8415l913p7018j1139J5681
6867a23052J6804K5297P1122m176J3425l5798k3047N8287J7299j0984N56l4550
6855b8817k3512p346j7024L9830J1693O3535n8823j11866K01L934K1796M5868
$$ plain form
6843 -60531 3085 -3201 -11247 -62874 -51652 -2153 62321 109566 148348 210579 165851 52100
6831 52100 -28257 -72067 -14719 -29722 -71430 -71190 -82266 -55083 -72664 -57895 -45012 -79047
6819 -79047 -72081 -68559 -78079 -77143 -101939 -19434 -38193 -115289 -79122 958 -12150 -91684 -94674
6806 -94674 -38396 -20674 -97344 -160619 -197237 -128216 -132327 -95225 -98948 -44372 29738 24138
6794 24138 -79101 -107349 -91907 -19177 59786 47817 40436 5011 -10974 -28463 -64065 -64674
6782 -64674 -28596 -5766 18300 8219 -48389 -10936 -54852 -103928 -179130 -156951 -69092 -57114
6770 -57114 -70680 -80006 -97991 -75323 -9604 43876 25178 -39188 -140864 -99920 -73852 -63619
6758 -63619 -7953 33900 25423 -47783 -44469 -37302 -15969 38205 41818 47742 -17128 -35830 -7997
$$ packed form
6843f0531O3616o286q046n1627J1222M9499O4474M7245L8782O2231m4728j13751
6831E2100q0357m3810N7348j5003m1708K40j1076K7183j7581J4769J2883l4035
6819g9047O966L522r520R36k4796Q2505j8759p7096L6167Q0080j3108p9534k990
6806i4674N6278J7722p6670o3275l6618O9021m111L7102l723N4576P4110n600
6794B4138j03239k8248J5442P2730P8963j1969p381l5425j5985j7489l5602o09
6782f4674L6078K2830K4066j0081n6608L7453m3916m9076p5202K2179Q7859J1978
6770e7114j3566r326j7985K2668O5719N3480j8698o4366j01676M0944K6068J0233
6758f3619N5666M1853q477p3206L314P167K1333N4174L613N924o4870j8702K7833
$$ plain form
6745 -7997 -45588 34669 95050 129492 79370 24397 40835 82352 81884 25333 -58995 -1933
6733 -1933 36339 46218 85833 78637 34388 46717 81926 3873 40141 112358 103780 37906 45372
6720 45372 50484 2379 -20939 -30663 39081 23160 -29780 8138 73624 103681 97449 61815
6708 61815 64841 97465 29508 -24966 -24617 14463 -4193 -40656 -42681 -43730 -42608 -19613 -3066
6695 -3066 -41357 -37806 -43455 -136699 -15928 58552 56260 91400 69710 5100 65043 22923
6683 22923 -33531 -42115 -27821 -41080 -58215 -87969 -24970 32972 72416 66043 -59991 -81178
6671 -81178 -10581 -20883 -56258 -72203 -63256 4195 31116 31933 23000 -13128 32673 17564 -12305
6658 -12305 -63000 -113297 -159287 -218724 -177543 -157593 -110539 8453 47173 39011 5396 -4573
$$ packed form
6745g997l7591Q0257O0381L4442n0122n4973J6438M1517m68n6551q4328N7062
6733a933L8272R879L9615p196m4249J2329L5209p8053L6268P2217q578o5874P466
6720D5372N112m8105k3318r724O9744j5921n2940L7918O5486L0057o232l5634
6708F1815L026L2624o7957n4474L49L9080j8656l6463k025j049J122K2995J6547
6695c066l8291L551n649r3244J20771P4480k292L5140k1690o4610N9943m2120
6683B2923n6454q584J4294j3259j7135k9754O2999N7942L9444o373j26034k1187
6671h1178P0597j0302l5375j5945Q947O7451K6921Q17q933l6128M5801j5109k9869
6658a2305n0695n0297m5990n9437M1181J9950M7054J18992L8720q162l3615r969
$$ plain form
6646 -4573 -44679 -49083 -10680 28101 44438 91797 15115 33728 47301 -46232 -75256 -56527
6634 -56527 -15920 -14573 26816 46648 63772 55022 1894 -30205 -14848 -48217 -50033 -52185 -84616
6621 -84616 -127437 -113738 -74784 11096 -23415 -69777 3314 -4924 34594 -15284 -110706 -137238
6609 -137238 -125994 -155033 -94903 -84842 -81462 -75249 -59047 -5375 -3851 12026 -38624 -26179
6597 -26179 23609 4042 2739 74293 72806 -79 -1081 19627 59110 98405 66620 -52505
6585 -52505 18620 81287 120253 111558 19112 -3369 -15076 -43523 -91291 -125250 -104412 -29548
6573 -29548 54738 1948 4354 58698 38327 80528 70707 38710 24748 62124 137308 196705
6561 196705 214969 143864 103650 38879 89683 102411 133339 44621 22810 -4886 58579 3223
$$ packed form
6646d573m0106m404L8403L8781J6337M7359p6682J8613J3573r3533k9024J8729
6634e6527M0607J347M1389J9832J7124q750n3128l2099J5357l3369j816k152l2431
6621h4616m2821J3699L8954Q5880l4511m6362P3091q238L9518m9878r5422k6532
6609a37238J1244k9039O0130J0061L380O213J6202N3672J524J5877n0650J2445
6597b6179M9788j9567j303P1554j487p2885j002K0708L9483L9295l1785j19125
6585e2505P1125O2667L8966q695r2446k2481j1707k8447m7768l3959K0838P4864
6573b9548Q4286n2790K406N4344k0371M2201r821l1997j3962L7376P5184N9397
6561A96705J8264p1105m0214o4771N0804J2728L0928q8718k1811k7696O3465n5356
$$ plain form
6549 3223 -2640 47074 19952 -8845 -6430 35863 86582 63961 64293 26800 -138123 -170945 -123396
6536 -123396 -76178 -14073 -30120 -48994 -101884 -108886 19279 82370 85334 116708 97417 43951
6524 43951 74537 127649 73976 58306 29558 37572 29461 -21745 -7932 -10836 -32778 -67166
6512 -67166 -73915 -61871 -128629 -78545 20375 31337 -31811 -72395 -70122 -2695 59334 14146
6500 14146 -46644 -37050 -48055 -26255 -41958 -18748 -4722 21119 45275 55391 67774 -13439
6488 -13439 5579 57844 47622 5858 2125 -8752 -1851 -38000 -117182 -154402 -53973 53387
6476 53387 14837 22744 27286 33081 18097 47492 13943 -437 -8125 -26922 -61610 -32308 -17299
6463 -17299 -138972 -224149 -146351 -68916 -74968 -8147 44516 -19274 31568 118488 166829 138861
$$ packed form
6549C223n863M9714k7122k8797K415M2293N0719k2621L32l7493j64923l2822M7549
6536a23396M7218O2105j6047j8874n2890p002J28165O3091K964L1374j9291n3466
6524D3951L0586N3112n3673j5670k8748Q014q111n1206J3813k904k1942l4388
6512f7166o749J2044o6758N0084R8920J0962o3148m0584K273O7427O2029m5188
6500A4146o0790R594j1005K1800j5703K3210J4026K5841K4156J0116J2383q1213
6488a3439J9018N2265j0222m1764l733j0877O901l6149p9182l7220J00429J07360
6476E3387l8550P907M542N795j4984K9395l3549j4380p688j8797l4688K9302J5009
6463a7299j21673q5177P7798P7435o052O6821N2663o3790N0842Q6920M8341k7968
$$ plain form
6451 138861 124676 68669 29860 14670 38511 -25025 -72399 -30056 15779 70807 64676 48819
6439 48819 -47968 -51599 -9761 -31797 -78386 -59877 -5345 108415 17161 -70116 -88876 -98547
6427 -98547 -109576 -139006 -106848 -68308 -36544 -18344 -6079 -14097 -51167 -13786 29280 90584
6415 90584 60843 12640 -47263 -56842 -59619 4532 -50950 14134 117977 107755 -4438 -45121
6403 -45121 -40590 -49639 14771 48104 83454 48546 -85876 -131414 -88264 -136532 -99708 -29501
6391 -29501 4556 -4515 -10755 -50152 -47890 -56756 -46882 20782 24492 71089 77759 72271 31612
6378 31612 77922 97313 97159 55674 68878 91121 27719 1112 26640 16683 -9150 -11869 -14406
6365 -14406 -16351 69017 135059 77339 4978 -38596 -68628 -43782 15853 -9438 -50838 -38903
$$ packed form
6451A38861j4185n6007l8809j5190K3841o3536m7374M2343M5835N5028o131j5857
6439D8819r6787l631M1838k2036m6589J8509N4532J13760r1254q7277j8760r671
6427i8547j1029k9430L2158L8540L1764J8200J2265q018l7070L7381M3066O1304
6415I0584k9741m8203n9903r579k777O4151n5482O5084J03843j0222j12193m0683
6403d5121M531r049O4410L3333L5350l4908j34422m5538M3150m8268L6824P0207
6391b9501L4057r071o240l9397K262q866R874O7664L710M6597O670n488m0659
6378C1612M6310J9391j54m1485J3204K2243o3402k6607K5528r957k5833k719k537
6365a4406j945Q5368O6042n7720p2361m3574l0032K4846N9635k5291m1400J1935
$$ plain form
6353 -38903 -66401 -83193 -129204 -133732 -144486 -132420 -85479 -43249 -66879 -61401 -14369 630
6341 630 -5118 -51384 -90188 -38679 73666 125148 126155 105608 71722 2123 -8522 -103922
6329 -103922 -138021 -122739 -9294 -13631 7637 3616 31618 24111 -9451 -68997 -59033 -17381
6317 -17381 -8843 -3193 -64531 -52358 -68832 -55414 -24148 -6557 -86472 -83188 -59764 -93191
6305 -93191 -121187 -168691 -179734 -118573 -104087 -109391 -131535 -117701 -124209 -98489 -182410 -58745
6293 -58745 91845 106240 64168 31329 32818 106653 115147 4498 -97684 -29279 20623 64456
6281 64456 125328 55943 -36027 -28777 15657 38712 -23504 12295 28052 -53777 -70092 20986
6269 20986 33153 19695 13699 -11314 16572 -25913 -20877 30789 -49086 -66349 -49836 -46044
$$ packed form
6353c8903k7498j6792m6011m528j0754J2066M6941M2230k3630N478M7032J4999
6341F30n748m6266l8804N1509J12345N1482J007k0547l3886o9599j0645r5400
6329a03922l4099J5282J13445m337K1268m021K8002p507l3562n9546R964M1652
6317a7381Q538N650o1338J2173j6474J3418L1266J7591p9915L284K3424l3427
6305i3191k7996m7504j1043O1161J4486n304k2144J3834o508K5720q3921J23665
6293e8745J50590J4395m2072l2839J489P3835Q494j10649j02182O8405M9902M3833
6281F4456O0872o9385r1970P250M4434K3055o2216L5799J5757q1829j6315R1078
6269B0986J2167j3458n996k5013K7886m2485N036N1666p9875j7263J6513L792
$$ plain form
6257 -46044 -17103 54530 46667 10154 22912 37546 57273 -913 24894 -54195 -18371 -34118
6245 -34118 -103695 -56151 -32867 -97025 -79551 -42998 -48038 79886 179997 196513 178972 159996
6233 159996 116488 87313 75391 80563 30076 -27618 -792 263 -44669 -65365 -74013 -106441
6221 -106441 -157880 -174711 -100722 -55997 -70183 -127268 -79183 -65234 -64821 -21104 9202 -67827
6209 -67827 -22665 69922 73377 -9203 -43071 26081 41849 37720 68774 61386 -11242 -51325
6197 -51325 -91729 -38785 44286 6873 105521 105756 42699 -33745 -52775 18622 66849 60822
6185 60822 17911 -17278 -49447 -69640 -143308 -126537 -86732 -27335 -41141 -50521 -22274 -46752
6173 -46752 -51583 -63228 -51684 11233 55261 31116 -66776 -26777 21913 39785 70650 26676
$$ packed form
6257d6044K8941P1633p863l6513J2758J4634J9727n8186K5807p9089L5824j5747
6245c4118o9577M7544K3284o4158J7474L6553n040J27924J00111J6516j7541j8976
6233A59996m3508k9175j1922N172n0487n7694K6826J055m4932k0696q648l2428
6221a06441n1439j6831P3989M4725j4186n7085M8085J3949M13M3717L0306p7029
6209f7827M5162R2587L455q2580l3868O9152J5768m129L1054p388p2628m0083
6197e1325m0404N2944Q3071l7413R8648K35o3057p6444j9030P1397M8227o027
6185F0822m2911l5189l2169k0193p3668J6771L9805N9397j3806r380K8247k4478
6173d6752m831j1645J1544O2917M4028k4145r7892L9999M8690J7872L0865m3974
$$ plain form
6161 26676 -47334 -71461 -45580 1668 -20608 -39578 -28485 12977 46540 47115 45063 64978
6149 64978 6277 1815 -17113 -18290 -6838 46085 7973 -65485 -46211 -16187 -6848 -38025
6137 -38025 -81794 -131004 -142539 -58301 -85423 -75456 -156746 -177789 -176611 -147181 -171785 -214349
6125 -214349 -224054 -183748 -184507 -198708 -156296 -103085 -120974 -120648 -75676 -44490 -53255 -40572 -54809
6112 -54809 -46461 16405 5414 16970 -21388 -47171 -28137 21915 -19361 -24438 31509 48000
6100 48000 53839 18073 92191 70328 -1074 -29393 -37462 -26506 -12298 24426 -6962 -31111
6088 -31111 -87688 7336 131638 27050 -84993 -82984 -17136 -9968 -29586 -55567 -117141 -73792
6076 -73792 -12058 -9227 -35779 -29159 -39242 -15018 -2699 -48297 -61983 -102083 -105111 -77641
$$ packed form
6161B6676p4010k4127K5881M7248k2276j8970J1093M1462L3563N75k052J9915
6149F4978n8701m462j8928j177J1452N2923l8112p3458J9274L0024R339l1177
6137c8025m3769m9210j1535Q4238k7122R967q1290k1043J178K9430k4604m2564
6125b14349r705M0306p59j4201M2412N3211j7889L26M4972L1186q765J2683j4237
6112e4809Q348O2866j0991J1556l8358k5783J9034N0052m1276n077N5947J6491
6100D8000N839l5766P4118k1863p1402k8319q069J0956J4208L6724l1388k4149
6088c1111n6577R5024J24302j04588j12043K009O5848P168j9618k5981o1574M3349
6076g3792O1734K831k6552O620j0083K4224J2319m5598j3686m0100l028K7470
$$ plain form
6064 -77641 -36183 1024 -26036 -56577 -79905 -114819 -111403 -91460 -63786 -106363 -101683 -75134
6052 -75134 -104834 -62175 20261 55481 53486 82282 129533 32205 -29348 19175 30510 -6919
6040 -6919 15822 34340 -50141 -50051 -101400 -76126 44724 50881 76566 28627 -26746 -112647 -124624
6027 -124624 -55723 -3175 -48441 1946 -3356 -8818 9730 -14260 10834 15131 -3957 57282
6015 57282 53465 -55031 -53024 -31534 41530 31792 24351 22981 71487 1175 -73031 -90324 -35016
6002 -35016 -53067 -74889 -43587 22378 11158 13812 -10027 24943 50331 1927 5983 85655
5990 85655 83851 -4712 40245 4162 11260 56174 6873 -58133 -75776 -94503 -176461 -170802
5978 -170802 -72626 -11282 -9620 56528 53220 10952 -3470 30355 42259 48666 64079 45937
$$ packed form
6064g7641M1458L7207k7060l0541k3328l4914L416J9943K7674m2577M680K6549
6052g5134k9700M2659Q2436L5220j995K8796M7251r7328o1553M8523J1335l7429
6040f919K2741J8518q4481R0n1349K5274J20850O157K5685m7939n5373q5901j1977
6027a24624O8901N2548m5266N0387n302n462J8548k3990K5094M297j9088O1239
6015E7282l817j08496K007K1490P3064r738p441j370M8506p0312p4206j7293N5308
6002c5016j8051k1822L1302O5965j1220K654k3839L4970K5388m8404M056P9672
5990H5655j804q8563M4957l6083P098M4914m9301o5006j7643j8727q1958N659
5978a70802R8176O1344J662O6148l308m2268j4422L3825J1904O407J5413j8142
$$ plain form
5966 45937 30729 -37350 -10455 133750 140334 100534 70142 32350 -57731 -72338 -36713 20796
5954 20796 74734 44450 22460 66800 79444 109995 85268 61883 -45938 -58514 -104807 -154851
5942 -154851 -117247 -39594 6437 75560 94736 121780 75822 -14620 -20630 16314 -18613 -44783
5930 -44783 -77805 -73696 2259 59643 72675 88174 100662 102462 89629 9770 -42772 -119717
5918 -119717 -81539 -130589 -85545 -14606 5487 69987 88607 66750 30046 15081 29582 26503
5906 26503 32078 73516 46943 17141 38690 70541 30433 -18092 -51580 -102770 -88413 -43451
5894 -43451 11030 -41637 -55044 -31392 -28388 -79553 -119379 -64007 -90656 -70518 -21395 52700
5882 52700 87854 -13 -12408 -23584 -90802 -157237 -206578 -120154 -40621 -46652 -6288 -80156
$$ packed form
5966D5937j5208o8079K6895J44205O584l9800l0392l7792r0081j4607L5625N7509
5954B0796N3938l0284k1990M4340J2644L0551k4727k3385j07821j2576m6293n0044
5942a54851L7604P7653M6031O9123J9176K7044m5958r0442o010L6944l4927k6170
5930d4783l3022M109P5955N7384J3032J5499J2488J800j2833p9859n2542p6945
5918a19717L8178m9050M5044P0939K0093O4500J8620k1857l6704j4965J4501l079
5906B6503N575M1438k6573k9802K1549L1851m0108m8525l3488n1190J4357M4962
5894d3451N4481n2667j3407K3652L004n1165l9826N5372k6649K0138M9123P4095
5882E2700L5154q7867j2395j1176o7218o6435m9341Q6424P9533o031M0364p3868
$$ plain form
5870 -80156 -154497 -116268 -56431 -105726 -43497 -20200 43836 19288 36348 71085 32271 -26406
5858 -26406 -22865 24161 29288 2497 -75735 -110594 -142892 -177149 -95887 -75847 -74649 16239
5846 16239 43489 80250 96197 112170 179659 187361 153310 155771 56479 -12338 49920 77828
5834 77828 93900 74901 73002 54784 20030 38760 75789 80456 32007 67792 12273 3576
5822 3576 17386 4442 -37479 36795 11063 -67116 -64824 -79087 -86091 -51 -35106 -87202
5810 -87202 -73591 -88713 -73416 -80528 -42552 -20824 -415 -59292 -92931 -59098 -18287 -89242
5798 -89242 -87703 -135836 -180384 -164303 -96458 3967 101928 136449 132098 86431 65867 84902
5786 84902 74192 41054 15923 30741 -10631 -40773 -53840 -28123 -41218 -65665 9283 27653
$$ packed form
5870h0156p4341L8229N9837m9295O2229K3297O4036k4548J7060L4737l8814n8677
5858b6406L541M7026N127k6791p8232l4859l2298l4257Q1262K0040J198R0888
5846A6239K7250L6761J5947J5973O7489P702l4051K461r9292o8817O2258K7908
5834G7828J6072j8999j899j8218l4754J8730L7029M667m8449L5785n5519q697
5822C576J3810j2944m1921P4274k5732p8179K292j4263p004Q6040l5055n2096
5810h7202J3611j5122J5297p112L7976K1728K0409n8877l3639L3833M0811p0955
5798h9242J539m8133m4548J6081O7845J00425R7961L4521m351m5667k0564J9035
5786H4902j0710l3138k5131J4818m1372l0142j3067K5717j3095k4447P4948J8370
$$ plain form
5774 27653 76509 70261 69841 -38997 -3226 52329 111959 90347 54298 7442 -14649 -10543
5762 -10543 -2423 84188 86844 42396 49046 117993 58089 -18923 -76908 -21942 -8541 -37844
5750 -37844 -23641 53317 67063 -26953 -30112 -40870 -44975 8938 13592 -24890 -131897 -153846
5738 -153846 -101767 -40418 -33505 -54765 -8408 30689 49264 6144 -76683 -96837 -95452 -104627
5726 -104627 -78109 -48638 -30515 421 46806 87567 56558 75157 20122 -20034 -47737 -183895
5714 -183895 -224146 -177056 -75170 -63701 -40969 40884 57669 87962 142008 171836 183340
5703 183340 193210 159576 88575 79872 71105 -18266 -98361 -14591 44182 28429 -18033 5463
5691 5463 37228 58610 22480 28180 -7379 30557 86021 67753 61260 107895 124177 83407
$$ packed form
5774B7653M8856o248m20j08838L5771N5555N9630k1612l6049m6856k2091M106
5762a0543Q120Q6611K656m4448O650O8947n9904p7012n7985N4966J3401k9303
5750c7844J4203P6958J3746r4016l159j0758m105N3913M654l8482j07007k1949
5738a53846N2079O1349O913k1260M6357L9097J8575m3120q2827k0154J385r175
5726a04627K6518K9471J8123L0936M6385M0761l1009J8599n5035m0156k7703j36158
5714a83895m0251M7090J01886J1469K2732Q1853J6785L0293N4046K9828J1504
5703A83340R870l3634p1001q703q767q9371q0095Q3770N8773j5753m6462K3496
5691E463L1765K1382l6130N700l5559L7936N5464j8268o493M6635J6282m0770
$$ plain form
5679 83407 -19081 40914 32358 48301 52344 10036 30045 14546 13053 -15960 -83955 -84127 -83032
5666 -83032 -65853 -14933 -55750 -106305 -229630 -161695 2442 -1720 -46088 -82300 -91774 -149470
5654 -149470 -78881 -53845 -15263 6385 17054 80089 160989 147239 71588 18761 3514 -37731
5642 -37731 -10774 968 -19460 -24637 -60109 -21705 33598 15584 -71947 -113777 -108255 -128883
5630 -128883 -150663 -28752 31429 -12279 -34058 -49974 -104791 -86329 -73169 -42338 -22269
5619 -22269 59024 110113 101344 95914 55850 99895 169797 111419 72300 24191 -72347 -86515
5607 -86515 -92368 -65271 -48354 -10628 -74528 -74935 -27812 18576 2627 -49737 -61088 -68778 -63511
5594 -63511 -37389 8366 897 -34065 -108045 -118086 -85050 -37525 -18903 28596 16947 -24198
$$ packed form
5679H3407j02488N9995q556J5943M043m2308K0009j5499j493k9013o7995j72J095
5666h3032J7179N0920m0817n0555j23325O7935J64137m162m4368l6212r474n7696
5654a49470P0589K5036L8582K1648J0669O3035Q0900j3750p5651n2827j5247m1245
5642c7731K6957J1742k0428n177l5472L8404N5303j8014q7531m1830N522k0628
5630a28883k1780J21911O0181m3708k1779j5916n4817J8462J3160L0831K0069
5619b2269Q1293N1089q769n430m0064M4045O9902n8378l9119m8109r6538j4168
5607h6515n853K7097J6917L7726o3900m07M7123M6388j5949n2364j1351p690N267
5594f3511K6122M5755p469l4962p3980j0041L3036M7525J8622M7499j1649m1145
$$ plain form
5582 -24198 -44395 -13277 -84171 -70105 -40573 -38028 36591 104624 62286 64799 41264 40730 5548
5569 5548 -9620 14185 54630 21203 18779 -8356 -21522 -32689 -2168 33990 7113 -20250
5557 -20250 -5014 -17526 -8564 19458 -8667 203 -11324 13995 23455 -40129 -102294 -112723
5545 -112723 -74758 21474 86329 88434 64674 46649 3799 -14353 -103111 -177575 -194489 -62217
5533 -62217 27943 29986 -16683 -43269 -84767 -141425 -194632 -231461 -191336 -54507 34156 45386
5521 45386 66933 28332 25562 37779 73939 -3284 -47533 -60465 -84504 -58279 -38581 28201
5509 28201 2905 -29547 -39226 -11416 23561 33454 -9925 -47469 -70340 -11736 25531 -74297
5497 -74297 -130124 -71231 -40441 -15244 1629 -40566 -84776 -49631 34186 -4612 -80501 -57346
$$ packed form
5582b4198k0197L1118p0894J4066K9532K545P4619O8033m2338K513k3535n34l5182
5569E548j5168K3805M0445l3427k424k7135j3166j1167L0521L6158k6877k7363
5557b0250J5236j2512Q962K8022k8125Q870j1527K5319R460o3584o2165j0429
5545a12723L7965R6232O4855K105k3760j8025m2850j8152q8758p4464j6914J32272
5533f2217R0160K043m6669k6586m1498n6658n3207l6829M0125J36829Q8663J1230
5521D5386K1547l8601k770J2217L6160p7223m4249j2932k4039K6225J9698O6782
5509B8201k5296l2452r679K7810L4977R893m3379l7544k2871N8604L7267r9828
5497g4297n5827N8893L0790K5197J6873m2195m4210L5145Q3817l8798p5889K3155
$$ plain form
5485 -57346 -32571 -28128 -76664 -83213 -59059 -80544 -52111 75917 95506 57965 42894 17161
5473 17161 -12507 14234 5007 57308 40197 27732 -13193 -60261 -139430 -138911 -124813 -81944
5461 -81944 11696 34510 -18942 -129744 -150795 -135402 -62445 24496 -3370 -28175 -85721 -72044
5449 -72044 -51781 -60569 -64591 -9801 17840 39237 12917 -2672 33853 42534 37597 4349 -54217
5436 -54217 -86301 -32536 13617 54724 52097 74620 80615 85291 54354 49500 134266 94974 34688
5423 34688 78418 35221 2848 -17321 -50359 -164310 -112886 -31031 -79034 -96835 -96044 -91610
5411 -91610 59431 16783 -44195 -52577 -20375 43627 33477 -10396 14032 66764 137600 83145
5399 83145 56629 90382 73138 54485 67969 66155 -9157 -59932 -46835 -53356 -25183 -9907
$$ packed form
5485e7346K4775M443m8536o549K4154k1485K8433J28028J9589l7541j5071k5733
5473A7161k9668K6741r227N2301j7111j2465m0925m7068p9169N19J4098M2869
5461h1944R3640K2814n3452j10802k1051J5393P2957Q6941k7866k4805n7546J3677
5449g2044K0263q788m022N4790K7641K1397k6320j5589L6525Q681m937l3248n8566
5436e4217l2084N3765M6153M1107k627K2523N995M676l0937m854Q4766l9292o0286
5423C4688M3730m3197l2373k0169l3038j13951N1424Q1855m8003j7801P91M434
5411i1610J51041m2648o0978q382L2202O4002j0150m3873K4428N2732P0836n4455
5399H3145k6516L3753j7244j8653J3484j814p5312n0775J3097o521K8173J5276
$$ plain form
5387 -9907 12203 9898 -32752 20429 39643 -45709 -37686 18406 11450 64259 73555 97563 33456
5374 33456 -40839 -85395 -54530 39844 31824 9048 -36810 4223 51328 57741 51564 35204
5362 35204 27900 32857 40200 74669 89705 65318 65758 6420 27580 16381 -22935 50076 162655
5349 162655 231840 168373 18527 21327 65485 68531 15730 -443 -3611 -2647 -13278 33044
5337 33044 140683 31895 -18475 -27674 -22670 -1931 -72555 -19142 57734 15254 -7242 -6819
5325 -6819 42372 135797 140384 45775 70720 80818 52428 30360 8956 15660 -15456 -23277 -48157
5312 -48157 -16767 -19697 -26381 56176 58007 11553 29761 6454 -14981 -61051 -73365 8775
5300 8775 89841 -718 -103990 -126840 -64200 -91238 -134059 -117007 -88694 -83282 -117830 -60153
$$ packed form
5387i907K2110k305m2650N3181J9214q5352Q023N6092o956N2809R296K4008o4107
5374C3456p4295m4556L0865R4374q020k2776m5858M1033M7105O413o177j6360
5362C5204p304M957P343L4469J5036k4387M40n9338K1160j1199l9316P3011J12579
5349A62655O9185o3467j49846K800M4158L046n2801j6173l168R64j0631M6322
5337C3044J07639j08788n0370r199N004K0739p0624N3413P6876m2480k2496M23
5325f819M9191R3425M587r4609K4945J0098k8390k2068k1404O704l1116p821k4880
5312d8157L1390k930o684Q2557J831m6454J8208k3307k1435m6070j2314Q2140
5300H775Q1066r0559j03272k2850O2640k7038m2821J7052K8313N412l4548N7677
$$ plain form
5288 -60153 -59681 -123706 -71822 -66129 -86143 -40742 1163 -62552 -86145 -13889 37303 61777
5276 61777 16186 -1060 23331 41951 2822 -55367 -51800 -51076 -37243 -47085 -25403 49500 97812
5263 97812 72324 49752 79154 59471 -4554 -70970 -106146 -83752 -9413 33880 -3451 -64509
5251 -64509 -62187 -86701 -29229 74026 44792 56179 92186 54321 -22762 -26749 -2831 61717
5239 61717 98119 54165 48362 16385 -9243 -46730 -49808 -75793 -66831 -45587 -3856 42366
5227 42366 67177 96110 59206 -17882 -77985 -118514 -139607 -181707 -115729 -97296 -90787 9879
5215 9879 50457 -38508 4040 47487 17562 -2297 29002 67334 29550 31186 73082 149123
5203 149123 101822 59158 1298 -165110 -181026 -79210 -34490 -93321 -127737 -94594 -88149
$$ packed form
5288f0153M72o4025N1884N693k0014M5401M1905o3715k3593P2256N1192K4474
5276F1777m5591j7246K4391J8620l9129n8189L567P24J3833r842K1682P4903M8312
5263I7812k5488k2572K9402j9683o4025o6416l5176K2394P4339M3293l7331o1058
5251f4509K322k4514N7472J03255k9234J1387L6007l7865p7083l987K3918O4548
5239F1717L6402m3954n803l1977k5628l7487l078k5985Q962K1244M1731M6222
5227D2366K4811K8933l6904p7088o0103m0529k1093m2100O5978J8433O509J00666
5215I879M0578q8965M2548M3447k9925j9859L1299L8332l7784J636M1896P6041
5203A49123m7301m2664n7860j66408j5916J01816M4720n8831l4416L3143O445
$$ plain form
5192 -88149 -38060 -42626 -66602 24645 61287 -22074 31729 56125 -65792 -108061 -53363 -18213
5180 -18213 -95723 -58222 -79834 -67375 -49941 -40547 -41021 -4070 -2116 -49415 -68058 -35086 -3292
5167 -3292 22080 -6449 -7194 -28712 -53618 -30169 3613 -23013 -57373 -41426 -75700 -48035
5155 -48035 4157 73108 119652 114554 115520 95266 95250 60960 72044 50224 93682 82421 69928
5142 69928 107010 63291 57384 34558 46116 122037 80591 -32565 -89889 -107830 -26423 3461
5130 3461 15016 -5033 -11823 100350 125189 41850 -16416 42586 89463 15345 42264 76014
5118 76014 34423 8416 44247 23335 19163 25681 29623 4773 -6898 -8609 39884 36975 -35821
5105 -35821 2860 13689 -49575 -119798 -142727 -77532 -11260 -15021 53973 107335 117995 115132
$$ packed form
5192h8149N0089m566k3976R1247L6642q3361N3803K4396j21917m2269N4698L5150
5180a8213p7510L7501k1612J2459J7434R394m74L6951J954m7299j8643L2972L1794
5167c292K5372k8529p45k1518k4906K3449L3782k6626l4360J5947l4274K7665
5155d8035N2192O8951M6544n098R66k0254j6l4290J1084k1820M3458j1261j2493
5142F9928L7082m3719n907k2826J1558P5921m1446j13156n7324j7941Q1407K9884
5130C461J1555k0049o790J12173K4839q3339n8266N9002M6877p4118K6919L3750
5118G6014m1591k6007L5831k0912m172O518L942k4850j1671j711M8493k909p2796
5105c5821L8681J0829o3264p0223k2929O5195O6272l761O8994N3362J0660k863
$$ plain form
5093 115132 85645 90904 123954 133264 88775 109 -86539 -74369 -32769 -51958 -108389 -146948
5081 -146948 -120410 -55431 -21405 -16462 -9209 -36180 -89730 -87133 -101874 -11339 -7483 -33274
5069 -33274 -45787 -62180 -28539 -51616 -33553 12529 33119 29844 -26559 5445 -12575 -35623
5057 -35623 -3813 64177 806 -15807 -38314 -64937 -34752 -44553 -90545 -66744 -38493 -29029
5045 -29029 -17561 -52919 -52704 -26246 46670 40157 -20612 -26970 -27384 -77544 -103029 -9554 71683
5032 71683 47689 49206 14046 -78960 -48009 -17980 18723 6717 -4733 -6610 -18233 -103027
5020 -103027 -109782 -158140 -214396 -193153 -126849 -103566 -21339 -85707 -105726 6656 35444 -37071
5008 -37071 -43224 -53065 -88330 -138540 -148347 -145033 -42463 7789 17010 31742 42340 23709 -12330
$$ packed form
5093A15132k9487N259L3050R310m4489q8666q6648J2170M1600j9189n6431l8559
5081a46948K6538O4979L4026M943P253k6971n3550K597j4741R0535L856k5791
5069c3274j2513j6393L3641k3077J8063M6082K0590l275n6403L2004j8020k3048
5057c5623L1810O7990o3371j6613k2507k6623L0185r801m5992K3801K8251R464
5045b9029J1468l5358K15K6458P2916o513o0769o358m14n0160k5485R3475Q1237
5032G1683k3994J517l5160r3006L0951L0029L6703j2006j1450j877j1623q4794
5020a03027o755m8358n6256K1243O6304K3283Q2227o4368k0019J12382K8788p2515
5008c7071o153r841l5265n0210r807L314J02570N0252R221J4732J0598j8631l6039
$$ plain form
4995 -12330 -17713 -3244 -6176 43848 46806 64275 70334 26798 -5741 9228 -5881 14937 7688
4982 7688 -13148 43993 76411 68785 37936 64632 142174 119911 -17427 -84098 -70560 15252
4970 15252 59392 127168 56096 5502 -5838 -9360 16937 -66669 -26199 42507 45922 27928
4958 27928 34325 56882 91979 161999 59203 -58077 -156613 -148760 -155961 -80227 -9793 27469
4946 27469 -1999 -32410 -22105 28095 54479 3854 -14106 11281 -21134 -104255 -52115 28397
4934 28397 61779 -7693 -95288 -127040 -171658 -141092 -83365 -116875 -80589 -91799 -151197 -116508
4922 -116508 -32248 47214 107657 151453 156844 56515 -11360 5573 36737 85425 103726 30357
4910 30357 68155 95818 -11756 -3832 47433 31140 -12324 -36145 -17935 -72074 -103454 -81635
$$ packed form
4995a2330n383J4469k932N0024K958J7469O059m3536l2539J4969j5109K0818p249
4982G688k0836N7141L2418p626l0849K6696P7542k2263j37338o6671J3538Q5812
4970A5252M4140O7776p1072n0594j1340l522K6297q3606M0470O8706L415j7994
4958B7928O397K2557L5097P0020j02796j17280r8536P853p201P5734P0434L7262
4946B7469k9468l0411J0305N0200K6384n0625j7960K5387l2415q3121N2140Q0512
4934B8397L3382o9472q7595l1752m4618L0566N7727l3510L6286j1210n9398L4689
4922a16508Q4260P9462O0443M3796N391j00329o7875J6933L1164M8688J8301p3369
4910C0357L7798K7663j07574P924N1265j6293m3464k3821J8210n4139l1380K1819
$$ plain form
4898 -81635 -74476 -77773 -11128 -15129 -14308 -13266 -33304 -24850 -30584 -60105 -46050 -21850 5243
4885 5243 25203 15361 34216 34116 39430 20233 2734 -15409 -75468 -15592 -1126 -39594 -48647
4872 -48647 -64193 -67602 -54645 -33116 -26172 -6817 32584 -58668 -173679 -183103 -137674 -115912
4860 -115912 -47421 -67286 -102073 -81328 -84610 -56152 -23555 -33127 27446 26957 54032 84694
4848 84694 71809 66597 91726 113609 84905 40688 22110 -64219 -100885 -51873 -30627 -69843
4836 -69843 -112551 -140039 -45226 -11421 -28028 -19122 -88206 -135684 -93413 -39071 10406 -1096
4824 -1096 -25674 -1062 3739 33103 -6712 -97037 -12752 48339 34873 10147 -39881 -68804
4812 -68804 -30415 -27421 -15738 39468 46071 95774 52158 47505 42780 26087 39974 -6054 43945
$$ packed form
4898h1635P159l297O6645m001Q21J042k0038Q454n734k9521J4055K4200K7093
4885E243J9960r842J8855j00N314j9197j7499j8143o0059N9876J4466l8468r053
4872d8647j5546l409J2957K1529O944J9355L9401r1252j15011r424M5429K1762
4860a15912O8491j9865l4787K0745l282K8458L2597r572O0573m89K7075L0662
4848H4694j2885n212K5129K1883k8704m4217j8578q6329l6666M9012K1246l9216
4836f9843m2708k7488R4813L3805j6607Q906o9084m7478M2271N4342M9477j1502
4824a096k4578K4612M801K9364l9815r0325Q4285O1091j3466k4726n0028k8923
4812f8804L8389K994J1683N5206O603M9703m3616m653m725j6693J3887m6028M9999
$$ plain form
4799 43945 68266 54677 -7714 43176 -15960 -19936 42875 59173 1762 -30692 31999 3943
4787 3943 1504 -18643 -31954 -23676 17138 2991 -12828 -35151 -21585 16443 45700 -2513
4775 -2513 -52969 -88644 -115049 -98019 7062 121975 62131 45226 50153 58830 -20158 -63253
4763 -63253 -70968 -112727 -143324 -104421 -74225 -77409 -66389 -92616 -109776 -109417 -88920 -32298 37922
4750 37922 -7788 -5716 65137 63226 46237 -13905 -14132 3437 -1103 -11485 23351 -62142 -123733
4737 -123733 -112468 -70299 -36186 -51838 -61927 -74743 -58482 -4903 54322 -2235 -48322 -13221
4725 -13221 28250 30289 19907 15672 -383 -87375 -80342 -51531 -100377 -112822 -95475 -46079
4713 -46079 -6187 -74328 -137098 -101567 -89797 -66949 -89869 -65169 -68895 -111970 -25106 -10053
$$ packed form
4799D3945K4321j3589o2391N0890n9136l976O2811J6298n7411l2454O2691k8056
4787C943k439k0147j3311Q278M0814j4147j5819k2323J3566L8028K9257m8213
4775b513n0456l5675k6405J7030J05081J14913n9844j6905M927Q677p8988m3095
4763f3253p715m1759l0597L8903L0196l184J1020k6227j7160L59K0497N6622P0220
4750C7922m5710K072P0853j911j6989o0142k27J7569m540j0382L4836q5493o1591
4737a23733J1265M2169L4113j5652j0089j2816J6261N3579N9225n6557m6087L5101
4725a3221M1471K039j0382m235j6055q6992P033K8811m8846j2445J7347M9396
4713d6079L9892o8141o2770L5531J1770K2848k2920K4700l726m3075Q6864J5053
$$ plain form
4701 -10053 47250 6368 725 -43340 -49658 -27657 -62862 -38287 -21157 -16914 37359 57172
4689 57172 70487 34107 -40099 -79344 -42149 4366 3412 38756 119495 113246 36660 -1169
4677 -1169 -14407 -30114 -23918 27798 89102 113687 131436 139207 83834 18504 76464 132147
4665 132147 145490 2981 -32449 -95259 -63628 38004 41655 -54144 -145590 -102575 -163664
4654 -163664 -246169 -128969 -89375 -11156 19535 -8141 12747 46255 90024 97022 18845 -53038
4642 -53038 -45186 -103097 -50924 31304 -7735 -63776 -6792 -6284 -37032 -812 30782 33572 -90310
4629 -90310 -127139 -5877 70636 58426 19935 56021 40203 42515 -64951 -151542 -135228 -19092
4617 -19092 -22179 -36704 -22255 40937 120208 60886 -34304 -425 -40458 -32377 -6721 -65655
$$ packed form
4701a0053N7303m0882n643m4065o318K2001l5205K4575J7130M243N4273J9813
4689E7172J3315l6380p4206l9245L7195M6515r54L5344Q0739o249p6586l7829
4677a169j3238j5707O196N1716O1304K4585J7749P771n5373o5330N7960N5683
4665A32147J3343j42509l5430o2810L1631J01632L651r5799r1446M3015o1089
4654a63664q2505J17200L9594P8219L0691k7676K0888L3508M3769O998p8177p1883
4642e3038P852n7911N2173Q2228l9039n6041N6984N08l0748L6220L1594K790j23882
4629i0310l6829J21262P6513j2210l8491L6086j5818K312j07466q6591J6314J16136
4617a9092l087j4525J4449O3192P9271n9322r5190L3879m0033Q081K5656n8934
$$ plain form
4605 -65655 13946 33334 -59291 -69153 -62198 -97927 -33429 -61678 -114256 -116529 -2531 69970
4593 69970 32577 34318 4449 20580 31932 -32975 -46820 -61667 -99481 -81070 -55083 -78904
4581 -78904 7958 112930 82958 9001 -9083 21887 14437 -42132 -71909 -23239 -8414 47801
4569 47801 -6113 -96609 -44742 -5977 29104 -8963 -20713 -45670 -67535 -95510 -119088 -90671
4557 -90671 -30024 58337 72370 53238 73954 40967 97130 81226 48892 54729 110523 56633
4545 56633 -96949 -44701 62321 9963 -31324 -52681 53580 89507 91584 92624 99744 94424
4533 94424 109845 44454 -13032 -32400 -30410 -18792 -43752 -88438 -111202 -119675 -139900 -129769
4521 -129769 -63446 -90655 -96407 -127952 -91423 -60756 -39244 -37928 -82380 -17608 11545 65526
$$ packed form
4605f5655P9601J9388r2625r862O955l5729O4498k8249n2578k273J13998P2501
4593F9970l7393J741k9869J6131J1352o4907j3845j4847l7814J8411K5987k3821
4581g8904Q6862J04972k9972p3957j8084L0970p450n6569k9777M8670J4825N6215
4569D7801n3914r0496N1867L8765L5081l8067j1750k4957k1865k7975k3578K8417
4557i0671O0647Q8361J4033j9132K0716l2987N6163j5904l2334N837N5794n3890
4545E6633j53582N2248J07022n2358m1287k1357J06261L5927K077J040P120n320
4533I4424J5421o5391n7486j9368J990J1618k4960m4686k2764q473k0225J0131
4521a29769O6323k7209n752l1545L6529L0667K1512J316m4452O4772K9153N3981
$$ plain form
4509 65526 15249 -1713 -17949 -45316 -80949 -107278 -93068 -43542 3245 11533 18032 92575
4497 92575 34542 4840 48801 65659 76121 62424 74344 64124 27014 38518 26556 84429
4485 84429 104993 99621 90632 55982 -19492 -54595 -60628 -93515 -124300 -146547 -93326 -123633
4473 -123633 -158459 -160838 -157043 -112370 -62937 -50374 -60073 47501 46011 19440 -31506 -71045
4461 -71045 -72348 -43436 -36751 -44106 28998 76250 57657 34660 -27518 -46739 -44593 -58869 -33059
4448 -33059 -19389 -32880 -35145 -20236 42890 88843 66900 82802 122111 129858 115555 130312
4436 130312 88432 -45234 -109071 -85595 -44283 -37103 -102 -79203 -76299 -26681 39144 47244
4424 47244 -19322 -6827 27069 18595 -43968 -75697 -32582 39163 79177 -12262 -49857 1269
$$ packed form
4509F5526n0277j6962j6236k7367l5633k6329J4210M9526M6787Q288O499P4543
4497I2575n8033k9702M3961J6858J0462j3697J1920j0220l7110J1504j1962N7873
4485H4429K0564n372q989l4650p5474l5103o033l2887l0785k2247N3221l0307
4473a23633l4826k379L795M4673M9433J2563r699J07574j490k6571n0946l9539
4461g1045j303K8912O685p355P3104M7252j8593k2997o2178j9221K146j4276K5810
4448c3059J3670j3491k265J4909O3126M5953k1943J5902L9309P747j4303J4757
4436A30312m1880j33666o3837K3476M1312P180L7001p9101K904M9618O5825Q100
4424D7244o6566J2495L3896q474o2563l1729M3115P1745M0014r1439l7595N1126
$$ plain form
4412 1269 -24718 -62277 -59582 11579 7551 -4058 -23768 -32281 -33690 -23462 16791 77534 62263
4399 62263 11751 96892 150862 47208 -35317 -9282 68466 137595 114491 9013 -31137
4388 -31137 8241 25993 63197 90918 30548 -20086 -43854 6655 46385 6233 -93294 -83850
4376 -83850 -43337 -21924 42403 57656 63263 65830 15665 -40612 -74762 -23214 -66485 -106451
4364 -106451 -62858 -116073 -56537 -47958 -26511 -12112 -3133 42070 36992 -5757 -30422 61163
4352 61163 79333 -20250 -43237 42238 80054 92291 141544 133438 172006 73190 101308 201605
4340 201605 191450 138645 86477 73710 95019 81414 66271 26820 -22717 -29689 -80780 -148868
4328 -148868 -184724 -52333 84810 150328 116313 91646 26255 7841 -10978 10679 -48883
$$ packed form
4412A269k5987l7559K695P1161m028j1609j9710q513j409J0228M0253O0743j5271
4399F2263n0512Q5141N3970j03654q2525K6035P7748O9129k3104j05478m0150
4388c1137L9378J7752L7204K7721o0370n0634k3768N0509L9730m0152r9527R444
4376h3850M0513K1413O4327J5253N607K567n0165n6277l4150N1548m3271l9966
4364a06451M3593n3215N9536Q579K1447J4399Q979M5203n078m2749k4665R1585
4352F1163J8170r9583k2987Q5475L7816J2237M9253q106L8568r8816K8118J00297
4340B01605j0155n2805n2168j2767K1309j3605j5143l9451m9537o972n1091o8088
4328a48868l5856J32391J37143O5518l4015k4667o5391j8414j8819K1657n9562
$$ plain form
4317 -48883 -75501 -37243 25851 -7793 -31070 -25993 -28042 59468 82253 56750 31503 -12011
4305 -12011 76532 105000 24503 9347 -231 49258 76299 78210 2579 10334 -27934 -18628 33183
4292 33183 7958 -75880 -108820 -57529 -121939 -177407 -112986 -44880 -41940 -28761 -15487 -56013
4280 -56013 -83873 -109367 -101633 -84591 -108583 -117525 -120951 3708 57439 -25015 -63414 -28332
4268 -28332 -40913 9317 -8278 37043 114310 148210 114428 9969 -9505 3757 -31595 -31094
4256 -31094 -64395 -50151 -28580 -67100 -141407 -74317 -38028 55409 50812 -3496 -12933 23750
4244 23750 43861 -3416 -26347 -23820 -37930 -141770 -130705 -79042 -44529 -58320 -93642 -119677
4232 -119677 -54487 -4944 7962 -8375 -63519 20449 64825 73364 94977 50929 107070 118799
$$ packed form
4317d8883k6618L8258O3094l3644k3277N077k049Q7510K2785k5503k5247m3514
4305a2011Q8543K8468q0497j5156r578M9489K7041J911p5631P755l8268R306N1811
4292C3183k5225q3838l2940N1291o4410n5468O4421O8106K940J3179J3274m0526
4280e6013k7860k5494P734J7042k3992q942l426J24659N3731q2454l8399L5082
4268b8332j2581N0230j7595M5321P7267L3900l3782j04459j9474J3262l5352N01
4256c1094l3301J4244K1571l8520p4307O7090L6289R3437m597n4308r437L6683
4244B3750K0111m7277k2931K527j4110j03840J1065N1663L4513j3791l5322k6035
4232a19677O5190M9543J2906j6337n5144Q3968M4376Q539K1613m4048N6141J1729
$$ plain form
4220 118799 50166 21285 98085 34241 49142 89997 52770 33883 -17152 -4354 -67683 -16446
4208 -16446 85361 125563 75052 45319 97658 98801 123159 163021 104139 -19868 2936 32272
4196 32272 105376 180659 238931 179474 118743 119562 85834 81439 122071 111263 56615 79013
4184 79013 102727 110289 119251 29096 42272 12586 27055 60902 94138 51642 43041 39154 3929
4171 3929 24679 82880 147493 128258 29670 -14458 -19747 -11436 -54263 -16393 -7191 -6680 -1787
4158 -1787 -45610 -56629 -120824 -150756 -16055 120297 93557 -19904 -99824 -66121 -49712
4147 -49712 -118460 -137276 -82443 -15900 -38775 -7080 -12605 -33529 -75351 -122976 -149891 -165913
4135 -165913 -206255 -124102 -2270 -24817 -52322 27618 22465 33822 -3329 -8583 -42049 -34616
$$ packed form
4220A18799o8633k8881P6800o3844J4901M0855l7227j8887n1035J2798o3329N1237
4208a6446J01807M0202n0511k9733N2339J143K4358L9862n8882j24007K2804K9336
4196C2272P3104P5283N8272n9457o0731Q19l3728m395M0632j0808n4648K2398
4184G9013K3714P562Q962r0155J3176k9686J4469L3847L3236m2496q601l887l5225
4171C929K0750N8201O4613j9235r8588m4128n289Q311m2827L7870R202N11M893
4158a787m3823j1019o4195k9932J34701J36352k6740j13461p9920L3703J6409
4147d9712o8748j8816N4833O6543k2875L1695n525k0924m1822m7625k6915j6022
4135a65913m0342Q2153J21832k2547k7505P9940n153J1357l7151n254l3466P433
$$ plain form
4123 -34616 35952 57288 -56030 -28609 12617 -28731 -27862 -2314 7654 -20704 -53127 -47546
4111 -47546 -3576 11788 -873 -33480 -56603 -133315 -90143 32948 38643 48094 16446 -65349
4099 -65349 -176979 -123424 -30606 -36152 10365 12450 20160 97740 54208 45817 99006 82663
4087 82663 9332 -48811 -77668 -135913 -165446 -200096 -198352 -162214 -74582 -64408 -24092 6650
4075 6650 29165 34354 29585 51104 21026 -37055 -61607 -74188 -63791 -11458 -9055 -31462 -41394
4062 -41394 -91353 -114090 -166632 -196892 -200166 -172086 -109121 -62276 -81562 -145112 -96440 -90470
4050 -90470 -48191 18162 -40795 14669 13018 -46766 -82083 -24926 -37348 -75856 -109145 -81534
4038 -81534 -57769 -101919 -136969 -23584 76262 145449 169480 112542 51856 20011 -4825 -46359
$$ packed form
4123c4616P0568K1336j13318K7421M1226m1348Q69K5548R968k8358l2423N581
4111d7546M3970J5364j2661l2607k3123p6712M3172J23091N695R451l1648q1795
4099f5349j11630N3555R2818n546M6517K085P710P7580m3532q391N3189j6343
4087H2663p3331n8143k8857n8245k9533l4650J744L6138Q7632J0174M0316L0742
4075F650K2515N189m769K1519l0078n8081k4552j2581J0397N2333K403k2407r932
4062d1394m9959k2737n2542l0260l274K8080O2965M6845j9286o3550M8672N970
4050i0470M2279O6353n8957N5464j651n9784l5317N7157j2422l8508l3289K7611
4038h1534K3765m4150l5050J13385R9846O9187K4031n6938o0686l1845k4836m1534
$$ plain form
4026 -46359 -39033 79158 69222 11313 28759 12619 3126 4351 6987 -48135 -6708 -26006 -2208
4013 -2208 24691 9706 61835 77333 -2983 -106277 -80315 -25480 25539 15822 61830 70470
4001 70470 61384 -43718 -38225 89587 66797 11845 -32352 25930 5398 63962 70588 45486
3989 45486 36446 8879 -13504 -17588 57631 58209 -4687 -7699 -24520 -61106 -74941 -69028 -20332
3976 -20332 41531 99052 93116 82620 135473 35599 -21846 39259 140751 160199 68475 -42248
3964 -42248 -24715 30005 -1102 -12848 -17937 -13503 -1909 -26384 -65640 -75098 -82819 -103761 -68106
3951 -68106 -30149 19651 86964 93886 92877 103658 133394 68250 48547 23377 -21141 10817
3939 10817 47896 23089 -43563 -109189 -52062 15656 32514 17034 -63113 -57880 -3996 66956
$$ packed form
4026d6359P326J18191r936n7909J7446j6140r493J225K636n5122M1427j9298K3798
4013b208K6899j4985N2129J5498q0316j03294K5962N4835N1019r717M6008Q640
4001G0470r086j05102N493J27812k2790n4952m4197N8282k0532N8564O626k5102
3989D5486r040k7567k2383m084P5219N78o2896l012j6821l6586j3835N913M8696
3976b0332O1863N7521n936j0496N2853r9874n7445O1105J01492J9448r1724j10723
3964d2248J7533N4720l1107j1746n089M434J1594k4475l9256r458p721k0942L5655
3951f8106L7957M9800O7313O922j009J0781K9736o5144j9703k5170m4518L1958
3939A0817L7079k4807o6652o5626N7127O7718J6858j5480q0147N233N3884P0952
$$ plain form
3927 66956 122016 44001 -11301 35657 38788 -34412 53467 17821 -51783 -110793 -48762 -31668
3915 -31668 -8567 -4928 -41097 -8509 7947 -52254 -33572 -19039 -101000 -188420 -81633 -29692
3903 -29692 -25870 -46179 -84866 16476 99601 78335 1607 -3558 -31604 -92629 -94147 -71683
3891 -71683 -63409 -67386 9342 34703 87177 52037 11346 2332 -51525 -82542 -113657 -111600 -85624
3878 -85624 -80097 -56272 -70439 -126153 -117351 -67502 13737 36302 -26891 -63497 -64823 39391
3866 39391 105045 95709 52698 54224 113047 58382 37172 11541 -16376 -37302 -26345 -55725
3854 -55725 -61371 -58198 -37422 -28758 -15140 -60037 -77606 -42575 -49151 -80350 -115100 -57892 -80552
3841 -80552 -51186 -35783 -88908 -142274 -159391 -120437 -33070 57103 4442 -4820 41892 91315
$$ packed form
3927F6956N5060p8015n5302M6958L131p3200Q7879l5646o9604n9010O2031J7094
3915c1668K3101L639l6169L2588J6456o0201J8682J4533q1961q7420J06787N1941
3903b9692L822k0309l8687J01342Q3125k1266p6728n165k8046o1025j518K2464
3891g1683Q274l977P6728K5361N2474l5140m0691r014n3857l1017l1115K057K5976
3878h5624N527K3825j4167n5714Q802M9849Q1239K2565o3193l6606j326J04214
3866C9391O5654r336m3011J526N8823n4665k1210k5631k7917k0926J0957k9380
3854e5725n646L173K0776Q664J3618m4897j7569L5031o576l1199l4750N7208k2660
3841h0552K9366J5403n3125n3366j7117L8954Q7367R0173n2661r262M6712M9423
$$ plain form
3829 91315 22697 48350 102052 49108 9492 -11531 -65391 -75704 -45261 36481 51604 14235
3817 14235 -18863 49819 111806 59325 -9761 -56152 38203 57670 57085 51075 78354 90826
3805 90826 72168 75698 109980 179311 253388 213503 102396 85432 106764 154869 115761 74945
3793 74945 29416 9944 5071 53117 80321 148126 157960 89769 21705 -14456 -1125 14084
3781 14084 -28033 -12371 -78703 -129013 -54964 -17122 -11856 -64497 -148048 -46461 43087 109888
3769 109888 99797 80120 55368 19334 -48111 -63572 -32157 -9674 6687 -38389 -64120 -75651
3757 -75651 -43426 -99811 -144407 -67186 2824 28280 18797 102586 134393 92931 116283 14752
$$ packed form
3829I1315o8618K5653N3702n2944l9616k1023n3860j0313L0443Q1742J5123l7369
3817A4235l3098O8682O1987n2481o9086m6391R4355J9467n85o010K7279J2472
3805I0826j8658L530L4282O9331P4077l9885j11107j6964K1332M8105l9108m0816
3793G4945m5529j9472m873M8046K7204O7805R834o8191o8064l6161J3331J5209
3781A4084m2117J5662o6332n0310P4049L7842N266n2641q3551J01587Q9548O6801
3769A09888j0091j9677k4752l6034o7445j5461L1415K2483J6361m5076k5731j1531
3757g5651L2225n6385m4596P7221P0010K5456r483Q3789L1807m1462K3352j01531
$$ [...]
##END NTUPLES=NMR SPECTRUM
##END=
