##TITLE=Analysis number 321374
Compound Code rjc 02399
Project Code adrs
Chemist Name tomalchev
##JCAMPDX= 6.0         $$ Bruker NMR JCAMP-DX V2.0
##DATA TYPE= NMR SPECTRUM
##DATA CLASS= NTUPLES
##ORIGIN= Bruker BioSpin GmbH
##OWNER= nmr
$$ XWIN-NMR		Version 3.5
$$ Tue Aug  8 09:15:39 2006 GMT Daylight Time (UT+1h)  MAYBRIDGE\nmr@NMR_250MHZ
##.OBSERVE FREQUENCY= 250.131544655141
##.OBSERVE NUCLEUS= ^1H
##.ACQUISITION MODE= SIMULTANEOUS (DQD)
##.ACQUISITION SCHEME= undefined
##.AVERAGES= 16
##.DIGITISER RES= 18
##SPECTROMETER/DATA SYSTEM= dpx250
##.PULSE SEQUENCE= zg30
##.SOLVENT NAME= DMSO
##.SHIFT REFERENCE= (INTERNAL, DMSO, 0, 16.522)
##AUDIT TRAIL= $$ (NUMBER, WHEN, WHO, WHERE, WHAT)
$$ ##TITLE= Audit trail, XWIN-NMR		Version 3.5
$$ ##JCAMPDX= 5.01
$$ ##ORIGIN= Bruker BioSpin GmbH
$$ ##OWNER= nmr
$$ C:\u/data/dgb/nmr/ADRS/410/pdata/1/auditp.txt
$$ ##AUDIT TRAIL=  $$ (NUMBER, WHEN, WHO, WHERE, WHAT)
(   1,<2006-08-08 09:15:19.53 +100>,<MAYBRIDGE\nmr>,<NMR_250MHZ>,
      <created by zg, POWCHK disabled, PULCHK disabled
       configuration hash MD5:
       E2 DF 36 D8 04 B2 41 60 5A D7 A3 38 5A 4B D0 FE
       data hash MD5: 64K
       8F D4 22 83 CD E9 76 22 AB C3 D3 31 92 68 8A C2>)
(   2,<2006-08-08 09:15:30.99 +100>,<MAYBRIDGE\nmr>,<NMR_250MHZ>,
      <Start of raw data processing
       ef LB = 0.3 FT_mod = 6 PKNL = 1 SI = 32K 
       data hash MD5: 32K
       E8 6E 45 6D 05 52 69 C7 65 8D 67 97 95 AF DE 4F>)
(   3,<2006-08-08 09:15:32.66 +100>,<MAYBRIDGE\nmr>,<NMR_250MHZ>,
      <apk 
       data hash MD5: 32K
       0A 1E 8A 82 25 E8 27 B7 3D 80 46 18 94 12 21 11>)
(   4,<2006-08-08 09:15:33.44 +100>,<MAYBRIDGE\nmr>,<NMR_250MHZ>,
      <abs ABSG = 5 
       data hash MD5: 32K
       32 F0 18 25 BA CD 94 69 FE E3 CC 54 E8 19 E4 80>)
$$ ##END=
$$ 
$$ hash MD5
$$ BE 6E 47 EC 40 0C 21 4B E8 90 60 71 F6 3E 42 D9
##$RELAX= 
##$RELAX= 
##$RELAX= 
##$RELAX= 
##$RELAX= 
##$RELAX= 
##$RELAX= 
$$ Bruker specific parameters
$$ --------------------------
##$DU= <C:\u>
##$EXPNO= 410
##$NAME= <ADRS>
##$PROCNO= 1
##$TYPE= <nmr>
##$USER= <dgb>
##$AMP= (0..31)
100 100 100 100 100 100 100 100 100 100 100 100 100 100 100 100 100 100 
100 100 100 100 100 100 100 100 100 100 100 100 100 100 
##$AQSEQ= 0
##$AQ_mod= 3
##$AUNM= <au_zg>
##$AUTOPOS= <4 >
##$BF1= 250.13
##$BF2= 250.13
##$BF3= 250.13
##$BF4= 250.13
##$BF5= 500.13
##$BF6= 500.13
##$BF7= 500.13
##$BF8= 500.13
##$BYTORDA= 1
##$CFDGTYP= 0
##$CFRGTYP= 5
##$CHEMSTR= <none>
##$CNST= (0..31)
1 1 145 1 1 1 1 1 1 1 1 1 1 1 1 1 1 1 1 1 1 1 1 1 1 1 1 1 1 1 1 1 
##$CPDPRG= <>
##$CPDPRG1= <>
##$CPDPRG2= <>
##$CPDPRG3= <>
##$CPDPRG4= <mlev>
##$CPDPRG5= <mlev>
##$CPDPRG6= <mlev>
##$CPDPRG7= <mlev>
##$CPDPRG8= <mlev>
##$CPDPRGB= <>
##$CPDPRGT= <>
##$D= (0..31)
0 1 0 0 0 0 0 0 0 0.06 0 0 0 0 0 0 0.0002 0 0 0 0 0 0 0 0 0 0 0 0 0 0 
0 
##$DATE= 1155024918
##$DBL= (0..7)
120 120 120 120 120 120 120 120 
##$DBP= (0..7)
150 150 150 150 150 150 150 150 
##$DBP07= 0
##$DBPNAM0= <>
##$DBPNAM1= <>
##$DBPNAM2= <>
$$ [...]
##$SUBNAM7= <"">
##$SUBNAM8= <"">
##$SUBNAM9= <"">
##$SW= 20.6930455092707
##$SWIBOX= (0..15)
0 0 3 0 0 0 0 0 0 0 0 0 0 0 0 0 
##$SW_h= 5175.983436853
##$TD= 65536
##$TD0= 1
##$TE= 295.16
##$TE2= 300
##$TE3= 300
##$TEG= 300
##$TL= (0..7)
0 120 120 120 120 120 120 120 
##$TP= (0..7)
150 150 150 150 150 150 150 150 
##$TP07= 0
##$TPNAME0= <>
##$TPNAME1= <>
##$TPNAME2= <>
##$TPNAME3= <>
##$TPNAME4= <>
##$TPNAME5= <>
##$TPNAME6= <>
##$TPNAME7= <>
##$TPOAL= (0..7)
0.5 0.5 0.5 0.5 0.5 0.5 0.5 0.5 
##$TPOFFS= (0..7)
0 0 0 0 0 0 0 0 
##$TUNHIN= 0
##$TUNHOUT= 0
##$TUNXOUT= 0
##$USERA1= <user>
##$USERA2= <user>
##$USERA3= <user>
##$USERA4= <user>
##$USERA5= <user>
##$V9= 5
##$VALIST= <valist>
##$VCLIST= <CCCCCCCCCCCCCCC>
##$VD= 0
##$VDLIST= <DDDDDDDDDDDDDDD>
##$VPLIST= <PPPPPPPPPPPPPPP>
##$VTLIST= <TTTTTTTTTTTTTTT>
##$WBST= 1024
##$WBSW= 4
##$XGAIN= (0..3)
0 0 0 0 
##$XL= 0
##$YL= 0
##$YMAX_a= 554037
##$YMIN_a= -533186
##$ZGOPTNS= <>
##$ZL1= 120
##$ZL2= 120
##$ZL3= 120
##$ZL4= 120
##$ABSF1= 16.522
##$ABSF2= -4.171173
##$ABSG= 5
##$ABSL= 3
##$ALPHA= 0
##$AQORDER= 0
##$ASSFAC= 0
##$ASSFACI= 0
##$ASSFACX= 0
##$ASSWID= 0
##$AUNMP= <proc_1d>
##$AZFE= 0.1
##$AZFW= 0.1
##$BCFW= 0
##$BC_mod= 0
##$BYTORDP= 0
##$COROFFS= 0
##$CY= 12.5
##$DATMOD= 1
##$DC= 0
##$DFILT= <>
##$DTYPP= 0
##$F1P= 14.0000005364418
##$F2P= -0.99999901652339
##$FCOR= 0.5
##$FTSIZE= 32768
##$FT_mod= 6
##$GAMMA= 0
##$GB= 0
##$INTBC= 1
##$INTSCL= 1
##$ISEN= 128
##$LB= 0.3
##$LEV0= 0
##$LPBIN= 0
##$MAXI= 10000
##$MC2= 0
##$MEAN= 0
##$ME_mod= 0
##$MI= 0
##$NCOEF= 0
##$NC_proc= -6
##$NLEV= 6
##$NOISF1= 0
##$NOISF2= 0
##$NSP= 0
##$NTH_PI= 0
##$NZP= 0
##$OFFSET= 16.522
##$PC= 1
##$PHC0= 142.0399
##$PHC1= 2.045541
##$PH_mod= 1
##$PKNL= yes
##$PPARMOD= 0
##$PSCAL= 4
##$PSIGN= 0
##$REVERSE= no
##$SF= 250.13
##$SI= 32768
##$SIGF1= 0
##$SIGF2= 0
##$SINO= 400
##$SIOLD= 32768
##$SREGLST= <1H.DMSO>
##$SSB= 0
##$STSI= 32768
##$STSR= 0
##$SW_p= 5175.98343685301
##$SYMM= 0
##$S_DEV= 0
##$TDeff= 65536
##$TDoff= 0
##$TI= <Analysis number 999999
Compound Code 99
Book Reference 9
Project Code 9>
##$TILT= no
##$TM1= 0
##$TM2= 0
##$TOPLEV= 0
##$USERP1= <user>
##$USERP2= <user>
##$USERP3= <user>
##$USERP4= <user>
##$USERP5= <user>
##$WDW= 1
##$XDIM= 32768
##$YMAX_p= 381889357
##$YMIN_p= -450222
$$ End of Bruker specific parameters
$$ ---------------------------------
##NTUPLES= NMR SPECTRUM
##VAR_NAME=  FREQUENCY,     SPECTRUM/REAL,   SPECTRUM/IMAG
##SYMBOL=    X,             R,               I
##VAR_TYPE=  INDEPENDENT,   DEPENDENT,       DEPENDENT
##VAR_FORM=  AFFN,          ASDF,            ASDF
##VAR_DIM=   32768,         32768,           32768
##UNITS=     HZ,            ARBITRARY UNITS, ARBITRARY UNITS
##FACTOR=    0.157963299565203, 1,           1
##FIRST=     4132.6476996994, 0,             0
##LAST=      -1043.33573715361, 0,           0
##MIN=       -1043.33573715361, -450222,     0
##MAX=       4132.6476996994, 381889357,     0
$$ Real data points
##PAGE= N=1
##DATA TABLE= (X++(R..R)), XYDATA
$$ [...]
25904a26018J26307P9526q8563l4606J6579P6221j04013r1811K92J7345R8676
25893c0065n9916j41607k4686J50055l2043m4566J42481q516k3341j25855k7806
25882b25865P7411L2916m445Q0181M7073J0629q5880L1941M7097J2750L0353L7721
25870I1882j22039l6299j1127K7468o2147l6492l4379j0764o918K0131L0627J32954
25858a7103o0229n0534o019m7231p744J18286O4554m0395l7455J3832o1201M204
25846a27035P270Q3364j087O1690p089J17638K1453p2438j23496q000R5098O2875
25834A10243j33936p7462J12493K1357Q2057r1991K291M9087r23m1741l1477J07412
25822A07410n3659q9169j7620n2522O384O0352l8992M977N6118K1355J0262l0194
$$ y = [-126018, 289, 79815, -8748, -43354, -26775, 49446, -54567, -146378, -146086, -128741, -30065, -89981, -231588, -256274, -106219, -138262, -182828, -40347, -48863, -72204, -198059, -225865, -148454, -115538, -119983, -39802, 7271, 17900, -67980, -36039, 11058, 23808, 54161, 91882, -30157, -66456, -77583, -50115, -112262, -148754, -183133, -193897, -200815, -180684, -150057, -17103, -77332, -127866, -133885, -181116, -188860, -70574, -6020, -46415, -83870, -70038, -131239, -127035, -119765, -36401, -37488, 24202, 17113, 134751, 156204, 83766, -39730, -47730, 47368, 110243, -23693, -101155, 11338, 32695, 114752, 22761, 25052, 74139, 73216, 31475, -2, 107410, 53751, -35418, -53038, -105560, -99176, -38824, -77816, -72839, -16721, 4634, 14896, -15298]
25810a5298k8595J8429k7532p085N9352J8424m2181n4191j16417J0567O2851J139
25798a20537q110L7950L3394O3472j3592K0185k2329o1438k8112L2760K2569q9117
25786a32905n275J89317m6031j00693R1363j1753L0025K2878K244l6240o2108
25775e9178m2356K6353J2771Q0712N9053J1937L4139O0773k03315j31240m6886
25764a97237p281R5348M1532l899L9934M2910q1607o803L3264L3841N480Q9255
25752H4737J2091q7540o8544J0430M2915j13132j3962J1979n6436k3475r7780
25741b98717Q5492N9814q9925r7862P2842J46525K5301N3810J54215m504n3048
25730E3943j6891j4967K6577n0873n0285K4742J11723l8387m1250M9722J8152
$$ y = [-15298, -43893, -25464, -52996, -60081, -729, 17695, -24486, -78677, -195094, -184527, -121676, -120537, -128647, -90697, -57303, 6169, -7423, 12762, -9567, -71005, -99117, -66357, -43788, -132905, -138180, 51137, 5106, -95587, -4224, -15977, 14048, 36926, 39170, 2930, -59178, -101534, -75181, -62410, 18302, 77355, 89292, 123431, 184204, -19111, -150351, -197237, -204518, -109170, -67638, -71537, -31603, 11307, -70300, -77103, -43839, -9998, -4518, 84737, 96828, 9288, -59256, -48826, -5911, -119043, -133005, -121026, -177462, -200937, -298717, -213225, -153411, -243336, -341198, -268356, -121831, -96530, -42720, 111495, 106991, 53943, 37052, 22085, 48662, -2211, -52496, -27754, 83969, 45582, 4332, 54054, 72206]
25719G2206o9564k8133J211O6059M3266j09631j42702j5599L4576Q0786p758r5200
25707a70483m0945j0485J44145N4219p0450m7034N9532R5918o7291l6702J10923
25696B1347K2223K4522m9579n8941M2371M0564j13007j16844m1279J34032P0216
25685b4375q5779j8841J6009R0919q2935m2501J26272Q6072Q4433m8992q9061
25674A1221N7267J3249l6151m9267q1067P6596R420p902J8895P1661O6485j31923
25662A8484m0974l2673o2507M5209j33304R892P4563Q4362N2290O314k8255k5398
25650c1997k3131l2898m3675J8832O6115n3488K0121L7924r7263k8893P1226k8760
25638a25887K1817J6152M5676O6475N6263k7137K857J5754k8980q6523K5704J41317
$$ y = [72206, 2642, -25491, -24280, 41779, 85045, -24586, -167288, -182887, -148311, -67525, -75283, -170483, -211428, -221913, -77768, -23549, -93999, -141033, -81501, 14417, -52874, -89576, 21347, 43570, 68092, 18513, -40428, 1943, 42507, -70500, -187344, -228623, -94591, -24375, -110154, -128995, -112986, -22067, -105002, -147503, -21231, 64841, 149274, 100282, 11221, 68488, 81737, 45586, -3681, -84748, -8152, 1268, -6634, 12261, 83922, 150407, 18484, -22490, -55163, -117670, -72461, -205765, -195873, -121310, -36948, 15342, 21656, -6599, -31997, -55128, -88026, -131701, -112869, -46754, -100242, -80121, -42197, -139460, -168353, -97127, -125887, -104070, -87918, -42242, 24233, 80496, 53359, 56216, 71970, 42990, -43533, -17829, 123488]
25626A23488m7610o4266j04867j0852N2214O975O3085j1755j88834j5659J09882
25615h8199R0664N606M0285k8032q2208k9219P5825J4169j01073n7524q6901k0530
25603b67137P3522P9717j3842O018Q7713K5180J221L237l8739k07j2824O5439
25591I298k7590j9293j5486K8275o7332k4457j732K7440m5002n4545N6432M3695
25579i0297J07277K7660m6545J8162O8568l8962j0541R7030R9122j13072m7981
25568G0421p4590l3312q9850l1336j0344o2688M8815P8338j7271J02762N6400
25557C7345p3001l6921o2879n1174m6143N3739R7325J07902j11j35573k218J04301
25545g408J43362l7020q0058J1136P90p330o0454o8522q416J5826J5363R6498
$$ y = [123488, 75878, 11612, -93255, -104107, -51893, -44918, 18167, 6412, -182422, -198081, -88199, 2465, 8071, 48356, 20324, -61884, -91103, -15278, -1109, -102182, -159706, -246607, -267137, -193615, -113898, -127740, -121722, -34009, -8829, -7608, -4371, -43110, -43317, -56141, 9298, -18292, -37585, -53071, -24796, -92128, -116585, -118317, -90877, -135879, -190424, -133992, -90297, 16980, 44640, -1905, 16257, 84825, 45863, 35322, 132352, 231474, 118402, 70421, -4169, -37481, -127331, -158667, -169011, -231699, -182884, -104546, -121817, -19055, 37345, -35656, -72577, -135456, -186630, -232773, -179034, -81709, 26193, 26082, -109491, -111709, -7408, 135954, 98934, 18876, 30012, 30802, 23472, -36982, -105504, -113920, -98094, -82731, 13767]
25533A3767N9592L4729n9897m640L4654n6615r6477M246l4874N5485P7083j2468
25521A4585N3124j11851j87682m1071N5743J04827m4929L0075L8044R5685R8353
25510A04903m3720q0376k466O8459J1882n8761L741m0908K9212j13012j2498M677
25498a28867j29335k3540J56202J38823q3699l1722K4907J0555j30986R566J28195
25487e9901R3589L9183k5945N939J2922m6536j93544m4705J4258K3412J49010
25476c2318J646k1594M6211P3438M2514p8059n6935k8964N4402p7974m6001N371
25464a18263p941j100J00262k8754k7306R7303O7540o2933m9357K5296J2301p2739
25452f5691J2803N5680j6134K6203o2664m1373l6773j507O4629p0590J10612R3455
$$ y = [13767, 73359, 108088, 48191, 43551, 78205, 21590, -74887, -70641, -105515, -50030, 27053, 14585, 67709, -44142, -231824, -272895, -217152, -112325, -157254, -127179, -89135, 6550, 104903, 61183, -19193, -21659, 46800, 58682, -79, 3662, -37246, -8034, -121046, -133544, -128867, -258202, -281742, -125540, 13283, -70416, -102138, -77231, -66676, -197662, -188096, -59901, 33688, 72871, 46926, 52865, 65787, 19251, -174293, -218998, -204740, -181328, -32318, -30672, -52266, -6055, 67383, 109897, 31838, -25097, -54061, 341, -77633, -123634, -118263, -126204, -127304, -27042, -55796, -83102, 14201, 81741, 18808, -30549, -5253, 7048, -65691, -52888, 2792, -13342, 12861, -49803, -91176, -127949, -129456, -64827, -135417, -24805, 68650]
25440F8650O7467M3579j64916n9357m0207k7232r2058J1440P1136J8305n0387
25429a53580L7878J0747N7293J9008o9620q599O9288N100M8019J01405m3130l3165
25417D0644k6870k4536o0457L6007N4479N1786K3084m5474k2429r2580l0673J2646
25405h4373P8556p1125m755m931l075Q0285k841M5042J5043q8538Q447K7275o3357
25392f8347q1099n6513j34666J34817Q1428P7706l0282n5070M4972K298J1206
25381g3550j30380P1891J05408o3091q0203L9059J9884o0772P1958P0483k10M1760
25369A2237N5962k786j88650k8750J2188J9945K8057M7417R795j9912P857q1872
25357a28512p4256J06064L3666Q363j19760J05055J15025l9457j76576o8665P18
$$ y = [68650, 136117, 179696, 14780, -44577, -84784, -112016, -204074, -192634, -121498, -103193, -153580, -115702, -104955, -47662, -28654, -98274, -106873, -37585, -32485, 15534, 116939, 73809, 40644, 13774, -10762, -71219, -35212, 19267, 71053, 94137, 48663, 26234, -66346, -97019, -84373, -5817, -76942, -81697, -86628, -89703, -9418, -12259, 32783, 47826, -40712, -32265, -4990, -68347, -149446, -205959, -340625, -205808, -124380, -46674, -76956, -132026, -87054, -84756, -73550, -203930, -132039, -26631, -89722, -169925, -130866, -110982, -171754, -99796, -29313, -29523, 12237, 68199, 65413, -123237, -151987, -139799, -119854, -91797, -44380, -34585, -54497, -46640, -128512, -202768, -96704, -63038, -54675, -174435, -69380, 45645, 6188, -170388, -239053, -238335]
25346b38335M571L929Q3823J5701k3018L4608r7992j16120l3364N8233o8428n1308
25334d27700K03087J79408J27175P4004k9201r7836m7375K8426J9388k3443N9623
25323F5556k3702o9710j03057N0571N7917L582m4406m4983N8207j1055Q0172p9522
25311f0430r5290M6827J11065M2693J9670q0816p9611q080R6781l8868m9408o3993
25299a59460j00666K4571Q8178J08785J2096K9004j1027o1002O9963O5689p6183
25288a0052j10729Q135j2162o375O4632R724K4136J2847N3037l051j1191J3563
25276C2514n8782k2043K9354N586j06127j2193P8814N594L563m3490O9273j2074
25264c0011K3381M263m1523k709j9728j8259K7834N5886J1704l4783o5435o8429
$$ y = [-238335, -233764, -229835, -146012, -130311, -153329, -118721, -216713, -332833, -366197, -307964, -376392, -427700, -224613, -45205, 81970, 155974, 126773, 28937, -18438, 9988, 29376, 5933, 65556, 41854, -27856, -130913, -80342, -22425, -18843, -63249, -108232, -50025, -61080, 19092, -60430, -155720, -108893, 2172, 44865, 64535, -16281, -95892, -103972, -7191, -46059, -95467, -159460, -260126, -235555, -147377, -38592, -26496, 2508, -8519, -69521, 442, 66131, -10052, -120781, -112646, -124808, -131183, -66551, -56827, -32691, -19844, 33193, 30142, 18951, 32514, -26268, -48311, -18957, -13371, -119498, -131691, -52877, -47283, -43720, -87210, -17937, -30011, -6630, -2367, -43890, -46599, -66327, -84586, -56752, -866, 10838, -23945, -89380, -157809]
25252a57809J14477P7725j2151R8403p6555p9934j1289L8428M5658o7644j12419
25241a43110j1538Q1890J49629O647n3191n2208L9881k1017Q2047J23371q5908
25230A16493q2744L8169k6183k8768m735Q053r6053O225r635Q3676R5344p8868
25218B0974q7774n2720N529K5643q4590O4113L823m2416Q3762J13801o986L0239
25206G3398m8032O505q22l2710k6936J3012q9295j50294O5309k5452J1892M6359
25194a57066L7392j20143R0744O7007P7483o4765j92J4403K1498O1988m5113j6769
25182c3533p0696J05667M8286m7165k9653n4726K0926J23400P1531m4986K5916
25171A14967N0748j08970j07897k5901M4350N0408L8932m1685J03801k3052q8057
$$ y = [-157809, -43332, 34393, 22242, 120645, 44090, -35844, -47133, -8705, 36953, -30691, -143110, -154648, -72758, 76871, 83518, 30327, -21881, 18000, -3017, 79030, 202401, 116493, 33749, 71918, 45735, 16967, 12232, 20285, -75768, -69543, -79178, 4498, 99842, 20974, -66800, -119520, -113991, -88348, -172938, -108825, -105002, -147418, -63656, 50145, 43159, 73398, 25366, 31871, 31049, -1661, -28597, -15585, -104880, -255174, -189865, -215317, -203425, -157066, -119674, -239817, -149073, -82066, -4583, -69348, -69540, -55137, -33639, 28349, -16764, -33533, -104229, 1438, 49724, 2559, -27094, -81820, -60894, 62506, 134037, 89051, 114967, 165715, 56745, -51152, -77053, -32703, 17705, 56637, 14952, 118753, 95701, 7644]
25160G644r1717q9954N2330L1512m416l6339N6595l4300K7061r7958j7265J42539
25148e4268l6388L5941M6227R9973p8085J6615Q9742q7795q5911l6791Q377N9435
25136b2928P4670m8414j0614p818k3138o0681L0970K9829l4191k3130K7230P5844
25124G629m2710j7260q1352o3414M8064J55665N6407l9630j2922N8219j43323
25113g4627K530K1009j1111L1865J49395J9264j36975j2316M7910j04661o6727
25102a34444O9571J1269O0533J3180l9433o8124K7297k6403J2924o0703K2687
25091a11646P2589p1306l5573Q6352L4607O1267M7903j5104q6260p3732k1176
25080a12079n6865k4636L282J33235j8526j5826L0621J2731n9414j0263J7639
$$ y = [7644, -84073, -174027, -121697, -90185, -94601, -130940, -74345, -108645, -81584, -179542, -196807, -54268, -90656, -54715, -8488, 91485, 13400, 30015, 119757, 31962, -53949, -90740, -82363, -22928, 51742, 3328, -7286, -15104, -38242, -98923, -67953, -38124, -72315, -95445, -68215, 7629, -35081, -52341, -133693, -197107, -149043, 6622, 63029, 23399, 10477, 68696, -74627, -72097, -51088, -62199, -30334, 119061, 138325, 1350, -10966, 36944, -67717, -134444, -64873, -53604, 6929, 20109, -19324, -87448, -60151, -86554, -73630, -134333, -111646, -39057, -110363, -145936, -59584, -24977, 36290, 84193, 69089, -17171, -90903, -112079, -168944, -193580, -190298, -57063, -75589, -91415, -60794, -48063, -107477, -117740, -100101]
25069a00101m9251L6830J09489O0276l2611j04522o829R3928p2746m5396k1307
25058a32240p5655j1068J03532J08559P1960P4225K4303j02172j76192M7080J69083
25047A01415J06852j01938N845K4516o2895m1458L0154K6447L1415k4338j22710
25036b6695j60588q7260R2849J64578L6019J6850L4815n0967q3781k9500L059
25025i0621J9014O4643J24660J4846j00382M8940L2410J062m7855M984M7650L2826
25013A52177K9376l5942j916n5607m3021n6733j68857k1260K8963N8545P2773
25002d1502r1489n4053j0012O6437P5176o3123m0251K5612K3865J07270l774l2203
24990c8047J7827m5731R544n7709O7853k992j0447L7009O938r7048L823P2846
$$ y = [-100101, -149352, -112522, -3033, 57243, 24632, -79890, -86719, 7209, -65537, -110933, -132240, -207895, -218963, -115431, -6872, 65088, 139313, 163616, 61444, -114748, -67668, 101415, 208267, 106329, 112174, 136690, 73795, 32337, 62491, 88938, 120353, 96015, -26695, -187283, -274543, -181694, -17116, 18903, 35753, 70568, 19601, -64180, -93680, -90621, -71607, -6964, 117696, 132542, 32160, 81100, 113510, 114572, 66717, 71701, 119351, 152177, 181553, 145611, 143695, 88088, 45067, -11666, -180523, -201783, -172820, -114275, -41502, -132991, -187044, -197056, -130619, -55443, -118566, -158817, -133205, -109340, -2070, -5844, -38047, -20220, -65951, -56407, -114116, -46263, -49255, -59702, -22693, -15755, -112803, -108980, -36134]
24978c6134M1087m0385K1375N2511j06611q1577P9159K8197j159p2376M8571O3444
24966c898l3830J2292N444k2049m1611J1664Q7992o3406m6001M481j39970l5705
24954b64597N2780J20157J32212m5926N214m0590L4048m6562q4957l9196K7481
24943a49936N6970K6335j3216K0432l319O9476M2018M6641m7531m2302m9781P8665
24931C4452M6665p2713m2235L2480K2222J9082j14347J38351P0017O509k257j1877
24919A26349j22200k7307l0898M9718J20948P8085n6899j47508Q8785q7744p332
24908a6003k1959j05270m4172R1469P2805r4114n4917J4522j7819N1583K750p26
24896a21851M1461L7652L5470N8129j06950N4973J09989l9249j7801P086q809
$$ y = [-36134, 4953, -35432, -14057, 38454, -68157, -149734, -70575, -42378, -43537, -115913, -67342, -3898, -37728, -25436, -19992, -42041, -83652, -71988, 16004, -47402, -93403, -88922, -228892, -264597, -211817, -91660, 40552, -5374, -160, -40750, -6702, -53264, -138221, -177417, -149936, -92966, -66631, -79847, -59415, -62734, 6742, 48760, 95401, 47870, 5568, -44213, 34452, 81117, 8404, -33831, -1351, 20871, 39953, -74394, 63957, 133974, 140483, 138226, 126349, 4149, -23158, -54056, -4338, 116610, 194695, 137796, -9712, 79073, -8671, -16003, -37962, -143232, -187404, -95935, -23130, -117244, -172161, -157639, -175458, -123875, -121125, -121851, -80390, -42738, -7268, 50861, -56089, -1116, 108873, 69624, 51823, 58909, 50100]
24885E0100M4749j77141j4974O4986R0591j13189p6822l0507m5323Q3520n910
24874a29920o9409R8298J9788N1794Q80N9375P217J9949P978M92L255q021L4554
24861I6230o9369L5370k0714n3909K9203P0090P0662J46839j27334j30903n3086
24850f921j5811O2011j1347k3209L303J14835J05589Q164j26935j23575q4236
24839i8132o5412O0441J13120K7658O5318j27101p3507M2426O9284m8445j3834
24828d8184P6943J74178M6704p9465j00885n7627P4400L8687n7787J5059n278
24817G6745k421J02173O2380j93101j45880o2691Q1682m5495J0787L7662K4536
24806e3623k8854n3276L4097O8449l3377n8234J26057L6454M469J25753P2484
$$ y = [50100, 94849, -82292, -97266, -32280, 58311, -54878, -131700, -162207, -207530, -124010, -129920, -199329, -101031, -81243, -29449, -28569, 30806, 38023, 57972, 65950, 66442, 69697, 61676, 96230, 26861, 62231, 41517, -12392, 16811, 86901, 157563, 304402, 177068, 46165, -6921, -22732, 39279, 27932, 4723, 8026, 122861, 228450, 236614, 109679, -13896, -98132, -163544, -103103, 10017, 37675, 102993, -24108, -97615, -55189, 14095, -34350, -48184, 28759, 202937, 249641, 170176, 69291, 11664, 86064, 124751, 66964, 82023, 76745, 74324, 176497, 238877, 45776, -100104, -162795, -81113, -126608, -115821, -78159, -53623, -82477, -135753, -101656, -33207, -66584, -124818, 1239, 37693, 42162, 167915, 240399]
24795B40399n2118m2828m6956q7313p4068n8820N6470L7074k7188l4633n7474
24784a47455J66230J72521L1834j43208k7739o8119k6206O894L7609N6727M2546
24773A01634l9642o1010p6227K5739k4835P4862j1289j3166L4446N7735J6246
24762H4493j03925j0952Q0350j7515n901J0516L0602l0267l1090L0132n4111p16
24750a8384K533p5091M0542l640o5321N939M9970J16435j8328P48J523j21179
24738h4253R586N8122m667p139R4616O6311j44851j45233m0982R1286K9143J9401
24726e8660J7605M0959Q1388K7257j06456m3869J02842J2076L5188k2831J2944
24715I8443k7711M7003p810j4820N0614j07662j28658o1094J07453N0173r2620
$$ y = [240399, 188281, 145453, 98497, 11184, -62884, -121704, -65234, -28160, -55348, -89981, -147455, 18775, 191296, 223130, 79922, 52183, -15936, -42142, -35248, 2361, 59088, 101634, 61992, 982, -75245, -49506, -74341, 521, -10768, -23934, 10512, 68247, 84493, -19432, -30384, 49966, 32451, 26550, 37066, 67668, 37401, 6311, 36443, -17668, -18384, -15851, -90942, -50400, -54040, -119361, -113422, -63452, 52983, 34655, 35403, 36926, -84253, -74667, -16545, -21212, -28351, 66265, 132576, -12275, -157508, -198490, -107204, -78061, -58660, -41055, -96, 81292, 108549, 2093, -41776, 61066, 73142, 108330, 85499, 98443, 70732, 117735, 109925, 95105, 145719, 38057, -90601, -151695, -44242, 5931, -86689]
24704h6689l5418J23462l3256J4478k4219q4102p141L1853k0997J31554M1487
24693E1012q1934n6976m5240o085L8717k4725k2151M0909R2898K2174J5179r1802
24681f8024N1897J06442m7543J263l5942J0143R4785n4318o7927M6004K0138J1121
24669F8039N9876M5366j22866o2490O3803P884j4267M7884M1644M860j072J9715
24657A58376p1183j16195n1233J0491K5549J7430o222J5878P0305p127J1924o1503
24645c510K7444M0718n3959Q852j0691p716p0272l9700Q9676N2563k3583l5954
24633b6132P4330j2472m2738o144J08056J05689p2339j26368m5095M3365J1766
24622A1918j58769j41210K5185K9005M0084J62303P6521o6078j6154Q0711N3665
$$ y = [-86689, -122107, 1355, -31901, -17423, -41642, -125744, -132885, -101032, -122029, 9525, 51012, -30922, -87898, -133138, -139223, -100506, -125231, -147382, -106473, -13575, 8599, 23778, -68024, -16127, 90315, 42772, 44035, 8093, 18236, 113021, 58703, -9224, 36780, 56918, 68039, 127915, 173281, 50415, -12075, 51728, 59612, 45345, 93229, 134873, 139733, 138661, 158376, 87193, -29002, -80235, -69744, -44195, -26765, -32987, -17109, 53196, 46069, 57993, -3510, 23934, 64652, 10693, 19545, 8854, 1138, -69134, -108834, -19158, 33405, 9822, -26132, 48198, 35726, -7012, -13156, 94900, 200589, 128250, 1882, -43213, 152, 11918, -146851, -288061, -262876, -233871, -193787, -31484, 45037, -21041, -37195, 43516, 97181]
24611I7181L9066J7245M3672j65579q8598l9792l859l1567J6479l811O6112N142
24599d8309m6013q6313R796J18482J53260J2849l2633L6494m289j25888N0569
24588C8005j3684j04704k4565p811P5875J09703p8055j63392L0914J29170J6733
24577H189r5261j6679R4231o2167N4026l882L5210j471J28151j0458o924O5906
24565A88871j6040m7487j00356j23478Q7778N0398l3033n733J12403N1414o8885
24554I5852p5216K3470k5987J3546L0691O8375k1603k0601q7429l8931O2198J09895
24542A34260p0612k2228R6900L3904P1126n0976m8088K429j0994k4419q831M0053
24530A42524O2186o6918o5304J057K6532j5418K0335Q1568o4544j1543j4815Q8734
$$ y = [97181, 136247, 153492, 197164, 31585, -57013, -96805, -100664, -132231, -115752, -119563, -53451, -48309, -94322, -180635, -170839, -52357, 100903, 113752, 81119, 117613, 113324, -12564, 38005, 24321, -80383, -104948, -112759, -36884, 72819, -5236, -168628, -137714, -8544, 8189, -87072, -103751, -9520, -71687, -17661, -21543, 13667, 12196, 140347, 129889, 122965, 188871, 172831, 125344, 24988, -98490, -10712, 39686, 6653, 920, 113323, 164737, 95852, 20636, 44106, 18119, 31665, 62356, 130731, 109128, 88527, 1098, -37833, 24365, 134260, 63648, 41420, 138320, 172224, 243350, 192374, 144286, 146715, 135721, 111302, 102471, 142524, 204710, 137792, 72488, 73545, 100077, 84659, 104994, 186562, 122018, 110475, 95660, 184394]
24518A84394L3071j38361j18005P1680J33784K6530j9210R768m2064n8945l6828
24507D5814N8701n4379j3848j6702N5473N6027r9960q1548R2261R2494l3762k0274
24495H0297q3208J4964N0338K6331j3990O8263Q6393m2973n8575r6245J21951
24484A53546M211J01261N6343p3304j2795j58328l1866P605l8331q6083O1457
24473a6284L5220K8139J3262M8648L1550O1966K6074j4730o5787n5759J05931
24462A98230N6938n1581j36314M8950L511M7644m6254R2539L2495r4831K405M912
24450A58644Q0490N7773p0051r927J35412j02444q6884K6211R8632k6260p0164
24439A91432k2857J6764k3836J8244P1951j29692o2863J1141M6867l9773K476
$$ y = [184394, 217465, 79104, -38901, 32779, 166563, 193093, 173883, 183651, 141587, 82642, 45814, 104515, 50136, 36288, 19586, 75059, 131086, 31126, -50422, 41839, 134333, 100571, 80297, -2911, 12053, 62391, 88722, 74732, 142995, 229388, 186415, 127840, 31595, 153546, 157757, 259018, 315361, 242057, 229262, 70934, 39068, 46673, 8342, -77741, -16284, 18936, 47075, 60337, 108985, 140535, 202501, 228575, 213845, 148058, 92299, 198230, 255168, 203587, 67273, 116223, 119734, 167378, 121124, 213663, 246158, 151327, 153732, 158644, 239134, 296907, 226856, 216929, 352341, 249897, 163013, 189224, 287856, 261596, 191432, 168575, 185339, 161503, 179747, 251698, 122006, 59143, 70284, 117151, 77378, 79854]
24428G9854M0482N3761p6823j20519J8161P8136O6784N2189M7616p6979n0353
24417A12309o4027m2820J43691k5281r5741Q3641j4256m4610M7596l6146p9896
24406a5540n5092K8090Q5141J39060M1567P0084L485j54239P8857J12151Q1577
24395D15141l5790m7399J7296J1264N9668j27269j97568l8934l6326N9324O5137
24384A44544O754K1684O0153M0028K3806j1249L4426L3589r259l479o6504J9013
24372B93506l7082j63488j1788k6356J24119J888k1560j17205l8028J18096o565
24361A15537M8331J20890l615m9224j22794m890R2477O1478J58482N7349k3819
24350D50202m7957r5194o7273m397K700J14529L5665L4646j4603q295o1182K6870
$$ y = [79854, 120336, 174097, 97274, -23245, -5084, 73052, 139836, 192025, 239641, 162662, 112309, 48282, 5462, 149153, 123872, 28131, 111772, 97516, 52906, 100502, 64356, -15540, -70632, -42542, 42599, 181659, 223226, 293310, 296795, 142556, 221413, 333564, 415141, 379351, 331952, 349248, 360512, 420180, 292911, 95343, 56409, 20083, 79407, 144544, 151298, 172982, 233135, 273163, 296969, 285720, 320146, 353735, 344476, 340997, 274493, 293506, 256424, 92936, 81148, 54792, 178911, 180799, 159239, 42034, 4006, 122102, 115537, 163868, 284758, 281143, 231919, 109125, 104235, 196712, 258190, 416672, 474021, 450202, 402245, 307051, 239778, 235381, 238081, 352610, 388275, 422921, 408318, 400023, 338841, 365711]
24338C65711j6554j85214r8843M2413O7475m5397J8356Q2076j6570n290p0385
24327A37778l9054O7511K4455j42519j16994L6875M1197Q2307K8648j2181J32998
24316B41021J13852j7377p6671j5540M7320o5192K0256Q6917M1682l183q5824
24305B87261p6688k4608n7737k2334r404R2791J73911K1290j11623q6932p1164
24294A14763O7237N0160K000L3623R3150n9213o2322m4794n240P361o6283k6317
24282A04125R9730O4741N8801m8587q08r8777k11325J32626L0296P1748J47096
24271C49666J13527R719j1525N0586J4j34769p1962p4811N7607l0377j17262J7496
24259A57909K7172Q5434L5012R7489n9563j02172n5249o7272r5393o0630J37901
$$ y = [365711, 349157, 163943, 65100, 107513, 174988, 129591, 147947, 230023, 213453, 208163, 137778, 98724, 166235, 190690, 48171, -68823, -31948, 9249, 91556, 120204, 108023, 241021, 354873, 337496, 260825, 245285, 292605, 227413, 247669, 334586, 376268, 373085, 287261, 210573, 185965, 128228, 105894, 96490, 189281, 363192, 384482, 272859, 185927, 114763, 182000, 232160, 234160, 267783, 360933, 301720, 239398, 194604, 189364, 196725, 130442, 104125, 203855, 268596, 327397, 278810, 278002, 179225, -32100, 100526, 130822, 202570, 349666, 463193, 472912, 461387, 511973, 511987, 377218, 305256, 230445, 288052, 257675, 140413, 157909, 185081, 270515, 305527, 403016, 343453, 241281, 186032, 118760, 23367, -37263, 100638]
24248A00638L0647R8671M0799k774J06729k2917K3662n9923j9615K3068j3352
24237C05633o1986P3205P6382R8368N8660o3945l3575O562l371k1683n0941o0755
24225C22554q3134n181n9991R0344q6853M3671J33500J11420q8262m3893N4547
24214C88722J980j6402M2220O0397j31295m5227L4615j2877o370J00304P6221
24203D92288L5222P492j13059p6569o3727M2012m0005L4928j147o0486J00311
24192C57260k0167M3872j1721o1874K4491J31006p0641n4914M275k0389J40884
24181D62082M0823p5070q673J5315p271k5771K7537m1246O8893R1622K6500m1627
24169E33114L2206m9068n1814J51124q6658j21922j7992j06462J18139O1022M2722
$$ y = [100638, 131285, 229956, 270755, 267981, 374710, 351793, 375455, 315532, 295917, 318985, 305633, 243647, 316852, 393234, 491602, 550262, 486317, 452742, 459304, 455933, 434250, 383309, 322554, 239420, 234239, 174248, 264592, 177739, 221410, 354910, 466330, 378068, 334175, 388722, 390702, 374300, 416520, 476917, 345622, 300395, 335010, 322133, 315763, 416067, 492288, 527510, 535002, 421943, 345374, 281647, 323659, 283654, 318582, 317435, 256949, 357260, 337093, 380965, 369244, 307370, 331861, 462867, 392226, 337312, 341587, 321198, 462082, 502905, 427835, 419162, 434477, 427206, 401435, 428972, 387726, 456619, 548241, 574741, 533114, 565320, 516252, 464438, 615562, 528904, 406982, 388990, 282528, 400667, 461689, 504411]
24158E04411K2982n148k2576o7087P1338M5964l5795J93409J02735p2926o5874
24147F71433j2352j07834k6121Q9626n658l486N0293K2351l3410k4133Q175K4517
24135F53401j04805j21673J5062p1988J06574Q1572m3114k4242j06397k9996J18892
24124D73286J80361K4521j01971n1218N9573Q1709K7689m1902j12665m7633P2503
24113E64253J4277L552n8022m0054j7775k3537j16581j13796Q755l7844R0439
24102B73667J98137n1661j4140J05922O0336p5526R7994M6289K2155K2388k054
24091F83507j28310q4458o6126K4096J25873L7161L1875L2239P616J9135j29987
24080E52621j47393o8156O0461J85720j6744K4399m474k7630K8157P6429R745
$$ y = [504411, 527393, 522245, 499669, 432582, 503920, 549884, 514089, 707498, 810233, 737307, 671433, 659081, 551247, 525126, 614752, 609094, 605608, 655901, 678252, 644842, 620709, 628884, 653401, 548596, 426923, 441985, 369997, 476571, 558143, 515029, 490787, 384390, 354394, 473286, 653647, 678168, 576197, 524979, 584552, 666261, 693950, 652048, 539383, 491750, 564253, 578530, 582082, 524060, 484006, 466231, 442694, 326113, 212317, 221072, 183228, 273667, 471804, 420143, 406003, 511925, 572261, 496735, 594729, 641018, 663173, 685561, 683507, 555197, 470739, 404613, 428709, 554582, 591743, 623618, 655857, 663473, 682608, 552621, 405228, 337072, 397533, 583253, 566509, 590908, 586434, 558804, 586961, 663390, 673135]
24069F73135M6698m3761j4237o3297j437K7054k685o3187O1733j6061k3675j68589
24057D11691l5696R4313l7085M7189J34152J121o7078p6174L2731K127Q5586J46558
24045G39435l5776q6649j09650j3550m0295O2082Q8050k1160p5730p7521l1206
24034C98030Q2984J21987q0139n934q898j6011k9283Q0839L6196j3320K2773R234
24022E98458n1192n2945J32497k5631l0864k0534M1152J03761l6100o2408M8213
24011F44407Q2941L333j08743n7342J39811j4887J6994m3555r5229k3760L6195
24000E80165O6709N0952Q423r0063k9090O5150j22406r1433l7436J13752j8301
23989D96422L2084l190M2268M0730l4724o3518O171M5471o936K058M0747r9655
$$ y = [673135, 719833, 676072, 661835, 598538, 597101, 624155, 621470, 558283, 620016, 603955, 580280, 411691, 375995, 470308, 433223, 480412, 614564, 615685, 548607, 472433, 505164, 507291, 592877, 739435, 703659, 617010, 507360, 493810, 453515, 515597, 603647, 582487, 506757, 429236, 398030, 481014, 603001, 522862, 516928, 508030, 492019, 462736, 543575, 579771, 566451, 589224, 598458, 547266, 494321, 626818, 601187, 570323, 549789, 590941, 694702, 658602, 596194, 644407, 727348, 730681, 621938, 564596, 704407, 689520, 706514, 662959, 567730, 543970, 580165, 646874, 697826, 706249, 616186, 587096, 652246, 529840, 438407, 400971, 514723, 496422, 528506, 525316, 567584, 608314, 573590, 510072, 516243, 561714, 554778, 556836, 597583, 497928]
23977D97928j20425M2216J22229R5451l0532o1846N5940N3156M7848N435j76542
23966E30858M0277O2861p6333M928p612l8534n6719K1482N2420Q557l4385J4043
23954E21843Q7694J73853l7076n7753K0974j01021j00419r807K9178L1309R5343
23943F54118P9520k7006j44458j23596K157O701L1161O7681K1329J0048P9092
23932F56747L0849n4547N9299K3220M7524j5390l2725L9686N8467o1243p7878
23921F74009L1548q2776l6040O6114N1727N2864R3053n0755j43540l1253Q6518
23910G11469K0335j65504q8839O8199n5658L2668L8492L7151j06812n729j9441
23899D66331o7967k2526L9498M5402L7018j2374N3484L4727M1979Q6606m4603
$$ y = [497928, 377503, 419719, 541948, 637399, 606867, 545021, 600961, 654117, 701965, 707400, 530858, 571135, 633996, 557663, 562591, 554979, 516445, 459726, 481208, 533628, 542185, 507800, 521843, 609537, 783390, 746314, 688561, 709535, 608514, 508095, 498288, 527466, 558775, 654118, 733638, 706632, 562174, 438578, 440735, 447436, 478597, 546278, 567607, 577655, 656747, 687596, 633049, 692348, 715568, 763092, 747702, 714977, 754663, 813130, 751887, 674009, 705557, 622781, 586741, 652855, 704582, 757446, 850499, 799744, 656204, 624951, 711469, 731804, 566300, 477461, 545660, 490002, 522670, 561162, 598313, 491501, 485772, 466331, 398364, 375838, 415336, 460738, 497756, 485382, 538866, 573593, 615572, 702178, 657575]
23888F57575L7787j10726m7348Q235m958m103p356l3162J40363P3276K9827j07883
23876F31527j32393o6695N5245Q6425Q025q516N233P0443n5921k6363j2810J5604
23864E69804J1377N0375R0350K7176j35343r43o5959Q415m4195l1164P135L9297
23852E26325R3220n5160o3629M5757L9071K2476M3352j19859o1312J8526O093
23841D94860J42944k8615m6585N6168N3238q212J9013r402j05443K5678J52747
23830G46391O2787j01283p0754n076q6608p1681N7308M8715k7963L1556q6605
23819D96787j00377K5337M3328l9512O5182M6617O7391J23919N4038j51538m9995
23808E81177O631n4p4646L6916j01894l7398M4496K8492M9946Q4434O3475O8004
$$ y = [657575, 695362, 584636, 537288, 545523, 540565, 536462, 529106, 495944, 636307, 709583, 739410, 631527, 499134, 432439, 487684, 574109, 582134, 573618, 578851, 649294, 593373, 567010, 554200, 569804, 581181, 631556, 721906, 749082, 613739, 612796, 546837, 555252, 511057, 479893, 487028, 526325, 619545, 564385, 500756, 546513, 585584, 608060, 651412, 531553, 470241, 488767, 494860, 637804, 609189, 562604, 618772, 672010, 663798, 682811, 673409, 567966, 593644, 746391, 809178, 707895, 637141, 632065, 545457, 473776, 531084, 579799, 551836, 583392, 496787, 396410, 421747, 465075, 425563, 490745, 537362, 604753, 728672, 782710, 631172, 581177, 587808, 587754, 513108, 550024, 448130, 410732, 455228, 483720, 533666, 618100, 681575, 749579]
23796G49579n2531j12340j4084M7173J23292r282j06868O995N2863R5064k4534
23785G55327j93413o1541o9464n1949J01164P5346l1680n3429P4861J3647O8798
23774F27667J3004J4125J7690r6811l5907K7128m2780K0856O915N5974k2707j23715
23762D61439n7928K0738J16974L8904Q0203K2272j5691k3807q650m6458N327o9295
23750E24028R529P268l1949L8985L3960R0103j1095L239j00019M5544j0438j0114
23738E89041M2910m6002j44308q4379L0339Q7644k4347L1851M1768m8640J62m104
23726D71935j1156j59295J1601J01051K001j6066Q1108J02486l114q3433j43461
23715C53657k2334J13164M3064q2078J0094N7965J2177N5016M5999q5773p9165
$$ y = [749579, 697048, 584708, 570624, 617797, 741089, 731807, 624939, 631934, 684797, 779861, 755327, 561914, 500373, 430909, 378960, 480124, 555470, 523790, 470361, 545222, 558869, 627667, 640671, 654796, 672486, 575675, 539768, 566896, 524116, 544972, 551887, 607861, 585154, 461439, 403511, 424249, 541223, 580127, 660330, 682602, 666911, 643104, 634454, 587996, 593323, 524028, 533557, 540825, 508876, 547861, 581821, 671924, 660829, 664068, 564049, 609593, 599155, 589041, 631951, 585949, 441641, 357262, 387601, 475245, 450898, 482749, 524517, 475877, 476039, 471935, 460779, 301484, 313085, 414136, 416137, 400071, 481179, 583665, 580551, 497118, 353657, 331323, 444487, 487551, 405473, 415567, 473532, 485709, 540725, 586724, 500951, 421786]
23704D21786L2587l6828q3599j4594m1809j0797j7253K3762J12484R1806K1724
23693D99269J30850j915m2211k079n3994j19576J41913K2442q0259K0683l9750
23682D75373m4713j0702J05071P0342m8054j5267J3252N3282m0019q6052L36M8124
23670E20973n7620K8536p4749q9985O638J00968J6410P8455O2205J8198j6332
23659E93697N0177j31461p2365j0836j18675o0959O6320J2934L8857L7203Q3997
23648D88889L0108L8669K8993l3754k4979p3799K0793Q514p5855m6467q8038Q263
23636B81337J09727k3215L0333k1631n8074p9270L9098K01187Q3356p1599j12780
23625C78469M3304j9977K6252K0782m2289l7623O3978N8192M1876j3560n9662
$$ y = [421786, 454373, 417545, 333946, 319352, 277543, 266746, 249493, 273255, 385739, 477545, 499269, 630119, 628204, 585993, 583914, 529920, 410344, 552257, 574699, 494440, 515123, 475373, 430660, 419958, 525029, 595371, 547317, 532050, 545302, 598584, 558565, 472513, 472849, 520973, 463353, 491889, 417140, 327155, 333793, 434761, 451171, 529626, 591831, 610029, 593697, 643874, 512413, 440048, 429212, 310537, 249578, 315898, 328832, 367689, 404892, 488889, 518997, 557666, 586659, 552905, 527926, 454127, 474920, 483434, 407579, 361112, 273074, 281337, 391064, 367849, 398182, 376551, 318477, 239207, 278305, 479492, 562848, 491249, 378469, 421773, 401796, 428048, 448830, 406541, 368918, 432896, 491088, 532964, 519404, 459742]
23614D59742p0894l9724R0N2240J840q5629n9834K7446L3200l267M4423p7304
23602B82329j58993J8176R4981J7422k4995n4069J36911O95j0062N3860N4184
23591D10439P8400k4324p6024j24504J1416J1370o1709N5866q8205p6420p214
23580A09091M2106J05894Q2735L0323m9333M3677P181J790j11775l9070O4810
23569B87429O5226N9554j8874N1295L9015k9871M38m2340o8970r780l1792N2522
23557C53852P2781K4126o7743l627j46651j4883O9670K5316j7957J2810N1625
23546C59319m127r4984L9620R6765L6065M604L9538k5808o2247l9539L3465K3233
23534D05904n2860k7220o375R1905k0066n3904o4949l6396o4717J5742j9298P8016
$$ y = [459742, 388848, 349124, 349214, 401454, 403294, 317665, 257831, 285277, 318477, 315210, 359633, 282329, 123336, 141512, 236493, 253915, 228920, 174851, 311762, 312457, 302395, 356255, 410439, 488839, 464515, 388491, 263987, 275403, 286773, 225064, 280930, 192725, 116305, 109091, 151197, 257091, 339826, 370149, 320816, 364493, 371674, 373464, 261689, 222619, 287429, 352655, 412209, 393335, 444630, 483645, 453774, 454212, 411872, 342902, 333122, 301330, 353852, 426633, 450759, 383016, 379389, 232738, 217855, 287525, 312841, 294884, 307694, 359319, 355192, 260208, 299828, 396593, 432658, 437262, 476800, 450992, 388745, 349206, 382671, 405904, 353044, 325824, 319449, 411354, 391288, 337384, 272435, 236039, 171322, 187064, 167766, 245782]
23522B45782N4587l5364p0352p1074q9540N7901O5522j3447l6219J04897P6366
23511B89059J25412K8254j36743j6125K5783J1361l5287r2433K6776J39162N5230
23500D20449k5489j21621o1797n3668M9152L5771J63343J3952o1540M2957K5801
23489D27310m2163k6999p4079p2881l3479J469R9632O4266o7621r2340l3801k5439
23477A23875l6960J99406N7684q7316M4502J26223J03654p8558q9012j0922k9304
23466C23272o8222q3859N9426k9301p7059L2234Q2794k1014k8379l2327R3330
23455B50895l5169q7177J907m6333r3155j9117K44198k0074P281J9782P5603J770
23443C00411p3242l8113K8640l8187m5915L5144m3536l8472R6532k335j9926M1800
$$ y = [245782, 300369, 265005, 194653, 123579, 34039, 91940, 157462, 144015, 107796, 212693, 289059, 414471, 442725, 305982, 289857, 315640, 327001, 291714, 199281, 226057, 365219, 420449, 394960, 273339, 211542, 157874, 207026, 242797, 406140, 420092, 358552, 401509, 427310, 385147, 358148, 284069, 211188, 177709, 179178, 278810, 343076, 275455, 183115, 149314, 123875, 86915, 286321, 344005, 256689, 301191, 427414, 531068, 452510, 363498, 352576, 323272, 255050, 171191, 230617, 201316, 124257, 156491, 239285, 218271, 189892, 157565, 250895, 215726, 128549, 130456, 84123, -9032, -28149, 216049, 195975, 203256, 223038, 298641, 300411, 227169, 189056, 217696, 179509, 133594, 168738, 125202, 86730, 183262, 180927, 161001, 202801]
23431B02801J07661K8874k7252l1989j03315q0302P053k4406L9355J11826j8897
23420B11409j63291m1200K4084L4823N6768N0155L6184L7457Q85r2974n784N3038
23408B01554K9871N780n5183J1782L7541j35640O713Q479Q2598o015R129n740
23396A90869Q7833o2508M4469L8978m2476p9861j8430p357J7842m1376r957k6010
23384I2016m225n1849k3049J61973M0654n5345L4756J26518m8419j02721j0096
23373A60213r5877m46l2236J01270p1143m7307q7734J9983P9926J50670l191J9330
23361A93458j3130p7076M7801O1315l115N711J257m0846r0849P1018k082R824
23349A63286k0037l9988R080q014j7374j8455j8857P0793M257n4101K705O8995
$$ y = [202801, 310462, 339336, 312084, 280095, 176780, 96478, 103531, 79125, 118480, 230306, 211409, 48118, 6918, 31002, 65825, 122593, 172748, 208932, 246389, 247274, 154300, 148516, 201554, 231425, 237205, 182022, 193804, 231345, 95705, 102418, 110897, 193495, 187480, 196609, 190869, 278702, 216194, 260663, 299641, 257165, 177304, 158874, 151517, 169359, 127983, 118026, 92016, 87791, 35942, 12893, 174866, 215520, 160175, 194931, 321449, 273030, 170309, 160213, 64336, 63890, 31654, 132924, 61781, 14474, -73260, -53277, 26649, 177319, 174128, 193458, 180328, 103252, 151053, 212368, 209253, 214964, 216221, 175375, 84526, 155544, 153462, 163286, 143249, 103261, 112341, 104327, 86953, 68498, 49641, 120434, 124691, 70590, 73295, 142290]
23337A42290J4860j6124l3867L954k4158N1009J01435J2140K0542k8113o8374
23326A75594q4798n8906L8542K9271p6826n6767J17692L3329k4468M7661J13530
23315B53854K6171p664N0129o5053o2494j30790n464m7229K8621j9060k1143J64058
23303A63936M8839J2581n007k255j1945o3389j4825K2280n5863p9693o7638r8024
23291a51003N6919M6628L6996P1301j7152K7630N220p6705N7252j0863o7602l9825
23279f1204K26273R7583J3832n7658j4324K808o4691j01554p2550R2718L1158
23268I2391n5666m7069P1694j1851O405Q7614J16123L8226p3769k6836q3481m1964
23256G1817Q0569J3777L9684M1334q3120o4059L1880k0681n5090m3291o2882P6495
$$ y = [142290, 157150, 141026, 107159, 111113, 86955, 137964, 239399, 251539, 272081, 243968, 175594, 90796, 31890, 70432, 99703, 22877, -33890, 83802, 117131, 92663, 140324, 253854, 280025, 272361, 322490, 257437, 194943, 64153, 58689, 11460, 40081, 21021, -122, 163936, 212775, 225356, 220349, 218094, 206149, 142760, 127935, 150215, 94352, 14659, -52979, -151003, -94084, -47456, -10460, 60841, 43689, 71319, 76539, -166, 57086, 46223, -21379, -61204, 165069, 262652, 276484, 218826, 204502, 207310, 142619, 41065, -31485, 61233, 92391, 36725, -10344, 61350, 49499, 55904, 143518, 259641, 297867, 224098, 197262, 113781, 71817, 152386, 166163, 205847, 247181, 164061, 100002, 131882, 111201, 56111, 12820, -50062, 26433]
23244B6433R3426k273k5384r3377K9024j1043j5474J57103K0008Q4321l9566k5457
23232A97741M7164n1037n2467l4364N3077j7979J09842J05717r7934l3575o1579
23221A64606j9526J39605p9199j61302p1513J1493J06392O8470k0310q4020O3059
23210A17755L0895J9659M994j54662j23505O5650k5130l4637l1586l8075N1810
23199a16832N0923o0980M066J6770N5208L5375M404l1077J07254K9628l5957j8529
23187D0253O1783j06505p9506q8909N181J55796R8567Q9925j2311m6130j395K2325
23175A39074P4545M9024k2283L063k7171j55957N796J02659N8178k4062j08847
23164I4019m1974j33951j49240K3803J39219K26777O0679n3915K3443m5242o4323
$$ y = [26433, 119859, 117586, 92202, -1175, 27849, 16806, 1332, 158435, 178443, 262764, 223198, 197741, 244905, 193868, 141401, 107037, 160114, 142135, 251977, 357694, 259760, 226185, 164606, 145080, 284685, 205486, 44184, -27329, -15836, 90556, 159026, 138716, 54696, 117755, 148650, 168309, 173303, 18641, -104864, -39214, -64344, -98981, -130567, -168642, -116832, -65909, -126889, -122823, -106053, -50845, -15470, -11066, -42143, 65111, 94739, 58782, 40253, 102036, -4469, -83975, -172884, -167703, -11907, 86660, 176585, 164274, 118144, 116749, 139074, 213619, 262643, 240360, 243423, 216252, 60295, 66091, 168750, 226928, 202866, 94019, 52045, -81906, -231146, -207343, -68124, 158653, 219332, 165417, 188860, 143618, 79295]
23153G9295K092M3691K0981p8056k4863N6168L8533M772J66581O3228j26302j44045
23141A02075p2889M0987N5333N17n4528O520K4985Q8243K0408k9633q154r1725
23129H2139L213q5931J137j5028l4401O3897k2708O5080P9978q9624k6770m771
23117A6211l6670j13830j5971J19466m6297l1059J15989J44204J5148j51845j27874
23106a12528q1597N0772J24087J12904l2825j4672J7402K3681p0132j02902o6858
23095a52668N5727N3613J3552m1774M0262N7434p1499j07723N4840L5754k3942
23084h6424k5068N7040P1546M1162N8760j85507m9972K3307J4903j1525l049L7627
23072e7200K6651j05661J6766O4904N1011Q1597m5525j49890m7639k3328M9298
$$ y = [79295, 81387, 125078, 146059, 68003, 43140, 99308, 137841, 142613, 309194, 372422, 246120, 102075, 29186, 70173, 125506, 126023, 71495, 78015, 103000, 191243, 211651, 182018, 173864, 82139, 85352, -579, 558, -14470, -48871, 15026, -7682, 57398, 137376, 47752, 20982, 16211, -20459, -134289, -150260, -30794, -77091, -108150, 7839, 152043, 167191, 15346, -112528, -194125, -143353, -19266, 93638, 60813, 46141, 63543, 87224, 17092, -85810, -152668, -96941, -43328, -29776, -71550, -31288, 26146, -45353, -153076, -98236, -62482, -86424, -111492, -54452, 17094, 58256, 117016, -68491, -118463, -95156, -80253, -91778, -94827, -57200, -30549, -136210, -119444, -54540, -3529, 78068, 32543, -117347, -164986, -188314, -139016]
23061a39016J67237P8821P0453K8802j40861j0503N3469N417r672j5794p05L1795
23049A19443O0084n6234N742J7889Q0012k977n016l2554q2512j70354r491l0666
23037a06634p246l6423o1740K7716K2454o5035J3251R6946N2851N4575J6533r375
23025b127J00346k0339p4595q243m061N5826n8493j5419P0027O6186O167l9885
23013G5390Q4673R0780k7327j63577r6837R1460Q3652k4705p4219j06592o1095
23002a28397m1394J15809J77972P6779o4644L4303p5878j04081q2028J39770k1149
22991B7062J7773k9175J10994p513m8462m7309k8639l6350m3814m2205r1524K9412
22979a89750R6321O0164J7595O9181K7697l8872q2745J3488J01716N3136J1158
$$ y = [-139016, 28221, 107042, 177495, 206297, 65436, 54933, 108402, 113819, 104147, 88353, 87648, 119443, 179527, 123293, 129035, 146924, 226936, 223959, 218943, 186389, 103877, -66477, -75968, -106634, -113880, -150303, -212043, -184327, -161873, -226908, -213657, -116711, -63860, -9285, 7248, -2127, 98219, 77880, 3285, -4958, -9019, 46807, -11686, -27105, 42922, 109108, 115275, 75390, 160063, 250843, 223516, 59939, -36898, 54562, 138214, 113509, 39290, -67302, -128397, -169791, -53982, 123990, 200769, 136125, 170428, 94550, -9531, -91559, 48211, 27062, 44835, 15660, 126654, 119141, 70679, 23370, -5269, -41619, -85433, -127638, -219162, -189750, -93429, -33265, -15670, 53511, 81208, 42336, -40409, -26921, 74795, 127931, 139089]
22968A39089o4745r6372j00721J24793K8793L530N7797J0283J6818J0991N6753
22957A87009K6729L354j21655m3411K5313m9313q733m4017j2735p1604Q0310n8324
22945h7077k180J21821j25164J4139O2772L7619k6158j03260N0868N4318L7132
22934C4830R7429k4219o645Q1777q4587p0197l6256j25044J2939M6695J6700o8768
22922a25346m4496L9161M5550O3090M3895p7975n7301P6306K0398N1289J232r308
22910B6495k9895P2747k9432m9808l0090k3719J06934m4234q1132J0508J2568
22899e9058N9861P0563M256o7395j04009q5493k6453N5816J9680n5451L9973J10817
22887c6893J09767P2438o4047j09589K5157K4531k6517L1217M604P364n9614m7551
$$ y = [139089, 74344, -22028, -122749, 2044, 30837, 34367, 92164, 102447, 119265, 130256, 187009, 213738, 217092, 95437, 52026, 77339, 28026, 19293, -24724, -37459, -109063, -28753, -87077, -89257, 32564, -92600, -78461, -15689, 21930, -4228, -107488, -56620, -2302, 34830, 132259, 108040, 101395, 183172, 98585, 28388, -7868, -132912, -119973, -73278, -56578, -125346, -169842, -130681, -85131, -22041, 21854, -56121, -113422, -37116, -16718, 34571, 35803, 26495, -3400, 69347, 39915, -9893, -39983, -63702, 43232, -1002, -82134, -71626, -59058, 803, 71366, 75622, 8227, -95782, -181275, -207728, -151912, -132232, -187683, -147710, -36893, 72874, 145312, 81265, -28324, -3167, 21364, -5153, 26064, 30668, 38032, -21582, -69133]
22875f9133n3936M6761J09703l9353k451K5144J4593l1035L1967L2047k2429q5536
22863d3658j3232p1148L140l6825n3646J48463K7445r6999J13754M8205j20672
22852i5173Q5144R3251j6189m8j070l9625J07489P9629j7008J3944j02225l8553
22840F9566j21285l9382O5703P2220l0848l5453L7048r1794O0599J28162l788
22829A10748L5316j93330n3974J42589R623n713J578m2274j6125k4990M9539q9391
22817g6404j14843n1534J5878N9076L5742O2975j3392J6786L1533n433J5271p8362
22805a02707m5042J07034J08019K3131L2844L8394j42149q6674r4557J05923o4605
22794a20389O3783J8823r5044J6459O9417k3093q2171j8476j1730k842j0884N395
$$ y = [-69133, -123069, -76308, 33395, -5958, -8409, 16735, 31328, 293, 32260, 64307, 41878, -43658, -56890, -128038, -124898, -161723, -215369, -66906, -39461, -136460, -22706, 25499, -95173, -10029, 83222, 67033, 66985, 65915, 26290, 133779, 213408, 196400, 210344, 108119, 69566, -51719, -91101, -25398, 46822, 15974, -19479, 17569, -74225, -13626, 114536, 110748, 146064, -47266, -101240, 41349, 50972, 45259, 46837, 4563, -11562, -36552, 12987, -76404, -191247, -242781, -226903, -167827, -132085, -69110, -82502, -65716, -34183, -39616, -24345, -102707, -147749, -40715, 67304, 90435, 123279, 161673, 19524, -67150, -161707, -55784, -120389, -56606, -37783, -132827, -116368, -46951, -70044, -152215, -170691, -182421, -185263, -196147, -190752]
22782a90752R7572J26987P0359p7734n74J10379J76310n7154j54988l2433J0811
22771G8783m0234k6254q5381k2335k633j8168m5196J13422J15175K7353m968P136
22759I6700k7818j09443J1881J169q659K4126l9909p8961l0533J5845j8882M4147
22747a20337Q6876J16931P7420j578M7712p8998J7984O4197q8531m7081r6356
22736b1761n2573J9126o3021M0047J79544P2642k112r9940j35299L9608N8718
22725C4979J03170l9613o5745O496l3200P658R8276k1798j34465l367P371r0965
22713a31203n0756N4361L0457k7283o9363O2712M6010n5339K5659m540N8441p7994
22701a38838M5284J103K1083N933P2738Q0310N1159J0713p6561j05550K2959k539
$$ y = [-190752, -93180, 33807, 104166, 26432, 25858, 136237, 312547, 255393, 100405, 67972, 78783, 38549, 12295, -73086, -95421, -98054, -116222, -161418, -47996, 67179, 94532, 89564, 96700, 68882, -40561, -28680, -27511, -36170, -12044, -51953, -130914, -161447, -145602, -164484, -120337, -33461, 83470, 160890, 159312, 207024, 128026, 146010, 210207, 121676, 74595, -21761, -74334, -55208, -118229, -78182, 101362, 174004, 171892, 71952, -63347, -23739, 34979, 138149, 98536, 32791, 39287, 6087, 13745, 112021, 90223, -44242, -47609, -40238, -131203, -181959, -127598, -97141, -124424, -193787, -131075, -85065, -140404, -114745, -119285, -60844, -138838, -93554, -92451, -71368, -65435, 7303, 87613, 138772, 149485, 72924, -32626, -9667, -12206]
22689a2206M3503j63l6941j23132q055L5641N2971O7580j7431q5337O3343J5046
22677e181R6955N2986q9793L8905m7222r5120r6252p0860M7431J30270j4800o8842
22665a21523l3635K7771m3869k3343J9999p2583p1022J39122Q2900M0575l3101
22654h8709q1288j0821q0234m9932Q5034J47927O0453L1002o074O1052R300q2043
22642d333o1296N9869N5913m4971n76j00711P5218J8957o1934j8597n6507n2450
22630a91418N0894r641O3242J14680l7356N098M1546J4199n8240l1885n1318l1584
22618a21783l3756K652l2420j3798K454Q9513P2530K3050K0902L6997j4842J6006
22606D7505l6161L4620k8012m1348k2366l5381M1355J05813q2897j2856j1728
$$ y = [-12206, 31297, 31134, -5807, -128939, -136994, -101353, -48382, 19198, 1767, -83570, -20227, -5181, 91774, 144760, 54967, 93872, 46650, -48470, -144722, -215582, -168151, -37881, -52681, -121523, -155158, -127387, -171256, -194599, -174600, -247183, -318205, -179083, -96183, -55608, -88709, -169997, -180818, -261052, -310984, -225950, -78023, -17570, 13432, 7358, 68410, 77710, -4333, -65629, -5760, 50153, 5182, 4606, -96105, -20887, -1930, -63864, -82461, -138968, -191418, -140524, -150165, -86923, 27757, -9599, -4501, 37045, 51244, -6996, -38881, -90199, -121783, -155539, -152887, -185307, -199105, -196651, -107138, -34608, -11558, 9344, 46341, 31499, 47505, 11344, 45964, 17952, -23396, -45762, -81143, -39788, 66025, -16872, -29728, -41456]
22595d1456k6284Q2k2783N8436L7238j4710q1356m5123r481J24871k9252q0499
22583a30317K6861R2047M2312j21536r8831J11985J24061k566r2368M0912R3155
22572H5715l5987l2183R712o9101J5772K8769O9944k9828n9833j9299K2267P8551
22560F4499q9710r4251m3161J4899J38398L424p0124j42422K8033J60203M9052
22549A8840q9618n4845j00138K2452q323O3766J08141k1131N5802l9014q5076
22538a29144P807o974M9374O467l2591m743N6674J2617m4258j8800j5446j2587
22526a31604j4580n8817k445J44564R1116j4776j5513L9852k8550r052L6083j5091
22514B1187L9236L4673j35999j468L8052n9865K4999P5320n2356p3343j9188J57132
$$ y = [-41456, -67740, -67658, -90441, -32005, 5233, -9477, -90833, -135956, -145437, -20566, -49818, -130317, -103456, -11409, 30903, -90633, -189464, -77479, 46582, 44016, -48352, -7440, 85715, 49728, 17545, 27257, -41844, -26072, 2697, 72641, 42813, -17020, -36319, -14052, 64499, -25211, -119462, -162623, -147724, -9326, -5902, -76026, -218448, -190415, -30212, 18840, -70778, -125623, -225761, -203309, -211632, -147866, -39725, -60856, -5054, -44068, -129144, -121337, -128311, -78937, -72470, -105061, -109804, -53130, -40513, -84771, -103571, -119017, -131604, -146184, -205001, -207446, -62882, 28234, 13458, -2055, 37797, 9247, 195, 36278, 21187, 60423, 95096, -40903, -42371, -4319, -64184, -39185, 36135, -16221, -89564, -108752, 48380]
22502D8380L0552P3283p6528o1615q705J9383N7153j0258O9445l1189j56079k4648
22490g0826O2594p20j44368l7528J06361J45286P0391q9704O5755q3666r7789
22479g4214r1260L173Q3202N9460P8551J41026j3462k703N955q2582j06144p588
22467f586l0517N5081l1489q8475m3727R605m9157N6156P8263k9455R8433N7940
22455G6072n2624n5461p8799k9243L5641J9147p2798L5106J9271L3707M0343p7057
22443a06695m4148J38926L1774L1118l7447p0589j41679J07067J16808k1709K6693
22432C0119q0128l8802J5079j077j01760l8760o5473O3185O8483j4402l6017k0316
22420b19869J42709Q7029N9115Q8813j8309o1449k6432K5650j06988k0987o681
$$ y = [48380, 78932, 152215, 75687, 14072, 5367, 24750, 81903, 71645, 141090, 109901, -46178, -70826, -8232, -8952, -153320, -190848, -84487, 60799, 131190, 41486, 107241, 23575, -74214, -165474, -162301, -79099, -19639, 58912, 199938, 186476, 183773, 189728, 107146, 1002, -6586, -37103, 17978, -13511, -101986, -145713, -136108, -185265, -129109, -50846, -80301, 18132, 76072, 23448, -32013, -110812, -140055, -104414, -85267, -158065, -122959, -103688, -69981, -29638, -106695, -150843, -11917, 19857, 50975, 13528, -57061, -198740, -91673, 25135, 3426, 30119, -50009, -88811, -73732, -74809, -176569, -215329, -280802, -217617, -149134, -163536, -199553, -219869, -77160, 9869, 68984, 157797, 139488, 78039, 51607, 77257, -29731, -50718, -57399]
22409e7399r1430M7178L8972p8848o8940J37222Q4447q4183o1812K0914Q9184
22398b4695m1877l8786J684J2892M0588J8684o8957o2182M2876L7661K2092Q8045
22386B8025M8370n8356K3565L5243K3127l454j962m4142o3168j7512P6390j24894
22374g8768m5700L7416L4124J40067k7282j65916n896O2135L5648k6619Q3962
22363D3171K8703k2119L5123P295J7947j15080k0368k004N4393O8910p6251J0689
22351C0409P2782p5882k01578N1874P7703j0990M8456R1750K2064m881j17549
22340a5842K8639R0123o9141n3241Q799m8057j06967j0052N5960N9214J7145p1396
22328a14816K0425K5757M6344J05535o2937j09786o1890r3752j1337j6571P5025
$$ y = [-57399, -148829, -101651, -62679, -141527, -210467, -73245, 11202, -72981, -134793, -113879, -24695, -66572, -105358, -103674, -90782, -50194, -31510, -100467, -162649, -119773, -82112, -60020, 28025, 76395, 18039, 41604, 76847, 99974, 96520, 94558, 50416, -12752, -30264, 46126, -78768, -124468, -87052, -52928, 87139, 59857, -106059, -111955, -49820, -14172, -40791, 43171, 71874, 49755, 84878, 92173, 110120, -4960, -25328, -27332, 27061, 95971, 19720, 30409, 103191, 27309, -174269, -122395, -44692, -55682, -7226, 84524, 106588, 101707, -15842, 12797, 102920, 33779, -19462, -10663, -58720, -165687, -175739, -119779, -60565, -43420, -114816, -94391, -68634, -22290, 83245, 20308, -89478, -151368, -245120, -256457, -273028, -198003]
22317a98003P8367r2486M7877L3707L6744J1007O3273q2577N653N3686K911K6110
22305a3731K9226k1130k3632k0827r668q6994R2202R8139q2087l7550J963k6184
22293a00273p0017M0849N3152m2899l0393r0390N0100l77n4882l7902J7424N9750
22281b05858Q0221R0845p1698o9064J18980J16995o4405j54335O5785p128n71
22270a00233J33272o481n2638K9004J13882o0721j84810n9469J71574J00409l8102
22259D5687m7231J4789n1402O1966J48443K0136o1888O9309j21684j21497o8364
22248a11736J2630O5931j6807j4603l9847P3670m6851n88k7740K0774R931o3531
22236a38767P4124J7564j0465j8248m9963N0405L8293j7835J5201J8789j7500
$$ y = [-198003, -119636, -212122, -164245, -130538, -93794, -82787, -19514, -102091, -96438, -42752, -39841, -13731, 15495, -5635, -29267, -50094, -59762, -146756, -54554, 43585, -38502, -76052, -74089, -100273, -170290, -129441, -76289, -119188, -149581, -239971, -189871, -190248, -245130, -283032, -265608, -205858, -125637, -34792, -106490, -175554, -56574, 60421, -3984, -158319, -92534, -99662, -100233, 33039, 26558, -26080, 2924, 116806, 56085, -128725, -188194, -16620, 83789, 45687, -1544, 13245, -38157, 23809, 172252, 192388, 130500, 199809, 78125, -43372, -111736, -99106, -33175, -49982, -64585, -104432, -30762, -77613, -78201, -105941, -85167, -75236, -138767, -64643, -47079, -57544, -75792, -125755, -75350, -37057, -54892, -39691, -20902, -38402]
22225c8402L5986K5549k3302n9671M5563l1868j01054o4722N8688J39891O0563
22214D7221n1129K7999L1693N4016q0172j45202L2734m829k0003k8544k8452J397
22202a63271N3802K1051p7598q6156Q2349R3907M5998O3619j8784n9489L7886
22191f686k7573K6401p4502P658J34070N9081q847M4592M3857L2354j00904k12626
22179h3125j09115J11976K09722P972k3960j6217n1371l3946k4009o4269l2219
22168a08561J6298M7402K526P0128j02878j16378L1902O8923L955J9205M3797
22157b3681n3044n0430O0650J19488J38132K6204m3630M1965n5057j36019k5090
22146e12J21714M5919J4529l6752q0055k8616o870K413j56488K7746P8734p0136
$$ y = [-38402, -2416, 23133, -169, -59840, -14277, -46145, -147199, -211921, -153233, -13342, 47221, -3908, 24091, 55784, 109800, 29628, -115574, -82840, -87669, -107672, -136216, -164668, -163271, -109469, -88418, -166016, -252172, -169823, -75916, -29918, 33701, 14917, -44572, -6686, -34259, -7858, -82360, -74702, 59368, 118449, 109602, 154194, 198051, 230405, 129501, -83125, -192240, -80264, 129458, 137430, 113470, 97253, 45882, 11936, -12073, -76342, -108561, -92263, -44861, -42335, 27793, -75085, -191463, -159561, -90638, -86683, -67478, -23681, -76725, -127155, -66505, 52983, 191115, 217319, 173689, 215654, 160597, 24578, -512, 121202, 167121, 181650, 144898, 64843, 36227, 29357, 31770, -124718, -96972, -18238, -88374]
22134h8374o44k296l6653N1981j4896K9145M3724o3705p879R5596m32j09413j16605
22121b20451M1786Q6535k6380Q6843J44917l4306j47183j10730Q4697J10125m9323
22110c3470J3758Q0992O5581O1741J0091p8073p1451Q464L1446m640m1678o6911
22098b4150K0681q3767L0840Q1636J66499L1178q4124j2136l8n785q9385j45085
22086a13636N0981P7256m6938r605J6691Q9001M3743j109M086p3147j4048q741
22074A4534p5536k199Q8850L7753m6643k9573J1910O5986J29562L1650O1087m9948
22062B37433j06148r5734l3579o037o2326n4183l3563K26151Q6085n2888q6783
22051A8428o0203J9301J97511n0722j59161J297l3797K7031N9066l3603k7198
$$ y = [-88374, -89018, -91314, -127967, -75986, -90882, -61737, -18013, -81718, -89597, 5999, 5567, -103846, -220451, -178665, -92130, -118510, -31667, 113250, 78944, -68239, -178969, -94272, 15853, -33470, -19712, 61280, 126861, 188602, 198693, 120620, 49169, 57633, 89079, 84439, 42761, -24150, -3469, -87236, -56396, 25240, 191739, 222917, 138793, 126657, 126619, 120834, 31449, -113636, -62655, 14601, -32337, -41942, -25251, 63750, 107493, 106384, 110470, 37323, 23275, 14534, -61002, -63201, 25649, 63402, 16759, -12814, -904, 65082, 194644, 226294, 287381, 237433, 131285, 35551, 1972, -4065, -66391, -120574, -154137, 72014, 158099, 105211, 18428, -41775, -22474, 175037, 124315, -34846, -33549, -67346, -40315, 18751, -14852, -42050]
22040d2050L2407P1306J32063N7487j21098j10130O6996J03268q6855m4694l425
22029E5275O3337n2731m2457j1086M6448p1411o8814k1472Q082L4267M8824J50173
22017A38435K8621o5445j36366r3699J3667K5368n9761M0939O5221O7556J370
22006B5906o6310Q7391O877r6349o1054L9617k3549R6243J025q2825m682R4727
21994A7017J3679q8598n992k6466p1090O7695L9875r4653n6353J05779P6279J43727
21982A20899M2066n3518L1924j05081j44219N630O8506K2743L3146n9176q5878
21971a22958L2909L3446n706J21697Q7583n5599q8200P421N0334J08964q23n7019
21959A12049O4941K9803p2432k2960j38777N9339J42512K0848l7905r1039r9739
$$ y = [-42050, -9643, 61663, 193726, 251213, 130115, 19985, 86981, 190249, 103394, 58700, 55275, 118612, 65881, 23424, 12338, 58786, -12625, -81439, -102911, -94829, -60562, -11738, 138435, 167056, 101611, -34755, -128454, -114787, -89419, -149180, -108241, -43020, 24536, 25906, -40404, 46987, 53864, -42485, -103539, -63922, -87471, 8772, 9797, -73028, -77710, 17017, 30696, -57902, -63894, -90360, -161450, -93755, -53880, -148533, -204886, -99107, -22828, 120899, 162965, 109447, 141371, 36290, -107929, -102299, -33793, -11050, 22096, -37080, -122958, -90049, -56603, -62309, 59388, 146971, 91372, 3172, 10593, 60927, 169891, 169068, 112049, 176990, 206793, 134361, 111401, -27376, 31963, 174475, 195323, 157418, 66379, -33360]
21948c3360q4677N8458P5786k0125J15392J800l2320j7424M2626p5214j35590
21937a04648q7329M5406J97948J25008J6642N7512j14440p8612j2672j653J1602
21926E4764m3722k1085O1865N844p8978l3009O3349Q8466m1820k9265O1414m333
21914H3490j40563k9106J35680L1465l5408q6833P7644O839k7967J4776k7542
21903B475j8795J00144j8843M3955N3841m2990o1458J9378P1083M2020m8189p7197
21891F5424j52196M9803J72978R4208J43957M993j72017p3961m917J906o0264
21880F9914j29881o613N8700k6615j3259j20082p5100J08731P8197l3463J14182
21869B4711N6932q449j7024n8024R4019M8689r2938o1455k0171N0523J20283k1171
$$ y = [-33360, -118037, -59579, 16207, -3918, 111474, 113274, 80954, 63530, 106156, 30942, -104648, -191977, -146571, 51377, 176385, 193027, 250539, 136099, 57487, 44815, 43162, 54764, 11042, -10043, 51822, 57666, -21312, -54321, 9028, 97494, 55674, 26409, 87823, 83490, -57073, -86179, 49501, 80966, 45558, -41275, 36369, 43208, 15241, 30017, 2475, -16320, 83824, 64981, 108936, 162777, 119787, 58329, 77707, 148790, 190810, 142621, 65424, -86772, -36969, 136009, 230217, 374174, 379167, 207150, 133189, 128272, 130178, 69914, -59967, -66580, -7880, -34495, -47754, -167836, -242936, -134205, -56008, -89471, 24711, 81643, 73194, 56170, -1854, 92165, 140854, 47916, -13539, -33710, 16813, 137096, 115925]
21857A15925j91620q0815M1563L7817k8382m047M6832j3037K2019N7716m3219
21846c9248q456k858p1938q0809J22420O6743m335L1661r4952r1992J79797K19346
21834B25379L8679l6858k0771M8700n7717r9130k7613P245K396N6312J12355j07544
21822A41433k0838m599q6980j37031M9133N8117Q7010L9344k2013J0424K7463
21811A41463K334L1615j26774m9568N5192k0009J03944L6135k780K4807n5163
21800A41196p1537J4917n1624M2057R4176l7814m9890p5193k8359J07293J16205
21789B01427L7497q9943r6878p3867Q4898M2789o8999n5478Q1870j0830q682m8596
21777d792J11963K7186J5585L863k4455r8280o9803R6911M0024q728J6195R1954
$$ y = [115925, -75695, -156510, -114947, -77130, -105512, -109559, -62727, -75764, -53745, 3971, -39248, -47704, -50562, -122500, -203309, -80889, -14146, -18481, 13180, -81772, -173764, 6033, 225379, 264058, 227200, 206429, 255129, 197412, 98282, 70669, 77914, 80310, 136622, 248977, 141433, 120595, 115996, 29016, -108015, -58882, -765, 86245, 125589, 103576, 114000, 141463, 143797, 175412, 48638, -930, 54262, 34253, 138197, 174332, 171552, 196359, 141196, 69659, 84576, 32952, 75009, 169185, 131371, 81481, 6288, -22071, 85222, 201427, 238924, 148981, 52103, -21764, 63134, 105923, 36924, -18554, 63316, 52486, 43804, -4792, 107171, 134357, 149942, 153805, 129350, 31070, -38733, 58178, 98202, 89474, 105669, 197623]
21765A97623j9184K6924o5530o4524M7401l0799J01813J00139j37155p0720j5637
21754G0351l1277J1409P0151J18526o1843o7395R665p7352m553M4872J4616J24381
21742B21551n1961j9484N2444l4451o3526m8456O114j5441K5335N8528r6662j7513
21730A6478k4597P3043k9398o4105J11094M0984O378Q0378N2140m7459o1268j11989
21718D1679p1912N5696R9490o648q4281j9432O2355R2305Q1189j318j577M9386
21706B96932p9011p7136R7808m4257k2582Q4049m8651n8013k4692m1763J3288
21695I5972R4622J30179R7649L9668j01319l8226n7649o3346J1516K5343n6893
21684A77516J3426L4002M1510J5915r8630m1092k1931L8137O5585l3775j5807
$$ y = [197623, 178439, 205363, 139833, 75309, 122710, 91911, 193724, 293863, 156708, 85988, 70351, 39074, 50483, 120634, 239160, 177317, 109922, 119587, 42235, 37682, 82554, 97170, 221551, 169590, 150106, 202550, 168099, 104573, 56117, 62231, 46790, 72125, 130653, 33991, 16478, -8119, 64924, 35526, -28579, 82515, 123499, 129877, 210255, 262395, 214936, 153668, 41679, -30233, 25463, 124953, 118305, 34024, 14592, 76947, 169252, 250441, 249123, 247546, 296932, 217921, 140785, 238593, 194336, 171754, 255803, 207152, 149139, 124447, 82684, 95972, 190594, 320773, 418422, 458090, 356771, 318545, 260896, 197550, 209066, 234409, 177516, 190942, 224944, 266454, 282369, 183739, 142647, 120716, 158853, 224438, 190663, 174856]
21673A74856n2138j8907j4709J8592J1177N3796J21327J585o7624j43547n2170
21662C2238M2174M3961M509l4305k9377R4986o8022o6003L8858J4923P1404N1505
21650A96851J02106K4400k2877k1954j52269Q6317R7851J6628r0349K0549p9590
21639A77663N011R0938K5343J8208p6056r9725l2725Q6339L6979N0613O3561M9262
21627C95411l7985q7901l2214O7043K3393p5652j07350K1909O7817N2168k6405
21616B60234n1738J6951M3181L9614q4203j01966L413j4530l6581j397J21147
21605A94125Q3725J3957j14648J31653j9405q3942m7896o7874m2857J791Q0629
21594A29258l556K0654P3254M6036M1486m1093m1988o9088q306Q3174P1151L059
$$ y = [174856, 122718, 103811, 89102, 107694, 118871, 172667, 293994, 295579, 227955, 84408, 32238, 74412, 118373, 122882, 88577, 59200, 154186, 86164, 20161, 59019, 73942, 145346, 196851, 298957, 323357, 300480, 278526, 126257, 212574, 310425, 327053, 236704, 257253, 177663, 182674, 273612, 298955, 317163, 241107, 141382, 108657, 194996, 231975, 282588, 346149, 395411, 357426, 269525, 237311, 304354, 327747, 252095, 144745, 166654, 234471, 286639, 260234, 208496, 225447, 268628, 308242, 224039, 122073, 125486, 110956, 74375, 72978, 194125, 277850, 291807, 177159, 308812, 289407, 205465, 157569, 89695, 46838, 48629, 129258, 125702, 146356, 219610, 265646, 307132, 266039, 224051, 154963, 146657, 229831, 300982, 304041]
21582C04041J16823k4532m2250K8997l4044j39225p0750J3134q135L7120R2165
21571B73344o3376l0708j4076O3091r736p3044J43787N2162q3500m4591L0059
21560B43412m6446Q0530Q5254n6588q5097Q384K1470l6130K0213O4864m1989l7333
21548B20544k4158Q5524n0483L950J5267O5025o2172j1437m4310j2353Q6705J24569
21536C96671r7477J8869J53550N0849p2987m4771j64248p0120R534J191O8684
21525B49745M7069J6265Q7861M2955l2497j2663l7803m5958m377j1330o1030O801
21513B45038L0612j4896l5739M4372k872j374j6484M7436o7678j330N9583N2486
21501C39154N3384P8806P5348o3477m9811j83765o677j1908j7958O558P9445P489
$$ y = [304041, 420864, 396332, 354082, 383079, 349035, 209810, 139060, 152194, 144059, 181179, 273344, 209968, 179260, 165184, 228275, 218539, 145495, 289282, 341444, 257944, 213353, 243412, 196966, 277496, 362750, 306162, 221065, 229449, 250919, 214789, 235002, 299866, 257877, 220544, 196386, 281910, 231427, 235377, 250644, 315669, 253497, 242060, 197750, 185397, 272102, 396671, 299194, 318063, 471613, 522462, 449475, 404704, 240456, 170336, 179870, 181061, 249745, 296814, 313079, 400940, 443895, 411398, 398735, 360932, 314974, 310597, 299267, 238237, 245038, 275650, 260754, 225015, 269387, 266515, 265141, 248657, 296093, 228415, 227085, 286668, 339154, 392538, 471344, 546692, 483215, 433404, 249639, 242962, 231054, 213096, 219654, 299099, 306588]
21489C06588p147K37402Q7681n1953j68554j6972j7355m5698K2955M1069l5342
21478C52674o038o5291m8639j8069k4263j4536L3338K681N6346R2773k1532j8877
21466C20567L6806j9077P3773L7877q5894j00848J20099q5872M3748N7435L7285
21455D35899l2442m6340L325N1021N7152L0608r9587k6004q4706L3623O7890l7726
21443C52713m727N9935q295R1946O4176n1350j7228K9781j9291m0652L4770n7489
21431D34289j47149P738J56838J49614P2777p1896r3243k0102k1927n3187l6277
21420C77475J1954n9305m422J72935J5078j10893o3081j5658Q8110O4530L6250
21409E12973r624P0051J3997K9602k2570j15381j03100R8628M9644j3531j8850
$$ y = [306588, 299441, 536843, 624524, 572571, 404017, 387045, 369690, 323992, 346947, 388016, 352674, 346636, 281345, 232706, 214637, 190374, 175838, 209176, 211857, 268203, 360976, 339444, 320567, 357373, 338296, 412069, 449946, 364052, 263204, 383303, 297431, 341179, 398614, 435899, 403457, 357117, 360442, 411463, 468615, 499223, 399636, 373632, 288926, 322549, 390439, 352713, 347986, 407921, 399626, 491572, 555748, 504398, 487170, 516951, 497660, 457008, 491778, 434289, 287140, 294878, 451716, 601330, 674107, 602211, 508968, 488866, 466939, 413752, 377475, 389429, 330124, 325702, 498637, 513715, 402822, 339741, 324083, 412193, 476723, 512973, 503349, 573400, 587397, 616999, 594429, 479048, 375948, 474576, 524220, 510689, 491839]
21398D91839k0330j1644M5881J6728n9725K8708M0419N4107r4284j01534j1907
21387C78258J61147n1264M8407O3649N427j4136l5562P7071J20681q2616n5162
21376F15900L1642P405j8055j23074r2827J892k9518L8956J00794P5970J12629
21365G21714n7617n7147O6054j1567n1092P233O1256j13044j15699l9821K3575
21354D33845M0591m3975r4049L4258L0852m9010J46875P9846J1012o8090j12082
21343D10073Q5023k7349m6723J1149L5036R6174Q9883K8719l9350j8098N6657
21332F81194m0494o4224N6064Q7735J3420p3148j21625Q3774J14551r25o3418
21321F72904L5396O4041n6923J3055O505L092j27313l5807j8017p8172L4680J58831
$$ y = [491839, 471509, 459865, 505746, 522474, 462749, 491457, 531876, 585983, 491699, 390165, 378258, 539405, 488141, 536548, 600197, 605624, 591488, 555926, 632997, 753678, 671062, 615900, 647542, 654947, 636892, 513818, 420991, 422883, 393365, 432321, 533115, 609085, 721714, 664097, 606950, 673004, 661437, 610345, 617578, 678834, 565790, 450091, 410270, 433845, 474436, 430461, 336412, 370670, 401522, 352512, 499387, 579233, 590245, 522155, 410073, 495096, 467747, 421024, 432173, 467209, 563383, 653266, 681985, 642635, 624537, 681194, 640700, 576476, 632540, 720275, 733695, 660547, 538922, 622696, 737247, 736322, 672904, 708300, 772341, 715418, 728473, 734978, 738070, 610757, 574950, 556933, 478761, 513441, 672272]
21309F72272J5424Q6952O087O8365M0243k5674l7449J5363J7574n1902l1493K2735
21297G98497O6141M7853j5864o1221J2666O0452p8655j69408L4162j5762K7330
21286G06191K8951L6982K2961J752N3401j8690p6882n6677K5233O2049k8316J4051
21274G71006j5426J7482M9114Q9303l5137o6419o3115m4802J17577L1143J0188
21263H60914m6348O5075l3986L6180J18423J4727p3604m5818K9612R4431n1221
21252I68385n1666R2342L9369o8528r1882K2658M7587K9868M7381n4021j30284
21241H51209o6600J45493o1239K1621M47L2245N9844K6257p9601N0152Q6148p1980
21229I93996j29087j9615L2952M9564J30268L4473r629J1730l3418q3581j85649
$$ y = [672272, 687696, 774648, 780735, 849100, 889343, 863669, 826220, 841583, 859157, 807255, 775762, 798497, 864638, 912491, 896627, 835406, 848072, 908524, 829869, 660461, 694623, 678861, 706191, 735142, 772124, 795085, 796837, 850238, 831548, 754666, 697989, 723222, 785271, 756955, 771006, 755580, 773062, 822176, 911479, 876342, 809923, 746808, 702006, 819583, 850726, 860914, 814566, 879641, 845655, 881835, 1000258, 1014985, 941381, 895563, 925175, 1019606, 968385, 916719, 1009061, 1048430, 979902, 888020, 910678, 958265, 988133, 1035514, 981493, 851209, 784609, 930102, 868863, 890484, 890931, 923176, 983020, 1009277, 929676, 979828, 1065976, 993996, 864909, 845294, 878246, 927810, 1058078, 1092551, 1082922, 1094652, 1061234, 977653, 792004]
21218G92004j78037P0663P5179O3386N6691q89j4171M5045J2600m2751K357J13144
21206I95221R286k4419Q2709j0780l1151n663n611K5777L6792L2778k00744J8164
21194I22359J16673M6200L3440o3995K0925M5439N9292m8257j28700K3258N8051
21183A084685M3028m6581j2888l8217O6836J37537L6093J0546k6734n5906L110
21172A201509J02164J1366o2110j14970J19063K9904l7666J3397P1632P2890j0792
21161A396387j08415j11075J3014M6510J62778k4016j02003j44633l0991K0283
21151A117839j9232j4544L800n77J99852L3389j05216j42564R7650J09231N9484
21140A339112j11105M5989P5127L9166Q348K3948n3296m7795l6770N6269k283
$$ y = [792004, 613967, 684630, 759809, 823195, 879886, 878997, 864826, 909871, 922471, 879720, 882077, 995221, 1004507, 980088, 1062797, 1052017, 1020866, 1015203, 1009592, 1035369, 1072161, 1104939, 904195, 922359, 1039032, 1085232, 1118672, 1054677, 1075602, 1121041, 1180333, 1132076, 1003376, 1026634, 1084685, 1127713, 1081132, 1068244, 1030027, 1096863, 1234400, 1270493, 1281039, 1254305, 1198399, 1201509, 1303673, 1315039, 1252929, 1137959, 1257022, 1286926, 1249260, 1262657, 1334289, 1407179, 1396387, 1287972, 1176897, 1189911, 1236421, 1399199, 1375183, 1273180, 1128547, 1097556, 1117839, 1098607, 1084063, 1087863, 1087286, 1287138, 1320527, 1215311, 1072747, 1170397, 1279628, 1339112, 1228007, 1273996, 1349123, 1388289, 1396637, 1420585, 1367289, 1319494, 1282724, 1338993, 1336710]
21129A336710k1789r3401j9570J16913K5478K2043q891L0375o625Q917O4815J6129
21117A471104j1250j3408p5185l6006R1883J43921M363Q5448K2029j5115p8312
21106A589472n8252l6448j06083K1533L8799K0278J36261J20953L0319l9786k6198
21095A690848L855k0240K7690q8441r7441L3375J19561L0446O4933L584o0127
21084A708043m5740M4741l622k8145J410L0009P8275p2708l057P4911J4442N9486
21072A858045O1025m0798k1685J9511J73573l060p9756m76O520j2735j5403l5399
21060A909362o4000k9818L6423K2619N1346L866k7564m9165j8427O0050Q2754
21049A977446P0330j7917J17737K9466M6522n1729J48912J8472n7462N4216p1255
$$ y = [1336710, 1314921, 1221520, 1201950, 1318863, 1344341, 1366384, 1357493, 1387868, 1381243, 1390160, 1454975, 1471104, 1459854, 1446446, 1371261, 1335255, 1427138, 1571059, 1575422, 1660870, 1682899, 1667784, 1589472, 1531220, 1494772, 1388689, 1410222, 1449021, 1469299, 1605560, 1726513, 1756832, 1717046, 1690848, 1694703, 1674463, 1702153, 1613712, 1516271, 1549646, 1669207, 1699653, 1764586, 1768170, 1708043, 1662303, 1707044, 1703422, 1675277, 1676687, 1706696, 1784971, 1712263, 1709206, 1784117, 1798559, 1858045, 1919070, 1878272, 1856587, 1876098, 2049671, 2046611, 1966855, 1966379, 1972899, 1960164, 1944761, 1909362, 1845362, 1815544, 1851967, 1874586, 1925932, 1929798, 1902234, 1853069, 1834642, 1894692, 1977446, 2047776, 2029859, 2147596, 2177062, 2223584, 2171855, 2320767, 2339239, 2281777, 2335993, 2264738]
21038B264738j5264O0784k8516r397j12445P1597M9276q4450M2001N2725j619
21027B289430m1692L8680M82O922l7129q6002j3192P4453p1072M7807K0730J35982
21015B365399J21487j6330m5064P5453J00136K8692q8705r8774j53112M7250J82577
21004B519009K5593N2582M2350N5982J109p8973p16p2544j09467k2703M7748K2329
20992B482299O0560l6620j5469P2140Q0987j2498j6062N3559R3145L5884J7087
20981B815012J24135p0384j4711j4759Q337J34434J11699k9663K0845M6458O4406
20970C195809L0038j9967K3363l0449l0582Q678k2686o9820n8198k1897J8849
20959C023138P8612Q6652k4527Q5812N1257p2523K4998l0418o5535O9161Q7758
$$ y = [2264738, 2249474, 2310258, 2281742, 2272345, 2159900, 2231497, 2280773, 2196323, 2238324, 2291049, 2289430, 2247738, 2286418, 2286900, 2293822, 2256693, 2170691, 2157499, 2231952, 2160880, 2208687, 2229417, 2365399, 2486886, 2470556, 2425492, 2500945, 2601081, 2629773, 2541068, 2442294, 2289182, 2336432, 2519009, 2544602, 2597184, 2639534, 2695516, 2696625, 2617652, 2616936, 2544392, 2434925, 2412222, 2459970, 2482299, 2542859, 2506239, 2490770, 2562910, 2643897, 2631399, 2615337, 2668896, 2762041, 2797925, 2815012, 2939147, 2868763, 2854052, 2839293, 2847630, 2982064, 3093763, 3064100, 3084945, 3131403, 3195809, 3225847, 3205880, 3229243, 3198794, 3168212, 3176890, 3154204, 3084384, 3026186, 3004289, 3023138, 3101750, 3188402, 3163875, 3249687, 3300944, 3228421, 3253419, 3223001, 3157466, 3226627, 3314385]
20948C314385M0681P5838J23864L0458Q8387n2196M705j06682j1792J4219J14249
20937C636116O8707j05308M0161K1249N3124l0888J03087K5849j9064P0096l5862
20926C827267k7595J67148N8555j746l2130o6323l5075l1818j6819J22308K6735
20915C990507n4446M1972J00680o5822Q165J22564Q9829R3778m2700k4142r667
20904D250718K9179R3661J24831L4234L6255j731N132O0794M3841m613J0163R8990
20892D781454O9466p7576K0962R5199m5015P1897j2921M5661K2228m0288O8014
20881D999081J38111J66932J09979j5377r052l9874j07821J20095O1674M1253
20871E465001K5581Q0822J01180L4825j5570K0970J4496p328q19K9711K3372N9314
$$ y = [3314385, 3355066, 3430904, 3554768, 3585226, 3673613, 3621417, 3626122, 3519440, 3507648, 3521867, 3636116, 3704823, 3599515, 3639676, 3660925, 3714049, 3683161, 3786248, 3812097, 3793033, 3863129, 3827267, 3799672, 3966820, 4025375, 4023629, 3991499, 3925176, 3890101, 3858283, 3841464, 3963772, 3990507, 3936061, 3978033, 4078713, 4012891, 4021056, 4143620, 4233449, 4327227, 4284527, 4260385, 4250718, 4279897, 4373558, 4498389, 4532623, 4568878, 4567147, 4572279, 4633073, 4676914, 4672301, 4682464, 4781454, 4850920, 4773344, 4794306, 4889505, 4844490, 4916387, 4903466, 4949127, 4971355, 4931067, 4999081, 5137192, 5304124, 5414103, 5398726, 5389674, 5349800, 5241979, 5362074, 5423748, 5465001, 5490582, 5571404, 5672584, 5707409, 5691839, 5712809, 5727305, 5719977, 5719158, 5748869, 5772241, 5831555]
20859E831555J57471J72862P367m3286P949N8254R3702N9642L7190N8700J28326
20848F569732j18754M2124R3486J6419N6453J00989L2995P705q184J21074O4529
20837F978568O4368J9228J79392P2823P7697N7549P6995J01296Q2970o2652l1431
20826G616803L5720Q1567P6112L8576J50375J05833N7626l7168N8765J37401Q2262
20815H403872N0301O6877N6556J71921O0572L4354m7496O6844R7409J1493L5215
20804I007918R0194J22155J99511J60514Q6831Q3726O2572K7598Q0599q2014P9134
20793I918738J55320J30689J08781k4513J46393J77213R8264K2733J24498J29014
20783A0987130R5754J27506P4241Q6707n0832Q1949J64298J05323J30074J03387
$$ y = [5831555, 5989026, 6161888, 6169255, 6125969, 6133918, 6192172, 6285874, 6345516, 6382706, 6441406, 6569732, 6450978, 6493102, 6586588, 6603007, 6659460, 6760449, 6793444, 6801149, 6792965, 6914039, 6978568, 7042936, 7062164, 7241556, 7314379, 7392076, 7449625, 7526620, 7627916, 7710886, 7648234, 7616803, 7652523, 7734090, 7810202, 7848778, 7999153, 8104986, 8162612, 8125444, 8184209, 8321610, 8403872, 8454173, 8521050, 8577606, 8749527, 8810099, 8844453, 8796957, 8863801, 8961210, 8972703, 9007918, 9098112, 9220267, 9419778, 9580292, 9667123, 9750849, 9813421, 9841019, 9921618, 9839604, 9918738, 10074058, 10204747, 10313528, 10289015, 10435408, 10612621, 10710885, 10733618, 10858116, 10987130, 11082884, 11210390, 11284631, 11371338, 11320506, 11402455, 11566753, 11672076, 11802150, 11905537]
20773A1905537R0717K08008O7828J50814J67957J78158J9170J44235J33946P3142
20763A3139512O6196K7001J72693J73648J12095J17584K43994J62280Q5790J12058
20753A4412851K57591J98275J28124R3035K20594J78612J98266J72749K27902
20744A6087999K66330J26125O1785K32998J75224K51087J99582K33378K81162
20735A7915670K75216J27176K41573K88087L25783J50028J31630K96418K58736
20726B0010317L00406K58913J05248J52785L58807L46999L67282L50565L40666
20717B2591988K97812J84568K11450K44488L27630M29170L76703L11556L05066
20708B5280431L29064L01662L32997L37845L89791M18988M24575M36246M48016
$$ y = [11905537, 11996254, 12204262, 12272090, 12422904, 12590861, 12769019, 12788189, 12932424, 13066370, 13139512, 13205708, 13232709, 13405402, 13579050, 13691145, 13808729, 14052723, 14215003, 14300793, 14412851, 14670442, 14868717, 14996841, 15089876, 15310470, 15489082, 15687348, 15860097, 16087999, 16354329, 16480454, 16542239, 16775237, 16950461, 17201548, 17401130, 17634508, 17915670, 18190886, 18318062, 18559635, 18847722, 19173505, 19323533, 19455163, 19751581, 20010317, 20310723, 20569636, 20674884, 20827669, 21186476, 21533475, 21900757, 22251322, 22591988, 22889800, 23074368, 23285818, 23530306, 23857936, 24287106, 24663809, 24975365, 25280431, 25609495, 25911157, 26244154, 26581999, 26971790, 27390778, 27815353, 28251599, 28699615]
20699B8699615L94275M47285M59178M82459M65922M40280L40816M19910N19303
20690C2669043N70141N26420N67007N48474M02901N60236O31948M82836O51580
20681C7610586O19710O61701O67423O54795O95629P29857O61452O22163O56484
20672D3579800Q33573Q07833R73280Q50997P64158P98524Q38083Q14004R21066
20663E1181318J047333J089438R55715R66802J041380J096105J027645J152533
20655E9558269J173695J152765J267596J325887J287118J258202J388745J392820
20647F9805097J430301J513909J483067J421164J624021J791453J811994J771003
20639H2652009J790076J984327K108183K025238K028491K114813K238330K292077
$$ y = [28699615, 29093890, 29541175, 30000353, 30482812, 30948734, 31389014, 31729830, 32149740, 32669043, 33239184, 33765604, 34332611, 34881085, 35283986, 35844222, 36476170, 36959006, 37610586, 38230296, 38891997, 39559420, 40214215, 40909844, 41639701, 42301153, 42923316, 43579800, 44413373, 45221206, 46194486, 47045483, 47809641, 48608165, 49446248, 50260252, 51181318, 52228651, 53318089, 54273804, 55240606, 56281986, 57378091, 58405736, 59558269, 60731964, 61884729, 63152325, 64478212, 65765330, 67023532, 68412277, 69805097, 71235398, 72749307, 74232374, 75653538, 77277559, 79069012, 80881006, 82652009, 84442085, 86426412, 88534595, 90559833, 92588324, 94703137, 96941467, 99233544]
20631I9233544K355622K379099K610921K693892K643090K804990K793110K772295
20623A20286563L043143L131227L379850L474973L415282L538035L745264L769679
20615A47784016L922310M055062M198750M407656M398357M538727M618461M828558
20607A82751897N146553N155195N291132N269553N400548N606369N871323N839901
20599B26332471N995750O118207O083258O220885O377937O482617O484945O368949
20591B76465019O535375O634386O575452O504089O431249O293231O138627O030935
20583C27608363N986705N748740N432747N151780M914048M487185M146862L869504
20575C67345934L428751L020286K588380K005795J560851J196960P19892K2508
$$ y = [99233544, 101589166, 103968265, 106579186, 109273078, 111916168, 114721158, 117514268, 120286563, 123329706, 126460933, 129840783, 133315756, 136731038, 140269073, 144014337, 147784016, 151706326, 155761388, 159960138, 164367794, 168766151, 173304878, 177923339, 182751897, 187898450, 193053645, 198344777, 203614330, 209014878, 214621247, 220492570, 226332471, 232328221, 238446428, 244529686, 250750571, 257128508, 263611125, 270096070, 276465019, 283000394, 289634780, 296210232, 302714321, 309145570, 315438801, 321577428, 327608363, 333595068, 339343808, 344776555, 349928335, 354842383, 359329568, 363476430, 367345934, 370774685, 373794971, 376383351, 378389146, 379949997, 381146957, 381866849, 381889357]
20567C81889357l01219p48669j240831j723754k163087k543713k940062l353433
20559C66874589l571962l953937m420265m583119m848734m997660n216624n397665
20551C29884623n461028n484634n520114n713260n856326n852765n817210n777683
20543B84401603n714233n565312n639842n658971n582252n529756n354529n295741
20535B40060967n175729n104545n047726m991062m958196m846141m528656m429369
20527B00979543m423580m296034m203330m129787l981166l967914l858753l688056
20519A68430923l612475l456115l459591l461261l324412l247984l115234l178720
20511A41575131k987911k928851k815161k611040k669273k638057k530334k480915
$$ y = [381889357, 381588138, 380839469, 379598638, 377874884, 375711797, 373168084, 370228022, 366874589, 363302627, 359348690, 354928425, 350345306, 345496572, 340498912, 335282288, 329884623, 324423595, 318938961, 313418847, 307705587, 301849261, 295996496, 290179286, 284401603, 278687370, 273122058, 267482216, 261823245, 256240993, 250711237, 245356708, 240060967, 234885238, 229780693, 224732967, 219741905, 214783709, 209937568, 205408912, 200979543, 196555963, 192259929, 188056599, 183926812, 179945646, 175977732, 172118979, 168430923, 164818448, 161362333, 157902742, 154441481, 151117069, 147869085, 144753851, 141575131, 138587220, 135658369, 132843208, 130232168, 127562895, 124924838, 122394504, 119913589]
20503A19913589k542218k371882k343057k281515k105277k084163k046369k012319
20495A02126789j963956j969666j899718j841726j846056j783833j697121j664585
20487H7460128j569588j489008j686529j426926j446759j383296j312647j397531
20479G5747844j320323j407908j338790j280057j203598j240680j212592j176782
20471F5567114j160886j030142r89197j042530j006333r90261r48283r86810r27616
20462E6485056q48809q76122r65212q96377q09435q16527p93137p37782q14430
20453D8927225q77853p20466o03019o28297o29339o76511p00526p17564n82266
20444D2791384o04696p50482o50339n69116n01686n66933n22618m91403n39130
$$ y = [119913589, 117371371, 114999489, 112656432, 110374917, 108269640, 106185477, 104139108, 102126789, 100162833, 98193167, 96293449, 94451723, 92605667, 90821834, 89124713, 87460128, 85890540, 84401532, 82715003, 81288077, 79841318, 78458022, 77145375, 75747844, 74427521, 73019613, 71680823, 70400766, 69197168, 67956488, 66743896, 65567114, 64406228, 63376086, 62386889, 61344359, 60338026, 59347765, 58399482, 57412672, 56485056, 55636247, 54760125, 53794913, 52898536, 52089101, 51272574, 50479437, 49741655, 48927225, 48049372, 47328906, 46725887, 46097590, 45468251, 44791740, 44091214, 43373650, 42791384, 42186688, 41436206, 40785867, 40216751, 39715065, 39148132, 38625514, 38134111, 37594981]
20435C7594981n01511n48089n78577n92275n43555m09554l64743m28214m78966
20426C3149497l79030l18807n58782n40491m40906m19433l62574l56063m14870
20417B9358541l69976l41462l83796l17147m24520m07664l42615l27578k52130
20408B6191653k83143k84642l70597l72441k66643l68998l13192l90753l99202
20399B3142042k18033j22390j66483k21974k93170l61880k74988k87578j27812
20390B1067734r1045q4003k74982l26355k42170j68888p9623k29483k99478l37960
20380A8933747j75021k17937l65351j85978n5723j48093k61706j89568o3681j51504
20370A7119185k84506j95447j99302j92946r1456j27933k13540j67616j92794
$$ y = [37594981, 37093470, 36545381, 35966804, 35374529, 34830974, 34421420, 34056677, 33628463, 33149497, 32770467, 32451660, 31892878, 31352387, 30911481, 30492048, 30129474, 29773411, 29358541, 28988565, 28647103, 28263307, 27946160, 27521640, 27113976, 26771361, 26443783, 26191653, 25908510, 25623868, 25253271, 24880830, 24614187, 24245189, 23931997, 23541244, 23142042, 22924009, 22801619, 22635136, 22413162, 22119992, 21758112, 21483124, 21195546, 21067734, 20976689, 20892686, 20617704, 20291349, 20049179, 19880291, 19800668, 19571185, 19271707, 18933747, 18758726, 18540789, 18175438, 17989460, 17933737, 17785644, 17523938, 17334370, 17270689, 17119185, 16834679, 16639232, 16439930, 16246984, 16155528, 16027595, 15814055, 15646439, 15453645]
20361A5453645j55273j65791k19335r0109j3604j28359j98058j13515j48871k25129
20351A3995601j62501k10221k8833q9155q4525j25543j60738k35717j94567j9481
20341A2684320m3413o5083q8716j12593j32716k03514l0453K2714o4678q209j56372
20330A1801287j63328k12916k32511j1211n9038k16649j70654r4279o5898r8284
20320A0476519J9420o0160k8169j04079j47931o5386R814n3177j03810j52641
20310I790400p449k3502j16045r6662j77771j25786n4975K1799M1540q5833l0483
20299I135233q4062j89037m5680r8454n5926P7129r9301j24109J5186j20666p7199
20288H333114j20119j04055j8498j37225j61534n601r0534o7138N390o4198j81773
$$ y = [15453645, 15298372, 15132581, 14913246, 14823137, 14809533, 14681174, 14483116, 14369601, 14220730, 13995601, 13833100, 13622879, 13594046, 13504891, 13420366, 13294823, 13134085, 12898368, 12703801, 12684320, 12640907, 12575824, 12487108, 12374515, 12241799, 12038285, 12007832, 12030546, 11965868, 11957659, 11801287, 11637959, 11425043, 11192532, 11181321, 11122283, 10905634, 10734980, 10640701, 10574803, 10476519, 10495939, 10435779, 10407610, 10303531, 10155600, 10090214, 10100028, 10046851, 9943041, 9790400, 9782951, 9759449, 9643404, 9546742, 9368971, 9243185, 9188210, 9210009, 9251549, 9165716, 9135233, 9051171, 8862134, 8816454, 8718000, 8662074, 8739203, 8639902, 8515793, 8530979, 8410313, 8333114, 8212995, 8108940, 8090442, 7953217, 7791683, 7786082, 7695548, 7628410, 7633800, 7569602, 7387829]
20277G387829r1655J52615k8804j03535p3116r5618O071L4964r0669P040r9194
20266G005928j32477n3839r291L1630K083j74236j44724K3662o4989k4308O4317
20255F523756p2265k49718j25576Q9737O0037Q625m3953j31452J4763J6058j4665
20244F075347r2610q5808k9441l2460j16851n7577K6528K2155o5288j4711r9133
20233E530151q0030q3388m160k932O377M597j16335j01510l5604K0949o6437k6548
20221E045130J6920J7823j5595R3552L3549n6530j34775o8741k9851Q8676R2146
20210E082304k8184n5487o4346n7144j08048l0659J7747m8922q9108j42484o004
20199D469665j11296m0058k7846K6523j5315N4207n088q7059j26812p8096M9821
$$ y = [7387829, 7296174, 7448789, 7419985, 7316450, 7243334, 7147716, 7153787, 7188751, 7098082, 7105122, 7005928, 6873451, 6819612, 6810321, 6841951, 6844034, 6669798, 6525074, 6548736, 6483747, 6459439, 6523756, 6451491, 6201773, 6076197, 6165934, 6225971, 6234596, 6190643, 6059191, 6073954, 6090012, 6075347, 5982737, 5896929, 5867488, 5835028, 5718177, 5660600, 5687128, 5709283, 5643995, 5629284, 5530151, 5450121, 5366733, 5362573, 5359641, 5366018, 5370615, 5254280, 5152770, 5117166, 5138115, 5071678, 5045130, 5062050, 5079873, 5064278, 5157830, 5191379, 5134849, 5000074, 4931333, 4901482, 4990158, 5082304, 5054120, 4998633, 4934287, 4877143, 4769095, 4738436, 4756183, 4707261, 4618153, 4475669, 4469665, 4358369, 4318311, 4290465, 4316988, 4301673, 4355880, 4350792, 4263733, 4136921, 4058825, 4108646]
20188D108646M7960j35355L6010j6714j01099k0229M3823k4090j09415m6454R2214
20177C875297n782J85790n5815m4937k31232q6411K6960l0226r0801k3767M2185
20166C561261j4636n5462L6692l5017K2697M7150K0810n4604O706j5573K2412
20155C542436n9463k4854N382O67j03721j09559J6212N547K7506N581j4793J0535
20143C301476P8272m6620p7058j68821l0157k928j9924J36095J73598k5091q0349
20132C238493m4499o9565r1730Q5746N8162k9612j26758l4419O2593n2055k2004
20121B974352n0019l0204n227m1792j51049Q5052J37864q2526k5040N4869R2662
20110B958942j1485p0582j64118p9061M5247q1877q7299K4540J746O3295j3755
$$ y = [4108646, 4156606, 4021251, 4057261, 4040547, 3939448, 3919219, 3963042, 3938952, 3829537, 3783083, 3875297, 3869515, 4055305, 3999490, 3954553, 3723321, 3636910, 3663870, 3633644, 3542843, 3519076, 3561261, 3546625, 3491163, 3527855, 3492838, 3515535, 3562685, 3583495, 3528891, 3535597, 3520024, 3542436, 3482973, 3458119, 3463501, 3464168, 3360447, 3250888, 3267100, 3272647, 3300153, 3305734, 3290941, 3301476, 3379748, 3333128, 3256070, 3087249, 3057092, 3054164, 3034240, 3170335, 3343933, 3318842, 3238493, 3193994, 3124429, 3032699, 3118445, 3176607, 3146995, 3020237, 2985818, 3048411, 2996356, 2974352, 2924333, 2894129, 2888902, 2847110, 2696061, 2781113, 2918977, 2836451, 2811411, 2866280, 2958942, 2947457, 2876875, 2712757, 2633696, 2678943, 2597066, 2509767, 2534307, 2536053, 2599348, 2585593]
20099B585593O4784J35888J3989O349o4154j51872r2848l0899L953l0640m7135
20088B393008K3457N834o0095J674J08128N8049m0737l7064n6022Q422Q1445K5864
20076B511963m6084k0258n6031o6142K957q1486j9350J001Q3960J41643j13353
20065B338820j20807j8305P8162M2035N5851n5773j11927k4482j0477q6109q7719
20054A999269M1298j3508k3975M5808N5159J02982M1560J3825n0657j50639n6633
20043B004489K060Q2045M247k2887r1397Q2040J39354K1529j5728L384q40k812
20031B205484k7327j06922p607l3940j02031l2385K6373J05228q5358k778O6370
20020B005107m2918L6005M8668k2449q2510j09116l4401M4947k8442q7301J07486
$$ y = [2585593, 2650377, 2786265, 2800254, 2806603, 2742449, 2590577, 2497729, 2466830, 2470783, 2440143, 2393008, 2416465, 2422299, 2362204, 2363878, 2472006, 2530055, 2489318, 2452254, 2396232, 2404654, 2486099, 2511963, 2465879, 2445621, 2389590, 2323448, 2326405, 2244919, 2225569, 2226570, 2310530, 2452173, 2338820, 2218013, 2199708, 2277870, 2319905, 2375756, 2319983, 2208056, 2183574, 2173097, 2086988, 1999269, 2040567, 2027059, 2003084, 2048892, 2104051, 2207033, 2248593, 2262418, 2211761, 2061122, 2004489, 2006549, 2088594, 2092841, 2069954, 1978557, 2060597, 2199951, 2221480, 2205752, 2209136, 2208296, 2205484, 2178157, 2071235, 2063628, 2029688, 1927657, 1895272, 1921645, 2026873, 1941515, 1938737, 2005107, 1962189, 1998194, 2046862, 2024413, 1941903, 1832787, 1798386, 1843333, 1814891, 1727590, 1835076]
20009A835076m226l1006L0705L971M0582N2273k8214j54049l2579Q0924L3933
19998A827390m6733Q124k9078m6798j2294O5763l3472k6046k5574r116P5590M7550
19986A795306O0305l6467m3858m656M704k785n88j4090q6062k627J9998L6721
19974A725901k228j038q0169k3017J3636j08727n9247n7024j7451J12372J05129
19963A608137L9954j50876J3581J07958r3438k9139N5377J15100p7626q1107r1789
19952A416132r6355l1044L9480J02389O3552j24200q9176J39729J60043K8753
19942A609303j96787j25362M1527J01033J05233r243j30633K3972l8164j4716
19932A366163M01n314o9787J7702M4626L8748n642k7037j24823o3626Q9511n3261
$$ y = [1835076, 1830850, 1799844, 1830549, 1834520, 1875102, 1927375, 1899161, 1745112, 1712533, 1793457, 1827390, 1780657, 1788781, 1759703, 1712905, 1700611, 1766374, 1732902, 1706856, 1681282, 1672166, 1747756, 1795306, 1855611, 1819144, 1775286, 1770630, 1775334, 1772549, 1771961, 1757871, 1671809, 1669182, 1689180, 1725901, 1723673, 1722635, 1642466, 1619449, 1633085, 1524358, 1465111, 1408087, 1390636, 1503008, 1608137, 1648091, 1497215, 1510796, 1618754, 1525316, 1496177, 1551554, 1666654, 1589028, 1507921, 1416132, 1319777, 1288733, 1328213, 1430602, 1494154, 1369954, 1280778, 1420507, 1580550, 1609303, 1412516, 1287154, 1328681, 1429714, 1534947, 1525704, 1395071, 1419043, 1380879, 1366163, 1366564, 1361250, 1291463, 1309165, 1353791, 1392539, 1386897, 1359860, 1235037, 1171411, 1260922, 1207661]
19920A207661p8448N6209M1929m3855J3537o5159M704J10128N1861p551j54774
19909A136242J3722J03294o0706o9217j9120k780J00928m5002j3451K0834k5061
19898A139683o7672q7920k304n6538J14760J9303J4841L8728l5965j9081q197
19887A049638N0428R1368M6375J3359n5384q9160j41215l3021j1960O8775P8327
19876A067530l6728j1002m6194L855Q473n127J31279K2318j5043n3047o46N2151
19864A117819q2312m2681m232l3377M5079Q6049J7342K1261j0441o835k7843p023
19852A072806j4304K6907Q4778K9097k3330p070l9514j9456N5459Q650j60060
19841A013963L0858p8974r6529P5223P1623n4628k0562P2768M2730k6678j7832
$$ y = [1207661, 1129213, 1185422, 1227351, 1183496, 1197033, 1131874, 1136578, 1246706, 1298567, 1291016, 1136242, 1149964, 1253258, 1192552, 1123335, 1104215, 1101435, 1202363, 1157361, 1143910, 1164744, 1139683, 1072011, 984091, 981787, 925249, 1040009, 1059312, 1074153, 1112881, 1076916, 1057835, 1049638, 1100066, 1191434, 1237809, 1251168, 1195784, 1106624, 965409, 932388, 920428, 989203, 1067530, 1030802, 1019800, 973606, 977461, 985934, 980807, 1112086, 1134404, 1119361, 1066314, 1065668, 1117819, 1035507, 992826, 988594, 955217, 1000296, 1086345, 1103687, 1124948, 1114507, 1107672, 1079829, 1072806, 1058502, 1085409, 1170187, 1199284, 1175954, 1168884, 1129370, 1109914, 1165373, 1174023, 1013963, 1044821, 965847, 869318, 944541, 1016164, 961536, 940974, 1013742, 1056472, 1029794, 1011962]
19830A011962P201j54564p5432L2609L4502q263M8005j5642l1589P1984N833n2173
19818H74433m3647m3448J4144Q2970k162j610N8554O742n861r024o5052k0624
19806H45415Q1892K4887r6434j3616J04833n3105p4011r3185l8356j4481L0568
19795G04407N0301O2419n583j25958m3777J34117O7507j3750K2886K1373M1174
19784I15116L0631n9239k4407p7186l2652m5805N6389J1879n5956O978J44513
19773H70261n2438L5695J34526k930j19456p3733l2662O3735K7527l0094K1310
19762H41741j5490K1162n7602l3139k9790P2229m0100q9J037l0081j02513p312
19750F20053M4040M1490r2731K2415N4201R2198p177k0327q2398K5035J5986N3799
$$ y = [1011962, 1019163, 864599, 789167, 821776, 856278, 848015, 896020, 880378, 848789, 920773, 926606, 874433, 830786, 787338, 801482, 884452, 882290, 880680, 939234, 945976, 940115, 931091, 866039, 845415, 927307, 952194, 855760, 842144, 946977, 893872, 819861, 726676, 688320, 673839, 704407, 754708, 817127, 811544, 685586, 641809, 775926, 843433, 829683, 852569, 873942, 915116, 945747, 886508, 862101, 784915, 752263, 706458, 762847, 774726, 718770, 725748, 870261, 817823, 853518, 988044, 985114, 865658, 791925, 759263, 822998, 850525, 820431, 841741, 826251, 847413, 789811, 756672, 726882, 799111, 759011, 758922, 759959, 729878, 627365, 620053, 664093, 705583, 612852, 635267, 689468, 781666, 774489, 754162, 671764, 696799, 712785, 766584]
19738G66584J08153J9409j69369j55023l6638M7487J77845R8288o1751q450q1532
19727G05003K2817J0157Q7221q6486n3523r658N4921l396k3316L8686l5327M6337
19715G53436q3337j3546K9065o5851j11550K1516N3856L6591J15847n2420m2330
19704F41277m0178K3864J24973P6120j1942l0749M1690P6289q5268j69873L6718
19693F82921j0070K174j5377R246J0362K713J050j8488J4300j23697P953J33621
19681F96708n133N036l0354r3697p4303p0911O6922k5244m0737J1553P6028O1903
19669E77771L301P688Q9366j0215p9145q0185k0995O8384K9941n4810L9280N6989
19657F27370q7441J1908M41l795R4085r5561L7350J9251L4976P2039r608p5468
$$ y = [766584, 874737, 894146, 724777, 569754, 533116, 580603, 758448, 856736, 794985, 786535, 705003, 727820, 737977, 825198, 738712, 685189, 675531, 730452, 727056, 703740, 742426, 707099, 753436, 670099, 656553, 685618, 619767, 508217, 529733, 583589, 620180, 736027, 683607, 641277, 601099, 624963, 749936, 826056, 814114, 783365, 825055, 901344, 816076, 646203, 682921, 672851, 675025, 659648, 668894, 679256, 681969, 683019, 664531, 678831, 555134, 563087, 696708, 691575, 696611, 666257, 572560, 498257, 427346, 494268, 469024, 428287, 439840, 515868, 577771, 581072, 588760, 678126, 667911, 588766, 508581, 487586, 555970, 585911, 531101, 570381, 627370, 539929, 551837, 552278, 548483, 642568, 547007, 584357, 603608, 638584, 710623, 701015, 625547]
19645F25547j05059j9949N1475Q76r6228O474K3537J07587l0939r814l7234O7659
19633E83932l0566k0179O6058k800N4343K0435l7263l6872p4719n8088M0193l8145
19621D66329M3102L935o2312M2585K9445k7971K888K8731J3167m3283J4699k3111
19609D88204l4838L2864L4200J27043m7453j49198N4543R502q1717J1546J11450
19598E56146K0611J0127j34683m0447j7271K6964r0387k7709L4387J12883R8266
19587E48887j32296J3105J00822N0164J5002K1492Q2435l6315m6050M8156j09583
19576E55819o6889N0018m4515J942J3490l7028l0481k1916M8545l7803j06879
19565C24303j3060l6717K8742J46117J42693O211o0207o5893Q6439P7580o4719
$$ y = [625547, 520488, 500539, 552014, 552890, 456662, 463136, 486673, 594260, 563321, 553507, 516273, 583932, 553366, 533187, 599245, 596445, 650788, 671223, 633960, 597088, 522369, 464281, 504474, 466329, 509431, 513366, 451054, 493639, 523084, 495113, 498001, 526732, 539899, 496616, 511315, 488204, 453366, 486230, 520430, 647473, 600020, 450822, 505365, 514867, 433150, 444696, 556146, 576757, 586884, 452201, 411754, 394483, 421447, 331060, 303351, 337738, 450621, 548887, 416591, 429696, 530518, 580682, 595684, 617176, 699611, 663296, 617246, 665402, 555819, 488930, 538948, 494433, 496375, 509865, 472837, 442356, 420440, 468985, 431182, 324303, 311243, 274526, 303268, 449385, 592078, 598289, 538082, 472189, 558628, 636208, 571489]
19554E71489j21270o9793o8841j8916J11992k9753m9471O6003K8982M5872j34255
19543C32039j39836J11169P4492M1059O3722J3088L4450m8467K3294j5316O0064
19532E49758N5846N9843n2306j13157k899l7990m8686k9730k5275M7121j0109
19521C92416L0346k502J23313j2973m0436j7134J6937K1710p0841k9342Q0465
19510D91959L148l4304m4052M644M3864J1416n562n8911k238N7095K1806k0570
19498D68295j5127N6508P7699j09196j15923n648o661P5188k5590M272l1062N8503
19486D31258R6430j76399q2756M8618k4885K3316l8330p3222J53308J08752k4210
19475D41880j8813j13070o4384r4511J0325J99932J02056j5613j79081j52829
$$ y = [571489, 450219, 380426, 311585, 292669, 404661, 374908, 325437, 391440, 420422, 466294, 332039, 192203, 303372, 377864, 418923, 482645, 495733, 530183, 481716, 505010, 489694, 549758, 605604, 665447, 613141, 499984, 497085, 459095, 410409, 380679, 355404, 402525, 392416, 422762, 420260, 543573, 530600, 490164, 473030, 489967, 511677, 440836, 411494, 491959, 495107, 460803, 416751, 421395, 465259, 476675, 471113, 412202, 409964, 467059, 488865, 468295, 453168, 509676, 587375, 478179, 362256, 356608, 349947, 425135, 399545, 403817, 372755, 431258, 527688, 351289, 268533, 317151, 292266, 315582, 277252, 204030, 357338, 466090, 441880, 423067, 309997, 245613, 151102, 161427, 361359, 463415, 447802, 268721, 115892]
19465A15892K33008R7571l5429q205o7516M4169o564j11313J04982J54222J0779
19454E31596r6300j29012J264R5870O3811L8558Q1006m1000j32520j81635O294
19443B37932J39617M4651n8177K6843K3390l142l6771J02609j610o2740k8228
19432C84374n0382K8252K7453O7623j19276o4634K5721Q489K3485q5782p4068
19421A71255M5299J28263J5199j55391k6611L6575M6188J0981n0909n2765M1302
19410B09386J35710K9609k09232l7187M9027P1966R3136m5591P0870P2931N9489
19399E00114l62j16298n8089j11895P2479j8755p1263K3033M3338m069k9397L974
19387B32810O6391j6753m4887l5881M275k9258M3020P4544J980K2531p3509j15117
$$ y = [115892, 348900, 446471, 411042, 402837, 335321, 379490, 372926, 261613, 366595, 520817, 531596, 435296, 306284, 307548, 403418, 467229, 505787, 586793, 545793, 413273, 231638, 237932, 377549, 422200, 364023, 390866, 414256, 411114, 374343, 476952, 475342, 412602, 384374, 333992, 362244, 389697, 457320, 338044, 273410, 299131, 307620, 331105, 245323, 171255, 216554, 344817, 360016, 204625, 178014, 214589, 260777, 271758, 220849, 168084, 209386, 345096, 374705, 165473, 128286, 177313, 249279, 342415, 296824, 367694, 440625, 500114, 499752, 383454, 325365, 213470, 285949, 267194, 195931, 218964, 262302, 258233, 228836, 232810, 299201, 282448, 237561, 201680, 205955, 176697, 219717, 294261, 296241, 318772, 245263, 130146]
19375A30146K4964L3594L7024m9601Q2231q691q4363j27175J7118N8268J12816
19364B26331N4623P1357Q930k948j13035o3054o3380J04177J19119o3803n7457
19353B20860m5121j40122l2821M1514P2791Q7922Q390l9190j05829J0139J16927
19342A95460l702o5889L1290r5199O466j9971p713J16681K5838p4321J40406M162
19330B53508l4875L7364K8636J1130m3272p2004n224M9682j03110L494J06034
19319B31363l3703r5556J6074o2659J07485m8790J838R9572l5726m3122j4231
19308A22545L6735P8404N2648m8439Q6675j47081j12351q5425J6691J43090N3640
19297A97132J32405M144j11089j0977L9983m7501r2695Q212M0168L8602L7491
$$ y = [130146, 155110, 188704, 225728, 176127, 258358, 249667, 165304, 38129, 55247, 113515, 226331, 280954, 352311, 361241, 358293, 245258, 182204, 118824, 223001, 342120, 278317, 220860, 175739, 35617, 2796, 44310, 117101, 205023, 213413, 174223, 68394, 78533, 195460, 191758, 125869, 157159, 61960, 68426, 48455, 40742, 157423, 183261, 108940, 249346, 253508, 218633, 255997, 284633, 295763, 252491, 180487, 175263, 224945, 121835, 125329, 231363, 197660, 102104, 118178, 55519, 163004, 114214, 116052, 215624, 179898, 136776, 122545, 159280, 237684, 290332, 241893, 328568, 181487, 69136, -16289, 402, 143492, 197132, 329537, 333681, 222592, 211615, 251598, 204097, 111402, 119614, 159782, 198384, 235875]
19286B35875J14916L7342j71054M4451J2525l0418L2816J8553O7103j6859o3336
19275B81914j3820Q8583J9944l7273N1973m908P8182K4632j11420j24388O2414
19264C15833L6876k6299l628N1377P6837j04621j18347m4367J09664L8041M0462
19253C71828N7452j4722l9123o5928j35707L2792J26993M9300j21353k268n3256
19242B06008N695J105m8246N837R7178q498r8830P6848j379j7853k705l140M6980
19229B59000Q694l6524m4234q4272p2861K8507J9r893R9468O1416O7519k5216
19217B51623K9978m979K3839J2226l8154l8024j33903J2070R5607J16887j36462
19206A90708o7755K4561M6774P9986k8239p7348m8373q5256L5098N0239K2247
$$ y = [235875, 350791, 388133, 217079, 261530, 274055, 243637, 276453, 295006, 362109, 345250, 281914, 268094, 356677, 376621, 339348, 391321, 386413, 464595, 489227, 377807, 253419, 315833, 352709, 326410, 322782, 374159, 450996, 346375, 228028, 183661, 293325, 331366, 371828, 429280, 414558, 375435, 309507, 173800, 206592, 333585, 382885, 261532, 259264, 206008, 211703, 212808, 164562, 170399, 267577, 259079, 160249, 237097, 235718, 217865, 215160, 212020, 259000, 267694, 231170, 186936, 102664, 29803, 58310, 58329, 48436, 147904, 209320, 276839, 251623, 281601, 276622, 300461, 312687, 274533, 236509, 102606, 114676, 210283, 327170, 190708, 122953, 147514, 194288, 274274, 246035, 168687, 120314, 35058, 70156, 120395, 142642]
19195A42642m9412j22558M1784L7584J09639Q3890J28136m6998o9917M9028Q5737
19184C89555j24192l7319o4407J9728O2375Q5821L0725r7779j34695j420M2537
19173A70929N1823J565O2702o9850K2991l7955o4546M0797r112J4156M6200l5150
19161A94550r13j01739L0791J23308m6869r5601o8256o2561K3100j0086J00249
19150H5973M3428K6531q2443P989J00588M5681P6621k0606m9108j28719r0843
19139A5092n7538j5300O9736P19M5196L2307O9131M2200K0868j2187p7891L8188
19127A70521j2007O808M230Q2102k8349j28504R8164M7909m338q1577q2509q1175
19115h725K7441J26203l460O2883m5827O949k4377j7810p8190j07714R4851J27976
$$ y = [142642, 93230, -29328, 12456, 50040, 159679, 243569, 371705, 324707, 254790, 303818, 389555, 265363, 228044, 163637, 183365, 245740, 331561, 362286, 264507, 129812, 128392, 170929, 222752, 224317, 287019, 217169, 240160, 202205, 137659, 178456, 169344, 183500, 229700, 194550, 193637, 91898, 122689, 245997, 199128, 103527, 35271, -27290, -4190, -14276, 85973, 129401, 155932, 73489, 81478, 182066, 227747, 304368, 283762, 234654, 105935, 15092, -42446, -57746, 11990, 12709, 57905, 90212, 159343, 201543, 222411, 210224, 132333, 170521, 158514, 165322, 169552, 251654, 223305, 94801, 192965, 240874, 236536, 154959, 72450, -8725, 18716, 144919, 141459, 204342, 158515, 165464, 141087, 123277, 45087, -62627, 32224, 160200]
19103A60200K8006J5239K8428J1375O9165m8498j10429o1116o0654j04612l531
19092g6427J19647O0693m1972O1090L9138j3740P2178k197j7735r970m6373K7080
19080A71412L7155J1284o8058m4371J3084k423J2121Q596m888l5818N883O6274
19068A70251Q6212R8829j4152p7040p0086j18756K8068J6596k3111Q0064M2742
19057B19617M2116j2452p9539n4077k3718l1241p1248n8647P4538O3205j515j4449
19045E2590J30197O2581j6140l9942m8234N28p7278K1124J17147j5540j12606
19034G4427J0203J27318k1937P910m0048l2657J15061m5908K1087L4540n8373
19023A91623o3227L2071P7504O2431j10570q0523N5672N5193r7923k1609k3285
$$ y = [160200, 188206, 203445, 231873, 243248, 312413, 263915, 153486, 92370, 31716, -72896, -76427, 43220, 103913, 61941, 123031, 162169, 148429, 220607, 218410, 200675, 190705, 144332, 171412, 208567, 219851, 151793, 107422, 120506, 118083, 130204, 138800, 133912, 98094, 103977, 170251, 256463, 355292, 341140, 264100, 194014, 75258, 103326, 119922, 96811, 176875, 219617, 261733, 249281, 169742, 115665, 91947, 60706, -10542, -69189, 5349, 68554, 67039, 52590, 182787, 245368, 229228, 189286, 141052, 141580, 64302, 85426, 202573, 187033, 74427, 84630, 211948, 190011, 197921, 157873, 125216, 240277, 194369, 215456, 249996, 191623, 128396, 160467, 237971, 300402, 189832, 109309, 164981, 220174, 122251, 100642, 77357]
19012G7357r9978R2540J88809L4157j42851n2095n4794j7788j5176j1074j33j5272
19000a6298q6787J8245J55944k752r6571M0465N3918l8061P4258M8303r228m1154
18988A00282j9545K8202N5185K0612p3298p654j42971n268J23203L1327m2910
18977F7165j9619L3796p4436r5558j50795n1337R5500M0482K6588J36827Q3737
18966I2350n2941j4993J58911J32480l8226p8649l9840J5665J73068J07923l517
18955D52231j92271j63345K3867o0758l8474j4985j6023j537J24063J05126L3145
18944B51039J7993o3471j1018O3529r056K3375j08399k32168q598O1688Q4047
18933F8961K4668l0509k9445p8901j6236P1198K9490o1576p7181j8679K9276M7171
$$ y = [77357, -22621, 69919, 258728, 292885, 150034, 97939, 43145, 25357, 10181, -893, -1026, -16298, -103085, -84840, 71104, 68352, -28219, 12246, 66164, 28103, 102361, 150664, 141436, 100282, 80737, 108939, 164124, 184736, 111438, 103784, -39187, -44455, 78748, 110075, 67165, 47546, 81342, 6906, -88652, -239447, -290784, -195284, -154802, -128214, 8613, 92350, 39409, 24416, 183327, 315807, 277581, 198932, 159092, 174757, 347825, 455748, 452231, 259960, 96615, 120482, 59724, 21250, 6265, -9758, -11295, 112768, 217894, 251039, 269032, 205561, 194543, 258072, 249016, 272391, 163992, -68176, -76774, -15086, 68961, 93629, 63120, 33675, -45226, -61462, 9736, 39226, -22350, -99531, -118210, -88934, -41763]
18921d1763O1300O3675J35681N7293j38704o7266K3614K5537J90705o3335j82270
18910F4467m5106q4958o8885L8630J13289J21611k8565R889O40K2270N0152o5027
18898A28407j53640l030L8039J1244l6116M7558R3749K7050j05831P3241p413
18887A13258J7767j5655l046o0455p4032R6898k8994k4787L1806P2999L3459r1611
18875F7607m3488J1517Q4452J17022p584j84641o4096k4129j4238J41210L5859
18864A19491L7243P062K600M0370K3379j06488q7903Q188r557l431J74p2888j9199
18851f0959N539l4468K5089O372M8079k0909j0336O3055P4428Q2632p9601k7586
18839G1335j03863O3608r493r232O1393M3389M5506M9676j36778j4231j7053M3343
$$ y = [-41763, 19537, 83212, 218893, 276186, 137482, 70216, 93830, 119367, 310072, 246737, 64467, 19361, -65597, -134482, -95852, 17437, 139048, 110483, 120372, 121012, 143282, 193434, 128407, -25233, -28263, 9776, 21020, -15096, 32462, 126211, 153261, 47430, 120671, 113258, 131025, 115370, 112324, 51869, -22163, 74735, 45741, 20954, 52760, 125759, 159218, 67607, 24119, 35636, 120088, 237110, 229526, 44885, -19211, -43340, -57578, 83632, 119491, 156734, 163796, 166396, 206766, 230145, 123657, 35754, 43942, 34385, 30954, 31128, -41760, -60959, -55420, -89888, -64799, -58427, -10348, -31257, -41593, 21462, 95890, 178522, 98921, 71335, -32528, 31080, 21587, 12355, 73748, 117137, 162643, 212319, 75541, 61310, 44257, 87600]
18827H7600M1682R8667l8611o4800J9784j774n8464J0387P6781j00483j20467
18816d9698J3151P3764p4467M0207M1849n652K8390j05039j51503J06032J28104
18805D5138o3946p7010m5144P0691K8418L3185k9318k6504l651j8202R2545O2907
18793F9109l9946m9383k9166j7351J04445J0498M2297Q4044n2175P716P5761m4943
18781A60906L0817k2147j08275J730L7967M693P2688m6861m9762l46R499m8218
18769D2691j21683l2062j7671L860l5026m4921R0219J32225M7733K2852q9138
18758i21q374m5950o1651m5446M3692M6247J29312o9087o3745R1823P5205N3765
18746A44870l2432n3293q6655n1301M3126J3846J23164N7945L2921L8436j1349
$$ y = [87600, 129282, 227949, 189338, 124538, 144322, 142548, 84084, 94471, 171252, 70769, -49698, -36547, 37217, -37250, 2957, 44806, 39154, 67544, -37495, -188998, -82966, 45138, -18808, -95818, -140962, -70271, -41853, -8668, -37986, -64490, -68141, -86343, 6202, 69109, 29163, -20220, -49386, -66737, 37708, 48206, 90503, 174547, 122372, 130088, 205849, 160906, 191723, 169576, 61301, 63031, 100998, 105691, 178379, 131518, 81756, 81410, 90909, 42691, -78992, -111054, -128725, -124865, -159891, -204812, -114593, 17632, 65365, 88217, -921, -9295, -55245, -116896, -162342, -118650, -72403, 56909, -12178, -75923, 15900, 91105, 144870, 112438, 59145, -27510, -78811, -35685, -21839, 101325, 159270, 192191, 230627, 219278]
18735B19278q0015l8681K5224Q4229m7088n1944l4421o4343J19033K3888p9004
18724G6156r1825K4432l3588R5412J15964M410r5431k4095k1377o8382o4857L5098
18712d8083Q6550m6271k0875O6226O2802q0413R8769n6030j59521M889N8264K434
18700c1259J11563J8249Q231K287P1501N0956j22465o4331Q2391O1764j9517p7816
18688I1554k2489L1610Q6926o8459k24920o2079M4795J08060J8143J9559l2826
18677a0126j055L8752K5485n7583m5761R3204R3539J1450j6851J6497L3611k8805
18665A52357k3603J0752l7527j15435j36716K8600j6161Q4732N2852J20088m4206
18654G5733Q1742l7728j40827j3725n7035p64R3043o452j801m5160l3804M8554
$$ y = [219278, 139263, 100582, 125806, 210035, 162947, 111003, 76582, 12239, 131272, 155160, 76156, -15669, 8763, -24825, 70587, 186551, 190961, 95530, 71435, 50058, -18324, -83181, -48083, 38467, -7804, -28679, 37547, 100349, 19936, 118705, 62675, -96846, -91957, -33693, -31259, 80304, 98553, 106784, 109071, 180572, 231528, 109063, 44732, 127123, 188887, 169370, 91554, 69065, 100675, 187601, 119142, -105778, -167857, -123062, -15002, 3141, 22700, -10126, -11181, 27571, 53056, -4527, -50288, 42916, 136455, 147905, 131054, 147551, 181162, 152357, 128754, 139506, 101979, -13456, -150172, -121572, -137733, -53001, -149, 119939, 75733, 157475, 119747, -21080, -34805, -91840, -92604, 439, -6013, -7814, -52974, -86778, -38224]
18642c8224N9431R4916M9770k8323j77430j43211P0993Q3322K1576n7018n4297
18631a18495K2204M7868m8005P8252M9476k6980Q006L6124j23617m1324M7001
18620f9490r813J14161o860l9502N5336J07293k3270p5570r2158K0193O1672j12794
18608g0802J14997L416k8997m5671l6656O4735J43553J34092j238j13659n1067
18597A12703J45836n8484j29449j18282p0912j6630J57029L6720K7000Q920n4199
18586D0252k8571o6051m4324K6825L4725Q182J33190L064J03700n8220m8911j4958
18574H8903j1354k3573M0147J0119r7685n3831j4128m0255R999l4980N3295k4052
18562i7395j12895N2777J19326P561O211q509l1822o0612L3735K0561J3172O9153
$$ y = [-38224, 21207, 116123, 165893, 137570, -39860, -183071, -112078, -28756, -7180, -64198, -118495, -96291, -48423, -96428, -18176, 31300, 4320, 12326, 48450, -75167, -116491, -69490, -79303, 34858, 27998, -11504, 43832, 151125, 127855, 52285, -39873, -19680, 41992, -70802, 44195, 47611, 18614, -27057, -63713, 1022, 144575, 278667, 277429, 163770, 112703, 258539, 200055, 70606, -47676, -118588, -135218, 21811, 58531, 85531, 94451, 40252, 11681, -54370, -98694, -71869, -37144, -28962, 104228, 107292, 210992, 152772, 103861, 88903, 77549, 53976, 94123, 104242, 6557, -47274, -61402, -101657, -91658, -126638, -73343, -97395, -210290, -157513, -38187, -30626, -24415, -32924, -64746, -125358, -91623, -71062, -57890, 11263]
18550A1263L7322o429m0237N774O094l2278m206L8343n3239M5865J181K4336J9967
18537E3756j3553J9127L4140k6839k2203j11737j54727J24461J39966J03886k8267
18526A18010J5009j2827o8991j93599J6619P6310n0725j07959L5606j6182K2808
18515a65921m5609l2821M8923O7638r944J9935L7568K5393J5156L955M6097j5634
18503e264j26158j07128L1408O9989m7597j6572J75730j0747P8735P1075j05751
18492G720j11687K8772K0811n9276M5521K2175k9902P1161J55952o2944K0713
18481A09016j5164j19035M8863N5798j83475n8391j8719J5707R9453M4352N7613
18470C6018J5055p1904L2274L6948o2825P378J48584M7727j65618j06479j7449
$$ y = [11263, 48585, 42156, 1919, 7693, 13787, -18491, -22697, 15646, -37593, 8272, 9453, 33789, 53756, 40203, 59330, 93470, 66631, 44428, -67309, -222036, -97575, 42391, 146277, 118010, 133019, 120192, 51201, -142398, -125779, -49469, -100194, -208153, -172547, -188729, -165921, -211530, -244351, -195428, -127790, -137734, -117799, -80231, -54838, -39682, -35727, 10370, -5264, -131422, -238550, -207142, -137153, -184750, -201322, -25592, -36339, 42396, 113471, 7720, -103967, -75195, -54384, -113660, -68139, -45964, -75866, -4705, 151247, 88303, 109016, 93852, -25183, 23680, 79478, -103997, -162388, -181107, -165400, -65947, -21595, 36018, 51073, -20831, 11443, 48391, -14434, -7056, 141528, 189255, 23637, -82842, -100291]
18459a00291L9577K158p2955L6028M2296k1580p023k5050q270P8399J16868R13
18447H1070j12576n9030k0707L5639m3179J9533R034k2729J01064L1254J2850
18436C2223p8855o3038P7310P3885p5369m8604N6619J54873k3912k3021j4061
18425F8050q0011n5812P3789o6510r9690M9121n6598j5335M2828O0119M9225l2739
18413f3563N8100J77271k360j41584L9097O8467K2096o4391K7616J1203n5216
18402G6736J306j9871q9226J3323k7482l3422L9807J10944N8361k0002r7117j40903
18390a27546Q7854J0851n2912K439l7414n1139O9289J19690m9893n6476Q1638
18379c619M9907q9635n9035P7157J23863n9768n8089j9378K7683J37997q3216
$$ y = [-100291, -60714, -58556, -131511, -95483, -53187, -74767, -81790, -106840, -115110, -36711, 80157, 81070, -31506, -90536, -111243, -75604, -118783, -99250, -90216, -112945, -11881, 19373, 32223, -46632, -109670, -32360, 41525, -33844, -82448, -25829, 129044, 105132, 82111, 68050, -11961, -67773, 6016, -60494, -160184, -111063, -167661, -182996, -140168, -80049, -30824, -63563, -5463, 171808, 169448, 27864, 66961, 135428, 157524, 93133, 120749, 131952, 76736, 78042, 58171, -31055, -17732, -45214, -78636, -38829, 72115, 130476, 110474, 13357, -127546, -39692, -28841, -81753, -79314, -116728, -167867, -98578, 21112, -28781, -85257, -3619, 46288, -43347, -102382, -25225, 98638, 38870, -19219, -38597, -10914, 127083, 43867]
18368D3867m9958o1663q9182J22367J21333M4862j47321P4711o7201R830J43923
18357A45568J0566q1458K6250j77j25783l0264N3159N3461J1312r8924R231n7308
18345h4367j0288K2387J23037K6140j5359j5333q7743Q892R5643L316P167K4453
18333I7945J3555J7315k2364n0749n34O0863R6070M2517l150j33138j09897n482
18321B951P7313k1657j20170N4650J60644k906p5090L6178r0347j1043j869q7314
18309g8660K3667k2305K1208N5393r322P2630l4137l6099J12139n1454L6239M2301
18297A31600l1798j43352j45172P3861J57157K0021L5456J10994K6016o7456p5484
18286I1843r0483j00259Q9944J00183L7660q0199j69536O725J98065J14831q9491
$$ y = [43867, -6091, -67754, -156936, -34569, 86764, 131626, -15695, 59016, -8185, 1645, 145568, 156134, 74676, 100926, 100749, -25034, -55298, -2139, 51322, 62634, -36290, -27059, -84367, -94655, -72268, 50769, 76909, 61550, 46217, -41526, -32634, 63009, 66325, 73492, 97945, 111500, 128815, 106451, 55702, 55168, 116031, 212101, 254618, 251468, 118330, 8433, 2951, 80264, 58607, -61563, -6913, 153731, 150825, 75735, 111913, 21566, 10523, 8654, -78660, -54993, -77298, -56090, -697, -10019, 62611, 28474, -7625, 104514, 53060, 89299, 131600, 99802, -43550, -188722, -114861, 42296, 62317, 97773, 208767, 234783, 167327, 91843, 1360, -98899, -8955, 91228, 128888, 48689, -120847, -114122, 83943, 198774, 109283]
18275A09283o4080m2986J6016p350p348O3900p237N1808m4617l503q2366Q213
18263a0267k0886p9733P5621N1053P7543J7066m107J8232l2994o4574N9554J74545
18251B61053j6604j7429J5104o2043l2699r5803q8834j4125N5109L0747j27627
18240i3151P3609J08815o1242M3883k01202L530Q9511m1512j3562L5394L8016
18229a7911l2633K8859P6577j6886j3773Q0570m2873M0932J2460k4536r1430n6181
18217e6825K9288R8679J5075l8781N4536j3882J4810q5120j11893O937o714o6524
18205a60414j8087J3605J19740K1795J08171j3467j18792o9260Q309J25422P4208
18194I1230l0850j08153k1856m5902n3288O0906M0837O23R7651L0594n7734n4383
$$ y = [109283, 45203, 2217, 18233, 10883, 3535, 67435, 60198, 112006, 67389, 63886, -18480, -10267, -31153, -110886, -35265, 15788, 93331, 110397, 106290, 124522, 91528, 26954, 86508, 261053, 244449, 227020, 242124, 180081, 147382, 51579, -37255, -51380, 3729, 34476, -93151, -19542, 89273, 28031, 71914, -129288, -125758, -36247, -77759, -91321, -55927, -17911, -50544, -21685, 54892, 38006, 24233, 104803, 61930, 102862, 115322, 90786, -644, -56825, -27537, 71142, 86217, 47436, 101972, 88090, 102900, 17780, -94113, -87176, -93890, -160414, -178501, -164896, -45156, -23361, 84810, 71343, -47449, -116709, -108400, 17022, 91230, 60380, -47773, -69629, -115531, -168819, -107913, -67076, -66453, 31198, 61792, 4058, -50325]
18182e0325q2738k6835M4669L7555m718m696P5114N1928j41718J5016O6011L9282
18170A8545p4240j15158l5147K5693N2736K8286r957M3603K2907j3297O628p2394
18158a21795l5596J2241J14650M563r1542k7179l7183l2652p88K2954k7692j9684
18146b39703m207N7735r615l7818K2437j2133K6789J17408O4666P6723O3015q7189
18134C8108r1373p0666q0504L2795L7156N1734O0090K7140J7888Q2956L878k5358
18122H3844k2217J13194N9259n6201j08895m4036j40085j4247O8729N7838M8417
18111D5600o546M1670n1974J00940p98k7500m5989r3881j6114p258K5716k2482
18099e8616o3020L2376J14863L7649m0372l455J1624Q5577m0174j64969o679J7902
$$ y = [-50325, -133063, -159898, -115229, -77674, -82392, -87088, -11974, 39954, -101764, -86748, -20737, 18545, -55695, -170853, -206000, -180307, -127571, -99285, -109242, -65639, -42732, -56029, -49401, -121795, -157391, -145150, -30500, -25937, -117479, -144658, -181841, -214493, -215281, -192327, -220019, -239703, -243910, -186175, -195790, -233608, -211171, -223304, -196515, -79107, -14441, 62282, 125297, 38108, -53265, -123931, -204435, -171640, -134484, -82750, -22660, 4480, 22368, 105324, 109202, 83844, 61627, 174821, 234080, 177879, 68984, 24948, -115137, -129384, -60655, -2817, 45600, 39054, 80724, 28750, 129690, 128892, 101392, 55403, -38478, -54592, -61850, -36134, -58616, -121636, -89260, 25603, 63252, 22880, 19425, 31049, 116626, 76452, -88517, -95196, -77294]
18087g7294m2644M4946R1556O8549k4495j17223j6044m4831m2570k1343K849M0006
18075a38538n6604L9241N9623M2055K1767k7051M0309l5762J2776L8782k8265
18064c1667q6147n1893J21885P4492N4114p5086l1336q5009K8819p8579m9513
18053b09920m3263J2872N7475O1109L769p6656M8757J05468R2834j35419n9018
18042a41992R618N9636k2150q3796j34113j6612O1123n8426K5070P3453N4594
18031a73595M8742N5482P2371R464n0778k7777l5189m4J28012J89077l3923o1230
18019A20612j28852m2728o6938l688N5005M3035Q86M2586J18508k9268q8168p1807
18007e0817k520j4684J73531p6100j27474m8375Q443O0564K7884m7682L1948m9530
$$ y = [-77294, -119938, -74992, 16564, 85113, 60618, -56605, -72649, -117480, -160050, -181393, -178544, -138538, -195142, -155901, -96278, -54223, -32456, -59507, -19198, -54960, -42184, -3402, -31667, -117814, -169707, -47822, 26670, 80784, 5698, -25638, -110647, -81828, -160407, -209920, -253183, -240311, -182836, -121727, -117958, -194614, -145857, -40389, 52445, -82974, -141992, -132374, -72738, -94888, -178684, -312797, -329409, -268286, -326712, -301642, -228189, -173595, -124853, -69371, 3000, 12464, -38314, -66091, -101280, -101324, 26688, 215765, 181842, 120612, -8240, -50968, -117906, -121594, -66589, -23554, -22668, 19918, 138426, 109158, 20990, -50817, -53337, -68021, 105510, 29410, -98064, -146439, -137996, -77432, -49548, -97230, -65282, -114812]
17995a14812K6231J11565J01535j44605o9190j8201j1547l4714Q369L5590N6161
17984e3618n9305r3237L6238O4551j1843r5924o0701J16362J05704p4798J2711
17973a13860P9356Q5046l3400K8846J2663j6724j15804j12642K9126L3115N0797
17962g3481M9316j6398j22617l2383m7511J28957Q4008l6093p8821N2610N0473
17951d1940L9726k4269k1446M2763L5046j1904j76269m3308N0132J8856J2409
17940a20204K8084R5588P045o8310r7674r989J41859Q3189r9942M4059O1182r644
17928E5243j9666J2405M089k1826p3743k4523j53450j1136J33780O2403j2126
17917d8550K341o4339k251K089K1452m5267P9402J5575R1005m9269j44322l5295
$$ y = [-114812, -88581, 22984, 124519, -20086, -89276, -107477, -119024, -153738, -145369, -109779, -53618, -112923, -206160, -169922, -105371, -117214, -213138, -273839, -157477, -51773, -126571, -113860, -34504, 50542, 17142, 45988, 58651, 41927, -73877, -186519, -157393, -124278, -73481, -24165, -40563, -163180, -195563, -243074, -114117, -30109, -66202, -145023, -92413, -41940, -2214, -26483, -47929, -5166, 29880, 17976, -158293, -201601, -151469, -132613, -120204, -92120, 3468, 10513, -57797, -155471, -165460, -23601, 59588, -40354, 3705, 64887, 55243, 35577, 47982, 52071, 30245, -43498, -68021, -221471, -232607, -98827, -36424, -48550, -46209, -110548, -112799, -110710, -89258, -134525, -55123, -39548, 51457, 2188, -142134, -177429]
17905a77429K8498n6808K4740L7772K8394N5813P0357J68202O56j07591p7491
17894d887K2387n9j0005p3615j6012M1626Q5241L9755n6789k8579l9455r790K0073
17881c0109M6986P9896O1336k5223n7522n9150j24410r4040k0643n3168K1402
17870b54645L3253N335J05349N7929j1916J1403j6458N5700K40J5919j7878q6372
17858a02141k8593K638L2957l4211o6900n1908J0840m1178J07403Q8187k9577
17847a12483J7281n8460j24154k4842N1875M8134P0999m7958k3588J250M5403
17836a56543l592J9633J0222P7301J21645N0913j514j40575q2695R5595L8435
17825B8825J6129o4475M3938N5301j3085r0110q6360m7490n0492k9898K343j2409
$$ y = [-177429, -148931, -205739, -180999, -143227, -114833, -59020, 11337, 179539, 180195, 72604, -4887, 17500, 17441, 7436, -66179, -82191, -40565, 44676, 84431, 27642, -937, -40392, -50182, -30109, 16877, 96773, 158109, 132886, 75364, 16214, -108196, -202236, -222879, -276047, -254645, -221392, -216057, -110708, -52779, -64695, -53292, -69750, -14050, -13810, 2109, -15769, -102141, -130734, -128096, -95139, -129350, -196250, -248158, -237318, -278496, -171093, -82906, -112483, -95202, -153662, -277816, -302658, -250783, -202649, -131650, -179608, -203196, -201946, -156543, -160135, -140502, -130280, -52979, 68666, 119579, 118065, -22510, -105205, -9610, 28825, 44954, -19521, 24417, 79718, 66633, -23477, -109837, -157327, -207819, -237717, -235374, -247783]
17813b47783O6814J9812p3270J5961j08189R4012m1260P7816Q8570J41965J8531
17802E2979j20554j05093l7247J1594m0191Q9788K4249l7092J1390L1587M9157
17791f9433J64095J1420j38697o0460K1489N3952o6006j08591Q3360Q0069L9454
17780A0652r8303n2098L1364j7419Q2899N3898P4717l3935n2252j1352k4329R205
17768b6953N0041K6834R5729P0591j84601j22454P8966O8952J220k0816K8303
17757F5812j50733K0569P5495P8383k0560O694K0988M5791J3438l6133k4900j9409
17745G5435J0123N836O2631R969K6347m2729J873O5604K3963j25506j27661m1212
17733e5327k3608M7763L5590l2604J8498L0837K8020r3540p5697J00962P315k8179
$$ y = [-247783, -180969, -161157, -234427, -218466, -326655, -232643, -273903, -196087, -107517, 34448, 52979, -67575, -172668, -209915, -198321, -238512, -148724, -124475, -161567, -150177, -118590, -69433, 94662, 106082, -32615, -93075, -71586, -17634, -83640, -192231, -108871, -28802, 10652, -87651, -139749, -108385, -125804, -42905, 10993, 85710, 51775, -477, -11829, -36158, -26953, 23088, 49922, 145651, 216242, 31641, -90813, -11847, 57105, 58325, 37509, 65812, -84921, -64352, 11143, 89526, 68966, 75660, 96648, 142439, 155877, 119744, 94844, 75435, 85558, 91394, 154025, 163994, 190341, 147612, 149485, 215089, 239052, 113546, -14115, -55327, -78935, -31172, 4418, -28186, -9688, 21149, 49169, -44371, -120068, -19106, -11791, -39970]
17721c9970N3022M9463P4947L910J4366K2758l3706o2461j8993L7156J4071J20997
17709B35560M1920R745o3792o8127Q49N809K8447n4713m8718l0481r0875o2733
17697i7109J019N2802J709j18627O6573J00865J05507K3501J12239o7542j35493
17686D5444n9730O1397o7052r8985L4994N2396o8282j5731J2429j07410j2763
17675b23293J30203N8814R6646O64L4772m0856q0396Q185r7357r3979K1832J71231
17663a3534L4234q271j23889P109M3729Q6967N6043K7398j64625o1437L4991L4287
17651d6998M9541J5171m3360o0525j7238j6041K9186l1722j1523L4093l252N8769
17639d3899P0069M0612k1450p4499R9713M1545P1897j11786J55577J36735j98285
$$ y = [-39970, 13052, 62515, 137462, 141372, 155738, 178496, 144790, 82329, 63336, 100492, 114563, 235560, 277480, 287225, 223433, 155306, 156155, 161964, 190411, 135698, 86980, 56499, -34376, -97109, -96090, -43288, -41579, -160206, -93633, 7232, 112739, 136240, 248479, 180937, 45444, -14286, 47111, -19941, -118926, -83932, -31536, -99818, -115549, -103120, -210530, -223293, -93090, -34276, 62370, 63034, 97806, 56950, -23446, -15261, -112618, -206597, -184765, -13534, 20700, 12429, -111460, -104351, -60622, 26345, 82388, 109786, -54839, -116276, -81285, -46998, 2543, 17714, -25646, -86171, -103409, -119450, -90264, -121986, -133509, -99416, -102668, -43899, 26170, 66782, 45332, -29167, 70546, 112091, 183988, 72202, 227779, 364514, 166229]
17628A66229k29560j27380l3620P5198J59135O948j5702j8995M0934r7789p9070
17617a53672P5117P7039m0308q1099L7597R3221O1207J16758L0337K1239o458
17606B30978J6756j57853p565P5467K4756r0888M069J09150J2410j00553m2670
17595G4057j13641N8080J99203P6461o0853n4444L9694j30051j22411r8443J8762
17584a13586N6156M5057K7664l2332O5693J9977P6367m4257j28552m1766k9731
17573i9310J08774J67763J8346K0334P378p4326n5680r1231l8790L1564Q9993
17562H4815q773l200O2763j01257K1425N3105J4919p1459n5808n2574N758K8644
17550b1642J43726M0413n7016n9816m2061j2150L3685J01852k7301l8950k2995
$$ y = [166229, -63331, -190711, -224331, -149133, 10002, 16950, 1248, -17747, 23187, -74602, -153672, -78555, -1516, -41824, -122923, -85326, 7895, 69102, 185860, 216197, 237436, 230978, 247734, 89881, 82316, 157783, 182539, 91651, 95720, 204870, 217280, 116727, 74057, -39584, 18496, 217699, 294160, 233307, 178863, 218557, 88506, -33905, -132348, -113586, -57430, -12373, 15291, -17041, 48652, 68629, 144996, 100739, -27813, -69579, -99310, 9464, 177227, 195573, 215907, 223285, 148959, 93279, 2048, -36742, -5178, 84815, 76042, 72842, 135605, 34348, 55773, 108878, 123797, 52338, -3470, -56044, -50286, -21642, 122084, 162497, 105481, 45665, 3604, -8546, 25139, 126991, 99690, 60740, 37745]
17539C7745n5390l5548K7052K2394j3102j09844q7548Q1182k2215N2965Q331k5362
17527a19340m0581n5333p517N0886l6269Q8863Q3945L0447K599O2418M7651r5445
17515A2324o8322K0931N5881Q9611q1810M240m4752Q527O686o9961l9855k8599
17503a35099j9131P4623O0992K7156r5910j88503j9609R7448J43656o4837N6285
17492f2929Q8100J18917Q135j20094l4046n4242j13192p0399R9328N2026j13964
17481b02360J690Q6527O5195L839L6484M7699M6543p229j25771k5720l1604P1445
17469c3262n3640j22009J8301K4097M4950P6041L8151l8632M3257M5512j4513
17458B8253j59444j38749M4452j2137K6406M8828j9552K3263j5802n4476p1504
$$ y = [37745, -17645, -53193, -26141, -3747, -16849, -126693, -214241, -133059, -155274, -102309, -93978, -119340, -159921, -215254, -222771, -171885, -208154, -119291, -35346, -4899, -2300, 60118, 107769, 12324, -55998, -35067, 20814, 110425, 28615, 32855, -11897, -3370, 3316, -66645, -106500, -135099, -154230, -79607, -18615, 8541, -87369, -275872, -295481, -198033, -54377, -119214, -62929, 25171, 144088, 152223, 32129, -1917, -56159, -169351, -239750, -140422, -88396, -202360, -200670, -114143, -48948, -45109, -8625, 39074, 85617, 78388, -47383, -73103, -104707, -33262, -86902, -208911, -190610, -166513, -121563, -45522, -7371, -46003, -2746, 42766, 28253, -131191, -269940, -225488, -237625, -211219, -162391, -181943, -158680, -174482, -228958, -300462]
17447c00462M1665N9147N4479N7447R626o9069m0529N6272K6392n2347r8681n1979
17435c08039J5998J51845J22220l3029j04637l9018j297k516Q632R34L6233N0819
17423a01855M0271j37859o5723P0133P0727J09339o2385j56151p2462M4411J56123
17412a05431R4704l428j12488o9809q3512Q4645j043L4571J01046j5554m9823
17401a26122n5676n809j650M2658j3820L9401j21544r2540K5899L6677k4116j485
17389b98127J91454L3517o1782j70M6943K2222M5693p8452P7003L2707j1031P182
17377G159m6374n600L597K0412k7318o1993K1608k6908o0509r31K8350Q3654j1875
17364g6728r2427n637n143m0742J8912l944M0299J14680M9194k0217j31094j58282
$$ y = [-300462, -258797, -199650, -145171, -87724, -78098, -147167, -187696, -131424, -105032, -157379, -256060, -308039, -292041, -140196, -17976, -51005, -155642, -194660, -195957, -198473, -189841, -188907, -152674, -101855, -61584, -199443, -265166, -195033, -124306, -14967, -77352, -233503, -305965, -261554, -105431, -10727, -14155, -126643, -196452, -279964, -195319, -196362, -161791, -60745, -76299, -126122, -181798, -187607, -189257, -146599, -160419, -121018, -242562, -335102, -309203, -272526, -296642, -298127, -106673, -73156, -134938, -135108, -88165, -65943, -20250, -98702, -21699, 11008, -23, 7159, -39215, -44815, -41218, -20806, -48124, -110117, -88509, -115417, -175926, -176857, -148507, -64853, -76728, -169155, -174792, -179935, -220677, -201765, -205709, -165410, -50730, -1536, -21753, -152847, -311129]
17352c11129o9829J8631R7000l9241K0178J23899K8093K2097j527K860J06695
17341b273J06459L6575J7528j0054j6436o1107P6275l3546j85905n3311o587L3403
17329i8979K6366p631j6429R8073J17522K1196j04213n9947L3125n450L2288j5262
17317B0659k0200K0023q0063q4223N6669J56144j18501r8868L5543k5993k9384
17306a68194J3371r1447n7029Q6332J29743n1286k7104Q1138L1344p4104o61J09371
17294a8526Q7269P0479p9232j61630j06404j0588J01222K118p6631K9289R5592
17283f7042L5464j19186o6994o9756O3369L2383P2967j4548P7834k0768q9448
17272a65725j8714P7404k5800j73084j9425J08041Q1913J5236L9783Q2932n1370
$$ y = [-311129, -380958, -362327, -265327, -304568, -284390, -160491, -132398, -110301, -111828, -108968, -2273, 104186, 140761, 158289, 148235, 131799, 70692, 146967, 113421, -72484, -125795, -132382, -98979, -72613, -80244, -96673, 1400, 118922, 140118, 35905, -24042, 9083, 3633, 35921, 20659, 459, 20482, -59581, -143804, -87135, 69009, -49492, -148360, -112817, -138810, -168194, -154823, -246270, -303299, -216967, -87224, -138510, -165614, -84476, -53132, -127236, -127897, -18526, 68743, 139222, 59990, -101640, -208044, -218632, -117410, -115292, -191923, -162634, -67042, -31578, -150764, -217758, -287514, -224145, -191762, -118795, -133343, -55509, -76277, -165725, -184439, -107035, -132835, -305919, -325344, -217303, -135390, -120154, -80371, 2561, -48809]
17261d8809j9590m490q4777n552p6505N0633K7013m304p3056n301J15296J35459
17249F017q816j48588l8157M835Q9185M3712P1947P0626P5603m2375j04968n8474
17237c9453L0643J7380j19258m115l8802N2779k2336N3546k3529J0022J4513o2066
17225a30676q7776n0721J03594p9843r222J33249O9564Q5400q1174l3821N257
17214g6169L1361l2116j3528N9926j3716m4352o5215R7109L5086L8010m72L6831
17202E2755N6335j07885j20127J6802l2241l721R3279k0486q8533j16341r2097
17191c62260M5394o244J9722P3881P6347Q1141j0831q7173O982q423n6671l5575
17179b63710K411N3150m983k2296J8190J556m639P5295J3663Q055J38446m646
$$ y = [-48809, -68399, -72889, -157666, -163218, -239723, -189090, -162077, -166381, -239437, -244738, -129442, 6017, -2799, -151387, -189544, -184709, -95524, -51812, 20135, 90761, 166364, 123989, 19021, -39453, -8810, 8570, -110688, -114803, -153605, -100826, -123162, -69616, -93145, -83123, -68610, -130676, -218452, -269173, -165579, -245422, -254644, -121395, -51831, 33569, -47605, -81426, -76169, -44808, -76924, -90452, -30526, -44242, -88594, -153809, -56700, -21614, 16396, 15924, 52755, 109090, 1205, -118922, -102120, -134361, -138082, -44803, -65289, -153822, -270163, -362260, -316866, -323110, -303388, -229507, -153160, -72019, -82850, -170023, -163041, -171464, -228135, -263710, -261299, -208149, -213132, -235428, -217238, -215682, -220321, -145026, -131363, -123308, 15138, 10492]
17167A0492n937p7144n7542K5033n568L4169J0983l805l453m91N3758N0920j12604
17154h1189q0417j2933k1689J1559q244n6795o0002J16485P1941p300J710N7812
17142f9062O735q9362n7021o5832r192J4849O9703J83083M4446J7853o5495m1249
17130f0544P7111l1306k1427L0065J9393j18614q5545j03635n7056N6706Q9826
17119b05026k5705p0124l021M3620j3992K3832O9993r9194M9110J52937J11873
17108C4303n4729r3005p9594L3980J3958o7704L535k8111R1544O4582P9127j8940
17096b1054o5972n4746L5380n9683j5836N1214K7429p6640K2260k5771O882K2070
17084a54467m0426j2423N2344M8694j2577L6457j2592j4530n1841M2849J55812
$$ y = [10492, 4555, -72589, -130131, -105098, -110666, -76497, -65514, -69319, -72772, -73263, -19505, 31415, -81189, -161606, -174539, -196228, -184669, -192913, -249708, -309710, -193225, -121284, -128584, -126874, -69062, -62327, -151689, -208710, -274542, -283734, -268885, -199182, -16099, 28347, 46200, -19295, -60544, 16567, -14739, -36166, -6101, 13292, -105322, -190867, -294502, -351558, -294852, -205026, -230731, -300855, -303876, -260256, -274248, -250416, -180423, -279617, -230507, -77570, 34303, -20426, -113431, -193025, -159045, -145087, -212791, -209256, -237367, -145823, -81241, -2114, -21054, -87026, -141772, -106392, -166075, -181911, -130697, -103268, -179908, -157648, -183419, -176537, -154467, -194893, -207316, -154972, -106278, -118855, -82398, -94990, -109520, -161361, -118512, 37300]
17073C7300O8734j29337p68O9155l5963n2629j5767o2570j13342R2151L2885J2613
17061i7538O6285R4738k7837n2283q8422k3565p9370k1209Q5526K1459m4680j8603
17049a85499o0443J9585j2791p5376M6980K8221O936K1365Q5983L2382p9529N08
17037a71678J00504N0135m1634K4831J03270N5691m1553j15680j34966N0251N7616
17026f3213K0458m6347q0135j0432L7983o1168k3805n181J15446J24799O3022
17015G1427P1465n0107p4117j2330r0867m4319K9179L9786k6290N5202L2247j03448
17003a02172l5442O2046p8990o8666J7181N2675J6361j2875o15R6859k328K9095
16991b6871l5060q8825j7696M5833M9706o2158L1187K4774M0921m1371l948m314
$$ y = [37300, 106034, -23303, -24071, 45084, 9121, -43508, -59275, -121845, -235187, -143036, -110151, -97538, -31253, 63485, 35648, -16635, -105057, -128622, -207992, -229201, -143675, -122216, -166896, -185499, -245942, -226357, -239148, -314524, -267544, -239323, -232387, -211022, -125039, -92657, -172186, -171678, -71174, -21039, -62673, -37842, 65428, 121119, 79566, -36114, -171080, -120829, -63213, -42755, -89102, -169237, -179669, -141686, -202854, -226659, -231840, -116394, 8405, 71427, 142892, 92785, 18668, 6338, -84529, -128848, -99669, -59883, -86173, -30971, 1276, -102172, -137614, -75568, -154558, -223224, -206043, -153368, -137007, -149882, -150497, -53638, -55966, -26871, -61931, -150756, -168452, -122619, -72913, -135071, -103884, -79110, -38189, -79560, -83508, -87822]
16979h7822N831P7367l3608j4763N9733l9017J6029n3675L8436r428K4258J72549
16967A55890j8759n8807Q0987j26778q6531q8763m3889J3359P0886J8300Q4552
16956D47M7566k0297r83K1115N2824k7374l2108j2803l2114m3122m2314k3611
16944a12774p7886r236K9033j8396l1711p9277j9909J03139J73528J35591j34682
16933d2580j11291n0089J3193j4134Q865j9176J3698Q8261J4654J07699M5037
16922E4137q6956r9638N5581K5758O7938K9639j07338J185o4481o7308K3152Q009
16910a60322m2203N0192J40910J18954n0447j15228j0618k5212J15865j30096
16900a08205K1216K7092K4622r995m7062n6706J5258m8251P9954O5373j04460
$$ y = [-87822, -81991, -4624, -38232, -52995, 6738, -32279, -16250, -69925, -31489, -40917, -16659, 155890, 137131, 78324, 159311, 32533, -53998, -142761, -186650, -173291, -102405, -84105, 447, 48013, 27716, 26733, 47848, 100672, 73298, 41190, 28387, -3727, -46849, -89163, -112774, -190660, -199896, -170863, -189259, -220970, -300247, -320156, -217017, -43489, 92102, -42580, -153871, -203960, -190767, -204901, -196036, -215212, -201514, -113253, -98599, 9100, 54137, -32819, -132457, -76876, -51118, 16820, 46459, -60879, -59694, -124175, -191483, -168331, -160322, -202525, -152333, -11423, 107531, 57084, -58144, -68762, -93974, 21891, -108205, -86989, -59897, -35275, -45270, -92332, -149038, -133780, -182031, -102077, -36704, -141164]
16889a41164l5978J22043K3995m6970j85289J816Q1138M6619L7802Q3127q2060
16878i4921k07605P8319L3734j24194R8393K2375n2795Q0343M1479k7570o6963
16867b19405j37422k1579J46590J2667K6074n1533R741O1091J09948N4215j04808
16856a14421j43274k5667J3504o6053k1038Q007J10942J14541n9103R7576K7198
16845e7788n0770k925J01251j247l345n631n4755K4712O7380q6447K6786q234
16833e1013M274q5261n3323j9790n3040Q3329p1725k1948M6325J18032M7180n4317
16821a11277K5851R8075K1578K3262n5033m9076K6141l7444L549n7434l0535j808
16809a44151R826K7948K5865L0913l5127n4378n7054Q3155m9284l6320n0237j9185
$$ y = [-141164, -177142, -55099, -31104, -78074, -263363, -261547, -180409, -133790, -95988, -12861, -94921, -302526, -224207, -190473, -314667, -216274, -193899, -246694, -166351, -124872, -152442, -219405, -356827, -378406, -231816, -219149, -193075, -244608, -234867, -173776, -63828, -9613, -114421, -257695, -283362, -269858, -335911, -356949, -348942, -238000, -123459, -182562, -84986, -57788, -108558, -111483, -10232, -11479, -14824, -20455, -75210, -50498, 16882, -69565, -42779, -51013, -46739, -132000, -185323, -205113, -258153, -174824, -246549, -268497, -222172, -104140, -56960, -111277, -85426, 12649, 34227, 57489, 2456, -46620, -20479, -57923, -54374, -111808, -142343, -144151, -134325, -106377, -80512, -49599, -84726, -139104, -196158, -113003, -162287, -198607, -248844, -268029]
16797b68029J41558N3149l1994R7221r0191j91742K1264J58846J04279r308j05610
16786a20557r2065K3594N3720N925m1897M6480M0501M8267M3547n3422l3602O0598
16774a8911M4889j394n9202l7454J4285o9332m8719Q7909r0475p8297J4157L5556
16762b06988R6721O7831K6134L9051n3517j1434m8647j738K5077r0963L1188k2294
16750a49579J6680K9921l724j14742R410J11918N3527m7503J169J16642M440j23799
16738i5640k5501R01p425K2836K8443p6425o8291Q686K0240J16987P5996L3246
16726C4053J7353m1111N2554k871j16559p2734N0317j08180M150O3903N9174M2806
16714a7145P9571m0000k0192R7552P6217l8002j32852J3541j03437K0749R2873
$$ y = [-268029, -126471, -73322, -105316, -8095, -98286, -290028, -268764, -109918, -5639, -14947, -120557, -212622, -189028, -135308, -129383, -171280, -124800, -84299, -36032, 7515, -45907, -79509, -18911, 25978, 24584, -34618, -72072, -57787, -127119, -175838, -87929, -178404, -256701, -242544, -206988, -110267, -42436, -16302, 22749, -30768, -42202, -90849, -92587, -67510, -158473, -127285, -149579, -132899, -102978, -106702, -221444, -212034, -100116, -46589, -94092, -92923, 23719, 28159, -95640, -121141, -120240, -127665, -104829, -76386, -152811, -221102, -212416, -192176, -75189, 807, 34053, 51406, 10295, 62849, 59978, -56581, -129315, -78998, -187178, -183028, -119125, -59951, -17145, 62426, 22426, 2234, 99786, 176003, 138001, 5149, 18690, -84747, -63998, 28875]
16703B8875j446o592m1919l309m5508r6519M3554K9012j4878L4906N8078O8461
16691E2715O544M965l4627q4056q606K5240n7701j15129j3776L058J5587o637
16679b12423K5490L1543Q498K8662J26371O7431n5782O038o2345p4780n3771L2341
16667a32727N4902j8548j18237N8618O9847m4947m4146L0274j4305j5871l4077
16656b09217J4191q388K8456R6568K9681j02910n7927R926k7148L6183P3364n1013
16644a68234j11942p682J5672K4887R7658J6963N3777L5242k7288j06890L9517
16633a38320o9235m2223k4706K8076J04363N1388j29393K0871J41394Q6069k3102
16622E182O131M5749J7783j13587Q2562j6535J9227K1648R737n9791m7527J6374
$$ y = [28875, 27429, 20837, -21082, -24391, -69899, -166418, -122864, -93852, -108730, -73824, -15746, 52715, 59259, 64224, 29597, -54459, -63065, -37825, -95526, -210655, -224431, -221373, -205786, -212423, -186933, -155390, -146892, -118230, 8141, 75572, 19790, 25828, -36517, -111297, -165068, -132727, -77825, -96373, -214610, -155992, -86145, -131092, -175238, -144964, -159269, -175140, -209217, -195026, -203414, -174958, -78390, -48709, -151619, -209546, -199620, -226768, -190585, -117221, -168234, -280176, -287858, -272186, -247299, -149641, -132678, -78901, -43659, -70947, -177837, -138320, -207555, -249778, -274484, -246408, -142045, -90657, -220050, -199179, -57785, 28284, 5182, 11313, 57062, 74845, -38742, 43820, 27285, 46512, 68160, 77897, 18106, -29421, -13047]
16610a3047N1955k8557K341K5806L3241q8619j7329K3921m5966L7444J08162L3339
16598A22691L598m90o5453o1686Q7282j11314q4219L0608J35942j20119l9042
16587a02202P0742j31867m7227R4265J28397k5551J4286K1292M9079r3012n7678
16576g9476l754M1560O0086r0139o5133J0879j6004o040q1466K7033M0925k5600
16564a87129n2920l3080k8487k0808J69136R3909Q4655L8936m4453j60861m3425
16553a84527l6465n8731j3640K2890P7512K9917j35103K2306O6799j4367m4220
16542b67629l9316K3290M2036M3146O4330Q7553K0710r6623j93673j003J4692
16531c02487o3763k7616J3505P9210J03862k4404k9440L0699n0239P7670P9154
$$ y = [-13047, 38908, 10351, 12692, 38498, 71739, -16880, -34209, -10288, -56254, -18810, 89352, 122691, 126289, 125799, 60346, -1340, 85942, -25372, -109591, -78983, 56959, -63160, -102202, -31460, -163327, -210554, -116289, 12108, -13443, 843, 22135, 71214, -21798, -79476, -83230, -41670, 18416, -71723, -136856, -125977, -141981, -148021, -229487, -202454, -161529, -187129, -240049, -273129, -301616, -322424, -153288, -59379, 25276, 64212, 19759, -141102, -184527, -220992, -279723, -293363, -270473, -192961, -163044, -298147, -275841, -209042, -223409, -267629, -306945, -283655, -241619, -198473, -134143, -46590, -25880, -122503, -316176, -317179, -302487, -366250, -393866, -380361, -301151, -197289, -221693, -251133, -220434, -270673, -193003, -113849]
16520a13849k5470o1468r533Q5184J9198J2M3104l2206L8069O8494l8914n002
16508c2381J5413L3199r606j1858k2114j08575p804N2837O4946J1627J2495j9544
16496b1365j0471m6303m1007O055n7102K9909j0173Q2185J2995j06598K1512P1789
16484f8574M5558K3474m8604l9910o6973J48580O2817j32019m0401O8185J21207
16473G3340k180n4084n6318l4038j03400l0755N9394J4977j05322j01069J1788
16462c27667j6601J12932j5357r8573Q1153M3344j00734j28719O8259J24512L2191
16451b25260K8385P0070m1405p179p9565n0430J29664k6193M8979R1089j30820
16440a92665Q912K0947M6765Q5225Q2905j3101j4817p4875J5023O3901N0804Q039
$$ y = [-113849, -139319, -200787, -210320, -125136, -105938, -105926, -62822, -95028, -56959, 11535, -27379, -32381, -16968, 16231, 6625, -5233, -27347, -135922, -143726, -90889, -25943, -14316, -1821, -21365, -31836, -78139, -119146, -113091, -170193, -140284, -150457, -68272, -55277, -161875, -140363, -68574, -23016, 458, -48146, -88056, -155029, -6449, 56368, -75651, -116052, -47867, 73340, 71160, 17076, -39242, -73280, -176680, -207435, -148041, -133064, -238386, -339455, -327667, -344268, -231336, -246693, -345266, -264113, -220769, -321503, -450222, -381963, -257451, -225260, -196875, -126805, -168210, -175389, -254954, -305384, -175720, -201913, -152934, -61845, -192665, -183753, -162806, -116041, -30816, 52089, 38988, 24171, -50704, -35681, 28220, 79024, 87063]
16428H7063O099j3653q6764J5892N18L8983j0429j37686p5148o9721m9241N5176
16416b38911j0512Q4046Q9150k8157n0322Q5733M3264j11885J4918k8221q0355
16405b31252r290P8531Q6284L7381k9861j3151q2759P223J06504L134q8630J6828
16393a19058K1144J2100r071J00444O2226o9017r5194Q6822Q0748N7354q546n5117
16381F4835j61326j65469N5695J2251J45379l4123j75325J1936J04518J65958
16371B4329l768k6968O3077l9121p7215m4397M1842j0829j8142P7402N3301J3588
16359E3099m3794l8939q3564o2503P393M030Q9361J5815j13460j7272O9153P540
16347a13141O9527k656J1317M970L5075J55147Q8353p5046M730j15032p5493K7747
$$ y = [87063, 93162, 79509, -7255, 8637, 9155, 48138, 37709, -99977, -175125, -244846, -294087, -238911, -249423, -165377, -76227, -104384, -154706, -68973, -25709, -137594, -122676, -150897, -231252, -240542, -162011, -75727, -38346, -68207, -81358, -164117, -156894, -50390, -47256, -135886, -119058, -97914, -85814, -94885, 5559, 67785, -1232, -96426, -9604, 71144, 128498, 119952, 64835, -96491, -261960, -206265, -194014, -48635, -82758, -258083, -246147, -141629, 24329, 20561, -6407, 56670, 17549, -59666, -104063, -62221, -73050, -91192, -13790, 39511, 53099, 9305, -29634, -113198, -175701, -168308, -164278, -74917, -59102, -172562, -189834, -120681, -113141, -43614, -46270, -34953, -29983, 5092, 160239, 248592, 173546, 178276, 63244, -12249, 15498]
16335A5498K2344j3965n8611n1316M3279p046p2818R8749L1769r3254m347m8814
16323a38532P159M1330O0835o325L3735K8572Q2324q7992j57212l600J28679n5086
16311f6113r1483J4907J18856O0607J8440K4971n1380M0907P8509k4305r846P0228
16299A84298K4608K8360J41035j0987o655N1747J0606J31258Q4159Q9434K08913
16288I36776K05219J78018j8124n2498N2385m4086n2155m3859p8822j70423r2618
16277H19813n7775q6012q2631q6691j7455m0907p2629k8378J7921k61r6032k27490
16265D1473j2693J32645Q3470J06244P1004j45414j08370o5903j0294p5798j5325
16254A039N9129m0645o2680p9709p165L2788p6560m1753L38k2351J1040P9649
$$ y = [15498, 37842, 23877, -34734, -86050, -42771, -49817, -122635, -23886, 7883, -85371, -89718, -138532, -131373, -90043, -29208, -35533, -1798, 26774, 109098, 21106, -136106, -139706, -11027, -66113, -157596, -142689, -23833, 36774, 55214, 80185, 28805, 69712, 148221, 123916, 114070, 184298, 208906, 237266, 378301, 367314, 360659, 412406, 423012, 554270, 638429, 727863, 936776, 1141995, 1320013, 1301889, 1249391, 1301776, 1257690, 1205535, 1161676, 1082854, 912431, 819813, 762038, 676026, 593395, 506704, 489249, 448342, 375713, 347335, 365256, 364995, 268963, 41473, 28780, 161425, 244895, 351139, 422143, 276729, 168359, 102456, 92162, 16364, 1039, 60168, 19523, -43157, -122866, -130031, -97243, -173803, -215556, -215218, -237569, -226529, -146880]
16242a46880L2860J35662J8287j42173m0160M7628J06520R2884l3869p4491n4116
16231e7848j49777K8376R8828J03298l0872J2315J26291M7948n6710j1200j22501
16220a1852l8585J16696J9817J0887O2473j392j59999j24740Q0619L0180K5481
16209I585K3623j8752j3835m62j3802m917k6449j7081N3169K1049M7841n2025
16197G944j31747R242J16404M9996o8738k8779j37283k5446J04737O9881P9973
16186D6184J7501K0045L1191q5697l3267o2325M7912J1537l5327j4212p570o2253
16174a26281r2750r7167K1301J44154J25791m2800J1823Q1568J13712L6696m5961
16163A30086P0813j08593M630j1514j6372K0018n3842l9438M4930k5070J7917
$$ y = [-146880, -114020, 21642, 39929, -102244, -142404, -94776, 11744, 104628, 70759, -3732, -57848, -207625, -179249, -80421, 22877, -7995, 4320, 130611, 178559, 121849, 110649, -11852, -50437, 66259, 86076, 96963, 159436, 158044, -1955, -126695, -46076, -15896, 9585, 33208, 14456, 621, 159, -13643, -18560, -45009, -62090, -8921, 12128, 59969, 7944, -123803, -114561, 1843, 51839, -16899, -45678, -182961, -208407, -103670, -33789, 46184, 63685, 83730, 114921, 29224, -4043, -66368, -18456, -6919, -42246, -56458, -64028, -126281, -219031, -316198, -294897, -150743, -24952, -67752, -55929, 25639, 139351, 176047, 130086, 200899, 92306, 96936, 85422, 69050, 89068, 35226, -4212, 40718, 15648, 33565]
16152C3565L0507q2923k7113L0047J21809j1703j37769n4166P3790L21l48M8153
16140B4170k4302J8100p614o2060k8466p497N0053Q975M3751P93o9685j00938
16128a54720r0826n9161J23025J99024N1330q7007m3667o1024k2907k6354l905
16117a76192p45n333M6473P5159P8613j27062q9360j7979R0342K00775q3452r7598
16105a06359K9375l6036R5433m120m0903P4969K2684n5648l2376k9591K3315r1172
16093a50429r7507M9485n102o4153J45191O5127l4375l6341n0235L2451P7296
16082f8592l2223j41485k0783L6543J48378J5952K5329R242j20431j38730J4745
16071b72055K48942K9599j1935R0354m7538P833l9867j08200q0944l0380p3388
$$ y = [33565, 64072, -18851, -45964, -15917, 105892, 94189, -43580, -97746, -23956, -23635, -23983, 24170, -132, 17968, 10354, -51706, -80172, -87669, -37616, -28641, 15110, 15903, -53782, -154720, -245546, -304707, -181682, 17342, 68672, -18335, -62002, -123026, -145933, -172287, -176192, -176937, -182270, -135797, -60638, 17975, -109087, -198447, -216426, -126084, 74691, -8761, -106359, -76984, -113020, -17587, -21707, -62610, 12359, 35043, -20605, -52981, -82572, -59257, -150429, -247936, -198451, -203553, -267706, -122515, -57388, -91763, -128104, -178339, -145888, -68592, -100815, -242300, -263083, -226540, -78162, -62210, -36881, -27639, -148070, -286800, -272055, -23113, 6486, -5449, 84905, 37367, 45200, 5333, -102867, -183811, -214191, -287579]
16060b87579o6891L5799J1413R0276K6689P294r303j0788L1138Q845L7097l5578
16048a61588K0392q729M3506n2183r947j0322k5324q9312J35945Q6148o6791q7617
16036b25822j2892J63621K4977m2039k7859J3637o3043L3274q445K2549r008l7079
16024a68129j8904M7692N2043k7030l2804j6120k528O9847R525o256J0396j7524
16012i9792J6099R9380j07302p2460r533K366n3974O294R052P2439P8737k7304
16000h5998K86Q5595l673l9934n1183o5254M2371J1982P7949L1057q4995M8148
15988c3649J02602l1175n8043j46345l4803L638o1593R0919O1192l7235l1562
15977a76054R7282P4982o6094k2230K7125l1402j9602M3151M9389R4629N7159
$$ y = [-287579, -354470, -318671, -307258, -216982, -190293, -182999, -192302, -203090, -171952, -163107, -126010, -161588, -141196, -149925, -106419, -158602, -168549, -178871, -204195, -293507, -157562, -71414, -138205, -225822, -238714, -75093, -50116, -92155, -120014, -106377, -169420, -136146, -144591, -122042, -131050, -168129, -187033, -139341, -87298, -114328, -147132, -163252, -165780, -95933, -86408, -92664, -82268, -99792, -83693, 15687, -91615, -164075, -173608, -171242, -225216, -218922, -209870, -137431, -58694, -85998, -85712, -117, -3790, -43724, -94907, -160161, -117790, -105808, -27859, 3198, -81797, -33649, 68953, 37778, -20265, -166610, -201413, -197775, -259368, -168449, -107257, -144492, -176054, -78772, -3790, -69884, -92114, -64989, -96391, -115993, -72842, -23453, 71176, 128335]
15966A28335q7908l7271K822k7830l0481r6665q1651P0722M7449J07732j292M3507
15954C7469k6358r9884j3580N010L0436R3031l9096q4513k1620N831n4100k0376
15942a87750P6496j7714o0660K7280N6295J706j6362J0421O6598J20602j7932
15931E8980p6155k9359q526O1623O1048N8368l2537o4390N937n6205Q8912K3942
15919I1638j19392J5648j1524r6300j633P6731j2750n2547m3577L8104K0969o4743
15907a59376M8719J23512N1406p4032o4683Q0641l1446M5577K7548n5945k8781
15896c6860J0428n1683k0613J9197L3316P9052N5101r5264m24Q5783k1164k7454
15884B9415K0536j1509l9817j5921K2781O1578R8633l3441j25902l8688j1659
$$ y = [128335, 40427, 3156, 5978, -21852, -52333, -148998, -230649, -159927, -112478, -4746, -6038, 37469, 11111, -88773, -102353, -97343, -66907, 26124, -12972, -97485, -119105, -113274, -167374, -187750, -111254, -128968, -189628, -162348, -106053, -104347, -120709, -110288, -43690, 76912, 58980, -17175, -46534, -55060, 6563, 67611, 125979, 93442, 29052, 34989, -21216, 67696, 91638, -27754, -12106, -23630, -119930, -121563, -44832, -57582, -110129, -153706, -115602, -94633, -159376, -110657, 12855, 64261, -9771, -74454, 6187, -25259, 20318, 47866, -8079, -36860, -26432, -78115, -98728, -79531, -46215, 32837, 87938, -7326, -7750, 78033, 56869, 29415, 49951, 38442, -1375, -17296, 5485, 67063, 165696, 132255, 6353, -32335, -43994]
15873d3994k6106p7813J6985j3427L0286m819Q1580N4756N0232o2159j6586K2709
15861A1644m2725M275j15130K6370J87815P0339j26543r0858o4831l1962K2719
15850a48887J08633M705m4656R8829N4753q1727N349r8154m1392k640J8462J3160
15838a13565N997k3416Q754j1450P1057m3438Q763r2106m5754j5270N9332M8153
15826a42943O7955M2957P9090l9890n3647k7692k4647K785Q8056M7021P123k4213
15814B1955q7817m1377J21928K6390L3216n0371N343m5994n2175O758m1721K0869
15802h2996N5040l7388K9748M5038K7765j8676M2032L686n0197k0055n2287l2789
15790i1079J5492o6656P971P5190O4683K3119K9623O343n7043m5682N2458l6432
$$ y = [-43994, -70100, -147913, -130928, -144355, -114069, -118888, -37308, 17448, 67680, 5521, -11065, 11644, -31081, -26806, -141936, -115566, 72249, 142588, 16045, -74813, -139644, -171606, -148887, -40254, -35549, -80205, 18624, 73377, -8350, -3001, -101155, -142547, -145187, -126725, -113565, -107568, -130984, -122230, -133680, -62623, -106061, -97298, -189404, -235158, -250428, -191096, -142943, -74988, -32031, 47059, 7169, -46478, -74170, -98817, -96032, -7976, 39045, 46168, 21955, -65862, -107239, 14689, 41079, 74295, 23924, 29267, -16727, -68902, -62144, -103865, -82996, -27956, -65344, -35596, 9442, 37207, 18531, 60563, 64249, 14052, -6003, -58290, -91079, -75587, -142243, -134272, -59082, 5601, 28720, 58343, 64686, 7643, -38039, 14419, -22013]
15778b2013l1546n3118k2111o1373P7017p0243P5215J28282j4392J3609l0854
15767a1527p612N3203K1076j21401n6021J7988L5866j1522r3376K2597J07542
15756d3187O2672R6204p5946J3932K7049q275n8220l1292p6749j02288N0721P5555
15744f9824R3748l2510n3774q8821l9025j7879k6717M9306J59920J04620J1703
15733I0747n4824j03944n8256P353K4374n3594n299k6561q2598K8419P6712Q296
15721a49175R3650P7478j31503l6948m3331K1150J18943n0864j8689o4615O4532
15710a19372R4417P4047k2255r4843j1641j0850O5951j3355n9909l5406L632o6672
15698a96256m9161J46800J39744q0240n6227r3518q9412O7426M7358L8670j1456
$$ y = [-22013, -53559, -106677, -128788, -190161, -113144, -183387, -108172, 20110, 5718, 19327, -11527, -19139, 34064, 55140, -66261, -122282, -104294, -68428, -79950, -173326, -150729, -43187, 19485, 115689, 39743, 53675, 80724, 72449, 14229, -17063, -93812, -196100, -145379, -69824, 23924, -8586, -62360, -151181, -190206, -208085, -234802, -185496, -25576, 79044, 90747, 35923, -68021, -126277, -118924, -94550, -148144, -153443, -180004, -262602, -234183, -157471, -149175, -55525, 21953, -109550, -146498, -189829, -168679, -49736, -100600, -119289, -183904, -119372, -24955, 49092, 26837, -68006, -79647, -90497, -24546, -37901, -97810, -133216, -129584, -196256, -245417, -98617, 41127, -39113, -95340, -188858, -278270, -210844, -163486, -124816, -136272]
15687a36272Q1551L6791L686M5286J5732j49026j19988J02358N2560J63511o9910
15676B6279O230J02005j25601n2897l4311q28K4517p8661N216J01093O6632p1132
15664c1458r9445o3285o3642J30545K8382m2323k1713l9476N5808j3553P4889
15653h5271J8908K4506o6374m4962P090L6078p1058R7789J37471j25098r5177
15642a66098M307k5784J34030J21195r3317k2500j18621L1505M2293Q1210K6340
15631A4560P5697O6520p6824N4989l3465j3166Q27j35082j70006J02647R3469
15620a9834J4733j04000P741j1473q4153Q1859N6424k0901L4758P5508o9592n1103
15608i0033N3529M6336n3437m8102K5294o417j5863q8829k5972M9943O8101J26700
$$ y = [-136272, -54721, -17930, -14244, 31042, 46774, -102252, -222240, -119882, -67322, 96189, 26279, 32509, 134514, 8913, -43984, -78295, -79123, -54606, -133267, -128051, -26958, 39674, -31458, -130903, -194188, -257830, -127285, -98903, -141226, -162939, -202415, -146607, -160160, -85271, -66363, -41857, -108231, -153193, -146103, -110025, -181083, -83294, 54177, -70921, -166098, -161791, -187575, -53545, 67650, -25667, -48167, -166788, -135283, -92990, -11780, 14560, 90257, 156777, 79953, 134942, 101477, 88311, 89138, -45944, -215950, -113303, -19834, -5101, -109101, -101360, -112833, -196986, -115127, -58703, -79604, -44846, 30662, -38930, -90033, -36504, 9832, -43605, -91707, -66413, -72830, -88693, -177522, -203494, -153551, -85450, 41250]
15596D1250Q184m0008l3142j86437k438J01468K4355l0007n8349L8630L8322j881
15584a00053k7438K6696O7643j2988j10799n0329N0655R4315l3142j7386R0131
15573b2695p3181K1927k866n3613L3673M9952o7274q3607j1632O2344J12930J33426
15561I9384P105p0614p8379K6622n1093J3360J17563j3112l1720j1981J2315o169
15549A3281m1042R999p850o3293N7951J4366M8635J22249n7742r6515p7490q8035
15537a65486O8676Q9010K7023j9584Q2202j02563l9750M755K5281M6425O436Q425
15525C0850J3976j03062K9274J2833p4906J04121m9827k0084J05825l2542r0663
15514g4205k5490J09493Q3743J7308j21069o4513l8497J7799j990n0610n854J05516
$$ y = [41250, 49434, 9426, -23716, -210153, -212591, -111123, -86768, -116775, -175124, -136494, -98172, -100053, -127491, -100795, -33152, -46140, -156939, -207268, -156613, -62298, -95440, -112826, -22695, -95876, -73949, -76815, -130428, -96755, -46803, -114077, -197684, -209316, -146972, -34042, 99384, 106489, 35875, -42504, -15882, -66975, -53615, 63948, 50836, 19116, 7135, 19450, 13281, -27761, -17762, -25612, -88905, -30954, -16588, 32047, 154296, 96554, 39, -77451, -165486, -96810, -7800, 19223, -361, 81841, -20722, -60472, -55717, -30436, 15989, 22425, 30850, 44826, -58236, -28962, -16129, -91035, 13086, -36741, -56825, 49000, 16458, -74205, -99695, 9798, 93541, 110849, -10220, -74733, -113230, -95431, -97421, -148031, -153885, -48369]
15502d8369m3460K3925N1626N7444m3943m4003R1952R6781n2720m1696p3451m6919
15490g2833J5272k7482l341j8076K7191o258q516k8320o5526j39525k8095P5582
15478b79927K1606K8892l4068P3632O7638m4871M1518L2251O9819n0178r778o0581
15466a44047J92169R3456L048O237o2731p6302Q1464m2079k2999n1001j00313
15455a23098p1340M5120J84818J34665m9499j09229r3660K8025K5087n4027m5650
15444a28788M8423K0192j05616P7674P4423n3128l1468P1101O1538l7134m5171
15433d7954j27671j9441r0526o1768P5700J29623O0677Q1348P2177p4099j36750
15422a38684k9171J32352m2161k9698L5631L8437J0619Q6050J0152j2708L0077
$$ y = [-48369, -91829, -67904, -16278, 41166, -2777, -46780, 45172, 141953, 89233, 47537, -25914, -72833, -57561, -85043, -88384, -106460, -79269, -85527, -94043, -122363, -187889, -327414, -355509, -279927, -258321, -229429, -263497, -189865, -122227, -167098, -125580, -93329, -23510, -73688, -83466, -144047, 48122, 141578, 144626, 150863, 88132, 11830, 93294, 51215, 28216, -22785, -123098, -194438, -149318, 35500, 170165, 120666, 11437, -82223, -54198, -29111, -83138, -128788, -80365, -60173, -165789, -88115, -13692, -66820, -98288, -27187, 34351, -2783, -47954, -175625, -195066, -285592, -347360, -271660, -142037, -81360, -12, 72165, -1934, -138684, -167855, -35503, -77664, -107362, -71731, -33294, -22675, 63375, 73527, 60819, 90896]
15411I0896M3038n660l3464K808j37334n7997o172l8492R772N0770J27708O5453
15399A11326m1323m5508n7774p7055o2826J0995K0797k6903O3862l2316Q5414
15388e1311J3654k2004n1712O4853O7058L0572P156n871O997N5026o115n2100
15376E6203o401L8116N7231N89o5386k3175m4980K4110j03861n9982N7064R7107
15364B6635j09638J7004k0671O3911J16097j24989j51143O2056k5941L0429m6114
15353a62364q0953N8758J51994M9490K0959P6392l992n7133p1122P9577Q9508
15342A51114n7343k14752k34427q3602R6398J15498J52578N1304L1747K7418j21299
15331h5366m3267N9452J36608J83476J660n4938m3064j51996j10609j6490n497
$$ y = [90896, 133934, 128274, 94810, 97618, -39716, -97713, -103885, -142377, -132605, -81835, 45873, 111326, 70003, 24495, -33279, -110334, -173160, -162165, -141368, -168271, -104409, -136725, -51311, -37657, -59661, -111373, -46520, 20538, 51110, 58266, 52395, 59392, 114418, 108303, 56203, 49802, 87918, 145149, 145738, 80352, 57177, 12197, 36307, -67554, -127536, -70472, 26635, -83003, -65999, -86670, -22759, 93338, -31651, -182794, -120738, -146679, -116250, -162364, -243317, -184559, -32565, 16925, 37884, 114276, 110284, 53151, -17971, 61606, 151114, 93771, -120981, -355408, -439010, -342612, -227114, -74536, -23232, 8515, 35933, -85366, -128633, -69181, 67427, 250903, 252563, 197625, 154561, 2565, -108044, -124534, -130031]
15320a30031M7240M5544K4909p202N888N9913N636O111R4506J02159j88212j74088
15308a07627M697L6101k6548M2092j2380o2621n1088O7765R2750k6052n7275J1737
15296h8449m7908q855j4993q2629L8623L0693P5355L0736K3944j7236K7015q8951
15284a22655Q2748O3780q5033j15563O3998J68410O319j50571N195R9045k8578
15273a2905j1310q1215m9136J2163J50747J8010p651N9652M1658k9862o9510j25209
15261a04568q6623N2408R3849L7140L2314l6294K1838M373p0874k27545l9238
15250c23220P0407J8659J25633P2397k3538J0504P0386J03141J11053o7814j76255
15239h647K050n9163l5555K7208J3737R555k8099k0013J7559Q9331j0807O3015
$$ y = [-130031, -82791, -37247, -12338, -19540, -13652, 46261, 51897, 58008, 152514, 254673, 66461, -107627, -102930, -66829, -93377, -51285, -63665, -126286, -177374, -109609, -16859, -42911, -100186, -88449, -136357, -145212, -160205, -242834, -204211, -173518, -98163, -67427, -43483, -60719, -33704, -122655, -39907, 23873, -61160, -176723, -112725, 55685, 62004, -88567, -83372, 15673, -12905, -24215, -105430, -154566, -142403, 8344, 26354, 18703, 78355, 120013, 90151, 20641, -104568, -191191, -138783, -44934, -7794, 24520, -11774, 10064, 14437, -56437, -283982, -323220, -252813, -234154, -108521, -36124, -59662, -49158, 21228, 124369, 235422, 167608, -8647, -6597, -65760, -101315, -74107, -60370, -50815, -78914, -98927, -81368, 7963, -2844, 60171]
15227F0171o087j35264j05746j7246J23764J32169J03629o7548m1813r622L7179
$$ y = [60171, 54084, -81180, -186926, -204172, -80408, 51761, 155390, 87842, 46029, 36407, 73586]
$$ [...]
##END NTUPLES=NMR SPECTRUM
##END=
