##TITLE=Analysis number 321595
Compound Code sb 00894
Project Code adrs
Chemist Name stores
##JCAMPDX= 6.0         $$ Bruker NMR JCAMP-DX V2.0
##DATA TYPE= NMR SPECTRUM
##DATA CLASS= NTUPLES
##ORIGIN= Bruker BioSpin GmbH
##OWNER= nmr
$$ XWIN-NMR		Version 3.5
$$ Thu Aug 17 12:25:27 2006 GMT Daylight Time (UT+1h)  MAYBRIDGE\nmr@NMR_250MHZ
##.OBSERVE FREQUENCY= 250.131544655141
##.OBSERVE NUCLEUS= ^1H
##.ACQUISITION MODE= SIMULTANEOUS (DQD)
##.ACQUISITION SCHEME= undefined
##.AVERAGES= 16
##.DIGITISER RES= 18
##SPECTROMETER/DATA SYSTEM= dpx250
##.PULSE SEQUENCE= zg30
##.SOLVENT NAME= CDCl3
##.SHIFT REFERENCE= (INTERNAL, CDCl3, 0, 16.522)
##AUDIT TRAIL= $$ (NUMBER, WHEN, WHO, WHERE, WHAT)
$$ ##TITLE= Audit trail, XWIN-NMR		Version 3.5
$$ ##JCAMPDX= 5.01
$$ ##ORIGIN= Bruker BioSpin GmbH
$$ ##OWNER= nmr
$$ C:\u/data/dgb/nmr/ADRS/1120/pdata/1/auditp.txt
$$ ##AUDIT TRAIL=  $$ (NUMBER, WHEN, WHO, WHERE, WHAT)
(   1,<2006-08-17 12:25:00.60 +100>,<MAYBRIDGE\nmr>,<NMR_250MHZ>,
      <created by zg, POWCHK disabled, PULCHK disabled
       configuration hash MD5:
       E2 DF 36 D8 04 B2 41 60 5A D7 A3 38 5A 4B D0 FE
       data hash MD5: 64K
       CB 60 1E C2 74 9D 04 C9 9D 13 7F EF 57 AD EF 7B>)
(   2,<2006-08-17 12:25:16.51 +100>,<MAYBRIDGE\nmr>,<NMR_250MHZ>,
      <Start of raw data processing
       ef LB = 0.3 FT_mod = 6 PKNL = 1 SI = 32K 
       data hash MD5: 32K
       85 B5 B5 35 7A D6 5F 7F BA 1F 78 F4 DB 51 9B 6D>)
(   3,<2006-08-17 12:25:19.10 +100>,<MAYBRIDGE\nmr>,<NMR_250MHZ>,
      <apk 
       data hash MD5: 32K
       FF F8 07 62 DD 6B FF 47 78 DD 1D 62 0A 35 D1 B7>)
(   4,<2006-08-17 12:25:19.96 +100>,<MAYBRIDGE\nmr>,<NMR_250MHZ>,
      <abs ABSG = 5 
       data hash MD5: 32K
       30 69 08 D0 C1 9D 9B FE 40 DC 99 00 D1 6D 3C 55>)
$$ ##END=
$$ 
$$ hash MD5
$$ E8 59 D8 65 C1 A2 93 91 E1 40 46 EA AE 06 26 D0
##$RELAX= 
##$RELAX= 
##$RELAX= 
##$RELAX= 
##$RELAX= 
##$RELAX= 
##$RELAX= 
$$ Bruker specific parameters
$$ --------------------------
##$DU= <C:\u>
##$EXPNO= 1120
##$NAME= <ADRS>
##$PROCNO= 1
##$TYPE= <nmr>
##$USER= <dgb>
##$AMP= (0..31)
100 100 100 100 100 100 100 100 100 100 100 100 100 100 100 100 100 100 
100 100 100 100 100 100 100 100 100 100 100 100 100 100 
##$AQSEQ= 0
##$AQ_mod= 3
##$AUNM= <au_zg>
##$AUTOPOS= <28 >
##$BF1= 250.13
##$BF2= 250.13
##$BF3= 250.13
##$BF4= 250.13
##$BF5= 500.13
##$BF6= 500.13
##$BF7= 500.13
##$BF8= 500.13
##$BYTORDA= 1
##$CFDGTYP= 0
##$CFRGTYP= 5
##$CHEMSTR= <none>
##$CNST= (0..31)
1 1 145 1 1 1 1 1 1 1 1 1 1 1 1 1 1 1 1 1 1 1 1 1 1 1 1 1 1 1 1 1 
##$CPDPRG= <>
##$CPDPRG1= <>
##$CPDPRG2= <>
##$CPDPRG3= <>
##$CPDPRG4= <mlev>
##$CPDPRG5= <mlev>
##$CPDPRG6= <mlev>
##$CPDPRG7= <mlev>
##$CPDPRG8= <mlev>
##$CPDPRGB= <>
##$CPDPRGT= <>
##$D= (0..31)
0 1 0 0 0 0 0 0 0 0.06 0 0 0 0 0 0 0.0002 0 0 0 0 0 0 0 0 0 0 0 0 0 0 
0 
##$DATE= 1155813898
##$DBL= (0..7)
120 120 120 120 120 120 120 120 
##$DBP= (0..7)
150 150 150 150 150 150 150 150 
##$DBP07= 0
##$DBPNAM0= <>
##$DBPNAM1= <>
##$DBPNAM2= <>
$$ [...]
##$SUBNAM7= <"">
##$SUBNAM8= <"">
##$SUBNAM9= <"">
##$SW= 20.6930455092707
##$SWIBOX= (0..15)
0 0 3 0 0 0 0 0 0 0 0 0 0 0 0 0 
##$SW_h= 5175.983436853
##$TD= 65536
##$TD0= 1
##$TE= 296.16
##$TE2= 300
##$TE3= 300
##$TEG= 300
##$TL= (0..7)
0 120 120 120 120 120 120 120 
##$TP= (0..7)
150 150 150 150 150 150 150 150 
##$TP07= 0
##$TPNAME0= <>
##$TPNAME1= <>
##$TPNAME2= <>
##$TPNAME3= <>
##$TPNAME4= <>
##$TPNAME5= <>
##$TPNAME6= <>
##$TPNAME7= <>
##$TPOAL= (0..7)
0.5 0.5 0.5 0.5 0.5 0.5 0.5 0.5 
##$TPOFFS= (0..7)
0 0 0 0 0 0 0 0 
##$TUNHIN= 0
##$TUNHOUT= 0
##$TUNXOUT= 0
##$USERA1= <user>
##$USERA2= <user>
##$USERA3= <user>
##$USERA4= <user>
##$USERA5= <user>
##$V9= 5
##$VALIST= <valist>
##$VCLIST= <CCCCCCCCCCCCCCC>
##$VD= 0
##$VDLIST= <DDDDDDDDDDDDDDD>
##$VPLIST= <PPPPPPPPPPPPPPP>
##$VTLIST= <TTTTTTTTTTTTTTT>
##$WBST= 1024
##$WBSW= 4
##$XGAIN= (0..3)
0 0 0 0 
##$XL= 0
##$YL= 0
##$YMAX_a= 580425
##$YMIN_a= -529165
##$ZGOPTNS= <>
##$ZL1= 120
##$ZL2= 120
##$ZL3= 120
##$ZL4= 120
##$ABSF1= 16.522
##$ABSF2= -4.171173
##$ABSG= 5
##$ABSL= 3
##$ALPHA= 0
##$AQORDER= 0
##$ASSFAC= 0
##$ASSFACI= 0
##$ASSFACX= 0
##$ASSWID= 0
##$AUNMP= <proc_1d>
##$AZFE= 0.1
##$AZFW= 0.1
##$BCFW= 0
##$BC_mod= 0
##$BYTORDP= 0
##$COROFFS= 0
##$CY= 12.5
##$DATMOD= 1
##$DC= 0
##$DFILT= <>
##$DTYPP= 0
##$F1P= 14.0000005364418
##$F2P= -0.99999901652339
##$FCOR= 0.5
##$FTSIZE= 32768
##$FT_mod= 6
##$GAMMA= 0
##$GB= 0
##$INTBC= 1
##$INTSCL= 1
##$ISEN= 128
##$LB= 0.3
##$LEV0= 0
##$LPBIN= 0
##$MAXI= 10000
##$MC2= 0
##$MEAN= 0
##$ME_mod= 0
##$MI= 0
##$NCOEF= 0
##$NC_proc= -2
##$NLEV= 6
##$NOISF1= 0
##$NOISF2= 0
##$NSP= 0
##$NTH_PI= 0
##$NZP= 0
##$OFFSET= 16.522
##$PC= 1
##$PHC0= -4.237998
##$PHC1= 3.019333
##$PH_mod= 1
##$PKNL= yes
##$PPARMOD= 0
##$PSCAL= 4
##$PSIGN= 0
##$REVERSE= no
##$SF= 250.13
##$SI= 32768
##$SIGF1= 0
##$SIGF2= 0
##$SINO= 400
##$SIOLD= 32768
##$SREGLST= <1H.CDCl3>
##$SSB= 0
##$STSI= 32768
##$STSR= 0
##$SW_p= 5175.98343685301
##$SYMM= 0
##$S_DEV= 0
##$TDeff= 65536
##$TDoff= 0
##$TI= <Analysis number 999999
Compound Code 99
Book Reference 9
Project Code 9>
##$TILT= no
##$TM1= 0
##$TM2= 0
##$TOPLEV= 0
##$USERP1= <user>
##$USERP2= <user>
##$USERP3= <user>
##$USERP4= <user>
##$USERP5= <user>
##$WDW= 1
##$XDIM= 32768
##$YMAX_p= 326789854
##$YMIN_p= -11589
$$ End of Bruker specific parameters
$$ ---------------------------------
##NTUPLES= NMR SPECTRUM
##VAR_NAME=  FREQUENCY,     SPECTRUM/REAL,   SPECTRUM/IMAG
##SYMBOL=    X,             R,               I
##VAR_TYPE=  INDEPENDENT,   DEPENDENT,       DEPENDENT
##VAR_FORM=  AFFN,          ASDF,            ASDF
##VAR_DIM=   32768,         32768,           32768
##UNITS=     HZ,            ARBITRARY UNITS, ARBITRARY UNITS
##FACTOR=    0.157963299565203, 1,           1
##FIRST=     4132.6476996994, 0,             0
##LAST=      -1043.33573715361, 0,           0
##MIN=       -1043.33573715361, -11589,      0
##MAX=       4132.6476996994, 326789854,     0
$$ Real data points
##PAGE= N=1
##DATA TABLE= (X++(R..R)), XYDATA
$$ [...]
19320b17J908N25k207j955J564J913j4k148M6R75P4m87m96l215M95K279l92k58
19302a610J678K39o16N84j13j666n50m58K08J952m47j307k192m7K601N22k50J012
19284d60N82k43l013K68Q64J264m22P34J330j619j879j100J790K826M10j866P48
19267B14j440k125j037L84q39M7P87J128P16J487K05j682P54J201J705l46k9K13
19249A343m02k205n37k13J8n61P45O23L51J837M38K36k472k591k56L15l09K89
19231c351J189J730L299p20n78j301j048r87K452J948j360k431k462K15K417P37
19215b51M3j905O25K975j363j118j528K42J952m90j825l703k897K034K446J212
19199c551n33o48Ln93M55K875K190K98r70k298m004p9J456j02R31L659L417j453
$$ y = [-217, 1691, 2216, 9, -1946, -382, 1531, 1517, -631, -585, 390, 464, -23, -519, -3734, -3239, -960, -1352, -1610, 68, 307, -309, 275, 162, -1504, -2054, -2512, -2304, -352, -799, -2106, -4298, -4345, -1744, -1222, -1472, -460, 122, -121, -3134, -2866, -2002, -738, -1160, -426, 904, -715, -2594, -3694, -1904, 922, 1332, -534, 214, -1226, -3351, -4388, -4004, -4843, -4796, -4009, -2881, -2165, -678, -473, -2155, -1401, -200, 1505, 1159, 1130, 1343, 941, -1264, -1801, -2014, -1996, -2557, -1812, -1189, -838, 999, 1437, 1673, -799, -3390, -3646, -3331, -3640, -3351, -2162, -432, 2867, 2147, 1569, 268, -780, -1767, 685, 2633, 1273, -1158, -3620, -3405, -988, -251, -208, -2113, -1488, 1487, 124, -994, -2522, -2280, -328, -818, -2643, -6346, -9243, -7209, -4763, -3551, -4084, -4732, -4729, -5322, -4867, -1992, 198, 496, -474, -2772, -6776, -6855, -5399, -5501, -4570, -911, 2506, 1053]
19181A053l369k368n87j372k26n4L517P13P72j644j286J648O27J750K133r52k102
19164a747j435Q33K51j32j469J11K698k90Q98J793J771R18k106k469P63j638M50
19147h00J703L01K77r82j549j610J228K275K419j689l346J460r96j851M11r5o05
19130c449LJ871j298j061Q26K160k88j534j913j560n96K22J013J779M834K11l279
19113b059k933j161L692m39j088j259J147o63j82J348L556P52k65j984k730j096
19097e364KM29J515J898J430n90j135r36J276J203p71k109j312J538M170J430
19081B674k998k93K21j192N75J426j028J205j380k129l20Q32J79k39J139o13j181
19064c122J416J555O6K831J304k083k166k437j549P20p35J015J805L4O91o53j046
$$ y = [1053, -2316, -4684, -5271, -6643, -6869, -6923, -3406, -2693, -1921, -3565, -4851, -3203, -2576, -826, 1307, 355, -1747, -3182, -2349, -2098, -2230, -3699, -3588, -890, -1180, -282, 1511, 3282, 4200, 2094, -375, 388, -1250, -800, 903, 1204, 1481, 499, -1050, -2660, -1432, 843, 3262, 1573, -1773, -313, -1309, -3160, -2749, -2844, -3449, -3446, -1575, -2873, -3934, -3108, -948, -1236, -2770, -4683, -6243, -6839, -6617, -5604, -3825, 1009, 1220, -2059, -4992, -6153, -2461, -2900, -3988, -5247, -4100, -4763, -4945, -3597, -41, 711, 446, -1538, -4268, -5364, -5362, -4933, -3418, -1520, -90, -680, -1815, -2751, -1475, -272, -1043, -3152, -4464, -2926, 1244, 2674, -324, -617, -396, -1588, -1013, 413, -615, 590, -790, -2919, -3239, -2407, -2228, -2467, -1328, -1941, -3122, -1706, -151, -85, 2746, 4050, 1967, -199, -2636, -4185, -3465, -4200, -3185, -1380, -1346, -655, -1308, -2354]
19047b354J001r52O88N46J94j086J327K510j869n32R20j658J28K735J677r78P52
19030C049J04j703j457j362j077K51j03k24k094m86L097O35k48J320k07o89p40
19013a934M29L03J18J262n39j57n38M16j608l19J442l6n07k180j942Q34J286Q3
18995c587m6J871L65N07k21K38l97j247P56J568k74r0K132J559k321k30J186O90
18977B459O92q86j06j593m84j633j255k2P23O99k189lO00N87m92j339j225J520
18959c947J434M19O44J750j706j795J391q20p1J100N59K336O4l299q47L18K677
18942B07P35o96Q69n24j852Q22o09k625k445K265J619J08K018R41k377J707J576
18925A739l59k528k272J325N34o34M29N30R94K041N36k300j016n15k146j951q57
$$ y = [-2354, -1353, -2305, -1617, -1071, -877, -1963, -636, 1874, 5, -527, 393, -1265, -1137, 1598, 3275, 2297, 3049, 3153, 1450, -7, -1369, -2446, -2195, -2298, -2522, -4616, -5102, -2005, -1370, -1618, -298, -505, -1194, -1934, -1505, -1202, -1084, 178, -361, -518, -1056, -640, -2248, -2567, -1125, -1161, -1668, -3848, -5790, -4956, -3670, -3587, -3633, -1762, -1397, -890, -1111, -873, -1270, -2517, -1761, -193, -467, -557, 1575, 3134, 813, 583, 1769, 2459, 3151, 2265, 2159, 566, 82, -1551, -2806, -2828, -2105, -1406, -3595, -3598, -2998, -2411, -2903, -4242, -5467, -3947, -2513, -2094, -1450, 300, -1406, -3201, -1810, -2630, -2701, -1601, -1042, 1294, 1358, -1941, -2788, -2470, 207, 942, 246, 1115, 591, -1261, -439, -1048, -3673, -6118, -3853, -2234, -2126, -108, 833, -1544, 163, 1739, 1380, -1148, -3420, -2095, -1561, -2195, -1766, -1236, -242, 1799, 2335, 35, -981, -1496, -3642, -5593, -6450]
18908f450J260K069Q50J859J185J500J361K24j924j280j038o77J838m2j41r97
18892d03P61j811q51L05o65j739K200L307J117k252M19K715J458K50j414k418
18876I79p74K406J91j404l5j374J019J894l30k158p3p81J97Q03J755O1j377k162
18858a163k78q75n5J914P76n41J625m50p5q46j78j948j68n39J75j13j415j691
18840e845O67K42k64rn44J625J795J46QJ440L267k421l551k098K537J837L088
18823A920P19j240p88m55j590R40R58j206m91k52j444L11J023j254k094K023L318
18806C98P20k090k319k623O93M232J115j615j603L44J445L25L9k321k241J216
18790d285K048j80j28j064J364R91j24n9K080q6L26K218j771j776p66K90j28k674
$$ y = [-6450, -5190, -3121, -2271, -412, 773, 2273, 3634, 3858, 1934, 654, -384, -1061, 777, 735, 594, -403, 358, -1453, -2304, -1999, -2664, -4403, -2203, 1104, 2221, -31, 388, 3103, 4561, 4811, 3397, 979, 205, 2611, 2802, 1398, 1363, -11, 1008, 2902, 2572, 414, 341, -440, -243, 560, 2315, 2376, 999, -1163, -1441, -2316, -2371, -457, 319, -222, 1403, 953, 878, 32, -146, -2094, -2262, -2801, -2626, -2739, -4154, -5845, -5178, -4936, -5200, -5209, -5753, -4128, -2333, -2187, -2179, -739, 2528, 107, -3444, -5542, -3005, -1168, 1920, 2639, 1399, 611, 156, -1434, -494, 464, -742, -1233, -1485, -2929, -2618, -1595, -2849, -4943, -2920, 398, 1118, -972, -3291, -5914, -5221, -989, 126, -1489, -3092, -2748, -1303, -978, -939, -3260, -5501, -4285, -2237, -2417, -2545, -3609, -2245, -1254, -1378, -1437, 643, 557, 883, 3101, 1330, -446, -1212, -922, -1050, -3724]
18772c724r38K631M457L477Q80o22J69O706O628J666j681p245n073m108q39R65
18756C349k87k191r05n8k89J362j074o98j03L568K284K6j095k895k966m19P24
18739a667p71J312q62J702L894J51j638j635j41L754J977l812k979j448L7L109
18723I83Q81j076J62k712o28J271j045R82J836J787m436l124k3K573M726P74q15
18706B116n04O47l51j1K66o5j984J860j032j483j784j513n41J538M83J607J184
18689D33M22O4j452r51J056r83J098j560p75P88n42J971J59j370N11R95l209l68
18671c713P94Q37L458J137k241l9m02K97L27j28p7l717r82q05J186K854j447q60
18653c521m7n11j86J615J271L93j113J35p93j882J479K032J192l79j226J98l87
$$ y = [-3724, -4662, -2031, 2426, 5903, 6783, 6161, 6330, 13036, 19664, 21330, 19649, 12404, 7331, 3223, 2384, 3349, 3062, 871, -34, -92, -381, 981, -93, -791, -894, 2674, 4958, 4984, 3889, 994, -1972, -2391, -1667, -2438, -1126, -1988, -286, 3608, 3759, 2121, 486, 345, 4099, 6076, 2264, -715, -2163, -2126, 983, 1864, 788, 950, -1762, -2390, -1119, -2164, -1182, 654, 2441, -1995, -5119, -5142, -2569, 2157, 2931, 2116, 1612, 2259, 1908, 1897, 2163, 2098, 114, 1974, 942, -541, -2325, -3838, -4379, -2841, -2358, -751, 433, 855, 919, -533, -1484, -428, -1411, -313, -1873, -2648, -1860, -2402, -431, -272, -1642, -1131, -136, -3345, -3713, -2919, -2082, 1376, 2513, 272, 233, -169, 128, 455, 327, 250, -3467, -4449, -5254, -4068, -1214, -2661, -3521, -3568, -4079, -4265, -2650, -1379, -986, -2099, -1964, -2757, -4639, -3160, -1128, 64, -315, -1541, -1343, -1730]
18636a730K525p51n33J476L2K533q66j867k216L48m15O77l90K122J233k620M07
18619c5J98J095Q42J745J076m85j827q84l512r01J711K251K013l18Q03J48p23
18602C197k435K93J418J728k881o76l153p31J434K487kk762j266Q95J255J336
18586A37o61P54J377k638q22p63n92k895K635Q42j572j890j841K01L185J959p28
18569c312J34J736J091J204j747n63r51j639P48L489m19k228k400j537j739J864
18553f269J317R94p07L47j930r7K073Q96j956o18J065M66J217M89J842K128m33
18536H24n03r13k477J045q26j322p86J036J239J308n90K69j531O98J017l47r43
18519b802k71K67j349L67J62J25r53K58N07J928j215q63J291Q00j387J255o20
$$ y = [-1730, 795, 44, -489, 987, 1019, 3552, 2686, 819, -1397, -1049, -1464, -787, -1177, 945, 2178, -442, -35, 163, 1258, 2100, 3845, 4921, 4436, 2609, 1725, -1787, -2688, -977, 1274, 3287, 2969, 3772, 3920, 3197, 762, 1055, 2473, 4201, 1320, 644, -2509, -3240, -1806, 681, 679, -2083, -3349, -2454, -1199, 137, -524, 230, 1607, -1031, -1853, -2616, -3208, -6103, -3468, -2626, -4198, -6088, -7929, -7728, -4543, -2584, -3312, -3178, -1442, -351, 853, -894, -1457, -2408, -4047, -3299, 190, -229, -2457, -4857, -6394, -8133, -6269, -4952, -3958, -4665, -4318, -6248, -6345, -4272, -3376, -5332, -5950, -4885, -4419, -3202, -2713, -871, 1257, 824, 321, -592, -3069, -2024, -2850, -4172, -4958, -3922, -2683, -1375, -1965, -1696, -3227, -2529, -1512, -1859, -2802, -3073, -2806, -4155, -3788, -3626, -3501, -4454, -4196, -3689, -1761, -2976, -3839, -2548, -1748, -3135, -1880, -2500]
18502b500m47o39K32Q97M94M81j198K41Q15J250l268j897J345J485j107R2Kr32
18484d654J416O15q47J443o38q74Q99K143Q31L67K79p54J566J897K9k657j872
18467h11J128J891k437r30M08K76m54m36j440l261J423L014J310m08k055l02K94
18450b790L384l32Jj470j394j689M10J230k033n61l05J223J866j041j555R94K720
18433a342J648j316k846m89j393k413O29K468K169K432K87q78j873k330q34L05
18417e776J26O20K370J362l70K10k22J923J260p93m752o44Rp46l413M26M524K156
18399a730m65J089o5r39J002o7m90n19j576k84p53k401o96O64M904M34k531R60
18381c463L435J319o43N87R51k541l405l8M43J376P96j752j631j276J04K320J950
$$ y = [-2500, -2947, -3586, -3354, -2457, -1963, -1482, -2680, -2439, -1624, -374, -3642, -5539, -4194, -2709, -3816, -3724, -3722, -4654, -3238, -2623, -3470, -2027, -2665, -3539, -2640, -497, 334, 701, 980, 226, 1792, 3689, 3718, 1061, -811, 317, 2208, -229, -1159, -751, -475, -929, -1365, -2805, -6066, -4643, -1629, -319, -727, -2782, -3084, -2790, 594, 262, 263, -1207, -2601, -4290, -3880, -2650, -4683, -5244, -5549, -4326, -2460, -3501, -5056, -4062, -1342, 306, -1010, -3856, -4345, -5738, -8151, -7522, -5054, -2885, -453, -166, -1044, -2917, -5247, -6081, -5776, -5650, -5030, -2660, -1298, -1668, -1458, -1680, 243, 1503, 710, -4042, -4686, -4677, -5423, -8836, -8410, -3886, -1730, -2195, -1106, -1171, -2110, -1108, -1175, -1665, -2184, -3760, -4044, -4797, -7198, -7894, -7230, -2326, -1892, -4423, -3463, -28, 1291, 648, 1235, 2186, -355, -3760, -3798, -3355, -1979, -1183, -2935, -4566, -5842, -5738, -3418, -1468]
18364a468K035q67k286j083j066J891L427m96r41j028j361N03J810j486R57J776
18348C17O04j876j074p37n53r55J90m95J387j374j126Q41J225L474J920N55O68
18331B991k401k035J216j417m180Q21L201R98N6M48J21J056n59j442j631J364
18315a393J219j460j590j655M09K195P29p61k73j10k66O6K217N7r40m96J561R4
18297c97j821q73L631J979m86K5k588N60j08n95j042j870j946J670m60J341J668
18280a312K205k214l115P68J744j270k483j1J015J532R74J730Q71M45k166k358
18264c645r70L12j210Q09J660j836m1Q01L90K832K148J345J541Qk083o88k057
18247f84j095N16Q59o03r99K770k22j290j504L087P45j7j382j307j635J669J827
$$ y = [-1468, 567, -300, -2586, -3669, -4735, -2844, 583, 87, -854, -1882, -3243, -2740, -930, -2416, -1459, 317, 921, -955, -2029, -2766, -3319, -4274, -4084, -4579, -3192, -4566, -5692, -4851, -3626, -152, 1768, 2323, 2991, 590, -1445, -229, -1646, -5826, -5005, -1804, -806, -750, -302, -181, 875, 316, -1126, -2757, -1393, -174, -1634, -3224, -4879, -4470, -2275, -1546, -2307, -2580, -2690, -2956, -2890, -673, -616, -1556, -2052, -491, -397, -2218, -3091, 540, 2519, 2033, 2058, -530, 30, -78, -673, -1715, -3585, -5531, -3861, -4321, -2980, -1312, 893, -1321, -4436, -3668, -1924, -3194, -5677, -5688, -4673, -3141, -2167, -437, 434, 879, -1287, -3645, -4615, -4303, -5513, -4704, -3044, -4880, -4921, -4120, -3730, -898, 1250, 2595, 4136, 4144, 2061, 1373, -684, -1779, -1263, -404, -1007, -2006, 764, 542, -748, -2252, 835, 1580, 1563, 181, -1126, -2761, -1092, 735]
18230G35J383j938o85N02J021j597K8K77l30o35J202J210k96r24K0K396N47q14
18212B102L46M75q18R98m2J595J997j01l782k717N41r34o0J539L38n6Q27L60j187
18193A421l952N1J485q35P40p56J092J309j882k055O91P91L28j141q91J861K690
18176I47K726j408l16J4j626k064j813J726J572j007n6j107k34o9J569K026j536
18159f56k270J245J398J786P02J252K02k18r38m28j898j767n4O05L732l91k348
18142d6L04O60j601P34J565j15k195L97K526K468K706J260L77J179L331J457J734
18125A6741P56p80K576P81K021N219Q475R867J0799Q142R211J2538J6377K0909
18111A23632L0704M5100P2016J21085K26030M49066O83690O11131N13614J23440
$$ y = [735, 2118, 180, -505, -3, 1018, -579, -551, -274, -604, -1239, -37, 1173, 877, -47, -27, 2369, 2916, 2102, 2448, 2923, 2105, 3103, 3061, 4656, 6653, 6552, 2770, 53, 594, -340, -400, 1139, 1477, 1421, 2248, 2608, 1421, -2531, -2480, -995, -1830, -1090, -1846, -754, 555, -1327, -3382, -2691, -1900, -1572, -2713, -3604, -1743, 947, 3673, 2265, 1949, 1963, 337, -1727, -3540, -1814, -242, -1249, -1305, -2412, -2646, -2715, -1146, 880, -656, -2926, -1681, -283, 1503, 2205, 3457, 3659, 3441, 2503, 2075, 177, -1590, -1644, -1039, 2693, 2302, -46, 258, 918, -683, 51, 1616, 1501, -694, -297, 2229, 4697, 7403, 8663, 9040, 10219, 13550, 15007, 16741, 17497, 16717, 19293, 20074, 22095, 27314, 35789, 45656, 56455, 64597, 73808, 86346, 102723, 123632, 154336, 199436, 271452, 392537, 618567, 1067633, 1751323, 2362454, 2876068, 2999508]
18101B999508q72531q39261m21751k03537j05442o7009o0030n7781m9584l7600
18091B84982k8223k1191j9069j8955j3360j0138o936n695r438j0325r783o997
18079A24872m282k005l226m540l356m012m840j731l387k056k853o808m118m012
18065G3646k729j619j667j788j97j223j882m683l34k617n5J466Q02m236m593n947
18049D2344k868J039J713J056O7j622m433l610j132j749Q68m31m676r55k90J235
18033B6556P18j455K92K80Q22l430l320N9O65J221p26j632m42R66l47k6j918j913
18015A6370J229P00j947l7j773j483J259r46J76k146j775n52J726R64k614r57
17999H194K14j71J975J130j238l75O02N18j830j140J231J052R28o52k906K155
$$ y = [2999508, 2126977, 1287716, 865965, 662428, 556986, 489977, 429947, 372166, 322582, 284982, 256759, 235568, 216499, 197544, 184184, 174046, 167110, 161415, 151977, 141652, 131869, 124872, 120590, 118585, 115359, 110819, 107463, 103451, 98611, 96880, 93493, 91437, 88584, 81776, 77658, 73646, 70917, 69298, 67631, 65843, 65646, 64423, 62541, 57858, 57524, 54907, 54852, 56318, 57120, 52884, 48291, 42344, 39476, 40515, 42228, 43284, 43351, 41729, 37296, 33686, 32554, 30805, 31673, 31242, 26566, 25611, 25321, 26556, 27274, 25819, 26111, 26391, 27213, 23783, 20463, 20522, 21187, 22408, 21682, 20050, 19608, 20574, 20227, 20201, 18283, 16370, 17599, 18299, 16352, 16315, 14542, 13059, 14318, 13372, 13548, 11402, 9627, 9075, 10801, 11765, 9151, 8194, 8408, 8237, 10212, 11342, 10104, 9729, 10331, 10849, 9019, 7879, 9110, 10162, 11090, 10438, 7532, 9687]
17983I687L12j342l011R86K747j075n6L80o73l718R53r14k085n86P61J73K232
17966D771l92k548o19j64K028Q52m323k331J74Q9L98K050QL017k465J09J587j99
17948B042j08m54j391r55p27j450P5M47r67k570j810J441N93J193J365J55K57
17931b864J314J488j461j144K602k5m70Q37k012J403J57Q58M61Q0L84j756o08
17914g56J101m34l22k143k325k13J698J535j433n35j959l040Q96K308L540j033
17898c115m97J515J054K549j170k119q3Q40M00k158N08L745N19j903p42m78o92
17881a827P2j361P50N53j266J089L07k34j921J437K37k96r64O30K917L68j475
17864i84k12j180j1K020j458R88l70k908k717L960K446k606j657N38K565J535
$$ y = [9687, 9999, 8657, 5646, 6632, 9379, 8304, 8248, 8628, 7955, 4237, 5190, 4276, 2191, 1605, 2366, 2539, 4771, 4379, 1831, 1212, 1048, 3076, 3928, -395, -2726, -2552, -2463, -2065, -15, -7, 3010, 545, 654, 2241, 2042, 1934, 1480, 89, -866, -1593, -3043, -2968, -2521, -3488, -6058, -7868, -6427, -5834, -4641, -3276, -3121, -2864, -1550, -62, -1523, -2667, -65, -90, -560, 277, -1735, -332, -175, 683, 1144, 1224, 1608, -148, -756, 345, -89, -411, -2554, -4879, -5092, -3394, -1859, -3292, -3827, -5786, -8826, -7930, -5622, -2082, -3115, -3612, -2097, -1043, 1506, 336, -1783, -1866, -1026, -626, -2784, -2276, 1469, 1988, 85, -657, -1135, -1827, -1755, -3116, -2366, -1813, -3079, -1990, -1683, -1917, -3838, -2401, -2164, -2460, -3424, -2794, 123, 491, -984, -1196, -2376, -2387, -367, -1825, -837, -1207, -4115, -6832, -2872, -426, -3032, -4689, -4151, -1586, -51]
17848e1j504o84Q9M19J582N03L00j518j074J813j687o10M94L022l68k205P28m81
17830a232j77P29j817j182j479K75j83L35J534K52k501j699n93Q6Q54K99O61q50
17812f688J10O86K671L606J556m59k424l373L6O6J304j719O48O28l89K664J187
17795A10J116l17p18k801n34J844K028r69k567k088P03J271J924Q38k513l49J871
17778a151q81m47k090J666O69L028P31j792j088l55p3p08o90l000l86K878J90
17761c499q59n09L32j759o91L90K96K306K166j139n65r6Q96P16N57J307k046k565
17743d762o71j744K119M569J442l533r1j648l340j77j353R70K928Q63p38J175
17727c991j313n7K703O38k17Q8j750n63L9K11j068J409n82L40K7R05n52Q80J51
$$ y = [-51, -1555, -2239, -2150, -1731, -149, 354, 654, -864, -1938, -125, -1812, -2422, -1928, 1094, 726, -1479, -751, -1232, -1409, -680, -2497, -3679, -5158, -4883, -5066, -4731, -3197, -2945, -5446, -7145, -7738, -7652, -6798, -6499, -5838, -6688, -6578, -5892, -3221, 385, 1941, 1482, -942, -4315, -4279, -4213, -2909, -4628, -3980, -3352, -3741, -1077, 110, 1226, 909, 191, -2610, -3144, -1300, 728, -241, -2808, -4896, -4193, -2922, -998, -160, -2673, -3022, -1151, -2032, -2479, -4569, -2903, -2234, 794, 1525, -267, -1355, -1710, -1783, -2491, -3181, -6181, -6567, -3689, -3499, -4358, -4867, -4535, -6294, -6985, -6595, -6299, -3993, -1827, -2966, -3531, -3627, -2731, -2015, -1458, -151, -2197, -4762, -5433, -7177, -5058, -489, 953, -2580, -2671, -4319, -7659, -7836, -9189, -8219, -5291, -4428, -5166, -3991, -5304, -5361, -2658, -2020, -2237, -2149, -3899, -4462, -4423, -4212, -5280, -3871, -4453, -4113, -4086, -3181, -3733, -2853, -2702]
17708b702k095m24O18J569L31j237j95O8q95K63R04J902o26k071k225j774J081
17691g508M821J526j747P9j378o82L38k175J765K398K515K50r02m124j5K790K773
17674G24Q34K177j417k187o43j314k388r26R29n09R10L084J193L58r54l154m37
17657c720j220Q8O68J418k128q47K272K101k33j425k287p92K809J435R13J266
17641C18j966j295J110k43k146j364N52M72L07j523M00j007kO13J60J396M52K196
17623a570n49k84j646j058k661P45j03j028J353R2j60R90L35J995J548L16N60
17606a125o94j941j969j265j694j016J101K282J402k230k76L115R98l27J527j254
17590c366j987Q04J05N80p95L01L244J092k64Q14j66k703j94J568l803p32J79
$$ y = [-2702, -4797, -5221, -4603, -3034, -2703, -3940, -4135, -4067, -4962, -4699, -3795, -1893, -2519, -4590, -6815, -8589, -7508, -2687, -1161, -2908, -2829, -4207, -4889, -4551, -6726, -4961, -2563, -48, 202, -700, -4824, -4839, -2049, 724, 1558, 3735, 2318, 131, -512, -1826, -4214, -5140, -4211, -4720, -3810, -726, 467, 825, -129, -3283, -3720, -4940, -4852, -4184, -2766, -4894, -5741, -3469, -1368, -1601, -3026, -5313, -6105, -3296, -1861, -948, 318, -1648, -2943, -1833, -2076, -4222, -5586, -5034, -4562, -4255, -5778, -5378, -6385, -6387, -5774, -5614, -4218, -3766, -1570, -2119, -2403, -4049, -5107, -7768, -7023, -7126, -8154, -6801, -6709, -6869, -5879, -5544, -3549, -2001, -1685, -1125, -1819, -3760, -5729, -6994, -8688, -9704, -8603, -6321, -4919, -7149, -7425, -4310, -3312, -3639, -2112, -3366, -5353, -4549, -4444, -3864, -4659, -4358, -1114, -22, -286, 528, 362, -2341, -2535, -967, -4770, -5502, -5323]
17573e323J975K200l82Q75L6J891k583j324l90l139j3K340k230J087j7J279K645
17556a073L62O47m324j845K70J875K136j086n56J790O82J340J971K830K228j499
17540E748L100M110J375O3l022j544j019l503j422p7j64k078j99o43j91J292q37
17523I89K91n85j227j788J867R84P9J66r96l187N2J271P68K25P18N07k734J58
17505b442J049M54L11j878l643j054k235l38J857J419J140O40K797P6O99O55p02
17488a195P92j555j243L70n6o79J969J623J337j340o41j231r38K812k41l42j083
17471a641j758O34m78L22L115k229k420J531K385q60j565m71J89j70p70P2P60
17454c354p68j212K389P69K05J273o16p20j804j114j516P42K109J850K228L95
$$ y = [-5323, -3348, -1148, -1530, -655, -619, 1272, -1311, -2635, -3025, -6164, -6177, -3837, -6067, -4980, -4997, -3718, -1073, -711, -64, -4388, -6233, -5963, -4088, -1952, -3038, -3594, -1804, -1122, 218, 2189, 5019, 7247, 5748, 8848, 12958, 14333, 14396, 11374, 9830, 8811, 5308, 3886, 3809, 3645, 1567, 1368, 725, 534, 1826, 989, 1280, 695, -532, -2320, -453, 531, 610, 776, -220, -3407, -3355, -2084, -1316, -1091, -373, 134, -2600, -2442, -1393, -939, -628, -2506, -6149, -7203, -9438, -9776, -7919, -6500, -5360, -4720, -1923, -1847, -1148, -493, -1195, -403, -1958, -3201, -2831, -2887, -3566, -1597, 26, 1363, 23, -618, -1849, -2787, 25, -216, -558, -1641, -3399, -2765, -3243, -2921, 194, -2035, -4455, -2924, -539, -1399, -2964, -3435, -3246, -3416, -4186, -4114, -3354, -4122, -5334, -2945, -2176, -1971, -698, -1314, -2034, -3838, -4952, -6468, -5726, -3617, -1767, 461, 856]
17438H56Q09K896M294M593O0k604n115k712k364j987j22J556Q30k443k141m05
17422c999j613k21K388J604j41k159p9r60j044K078K333q29j537r79K248J118
17406a792Q50l62q06J99o07j732R75Q93r62q46Q41k047j020L543J629N34j551
17389b261K217J238j201k213p32L52J939k313l635m95K212K196n46K011K00k148
17373c179O9J517Q95P14M09r36Q8p37j254j091j552n91n42j416k125J295L614
17356d822L626l72J289J565j460j384K38M56p29k563j370j173Q30J678L48n32
17340d375J059j631J140K49j618o2K484l38J136J568j936n005P20o10J339K843
17324c037M62r01J27M34J57q5j1L19j572r76P66N5M03p61j49O26j020K059K347
$$ y = [856, 1665, 4561, 8855, 13448, 13508, 10904, 5789, 3077, 713, -1274, -1396, 160, 990, -1453, -3594, -3999, -5612, -5833, -3445, -1841, -1982, -4141, -4220, -5180, -6224, -4146, -1813, -2642, -4179, -5158, -2910, -1792, -942, -1304, -2110, -1911, -2518, -4250, -3275, -2382, -3344, -4190, -3349, -5396, -6416, -2873, -1244, -710, -2261, -44, 1194, -7, -2220, -2952, -2600, -661, -2974, -6609, -7104, -4892, -2696, -3242, -1231, -1031, -3179, -3110, -1593, -698, 16, 425, -511, -423, -1160, -2414, -3505, -5057, -5648, -6190, -7606, -9731, -8436, -4822, -1196, -1568, -279, 1286, -174, -1558, -1320, -864, -1593, -4156, -5526, -6699, -5869, -4191, -3843, -4375, -3316, -4947, -3807, -3558, -5176, -5238, -2754, -3092, -1956, -388, -2324, -7329, -6609, -7219, -5880, -3037, -2575, -3476, -3349, -2915, -2758, -2843, -2854, -2535, -4107, -5083, -4317, -4262, -3859, -4620, -4769, -4143, -5163, -3104, -757]
17305g57j334k636j154M174J186n27j167j046r74K63p04J294J818j26K59R05l957
17288d483m88L17M9k24J7k487q42Q61N61J969N55o32J117O11o28J706j274k745
17270f040j169m84O52K662K999O17o59j085p71l88k890j00J98o33P18K566K166
17253a641j537j264k20O91l11j315k21K809N19j732q19L82m10j981M82K153J511
17236b904q52q26N8K98j9j403o81P53J860J085l76l60L37j163M48m56k109P74
17218e536K424P47n45n1j2p14k59M6K2j732M5K458J063Q06k34j927j822j528P37
17199f012k74K74m45l99j569L76J558J589P66J264R78J827l15o36j42r84N82L97
17181a165L43j497j711l291j388J162r11J641K222M26L32J996l47j255L36O94
$$ y = [-757, -2091, -4727, -5881, -1707, -521, -1048, -2215, -3261, -4235, -3972, -4676, -3382, -1564, -1690, -1431, -526, -4483, -4971, -4654, -4605, -4829, -4812, -7299, -8141, -7280, -6719, -4750, -4195, -4827, -3710, -3099, -3727, -2021, -3295, -6040, -7209, -7693, -7041, -4379, -1380, -763, -1422, -2507, -3278, -3666, -6556, -6656, -6458, -7091, -6373, -3807, -1641, -3178, -4442, -4662, -3971, -4282, -5597, -5818, -3009, -2490, -4222, -5041, -4659, -5069, -7050, -6568, -4415, -2904, -3756, -4582, -4524, -4226, -4245, -5648, -6329, -5576, -3716, -2631, -3007, -3367, -3030, -4193, -3745, -4201, -6310, -5536, -3112, -2365, -2910, -2961, -2973, -3687, -3946, -3900, -3878, -5610, -5565, -3107, -2044, -1238, -1472, -3399, -5221, -6749, -6012, -6286, -6012, -6457, -6856, -8425, -8049, -6491, -4902, -4136, -2872, -1894, -67, -382, -1018, -1160, -2144, -1562, -1165, -822, -2319, -4030, -7321, -8709, -7547, -8458, -6817, -4595, -4169, -3837, -1841, -2188, -3443, -3107, -2413]
17165b413j125j81m09J38q20k333O08J012J871J080J670k136K87j461j989J014
17149e187J596j329K531k223k906M33M820M430j108j789k33j336o1J87j197m20
17133c792O69j405o29O83j054M54J801M25K329q74j934L54p65p54K756K843M76
17116A583L65j286j85p47j471j326k266N91r7K09N20j555O87J218l431o65J465
17099f391K190j504l462P67J091r84J458K770l88j289p86j955q95Q65J066R02
17083f545K341k2M56j724k82J609J36q34k427R39Q80j020k281K593L69m10J807
17066d415J43K799oj088M24O03n05P23j148p04L3j741o41Q82j92O53K466J178
17048e36K38j088l345k043n41R6J941k52m76J121K67j363k793k478j64L384L656
$$ y = [-2413, -3538, -3719, -4128, -3990, -4810, -7143, -6535, -5523, -3652, -2572, -902, -3038, -2751, -4212, -6201, -5187, -3591, -4920, -2389, -4612, -7518, -7085, -2265, 2165, 1057, -732, -965, -2301, -2362, -2175, -3372, -3792, -3123, -4528, -5157, -4474, -5528, -5074, -3273, -2848, -519, -1393, -3327, -2973, -3738, -4492, -1736, 1107, 1583, 1948, 662, 477, -270, -1741, -3067, -5333, -4742, -4839, -4630, -4110, -5665, -4978, -3760, -7191, -7856, -6391, -4201, -5705, -9167, -8400, -7309, -8293, -6835, -4065, -4453, -5742, -6528, -8483, -9378, -8513, -7447, -6545, -4204, -4226, -3770, -5494, -5776, -4167, -4031, -4865, -7292, -6353, -5473, -6493, -8774, -6181, -5812, -6222, -4415, -4272, -1473, -1479, -2567, -2143, -1540, -2045, -1322, -2470, -3174, -3141, -4882, -5523, -4641, -4833, -4180, -1714, -536, -298, -1386, -4731, -6774, -7315, -7219, -5278, -5530, -6006, -4885, -4618, -5981, -8774, -11252, -11416, -8032, -4376]
17031d376N65k789R09J740K911K384k362k124j365O21j619J651J576k748k027
17016g053M39K432Q09K383O04k42o22l126l974j533K089K115Q64K230q19n48O9
16999c883R5J056l78J55J024N91r67j099l20k252m77J841j88J003r53L52K044
16982b356J160r38N00J20J262k68j039L82n59q65N16J837J927l52j423j986J412
16965f70K466j185l07J514O16Q09k674k513m31K020K220l63k082j644o37J114
16949a747n55N81J721Rj459o03k604n41j079P11Q45j102j268J533Q47j62j552
16932f425J321J802J718r41j287K669P90k444j156m92K218K024m08n87k26o98
16916b122Q8n13j644R59k35k69p47J258K140r83n18k67P31K388m32p43k302l622
$$ y = [-4376, -3811, -6600, -5691, -3951, -1040, 1344, -1018, -3142, -4507, -3886, -5505, -3854, -2278, -5026, -7053, -6614, -4182, -3373, -990, -386, -628, -1250, -4376, -8350, -9883, -7794, -5679, -4815, -2585, -3404, -3952, -3883, -3788, -2732, -3110, -2955, -1931, -1340, -2307, -3406, -3726, -5978, -6455, -4614, -4802, -3799, -4752, -4400, -2356, -1196, -2134, -1634, -1514, -252, -520, -1559, -1177, -1736, -2601, -2085, -248, 1679, 1327, -96, -2082, -670, 1796, 611, 304, 1818, 2434, 3243, 569, -1944, -2375, -355, 1865, 1502, -580, -2224, -2861, -1747, -2302, -1721, 0, 9, -1450, -2053, -4657, -5198, -6277, -5566, -4721, -5823, -7091, -5558, -4711, -4873, -6425, -5104, -3302, -1584, -2525, -3812, -1143, -353, -2797, -3953, -4445, -2227, -203, -611, -1198, -1424, -2122, -2034, -2547, -4191, -3232, -3467, -3736, -4483, -3225, -1085, -2068, -2586, -2853, -2122, 266, -166, -909, -3211, -6833]
16898f833j001K188J923K715J008k70j963n31j656n04N20K257K276j462k738j678
16882e749o9R38j071m929p09K539K779J915k14J586J444k530j630J646K575J893
16866D14r44k619Q3o13k389L57q44K528k16O99m33j516%l59q72J570N10j888M22
16847f110J66M74L063O35K62k532r76P51K15l08J226K386N43k866k03M15K659
16830b00j447k271j647K684J999l93o82q98J057k74J127jj749k60K480p8n74j664
16812b791j392K098r5n79k05j77J239J203J48j401j621j739K97k52o60k262J026
16795g163L204K344j044j590N74J085j295q29P95P28J711L69j992J453k99q01
16779b750o71k217n58O27j055j05J818K246j000p86J914L59k489J378P24k963
$$ y = [-6833, -7834, -5646, -3723, -1008, 0, -270, -2233, -2764, -4420, -4924, -4404, -2147, 129, -1333, -4071, -5749, -5818, -4880, -5951, -10880, -11589, -9050, -6271, -4356, -4570, -2984, -1540, -4070, -5700, -4054, -1479, 414, -530, -3149, -3066, -3679, -6068, -5711, -6555, -4027, -4243, -3544, -3977, -5493, -5493, -5852, -6724, -5154, -4644, -6532, -6110, -5944, -5470, -2407, -1772, -1510, -4042, -5018, -4267, -4052, -4360, -3134, -748, -205, -3071, -3274, -2859, -200, -1647, -3918, -5565, -2881, -882, -1275, -1957, -2855, -1798, -2072, -945, -946, -2695, -2955, -475, -553, -1127, -2791, -4183, -2085, -2180, -2759, -2964, -3141, -1902, -699, -551, -1952, -3573, -5312, -5015, -5267, -5927, -8189, -7163, -3959, -1615, -2659, -4249, -3675, -2590, -3885, -4714, -3919, -3191, -1480, -1111, -3103, -1650, -1949, -2750, -3421, -5638, -6196, -5569, -6624, -6729, -4911, -2665, -3665, -4451, -2537, -2178, -4667, -3289, -2565, -5528]
16763e528j65K314k39j793K94j73J527K411j127j594k925k319J744K057M12O91
16747d413j381j056l115J625L596J105l15k019k85K874nk61J71J983j522r16J331
16730b603O17r97j596j219o46k21K196J587j805j401m06L506J87m64nj423J011
16713c682K166p39j599O13J692J672j362k118n73M79p27k36o0J030j209j384R54
16696e083O92l115j353M91J824J235N02J710J447J159N24L794m38m135j829j984
16680d559j337n24J461O96k887r72K481J705j151j335R83P54j089J184K209p69
16664c150r82J92k6M61J156l22K217K419k814k365J38k307k39Q41J360q22k197
16647f440J117K343J745j199p54j29M84K031n9J373J114j374k673J313k97q89
$$ y = [-5528, -5693, -3379, -3618, -5411, -5117, -5290, -3763, -1352, -2479, -4073, -6998, -9317, -7573, -5516, -5104, -4413, -5794, -6850, -9965, -8340, -4744, -3639, -3954, -5973, -6258, -3384, -3389, -3650, -3479, -1496, -3018, -3934, -2603, -1986, -2983, -4579, -5798, -6444, -6665, -4469, -2882, -4687, -6088, -6494, -2988, -2801, -3265, -3270, -4693, -3682, -1516, -2255, -3854, -3241, -1549, 123, -1239, -3357, -3930, -3451, -4178, -4414, -4474, -3444, -4653, -6037, -5083, -4391, -7506, -8859, -8368, -6544, -5309, -4807, -3097, -1650, -491, 33, 3827, 3389, -746, -2575, -4559, -5896, -6420, -4959, -4263, -7150, -8122, -5641, -3936, -5087, -6422, -5439, -4685, -5774, -4590, -2381, -3150, -4132, -3940, -3966, -3505, -2349, -2671, -454, 1965, -849, -3214, -3076, -5383, -5622, -4781, -3421, -4243, -6440, -5323, -2980, -1235, -2434, -3188, -3317, -2833, -802, -861, 512, 1626, 252, -2421, -1108, -1405, -2294]
16631b294j255j028l81R53L922N90O28J551k94l361p26J518k449k466J092L703
16615b97j427k625k058j345K942M044q69l908j982j080j403J905J908J041N57
16600d597Nn66J578K840J750j278k328k28j416k059o16J824J527m54R25R82O69
16583a442q72k153j226j242j96p38j508j643J380J022Q66P83K925J592k61j243
16567c956J970K876r5k564j226J960n97j928M46L98J828J670K043k994l827l276
16551g272R96L788k658l651J530J048J570j157J858K316J303N96k62o53n53l153
16535d354P10K325l89j675K451K754k933k668k03j562J491O62M86k100j274J75
16519f104N45N3k624k658N35j16J67K081J645J505Q49k79N01J090J093l039j518
$$ y = [-2294, -3549, -4577, -4958, -4005, -83, 507, 1135, 2686, 2392, -969, -1695, -177, -2626, -5092, -4000, -297, -1724, -4349, -6407, -7752, -4810, -766, -1635, -5543, -7525, -8605, -10008, -8103, -6195, -5154, -4597, -4592, -5158, -3580, -740, 1010, -268, -2596, -2824, -4240, -6299, -6915, -5091, -3564, -4018, -3093, -2111, -1442, -2314, -4467, -5693, -6935, -7131, -7869, -9377, -11020, -9640, -8618, -7752, -6969, -4044, -2452, -2713, -3956, -1986, 890, 795, -1769, -2995, -1035, -1632, -3560, -3114, -2716, -888, 782, 2825, -169, -3996, -7272, -6276, -2488, -5146, -8797, -7267, -6219, -4649, -5806, -3948, -1632, -329, 267, 5, -648, -1201, -4354, -3644, -1319, -1708, -3383, -932, 1822, -1111, -3779, -3982, -5544, -4053, -3391, -2905, -5005, -6279, -6104, -5559, -5506, -8130, -10788, -10253, -10369, -10202, -8121, -6476, -4971, -4122, -4401, -3900, -2810, -1717, -4756, -6274]
16502f274J03j208n71K012J095O97P90j593j031m56k60o47M22J786p94J340J51
16485d438k415j58M50L392J791n88J170K132k223k434j532L82o08J21K054K590
16469c14J4n5r94O53P23q16k459k620L369N34r6M58l39n43p01L40r30j709p09
16450f194J8j277j085m49Q90j436L92J076J381j168J139R56p47R12M36j06K041
16433c221J873m938r33K515R64R40L53l234k800Q13L53K892n10k035L19K578K575
16416a496m10N41K17k909j602J773J808j98k048J40M79k38l69J778Q47q3k817
16399d587o46j179j128L280J629p9n01L92r04o61o73Q88J407k985k296J680O99
16382e664K081K634j477k401o26k075k160Q87n53K380L048l62l165K74J330K65
$$ y = [-6274, -6171, -7379, -7950, -5938, -4843, -4146, -3356, -4949, -5980, -6436, -6696, -7343, -6921, -5135, -5929, -4589, -4438, -6853, -7011, -6561, -3169, -1378, -1966, -796, 1336, -887, -3321, -4853, -4471, -5079, -4958, -2904, -314, -300, -355, -1349, -696, 27, -789, -3248, -5868, -2499, -1965, -2061, -1603, -1942, -2485, -3186, -2846, -3776, -5485, -6194, -6176, -7453, -8538, -8987, -8097, -9533, -9141, -8065, -6684, -7852, -6713, -5757, -6504, -5592, -5156, -5262, -3221, -1348, -6286, -7219, -4704, -3740, -2800, -2447, -5681, -8481, -7668, -7315, -4423, -4933, -6968, -6649, -4071, -1496, -1906, -1365, -1148, -4057, -5659, -3886, -2078, -2276, -4324, -4184, -3705, -3943, -4312, -2534, -1687, -1770, -4587, -5233, -6412, -7540, -4260, -2631, -2710, -3211, -2819, -3723, -4384, -5057, -4169, -2762, -5747, -8043, -6363, -5664, -3583, -949, -2426, -4827, -5453, -7528, -9688, -8801, -9354, -6974, -3926, -4288, -7453, -7179, -5849, -5584]
16366e584K802J626o20J256r1M85j428M12L98O71q24k878l025l207J85L083r91
16349g730M17L246J231j700k143n5k55J774J248J503l51j569j399j511q6K675
16333d705K3J026O25j348j397k796P38k45J005K956K615L97L8q70l412k495M336
16316c509K456k128r26J066M150J928r03k468k209P16K78K66J472J21P75N54K387
16299D026L748j36j283j592Q27M940M073L791N566M565N865N870P634P389N636
16284F0919N523j179m370j190k408k424L3l209m117m150l972k936l208l641m545
16269B5126l134j513m73l762l058j391r82p88l164J293O63k68k830k647j51M84
16253C405n54M64P78l10o31o1j402J043K216R42k323j876o81j549j346K179n44
$$ y = [-5584, -2782, -1156, -1776, -520, -611, -126, -1554, -1142, -744, -73, -897, -3775, -6800, -10007, -9822, -6739, -7730, -7313, -4067, -2836, -4536, -6679, -6734, -6989, -5215, -3967, -2464, -2815, -4384, -5783, -7294, -7380, -4705, -4682, -3656, -3031, -4379, -5776, -8572, -7834, -8079, -7074, -4118, -1503, -1106, -1068, -1938, -5350, -7845, -3509, -1053, -3181, -4107, -3041, 1109, 3037, 2134, -334, -2543, -1827, -1549, -1283, 189, 310, 1085, 1639, 4026, 7774, 7638, 6355, 4763, 5590, 10530, 14603, 18394, 23960, 28525, 34390, 40260, 47894, 55283, 60919, 66442, 65263, 60893, 59703, 57295, 54871, 54904, 51695, 47578, 43428, 39456, 36520, 33312, 29671, 25126, 21992, 20479, 20006, 16244, 13186, 11795, 10813, 10025, 6861, 8154, 8817, 8549, 5719, 3072, 2921, 3405, 2851, 3315, 4093, 3783, 3152, 3091, 1689, 2732, 4948, 5890, 3567, 1691, 1010, -539, -1885, 294, -250]
16236b50n97K202j226J071o82k524J117J605J41N25j713j082P37L158K56J24R46
16219C808o62J96m54j139j965J001J972J103m09J621J550m807j271J420K7l71
16203A620O7o10J802K62J118L66k510l260k62K104K053K139m053k822j060p37
16187c783Q41q82r2K565l66k531j076o32P17K484N3P64J466Q33l56J387r15q43
16169c66q24o46L02j069R90R83p01q23K112J232k410k088j658K93P31L167rQ67
16151H3J508k3k948P1J852J571o33Q84K136j820L747M507o67k007j0R50j068k897
16133E236K07k27k31j932J939K309j948L09j935j601J689J445l946l247k788N51
16117d170Q70K024K085k84J391j168k103j296L38m57j606q01K302j169P9J216
$$ y = [-250, -847, 1355, 129, 1200, 518, -2006, -889, 716, 857, 1382, -331, -1413, -676, 2482, 2738, 2862, 3808, 3146, 3342, 2888, 1749, -216, 785, 2757, 3860, 3451, 5072, 6622, 1815, 544, 1964, 1991, 1620, 1687, 1077, 2879, 3141, 4259, 4625, 2115, -1145, -1407, 697, 2750, 4889, 836, -1986, -3046, -3783, -2942, -3824, -3916, -1351, -1717, -4248, -5324, -5956, -5239, -2755, -2702, -1938, -472, 361, 5, 1392, 477, -366, -1190, -1836, -1534, -2603, -1613, -630, -1331, -2154, -42, 1190, -1220, -3308, -4966, -4673, -3942, -775, -784, 83, 1591, 1568, -1380, -1309, 543, 2114, 1481, 2365, 4501, 2681, 6428, 10935, 10268, 8261, 8251, 9201, 8133, 5236, 5443, 5216, 4985, 3053, 4992, 7301, 5353, 5662, 3727, 2126, 3815, 5260, 1314, -1933, -4721, -4170, -3300, -1276, 809, 525, 1916, 748, -1355, -2651, -2313, -2770, -4376, -5177, -2875, -4044, -3965, -2749]
16101b749l34J793p62j865o52J837o79p42n53L022K434L05j651m66k027o64j025
16084d778m028j187K129N78J165J470l46j52K29j959m4R99P85J28M19j8R38k77
16066c949K233K581O08j055k559N14L65M97J754R10j321l8J118j333j509r54q7
16049b225J108N55k154k272J945J618K341K388l417k989J318J806o95q33l85l03
16033b194j146R39K691m22j003N24q04J21p39m52m29R59o50m77R04Qj406j656
16015e232Q51J079k985j704L177O84j251N87J878J193k025R36k58j327j527j085
15999g009r03J126KO2k25K62J978j41R56M494J240p87p18K13j030k780k624K20
15981e664K463K02k775J44J768K187r32j712O11J495j420o11O41Q73P65J000j439
$$ y = [-2749, -3083, -1290, -2052, -3917, -4569, -2732, -3411, -4153, -4706, -1684, 750, 1055, -596, -1062, -3089, -3753, -4778, -8806, -9993, -7864, -7286, -6121, -4651, -4997, -5149, -4920, -6879, -6923, -5924, -5139, -5011, -4592, -4610, -3672, -3949, -1716, 865, 1473, 418, -2141, -1627, -1262, -765, 989, 1899, 578, 540, 1658, 325, -1184, -2138, -2225, -1117, -562, -2716, -4988, -3043, -1425, 916, 3304, -113, -3102, -1784, 22, -673, -1506, -1891, -2194, -3340, -2401, 290, -132, -1135, -611, -1415, -1294, -2033, -2485, -2914, -1955, -2605, -3082, -2178, -2170, -3576, -5232, -4381, -3302, -6287, -7991, -4814, -4130, -5381, -4794, -2916, -1723, -3748, -2812, -3070, -4397, -5924, -7009, -7912, -6786, -6784, -6722, -6947, -6685, -4707, -4848, -3892, 602, 1842, 1055, 337, 550, -480, -3260, -5884, -5664, -3201, -2999, -5774, -5630, -3862, -1675, -2607, -4319, -3708, -2213, -3633, -4244, -3603, -2730, -1965, -965, -2404]
15964b404L69M68j470J529J332o6l201j576J858J642L31J371N02l125k049J735
15948b754P06r20j542R07K251j046P5r8J357m30o22k402n32J998j430o13J387
15931c708K070K050J006n21k181k213k394m73J686J005L16p07n66l65l34P45k030
15914f614m57J964l08j90K123O57m95j10L73K741o07j970k286P97J250J047J205
15897h80K32j10P81j937k559j979k179K65J990J562L8J771J230r00J012K317j118
15880d64M93j227L57L4j604J328j873k372n30K620K464o47k009n28O95K483L5
15863g45J039J464l86k931Q7l37k67m19k011K75Q70n24j750k42M4J169K139K33
15845b292Q82P03l707Q85L267K27j443l566j612J818K96l42J65r06j426l67M03
$$ y = [-2404, -2035, -1567, -3037, -1508, -176, -242, -3443, -5019, -3161, -1519, -1188, 183, 685, -2440, -4489, -2754, -2048, -2968, -4510, -3603, -1352, -2398, -2323, -2421, -1064, -1494, -2116, -4518, -5050, -3052, -4482, -5095, -3708, -1638, 412, 1418, 897, -1284, -3497, -5891, -6364, -4678, -3673, -3357, -4064, -4630, -4995, -5329, -4584, -6614, -7071, -5107, -5415, -5605, -3482, -2825, -3320, -3430, -3057, -316, -923, -2893, -5179, -4382, -3132, -2085, -880, -648, -758, 23, -1914, -4473, -6452, -8631, -8366, -6376, -4814, -4776, -3005, -1775, -2675, -1663, 654, -464, 29, -1198, -841, -807, -2411, -1083, -2956, -5328, -5858, -3238, -774, -1421, -3430, -3958, -3263, -780, -745, 294, 1758, 1372, -1559, -1472, -1809, -2076, -2495, -4506, -4231, -3361, -3885, -5635, -5877, -5833, -4664, -2525, -2292, -1410, -707, -4414, -3529, -262, -35, -1478, -5044, -6656, -4838, -4542, -4884, -4719, -5625, -7051, -7418, -7015]
15828g015o68K302J99O60Q28j251Q3l19k84j360L97J841P0j572o6P35R71K101
15810b348j412j818R31Q61Q38P77q13K29l07J62p19K14j25O86j538m246m62K505
15792f585m87J901J850Q44j37m49K601q46J53k195k005n2J97J223o6O5q97j791
15774f676l551m37L026L71Q83J693J520Q32J798O52k481l335R54L166m11k292
15758d288p52o91J36O58k38q83Q28J362J470J482J469l506k908k802J666J832
15742e165M374L254p93k449l773k398Q81K348J680K302J698r66l20q79p94L56
15726f44n67R41Q09N42k530k630k184j43k167K015J260J363R51J575J347j207
15710a269k779k09M02k265J252J550p11p76P3L451j189j130K17K205L11k17L12
$$ y = [-7015, -7683, -5381, -5182, -4522, -3694, -4945, -4862, -5181, -5465, -6825, -6428, -4587, -4517, -6089, -6155, -5420, -4449, -2348, -3760, -5578, -4647, -3786, -2948, -2171, -2984, -2755, -3062, -2900, -3619, -3405, -3530, -2844, -4382, -8628, -9090, -6585, -7072, -5171, -3321, -2477, -2614, -3063, -462, -1308, -1155, -3350, -5355, -5407, -5210, -3987, -4053, -3988, -4885, -6676, -10227, -10664, -7638, -7267, -6384, -4691, -3171, -2339, -541, 111, -2370, -5705, -4751, -1585, -1996, -4288, -5040, -5731, -5595, -4937, -5175, -6058, -5230, -3868, -2398, -916, 553, -2953, -5861, -8663, -6997, -5165, -791, 2463, 1670, -779, -4552, -6950, -6069, -3721, -2041, 261, 1959, 993, 673, -206, -1000, -644, -1211, -270, 539, 1081, -1449, -4079, -6263, -6406, -8573, -6558, -5298, -3935, -2984, -1409, -62, -1269, -4048, -4257, -3855, -6120, -4868, -3318, -4029, -4805, -4732, -1281, -2470, -3600, -3383, -1178, -867, -1084, -772]
15693g72j392l57J660J648j162k638k073j15J235P84j476k280k39N80J356J75
15677e066N45k631K90J15J711J536Q46K379j627l596j990J79q63q22J271L219
15661d504J835M22j110j069l102l63J495K007n45j953M93J118J983m70j239L737
15645a265J262j50J985j20j946k984j594Q20K74O29j12Q60j086l083m88l75r92
15628h365J407K948J766J508j169k536j027Q80j434O82J306J15p50j751k110j575
15612a0105l66P30K837J244M31q17j845j55L726K047j445j610n25j764J56L008
15596d453K939k207r22O42m89k081M41j518j922R99J224n73K43j13j532L226Q28
15579e268J133l68L60l50J73q63j600K66J029L27k632j075L846O33j837j242k309
$$ y = [-772, -2164, -2521, -861, 787, -375, -3013, -5086, -5201, -3966, -3182, -4658, -6938, -7177, -6597, -5241, -5066, -4521, -7152, -6862, -6747, -5036, -3500, -2654, -275, -1902, -5498, -7488, -7309, -8172, -8994, -7723, -4504, -2669, -2247, -3357, -4426, -7528, -7891, -6396, -4389, -4934, -6887, -6394, -5276, -3293, -3763, -5002, -1265, -3, -153, 1832, 1712, -234, -3218, -4812, -3992, -3718, -3089, -3201, -2341, -3427, -6510, -6998, -7373, -8365, -6958, -4010, -2244, -736, -1905, -4441, -5468, -4588, -6022, -5340, -4034, -3919, -4669, -6420, -8530, -10105, -10471, -9741, -6904, -5660, -5229, -6046, -7891, -8046, -4320, -2273, -3718, -5328, -5853, -7617, -7461, -4453, -1514, -3721, -4643, -4001, -4490, -6571, -6130, -7648, -9570, -8571, -7347, -7920, -7677, -7790, -9322, -6096, -5268, -4135, -4503, -4143, -4493, -4320, -5183, -6783, -6517, -5488, -5161, -7793, -8868, -5022, -4389, -6226, -7468, -9777]
15562i777K343L176L03j694r39j461J715N55l64Q61L375m86j327k54Q4o30J622
15545b898m93Q42L978p92j584j065q56o59m58j93L96j824M47J993J831J949P8
15528F92q66j907j090M9j556J882r72o95K56J629J43k974J78j455j73K480K000
15511b379k317l83j859K89j798K263O02K693J338r65k45k97J745K80j89k796J2
15494d006M28J915L139R87j973j728o79J330O48l419j243J198j34p42Q65k70K33
15477c451K56k349J298m98O31O14O57k533j960J566J003m63J394l66q72J85K355
15460b533n08j578J988P30J268r68j349j177J439J98j219k186p48N04J105P54
15444d280l74j09O39J275M01J14J012j551m71k863m4K318j77K213K43j407o83
$$ y = [-9777, -7434, -4258, -3955, -5649, -6588, -8049, -6334, -5779, -6143, -5282, -1907, -2393, -3720, -3974, -3890, -4520, -2898, -3391, -2549, 1429, 637, -947, -2012, -2868, -3527, -3985, -4178, -3782, -5606, -5159, -3166, -1335, 614, 692, -174, -2081, -3171, -3122, -4678, -2796, -3768, -4463, -4207, -2578, -2435, -5409, -5231, -6686, -6859, -4379, -2379, -4696, -5079, -6938, -6649, -8447, -6184, -5582, -2889, -1551, -2516, -2761, -3058, -1313, -1033, -1222, -4018, -4006, -3578, -1663, 1476, 2463, 490, -1238, -1917, -587, 61, -3358, -4601, -3403, -3537, -4279, -3414, -3684, -3451, -3195, -5544, -4246, -4744, -4113, -3499, -2842, -5375, -7335, -5769, -4766, -5229, -3835, -4201, -5073, -4888, -2533, -3041, -4619, -2631, -1901, -633, -1601, -2950, -4127, -2688, -2490, -3709, -5895, -6643, -6139, -5034, -4280, -4654, -4763, -4124, -2849, -2448, -2334, -1322, -2873, -3344, -6207, -6251, -3933, -4110, -1897, -1654, -3061, -3744]
15427c744k816l21l78K76M91o3J111J44P33n30n57M38J972j164J220J074l537
15410e651j140L38P61l60K593j173k736L33N527J587J29J12k883k884j021J129
15394e339J206Q5J85k176n18L10J816J134R57p3K193j001o32K478J426l365k006
15377c320j955k369j578K348J056m92J104K9K531J99M24M98k559Q75Q80k488k49
15360e066J232J889J9J072Q83k140k78j675q54J711j390q80K419R06m01l82P20
15343b215j63j131J868j233R21l61j379j039p44qJ340J765J040J521R35N17O5
15326A699m42k138k170o57j334m55p76R91K268J311J74j455L26J224j576k043
15310e053N15j124J819L53o26l30j287J22K822P15M64o56j088L34j312j356n99
$$ y = [-3744, -6560, -6881, -7259, -6983, -6492, -6555, -5444, -5300, -4567, -5097, -5654, -5216, -3244, -4408, -3188, -2114, -5651, -6791, -6453, -5692, -6052, -3459, -4632, -7368, -7035, -1508, 79, 208, 320, -2563, -5447, -6468, -5339, -4133, -4048, -3863, -6039, -6557, -6247, -4431, -3297, -2340, -2413, -220, -1221, -1853, 625, 2051, -1314, -3320, -5275, -7644, -9222, -6874, -5818, -6310, -5206, -5177, -2646, -2447, -2023, -1525, -4084, -3209, -2329, -4817, -5066, -3834, -1945, -1926, -854, 29, -2111, -2389, -4064, -4918, -3207, -4597, -5477, -3058, -2152, -2553, -2935, -2215, -2378, -3509, -1641, -2874, -1953, -2314, -3693, -4732, -5476, -5484, -4144, -2379, -1339, 182, 1117, 1634, 1699, 1257, -881, -3051, -3708, -5042, -5497, -6273, -5282, -3014, -1703, -1529, -2984, -2658, -1434, -3010, -5053, -4538, -5662, -3843, -3490, -4116, -4446, -5733, -5611, -2789, -2074, -1610, -2266, -3354, -3020, -4332, -5688, -6287]
15293f287K02k576J369J06o30M47L406J667j480m948o31L97K054K458l70j006
15277e822J797p03o19m05N87J078K144J367J91K728j646k988q01N63R88j435j17
15260c093o74K325J884K295L178O807N741k484k936k226j966j707M00j82l679
15245C683m948l780P70K660M96j099J335J069J621J551O60l48O43J609j671j303
15229B948o25L39K620Q94M62L601L438J599M903Q918J2030Q596N976O559M102
15214F6360m859j0133r315m630r323q040p528k678k02j303j942p57j250P15M17
15199E532j042o50L07j252Q82P98K114l398k343K519o12j148l194o37q77J16N1
15182b834j008O00P01Q06L363K71q12k375j069j214j419K40J530n55R62K699q46
$$ y = [-6287, -6085, -8661, -7292, -7186, -7816, -7369, -3963, -2296, -3776, -8724, -9355, -8958, -6904, -4446, -4816, -5822, -4025, -4728, -5347, -5752, -5165, -4087, -1943, -576, -385, 2343, 697, -2291, -3092, -2529, -1541, -2976, -3093, -3767, -1442, 442, 2737, 5915, 12722, 18463, 15979, 13043, 10817, 8851, 7144, 7544, 7362, 3683, -1265, -5045, -4275, -1615, -1119, -2218, -883, 186, 1807, 3358, 4018, 3670, 4313, 5922, 4251, 2948, 2323, 2662, 5282, 6176, 6638, 10239, 13677, 15276, 20179, 29097, 41127, 49723, 55699, 62258, 66360, 61501, 51368, 42053, 37423, 28100, 20060, 12532, 9854, 9652, 8349, 6407, 5650, 4400, 5115, 5532, 4490, 3840, 4147, 2895, 3777, 4575, 6689, 3291, 948, 3467, 2855, 1707, -1487, -2124, -3001, -2885, -2834, -3842, -3242, -2541, -1735, 1628, 1899, 1087, -1288, -2357, -3571, -4990, -4750, -3220, -3775, -2813, -114, -960]
15165i60j281p29n35j198o77J632J438j769o06l104Q4L260j29J180r01q23J325
15148c793K649l03o21r46j253J739j33j017J066J685n89j292j252R83R19k067
15132d225J415L230R58r74l15J35j816j987l90n30o70J128m91q37J815K795J816
15115A057j057j613j473J219J843O93j96J890Q82k329k471qk118q61J35J914m31
15098b924J030K67l61J652k58l011N71K060Q67q69J761J036j224k68l284j178
15082d133J330J779j037m159J03N14N39K549q95j648R20J695k32k001r08Q79p33
15065e438k968K267J632J929J590K67jP68L58j165j623L63l65N09O79k034M04
15048b828K968O12K356J281j6m24K66j595j228K77O4k64K3R83L141K968K29K167
$$ y = [-960, -2241, -2970, -3505, -4703, -5380, -3748, -2310, -4079, -4685, -7789, -7705, -4445, -4574, -3394, -4295, -5118, -3793, -1144, -1447, -2068, -3014, -4267, -2528, -2661, -3678, -2612, -927, -1516, -2808, -4060, -3077, -2158, -4225, -2810, 420, 1378, 404, 89, 224, -1592, -3579, -3969, -4499, -5169, -4041, -4532, -5369, -3554, -759, 1057, 0, -1613, -3086, -1867, -24, 669, 473, 2363, 3245, 916, -1555, -1563, -3681, -4542, -4407, -2493, -2924, -1894, -1627, -1988, -336, -594, -3605, -3034, -974, -107, -976, 785, 1821, 597, 329, -2955, -4133, -2803, -1024, -2061, -6220, -6117, -5603, -5064, -2515, -3410, -5058, -4138, -2443, -2675, -4676, -5584, -4705, -5438, -8406, -6139, -4507, -2578, -988, -721, -722, 46, 404, -761, -2384, -2021, -2386, -1877, -1198, -3232, -2828, 140, 752, 3108, 4389, 4373, 3949, 4215, 2620, 1392, 1669, 1733, 1469, 1492, 2475, 5616, 8584, 8813, 10980]
15030A0980J025j191m54n74k026o84N87j432k530q57r81j28p35N31p46P13j705
15013b07k027J69J817r2p7J160J348J024l846r55J635K206j695j400J559L30K103
14996C052J137j478k049m64J682Q59k313l99R33J580k766j530J226l95k170N38
14980b557L978L463L810j055O9M452J541l72j652k029n08l378m22M29J256L47
14964G372k613l292j975J060J512J961K932l25L80L149K524N887P684P628N930
14949C9814m38o892q216m654r90O523J0319J2759Q972O822j0963j7186j1910n575
14935A8385j743J054k005L12k467l280P0J764k737k596J587J128p47j791k91j509
14919E134j563m8K776n98k068l47K228K20j7M36k380r65l21O81P05j498p14r16
$$ y = [10980, 12005, 10814, 10360, 9786, 7760, 7076, 7663, 6231, 3701, 2844, 1863, 1735, 1000, 1531, 785, 1498, -207, -2234, -2065, -248, -340, -417, 743, 2091, 3115, -731, -1686, -51, 2155, 460, -940, 619, 949, 3052, 4189, 2711, 662, 198, 1880, 2739, 426, 27, 960, 2540, -226, -1756, -530, -925, -3095, -2557, 1421, 4884, 8694, 7639, 7708, 12160, 13701, 13329, 11677, 9648, 9140, 5762, 5340, 5769, 7025, 7372, 4759, 1467, -508, 552, 2064, 4025, 6957, 6632, 7012, 10161, 12685, 18572, 26256, 33884, 39814, 39376, 32484, 24268, 19614, 18624, 25147, 35466, 48225, 57197, 64019, 53056, 35870, 23960, 18385, 16642, 17696, 15691, 16003, 13536, 10256, 10326, 12090, 9353, 6757, 8344, 9472, 8725, 6934, 6643, 5134, 3571, 3523, 6299, 5701, 3633, 3286, 5514, 5734, 5717, 6153, 3773, 2808, 2487, 3168, 3873, 2375, 1661, 745]
14901G45k47K344R93n49k48j417K9P77K244P13r03k616j769J912K037k208q88
14884I49j0N92K191j860Q95J897p04N63n01R22J272o61l137o46J076n68J559K204
14866F033R27j681l110K08K44j57q92l367K24J818l305J114K283l148o38J810
14850a637L492Q64J165J121k383n04q78J677M09j037k820P12K323J424J175L65
14834E468N77j557j184O41m26L421L72M66j758j896L480K528J262j137n80j065
14818H612J191Q14J29J260Q20j226J548J300q13n72J340N900K301L86K62k917
14802B0335k752K261J787j840P92k413j236P99K28J529k234Q7o78j258J014L587
14786B0008M530L554J330K312L614L279l9K217R93R23M015Q027P235N246M273
$$ y = [745, 498, 2842, 3835, 3286, 3038, 1621, 1650, 2427, 4671, 5384, 4481, 1865, 96, 2008, 4045, 1837, 949, 939, 1531, 3722, 1862, 2757, 4654, 3950, 4513, 4012, 4934, 6206, 5545, 2408, 1762, 2838, 2270, 3829, 6033, 6960, 5279, 2169, 2377, 2621, 2464, 1572, -1795, -1571, 247, -3058, -1944, 339, -2809, -3447, -1637, 1855, 2719, 3884, 5005, 2622, 2118, 1240, 2917, 3326, 2289, -531, 181, 2504, 3928, 5103, 5468, 6045, 4488, 3304, 3945, 3519, 6940, 7312, 7778, 6020, 4124, 7604, 10132, 11394, 10257, 9677, 8612, 9803, 10617, 10746, 12006, 12826, 11600, 13148, 14448, 13635, 13063, 14403, 20303, 22604, 22990, 23252, 20335, 17583, 19844, 21631, 19791, 20583, 18170, 16934, 17733, 17961, 19490, 17256, 17343, 16665, 15407, 16421, 20008, 24538, 28092, 29422, 31734, 35348, 38627, 38588, 40805, 41798, 42721, 46736, 54763, 61998, 67244, 71517]
14771G1517N699O486Q476R525J0585J5512K1249K6683K9683M1949O0463R1057
14759C98884J45733K19992L16389M40952N34494N21522M89649L03395n3690k09544
14749C107776l94038n45744m61448l61477k78229j89790j27807r4359p3125n8923
14739E22836m5882l5159l1527k3620j6591j4426j6684j6207j3323j0755j2788
14728B85874j0979j0092j2049q114o727o023n780r892j1836q616p689n812m773
14715A77492j129j633o22K790j10j964O059O047O060O187P392Q706R529Q322J0100
14700B43226J5645K5662L2594L9643N0819O5498Q0569R5103J09223J37444J89370
14689A084796K64614M23226P54024J195482J474315J761925K096824J558059R23539
$$ y = [71517, 77216, 83702, 92178, 101703, 112288, 127800, 149049, 175732, 205415, 247364, 307827, 398884, 544617, 764609, 1080998, 1521950, 2056444, 2577966, 3067615, 3371010, 3317320, 3107776, 2713738, 2167994, 1706546, 1345069, 1066840, 877050, 749243, 654884, 581759, 522836, 476954, 441795, 410268, 386648, 370057, 355631, 338947, 322740, 309417, 298662, 285874, 274895, 264803, 252754, 244640, 237913, 231890, 226110, 216218, 204382, 195766, 188077, 182265, 177492, 176363, 174730, 174108, 176898, 176788, 174824, 180883, 186930, 192990, 199177, 206569, 215275, 224804, 233126, 243226, 258871, 284533, 317127, 356770, 407589, 473087, 553656, 648759, 757982, 895426, 1084796, 1349410, 1772636, 2526660, 3722142, 5196457, 6958382, 9055206, 10613265, 11536804]
14680A1536804J061596n4758j929174j612133j147413j624017j586030j005206
14672C639669o21626m17141k98324k39665j98469j65710j42099j17642j00465
14663A338528r4980q1794p0064o8317o0578m9327m0628l5245l1426k9158k7082
14652G49929k6684k3914k4090k3459k4349k1845k2757k4622k0491j9217k0212
14641D98289k0010j6690j5082j6920j4102j2091j3847j1445q463r288j0739j0083
14629C39529j0458q195q678n520o694q411o541q522j0057p913r229r415n690r260
14615B24946n914n348p213o527m152m898n297l807k944n724n338l358n888l614
14601A54924l765p461q384j669q14m223M28r03k865j314k297p243m573l189n478
$$ y = [11536804, 12598400, 12543642, 10614468, 9002335, 7854922, 6230905, 4644875, 3639669, 3018043, 2600902, 2302578, 2062913, 1864444, 1698734, 1556635, 1438993, 1338528, 1243548, 1161754, 1091690, 1023373, 962795, 913468, 872840, 837595, 806169, 777011, 749929, 723245, 699331, 675241, 651782, 627433, 605588, 582831, 558209, 537718, 518501, 498289, 478279, 461589, 446507, 429587, 415485, 403394, 389547, 378102, 369639, 360351, 349612, 339529, 329071, 320876, 312198, 306678, 299984, 291573, 285032, 276510, 266453, 258540, 249311, 239896, 234206, 224946, 219032, 213684, 206471, 199944, 195792, 190894, 185597, 181790, 178846, 173122, 167784, 164426, 158538, 154924, 151159, 143698, 135314, 133645, 132831, 128608, 129036, 128133, 125268, 123954, 121657, 114414, 109841, 106652, 101174]
14586A01174l850J560m54l338j049k519m638k224j368l199m046k047j618k031
14572G0353k907p20j043j186j583k186j387j676j348l154n49m58Q60J16Q57J038
14556E5027J215j980l831k62k741k156J190J759k528m205l818K547K222j550m054
14541C6835l362n22k169k239j848k817r33l62n33r05j264K82n18m75J106j695
14525A8581j389O03q79j312J580R92j718l13K95j568N0o71J061N87K907k88p68
14508A7750J714K9k447j133j415Q74N22j20p71J410K53N94m15K96n34J22K562
14491A9291J046K353m47j71L292O902L400J8L034q72l49j881l120jk935l398m90
14474B5672k263k301j354r0Q6J078K61O60j963n115j677k66Q21m84M26J373J771
$$ y = [101174, 97324, 98884, 98430, 95092, 94043, 91524, 86886, 84662, 83294, 80095, 76049, 74002, 72384, 70353, 67446, 66726, 65683, 64497, 62914, 60728, 59341, 57665, 56317, 53163, 52614, 52156, 53016, 53132, 53989, 55027, 56242, 54262, 50431, 50169, 47428, 45272, 46462, 48221, 45693, 41488, 37670, 40217, 42439, 40889, 36835, 33473, 32951, 30782, 28543, 26695, 23878, 22945, 22583, 22050, 21145, 19881, 20163, 19645, 19170, 20276, 18581, 17192, 17795, 16916, 15604, 17184, 18176, 16458, 16145, 16440, 14872, 14922, 14251, 15312, 15899, 18806, 18518, 17750, 19464, 19493, 17046, 15913, 14498, 15372, 15894, 15774, 15003, 16413, 16666, 17260, 16845, 17141, 16607, 16729, 19291, 20337, 22690, 22243, 22072, 25364, 32266, 35666, 35684, 38718, 37846, 37497, 35616, 32496, 32495, 29560, 26162, 25672, 23409, 21108, 19754, 19664, 19750, 20828, 21089, 21749, 19786, 14671, 12994, 12728, 13549, 13065, 13491, 14864, 16635]
14457A6635q66j908l67j196o76O62N92O35J158J291k000n01J430J872J927L777
14441B2465L185N038J1225J6194J7720J8557K6021K2294K6347K7643L0598J4504
14429B41791j2004l426P074K904k9219l9903k3837j2423j5063k3761j5882r676
14417F6575q677q753m525k156j546k899l787k842l48P3o44N22j722p40r22k315
14401B5294m251k885m32J858K140j747k645k092k182q60J58k212j344l266K943
14386H477J099K90k902j066L21n76J243N24p45j514j262r53n04J181K151J386
14370G150N49j48q15N59k23l17Q30L26m8J46P07j915j674n04k325j298O20J002
14352B622p70q3j240j383J006k19J154J794J608m50j062J033J229k850m03J796
$$ y = [16635, 15769, 13861, 13494, 12298, 11622, 12284, 12876, 13511, 14669, 15960, 13960, 13459, 14889, 16761, 18688, 22465, 25650, 30688, 41913, 58107, 75827, 94384, 120405, 142699, 169046, 196689, 227287, 241791, 229787, 226361, 233435, 236339, 207120, 167217, 143380, 130957, 115894, 92133, 76251, 66575, 57898, 49145, 44620, 42464, 40918, 38019, 34232, 31390, 31042, 31115, 30471, 30993, 29271, 28531, 27609, 25294, 21043, 18158, 17726, 19584, 21724, 19977, 17332, 15240, 13058, 12198, 12356, 10144, 8800, 5534, 8477, 9576, 9866, 6964, 5898, 6219, 5643, 6886, 7410, 6665, 5151, 3889, 2936, 2432, 3613, 5764, 7150, 7699, 7551, 6736, 7295, 7072, 6755, 7585, 7911, 7863, 8009, 8716, 6801, 5127, 4623, 2298, 1000, 1620, 2622, 1852, 1769, 529, -854, 152, -67, 1087, 2881, 4489, 4039, 2977, 4010, 5239, 2389, 1986, 3782]
14336C782L40P40k965j289l82J765j129k078j6j33M08Q69k424k811J433L612J590
14319A312J153p28K215j43k887R0N53M38n92o26n87J493P65m73k760o77M36J113
14301I5K912k12Q27J468K08k86j020j364L09J967j175l92p96p08n6K90K08M90
14283B765n40J633m52r15m0m01R51R98o50L98j316j370J80J59p83q22q4J597L393
14264D701q0j343p05K443q34j501N67K254J831j463k365l061p48j97L886L602
14248F987L042L840P37k694J20M574o43k876k628J018m2r24l059j398p64l624
14232A666N12j338k02J260J875r86k451l14J786L776l05l579R88q03J192L598
14216F675j070k877J610Q38j102k408L67M04k334J703J992k176j582l03l83K88
$$ y = [3782, 4122, 4862, 1897, 608, 226, 1991, 862, -1216, -1232, -1365, -957, -88, -2512, -5323, -3890, -278, 1312, 2465, 1737, 3952, 3809, 922, 1012, 1565, 2003, 1411, 785, 198, 1691, 2456, 1983, -777, -1454, -1018, 95, 3007, 2795, 3622, 5090, 5298, 5012, 3992, 2628, 2937, 4904, 3729, 3337, 2541, 1833, 1777, 2067, 2275, 2765, 2225, 3858, 3406, 2491, 2451, 2050, 3001, 3999, 3349, 3747, 2431, 1061, 1241, 1400, 617, -205, -289, 1308, 4701, 4621, 3278, 2573, 5016, 4182, 2681, 3248, 5502, 7333, 5870, 3505, 444, -304, -501, 3385, 6987, 10029, 13869, 14606, 11912, 12032, 16606, 15963, 13087, 10459, 11477, 11435, 10511, 7452, 6054, 5290, 1666, 2178, 840, 638, 1898, 3773, 2787, 336, 22, 1808, 5584, 5279, 1700, 2688, 1885, 3077, 6675, 5605, 2728, 4338, 5176, 4074, 1666, 2033, 2437, 103, 1806, 3798, 1622, 40, -263, -646, -358]
14200c58J261R66J060r43m20J569j253j692K325J405j528l606o30p0K146M70O30
14183A332K31L37J670k017k605M8K538J098k8j723l46m42K945K81r20K451o92
14166D158j498K121O05j895J926J14N17J659n78l68R54J400J478O84J65j868J239
14149A0813J276P28M223L526L923R133R816J3330J1729N926N777N210k271n502
14135G7637J599j331j456k81K556P734M770J009k393j483n420r990q890n773n533
14120E2755q409m780l449k736k736l262m114j321p13k643O02q59j770J74r34k211
14104A3594j490J892K937J432P10j094p00j457M92j60j100l549j225l0j246K066
14088A1072J786j975k986j709j846L03m96o86O25R86J400j13l35L14N86j97J284
$$ y = [-358, 903, 1869, 2929, 1986, 1566, 3135, 1882, 190, 2515, 3920, 2392, -1214, -1844, -1914, 232, 702, 1332, 1563, 1900, 3570, 1553, -1052, -1004, 1534, 2632, 2604, 881, 535, 93, 3038, 3319, 2399, 4850, 4158, 2660, 4781, 5386, 3491, 5417, 5531, 6048, 7707, 7129, 6761, 7715, 9115, 10593, 11277, 11442, 9574, 10813, 12089, 12817, 17040, 20566, 24489, 33622, 43438, 56768, 68497, 74423, 80200, 85410, 83139, 77637, 79236, 77905, 76449, 76168, 78724, 86458, 91228, 92237, 89844, 88361, 82941, 72951, 64061, 58288, 52755, 44346, 39566, 36117, 33381, 30645, 27383, 23269, 21948, 21235, 18592, 19194, 18335, 16565, 16739, 15805, 13594, 12104, 13996, 16933, 18365, 19075, 17981, 17281, 15824, 16316, 16156, 15056, 11507, 10282, 10252, 9006, 11072, 12858, 10883, 7897, 6188, 4342, 4645, 4149, 3463, 4088, 5074, 6474, 6361, 6026, 6340, 6926, 6729, 8013]
14071H013l81J065J569j473k955j620J413R31j228k64Q77m36K50J9l43o95J606
14054F348j938j449R22m30L94J411L33p24j204L96o03j78J048nJ239J716m48p27
14036F101j113m78K0K218L263n26m79r99n92k64j672L80m36j873j237k67M72j217
14018A301J32n08l72J094P17r10J549K769n32k023k121K833J50k117J420K086
14002E468k299j192j108J082K290p95l710k250J829K207M182K114j81j541J301
13987G397K356j902j225k29K089R89J048L003O34r32O07p31p24p77j230j031k071
13970G271J40l10j685k04J37K572M18L90j665j115j669k101R07L494j33M04p41
13953F110J7O60O11p78p45l194r55O79j230J91m7K692K120l600j361M37NQ98J045
$$ y = [8013, 7632, 8697, 10266, 8793, 5838, 4218, 5631, 6562, 5334, 5070, 5947, 5511, 5761, 5780, 5437, 4742, 6348, 4410, 2961, 3883, 3453, 3847, 5258, 5591, 4867, 3663, 4059, 3456, 3278, 4326, 4321, 5560, 7276, 6828, 6101, 4988, 4510, 4530, 6748, 10011, 9485, 9006, 8007, 7415, 7151, 5479, 5859, 5423, 3550, 2313, 2046, 2518, 1301, 1433, 925, 553, 1647, 2364, 1454, 3003, 5772, 5240, 3217, 1096, 3929, 4079, 1962, 3382, 5468, 3169, 1977, 869, 1951, 4241, 3446, -264, -2514, -685, 1522, 5704, 7818, 7637, 6096, 7397, 9753, 7851, 6626, 6397, 8486, 9475, 10523, 13526, 14160, 13228, 13835, 13104, 12380, 11603, 10373, 9342, 7271, 7411, 7101, 5416, 5212, 5349, 7921, 8339, 8729, 7064, 5949, 4280, 2179, 3086, 6580, 6447, 6851, 6110, 6127, 6787, 7398, 6620, 5875, 2681, 1726, 2405, 1175, 1366, 1319, 4011, 6131, 2531, 1170, 1607, 1612, 2510, 3555]
13934C555Q98Q51k8Q81j90q20j184q16Q19N43n42k44Q38J683k376J729J028J33
13916F758j968M92M7J75j146N74O12k28k82O50L90J621j009j967j403L4K40j638
13898A952j019M35J320n26Q26J025l2N81j567k624J498l75j642j00j683K80J200
13881d51j267Q03K533K045J545O37j62J134o25j915N89J842l755k260L23M872
13865E888j405M53p51k230R53J931Q48R54K331K430k629k757J124J587l757j515
13849C455K129Q44j464l493J506n5k195q83j80N052L904Qo037j255K219K462m6
13832E971j309R07N38j826k460J59L271L776j467k655j174k77j508k677O25L23
13816B17K089l64R02j737J643j053l51K638M769n23k049j359l89K910R85k600
$$ y = [3555, 4453, 5304, 5276, 6157, 5967, 5147, 3963, 3147, 3966, 4509, 3967, 3723, 4561, 6244, 3868, 5597, 6625, 6758, 4790, 5282, 5329, 5504, 4358, 4932, 5544, 5316, 5034, 5684, 6074, 7695, 6686, 4719, 3316, 3350, 3590, 1952, 933, 1368, 2688, 2162, 2988, 4013, 3981, 4562, 2995, 371, 1869, 1494, -148, -248, -1931, -1651, -451, -1718, -915, 1618, 3663, 5208, 5845, 5683, 6817, 6192, 4277, 4866, 6708, 2953, 693, 1016, 5888, 4483, 4936, 4185, 1955, 2908, 4839, 5687, 6641, 8972, 11402, 8773, 6016, 7140, 8727, 4970, 3455, 5584, 6428, 4964, 1471, 2977, 2922, 727, -156, -336, 4716, 8620, 8628, 2591, 1336, 3555, 6017, 5971, 4662, 5569, 6107, 4281, 1821, 1980, 5251, 9027, 7560, 4905, 3731, 3454, 1946, -731, -106, 217, 2306, 1942, 2844, 1107, 2750, 1697, 1346, 3984, 8753, 8230, 6181, 4822, 4433, 7343, 8328, 5728]
13800E728P95J238R29J578K65O42R27K58J66Q59q00k250J607K410j1j445l23K847
13782A5420P054Q575J3632K0045K9467L1224K7092J1005p470k4054k9678k5386
13770G6926j6661j2590p626m777k096k442k920j336k433l703j48P55J394J028
13756B3371p75k864l846n99k254j086j828J278j4J56O79m12J362J032l525j643
13740I032m58J344J025J117O6l13r92Q01N24R81J22l753j910o03n41J655J393
13723I490p07o08n90j060J444m9M70L920K000l041j904j379J379o88j781J481
13707H377J024N64J651j120l364r47j010R0M04P06M16L132K895l014l323L91R37
13690G809o21k63o61J577p30j29K723M07k12J675Q05n69k54j808o22J622o60j705
$$ y = [5728, 6523, 7761, 8690, 10268, 10533, 11175, 12102, 12360, 12526, 13385, 12585, 10335, 11942, 14352, 14341, 12896, 12573, 15420, 22474, 31049, 44681, 64726, 94193, 125417, 152509, 163514, 156044, 131990, 102312, 76926, 60265, 47675, 40049, 35272, 33176, 30734, 27814, 26478, 24045, 20342, 20194, 20949, 22343, 23371, 22596, 19732, 15886, 15287, 13033, 11947, 10119, 11397, 11383, 11539, 12218, 11806, 13168, 14200, 10675, 9032, 8574, 9918, 10943, 12060, 12126, 11813, 10821, 11622, 12146, 13127, 13249, 9496, 7586, 6983, 6442, 8097, 9490, 8783, 8175, 7585, 6525, 7969, 7920, 8390, 12310, 14310, 11269, 9365, 7986, 9365, 8677, 6896, 8377, 9401, 9965, 11616, 10496, 7132, 6185, 5175, 5265, 5669, 6375, 6791, 9923, 12818, 9804, 6481, 6872, 7809, 7188, 6925, 6264, 7841, 7111, 6982, 9705, 10112, 9900, 11575, 12380, 11811, 11557, 9749, 9127, 10749, 10089, 8384]
13672H384j10j129j344q41O60n27k075K756K657j970N8K57l170j274R43J624L389
13655H288P70k001l009J696O10j308Q4Q62L50K298j158j842j509N34K135J22J424
13638H346J276j608Nj548K08O78J164k18l057j957j126K326K236j239k42Q36K73
13621F353P89p81R1k335j567J062K832J439Q62r94j451k179n17n75L78O63K010
13604F080L571n13K16J016K500K599J306k803o105j566K721J210j3j402K44J285
13588A0346k72J179n48l129P45K568k612k829J160J144J532p12j05J784j013j548
13572G690k27J934p27k570q15J646O99l73P63L01N29N11L48j028p6j141k704J835
13554F595K05j071J264R38k377J199n49p74Q09l59J616J001LO40J204R10j557
$$ y = [8384, 8274, 7145, 5801, 4960, 5620, 5093, 3018, 5774, 8431, 6461, 6519, 6776, 3606, 2332, 3275, 4899, 8288, 9058, 7057, 4048, 5744, 6354, 5046, 5130, 5992, 6342, 8640, 7482, 5640, 4131, 4665, 6800, 6922, 8346, 9622, 8014, 8019, 6471, 6679, 7357, 8521, 8303, 5246, 3289, 2163, 4489, 6725, 5486, 5244, 6080, 6353, 7142, 6361, 6452, 4117, 2550, 3612, 6444, 7883, 8745, 7751, 6300, 4121, 3604, 3029, 3407, 4070, 6080, 9651, 9138, 9354, 10370, 12870, 15469, 16775, 13972, 7867, 6301, 9022, 10232, 10219, 8817, 9061, 10346, 10074, 11253, 10705, 7576, 8321, 10889, 8277, 5448, 6608, 7752, 9284, 8572, 8467, 10251, 9238, 7690, 7463, 9397, 8670, 6100, 5285, 6931, 7630, 7257, 8020, 8321, 8850, 9361, 9709, 8681, 8605, 7464, 4760, 6595, 6800, 5729, 6993, 7931, 5554, 6753, 6204, 5430, 6239, 5880, 7496, 8497, 8500, 9140, 10344, 11254, 9697]
13537I697Q97j132n478j936J576Q21K52J040O63m49J24N2K233J853K22k876J455
13520I014R11j708N39m3k999k365l209L637L966j707J250K891M9n80P87j306j112
13503H015J583M223J145P29J295j145j576J27K433m0j672r02l14K58J93k502k379
13486I471k512j237R07K530k94o36j373p42K092J09K43j404J799M63J546K041
13470A3003P63n24j213l1j686k798O49M08l4l8j51K321m81k979K786K882r94k599
13452I284j412J408P21K18k287J269J248J912L44p08l33n35K57R62Q20m71k567
13435A0130j862J596o36J44N29K18K997J854l95m840l367l45R27J686j604K17
13419G249j449O65J728J310J43J24q83k919j737J966Q59J372Q90J394j854k188
$$ y = [9697, 10594, 9462, 3984, 2048, 3624, 4445, 4697, 5737, 6400, 5951, 6075, 6127, 8360, 10213, 10435, 7559, 9014, 9925, 8217, 8756, 8713, 5714, 3349, 140, 3777, 7743, 6036, 7286, 10177, 10226, 9646, 10433, 9127, 8015, 9598, 13821, 14966, 15695, 16990, 15845, 14269, 14396, 16829, 16789, 15117, 14215, 13901, 14159, 14352, 11850, 9471, 6959, 5722, 6629, 9159, 8865, 8229, 6856, 6114, 8206, 8315, 8558, 7154, 8953, 9416, 10962, 13003, 13766, 13242, 12029, 11998, 10312, 7514, 8163, 8571, 8537, 8499, 8348, 10669, 10188, 7209, 9995, 12877, 11883, 9284, 7872, 9280, 10001, 10219, 7932, 9201, 10449, 12361, 12705, 11997, 11664, 11129, 11386, 12348, 13168, 12697, 10130, 8268, 9864, 9228, 9372, 9901, 10119, 13116, 14970, 14575, 9735, 6368, 6023, 6950, 8636, 7032, 7249, 5800, 6465, 8193, 9503, 9646, 9770, 8887, 5968, 4231, 6197, 7056, 8428, 9318, 10712, 8858, 6670]
13403F670J103R30Q63n36n61l388K83J343J286j380M3L020j44Q6l55j82k190k90
13385F601J925M123k228l230j382p36O11J332k08Q7o29%J067k150K650K044j769
13368H108q42r52o79r26K343J088j508R5l59j465L881K809K117K323o83j733j586
13351A2031k92K059K624J285l261j578j871q4k47r8n20j688k325J680O303M192
13335A8210r57p62j751j984R86J797q62l782j984J58K423L919o29l257j461j003
13319I061L40l95K965J772k10j263r78k21n78j343J79L165K048N73J049m63j876
13302A3825j627q16M27N1j539k454L26J802J140p22k709J462J852J099J444J420
13286A4981k22j422L257R65K971J083k062j300o05j525r80J062R54k260J560P76
$$ y = [6670, 7773, 8703, 9566, 9030, 8469, 5081, 5364, 6707, 7993, 6613, 6656, 9676, 9532, 9618, 9263, 9081, 6891, 6601, 8526, 12649, 10421, 7191, 5809, 5073, 5684, 7016, 6808, 6895, 6266, 6266, 7333, 5183, 7833, 9877, 8108, 7266, 6314, 5635, 4709, 7052, 8140, 6632, 6727, 6368, 4903, 8784, 11593, 13710, 16033, 15350, 13617, 12031, 11739, 13798, 16422, 17707, 14446, 12868, 10997, 10913, 10666, 10568, 10048, 8360, 6035, 7715, 14018, 18210, 17253, 16491, 14740, 12756, 13742, 15539, 14677, 10895, 8911, 9069, 11492, 15411, 14782, 11525, 10064, 9061, 9401, 9006, 11971, 13743, 13533, 12270, 11292, 11071, 10493, 9150, 9329, 12494, 14542, 15115, 16164, 15701, 13825, 12198, 11382, 11809, 11860, 10321, 7867, 8193, 9995, 11135, 10413, 7704, 9166, 11018, 12117, 13561, 14981, 14759, 13337, 16594, 17559, 20530, 21613, 19551, 18251, 17646, 16121, 15141, 16203, 17157, 14897, 16457, 17233]
13270A7233J666k643l24K00o18K16L94M15o61j765j472q90K341K837k344N95J249
13253A6429L39J793j711o16J055J035L121L314l093k250j330J999Q17P5K384j223
13237B2138j112j157o31k37J942R6o71K09j144j136J728L443K292J098l31l109
13221B3418j02O73r08J26m20J221P54n81K468J032J51J242m077k525M46j91k64
13204B2463L725j037J135L263J452K27k030j021l74J168k162J014K506j12p61
13189B9456o09Q14J327K71m7K64R90J689K817o30J570J263k368k596K28L175R00
13172C8514j480k764k819O24J081J327L285j433l039J596K463L367J327k476k493
13157C7080q65m72J5K406K551M78n07J475J010J246J817J603k94l114j788J26
$$ y = [17233, 18899, 16256, 15932, 16132, 15514, 15730, 16124, 16539, 15878, 14113, 12641, 11751, 14092, 16929, 14585, 15180, 16429, 16768, 18561, 16850, 16234, 17289, 18324, 21445, 24759, 21666, 19416, 18086, 20085, 20902, 20977, 23361, 22138, 21026, 19869, 19238, 19001, 20943, 21039, 20368, 20577, 19433, 18297, 20025, 23468, 25760, 26858, 26527, 23418, 23316, 23989, 23081, 23207, 22787, 24008, 24762, 24181, 26649, 27681, 27832, 29074, 24997, 22472, 22918, 22727, 22463, 26188, 25151, 26286, 29549, 31001, 31228, 29198, 28177, 27803, 28971, 26809, 27823, 30329, 30217, 29456, 28847, 29661, 30988, 31259, 31212, 31476, 32466, 34155, 36972, 36342, 37912, 39175, 36807, 34211, 34439, 37614, 38514, 37034, 34270, 31451, 32075, 33156, 34483, 37768, 36335, 33296, 34892, 37355, 40722, 42049, 39573, 37080, 36215, 35743, 35758, 38164, 40715, 41193, 40686, 42161, 43171, 44417, 46234, 47837, 47543, 44429, 42641, 42767]
13141D2767o64q60K38j739L44J024J569Q7k82q91q17R91m22l441j523p40J750
13124C7391J933j551p20q77K42K127J766L6P60M520K481J150K27J880J266p2K3
13107E2582l107k3K091L966R39r08k318p20N27l55N81R41J498o4O16L77n61J840
13089E7902K729O60J43l43k627l568l284k230j429J817N03J03k11K28j448j62
13073D8783l298k251M17K144J192r52k406O14n31n92L51K416L692K9m082p54l315
13056D1457p85K663J252k40o41J085P07R31L36j110o26L38L004J832M95J051j029
13039E0720j322j56J045k149r77k84J279J69J140R1L88q75k811k209K514J443
13023D8006R26j682n04K562J505J359K602J672r6k107k858m53J414L076L122K056
$$ y = [42767, 42103, 41243, 41481, 39742, 40086, 41110, 42679, 42766, 42484, 41593, 40776, 41767, 41345, 37904, 36381, 35641, 37391, 39324, 37773, 37053, 36176, 36418, 38545, 40311, 40347, 41107, 45627, 48108, 49258, 49485, 51365, 52631, 52559, 52582, 49475, 49452, 51543, 55509, 56448, 55540, 53222, 52502, 53029, 52674, 53255, 54196, 55694, 55630, 56246, 56623, 56062, 57902, 60631, 61291, 61434, 61091, 58464, 54896, 51612, 49382, 47953, 49770, 50273, 50376, 50165, 50393, 48945, 48783, 45485, 43234, 43651, 45795, 46987, 46035, 43629, 44243, 43712, 43120, 43471, 45887, 49579, 49608, 45526, 44772, 41457, 40672, 43335, 44587, 44347, 43706, 44791, 45498, 46429, 46765, 45655, 45029, 45367, 48371, 50203, 50698, 51749, 50720, 49398, 49242, 50287, 48138, 47161, 46877, 48156, 48325, 49465, 49556, 49944, 49069, 46258, 44049, 46563, 48006, 48932, 47250, 46746, 49308, 50813, 52172, 54774, 56446, 56350, 54243, 51385, 50932, 52346, 55422, 58544, 60600]
13007F0600L084O713O207P473N884o88n875l757l005j747j969l651j66Q64O07
12992G0574l151j056L509L611J6m672o257q54J77j767n915L98L698L898K709j680
12976F3238l589l791l268l88j249k03L15n1K584L565J751L65M50r58j101O49K803
12959F1122L830N729R82Q06J624m50k091l358j420k70k251R23O11j64q66q79L99
12942F4277K552J934J608M512M177j87j518J260K855m32K936N923O329R622J2843
12927A18691J3697J2079J2892J0251J9144K9306M4521O9316J13656J83805K80294
12916I07652L80385L86059K70830J11261k00297m44310l81653k27700j31110q4111
12906E87006n4051k5085P14J4395J3979p180n0126p7892o9163m8234l3057k0750
$$ y = [60600, 63684, 70397, 76604, 84077, 89961, 89273, 83398, 79641, 76636, 74889, 72920, 69269, 69103, 69967, 70574, 67423, 66367, 69876, 73487, 73503, 68831, 62574, 61720, 61897, 60130, 54215, 54613, 58311, 62209, 64918, 63238, 59649, 55858, 52590, 52202, 50953, 50750, 51065, 51014, 53598, 57163, 58914, 59279, 59729, 58771, 57670, 58319, 61122, 64952, 70681, 71663, 72469, 74093, 73643, 71552, 68194, 66774, 66504, 64253, 65176, 65787, 65623, 64757, 63878, 64277, 66829, 68763, 70371, 74883, 79060, 78873, 77355, 78615, 81470, 81038, 83974, 89897, 96226, 105848, 118691, 132388, 144467, 157359, 167610, 186754, 216060, 260581, 329897, 443553, 627358, 907652, 1288037, 1674096, 1944926, 2056187, 1855890, 1411580, 1029927, 802227, 671117, 587006, 532955, 507870, 508584, 522979, 536958, 529778, 479652, 401760, 332597, 284363, 251306, 230556]
12894B30556j2272j0406j0299m930n28K726J748n31o785r624q095o51R58m98q41
12879A70528N66j62l544n291m385k345k694l480k195m11J58k496k412n406o554
12864A29877k331r41J021J267L907N966Q583J3181J4539J0111K146o120j5711
12851A65495j3878j2078r107n160l579m148l145o681p403l101m327k042j53k25
12837I0468k68O19L55k733j195M354O535O916R892J2751J2997J2748Q794Q7m463
12822A57857m895p254j2414q944j940k007k968o605k211m070p018q280j1100l087
12808G5064Q402J5461J3954J1673J3813J3069J3105J2887J1135R790P625r321
12796A96657k3739j9022r358l772k144j750j957n246m782n73k38j979J157K222
$$ y = [230556, 218284, 207878, 197579, 192649, 192121, 194847, 196595, 196064, 189279, 179655, 171560, 170909, 171867, 171369, 170528, 171094, 170932, 167388, 162097, 157712, 155367, 152673, 149193, 146998, 146587, 146745, 144249, 141837, 136431, 129877, 127546, 126605, 127626, 128893, 132800, 138766, 147349, 160530, 175069, 185180, 187326, 181206, 165495, 151617, 139539, 130432, 125272, 121693, 117545, 114400, 107719, 100316, 97215, 92888, 90846, 90693, 90468, 90200, 90819, 91174, 88441, 87246, 91600, 98135, 105051, 114943, 127694, 140691, 153439, 162233, 162320, 157857, 152962, 145708, 133294, 124350, 122410, 120403, 117435, 110830, 108619, 104549, 97531, 89251, 78151, 75064, 83466, 98927, 112881, 124554, 138367, 151436, 164541, 177428, 188563, 198353, 205978, 196657, 172918, 153896, 144538, 140766, 138622, 136872, 134915, 129669, 124887, 124314, 124076, 122097, 123254, 125476]
12782A25476k799o595k684J203j74J332j264J339J495n07K203J636O7m857m155
12767A11716P06L056p05l023m706l677K901K548M576J601k429m233l857m688n034
12752I4752j087O664R432O636N982J540J154K833K904J702K54l378m451p709r646
12737A07582n401p38n698p914k990M683J0581Q959Q570P364M294L858j98j163
12723A31789L228L294K804N145N287N868O528P037M943J0590J3722J6442J9552
12710B36229K6325K8047K3119K1272K1702O108m117j296Q165Q898Q389r84o481
12697C75376K062N914N889J7117K8696L7128M2013N3525O5830Q9244J23209J52731
12685I98734J53716J09906K2919q1018j56580j78099j57853j16872p8594m8321
$$ y = [125476, 122677, 116082, 113398, 114601, 114427, 115759, 114495, 115834, 117329, 116822, 119025, 120661, 120728, 115871, 111716, 112422, 115478, 114773, 111750, 107044, 103367, 106268, 108816, 113392, 114993, 112564, 108331, 104474, 99786, 94752, 93665, 100329, 109761, 116397, 122379, 123919, 125073, 127906, 130810, 132512, 132766, 129388, 124937, 117228, 107582, 102181, 101443, 95745, 87831, 84841, 89524, 100105, 109064, 117634, 124998, 129292, 133150, 132952, 131789, 135017, 138311, 141115, 146260, 151547, 157415, 163943, 170980, 175923, 186513, 200235, 216677, 236229, 262554, 290601, 313720, 334992, 356694, 362802, 358685, 357389, 365554, 374452, 382841, 381857, 375376, 377438, 383352, 389241, 406358, 435054, 472182, 514195, 567720, 633550, 722794, 846003, 998734, 1152450, 1262356, 1285275, 1204257, 1047677, 869578, 711725, 594853, 516259, 467938]
12675D67938l4017k8142k5485k2030k0242j9526j5367j0270n272j908k751k563
12663B80365q79K115M59m835r884j0766j2121j1551p907p23J315K310L399O340
12649B37637J0333R673J3478J4620P109j2532k2738k3322j7450j0330j2393r291
12637A84794m50k215p160p704j412J1204K2463J9022j003n067j1734k0772j2486
12624A67480N629J6907J6373Q812Q245K0380L1132K5126J1274J078L838N005N751
12611C27030J0492J3006J5709J9883L0189L1340K8374K9499L4668L9673N0070
12600F29933P1797R8286J35306J88842K76074M24826O53084R69563J284788J422307
12590F154806J222993N81247l24091j056934j362416j157401p74697m51551k72029
$$ y = [467938, 433921, 405779, 380294, 358264, 338022, 318496, 303129, 292859, 287587, 285679, 282928, 280365, 279486, 281601, 282060, 277225, 267341, 256575, 244454, 232903, 224996, 224273, 225588, 227898, 231297, 237637, 247970, 257643, 271121, 285741, 292850, 280318, 257580, 234258, 216808, 206478, 194085, 184794, 184344, 182129, 174969, 167265, 165853, 177057, 199520, 218542, 217539, 212472, 200738, 179966, 167480, 173109, 190016, 206389, 215201, 223446, 243826, 274958, 300084, 311358, 312436, 316274, 321279, 327030, 337522, 350528, 366237, 386120, 416309, 447649, 476023, 505522, 540190, 579863, 629933, 701730, 800016, 935322, 1124164, 1400238, 1825064, 2478148, 3447711, 4732499, 6154806, 7377799, 7959046, 7634955, 6578021, 5215605, 4058204, 3283507, 2831956, 2559927]
12581B559927k43846k15273j66129j52171j37297j19445q9112o7320o3477m9489
12571A256368k7785j8180j7421k8005m4040m0997k5113j4869p066q549j5998j6568
12559I91777j7413j4224J875J4061J8426J5492Q522n38k0774m0532l0458j5816
12547I10398j1129j1409k569R812J1021L106j874k580l395K886J8875L9017O0567
12534A022726P2054N8969L6490k2477p2370n1445k9175j8099o202k49J752N695
12522I97669J3828J6514J3191Q916J6663K4676K5375K1424K0389K0879J3877K37
12510A193638q837k822R720J9331L0776M4413M8847L9537L1615L8330N0309M6720
12498A541577L3946K2009J1478O626J9353M5317N9837M9800M1548N5904P5409
$$ y = [2559927, 2316081, 2100808, 1934679, 1782508, 1645211, 1525766, 1436654, 1369334, 1305857, 1256368, 1228583, 1210403, 1192982, 1164977, 1120937, 1079940, 1054827, 1039958, 1032892, 1024343, 1008345, 991777, 974364, 960140, 962015, 976076, 994502, 1009994, 1018516, 1017978, 997204, 956672, 926214, 910398, 899269, 887860, 885291, 895103, 906124, 909230, 907356, 904776, 901381, 904267, 923142, 962159, 1022726, 1094780, 1153749, 1190239, 1167762, 1095392, 1043947, 1014772, 996673, 990471, 990222, 991974, 997669, 1011497, 1028011, 1041202, 1050118, 1066781, 1091457, 1116832, 1138256, 1158645, 1179524, 1193401, 1193638, 1184801, 1181979, 1191699, 1211030, 1241806, 1286219, 1335066, 1374603, 1406218, 1444548, 1494857, 1541577, 1575523, 1597532, 1609010, 1615636, 1634989, 1680306, 1740143, 1789943, 1831491, 1887395, 1962804]
12487A962804R2343J07308J13138J08556J25994J73529K23041K62497K88302L00069
12477C757581K88165L04407L56270L97494M24525M54178N01468O24316Q54252
12468G962656J143656J436764J753057K073766K356128K685681L096062L653711
12460B6161481M659753O688991J0430292J6694285K4375962L0834990M0615028
12453A60460782N1236063M8981557L9481549K6629903m519053n1797608o7956698
12446B02516495n0196052l0602367j9026973j0941587m267370Q30392L417408
12439I1729946K828346j712339r639893j4173064j2480446q409578n361146l715855
12431C9065971l018959k732979k428133k063953j707357j368440j129444j025507
$$ y = [1962804, 2055147, 2162455, 2275593, 2384149, 2510143, 2683672, 2906713, 3169210, 3457512, 3757581, 4045746, 4350153, 4706423, 5103917, 5528442, 5982620, 6484088, 7108404, 7962656, 9106312, 10543076, 12296133, 14369899, 16726027, 19411708, 22507770, 26161481, 30821234, 37510225, 47940517, 64634802, 89010764, 119845754, 160460782, 211696845, 260678402, 300159951, 326789854, 322270801, 270473193, 202516495, 152320443, 121718076, 102691103, 91749516, 87482146, 88312538, 91729946, 94558292, 92845953, 83206060, 69032996, 56552550, 48142972, 42781826, 39065971, 36047012, 33314033, 30885900, 28821947, 27114590, 25746150, 24616706, 23591199]
12423B3591199r62959q99585q32126p63389p07393o86657o88758o89131o64362
12414A6696839n97297n02941l68926k27782j84683k03066k96808o00836o99566
12405A3014934n34231l95118l11158k26603j20498j1084J31544L97608Q96784
12396A2842178J605612K274983K469325J849700M67520j572020k865719k676538
12388A4395041j845807j097646p10339n47911m66803m39512m22175l54721k64875
12379H245252j88719j25248m2734Q1591K66855N77676J104500J750730K139288
12370A3809191K196922J734578J10538j222121j683911k232854k070434j378690
12362I263219q57209n94640m86941m79215m75003m02862l06388k35390j90376
$$ y = [23591199, 22628240, 21728655, 20896529, 20133140, 19425747, 18739090, 18050332, 17361201, 16696839, 16099542, 15596601, 15227675, 14999893, 14815210, 14612144, 14315336, 13714500, 13014934, 12480703, 12085585, 11774427, 11547824, 11427326, 11416242, 11547786, 11945394, 12842178, 14447790, 16722773, 19192098, 21041798, 21509318, 19937298, 17071579, 14395041, 12549234, 11451588, 10741249, 10193338, 9726535, 9287023, 8864848, 8510127, 8245252, 8056533, 7931285, 7888551, 7970142, 8236997, 8814673, 9919173, 11669903, 13809191, 16006113, 17740691, 17851229, 16629108, 14945197, 12712343, 10641909, 9263219, 8406010, 7811370, 7324429, 6845214, 6370211, 5967349, 5660961, 5425571, 5235195]
12353E235195j61039j38085j14443q6728o4230l9287J5514J14780K65965N14848
12343E542490R87291J883279K865693K824250K206857P04849k896830l884325
12335A0233554k422224j294015p15012m63979l84181l49583l10567k60361j91494
12326C842138j44239j35512j47793j41072j22329q1050n4668m0482l5150m2330
12316B897513n3071n4601n2773o1657q1119r2293q2122o6607n1133l6169k4300
12305B241668j5624l747L7696R5483J40596J83977K27729K73822L27736L83888
12295C893224M04340L82124L07071J88961R0038R969k2296J01863L31592N42689
12285F229575P16375Q95957J115835J416959J831840K433499L447048N197880
$$ y = [5235195, 5074156, 4936071, 4821628, 4734900, 4670670, 4631383, 4646897, 4761677, 5027642, 5542490, 6529781, 8413060, 11278753, 14103003, 16309860, 17014709, 14117879, 10233554, 7811330, 6517315, 5802303, 5338324, 4954143, 4604560, 4293993, 4033632, 3842138, 3697899, 3562387, 3414594, 3273522, 3151193, 3070143, 3015475, 2974993, 2939843, 2897513, 2844442, 2789841, 2737068, 2675411, 2594292, 2501999, 2419877, 2353270, 2302137, 2265968, 2241668, 2226044, 2222297, 2259993, 2355476, 2496072, 2680049, 2907778, 3181600, 3509336, 3893224, 4297564, 4679688, 4986759, 5175720, 5265758, 5275727, 5253431, 5355294, 5686886, 6229575, 6945950, 7841907, 8957742, 10374701, 12206541, 14640040, 18087088, 23284968]
12277B3284968Q148317J3220031K1863619L3504600M1023958L7470862K4767664
12270B03284019Q90179l0390410m5186445l6631851k2607433j3256071q453461
12263D7648527o320550n297601m462334l615401k838053k233981j840608j556221
12255A9483778j288331j031469p88214n79956m48348l77675l84575m91353n89039
12246A3504818n63397n20864n37368n64741n57065n03979m39534m00219l88571
12237I029080l88021l78971l50381l13219k83034k69571k63992k46648k23412
12228F311831j99374j78769j64407j61418j62959j52119j32845j25446j27292
12219D907202j34457j29850j17420j05681j01636j09194j18891j32195j41334
$$ y = [23284968, 31433285, 44653316, 66516935, 100021535, 141045493, 178516355, 203284019, 204174198, 173783788, 128597343, 91965492, 69358059, 56101988, 47648527, 41327977, 36030376, 31568042, 27952641, 25114588, 22880607, 21039999, 19483778, 18195447, 17163978, 16375764, 15795808, 15347460, 14969785, 14585210, 14093857, 13504818, 12941421, 12420557, 11883189, 11318448, 10761383, 10257404, 9817870, 9417651, 9029080, 8641059, 8262088, 7911707, 7598488, 7315454, 7045883, 6781891, 6535243, 6311831, 6112457, 5933688, 5769281, 5607863, 5444904, 5292785, 5159940, 5034494, 4907202, 4772745, 4642895, 4525475, 4419794, 4318158, 4208964, 4090073, 3957878, 3816544]
12210C816544j37799j30056j16693j00860q4397p6785p9805q2693q1872p7941
12200B847643p4359o7605o5552n6322n0569n2687n4295n5169n5565m9788m7604
12189B218128m6784m8330n2288n5960n0113m3066m1543l9471m1957m9577n3684
12178A695355m9308l9776l5310l9758l5990l5178l3944l1864l2186l5220l9281
12167A287540m1981m2196m2468l7344l5899l3903k8557k4952k4827k2994k1951
12156I30468k3436k1711k6929k9781k2899j2690p610m939j721j1021j9865k2909
12144G24957j8625j9279j2223q353n749k604m243r108j0912j3186k2050k2861
12132E75764k2015k7028k7563l2936l1650k4127j7636j0677q043o202m289j1085
$$ y = [3816544, 3678745, 3548689, 3431996, 3331136, 3246739, 3169954, 3090149, 3007456, 2925584, 2847643, 2773284, 2705679, 2640127, 2583805, 2533236, 2480549, 2426254, 2371085, 2315520, 2265732, 2218128, 2171344, 2123014, 2070726, 2014766, 1964653, 1921587, 1880044, 1840573, 1798616, 1749039, 1695355, 1646047, 1606271, 1570961, 1531203, 1495213, 1460035, 1426091, 1394227, 1362041, 1326821, 1287540, 1245559, 1203363, 1160895, 1123551, 1087652, 1053749, 1025192, 1000240, 975413, 952419, 930468, 907032, 885321, 858392, 828611, 805712, 793022, 785412, 780473, 778752, 767731, 747866, 724957, 706332, 687053, 674830, 666477, 660728, 658124, 653881, 644773, 633861, 620675, 598625, 575764, 553749, 526721, 499158, 466222, 434572, 410445, 392809, 382132, 374089, 367887, 363598, 352513]
12120C52513j5103j5357j3743j2757p437l464k436l351m158l119n727o379r849
12107B49633j1665p837o336j711L503K118J312O488R148N688k108j48O291J1592
12093B65968K1210K0220Q821l037j1624j4293j2350r438r259r385k272m563k206
12080B37792k861o971k591Q855J5827J4573J6510J7000J2620M711k806o170o805
12067B99684q638j2897j1343j3920j5102j2795m672j98K765K323Q50Q55J884K880
12053B31676K991N517Q668J0259J5752K3794L3153L1149K4157J1294j3171j9744
12041C65495p011Q061J6026K4880L7138M6759O8253J05201J70311K74866M20393
12030A530372O09897Q20206R81777J007231R17796O59985K10086k17045n44330
$$ y = [352513, 337410, 322053, 308310, 295553, 288116, 284652, 282216, 278865, 274707, 271588, 265861, 259482, 249633, 237968, 230131, 223795, 222084, 225587, 227705, 229017, 235505, 244653, 250341, 248233, 248085, 254376, 265968, 287178, 307398, 316219, 313182, 301558, 287265, 274915, 265477, 256218, 246833, 244561, 239998, 237792, 234931, 227960, 225369, 234224, 250051, 264624, 281134, 298134, 310754, 315465, 312659, 306489, 299684, 291046, 278149, 266806, 252886, 237784, 224989, 220317, 220119, 222884, 225207, 226057, 226912, 228796, 231676, 234667, 240184, 248852, 259111, 274863, 298657, 331810, 362959, 387116, 398410, 385239, 365495, 358484, 366545, 382571, 407451, 444589, 491348, 559601, 664802, 835113, 1109979, 1530372, 2140269, 2960475, 3942252, 4949483, 5867279, 6527264, 6737350, 6520305, 5975975]
12021E975975q28865r33512q37834o85115n19392l56171k36497j63024j15464
12012A300101q1289m7251o236L5328Q9719J83661L68873O23442O69734N35622
12002C671704K85060n36323r18464o13321l49798k01762j30495j01077q5050o8646
11992I51828m8504l1822j9758r304L510K6357N1083P5890R9720J35976J74694
11981A409670K50155L19620K90605J35695k05092m57179l92605k46256j43443
11972I61170p8020k9244j382P666O80l0781p5824r3199p9467n4066l5632k5564
11960D66337j8999j3227j1261j0621j1060j4128j6179j3322j1500j6903j2984
11949C16153j1632r072q595p568n653l910l381k442m192n186r376r016p119n521
$$ y = [5975975, 5147110, 4213598, 3375764, 2690649, 2171257, 1815086, 1578589, 1415565, 1300101, 1218812, 1171561, 1165325, 1200653, 1290372, 1474033, 1842906, 2466348, 3136082, 3671704, 3956764, 3420441, 2501977, 1888656, 1538858, 1337096, 1206601, 1105524, 1020474, 951828, 903324, 871502, 851744, 842440, 845950, 872307, 923390, 999280, 1099000, 1234976, 1409670, 1659825, 1979445, 2270050, 2405745, 2200653, 1743474, 1350869, 1104613, 961170, 883150, 853906, 852524, 860190, 860870, 830089, 754265, 661066, 581599, 527533, 491901, 466337, 447338, 434111, 422850, 412229, 401169, 387041, 370862, 357540, 346040, 329137, 316153, 304521, 295449, 286854, 279286, 273633, 269723, 266342, 263900, 259708, 254522, 245146, 236130, 229011, 223490]
11935B23490o623m536l774l225k969j317Q81L689K743L548M373P009M070n255
11921B22104j5353j5592j0140p742k630j352l852n361l409l512k794L985K780
11908A57132j194k3N427O127N083K74j106l994p448r078j1919j1930o011j686
11894A19654K379K626K075R90k513l051k319k895m738k474j051j692l71j287K727
11879A08060L826L131M032J900N096Q932J2635J1799P172q460k2460j4164o576
11866A14923J761M958M303N698J0955K5788M0797O1270R9459J41056J74577J79394
11854H64939J40637N3258n3978j39236j72745j60550j23530q1272n2385l3368
11844B41770k6857k3454j9408j2855q395q574j1925j1224q748n850k687K33L777
$$ y = [223490, 216867, 212331, 208557, 205332, 202363, 201046, 201927, 205616, 208359, 211907, 216280, 223289, 227359, 222104, 206751, 191159, 181019, 173277, 170647, 169295, 165443, 160082, 156673, 153161, 150367, 154352, 157132, 155938, 155915, 161342, 167469, 172552, 172826, 171720, 167726, 160278, 151200, 139281, 127351, 121340, 119654, 122033, 124659, 126734, 127724, 125211, 122160, 119841, 116946, 112208, 109734, 108683, 106991, 106620, 105333, 108060, 111886, 115017, 119049, 120949, 126045, 134977, 147612, 159411, 166583, 158123, 135663, 121499, 114923, 116684, 121642, 125945, 131643, 142598, 168386, 209183, 270453, 369912, 510968, 685545, 864939, 1005576, 1058834, 1004856, 865620, 692875, 532325, 408795, 327523, 275138, 241770, 214913, 191459, 172051, 159196, 150801, 142227, 130302, 119078, 110330, 104480, 101793, 102026, 105803]
11831A05803P046L786j094j487m201j947j088m633o447k196l421N55K278l402
11817H9552o507o304n182j725L003J735L377O554J0838M008k808m189o591o260
11803G9501k644k571l832l350k680k978l760k011J850l76K31L569J513J662R09
11788F5033J581K132J307J903k596o50K574j836l205k046j658K356l37k790l548
11773E8220j613P7j625k495k66J784K533K755J646L172N918M364j438m016J269
11758G0285K351P76p88K527R157J5593J6405J1999N313p648k0546j7305p951m984
11744G5184k646k775l587m092k617j579K067J970k05j233l47r37j777J5J485J99
11728E9125N61J985J822J582K077K417L151J232k051K179K475J578J99O05J746
$$ y = [105803, 112849, 116635, 115541, 114054, 109853, 107906, 106818, 102185, 95738, 93542, 90121, 90676, 92954, 89552, 83045, 76741, 71559, 69834, 72837, 74572, 77949, 84503, 95341, 99349, 96541, 92352, 85761, 79501, 76857, 74286, 70454, 67104, 64424, 61446, 57686, 55675, 57525, 57149, 57380, 60949, 62462, 64124, 65033, 66614, 68746, 70053, 71956, 69360, 68710, 71284, 69448, 66243, 64197, 62539, 64895, 64558, 61768, 58220, 56607, 56684, 55059, 52564, 52298, 54082, 56615, 59370, 61016, 64188, 70106, 74470, 73032, 69016, 70285, 72636, 73412, 72624, 75151, 84308, 99901, 116306, 128305, 133618, 125970, 105424, 88119, 80168, 75184, 72538, 69763, 66176, 62084, 59467, 57888, 59955, 61925, 61720, 60487, 60140, 59203, 57426, 57441, 58926, 59125, 59686, 61671, 63493, 65075, 67152, 69569, 72720, 73952, 71901, 74080, 76555, 78133, 78332, 78937, 80683]
11713H0683J645K005J916K932K493O30J719j412R82J775L842L379K114lL161Q344
11697A16205R566R675J0853J2929J4915K1630K6196L3363L9193M1429M6856M6147
11685D28957M5893M5343L7075L1496L2172L9777M8161N8565P4366R6477J20510
11674A058792J50370J98332K66685L68586N30540P87229J160084J621897K097692
11665H240207K472441K643732K551074K213964J684136R56872K8687r29137j646445
11656A8215531k047938k235667k279677k130692j770152j325572r42147o70838
11648D812848m92978l58282k41404j01406Q4323K33875K24383J49300j32893n85512
11638C592254n69792l58873k22509j58150j30448j18835j11490j04888r4724q4817
$$ y = [80683, 82328, 84333, 86249, 89181, 91674, 92304, 94023, 92611, 93593, 95368, 99210, 102589, 104703, 104700, 107861, 116205, 125771, 135446, 146299, 159228, 174143, 195773, 221969, 255332, 294525, 335954, 382810, 428957, 474850, 520193, 557268, 588764, 620936, 660713, 708874, 767439, 841805, 938282, 1058792, 1209162, 1407494, 1674179, 2042765, 2573305, 3360534, 4520618, 6142515, 8240207, 10712648, 13356380, 15907454, 18121418, 19805554, 20762426, 20791113, 19861976, 18215531, 16167593, 13931926, 11652249, 9521557, 7751405, 6425833, 5483686, 4812848, 4319870, 3961588, 3720184, 3618778, 3703101, 3936976, 4161359, 4310659, 4177766, 3592254, 3022462, 2663589, 2441080, 2282930, 2152482, 2033647, 1922157, 1817269, 1722545, 1637728]
11628A637728q2871p8566p4075o3312n9747n5515n0892m3442l6426l2628l0385
11617A029869k8037l6014l5079k9368k2142k2323j9770j7492k1695k1063k2791
11606G54095k4723k2869k4147k6124k4151k0997j8391j8881j8681j6785j5928
11595E22418j7479j6248j5862j1617j0235j0989j0243j0350j0802j2518r561j0250
11583C76264q628r282r614q182q947r992p079m685r354q556j0276p974n142m980
11569B63573p528j0787n769k253n285n215q08l067n722o668o296n428o975k484
11555A89288j144lj136k319m938p265m937k316l373p156q143n206o183k292l080
11540A29797j425k636l718r29n72j560n39J51k714m745n429n723k938l18j231
$$ y = [1637728, 1554857, 1476291, 1402216, 1338904, 1279157, 1223642, 1172750, 1129308, 1092882, 1060254, 1029869, 1001832, 965818, 930739, 901371, 879229, 856906, 837136, 819644, 797949, 776886, 754095, 729372, 706503, 682356, 656232, 632081, 611084, 592693, 573812, 555131, 538346, 522418, 504939, 488691, 472829, 461212, 450977, 439988, 429745, 419395, 408593, 396075, 386514, 376264, 367636, 358354, 348740, 340558, 331611, 321619, 314540, 309855, 300501, 291945, 281669, 273695, 268553, 263573, 256045, 245258, 239489, 237236, 231951, 226736, 225928, 222861, 217139, 210471, 204175, 198747, 191772, 189288, 188144, 188141, 187005, 184686, 179748, 172483, 167546, 165230, 161857, 154701, 146558, 141352, 135169, 132877, 129797, 128372, 125736, 122018, 121089, 120517, 118957, 118418, 118569, 115855, 111110, 105681, 99958, 97020, 96702, 95471]
11525I5471J95l039K75J997k75l584n992m986m935l023k084p06m02k688l065j274
11509F1885j105j304j938j629k961k222m256j099j714q48j375j374k923j092o2
11494C5983M46J672m35m17J824p56k466L20J633J792R36J863q90n6M42j384j070
11477C9437J89k429k575K51j205j318j313J238n9j720n484l236K607J053o93O33
11461B5376o81J191J42M96N82j694l81Q91l74j208K1k019R83R73k47J809k12P88
11443B6436j150j522j191j243K59J606K182k64m32J072J487j844j950J022J980
11428B6448M573L018J811J294J38L194N140N210K54r47O66J500K364K421J939
11413E9023L770Q73k355r537j0012k828j025j887l908k517N15k023r73k243j081
$$ y = [95471, 95666, 92627, 92902, 94899, 94624, 91040, 85048, 80062, 75127, 72104, 70020, 69314, 68912, 66224, 63159, 61885, 60780, 59476, 57538, 55909, 52948, 50726, 46470, 45371, 43657, 42809, 41434, 40060, 37137, 36045, 35983, 36429, 38101, 37666, 37249, 39073, 38317, 35851, 36171, 37804, 39596, 40532, 42395, 41505, 41449, 41891, 40507, 39437, 39626, 37197, 34622, 34873, 33668, 32350, 31037, 32275, 32216, 30496, 25012, 21776, 24383, 25436, 24743, 25376, 24695, 25886, 26028, 26524, 27106, 25412, 25031, 25922, 25548, 24340, 24361, 22342, 23325, 24298, 24051, 25860, 25648, 26436, 25286, 23764, 22573, 21330, 21589, 23195, 25377, 25113, 24681, 25753, 27240, 25396, 23446, 24468, 26448, 31021, 34039, 35850, 37144, 37282, 40476, 45616, 50826, 51080, 50133, 50799, 52299, 54663, 57084, 59023, 62793, 63666, 61311, 51774, 41762, 38934, 37909, 36022, 32114, 29597, 30112, 28089, 27116, 24873, 23792]
11398B3792j499r19J576J35n10j320j536L572O41l587j366J506m0j343K98j868
11382A7532J565K395R7j656l414j84q54n66n42O59J192k112j87j359q84p28j835
11365I119j438j053j911J53K736J524L072M14q61l42q85R54j895J148J990J935
11349A4660o33j705r50j41J674J230R10pO15m04m74q37K264p54K121K488P49K843
11331B3649O019K210J324J617N326L816N583M368N524N916N756O297P661R367
11317I4433J1395J2448K0705K6818L9553O0212Q7677J32445J80250K04428J82776
11306A053140J11329l0573j80556k31050j84584j17893p3810m9774m0572l4287
11296B21370k5907k2859j5197j0830r956q271p506p498m769k555l333m637m966
$$ y = [23792, 22293, 21374, 22950, 23085, 22575, 21255, 19719, 23291, 23932, 20345, 18979, 20485, 20445, 19102, 19400, 17532, 19097, 21492, 21589, 19933, 16519, 16335, 15481, 14915, 14373, 15032, 16224, 14112, 13925, 12566, 11682, 10954, 9119, 7681, 6628, 4717, 4870, 7606, 9130, 12202, 12616, 11755, 11413, 10528, 11482, 9587, 10735, 12725, 14660, 14027, 12322, 11372, 11231, 12905, 14135, 15045, 15038, 15653, 15249, 14775, 13938, 16202, 15448, 17569, 20057, 20806, 23649, 29668, 31878, 33202, 34819, 40145, 43961, 49544, 53912, 59436, 65352, 71108, 77405, 85066, 94433, 105828, 118276, 138981, 165799, 205352, 265564, 353241, 485686, 665936, 870364, 1053140, 1164469, 1133896, 953340, 722290, 537706, 419813, 346003, 296229, 255657, 221370, 195463, 172604, 157407, 146577, 136621, 128350, 120844, 113346, 108577, 106022, 102689, 98052, 93086]
11283I3086m056j939m320n056k029j154l178k131l736n50k512n16K431l771l945
11268E6624k31J081k749l66k729j596j860o44j3j373p64O85j547j071J471R70
11252D5888L287N493O741P866J1575J4931J4531J0900P659O932L620k332r275
11239A27816j0750j1934j5157j4054r873n270m229m406m549l313l945k648k066
11226C5622j92J605Q96J579j549j615L80Q0k079k268j102R10q38q70N94Q31j54
11209C1830L67R37J17M50qP76L233L763N235K207N001R698J6364K0153J8460K0054
11193A38637K0446J7293J2018P523P30n52J0107K2751L4083L4656K8187J2011
11181C37890j0254k8889l9656m0679l4501l0013k2066j7092j1459j1646j1131
$$ y = [93086, 89030, 87091, 82771, 77715, 75686, 74532, 71354, 69223, 65487, 64937, 62425, 61909, 64340, 60569, 56624, 56393, 57474, 54725, 54359, 51630, 50034, 48174, 47530, 47517, 46144, 45380, 46065, 44518, 43447, 44918, 45888, 49175, 54668, 61409, 69275, 80850, 95781, 110312, 121212, 128871, 135803, 139423, 137091, 127816, 117066, 105132, 89975, 75921, 66048, 60778, 56549, 52143, 47594, 44281, 40336, 37688, 35622, 35430, 37035, 37931, 39510, 37961, 36346, 36726, 36806, 34727, 32459, 31357, 32267, 31429, 30559, 31153, 31984, 31830, 32197, 33134, 33251, 33701, 33693, 34469, 37702, 41465, 46700, 48907, 53908, 63606, 79970, 100123, 118583, 138637, 159083, 176376, 188394, 195917, 196647, 196095, 206202, 228953, 263036, 297692, 325879, 337890, 327636, 298747, 259091, 218412, 183911, 153898, 131832, 114740, 103281, 91635, 80504]
11170H0504n263k773l966m336n658l883n146k867R46j696l531j845m61q47l136
11155C6042j911l779l27n39n4j049j928k287P01J519O49J207k232l653k364K93
11139B0288J753O50j627k107j416j005j860J30l53L625P24p73j273k717P65J564
11123A6368Mr76K028R45k11j754k957k577J449K416m9J08K61j84k752j183j48
11106A0788M95J160K193k13j937K339K361J247p1L955L865M115N510N367R402
11091E0576J6083J5967J7548J8868J5318Q694J285o773j3550j8580j8279j5374
11079G1783j0721q355q667p921n065j956J13j02j824m416j579P57k85M50j637
11064B0575k59j831j954M50j087J125q67j054j179j50O28j761k616j157R28p61
$$ y = [80504, 75241, 72468, 68502, 64166, 58508, 54625, 49479, 46612, 47558, 45862, 42331, 40486, 40025, 39178, 36042, 34131, 30352, 30025, 29486, 29432, 28383, 26455, 24168, 24869, 26388, 27037, 28244, 26012, 22359, 19995, 20288, 22041, 22691, 21064, 18957, 17541, 16536, 14676, 14806, 14453, 18078, 18802, 18029, 16756, 14039, 14804, 16368, 16372, 15396, 17424, 18369, 18158, 16404, 13447, 10870, 12319, 14735, 14686, 14794, 15055, 14871, 12119, 10936, 10788, 11283, 12443, 14636, 14423, 12486, 14825, 17186, 18433, 18362, 22317, 26182, 30297, 35807, 41174, 50576, 66659, 82626, 100174, 119042, 134360, 143054, 144339, 137566, 124016, 105436, 87157, 71783, 61062, 52707, 44040, 36119, 31054, 29098, 29211, 29109, 27285, 22869, 21290, 22047, 21762, 22212, 20575, 20316, 18485, 16531, 16981, 15894, 17019, 16152, 15098, 13919, 13769, 14397, 12636, 10020, 8863, 9791, 9030]
11048I030J075j397q20L14J83J482J014M53k49K558J718N197N703R727P079M758
11032D7825j513m039p295o359k430m174n009m768k526J899J295L26l78j77L091
11017A5768N98J407K482L307J74K965Q338J2162J4002K1458K5998J9198R349l480
11003A33726j2429j5427j3168q917p642r067q840n647o945n602m866l931l424
10990B7821j967l298r38j845k253N46M6j081j402P10k220k460P81j65k655r34
10974H686J076j005o33o79K046L526j013j166o99N57Q41j496o51L27r57J309J719
10957A1788l65j123l029n81K278P36k237k342n39K002N11R76M190K863L23K47
10941A5698j112j147j095o49p9l490j934k143q53l29J728K558K108J380J672j030
$$ y = [9030, 10105, 8708, 7888, 8202, 8385, 9867, 10881, 11334, 11085, 13643, 15361, 20558, 26261, 35988, 43067, 47825, 46312, 42273, 34978, 28619, 26189, 22015, 17006, 12238, 9712, 11611, 12906, 13232, 12854, 12677, 15768, 16366, 17773, 20255, 23562, 23736, 26701, 35039, 47201, 61203, 82661, 108659, 127857, 137206, 133726, 121297, 105870, 92702, 83785, 76143, 67076, 58236, 52589, 45644, 40042, 35176, 31245, 27821, 25854, 22556, 21618, 19773, 17520, 18066, 18112, 17031, 15629, 16339, 14119, 11659, 12440, 12275, 9620, 8686, 9762, 8757, 8124, 7445, 9491, 13017, 12004, 10838, 10139, 10696, 11537, 10041, 9390, 9717, 8760, 10069, 11788, 11423, 10300, 7271, 6690, 8968, 9704, 7467, 5125, 4586, 6588, 7099, 8075, 12265, 15128, 15451, 15698, 14586, 13439, 12344, 11695, 11616, 8126, 6192, 4049, 3196, 2867, 4595, 7153, 9261, 10641, 12313, 11283]
10925A1283j185l42q35k309j433J046K212L71q7k22Q08K749J859J951L564M959
10909B4389N698N607Q106Q495J411m548o841o802n416n449m998l952Q28j004o70
10894A4854k801k517j937O15J684P37J846J20k846k459K34Q66Q06r94r55o77M76
10877G052j001j440J68J027J22k235j680j109L13Q78R12P27J603J241O37j346
10861E869j497K314n54J288K304K762L658L691M546O471O308l38l193l123m265
10846B6241l151m306l390j544l037j932K865j191k744j449q99p56k038J441J616
10831E726j761j796k745j487L221L249j36o6L234j581J14J050m98q59L87J054
10815G106k97J99Q39q79m50j26j24M73j652l558j190J091J179M51o70J416Q23
$$ y = [11283, 10098, 9756, 8921, 6612, 5179, 6225, 8437, 8808, 8721, 8499, 9307, 12056, 13915, 15866, 19430, 24389, 30087, 35694, 43800, 52295, 53706, 49158, 42317, 35515, 30099, 24650, 19652, 15700, 16528, 15524, 14854, 12053, 9536, 7599, 8214, 9898, 10635, 12481, 12601, 9755, 7296, 7530, 8396, 9202, 8208, 7253, 6576, 7052, 6051, 4611, 4779, 5806, 5928, 3693, 2013, 904, 1217, 2095, 3007, 3734, 5337, 6578, 7215, 5869, 4372, 6686, 6132, 7420, 9724, 12486, 16144, 19835, 24381, 30852, 37160, 36822, 33629, 30506, 26241, 23090, 18784, 15394, 13850, 10813, 8881, 11746, 10555, 7811, 6362, 5463, 4707, 2669, 4110, 5726, 3965, 2169, -576, -2063, 1158, 4407, 4271, 4205, 7439, 5858, 5972, 7022, 6524, 5665, 6052, 7106, 6809, 7008, 7847, 6968, 6518, 6392, 6268, 6741, 5089, 1531, 341, 1432, 2611, 3062, 2392, 3808, 4631]
10798D631M97J032j414l863k69J182l75N27R82J228q79K05J190l90N70j426o68
10781B760K326O25k559n74j757J065M59J37J607J048N16j691q7K50J770J670J285
10764H850K296p26n92P91l927j721j500L631L583o31m77k595j302k940j98J485
10748D027R86J602j271M55J96Q6r36l81J553J035l50j942o46p95j710j844m68
10731d03J583N90k472o46M03k94O46J872P72K625J78j604J549l76J300K524k835
10714E412k546p75k658M67K94M93J318K071j205j603P94O53J749j35K18j87k296
10697B064j276j781q13M05J911L51K51k51j040j444J599K372m46k004j342L33
10681a111r20j356o22K95L480L170l035J522Q94J180j42j618o07j301M81J501
$$ y = [4631, 5128, 6160, 4746, 883, 614, 1796, 1421, 1948, 2930, 4158, 3279, 3484, 4674, 4284, 4854, 3428, 2760, 5086, 5711, 3152, 2578, 821, 1886, 2345, 2482, 4089, 5137, 5653, 3962, 3875, 4125, 5895, 7565, 8850, 11146, 10420, 9828, 10619, 6692, 4971, 3471, 7102, 10685, 10054, 9577, 6982, 5680, 2740, 2542, 4027, 5013, 6615, 5344, 5799, 5995, 6081, 5145, 4764, 6317, 7352, 7002, 5060, 4414, 3619, 1909, 65, -403, 1180, 1770, -702, -1348, -945, -1239, -593, 1279, 2051, 4676, 4854, 3250, 4799, 4423, 5723, 8247, 5412, 2866, 2091, -567, -100, 194, 687, 2005, 4076, 2871, 1268, 2062, 2715, 4464, 4329, 4547, 4360, 2064, 788, -993, -1806, -1401, 510, 861, 1112, 861, -179, -1623, -24, 2348, 1902, -102, -1444, -1111, -2031, -3387, -4009, -3714, -234, 2936, -99, 1423, 2317, 3497, 3355, 1737, 1130, -171, 310, 1811]
10665A811J591k98r56K795l203l048J824K510R56j307j677J218q84j445J12J817
10649A816P98j099p91j742n04Q21K692L22K036r65r69L43j547j296n10J251K366
10632C022J399j631j992j911M4M23M13K160J525K53j941m31J282o71j207j246
10616e09J436J951o07L85K634Q06k757l241P30K339Q14j829K598J893j796k306
10600B541j885Q8n52J292l529P1J899J265n92n34K11K83k29p49p91p25K01J740
10582El25P40P43J660p27j526J032J37K094o64P83P29j371J67N77k073j97J953
10564C737K081P83l43j673l157r23R77J619J153Q66j394n4M29J20J141j111p7
10547D174J324J29j400R86L139j934m639r92M48P50l88K462J318N93K610P0j374
$$ y = [1811, 3402, 3104, 2148, 4943, 1740, -1308, 516, 3026, 3982, 2675, 998, 2216, 1332, -113, -1, 1816, 2614, 1515, 724, -1018, -1522, -701, 1991, 2313, 4349, 3384, 2415, 2758, 1211, -85, -595, 656, 3022, 4421, 2790, 798, -1113, -1069, -646, -233, 1927, 3452, 3705, 1764, 1333, 2615, 1944, 737, -509, 927, 2878, 2271, 2656, 5290, 6096, 3339, 98, 828, 3167, 3981, 2152, 4750, 6643, 4847, 2541, 656, 744, 192, 1484, -2045, -1974, -75, 1190, 598, 64, 275, 558, 329, -420, -1211, -1936, -1735, 5, -320, 420, 1163, 2823, 2096, 570, 1602, 1739, 3833, 3169, 3952, 4681, 3310, 3477, 4054, 1981, 1784, 3737, 5818, 6601, 6258, 4585, 1428, 505, 1482, 3101, 4254, 5120, 3726, 3672, 4101, 4221, 5362, 4251, 4174, 5498, 5627, 4227, 5213, 8352, 6418, 1779, 787, 1235, 1985, 1597, 4059, 5377, 5970, 8580, 8650, 7276]
10530G276J98J916M861L273P380Q440O487J1639Q314L293L11n842o698j0554j2130
10515B8164p003m178l084j024K061j581l394l57q69k748r30J985K628K152k118
10500I704k354L82l080k979k019J414L630j135o46R39r40j508j107J543K387J138
10484E369K314K111L07j242J135L033L989M615O315Q974P542R831O159j507l189
10469E5756j98p464j1906p635p119n750k386n68j523M07m83R69K00j492m04J532
10453A1936j043n6j486J054J985k304j983j664j7P4j648j45J461K94O15k064j682
10436C327n54Q35Q33N49Q83k236n78K403L603j470k291K277J137k453P5L24j280
10419E384P70J207N66J215N80l74m081j79R09L625n23j500J472j529j836k521
$$ y = [7276, 7474, 9390, 14251, 17524, 24904, 33344, 39831, 51470, 59784, 63077, 63388, 57546, 50848, 40294, 28164, 21161, 16983, 13899, 12875, 14936, 13355, 9961, 9604, 8735, 5987, 5057, 7042, 9670, 11822, 9704, 7350, 7732, 4652, 1673, -346, 1068, 4698, 3563, 2917, 3856, 2916, 1408, 301, 1844, 4231, 5369, 7683, 9794, 10101, 8859, 9994, 13027, 17016, 21631, 27946, 36920, 44462, 54293, 60452, 58945, 55756, 55558, 48094, 36188, 28553, 21434, 15684, 13298, 12730, 11207, 11614, 11131, 12100, 12300, 10808, 10404, 11936, 10893, 10837, 9351, 10405, 12390, 10086, 8103, 6439, 6422, 6496, 4848, 4703, 6164, 6458, 7073, 5009, 3327, 2773, 3608, 4441, 4990, 5873, 3637, 3059, 5462, 9065, 7595, 5304, 7581, 8718, 6265, 6340, 6664, 5384, 6154, 7361, 7927, 9142, 9722, 9348, 5267, 5088, 5997, 9622, 9099, 7599, 9071, 7542, 5706, 3185]
10403C185k683K326J621k56l1K351rj829J590J792j420m78k388j97K181L305n29
10386H531j440J51M72Q23O52l62j274N71J202J620j690K48L135k67k949Q53O82
10369A0958n37J821K71o69l10K56j93o3K79L77j158r17L07O6n41j87J031P82j012
10350A0561p27J219q29j197j448m4k935K97K135N47P19j116O28J346Q65L189J120
10333A4330k273l316r34J263j282J224K790j08J237K797L18J592m15j987o67J929
10317A6498k311m491j345j252p09O25j322j206q79J883O89j594n82M829j4j562
10301G257j303j580K699L051l712j017j972n84k87J528O19J036j455j167p06J501
10285C908M91K65J862J736M01j096j384m50N06J346j273K05q17j342O82M169K964
$$ y = [3185, 502, 2828, 4449, 4193, 4162, 6513, 6504, 4675, 6265, 8057, 6637, 6159, 3771, 3574, 5755, 9060, 8531, 7091, 7242, 7714, 8537, 9189, 8827, 7553, 8124, 9326, 10946, 9256, 9504, 12639, 12372, 9423, 10276, 10958, 10421, 12242, 12513, 11844, 11534, 11790, 11597, 11534, 11813, 12190, 11032, 10115, 10422, 10488, 9947, 9760, 10791, 11573, 10561, 9834, 11053, 10224, 9027, 7579, 7535, 4600, 4897, 7032, 7579, 8298, 7182, 7810, 9156, 10021, 13210, 14330, 12057, 8741, 7807, 9070, 7788, 9012, 11802, 11694, 12931, 15728, 16046, 17638, 17223, 15236, 14569, 16498, 14187, 9696, 8351, 7099, 6390, 7015, 5693, 4487, 3608, 5491, 6180, 4586, 4004, 8833, 8819, 7257, 5954, 4374, 7073, 10124, 6412, 5395, 3423, 2839, 2552, 4080, 4699, 5735, 4280, 3113, 2407, 3908, 4399, 4664, 6526, 8262, 8663, 7567, 6183, 5733, 6239, 7585, 6312, 6517, 5700, 4358, 5040, 9209, 12173]
10268A2173r62k907j488r33K741K696K747o94l710l301l203J575J854j29K257
10253H716K927K492O65J739J688Q90J159J959o2j857m13J016K379K702K652K571
10237C1223j031l1j79m24l291l576l532q58O92J30o1K3J260j75j938L366M364
10220B5962k178k570O24J265k506j109N15n86q35O96K33K204K439K528K816O683
10204C6181M659L902L197N14j614m167q236n780l087J7q09J261J130j040L860
10189B9988K426J822n4j894k54j078N40J508j589K06J000K735k144k142J702k75
10173C2497R40J225K603j232K328N766N271N043P34q81j840P37K024L556J781
10158F0552J106L551R73N22j598M28L384K457K543N493R386J5218K0871K3844
$$ y = [12173, 11211, 8304, 6816, 5883, 8624, 11320, 14067, 13373, 9663, 6362, 3159, 4734, 6588, 6459, 8716, 11643, 14135, 14800, 16539, 18227, 19117, 20276, 22235, 22173, 20316, 19903, 20919, 23298, 26000, 28652, 31223, 30192, 30161, 29982, 29558, 26267, 22691, 19159, 18301, 18993, 19123, 19062, 19085, 20345, 20170, 18232, 21598, 25962, 23784, 21214, 21838, 23103, 20597, 19488, 20003, 19417, 18582, 19278, 19511, 21715, 24154, 26682, 29498, 36181, 40840, 44742, 47939, 48453, 46839, 42672, 34436, 28656, 25569, 25586, 24777, 26038, 27168, 26128, 29988, 32414, 34236, 34182, 32288, 32034, 30956, 31496, 33004, 31415, 31621, 32621, 35356, 33212, 31070, 32772, 32497, 33437, 34662, 37265, 36033, 38361, 44127, 49398, 54441, 55175, 54294, 52454, 53191, 55215, 58771, 60552, 61658, 65209, 66182, 66704, 65106, 65534, 68918, 71375, 73918, 79411, 88797, 104015, 124886, 148730]
10144A48730K8499L0394K3008J4807J2073J3776O120N683J3340J1522J8462L0318
10132C56732L6021M9382O2408Q2439J19066J64738K47284M10496P17653J160483
10122C406702J506416J936243K225173J230540P90370L15342j688267j738037
10114G984482j490380j748051j218015p01189m46962l21413k51373k08468j68705
10105A429926j30420j07625q3494o6940n7742m5235l9777m1094l5543m2385m5249
10094G34422l3907l0737l0283k6092k0690k0021j9247k2118k1506k1655k0852
10083D67314j7766j7702j6021j3234j3866j5225j3574j1730j2592j0068o810p286
10071C11440p030j0428p822o326p243p467n328o817o924p572n275o232p940p760
$$ y = [148730, 177229, 207623, 230631, 245438, 257511, 271287, 277407, 283090, 296430, 307952, 326414, 356732, 392753, 442135, 504543, 586982, 706048, 870786, 1118070, 1528566, 2246219, 3406702, 4913118, 6849361, 9074534, 10305074, 11095444, 11410786, 9722519, 7984482, 6494102, 4746051, 3528036, 2826847, 2379885, 2058472, 1807099, 1598631, 1429926, 1299506, 1191881, 1108387, 1041447, 983705, 938470, 898693, 857599, 822056, 779671, 734422, 700515, 669778, 639495, 613403, 592713, 572692, 553445, 531327, 509821, 488166, 467314, 449548, 431846, 415825, 402591, 388725, 373500, 359926, 348196, 335604, 325536, 318726, 311440, 304410, 293982, 286160, 279834, 272591, 265124, 259796, 252979, 246055, 238483, 233208, 226976, 219036, 211276]
10057B11276q107n987n643p874l907k711j739q22j922j228l806n035o020l807
10043A52668k782J453o98k493o085o655n710m469j411m797m393j773p63Q58j670
10028A11280m559l707j161j733j931k356n244n069l883l368k751P02M87k441m738
10013F9528o06q33l609p04J580J229n61k543m3k543r53l877l180J544n68J414
9997E5275P3k340k579j385J026J098l905k333J154k949j113R82K664L128K18L36
9981D9350k630j583m50l89j451j70o68J597K053J446M007Q00J385J826k83O323
9965F1163P339N455M591J0247J9386L0880N2838R0576J83714L01220K84557K31524
9953A283490J05745l67906m02350k00418r4240m9118l2453k6258k6760k4509j4737
$$ y = [211276, 203169, 197182, 191539, 183665, 179758, 177047, 175308, 174486, 172564, 171336, 167530, 162495, 156475, 152668, 149886, 151339, 150641, 148148, 142063, 135408, 129698, 125229, 123818, 119021, 114628, 112855, 112092, 112950, 111280, 106721, 103014, 101853, 100120, 98189, 95833, 90589, 85520, 81637, 78269, 75518, 76220, 76707, 74266, 69528, 68922, 68089, 64480, 63776, 65356, 66585, 66024, 63481, 63438, 60895, 59942, 56065, 52885, 54429, 53861, 55275, 55348, 53008, 50429, 49044, 50070, 51168, 47263, 44930, 46084, 43135, 42022, 43004, 45668, 48796, 49014, 49350, 46720, 45137, 44687, 44298, 42847, 42677, 42009, 43606, 45659, 47105, 51112, 51912, 53297, 55123, 54840, 61163, 68502, 73957, 78548, 88795, 108181, 139061, 191899, 282475, 466189, 767409, 1051966, 1283490, 1389235, 1021329, 618979, 418561, 324321, 275203, 242750, 216492, 189732, 165223, 150486]
9942A50486j0890r857n316m204n464m337j875k545k293m489q285q613k190k670
9928G7458k355j737k073k465p31k36J06k180l158k672n477m695q60j787m8j030
9912D6060K921J623Q1m824l248k43k392N37M33J365j56k029j509j117O25M62L02
9895C8891M69r88o76m2J468k004N76o50J067k08k075l240j61P7J04j64k049J163
9877C1558p64j213m050L75L228L074Q42j630r95k356q86K895J958j693k217j424
9861B6702p34n65J815K414J56n48K269K009l29N33J542K371J525J6j555k209k499
9844C2913k246m886j153R02k080O86P35N61j621J600ko36K79o2k714j923m70M092
9826B3975M03k868j557R43J986l87j064l355k26n98J038K708l61j8n97j191jR99
$$ y = [150486, 139596, 129739, 124423, 120219, 114755, 110418, 108543, 105998, 103705, 99216, 90931, 82318, 80128, 77458, 75103, 73366, 71293, 68828, 68097, 67861, 67967, 65787, 62629, 59957, 54480, 49785, 48925, 47138, 47090, 46060, 48981, 50604, 50685, 45861, 42613, 42370, 39978, 40515, 40948, 42313, 42157, 40128, 38619, 37502, 38127, 38589, 38891, 39360, 38372, 37696, 37654, 39122, 37118, 37694, 37044, 38111, 37903, 35828, 32588, 32427, 32504, 32608, 32444, 30395, 31558, 30794, 29581, 25531, 25906, 29134, 32208, 33050, 31420, 30425, 28069, 27183, 30078, 32036, 30343, 28126, 26702, 25968, 25403, 27218, 29632, 29788, 29240, 31509, 33518, 33189, 33722, 35264, 37635, 39160, 39176, 37621, 35412, 32913, 30667, 25781, 24628, 25530, 23450, 24136, 24871, 25432, 23811, 25411, 25409, 24773, 25052, 24990, 22276, 20353, 19883, 23975, 24378, 21510, 19953, 20896, 22882, 22495, 21431, 18076, 17850, 17252, 18290, 20998, 20637, 20619, 20022, 18831, 18830, 19829]
9808A9829J716o72j824O42O90M460L033j017j899O84L25k542J271P71j997q56
9792B2614j72K517J339K16P90R89R6r93J38m4j375K93K12J33K234K344j143J27
9774C0315p8J710K047Q8P47q29q39l497L35L397Q25J440j550k814k00P85j824
9757C0058n7J364k89q65N30j187P31J038J375K901o12l55n29N97O66m47J213J351
9739C7483j360r03Q20J836k019K70J317P50j70m07j115J95j421j253R59J123J745
9722C7850p11j81J215L010J477j93L349O739Q130J1935J3492Q067L664L887o384
9707I5346p835q993r339m978m650m254k381r62R18O42j822k533l029J252P83j004
9691D7161j294J363J241r90o75K405N74R57n60k041p04k771k283L632L643J036
$$ y = [19829, 21545, 20873, 19049, 19691, 20381, 24841, 27874, 26857, 24958, 25642, 25967, 23425, 24696, 25467, 23470, 22614, 22442, 24959, 26298, 26514, 27304, 28293, 28389, 27396, 27534, 27490, 26115, 26408, 26620, 26753, 28987, 31331, 30188, 30315, 30237, 31947, 33994, 34082, 34829, 34000, 33161, 29664, 29999, 33396, 34221, 35661, 34111, 31297, 31097, 31882, 30058, 30001, 31365, 31076, 30211, 30741, 29554, 30285, 31323, 32698, 35599, 34987, 34632, 34103, 34700, 35366, 34919, 36132, 37483, 36123, 35220, 36040, 37876, 35857, 36127, 37444, 38194, 38024, 37617, 36502, 36697, 35276, 34023, 34982, 36105, 37850, 37139, 36958, 38173, 41183, 42660, 42467, 45816, 52555, 60685, 72620, 86112, 94179, 97843, 101730, 95346, 87511, 78518, 69179, 64201, 59551, 55297, 52916, 51954, 52872, 53514, 51692, 49159, 46130, 47382, 48165, 47161, 45867, 47230, 48471, 47481, 46806, 49211, 49785, 50742, 50182, 48141, 47437, 44666, 42383, 46015, 49658, 50694]
9675E0694K620K329O51j081n68j296K97m4N04M06j669k527j566J427K837K731
9659E5745J589q08k27r38r67j136J514j27J465K569L5P26J362J602K225P09K47
9642F5585M583L121J175L644N964L374K580M536Q557J2788J6025K1996L4170N4579
9628B42677Q1818R5761J02510R5616P2016O9650P1222N0271k9273r8226q4144
9617F69898m8782n4861r2291r9490p2388m4657k7433j9013j5342j3434j1575o127
9605A64505n373n246n575m200j018k343n664o400n197l563k306o727l590k809
9591A04494j039N27k476L61q22l459m849j842P53j890q79o72j52j537j709l060
9575H1749J63K187K67O91k588k389l003Q85P56m96J474j890l643j578k51J389
$$ y = [50694, 53314, 55643, 56294, 55213, 54645, 53349, 53646, 53602, 54106, 54512, 52843, 50316, 48750, 50177, 53014, 55745, 57334, 56526, 56299, 55361, 54394, 53258, 54772, 54645, 56110, 58679, 58714, 59440, 60802, 62404, 64629, 65338, 65585, 70168, 73289, 74464, 78108, 84072, 87446, 90026, 94562, 103119, 115907, 131932, 153928, 188098, 242677, 324495, 420256, 522766, 618382, 690398, 760048, 831270, 881541, 852268, 754042, 669898, 621116, 566255, 473964, 374474, 302086, 257429, 229996, 210983, 195641, 182207, 170632, 164505, 159132, 153886, 148311, 144111, 143093, 140750, 135086, 128686, 123489, 119926, 117620, 110893, 107303, 104494, 103455, 103982, 101506, 101867, 101045, 97586, 92737, 90895, 91648, 89758, 88879, 88207, 88055, 86518, 84809, 81749, 81912, 84099, 84366, 85057, 82469, 80080, 77077, 77962, 78718, 78222, 79696, 77806, 74163, 72585, 72334, 73723]
9559G3723J280k465k224L414J617k516l457j387J673K886N74j072l601J167M54
9544G0066j835k531j51K103K064p3l122l164J230m52L98J088k162j241J104Q72
9528F4194k877l650m57J960M743J985k545j560k31j382j684j875j547O03k785
9513E2892j135j66J854L613K131M92l30j094k358j520J425J80j00L079L59n020
9497E4302k628O65K159j103k441p67J1P91j093j039J523j61q15j936M3o05l3j736
9479D5137k227J382q27L77L28M55K908J334p59k353O09j005J63J130j525j451
9463D3676j177J678r81j940J633K26J115j832k484N49j807Q71K318M04K67J039
9447D3555R35q94k536j848o03R4K101q7k073q97J661K029m01M36p73j766P30K023
$$ y = [73723, 75003, 72538, 70314, 73728, 75345, 72829, 69372, 67985, 69658, 72544, 73118, 72046, 68445, 69612, 70066, 68231, 65700, 65549, 67652, 69716, 69643, 66521, 63357, 64587, 64135, 64533, 65621, 63459, 62218, 63322, 64194, 61317, 57667, 57210, 59170, 63913, 65898, 63353, 61793, 61562, 60180, 58496, 56621, 55074, 55677, 52892, 51757, 51591, 53445, 57058, 59189, 59681, 59351, 58257, 55899, 54379, 55804, 55984, 55884, 58963, 59322, 54302, 51674, 52339, 54498, 53395, 50954, 50187, 50198, 50989, 49896, 48857, 50380, 50219, 49404, 47468, 47511, 46906, 46873, 45137, 42910, 44292, 43465, 43842, 44170, 44625, 47533, 48867, 48108, 45755, 46364, 45359, 45522, 46652, 45127, 43676, 42499, 44177, 43196, 41256, 42889, 43115, 44230, 42398, 39914, 40463, 38656, 39527, 41845, 42249, 42516, 43555, 44490, 43596, 41060, 39212, 38609, 38703, 40804, 40717, 38644, 37747, 39408, 41437, 41036, 41472, 40699, 38933, 39663, 41686]
9429D1686p81j430N5m088j490P36L224j25k898k45K111m4j856K105K194P77j54
9412C9777k607j446q84N12m43L96k061n66j167L39k67r93L351P99o78M01k82l666
9394C0515k91J614r4O43J106q47k658j132l88j662K773N74J409M58j769k013R57
9377B9195L299L55j738j852r20Q93O61m6m01O14j102j520k408k05J443Q95J156
9360B8319l2k07k93k001l28K109K660Q22j541o90o79j185Q07O79k960P52K71j135
9342B5368Q52j87J558k697J89K037K644Q86k253k300m612k9K791J556J02k131
9326B3774r81P75J218K28N23r75n75p74r39k311o61J062Q47r88R25P10J10j682
9308B0286l018P40K041J46P0Q61J726j207m35O17j7J87J582k97m25j324k368j518
$$ y = [41686, 40905, 39475, 39530, 35442, 33952, 34688, 37912, 37787, 34889, 34644, 36755, 36711, 34855, 36960, 39154, 39931, 39777, 37170, 35724, 34840, 35352, 34909, 35305, 33244, 32678, 31511, 31850, 31583, 30590, 33941, 34740, 34062, 34463, 34181, 30515, 30224, 31838, 31744, 32387, 33493, 32646, 29988, 28856, 28468, 26806, 29579, 30153, 31562, 32020, 30251, 28238, 29195, 32494, 32849, 31111, 29259, 28339, 29232, 29893, 29847, 29446, 30060, 28958, 27438, 25030, 24825, 26268, 27163, 28319, 28287, 28080, 27787, 25786, 25458, 27567, 30227, 31049, 29508, 28818, 28139, 26954, 27761, 28440, 25480, 26232, 26503, 25368, 26220, 26033, 27591, 24894, 25083, 27120, 29764, 30650, 28397, 26097, 21485, 21456, 24247, 25803, 25905, 23774, 22793, 23568, 24786, 25014, 25537, 24562, 23987, 23213, 22274, 19963, 19302, 20364, 21211, 20223, 21148, 21858, 21968, 20286, 17268, 18008, 20049, 20195, 20265, 21126, 22852, 21645, 21210, 21827, 21810, 21997, 23579, 23282, 22857, 21533, 19165, 17647]
9290A7647K598K563J76j875j123k296N14j019J63J471L83j289m99Q02k31k06m65
9273A7314P1J134q86j179N93J056K13J115J244j592j129J415j61j085r31p60L63
9256A6795r44k05J984J438K40J036q93J588q20P18K180%k197J315L99j334j973
9239A9327K96l26l460j500K487P06j136j289J885l9j414O0N97k68j521r46l69
9222A3090J696k804o07N6r93K830K263J052l5m69K263R10j76K090K730J311l258
9205B1949k367j783M21m67k001K24o31k03L122J411k05l84m36k096l06k918l019
9188A0311R10K452K512j967l7p70K589J434l43l068p33Q78K044M42r58j894k342
9171A1460q32L48M41J112L45q99m29L24m80o5J729L832R42k914j698m96n07K307
$$ y = [17647, 20245, 22808, 22984, 21109, 19986, 17690, 18204, 17185, 17348, 18819, 19202, 17913, 17414, 18216, 17985, 17779, 17314, 17385, 18519, 17633, 16454, 17047, 18103, 18316, 19431, 20675, 19083, 17954, 19369, 19208, 18123, 17192, 16432, 16795, 15851, 15646, 17630, 19068, 19308, 20344, 19451, 21039, 20219, 20937, 23117, 23117, 20920, 22235, 22634, 21300, 19327, 19623, 19297, 15837, 14337, 16824, 17530, 16394, 15105, 16990, 16951, 15537, 15597, 16194, 15926, 14405, 13459, 13090, 14786, 11982, 11375, 11431, 10438, 13268, 15531, 16583, 16548, 16079, 18342, 19252, 19076, 21166, 23896, 25207, 21949, 19582, 17799, 18220, 17753, 15752, 15976, 15345, 15142, 18264, 19675, 19470, 19086, 18650, 16554, 16248, 13330, 10311, 11221, 13673, 16185, 14218, 14181, 13411, 16000, 17434, 17091, 14023, 13290, 14168, 16212, 16654, 15696, 13802, 11460, 10628, 10976, 11417, 12529, 12874, 11975, 11546, 11870, 11390, 11325, 13054, 16886, 17828, 14914, 13216, 12720, 12213, 14520]
9153A4520P81N32L20j004n16N86r04j487l479k804n75J226J796m9Q9J627J446
9136A2105j544j329j30Q81N47P81q34J00mJ34l83j198K4P8q2K48J748J220J306
9117A3668j400j320j426J240J21K68J536J33j366j474K07R07K738K346K25j936
9101A4467j848n00o69P29R17l44O67l093j76J398N46o23o51J134j92M4l23J034
9083A2517j773q11l35J614j125J287M92k152r51l024J719K836R35M04j91l036
9067H406j425K933Q37j056k253M62L867J700j553p94J002J090j144o92N46O02
9051A2528j763j004J141Q44k100k93n78p74K82n11j848J269n81n30l27J146R7
9034F998K782M35r6r57J11o12O74P21n84m8J227K70j464O69k400P74K353j891
$$ y = [14520, 15301, 15833, 16153, 15149, 14633, 15219, 14315, 12828, 9349, 6545, 5970, 7196, 8992, 8943, 9032, 10659, 12105, 10561, 9232, 9102, 9983, 10530, 11311, 10477, 10577, 10573, 10707, 10324, 9126, 9150, 9228, 9146, 9394, 11142, 12362, 13668, 12268, 10948, 9522, 10762, 10883, 11151, 12687, 12820, 11454, 9980, 10187, 11094, 13832, 16178, 16403, 14467, 12619, 12119, 11450, 12179, 13096, 12752, 13419, 10326, 10150, 11548, 12094, 11471, 10820, 11954, 11762, 11806, 11483, 12517, 10744, 9933, 9598, 11212, 10087, 11374, 11866, 9714, 8763, 5739, 7458, 10294, 11229, 11633, 11442, 8406, 6981, 9914, 10751, 9695, 7442, 7904, 11771, 13471, 11918, 11124, 12126, 13216, 12072, 11380, 11926, 12528, 10765, 9761, 10902, 11746, 9646, 9353, 8775, 8001, 8283, 7772, 5924, 7193, 6612, 6082, 5755, 6901, 6998, 9780, 10215, 10119, 9162, 9273, 8661, 9335, 10056, 9472, 9424, 10651, 10921, 9457, 10126, 7726, 8500, 10853, 8962]
9016H962k575R74J747R0k002N27K640J51o15j578q25p14j781q77L30N44J190O75
8998F863L112J126k048r05p94k849J68K779J131J830j397r91q79n52M10N99j391
8981F212k806J601j237K11M92J831Q9J203j627O48j210j143J666k50J050j310
8965E420r91j39k873j439K379K835O19J263L763j791m564l38K16K320L575J505
8949A1760n15k297j338R8K2j081k007j775L417L142j117k184m418K00J817k573
8933A151J119L631K13q78n09m02J454j450k83M03J97n05J140K15J88k98P29p15
8915E400j615k6r57m59J830K559K546M06m14P2q07k103k82j332n44J682j298l55
8897D303J111m14k084p9r10R3J22O92K890J445J058j96j438m485J071K746J598
$$ y = [8962, 6387, 7361, 9108, 9198, 7196, 7723, 10363, 10514, 9899, 8321, 7496, 6782, 5001, 4124, 4454, 4998, 6188, 6863, 9975, 11101, 9053, 8148, 7354, 4505, 4673, 7452, 8583, 10413, 9016, 8025, 7146, 6594, 7004, 7603, 6212, 3406, 5007, 3770, 3981, 4473, 6304, 6393, 7596, 5969, 6617, 5407, 4264, 5930, 5680, 6730, 5420, 4429, 4290, 1417, -22, 2357, 5192, 5811, 7074, 10837, 9046, 4482, 4144, 4360, 6680, 10255, 11760, 11245, 8948, 7610, 7708, 7730, 6649, 4642, 2867, 6284, 9426, 8309, 6125, 1707, 1907, 3724, 1151, 2270, 5901, 6114, 5236, 4727, 4325, 5779, 4329, 4046, 4449, 4646, 4141, 5281, 5496, 5684, 5386, 6115, 5400, 3785, 3759, 2802, 2343, 4173, 6732, 9278, 9684, 9270, 9342, 8535, 6432, 6150, 4818, 4274, 5956, 4658, 4303, 5414, 5000, 2916, 2837, 1927, 2020, 2142, 2834, 5724, 7169, 8227, 8031, 6593, 2108, 3179, 5925, 7523]
8880G523j843p58j123j028j469J848K117L090j377j092k234L49J602P40M41j308
8864E478k893j053J216J473N04J364k85o36N17q23q65J75J138K19K256j152j733
8847D900r73K127J536J194P86J381K636R94q98k595j003P32J665o30qL923L525
8830A9292J084J086p50j750M01j994k174j248l892k120j793K19N28r36p67P26
8814E912Q48j400j060l6K7Q8k328l269J434J922Q51L437J051j030k00l43M52R7
8796F453J703j36J8j696j59J316q03k009L93J971J500R43n38k440J095R31n1K324
8778A0815L284L944J981J38J433j014j573n485p21R02Q41j287k490k373j609k82
8762F504k429q09J72J53M55J044r48l45J059j159R60L888j166q29J529J387L80
$$ y = [7523, 5680, 4922, 3799, 2771, 1302, 3150, 5267, 8357, 6980, 5888, 3654, 4003, 5605, 6345, 6786, 5478, 2585, 1532, 2748, 4221, 4725, 6089, 5804, 5168, 5685, 4862, 3997, 4172, 5310, 5529, 7785, 6633, 4900, 3927, 6054, 7590, 8784, 9570, 10951, 13587, 14581, 13683, 11088, 10085, 10817, 12482, 11852, 11844, 15767, 19292, 20376, 21462, 20712, 18962, 19363, 17369, 15195, 13947, 10055, 7935, 6142, 6361, 6889, 5953, 5186, 5912, 6760, 5360, 4300, 4264, 4291, 4379, 2051, -1218, 216, 2138, 2989, 6426, 7477, 6447, 6247, 5904, 6356, 6453, 8156, 8020, 8038, 6342, 6183, 7499, 6696, 4687, 5080, 7051, 8551, 9494, 8956, 6516, 7611, 8542, 8491, 10815, 14099, 18043, 20024, 20162, 21595, 20581, 19008, 13523, 12802, 13704, 14545, 13258, 10768, 8395, 6786, 6504, 4075, 3266, 3438, 3591, 4046, 5090, 4142, 3797, 4856, 3697, 4657, 8545, 7379, 6550, 8079, 9466, 9846]
8745I846J664k495l446J967K537R01k722j303O96O43n50l38j084O01k21N16j51
8728G061K03m33j714R44R53P30L40q23O80L744M299J89l836j641p88O47J251k134
8710I672k424q43m044L38K232J81m09M351K955Q55j462j802k09q45j539m18O79
8693G268K810K777j075j385n80j703j082q71k967J512O96P23J699o32r84O11O16
8676G433j340N69K009J002P61r07M17kk081l637k727O31k86p51n54L783J439q03
8658D956K67Q07n47p5J07k470J420J5n13o2m54j55Q66o43k08N56L57o06j213J919
8638D324J067q03k804K649K548k453j632L74J419L171l15K585J475j994k710Q46
8622G747J802L57J9j744j010j529J195n24j780j857R33L618j15k39q73k016r52
$$ y = [9846, 11510, 9015, 5569, 7536, 10073, 10974, 8252, 6949, 7645, 8288, 7738, 7400, 6316, 6917, 6696, 7212, 7061, 7264, 6831, 5117, 6061, 7014, 7744, 8084, 7261, 7941, 11685, 15984, 16173, 12337, 10696, 9908, 10555, 11806, 9672, 7248, 6405, 2361, 2699, 4931, 5112, 4703, 9054, 12009, 12864, 11402, 9600, 9391, 8546, 7007, 6589, 7268, 10078, 12855, 11780, 10395, 9815, 8112, 7030, 6159, 3192, 4704, 5400, 6123, 7822, 7190, 6206, 6817, 7433, 6093, 6662, 8671, 9673, 10434, 9527, 9944, 9942, 7861, 4224, 1497, 2128, 1842, 1091, 537, 4320, 5759, 4956, 5223, 6030, 5483, 5408, 5515, 3045, 4465, 4480, 3967, 3905, 3451, 3296, 4162, 3519, 3311, 3867, 4224, 3618, 2405, 4324, 5391, 4588, 1784, 4433, 6981, 4528, 2896, 3270, 4689, 7860, 7545, 10130, 11605, 9611, 6901, 7747, 9549, 9906, 9925, 8181, 7171, 5642, 6837, 6313, 4533, 2676, 3609, 7227, 7112, 6873, 6000, 3984, 3032]
8605C032j470Q37K268L131m70o44m14J244M00R31j935r74J635j35J941o34k442
8588F301K42L033j229k670j342j174m46j239J958K00J756N71j493q74r28J615
8572D281L83j118K52K186j384Q02K769r24K80n56L55k986p89K590O46m23K232
8555H596K216q0K280K436L345J661j348k247k242p03J158J840k006j163O137R171
8539B9051P521Q068L207l604j0861j0120n247j536O93O76N36K54K025j266k185
8524A7212j733l526K38M96p26l736J123K934P58j129J066M968o28k424J594K987
8508A9474Q87J259J502J032J063r22K966M775P008R576Q555J684q789j4591r071
8493B6408l536k444j728m5J57m91N66p51l962j659N72n64r88O94L401r7j412M77
$$ y = [3032, 1562, 2399, 4667, 7798, 7328, 6684, 6270, 7514, 7914, 8845, 6910, 5936, 7571, 7436, 9377, 8743, 6301, 6543, 9576, 8347, 5677, 4335, 3161, 2715, 1476, 3434, 3634, 5390, 5961, 4468, 3594, 2666, 4281, 4664, 3546, 3798, 5984, 4600, 5402, 8171, 7247, 7527, 6971, 7326, 4340, 3551, 6141, 6787, 6364, 8596, 10812, 10732, 13012, 15448, 18793, 20454, 19106, 16859, 14617, 13914, 15072, 16912, 14906, 13743, 19880, 29051, 36572, 44640, 47847, 44243, 33382, 23262, 18015, 16479, 17172, 17848, 18384, 18638, 20663, 19397, 17212, 15479, 11953, 12191, 12687, 11961, 8225, 9348, 12282, 13040, 11911, 12977, 17945, 17317, 14893, 16487, 19474, 20361, 21620, 23122, 24154, 25217, 24295, 27261, 32036, 39044, 48620, 57175, 58859, 50070, 35479, 26408, 22872, 20428, 18700, 18655, 18812, 18321, 18887, 18136, 14174, 12515, 13087, 12523, 11535, 12229, 15630, 15533, 14121, 14598]
8475A4598L97j74j404J576M541Q345J3762J9848K2163J9830J0011r640k7681k1678
8461E4494j2427p913m384l426j787k090j900k588l550j055K611J356k33k553j570
8446A2985q0J289p04j446J344K792l050j973j11M25J365O63K809l56J148J474
8430A8574L19q1M242N777J0190K2335L3016M6521M4321L2410p0m9767n5073l3297
8416G9417j8750j2708p615l262l510l157l329j362o34k935j652L55k375m753k091
8401A1639J253K093l46Q05k06J234J821m82p06M48r21O65j064L01k676J007K118
8384A6983K998K65J394R275J5780J9610K2897J8448P568j5060k7733k2129j2799
8371C7497p056m319k680m488k788l893J360K945k672r6n68r47l420k265R84m91
$$ y = [14598, 14995, 14821, 13417, 14993, 19534, 27879, 41641, 61489, 83652, 103482, 113493, 103853, 76172, 54494, 42067, 34154, 29770, 26344, 24557, 22467, 20567, 17979, 14429, 13374, 15985, 17341, 17108, 14555, 12985, 12905, 14194, 13490, 12044, 13388, 16180, 13130, 11157, 11046, 11471, 12836, 13499, 16308, 15952, 17100, 18574, 18893, 18812, 23054, 28831, 39021, 61356, 94372, 140893, 185214, 217624, 217554, 167787, 112714, 79417, 60667, 47959, 40344, 37082, 33572, 30415, 27086, 25724, 25090, 22155, 20503, 20858, 18483, 13730, 11639, 12892, 14985, 14639, 15444, 15238, 16472, 18293, 17811, 17105, 17553, 16632, 17297, 16233, 16534, 13858, 14865, 16983, 19981, 20246, 21640, 30915, 46695, 66305, 89202, 107650, 115218, 100158, 72425, 50296, 37497, 30441, 26122, 23442, 18954, 16166, 12273, 13633, 16578, 13906, 13810, 13242, 12295, 8875, 6610, 7594, 7103]
8355G103j356n14N53L043J380K34N27R86j482m233J98J484j103j120j289J425
8339E836K345L265K40j675j470l41j409k499Q87k875j473J21j823j554o49K576
8323d98L598M50r05J620j696j73j07j140j558j98J233N46j999j611J255J806k68
8306C55k34R81l59J6k022J80N45o9M84j596J241K718N31J124J18j421r36J078
8288B734O68l23j286l507J577L20j973K07N53p34k033P79o27J35R82K931K455
8271B858j719j890N7q81L36L89J58l77P66M9j823j004J117Q70r44k354J083J940
8253a369J697j77J171J544O43J234r24j936j434O51k73j067q40J862p50j581O2
8236a487L92R80N11j088l1l03l60p18j552P25K980K846r8j563J23K09k359j931
$$ y = [7103, 5747, 5233, 5786, 8829, 10209, 10443, 10970, 11956, 10474, 6241, 6439, 7923, 6820, 5700, 4411, 5836, 8181, 11446, 11686, 10011, 8541, 8200, 6791, 4292, 5179, 2304, 831, 952, -871, -2425, -3074, -498, 3100, 3550, 2645, 4265, 2569, 2396, 2289, 1149, -409, -607, 626, 1172, -827, -2438, -1183, 623, 355, 121, 1102, 743, 759, -1263, -1083, -538, -607, -123, -1719, -478, 2240, 2771, 3895, 4013, 2592, 1656, 2734, 3402, 3079, 1793, -1714, -137, 183, -1790, -1583, -1030, -1764, -3797, -3018, -3645, -3510, -2528, 403, 2858, 1139, -751, -694, -1575, -1239, -850, -692, -1069, -303, -254, -2077, -3081, -1964, -1094, -2038, -4392, -3309, -1369, 328, 151, 1322, 2866, 3509, 4743, 3819, 1883, 449, 1100, 827, -240, -1080, 782, 32, -1549, -1487, -1095, -115, 396, -692, -723, -1026, -1386, -2104, -3656, -2931, 49, 2895, 2797, 1234, 1357, 1566, -793, -2724]
8218b724J68o52K014J58M12o74j646K27J499Q83j145k75J64J088P09J175J680
8201C061j006m60k3R1M31k651j093j191J653K67M47J208j770j839R6Q22Q40J139
8183B2M75k668J845r7k571K230L154j439j619J328K600J670j077j260j255o29
8167G09J954o6j760P42j719O91n4m95jj340J084M7p88O3K472k353k243N49P81
8148a727m99j35L437J990k625j319n49J196j220j831j829K387J338J170J332k040
8132i24n394Q82J371J169K737O07l32P79p1M90P06M14L9j47j9N17J0R2P12j867
8112A771r43k042j754J704J299J343p64O92j80m66j963K09J857O29L0P69j406
8095G85j669J419r32K132K53k660M00J806J454k170k047M52J668r63p6k22O65
$$ y = [-2724, -2556, -3208, -1194, -1036, -624, -1298, -2944, -2717, -1218, -335, -1480, -1755, -1591, -503, 206, 1381, 3061, 2055, 1595, 1572, 1663, 2094, -557, -1650, -2841, -1188, -921, -474, 734, -1036, -2875, -2779, -1957, -1117, 22, 497, -2171, -326, -423, -2994, -764, 2390, 951, -668, 660, 3260, 4930, 3853, 2593, 1338, 709, 2663, 2597, 837, 1579, -140, 551, 497, 2, 1, -1339, -255, -208, -996, -933, 1539, -814, -3057, -2508, -1727, -2226, -2361, 1076, 3066, 441, -878, -1427, -231, -1451, -3282, -5111, -2724, -1386, -216, 1116, -924, -6318, -5436, -4065, -2896, -159, 448, 116, 895, 824, 1314, 2020, 2434, 2473, 2326, 2307, 2824, 2834, 2926, 3638, 1771, 828, -1214, -2968, -1264, 35, 1378, 614, 1306, 1126, 660, -1303, -1094, 763, 1392, 1422, 2191, 785, -884, 535, -397, 1735, 1988, -672, -272, 1534, 2988, 818, -1229, -777, 891, -72, -148, -370, 295]
8078B95l14K316L27k042n78J62L0j211n54N47J399M52k372l63J323Q12R07j559
8060d23N63o6n13j392q52J232J20K53r78L4Q19R29J75J237J658j052k107k86K599
8041A950K448k81j659q43q42J516J569k053k011q2n19J066K050N7l068K189K984
8024D471j299j159j004j223n55J096j285j576j673M48J079M94j052p13K14K950
8008g87J657L363l85J98m52p9Q53J717J340J319L126J899k8j200J172k193k574
7991H946k648k153P77K185J683j929l295q47j978j011J183r18k28J299K884k682
7975A268q62R17r20P61j309r24L41J355P32Q32Q10j919L88M49O23r5Q4R57k253
7956A235l212j967o97J457K774K582K082J066N51n62j354j077j512k016R92L89
$$ y = [295, -19, 2297, 2624, 582, 4, 166, 196, -1015, -1569, -1022, 377, 829, -1543, -1906, -583, 229, 1136, -423, 140, 74, -439, -1831, -2683, -1451, -1331, -1078, -2056, -2022, -1203, -274, -99, 1138, 2796, 1744, -363, -649, 1950, 4398, 4117, 2458, 1615, 773, 2289, 3858, 1805, -206, -288, -807, 259, 2309, 2366, -702, 1487, 4471, 3172, 2013, 1009, -214, -769, 327, -958, -2534, -4207, -3759, -2680, -2186, -3238, -3951, -3737, -787, 870, 4233, 3848, 4046, 3594, 3515, 4368, 6085, 7425, 8744, 11870, 13769, 13741, 12541, 13713, 11520, 8946, 6298, 4145, 4922, 7107, 8790, 6861, 3566, 2719, 741, -270, 913, -5, -233, 1066, 3950, 1268, 406, 1323, 403, 1164, -145, -1069, -728, 627, 1359, 2191, 3001, 1082, 1470, 1919, 2542, 2447, 2531, 3488, 1235, -1977, -3944, -4641, -3184, -410, 2172, 4254, 5320, 5871, 5309, 3955, 2878, 1366, -650, 342, 731]
7940G31l55j939J898O67j368j784k75L222L067Qo06J589j482j718m85L465L18
7923D953l421j286K704p86j913j490J868L421J097O20n00l44N83k816l216j04
7907f30K284J866r86j016k631p74J947J517k710j847J424K424O39M87J015N15
7891C524j11k028j947m22L164J462j59j089j965o44J337J094O56k214l03j636
7875a281K9K125J906l85q55j128K71L192j40l212k246Q36J927k97R97J733J157
7858D629k215j227J435J793J2l166k876J570R28k520p67k020r19Q20L755K239
7842A471q32r06l80J626J659k448k941Q10J500J537M02j044L57P75J527j881k854
7825a622j010k591K487p11p73L904J765j085O33J99k873j622J130l14R50J697
$$ y = [731, 376, -1563, 335, 1002, -366, -2150, -2425, 797, 3864, 3872, 3266, 4855, 3373, 1655, 1170, 4635, 4953, 1532, 246, 2950, 2164, 251, -1239, 629, 4050, 5147, 5767, 5267, 4923, 5506, 2690, -526, -630, 1654, 3520, 2534, 1518, -1113, -1887, 60, 1577, -1133, -2980, -1556, 868, 1507, 1994, 3009, 3524, 3413, 1385, -562, -984, 2180, 3642, 3483, 2394, 429, -215, 1122, 2216, 2872, 658, 355, -1281, -1252, 873, 2779, 2394, 1539, 411, 682, 3874, 3734, 522, -1724, -888, 1039, 742, 1739, 3472, 4629, 2414, 1187, 2622, 4415, 4427, 1261, -1615, -45, 883, -1637, -2404, -4424, -5343, -4523, -768, 1471, 639, -267, -647, 979, 2638, 190, -2751, -1941, -441, 1096, 1498, 454, 811, 1586, 3113, 1232, -1622, -2632, -5223, -2736, -3447, -4220, -316, 1449, 364, 997, 1196, -1677, -3299, -2169, -2483, -1533, 164]
7809A64j364N13K849j52j532p10J54m30J45J005J18k079J473J495O67k008K14
7792E22p74K432K63k132j81l389j007J478M25J080Q80j326j973J391M06o82J657
7775i30O99O31J334N63j550k76Q76m40R50m09k067j768K033o48k404J78P92k121
7757d557j248J378J923o98k13P40j26r94J240R48M035J731l101j484L19J275k215
7740a047p42L2K76m57J728J509j120r51J361p50k165q34j198O31K136Q49J79J796
7722A233M23j73J052j066k521k177p64M537j566M54J765P77P3l489m98L195L067
7705D322r33k207j694P82n88j332J097Q0n85k827j383p07P96J793J468L14K134
7688E30J126l791q93j710o38l49Q43K545K43l635j504J227K762K296N62k435l281
$$ y = [164, -1200, -687, 2162, 2010, 478, -232, -78, -508, -363, 642, 760, -1319, 154, 1649, 2316, 308, 522, -252, 2180, 2443, 311, 130, -3259, -4266, -2788, -2363, -1283, -403, -1729, -3702, -2311, -1905, -2587, -930, -231, 400, 1734, 2297, 747, 471, 1347, 907, 1857, 1448, -619, -2387, -354, -1002, -3406, -3228, -2436, -4557, -5805, -4427, -2504, -3202, -3415, -2675, -2801, -3795, -2555, -1607, 2428, 4159, 1058, -426, -107, 1168, -1047, -1789, -1757, -1481, -1938, -210, 1299, 179, -772, 589, -161, -2326, -3160, -4358, -3727, -1591, -742, -563, 1233, 1656, 1483, 2535, 1469, -1052, -3229, -3993, 544, -1022, -568, 1197, 1974, 2047, -1442, -1940, 1255, 4322, 3389, 1182, -512, 270, -318, -1650, -553, -473, -1058, -3885, -5268, -5975, -5179, -3386, -1918, -1604, 530, 1656, -2135, -3028, -4738, -5376, -5725, -4882, -2337, -2094, -5729, -7233, -6006, -3244, -948, -386, -2821, -6102]
7671f102m473J203M227L194K273j855J975L33J591j869k207K595p5j0j159p3K326
7654A894J257p97o15j304r66o0P43j85j08n32j513K103q77j974J257R23J548O70
7636A464j490k955J918J520j238q73j693J487K015k106j130K70O45n76m32k111
7620e285J684l4j087M86J861J548J394n63J404r61l68q5o71j292j342k49J957
7603a603K283j655j864J615n07j125J032L320K164q36M38j429j399k48M16j143
7587e41j146M95M079K225l065k193k22kR27J682P84N59j88k239p42M4r90q62L82
7568a013o47p53N78p51l09K599r86p67o31j135M76J532J662k19Q2J319j19k037
7550a119j317K73J574q77l9M73J598K748j00n14j867j023M09J261L7M57M7K87
$$ y = [-6102, -10575, -9372, -5145, -1951, 322, -1533, 442, 775, 2366, 497, -1710, 885, 810, 800, -359, -432, 1894, 3151, 2354, 1739, 435, -531, -591, 152, -33, -141, -673, -2186, -83, -960, -2934, -1677, -754, 794, 1464, -26, -2981, -1063, 457, -781, -1654, -3347, -1860, 155, -1951, -3081, -2811, -2166, -2742, -3174, -5285, -3601, -3635, -4722, -4236, -2375, -827, 567, 4, 1408, 447, 79, -6, -677, -1969, -3311, -3560, -1603, 680, -975, -2839, -1224, -1731, -2856, -1824, 1496, 3660, 2824, 3262, 1833, 434, 186, 602, -541, -1687, -1192, 2887, 5112, 2047, -146, -368, -370, 557, 2239, 3023, 3582, 3394, 1155, 413, 457, -533, -1395, -1013, -1660, -2413, -1835, -2586, -2895, -296, -1282, -2049, -2680, -3815, -3339, -1807, -145, -364, -282, 1037, 918, -1119, -2436, -2163, -589, -1466, -1505, -1032, 566, 3314, 3214, 2700, 833, -190, 219, 1480, 1517, 1974, 2021, 2308]
7532B308K33p66m009k094N66J174J682Oj340l040l91J746L366L898p9l761j482
7515a983j884O12J047J476r39L14l30q45Q97J084J97k735J352j203m77N43r49
7498c823J043P83k66k617p69J604J888l02o20J228j573j43N38R8j637R2K56K50
7480c970J514j637j406N99k61K908Q84o37j483n17J396m18J184P09N83P69j265
7463a048n16J558j701k505q72J482k91l68J581P84l440j17J369J156J017k252
7447d163j561K154J535Q24J135J303K402j104l615l73R46R35k782n29K422n83
7431a054k736J496N29N31O4J08p3k207L164J275k066j128j67J252j252J211k233
7414c286j018O62J126J194j464j661M70K78o89L76K72o35p98j958o80J197J145
$$ y = [2308, 2541, 1775, -2234, -4328, -3762, -2588, -906, -900, -2240, -5280, -5671, -3925, -559, 3339, 3260, -501, -1983, -3867, -3255, -2208, -732, -1671, -1357, -1687, -2532, -1635, -551, -354, -3089, -1737, -2940, -3417, -2874, -3823, -2780, -1997, -2263, -4880, -5649, -4045, -2157, -2459, -3079, -1851, -3424, -3567, -3029, -2931, -4568, -4476, -4220, -3970, -2456, -4093, -5499, -4900, -5161, -2253, -1369, -2006, -3489, -4006, -2610, -3028, -1844, -1135, -552, 217, -1048, -1564, -6, -1707, -4212, -5084, -3602, -3893, -4261, -2680, -1896, -5336, -5453, -4084, -2928, -1911, -4163, -5724, -3570, -2035, -1211, -76, 1227, 3629, 2525, -1090, -1463, -517, 418, -2364, -2893, -471, -1054, -3790, -2294, -1765, -1234, -1170, -1062, -1135, -3342, -178, 1097, -969, -2097, -2264, -1012, -2264, -1053, -3286, -4304, -3642, -2516, -1322, -2786, -4447, -3977, -3699, -4388, -4012, -3740, -4375, -5173, -7131, -7811, -6614, -5469]
7397e469L741J390o08l90k802k06K553j715K07J46K818J314n86l80M63n51N20
7380D45m83K53J28N99M68j229j084m69j14P49r42p21j95p26J075J744j533q28
7362b863j511n71O58n30q3J741J821K164K699l51j672L3p71j018q08k454j117
7345d633J007L029P14j083m369p64K459J699j132j154j729K840J020J528K48M48
7329A28j319r51M518K912j889k328j634M02M94k51p17K808J556j218k531p55p54
7312a529l172Q13m8p98k007L29L609J706J32j239k820m1l97p45J299R02P36L214
7294e6J82l75m0n12j019r74R38m92P93m28m66J697L533L95J286k735j546J566
7276A747r84k608n07l37J984Q48j733J191J010j914k952k281j007J552K950L884
$$ y = [-5469, -1728, -338, -946, -1336, -4138, -4344, -1791, -3506, -3299, -3153, -335, 979, 393, 13, 476, -75, 445, -38, 215, 343, 942, 1410, 181, -903, -1372, -1486, -737, -1679, -2400, -2595, -3321, -2246, -502, -2035, -2863, -4374, -4945, -4287, -4817, -4900, -3159, -1338, 826, 3525, 3174, 1502, 1535, 764, -254, -1062, -3516, -4633, -3626, -597, 117, -966, -5335, -6099, -3640, -1941, -3073, -4227, -5956, -3116, -2096, -568, -320, 128, -1191, -2142, 2376, 5288, 3399, 1071, -563, -161, 333, 82, -635, 2173, 3729, 2511, -20, -775, -1529, -4701, -3888, -3936, -4734, -6741, -6412, -2803, -1097, -965, -2204, -5024, -5065, -5462, -6207, -4908, -4006, -3270, -56, 126, -249, -289, -801, -1820, -2794, -1856, -2348, -1555, -1983, -2449, -752, 2781, 3176, 4462, 1727, 181, 1747, 763, -1845, -2352, -2689, -705, 143, -1590, -399, 611, -1303, -4255, -6536, -7543, -5991, -3041, 843]
7260H43J8P58K20m97l041k307j704J030J210k37J316L13L60J43j208k336P37Q82
7242c500R25J227q62L32p13J477L447J255J21k073j699J80P39L73k434o40j31
7225a976j762l34J710J443m61j637o85K42N1J795o9k919j208o65K308J237L97
7208b533J961J325N3k074m26q86R06k689k080J913K878P9j170l553j418L145J317
7191c252q81R84J235p43N80R50n36j235M29J619J216k221j352L302J280j240l38
7174b03j676N8N76j343n97K601p4m310%J013K801J508j036N54j156j427N23p79
7156b967P37J687j305k110J685J950j384q54J122K034J082j11M42j37o58J925
7140C138n66P4k196n47j300l42J364J764k532l078r98k416m38J582K270J004p37
$$ y = [843, 861, 1619, 1839, 1342, -1699, -4006, -5710, -4680, -3470, -3707, -2391, -2078, -1718, -1575, -2783, -5119, -4382, -3500, -2575, -1348, -2210, -1878, -2591, -1114, 2333, 3588, 3709, 1636, -63, 117, 856, 1229, -1205, -1845, -1976, -3738, -4072, -2362, -919, -1380, -3017, -3702, -3460, -3409, -1614, -1683, -4602, -5810, -6475, -4167, -2930, -2533, -572, 753, 806, -1268, -1694, -2580, -1674, -4363, -6443, -4530, -1652, -1573, -2743, -6296, -7714, -4569, -3252, -4133, -3149, -1914, -2657, -2077, -1127, -1663, -2898, -2469, -850, 366, -1855, -3207, 95, 1375, 135, -203, -1879, -1821, -1245, -2588, -3185, -584, -658, -4968, -4968, -3955, -1154, 354, -682, -128, -1284, -2711, -2188, -2967, -2230, -543, -1848, -3958, -2273, -323, -1707, -2561, -1439, 595, 1677, 1566, 2008, 1871, 1213, 3138, 2572, 2646, 450, -97, -1397, -1739, -375, 1389, -1143, -4221, -5219, -7635, -8073, -6491, -4221, -3217, -3954]
7123c954Q66K992J19J276M63K263M89j134j328j736j018m57P91N94j468M09p68
7106a601J85m61n89L98M50M60m42O3j020n70J584j422j470J911J995n34Q3K358
7088A378n82j511J04N0p14Q78M46J05j604K55j002L4p00J795m75M18p04Q27j272
7069b274j284M28j228J61M100K242J50j188J56j502k226j280K375O10p7j2j203
7052b052k130J930q49k371K19J415K090J191O35m40k598k428M278K312j460k494
7036b752o39J110J274Q26p56n22Q73l013q49M2q36M72J615M87J03q86K500k659
7018c610q77j044M84J719K328p34j417R84M05l32R04j243k8K444M21n39j865j147
7000c147K098J216j2R64r76j314j833q59K263K184J825Q78J208j13j751r51j7
$$ y = [-3954, -3088, -96, 23, 1299, 1762, 4025, 4514, 3380, 2052, 316, -702, -1159, -368, 226, -1242, -833, -1601, -1416, -1877, -2466, -2068, -1618, -1158, -1600, -1537, -2557, -3127, -1543, -2965, -4435, -2524, -529, -1063, -980, 1378, 796, -715, -611, -561, -1275, -397, 49, 154, -1450, -1195, -2197, -2163, -2863, -1068, -1543, -1125, -1829, -1002, -2274, -3558, -3130, -4358, -4197, -97, 2145, 2295, 1107, 1263, -239, -2465, -3745, -1370, -760, -837, -849, -2052, -4182, -2252, -3101, -5472, -5253, -3838, -1748, -557, 78, -362, -2960, -5388, -1110, 1202, -258, -2752, -3391, -2281, -1007, -181, -937, -1459, -586, -3599, -4448, -4406, -5242, -4770, -3155, -2668, -2565, -3451, -951, -3610, -4487, -5531, -5047, -3328, -1000, -1734, -3151, -2167, -1762, -2094, -1190, -2433, -2461, -17, 404, -135, -2000, -3147, -1049, 167, 155, 1119, 143, -1171, -3004, -3863, -1600, 584, 2409, 3287, 4495, 4382, 2631, 1680, 1663]
6983A663j734J181k084k867j288O72J264J208M40o04N23o52m26j413l39j881k03
6966f540j559k10R34L240J021N68j825K15P53j200K673j016o41Q82L01j679J114
6949b969O84j10N83K343K26j525L9J340j037p48L43Q76j437j970N49j033J138
6932b708K348kj152j014j096J414L116M91j548O1Q34j819L25N34q88Q7j10J53
6914i74J021L8k800j692m26o68K056K313P88j350j866p93Q83K658p16rm19K00
6896a756N53J504Q60j777m095J987K605j402R5M49J424l31p54q95K94j885J820
6879a304O94J092m3j332M43j045J08j531q76o37M76P64J858n56l653o06K030J520
6861b598J472N7o93o06L010M29L50o15J47o4j16j667k925K508J980o05k774l478
$$ y = [1663, -71, 1110, -974, -3841, -5129, -4457, -3193, -1985, -1545, -2149, -1626, -2278, -2704, -4117, -4456, -6337, -6540, -8099, -8309, -7375, -4135, -3114, -2546, -4371, -4156, -3403, -4603, -1930, -2946, -3587, -2705, -2404, -4083, -2969, -2285, -2395, -1812, 531, 757, -768, -729, 611, -426, -1174, -831, 45, -1392, -3362, -2813, -3846, -2708, -360, -362, -1514, -2528, -3624, -2210, 906, 1397, -151, -90, 744, -1075, -750, -216, -1104, -1017, -1127, -974, 47, 85, -2715, -4407, -4833, -5501, -3445, -1132, -344, -1694, -3560, -4353, -3470, -812, -1528, -1537, -1956, -1756, -1203, 301, 1161, -616, -4711, -2724, -119, -1521, -1426, -977, 447, 116, -638, -1533, -1239, -3124, -1304, -610, 482, 439, -893, -450, -1495, -1387, -2918, -3794, -4431, -3955, -3191, -1333, -1889, -5542, -6148, -4118, -2598, -1126, -1069, -1762, -2368, 642, 1071, 1421, 806, 953, 889, 773, -894, -3819, -1311, 669, 64, -2710, -6188]
6843f188L49J946J264l51N6J382O44N57p51j064J098J558J323L79k549K09P22
6826E84Q9l16r38q90l49N89p67k87Q78ko41J651L06j273j677j040J20l0K95K389
6806a309J342j171m46R61j520J20L43j36O45j389k731r75K913K093j336n9J478
6789a177m23q22j099P03r54q10R98O40k213p3N53Q93J071r20J650J778J711O30
6771B136k899o99j06J051k13q54P96P70L47j154l2j981m37O00K090j333K92J251
6753c75P7m242J560J541r30Q45J667J392p2L36p35l6J291r49L04j144m48r44r62
6734a824q50r07J382K579R18j125m56j346r57M45O1L65j00R21J879l70J624J442
6716C681k933j763R67m89R65J498J115j459l076J21K154j342j683n82L61l151
$$ y = [-6188, -5839, -3893, -2629, -2980, -2924, -1542, -898, -341, -1092, -2156, -1058, 500, 1823, 2202, -347, -138, 584, 673, 357, -581, -1471, -1820, -1231, -1998, -2285, -1407, -1409, -2050, -399, -93, -1366, -3043, -4083, -3963, -3993, -3698, -1309, 33, -1138, -1584, -623, -2143, -2023, -1680, -1816, -1171, -2560, -5291, -6266, -3353, -1260, -2596, -2655, -1177, -1600, -2422, -3521, -2818, -3772, -4582, -3584, -2944, -5157, -5230, -4677, -3784, -2713, -3633, -1983, -205, 1506, 2136, -763, -1462, -1568, -517, -730, -1584, -788, -18, 329, -825, -857, -2838, -3275, -2675, -585, -1918, -1626, -375, -298, -4540, -2980, -1439, -2369, -1524, 143, 1535, 1463, 1799, 1064, 1028, 2319, 1370, 1674, 530, 82, -862, -1824, -2674, -3581, -2199, 380, 1298, 173, -283, -1629, -2586, -2141, -2080, -1715, -1815, -894, 985, 615, 2239, 3681, 748, -1015, -48, -537, 428, 1926, 3041, 1582, -1494, -1373, 781, -561, -2244, -2826, -2465, -5616]
6700e616Q11L175J464j009j083k013R89K81p0j68p05M15p92L16M46m17k382J569
6682d789K454N48q04j52j259j441j27J040Q40J505j305l170N96L135K681j9l03
6665e70Q18M37J654J30j628r92J058N62l64R13j282Q64J612r29l87j843l164M47
6647b664Q91k28K5m22m11k30J301p45j084k730J95K879N62J883O65J111m58p57
6629b17m66j217m32j063J95p72J357k324j462K952K465j440K01K058r02n7J685
6612E61O65m08n77M54J197n6k562k663l17L3J71N248j096k510r95r89J277P61
6594a806J5J159J51J51j369k305j551K633L543n08j917r18q05j225j425m14k0
6577f611j836j740J427K819J462J285K260J105K241Q13q99J176j669j624K256
$$ y = [-5616, -4805, -1630, -166, -1175, -2258, -4271, -3282, -3001, -3071, -3239, -3944, -3529, -4321, -4005, -3559, -3976, -6358, -4789, -2335, -1787, -2591, -2743, -4002, -5443, -5570, -4530, -3690, -2185, -3490, -6660, -6064, -2929, -248, -267, -570, 248, 685, 2339, 2469, 841, -151, 907, 1469, 1105, 2018, 736, 1600, 3212, 2283, 1896, 53, -3111, -2664, -1773, -2001, -1976, -2398, -2809, -3039, -1738, -2483, -3567, -6297, -6102, -3223, -2661, -778, -113, 998, 540, -217, -683, -1900, -2332, -3395, -3200, -3972, -2615, -4939, -6401, -3449, -984, -2424, -2223, -165, -1067, -1124, 561, 1226, 818, 241, 695, 1892, 1836, -726, -3389, -3706, -3673, -3502, 1746, 650, -1860, -2855, -3844, -2567, -1806, -1791, -632, -481, -330, -1699, -4004, -5555, -2922, 621, 113, -1804, -2722, -3527, -4752, -6177, -6591, -6611, -8447, -10187, -8760, -5941, -4479, -3194, -934, 171, 2412, 3225, 2326, 3502, 1833, 209, 2465]
6562B465N00k001j580J718p14j188P45P22N56k721j824J815K163O4j480Q57j596
6545a499q56J693j342O1J401j66J112J174M10j020q01J24m69J486N91j684n83
6528c68J122J064R91k308k201m78J861J125J50m62k76j452k51j168L011P08j930
6511h62j138j660J737J394J008r82l267l066R71M380L640L96j603m01J095k864
6495a222k588N31O03j934N21J431J099n67L13J403Jj770j028J831R10P52l057
6478b771j991J760J717K912L986j516l052k333j821K12l27n50l19O02J270J369
6462h52K229K93j666L89K57n51k363j93j059n34Q46L65l038J301J360J3K15q94
6444c882l09j38k72K643j102k86k19o78L326O40k783l476o7L214l23n52K808M22
$$ y = [2465, 2965, 964, -616, 1102, 388, -800, -55, 667, 1223, -1498, -3322, -1507, 656, 720, -760, 97, -1499, -2355, -662, -2004, -1943, -542, -708, 404, 1578, 1988, 968, 167, 291, -178, 1308, 1899, 215, -368, 754, 1818, 2809, 501, -1700, -2178, -317, 808, 958, 496, 220, -1232, -1483, -2651, 360, 1068, -862, -2000, -3660, -1923, -529, 479, -503, -3770, -6836, -5865, -1485, 2155, 2551, 948, 547, 1642, -1222, -3810, -3279, -2676, -4610, -4089, -2658, -1559, -2126, -1813, -410, -409, -2179, -3207, -1376, -466, 286, -2771, -4762, -3002, -1285, 1627, 5613, 4097, 1045, -1288, -3109, -2897, -3224, -3774, -4093, -3491, -2221, -852, 1377, 1670, 4, 393, 650, 99, -2264, -2457, -3516, -4050, -3204, -2839, -5877, -4576, -3216, -3203, -2988, -3882, -4191, -4329, -4601, -1958, -3060, -3346, -3565, -4243, -917, -277, -3060, -6536, -6603, -3389, -3712, -4264, -1456, -1034]
6426a034j440K94j254j165j95Q30J633K03j33J153K534J54K4j444j435N78J48
6409e49K980J644m06m41k221p65k179k026J439L9R50J57j643O34R31J425k50K11
6391g0j227Q1K818J024j404l068o90j347K084J132j803j091R0j460J845r77r77
6374e040P20O96j167j97J190q73R07J992J16Q54j740k952j949J879K657J009M86
6357a412J92J76Q10l93j773o33J559R70q82j922J380L731J489j460l639m813j1
6340f631k375K203K601J041K567O77l00O60J932O11j843m006m26N95j363o19P04
6323c972J018J394L11M66j687j972l98K748L230J843J655n17j156l340j999j156
6307c532q7J252J28j171K69J317P69K73J847R6M11j17j059j032j010K56R68k208
$$ y = [-1034, -2474, -2180, -3434, -4599, -4794, -3964, -2331, -2128, -2261, -1108, 1426, 1580, 1604, 160, -1275, -697, -549, 2431, 4075, 3669, 3228, 1007, 242, -1937, -3963, -2524, -2485, -1535, -1378, -3021, -2387, -1456, -31, -281, -70, -1297, -1216, 1602, 2626, 1222, -1846, -2536, -3883, -1799, -667, -2470, -3561, -3471, -4931, -3086, -4063, -5040, -4320, -3624, -4791, -4988, -3798, -4671, -3764, -1772, -1656, -802, -2542, -5494, -7443, -5564, -2907, -1898, -1412, -1220, -1044, -234, -627, -2400, -3033, -1474, -504, -1386, -3308, -1928, 1803, 3292, 1832, -1807, -6620, -6631, -9006, -6803, -4202, -3161, -594, 83, -217, 443, 2375, 2986, 1143, -2863, -3289, -2694, -4057, -4676, -3972, -2954, -1560, -1249, -783, -2470, -4442, -4840, -2092, 1138, 2981, 4636, 4119, 2963, -377, -2376, -3532, -3619, -2367, -2239, -3410, -3141, -1824, -1055, -782, 1065, 1161, 1572, 1455, 396, -636, -1646, -1390, -422, -2630]
6289b630k48K637L49j236j047J741M56j435m85r15q91J370j505o91K907J110M456
6272C943J018j061n33n78l933j939K870Q02q41j139k072j945K53J943O94K596
6256G8m3k439l37K85n00r22K772R0K24K71Q84K94k001N26N29j080k41J956l31
6237A5k46l03j495q16Q08J02m03K15J521j075M65J59j436J224K195K154k331k330
6219a577j933r2K285K989Q64j880l005K65K456J117m459k249R04K205J255K74
6203e81j930Q67o16q09p7K6K3R57r82k259k321N61K514J576O73Q01n34J867J320
6184A076j613j626K165J72Q53k15m209j832K232K629p40k698r53J266K62r51j67
6167d349O96K070K004p36j25Q9l77P28n20J279q63j693R0Q6j333K167O49L568
$$ y = [-2630, -2878, -241, 108, -1128, -2175, -434, 22, -1413, -1898, -2813, -3704, -2334, -3839, -4530, -1623, -513, 3943, 4961, 3900, 3367, 2789, -1144, -3083, -213, 589, -252, -1391, -3463, -5408, -5155, -3212, -2518, 78, 35, -2404, -2741, -2456, -2956, -3878, -1106, -1016, -792, -521, 363, 657, -1344, -818, -289, -1369, -1610, 346, 15, -231, -534, -2029, -2845, -2037, -1935, -2338, -2123, -602, -1677, -1212, -1053, -2489, -1265, 930, 3084, 753, -1577, -3510, -3602, -1317, 1672, 2536, 656, -2349, -2084, 372, 1489, -2970, -5219, -4315, -2110, -855, -581, -2511, -1644, -2260, -3069, -3146, -3120, -3097, -2140, -3122, -5381, -7702, -7141, -4627, -3051, -2378, -1577, -2111, -244, 1076, -537, -2163, 2, 174, 1027, 812, -3397, -5229, -2997, -368, -1108, -3806, -4759, -3493, -3231, -4182, -4349, -3653, -1583, 421, -315, -440, -351, -728, 0, -520, 759, -104, -1797, -1707, -1621, -2954, -787, -138, 3430]
6149C430j112j151m94j260j117p31J915J218k935J558J054j2K25J473j955k45
6133a39j044J846J056o12j305k343J238K121n68k449N27m55k007k826K265N554
6117H59J582q37l06J795J56k569J819j320j671K221j426l838N1K255O28J081L03
6100G83j082j10L00M90n71R11j155L89j016j289N7K028o77r15M33Q0M45O36J037
6081G74j53j192K473J007j65k413j626j086k024l436P14K476L179J135M74q50
6065g13M36J46k380R48J506j621J181o68K529q7k18J301J272j312o19r11j652
6048h62J592k890k47J951L8j805k164j104P23O06R5M84K104J669J969j097j624
6031e62k350j610N33J591J525J170n26j780Q11J760R52j135j242K706K14R42l50
$$ y = [3430, 2318, 1167, 673, -587, -1704, -2435, -520, 698, -2237, -679, 375, 363, 588, 2061, 106, -139, -1183, 663, 1719, 1107, -198, -2541, -1303, 818, 250, -2199, -1672, -2127, -4134, -6960, -4695, 859, 2441, 1604, 1298, 3093, 3249, 680, 2499, 1179, -492, 1729, 303, -3535, -3484, -1229, -601, 480, 783, -299, -409, -109, 381, -190, 721, -434, -45, -1061, -2350, -2293, -265, -942, -1857, -1424, -1344, -899, -263, 774, 621, -571, 1902, 2909, 2744, 331, -1295, -2381, -4405, -7841, -7127, -4651, -1472, -337, 137, -713, -277, -131, -2511, -1563, -57, -1678, -497, -1165, 1364, 1277, 1059, 2360, 3632, 2320, 1701, 790, -862, 730, -2160, -2407, -456, -418, -2223, -4387, -5491, -4768, -4162, -4067, -3583, -1479, 190, 2159, 1062, -562, -2912, -4522, -3989, -2398, -873, 297, -229, -2009, -1198, 562, 1514, 379, -863, 1843, 2057, 2999, 2649]
6014B649j708j434l36J192n98j932j440K077J936k78J437j127j658j142J409M14
5998e39j271j668q02J837K875J650j183p51r46k64j19m88p42j816l97N98J036
5981b990q64N30J524J003P00J074j554p58P23J290j997k99L4j435j104L176L18
5964f29j171J919J28j267J78j801l758K255L055k5K24j709j54j279J021J925L56
5947g32j687k105L61R10J083j481P30K133O39k37k559K194J587p12j274R87J781
5930A618l17K92m74j119j497L8J345k190l0L710J510j927n96K278o03J72J218
5913C428j797k101K068o88q60R21J312J048l589k437O41J51m06n27J318N78J770
5896H30k102j520J298L088J064j274k099j281m03k002j24J211R96Q26q51p53m28
$$ y = [2649, 941, -493, -829, 363, -235, -2167, -3607, -1530, 406, 128, 1565, 438, -1220, -2362, -953, -539, -1810, -3478, -4280, -2443, 432, 2082, 899, 148, -798, -1062, -1181, -1669, -2411, -4227, -4624, -4026, -2990, -3854, -3324, -1800, -797, -97, 977, -577, -1335, -612, 678, -1319, -1618, -1584, -3019, -4123, -947, -629, -1800, 119, 247, -1020, -842, -2643, -6401, -4146, -1091, -1116, -892, -2601, -2755, -4034, -3013, -1088, -732, -2419, -4524, -4163, -3253, -2170, -3651, -2921, -788, -149, -386, -2945, -751, 836, 124, -1150, -163, 1618, 1301, 1593, 1119, 0, -1497, -1459, -114, -2304, -2334, 1376, 2886, 959, 363, 2641, 2038, 2210, 3428, 1631, -470, 1598, 910, 50, 971, 2283, 3331, -258, -2695, -2054, -1903, -2309, -2836, -1518, -940, 830, -1272, -2792, -1494, 1594, 2658, 1384, -715, -1996, -2399, -4401, -4525, -3314, -2318, -1492, -2343, -3096, -3524]
5879c524J71K42J43N23o2q01j445J212J005k17j66J87q43K45r36n62L911J950
5861A033k756j600j125K255L80K306J204J103m22K31l358j676J054n14k766K26
5845d425Q75J624K860j064j901o07j322J246l83r94K098O18j27J89k188Q16O77
5828b008N81K825M32n42j567j270j412Q50K221j405j544J469N7o81J949k80Qj340
5810a657J155K279M44J432l599k386R69K60j689l81K46L005K127P37J720j767
5794B895o22J400q09k858P25q9j929N74J68k747j659o60M82K416Q79m86k373j495
5776f188L71J483K40K65J659M46r43K77K30M22m8r99p35J238j8m41J397l45K192
5757E03L59j771J568j554k385k03K465J561o9p63j276R49JR36m4P13K654k888
$$ y = [-3524, -3353, -3111, -2968, -2445, -2507, -3308, -4753, -3541, -2536, -2753, -2919, -2732, -3575, -3330, -4266, -4828, -917, 1033, -1723, -3323, -4448, -2193, -1813, 493, 1697, 2800, 2378, 2609, -749, -2425, -1371, -1885, -4651, -4425, -3550, -1926, 934, -130, -2031, -2638, -3960, -2714, -3097, -4091, -1993, -1375, -1502, -1313, -3501, -2685, -2008, -1427, 1398, 1830, 1288, -279, -1549, -2961, -2111, 110, -1295, -2839, -1370, -1313, -1994, -45, -325, -317, -1657, -502, 1777, 2221, 3653, 54, -2332, -1363, -1103, -2792, -3173, -2927, 78, 2205, 2942, 4662, 2895, 2273, 3673, 2864, 6, 731, 642, -1287, -713, -545, -3292, -4951, -5611, -5129, -2713, -1834, -2320, -4693, -6188, -5817, -4334, -4094, -3829, -2170, -1724, -2667, -2390, -2160, -1738, -1786, -2785, -3520, -2282, -2300, -2741, -1344, -1689, 503, 862, -909, 659, -895, -3280, -3483, -1018, 543, 474, -289, -1565, -616, -615, 321, 277, 990, 3644, 756]
5739G56R0N28O31N25k61P39J584q89k84j015j366k16Q39r15j404j273J747j057
5721a241P41l253j832K612K759K83J175R91J049P37j37j631k183n61l88j936J377
5704a438k395J484p53L425J451j739o89j631Q60J74j2O17m56k361r63l5j512K473
5686c500J436l403k608O75L515m1K2J786k56K17Q92p41N77m03k789o43k45J650
5668c859J222J411r73m69Q31p4J119j01l66K06K386K601k32j434j027J687j944
5651I84k308p64O02J59j276j472m35L011K571L250k912l78r52l997r58J433K672
5634g70K97j397J314j255p93o49l95q67o09j47K449J302K383L55j661j035p58
5617b236r61m32N35K086P10P72r38M9J920j101j567K81J094J83j191r92k539k116
$$ y = [756, 846, 1374, 2005, 2530, 2269, 3008, 4592, 3703, 3419, 2404, 1038, 822, 1661, 746, -658, -1931, -184, -1241, -500, -3753, -5585, -2973, -214, 69, 1244, 2235, 3284, 4021, 3884, 2253, 70, -491, -879, -2815, -1438, -3833, -2349, -3102, 323, 1774, 35, -654, -2285, -1425, -1251, -1263, -646, -1102, -3463, -4426, -4461, -5973, -3500, -2064, -5467, -8075, -7400, -3885, -3926, -3904, -2118, -2374, -2157, -1265, -2006, -1429, -1832, -4621, -5264, -5509, -3859, -2637, -1226, -2199, -2668, -1837, -1911, -792, -893, -1259, -1053, 1333, 3934, 3702, 2268, 1241, 2928, 984, -1324, -2088, -1486, -1327, -2603, -4075, -4510, -1499, 1072, 4322, 1410, 1032, 80, -3917, -4875, -3442, -770, -473, -1870, -556, -1811, -2604, -3253, -3648, -4515, -5124, -5271, -2822, -1520, 863, 1218, -443, -1478, -2236, -3197, -3629, -3094, -1008, -298, 474, -464, -415, 1505, 404, -1163, -882, 212, 395, -796, -1788, -4327, -6443]
5599f443q27q42N8L785M898K037j18j335k639p52J871K091k646j183K591K600
5583C146J962n45m136k492M42j520R69M37o53l56K439K100k13q94o75k056j639
5566c684J871n58l41r81O88M65j605P40J382K858J131P73L85j898l816l101n91
5549f282J48j060L18j588L341M053P72j288o8j054n9Q12J27o53r46J94P04J862
5531f67N13K517p04j287p22L62j94J609J347l706P13Q68j787p55N24M54l90P28
5513e77j71M06K717m53j375k350m38N33J91j33Q04j104J072P35o28k90J443O48
5495A030O90p06m269k89J481Q85K056J083j128l6k81l91j624N91J976k396j795
5478c123M64P30K27M37Q6L23J352R27m02j436j564p9j428n59K472K766Q74j59
$$ y = [-6443, -7270, -8112, -8054, -4269, 629, 2666, 2548, 1213, -1426, -2178, -307, 1784, -862, -2045, 546, 3146, 5108, 4563, 427, -2065, -1623, -3143, -2174, -1737, -2390, -2746, -307, 1793, 1580, 686, 11, -2045, -3684, -1813, -2371, -2712, -3693, -3005, -2540, -4145, -3405, -2023, 835, 1966, 2739, 3124, 1226, -2590, -5691, -6282, -6134, -7194, -6876, -8464, -5123, -1070, -298, -1586, -1654, -2708, -2767, -1955, -1828, -2481, -3427, -3233, -2529, -667, -154, 2363, 1659, 372, -350, 12, -182, 1427, 2774, -932, -219, 649, -1138, -1893, -1369, -915, -1305, -577, -748, -342, 2375, 1922, 547, -1803, -2241, -1708, -1517, -1650, -846, -1950, -878, -143, -771, -1061, 382, 1030, 1720, 1014, -3255, -3544, -2063, -1178, 878, 1961, 833, 797, 516, 125, -1499, -908, 1068, -1328, -3123, -2659, -1929, -1702, -1265, -1179, -856, 496, 1423, 1021, -415, -1979, -2058, -3486, -4045, -1573, 1193, 2067, 1908]
5460A908r29L21O96k683k614K83J868j272j533K32j570J031J728n52OJ348O17
5443a115L00j563J64P24J61P99J699k845j433R5m01j078m49j604J643K788R50
5426a165o22N45j639J152M57J77J25K33p91J88M40m41J294N37l658Q69j773kN233
5407A159L552j801m04j653J008n44Q1J71J290j883j437N62q34J312j68j495k41
5390a325K551j739j186K781O6O57J021k378l003K27j070j982K598K742J980k637
5374f97n50L97j149k065j077N25J293R89r79J83K589J147j251q44J856j087o26
5357a346J15J783J207J064k044j443o76J148p79j034j59J994J106j914p29j248
5341b955K23N1J311K100R37J677k691j91J470k80k10k231k474l90O35N83J173
$$ y = [1908, 979, 1300, 1996, -687, -3301, -3018, -1150, -2422, -3955, -3723, -5293, -4262, -2534, -3086, -3080, -1732, -1115, -815, -2378, -2214, -1490, -1329, -530, 1169, -1676, -3109, -3014, -3415, -4493, -4942, -6546, -4903, -2115, -1165, -1787, -1242, -2881, -1729, -1272, -1095, -970, -737, -1528, -1340, -900, -1341, -47, 490, -3168, -2299, -4072, -4074, 1159, 4711, 2910, 2506, 853, 1861, 1317, 1398, 1569, 2859, 976, -461, 101, -733, 579, 411, -1084, -1325, 1226, -513, -1699, 1082, 1148, 1805, 2826, 448, -2555, -2328, -3398, -5380, -2782, -40, 1940, -697, -1247, -850, -1999, -4064, -5141, -4616, -3323, -2334, -3313, -3130, -541, 606, -645, -1489, 367, -720, -1346, -1231, 552, 1759, 2823, 779, -664, -1340, -192, -971, -2005, -2164, -170, 936, -978, -1707, -2955, -2732, -2681, -1370, 730, 1667, 3344, 653, 462, 1932, 1652, 1442, -789, -3263, -3653, -3018, -2435, -1262]
5324a262M49N53K938l45K80j828l899P9J586j37O63j293j333j257N05k6j192K684
5306b835K887L380o21j452l024j261K541m61j278J509p22j081L24j400J398K987
5290H91Q08k047r7J559J66N59k623l181P80L252K758P72j726R25j140j86J520
5273B990k833j390P00N34j308K78R78J29J866Q33j899j819j41Q75J128k941k9
5256b049L259J537k940J103K395j413m233j985j638K728J78k99j528j949P5K756
5240d003Q04k29n70J039K981J391j11o02j678k984j911K77J22J426k132J227o68
5223e621J229Q18J478L047J094J381Q15J838k097k153q92M81j653l244J267J298
5207i14J324Q5Jj714M96j251k24J996j418M08K748J65k203j692J158K03j691q10
$$ y = [-1262, -813, -260, 2678, 2333, 2613, 785, -3114, -3035, -1449, -1586, -923, -2216, -3549, -4806, -4301, -4327, -5519, -2835, 52, 3432, 2811, 1359, -1665, -2926, -385, -846, -2124, -615, -1337, -2418, -2094, -3494, -2096, 891, 1699, -348, -445, 1114, 1280, 1839, -784, -3965, -3185, 67, 2825, 3597, 1871, 2796, 1656, 1470, 2990, 157, -1233, -533, 1, -1307, -1029, -51, 78, 1944, 2777, 878, -941, -1082, -207, 921, -2020, -2049, 1210, 2747, -193, 910, 3305, 1892, -2341, -4326, -5964, -3236, -3058, -3357, -4885, -6834, -6759, -4003, -3199, -3428, -3998, -2959, 22, 1413, 1302, 700, -978, -3962, -5873, -5596, -5474, -4048, -6180, -4953, -5621, -4392, -3574, -2096, 951, 2045, 3426, 4241, 6079, 3982, 1829, 937, 1418, -235, -3479, -2212, -914, 410, 495, 496, -1218, -722, -1973, -2197, -201, -1619, -1211, 1537, 1702, -501, -2193, -1035, -832, -2523, -3333]
5189c333j20J336N20J50M57L62J55j443J386J438J261j844l18k601K572J433J157
5172B568J354l222l884k794K884J734J278J203J027j772j118L094K083l087k007
5157f59O2o05J698P77j314J160n89j033k15j419j83j52j048k51L300J797m7R89
5139B268k60l031k057M57J596j120Q32J459n88j665j334n37J777J316J392j99
$$ y = [-3333, -3453, -2117, -1597, -1447, -990, -628, -473, -1916, -530, 908, 2169, 325, 7, -2594, -22, 1411, 2568, 3922, 700, -3184, -5978, -3094, -1360, -82, 1121, 2148, 376, -742, 2352, 4435, 1348, -659, -597, -1202, 496, 1273, -41, 1119, 530, -503, -718, -2137, -2320, -2472, -3520, -3771, -471, 1326, 1279, 2268, 2008, -1023, -3080, -2623, -1027, -2147, -1315, 144, -444, -2109, -3443, -3980, -2203, -887, 505, 306]
$$ [...]
##END NTUPLES=NMR SPECTRUM
##END=
