##TITLE=Analysis number 321822
Compound Code sb 01291
Project Code adrs
Chemist Name stores
##JCAMPDX= 6.0         $$ Bruker NMR JCAMP-DX V2.0
##DATA TYPE= NMR SPECTRUM
##DATA CLASS= NTUPLES
##ORIGIN= Bruker BioSpin GmbH
##OWNER= nmr
$$ XWIN-NMR		Version 3.5
$$ Wed Aug 30 09:46:46 2006 GMT Daylight Time (UT+1h)  MAYBRIDGE\nmr@NMR_250MHZ
##.OBSERVE FREQUENCY= 250.131544655141
##.OBSERVE NUCLEUS= ^1H
##.ACQUISITION MODE= SIMULTANEOUS (DQD)
##.ACQUISITION SCHEME= undefined
##.AVERAGES= 16
##.DIGITISER RES= 18
##SPECTROMETER/DATA SYSTEM= dpx250
##.PULSE SEQUENCE= zg30
##.SOLVENT NAME= CDCl3
##.SHIFT REFERENCE= (INTERNAL, CDCl3, 0, 16.522)
##AUDIT TRAIL= $$ (NUMBER, WHEN, WHO, WHERE, WHAT)
$$ ##TITLE= Audit trail, XWIN-NMR		Version 3.5
$$ ##JCAMPDX= 5.01
$$ ##ORIGIN= Bruker BioSpin GmbH
$$ ##OWNER= nmr
$$ C:\u/data/dgb/nmr/ADRS/1830/pdata/1/auditp.txt
$$ ##AUDIT TRAIL=  $$ (NUMBER, WHEN, WHO, WHERE, WHAT)
(   1,<2006-08-30 09:45:48.08 +100>,<MAYBRIDGE\nmr>,<NMR_250MHZ>,
      <created by zg, POWCHK disabled, PULCHK disabled
       configuration hash MD5:
       E2 DF 36 D8 04 B2 41 60 5A D7 A3 38 5A 4B D0 FE
       data hash MD5: 64K
       77 1C FA 3D 4C EC E8 13 E7 E5 38 14 43 E4 22 CB>)
(   2,<2006-08-30 09:46:17.89 +100>,<MAYBRIDGE\nmr>,<NMR_250MHZ>,
      <Start of raw data processing
       ef LB = 0.3 FT_mod = 6 PKNL = 1 SI = 32K 
       data hash MD5: 32K
       35 9B E2 1C F7 19 70 A6 5F 0F 53 B5 FC EE F9 B3>)
(   3,<2006-08-30 09:46:22.02 +100>,<MAYBRIDGE\nmr>,<NMR_250MHZ>,
      <apk 
       data hash MD5: 32K
       76 E1 25 CD 86 79 AF 9E E7 1D 88 6A BE B2 D9 61>)
(   4,<2006-08-30 09:46:23.30 +100>,<MAYBRIDGE\nmr>,<NMR_250MHZ>,
      <abs ABSG = 5 
       data hash MD5: 32K
       99 8D AE 45 F1 96 BB 39 79 43 26 6A AC E5 58 E9>)
$$ ##END=
$$ 
$$ hash MD5
$$ A4 10 02 68 FC 44 38 25 99 D1 60 C1 EB AC C9 9A
##$RELAX= 
##$RELAX= 
##$RELAX= 
##$RELAX= 
##$RELAX= 
##$RELAX= 
##$RELAX= 
$$ Bruker specific parameters
$$ --------------------------
##$DU= <C:\u>
##$EXPNO= 1830
##$NAME= <ADRS>
##$PROCNO= 1
##$TYPE= <nmr>
##$USER= <dgb>
##$AMP= (0..31)
100 100 100 100 100 100 100 100 100 100 100 100 100 100 100 100 100 100 
100 100 100 100 100 100 100 100 100 100 100 100 100 100 
##$AQSEQ= 0
##$AQ_mod= 3
##$AUNM= <au_zg>
##$AUTOPOS= <6 >
##$BF1= 250.13
##$BF2= 250.13
##$BF3= 250.13
##$BF4= 250.13
##$BF5= 500.13
##$BF6= 500.13
##$BF7= 500.13
##$BF8= 500.13
##$BYTORDA= 1
##$CFDGTYP= 0
##$CFRGTYP= 5
##$CHEMSTR= <none>
##$CNST= (0..31)
1 1 145 1 1 1 1 1 1 1 1 1 1 1 1 1 1 1 1 1 1 1 1 1 1 1 1 1 1 1 1 1 
##$CPDPRG= <>
##$CPDPRG1= <>
##$CPDPRG2= <>
##$CPDPRG3= <>
##$CPDPRG4= <mlev>
##$CPDPRG5= <mlev>
##$CPDPRG6= <mlev>
##$CPDPRG7= <mlev>
##$CPDPRG8= <mlev>
##$CPDPRGB= <>
##$CPDPRGT= <>
##$D= (0..31)
0 1 0 0 0 0 0 0 0 0.06 0 0 0 0 0 0 0.0002 0 0 0 0 0 0 0 0 0 0 0 0 0 0 
0 
##$DATE= 1156927546
##$DBL= (0..7)
120 120 120 120 120 120 120 120 
##$DBP= (0..7)
150 150 150 150 150 150 150 150 
##$DBP07= 0
##$DBPNAM0= <>
##$DBPNAM1= <>
##$DBPNAM2= <>
$$ [...]
##$SUBNAM7= <"">
##$SUBNAM8= <"">
##$SUBNAM9= <"">
##$SW= 20.6930455092707
##$SWIBOX= (0..15)
0 0 3 0 0 0 0 0 0 0 0 0 0 0 0 0 
##$SW_h= 5175.983436853
##$TD= 65536
##$TD0= 1
##$TE= 295.16
##$TE2= 300
##$TE3= 300
##$TEG= 300
##$TL= (0..7)
0 120 120 120 120 120 120 120 
##$TP= (0..7)
150 150 150 150 150 150 150 150 
##$TP07= 0
##$TPNAME0= <>
##$TPNAME1= <>
##$TPNAME2= <>
##$TPNAME3= <>
##$TPNAME4= <>
##$TPNAME5= <>
##$TPNAME6= <>
##$TPNAME7= <>
##$TPOAL= (0..7)
0.5 0.5 0.5 0.5 0.5 0.5 0.5 0.5 
##$TPOFFS= (0..7)
0 0 0 0 0 0 0 0 
##$TUNHIN= 0
##$TUNHOUT= 0
##$TUNXOUT= 0
##$USERA1= <user>
##$USERA2= <user>
##$USERA3= <user>
##$USERA4= <user>
##$USERA5= <user>
##$V9= 5
##$VALIST= <valist>
##$VCLIST= <CCCCCCCCCCCCCCC>
##$VD= 0
##$VDLIST= <DDDDDDDDDDDDDDD>
##$VPLIST= <PPPPPPPPPPPPPPP>
##$VTLIST= <TTTTTTTTTTTTTTT>
##$WBST= 1024
##$WBSW= 4
##$XGAIN= (0..3)
0 0 0 0 
##$XL= 0
##$YL= 0
##$YMAX_a= 351744
##$YMIN_a= -534975
##$ZGOPTNS= <>
##$ZL1= 120
##$ZL2= 120
##$ZL3= 120
##$ZL4= 120
##$ABSF1= 16.522
##$ABSF2= -4.171173
##$ABSG= 5
##$ABSL= 3
##$ALPHA= 0
##$AQORDER= 0
##$ASSFAC= 0
##$ASSFACI= 0
##$ASSFACX= 0
##$ASSWID= 0
##$AUNMP= <proc_1d>
##$AZFE= 0.1
##$AZFW= 0.1
##$BCFW= 0
##$BC_mod= 0
##$BYTORDP= 0
##$COROFFS= 0
##$CY= 12.5
##$DATMOD= 1
##$DC= 0
##$DFILT= <>
##$DTYPP= 0
##$F1P= 14.0000005364418
##$F2P= -0.99999901652339
##$FCOR= 0.5
##$FTSIZE= 32768
##$FT_mod= 6
##$GAMMA= 0
##$GB= 0
##$INTBC= 1
##$INTSCL= 1
##$ISEN= 128
##$LB= 0.3
##$LEV0= 0
##$LPBIN= 0
##$MAXI= 10000
##$MC2= 0
##$MEAN= 0
##$ME_mod= 0
##$MI= 0
##$NCOEF= 0
##$NC_proc= -3
##$NLEV= 6
##$NOISF1= 0
##$NOISF2= 0
##$NSP= 0
##$NTH_PI= 0
##$NZP= 0
##$OFFSET= 16.522
##$PC= 1
##$PHC0= 155.2415
##$PHC1= 7.199951
##$PH_mod= 1
##$PKNL= yes
##$PPARMOD= 0
##$PSCAL= 4
##$PSIGN= 0
##$REVERSE= no
##$SF= 250.13
##$SI= 32768
##$SIGF1= 0
##$SIGF2= 0
##$SINO= 400
##$SIOLD= 32768
##$SREGLST= <1H.CDCl3>
##$SSB= 0
##$STSI= 32768
##$STSR= 0
##$SW_p= 5175.98343685301
##$SYMM= 0
##$S_DEV= 0
##$TDeff= 65536
##$TDoff= 0
##$TI= <Analysis number 999999
Compound Code 99
Book Reference 9
Project Code 9>
##$TILT= no
##$TM1= 0
##$TM2= 0
##$TOPLEV= 0
##$USERP1= <user>
##$USERP2= <user>
##$USERP3= <user>
##$USERP4= <user>
##$USERP5= <user>
##$WDW= 1
##$XDIM= 32768
##$YMAX_p= 462389222
##$YMIN_p= -176794
$$ End of Bruker specific parameters
$$ ---------------------------------
##NTUPLES= NMR SPECTRUM
##VAR_NAME=  FREQUENCY,     SPECTRUM/REAL,   SPECTRUM/IMAG
##SYMBOL=    X,             R,               I
##VAR_TYPE=  INDEPENDENT,   DEPENDENT,       DEPENDENT
##VAR_FORM=  AFFN,          ASDF,            ASDF
##VAR_DIM=   32768,         32768,           32768
##UNITS=     HZ,            ARBITRARY UNITS, ARBITRARY UNITS
##FACTOR=    0.157963299565203, 1,           1
##FIRST=     4132.6476996994, 0,             0
##LAST=      -1043.33573715361, 0,           0
##MIN=       -1043.33573715361, -176794,     0
##MAX=       4132.6476996994, 462389222,     0
$$ Real data points
##PAGE= N=1
##DATA TABLE= (X++(R..R)), XYDATA
$$ [...]
$$ plain form
18636 65469 71694 113595 112808 70100 105839 126464 84997 53054 39204 56541 86668 108733
18624 108733 112867 65599 57029 34607 9222 1299 6040 -11507 61602 90341 34451 -7112
18612 -7112 22155 46210 71556 76202 95103 84917 21603 310 -11545 5679 19329 34938
18600 34938 68684 80008 40786 3329 32461 54569 73087 59965 45479 42395 26831 36599
18588 36599 47086 34503 19569 43377 75510 45208 25444 70156 81406 107105 97962 94112
18576 94112 106545 78560 68286 65043 49862 39002 -4740 -47530 -74899 -65244 -48344 -30075
18564 -30075 10997 53557 50681 60871 89176 104719 60649 66023 42002 20320 28829 37722
18552 37722 -17141 -17339 -1818 -5339 -38180 -46342 -36791 6279 47051 50162 83134 104110 57246
$$ packed form
18636F5469O225M1901p87m2708L5739K0625m1467l1943j3850J7337L0127K2065
18624A08733M134m7268q570k2422k5385p923M741j7547P3109K8739n5890m1563
18612g112K9267K4055K5346M646J8901j0186o3314k1293j1855J7224J3650J5609
18600C4938L3746J1324l9222l7457K9132K2108J8518j3122j4486l084j5564R768
18588C6599J0487j2583j4934K3808L2133l0302j9764M4712J1250K5699r143l850
18576I4112J2433k7985j0274l243j5181j0860m3742m2790k7369R655J6900J8269
18564c0075M1072M2560k876J0190K8305J5543m4070N374k4021k1682Q509Q893
18552C7722n4863j98J5521l521l2841q162R551M3070M0772L111L2972K0976m6864
$$ plain form
18539 57246 22774 11023 36193 55503 60237 78861 109080 112847 89274 84197 126592 158553
18527 158553 194676 207836 232790 196700 177606 193480 213484 240911 224909 196651 177637
18516 177637 186856 165816 214252 223341 198524 206984 248136 246638 261289 251497 235358 232616 150137
18503 150137 97799 125526 132999 163547 193933 223161 209443 180084 204998 189800 191314 224008
18491 224008 248840 267764 266503 241183 251078 296639 305151 283721 279567 287367 273500 275028 329540
18478 329540 360395 341831 345980 356163 358217 340523 320469 319785 278075 240802 272747 326765
18466 326765 389228 392242 401340 421881 435885 410690 415364 407863 409087 398040 423452 444269
18454 444269 489285 484183 468593 521518 584246 587657 626411 645166 691073 747643 792678 796894
$$ packed form
18539E7246l4472j1751K5170J9310M734J8624L0219L767k3573n077M2395L1961
18527A58553L6123J3160K4954l6090j9094J5874K0004K7427j6002k8258j9014
18516A77637R219k1040M8436R089k4817Q460M1152j498J4651r792j6139k742q2479
18503A50137n2338K7727P473L0548L0386K9228j3718k9359K4914j5198J514L2694
18491B24008K4832J8924j261k5320R895M5561Q512k1430m154P800j3867J528N4512
18478C29540L0855j8564M149J0183K054j7694k0054o84m1710l7273L1945N4018
18466C26765O2463L014R098K0541J4004k5195M674p501J224j1047K5412K0817
18454D44269M5016n102j5590N2925O2728L411L8754J8755M5907N6570M5035M216
$$ plain form
18442 796894 827413 856573 907078 982942 1084631 1183006 1272652 1374268 1482694 1571289 1597072
18431 1597072 1616295 1657465 1737860 1888516 2091441 2346525 2648018 3030074 3611941 4365810
18421 4365810 5363300 6808841 9023976 11982743 14673763 16455957 17301422 16733176 15410532
18412 15410532 14628306 14878962 16045092 18116432 21860897 28752953 40089792 53923333
18404 53923333 65248825 73053776 76950689 76870938 79399461 88733628 101918864 111647653
18396 111647653 112877759 106104757 91882313 76565543 65916475 59833736 57012156
18389 57012156 57586861 63151375 73118488 82430201 88262313 88479756 80577275 68790190
18381 68790190 57767678 49729984 43985784 39238772 35051398 31453601 28626254 26500987
$$ packed form
18442G96894L0519K9160N0505P5864J01689R8375Q9646J01616J08426Q8595K5783
18431A597072J9223M1170Q0395J50656K02925K55084L01493L82056N81867P53869
18421D365810R97490J445541K215135K958767K691020J782194Q45465n68246j322644
18412A5410532p82226K50656J166130K071340L744465O892056J1336839J3833541
18404E3923333J1325492P804951L896913p9751K528523R334167J3185236R728789
18396A11647653J230106o773002j4222444j5316770j0649068o082739k821580
18389E7012156N74705N564514R967113R311713N832112K17443p902481j1787085
18381F8790190j1022512q037694n744200m747012m187374l597797k827347k125267
$$ plain form
18373 26500987 24803274 23408032 22288516 21378847 20823969 20678142 21174422 22607718 25559086
18364 25559086 31165149 40553708 51951589 60772346 65367601 64987412 58158327 49013752
18356 49013752 41858918 37379065 34432364 32215396 31101703 32058785 35387949 39403100
18348 39403100 41853587 42331490 39966517 34884139 29721775 25976793 23365147 21142751
18340 21142751 19063549 17140252 15563741 14218971 13081883 12170341 11439705 10874766
18332 10874766 10367073 9945119 9575388 9234377 8852051 8466481 8136867 7822357 7560752
18323 7560752 7278125 6940255 6678312 6438716 6224042 6046431 5847748 5651802 5455847
18314 5455847 5271644 5091804 4918303 4769216 4622811 4476139 4353095 4212515 4044849
$$ packed form
18373B6500987j697713j395242j119516r09669n54878j45827M96280J433296K951368
18364B5559086N606063R388559J1397881Q820757M595255l80189o829085r144575
18356D9013752p154834m479853k946701k216968j113693R57082L329164M015151
18348C9403100K450487M77903k364973n082378n162364l744982k611646k222396
18340B1142751k079202j923297j576511j344770j137088r11542p30636n64939
18332A0874766n07693m21954l69731l41011l82326l85570l29614l14510k61605
18323G560752k82627l37870k61943k39596k14674j77611j98683j95946j95955
18314E455847j84203j79840j73501j49087j46405j46672j23044j40580j67666
$$ plain form
18305 4044849 3889259 3768407 3684522 3592458 3468365 3354503 3265334 3160447 3065655 3006413
18295 3006413 2904089 2824300 2771854 2740939 2676111 2599848 2510689 2421058 2342605 2302783 2240288
18284 2240288 2170257 2106162 2065250 1965435 1920360 1905650 1846571 1785669 1745659 1771096 1738351
18273 1738351 1668097 1604889 1597491 1564935 1529970 1476786 1461792 1434499 1407074 1351616 1295444
18262 1295444 1281484 1317827 1368257 1358722 1318221 1246256 1152400 1116173 1071812 1001791 1003322 994754
18250 994754 1017396 975441 929166 908328 878540 885325 859219 857857 816056 789632 753533 725745
18238 725745 699750 708917 681373 662169 658453 655188 668358 640565 607897 590334 607787 597037
18226 597037 559802 521958 486131 458162 470533 475784 461385 466781 450432 458931 444012 428662
$$ packed form
18305D044849j55590j20852q3885r2064j24093j13862q9169j04887r4792n9242
18295C006413j02324p9789n2446l0915o4828p6263q9159q9631p8453l9822o2495
18284B240288p0031o4095m0912r9815m5075j4710n9079o0902m0010K5437l2745
18273A738351p0254o3208p398l2556l4965n3184j4994k7293k7425n5458n6172
18262A295444j3960L6343N0430r535m0501p1965r3856l6227m4361p0021J531q568
18250I94754K2642m1955m6275k0838k9788O785k6106j362m1801k6424l6099k7788
18238G25745k5995R167k7544j9204l716l265J3170k7793l2668j7563J7453j0750
18226E97037l7235l7844l5827k7969J2371N251j4399N396j6349Q499j4919j5350
$$ plain form
18214 428662 408913 418840 419383 421779 417962 407851 362749 342360 336019 367231 366966 360626 374435
18201 374435 356055 312330 291160 311490 319374 251377 229137 222918 262792 255460 235885 239672
18189 239672 260287 275744 310154 351082 315390 282987 298280 354862 389451 454148 518298
18178 518298 532128 543238 549234 542152 511231 499551 472412 423262 404406 398415 337853 273982
18166 273982 262919 256797 201219 188558 206799 232757 246824 263933 225954 264646 302737 349438
18154 349438 359545 328330 361765 345065 314878 295948 256508 270137 257887 263839 243813 233469
18142 233469 263296 287188 314085 348532 365347 376976 384123 387419 386950 410457 406242 429198
18130 429198 481578 511333 568723 619098 667026 737906 800523 838709 969203 1086920 1160046
$$ packed form
18214D28662j9749R927N43K396l817j0111m5102k0389o341L1212k65o340J3809
18201C74435j8380m3725k1170K0330P884o7997k2240o219L9874p332j9575L787
18189B39672K0615J5457L4410M0928l5692l2403J5293N6582L4589O4697O4150
18178E18298J3830J1110N996p082l0921j1680k7139m9150j8856n991o0562o3871
18166B73982j1063o122n5578j2661J8241K5958J4067J7109l7979L8692L8091M6701
18154C49438J0107l1215L3435j6700l0187j8930l9440J3629j2250N952k0026j0344
18142B33469K9827K3892K6897L4447J6815J1629P147L296m69K3507m215K2956
18130D29198N2380K9755N7390N0375M7928P0880O2617L8186J30494J17717P3126
$$ plain form
18119 1160046 1223984 1359775 1547170 1806210 2122211 2520608 3090835 4003606 5488063
18110 5488063 8141837 13336168 22784369 33918415 40407179 43936164 41580521 31908473
18102 31908473 24058558 19656493 17167640 14970015 12556654 10411998 8798000 7630619
18094 7630619 6688544 5941727 5332268 4824674 4413514 4101769 3843553 3620424 3435738
18085 3435738 3262243 3049504 2855573 2673948 2514640 2425576 2340173 2247522 2142836 2030624
18075 2030624 1941975 1868343 1779542 1683662 1587313 1540261 1462859 1407002 1376492 1334436 1297630
18064 1297630 1297688 1241345 1207922 1167176 1154679 1128874 1055530 999802 961048 913850 873729 872604
18052 872604 901306 892399 855131 783758 764494 794535 803196 790616 704833 661820 645502 681119
$$ packed form
18119A160046O3938J35791J87395K59040L16001L98397N70227R12771J484457
18110E488063K653774N194331R448201J1134046O488764L528985k355643r672048
18102C1908473p849915m402065k488853k197625k413361k144656j613998j167381
18094G630619r42075p46817o09459n07594m11160l11745k58216k23129j84686
18085C435738j73495k12739j93931j81625j59308q9064q5403r2651j04686j12212
18075B030624q8649p3632q8801r5880r6349m7052p7402n5857l0510m2056l6806
18064A297630N8n6343l3423m0746j2497k5805p3344n5728l8754m7198m0121j125
18052H72604K8702q907l7268p1373j9264L0041Q661j2580q5783m3013j6318L5617
$$ plain form
18040 681119 665446 570598 539519 510655 487950 515276 531039 532058 552799 511181 454169 438292
18028 438292 406291 405378 374764 339542 350984 368646 391483 414231 418558 430619 423976 383124
18016 383124 371553 409572 399121 359064 328665 312138 327742 343426 298806 250236 237999
18005 237999 243773 229311 205268 226714 253352 289473 256373 234601 251007 279561 275523 267714
17993 267714 265257 232063 238365 237645 216588 176749 172487 162951 119622 81790 74358 76084 61591
17980 61591 94727 115929 52730 37231 63119 102999 130326 137936 148437 157375 146104 148615
17968 148615 147376 151922 148617 101799 56913 49058 67025 52145 83795 89286 68281 79692
17956 79692 89675 82874 44753 27206 46942 68483 50596 52489 72749 80790 78074 61423 62522
$$ packed form
18040F81119j5673r4848l1079k8864k2705K7326J5763J019K0741m1618n7012j5877
18028D38292l2001r13l0614l5222J1442J7662K2837K2748M327J2061o643m0852
18016C83124j1571L8019j0451m0057l0399j6527J5604J5684m4620m8570j2237
18005B37999N774j4462k4043K1446K6638L6121l3100k1772J6406K8554m038p809
17993B67714k457l3194O302p20k1057l9839m262r536m3329l7832p432J726j4493
17980F1591L3136K1202o3199j5499K5888L9880K7327P610J0501Q938j1271K511
17968A48615j239M546l305m6818m4886p855J7967j4880L1650N491k1005J1411
17956G9692R983o801l8121j7547J9736K1541j7887J893K0260Q041k716j6651J099
$$ plain form
17943 62522 53732 6477 10506 2232 -33296 -37207 -49173 -38269 16032 63321 62171 40375 8553
17930 8553 2210 46715 91005 45212 25932 31949 45207 26250 12783 36277 86554 99494
17918 99494 92349 21364 20598 51279 85521 122285 141920 135399 124179 137609 158172 150549 169647
17905 169647 179969 186427 159577 170225 171670 174583 193955 254459 253615 277260 249674 229054
17893 229054 252661 242087 237197 229032 215278 278497 392438 520264 590081 641517 671544
17882 671544 622151 555021 496171 474422 435118 401557 404347 400676 427197 477564 519222 570282
17870 570282 577872 551355 464328 368875 320441 286138 282376 300240 243185 215163 177839 166090
17858 166090 166493 127016 121997 139674 129313 137487 109758 134603 154593 177761 267945 345946
$$ packed form
17943F2522q790m7255M029q274l5528l911j1966J0904N4301M7289j150k1796l1822
17930H553o343M4505M4290m5793j9280O017J3258j8957j3467K3494N0277J2940
17918I9494p145p0985p66L0681L4242L6764J9635o521j1220J3430K0563p623J9098
17905A69647J0322O458k6850J0648J445K913J9372O0504q44K3645k7586k0620
17893B29054K3607j0574m890q165j3754O3219J13941J27826O9817N1436L0027
17882F71544m9393o7130n8850k1749l9304l3561K790l671K6521N0367M1658N1060
17870E70282P590k6517q7027r5453m8434l4303l762J7864n7055k8022l7324j1749
17858A66090M03l9477n019J7677j0361Q174k7729K4845J9990K3168R0184P8001
$$ plain form
17846 345946 345099 354112 357525 307887 272455 262363 256389 274628 310264 363942 410555 379506
17834 379506 348698 336008 309861 273381 230619 181917 172885 188724 179345 143171 148187 168057
17822 168057 163689 163467 132748 103323 115086 100542 147909 171813 131677 120537 101560 97867
17810 97867 89296 69706 60503 59391 59194 81549 84004 90004 70659 56787 88309 130337 111796
17797 111796 112275 132352 140876 128695 157087 198182 203163 199741 208685 214353 230194 225747 262309
17784 262309 305367 290620 227808 168465 178829 209996 210158 189117 167800 108763 56213 60730
17772 60730 79952 153692 141032 121280 126807 144227 138462 96065 68260 83803 114986 106920
17760 106920 86097 61158 103414 120942 107803 108096 112960 107795 122304 148002 142856 143184 148290
$$ packed form
17846C45946q47R013L413m9638l5432j0092n974J8239L5636N3678M6613l1049
17834C79506l0808j2690k6147l6480m2762m8702r032J5839r379l6174N016J9870
17822A68057m368k22l0719k9425J1763j4544M7367K3904m0136j1140j8977l693
17810I7867q571j9590r203j112j97K2355K455O000j9345j3872L1522M2028j8541
17797A11796M79K0077Q524j2181K8392M1095M981l422Q944N668J5841m447L6562
17784B62309M3058j4747o2812n9343J0364L1167J62k1041k1317n9037n2550M517
17772F0730J9222P3740j2660j9752N527J7420n765m2397k7805J5543L1183q066
17760A06920k0823k4939M2256J7528j3139K93M864n165J4509K5698n146L28N106
$$ plain form
17747 148290 148843 118406 123981 156541 166688 190461 203989 210440 204553 181736 245994 286806
17735 286806 313175 331384 359131 348067 311459 304634 313859 309067 320838 313433 328877 316886
17723 316886 265230 230733 257478 319622 325138 300554 277550 313447 319901 364947 382137 342987
17711 342987 342371 385942 377808 390999 436989 496084 594979 656707 727080 768803 916565 1076717
17699 1076717 1213199 1338737 1476759 1566357 1583334 1551776 1552356 1632003 1751400 1877668 2075406
17688 2075406 2354521 2702862 3202402 3891978 4824046 6138819 8219903 11481406 16376091
17679 16376091 23343627 32276913 42341571 51912435 59363672 63039185 62398339 58090318
17671 58090318 51564201 44471585 37868109 32274819 27669796 23870985 20697508 18152010
$$ packed form
17747A48290N53l0437N575L2560J0147K3773J3528O451n887k2817O4258M0812
17735B86806K6369J8209K7747j1064l6608o825R225m792J1771p405J5444j1991
17723C16886n1656l4497K6745O2144N516k4584k3004L5897O454M5046J7190l9150
17711C42987o16M3571q134J3191M5990N9095R8895O1728P0373M1723J47762J60152
17699A076717J36482J25538J38022Q9598J6977l1558N80P9647J19397J26268J97738
17688B075406K79115L48341M99540O89576R32068J314773K081084L261503M894685
17679A6376091O967536Q933286J0064658R570864P451237L675513o40846m308021
17671E8090318o526117p092616o603476n593290m605023l798811l173477k545498
$$ plain form
17663 18152010 16205367 14907856 14193993 13973679 14113285 14501913 14976790 15184744 15108367
17654 15108367 14643652 13828224 12867775 11790900 10776745 9897561 9190127 8673505 8320060
17645 8320060 8133048 8189026 8536974 9199300 10138692 11273645 12337121 13046408 13174713
17636 13174713 12721409 11847690 10941750 10146300 9603289 9288622 9152581 9277313 9826273
17627 9826273 10938035 12856689 16053359 20967332 27716830 35894229 44494959 51728512
17619 51728512 56288389 57096451 54420906 49117019 42685255 36425094 30989533 26432864
17611 26432864 22661599 19602462 17062861 14925143 13162191 11689462 10554010 9637651
17603 9637651 8905845 8330127 7838440 7424163 7060870 6767675 6509577 6286687 6020399
$$ packed form
17663A8152010j946643j297511p13863k20314J39606L88628M74877K07954p6377
17654A5108367m64715q15428r60449j076875j014155q79184p07434n16622l53445
17645H320060j87012N5978L47948O62326R39392J134953J063476P09287J28305
17636A3174713m53304q73719r05940p95450n43011l14667j36041J24732N48960
17627I826273J111762J918654L196670M913973O749498Q177399Q600730P233553
17619E1728512M559877Q08062k675545n303887o431764o260161n435561m556669
17611B6432864l771265l059137k539601k137718j762952j472729j135452r16359
17603I637651p31806n75718m91687m14277l63293k93195k58098k22890k66288
$$ plain form
17594 6020399 5773024 5499423 5193406 4927881 4693637 4514454 4361651 4151688 3925794
17585 3925794 3724168 3576799 3452824 3319205 3190199 3125184 3066158 2965885 2887566 2780194
17575 2780194 2645925 2506223 2425908 2353774 2265657 2201666 2120232 2047624 2016491 1937630 1852263
17564 1852263 1824305 1765998 1693564 1649587 1634059 1564576 1488635 1449747 1421197 1392584 1372440
17553 1372440 1342940 1283439 1256381 1250678 1240035 1231976 1198867 1155139 1123467 1097468 1098763 1083107
17541 1083107 1057011 1022610 999606 934391 851398 779110 755894 769217 822648 826997 795900
17530 795900 717494 701318 680232 683079 677982 655466 643105 660317 654709 598588 563019 549778
17518 549778 575853 556220 543176 561335 545312 497832 490591 505803 519482 485095 514531 525274
$$ packed form
17594F020399k47375k73601l06017k65525k34244j79183j52803k09963k25894
17585C925794k01626j47369j23975j33619j29006o5015n9026j00273p8319j07372
17575B780194j34269j39702q0315p2134q8117o3991q1434p2608l1133p8861q5367
17564A852263k7958n8307p2434m3977j5528o9483p5941l8888k8550k8613k0144
17553A372440k9500n9501k7058n703j0643q059l3109m3728l1672k5999J295j5656
17541A083107k6096l4401k3004o5215q2993p2288k3216J3323N3431M349l1097
17530G95900p8406j6176k1086K847n097k2516j2361J7212n608n6121l5569j3241
17518E49778K6075j9633j3044J8159j6023m7480p241J5212J3679l4387K9436J0743
$$ plain form
17506 525274 468796 434020 413934 388527 351335 343547 354905 362948 363794 338735 309589 289885
17494 289885 326979 354429 323646 280059 265703 260314 235046 182952 178462 193739 235853 217693
17482 217693 203443 208137 230910 217759 200950 198609 188749 170583 144263 136610 164166 168231
17470 168231 175194 147611 196694 219075 174732 170148 220067 233478 189299 151704 166169 171644
17458 171644 128224 85872 97711 128661 139595 110234 89510 97934 75022 78676 70311 101962
17446 101962 137181 123048 99002 148934 242766 306249 335391 348653 350023 263794 175797 129012
17434 129012 156055 134368 147421 123517 108238 98915 102186 77054 121003 136654 100534 96232
17422 96232 87139 60350 45829 58786 61394 69392 63104 74967 72982 63630 46428 29989 49454
$$ packed form
17506E25274n6478l4776k0086k5407l7192p788J1358Q043Q46k5059k9146j9704
17494B89885L7094K7450l0783m3587j4356n389k5268n2094m490J5277M2114j8160
17482B17693j4250M694K2773j3151j6809k341r860j8166k6320p653K7556M065
17470A68231O963k7583M9083K2381m4343m584M9919J3411m4179l7595J4465N475
17458A71644m3420m2352J1839L0950J0934k9361k0724Q424k2912L654q365L1651
17446A01962L5219j4133k4046M9932R3832O3483K9142J3262J370q6229q7997m6785
17434A29012K7043k1687J3053k3904j5279r323L271k5132M3949J5651l6120m302
17422I6232r093k6789j4521J2957K608P998o288J1863j985r352j7202j6439J9465
$$ plain form
17409 49454 99040 114066 102032 122534 148210 132061 89230 78027 106311 81360 52738 78207
17397 78207 77933 67162 85179 70117 24878 -9606 16859 11328 -14106 38856 72478 68975
17385 68975 62615 33073 5727 -27708 -48640 -32579 -1251 1112 -4091 58266 85559 61239
17373 61239 1637 12321 26960 28057 10023 -9736 21849 52218 47368 40305 36409 22398
17361 22398 -20180 -18836 8156 27397 67913 83614 71739 61359 8039 -37463 -6363 -8784
17349 -8784 3692 19890 33343 21214 10234 20906 34233 60238 76531 98930 57739 68436
17337 68436 28052 1672 30922 37493 55491 57299 2341 -32951 -37127 -50913 -30572 -30593 -78576
17324 -78576 -93859 -58689 -30220 2894 -14693 -37162 -21926 -5598 70 15910 25915 33961
$$ packed form
17409D9454M9586J5026j2034K0502K5676j6149m2831j1203K8284k4951k8622K5469
17397G8207k74j0771J8017j5062m5239l4484K6465n531k5434N2962L3622l503
17385F8975o360k9542k7346l3435k0932J6061L1328K363n203O2357K7293k4320
17373F1239n9602J0684J4639J097j8034j9759L1585L0369m850p063l896j4011
17361B2398m2578J344K6992J9241M0516J5701j1875j0380n3320m5502L1100k421
17349h784J2476J6198J3453j2129j0980J0672J3327K6005J6293K2399m1191J0697
17337F8436m0384k6380K9250O571J7998J808n4958l5292m176j3786K0341k1m7983
17324g8576j5283L5170K8469L3114j7587k2469J5236J6328N668J5840J0005Q046
$$ plain form
17312 33961 73772 64727 20897 3319 -25985 -35160 -20540 -15776 -22794 -74384 -90478 -77587
17300 -77587 -102189 -100678 -44221 -25694 -59069 -46469 -6874 14000 6462 21820 2983 14190
17288 14190 5611 12949 30506 42366 40797 32747 29320 12437 4887 25218 47570 21721 2900
17275 2900 6172 -29622 -65725 -63571 -40368 -2090 18236 16044 14561 -18711 -7 -8180 -36046
17262 -36046 -26032 -30208 -61038 -10976 13951 24351 36239 59003 34689 12741 26900 22839
17250 22839 11586 -13501 11751 26920 27007 -39 -830 20649 1343 16648 32224 -14367 -36799
17237 -36799 -47857 -38145 -48861 -47597 -26565 -16505 -20305 -62343 -48088 -1353 3834 -9993
17225 -9993 -5508 2620 4978 -2680 -849 3445 17154 31254 6509 -4798 26250 30264 -21898
$$ packed form
17312C3961L9811r045m3830j7578k9304r175J4620M764p018n1590j6094J2891
17300g7587k4602J511N6457J8527l3375J2600L9595K0874p538J5358j8837J1207
17288A4190q579P338J7557J1860j569q050l427j6883p550K0331K2352k5849j8821
17275B900L272l5794l6103K154K3203L8278K0326k192j483l3272J8704q173k7866
17262c6046J0014m176l0830N0062K4927J0400J1888K2764k4314k1948J4159m061
17250B2839j1253k5087K5252J5169Q7k7046p91K1479j9306J5305J5576m6591k2432
17237c6799j1058R712j0716J264K1032J0060l800m2038J4255M6735N187j3827
17225i993M485Q128K358p658J831M294J3709J4100k4745j1307L1048M014n2162
$$ plain form
17212 -21898 -17994 21740 45999 36169 24332 3324 -43018 -67494 937 50078 73338 71630
17200 71630 76931 64018 35024 56561 78963 32818 30429 46190 41166 40296 12017 -13521 -11508
17187 -11508 -14148 6593 1696 -45916 -83392 -79322 -67741 -88101 -75850 -1976 -19797 -20555 -3435
17174 -3435 -307 -23 18494 30796 15813 72202 131602 180127 205776 244822 233610 221931
17162 221931 238552 234668 233208 234996 213707 147606 116951 111588 142988 116786 94830 119939
17150 119939 142542 138349 132299 139420 151475 138067 117193 185499 140096 99677 109314 130890
17138 130890 83366 54233 27560 9331 2422 -14660 -56300 -81290 -35950 -4461 -4432 23789
17126 23789 9455 24458 33193 53212 28487 99451 145396 129294 67668 78161 91362 82221
$$ packed form
17212b1898L904L9734K4259r830j1837k1008m6342k4476O8431M9141K3260j708
17200G1630N301j2913k8994K1537K2402m6145k389J5761n024q70k8279k5538K013
17187a1508k640K0741m897m7612l7476M070J1581k0360J2251P3874j7821p58J7120
17174c435L128K84J8517J2302j4983N6389N9400M8525K5649L9046j1212j1679
17162B21931J6621l884j460J788k1289o6101l0655n363L1400k6202k1956K5109
17150A19939K2603m193o050P121J2055j3408k0874O8306m5403m0419R637K1576
17138A30890m7524k9133k6673j8229o909j7082m1640k4990M5340L1489K9K8221
17126B3789j4334J5003Q735K0019k4725P0964M5945j6102o1626J0493J3201r141
$$ plain form
17114 82221 60244 91302 160402 207636 260056 275077 288256 311951 318433 269825 214037 175398
17102 175398 168322 144186 95572 47955 46380 55844 89375 73031 18641 17161 53020 49417
17090 49417 27785 17509 70381 76760 28732 -22913 -16843 -1871 33987 26289 1278 -2674
17078 -2674 -10949 -5551 -30543 7577 24458 2781 9942 35452 43075 45641 29857 39123 778
17065 778 -28305 -11790 -4679 -36036 -36440 -16590 14862 25540 -8819 -42530 -69379 -74932 -47263
17052 -47263 39467 136883 105390 10821 -36988 -7869 32075 24981 35532 40091 30982 421
17040 421 15289 2095 -28673 -13316 29733 61428 11528 -87547 -81280 -60521 -64699 -55282 -42083
17027 -42083 -33509 -45800 10408 46441 38396 4465 -5874 14848 8687 52912 48374 26776
$$ packed form
17114H2221k1977L1058O9100M7234N2420J5021J3179K3695O482m8608n5788l8639
17102A75398p076k4136m8614m7617j575R464L3531j6344n4390j480L5859l603
17090D9417k1632j0276N2872O379m8028n1645O070J4972L5858p698k5011l952
17078b674q275N398k4992L8120J6881k1677P161K5510P623K566j5784R266l8345
17065G78k9083J6515P111l1357m04J9850L1452J0678l4359l3711k6849n553K7669
17052d7263Q6730R7416l1493r4569m7809K9119L9944p094J0551M559r109l0561
17040D21J4868j3194l0768J5357M3049L1695m9900r9075O267K0759m178R417J3199
17027d2083Q574j2291N6208L6033q045l3931j0339K0722o161M4225m538k1598
$$ plain form
17015 26776 7488 -7188 -20126 -22789 -29587 833 6461 -9084 -14343 -34080 -45048 7366
17003 7366 26239 12324 2595 62260 49360 -10334 -27883 -27868 -35447 -52151 -39792 -18105 -16196
16990 -16196 -40682 -34731 -13768 -27073 11851 51466 63701 36947 -8039 -65054 -93216 -93764
16978 -93764 -45007 -32057 15384 43047 25521 28043 15992 26036 1487 2072 4430 -13362
16966 -13362 -11187 -40440 -39449 -51135 -112207 -104596 -94977 -65944 -41774 -44187 -10505 -22236 -45265
16953 -45265 -24556 14046 47944 46253 47732 -6722 -29915 -32447 -29407 -53281 -45143 -21589 -33571
16940 -33571 -38462 -33709 -5976 -46427 -46870 -12827 -30846 -45956 -46452 -5782 39103 15620 58242
16927 58242 81816 75635 60877 25673 13210 27643 1737 6387 -5752 -22179 -63581 -73711
$$ packed form
17015B6776j9288j4676j2938k663o798L0420N628j5545n259j9737j0968N2414
17003G366J8873j3915r729N9665j2900n9694j7549J5p579j6704J2359K1687J909
16990a6196k4486N951K0963j3305L8924L9615J2235k6754m4986n7015k8162n48
16978i3764M8757J2950M7441K7663j7526K522j2051J0044k4549N85K358j7792
16966a3362K175k9253R91j1686o1072P611R619K9033K4170k413L3682j1731k3029
16953d5265K0709L8602L3898j691J479n4454k3193k532L040k3874Q138K3554j1982
16940c3571m891M753K7733m0451m43L4043j8019j5110m96M0670M4885k3483M2622
16927E8242K3574o181j4758l5204j2463J4433k5906M650j2139j6427m1402j0130
$$ plain form
16915 -73711 -47719 -20061 10667 -15913 -20323 28212 29480 27136 45506 17359 10868 43163
16903 43163 50166 45590 -14009 -5358 2530 -8840 48334 19751 -11773 -2035 -13064 -38677 -26269
16890 -26269 -33953 -42441 -47845 -37710 -27162 -45689 -43440 -42345 -89990 -120076 -104156 -93656 -127321
16877 -127321 -142614 -121164 -57075 -14814 -11905 -17180 -30175 -26785 -19785 -6317 25910 23188
16865 23188 8768 -48272 -62592 -28768 -58459 -42282 1328 13499 5890 -33583 -41687 9308
16853 9308 25288 29873 45635 30388 25636 46419 24440 13009 -11818 -47665 -66108 -67662
16841 -67662 -84634 -109738 -91390 -98060 -110563 -66455 -37001 -60746 -79461 -64465 -8939 17144
16829 17144 13156 -2399 -30737 -42449 -14887 12881 27519 46442 17779 -31458 -17669 -35432
$$ packed form
16915g3711K5992K7658L0728k6580m410M8535J268k344J8370k8147o491L2295
16903D3163P003m576n9599Q651P888j1370N7174k8583l1524R738j1029k5613J2408
16890b6269p684q488n404J0135J0548j8527K249J095m7645l0086J5920J0500l3665
16877a27321j5293K1450O4089M2261K909n275j2995L390P000J3468L2227k722
16865B3188j4420n7040j4320L3824k9691J6177M3610J2171p609l9473q104N0995
16853I308J5980M585J5762j5247m752K0783k1979j1431k4827l5847j8443j554
16841f7662j6972k5104J8348o670j2503M4108K9454k3745j8715J4996N5526K6083
16829A7144l988j5555k8338j1712K7562K7768J4638J8923k8663m9237J3789j7763
$$ plain form
16817 -35432 -36008 -19740 969 26158 29590 31045 13353 -35248 -71950 -75015 -63122 -18770 -29431
16804 -29431 -37560 -58401 -75473 -70257 -22443 29298 16054 13134 16733 -9642 -18598 17980 -19252
16791 -19252 -42300 -22727 -15323 -17393 -42351 -88516 -57294 -8132 40376 13329 -7199 -26638
16779 -26638 -23456 -58688 -53610 -35924 -18059 -29296 -2711 10844 6304 -23581 -88972 -88941 -109053
16766 -109053 -73441 -64410 -44690 -58408 -76958 -84015 -68934 -88359 -57180 -19469 -19375 -18601 -36468
16753 -36468 -14430 11283 -21927 -43551 -21451 2360 12930 9317 1981 40241 19969 -20575
16741 -20575 -41587 -59713 -97371 -128116 -109291 -87709 -100324 -111288 -87362 -101921 -108446 -64241
16729 -64241 -55820 -9715 42451 18922 3416 12029 -18060 -50334 -42650 -14475 -26366 -55763
$$ packed form
16817c5432n76J6268K0709K5189L432J455j7692m8601l6702l065J1893M4352j0661
16804b9431q129k0841j7072N216M7814N1741j3244k920L599k6375q956L6578l7232
16791a9252k3048J9573P404k070k4958m6165L1222M9162M8508k7047k0528j9439
16779b6638L182l5232N078J7686J7865j1237K6585J3555m540k9885o5391L1k0112
16766a09053L5612R031J9720j3718j8550p057J5081j9425L1179L7711R4P74j7867
16753c6468K2038K5713l3210k1624K2100K3811J0570l613p336L8260k0272m0544
16741b0575k1012j8126l7658l0745J8825K1582j2615j0964K3926j4559o525M4205
16729f4241Q421M6105N2166k3529j5506Q613l0089l2274P684K8175j1891k9397
$$ plain form
16717 -55763 -86053 -75097 -26306 18605 24522 27598 17722 -14968 -54607 -36160 -24478 -31710
16705 -31710 -43247 1618 -22207 -50946 -21539 -22051 -55579 -78880 -36937 -8898 -12026 -26567
16693 -26567 -46078 -52025 -41649 -48620 -33852 -2674 -39841 -79185 -64250 -33492 14637 26699
16681 26699 -45327 -79156 -60227 -46760 -54288 -18967 -15661 -3759 -42901 -68727 -49534 -38744
16669 -38744 -25321 -9973 -33835 -10438 -16122 -38761 -47714 -38815 -26020 -3030 -30616 -21248
16657 -21248 -18428 -6307 1 -15269 -58366 -52705 1334 41580 -6563 -48382 -83403 -68559
16645 -68559 -47967 -56004 -60785 -14690 -12982 -45712 -67921 -15689 8816 -944 -11221 3290
16633 3290 28228 23599 15628 -669 -19394 7838 27993 27468 38056 28753 19016 -21550 -28465
$$ packed form
16717e5763l0290J0956M8791M4911N917L076r876l2690l9639J8447J1682p232
16705c1710j1537M4865k3825k8739K9407n12l3528k3301M1943K8039l128j4541
16693b6567j9511n947J0376o971J4768L1178l7167l9344J4935L0758M8129J2062
16681B6699p2026l3829J8929J3467p528L5321L306J1902l9142k5826J9193J0790
16669c8744J3423J5348k3862K3397n684k2639q953Q899J2795K2990k7586R368
16657b1248K820J2121O308j5270m3097N661N4039M0246m8143m1819l5021J4844
16645f8559K0592q037m781M6095J708l2730k2209N2232K4505r760j0277J4511
16633C290K4938m629p971j6297j8725K7232K0155n25J0588r303r737m0566o915
$$ plain form
16620 -28465 -24407 -39764 -24436 27698 4159 -29076 -7471 -13813 -31043 -4061 51844 89361
16608 89361 91690 80449 83912 89620 45856 -23066 -53739 -73749 -58896 -15539 12158 4814
16596 4814 -3270 -49549 -50953 -31993 -34150 -2968 -20228 -24328 -13033 11617 46576 24733 9836
16583 9836 34072 76541 63800 66957 47073 30735 20319 39251 21370 -255 9815 55674
16571 55674 28573 -7152 -14436 28204 30710 34630 75805 96657 49113 17987 -18383 -65889
16559 -65889 -85797 -47831 -13569 18556 2094 -3628 -42847 2647 2241 -8611 -34163 -24112
16547 -24112 6726 12398 -6737 -4880 8869 -12787 -44389 -53857 14617 38997 25591 3729
16535 3729 -18404 -16020 34961 26902 5257 -21288 -31627 -29884 -1709 -1891 -14249 -13571 14308
$$ packed form
16620b8465M058j5357J5328N2134k3539l3235K1605o342j7230K6982N5905L7517
16608H9361K329j1241L463N708m3764o8922l0673k0010J4853M3357K7697p344
16596D814q084m6279j404J8960k157L1182j7260m100J1295K4650L4959k1843j4897
16583I836K4236M2469j2741L157j9884j6338j0416J8932j7881k1625J0070M5859
16571E5674k7101l5725p284M2640K506L920M1175K0852m7544l1126l6370m7506
16559f5889j9908L7966L4262L2125j6462n722l9219M5494m06j0852k5552J0051
16547b4112L0838N672j9135J857J3749k1656l1602r468O8474K4380j3406k1862
16535C729k2133K384N0981q059k1645k6545j0339J743K8175j82j2358O78K7879
$$ plain form
16522 14308 17416 43538 54577 72211 55268 71866 81621 56980 82952 64049 44885 42691
16510 42691 -12661 -21657 15170 39650 61167 81128 91227 61885 53231 31552 52705 44144
16498 44144 49073 77684 95737 107718 111978 105151 110454 125186 100233 76322 67414 94612 115013
16485 115013 114691 115714 139088 133752 116092 78373 39778 49124 54296 113842 156992 156137 92151
16472 92151 46212 54812 79266 90307 98674 105314 82146 84884 106701 113674 96564 70742 40489
16459 40489 14838 22612 22369 4856 -25285 -24988 777 -8107 -10899 18595 2402 -29898 -37081
16446 -37081 -9894 -36174 -52527 -62420 -13567 14128 36093 -4247 -49423 -52431 -66302 -54826
16434 -54826 -53645 -55024 -48516 -22866 -19092 12734 32635 45278 79988 53214 7202 4019 9721
$$ packed form
16522A4308L108K6122J1039J7634j6943J6598R755k4641K5972j8903j9164k194
16510D2691n5352q996L6827K4480K1517J9961J0099k9342q654k1679K1153q561
16498D4144M929K8611J8053J1981M260o827N303J4732k4953k3911q908K7198K0401
16485A15013l22J023K3374n336j7660l7719l8595R346N172N9546M3150q55o3986
16472I2151m5939Q600K4454J1041Q367O640k3168K738K1817O973j7110k5822l0253
16459D0489k5651P774k43j7513l0141K97K5765q884k792K9494j6193l2300p183
16446c7081K7187k6280j6353r893M8853K7695K1965m0340m5176l008j3871J1476
16434e4826J181j379O508K5650L774L1826J9901J2643L4710k6774m6012l183N702
$$ plain form
16421 9721 -10323 10455 27523 35453 10964 23651 25786 15508 -20620 -46257 14863 83387
16409 83387 87875 39995 -15140 -1664 -10955 -28556 2877 14850 8344 -21832 -58221 -42520
16397 -42520 -31988 -10071 -41139 -38181 -38211 -28709 -43443 -26808 -14434 -9462 1211 4444 -24099
16384 -24099 -19687 -20495 -30369 11226 -17408 -58598 -34198 -12604 -4219 5653 -2253 -30358 -24976
16371 -24976 -20290 -21049 -29109 -47545 -41114 -22212 -27147 -23938 15211 9871 8184 2712 -10052 -7620
16357 -7620 28973 23057 4118 6480 -41950 -56044 -35881 8720 3100 8410 -16420 -12881 -11845
16344 -11845 -51299 -49031 -49725 -53246 -35099 -15505 23325 42255 28729 24169 35412 34644 43123
16331 43123 29353 -45632 -109413 -87929 -74775 -62376 -715 9150 -36693 -41562 -20368 -48327
$$ packed form
16421I721k0044K0778J7068P930k4489J2687K135j0278l6128k5637O1120O8524
16409H3387M488m7880n5135J3476r291j7601L1433J1973o506l0176l6389J5701
16397d2520J0532K1917l1068K958l0R502j4734J6635J2374M972J0673L233k8543
16384b4099M412q08r874M1595k8634m1190K4400K1594Q385R872p906k8105N382
16371b4976M686p59q060j8436O431J8902m935L209L9149n340j687n472j2764K432
16357g620L6593n916j8939K362m8430j4094K0163M4601n620N310k4830L539J036
16344a1845l9454K268o94l521J8147J9594L8830J8930j3526m560J1243p68Q479
16331D3123j3770p4985o3781K1484J3154J2399O1661R865m5843m869K1194k7959
$$ plain form
16319 -48327 -53789 -15743 18266 37891 20871 -11595 2904 30252 49771 54109 51072 21802
16307 21802 8095 4199 31056 46732 7814 -26638 -39272 -28508 -46542 -39472 -36675 -52358
16295 -52358 -40352 -51415 -22614 12791 56128 45985 27690 -8724 -854 22286 45363 64909
16283 64909 54487 27384 -13781 -2389 -22882 -18737 -26335 -35342 -14869 10055 -25917 -35851
16271 -35851 -16808 12466 11095 -35605 -46894 -64404 -38445 -37012 -68811 -45659 -9000 19425
16259 19425 52968 42698 -10559 -12012 -19148 -47048 -33627 -12037 8527 -2314 26059 75480
16247 75480 64498 10988 -15463 -1417 -24885 -21912 13137 -26512 -57640 -40110 -28801 -38630
16235 -38630 -62246 -60404 -48351 -26285 -6207 -31751 -14138 -34418 -25936 -7783 -4706 19619
$$ packed form
16319d8327n462L8046L4009J9625j7020l2466J4499K7348J9519M338l037k9270
16307B1802j3707l896K6857J5676l8918l4452j2634J0764j8034P070K797j5683
16295e2358J2006j1063K8801L5405M3337j0143j8295l6414P870K3140K3077J9546
16283F4909j0422k7103m1165J1392k0493M145p598r007K0473K4924l5972r934
16271c5851J9043K9274j371m6700j1289j7510K5959J433l1799K3152L6659K8425
16259A9425L3543j0270n3257j453p136k7900J3421K1590K0564j0841K8373M9421
16247G5480j0982n3510k6451J4046k3468K973L5049l9649l1128J7530J1309r829
16235c8630k3616J842J2053K2066K0078k5544J7613k0280Q482J8153L077K4325
$$ plain form
16223 19619 48147 44590 44850 60259 43011 76633 87243 58321 109430 111205 84533 67815
16211 67815 74021 53922 33463 54572 63709 44870 38875 -6184 -73846 -111080 -72904 -24946
16199 -24946 -8760 -5537 -22354 -16743 -21232 -21443 18196 13771 21434 -22954 -19521 -15286 -15996 -30208
16185 -30208 -34083 -25913 -27232 14317 30875 -32245 -25419 -7593 12831 21420 15108 -9634 -42076
16172 -42076 -8511 2330 -8762 19098 43102 33826 15605 -45122 -40221 -37686 6975 36179
16160 36179 8956 18490 25975 11397 26035 -9586 -7309 12547 10811 -5198 9067 9253 18874
16147 18874 -25724 -27381 -57070 -59728 -2148 49091 7606 25726 27686 4737 -7814 14728
16135 14728 13514 -10728 27251 13382 -34046 -53830 -34627 -39150 -21548 -2339 6219 -50655
$$ packed form
16223A9619K8528l557K60J5409j7248L3622J0610k8922N1109J775k6672j6718
16211F7815O206k0099k0459K1109R137j8839n995m5059o7662l7234L8176M7958
16199b4946J6186L223j6817N611m489k11L9639m425P663m4388L433M235p10j4212
16185c0208l875Q170j319M1549J6558o3120O826J7826K0424Q589o312k4742l2442
16172d2076L3565J0841j1092K7860K4004r276j8221o0727M901K535M4661K9204
16160C6179k7223R534P485j4578J4638l5621K277J9856j736j6009J4265J86R621
16147A8874m4598j657k9689k658N7580N1239m1485J8120J960k2949j2551K2542
16135A4728j214k4242L7979j3869m7428j9784J9203m523J7602J9209Q558n6874
$$ plain form
16123 -50655 -51935 2203 54403 86043 76813 62936 80786 85644 73853 63768 60328 38213
16111 38213 36683 7922 7248 -23156 -31604 -7655 -4735 21358 68886 57105 51975 9167 -8985
16098 -8985 28805 6584 -33926 -29077 -17686 -20739 -36631 -9652 -72781 -70343 -44661 3877
16086 3877 72095 86615 52753 -727 -24751 -40432 -10267 24406 26765 11663 5296 30168
16074 30168 55762 88706 73491 41244 22256 27355 -13870 -40647 -44918 -65540 -105563 -127653
16062 -127653 -39236 44475 36857 4910 -21524 -50255 -55248 -28073 -27576 -44977 -35334 -9182
16050 -9182 36987 43451 32181 53290 39287 15764 44406 109498 97660 58312 36959 63646
16038 63646 92474 88338 35743 22847 43247 24773 28735 37909 37495 36242 62428 71784 101188
$$ packed form
16123e0655j280N4138N2200L1640r230j3877J7850M858j1791j0085l440k2115
16111C8213j530k8761o74l0404q448K3949K920K6093M7528j1781n130m2808j8152
16098h985L7790k2221m0510M849J1391l053j5892K6979o3129K438K5682M8538
16086C877O8218J4520l3862n3480k4024j5681L0165L4673K359j5102o367K4872
16074C0168K5594L2944j5215l2247j8988N099m1225k6777m271k0622m0023k2090
16062a27653Q8417Q3711p618l1947k6434k8731m993K7175M97j7401R643K6152
16050i182M6169O464j1270K1109j4003k3523K8642O5092j1838l9348k1353K6687
16038F3646K8828m136n2595j2896K0400j8474L962R174m14j253K6186R356K9404
$$ plain form
16025 101188 66153 45711 46476 35041 7041 -4798 -3081 9571 -10526 15363 -7006 -5167
16013 -5167 18399 21150 32479 37896 25882 14838 9489 29375 76385 53045 25829 50295
16001 50295 57901 18315 -32190 -37816 -40896 -42294 -1385 -8981 -27345 -20454 -24317 -14392 -10326
15988 -10326 -7081 -1519 -6841 -9849 12591 -10705 3350 22244 73351 51019 33442 13675
15976 13675 -16129 -31627 -21022 21228 27497 -17807 -41787 14849 52749 55642 22534 17114
15964 17114 9082 19485 61418 78043 61496 45515 40316 -563 3692 14572 12353 50806
15952 50806 29586 -28633 -17864 7728 16647 27086 13897 22317 11283 50754 69373 66001
15940 66001 50808 7380 -23241 -9745 -1501 33464 14286 -3384 29712 78238 79528 74374
$$ packed form
16025A01188l5035k0442P65j1435k8000j1839J717J2652k0097K5889k2369J839
16013e167K3566K751J1329N417j2014j1044n349J9886M7010k3340k7216K4466
16001E0295P606l9586n0505n626l080j398M0909p596j8364O891l863R925M066
15988a0326L245N562n322l008K2440k3296J4055J8894N1107k2332j7577j9767
15976A3675k9804j5498J0605M2250O269m5304k3980N6636L7900K893l3108n420
15964A7114q032J0403M1933J6625j6547j5981n199m0879M255J0880k219L8453
15952E0806k1220n8219J0769K5592Q919J0439j3189Q420j1034L9471J8619l372
15940F6001j5193m3428l0621J3496Q244L4965j9178j7670L3096M8526J290n154
$$ plain form
15928 74374 51620 17964 -15701 -7417 -28903 -44329 -80418 -91264 -75241 -49890 -43360 4803
15916 4803 43728 63889 51759 30662 18644 823 27777 29636 19069 38857 -2528 -17416
15904 -17416 13704 97 -7465 22966 31486 47632 80653 72550 42693 50736 81992 82163 60630
15891 60630 82561 76822 108939 122426 106878 94345 106646 92650 115802 138668 140971 172659
15879 172659 167500 136494 149001 161485 101937 73400 143034 137905 103477 96643 125475 142048
15867 142048 101355 86768 67442 86342 103476 119853 107792 95786 82563 86915 97822 110000
15855 110000 124573 114114 120064 73226 63753 90229 115310 122607 146397 176975 207347 197121
15843 197121 194935 198325 162932 187243 176614 188140 156335 146321 139835 161374 220933 235193
$$ packed form
15928G4374k2754l3656l3665Q284k1486j5426l6089j0846J6023K5351O530M8163
15916D803L8925K0161j2130k1097j2018j7821K6954J859j0567J9788m1385j4888
15904a7416L1120j3607p562L0431Q520J6146L3021q103k9857Q043L1256J71k1533
15891F0630K1931n739L2117J3487j5548j2533J2301j3996K3152K2866K303L1688
15879A72659n159l1006J2507J2484n9548k8537O9634n129l4428o834K8832J6573
15867A42048m0693j4587j9326J8900J7134J6377j2061j2006j3223M352J0907J2178
15855A10000J4573j0459N950m6838r473K6476K5081P297K3790L0578L0372j0226
15843A97121k186L390l5393K4311j0629J1526l1805j0014o486K1539N9559J4260
$$ plain form
15831 235193 256368 242212 266345 286745 230379 199554 179265 209178 201237 181104 217310 286364
15819 286364 296770 286287 267711 349214 400747 404934 406211 456551 501428 541989 558504 570523
15807 570523 604367 605153 611127 605400 634930 630464 632242 677559 722058 705862 702163 746988 813537
15794 813537 889884 973702 1029261 1054302 1079558 1175615 1277238 1400131 1562431 1768275 2007150
15783 2007150 2224348 2457219 2694277 2974450 3258142 3621408 4067092 4576544 5171214
15774 5171214 5842409 6664142 7724204 9111875 10830671 13041763 15961431 19681276
15766 19681276 24328919 29955835 35980570 41394568 47118450 57975378 80627825 115305169
15758 115305169 147026504 162920033 148266544 113204033 86442025 68490447 56357796
$$ packed form
15831B35193K1175j4156K4133K0400n6366l0825k0289K9913p941k0133L6206O9054
15819B86364J0406j0483j8576Q1503N1533M187J277N0340M4877M0561J6515J2019
15807E70523L3844P86N974n727K9530m466J778M5317M4499j6196l699M4825O6549
15794H13537P6347Q3818N5559K5041K5256R6057J01623J22893J62300K05844K38875
15783B007150K17198K32871K37058K80173K83692L63266M45684N09452N94670
15774E171214O71195Q21733J060062J387671J718796K211092K919668L719845
15766A9681276M647643N626916O024735N413998N723882J0856928K2652447L4677344
15758A15305169L1721335J5893529j4653489l5062511k6762008j7951578j2132651
$$ plain form
15751 56357796 47849571 41117599 35535110 31071962 27572610 24805083 22504042 20514917
15743 20514917 18805706 17396161 16151031 15077011 14115622 13285700 12627039 12071841 11468802
15734 11468802 10890428 10351048 9835601 9337187 8858066 8447361 8112199 7839550 7512764
15725 7512764 7179051 6922227 6630190 6354083 6132819 5891499 5664118 5427747 5232827
15716 5232827 5096724 4946951 4725714 4535104 4374903 4245113 4062378 3925575 3792949
15707 3792949 3642657 3517416 3424869 3338253 3273628 3175552 3040198 2946617 2897166 2869111 2796951
15696 2796951 2718164 2684115 2634083 2549786 2434033 2362126 2296233 2187628 2089879 2038096 2002740
15685 2002740 2012780 2006702 1965758 1876638 1821410 1765021 1697881 1639776 1643470 1622867 1558477 1530525
$$ packed form
15751E6357796q508225o731972n582489m463148l499352k767527k301041j989125
15743B0514917j709211j409545j245130j074020r61389q29922o58661n55198o03039
15734A1468802n78374n39380n15447m98414m79121m10705l35162k72649l26786
15725G512764l33713k56824k92037k76107k21264k41320k27381k36371j94920
15716E232827j36103j49773k21237j90610j60201j29790j82735j36803j32626
15707C792949j50292j25241r2547q6616o4625r8076j35354r3581m9451k8055p2160
15696B796951p8787l4049n0032q4297j15753p1907o5893j08605r7749n1783l5356
15685B002740J0040o078m0944q9120n5228n6389o7140n8105L694k0603o4390k7952
$$ plain form
15673 1530525 1526670 1496166 1463112 1450816 1397414 1332983 1319079 1304288 1310351 1273505 1232844 1169930
15661 1169930 1117390 1075585 1039704 1011050 987543 975900 972976 933288 877311 816298 810109 815871
15649 815871 802477 815153 795456 741027 725965 719116 711670 688710 660498 659007 688094 687283
15637 687283 665858 618142 589276 573714 541219 559253 575689 545379 542493 584806 577609 536580
15625 536580 513716 518414 535248 574105 558424 551906 544301 492149 469631 463878 425371 417816
15613 417816 363291 322058 331006 348071 354397 370713 362108 339846 319983 293491 295404 304798
15601 304798 296306 285750 241595 229090 211505 177441 204138 235788 245055 242060 269553 276488
15589 276488 238695 215116 221124 154732 129195 158339 160421 145142 130264 102472 60993 66700
$$ packed form
15673A530525l855l0504l3054j2296n3402o4431j3904j4791O063l6846m0661o2914
15661A169930n2540m1805l5881k8654k3507j1643k924l9688n5977o1013o189N762
15649H15871j3394J2676j9697n4429j5062o849p446k2960k8212j491K9087q11
15637F87283k1425m7716k8866j5562l2495J8034J6436l0310k886M2313p197m1029
15625E36580k2864M698J6834L8857j5681o518p605n2152k2518n753l8507p555
15613D17816n4525m1233Q948J7065O326J6316q605k2262j9863k6492J913R394
15601C04798q492j0556m4155j2505j7585l4064K6697L1650R267k995K7493O935
15589B76488l7793k3579O008o6392k5537K9144K082j5279j4878k7792m1479N707
$$ plain form
15577 66700 93565 107811 76393 91072 87221 50966 64158 95731 111872 111808 118897 160384 157391
15564 157391 164596 169215 163306 152484 167208 152222 104377 70357 21870 64302 82674 58661
15552 58661 75264 78717 69510 21870 7672 19057 45958 22463 24564 9169 50418 98673
15540 98673 112201 128262 142164 121962 98753 59329 28359 12416 54509 65923 51433 49379
15528 49379 19047 9616 70029 128476 132659 118670 154280 174312 143776 109573 68002 57777
15516 57777 17393 -21600 13072 53000 30516 24050 22250 4037 32952 51948 45007 20438
15504 20438 19581 11230 22391 45417 30359 44861 70010 101905 131068 97505 71957 55150
15492 55150 63709 105621 128055 131438 90747 73792 54269 50571 51641 11937 -30742 -56813
$$ packed form
15577F6700K6865J4246l1418J4679l851l6255J3192L1573J6141o4P089M1487k993
15564A57391P205M619n909j0822J4724j4986m7845l4020m8487M2432J8372k4013
15552E8661J6603L453r207m7640j4198J1385K6901k3495K101j5395M1249M8255
15540I8673J3528J6061J3902k0202k3209l9424l0970j5943M2093J1414j4490k054
15528D9379l0332r431O0413N8447M183j3989L5610K0032l0536l4203m1571j0225
15516E7777m0384l8993L4672L9928k2484o466j800j8213K8915J8996o941k4569
15504B0438q57q351J1161K3026j5058J4502K5149L1895K9163l3563k5548j6807
15492E5150Q559M1912K2434L383m0691j6955j9523l698J070l9704m2679k6071
$$ plain form
15480 -56813 -18537 -23435 -10128 35576 8816 -13123 4306 50087 61665 52360 28243 -14261
15468 -14261 -15582 -14429 12579 -3669 45496 76916 84754 33002 21674 -15053 -7587 38653
15456 38653 66342 39158 29739 82804 96298 107954 98535 63616 45109 1525 449 10562
15444 10562 6672 11495 32216 31343 39100 56195 54630 29195 18765 3852 -34183 -4100 20804
15431 20804 5410 2787 -15166 -34239 -57287 -68081 -53012 -36506 -32691 -9416 -23225 -22303
15419 -22303 -10114 -26443 -33579 -39096 -58157 -36029 316 47537 89347 72556 18534 13201
15407 13201 879 4993 31075 48141 26836 -22723 -28230 -32757 -40366 -32507 -49682 -81055 -33162
15394 -33162 -10919 337 -47635 -70456 -39929 -6803 3185 -23392 -52226 -68338 -92578 -51867
$$ packed form
15480e6813L8276m898J3307M5704k6760k1939J7429M5781J1578r305k4117m2504
15468a4261j321J153K7008j6248M9165L1420P838n1752j1328l6727P466M6240
15456C8653K7689k7184r419N3065J3494J1656r419l4919j8507m3584j076J0113
15444A0562l890M823K0721q73P757J7095j565k5435j0430j4913l8035L0083K4904
15431B0804j5394k623j7953j9073k3048j0794J5069J6506L815K3275j3809R22
15419b2303J2189j6329p136n517j9061K2128L6345M7221M1810j6791n4022n333
15407A3201j2322M114K6082J7066k1305m9559n507m527p609P859j7175l1373M7893
15394c3162K2243J1256m7972k2821L0527L3126R988k6577k8834j6112k4240M0711
$$ plain form
15382 -51867 -37537 23925 30519 1416 -19272 -13629 1127 34736 19242 -29773 -36940 -18031
15370 -18031 6829 6411 -45451 -55412 -37912 -37068 -7085 70536 87604 79726 75167 25607 -8654
15357 -8654 -5589 6783 -2227 -22504 -2933 1222 64142 45289 -4039 8822 28056 29481 -10761
15344 -10761 -12318 -735 -27435 -32798 25003 70353 52870 -309 -64805 -44129 17585 40213
15332 40213 40379 12135 24632 17435 16432 19480 39241 26073 1669 441 4137 48429 41818
15319 41818 23038 13512 15189 -2659 -6106 -49376 -57365 -56524 -29081 -17718 14735 11457 -52661
15306 -52661 -116410 -83124 -34954 -40332 -59779 -26479 -196 31155 11664 17222 26302 -1578
15294 -1578 -56416 -42981 13622 34891 43462 11827 -24614 8411 20008 24441 -6478 16313
$$ packed form
15382e1867J4330O1462O594k9103k0688N643J4756L3609j5494m9015p167J8909
15370a8031K4860m18n1862r961J7500Q44K9983P7621J7068p878m559m9560l4261
15357h654L065J2372r010k0277J9571M155O2920j8853m9328J2861J9234J425m0242
15344a0761j557J1583k6700n363N7801M5350j7483n3179o4496K0676O1714K2628
15332D0213J66k8244J2497p197j003L048J9761j3168k4404j228L696M4292o611
15319D1818j8780r526J677j7848l447m3270p989Q41K7443J1363L2453l278o4118
15306e2661o3749L3286M8170n378j9447L3300K6283L1351j9491N558R080k7880
15294a578n4838J3435N6603K1269Q571l1635l6441L3025J1597M433l0919K2791
$$ plain form
15282 16313 18728 3870 21804 12383 31503 51259 45612 46472 38314 35614 60792 98399 83638
15269 83638 37311 9113 1771 -13471 -53384 -91843 -75500 -8741 22413 19947 -14608 -63387
15257 -63387 -78801 -26493 7976 14368 -23497 -32395 19940 14522 7938 -1735 4523 -15995 -30420
15244 -30420 -2555 15012 37739 47521 28315 40900 36513 35864 24459 -37032 -44839 -13933 18340
15231 18340 31499 13498 18352 11804 -13149 -48591 -49582 -36598 -16916 14892 26787 34060 69377
15218 69377 94000 101112 78989 47525 51367 28607 20527 6048 15585 21348 10874 7769 2360
15205 2360 23504 31506 79161 84682 53045 25879 4474 52395 77230 28606 6105 39572
15193 39572 31078 -25764 -25033 -7742 32123 -4842 -42650 -48843 -23956 -3974 -24731 -70579
$$ packed form
15282A6313K415j4858J7934r421J9120J9756n647Q60q158k700K5178L7607j4761
15269H3638m6327k8198p342j5242l9913l8459J6343O6759L1154k466l4555m8779
15257f3387j5414N2308L4469O392l7865q898N2335n418o584r673O258k0518j4425
15244c0420K7865J7567K2727R782j9206J2585m387o49j1405o1491p807L0906L2273
15231A8340J3159j8001M854o548k4953l5442r91J2984J9682L1808J1895P273L5317
15218F9377K4623P112k2123l1464L842k2760q080j4479R537N763j0474l105n409
15205B360K1144Q002M7655N521l1637k7166k1405M7921K4835m8624k2501L3467
15193C9572q494n6842P31J7291L9865l6965l7808o193K4887J9982k0757m5848
$$ plain form
15181 -70579 -122900 -107719 -78500 -42641 -861 -9734 -5967 -4796 -278 8053 -9393 -3602 -7224
15168 -7224 -14507 -3470 3663 652 -18119 -14673 -40802 -69259 -61070 -69773 -71194 -83335 -102252
15155 -102252 -120691 -144122 -109865 -81168 -33882 -45320 -78961 -55922 -16341 6227 -14108
15144 -14108 -32976 -48283 -20077 57138 55072 56906 42635 46215 59642 46991 48068 11465
15132 11465 -35374 -51170 -48010 -49341 -20947 37796 34812 5926 -993 -56326 -81771 -53175
15120 -53175 -65785 -48973 -65615 -61118 -38835 -35414 -34726 -42406 -1178 40736 -748 5558 5364
15107 5364 -40834 -84437 -83659 -29814 25253 54287 57552 12459 19508 74288 75869 48757 16614
15094 16614 -3692 -4274 23960 10642 -12551 -56414 -51006 -40590 -17352 -8255 -22637 -6961
$$ packed form
15181g0579n2321J5181K9219L5859M1780q873L767J171M518Q331j7446N791l622
15168g224p283J1037P133l011j8771L446k6129k8457Q189q703j421j2141j8917
15155a02252j8439k3431L4257K8697M7286j1438l3641K3039L9581K2568k0335
15144a4108j8868j5307K8206P7215k066J834j4271L580J3427j2651J077l6603
15132A1465m6839j5796L160j331K8394N8743k984k8886o919n5333k5445K8596
15120e3175j2610J6812j6642M497K2283L421O88p680M1228M1914m1484O306j94
15107E364m6198m3603P78N3845N5067K9034L265m5093P049N4780J581k7112l2143
15094A6614k0306n82K8234j3318k3193m3863N408J0416K3238R097j4382J5676
$$ plain form
15082 -6961 15917 -2609 -1147 -5368 -43130 -24201 -1353 -16941 -32194 -9505 14365 14390 -16463
15069 -16463 -22643 -56611 -63867 -45221 -8054 -19066 -71204 -98558 -110455 -122098 -100420 -32098
15057 -32098 -13443 -9998 -2720 1115 -2790 -4316 15319 31939 40661 35963 -19752 -54352 -47368
15044 -47368 -18002 2019 -12972 -36356 -31619 -47187 -69698 -94784 -107023 -66208 -34620 -51222
15032 -51222 -71894 -77973 -49686 5485 22649 36788 -8459 -31367 -37087 46678 68400 71477
15020 71477 47912 9794 -11627 -28570 -43198 -28155 -9755 15705 23342 12980 -17828 -6134
15008 -6134 47999 44340 -34871 -62634 -29978 16115 22246 25270 3850 3003 -12802 24185 -8064
14995 -8064 -50868 -39059 -16936 9892 27723 5954 -19671 -35248 -22005 -11296 9046 17937
$$ packed form
15082f961K2878j8526J462m221l7762J8929K2848j5588j5253K2689K3870K5l0853
15069a6463o180l3968p256J8646L7167j1012n2138k7354j1897j1643K1678O8322
15057c2098J8655L445P278L835l905j526J9635J6620Q722m698n5715l4600O984
15044d7368K9366K0021j4991k3384M737j5568k2511k5086j2239M0815L1588j6602
15032e1222k0672o079K8287N5171J7164J4139m5247k2908n720Q3765K1722L077
15020G1477k3565l8118k1421j6943j4628J5043J8400K5460P637j0362l0808J1694
15008f134N4133l659p9211k7763L2656M6093O131L024k1420q47j5805L6987l2249
14995h064m2804J1809K2123K6828J7831k1769k5625j5577J3243J0709K0342Q891
$$ plain form
14983 17937 13066 54618 71054 58274 56582 55260 36619 -20860 -31389 -12012 -21126 -33721
14971 -33721 -30936 -54644 -30847 -14744 -4888 14222 36605 42173 49998 49251 58937 66866 35100
14958 35100 52039 88102 63484 51276 7989 10153 39356 21102 -24892 -38758 -1304 26685
14946 26685 -11707 -16144 12242 28022 -4841 -2929 -18201 -6654 19895 40297 23651 -10230
14934 -10230 22647 5112 18846 5252 17899 51152 43290 -2651 -69566 -57696 -37711 -18436
14922 -18436 57754 54805 56113 92332 84232 93655 75821 42351 23433 -8116 1376 35428 21733
14909 21733 -3360 -5885 35674 43201 46813 45164 6793 -17966 -5498 19594 24212 -24362 -65411
14896 -65411 -59643 -59803 -20441 -2277 -2610 -8365 9145 59388 113112 82240 73171 68228 53005
$$ packed form
14983A7937m871M1552J6436j2780j692j322j8641n7479j0529J9377r114j2595
14971c3721K785k3708K3797J6103R856J9110K2383N568P825p47R686P929l1766
14958C5100J6939L6063k4618j2208m3287K164K9203j8254m5994j3866L7454K7989
14946B6685l8392m437K8386J5780l2863J912j5272J1547K6549K0402j6646l3881
14934a0230L2877j7535J3734j3594J2647L3253p862m5941o6915J1870J9985J9275
14922a8436P6190k949J308L6219q100R423j7834l3470j8918l1549R492L4052j3695
14909B1733k5093k525M1559P527L612j649l8371k4759J2468K5092M618m8574m1049
14896f5411N768j60L9362J8164l33n755J7510N0243N3724l0872r069m943j5223
$$ plain form
14883 53005 38255 64823 63504 64148 24299 -2956 -17841 4057 -12428 -18412 -39655 -38210 -11416
14870 -11416 25817 21466 14578 34019 -7821 -18742 -24994 -20992 11697 919 -34371 -36969 -21847
14857 -21847 714 15154 19369 34054 38357 29241 38519 63195 56194 10246 -16661 -20563 -1286
14844 -1286 10087 44485 40329 11742 -18784 -4938 18019 7697 2439 30596 30946 39392 30351
14831 30351 26657 54209 14539 -20828 -28195 -15082 -20075 -22119 58899 84704 46207 35906
14819 35906 36592 39298 38132 70766 127747 80571 27851 72975 49697 25414 56204 59003 33302
14806 33302 22046 12059 39772 58625 48387 -5984 -20785 313 6084 18441 -15114 -43644
14794 -43644 -66438 -72945 -30791 -3143 2290 6801 74094 65993 40304 41286 80572 98837 94968
$$ packed form
14883E3005j4750K6568j319O44l9849k7255j4885K1898j6485n984k1243J445K6794
14870a1416L7233m351o888J9441m1840j0921o252M002L2689j0778l5290k598J5122
14857b1847K2561J4440M215J4685M303r116R278K4676p001m5948k6907l902J9277
14844a286J1373L4398m156k8587l0526J3846K2957j0322n258K8157L50Q446r041
14831C0351l694K7552l9670l5367p367J3113m993k044Q1018K5805l8497j0301
14819C5906O86K706j166L2634N6981m7176n2720M5124k3278k4283L0790K799k5701
14806C3302j1256r987K7713J8853j0238n4371j4801K1098N771J2357l3555k8530
14794d3644k2794o507M2154K7648N433M511O7293q101k5689R82L9286J8265l869
$$ plain form
14781 94968 44868 29626 2923 4260 -5761 -24876 -3975 34548 73 -28455 -8890 30003
14769 30003 27042 25993 27351 12363 -39980 -21634 -11550 -5130 32457 37264 18738 -17461 -36865
14756 -36865 -42398 -35796 -46046 -73071 -67717 -49196 -72317 -67429 -6240 9530 24791 12736
14744 12736 -3874 -625 4342 -2673 -20841 -21642 -26211 -23568 -6060 -5817 17678 43972 93852
14731 93852 51499 16474 -6169 -20057 -18449 3692 4847 -4800 16425 -7766 -25122 -1233
14719 -1233 35308 11322 6851 30282 39207 52208 62884 9601 -22581 21281 53733 8175
14707 8175 -15066 -5750 16531 19124 7710 10819 52216 30894 -1128 10770 -4186 -8817 6610
14694 6610 24743 12707 48560 73523 57157 34583 79 -28551 -42222 -20890 -2579 -21139
$$ packed form
14781I4968n0100j5242k6703J337j0021j9115K0901L8523l4475k8528J9565L8893
14769C0003k961j049J358j4988n2343J8346J0084O420L7587M807j8526l6199j9404
14756c6865n533O602j0250k7025N354J8521k3121M888O1189J5770J5261j2055
14744A2736j6610L249M967p015j8168q01m569K643J7508K43K3495K6294M9880
14731I3852m2353l5025k2643j3888J608K2141J155r647K1225k4191j7356K3889
14719a233L6541k3986m471K3431Q925J3001J0676n3283l2182M3862L2452m5558
14707H175k3241R316K2281K593j1414L109M1397k1322l2022J1898j4956m631J5427
14694F610J8133j2036L5853K4963j6366k2574l4504k8630j3671K1332J8311j8560
$$ plain form
14682 -21139 -21832 7449 6384 -16285 -8373 29493 39515 3880 10525 12820 -23966 -54221 -10613
14669 -10613 12529 25292 -28640 -23976 15192 29390 56911 40233 10285 33436 -280 -34287
14657 -34287 -19622 28340 6975 793 37507 80686 130820 70817 25191 -17459 -42627 -35638
14645 -35638 -38221 -72620 -79167 -62310 -58545 -71182 -52783 -67046 -63371 -54357 -102812 -118777 -69064
14632 -69064 -25347 -42543 -19005 -21224 4263 26905 44824 27887 -28919 -31895 -33623 -43964
14620 -43964 -32637 -12534 11785 11825 -2169 15605 24095 20198 33756 43960 7207 -25322 -20222
14607 -20222 -38301 -50391 -3430 -14403 -43743 -70652 -53841 -8891 -23244 -22427 -30434 -22446
14595 -22446 7491 22911 14219 -43252 -37703 -634 -4595 -19141 -7508 -12194 -89560 -90198 -9973
$$ packed form
14682b1139o93K9281j065k2669P912L7866J0022l5635O645K295l6786l0255M3608
14669a0613K3142J2763n3932M664L9168J4198K7521j6678k9948K3151l3716l4007
14657c4287J4665M7962k1365o182L6714M3179N0134o0003m5626m2650k5168O989
14645c5638k583l4399o547J6857L765j2637J8399j4263L675R014m8455j5965M9713
14632f9064M3717j7196K3538k219K5487K2642J7919j6937n6806k976j728j0341
14620d3964J1327K0103K4319M0j3994J7774Q490l897J3558J0204l6753l2529N100
14607b0222j8079j2090M6961j0973k9340k6909J6811M4950j4353Q17q007P988
14595b2446K9937J5420q692n7471N549L7069l961j4546J1633m686p7366o38Q0225
$$ plain form
14582 -9973 25970 55916 33129 -1001 -20960 -25468 2022 11612 -9799 11231 31642 -6489
14570 -6489 -57695 -38403 -53884 -74334 -35251 -46743 -38277 -16176 -16610 -38866 -42234 -32407 -16678
14557 -16678 2543 54508 82607 41797 7818 25459 25759 -17244 -21261 -21457 -31926 -37913 -46099
14544 -46099 -56348 -58779 -59789 -16797 -19002 -12570 15345 30265 12562 8099 25011 12015 -14509
14531 -14509 -63877 -50658 -38736 -27926 -19696 -38671 -61818 -44877 -31700 -44477 -40507 -42621
14519 -42621 2326 23328 11792 17071 33449 25413 13394 -3760 -28538 -35667 7758 -19983
14507 -19983 -3703 33115 14471 20750 11128 -27522 -50108 -3032 11389 21841 48415 48365 43655
14494 43655 39392 43810 -614 -23660 -49096 -32504 -1559 25490 16652 6367 -23659 -50783
$$ packed form
14582i973L5943K9946k2787l4130j9959m508K7490R590k1411K1030K0411l8131
14570f489n1206J9292j5481k0450L9083j1492Q466K2101m34k2256l368R827J5729
14557a6678J9221N1965K8099m0810l3979J7641L00m3003m017j96j0469n987q186
14544d6099j0249k431j010M2992k205O432K7915J4920j7703m463J6912j2996k6524
14531a4509m9368J3219J1922J0810Q230j8975k3147J6941J3177j2777L970k114
14519d2621M4947K1002j1536N279J6378q036j2019j7154k4778p129M3425k7741
14507a9983J6280L6818j8644O279r622l8650k2586M7076J4421J0452K6574n0m710
14494D3655m263M418m4424k3046k5436J6592L0945K7049q838j0285l0026k7124
$$ plain form
14482 -50783 -13629 -26123 -58048 -52547 -19080 7923 12312 7773 5553 -2695 7046 15620 19531
14469 19531 54994 54565 26780 -6216 5096 -3053 -1115 16982 30232 29587 16961 -75517 -91635
14456 -91635 -104696 -108155 -110672 -78094 -15038 -21041 -17337 -1957 -13887 5827 -33505 -21135
14444 -21135 -48393 -61122 3406 28348 17058 66257 63713 -14152 -40509 -48417 -40165 -20356
14432 -20356 14724 20069 3626 9366 -9972 -21734 -18765 -25002 -41169 -46259 -60415 -42313 -15161
14419 -15161 -6587 -2735 2611 31527 45492 47106 -16928 -33037 16011 28202 26900 -17254 -26231
14406 -26231 -38867 -48157 -28954 21997 30212 53088 46292 5887 -12749 22921 33413 18286
14394 18286 5887 11923 5966 4230 18721 -8372 -20033 6990 3057 20014 34879 35778 19526
$$ packed form
14482e0783L7154j2494l1925N501L3467K7003M389m539k220q248R741Q574L911
14469A9531L5463m29k7785l2996J1312q149J938J8097J3250o45j2626r2478j6118
14456i1635j3061l459k517L2578O3056o003L704J5380j1930J9714l9332J2370
14444b1135k7258j2729O4528K4942j1290M9199k544p7865k6357p908Q252J9809
14432b0356L5080N345j6443N740j9338j1762K969o237j6167n090j4156J8102K7152
14419a5161Q574L852N346K8916J3965J614o4034j6109M9048J2191j302m4154q977
14406b6231j2636r290J9203N0951Q215K2876o796m0405j8636L5670J0492j5127
14394A8286j2399O036n957j736J4491k7093j1661K7023l933J6957J4865Q99j6252
$$ plain form
14381 19526 12922 35178 52713 17082 -29938 -76280 -66532 -43481 -32345 -57923 -45616 -36279
14369 -36279 -40970 -35587 -32102 -44653 -55530 -69805 -28758 24099 18156 -847 -20202 -61756
14357 -61756 -87780 -66686 -46266 -5939 -20158 -44237 -29499 -59916 -64295 -45569 -22612 -35
14345 -35 -15920 -68209 -45533 -6791 9297 40553 14002 -28540 -11442 4074 -28842 -88233
14333 -88233 -125304 -98098 -104311 -111348 -93926 -72762 -24525 560 -31395 -103958 -100476 -91670
14321 -91670 -66843 -73807 -55488 -39395 -7459 3655 -13985 -21382 -7285 -19661 33993 27827
14309 27827 -35665 -80641 -67939 -47038 -12958 -25070 -26827 -25325 8101 19889 25395 -497
14297 -497 -19992 -4216 7544 -15176 -69654 -86230 -65148 -1778 5646 -10925 5387 -19767
$$ packed form
14381A9526o604K2256J7535l5631m7020m6342R748K3051J1136k5578J2307R337
14369c6279m691N383L485j2551j0877j4275M1047N2857n943j9003j9355m1554
14357f1756k6024K1094K0420M0327j4219k4079J4738l0417m379J8726K2957K2577
14345c5j5885n2289K2676L8742J6088L1256k6551m2542J7098J5516l2916n9391
14333h8233l7071K7206o213p037J7422K1164M8237K5085l1955p2563L482Q806
14321i1670K4827o964J8319J6093L1936J1114j7640p397J4097j2376N3654o166
14309B7827o3492m4976J2702K0901L4080j2112j757J502L3426J1788N506k5892
14297d97j9495J5776J1760k2720n4478j6576K1082O3370P424j6571J6312k5154
$$ plain form
14285 -19767 -28025 -3228 21668 15921 28195 58363 96074 87467 4300 3158 -30510 -51813
14273 -51813 -48357 -39697 -17453 -7171 -32571 -34249 -267 17099 36240 50435 39094 14901
14261 14901 1632 -40398 -61811 -43577 -35205 -46857 -6531 12084 -747 -1428 -26580 -47056
14249 -47056 -25914 -50700 -13654 -14155 9956 10004 -5960 -12006 -24797 -26917 -1601 31491 45726
14236 45726 4118 33227 38344 42714 50743 18556 27435 17366 13606 23339 13585 -18807 -25311
14223 -25311 -37853 17905 52702 27250 35136 7309 -52055 -59195 -13714 -1052 -34186 20664
14211 20664 42473 -9090 -11879 39486 8316 -10353 -8593 31136 12782 775 9269 -5769
14199 -5769 -7130 9802 29292 30692 20587 23824 6373 -32410 -52255 -70166 -71587 -42562 -4370
$$ packed form
14285a9767q258K4797K4896n747J2274L0168L7711q607q3167j142l3668k1303
14273e1813L456Q660K2244J0282k5400j678L3982J7366J9141J4195j1341k4193
14261A4901j3269m2030k1413J8234Q372j1652M0326J8615j2831o81k5152k0476
14249d7056K1142k4786L7046n01K4111M8j5964o046j2791k120K5316L3092J4235
14236D5726m1608K9109N117M370Q029l2187Q879j0069l760R733r754l2392o504
14223b5311j2542N5758L4797k5452P886k7827n9364p140M5481J2662l3134N4850
14211B0664K1809n1563k789N1365l1170j8669J760L9729j8354j2007Q494j5038
14199e769j361J6932J9490J400j0105L237j7451l8783j9845j7911j421K9025L8192
$$ plain form
14186 -4370 30469 1871 -52269 -39232 -7150 -743 1030 -4932 -28230 -39572 -29862 -24622 -24223
14173 -24223 -10404 -44536 -64828 -33732 -13872 -23127 4943 -25401 -17612 -41751 -5983 7786
14161 7786 9339 -11769 -5970 -10451 4290 18520 13436 -6730 -4757 -8051 5837 15548 21373
14148 21373 26845 513 -43628 -27931 -66526 -68004 -73258 -77678 -73092 -59103 -45307 -9470 24751
14135 24751 7222 -13120 -6055 28671 27413 -16604 -41211 -33021 -55275 -50225 -57871 -68881 -73243
14122 -73243 -48372 -45361 -4939 9888 -2633 19208 8762 -11963 -50307 -57314 -35249 -21441
14110 -21441 -4012 -8743 -59813 -73269 -49815 -3910 33885 3077 -26748 -47166 -42017 -11280
14098 -11280 33138 6455 -3699 12846 20504 58357 28190 -10430 36507 16171 -17018 -50286
$$ packed form
14186d370L4839k8598n4140J3037L2082O407J773n962k3298j1342R710N240L99
14173b4223J3819l4132k0292L1096J9860r255K8070l0344P789k4139L5768J3769
14161G786J553k1108N799m481J4741J4230n084k0166J973l294J3888R711N825
14148B1373N472k6332m4141J5697l8595j478n254m420M586J3989J3796L5837L4221
14135B4751j7529k0342P065L4726j258m4017k4607Q190k2254N050p646j1010m362
14122g3243K4871L011M0422J4827j2521K1841j0446k0725l8344p007K2065J3808
14110b1441J7429m731n1070j3456K3454M5905L7795l0808k9825k0418N149L0737
14098a1280M4418k6683j0154J6545P658L7853l0167l8620M6937k0336l3189l3268
$$ plain form
14086 -50286 -33214 -22153 -36166 -13453 -29237 -35501 -42730 -27617 -17875 -20427 -6134 -11372 32674
14073 32674 25420 37594 9129 41004 36761 13715 27155 47636 46886 6310 10867 37426 14995
14060 14995 29520 40409 16599 31275 -856 -34653 -55919 -53253 -25217 -12908 -19610 -16210
14048 -16210 -25093 2583 3939 289 -14191 -43073 -57217 -71607 -51555 -28787 -17481 -27550
14036 -27550 -34782 -67173 -63051 -49977 -41652 -38017 -76839 -95549 -82983 -60261 -17004 -5574
14024 -5574 -6404 -11553 -39094 -61460 -81922 -43924 363 4839 8903 25731 -26719 -47724 -47544
14011 -47544 -88363 -107926 -81451 -51526 -18958 13137 36238 30022 -8312 -7561 3061 6154
13999 6154 -689 -22435 10247 35324 27178 43898 24696 9663 11114 -4703 -26622 -42381
$$ packed form
14086e0286J7072J1061j4013K2713j5784o264p229J5113R742k552J4293n238M4046
14073C2674p254J2174k8465L1875m243k3046J3440K0481p50m0576M557K6559k2431
14060A4995J4525J0889k3810J4676l2131l3797k1266K666K8036J2309o702L400
14048a6210q883K7676J356l650j4480k8882j4144j4390K0052K2768J1306j0069
14036b7550p232l2391M122J3074Q325L635l8822j8710J2566K2722M3257J1430
14024e574q30n149k7541k2366k0462L7998M4287M476M064J6828n2450k1005J80
14011d7544m0819j9563K6475K9925L2568L2095K3101o216l8334P51J0622L093
13999F154o843k1746L2682K5077q146J6720j9202j5033J451j5817k1919j5759
$$ plain form
13987 -42381 -34151 -17104 -32320 -32260 -33474 -31105 -56239 -56569 -30929 -24314 2949 3226 3377 -15654
13973 -15654 4320 3983 -17622 -72536 -92548 -63693 -33775 -50747 -85080 -65937 -45614 1964
13961 1964 14623 -18793 -16723 10446 -5815 5206 1846 -4061 -38595 -48370 -61756 15898 47544
13948 47544 38400 37431 36150 -8296 -14690 -28175 -63561 -15350 1208 1620 15374 95119 104307
13935 104307 52098 14820 3194 -1023 -23444 -38235 -65519 -33684 19922 49882 42242 4376
13923 4376 -11190 22217 29960 -13369 -21883 -13488 -26573 -36652 -46464 -54772 -55393 -43265 -50852
13910 -50852 -53837 -50856 -56537 -52325 -43833 -35827 4750 9224 12692 -11008 -40868 -27434 3988
13897 3988 -29340 -20318 -160 35850 19352 16876 18974 -17005 -23213 -26983 -37151 -23375 -8541
$$ packed form
13987d2381Q230J7047j5216O0j214K369k5134l30K5640O615K7263K77J51j9031
13973a5654J9974l37k1605n4914k0012K8855K9918j6972l4333J9143K0323M7578
13961A964J2659l3416K070K7169j6261J1021l360n907l4534r775j3386P7654L1646
13948D7544r144r69j281m4446o394j3485l5386M8211J6558M12J3754P9745R188
13935A04307n2209l7278j1626m217k2421j4791k7284L1835N3606K9960p640l7866
13923D376j5566L3407P743m3329q514Q395j3085j0079r812q308o21J2128p587
13910e0852k985K981n681M212Q492Q006M0577M474L468k3700k9860J3434L1422
13897C988l3328R022K0158L6010j6498k476K098l5979o208l770j0168J3776J4834
$$ plain form
13884 -8541 -21662 -66663 -78503 -52323 -46076 -48232 -21688 18060 17038 -79556 -83543 -23869 -40220
13871 -40220 -64772 -108400 -103395 -85688 -30383 -11352 6926 -199 -14870 -16189 13095 19554
13859 19554 17311 22138 18508 9891 -22566 13344 -11287 -59425 -47561 -33048 -51583 -8554
13847 -8554 48661 91423 55922 28498 27967 29804 -3863 -19100 -4895 2058 -4041 7575 -16088
13834 -16088 789 38313 55984 37483 64238 54009 16588 67540 59662 7693 -12831 4070
13822 4070 -16304 -49906 -17694 -4577 -24068 -42775 -35071 5726 -2505 24096 37566 24348
13810 24348 24025 -9130 -52410 -59185 -55541 -11863 -16890 -22161 2566 15707 -16536 -46509 -33055
13797 -33055 -29271 -46619 -11066 -11339 -16939 -13030 -9950 2845 6841 -17086 -23353 7499 47748
$$ packed form
13884h541j3121m5001j1840K6180O247k156K6544L9748j022r6594l987N9674j6351
13871d0220k4552m3628N005J7707N5305J9031J8278p125j4671j319K9284O459
13859A9554k243M827l630q617l2457L5910k4631m8138J1864J4513j8535M3029
13847h554N7215M2762l5501k7424n31J837l3667j5237J4205O953o099J1616k3663
13834a6088J6877L7524J7671j8501K6755j0229l7421N0952p878n1969k0524J6901
13822D070k0374l3602L2212J3117j9491j8707P704M0797q231K6601J3470j3218
13810B4348l23l3155m3280o775L644M3678n027n271K4727J3141l2243k9973J3454
13797c3055L784j7348L5553k73n600L909L080J2795L996k3927o267L0852M0249
$$ plain form
13784 47748 36676 -3984 -21979 -36878 -68807 -47379 -45563 -51025 -33457 31644 24892 -32930
13772 -32930 -93338 -74886 -52216 -4616 1035 -31903 -18704 -33575 -31074 -39053 -46564 -23425
13760 -23425 -73147 -81042 -83035 -80294 -53348 -42405 -21045 -34040 1316 -32272 -81609 -84681
13748 -84681 -73185 -48238 -53671 -70473 -76748 -45860 -4786 30719 -8243 -8063 -18655 -22993 -3181
13735 -3181 27155 -8198 -29536 -32390 -25460 -34996 -38253 -15015 4008 14542 13748 68229 73515
13722 73515 37036 41347 21357 -25199 -992 45271 56515 16349 115 25100 49547 57291
13710 57291 16479 -35989 22549 89784 25619 7734 26795 42121 3781 -58473 -54025 -27832
13698 -27832 9906 21634 49821 38788 -23412 -21599 30120 72799 50000 41957 67149 59819
$$ packed form
13784D7748j1072m0660j7995j4899l1929K1428J816n462J7568O5101o752n7822
13772c2930o0408J8452K2670M7600N651l2938J3199j4871K501p979p511K3139
13760b3425m9722p895j993K741K6946J0943K1360j2995L5356l3588m9337l072
13748h4681J1496K4947n433j6802o275L0888M1074L5505l8962J80j0592m338J9812
13735c181L0336l5353k1338k854O930r536l257K3238J9023J0534p94N4481N286
13722G3515l6479M311j9990m6556K4207M6263J1244m0166j6234K4985K4447P744
13710E7291m0812n2468N8538O7235o4165j7885J9061J5326l8340o2254M448K6193
13698b7832L7738J1728K8187j1033o2200J813N1719M2679k2799q043K5192p330
$$ plain form
13686 59819 45196 20135 34948 13193 -13224 -3485 -618 48071 50163 17534 -2332 -22138
13674 -22138 -58951 -42289 6206 -7078 -21342 3261 -3150 -32800 -13959 -47500 -18991 -29627
13662 -29627 -15067 -24162 -100396 -102299 -60157 -28350 -40003 -29925 -21660 -36801 -45723 -36653 -14351
13649 -14351 11557 9695 -19406 -46048 -64460 -43377 12211 31187 -9568 -26047 -31174 -13654
13637 -13654 -17642 -31783 -21413 37678 62740 40708 -5919 -59104 -50187 -24781 10424 -3876
13625 -3876 8362 1441 -4193 -27896 -15696 -50832 -66239 -55169 -1000 19998 -6528 -20373
13613 -20373 -40679 -53559 -36925 16320 31623 68239 81651 51491 32827 62573 23019 -7037
13601 -7037 4569 -5717 -41434 -35903 -32028 -23571 256 1525 31327 64462 51600 32098 43101
$$ packed form
13686E9819j4623k5061J4813k1755k6417R739K867M8689K092l2629j9866j9806
13674b2138l6813J6662M8495j3284j4264K4603o411k9650J8841l3541K8509j0636
13662b9627J4560r095p6234j903M2142L1807j1653J0078Q265j5141q922R070K2302
13649a4351K5908j862k9101k6642j8412K1083N5588J8976m0755j6479n127J7520
13637a3654l988j4141J0370N9091K5062k2032m6627n3185Q917K5406L5205j4300
13625c876J2238o921n634k3703J2200l5136j5407J1070N4169K0998k6526j3845
13613b0373k0306j2880J6634N3245J5303L6616J3412l0160j8664K9746l9554l0056
13601g037J1606j0286l5717N531L875Q457K3827J269K9802L3135j2862j9502J1003
$$ plain form
13588 43101 37003 40229 29067 82647 128831 111288 78980 14518 30933 71752 61905 53374
13576 53374 63089 20938 318 -5141 34986 37553 52555 42821 53241 41513 -12613 -16760 -12430
13563 -12430 4293 6169 -1592 38029 69786 111531 143563 114293 77588 41505 29661 62553
13551 62553 75550 37918 35581 15136 -37755 -26345 -1612 -20447 -7174 12267 11745 -13926
13539 -13926 -6548 -489 5249 2731 48145 48141 40042 38794 6273 -29395 3147 14106 -11766 -70115
13525 -70115 -34562 31472 28188 33891 46271 36726 79912 88524 36829 47526 57431 17480 -7995
13512 -7995 -4308 -20111 18540 11569 -30996 -60639 21947 40280 40520 -3932 17447 38419 19955
13499 19955 2384 -2 27857 27757 28155 3844 43499 87806 39387 21992 35559 50864 47937
$$ packed form
13588D3101o098L226j1162N3580M6184j7543l2308o4462J6415M0819r847q531
13576E3374R715m2151k0620n459M0127K567J5002r734J0420j1728n4126m147M330
13563a2430J6723J876p761L9621L1757M1745L2032k9270l6705l6083j1844L2892
13551F2553J2997l7632k337k0445n2891J1410K4733j8835J3273J9441n22k5671
13539a3926P378O059N738k518M5414mq099j248l2521l5668L2542J0959k5872n8349
13525g0115L5553O6034l284N703J2380r545M3186Q612n1695J0697R905l9951k5475
13512g995L687j5803L8651o971m2565k9643Q2586J8333K40m4452K1379K0972j8464
13499A9955j7571k386K7859j00L98k4311L9655M4307m8419j7395J3567J5305k927
$$ plain form
13486 47937 62903 74315 96433 90523 104483 121066 122318 78302 38068 49374 51985 54279
13474 54279 31980 64652 54071 36788 36512 54384 60783 62741 40990 -316 23230 25217 32834
13461 32834 36025 60996 50392 51970 63028 9475 13631 40548 55876 40734 37971 31674 -6440
13448 -6440 -38005 -30159 -13441 -18588 -20424 -27409 -16623 15320 60036 46722 78699 126562 110265
13435 110265 114665 78764 21306 15943 20477 8246 10851 -21350 -11682 40689 61667 22128
13423 22128 20751 9991 7825 24085 65343 79170 49574 42368 47911 32434 -7374 -44858
13411 -44858 -55388 -66813 -55551 -16418 16971 18613 47502 53151 19444 1553 2475 -1363 -17399
13398 -17399 -19903 5050 2328 -4575 46190 75628 59631 69748 100943 66923 65996 94332 143851
$$ packed form
13486D7937J4966J1412K2118n910J3960J6583J252m4016m0234J1306K611K294
13474E4279k2299L2672j0581j7283k76J7872O399J958k1751m1306K3546J987P617
13461C2834L191K4971j0604J578J1058n3553M156K6917J5328j5142k763o297l8114
13448f440l1565P846J6718n147j836o985J0786L1943M4716j3314L1977M7863j6297
13435A10265M400l5901n7458n363M534j2231K605l2201R668N2371K0978l9539
13423B2128j377j0760k166J6260M1258J3827k9596p206N543j5477l9808l7484
13411d4858j0530j1425J1262L9133L3389J642K8889N649l3707j7891R22l838j6036
13398a7399k504K4953k722o903N0765K9438j5997J0117L1195l4020r27K8336M9519
$$ plain form
13385 143851 237582 374415 553329 867265 1363379 1858046 2242312 2461434 2416241 2194574
13375 2194574 1860009 1500675 1243683 1064717 936621 798429 668761 540171 488013 464366
13365 464366 403791 345840 326743 342288 325898 306888 277601 232624 207356 237119 269139
13354 269139 269560 260625 274887 310815 301125 264943 264796 233839 187738 167979 149285 151951 132467
13341 132467 121918 100362 130729 148754 146177 81985 92311 141546 143971 123961 113050 82097
13329 82097 60224 87569 115732 120206 123205 77287 65328 97246 128309 134770 96326 103599
13317 103599 137880 112553 87832 91557 107797 138714 131365 142032 146178 142406 163827 168768
13305 168768 165965 195406 224898 239678 216476 199562 210372 196118 205219 151281 151118 123490
$$ packed form
13385A43851R3731J36833J78914L13936M96114M94667L84266K19122m5193k21667
13375B194574l34565l59334k56992j78966j28096j38192j29668j28590n2158k3647
13365D64366o0575n7951j9097J5545j6390j9010k9287m4977k5268K9763L2020
13354B69139M21q935J4262L5928r690l6182j47l0957m6101j9759j8694K666j9484
13341A32467j0549k1556L0367J8025k577o4192J0326M9235K425k0010j0911l0953
13329H2097k1873K7345K8163M474K999m5918j1959L1918L1063O461l8444P273
13317A03599L4281k5327k4721L725J6240L0917p349J0667M146l772K1421M941
13305A68768k803K9441K9492J4780k3202j6914J0810j4254R101n3938j63k7628
$$ plain form
13293 123490 83655 36176 37684 34447 44061 45633 61766 118903 145987 171602 150073 97827
13281 97827 99427 99500 67707 78120 124069 163715 142054 145676 137175 140466 164858 184506 167857
13268 167857 147393 136006 135771 120912 114287 146544 183617 192014 240437 266669 256143 220791
13256 220791 201172 210730 218663 190098 113052 95148 113164 129219 102089 110344 91092 131761
13244 131761 150532 125766 124107 53272 26234 25829 61448 118074 134013 112971 142269 139299
13232 139299 69329 -28434 -143321 -176794 -127050 -86479 -49819 -27917 -7954 -13680 -10066 -64966
13220 -64966 -67728 -7606 23025 7674 -17432 1860 1355 46910 30963 1592 33956 51473
13208 51473 74912 79533 58801 -2611 -27441 -38483 -46290 -7810 14627 25551 12927 -13850
$$ packed form
13293A23490l9835m7479J508l237R614J572J6133N7137K7084K5615k1529n2246
13281I7827J600P3l1793J0413M5949L9646k1661L622q501L291K4392J9648j6649
13268A67857k0464j1387k35j4859o625L2257L7073Q397M8423K6232j0526l5352
13256B20791j9619R558P933k8565p7046j7904J8016J6055k7130Q255j9252M0669
13244A31761J8771k4766j659p0835k7038m05L5619N6626J5939k1042K9298k970
13232A39299o9970r7763j14887l3473M9744M0571L6660K1902J9963n726L614n4900
13220f4966k762O0122L0631j5351k5106J9292n05M5555j5947k9371L2364J7517
13208E1473K3439M621k0732o1412k4830j1042p807L8480K2437J0924j2624k6777
$$ plain form
13196 -13850 -16553 -18950 -17666 -25538 16402 52401 23607 40346 46822 53352 80707 107038 111534
13183 111534 82756 82938 111627 163153 201199 231417 187050 158114 168850 184862 196585 244382
13171 244382 250010 200022 174758 152416 119892 93470 116219 119510 92983 117091 152772 142919
13159 142919 100785 45562 28081 23100 37427 22052 34750 30822 42583 48369 30029 22860
13147 22860 27328 51499 73577 57277 92913 141811 82321 33463 37663 53077 68513 46696
13135 46696 30741 28640 64987 104068 149533 141619 155495 147256 145873 100272 75155 75938 92486
13122 92486 125160 141560 134605 67416 29557 16513 -24701 -62921 -79958 -42071 16266 36779
13110 36779 85487 126765 127616 106564 92529 85585 78037 81783 113354 126018 92268 70460 94262
$$ packed form
13196a3850k703k397J284p872M1940L5999k8794J6739O476O530K7355K6331M496
13183A11534k8778J82K8689N1526L8046L0218m4367k8936J0736J6012J1723M7797
13171B44382N628m9988k5264k2342l2524k6422K2749L291k6527K4108L5681r853
13159A42919m2134n5223j7481m981J4327j5375J2698l928J1761N786j8340p169
13147B2860M468K4171K2078j6300L5636M8898n9490m8858M200J5414J5436k1817
13135D6696j5955k101L6347L9081M5465p914J3876q239j383m5601k5117P83J6548
13122I2486L2674J6400o955o7189l7859j3044m1214l8220j7037L7887N8337K0513
13110C6779M8708M1278Q51k1052j4035o944p548L746L1571J2664l3750k1808K3802
$$ plain form
13097 94262 83567 47604 3663 13796 39903 62450 73794 50787 52176 -2152 -37084 -9690
13085 -9690 10835 8679 -8415 -25725 -31370 -57202 -74449 -74042 -77516 -81517 -73775 -123885 -122327
13072 -122327 -102632 -108148 -102078 -48869 -16205 17821 -507 10827 11521 16141 42167 68212
13060 68212 63005 71598 83688 78025 77829 128710 155100 126614 181995 233905 282794 324612 368349
13047 368349 448400 528977 563979 552736 561239 553029 507055 473171 469591 425035 386791 452055
13035 452055 459083 448617 496432 504808 428949 393350 388471 402444 392436 373698 375927 388854
13023 388854 350896 285596 271223 304135 318023 351420 365523 387885 377530 361601 381789
13012 381789 360032 391266 397895 350593 316232 279045 287995 318774 338512 364557 417354 410924
$$ packed form
13097I4262j0695l5963m3941J0133K6107K2547J1344k3007J389n4328l4932K7394
13085i690K0525k156j7094j7310n645k5832j7247M07l474m001P742n0110J558
13072a22327J9695n516O070N3209L2664L4026j8328J1334O94M620K6026K6045
13060F8212n207Q593J2090n663j96N0881K6390k8486N5381N1910M8889M1818M3737
13047C68349Q0051Q0577L5002j1243Q503q210m5974l3884l580m4556l8244O5264
13035D52055P028j0466M7815Q376p5859l5599m879J3973j0008j8738K229J2927
13023C88854l7958o5300j4373L2912J3888L3397J4103K2362j0355j5929K0188
13012C81789k1757L1234O629m7302l4361l7187Q950L0779J9738K6045N2797o430
$$ plain form
13000 410924 406391 403494 430259 441538 415923 447508 493024 523589 516498 506271 479825 500618
12988 500618 501184 511163 502335 508160 458570 483481 536796 555588 639439 710087 769359 897853
12976 897853 1029265 1114909 1110018 1116144 1165560 1174869 1144561 1169379 1209257 1212860 1215396 1257944
12964 1257944 1310399 1335597 1374752 1394319 1439903 1491429 1601651 1742567 1831932 1919737 2036531
12953 2036531 2181740 2324299 2511432 2689652 2849241 3084148 3347615 3594947 3891682
12944 3891682 4250827 4649448 5137784 5795003 6518552 7355796 8348943 9648943 11341791
12935 11341791 13418048 15870096 18705730 22011466 26049371 31248255 38508505 49247764
12927 49247764 66321372 95527238 146789860 226302587 319408576 403454345 457609851
$$ packed form
13000D10924m533k897K6765J1279k5615L1585M5516L0565p091j0227k6446K0793
12988E00618N66R979q828N825m9590K4911N3315J8792Q3851P0648N9272J28494
12976H97853J31412Q5644m891O126M9416R309l0308K4818L9878L603K536M2548
12964A257944N2455K5198L9155J9567M5584N1526J10222J40916Q9365Q7805J16794
12953B036531J45209J42559J87133J78220J59589K34907K63467K47332K96735
12944C891682L59145L98621M88336O57219P23549Q37244R93147J300000J692848
12935A1341791K076257K452048K835634L305736M037905N198884P260250J0739259
12927D9247764J7073608K9205866N1262622P9512727R3105989Q4045769N4155506
$$ plain form
12920 457609851 462389222 425747833 359993088 292788238 242944763 207389397 178303865
12913 178303865 151875970 128623361 109986713 95672917 84560538 75527159 67984924
12906 67984924 61610624 56268794 51766507 47979267 44761071 41943852 39466637 37249968
12898 37249968 35153179 33150651 31281864 29586475 28089222 26820552 25816534 24975884
12890 24975884 24229006 23501467 22694015 21796541 20833810 19849705 18977137 18181932 17475375
12881 17475375 16808723 16159725 15549834 14931733 14366819 13784086 13254896 12778697 12342944
12872 12342944 11888867 11475094 11055338 10730015 10432432 10113757 9789966 9522628 9294736
12863 9294736 9102393 8894016 8693235 8491183 8300451 8101139 7862664 7624051 7423600
$$ packed form
12920D57609851M779371l6641389o5754745o7204850m9843475l5555366k9085532
12913A78303865k6427895k3252609j8636648j4313796j1112379r033379p542235
12906F7984924o374300n341830m502287l787240l218196k817219k477215k216669
12898C7249968k096789k002528j868787j695389j497253j268670j004018q40650
12890B4975884p46878p27539q07452q97474r62731r84105q72568p95205p06557
12881A7475375o66652o48998o09891o18101n64914n82733n29190m76199m35753
12872A2342944m54077m13773m19756l25323k97583l18675l23791k67338k27892
12863I294736j92343k08377k00781k02052j90732j99312k38475k38613k00451
$$ plain form
12854 7423600 7197813 6996697 6791080 6593371 6400825 6236310 6086612 5967488 5823224
12845 5823224 5663520 5543497 5446171 5330749 5164443 5027657 4918671 4810211 4686536 4569392
12835 4569392 4469056 4384728 4298774 4222738 4117513 3994215 3852916 3751939 3678621 3587072
12825 3587072 3502855 3457476 3399246 3313746 3223228 3109452 2978947 2855340 2750548 2619248
12815 2619248 2535624 2495628 2431553 2360613 2310012 2265328 2226658 2165347 2102244 2026369 1992383
12804 1992383 1959395 1900714 1861328 1811864 1757082 1730817 1735613 1685156 1641149 1660955 1654492 1599989
12792 1599989 1575540 1590125 1573487 1532864 1518186 1539388 1546247 1532862 1469105 1366603 1327839
12781 1327839 1271310 1210801 1164279 1143019 1125621 1095258 1060982 1015635 1005636 1067443 1029538
$$ packed form
12854G423600k25787k01116k05617j97709j92546j64515j49698j19124j44264
12845E823224j59704j20023r7326j15422j66306j36786j08986j08460j23675j17144
12835D569392j00336q4328q5954p6036j05225j23298j41299j00977p3318r1549
12825C587072q4217m5379n8230q5500r0518j13776j30505j23607j04792j31300
12815B619248q3624l9996o4075p0940n0601m4684l8670o1311o3103p5875l3986
12804A992383l2988n8681l9386m9464n4782k6265M796n0457m4007J9806o463n4503
12792A599989k4449J4585j6638m0623j4678K1202O859j3385o3757j02502l8764
12781A327839n6529o0509m6522k1260j7398l0363l4276m5347r999O1807l7905
$$ plain form
12770 1029538 958937 935960 933469 913773 887450 859296 815919 812616 840950 811189 730903 637879
12758 637879 572440 564918 596919 608113 587036 582083 568420 509001 519511 571302 568106 571540
12746 571540 571861 537997 530243 544678 527230 524178 503846 488934 486590 465351 425111 370005
12734 370005 310308 296124 309058 318099 382488 454944 469026 434899 425251 419055 416438 368886
12722 368886 323173 284516 283458 282995 272603 304582 289595 279127 270868 272309 254579 217267
12710 217267 247142 247623 263881 317252 375633 380169 375632 348408 300748 306755 286218 300510
12698 300510 329013 320085 314808 267249 243934 205688 194794 256706 282692 305377 293438 263626
12686 263626 236990 225985 231761 247404 236026 242582 261813 233677 236464 255167 270586 273830
$$ packed form
12770A029538p0601k2977k491j9696k6323k8154m3377l303K8334k9761q0286r3024
12758F37879o5439p522L2001J1194k1077m953j3663n9419J0510N1791l196L434
12746E71540L21l3864p754J4435j7448l052k0332j4912k344k1239m0240n5106
12734C70005n9697j4184J2934R041O4389P2456J4082l4127r648o196k617m7552
12722C68886m5713l8657j058m63j0392L1979j4987j0468q259J441j7730l7312
12710B17267K9875M81J6258N3371N8381M536m537k7224m7660O007k0537J4292
12698C00510K8503q928n277m7559k3315l8246j0894O1912K5986K2685j1939k9812
12686B63626k6636j1005N776J5643j1378O556J9231k8136K787J8703J5419L244
$$ plain form
12674 273830 263857 267232 257394 222418 218169 221976 224366 243629 269977 281480 258463 231034 220905
12661 220905 286405 331508 336777 297931 307547 282759 245304 288836 270911 281680 301494 316059
12649 316059 273181 263354 280117 270864 261020 262119 226318 206576 175073 185564 165322 186681
12637 186681 218336 191634 184769 167639 194046 198335 218728 232347 229013 224812 201969 205342
12625 205342 189399 182245 159990 143938 110996 103128 156097 190356 226941 283700 275678 253621
12613 253621 228401 226668 255824 221129 214552 211872 198846 194196 188755 135104 102476 84539
12601 84539 80547 59733 47684 62258 55282 42376 95292 75497 52554 75577 108516 119759
12589 119759 100015 91347 105680 100171 52952 4107 5674 16563 26664 61651 89325 82498
$$ packed form
12674B73830r973L375r838l4976m249L807K390J9263K6348J1503k3017k7429j0129
12661B20905O5500M5103N269l8846R616k4788l7455M3532j7925J0769J9814J4565
12649C16059m2878r827J6763r253r844J099l5801j9742l1503J0491k0242K1359
12637A86681L1655k6702o865j7130K6407M289K0393J3619l334m201k2843L373
12625B05342j5943p154k2255j6052l2942p868N2969L4259L6585N6759q022k2057
12613B53621k5220j733K9156l4695o577k680j3026m650n441n3651l2628j7937
12601H4539l992k0814j2049J4574o976j2906N2916j9795k2943K3023L2939J1243
12589A19759j9744q668J4333n509m7219m8845J567J0889J0101L4987K7674o827
$$ plain form
12577 82498 107144 74745 77735 49284 -10902 18039 50392 75594 62047 55818 99730 74256
12565 74256 24140 37102 65719 51634 41091 67205 60813 60236 27779 49991 50481 21247 30936
12552 30936 577 -20968 9184 26114 16921 -15195 -58118 -43128 -44590 -87197 -77433 -47677
12540 -47677 -28787 21908 58261 62782 82006 107556 119636 64177 37849 64686 56946 35903
12528 35903 19397 27412 34152 -36646 -84491 -77146 -50602 8502 16217 15291 24073 57779 48256
12515 48256 22270 -29576 -38174 -14890 -8574 2628 17488 43371 38533 25784 44717 49548
12503 49548 41459 34865 23390 -5034 14133 4335 -13363 143 66449 104656 69886 89025
12491 89025 70002 46753 59726 56673 28165 13615 27547 21873 1123 28881 14535 -11194
$$ packed form
12577H2498K4646l2399K990k8451o0186K8941L2353K5202j3547o229M3912k5474
12565G4256n0116J2962K8617j4085j0543K6114o392n77l2457K2212M90k9234R689
12552C0936l0359k1545L0152J6930r193l2116m2923J4990j462m2607R764K9756
12540d7677J8890N0695L6353M521J9224K5550J2080n5459k6328K6837p740k1043
12528C5903j6506Q015O740p0798m7845P345K6544N9104P715r26Q782L3706r523
12515D8256k5986n1846q598K3284O316J1202J4860K5883m838j2749J8933M831
12503D9548q089o594j1475k8424J9167r798j7698J3506O6306L8207l4770J9139
12491H9025j9023k3249J2973l053k8508j4550J3932n674k0750K7758j4346k5729
$$ plain form
12479 -11194 -47550 -7330 47640 57509 68799 65382 27005 71449 64099 43483 70484 87820
12467 87820 101706 130606 133583 144576 243395 367043 570634 839054 1261167 1707666 2129959
12456 2129959 2434249 2499421 2329342 1992307 1603366 1305034 1124064 1012716 862000 749186
12446 749186 685747 577504 493006 402303 324822 317158 337325 334928 331469 315042 297615 285944
12434 285944 261736 228950 251725 218418 156895 149605 120296 100238 134674 161132 188883 171661
12422 171661 150634 113544 73124 121497 201961 204726 179449 180893 155238 135465 113056 102479
12410 102479 116878 131968 130780 130491 111353 75532 103630 144761 154033 129232 149271 143472
12398 143472 93531 88168 69111 104308 106579 71818 44191 83177 82429 45185 41282 23811
$$ packed form
12479a1194l6356M0220N4970R869J1290l417l8377M4444p350k0616K7001J7336
12467H7820J3886K8900K977J0993R8819J23648K03591K68420M22113M46499M22293
12456B129959L04290O5172j70079l37035l88941k98332j80970j11348j50716j12814
12446G49186o3439j08243q4498r0703p7481p664K0167k397l459j6427j7427j1671
12434B85944k4208l2786K2775l3307o1523p290k9309k0058L4436K6458K7751j7222
12422A71661k1027l7090m0420M8373Q0464K765k5277J444k5655j9773k2409j0577
12410A02479J4399J5090j188k89j9138l5821K8098M1131R272k4801K0039n799
12398A43472m9941n363j9057L5197K271l4761k7627L8986p48l7244l903j7471
$$ plain form
12386 23811 -13210 33295 76088 84593 69618 59296 61764 33983 48899 94585 57063 5995
12374 5995 -5574 8036 4214 33902 23699 18843 -9915 19880 31395 48004 46484 32548
12362 32548 28113 -9140 25189 42744 -43524 -33763 3524 -5256 -4933 -30672 12832 33434 32808
12349 32808 40558 18529 14951 35604 42958 9365 9557 -20125 -53815 -35875 -49735 -39879 -2844
12336 -2844 10682 27290 46197 43982 92838 101187 76251 36719 52211 26345 -13264 -41880
12324 -41880 -27463 -12865 3596 -10359 -30868 -7846 4928 10366 1111 4629 27367 28669
12312 28669 45921 88008 122231 114168 77639 44421 -7272 -12928 -44400 -34990 17163 46505
12300 46505 70421 15576 14748 22760 55718 93063 81920 81050 71432 59323 38769 33163 49915
$$ packed form
12386B3811l7021M6505M2793Q505j4975j0322K468k7781J4916M5686l7522n1068
12374E995j1569J3610l822K9688j0203m856k8758K9795J1515J6609j520j3936
12362C2548m435l7253L4329J7555q6268R761L7287q780L23k5739M3504K0602o26
12349C2808P750k2029l578K0653P354l3593J92k9682l3690J7940j3860R856L7035
12336b844J3526J6608J8907k215M8856Q349k4936l9532J5492k5866l9609k8616
12324d1880J4417J4598J6461j3955k0509K3022J2774N438r255L518K2738J302
12312B8669J7252M2087L4223q063l6529l3218n1693n656l1472R410N2153K9342
12300D6505K3916n4845q28Q012L2958L7345j1143q70r618j2109k0554n606J6752
$$ plain form
12287 49915 50445 73658 84082 47318 44335 -3705 -18427 -12907 -31933 11006 14979 29402 3081
12274 3081 30 33796 51743 31371 11251 15967 27420 17185 558 -4871 29265 28628 51393
12261 51393 40762 22977 13101 10793 54905 49009 35062 59645 71720 53384 57929 51341 17137
12248 17137 -3987 6341 11553 25979 46422 52960 9106 2313 5746 -19949 -55764 -79943
12236 -79943 -121511 -88786 -11079 7903 -4377 -64837 -83113 -49708 -29078 36335 19388 14539
12224 14539 17039 20572 -6037 -32258 8233 93591 113838 97677 85293 85372 56557 34521 10366
12211 10366 -18389 -16789 -18463 26309 50905 50562 53100 52423 42684 10413 -31119 -43457 -24265
12198 -24265 -27214 -2500 3849 32642 22503 19703 41752 18466 5501 15633 59593 63544
$$ packed form
12287D9915N30K3213J0424l6764k983m8040j4722N520j9026M2939L973J4423k6321
12274C081l051L3766J7947k0372k0120M716J1453j0235j6627n429L4136o37K2765
12261E1393j0631j7785r876k308M4112n896j3947K4583J2075j8336M545o588l4204
12248A7137k1124J0328N212J4426K0443O538m3854o793L433k5695l5815k4179
12236g9943m1568L2725P7707J8982j2280o0460j8276L3405K0630O5413j6947m849
12224A4539K500L533k6609k6221M0491Q5358K0247j6161j2384P9k8815k2036k4155
12211A0366k8755J600j674M4772K4596l43K538o77r739l2271m1532j2338J9192
12198b4265k949K4714O349K8793j0139k800K2049k3286j2965J0132M3960L951
$$ plain form
12186 63544 57159 26265 13962 30086 2798 12544 61136 46146 47211 58465 46263 26120
12174 26120 9071 8999 43149 52580 46264 36681 70863 102002 102523 98496 82585 43302 2737
12161 2737 13016 90222 101221 91035 80705 26342 8662 -18697 -25939 -16851 -19563 -1476
12149 -1476 24330 40790 38066 19071 -16879 -23840 -15932 -26281 -21724 7551 25358 34617 53880
12136 53880 55952 42904 35118 26001 8213 23659 33993 27354 44472 61207 18318 30783
12124 30783 40691 62610 67929 35492 20621 20746 60706 38078 33569 45179 41564 29190 31958
12111 31958 15266 16673 7293 -22203 -4700 -9081 -13669 -49034 -34269 10327 -1850 1495 54432
12098 54432 51092 23783 -36572 -34635 -16144 -22946 -34700 -25416 22840 66947 44532 17755
$$ packed form
12186F3544o385l0894j2303J6124k7288R746M8592j4990J065J1254j2202k0143
12174B6120j7049p2L4150R431o316r583L4182L1139N21m027j5911l9283m0565
12161B737J0279P7206J0999j0186j0330n4363j7680k7359p242R088k712J8087
12149a476K5806J6460k724j8995l5950o961P908j0349M557K9275J7807R259J9263
12136E3880K072j3048p786r117j7788J5446J0334o639J7118J6735m2889J2465
12124C0783R908K1919N319l2437j4871J25L9960k2628m509J1610l615j2374K768
12111C1958j6692J407r380k9496J7503m381m588l5365J4765M4596j2177L345N2937
12098E4432l340k7309o0355J937J8491o802j1754R284M8256M4107k2415k6777
$$ plain form
12086 17755 -20651 24044 79647 87532 14644 2865 35399 8401 -6321 63639 67381 57421
12074 57421 36451 8047 -16967 -14762 4777 2044 -4089 -21854 1972 50880 13278 -20712
12062 -20712 2922 2096 528 21130 -4764 -1042 17421 12325 4759 -16292 13311 -5806 -42136
12049 -42136 -15882 -9993 -42379 -29283 -7673 19322 45483 55277 -22579 -70498 -41292 -53114
12037 -53114 -28727 6942 -27099 -69002 -43768 -23974 -46450 -71393 -47932 -54867 -8724 35508
12025 35508 78508 56708 11490 29091 44230 35846 25524 26780 26213 4679 -13501 18561
12013 18561 57106 31410 8973 -29154 -27383 -21336 -4028 -2059 10661 43626 80387 54945
12001 54945 38085 79026 70973 50763 48435 -4964 -10784 -15776 3627 41469 33374 2253 -10918
$$ packed form
12086A7755l8406M4695N5603P885p2888j1779L2534k6998j4722O9960L742r960
12074E7421k0970k8404k5014K205J9539k733o133j7765K3826M8908l7602l3990
12062b0712K3634q26j568K0602k5894L722J8463n096p566k1051K9603j9117l6330
12049d2136K6254N889l2386J3096K1610K6995K6161R794p7856m7919K9206j1822
12037e3114K4387L5669l4041m1903K5234J9794k2476k4943K3461o935M6143M4232
12025C5508M3000k1800m5218J7601J5139q384j0322J256n67k1534j8180L2062
12013A8561L8545k5696k2437l8127J771O047J7308J969J2720L2965L6761k5442
12001E4945j6860M0941q053k0210k328n3399n820m992J9403L7842q095l1121j3171
$$ plain form
11988 -10918 29480 33937 -4573 8691 23788 41815 34639 -14436 -49282 -58334 -73846 -62025
11976 -62025 -21039 -33875 22591 64191 47031 23556 1475 23067 29075 37636 46537 59204
11964 59204 21136 11797 39331 -19208 -33635 36975 72398 42007 -14858 -22347 -57301 -41065
11952 -41065 -3046 -13664 -25091 -8305 5547 -29293 -35088 -23614 -39065 -51293 -52334 -3719
11940 -3719 -21658 -25037 1617 19434 29696 22529 35233 15513 40862 32137 -12201 1292
11928 1292 -46084 -31950 10701 22622 26200 74237 73957 48725 15705 9137 -27544 -52740 -38691
11915 -38691 -23866 -30521 -36832 -32518 -31252 6664 21953 32765 -10964 12166 28007 43739
11903 43739 42472 32827 8069 11270 34032 48539 51782 110822 125402 83940 58840 48461
$$ packed form
11988a0918M0398M457l8510J3264J5097J8027p176m9075l4846r052j5512J1821
11976f2025M0986j2836N6466M1600j7160k3475k2081K1592O008Q561Q901J2667
11964E9204l8068r339K7534n8539j4427P0610L5423l0391n6865p489l4954J6236
11952d1065L8019j0618j1427J6786J3852l4840n795J1474j5451j2228j041M8615
11940c719j7939l379K6654J7817J0262p167J2704j9720K5349q725m4338J3493
11928A292m7376J4134M2651J1921L578M8037k80k5232l3020o568l6681k5196J4049
11915c8691J4825o655o311M314J266L7916J5289J0812m3729K3130J5841J5732
11903D3739j267r645k4758L201K2762J4507L243N9040J4580m1462k5100j0379
$$ plain form
11891 48461 64541 32675 -15923 32567 36204 16987 50797 -6334 -38312 -33464 -22566 4566
11879 4566 28493 19772 2373 3928 12246 6367 -27502 -20915 -4733 4746 8804 17924 11959 9460
11865 9460 34941 218 -1577 3713 6145 -32649 -19146 3460 18316 -12208 -14945 -41104 -41453
11852 -41453 -47787 -35301 2099 -12429 -15494 -42864 -40129 -22734 -18247 22819 31498 -3813 -1235
11839 -1235 58713 103117 97214 79453 30536 19337 -14685 -26795 -10915 -6937 -6849 -3017 -2367
11826 -2367 -19123 -34719 -17908 -3562 8841 47435 80044 73509 4992 -26760 -47429 -60141
11814 -60141 -37362 -9835 -13966 -41185 -29255 -22165 12680 38787 18023 2398 24689 27487
11802 27487 24742 30232 -7435 -38453 -62056 -59623 -39436 -69439 -50599 -29142 -19758 -707
$$ packed form
11891D8461J6080l1866m8598M8490L637j9217L3810n7131l1978M848J0898K7132
11879D566K3927q721j7399J555Q318n879l3869O587J6182R479M058R120n965k499
11865I460K5481l4723j795N290K432l8794J3503K2606J4856l0524k737k6159l49
11852d1453o334J2486L7400j4528l065k7370K735J7395M487M1066Q679l5311K578
11839a235N9948M4404n903j7761m8917j1199l4022j2110J5880L978Q8L832O50
11826b367j6756j5596J6811J4346J2403L8594L2609o535o8517l1752k0669j2712
11814f0141K2779K7527m131k7219J1930P090L4845K6107k0764j5625K2291K798
11802B7487k745N490l7667l1018k3603K433K0187l0003J8840K1457R384J9051
$$ plain form
11790 -707 -31157 11013 34090 15221 21063 50226 52249 78670 81476 43310 10151 -435 -17298
11777 -17298 -17745 -22715 2991 -11229 -4411 -9755 -23117 -16485 -25990 -32000 -25611 -13417 -17253 -26750
11763 -26750 -10358 129 14921 26589 12872 26596 46266 59354 29742 -9204 -28229 -43427
11751 -43427 -33491 1911 48992 59488 20193 9303 -9464 -10410 3155 28009 20364 27921 31878
11738 31878 46642 59978 65394 58652 45673 51122 56391 57937 20578 21398 811 -33 -15333
11725 -15333 -11572 -22123 -15996 2232 9094 17066 -27010 -71584 -80481 -52043 -49397 -105522 -94810
11712 -94810 -60199 -54251 -54616 -48618 -11175 18047 40856 38681 19057 11665 -4351 5524 12700
11699 12700 23060 50657 28027 -5059 -15164 12043 14105 23894 28140 39701 26766 -5061
$$ packed form
11790g07l0450M2170K3077j8869N842K9163K023K6421K806l8166l3159j0586j6863
11777a7298m47m970K5706j4220O818n344j3362O632r505o010O389J2194l836r497
11763b6750J6392J0487J4792J1668j3717J3724J9670J3088k9612l8946j9025j5198
11751d3427R936L5402M7081J0496l9295j0890j8767r46J3565K4854p645P557L957
11738C1878J4764J3336N416o742j2979N449N269J546l7359Q20k0587q44j5300
11725a5333L761j0551O127J8228O862P972m4076m4574q897K8438K646n6125J0712
11712i4810L4611N948l65N998L7443K9222K2809k175j9624p392j6016R875P176
11699A2700J0360K7597k2630l3086j0105K7207K062R789M246J1561j2935l1827
$$ plain form
11687 -5061 -21550 -9562 15766 1602 -2002 49647 45247 1417 -24524 -36040 4270 -22434
11675 -22434 -46419 -67879 -78171 -45823 -37191 -45428 -31148 -38698 -48873 5233 19310 41758
11663 41758 23660 -3443 -10947 25989 68202 78125 74857 26540 35014 34262 -13659 -13660 -33465 -7313
11649 -7313 -17694 -56712 -78082 -54338 -32881 -783 -28252 -26591 -15138 980 -8418 13157
11637 13157 13524 -12936 10552 18476 30185 24435 13947 7568 -2096 24354 51362 34599 -1393
11624 -1393 1077 -41392 -25995 4551 14013 41530 75846 49983 22925 -12199 -11925 527 15728
11611 15728 85 -827 12077 6499 59722 51094 58643 46414 54344 35516 59198 23902 26878
11598 26878 76022 84605 52064 17053 31033 -1546 -19740 -15659 -11245 -11617 -18542 14116 18790
$$ packed form
11687e061j6489J1988K5328j4164l604N1649m400m3830k5941j1516M0310k6704
11675b2434k3985k1460j0292L2348Q632q237J4280p550j0175N4106J4077K2448
11663D1758j8098k7103p504L6936M2213R923l268m8317Q474p52m7921jj9805K6152
11649g313j0381l9018k1370K3744K1457L2098k7469J661J1453J6118r398K1575
11637A3157L67k6460K3488P924J1709n750j0488o379r664K6450K7008j6763l5992
11624a393K470m2469J5397L0546R462K7517L4316k5863k7058l5124K74J2452J5201
11611A5728j5643r12J2904n578N3223q628P549j2229P930j8828K3682l5296K976
11598B6878M9144Q583l2541l5011J3980l2579j8194M081M414l72o925L2658M674
$$ plain form
11585 18790 9195 6633 7067 5007 -12944 -18197 12883 22878 25857 -12777 -52197 -61014 -75603
11572 -75603 -71127 -27224 -3824 2768 50658 36845 -21522 -3435 5499 17043 32666 16658
11560 16658 40099 30233 11265 -23706 -30691 2272 26360 64162 83314 88480 64536 65406 73351
11547 73351 69685 38049 7858 -5731 -8626 -7497 -38242 -17210 -4635 -33025 -5625 3393
11535 3393 28717 53627 34244 10774 63698 69049 70444 54326 33914 7990 -16327 39856
11523 39856 46892 -35200 -39666 -10102 -31372 -60708 -113997 -123249 -104013 -78171 -59669 -44726
11511 -44726 -8713 23398 3548 34882 132489 149696 89505 39247 31868 17148 25525 31915
11499 31915 45193 57564 55044 67763 89389 19128 15438 32046 56085 58409 11452 -29106
$$ packed form
11585A8790r595k562M34k060j7951n253L1080R995K979l8634l9420q817j4589
11572g5603M476M3903K3400O592M7890j3813n8367J8087Q934J1544J5623j6008
11560A6658K3441r866j8968l4971o985L2963K4088L7802J9152N166k3944Q70P945
11547G3351l666l1636l0191j3589k895J129l0745K1032J2575k8390K7400R018
11535C393K5324K4910j9383k3470N2924N351J395j6118k0412k5924k4317N6183
11523C9856P036q2092m466K9564k1270k9336n3289r252J9236K5842J8502J4943
11511d4726L6013L2111j9850L1334R7607J7207o0191n0258p379j4720Q377O390
11499C1915J3278J2371k520J2719K1626p0261l690J6608K4039K324m6957m0558
$$ plain form
11487 -29106 -44469 -31295 -38996 -2714 46964 13259 18972 53290 46788 33529 -7856 -11228
11475 -11228 -17654 3061 -16843 -25665 7110 -1688 -27114 -14110 -3925 8997 22074 22385 18527
11462 18527 -70 28186 52756 27560 362 -2084 -6257 -5502 -12545 -8476 -554 -18360 -27599
11449 -27599 -23472 -6926 -52954 -90404 -6862 18866 26985 26230 -9576 -16067 -50680 -68831 -26422
11436 -26422 11923 4102 -8441 -10185 24848 1174 -5601 22388 1366 -27029 16959 23194
11424 23194 54138 61087 17516 -13859 -60371 -114384 -92222 -49005 -30310 -35215 -61210 -23449
11412 -23449 -19374 -31829 -6096 -9103 858 2206 -12534 -23645 17115 44064 54650 21126
11400 21126 25624 24407 7316 -44669 -93125 -84242 -7571 41005 5183 7654 20127 45230
$$ packed form
11487b9106j5363J3174p701L6282M9678l3705N713L4318o502j3259m1385l372
11475a1228o426K0715j9904q822L2775q798k5426J3004J0185J2922J3077L11l858
11462A8527j8597K8256K4570k5196k7198k446m173P55p043M069P922j7806r239
11449b7599M127J6546m6028l7450Q3542K5728Q119p55l5806o491l4613j8151M2409
11436b6422L8345p821j2543j744L5033k3674o775K7989k1022k8395M3988O235
11424B3194L0944O949m3571l1375m6512n4013K2162M3217J8695m905k5995L7761
11412b3449M075j2455K5733l007R961J348j4740j1111M0760K6949J0586l3524
11400B1126M498j217j7091n1985m8456Q883P6671M8576l5822K471J2473K5103
$$ plain form
11388 45230 14662 -16847 -28691 -27480 -50601 -50487 -51064 -21996 -40188 -8216 1982 -63152 -81440
11375 -81440 -70311 -36856 10906 -12 -25861 17487 70590 62228 48031 51158 41988 12725
11363 12725 -24883 1822 -17815 -10796 2744 6242 1651 6740 15874 7514 4417 -6614 -47269
11350 -47269 -33560 -39787 -69172 -43612 -6354 -13615 -2930 -21624 -17647 -16518 17595 51777
11338 51777 52085 55618 35036 41769 25378 34586 20354 58421 63794 32838 2646 9712 4587
11325 4587 19207 4157 15671 35695 9415 -13654 5635 -21550 -21955 -42118 -25629 -28383
11313 -28383 -5421 25904 34476 51034 40135 7613 -13650 -4316 -29302 -41265 -62837 -17311
11301 -17311 2889 -49634 -59319 -24382 19478 42998 37810 32049 21245 24959 41425 -8939
$$ packed form
11388D5230l0568l1509j1844J211k3121J14n77K9068j8192L1972J0198o5134j8288
11375h1440J1129L3455M7762j0918k5849M3348N3103q362j4197L127r170k9263
11363A2725l7608K6705j9637P019J3540L498m591N089R134q360l097j1031m0655
11350d7269J3709o227k9385K5560L7258p261J0685j8694L977J129L4113L4182
11338E1777L08L533k0582O733j6391R208j4232L8067N373l0956l0192P066n125
11325D587J4620j5050J1514K0024k6280k3069J9289k7185m05k0163J6489k754
11313b8383K2962L1325Q572J6558j0899l2522k1263R334k4986j1963k1572M5526
11301a7311K0200n2523r685L4937M3860K3520n188n761j0804L714J6466n0364
$$ plain form
11289 -8939 -4451 -32604 -50136 -41207 -37966 -51988 -24947 -23334 -55622 -75185 -74695 -75940 -87787
11276 -87787 -57102 -36973 -12163 14506 -959 8283 -17113 -6049 37918 45496 52802 56552
11264 56552 31146 25637 37335 11803 -8734 11877 8835 -9961 -37576 14444 17732 12753
11252 12753 1922 -2401 -1878 14370 24708 15100 27637 62640 34570 9593 11472 9975 -13723
11239 -13723 927 15401 -12048 -21324 -7973 9737 5550 18574 16613 -806 -19378 6027
11227 6027 45517 44075 30709 -26294 -45505 -3493 -2390 3351 -24436 -25571 -2987 4922 -12293
11214 -12293 -2194 -9951 -17309 -5430 11843 50935 51756 29363 20108 -17069 -21583 2964 36951
11201 36951 22579 1507 20020 -10582 -27293 -22929 -37013 -32337 -21693 -30175 -20058 -126
$$ packed form
11289h939M488k8153j7532Q929L241j4022K7041J613l2288j9563M90j245j1847
11276h7787L0685K0129K4810K6669j5465R242k5396J1064M3967P578P306L750
11264E6552k5406n509J1698k5532k0537K0611l042j8796k7615N2020L288m979
11252A2753j0831m323N23J6248J0338r608J2537L5003k8070k4977J879j497k3698
11239a3723J4650J4474k7449r276J3351J7710m187J3024j961j7419j8572K5405
11227F027L9490j442j3366n7003j9211M2012J103N741k7787j135K2584P909j7215
11214a2293J0099p757p358J1879J7273L9092Q21k2393r255l7177m514K4547L3987
11201C6951j4372k1072J8513l0602j6711M364j4084M676J0644q482J0117J9932
$$ plain form
11189 -126 -23086 -52012 -74008 -97530 -46508 14404 17414 -5391 -29132 -6080 -36856 -72639
11177 -72639 -42727 -19987 -23049 -51010 -45843 -52890 -49552 -67657 -53988 -49431 -57375 -32731 -6908
11164 -6908 -40199 -54336 -43647 -53425 -44544 -24254 -73275 -67937 -46186 -36189 -27488 -5596 34790
11151 34790 54722 33402 6766 9650 -369 -24049 -9274 707 -21976 -43228 -20740 -17529
11139 -17529 -33166 -32538 -55013 -1847 34763 3951 -22673 -29922 -51589 -44832 -4046 -15348
11127 -15348 -38092 -63122 -30978 -6024 -11042 -27495 -8860 28329 34827 46862 7795 -33395
11115 -33395 -22660 2466 2716 -18711 -7937 -22165 -63719 -58302 -58700 -82153 -54233 12815 7109
11102 7109 10706 29283 21451 9057 31784 -3841 -5665 10588 20430 18503 -1931 43322 68884
$$ packed form
11189a26k2960k8926k1996k3522N1022O0912L010k2805k3741K3052l0776l5783
11177g2639K9912K2740l062k7961N167p047L338j8105J3669M557p944K4644K5823
11164f908l3291j4137J0689r778Q881K0290m9021N338K1751R997Q701K1892M0386
11151C4790J9932k1320k6636K884j0019k3680J4775R981k2683k1252K2488L211
11139a7529j5637O28k2475N3166L6610l0812k6624p249k1667O757M0786j1302
11127a5348k2744k5030L2144K4954n018j6453J8635L7189O498J2035l9067m1190
11115c3395J0735K5126K50k1427J0774j4228m1554N417l98k3453K7920O7048n706
11102G109L597J8577p832j2394K2727l5625j824J6253R842j927k0434M5253K5562
$$ plain form
11089 68884 34314 6258 -24875 452 16807 39413 22340 -6077 -30059 -37300 828 16512
11077 16512 -3946 -32873 -29723 2380 60815 65872 21718 -30279 -57529 -67644 -112779 -94624
11065 -94624 -45452 8662 28276 -6467 -23935 -13898 4632 -27072 -24569 -1575 -3056 5102
11053 5102 40120 42856 25764 -1488 -34524 -35885 -6142 -18991 -8204 4810 -868 6798 -9800
11040 -9800 -15589 -9437 -13613 -11475 -19775 -19778 24608 7224 -11883 7394 15867 29500 -3991 -17130
11026 -17130 -37301 -55430 -57867 -32072 -57377 -85188 -41111 20948 31053 -6958 -37697 -19697
11014 -19697 -31528 -64692 -65338 -34279 6200 -30114 -57607 -19686 -8750 -2136 3361 -1287 -2589
11001 -2589 7845 49498 66673 69105 41883 28167 -4801 -77069 -133736 -121399 -79284 -31643
$$ packed form
11089F8884l4570k8056l1133K5327J6355K2606j7073k8417k3982p241L8128J5684
11077A6512k0458k8927L150L2103N8435N057m4154n1997k7250j0115m5135J8155
11065i4624M9172N4114J9614l4743j7468J0037J8530l1704K503K2994j481Q158
11053E102L5018K736j7092k7252l3036j361K9743j2849J0787J3014n678P666j6598
11040i800n789O152m176K138q300lM4386j7384j9107J9277Q473J3633l3491j3139
11026a7130k0171j8129k437K5795k5305k7811M4077O2059J0105l8011l0739J8000
11014a9697j1831l3164o46L1059M0479l6314k7493L7921J0936O614N497m648j302
11001b589J0434M1653J7175K432k7222j3716l2968p2268n6667J2337M2115M7641
$$ plain form
10989 -31643 -19510 -14588 9240 23059 -3539 -50133 -59307 -58813 -50037 -28078 -4622 23894 -14804
10976 -14804 -23562 -4180 3300 -21276 -19728 4942 12343 -15991 -29424 -40754 -53299 -23436
10964 -23436 -38951 -8416 1925 6695 40173 14958 18283 30761 27944 12994 21578 10128
10952 10128 -40380 -32179 4180 36199 51011 72886 28427 28550 13336 43158 73161 57661
10940 57661 65537 24319 5094 34124 51367 26981 7463 -26577 -33042 -67299 -67955 -33817
10928 -33817 -18812 26505 58701 68954 20733 -42867 -37106 451 -2024 4714 13915 17163 28103
10915 28103 16070 -24242 -12677 15797 24307 16643 -30722 -47378 -2099 14001 17897 28937
10903 28937 9839 40575 6002 -16054 -1246 58555 94414 40235 -8290 15022 44392 50338
$$ packed form
10989c1643J2133M922K3828J3819k6598m6594r174M94Q776K1959K3456K8516l8698
10976a4804q758J9382P480k4576J548K4670P401k8334j3433j1330j2545K9863
10964b3436j5515L0535J0341M770L3478k5215L325J2478k817j4950Q584j1450
10952A0128n0508Q201L6359L2019J4812K1875m4459J23j5214K9822L0003j5500
10940E7661P876m1218j9225K9030J7243k4386j9518l4040o465l4257o56L4138
10928c3817J5005M5317L2196J0253m8221o3600N761L7557k475O738R201L248J0940
10915B8103j2033m0312J1565K8474Q510p664m7365j6656M5279J6100L896J1040
10903B8937j9098L0736l4573k2056J4808N9801L5859n4179m8525K3312K9370N946
$$ plain form
10891 50338 29049 -8773 24481 85604 92963 55286 11382 26117 87359 105912 69441 61670
10879 61670 50336 3572 -15225 -61338 -47459 -51528 -31886 -8811 6944 -1290 -44828 -90397
10867 -90397 -70309 -72291 -52196 -27745 -3863 -20027 -50932 -9944 10726 37958 65244 35723
10855 35723 -15454 -17641 -3064 -17298 -24804 22816 40735 35553 -23274 -76537 -31389 -35691
10843 -35691 -37361 -33574 -17765 18643 41922 18825 2692 27367 3680 -28536 -36754 -89969
10831 -89969 -84815 -72705 -56258 -35066 -12089 -28897 -14479 -49610 -60411 -28462 -13137 -30250
10819 -30250 -54101 -27534 -4885 -6710 -13881 3981 -8784 -37069 -51492 -54019 -11621 16411
10807 16411 19323 -12070 -2180 25549 47294 23468 25209 65079 74239 106164 97572 75490 69381
$$ packed form
10891E0338k1289l7822L3254O1123P359l7677m3904J4735O1242J8553l6471p771
10879F1670j1334m6764j8797m6113J3879m069J9642K3075J5755q234m3538m5569
10867i0397K0088j982K0095K4451K3882j6164l0905M0988K0670K7232K7286k9521
10855C5723n1177k187J4577j4234p506M7620J7919n182n8827n3263M5148m302
10843c5691j670L787J5809L6408K3279k3097j6133K4675k3687l2216q218n3215
10831h9969N154J2110J6447K1192K2977j6808J4418l5131j0801L1949J5325j7113
10819c0250k3851K6567K2649j825p171J7862j2765k8285j4423k527M2398K8032
10807A6411K912l1393R890K7729K1745k3826J741L9870R160L1925q592k2082o109
$$ plain form
10794 69381 67145 32450 -42957 -42175 -35696 3218 1580 -7377 15616 -14617 -22404 3039 -21506
10781 -21506 -30852 -11284 -7694 -950 -21596 3046 56897 39026 -30154 -78983 -72542 -43132
10769 -43132 -10694 -4910 861 -25306 -52675 -59682 -33248 -21565 -35345 -56791 -27278 -7188
10757 -7188 -23620 -3137 -29032 -49777 -42685 -66721 -62757 -76358 -68882 -26921 6772 1179 -8960
10744 -8960 -936 -28964 -50825 -42331 -2945 31026 32038 34088 -15032 -11012 17530 31250 45118
10731 45118 20475 -19612 -41659 -92789 -56706 -2195 -24753 -81752 -66648 -14086 -27662 -83389
10719 -83389 -88956 -85143 -49262 -32287 -48319 -74251 -45406 2099 6703 -396 -14271 7403
10707 7403 31299 10889 -20739 -1231 32303 16140 -18075 -41185 -47342 -19135 -2123 7920
$$ packed form
10794F9381k236l4695p5407P82O479L8914j638q957K2993l0233p787K5443k4545
10781b1506r346J9568L590O744k0646K4642N3851j7871o9180m8829O441K9410
10769d3132L2438N784N771k6167k7369p007K6434J1683j3780k1446K9513K0090
10757g188j6432K0483k5895k0745P092k4036L964j3601P476M1961L3693n593j0139
10744h960Q024k8028k1861Q494L9386L3971J012K050m9120M020K8542J3720J3868
10731D5118k4643m0087k2047n1130L6083N4511k2558n6999J5104N2562j3576n5727
10719h3389n567L813L5881J6975j6032k5932K8845M7505M604p099j3875K1674
10707G403K3896k0410l1628J9508L3534j6163l4215k3110o157K8207J7012J0043
$$ plain form
10695 7920 7463 17202 6776 9817 -7848 31013 23205 -2101 -16334 13874 21102 18975 41198
10682 41198 66007 88721 96229 93946 63334 -1499 -50808 -62368 -68447 -20863 15492 -3240
10670 -3240 14754 -8191 1390 -30767 -16170 11702 3047 16452 32937 42140 33899 73920 91515
10657 91515 78661 50236 59382 87505 70515 44361 18015 23300 4940 3234 -6117 -4542 -11694
10644 -11694 -15106 -28091 -71360 -78465 -71227 -25050 -23746 -76960 -79541 -58938 -36127 -6917 27833
10631 27833 47492 63457 59868 29950 5215 -461 8001 295 -18368 -19289 -27690 -40174 -61085
10618 -61085 -22110 -7546 -16360 6132 -21286 -49750 -32711 -4318 -28848 -37868 -19588 36809
10606 36809 73727 33253 -25979 -70694 -47889 -26612 -19758 35385 65970 23486 -2890 -1460
$$ packed form
10695G920m57R739j0426L041j7665L8861p808k5306j4233L0208P228k127K2223
10682D1198K4809K2714P508k283l0612o4833m9309j1560o079M7584L6355j8732
10670c240J7994k2945R581l2157J4597K7872q655J3405J6485R203q241M0021J7595
10657I1515j2854k8425R146K8123j6990k6154k6346N285j8360j706r351J575p152
10644a1694l412j2985m3269p105P238M6177J304n3214k581K0603K2811K9210L4750
10631B7833J9659J5965l589k9918k4735n676Q462p706j8663r21q401j2484k0911
10618f1085L8975J4564q814K2492k7418k8464J7039K8393k4530r020J8280N6397
10606C6809L6918m0474n9232m4715K2805K1277O854N5143L0585m2484k6376J430
$$ plain form
10594 -1460 -215 32400 27271 24607 40459 57985 54652 32705 31339 32418 26478 39435 60075
10581 60075 34038 -30061 -32655 -51656 -71459 -70930 -46963 -6050 10287 -13085 -13545 -54902 -40456
10568 -40456 -43792 -48901 -52643 -46843 -22141 -11963 16732 36210 51916 13528 7066 49006 25931
10555 25931 -2095 12470 -1260 -5277 11928 56019 73389 42281 -521 -18469 -20901 -49507
10543 -49507 -78528 -87123 -35700 -70828 -95077 -70183 -69350 -62116 -44465 -33124 -34292 -47062 -31951
10530 -31951 -44206 -57971 -20025 24877 9151 6225 -2485 -1863 -9316 -41195 -14425 -2837 -29765
10517 -29765 -25480 -25802 -43385 -35980 -44748 -25153 -11643 5431 2923 6466 6908 -17277 -24945 -68604
10503 -68604 -87443 -62126 -28584 -21599 -34461 -52143 -67125 -33729 -9034 -17079 -25836 -50234
$$ packed form
10594a460J245L2615n129k664J5852J7526l333k1947j366J079n940J2957K0640
10581F0075k6037o4099k594j9001j9803N29K3967M0913J6337k3372m60m1357J4446
10568d0456l336n109l742N800K4702J0178K8695J9478J5706l8388o462M1940k3075
10555B5931k8026J4565j3730m017J7205M4091J7370l1108m2802j7948k432k8606
10543d9507k9021q595N1423l5128k4249K4894Q33P234J7651J1341j168j2770J5111
10530c1951j2255j3765L7946M4902j5726k926q710O22p453l1879K6770J1588k6928
10517b9765M285l22j7583P405q768J9595J3510J7074k508L543M42k4185p668m3659
10503f8604j8839K5317L3542O985j2862j7682j4982L3396K4695q045q757k4398
$$ plain form
10491 -50234 -43770 11571 30772 38154 39340 35072 -11704 -16283 7653 -22753 11544 52255 64980
10478 64980 35781 -21883 -56058 -60370 -54005 -27345 -19608 -26801 -3294 -43307 -15421 18543
10466 18543 36360 2950 -29103 -81785 -40876 -58028 -45491 -61025 -72292 -43487 -12347 19807
10454 19807 16397 -15146 -12446 -43595 -40970 -80358 -77682 -56368 -63917 -61591 -42160 -83442 -62423
10441 -62423 -34223 -30805 -24635 5953 59996 88932 63507 39398 17601 -21924 -28106 -47859
10429 -47859 -46824 -8787 -2654 -9155 -16322 -26233 -7942 4908 -40257 -38984 9851 2102 -29523
10416 -29523 -6694 36345 11646 30486 21423 11285 33188 85113 75587 46307 40782 42861
10404 42861 52310 11899 830 -7273 -37261 -23808 20821 58549 44251 28163 19898 -45463
$$ packed form
10491e0234O464N5341J9201P382J186m268m6776m579K3936l0406L4297M0711J2725
10478F4980k9199n7664l4175m312O365K6660P737p193K3507m0013K7886L3964
10466A8543J7817l3410l2053n2682M0909j7152J2537j5534j1267K8805L1140L2154
10454A9807l410l1543K700l1149K625l9388K676K1314p549K326J9431m1282K1019
10441f2423K8200L418O170L0588N4043K8936k5425k4109k1797l9525o182j9753
10429d7859J035L8037O133o501p167r911J8291J2850m5165J273M8835p749l1625
10416b9523K2829M3039k4699J8840r063j0138K1903N1925r526k9280n525K079
10404D2861R449m0411j1069q103k9988J3453M4629L7728j4298j6088q265o5361
$$ plain form
10392 -45463 -58563 -9713 9082 23164 -29162 -53289 -46150 -16767 143 29379 28457 14344
10380 14344 200 -32029 -18814 -19765 -19374 -2394 12798 31514 -6230 -46450 -81874 -84051 -55801
10367 -55801 -29496 37498 67056 44753 19439 -16645 -5793 30721 19866 30528 26003 3907
10355 3907 -10017 4412 -6921 7763 7709 -6496 -7964 -10801 19693 30597 7886 7889 -16601 -40424
10341 -40424 -63988 -63353 -65134 -57362 -40349 -15759 -42312 -35711 -26580 -14666 -4399 -20718 -10731
10328 -10731 -39547 -57422 -64355 -31350 2389 -757 -488 -24058 -19133 -10776 7076 15822 -6757
10315 -6757 3645 12870 -40894 -58047 -41187 -53402 -17267 -9468 15682 59963 54442 26464
10303 26464 26896 39845 37424 -17536 -67110 -62259 -21099 30977 46277 49278 38072 14029 -30987
$$ packed form
10392d5463j3100M8850J8795J4082n2326k4127P139K9383J6910K9236r22j4113
10380A4344j4144l2229J3215r51L91J6980J5192J8716l7744m0220l5424k177K8250
10367e5801K6305O6994K9558k2303k5314l6084J0852L6514j0855J0662m525k2096
10355C907j3924J4429j1333J4684n4j4205j468k837L0494J0904k2711Lk4490k3823
10341d0424k3564O35j781P772J7013K4590k6553O601R131J1914J0267j6319R987
10328a0731k8816j7875o933L3005L3739l146K69k3570M925Q357J7852Q746k2579
10315f757J0402R225n3764j7153J6860j2215L6135P799K5150M4281n521k7978
10303B6464M32J2949k421n4960m9574M851M1160N2076J5300L001j1206k4043m5016
$$ plain form
10290 -30987 -42539 -20353 -15980 -36281 -55928 -20917 25275 39854 50185 64871 46894 23385
10278 23385 -26560 -41909 -33965 -21701 -15002 -14261 -15157 -16682 9331 18973 -7167 -21756 -21080 -38293
10264 -38293 -40575 -578 26780 -4344 -50740 -58261 -55524 -40249 1532 24818 22290 -7349
10252 -7349 -4268 2344 16460 -7780 -15369 -14713 -12551 -13685 -32480 -27383 -48617 -41827 9144 52435
10238 52435 48043 22988 -2331 1083 24609 49242 44279 69909 34062 -18301 9985 48879
10226 48879 84249 114933 94558 48931 -18324 -17659 2310 11669 2986 -23642 6161 24797
10214 24797 20991 -3996 -42341 -40535 -54970 -91332 -95984 -49139 -10300 17595 48952 87816
10202 87816 88794 69288 82754 70121 88717 68611 51795 30283 30738 54843 65810 70126 45398
$$ packed form
10290c0987j1552K2186M373k0301j9647L5011M6192J4579J0331J4686j7977k3509
10278B3385m9945j5349P944J2264O699P41q96j525K6013R642k6140j4589O76j7213
10264c8293k282L9997K7358l1124m6396p521K737J5275M1781K3286k528k9639
10252g349L081O612J4116k4240p589O56K162j134j8795N097k1234O790N0971M3291
10238E2435m392k5055k5319L414K3526K4633m963K5630l5847n2363K8286L8894
10226D8879L5370L0684k0375m5627o7255O65J9969R359q683k6628K9803J8636
10214B4797l806k4987l8345J806j4435l6362m652M6845L8839K7895L1357L8864
10202H7816R78j9506J3466j2633J8596k0106j6816k1512M55K4105J0967M316k4728
$$ plain form
10189 45398 9454 -10369 -23574 -10060 -7964 -38599 -40509 -25434 -21956 -166 -9089 -45623
10177 -45623 -37113 -60565 -66024 -51209 -65552 -63324 -69124 -41183 -9904 -2604 -1956 19827 34405
10164 34405 49256 48355 7213 -21687 -22101 13066 6305 -576 -12510 7200 68399 31191 -17234
10151 -17234 -35348 -35241 -38930 -34212 -12489 20690 25628 32697 9244 -27924 -6494 -30451 -34476
10138 -34476 8653 15255 26666 22721 27513 11478 -61937 -82488 -53852 -27401 -10325 22037
10126 22037 54585 62435 2390 -21957 -44788 -40587 -7040 -12934 -16737 -42684 -38569 -2992 -6512
10113 -6512 -35360 -42974 -16534 40901 54071 23511 -14041 -28115 -25053 -46940 -42805 -27874
10101 -27874 -27574 -10982 16437 16204 -6867 -19275 -34956 -10164 -25138 -10000 -6947 -47828 -41425
$$ packed form
10189D5398l5944j9823j3205J3514K096l0635j910J5075L478K1790q923l6534
10177d5623Q510k3452n459J4815j4343K228n800K7941L1279P300O48K1783J4578
10164C4405J4851r01m1142k8900m14L5167o761o881j1934J9710O1199l7208m8425
10151a7234j8114J07l689M718K1723L3179M938P069k3453l7168K1430k3957m025
10138c4476M3129O602J1411l945M792j6035p3415k0551K8636K6451J7076L2362
10126B2037L2548P850o0045k4347k2831M201L3547n894l803k5947M115L5577l520
10113f512k8848p614K6440N7435J3170l0560l7552j4074L062k1887M135J4931
10101b7874L00J6592K7419k33k3071j2408j5681K4792j4974J5138L053m0881O403
$$ plain form
10088 -41425 -5149 -13935 10109 8137 -17384 -10980 -10193 -40255 -27146 -44370 -35540 -11289 -13550
10075 -13550 -13955 -41156 -15099 -2929 -36459 -20648 -8186 -28622 -29364 -54257 -50797 -35703 -47368
10062 -47368 -6084 10002 23447 -22824 -84958 -51855 -25804 2986 -3762 2800 4547 994
10050 994 -1091 2309 -31823 -15651 15241 16818 -27711 -56355 -61805 -26678 -75904 -75679 -21882
10037 -21882 1185 10793 -4046 4912 18607 926 -7177 -22849 -46720 -32619 -12778 10995
10025 10995 701 25340 32780 52055 43451 3265 18226 4780 -34808 -33520 -19508 11114
10013 11114 4210 21935 8358 27517 52838 32713 67943 46928 -20399 -35026 -16644 11444
10001 11444 52393 58383 -941 -39658 -29540 -32085 -33714 -24640 15659 32833 62847 34082
$$ packed form
10088d1425L6276q786K4044j972k5521O404P87l0062J3109j7224Q830K4251k261
10075a3550m05k7201K6057J2170l3530J5811J2462k0436p42k4893L460J5094j1665
10062d7368M1284J6086J3445m6271o2134L3103K6051K8790o748O562J747l553
10050I94k085L400l4132J6172L0892J577m4529k8644n450L5127m9226K25N3797
10037b1882K3067R608j4839Q958J3695j7681q103j5672k3871J4101J9841K3773
10025A0995j0294K4639P440J9275q604m0186J4961j3446l9588J288J4012L0622
10013A1114o904J7725j3577J9159K5321k0125L5230k1015o7327j4627J8382K8088
10001A1444M0949N990n9324l8717J0118k545j629R074M0299J7174L0014k8765
$$ plain form
9989 34082 10738 10749 12554 -1304 30421 55124 50426 17628 -28932 -35572 -62154 -72640 -67778
9976 -67778 -576 25304 9041 -27494 -26512 30191 11338 -66 54431 67282 23434 35289
9964 35289 88288 64068 11023 25811 9458 -7508 -20327 -8653 -37963 -52709 -57664 -61740
9952 -61740 -64825 -57163 -23861 18416 -14626 -47721 -70268 -62547 -51873 3728 13872 12168 -22984
9939 -22984 -11006 32386 28695 2408 4008 24910 -8757 -28239 -7550 10570 -13932 23105
9927 23105 41234 19269 -17526 1379 28071 9256 -33080 -31548 2094 27357 386 -40265
9915 -40265 -32512 -21947 4839 39947 31688 30305 32098 14602 6162 47795 92990 76074 62646
9902 62646 72259 55747 55659 59170 84151 95888 63525 47285 53365 20607 4947 29843 2602
$$ packed form
9989C4082k3344J1J805j3858L1725K4703m698l2798m6560o640k6582j0486M862
9976f7778O7202K5880j6263l6535R82N6703j8853j1404N4497J2851m3848J1855
9964C5289N2999k4220n3045J4788j6353j6966j2819J1674k9310j4746m955m076
9952f1740l085P662L3302M2277l3042l3095k2547P721J0674N5601J0144j704l5152
9939b2984J1978M3392l691k6287J600K0902l3667j9482K0689J8120k4502L7037
9927B3105J8129k1965l6795J8905K6692j8815m2336J532L3642K5263k6971m0651
9915d0265P753J0565K6786L5108q259j383J793j7496q440M1633M5195j6916j3428
9902F2646R613j6512q8L511K4981J1737l2363j6240O080l2758j5660K4896k7241
$$ plain form
9889 2602 -31023 -12348 43520 48924 54380 66658 10800 -5707 -16844 -18568 -24252 4597 47811
9876 47811 49140 49869 63894 32688 35704 18798 1776 41213 51046 -82 26619 54337 16199
9863 16199 45784 33739 8414 -24612 -8465 -8298 -37364 -42750 -13095 19790 24503 19916 36236
9850 36236 71027 69120 48679 56105 54735 51540 55684 40461 -6353 10634 -15156 -37975 -33326
9837 -33326 -13007 13155 -7588 -27494 86 64214 41891 23676 9949 -40976 -20184 -13514
9825 -13514 -24976 -39703 -19960 -2127 -20582 -44725 -57398 -5627 3677 -43952 -26049 -24864
9813 -24864 -27003 -83573 -104828 -90255 -67418 -43797 -12339 -25169 -70370 -71983 -29283 -19640
9801 -19640 -25984 8438 48421 49962 59599 98022 73340 46706 23236 48869 53634 94846 94338
$$ packed form
9889B602l3625J8675N5868N404N456J2278n5858j6507j1137j724n684K8849M3214
9876D7811J329P29J4025l1206L016j6906j7022L9437R833n1128K6701K7718l8138
9863A6199K9585j2045k5325l3026J6147J67k9066n386K9655L2885M713m587J6320
9850C6236L4791j907k0441P426j370l195M144j5223m6814J6987k5790k2819M649
9837c3326K0319K6162k0743j9906K7580O4128k2323j8215j3727n0925K0792O670
9825a3514j1462j4727J9743J7833j8455k4143j2673N1771R304m7629J7903J185
9813b4864k139n6570k1255J4573K2837K3621L1458j2830m5201j613M2700R643
9801a9640o344L4422L9983J541R637L8423k4682k6634k3470K5633M765M1212n08
$$ plain form
9788 94338 70070 60038 60638 70495 30374 -6158 -4771 -26630 -35630 -38333 -75027 -102924 -117528
9775 -117528 -64300 -39857 -14954 -17841 -26628 -39783 -32167 -7307 -157 -20935 -40202 -9356
9763 -9356 12049 12408 14039 26859 24353 27689 66049 71391 37672 -1652 -30545 -41408 -42980
9750 -42980 -31525 -11081 -3012 -14167 -1588 6984 30349 42869 56400 10436 -27509 -19117
9738 -19117 -22157 -6979 12519 22158 -8248 -33468 -66664 -52159 -66764 -64971 -49272 -35891
9726 -35891 -48467 -46437 -46512 -40461 7569 -38404 -43032 -5037 -46484 -49467 -18196 18749 26696
9713 26696 -16559 -19973 -17539 -61669 -87824 -98070 -70950 -35689 -36354 -14052 -11514 7919 25757
9700 25757 7555 -57058 -36129 -33696 -29262 -8993 -35030 -72232 -47175 -11801 -606 -25956
$$ packed form
9788I4338k4268j0032O00R857m0121l6532J387k1859r000k703l6694k7897j4604
9775a17528N3228K4443K4903k887q787j3155P616K4860P150k0778j9267L0846
9763i356K1405L59J631J2820k506L336L8360N342l3719l9324k8893j0863j572
9750d2980J1455K0444Q069j1155J2579Q572K3365J2520J3531m5964l7945Q392
9738a9117l040J5178J9498R639l0406k5220l3196J4505j4605J793J5699J3381
9726c5891j2576K030p5O051M8030m5973m628L7995m1447k983L1271L6945P947
9713B6696m3255l414K434m4130k6155j0246K7120L5261o65K2302K538J9433J7838
9700B5757j8202o4613K0929K433M434K0269k6037l7202K5057L5374J1195k5350
$$ plain form
9688 -25956 -25999 -22688 -39922 -32338 -3464 -539 -37997 -61313 -47001 -43394 -47627 -30824 24933
9675 24933 14946 28178 35835 22004 -17310 -26193 -40802 -49098 -56243 -56503 -26680 -7565 -23930
9662 -23930 -29227 -7559 -14425 -31580 -32014 -17966 43078 64391 82900 45934 11243 61194 43312
9649 43312 8898 -4965 13300 19117 11180 4846 -2827 -15574 -41507 -32229 -25629 -53070 -80394
9636 -80394 -105331 -110786 -82965 -24460 -14789 12308 18158 -17306 -54323 -47692 -68168 -55358 -22914
9623 -22914 3544 -1349 1319 29590 13233 -5103 -19140 -25845 -30804 5957 -55378 -91714 -79169
9610 -79169 -21182 -25867 -3570 2535 7192 523 -38441 -90848 -101140 -50942 -14980 -28887 -3788
9597 -3788 14043 6333 -46263 -59520 -35708 -29221 -27869 -44177 -57024 -22590 -23408 -296 34967
$$ packed form
9688b5956m3L311j7234P584K8874K925l7458k3316J4312L607m233J6803N5757
9675B4933r987J3232P657j3831l9314q883j4609q296p145k60K9823J9115j6365
9662b3930n297K1668o866j7155m34J4048O1044K1313J8509l6966l4691M9951j7882
9649D3312l4414j3863J8265N817p937o334p673j2747k5933R278O600k7441k7324
9636h0394k4937n455K7821N8505R671K7097N850l5464l7017O631k0476J2810L2444
9623b2914K6458m893K668K8271j6357j8336j4037o705m959L6761o1335l6336J2545
9610g9169N7987m685K2297O105M657o669l8964n2407j0292N0198L5962j3907K5099
9597c788J7831p710n2596j3257K3812O487J352j6308j2847L4434q18K3112L5263
$$ plain form
9584 34967 57629 3883 -50366 -74560 -80053 -85233 -100347 -55617 -22649 -9311 34656 68474
9572 68474 43793 51386 59602 35847 744 -27588 -47402 -42866 7916 17531 335 -19036 -19222
9559 -19222 -23384 -30525 -11857 -8268 -2762 -34803 -29388 -12061 19166 48457 69341 62873 41240
9546 41240 4798 -6389 -44872 -78504 -56554 -47995 -38008 -61062 -76392 -72548 -105652 -80703
9534 -80703 -35748 -40593 -107103 -174568 -152636 -103251 -43001 9687 4277 -30921 -52389 -68597
9522 -68597 -57917 -27007 -7208 -31584 -16661 19084 -17355 -17083 -28441 -22625 6609 12877 23909
9509 23909 24200 5751 -5787 -27725 -34682 -58750 -82596 -83431 -45821 -20809 -26006 -10805 -21365
9496 -21365 -5891 -29423 -51018 -77523 -68008 -30320 -65133 -81198 -42256 -5089 7048 -31934
$$ packed form
9584C4967K2662n3746n4249k4194n493n180j5114M4730L2968J3338M3967L3818
9572F8474k4681P593Q216k3755l5103k8332j9814M536N0782R615j7196j9371j86
9559a9222m162p141J8668L589N506l2041N415J7327L1227K9291K0884o468k1633
9546D1240l6442j1187l8483l3632K1950Q559R987k3054j5330L844l3104K4949
9534h0703M4955m845o6510o7465K1932M9385O0250N2688n410l5198k1468j6208
9522f8597J0680L0910J9799k4376J4923L5745l6439K72j1358N816K9234O268J1032
9509B3909K91j8449j1538k1938o957k4068k3846q35L7610K5012n197J5201j0560
9496b1365J5474k3532k1595k6505R515L7688l4813j6065L8942L7167J2137l8982
$$ plain form
9484 -31934 -1360 12038 38827 35113 32233 -628 -20517 16688 32210 14610 12970 5751 4895
9471 4895 25435 36063 59783 72631 53730 73112 51733 29606 12454 27588 15964 -9851
9459 -9851 -38085 -40115 -60799 -63393 -55938 -37682 -46001 -74618 -89471 -40575 -2203 -18539 -44205
9446 -44205 -65069 -88884 -123246 -110473 -56935 13090 30597 14480 -9435 11221 34929 26332
9434 26332 14540 -40 12484 25633 3935 -7389 -16217 -41362 -42058 272 9768 4435 6411
9421 6411 22895 89424 102868 70679 69256 35213 18818 48134 57346 26674 11408 2208 1523
9408 1523 15147 27733 22988 12023 13205 58465 51341 30196 22499 4275 21857 103659 80084
9395 80084 29888 24457 44205 35962 27503 14715 74178 97497 47113 5154 -22459 -37959
$$ packed form
9484c1934L0574J3398K6789l714k880l2861j9889L7205J5522j7600j640p219q56
9471D895K0540J0628K3720J2848j8901J9382k1379k2127j7152J5134j1624k5815
9459i851k8234k030k0684k594P455J8256q319k8617j4853M8896L8372j6336k5666
9446d4205k0864k3815l4362J2773N3538P0025J7507j6117k3915K0656K3708q597
9434B6332j1792j4580J2524J3149k1698j1324q828k5145o96M2330R496n333J976
9421F411J6484O6529J3444l2189j423l4043j6395K9316R212l0672j5266r200o85
9408A523J3624J2586m745j0965J182M5260p124k1145p697j8224J7582Q1802k3575
9395H0084n0196n431J9748q243q459j2788N9463K3319n0384m1959k7613j5500
$$ plain form
9383 -37959 -34270 -1812 60509 84331 29297 -505 -20159 -59380 -42515 -29210 -16282 -40936
9371 -40936 -82828 -82468 -94136 -74753 -40214 -43114 -80134 -100622 -64868 -50722 -13207 -6105 -10186
9358 -10186 -11142 -33855 -70368 -41521 21566 29117 39527 36827 14166 34037 33898 85415 103017
9345 103017 52909 -1478 -36728 -7398 -9729 -17165 -47286 -69248 -65504 -41457 -25197 -25030 -1730
9332 -1730 34479 6583 -49581 -65556 -21966 -41977 6743 53995 58339 36157 26446 -13906
9320 -13906 21182 -6202 -8511 9890 29932 5502 32843 69430 36713 38869 73001 36437
9308 36437 -4444 26617 31983 -3436 -25347 -41624 -7883 27137 53936 45433 9885 -10113
9296 -10113 12636 18168 47702 45158 26819 23696 28216 67136 103209 104668 78939 68272 74128
$$ packed form
9383c7959L689L2458O2321K3822n5034k9802j9654l9221J6865J3305J2928k4654
9371d0936m1892L60j1668J9383L4539k900l7020k0488L5754J4146L7515P102m081
9358a0186r56k2713l6513K8847O3087P551J0410k700k2661J9871j39N1517J7602
9345A03017n0108n4387l5250K9330k331p436l0121k1962L744K4047J6260J67K3300
9332a730L6209k7896n6164j5975M3590k0011M8720M7252M344k2182r711m0352
9320a3906L5088k7384k309J8401K0042k4430K7341L6587l2717K156L4132l6564
9308C6437m0881L1061N366l5419k1911j6277L3741L5020K6799q503l5548j9998
9296a0113K2749N532K9534k544j8339l123M520L8920L6073J459k5729j0667N856
$$ plain form
9283 74128 28040 29993 43739 75014 117556 104477 67992 26728 42084 65015 10616 -36626
9271 -36626 39097 72779 106536 87489 76528 82516 103465 141793 115588 103276 103053 79381
9259 79381 85520 49694 44347 79464 143981 145161 105569 47488 54953 50594 61748 47862 29438
9246 29438 54571 111688 128044 119553 81073 76955 47700 57365 55473 72323 93790 132120 156508
9233 156508 150951 151564 154088 123132 125501 75507 48601 123880 145342 139728 187537 212997 225864
9220 225864 205568 248721 296128 260402 301676 371143 422651 453746 475749 567914 692563
9209 692563 783955 961306 1144139 1387542 1654393 1923536 2256827 2676644 3113477 3513184
9199 3513184 3992904 4818162 6148738 7990190 9974763 11332953 11380808 10083447 8320868
$$ packed form
9283G4128m6088J953J3746L1275M2542j3079l6485m1264J5356K2931n4399m7242
9271c6626P5723L3682L3757j9047j0961N988K0949L8328k6205j2312k23k3672
9259G9381O139l5826n347L5117O4517J180l9592n8081P465m359J1154j3886j8424
9246B9438K5133N7117J6356q491l8480m118k9255R665j892J6850K1467L8330K4388
9233A56508n557O13K524l0956K369m9994k6906P5279K1462n614M7809K5460J2867
9220B25864k0296M3153M7407l5726M1274O9467N1508L1095K2003R2165J24649
9209F92563R1392J77351J82833K43403K66851K69143L33291M19817M36833L99707
9199C513184M79720Q25258J330576J841452J984573J358190M7855j297361j762579
$$ plain form
9190 8320868 6791323 5634671 4719733 4062360 3567089 3216544 2840971 2550065 2305565
9181 2305565 2059732 1885908 1728289 1597865 1455731 1347992 1311951 1248721 1177253 1117646
9171 1117646 1068179 1023919 955748 890553 890090 877329 830327 802445 776677 712705 648536 668529
9159 668529 719308 685486 643758 601331 575271 539449 502630 476927 498836 518625 502858 445195
9147 445195 410267 412050 373462 371519 396860 356386 367106 415667 417105 373445 349293 336344
9135 336344 318429 321238 290117 306149 308776 270302 201251 180438 162309 153644 180585 194760
9123 194760 192507 192151 227865 232701 223497 247478 227242 212180 199747 192444 167750 143459 156460
9110 156460 189339 173917 138659 164805 186396 179006 168379 157937 146967 145595 128693 84458
$$ packed form
9190H320868j529545j156652r14938o57373m95271l50545l75573k90906k44500
9181B305565k45833j73824j57619j30424j42134j07739l6041o3230p1468n9607
9171A117646m9467m4260o8171o5195m63j2761m7002k7882k5768o3972o4169J9993
9159F68529N0779l3822m1728m2427k6060l5822l6819k5703K1909J9789j5767n7663
9147D45195l4928J783l8588j943K5341m0474J0720M8561J438m3660k4152j2949
9135C36344j7915K809l1121J6032K627l8474o9051k0813j8129q665K6941J4175
9123A94760k253l56L5714M836r204K3981k0236j5062j2433p303k4694k4291J3001
9110A56460L2879j5422l5258K6146K1591p390j0627j0442j0970j372j6902m4235
$$ plain form
9098 84458 81742 87957 111653 117787 120471 122835 106068 95228 93348 114680 113434 96506 88687
9085 88687 106727 114338 149354 126394 70818 64750 81775 84944 62589 116877 158994 142768
9073 142768 154320 182510 179086 150260 172964 123345 90866 55586 32045 23825 20056 51570
9061 51570 88703 81491 75629 47803 54914 60467 31039 13355 34114 37170 28712 57882 44466
9048 44466 -3133 -21244 -9760 24857 32242 15365 7146 3961 14179 55072 61241 125659 122164
9035 122164 70310 60480 41387 3489 33422 74719 138835 213036 254053 279876 271550 284921
9023 284921 266944 218634 199455 156668 109631 91526 59162 54817 19458 -55447 -38360 18164
9011 18164 101421 92757 31112 8718 34488 47898 65335 89559 82738 50274 52084 69352
$$ packed form
9098H4458k716O215K3696O134K684K364j6767j0840j880K1332j246j6928p819
9085H8687J8040P611L5016k2960n5576o068J7025L169k2355N4288M2117j6226
9073A42768J1552K8190l424k8826K2704m9619l2479l5280k3541q220l769L1514
9061E1570L7133p212n862k7826P111N553k9428j7684K0759L056q458K9170j3416
9048D4466m7599j8111J1484L4617P385j6877q219l185J0218M0893O169O4418l495
9035A22164n1854r830j9093l7898K9933M1297O4116P4201M1017K5823q326J3371
9023B84921j7977m8310j9179m2787m7037j8105l2364m345l5359p4905J7087N6524
9011A8164Q3257q664o1645k2394K5770J3410J7437K4224o821l2464J810J7268
$$ plain form
8999 69352 62564 38811 48819 79923 90690 54460 4734 -15920 -8646 27392 66564 83339
8987 83339 115921 141138 171790 244101 317302 387335 400431 377344 377897 324778 241223 245814
8975 245814 234273 222315 215256 197746 145015 108839 85099 47929 60657 47470 45160 14100
8963 14100 34427 76785 113982 89326 100108 89904 34277 14445 42434 52406 39447 18309
8951 18309 7079 33698 74427 110339 123402 92309 61959 52922 32668 100830 161448 174091
8939 174091 173008 204095 230403 224911 195481 148977 163000 173625 107022 68912 109413 97328
8927 97328 73777 47167 27710 14918 32280 15541 53777 74174 45718 51314 17879 -43108
8915 -43108 -57957 -48442 -36329 -6521 68708 106054 94116 63505 24185 4585 16699 -16582
$$ packed form
8999F9352o788k3753J0008L1104J0767l6230m9726k0654P274L6038L9172J6775
8987H3339L2582K5217L0652P2311P3201P0033J3096k3087N53n3119q3555M591
8975B45814j1541j1958p059j7510n2731l6176k3740l7170J2728j3187k310l1060
8963A4100K0327M2358L7197k4656J0782j0204n5627j9832K7989R972j2959k1138
8951A8309j1230K6619M0729L5912J3063l1093l0350r037k0254O8162O0618J2643
8939A74091j083L1087K6308n492k9430m6504J4023J0625o6603l8110M0501j2085
8927I7328k3551k6610j9457j2792J7362j6739L8236K0397k8456N596l3435o0987
8915d3108j4849R515J2113K9808P5229L7346j1938l0611l9320j9600J2114l3281
$$ plain form
8903 -16582 -3689 39947 -297 -1507 -8852 -7737 -5496 3490 -50467 -41224 6082 22675 30389
8890 30389 16683 25979 22895 3914 -34939 -28399 1200 -13978 -49952 4302 -5964 -30942
8878 -30942 22707 46162 10559 46996 36983 30576 11423 -507 435 14474 29354 -3856
8866 -3856 -45350 -43643 -21170 42188 69174 54173 8854 30382 60491 30890 22354 36426
8854 36426 63576 89664 71604 46939 41899 30599 31304 28076 44068 10756 20837 42188 35391
8841 35391 72600 60629 -22831 -71696 -74900 -39851 -66027 -90042 -93107 -81968 -31505 31228
8829 31228 52662 83049 94669 83475 66129 30945 -12652 11403 26774 -2254 -6055 -32473
8817 -32473 -33214 -11949 -40131 -52834 -43871 -6843 -30875 -31694 -3014 -13897 -16608 22829 43203
$$ packed form
8903a6582J2893M3636m0244j210p345J115K241Q986n3957R243M7306J6593P714
8890C0389j3706R296l084j8981l8853O540K9599j5178l5974N4254j0266k4978
8878c0942N3649K3455l5603L6437j0013o407j9153j1930R42J4039J4880l3210
8866c856m1494J707K2473O3358K6986j5001m5319K1528L0109k9601q536J4072
8854C6426K7150K6088j8060k4665n040j1300P05l228J5992l3312J0081K1351o797
8841C5391L7209j1971q3460m8865l204L5049k6176k4015l065J1139N0463O2733
8829C1228K1434L0387J1620j1194j7346l5184m3597K4055J5371k9028l801k6418
8817c2473p41K1265k8182j2703Q963L7028k4032q19K8680j0883k711L9437K0374
$$ plain form
8804 43203 75191 63609 39512 44961 53152 60454 44755 -13823 -84591 -102724 -86608 -25894
8792 -25894 20365 2722 -37407 -54142 -55384 29460 10007 -19087 -15344 34420 61293 28009
8780 28009 17734 21864 9236 -12355 -23376 -52577 -55567 -20766 64865 72204 52448 56461 55611
8767 55611 66078 48856 31382 35779 43639 -15800 -27607 -11987 -15324 -43704 -58387 -19246
8755 -19246 -26735 -35607 -31150 -12597 -28770 -39183 -68088 -67755 -41768 -7587 -16099 23346 85957
8742 85957 73789 30279 -20843 -37351 -52040 -67809 -74030 -53762 -23499 -24232 -20211 -17008 -28618
8729 -28618 -5662 50343 82662 60288 33772 35579 10324 -46143 -40594 16791 17519 28424 15129
8716 15129 5078 48016 24452 12285 -22987 -21149 -10627 -21223 -2608 16546 8335 8547 39305
$$ packed form
8804D3203L1988j1582k4097N449Q191P302j5699n8578p0768j8133J6116O0714
8792b5894M6259j7643m0129j6735j242Q4844j9453k9094L743M9764K6873l3284
8780B8009j0275M130j2628k1591j1021k9201k990L4801Q5631P339j9756M013q50
8767E5611J0467j7222j7474M397P860n9439j1807J5620l337k8380j4683L9141
8755a9246p489q872M457J8553j6173j0413k8905L33K5987L4181q512L9445O2611
8742H5957j2168m3510n1122j6508j4689j5769o221K0268L0263p33M021L203j1610
8729b8618K2956N6005L2319k2374k6516J807k5255n6467N549N7385P28J0905j3295
8716A5129j0051M2938k3564j2167l5272J838J0522j0596J8615J9154q211K12L0758
$$ plain form
8703 39305 35999 38730 28606 7299 -9524 13356 48164 82719 66756 54171 24820 -21796
8691 -21796 -6038 10347 -14207 17794 27223 71574 93954 35174 -13290 -43861 -35841 -7499
8679 -7499 9705 30336 7722 -8770 -6884 -16023 -12661 26717 31238 43506 46181 39889 56483
8666 56483 77925 65854 21848 17790 67861 104318 131915 130055 45887 -24238 -10609 37132
8654 37132 97708 94931 84179 76884 48669 82844 80802 59202 59310 100768 116663 111497 40207
8641 40207 -3172 -36733 19 27831 71563 50780 18804 -2608 -21231 5596 2692 19152
8629 19152 -14609 -73734 -62728 -32687 -21890 -19908 11409 46284 75395 37380 14396 45746
8617 45746 48490 61863 41366 23368 51394 65038 47835 72772 59070 34624 -11858 -35207
$$ packed form
8703C9305l306K731j0124k1307j6823K2880L4808L4555j5963j2585k9351m6616
8691b1796J5758J6385k4554L2001R429M4351K2380n8780m8464l0571Q020K8342
8679g499J7204K0631k2614j6492J886r139L362L9378M521J2268K675o292J6594
8666E6483K1442j2071m4006m058N0071L6457K7597j860q4168p0125J3629M7741
8654C7132O0576k777j0752p295k8215L4175k042k1600J08M1458J5895n166p1290
8641D0207m3379l3561L6752K7812M3732k0783l1976k1412j8623K6827k904J6460
8629A9152l3761n9125J1006L0041J0797J982L1317L4875K9111l8015k2984L1350
8617D5746K744J3373k0497j7998K8026J3644j7203K4937j3702k4446m6482k3349
$$ plain form
8605 -35207 2369 24825 48081 114369 123800 111486 119334 97110 55917 87352 101047 115942
8593 115942 141433 173080 215068 253148 256230 245777 259576 201998 176632 140410 153426 164486
8581 164486 152989 124351 92568 63291 81319 108974 92890 72516 67310 74331 72893 40226
8569 40226 14310 18849 17130 33955 59829 94292 98460 29366 20965 16157 20503 54228 66129
8556 66129 63452 52579 27600 45602 16036 21883 51809 52361 45573 39497 40059 40125 41601 73017
8542 73017 60159 48253 20291 -5249 36173 49727 12167 23331 4492 26183 70346 65889
8530 65889 18328 23901 40396 27009 -12327 -419 24439 -20604 -42217 -58318 -8794 53938
8518 53938 44785 20116 -10511 -29829 -18266 -11352 -42032 -1526 70702 87874 23310 2945
$$ packed form
8605c5207L7576K2456K3256O6288R431j2314P848k2224m1193L1435J3695J4895
8593A15942K5491L1647M1988L8080L082j0453J3799n7578k5366l6222J3016J1060
8581A64486j1497k8638l1783k9277J8028K7655j6084k0374n206P021j438l2667
8569D0226k5916M539j719J6825K5874L4463M168o9094q401m808M346L3725J1901
8556F6129k677j0873k4979J8002k9566N847K9926N52o788o076N62O6J476L1416
8542G3017j2858j1906k7962k5540M1422J3554l7560J1164j8839K1691M4163m457
8530F5889m7561N573J6495j3387l9336J1908K4858m5043k1613j6101M9524O2732
8518E3938r153k4669l0627j9318J1563O914l0680M0506P2228J7172o4564k0365
$$ plain form
8506 2945 -14734 18704 41571 54483 64758 42113 -13983 -54592 -37595 25875 55864 35004
8494 35004 -8299 282 50594 94621 97175 73743 11743 -37063 -363 27918 39037 39876 45867
8481 45867 44280 40951 18690 41159 46147 35566 16726 21785 2568 -7204 -2617 3189 36624
8468 36624 43149 12891 -1865 -4835 -43396 -50819 -55682 -48713 -57985 -58565 -31839 20253 38172
8455 38172 6141 -1906 16266 18186 6998 -9398 28934 29902 -9410 7539 32124 32344 14366
8442 14366 36797 58302 21557 -42829 -60210 -10790 4818 -3943 -19623 8642 22941 11947
8430 11947 32308 16684 49532 72473 65843 77339 78648 80377 94835 69186 30818 -7760
8418 -7760 -14369 -393 12575 9501 -12433 -70753 -35229 -16963 -768 11701 -18206 -9707 -15559
$$ packed form
8506B945j7679L3438K2867J2912J0275k2645n6096m0609J6997O3470K9989k0860
8494C5004m3303Q581N0312M4027K554k3432o2000m8806L6700K8281J1119Q39N991
8481D5867j587l329k2261K2469M988j0581j8840N059j9217r772M587N806L3435
8468C6624O525l0258j4756k970l8561p423m863O969r272n80K6726N2092J7919
8455C8172l2031q047J8172J920j1188j6396L8332R68l9312J6949K4585K20j7978
8442A4366K2431K1505l6745o4386j7381M9420J5608q761j5680K8265J4299j0994
8430A1947K0361j5624L2848K2941o630J1496J309J729J4458k5649l8368l8578
8418g760o609J3976J2968l074k1934n8320L5524J8266J6195J2469k9907Q499n852
$$ plain form
8405 -15559 54496 46296 1639 -14939 -3593 -8800 17388 41904 3829 -27344 -7068 11850
8393 11850 49427 51060 74873 49786 12663 -7123 -30594 6431 36402 59088 61620 30042
8381 30042 34435 -18436 -61323 -63674 -73477 -64479 -39140 -44239 -88301 -85798 -18305 1947 16259
8368 16259 40419 56044 36793 -5437 -7742 4231 724 2717 -14845 -22885 -24363 10343 28410
8355 28410 13815 -18093 -13249 -9163 11253 11314 -4936 11645 16952 9009 -4304 42415 55292
8342 55292 25561 25635 23423 37786 53441 64201 11680 39942 43320 46054 25149 -14835 13444
8329 13444 35576 25993 -4793 -12043 -31234 -16623 -22194 29839 44510 -292 -1966 13028 -40075
8316 -40075 -29340 33435 43984 45171 36164 14891 -57440 -56328 -7294 -4186 -15088 -5548 -9397
$$ packed form
8405a5559P0055q200m4657j6578J1346n207K6188K4516l8075l1173K0276J8918
8393A1850L7577J633K3813k5087l7123j9786k3471L7025K9971K2686K532l1578
8381C0042M393n2871m2887k351r803Q998K5339n099m4062K503O7493K0252J4312
8368A6259K4160J5625j9251m2230k305J1973l507J993j7562q040j478L4706J8067
8355B8410j4595l1908M844M086K0416O1j6250J6581N307p943j3313M6719J2877
8342E5292k9731P4k212J4363J5655J0760n2521K8262L378K734k0905l9984K8279
8329A3444K2132r583l0786p250j9191J4611n571N2033J4671m4802j674J4994n3103
8316d0075J0735O2775J0549J187r007k1273p2331J112M9034L108j0902R540l849
$$ plain form
8303 -9397 -35807 -21144 5913 22431 54700 37766 13979 10139 -3704 17003 12533 22135 1997
8290 1997 -31103 -47752 -35681 -42265 3764 44954 59067 47829 2856 -37896 -9478 40026
8278 40026 74936 85268 54140 30085 81199 76630 19782 5227 -28032 5253 14286 39703
8266 39703 38636 29885 48311 62272 58892 36600 -7166 1572 27368 37002 7431 24286 41229
8253 41229 45017 33854 5663 33211 49545 22232 -30067 -59873 -63533 -68069 -63500 -52132 -54994
8240 -54994 -43216 42772 67014 33041 29737 22625 11529 34078 63367 115794 93066 70997
8228 70997 58672 22235 -2166 -113 26511 48535 55871 22051 -53046 -45843 309 40337
8216 40337 53749 20535 2314 31956 82627 63202 46167 69563 91012 35280 4723 -729
$$ packed form
8303i397k6410J4663K7057J6518L2269j6934k3787l840j3843K0707m470R602k0138
8290A997l3100j6649J2071o584M6029M1190J4113j1238m4973m0752K8418M9504
8278D0026L4910J0332l1128k4055N1114m569n6848j4555l3259L3285R033K5417
8266C9703j067q751J8426J3961l380k2292m3766Q738K5796R634k9571J6855J6943
8253D1229L788j1163k8191K7548J6334k7313n2299k9806l660m536M569J1368k862
8240e4994J1778Q5988K4242l3973l304p112j1096K2549K9289N2427k2728k2069
8228G0997j2325l6437k4401K053K6624K2024P336l3820p5097P203M6152M0028
8216D0337J3412l3214j8221K9642N0671j9425j7035K3396K1449n5732l0557n452
$$ plain form
8204 -729 2434 980 -802 12661 1825 -11660 -14222 -49801 -28056 2826 12319 -7233 1274
8191 1274 25023 39133 45054 89025 84920 41636 23157 21810 12409 38507 44238 35912 853
8178 853 8004 6582 1693 -51928 -38309 -51658 -66384 -67007 -11588 41977 59182 93711 66376
8165 66376 23548 6650 -19172 -19757 -19247 -39253 -72799 -78340 -60274 -67366 -79568 -61372 -47386
8152 -47386 -42715 -29203 -14382 -1915 2209 -874 -24411 -16974 40122 12372 -47154 -42920 3629
8139 3629 25730 19796 6048 32918 24902 44526 54578 22478 -10096 -290 33088 25213 41264
8126 41264 48335 31363 -39996 -29752 -24883 -27647 -48965 -49638 -10960 21635 1304 -23849 27811
8113 27811 37379 -14620 -23033 -25580 -16814 -7817 -11283 5860 -4321 -40989 -81927 -62777 -10888
$$ packed form
8204g29L163j454j782J3463j0836j3485k562l5579K1745L0882R493j9552Q507
8191A274K3749J4110N921M3971m105m3284j8479j347r401K6098N731q326l5059
8178H53P151j422m889n3621J3619j3349j4726o23N5419N3565J7205L4529k7335
8165F6376m2828j6898k5822n85N10k0006l3546n541J8066p092j2202J8196J3986
8152d7386M671J3512J4821J2467M124l083k3537P437N7096k7750n9526M234M6549
8139C629K2101n934j3748K6870q016J9624J0052l2100l2574R806L3378p875J6051
8126D1264P071j6972p1359J0244M869k764k1318o73L8678L2595k0331k5153N1660
8113B7811R568n1999q413k547Q766Q997l466J7143j0181l6668m0938J9150N1889
$$ plain form
8100 -10888 33924 43526 10620 14786 40118 45806 86023 56280 31974 -11073 -7673 15934 24523
8087 24523 13985 27908 39251 85796 61969 44478 47999 24593 22154 43458 32590 20161
8075 20161 -6691 -30627 -30977 -44492 -33273 -35179 -39624 -12584 4258 -28273 -21820 1471 -3652
8062 -3652 12071 55495 48292 34118 -29780 -63332 -66970 -48631 -2097 3387 -19546 -38809 -15208
8049 -15208 27216 40639 43565 33064 22341 28929 32619 69786 50473 83025 90991 55899 69797
8036 69797 95083 53288 11925 35326 29617 -2147 8686 16607 60398 72886 64975 53766
8024 53766 50445 2531 24180 39058 20470 19314 22617 25685 21086 10663 84639 116330 122897
8011 122897 99027 83011 86169 123385 133911 88356 47214 72611 94925 83866 68047 86858
$$ packed form
8100a0888M4812R602l2906M166K5332N688M0217k9743k4306m3047L400K3607Q589
8087B4523j0538J3923J1343M6545k3827j7491L521k3406k439K1304j0868j2429
8075B0161k6852k3936l50j3515J1219j906m445K7040J6842l2531O453K3291n123
8062c652J5723M3424p203j4174o3898l3552l638J8339M6534N484k2933j9263K3601
8049a5208M2424J3423K926j0501j0723O588L690L7167j9313L2552P966l5092J3898
8036F9797K5286m1795m1363K3401n709l1764J0833P921M3791J2488p911j1209
8024E3766l321m7914K1649J4878j8588j156L303L068m599j0423P3976L1691O567
8011A22897k3870j6016L158L7216J0526m5555m1142K5397K2314j1059j5819J8811
$$ plain form
7999 86858 84861 123825 130980 73948 26786 50931 84365 93168 106566 106141 66999 72208 83725
7986 83725 91744 65672 86819 99446 102663 93875 58462 75681 47178 75214 91471 95069 110252
7973 110252 133584 119694 45378 39472 49810 38910 80962 98232 86375 128054 154008 127870
7961 127870 60387 31919 42077 8094 26851 34930 36529 70667 43965 52607 77399 75974
7949 75974 94500 128008 135348 88781 27141 72333 104512 104308 79670 45303 17106 -19364
7937 -19364 -13142 12311 59535 52204 42572 75717 87905 53134 42381 16496 -16345 12044
7925 12044 54835 35731 21011 -12217 3108 45835 59398 49870 117311 128283 89816 101862
7913 101862 157446 148620 93938 54392 79225 97160 125567 122876 118783 104685 50364 17118
$$ packed form
7999H6858j997L8964P155n7032m7162K4145L3434Q803J3398m25l9142N209J1517
7986H3725Q019k6072K1147J2627L217q788l5413J7219k8503K8036J6257L598J5183
7973A10252K3332j3890p4316n906J0338j0900M2052J7270j1857M1679K5954k6138
7961A27870o7483k8468J0158l3983J8757Q079J599L4138k6702Q642K4792j425
7949G5974J8526L3508P340m6567o1640M5192L2179k04k4638l4367k8197l6470
7937a9364O222K5453M7224p331r632L3145J2188l4771j0753k5885l2841K8389
7925A2044M2791j9104j4720l3228J5325M2727J3563r528O7441J0972l8467J2046
7913A01862N5584q826n4682l9546K4833J7935K8407k691m093j4098n4321l3246
$$ plain form
7901 17118 57426 71383 84283 80736 54747 48553 51341 22265 -12685 -18680 20172 58140 71170
7888 71170 61328 52448 40847 41010 47298 27090 32519 49865 93337 69913 74441 45626 58799
7875 58799 62028 30283 -6332 -26039 3669 6835 1009 8099 32380 41878 73021 100786 120606
7862 120606 90056 69065 61946 49997 34717 18540 4516 -2442 -32580 -29086 27270 36724
7850 36724 -14224 -24941 -21739 35669 86441 28227 11116 -19983 3784 50825 42057 31968
7838 31968 29146 14197 5288 -2821 -30720 767 51091 91840 72809 46301 44366 21702 11319
7825 11319 32435 54368 79034 74568 45174 9436 31834 42183 39035 11543 -12714 -46981
7813 -46981 -36298 -41467 -49043 -8309 23494 24706 26760 24993 14687 23944 15042 -35658 -43555
$$ packed form
7901A7118M0308J3957J2900l547k5989o194K788k9076l4950n995L8852L7968J3030
7888G1170r842q880j1601J63O288k0208N429J7346M3472k3424M528k8815J3173
7875E8799L229l1745l6615j9707K9708L166n826P090K4281R498L1143K7765J9820
7862A20606l0550k0991p119j1949j5280j6177j4024o958l0138L494N6356R454
7850C6724n0948j0717L202N7408N0772n8214j7111l1099K3767M7041q768j0089
7838C1968k822j4949q909q109k7899L1487N0324M0749j9031k6508j935k2664j0383
7825A1319K1116K1933K4666m466k9394l5738K2398J0349l148k7492k4257l4267
7813d6981J0683n169p576M0734L1803J212K054j767j0306R257q902n0700p897
$$ plain form
7800 -43555 -28647 27015 33937 -1818 -25679 -23536 -36083 -8398 25064 3332 1079 41181
7788 41181 70735 61020 40607 44803 6136 2514 -6583 -35840 -33394 -16927 23024 81782 107450
7775 107450 69325 25794 48593 72054 58289 9981 4348 -32978 -12826 2895 16248 26868
7763 26868 21055 65868 31356 -41577 -102396 -127643 -114592 -63687 -41872 -49474 -30206 5163
7751 5163 -7341 -33041 -46667 -49945 -44359 8006 -17146 -43341 -2859 36506 65105 64787 48112
7738 48112 24249 56186 60779 48612 31149 7098 34065 121231 132784 44358 -9607 10493
7726 10493 -16734 -40508 -43518 -21104 -17521 -60620 -71020 2005 201 -31036 -50615 -45095 -47836
7713 -47836 -43838 -55359 -50636 -12468 -12502 -37602 11963 29146 25622 28938 42647 17171 36959
$$ packed form
7800d3555J4908N5662O922l5755k3861K143j2547K7685L3462k1732k253M0102
7788D1181K9554r715k0413M196l8667l622r097k9257K446J6467L9951N8758K5668
7775A07450l8125m3531K2799K3461j3765m8308n633l7326K0152J5721J3353J0620
7763B6868n813M4813l4512p2933o0819k5247J3051N0905K1815p602J9268L5369
7751E163j2504k5700j3626l278N586N2365k5152k6195M0482L9365K8599l18j6675
7738D8112k3863L1937M593j2167j7463k4051K6967Q7166J1553q8426n3965K0100
7726A0493k7227k3774l010K2414L583m3099j0400P3025j804l1237j9579N520k741
7713d7836L998j1521M723L8168l4k5100M9565J7183l524L316J3709k5476J9788
$$ plain form
7700 36959 42570 10960 6139 3244 -8882 -52241 -75770 -56124 -30767 -30066 -24997 -21355 -61925
7687 -61925 -74506 -20489 23040 2860 16536 19037 1785 9971 -822 49298 71425 52600
7675 52600 71612 104292 80561 24312 40293 24234 -16596 -1602 17532 20331 22090 46562
7663 46562 31341 -3056 -23948 5921 11864 -6860 -47849 -55255 -21410 -16103 -53571 -73029
7651 -73029 -45708 -29734 -28503 -12824 71837 116844 86681 64937 50657 62748 43864 23653
7639 23653 15108 -46556 -45865 -599 21590 -25855 1306 -243 -8072 10821 45530 46543 59617
7626 59617 77440 67104 60297 36564 36715 46477 19043 -19788 -1375 49899 77378 108717 104248
7613 104248 66938 22662 -693 25496 25542 45173 62740 56796 30694 28225 -4978 -21857 -20306
$$ packed form
7700C6959N611l1610m821k895j2126m3359k3529J9646K5357P01N069L642m0570
7687f1925j2581N4017M3529k0180J3676K501j7252Q186j0793N0120K2127j8825
7675E2600J9012L2680k3731n6249J5981j6059m0830J4994J9134K799J759K4472
7663D6562j5221l4397k0892K9869N943j8724m0989p406L3845N307l7468j9458
7651g3029K7321J5974J231J5679Q4661M5007l0163k1744j4280J2091j8884k0211
7639B3653q545o1664O91M5266K2189m7445K7161j549p829J8893L4709J013J3074
7626E9617J7823j0336o807k3733J51R762k7434l8831J8413N1274K7479L1339m469
7613A04248l7310m4276k3355K6189M6J9631J7567n944k6102k469l3203j6879J551
$$ plain form
7600 -20306 -4735 -19390 -21288 -25152 -43259 -31044 -15565 -28655 -18789 26473 32001 271 -4318
7587 -4318 -8352 47019 61987 69040 46345 56640 100603 108107 52719 25809 -23112 -20654 -27317
7574 -27317 -24390 6074 -6103 -9571 -21853 -41208 -31596 -22447 -22313 -36844 -63635 -55477 -34538
7561 -34538 -29241 -21795 -39264 -29468 -32233 -38005 -20275 -13103 7943 -13362 -40631 -69853 -41199
7548 -41199 -28176 -6466 -8288 -3706 -9022 -26536 -37637 -6522 37533 35179 19290 15333 34315
7535 34315 71479 68847 7900 -30821 -12304 -19044 -56903 -71909 -36713 -8692 4806 15251
7523 15251 -8020 -26002 -31004 -11703 13501 -17507 -30318 -6055 31983 1401 -16214 -20183
7511 -20183 -46648 -31479 -21126 -32025 -20986 -45708 -17768 -30422 -46590 -31298 1942 17665
$$ packed form
7600b0306J5571j4655j898l864j8107J2215J5479j3090R866M5262N528l1730m589
7587d318m034N5371J4968P053k2695J0295M3963P504n5388k6910m8921K458o663
7574b7317K927L0464j2177l468j2282j9355R612R149J34j4531k6791Q158K0939
7561c4538N297P446j7469R796k765n772J7730P172K1046k1305k7269k9222K8654
7548d1199J3023K1710j822M582n316j7514j1101L1115M4055k354j5889l957J8982
7535C4315L7164k632o0947l8721J8517o740l7859j5006L5196K8021J3498J0445
7523A5251k3271j7982n002J9301K5204l1008j2811K4263L8038l0582j7615l969
7511b0183k6465J5169J0353j0899J1039k4722K7940j2654j6168J5292L3240J5723
$$ plain form
7499 17665 -4719 -30189 -58245 -78974 -56885 -30228 -20002 -63945 -76034 -103837 -47827 -34410
7487 -34410 -42872 -43549 -18712 29493 23271 14332 29786 50944 69862 62647 54440 36400 731
7474 731 -5886 -29360 -15232 -34268 -40641 -26652 -9720 9813 11002 -11320 -10535 21355 37410
7461 37410 39317 -5800 -46621 -66578 -40247 -10195 -42039 -38494 -26111 -45265 -46549 -329
7449 -329 11066 -571 -17617 -27877 -56290 -64519 -25560 -7858 -36278 -57869 -45238 -7649
7437 -7649 23778 -1078 -868 2418 -35374 -56896 -24882 -22338 -3121 -12309 -55352 -52716 -20407
7424 -20407 34488 30973 17420 -550 -19019 -10736 8054 55072 63632 51300 32187 -32624
7412 -32624 -43548 5355 5367 1095 35979 53620 33485 19360 17566 -8135 10653 -15546 -52406
$$ packed form
7499A7665k2384k5470k8056k0729K2089K6657J0226m3943j2089k7803N6010J3417
7487c4410q462o77K4837M8205o222q939J5454K1158J8918p215q207j8040l5669
7474G31o617k3474J4128j9036o373J3989J6932J9533J189k2322P85L1890J6055
7461C7410J907m5117m0821j9957K6331L0052l1844L545J2383j9154j284M6220
7449c29J1395j1637j7046j0260k8413q229L8959J7702k8420k1591J2631L7589
7437g649L1427k4856K10L286l7792k1522L2014K544J9217r188m3043K636L2309
7424b0407N4895l515j3553j7970j8469Q283J8790M7018Q560j2332j9113o4811
7412c2624j0924M8903J2m272L4884J7641k0135j4125j794k5701J8788k6199l6860
$$ plain form
7399 -52406 -78179 -52031 -43644 -50187 -28266 431 17659 -38318 -18616 -7937 -19004 34431
7387 34431 11102 -43200 -29909 -10872 14202 16139 -23382 -22475 -14804 -18622 -18072 1334 17203
7374 17203 39444 -21506 -36577 -35044 -8341 -70081 -43600 -1699 -2081 -6529 5977 14273 -12329
7361 -12329 27897 30931 164 -41650 -35120 -19436 10821 10947 20371 10119 15384 25907 4051
7348 4051 293 -16315 -41274 -26659 -23930 -50245 8612 76626 116719 100168 40825 24138
7336 24138 -23859 -24662 -26348 -52753 -64003 -65656 -78353 -96949 -98582 -39521 12834 42143 16347
7323 16347 22342 23346 -31667 -33726 -5857 -29039 -67304 -39516 -32331 -3474 -13408 -20467 -27836
7310 -27836 7263 4988 -15687 -46873 -53714 -32312 523 3238 737 -16258 15698 33919 27150
$$ packed form
7399e2406k5773K6148Q387o543K1921K8697J7228n5977J9702J0679j1067N3435
7387C4431k3329n4302J3291J9037K5074J937l9521R07P671l818N50J9406J5869
7374A7203K2241o0950j5071J533K6703o1740K6481M1901l82m448J2506Q296k6602
7361a2329M0226L034l0767m1814O530J5684L0257J26R424j0252N265J0523k1856
7348D051l758j6608k4959J4615K729k6315N8857O8014M0093j6551n9343j6687
7336B4138m7997q03j686k6405j1250j653j2697j8596j633N9061N2355K9309k5796
7323A6347N995J004n5013k059K7869k3182l8265K7788P185K8857r934p059p369
7310b7836L5099k275k0675l1186o841K1402L2835K715k501j6995L1956J8221o769
$$ plain form
7297 27150 11718 26548 25376 5822 -1877 -10785 -11259 8217 8281 6622 -4817 -47613 -33030 2594
7283 2594 902 -35370 -71972 -43942 -45974 4288 12633 -14369 -12648 -15598 -28604 -67465 -37666
7270 -37666 -28095 -48756 -53518 -4271 -45013 -43609 1544 61451 56775 8557 -1700 28631 22473
7257 22473 -3968 1135 17107 -5874 6246 -11006 -57292 -55620 -23732 10484 -18552 -39419
7245 -39419 1395 30705 20556 -13860 -35467 8772 10973 -16218 25301 28349 607 -17221
7233 -17221 17849 23567 37973 27004 6129 -18067 -34451 -68405 -101918 -112623 -95696 -51763
7221 -51763 -63965 -77801 -94254 -71560 -68648 -77290 -81223 -82947 -53228 -59855 -63555 -60700 -46327
7208 -46327 -5637 897 7404 -35189 -53534 -54553 -39432 -25544 11833 6402 22272 81356 109570
$$ packed form
7297B7150j5432J4830j172j9554p699q908m74J9476O4j659j1439m2796J4583L5624
7283B594j692l6272l6602K8030k032N0262Q345k7002J721k950j3006l8861K9799
7270c7666R571k0661m762M9247m0742J404M5153N9907m676m8218j0257L0331o158
7257B2473k6441N103J5972k2981J2120j7252m6286J672L1888L4216k9036k0867
7245c9419M0814K9310j0149l4416k1607M4239K201k7191M1519L048k7742j7828
7233a7221L5070N718J4406j0969k0875k4196j6384l3954l3513j0705J6927M3933
7221e1763j2202j3836j6453K2694K912q642l933j724K9719o627l700K855J4373
7208d6327M0690O534O507m2593j8345j019J5121J3888L7377n431J5870N9084K8214
$$ plain form
7195 109570 86654 33377 17123 13246 14260 50672 75462 53481 61629 20377 -7534 17703
7183 17703 23210 7030 21460 23561 26694 10155 -9056 -37 27729 29849 39164 39492 15188
7170 15188 6947 30153 21156 -9927 -19171 -24266 -34890 -46916 -15423 11765 -19770 -34752 -45005
7157 -45005 -39777 -21474 -5533 -16327 -19013 -3173 19632 24320 25831 19987 15063 -13973 -21109
7144 -21109 29539 3082 -16029 -25215 -6515 7600 29896 -3240 -37997 -48614 -59191 -60132
7132 -60132 -16310 36919 84464 75196 39775 17168 -32398 -43677 -23484 695 -13380 -35169
7120 -35169 -36531 2784 46057 42092 28487 50392 20808 26224 -9752 -12793 -10219 3277 14385
7107 14385 7554 -235 10536 33439 36725 8539 -20156 -28970 -63382 -71167 -88611 -35402 6430
$$ packed form
7195A09570k2916n3277j6254l877J014L6412K4790k1981Q148m1252k7911K5237
7183A7703N507j6180J4430K101L133j6539j9211R019K7766K120R315L28k4304
7170A5188q241K3206q997l1083r244n095j0624j2026L1493K7188l1535j4982j0253
7157d5005N228J8303J5941j0794k686J5840K2805M688J511n844m924k9036p136
7144b1109N0648k6457j9111r186J8700J4115K2296l3136l4757j0617j0577r41
7132f0132M3822N3229M7545r268l5421k2607m9566j1279K0193K4179j4075k1789
7120c5169j362L9315M3273l965j3605K1905k9584N416l5976l041K574J3496J1108
7107A4385o831p789J0771K2903L286k8186k8695q814l4412p785j7444N3209M1832
$$ plain form
7094 6430 29479 37331 16739 47159 24681 -53343 -41784 -9281 23126 37335 26079 12452
7082 12452 42746 19206 -2132 -9860 -35904 -47181 -40837 -51910 -26348 28336 34771 42400 47677
7069 47677 51266 39367 -1065 -30965 12335 82360 91507 76022 59364 33633 28007 33540 27302
7056 27302 51471 65661 34555 8857 -37972 -28536 -13447 8759 -15654 -45660 -4320 31322
7044 31322 39529 34527 -11873 10222 45140 76637 104254 70411 35863 45034 36628 45929 19539
7031 19539 -37535 -29516 -16732 -47163 -37813 -13057 35048 43957 37293 -18490 -7112 9966 -2975
7018 -2975 4384 61199 76794 77243 34915 -20559 -33159 -19651 -26904 -35244 -29497 -43898 -32595
7005 -32595 -9616 86 -14079 15175 62399 97474 55424 13822 -10787 -11456 9617 47144
$$ packed form
7094F430K3049P852k0592L0420k2478p8024J1559L2503L2407J4209j1256j3627
7082A2452L0294k3540k1338p728k6044j1277O344j1073K5562N4684O435P629N277
7069D7677L589j1899m0432k9900M3300P0025R147j5485j6658k5731n626N533o238
7056B7302K4169J4190l1106k5698m6829R436J5089K2206k4413l0006M1340L5642
7044C1322Q207n002m6400K2095L4918L1497K7617l3843l4548R171q406R301k6390
7031A9539n7074Q019J2784l0431R350K4756M8105Q909o664n5783J1378J7078j2941
7018b975P359N6815J5595M49m2328n5474j2600J3508p253q340N747j4401J1303
7005c2595K2979R702j4165K9254M7224L5075m2050m1602k4609o69K1073L7527
$$ plain form
6993 47144 65553 46735 34510 18759 -3104 -19703 -15720 4392 20626 44288 -20968 -112247
$$ packed form
6993D7144J8409j8818j2225j5751k1863j6599L983K0112J6234K3662o5256r1279
$$ [...]
##END NTUPLES=NMR SPECTRUM
##END=
