##TITLE=Analysis number 321589
Compound Code sb 01321
Project Code adrs
Chemist Name stores
##JCAMPDX= 6.0         $$ Bruker NMR JCAMP-DX V2.0
##DATA TYPE= NMR SPECTRUM
##DATA CLASS= NTUPLES
##ORIGIN= Bruker BioSpin GmbH
##OWNER= nmr
$$ XWIN-NMR		Version 3.5
$$ Thu Aug 17 10:12:13 2006 GMT Daylight Time (UT+1h)  MAYBRIDGE\nmr@NMR_250MHZ
##.OBSERVE FREQUENCY= 250.131544655141
##.OBSERVE NUCLEUS= ^1H
##.ACQUISITION MODE= SIMULTANEOUS (DQD)
##.ACQUISITION SCHEME= undefined
##.AVERAGES= 16
##.DIGITISER RES= 18
##SPECTROMETER/DATA SYSTEM= dpx250
##.PULSE SEQUENCE= zg30
##.SOLVENT NAME= CDCl3
##.SHIFT REFERENCE= (INTERNAL, CDCl3, 0, 16.522)
##AUDIT TRAIL= $$ (NUMBER, WHEN, WHO, WHERE, WHAT)
$$ ##TITLE= Audit trail, XWIN-NMR		Version 3.5
$$ ##JCAMPDX= 5.01
$$ ##ORIGIN= Bruker BioSpin GmbH
$$ ##OWNER= nmr
$$ C:\u/data/dgb/nmr/ADRS/1070/pdata/1/auditp.txt
$$ ##AUDIT TRAIL=  $$ (NUMBER, WHEN, WHO, WHERE, WHAT)
(   1,<2006-08-17 10:11:52.07 +100>,<MAYBRIDGE\nmr>,<NMR_250MHZ>,
      <created by zg, POWCHK disabled, PULCHK disabled
       configuration hash MD5:
       E2 DF 36 D8 04 B2 41 60 5A D7 A3 38 5A 4B D0 FE
       data hash MD5: 64K
       AD B9 F0 76 E1 F9 A0 F6 E3 BA F9 EA 76 AD FA 23>)
(   2,<2006-08-17 10:12:05.01 +100>,<MAYBRIDGE\nmr>,<NMR_250MHZ>,
      <Start of raw data processing
       ef LB = 0.3 FT_mod = 6 PKNL = 1 SI = 32K 
       data hash MD5: 32K
       D7 14 6C 2B 89 F4 5C C4 B3 37 EE B4 09 DD A2 17>)
(   3,<2006-08-17 10:12:06.65 +100>,<MAYBRIDGE\nmr>,<NMR_250MHZ>,
      <apk 
       data hash MD5: 32K
       78 92 B8 8A 65 3E 4A D6 1E 50 7B 1A D1 00 B9 94>)
(   4,<2006-08-17 10:12:07.44 +100>,<MAYBRIDGE\nmr>,<NMR_250MHZ>,
      <abs ABSG = 5 
       data hash MD5: 32K
       92 11 21 D6 D5 C9 AC 13 AE 69 74 BF 22 FB B6 48>)
$$ ##END=
$$ 
$$ hash MD5
$$ 03 D6 15 E4 BE 39 82 83 67 6C F8 7A AC 49 7B 0B
##$RELAX= 
##$RELAX= 
##$RELAX= 
##$RELAX= 
##$RELAX= 
##$RELAX= 
##$RELAX= 
$$ Bruker specific parameters
$$ --------------------------
##$DU= <C:\u>
##$EXPNO= 1070
##$NAME= <ADRS>
##$PROCNO= 1
##$TYPE= <nmr>
##$USER= <dgb>
##$AMP= (0..31)
100 100 100 100 100 100 100 100 100 100 100 100 100 100 100 100 100 100 
100 100 100 100 100 100 100 100 100 100 100 100 100 100 
##$AQSEQ= 0
##$AQ_mod= 3
##$AUNM= <au_zg>
##$AUTOPOS= <11 >
##$BF1= 250.13
##$BF2= 250.13
##$BF3= 250.13
##$BF4= 250.13
##$BF5= 500.13
##$BF6= 500.13
##$BF7= 500.13
##$BF8= 500.13
##$BYTORDA= 1
##$CFDGTYP= 0
##$CFRGTYP= 5
##$CHEMSTR= <none>
##$CNST= (0..31)
1 1 145 1 1 1 1 1 1 1 1 1 1 1 1 1 1 1 1 1 1 1 1 1 1 1 1 1 1 1 1 1 
##$CPDPRG= <>
##$CPDPRG1= <>
##$CPDPRG2= <>
##$CPDPRG3= <>
##$CPDPRG4= <mlev>
##$CPDPRG5= <mlev>
##$CPDPRG6= <mlev>
##$CPDPRG7= <mlev>
##$CPDPRG8= <mlev>
##$CPDPRGB= <>
##$CPDPRGT= <>
##$D= (0..31)
0 1 0 0 0 0 0 0 0 0.06 0 0 0 0 0 0 0.0002 0 0 0 0 0 0 0 0 0 0 0 0 0 0 
0 
##$DATE= 1155805911
##$DBL= (0..7)
120 120 120 120 120 120 120 120 
##$DBP= (0..7)
150 150 150 150 150 150 150 150 
##$DBP07= 0
##$DBPNAM0= <>
##$DBPNAM1= <>
##$DBPNAM2= <>
$$ [...]
##$SUBNAM7= <"">
##$SUBNAM8= <"">
##$SUBNAM9= <"">
##$SW= 20.6930455092707
##$SWIBOX= (0..15)
0 0 3 0 0 0 0 0 0 0 0 0 0 0 0 0 
##$SW_h= 5175.983436853
##$TD= 65536
##$TD0= 1
##$TE= 295.16
##$TE2= 300
##$TE3= 300
##$TEG= 300
##$TL= (0..7)
0 120 120 120 120 120 120 120 
##$TP= (0..7)
150 150 150 150 150 150 150 150 
##$TP07= 0
##$TPNAME0= <>
##$TPNAME1= <>
##$TPNAME2= <>
##$TPNAME3= <>
##$TPNAME4= <>
##$TPNAME5= <>
##$TPNAME6= <>
##$TPNAME7= <>
##$TPOAL= (0..7)
0.5 0.5 0.5 0.5 0.5 0.5 0.5 0.5 
##$TPOFFS= (0..7)
0 0 0 0 0 0 0 0 
##$TUNHIN= 0
##$TUNHOUT= 0
##$TUNXOUT= 0
##$USERA1= <user>
##$USERA2= <user>
##$USERA3= <user>
##$USERA4= <user>
##$USERA5= <user>
##$V9= 5
##$VALIST= <valist>
##$VCLIST= <CCCCCCCCCCCCCCC>
##$VD= 0
##$VDLIST= <DDDDDDDDDDDDDDD>
##$VPLIST= <PPPPPPPPPPPPPPP>
##$VTLIST= <TTTTTTTTTTTTTTT>
##$WBST= 1024
##$WBSW= 4
##$XGAIN= (0..3)
0 0 0 0 
##$XL= 0
##$YL= 0
##$YMAX_a= 370156
##$YMIN_a= -497860
##$ZGOPTNS= <>
##$ZL1= 120
##$ZL2= 120
##$ZL3= 120
##$ZL4= 120
##$ABSF1= 16.522
##$ABSF2= -4.171173
##$ABSG= 5
##$ABSL= 3
##$ALPHA= 0
##$AQORDER= 0
##$ASSFAC= 0
##$ASSFACI= 0
##$ASSFACX= 0
##$ASSWID= 0
##$AUNMP= <proc_1d>
##$AZFE= 0.1
##$AZFW= 0.1
##$BCFW= 0
##$BC_mod= 0
##$BYTORDP= 0
##$COROFFS= 0
##$CY= 12.5
##$DATMOD= 1
##$DC= 0
##$DFILT= <>
##$DTYPP= 0
##$F1P= 14.0000005364418
##$F2P= -0.99999901652339
##$FCOR= 0.5
##$FTSIZE= 32768
##$FT_mod= 6
##$GAMMA= 0
##$GB= 0
##$INTBC= 1
##$INTSCL= 1
##$ISEN= 128
##$LB= 0.3
##$LEV0= 0
##$LPBIN= 0
##$MAXI= 10000
##$MC2= 0
##$MEAN= 0
##$ME_mod= 0
##$MI= 0
##$NCOEF= 0
##$NC_proc= -5
##$NLEV= 6
##$NOISF1= 0
##$NOISF2= 0
##$NSP= 0
##$NTH_PI= 0
##$NZP= 0
##$OFFSET= 16.522
##$PC= 1
##$PHC0= 149.7804
##$PHC1= 12.40571
##$PH_mod= 1
##$PKNL= yes
##$PPARMOD= 0
##$PSCAL= 4
##$PSIGN= 0
##$REVERSE= no
##$SF= 250.13
##$SI= 32768
##$SIGF1= 0
##$SIGF2= 0
##$SINO= 400
##$SIOLD= 32768
##$SREGLST= <1H.CDCl3>
##$SSB= 0
##$STSI= 32768
##$STSR= 0
##$SW_p= 5175.98343685301
##$SYMM= 0
##$S_DEV= 0
##$TDeff= 65536
##$TDoff= 0
##$TI= <Analysis number 999999
Compound Code 99
Book Reference 9
Project Code 9>
##$TILT= no
##$TM1= 0
##$TM2= 0
##$TOPLEV= 0
##$USERP1= <user>
##$USERP2= <user>
##$USERP3= <user>
##$USERP4= <user>
##$USERP5= <user>
##$WDW= 1
##$XDIM= 32768
##$YMAX_p= 492016929
##$YMIN_p= -1299821
$$ End of Bruker specific parameters
$$ ---------------------------------
##NTUPLES= NMR SPECTRUM
##VAR_NAME=  FREQUENCY,     SPECTRUM/REAL,   SPECTRUM/IMAG
##SYMBOL=    X,             R,               I
##VAR_TYPE=  INDEPENDENT,   DEPENDENT,       DEPENDENT
##VAR_FORM=  AFFN,          ASDF,            ASDF
##VAR_DIM=   32768,         32768,           32768
##UNITS=     HZ,            ARBITRARY UNITS, ARBITRARY UNITS
##FACTOR=    0.157963299565203, 1,           1
##FIRST=     4132.6476996994, 0,             0
##LAST=      -1043.33573715361, 0,           0
##MIN=       -1043.33573715361, -1299821,    0
##MAX=       4132.6476996994, 492016929,     0
$$ Real data points
##PAGE= N=1
##DATA TABLE= (X++(R..R)), XYDATA
$$ [...]
23036B6820Q9438k61766l18681n626R4148k34944k52659L71732K20831K95343
23026B4636o904j5139O1338K95967j8557j95360N5001J86505K44572M5019l91293
23015B85785j36699K25139k1925o3673k42381K26858J03807l81930Q0843J53481
23005B29305k80232k5719p0803q7607K38681j68549p6176o2336Q543j18985K2085
22994c91793K40250l7435P0506N8794j2006O2705K68799m08308O9989k241q9515
22983a70255M9076M08237q9363j6529M32599K51178m14399l47771l33390K11552
22973a9065K72772J67241k0815j53378m34605j0356j22138J76985K05364R4626
22963A56631j54705m51449q5100L22031K10244J28507J52853k7350l3373l33672
$$ y = [26820, 116258, -145508, -464189, -469815, -375667, -610611, -863270, -491538, -270707, 24636, 17732, 2593, 63931, 359898, 341341, 145981, 200982, 387487, 632059, 677078, 285785, 149086, 374225, 352300, 288627, 46246, 273104, 376911, -5019, 75824, 229305, -50927, -76646, -147449, -235056, 3625, -164924, -241100, -303436, -294893, -413878, -391793, -151543, -188978, -118472, -59678, -71684, -8979, 259820, -148488, -78499, -80740, -170255, -121179, 287058, 197695, 181166, 613765, 864943, 450544, 102773, -230617, -19065, 253707, 420948, 400133, 246755, -187850, -198206, -320344, -143359, 62005, 156631, 1926, -449523, -534623, -212592, -2348, 126159, 279012, 251662, 218289, -115383]
22953a15383M9144K30869K32987J20479o3175j23433M3653o8115j22142j73624
22943A1260j4260J79118j21518m34477q5938K36458p123m2651o1617L40151J81023
22932A80426j0937R865j12338k37155O4212K7745j26543r7985j14706P1985q0403
22921d25834J18551K10468l167k91634N0062J77635r2839J19200q363N4738j93564
22910b84747o7905K18361J30585J3364j19483J51303n3417o0705K35507L17852
22900D80715K39929j96323j49144j92755k14287l43304Q3026k6525j68316M51196
22890c5788K51499J01294j95386l52908r0156k37645j05099M2097P7285L06997
22880b37810q7196n4840L10470J477n2620p553J40413R972R6496J89661K36973
$$ y = [-115383, -66239, 164630, 397617, 518096, 454921, 331488, 375141, 307026, 184884, 11260, -3000, 176118, 54600, -379877, -465815, -229357, -236480, -279131, -340748, -597, 180426, 169489, 179354, 67016, -170139, -105927, -78182, -204725, -302710, -417416, -345431, -425834, -307283, -96815, -99982, -391616, -341554, -163919, -256758, -137558, -145921, -91183, -284747, -352652, -134291, -3706, 9658, -109825, 41478, -11939, -72644, 162863, 480715, 720644, 524321, 375177, 182422, -31865, -375169, -292143, -318668, -486984, -35788, 215711, 317005, 121619, -231289, -321445, -559090, -664189, -622092, -544807, -237810, -325006, -379846, -69376, -67899, -120519, -128072, 12341, 22313, 118809, 308470, 545443]
22869E45443n2195N9545J89402M0312l69182j74929j36741j02626O6567l0493
22859C5103J61165r8995n26434l44236M48583J90688n9782J17347J10812l52319
22849c18068j70199Q0172Q3486K08528K54245J12219J52440p9479K1116k54192
22839I0268j26186K2117k47412L7738K08103P6256m79046m80176J12001L17745
22829d68592k41312K43793O07264J19566l72267Kr4905J16634k15496m37369M3286
22818f99396J76504K00149K25939K4857J46274O6901k92936l3836K17874J2859
22808D5189P9768K34098j83707j39818l45335J71741J73795q6054j9835P1049
22798H91J15402j04253m28656j22869K5949j05670J06239K04422K40796j04571
$$ y = [545443, 493248, 552793, 742195, 782507, 413325, 238396, 101655, -971, 65596, 35103, 196268, 97273, -429161, -773397, -324814, -134126, -193908, -76561, 34251, -318068, -488267, -408095, -324609, -116081, 138164, 250383, 402823, 323344, 344460, 90268, -35918, -13801, -261213, -223475, -15372, 60884, -418162, -898338, -786337, -468592, -709904, -466111, 141153, 260719, -111548, -111546, -206451, -89817, -305313, -742682, -699396, -522892, -322743, -96804, -71947, 74327, 141228, -151708, -185544, 32330, 45189, 124957, 359055, 175348, 35530, -309805, -138064, 35731, -50323, -70158, 891, 116293, 12040, -416616, -539485, -513536, -619206, -512967, -308545, -67749, -172320]
22788a72320l0655J37269J58112k39207Q6822Q1029r9718j43705k44331j67754
22778f34458K6855Q7123J94753r3334j34087N1772L99152J98765n7783l99170
22768c60412j48562K68313R1374k66242O0147N1478p1586M4917p7828o9485K31507
22757b46379L5172J7611J13981q7579J14177r9838J5324J19319k67875J76233
22747a09854J15838o3668r4219K03959l98050k32007Q7928M03667L3265J40806
22737H7665k24121k44061K05431J68920Q0289J65193M17570j35586k57940j03748
22727A59612Q6166j02080p6310K5352l32695k58236K70112R492p3520K64805R5024
22716F7722l44537k08987J19859J11976p9776L3681l6931P8876m9846K34554J73112
$$ y = [-172320, -202975, -65706, 92406, -146801, -59979, 21050, -78668, -222373, -466704, -634458, -607603, -520480, -325727, -419061, -553148, -501376, -102224, 96541, 38758, -360412, -508974, -240661, -149287, -415529, -355382, -303904, -375490, -330573, -408401, -477886, -246379, -211207, -193596, -79615, -167194, -53017, -152855, -137531, -18212, -286087, -109854, 5984, -57684, -151903, 52056, -345994, -578001, -490073, -86406, -53141, 87665, -136456, -380517, -175086, -6166, 74123, 239316, 656886, 521300, 263360, 159612, 245778, 143698, 67388, 92740, -239955, -498191, -228079, -218587, -292107, -27302, 67722, -276815, -485802, -365943, -253967, -333743, -300062, -336993, -258117, -307963, -73409, 99703]
22705I9703R0373L61563j85130k05831k56783O9092j25775l5888O656k05179J97186
22694a90013L02483j54879o4858J33158p3035m9478m5627j45621M03809L20021
22684D35960j74160m17039K77868K46659k32942Q330l6583J20282J02460n1579
22674B79256l75004k02907j59290J08871L21515J12826L00485K43338k41237p3586
22664C14267k96181k06806K18899j50272j18280Q9592J75694J44268j11944k40722
22654a81485k86793o1292J44826K07274l12515k06335O9624r7273O8521K88105
22644c67343L11579n6867Q7308k2223n2371K09295k0601n6200j31392j30850j83181
22633d12846L0115M0718p1047J99579J41410M93747P7576j87612k63305j20960
$$ y = [99703, 190076, 551639, 366509, 160678, -96105, -27013, -152788, -188676, -182020, -387199, -190013, 112470, -42409, -107267, 25891, -47144, -96622, -142249, -287870, 115939, 435960, 261800, -155239, 122629, 369288, 136346, 144676, 108093, 228375, 330835, 279256, -95748, -298655, -457945, -349074, -27559, 85267, 385752, 629090, 387853, 314267, 18086, -188720, 30179, -120093, -238373, -148781, 26913, 171181, 59237, -181485, -468278, -529570, -384744, -177470, -489985, -696320, -626696, -723969, -655448, -367343, -55764, -112631, -25323, -47546, -99917, 109378, 88777, 32577, -98815, -229665, -412846, -382731, -342013, -413060, -213481, -72071, 421676, 499252, 311640, 48335, -72625]
22623g2625j27854o2229K6559j84671Q4913J90511K39408J03280j95308j05583
22613a03599J27629k34582k57608K28170L54651J34208j99818m12323j92701N1998
22603e03975J33628o1369j59657K15764M40722K78239j32666J8356j18641l24045
22593b13644l99263L3349J67890N49860j21675k41814K75187M5548M2708l9246
22583I8900k48403j01247O0461K35784J42141j10708J35960k08777k68659J19684
22573a44864M7673k2425j1703M5823O3341k2827j97923j19637M1765N7757M70809
22562B07789P5543k94996j58903Q094J30677J1381J20601K09177J57776j03429
22552C63710k35109m72k3050J1590L74293o7007l32095k68001K072n4089K12705
$$ y = [-72625, -200479, -262708, -236149, -420820, -335907, -145396, 94012, 197292, 1984, -103599, 24030, -210552, -468160, -239990, 114661, 248869, 49051, -363272, -555973, -503975, -370347, -431716, -591373, -375609, 65113, 343352, 210686, 229042, 110401, -213644, -612907, -579558, -411668, 138192, 16517, -225297, 49890, 95438, 138146, 98900, -149503, -250750, -190289, 45495, 187636, 76928, 212888, 4111, -264548, -144864, -97191, -119616, -131319, -85496, -22155, -44982, -242905, -362542, -320777, -263020, 207789, 283332, -11664, -170567, -162473, -31796, -20415, 100186, 309363, 467139, 363710, 128601, 128129, 105079, 116669, 490962, 423955, 91860, -176141, -174069, -228158, -15453]
22541a5453j38685J45639j78230J5998J53468j19449J6971j14702j02936J40703
22531a96676J55527j81678l34959l40810J69060M60815K45034j81197k28354J18599
22521c14639J27253K22289K14145j07668k34813k20963K9229j67157Q6327M21295
22511E5298N2544q0561k33344J76102j98395m40190j70584J50492K02282K18496
22501b67860P9100k64933j31257J17591r0966K04069J67913j41247J73053K77465
22491A22928o1020j40336O1963p4583j03904L55665M03195R4038l17032l09782
22481C1132m1127j27756r0502J7735j23426L64505k24427j64199j37598K23056
22471b72607p6477n6093L8151J38718K0386k41112K12807P1081K25173j79045
$$ y = [-15453, -154138, -8499, -186729, -170731, -17263, -136712, -119741, -234443, -337379, -196676, -41149, -222827, -557786, -898596, -729536, -268721, -23687, -204884, -433238, -314639, -187386, 34903, 249048, 141380, -93433, -314396, -285167, -452324, -365997, 55298, 107842, 27281, -206063, -29961, -228356, -668546, -839130, -688638, -486356, -267860, -188760, -453693, -584950, -467359, -558325, -354256, -186343, -327590, -154537, 122928, 61908, -78428, -16465, -91048, -194952, 160713, 563908, 657946, 340914, 31132, -9995, -137751, -228253, -210518, -333944, 30561, -193866, -358065, -495663, -272607, -349084, -405177, -367026, -228308, -207922, -449034, -236227, -165146, 60027, -119018]
22461a19018k89349K75044m4899m9529l79500m5392J87478L1050L11970j90235
22451c12380m06687n9654K41598j92218K2706N30819N02124j0238m06541l67244
22441d57715j62936L9963J43803r4431j11260N8880o1525j70411J92648l14140
22431i37124J85767L80192L66569M55620K8538m90834n5336O5074j25516K50169
22421A23119l68606M7549K19735M6983j46407k89693Q9255o8799M3462O1287J43888
22410i8227J29211j31774k01249K46191K79510J66980k08195l32918J37809J91384
22400A78722j58609J2478J12601j64017j58371J21722J77360j40399j26820K2137
22390a23196j70616K038J2121J38469l4354k19593l49113K05522k7905k78398
$$ y = [-119018, -408367, -133323, -178222, -227751, -607251, -652643, -465165, -434115, -122145, -312380, -719067, -778721, -537123, -729341, -706635, -175816, 326308, 316070, -90471, -457715, -620651, -580688, -436885, -531316, -642576, -583696, -645221, -815632, -622984, -937124, -751357, -371165, -4596, 451024, 479562, -11272, -66608, -1534, -127050, 123119, -245487, -197938, 21797, 68780, -77627, -367320, -278065, -346864, -303402, -242115, -98227, 30984, -100790, -302039, -55848, 223662, 390642, 182447, -150471, -12662, 178722, 20113, 32591, 145192, -18825, -177196, -55474, 121886, -18513, -145333, -123196, -293812, -291774, -279653, -141184, -175538, -395131, -744244, -538722, -566627, -845025]
22380h45025K79048L98721J70240K74514n9292l55081M5849L27636m0055j28320
22370F8235J37869J51007j07895j27303j55005K62639J76446j55980q8071K5590
22360A87532J26738J43937P2347m13894k80592J60147M9065m8790K4418r7670
22350g6762l2641j63409J5547P5915P1772K52650K5956l5402j72170j69301L79551
22339A71706N5087L7376K16174N9020k41442l41780j12672J49334P073l8188K04697
22328A66385j1200J4479K87463J17332k78556o2527J54409j04510l28788m58370
22318e03883l8779K07548K07465K31466m3430J27838N7119M2569j01236k85339
22308i8662k6354J87634L97389J61410j43858K14341J0194K14795n997r4869k04569
$$ y = [-845025, -565977, -167256, 2984, 277498, 218206, -136875, -91026, 236610, 196555, 68235, 206104, 357111, 249216, 121913, -33092, 229547, 405993, 250013, 161942, 187532, 314270, 458207, 530554, 116660, -163932, -3785, 45280, -3510, 20908, -76762, -109403, -272812, -257265, -181350, -109578, 143072, 169028, 133626, -38544, -207845, 171706, 226793, 264169, 480343, 539363, 297921, -43859, -156531, -7197, -124, -38312, 166385, 155185, 169664, 457127, 574459, 295903, 233376, 387785, 283275, -45513, -503883, -542662, -335114, -127649, 103817, 60387, 188225, 245344, 287913, 186677, -98662, -125016, 62618, 460007, 621417, 477559, 691900, 702094, 916889, 910892, 816023, 611454]
22297F11454M4237j69526l39250K09454K10k7765k01062m08090P3948M32513M2639
22286B68762m25169j56494J44244q7709q0508j41110J90761L00897l98217k8456
22276d12999j03369P8617L94926M75991O1597k95884j35976k71410J4551N0180
22266a43776o7163R08J42235k2024j29913Q5582J56494N0227J23716j66395r2476
22255f2585K82534J31300j07950j25319k69422K05397K33415l09853k98929n1322
22245c72734K02779L48905L5459j50964K3011k41233q2429j64695l18438M38088
22235b82251M59691N9266k28933o62772O4665L78173J48773J95753O8753j74430
22225B6688k9655l072o007J32181Q1939K0151j00265J7856l4811k18033l8732
$$ y = [611454, 655691, 486165, 146915, 356369, 356579, 328814, 127752, -280338, -206390, 226123, 268762, -156407, -312901, -168657, -256366, -336874, -477984, -287223, 13674, -384543, -412999, -516368, -437751, -42825, 433166, 494763, 198879, 62903, -208507, -193956, -143776, -210939, -210031, -67796, -89820, -219733, -134151, 22343, 72570, 196286, 29891, -62585, 219949, 351249, 243299, 117980, -151442, 53955, 287370, -22483, -321412, -372734, -169955, 178950, 214409, 63445, 86456, -154777, -237206, -401901, -720339, -282251, 177440, 236706, 7773, -654999, -590334, -212161, -63388, 132365, 201118, 26688, -2967, -6039, -12046, 120135, 202074, 222225, 121960, 139816, 105005, -113028, -151760]
22214a51760m7890l12279J06115M84975J20019J79426k79080j79928j5765L49180
22204B53013N097l35561k06968M632N0681r9368O0632K87089M3482J71590J95371
22193D29690J6139j03637j85720k53409k54536J28967Q5555R9371J46293J1366
22183A20079Q8714J78619l22569k76366K21036R2857K95792j17846k89725J23460
22173A14051P9197J89008r2277l4731O7123J0893k48735J2362J89470j02629l06568
22162a22836j14783N8110M3752k90859o466K00679k29892j01221L09314n1823
22152c06025J99504K01310j12525j49328K22663J11136J07302o3136m00622j98733
22142c88454J43063N34382R9458j91530J28459R4100J28001j29582o28198k23137
$$ y = [-151760, -199650, -511929, -405814, 79161, 199180, 378606, 99526, -80402, -96167, 253013, 258110, -77451, -284419, -279787, -229106, -328474, -267842, 19247, 62729, 234319, 429690, 445829, 342192, 156472, -96937, -351473, -222506, -136951, -37580, 108713, 120079, 208793, 387412, 64843, -211523, 9513, 102370, 398162, 280316, -9409, 114051, 193248, 382256, 289979, 255248, 322371, 333264, 84529, 96891, 286361, 183732, -122836, -237619, -179509, -135757, -426616, -433082, -232403, -462295, -563516, -254202, -306025, -106521, 94789, -17736, -167064, 55599, 166735, 274037, 210901, -189721, -388454, -245391, 288991, 388449, 196919, 325378, 419478, 547479, 417897, -210301, -433438]
22132d33438p0826o1451K31726O58148K78145N2955m45063L3103r6359j49073
22122b133J9585J07482J0419q8043J19951K8280j9303o2715j06153J72489j0859
22111A69000j52279M192J95441L37410o8070O4452k98273n9651J44470r2215K28709
22100D73186j07423m55891m18102O4161m1043J69403P245j54459l1798M06334
22090h8387K08101p550j58955R3766j07165r7069J66620j85759k49815n7433K29105
22079b54541K46987l1271j34033j37361j23096L25972L28158L09527l30018N7991
22069B58315N42462q1483k75003K317k64794P0514K18909l62354k10417L45449
22059B43915p9225m3230j93543k58535p7417n0910O2757K98734K31273m08929
$$ y = [-433438, -504264, -565715, -333989, 324159, 602304, 655259, 210196, 243299, 146940, -2133, 17452, 124934, 135353, 47310, 167261, 195541, 176238, 113523, 7370, 179859, 169000, 16721, 20913, 216354, 553764, 485694, 550146, 251873, 192222, 336692, 244477, 473186, 365763, -90128, -508230, -444069, -485112, -315709, -308464, -462923, -494721, -88387, 119714, 112164, -46791, 46975, -60190, -157259, 9361, -176398, -426213, -483646, -254541, -7554, -38825, -172858, -310219, -433315, -107343, 220815, 530342, 200324, 258315, 800777, 719294, 444291, 446608, 181814, 252328, 471237, 108883, -101534, 243915, 164690, 121460, -72083, -330618, -408035, -458945, -396188, -97454, 133819, -275110]
22049b75110k02168K17733l311L3250r6897J43307L2189j51534J03961K23127
22039B4547j17518m5012N08675J12948j68139l00804j33726j9711K94617j3349
22029A42528J40610M58774r8479k91072k74353M5514J7106l0725j10682l3480
22019c4259j46713J04644J49111j19333k17966L3290M1884K908r9697q1211k1694
22008c89036j57378P5904L91360k75791k17949q4767j64807J22636k7831J1716
21998g15943L65442K24740j32071k31126k21960r9507N30657K48823j27151J88669
21988C0573n7718l610p8525M3149j32680J00129K64358j82143k9178L06199q0757
21977A79797k73570k05162O33981L55391k55269j39547n91241n85775J18923L31514
$$ y = [-275110, -477278, -259545, -262856, -229606, -326503, -183196, -151007, -302541, -198580, 24547, -92971, -137983, 370692, 483640, 315501, 14697, -119029, -138740, 155877, 142528, 283138, 741912, 643433, 352361, 78008, 123522, 140628, 109903, -779, -34259, -180972, -76328, 72783, -46550, -264516, -231226, -189342, -186434, -286131, -367342, -389036, -546414, -470510, -79150, -354941, -572890, -657657, -822464, -699828, -727659, -715943, -350501, -125761, -257832, -488958, -710918, -810425, -279768, -30945, -158096, 30573, -27145, -30755, -109280, -66131, -198811, -98682, 165676, -16467, -45645, 260554, 179797, -93773, -298935, 335046, 690437, 435168, 295621, -295620, -881395, -762472, -430958]
21967d30958J59598K51213R1279l0126l5471J38362L8622k80410k72637R5011
21957b75517J78537L4951K803K14531l6793m10441R6808K46201J51540L714K01107
21946D07441k29667p8892m0318J45554l90988l99669O23004M82951n0316j81266
21936B87834j75112k93666l01456j66919J72983M42653K61158l22288j43613M92071
21926B53645K40343l21212M4265R7207n4195j50932l39630K2507j49491M36439
21916G8946K2949j81296N5390J28957k7795K34458L70031j08397k41344L807J5478
21905C51184l55730l67809K97588j02748J41555L87129l88158n5695P2869q9831
21895a09646l3048r8666j02996m56922J00598L51185K24919l0987k4018j79971
$$ y = [-430958, -271360, -20147, 71132, 41006, 5535, 143897, 182519, -97891, -370528, -275517, -96980, -62029, -59226, 155305, 118512, -291929, -195121, 51080, 202620, 206334, 407441, 177774, 98882, 58564, 204118, -186870, -586539, 36465, 519416, 469100, 287834, 112722, -180944, -482400, -649319, -476336, -33683, 227475, -94813, -238426, 253645, 493988, 172776, 217041, 314248, 260053, 109121, -230509, -208002, -357493, 78946, 101895, -79401, -24011, 104946, 77151, 311609, 681640, 573243, 331899, 335706, 351184, -4546, -372355, -74767, -177515, -35960, 351169, -36989, -92684, -19815, -109646, -142694, -241360, -344356, -801278, -700680, -349495, -124576, -155563, -179581, -359552]
21885c59552j24144l14286J60913M93006J84344j70926J45368O042Q0192R2935
21875A93892j52733m16040j90460o9531q282J38148K19852M49055J06949o3003
21865B07847j34478o4123o1561r6660r0058L7575k5549k36574j04474M43661k0610
21854a45004L7665K94741j33457j8669n5762k57836k56821P2656J92978j21965
21844c91474K12222J53605l61110L9927R1871k52593J533j14133j43275K47975
21834e15452j83076m1414L33509M0653L10697J58748J0837K5214k36461r5644
21824a92389K96708J40713j1825N5328l03645n5549K45589p9328l11728j06240
21814c22366L4503P7648k7935M77665J19735m85065m00136p3404k8820J07091
$$ y = [-359552, -483696, -797982, -637069, -144063, 40281, -130645, 14723, 20765, 100957, 193892, 41159, -374881, -565341, -634872, -643154, -505006, -285154, 163901, 270850, 207847, 73369, 9246, -52315, -148975, -239033, -201458, -227007, -463581, -568055, -124394, -145004, -107339, 187402, 53945, 35276, -20486, -278322, -535143, -462487, -269509, -391474, -179252, -25647, -386757, -346830, -254959, -507552, -506019, -620152, -763427, -515452, -698528, -739942, -406433, -365780, -55083, 103665, 114502, 139716, -96745, -192389, 104319, 245032, 233207, 288535, -15110, -70659, 174930, 95602, -216126, -322366, -287863, -210215, -238150, 239515, 359250, -125815, -525951, -599355, -628175, -521084]
21804e21084K20623o2891O4461N8164L80606L48596j06409j70177j10310l31532
21794b29953J58414J29457M03941Q8530n17612l23630j72450J48832K92846J807
21784a9818p6158L4463K23430K48011K00066M2526j89621j86100K04045j64277
21774C16567J39957p4761k79004R0990L21455j36029k67161m93779j61552R2073
21764d51244K94739O700K9434q2448l07780K39930O28462j3311l56549j6353L8521
21753A0101j09401p0388J22362l5723r6987M97504J06513k77436l20682k17069
21743c91206J27806O6770J24126K61744m7310k49150K7721K71501J30466k67959
21733E4509J75220K20057m68616n92147j4961k47611K84992M92727J91962j06790
$$ y = [-521084, -300461, -363352, -298891, -240727, 139879, 488475, 382066, 211889, 101579, -229953, -71539, 57918, 461859, 550389, 32777, -290853, -463303, -314471, -21625, -19818, -95976, -61513, 161917, 409928, 609994, 652520, 462899, 276799, 480844, 316567, 456524, 381763, 102759, 193749, 515204, 379175, 112014, -381765, -543317, -451244, -156505, -149805, -120371, -202819, -510599, -270669, 357793, 344482, -12067, -28420, 10101, -99300, -169688, -47326, -83049, -180036, 317468, 423981, 146545, -174137, -391206, -263400, -196630, -72504, 189240, 141930, -107220, -79499, 192002, 322468, 54509, 229729, 449786, -18830, -610977, -625938, -873549, -588557, -95830, 96132, -10658]
21723a0658L019l9072R4590K01150J5969K33557L15789j51873o7838j94285J22357
21712E22705R4367k56629m19679m2092J95787J90737j70181j29754o3473j91616
21702b69828p0014l20020Q164K71056L35890O01276J71814l23468q9489j13210
21692B02171j97445l092K52713P6124J09837L6276l60192n00299n6398K14688
21682b25617K95155J8612j32068J76183L6713J86659O873O6220k83071k95458
21672a49799k35108j83128k65895K27096L10341M30209k97881l71503K22481L40886
21662B7699P8364O0046J01880n5283j77394j46969j88136k34265K05675J33664
21652a94719M2670l18343K88806K71919k22455k54993j39051K10574P380m4368
$$ y = [-10658, -7639, -46711, 47879, 249029, 264998, 498555, 814344, 662471, 594633, 400348, 522705, 617072, 360443, -59236, -101328, 94459, 285196, 115015, -14739, -78212, -269828, -339842, -659862, -651698, -380642, -44752, 556524, 728338, 404870, 315381, 202171, 4726, 1634, 254347, 330471, 440308, 476584, 116392, -383907, -440305, -225617, 69538, 88150, -43918, 132265, 168978, 355637, 362510, 428730, 145659, -149799, -384907, -568035, -833930, -606834, -296493, 133716, -164165, -535668, -313187, 27699, 106063, 166109, 267989, 212706, 35312, -111657, -299793, -534058, -328383, -194719, -152049, -470392, -181586, 90333, -132122, -387115, -526166, -315592, -308212, -352580]
21642c52580l519l0990L2202J58101p0150k00219K9334J03135L90542Q3979o20903
21631d81068O582M16948L01083K04096J40088o8542j66063k30337j46048j32827
21621a56088M92897Q3235k63450L0986J71197k23772j14354k58552r8022j3517
21611c49440J35162K86073k40118K1658j05120J14845K86015j59977j25793J70926
21601C4231K01194P9748M5320l87664j33289J00243k83701Q6779k01752n2309
21591e11200K01135K17839L01499j2176j49874J82860n0000K74649j0554m360
21581D39818k72191k15512k5888n823J78062R9999k04572j967k9141j1215k42641
21570b91071J319J12927m457n4334m36397K45739L2211J60129K61760r2421j01692
$$ y = [-352580, -356099, -387089, -354887, -196786, -266936, -467155, -437821, -334686, 55856, 139835, -481068, -474486, -57538, 243545, 447641, 587729, 519187, 353124, 122787, -23261, -156088, 336809, 420044, 156594, 187580, 358777, 135005, 20651, -237901, -335923, -349440, -214278, 71795, -168323, -146665, -251785, -136940, 149075, -10902, -136695, 34231, 235425, 315173, 360493, -27171, -160460, -60217, -343918, -257139, -458891, -511200, -310065, -92226, 209273, 197097, 47223, 230083, 180083, 454732, 444178, 439818, 167627, -47885, -73773, -79596, 98466, 198465, -6107, -8074, -37215, -48430, -291071, -289752, -176825, -181282, -235616, -672013, -426274, -394063, -233934, 27826, -64595, -166287]
21559a66287L13157o2698j77325J50818J83179N9009K00545j40052M809k70533
21549I4622r365j52424o4025j2517L02302k64273j95130p326p6130L5688l60130
21538g08708q1092J02767K24133J02894j10243J37734J01455Q7754K08379j04102
21528c9029n735L27248K29042q1284L1900l25332K85598m6153j77154j26940M7715
21517A19876k2177L86617j78933p5059Q1263N2525m28181l57147Q916J66019m0342
21506b86623l56718K50952K32435k49073l7883J62132L19403M15323J06102K1310
21496E77360o8047m13990l82731K05921K44821j96470k14437K1806K83004j59195
21486a01958p1201q6885K03129K45214p8927K00735K43345r7705l65473K35020
$$ y = [-166287, 146870, 84172, -93153, 57665, 240844, 299853, 500398, 360346, 365155, 94622, 85257, -67167, -131192, -143709, 158593, -105680, -300810, -308136, -384266, -348578, -708708, -789800, -687033, -462900, -360006, -470249, -332515, -231060, -143306, 65073, -39029, -44764, 282484, 511526, 430242, 462142, 136810, 422408, 376255, 199101, 72161, 119876, 97699, 484316, 305383, 230324, 311587, 364112, -64069, -421216, -412300, -246281, -286623, -643341, -392389, -159954, -409027, -446910, -284778, 34625, 449948, 556050, 577360, 509313, 95323, -287408, -81487, 163334, -33136, -247573, -225767, 57237, -101958, -173159, -260044, -56915, 188299, 109372, 310107, 553452, 455747, 90274, 325294]
21476C25294J72786O9882r1561m04794l24091O5860J10618K42667J32852j9341
21466B80172k22948L73218o2628M4532k50325j62916J94820K31542R7743p3010
21456D50200l07290m10069l33227K6794L11008K21318l002M24570o6238k16672
21446I7392q6221j00029N9847j66561j24816J09347N2756J71072L2571J4757o10705
21435e50590k02808N17732Q8638J59466k8847k83701L0167J13907k7732J28923
21425e4845j05207k52729P2183l6205J4623J83413L01194l07214n4268j47631
21415c86686K63529K2118K34343J14724N0178j00463j72651K36882J18639n8330
21405C22283j17151K1007J20387P5838l74421m0781k96347k62245K03510k31642
$$ y = [325294, 498080, 567962, 476401, 71607, -252484, -186624, -76006, 166661, 299513, 280172, 57224, 430442, 367814, 412346, 162021, -895, 193925, 425467, 523210, 450200, 142910, -267159, -600386, -573592, -262584, -41266, -44268, 380302, 314064, 97392, 11171, -88858, -29011, -195572, -320388, -211041, -158285, 12787, 45358, 60115, -550590, -753398, -235666, -147028, 12438, -16409, -300110, -269943, -156036, -183768, -54845, -160052, -412781, -340598, -376803, -362180, -178767, 122427, -184787, -239055, -386686, -123157, -101039, 133304, 248028, 298206, 197743, 25092, 261974, 380613, 322283, 205132, 226139, 346526, 422364, 47943, 7162, -289185, -551430, -347920, -579562]
21395e79562R5947K12812K84880P821R0071L61304k83341o1063O4098o103k1504
21384A65360j06194K61715J0843m7997k04738k47690L42584M2489L51080J31076
21374F98528k42193k42603k62141k73490N5876J6804J98767J29463k11128L7567
21364i4550L1588o8699K52950q2965p7664J1630J51275N0205j10647K3576l32283
21353b45584r3464j54548j44898L67737j00461k38549J26268p6607j99302k4020
21343g83428L35559M93753K53474O014j26888j12138N06077J73598j79086m07726
21333A59209l52275l32718L76762P1668k3061J50888j3861m31028j54440K67J57794
21322c90795N3169J6749J97804K25742p4012p9314j7673M2893L01241k65559m72093
$$ y = [-579562, -483615, -270803, 14077, 21898, 111969, 473273, 189932, 128869, 192967, 186864, 165360, 59166, 320881, 331724, 283727, 78989, -168701, 173883, 216372, 567452, 698528, 456335, 213732, -48409, -321899, -266023, -249219, -50452, 79011, -132117, -94550, -62962, -131661, 121289, 38324, -39340, -27710, 123565, 173770, 63123, 86699, -245584, -339048, -493596, -638494, -270757, -371218, -609767, -483499, -560106, -759408, -783428, -447869, 45884, 299358, 305372, 178484, 66346, 572423, 746021, 566935, 159209, -193066, -525784, -149022, -77354, -100415, 50473, 36612, -394416, -548856, -548589, -390795, -337626, -320877, -123073, 102669, 28657, -50657, -68330, -25437, 275804, 10245, -461848]
21311d61848j49662K81685N44064J6553J6354j92722R2125K87990j93335n67546
21301c26342k0079M53887O17921j64890l77065k27884k46321j79261J68974J51699
21291a49361M78392j26940k36780L5420K9366k4237M7468J72303n04352m60078
21281g38799O5520L0998M49377M32650K70719K59674O0297l99069P810k6089q3289
21270C29799K32815J72625j18092o02363k71641K82987n4177l71877L49877P4902
21260B4855j05123L4156o4812K176j13618K09289K41572j65630j45436j60721
21250b43292j42522M51920K64215q0171j937k21737j68874J67559J99897o882
21240B18176O6304K4400m59103l42789J82177J36031k73645l43594k05630L44007
$$ y = [-461848, -611510, -329825, 214239, 230792, 247146, 54424, 146549, 434539, 241204, -326342, -346421, 107466, 725387, 560497, 183432, -44452, -290773, -470034, -301060, -149361, 329031, 202091, -34689, 731, 30097, 5860, 53328, 225631, -278721, -738799, -673279, -642281, -192904, 239746, 510465, 770139, 830436, 431367, 439177, 413088, 329799, 562614, 735239, 617147, 14784, -256857, 26130, -28047, -399924, -50047, 24855, -80268, -46112, -110924, -108748, -222366, -13077, 228495, 62865, -82571, -243292, -385814, 66106, 330321, 250150, 248213, 26476, -142398, 25161, 225058, 218176, 284480, 308880, -150223, -493012, -310835, -174804, -448449, -792043, -997673, -653666]
21230f53666K87322N2647P9672j76116l1771j7327L711L03768k9378n47013J13073
21219f15078M16109L9590m11l8613J83427P1422k2218k68584r5528J35647K67219
21208G2982l74121j79439L3676j78564n1573K01620K83284m7345N4897K48967
21198F4384J69102J38699J12333L8206n09039j24947j1850j20907q5698K95023
21188c4694o4098O751L60771j42215m6700m60636p6517J97671J40760K2108q0372
21177a77171K02245L08603N3513j89672j59123O9855K85451K2079o9891j22801
21167B23088M9576k37851L1573J50119p0600Q4283j18764o3828J32682j01364
21157G8914j61975J92579R7998L8102l23244m35360J25955L17242J68451p7977
$$ y = [-653666, -366344, -313697, -234025, -410141, -441912, -459239, -455528, -151760, -181138, -728151, -615078, -198969, -159379, -159790, -198403, -14976, 56446, 34228, -234356, -329884, -194237, 72982, -301139, -480578, -446902, -625466, -677039, -475419, -192135, -239480, -184583, 64384, 233486, 372185, 484518, 522724, 13685, -111262, -123112, -244019, -329717, -34694, -98792, -92041, 268730, 126515, 79815, -380821, -457338, -259667, -118907, -96799, -177171, 25074, 333677, 387190, 197518, 38395, 108250, 393701, 415780, 345889, 223088, 272664, 34813, 66386, 216505, 145905, 230188, 111424, 47596, 180278, 78914, -83061, 109518, 207516, 245618, -77626, -512986, -387031, -69789, 98662, 20685]
21147B0685J98563j59339j426J08083k74681o06560L70960K94607l4881n05460
21137e89449J55534L01337j9831n7659q6961J23610p1212l35782l54613J28142
21127h06884K45893k5129r9348L10698N72633K00807P3763k30538k22870J22622
21117A41647R5795k01843M7323J05425K2322K6844k37468j98128j92843J02299
21107b88627J79841M6194k84273K73457j5644L2466J51149k33002o0622j2502
21097b11563q0147q7503J39959J49493K31306J06053m7715j77427k50075l86899
21087f14518k71333J40134N5474K63985K31125J77503l6059k3966Q1272K26394
21077B30011p2137k16858N74318j1794k84836m26059J18471J88565l4196O4703
$$ y = [20685, 219248, 59909, 58483, 166566, -108115, -714675, -343715, -49108, -83989, -589449, -433915, -132578, -152409, -210068, -297029, -173419, -244631, -580413, -935026, -806884, -560991, -586120, -685468, -374770, 197863, 398670, 472433, 241895, 19025, 141647, 237442, 35599, 82922, 188347, 210669, 237513, 45, -198083, -390926, -288627, -108786, -62592, -346865, -73408, -89052, -56586, 94563, -138439, -199061, -211563, -291710, -379213, -239254, -89761, 141545, 247598, 199883, 22456, -227619, -614518, -885851, -745717, -690243, -426258, -195133, -17630, -53689, -77655, 3617, 230011, 157874, -58984, 515334, 503540, 218704, -207355, -88884, 99681, 65485, 130188]
21067A30188R8498j90857K11148l7544l22172j86095O1445R2578J19325L0532
21057G046K48732k11152n8476k37377j95169K10475J66950l07390J28799j5874
21047b63436J02729L5930N4339J1989j09839k152J79179p2226O5805J64806n3220
21036A13904j71821O9804j13276r3592Q7747P0517K800M01424J07435l1267j54389
21025B89286m0674K3825j5207l21761k13864l75L68639l28462l21037J38790j8853
21014d39693J23456L06062L63453j02447o4717J75838n8822j14137l64495j62186
21004c37688K8140L83195J87815J5736k8686j28488k00284P9119m29263k6491
20994d56895j1667L81862J53429m20091k01583j54142j43841J74664L26077J04548
$$ y = [130188, 228686, 37829, 248977, 211433, -110739, -296834, -235389, -142811, -23486, 7046, 255778, 44626, -13850, -251227, -446396, -235921, -68971, -376361, -247562, -263436, -160707, -124777, -70438, -58449, -168288, -170440, 8739, -63487, 2318, 167124, 113904, -57917, 11887, -101389, -194981, -107234, -36717, -33917, 367507, 474942, 443675, 289286, 248612, 272437, 257230, -64531, -278395, -278770, 89869, -238593, -559630, -420840, -439693, -316237, -10175, 353278, 250831, 186114, 361952, 303130, 188993, -175502, -337688, -309548, 73647, 261462, 277198, 248512, 120024, -80260, -1141, -430404, -456895, -468562, -86700, 66729, -353362, -554945, -709087, -852928, -678264, -352187, -247639]
20984b47639L06574k1387m2077L60756K10185j16789k47717j70526Q665q6112
20974d6067p0431k6641j77089J81453k6032j63550L72814p5198L65934K00292
20964E35485R7307r9709j25864j6973n4998K45440N3138n11539p8022L06167M9867
20953D00299O5283l07501k34104J02671j3928J14234J454j99243l1525L0113R4670
20942B2423l1564m6273k24733O1798j6792j33515n4177J4878K15090L95896J40166
20931C43197K19098l9204m2088l31436L30295j02617l15759J1666K62036l71545
20921c6357r896m7382m6885R6035J24356k88920k51068j05185K15465L21115K29455
20910B00733m8657L76912K2144j14836j8955l04955k59438n8359j28477n75l6719
$$ y = [-247639, 58935, 37548, -4529, 356227, 566412, 449623, 201906, 31380, 40045, -46067, -116498, -143139, -320228, -138775, -164807, -328357, 44457, -30741, 335193, 535485, 632792, 533083, 407219, 390246, 335248, 580688, 633826, 122287, 44265, 350432, 400299, 465582, 158081, -76023, 26648, 12720, 126954, 128408, -70835, -102360, -72247, 22423, -9141, -55414, -280147, -218349, -235141, -368656, -422833, -407955, -192865, 203031, 343197, 562295, 523091, 481003, 149567, 479862, 377245, 61486, 73152, 335188, -36357, -46253, -93635, -140520, -44485, 79871, -209049, -460117, -565302, -349837, -28722, 200733, 152076, 528988, 551132, 436296, 417341, 112386, -147052, -205411, -333888, -334463, -371182]
20899c71182K43705k83256m33204K45825N10401M35307K65143n3995l96610m10374
20889b48240j47370J8688j29091R7817Q6065M87850M06925k96464j78788l33932
20879b36540j96252k5783J08983K62272k1057j59254j40668P7569L57840K4147
20869E1257m1564R4017N7881k99361J85505L50534j2825j51379k44168r3204J49904
20858D6597k47590N5453J31162k36204o5905m7912L53498P0847j18707j33617
20848a92378R1215R8094P8307k95251r3873p2110j52933j14819K08503J48196
20838b97049L11121N0472j57758k91343p5274J76202N15060K46968j92218p2309
20828B13872J45175J00096k12029J31393J41720k04338J2214K56786q2613l04857
$$ y = [-371182, -127477, -410733, -843937, -598112, -87711, 347596, 612739, 558744, 162134, -248240, -395610, -376922, -506013, -408196, -322131, 165719, 572644, 276180, 97392, -236540, -432792, -458575, -349592, -87320, -108377, -267631, -408299, -330730, 27110, 51257, 9693, 103710, 161591, -137770, 47735, 398269, 385444, 234065, -10103, -103307, 46597, -200993, -145540, -14378, -250582, -316487, -364399, -10901, 59946, -58761, -192378, -101163, -3069, 75238, -220013, -313886, -385996, -538929, -653748, -445245, -297049, 14072, 64544, -93214, -384557, -459831, -283629, 231431, 478399, 286181, 213872, 359047, 459143, 247114, 378507, 520227, 315889, 328103, 584889, 502276, 197419]
20818A97419J90567L42885P6396n14355j45299K90527j47195l81153l82913K39583
20808b33538K49630J235M5454k3963K67010k6398l4273l52062n1841n9598j00745
20797c19089J22714L7569j22861J06853K24579n1222R9099j89458J1166k86074
20787c66724J6848j62592N1586n3164J09973K71728K24172k4892N2988M11464
20777E31387j31244k06465n91K35511j55883q9800J72884l1521k08733j63460
20767d7915p0074R3563J35048K67996L27897k32851k68766m37867M7243J60877
20757b4849J98286J4572L6808j58677k079j3295L1121J40131J33903n9553J00131
20746C96499o3731j41287l37556k06301R1061K02635k18750l54433J61920p9473
$$ y = [197419, 387986, 730871, 807267, 292912, 147613, 438140, 290945, -90208, -473121, -233538, 16092, 17327, 62781, 38818, 305828, 279430, 245157, -106905, -158746, -218344, -319089, -196375, -158806, -281667, -174814, 49765, -1457, 97642, -91816, -80650, -366724, -349876, -512468, -460882, -514046, -404073, -132345, 91827, 66935, 119923, 531387, 400143, 193678, 193087, 428598, 272715, 182915, 355799, 324278, 115545, -47915, -117989, -24426, 110622, 378618, 706515, 473664, 204898, -232969, -185726, -24849, 173437, 188009, 224817, 66140, 64061, 50766, 81887, 222018, 355921, 296368, 396499, 332768, 191481, -146075, -352376, -261315, -58680, -277430, -631863, -469943, -549416]
20736e49416j81612J84182j89527p0496L04417N1360p29J17369J48602O9198j62512
20725b79164j89799q5645J29449N09028L54374q7684n6314k97177K29146K33236
20715D59450J06156l15674j34651L68348p5702p8131J00620r8285j96372m30064
20705b94305j46887K38347k8627k56885M8480p8228R9841K26294l43260O1318
20695d73912p4053O6879L49212j12651J69356K66998k22249r8403L49396j502
20685B19071l55953l43886K37235l2148j95514K35416J92799j31386l16732k4656
20675e15754N33217J29619J42394J84713q9373k94056j26983m30029r7339K00525
20665c63066J29872m30548O7219K77286J23235m9843L68034j25801j13206J81697
$$ y = [-549416, -731028, -546846, -736373, -806869, -502452, -451092, -451821, -334452, -185850, -116652, -279164, -468963, -554608, -425159, 83869, 438243, 350559, 294245, -2932, 226214, 459450, 565606, 249932, 115281, 483629, 407927, 329796, 430416, 332131, 135759, -294305, -441192, -202845, -231472, -488357, -439877, -518105, -418264, -191970, -535230, -473912, -547965, -481086, -131874, -244525, -75169, 191829, -30420, -128823, 220573, 219071, -136882, -480768, -243533, -275681, -471195, -235779, -42980, -174366, -491098, -515754, 17463, 147082, 289476, 474189, 384816, 90760, -36223, -466252, -563591, -363066, -233194, -663742, -596523, -319237, -196002, -245845, 122189, -3612, -116818, 64879]
20655F4879K17620j60419m13302L9726J48551k38767K13624L5989j20566r8373
20645c11038J64288j17949o8653j63609N38740N19702J83102l65941m10147k88049
20635c19554n3571K44923P9986o4303j64014j92246k23930J7728l8786j14151
20625h27918K59855L8704k16881J95309L551j41133L19989k1803k14959j88519
20615g93805K81143L57328j16554m78645R7714J49407K13870R8023K98721J97559
20605C04761l41391n56349j43379J06454L432J75584L06098L74951j21125l27936
20595b18900k24629J30742L56002K56280M2108Q9480j78798l08171J43315k94001
20585b06572l4035M48161L5044l4741K18372m17483l93474K03742Q6903L73483
$$ y = [64879, 282499, 122080, -291222, -251496, -102945, -341712, -128088, -92099, -212665, -311038, -146750, -264699, -333352, -496961, 41779, 561481, 744583, 378642, -31505, -319554, -373125, -128202, -48216, -112519, -276533, -468779, -692709, -674981, -713767, -827918, -568063, -529359, -746240, -550931, -547380, -688513, -368524, -390327, -605286, -793805, -512662, -155334, -271888, -750533, -652819, -503412, -289542, -191519, 107202, 304761, -36630, -592979, -736358, -629904, -626472, -450888, -144790, 230161, 109036, -218900, -443529, -312787, 43215, 299495, 341603, 431083, 252285, -55886, 87429, -206572, -240607, 207554, 242598, 207857, 426229, 8746, -384728, -180986, -94083, 279400]
20575B79400o0566j28390m2274K24267K38286M0691j1271o854P6586k44278J45765
20564E11362P864k3152M0616o67068n03279j07531l5317L94725K42109k5438J70742
20553E633j18170l53201j16185r2383p784J07767M47030K92830q5200O4231o0805
20542H3763m23739p4387Q6324k3091J66176Q1970j58590M8347P1297q8526k511
20531b32967J93995j75429j98840j92473J49032J65529L13613L25128j46776l12335
20521a11523j63251J07891M1633J51752J24162r8114l7000K518l55602j1147K29346
20510a19335n9455n3063J35474o1197j3341N8868m54347J66637J94539N88236
20500C83016j26646k59933j68664m4208J41554o129L02465O11028J42629j53815
$$ y = [279400, 218834, 90444, 48170, 272437, 510723, 551414, 540143, 533289, 609875, 365597, 511362, 519226, 496074, 536690, -130378, -633657, -741188, -776505, -381780, -139671, -165109, 5633, -112537, -465738, -581923, -674306, -682090, -574323, -127293, 165537, 80337, 144568, 83763, -339976, -414363, -328039, -351130, -184954, -102984, -261574, -213227, -141930, -230456, -232967, -38972, -214401, -413241, -605714, -456682, -291153, 22460, 347588, 200812, -111523, -274774, -166883, -125250, 26502, 150664, 52550, 15550, 18068, -337534, -348681, -119335, -178790, -231853, -96379, -157576, -170917, -112049, -566396, -399759, -205220, 383016, 256370, -3563, -172227, -216435, -74881, -81010, 221455, 832483, 975112, 821297]
20490H21297j81118K52493k33149k34983k84378j14031j4305N971L6320J35894
20480A90011K97589l05881l1130L61163k29111k85355K3982j3602l66507J00074
20470b58767M27340q6007j51302J78945L05125l52945k23497M4015n7101M0200
20460a33994k30751J10420K03160q2722o0169K8440N2619K564J68824o5294m9957
20449e6860J4933Q8687L0876K8863n2892k97485k36743k06099Q3583J30962J96113
20438b76062J63052J35622M373k2895K91360M21908K82437l00272n93912k74372
20428a68761M2946J32390J78405K36963j46752j43298j8697j39120K93628J75677
20418D43381k56382j39272J16874J44032k05550k40661k28855k08740k227J12238
$$ y = [821297, 640179, 892672, 659523, 424540, 140162, 26131, 11826, 17797, 54117, 190011, 487600, 181719, 150589, 511752, 282641, -2714, 21268, 7666, -358841, -258767, 168573, 82566, -68736, 110209, 415334, 62389, -161108, -117093, -174194, -133994, -364745, -254325, -51165, -133887, -194056, -165616, -112997, -110433, 58391, -6903, -56860, -41927, 46760, 77636, 106499, 53607, -243878, -480621, -686720, -603137, -472175, -276062, -113010, 22612, 26985, 4090, 295450, 717358, 999795, 699523, 105611, -168761, -125815, 6575, 184980, 421943, 275191, 131893, 113196, -25924, 267704, 443381, 186999, 47727, 164601, 308633, 103083, -137578, -366433, -575173, -577400, -465162]
20408d65162m403J30515J98866N121K5195M6858j21964K60774J72786J63326J4235
20397D26147l81688j14740o973Q4801L75208l53378j72773J03814J04531k24190
20387a59241q6855K51743j55390J69858R7041o5682J65518j23716l69352k41785
20377e17861L12066K98374L02546K19551L44371k54504l61527j12003k86712k32070
20367b87769j13172P2901J8848j38108J91831N5359j00358L58915m9829l00745
20357b92127J78729L90856p7346j61652k86886k77775o8738P597K63406L02923
20347b1013O3879J02519j54014j13292L41677J22615K3544J05112K39469j63485
20337E47011m98326P0287O31R3873L86562J36491l80954n7810j07422k28605J79995
$$ y = [-465162, -469565, -339050, -140184, -135063, -109868, -63010, -184974, 75800, 248586, 411912, 426147, 44459, -70281, -77254, 7547, 382755, 29377, -143396, -39582, 64949, -159241, -246096, 5647, -149743, 20115, 117156, 51474, 216992, 93276, -276076, -517861, -205795, 92579, 395125, 614676, 959047, 704543, 343016, 231013, -55699, -287769, -400941, -328040, -309192, -447300, -255469, -200110, -300468, 58447, 8618, -292127, -113398, 277458, 200112, 38460, -248426, -526201, -594939, -587342, -323936, -21013, 42866, 145385, -8629, -121921, 219756, 342371, 365915, 471027, 710496, 547011, 48685, 118972, 119603, 213476, 600038, 736529, 355575, 297765, 190343, -38262, 141733]
20326A41733L81985l34076r8589j04992j03308J93491N7594p1989L75800L7242
20316D74891L5403j03108K0439J56900k87277l86809j51409R2445l242J90137
20306C8370k94737J46001K25865K89762J2419j13665j80232l18515o636K49519
20296D8151k57359k92305O7259N04489j09285j70307k27093L77580L35157j95806
20286H0481n0996J66017K5848n8631j5237J28722j56835l40965K18772L50040
20276C47216j25916k37969o2732J3741m4356K7383O07357r7346l36199n00631
20266d09452K77071q6660J11605j76916J05006K14024j31342J08259J22673L5188
20256A69456J199J97992J28934J9640m8263J14114j27488r2502j96603J89704
$$ y = [141733, 523718, 189642, 91053, -13939, -117247, 76244, 133838, 61849, 437649, 474891, 510294, 407186, 427625, 584525, 297248, -89561, -240970, -148525, -151767, 38370, -256367, -110366, 115499, 405261, 417680, 304015, 123783, -194732, -201368, 48151, -209208, -501513, -434254, 70235, -39050, -209357, -436450, -58870, 276287, 80481, 29485, 195502, 221350, 162719, 147482, 276204, 119369, -221596, -2824, 347216, 221300, -16669, -79401, -65660, -110016, -82633, 524724, 427378, 91179, -409452, -132381, -219041, -107436, -284352, -179346, 34678, -96664, 11595, 134268, 169456, 170655, 368647, 497581, 517221, 468958, 583072, 455584, 363082, 166479, 356183]
20246C56183p6665N615n6488k10239j0758J45310J19648j21010J77930K5942j88928
20235A66540n0297J07789o0816j90225r1680K33357J55650k33293n454J02317
20225A33888k27984J55419J88685j13462r8249J93767K44248l38575n6618K2690
20215A03809j45119n4047L43781L24387j4365N6307J11919J9247K904m55344L5995
20204C29474M05572K33499J75983O5770m30393L535M46769L14663K272m29109
20194A118035n2934N80172K79462K12312k5111l05767l93154k92705j3838J9206
20184A125678L50467K05536j05610l29121k76547L70644J07895l64849l23367
20175G60726J21751J56251p8647K22254M86331j85730J0286K7278k79370k01284
$$ y = [356183, 279518, 285133, 228645, 18406, 7648, 152958, 272606, 151596, 329526, 355468, 166540, 116243, 224032, 163216, -27009, -118689, 114668, 270318, 37025, 31571, 133888, -94096, 61323, 250008, 136546, 38297, 232064, 476312, 137737, 81119, 103809, -41310, -95357, 248424, 572811, 558446, 614753, 726672, 745919, 748823, 293479, 329474, 735046, 968545, 1144528, 1210298, 779905, 783440, 1230209, 1544872, 1547144, 1118035, 1065101, 1645273, 1924735, 2137047, 2111936, 1806169, 1413015, 1120310, 1106472, 1125678, 1476145, 1681681, 1576071, 1246950, 970403, 1341047, 1448942, 1084093, 760726, 882477, 1038728, 960081, 1182335, 1668666, 1482936, 1493222, 1520500, 1241130, 1039846]
20165A039846j03322K03647j73876m31387J73295L04652r6518l29161n5897Q86316
20155A417595M44677K64008J03631J72944O2952m8914l7235p5457k49611p2527
20145A982063m5116l32314k13254k64546m68906k0001J84915K09630j69876k48518
20135F14077l79825r4370J00204P4149k074k22059N6039M33558M30584j77795
20125H32488l01155j32817L4852J8205j67748J34481j8214l2131p4270R5283P630
20114C96604j14925J94179J08082j52646J03532K6247j26574l23058Q4707K93271
20104D89419q3776n1550q4679J61880L0439j90633r2141k20872k24493j69295
20094d35701J10772O8471J70569L04180K38484n66607K1731R6937J19660n0439
$$ y = [1039846, 936524, 1140171, 966295, 534908, 708203, 1012855, 916337, 587176, 531279, 1417595, 1862272, 2126280, 2229911, 2402855, 2465807, 2416893, 2379658, 2304201, 2054590, 1982063, 1936947, 1604633, 1391379, 1126833, 657927, 637926, 822841, 1032471, 862595, 614077, 234252, 139882, 240086, 314235, 312161, 90102, 146141, 579699, 1010283, 832488, 531333, 398516, 433368, 451573, 283825, 418306, 400092, 367961, 293691, 388974, 396604, 281679, 475858, 583940, 431294, 534826, 561073, 434499, 111441, 196148, 489419, 405643, 354093, 269414, 431294, 461733, 271100, 178959, -41913, -266406, -435701, -324929, -256458, -85889, 218291, 456775, -109832, -88101, 8836, 128496, 78057]
20084G8057k00607k53323K212j21220K33081N43103l2343j68529q7880m1375O9359
20073B0535Q8777K38598P6496J61095M14923q3782l29692k16258j85870j73019
20063A1803J34885j99929j92519N46325R8530J74311k95164j18283Q4565K96892
20053E41416J36565o3855j15588p837Q3915P1600m01510l79935K53009O2528K15434
20042C95742L84351m59549l55920k87823J37608N32214j78951J06098J60257L6389
20032D70416p3792j27694k97110l9160J55436j85251j08364P4281q9884J57902
20022f3220r2738J10544M6492n3904k051K88203m7386j58037J51310K83796k8510
20011D34499l29447j88870j8652M75444K99373j68934k74272L9031l0229J61397
$$ y = [78057, -122550, -375873, -373661, -494881, -261800, 281303, 248960, 80431, -7449, -48824, 20535, 109312, 347910, 424406, 585501, 1000424, 916642, 586950, 370692, 184822, 11803, 146688, -53241, -245760, 300565, 399095, 573406, 278242, 159959, 244524, 541416, 677981, 614126, 498538, 490701, 574616, 646216, 244706, -135229, 117780, 180308, 395742, 780093, 320544, -35376, -323199, -185591, 346623, 167672, 273770, 434027, 470416, 396624, 268930, -28180, -67340, 88096, -97155, -205519, -131238, -221122, -63220, -155958, -45414, 1078, -52826, -54877, 233326, 185940, 27903, 179213, 463009, 434499, 105052, -83818, -102470, 372974, 672347, 503413, 229141, 268172, 237943, 399340]
20001C99340K2651j47879j51342k59046J16934R493L98828L86920j29679j60258
19991D85962P8402K70465j48419j76323j06520M03093k48901o31522k45178K11609
19981a07332O4567J73362J62858J02717k0474j90256r7094K35588J38554j49343
19971C13147R7983j38988O0566l0691J6030N16416p4566j17192j67381J10249
19961E85573k61152j41978j65599J89731J24945j04037J55029J80518K69718k56499
19951E76249m82802j66291j19940j93307Q5585k0521M10298J36699L3484o8932
19941A90522o2916L3174O6203K06951r7525j68063j90566J7082J50967R2458M744
19930B43031l54791j28109M54344N1475j88726p6454j13865j17701J42276p8489
$$ y = [399340, 421991, 274112, 122770, -136276, -19342, -9849, 388979, 775899, 646220, 485962, 564364, 834829, 686410, 510087, 403567, 806660, 557759, -73763, -318941, -107332, -42765, 130597, 293455, 396172, 375698, 185442, 88348, 323936, 462490, 313147, 411130, 272142, 332708, 302017, 318047, 834463, 759897, 642705, 475324, 585573, 324421, 182443, 16844, 206575, 331520, 227483, 382512, 563030, 832748, 576249, 93447, -72844, -192784, -386091, -300506, -321027, 89271, 225970, 259454, 190522, 127606, 160780, 226983, 433934, 336409, 168346, -22220, -5138, 145829, 238287, 243031, -111760, -239869, 214475, 265950, 77224, 770, -113095, -230796, -88520, -167009]
19920a67009o4807n5598J98393J99855j63796K16320K53124J71229q1808L61721
19910H67624r8892m7911j62444K2080J50525j08730k2517M6230J35887k57304
19900E24548l10886j62212l54329R5444M63090k2799M38475l03170l0710J0449
19890C47900j9530p3150K9179J43658J38825R8355j44949m8511n6605k07663K0081
19879B27590J08925r5609Q509j11334p0722J96756K77199K6256J60411M5530r3575
19868F79936k8977n726o0533j50874o2737l61384n9200L99371M48085J89348k59604
19857G27705K17164K6301j08917k01049J33869m80594J59889L11518j23566J06464
19847G68784J29615j87421m30O2410q457l57890k95172Q2599K3860j69949P8541
$$ y = [-167009, -231816, -287414, -89021, 110834, -52962, 163358, 416482, 587711, 505903, 867624, 768732, 720821, 558377, 580457, 730982, 622252, 599735, 645965, 781852, 524548, 213662, 51450, -302879, -207435, 255655, 232856, 671331, 368161, 337451, 347900, 328370, 255220, 284399, 428057, 566882, 665237, 520288, 471777, 415172, 207509, 227590, 336515, 240906, 249415, 138081, 67359, 264115, 541314, 567570, 727981, 773511, 679936, 650959, 645233, 584700, 433826, 371089, 9705, -49495, 349876, 797961, 987309, 727705, 944869, 971170, 862253, 661204, 795073, 314479, 474368, 785886, 662320, 768784, 898399, 710978, 710548, 772958, 764501, 406611, 111439, 194038, 217898, 47949, 126490]
19836A26490J95836j78246O2289K86277r6671j73288k86424k7019J20072O5735
19826I5051J8888j88128M41814N24229j56597j40600L16591O1186K22241J03409
19816A298084o8799J05850j18721l83893k56794k70520J99L47600k2158J8942
19806F49790k26346k2191K67831k6044L36878K58068n35369j23935O310J55478
19796G40470L8275k10263k03970r0943L08303L84012j2927k28494j88980j7785
19786E17698M7260K05685k42559j33289M34657K39278k55528Q9974q4405j44430
19776F74341j31222J94484R2993L35320O171j05017J92456N34567J25371k01193
19766A718271n0551k38250m55149l9301M61040K17528k24695l48686O0671K0330
$$ y = [126490, 322326, 144080, 206369, 492646, 395975, 222687, -63737, -90756, 29316, 95051, 113939, -74189, 367625, 891854, 735257, 594657, 911248, 972434, 1194675, 1298084, 1229285, 1335135, 1216414, 832521, 575727, 305207, 305406, 653006, 630848, 649790, 423444, 401253, 669084, 643040, 979918, 1237986, 702617, 578682, 584992, 740470, 778745, 568482, 364512, 273569, 581872, 965884, 952957, 724463, 535483, 517698, 564958, 770643, 528084, 394795, 829452, 1068730, 813202, 903176, 818771, 674341, 543119, 737603, 830596, 1165916, 1172087, 1067070, 1259526, 1794093, 1919464, 1718271, 1667720, 1429470, 974321, 935020, 1396060, 1613588, 1388893, 1040207, 1100878, 1121208]
19756A121208J33407O1964K61405k9042k19861M6860J63325P9027k02738j30798
19746A284757J68240M35154j91252N709r1658j0651K46057J84738j92971k86379
19736A551744j17328j17459J96839K94933K16739K96164j33223l05138r2075j7988
19726A773208j05048J14191J22351Q9098K12346J46173k03426Q6503O4352j2851
19716B286897O7380K33307N9664J15081J34439j64269k93876p0855K87603K28260
19706B883631J47417n797p208O9148j27192o3398J43952K68619L02938J55416
19696C767526l34271L58150q6163l07065r4961J1595M44692L76060L76912Q10
19686D513285R7778L37448J67407p3736R1122M19839K78687K92133M71878N81096
$$ y = [1121208, 1254615, 1316579, 1577984, 1548942, 1329081, 1375941, 1539266, 1618293, 1415555, 1284757, 1452997, 1888151, 1696899, 1702608, 1610950, 1600299, 1846356, 2031094, 1838123, 1551744, 1434416, 1316957, 1513796, 1808729, 2025468, 2321632, 2188409, 1883271, 1791196, 1773208, 1668160, 1782351, 1904702, 1993800, 2206146, 2352319, 2148893, 2235396, 2299748, 2286897, 2354277, 2587584, 2647248, 2762329, 2896768, 2732499, 2438623, 2367768, 2655371, 2883631, 3031048, 3025251, 3018043, 3087191, 2959999, 2896601, 3040553, 3309172, 3612110, 3767526, 3433255, 3791405, 3705242, 3398177, 3303216, 3314811, 3759503, 4135563, 4512475, 4513285, 4611063, 4948511, 5115918, 5042182, 5133304, 5553143, 5831830, 6123963, 6595841, 7176937]
19676G176937L97493J20343O72088N24846P1096M11572O00293M82693N94446Q41960
19666A1893767R02700O35980J009775J362304J318406R09620K41390N06469M92423
19657A9272834R43971J176002J349971K159192K491626L599613M541029N823837
19649D1358075Q287190J1063350J4299332J7313696J9283300K1233194K3167834
19642A56005971K5587370L0105962L4394842L4785336K7085525J2794326o197052
19635C14562280k3490523k9675974k5803761j4293674l19792J1448567J7228864
19628B49655987J4179596M437946q466110k1703530k8024137k8336638k4038484
19621A57704630j8276342j3047096q172389n090498k032558Q21281M042093P904047
$$ y = [7176937, 7574430, 7694773, 8366861, 8891707, 8962803, 9374375, 9974668, 10457361, 11051807, 11893767, 12796467, 13432447, 14442222, 15804526, 17122932, 18032552, 18273942, 18780411, 19272834, 20216805, 21392807, 22742778, 24901970, 27393596, 30993209, 35534238, 41358075, 49645265, 60708615, 75007947, 92321643, 111604943, 132838137, 156005971, 181593341, 211699303, 246094145, 280879481, 307965006, 320759332, 314562280, 291071757, 261395783, 235592022, 221298348, 220978556, 232427123, 249655987, 263835583, 268273529, 259807419, 238103889, 210079752, 181743114, 157704630, 139428288, 126381192, 118208803, 113118305, 111085747, 111907028, 115949121, 123853168]
19613A23853168J3110249J9725772K5922129L0007432K8329570K0639191Q568229
19606B70155740n227794j3293472j2239806m199500R086719K2948961L3386997
19599C00617845L4811896K4735286P982111j2548688k6999288l1933388l1058803
19592B65606971k6654794k2895587k1665050k1281417j9397660j7130418j3873993
19585A22708052j1382450r138607p409888o257362n968760m786554l763772l304574
19577G0696085k908778k650862k516604k241648j717259j893946k023587k051930
19569E2691471k181574j525975j796664j912368j305045o44553q78052j644198
19561D0803042j227766q67628j287488j342449j381361r81250j033671j274329
$$ y = [123853168, 136963417, 156689189, 182611318, 212618750, 240948320, 261587511, 270155740, 264927946, 251634474, 239394668, 235195168, 244281887, 267230848, 300617845, 335429741, 360165027, 368147138, 355598450, 328599162, 296665774, 265606971, 238952177, 216056590, 194391540, 173110123, 153712463, 136582045, 122708052, 111325602, 102186995, 94777107, 88519745, 82550985, 77764431, 74000659, 70696085, 67787307, 65136445, 62619841, 60378193, 58660934, 56766988, 54743401, 52691471, 50509897, 48983922, 47187258, 45274890, 43969845, 43325292, 42447240, 40803042, 39575276, 38707648, 37420160, 36077711, 34696350, 33715100, 32681429, 31407100]
19553C1407100j470202r54287j263985j076083m44839l55055n62032j128357o22153
19544B3530107n73152p20427n45806p64410p41035o70868m55927m14908k35912
19535A8407662l74113l82087l82243p93967m98545j09714o25407o11519n75978
19526A4054089k68182L12216J48962q54943o12998l39828k49932m70018k06777
19517A1512589j43867K3624k6919o04215m88791j90196l1426k60171m36120n89913
19507H764595o78304j34210k4696K7400j37588j51880q5208p2467k29529l01539
19497F976574j6004L8100l08189m76752j29076J00736j13902l28744j31069r4976
19487E516698Q1956k21455k82410j5817n1920l26823l85154j84662J1179j71369
$$ y = [31407100, 29936898, 28982611, 27718626, 26642543, 26197704, 25842649, 25280617, 24152260, 23530107, 22956955, 22236528, 21690722, 20926312, 20185277, 19514409, 19058482, 18643574, 18407662, 18033549, 17651462, 17269219, 16475252, 15976707, 15866993, 15241586, 14630067, 14054089, 13785907, 14098123, 14247085, 13392142, 12779144, 12439316, 12189384, 11719366, 11512589, 11368722, 11392346, 11365427, 10761212, 10272421, 10082225, 10050799, 9790628, 9354508, 8764595, 8086291, 7952081, 7927385, 7954785, 7817197, 7665317, 7580109, 7507642, 7278113, 6976574, 6960570, 6998670, 6690481, 6213729, 6084653, 6185389, 6071487, 5742743, 5611674, 5516698, 5598654, 5377199, 5094789, 5078972, 5027052, 4700229, 4315075, 4130413, 4141592, 3970223]
19477C970223j38923l25234j32394N0118K34268L3709N0597k75663j38334K28112
19467C556479j48734m80768k35496O4685j62255J11898p2936j23137r3939r5529
19457B320268j58153j55721n3171J44413L04855j69729m49326k81400m375j71789
19447A325872k710K40177K84108k17975j49903K2355K89152j58223o01970j89022
19437H41861Q7020j94688l63971K80403K61142K7235P5004j21021J40815J11441
19427A145241q1642j27976k6572k61517r0859K60521k6465j76030q1661p4041
19417D58999Q3265K15457r1143j11541R2127K56028k74154l28558j17396j84302
19407a218K22936N36999K94496k42442l54068k10278j11187K1375k34162k04982
$$ y = [3970223, 3831300, 3506066, 3373672, 3423790, 3658058, 3691767, 3742364, 3466701, 3328367, 3556479, 3407745, 2926977, 2691481, 2756166, 2593911, 2705809, 2632873, 2509736, 2415797, 2320268, 2162115, 2006394, 1953223, 2097636, 2402491, 2232762, 1783436, 1502036, 1497661, 1325872, 1323162, 1563339, 1847447, 1629472, 1479569, 1501924, 1791076, 1632853, 1030883, 841861, 928881, 734193, 370222, 650625, 911767, 939002, 1014006, 892985, 1033800, 1145241, 1063599, 935623, 909051, 647534, 556675, 817196, 790731, 614701, 533040, 458999, 542264, 757721, 666578, 555037, 647164, 903192, 629038, 300480, 183084, -1218, 221718, 758717, 1053213, 810771, 456703, 246425, 135238, 156613, -77549, -282531]
19397b82531N1362K64472N9305j61311L1634Q9891L31441j64443j84011K13868
19387B49677R762K28085J00875L7210J48144k03509j0430l66997l35877J4928
19377a28132P51192K25175p0019l79145J7374N3632o6919m4686j71703R3075P3708
19366C53552K84845J18916r0104k2346l3329K6311o4826K911J81783m1599p6046
19355F40068m1700n6143K72939k08109j31347j0195r6840j09322J92078K01388
19345F52817j12073k16347k24702r7247j32414l94158J43969O69270K14168k34061
19335B69222O1321k3159l96210K6980K62479j096l36033j08039R7111r1457K07833
19324c1048K02877O5047k77178k59840J24727N1361j0742o5469r6024j21368M1802
$$ y = [-282531, -231169, 33303, 92608, -68703, -37069, 52822, 384263, 219820, 35809, 249677, 259439, 487524, 588399, 625609, 773753, 570244, 559814, 192817, -143060, -128132, 623060, 848235, 778216, 399071, 416445, 470077, 403158, 358472, 186769, 279844, 353552, 638397, 757313, 667209, 644863, 611534, 637845, 573019, 575930, 757713, 716114, 640068, 598368, 542225, 815164, 607055, 475708, 465513, 368673, 259351, 451429, 652817, 540744, 324397, 99695, 2448, -129966, -524124, -380155, 289115, 503283, 269222, 330543, 307384, -88826, -61846, 200633, 199537, -136496, -244535, -147424, -238881, -31048, 171829, 236876, -40302, -300142, -175415, -124054, -134796, -200265, -296289, -417657, -375855]
19313c75855l36674J9468J16573L02589K59991j51990k77356k85185J54169K69712
19303c04558L22300k13366r7040k23497j81741L42496N61976J7661j91564l6903
19293d236K20785K38075P6503k58569k73829j50678K4319M9495j4776J25430k96060
19282b63541k36598n9732L73208K92269R7421q8365q6042J20552p1806j84878
19272a07512M07265K53057l08633l62085j09084j51219j19198L69546J37650J08325
19262A18112J03068m1900j43859Q275o0045J16862K55977j1447J67597o7137j73028
19251B72475k35687k71554j06703o3524J16227J71979Q8981L8755m0232k06212
19241b35495j16525l7835k37131k58494K5851N73628J79276N8370r8416m4056
$$ y = [-375855, -712529, -693061, -576488, -273899, -13908, -165898, -443254, -728439, -574270, -304558, 17742, -195624, -292664, -516161, -697902, -355406, 206570, 224231, 32667, -4236, 216549, 454624, 531127, 272558, -1271, -151949, -127630, -78135, -92911, 32519, -263541, -500139, -559871, -186663, 105606, 203027, 114662, 28620, 149172, 77366, -107512, 299753, 552810, 244177, -117908, -226992, -378211, -497409, -127863, 9787, 118112, 221180, 179280, 35421, 43696, -16349, 100513, 356490, 345043, 512640, 445503, 272475, 36788, -234766, -341469, -404993, -288766, -116787, -27806, 10949, -29283, -235495, -352020, -389855, -626986, -885480, -859629, -286001, -106725, -48355, -146771, -190827]
19231a90827K7991j7139L60498M0070j15833O5123m62627k59494J76583l6065
19221d11720K7737l72754j64663p9966K7412K15929K54712j59932Q7708N2671
19211e22866q3411K88095K07673J20140l45294o401Q7227R9201J18176k0794K12808
19200A54554j84783P510k50352p9008l2920j02652J68122L66448J98692m96188
19190b50577k26597R8740M79781J99141m30723j86331m7493K13194J91167N9467
19180I9769j82480l69444k24623j91500K39599M18501j03431J41640R4847j08663
19170a85785K62140N0860K7612J05659k58354M834M8373J9119q4285k62997L4875
19159b37949K05301q19K64119m7149J08930J58863J23941k86116n02271J20671
$$ y = [-190827, -162836, -179975, 180523, 220593, 104760, 169883, -292744, -552238, -375655, -411720, -383983, -756737, -921400, -1001366, -973954, -758025, -503313, -663245, -575537, -522866, -606277, -318182, -110509, 9631, -335663, -342064, -254837, -155636, -37460, -58254, 154554, -30229, -22719, -273071, -352079, -384999, -487651, -319529, 46919, 245611, -250577, -477174, -378434, 101347, 300488, -130235, -316566, -364059, -150865, 40302, 99769, -82711, -452155, -676778, -868278, -628679, -210178, -313609, -171969, -77122, -185785, 76355, 127215, 154827, 260486, 2132, 6966, 55339, 74458, -9827, -272824, -237949, -32648, -33467, 230652, 183503, 292433, 451296, 575237, 289121, -213150, -92479]
19149i2479K72101K01949N65109K59597j91772l67608n03848j46616K15829j61356
19139E0906l68116m4530j40498K15327J7222j7907k69389j9414J99966Q2613K53654
19128d0166j92656k68790k79383J07398L3586l3215N5240n0534Q6413j53573R2025
19117f43655J91312k2382K24727j03871k90355j95634J54332M45623M90974k51247
19107a76o0063m5211L5841m5908J88682n0129j45238Q9150K3480k70615P0090
19096b10097k63093J47779J43470q2964J81423J97514K53610j25203L6221j93208
19086H5452j35535J30401K06626K14226M13701N98138N13293j18433k21977J58038
19076A843930l12956n14811k34569j0068K35458L29837l58919k68959n3011k73357
$$ y = [-92479, 179622, 381571, 946680, 1206277, 1014505, 646897, 143049, -3567, 212262, 50906, -317210, -361740, -502238, -286911, -269689, -287596, -556985, -576399, -376433, -293820, -40166, -232822, -501612, -780995, -673597, -640011, -673226, -617986, -668520, -582107, -735680, -643655, -452343, -474725, -249998, -353869, -644224, -839858, -685526, -239903, 251071, -176, -60239, -105450, -69609, -115517, 73165, 23036, -122202, -33052, -9572, -280187, -210097, -473190, -325411, -181941, -264905, -83482, 114032, 367642, 242439, 278660, 85452, -50083, 80318, 286944, 501170, 914871, 1513009, 2026302, 1907869, 1685892, 1843930, 1530974, 1016163, 781594, 771526, 1006984, 1336821, 977902, 708943, 655932, 382575]
19066C82575k8483M1625o9190P8621K42311J21603r894k68389l48258k0696M16265
19055E38090j82758J37593P8981M27788r2290l6231J00952J15599j25876j54685
19045H07163J46894L10708k40131J26763J2182j05025L19727K38268l9842R0Q280
19034A585077O4355l23689l59940k5076j54605J74181N7254k39834J38587l8104
19024H78206j95903k35385k00199J27706k50522N1105M28560K18651j23820j02703
19014E95696K02785k39019j93226p3144P2806m659k95481P7134L03648m2882j14397
19003B89261j31556k60969J17752l150K68357l6678k27733J0079O2293K06621
18993B94277P0604l05254J48851L18795k79587J49845j72453l39631q0830J22739
$$ y = [382575, 354092, 395717, 326527, 405148, 647459, 769062, 759168, 490779, 142521, 121825, 538090, 355332, 492925, 571906, 999694, 907404, 871173, 972125, 1087724, 961848, 807163, 954057, 1264765, 1024634, 1151397, 1163579, 1058554, 1378281, 1616549, 1576707, 1576797, 1585077, 1649432, 1325743, 965803, 940727, 786122, 960303, 1017557, 777723, 916310, 878206, 682303, 446918, 246719, 374425, 123903, 175008, 603568, 822219, 698399, 595696, 798481, 559462, 366236, 293092, 365898, 361239, 65758, 142892, 446540, 403658, 289261, 157705, -103264, 14488, 11338, 279695, 243017, 15284, 25363, 87656, 294277, 364881, 59627, 208478, 527273, 247686, 397531, 225078, -114553, -195383, -72644]
18983g2644L71624R2647j21813k19918j33026j71014k36747K3004R2009J15822
18973b60056K01551M947o7101P3725K9313J63826R2488j61965n380J47501K86393
18962E05242K24619l22100m33963q3720J15698K26927K84974K08639J83848j49020
18952G61144m45672l14443n61789n7329N34702J49469J11183K14444m17093n20879
18942e46263k26631R6191K83143J87194N3772j00936m62667P6958M67891J37395
18932c3953J20741J95967j86907k38482k8980m1922K10900j59410P3901O7637
18922b0508J74860m5481k87061m6979M3921j67081j2881K57810J65713K78638
18912C40951j73224m43770J85909o2646l31626k82605J86441J48918L22646j9659
$$ y = [-72644, 298980, 391627, 269814, 49896, -83130, -254144, -490891, -467887, -375878, -260056, -58505, -53558, -120659, -46934, -17621, 146205, 238693, 76728, 71348, 218849, 505242, 729861, 407761, -26202, -109922, 5776, 232703, 517677, 726316, 910164, 761144, 315472, 1029, -560760, -618089, -83387, 66082, 177265, 391709, -25384, -546263, -772894, -676703, -393560, -206366, -152594, -253530, -716197, -639239, -171348, -33953, 86788, 282755, 95848, -142634, -171614, -213536, -2636, -162046, -88145, -20508, 154352, 108871, -178190, -225169, -181248, -348329, -361210, -103400, 62313, 340951, 167727, -276043, -90134, -152780, -484406, -767011, -580570, -431652, -109006, -128665]
18902a28665j42111J02852m6192K7339L99225K47445j51462j12337Q8729j66990
18892A17833j21858K2034j5647J92183K0706k97840k20276R5595N46588J39098
18882D78416J26143m45569m94864J06376j33342n6476L11845K12822J0521r9130
18872A6742j86870j3015P8592L0957L61854j60649l96232O0948J51136m6985o701
18861a10223R2623N1947j18533k96486n5675L5862l6566J7212L08936L01833k74016
18850h3086m8J80456J0730l60848l35922J54O12671j6897m0645K61079j98335
18839B9309K2782l54925j2826N3408O3085J59180L53851M622j88873J29914J3931
18828B73458J26665P6403l35847j05128l62688J929R8124L4964M49367J10995
$$ y = [-128665, -270776, -167924, -214116, -186777, 212448, 459893, 308431, 196094, 284823, 117833, -4025, 18009, 2362, 194545, 215251, -82589, -302865, -207270, 339318, 478416, 604559, 158990, -335874, -229498, -362840, -419316, -107471, 105351, 115872, 16742, -170128, -183143, -104551, -73594, 288260, 127611, -268621, -207673, -56537, -103522, -110223, -17600, 34347, -84186, -380672, -436347, -400485, -437051, -419839, -110903, 190930, -83086, -83134, 97322, 108052, -252796, -588718, -588564, 24107, 7210, -33435, 227644, 29309, 52091, -302834, -315660, -262252, -199167, -39987, 313864, 318486, 129613, 259527, 273458, 400123, 476526, 140679, 35551, -327137, -325208, -227084, -192120, 257247, 368242]
18818C68242l26088k65178k46931l06190j30036m6626N8366K31412J22378K01286
18808c39365p7672k22807K59757K44536l49754O1941m7916K56307J33778n5549
18798a36744J8851j71940j55650N6038N3250K29903k12230K21738m3652P8803
18788f1633J00099K5694q1028L81098J38221j40515j38203j84105j64419M9290
18778g5501J84873r2242l63599n8415p3259L62041L8074N5608J71757R1397p3454
18767A67280L9487K20742M25085P93539M67041o12842k82336q3164l48565m47995
18757C38272m39822l4361j8386K67098N16289k25809N6494l72418l42000J3281
18747b41362k97096j27489M96098L23968J64683K57906j24048l2921j37554k57050
$$ y = [368242, 42154, -223024, -469955, -776145, -906181, -952807, -894441, -663029, -540651, -339365, -417037, -639844, -380087, -135551, -485305, -423364, -471280, -214973, -81195, -136744, -117893, -289833, -445483, -389445, -336195, -106292, -318522, -96784, -140436, -61633, 38466, 64160, -16868, 364230, 502451, 361936, 223733, 39628, -124791, -75501, 109372, 17130, -346469, -404884, -478143, -116102, -78028, -22420, 149337, 240734, 167280, 206767, 427509, 852594, 1646133, 2113174, 1500332, 1217996, 1134832, 786267, 338272, -101550, -135911, -154297, 112801, 629090, 403281, 459775, 87357, -254643, -241362, -538458, -665947, -169849, 154119, 318802, 576708, 452660, 419739, 282185, 25135]
18737B5135j81140l74068j04948K57430K78243K50129J66256J86257q9489k02286
18727B11519j74699l32426j14817K88928K73591O2350k63003k94255K43829j79470
18717b78453j04655k61451J56314J1090k64784K46944L17948j73306J38101K3987
18707a88265k16424k2099L95313r7482o1782J4747l41311q7731J96433K5895N6558
18696c26148M6122J74116q005k81246J37444K98726j68949l60150K32119K01615
18686e4356K1768J72257j05098k78880j76783j84789L04083K20485J2341Q5464
18676A6492j68949j29177J61877K71183L30542k0420k2077J97902Q8442j97805
18666E28010q2830n14887l64739P9941J43417J51639k37002r9889J46778P6378
$$ y = [25135, -156005, -530073, -635021, -377591, -99348, 150781, 317037, 503294, 413805, 211519, 36820, -295606, -410423, -121495, 152096, 214446, -48557, -342812, -98983, -278453, -383108, -644559, -488245, -477155, -741939, -494995, -177047, -350353, -212252, -188265, -404689, -426788, -31475, -128957, -190739, -175992, -517303, -605034, -408601, -382706, -326148, -280026, -105910, -113915, -395161, -257717, 41009, -127940, -488090, -255971, -54356, -32588, 139669, 34571, -244309, -421092, -605881, -301798, -81313, -68972, 16492, -152457, -281634, -119757, 151426, 481968, 461548, 439471, 637373, 725815, 528010, 445180, -69707, -434446, -354505, -211088, -59449, -296451, -396340, -249562, -173184]
18656a73184J60500L23448Q8792K7435J7767o1079l96210j51826q9863J06343
18646a47877L04132Q6467k2867j10791J21929M5814l57523J46490j14374k33759
18636b82359L77102L11925n3062k78455J00196k38927l0320K26930K85628o10875
18626a92217j26715K84892K86461L39207j65476m84595j48241j6612j81787K22798
18616a82285J21325J6793j64508K3929L3019K17542J44904J43062k64767n6945
18606C2069R0466j0885J12744j98016k60359j42508K37870L34410l42192l89531
18596e35932l13188o3044J52153o8046L14994L19202K65014l65095r9281L52847
18586d0376J38682P8871k27964o4885k35975j45418K6247n7229j36980J21652
$$ y = [-173184, -12684, 310764, 399556, 426991, 444758, 383679, -12531, -164357, -254220, -147877, 156255, 242722, 219855, 109064, 230993, 276807, -80716, 65774, -48600, -282359, 94743, 406668, 353606, 75151, 175347, -63580, -93900, 133030, 418658, -192217, -318932, -34040, 252421, 591628, 426152, -58443, -206684, -223296, -405083, -182285, -60960, -44167, -208675, -184746, -151727, 65815, 210719, 353781, 89014, 32069, 122535, 111650, 224394, 26378, -233981, -376489, -138619, 195791, -146401, -535932, -849120, -912164, -760011, -828057, -513063, -193861, 71153, -293942, -393223, -40376, 98306, 177177, -50787, -115672, -351647, -497065, -470818, -528047, -665027, -543375]
18576e43375j41179k2752K94684J42220k68200o1296M21774o6517k58848k68680
18566g72169J2486L96124L50973K00757j17408k90021M2164J40552O5867j04530
18556g5205l1553L61667o8388k69537j43766j43749J12306M5684L22235J78799
18546B88493K6346j9671m70643k44825J16399K13963K55040j11223j76933K74375
18536A51321j199j92350k45674k1467l5878l4522O9777K13167L8655j90895O0688
18525a88377o9186j09899k53764j48262K15160r9006l1769L34081J05154R4916
18515a50952M86764j63962j35573j82103j58365K54280P9541M9764J49803k53079
18505b3882l68902j91663n8951J73526J74601L87819K632j65903J05408r1586
$$ y = [-543375, -684554, -707306, -412622, -270402, -538602, -599898, -178124, -244641, -503489, -772169, -759683, -363559, -12586, 188171, 70763, -219258, -177094, -36542, 29325, -75205, -106758, 254909, 186521, -83016, -226782, -370531, -258225, -212541, 109694, 288493, 314839, 295168, -175475, -420300, -303901, -89938, 165102, 53879, -123054, 151321, 150122, -42228, -287902, -309369, -345247, -379769, -309992, -96825, -58170, -249065, -188377, -257563, -367462, -621226, -769488, -554328, -653334, -685103, -351022, -245868, -150952, 335812, 171850, 36277, -145826, -304191, -49911, 29630, 79394, 229197, -23882, -392784, -584447, -643398, -469872, -295271, 92548, 95180, -70723, 34685, -56901]
18495e6901n5156k75426K26504K88044K6437r2884L2076m55859l75348J08256
18485f30257L68975K1119J46269J39840Q809p7368l24448j67149L33615J07829
18475g2766j34862j79555m2338l3294k18491N7807K01845M48963m8263J95192
18465A74238M21295J39554r0439j95408l12621l90345j24513J45916N8239K23009
18455D8925O6455m7265k86190j05376K86474Q9973j40936M0824J78656k52650
18445a21110l12183j00593J24921L04992k7867k3003M02112M6420o1850j21246
18435A10593m00555J32112N7711l95975k47571K36515J59579J81167L2150K4585
18425a09689k13241k10769p5607j8251K47060L65274J05139J47439J26528j59568
$$ y = [-56901, -112057, -387483, -160979, 127065, 153502, 60618, 92694, -363165, -738513, -630257, -261282, -240163, -93894, 45946, 54755, -22613, -347061, -514210, -180595, -72766, -207628, -387183, -429521, -462815, -681306, -623499, -421654, 27309, -20954, 174238, 595533, 735087, 644648, 449240, 136619, -253726, -378239, -232323, -174084, 48925, 115380, 68115, -218075, -323451, -36977, 52996, -87940, -47116, 131540, -121110, -433293, -533886, -408965, -103973, -131840, -154843, 247269, 293689, 231839, 110593, -289962, -157850, -100139, -496114, -743685, -507170, -347591, -166424, -134274, -109689, -322930, -533699, -609306, -627557, -380497, -15223, 89916, 237355, 363883, 204315]
18415B04315l47150l64584Q9619J48165m2662l16411J90165K20600J55326L19600
18405B56983n2380k36562j93206J50676M98978k8562k54762N6588P8983l39840
18395f3104k78128J57921M05255J41J57203n1385k22621j22020j09510P1145O575
18384d8528j91919p2361L4666q9795r3180N5581k49581j273K28111L09446J79166
18373F0333L128K99920O9799j50816l59445q3487k12667J29620m4063L7568J07585
18362a42525K99404K49296l7762k13684K36705K22860k42961l65409j76340O1193
18352a09223L06422K59050m79497j77047n3433O0090j69635L67j68927l4358K45298
18341c20893L88543O5539J57504L8707r7255m4837L1172m1435P6679j58664J5653
$$ y = [204315, -142835, -507419, -417800, -269635, -312297, -628708, -438543, -217943, -62617, 256983, 204603, -31959, -225165, -74489, 424489, 395927, 141165, 197753, 276736, -63104, -341232, -183311, 221944, 222085, 379288, 327903, 105282, -16738, -126248, -55103, -48528, -240447, -312808, -278142, -367937, -461117, -405536, -655117, -656390, -428279, -118833, 60333, 63461, 363381, 433180, 282364, -77081, -160568, -373235, -243615, -287678, -250110, -142525, 156879, 406175, 368413, 154729, 391434, 614294, 371333, 5924, -170416, -109223, 197199, 456249, -23248, -200295, -253728, -193638, -363273, -362906, -531833, -566191, -320893, 67650, 133189, 290693, 329400, 232145, 187308, 218480, 177045, 253724, 95060, 110713]
18330A10713J25370k71071M8383J01969J75906L17511L50911k19836j29846j70807
18320D39203k98109N027M7355K86422Q2197k32360p5663O4881q6689K53033L23720
18309H09017m14195j88450N67512j95842n43127K69632M58496l54347k60253L3151
18299A81594l13894N7653p9723K58077J38282k11499j62057L27563j95465l26383
18289c25852O7214J41741n235K26781N1193j82523J28472j30702k85622j3463
18279c27996k36491O492J73142n6169L5658R8549m27340J94049L03427j88749
18269d25428o6285J51540q729j42445M99834L40475j45006k31436k79388J21381
18259a85487N560n4888m7595K87294o1160n1414K98967k93965o5859j58537M3409
$$ y = [110713, 236083, -34988, 13395, 115364, 291270, 608781, 959692, 739856, 610010, 439203, 141094, 146121, 193476, 479898, 562095, 329735, 254072, 318953, 232264, 485297, 809017, 394822, 206372, 773884, 578042, 34915, 304547, 763043, 408696, 148443, 181594, -132300, -74647, -154370, 103707, 241989, 30490, -131567, 195996, 531, -325852, -258638, -116897, -122132, 104649, 155842, -26681, 101791, -28911, -314533, -327996, -564487, -557995, -384853, -441022, -405364, -306815, -734155, -540106, -236679, -425428, -491713, -340173, -348902, -491347, 8487, 348962, 203956, -27480, -306868, -185487, -179927, -234815, -282410, 4884, -56276, -107690, 191277, -102688, -168547, -327084, -283675]
18248b83675j15357J53674M22846k28180O3940L02592J17991k12532k53613l77439
18238d09753r3397J7248P1399J51255O44778J15670R9372k43108l30346n9000
18228c5882m8404l29108K97908K23660J17204k9362K95070K29763l28335n07962
18218a15448k33576N6992K26070J68352l3740m7866l435n7164O526M4219L7151
18207D8081J30121K74625K16726j34381k16345k74718q5187J11764K18345N2791
18197C41822K22314L5608r9296r3511q5993J23335K31353R8719k14825l47126
18187B12400j05292J41209J93769K9840m6693K51980J94853J27022j39314l00419
18177E59355k73818k36744j90597J30174j3815j14772n824L32494L03210m5131
$$ y = [-283675, -399032, -245358, 177488, -50692, 13248, 315840, 433831, 221299, -32314, -409753, -503150, -485902, -414503, -263248, 381530, 497200, 596572, 353464, 23118, -35882, -84286, -413394, -115486, 108174, 225378, 196016, 491086, 720849, 392514, -115448, -349024, -292032, -65962, 102390, 68650, 20784, 17349, -39815, -33289, 10930, 48081, 178202, 452827, 669553, 535172, 318827, 44109, -41078, 70686, 289031, 341822, 564136, 599744, 500448, 406937, 320944, 444279, 675632, 774351, 559526, 212400, 107108, 248317, 442086, 471926, 425233, 677213, 872066, 999088, 859774, 559355, 285537, 48793, -141804, -11630, -25445, -140217, -146041, 186453, 489663, 444532]
18167D44532l45641L08463N79413K1186p9494l13460J09314J30545k05460l62099
18157B87299R5422L56027J92720j69873N4255J94724o6699j61458n6824J53790
18147H79383k17773K13530L48577k43583N13207J10862n04858k96009j0874R4256
18137H86718L95496N52420Q9747K63983N54684J91180Q1063M4789R7932R04497
18127D062509N11010J57378J04780J43957L84607N71156Q67116P09533R59630
18118H471676J589919J926838K666020L756715M484587N420843Q212565J3604368
18110E0133531K3445033M3803097P9030891J08970394J01807073O9860117p4209555
18103D02840581j46097658r1325796m6870282k6806693j6046138r421061o019407
$$ y = [444532, 98891, 407354, 986767, 1007953, 928459, 614999, 724313, 854858, 649398, 287299, 382721, 738748, 931468, 761595, 815850, 1010574, 943875, 782417, 725593, 879383, 661610, 875140, 1223717, 980134, 1493341, 1604203, 1099345, 803336, 792462, 886718, 1282214, 1834634, 1924381, 2188364, 2743048, 2934228, 3015291, 3060080, 3158012, 4062509, 4573519, 4730897, 4835677, 4979634, 5364241, 5935397, 6802513, 7512046, 8471676, 10061595, 11988433, 14654453, 18411168, 22895755, 28316598, 36529163, 50133531, 73578564, 117381661, 196412552, 305382946, 407190019, 477050136, 402840581, 256742923, 165417127, 118546845, 91740152, 75694014, 66272953, 60253546]
18096F0253546m199330l123993l330221l366948l649610l593963l215791k938757
18088C2834933k708224k168218k195239j703403j005205q06218o93507o95926
18080B0858993q94282q37269q23018o19866m90346o12112m21263j62039m10703
18071A5588095p08155p85507o71499q22776m40998m1494q9359j40912n21933l61390
18061A1004072l37135m18040m09269j43093l69141l19394k55997k46292j21950
18052H383761m48673n68491l78248j32243k84243k67529k60903J4811q9j85090
18042E873063j74386l16596O1829L10367r3682j39689k11103r7913j31151n68714
18032D512025l76329J82479R5125J57835K01911j90926j02539m16528j1677n5409
$$ y = [60253546, 56054216, 52930223, 49600002, 46233054, 42583444, 38989481, 35773690, 32834933, 30126709, 27958491, 25763252, 24059849, 23054644, 22248426, 21554919, 20858993, 19964711, 19127442, 18304424, 17684558, 17194212, 16582100, 16160837, 15998798, 15588095, 14879940, 14094433, 13422934, 12600158, 12159160, 12117666, 12028307, 11887395, 11365462, 11004072, 10666937, 10248897, 9839628, 9696535, 9327394, 9008000, 8752003, 8505711, 8383761, 7935088, 7366597, 6988349, 6856106, 6571863, 6304334, 6043431, 6058242, 6058153, 5873063, 5698677, 5382081, 5443910, 5754277, 5660595, 5520906, 5309803, 5211890, 5080739, 4512025, 4135696, 4318175, 4413300, 4571135, 4773046, 4582120, 4479581, 4063053, 4051376, 3995967]
18022C995967r2412k24487j68401j27139K1141l60793k96478J02276K03508K04597
18012C257779Q7086n9929m82318l53882O4036K57631m7852n06675k78796M2734
18002A979814K10529r00O5627j69443o004K06887r9341J44864m1092r5101N6433
17991B252273j89457j68926j13519o71638M8131M60147N8260J00007O4453l36297
17981A503434p16766k81671M69860L44906m35499l1320J33520j68147n8349M2384
17971H02352j19098L49598K18161j10203l84797q8911J28732P5821l15282J1296
17961E67669J8377n9496o8058O1676J22510J25231J56815O3260n61446m80432
17951e3894l48300J09459L49218l48185o2351M15676k26264l108L20775J54665
$$ y = [3995967, 3903555, 3679068, 3510667, 3383528, 3404669, 3043876, 2747398, 2849674, 3053182, 3257779, 3344865, 3284936, 2802618, 2448736, 2512772, 2770403, 2722551, 2215876, 1937080, 1979814, 2190343, 2189443, 2255070, 2085627, 2079623, 2286510, 2187169, 2332033, 2290941, 2195840, 2252273, 2062816, 1893890, 1780371, 1108733, 1156864, 1617011, 1675271, 1775278, 1839731, 1503434, 786668, 504997, 974857, 1319763, 884264, 852944, 986464, 818317, 759968, 802352, 683254, 1032852, 1251013, 1140810, 756013, 667102, 795834, 871655, 556373, 567669, 586046, 526550, 458492, 520168, 642678, 767909, 924724, 987984, 426538, -53894, -402194, -292735, 56483, -291702, -354053, 61623, -164641, -167749, 153026, 307691]
17941C07691k32089k9186o3428P275J47974q7813L1958m46991k26835K24236M9251
17930c17957j01064J45928k3211R2109J39375K57651M3734o6108j00178J01355
17920A71634n2601k02465j49797L86852J95918j70920L06394K3448j57099j03315
17910B48049q9772J39031J36919j81213j30393J21598J51644k33589j52835J75594
17900A85033j70212k39274l02916k70743K56261K06208K11181J73739p4751O7213
17890D1739J60040K6194J11855J44946m73718m41978J43831k0419m0282L49332
17880A540J04687k49146n8724j12675p1027J61309L34497q5607k64380J54343
17870h5183J02093k2748j5256j32135m3991R6778j40683j9703J72661L81069L96061
$$ y = [307691, 75602, 46416, -17012, -9737, 138237, 50424, 82382, -364609, -591444, -367208, -317957, -419021, -273093, -296304, -204195, -64820, 192831, 236565, 170457, 70279, 171634, 119033, -83432, -233229, 153623, 349541, 178621, 485015, 508463, 351364, 248049, 158277, 297308, 434227, 253014, 122621, 244219, 395863, 162274, 9439, 185033, 14821, -224453, -527369, -798112, -541851, -335643, -124462, 49277, -25474, 41739, 201779, 227973, 339828, 484774, 11056, -430922, -287091, -307510, -347792, 1540, 106227, -142919, -201643, -314318, -385345, -224036, 110461, 24854, -239526, -85183, 16910, -5838, -21094, -153229, -197220, -100442, -241125, -260828, -88167, 292902, 688963]
17859F88963N8295l52341l35995K1501P0136R4475j2359k45152J278l2688J36732
17848I2845k45109j67523P5383n3880O973j38704p378o5146K61717J79130M99872
17837D38180J61134j48152n9389o9333o4974j24373l62725j96934J78320K14030
17827c4216K4464k16517k89193j31549L54953j00924K17250r244J96283J22325
17817A33632k55376l45318j49531J53290J75973M67649P5165l26699Q1350J4045
17807B4180L7443O2066K70661J56205j58576l84405J11794J24225r6350j33772
17797A3471o8987j43934j12004R3013L62056J11937j25000l77732j97300q6366
17787e30846N3252J83745j02567j18627k6557M8849K33482J75610K5646j00360
$$ y = [688963, 747258, 394917, 58922, 80423, 150559, 245034, 232675, -12477, -11199, -43887, 92845, -152264, -319787, -244404, -298284, -291311, -430015, -437393, -502539, -240822, -61692, 438180, 599314, 451162, 391773, 322440, 257466, 133093, -229632, -426566, -248246, -34216, -9752, -226269, -515462, -647011, -292058, -392982, -175732, -184976, 11307, 133632, -121744, -467062, -616593, -463303, -287330, 180319, 255484, -71215, 10135, 24180, 61623, 123689, 394350, 550555, 391979, 7574, 119368, 243593, 147243, 13471, -55516, -199450, -311454, -218441, 143615, 255552, 130552, -247180, -444480, -530846, -477594, -293849, -396416, -515043, -541600, -492751, -259269, -83659, -58013, -158373]
17777a58373N8700Q3409N2928r606j5429j97671j24064L1509o7229r68p4728Q3838
17765c37684M02818K0101l45253l15137J15551J05733M41227J28214m41641k1148
17755b47219p1619M8484J18673M1319K02723J75651K5538n62753k51920R8854
17745d22269Q3312J71227R7811K05236o5389k30770j47927P5039J08331k80521
17735d05920O8055J28063L59514O4603K42003K7910p7369j70903J40519m5238
17725C31237o9345P2805k97101p3633k525n0090l8553m3196j51550j14052r0661
17714e26664j96909J78183K32548J64150O780k60116K21282J80878J11468J03021
17704B14621R0733k92860j33725k59243P8746L59513R5606M2414J70453J06251
$$ y = [-158373, -99673, -16264, 36664, 27058, 11629, -186042, -310106, -278597, -345826, -346794, -421522, -337684, 65134, 85235, -260018, -575155, -459604, -353871, 87356, 215570, -226071, -247219, -318838, -270354, -151681, -110362, 92361, 268012, 293550, -269203, -521123, -422269, -338957, -167730, -69919, 135317, 69928, -160842, -308769, -233730, -125399, -405920, -337865, -209802, 149712, 214315, 456318, 484228, 406859, 235956, 376475, 331237, 261892, 334697, 37596, -36037, -38562, -88652, -127205, -170401, -321951, -436003, -526664, -723573, -545390, -312842, -148692, -141912, -402028, -180746, 132, 111600, 214621, 305354, 12494, -121231, -380474, -301728, 57785, 153391, 195805, 366258, 472509]
17694D72509m6312o621k433k44273K06402m6643O8860J87780j00940k51815m99558
17683b63044k4448J03324K96229l6903L4503k1630m16092j40814K14885J67010
17673h6980m1952k64690N0068M55344M56931k14583k08276q3221k40593j13125
17663b91077J6766k73558P1078M60025K14810J38531j68431l54367P007j73965
17653c53181l00550J59634R5563K81091j08251j70076J18000L82455K57557j99687
17643A62555k31597m2691l24910m76840j70117M67005N46648J44334o7064m6484
17633c9161O987k02544J18516K37202R3220k40342K19495j48787Q5599K86219
17623D16404k97754M36958M9318l21063j62095k58587j22425K04197J12769j54388
$$ y = [472509, 426197, 419576, 417143, 172870, 379272, 332629, 401489, 589269, 488329, 236514, -263044, -287492, -184168, 112061, 75158, 109661, 88031, -328061, -468875, -253990, -86980, -128932, -393622, -343554, 111790, 568721, 354138, 145862, 62641, -177952, -291077, -274311, -547869, -476791, -16766, 198044, 336575, 168144, -186223, -179216, -353181, -653731, -494097, -398534, -117443, -225694, -395770, -277770, 104685, 362242, 162555, -69042, -111733, -436643, -913483, -1083600, -616595, -69947, 74387, 7323, -39161, -32174, -234718, -116202, 121000, 214220, -26122, 193373, 44586, 130185, 416404, 118650, 555608, 604926, 283863, 121768, -136819, -259244, -55047, 57722, -96666]
17613i6666n8643R6628M84147L8928r1567l79034M5494j70574m1699K62316n0076
17602C9254K19517J72709K01582j32098n28070k54308j04177j14344J25385K066
17592c72484L8286K7502J39282n1507K58882J30053J11174j91340k17392K5458
17582a02086O7724o887O2562K18294J08495k31412j73731p7169K4240J71746p3071
17571a1295l06340N7950K37674P8427r8302L6078j06045m8291j88015l4589K86370
17560i6378P3023k76580L16295P7925j62060K28698m1911l15206J94521p8536
17550h0209J21544p3360K03019P2698l24977p3309n6555O5652M4147n4350p0529
17539b26229K7516j71897q6790J72518K00267J43466p4863l11217M4357N4211
$$ y = [-96666, -155309, -58681, 425466, 464394, 372827, -6207, 39287, -131287, -172986, 89330, 39254, 258771, 431480, 633062, 500964, -27106, -281414, -385591, -499935, -374550, -372484, -334198, -306696, -167414, -218921, 39961, 170014, 281188, 89848, -127544, -102086, -34362, -41249, 21313, 239607, 348102, 116690, -57041, -134210, -109970, 61776, -11295, -317635, -259685, -22011, 56416, -41886, -5808, -111853, -160144, -348159, -382748, -96378, -23355, -299935, 16360, 94285, -67775, 160923, 119012, -196194, -1673, -80209, 41335, -32025, 170994, 243692, -81285, -154594, -211149, -145497, -101350, -155700, -226229, -198713, -370610, -457400, -284882, -84615, 58851, -16012, -327229, -282872, -228661]
17529b28661k70875K3900J15887J64404L16059K35627k68672L39501m07180N1889
17519G1879l327P8479Q8858r5671L41837P0886j44096q0724J30826j25848L9450
17508C72549k60538j86729L41276j25308m53169l40148J69375M13413K17824J5326
17498A63871j80125J27314J54221j04915L55029k08061r2244L1140l3127J93062
17488D06165M5692M1873j07706l60083k17013L81562J40699k24533m02659K95086
17478i17O5178l60385n5168J71754J58224J40862L8959k4642m48135J08977J49841
17467e5452J29003K08743L44904o2739k11254l18111j59053j3191Q0329K22245
17457A65424J42042L17989J77892K27869J95099J77939j7571j2653J7349k36996
$$ y = [-228661, -499536, -475636, -359749, -195345, 120714, 356341, 87669, 427170, 19990, 71879, 68552, 147031, 235889, 140218, 482055, 552941, 408845, 328121, 458947, 333099, 372549, 112011, -74718, 266558, 141250, -311919, -652067, -482692, -69279, 148545, 163871, -16254, 111060, 265281, 160366, 515395, 307334, 215090, 246230, 213103, 406165, 451857, 493730, 386024, 25941, -191072, 190490, 331189, 106656, -296003, -917, 64261, -296124, -351292, -179538, -21314, 119548, 158507, 133865, -314270, -205293, -55452, 73551, 282294, 627198, 564459, 353205, 35094, -123959, -137150, -56821, 165424, 307466, 625455, 803347, 1031216, 1226315, 1404254, 1386683, 1374030, 1391379, 1154383]
17447A154383l50745J76904n9736J71551l6623N46918Q47079Q83530R00781J10927
17437D344969o03407q77704p55805l17323k11573J26884o4238k87691l76216m60019
17427E17877j57969p8782K92280K64888j36716M7651J18483P6907L10911N28756
17417A784286K60024j41026k84252J6016P0005j32246j02971m1860j23956l44669
17407I59351m20636l97726K2691P06672O39328L60981l357O720J06775K41344
17397B222143j86055m65501l71062J36930j12651l36335k82506R6398o7405n7865
17387E76091p7284k94237K78234K57639o96068k32674J04522j30161K54711N8622
17377I9395j43726j11888M7506o3299L4896L62334K09706R6392R7256l23499k33119
$$ y = [1154383, 803638, 980542, 920806, 1092357, 1055734, 1602652, 2449731, 3333261, 4234042, 4344969, 3741562, 2863858, 2108053, 1790730, 1579157, 1706041, 1641803, 1354112, 977896, 517877, 359908, 281126, 573406, 838294, 701578, 749229, 867712, 944619, 1255530, 1784286, 2044310, 1903284, 1619032, 1635048, 1705053, 1572807, 1469836, 1427976, 1304020, 959351, 538715, 140989, 163680, 870352, 1509680, 1870661, 1867304, 1874024, 1980799, 2222143, 2036088, 1570587, 1199525, 1336455, 1223804, 887469, 604963, 701361, 633956, 576091, 498807, 204570, 482804, 740443, 44375, -188299, -83777, -213938, 40773, 99395, -44331, -156219, -108713, -172012, -137116, 225218, 434924, 531316, 628572, 305073, 71954]
17366G1954r2285L92065o1353R9575p4031j61209r2113j55923l09554j05495K37910
17355b50459J37728O5278J6470l53491J88492M1106J62904j55602k05905l32581
17345f86060j18484N08057K33796J08537K94375J45133J17548l09925k18488k011
17335G2478O5023J69238k48100k76218p2154N2816K68592L91532K10196Q4117
17325G17520j55420k70669n6462N1502J71435o8011M8372J66717j26452o2637
17315D15895J52695l50966j67503j2592L46013J18549K19295k02624j96447o22661
17305c00346j01897J46003k53035j72374O46789L31281k55856K32094M3794m35999
17295a19546j83627j0143J15513j25484K22641R441k39285K6587L84124R8124
$$ y = [71954, -20331, 371734, 310381, 409956, 335925, 174716, 82603, -73320, -382874, -488369, -250459, -112731, -47453, -30983, -384474, -195982, -154876, 8028, -147574, -353479, -686060, -804544, -296487, -62691, 45846, 340221, 485354, 602902, 292977, 74489, 72478, 137501, 306739, 58639, -217579, -289733, -236917, 31675, 423207, 633403, 717520, 562100, 291431, 234969, 286471, 457906, 389895, 438267, 604984, 478532, 415895, 568590, 217624, 50121, 37529, 383542, 502091, 721386, 518762, 322315, -300346, -402243, -256240, -509275, -681649, -34860, 296421, 40565, 272659, 316453, -119546, -303173, -313316, -197803, -323287, -100646, -91205, -330490, -303903, 80221, 178345]
17285A78345l11934j37984L5481j9147J9121L81017K01492j03542K46635q6659
17275D02825k95429K0912J33714n8083J52182p7331l6931K65103J24535k93617
17265C37880J207J81482j64730j90437k9525o348o7288J25547L75717m2918L8770
17254E59357q4195k06212O3475m7760K2138j36199k99082j82400J08556m06858
17244f09180j4557Q4933N18323O8603j09752j3852R8645J93230J98430q6863j90032
17233A37928J44536N280l5163l82145l13225K35958M24524K44521k991o5264Q7776
17222D81735N4292k57437l64087P904J60835J23810J47513J71315n1814m5793
17212D28273j33398q9924J48555Q0500m6869K8745k3640j19669k57261n5073q3947
$$ y = [178345, -133589, -271573, -236092, -255239, -236118, 144899, 346391, 242849, 489484, 402825, 107396, 128308, 262022, 203939, 356121, 278790, 241859, 506962, 631497, 337880, 339087, 520569, 355839, 165402, 135877, 129529, 62241, 187788, 563505, 520587, 559357, 475162, 268950, 332425, 284665, 306803, 170604, -128478, -310878, -202322, -609180, -623737, -538804, -20481, 48122, -61630, -75482, 23163, 216393, 414823, 327960, 137928, 282464, 287744, 252581, -129564, -442789, -206831, 217693, 462214, 459223, 393959, 481735, 536027, 278590, -85497, -77593, 83242, 207052, 354565, 525880, 474066, 428273, 294875, 204951, 353506, 434006, 387137, 415882, 392242, 272573, 15312, -39761, -123708]
17201a23708J50173J20334J01633L85326j16810o6628R6201l5686l39732M8737
17191B19840o2945q8979J35892K52133J0340J06461n2674j04548M586J04018j77503
17180C46621k33061k06649j53802J8515L89781R8852K25k0540J59660k62997q3058
17169E3547J77989j67379R3423K35083k42247q9868k2483N3738K46856L06257
17159F44916K71597j52246l28718l30014o8017J52168L46430J93040n500k79357
17149D44299K9012J50191K03268j32867m20333m79083M2933k56176j32409P0175
17139d80990J78916L56051j41695K59628q5488O8004m51807k4236O6150J20039
17129a35428j30406j34399J20116k418N9686L8729j98040L47944M95192j54252
$$ y = [-123708, 26465, 146799, 248432, 633758, 516948, 450320, 546521, 510835, 171103, 219840, 156895, 67916, 203808, 455941, 466281, 572742, 520068, 415520, 420106, 524124, 346621, 113560, -93089, -246891, -228376, 161405, 260257, 260482, 239942, 399602, 136605, 53547, 231536, 64157, 157580, 392663, 150416, 60548, 38065, 91803, 338659, 644916, 916513, 764267, 435549, 105535, 37518, 189686, 536116, 729156, 723656, 444299, 473311, 623502, 826770, 693903, 273570, -205513, -162580, -418756, -551165, -480990, -302074, 53977, -87718, 171910, 86422, 154426, -297381, -321617, -255467, -135428, -265834, -400233, -280117, -282535, -222849, -184120, -382160, -34216, 460976, 306724]
17119C06724j48740J15076p9070k95732K44449J43875L50701L33057K5524k72415
17109G23449m24911k23235J80762J19162k29652k00073K14570q3305K59473j86909
17099A49331l30818j26106L59449K52724Q8493j11964k70369j70328p492M63636
17089B96556J30262k63294L07499J97490p608K4264J23753m13138k77812o3871
17079E4101j9396J05268J72923K0390K08402p4592j88422J23942J77516j7761
17069E62371O2716k07187r8888m9069n1012p2117M84436N0708J14424j81153J30481
17058G45710J40124j26374p898K62432o6433k74669j60189j16799K38394J04342
17048G38640q8207R5453j87156r3166O39937K19729q6976k15295J28668K52193
$$ y = [306724, 157984, 273060, 193990, -101742, 142707, 286582, 637283, 970340, 995864, 723449, 298538, 75303, 256065, 375227, 145575, -54498, 160072, 76767, 336240, 149331, -181487, -307593, 51856, 304580, 393073, 281109, 10740, -159588, -167080, 296556, 426818, 163524, 471023, 668513, 660905, 685169, 808922, 395784, 117972, 54101, 34705, 139973, 312896, 333286, 541688, 467096, 278674, 402616, 580132, 562371, 625087, 417900, 319012, 269943, 218931, 146814, 631250, 681958, 796382, 615229, 745710, 885834, 759460, 751562, 1013994, 947561, 672892, 512703, 395904, 634298, 738640, 650433, 745886, 558730, 465564, 1105501, 1325230, 1238254, 1022959, 1151627, 1403820]
17038A403820j67565j49785j02833n4407j99376R032R1767K01587K36770j33592
17028A135418L08935L62909o8243l34280k13000R7697j53803N254J86698O3739
17018A391324p8486J49459K55459n3889M3414j94565L17658K72165J50244o0950
17008B191833l91717l24476J73676J24220L37410K17785m4865L57253N53n6076
16998B585596J749j81368K54085K20366J24479P4773k91573l7931p6346k03743
16988B470087L73181M61850R5233J03479o9988K2673J79711K63303j1n9001J38189
16977C978706J8629O344N19269K28344O5314K88139K11234N07806P47109P99372
16967G370266J020887J189675O60805O44424P04554Q14527J198111J189966J475327
$$ y = [1403820, 1236255, 1086470, 983637, 929230, 729854, 738886, 830653, 1032240, 1269010, 1135418, 1444353, 1807262, 1739019, 1404739, 1191739, 1289436, 1135633, 1140887, 1327585, 1391324, 1312838, 1462297, 1717756, 1663867, 1707281, 1512716, 1830374, 2102539, 2252783, 2191833, 1800116, 1475640, 1649316, 1773536, 2110946, 2328731, 2283866, 2641119, 2641672, 2585596, 2587345, 2405977, 2660062, 2880428, 3004907, 3079680, 2788107, 2750176, 2673830, 2470087, 2843268, 3305118, 3400351, 3503830, 3433842, 3456515, 3636226, 3899529, 3899518, 3840517, 3978706, 3997335, 4003679, 4522948, 4751292, 4816606, 5104745, 5315979, 5823785, 6570894, 7370266, 8391153, 9580828, 10241633, 10886057, 11590611, 12405138, 13603249, 14793215, 16268542]
16958A6268542K046862K477583L591860N354716P969327J2611848J9919718K6912846
16950I7153302L1425419K9613513K0423479J5574346L2380620O6508545Q4717408
16943C77796632P0959484O736923q8133659r8561224n8017375k4371924j227821
16936A85181036K1506648M5248448N6314537M6221262L764417n8021551p3843690
16929B26371107n1722023l1069645j9391529j2371012p508073m572814k738312
16922I6997699j076364J165369L808753P417020J4602720K6865240M5242063O0674382
16914B55696882O0272538L6340130k2125832o5434624n2351843k3635713p6023
16907A88685515K4172389N5250395Q2415524Q4903622N6589484k6208126r5803201
$$ y = [16268542, 18315404, 20792987, 24384847, 29739563, 37708890, 50320738, 70240456, 97153302, 128578721, 158192234, 178615713, 194190059, 226570679, 293079224, 377796632, 448756116, 455493039, 367359380, 268798156, 210780781, 186408857, 185181036, 206687684, 251936132, 308250669, 354471931, 358236348, 300214797, 226371107, 174649084, 143579439, 124187910, 111816898, 104308825, 99736011, 96997699, 95921335, 97086704, 100895457, 108312477, 122915197, 149780437, 195022500, 255696882, 315969420, 352309550, 330183718, 264749094, 212397251, 188761538, 188685515, 212857904, 268108299, 350523823, 435427445, 492016929, 465808803, 370005602]
16900C70005602p5313262l4373019j2755132j2164342k3779488l2299380k9513310
16893A49807669k0453043j3673705j0403172q380360o734727n577729m843237
16886G9741696m251492l798180l317957l492460l096535l141915k752975k150234
16878E3739948k053539k415764k040271j747527j233748j116467j384803j227495
16870D0520334j146633j236541r80067j171565j185532j020640n92679p28951
16862C2457726j009919j080657r35735r42992j037890r28110j138100n07369r1834
16853B4785120q71321n38223o35380r99413p03975l33577k41193p21786j031673
16844A8708579n73072j58503k51516m05675n54238k46892J05503k39735k75790
$$ y = [370005602, 294692340, 260319321, 247564189, 235399847, 211620359, 179320979, 149807669, 129354626, 115680921, 105277749, 96897389, 90162662, 84584933, 79741696, 75490204, 71692024, 68374067, 64881607, 61785072, 58643157, 55890182, 53739948, 51686409, 49270645, 47230374, 45482847, 44249099, 43132632, 41747829, 40520334, 39373701, 38137160, 37157093, 35985528, 34799996, 33779356, 33186677, 32457726, 31447807, 30367150, 29431415, 28488423, 27450533, 26522423, 25384323, 24876954, 24785120, 23913799, 23375576, 22740196, 21740783, 21036808, 20703231, 20462038, 19740252, 18708579, 18135507, 17977004, 17725488, 17319813, 16765575, 16518683, 16624186, 16384451, 16108661]
16835A6108661m49705n03386l34648n84924l57355m1880n26774p75147j89267
16826A2345575l15122m53574l08155k36990l13829m08657m79465k27305j44214
16817I458264r2176j93381J7900j59758J3516m81571l20620L00551J99051j07681
16807H634095n30646k00897l44222l58445m48871l11386r7805k98334j93961q8135
16797E761393j90446j41060m8809j65705Q8467J24863j4077k34796k84590k30546
16787D664694m5200m97035j63318j7621K63298J31192l65303o08481j20469n1030
16777C190727K79455J47354n0266k6667K5672L52192j15352l93368N1259l54415
16767C106591k37187J56417k45663j6287j59333k17685m71711N9498Q3674K5699
$$ y = [16108661, 15658956, 15155570, 14820922, 14235998, 13878643, 13836763, 13309989, 12534842, 12345575, 12030453, 11576879, 11268724, 11031734, 10717905, 10309248, 9829783, 9602478, 9458264, 9366088, 9172707, 9190607, 9030849, 9044365, 8562794, 8242174, 8542725, 8741776, 8634095, 8103449, 7902552, 7558330, 7199885, 6751014, 6439628, 6341823, 6043489, 5849528, 5761393, 5570947, 5429887, 5381078, 5215373, 5303840, 5428703, 5414626, 5179830, 4895240, 4664694, 4619494, 4122459, 3959141, 3941520, 4204818, 4336010, 3970707, 3362226, 3241757, 3190727, 3470182, 3617536, 3567270, 3540603, 3566275, 3918467, 3803115, 3409747, 3461006, 3106591, 2869404, 3025821, 2780158, 2763871, 2604538, 2386853, 1915142, 1974640, 2058314, 2084013]
16757B084013K4491p2013k13207L052j10403k61164l03779J20499K37610k39272
16747A269827P9049k50261j19869M5907j1170l61051M1526J0903M29378K65090
16737A399329r0125k66613j96233j1726K32315l82449n07118J07664J00878O6014
16727D51936r0446J6869J23626J23027j66318j15051N3295P0795O0098K10490
16717G38321m8588l00490N4405K17237K22665R2714l86934l0919Q2616n50978
16707I0049l44312P8478J23105J64331K56851k55982k84763j87736P3808K56305
16697b9866J25554M1413J59013j2669K59260j01990M7449P2234M22858K04517
16687A187773l9583m34488n9581K15168j44668j79294J93551k7267l49952n4271
$$ y = [2084013, 2108504, 2036491, 1823284, 1826336, 1715933, 1454769, 1150990, 1271489, 1509099, 1269827, 1348876, 1098615, 978746, 1024653, 1013483, 652432, 693958, 704861, 1134239, 1399329, 1309204, 1042591, 846358, 834632, 1066947, 684498, 177380, 285044, 385922, 451936, 361490, 378359, 501985, 625012, 458694, 343643, 396938, 467733, 527831, 738321, 689733, 389243, 443648, 660885, 883550, 976264, 589330, 558411, 641027, 90049, -254263, -175785, -52680, 111651, 368502, 112520, -172243, -359979, -286171, -29866, 95688, 137101, 296114, 283445, 542705, 440715, 488164, 560398, 983256, 1187773, 1148190, 713702, 654121, 869289, 724621, 545327, 738878, 711611, 361659, 307388]
16677C07388j36446J30915J58468k2329K09787j35153m9826P2817p3655J42494
16667F04460l22684J08877Q3369J2220n8442r7080K00057J02691j3762l40760
16657B78946J57402j88180N2930J1235p9831j18029K040L11322J91871o9637J1243
16646E61312l98962m87834J8526K11827N05242J68066N1215K25477o3172l73968
16636D17729R9451Q8625k18127J01810l66777p9709P5294J6146J16502l11511
16626f0567j05035K44735J95117l0873J65631L86452m3401j40768r3236j68823
16616C49232l43723j59581K93231L11542L46885J46126j62045m28781m81686j41015
16606b69815M30843l6266o9046k03910o7600M0832j09308O0245L34676K21216
$$ y = [307388, 170942, 301857, 460325, 437996, 647783, 512630, 462804, 535621, 461966, 604460, 281776, 390653, 474022, 486242, 427800, 330720, 530777, 633468, 619706, 278946, 436348, 248168, 301098, 312333, 232502, 114473, 116513, 427835, 619706, 550069, 561312, 162350, -325484, -306958, -95131, 410111, 578177, 629392, 854869, 791697, 417729, 517180, 605805, 387678, 489488, 122711, 43002, 118296, 134442, 250944, -60567, -165602, 79133, 274250, 243377, 409008, 795460, 752059, 611291, 518055, 349232, 5509, -154072, 139159, 450701, 797586, 943712, 781667, 352886, -128800, -269815, 161028, 124762, 55716, -148194, -215794, -174962, -284270, -224025, 110651, 331867]
16596C31867K44543K26385j92352k83922k11228l42052q4749P0150j34771o9998
16586d46127N51249K37595Q456J35315n64937m67041L27355j69707K34734J30913
16576b2195k86292k47157Q8483K07131j11794O5258o8124J35738l22217m41486
16566a002655K34731J00317j21147L24551L25677J98053j60298p0250L02315N03550
16556F34844J557j06696k51605k19761k96583L2063J84264K12612K7098J40617
16546C58410l31776q4277M20815M6824j25072k44811l64750J24603l17432k21593
16536g39059K12803K26669k44388J16020J56576K69715k19407j28407N8164L52594
16526F1280K3170l21126K1987K39058l8137j37111L20367R9324J41619O0936J03541
$$ y = [331867, 576410, 802795, 610443, 326521, 115293, -226759, -311508, -241358, -376129, -446127, 105122, 342717, 351173, 486488, -78449, -545490, -218135, -387842, -153108, -22195, -308487, -555644, -467161, -260030, -371824, -306566, -374690, -238952, -561169, -1002655, -767924, -667607, -788754, -464203, -138526, 59527, -100771, -171021, 131294, 634844, 636401, 529705, 278100, 58339, -238244, -206181, -21917, 190695, 217793, 358410, 26634, -57643, 363172, 409996, 284924, 40113, -324637, -200034, -517466, -739059, -526256, -299587, -543975, -427955, -271379, -1664, -221071, -349478, -291314, 61280, 84450, -236676, -214689, 24369, -13768, -150879, 169488, 268812, 410431, 471367, 574908]
16515E74908k86647k95791k14804q8423K53256K76072o3560l74775k37050q965
16505d65779O0506j23909O7094O35990K30303M0911j46084m5312k63098l25707
16495c35085K53979O0510j52902J92417O2133l18090j25177j55233l2551K6169
16485e23830M16494p854K34981M62501K55881j84375o41717k73486P3910l674
16475a91169L6664Q1394L7282J33459M9228k7309J79581J81576j76291j71085
16465A33330K7768M5913J17332P3974m07770r0996O4078O5213k11455m9540P0864
16454a61289K26714j07544l38397L46980L69992J7773j81555L81520l9906l9627
16444D74661L70960M75268J93977j59287j04976k67923k64309Q199O5529p6641
$$ y = [574908, 288261, -7530, -222334, -310757, -57501, 218571, 155011, -219764, -456814, -465779, -405273, -529182, -462088, 173902, 404205, 445116, 299032, 253720, -9378, -335085, -81106, -20596, -173498, 18919, 81052, -237038, -362215, -517448, -549999, -523830, -107336, -115190, 119791, 582292, 838173, 653798, 12081, -261405, -187495, -191169, -154505, -73111, -35829, 97630, 146858, 119549, 299130, 480706, 304415, 133330, 161098, 207011, 324343, 398317, -9453, -100449, -36371, 28842, -182613, -232153, -161289, 65425, -42119, -380516, -33536, 336456, 354229, 172674, 554194, 514288, 474661, 845621, 1320889, 1514866, 1355579, 1250603, 982680, 718371, 726570, 792099, 715458]
16434G15458j72961m86954K61609N93497K75311k2372j49527m7698K30461K42695
16424A439519k17149l53795k00739m2854l4800J79217j14983J3079k42907j79948
16414B44640j56246M14719J38400R2417Q4371J60286M18730L50441K19763Q1675
16404B049196K75382N7910j52868o55820q19538l72383J171J87589K84886N43442
16394A398967r2964j77111L56089j41385j81201k47365J54997O1315N10410j79859
16384A461893o05632m31616k68210j52694j87388K21671J28835K83750J59777
16375F10386k88221p1677K66830J77370j85345m68462k68035J56315J37295Q7336
16365A53792K38731m0923j36807l15003M1793j71524L32819J03339m00603j09847
$$ y = [715458, 542497, 55543, 317152, 910649, 1185960, 1163588, 1014061, 966363, 1196824, 1439519, 1222370, 868575, 667836, 624982, 590182, 769399, 654416, 667495, 424588, 244640, 88394, 503113, 641513, 733930, 818301, 978587, 1397317, 1747758, 1967521, 2049196, 2324578, 2382488, 2229620, 1573800, 754262, 381879, 383050, 570639, 855525, 1398967, 1306003, 1128892, 1484981, 1343596, 1162395, 915030, 1070027, 1131342, 1641752, 1461893, 856261, 424645, 156435, 3741, -183647, 38024, 166859, 450609, 610386, 322165, 250488, 517318, 694688, 509343, 40881, -227154, -70839, 66456, 153792, 392523, 351600, 214793, -100210, -58417, -229941, 102878, 206217, -194386, -304233]
16355c04233J63937l2411o6699K10M47747J8989l81326L42444k09697k1490k96254
16344c38783m83936J70499N42633l7958K25362J10585l37888j22327P3925O5288
16334a32600l20947j25455K37173K78898P1378N4861k34431P4257K3737P494j42624
16323b08259l5456j33075J7617J50751j30495n8533M73801R9959k01790l9588
16313f5068k73853k00632j19209l74680R1524j41691K62004J74646J98564o5777
16303e14172K55963J10406k81785j14440K2786l3535K31087K01856J06874K6423
16293A1463K04089J84352k08469R609P4677j09763K03384l98727m99021K28783
16283b99623P9865q3111k81465J88649K8064p2005K53122n0673j71509j62278
$$ y = [-304233, -140296, -172707, -239406, -239196, 208551, 227540, -153786, 188658, -21039, -42529, -338783, -822719, -652220, -109587, -147545, 77817, 188402, -149486, -271813, -197888, -132600, -453547, -579002, -341829, -62931, 8447, 63308, -171123, -96866, -73129, -65635, -208259, -243715, -376790, -359173, -208422, -338917, -397450, 76351, 176310, -25480, -65068, -338921, -539553, -658762, -1033442, -941918, -1083609, -821605, -646959, -448395, -514172, -258209, -147803, -429588, -544028, -521242, -554777, -323690, -121834, -14960, 11463, 215552, 399904, 191435, 201044, 275721, 165958, 369342, -29385, -528406, -299623, -219758, -302869, -584334, -395685, -367621, -439626, -186504, -237177, -408686, -570964]
16273e70964l81724j20139M69278L28440M08990j4789o2069l90751j48190K57321
16263b24597J57774n9860K80607J26737j14903m10391l60135M8191J77516J51823
16253b27238N0983Q7948m38576J26138K33586m5043K11075N0500J39576p7492
16243A11457m04671l39468l5909J16277l717J93332J65335K16663k7726M9349
16233D0922k02678j05282K0014j26720l96224j100K74838j75218J59088J9323
16223d93037J66639l4392J05915n9456j25462R2545K81056r9918Q849j00290l85632
16212f43183K3680n8657R5797L96377q2604r4531m84l59789J33047J70719K96917
16201a22711J80559Q907p7877k62886k161K58395k0155K6920M9737k94784L3043
$$ y = [-570964, -952688, -1072827, -603549, -275109, 133881, 119092, 57023, -333728, -481918, -224597, -66823, -126683, 153924, 280661, 165758, -244633, -604768, -556577, -379061, -227238, -176255, -88307, -526883, -400745, -167159, -212202, -1127, 49373, 188949, 111457, -293214, -632682, -668591, -552314, -556031, -362699, -197364, 19299, -8427, 40922, -161756, -267038, -247024, -373744, -769968, -771068, -496230, -671448, -512360, -493037, -326398, -360790, -254875, -314331, -439793, -347248, -66192, -166110, -157261, -257551, -643183, -619503, -678160, -582363, -185986, -268590, -363121, -363605, -723394, -590347, -419628, -122711, 57848, 66755, -11122, -274008, -276169, -17774, -37929, -11009, 38728, -256056, -223013]
16190b23013L58475l08230r2254J19401J8677q1295o1416P6082L55694r6632j04543
16179c9054k45095r5212L22597L9718J17044j26746L7892K65539q2606k10073
16169a5996R1911K62300p110R3092k3672R2865k6933m1380m30465j12729k17909
16158c36026l65089R0287K44488J1484J27272q0330k71251M9688l9808P2268J59972
16147c37045l30041K37374P2145N255O7016j06386J5825L47982P5765j16635N9089
16136i656l3549J37886j31761O558K18785k39838r6744M2055J30499L3365o4254
16125f654o8070M2024J52449o1675m27771M31601J78621m42183n35331P4677M84818
16114a77494J11462j22316J20631J29036m5394K07090K17240m5429k28743j5518
$$ y = [-223013, 135462, -172768, -265022, -145621, -126944, -208239, -269655, -193573, 162121, 65489, -39054, -284149, -379361, -56764, -17046, 99998, -26748, 11144, 276683, 194077, -15996, 75915, 338215, 331105, 424197, 400525, 493390, 466457, 425077, -5388, -118117, -336026, -701115, -610828, -366340, -354856, -227584, -307914, -579165, -529477, -569285, -497017, -337045, -667086, -429712, -357567, -352312, -285296, -391682, -375857, -27875, 47890, -68745, -9656, -43205, 94681, -37080, -30522, 188263, -51575, -148319, -106264, 24235, 57600, -6654, -74724, -32700, 119749, 58074, -369697, 61904, 240525, -201658, -736989, -662312, -177494, -66032, -188348, -67717, 61319, 15925, 223015, 440255, 394826, 166083, 150565]
16104A50565K15449o9428m96023p3334m1197o2651J02447K17347j60330j69916
16094c87071J44855L56511p5675l58704j85111q9646m2999m4510j2771J47735
16084e47386N21388J8064j27155j29991k03849J75099j03023K81635J01412J1089
16074b717Q2126K33328l53184l00680j19634k41993K07452J64337j56219p22K11325
16063b76581r141Q0612J55267p0953K7714J15178l6574J45977o2870k25328l92913
16052e49612O3456K58988K09478J2308j48377k31959l14669l06443L28870N81819
16042i6141L05845K6463N22967J33001R9000j09664j81994n47463l21949j22106
16032b92041J36108J23224m7673K60121j4742k42345k38804R0262J58828m4946
$$ y = [150565, 366014, 296586, -199437, -272771, -313968, -376619, -274172, -56825, -217155, -387071, -242216, 114295, 38620, -320084, -505195, -594841, -637840, -682350, -695121, -547386, -25998, -7934, -135089, -265080, -468929, -293830, -396853, -115218, -13806, -2717, 79409, 312737, -40447, -341127, -460761, -702754, -495302, -330965, -487184, -487906, -276581, -285722, -205110, -49843, -120796, -93082, 22096, -14478, 131499, 68629, -156699, -549612, -486156, -227168, -17690, -5382, -153759, -385718, -700387, -1006830, -677960, -96141, 209704, 236167, 759134, 892135, 991135, 881471, 699477, 152014, -169935, -292041, -155933, -32709, -80382, 179739, 164997, -77348, -316152, -225890, -67062, -112008]
16022a12008K6088k9460l16554k8605m2387k85197j70634j21050K75626J83336
16012f20845J73910K10547O3663J50798j17378o8167J11696k53900j73389j11460
16002f34525K64978K71582j51455k20788J22229Q7204j09153L7674Q7145k55378
15992e00487l8904J08559J03884J95514L04343J29014m44936p0238J01797m4468
15982a55922j79515l1455K53647j82758m13694L34650J43017K91594J00741K76382
15972D36687q0437l97888l852q8422j23854K96526L40312K29053J40256j27032
15962F21349M7078j93653o6196J95841p902k81250k52859J50891j88674N2035
15952G6660m0847k10428J79950M02784k42479l32193L6485J90961J12828J95631
$$ y = [-112008, -85920, -115380, -431934, -460539, -502926, -788123, -958757, -1079807, -804181, -620845, -446935, -236388, -172725, -21927, -139305, -207472, -95776, -349676, -523065, -634525, -369547, -97965, -249420, -470208, -347979, -260775, -369928, -332254, -245109, -500487, -539391, -430832, -326948, -131434, 172909, 301923, -143013, -213251, -111454, -155922, -335437, -366892, -113245, -296003, -709697, -375047, -232030, 59564, 160305, 436687, 356250, -41638, -45490, -133912, -257766, 38760, 379072, 608125, 748381, 621349, 668427, 474774, 408578, 604419, 596517, 315267, 62408, 213299, 24625, 76660, 35813, -174615, 5335, 408119, 165640, -166553, -130068, 60893, 173721, 369352]
15942C69352r6867L11219L40081p2420m20880j83999O8233l85535l53565j56372
15932e80753O1899N2924K16340j26068k05178L18002J10176k72284k82227j03810
15922h10979L01406P9745r7076J89425O4861L05072p5736Q6074J68113k69325
15912e8420k26500k05131p3598O0967l4659K17053K0477K09527J08785K7360J77791
15901B23652l6571j65859j60106J85106K84247j32128J50970J06432j17378k08520
15891A29845J06828k01175k08193k95179l3510L33541J58758k889J70449r2184
15881F6291N6437k24814J07805P4539K83073j34381l47857m69659M8296J69560
15871c70710K70053J15607K89016K00085j41704J3056q3610l41398K2648j70126
$$ y = [369352, 272485, 583704, 923785, 851365, 430485, 246486, 314719, -70816, -424381, -580753, -518854, -465930, -249590, -375658, -580836, -262834, -152658, -424942, -707169, -810979, -509573, -429828, -526904, -337479, -272618, 32454, -43282, 42792, 210905, -58420, -284920, -490051, -563649, -502682, -537341, -320288, -299811, -90284, 18501, 45861, 223652, 187081, 21222, -138884, 46222, 330469, 198341, 349311, 455743, 338365, 129845, 236673, 35498, -172695, -467874, -501384, -167843, -9085, -11974, 158475, 66291, 122728, -102086, 5719, 80258, 363331, 228950, -118907, -588566, -540270, -370710, -100657, 14950, 303966, 504051, 362347, 375403, 291793, -49605, -26957, -197083]
15861a97083k21874L58429L96829K49418k43297L47149l50230k81580l11571L19166
15851F5356k09692m068q6832p1291Q2164j54550n3516M5788J4051l38216l4058
15840g44864P2723L0611Q3616P8351L25973j86036m5767j4803J8640J79205J52308
15829e0043J56645l42976j65953K27051p3345J02694K44973J09512k24946l51757
15819c68145p9261m4505P3601K79671k08239n79129N8515K54832O9293N52607
15809I240K29248P6305k53115k64309q844O2158k82165L0197K40037k10805k94005
15798f66058j3502J71627N464n39988j5741J01280J40823J53027J71707O0645
15788d30716m91180J08555L39619J57155J11152P4514o055k59663O7340J86288
$$ y = [-197083, -418957, -60528, 336301, 585719, 342422, 689571, 339341, 57761, -253810, 65356, -144336, -148404, -235236, -306527, -224363, -378913, -432429, -386641, -372590, -710806, -744864, -672141, -641530, -557914, -479563, -153590, -339626, -385393, -400196, -381556, -202351, -50043, 106602, -236374, -402327, -175276, -248621, -145927, 99046, 208558, -16388, -368145, -447406, -491911, -418310, -138639, -346878, -926007, -867492, -612660, -543367, 9240, 238488, 314793, 61678, -202631, -211475, -149317, -431482, -401285, -161248, -372053, -666058, -679560, -507933, -502469, -1042457, -1058198, -956918, -816095, -663068, -491361, -430716, -921896, -813341, -473722, -316567, -205415, -130901, -136956, -396619, -329279, -142991]
15778a42991J83924k92564M2672M9160k1999L36868J36713p43229m25054J09573
15768g66927J85183J54591K75838R3130k02469j14253J10755p9370P7301j31858
15758c98079k37193q734O8866j01896P4671n8103K14747p0244l37021J42330M80229
15747b30427p4187m0542L2133k76125K20551M72498K70917k6842j25961m71571
15737b49556J56273M93993q5664k24390j24536J70306R4881j17348J63655l03899
15727b6285l11192Q5890j14665o8226K75810k23663p6819J32224K91414j36035
15717a71547k59005L17687l5188J79132L30720J2532l10102j96541j49609J10335
15707a71586K60527J03999k42933m96925N55677M42381p4829k29765k40025K31398
$$ y = [-142991, 40933, -251631, -208959, -159799, -181798, 155070, 291783, -451446, -876500, -766927, -581744, -427153, -151315, -58185, -260654, -374907, -264152, -343522, -266221, -398079, -635272, -644006, -575140, -677036, -602365, -660468, -445721, -515965, -852986, -710656, -230427, -304614, -345156, -313023, -589148, -368597, 103901, 374818, 347976, 222015, -249556, -93283, 400710, 315046, 90656, -33880, 136426, 231307, 113959, 277614, -26285, -337477, -251587, -366252, -434478, -158668, -382331, -459150, -326926, -35512, -171547, -430552, -112865, -148053, 31079, 361799, 374331, 64229, -132312, -281921, -171586, 88941, 192940, -49993, -546918, 8759, 451140, 376311, 146546, -93479, 137919]
15697A37919N887j72822j84045O824O5765M3266O4682J55956J94199l66616o55413
15686g04398J62077K94576N2366j51115j32575k43734o9241L05680J81410K543
15676c02411L14216L70722l27332j92895K01038K57140O3410j03957k60867k31800
15666b12736n1488J46354K2195m7330J32068l0221Q4461o1348m05909J85444J32033
15655a06477N276k4947J05561p5799j8158O1984j37192J44594R5373k11344q1726
15644b42855L3916n4700j5392M7158j31431J65430P8533K81938M30780k06196
15634C87181q5524K0010K42572n583j93657K09269k51157l6699o817k63325L69121
15623C85391J65580j71444k62244K6125K71384j4669j2482j79625J80402k54994
$$ y = [137919, 143806, -29016, -213061, -206237, -140472, -97206, -32524, 123432, 317631, -48985, -704398, -542321, -247745, -195379, -346494, -479069, -722803, -792044, -486364, -304954, -302411, 11805, 382527, 55195, -137700, 63338, 320478, 383888, 279931, 19064, -212736, -264224, -117870, -95675, -143005, -10937, -41158, 43303, -18045, -423954, -238510, -106477, -101201, -126148, -20587, -96386, -114544, -52560, -189752, -45158, 50215, -161129, -242855, -208939, -263639, -279031, -231873, -363304, -197874, -119341, 162597, 593377, 387181, 301657, 321667, 564239, 558656, 364999, 574268, 323111, 286412, 279595, 16270, 385391, 550971, 379527, 117283, 143408, 414792, 400123, 387641, 208016, 388418, 133424]
15613A33424k09465o8966Q0391l7315l83248k10472J79194O1850K56246K1862
15603a76499K27539j55607j47778J13141K5307k01197K46549M1974n2362p385
15593h6318J1320j01210P1914j00645J43753j85722q1079R9005k16196K7928Q8265
15582c28985j15189N3393j82140Q2541K17296J46499l23416R1547k17341o452
15572e82247L93821K62724j14007O8040j92703L289K44861j95393K23874o1344
15562E0915r3108J8725j3922j50642k43296p4090j6104O9333K22296K52844k43014
15551b20063j41059J26167J46225o4601p3009K11660Q4439o1589m42804j91212
15541f25846j2205L02112L16999m2031M5734M0955O1413k51177j62841R3492K46403
$$ y = [133424, -76041, -145007, -64616, -101931, -485179, -695651, -516457, -454607, -198361, -176499, 51040, -104567, -252345, -139204, -113897, -315094, -68545, -26571, -78933, -86318, -74998, -176208, -104294, -204939, -61186, -246908, -327987, -228982, -445178, -417250, -328985, -444174, -390781, -572921, -490380, -273084, -126585, -450001, -358454, -575795, -582247, -188426, 74298, -39709, 28331, -164372, -161083, 83778, -111615, 112259, 50915, -42193, -23468, -37390, -188032, -431328, -505418, -521522, -452189, -229893, 22951, -220063, -361122, -234955, -88730, -153331, -226340, -14680, 69759, 8170, -434634, -625846, -638051, -335939, -18940, -60971, -15237, 25718, 87131, -164046, -326887, -233395, 13008]
15530A3008p4677J28652K95111r9676N8419Q7j59209N6456l9821O3473O8460j39361
15518A70922K2687k34868l09547l8281l3052J26387L03252J01849j70965J78307
15508A16691L0111l00851M3583J15681k33471j05959Q6645m89321k46819j12006
15498a095716J34875M71633L46407p2530j5284L7702r1418k46159q2180K18612
15488c94058j52594l4687J40224o6161K36786J27807L67373l1334l09376O7463
15478d8557K12435k26162j87751R9625j1790N6350k61933J45404K5980J80481
15468a5918L52642K29133k4310l03066l3108P6006n3767r2063j7697J1180p6420
15457E2612k62311J46191j4018M3684J17088Q7651l57379P0353L6812l42400L59680
$$ y = [13008, -61669, 66983, 362094, 262418, 320837, 320924, 161715, 218171, 178350, 241823, 310283, 170922, 193609, -41259, -350806, -389087, -422139, -295752, 7500, 109349, -61616, 116691, 146802, -154049, -110466, 5215, -228256, -334215, -247570, -736891, -983710, -1095716, -960841, -489208, -142801, -215331, -230615, -192913, -284331, -530490, -612670, -394058, -546652, -581339, -441115, -507276, -270490, -142683, 224690, 193356, -116020, -48557, 163878, -62284, -250035, -150410, -162200, -105850, -367783, -222379, -196399, -15918, 336724, 565857, 541547, 238481, 205373, 281379, 227612, 135549, 117852, 129032, 52612, -209699, -63508, -77526, -33842, 83246, 170897, -186482, -116129, -79317, -421717, -62037]
15446f2037K19426m96200l29930N6284L5271J26402K06495J06124Q4055l40937
15436c95047j47404K29264Q357j21798J89503J63725m6346M8753k13109j32063
15426d16165K21456j82158j9482r79N9031M90343p8144k29326M7369J24086K00884
15415B16915J26661n49011p7815L53548p7212n49513j84387K66723K14790J66376
15405i2925k06068k31297m532M47421Q6035j3517K3019J9260K27161J34957m1469
15394C48045j14654k94350K75756j34988j39936l67171J70586K25803N7281J5156
15384D1528l47113q1766L33175n6748j97964J51959L45957k21016l73347j45282
15374e50617j14378Q2606P51934K41025o8045k82172q9921k92513J03078L98654
$$ y = [-62037, 157389, -338811, -668741, -612457, -577186, -450784, -244289, -138165, -54110, -395047, -542451, -313187, -304830, -426628, -237125, -73400, -119746, -70993, -284102, -416165, -194709, -376867, -396349, -397328, -338297, 152046, 73902, -155424, -108055, 16031, 216915, 343576, -205435, -283250, 70298, -6914, -556427, -740814, -474091, -259301, -92925, -298993, -530290, -534822, -87401, -1366, -14883, 8136, 27396, 254557, 389514, 348045, 233391, -60959, 214797, 79809, -60127, -427298, -256712, -30909, 26372, 41528, -305585, -387351, -54176, -110924, -308888, -156929, 189028, -31988, -405335, -550617, -664995, -582389, 169545, 410570, 342525, 60353, -29568, -322081, -219003, 179651]
15364A79651k96313J10385K2072K39490J4356k33991K79906j97995l09386R9586
15354i2239p6006N0242m7592q5107j2691Q2809l16106J44829J08377P1855j5118
15343a86747r9107P4900l0664J08289N6898J32161l04951m65345P55705O87248
15333G28387o3890o59822l60700K13634J94248K19574j50266n9336K24549k7690
15323B58688o3803J62670K25401m34788n75511J75132K33354j43548J39752j07317
15313a29970K6675j6632r4948k10352K70093r7387l08606L18632k00816L7536
15303d05775J14993j11534r5587K92172K45333j3900K7496k13140p8366K15998
15293b2310J65199k75429j46770M74186K93632N3984R8850j54176J4027n30211
$$ y = [179651, -116662, -6277, 15795, 255285, 269641, 35650, 315556, 117561, -191825, -92239, -168245, -118003, -165595, -250702, -263393, -180584, -496690, -351861, -243484, -171629, -186747, -285854, -210954, -241618, -133329, -76431, 55730, -249221, -714566, 41139, 728387, 664497, 4675, -356025, -142391, 51857, 271431, 121165, 61829, 286378, 258688, 194885, 357555, 582956, 148168, -427343, -252211, -18857, -162405, -22653, -129970, -103295, -119927, -214875, -425227, -155134, -252521, -561127, -242495, -443311, -405775, -290782, -402316, -497903, -205731, 39602, 25702, 53198, -159942, -238308, -22310, 142889, -132540, -279310, 194876, 488508, 542492, 641342, 487166, 501193, -29018]
15283b9018O551L46615K9108k00746p139J87273m19628l33276K57187K55041n8395
15272C3573q0736j2979j75444Q6331N55970K20572n394o1987k7902j76438l3547
15261C22019k02390o4572j59921k23000Q0541J65878K8510K46333Q5360r1615
15251A87143k05756j87887j70881l3624j15621L00659K17366J10119r0283K34685
15241B45920m3013j42093Q577j33303j64399r2675J26278J87743M7914J3763l82350
15230c27638k89577l2804M1758R7199J10606K28425L14432k8041K14308J29061
15220D57729j20066Q2371M8279q9796l35713l7354J12839m1417R9499j13305j42243
15209g9177k94247Q8141k31318K41456R7122L6333L93462Q6538p0118k59957Q277
$$ y = [-29018, -22467, 324148, 353256, 152510, 145371, 332644, -86984, -420260, -163073, 91968, 33573, -47163, -60142, -235586, -149255, 406715, 627287, 621893, 559906, 532004, 355566, 322019, 119629, 55057, -104864, -327864, -247323, -81445, -52935, 193398, 278758, 187143, -18613, -206500, -377381, -411005, -526626, -225967, -8601, 101518, 11235, 245920, 202907, 60814, 69391, -63912, -228311, -320986, -194708, -6965, 40949, 54712, -327638, -617215, -650019, -608261, -511062, -400456, -172031, 142401, 114360, 328668, 457729, 337663, 420034, 468313, 378517, 42804, 5450, 118289, 76872, 176371, 63066, -79177, -373424, -285283, -516601, -275145, -178023, -141690, 251772, 338310, 268192, 8235, 16512]
15198A6512n7987j72178R6059k8733K36275m8916k99766l1125J83977J70569l72401
15187c07714k667L46107J84426M0762O3097r5952j40594n8544j81980J52183o6313
15176f7189l79839r3113R7630j5117L4094J50014k69161L14000J57848j27389
15166a98222j65742j15189J44579Q442J93405P9406K93380J44325P036j40540
15156B50880j19839j15682j34465l3934l5044K14170J83901k09957l51466j02871
15146d54307N02167J31019j79962m5722k63454l80704k52861N02151J03802j4377
15136c52248l09658j82769m4400K25755K06801J35869k8647O9967M5208N2927
15126a81195J52095p7836l15009J05196M74042j1818j37030k88431N8534k44608
$$ y = [16512, -41475, -213653, -117594, -146327, 89948, 41032, -258734, -289859, -105882, 64687, -307714, -310381, 35726, 220152, 260914, 324011, 228059, 87465, 28921, -153059, -876, -67189, -447028, -540141, -442511, -457628, -423534, -273520, -542681, -228681, -70833, -198222, -363964, -479153, -334574, -326132, -132727, -53321, 240059, 384384, 391420, 250880, 131041, 15359, -119106, -153040, -188084, 26086, 209987, 30, -351436, -454307, 47860, 178879, -1083, -46805, -310259, -690963, -943824, -441673, -337871, -352248, -661906, -844675, -889075, -663320, -456519, -320650, -349297, -279330, -234122, -181195, -29100, -106936, -421945, -316749, 157293, 145475, 8445, -279986, -221452, -466060]
15116d66060j92104Q9261N0704K03967r3718q6515L63641O01291j57755m85021
15106a72309k47335r5044k7495k60128L75332K77277J35875q8014l66863n05756
15096i74460J38033L54562L28947M164J82245R0178m15508l40653K39839M77646
15086H4993K44317K5901j08122K28936Q0484j90440n8831k97697J75215Q4928
15076B69684N993Q6247n57185k23941L86138J40036P763Q0784K7739j04289j61386
15065d2417j41441J12828L12505P3799l188p0905m5243l19078p1241O5073o5034
15054a94342j39321k3868O698L49838k8078J50026M67055J33235k06063n19020
15044c840k13372J04737P7631N6206o4132J04718J57615k95571n5010R0452Q4340
$$ y = [-466060, -658164, -568903, -518199, -314232, -407950, -494465, -130824, 470467, 312712, -172309, -419644, -514688, -542183, -802311, -426979, -149702, -13827, -101841, -468704, -974460, -836427, -481865, -152918, -148754, 33491, 123669, -291839, -632492, -392653, 84993, 329310, 355211, 247089, 476025, 556509, 366069, 307238, 9541, 184756, 269684, 275677, 361924, -195261, -419202, -33064, 106972, 114735, 195519, 223258, 118969, -42417, -183858, -71030, 241475, 315274, 312086, 241181, 195938, -123140, -194381, -129308, -194342, -333663, -357531, -350833, -995, -29073, 120953, 588008, 721243, 515180, -3840, -217212, -112475, -34844, 21362, -42770, 61948, 219563, -76008, -131018, -40566, 43774]
15033D3774o1666q7244k55149Q9712N0795J14564J40471l4253l34735J1167M06845
15022H4281J51995m943k37715k97537n26566J27483J84840P9062k04855L11983
15012c31972K52870K56259J42082o5109J55867K24751K81397o50828n25512j24021
15002c84216L2995O6527K12927J67982m82881m4712R4737K58664Q3679k64528
14992b58826j63744L37510M51413K77105j33144K60496k06455k30840j87245n1379
14982I4891P3045Q8042k3501q4521n3459j8749J63904J85719K2849j42907P5521
14971C80834J99915k17927o3772N5796j16395N0570J47295j79842m51654l1234
14961b26414l18193M7667O96053J62580k74641j34787j1654J25886J04639J81642
$$ y = [43774, -17892, -105136, -360285, -270573, -219778, -105214, 35257, 1004, -333731, -322564, 84281, 236276, 231333, -6382, -303919, -830485, -703002, -518162, -439100, -643955, -331972, -79102, 177157, 319239, 254130, 409997, 634748, 916145, 265317, -260195, -384216, -351221, -284694, -71767, 96215, -386666, -431378, -336641, -77977, 5702, -258826, -422570, -85060, 366353, 643458, 510314, 770810, 564355, 333515, 146270, 94891, 167936, 255978, 232477, 147956, 94497, 75748, 239652, 425371, 448220, 305313, 380834, 580749, 362822, 299050, 354846, 238451, 289021, 436316, 256474, -195180, -226414, -544607, -496940, 199113, 361693, 87052, -47735, -59389, 66497, 171136, 352778]
14951C52778J59838r778j13379o5982M5024k62349m82933R2886K73608J25394
14941A15107J46937k49983j90768J07551o8508n8154L18199N7804m14584P5942
14931a60457J92898J7081k36275J71082J21436J07456K767K67778l34038j71581
14921b1853k13857L9991K43206N31745J00685n18294k52720k44448J00737K13399
14911b1409J36177k6379l45887k41252K18009j06169j76241L30688K31372j91308
14901a92399j68803O0318J27069m82737q5689q7458K73584O8908J01237K15518
14891a70452k612K68217J41059j60237k45428l89960j89939J2020j71936K16598
14881f92670K09532K47817M0966j11580l67417o5925N8849L4063n1383J40495
$$ y = [352778, 512616, 502838, 389459, 323477, 368501, 106152, -376781, -283895, -10287, 115107, 262044, 12061, -178707, -71156, -139664, -197818, 120381, 178185, -236399, -160457, 32441, 49522, -186753, -15671, 105765, 213221, 215988, 483766, 149728, -21853, -235710, -195719, 47487, 579232, 679917, 161623, -91097, -335545, -234808, -21409, 114768, 88389, -257498, -498750, -280741, -386910, -563151, -232463, -1091, -192399, -361202, -300884, -173815, -656552, -742241, -829699, -556115, -487207, -385970, -170452, -173064, 95153, 236212, 75975, -169453, -559413, -749352, -737332, -909268, -692670, -483138, -235321, -194355, -305935, -673352, -739277, -680428, -646365, -697748, -557253]
14871e57253N02754L29007J65560J4490j73979k78412l1233M5310k11178j35920
14861c30854l313j14524R1489R6564K39204J84102j88661J99767M22561K16858
14851H13193k93969m40046m6158j22924J22102J73247j36066q7585k85206L79885
14841G6473L78872J28732o9509k23419K7934K11932j39711k54058m1611j40607
14831d4972J12447o4287n53387K13289O79596O39226N3593j04073l62979k4386
14821E44067N0168k7498M8908l20691l18955l5693Q2228N2655k39511k91990L35343
14810a20969L47969k89426J4171n8965O3559k16256j60418L32795L28223L04002
14800E44685k58841j10088j15062j03099j00559j36055K93963J43120J00826l87702
$$ y = [-557253, -54499, 274508, 440068, 454558, 280579, 2167, -29066, 16244, -194934, -330854, -334167, -448691, -357202, -260638, -21434, 162668, -25993, 173774, 596335, 813193, 519224, 79178, 33020, -89904, 32198, 205445, 69379, -18206, -303412, 76473, 455345, 584077, 514568, 291149, 319083, 531015, 391304, 137246, 95635, -44972, 67475, 3188, -550199, -336910, 342686, 981912, 1035505, 931432, 568453, 544067, 594235, 566737, 615645, 294954, -24001, -59694, 22534, 75189, -164322, -456312, -120969, 227000, -62426, -48255, -107220, -43661, -259917, -420335, -87540, 240683, 544685, 285844, 175756, 60694, -42405, -142964, -279019, 14944, 158064, 258890, -128812]
14790a28812j63613L66589r7359j53011M28887N6830k7079j14252l28707J48467
14780a2060N5261k48262j32280J66159j39903j17851j74172L1337O200J01451
14770d64120J35347J14239J68575r370j82867L36895k05904J59427K11771l08052
14760d4059p3618r6912L17410L5371j82585o1245K1922K68543J23782J05305j71938
14749B41976l59753L42656K51002l4779j89533O6772j31085m2373l405J07096
14739B48574k5027j87898k06629m19920m0385L09851J74412P0467J8568k54818
14729c12805j13147J07395J29804k63592J23717r3601k6505K08405o9696J95597
14719a14428P7424J69513L46591o8759o1142l47635l11911M7941j74275R5452
$$ y = [-128812, -292425, 74164, -23195, -176206, 252681, 309511, 282432, 168180, -160527, -12060, 43201, -205061, -337341, -171182, -311085, -428936, -603108, -571771, -565571, -464120, -328773, -214534, -45959, -55329, -238196, 98699, -107205, 52222, 263993, -44059, -117677, -214589, 102821, 138192, -44393, -105638, -83716, 184827, 308609, 413914, 241976, -117777, 224879, 475881, 441102, 251569, 318341, 187256, 144883, 141478, 248574, 223547, 35649, -170980, -590900, -631285, -321434, -147022, -76555, -57987, -312805, -425952, -318557, -188753, -452345, -328628, -422229, -448734, -240329, -310025, -114428, -37004, 132509, 479100, 410341, 349199, 1564, -310347, -262406, -436681, -341229]
14709c41229K24436p3585k08642K01315k0561P129K68565K61097j48371l38851
14699a68697j31148J44971j10072j30291N6554l8985j00286K42526L32109k3252
14689G3429o7420m1865m27228J76866M12235l9310j29120j62100j19495R817J70445
14678a43746K94374K9411J30536L7025L4619M8612l19787l37972n1038p4378L66546
14667A4202O0285J4990n1001k48190k9718J23010m5013n5212j05509Q7225J43386
14656i1545K17045J54562J64416j90948l55772k18044j28035k62373k74O9106
14646f41862J14220P9914j43213L03144J60424k98942O3544J75389L93938O2641
14636B69197j2590j86262j0530N52946O5725l21875n58877k37670J43124J43688
$$ y = [-341229, -116793, -190378, -399020, -197705, -218266, -211137, 57428, 318525, 170154, -168697, -299845, -154874, -264946, -395237, -338683, -377668, -477954, -235428, 96681, 73429, 6009, -35856, -463084, -286218, 126017, 86707, -42413, -204513, -324008, -314191, -143746, 150628, 180039, 310575, 347600, 382219, 430831, 111044, -226928, -277966, -352344, 14202, 74487, 89477, 38476, -209714, -239432, -116422, -161435, -216647, -322156, -234931, -91545, 125500, 280062, 444478, 253530, -102242, -320286, -448321, -710694, -710968, -641862, -527642, -447728, -590941, -287797, -127373, -426315, -362771, -187382, 206556, 269197, 256607, 70345, 59815, 612761, 678486, 356611, -202266, -439936, -296812, -153124]
14626a53124M554r3434J06875l2444k41112J56185L29162J12637k56813k3306
14616i0820J91073K3918J39479J90054N012l3361r3615j10055l14951k09896j50379
14605d53541n4262L15837m7877J82284R5415k20840j70675J19497M16012R8301
14595B80151j87132l59473J1522L01133j98134M0332R0817Q353j79255p2358J11343
14584a52701K09411K88604k40242j99343P9223J98313K01357Q7332N5131J99220
14574G26305L8827J72511l55515j82980k10058o663J488j44647k61655k6803L70429
14563A21239r4078l5567J20525k3947q3967k97164k57081L29576M06697k89873
14553a03640r0988L6113J25220n751J58853K46971J55257r5177k58747j52250
$$ y = [-153124, -148570, -242004, -135129, -167573, -408685, -252500, 76662, 189299, -67514, -90820, 100253, 124171, 263650, 453704, 458716, 425355, 331740, 221685, -93266, -303162, -453541, -507803, -191966, -239843, -57559, 37856, -182984, -353659, -234162, 181850, 280151, 93019, -266454, -254932, 46201, -151933, -111601, -20784, -12431, -191686, -264044, -152701, 56710, 345314, 105072, -94271, -15048, 183265, 384622, 471954, 527085, 726305, 765132, 937643, 582128, 399148, 189090, 182427, 183915, 39268, -222387, -249190, 121239, 27161, -8406, 112119, 88172, 4205, -292959, -550040, -220464, 186233, -103640, -194628, -158515, -33295, -39046, 119807, 366778, 522035, 426858, 168111, 15861]
14543A5861l0979K48053J47003k3945L22032m01176j31243l06472r5497O85988
14533D29625M30303l34351l14229q6568Q0501K63595j55132l16706M4331K26499
14523B67868j12693m66176j10979R802n92323K7702N06776O41139j67180k90593
14513b86657M42270L72714Q584o1585K0304j74981l3740r7279m25347j84809k38216
14502f58742j45752J66390M12047M2672K5957J85726k6212L0605J06010L05882
14492D44583Q6271l3913k61537O6830K32644l08210k51357j65784q9442l4745
14482c14660L01815j71806j67482j01141J41992L36873j89710k88825J49748K64359
14472c8837j75798q8231j88423L5799K64247J47005J72821j50753L626K35301
$$ y = [15861, -15118, 232935, 379938, 355993, 678025, 276849, 145606, -160866, -256363, 429625, 859928, 525577, 211348, 124780, 205281, 468876, 313744, -2962, 41369, 267868, 155175, -311001, -421980, -412178, -1004501, -976799, -470023, 171116, 3936, -286657, 155613, 528327, 536911, 475326, 495630, 320649, 286909, 189630, -235717, -420526, -658742, -804494, -638104, -226057, -183385, -157428, 28298, 2086, 32691, 138701, 444583, 530854, 496941, 235404, 302234, 534878, 226668, -24689, -190473, -279915, -314660, -12845, -184651, -352133, -453274, -311282, 25591, -164119, -452944, -303196, -38837, -214635, -302866, -491289, -455490, -191243, -44238, 128583, -22170, -18544, 216757]
14462B16757J23845M0613j93051j19704j3849j00835m7880L0010j37550k25347
14452d26991J07824K71466K78186m959o3422Q2879J56113k45887k71376J57583
14442D1416K60209m13506j9167L05347q2645n6680J54805r5155J79099J28545
14432D02268m53840j47495P5224L19919J14248k22917j57097j1940j04208K82487
14422I6649j50037j18552j00173M47474K44510l2489J25119l2942l36920m50403
14412c07764K06501M35177K11906j30461K68563l01173m01122j27223P2092K02016
14402A28512j08428J32742k3176n1435K04219k67888j32454n3389M7145L2766
14392i1386P2755m467J36714k59214j49874M88211O1007m45194j19863L60827
$$ y = [216757, 340602, 381215, 188164, 68460, 54611, -46224, -94104, -64094, -201644, -426991, -319167, -47701, 230485, 225526, 162104, 244983, 401096, 155209, -116167, 41416, 301625, -111881, -131048, 174299, 91654, 34974, 189779, 94624, 273723, 402268, -51572, -199067, -123843, 196076, 310324, 87407, -69690, -81630, -185838, 96649, -53388, -171940, -272113, 175361, 419871, 387382, 512501, 479559, 142639, -307764, -101263, 333914, 545820, 415359, 683922, 382749, -18373, -145596, -73504, 128512, 20084, 152826, 129650, 78215, 282434, 14546, -117908, -171297, -124152, -91386, -18631, -23098, 113616, -145598, -295472, 192739, 253746, -191448, -311311, 49516]
14382D9516M0268l2467r6259k22704j81431K31279O227L30710N9319m6123j65677
14371b7342p653J4026j22864J69676M757J67104K53165j03543J90572q1521K50842
14360G07219o6141m82335q2725j9536j71688j23237L28799L1525j10736j35726
14350a24581k34773Q4197L5241p9949K62022L32188R010j79316j71643K38409
14340A70805M5602k05103o1167m36599R7646L85260O9551j89847J55820r9434
14330f7466m05769J79300L41255K86189m9939k7779J39820j53338j5863P5537
14320C01947k7520k90524P6892k07317J08276K10053m430J46824k3601J32827
14310D23427j45068k11370k2794L06714K8616l26088l3300L76471l30618j91298
$$ y = [49516, 89784, 57317, -38942, -261646, -443077, -211798, -205571, 125139, 184458, 138335, -27342, -34995, -20969, -143833, 25843, 30600, 197704, 450869, 347326, 537898, 456377, 707219, 641078, 158743, 76018, 56482, -115206, -238443, 90356, 121881, 11145, -124581, -359354, -275157, -239916, -319865, -57843, 274345, 283355, 104039, -67604, 170805, 216407, 11304, -49863, -486462, -388816, -3556, 65995, -123852, 31968, -67466, -473235, -293935, 47320, 333509, 283570, 255791, 395611, 242273, 226410, 301947, 274427, -16097, 60795, -146522, -38246, 171807, 167377, 314201, 290600, 423427, 278359, 66989, 44195, 350909, 379525, 53437, 20137, 396608, 65990, -125308]
14300a25308n9557K62654J27166J72098k58317l21681M0243L31646m4810K5699
14290A49833M9295l02161l5515J80633k53424k93042J42226j53729K36136J71464
14280a08284j98717j39185o2477J30955K28376N1393J79642q8646J55376N7244
14270B05677o9692j68252J82754J15112N3096J06934p3696L4745K58828P0306
14260G15812k18460J9264R5264m3370R4155R899j41291Q7688L24228p3984J47915
14249A017120o8762o73448o9207j12651J58598k22313l11187J90733J01643r7748
14239h7222L27314J96343J96260k46204l31202N7101K21721N0554M83531J10711
14229I78907R8221l99125k28582K27375j9447l45228R1891j34113q0515L220K69174
$$ y = [-125308, -184865, 77789, 204955, 377053, 118736, -202945, -162702, 168944, 124134, 149833, 199128, -103033, -138548, 42085, -211339, -504381, -362155, -515884, -279748, -108284, -307001, -446186, -508663, -377708, -149332, -97939, 81703, -6943, 148433, 205677, 135985, -32267, 150487, 265599, 318695, 425629, 351933, 386678, 645506, 715812, 497352, 516616, 611880, 568510, 662665, 672564, 531273, 618961, 943189, 869205, 1017120, 948358, 274910, 205703, 93052, 251650, 29337, -281850, -91117, 10526, -87222, 240092, 436435, 632695, 386491, 55289, 112390, 334111, 384665, 868196, 978907, 1077128, 678003, 449421, 676796, 657349, 312121, 404012, 269899, 189384, 192604, 461778]
14218D61778l2261l3110m97387n87467M1144L88640R2544K27226l8676K04218
14208B26649N9205q5367J76174l1890j34776J33395J62473K85935r8751q2849
14198F10198j75377l50135m16751K34970K47062M25209J46526l75486j31412J0097
14188B24901o2754R4390p1500o9598M6316K26049K0143O6713J16268J75123O0349
14177H26400l91492l90217k5191p5854J58753j10348J81405j33969J48252M08628
14167E96367r17j64971K02367j99306m5320J64720j38053l9215O6317k02345l71922
14156a32278k72033L23291K82043L05811j05190k78924M27169Q7274k23916j17004
14146B96243M999o0465o8170J43783J23727k4403J4567p3278L15976L70955N4797
$$ y = [461778, 429517, 396407, -100980, -688447, -647303, -258663, -166119, 61107, 22431, 226649, 285854, 200487, 376661, 344771, 209995, 343390, 505863, 791798, 693047, 610198, 434821, 84686, -332065, -97095, 149967, 575176, 721702, 346216, 214804, 224901, 162147, 256537, 185037, 115439, 161755, 387804, 407947, 474660, 590928, 766051, 826400, 434908, 44691, 19500, -56354, 102399, -7949, 173456, 39487, 187739, 596367, 595450, 430479, 632846, 433540, 388220, 552940, 414887, 375672, 441989, 239644, -132278, -404311, -81020, 201023, 506834, 401644, 122720, 549889, 637163, 413247, 296243, 301242, 240777, 172607, 316390, 440117, 415714, 430281, 357003, 672979, 1043934, 1098731]
14135A098731q448j74885k05831j35677j85312q6309k50359j27049K24501R8231
14125B47593L10106K80402j1889J405o2018m69441k59982K10885j61456n7212
14115B8393L31869q623j88471k4018P0304J52186L72884J7985m27226m00080J89096
14104A14299Q3868J58430o6265k22219M89694L28326m0818m09660k95500j34405
14094E750j51907o9148j5853J26443K38787J75159k11052j56041J44733n8026
14084B8845J23028k91355j38691N03386K3728n57763M3405K41068K63875n9542
14074A79984J74956J48732Q0472n3065M6245j56683k94961k6449J10190J26978
14064C36399j59N24925j83475m4446q8696K7969J08050k91553n51404N0064M61824
$$ y = [1098731, 1090283, 915398, 709567, 573890, 388578, 302269, 51910, -75139, 149362, 247593, 557699, 838101, 826212, 827617, 765599, 296158, 36176, 247061, 85605, 28393, 360262, 351639, 163168, 139150, 209454, 361640, 734524, 752509, 325283, -74797, 114299, 198167, 356597, 290332, 68113, 557807, 886133, 845315, 435655, 140155, 5750, -146157, -215305, -231158, -104715, 134072, 309231, 98179, -57862, 86871, 28845, 151873, -139482, -278173, 225213, 248941, -308822, -265417, -24349, 239526, 179984, 354940, 503672, 584144, 531079, 577324, 420641, 125680, 99231, 209421, 336399, 336240, 861165, 677690, 633244, 544548, 572517, 680567, 389014, -162390, -112326, 349498]
14053C49498J40q0188j49062N364N41118K52773n0562K7377k8889n27939k0971
14042C18659j44374K7247K68983q8243k12648k74075l69079J88506J32926N0J77409
14031B5361J72503J94526l01828r6640K45016j75111j99708J26254J64479L47490
14021E02342R5154k2890j49083J11346L8551K87586J47826p47136j14174J79586
14011C29108m1129j3311j4369q6510j68054K25867J97623J25590J51714k046j57199
14000E47284j82349l8293N3644M4740J90343J07851o2730k92916l17274J02042
13990A52342L80792l9061j67908l09606j60060N6281K04897J58498P4820J35969
13980D86964n603Q783l14492l97791O4319O91562K36606l43682q7843L72064P9191
$$ y = [349498, 349638, 269450, 120388, 125752, 666870, 919643, 869081, 896458, 867569, 339630, 318659, 174285, 201532, 470515, 382272, 169624, -104451, -473530, -285024, -152098, -152048, 25361, 197864, 392390, 90562, -6078, 238938, 63827, -135881, -9627, 154852, 502342, 597496, 574606, 425523, 536869, 575420, 863006, 1010832, 263696, 149522, 329108, 287979, 274668, 260299, 173789, 5735, 231602, 429225, 554815, 706529, 704483, 547284, 364935, 326642, 380286, 425026, 615369, 723220, 660490, 367574, 50300, 152342, 533134, 494073, 326165, 16559, -143501, -87220, 117677, 276175, 350995, 486964, 481361, 490144, 175652, -222139, -157820, 533742, 770348, 426666, 338823, 710887, 790078]
13969G90078K21525m6195j37688k15424r5671O7441j09964J22464l6743l17756
13959B42067m19942K8736L84200L56145L61820K2746l46345J4247k06788j96949
13949B39937j3000J19628J9226q0762r9911J31706k20780k2872N09434J45987
13939G28593K69676J94088O8001m93804j73755J00247j06074r0856K65769R3391
13929H55276J80121k50656k19070j83513j64229J50254J50475J29543q1091k7759
13919E39351k23425J35250M31726k87669l10076L1990m7126J52431J23672L5127
13909E81251R7272K0328K52188K9074k42016k60833J32253K9578R5160j28764
13899F05491j62170m8806j02582L17634O6586j09691L20367J23177k79871k74008
$$ y = [790078, 1011603, 965408, 827720, 612296, 516625, 584066, 474102, 596566, 559823, 242067, -177875, -149139, 235061, 591206, 953026, 975772, 629427, 643674, 436886, 239937, 226937, 346565, 365791, 285029, 185118, 316824, 96044, 73172, 582606, 728593, 998269, 1192357, 1260358, 766554, 592799, 693046, 586972, 496116, 761885, 855276, 1035397, 784741, 565671, 382158, 217929, 368183, 518658, 648201, 567110, 539351, 315926, 451176, 882902, 595233, 285157, 317147, 270021, 422452, 546124, 581251, 678523, 698851, 951039, 980113, 738097, 477264, 609517, 639095, 734255, 605491, 443321, 394515, 291933, 609567, 676153, 566462, 886829, 1010006, 730135, 456127]
13889D56127j12535m4011K06085J70534m0568K70088j59713k12686l67187q1566
13879H4568M8460Q0154M04836J77786K75011m28762l56977m8453j05904K26780
13869C57499J4159j40265j36104q225l34383l0794M58765O8076k37331l27764
13859c16367O6001J98486J44662m4522Q9448K29869R3658J3172j07218j15144
13849B52045J02982J61890J89877p8879k11703J16278j11231j85516L35428J26334
13839F97505j69433j04007J41664K04562J47032j42184j14116j64192K14749L45071
13829A056651L17514j03977k59888m84154J78425L69626m45418N8149j28079j86189
13819C72660k024k5164L23975K43327o1465M2721P8743L130J47537j7520O780
$$ y = [456127, 343592, 299581, 505666, 676200, 635632, 905720, 746007, 533321, 166134, 84568, 133028, 213182, 618018, 795804, 1070815, 642053, 285076, 236623, 130719, 357499, 371658, 231393, 95289, 87064, -247319, -278113, 180652, 248728, 11397, -316367, -250366, -51880, 92782, 48260, 137708, 367577, 461235, 474407, 367189, 252045, 355027, 516917, 706794, 627915, 416212, 532490, 421259, 235743, 571171, 697505, 528072, 424065, 565729, 770291, 917323, 775139, 661023, 496831, 711580, 1056651, 1374165, 1270188, 1010300, 526146, 704571, 1074197, 628779, 686928, 558849, 372660, 370636, 345472, 669447, 912774, 851309, 894030, 972773, 975903, 1123440, 1105920, 1112700]
13808A112700j14207O4702J7010j43016p9534j45431j24109j41466j40755Q2827
13798C88721j41785K15938k9922M3674J84317K46773J45456J35325o4440m3525
13788A080532J33258Q1638j88083n77146j42440K1737K2430N9573K32626k56305
13778D67820o6650L03125L0452L31550K66162M0486l09617J32675J17707K78333
13768A592043j92827k02857N0487p7867k18669j5721k4001Q0365L01916k0721
13758A272148l46980n50454N0466K61743q8028p6982J39538R7421M89320L54077
13748A602269K0454j31997k26911k05758r1021j6328j25612j91064N9769L38480
13738A032281J66283M7005K07727j08971j79544k7028j1145L6976J06943l77334
$$ y = [1112700, 998493, 1063195, 1080205, 937189, 857655, 712224, 588115, 446649, 305894, 388721, 246936, 462874, 432952, 476626, 660943, 907716, 1053172, 1188497, 1124057, 1080532, 1213790, 1295428, 1107345, 530199, 387759, 409496, 431926, 491499, 724125, 467820, 401170, 704295, 734747, 1066297, 1332459, 1372945, 1063328, 1196003, 1313710, 1592043, 1399216, 1196359, 1246846, 1168979, 950310, 934589, 910588, 990953, 1292869, 1272148, 925168, 374714, 425180, 686923, 598895, 521913, 661451, 758872, 1248192, 1602269, 1622723, 1490726, 1263815, 1058057, 967036, 950708, 825096, 634032, 693801, 1032281, 1198564, 1245569, 1453296, 1344325, 1164781, 1137753, 1126608, 1163584, 1270527, 893193]
13728H93193P1298K96229k9587J26297j56658n0799O8224j50322j33363L22804
13718A257316J45791L30188p912m57685n772N618j41419J69857J67935q6684P3304
13707A450537O4974K82957o0479K8725n6228l03103R1837J95184J1907l47526
13697A358785j96984k6790L21452K11053j16508j02805q7485L57528L53638j2589
13687B059295l15946K844j1371M9108j38088J5277O2591r7273r0043m5515J45727
13676A636606j1396K14234O7294k9553j77119j13356N8592J397j43131o346j47022
13665A350200p5347J64783N0505k97240m26275K45441N55092K7768J53622j11647
13655A636902k27749j22536j05874N3360J97898J40112L13228N3253q1715j88390
$$ y = [893193, 964491, 1260720, 1231133, 1357430, 1200772, 1149973, 1218197, 1067875, 934512, 1257316, 1403107, 1733295, 1725383, 1267698, 1261926, 1267544, 1126125, 1295982, 1463917, 1377233, 1450537, 1515511, 1798468, 1737989, 1766714, 1710486, 1407383, 1499220, 1694404, 1706311, 1358785, 1161801, 1135011, 1456463, 1667516, 1551008, 1448203, 1360718, 1718246, 2071884, 2059295, 1743349, 1746193, 1734822, 1783930, 1645842, 1661119, 1723710, 1626437, 1536394, 1490879, 1636606, 1625210, 1839444, 1906738, 1877185, 1700066, 1586710, 1645302, 1646699, 1503568, 1497222, 1350200, 1274853, 1439636, 1490141, 1192901, 766626, 1012067, 1567159, 1594927, 1748549, 1636902, 1409153, 1286617, 1180743, 1234103, 1432001, 1572113, 1885341, 1938594, 1856879, 1668489]
13645A668489j93235j41218l3925L51674J83775L10465J08880j21192n29277k62406
13635A342030K72950O9545j56306p8237j35052Q1329J98051j93577p5759l1831
13625A293143K17862J75988J44490m45290Q7417M65595k00525n12638p9503M70130
13615A616669J70891L2693J60089J16481J47397j07245j53897k26303J8000l680
13605A771095K50997j43579J95217R9873j82580j16659J86348m0915q6335o412
13595A927050n0380J73019K61133j53229j72293J38298J04548k89433R1275K60692
13585B290680M13123l06353j49717j22033k27902m61418J50720K07903n4962L9852
13575A779893M72698L50695J73335k03676J46563Q1457J85120j58275j86468q6772
$$ y = [1668489, 1475254, 1334036, 1300111, 1651785, 1835560, 2146025, 2254905, 2133713, 1604436, 1342030, 1614980, 1684525, 1528219, 1449982, 1314930, 1396259, 1594310, 1400733, 1324974, 1293143, 1511005, 1686993, 1831483, 1386193, 1473610, 1939205, 1738680, 1226042, 1146539, 1616669, 1787560, 1820253, 1980342, 2096823, 2244220, 2136975, 1983078, 1756775, 1774775, 1771095, 2022092, 1878513, 2073730, 2173603, 1991023, 1874364, 2060712, 2019797, 1933462, 1927050, 1876670, 2049689, 2310822, 2157593, 1985300, 2123598, 2228146, 1938713, 2029988, 2290680, 2703803, 2397450, 2247733, 2125700, 1897798, 1436380, 1587100, 1795003, 1740041, 1779893, 2252591, 2603286, 2776621, 2572945, 2719508, 2800965, 2986085, 2827810, 2641342, 2554570]
13565B554570l41479m41460j03899K0253J36352L92515J24367m49437j7608M57551
13555B331725Q1851K7536Q512K0962M0320k8210o0135j5243k0260j76017k38464
13544A972577q9793k7698J48830K67265K15492K67021O5932L3299o9205j30864
13534B652856k51738K55110O86940l52337m76948K28844K46801N5122J21527L91083
13524C557260r0666j82317R5941j42751j98824r7352j36277m2389P7831O2862
13514B903318K6027L41205L25183n174L49094J67978k92315k28504m6910m14771
13504C125131k9484J87981K59820M10317k45925J17618k14612l02707o7177j25104
13494C115858L38420J39544k19389l16981m113K35389L32160m31007k48274n643
$$ y = [2554570, 2213091, 1771631, 1667732, 1687985, 1824337, 2216852, 2341219, 1891782, 1874174, 2331725, 2413576, 2441112, 2449624, 2470586, 2510906, 2482696, 2422561, 2407318, 2387058, 2211041, 1972577, 1882784, 1855086, 2003916, 2271181, 2486673, 2753694, 2819626, 2852925, 2783720, 2652856, 2401118, 2656228, 3343168, 2990831, 2513883, 2742727, 2989528, 3044650, 3166177, 3557260, 3466594, 3284277, 3380218, 3237467, 3038643, 2941291, 2805014, 2762625, 2840456, 2903318, 2929345, 3270550, 3595733, 3590559, 3939653, 4107631, 3815316, 3586812, 3539902, 3125131, 3095647, 3283628, 3543448, 3953765, 3707840, 3825458, 3610846, 3308139, 3240962, 3115858, 3454278, 3593822, 3374433, 3057452, 3053339, 3288728, 3620888, 3189881, 2941607, 2935964]
13484B935964L04135K24604K6632l10376j37326P4309P0213J25222l3788m2161
13474C237428j77441J58230j41138j18505J43298J67001K30632K48609K41638
13465C989752L58131M04084K80338k83726l58707k12957J02033r4483j36936j4383
13455D033146N1928P0273j05721J55250M380K38726K72720k81621l78876J07088
13445D167293K73735N0568L4255L9977n4423l0862K1016o3899J68568K25086K52633
13434E083947q1920L00666N14344P8851l12461N514k46505m88236K97959K13099
13424E365258j14442J9850J2183J81397j1341n8901J63686k26016O0612K13678
13414E605964K49709o4726L50062J68446k37675K20448M45800N24092M65829M59022
$$ y = [2935964, 3240099, 3464703, 3491335, 3180959, 3043633, 3117942, 3188155, 3313377, 3279589, 3237428, 3059987, 3218217, 3077079, 2958574, 3101872, 3268873, 3499505, 3748114, 3989752, 4347883, 4751967, 5032305, 4748579, 4389872, 4176915, 4278948, 4184465, 4047529, 4033146, 4085074, 4155347, 4049626, 4204876, 4209256, 4447982, 4720702, 4439081, 4060205, 4167293, 4441028, 4491596, 4525851, 4565828, 4511405, 4480543, 4501559, 4437660, 4606228, 4831314, 5083947, 5002027, 5302693, 5817037, 5895888, 5583427, 5588941, 5342436, 4854200, 5152159, 5365258, 5250816, 5270666, 5282849, 5464246, 5452905, 5394004, 5557690, 5331674, 5392286, 5605964, 5855673, 5790947, 6141009, 6309455, 6071780, 6292228, 6738028, 7262120, 7727949, 8186971]
13404H186971K80776k91665l70949m14844k93004k46778J5612O03571m7521m04987
13394G017182k69369r3533K24930J52446j65429J56153L98300K9946j22231j93642
13384G134753p5408J0388M414q7840k3767n6130j14568m5155Q1995O5837L44974
13373G239493O49463Q1764k45100j58974L21178k41381J26011k5277J30653P9895
13363G957725J1643q850j28572L40509K59288K24102M53668K04985k15581l68320
13353H730597J0517K92112K41275j95692r9492L0134J62721K62570K12781J63383
13343I810906P0964j61768M1197K61327k49263L49135L54513j08344j35283k64269
13333I969115j71656J04828L51874M47024L47608K38426J64857r3240n5068k8614
$$ y = [8186971, 8467747, 8176082, 7805133, 7390289, 7097285, 6850507, 6866119, 7469690, 7422169, 7017182, 6747813, 6654280, 6879210, 7031656, 6866227, 7022380, 7420680, 7450626, 7328395, 7134753, 7059345, 7069733, 7074147, 6986307, 6962540, 6906410, 6791842, 6746687, 6828682, 6894519, 7239493, 7888956, 7970720, 7725620, 7566646, 7887824, 7646443, 7772454, 7747177, 7877830, 7957725, 7969368, 7960518, 7831946, 8172455, 8431743, 8655845, 9109513, 9314498, 9098917, 8730597, 8741114, 9033226, 9274501, 9078809, 8979317, 9009451, 9172172, 9434742, 9647523, 9810906, 9881870, 9720102, 9761299, 10022626, 9773363, 10122498, 10477011, 10368667, 10233384, 9969115, 9797459, 9902287, 10254161, 10701185, 11048793, 11287219, 11452076, 11358836, 11303768, 11275154]
13323A1275154K40641L71811J3529j70649J38449J60579K28868N74384J5149O6730
13313A2914645P9510j62188j55403j13648K9848j08131l9157P21731M94251K18721
13303A3880179P4001K25721K01935N4208J92241J02038O7897P5988k3688j79672
13293A4670848K37332K87827J90312n1036R4515J53765K00226M03636K94665J95172
13283A6677262N0349Q8163K30019K22240K94026J13554R1227L25985K52434L6504
13273A8381763k53373K29178J92693K40548J85416K71138K69980M626K40783K51152
13263B0013904J38222M36597K48531J83778K45016J28117K29334L21215O7129
13254B2011843J62069J36118J89284M60665O27915N07872M69218R1344K27292
$$ y = [11275154, 11515795, 11887606, 11901135, 11730486, 11868935, 12029514, 12258382, 12832766, 12847915, 12914645, 12994155, 12831967, 12676564, 12562916, 12592764, 12484633, 12445476, 13167207, 13661458, 13880179, 13954180, 14179901, 14381836, 14436044, 14628285, 14730323, 14798220, 14874208, 14850520, 14670848, 14908180, 15196007, 15386319, 15335283, 15429798, 15583563, 15783789, 16187425, 16482090, 16677262, 16727611, 16815774, 17045793, 17268033, 17562059, 17675613, 17766840, 18092825, 18345259, 18381763, 18128390, 18357568, 18550261, 18790809, 18976225, 19247363, 19517343, 19521969, 19762752, 20013904, 20152126, 20588723, 20837254, 21021032, 21266048, 21394165, 21623499, 21944714, 22011843, 22173912, 22310030, 22499314, 22959979, 23587894, 24095766, 24564984, 24656328, 24883620]
13245B4883620M59999K32084Q00126K24150r817N5964l65811J52366L97900R46241
13235B7776822N76581K7883O34449P32389J42029l77264J232K97169M84753K17505
13225C0513548K20252M58336N67254M36206O65332L29539N66678O62465N34779
13216C4954389K84929R5704O08283L98716Q0610L03710P38413N67678N43921j4333
13206C8562020P6666N19912N50469L91001O84246L73838N02990O54740N25996
13197D2841878L60654L67785L15265L58483M43797M81251L33439Q72576N88386
13188D6963514K23751O45392N53197L55360K28482J32136K51129N76222P67589
$$ y = [24883620, 25343619, 25575703, 26375829, 26599979, 26590162, 26646126, 26280315, 26432681, 26830581, 27776822, 28353403, 28381286, 29015735, 29748124, 29890153, 29512889, 29514121, 29811290, 30296043, 30513548, 30733800, 31192136, 31759390, 32195596, 32860928, 33190467, 33757145, 34419610, 34954389, 35239318, 35335022, 35943305, 36342021, 36422631, 36726341, 37464754, 38032432, 38576353, 38562020, 38638686, 39158598, 39709067, 40100068, 40784314, 41158152, 41661142, 42315882, 42841878, 43202532, 43570317, 43885582, 44244065, 44687862, 45169113, 45502552, 46375128, 46963514, 47187265, 47832657, 48385854, 48741214, 48969696, 49101832, 49352961, 49929183, 50696772]
$$ [...]
##END NTUPLES=NMR SPECTRUM
##END=
