##TITLE=Analysis number 321504
Compound Code sb 01482
Project Code adrs
Chemist Name flurochem
##JCAMPDX= 6.0         $$ Bruker NMR JCAMP-DX V2.0
##DATA TYPE= NMR SPECTRUM
##DATA CLASS= NTUPLES
##ORIGIN= Bruker BioSpin GmbH
##OWNER= nmr
$$ XWIN-NMR		Version 3.5
$$ Mon Aug 14 10:57:00 2006 GMT Daylight Time (UT+1h)  MAYBRIDGE\nmr@NMR_250MHZ
##.OBSERVE FREQUENCY= 250.131544655141
##.OBSERVE NUCLEUS= ^1H
##.ACQUISITION MODE= SIMULTANEOUS (DQD)
##.ACQUISITION SCHEME= undefined
##.AVERAGES= 16
##.DIGITISER RES= 18
##SPECTROMETER/DATA SYSTEM= dpx250
##.PULSE SEQUENCE= zg30
##.SOLVENT NAME= CDCl3
##.SHIFT REFERENCE= (INTERNAL, CDCl3, 0, 16.522)
##AUDIT TRAIL= $$ (NUMBER, WHEN, WHO, WHERE, WHAT)
$$ ##TITLE= Audit trail, XWIN-NMR		Version 3.5
$$ ##JCAMPDX= 5.01
$$ ##ORIGIN= Bruker BioSpin GmbH
$$ ##OWNER= nmr
$$ C:\u/data/dgb/nmr/ADRS/760/pdata/1/auditp.txt
$$ ##AUDIT TRAIL=  $$ (NUMBER, WHEN, WHO, WHERE, WHAT)
(   1,<2006-08-14 10:56:34.06 +100>,<MAYBRIDGE\nmr>,<NMR_250MHZ>,
      <created by zg, POWCHK disabled, PULCHK disabled
       configuration hash MD5:
       E2 DF 36 D8 04 B2 41 60 5A D7 A3 38 5A 4B D0 FE
       data hash MD5: 64K
       6E 37 CC C1 93 AF FB 59 4F 0A D8 A7 B1 49 F6 0A>)
(   2,<2006-08-14 10:56:47.63 +100>,<MAYBRIDGE\nmr>,<NMR_250MHZ>,
      <Start of raw data processing
       ef LB = 0.3 FT_mod = 6 PKNL = 1 SI = 32K 
       data hash MD5: 32K
       DF 2C B6 07 28 5F 57 A3 EA 6F 5A D1 92 5E B9 B1>)
(   3,<2006-08-14 10:56:49.24 +100>,<MAYBRIDGE\nmr>,<NMR_250MHZ>,
      <apk 
       data hash MD5: 32K
       F2 96 9C FB 56 E1 51 73 CF F8 F3 B2 B2 AB 6D 6D>)
(   4,<2006-08-14 10:56:49.98 +100>,<MAYBRIDGE\nmr>,<NMR_250MHZ>,
      <abs ABSG = 5 
       data hash MD5: 32K
       3A 10 BB DE F8 4F 84 79 13 0F ED BA 75 EB 04 AE>)
$$ ##END=
$$ 
$$ hash MD5
$$ B7 07 DF AA 69 7C 3F 99 AC 15 F8 92 C0 B3 99 1F
##$RELAX= 
##$RELAX= 
##$RELAX= 
##$RELAX= 
##$RELAX= 
##$RELAX= 
##$RELAX= 
$$ Bruker specific parameters
$$ --------------------------
##$DU= <C:\u>
##$EXPNO= 760
##$NAME= <ADRS>
##$PROCNO= 1
##$TYPE= <nmr>
##$USER= <dgb>
##$AMP= (0..31)
100 100 100 100 100 100 100 100 100 100 100 100 100 100 100 100 100 100 
100 100 100 100 100 100 100 100 100 100 100 100 100 100 
##$AQSEQ= 0
##$AQ_mod= 3
##$AUNM= <au_zg>
##$AUTOPOS= <8 >
##$BF1= 250.13
##$BF2= 250.13
##$BF3= 250.13
##$BF4= 250.13
##$BF5= 500.13
##$BF6= 500.13
##$BF7= 500.13
##$BF8= 500.13
##$BYTORDA= 1
##$CFDGTYP= 0
##$CFRGTYP= 5
##$CHEMSTR= <none>
##$CNST= (0..31)
1 1 145 1 1 1 1 1 1 1 1 1 1 1 1 1 1 1 1 1 1 1 1 1 1 1 1 1 1 1 1 1 
##$CPDPRG= <>
##$CPDPRG1= <>
##$CPDPRG2= <>
##$CPDPRG3= <>
##$CPDPRG4= <mlev>
##$CPDPRG5= <mlev>
##$CPDPRG6= <mlev>
##$CPDPRG7= <mlev>
##$CPDPRG8= <mlev>
##$CPDPRGB= <>
##$CPDPRGT= <>
##$D= (0..31)
0 1 0 0 0 0 0 0 0 0.06 0 0 0 0 0 0 0.0002 0 0 0 0 0 0 0 0 0 0 0 0 0 0 
0 
##$DATE= 1155549393
##$DBL= (0..7)
120 120 120 120 120 120 120 120 
##$DBP= (0..7)
150 150 150 150 150 150 150 150 
##$DBP07= 0
##$DBPNAM0= <>
##$DBPNAM1= <>
##$DBPNAM2= <>
$$ [...]
##$SUBNAM7= <"">
##$SUBNAM8= <"">
##$SUBNAM9= <"">
##$SW= 20.6930455092707
##$SWIBOX= (0..15)
0 0 3 0 0 0 0 0 0 0 0 0 0 0 0 0 
##$SW_h= 5175.983436853
##$TD= 65536
##$TD0= 1
##$TE= 295.16
##$TE2= 300
##$TE3= 300
##$TEG= 300
##$TL= (0..7)
0 120 120 120 120 120 120 120 
##$TP= (0..7)
150 150 150 150 150 150 150 150 
##$TP07= 0
##$TPNAME0= <>
##$TPNAME1= <>
##$TPNAME2= <>
##$TPNAME3= <>
##$TPNAME4= <>
##$TPNAME5= <>
##$TPNAME6= <>
##$TPNAME7= <>
##$TPOAL= (0..7)
0.5 0.5 0.5 0.5 0.5 0.5 0.5 0.5 
##$TPOFFS= (0..7)
0 0 0 0 0 0 0 0 
##$TUNHIN= 0
##$TUNHOUT= 0
##$TUNXOUT= 0
##$USERA1= <user>
##$USERA2= <user>
##$USERA3= <user>
##$USERA4= <user>
##$USERA5= <user>
##$V9= 5
##$VALIST= <valist>
##$VCLIST= <CCCCCCCCCCCCCCC>
##$VD= 0
##$VDLIST= <DDDDDDDDDDDDDDD>
##$VPLIST= <PPPPPPPPPPPPPPP>
##$VTLIST= <TTTTTTTTTTTTTTT>
##$WBST= 1024
##$WBSW= 4
##$XGAIN= (0..3)
0 0 0 0 
##$XL= 0
##$YL= 0
##$YMAX_a= 535277
##$YMIN_a= -441430
##$ZGOPTNS= <>
##$ZL1= 120
##$ZL2= 120
##$ZL3= 120
##$ZL4= 120
##$ABSF1= 16.522
##$ABSF2= -4.171173
##$ABSG= 5
##$ABSL= 3
##$ALPHA= 0
##$AQORDER= 0
##$ASSFAC= 0
##$ASSFACI= 0
##$ASSFACX= 0
##$ASSWID= 0
##$AUNMP= <proc_1d>
##$AZFE= 0.1
##$AZFW= 0.1
##$BCFW= 0
##$BC_mod= 0
##$BYTORDP= 0
##$COROFFS= 0
##$CY= 12.5
##$DATMOD= 1
##$DC= 0
##$DFILT= <>
##$DTYPP= 0
##$F1P= 14.0000005364418
##$F2P= -0.99999901652339
##$FCOR= 0.5
##$FTSIZE= 32768
##$FT_mod= 6
##$GAMMA= 0
##$GB= 0
##$INTBC= 1
##$INTSCL= 1
##$ISEN= 128
##$LB= 0.3
##$LEV0= 0
##$LPBIN= 0
##$MAXI= 10000
##$MC2= 0
##$MEAN= 0
##$ME_mod= 0
##$MI= 0
##$NCOEF= 0
##$NC_proc= -4
##$NLEV= 6
##$NOISF1= 0
##$NOISF2= 0
##$NSP= 0
##$NTH_PI= 0
##$NZP= 0
##$OFFSET= 16.522
##$PC= 1
##$PHC0= -4.476657
##$PHC1= 6.759992
##$PH_mod= 1
##$PKNL= yes
##$PPARMOD= 0
##$PSCAL= 4
##$PSIGN= 0
##$REVERSE= no
##$SF= 250.13
##$SI= 32768
##$SIGF1= 0
##$SIGF2= 0
##$SINO= 400
##$SIOLD= 32768
##$SREGLST= <1H.CDCl3>
##$SSB= 0
##$STSI= 32768
##$STSR= 0
##$SW_p= 5175.98343685301
##$SYMM= 0
##$S_DEV= 0
##$TDeff= 65536
##$TDoff= 0
##$TI= <Analysis number 999999
Compound Code 99
Book Reference 9
Project Code 9>
##$TILT= no
##$TM1= 0
##$TM2= 0
##$TOPLEV= 0
##$USERP1= <user>
##$USERP2= <user>
##$USERP3= <user>
##$USERP4= <user>
##$USERP5= <user>
##$WDW= 1
##$XDIM= 32768
##$YMAX_p= 342437146
##$YMIN_p= -59641
$$ End of Bruker specific parameters
$$ ---------------------------------
##NTUPLES= NMR SPECTRUM
##VAR_NAME=  FREQUENCY,     SPECTRUM/REAL,   SPECTRUM/IMAG
##SYMBOL=    X,             R,               I
##VAR_TYPE=  INDEPENDENT,   DEPENDENT,       DEPENDENT
##VAR_FORM=  AFFN,          ASDF,            ASDF
##VAR_DIM=   32768,         32768,           32768
##UNITS=     HZ,            ARBITRARY UNITS, ARBITRARY UNITS
##FACTOR=    0.157963299565203, 1,           1
##FIRST=     4132.6476996994, 0,             0
##LAST=      -1043.33573715361, 0,           0
##MIN=       -1043.33573715361, -59641,      0
##MAX=       4132.6476996994, 342437146,     0
$$ Real data points
##PAGE= N=1
##DATA TABLE= (X++(R..R)), XYDATA
$$ [...]
19744B24k2771j403m01N003l697P941J3752j0167j6107l010R778J3120j5463R872
19730a3329J6739K803R808m459j1746K51q542j4492n626q954L313J7212O108J0561
19716c53m013m77R319k35j3944n308k152q162k095k26K819J9237K8474J1764j497
19701C3151j7104j3369P75r324r374N4r998J408O393l644P904q209L966J7551
19687A80J2588l712L01j0610p656L939K622j956k898m737l296N657P614J939P037
19672G012K0499M764p530r429j1738p396O134J2618r282j9306j2090j0707J2327
19659b4124N115L738j507n083L873r585j093N21P823P527M71K952q20j2526k168
19644b4886J4053M009J6832N34j4852n955K697n719k471l252m638R536K2745J4148
$$ y = [224, -22547, -23950, -24351, -19348, -23045, -15104, -1352, -11519, -27626, -30636, -20858, -7738, -23201, -13329, 3410, 6213, 16021, 11562, -184, 67, -8475, -22967, -28593, -37547, -34234, -17022, -10914, -353, -4366, -4843, 4476, 4241, -9703, -15011, -17163, -25325, -27420, -27646, -24827, -5590, 22884, 34648, 33151, 16047, 2678, 3453, -5871, -15245, -15191, -25189, -23781, -17388, -21032, -13128, -21337, -17371, 180, 12768, 9056, 9357, -1253, -8909, -4970, -2348, -4304, -7202, -11939, -15235, -9578, -1964, -25, 7012, 27511, 32275, 24745, 15316, 3578, -3818, 2316, 14934, 5652, -13654, -25744, -36451, -24124, -19009, -15271, -16778, -21861, -17988, -27573, -28666, -28145, -20322, -12795, -12324, -9372, -10192, -22718, -24886, -10833, -6824, 10008, 10542, -4310, -10265, -7568, -13287, -15758, -19010, -23648, -14112, 8633, 22781]
19630B2781j8938n056Q502R28K570j6030O930M715q293J261k025o901l581J1246
19616a891r51q048r207o852J7274J5o537j291M866Q584k040j3833J5329j1583
19602a6165j2248J1811J3204K037M18j4275O60J3882J902j0474p219J9137J3539
19589A6209j392J4202j96j1181q276q586r259P049N190M775m635j08K690J945
19575H427K699O184L707k450r158q230M355p403j2379n100o606o282K001J044
19561b9191O453L674R392J7606P99k669j1093m803l068m256L160R819N943J0547
19547A2313l353N048M027p096J852o488l893J188r784j739J6078R184k761O50
19533A5226N703J299j5663P781J267o064K411o439P816J191k048L012J0276l896
$$ y = [22781, 3843, -1213, 7289, 8217, 10787, -5243, 1687, 6402, -1891, -630, -2655, -9556, -13137, -1891, -2842, -10890, -20097, -26949, -9675, -9660, -16197, -17488, -12622, -4038, -6078, -19911, -4582, -16165, -28413, -16602, -3398, -1361, -943, -15218, -14558, -676, 1226, -9248, -16467, 2670, 16209, 14817, 29019, 28823, 17642, 9366, 780, -8479, -1430, 3760, 8535, 3900, 3792, 6482, 8427, 11126, 17310, 21017, 18567, 9409, 1179, 5534, -1869, -14248, -19348, -25954, -32236, -30235, -29191, -22738, -19064, -9672, 7934, 8733, 6064, -5029, -9832, -12900, -17156, -13996, -4177, 1766, 12313, 8960, 14008, 18035, 10939, 12791, 6303, 2410, 3598, -6186, -7925, 8153, 17337, 14576, 15226, 20929, 22228, 6565, 14346, 15613, 9549, 11960, 5521, 13337, 14528, 12480, 15492, 25768, 21872]
19519B1872n811J866m814j7478p771Q042O594P366p071l481m626j335n504L017
19505i134M607J797r183M557o021O189J6147Q003l189j2910o384p726J2282m211
19491e176r812M878L937P405l460p22K688j7692p760J3414J7141l903j2918l689
19477a5669q18l140m446l466j481M128J121J248j1347p390M265P20K821K1071
19463a2383M877r6J1411Q141J148n669n934r894K569J1148M753l753k465p691
19449c838N76R357j1492j5173K979J0700Q792n816q308P166m879p784P993J2073
19435B346M186p98M391r157j0103r239j68P252n273m767j4006Q750R758J651O999
19420h178j37N71N895L36J4912L157r087k164j9743j502N506M20M21o127O383
$$ y = [21872, 16061, 17927, 13113, -4365, -12136, -4094, 2500, 9866, 2795, -686, -5312, -6647, -12151, -9134, -4527, -2730, -11913, -7356, -13377, -7188, 8959, 16962, 13773, 863, -5521, -13247, -965, -5176, -14988, -10110, -6173, 1232, -2228, -2950, -262, -17954, -25714, -12300, 4841, 938, -11980, -15669, -16487, -19627, -24073, -27539, -29020, -24892, -23771, -22523, -33870, -41260, -36995, -36275, -33454, -12383, -7506, -7602, 3809, 11950, 13098, 7429, 1495, -8399, -5830, 5318, 10071, 6318, 3853, -3838, -3262, 6095, -5397, -20570, -17591, -6891, 1901, -3915, -12223, -5057, -9936, -17720, -9727, 2346, 6532, 5734, 10125, 968, -9135, -18374, -18542, -11290, -16563, -21330, -35336, -26586, -16828, -15177, -8178, -8315, -7744, -1849, -1513, 13399, 16556, 7469, 5305, -14438, -15940, -10434, -10014, -9593, -15720, -9337]
19405i337K487o915J387j368k622j1651O382J5970j188J6522M482M613j0399j2625
19391d262j5358r739J741J6597J4255M85N308J0971j2046k708l55K440o254j8238
19377a7163n116l578K736J2182k635J1020L708q791p830l071K467o881M998M296
19363a3658P252J4199P294j3925n303O349n57r357M239m626q396l629L793L800
19349a2525J0267O764m417P03J201o609R199K159l579k534q240P682J5187l464
19335A1794q242M24n758p247q8J0556m611m564l188M184n587M128M718O675L594
19320F788m835n771q893j0925k556J8963N814l880O175J183m801p179J129r26
19306i714k069j0502O898J6628l686k123N296J9241J0521O72j4595j171m560p903
$$ y = [-9337, -6850, -13765, -12378, -13746, -16368, -28019, -21637, -5667, -6855, 9667, 14149, 18762, 8363, -4262, -19620, -29359, -27618, -11021, 3234, 3719, 9027, 19998, 7952, 5244, 4889, 7329, 1075, -17163, -22279, -25857, -23121, -10939, -13574, -2554, 1154, -7637, -15467, -18538, -16071, -22952, -17954, -13658, -6406, 7793, 15087, 1162, -4141, 2208, 1651, -7706, -3467, -8093, -16489, -20118, -16325, -12525, -2258, 4506, 89, 792, 1993, -4616, 4583, 6742, 3163, 629, -7611, 71, 15258, 11794, 3552, 3976, -1782, -9029, -9117, 1439, -3172, -7736, -10924, -6740, -12327, -8199, -3481, 3194, 6788, 1953, -3818, -12711, -23636, -26192, -7229, -1415, -5295, 880, 2063, -2738, -9917, -8788, -9714, -11783, -22285, -15387, 1241, -2445, -4568, 728, 19969, 30490, 31162, 16567, 15396, 10836, 2933]
19292B933m171j1194j2846L798J5334P407l502j565k770q311J900j636l26J3025
19278a924J1403o606k3098n11J9733m740J5548N063m378m186j3288L654J0165
19265F835K821J0978J85r857j1712Q237K925j2783o183j2618o852P748J6728O797
19251C249L02n817n354N688L476R280J7119o337j5905p163J0905L992K62p487
19237F210p708J9277P50j2892j562Q74L595o458M822J851J014o876j183n237M334
19222H11J293L386N985P869n987j1404j0177j5811J1548J1494L18K399K419n443
19208a300K163P563L15o880q853k3059K496R593K951N973O50J6853J0751o423
19194A2793Q764n653j7293N009P001k997N068k532j6253j6021J3308J8194J795
$$ y = [2933, -1238, -12432, -25278, -21480, -6146, 1261, -2241, -3806, -6576, -14887, -12987, -14623, -14949, -1924, 9479, 2873, -20225, -20736, -1003, -5743, 9805, 14868, 10490, 6304, -6984, -3330, 6835, 9656, 20634, 20819, 10962, -750, 7487, 10412, -2371, -8554, -21172, -28024, -20276, -3548, 3249, 3551, -2266, -7620, -1932, 1544, 10824, 27943, 21606, 5701, -1462, 9443, 13435, 13697, 6210, -1498, 17779, 18529, 5637, 4075, 4949, 8544, 2086, 6908, 8759, 9773, 2897, 1714, -3523, 811, 2104, 5490, 11475, 19344, 13357, 1953, -8224, -24035, -12487, -993, -675, 1724, 4143, -1300, 863, 8426, 8741, 1861, -6992, -30051, -27555, -17962, -15011, -9038, -8388, 8465, 19216, 12793, 21557, 15904, -1389, 3620, 10621, 7624, 12692, 10160, -6093, -22114, -8806, 9388, 11183]
19181A1183j2887P68O629n763j588N207N029M926O875r330n988N98o377N025R566
19166A3873j4318k089J8559J0887m002R346r811k8060l175J4963R945n752l559
19153F807j3703j461J425K575j0017l544K904J2537q845j2388P381J3254J2641
19140I566r809o913L978L331p098K05O666J887n971Q798j1699n132K975J1522
19126B306m21j0971j3911j3020J475l031P840O587J372j556l669mJ3456M86q170
19111b1231J5156Q80n970k210J6290O314L637k434j125j0568j2664q76J3629Q854
19097G682j009Q881J183r057r737j4697P54J3447P827j0738j2294n616J8880Q744
19083D250m039n9j9457j1797J6801N092q04K738m578J822q47o921K289N075m677
$$ y = [11183, -1704, -936, 5693, -70, -1658, 3549, 8578, 13504, 20379, 11049, 5061, 5659, -718, 4307, 13873, -445, -2534, 16025, 26912, 22910, 32256, 22445, -5615, -8790, 6173, 16118, 10366, 6807, -6896, -8357, -6932, -4357, -14374, -17918, -15014, -2477, -11322, -23710, -16329, -3075, 9566, -243, -7156, -3178, 153, -6945, -6740, -74, 1813, -4158, 4640, -7059, -12191, -9216, 2306, 1885, -9086, -22997, -36017, -34542, -37573, -29733, -23146, -21774, -23330, -26999, -27003, -13547, -13061, -21231, -6075, -5195, -11165, -13375, 2915, 9229, 12866, 10432, 9307, -1261, -13925, -14801, -1172, 7682, 6673, 15554, 16737, 7680, -2057, -16754, -16000, -2553, 5274, -5464, -17758, -23374, -4494, 4250, 211, 152, -19305, -31102, -14301, -9209, -10013, -7275, -11853, -10031, -10878, -17799, -15510, -10435, -15112]
19068a5112K123J0824J552K589n92o01J342k297J437P049l822J53R40K599m097
19053D087n084J3475P430j0786K566Q820O064j9669j4123J8095J2680k911n424
19040A5220j4945m911J2634j167j0747n48j658n727n143m172o50k586Q371n779
19026b1808o689J6645N044m311Q65K302J0668j503j0446J2014p40l448r0n524
19012g021n93j959m828J6035J5733m502j0286l013pj625N508N999j2663J5L305
18997I8K816P019o442m414L126q963l903J993L663J742k1463n704O865J1896l710
18982a5381o580Q394J2691M732q136j256o793R236J2225O214O515M260q070l357
18968A4694M721n088R723n035j5412n588P532k551j919n644o436q429O545O732
$$ y = [-15112, -12989, -2165, -613, 1976, 1384, 783, 2125, -172, 1265, 8314, 4492, 4645, 5585, 8184, 4087, -997, 12478, 19908, 9122, 11688, 20508, 26572, 6903, -7220, 10875, 23555, 20644, 15220, 275, -4636, 7998, 6831, -3916, -4464, -6122, -11849, -16992, -21164, -21814, -24400, -16029, -21808, -28497, -11852, -6808, -11119, -10254, -7952, 2716, 1213, -9233, 2781, 2041, -1407, -1497, -7021, -7614, -9573, -14401, 1634, 17367, 12865, 2579, -434, -441, -2066, 3442, 9441, -3222, -3207, 98, 2914, 9933, 3491, -923, 2203, -6760, -10663, -8670, -5007, -3265, -24728, -30432, -23567, -11671, -15381, -21961, -13567, -876, 3856, -4280, -5536, -12329, -3093, 9132, 15346, 21861, 26121, 18051, 14694, 19415, 14327, 24050, 19015, 3603, -1985, 5547, 2996, 1077, -4567, -11003, -19432, -12887, -6155]
18954f155k187L566J8784J7775j3613j0534j1094r076J80O061O002J2852j0655
18941A906j3718k080J0077K5258K72j8673j1803L748j609k427P448l390N334J85
18927E28L652O348R345N201j0214q264k145m637R850J0222O820q4k0926q697O762
18912C761N912j573k24Q54o715r78J504p814JM494m737N624k952R191L996J549
18896A1893K243m611J817q704r198M362N875k91J4170k950K558p987j8232r676
18882a8731J1502J409j826J8089J4334j1758m618J391q037m165m154L254N931
18869B621O698N16L670R986Q226o602j1928j2458N868M635N499J5315O7l936j702
18854B6475j06j1045J321j880l029L143J2202l592j2733k666k060J135p982p889
$$ y = [-6155, -8342, -4776, 14008, 31783, 18170, 7636, -3458, -12534, -12354, -6293, -291, 12561, 1906, -11812, -13892, -3815, 21443, 21715, 3042, -8761, -5013, -6622, -9049, -1601, -4991, 343, 528, 4180, 10528, 19873, 25074, 14860, 6596, 4451, -186, 9664, 19886, 26706, 26622, 5696, -3001, 3761, 9673, 8100, 7876, 8730, 2015, 1037, 2541, -5273, -5272, -778, -5515, 109, -2843, 6348, 10344, 11893, 14136, 9525, 11342, 2638, -6560, -2198, 3677, 3386, 17556, 14606, 17164, 9177, -9055, -18731, -7229, -5820, -7646, 10443, 24777, 13019, 8401, 9792, 1755, -2410, -6564, -3310, 2621, 9319, 9835, 13505, 23491, 31717, 25115, 13187, 729, 6597, 11232, 16731, 32046, 32113, 28177, 26475, 26369, 15324, 16645, 14765, 11736, 14879, 27081, 23489, 10756, 8090, 6030, 7165, -817, -8706]
18840h706R191K0824O535o07j0019m902Q71j4233k239J3850M228J8780J1165n472
18826C9266J392N285k0228q391j0423J1449J820j9533q524J3271J3469Q596j1574
18813A5875m307o272n716m988P634K440o110J7341j5206N728J635n388J8565J4074
18799C5305Q27m112O361j702o949J0738R570L437m172j2474j8057L944Q590o03
18785C0703l12j433j417J256k854J2087n925q138K1865J2107r814N450j3546j2972
18771B7057P388K1179r94j2491o399J9664K9917J8100O345R341q722k0982j5890
18758G3513j6762j4716j248j589O578q537j6176k162M503J2370O565P117n943
18745D3513k703R562J2436K3808j3415l242J4062J9346N037Q660L3368N1192L0394
$$ y = [-8706, 485, 21309, 27844, 27237, 17218, 12316, 13187, -1046, -3285, 10565, 14793, 33573, 44738, 39266, 40658, 45943, 25715, 17324, 6901, 18350, 20170, 637, -7887, 5384, 18853, 27449, 15875, 11568, 5296, -420, -5408, 2226, 4666, -1444, 15897, 691, 6419, 8054, 2666, 21231, 35305, 36132, 32020, 38381, 36679, 29730, 40468, 50038, 53475, 49303, 36829, 18772, 22716, 31306, 30703, 30391, 28958, 27541, 28797, 25943, 38030, 32105, 23967, 45832, 57939, 48125, 53575, 40029, 27057, 34445, 55624, 54630, 42139, 35740, 55404, 85321, 103421, 109766, 119107, 110385, 89403, 73513, 56751, 42035, 40787, 39198, 45776, 37239, 21063, 18901, 23404, 35774, 42339, 49456, 43513, 40810, 50372, 62808, 86616, 73201, 69959, 84021, 103367, 108404, 117064, 150432, 201624, 232018]
18732B32018M1551M7611O8136Q3832P7228M6784J301l2466o3764o1387o6783l6685
18720C37376j7224k3083Q438M1888O5702Q2979O1977K7117k3011m8895p6085q6550
18708C50629o4255m3431k6030k7901j9624n180q884n056j3659j6467J444J9573
18696A41159k321r151k033k280r552P552O101J0974K5581K5678N3896N3804J7018
18683C16426l546j6389k5299l8030j9741K491J0548J0502Q449n186M168J2505
18671B56898p812k1967k9226k2510j5865j1425j0918j5494o295M043o294j1891
18659A01244r369R684J3580p965j2165j37J5272L968j0789n19J555o383j5925
18646H2051o905L268N539L163r849j0639j0128J003J2198J8292l620l618L261
$$ y = [232018, 273569, 321180, 389316, 473148, 550376, 597160, 598461, 565995, 502231, 440844, 374061, 337376, 320152, 297069, 305507, 347395, 413097, 496076, 558053, 585170, 562159, 513264, 437179, 350629, 286374, 242943, 216913, 189012, 169388, 164208, 155324, 150268, 136609, 120142, 121586, 141159, 138838, 129687, 127654, 125374, 115822, 123374, 129475, 140449, 166030, 191708, 245604, 299408, 316426, 312880, 296491, 271192, 233162, 213421, 215912, 226460, 236962, 245411, 240225, 244393, 256898, 249086, 227119, 197893, 175383, 159518, 148093, 137175, 121681, 115386, 119429, 113135, 101244, 91875, 101559, 115139, 107174, 95009, 94872, 110144, 114112, 103323, 102804, 104359, 97976, 82051, 75146, 78414, 83953, 87116, 77267, 66628, 56500, 57503, 69701, 87993, 84373, 80755, 84016]
18633H4016R456k813k6003j4421j6143L88K0684J6451J0445J4117J202Q60k752
18620I5487l680L301j4263Q699K349K723j030j467P426J072q722o086r129o477
18606G0203k204k249J7378L879m950p287J2446J3322r675K981o339n34J6601K3495
18592A27067J8332K8715K657M646J2555L1123L6190K9386L7677K0768K4081K9021
18580D02218M4844L4738K3909L2154K5644J2403J7584K2943M825k2189j9657k3995
18568E55421j3383j0939k6551j6455k2429l7404k4192k0979k4331k3144m0592
18557B95022k6739j4338n340n991k2322j9777Q17K662k4913j3080R475K9661K7182
18544B32319J0275K0567K1189K4493J2837K4789L8609M1978L8938M3118L0814
$$ y = [84016, 93472, 90659, 64656, 50235, 34092, 34480, 55164, 71615, 82060, 96177, 97379, 98239, 95487, 91807, 95108, 80845, 89544, 91893, 94616, 93586, 92119, 99545, 100617, 91895, 85809, 76680, 70203, 67999, 65750, 83128, 87007, 82057, 74770, 87216, 100538, 90863, 93844, 87505, 86971, 103572, 127067, 145399, 174114, 176771, 181417, 193972, 225095, 261285, 290671, 328348, 349116, 373197, 402218, 447062, 481800, 505709, 537863, 563507, 575910, 593494, 616437, 621262, 599073, 579416, 555421, 542038, 531099, 504548, 488093, 465664, 428260, 404068, 383089, 358758, 335614, 295022, 268283, 253945, 248605, 242614, 220292, 200515, 201332, 203994, 179081, 166001, 175476, 205137, 232319, 242594, 263161, 284350, 308843, 321680, 346469, 385078, 427056, 465994, 509112, 539926]
18533E39926J5166M0591M5642L8235L1752K3481J9055j68l4059k1880n383j5874
18521F76484l80p380m6868n5523m5444n5081m1304k1805r485k1157k1024j8161
18509C32872k6856j8671j3186k1901j8394j1075n164j093j407r516j6293p750
18497A81566M270j905k84j1585j7595J2207J2870m338N88j284o325j9530L635
18484A52290J5548j5204j6079M777J3000R119J09J2474J9188J0902J1980K7979
18472B46083J8238O831K82J1945K0838L2837J3285M412k738j3830j440J1158k857
18459C45044p304l755p532k4377j504j1830j0888o353j5315l9493k3481j8768
18447A74444q400o142n469L151R311j3596j0511M846m83Q849J8885K5250J1412
$$ y = [539926, 555092, 595683, 641325, 679560, 711312, 734793, 753848, 753680, 719621, 697741, 692358, 676484, 676104, 668724, 621856, 566333, 520889, 465808, 424504, 402699, 393214, 372057, 351033, 332872, 306016, 287345, 274159, 252258, 233864, 222789, 217625, 216532, 215125, 205609, 189316, 181566, 185836, 183931, 183647, 172062, 154467, 166674, 179544, 175206, 175794, 174510, 168185, 148655, 152290, 167838, 152634, 136555, 141332, 154332, 163451, 163560, 176034, 195222, 206124, 218104, 246083, 264321, 271152, 271434, 283379, 304217, 337054, 350339, 354751, 352013, 338183, 336743, 347901, 345044, 337740, 333985, 326453, 302076, 300572, 288742, 277854, 271501, 256186, 216693, 193212, 174444, 166044, 159902, 154433, 157584, 166895, 153299, 142788, 147634, 147151, 156000, 174885, 200135, 211547]
18434B11547k0207L238K304l643Q330J0772J5336K5590L0177L1312M1749L6748
18422C93253K4890K7481R567Q647K4213L0422L1530L2172J993j0424o625r020
18410E58099p210j1625l6893k8146j9650l0852l9237l3581k3463j5472k1147k9136
18398B61687k0018j5681r633j5203j7378r351O778Q703J1335j5340j3609N647
18386A77937j607o111M340J2187J2252J049J9098j777j699J8128Q245M847K8241
18373B75130J866J8931P501J2850K4221J8644P0j787j141j08q598o130J2450J4745
18359C68644K736l2648k7497k3011j6595k4269k0695k8992q522j0303k5350k274
18347A51224O892O82j9535K816J2842L350J140R91R41P215j6180j2311M630j7594
$$ y = [211547, 191340, 194578, 196882, 193239, 201569, 212341, 227677, 253267, 283444, 314756, 356505, 393253, 418143, 445624, 455191, 463838, 488051, 518473, 550003, 582175, 584168, 573744, 567119, 558099, 550889, 539264, 502371, 474225, 454575, 423723, 384486, 350905, 327442, 311970, 290823, 261687, 241669, 225988, 216355, 201152, 183774, 174423, 181201, 189904, 201239, 185899, 172290, 177937, 176330, 170219, 174559, 186746, 198998, 200047, 219145, 217368, 215669, 233797, 242042, 246889, 275130, 276996, 295927, 303428, 316278, 340499, 359143, 359213, 357426, 356285, 356177, 347579, 341449, 353899, 368644, 371380, 338732, 311235, 288224, 271629, 247360, 226665, 197673, 189151, 178848, 153498, 151224, 158116, 158798, 139263, 142079, 154921, 158271, 159411, 160402, 161343, 168558, 152378, 140067, 144697, 127103]
18333A27103J378K2058J6781n598P519j18N416J2113O949p262j7189j3980N507
18320A60677m678q463j0562J0674J664p184o186j3765n081K2118Q497N462O817
18307A59990J792p033j4591o949J004J0094R686n027o988n285J339J2097J4796
18294A64925K663m106k3757P815K1341J4147n87L531O647M432O946J4293l004
18281B15286j9445J2919J6804j873O502n777j5529j4431J7935J769M6J7309K1715
18268B53230k140M099p0j1305P494M333j542j8884j7345%K7026J5314J0144K694
18254B73048k1897k8665j4388q383j1213M36j15P028m307P844J4852j1057N386
18241B08569K9444R215j707J1944q677O383J6760k180J749J16r648K760N484R620
$$ y = [127103, 128481, 150539, 167320, 161722, 169241, 169123, 174539, 186652, 193601, 186339, 169150, 155170, 160677, 155999, 147536, 136974, 147648, 149312, 142128, 135942, 122177, 117096, 139214, 147711, 153173, 159990, 161782, 154749, 140158, 133209, 134213, 144307, 153993, 148966, 141978, 136693, 138032, 150129, 164925, 167588, 163482, 139725, 147540, 168881, 183028, 182441, 185972, 192619, 197051, 203997, 218290, 215286, 195841, 208760, 225564, 223691, 230193, 224416, 208887, 194456, 212391, 214160, 214206, 231515, 253230, 251090, 255189, 255119, 243814, 251308, 255641, 254099, 235215, 217870, 217870, 244896, 260210, 270354, 273048, 251151, 222486, 208098, 199715, 188502, 188938, 188823, 195851, 191544, 199388, 214240, 203183, 208569, 238013, 247228, 245521, 257465, 248788, 255171, 271931, 269751, 271500, 271616, 261968, 264728, 270212, 279832]
18227B79832J0830L4031J8875K3980L8959K6314l100j3218j6657k6012j2807Q29
18215C61856L238J6806N539J1248J3978k116j1479q790j6387j7407p734M633q468
18202C44917j7122M262K636m23J7036J8441P330J0817K570Q271K6247K5338K4364
18189D74684L283O918J6439L5l136J7722J5269L942L297J4922R749J5197J9008
18176E97329L6450L9686K5778L2511M488J623o040j2174M290L1897L8049M3462
18164H37349J6407k1898k0738m002j2807j7441M616L2296K6937J7108j8017l4205
18152H05605m1606j5039m759j8537L920J6353J2671O901M360J9663K5840J1139
18140H26511j091R354J6513K5133L4385L5847M2422L9172L4440K9783L5104M0458
$$ y = [279832, 290662, 324693, 343568, 367548, 406507, 432821, 429721, 416503, 399846, 373834, 361027, 361856, 365094, 381900, 387439, 398687, 412665, 410549, 399070, 390280, 373893, 356486, 348752, 353385, 344917, 327795, 332057, 334693, 334270, 351306, 369747, 377077, 387894, 390464, 398735, 424982, 450320, 474684, 477967, 484885, 501324, 501359, 498223, 515945, 531214, 535156, 538453, 553375, 563124, 578321, 597329, 633779, 673465, 699243, 731754, 736242, 737865, 731825, 719651, 723941, 755838, 793887, 837349, 853756, 831858, 811120, 807118, 794311, 776870, 781486, 813782, 840719, 857827, 839810, 805605, 763999, 748960, 744201, 725664, 729584, 745937, 758608, 765509, 769869, 789532, 815372, 826511, 825420, 834774, 851287, 876420, 910805, 946652, 989074, 1028246, 1062686, 1092469, 1127573, 1168031]
18128A168031L8164M0657M9700M5794N3687O1884O2053Q1981R5792R7722J12299
18117A907764J15162J12937J40725J83243K40214L08235L99905N72106Q42947
18108D823238J340232K331131L543940L719783K866842P82895k902827m270850
18100A2234384k798969j493639q09286m27654j71808K0903J63924L11005N02600
18091G531460Q08749J265985J953470K797895L414756L572038L324716K750009
18083B7419078K739038L768731M904370N349478N889456O191933M829152L357728
18075F4448964K585341J480053K28587M29655J248425J279444R36132o34023k702592
18066F9299986l681917m384166n689614n613177l974268l172211l179202k946165
$$ y = [1168031, 1206195, 1246852, 1296552, 1342346, 1396033, 1457917, 1519970, 1601951, 1697743, 1795465, 1907764, 2022926, 2135863, 2276588, 2459831, 2700045, 3008280, 3408185, 3980291, 4823238, 6163470, 8494601, 12038541, 15758324, 18625166, 19408061, 16505234, 12234384, 9435415, 7941776, 7132490, 6704836, 6533028, 6553931, 6717855, 7028860, 7531460, 8340209, 9606194, 11559664, 14357559, 17772315, 21344353, 24669069, 27419078, 30158116, 33926847, 38831217, 44180695, 50070151, 56262084, 61091236, 64448964, 67034305, 68514358, 68742945, 69172600, 70421025, 71700469, 72636601, 72002578, 69299986, 65618069, 61233903, 55544289, 49931112, 45956844, 42784633, 39605431, 36659266]
18058C6659266l094715l941110m071944l119455k127956j469244j034233p09194
18050A7091415m62832k32189p6769Q4096L27654P02796J231028J982833K946405
18041B3594437L656888L831641L615287L012501K975626M089349N406179N958712
18033E6140620O491898O957089N583633L930777L091634J776189J13004K54809
18025H4339653J350867J393376J121194l66803k981779m492782n047709o445125
18017F8870892o944722n264936m070683m030655l835463l805789m760668n260889
18009C0897087m328060l071582k193217j631054j262055r87098p90827o42482
18001A5990712n32197m70227m47207m18826m28794m11961l84903l49056k85225
$$ y = [36659266, 33564551, 29623441, 25551497, 22432042, 20304086, 18834842, 17800609, 17091415, 16628583, 16396394, 16319625, 16403721, 16731375, 17434171, 18665199, 20648032, 23594437, 27251325, 31082966, 34698253, 37710754, 40686380, 44775729, 50181908, 56140620, 62632518, 69589607, 75173240, 79104017, 82195651, 83971840, 84084844, 84339653, 85690520, 87083896, 88205090, 87838287, 84856508, 80363726, 75316017, 68870892, 61926170, 56661234, 52590551, 48559896, 44724433, 40918644, 36157976, 30897087, 26569027, 23497445, 21304228, 19673174, 18411119, 17424021, 16633194, 15990712, 15458515, 14988288, 14541081, 14122255, 13693461, 13281500, 12896597, 12547541, 12262316]
17992A2262316k28673k24399k39369k87784l36241l03496k53909k04075j67728
17983A0016642j13089k8130N8768K08852M08531P06793J186158J911606K621765
17974A6977896K823485K594021J925159J712469K825981L694528L351875J668484
17966C7573898l78972l16254Q30265P37055k99062p41641l48977j22804j196661
17957C5736847l307098l550689k130027j317311j597338k625441l013824k324022
17949A5871097j532351j051056p62723n43424l90950l20286k77055j59732k8995
17940A0804525N8941P0433M1415J8907L0641J82542M12821O18900Q21734J065929
17930A4126788J541346K520689L891584N069905N804328O084495N668837O101295
$$ y = [12262316, 12033643, 11809244, 11569875, 11282091, 10945850, 10642354, 10388445, 10184370, 10016642, 9903553, 9875423, 9934191, 10143043, 10551574, 11258367, 12444525, 14356131, 16977896, 19801381, 22395402, 24320561, 26033030, 28859011, 32553539, 35905414, 37573898, 37194926, 36878672, 37708937, 38445992, 38146930, 37405289, 37056312, 36933508, 35736847, 32429749, 28879060, 26749033, 25431722, 23834384, 21208943, 18195119, 15871097, 14338746, 13287690, 12524967, 11981543, 11590593, 11270307, 10993252, 10833520, 10804525, 10863466, 10933899, 10975314, 10994221, 11024862, 11207404, 11620225, 12239125, 13060859, 14126788, 15668134, 18188823, 22080407, 27150312, 32954640, 39039135, 44707972, 50809267]
17922E0809267P046481O729846O327055M749953L205263L063083J511474j55029
17914H3287393l94224j51663m25383j120898k700937m448304m704072n660665
17906F3681247o096404n225464n106073n157359n429090n405013m339881l114092
17898B3807871k289736j755188j391383j109699r05751p61157o41319n30781m00970
17889A4021887l00080k48445j92790j04694p503J29468K74650M92522P67945J246493
17879A6079453K085225L243325M221303M376784L865188K782705K787702M629393
17871D4071078N545154M651026J637389j117303m29473J117264O51359r67226
17863E5159268j443717p39269n08700k426939n299605n113242l049484k138092
$$ y = [50809267, 57855748, 64585594, 70912649, 75662602, 78867865, 81930948, 83442422, 83287393, 82893169, 82741506, 82316123, 81195225, 78494288, 74045984, 69341912, 63681247, 57584843, 52359379, 47253306, 42095947, 36666857, 31261844, 26921963, 23807871, 21518135, 19762947, 18371564, 17261865, 16356114, 15594957, 14953638, 14422857, 14021887, 13721807, 13473362, 13280572, 13175878, 13168375, 13297843, 13572493, 14065015, 14832960, 16079453, 18164678, 21408003, 25629306, 30006090, 33871278, 36653983, 39441685, 44071078, 49616232, 54267258, 55904647, 54787344, 54357871, 55475135, 56126494, 55159268, 53715551, 52976282, 52467582, 50040643, 44741038, 39627796, 36578312, 34440220]
17855C4440220k785953m255826m529050l465022k411681j740546j352025j079390
17847A2820727q54960p10710n94559n29649m66651m06103l57402l10845k55975
17838H333873k30221k39350k32816k03746j68149j80580j90380j95376j92573
17829F500682j93056j95179k03404k04522k02201j97785j99497j81235j75192
17820D748611j73940j61280j42002j34776j38014j30343j17304j09400j01836
17811C539716r8513j00351q7210q9778r6758r6045q3396q0831q0028o8814o8897
17800B589095p2979o0063n1265n1169p0580o1165n0613o0704l5361m5416n3911
17789A975869o0074l7910m6293m3621n3325m4746l7961m3595m2163n8058o2571
$$ y = [34440220, 31654267, 27398441, 22869391, 19404369, 16992688, 15252142, 13900117, 12820727, 11965767, 11255057, 10660498, 10130849, 9664198, 9258095, 8900693, 8589848, 8333873, 8103652, 7864302, 7631486, 7427740, 7259591, 7079011, 6888631, 6693255, 6500682, 6307626, 6112447, 5909043, 5704521, 5502320, 5304535, 5105038, 4923803, 4748611, 4574671, 4413391, 4271389, 4136613, 3998599, 3868256, 3750952, 3641552, 3539716, 3441203, 3340852, 3253642, 3163864, 3067106, 2971061, 2887665, 2806834, 2726806, 2657992, 2589095, 2516116, 2456053, 2404788, 2353619, 2283039, 2221874, 2171261, 2110557, 2075196, 2029780, 1975869, 1915795, 1877885, 1831592, 1787971, 1734646, 1689900, 1651939, 1608344, 1566181, 1508123, 1445552]
17778A445552m8667l5544l0553l9964m1016l0753m3674l4513k9553k3131k5915
17767A062269p903k2428k7021n762j3804l1538l1968j5884j3694j1613j5938k3807
17755H40909p091k8799l5875k3979J352k237j0988o318Q909j6431k4463j3858
17743F81131q558n523L047K104N134j4495k1694j2402j0226k5065k4006j9782
17731E49665j7466o040l480j63j1600j4182j6888o974o621L805J7069q683n018
17718D73424J73R546q240N558K515q750O938k895j6900j5999n831J718M011J0790
17704D56058J4018j929J2632J0474L133J3186j675o742J1216k986Q349O779r121
17691E13392j4118j4269k993m57k165N198k1124k2392j2282m740O657p246j3001
$$ y = [1445552, 1396885, 1361341, 1330788, 1290824, 1249808, 1219055, 1175381, 1140868, 1111315, 1088184, 1062269, 1054366, 1031938, 1004917, 999155, 985351, 953813, 921845, 905961, 892267, 880654, 864716, 840909, 833818, 805019, 769144, 745165, 746517, 744280, 733292, 726974, 735883, 719452, 694989, 681131, 672573, 667050, 670097, 672201, 677335, 662840, 641146, 628744, 618518, 593453, 569447, 549665, 532199, 526159, 522679, 522516, 510916, 496734, 479846, 472872, 466251, 470056, 487125, 478442, 473424, 473597, 483143, 474903, 480461, 482976, 474226, 481164, 478269, 461369, 445370, 439539, 441257, 445268, 456058, 470076, 468147, 480779, 491253, 494386, 507572, 505897, 499155, 510371, 507385, 515734, 522513, 513392, 499274, 485005, 482012, 481555, 479390, 484588, 463464, 441072, 428790, 424050, 430707, 423461, 410460]
17678D10460p911p387M714J2029N243j9356j0422j3179m323L769J550R464P033
17665C91684N126Q358J2346J3568K6874J8072J3769J6947J8488K58j25K6345L3663
17652E85373r345k5233j9418q660K164K2178K4141J0541r441k9519k0748j4079
17640E07954k1140k111n10l511k0531k3962m516P767J8456J6316n214k330J5874
17627D82542J3465J8095J3810j0401j6226r893J2864Q597J0779K3093K5005J1886
17615E83616K6887K6990K2768J2106K9782L6655L4111K6599J6935K901P64m775
17603H15339j2972k0181P336J3764Q769j972P229J8607J3201J709N638J2244K6114
17590H94825M147k207l81J9020K8232K2458K9836K6446J9504K1289K3320K5587
$$ y = [410460, 402549, 395162, 399876, 411905, 417148, 397792, 387370, 374191, 369868, 373637, 375187, 384651, 391684, 396810, 405168, 417514, 431082, 457956, 476028, 489797, 506744, 525232, 525490, 525365, 551710, 585373, 576028, 550795, 531377, 522717, 524881, 547059, 571200, 581741, 572300, 542781, 522033, 507954, 486814, 484703, 484193, 480682, 460151, 436189, 431673, 439440, 457896, 474212, 468998, 466668, 482542, 496007, 514102, 527912, 517511, 501285, 491392, 504256, 512853, 523632, 546725, 571730, 583616, 610503, 637493, 660261, 672367, 702149, 738804, 772915, 799514, 816449, 819350, 820114, 815339, 802367, 782186, 789522, 803286, 812055, 810083, 817312, 835919, 849120, 850829, 856467, 868711, 894825, 898972, 896765, 896384, 915404, 943636, 966094, 995930, 1022376, 1041880, 1063169, 1086489, 1112076]
17578A112076J1339J4802L1829M0104O0798R1969J41613J71425J79742J94835
17568B050532J83222J63898R7973O2128P2241Q1331R3157J08505Q2740M4479K1320
17557C061526O4759J48305K22706K85238L73312M66905O07825P84522J051605
17548G066703J467941K028475K941187M448805O671316R106748J0778248J0006397
17540E4515820O541300J712456j481359o02903K882243N703135M411343p23632
17532G2958403p443816j1762977j1867116r309463o282345m140315k790772j897418
17524A7464181j333153r87645p91600o79435n36137l98711k84924k26420k04029
17515A2022127j98346j88802j76555j87711j74322q4119P6668K23281L52744M73271
$$ y = [1112076, 1123415, 1138217, 1170046, 1210150, 1270948, 1362917, 1504530, 1675955, 1855697, 2050532, 2233754, 2397652, 2495625, 2557753, 2629994, 2711325, 2804482, 2912987, 2995727, 3040206, 3061526, 3126285, 3274590, 3497296, 3782534, 4155846, 4622751, 5230576, 6015098, 7066703, 8534644, 10563119, 13504306, 17953111, 24624427, 33731175, 44509423, 54515820, 61057120, 62769576, 61288217, 60685314, 63567557, 69270692, 73682035, 72958403, 65514587, 53751610, 41884494, 32575031, 26292686, 22152371, 19361599, 17464181, 16131028, 15143383, 14351783, 13672348, 13136211, 12737500, 12452576, 12226156, 12022127, 11823781, 11634979, 11458424, 11270713, 11096391, 11012272, 11088940, 11312221, 11664965, 12138236]
17505A2138236N97926P86075J120591J615794K351395L467494N165786P768033
17497C5011330J1195813J4614191J6147649J4353939Q990495K862420l70178J131235
17489A03936894N354765P194121L691188m750502j3503752j8266561j7748474
17482F5907679j3929870r708162o582130m591990l292328k399704j820170j444943
17474B2138382j166990r41764p74332n92990m31626k77761j53176r1952p3382
17465A7634409o6790J5455J60722L74535O18996Q27782J049228J325095J832458
17456B3771890K720754M117412O213914Q734121J1455490J4761229J7504702J9062326
17448A08341838J9925619J6802298J0216758N129244J862582j588330j549113
$$ y = [12138236, 12736162, 13522237, 14642828, 16258622, 18610017, 22077511, 27243297, 35011330, 46207143, 60821334, 76968983, 91322922, 100313417, 103175837, 102805659, 103936894, 109291659, 116485780, 120176968, 115426466, 101922714, 83656153, 65907679, 51977809, 42269647, 35687517, 31095527, 27803199, 25403495, 23583325, 22138382, 20971392, 20029628, 19255296, 18662306, 18230680, 17952919, 17799743, 17707791, 17634409, 17567619, 17583074, 17743796, 18118331, 18737327, 19565109, 20614337, 21939432, 23771890, 26492644, 30610056, 36823970, 45558091, 57013581, 71774810, 89279512, 108341838, 128267457, 145069755, 155286513, 160415757, 162278339, 160690009, 159140896]
17441A59140896k34830m695689j0942617j4760966j7497044j8452766j5618161
17434G6938823j2119171j0074595p928784n678269m024929k961281k263219j800802
17426C0087773j512063j366550j275101j151280r74672p52750n95553n05513n21119
17417B1433172n80040n41764m59897l42513k39720j52474n8510O0897K55951N09434
17407A9884536Q55312J380924K172605L401642M991665O557223Q284184R611810
17399E7139901R732728R912536R149756O261825M523178M020257Q19028j972025
17391I9587184j849888l849995o888073p190337p704711r543379r258340p681020
17383D5621441o869384n830934m290592l063653k283658j773688j440179j225908
$$ y = [159140896, 158906066, 154210377, 143267760, 128506794, 111009750, 92556984, 76938823, 64819652, 54745057, 46816273, 41138004, 37113075, 34151794, 31888575, 30087773, 28575710, 27209160, 25934059, 24782779, 23808107, 23055357, 22459804, 21954291, 21433172, 20853132, 20311368, 19851471, 19508958, 19269238, 19116764, 19058254, 19119151, 19375102, 19884536, 20739848, 22120772, 24293377, 27695019, 32686684, 39243907, 47528091, 57139901, 66872629, 76785165, 85934921, 92196746, 96719924, 100740181, 101559209, 99587184, 97737296, 93887301, 86999228, 79808891, 72104180, 62560801, 53302461, 45621441, 38752057, 32921123, 28630531, 25566878, 23283220, 21509532, 20069353, 18843445]
17375A8843445j075821r69814q96727p99357o85150o11859n68610n45946n11604
17366A2178557m73478m27313l84433l59459l16016k89915k92572k85929k76698
17357I072744k79727k75893k97357l12327k86775k58442k49693k41123k34276
17348F637131k26361j98646j83457j70608j68092j62688j64189j50540j43863
17339E068687j36721j12217j09315j30056j36566j47677j31860j24760j24385
17330C915130j12712j06084j02189j08602j13479j18399j18097q8141p9716o8705
17320B899006p1022q2916p1481n3744o5675o5427n9686n6142o9766o3011o3300
17309B176836p0841o8692m4020n8442n9979o6725o0771m0821m3275m3310m3995
$$ y = [18843445, 17767624, 16797810, 15901083, 15101726, 14416576, 13804717, 13236107, 12690161, 12178557, 11705079, 11277766, 10893333, 10533874, 10217858, 9927943, 9635371, 9349442, 9072744, 8793017, 8517124, 8219767, 7907440, 7620665, 7362223, 7112530, 6871407, 6637131, 6410770, 6212124, 6028667, 5858059, 5689967, 5527279, 5363090, 5212550, 5068687, 4931966, 4819749, 4710434, 4580378, 4443812, 4296135, 4164275, 4039515, 3915130, 3802418, 3696334, 3594145, 3485543, 3372064, 3253665, 3135568, 3047427, 2967711, 2899006, 2827984, 2745068, 2673587, 2619843, 2554168, 2488741, 2429055, 2372913, 2303147, 2240136, 2176836, 2105995, 2037303, 1993283, 1934841, 1874862, 1808137, 1747366, 1706545, 1663270, 1619960, 1575965]
17298A575965m9753m2701m1880m4479m6337k6670p774q091k1752k4288l2154l0052
17286A200034j0463j3160j9067k4278k6383j8076l0275k9019k6038l6743n1527
17275I15005k5981k4255k3817j7021j4981j0151k391l950q798k7862j9156k0835
17263G15807r966L48j0984j7160j0163j216l178r55j2535l5799q255Q73j0064
17250E96753j9800j0232j0720j7800j6358n525l634O785j2931k1248r543r501
17238D66246j3390k929J3578J670j3663j5389j1753J142N45k021j0n529o206L41
17224D12632m399n870N534p227k1593j5731p78j1289o131Q613J5094K395L743
17211C74993q806r168p618r82j764J615l144k367j0799M34Q305n111j0691K720
$$ y = [1575965, 1526212, 1483511, 1441631, 1397152, 1350815, 1324145, 1316371, 1308280, 1286528, 1262240, 1230086, 1200034, 1189571, 1176411, 1157344, 1133066, 1106683, 1088607, 1058332, 1029313, 1003275, 966532, 915005, 889024, 864769, 840952, 823931, 808950, 798799, 796408, 792458, 783660, 755798, 736642, 715807, 705841, 706189, 695205, 678045, 667882, 666666, 663488, 662533, 649998, 614199, 605944, 606817, 596753, 576953, 566721, 556001, 538201, 521843, 516318, 512684, 519469, 506538, 485290, 475747, 466246, 452856, 449927, 463505, 465175, 451512, 436123, 424370, 425512, 426057, 424036, 424026, 418497, 412291, 412632, 408233, 402363, 407897, 400670, 379077, 363346, 362568, 351279, 345148, 353761, 368855, 371250, 374993, 366187, 357019, 349401, 348419, 346655, 348270, 345126, 342759, 331960, 332394, 340699, 335588, 324897, 327617]
17197C27617j0434n960N72J921K963j5590j6892O613O234j8875k1438j5862n492
17184B35377q738K741M916l549N014p549j6261o715K0266J9692M659r17o66j5985
17170B32285j9790j1642j634o709j401q133j6829J1738O663r92J450n062M437
17157A84381o551L814l120O727k278J671M740k565n175l269j660L258L34m233
17143A76074m51o242r758N867Q036n491j6744j800R842j0705j1477k765j0722
17130A23664k0669O497R397l422o038j4820L997k039r438O746L973j5679r651
17117G2518r9L971j67R399L258J8482J3323m769k0639n611O426j5687j1585N889
17103G4709N634K27P127j480p441p257K339p287p191j0513J5593J7622J3402j3822
$$ y = [327617, 317183, 311223, 311795, 313716, 316679, 301089, 284197, 290810, 297044, 278169, 256731, 240869, 235377, 226639, 229380, 234296, 230747, 235761, 228212, 211951, 205236, 225502, 245194, 249853, 248936, 248270, 232285, 212495, 200853, 199219, 192510, 191109, 182976, 166147, 177885, 184548, 183556, 185006, 179944, 184381, 177830, 181644, 178524, 185251, 182973, 184644, 189384, 186819, 181644, 178375, 176715, 179973, 180307, 176074, 175623, 169381, 159623, 165490, 173526, 168035, 151291, 149491, 159333, 148628, 137151, 134386, 123664, 102995, 109492, 118889, 115467, 109429, 94609, 98606, 96567, 87129, 93875, 97848, 82169, 72518, 72419, 76390, 76223, 85622, 88880, 107362, 120685, 115916, 95277, 89666, 96092, 80405, 68820, 74709, 80343, 80570, 87697, 86217, 78776, 71519, 73858, 66571, 59380, 48867, 64460, 82082, 95484, 81662]
17089H1662k5412j855J58J362j122J1279m684j630m478k0920J437M818l639J612
17075C8588O290K364l372L726j2974Q178j202n253L189j133J2310J7517K060r55
17061F9333q87L283j048N622O115k323j0847p944P123m726j1833l640K607J3054
17047F3889J1078N936N745r094K767J0406O708J862O37l087J0075K8273L3698
17034A68893L2623N0874M1424M8620K0652p854m902N202J7702J5350n883m1149
17022C41552m6948m4895l6278l8484j9302M49k1593j6985j4064o637q563R023
17010I7275N277q7j0715P259J0562k030j0204l656J353N162J1986k209M989J476
16996A16438k431P45m107N809J7806J7372k481L3545O5064Q5125Q8293Q7870P4773
$$ y = [81662, 56250, 54395, 54553, 55915, 54793, 66072, 61388, 59758, 55280, 34360, 35797, 40615, 36976, 38588, 44878, 47242, 43870, 47596, 34622, 42800, 41598, 36345, 39534, 38401, 50711, 68228, 70288, 69333, 68446, 71729, 70681, 76303, 82418, 80095, 69248, 61304, 68427, 63701, 51868, 48228, 50835, 63889, 74967, 80903, 86648, 77554, 80321, 90727, 97435, 99297, 99934, 96847, 106922, 135195, 168893, 201516, 252390, 293814, 342434, 363086, 355232, 350330, 355532, 373234, 388584, 382701, 341552, 294604, 249709, 213431, 174947, 155645, 156094, 134501, 117516, 103452, 96815, 88252, 97275, 102552, 102465, 91750, 99009, 109571, 107541, 97337, 93681, 95034, 100196, 112182, 109973, 114962, 116438, 114007, 114752, 110645, 116454, 134260, 151632, 149151, 182696, 247760, 332885, 421178, 509048, 583821]
16983E83821L5030k1252j6342Q445J6665J9206j2999m8443r4846j02469p5361
16972B91455o0574l8605k1074j4072j3947j866L382k061j9115j3598J958j1699
16960A00184r667m313J3118q31j7876j7843O137K2573l594L475M586P525R172
16947A12646J8671J6903P617J4483P492K5723N4866P0993R5418J11632J06649
16936F43093O5073N8628M0393L3216K6744K0277o564m0855m4061o6081q1511p1461
16924E76891o3466o5016p4722o0385m3345l3435j8007j9386j3761n474J375j2669
16912A68600j8807R106k678j1828n819j0280K131O01J1829j273j6791j185j9094
16899A04512p993R879j242N145J5840R453R97K2483Q232K8061N4312L9672L4941
$$ y = [583821, 618851, 597599, 581257, 589702, 606367, 625573, 612574, 564131, 469285, 366816, 291455, 230881, 192276, 171202, 157130, 143183, 141317, 144699, 142638, 123523, 109925, 111883, 100184, 90517, 86204, 99322, 98491, 80615, 62772, 68909, 91482, 87888, 91363, 95949, 103474, 112646, 131317, 148220, 155837, 170320, 177812, 203535, 258401, 329394, 424812, 536444, 643093, 708166, 766794, 807187, 840403, 867147, 887424, 880860, 840005, 795944, 729863, 648352, 576891, 513425, 448409, 373687, 313302, 269957, 236522, 218515, 199129, 185368, 179894, 181269, 168600, 149793, 158899, 156221, 144393, 138574, 128294, 130425, 131026, 142855, 141582, 124791, 123606, 104512, 96519, 106398, 105156, 110301, 126141, 135594, 136591, 159074, 167306, 195367, 249679, 289351, 324292]
16886C24292N3207N7396M9629N7497L8044K1614J7852j0200k1043k6499m0152
16875E21637l5884m3444p2330n1549m1520m0974l2107j9962l3787j8079j3387
16864A18614j279Q416m319j5781j1322k433K375k234n400j2480o450J0967q899
16851F9775j830p798k7276l870J6827J6996J1028k947j1987n440M165j2952l392
16838D1299Q771o962j3915L72N538o014r735R313R665m08om209L49j162j2371
16823B0525k998J1304L910N822j658l524P43j2845n464n916J2321K2602J4602
16810E9424j0717k3219q488J7687J9891q237j7311q899p417j947k2651p773L413
16797a6244J6749J7054k359r310J0763J0398J33r327K548p131K238J3210q024
$$ y = [324292, 377499, 434895, 484524, 542021, 580065, 601679, 619531, 609331, 588288, 561789, 521637, 485753, 442309, 369979, 318430, 276910, 235936, 203829, 183867, 150080, 132001, 118614, 117335, 125751, 121432, 105651, 94329, 91896, 94271, 92037, 86637, 74157, 67707, 78674, 69775, 67945, 60147, 32871, 29001, 45828, 62824, 73852, 70905, 58918, 53478, 57643, 44691, 41299, 50070, 43108, 29193, 29565, 35103, 29089, 19354, 28667, 38332, 37924, 37918, 33709, 34058, 32896, 20525, 17527, 28831, 32741, 38563, 36905, 33381, 34124, 21279, 15815, 9899, 22220, 44822, 59424, 48707, 25488, 17000, 34687, 54578, 46341, 29030, 20131, 12714, 10767, -11884, -19657, -16244, 505, 17559, 15200, 5890, 16653, 27051, 27184, 17857, 20405, 13274, 15512, 28722, 20698]
16784B0698j6655o302J318j0301j1157N395M567J8457J9946p517j3509r527j422
16771f009J1528Q214j298O00L756r071M149j3319q156J6048J1323K279k82L776
16757B3538O317q371r469J081N37L749P692k804n974l833k340j0002P960M886
16743A2967k836K0k517M71n479q944N252J1563J1176l102m956r443P28m356M249
16728D793M938l684J0137O690j5546q845n742j7523o745Q715K5160Q287j0254
16715C81j3953K211J159O636p325j320r041J661J3573P875J820j0116J4097R515
16701A7173p365N311N29n713n454j4188J0207N504q044J3935m282j9645o790L781
16687a5041K034r307p303J1397N627J0480p096j472m143j6418j959Q213Q001R161
$$ y = [20698, 4043, -2259, -941, -11242, -22399, -17004, -12437, 6020, 25966, 18449, 4940, -4587, -6009, 5519, 13733, 12435, 13035, 16791, 7720, 11869, -1450, -9606, 6442, 17765, 20044, 19762, 23538, 29855, 21484, 12015, 13096, 13633, 17382, 25074, 22270, 16296, 12463, 10123, 121, 8081, 12967, 10131, 10151, 7634, 8105, 2626, -6318, -1066, 10497, 21673, 18571, 13615, 4172, 4900, 544, 4793, 9731, 6047, 16184, 22874, 7328, -1517, -7259, -24782, -31527, -22812, 2348, 10635, 381, -13572, -11361, -10202, -3566, -10891, -12211, -21252, -19591, -6018, 1857, 3677, -6439, 7658, 17173, 9808, 15119, 15648, 9935, 4481, -9707, 500, 6004, -2040, 11895, 7613, -12032, -18822, -15041, -13007, -22314, -29617, -18220, -12593, -2113, -9209, -10681, -14824, -31242, -33201, -24988, -16987, -7826]
16673g826o44J1496p381j308M536J3047j09M80o100Q795p87L753J983l504l142
16658A3289K979k074L217m047j184J832P604R97j7226j4325Q58K3595p397j4804
16644f686n818l038J842K834o28j3643k3202Q34J3279N764J0270J1014p457O5
16630a4570L570j0684K390l704O878J7748N870j795o162m94J6582Q352j2983k17
16616A0781q844o237j263J2350L410j1325m346o323j198P039j0169J621O30o646
16602b0520n795J3125j960R831J1926M854k11r721J74j381M027J766j1102J370
16588c617p529n367J4306J0585n286p293K595L656J3347j1476j8722P858P431
16575D88K790J915K271J96m264j712n91j990m054k315j6980K083K0692P523k0351
$$ y = [-7826, -8470, 3026, -4355, -5663, -1127, 11920, 11811, 12291, 6191, 14986, 14199, 17952, 19935, 16431, 13289, 16268, 14194, 17411, 13364, 12180, 14012, 21616, 22613, 5387, -8938, -8080, 15515, 8118, -6686, -12504, -15542, -13700, -10866, -11494, -25137, -48339, -47505, -34226, -28462, -18192, -7178, -14635, -14570, -11000, -21684, -19294, -22998, -16120, 1628, 7498, 5703, -459, -953, 15629, 23981, 10998, 10781, 1937, -4300, -5563, 6787, 10197, -1128, -5474, -11797, -12995, -5956, -16125, -14504, -13874, -20520, -26315, -13190, -15150, -5319, 6607, 11461, 11250, 1529, 1703, 322, 4349, 6115, -4987, -3617, -11146, -16513, -2207, 8378, 3092, -4201, -1606, 2050, 15397, 3921, -14801, -6943, 488, 3278, 5193, 7464, 7660, 3396, 1684, 1093, -897, -4951, -7266, -24246, -22163, -1471, 6052, -14299]
16560a4299m135J4458m526m122N119N098k012j916L52r349J264J0960J4564J6110
16546B7566N884m790j0619M86J709j4002k799O285K795j7459n915J0265R12m882
16532d564l785M650j622j3391o065K236k732L194r611j6701P870J9467N040L958
16518a2056K829J718O352p368k963N192K620N050N640M031m476p301M671P548
16504A1487j4028q562l94N40P841J5372K907k128j1256n746P972J264N158m729
16490E698M63R943q430l950N403l72k404R945q204q593K266m719O259J4056p911
16475I450j2029j1710l126N676P636M458R016n19L245J795p384p591q018O424
16461b677J2340J0143j3767j2586j160m738k808O017L51K129k117o540J3448O825
$$ y = [-14299, -18434, -3976, -8502, -12624, -7505, -2407, -4419, -6335, -5983, -15332, -14068, -3108, 11456, 27566, 33450, 28660, 18041, 18527, 20236, 6234, 3435, 9720, 12515, -4944, -10859, -594, 318, -4564, -8349, -3699, -5321, -18712, -24777, -22541, -25273, -22079, -31690, -48391, -40521, -21054, -16014, -12056, -9227, -7509, -1157, -8525, -11488, -6296, -3676, 1374, 7014, 11045, 6569, -732, 3939, 11487, -2541, -11103, -11497, -10957, -3116, 12256, 15163, 13035, 1779, -3967, 4005, 5269, 10427, 5698, 6161, 16104, 7674, 3724, 9127, 8755, 6351, 16296, 8092, -501, 1765, -2954, 3305, 17361, 9450, -2579, -14289, -17415, -11739, -4103, 355, 9371, 8852, 12097, 13892, 6508, -1083, -9101, -2677, 9663, 19806, 6039, -6547, -7707, -12445, -15253, -9236, -8885, -6756, -8873, -15413, -1965, 4860]
16447D860j4105k162K872k325O844M100R906n996j7379L511K384K995J703J492
16433a300M2j0938m82J4238M172J928k795j3913j3423m622m460O337J7619j23
16419g720j8767P205k925o065n636N724K1539J862M541J0101j497p284J017R92
16405C087j1062j5065Q153m201J625J569J651K029k16m86K719r242p011N958J1510
16390h982J0142L410l726j6107L659N016q46j425J4074M692J839j1124j7935j3112
16376c0425N485K770m665K233K229L950K986J4611J5873r867r969m865j5433j250
16362b6337J0148p71K097j0668L998N849n100p725l433J1614L55J1908Q734Q901
16348I570L394j9331p001M79r768Q229J038m606M734j331K504J633m22J0883j1899
$$ y = [4860, -9245, -11407, -8535, -10860, -4016, 84, 9990, 3994, -13385, -9874, -7490, -4495, -2792, -1300, -1258, -12196, -12678, 1560, 5732, 7660, 4865, -9048, -22471, -27093, -31553, -25216, -7597, -7720, -26487, -19282, -22207, -28272, -33908, -28184, -6645, -4783, -242, 9859, 8362, 1078, 2095, 3087, -7975, -23040, -14887, -19088, -17463, -15894, -14243, -12214, -12430, -12916, -10197, -19439, -26450, -20492, -8982, 1160, 4570, 844, -15263, -11604, -6588, -7434, -8859, 5215, 9907, 11746, 622, -17313, -30425, -24940, -22170, -26835, -24602, -22373, -18423, -15437, -826, 15047, 5180, -4789, -9654, -25087, -26337, -16189, -16960, -14863, -25531, -21533, -15684, -20784, -28509, -31942, -20328, -19973, -8065, 669, 9570, 12964, -6367, -13368, -12889, -22657, -14428, -13390, -17996, -13262, -14593, -12089, -10456, -10878, 5, -11894]
16333a1894J1077J4455K057r719m533j989l83l616n338L739Q26j1031j1818Q846
16319a9321l263q939N975R638q74m550J052m299l031M438n784R000N090K691j200
16304a3377k03P208N530N781n312J741P330j5768L791O234Q196j4180j3551q142
16290b4722M967P965j1911J571r326k877k915M360N193R036N757r037p598J4884
16276a4653J5236n206n512L40Q929m442j4022N093j390o452O084m212j437L709
16262a7935O617Q470M877o219q168J802p819J1258N715M56k240p120n522j447
16248a7275O9j4406J958L110M448J0957R473M374J7841m94j0401j8875J1108Q289
16234A0176j1911K388J3213m57P87q463j1833J8530J5952j3206j1048m961m63
$$ y = [-11894, -817, 13638, 15695, 5976, 1443, -546, -929, -4545, -9883, -6144, -5318, -16349, -28167, -19321, -22584, -31523, -25548, -15910, -16784, -21334, -20282, -24581, -27612, -23174, -28958, -19958, -14868, -12177, -13377, -13580, -6372, -842, 4939, -373, 1368, 8698, -7070, -3279, 2955, 11151, -3029, -16580, -24722, -19755, -11790, -23701, -22130, -31456, -34333, -37248, -32888, -27695, -18659, -12902, -21939, -29537, -14653, 583, -4623, -10135, -9795, -866, -5308, -19330, -14237, -15627, -22079, -15995, -20207, -21644, -17935, -11318, -2848, 2029, -4190, -12358, -10556, -18375, -7117, -1402, -946, -3186, -10306, -15828, -17275, -17206, -31612, -29654, -26544, -22096, -11139, -1666, 2708, 20549, 20055, 9654, -9221, 1887, 10176, -1735, 653, 13866, 13409, 14196, 5733, -6100, 12430, 28382, 15176, 4128, -833, -1296]
16221a296n44r176r272L186M266j663K947m75j468j4310p436J2136J1198K761
16207i146j0230r872n86O596J4322l547L448Q020J8339j4385j3826M778j256O849
16193d96P853r904q807K928Q159k09o492r860n0N415M690J470M163P486j4806
16178h460p024J442j816M108r164J1744J5702K21p539j0043j2508j0809O349R941
16164a7856p656m778O38K0106J0017K952k460R100q488k1894n862R323K8p158
16150b3988N897O593m786Q880m054p373R867N603J927Q098p552m895J1436k526
16136C127j1412N375k415j2215J3357N56l037K278J030j2767r336R93m1L158R456
16121a1893M344r354P887J4145n128j0462L983j121J4918j69k5465j055J7586
$$ y = [-1296, -1840, -11016, -20288, -17102, -12836, -14499, -11552, -12027, -13495, -27805, -35241, -23105, -11907, -9146, -19376, -29248, -29834, -23238, -8916, -12463, -9015, -995, 17344, 2959, -10867, -6089, -7345, -496, 7357, -2547, -11354, -8426, -267, -476, -6968, -16828, -16878, -11463, -6773, -5303, -1140, 6346, -8460, -15484, -14042, -15858, -11750, -20914, -9170, 6532, 6753, -786, -10829, -23337, -34146, -27797, -17856, -25512, -30290, -29652, -9546, 471, 3423, 963, 10063, 1575, -20319, -26181, -16858, -16830, -23988, -18091, -11498, -16284, -7404, -11458, -18831, -8964, -3361, -1434, 6664, -888, -5783, 5653, 3127, -8285, -2910, -5325, -17540, -4183, -3627, -6664, -4386, -3356, -16123, -25459, -24466, -24507, -21349, -11893, -7549, -16903, -9016, 5129, 1, -10461, -6478, -7599, 7319, 7150, -18315, -19370, -1784]
16108a784k28Q27q857l799j5689l190K1575J394j703N42M15J0788O225r026q377
16093a0887k407q84k889P818R347k489j45O41l792q681M676J4697O078P914K71
16078A9268n009J132k0337j5282o428J157J2767O927l805j0311K274k835N725
16065a4757N436j5885j1067J6041N746K8J9663J4884j0513L51n065k538K53n575
16051b998K878N302J170j4372q424j3724J310M641J482m326l174L336Q853j747
16037a9793P234O412J865Q095J1148J64j5703q719N108j882m714j6188q888J0073
16023b5788L751M128K085k863J3258J4096K54p915o018k111J339M61k566N955
16009a934P02o458M697Q671J0123P851n318R041J1486P486o292l831j283j8891
$$ y = [-1784, -2012, -1185, -10042, -13841, -29530, -32720, -11145, -9751, -11454, -10912, -10497, 291, 6516, -2510, -10887, -13294, -14178, -17067, -9249, 98, -2391, -2536, -1895, -5687, -14368, -9692, 5005, 11083, 18997, 19268, 14259, 15391, -4946, -20228, -26656, -25499, -12732, -5805, -9610, -19921, -17647, -20482, -14757, -9321, -25206, -36273, -20232, -14486, -14458, 5205, 20089, 9576, 9927, 4862, 2324, 2577, -2998, -120, 5182, 6352, -8020, -16444, -30168, -28858, -24217, -22735, -27061, -30235, -26899, -18046, -19793, -12559, -6147, -4282, 3813, 14961, 15125, -578, -9297, -4189, -6071, -10785, -26973, -35861, -25788, -22037, -17909, -15824, -18687, -5429, 8667, 8921, 1006, -5012, -7123, -5784, -5323, -7889, -1934, -1232, -7690, -2993, 5678, 15801, 23652, 18334, 27375, 38861, 46347, 40055, 36224, 34941, 16050]
15995A6050j6136O2o407n569J142P694o729j3168j9739l825j3016L935P405J6201
15981c2100R125o792N056K024j0096P825j938J2036J3223N105J017j1434j3528
15968b0477O755L961O96o500M60J0457M811n272j0072O76n585k0914K076O805
15954c2123J1680k638l745O39m140J1247J4091J3301N061o776Q834n650n497M511
15940H795o918j7170k039N42O163J0130J555Q922K906P95p033j1589k592j0606
15926a8139n609N590o522j349k857r365k050K1354N85j1161N870r398J27J9436
15912a3488M951j686j2502j9545l969J9277K3105J4111p638j8070l585J907j0917
15899b8049L492J9028J0591j856j562J317J05m496k82l653M474n350j6669Q957
$$ y = [16050, -86, -24, -6431, -12000, -10858, -3164, -9893, -23061, -42800, -46625, -59641, -55706, -48301, -32100, -22975, -29767, -24711, -22687, -32783, -24958, -26896, -14860, -1637, 3468, 4485, -6949, -20477, -13722, -9761, -9065, -15565, -15105, -4648, 163, -5109, -15181, -14505, -20090, -41004, -38928, -32123, -20443, -23081, -26826, -26187, -30327, -19080, -4989, 8312, 13373, 6597, 15431, 9781, 4284, 8795, 1877, -15293, -17332, -16790, -10627, -497, 1058, 9980, 12886, 13681, 6648, -4941, -7533, -18139, -23748, -18158, -24680, -26029, -28886, -38251, -40301, -18947, -18362, -29523, -23653, -33051, -32924, -13488, -8537, -10223, -22725, -42270, -46239, -26962, -3857, 10254, 2616, -15454, -19039, -17132, -28049, -24557, -5529, 5062, 3206, 1644, 2961, 3066, -1430, -1712, -5365, -891, -6241, -22910, -13953]
15885a3953M483K1066O267q680m366J831O534P149j8r145q572m015k39l135o161
15870a0954J1301R233k252j5681l155N186Q171O20K490l807j2627j0008R829O665
15856d989j1434m535N578m73K615k158r531K852J2787J6965m2k304o844j3108
15842a4621N45O401j2008j1601Q069L725j372j995L334r83q218Q743J588J4129
15828d264J1663J794j5346k749m384N223m08K11j4237j3298j387j800q961p193
15814e5136O488J7530P782j2865o51J3110Q781O129R645n59O84r447j6995K634
15800b2870L898O923Q981l259K035j0661q278R365j910R75m548j618l676Q663
15786a5980K705p342o39P725m209O324L164P398L048L790k565n946j0922q995
$$ y = [-13953, -9470, 11596, 17863, 9183, 4817, 6648, 13182, 20331, 20313, 11168, 2596, -1419, -1658, -4793, -10954, 347, 9580, 7328, -8353, -11508, -6322, 1849, 2469, 4959, 1152, -11475, -21483, -11654, -4989, -16423, -20958, -15380, -15853, -13238, -15396, -24927, -22075, -9288, 7677, 7635, 5331, -1513, -14621, -14076, -7675, -19683, -31284, -23215, -19490, -20862, -22857, -19523, -20506, -28724, -19981, -18393, -4264, 7399, 9193, -6153, -8902, -13286, -8063, -8471, -8260, -22497, -35795, -37182, -38982, -47943, -55136, -48648, -31118, -23336, -36201, -36852, -23742, -14961, -8832, 813, 254, 938, -8509, -25504, -22870, -18972, -12049, -3068, -6327, -4292, -14953, -23231, -13866, -15776, -14801, -19349, -20967, -24643, -15980, -13275, -20617, -21256, -13531, -17740, -11416, -8252, -854, 2194, 5984, 3419, -2527, -13449, -22444]
15772b2444j809m778QL411n988n425J6886J0862L37J380J957p649L251j072p447
15757a8520l842J2934p808M744R897K319M569r836j1754p64J699p444P981J028
15743a4797j837n722M022J7513J1172j0773n849k670j336L982N234n591r629l408
15729a9689R941N342m030k874K557J288P904Q988m220J3512l240n49j1716j6229
15715a3015p342M521Q878J1104J2641K713k261J1752j4037j2773k999J7793R890
15702B6865j4045p874k0569J956O414n192j9628k862J1369J4978Q417K1883n136
15689A6576j4685K793l177k2578o658K447N076J3497k422J759l828r60K009O492
15675c659l750R931R74J09j2525J378J6901l395l980j743j1681O985L943N121
$$ y = [-22444, -24253, -29031, -29023, -25612, -31600, -37025, -20139, -9277, -8940, -7560, -5603, -13252, -10001, -11073, -18520, -22362, -9428, -17236, -12492, -2595, -276, 4293, -5543, -17297, -18061, -16362, -23806, -15825, -14797, -16634, -22356, -18334, -821, 10351, -422, -6271, -8941, -10277, -6295, -1061, -6652, -16281, -19689, -9748, -4406, -8436, -11310, -8753, -7465, 439, 9427, 5207, 18719, 15479, 14930, 3214, -13015, -20357, -15836, -6958, 4146, 16787, 19500, 17239, 28991, 14954, 2181, -818, 16975, 26865, 12820, 4946, -15623, -13667, -7253, -12445, -32073, -34935, -23566, -8588, -171, 21712, 16576, 1891, 4684, 1507, -21071, -27729, -25282, -20206, -6709, -9131, -7372, -11200, -12160, -10151, -3659, -7409, 2522, 3496, 3605, -8920, -7542, 9359, 5964, 1984, 241, -11440, -4455, -512, 4609]
15661D609J4361k079j5588o352o251q066J2573O105O795P912j4712r537K232Q612
15647F14N632p418l230r038k584M996Q131j2401R60J2927O11r470r728J98J1852
15632g948P207m957m609Q77J5058K888k0281n617l739J4875K0538j959q406N077
15618I004l021r946j841N283M678J3296j2284j7026l498J4034K1201J1747m507
15605B7120p604o554j1028K947J0017P180K095l176L126o696j3748L279J5392
15592B2350p565J736J1868q551p911J351R521J704k0482J190n271m770l891k128
15578a0849n427k865M183R068m127J301L823N618L526J5342n987j263L568P395
15564B3306M591n345j3794j4685P263J9204O620P745q159O085Q603L105j345j5213
$$ y = [4609, 18970, 16891, 1303, -5049, -11300, -19366, -6793, -688, 6107, 14019, -693, -10230, -7998, 614, 6246, -1172, -4402, -13440, -16024, -11028, -2897, -15298, -14338, -1411, -800, -10270, -19998, -19800, -7948, -741, -5698, -10307, -9430, 5628, 8516, -11765, -17382, -21121, -6246, 14292, 12333, 3927, 9004, 5983, -3963, -5804, -521, 4157, 17453, 5169, -11857, -15355, -1321, 19880, 31627, 27120, 19516, 12962, 1934, 4881, 14898, 22078, 24173, 20997, 24123, 17427, 3679, 6958, 22350, 14785, 16521, 28389, 19838, 11927, 13278, 22799, 24503, 4021, 5211, -60, -4830, -8721, -10849, -16276, -19141, -14958, -5890, -10017, -8716, -4893, 725, 4251, 19593, 13606, 12343, 15911, 23306, 27897, 22552, 8758, -5927, 1336, 20540, 27160, 34905, 26746, 32831, 41434, 44539, 43194, 27981]
15550B7981o874q053k440l846q668j3644r11N466L304n726O488O976M539p719
15536c127k289q35k5J1747J859r534j0300R55K462q648j663j177j3396m587J7681
15521b0877K3609N30j0346j0616K628O345o700M092j3862p439o171n315K928J1367
15507b9827k517j694J1627m970O08J221m003J728J0101O266L107J440N171N414
15493C672m142p091m816O087J433n56n577n369q951j396J0405k553L644p942j7219
15478d0371J882P345M054J657p231J3968M433L83p132l453l274j3621J2588J1076
15464a7696Q757J1443j8907j1442L7J3793r59r456j6383J4152K2281l20o059j1416
15450b2175r803N483J8148K739j1421K565k469q796p086O077J0786P946o322p540
$$ y = [27981, 21107, 13054, 10614, 6768, -1900, -15544, -16455, -10989, -7685, -13411, -6923, 53, 4592, -3127, -5416, -6251, -6276, 5471, 7330, -2204, -12504, -11549, -9087, -17735, -19398, -20575, -33971, -38558, -20877, 2732, 3262, -7084, -17700, -15072, -8727, -15427, -11335, -25197, -32636, -38807, -44122, -41194, -29827, -32344, -34038, -22411, -27381, -26773, -25552, -29555, -27827, -17726, -11460, -8353, -6913, -1742, 3672, -470, -7561, -12377, -6290, -4857, -5413, -10990, -16359, -25310, -26706, -16301, -18854, -15210, -23152, -40371, -38489, -31144, -27090, -25433, -32664, -18696, -14263, -13880, -21012, -24465, -27739, -41360, -28772, -17696, -8939, 2504, -16403, -27845, -27808, -14015, -14974, -24430, -40813, -26661, -4380, -4700, -10759, -22175, -31978, -26495, -8347, -5608, -17029, -14464, -16933, -25729, -32815, -26738, -15952, -8006, -14328, -21868]
15436b1868k496k104k97J372K455l833j27K972J2209O139n016n365j2384o933
15422c5276M15M728J892Q722Q734k094J531L045n742r504j733M651K893N755j930
15407a3913q10O819m888j6005O204O676K395L832P190J3637q533j5336r348k55
15393b2335J0132m817j4538l400J848r022O193J2615J5215M877j8719j6862r555
15380d8368J9125O582p107O867j009L964L204k2910J637K1992O942J925P609k479
15366b026r343M203r39k74J0457J5645J0486j1214j9020j1727j34K664l309r004
15352b3535J8268J6967J543k117o470j2665j062m58J740P142O215l889j2461m270
15338a5052J970j0722N69q149Q876O501N590q957p032K131k212p591O232J9429
$$ y = [-21868, -24364, -26468, -26765, -25393, -22938, -26771, -26898, -23926, -11717, -5578, -10594, -15959, -28343, -35276, -34861, -30133, -28241, -19519, -10785, -12879, -11348, -8303, -14045, -23549, -25282, -20631, -17738, -11983, -13913, -14723, -7904, -12792, -28797, -22593, -15917, -13522, -9690, -2500, 11137, 2604, -12732, -22080, -22335, -12203, -17020, -31558, -34958, -33110, -42132, -35939, -23324, -8109, -3232, -21951, -38813, -48368, -29243, -22661, -29768, -22901, -23910, -19946, -16742, -39652, -38015, -16023, -9081, -7156, 453, -2026, -11369, -7166, -8105, -8379, 2078, 17723, 28209, 16995, -2025, -13752, -13886, -11222, -14531, -23535, -5267, 11700, 13243, 11126, 4656, -8009, -9071, -9529, -7789, -647, 5568, 1679, -10782, -15052, -13082, -23804, -23235, -31384, -22508, -16007, -10417, -19374, -26406, -24275, -26487, -34078, -27846, -8417]
15324h417J8891M898k1889o144K912P076p180j6794N735N60J2191J2709j969O172
15310H751N009o867k1948J3673R49L152J5080k405j2633K538N013q51J642k927
15296H176Q641N412q065j2216j0850J952o167j1184l107J0737J567O410J19q886
15282a7461L882J11k032N476J0386M022j4895j6339n98Q457K333q723j1732N290
15268c1823J6630q390o063p322J1029p604L95j05J7381J7026j5502k50J3248O388
15254E038m9J8451J0372j1466j1005j3606j0847o2n410Q554J4285k601K005N885
15240I544n000r748j4908J1189p25j5406j3858Q809k231N348k373Q233J1366Q46
15226h914l188j0671k936n17J7351L919m176J183J353N650J889P741j0243j1847
$$ y = [-8417, 10474, 15372, -6517, -12661, -9749, -2673, -9853, -26647, -20912, -20352, -8161, 4548, 2579, 8751, 13760, 6893, -15055, -1382, -433, 2719, 17799, 15394, 2761, 5299, 10312, 9461, 11103, 8176, 16817, 22229, 14164, 1948, -8902, -6950, -13117, -24301, -27408, -16671, -15104, -8694, -8575, -17461, -13579, -13468, -15500, -10024, 362, 4384, -10511, -26850, -27448, -18991, -16658, -25381, -37113, -31823, -15193, -23583, -29646, -36968, -25939, -33543, -33148, -33253, -15872, 1154, -14348, -14598, -1350, 5038, 4989, 23440, 33812, 22346, 11341, -2265, -13112, -13174, -18584, -10030, 4255, 1654, 3659, 9544, 4544, -5204, -20112, -8923, -9648, -25054, -38912, -30103, -32334, -26986, -29359, -21126, -9760, -8914, -12102, -22773, -25709, -26226, -8875, -4956, -9132, -7949, -6596, -946, 943, 8684, -1559, -13406]
15212a3406N411P662n083j768J0257J0942q692L692L048p211r27l660n374L60
15198d749j4121j0581N675l91q096m146j0121P850P440N809l843k508L035J4773
15184a3974J0911q47o293m391J0977k864l982M558j857p335q088M198J3573O197
15170G83J270L139l190j0440n203l030k196R114M169R198N660q072j1375l403
15156a3576m080o65J892K514l563q930Q127K0938Q494q14L371R395q297o227L677
15141A2256l883q912o253q857j2509k934J2620P889P532L12r050n199P499l675
15127a3164O823N975j2388m690k986L907Q088l22q204J595J8492m496M124L361
15113F115o706m745q76j1527k3619M825l347P949K5571J7479k0903o572k792L381
$$ y = [-13406, -7995, -333, -5416, -7184, 3073, 14015, 5323, 9015, 12063, 4852, 3925, 265, -5109, -4749, -18870, -29451, -23776, -24167, -32263, -36409, -46530, -38680, -31240, -25431, -29274, -31782, -28747, -13974, -3063, -3910, -10203, -14594, -3617, -6481, -10463, -5905, -7762, -15097, -23185, -18987, -5414, 783, 2053, 5192, 2002, -8438, -13641, -16671, -18867, -9753, -5584, 3614, 9274, 1202, -10173, -13576, -17656, -18321, -16429, -13915, -17478, -26408, -18281, 2657, 11151, 10337, 13708, 23103, 14806, 8579, 12256, 8373, -539, -6792, -15649, -28158, -31092, -18472, -10583, -3051, -2739, -11789, -16988, -9489, -13164, -6341, -366, -12754, -17444, -20430, -16523, -8435, -8757, -16961, -15366, 3126, -1370, 2754, 6115, -591, -5336, -6212, -17739, -41358, -36533, -39880, -31931, -6360, 11119, -9784, -16356, -19148, -15767]
15099a5767M905J3032k711Q90q18l804N324j607n101j2770l730L49K041N13J736
15084a7518J4598m798p922q361N527Q251J5424m129j0703R083J0866q267o628
15071d577O267M273j6607o346Q206O543k198q423p597p832J0018J1458J965k283
15057g133M579j610P049N723N403k739q567j6198j728O766J5155O100O395o71
15043A8524j1403k3463j7137j520m20L355J5732J2351j812p500n158O621m888
15030a6718r977P031K258m273J106Q801J2123k076K362K553M97j7736j5446k254
15016c1749J4259O582O467o280N43J4337j4072k487K116J94J881j30K491j046
15002f894k954p531Q962L644q295j1689l26J3950r442j1751J4046M753l379m736
$$ y = [-15767, -10862, 2170, -541, 349, -469, -4273, 1051, -556, -5657, -18427, -22157, -21808, -19767, -19254, -17518, -2920, -7718, -15640, -24001, -18474, -10223, 5201, 1072, -9631, -548, 10318, 2051, -4577, 1690, 5963, -10644, -16990, -8784, -2241, -4439, -12862, -20459, -28291, -18273, -6815, -4850, -7133, -2554, -4164, 2885, 8608, 14011, 11272, 2705, -13493, -15221, -8455, 6700, 12800, 19195, 18524, 7121, -16342, -33479, -34999, -35419, -32064, -16332, -3981, -5793, -13293, -18451, -11830, -16718, -26695, -19664, -17406, -21679, -20573, -11772, 351, -1725, 637, 3190, 3687, -14049, -29495, -31749, -17490, -10908, -4441, -10721, -10178, 4159, -9913, -12400, -10284, -10090, -8209, -8339, -5848, -6894, -9848, -17379, -8417, -4773, -13068, -24757, -25083, -11133, -20575, -32326, -18280, -13527, -16906, -21642]
14988b1642J902K432N825N869O849p294j1896j630k617m593J1725J7893m255k642
14974d074j0241n658k384R411R168J1176J918P51r776r838j140M298j0311p662
14960b4362M71P156Q397M567k837L114P094J39q535O365O397P299q21j5199r695
14945a0450P666O279n467o475l991o441N03J4091J3019O222j798j5585k4785N402
14931b1810J7290j027n154p981l164l920Q302M286J0529J1417k985k1695j6212
14918c2124j614J1200J1788L560k1384p52k335N365J5216J2806r762M741J3851
14905A0556O943j4477m501P041l775k686j2245l126r574o126J4283M346L540J437
14891h364M472L159j5395n995J809j5418N200J7850J0239k680j5092j2802N602
$$ y = [-21642, -19740, -17308, -11483, -5614, 1235, -6059, -17955, -19585, -22202, -26795, -15070, 2823, -1432, -4074, -14315, -19973, -22357, -12946, -3778, 7398, 9316, 10067, 291, -9547, -10687, -6389, -16700, -24362, -23891, -16735, -8338, -3771, -6608, -3494, 3600, 3739, -4796, 1569, 7966, 15265, 14444, -755, -10450, -2784, 3495, -1972, -8447, -12438, -18879, -18376, -4285, 8734, 14956, 13158, -2427, -27212, -21810, -4520, -5547, -10701, -18682, -21846, -25766, -17464, -13178, -2649, 8768, 5783, -15912, -32124, -33738, -22538, -10750, -7190, -28574, -29326, -31661, -26296, -11080, 1726, -8036, -3295, 10556, 17499, 3022, -1479, 5562, 1787, -899, -13144, -16270, -25844, -31970, -17687, -13341, -9801, -8364, -3892, -733, -16128, -22123, -20314, -35732, -30532, -12682, -2443, -5123, -20215, -33017, -27415]
14878b7415J8759M030n863m949j3924M082o139l340l405j0083k714J6436J6190
14865a8335J2895J7011P530l735r929n410j265j0774Q736m68k1156J5594O022
14852c284J562L878m392l921r576r303M708k0506l933J8421M831m370J1351Q712
14838e822p158P413J288m28J508Q505l742j0299p381o779J662J549J167O516N654
14823f347O627n372j7774j026J3732J2184j0814K715O345r395j8928j1331O562
14810c2822K247J5890N478q271m274P406k242n034J1304M862q10N278J128k542
14796b402n74r621M536l790j0081j45J7264m3k365K528n673j4594J348J3624p678
14781a7666O132q29j342m831l46J3669J0020p487m250k335p654m564L675n231
$$ y = [-27415, -8656, -4626, -10489, -15438, -29362, -25280, -31419, -34759, -38164, -48247, -50961, -34525, -18335, -5440, 11571, 19101, 15366, 5437, 27, -1238, -12012, -3276, -3744, -24900, -9306, -3284, -1722, 2156, -2236, -6157, -15733, -25036, -20328, -40834, -44767, -26346, -21515, -25885, -14534, -5822, -12980, -5567, -4279, -4707, -3199, 5306, 1564, -8735, -16116, -22895, -21233, -19684, -18517, -12001, -6347, 280, -5092, -22866, -23892, -10160, 2024, -8790, -6075, 270, -9125, -28053, -39384, -32822, -30575, -14685, -9207, -17478, -21752, -14346, -16588, -21622, -10318, -5456, -6266, -988, 140, -2402, -2976, -12597, -8061, -11851, -21932, -22077, -4813, -4856, -7221, -4693, -10366, -24960, -23612, -9988, -17666, -11534, -12363, -13705, -18536, -18882, -5213, 4807, -2680, -6930, -9265, -16919, -21483, -17808, -23039]
14767b3039P607P285J098J189l948J0717O162J5282j4141r228K526K360O538n395
14753E013m845l419J0236k457L52L797r568q132j2257J0635K610J0856J206j1371
14739g344j9662o245K711M699J5652R518K865m919o941j2802q46p605J6009J5845
14725I35Q166Q936K772k1396k2554O133R41L478j5995J79J1670K464J3064l593
14711d800O667O09o968l525k128N719l353L262Q759q879r541K895M239J1043Q992
14696A2991j148r596K093J153q679l817Q18K463j0230p983j9565N012M434K0323
14682a1731M031n45j116J885P652M815N208J215m31n771L458r722j0840N621P22
14667e549K944o763j1041N347J5766P964j4936j3197p126R437J1146Q409p527
$$ y = [-23039, -15432, -8147, -7049, -5860, -9808, 909, 7071, 22353, 8212, -1016, 1510, 3870, 10408, 5013, 168, -3251, 6985, 4528, 4880, 8677, -891, -9023, -21280, -10645, -8035, 2821, 4027, -7344, -27006, -33251, -30540, -25841, -10189, -671, 2194, -2725, -9666, -22468, -23314, -30919, -14910, 935, 9101, 18037, 20809, -587, -23141, -17008, -16067, -12589, -28584, -28405, -16735, -14271, -1207, -4800, 1867, 2476, -4492, -8017, -10145, -4426, -7779, -4517, 4242, -4637, -14178, -11283, -7044, 3999, 12991, 11843, 2247, 4340, 5493, -3186, -7003, -6185, -3722, -13952, -21935, -41500, -36488, -32054, -11731, -7700, -8245, -9361, -7476, 176, 4991, 10199, 11414, 10983, 5212, 8670, -1052, -11892, -6271, -5549, -2605, -9368, -20409, -15062, 704, 8668, -6268, -19465, -26591, -17154, -6008, 2401, -5126]
14654e126j5499kJ2479R965j9438o34J7921L802m865p952R622J1212N865k027
14640A5323l863J046q238j438K652L020j0498k19J5081n331k212o23J2481n322
14626A1859K836P062j635q648j5226n38J4770J9272m009k2555m722O572J0811
14613A5849p447o455j880k812J0266J0059J419L862j7188r285P234r483k0634
14600b6495m83r750J4564J1499j2419r209R372l185L543L1520J9833m38o724l234
14586A8394m39q604q98J5533J468j2429P827K287j361m428L223M536k181n460
14572A7468L584n110n128M723Q07n795P372r048Q64k763J138k679p034P832J3104
14557A9335J767l764L214j6703o579L129m771K614N048p973n45J3675K0989J311
$$ y = [-5126, -20625, -20627, -8148, 1817, -17621, -18255, -334, 3468, -1397, -9349, 273, 11485, 17350, 15323, 11460, 12506, 4268, 2830, 5482, 8502, -1996, -2215, 12866, 7535, 5323, 4700, 17181, 11859, 14695, 21757, 20122, 11474, -3752, -4290, 10480, 29752, 25743, 3188, -1534, 5038, 15849, 8402, 1947, 67, -2745, 7521, 17580, 18999, 22861, 5673, -3612, 3622, -5861, -26495, -26978, -36728, -22164, -10665, -23084, -32293, -22921, -26106, -22563, 8957, 28790, 28352, 21628, 18394, 17955, 9351, 8453, 23986, 25454, 13025, 20852, 23139, 21778, 17350, 20573, 25109, 22928, 17468, 21052, 15942, 10814, 15537, 16344, 10549, 17921, 8873, 9737, 6974, 8112, 5433, -1601, 6231, 19335, 21102, 17338, 20552, 3849, -2730, 399, -4372, -1758, 3290, -4683, -5228, 8447, 29436, 30747]
14543C0747O136q00k2099o144L540M220j442r72J1943R249J486j7289o678R638
14529B1535J4922j747j2138M267k233M766P683K012m039K271k217L353q844l89
14515B9202r777q75R808p890j5338p157MK1326K3401J3112K128j7081o851P759
14501D1771M487j7578J0036J6060j1485j8361K906q02m910o824k375M353O694
14488B3972P795M033j3408j3465Q453J1731M962N430m71o205P675O181n98n057
14474D1028P800o403j7066p789o516j8408j599J3902k619q27N18r382P391J4641
14460A4671R349M325m161l681n18r747J5437J2367n239o126P613N059j440j016
14446C6893j054j206p674n603j1915N694J7652J0596l697j1477n054L072L95J1575
$$ y = [30747, 36883, 36083, 13984, 7840, 11380, 15600, 14158, 13186, 25129, 34378, 35864, 18575, 11897, 21535, 36457, 34710, 22572, 26839, 24606, 29372, 37055, 39067, 35028, 37299, 35082, 38435, 29591, 29202, 19425, 18550, 28358, 20468, 5130, -2027, -2023, 19303, 42704, 55816, 57944, 40863, 34012, 41771, 46258, 28680, 38716, 54776, 43291, 24930, 27836, 27034, 22124, 15300, 12925, 17278, 23972, 31767, 35800, 22392, 8927, 17380, 29111, 34073, 39503, 39032, 32827, 40502, 46683, 46085, 41028, 48828, 42425, 25359, 17570, 11054, -7354, -8953, 4949, 2330, 1503, 2021, -7361, 30, 14671, 24020, 28345, 24184, 20503, 19985, 10238, 25675, 38042, 32803, 26677, 34290, 39349, 37909, 36893, 35839, 34633, 26959, 21356, 9441, 15135, 32787, 43383, 39686, 28209, 23155, 26227, 26622, 38197]
14432C8197Q948n575M546r537K441J1172L046j1454q516N62N660J5658k88m216
14418E0644M677k0262j8643L140J3126O091O998J2467J3568L298J785J911j859
14405G6941p4j8137j1589j355K032o552J0403L8274K8052j1603P18J2422J0322
14392A29854J6086O0840R3277J28143J67957J89839J60784N8361p9366j82584
14382G43191j74026j24254p7563n4507l6479l3775j9551j2763j3752n262j2678
14371A78581o457j6236j473p727k3163k7272j5930q091j648J4377Q127q64P027
14358I9251J1596k870m592J2203J1711k973m175n591L202l142P267j9077j747
14345A01063J8826J9562J7701J2677K2148L1992L3942M1063N6981R3200J68167
$$ y = [38197, 47145, 41570, 46116, 36579, 39020, 50192, 53238, 41784, 33268, 33830, 39490, 55148, 54860, 50644, 55321, 35059, 16416, 19556, 32682, 38773, 45771, 58238, 71806, 75104, 76889, 78800, 76941, 76867, 58730, 47141, 45786, 47818, 41266, 51669, 89943, 117995, 106392, 107110, 119532, 129854, 145940, 206780, 300057, 428200, 596157, 785996, 946780, 1005141, 925775, 743191, 569165, 444911, 367348, 312841, 276362, 242587, 223036, 210273, 196521, 191259, 178581, 172124, 155888, 154415, 146688, 123525, 96253, 80323, 72232, 70584, 84961, 93088, 92224, 99251, 110847, 107977, 103385, 115588, 127299, 124326, 120151, 114560, 117762, 114620, 121887, 102810, 101063, 119889, 139451, 157152, 169829, 191977, 223969, 257911, 298974, 355955, 449155, 617322]
14334F17322K73652L29998L30728K78868R5116j28917k47507k80670k78674k16648
14324G73268j49818j05738p2178o3607m4430l5647j9468m197n595j7275l0485
14313B24830j1714l479j9187k3429j5679j0469p072j0252o822J5608K5007J5308
14301A72650K277J4469N119j5616l4K0145J4165n541o660j2277k6761j4944k119
14288A44873J0118J5105K0719K3127K7257J0902P346L7699O5513R6029J62191
14277F20879K09186K10652J23067l3618j75903k22885j71906j19759p1260n8583
14267C09870l4330j9436j3619j7135q403k3748j6355n692l174j0115k206m378
14255A51279l389o145r534r726j4225R740p27n731n79J6893J9146Q53l901j1956
$$ y = [617322, 890974, 1220972, 1551700, 1830568, 1925684, 1796767, 1549260, 1268590, 989916, 773268, 623450, 517712, 445534, 381927, 337497, 301850, 282382, 278185, 272590, 255315, 224830, 213116, 209637, 190450, 167021, 151342, 140873, 133801, 123549, 116727, 132335, 157342, 172650, 174927, 189396, 194515, 178899, 178865, 199010, 213175, 207634, 200974, 188697, 161936, 146992, 144873, 154991, 170096, 190815, 213942, 241199, 252101, 259447, 297146, 362659, 458688, 620879, 830065, 1040717, 1163784, 1130166, 954263, 731378, 559472, 439713, 368453, 309870, 275540, 256104, 242485, 225350, 216947, 193199, 176844, 171152, 167978, 157863, 155657, 151279, 147890, 141745, 132211, 122485, 108260, 118000, 117273, 111542, 110963, 127856, 147002, 147855, 143954, 131998]
14241A31998q748p923O950L546j8538j4861K804j39P96K1587M404J010l784k287
14227A16815r674k0042j4335n39k988j196R91r67K2255J902O610R110j1079j5349
14213H1514j8113j4828J33M373J3508J0590j2170j4955J1721J3114o957p315j6054
14200D4561q010P91j2555R640J0125K936J105J6254J7651J4023l101r994Q64J1837
14186I6127l625p446j2880J1934L163J2539Q536N491O38K435J0166L942O569m05
14172A37184O113J126K454J543J0429K368J1513R16R85J051j0780k5762k8618
14159A10522n5k921n774l276q415j6931l780K297R65n191r392r947L913j210j5459
14144C5346k371O471K7603J2516k424j1634q885J0490j3629o831J7433N754m906
$$ y = [131998, 123250, 115327, 122277, 125823, 107285, 92424, 95228, 95089, 95885, 117472, 121876, 122886, 119102, 116815, 107141, 87099, 72764, 72225, 69237, 68041, 69032, 68065, 90320, 92222, 98832, 107942, 96863, 81514, 63401, 48573, 48706, 53079, 66587, 77177, 65007, 50052, 61773, 74887, 67930, 60615, 44561, 36551, 37342, 24787, 34427, 44552, 47488, 48593, 64847, 82498, 96521, 93420, 83426, 84290, 96127, 92502, 85056, 72176, 84110, 87273, 99812, 108348, 113839, 114477, 116912, 127078, 131020, 137589, 137184, 143297, 144423, 146877, 148420, 158849, 161217, 172730, 173646, 174631, 175682, 164902, 139140, 110522, 110467, 107546, 101772, 98496, 90081, 73150, 69370, 71667, 72632, 67441, 58049, 48102, 52015, 50805, 35346, 32975, 39446, 67049, 79565, 77141, 65507, 56622, 67112, 53483, 46652, 64085, 69839, 64933]
14131F4933J1024K5441R491N284M254O082P011j3217J4776L150J0974J6826J886
14118A67915j0992J746J2181M1281J9201m993N999K2239K0433O630m517k8254
14106B48869l0272j4976k0967o898J6029j147j7321o809M58o980J0549R617k800
14093A77352j2638l003J6084O216O193J1705Q899j3305j9145p465j4636p187J42
14080A49212r655N475J1984N020J3874J4655O316n828N936K316j51N006q587j283
14066A94290m364r420m446J326j0421m36J1017J8016R194O568k943q906J6451
14053B15926j017j1718j2924j9448o040k289p631j1946k6296k9977L440K6950
14041A17030L2705O2156M7405M7027N1645L9771J137k9136q591k927J0434K5641
$$ y = [64933, 75957, 101398, 110889, 116173, 120427, 126509, 133520, 120303, 135079, 138229, 149203, 166029, 167915, 156923, 158669, 170850, 212131, 231332, 226339, 232338, 254577, 275010, 281640, 277123, 248869, 218597, 203621, 182654, 175756, 191785, 190638, 173317, 166508, 166966, 159986, 170535, 180152, 177352, 164714, 161711, 177795, 184011, 190204, 201909, 210808, 197503, 178358, 170893, 156257, 149070, 149212, 139557, 145032, 157016, 162036, 175910, 190565, 196881, 191053, 196989, 199305, 199154, 204160, 195573, 194290, 189926, 180506, 176060, 177386, 166965, 166529, 177546, 195562, 204756, 211324, 208381, 199475, 215926, 214909, 203191, 190267, 170819, 164779, 162490, 154859, 142913, 116617, 86640, 90080, 117030, 149735, 211891, 259296, 306323, 357968, 397739, 398876, 369740, 361149, 358222, 368656, 394297]
14029C94297K1391J4838J6760l287k3317k7199k1691k1516J4729K7420L7478M6850
14017D76753N2723N6955P6902N2934J0265m2789p0241o5384l9939k5414r696q720
14005D64349L970K2505M636j0252l046j7889j8552j6394k2582l72N845K1211J8566
13992D51995J786j7270m3851k8483Q433M1812R4765J06930R9370P4653L2549J0918
13980H33607J1315J2823J9798M2346O1208N6417N9052L0850M548j2148j3574j4066
13968A092176j1291o919N619J5288L8643K8340K2132N1127M6351N3267O1197P2061
13956A467991N7414N9334P3533N9744M2008K6017L6595O2252Q2425R2985J19612
13945B179910J21690J31502J25682J30192J52534J74143J90437K14213K36788
$$ y = [394297, 415688, 430526, 447286, 443999, 420682, 393483, 371792, 350276, 365005, 392425, 429903, 476753, 529476, 586431, 663333, 716267, 726532, 683743, 613502, 548118, 508179, 482765, 473069, 464349, 468319, 490824, 495460, 485208, 482162, 464273, 445721, 429327, 406745, 406373, 412218, 433429, 451995, 453781, 436511, 392660, 364177, 372610, 414422, 509187, 616117, 715487, 790140, 822689, 833607, 844922, 857745, 877543, 919889, 981097, 1037514, 1096566, 1127416, 1131964, 1119816, 1106242, 1092176, 1080885, 1073966, 1079585, 1094873, 1133516, 1161856, 1183988, 1235115, 1281466, 1334733, 1395930, 1467991, 1525405, 1584739, 1658272, 1718016, 1760024, 1786041, 1822636, 1884888, 1967313, 2060298, 2179910, 2301600, 2433102, 2558784, 2688976, 2841510, 3015653, 3206090, 3420303, 3657091]
13936C657091K38399K33382K83119L78021N19953O92797R33185J204413J503147
13927I643507J869140K302729K874860L659306M805925O825447J0500804J6989928
13919E9471646K6273213L4206326L4843391K4027000J348873k2845963l5379658
13912A21944828l2019270k1766699j3772949r008686o163207m363101l169555
13905C1681361k449982k042743j903828k081552k048298j632343j286414j114969
13897A7121232j002424r06314p72815n97982m48464l15173j99880j04901k8372
13888A2744907L2296Q2598J58578K20818K54324L04665L21430L05432L09840L68622
13878A5103510N26607P68534J118069J557112K115137K801223L606114M538508
$$ y = [3657091, 3895490, 4128872, 4411991, 4790012, 5309965, 6002762, 6935947, 8140360, 9643507, 11512647, 13815376, 16690236, 20349542, 25155467, 31980914, 42481718, 59471646, 85744859, 119951185, 154794576, 178821576, 180170449, 157324486, 121944828, 89925558, 68158859, 54385910, 45377224, 39214017, 34850916, 31681361, 29231379, 27188636, 25284808, 23203256, 21154958, 19522615, 18236201, 17121232, 16118808, 15212494, 14439679, 13841697, 13393233, 13078060, 12878180, 12773279, 12744907, 12777203, 12859801, 13018379, 13239197, 13493521, 13798186, 14119616, 14425048, 14734888, 15103510, 15630117, 16398651, 17516720, 19073832, 21188969, 23990192, 27596306, 32134814]
13870C2134814N761449P385449R874105J4358497K2425030L5837358N3228320
13863A81005022O3963637N9062377L8406110j090400l7607094m7024705m7806076
13856B08908871m7718737l7289476k4461725j6253574j1735244r045822p173118
13849E5231175n756186m632055l716953k978305k464728k149085k010824j909599
13841B9613440j768257j589027j395244j154742r43929p59981o07379m98057l89090
13832B0507734k53353j61796p8431l5645j6959k1076r7061j47852j59419j06114
13822A9430028O7445L34784P28076J286562J886844K265862K476231K439602K534451
13813C3449885L519207N524755Q917281J4802110K4355497L5539169M0517553
$$ y = [32134814, 37896263, 45281712, 55155817, 69514314, 91939344, 127776702, 181005022, 244968659, 304031036, 342437146, 341346746, 303739652, 256714947, 208908871, 161190134, 123900658, 99438933, 83185359, 71450115, 62404293, 55231175, 49474989, 44842934, 41125981, 38147676, 35682948, 33533863, 31523039, 29613440, 27845183, 26256156, 24860912, 23706170, 22762241, 22002260, 21394881, 20896824, 20507734, 20254381, 20092585, 20014154, 19978509, 19961550, 19940474, 19843413, 19695561, 19536142, 19430028, 19497473, 19832257, 20560333, 21846895, 23733739, 25999601, 28475832, 30915434, 33449885, 36969092, 42493847, 51411128, 66213238, 90568735, 126107904, 166625457]
13806A66625457L3327522J2490955j8139316m0210458l9986696k7973492j7716034
13799F8417938j1591246q084274o044462m833474m070532l409365k752588k131065
13791B5500932j649328j353226j217254j165087j162032j129075j027380q91981
13783A5905569p63612o79451n97833n17587m49302l77538l24348k75416k12150
13774A1708332j86787k02688k12916k64688l38068l91689m13716m08787l75810
13765H913183l51061l17440k81006k64008k45356k42041k29816k07153j54249
13756F621053j23993j11911j30189j44697j64469j76308j78431j68530j75897
13747E246628j84385j93925j85881j74230j65636j48935j27141j27395j48355
$$ y = [166625457, 199952979, 212443934, 194304618, 154094160, 114107464, 86133972, 68417938, 56826692, 48742418, 42697956, 37864482, 33793950, 30384585, 27631997, 25500932, 23851604, 22498378, 21281124, 20116037, 18954005, 17824930, 16797550, 15905569, 15141957, 14462506, 13864673, 13347086, 12897784, 12520246, 12195898, 11920482, 11708332, 11521545, 11318857, 11105941, 10841253, 10503185, 10111496, 9697780, 9288993, 8913183, 8562122, 8244682, 7963676, 7699668, 7454312, 7212271, 6982455, 6775302, 6621053, 6497060, 6385149, 6254960, 6110263, 5945794, 5769486, 5591055, 5422525, 5246628, 5062243, 4868318, 4682437, 4508207, 4342571, 4193636, 4066495, 3939100, 3790745]
13738C790745j25921q3341o2471r200k8681m6935n6001j03679j18228j08444j14497
13727B933347j12135q8248o5917o6060o3708p3611p5688r0716n9343o9736p0667
13716B097518n2455n8308m0672j6795j5306K941J3606N975k6647r6079q9464n8593
13704A665721m4929n8304o3535l3809N667J0180k586k6706m3483n3090o7272m0271
13692A247583m0546l1371l4597k5602l9640l3713k8538m0555m5448m1193k4191
13681H62189K196J6249K5825M4160J2656o177l0268l6173k3634j3071k3902j6437
13669H13613j0965j3002k1922j7625j5901k5885k7265j4694j2530m465L401l428
13657F49332k9190l8829l1589k8009l0671j4665j7182J4520J5021J5176K2629
$$ y = [3790745, 3664824, 3581483, 3519012, 3509812, 3481131, 3434196, 3378195, 3274516, 3156288, 3047844, 2933347, 2821212, 2732964, 2667047, 2600987, 2537279, 2463668, 2387980, 2297264, 2237921, 2168185, 2097518, 2045063, 1986755, 1946083, 1929288, 1913982, 1916923, 1930529, 1936504, 1909857, 1813778, 1724314, 1665721, 1620792, 1562488, 1498953, 1465144, 1470811, 1480991, 1478405, 1451699, 1408216, 1355126, 1287854, 1247583, 1207037, 1175666, 1141069, 1115467, 1075827, 1042114, 1013576, 973021, 927573, 886380, 862189, 864385, 880634, 906459, 950619, 963275, 957098, 926830, 890657, 867023, 853952, 830050, 813613, 802648, 789646, 767724, 750099, 734198, 708313, 681048, 666354, 653824, 649359, 652760, 649332, 620142, 581313, 549724, 521715, 491044, 476379, 459197, 473717, 488738, 503914, 526543]
13646E26543J3823K3678j88j5188r207j5957k9503k1328j3438k3833J7612O744
13634D59758L556j6427j5267j0019j9981j171J2369J9352K8477Q194j692j6854
13622D50295n300M137n872o175p457n154O412k597M10n087k789m399r699r960
13608C96765q989j9481p132m700p577q435j1377k4349r525q966l57o382r013j3197
13594B57285j2773o284k528K1062K1818P61j0314j2381r385j385R855k779o202
13581B46750q868j0804l642p906P430p221n20J0813j210J20j862J0462N610j0570
13567B28582q599j5206j1669R193j1321j0326O383k693k499J0427J1889R244J7490
13554B30895j1721j4743j5146j3729J073J419p084J001l472j1131m313j0590O24
$$ y = [526543, 540366, 564044, 563856, 548668, 539461, 523504, 494001, 472673, 459235, 435402, 453014, 459758, 463314, 446887, 431620, 421601, 401620, 400449, 412818, 432170, 460647, 468841, 467149, 450295, 444995, 449132, 443260, 437085, 429628, 424474, 430886, 428289, 428699, 423612, 420823, 416424, 406725, 396765, 387776, 368295, 361163, 356463, 348886, 340451, 329074, 304725, 295200, 286234, 285877, 279495, 270482, 257285, 244512, 238228, 235700, 256762, 278580, 279341, 269027, 256646, 247261, 245876, 255731, 252952, 246750, 237882, 227078, 223436, 215530, 222960, 215739, 215219, 226032, 224822, 224942, 223080, 233542, 239152, 228582, 219983, 204777, 193108, 202301, 190980, 180654, 187037, 184344, 181845, 192272, 204161, 213405, 230895, 219174, 204431, 189285, 175556, 176629, 178048, 170964, 171965, 168493, 157362, 153049, 142459, 143083]
13541A43083J461P213r770j3442j1549q512L130O893n680P455K145j1716P79L001
13527A14491l140j8891j5666P666P710J0515o589J90N669J0904K970l034j2890
13514I9905j4772r578N604M964k420q303n428j0308J4240L813j1153L117k567
13501F7114J0870R358o681p674N48N430o148r889j0255R259N088j6236j5530l07
13487C4947J7505K466R226J0712J157J2029l977p787j5654o379q55j113m339J5970
13473F3908L2313R820P367r261q013N578j0441j2026n453M707j3862q86k624N87
13459F1714J7007l740N105J3239m255r592r975j9233O266J0108J0962J9374L1599
13446A28579K7072K4157M0149N2760Q3148J29356J74783J84687J09309j3561j03568
$$ y = [143083, 144544, 151757, 141987, 128545, 116996, 108484, 111614, 118507, 112827, 120282, 122427, 110711, 111490, 114491, 111351, 92460, 76794, 84460, 92170, 102685, 96096, 96286, 101955, 112859, 115829, 112795, 99905, 85133, 75555, 81159, 86123, 83703, 75400, 69972, 59664, 73904, 77717, 66564, 69681, 67114, 77984, 87342, 80661, 72987, 73535, 78965, 72817, 62928, 52673, 61932, 67020, 50784, 35254, 34947, 52452, 54918, 64144, 74856, 76013, 88042, 84065, 76278, 60624, 54245, 53390, 52277, 47938, 63908, 96221, 106041, 113408, 104147, 96134, 101712, 91271, 79245, 73792, 78499, 64637, 63751, 61127, 61714, 78721, 74981, 80086, 93325, 89070, 79478, 69503, 50270, 56536, 66644, 77606, 96980, 128579, 155651, 179808, 219957, 272717, 355865, 485221, 660004, 844691, 954000, 940439, 836871]
13435H36871j51489j42409j08334r8971n3170l3250j7632k3653j9485j5230j4916
13424A58332k7520j1170J863P092M473K1774Q249M886J8569j393p882m804j1910
13411A60559j0925l1720k4870p909J375j0637m077J605O213J8677J6510M980l299
13398A16482j45N660M460J0898K0370J9793L5134M9871O0365P1756J27538J92417
13386G14599K80860L19642K95773J88591K861j71625k27012k27608k39414k16880
13376G19787j51967r7771p0702n4823m7495m0190k8819p915j5866j3127r476m53
13364A81183k074M73l507M624q208j6038o090j0275p269k491J4717M036M615j7586
13350A36110j0189O58R396N461j0381q216P192L899N736L421k824J6960J0220
$$ y = [836871, 685382, 542973, 434639, 335668, 282498, 249248, 231616, 207963, 188478, 173248, 158332, 130812, 119642, 121505, 128597, 133070, 154844, 163093, 167979, 186548, 185155, 177273, 172469, 160559, 149634, 117914, 93044, 85135, 86510, 75873, 71796, 73401, 79614, 98291, 114801, 119781, 116482, 116337, 121997, 126457, 137355, 157725, 177518, 212652, 262523, 322888, 394644, 522182, 714599, 995459, 1315101, 1610874, 1799465, 1802326, 1630701, 1403689, 1176081, 936667, 719787, 567820, 470049, 399347, 344524, 297029, 256839, 228020, 220105, 204239, 191112, 181636, 181183, 179109, 179582, 176075, 180699, 172491, 156453, 150363, 140088, 132819, 130328, 145045, 149081, 153696, 136110, 125921, 126579, 135975, 141436, 131055, 122839, 130031, 133930, 139666, 143087, 140263, 157223, 167443]
13337A67443K1457K1799K5066K0634L3199P4931J28724J78131K05608J74306P4194
13326A125492q6351j85094j98378j62903j11608p5453m9151m0836k1835j7196
13316A76687n238m305j1721j381o626r985l418o961j0633J740K69l111j134p744
13302A06439k1110k159N999r041j4091j548j3435J2649N660k825j579J087O70
13289F6716o15J034J028J153j3435N068J1531j161L496j5393M275K85j1691L518
13275E5809Q564L644l72l594j1320L572R83l106n168j4318j0602Q190n924M474
13261C0832r417l677M867K706P105m082p552J6760R980M830m219j9673j9613N624
13247A4471P430R44N075P56M159j2642M379N039q579q756n013n444Q951J3559
$$ y = [167443, 188900, 210699, 235765, 256399, 289598, 364529, 493253, 671384, 876992, 1051298, 1125492, 1039141, 854047, 655669, 492766, 381158, 305705, 256554, 215718, 193883, 176687, 171449, 167144, 155423, 154042, 147416, 137431, 134013, 127052, 116419, 118159, 118428, 115317, 114183, 106439, 85329, 83170, 89169, 80128, 66037, 64489, 51054, 63703, 69363, 66538, 64959, 66046, 66716, 66101, 67135, 68163, 69316, 55881, 60949, 72480, 71319, 74815, 59422, 63697, 63982, 52291, 55809, 64373, 68017, 67645, 64051, 52731, 56303, 57286, 54180, 49012, 34694, 24092, 32282, 26358, 30832, 21415, 17738, 22605, 25311, 32416, 28334, 20782, 37542, 47522, 52352, 48133, 28460, 8847, 14471, 21901, 22845, 27920, 28676, 32835, 20193, 24572, 29611, 21032, 12276, 7263, 1819, 10770, 24329]
13233B4329p159M652Q387L165Q975R856j6727m58J378q243j509j1875j419k680
13219A0672J1573R462K823K6j4521j5656M586N231k0371r598K952K095l25P43
13205a0308n156J0116J3733P915j256j9374R588n79n171j4794K950Q845N657j671
13191D95l19J5560J2697o227j8353p737O501P280j6607m802R611j3516k924J2138
13177f203j651k596n403J0702Q451O158L376q599j4091O673L437J3016p204n841
13163B25K999P11J4464M875J219O843Q561j189j0839l654k140J509o281o437r370
13148A496Q384J3973j5959k4248P531J1664P931k766L188j273J4514L934n776
13135B2593Q03l53p5q358L832J252L556J83p806m100K125L152q211m99N111N068
$$ y = [24329, 17170, 21822, 30209, 33374, 42349, 52205, 35478, 35020, 36398, 28155, 26646, 14771, 13352, 10672, 22245, 31707, 34530, 34556, 20035, 4379, 8965, 14196, -6175, -15773, -12821, -10726, -11051, -10308, -15464, -5348, 8385, 16300, 15044, -4330, 5258, 4679, -492, -15286, -12336, -3491, 2166, 495, 176, 15736, 28433, 22206, 3853, -3884, 2617, 9897, -6710, -11512, -1901, -15417, -18341, -6203, -7854, -10450, -15853, -5151, 3300, 9458, 12834, 4235, -9856, -3183, 254, 13270, 6066, 225, 3224, 3935, 18399, 23274, 24493, 31336, 39897, 38708, 27869, 24215, 22075, 23584, 17303, 10866, 1496, 9880, 23853, 7894, -16354, -8823, 2841, 10772, 8006, 11194, 9921, 24435, 28369, 22593, 23396, 23043, 22968, 14610, 18442, 19694, 23250, 23433, 15627, 11527, 13652, 16804, 8593, 8094, 13205, 18273]
13119A8273l360o031m18R158M385Q699Q201m781r882P90J3363J134k721J007k1580
13104A6237m280N277j636P018j263O257M777Q548j2607p196K1536O882q525o790
13090C4235q143L194m553j5336j555K52Q225l677o117n27R590L446N890P709O022
13075C8655M697l906p35j0059j3662N883j138O428J2361j0063j0809J2383O061
13062C6096P010p001L20l533J590K0511J2865p289j4012j1504j2278L903R460
13049C6138k92J936K022P880n616p165r527l245j992J2564J846j0439r019j1975
13035C116N836J7708O393j7386k3069k401M78N84K349R587O86L585P007J3262
13021B7735m08k044p08m48j943k460j290J684R533j052j0736j3281j477j0115
$$ y = [18273, 14913, 8882, 8464, 17622, 22007, 30706, 38907, 34126, 24244, 25034, 38397, 39531, 36810, 37817, 16237, 11957, 17234, 15598, 22616, 21353, 27610, 32387, 40935, 28328, 21132, 42668, 49550, 41025, 34235, 26092, 29286, 24733, 9397, 7842, 8094, 16319, 12642, 6525, 5998, 15588, 19034, 24924, 32633, 38655, 43352, 39446, 38711, 28652, 14990, 20873, 19735, 26163, 38524, 28461, 17652, 30035, 36096, 43106, 36105, 36425, 32892, 34482, 54993, 67858, 60569, 46557, 35053, 22775, 26678, 36138, 35846, 37782, 39804, 47684, 42068, 34903, 25376, 22131, 20139, 32703, 34549, 24110, 15091, 3116, 8952, 26660, 33053, 15667, -7402, -9803, -9325, -8741, -6392, 3195, 3881, 7466, 14473, 27735, 27327, 25283, 24575, 24127, 22184, 19724, 18434, 20118, 29651, 28599, 17863, 4582, 3105, -7010]
13007g010J0724M130J2328l629J0497n674n071J704q726J3726J6473J045j978
12994C8539J0850J422m959J459O456N17j6510q653N646q954j2263K043J3307j692
12980B7208j0628J620M170J0401O543k016m907m955o273k187K907J3663j0694
12967B4852j1842k641J5581J998l746o427o19J1687o202J189K518j501m112k867
12953A7868N062L581j0558l391o90J537k190J6463K0787L384j6677j7925l324
12940A3927j0835J486j64J2363O187O383l5k2464n663o783L18l73J9572K648L196
12925A9763O863m125m4m798O787K852j738J4920k073M666O116j0160o541j0131
12911B2357R953k144o560N050K923j7237M486J5088n281j0182M354n259j155l210
$$ y = [-7010, 3714, 7844, 20172, 16543, 27040, 21366, 16295, 17999, 9273, 22999, 39472, 40517, 38539, 49389, 50811, 45852, 47311, 53767, 54284, 37774, 29121, 34767, 25813, 13550, 15593, 28900, 27208, 16580, 18200, 22370, 32771, 39314, 37298, 32391, 27436, 21163, 18976, 21883, 35546, 24852, 13010, 10369, 25950, 27948, 24202, 17775, 17156, 28843, 22641, 23830, 26348, 24847, 20735, 17868, 22930, 26511, 15953, 12562, 11872, 13409, 11219, 27682, 48469, 51853, 35176, 17251, 13927, 3092, 4578, 4414, 16777, 22964, 29347, 29312, 6848, 1185, -5598, -5280, -5653, 13919, 16567, 19763, 26626, 22501, 22457, 17659, 24446, 27298, 25560, 40480, 38407, 43073, 49189, 39029, 32488, 22357, 32310, 30166, 23606, 28656, 31579, 14342, 18828, 33916, 28635, 18453, 22807, 17548, 16393, 13183]
12897A3183p20N112K998k989o23k837K557k0157n50N010M381O138l864K29j49
12882G719p146L305O88O123N184j5148m205L186k026k009o961o960O608N365n984
12867a2261n857M529J3601O909L288j558l941M824j498j1268r850O526P455j315
12853d16Q634N925J1653m619j4287l177O65J2634Q682m608q619p756k016n131
12839b436J2484K3828j1810j8704j045J5378P061p867p333K267j3795j4202J1194
12826d980K44o007K45J0705J5312j690j4758r099p929L331J3400l97J0071j71
12812H277l982l240n722j674p97l184J987J2708n424L706J0846j112n22k465p173
12797B229j011K543o714o34k140K241l737J659j8755l334J1310M791L390l928
$$ y = [13183, 12463, 17575, 20573, 17584, 16961, 14124, 16681, -3476, -4026, 984, 5365, 11503, 7639, 7868, 7719, 573, 3878, 4566, 10689, 15873, 725, -3480, -294, -2320, -4329, -11290, -18250, -11642, -6277, -12261, -18118, -13589, 12, 6921, 10209, 8651, 4710, 9534, 8036, -3232, -13082, -6556, 899, -416, 8218, 14143, 25796, 21177, 6890, 3713, 4378, 17012, 25694, 21086, 12467, 4711, 2695, -2436, 10048, 33876, 22066, 3362, 2317, 17695, 24756, 16889, 9556, 11823, -1972, -16174, -4980, -4736, -10743, -10498, 207, 15519, 13829, -929, -10028, -17957, -14626, -1226, -1623, 8448, 8277, 4295, 1055, -4667, -6341, -7138, -10322, -8335, 4373, -1051, 2655, 13501, 12389, 11867, 9402, 2229, 1218, 3761, -2953, -3587, -5727, -3486, -7223, -5564, -24319, -27653, -16343, -11552, -8162, -12090]
12783a2090j1083K3842K1963K154k6795L19j693k211J2249J3708M958k60r036
12770A6025j0670j4880J1224R651J182m113j0349n259N68J5781r864j7082j538
12757a9324N724o063J0686J5600J2909Q244R17M629j256j5529n732K61k171k01
12743H694p14l850j621K03o853q432J2309M970k782o260M908J3193N82J0404j026
12728B3725j0349j3501p854R659j7n797N253j680J061J5993j874P69O21j0085
12714E924o42J0130J1163M486j839j0857o234j729P034J0316J6307M601j0927
12701C7733j1957r430j02l99q387n985N150J473J2622m04O459M293n280N376q153
12686B3009Q254O261q559k1093q491J7563J1797k56j6132j0766L408L533J002
$$ y = [-12090, -23173, 669, 22632, 24786, -2009, -1690, -3383, -5594, 6655, 20363, 25321, 25061, 16025, 5355, -9525, 1699, 11350, 12532, 8419, -1930, -7189, -6621, 9160, -704, -17786, -19324, -13600, -19663, -8977, 6623, 19532, 27776, 28693, 33322, 32066, 16537, 10805, 11066, 8895, 8694, 7980, 4130, 2509, 2712, -4141, -12573, -264, 4706, 1924, -4336, 572, 13765, 14347, 24751, 23725, 13376, -125, -7979, 1680, 1663, -4134, 1119, -561, 500, 16493, 14619, 15388, 16009, 5924, 5282, 15412, 26575, 31061, 29222, 18365, 12131, 10402, 17436, 27752, 44059, 48660, 37733, 25776, 16346, 16244, 15845, 7458, 1473, 6623, 8096, 20718, 20314, 26773, 31066, 25786, 31162, 23009, 31263, 37524, 28965, 7872, -619, 16944, 28741, 28485, 12353, 1587, 4995, 8528, 9530]
12673I530N181j2626O063M134L499P913Q275j43q803N832N854K823l52r338j7065
12658A0777n825Q924o104j5748M408K821N619K148j3849Q737j63j5298m743J7111
12644a185O508j935K103L029q067k232q58K227L52r56Q835R3j2147N488R852M021
12628A5128j4670r822o475r577K587J9686N388K113R54M070N590J818Q813j6671
12614H932j2423M256O521J7201R786k2635r410l600j129r722p179L279J3252O365
12600C494L670j188j241l267J669n157n884p877N239R046J4451q034j1893R624
12586B652J5938N807j157k638l694j4164O572l165O925K615l194o528j1138n18
12572e687K901j19k886L332J763m234j985Q867k076N186R289K462j2039k1202
$$ y = [9530, 14711, 2085, 8148, 12282, 15781, 23694, 31969, 31826, 23023, 28855, 34709, 37532, 37180, 27842, 10777, 4952, 13876, 7772, -7976, -3568, -747, 4872, 7020, -6829, 1908, 1745, -13553, -18296, -1185, 5323, 3388, 5491, 8520, 453, -1779, -2637, -410, -58, -1014, 7821, 7914, -4233, 1255, 11107, 15128, 458, -9364, -15839, -25416, -22829, -3143, 2245, 4358, 5312, 9382, 14972, 16790, 25603, 8932, -3491, 765, 7286, 24487, 34273, 11638, 2228, -1372, -2501, -12223, -19402, -16123, -2871, 3494, 7164, 5976, 4735, 1468, 3137, -2020, -7904, -15781, -10542, -1496, 12955, 4921, -6972, 2652, 18590, 24397, 23240, 20602, 16908, 2744, 9316, 6151, 13076, 15691, 12497, 5969, -5169, -5687, -2786, -2905, -5791, -2459, -696, -4930, -6915, 1952, -124, 5062, 14351, 16813, 4774, -16428]
12558a6428n086O39j294Q735J5244N023K275j021N285J485l398J176k119k576
12544G940N263j907N93q579N379q165k147N563j645l910k0965Q62J428j5898j586
12529c7774p55L143J6826M948K913l159J2490L508m370j609p661q108J6613J5061
12515A2066p835j992N086j23j1719n391J664o125P033K0709J0455M52j426q927
12501A3927l894R127J538n574O6j597n927o625q41L602M097K50j4531j1986K942
12486a5426R910Q689m75P584L317J946m148M194q867n196Q950M639o906K053r932
12471C32K4689j744j1328o540M628J8907J0836N880k0303j7346j2J3418j0627
12458A0790j1182Q118P845r101O812p158Q445Q530o809R084O879j967L114m955
$$ y = [-16428, -21514, -20875, -22169, -13434, 1810, 6833, 9108, 8087, 13372, 14857, 11459, 12635, 10516, 7940, 13203, 11296, 11889, 3310, 8689, 524, -1623, 3940, 2295, -1615, -22580, -21718, -20290, -36188, -37774, -38529, -35386, -18560, -13612, -10699, -13858, -1368, 2140, -2230, -3839, -11500, -19608, -2995, 12066, 4231, 2239, 7325, 7202, -4517, -9908, -8244, -14369, -7336, 13373, 23828, 24280, 22854, 13927, 10033, 19160, 20698, 15124, 15190, 13593, 7666, 1041, 200, 3802, 7899, 8149, -6382, -18368, -15426, -5516, 3173, 2698, 10282, 13599, 15545, 11397, 15591, 6724, 1528, 10478, 15117, 8211, 10264, 332, 25021, 23277, 11949, 5409, 10037, 28944, 39780, 45660, 25357, 8011, 7999, 21417, 10790, -392, 7726, 15571, 6470, 13282, 6124, 14569, 23099, 16290, 25374, 32253, 30286, 33400, 28445]
12444B8445r098L796p279k860L24k252j9576j4946J2866J8227M015M392P970j4574
12430I450p833n89L196J7841k660m074n563J0567J4601j5050p426q591M569J0264
12416A8702j599j317K365n590j0202l644l316P710P1l10q275o102J4552n133p807
12401i895J5234P054J0995R079o132j0737o951R075L626R555Q47j2882O546Q214
12387C3628n461p109K801M225l299J515K872J0079l00j2251m579J919O018J0601
12373D0659J673j9187J178J0956J7933k371r703q043r68n706j938R257J9590M719
12359E8049j3451n157m021M493J385j266O805L139j0426N708Q285n250j7337l782
12345B7174j515M084Q678K91O862J4764l089j3247j1156J093J765p235J1981M415
$$ y = [28445, 19347, 23143, 15864, 13004, 13328, 11076, -8500, -23446, -10580, 7647, 11662, 16054, 24024, 9450, 1617, 1028, 4224, 22065, 19405, 15331, 9768, 20335, 34936, 19886, 12460, 3869, 8438, 18702, 17103, 15786, 18151, 12561, 2359, -1285, -4601, 3109, 3180, 2870, -5405, -11507, 3045, -2088, -9895, 5339, 12393, 23388, 32467, 26335, 15598, 8647, 17722, 21348, 30903, 31750, 18868, 25414, 33628, 28167, 21058, 23859, 28084, 24785, 26300, 29172, 39251, 38951, 26700, 22121, 24040, 30058, 40659, 42332, 23145, 24323, 35279, 53212, 50841, 41138, 33095, 32127, 26421, 24483, 33740, 53330, 58049, 44598, 39441, 35420, 39913, 41298, 40032, 46837, 49976, 39550, 45258, 53543, 48293, 30956, 27174, 25659, 29743, 38421, 38712, 45574, 60338, 57249, 44002, 32846, 33939, 35704, 28469, 40450, 44865]
12331D4865M717k295j1378j3107k42K398J1571K696n370j3871l236K478k288O453
12317B3391k57m496k864K579J0971k462L148R873K345p10J5625n632R16p790j9249
12302B5388l08P956r63J1367K810o422O821r56j7232L14J9230p132j9833m58L228
12287B3810P088N145J266J102K967j0250P33J5093k38n435M34l8k371O688N14
12272D6508p592j1323P255l858j0534K500j556J2902L655Q226r713j642m619j1924
12258A8285j0895L125J2349Q004J8960K672k9608o09J1474J2979L114q701Q227
12245D9376J29j613P885p360j9260J1383J4109n556l014l228k834j778m730K569
12231C6078J3643J0341q187l82R849J797m657l017k2739l684J9535J1518m00O102
$$ y = [44865, 49582, 47287, 35909, 22802, 22560, 24958, 36529, 39225, 33855, 19984, 16748, 19226, 16938, 23391, 23134, 18638, 15774, 18353, 29324, 26862, 30010, 39883, 42228, 41518, 57143, 51511, 52427, 44637, 25388, 25080, 33036, 32073, 43440, 46250, 39828, 46649, 45693, 28461, 28775, 48005, 40873, 21040, 20582, 23810, 30898, 36043, 37309, 38411, 41378, 31128, 31861, 46954, 46716, 41281, 41715, 41677, 39306, 45994, 46508, 38916, 27593, 34848, 30990, 20456, 22956, 21400, 34302, 37957, 46183, 36470, 34828, 30209, 18285, 7390, 10515, 22864, 30868, 49828, 52500, 22892, 22283, 33757, 46736, 49850, 41149, 49376, 49505, 47892, 55777, 48417, 29157, 40540, 54649, 49093, 46079, 42851, 40017, 38239, 33509, 36078, 49721, 60062, 51875, 51493, 61342, 63139, 58482, 55465, 32726, 29042, 48577, 60095, 59695, 65797]
12217F5797J4533J3346R555O806J753Q154J5577K5613L4797L5981L8122M6258
12205C16292O5263M8960L4211M3850L1536L0029L5828J8977q98k2236l4485l1562
12193E35765l9233l7627l0437l6588n2691m2751l9365k9018m773k1998l6538p482
12181A57264J4569q706k2486m385j1180j6711J612J981n76k946j5417m996M181
12168I2204j217M310J0801J617P389L146J2393K4467J6343Q384K2396J3783L1090
12155B47106M1811M7790O4474P7794Q3001Q3775O9901Q3393P8119O9127N1261
12144I97552L6613J6669Q721k428l8049o4614o0718o9386o8731p5425q3923p4528
12132E21753p8127o4353n1177k8531k5256k1749j6593j7959k3892j0586J2942
$$ y = [65797, 80330, 93676, 103231, 110037, 111790, 119944, 135521, 161134, 195931, 231912, 270034, 316292, 381555, 430515, 464726, 508576, 540112, 570141, 605969, 624946, 624048, 601812, 567327, 535765, 496532, 458905, 428468, 391880, 339189, 296438, 257073, 228055, 223282, 201284, 164746, 157264, 171833, 163127, 140641, 136256, 125076, 108365, 109977, 111958, 111382, 108436, 93019, 88023, 92204, 90987, 95297, 106098, 107715, 115104, 118250, 130643, 155110, 171453, 179837, 202233, 216016, 247106, 288917, 336707, 401181, 478975, 561976, 645751, 715652, 799045, 877164, 946291, 997552, 1034165, 1050834, 1059555, 1057127, 1019078, 954464, 893746, 824360, 755629, 680204, 596281, 521753, 443626, 379273, 328096, 299565, 274309, 252560, 235967, 218008, 194116, 183530, 196472]
12121A96472j551r496j5328K941j0763n107m407n208j9957k4045J567J5409J1820
12108A32347N115J635P208Q398K002M877J4216J9489J3591K8007L4137M0403N1889
12095C63314M6359L0627J0435L1399K7964L0131K1059JP867j1162k2366k2960
12083E12668l6574l3804m3830n3586l9984k1850k7358l2827k8321k6844J378o133
12071A62935j5110j212L829n133j6572o638n008j5255P874n735j0679J2960P339
12058A13595r569j658j4215N781J0455K642j2529o2N540L27n541j4672j1122Q225
12044G7197K0587p08P821k248O100J0511q923l264R040K9825J339L090m125J367
12030A47609j5830j3089L063p923J363J1949m022q773p440j8179p795J75K932
$$ y = [196472, 194921, 185425, 170097, 173038, 162275, 157168, 152761, 147553, 127596, 103551, 105118, 120527, 132347, 137462, 139097, 146305, 154703, 156705, 161582, 175798, 195287, 208878, 236885, 271022, 311425, 363314, 409673, 440300, 450735, 482134, 510098, 540229, 561288, 561289, 569156, 557994, 535628, 512668, 476094, 442290, 398460, 344874, 304890, 283040, 255682, 222855, 194534, 167690, 169068, 162935, 147825, 146613, 150442, 145309, 128737, 122099, 117091, 101836, 109710, 103975, 93296, 106256, 113595, 104026, 102368, 88153, 93934, 104389, 107031, 94502, 94440, 99980, 100307, 94766, 80094, 68972, 77197, 97784, 97076, 104897, 102649, 108749, 119260, 110337, 107073, 116113, 145938, 147277, 150367, 146242, 147609, 131779, 118690, 121753, 113830, 115193, 127142, 123120, 114347, 106907, 88728, 80933, 81108, 84040]
12017H4040J803O333O43L78j679n164k295J058M760p150M564n078P53k122J7356
12002I8200Q292j4864o523q415j1826J8285J1314j727o82Q121j1320k1140R354
11989G7069J4425M853J3806N106N958J4308J3984Q720o634k06N614P050N825J3615
11975A83493J3103P800o524j4409o362l873n473J1335L612k5779j1726N743Q692
11962A59632p929n823o033J75M412K80j8329j3563o793RR126Q185m704P474K2342
11947A48461J0730J443j1358j2134j2646O779K0331J105l421J3440L962o18N733
11934A71807L220J0274k304p814M009P896k089M47k813o424l541J2357n118j7519
11920A62388K304N503J2997R62k9332j7606K469J3140m33o51Q581R190Q518O20
$$ y = [84040, 85843, 92176, 92819, 93197, 91518, 86354, 84059, 85117, 89877, 82727, 87291, 82213, 82966, 80844, 98200, 106492, 91628, 85105, 76690, 64864, 83149, 94463, 92736, 92054, 100175, 88855, 67715, 77069, 91494, 96347, 110153, 115259, 121217, 135525, 149509, 158229, 151595, 151389, 157003, 164053, 169878, 183493, 196596, 204396, 197872, 183463, 177101, 173228, 167755, 179090, 182702, 156923, 145197, 150940, 159632, 151703, 145880, 139847, 140022, 144434, 144714, 126385, 112822, 106029, 106038, 115164, 123349, 118645, 126119, 148461, 159191, 160634, 149276, 137142, 124496, 131275, 151606, 152711, 149290, 162730, 166692, 166074, 171807, 175027, 185301, 182997, 175183, 179192, 187088, 184999, 185446, 182633, 176209, 172668, 185025, 179907, 162388, 164692, 170195, 183192, 184154, 154822, 137216, 139685, 152825, 152392, 151741, 160322, 169512, 178030, 178650]
11906A78650O378J4378K2293K1474K5781J2380J4422J7042K6647J4930K7247J4104
11894C95726r080j815J634K9609J3834o660J5112J3963P339j570J2893K3939P566
11881E02490O854K5431L4701J9776R809P139R558J3245k972j2577o076o94k4012
11868E82672j9434j4963j8380j9664k4932m288j38o001q713l608L23l959q524
11855D50391J6393K3773J5859J7939J6157K5397L0874M2667L6321K6028L6133
11844G37932L3789L5231L0888N7297M4500K5277K7428L0203K7340L8630L9080
11833A127595K4271j2604k570L2969K8470J3721K2136L0102K3755K6010M3527
11822A357382M6151M5954O5637O9543N7700N9291N2197P1651Q9783Q8336R3468
$$ y = [178650, 185028, 199406, 221699, 243173, 268954, 281334, 295756, 312798, 339445, 354375, 381622, 395726, 386646, 384831, 386465, 416074, 429908, 423248, 438360, 452323, 459662, 458092, 470985, 494924, 502490, 509344, 534775, 569476, 589252, 599061, 606200, 615758, 629003, 626031, 613454, 607378, 606684, 582672, 563238, 548275, 529895, 510231, 485299, 481011, 480873, 474872, 466159, 462551, 462874, 458915, 450391, 466784, 490557, 506416, 524355, 540512, 565909, 596783, 639450, 675771, 701799, 737932, 771721, 806952, 837840, 895137, 939637, 964914, 992342, 1022545, 1049885, 1088515, 1127595, 1151866, 1139262, 1136692, 1169661, 1198131, 1211852, 1233988, 1264090, 1287845, 1313855, 1357382, 1403533, 1449487, 1515124, 1584667, 1642367, 1701658, 1753855, 1825506, 1915289, 2003625, 2097093]
11811B097093R4097J13753J42728J59018J59604J96601K20348K37644K49150K72282
11801C942318L24621L79819M38842N33543O35093P54958R31552J181198J496281
11792A0618225J984255K743582L860528N423505P122575Q585296R355152R194006
11784E8887124Q604146Q114128P899968P675767O912877N391323L118461L11813
11776A06915607k321784m198604n224527n804125o394558p055220p874967q567500
11768E9474322q664015p842240o269384m641052l440474k616570k052771j673928
11760B2273888j411100j231617j057258r02747p54499n97436m54096l37121k29815
11751A5298199j35083m2126M6102J03225K07391L18172M29550N58535P21857R12431
$$ y = [2097093, 2191190, 2304943, 2447671, 2606689, 2766293, 2962894, 3183242, 3420886, 3670036, 3942318, 4266939, 4646758, 5085600, 5619143, 6254236, 7009194, 7940746, 9121944, 10618225, 12602480, 15346062, 19206590, 24630095, 31752670, 40337966, 49693118, 58887124, 67491270, 75605398, 83505366, 91181133, 98094010, 103485333, 106603794, 106915607, 104593823, 100395219, 95170692, 89366567, 82972009, 75916789, 68041822, 59474322, 50810307, 42968067, 36698683, 32057631, 28617157, 26000587, 23947816, 22273888, 20862788, 19631171, 18573913, 17671166, 16916667, 16319231, 15865135, 15528014, 15298199, 15163116, 15120990, 15167092, 15270317, 15477708, 15795880, 16225430, 16783965, 17505822, 18418253]
11741A8418253J168822J521400J997257K680515L734607N267989P190493R473797
11733E1453133J1931658J4044285J5662856J6524404J6223921J5263886J4118511
11726A55222654J2979025J1469262Q882301N478079J496939k669592o487404r403437
11718A76967827j1132625j2334357j3484596j4373258j4958990j4996949j4291166
11711H1395886j2546907r916795p346548n478185m231927l378409k779864k352657
11703C3364594k025704j756701j526216j298980j132183r68647q49829p38935
11695B3067399o09767n10938m11788l20110k23669q3348L4418J36265K21975L11976
11685B1612413M38816O20415R21842J293726J863541K735429L946286N377249
$$ y = [18418253, 19587075, 21108475, 23105732, 25786247, 29520854, 34788843, 41979336, 51453133, 63384791, 77429076, 93091932, 109616336, 125840257, 141104143, 155222654, 168201679, 179670941, 188553242, 194031321, 195528260, 192858668, 186371264, 176967827, 165835202, 153500845, 140016249, 125642991, 110684001, 95687052, 81395886, 68848979, 58932184, 51585636, 46107451, 41875524, 38497115, 35717251, 33364594, 31338890, 29582189, 28055973, 26756993, 25624810, 24656163, 23806334, 23067399, 22457632, 21946694, 21534906, 21214796, 20991127, 20907779, 20942197, 21078462, 21300437, 21612413, 22051229, 22671644, 23593486, 24887212, 26750753, 29486182, 33432468, 38809717]
11677C8809717O736613P623250P821028P470999O986858O713778O447908N906586
11669I4516737M802522K980679O99643j692510l646992m867056n566071o056935
11661H1170017o608479p269202p884476q119017p611462o406332m924507l648261
11653B8698281k761097k175267j755855j475176j280270j136289j000710q99145
11645A6214472p86482p04787o37831n83416n29598m83506m55714m18467l74306
11636A1240365l64576l39130l10626l02280k93495k84386k87733l00648k96825
11627H460666k87474k67389k48142k48163k24489k09474k07411k08681j84135
11618F375308j66683j89747j68660j62312j59818j53895j50244j46186j63931
$$ y = [38809717, 45546330, 53169580, 60990608, 68461607, 75448465, 82162243, 88610151, 94516737, 99319259, 102299938, 102999581, 101307071, 97660079, 92793023, 87226952, 81170017, 74561538, 67292336, 59407860, 51288843, 43677381, 37271049, 32346542, 28698281, 25937184, 23761917, 22006062, 20530886, 19250616, 18114327, 17113617, 16214472, 15427990, 14723203, 14085372, 13501956, 12972358, 12488852, 12033138, 11614671, 11240365, 10875789, 10536659, 10226033, 9923753, 9630258, 9345872, 9058139, 8757491, 8460666, 8173192, 7905803, 7657661, 7409498, 7185009, 6975535, 6768124, 6559443, 6375308, 6208625, 6018878, 5850218, 5687906, 5528088, 5374193, 5223949, 5077763, 4913832]
11609D913832j63995j54495j54359j43845j45639j18388j29033j37268r7237r1600
11599C577973r5066r1296q1835o8074p6232o9518o7650o9141q1985q1382q9758
11588B706036r4488p5669o9173p6632p1273n7322o7054p1597n6184n6823n1345
11577A958476m4186l7029j9850l6647m7691l0577k9850k3275k6006m5298m8310
11566A569757k2866k5628l9629l1506l6367k4202k7139k8248k9233j4265m2819
11555A247855m0578l6205m0370l1420k5644k6155k4062k3879l0099l4928j8773
11544I15742O200l494j7640j1660l232J0074J037j5435j8489j2583k7152k3213
11532H00155j2956j8438j3905j1355j7530r610j1640j0800k0058l2560k5423q322
$$ y = [4913832, 4749837, 4595342, 4440983, 4297138, 4151499, 4033111, 3904078, 3766810, 3669573, 3577973, 3482907, 3391611, 3309776, 3241702, 3165470, 3095952, 3028302, 2959161, 2877176, 2795794, 2706036, 2611548, 2535879, 2466706, 2390074, 2318801, 2261479, 2194425, 2122828, 2066644, 2009821, 1958476, 1914290, 1877261, 1857411, 1820764, 1773073, 1742496, 1712646, 1689371, 1663365, 1618067, 1569757, 1546891, 1521263, 1481634, 1450128, 1413761, 1389559, 1362420, 1334172, 1304939, 1290674, 1247855, 1207277, 1171072, 1130702, 1099282, 1073638, 1047483, 1023421, 999542, 969443, 934515, 915742, 921942, 918448, 900808, 889148, 885916, 895990, 897027, 881592, 863103, 850520, 823368, 800155, 787199, 768761, 754856, 743501, 725971, 716361, 704721, 693921, 673863, 641303, 615880, 607558]
11520F07558J147k0114k5892j3902l19N082L385j2085k1909n821l309J272l320
11507E11773K412Q149r844p962O653r460j8156j748K846k040q514j508m177j662
11493D66762k977R99o926J755L499M595p077j7829n882O516Q212l715k3309o115
11479D18508Q66J4456P082r509q065m524r072j5946j3945J459O872m896m197p515
11465C71574l175o440j9514m257M795j3502l1932l0029k278O036j8491j5939L167
11452B40015Q487M096K836O944J319P409m729k786J246Q26q459o985m959o161
11438B39099k384M338j0864n872o442r346N548R364r92j604j885Q606j019j959
11424B24588L489P19q659K656p302r071j746j5751q555L317M778O061m384j2460
$$ y = [607558, 608705, 588591, 562699, 548797, 548478, 553560, 556945, 544860, 522951, 517130, 513821, 515093, 511773, 514185, 522334, 512490, 504528, 511181, 501721, 483565, 481817, 484663, 482623, 474109, 472601, 468424, 466762, 463785, 464784, 457858, 459613, 463112, 467707, 460630, 442801, 436919, 443435, 451647, 447932, 424623, 418508, 419374, 433830, 440912, 431403, 423338, 418814, 409742, 393796, 379851, 381310, 388182, 383286, 379089, 371574, 368399, 361959, 342445, 338188, 342983, 329481, 297549, 267520, 265242, 271278, 252787, 236848, 240015, 248502, 252598, 255434, 262378, 263697, 271106, 266377, 263591, 264837, 265663, 257204, 250219, 245260, 239099, 236715, 241053, 230189, 224317, 217875, 208529, 214077, 223441, 222449, 220845, 218960, 227566, 226547, 224588, 228077, 228796, 220137, 222793, 215491, 206420, 204674, 188923, 180368, 183685, 188463, 194524, 190140, 177680]
11410A77680j9177r26j4582m65J1890N0j0354l826N75r443L455k523m777O179
11396A33756l346n020q812l532J1915J4277O485n476o754n284m718K627j268J1264
11382A36114P717N809r325j5779j7770K669R938J0809L540n473j0030k463m449
11369A11307q934J2625K3999Q168J3686K0646K2607P771J9733M1001N8663O6036
11357C97308M3665L3156L6749L9422M2116L7269J8590l02j8461k9416k8987l4827
11345E36282k8620l6361m2817m4849l4038l8433l6623j6466n490j1034j4478l382
11333B23691p911k5683r861N171J460j3168j394Q124l628k0501o605O49k757l141
11319A44446o526p176M903J3534R597O543j307O429K6316K2265L1948K7906M3920
$$ y = [177680, 158503, 157577, 142995, 142530, 154420, 154470, 144116, 140290, 140865, 131422, 134877, 132354, 127577, 133756, 130410, 125390, 116578, 113046, 124961, 139238, 145723, 140247, 133493, 128209, 123491, 126118, 124850, 136114, 143831, 149640, 140315, 124536, 106766, 109435, 119373, 130182, 133722, 128249, 118219, 115756, 111307, 102373, 114998, 138997, 147165, 160851, 181497, 204104, 211875, 231608, 272609, 331272, 397308, 440973, 474129, 510878, 550300, 592416, 629685, 648275, 647973, 629512, 600096, 571109, 536282, 507662, 471301, 428484, 383635, 349597, 311164, 274541, 258075, 252585, 241551, 227073, 223691, 215780, 190097, 180236, 185407, 186867, 173699, 172305, 180429, 176801, 156300, 149695, 150344, 147587, 144446, 137920, 130744, 135647, 149181, 158778, 165321, 164014, 170443, 196759, 219024, 250972, 278878, 322798]
11306C22798P5431Q8544Q4935P9177P4271Q2893Q6883P2490O6513L9371J7232
11295A090538j3130k7995l4367n6569o5644o6842n8242n8899q8531j04538p9135
11284D36646n8574m0234l9524k2657O4q937j8933k0501K721n360k9916k1042K391
11271A76144J6487l452k2017l124N342l718k729Q21m131k877J1316o773k0529
11258A40760m654K776M986P161J5782K4173K3995L0497M0544M3882L9666L7356
11246D06924K9720L6313M6013M1434K9355J765p410p127k2459k1174l2542l4873
11234D65939n5599n5891m5461l4441l2526k1852j9131k0566j0841o985j9189k1905
11222A21552r632J5666J4891J4116j6605j3672r561r104L47j838q652j5284N835
$$ y = [322798, 398229, 486773, 571708, 650885, 725156, 808049, 894932, 967422, 1033935, 1073306, 1090538, 1077408, 1049413, 1015046, 958477, 892833, 825991, 767749, 708850, 620319, 515781, 436646, 378072, 337838, 298314, 275657, 275721, 266784, 247851, 227350, 230071, 224711, 194795, 173753, 176144, 192631, 189179, 167162, 164038, 169380, 165662, 162933, 163754, 159623, 156746, 168062, 161289, 140760, 136106, 138882, 143868, 151029, 166811, 190984, 214979, 245476, 286020, 329902, 369568, 406924, 436644, 472957, 518970, 560404, 589759, 591524, 584114, 576987, 554528, 533354, 500812, 465939, 410340, 354449, 308988, 274547, 242021, 220169, 201038, 180472, 169631, 162646, 143457, 121552, 111920, 127586, 142477, 156593, 139988, 126316, 116755, 107651, 107998, 106160, 97508, 82224, 88059]
11209H8059l671n761N073O940q086j5135j3293r906j985j503K6585M409o615J77
11195F5288L161K26K165n906j4620k3352j931M3079K0735j1723j0257j5569M863
11182E6159j0364j1769J4411K7231n656j8189k841N136Oj1670l641m040J2612
11169D7385M266O485q060J273j2404k211J9775J1375m189j517j0697q442J632
11156D4671P923N465o844j32k132k107p516K224P021j0537j9136m54l466l022
11142A1958J3166J5998Q077l332j5021n769l10k919Q513p034j0623j3946K320
11129A078Q911j052L475J3625P186o313m595L325J781N272n589P561m857K103
11115C1911k2582k7165j1045J5646J4792j2258J59J1742J0291j976l947J4142
$$ y = [88059, 84388, 78627, 83700, 90640, 82554, 67419, 54126, 44220, 42235, 40732, 67317, 71726, 65111, 65288, 68449, 68675, 70840, 64934, 50314, 26962, 25031, 68110, 88845, 77122, 66865, 51296, 56159, 45795, 34026, 48437, 75668, 70012, 51823, 48982, 54118, 54124, 42454, 38813, 34773, 47385, 51651, 58136, 50076, 51349, 38945, 36734, 56509, 67884, 63695, 62178, 51481, 43039, 44671, 52594, 58059, 51215, 51083, 48951, 46844, 39328, 41552, 48573, 38036, 18900, 18446, 14980, 11958, 25124, 41122, 49199, 45867, 30846, 25077, 24767, 21848, 30361, 23327, 12704, -1242, 1078, 9989, 8937, 12412, 26037, 33223, 26910, 22315, 25640, 27421, 32693, 27104, 34665, 29808, 31911, 9329, -17836, -28881, -13235, 1557, -10701, -10542, 1200, 11491, 9515, 5568, 19710]
11103A9710R206J597o113M139p740J582Q783L224n930o236n941j680p66K3413
11089C7248J7144M909j6984j4265M536k858J279p713j2954L072M490L87m086k402
11075A1803k720o515k633L994J9132J2045M858n912j1565m261J0313Q829M353
11062D1721p439p319j294j1365k807j7785j9302Q846J392p61J7860o329K317P963
11048E698O87J3740J2133K126j0369n26P811N800o152p661l56n120K023L759k871
11033B0722N706N662n847o434n035j986P459P58J228j7993k948J1345Q314J0066
11019C1017M699L916K030j7419j8327q576j1371n044J0991J0955J2862m591J623
11006A2765O267L313n951j2190n667Q860q281k205j93p8j3650L474Q909J1096
$$ y = [19710, 28916, 30513, 24400, 28539, 20799, 22381, 31164, 34388, 28458, 22222, 16281, 14601, 13835, 37248, 54392, 59301, 42317, 28052, 32588, 29730, 31009, 23296, 10342, 13414, 17904, 18291, 14205, 11803, 9083, 2568, -65, 3929, 23061, 35106, 39964, 34052, 22487, 18226, 28539, 37368, 41721, 34282, 26963, 25669, 14304, 11497, -6288, -25590, -16744, -15352, -16113, 1747, -4582, -2265, 5698, 6385, 20125, 32258, 34384, 24015, 23489, 31300, 37100, 30948, 23287, 22931, 17811, 19834, 23593, 20722, 26428, 32090, 26243, 19809, 14774, 12788, 20247, 21005, 22233, 4240, 1292, 12637, 20951, 31017, 35716, 39632, 41662, 24243, 5916, -2660, -14031, -19075, -8084, 2871, 15733, 11142, 12765, 19032, 22345, 16394, 4204, -1463, 7397, -884, -3089, -3282, -3360, -17010, -13536, -4627, 6469]
10992F469J2441R411r427j8313J96p900L752L423P595J4605r364j3708K327N571
10978G078R263j1482l970J4219m226r780j824J446J0630M985k539Q159L383j1462
10964A3880n493n056J979k935j601p665j086J4914K175M730O328p308m475j8189
10950i802p193J6149M666j967J145N85R391K756j3718j2154K316M10Q420P205
10936H209N773j2477j431N827Q949l540k597n698m637n483j2341k755L082J295
10922a7824O350k087L240J753j2059J45Q013M043K336o337Q221j581J638N052
10908I03R657J5096Q873l297j5189j0836P118n596n061l41L601N404o810j802
10894A720Q3P599J0058M189r533j3861k975o163r820J0927N412R177l609R727
$$ y = [6469, 18910, 28321, 18894, 581, 777, -7123, -3371, 52, 7647, 22252, 12888, -820, 1507, 7078, 16341, 4859, 889, 15108, 10882, 1102, -722, 724, 11354, 16339, 13800, 21959, 25342, 13880, 8387, 3331, 5310, 2375, 774, -6891, -7977, 6937, 9112, 13842, 20170, 12862, 8387, -9802, -16995, -846, 3820, 1853, 2998, 3583, 12974, 15730, 2012, -10142, -7826, -7416, 1004, 8209, 13982, 1505, 74, 5901, 14850, 11310, 8713, 3015, -1622, -7105, -19446, -22201, -19119, -17824, -11474, -13561, -10321, -8568, -20627, -20482, -12469, -8426, -6090, -12427, -4206, -5787, -4149, 903, 10560, 25656, 34529, 31232, 16043, 5207, 12325, 6729, 1668, 1327, 4928, 10332, 3522, 1720, 1803, 9402, 19460, 23649, 14116, 255, -2720, -8883, -18703, -7776, -2364, 6813, 3204, 12931]
10880A2931Q317J3276n026k226o373p407k795r23k480Q05J91J1860k231j0114
10866G805j6848j0148N76J4066J3876Q245j927p870j7643n047J4947J0833k075
10853H790m287o488J0646O687K10j4258J901m596o568l503J1886J1341R601K174
10839B3536n435p137O688J2779J3205l841o859j54j853n653j403p43n341M588
10825B2377K709j5008m122k678N287J1693L708J3321o641j0705m971P504L298
10812B5772m971o610P84K407P58p029J2416M92j6960K049N738P147J1394K385
10798C5772o986M588m256j5484k1183j3990P109k775j170J0384J4498J1063j708
10785A5862q941l387O855m132M577m783k333J0001R312k652M674j6393r950J812
$$ y = [12931, 21248, 34524, 29498, 27272, 20899, 13492, 10697, 9774, 7294, 8099, 8290, 20150, 17919, 7805, -9043, -19191, -18615, -4549, 9327, 17572, 15645, 7775, -9868, -14915, 32, 10865, 8790, 4503, -1985, 8661, 15348, 15558, 1300, 3201, -1395, -7963, -11466, 420, 11761, 21362, 23536, 18101, 10964, 17652, 30431, 43636, 39795, 32936, 32782, 30929, 25276, 23873, 23130, 17789, 22377, 25086, 10078, 5956, 3278, 8565, 20258, 23966, 37287, 30646, 19941, 14970, 22474, 25772, 20801, 14191, 14975, 17382, 18140, 11111, 23527, 24019, 7059, 9108, 14846, 21993, 33387, 35772, 28786, 33374, 29118, 13634, -7549, -21539, -14430, -17205, -18375, -7991, 6507, 17570, 15862, 6921, 3534, 10389, 6257, 10834, 6051, 3718, 13719, 23031, 20379, 25053, 8660, -1290, 522]
10771E22P097J0935q341q370n248L427Q974O74O39Q68j943o890m368N837m415
10756f02k2925n257N248J2963j382l845P300Q480n514N0P245j5007K010P536K131
10741a569O891J5890J3705j2408k4009l373R920Q73q457j0986r415j466J500J6730
10727f174L034o22k550j1166m842o456J1043M490n251m982K1420P98l226l252
10713g736l172J0189N773j3097r632R245j505k018O214R827K315M844o383n695
10699h31J1054J3114j234l478l440j0838n335j586k314j4145n173P575M739O557
10685e335P2P236N520O101m141n310j11J4377O145j4023m268l299P932N779r172
10670G503J2216n7M964q492r429o995K895j0698N221O281o767j4205K005N852
$$ y = [522, 7619, 18554, 10213, 1843, -3405, 22, 8996, 9670, 10309, 11177, 9234, 2344, -2024, 3813, -602, -23527, -28784, -23536, -10573, -11955, -15800, -8500, -20, -5534, -5484, 1761, -13246, -11236, -3700, -1569, 5322, 21212, 34917, 22509, -1500, -4873, 5047, 5920, -2537, -13523, -22938, -24404, -22904, -6174, -3140, -3762, -6312, -17478, -22320, -28776, -17733, -13243, -18494, -23476, -2056, -1258, -4484, -7736, -10908, -719, 5054, -8043, -17675, -8430, -9935, -11953, -5739, 4088, 6403, 11247, 4864, -831, 10223, 23337, 22103, 18625, 15185, 4347, -988, -2574, -4888, -19033, -24206, -16631, -11892, -5335, -5263, 1973, 7493, 13594, 9453, 4143, 4032, 18409, 24554, 10531, 6263, 2964, 10896, 16675, 7503, 19719, 19662, 24626, 16134, 6705, -290, 2605, -8093, -2872, 3409, -3358, -17563, -15558, -9706]
10656i706Q029J0311L834J1514p640l840k885r855n6J1413R239O142n624j2722
10642H154k189j6884m289P245J2283R15j8279r7J3728R044l805n012p532Q541
10628A823Q139k030K479j0057k613J0117L874j036n001n383p547n310j748K284
10614a2009O740M932m020J058M429p681J373P585j3610J6186m45k823N565l107
10600D173k185R059j4J0928j243j0384M016K31l219k829m55o996j627J5363O229
10585B1047N170K370N809m507j2623j0176r388J2319L640j8052o879p646l153
10572b2069R13L24R404K3765M354m677j3463q741n041P76M846J0500R092n522
10558D461j2222Q05J2805q373K793j779k66N39J1151M903K170l280O414j3452
$$ y = [-9706, -1677, 8634, 12468, 23982, 16342, 12502, 9617, -238, -294, 11119, 20358, 26500, 20876, 8154, 5965, -10919, -15208, -7963, 4320, 5235, -13044, -13141, 587, 9631, 5826, 814, -6718, 1823, 9962, 7932, 10411, 354, -2259, 7858, 11732, 10696, 5695, 312, -7235, -12545, -14293, -12009, -5269, -337, -4357, -3299, 1130, -6551, -5178, 2407, -11203, 4983, 4538, 1715, 7280, 4173, 1988, 11047, 11033, 21961, 20718, 10334, 14350, 14581, 11362, 8533, 8078, 1082, -545, 14818, 21047, 26217, 28587, 34396, 29889, 17266, 7090, -2298, 10021, 13661, -4391, -11270, -18916, -22069, -21156, -20832, -11428, 12337, 16691, 12014, -1449, -10190, -15231, -14455, -9609, 891, 9983, 4461, -7761, -6956, 5849, -2524, 269, -1510, -1776, -1237, 9914, 14817, 16987, 13707, 20121, 6669]
10544F669l529K245J0239L834l077J548k46J388j0280j9384n956o333j906O268
10530a8520J9530R839O055k565J241L071j988j342M82m843N378N049R840k098
10516B9129j133N697o939k1695o766r459J5827J814k315M143k965j1146M864Q990
10502H046l733q153N731J5040J2710n508k7208k3518J382J3493J5580j4268J0189
10489b17M037M756N006R522J0357j11o328p254k889r043L431k577m879j987J532
10474C356j4811q830J2387M022J3352K413Q763J4533K63P095J5100n642j8990
10461C3011q014J0740J5095q111L579L892O995J4728q354q439j5610j9639j8006
10448A867R97M915Q886M805p539l640j56P406j2188l820J4728J1759J1595p723
$$ y = [6669, 3140, 5385, 15624, 19458, 16381, 17929, 17683, 19071, 8791, -10593, -16549, -22882, -24788, -18520, 1010, 10849, 16904, 14339, 15580, 18651, 16663, 15321, 15803, 10960, 16338, 21387, 31227, 29129, 27996, 33693, 26754, 5059, -1707, -11166, 4661, 6475, 4160, 8303, 5338, -5808, -944, 8046, 4313, -3840, 1891, 16931, 29641, 24133, -3075, -26593, -25211, -11718, 3862, -10406, -217, 3820, 8576, 13582, 23104, 33461, 33350, 27022, 19768, 16879, 7836, 11267, 8690, 3811, 1824, 3356, -11455, -20285, -7898, -3876, 9476, 11889, 20652, 35185, 35448, 42543, 57643, 52001, 33011, 24997, 35737, 50832, 42721, 46300, 50192, 57187, 71915, 63561, 55122, 39512, 19873, 1867, 2864, 7779, 16665, 21470, 13931, 10291, 10135, 17541, 5353, 1533, 16261, 28020, 39615, 31892]
10434C1892j7622p216j1309p327m391R462J0845p462J3124O396j379j0957q142
10421d086M426N248o978q276J2802M821l51P729n93j7034r585o906K020K1314
10407D551O510r791j1147l416K3370J2380O111j1247J2859J3849l709o134J006
10394C5192R099k4612k1346J2248P586R758J877k77q857q009n597M459p054j7125
10380a2658n122P427K0616Q404J4066q61j6040J016O379j526K91O402J852N92
10366C0838J0032Nl576K609O815K687j2481k4426k4523N531J4581K399J2871K3428
10352D6790M129j0176j5888o840L663m687j6662j2553j2139Q793J2477J4173L766
10339A4846j761k111j618j1424L872J7313R780L053R080J6867N696r838p630j4343
$$ y = [31892, 14270, 7054, -4255, -11582, -15973, -6511, 4334, -3128, 9996, 16392, 15013, 4056, -4086, 340, 5588, -1390, -9666, 3136, 7957, 7606, 15335, 14742, -2292, -11877, -18783, -16763, 4551, 11061, 1270, -9877, -13293, 10077, 22457, 28568, 17321, 30180, 44029, 40320, 34186, 35192, 44291, 19679, -1667, 10581, 18167, 27925, 29802, 29525, 20668, 12659, 7062, 11521, 4467, -12658, -17780, -10353, 10263, 18667, 32733, 31872, 15832, 16848, 23227, 21701, 21992, 28394, 30246, 30838, 40870, 40875, 37299, 39908, 46723, 49410, 36929, 12503, -12020, -6489, 8092, 10491, 23362, 46790, 50919, 40743, 24855, 18015, 21678, 16991, 329, -12224, -24363, -15570, -3093, 11080, 14846, 13085, 10974, 9356, -2068, 1804, 19117, 28897, 31950, 41030, 57897, 63593, 53755, 46125, 31782]
10325C1782j4177r864L34k005j8205q04m582J1795K1114J2251j229L48q558j2424
10311E776M727K0696N982j031n912N330o839q711o206M370J633q365j3229q557
10297a0336n728P152J8559J2975K492J597j6026l706j3705j6363M050Q630J0585
10284A76P707k912K0034j736J676M976O484l22j3510j1053O680Q763N451j457
10270C0957j5145j6848m147L423N566M114J1236L280n916J2141n332p538N193
10257B0984r872p387J3471Q346M278k0040m922P464R785O8J2036j1609l525k408
10243A6669j1940k1054j4489J033J0073J9377P798l344p344O417J095K047m931
10230A407l034O135J1609J8396k361m659q406k0516n312Q036o707O433J6676J0937
$$ y = [31782, 17605, 7741, 8075, 6070, -12135, -12939, -17521, -5726, 15388, 27639, 26410, 26758, 18200, 5776, 10503, 31199, 37181, 36150, 30238, 35568, 28729, 20018, 13812, 18182, 19815, 11450, -1779, -10336, -16064, -8912, 9647, 22622, 25114, 26711, 10685, 6979, -6726, -23089, -19039, -10409, 176, 7883, 4971, 25005, 23269, 24945, 29921, 36405, 36083, 22573, 11520, 18200, 26963, 32414, 30957, 15812, -1036, -5183, -1760, 3806, 7920, 19156, 22436, 16520, 28661, 23329, 15791, 20984, 11112, 3725, 17196, 25542, 29820, 9780, 4858, 12322, 22107, 22175, 34211, 22602, 19077, 16669, 4729, -16325, -30814, -29781, -19708, -331, 7467, 4123, -3221, 3196, 4291, 6338, 1407, -1627, 4508, 16117, 34513, 32152, 27493, 19087, -1429, -6741, 1295, -5412, 1021, 17697, 28634]
10216B8634Q63n114n037n755j1739o208k900M580K2L70m8P702j2542J889M828
10201d55K78K1092l171k80n687j2714K436O360L589P533J883K832k634r475m663
10186F924o880m718K1382J7448J173O77p001K32j4598p220j0197m062J102R89
10172d749J7495P974o832m136j6728O839N998J0950m08n392j2338J3237M058k140
10158A3828R260P26j2826p676P321j3618k288L095J636J4824m64n301J4485L343
10144B6345j0657j5057m702j1788r599L1M321Q047J5677J1399J2955q448o866
10131A1658R544R27j2502O686Q199j650J3355j411q350k3227l473K881J3145J5379
10117C1161r003m715K370N424n169p943o906J624J8074j3974k1187j173M153J8412
$$ y = [28634, 29497, 24383, 19346, 13591, 1852, -4356, -7256, -2676, -2654, -2284, -2332, 5370, -7172, -5283, -455, -177, 20915, 17744, 17464, 11777, -937, 1499, 7859, 11448, 18981, 20864, 23696, 21062, 11587, 6924, 44, -4674, 16708, 34156, 35329, 36006, 29005, 29237, 14639, 7419, -2778, -6840, -5738, -4749, 12746, 20720, 13888, 9752, -6976, -137, 5861, 16811, 16403, 11011, -1327, 11910, 15968, 13828, 23088, 23814, 10988, 3312, 10633, -2985, -5273, -2178, -542, 14282, 13818, 8517, 23002, 26345, 15688, 631, -4071, -15859, -25458, -25427, -21106, -13059, 2618, 14017, 26972, 18524, 11658, 21202, 22129, 9627, 16313, 24512, 22862, 36217, 34806, 26456, 3229, -244, 2637, 15782, 31161, 22158, 17443, 19813, 25237, 20068, 12125, 5219, 6843, 24917, 10943, -10244, -11417, -7264, 11148]
10103A1148L157O268P121K683o528j2497q223j3216N692J2198M331J699n222l339
10089E272O943P197j692O867J2969l514q643l667r349R07p78Q21m520m788q770
10074d745k684n762J7302K5827o331j1617j0807j6919r383P951P417j237J058
10061i930J7861l600n768N82j456l454J082J2971k282q799m806J3531K67j0284
10047d085j1104j6143j3779K3615J9986n061J2149J0331j1814q618J4456j635
10035H298r426j8130J1532K4932O825n323o450j0044P669r5O777L198L270n712
10021A7321p625J689l017j0928n725r606M781J5202J4238J2353J577j4663k7993
10008a2396r44K999o817j1396Q575O606k58M709L416r251K1576Q239O694Q248
$$ y = [11148, 14305, 20573, 27694, 30377, 23849, 11352, 3129, -10087, -4395, 7803, 12134, 13833, 8611, 5272, 12215, 19412, 17720, 24587, 37556, 34042, 25399, 21732, 12383, 13290, 12512, 13333, 8813, 4025, -4745, -7429, -13191, 4111, 29938, 23607, 11990, 1183, -15736, -25119, -17168, -9751, -10988, -9930, 7931, 4331, -1437, -855, -2311, -5765, -4683, 8288, 6006, -2793, -7599, 5932, 6199, -4085, -15189, -31332, -45111, -21496, -1510, -6571, 5578, 15909, 4095, -4523, 9933, 8298, -1128, -19258, -7726, 17206, 24031, 18708, 12258, 2214, 9883, 9788, 16565, 19763, 23033, 17321, 9696, 11385, 8368, -2560, -8285, -17891, -13110, 2092, 16330, 28683, 30260, 15597, -12396, -13340, -10341, -17158, -28554, -19979, -13373, -13631, -8922, -5506, -14757, 6819, 15058, 21752, 30000]
9994C0000mR447q104j2732k2912j0083R522R992j31J797q402o435k047J641P838
9979f13L920j794o342j0105k108M620P659J4335L605o310P327J6698P183R763
9965D7838Q708J0236K8841K828r490k1670j5155m134o432j852q983R086K243l947
9951C8117j2389j2382J1853J4899J8071N535k0259j4189J443L27p595N06N734
9938B9671M067q476J056N825M874q863k2675p228R402J3057J3236O063J095J3449
9924E4553q829k4728o130J4527J1382J82k0556r512L04Q996Q870n114m689q619
9910A0637o647n316O910Q503K1357J7472J432k917N423p796k0588j775J431n4
9896B8072J736Q105J0402p821j229l979P16O211O430r045j0728k536j4329q129
$$ y = [30000, 29996, 39443, 31339, 18607, -4305, -14388, -4866, 5126, 4995, 6792, -1610, -8045, -10092, -8451, -613, 3307, 1513, -4829, -14934, -17042, -12422, -4763, 9572, 13177, 6867, 14194, 30892, 38075, 47838, 56546, 66782, 95623, 98451, 88961, 67291, 52136, 48002, 41570, 39718, 30735, 39821, 42064, 38117, 25728, 13346, 25199, 40098, 58169, 63704, 43445, 29256, 30699, 31026, 23431, 23937, 29671, 33738, 25262, 26318, 32143, 37017, 28154, 5479, -1749, 7653, 20710, 33946, 40009, 41104, 54553, 45724, 20996, 14866, 29393, 40775, 40957, 20401, 10889, 11193, 20189, 29059, 23945, 19256, 10637, 3990, -1326, 5584, 14087, 35444, 52916, 54348, 51431, 56854, 49058, 28470, 26695, 28126, 28072, 29808, 37913, 48315, 40494, 39265, 35286, 36002, 42213, 48643, 39598, 28870, 26334, 12005, 3876]
9882C876K9072q05o234l239q218M870J9467Q202R938J724j1248J06q88k051o781
9867C7791K930J2924j295J0681Q94l328j2567j8546o506k954J307P207J0538J1490
9853E0566j1088O103K217j511o300j3686R618J432L041J2781O47r082j5876j0660
9839A8202J1201r148L550R276j533J2909p952j1333J613m999j5589K971L021O820
9825A9009P311J0534J6253O999j4138j0558p211m167K865J4457j080j6036k43
9812B3995N038O491Q488P45q722k66r558m725J103p73p41L46J1322J550j43k981
9796C1169j057q368l471N258j3875j4495j461J6289J1563k371j0173R78M806k498
9782A2294R379k743J844j4349N054q6r90Q20k31j93N828p06q022Q836J0569j4530
$$ y = [3876, 32948, 32143, 25909, 22670, 14452, 19322, 38789, 46991, 56929, 58653, 47405, 47511, 46623, 44572, 37791, 40721, 53645, 52350, 63031, 63925, 60597, 48030, 29484, 22978, 20024, 21331, 28538, 39076, 50566, 39478, 45581, 47798, 46287, 39987, 26301, 35919, 37351, 40392, 53173, 53820, 44738, 28862, 18202, 29403, 20255, 23805, 33081, 31548, 44457, 36505, 25172, 26785, 21786, 6197, 9168, 12189, 19009, 26320, 36854, 53107, 60106, 45968, 35410, 28199, 24032, 26897, 41354, 40274, 24238, 23995, 29033, 35524, 44012, 44757, 36035, 35769, 26211, 21486, 22589, 21816, 21075, 21421, 32743, 34293, 34150, 31169, 30112, 21744, 18273, 23531, 9656, -4839, -6300, 9989, 21552, 19181, 9008, 9986, 14792, 12294, 21673, 18930, 20774, 6425, 11479, 11393, 10403, 11223, 10992, 10799, 16627, 15921, 7899, 16735, 27304, 12774]
9766A2774j0681N238J80p27j4696n170J0368J0388P203r655m514J2853N913q22
9752A8652k193R564N273k887n635O548Q064m697r180j530j8695q850R666K812
9738F912r72Q998l788K865j577J563P61O645J3082M931J606q264o471L36Q6m271
9722B2442l853P764n344n900j9518j0259R308P504n093l206M070P853M464K522
9708A2754M5k426m579j6161k0357J1000K7171J0544j2398m562L21J6390l585n190
9694H967m190P47m431j8019j0847N408K1538J2936l340o372K259P026N610o479
9680A0813L827J059q636Q048L47Q860J340l365j2200q485M016o938l169J0050
9666E567p79N039O51n897n412Q407n359n106J7883j5285q783J6787J3159P023
$$ y = [12774, 2093, 7331, 7511, 6784, -7912, -13082, -2714, 7674, 14877, 5222, 708, 13561, 19474, 18652, 16459, 26023, 31296, 28409, 22774, 29322, 37386, 32689, 23509, 21979, 3284, -5566, 4100, 6912, 5940, 14938, 11150, 14015, 12438, 14001, 14762, 21407, 34489, 39420, 41026, 32762, 26291, 26627, 26713, 22442, 18589, 26353, 21009, 15109, -4409, -14668, -5360, 2144, -2949, -6155, -2085, 5768, 10232, 12754, 12799, 10373, 5794, -10367, -30724, -19724, 7447, 17991, 5593, 1031, 1352, 17742, 14157, 8967, 4777, 5524, 1093, -16926, -27773, -22365, -827, 12109, 8769, 2397, 4656, 11682, 17292, 10813, 14640, 15699, 7063, 15111, 15458, 24318, 25658, 22293, 10093, 1608, 5624, -1314, -4483, 5567, 4788, 9827, 10478, 4581, -831, 7576, 2217, -2889, 14994, -291, -9074, 7713, 20872, 27895]
9652B7895m356o116r304m695M665J955r24n482L670J281p773q543j0358M281O620
9637g184J5583J0889k65m561o491q671l789J1053K1014j413k7083j3604K802J272
9623a0448l982P085J6563n872L23K0057J229J0362m243r255k803j3441j4602J3448
9609D421o74q29P000o176p034l024J75J921K346P516j962j825l837j543o846R548
9593h23J5559K210L420K080k412L457l1j3539p297J216O089P069o630Q251L484
9578B2103q073L769O851l690j8544l061J3075Q485n909q320m044R32J7353l49
9564B0578q66J0489m028j4001j413j272j1827J488J4921k867N517J0208j2101
9551A4826k453O610j8205k0402K87L393j886l945O460N856J3277K591m147P486
$$ y = [27895, 23539, 17423, 8119, 3424, 8089, 10044, 9120, 3638, 7308, 8589, 816, -7727, -18085, -13804, -7184, 8399, 19288, 19023, 14462, 7971, -700, -4489, 6564, 27578, 26165, -918, -14522, -11720, -10448, -14430, -7345, 9218, 3346, 3669, 23726, 24955, 35317, 31074, 21819, 19016, 5575, -9027, 4421, 3747, 2918, 9918, 3742, -3292, -6316, -6141, -4220, -1874, 5642, 3680, 1855, -1982, -3525, -10371, -823, 14736, 16946, 20366, 22446, 20034, 23491, 23460, 9921, 2624, 3840, 9929, 16998, 10368, 18619, 22103, 14030, 17799, 24650, 20960, 2416, -645, 12430, 20915, 15006, 6686, 2642, 3574, 20927, 20578, 19712, 30201, 26173, 12172, 10759, 9487, -2340, -852, 14069, 11202, 16719, 26927, 14826, 12373, 18983, 778, -19624, -19337, -15944, -17830, -21775, -15315, -9459, 3818, 6409, 2262, 9748]
9537I748J2377l672q539p533K753J0717Q552n124j0902L775L731p803p312j1958
9523a1190m736J6630J9132Q717l317k525q001l191N34P713r373j9345m440K2016
9509H624m84m515m302j3206j984N86J0800l345m624L327J02J3761q526j6871R622
9494a1035K1937m352m741L149J8369p78q350m170o041p827P025J376k895l806
9480b139p435j6802J3994J4955n679J2136m649j0455j5315M6J0326J1031L449
9467C463L854J416N41M622l001j5289j5276m211P872L613m664J469J9732j321
9453B820p346r485n326K797L544o537P722P892j561K19P987p283Q608R340p015
9438F376r478p831k070R472J2436m310m378j584r68N347r347m347M454K290p030
$$ y = [9748, 22125, 18453, 9914, 2381, 5134, 15851, 24403, 19279, 8377, 12152, 15883, 8080, 768, -11190, -15926, 704, 19836, 28553, 25236, 22711, 14710, 11519, 12053, 19766, 10393, -8952, -13392, 8624, 8140, 3625, -677, -13883, -15867, -15281, -4481, -7826, -12450, -9123, -9021, 4740, -3786, -20657, -11035, 10902, 6550, 1809, 4958, 23327, 22549, 14199, 10029, 3988, -3839, 3186, 4562, 1667, -2139, -9574, -26376, -12382, 2573, -3106, 9030, 4381, -6074, -21389, -21343, -11017, 14, 3463, 7317, 8733, 9274, 13896, 10895, -4394, -19670, -23881, -16009, -12396, -17060, -15591, 4141, 2820, -4526, -14011, -19337, -16540, -12996, -19533, -11811, -3919, -5480, -5261, 2726, -4557, 4051, 13391, 6376, -3102, -10933, -13003, -3531, 8905, 4595, 217, -1367, -2335, 3012, -6335, -10682, -6228, -3938, -10968]
9423a0968J0817j582n59J0368L214n25r082n199p062O975N876L625K606K1476
9409B9980o048j0870o606J015N728M989m84j168O881J041j2735l339N812Q313
9395B2509J405o352j304Q60J2736J1390k574j0262j3308k806L877q585l357L237
9381G466N106N930m519l428p87J1570L664q928j4779M794Q639J1537J1350J449
9367C9064Q484Q369r157N957l392J423j2038n401n124P939j398l294l173r952
9353A8307Q622O106k832p267o966L144J3373O364n857j0860o078O516j342k510
9339A8720J0650J6797O980o654n22o613j0207N351O573K865k408j247J1010L977
9325E5272k017l302o598n20M660p91k994q11Q196M83K383q105r492o146J1200
$$ y = [-10968, -151, -1733, -2292, 8076, 11290, 10765, 1683, -3516, -10578, -3603, 2273, 5898, 8504, 29980, 23932, 13062, 6456, 7471, 13199, 18188, 17704, 16536, 23417, 24458, 11723, 8384, 14196, 22509, 23914, 17562, 16258, 17118, 29854, 41244, 38670, 28408, 15100, 12294, 16171, 7586, 4229, 7466, 12572, 18502, 13983, 10555, 9768, 21338, 25002, 16074, 1295, 6089, 14728, 26265, 37615, 39064, 47548, 55917, 46760, 52717, 49325, 50748, 38710, 33309, 28185, 36124, 34726, 31432, 28259, 18307, 26929, 33035, 30203, 22936, 15970, 19114, 32487, 38851, 32994, 22134, 16056, 22572, 21230, 18720, 29370, 46167, 53147, 46493, 45971, 39358, 29151, 34502, 41075, 43940, 41532, 40285, 51295, 55272, 53255, 49953, 43355, 42835, 47495, 46704, 43710, 42899, 51095, 51578, 53961, 45856, 36364, 30218, 41418]
9310D1418J7367k67R58l572o842j0829J366J6191J6068l883n237q20K238L096
9296F7252J4575K427q383o677l823J2792P401Q851o054n919n041k237k748l73
9282G2043N176k3J0179O043m807k044r718o366o96l563o145m551R879J0575k477
9267G3505N960P682M118K625R271j685o604j7106R490L59j0157J2951O207k62
9253I6354J325O158M918N523l580j1340l019J4797J4555M060q944j0463L061k733
9239A10672j351k192Q447J800L741O669m503L342P800J0181K2705K5279J2582
9226B05172R319M299P304L0352K6429J3823J6131L6572L3968N3580Q2774Q6182
9214F05905R2103J18950J73579K24151L36011N30753Q52612J395425K009060K125830
$$ y = [41418, 58785, 58518, 59476, 55904, 49062, 38233, 39599, 55790, 71858, 67975, 62738, 61918, 64156, 67252, 81827, 84254, 75871, 69194, 65371, 78163, 85564, 94415, 88361, 82442, 77401, 75164, 72416, 72043, 77219, 77196, 87375, 93418, 88611, 86567, 76849, 70483, 69787, 66224, 60079, 55528, 65407, 75982, 73505, 79465, 87147, 91265, 93890, 103161, 101476, 94872, 77766, 87256, 87615, 77458, 90409, 96616, 96354, 97679, 103837, 108755, 114278, 110698, 99358, 96339, 111136, 125691, 129751, 120807, 110344, 113405, 110672, 109321, 107129, 115576, 117376, 121117, 127786, 123283, 126625, 134425, 144606, 167311, 192590, 205172, 214491, 218790, 226094, 256446, 282875, 296698, 312829, 349401, 383369, 436949, 519723, 605905, 698008, 816958, 990537, 1214688, 1550699, 2081452, 2934064, 4329489, 6338549, 8464379]
9204H464379J378516o2191j679483k150231j578296j008714o69242m67464l20200
9195A907074k35588j93666j59799j24331r9114p9473o0456n2301n5576n8283n3416
9184G35071m8024l7517k3709k5167l5906k6887j8318k7047j9398j2593L74N265
9172D66144j6719j4442Q338J262j8686j8436o159p064j6176k3065j6379j681k2441
9159C14496k728k085j2108j4412j9643q324m821m109j2524l964L525M171j5873
9146B21601N61j1177r225j1091j7774K253o706r057J0798P212j5342p178K064
9133A56939M30jK329J2356o341m447j59k6612j8060m921o755K155J7432j628O0
9118A22777j7211o573L242q83m401j2462K16k37m372q894k1402N994P343J5467
$$ y = [8464379, 9842895, 9780704, 8101221, 5950990, 4372694, 3363980, 2694738, 2227274, 1907074, 1671486, 1477820, 1318021, 1193690, 1094576, 1015103, 954647, 902346, 846770, 788487, 735071, 687047, 649530, 625821, 600654, 564748, 537861, 519543, 492496, 473098, 460505, 460879, 466144, 449425, 434983, 443321, 444583, 425897, 407461, 401302, 394238, 378062, 354997, 338618, 336937, 314496, 311768, 309683, 297575, 283163, 263520, 255196, 250375, 246266, 233742, 229778, 233303, 237474, 221601, 222162, 210985, 201760, 190669, 172895, 175148, 168442, 159385, 170183, 177395, 162053, 154875, 156939, 157369, 157368, 159697, 172053, 165712, 161265, 161106, 134494, 116434, 111513, 104758, 106913, 124345, 122717, 122777, 105566, 98993, 102235, 101352, 96951, 84489, 84705, 84468, 80096, 71202, 49800, 55794, 63137, 78604]
9104G8604L395j2298j012O69N469P715j1203n217J2138M571j1227k475J1888L734
9090H4751j6754j1001n114J1773R496J0402o795k0420o169N081j1448L75J0299
9077E4476p707n09P777J45P010k268j1028J7619J3213j1160j3970j5717j440J3291
9063D9732M148l228j2602p625R838M153L063J4276k148k0380r667M453N911R403
9049D9327K969m799j3533Q00J5672j0911o880J3216J1753q254j0452J179J0914
9036E1001k465k2351l551j180R101O048q333j183N011O621l163l046j0225M274
9022B6559M490m354l595O461O019M696K703P418r960r813Q475l035j0923K259
9008B7400J2128K39m204L394m349N692N210k7404o036J266J7395J3756j6647k8
$$ y = [78604, 81999, 69701, 68689, 69358, 74827, 82542, 71339, 66122, 78260, 82831, 71604, 69129, 81017, 84751, 67997, 56996, 51882, 63655, 73151, 83553, 76758, 56338, 50169, 55250, 43802, 44177, 54476, 46769, 46260, 54037, 54182, 61192, 58924, 47896, 65515, 78728, 67568, 53598, 37881, 36441, 49732, 53880, 50652, 38050, 30425, 40263, 44416, 47479, 61755, 59607, 39227, 29560, 34013, 39924, 49327, 52296, 47497, 33964, 34764, 50436, 39525, 32645, 45861, 57614, 49360, 38908, 40087, 51001, 48536, 26185, 22634, 21454, 30555, 36603, 28270, 27087, 32098, 38719, 35556, 32510, 22285, 26559, 31049, 26695, 23100, 29561, 35580, 40276, 42979, 50397, 40437, 30624, 39099, 36064, 25141, 27400, 39528, 39767, 35563, 38957, 34608, 40300, 45510, 18106, 12070, 13336, 30731, 44487, 27840, 27812]
8994B7812j988o56j0685k221P52P666L219Lj2211J0755R259p957k1195k382K7427
8979B7598K132j3393j4603j5755J3546J0440N853l673P116m635L708K0725M572
8966D3631j5273M216r32k309k339k50N787q341n501Q259R288j2895j1454m549
8952G338j3363J1393P033p895o985R728O646J2847o023J3097J214j3444P783N962
8938C5331r04O906q961K265l984j3513J588j1721o142N926N197K87M109L819J921
8923B2124K519N926j3567L152l197J1462J4767J2581j8439n108l94o615j1701
8910A3510M498J1724L013o189Q491J818k1093q736K2N363J2634o53K962k635N38
8895B5267j3448r805M116M661J4943p395J1708j2307n508J0573O944M738j1122
$$ y = [27812, 25824, 25168, 14483, 12262, 13014, 20680, 23899, 23902, 11691, 22446, 31705, 23748, 2553, 171, 27598, 29730, 16337, 1734, -14021, -475, 9965, 15818, 12145, 19261, 14626, 18334, 39059, 43631, 28358, 32574, 31642, 29333, 26994, 26744, 32531, 24190, 18689, 26948, 36236, 23341, 11887, 7338, -6025, 5368, 12401, 4506, -2479, 7249, 13895, 26742, 20719, 33816, 35030, 21586, 29369, 35331, 34427, 41333, 32372, 34637, 30653, 17140, 18728, 7007, 865, 6791, 11988, 12275, 16384, 20203, 22124, 24643, 30569, 17002, 20154, 16957, 28419, 43186, 55767, 37328, 32220, 31826, 25211, 13510, 18008, 29732, 32745, 26556, 35047, 36865, 15772, 7036, 7058, 12421, 25055, 24402, 27364, 24729, 25267, 11819, 2014, 6130, 10791, 25734, 18339, 30047, 17740, 12232, 22805, 29749, 34487, 23365]
8882B3365r229R91M93r753n952Q948M812R798n662k888p091J1817P947J4459M082
8867D6137j334q523l892j7231o959O886R713o559l712p945r229R831J0251K302
8853A9736o772R639O054J565O689N074j2738J790j1379j699n234k506O099J0730
8839B7048n690J857J141L590K023o204J1750n440k285r374j9882k121P880N602
8825I895o363L170j501r974J5362K1284l540o248o344J2688r46l460p909r185
8811F929K706n055l445N330k394J776L120J0969K762o464j1341K880Q300R395
8797B5468Q687P742M8n085j136q330p257n170k031o89j0197n516R516N230K40
8782A1520n094M86o070n104Q32N943P404N343J0787p16r85q187M782J5872n89
$$ y = [23365, 14136, 15127, 15620, 5867, -85, 8863, 13675, 23473, 17811, 14923, 7832, 19649, 27596, 42055, 46137, 44803, 36280, 32388, 15157, 8198, 15084, 24797, 18238, 14526, 6581, -2648, 7183, 17434, 19736, 12964, 22603, 28657, 30222, 36911, 41985, 29247, 31037, 19658, 17959, 12725, 10219, 16318, 27048, 21358, 23215, 24356, 27946, 29969, 23765, 35515, 30075, 27790, 18416, -1466, -3587, 4293, 9895, 3532, 6702, 5201, -4773, 10589, 31873, 28333, 22085, 15741, 28429, 27483, 24023, 16114, 6929, 9635, 4580, 1135, 6465, 4071, 5847, 8967, 19936, 22698, 16234, 4893, 7773, 16073, 25468, 34155, 41897, 41945, 36860, 35724, 27394, 20137, 14967, 12936, 12247, 2050, -3466, 6050, 11280, 11520, 6426, 6912, 842, -4262, -3430, 2513, 9917, 15260, 26047, 25331, 24346, 16159, 20941, 36813, 36224]
8767C6224m193j1667k050l894j1021k035M311M669q071r035R86J9115l047J762
8753A2054P746J4383N186L783j0907q328K029P500K234j3298j083J310l383j7954
8739A272k22Q784l507J2216M39L616J2900l208j2980l632K466k369K658J369j4516
8724E286k296L492L399n88L80P966K274m05J38r704q083N46M327R327j049j2187
8708B823p469r32K5981Q052j185N675m027j6714o150Q637o444o882J91P219M197
8693A2972j508j0733n591J4073M435O994M109l1465j2397J1496J1968J1743N910
8680B2006L139j1379l074J1702N253L018n124n625L27j002j060N309L69m175k513
8665A7171M751o586j6349l2Q178J1702J3637L404p664q478j648Q463J342p794
$$ y = [36224, 32031, 20364, 18314, 14420, 3399, 1364, 5675, 10344, 2273, -6762, -5776, 13339, 10292, 12054, 19800, 34183, 39369, 43152, 32245, 23917, 25946, 33446, 35680, 22382, 21299, 22609, 19226, 1272, 1050, 9834, 6327, 18543, 18982, 22598, 35498, 32290, 19310, 15678, 18144, 15775, 18433, 19802, 5286, 2990, 6482, 9881, 9293, 9673, 17639, 19913, 19508, 19646, 9942, 1859, 2405, 6732, 16059, 15010, 2823, -4646, -5578, 20403, 28455, 27270, 32945, 28918, 12204, 6054, 14691, 8247, 1365, 1556, 8775, 12972, 11464, 731, -4860, 9213, 13648, 20642, 24751, -6714, -19111, -7615, 4353, 16096, 22006, 25145, 13766, 10692, 22394, 27647, 30665, 25541, 19916, 20243, 19241, 18181, 23490, 23859, 19684, 17171, 21922, 15336, -1013, -1045, 7133, 18835, 32472, 35876, 28212, 19734, 18086, 26549, 27891, 20097]
8651B0097j956m565j3127j2174J5484P936j0483q547R337J9961J6063q973p690
8638B1363k171j0877J950K730K26P86J0068K520r968kQ23j4049o007o15J026P467
8622E270O481Q922m37j597J729M199r642j0182l854K560K2168P972K436r415m559
8607B2051k838j1872l511J199J2338J034l387P76r134O108J0741p904j12J1292
8593B6781j2333j0075L685p581R649J4487j1394p509Q190q094O977j416K308j745
8579A1930n287l915n856J54n740R010P79J4196K77L522n173r293q315k715J201
8564e225P262J4433P350n493M072l837j2315j0689N040J193q666J561O195J4129
8550A5010J1400k274j2740q012J2838J5014L030k674o752p937J870m054o498p486
$$ y = [20097, 18141, 13576, 449, -11725, 3759, 11695, 1212, -7335, 2002, 21963, 38026, 29053, 21363, 19192, 8315, 10265, 12995, 13221, 14007, 24075, 26595, 16627, 16625, 17448, 3399, -2608, -3223, -2197, 5270, 11751, 20673, 20236, 18639, 20368, 24567, 14925, 4743, 889, 3449, 25617, 33589, 36025, 26610, 22051, 19213, 7341, 3830, 5029, 17367, 18401, 15014, 15790, 6656, 12764, 23505, 15601, 15489, 26781, 14448, 4373, 8058, 477, 10126, 24613, 13219, 5710, 13900, 5806, 12783, 11367, 13675, 11930, 6643, 2728, -3128, -2974, -8714, 296, 1075, 15271, 15548, 19070, 13897, 4604, -3711, -6426, -5225, 2037, 16470, 23820, 18327, 22399, 18562, 6247, -4442, 598, 1791, -6875, -5314, 881, 15010, 26410, 24136, 11396, 3384, 16222, 31236, 34266, 31592, 24840, 16903, 18773, 14719, 8221, 735]
8536G35J141J0034J1456j7364L100k957q647O483m481J188J7310n722j0894J150
8522B532J4386J2205m689L338l425j1730L012K1570n183l328j4110r185J486l731
8508C148J2770O640j5469l918J1854L176M582P409m126K194K453p11p590j01N636
8493B7947k2802l410L834J690r348p256j2406k647J5143J0368J1651n572L41R641
8479A7174M530n913M811J003r741k549K227p906L433P60j302L860J0068K363j027
8464B1791Q950l809r646r073r237j0516J630J0060L266j2597P800L359M687J2975
8450A9640P144J2672l938j2205j5974p952P305Q791L674m321O232j007K583L665
8436B6309l435L02k044r320l314L25k166M599J255n9k097j442O6J3949M126j322
$$ y = [735, 1876, 11910, 23366, 6002, 9102, 6145, -2502, 3981, -500, 688, 17998, 12276, 1382, 2532, 16918, 29123, 24434, 27772, 24347, 12617, 15629, 37199, 32016, 28688, 14578, 5393, 6879, 3148, 15918, 22558, 7089, 3171, 15025, 18201, 22783, 30192, 26066, 28260, 30713, 30002, 22412, 22311, 27947, 5145, 1735, 5569, 7259, -2089, -9345, -21751, -24398, -9255, 1113, 12764, 7192, 7533, 17174, 21704, 15791, 20602, 21605, 11864, 9315, 11542, 3636, 7069, 7829, 6527, 10387, 20455, 22818, 21791, 30741, 26932, 17286, 8213, -1024, -11540, -9910, 150, 3416, -9181, -1381, 1978, 6665, 19640, 26784, 39456, 35518, 23313, 7339, -613, 6692, 15483, 19157, 14836, 21068, 20061, 22644, 26309, 22874, 23176, 21132, 11812, 8498, 8823, 6657, 11256, 12511, 12452, 10355, 8913, 8979, 22928, 27054, 25732]
8420B5732j0631O362K108j7808l290L501O227J0845R638k907k220OQ910J061j4586
8405B2948n583j3461r176K083J3613j0118j8180j0935Q536L646R855M609J0201
8392H038N205j839m112K697m573r716q878P676M555L501J0051p741P92N405p240
8377C821J750J040q961J823J6507L101j3961r164N678J0348J5028j527r277J030
8363A7236J8808L080j0276P716j0782o616j2880p135K23n077L922J1224J083q406
8349B120J1743j0287J1362J605J78l180p505p682Q482J3059L450K927q421j430
8335A6421n323k060M413l90j028o130J777L95J304j1113n027O937L120L17M573
8320H186K026k465j3262j3127R610J1738o01R069O849N743o23m615k8465r640
$$ y = [25732, 15101, 21463, 23571, 5763, 2473, 5974, 12201, 23046, 32684, 29777, 27557, 27563, 36473, 37534, 22948, 17365, 3904, -5272, -3189, 10424, 306, -17874, -28809, -20273, -16627, -6772, -2163, 8038, 13243, 11404, 7292, 9989, 5416, -4300, -13178, -5502, -947, 2554, 12605, 4864, 5656, 11061, 3821, 5571, 6611, -2350, -527, 15980, 19081, 5120, -4044, 1634, 11982, 27010, 25483, 16206, 17236, 36044, 39124, 28848, 36564, 25782, 19166, 6286, -849, -626, -5703, -1781, 9443, 10526, 2120, 13863, 3576, 14938, 16543, 16721, 13541, 6036, -1646, 6836, 19895, 23345, 26272, 17851, 16421, 11098, 9038, 13451, 13061, 12033, 5903, 7680, 8075, 9379, -1734, -6761, 176, 3296, 3613, 8186, 10212, 7747, -5515, -18642, -9032, 2706, 2105, 11174, 18023, 23766, 23143, 18528, -9937, -19577]
8306a9577Q605J019P007k34k102m622n639O835L632L659J2265M596j994J1741
8292B5191l129j0943j1012j1512J544J0320J2667N27k700O773j316q361n706j8406
8278a6063j0086m521K0347K059P984J3122l501j894L284N193q740l300k821l131
8264b068j2660n910r400N397k923l743M454O363O96P995N659J3719j978l641o026
8249d066R780j289j4597K436R70n311J0369M289l364j7596n795M968R142M89l26
8234i901Q096p714o084k82n539l325J3890J445R642o356K904P117l266r853O167
8219c059J4258k060q090l841n61l382j2J2981n16l307o107N164N279o398p370
8204g021o045N545P3n89l860K289J2444R724J0989P892o578M008N704p307k3311
$$ y = [-19577, -10972, -9953, -2946, -3180, -5282, -9904, -15543, -8708, -5076, -1417, 10848, 15444, 13450, 25191, 22062, 11119, 107, -11405, -9861, 459, 13126, 13653, 10953, 17726, 16410, 8049, 2343, -16063, -26149, -30670, -10323, -8264, -280, 12842, 9341, 7447, 10731, 15924, 7184, 3884, 1063, -2068, -14728, -20638, -30038, -24641, -27564, -31307, -26853, -20490, -19794, -11799, -6140, 7579, 5601, 1960, -4066, 5714, 4425, -10172, -7736, -6766, -12077, -1708, 2581, -783, -18379, -24174, -19206, -10064, -9575, -9901, -1805, -9519, -15603, -15885, -21424, -24749, -10859, -9414, 228, -6128, -3224, 3893, 627, -9226, -3059, 11199, 9139, 1049, -2792, -3353, -6735, -6747, 6234, 5718, 2411, -3696, 1468, 6747, 349, -7021, -13066, -7521, -7448, -8037, -11897, -9608, 2836, 12560, 23549, 31441, 24863, 28871, 34575, 27268, 3957]
8189C957j610Q055p899k6741j2932K101Q512j388J3674N625k806o487J550K994
8175a3395J1392M710J4481L843o08m825k138m779k015j219M888N405m043N338
8161A7035j0321k5170j3854J0885J2240R827J1936O410K567j1838j081j625R069
8148A6080Q52l075Q595K312q210q012j863n367K419J5340j3035L102M353p14p776
8133E001R526l012Q50j6327j3514l489j758q246O144J8196J544l301l197Q949
8119b634J0327q872j1711j7715J1662K2760J5881j0699j3589k493K265L215p10
8106b313J634k995n000P562l829M635j945m83M508J20r72N996R168j535P138N891
8090B7580j975q077O618o504O069p781j3689K43J1184l871j6010q557M428Q984
$$ y = [3957, 2347, 10402, 2503, -24238, -37170, -35069, -26557, -27945, -14271, -8646, -11452, -17939, -16389, -13395, -2003, 2707, 17188, 21031, 20423, 15598, 13460, 8681, 6666, 5447, 10335, 15740, 11697, 17035, 6714, -18456, -32310, -21425, -9185, 642, 12578, 18988, 21555, 9717, 8636, 7011, 16080, 16932, 13857, 22452, 24764, 16554, 8542, 6679, 1312, 3731, 19071, 6036, 9138, 13491, 12777, 5001, 14527, 11515, 12365, -3962, -17476, -20965, -22723, -30969, -24825, -6629, -5085, -8386, -11583, -2634, 7693, -1179, -12890, -30605, -18943, 3817, 19698, 8999, -4590, -7083, -4818, -1603, -2313, -679, -3674, -8674, -1112, -4941, -306, -2251, -2734, 1774, 1894, 922, 6918, 16086, 14551, 21689, 27580, 25605, 17528, 24146, 17642, 23711, 15930, 2241, 2484, 13668, 9797, -6213, -14770, -10342, -1358]
8076a358K3306M221o179p619q475j0557J3643N419l669j892j8381j4770m080k012
8062c2403M571Q948K680J9062l095o233P215q98m072J038Q791P447K262n453J559
8047A1419o913j0064q268j656l696Q980J8076Q963m609R313n129l437j1267j0637
8033h925r112J0905N283k746k967K91k848N996Q824o053j2911R830J3647j0224
8019a010r395j601o584O448Q432p888j2694R011P933k689r473O54O2J83r795j178
8003b9584Q837O376L331R016Q705p48l151J347j2745J1549J0286m346L319k182
7989A0010J572n560r125p015j96J6243J7854n176j7202p602L633J419J471J300
7975A626J4196K385n381q308O871L896p569j0443M715J307O904l485j0945j1409
$$ y = [-1358, 21948, 26169, 19990, 12371, 3896, -6661, 6982, 12401, 8732, 6840, -11541, -26311, -30391, -32403, -27832, -18884, -16204, 2858, -237, -6470, 745, -153, -4225, -3187, 5604, 13051, 15313, 9860, 11419, 4506, -5558, -13826, -15482, -19178, -10198, 7878, 16841, 12232, 21545, 16416, 12979, 1712, -8925, -18037, -7132, -1849, -4595, -7562, -7271, -10119, -4123, 4701, -1352, -14263, -4433, 9214, -1010, -10405, -12006, -18590, -12142, -3710, -11598, -24292, -15281, -7348, -10037, -19510, -18856, -18794, -18611, -28406, -29584, -20747, -14371, -11040, -2024, 6681, 5933, 2782, 4129, -8616, 2933, 13219, 8873, 12192, 10010, 11582, 6022, -3103, -10118, -10314, 5929, 23783, 18607, 1405, -6197, -2564, -1145, 326, 1626, 15822, 18207, 12826, 4518, 11389, 15285, 7716, -2727, 1988, 3295, 10199, 6714, -4231, -15640]
7961a5640n817K380N772P848n172q015J2680K255L93K507M602j2650j1850L990
7947a6717K9697O529j1846J418j141o299j035r719j3749m995Q057L430N098n076
7933a6348n566P192l688j3445q61l621j299r66R781J5162O461N606q843j4447
7919b4882J7290M799m917j2386K917J294Q408j472O70J032j5386j278P978M872
7905a1061J0438L326n15k975k0447L181M506n893j1163K325Q458r344J0789O613
7891a1762m429j725Q344Q91J891Q285m959O232L888n695O183l672o031k370k519
7876g448j825j3925M524J6340J6479j277j9569k137M071Q871J0644j1547n025
7863a824o227J306k439m319j474j003j3241L12P592K114M582K3176J7328J6121
$$ y = [-15640, -21457, -19077, -13305, -5457, -10629, -18644, -5964, -3709, -3316, -809, 3793, -8857, -20707, -16717, 12980, 19509, 7663, 9081, 7940, 1641, 606, -9113, -22862, -27857, -19800, -16370, -11272, -16348, -21914, -14722, -18410, -31855, -32716, -36337, -37636, -38602, -28821, -13659, -7198, -1592, -10435, -24882, -7592, -2793, -7710, -20096, -17179, -15885, -7477, -8949, -8279, -7247, -22633, -23911, -15933, -11061, -623, 2703, 2188, -787, -21234, -18053, -13547, -19440, -30603, -28278, -19820, -29164, -18375, -11762, -16191, -17916, -9572, -8681, -6790, 1495, -3464, 2768, 6656, 961, 7144, 3472, -2559, -4929, -7448, -9273, -23198, -18674, -2334, 14145, 12868, -6701, -8838, -4767, 4104, 14748, 3201, -1824, -8051, -6745, -9184, -13503, -14977, -15980, -29221, -28909, -21317, -19203, -14621, 8555, 25883, 42004]
7849D2004j4714j3976j0366n351o082o967q230j1520j3738N943J7762J1349r618
7836b3504p494K064M806R496N974L45o000N50J5849J4340k437j0273o418k339
7822e041Q38q985M268J150Q264O707Q0l330Q71j235j301k341q793Q49J106L571
7806c322O343k0038j5159J979J4349P089r833J5603J320O630p4j0153o259O285
7792e240p35L399N437n262k498r93Q860J3332k176n431o880j6376j0137m509N310
7777b3899J4164M422J1670K842j290Q681j068j9735n910K922j6281Q201O501j6386
7763b5166Q83j339j2174n716J375Q598n49J0618L57k060r35p30M312p479N381
7748b4624J1067J1700N100p164n487R412L29o973M575k287Q8j759j406R239o599
$$ y = [42004, 27290, 13314, 2948, -2403, -8485, -15452, -23682, -35202, -48940, -42997, -25235, -13886, -23504, -30998, -28934, -24128, -14632, -8658, -8313, -14313, -13763, 2086, 16426, 13989, 3716, -2702, -5041, -4203, -13188, -8920, -7770, 494, 7201, 7281, 3951, 4822, 3587, 2286, -55, -8848, -7999, -6893, -3322, 3021, -17017, -32176, -30197, -15848, -8759, -18592, -2989, -1669, 4961, 4887, -5266, -11525, -5240, -5975, -2576, 2861, -2401, -4899, -5892, 2968, 16300, 14124, 8693, 1813, -14563, -24700, -29209, -23899, -9735, -5313, 6357, 9199, 7909, 16590, 15522, -4213, -10123, -7201, -23482, -15281, -8780, -25166, -24283, -25622, -37796, -43512, -42137, -33539, -34088, -23470, -23113, -25173, -26108, -26838, -22526, -30005, -24624, -13557, -1857, 3243, -3921, -9408, 4, 333, -6640, -2065, -4352, -4264, -6023, -7429, 1810, -4789]
7733d789k3551P351J5185K2357N491k986n551n990m894o23L490O07o783J024r773
7718i435P108P700n430N589q411k320r629J486N70n130P691Q375J3616j4420l132
7703e772m819j1784m743l252J273R538J4285Q518k563J2503m5k4734j9645p528
7689c8768K4177K5588p072r27j496j0316o36K316j9849j1861j2086K714N295N825
7675c7096N850J6256j73J1836J0617q387r033p330j141J0663P083O207K740j599
7661F493q226l932j3719r734R617K430j3895J3789R880L616Q455J4358J7802k956
$$ y = [-4789, -28340, -20989, -5804, 16553, 22044, 19058, 13507, 7517, 2623, 2000, 5490, 6097, -686, 338, -9435, -2327, 5373, -57, 5532, -2879, -5199, -14828, -13342, -12772, -17902, -10211, -1836, 11780, -2640, -5772, -10591, -22375, -27118, -30370, -29097, -19559, -5274, 3244, 681, 13184, 13139, -11595, -31240, -38768, -14591, 10997, 3925, 2998, 1502, -8814, -9450, -7134, -26983, -38844, -50930, -48216, -42921, -37096, -31246, -14990, -15163, -3327, 7290, -1097, -10130, -17460, -18601, -7938, -855, 5352, 8092, 6493, -1733, -5665, -19384, -29118, -19501, -17071, -30966, -17177, -7297, -3681, 4774, 19132, 36934, 33978]
$$ [...]
##END NTUPLES=NMR SPECTRUM
##END=
