##TITLE=Analysis number 321359
Compound Code sb 02107
Project Code adrs
Chemist Name perepichka
##JCAMPDX= 6.0         $$ Bruker NMR JCAMP-DX V2.0
##DATA TYPE= NMR SPECTRUM
##DATA CLASS= NTUPLES
##ORIGIN= Bruker BioSpin GmbH
##OWNER= nmr
$$ XWIN-NMR		Version 3.5
$$ Mon Aug  7 12:33:47 2006 GMT Daylight Time (UT+1h)  MAYBRIDGE\nmr@NMR_250MHZ
##.OBSERVE FREQUENCY= 250.131544655141
##.OBSERVE NUCLEUS= ^1H
##.ACQUISITION MODE= SIMULTANEOUS (DQD)
##.ACQUISITION SCHEME= undefined
##.AVERAGES= 16
##.DIGITISER RES= 18
##SPECTROMETER/DATA SYSTEM= dpx250
##.PULSE SEQUENCE= zg30
##.SOLVENT NAME= DMSO
##.SHIFT REFERENCE= (INTERNAL, DMSO, 0, 16.522)
##AUDIT TRAIL= $$ (NUMBER, WHEN, WHO, WHERE, WHAT)
$$ ##TITLE= Audit trail, XWIN-NMR		Version 3.5
$$ ##JCAMPDX= 5.01
$$ ##ORIGIN= Bruker BioSpin GmbH
$$ ##OWNER= nmr
$$ C:\u/data/dgb/nmr/ADRS/360/pdata/1/auditp.txt
$$ ##AUDIT TRAIL=  $$ (NUMBER, WHEN, WHO, WHERE, WHAT)
(   1,<2006-08-07 12:33:26.35 +100>,<MAYBRIDGE\nmr>,<NMR_250MHZ>,
      <created by zg, POWCHK disabled, PULCHK disabled
       configuration hash MD5:
       E2 DF 36 D8 04 B2 41 60 5A D7 A3 38 5A 4B D0 FE
       data hash MD5: 64K
       A5 08 53 B6 84 62 5F EF 1A 46 EC 74 67 19 B6 46>)
(   2,<2006-08-07 12:33:40.26 +100>,<MAYBRIDGE\nmr>,<NMR_250MHZ>,
      <Start of raw data processing
       ef LB = 0.3 FT_mod = 6 PKNL = 1 SI = 32K 
       data hash MD5: 32K
       92 3E 34 E3 35 3A F9 24 11 8C 7F FE 6E B4 F1 92>)
(   3,<2006-08-07 12:33:42.09 +100>,<MAYBRIDGE\nmr>,<NMR_250MHZ>,
      <apk 
       data hash MD5: 32K
       8A E8 A5 76 B2 5F 85 40 6C 22 3C 51 14 26 EF 32>)
(   4,<2006-08-07 12:33:42.90 +100>,<MAYBRIDGE\nmr>,<NMR_250MHZ>,
      <abs ABSG = 5 
       data hash MD5: 32K
       06 86 E6 F0 14 9C F0 F3 BE 7B D1 D1 8D 1A D6 C5>)
$$ ##END=
$$ 
$$ hash MD5
$$ 14 D2 59 75 AA D9 88 E0 68 8E FF 28 EF 5D A3 AB
##$RELAX= 
##$RELAX= 
##$RELAX= 
##$RELAX= 
##$RELAX= 
##$RELAX= 
##$RELAX= 
$$ Bruker specific parameters
$$ --------------------------
##$DU= <C:\u>
##$EXPNO= 360
##$NAME= <ADRS>
##$PROCNO= 1
##$TYPE= <nmr>
##$USER= <dgb>
##$AMP= (0..31)
100 100 100 100 100 100 100 100 100 100 100 100 100 100 100 100 100 100 
100 100 100 100 100 100 100 100 100 100 100 100 100 100 
##$AQSEQ= 0
##$AQ_mod= 3
##$AUNM= <au_zg>
##$AUTOPOS= <24 >
##$BF1= 250.13
##$BF2= 250.13
##$BF3= 250.13
##$BF4= 250.13
##$BF5= 500.13
##$BF6= 500.13
##$BF7= 500.13
##$BF8= 500.13
##$BYTORDA= 1
##$CFDGTYP= 0
##$CFRGTYP= 5
##$CHEMSTR= <none>
##$CNST= (0..31)
1 1 145 1 1 1 1 1 1 1 1 1 1 1 1 1 1 1 1 1 1 1 1 1 1 1 1 1 1 1 1 1 
##$CPDPRG= <>
##$CPDPRG1= <>
##$CPDPRG2= <>
##$CPDPRG3= <>
##$CPDPRG4= <mlev>
##$CPDPRG5= <mlev>
##$CPDPRG6= <mlev>
##$CPDPRG7= <mlev>
##$CPDPRG8= <mlev>
##$CPDPRGB= <>
##$CPDPRGT= <>
##$D= (0..31)
0 1 0 0 0 0 0 0 0 0.06 0 0 0 0 0 0 0.0002 0 0 0 0 0 0 0 0 0 0 0 0 0 0 
0 
##$DATE= 1154950405
##$DBL= (0..7)
120 120 120 120 120 120 120 120 
##$DBP= (0..7)
150 150 150 150 150 150 150 150 
##$DBP07= 0
##$DBPNAM0= <>
##$DBPNAM1= <>
##$DBPNAM2= <>
$$ [...]
##$SUBNAM7= <"">
##$SUBNAM8= <"">
##$SUBNAM9= <"">
##$SW= 20.6930455092707
##$SWIBOX= (0..15)
0 0 3 0 0 0 0 0 0 0 0 0 0 0 0 0 
##$SW_h= 5175.983436853
##$TD= 65536
##$TD0= 1
##$TE= 295.16
##$TE2= 300
##$TE3= 300
##$TEG= 300
##$TL= (0..7)
0 120 120 120 120 120 120 120 
##$TP= (0..7)
150 150 150 150 150 150 150 150 
##$TP07= 0
##$TPNAME0= <>
##$TPNAME1= <>
##$TPNAME2= <>
##$TPNAME3= <>
##$TPNAME4= <>
##$TPNAME5= <>
##$TPNAME6= <>
##$TPNAME7= <>
##$TPOAL= (0..7)
0.5 0.5 0.5 0.5 0.5 0.5 0.5 0.5 
##$TPOFFS= (0..7)
0 0 0 0 0 0 0 0 
##$TUNHIN= 0
##$TUNHOUT= 0
##$TUNXOUT= 0
##$USERA1= <user>
##$USERA2= <user>
##$USERA3= <user>
##$USERA4= <user>
##$USERA5= <user>
##$V9= 5
##$VALIST= <valist>
##$VCLIST= <CCCCCCCCCCCCCCC>
##$VD= 0
##$VDLIST= <DDDDDDDDDDDDDDD>
##$VPLIST= <PPPPPPPPPPPPPPP>
##$VTLIST= <TTTTTTTTTTTTTTT>
##$WBST= 1024
##$WBSW= 4
##$XGAIN= (0..3)
0 0 0 0 
##$XL= 0
##$YL= 0
##$YMAX_a= 278227
##$YMIN_a= -391403
##$ZGOPTNS= <>
##$ZL1= 120
##$ZL2= 120
##$ZL3= 120
##$ZL4= 120
##$ABSF1= 16.522
##$ABSF2= -4.171173
##$ABSG= 5
##$ABSL= 3
##$ALPHA= 0
##$AQORDER= 0
##$ASSFAC= 0
##$ASSFACI= 0
##$ASSFACX= 0
##$ASSWID= 0
##$AUNMP= <proc_1d>
##$AZFE= 0.1
##$AZFW= 0.1
##$BCFW= 0
##$BC_mod= 0
##$BYTORDP= 0
##$COROFFS= 0
##$CY= 12.5
##$DATMOD= 1
##$DC= 0
##$DFILT= <>
##$DTYPP= 0
##$F1P= 14.0000005364418
##$F2P= -0.99999901652339
##$FCOR= 0.5
##$FTSIZE= 32768
##$FT_mod= 6
##$GAMMA= 0
##$GB= 0
##$INTBC= 1
##$INTSCL= 1
##$ISEN= 128
##$LB= 0.3
##$LEV0= 0
##$LPBIN= 0
##$MAXI= 10000
##$MC2= 0
##$MEAN= 0
##$ME_mod= 0
##$MI= 0
##$NCOEF= 0
##$NC_proc= -5
##$NLEV= 6
##$NOISF1= 0
##$NOISF2= 0
##$NSP= 0
##$NTH_PI= 0
##$NZP= 0
##$OFFSET= 16.522
##$PC= 1
##$PHC0= 141.6931
##$PHC1= 11.13455
##$PH_mod= 1
##$PKNL= yes
##$PPARMOD= 0
##$PSCAL= 4
##$PSIGN= 0
##$REVERSE= no
##$SF= 250.13
##$SI= 32768
##$SIGF1= 0
##$SIGF2= 0
##$SINO= 400
##$SIOLD= 32768
##$SREGLST= <1H.DMSO>
##$SSB= 0
##$STSI= 32768
##$STSR= 0
##$SW_p= 5175.98343685301
##$SYMM= 0
##$S_DEV= 0
##$TDeff= 65536
##$TDoff= 0
##$TI= <Analysis number 999999
Compound Code 99
Book Reference 9
Project Code 9>
##$TILT= no
##$TM1= 0
##$TM2= 0
##$TOPLEV= 0
##$USERP1= <user>
##$USERP2= <user>
##$USERP3= <user>
##$USERP4= <user>
##$USERP5= <user>
##$WDW= 1
##$XDIM= 32768
##$YMAX_p= 437686549
##$YMIN_p= -876074
$$ End of Bruker specific parameters
$$ ---------------------------------
##NTUPLES= NMR SPECTRUM
##VAR_NAME=  FREQUENCY,     SPECTRUM/REAL,   SPECTRUM/IMAG
##SYMBOL=    X,             R,               I
##VAR_TYPE=  INDEPENDENT,   DEPENDENT,       DEPENDENT
##VAR_FORM=  AFFN,          ASDF,            ASDF
##VAR_DIM=   32768,         32768,           32768
##UNITS=     HZ,            ARBITRARY UNITS, ARBITRARY UNITS
##FACTOR=    0.157963299565203, 1,           1
##FIRST=     4132.6476996994, 0,             0
##LAST=      -1043.33573715361, 0,           0
##MIN=       -1043.33573715361, -876074,     0
##MAX=       4132.6476996994, 437686549,     0
$$ Real data points
##PAGE= N=1
##DATA TABLE= (X++(R..R)), XYDATA
$$ [...]
31448 281995 287243 140761 134990 302678 382287 319672 285521 99994 -37595 -299262 -410855
31437 -410855 -483392 -432685 -515252 -306380 -166041 -181562 -193885 -272635 -391058 -376384 -239544
31426 -239544 -145014 -5383 -38549 92473 259261 248297 145127 165807 62628 251675
31416 251675 240268 140276 98013 -66320 -90967 -148271 -87326 -120234 -234485 -130428 -272998
31405 -272998 -48410 35263 -151832 -362166 -538677 -420032 -316417 -198473 -370654 -390602
31395 -390602 -242048 -46047 243333 292651 263544 204400 61813 191575 107196 85050
31385 85050 74287 199502 312015 358300 344640 256953 109175 223546 123013 268697
31375 268697 120560 65313 146058 124215 330128 170693 184 67780 -24338 -141087
31365 -141087 -33798 76653 -86536 -433639 -264360 -218094 -308567 -181039 28070 57030
31355 57030 206462 370118 137042 -57493 -72161 -226926 -195562 -62690 -184845 -88643
31345 -88643 -222183 -154949 271189 499606 337768 407035 341218 -8185 -23942 4333 -156749
31334 -156749 -244445 -145264 -177038 32446 224171 117363 -216054 -148579 -204236 -113703 -80251
31323 -80251 -171821 -170245 -366049 -313218 -133467 -158938 97037 250512 7211 -81821 -110242
31312 -110242 68879 235929 203960 -116956 -131919 -68336 81780 -59721 -191024 -319995
31302 -319995 -95037 38833 11020 -267399 -269623 -179539 -42852 54576 334892 710190
31292 710190 569225 338626 153022 -24803 -107403 -62851 -76363 34379 5559 37970
31282 37970 39086 185918 238713 185593 187914 49969 90489 -55702 -309491 -335218 -280813
31271 -280813 -165195 -172747 -199221 -221770 -2965 28560 -148539 28332 68013 156597 263724
31260 263724 210820 122583 120141 222360 155058 38517 -97888 -170083 -185426 -261929 -310446
31249 -310446 -289891 -282359 -422995 -554920 -433964 -344629 -172127 6742 -43630 -151254
31239 -151254 -136181 -292983 -195697 -210870 -125883 -258340 -419831 -231732 -96163 -394834
31229 -394834 -337978 -261037 -373511 -388949 -271891 -447910 -440169 -353780 -266420 -215352 -178557
31218 -178557 -81485 151899 346851 207548 5980 7058 -84741 -188139 -225246 2146
31208 2146 31000 -55509 -61142 -77333 -184486 -357920 -114096 -93088 -235183 -206280 -347470
31197 -347470 -235309 -175868 -137572 -167794 -195538 -267250 -327758 -153924 132011 224413 257697
31186 257697 253305 186382 142433 179752 211488 72349 69667 -78381 -153622 -114042 -91769
31175 -91769 -3857 -65805 -324351 -347318 -370735 -322051 36745 99994 -37444 37843 156927
31164 156927 156551 283674 301558 213329 1000 -143976 15728 165355 -67600 15643 -82783
31153 -82783 -319455 -150840 83720 59582 -49617 -19117 -100465 -164151 -220925 -312574 -370048
31142 -370048 -299447 -131576 -56030 132132 208178 -69118 -64060 -161022 -253058 -280132 -303455
31131 -303455 -191844 -228622 -102006 -7231 -143988 -127116 127734 105671 -68309 -116838
31121 -116838 151739 343213 293147 393932 612087 323225 124201 111061 -9980 -49340
31111 -49340 -162868 -92523 41466 -35018 -45602 189701 240343 -44171 -221068 -242325 -76544
31100 -76544 -194018 -344341 -218132 -2013 142493 180139 308400 178222 43312 63455
31090 63455 111458 -85689 -202101 -312093 -391388 -469924 -330638 38904 353729 247521
31080 247521 -127904 -252442 -72812 70230 140772 -23963 -182860 -359441 -435240 -337916
31070 -337916 -173131 -41137 43174 -32807 -135128 -53368 16254 212835 340216 354882
31060 354882 147864 -44633 -172475 -69737 230388 119842 -16126 -92162 -270596 -332300
31050 -332300 -110884 -152146 -127404 -21767 39931 149034 -46403 -106341 -259699 -298010
31040 -298010 7166 55588 22709 -85897 -47382 78644 164605 290567 363309 70752
31030 70752 -39370 107131 178590 167431 202601 175731 236893 111550 -109231 -10756 103001
31019 103001 130008 -90781 7986 321997 387271 320721 245523 200336 100516 -89848 -48593
31008 -48593 -154301 -363523 -314529 -190000 -89525 -53506 6905 215015 204982 209908 268441
30997 268441 450635 367532 60088 -17974 39085 -68620 -269027 -244939 -153301 -9777
30987 -9777 -88955 -315742 -371368 -387004 -326099 -80245 -16601 -199852 -182780 -55192 10047
30976 10047 -147260 -54212 252337 56849 -93824 -87105 60737 9891 -85143 -228779 -423920
30965 -423920 -319961 -270628 -281060 -270931 -59827 -9182 -85576 27252 173206 34926
30955 34926 239186 178581 77601 -55936 -62097 6986 182658 212615 227213 61477 -16231
30944 -16231 91195 198003 257174 -18904 -210168 -208654 -152278 -111915 -10709 122878 79997
30933 79997 -105448 -98146 -4034 -87266 -307784 -251765 6537 249231 195151 -81436 -311849
30922 -311849 -286522 -85102 132678 78210 30848 213571 399541 529415 319685 23481
30912 23481 -8427 -218150 -103522 -255480 -308409 -483761 -735530 -576360 -316056 -255891
30902 -255891 -124359 -47673 -49647 -84502 -130541 -238570 -116708 -107966 -220692 -281373 -247651
30891 -247651 -205924 -195922 -66822 -33741 -170846 -376370 -243256 -50956 -45455 -128208 -366477
30880 -366477 -166428 -180641 -218220 -525 -27857 -64488 -86423 -73776 -206151 -341056 -181811
30869 -181811 -297599 -225584 -371373 -539733 -540828 -532597 -350153 -158887 -140978 -173243 -157031
30858 -157031 -75310 223590 211192 -109118 -155612 -126092 -145205 -123517 -213017 -236588 -89092
30847 -89092 -65026 -196488 -169556 -43558 47981 25384 -227146 -478019 -447015 -134385 96809
30836 96809 160434 69499 31527 24500 -161875 -232176 -223848 -6299 302882 226664 270077
30825 270077 184885 338374 198668 201840 292470 266024 353658 270878 67135 68107 99881
30814 99881 151312 97708 122606 142253 33612 -42168 730 208850 333981 142915 -20329
30803 -20329 -243747 -282245 -380540 -254331 -117731 -265039 -295952 -124857 -85560 -106725 -127072
30792 -127072 61912 143379 262353 96661 -29628 -25429 -189579 -35522 159650 65784
30782 65784 89320 44803 131875 -178165 -106215 178097 301083 70414 -64141 -78889 2396
30771 2396 248226 324052 334129 292427 175255 117660 108844 63575 68653 151797 1035 -53584
30759 -53584 -111345 -57655 -7974 3687 53760 135059 295256 442469 82015 -469353 -344482
30748 -344482 -407727 -429357 -540577 -493571 -375121 -201274 -142805 13513 37530 236290
30738 236290 87704 15925 47833 21163 -132162 -172183 -23042 150095 -18205 -317801
30728 -317801 -319648 -397808 -553500 -547429 -326427 -165550 40710 153531 52660 -323772
30718 -323772 -551414 -309451 -197892 -200168 -64942 -124731 -146369 -408454 -334337 -250021 -235971
30707 -235971 -279256 -288409 -287443 61795 309426 -14065 -178912 -262247 -558641 -393899 17544
30696 17544 138412 37172 -68716 -54708 -58728 80695 -199706 -293118 -69749 -12941 -94246
30685 -94246 -401577 -616184 -357815 -193539 -131903 -46829 184148 420978 395229 63217
30675 63217 -111232 31521 53577 -48511 11485 -41177 -124611 -159780 -116899 216657 44383
30664 44383 -197294 -16513 -112216 -121000 -95803 -358133 -395425 -180474 -120247 -157119 40538
30653 40538 117440 -29579 -93035 30141 175078 143028 36250 15912 134645 146154 440887
30642 440887 570139 255418 58297 7158 -124199 -165300 -203873 -220930 -249169 -340795 -450110
30631 -450110 -339753 -179571 -75762 -45125 -205126 -178216 112796 5434 -132896 -205843
30621 -205843 -154795 -61526 -21465 22608 -93838 -64514 136155 -17196 -3303 -36086 -84736
30610 -84736 4384 60783 139442 11556 28342 45217 35244 147067 335366 240114 28732
30599 28732 46212 214923 256511 106850 43507 -31827 -65906 119079 101304 -231589 -438863
30588 -438863 -616869 -528761 -451923 -368927 -139848 10483 184666 170321 298068 320892
30578 320892 173479 159336 149917 205946 211074 124110 55906 93596 279033 249606 231837
30567 231837 167024 233803 79074 92118 92694 17801 -66090 57173 207295 313143 182239
30556 182239 97088 56063 25808 -16794 -90971 -156085 -33132 171876 216949 86227 -265605
30545 -265605 -255158 -101003 -122282 -78085 -143588 -124022 -101090 -209298 -225930 -162983 104427
30534 104427 293858 232349 114634 105616 -63780 66851 187800 233090 192773 223714 142733
30523 142733 89554 175625 144410 38473 -165150 -291148 -37972 22593 -70189 -116776 -130831
30512 -130831 -8330 216176 177076 -76935 -104482 -227972 -106911 -75282 -22544 -56331
30502 -56331 -66652 -61815 -147950 109724 370505 162278 -57093 -372989 -483394 -266428
30492 -266428 -59182 -15023 147049 236976 215475 186475 294103 299607 106042 -80252 55929
30481 55929 93772 1303 185742 365585 511829 376793 398072 305449 256875 312772 190988
30470 190988 19131 -156063 -144424 -83699 -153169 -421230 -387044 -71915 -142727 -216506 -51207
30459 -51207 215432 452257 319772 99280 -94754 32749 93754 -150262 -183875 -109719
30449 -109719 -245407 -194585 -379726 -372646 -172645 -174865 -34695 39417 -241038 -365080 -45372
30438 -45372 134361 309417 17889 -47907 -179484 -162322 -20991 -248505 -334728 -177485
30428 -177485 -110654 -85480 6008 50567 96816 -13464 -9785 -64786 -25776 147491 168160
30417 168160 -58355 -44643 -91222 16668 147558 220901 130275 85991 143609 37821 149811
30406 149811 223186 473161 503394 315788 -579 -72849 -172370 -247370 -101046 207267
30396 207267 392540 183880 -238364 -231436 37012 38021 -196650 -73716 102041 -32484
30386 -32484 12933 71637 63691 55950 56332 -28251 161153 256513 385068 174217 47733 47596
30374 47596 399219 537201 192518 42536 14189 36626 251587 405607 318627 354901
30364 354901 281399 18656 -58544 -8805 37766 148899 66041 86785 -110534 -316273 -587715
30353 -587715 -496170 -245768 -130176 -218377 -120668 -53408 111781 200229 46321 -88351
30343 -88351 105225 365236 209936 172172 -14459 -137429 -99271 -147935 -192374 -286668 -350627
30332 -350627 -396132 -332213 -265226 -127666 218837 175651 43592 -2425 -73648 -213576 -219834
30321 -219834 -1833 154303 97617 -159640 -201451 158010 324547 355825 122666 -244931
30311 -244931 -227302 -51369 -10438 21740 7758 -64007 -143002 -188903 -197087 -139742 -238240
30300 -238240 -332016 -150169 -28022 -65831 -13686 148680 71018 28660 6118 5477 33274
30289 33274 -35160 -58461 247853 292849 275953 165153 -62210 -9658 119707 124859 92188
30278 92188 76200 149498 -48281 -78740 162023 108407 110051 -8339 -24833 -111235 -13833
30267 -13833 -59466 94261 177914 -67146 -268628 -91531 254096 397053 286904 314938
30257 314938 223203 265082 222117 205423 111772 -40805 53270 75258 77513 76543 213840 223231
30245 223231 66937 19904 46285 -120654 -15580 17435 -103080 -78333 -2582 60257 271835
30234 271835 405652 393844 336507 -167304 -351902 -317139 -195024 23701 89225 137085
30224 137085 158837 170400 -155626 -360472 -264009 -317673 -321623 -165725 25199 124663 187367
30213 187367 -93209 176597 211728 -13773 168043 226910 155947 -69998 90762 336175
30203 336175 383727 237121 12760 16140 185454 55924 26038 -34469 -50258 -4764 -38101
30192 -38101 178642 290265 140981 26480 53762 -69439 -194162 -119569 67912 84354
30182 84354 146914 68406 39259 151461 153650 298396 376520 325008 295998 76260 -1031
30171 -1031 -133615 12949 -148814 -57143 -21767 -40823 -30775 -106385 -130866 -154169 -123403
30160 -123403 57604 184917 245970 40252 44690 61290 230027 270738 199266 -48391 -317923
30149 -317923 -252849 75165 161293 -76923 -117551 -265218 -487085 -401562 -389879 -372459 -334187
30138 -334187 -248092 -9199 -204680 -224414 -211036 -214919 6867 34392 51865 -50417 -287960
30127 -287960 -252160 -245210 -3529 -109815 -206228 28524 153576 189663 182821 92551 63000
30116 63000 -108490 21972 -157821 -258312 -91316 33352 135887 88377 284640 166059
30106 166059 130793 56219 12524 -111899 -117151 -513861 -658588 -671656 -454309 -179463 16141
30095 16141 22636 74531 223174 334980 287650 337598 323546 306789 -97428 -153573 162543
30084 162543 111089 -81744 -55351 -197202 -143962 -119419 -417792 -361873 -139103 -131654 -36728
30073 -36728 71082 102946 -115353 -19731 -73322 -130228 -116747 -252925 -126530 -81415 243109
30062 243109 113374 129240 109313 110989 1314 -201328 -257890 -193984 -234768 -345445 -334537
30051 -334537 -199738 236057 391127 38848 -164664 -35451 9301 -281331 -493443 -405926
30041 -405926 -346458 -449860 -504157 -504092 -529202 -452291 -265565 84887 -91171 -229764 -204639
30030 -204639 -236532 -265286 -184975 -154701 -35104 -182671 -465065 -312548 -154364 -147776 -153149
30019 -153149 -207251 -24167 -184393 -203182 -205873 -84392 -87263 -283928 -264561 15377 103808
30008 103808 -163309 -181367 -101124 22542 128902 95507 183161 186136 77192 169153 149291
29997 149291 182600 198681 236677 275633 186153 226480 242480 153643 365347 471767 -71662
29986 -71662 -206387 -4820 43072 38087 165773 243375 219621 44306 31100 -247213 -148178
29975 -148178 183952 284175 17988 19952 -26453 -167161 -128014 -47155 3296 -91469 -237524
29964 -237524 -323698 -308093 -58341 -92269 -149088 -137460 -109970 -125819 -132699 -257193 -335903
29953 -335903 -170304 21203 35652 -41845 -42772 25616 133680 -74883 -84794 48090 -86903
29942 -86903 -276264 -279410 -69482 -168830 -137542 -176757 -195203 -352062 -560577 -397050 -134145
29931 -134145 1257 121575 281453 103910 86234 156498 141967 152129 57249 -1417 -64095
29920 -64095 -205585 -223520 -198169 -52753 -242648 -420320 -340783 -399093 -440541 -392313 -314163
29909 -314163 15207 184695 28975 -32744 -103887 -79470 27650 -67370 65775 129300
29899 129300 52678 144126 15565 -131722 -335128 -254402 -61681 -81547 -278144 -448115
29889 -448115 -483794 -273871 -48937 57474 164159 220001 217193 248070 129987 -269002
29879 -269002 -303591 -199696 -263295 -139546 -13590 -163341 -152049 130394 144269 -11901
29869 -11901 -150979 -67459 -91765 -107062 -30513 -26452 168051 64505 98804 38624 -13041
29858 -13041 186789 204526 314291 474037 413160 283254 255716 168676 154744 77758 118052
29847 118052 320118 94347 -53685 -85786 -29363 4411 299492 402570 214867 231268
29837 231268 195800 62550 -35386 -257141 -421008 -307037 -222020 -257892 -231787 -123303
29827 -123303 54071 -59376 -158352 -223142 -197646 77580 183837 41513 -230807 -347101
29817 -347101 -253385 -49792 221036 242954 133463 193276 113787 -16683 -121172 -163626
29807 -163626 -349878 -351692 -314624 -352373 -328839 -288199 -369570 -493207 -373724 -254754 -267081
29796 -267081 -382431 -326443 -146849 -115656 53154 19416 52014 9351 -32625 -79468 42389
29785 42389 10180 -323944 -451134 -202844 152665 170250 347593 267091 178477 -155705
29775 -155705 -614621 -459040 -2899 22175 -41253 -188517 -214057 -70374 -16698 -170465
29765 -170465 -108307 -179308 -204521 -203148 -16330 7951 -13658 128452 118450 8978 -354626
29754 -354626 -421314 -279184 -443840 -297749 -79106 8398 -177352 -164473 -70533 232746
29744 232746 490535 381732 100311 -21133 -14532 -51958 -149923 -177476 10471 63994 -33839
29733 -33839 28842 -130222 -424274 -139558 -76387 -115033 -93987 -266806 -251850 -192549 -394296
29722 -394296 -661741 -783540 -534579 -508955 -480623 -234786 -47997 38265 -28646 43946
29712 43946 31743 -48012 -24903 191836 289591 182604 162243 195468 335892 286241 33545
29701 33545 62214 -150315 -338715 -199204 -246666 -67398 101557 114468 28330 -60233 175688
29690 175688 96603 -125650 -144895 -159912 -15812 233945 320893 200782 151669 59896 34581
29679 34581 -67757 -237997 -363125 -36197 157418 212824 50909 -54465 -125178 -69064
29669 -69064 -1310 -72133 106804 257472 311825 184287 171784 252657 249119 132001 204935
29658 204935 262345 414262 407831 323237 198268 185726 43230 -7643 -17985 49498 -113414
29647 -113414 -336189 -423646 -276821 -245106 -74084 -87618 -171822 -181875 -24406 -57135 -226469
29636 -226469 -243782 -143486 -113093 -73122 -94187 17860 261251 196170 87581 208289
29626 208289 315794 277746 -48980 -17828 119986 161529 133983 73503 -22331 -255029 -40080
29615 -40080 215456 64002 105239 -18919 -69328 54630 104502 119164 86873 142385 335059
29604 335059 452059 97432 -102353 -94015 -92520 -121825 -73358 -79498 12640 206990 80257
29593 80257 143076 43051 -59082 -116952 16191 312960 227815 172279 205251 218333 78541
29582 78541 6869 54864 -131171 -137115 83724 174030 163069 336878 345752 161816 17962
29571 17962 11428 19017 12768 -94840 -145962 47956 -17151 -234157 79974 113026 -6383
29560 -6383 234307 174709 -91835 -136894 -159536 -64443 -83040 8694 8070 -279294 -323479 -153613
29548 -153613 -53510 96907 -33928 -291636 -360865 -410710 -520825 -317922 -318178 -65348
29538 -65348 346137 206393 81655 -65909 -59386 125657 284427 143770 85268 61610
29528 61610 55421 175792 -5194 -217243 -136311 -180095 -128585 -232361 -398919 -327713 12355
29517 12355 -1134 -101765 -163314 -40927 -101690 -218957 -39606 61680 -128943 -290040
29507 -290040 -268874 -208500 -155793 179849 322497 247374 17629 5293 59518 47153 -84346
29496 -84346 -355024 -595844 -353901 21602 13384 -31824 -20777 19528 50424 87068 289070
29485 289070 405908 458196 508518 545573 541993 121764 -101791 -142322 28054 87588 51449
29474 51449 -29471 -272221 -313847 21504 166662 441517 581372 562590 495935 267303
29464 267303 165909 87804 -2967 115546 193999 65274 26072 129383 230708 323009
29454 323009 229967 36208 -119748 -156152 -89034 -36770 -167763 -177620 47450 31171 -64163
29443 -64163 -151660 -111485 -116588 13575 196660 299587 359576 228842 308360 136307 -144283
29432 -144283 105617 127599 -42003 -238658 -66530 285157 227316 135392 258341 431939
29422 431939 309955 140700 -66068 -245754 -140895 -48382 147498 29880 -123984 -102137
29412 -102137 -258608 -371136 -219992 -113451 -299914 -351298 -388627 -293897 -383685 -428031
29402 -428031 -165471 -178587 -242145 -237522 -360871 -270244 -20280 138430 112466 47614 274392
29391 274392 330457 121474 -82761 -41684 -132962 -197326 -440486 -555422 -432140 -87506
29381 -87506 37356 -15877 -112414 -176416 -273689 -228384 12464 308875 377197 238882 307262
29370 307262 62962 42134 207445 230558 40136 -163559 -273387 -266655 -22726 62402
29360 62402 74170 10938 -50608 -159875 -230868 -125013 -68948 64354 209364 147679 97373
29349 97373 -42797 -228372 -196091 -155395 -163636 -276197 -295055 -217248 -78762 217192 225257
29338 225257 -58582 -15431 14161 -167500 -103688 -133694 -174923 -98727 17753 70892 -7934
29327 -7934 -78835 -91769 1416 185733 139307 17437 -228219 -256786 -23951 115480 48170
29316 48170 99916 92279 212011 27717 -147212 -122842 -185662 -167845 -151240 -264112 -191755
29305 -191755 -336135 18542 130705 -179944 -338653 -188210 -205115 -132058 -40294 80921
29295 80921 314308 464470 463555 212370 111847 185581 320160 322727 199594 64314 187088
29284 187088 275052 176766 -132669 -63652 -19040 99774 95206 119828 83177 239291 208160
29273 208160 72202 -148562 -222320 -415559 -373930 -296140 -285391 -207201 -162286 -16133 133480
29262 133480 326562 431923 163576 310887 382550 251984 46512 126872 177044 210410
29252 210410 103443 274984 308802 98360 -183346 -196192 -153778 -28872 -36569 -330191
29242 -330191 -222426 34775 68579 232497 88268 -38104 -178726 -100453 -173771 -249673
29232 -249673 -177682 -66714 142809 225200 117144 220686 126234 -13531 -123759 -131641
29222 -131641 -5779 -106591 -337519 -266194 -201192 57499 212911 127430 6018 13133
29212 13133 2095 -30322 -144189 -209315 -290140 6087 257701 290957 72544 -182858 -71682
29201 -71682 14168 155422 196722 403510 181455 76067 205016 272121 369209 188893
29191 188893 114415 258477 235437 329687 380737 457989 445889 397006 480001 248536 -99953
29180 -99953 -183750 12290 -45791 -342951 -549254 -593090 -549833 -261132 110381 314801
29170 314801 189964 -187293 -256702 56450 -106618 -325604 -248169 -292891 -378064 -69463
29160 -69463 177199 272084 286820 398407 442686 229630 -19331 -246124 -104639 156423
29150 156423 131813 -126509 -137197 -93101 -190631 -156177 -25803 99169 183025 214470 74010
29139 74010 270638 289437 246427 240641 189949 -67952 -254987 -441626 -442369 -350338 -187869
29128 -187869 -129406 -118402 -56825 317307 310408 95917 41633 -67516 37565 26935 -164836
29117 -164836 3687 108718 172278 54202 17192 -150871 -6519 284487 357959 409231
29107 409231 243739 87124 -117055 29075 -43080 -316500 -324084 -335718 71130 161383
29097 161383 124510 84490 -190465 -180490 -5466 -99960 -363559 -163807 26423 -209856
29087 -209856 -299211 -119403 152436 131877 247099 562765 309755 132137 236406 76575
29077 76575 -315417 -137042 -138328 -130119 -89122 -136502 -261156 -270858 -251729 -43983 47728
29066 47728 -619 66897 110313 214402 136721 136406 324217 406043 394432 201783 182630
29055 182630 144537 326491 -2658 -210925 -179222 -183352 -135344 -41496 -47448 -59584 49310
29044 49310 426297 516451 438971 99754 -426971 -449550 -178455 -74838 -217148 -417253
29034 -417253 -255150 -282842 -223949 51140 160668 -26613 -136713 -232827 -175046 -105405
29024 -105405 -228470 -116568 -329066 -422529 -280451 -163235 95486 315778 348476 110414
29014 110414 15885 -130496 89735 309518 146949 -50779 -87977 -122140 -73782 -148254
29004 -148254 -457890 -462198 -403179 -320650 -68550 141721 240364 2553 -10784 42038 59694
28993 59694 -171346 -235364 -68588 -99166 -7738 -30378 -208220 -312308 -126146 -86723 87223
28982 87223 121337 153487 34388 -140023 -252597 -283811 75363 180233 152074 196120 162188
28971 162188 -1160 -105244 64117 270608 413325 363442 237225 133699 174781 381113
28961 381113 426348 367655 57806 -48266 114656 153034 106239 158874 85237 -17034 -125514
28950 -125514 -366392 -400993 -127723 -3654 184636 335248 482522 529807 441681 338791
28940 338791 -15257 -82132 -142886 -210747 -204266 -186227 -34059 212310 342061 101349 59290
28929 59290 268386 266108 156876 -8748 -193461 -265406 -365187 -250235 -311856 -214769 -20531
28918 -20531 126724 63822 -41433 83607 193300 96927 -68919 -69933 121924 269945
28908 269945 99406 -55224 -96732 -225810 -354936 -226299 -44485 160416 127295 79688
28898 79688 100984 -70171 -58009 -38356 188230 180528 88956 -122136 -327929 -354440 -159503
28887 -159503 -3948 -25245 17299 222044 240404 -80202 -180164 -140972 159246 310810
28877 310810 503886 572406 355151 164227 34867 169795 39809 31236 -132119 -86228
28867 -86228 33334 7585 6452 -8327 -27529 -258000 -261929 6267 -36212 -161023 -56410
28856 -56410 -88432 -186137 -189606 10156 96164 94425 52275 -135973 -243098 -143131 -95386
28845 -95386 -248481 -301469 -308412 -445164 -255637 133587 5353 -165235 20904 85006
28835 85006 -42363 -142622 67987 108255 230054 -23688 -371557 -134082 105983 106463
28825 106463 29349 71399 169368 79246 124246 136797 218793 451727 212407 -65184 80624
28814 80624 337348 191236 108950 259809 300052 70193 -33596 47777 282907 113957
28804 113957 -107295 -288393 -194582 -168994 -304919 -354797 -217481 -240312 -148681 56431
28794 56431 111634 88074 -147523 -35624 296034 131082 195787 525224 459844 199795
28784 199795 163640 224118 3042 57746 31540 -162966 -196085 -207869 107482 306232 325321
28773 325321 63772 -57427 10123 71178 -163319 -69914 89036 92085 -122580 -194067 -8478
28762 -8478 12966 -98359 -14060 1405 10830 -48562 -28939 16719 -90509 35189 80626
28751 80626 29121 -26154 254850 309168 194816 192332 124347 278598 360597 320964 485099
28740 485099 481886 239600 -50438 -12049 50004 89352 201186 210258 186080 -38783 -144430
28729 -144430 -67305 158979 353620 360411 563662 599918 388948 230881 31120 12976
28719 12976 -53051 -344553 -342002 -59775 114431 426725 399318 408286 289555 286282 256931
28708 256931 422560 348131 10743 -205415 -168058 -106458 -227207 77822 196541 231824
28698 231824 376311 535823 293631 -71805 -263083 -286525 78166 272247 446977 206381
28688 206381 -28589 -103357 -230328 -332573 -305881 -261345 29466 186134 239494 224446
28678 224446 -78056 -418162 -298859 -214909 -131032 120231 37397 -140183 -97581 20984
28668 20984 104129 25692 165962 171398 142075 -4967 48647 181991 242744 32060 -10143
28657 -10143 -18986 99886 266527 346301 262582 176843 195667 132311 68822 -32713 -154789
28646 -154789 32154 -98274 -98707 -371713 -482292 -336313 -275536 -315003 -358636 -395938 -399286
28635 -399286 -446848 -334557 -388300 -406559 -142938 252901 109744 -241363 -195365 7209
28625 7209 42319 -130156 -134799 98432 21379 -14906 186623 184641 200948 167398 167132 418789
28613 418789 252259 123686 239204 289277 275486 222639 -40019 -285424 -275830 -152814
28603 -152814 -20731 90746 70081 -25867 46236 102022 140815 279715 386784 355941 206667
28592 206667 41029 377758 173389 -24393 -255457 -143622 11204 81628 230298 288888
28582 288888 3626 7 -115133 -241058 -197934 5472 291725 320645 265804 122008
28572 122008 120250 243896 344653 338726 213267 398793 473206 402785 407837 371778 346908
28561 346908 150869 -50143 -284067 -387248 -297136 -137282 -130855 -300897 -296577 -381585 -285375
28550 -285375 -245292 -134961 73038 204231 165342 -9288 33518 112550 178535 -82265
28540 -82265 -65002 158227 173625 201353 370175 214605 60819 11271 42104 77057 183386
28529 183386 317708 382499 319981 140363 4292 -40887 59396 156951 274053 269114 275728
28518 275728 244509 272461 431145 501519 379068 530017 611125 633198 505007 209158
28508 209158 403635 367515 295958 331619 513605 382356 333053 371103 138309 205706 155662
28497 155662 211120 116339 163780 119271 237749 142626 23447 208948 191119 275025 301621
28486 301621 220645 255483 123544 -135972 -189408 -201090 -115817 -64589 171617 230637 156958
28475 156958 97988 120155 403417 494485 291619 170187 395266 537271 529794 349132
28465 349132 312270 385430 329110 365627 517776 578534 511908 581936 583611 376059 270542
28454 270542 475601 436704 498651 302896 321426 240407 291336 487365 486726 374332 391772
28443 391772 238623 419599 336253 347040 363569 404567 587816 740110 531534 512529
28433 512529 673533 763181 525025 456245 306603 232144 441577 555032 445412 319437
28423 319437 136067 54853 156954 513168 646628 483984 465482 239461 -144427 -252664
28413 -252664 107179 260897 189323 300726 386496 373240 287398 252208 156989 49115 54080
28402 54080 115508 355174 624496 583355 445132 409365 426611 353437 292633 412996 408602
28391 408602 410706 400938 430488 508986 308137 211111 327312 483364 341690 78097 83342
28380 83342 184959 434699 427168 141912 68407 401131 509098 588937 706615 560601
28370 560601 555005 514065 530734 703089 695128 595957 511838 534053 329488 314718 278427
28359 278427 238064 511838 685515 790590 361390 269096 447870 572828 273268 241615
28349 241615 212660 280644 334134 325147 264403 355964 375400 339537 273436 439946 376761
28338 376761 441412 349965 161608 245887 339410 360948 402185 804620 851026 840887 603160
28327 603160 293850 390235 258735 24900 -241128 -408707 -227190 -107175 71434 93868
28317 93868 126704 277683 242015 284524 355092 391203 425770 416928 376133 543308 403251
28306 403251 528901 682418 699485 870929 616210 580751 643276 802246 833795 651165
28296 651165 442984 498022 444511 256530 545101 530121 557414 544405 669655 660990 650629
28285 650629 775973 885252 786183 454776 285078 637140 674933 542259 576141 628126
28275 628126 598616 563500 466841 358131 572678 645129 572584 677270 726413 841299 787923
28264 787923 762536 841978 812628 849891 777884 989317 948842 1034347 892241 913457 911156
28253 911156 816708 700276 582432 756241 925403 793545 782124 1075605 1122972 850602
28243 850602 720857 714223 612132 499659 395702 486745 622788 533086 431019 564457
28233 564457 515081 555251 775175 974119 921865 1080235 763451 654785 832553 754111
28223 754111 530233 361710 536612 642545 688379 861834 673411 493725 514513 802888
28213 802888 980951 1059403 1040703 1003518 918703 726337 717323 793851 760335 799195 733461
28202 733461 845997 857875 675440 374399 382964 535719 598471 973851 1279959 1490242
28192 1490242 1466914 1478873 1381428 1257065 1042517 869280 842632 983057 1183655 1171255
28182 1171255 1122496 1144113 949341 1178268 1252598 1177178 1292497 1519745 1596856 1345198
28172 1345198 1057642 1199996 1250253 1274113 1335686 1378669 1279991 1286493 1214447 1222579 1270281
28161 1270281 1340344 1344701 1460859 1468302 1564131 1469868 1281745 1191496 1386333 1415369 1420058
28150 1420058 1478170 1467510 1348303 1419920 1545501 1366716 1157371 1219562 1306584 1081658
28140 1081658 1049423 1238155 1276472 1339313 1548185 1542326 1505774 1509343 1448474 1432722 1353940
28129 1353940 1251536 1167658 1355472 1539753 1548520 1340070 1155446 1203442 1172961 1403479
28119 1403479 1819682 1877917 1712208 1684993 1640755 1630731 1535462 1512900 1595058 1648564 1805339
28108 1805339 1888364 1980836 1793834 1889884 1938624 1941964 1972935 1909697 1779689 1680612 1702908
28097 1702908 1858815 1744186 1834795 1846243 1962918 1907309 1827436 1816688 1983152 2007903
28087 2007903 2042876 1838073 1981971 1977239 1994498 2054150 2143903 2110135 2053435 2083044 2175006
28076 2175006 2091850 1887769 1987845 1918743 1959563 2132359 2204700 1993570 1931016 2175775
28066 2175775 2227343 2424506 2355399 2329851 2359173 2483738 2358923 2412702 2326413 2278003 2366474
28055 2366474 2462282 2411889 2212854 2334061 2672193 2780702 2538304 2587772 2752101 2569690
28045 2569690 2417399 2216151 2193482 2313292 2503525 2459481 2580141 2741065 2701132 2690257
28035 2690257 2970771 2853212 2884147 3093357 3099360 2887410 2937250 2929849 2871254 2899476 3021116
28024 3021116 2843885 2684387 2598634 3109015 3298585 3126266 3260662 3424268 3267561 3064617
28014 3064617 2983070 3220006 3288545 3416951 3575827 3774638 3784154 3849834 3788200 4008580
28004 4008580 4186453 4327468 4260847 4048971 3855939 3595579 3632855 3951301 4129180 4095269
27994 4095269 4136739 4249334 4415184 4317866 4228218 4394803 4551622 4328218 4308833 4530432
27984 4530432 4642432 4795098 4704920 4651278 4537188 4608835 4793373 5001861 5083217 5138387
27974 5138387 5192460 5059980 5054497 5130963 5166176 5460549 5882484 5864796 5648694 5409041
27964 5409041 5308410 5435387 5603994 5635629 5757824 5957195 6170215 6474428 6599493 6736141
27954 6736141 6780457 6702816 6881262 7008315 6938251 6826562 6612832 6734240 7183903 7348390
27944 7348390 7260903 7505340 7756102 7894618 8032878 8146043 8241667 8294396 8229470 8310846
27934 8310846 8573872 8561084 8622743 8681459 8963343 9231027 9105214 9086839 9236441 9272905
27924 9272905 9362090 9445455 9552915 9823553 10064528 10231654 10279626 10339167 10570793 10917645
27914 10917645 11167721 11517282 11667958 11866733 12056026 12364249 12409104 12620209 12843628
27905 12843628 13257019 13470311 13564824 13551087 13547226 13718718 13982152 14170422 14494716 14688590
27895 14688590 14898649 15049038 15151816 15332110 15755313 15951859 16344179 16850550 16805743
27886 16805743 16944081 16937843 17234896 17685274 18015710 18227434 18327254 18602449 18902559 19164117
27876 19164117 19520302 19933813 20210144 20438011 20660553 20738504 20698035 21119649 21751601 22277224
27866 22277224 22624101 23028033 23509406 23518970 23631915 24021867 24318237 24515205 24750874 25072641
27856 25072641 25475494 25610822 25973509 26020229 26270432 26730124 27009931 27257045 27188336 27104668
27846 27104668 27561422 28170197 28627018 28781099 29008401 29373194 29508407 29704297 29879373
27837 29879373 30053998 30133328 30373278 30394298 30559789 30798193 31174038 31160046 31031262 31081961
27827 31081961 30872831 30805039 30893622 30980185 30940269 30836213 30994107 31102683 30938989 30858332
27817 30858332 30916891 30990168 30880926 30619951 30181480 29924477 29661923 29644043 29298190 29031729
27807 29031729 28803397 28601738 28498903 28351562 28045882 27416528 27186571 27172176 27184627 27110650
27797 27110650 26704866 26458149 26027590 25713726 25280652 25009921 24920176 24663959 24376651
27788 24376651 24043105 23906093 23377067 22829210 22844916 22934586 22681863 22349967 21899847 21478798
27778 21478798 21273351 21115442 20971901 20782827 20511210 20051386 19667780 19480129 19183697
27769 19183697 18903781 18628278 18606673 18352392 18072732 17885568 17546449 17353934 17097506
27760 17097506 16593915 16326569 16045611 15900513 15964289 15798215 15216732 15009673 14907180
27751 14907180 14661453 14585820 14346672 14059790 13868848 13578323 13347625 13224396 13065739
27742 13065739 12790504 12590593 12350668 12330249 12233423 12125459 12051191 11953314 11778144 11626213
27732 11626213 11445681 11054161 11051741 11228010 10884431 10592300 10380123 10302602 10012347 9824924
27722 9824924 9833335 9852584 9817145 9379615 9089112 9152370 9238450 9297000 9268986 8883864 8547273
27711 8547273 8491711 8471766 8327250 8119489 8231921 8111068 7945992 7881345 7575449 7368817
27701 7368817 7308901 7402857 7213890 7103323 7005583 6605148 6387111 6418354 6633241 6585972
27691 6585972 6465748 6339276 6129326 6056646 6010367 6067189 6274376 6426780 6099287 5643960
27681 5643960 5616926 5771839 5968448 5900419 5559945 5110281 5007886 5237368 5052250 5071116
27671 5071116 5024874 4775110 4703068 4836116 4925117 4902160 4859156 4756633 4624982 4525830
27661 4525830 4525599 4626489 4346533 4194675 4175877 4289684 4370317 4338174 4261333 4017366 4136581
27650 4136581 4251569 4122569 4032628 4054524 3961907 3877385 3867929 3710119 3324022 3239109 3308380
27639 3308380 3432302 3553967 3520946 3353093 3444690 3387558 3463472 3286814 3271371 3328345
27629 3328345 3404415 3341334 3389226 3327078 3437412 3365636 3101644 2979653 2729348 2729914 2760536
27618 2760536 2793216 2788001 2617938 2690469 3071626 2857584 2624000 2755436 2669644 2631351
27608 2631351 2658440 2691907 2650959 2648978 2475936 2423326 2515444 2747714 2849440 2754408 2777527
27597 2777527 2646004 2488257 2478217 2570655 2673300 2424927 2209981 2112967 1864834 2016748
27587 2016748 2141759 2279023 2375485 2236639 2056570 2336061 2462197 2268258 2187112 2064062
27577 2064062 2005411 2151693 2098253 2051023 2041499 2070758 1945289 1928425 1961201 2088929 2237739
27566 2237739 2375195 2315837 1967124 1729497 1330162 1202128 1394564 1604630 1480153 1466197
27556 1466197 1572554 1370074 1569566 1613349 1429968 1443820 1503134 1623876 1520633 1555849
27546 1555849 1808984 2012563 1990944 1778497 1632539 1654473 1658292 1675611 1681773 1641504 1647760
27535 1647760 1406522 1180485 1169807 1189405 1135633 1160867 1286107 1331109 1191228 1122111
27525 1122111 1190890 1343541 1622860 1653430 1541322 1256341 1382587 1695061 1738655 1556276
27515 1556276 1403956 1477219 1276285 1162666 1387576 1398643 1488655 1592469 1411125 1356313
27505 1356313 1230704 1277363 1197676 1041971 1100954 1077865 1038827 839427 726463 972278
27495 972278 1123920 1349583 1236790 786193 841732 908694 1000176 1065211 993439 897862 989916
27484 989916 1211760 1260297 1033327 1006023 849012 552220 539827 660198 626774 616406
27474 616406 676997 667502 914289 966766 1100332 1124787 966754 894225 951541 780469 695604
27463 695604 620320 621507 465463 255267 262155 451733 637829 671731 549746 596943 820088
27452 820088 844829 712741 762444 916652 819075 1001378 1099819 1053017 982545 843027 931267
27441 931267 857482 803503 719469 793758 828665 1020299 1098222 888505 742631 995112 862575
27430 862575 699207 623763 649423 943888 867092 640223 646557 791334 940419 925186 878190
27419 878190 801097 681811 485495 596569 835174 1036531 1018359 865556 949720 1035123
27409 1035123 912592 612792 838613 841013 763881 645303 494299 529014 453486 246059
27399 246059 223692 543534 743385 657497 428829 609949 627479 401158 347581 552103
27389 552103 337802 289544 281668 227978 369280 284058 297125 487007 365236 635810 768233
27378 768233 535157 384785 300895 212544 374820 687861 484798 400008 426786 518653
27368 518653 421546 326610 585923 750443 541649 620853 695360 617524 507880 390872
27358 390872 700411 925312 1039941 760062 636155 383627 241340 450667 254145 96756
27348 96756 83397 263597 287246 467632 591397 730311 828341 810444 768167 754617 646687
27337 646687 554735 557600 515173 412100 464519 572669 634453 615933 629463 632055 615248
27326 615248 495991 437614 390453 435311 565329 642965 730406 645889 591558 811357 759913
27315 759913 534318 518608 555007 477690 358045 26095 -142898 116147 499787 505866
27305 505866 364489 239300 77459 114997 68893 218255 345352 395932 359294 429566
27295 429566 276862 66571 -40874 -137032 -76783 -14226 287322 531534 668533 684219
27285 684219 702718 615573 450308 403725 483541 451178 522104 406105 351626 207092 190409
27274 190409 225896 357631 354475 375342 215443 607 -80036 -366679 -417146 -312541 73869
27263 73869 96357 51939 -176416 -302256 -346969 -239671 -68523 187712 417736 486377
27253 486377 350964 298493 393158 358649 271989 205171 127593 -137016 75685 225973 332259
27242 332259 324653 238184 223136 -3344 -332100 -536118 -155211 295630 504724 572761
27232 572761 669802 808691 693390 344115 248229 480413 605835 556528 390463 476979
27222 476979 539054 537842 437709 590313 488829 379975 192808 36794 -64221 -92959
27212 -92959 104701 297068 536057 680643 660884 346770 286992 123123 31559 -161734
27202 -161734 -303364 -39769 99041 84454 182072 330653 287743 217171 99788 46585
27192 46585 87863 113520 99469 115994 -113634 -350540 -221348 -37830 188868 43278
27182 43278 21561 49886 220917 66237 -419 -32532 -7249 205653 129445 117201 237494
27171 237494 191240 130530 36397 -203636 -212599 123098 196348 -20022 21124 177750 131276
27160 131276 -137413 -310626 -124949 106362 215515 301247 379713 609931 321228 98061
27150 98061 230596 158837 238952 291230 250043 237321 538452 602143 500741 199494 -66056
27139 -66056 130514 283136 203402 47667 -1039 14157 -290289 -280592 -18812 37818 120598
27128 120598 168474 123751 112970 156290 327165 385904 165745 109125 86196 -23134 -62874
27117 -62874 -221731 -172384 -254183 -412890 -353143 -37120 264175 275584 188809 145648 230224
27106 230224 266854 364978 480527 614004 650063 550123 367986 341072 225067 148081 216352
27095 216352 350297 152807 214071 303330 258856 224954 -25048 -67069 327330 490066
27085 490066 393756 291718 387250 584815 439771 326575 300937 120512 262326 479064
27075 479064 407971 392788 280121 165333 165057 412061 584579 606529 682919 641530 368731
27064 368731 92900 151289 368383 259140 114795 80491 11516 -183074 -80541 192708
27054 192708 284898 199566 34660 -14539 53966 26889 173986 277153 304231 270090 127666
27043 127666 103325 123108 13704 -157910 -359053 -553901 -511747 -327538 -121027 14188
27033 14188 34384 136690 65950 203405 9547 39330 178079 369254 108563 -75666
27023 -75666 47144 79809 70195 -22024 56527 172760 89064 23853 147306 103669 203050
27012 203050 318789 242988 122769 38185 -11021 -79645 -124550 -182669 -236548 -285105 -263195
27001 -263195 -12620 -87837 -169429 -151601 -121996 -61421 4734 227598 267077 213258 165726
26990 165726 137377 195313 170293 152923 36583 -11428 -23111 -199611 -141618 -165806 -103712
26979 -103712 40002 22202 -69417 -133353 -246860 -98755 33348 -115370 67718 159724
26969 159724 363035 419559 292583 207317 317609 490920 496367 317904 28794 -104717
26959 -104717 -47712 15220 151773 193827 133962 -92724 60273 167287 1992 -36161
26949 -36161 -83447 -57619 -127174 -158234 -265202 -342126 -125695 -176233 -195818 144763 374782
26938 374782 188016 -71793 34745 143069 -206006 -310138 -110103 -26672 85520 -82161
26928 -82161 -277091 -119817 11658 75386 -132097 -263360 -202049 -136034 64909 81865
26918 81865 -56791 204955 225302 64000 181687 312368 298526 264818 214417 86148
26908 86148 71970 31297 -32774 -160192 -208609 39977 229755 265264 434944 272678 -107975
26897 -107975 -314439 -338208 -367011 -249983 -179436 178960 378767 353496 283674 65375
26887 65375 -244535 -300689 91917 57692 44424 75857 123277 56200 -182109 -344222 -332577
26876 -332577 -223792 -46104 -73212 -51720 -71201 -43344 7645 -222902 -232041 -122251 -87846
26865 -87846 -175516 -199716 -3826 96337 41019 -348492 -298458 -243378 -124485 8984 165272
26854 165272 468290 346130 -53748 -196554 -66205 -105499 -383818 -103460 65398 180633
26844 180633 219365 321557 387123 385956 317180 466037 464265 308149 79129 -168701 -50868
26833 -50868 70561 2229 90205 210494 231498 232405 279933 191875 225423 292821 333406 323733
26821 323733 -55847 -166702 31564 228219 391811 349642 145676 106202 158124 180640
26811 180640 -56560 -286499 -149196 8223 -130495 35789 12090 -220084 -162982 -190427
26801 -190427 -104651 19017 -105837 -149039 57488 8061 -56960 -239697 -343219 -295292
26791 -295292 -127526 11058 -70615 -121509 -231112 -224840 79451 188368 -27086 -100169
26781 -100169 -162250 -135133 33877 -81260 -88089 -39511 -32299 -51163 -211437 -270125 -301460
26770 -301460 -125190 149503 118790 119725 119745 -13653 -131674 -228070 -295927 -404134 -236981
26759 -236981 -237788 26908 189668 -45324 -112651 14006 173052 153619 69586 147510 70743
26748 70743 -22561 27513 111888 124183 85276 -15369 -13031 162446 173553 337638 407165
26737 407165 407087 280875 35512 -290657 -432537 -231969 137090 399774 150862 -47811
26727 -47811 128790 166420 -3768 43960 324832 432042 429500 351856 147460 200858 235092
26716 235092 35724 -176875 -252597 -180107 -68722 50331 97645 116427 42299 93789 240011
26705 240011 193359 28890 -235906 -259528 -209568 -127470 -197937 -143112 58892 -53496 -208259
26694 -208259 -351975 -417115 -237297 -222370 -188533 -75348 11103 129328 133807 139673 -51854
26683 -51854 -243209 -190791 85102 -1626 -93315 -59861 -50665 -122514 -146281 -109397 -33690
26672 -33690 -126800 -179772 -117466 -163766 -166519 -4445 174843 384233 373210 404902 484685
26661 484685 421279 461959 440453 373929 -67375 -114509 -162724 -181707 -19364 299213 445311
26650 445311 398878 302499 292790 292556 58569 -50698 79722 123946 -50352 32572 187428
26639 187428 358579 189385 154936 280168 279609 260 -130281 -63087 64838 171641
26629 171641 -2635 -272749 -409908 -355506 -60244 118588 165808 290083 351100 205695
26619 205695 109790 -129514 -358291 -670493 -671779 -530716 -401423 -357616 -145255 -204048
26609 -204048 -342123 -343199 -375336 -153728 18748 -134309 -174526 -217104 -109160 11936
26599 11936 127596 233272 161382 25047 52166 170182 257103 141700 -97925 1241
26589 1241 276428 314184 219509 246142 459189 316889 172619 -7797 109060 159073 123317
26578 123317 75161 66323 152532 3308 115927 134390 -32182 -203262 30946 229094
26568 229094 132747 71076 -43595 -55153 264489 305736 297081 112847 -86985 -181125 -36437
26557 -36437 67854 147327 57525 176303 13138 -275119 -232826 -184934 -74117 52987
26547 52987 -121943 -217838 -95506 -119512 -235375 -103985 48198 -9090 -162083 -170886 -163423
26536 -163423 41080 199538 184005 -77335 -306792 -204180 19863 -91598 -35966 139979
26526 139979 81513 -212613 -276038 -228030 -150382 -243615 -362639 -97197 -65793 -100935 82964
26515 82964 119181 97736 -6166 -69591 -296104 -209140 131889 291036 142703 155416 -19537
26504 -19537 -312377 -460197 -404195 -250333 -142041 -112400 -85028 -255143 -115300 54024
26494 54024 207036 -78251 -295403 -215414 -216717 -368452 -513884 -421869 -278290 -112947
26484 -112947 -89444 -7142 -14317 -25976 97541 81050 -61025 -30804 12085 96349 245979
26473 245979 87384 -63290 -67344 67474 422426 341941 428352 730229 840005 566132
26463 566132 416773 88050 -125434 -117419 256191 505695 406983 251872 -17110 -35501
26453 -35501 -14411 186276 358077 445604 704099 263885 54570 112788 190240 150128 8815
26442 8815 131416 -42351 -224110 -224662 -134086 6587 -25725 -281268 -379349 -193255 -23155
26431 -23155 163857 91567 106547 -151111 -134411 -66327 134098 319475 411287 506913 314155
26420 314155 109690 -28804 -106105 -200552 -211427 35360 91963 109397 122255 -192960 -256734
26409 -256734 -147366 -63088 -103148 -137088 -305468 -126308 109710 143533 307704 98332
26399 98332 -286001 -267173 -192066 -48562 -98035 -72285 -180588 -93041 -62371 -211360 -153238
26388 -153238 87113 19068 -304014 -246310 -180609 -166132 -136395 -167258 -10444 57872 139667
26377 139667 89728 -285468 -360202 -288597 -422145 -416595 -329791 -190673 -256125 -169225 -36350
26366 -36350 -29343 -121477 -132744 -10273 91930 195700 371048 376944 265994 76662 -107535
26355 -107535 -22487 -66878 -35578 44896 167990 76014 32347 115173 140471 219606 303482
26344 303482 19892 -193144 -218619 -418536 -329410 -53675 121306 215845 82501 107831
26334 107831 65836 134036 109180 141752 224944 268703 57438 -13107 -121781 53818 10713
26323 10713 -160143 -95236 -10579 -256899 -167187 105997 151505 289709 224626 96834 63582
26312 63582 -13363 -107920 -149708 -223186 -257475 -273322 -118942 107305 272680 385408 544933
26301 544933 411837 165165 218588 352350 284630 244425 10108 -24729 14757 -109443
26291 -109443 -508025 -434364 -392954 -259449 -295638 -100507 34023 143898 156347 -67513
26281 -67513 13786 274223 360765 408506 249547 104837 233757 207437 85583 304787
26271 304787 298635 117152 4964 197170 93598 -50918 122472 139151 77839 17988
26261 17988 -13322 -49829 -110539 -10062 195639 225967 255661 106838 -110397 -77440 100259
26250 100259 3141 -12954 132112 10863 -185110 94281 42787 -136651 -117897 168878
26240 168878 313998 -10073 -84020 131830 91163 -82744 -32910 109401 4857 30636
26230 30636 213724 132497 13948 -74000 -101073 -134800 33562 16492 108462 -3971 -62107
26219 -62107 -334062 -404667 18778 238432 274341 35699 6109 91659 300193 178941
26209 178941 192126 289117 493800 393047 298146 328620 382837 161397 -29112 -183216
26199 -183216 -294255 -339295 -485474 -526766 -426557 -260913 -10750 88541 -2465 -29558
26189 -29558 101404 310191 152336 -47503 -148217 -307151 -249013 -104063 2562 80846
26179 80846 232243 287912 252495 213532 112826 96406 30695 -165512 -78115 -166820 -181229
26168 -181229 -93115 -42621 -211929 -303989 -26501 260777 175402 13815 -45911 -12565 -196630
26157 -196630 18510 235675 159255 322259 321576 68804 -71485 -71821 101035 152553 -95331
26146 -95331 -117213 158076 167037 106410 341815 395165 174033 127847 -78182 -164985 -289330
26135 -289330 -231124 36097 94831 226069 215839 194555 244104 142794 11879 74724 375470
26124 375470 226835 216412 313521 139664 -22850 10032 5760 14090 -87538 -239755 -499321
26113 -499321 -368817 37969 252409 109077 -40479 -142845 -30112 217985 504885 576222
26103 576222 509887 351432 294784 336008 385565 306301 306193 373373 334245 323432 307230 211196
26091 211196 278563 310652 383383 259784 208890 406806 324120 459755 447744 311767 257746
26080 257746 367347 341383 333161 325070 475257 381852 291228 140293 123145 216884 283188
26069 283188 500394 854893 821075 621885 482654 387748 538350 564126 396181 321002
26059 321002 194059 340879 571725 560285 689461 627294 333454 290158 160562 218664
26049 218664 332452 60851 179308 488059 417807 210878 153828 -45921 -14546 280161
26039 280161 131755 -80832 -60835 42695 74279 136433 31445 -197898 -288819 10633
26029 10633 225698 48881 -193179 -121269 -180259 -121226 -87301 -118877 70013 373673 363480
26018 363480 241309 231123 389896 430401 651782 521130 395789 361317 234980 213113
26008 213113 153876 147081 42368 -92375 58777 -35905 -31081 -30896 59656 136888 77007 1171
25996 1171 113257 248558 359955 354616 432814 493731 356121 103650 193421 578212 561686
25985 561686 513908 520256 634790 617072 471723 670039 894870 693873 153909 65484
25975 65484 186145 180246 238302 271448 304800 383316 337400 162459 196269 271778 328187
25964 328187 253757 113966 225975 391339 350895 535449 384460 158338 -8 -19887
25954 -19887 -45346 10336 178601 314295 349747 423156 254897 139135 422629 332115 309793
25943 309793 258919 221855 278787 250490 382177 679210 842236 955153 969234 909451 899184
25932 899184 938884 1031234 1071796 1099593 1099353 1038507 1044198 1123537 1341773 1451721 882798
25921 882798 773917 957032 1070520 1180023 1110934 783843 309257 234530 279222 323033
25911 323033 436654 580517 721925 906768 948219 1074746 1172153 939352 733494 919178
25901 919178 1005028 961302 685748 735324 1019474 1129266 1170456 1123579 964522 605219
25891 605219 527389 773959 808438 771598 828385 829937 711522 728615 791160 815888 711593
25880 711593 691116 557361 472095 755305 832910 855188 879005 788213 644567 728982 1040406
25869 1040406 1162886 963070 696896 705884 772788 756041 972627 866616 395727 579065
25859 579065 855385 754353 887105 872625 931665 752946 795323 837966 709293 528643
25849 528643 484840 661565 484422 546689 643774 779208 883791 953471 1003956 1180119
25839 1180119 1197056 1227176 1297495 1256734 1160564 1074377 882558 809063 958527 924218 724216
25828 724216 782224 915259 826927 783679 768324 757564 784784 933978 1070623 944399 840684
25817 840684 985995 951380 1047745 1497864 1628883 1498025 1585790 1636389 1486642 1269426
25807 1269426 948243 967211 1161287 1339091 1463159 1218236 1199227 1334642 1448624 1446562
25797 1446562 1478918 1702593 1633459 1172174 1080735 1470255 1693031 1686294 1551180 1543880 1444075
25786 1444075 1413401 1331281 1353078 1448545 1476602 1467246 1587258 1926472 2028180 1849841 1670161
25775 1670161 1522849 1536249 1360083 1243273 1105885 1252101 1301790 1266531 1254698 1548177
25765 1548177 1676431 1833086 1980718 1875246 2037231 2400890 2253950 1894754 1964407 2307264
25755 2307264 2663123 2768256 2519497 2170647 2081841 1969264 2140584 2388313 2382478 2390852
25745 2390852 2220695 2325966 2302343 2410095 2678133 2657192 2514682 2521823 2567770 2828010
25735 2828010 2899514 2942096 2989630 2954105 2781780 2715089 2880965 3105860 3393252 3561753
25725 3561753 3356537 3323088 3604159 3606392 3794872 3783582 3708878 3534945 3510532 3705866
25715 3705866 3754657 3937312 4160362 4132759 4015778 3938666 3969264 4158304 4154920 4102861 4228361
25704 4228361 4339731 4511433 4722219 4753559 4870943 5063886 5271148 5438433 5418533 5486899
25694 5486899 5701074 5597734 5619880 5690895 5980394 6196923 6375941 6394512 6427152 6465894
25684 6465894 6472625 6687642 6708039 6736589 6929773 7264833 7243288 7153366 7389979 7689837
25674 7689837 8021432 8224648 8367861 8485290 8609734 9037123 9502891 9601359 9899538 10299335
25664 10299335 10505380 10620390 10991246 11131101 11328479 11950030 12584017 13191586 13508456
25655 13508456 13667678 14010782 14548723 15032311 15427641 16004049 16609476 17182222 17658210
25646 17658210 18105070 18607005 19348836 20077268 21016196 22010884 22824316 23631909 24632171
25637 24632171 25573962 26509191 27543285 28755439 30025853 31278912 32339396 33434458
25629 33434458 34718500 36053551 37144608 38436207 40244331 41964751 43414342 44964575
25621 44964575 46465070 48178981 49555410 50722532 52074335 53367560 54735887 55991193
25613 55991193 57155715 58267208 59478583 60547115 61683379 62645025 63553784 64223924
25605 64223924 64818065 65225706 65623569 65980798 66391746 66510009 66520105 66537165 66517115 66575884
25595 66575884 66264014 65656536 65066207 64794377 64430209 64040205 63321809 62325108 61183569
25586 61183569 60141265 59513498 58670359 57548215 56259034 54725922 53421258 52127011
25578 52127011 50747103 49470504 48037810 46455950 45077347 43860924 42499499 41109165
25570 41109165 40061626 38678930 37247957 35929585 34803542 33740481 32768424 31819171
25562 31819171 30876321 29940516 29140600 28308584 27256252 26220245 25329051 24610209 24012512
25553 24012512 23147549 22261064 21806020 21085146 20288016 19661563 19119179 18646982 18397240
25544 18397240 17880656 17278299 16613137 15995512 15845807 15564676 15036758 14548373 14045536
25535 14045536 13727776 13527718 13268077 13203257 12845968 12328032 11948160 11571767 11041020
25526 11041020 10819902 10912088 10454879 10121996 9911532 9637390 9730383 9499323 9212340 9109687
25516 9109687 8855571 8730439 8501341 8300021 8253692 8160036 7860364 7685557 7578792 7257677
25506 7257677 7179331 7030016 6778505 6558367 6306217 6283358 6071218 5944875 5788446 5651862
25496 5651862 5706286 5557850 5561990 5455513 5175522 5121708 5038672 4772918 4490164 4313368
25486 4313368 4264315 4384170 4262159 3963371 3853700 4028352 3815268 3668293 3791146 3659003
25476 3659003 3683493 3620125 3508434 3347747 3398619 3239890 3066746 3066744 3245813 3433102 3323768
25465 3323768 3115396 2889681 2706104 2543474 2610223 2593349 2708458 2775979 2893993 3044302
25455 3044302 3064840 2979332 2679959 2407354 2226955 2285474 2436322 2356708 2127040 2118109
25445 2118109 2250420 2514461 2416485 2306442 2337992 2360569 2251177 2051628 2106430 1825852
25435 1825852 1621242 1510827 1743117 1890647 1999013 2055387 2078709 1918672 1767956 1686832
25425 1686832 1551862 1457984 1303674 1441879 1747116 1896561 1806404 1822976 1641354 1524017
25415 1524017 1225598 1246145 1265467 1022288 1127852 1216737 1315851 1508108 1584989 1638585
25405 1638585 1422708 1470150 1431983 1238581 1126358 889315 994844 1228723 1529475 1564995
25395 1564995 1388722 1299185 1105052 835760 635919 725315 858793 1398081 1630265 1514877
25385 1514877 1377080 1247150 938486 795428 702236 707615 787278 857663 978693 1011374
25375 1011374 1097698 1323708 1444624 1294430 1238860 1220244 1058440 956231 754140 617237
25365 617237 856073 1160480 1116429 1039068 886071 958609 1190587 1190353 984934 990464 817191
25354 817191 747942 837303 740017 676847 954696 978182 685462 653051 904694 718936 489477
25343 489477 547042 629388 682023 578971 833704 952980 667641 579244 578123 639513 1021045
25332 1021045 1141164 1070766 750262 561686 371906 330894 259507 459948 415795 1944
25322 1944 -115442 258620 304547 334766 419311 439649 331511 357879 268471 327998 449278
25311 449278 633726 799909 522228 259351 349586 671330 709682 406973 366598 389128
25301 389128 495011 322765 260298 9049 125236 404914 558723 501220 181303 90660
25291 90660 253465 255628 330577 310811 417704 335039 255787 201038 171031 233664 197717
25280 197717 160957 210850 421452 366877 381115 520088 548462 430119 464748 489198 375058
25269 375058 478024 566503 734818 617437 467649 372060 373762 221774 120295 -15199
25259 -15199 -94292 186713 424177 343094 337867 285706 131945 33978 -212047 -87364 -103369
25248 -103369 54717 248884 212403 135352 -142597 39594 322536 393691 371040 248371
25238 248371 311064 395016 237566 262053 439303 515821 282788 396040 482189 578609 604064
25227 604064 543968 221859 -64382 -58863 89029 148413 -125484 -49634 248370 306069 360579
25216 360579 91042 -249276 -354742 -155713 248175 340132 370830 315466 114142 54126
25206 54126 311712 263700 270724 133646 -15094 151002 260498 349974 351841 80783 -182254
25195 -182254 -189544 -219139 -214563 -38253 63572 22969 -217 269136 414736 403002 519860
25184 519860 319919 230235 221788 74004 -43917 -207049 -215283 -106532 151819 230735 184166
25173 184166 144344 184994 145137 220307 157718 64420 152174 112299 168487 261423 344639
25162 344639 283953 190302 165459 68637 63375 156646 272808 206464 91813 164635 202840
25151 202840 134038 266171 401232 409130 366365 295623 92229 108017 269929 386279 337395
25140 337395 187771 179585 181203 186207 136441 366721 359468 67336 29621 94665 202021
25129 202021 276013 79522 -63988 -181192 -164472 25165 -119052 -262633 -19634 55570
25119 55570 -54146 132178 236028 378977 290732 115000 87061 -75822 -137386 -234007
25109 -234007 -565477 -459797 -164536 7473 81447 93836 270482 132454 160008 132505
25099 132505 39021 -48602 -133456 -146387 -67205 16916 143181 76112 -30191 -89634 -237568
25088 -237568 -532833 -263281 -66321 123477 313369 419009 419768 342825 168377 23699
25078 23699 -19316 289669 261157 94748 -302694 -425855 -468481 -329595 -111891 -239
25068 -239 -36351 -155213 -257107 118400 134682 -59148 -147326 45493 225201 32043 42260
25057 42260 115400 253965 209798 80793 46434 141206 98987 -103848 -46356 19602 -8442
25046 -8442 -130994 -150072 -128327 -42338 -144456 -160431 27799 -52064 162188 428237 305563
25035 305563 347513 252075 187779 191927 -11861 -199657 -403741 -68039 179046 365964
25025 365964 424124 185697 201107 357927 178946 169635 219668 278837 286275 297372 334215
25014 334215 191633 -76943 -71403 -66041 -120540 -59933 -21330 -59649 -188956 -382022 -499542
25003 -499542 -482632 -466256 -406289 -436462 -266491 79877 74497 -2822 -236329 -85760 -4369
24992 -4369 164285 309443 410680 280505 29110 -232921 -203396 -89619 52300 43436
24982 43436 -146947 -205060 -106728 215649 63982 88466 205659 97400 -54268 -133529
24972 -133529 -68132 -45109 29045 55217 161727 260302 57459 -167986 -217209 -94965 43539
24961 43539 55047 -71094 -41582 -80078 103333 -79834 -384844 -455661 -260184 -17094
24951 -17094 85596 -276481 -392673 -144894 -88396 5457 253821 351648 267286 196529 42450
24940 42450 -34036 19940 86584 188146 189741 -47077 -294502 -234399 -185900 -55870 -27349
24929 -27349 -154294 -50225 -15813 -195229 -316378 -374870 -355339 -90750 -351625 -487971
24919 -487971 -285047 -62146 15310 82093 102855 429785 516246 300102 -50475 -113631
24909 -113631 22784 169598 142920 130099 234053 169923 -69773 -6801 210586 82401
24899 82401 143251 234471 235990 160805 -162554 -67674 79032 28372 53298 205512 174128
24888 174128 99116 -167737 -234541 -135442 46493 -72469 -193661 43023 52171 20550 -56462
24877 -56462 -368005 -350796 -203165 -120152 -85637 47212 133961 -95946 -74611 -221272 -266129
24866 -266129 -36390 34966 6199 -20481 23410 223101 319511 99031 -7428 145871
24856 145871 -49396 -157305 -138899 -178560 -259311 -156440 -60384 -17482 -224380 -468125
24846 -468125 -394909 -123903 -73864 -176549 -82584 -75923 -37113 -75861 -241324 -177240 -189413
24835 -189413 -294283 -382315 -329084 -303139 -194322 -260429 -95883 -129904 -99457 45390 80550
24824 80550 262221 233041 -46919 -290541 -280925 -225231 -46447 29247 85876 183388 73471
24813 73471 190469 95686 -120044 -229616 -431005 -318845 -324487 -95844 -186181 -95884 -185838
24802 -185838 -198512 131502 269173 51397 -72917 78646 -35623 -158467 -88478 10039
24792 10039 -150995 -97055 -100076 -159756 -138310 -272042 -294272 -209361 -44088 -85162 -156041
24781 -156041 42090 338337 256190 46337 -98658 -94947 10816 -4871 201819 228686
24771 228686 6482 -11502 101472 369662 236574 60334 55311 -143355 -346545 -358342
24761 -358342 -269893 -283888 -255189 -70073 58599 196138 292163 111027 252958 337888
24751 337888 309165 143118 -35486 -224907 -164299 -96292 -46770 82076 -30673 -69591
24741 -69591 -148590 -277936 -189519 32920 120174 -69736 -118649 -213558 -312609 -120035 -141137
24730 -141137 -88557 -292779 -379511 -363826 -164780 -164054 -418339 -375024 -305551 -456562 -336899
24719 -336899 -336631 -91834 214176 -19073 -209243 -319797 -384236 -443468 -358655 -218400 -204006
24708 -204006 -266092 -292214 -82076 -829 40917 -11567 89830 -11391 -208815 -267816 -285793
24697 -285793 -169730 -52819 -14910 -71711 -184830 -97331 -64811 1816 -9566 -5458 7728
24686 7728 -77795 -135026 -118218 -381772 -472097 -511491 -447242 -303048 -388164 -254864 -113741
24675 -113741 -99528 -291327 -561186 -327176 -118610 -31419 -88334 2784 -79975 -254851
24665 -254851 -198800 201457 138951 110013 233090 164128 213219 134169 2140 8556 -57445
24654 -57445 -69080 -139751 -158383 -151311 -176289 -269071 -212251 -88234 -168821 -284324 -418657
24643 -418657 -551397 -387161 -177020 23917 172971 102056 -85542 -51932 -63112 -225199
24633 -225199 -178891 -347612 -546541 -360526 -122160 -21911 -16593 51848 181926 242881
24623 242881 62352 -162431 -366726 -478595 -275756 -79477 -26616 185042 53478 -98683
24613 -98683 -115642 -94996 31539 14542 -189666 -183886 -122530 -234510 -346299 -311672 -295394
24602 -295394 -392641 -503368 -302711 40184 -16207 9682 -38353 -6552 -61870 -34804 62670
24591 62670 -1175 -262794 -173150 -37876 131704 247005 57660 -54800 -288887 -211003
24581 -211003 -126515 -164320 -299326 -359736 -248230 -141129 -163404 -72979 -46623 -276109 -385276
24570 -385276 -491858 -406390 -332655 -465511 -491093 -432152 -389898 -343553 -394811 -307399 -189222
24559 -189222 -58408 -217148 -275313 -91252 181232 320633 102422 -143829 -216464 729
24549 729 33927 -222960 72068 232061 190858 195311 63057 137271 -12030 -136455 -134577
24538 -134577 21737 100822 67614 -148640 -272013 -366403 -292271 -156701 -124185 -147013 -337911
24527 -337911 -460036 -357179 -335722 -418503 -420493 -416238 -308434 -110990 -122931 -208186 -43350
24516 -43350 97338 6902 609 135738 254519 354499 288829 38763 15268 -9754 -156181
24505 -156181 -131770 -124232 -148712 -653984 -808430 -667610 -462462 -217118 62643 5213
24495 5213 51310 51051 31377 27709 343540 281559 132141 181959 379877 204414 -21779
24484 -21779 -23814 140355 264286 112410 304133 401878 453647 39707 -224193 -208981 39795
24473 39795 -121772 -245089 -74505 -28644 -98732 -245501 -348656 -359615 -191659 77182
24463 77182 209419 284019 28051 -119189 -89240 -81038 -179667 -342171 -441089 -546917 -452261
24452 -452261 -207862 1170 53527 36180 -865 -107598 80305 119070 191487 277194 196963
24441 196963 164430 124842 -39466 -63389 -204176 -186954 -129936 -84041 -6503 -96996 -177906
24430 -177906 4564 76600 -126930 -115613 -161454 -225382 -181482 -24152 110053 128104 -63784
24419 -63784 -104424 -3193 207661 151878 48814 182954 259730 589313 540768 149345
24409 149345 -116850 -68467 -28077 -211464 -176896 -47873 113814 153455 86893 -65665
24399 -65665 48672 60379 160132 239373 -50064 -234868 -77501 -63634 -80659 -101677 -335784
24388 -335784 -305321 -310724 -404263 -371022 -236575 -426975 -579432 -718780 -588953 -575524 -363225
24377 -363225 -115292 9645 121000 215566 155753 69707 59752 38685 115615 11730 -14646
24366 -14646 -32427 -118713 -98474 128225 58988 -17296 -116240 -93601 -90422 35245 -71782
24355 -71782 -77318 -16260 38791 1684 -172347 -119614 -174490 -380169 -162322 -50888 -40115
24344 -40115 101850 -8021 -106969 -56943 -240361 -125437 66639 -10966 -147265 -278787
24334 -278787 -217151 -253594 -233820 -156771 -86504 -44859 72989 31084 -146012 33865 303369
24323 303369 266438 -100223 -57683 90567 193114 96426 -69417 -203653 -198086 -292108 -220612
24312 -220612 -150554 -51949 -151213 50551 288677 74387 156677 144135 -110328 60173
24302 60173 47432 117847 267213 228425 -32696 -145159 38231 -18152 58595 238516 202528
24291 202528 -7085 -246299 -252569 -124233 163248 132814 148113 -125259 -95928 -133357 -260985
24280 -260985 -303788 -302119 -322272 -152312 -159429 -200185 -22615 -109936 -351352 -358316 -338159
24269 -338159 -312844 12996 25806 -156403 -248612 -315081 -294856 -220660 -185357 -433588 -600910
24258 -600910 -376040 -296903 -242079 -337234 -340631 -219034 -127604 29742 5085 -258866 -123318
24247 -123318 -86908 -68131 34535 191626 311924 177451 57629 -177394 -192390 -74894
24237 -74894 -148463 -202257 -55009 127546 224107 11956 -14499 -95279 34089 7802 -46853
24226 -46853 -256393 -196048 50466 317558 114109 32346 -51432 -96111 -155900 -191504 -92937
24215 -92937 -182980 -188841 -94878 -86318 159772 186639 130161 3650 11913 -220825 -422816
24204 -422816 -461954 -341895 163344 222572 106001 205734 187184 100061 34010 23917 103491
24193 103491 -203402 -301335 -200531 -221476 -374894 -384012 -426211 -246466 76954 67237 40530
24182 40530 211344 279395 51708 -215239 -196744 9564 -110163 49345 204304 97447
24172 97447 42014 -67408 -24493 96253 -82002 -394542 -476660 -449859 -89099 133810
24162 133810 -90294 -188517 -220709 -249362 -300455 -232309 -184688 -182615 -93158 -201173 -364196
24151 -364196 -403496 -78693 -34030 -97266 65349 354830 63517 -189200 -163450 -254365
24141 -254365 -290275 -544022 -340710 -62982 82882 4468 -158926 -440694 -406061 -313883
24131 -313883 -139205 73790 163987 125334 121413 61771 -144347 -337835 -551698 -397871
24121 -397871 95755 44839 110339 137420 121349 -91915 1337 107476 -43862 -70379 -92761
24110 -92761 -331312 -222017 -55963 168082 12975 -129075 -12688 135697 227911 41002
24100 41002 -252511 -507609 -452125 -432092 -209351 143747 -85 -44899 -16344 -55661 -111501
24089 -111501 -103190 -198371 -194928 -81481 -323322 -447900 -454316 -444836 -284335 -225418 -24290
24078 -24290 30649 6103 60258 -88339 -48297 -53121 31329 147859 31344 49701 210457
24067 210457 -24999 176081 218702 31886 -56483 -154625 -131531 -140398 660 153465 156509
24056 156509 -135547 -5022 89906 44885 265306 128512 -6108 103928 38751 35285
24046 35285 -5879 -29676 71260 -159362 -117543 152261 53614 -103493 -1138 91826 184655
24035 184655 34966 -48079 -75918 -143217 -131184 -97225 -183152 -230557 -460632 -398080 -231417
24024 -231417 -223485 -374080 -409359 -60727 219236 308836 94760 -24014 -124725 -155231
24014 -155231 42727 190529 172767 105630 -90768 919 -51111 -42786 -233637 -318783 -126356
24003 -126356 -35836 -53660 -71092 236087 341706 248048 112654 41643 45933 147959 -55188
23992 -55188 -344828 -398798 -397460 -221747 65112 290275 511854 273308 204730 80419
23982 80419 -128552 -76124 -88599 9249 10817 -147319 -140178 -271259 -295380 -199136 -311202
23971 -311202 -436657 -465754 -321180 -68079 -121095 -194302 -311578 -387798 -201330 -110847
23961 -110847 -225627 -271173 -256198 -314040 -571673 -376567 -82366 134573 -16107 2191
23951 2191 574 47852 11810 -109536 -240061 -284064 -47394 -86946 -168207 -152568 -6875
23940 -6875 156659 237154 149734 156834 335564 255952 171565 285316 328310 287925 132727
23929 132727 -67441 -214829 -264439 -481988 -429972 35210 78740 -24937 -36188 -91250
23919 -91250 33929 147832 70475 96327 159163 170832 89919 177460 -75180 -135973 -5440
23908 -5440 -87891 -345316 -106506 9411 -126173 -108706 93835 70059 55635 -41203 -107230
23897 -107230 36438 19861 -128792 84434 127391 38599 -108387 -238446 -347570 -432160
23887 -432160 -385863 -419657 -415143 -450309 -396500 -219455 -174320 -68870 -276752 -322928 -421815
23876 -421815 -598124 -403759 -333209 -574803 -757799 -524644 -316794 -124189 -210567 -599
23866 -599 225476 117082 81753 -105640 -365948 -574456 -568118 -463282 -311823 -233907 -41471
23855 -41471 -94391 68874 20651 246464 342497 114775 52847 70371 -45710 -92773 -152817
23844 -152817 -130238 -167434 -226811 -219505 -84424 -337104 -363132 -182627 47010 156383 120590
23833 120590 -34493 30296 42398 105792 173067 -30366 28877 283953 348264 479694 322862
23822 322862 -107945 -261807 18345 45714 -68596 -160215 -81382 -105054 -7161 236061
23812 236061 249319 -282962 -456761 -211690 -36251 137269 -100051 -177420 -238084 -333910
23802 -333910 -180526 -120160 -88673 -73745 -15000 -9847 93010 -127130 -453468 -393443 -220061
23791 -220061 -58643 -62738 -72799 -21715 263752 299884 394399 488675 373636 281262 105389
23780 105389 -61006 149596 220898 25937 -247130 -143840 -102724 -161374 -378545 -390664
23770 -390664 -353905 -147824 -230150 -87638 83688 149130 307951 474964 590319 582772
23760 582772 559162 419295 239956 195593 172641 120457 137096 141117 80582 -88083 -68811
23749 -68811 2889 -100875 20255 65126 6054 -193734 -179133 -155070 -276546 -199755 -208201
23738 -208201 -83140 254503 231157 -46021 -155912 -307349 -382186 -254257 -140938 -318237
23728 -318237 -408343 -353969 -154729 -71835 -167610 -102196 -154332 -263854 -4544 127716 261636
23717 261636 269516 353390 181204 265520 411162 482606 284273 314325 249634 -63726 -394464
23706 -394464 -609893 -376111 87252 161422 266290 283454 71366 -27762 -89636 81228
23696 81228 263537 329632 325825 198227 117200 69357 81681 122520 164062 45193 72759
23685 72759 246577 252570 -169388 -115019 122615 372766 397026 415572 522886 408463 46617
23674 46617 124614 -43696 -74288 -41136 -40835 -58176 -66163 187368 -17015 -405295 -186365
23663 -186365 44701 66706 45258 23507 59235 -64745 63734 177319 70313 -57074
23653 -57074 -260322 -385124 -335403 -320461 -248448 -130544 -19062 68478 41506 -30360 138149
23642 138149 225283 382927 328101 226295 306337 -39382 -101259 50338 160067 -40740
23632 -40740 19784 53272 18951 91635 129030 204994 43572 44772 -99600 -207273 -176149
23621 -176149 -128214 28052 24 -44516 65388 73826 -66503 -259415 117179 224594
23611 224594 -108045 -281131 -134070 87668 269387 231248 -132984 -488505 -610250 -328534
23601 -328534 -218286 -248451 -187850 58263 -89398 -199950 -219140 -169839 -82566 -75565 -146429
23590 -146429 -149833 -157103 -198344 -140221 -4069 -174458 -4613 40783 27094 -18325 -124981
23579 -124981 3635 68546 -23349 -52198 -146416 -387188 -347026 -84674 -191224 -97274 -58447
23568 -58447 112381 221041 130410 5029 132366 210749 99472 -192446 -215233 -283369
23558 -283369 -251746 -227876 -278301 -212086 -204085 -152763 -85709 -349221 -339735 -305719 -234274 -254707
23546 -254707 -240641 -44044 -91214 -124432 -207048 -138723 -95932 -171832 -54843 -57214 70429
23535 70429 129889 21111 -47906 59014 220760 45397 -227594 -625 189031 208013
23525 208013 -29095 -184188 -94386 175406 130083 135390 201698 285324 455865 382782 135310
23514 135310 48868 259175 291017 126720 60419 87637 -244512 -247149 -62418 -147159 -225710
23503 -225710 -183119 -303393 -189177 7757 163637 203989 75538 -15766 -162322 -267708
23493 -267708 -168007 -122851 -314174 -510487 -291245 -106775 -133004 -39522 -86896 -146524 -116469
23482 -116469 -39883 -78565 -195191 -294907 22885 -44169 42121 156458 234250 329248 119127
23471 119127 -236832 -323116 -461351 -535021 -554209 -609752 -481865 -194114 -31887 207334
23461 207334 216727 164254 -157028 -470099 -225380 -73459 -258680 -326563 -262699 -346381 -409471
23450 -409471 -388259 -25055 435670 95655 -54567 83689 80215 248195 109156 -173783
23440 -173783 -325084 -167076 -44814 -82269 -32975 -58527 -174679 -202341 -221980 -49196
23430 -49196 167954 17211 -116778 -122116 -149278 -195243 -264711 -357439 -352972 -114094 -47134
23419 -47134 -72339 -111147 -115565 -61627 -105320 -66464 83514 -84421 -357157 -344756 -177649
23408 -177649 -197428 -382892 -114665 1124 -79047 -14508 -54046 -294227 -116802 -116680 -238765
23397 -238765 -392632 -181615 -193276 -229314 19710 188097 48320 -111602 -67388 -35444
23387 -35444 18507 283786 246254 -158253 -249967 -40589 71812 240130 256 -295864
23377 -295864 -241304 -103907 -39006 116244 66027 -247064 -18287 -85336 -46183 -366466
23367 -366466 -341966 -351803 -374600 -279140 -372513 -110940 -40357 -54290 23778 -56339 -85845
23356 -85845 -23727 -57996 -21149 -106269 81109 186150 275046 355420 70605 38423 -202784
23345 -202784 -283165 -87114 -77978 -141931 -223497 -121198 197395 264976 37447 -21539 138595
23334 138595 242871 305988 187345 210227 4790 -168469 -96999 674 -294452 -481486
23324 -481486 -341514 -67086 196287 293431 233801 91733 -40508 37937 33642 -89316
23314 -89316 -86810 116375 89145 44988 -24119 -125879 -205839 -313727 -228787 -30825 -73340
23303 -73340 -106519 269809 505335 235974 153662 -108187 -27893 7593 18108 -160726 -344258
23292 -344258 -346468 -132038 -342334 -542144 -398396 -151147 -84715 57030 96117 157461
23282 157461 210728 87046 33952 171438 200069 222518 -163501 -395034 -288386 -96600
23272 -96600 -89924 -169595 -198519 -256131 -484356 -274136 -136302 -151412 -237090 -70530 -98836
23261 -98836 -208193 -465033 -477344 -440303 -366083 -347582 -249613 -257848 -423786 -494385 -443122
23250 -443122 -452227 -405941 -329430 -493641 -278571 -205206 -119344 11352 -342984 -370861 -239406
23239 -239406 -211059 -27565 186687 82322 -3317 -171344 -443590 -299637 -281661 -344387
23229 -344387 -281525 -298975 -357615 -176167 209296 152387 -9496 21945 10245 17564 31753
23218 31753 115820 -40185 -117684 9773 99501 186624 338014 386995 171706 -328373 -320416
23207 -320416 -441662 -467356 -441824 -105915 82886 223037 154519 84428 -12930 -77512 111704
23196 111704 -16216 -772 -11683 -154627 -266557 -98048 80040 26048 -131299 -173563
23186 -173563 -129476 -150684 -21121 164906 -83422 -202617 -402303 -252502 -201808 -328960
23176 -328960 -46069 236671 318783 305725 278021 180437 264601 -5328 58854 299585 383583
23165 383583 198437 -69522 -30953 -17409 -182903 -190191 -225912 -201737 -241718 -340304 -466323
23154 -466323 -468793 -400068 -438752 -379834 -284136 -225325 -228057 -408800 -613815 -659406 -227030
23143 -227030 97512 35816 -59219 -254408 -180104 -248478 -141765 -9524 13932 161772
23133 161772 -1729 -20190 -120860 -267992 -154340 -29942 -1094 -99322 76081 266195
23123 266195 417787 311366 247826 388985 439565 275544 303426 589779 395047 161280
23113 161280 124676 120940 64508 39552 91433 129175 -262104 -57668 160203 67924 105173
23102 105173 4436 -393416 -374492 -347780 -352798 -159201 -226338 -288351 -131879 10330 -196755
23091 -196755 -139881 118723 2999 -187201 -185928 -230919 -366996 -354302 -210791 -243832 -193150
23080 -193150 -210836 -202032 -43294 -183864 -408186 -298942 -82362 182803 -108339 -338928
23070 -338928 -116862 798 -93967 -169024 -2759 -90855 -324000 -395429 -528434 -476933
23060 -476933 -250618 -158219 -101145 -1106 26100 137451 10358 -199333 -170923 -154227
23050 -154227 -66909 -85887 100305 72321 -203994 -267294 -54279 -138477 -229442 -302010 -231563
23039 -231563 -5386 -25533 -66162 -65756 -289493 -398667 -319354 -407315 -266996 31221 80382
23028 80382 -33763 -302432 -413396 -378293 -53453 326102 235327 196214 217362 13373
23018 13373 -204250 -379596 -271209 -42323 90586 135216 -3645 74318 241431 109102
23008 109102 53173 175759 285137 178755 143371 52221 249813 569786 716540 889885
22998 889885 1034364 858871 963895 1196693 1235176 1433276 1536891 1505013 1185541 1067175
22988 1067175 1219389 947013 683374 543926 399160 597377 478881 14571 -206564
22979 -206564 29570 115562 33610 53660 -10158 -230644 -119321 112758 86674 204121
22969 204121 342851 242312 70281 176723 235510 232364 340634 337593 163313 208500 194046
22958 194046 60797 156209 451676 417398 298077 130225 199714 379599 329211 336209 313482
22947 313482 398630 211550 29496 74715 413833 391435 319483 414693 153323 84166 189855
22936 189855 13676 -173163 -280329 -281305 -364230 -218559 -81710 61436 206912 449218
22926 449218 89481 -95544 29627 -100903 -184661 -111933 -92695 -116011 -108102 -49194 -177835
22915 -177835 -316387 -135852 -381358 -500884 -351141 -225056 -143000 -87526 -76623 -49217
22905 -49217 139415 398741 242422 44217 -29137 -255281 -256721 -187432 -311453 -355672 -189105
22894 -189105 7331 -185610 -285799 -168459 26658 256001 134953 31834 -99464 -127142
22884 -127142 -155114 -146419 72388 111505 -340198 -250975 -318370 -336739 -152974 -58677 -88755
22873 -88755 -223509 -533221 -606742 -546273 -245479 -322061 -250501 -29272 127859 19774
22863 19774 55634 136623 137393 139875 -41445 -225583 37962 324219 265581 262591 364635
22852 364635 330525 200302 -7110 -116641 -192904 -160054 16002 10831 185904 218406 153901
22841 153901 -5589 28100 219951 221070 147034 20774 46694 177114 126036 -93930 -124569
22830 -124569 38662 345547 518404 428906 408111 474194 247658 186131 191088 252890 360653
22819 360653 168725 -102385 -109712 -154909 -144950 -403090 -423016 -261149 -128417 -100673 -182640
22808 -182640 -339937 -294369 -227697 -214511 -76986 146549 99049 -150680 -164457 -230991 -221582
22797 -221582 -131695 -70637 23920 167120 508883 711346 512352 349360 285272 75266
22787 75266 -245558 -435380 -335328 -342050 -366095 -369114 -291440 -184020 -81282 -150242 -69343
22776 -69343 119535 391139 128944 32668 -66047 75048 91510 -71988 -86766 -98507 -95753
22765 -95753 -138277 -46318 32763 -52080 227801 439738 215394 -192574 24409 97428 39123
22754 39123 -15418 -103354 -277470 -216513 12241 63278 133568 7399 -149102 -188717 -182220
22743 -182220 -307731 -174781 51846 148037 -59755 -97340 -28760 236616 75497 -86261
22733 -86261 -72404 -112832 -438615 -458089 -642552 -417262 -139437 -44460 -75641 -75240 179574
22722 179574 263048 -9069 86195 165432 29740 -14187 -146400 -200414 9780 104722 190175
22711 190175 70512 1093 92794 107098 180984 41968 56944 34821 -137207 147427 278050
22700 278050 299877 135505 155622 34224 32533 141876 233794 210416 256776 102333 11233
22689 11233 -107609 -101460 -102839 -231464 -189917 -81255 24268 -27452 -27308 -140766 -79192
22678 -79192 92819 77386 -77257 -59421 45305 340856 320623 191472 199691 293505 106254
22667 106254 32894 100282 -77142 -5915 275340 205816 -39127 -49440 146216 227332 240413
22656 240413 136139 17991 15692 -42635 206416 425091 61325 -70060 145416 335748
22646 335748 324409 70447 -76907 92399 344362 286507 -40404 -49656 153590 120902
22636 120902 77604 134273 317591 302709 224396 169218 -142595 22905 177826 171693 209617
22625 209617 -15373 -6146 -18886 90909 189699 392467 426841 378518 150891 -63169 21698
22614 21698 91706 31395 -166953 -154842 -44773 83634 256525 368994 441483 383175 494002
22603 494002 372252 368631 410977 212988 237372 150967 232805 276967 248706 54515 -60740
22592 -60740 102448 358046 479595 499232 575576 687919 563219 387124 367604 422690
22582 422690 485465 863168 1125416 1014933 779760 917496 1089742 918857 872409 699191
22572 699191 682279 777761 736355 626581 681560 625972 523232 440700 412094 381829 524996
22561 524996 524047 768389 780581 691168 662137 679908 895901 837391 807895 742923 831013
22550 831013 885895 800562 700886 741152 782599 893881 960505 1059074 1167155 1212690 1530322
22539 1530322 2089141 2526060 2769724 2775552 2876495 2908588 3040395 3165704 3114209 2840020
22529 2840020 2612688 2122279 1675801 1579451 1617105 1582808 1674465 1682935 1654478 1490705 1389141
22518 1389141 1463740 1498005 1432592 1437995 1337169 1316506 1057264 945394 1187079 1414272
22508 1414272 1476659 1414400 1370662 1292688 1530269 1933618 2122796 1938750 1950053 1983853
22498 1983853 1929082 2025051 2300664 2545289 2834723 2953739 3007743 3280938 3620025 3771321
22488 3771321 3742399 3928963 4212567 4618639 5080799 5657653 6349554 7257832 8238091 9138920
22478 9138920 9912427 10733582 11657845 12914933 14570095 16223021 18293742 20722119 23399272
22469 23399272 27140721 32378270 39678726 50549273 66931502 93055642 135530062
22462 135530062 199131502 271999828 330426482 363148751 377236526 390663086 410294652
22455 410294652 430078888 437686549 410986391 343559994 255368297 177497061 126973522
22448 126973522 97113124 78825909 67184106 59061152 53009240 48156783 44344964
22441 44344964 41417200 38973186 36836957 35043574 33659653 31892448 29707607 27888941
22433 27888941 26050740 24164149 22648143 21684242 20724992 20002515 19171699 18159155 17275360
22424 17275360 16564472 15688792 14999420 14422022 13970849 13575107 13306513 13022980 12829405
22415 12829405 12610571 12227832 11914991 11708003 11160266 10700595 10143314 9530542 9071640
22406 9071640 8711970 8451451 8326289 8125881 7761596 7248429 7076476 7166777 6789268 6709424
22396 6709424 6639740 6340335 6131867 6197144 6107915 6089571 5797646 5468028 5080363 4856364
22386 4856364 5069428 5135338 4826498 4809078 5417241 5687162 5883742 5994652 5794029 5602807
22376 5602807 5613467 5368375 5083314 4779988 4263271 3905750 3644123 3342270 3093773 2982666
22366 2982666 2953630 3003509 2854103 2727067 2873105 2711280 2502204 2304401 2184701 2051834
22356 2051834 2061827 2207012 2146807 1944056 1769080 1764031 1671311 1592502 1329648 1278077 1308128
22345 1308128 1302551 1431008 1709067 1687765 1194702 1085760 1010871 1084461 942623 474892
22335 474892 485818 715109 839903 994399 859477 680279 506207 509006 447046 327435
22325 327435 442887 561898 589303 469830 438496 608431 665927 484484 242134 131268
22315 131268 117 161484 73433 4053 176702 167109 202271 205517 275955 276853 211329 122117
22303 122117 137801 157359 18507 -56703 -120008 -39882 86259 71486 -85383 104055 391457
22292 391457 272919 -23252 -300704 -302232 -160021 -99775 45160 -65007 -28745 17911
22282 17911 -24657 148717 434943 381961 132323 213254 199878 23992 -283006 -384401
22272 -384401 -291639 -52942 -11945 117567 211880 205018 64196 -187203 -336532 -440256
22262 -440256 -148914 -92425 -166776 -79796 -174700 -254411 -216063 -98499 -84002 -145307 -81158
22251 -81158 -75590 55685 -23353 -82276 116019 95986 75386 50784 18685 -236437 -281842
22240 -281842 -53591 -105566 -17713 48817 75421 -62162 -142761 -222323 -158372 -186075 -236808
22229 -236808 -138793 -87182 -96969 -226128 -239903 -50177 3996 -32135 -122370 -217466 -101118
22218 -101118 29689 -157713 -419656 -243777 -66151 -60918 -39421 219682 311615 363956
22208 363956 313760 292438 164521 -159013 -92036 62204 82412 280866 226135 -91065
22198 -91065 -288348 -223700 -160729 105143 -138422 -456722 -518785 -355286 -221759 -35289
22188 -35289 41799 -147621 -168304 72613 126498 -51227 -12738 84592 290377 76443 -211916
22177 -211916 -257322 -184278 -356465 -500758 -521727 -409018 -181611 -126958 -73509 -60127 -168835
22166 -168835 -302935 -310361 -274940 -492038 -424059 -521321 -447182 -251630 -222428 -87361 131788
22155 131788 -25244 -166453 -29634 62350 209091 354928 354828 360369 -164237 -277241 -171809
22144 -171809 -272700 -166518 113338 55142 -166013 -277033 -238770 -50474 -56873 -78577
22134 -78577 -227544 117294 210082 208619 176830 156075 98166 -68373 -166440 -396869 -627446
22123 -627446 -684303 -416881 -226410 744 92072 -131156 -19183 -165387 -459349 -446149
22113 -446149 -316866 -238977 -242596 -46992 164351 16629 -137292 -16319 140843 79942
22103 79942 -9816 75699 57299 30712 -167383 -1579 -24460 -134652 -171006 -140042 -7238
22092 -7238 -19253 -167209 -249199 -283895 -463094 -435043 -466928 -370987 -310222 -53117 -188449
22081 -188449 -52926 -13212 -198089 -146270 -149882 11544 -247261 -343642 -400080 -239873 -145119
22070 -145119 -114671 97453 -49061 -210604 -10726 74911 167465 81881 -14693 -12126 -38345
22059 -38345 -118454 -20518 151984 129190 177723 28609 -145369 -171472 -215716 -146565 -429514
22048 -429514 -351256 -58933 -209143 -268887 -139949 9090 -43489 -242092 -436430 -294239
22038 -294239 -89813 94357 129115 195463 169707 1049 6475 -75602 -377301 -733416 -730541
22027 -730541 -730797 -367497 -173543 -290321 -235941 -76393 -161579 -271245 -305010 -179505 128112
22016 128112 182969 123942 55393 -282700 -481661 -483461 -426055 -439678 -613434 -597330 -455396
22005 -455396 -534497 -365585 -34450 39038 -89146 -173689 -273525 -335962 -475424 -394831 -345559
21994 -345559 -332972 -336940 -145230 56118 -34647 -145341 -46478 -164196 -268247 -43944
21984 -43944 -131803 -294120 -585502 -813939 -733905 -462922 -218897 -49174 -62812 -75218
21974 -75218 -153110 -382419 -562346 -553675 -705210 -611358 -346468 -399751 -446718 -164110 -222717
21963 -222717 -350588 -374889 -466994 -362346 -249156 -224936 -328317 -385129 -301101 -119360
21953 -119360 -84621 -344124 -391420 -382309 -564681 -440292 -61909 201279 116046 165404 70315
21942 70315 26128 87973 12015 87141 73426 -134745 -95919 -111774 -52883 11629 90346
21931 90346 148298 30884 173987 337724 438738 340683 219548 55408 -219096 -109629
21921 -109629 4499 351 153856 551967 611525 896245 1235498 1408627 1413472 1474171 1308280
21910 1308280 1319553 1507567 1537664 1349496 1218219 1143766 917833 668414 413847 173509
21900 173509 145306 281779 282370 19437 22898 64270 123397 222749 306885 331411 85597
21889 85597 7078 -198065 -514286 -580938 -622313 -373519 -133386 -107134 -242421 -222318 -72191
21878 -72191 -108898 -131625 -300945 -330434 -390580 -282504 -148467 -90547 -223580 -369084 -240576
21867 -240576 -247187 -430646 -290653 -222183 -317606 -183961 34129 220843 361240 229534
21857 229534 31627 -126901 -105508 -204653 -436254 -537505 -414117 -473282 -386919 -146573
21847 -146573 -62039 15867 -17898 -446 -165731 -145407 110148 174732 131009 113182 226989
21836 226989 93346 70119 -8595 -152762 -331392 -267235 -363997 -431153 -385230 -32780 210376
21825 210376 220085 5557 -82266 -107826 -205685 -125989 -29094 -83705 -251826 -275980 -99860
21814 -99860 -92824 -98945 -25117 -92905 185551 25507 -165609 -35272 -11476 -69063 -218722
21803 -218722 -284349 -355887 -114537 62876 -95150 -231792 -245517 -160046 -104526 -223822
21793 -223822 -147733 -8134 -130466 -70917 -34129 -220769 -256016 -372454 -396837 -356310 -249911
21782 -249911 -220671 -250393 -420370 -231981 -130117 -145856 96378 346105 357303 368540
21772 368540 363838 119230 33335 -140740 -149922 -152533 -140700 96912 181352 -22878 -99123
21761 -99123 -206671 -245050 -241164 10591 23787 -224099 -249207 -102943 -39808 63332 62111
21750 62111 81697 177840 287264 507901 524608 439339 431343 335245 82883 -140709 -342469
21739 -342469 -451504 -372997 -346866 -302176 -275469 -384059 12596 82114 146864 -41711 -306802
21728 -306802 -376795 -565618 -704232 -523089 -108420 -206799 -536751 -486340 -256911 -54857
21718 -54857 -27592 -12403 86612 48080 -21844 -192199 -194449 -119826 -84644 -105990 -303839
21707 -303839 -359769 -233252 -110055 -9854 118590 257291 150225 25495 -91785 -137776
21697 -137776 -160913 -140163 -276400 -230042 -225746 -100009 -131364 106048 119971 45576 73090
21686 73090 160941 55894 -111380 -257382 -425750 -435013 -559166 -389472 -135543 57055
21676 57055 184231 259211 94995 -124884 -127660 -119380 -101195 -38577 -88559 -100930 -17697
21665 -17697 -31481 -206274 -466659 -537775 -423307 -300445 -299660 -271019 -413599 -486279 -434027
21654 -434027 -441934 -455264 -416278 -290271 -237025 -263987 -170595 -360044 -333981 -241093 57532
21643 57532 197388 3550 -261641 -494668 -537103 -414553 -381491 -209842 -4402 -159987
21633 -159987 -388889 -488755 -548639 -628993 -457948 -308275 -227705 -207784 -49032 -182085
21623 -182085 -97636 11144 28673 -218098 -196905 -97503 -247044 -117092 -73864 -217105
21613 -217105 -269779 -349269 -290955 -19305 86505 142738 140660 232953 29787 61818 257378
21602 257378 269582 31797 53655 -39795 -224392 -252199 -319306 -313300 -347792 -323611 -448670
21591 -448670 -489158 -404599 41436 55851 -135810 -226726 -182240 -124593 63122 89680 132047
21580 132047 123509 -47028 -187465 -165983 -192524 -115950 -213923 -370092 -254657 -320467 -179273
21569 -179273 107104 192883 149392 134225 -61768 -190664 87168 38112 94824 262482
21559 262482 -25399 -14248 -10181 152808 193680 230718 -21042 -160714 -91876 -39020 -178839
21548 -178839 -306578 -344688 -255188 -59221 -81728 -242788 -298355 -155851 11934 -213717
21538 -213717 -264471 -124799 -48236 -41235 -327744 -363734 -276009 -244482 -269379 -263274 -286784
21527 -286784 -113075 118891 161430 105354 -33009 -238920 -165368 4858 44409 -375388
21517 -375388 -509107 -291390 -158712 -117087 -97824 -45080 -109593 -209144 -297032 -245590 -82983
21506 -82983 -250219 -352745 56000 117291 189506 289285 152244 18536 -28312 -87138 -7269
21495 -7269 57301 -36374 -84221 -282604 -78699 -12238 -67782 -137506 -232639 -279333 -353831
21484 -353831 -300815 -263607 -248210 -295965 -235144 -180878 -151292 21474 -53296 -132613 -285581
21473 -285581 -253491 -284790 -334728 -236033 -250229 -244641 -313999 -234791 -149053 -178576 -300459
21462 -300459 -118810 264678 585236 556152 221055 -55790 -182121 24459 67383 -206554
21452 -206554 -287891 -194570 -175415 -280029 -406923 -385415 -182706 63527 12778 22696 69035
21441 69035 187338 116083 -104508 -171235 -147512 6522 172063 97997 -60049 -97546 190086
21430 190086 96247 -96774 -136173 -237581 -323235 -395627 -392190 -380275 -285413 -363079 -336663
21419 -336663 -391265 -401894 -464956 -376378 -250441 -158887 -113280 -130313 -266214 -136690 29851
21408 29851 -84386 -134340 75988 160133 115350 -122617 -303203 -357559 -407716 -172504 -66051
21397 -66051 -340744 -251835 -88036 -232331 -252570 -104620 -307174 -543575 -405568 -131271
21387 -131271 -141039 -99653 -39456 136270 37050 111135 69302 81898 -28186 -159610 -221694
21376 -221694 -302813 -279365 -113612 -105670 -207612 -77953 -213125 -287960 -149575 -51393 -97979
21365 -97979 -224219 -345992 -296514 -244708 -28470 33998 51668 129897 179406 -56206 -300752
21354 -300752 -138409 -156523 -206210 -182262 127017 146695 53926 -109142 -88830 -26797 210345
21343 210345 180581 -47894 -62677 -107106 -116191 -353674 -448917 -557349 -618360 -549900 -514949
21332 -514949 -461005 -379805 -214819 -91594 -83275 -50754 -30338 -232083 -416982 -450537 -389388
21321 -389388 -325807 -315289 -329578 -299189 -424671 -395021 -289973 -193406 -93709 99702 51177
21310 51177 43581 -142271 -193594 -20445 6683 -63477 -121799 24722 -85923 -308000 -299502
21299 -299502 -183958 -150859 -225286 -72363 -196091 -246223 -69105 -17522 -249350 -410715
21289 -410715 -118245 -21535 117926 -109470 -151430 -158152 -57703 176844 210812 -24009
21279 -24009 -280218 -316510 82484 188871 249667 292612 378064 246763 107185 118936 275097
21268 275097 388065 436776 260677 208109 -37991 -212989 -226006 -163561 23286 180405
21258 180405 352443 247389 141386 234723 90117 99500 243590 425794 154774 220877
21248 220877 259159 83040 -110589 -221379 -28592 172295 202349 104160 56253 179449
21238 179449 131181 118773 -42059 -206953 -189035 -34826 8416 -24700 63937 110886 38978
21227 38978 129433 202743 62456 84928 151295 -112914 -21551 349982 451983 321594 15383
21216 15383 -155129 -192072 -140497 62819 -38096 -79095 -266654 -290568 -162009 -63321 39975
21205 39975 180965 110165 -14939 6417 42893 84789 143481 127635 158179 197894 6534
21194 6534 184579 278822 13287 -71490 24361 -104068 -162948 25576 -102384 -225405 -375939
21183 -375939 -400153 -337738 -337111 -323719 -259533 -295595 -542876 -558694 -479912 -570473 -372974
21172 -372974 -163634 -125335 -131045 -100441 -89533 -129918 -161535 -147768 -170054 -146629 23415
21161 23415 -36488 -381106 -485977 -433425 -219654 -80028 -174572 -93777 -233002 -387687
21151 -387687 -289927 -379969 -301437 -34657 -88388 -248014 -348536 -285469 -154671 -70984 -62447
21140 -62447 -212295 -155793 -57220 225814 122515 -48252 -298738 -299724 -387822 -241593 43894
21129 43894 -164756 -145729 -43171 -38022 14388 -135278 -200866 25276 55480 35488 53597
21118 53597 -89331 -129882 -185928 -75687 -139041 -207154 -270309 -97282 -75678 -315294 -172168
21107 -172168 45032 -62693 -120011 -126065 -296555 -306417 -267850 -264285 -235078 -256531 -134340
21096 -134340 -124081 -40659 -159760 -113792 53982 -88277 -68872 45947 62460 -58151
21086 -58151 -161983 -170907 184 265332 267791 218341 319855 540632 403781 273569 312844
21075 312844 158003 -76993 -157370 -65363 137016 63553 -190158 -290843 -192381 -36075
21065 -36075 -263352 -429037 -244650 -152873 -277910 -101783 -42978 -116330 -51375 -108684 -138662
21054 -138662 -138735 61303 -15897 -72035 -121692 -568055 -705539 -184656 -102710 -37970 88514
21043 88514 69962 281185 322063 117910 87546 127063 -46924 -60409 -76162 -135163 -68464
21032 -68464 -89395 -163505 -133494 -113493 12160 -54080 -11611 -112302 -7529 216167 222454
21021 222454 238367 73802 -43966 -287748 -147807 38448 -139709 -387079 -408886 -41528
21011 -41528 -12377 -69485 -262882 -366014 -198129 -236292 -205744 -117053 -49655 -225169 -358032
21000 -358032 -46813 125206 76525 -3661 -45545 70869 -28099 -325158 -329467 -321067 -278042
20989 -278042 -285996 -184181 -36535 -198780 -367975 -350429 -180818 -98248 -134343 -212704 -193598
20978 -193598 -88716 -123374 -272652 -410827 -350962 -161763 -82076 -117460 45146 -147719
20968 -147719 -576341 -488654 -616245 -436436 -512076 -568857 -327841 -346346 -244681 -247295 -244835
20957 -244835 -402995 -220069 -35514 12981 38842 83497 81573 3029 224256 108759 -69541
20946 -69541 -114150 -133545 -99551 -149154 -89181 -137482 40567 100303 -109983 -38776 -128898
20935 -128898 -131930 173227 258931 323864 127212 -28400 -163587 -190145 -90962 -17995 -366246
20924 -366246 -310698 -268911 -113418 74784 212877 147586 -51350 -181853 -192137 -275077
20914 -275077 -294355 -165107 -117649 -43035 138568 2692 55550 -37562 -79964 -91709 -47931
20903 -47931 39448 69570 14472 -107608 -339406 -495071 -498506 -307048 -155066 -222996 -262286
20892 -262286 -98739 -148003 -406803 -595598 -668805 -753717 -541819 -312353 -69140 -11819
20882 -11819 107468 139662 -267770 -469895 -399849 -270625 -375291 -306370 -183559 -209838
20872 -209838 -230243 -149159 -94488 -241312 -290994 30941 119924 35238 -156945 -285450 -196058
20861 -196058 -59067 156708 184525 -24320 -53290 -45702 71921 55824 10252 -176076 -269774
20850 -269774 -264770 -273241 -560059 -748393 -876074 -634648 -380472 -228991 92930 -50474
20840 -50474 -82149 66733 -69044 -271724 -396116 -129086 -46925 -55235 -2218 -27283 -80519
20829 -80519 74122 308088 202601 88168 103515 -154646 -362465 -339605 -317001 -348076
20819 -348076 -308107 -325447 -215736 -126331 -393810 -347970 -276039 -246427 -321142 -261743 -88412
20808 -88412 48222 73172 45555 263401 215477 -20122 -236602 -369438 -327651 -27696
20798 -27696 252050 175300 75328 48024 -40490 55282 193653 242800 322256 518228 238430
20787 238430 85095 -152235 -160510 -123286 -187131 -76299 109404 -6443 -150143 -406129
20777 -406129 -564589 -536821 -535258 -553767 -442944 -269358 -96368 -232029 -460208 -253523
20767 -253523 -58025 -244999 -180760 -119672 -223914 -96634 -128476 -346614 -255031 -140239
20757 -140239 -181265 -66965 24518 -103456 54135 271506 454480 286151 235777 76201
20747 76201 -108745 -314001 -410894 -387022 -467962 -305179 -259637 -339428 -375981 -330466 -187626
20736 -187626 -94306 -135482 93159 112756 31152 105923 80239 179846 352453 477473 430338
20725 430338 364309 310335 101099 29458 167393 -122223 -120085 26760 -26347 -214447 -458588
20714 -458588 -414741 -309474 -209602 -526052 -387093 -243224 -195803 -167662 -178008 -299634
20704 -299634 -265392 -302598 -147698 -33822 -12680 301022 394472 4407 56500 18851 -58090
20693 -58090 -41005 -111798 -69952 -15399 -17824 16599 -17648 -32598 -43771 -5265 -191047 -278277
20681 -278277 -163441 -152523 168739 231472 95971 200758 344764 185415 4769 -39873
20671 -39873 -109450 -366524 -407202 -113953 32741 36086 48728 61264 -25965 -286175 -356874
20660 -356874 -362998 -497357 -543205 -476092 -378564 -267032 -306155 -161087 -203086 -279246 -314824
20649 -314824 -392759 -420728 -379601 -352367 -421242 -433163 -373140 -387905 -404978 -171160 -78264
20638 -78264 -278184 -81759 62311 -110074 -220721 -106288 -48040 91106 -26974 -340971
20628 -340971 -374490 -186396 -105586 -262427 -196082 -182361 -143275 -385466 -448703 -271859 -47106
20617 -47106 91492 -105517 -138087 -129203 -243520 -201776 -46922 -143035 -239346 -170425 -61109
20606 -61109 -187358 -123491 -72712 -17409 71652 164332 153231 -158972 -385675 -284561 -337406
20595 -337406 -47143 -84098 -290878 -202885 134613 187841 197440 117755 141046 125701 64784
20584 64784 6391 -91481 -133235 -16217 163864 -130480 -160326 -121377 -105966 97438 -7787
20573 -7787 -39909 -125733 -54721 109672 62648 -294843 -489402 -497233 -349810 -231039 -180943
20562 -180943 122365 123156 -32665 71862 -160968 -337344 -265466 -146483 -124383 80417
20552 80417 114576 -99546 -272135 -274773 -41209 143851 -176549 -341021 -202477 -69021
20542 -69021 102583 -3932 -110006 -67759 -140215 -175402 -116756 -172301 -89891 -170848 -309523
20531 -309523 -143765 -106228 -249728 -285543 -337800 -323787 -370091 -312807 -171232 -110883 -173766
20520 -173766 -129539 -280878 -234014 -194665 26978 211509 283447 378713 213378 -75323
20510 -75323 -328265 -227175 -351417 -363741 -262659 -117252 -50853 -104878 30613 111973
20500 111973 155363 11118 -271978 -231768 -43569 141421 -42388 84002 19586 7585
20490 7585 -203775 -77864 -52050 60435 173596 43235 70498 -284089 -390230 -227738
20480 -227738 -136489 -396190 -253644 -129139 -241718 -277030 -111680 -92150 -304636 -299652
20470 -299652 -337699 34082 66055 198387 108090 -23182 40069 -25349 -210518 -271213 -185973
20459 -185973 -126502 -213579 -330368 -379039 -315050 15817 -73523 -68806 69882 7678 -61939
20448 -61939 -222087 -262560 -217011 -304595 -197745 -139193 -345756 -268085 55562 404049 398941
20437 398941 444542 76113 3212 143134 104410 -79028 -178548 -168833 -227088 -352695 -307559
20426 -307559 -200838 -119055 118889 121677 97799 174694 446187 448052 527866 573902 723983
20415 723983 689972 847326 957380 691995 829250 942174 839275 797389 810133 1065116
20405 1065116 1107115 1007175 841190 629661 663737 454355 297165 322750 122535 35410
20395 35410 134862 201879 85297 276314 243648 145882 417727 622978 464763 516261 495850
20384 495850 434983 267939 405127 429244 197583 219077 420653 413035 402583 480970 467234
20373 467234 399044 358575 347136 184122 253232 355123 317526 278995 682433 809391 880562
20362 880562 934733 1019822 1111360 1248438 1508769 1120689 748385 585236 478764 363768
20352 363768 382612 418882 238001 297587 375907 439560 178522 -2319 -15108 -58612 -52587
20341 -52587 94131 291402 362712 374168 459093 416406 477005 621727 735288 728233 995527
20330 995527 933246 897364 864647 907533 866640 796364 867591 850826 789622 768619 475578
20319 475578 359521 439619 439869 489478 535835 529153 686298 795605 752515 825834 749949
20308 749949 812219 1169731 996554 709852 813842 788234 768038 655368 445630 355437
20298 355437 239467 279571 535453 330176 234884 396500 243704 216964 316854 561647
20288 561647 496999 408212 340242 123934 -38358 -195892 -242287 -127933 -215984 -249831 -47537
20277 -47537 -37404 75715 216533 355334 225157 227602 449860 301387 434432 495084
20267 495084 211641 -46996 61870 147015 100683 338762 307740 -55531 -54725 127740 367936
20256 367936 267476 141724 279578 119622 -279201 -224375 -107067 -21173 92102 229286
20246 229286 384419 -24458 -309301 -270286 -127689 -271731 -133117 67205 170104 105622
20236 105622 -17711 -65418 43297 102940 30705 -136625 -6018 -12671 -171199 -59593
20226 -59593 66050 114797 14489 -933 -85986 -16008 -128855 -170157 -189120 -459242 -584827
20215 -584827 -571774 -292226 55310 60795 74508 77166 -26672 -99447 46191 246095 155312
20204 155312 -29645 15018 4545 -23707 30204 116455 217320 459263 339339 116339
20194 116339 14757 -69584 -198098 -114699 -170652 -131653 67749 47025 -258138 -185596 12229
20183 12229 44146 -201933 -305621 -356506 -205193 -10755 78684 173721 36061 -157333
20173 -157333 -187029 -151392 -59198 -54121 -177258 -37626 134668 126897 -236830 -99261 122771
20162 122771 86131 110504 90622 -15972 41116 148680 128221 258087 294844 284087 238809
20151 238809 188293 31375 99293 41982 -73567 -44082 -11495 3032 120070 274357 325593
20140 325593 476980 435429 117503 -166655 -309602 -396465 -142296 -57253 -94025 -85542 75901
20129 75901 131854 -42901 -91047 -253742 -408885 -308821 57299 97934 -2731 -166355
20119 -166355 -302340 -68193 223716 292142 298361 370116 500226 486703 476317 559063 497476
20108 497476 198630 16139 62274 8265 -104049 -83253 -72941 88098 327491 290024
20098 290024 -64852 -206197 -77055 -44769 -180912 -329032 -144136 -9000 -228096 -209857
20088 -209857 -3849 61202 113402 293689 244511 193791 188632 214165 206953 70387 -2697
20077 -2697 146961 252222 175886 368244 371787 287653 164915 -88233 -198672 -113506 32136
20066 32136 112353 294368 97246 117387 213469 288138 174597 66897 -98679 -8870 255986
20055 255986 193889 82750 171661 177635 251578 92068 66598 -93695 73764 261676 401403
20044 401403 328957 350463 208361 106372 265199 518128 502900 444858 303686 334643
20034 334643 459708 346540 257347 418406 523921 497382 447927 463691 521148 526621 606920
20023 606920 626776 504674 704644 798660 652547 332205 47542 67237 232528 199916
20013 199916 294357 692875 787206 492016 425169 449321 585807 508345 361274 429272 537648
20002 537648 581745 606273 564209 599412 462757 644024 657329 439039 311254 355261 459851
19991 459851 424871 410803 624731 728210 793419 959424 889648 584979 665942 788526
19981 788526 587801 483667 541766 634407 667645 753505 1009209 979722 920247 925196 713238
19970 713238 638267 627688 641889 496910 651008 998180 991194 997375 1095160 1012522 946055
19959 946055 1048421 1033356 828205 663013 645730 697321 666817 724237 717919 683698 432011
19948 432011 739010 859436 940484 1080067 1055846 1118399 1200104 1384859 1468533 1310572
19938 1310572 1390236 1702164 1883541 1817146 1833211 2018875 2075602 2301908 2391046 2389480 2636109
19927 2636109 2884727 3158197 3414046 3878906 4370677 4664314 4937281 5265124 5459377
19918 5459377 5759839 6328126 6646540 7224653 8415200 9384669 10825482 12670707 15129637
19909 15129637 18493990 22967504 29622908 38387846 48524548 59810695 70968320 81989128
19901 81989128 93401008 104644188 116151260 127480067 137275068 143777405 146586899
19894 146586899 146470417 143937314 139631563 133818075 126839105 118446967 108355085 96491104
19886 96491104 83784893 71021368 58862640 48519679 40573505 34971029 30995576
19879 30995576 28037943 26033128 24275493 22913014 22186136 21585683 21125733 20805551 20466598
19870 20466598 20011533 19480107 19372651 19430169 19417483 19708242 19804507 20318447 21585718 23269937
19860 23269937 25793376 29530149 35055808 42668826 52442506 63811925 76003544 88339984
19852 88339984 100575204 112657607 124746552 136669534 147548739 155853773 160428044
19845 160428044 161134637 158838451 154153981 147548311 140230400 131809767 121819039 110420174
19837 110420174 97870711 84740306 71761134 59421182 49103481 41146333 35267764
19830 35267764 31262704 28394255 25992068 24002373 22663446 21719064 20669925 19813061
19822 19813061 18968830 17835306 16946732 16249627 15482154 15009038 14559988 14066868 13478458
19813 13478458 12744499 11786010 11168041 10947110 10699755 10209289 9929402 9571249 9218112
19804 9218112 9188991 9167594 8823039 8692530 8422268 8152876 7779284 7456728 7331363 6962482
19794 6962482 6450955 6434367 6625527 6599274 6466299 6145837 6065429 5939441 5977110 5836275
19784 5836275 5835043 5887402 5736459 5765081 5818070 5767768 5756308 5440926 5435162 5699474 6053194
19773 6053194 6573683 7057529 7401860 7444784 7868128 8459774 8607303 9024091 9614930 10336303
19763 10336303 10917448 11315572 11789577 12549795 13606244 14534435 15306038 16580173 18218705
19754 18218705 20543495 23956296 28409435 34460851 42682639 54449656 70666653 91326084
19746 91326084 114359454 135978153 153600819 167257301 178429465 188973912 198490980
19739 198490980 203392724 200031919 186784141 166873283 146113376 129190234 117401952
19732 117401952 110005450 105214914 102631484 103225666 108821091 120302905 136590665 154032164
19724 154032164 168813760 178978909 185536651 190048997 192764811 192611038 186186995 171221579
19716 171221579 148682250 122951985 98878400 79692683 65831684 56240344 49205701
19709 49205701 43542256 39252735 36084290 33811183 31678621 30114157 28514023 26894722
19701 26894722 25592426 24691630 23528426 22529351 21613790 20765941 19920570 19191277 18293790
19692 18293790 17422869 16419759 15572611 14778135 14067221 13410883 12877151 12356635 12088350
19683 12088350 11804155 11269622 10695599 10216033 9898643 9754908 9377213 9059726 8823179
19674 8823179 8568873 8157421 7804096 7596738 7584921 7617348 7443694 7283272 6973399 6740135
19664 6740135 6495723 6515096 6392710 6053773 5689493 5291270 5267469 5395730 5339583 5261387
19654 5261387 5224164 5133418 4972537 4641143 4436378 4648899 4736724 4630027 4607038 4402798
19644 4402798 4199218 4212171 4172639 3986523 3885357 3748831 3492284 3468365 3562193 3523004
19634 3523004 3607124 3440996 3368793 3411296 3226372 2804834 2554912 2640607 2575844 2369261
19624 2369261 2381819 2085688 2046856 2102463 2255626 2191595 2175981 1850419 1599120 1599893 1761914
19613 1761914 1714350 1505315 1384418 1446261 1748705 1779035 1754591 1719699 1549674 1276461
19603 1276461 1325015 1501274 1534212 1630674 1590162 1407756 1156296 1277433 1601678 1596589
19593 1596589 1384499 1280072 1215765 1369218 1709632 1654511 1361988 1204008 1081660 1227835
19583 1227835 1282216 1324267 1280349 1037197 982171 1207322 1322213 1299327 1084017 1003764
19573 1003764 957124 713514 756437 1037172 970430 733399 633951 827133 971243 911198
19563 911198 901436 480562 201316 156333 539756 703500 767909 742752 656862 566605 652598
19552 652598 772422 510651 396419 547419 895844 1148208 1112787 909226 995383 925830
19542 925830 607124 455314 562198 772262 895128 868979 827168 820909 575292 408997
19532 408997 60717 6251 -14781 89923 432553 461802 409583 340954 324062 122252 198321
19521 198321 430068 673173 650611 602747 694794 774964 705731 670719 614819 300157 51332
19510 51332 146478 463372 648990 398405 341058 432087 552283 596198 535406 601097 553603
19499 553603 342664 430696 286666 201809 157048 229802 230119 206485 225113 374100 399884
19488 399884 680825 819808 652042 364050 162707 183368 306889 354551 94364 70586
19478 70586 171942 132899 174462 215117 215421 479580 611497 517379 433965 342644 416513
19467 416513 126068 279857 469734 423657 447852 333490 95754 120317 33790 256446
19457 256446 350033 89287 121927 227834 325024 361378 456025 388927 444184 346984 210637
19446 210637 139441 1244 21184 117114 219693 32149 173222 127819 -100754 -226836
19436 -226836 -199662 -150038 -386942 -362934 -289003 -87263 116546 275431 269351 118044 -57054
19425 -57054 82990 134714 -26608 -130186 -209190 -282507 -273732 -43131 -11010 -27243 38477
19414 38477 90637 167984 331246 191229 49260 293726 508679 565388 379785 56724
19404 56724 17183 150221 46392 101317 238075 80921 124022 175283 320575 292616 301878
19393 301878 131946 -79925 166786 344750 242823 274765 230417 340354 333238 324669 402408
19382 402408 374565 327521 599574 535482 451990 611818 782286 811727 622747 622396 901801
19371 901801 1080833 843559 739874 659865 588389 654188 801838 771311 367437 177335
19361 177335 293847 265568 401586 539223 709234 688434 670428 475926 358861 304678
19351 304678 414296 385754 224262 163909 122818 395147 516457 404462 133133 286105
19341 286105 195210 39365 292246 174058 198473 323971 593217 740543 648038 760405
19331 760405 509127 497475 567816 534525 768246 718444 407403 307903 372378 694360 672342
19320 672342 733445 642340 523777 575410 655812 761837 633200 605966 518735 476673 545641
19309 545641 376682 286909 203432 273748 424188 533574 804381 693675 656620 392001
19299 392001 289029 237958 300079 391663 355085 275973 167823 26597 -152413 48343
19289 48343 200900 301139 381258 193465 178643 442423 611656 556355 525081 505552 444689
19278 444689 203276 336572 382745 331795 286325 236544 121843 255493 261559 30439 2586
19267 2586 35072 252592 215185 103280 179903 257009 261291 287544 486340 673102 603103
19256 603103 273859 499071 511867 381182 359795 467928 580917 465871 343406 317992
19246 317992 312021 199759 103572 327200 506522 229442 141769 185948 233867 224428 260247
19235 260247 255031 32195 -164657 51618 193250 35522 -137798 -60534 72131 393207
19225 393207 368882 241564 202169 322501 375970 284838 280947 297969 231098 245657 99913
19214 99913 94547 215533 229899 114007 1714 167415 410029 435681 688868 835355
19204 835355 690104 456627 468113 781995 1104304 994522 1061963 1013861 806322 529188
19194 529188 433328 116081 247911 609810 666449 336489 264610 484822 831032 825499
19184 825499 719029 628139 650360 566884 587803 680086 887340 1089465 980810 1144950
19174 1144950 1185555 1230564 1159601 1062481 1210197 1494034 1656997 1689117 1711089 1806092 1925142
19163 1925142 2370097 2885870 3112957 2918513 3034314 3518034 3892575 4364554 4707587
19154 4707587 4959749 5346363 5677441 5933592 6438975 7147528 7937070 8561588 9160472
19145 9160472 10183587 11567839 13260795 15540366 18649352 23441642 30733881 41026667
19137 41026667 54465245 69090119 82147396 92221314 100326447 109238106 120748850
19130 120748850 134725911 148384189 156111347 154596535 145573633 134899535 127406734
19123 127406734 123785287 121035268 115608358 104051819 87069985 68994178 53896565
19116 53896565 43463142 36790330 32469318 29315882 27171683 25536996 24104848 23061857
19108 23061857 22386147 22060783 21308590 20774373 20463187 20390280 20288679 20342619 20404382 20443850
19098 20443850 20700329 21321927 22529812 24159534 26398331 29780715 35075127 43250303
19090 43250303 55552480 71816209 88971617 103748373 114480129 123194017 133172446
19083 133172446 146403662 161963705 175345048 180193167 174464408 161460857 148243927
19076 148243927 139698670 135359728 131550504 124316061 110988947 92714183 73424405
19069 73424405 57756025 47098651 40056000 35316797 31685747 28789426 26564858 24685112
19061 24685112 23167373 21830099 20575134 19430034 18694471 18246141 17742288 17042455 16357938
19052 16357938 15598235 14698631 13978780 13681665 13223654 12609935 11833741 11380527 10959570
19043 10959570 10282207 9758591 9418042 9072527 8758017 8151037 7849293 7799199 7530984
19034 7530984 7314374 7213021 6877370 6352975 5957872 5765899 5643647 5583594 5461893 5364469
19024 5364469 5316749 5293712 5079165 4928101 4684142 4495385 4079329 3754031 3866955 3926046
19014 3926046 3822081 3620605 3405773 3332542 3432825 3442222 3441047 3450200 3264210 3184481 3415057
19003 3415057 3225370 2988759 2931090 2694696 2686497 2724984 2574326 2579170 2532759 2361279 2149969
18992 2149969 2121107 1996565 1915123 1750234 1482185 1557626 1607375 1704420 1759623 1826258 1498430
18981 1498430 1338344 1162007 1111765 1213793 1376462 1423806 1368022 1212158 1046489 1111205
18971 1111205 1284138 1292556 1283560 1460873 1402851 1261828 1168537 1187239 1152250 981563 1022685
18960 1022685 1125638 1102289 1098189 1121811 1042091 1063608 1064851 1071200 1197387 1275293 1137953
18949 1137953 1189219 1243684 1289032 973401 935134 920395 802323 885210 831278 862591 1002812
18938 1002812 1038279 883850 694286 431818 573647 687826 566138 682553 589468 530325
18928 530325 412708 247682 253206 485718 478239 380738 404953 335007 330477 172564 164670
18917 164670 410583 569855 448407 433529 589916 492985 395742 332012 410849 603524
18907 603524 622478 838706 703071 534077 513604 746388 483004 403010 307611 222715
18897 222715 415276 601855 698506 423017 489244 559979 486713 399857 622555 650832 481489
18886 481489 511559 276561 253959 431790 443270 408786 433033 355604 478901 638991 565254
18875 565254 467769 533170 616221 467437 160260 127679 202642 394641 385709 339331 275804
18864 275804 338727 327450 411389 398907 404489 304137 322515 446389 522295 281718 311984
18853 311984 187341 395800 359051 366795 379863 413175 435258 383249 442788 480438 336719
18842 336719 295833 281134 330282 362502 506018 507853 433092 395717 453447 402881 233595
18831 233595 100554 357846 559779 426199 197600 -94402 -10161 51598 92760 -21856
18821 -21856 -228535 159082 466874 551742 556882 627020 502630 402624 311756 217599 149219
18810 149219 171920 246438 255028 527140 886710 1023613 1004649 1009504 800408 630316 737463
18799 737463 795270 801889 680158 747579 881362 424749 177444 216530 186687 398342 332205
18788 332205 270547 145486 183925 337488 388524 400333 205816 183524 363355 484932
18778 484932 242999 23871 -172060 -97982 -11846 -37314 -298083 124755 597108 586478
18768 586478 416922 418598 584715 593272 772712 836088 963214 850654 869938 1049159 870133
18757 870133 555341 503029 822984 973425 1048667 1220092 1195568 1153442 878605 581135
18747 581135 472349 510517 552923 363529 267676 297816 287109 273456 340524 380636 296415
18736 296415 188305 87192 313397 378491 194760 307478 373295 202785 147873 207181
18726 207181 186181 203725 487148 630592 374534 259801 47324 -93510 -182544 68549
18716 68549 184349 -2379 -108173 -76995 -19905 116690 207792 215967 337830 466054 529856
18705 529856 717944 573477 408231 465312 400054 465822 375210 292383 419607 606433
18695 606433 622072 451796 494648 455442 203795 171492 405365 369752 245038 260253 152552
18684 152552 225794 294158 284824 323747 423760 292455 142931 79341 145718 237831 135866
18673 135866 -112177 -113138 6472 -7662 -38733 116193 148721 182209 428189 402996 234079
18662 234079 277924 338934 629548 673492 547337 454803 151620 276542 353138 205759
18652 205759 239759 211837 143025 80869 92098 65586 -268488 -141783 -116553 28865 305873
18641 305873 609192 630793 807946 600381 392310 225046 153805 369079 517068 289652
18631 289652 139528 -17439 -125539 3040 -149142 86539 263629 372566 523837 575770
18621 575770 515033 497572 610273 759415 623142 388843 471599 335057 317549 320740 208663
18610 208663 165052 174747 245059 430847 521622 330898 246266 373734 582218 525982 468081
18599 468081 292505 350676 373242 83663 107069 25172 -71648 39225 45785 24393 -53791
18588 -53791 -67460 105993 187190 241193 303027 312228 224216 344656 528342 563731 702587
18577 702587 760165 645512 376623 432510 447922 679202 874706 811103 753165 920791
18567 920791 890157 660650 880520 1024126 1102509 1073411 837924 647441 694289 615208
18557 615208 568974 465047 452167 462206 237695 112201 141362 164099 179181 177383 168842
18546 168842 185807 64090 -87544 -194179 -26167 157439 163337 183577 275329 413309
18536 413309 293160 135154 -100613 -90632 -37668 115172 89259 127562 375549 497779
18526 497779 354200 146537 128371 135029 161946 120620 -118081 -330161 -139299 162791
18516 162791 184571 256897 68815 -71529 -41127 64660 128989 92662 151476 285400 159638
18505 159638 291547 276681 180879 118645 189774 331330 269609 62030 159516 50068 134736
18494 134736 196133 201440 302023 269116 127387 246855 74968 1666 29508 289582 345311
18483 345311 313308 189768 228174 37459 -80328 -143916 -101474 192459 291412 -98632
18473 -98632 -271491 -148080 164698 91926 193772 166571 107974 23476 -93788 -187031 -157002
18462 -157002 87891 -34883 -228486 143388 279496 298813 456265 458826 240237 76196
18452 76196 15912 64749 77152 -40452 -26398 126301 41231 74914 -18193 -77224 -341876
18441 -341876 -173581 250420 243357 69225 -51920 35711 96755 81018 -25134 -73 174861
18430 174861 192963 128341 245097 115096 66749 267587 403929 225580 342661 594414
18420 594414 390496 210118 -127598 -378608 -262047 -76490 242261 177847 228224 415359
18410 415359 459826 527765 578641 465244 262222 25396 188164 142223 31713 124883
18400 124883 102988 8795 241999 186290 333433 458861 687154 592885 300430 144909
18390 144909 330922 465890 316579 -7985 -210798 -159585 176834 217799 235871 366442
18380 366442 318238 534570 813613 748677 619012 489292 602030 693974 473468 344998
18370 344998 639032 785398 668194 531025 535640 601402 537801 481661 431299 460095 428866
18359 428866 178713 11421 108382 363814 573977 561880 277652 396413 652675 889434
18349 889434 804271 848695 1180998 1332277 969658 539625 474262 623659 796234 713021
18339 713021 684472 757377 807917 993073 1277409 1258490 1408607 1368885 1450720 1528439 1558757
18328 1558757 1745920 1931855 2066124 2507003 2868977 3139143 3356590 3392541 3590729 3873230
18318 3873230 3941095 3836856 3659849 3793019 4197474 4650581 4999464 5384494 6051377 7076527
18308 7076527 8306664 9866932 12098192 14842246 18728505 24322952 32801778 45274380
18300 45274380 61559446 78510548 90350493 96106843 100339859 104701749 108837893 111514435
18292 111514435 109537626 99071517 80182066 60412566 45546871 35698345 29251867
18285 29251867 24911788 21608632 19569138 18163004 16948742 15683983 14811963 14526708
18277 14526708 14502344 14245125 14062527 14163983 14291481 14157480 14060861 14025026 13850927 13677145
18267 13677145 13796502 14040134 13934368 13914706 14310241 15364290 16563371 18107373 20076366
18258 20076366 22579260 26448008 31955963 40218103 52290935 69846404 93855377 121659153
18250 121659153 147405134 166982815 179434616 187717645 195223019 201165641 202228326
18243 202228326 193074603 171011710 140525601 108772332 82380183 64392996 52644769
18236 52644769 44497142 38634917 34421766 31299984 28561023 26366696 24771860 23496585
18228 23496585 22398665 21613112 21026333 20398949 20042092 19791580 19329699 18883095 18335443
18219 18335443 17709506 17063696 16354317 15929439 15647561 15724904 15532835 15477525 15751737 16545403
18209 16545403 17559124 19208507 21483528 25053932 30724942 39347657 51256416 66053383
18201 66053383 79115687 86269120 89649842 92626238 96120833 99483340 100433635 95498709
18193 95498709 81937329 63478341 47662357 36727653 29485294 24784545 21531043
18186 21531043 19329213 17424277 15875428 14837528 14159268 13530675 12861262 12478948 11924919
18177 11924919 11486741 11249101 10818697 10303690 9853111 9658187 9284819 9098620 8592788
18168 8592788 8116637 7626193 7209684 6900016 6624593 6442259 6042575 5513889 5336871
18159 5336871 5118180 4976980 4838170 4721119 4802273 4731114 4610810 4558213 4453643 4400192
18149 4400192 4201435 3928301 3742124 3698834 3716695 3728317 3657693 3540095 3505315 3355082
18139 3355082 3086636 2805933 2807049 3022746 2874280 2901771 2706178 2644733 2726259 2702701
18129 2702701 2387800 2120408 1998940 2044668 2172821 2165815 1954500 1725330 1770174 1705772
18119 1705772 1671326 1762659 1645154 1621156 1892353 2042766 1830406 1489104 1224215 1283171
18109 1283171 1231039 1361177 1450652 1543213 1609574 1528920 1353946 1266985 1107069 1083006 1076864
18098 1076864 855771 716961 656704 458785 463614 384253 519855 712895 804792 886193
18088 886193 1097425 1066014 948877 976421 958781 769936 424712 287865 429120 728604
18078 728604 686615 722936 733397 520844 683375 852050 627816 496565 325015 476577
18068 476577 556317 412160 357877 507674 471871 312401 273964 304065 370403 392328 388509
18057 388509 430148 383044 243011 253857 222627 198033 354831 501931 619504 414232
18047 414232 250835 137837 -21961 110556 90033 397300 393977 223899 172570 591090
18037 591090 769149 697185 515948 260781 223307 507039 520945 225500 306650 90215
18027 90215 192839 283699 120579 191220 24367 -46553 49843 230891 220067 256104 22989
18016 22989 -39629 -43722 -106379 -151659 -156163 -104276 25932 159921 166276 66778 357510 213335
18004 213335 379277 420118 247938 150752 102904 42469 164004 238749 430760 743180
17994 743180 429416 141575 176649 233013 25216 -151639 -112905 58224 257879 319772
17984 319772 235023 257973 63449 21429 50274 93496 -169566 -65390 37026 -62880 -217732
17973 -217732 -484542 -538964 -121109 -96019 -159914 -80188 110276 287984 385814 567831
17963 567831 686264 585108 623401 469899 235790 323088 450927 655312 668041 754521
17953 754521 587209 662975 785679 591773 615914 696421 558007 467093 661901 726757
17943 726757 548075 631707 407418 381119 379493 482079 644312 495581 505626 481443 488921
17932 488921 541244 471263 398172 278343 299232 406695 368388 249832 212286 251987 175625
17921 175625 169105 160068 114682 -254952 -126641 51922 -200290 -288918 -153783 -66789 -54832
17910 -54832 -177140 -198070 -300053 -361555 -75538 56220 250941 324852 332458 238984 -16178
17899 -16178 -9792 98868 61066 61182 101948 12968 164301 140133 259040 324306 113542
17888 113542 5112 -22063 -156585 -169263 -283057 -153110 -173059 -132668 90610 -82411
17878 -82411 -262874 -239746 21400 207917 256171 495461 704452 581044 133819 -194775
17868 -194775 -235418 -264358 -109454 -126447 -210945 -175493 -242823 -139636 214719 63930 167606
17857 167606 196605 132965 321121 184404 201078 255275 305998 406563 208874 -76315
17847 -76315 -278080 -87355 66332 339770 603444 439608 40907 44054 -57269 1823
17837 1823 -118646 -248828 -213161 -76651 -123070 47218 5930 -25895 148929 155321 87770
17826 87770 66938 -53919 -193183 -349855 -127021 107228 -95313 -120097 -211471 -222484
17816 -222484 -42766 247142 310379 120752 99004 66007 37934 -56077 -249362 -455063
17806 -455063 -514515 -313412 -325071 -124002 46995 24078 -56118 -130023 -185480 -238077 -113677
17795 -113677 -23129 64611 6737 73959 121843 63470 124307 454540 517062 412644 271989
17784 271989 166289 222174 402775 505035 333023 272453 373220 464799 489075 505679
17774 505679 488061 497262 364669 305412 352152 467703 343780 355918 644102 842395 590663
17763 590663 531769 506265 526302 346222 307645 294038 140155 205213 142633 62123 41405
17752 41405 173536 353080 310429 108756 -8466 136323 -31221 121974 427664 397668
17742 397668 428503 675111 742957 593233 805348 986877 1016567 829260 759324 709134
17732 709134 516041 597124 693395 798752 1027391 1120385 1227547 1227849 1105645 920840 756244
17721 756244 509653 352253 212969 17453 217725 522560 390361 654440 596702 -94042
17711 -94042 -348154 -360965 -247002 -106773 5300 -38802 -115626 109132 208679 244335 104075
17700 104075 104301 282217 495738 331557 214149 259597 65596 -73441 -222780 -216124 -18859
17689 -18859 87898 42785 101336 252274 359634 490879 578910 658837 585731 557074 502962
17678 502962 222816 177405 246713 316948 185111 32138 68650 144951 223917 341535 348026
17667 348026 196287 -87832 -128703 151886 370348 530186 598037 379953 256622 411966
17657 411966 609059 404987 218885 166500 268469 279015 352023 358843 368525 432125 509328
17646 509328 438867 364327 139533 64187 83871 -12174 -56960 55113 78043 95538 9869
17635 9869 -13903 -7016 -63195 -28349 -215433 -269183 -79074 -169206 -135775 60161 71315
17624 71315 79707 -10844 -142427 -360152 -355064 -187592 -85593 103050 75285 116518 103830
17613 103830 126467 -83204 -267134 -84427 -148393 -243104 -200842 -168994 -163017 -260185 -56182
17602 -56182 -116511 -161762 -123157 -72106 -166582 -205509 -185708 -226556 -276062 -174161 22805
17591 22805 163996 356903 349747 130858 93886 62952 37984 93461 88602 -101200 -326142
17580 -326142 -504320 -235128 -97425 -77776 -52913 -87252 146430 272673 59293 36828
17570 36828 1778 -124119 -223401 -112599 100865 -1781 3030 -38694 -187985 -278816 -296331
17559 -296331 -74025 109615 215728 23584 -163888 -13199 40380 302423 39617 -330159
17549 -330159 -218658 46630 67819 242243 297354 304452 339096 309515 176547 -84365 121317
17538 121317 27155 -180287 14031 271098 92257 20251 311719 403542 263762 51786
17528 51786 -239177 -244214 -198108 -301917 -338245 -233680 -284903 -418270 -276263 -89219 -175387
17517 -175387 -202975 -25631 79654 215918 291768 61970 -83055 2431 5656 -127355
17507 -127355 -122027 -10875 8115 -244926 -4112 277832 204714 253135 134897 -173071
17497 -173071 -240285 -354378 -302371 -268103 -276086 -49476 -16873 16091 -248825 -233591 -234574
17486 -234574 -117681 -170455 -71547 -95102 -128105 -117472 -114729 -26247 -28457 63763 -89708
17475 -89708 -60352 -128346 -300669 -509853 -271422 -101880 -318439 -511196 -431029 -272125
17465 -272125 -59470 58490 66904 102085 -50077 -3024 242649 17491 -130460 -145225
17455 -145225 -181190 -16094 41890 6303 33458 159753 223755 84909 -46972 -27576 89668
17444 89668 114227 -107906 -17720 -16143 147909 229932 92345 -106859 -107875 -165574 -301070
17433 -301070 -254677 -56953 43190 26855 -120654 -23570 -143617 -142528 69728 85645 154807
17422 154807 355636 265875 95962 180644 55696 80694 79051 -215931 -445940 -42066
17412 -42066 196377 203751 64020 15953 59054 27247 81952 18847 -162103 -147670 -305241
17401 -305241 -342266 -120104 -31566 -275366 -279764 -53144 122084 7872 144224 178011
17391 178011 120162 120714 137756 193315 176933 148623 123695 -205955 -388470 -234365 111523
17380 111523 -83896 -511061 -548671 -304464 -114936 -220630 -173489 -6824 47114 46426 168647
17369 168647 456712 542622 212934 31582 4638 35939 138710 -35919 -15852 -55178
17359 -55178 -192105 -140277 -60021 -118231 -138343 -188029 -68215 -40336 -206757 -106641 -59480
17348 -59480 -14093 111844 105468 42806 25747 -3184 85770 197426 -5707 -375012 -458780
17337 -458780 -230848 91946 86969 -185593 -319501 -572570 -658630 -423972 -223342 -129892
17327 -129892 -41975 -182960 -264751 -483974 -592881 -345263 -213923 -197400 -99141 -42813
17317 -42813 -55678 67548 1485 -1942 101418 -97793 57150 150250 78387 218376 339628
17306 339628 -45115 15171 -267925 -81865 199348 282429 124522 60058 136098 71761
17296 71761 -67332 28644 122313 -62862 -398389 -390309 -310438 -255795 -41459 -22704 132365
17285 132365 -141015 -137197 -236620 -148652 132021 23818 -117202 -73331 -169754 -30166 -106170
17274 -106170 -410189 -163263 -69885 -69710 -79095 90274 313794 301161 261294 17485 78269
17263 78269 179611 146052 252445 377079 110866 -165913 -162744 -130308 44958 33642 -135610
17252 -135610 -184352 35250 95155 -59461 -122225 12409 42724 -4412 -121931 -248801
17242 -248801 -384828 -207395 -188401 -149028 -168897 -153346 -435847 -639369 -359610 -233888
17232 -233888 -476673 -523558 -514317 -352621 -522245 -482090 -57400 79506 -184896 -235926
17222 -235926 -6236 -38888 47395 91488 -70764 -161764 -445400 -648586 -447144 -31374
17212 -31374 275525 242036 143295 63999 -100904 -62458 -61945 -217544 -306317 -336472 -396563
17201 -396563 -642087 -467189 -278720 -102860 -113591 -466764 -403325 -183578 -113497 -93495
17191 -93495 -131519 154151 32964 -176696 -181765 48328 209832 102366 100754 -60959 -272074
17180 -272074 -173815 -214934 -115636 104478 230766 235345 211885 115472 -75685 -60537 -3252
17169 -3252 720 -92958 -220652 -80896 45188 164399 311306 138372 119500 259735 68583
17158 68583 78554 348790 357401 188480 253750 565061 636752 117852 -70187 58690 -129428
17147 -129428 -481663 -616173 -581095 -419125 -98090 -79314 -155300 -74540 -10089 -135772
17137 -135772 -12723 121854 15935 -249866 -419400 -454593 -435368 -235187 -115428 -212056
17127 -212056 -419513 -263161 -143357 35358 -18407 66869 115931 -44315 2270 -99929
17117 -99929 -241723 -58830 105205 382245 487616 199677 48034 -118321 -319633 -463772
17107 -463772 -347324 -316957 -487011 -191011 81179 144123 28002 37184 -71652 -267043
17097 -267043 -257615 69115 10966 -118925 36979 254876 -14160 22728 89313 -108623
17087 -108623 -583722 -610606 -220800 -107685 -233192 -234869 -129754 -359556 -782474 -808381
17077 -808381 -743312 -594113 -446226 -367865 -203182 -244133 -343310 -419874 -461216 -303598 -246794
17066 -246794 -288453 -133068 -34225 118524 -199776 -356991 -186572 -236425 -184980 -98308
17056 -98308 -52681 -114487 -157406 -88380 -116461 -73641 -121231 -72363 -156282 -144945 -54942 -47069
17044 -47069 -17027 124682 -30674 -109636 -53516 144243 110481 -176201 -314599 -284219 -191308
17033 -191308 -302763 -317241 -258313 -173361 67739 177295 11359 -118727 -122083 17235
17023 17235 129246 13700 -250658 -347326 -365720 -169816 -194417 -138177 294956 426611
17013 426611 284477 194521 292243 298540 134361 52684 75740 -110461 28814 57163 -160504
17002 -160504 -264536 -282677 -327376 -290734 -151706 70228 148009 201 -296424 -438185
16992 -438185 -497141 -259664 -206951 -156785 -305451 -330285 1905 238628 282372 441390
16982 441390 629791 569718 346721 171612 33488 -22722 102412 42382 17104 19665 -355086
16971 -355086 -505077 -293556 -152787 -48797 58278 67455 3771 -32453 -61408 -40126 70042
16960 70042 -197187 -111003 6335 -128707 -166433 -167572 -135038 -93135 -137939 -264067 -487993
16949 -487993 -575906 -363880 -177162 -237333 -76303 165165 200993 50751 -73878 -248602
16939 -248602 -106097 -231246 -367059 -248499 17934 69103 182646 75958 -164622 -182015
16929 -182015 26609 69417 -8372 -80564 -275805 -213153 -65715 -173795 -100040 -103149 -270933
16918 -270933 -216353 -309253 -317743 -117036 -151604 -165560 -264480 -454953 -491430 -441034 -388247
16907 -388247 -341583 -472289 -570565 -546796 -411340 -361653 -211031 -165760 -2171 60188 -115497
16896 -115497 -282247 -255442 -359817 -217549 -187864 -373987 -644506 -421601 -75593 137196
16886 137196 134340 180219 337161 437811 464350 144627 208900 129105 107558 205506 369259
16875 369259 15188 -87247 -192531 -412327 -521999 -412330 -280484 -325980 -169752 -124058
16865 -124058 -62657 -281860 -489469 -237843 24776 -205730 -191873 492 51314 20408
16855 20408 -77549 -263037 -306650 -110496 57290 -26301 -178962 -214457 -210165 -219717 -346298
16844 -346298 -399774 -524979 -633068 -654218 -513588 -287759 -43539 -27169 -13649 -95200
16834 -95200 -173001 -71841 -38729 -68765 -106596 30628 221674 271672 103385 -24696 -63948
16823 -63948 -230813 -129547 -80801 232071 388808 146555 -106679 -209928 -241872 -239332
16813 -239332 61746 124375 173007 -168843 -315309 -397468 -330143 -146557 -233135 -109350
16803 -109350 -173801 -227532 -184013 104922 -19519 -248815 -316062 -68437 69174 121547
16793 121547 130001 -130912 -162340 -31044 -14474 -207627 -238426 -461471 -427358 -327663 -168121
16782 -168121 -102741 -13723 46515 129618 34686 104622 144843 103889 297624 302062 202808
16771 202808 61335 76572 33294 -187463 -363053 -474932 -365657 -290511 -81447 308870
16761 308870 186531 -184437 -196986 -122698 -83968 98151 180706 368886 183875 -68376
16751 -68376 -38059 -111227 -251006 -60626 13265 15348 81514 341673 211770 137345 -212477
16740 -212477 -252986 -88630 -7631 121112 137135 93870 -141675 -339944 -278505 -142379
16730 -142379 12021 -20942 -226843 -254476 -429741 -588466 -551689 -241834 -172374 -315670
16720 -315670 -97674 -140856 -196333 102036 -140198 -251107 -278817 -307885 -136142 -185160
16710 -185160 -221165 -219211 -466785 -487880 -451903 -396575 -230411 -423261 -571893 -196105 110777
16699 110777 150342 223726 192198 -71286 -237304 -127466 93635 175329 259366 334848 62864
16688 62864 -63774 -115687 -324973 -338542 -254240 -118736 -85937 -40980 -83643 -10389 -107020
16677 -107020 -115362 3732 -36486 -22680 -152941 -202592 -191051 -92182 -97707 -179914 -336714
16666 -336714 -182435 -82887 -62786 -109694 -223619 -249298 -154926 -54841 49578 -169077
16656 -169077 -113995 78903 -99965 -121043 -361428 -611843 -552163 -248401 -36641 48201
16646 48201 -293702 -293925 33381 71428 -205717 -167502 -96742 -103860 -137662 -309074 -230792
16635 -230792 -112131 -241520 -114056 -56911 1808 -2404 71374 154919 -141333 -78886 -3541
16624 -3541 -220084 -390634 -566187 -745096 -547208 -384378 -248801 -140721 -6125 -83719
16614 -83719 -164626 -234606 -423971 -470948 -187515 -164885 -41156 -47509 -280949 -194575 62840
16603 62840 6331 -199472 -187817 -230571 -11297 71152 -7997 -157776 -117889 51787 1963
16592 1963 -15912 45749 -36228 50913 -39380 -147446 -302654 45484 253476 162014 35434
16581 35434 134229 288679 112085 113979 220116 322408 465681 298320 42478 -171052
16571 -171052 -357624 -260684 -171767 -164414 -19417 -127445 -268883 -471981 -450556 -95440
16561 -95440 -63055 -97852 -294033 -255509 -89195 124682 124364 235229 358855 141504 -135238
16550 -135238 -202888 -68905 78095 -47268 -206296 -227334 -148505 -84864 -233093 -467345
16540 -467345 -442934 -66011 59882 110451 50325 -26920 -91045 -233825 -133306 23994
16530 23994 42683 121235 -174191 -187049 111833 112451 -47993 -48427 -59616 20504 277761 254985
16518 254985 184894 146797 -248342 -497511 -274710 -187831 -81968 265530 374267 189119
16508 189119 83730 46438 57831 186715 136460 174925 -2753 -331539 -376300 -257716
16498 -257716 -253857 -288386 -357240 -249666 97395 216295 123527 -39505 144460 164274 37267
16487 37267 9729 79259 195137 98586 -235136 -608965 -555785 -450147 -324851 -652253
16477 -652253 -684845 -628085 -580712 -519996 -416259 -127021 194861 202787 874 -156905 -133283
16466 -133283 -69696 -173549 -203963 -194174 -220800 -240437 -360448 -240908 -252260 -584463 -671442
16455 -671442 -517122 -440557 -448874 -193975 -297308 -407948 -310688 -156759 35497 105898
16445 105898 -58498 -114877 9077 -190258 -402576 -368492 -218805 -108396 -27665 220853
16435 220853 326369 95223 -6832 -11089 -35985 -25105 -148920 -153482 -45073 -53581 100098
16424 100098 150057 85177 120215 9087 -153744 -87142 -81103 -286712 -214178 101562 100310
16413 100310 44789 -22206 205314 246379 -59440 -263004 -236970 -64604 -113359 -267644
16403 -267644 -464788 -608945 -470973 -376888 -145845 -72887 -288920 -539085 -553507 -319365
16393 -319365 -297099 -228772 -22286 289581 89524 -479469 -585089 -424785 -264030 -183514
16383 -183514 -258928 -352257 -244365 -379508 -538357 -470048 -274374 -46554 148759 -32845
16373 -32845 -166420 -75657 66133 180700 194910 -51131 -124309 -20980 159284 173551
16363 173551 148261 77272 -7521 -36874 35907 -64417 128181 130856 246290 321359 267061
16352 267061 226846 222895 137519 64668 -14723 -136046 82757 322525 395979 167136 234098
16341 234098 437969 443626 305962 -49495 -215930 -430065 -244900 -97175 -16053 57906
16331 57906 -33303 257847 173474 36623 -93877 -112796 -86255 197099 283133 89166 6052
16320 6052 238681 371974 172968 -238221 -352345 -228798 -177441 -219083 -420125 -642002
16310 -642002 -729467 -481860 -83179 -68141 -344255 -555516 -445319 -242266 -146648 -89866
16300 -89866 -17081 135106 129108 162232 43835 -70942 22834 -22657 -62929 148703 189563
16289 189563 68176 178952 255354 290116 139493 68556 35713 109711 168931 94709 7638
16278 7638 249718 143292 187879 85568 -19852 -31983 -149211 -82170 113512 179277 350159
16267 350159 525789 345623 243108 353198 453183 439107 319403 299616 67220 -113717
16257 -113717 57692 157357 91328 22746 -83266 -93531 -26449 28630 -73053 -210696 -277144
16246 -277144 -369462 -304098 -101909 -85372 -108142 -142094 15103 4435 -409988 -492541 -379541
16235 -379541 -79205 -64954 -78219 -35649 -127353 -174380 -62627 139853 431960 291531
16225 291531 149512 125515 308296 321773 338483 192147 -92479 -129435 -180491 -157476 -106437
16214 -106437 -136238 -71109 146023 28531 106509 136626 132439 -16985 -65092 -14449 130782
16203 130782 154582 323221 316923 76698 -20712 60664 -12460 -130116 106020 159584 34386
16192 34386 1663 30821 137741 122843 85295 308280 186455 -60516 41411 116142 -156347
16181 -156347 -101179 -21216 -151288 -287438 -285733 -351331 -353105 -271566 -264540 -334720 -385890 -174702
16169 -174702 -63529 -142015 -2704 70212 -101211 -110675 -122793 -104538 -138957 -363069 -611046
16158 -611046 -301090 -439325 -484033 -203757 -172546 -117656 -141190 -233726 -284030 -241276 -247124
16147 -247124 -112064 -264485 -382065 -350899 -97023 -45599 -87531 -393615 -679600 -447933
16137 -447933 -204334 -137854 -162068 -91506 -113332 -122679 24459 233046 154398 179243 170557
16126 170557 -83823 -200094 -262660 -267819 -196805 -17873 44422 -31131 115329 318532 363288
16115 363288 407577 301850 398206 486112 286498 190100 34233 -174328 -57883 113962
16105 113962 182455 190564 -33465 71080 46745 -81348 -236089 -235741 -248352 -277284 -229638
16094 -229638 -70647 19329 -34573 -293164 -312712 -285098 -396620 -481708 -414017 -328904 -194683
16083 -194683 -123235 -187977 -199023 -122975 -189951 16760 348707 251729 95903 209715 116666
16072 116666 136718 61805 51481 -236515 -242782 -254116 -179627 -139371 -80454 -183637 -230345
16061 -230345 -16259 -55079 -491502 -500359 -244250 -208093 -196027 -257109 -376756 -378104 -320453
16050 -320453 -231126 -194209 -173110 -88569 6922 22000 -196203 -369357 -311031 -438682 -394590
16039 -394590 -452193 -506050 -446485 -279804 -284667 -376473 -116172 44080 -130461 -4405 275167
16028 275167 328216 96956 -111044 -163997 -136827 -47521 -306693 -512606 -594110 -491333
16018 -491333 -143936 -177423 -376495 -191427 53513 144291 34942 166018 296899 167486
16008 167486 89543 51822 -33921 -57108 -135974 -118463 18746 -74101 -345371 -135566 -71417
15997 -71417 17947 40704 -164918 -53408 -136829 -168557 7663 131609 59689 -144129 -174748
15986 -174748 32439 -4890 -143408 -97216 -48646 -139272 -246384 -74723 60530 93660
15976 93660 53484 111077 88 81659 86923 -83605 -177319 -147815 -180754 -80889 -175131
15965 -175131 -327248 -174845 102182 128861 4737 -5912 22265 45438 -43977 -349061
15955 -349061 -355250 -222637 -75225 98641 241017 269936 291692 173111 198801 185008 89185
15944 89185 -215821 -510411 -256047 -202187 -2191 20182 -218306 -79849 139626 176852
15934 176852 92335 123717 171983 45406 -72606 -48557 69988 235916 255459 -26468
15924 -26468 59406 84363 140544 302660 247059 140019 43254 45020 18289 -100520 -199887
15913 -199887 -158550 -175152 -393366 -317893 -177396 -152632 26365 -45457 -105056 -329464 -429376
15902 -429376 -379987 -487060 -235039 116237 229462 68150 -86797 -132894 -59073 237417
15892 237417 230215 129101 -48933 -138219 -194720 -226646 -230814 -222908 57190 209235 134375
15881 134375 146222 214089 63959 87823 -47849 47552 155202 214848 257143 165301 177749
15870 177749 -26355 30309 224172 99836 62944 269464 350032 70839 -222024 -393564
15860 -393564 -125565 85521 185598 -21922 -146194 -197727 -197637 -128062 164854 162713 94501
15849 94501 141390 127950 20794 -142072 -324904 -476885 -487316 -621780 -570466 -454195
15839 -454195 -255694 -287752 -67984 227857 22832 22065 39399 -17063 -166511 -345918 -333969
15828 -333969 -456666 -289550 -295444 -424344 -238790 -94570 -46692 -247539 -362791 -446402
15818 -446402 -458221 -403130 -578242 -557772 -561406 -179419 87524 -32192 -130441 -48314 32063
15807 32063 73720 241401 217881 -26315 -92079 136514 299223 119670 -107922 -236645
15797 -236645 -434910 -460918 -336535 -331440 -323705 -150621 -13451 -73852 -61945 193843 -63477
15786 -63477 -167566 -152471 -175556 -180082 -314914 -363394 -435794 -537709 -370337 -364953 -235553
15775 -235553 -59103 -28087 -9601 -322105 -474197 -169253 -120067 -8837 98993 5292
15765 5292 -26809 -30339 -205091 -164210 55961 53188 -155290 -334663 -291394 -135299 36324
15754 36324 -140987 -521130 -621103 -380575 -173974 236358 395746 221941 212591 -117510
15744 -117510 -252920 -14905 -27025 -63800 -162078 -250382 -226443 -319949 -411736 -215905 -181832
15733 -181832 -38074 188276 123969 -46481 -92946 31454 78093 -42744 -175946 -185562
15723 -185562 -253169 -364056 -316511 -321347 -268535 -67211 -47035 -106227 -4884 -99588 -19158
15712 -19158 173206 243682 355524 390362 88478 -137327 -316705 -246763 -335425 -226652
15702 -226652 -209403 -210174 -172390 -192805 -324863 -351646 -282571 -316309 -338527 -54226 -60717 -224527
15690 -224527 -231313 133320 287846 129768 98225 152217 -48539 -301350 -475538 -469619 -453729
15679 -453729 -348524 -74445 78791 -11165 172341 415621 477815 318677 103328 -162287
15669 -162287 -152544 -252745 -125485 35735 -4116 -159326 -336948 -387691 -312904 -252576 -280142
15658 -280142 -286884 -333771 -239906 -204467 -173227 -82949 90173 126914 272071 333826 226276
15647 226276 157132 138982 454799 455765 99137 31623 15281 140761 316584 287082 166493
15636 166493 -16604 -88046 -326579 -179937 -83659 -323075 -545917 -453653 -330532 -115463
15626 -115463 98644 89327 -15653 -81220 145562 154035 -340 55926 57743 -36596 -103453
15615 -103453 -69367 -174275 -134844 218610 244012 216211 -74083 -231434 -131040 225722
15605 225722 189265 -157681 -212332 -97894 -200975 -459256 -658060 -565214 -327891 -368269
15595 -368269 -345645 -49753 -38702 -112523 -93448 -108366 44745 11328 57121 -33328 -118311
15584 -118311 -115806 -42183 -22063 189801 232428 53676 25580 -158135 -237407 -240102 -173821
15573 -173821 -130544 -198566 -128796 67836 -183131 -346396 -150741 -216015 -477731 -390957
15563 -390957 -261162 -134975 -242174 -185166 -93276 -159405 -239960 -59615 129566 63241
15553 63241 50697 -13847 -40150 -59985 -185237 -139604 35856 95068 -24447 10987 229089
15542 229089 95157 -55324 250171 99319 -145440 -309229 -240006 966 72150 -53026
15532 -53026 25594 95322 119996 -151803 -261651 -280211 -97667 80645 91267 367850 246651
15521 246651 -144680 -171663 -8340 72258 70918 53368 172122 -67054 -201045 11658
15511 11658 149528 201203 174707 -94689 78953 46173 -206624 -273136 -154348 -9746
15501 -9746 12835 -43819 5412 65097 89082 100301 -25901 -86442 -56923 -89087 -52337 -285933
15489 -285933 -387072 -303424 -218516 90110 719 -46427 -137490 -175374 -71137 -47557 -158535
15478 -158535 -150203 15433 159241 355038 248852 125215 -50200 -323672 -361846 -167266
15468 -167266 -245537 -263544 -378404 -417341 -42553 166142 378600 223212 267256 263978 372999
15457 372999 392970 104905 -1363 99192 190514 -4258 -148439 -151251 1935 345214
15447 345214 222500 -76538 -140851 -7582 259259 581251 528605 383387 20304 67558
15437 67558 97332 -50828 -80583 -89890 123083 85482 30162 158045 -63016 -31340 -5247
15426 -5247 -95374 -255773 -143994 169257 -66401 -143119 -32150 -67368 59277 -80485
15416 -80485 -311357 -204434 -12548 56221 -103409 -142109 -39099 122915 284496 160069
15406 160069 287209 185037 144171 126124 75833 213947 136079 -98062 -51977 100113
15396 100113 215617 265454 313089 209853 -82590 -196870 416 -32102 34700 -56684
15386 -56684 -258140 -255683 -347609 -398355 -391961 -169430 -296477 -443329 -361134 -215137 -225845
15375 -225845 -185831 -50584 84189 120785 276163 375316 277910 107211 14201 138577
15365 138577 166067 -106913 -256424 -194232 21052 -194294 -314954 -552631 -589568 -512074
15355 -512074 -346570 -175816 -210441 -246306 -202429 -309436 -500189 -260515 -45028 -31183
15345 -31183 110113 103049 -15133 -5374 71071 115806 68549 -176819 -93843 102540 72892
15334 72892 -190486 -167031 -111580 -137653 -125227 -113669 -5536 63788 -78674 -245745 -83854
15323 -83854 100727 -14723 -183641 -315845 -73749 -5269 -182693 -84810 127286 5216
15313 5216 -215323 29202 75823 -236472 -401035 -356749 -162158 -82918 121765 155719 180448
15302 180448 -53488 -169842 -208839 -266369 -99874 226359 268221 162706 387331 422272
15292 422272 136119 -59860 -162235 -233970 -77820 -170939 -393989 -461999 -458684 -530117 -333623
15281 -333623 -59330 -162400 -326331 -298804 -305599 -183238 -157129 -16928 -32131 -97965 -97611
15270 -97611 -267138 -93470 -24026 71559 35435 42997 -28190 -192802 -118201 -114348 -304048
15259 -304048 -298913 -348093 -424200 -109676 99074 95003 11724 -103139 -102628 -39743 -29143 -179279
15247 -179279 -355448 -291616 -369447 -222208 -202049 -234235 -262070 -270156 -144891 -160182 -174444
15236 -174444 -280664 -187375 -55095 -96503 -288119 -365647 -480505 -260344 -157748 -393620
15226 -393620 -500056 -244007 -84764 74879 77193 -253267 -216263 56162 -27512 -275891
15216 -275891 -548506 -479477 -454432 -285564 -214427 42153 134891 88385 131081 -68105 -249595
15205 -249595 -104209 31608 16590 -219541 -153764 -194036 -315425 -669265 -683247 -585660
15195 -585660 -413539 -47139 377482 331883 307174 307069 171136 14226 -237033 -171322 80786
15184 80786 214036 373522 380723 195931 139740 6637 -65708 53739 138102 118128 40704
15173 40704 36618 -63572 -8354 43129 349202 348360 367656 -19566 -301201 -210293 -56579
15162 -56579 42642 25097 96757 167654 79503 -4143 167865 133240 -76566 -231644 -417705
15151 -417705 -460918 -478551 -396057 -282289 29254 73367 -25654 -30622 -30231 89604 37245
15140 37245 -63831 -125752 -151734 -219462 -126859 -339349 -303779 -157343 -139094 -116874 -38711
15129 -38711 106423 46839 2564 148594 299192 430410 485949 354721 15293 -144666
15119 -144666 -259229 -445781 -283481 -237204 -337567 -577963 -670458 -386348 -214393 -145644
15109 -145644 -5060 -47278 -111098 -267943 -248710 -145049 288924 337628 288432 488416
15099 488416 389022 71412 -68857 32598 14457 -32325 42808 42543 40870 148211 -178312
15088 -178312 -207723 -89116 -284811 -437706 -394205 -85294 46717 -86272 -186276 35748
15078 35748 -38958 -32259 606 -32396 11525 -70059 -29182 12277 33042 -274878 -463520
15067 -463520 -335769 -294485 -129407 -105569 -343861 -499651 -250626 -154962 -133821 -355150
15057 -355150 -405959 -162868 -3844 213217 180097 -15108 -35384 93827 157605 217255
15047 217255 189106 12927 -228648 -326606 -33228 -192407 -274145 -316158 -248203 -84587
15037 -84587 -35285 -129793 7550 -74759 129950 5808 -147794 -196643 -123138 50708 -172531
15026 -172531 -243916 -112066 -188341 -208800 3589 -63861 -279903 -467983 -490255 -457503 -479910
15015 -479910 -415857 -755 87934 -121799 -207755 -191548 46614 120637 180659 305919 214498
15004 214498 -32017 -347877 -476882 -407511 -200178 79537 279021 343823 210369 83511
14994 83511 -300259 -398651 -227729 -217652 -155147 82102 311995 393965 360856 137505 95466
14983 95466 -86908 -386959 -61855 193147 43275 111910 236222 343155 447183 337690
14973 337690 64802 -167607 65003 -130234 -153335 8479 -79466 -138504 -279599 -399814
14963 -399814 -78331 43359 -216427 -320205 -308356 -400625 -550591 -623682 -480648 -431387
14953 -431387 -98591 22672 -136231 -180910 -33148 25078 309908 323772 186503 263797
14943 263797 280909 127139 73930 157339 120683 144609 197739 226800 183690 221515 243253
14932 243253 182531 -9942 97694 308856 215234 22122 -12904 26018 -76081 -100195
14922 -100195 -378771 -457792 -367220 -389466 -143509 55003 -48557 -243218 -227201 -70464
14912 -70464 -57767 -28896 87557 -64761 -104692 -142516 -357398 -476386 -417920 -475298 -299832
14901 -299832 -266067 -363991 -101246 -3523 148226 101671 53299 -140775 -261300 -316741 -500714
14890 -500714 -423547 -182867 -243686 -220847 -239003 -324995 -474629 -443273 -262763 -201915 -323791
14879 -323791 -311002 6806 11269 75223 242814 215257 140134 258819 67532 -117848 -223050
14868 -223050 -9714 -109781 -205854 -197730 -2054 163297 39787 -241978 -332388 -221468
14858 -221468 -165561 -203476 -289292 -265793 -293506 -454226 -715723 -620178 -531078 -443206 -275991
14847 -275991 -43584 -208848 -132318 -4646 142034 52386 -113103 -88542 33055 101790
14837 101790 -1566 -7878 240758 360427 189069 -94736 -280218 -424802 -467839 -201651
14827 -201651 55674 71166 77101 165600 160287 -2167 -17274 45924 -260664 -401937 -536235
14816 -536235 -517156 -255846 71011 79548 68606 31012 28083 128144 117142 225641 297342
14805 297342 209023 154495 246642 463198 237734 262364 187645 235059 217976 24264 -59776
14794 -59776 -246902 -259989 -189340 -195862 -128896 -73738 -293219 -535835 -555757 -451264 -34764
14783 -34764 54441 -1079 42987 132139 99540 104547 43756 -139848 -108344 -25499 -29156 211341
14771 211341 156375 -132461 -239605 -40197 -61016 6274 106855 9221 -128771 -218250
14761 -218250 -156033 146038 36047 -8697 185865 66518 -17286 -42398 -75414 -207925
14751 -207925 -208298 -153758 -319311 -392860 -8785 107135 179561 413135 391303 451345 253245
14740 253245 44536 -5444 -49610 76409 181725 94074 17346 162721 137766 -61356
14730 -61356 -104014 -38414 278259 396379 152367 86127 50038 -46454 -127988 15832 -646
14719 -646 -42182 -239247 -80937 -78456 -21787 -135801 -270167 -245247 -212074 -164425 -203391
14708 -203391 -384284 -337680 -79130 84690 96318 -121073 -217642 -165601 -213014 -335494
14698 -335494 -184290 -34348 -46735 -59586 -127586 -122000 -230637 -163110 -126200 -167639 -1492
14687 -1492 -68547 -196835 -111157 86041 33861 -91294 -226077 -243233 -162440 -162806 -67044
14676 -67044 6069 74449 178763 103457 -238300 -233202 88762 205384 137462 4207 25629
14665 25629 -50663 -238618 -160975 -31732 -79123 -5780 -98176 -53589 63137 121985 -26798
14654 -26798 -238011 -416007 -388443 -397129 -200716 -137670 -52981 -112019 78209 73297 -121259
14643 -121259 -12429 36776 137518 -91938 -364745 -363773 -224087 -233056 -313642 -106930 55419
14632 55419 144081 205471 -17375 -143267 58433 391675 340448 60331 -53146 -88187
14622 -88187 -206057 -346222 -343564 -302559 -94920 14954 121365 179444 -8159 -206969
14612 -206969 -58297 25439 -294660 -280884 -112868 -67202 118283 266375 249369 12445
14602 12445 43072 210123 233359 60701 -34482 -126062 -226521 -170699 51022 -48397 -125877
14591 -125877 -292164 -114984 13522 66269 -15782 -105194 -286746 -478637 -452395 -335655
14581 -335655 -169524 -68576 -296945 -98997 177479 126340 -1220 2446 -25701 -64905
14571 -64905 -164704 -18160 17470 75857 -132218 -82053 -16845 -35753 -61836 -227480 -276884
14560 -276884 -158413 24196 -51933 -280603 -257983 -240360 20476 115631 -8425 -203380
14550 -203380 -146144 -221806 -231019 -235538 -172638 -92712 -118158 -177522 -77889 68688 52836 147714
14538 147714 118775 120425 -31660 -93384 -91965 -57060 -169577 -217334 -128682 -26981 -60641
14527 -60641 -95367 -94714 -16807 -53737 -100559 -70852 -165708 -266488 -134233 -178393 -134607 -57147
14515 -57147 1799 55400 4811 -16494 -149634 -252627 -71370 76794 -5422 124627 227572
14504 227572 178599 192266 388500 132255 6923 51325 33219 -18946 20392 10070 -25168
14493 -25168 -183121 -169912 -156276 -171098 -92470 -69744 74899 -25880 -108932 -39341 50321
14482 50321 161234 59951 13469 26425 -23375 57618 -114282 -357926 -293169 -139480 19946
14471 19946 73423 152893 277415 92871 -26436 -66757 -2260 -75856 -158151 -16641 45277
14460 45277 72032 101327 29813 257386 -72228 -440767 -396080 -516019 -624538 -539769 -418808
14449 -418808 -304656 -229665 -265398 -209203 34050 -40618 143855 194527 166829 61988 202700
14438 202700 62264 3140 31788 231652 322911 201445 256717 135939 -161900 -343310
14428 -343310 -238325 -68234 -32354 109821 236816 460537 308495 -120434 -271011 -405604
14418 -405604 -346439 -124925 90531 -41004 33176 55499 129706 72987 -60573 -93724 30376
14407 30376 79349 80468 101251 65916 46993 -38673 -76085 154190 202498 41915 -1714
14396 -1714 -255210 -351109 -104591 -8128 -82322 -164327 26869 118746 240706 103950 60942
14385 60942 44707 126301 267916 297009 60242 -197009 -396490 -343136 -75362 180010
14375 180010 89922 -140909 -164917 277877 343328 159720 -7873 -55684 160528 345260
14365 345260 356250 60697 -141353 -300301 -284406 -309055 -213958 -195156 -84650 -214702
14355 -214702 11564 191209 236669 452702 412659 299924 121069 -201138 -598609 -611051
14345 -611051 -378385 -354879 -574633 -531749 -155063 -116938 -164607 -250228 -213191 -93701 171899
14334 171899 211130 55468 95458 129817 -296673 -607200 -586259 -241243 -190173 -139405 -329013
14323 -329013 -264126 -357670 -421761 -520469 -365620 48957 91902 37535 -23984 -233475 -334096
14312 -334096 -488425 -575114 -300656 59201 -18622 -105364 -71429 97360 199782 434323
14302 434323 391121 153782 -9388 -22110 108479 -94778 -354341 -273900 -218103 -143368
14292 -143368 -76604 -154440 -356166 -158370 82069 187843 127321 38288 -7405 -182531
14282 -182531 -171529 -246536 -256369 -161612 -101423 -215565 -157270 -28796 -148863 -213909 -142093
14271 -142093 -120073 -99763 -180732 -319609 -287051 -78663 55443 -163831 -333983 -395989
14261 -395989 -204285 20052 210767 157219 -26734 -3942 146733 335718 391895 352782
14251 352782 479159 305290 274398 75445 -101023 -252705 -399179 -504487 -272263 15442
14241 15442 34670 149619 239781 143117 191323 109846 129666 33459 -235182 -365540 -198829
14230 -198829 -344418 -287439 -132373 -17759 -29159 64716 19068 -148022 -245023 307027
14220 307027 716666 523709 372546 238522 260150 238638 171708 -79974 -354274 -257495
14210 -257495 54242 132642 26914 -86227 14759 248138 95898 -74189 -340600 -313040
14200 -313040 -78718 -8867 -36128 75847 252942 210670 118683 -22394 -119687 -199096 3329
14189 3329 132741 -83453 -50767 -106389 -100484 78620 269266 129574 -209611 -558191 -563178
14178 -563178 -296631 -420410 -185208 -68104 -162177 -218640 -174998 -1413 -135895 -273984
14168 -273984 -377399 -531948 -249962 -176025 -362239 -464084 -471806 -276619 -33162 -17640
14158 -17640 199386 207790 124999 36456 78995 111363 33200 -198189 -217966 -283545 -205933
14147 -205933 -83936 79637 222840 -99396 -405323 -405914 -434098 -242465 -39633 172182
14137 172182 85335 -41745 -38527 -95924 -39981 -88028 -162743 59999 339455 280246 133656
14126 133656 11553 36822 -265921 -191876 120318 216326 112428 286955 389905 488796
14116 488796 342810 224916 44582 -59375 -104199 -233400 -52693 63905 118505 -24727
14106 -24727 -244757 16820 37955 201193 -8831 170785 584131 580150 376620 467114
14096 467114 329743 36410 -76211 -153727 28431 -34720 -96808 71334 111914 36874
14086 36874 63151 57035 -212732 -228821 -65383 151808 -73322 69819 311019 143531
14076 143531 180387 226518 199163 112075 2015 23902 26460 223763 413655 536658 276975
14065 276975 88129 -80636 -87408 -208310 -300294 -333988 -185976 -135649 168151 253477 148328
14054 148328 -95195 -101316 -103111 -2264 -297 -78740 6071 -39096 -2927 181101 94036
14043 94036 33830 35274 59337 44803 114382 107301 142291 67229 86913 58122 61453 21027
14031 21027 90748 -36331 -37676 -80144 -37598 41071 -48149 -100269 -49505 36711 -25142 -87394
14019 -87394 11179 66827 242957 193721 262958 500057 271693 72193 -55884 -127451 -251819
14008 -251819 -142174 -180929 -80265 -395329 -523797 -409392 -364925 -234169 -227398 -167393
13998 -167393 29928 256095 395390 189813 -147672 -255394 -446559 -239193 -153466 -297764
13988 -297764 -435176 -210101 -291498 -211131 -194085 -249728 -358015 -513555 -295717 -146706
13978 -146706 -30283 7373 -36383 -177879 121549 299884 248595 -16904 -88243 217976
13968 217976 210996 77351 -83 88620 17294 -136677 -123524 -145024 -307638 -331479 -385404
13957 -385404 -578026 -615058 -531951 -431263 -421520 -98229 -7950 -137167 -328145 -451673
13947 -451673 -304758 -153011 -245433 -198825 -85290 -272378 -238561 -170207 -317093 -413821
13937 -413821 -364690 -347246 -261701 -135455 10858 76945 -88496 -475939 -549521 -216065
13927 -216065 -31957 -263192 -404092 -483073 -141336 -37083 133500 36460 -146107 -74942
13917 -74942 -176183 -182234 49641 386701 405782 278644 366988 355087 256251 133326 -154396
13906 -154396 -228340 -317398 -333028 -312337 -390681 -315646 -271839 -350855 -272505 -201290 -82448
13895 -82448 56086 -139482 -179780 -11047 54024 -1440 -176558 30 180390 150078
13885 150078 101103 7900 -106826 -92140 -30574 30510 -166351 -152243 -47128 -29936 215991
13874 215991 323174 359242 337938 249458 274728 210804 206648 261430 267504 152899 -106413
13863 -106413 -177714 -63682 19681 -39572 -92603 6435 -25760 35718 150375 65697 -165819
13852 -165819 -132410 -107962 -28616 293492 474715 78104 83137 87977 -259110 -57429 223634
13841 223634 392128 508473 470405 66243 -188129 -263558 -312076 -144450 -38736 -183698
13831 -183698 -449314 -224160 -256434 -381948 -167391 44480 -101674 -116142 -148387 100991
13821 100991 231676 202585 -2509 -161204 -178169 -137910 -181081 54224 240517 41573
13811 41573 -54914 27732 37206 39712 213248 261041 279323 137459 -62065 -13495 -36161
13800 -36161 -86507 -26220 79449 48732 -33440 -143037 -126612 -298182 -580768 -508674 -375882
13789 -375882 -369758 -159955 25643 146342 364457 300476 32932 41156 239667 281546 -132607
13778 -132607 -185282 -211693 -499642 -462443 -386344 -404961 -499789 -257782 -133103 -215330 -224528
13767 -224528 -214529 -19500 179102 158509 49124 -174692 -172944 -116551 6150 83495 -81255
13756 -81255 -126079 -215722 -183109 31737 149309 334514 559179 518384 182863 -12599
13746 -12599 58843 167233 17691 -223321 -91927 -135500 -36007 -11932 -102744 -85429 -231152
13735 -231152 -223822 -23516 90666 -120744 -102533 -83163 -108496 -75609 27417 -99707 -199163
13724 -199163 -380129 -314865 -219966 -399426 -417233 -308611 -154905 -153842 -293490 -101522
13714 -101522 139134 302478 221101 109453 32361 -151205 2136 51612 -53985 -207413
13704 -207413 -191085 -146048 -259564 -128073 -4177 -88530 -48889 98260 281976 390012
13694 390012 380805 271516 325787 360285 303972 150928 28247 -68886 150222 121461 -129891
13683 -129891 -66669 116949 81800 9412 -251927 -336546 -35170 124115 252314 160967
13673 160967 -91832 -259289 -119394 -291252 -410764 -331636 -184019 -316650 -491726 -277220
13663 -277220 -94095 62214 220726 272149 50956 -84201 -187639 -89081 116687 86535
13653 86535 -10408 -58192 43906 -69786 -144591 -72932 -45900 182105 286514 -61682 -292344
13642 -292344 -203298 -150645 -160841 -151603 -132189 -210488 -184485 6692 320508 327513 102647
13631 102647 163027 217056 289147 381485 280243 4194 -108097 79215 268917 212048
13621 212048 264760 342556 167790 -27285 -128789 -212798 10311 124727 197945 124184
13611 124184 107854 158080 51872 155768 113113 251249 329655 254957 259569 -142643 -464698
13600 -464698 -380476 -146296 -266537 -230975 42805 252690 277237 230033 -54999 -282072
13590 -282072 -289218 -439166 -336417 -417086 -645246 -723523 -599762 -212148 -27882 -114091
13580 -114091 -136991 -202738 35765 113583 106295 358682 496150 363687 395573 249172 81506
13569 81506 5346 134382 210963 110997 98790 97885 -29805 -203772 -278894 -224873 -9262
13558 -9262 80739 64449 33573 535 -93699 -182409 -36869 22266 130626 388466 441187
13547 441187 40294 -64497 61190 92892 255943 320920 297706 303112 548005 685541
$$ [...]
##END NTUPLES=NMR SPECTRUM
##END=
