##TITLE=Analysis number 321391
Compound Code spb 05494
Project Code adrs
Chemist Name fudan
##JCAMPDX= 6.0         $$ Bruker NMR JCAMP-DX V2.0
##DATA TYPE= NMR SPECTRUM
##DATA CLASS= NTUPLES
##ORIGIN= Bruker BioSpin GmbH
##OWNER= nmr
$$ XWIN-NMR		Version 3.5
$$ Wed Aug  9 09:38:15 2006 GMT Daylight Time (UT+1h)  MAYBRIDGE\nmr@NMR_250MHZ
##.OBSERVE FREQUENCY= 250.131544655141
##.OBSERVE NUCLEUS= ^1H
##.ACQUISITION MODE= SIMULTANEOUS (DQD)
##.ACQUISITION SCHEME= undefined
##.AVERAGES= 16
##.DIGITISER RES= 18
##SPECTROMETER/DATA SYSTEM= dpx250
##.PULSE SEQUENCE= zg30
##.SOLVENT NAME= CDCl3
##.SHIFT REFERENCE= (INTERNAL, CDCl3, 0, 16.4792)
##AUDIT TRAIL= $$ (NUMBER, WHEN, WHO, WHERE, WHAT)
$$ ##TITLE= Audit trail, XWIN-NMR		Version 3.5
$$ ##JCAMPDX= 5.01
$$ ##ORIGIN= Bruker BioSpin GmbH
$$ ##OWNER= nmr
$$ C:\u/data/dgb/nmr/ADRS/460/pdata/1/auditp.txt
$$ ##AUDIT TRAIL=  $$ (NUMBER, WHEN, WHO, WHERE, WHAT)
(   1,<2006-08-09 09:37:51.52 +100>,<MAYBRIDGE\nmr>,<NMR_250MHZ>,
      <created by zg, POWCHK disabled, PULCHK disabled
       configuration hash MD5:
       E2 DF 36 D8 04 B2 41 60 5A D7 A3 38 5A 4B D0 FE
       data hash MD5: 64K
       26 36 3E 9A 93 EA 57 E8 B5 FB 1C 1D 6E 11 3B 09>)
(   2,<2006-08-09 09:38:03.51 +100>,<MAYBRIDGE\nmr>,<NMR_250MHZ>,
      <Start of raw data processing
       ef LB = 0.3 FT_mod = 6 PKNL = 1 SI = 32K 
       data hash MD5: 32K
       FC 3E A1 CD E5 E6 54 A0 7B ED B6 72 D2 70 70 25>)
(   3,<2006-08-09 09:38:05.41 +100>,<MAYBRIDGE\nmr>,<NMR_250MHZ>,
      <apk 
       data hash MD5: 32K
       15 98 F4 16 0E AF 4D 64 80 81 C0 30 C5 F8 9F 9B>)
(   4,<2006-08-09 09:38:07.26 +100>,<MAYBRIDGE\nmr>,<NMR_250MHZ>,
      <abs ABSG = 5 
       data hash MD5: 32K
       E2 9F B8 07 C7 47 14 11 C5 C3 C6 B3 62 DC EE E7>)
$$ ##END=
$$ 
$$ hash MD5
$$ D5 75 CB 47 32 D3 AE 8B EE EC 85 F0 FF 10 00 FA
##$RELAX= 
##$RELAX= 
##$RELAX= 
##$RELAX= 
##$RELAX= 
##$RELAX= 
##$RELAX= 
$$ Bruker specific parameters
$$ --------------------------
##$DU= <C:\u>
##$EXPNO= 460
##$NAME= <ADRS>
##$PROCNO= 1
##$TYPE= <nmr>
##$USER= <dgb>
##$AMP= (0..31)
100 100 100 100 100 100 100 100 100 100 100 100 100 100 100 100 100 100 
100 100 100 100 100 100 100 100 100 100 100 100 100 100 
##$AQSEQ= 0
##$AQ_mod= 3
##$AUNM= <au_zg>
##$AUTOPOS= <5 >
##$BF1= 250.13
##$BF2= 250.13
##$BF3= 250.13
##$BF4= 250.13
##$BF5= 500.13
##$BF6= 500.13
##$BF7= 500.13
##$BF8= 500.13
##$BYTORDA= 1
##$CFDGTYP= 0
##$CFRGTYP= 5
##$CHEMSTR= <none>
##$CNST= (0..31)
1 1 145 1 1 1 1 1 1 1 1 1 1 1 1 1 1 1 1 1 1 1 1 1 1 1 1 1 1 1 1 1 
##$CPDPRG= <>
##$CPDPRG1= <>
##$CPDPRG2= <>
##$CPDPRG3= <>
##$CPDPRG4= <mlev>
##$CPDPRG5= <mlev>
##$CPDPRG6= <mlev>
##$CPDPRG7= <mlev>
##$CPDPRG8= <mlev>
##$CPDPRGB= <>
##$CPDPRGT= <>
##$D= (0..31)
0 1 0 0 0 0 0 0 0 0.06 0 0 0 0 0 0 0.0002 0 0 0 0 0 0 0 0 0 0 0 0 0 0 
0 
##$DATE= 1155112670
##$DBL= (0..7)
120 120 120 120 120 120 120 120 
##$DBP= (0..7)
150 150 150 150 150 150 150 150 
##$DBP07= 0
##$DBPNAM0= <>
##$DBPNAM1= <>
##$DBPNAM2= <>
##$DBPNAM3= <>
$$ [...]
##$SUBNAM7= <"">
##$SUBNAM8= <"">
##$SUBNAM9= <"">
##$SW= 20.6930455092707
##$SWIBOX= (0..15)
0 0 3 0 0 0 0 0 0 0 0 0 0 0 0 0 
##$SW_h= 5175.983436853
##$TD= 65536
##$TD0= 1
##$TE= 295.16
##$TE2= 300
##$TE3= 300
##$TEG= 300
##$TL= (0..7)
0 120 120 120 120 120 120 120 
##$TP= (0..7)
150 150 150 150 150 150 150 150 
##$TP07= 0
##$TPNAME0= <>
##$TPNAME1= <>
##$TPNAME2= <>
##$TPNAME3= <>
##$TPNAME4= <>
##$TPNAME5= <>
##$TPNAME6= <>
##$TPNAME7= <>
##$TPOAL= (0..7)
0.5 0.5 0.5 0.5 0.5 0.5 0.5 0.5 
##$TPOFFS= (0..7)
0 0 0 0 0 0 0 0 
##$TUNHIN= 0
##$TUNHOUT= 0
##$TUNXOUT= 0
##$USERA1= <user>
##$USERA2= <user>
##$USERA3= <user>
##$USERA4= <user>
##$USERA5= <user>
##$V9= 5
##$VALIST= <valist>
##$VCLIST= <CCCCCCCCCCCCCCC>
##$VD= 0
##$VDLIST= <DDDDDDDDDDDDDDD>
##$VPLIST= <PPPPPPPPPPPPPPP>
##$VTLIST= <TTTTTTTTTTTTTTT>
##$WBST= 1024
##$WBSW= 4
##$XGAIN= (0..3)
0 0 0 0 
##$XL= 0
##$YL= 0
##$YMAX_a= 526665
##$YMIN_a= -412916
##$ZGOPTNS= <>
##$ZL1= 120
##$ZL2= 120
##$ZL3= 120
##$ZL4= 120
##$ABSF1= 16.47918
##$ABSF2= -4.213993
##$ABSG= 5
##$ABSL= 3
##$ALPHA= 0
##$AQORDER= 0
##$ASSFAC= 0
##$ASSFACI= 0
##$ASSFACX= 0
##$ASSWID= 0
##$AUNMP= <proc_1d>
##$AZFE= 0.1
##$AZFW= 0.1
##$BCFW= 0
##$BC_mod= 0
##$BYTORDP= 0
##$COROFFS= 0
##$CY= 12.5
##$DATMOD= 1
##$DC= 0
##$DFILT= <>
##$DTYPP= 0
##$F1P= 14.0000005364418
##$F2P= -0.99999901652339
##$FCOR= 0.5
##$FTSIZE= 32768
##$FT_mod= 6
##$GAMMA= 0
##$GB= 0
##$INTBC= 1
##$INTSCL= 1
##$ISEN= 128
##$LB= 0.3
##$LEV0= 0
##$LPBIN= 0
##$MAXI= 10000
##$MC2= 0
##$MEAN= 0
##$ME_mod= 0
##$MI= 0
##$NCOEF= 0
##$NC_proc= -3
##$NLEV= 6
##$NOISF1= 0
##$NOISF2= 0
##$NSP= 0
##$NTH_PI= 0
##$NZP= 0
##$OFFSET= 16.47918
##$PC= 1
##$PHC0= -2.896719
##$PHC1= 4.589557
##$PH_mod= 1
##$PKNL= yes
##$PPARMOD= 0
##$PSCAL= 4
##$PSIGN= 0
##$REVERSE= no
##$SF= 250.130010709749
##$SI= 32768
##$SIGF1= 0
##$SIGF2= 0
##$SINO= 400
##$SIOLD= 32768
##$SREGLST= <1H.CDCl3>
##$SSB= 0
##$STSI= 32768
##$STSR= 0
##$SW_p= 5175.98343685301
##$SYMM= 0
##$S_DEV= 0
##$TDeff= 65536
##$TDoff= 0
##$TI= <Analysis number 999999
Compound Code 99
Book Reference 9
Project Code 9>
##$TILT= no
##$TM1= 0
##$TM2= 0
##$TOPLEV= 0
##$USERP1= <user>
##$USERP2= <user>
##$USERP3= <user>
##$USERP4= <user>
##$USERP5= <user>
##$WDW= 1
##$XDIM= 32768
##$YMAX_p= 317240411
##$YMIN_p= -222938
$$ End of Bruker specific parameters
$$ ---------------------------------
##NTUPLES= NMR SPECTRUM
##VAR_NAME=  FREQUENCY,     SPECTRUM/REAL,   SPECTRUM/IMAG
##SYMBOL=    X,             R,               I
##VAR_TYPE=  INDEPENDENT,   DEPENDENT,       DEPENDENT
##VAR_FORM=  AFFN,          ASDF,            ASDF
##VAR_DIM=   32768,         32768,           32768
##UNITS=     HZ,            ARBITRARY UNITS, ARBITRARY UNITS
##FACTOR=    0.157963299565203, 1,           1
##FIRST=     4121.93731538863, 0,            0
##LAST=      -1054.04612146438, 0,           0
##MIN=       -1054.04612146438, -222938,     0
##MAX=       4121.93731538863, 317240411,    0
$$ Real data points
##PAGE= N=1
##DATA TABLE= (X++(R..R)), XYDATA
$$ [...]
21305 -5798 -2919 1708 2834 4438 4569 1939 7432 11354 12549 8768 4594 4044 3808 12236 12510 8293
21289 8293 10525 8090 12983 13560 9188 5063 -839 4625 4384 9215 8977 6671 5105 6895 6962 6365
21273 6365 2144 5403 2464 -7117 -11660 -7289 801 3463 49 -1108 1032 1356 -127 5306 7457
21258 7457 1567 -2046 -3936 -776 5854 2479 3619 4814 915 718 3819 4495 -105 3380 5225
21243 5225 7189 11984 12018 9701 11071 7657 973 4138 11485 3457 -3311 -4743 -4414 -10224 -8409
21228 -8409 -3480 1419 338 -4038 -3633 -11887 -10639 -8051 -7506 1044 5431 852 -3576 -1507 1116
21213 1116 626 5630 5203 -3127 -2523 4518 5566 5372 3373 3666 448 4061 3147 10599 6166 3087
21197 3087 -1747 -616 3046 1327 -433 1104 -317 -921 1871 -2916 -5186 -3294 -3690 -6452 -8336
21182 -8336 -7101 -7347 -14706 -12967 -7048 -6964 -324 5277 -618 -3676 -225 1515 -930 -6639 -8407
21167 -8407 -5634 -3748 -6678 -7294 -4421 1103 2874 -4011 -5417 1073 3072 3706 4221 1615 2652
21152 2652 -1293 -1176 -4948 -9972 -15865 -15732 -8795 -12104 -15119 -14712 -8888 -3009 -5717 -4537 3144
21137 3144 6595 3445 2164 1751 -127 5985 9122 406 -2869 1026 -4085 -7622 -8063 -3387 561
21122 561 212 -2789 -6224 -9991 -7492 -4395 4906 4621 -4244 -11443 -13176 -11541 -9326 -8823 -9601 -10060
21106 -10060 -8918 -7226 -9333 -10625 -5329 -3913 -2077 -1742 -4945 -778 -878 2756 7331 7151 8992
21091 8992 6950 7595 10505 8889 742 -3846 -8861 -9141 -7761 -7588 -12062 -16506 -12620 -823 -1238
21076 -1238 -4583 -11063 -6112 2139 1379 -2209 -5385 -3437 -5872 -10647 -16302 -15547 -5806 -5389 -3608
21061 -3608 -1267 -1827 -4557 -7367 -12016 -15837 -15091 -11869 -11236 -11197 -9150 -10370 -9939 -10670 -18039 -14491
21045 -14491 -14930 -9978 -6980 -6633 -4755 -8595 -10553 -8594 -10207 -7883 -3082 -2664 -5861 -8077 -9029
21030 -9029 -6935 -2623 2844 3866 -1194 -3358 8448 14485 14754 6588 7589 6043 1180 -3539 -3381
21015 -3381 -6996 -9783 -4849 -4977 -3651 -2125 -8671 -3995 1109 -5756 -4920 -4259 -2570 -9176 -18220
21000 -18220 -12987 -3653 7228 10445 10622 5896 7557 8494 7901 9041 2312 3172 81 1028 1413 -5015
20984 -5015 -4596 -724 868 4125 5698 357 -5990 -4847 -6376 -9597 -8004 -7952 -2107 -5 -2551
20969 -2551 -6558 -8659 -5485 -261 -2909 105 5336 1922 -3207 -2279 -2709 -1792 2337 -932 -9453
20954 -9453 -7536 -3524 4597 493 -7971 -11311 -8792 -6257 -8051 -9130 -14231 -14681 -14128 -11464 -11685
20939 -11685 -10782 -10448 -14012 -13686 -9226 -5015 -1974 -4948 -9157 -11592 -6613 -6412 -11277 -7307 -1846
20924 -1846 -5501 -3544 1726 891 -4412 -6793 -4926 -660 3751 1282 124 1983 284 -1937 -3434
20909 -3434 -3519 693 4679 -2390 -3546 -5128 -1639 -852 3843 12847 18801 10141 -2831 -8978 -11419
20894 -11419 -15435 -7296 -10777 -12902 -7508 -1628 -1490 841 -605 -2056 -6003 -12048 -7141 -3681 -5005
20879 -5005 781 1278 2841 -174 -5959 -4037 -1847 -2733 2538 -5648 -5652 -1397 -5049 -7477 -8679 -3284
20863 -3284 -838 -199 1613 -1252 -1290 6274 2392 -3507 -533 2242 6879 6467 4774 3511 -878 2001
20847 2001 -1136 -3996 -1266 -5322 -11578 -13054 -5970 1547 -3834 -7591 -5758 -2473 -691 -3199 -9974
20832 -9974 -6580 -2872 -3256 -3190 -6240 -6013 -808 -5271 -7547 -6730 -4491 -949 3118 4555 7021 5721
20816 5721 -550 -9883 -8230 -1626 377 1462 1383 -15 3161 4122 -3571 -986 -784 -8806 -13121 -15105
20800 -15105 -7292 129 896 2357 7522 4767 1732 1404 3677 6391 3775 2979 5454 5521 4312 629
20784 629 -3893 -2997 -4157 -5402 -7159 -11656 -12281 -6724 -2549 -1281 139 -5704 -3315 -3546 -8177 -8914
20768 -8914 -1713 -776 233 -4250 932 1595 -2620 -6647 -5803 -2907 6222 6330 2256 -525 -6889 -7428
20752 -7428 -6174 -617 938 5829 7353 1939 -2419 -4330 -2094 2344 5988 6042 4365 -942 -3020
20737 -3020 -7040 -9109 -7715 -1113 269 -5580 -11297 -13849 -14114 -16864 -14910 -13630 -8518 -8602 -7413
20722 -7413 -11775 -8409 -3256 19 -2367 1617 4792 -1066 -4227 -2555 -3728 -8378 -11541 -11085 -10639
20707 -10639 -4562 -1877 -2455 4603 2567 -1321 -704 1311 -6023 -5101 -3854 -8003 -8926 -7361 -319
20692 -319 -6694 -7607 -3539 -588 -961 1944 3184 302 -6499 -5150 -5480 -3502 1093 4942 4107 6977
20676 6977 9256 11039 4312 -3179 -1993 2892 5070 4254 -1299 2971 3695 2569 1982 -695 -1663 2526
20660 2526 5635 4910 2042 -4461 -4009 8431 15253 11632 8335 4934 5000 1258 672 3358 6487 4644
20644 4644 3208 2677 4937 4578 2423 3372 1189 248 -2137 -295 5426 5974 5441 1582 -2968 -4279
20628 -4279 -2278 -14 5998 3917 4597 6580 8656 6932 -880 -2377 3032 4355 5950 10233 6425
20613 6425 -3543 -5771 7549 11648 5596 3291 -505 -5012 -6314 -627 3498 7078 3357 -1068
20599 -1068 -4394 -5420 -7675 -9775 -6793 -11854 -13625 -18799 -19702 -14667 -2010 1363 2565 -1960 2834
20584 2834 6180 7420 8655 9256 1567 72 722 -5000 -14612 -11944 -9270 -6087 487 6180 4286
20569 4286 2284 1100 -4835 -1957 2470 6553 10024 10920 13085 12625 13426 9020 3269 3818 -1397 -736
20553 -736 -6680 -9285 -8269 -7289 -3431 -7661 -3441 1114 -565 -10815 -10180 -10768 -6207 -7612 -13760
20538 -13760 -18926 -13373 -9409 -3250 5519 4992 -989 -842 -3651 -7021 -3601 -8443 -9391 -6345 -7829
20523 -7829 -9360 -7956 -4770 -1313 -942 3896 7127 6657 -397 -3657 3881 7271 2836 1932 87
20508 87 -6820 -3287 3387 4994 8641 5475 1986 -5618 -4165 -3431 -196 6098 8643 8064 1185 -975
20492 -975 -2385 -2186 1343 -2760 -5327 -2835 -856 -3027 -12783 -18172 -17778 -15458 -12547 -16169 -8971
20477 -8971 -200 5270 4176 6666 9844 6413 3678 -362 40 -8245 -15200 -13776 -7742 -993 8319
20462 8319 8080 4475 -4350 -10816 -8638 -9677 -4731 2353 -3552 -10691 -11614 -7742 -5976 833 7435
20447 7435 -1014 -4409 -6167 -8965 -11726 -11732 -5185 -3211 -7694 -3630 -1966 -8250 -9232 -2475 631 -1579
20431 -1579 -5759 -9424 -8029 -152 -5939 -3695 -6376 -3282 -2389 -5665 -6537 -4915 -4464 -3099 -4930
20416 -4930 3606 8672 6651 -2267 -4684 2048 3255 2164 2640 669 -615 4495 -3492 -8883 -12651
20401 -12651 -13035 -18330 -17065 -8174 -3006 -1507 1288 6208 8822 5172 4506 2889 -2049 -4368 -4553
20386 -4553 -11504 -19675 -21438 -18429 -15342 -14995 -17707 -19779 -10639 -7320 -5751 -1920 -10005 -7901 -9560
20371 -9560 -11163 -6752 -4747 -8614 -8912 -4777 5877 9988 8332 9221 14274 18270 14394 10633 2228
20356 2228 -2819 -1999 -1147 -163 -1753 -4135 -5334 -8124 -10562 -7873 -3932 -3814 -2018 1787 3384 2317
20340 2317 -1021 -4849 -8188 -7366 -10946 -7451 -5886 -11319 -17476 -11460 -6055 -5462 -8420 -3727 1438
20325 1438 696 -8997 -14285 -16358 -16549 -15998 -19150 -16711 -13945 -9725 -10035 -5801 -7453 -4040 1892 8386
20309 8386 10796 6323 6827 3251 -3263 -4994 -653 2705 6758 7105 12045 2892 -9788 -6687 -3447
20294 -3447 1680 5611 2263 -417 4211 4343 2393 -81 3672 6239 5432 929 -3126 -5642 -5885
20279 -5885 -2626 390 1577 4265 10434 4949 5230 5413 8367 13523 14835 9363 1041 -1543 -4046
20264 -4046 -2468 -3134 -5213 -3740 208 -6715 -5175 -4250 835 4471 7081 4942 5842 -482 -5532
20249 -5532 -5513 -4425 -4851 -9137 -7494 -7992 -8235 -3057 -855 649 412 -596 -186 -1923 -3511 -3536 -6483
20232 -6483 -9802 -7154 -5324 -7540 -8357 -5501 -6457 -7270 -7064 -3488 -1490 -2479 -197 -5294 -2641 3440
20216 3440 4231 3372 4452 5244 5405 6731 13180 18446 12737 11272 9355 -526 -10337 -6434 -804 1951
20200 1951 5667 7087 4356 4425 626 -6752 -11790 -11159 -5417 2851 4877 2732 984 25 3106 3929
20184 3929 4350 5031 -3690 -7938 -2386 363 2885 -971 -2649 -4431 -5414 -5750 -3494 -1768 1735 -1290
20168 -1290 -5808 -5300 -1888 1934 1261 3480 334 -1251 -4877 -3117 -651 -736 -5473 -6623 -1952 848
20152 848 -1719 -8049 -9768 -7403 -6337 -6412 -8476 -7189 -5895 -644 2267 2849 3173 4079 1694 6733
20136 6733 3242 -3053 -5100 -1384 -6165 -12711 -10738 -1524 -3131 -7272 -9647 -3493 -1608 365 -574
20121 -574 -4979 -1402 -932 -4567 -3601 3499 2130 -3206 -11397 -13778 -15142 -10076 -7157 -4550 -2502
20106 -2502 -676 408 5759 378 -7724 -3257 -4066 -2531 -3832 -7294 -4720 -563 2801 6688 8208
20091 8208 8336 9429 7576 2020 -2422 -7534 -7191 -3135 1770 3595 128 -1688 -4271 -5021 -9893
20076 -9893 -14802 -13075 -6122 -8225 -6681 -9090 -9714 -5672 -2451 -1330 -1863 1294 775 1418 2417 -5304
20060 -5304 -5961 -6117 -10888 -18095 -16602 -13687 -7729 -1642 -618 -41 -992 2420 1628 7140 10444 8788
20044 8788 5587 9267 8723 5973 -4298 -10349 -3020 -348 -2381 -5630 -6310 -7598 -1997 5703 680
20029 680 -1860 -1201 -4446 -4291 -2296 -7529 -8976 -4073 -1916 3338 -3948 -3728 -3217 -913 1577 3157
20013 3157 4001 7001 3065 2871 1034 -4031 -5484 -5357 -3583 -6192 -11041 -10235 -2894 -5071 -7722 -8768
19997 -8768 -5730 -4892 -5628 -1624 -3928 -7564 -3508 -3009 1001 2868 -2196 -48 1837 970 -2768 -4227
19981 -4227 -7011 -14976 -15738 -14340 -8250 -5653 -1154 3326 147 -6753 -11633 -15370 -15543 -11500 -8693
19966 -8693 -6279 -7201 -2026 -5257 -15272 -15754 -11611 -9693 -10188 -10963 -8633 -10011 -8037 -6332 -2249
19951 -2249 -2942 -4471 -1282 -1720 1756 -1078 -1590 -378 867 270 -1482 -3983 -6181 -10001 -9496 -11745
19935 -11745 -7360 649 9789 9646 9664 7035 3724 -2165 185 5301 -287 -5932 -4323 -6006 -3624
19920 -3624 -2735 -5438 -9839 -4723 -6130 -6135 -7153 -7020 -2915 -2163 -7530 -3376 -3065 799 -1285 107
19904 107 1399 264 -1568 -6287 -7836 -9300 -6463 -805 -2397 -2835 -4255 -83 307 379 1940 2522
19888 2522 -1942 -10790 -13490 -16573 -22132 -20659 -16384 -10220 -7252 -9321 -11459 -5629 817 -63 -4079
19873 -4079 -2899 -6715 -14736 -15387 -11615 -5221 1489 4051 -1246 -4677 -2312 -5700 -1981 -108 2932
19858 2932 2712 3765 12463 7646 1842 1333 -216 375 6404 6141 6615 8175 2755 -3977 -8429 -7112
19842 -7112 1749 3098 5595 1425 -5049 -8319 -4105 2044 2546 -435 -1566 273 -4753 -11718 -8529
19827 -8529 -5879 -7572 -3951 -4384 -4495 -4778 -3820 -605 -2740 -2579 10 6698 6698 6535 6356 13519 8086
19810 8086 5194 4877 5299 -3505 -5699 -5158 -1609 -1863 -24 -414 306 4764 -679 -4685 -3631 977
19794 977 -7921 -8564 -5973 -3909 -1307 -723 -9904 -13931 -9781 -6207 401 1197 3033 3026 172 -6313
19778 -6313 -12836 -11030 -5064 -1676 -448 7487 15723 8703 -4064 -10826 -12005 -3407 7326 4146
19764 4146 3192 332 -1222 460 -705 -1730 -3140 -6907 -7466 -10092 -7368 -6527 -1933 9946 10917
19749 10917 2989 -2247 -3439 -4678 -5810 -3637 -8107 -7716 -1479 2632 -1899 -825 -1817 -4469 -2743
19734 -2743 2293 -4077 -4818 -4131 -2054 -4340 -9198 -7867 -13100 -9277 -9808 -10474 -11194 -6077 -3747 -3231
19718 -3231 339 8502 8116 2210 -4798 -2489 2815 8268 6826 7382 6825 5366 -228 -5994 -5641 497
19702 497 6897 6785 8047 9417 12245 13103 15794 14839 12628 7756 1237 -3465 -6048 -332 3067 1545
19686 1545 -10007 -14271 -6359 1055 4345 -4030 -14333 -11856 -4356 -6756 -4719 1420 -1172 -12874
19672 -12874 -8122 -3052 452 -2841 -11843 -13075 -11696 -9968 -4223 -2775 -2712 -3775 -1550 399 1128
19657 1128 -5981 -12507 -10105 -11913 -7146 339 -2756 436 -2190 -11030 -10346 -6014 -6898 -11516 -6165
19642 -6165 2835 -977 -1595 -4038 -3229 -4512 -6331 -369 3557 7624 16928 11230 9624 10265 1307
19627 1307 -5313 -1359 -1375 -2966 -3332 -3289 -2847 2503 2109 -4664 -8948 -2326 1647 -3658 -11399 -10494 -8444
19610 -8444 -6983 -10514 -11825 -11903 -11525 -6136 -1558 794 2273 282 -4533 -7933 -2847 -1863 -761 -3955
19594 -3955 -4958 -6703 -6090 380 4926 4487 1038 -1370 -3603 -3748 -3085 -1481 3295 3776 -2020 -1497
19578 -1497 457 1918 882 -1146 345 -1587 -1257 108 -2877 -9771 -12632 -10601 -7487 -6584 -2984
19563 -2984 -5583 -6184 -1407 -6965 -7250 -8759 -13987 -10262 -5362 -5343 -10165 -11611 -12171 -7356 -8700 -4522
19547 -4522 -1745 -5633 -5636 -2342 1592 889 -3035 -5042 -10611 -15778 -6526 2208 -4332 -3466 -4171 -1582
19531 -1582 -386 -1147 -1206 -6761 -1383 2324 -336 -2307 -623 515 322 -5047 -4218 -6463 -5983 -9122
19515 -9122 -8561 -6919 -11818 -13199 -13650 -12634 -12835 -7236 -6977 -6467 -6169 -5743 -3319 -239 -2457 -4548
19499 -4548 198 800 3187 -2581 -2537 -3985 -2332 -4787 -5794 -4376 -1001 -174 3777 288 -1330 -4498
19483 -4498 -9256 -7991 1404 3812 320 -1071 2385 1481 2442 8682 8383 1169 6376 7755 5302
19468 5302 884 -1073 -2246 -1211 159 -2897 -4262 -817 4541 509 -2098 -2611 -1668 434 865
19453 865 -171 -8320 -4664 -5152 -6108 -1914 -3482 -8418 -7741 -10969 -7247 -2390 -5602 -5007 -1000 1667
19437 1667 -2059 -761 4839 4908 4406 3906 6393 3228 3412 2840 1497 -1494 -5618 -6486 -1791 4450
19421 4450 4120 4719 5119 1387 -3366 530 -871 -3450 -4699 -10062 -5412 -3647 -8887 -14670 -16760
19406 -16760 -13793 -11761 -13038 -14644 -11904 -7434 -2302 1093 -7182 -12270 -15238 -14732 -17113 -13765 -7634
19391 -7634 -339 -3382 -9329 -8306 -9921 -8847 -6932 -9164 -8840 -4552 -5392 -4653 -5254 -4801 -4625 -3906
19375 -3906 -5178 -3700 -37 2348 4227 5528 4370 1476 16 -1293 -4028 -7563 -12354 -11227 -14628
19360 -14628 -14249 -8568 -3321 -2845 -5163 -1039 3808 1240 948 -30 -912 -5415 -700 1807 -5447 -8218
19344 -8218 -8446 -11204 -13995 -12576 -11897 -4887 -5681 -4981 -5987 -9530 -12491 -8112 -5707 -203 4127 1492
19328 1492 -7627 -12005 -11213 -6030 -2298 -6783 -6957 -6137 -7006 -4928 -6959 -11575 -8988 -6710 -4054 -10507
19312 -10507 -13102 -8780 -10935 -8519 -656 4573 3748 568 1150 1545 -1830 -2422 -5189 -5660 -1534 829
19296 829 1182 5513 5506 5213 10240 8195 1889 2655 354 -353 -271 -304 -3142 -6462 -10090 -15555 -14956 -16621
19278 -16621 -16944 -13341 -12753 -12289 -8877 -6325 -7394 -8835 -14500 -13222 -7085 -10681 -13156 -17983 -15482
19263 -15482 -9842 -4203 -1998 -6125 -13126 -8328 -8124 -8834 -8086 -5434 -1144 4852 605 3789 4339
19248 4339 2418 569 409 2567 1253 -605 -5093 -1498 -3205 -7786 -7776 -4711 185 -6610 -12329
19233 -12329 -14635 -16516 -15371 -12912 -7774 -10624 -15199 -15389 -14141 -10940 -5588 2724 3196 4076 -2677
19218 -2677 -10762 -6057 -594 993 183 2729 1769 1460 1022 3902 -2925 -4625 -3205 -2393 -2211 -87
19202 -87 2515 -930 -1567 -3324 -1811 -2897 -4852 -7058 -11081 -13085 -2555 1792 -2948 -1505 -1324
19187 -1324 596 2079 -1125 -6213 -14351 -13130 -10400 -8281 -5140 -6 4913 9339 11178 6252 -1150
19172 -1150 -6314 -6374 -1064 -1093 -2864 -7409 -10780 -9126 -5436 -4896 -691 4325 3424 -1753 -4464 -7326
19156 -7326 -8170 -2712 -2831 -5753 -3976 -8418 -9116 -7573 -4859 -1579 -3727 -4901 -5000 -4224 -965 247
19140 247 2608 -1263 -5223 -5038 -3988 -8927 -7902 -5960 -3396 1859 1901 -4519 -3820 -2474 -257 417
19124 417 2786 -2941 -3718 -3089 -4182 -5949 -4385 -10203 -8159 -7971 -8666 -9104 -12008 -17912 -13869 -9345
19108 -9345 -13255 -17307 -16347 -15340 -16272 -10592 -6218 -6224 3633 4063 -1002 -3622 -8601 -12029 -9221 -4217
19092 -4217 2875 -720 -4201 -6672 -13685 -15827 -10672 -5970 1709 7147 7383 3643 -4347 -5776 -5242
19077 -5242 -11498 -16061 -21522 -20355 -16299 -11207 -4753 -5797 -1953 -4244 -3352 1783 3137 5037 4640
19062 4640 2579 -1460 -2777 -4424 489 270 -5910 -9308 -8440 -9600 -8064 -8299 -9588 -990 3527
19047 3527 -5455 -6644 -7593 -7790 -10160 -15656 -18578 -17143 -12241 -9998 -8981 -16592 -22169 -11466 -6166
19032 -6166 -6719 -13476 -16675 -12389 -9573 -4774 -1110 -1256 -4029 -9803 -12124 -12391 -8469 -6844 -3775
19017 -3775 -1327 -2656 -705 5774 5337 876 -2235 -3383 -6539 -6439 -1582 3739 5696 3156 2469
19002 2469 6715 7426 6695 6669 5167 1175 -2533 -4140 2621 5218 1148 -7895 -11789 -1611 5351
18987 5351 4556 -522 2636 7980 9294 5849 -375 -1931 -7476 -9996 -8516 -7655 -11580 -13379 -11375
18972 -11375 -5638 -6701 -16768 -17898 -12902 -5862 6547 5505 917 4243 5565 3818 -2374 -8238
18958 -8238 -11976 -11718 -11143 -15275 -18268 -13164 -9908 -4668 -2021 1164 7368 5569 9601 8273 8976
18943 8976 4846 -5 -3269 -4938 -7767 -11949 -11313 -4520 -1608 -1636 2008 7619 5509 1325 -2248
18928 -2248 -11263 -10523 -7691 1771 4399 -2086 -5130 -5368 -939 2767 2906 1965 -1926 -3564 -5921 -6194
18912 -6194 -5404 -272 2208 992 3532 1017 1005 6973 4238 -3512 -8992 -17050 -24648 -21973 -16510
18897 -16510 -12611 -9896 -4672 -1430 -842 -854 -5886 -4582 -1379 -4192 -6587 -8852 -4903 -3010 -3491
18882 -3491 -1030 -2533 -2964 -7119 -12377 -12915 -9328 -4477 -8127 -11474 -9598 -6248 -4490 -9175 -7504
18867 -7504 -7073 -7936 -12075 -10151 -4957 -6269 -12148 -15913 -13929 -10444 -9108 -3855 -4617 188 3331
18852 3331 2431 -6257 -13823 -17770 -24645 -20832 -14454 -10455 -11280 -14736 -12302 -4796 -3128 -9227 -10590
18837 -10590 -17555 -21784 -17780 -12434 -9062 -7254 -16881 -13741 -12311 -7078 -1949 4587 12374 11463 8428
18822 8428 7016 3106 -5137 -8679 -16484 -15045 -8462 -5088 -7979 -5053 -5178 -3432 1876 3639 6134
18807 6134 2861 797 3459 6354 6875 3657 -7031 -11993 -8600 -4870 -8815 -6516 -2430 -3047 -2048
18792 -2048 795 -5563 -8898 -4676 -8133 -6251 -9052 -11909 -2021 4194 -133 -2963 -4223 -5230 -5392
18777 -5392 -771 2419 4667 -626 -11805 -12399 -8950 -4785 -2336 2944 9121 22983 34012 36906
18763 36906 38925 33816 24938 12383 3426 1720 7537 6405 2793 5717 9079 7644 5065 5304
18749 5304 -155 -3935 -6650 -10959 -7864 -4778 1762 6609 -1412 -7018 -3818 -6496 -892 2920 1998
18734 1998 510 2597 3267 4502 5223 2472 -718 -6444 -7363 -9259 -9227 -3606 3550 4297 1234 -3766
18718 -3766 -5599 -8207 -10851 -11179 -7563 -12598 -18523 -12088 -5301 -1474 -5123 -9010 -14828 -11716 -6198
18703 -6198 -2091 3303 4383 1787 3383 -2143 -7349 -4214 -559 374 -2638 -7074 -14312 -13768 -12215
18688 -12215 -14917 -13303 -13527 -9018 -6272 -5941 -6787 -9860 -8693 -4737 1830 6329 3342 123 509
18673 509 -1074 -5231 169 3349 5503 10138 9689 5152 4843 6657 8812 5283 -1893 -7826 -9142
18658 -9142 -11202 -10094 -7202 -2170 -5498 -8581 -5517 -1847 -9990 -14583 -12083 -5885 -44 4064 6412
18643 6412 6801 2903 -2665 -8149 -8687 -7840 -5900 -5329 -12002 -15682 -19253 -14225 -7242 1266 1120 -3073
18627 -3073 -2045 -5860 -7785 -6283 -3365 4262 2796 -882 -4794 -3671 -3007 1209 4661 972 -543
18612 -543 -226 278 -592 -16 6458 7639 7710 4595 3678 -1451 -4087 -4989 -4655 -4292 1649 2997 2821 -516
18594 -516 -1410 -6421 -9891 -5904 -9381 -6453 -4180 -5382 -3564 301 3115 1993 972 -2347 -3264
18579 -3264 -3349 -1393 -2694 -2412 -937 -3285 2028 2025 8792 9184 9312 11186 2132 2357 3532 -1807 -1920
18562 -1920 -4923 -6711 -5776 -2303 -214 1239 4589 4697 2233 374 -896 -1441 2892 750 -5157
18547 -5157 -3200 -3915 -1581 -1320 -322 5932 7815 9627 -1256 -7289 -10320 -12072 -5579 -2550 -4887
18532 -4887 -8055 -12132 -9152 -5632 -7177 -6450 -3860 1228 10458 6869 1710 408 2294 4964 5770
18517 5770 3925 -664 -1718 -1283 1761 -2813 -1170 1966 466 -3565 -1640 2072 2086 5773 9449
18502 9449 16886 15810 15535 13373 8416 2495 -1961 -5452 -7883 -7575 -1130 3545 5246 3179 2095
18487 2095 7476 1993 -6653 -7378 -1147 -963 -3705 -67 -1516 1265 1248 1411 1219 1520 -1537 -6484
18471 -6484 -4187 -6993 -8241 -5309 -3763 -1284 -3335 -3448 -4856 -7696 -10026 -8469 -13722 -10518 -1545
18456 -1545 2229 9812 8529 3780 8824 9206 2745 1547 -1881 -3694 -590 538 1314 6307 6017
18441 6017 7221 8056 4462 -2238 -7194 -7055 -1521 -3931 -6322 -2547 -1453 4041 9469 9949 8897
18426 8897 2458 -5405 -121 1721 5970 6907 3003 660 -1179 -1770 -3030 -4998 1691 8619 8593 1139
18410 1139 157 1051 1313 1665 1440 -3275 -10724 -13354 -9408 -6020 -3608 -2538 -138 1645 774 4275
18394 4275 -3197 -5639 -2622 5958 5819 2986 692 -559 190 6224 7580 9859 11593 11277 10989 8626
18378 8626 4881 372 -4127 744 3797 10250 9391 6881 9078 8033 3821 5805 -2539 -4635 -1039
18363 -1039 5284 3280 5239 9467 9077 8247 11442 14672 733 -677 -3349 -3595 2462 2307 -4347
18348 -4347 -7928 -4380 -2459 1803 1049 -669 -3195 -8269 -4248 -2135 -4160 -3676 -3608 -4553 -9855 -7888
18332 -7888 -3951 -1694 -6089 -4872 -1224 1649 7997 4242 -4167 -3276 2730 8406 11974 10039 5711
18317 5711 10076 16528 9330 5349 7694 9029 8351 4482 -1436 -1849 3544 5409 -129 7493 10394
18302 10394 4324 5499 6892 -1092 -5471 -11285 -8034 -3247 -4770 -4415 -1770 1277 -1279 -5845 -7129
18287 -7129 -2669 3374 -979 -7913 -9460 -7927 -10204 -8623 -7257 -2765 -11379 -10202 -7498 -8552 -9659
18272 -9659 -8968 -6950 -6523 -6784 -5255 4933 4540 1459 -2688 -1235 -6272 -7308 -13168 -351 5143
18257 5143 -7300 -10575 -3684 907 7291 5758 176 -1084 1389 3085 -1643 -2000 -6080 -5308 -715
18242 -715 -2400 -5402 -6080 -8436 -9309 -13012 -19264 -11664 -9147 -8646 -6007 -7027 -3422 -2528 4456 11437
18226 11437 10113 8647 6612 4910 5714 3841 7598 8031 6817 6192 9444 15903 12760 5453 2871
18211 2871 7906 15931 14977 15177 12781 7135 7504 9755 12038 15029 13154 18114 15214 7580 4574
18196 4574 -2627 262 4976 9580 15757 21569 14598 8943 11003 11154 17127 17256 20025 18108 11538
18181 11538 11412 10690 10456 10849 12117 11201 7605 7692 4417 4817 4989 -1802 -4559 2876 13573 18225
18165 18225 22760 20411 18092 15451 9775 6371 3700 -3117 1976 8589 15250 14589 14886 23424 31423
18150 31423 31137 30027 30329 27454 27900 31998 30364 34212 36364 31572 26420 29380 35171 34117 36988
18135 36988 38863 39910 35417 38660 45821 46618 55266 62160 68373 70683 76681 88324 101950 111990
18121 111990 119351 127924 141391 159644 186997 223471 269813 332493 408715 507897 646610 851637
18109 851637 1182106 1756311 2836541 4519790 6085259 6990678 7216067 6430675 4541554
18100 4541554 3002515 2144019 1623730 1274619 1047650 901861 801305 722320 668535 625567
18090 625567 577691 538984 507040 475005 452384 430139 401282 378436 357963 336087 319097
18079 319097 301483 283272 272262 259700 249431 238616 230705 213923 209315 211836 208923 208703 208185
18066 208185 205408 205698 202182 201977 194523 182096 178684 169647 160640 151438 144299 140179 128026 121109
18052 121109 118122 118287 113051 108689 105897 104389 98801 99603 98286 94007 86979 85024 89305 87528 79124
18037 79124 70271 69303 70904 72706 69779 63551 59896 57895 54051 48994 46312 47030 48179 53258 55411
18022 55411 58313 59177 57387 52553 54437 53925 54110 52430 47439 52275 47337 38084 30927 30457 37283
18007 37283 37697 31844 36927 40839 41160 36865 31361 32088 32532 29962 29917 30739 32636 26471 13255 8848
17991 8848 14759 18126 15450 12392 9734 7342 7956 6475 5246 7782 12095 8071 6637 8633 12621
17976 12621 12736 9635 15287 17972 17774 12293 16400 16254 9912 13114 18728 26496 25605 20707 13117
17961 13117 10718 7846 6160 9354 12153 16965 17311 17918 20650 24078 19160 15576 12486 12113 14384
17946 14384 8534 9066 7038 7024 8780 11349 10193 6770 8914 4413 1193 8451 6327 4810 7806
17931 7806 8254 4046 2877 7583 8948 8168 6456 7364 10612 11041 6616 2156 6878 12907 17358 16940
17915 16940 13915 13526 16147 7774 4885 7981 10233 5776 97 -7233 -5194 -7085 -10934 -12195 -9830
17900 -9830 -4259 125 5552 8503 6782 9327 5897 2352 -879 -5277 -7651 -6505 1562 8451 10707
17885 10707 8197 2294 -548 -5802 -3222 4702 7052 4702 782 -2940 -5192 -3901 -4279 -1389 4618
17870 4618 8712 2493 1509 4082 735 -4070 -3469 -6651 -6269 -7972 -8979 -7395 -4807 -6277 -3211
17855 -3211 2183 -1337 -4167 -2221 -3304 -4178 -3347 -3682 -3659 -5262 -2062 -4800 -6470 -3081 2937 1856
17839 1856 -6630 -10738 -7732 -9724 -4802 -2389 55 5461 8299 10122 14272 12776 10138 6229 6882
17824 6882 10417 8663 7221 3998 6869 3682 -1093 -2583 924 10523 10494 7748 3004 -1242 113
17809 113 2330 -575 1180 5885 10187 14308 10088 1861 3477 5038 -184 -1829 4642 7624 6799
17794 6799 6170 441 -3713 -4214 -2220 -4345 -3632 5375 9374 11937 7714 2549 -4781 -8968 -9711 -4525
17778 -4525 2843 8209 8790 5297 8409 4302 -3807 -4451 1970 3747 -1686 -3653 264 159 566 -5469
17762 -5469 -3901 5287 3790 4269 7471 5025 -714 -3446 -10011 -7427 -595 1145 5137 8394 13016
17747 13016 14141 10772 2144 3104 2104 2298 4235 1512 3022 10705 13476 11626 10847 9806 3778
17732 3778 -2525 6588 12842 4122 -847 -1097 3071 6958 12012 16418 10295 1689 -3020 -3679 -6102
17717 -6102 2118 16951 22722 21065 8262 -1154 -1803 -10543 -13634 -16885 -15473 -3130 3788 7235
17703 7235 5289 -3112 -8750 -15129 -12611 -4981 49 7042 7602 5428 6872 10852 18463 13376 5530
17688 5530 5785 9197 11560 10663 8424 7565 2529 -46 -6129 -6682 -6133 -7408 -2526 -5651 -3198 4166
17672 4166 5846 5947 11210 13559 8796 4935 995 -4537 -7525 -4018 3847 7997 12611 10958 5266
17657 5266 -7075 -8915 -5331 -2831 61 -419 -4590 -9388 -8613 -11675 -7093 2811 8053 5683 8005
17642 8005 4396 356 710 3876 5295 4538 1284 -1077 -2944 -1595 1653 1158 -2487 384 358 3015
17626 3015 7949 9027 15587 16435 12536 10785 9547 6860 9086 13382 15108 13667 4568 -52 9626
17611 9626 10682 8446 5661 1672 -1798 3798 4161 1192 2351 8666 15311 7429 4991 3231 -2719
17596 -2719 4201 2929 1051 6171 8113 9238 5743 5960 11610 17019 17835 26502 32523 29649 26868
17581 26868 26243 25295 26942 36267 45261 64767 92565 128025 166994 207164 255944 299881 336812
17568 336812 370043 394466 397084 381136 363558 327109 280701 235557 194979 160135 131843 104914
17556 104914 85261 79201 74169 64618 57360 56397 61537 61707 56428 55980 49270 46383 43630 42145 40969
17541 40969 34497 23383 25643 37335 39425 40168 35496 30423 29377 35329 38896 30507 27765 31975
17527 31975 28685 22132 11884 8430 10510 12303 18359 21624 20922 15587 11477 8638 4400 4647 8495
17512 8495 15448 15746 13586 14441 12427 8220 8723 6395 5425 14543 19660 18979 18550 20834 20717 17732
17496 17732 10363 5820 13002 13960 10044 5025 5671 4604 11668 19192 20836 10365 6478 10301 15453
17481 15453 26642 27666 23483 20826 17169 11745 11272 8657 6869 6947 7692 7617 6597 5556 8396 6808
17465 6808 4248 3472 5661 6092 7902 5889 3774 3850 2665 6281 10332 5941 4355 10017 13137 17763
17449 17763 23124 17233 9090 6113 6905 9487 14742 19011 21376 17193 24436 36307 40044 38299
17435 38299 36499 29151 20327 15192 10412 5408 2205 4927 8398 9188 5172 9515 18943 18992 11217
17420 11217 3782 890 -1862 -3862 -3672 462 2144 8779 14027 11195 3699 9796 8357 9190 3970
17405 3970 -5148 -4628 -4682 -775 -597 5820 17249 20134 13580 11726 10112 13804 16346 9210 4964
17390 4964 2368 1187 7440 7886 5598 5666 5538 1341 656 6189 13267 21036 21235 11220 3020 34
17374 34 4704 7072 7053 4383 7783 14890 17869 6301 2711 1530 158 -395 3707 13571 14924 9774
17358 9774 7446 3305 1923 5895 5448 5635 4872 9327 15521 12844 13113 17494 16172 12286 10769 13432
17342 13432 13522 11119 9702 5718 3084 3073 852 -3140 -7056 -4023 805 -1819 3371 10419 8308
17327 8308 7854 6803 678 2423 7295 11196 7793 272 -4851 -7019 -14304 -14833 -6437 2248 3834
17312 3834 -2502 -2840 -6779 -6676 -11 2772 2387 -3647 -2276 426 5920 8208 3251 6350 7073 3350
17296 3350 -7659 -10836 -3845 3988 4349 8464 16218 15584 19390 27525 28723 17348 10375 6034 4113
17281 4113 12628 24147 22460 13655 11490 9302 6852 9330 14883 16951 17839 25028 27877 30673 33456
17266 33456 36457 46972 52538 56269 48999 48546 53128 56502 53014 50183 52213 44831 40280 34019
17252 34019 37251 46594 45722 44272 47156 44344 34546 32365 35991 37138 39470 39372 43237 44464 41578
17237 41578 39811 40433 39370 34449 25052 18528 19796 25403 22300 20138 15896 16637 21025 21753 28870
17222 28870 25340 23238 27352 33295 31780 24774 26928 29360 27898 19192 17703 18646 21959 25832 26698
17207 26698 21735 20038 26286 23633 19057 17834 16567 13904 11993 7680 707 2398 6483 1325
17193 1325 -5720 -3176 -147 -5504 -7787 -8842 -10164 -8045 -2351 -200 -924 1558 7025 8768 8124
17178 8124 14256 14355 6577 7061 10797 12499 10435 5666 4994 1996 -1966 170 5470 1770 -4670 -6488
17162 -6488 -5989 -2250 -3507 6424 18412 20618 24987 20668 15363 14033 18996 21499 16714 16623 14067
17147 14067 14764 13098 8472 7611 7255 6783 3248 4738 9572 18462 28792 51129 69482 86044
17133 86044 99115 109273 120538 127570 140112 145177 144766 143026 138424 136552 133012 129584 130057 141268
17119 141268 138854 132404 129002 122123 118407 122314 125524 124780 128247 128274 137542 139676 144911 155591 160321
17104 160321 163115 166372 171448 175888 173901 173347 176947 175586 172701 171018 169064 177394 187412 190086
17090 190086 191674 194413 205487 214136 221618 226965 223886 222441 217563 217639 221490 231581 240851 247179
17076 247179 248129 252202 262299 269797 277467 280887 282963 287397 294091 303010 313617 321600 334379 344595
17062 344595 350569 357448 366140 376093 392252 408156 423666 440372 455670 470745 475119 489277
17050 489277 506423 515075 527373 551562 573665 604968 637089 670322 700608 745444 798290 850934
17038 850934 920464 1008697 1105817 1224914 1361720 1505421 1661854 1835536 2012656 2186194
17028 2186194 2372785 2584739 2813315 3085420 3408095 3800500 4292562 4928810 5747528
17019 5747528 6843840 8408827 10695901 14009877 18578385 24440991 31885116 41169603
17011 41169603 50932539 59335497 67198799 74439554 77605235 75486352 72009962 67695630
17003 67695630 59914921 49661496 40614830 33211808 26696428 21360625 17544778 14948152
16995 14948152 13151567 11852280 10875123 10110015 9478706 8914779 8414412 7979493 7571208
16986 7571208 7164028 6774590 6424189 6101769 5789518 5497169 5224692 4984645 4756267
16977 4756267 4549931 4369196 4219290 4092063 3980228 3888254 3810780 3743277 3663689 3570157
16967 3570157 3471259 3376731 3273465 3158511 3036367 2920875 2805574 2695995 2590097 2493471
16957 2493471 2410604 2335792 2260813 2182300 2106002 2040769 1972337 1907940 1849312 1786220 1726954
16946 1726954 1670163 1620166 1564912 1513356 1467895 1423112 1380947 1345430 1304177 1266631 1233143
16935 1233143 1195730 1159881 1127741 1097951 1064794 1033082 1006873 990590 968508 939825 914981
16924 914981 894294 872774 862108 841255 806980 778261 756796 736903 709488 688658 674056
16913 674056 652050 632131 609233 596640 586784 576305 560564 542610 525796 512043 499618 482811
16901 482811 461530 453035 452362 437430 425898 412460 394268 374382 361826 353714 344203 332351
16889 332351 324675 321113 321121 317188 316793 312155 310559 316991 320759 326786 330282 330717 339051 344678 342125
16874 342125 343474 351757 347693 330864 316311 304785 297664 285320 268313 258620 247679 234719
16862 234719 230510 223572 210409 198023 194180 183709 177568 170825 162142 151163 152636 154263 155186
16849 155186 158795 152439 141282 137552 136297 139740 139253 134709 134116 138049 136974 126372 124750 129092
16835 129092 127611 124002 126613 127356 128904 125289 117410 115513 114078 111402 103690 99388 95189 94396 95777
16820 95777 97451 92428 82407 77758 82352 85282 85675 85423 80797 84499 84394 82803 86107 93616 90581
16805 90581 81882 70639 60309 51715 52205 57535 59673 61324 65312 61669 60910 60688 53873 54701 54199
16790 54199 54898 60655 55697 53975 55239 59385 61232 63344 61494 58060 63225 63402 51531 45959 50598
16775 50598 56007 56550 46312 48891 44871 38875 35329 37298 34880 34609 40168 46788 44682 39940 37835
16760 37835 36652 39411 39299 39909 37885 33946 33515 31514 25453 28358 32024 37258 39468 45870 47032
16745 47032 44981 39606 36221 37781 37254 36750 36059 35131 37948 41765 43200 38075 32814 32355 35174 36653
16729 36653 30929 25525 28595 35673 31640 20934 20788 25120 21817 28700 35968 35103 35036 32395 27744
16714 27744 24532 24199 24951 20522 25307 27124 24156 18188 16132 23354 26373 31982 33796 33806 35927
16699 35927 34465 32083 33251 33955 26848 21095 20349 16577 12136 14034 18225 18512 17537 15043 11036
16684 11036 12459 10718 7199 3315 126 928 2835 5483 9898 7434 6659 9177 6314 9412 12713
16669 12713 8383 4328 1720 -1507 -3720 -1347 4656 7651 12479 15866 11792 10567 11249 9633 7130
16654 7130 3026 -750 -341 -2402 -9864 -12141 -10610 -2715 5756 4840 9717 10912 4976 3714 7956
16639 7956 15238 10630 5237 5262 9634 14872 12198 13235 13670 13184 13288 16629 13156 13154 10900 7815 7414
16622 7414 12268 9581 2159 507 4101 7727 11674 3756 5451 8163 11298 11791 5025 4788 8750
16607 8750 7806 5897 6519 3960 2705 1996 -2586 -6094 -4642 -3690 -1648 3072 6314 6816 5421 -1787
16591 -1787 893 2506 3213 -1303 -6010 -7545 -3635 1387 -2037 -9359 -10815 -7135 -4273 -2192 -690
16576 -690 -1551 -2087 -3750 722 -2859 -4386 1071 3185 2423 -2053 -221 406 1208 5330 3783 5314
16560 5314 5806 4795 7758 7007 7738 8865 7932 2148 32 -1727 590 791 -422 -2696 -2414 -3458
16544 -3458 -2585 2771 -2841 -11554 -15632 -19455 -18724 -16059 -16440 -16100 -15437 -15141 -5010 -1120 -1053 2350
16528 2350 1803 5506 5677 8813 1938 -5209 -6946 -5672 -7448 -5105 2930 5552 -1247 -5119 -5448
16513 -5448 -5697 -4558 -828 8070 12725 17970 16371 3598 -4822 -8306 -9668 -7106 -4107 -1125 -5596
16498 -5596 -1254 -3241 -5009 594 7569 3652 -1081 -3326 -5459 -4049 -445 2729 6867 6028 4801
16483 4801 2853 12324 18197 12546 3187 1396 -1603 -3402 -3588 177 -93 7772 11251 14576 11245
16468 11245 8280 6176 600 -639 1338 6769 8014 10022 18114 14761 15016 28000 29539 24044
16454 24044 22813 26705 37362 53622 71712 96577 123922 157321 204222 255618 296597 342590
16442 342590 384220 407169 402545 383434 357764 320800 273928 225064 182180 150117 121580 100604
16430 100604 84850 73150 68478 58743 55826 51660 48601 47996 45105 39302 37402 38753 33608 32858
16416 32858 27019 23024 21891 22761 21753 20714 18014 17877 23513 24507 30983 30277 25943 21520 16314
16401 16314 12032 8872 7199 10939 11065 7142 2140 -344 2937 10069 11113 11341 14657 14243 12981
16386 12981 14288 17591 16499 10747 4565 -2958 -6074 -5113 -1006 2464 5238 3395 -900 -2205 4405
16371 4405 10927 8839 6281 7650 6165 1165 1462 7105 9921 2646 -6728 -9989 -6670 -273 -432
16356 -432 2315 5834 3941 -2107 -6018 -1655 -734 -992 -2127 -5524 -8821 -7859 -1744 -3075 293 7363
16340 7363 12909 9452 2756 3202 2854 2161 1491 7466 6396 4294 5404 -3095 -8215 -5986 -3302 2861
16324 2861 6959 8996 4720 632 -1886 -3793 -3304 -4709 -6655 -7927 -6748 -3177 -5535 238 2308
16309 2308 -380 -3621 5090 9887 8768 7177 9036 9862 12530 12895 10165 9947 6108 303 -3200
16294 -3200 -5683 -3416 147 1809 3675 3520 889 -292 -1419 4289 4940 -2241 -3589 -1269 -971
16279 -971 -730 -3320 -3958 -5751 -11569 -16783 -8296 -2946 668 2642 1862 -2748 -9813 -12673 -12357 -6839
16263 -6839 3939 3259 -2383 -6882 -7672 -8401 -7012 -5453 -6926 -4178 -549 4236 -214 -4473 -1924
16248 -1924 1844 4683 3250 6057 4649 4142 1838 -3153 -4966 -4242 -2716 -4382 -9842 -13170 -14395
16233 -14395 -3047 -3171 -8449 -8835 -5238 -10692 -14500 -11717 -11482 -3689 93 -6611 -5875 -4096 -6692
16218 -6692 -5423 -773 -1949 -5647 -5109 563 6443 975 425 -1981 -3096 -6223 -10698 -11770 -13547
16203 -13547 -4878 2416 5132 9260 8622 2230 566 7084 117 -690 -74 3764 5183 -1245 559
16188 559 2756 -2050 -8223 -12432 -10800 -10294 -8740 -2768 595 -3291 -7789 -5125 2117 -453 921
16173 921 2854 -5885 -9809 -9144 -4871 -7016 -3639 4879 6636 6142 3582 5870 6361 153 -7379 -5705
16157 -5705 -10540 -14544 -16659 -8887 -3626 -435 -4004 -3958 -4274 -2571 -1147 1286 4281 2179 2723 -3596
16141 -3596 -1901 2247 -1043 -6464 -6486 -4710 -11236 -18122 -9496 -2212 -76 -4261 -11342 -10202 -9969
16126 -9969 -15178 -16047 -6824 -964 52 5742 8360 612 -3109 -6165 -9482 -8621 -4004 -1510 -3707
16111 -3707 -6940 -10337 -14145 -14349 -10589 -12638 -13979 -11859 -3424 -2910 -3490 -5506 -2170 -5195 -11771
16096 -11771 -15546 -18228 -17166 -12195 -1750 88 -5429 -3605 -3219 -2009 -684 -5003 -2954 -832
16082 -832 -4765 -11705 -11025 -7025 -9599 -5743 -5186 -11737 -11391 -8783 -2249 3642 2709 1766 695 -1787
16066 -1787 -9837 -12334 -15614 -13894 -8352 -3774 -1723 -112 672 -3525 -7692 -7268 -6732 -5958 -4800 -588
16050 -588 432 -858 -504 2259 4705 -5110 -20371 -19429 -17344 -9731 -636 1209 -5111 -10389 -16965
16035 -16965 -26475 -23169 -15684 -7487 -7686 -2698 -3136 1322 -4911 -16096 -22139 -30200 -29015 -21115 -16450
16020 -16450 -10111 -1698 4623 11265 15054 14127 17765 12443 227 -485 -528 -8118 -6497 -4356 -6614
16005 -6614 -6930 -4666 -8914 -2098 -8028 -6600 -6782 -13176 -8658 -7640 -5564 -3022 -6559 -10495 -1279
15990 -1279 6008 7201 674 2337 -3239 -9902 -11558 -5183 4767 12690 28775 44237 46961 47433
15976 47433 45255 30697 8915 -7452 -16345 -14643 -12105 -9197 -9946 -8404 -3700 -5962 -14054 -12160
15962 -12160 -10973 -9566 -7602 -1755 -2094 -6203 -10099 -11938 -3049 645 -2965 -5845 -4468 -2702 -3535
15947 -3535 -7502 -7972 -12239 -16160 -17929 -15762 -7380 -1108 3755 8461 292 -9861 -14001 -17557 -19263
15932 -19263 -21604 -22896 -20500 -10603 -1879 5310 2366 3408 6848 4464 -735 -4775 -11137 -10504 -1410
15917 -1410 9954 4991 -1194 -1575 -3579 -6817 -10437 -10954 -3829 337 3300 7107 2487 -7371 -7329
15902 -7329 -918 -4065 -12195 -17518 -24907 -22052 -17952 -23816 -27038 -22699 -18897 -15383 -11328 -9840 -13003
15887 -13003 -17912 -16862 -10533 -11299 -14161 -12799 -15658 -17705 -18085 -15555 -15909 -16386 -16009 -13854 -13430 -16507
15871 -16507 -9727 -2398 5305 10205 7843 -4991 -6642 -2014 -2601 507 2913 -1438 -4574 -12866
15857 -12866 -18835 -15204 -11667 -10658 -9582 -11802 -11776 -8329 -9979 -11732 -12706 -9309 -6347 -5998 -1581
15842 -1581 149 -2764 -8637 -8756 -4725 -4527 -3454 -1259 732 4696 3476 1370 -4363 -6921 -8629
15827 -8629 -3924 -5220 -1349 1092 -368 3464 5945 2505 -5323 -8392 -3829 -4134 -3651 -262 53
15812 53 -986 1606 1321 -3661 -1781 922 -1598 -9505 -10681 -8117 -4474 -3125 -4550 -3745 -5490 -4002
15796 -4002 -5366 -6561 -5954 -8167 -10713 -8294 -2075 -5671 -9000 -5144 -6823 -5550 -2181 -3367 -3837
15781 -3837 -6692 -3628 -5496 -14196 -17928 -12902 -6238 -8832 -9355 -8643 -7849 -5999 -797 -1051 -2876 -6603
15765 -6603 -11535 -9041 -8884 -1198 480 2360 -1944 -2083 -3010 -2710 -2459 -946 3557 -1983 -9567 -15988
15749 -15988 -11142 3085 4974 -970 -3076 -2318 -1715 -7163 -8988 -628 185 -7377 -7274 -4339 -2089
15734 -2089 -10551 -10996 -7244 -9784 -9237 -11199 -7867 -8067 -5693 -2738 3151 167 -2327 -3249 1016 1247
15718 1247 -658 192 -6473 -8226 -10593 -12675 -15654 -13796 -13053 -4558 -1089 -1519 1255 4512 4474 8911
15702 8911 4730 -3591 -3707 -7424 -7915 -9266 -5270 229 -968 -8908 -11346 -10993 -9597 -8397 -8139 -6949
15686 -6949 -7757 -6222 -5072 -4792 -5604 -5580 -8519 -12852 -10387 -7267 -1843 2297 6093 6847 5055 -1660
15670 -1660 -1905 -4573 -11184 -10722 -5591 329 1085 2296 3514 -6924 -15378 -14425 -9373 -5007 -4427 -6159
15654 -6159 -3612 -6684 -1829 -3274 -4405 -2279 -2855 4801 6154 -5480 -12337 -8968 -4163 2895 -3911
15639 -3911 -3301 -2693 -1315 -4302 -4231 -5601 -13269 -14023 -12134 2530 8127 4197 -2049 -2980 -9050 -10979
15623 -10979 -1405 540 -2489 -1058 2037 632 -723 1291 3227 2486 1354 2824 2874 -1173 -4399
15608 -4399 -4207 -644 2752 7709 1167 702 3193 -1542 -5246 -5663 -5308 -7822 -14270 -18779 -17448 -13556
15592 -13556 -5555 -550 1917 3896 2644 3327 -7025 -6472 -10021 -7243 -6667 -3887 -461 5834 10761
15577 10761 5749 2400 1094 -1635 249 -4285 -5291 4892 6003 -9242 -8523 -3691 -6689 -9104
15563 -9104 -6451 -2319 -5366 -4919 -3255 -207 3103 1960 833 6415 2956 -3748 -5026 -7196 -7928
15548 -7928 -1458 -697 -1926 304 1869 617 921 -1149 -6887 -6978 -7895 -9000 -10265 -15786 -13569 -8494
15532 -8494 -4325 -1463 1826 2689 -5177 -7468 -6083 -6506 -7979 -4604 -4692 -6601 -10715 -15876 -12427 -6128
15516 -6128 -1805 -2933 -10002 -14207 -13431 -12040 -11515 -8364 -11278 -12735 -9066 -3161 -1105 -268 -4135
15501 -4135 -5781 -4160 -5034 -2490 187 3246 1791 4104 8751 6667 7647 5638 -2033 -5096 -1093
15486 -1093 4811 8473 8671 5439 4222 2315 4384 4310 3037 8303 3369 1543 6140 5101 -1195
15471 -1195 -4895 -3633 -4519 -5539 -4532 -4846 -455 1021 657 3948 3107 -1291 -4293 -6983 -5532 -6155
15455 -6155 -4209 2272 2871 -1829 -8036 -6854 -3637 -883 5251 6475 -2632 -4291 -8264 -16214 -26361
15440 -26361 -27495 -22280 -13084 -5881 -3024 -7278 -6613 -6094 -9541 -19562 -23697 -19836 -22828 -18925 -9804
15425 -9804 -5182 -2115 -1701 -638 8496 8946 7619 8097 10147 3567 1938 4138 -6887 -9643 -3220
15410 -3220 -463 -1757 -2704 -2638 -2502 -8442 -19687 -18697 -16138 -12156 -7745 -6110 -8986 -5761 -6531 -5440
15394 -5440 -5206 949 -2390 -274 -1038 -4051 -6129 -10089 -10981 -7097 -11417 -13268 -12952 -14189 -12116 -8713
15378 -8713 -9738 -8731 -3704 -1151 -2017 -420 -1457 -6249 2793 8728 8885 1360 -8400 -9899 -8739
15363 -8739 -13230 -7762 -5011 -3217 -388 -795 659 1343 -3503 -5413 -2307 -2070 -6204 -4187 -1116
15348 -1116 4346 2671 4408 10191 4904 1013 -3390 -4783 -9267 -8063 239 3146 1451 -4107 -2990
15333 -2990 48 -1723 -5470 -8798 -10621 -8019 -8288 -9732 -4629 -5251 -2091 7278 5834 4987 2184
15318 2184 -569 -5468 -6214 -5032 -4597 -2502 274 653 -2685 2054 6932 5222 2872 1427 -2302
15303 -2302 -7933 -10628 -3497 -6271 -8373 -13521 -12900 -6639 -4506 -3885 -5910 -6322 -5094 -8380 -8398 -5356
15287 -5356 -3626 -6224 -4795 -2338 -5284 -5364 702 4553 536 -2650 -6773 -4556 1853 -711 -7424
15272 -7424 -6748 -5081 -11766 -11329 -11953 -5594 -967 460 -2244 -5166 -1010 5500 4868 2662 -69 -8455
15256 -8455 -7175 -9735 -5288 1595 8759 9538 6928 5801 2087 1616 -66 -1192 -4087 -7136 -11516
15241 -11516 -13678 -11094 -7273 -8088 -5324 -6488 -5444 -4907 -4077 -4841 -6602 -16349 -21476 -17052 -11936
15226 -11936 -16219 -16329 -15868 -8097 -6594 -8867 -13122 -17494 -13030 -8516 -6247 -2780 -7375 -16697 -20599
15211 -20599 -19507 -18657 -12439 -10670 -10814 -12968 -9333 -13137 -12212 -12746 -10853 -14552 -16635 -10059 -1532
15196 -1532 -800 1648 -35 -3708 -4159 -3447 -76 3101 2201 7712 5327 5227 2752 3330 298 -1947
15180 -1947 -284 -3141 -4419 -9327 -4939 -3499 -5430 -1294 1248 1127 -103 2286 5556 1272 -7290
15165 -7290 -5591 -3189 -4032 -6703 -6937 -13280 -15449 -11510 -7523 -9604 -17499 -18897 -14765 -10989 -7111
15150 -7111 -4684 -5529 -5808 -9704 -7829 -7532 -9342 -5979 -7004 -5851 -7927 -8293 4739 8787 1525
15135 1525 -1137 1105 5466 1129 -3991 -7268 -8097 -10678 -9306 -14337 -18655 -18282 -8946 -8379 -10752
15120 -10752 -12232 -9785 -9080 -8156 -6982 -3748 -3441 -5206 -5456 -10578 -8449 -8793 -495 117 -8317 -8276
15104 -8276 -12506 -8306 -8763 -13905 -12034 -14855 -18846 -11650 -5044 2088 3099 -6747 -9115 4463 10107
15089 10107 8085 -6919 -11440 -3952 1619 -492 -3735 -3429 -399 2580 4874 4449 -6655 -6464 -5576
15074 -5576 -13205 -21269 -14905 -14310 -17420 -14382 -16690 -14961 -15335 -14077 -12712 -8898 -2856 -3071 -13177
15059 -13177 -15641 -12170 -8407 -6219 -5243 -8056 -10459 -17465 -22504 -17315 -10652 -4054 162 7 -1990
15044 -1990 -8348 -9947 -10553 -10379 -8602 -9635 -13390 -9496 -9486 -13970 -6777 337 -2726 -5116 -3359 -5047
15028 -5047 -2676 -3716 -1582 1490 2909 3102 -2613 -7387 -6388 -6754 -12195 -13063 -7815 -6160 -14604 -7457
15012 -7457 836 4586 -256 -1623 -2047 720 -2316 -8094 -9471 -7366 -1312 2031 9554 4666 -1107
14997 -1107 -3618 -4327 -4016 -6925 -7445 -2075 -1984 -5114 -2226 5146 6950 -1947 -6770 -9335 1068 8756
14981 8756 4906 369 2948 -1529 -4861 -5535 -4478 -1904 1936 3601 -147 1636 1662 -1860 -1418 -12644
14965 -12644 -7303 2031 4477 1742 -1442 -1075 939 3665 7334 7843 989 -1816 -3231 -4992 -7638
14950 -7638 -7616 -2025 4716 13199 13399 7214 2762 5967 2827 3406 4634 3440 2428 1510 -2805 -1117
14934 -1117 -3805 88 609 -2987 -1449 1618 -308 -1766 1387 -4360 -7930 -3607 -7340 -13043 -12844
14919 -12844 -12273 -8972 -8273 -6655 -2423 1557 3891 10285 14860 11415 4416 520 -3524 -11316 -10582
14904 -10582 -10162 -12523 -8118 2673 842 -2278 1020 4088 784 565 4915 6904 8216 7083 2693
14889 2693 1669 2655 3787 10853 14183 3915 125 1267 2848 -721 -4357 -6151 -1142 384 -688
14874 -688 -2847 -41 849 8682 8215 900 -908 -5211 -7116 -7019 -6053 -4888 -4197 -1737 -2284 -2736 -157
14857 -157 1975 1427 -247 946 4951 4994 910 833 2389 4706 -1710 -6481 565 2136 -9414 -8757
14841 -8757 -1965 2046 4221 8539 13164 13630 11308 4611 -4925 -9138 -13247 -11623 -9234 -3502 1015
14826 1015 3659 3959 7307 6599 1034 -5898 3079 2518 -2568 -2251 -5542 1094 1016 -386 3993 7731
14810 7731 3318 1259 3599 2835 -772 -4807 -8727 -15232 -15880 -14825 -13380 -9617 -7159 -12208 -17224
14795 -17224 -13170 -6080 1841 -2811 1807 6540 1873 3823 602 -2257 -2618 -2837 -197 4080 5730
14780 5730 3404 4041 -68 -9831 -13227 -7839 -1513 -3583 -12926 -13003 -2147 4154 -1928 -6149 -3911
14765 -3911 -1522 -2536 -3500 1071 1678 -1922 -3414 -6753 -11305 -9525 -14438 -17189 -10106 -4494 -1709
14750 -1709 1106 -2433 -6245 -10607 -8894 -1539 4303 -692 -5924 -7831 -7530 -4891 1894 2828 -1522
14735 -1522 -1172 -1067 -2263 257 -4315 -1447 2908 501 390 1285 -3814 -3952 -2950 -11799 -4856 5827
14719 5827 9500 6869 -106 -4735 -9172 -6807 -8064 -5178 -2453 -2296 -1396 -1028 1959 -541 -1024 3246
14703 3246 2168 -82 -3517 -3710 -5009 -1910 1043 2129 -3638 -3535 -2136 82 6168 10182 6067
14688 6067 4875 5718 2892 3064 916 -901 -5571 -2661 3363 -118 -3123 783 4113 4074 4181 1368
14672 1368 -1760 -1220 -1916 1457 1126 -422 -3886 -4704 -6525 -823 -3715 -2406 -482 2264 6382 2286
14656 2286 -1687 -461 4038 2574 934 5616 9422 8806 9052 4734 1671 -1517 658 7010 5692
14641 5692 263 -4953 -1880 -6130 -12994 -19487 -10781 -1027 -542 -2146 -2498 466 3459 1303 -3077
14626 -3077 4025 7062 3289 -4764 -1010 -1612 -1491 -2008 -2085 -3050 -617 -760 -2927 -1125 -1893 -5711 -10474
14609 -10474 -4742 -3740 -7434 -6636 -4780 -3799 1124 1284 1700 5794 1586 -944 1357 1353 -5251 -4944
14593 -4944 -1409 344 -1552 5526 6802 1970 -1028 392 -793 -1967 -1033 -465 1639 2069 -6249
14578 -6249 -13479 -11704 -11573 -10932 -6762 1357 3234 816 -5459 -6727 -7083 -8281 -6502 -5384 -7339
14563 -7339 -5262 -2114 -885 -2686 659 101 -2279 -523 1954 2289 263 6480 12741 13159 12688 11333
14547 11333 9547 4457 12073 17320 17768 15111 11152 5572 3202 10265 18673 18366 13943 5846 3459
14532 3459 8193 8168 9721 13452 6742 342 6 10045 16858 16535 12465 2992 -1916 -2671 -4090 -8408
14516 -8408 -9571 -9458 -5807 -2925 34 -3067 -2126 -2087 4067 3977 4678 -564 -5518 -10317 -8067 -3695
14500 -3695 -3558 -3934 -5743 -8419 -7946 -2007 -413 45 1418 -1970 -4543 -3748 3628 5330 2052 -2247
14484 -2247 -3366 -6223 -11066 -16344 -12591 -10468 -3637 4968 20775 31220 34682 33891 27339 17239
14470 17239 10030 6710 1644 1523 11589 14476 17214 19353 20527 8739 5281 6704 8907 7724
14456 7724 5401 2374 4378 527 -3722 -1179 7879 8037 -210 -6042 -9176 -10252 -4565 5944 7863
14441 7863 3121 -5294 -7366 -4271 -310 7402 10294 3068 2127 9914 16446 19780 22631 17328 8987
14426 8987 4051 48 -1556 -7594 -8713 -3855 1273 -1997 -5263 1568 3261 707 -2031 -5772 -7509
14411 -7509 -3642 -3290 -3003 1885 1259 301 3522 -1961 -2752 -4621 -957 -652 -2153 -3129 -7004 -8040
14395 -8040 -1870 3435 6093 2325 4623 9098 3742 598 -2755 -8638 -7768 -3503 -1472 -4016 1779
14380 1779 7597 9554 5692 5094 14988 17184 16443 13067 11936 9213 11393 14628 14223 13554 11508 13009
14364 13009 11694 5021 7033 12451 7554 6955 4251 3935 3819 6242 5808 9645 8309 3482 6470
14349 6470 6321 5295 12770 16402 14655 10718 3168 -482 -1333 -2877 94 730 5001 8851 11673
14334 11673 10407 5560 5966 8323 14424 15145 8379 6077 6112 10086 20412 18550 11734 6019 6432
14319 6432 10649 5956 4792 1362 4833 10275 9345 7752 9298 7681 7403 -1538 -3790 -8084 -8294
14304 -8294 -1454 7868 11854 5099 -3680 -3107 -185 8328 8391 3251 2895 6050 6174 6117 6862 5017 4213
14287 4213 1275 3030 6230 5489 -570 -582 4125 -1234 -2890 -1158 6215 7369 3997 4794 6005 6292
14271 6292 4350 4697 4710 5421 7218 8480 8001 7564 7395 2728 620 263 750 3128 3677 737 961
14254 961 336 1323 2791 12076 22793 19639 14952 14007 17081 15939 11062 6613 4685 10700 15844
14239 15844 13430 8608 5613 10070 14086 14673 12799 10310 9626 5602 2321 4010 2130 1818 -710
14224 -710 -739 -649 3187 7323 6236 7880 15078 18103 14511 11978 9989 10673 7665 530 -36 432 2614
14207 2614 11673 14543 20818 17354 8314 8393 12004 12799 12600 7522 9422 8569 11021 13963 6895 7423
14191 7423 6810 5813 6017 4573 2524 4286 8974 12283 11221 9513 8211 8484 13363 15751 17037 20068
14175 20068 15025 6806 11615 15979 9982 8373 9298 12125 18446 17319 19416 22671 19319 19993 20995
14160 20995 16919 8698 6714 4810 1903 2203 8872 17445 23135 12160 9583 14218 12921 7357
14146 7357 11081 10978 16639 18926 16729 16297 13854 13438 16792 9688 4101 3291 6890 9452 12579 18982
14130 18982 17566 14245 13350 18079 13662 13845 17821 14652 11348 11445 19650 16961 22022 14724 6755
14115 6755 6250 11214 14084 8872 8182 12016 10362 8544 12040 15075 14988 22455 21694 8315 5697 16035
14099 16035 16997 13583 12778 16676 15165 5277 5991 10855 17895 22886 27716 40920 46365 44623 39958
14084 39958 36716 28088 22811 15757 11139 10132 9611 16385 19101 20448 20681 20836 25067 23079 14240
14069 14240 11799 14869 9272 3170 10033 16071 21237 30370 29798 18955 16825 12906 13402 14759 12535
14054 12535 10121 16063 15870 16884 19147 19188 23719 19881 18507 21595 18070 7744 5554 11301 14108
14039 14108 16876 16375 14974 17123 16911 12218 10811 19883 24621 25324 26295 22904 24451 30521 30841 28165
14023 28165 23847 30021 31362 32404 35153 29318 21129 23206 26173 25418 18741 19540 22050 25465 26075
14008 26075 25993 27106 26592 26498 24404 24616 26164 23467 18855 18906 24197 22815 24567 26060 20676 13694
13992 13694 12429 13580 15807 21040 24022 24202 27163 24106 23059 24041 24967 22393 18367 21094 23931
13977 23931 28917 30757 32231 29681 25258 19094 18915 20985 23681 19381 17561 17965 24050 20673 26002
13962 26002 27001 25874 21254 21097 25637 30165 31508 24788 25431 26343 32722 35647 25607 18326 22674
13947 22674 27636 26502 28673 29901 28366 26130 30237 34065 38266 43594 51272 54201 53293 52346 57611
13932 57611 70830 87427 108100 134409 147923 166309 179594 172165 146962 117578 95408 83600
13920 83600 77182 67448 58205 51765 42925 46514 52946 53222 51887 49445 49954 48703 46064 47201 45734
13905 45734 44944 44925 43848 54745 58028 57190 51847 43336 48242 50662 49898 59204 68233 77419 89015
13890 89015 99216 104632 115769 148483 197359 252434 319560 382639 427373 448915 440940 385610
13878 385610 295785 224152 172199 144645 128101 116568 114807 109842 105945 102410 97966 95350 91145
13865 91145 90255 86318 85484 84657 77884 72188 71416 69993 74070 80754 85222 87070 87892 84212 80046 70131
13849 70131 65643 67643 74719 83037 89170 104029 128664 151168 185904 243030 321794 397778 454090
13836 454090 491817 488916 430578 338404 254663 198143 165013 149673 136488 129092 125169 113205
13824 113205 105258 102380 98237 88157 83762 81522 80047 78107 75258 74781 66322 63834 64848 64350
13810 64350 63545 67053 65714 66881 68692 72389 70846 63045 63553 67080 72491 80322 88865 93786 103041
13795 103041 123396 151971 181556 198588 207990 208899 191512 164227 134809 122887 112700 110968
13783 110968 109976 100876 99125 94763 93210 88823 85842 81882 68998 62907 60559 57634 49665 42608
13769 42608 43126 48959 49658 52187 54259 57855 59709 58662 61636 61830 64020 65224 64703 65190 71151 68240
13753 68240 63901 66839 66469 69604 72776 69592 65605 68940 73367 79506 85983 92768 92599 100575 101478
13738 101478 106615 99537 90138 84169 79087 76437 69227 57133 50249 54104 55122 54699 55226 55764 57048
13723 57048 61559 68670 75824 74082 72789 75341 73207 77893 83766 90317 89442 87096 85652 80190 77390
13708 77390 77402 80261 86608 88582 84255 81488 83837 82567 85736 92997 98060 106715 115913 126619 137527
13693 137527 140107 131355 118903 114220 111963 103967 100091 89264 83784 83256 79145 80301 76113 65098
13679 65098 65535 78802 88022 96502 102490 107240 107614 104310 103219 103387 104544 104614 97077 91393 87746
13664 87746 83487 86305 86350 83409 86373 87047 88679 88483 93508 98954 101063 100189 105819 105532 103452 106028
13648 106028 105957 101683 96850 94928 92423 87717 87781 88726 85104 87337 89094 85428 82597 83573 89084 90819
13632 90819 102309 113081 122070 127103 130381 134286 128998 123567 127226 131108 129949 126372 116476 109705
13618 109705 108453 109065 105823 107690 113192 113289 117145 117649 111527 106837 105893 99923 101850 107415 104084
13603 104084 106765 107676 109968 108765 105473 97006 88219 84183 89750 91185 93711 98827 99005 110605
13589 110605 128729 139375 141209 136372 131221 131608 139039 144237 148086 142010 142263 147531 146066 143868
13575 143868 144882 141639 140800 137830 132394 132521 134552 135269 140801 153690 164594 179209 181442 180959
13561 180959 183502 188796 194598 195177 188524 178270 168327 158915 146906 139114 133982 133477 138910 148228
13547 148228 157519 166096 196075 232177 248812 266993 279669 272108 266923 265566 263287 259575 264512
13534 264512 260233 262628 262234 256798 258388 265758 261870 266133 277969 288482 297477 308400 324853
13521 324853 342948 364375 374696 394752 415503 429429 438002 443109 446429 451986 464164 475889
13509 475889 493181 509174 536362 582943 654882 765852 932869 1178496 1473811 1778398
13499 1778398 2043151 2192587 2185646 2008322 1721397 1431029 1215122 1087658 1017995 976655
13489 976655 954989 952012 959568 976821 1005582 1040703 1082217 1129060 1183494 1250230 1344683 1456885
13477 1456885 1603663 1795815 2039389 2350008 2735368 3214941 3821308 4632242 5798649
13468 5798649 7589524 10384754 14336030 18737704 22475452 25252838 26385712 24556707
13460 24556707 19882411 14830383 11135818 8737123 7192452 6183315 5505911 5019493
13452 5019493 4656225 4354183 4088358 3857530 3666157 3524695 3422397 3357479 3307945 3276943
13442 3276943 3269464 3280033 3314345 3361143 3424398 3513765 3630638 3784908 3996490 4278690 4658488
13431 4658488 5176631 5847316 6691016 7761836 9122376 10846276 13131978 16409956 21443747
13422 21443747 29333205 40983293 55015033 67185235 76131503 81127515 77673172 63784948
13414 63784948 46560321 33879596 25870598 20777676 17454967 15223291 13662594 12484227
13406 12484227 11489830 10592082 9780593 9091673 8542688 8111628 7760086 7461861 7203492
13397 7203492 6975840 6778673 6608883 6478171 6391217 6339582 6329384 6371030 6483743 6678440
13387 6678440 6976424 7414422 8022664 8808144 9821358 11120584 12779301 14967052 18058538
13378 18058538 22773929 30168774 41296559 55337596 68180157 77615563 83494143 81583659
13370 81583659 68854089 50914802 36941811 28055584 22419089 18746355 16283950 14551626
13362 14551626 13255215 12176632 11193975 10303088 9547091 8927641 8421043 7996512 7623322
13353 7623322 7281958 6961738 6662508 6388074 6134466 5923985 5746990 5598818 5477246
13344 5477246 5394615 5354722 5357943 5411697 5540720 5747442 6035147 6428760 6952654 7643918
13334 7643918 8621461 10103053 12409095 15880836 20310689 24546501 27788245 29795133
13326 29795133 29344942 25479741 19732394 14864146 11592833 9481620 8090453 7142675
13318 7142675 6470749 5974573 5566070 5196048 4866628 4585075 4345098 4127583 3923299
13309 3923299 3736430 3568082 3411554 3265073 3125905 2978866 2841434 2730000 2629846
13300 2629846 2530605 2452802 2377458 2305633 2246514 2195556 2157269 2127579 2106654 2085442 2062593
13289 2062593 2039063 2008987 1968405 1913599 1853344 1799703 1743943 1676412 1602422 1531259 1469309
13278 1469309 1413852 1370256 1326411 1282871 1251700 1223252 1192829 1162650 1134690 1107981 1086915
13267 1086915 1070831 1049770 1021899 992306 961547 938439 906848 883505 860522 838948 817395
13256 817395 795868 771533 744166 713374 694902 673885 665392 652170 645192 647063 650631 649527
13244 649527 658978 672950 661844 641469 626203 610535 590269 575076 556937 532564 505964 490869
13232 490869 481187 467780 458818 451535 440462 433024 429923 418438 406134 393427 385170 376255 368692
13219 368692 368235 370967 364781 355126 340871 327387 322053 313193 308791 310268 310185 304658 308987 312818
13205 312818 327188 335975 343206 353492 355154 351969 347242 342248 334257 328089 320738 313055 308623 305376
13191 305376 298197 287259 270246 258463 253204 253334 266270 296161 359773 461162 565142 646538
13179 646538 701975 725409 724640 714261 699949 693343 685561 680270 671969 664900 657668 655598 654388
13166 654388 656562 653723 646350 628750 617131 604997 602280 606474 615981 634723 653320 689163 733719
13153 733719 786793 842767 900034 966233 1044133 1153624 1310928 1550699 1907367 2355270
13143 2355270 2824372 3227794 3480135 3480568 3189969 2721139 2233768 1862959 1628748 1484560
13133 1484560 1400491 1349284 1324514 1302024 1278583 1256439 1237971 1223473 1221107 1225558 1233784 1248992
13121 1248992 1258121 1274621 1296528 1312332 1336512 1367866 1404706 1458041 1524692 1597828 1671155
13110 1671155 1750607 1830758 1924242 2041705 2188227 2380328 2624590 2962082 3447175 4176604
13100 4176604 5226501 6577481 8046368 9355204 10256558 10482060 9832442 8479438 6956116
13091 6956116 5742491 4963203 4514225 4267762 4155163 4130481 4158757 4237734 4355828 4519046
13081 4519046 4720783 4962087 5262767 5618503 6026312 6479676 6971263 7515395 8149326
13072 8149326 8931366 9915472 11141414 12681673 14656502 17206054 20537394 24961633
13064 24961633 30904273 39051318 50675943 68125026 94925492 133981677 183384728
13057 183384728 234964444 279816832 310033340 317240411 294248676 246063643 189289500
13050 189289500 141280770 107495458 84687270 68832779 57588038 49544089 43687213
13043 43687213 39250495 35728997 32825009 30375162 28292478 26513810 24976966 23603373
13035 23603373 22327187 21104019 19921637 18796456 17767831 16840742 16009051 15288258
13027 15288258 14663417 14109844 13626830 13210465 12869526 12593454 12378273 12213488 12078573
13018 12078573 11951332 11830093 11695695 11511293 11266912 10981362 10687545 10431786 10279716
13009 10279716 10247742 10313107 10411505 10450411 10330116 9958239 9334215 8580125 7868142 7289141
12999 7289141 6839018 6487171 6203369 5978197 5791936 5627138 5479337 5331156 5159982
12990 5159982 4993129 4830397 4669734 4523648 4393132 4261860 4125036 3985780 3849787
12981 3849787 3716188 3595545 3483224 3376359 3281191 3201699 3129536 3065769 3010790 2951648
12971 2951648 2883098 2817208 2744487 2674373 2610019 2541430 2466482 2387698 2308984 2228861 2144212
12960 2144212 2071392 2017252 1968494 1936987 1911826 1884642 1857102 1824266 1795237 1774796 1764823
12949 1764823 1761900 1776007 1788918 1789491 1771798 1734757 1646504 1523659 1409929 1319572 1253608
12938 1253608 1200631 1162281 1133882 1109552 1082716 1055501 1041318 1034667 1034681 1051316 1084346 1130536
12926 1130536 1173272 1210914 1233197 1230974 1213248 1194610 1167269 1130943 1092861 1046530 1001251
12915 1001251 966347 925562 889854 865374 839752 803837 769135 742038 731147 733589 744814
12904 744814 774457 831540 891516 935777 967170 965344 909363 809708 710399 645586 602614 568536
12892 568536 547391 529221 511509 498301 483279 471888 468778 466914 455402 447804 440672 439028
12880 439028 432795 431860 437627 437178 431998 423280 410704 406423 404979 399207 393506 383758 370675 360579
12866 360579 354138 348629 346682 345185 341405 344368 348558 363952 383943 403618 422788 422320 413493
12853 413493 393001 358315 326308 298710 279162 261699 250111 245013 244095 232755 228249 230259
12841 230259 231348 234802 244985 245622 248140 247828 241863 229220 220193 212593 213640 204310 198263 196374
12827 196374 187173 181099 175529 178082 175908 170624 161410 155848 152357 149456 144731 140768 141156 143423
12813 143423 145486 145874 146443 145068 148078 149929 148069 149931 141951 138509 136134 133167 134279 138894 138636
12798 138636 137886 135031 135822 141060 144270 147644 151453 156315 155388 162310 163988 153234 143805 138539 127244
12783 127244 123151 124025 127469 117361 106301 106157 111318 115462 115373 118440 116899 112191 110075 108837 113719
12768 113719 109634 104281 97113 95462 91255 85991 80350 80414 78534 78052 76747 72462 70513 65986 66189
12753 66189 70687 77435 86429 99173 114640 122233 120950 119749 116415 108480 97045 84309 71355
12740 71355 63271 54606 53293 56672 56744 58781 60299 46612 40284 39886 38748 36723 36809 32572 34382
12725 34382 33372 37379 38426 45667 48127 52728 51638 43506 37421 37832 41130 42269 43697 50428 46451
12710 46451 38768 35529 35544 31567 32877 38092 38496 35777 37647 40064 43155 37156 29999 34576 44356
12695 44356 49882 57621 62596 64939 59464 48270 46759 48682 45518 43426 44006 44066 42669 45368 50213
12680 50213 49589 37885 41759 41085 41980 45348 49588 59147 66907 65421 71257 85042 105024 131350
12666 131350 166867 199812 223706 237439 222830 198821 176095 170951 173379 185984 227401 284480
12654 284480 346484 398134 422738 405238 344266 264774 200736 156775 130012 111488 97719
12643 97719 85834 76386 74033 72554 68622 60307 57907 57284 58201 62694 67742 72028 68086 73559 81451
12628 81451 92609 102722 105722 112135 115874 111035 104053 101432 106064 108426 109873 114332 122518 142415
12614 142415 165884 200596 245321 316335 426648 591757 814801 1089113 1362620 1567429
12604 1567429 1661370 1601438 1387704 1087074 804053 602489 473150 387520 325192 280357
12594 280357 244650 216527 198441 183627 167672 151347 143972 144417 144148 146522 145548 151975 158098
12581 158098 154481 149278 140325 134069 126932 122309 114584 107255 101826 98822 93380 90864 89657 82273
12567 82273 76400 73692 71455 68938 64561 68163 63567 62457 57994 51139 46396 42341 47509 50666
12553 50666 54480 54777 52064 50340 47969 50762 53364 50386 48793 43810 41475 46875 49225 51278 47690
12538 47690 50111 49076 43740 46228 46882 44383 36128 33893 27757 29511 36593 42357 45563 41993 38306
12523 38306 36037 41225 43441 47722 50040 51944 50142 49180 52922 53544 59712 67043 75299 78073 78396
12508 78396 81235 84770 87307 89124 92450 98467 104599 109564 105494 96648 91580 91029 97498 94348 89758
12493 89758 87870 81834 73090 72205 71119 71271 67076 62012 68277 73933 76469 76800 72831 77576 73251
12478 73251 74112 81861 91093 93839 96106 104506 111943 125836 141366 149985 159354 174721 195707 208748
12464 208748 218696 230191 240736 257075 267144 271162 278525 281053 276419 272060 262607 248036 235646
12451 235646 219791 200562 186710 185588 176595 167258 156625 150563 146381 138440 128426 119737 115193
12438 115193 113601 114105 118651 118832 122867 119455 114358 114341 117827 124165 128542 125869 130975 140818 154587
12423 154587 168793 180555 188793 204879 226602 249708 266020 280166 290371 294102 296396 295768
12411 295768 288352 278599 267672 257862 243906 226691 212534 205535 192178 170520 154275 142287
12399 142287 135729 127792 118933 116278 117759 113031 109460 104030 99167 98399 98236 99371 100843 96648 97700
12384 97700 95451 94361 89959 90844 90371 99940 107311 108456 114436 117688 119229 115957 117872 125092 137083
12369 137083 144765 138907 130634 122058 119332 117632 107750 100969 93370 89552 90299 85897 76650 66370
12355 66370 65410 68215 67125 62238 62209 60091 51160 49455 49028 48013 43557 37568 33403 39201 41357
12340 41357 35373 31420 22413 15922 18626 19377 25758 31931 27977 26753 27634 24715 18846 10834 9022
12325 9022 15895 18419 9998 10743 20569 22291 18638 13158 12446 14409 16851 18000 16470 18169 21545
12310 21545 24510 24247 22792 22340 19585 21541 25568 20683 13546 11306 7372 4395 4122 11190 16589
12295 16589 12940 8457 -1241 1086 2995 -2046 1897 7585 14386 16869 8072 7357 2186 1217 535
12280 535 6766 -81 -6622 -7303 -3377 -6820 -8617 -7923 -6659 -5115 -690 9457 12448 7190 2323
12265 2323 4922 11766 11742 14921 16343 13367 7237 2441 -1163 -1816 202 224 1121 2212 3273 1899
12249 1899 -3067 -3725 -1830 -85 -1255 196 -1297 -509 -1188 1409 8173 11969 16068 17968 20679
12234 20679 19370 20988 12505 6881 5385 2040 602 4450 2495 1593 1313 7257 6016 3283 -1337
12219 -1337 -3161 3325 11255 10966 5251 3742 3676 4791 2499 -2564 -2773 -1023 2306 2858 1590 2034
12203 2034 6115 1588 -1575 -121 3106 -1074 7 2111 212 2917 2153 -675 782 1928 7199
12188 7199 10723 5603 2859 -1139 936 -112 -4295 -2952 1467 1680 1046 2394 5200 3777 -8764
12173 -8764 -13482 -11191 -10880 -7436 -4016 -99 9839 13859 5855 968 -7183 -2450 396 6460 9089
12158 9089 7271 5308 8941 11130 5257 1914 457 -1168 2617 5598 6169 7545 1742 -899 -2797
12143 -2797 -5219 2135 4326 7318 8809 3831 -214 122 4954 4971 4482 -708 -3896 -4447 -4219 -5399
12127 -5399 -4687 -4001 -3953 -6131 -6779 -5500 -2123 -5914 -5358 -2828 -3165 -6370 -12055 -10669 -2589 906
12111 906 3560 8555 9323 4985 6674 2690 510 -928 3260 3968 2829 6819 5417 5555 1302 -10879
12095 -10879 -16822 -10796 195 2567 3295 1110 942 -6416 -7481 -2638 2083 2923 -5570 -10269 -9542
12080 -9542 -6102 -1848 2385 -55 -6918 -10116 -6399 812 5031 2626 2061 1068 5501 2126 971
12065 971 6647 7863 9714 4892 -1023 1074 -391 -2466 4896 8696 8498 2239 3536 3935 -2421
12050 -2421 -5643 -7761 -10222 -7527 -2914 2379 133 -1310 2738 611 596 -2935 -6437 -15362 -20387
12035 -20387 -15566 -8039 -3307 -103 -546 -1646 -8235 -6621 -6771 -2808 -1626 -1310 831 -470 -4817
12020 -4817 3198 11525 12323 6253 6900 6401 2436 8860 8646 6643 12596 13717 11292 6601 1787 5380
12004 5380 6826 7263 8758 6226 3037 7912 10762 10145 6254 2372 2625 5138 3882 2430 6914
11989 6914 5744 5992 558 3880 1898 406 1334 6175 7678 9180 8704 5454 -1587 -7415 -4534
11974 -4534 -2627 175 -2200 -3639 4930 6167 2743 6456 11946 12446 13268 12481 5090 1095 -1393
11959 -1393 4132 9726 13861 10688 10720 12080 7694 10103 8693 3532 -105 1742 3297 852 -4660
11944 -4660 -4336 -1571 481 -597 4133 3678 1491 4801 4384 5935 6535 3241 159 -2435 -216 8141
11928 8141 4642 2819 2884 7203 11852 7531 5486 3875 -2867 -11115 -10549 -4582 -7495 -10585 -15212
11913 -15212 -8750 -6080 -7292 1552 6578 -387 -8464 -3329 -1767 -458 -1523 -4745 -4552 -3377 2931
11898 2931 5516 3471 342 -3718 -1786 -2718 -5039 2377 1214 -5609 -10422 -9265 -8941 -7992 1195
11883 1195 5845 -728 -2067 -4954 -6723 -6146 -8986 -7211 -4055 -1576 -3355 -3661 -5453 -9150 -13343
11868 -13343 -12893 -8711 -4582 -1910 -5534 -11163 -6963 -1570 -6055 -4053 -1731 941 -1587 -11303 -11135
11853 -11135 -5874 1780 4961 6760 3772 109 1230 4937 8960 15508 13510 4448 6998 9982
11839 9982 3734 -970 -2386 409 1635 623 -340 4701 2020 -3499 -7549 -1645 -2192 -3794 -8483
11824 -8483 -9197 1560 5769 -1917 -9572 -6851 6000 11728 6946 3306 162 888 4861 5337 2407
11809 2407 -1642 -2784 -4397 -1951 -1661 3250 7704 5971 713 -3386 -5663 3387 11297 14053 13418
11794 13418 5911 2955 6102 6085 1258 -2941 1937 2084 1419 2017 -3639 -2545 3055 2621 4387 3623
11778 3623 -1245 2475 -1035 -11439 -10236 -6427 12 3540 2438 -873 364 4688 9040 4334
11764 4334 -138 -4066 1267 4805 2792 4718 5644 3200 -1988 -2759 -6704 -13501 -21406 -19716 -18298
11749 -18298 -10573 -2857 -8374 -11769 -17028 -15414 -10575 -7852 -4004 1885 3467 2377 -2822 -3041 -5132
11734 -5132 -4863 -1632 -6186 -3303 879 2123 -1925 -9873 -14163 -11165 -5360 -5066 -6985 -5205 -6982
11719 -6982 -9834 -8588 -7946 -6901 -9761 -10600 -5712 -4239 292 -3204 -7314 -10093 -2166 4871 3813
11704 3813 3483 4028 1248 -4445 -6977 -1441 -1553 1829 5669 4000 3766 7545 8138 2723 -6986 -10737
11688 -10737 -8273 -4881 -313 3938 2350 10208 11083 15345 9814 8471 9377 7689 3185 -722 -3618
11673 -3618 -4413 -3811 -5205 -5119 5133 5511 6172 3939 -2902 -7976 -6517 -6460 299 -44 -6991 -3414 806
11656 806 -5087 -12075 -6769 -10436 -13201 -12498 -11470 -13071 -7737 4431 5177 -1119 -1313 -5327 -4176
11641 -4176 -41 5196 10682 16837 26232 25466 23801 23807 19392 10351 4603 -3527 -12015 -10664 -6336 -6479
11625 -6479 -2558 948 -3617 -8600 -12059 -15771 -14510 -10019 -6944 1044 768 -1839 -2477 -5720 -16028
11610 -16028 -16346 -14340 -9458 -10339 -6596 -2527 -5875 -13666 -9218 -525 -505 1464 -4204 -11226 -3768
11595 -3768 6577 11216 13830 11739 7850 11240 15007 14376 9117 10878 9759 5559 2945 -1675 -6435
11580 -6435 -7859 -7686 -8916 -8306 -2673 -7656 -9569 -1475 -1820 -5759 -8294 -9755 -7254 -4365 2847
11565 2847 4028 1999 7720 7622 6231 4255 -2724 -6888 -908 631 -7033 3710 7391 8815 1951
11550 1951 811 306 -5624 -13527 -7416 -9742 -10077 -7913 -1209 5018 10489 8847 7691 7636 11489 11427
11534 11427 10310 2650 -2157 -6901 -6564 -1842 -3309 173 2788 -1305 -5621 -900 6891 8698 11641
11519 11641 6893 4214 2122 315 4720 5089 4281 2153 3492 8227 13729 12798 3571 -8414 -7066
11504 -7066 -2484 -2072 -2464 1986 9043 5835 899 2355 7145 5982 -1166 538 6405 8978 8918 3909
11488 3909 1227 3481 1465 -1095 -5312 -3609 -7348 -13889 -12568 -1808 -1083 -2079 2618 5704 1617
11473 1617 -2503 -2951 -4847 -2808 -2282 -638 -2014 2241 8682 10585 7649 3054 2939 5310 2861
11458 2861 -2047 -8545 -11893 -12105 -5241 -417 1225 1541 2635 1884 -32 781 -3339 -1824 -2206 -2219
11442 -2219 -2753 -1513 -6669 -3914 -433 7869 11145 5904 571 2575 11927 7337 1376 3015 4097
11427 4097 7129 8812 11973 14855 8056 7417 4912 -1697 -790 291 -474 1853 2868 2550 3918 6720
11411 6720 6896 4114 4930 2367 -5784 -15040 -15570 -8321 1617 -1125 -6589 -6942 -3195 -1423 -1047 -3047
11395 -3047 1611 4818 7770 3273 -358 -3844 -2255 4880 1817 1941 1850 2887 8244 8845 6584 8277
11379 8277 9505 15947 11862 2295 3073 4723 177 1254 1699 7815 10450 4810 4241 1973 -2016
11364 -2016 -102 1243 2186 -539 -3822 176 3768 45 -6621 -12663 -16363 -11970 -8312 -5262 -707
11349 -707 7625 14659 9351 6648 2936 10020 7201 799 3106 7398 7901 8612 10522 11363 4143 2794
11333 2794 1117 482 9643 4482 2439 913 -1784 3143 8819 7800 7849 4705 4048 6930 979 -7849
11317 -7849 -9903 -2340 -2401 -1556 5429 9703 9917 9684 7731 2487 5793 5718 -575 -393 2855 6969 8850
11300 8850 9482 11053 10535 13550 12496 11881 8517 7458 8564 7879 10548 16230 12892 3166 -141 -361
11284 -361 1245 6032 8403 4271 4880 8946 9358 9442 6234 -4318 -11417 -11204 -1270 -3793 -4790 -1149
11268 -1149 8367 11056 6062 6747 8348 -1227 -3809 -1469 -3670 203 4848 3510 5414 6567 6344
11253 6344 5378 2498 4345 7862 7968 -700 -7020 -4514 -9463 -7273 -1716 6546 8264 13226 17908
11238 17908 13852 3024 -1507 -2971 548 6700 1834 2057 -395 1145 -185 -2008 -1727 1931 4974
11223 4974 894 2463 841 -772 4045 9832 11819 4539 -2217 -1618 2323 2553 -1240 50 2814
11208 2814 5128 7510 8120 11251 19994 22980 25467 22528 14995 664 -1376 -233 -1571 3881 10156
11193 10156 13233 10157 6197 -612 -5664 -9743 -4462 -6163 -6542 -108 8687 13048 13771 18595 16354
11178 16354 11480 10444 9396 9743 8344 11475 16566 15696 11336 11633 9258 1234 366 -81 -4222 -1749
11162 -1749 3888 9065 8791 9225 7427 6278 9880 11890 14500 10355 5201 9545 6922 4526 2838
11147 2838 1105 208 -935 -626 2063 4059 6800 7750 9243 12088 15010 16336 16116 11832 7231 10517
11131 10517 10807 5583 9319 12636 11184 14821 27403 28921 21210 15979 12747 13018 11462 16762 22042
11116 22042 28366 24767 18274 16986 15657 8677 2607 7420 3454 5636 4938 6351 9789 12213 7846
11101 7846 -208 2182 5615 11353 17456 15036 10380 6436 4595 7352 9712 9842 6746 6579 7302
11086 7302 8647 7988 1472 369 143 2745 4432 3632 -2862 -3418 1198 2493 6739 10272 16183 17899
11070 17899 19012 16817 15148 7247 9978 9842 11853 14653 14917 10269 12625 13083 9971 7657 10928
11055 10928 4966 1895 10011 17969 21875 12649 463 2847 2940 7182 3829 206 -3136 -2388 562
11040 562 3262 2921 -957 2174 13124 14344 9566 9538 10613 2487 -1010 -352 2037 3422 7540 319
11024 319 -5489 -4902 5561 15777 17227 21387 16561 12452 13547 11994 9002 9083 8680 8346 9464 10592
11008 10592 15600 17206 14631 11933 7172 3225 4083 4882 9340 12176 10124 10693 8997 5691 95
10993 95 2609 11168 18272 12950 12151 11205 14764 12139 10364 9168 7998 8763 15421 13130 5787 8475
10977 8475 16299 15630 8777 5674 6898 5533 7181 9171 14075 13651 15272 15277 13616 16087 13494 11915
10961 11915 18984 17844 11308 11961 11582 17414 17810 14673 10880 4186 3633 8785 12681 8921 7109
10946 7109 11402 10493 6405 6185 11907 8922 12022 9335 15405 17110 11538 20296 23195 25091 29233
10931 29233 22100 12713 11811 11997 11514 13793 12214 11607 13052 18400 26034 27047 25997 23575 25811
10916 25811 29562 33333 30802 26360 27882 24769 20624 15950 13653 7088 15576 22606 17561 19358
10902 19358 15963 13374 16520 17327 19733 20326 19968 21158 20321 16669 15014 11834 12046 8140 5393 13802
10886 13802 15765 13705 13376 14782 16221 15779 17404 15238 16069 17688 22944 22298 19128 17481 18866
10871 18866 23965 22088 22141 24313 21407 20756 27423 32504 29955 26119 22694 17283 21092 18940 20366
10856 20366 15176 8930 9112 10866 15140 13687 13189 12966 19956 19592 28220 30629 23018 18920 24051
10841 24051 19610 13855 14248 15025 18225 15339 18226 21818 19369 23571 28562 30171 29336 23841 25559
10826 25559 20203 16917 20229 22871 21307 21180 18870 23878 22303 21875 13619 17296 21376 23496 23345
10811 23345 21340 22454 23927 30400 28397 26174 21893 20448 26457 26459 24945 28729 31467 33534 32530
10796 32530 33784 26086 23048 24202 25723 18554 22621 31241 31797 32729 30136 33195 33211 26760 28227
10781 28227 34631 36743 27946 31790 34977 28449 32813 41285 41813 35365 37443 35106 36445 36805 35438
10766 35438 38847 46167 43272 39378 40397 40436 33345 33568 36405 30403 27970 28263 25290 19835 17350
10751 17350 24912 34280 43293 40266 32689 37148 41802 38844 37249 37907 36535 35974 32279 26881 31569
10736 31569 35984 36836 35298 32802 33349 41431 42387 24665 20252 16908 10217 17748 21476 27515 21722
10721 21722 24903 25384 20625 24296 29070 28568 19318 17630 20547 19413 21519 31887 36462 33468 30000
10706 30000 23610 25552 27302 26451 27914 34350 35324 35779 37040 36080 28679 26531 26878 30602 25622 26203
10690 26203 29856 28098 26198 25880 26013 29493 31775 38008 44858 44094 38245 36657 36458 33687 29322
10675 29322 31312 35974 34177 34179 35972 35875 30034 31583 33452 34585 35233 35984 32231 29551 38049 45571
10659 45571 48369 46695 41787 37039 38483 39219 44318 49608 49028 45286 45020 49893 44250 44529 43942 42546
10643 42546 44690 37444 39331 46799 45322 41367 41957 43462 38572 35716 41353 50159 53531 52183 54330
10628 54330 52439 48652 47014 48733 44912 43266 42175 49711 47456 48208 45736 41816 42020 41040 39546
10613 39546 36666 34163 34918 35559 36963 40241 43281 44393 47400 48136 50468 58468 57983 53816 55488
10598 55488 55823 57678 58490 55763 52721 50692 53507 51595 52908 51323 48315 53609 60888 65435 61078
10583 61078 63436 67373 65182 70385 63139 61508 61182 59016 57236 56671 53638 52401 50076 47370 44585
10568 44585 50622 57790 54428 53770 59160 62843 64061 64120 69925 70484 80599 91527 95975 93688 94291
10553 94291 93484 97043 108243 117300 125951 136870 142452 152751 172414 188495 216586 262375 326295
10540 326295 413620 542838 704491 901127 1112144 1306820 1451856 1507532 1474106 1365561
10530 1365561 1205000 1009659 801092 622800 488445 397079 339417 295367 270105 255865
10520 255865 238696 222352 208785 207938 200142 194175 185467 176461 165776 152884 149084 148308 142774
10507 142774 137235 130242 127003 122575 123997 126722 127261 123221 117059 118954 124369 126253 125592 118074 113390
10492 113390 112670 106570 102426 101462 96304 87949 96223 101183 98063 90520 93424 92848 81672 76225 76849
10477 76849 77487 75087 74748 76587 83494 84862 83740 78887 80010 85745 88273 83988 84636 89733 93198
10462 93198 91005 91451 97014 89838 86701 84352 80703 81659 84364 90275 81867 76033 75864 76016 76509 74713
10446 74713 65930 60537 54265 36358 28405 28303 17857 6788 5896 9017 19033 28414 38850 54452
10432 54452 63343 59053 56207 53282 52270 61004 58549 62607 67797 65138 62146 61258 67084 61601 60555
10417 60555 65350 69853 71499 64507 64915 75338 75773 81433 84972 86512 92377 95199 97817 94191 88844
10402 88844 88809 98912 101876 95396 94012 99394 105725 120205 134287 151632 172714 192763 205121
10389 205121 224785 233155 238216 233271 228439 220745 213901 206403 189968 173268 164243 161042 163456
10376 163456 163779 164218 167812 165534 164150 162732 160667 153914 152175 156962 157845 152030 145166 139639 143755
10361 143755 142073 137775 141185 132166 127606 125934 123961 121494 128134 130292 128198 131063 131687 132278 139790
10346 139790 140373 145777 148424 144785 141032 137466 138657 137047 133162 129611 125448 125736 127941 123894 120811
10331 120811 117508 109574 102413 103527 101544 95478 92102 95536 100553 96218 87878 81936 77623 70308
10317 70308 66275 69806 70806 68206 65389 64485 69185 77339 82576 84105 76902 72829 80317 83654 84212
10302 84212 83542 83044 83183 83692 84145 86448 91574 93548 92272 85281 86730 85658 84402 83628 79492 89328
10286 89328 100298 108254 118746 124701 128401 133979 138272 142253 150684 147934 141586 134580 129333 121652
10272 121652 119936 113185 115427 121970 125148 125485 122289 124380 137717 158000 191422 242689 308064
10259 308064 372249 438090 501142 547692 564683 571649 578017 572056 560002 556543 548510 541248 536353
10246 536353 535772 535925 526641 519871 515352 502747 488597 476699 462620 463341 462784 464597 476842 494217
10232 494217 506134 519635 537921 555269 569888 585791 597062 612254 621382 627386 630257 636916
10220 636916 655653 663895 672916 691519 711083 723862 742457 761507 776440 794053 815137 837692
10208 837692 859982 876396 888609 896229 912321 929920 959757 987453 1015137 1045400 1086693 1153877
10196 1153877 1237163 1333897 1428047 1507555 1566753 1596957 1594406 1584783 1578748 1579450 1583219 1574533 1563913
10183 1563913 1565167 1585076 1617300 1650001 1690490 1739946 1787588 1835910 1887369 1942004 2008195
10172 2008195 2080115 2160296 2250574 2355294 2478679 2599893 2732772 2884151 3050020 3250010
10162 3250010 3476406 3740807 4062936 4445092 4905017 5448323 6051273 6702420 7379672
10153 7379672 8057484 8722096 9422898 10224765 11197999 12412898 13968694 15982287 18580407
10144 18580407 21924566 26264274 32091698 40371820 52696797 71106374 96994036 129471567
10136 129471567 165740049 202682157 235573485 257517036 263246739 253937233 233684877
10129 233684877 204832602 169118745 132014317 100638526 78196787 63314791 53403336
10122 53403336 46510309 41458018 37555789 34376341 31702921 29415917 27463935 25819437
10114 25819437 24449997 23271861 22193886 21138688 20067503 18997839 17943425 16921074
10106 16921074 15955067 15085214 14335804 13714520 13196572 12771091 12419452 12139000 11900427
10097 11900427 11694824 11513733 11326047 11120177 10876100 10591640 10264287 9900426 9500372
10088 9500372 9080404 8673433 8299132 7937204 7602218 7302998 7041188 6793809 6559134
10079 6559134 6335119 6125038 5925456 5731941 5546964 5370718 5207754 5057309 4907136
10070 4907136 4763779 4631005 4500477 4372531 4246033 4124422 4018998 3917756 3803284
10061 3803284 3688704 3574340 3462723 3355926 3252053 3155073 3068927 2993497 2927268 2860085
10051 2860085 2789276 2724691 2669037 2615951 2553692 2486022 2416787 2352765 2287470 2220056 2147876
10040 2147876 2075464 2006847 1943055 1888635 1840374 1791317 1749006 1719627 1677640 1640366 1606183
10029 1606183 1572015 1531008 1482067 1430537 1373110 1327105 1282000 1239255 1198767 1163640 1132574
10018 1132574 1103754 1069788 1042189 1015629 989509 965468 950485 939442 931609 932339 946284 963146
10006 963146 985125 1017176 1043978 1069449 1086958 1098737 1098200 1084940 1058814 1027730 993325 963214
9994 963214 929026 888880 854761 823063 784727 751386 727791 701742 679574 654318 629896 598467
9982 598467 564816 540835 530228 519977 505057 496340 489785 482361 464964 449593 435499 432206
9970 432206 427639 423921 427938 424519 419744 409916 403510 399532 387830 383944 380669 374072 366840 361408
9956 361408 361108 363480 360906 354896 352129 348293 350274 351693 348625 341202 328450 322859 314572 311905
9942 311905 306459 295210 293935 293023 284449 282410 278757 278516 277164 273640 260545 252840 248096 236384
9928 236384 224458 221577 225781 221101 211860 206002 204789 210547 215977 214686 216962 220219 224520 232372
9914 232372 245398 262423 269684 275888 273273 272731 264858 250947 246786 241370 240047 240531 239931 238033
9900 238033 236206 235046 229913 231086 227229 224151 217393 209631 203859 200921 206973 214719 215922 223852
9886 223852 233397 235391 240774 242267 238636 237493 232477 227886 234437 233892 231569 237875 245876 257211
9872 257211 271100 281065 287891 289010 287785 296015 309304 310818 310125 310957 303843 297016 296666 294774 299639
9857 299639 305949 309514 316070 329847 338743 344191 350316 358051 363666 368988 377017 391379 401213 410645
9843 410645 425452 441072 446211 450899 464042 475949 491255 508674 527506 548119 571319 599788
9831 599788 630719 662624 700670 736199 768172 806490 848961 884971 924253 965968 1005166 1043851
9819 1043851 1092998 1147098 1203138 1268754 1343358 1417839 1487794 1568326 1658563 1758430 1867663
9808 1867663 1968841 2050389 2107555 2135892 2151624 2169578 2223487 2307531 2426801 2590769 2806710
9797 2806710 3102434 3518466 4085956 4920466 6203429 8327904 11930346 17433454 24149246
9788 24149246 30572371 35710861 38687109 37522152 31419802 22991074 15903044 11405340
9780 11405340 8727611 7058544 5976929 5244492 4729184 4335267 4010846 3732618 3487679
9771 3487679 3283935 3113815 2965796 2851233 2755753 2658548 2563419 2464902 2351912 2220624
9761 2220624 2084224 1953358 1853139 1779001 1704562 1654756 1616135 1580603 1548294 1521389 1502280
9750 1502280 1485260 1467028 1453943 1433674 1407042 1356775 1304577 1259019 1216335 1174237 1134512
9739 1134512 1102458 1082463 1065675 1057967 1073552 1107274 1164402 1260917 1397972 1560197 1743376
9728 1743376 1921651 2065837 2128459 2092980 1982212 1814881 1600740 1372753 1171772 1019345
9718 1019345 912268 836318 776747 729579 692740 656427 626918 601003 580976 562625 542000
9707 542000 523958 513522 503736 492352 475232 462774 456849 439598 422955 407419 397522 392425
9695 392425 381219 367865 359050 347883 336034 326017 323008 323640 318583 314750 306883 302065 297823
9682 297823 289124 278038 263524 251798 243360 242920 238799 238412 235422 228818 223336 218705 208319 193250
9668 193250 183291 182365 181646 173348 167958 174508 173029 177221 182199 189656 196690 201398 208319 210441 206491
9653 206491 202998 199210 201327 201659 195187 185399 180034 165641 156282 151646 152984 149418 147817 139419
9639 139419 141253 139398 133152 126488 127382 130178 127447 128947 128213 127214 129147 129303 131044 126849 117714
9624 117714 116902 118675 118113 119768 115560 111876 111219 116746 117699 109482 102963 105966 115023 117962 119227
9609 119227 124634 118402 118824 119781 121449 123672 120500 120452 114315 108295 105127 104044 106385 114501 111497
9594 111497 113092 120119 118201 117209 114889 109962 105877 105680 112476 117385 123078 126170 123570 120459 120473
9579 120473 117493 118466 115678 114140 115297 118715 113933 109482 108523 106791 112373 119555 118079 114413 115665
9564 115665 110720 104999 101991 104472 105482 104760 101197 101485 99237 100906 106223 105475 100927 100095 97757
9549 97757 93969 96082 98869 98048 97847 98335 100416 95459 100284 103973 97242 87758 86160 89006 87131
9534 87131 80912 76452 81622 87476 84766 75783 72733 81006 84983 80720 80807 75765 76092 79894 77052
9519 77052 76151 75698 71324 69925 69189 67123 68679 66978 66124 66231 64661 57093 51907 46933 45065 45325
9503 45325 46446 43227 45882 53176 56287 52230 47594 54077 52931 50893 49633 53788 58864 58336 50480
9488 50480 51105 47298 45581 52714 48310 44035 47586 51286 59847 58724 55958 55914 54887 51535 54330
9473 54330 56914 52534 43146 41456 43749 43535 40138 41054 48154 38760 24451 22174 26030 27412 29775
9458 29775 32037 29377 30524 36024 39063 40358 46691 39259 33838 33346 30637 34405 34273 41267 54305
9443 54305 53218 45328 43186 42350 45084 46879 46997 40700 38544 41412 42989 41386 42242 41285 37369 30388
9427 30388 34481 39516 37957 37238 38317 34781 33900 33978 30498 27994 27665 34998 32510 35071 39885 37648
9411 37648 29813 27988 28658 31512 33459 29398 33922 35926 32439 28980 25758 30683 32312 30989 35137
9396 35137 36438 38714 36712 44427 51644 57362 54509 49392 45718 50654 54767 54454 50339 55098 59120
9381 59120 67406 79746 97091 125546 156926 191541 217099 229859 227723 197809 154816 121557
9369 121557 97296 84018 70087 65116 64419 62160 60724 61559 62594 64529 66838 62998 57587 56433
9355 56433 54449 50697 48126 46469 45534 48136 48105 46040 43435 47319 50471 49490 49052 49568 49637 46975 45841
9338 45841 40474 40510 38339 33692 33097 38271 42946 44602 42929 36928 32042 30923 29206 31430 36698
9323 36698 35251 32073 37824 37944 35198 32055 32655 29848 31706 42681 43907 45466 46714 41822 38839
9308 38839 41258 42527 46878 46099 43068 33898 34251 35973 33877 32490 33650 39141 43085 44738 45525
9293 45525 47764 45731 42325 40612 36701 34174 34145 33482 39388 47346 54479 58713 55765 54227 49420
9278 49420 50482 54085 51502 45100 35188 36093 43893 46016 50397 53044 49605 46111 45893 53065 50062
9263 50062 47064 46685 48107 46312 45776 47570 42086 38151 39588 42407 40969 40104 44516 41148 37466
9248 37466 40230 43416 38723 35330 34974 36579 39630 45057 43686 41531 38779 39839 38014 39768 44980
9233 44980 47232 46864 46264 49395 49490 53327 55331 57105 53596 51752 48277 44602 39509 41523 45019 46697
9217 46697 48245 45972 44252 41705 39403 40775 45493 46775 41262 39180 49459 53789 58992 54114
9203 54114 53153 54600 50642 45560 46956 46400 47705 43094 48170 50092 43806 37832 43014 51283 54480
9188 54480 53627 49939 54696 55257 55961 60350 62949 59901 63805 67183 72359 72275 73117 69989 65913 66595
9172 66595 69530 71909 79668 89111 96965 102304 112826 130302 147465 174922 217609 286775 373591
9159 373591 446321 496344 519129 488776 407109 311138 240825 199253 171371 147233 128942 119118
9147 119118 113924 104871 106896 111021 112570 113880 109367 106032 105864 106175 109216 111962 115365 114210 111447
9132 111447 105604 109746 108695 102213 102208 107036 115872 123296 134463 143606 161163 181202 204001 240643
9118 240643 291246 377609 506003 655718 791531 896551 957331 924944 768842 571327
9108 571327 423189 331022 277278 234067 202100 185241 180452 171585 163477 161031 159360 157711 153791
9095 153791 147275 142545 137870 134238 132911 132110 127795 121444 117291 114991 118798 117847 112704 112746 120102
9080 120102 125991 128050 142414 154047 166498 170701 177930 198840 233481 277421 334112 403037
9068 403037 467512 506425 493012 427099 332128 261075 211763 179630 161413 142284 136371 135981
9056 135981 131736 123633 115330 110713 117196 120925 119566 113806 113675 110912 107907 102907 97723 90994 88566
9041 88566 85237 88484 92156 95080 95027 91192 93741 104732 111848 115157 117757 115251 106990 102818 96678
9026 96678 84089 67865 53594 57120 62009 51185 48113 47345 54720 76729 96385 102836 100878
9013 100878 103979 109491 114309 114329 109365 104235 109768 108679 99259 88477 88244 90970 94610 100166 99431
8998 99431 101751 99038 105089 106910 106485 104923 109503 114507 122471 135601 142368 152422 160566 165297
8984 165297 163108 155497 137216 119349 102945 97311 99330 100244 102158 97347 107627 131393 157226
8971 157226 170632 176646 182699 183001 183986 182793 182821 184324 172220 150189 137276 136831 134763 134607 134156
8956 134156 138780 135922 131759 129733 132987 136276 137310 139041 135311 135438 148231 155935 158962 169994
8942 169994 182260 200523 213145 212489 188601 155907 133189 122006 116135 114425 114500 123304 126772
8929 126772 128386 140264 155060 162518 167809 170069 168081 162926 162085 164127 162699 154290 147013 139461
8915 139461 134294 128512 125905 124427 129008 128594 129388 132730 139311 141136 137416 136416 138062 134650 137169
8900 137169 131204 121355 124323 129223 135902 139179 135057 126449 115676 102350 91837 90775 101786
8887 101786 115106 132460 155476 178899 192659 215027 225679 228402 227265 223301 227537 226196 228122
8874 228122 225895 216007 214301 210696 207930 210115 210531 210659 207438 205082 209225 209195 216539 218926 221739
8859 221739 224915 227920 227562 231451 233812 230958 231697 236869 236116 229621 223560 222069 222968 226784 230110
8844 230110 230772 240227 265861 308751 368029 427662 479230 525884 550302 547850 539981 542299 555674
8831 555674 568771 577280 588811 592356 594157 584009 572191 562387 558335 553556 547721 544424 545825
8818 545825 548394 562633 579045 587800 598753 620203 634877 650370 667742 684189 702238 722530
8806 722530 736578 754289 773369 778401 795374 824759 857730 880925 910988 958304 1010732 1088835
8794 1088835 1164121 1227296 1284475 1334968 1384044 1420570 1453812 1511520 1589639 1673515 1763578
8783 1763578 1867834 1976356 2082775 2190188 2303720 2438319 2594561 2787189 3038383 3374285
8773 3374285 3785433 4270105 4849852 5525698 6327115 7321749 8655521 10518662 13206399
8764 13206399 17257322 23601471 33541581 47434086 62133802 73829216 82417249 85018838
8756 85018838 76852447 59510975 42889155 31613255 24452888 19821011 16767869 14710275
8748 14710275 13274652 12235773 11442846 10786965 10220377 9752473 9377626 9057397 8765085
8739 8765085 8501358 8296634 8136052 8010440 7946331 7940674 7993373 8100511 8286007 8610690
8729 8610690 9101470 9738170 10519954 11488368 12669929 14085175 15846744 18230149 21554307
8720 21554307 26333148 33541798 44945188 63292621 90325373 120137748 143487509
8713 143487509 161573251 169680482 156728445 122257241 87522070 63820942 48798729
8706 48798729 39056656 32582870 28188922 25112197 22869492 21155563 19768635 18566809
8698 18566809 17512153 16609368 15779640 14944252 14132529 13423117 12801302 12239225 11739876
8689 11739876 11314817 10965924 10696329 10499769 10385951 10370083 10461436 10659022 10969351 11405521
8679 11405521 11980852 12764991 13849201 15363538 17526157 20777844 25845368 33858930
8671 33858930 45765042 59889642 71944267 80927207 85643309 81345041 66472992 48968139
8663 48968139 36136977 27917637 22595152 19049209 16621048 14897774 13616188 12624766
8655 12624766 11826814 11138921 10539303 10016759 9517867 9006587 8497039 8023758 7601860
8646 7601860 7221680 6877726 6557976 6265528 6001478 5761745 5536720 5328692 5148149 4986632
8636 4986632 4856769 4747496 4655789 4582025 4529001 4487081 4439414 4380426 4306259 4208015 4077182
8625 4077182 3940667 3807955 3663901 3517467 3373974 3242517 3125920 3022986 2923281 2833505
8615 2833505 2766443 2705228 2638821 2578282 2514505 2450221 2391962 2340347 2301009 2258317 2215173
8604 2215173 2174828 2140200 2118297 2111683 2120490 2150024 2185635 2231169 2297801 2414765 2611073
8593 2611073 2937207 3490581 4443903 5954900 7766832 9249488 10420100 11119896 10575785
8584 10575785 8541966 6323325 4849966 3956186 3381737 2998584 2729967 2527528 2370553
8575 2370553 2244447 2140813 2055961 1980995 1913474 1860191 1808324 1756496 1710105 1678537 1652049
8564 1652049 1634210 1623659 1627423 1667283 1749721 1888298 2059005 2209497 2355938 2481801 2528742
8553 2528742 2480428 2458118 2550873 2768174 3143607 3745382 4733263 6414411 9194124 12835976
8543 12835976 15952326 18390601 20178007 19782418 16114677 11450623 8235448 6297142
8535 6297142 5082058 4281765 3737387 3345567 3061305 2853121 2684790 2535972 2412518
8526 2412518 2310366 2223721 2127188 2022755 1938216 1871303 1816189 1773192 1765817 1794460 1870182
8515 1870182 2048547 2311268 2531615 2713353 2872629 2887357 2651072 2317859 2114233 2046223
8505 2046223 2074156 2188637 2423810 2832094 3528658 4693810 6345510 7954086 9157226
8496 9157226 10071296 10155805 8772036 6472924 4651027 3537457 2854972 2415791 2113422
8487 2113422 1903324 1751390 1634044 1541984 1470999 1411641 1353519 1305761 1252273 1195176 1139977
8476 1139977 1095055 1066449 1044874 1037136 1047617 1091710 1184181 1289761 1367363 1428987 1447691
8465 1447691 1364867 1180283 998216 878969 804956 755234 723834 701439 692895 675041 657505
8454 657505 639382 619856 604507 592241 581161 568919 551740 528139 507173 489106 471438 457980
8442 457980 447716 429427 412155 392709 377769 366317 355371 348114 337950 333089 324347 323305
8430 323305 314584 305664 293564 283453 277419 274020 274803 270354 255643 247602 236675 229955 227134 227896
8416 227896 227262 230298 235048 236656 238664 238300 229148 227003 236150 240947 242272 240060 230219 216481 202093
8401 202093 190834 181575 178365 176420 177363 175648 169712 164308 156862 142648 127468 116063 112122 115981
8387 115981 123582 124294 121030 118704 114174 111865 115937 120112 120948 112314 108242 107979 108029 107311 106828 104249
8371 104249 107648 112165 114879 117232 123763 130001 126131 123556 130302 140145 148442 161795 179054 207190
8357 207190 247269 305173 381933 461981 519249 553074 535320 452715 347872 264342 210930
8346 210930 176740 148344 132594 125783 119807 117781 113788 110882 102615 96531 93796 88447 82644 82959
8332 82959 79056 75815 75166 78218 80717 82219 74698 75374 88476 97916 100084 102376 112519 127912
8318 127912 134203 143340 158765 185106 215673 266061 343919 463208 619417 768936 880487
8307 880487 953090 923528 773867 579488 431263 338847 273315 228507 198223 175316 159131
8296 159131 146253 134558 124686 115855 116288 104084 92004 87037 85167 76818 71136 76997 80329 79829
8282 79829 77857 81132 83719 82966 79591 84178 91518 91214 94092 101836 106768 109447 117518 125876 140260
8267 140260 172180 231348 309194 378770 431806 463555 454172 390240 303577 234586 190710 155742
8255 155742 127177 109948 101384 95189 85580 78170 68808 52951 46252 44084 41593 39472 39597 43188
8241 43188 50289 50842 54857 57638 53641 50162 49289 42736 47982 53608 45634 31283 28281 31806 37441
8226 37441 37831 35685 35717 33177 30577 27968 30986 24734 22076 21481 18871 25738 29508 26573 19655 22167
8210 22167 25068 25434 24239 24600 20316 18290 17627 11543 7231 5943 13018 14650 13828 17118 15437 15992
8194 15992 18124 14427 15014 7986 1741 4801 12610 19464 22566 32278 44145 53862 59546 65955 52601
8179 52601 44490 33789 26556 21562 24319 15535 13595 19234 18250 16079 20105 21911 20040 16693 15325
8164 15325 10009 11261 12512 11919 15801 13301 15639 23349 27489 30140 33079 28503 26837 26688 27244
8149 27244 19636 16672 18410 24211 24394 25265 28347 35284 44052 62548 85992 101990 113887 124656
8135 124656 115275 84525 64312 51290 39353 29592 21477 18976 25098 22785 16966 10240 9077
8122 9077 11855 15159 19674 12253 16445 13073 11110 11203 11174 11578 7664 7832 15885 23976 18983 9749
8106 9749 13521 19403 20980 23253 22869 23817 33244 30522 22655 18944 30628 39759 45909 54175 64523
8091 64523 67622 62588 49106 41380 34221 28225 31622 28602 25746 22908 21933 23482 21804 17435 10576
8076 10576 11870 15125 26401 23673 20776 24649 26578 18488 13263 15594 18868 22952 23269 14952 16324
8061 16324 14768 22507 22657 19243 20336 14992 11833 9452 2268 5458 9326 9826 3385 4452 9147
8046 9147 7114 7031 11077 21019 24287 29625 34933 36306 30787 27956 24071 24231 26439 24937 24473 21847
8030 21847 23722 21699 24654 24150 22000 20890 15862 17065 12621 8323 653 1188 8480 5729 6348
8015 6348 8253 6445 9438 12452 12409 11057 17103 13347 8363 6267 9273 7512 895 -3048 -6132
8000 -6132 -7035 -1609 9281 10580 12962 7046 8773 14010 15745 18365 18130 14369 20060 24555 24971
7985 24971 21994 19613 19473 15272 15023 10085 13436 15664 17577 18493 20290 21239 20172 15136 13084 16802
7969 16802 12975 6985 6551 16884 21793 18284 18372 12517 4136 1380 8184 11020 6880 11990 18515
7954 18515 16723 14884 17503 13839 8973 11337 16599 22940 25362 26569 29633 34102 36355 38310 35367
7939 35367 35490 31535 28316 29983 25694 21961 21897 25317 23146 23195 26267 20522 16399 16707 24251 29914
7923 29914 30458 28862 22135 19449 22302 19991 17179 11540 9190 12754 17000 15175 12851 18155 19505
7908 19505 18940 20946 19977 19384 18891 16154 20530 29258 33030 31232 32432 32399 32259 38353 34665 28148
7892 28148 28744 30355 25199 20187 21756 24739 22441 17116 13882 16177 17432 21358 24629 25520 19185
7877 19185 17740 22135 19777 16002 14752 12223 7806 5826 10003 13524 19386 14839 7944 15288 22168
7862 22168 20191 16311 15222 14095 14115 16265 14916 14958 15447 13484 15807 15791 11273 8831 3337 7394
7846 7394 6275 3731 2360 3647 10309 7714 1506 -6621 -4519 7833 7049 963 -627 775 8275
7831 8275 10255 4805 4176 2537 2963 3043 1451 -751 371 7480 7259 1206 -1445 -610 2821 5570
7815 5570 -2657 -5657 214 -5124 -5345 -154 1948 -1070 2094 7445 7523 11926 4578 -2751 -4939 -633
7799 -633 4785 5232 7105 12323 7970 5675 6448 1898 -2553 1546 3356 2556 5367 6915 5072 6007
7783 6007 6526 5263 8083 10255 1127 -2651 -1593 -3636 -4756 -3574 5056 2527 -5725 -4704 3054
7768 3054 2664 -1196 -1912 -5183 -683 -1522 -7114 -9125 -7115 -6097 -6483 -5863 777 2738 3019 4595
7752 4595 10863 6980 97 -2192 2745 4721 -4062 -2657 -1041 1506 5148 5949 4765 2404 2938
7737 2938 5316 5777 6287 5016 4 1088 576 -425 -740 2632 -3699 -7917 -6093 2281 4713 -2096
7721 -2096 -265 3082 2081 -2659 -8095 -4893 -3293 -8596 -12286 -4603 -2036 -269 4498 1760 -4751
7706 -4751 -671 -875 -4452 -3055 -7624 -8085 -4545 -3619 -7043 -3670 -5388 -14117 -14765 -12175 -5848 -3405
7690 -3405 658 1908 1469 -1798 -4354 -9491 -6137 -2047 -1960 -5834 -7231 -4612 -4222 -3894 -1079 1667
7674 1667 -2714 -3697 -3947 -8120 -9635 -1477 1916 -1479 -862 -1891 -6634 -10996 -10159 -6710 -2912 -6281
7658 -6281 -14373 -14227 -14007 -9492 -8119 -6674 -4396 -2471 624 6830 6495 8401 6364 6663 6978 3115
7642 3115 169 4127 5358 -255 -4733 -2440 -4380 -8083 -10115 -902 3322 7297 6607 4312 1531
7627 1531 4821 5955 2180 -5943 -6794 -7595 -12854 -13671 -6339 -891 2021 -4423 -5842 6449 12891
7612 12891 2802 -5542 -13778 -16991 -17653 -14036 -12099 -8543 -12079 -15210 -17042 -13598 -10755 -11920 -8561
7597 -8561 -3344 -4916 -2803 -1520 -3358 -1320 -4437 -10552 -14145 -13532 -13383 -11365 -5480 1473 -1576
7582 -1576 -7516 -8926 -11073 -12133 -14637 -7897 -7954 -9686 -10573 -13071 -14628 -9136 -1680 -431 -1322 -2285
7566 -2285 -2607 1201 3064 493 845 5573 6702 686 2036 676 -3127 -2359 -4494 -5500 -7070 -8886
7550 -8886 -11139 -14022 -10787 -4930 -7869 -15702 -14694 -12964 -8373 -6062 -1121 -1516 -5900 -9478 -13314
7535 -13314 -18256 -16943 -9231 -2798 4932 2901 -4453 -4491 -9699 -12696 -11586 -9082 -6903 -4343 -7246
7520 -7246 -7762 103 878 -973 1293 -520 159 1581 156 439 885 -4859 -7480 -3405 305 -2681
7504 -2681 -3059 -3697 -9214 -11225 -4812 -7249 -8171 -11103 -10812 -4683 938 2449 2953 2969 -2454 -9029 -7106
7487 -7106 -8685 -11610 -6190 -3004 -5351 -6408 -10071 -12461 -13216 -13598 -11910 -11772 -9958 -9421 -2870 187
7471 187 -1369 -5449 -9373 -6991 2254 2516 -7032 -8156 -2974 -3634 -6466 -6235 1742 4724 -2087 -1977
7455 -1977 -144 -2289 3105 2577 4521 11246 11549 5359 952 376 -4642 -864 1796 1744 -2509 -3437
7439 -3437 -5884 -4321 -997 2989 1616 -1890 -2390 -86 -4860 -4377 -898 977 4560 8551 9438 7018
7423 7018 6343 -870 -3481 -7852 -8885 -8958 -10248 -9433 -9776 -6584 -2090 -75 -1424 -3504 -8445 -6071
7407 -6071 -10309 -11145 -12488 -16529 -11324 -3126 1518 2133 -1864 -8985 -4676 581 555 2396 5797 498
7391 498 1609 1396 -1365 -1872 -3215 -753 -4499 -3652 -4364 -3018 -3567 0 528 -4360 -10097 -7952 1659
7374 1659 7990 7536 2496 -250 2786 -99 -2455 1653 3675 4575 4600 806 1813 5173 1970 -3195
7358 -3195 -2143 -98 -3404 -1280 -9045 -6702 1649 6656 4228 2194 4286 11683 6782 4884 -3852
7343 -3852 -7476 -4920 375 -1976 -3036 -2060 -6764 -9129 -6173 -7650 -12510 -13803 -16080 -15064 -8881
7328 -8881 -8367 -2889 4887 1269 -992 -1199 5309 1554 -2026 -4051 -4096 -3774 -5760 -4463 -2943 -2488
7312 -2488 -7061 -10722 -7335 -7589 -11833 -6354 -5189 -8273 -9649 -9640 -11198 -5489 -1899 -3036 -1590 -4854
7296 -4854 -9091 -9905 796 17909 13615 -133 -7581 -9966 -7720 -5793 -8912 -8484 -5260 -3840 -4572
7281 -4572 -686 -2363 -7587 -13641 -12854 -12891 -11794 -3689 3564 6258 -1535 -3185 -2167 -14742 -20686
7266 -20686 -12331 -7469 -6000 -8566 -7036 -4133 -1839 -5158 -11040 -13392 -23510 -29111 -28440 -25841 -17538
7251 -17538 -12269 -5416 -6327 -4295 -5608 -1080 1528 -479 -154 -1769 -9035 -4948 -6478 349 4457
7236 4457 -1230 -6956 -9069 -12959 -14591 -9119 -5541 -13526 -15873 -14943 -21239 -15055 -10457 -13408 -10151
7221 -10151 -8727 -4654 -3512 -5454 -1195 3046 8007 16701 24653 27149 26534 25588 24808 17272 12884
7206 12884 10361 3075 2720 1973 -4654 -11018 -7635 -5682 -11026 -8002 -6913 -722 -696 782 7902 7969
7190 7969 474 -533 4083 -1175 -8154 -10831 -13153 -11796 -5065 -1571 -943 516 -3039 -1622 553
7175 553 1055 2010 5780 2045 -347 2420 -2416 -5733 -7812 -13887 -11472 -7083 -7071 -15518 -19489 -18908
7159 -18908 -16679 -9739 -5276 -7770 -8823 -2863 -1471 -48 522 -1935 -10016 -13546 -17886 -20216 -14789
7144 -14789 -8419 -3878 -198 298 -1814 -3502 -12373 -13077 -3928 -940 1379 1637 -2983 -3448 1223 3698
7128 3698 5781 5759 3878 2848 2049 2616 3331 2367 -2252 -11743 -12432 -11636 -8243 -4559 -96 3212 -3555
7111 -3555 -8827 -14248 -14271 -15329 -12360 -7861 -8737 -7026 -8445 -11407 -15564 -17159 -9911 -6046 -8769 -8615
7095 -8615 195 9318 15291 10492 8544 7062 6690 3092 707 -544 4063 5919 6232 3329 -37
7080 -37 7185 12316 6837 4705 -2922 -8693 -7969 -13027 -5785 -7962 -4748 1286 297 -2322 -1061 -6487
7064 -6487 -14213 -3693 -23 897 -5346 -12690 -15480 -8894 -2930 -5689 -5912 -6560 -10423 -12297 -4062
7049 -4062 2286 -149 -9871 -13460 -13154 -6097 -4938 -7101 -9567 -12678 -10563 -6536 -2539 -4993 -11780
7034 -11780 -14039 -4852 703 5027 2827 -3403 -5816 -8534 -9142 -11013 -16239 -5354 55 3943 4220
7019 4220 6558 1645 -1576 -23 -2247 -10406 -8830 2534 1481 -4895 -10555 -4188 5075 4833 -3328
7004 -3328 -5055 -3457 -97 -7272 -4865 -6224 -11097 -13170 -11579 -4045 2355 -860 -2442 -4986 -3860
6989 -3860 -2013 -5878 -7158 -3595 508 -2445 -5609 -3541 -4702 -6244 -8193 -6461 -9045 -12381 -13389
6974 -13389 -11285 -5439 102 6013 10554 11667 9555 8768 1242 -3067 -3871 -9710 -11406 -9059 -9331
6959 -9331 -13510 -18326 -13652 -10531 -8198 -11379 -9215 -7849 -6776 -6029 2531 3141 3214 -2481 -4481 -1557
6943 -1557 -2241 -1757 1323 -1115 -5125 -8193 -8210 -9963 -11553 -10335 -9976 -12054 -12138 -14326 -11974 -9996 -12790
6926 -12790 -14598 -12714 -5981 -5344 -4757 -2447 -6598 -11207 -6580 -7081 -9967 -1894 2392 -1411 -1599 -5152
6910 -5152 -11263 -11810 -9395 -7807 -8923 -5556 3505 -2126 -4503 -4552 -5883 -1187 -263 -5774 -8817 -11669
6894 -11669 -5649 -1827 1374 -2972 -7541 2477 4269 -2920 -8163 -12024 -8803 -6119 -3677 -6835
6880 -6835 -6205 -6066 -1474 943 -456 -892 1280 -237 -2899 -7957 -8146 -7432 -10541 -6020 -5125 3951
6864 3951 13773 8138 589 -1715 932 -6493 -15088 -21286 -10767 -3140 -6919 -11290 -6315 -3006 -2102
6849 -2102 -6825 -8882 -8680 -6019 -4176 -4486 -14366 -19571 -10344 -11231 -7637 -7016 -10735 -14381 -14884 -13592
6833 -13592 -12269 -6853 -2953 -3513 -2674 1689 386 -4993 -8130 -12036 -9258 -3492 -1629 -1184 -2733
6818 -2733 -3748 -5284 -1763 -260 -7407 -7320 -11919 -6617 -457 6997 2245 -8091 -8776 -3474 1546
6803 1546 -2382 -5138 -7239 -8883 -6993 -7327 -7811 -7470 5252 8064 4647 -3978 -1588 959 -5443
6788 -5443 -7307 -10585 -8588 -4344 51 3608 6178 524 -6681 -8420 -5531 -5246 -6993 -7179 -9550
6773 -9550 -9663 -3501 4276 7415 -926 -6059 -4425 -231 -4311 -6561 -3708 -5664 -16690 -20811 -16358
6758 -16358 -17890 -13818 -6316 -6490 4069 6967 -1804 -10172 -13268 -14149 -8478 -8466 -11105 -10303 -9434 -6547
6742 -6547 -8398 -6689 -2240 -1197 -4240 -5250 -1764 -1459 -2267 -78 428 1335 1782 2 -3096 -3775
6726 -3775 -8102 -13663 -13212 -11010 -10673 -9207 -6339 -6081 -12582 -14044 -8410 -708 1397 4765 2923 -1289
6710 -1289 -1469 -477 3931 7143 9727 9325 11912 10978 7885 6231 9814 11240 13193 13656 11269 15213
6694 15213 17897 10160 6283 6406 8563 12887 6047 4043 8948 11686 15030 22979 28881 28892 36156
6679 36156 47302 65651 98160 133705 169552 192237 206148 195516 152353 106356 78679 61063
6667 61063 46639 39048 35022 29765 21213 23648 29945 26519 14406 5601 9172 13235 16907 13248
6653 13248 8783 12377 18880 21509 12670 8622 9930 5144 -3732 -5760 -2440 -6511 -6640 -2136 -1159
6638 -1159 2289 4468 5213 1137 -5109 -7314 -3002 215 -3959 1893 12190 9747 6043 4111 745
6623 745 -6839 -8094 955 1807 1573 4196 525 3977 7786 4741 5426 8404 10244 10585 8603 5747
6607 5747 -489 -5481 -7428 -6905 -5341 -697 3201 634 -7049 -6632 -2574 1677 6283 8029 5665
6592 5665 276 548 -172 -7239 -5891 -782 -1071 -698 -1272 1593 4584 10584 12248 6927 6747 1319
6576 1319 -2997 -6009 -10102 -17070 -12353 -5813 -3918 -4322 -545 54 -2815 -1309 1386 834 2795 -948
6560 -948 -9962 -12362 -11190 -1717 -2650 -3092 -8995 -11645 -4991 7830 12237 6495 2396 -2402 -5004
6545 -5004 -123 4970 1161 -4182 -5287 -213 528 -782 -5761 -8853 -2417 5860 3921 4884 7879
6530 7879 1133 -3032 -7874 -9133 -2735 -2254 -1402 -6875 -10934 -11259 -9285 -8830 -4963 -3556 -1454 -1545
6514 -1545 -1728 -4885 -7057 -7824 -10045 -15479 -11631 -7944 -12406 -10979 -5067 -6375 -4120 -526 5297
6499 5297 2278 -7275 -3945 -1266 -1484 2956 3007 1750 1825 820 -359 -3953 -9403 -4736 -2283 1808
6483 1808 3495 2226 1500 -8562 -8046 -6568 -5893 -3618 -270 3934 2258 2025 1847 1404 3013 2902
6467 2902 1581 -746 -147 -390 383 1554 -4262 -10604 -4044 3940 5837 211 -6146 -8097 -4346 -1599
6451 -1599 2361 5005 1374 -6162 -10822 -9291 -4820 -1436 262 -912 -3809 -3398 -3965 -7948 -4489
6436 -4489 2176 1771 -3287 -4498 -3129 -6621 -6383 -4043 -5161 -3714 672 3887 4847 700 1443 6264
6420 6264 797 2137 5610 1827 -2033 -8896 -11942 -10172 -14035 -13916 -6082 434 -2146 -3699 -2906
6405 -2906 -500 1940 -912 -7366 -4107 1118 2233 2580 4299 1779 -1756 -6704 -2337 -114 -2264
6390 -2264 -8360 -8624 -1768 860 6110 5212 -2054 -530 2507 1677 -9447 -12817 -7911 -6744 -4949
6375 -4949 -6673 -5203 -3858 -3223 83 5740 13018 7589 641 1198 -268 -4952 -7439 -7716 -4554 -6163
6359 -6163 -6330 -420 -7234 -11940 -6808 -5854 -4629 -3830 -5693 -7088 -7923 -7961 -9444 -11408 -7785 -10045
6343 -10045 -14053 -12421 -14920 -14280 -9513 -2316 -1741 -664 5372 2791 -5191 -5809 -1263 6700 10989
6328 10989 8933 4630 -4055 -5849 -1717 -5838 -2804 655 1373 -1350 -2988 -1719 -6755 -14993 -12123
6313 -12123 -5695 -4043 3032 3082 489 -2394 -2113 2541 -597 -864 -634 -720 2498 3477 4907 3845 8427
6296 8427 10155 1702 -7212 -11604 -7724 -4004 -400 4963 8380 2357 -7253 -11557 -7206 -795 -750
6281 -750 -3272 -7418 -13608 -14002 -11408 -4555 -400 3451 9006 3978 643 -457 -2673 870 1100 1885
6265 1885 5012 -1455 -4958 -7171 -3229 5414 2071 -6074 -8263 -13597 -12057 -12186 -9419 -6917 -9192
6250 -9192 -9127 -5231 -457 -1165 -6199 -3658 -2579 -4582 -13474 -10762 -2699 4779 4591 7043 2639 -3812
6234 -3812 -5283 -10000 -7105 -1503 -2902 -5085 -7705 -12092 -15848 -18210 -13831 -7468 -4229 2375 2988
6219 2988 -2273 1934 4614 7041 11279 10280 15187 15967 11705 7746 2647 -4385 3042 3626 -2327 -8049
6203 -8049 -4823 -5312 -6904 -11543 -8956 -6503 -4256 2500 518 -5320 -4427 1961 1000 -2072 -6027 -3595
6187 -3595 1848 3241 -1296 -7449 693 11283 15711 21000 10557 5708 349 -9153 -13645 -8540
6173 -8540 -1862 -4900 -8383 -7663 -4217 847 -1042 4000 10075 14832 11534 8157 2312 -4359 -6226
6158 -6226 -1719 -6895 -13739 -8670 -6084 -6109 -2610 1191 -253 -8676 -7975 -2733 -8048 -8695 -6809 -4548
6142 -4548 -8225 -10378 -13269 -12917 -17378 -20295 -21867 -23115 -21070 -18439 -15376 -13458 -5795 -1674 1747
6127 1747 2626 -3878 -8793 -4410 810 1012 -2687 -1541 -4844 -6516 -10008 -9503 -6952 -7645 -8101 -6106
6111 -6106 -11461 -6012 -2497 -8573 -10607 -8480 -4127 -2298 -5405 -4949 -7758 -8452 -7923 -6100 -4530 -8649
6095 -8649 -8017 -11967 -14400 -17853 -17966 -11624 -12724 -12403 -1304 1579 516 -2148 -3459 -841 4548
6080 4548 1176 -5812 -11541 -10768 -2147 2791 3740 8749 6746 2321 2349 3539 -1478 3314 8422 7870
6064 7870 5414 916 -5128 -9051 -11755 -13004 -10463 -2649 -4999 -2657 -1461 -5659 -5066 -4928 -3314
6049 -3314 -2771 -3106 1687 8154 13646 8568 -2637 -11322 -10032 -1117 2276 -4188 -8568 -8348 -10420
6034 -10420 -9008 -4138 -1744 2563 4959 4151 -2284 -2286 418 -2532 -2278 1950 1592 966 -6803 -4428
6018 -4428 2260 3434 7972 6628 1647 -1555 -3240 1701 174 2581 3337 2428 319 -3969 2022
6003 2022 7061 4904 10065 11692 7905 4105 55 -1462 -5941 -5833 -5929 -6156 -7356 -6218 -3820 -314
5987 -314 325 -1025 -3494 -9612 -12852 -6330 -2531 51 1297 923 -1796 -4079 -5215 -2145 -712 -6259
5971 -6259 -8205 -6517 -3471 -1217 -2380 -1539 -747 5087 3196 7218 7339 3463 4257 7459 3825 -3234
5955 -3234 -2762 -2672 -557 356 -5302 -10280 -13206 -6796 -675 -9667 -8964 -4027 -2349 -9415 -12888 -12684
5939 -12684 -6935 -5503 -2912 2529 801 -2593 -3230 -5333 -2698 -9720 -14667 -10092 -4475 2969 1683
5924 1683 4475 5196 4028 1107 -4519 -8586 -1451 768 -64 593 -78 4277 4125 7448 9519 8445
5908 8445 6899 1750 3881 -466 -10697 -4817 3945 7713 -700 1617 4609 5871 -1072 -1964 3790
5893 3790 9309 9201 9409 6044 7538 7298 5958 2054 -6700 -15427 -18268 -16075 -15878 -15510 -8361 -2257
5877 -2257 130 1702 4064 -1404 -2526 1495 562 192 -6866 -12618 -14133 -18564 -18128 -12299 -6091 -2987
5861 -2987 -2637 7409 11122 5407 1059 5357 5841 3368 8377 10625 4863 -3230 3160 619 1814
5846 1814 9272 7364 -356 -1817 -3641 -8663 -4687 4088 10505 13376 15951 12403 13468 10333 6400
5831 6400 3854 1785 -5185 -8407 -5238 -7651 -8828 -7493 -12433 -15564 -6367 -2308 -583 -157 667
5816 667 1151 -2006 2365 -3 -3985 -5499 -7650 -4488 -4675 -4222 -4737 -1659 -829 -6848 -8060 -6749
5800 -6749 -7728 -4458 -218 1897 3705 7012 12334 17778 25646 37367 43251 42346 26838 10975 -5229
5785 -5229 -14538 -19646 -17940 -11452 -11520 -7831 -4881 1941 3989 -3888 -9917 -12835 -9165 -7512 -5744
5770 -5744 -9816 -1133 1883 8094 10662 10806 5212 413 1317 8093 13244 8966 3912 -1450 -1977 -1479
5754 -1479 -2796 -3711 -9183 -7993 -4566 1141 3707 3421 9080 6017 5034 2167 -6676 -11165 -9710 -8646
5738 -8646 -4629 590 -3844 -13314 -15037 -13835 -10025 -8738 -6678 -4592 -1990 -2491 -2414 -3841 -9128 -7757
5722 -7757 -4941 -9346 -11178 -8297 -6879 -6454 1311 1242 -5324 -1409 3064 -930 -916 3015 76 -3854
5706 -3854 -6323 -10462 -8624 -9303 -11928 -12182 -11643 -12646 -13173 -10695 -7936 -5919 -10671 -14191 -13768 -16207
5690 -16207 -14399 -6815 -8553 -13118 -6002 -10917 -13157 -12276 -9181 -8516 -4752 -6152 -9564 -3744 -622
5675 -622 -821 1326 -3160 -7228 -4840 1240 7152 7182 -1542 -8273 -3333 -1298 -7013 -9742 -13281 -9564
5659 -9564 -5163 -497 2482 -1445 -8365 -3295 794 -10668 -13500 -6365 -7437 -11593 -13298 -11202 -5035
5644 -5035 -7938 -5140 -3682 2539 2575 -5479 -4653 3280 2885 -5815 -6950 -5183 -3578 393 1990 -593
5628 -593 21 1237 -2662 -1119 388 -4696 -7329 -9163 -8009 -2673 -1122 -4620 -7796 -6594 -7189 -10590
5612 -10590 -6137 -6062 -1827 193 -3715 -3147 543 4447 8640 5087 599 -6074 -6082 -2868 -4234 -2737
5596 -2737 -2903 -4515 -1128 -1586 -4037 -2916 -2389 1757 5114 6162 2617 -4095 -4085 -2167 555 568 7076
5579 7076 2930 2934 2859 559 -6279 -67 1000 -3936 -6861 -5661 -1143 -10643 -14673 -10563 -9787 -6479
5563 -6479 -5726 -9105 -10677 -7886 -6416 -10449 -9403 -2284 6760 7874 3725 -7514 -12915 -8643 -5125
5548 -5125 -2812 2584 4759 1923 -862 1948 1331 604 5755 4378 -7404 593 8334 -449 -2551
5533 -2551 -3032 4458 13123 8785 7676 2131 -7422 -13302 -10785 -7025 -3399 1258 2658 -9604 -14513
5518 -14513 -11118 -3724 3724 5047 5670 1795 -2081 -3189 -7281 -4940 3741 5877 6697 6073 10161
5503 10161 13125 9674 7410 2694 54 -4286 -4736 -3723 4924 4397 1417 -1811 2584 8805 7336
5488 7336 4217 3379 -1852 -928 -1024 -2126 -4833 -6765 -8094 -6225 -5117 -11951 -10217 -3831 -2841 -3883
5472 -3883 -8705 -8189 -6808 -5038 -507 -1627 -2972 1718 -738 5613 5865 2356 -4192 -4222 377 -1688
5456 -1688 -9848 -7412 -5982 -1365 2510 -1523 -4776 -5298 -3409 1738 6404 3431 4742 6778 1815
5441 1815 -5335 -10266 -16437 -10316 -7562 -9142 -8218 -5650 -1486 1726 5136 6548 6405 3083 -2051
5426 -2051 -7999 -10406 -8830 -4006 -2965 -508 5293 3562 1523 -1625 543 -3126 -5185 -2771 -1725
5411 -1725 -7563 -14522 -14490 -14585 -14800 -14035 -12406 -13536 -13002 -9173 670 3254 -3415 -5757 -121 -194 910
5394 910 619 -526 -6650 -14752 -12754 -8959 -13489 -14983 -15897 -3991 1675 4732 10132 11237 7414
5379 7414 -1520 -2072 2060 1541 777 2624 6343 -1061 -2116 3962 6914 -1491 -306 1655 -2794 -4783
5363 -4783 -3460 -2239 -5331 -13123 -7706 -2670 -1545 1513 2530 1727 -1115 -7691 -6766 -5690 -5268 -4568
5347 -4568 -3998 -4749 -5740 -3500 -2138 -5257 -8392 -4923 -7559 -13366 -10301 -7900 -6078 -4482 1332 12576
5331 12576 14875 12541 10346 10455 3968 476 3990 4717 5825 4140 3808 8093 7946 4364 3731 -2239
5315 -2239 -4404 5347 6426 5322 4532 3851 3781 3526 2863 1752 1565 4127 2500 2073 6313 2557 465
5298 465 2096 -5069 -9221 -10374 -11149 -5737 -2538 -1116 -348 -3867 -8014 -7677 -11607 -12372 -12790 -12635 -5546
5281 -5546 1240 1656 2569 -42 -3737 -7350 -2300 -3110 -3438 -6605 -6716 -3188 -4593 -7012 -5365 -484
5265 -484 -521 -4121 -11465 -10682 -7041 -9858 -10094 -8267 -794 2563 -4619 -4589 758 7627 4926 10345 10671
5248 10671 10588 1203 -3115 -2038 2185 6001 3612 3202 -721 2146 5566 749 -2345 151 4976
5233 4976 12014 10934 2243 4906 -2140 -1288 945 2097 -732 -11021 -13644 -13390 -17300 -18915 -13711
5218 -13711 -12102 -4623 2644 5969 3091 1885 7437 6299 9262 11516 5044 7529 5676 3300 3100
5203 3100 -1857 -5789 -5651 -9669 -9249 -4966 -3275 468 3855 4809 3405 2242 -700 1732 366 -3014
5187 -3014 -5742 -3491 -3408 -3391 -4024 -6895 -7720 -971 3701 1204 2165 3489 2119 -808 -12198 -5292
5171 -5292 8610 10099 9387 8918 4554 6015 9025 10107 11251 5963 1509 -3205 -5075 -3535 386
5156 386 1216 -3807 -771 8295 11248 4620 3386 36 531 4929 6550 8196 5675 3574 3198 7343
5140 7343 7396 5939 1935 2831 3484 2495 3214 -5415 -11558 -9671 -7791 -6149 -6036 -6441 -11053 -7847 -3376
5123 -3376 472 6595 540 5932 9644 6050 4359 -362 -6567 -9311 -9025 -7385 -5407 -7318 -7530
5108 -7530 -5293 -6977 -9674 -5561 -10941 -4116 583 -1394 -9102 -13347 -12371 -5189 -7294 -5734 -8040
5093 -8040 -1141 481 -1034 -4947 -6788 -8295 -8980 -6141 -2549 776 62 -1540 -1545 -387 -2359 -4362
5077 -4362 1501 407 873 -1946 -1712 -3865 -6840 -6170 -1726 -2594 -824 -1510 -7565 -8849 -6502 -6190
5061 -6190 -1657 1535 -537 1615 3746 3755 4759 5068 3068 8205 14497 16258 6899 780 2251 -4166
5045 -4166 -4059 -9669 -10010 -12835 -8516 -4222 683 -6696 -5511 3381 7448 9078 7159 6105 3618
5030 3618 -1053 -6517 1200 6872 -467 -5807 -6549 -9592 -8143 -4349 406 2097 -2558 1405 5923
5015 5923 3185 3691 914 1592 1203 -2102 6080 10075 7095 2216 -3249 -5550 1732 -907 -8092 -10113
4999 -10113 -6294 -194 2437 -2112 1766 4640 2781 5489 -3374 -7911 3342 8242 5302 -2413
4985 -2413 -7148 -3725 3112 7671 2694 -319 -5964 -6579 -4480 -3022 -3639 -670 -2121 -5405 -6133 -1683
4969 -1683 -17 -767 528 -1904 -2043 -4552 -6196 -5118 -3783 -2601 -282 1379 1039 -4023 -9620 -7772
4953 -7772 -9511 -4514 -1724 -1040 2967 278 2802 4808 4606 -4523 -9575 -8438 -6830 -3493 -1890
4938 -1890 4942 4824 117 -5194 -7056 -4123 4658 6609 4769 7529 6287 -1604 -8478 -7102 -6361
4923 -6361 2326 -506 -6206 -3063 3333 6398 4960 5776 8560 13083 10987 672 -3893 934 -1374
4908 -1374 5309 -326 -3456 -6919 -9665 -8507 -3374 2878 2960 3659 6796 7780 1614 -3190 -2383 -3313
4892 -3313 -2033 -4718 -5826 -3747 -6728 -5223 -896 57 -6245 -13463 -13726 -7854 -6676 -8993 -8278 -8188
4876 -8188 -5334 -8783 -13380 -4218 1837 3193 4735 2527 -2523 -6814 -1916 5968 8652 -6749 -10284
4861 -10284 -6955 -2819 740 -3330 -7806 -7856 -3361 -3886 -2289 -1250 -1702 1687 4462 6338 10304 5240
4845 5240 -2171 -2110 -1194 1820 4810 4993 3724 8685 3540 3292 6374 7328 4580 4199 789 5408 1726
4828 1726 -2102 1585 8891 7656 2422 481 -721 -4873 -4006 -5062 -13682 -20696 -17228 -12014 -5665
4813 -5665 -4925 -1943 -720 -6371 -8885 -7221 -6300 -165 -600 -5072 -6873 -5080 -800 -1294 -2321 1323
4797 1323 -1229 -2596 -2409 -8377 -9460 -8353 -4673 -6258 -4965 -5773 -5502 535 1886 6546 3837 3341
4781 3341 -3089 1410 303 -10592 -13647 -6096 -1766 3968 6808 4795 -4845 -5317 -2837 -6787 -10458
4766 -10458 -5074 4406 8397 3831 1356 -2941 1482 1934 -6359 -4567 -1716 -2064 -11740 -9527 -223
4751 -223 3354 8435 13362 8297 2753 30 -6033 -4841 -4568 -3844 -1377 340 835 1553 -8606 -14451
4735 -14451 -14398 -12143 -5453 -2811 -1308 -2707 1829 9269 5217 -155 -1704 -2260 1385 -1108 2511
4720 2511 1187 1088 5815 8072 11829 15063 11947 5216 -1594 1782 10886 14644 15286 8489 1176 -1756
4704 -1756 -2867 -1912 5634 1090 -6220 -5495 -500 -3701 -6341 -1592 -2586 -1613 1651 1019 -1179 -2904
4688 -2904 -7946 -4448 500 1756 2300 3743 -674 -2973 -4199 -7829 -2517 -482 -8282 -10327 -11191
4673 -11191 -11585 -3131 -1462 -4488 143 2130 1725 -689 -2880 624 -3418 -8403 -7770 -4072 -403
4658 -403 1928 -3036 -7818 -8485 -8033 -6147 -9547 -15327 -12570 -6111 -2138 -3629 -6928 -11838 -16176 -9492
4642 -9492 -5030 -2405 433 32 -2658 -5109 -6811 -10573 -8170 -7737 -9268 -4492 1296 -1976 2652
4627 2652 861 -2310 -3162 -10193 -6083 -252 5097 6587 6326 5120 1284 -451 1112 -3969 -8278
4612 -8278 -9273 -4279 3497 4237 2839 2061 -488 -4089 -1829 2611 9303 12214 15434 9500 432 -2304
4596 -2304 -2900 -4754 -11160 -12574 -10847 -10873 -5837 -4245 -6282 -7632 -7742 -4819 -2979 -997 -1105 -1223
4580 -1223 1130 6075 1476 -5591 -1736 1390 -79 -4758 -6061 -5138 -997 3988 7009 8720 8399
4565 8399 5591 -38 -5885 -12946 -15131 -11984 -8005 -12078 -8965 -5074 -4233 -3702 -1549 6732 3316
4550 3316 2456 -3194 -3756 104 2244 773 373 992 2064 -4679 -9039 -16906 -15596 -10558 -8274 -6687
4534 -6687 -6773 -359 4220 3874 6760 -353 -3558 -820 -4148 313 2743 1361 -536 -11800 -12297 -6046
4518 -6046 3760 13949 13375 8076 3213 -3405 -8257 -8095 -3765 -210 -1016 5849 10036 10670 5328 111
4502 111 -1921 -814 1803 7709 10628 5203 -709 -1063 588 936 -2026 -5393 -10853 -8733 -1892 5952
4486 5952 3667 4824 8249 13696 11122 7807 10680 7707 4742 8275 14760 9958 6381 -1253 -1887
4471 -1887 -4106 1040 267 -317 -673 -2182 -1665 -2667 -176 1516 -416 -1469 -1888 -4021 -7066 -4151
4455 -4151 2154 -2233 -6822 -6027 -2843 -2385 -505 3425 1598 4605 4694 8410 12418 1548 -325 -2682
4439 -2682 -5469 517 5200 3251 -1012 -5895 -11710 -10270 907 2539 -3397 -3425 438 3730 6555
4424 6555 8640 4897 820 -597 2299 8297 10876 10439 3164 4959 10935 11813 3323 -7228 -6776
4409 -6776 -3851 4126 4818 6086 5040 2132 -4960 -7286 -8133 -5926 1121 -113 485 7920 5010 3795
4393 3795 -3577 94 3913 8905 5205 2933 -624 -5156 -10968 -13481 -17557 -7028 3540 10712
4379 10712 11462 2415 -3908 -5824 -6687 -4623 5224 13734 16255 15289 13507 14805 11217 -1428 -10954
4364 -10954 -15249 -13411 -6675 -3706 -4954 -6595 -4006 1582 7850 7609 4439 4310 1621 4241 3328
4349 3328 6555 2782 3315 3705 1533 3548 4848 3440 101 5035 5783 3260 5351 11641 13025 14529
4333 14529 12251 7813 -1217 -7655 -6087 5072 10648 7668 5126 2163 3481 3345 -2984 -1401 5094
4318 5094 -436 2109 3503 -2505 -2787 -4319 -6082 -4559 -6459 -6113 -5809 -8021 -6611 -7253 -2109 -3626
4302 -3626 -5460 -6482 -9712 -4020 1586 3939 -3323 -6736 -5470 -4980 -6011 -7363 -13495 -8048 -10647
4287 -10647 -15888 -15030 -9044 -8164 -7881 -162 11418 12973 7887 9035 7060 3521 1749 4021 4969
4272 4969 -1717 -76 5219 1534 -2842 -5081 -6405 -3900 -5940 -4327 1328 8626 12194 10662 13864
4257 13864 11512 5556 14750 18774 13614 6117 3504 6212 3491 7359 13770 18438 17977 13953 17959
4242 17959 19703 18166 16993 9219 1432 3606 4983 2383 3618 3872 4699 3424 6814 9714 16712
4227 16712 15057 10837 3578 -3497 -11981 -6148 4230 5907 12462 9648 -1512 -7484 -11648 -10623
4213 -10623 -11752 -16192 -9837 1379 2788 -5774 -10020 -5128 -1388 -3941 -1737 7098 8290 4308
4199 4308 3790 2715 -4275 -3060 -10007 -7760 934 8239 11218 7018 2556 -6170 -8465 -7835 -6890 -1506
4183 -1506 -2548 3208 4016 -3627 -7050 -779 7760 6061 2411 -4081 -1903 -436 -8017 -5823 -5607
4168 -5607 -7404 2151 988 -3469 -1279 4635 8309 8335 6189 9128 10001 8522 5863 1544 -1740 4466
4152 4466 5088 8050 9450 10365 12593 5058 4813 356 95 1295 2771 8294 10273 4646 -230 9086
4136 9086 11481 5605 4269 5289 11025 15024 13199 10083 2103 3571 2704 -1232 2900 2914 -242 3725
4120 3725 5736 -130 606 -792 -6256 -9169 -4014 -3351 -10308 -8926 -2931 1315 4921 2776 1192
4105 1192 7758 4528 1209 3962 788 -6066 -6406 3922 -1284 1903 5654 4102 3114 1881 6533
4090 6533 6481 9414 8722 -393 -1392 -6497 -9005 -12230 -8996 -3326 -1579 517 -327 -2256 441 -2238
4074 -2238 -3932 -3723 -7397 -9728 -1145 6092 395 3678 5188 3793 3271 5980 1148 -5119 -6039 -7935
4058 -7935 -7050 -12088 -4157 5381 5551 -1455 -867 4295 -1461 -5257 -903 3262 11249 12174 2796 -9646
4042 -9646 -16247 -15509 -14232 -10958 -1985 2507 5281 -1216 -5608 -5101 -7051 -10952 -6932 -5090 -2564
4027 -2564 3848 3069 -737 -536 -162 -5686 -9120 -3628 -3600 -664 2474 898 -3343 -5764 -395 -4169
4011 -4169 -2576 2922 2730 1398 861 97 6254 1196 -8232 -11104 -8343 -1381 456 -2480 -3435 -8125
3995 -8125 -8955 -4963 -409 3834 3311 1469 2749 2266 1044 6839 7939 -380 25 3901 7409 9203
3979 9203 4785 2278 -2591 2458 3915 -3703 -5448 -536 1202 -2223 -4004 142 1713 -884 398
3964 398 -2967 -360 -4407 -4781 4650 4643 -2514 -6470 -7206 -6168 -2612 3063 6074 1004 2347 1202
3948 1202 2501 145 -4770 -1504 4000 6298 5018 2980 5623 8069 11130 10153 4644 -4403 -9444
3933 -9444 -2762 -11080 -9747 -1025 7163 10958 6575 5028 2948 802 -2554 -3926 -4361 -1424 -726
3918 -726 3390 5010 141 -1465 -2979 -4222 2590 5093 8114 5905 8022 8449 2825 -446 -907 -1455
3902 -1455 2665 -748 -3161 2693 7816 10724 13447 8618 9092 9750 7125 8901 6905 4141 7172
3887 7172 7234 3864 -1397 -823 302 2815 -2571 -3160 -1954 -6804 -12138 -4162 -2081 -4679 -5740 -1548
3871 -1548 -1432 -2300 1103 2417 4199 9157 6234 4946 5363 4948 6872 7643 882 -3397 3288 8519
3855 8519 9301 10265 7168 -4240 -705 3462 4236 1609 -2921 3599 4329 1754 -1099 -4173 -7021 -7729
3839 -7729 -10237 -2945 -3762 -4393 1658 7600 4499 -6380 -8361 -4232 -4696 578 -6911 -9422 -6781
3824 -6781 -11253 -10204 1013 701 -822 -3343 -2056 502 5415 3758 4329 2367 -1779 2239 1126
3809 1126 1614 794 3524 9898 11679 6395 6858 6461 6875 10889 11632 1546 -398 -832 248 -1337
3793 -1337 -2827 -408 -835 2167 7245 8819 8452 14064 5947 -1617 -5211 -9629 -9389 -7489 -3746 4853
3777 4853 9442 3497 2077 5194 6420 5352 6348 1251 117 86 7378 10795 4918 4006 -2013 -476
3761 -476 2069 1479 -2479 -4551 -4328 1860 -1807 -3501 -3418 -3343 -3569 -4722 -5361 -3447 -5397 -9585 -8218
3744 -8218 2615 12360 5661 -124 4671 7152 3357 -7957 -7992 -2705 -2651 -6399 -7137 -4912 -3567 285
3728 285 2399 1343 -4620 432 -983 -5883 -488 1113 5679 7445 8037 -769 -9780 -5190 -2990
3713 -2990 -4239 -4000 -440 -283 7808 7844 6823 8199 8821 10513 4686 1059 416 -4866 -8874 -3
3697 -3 8475 11528 4926 3497 3086 2649 -626 2559 5536 6880 3005 4571 7969 11135 11235 3350
3681 3350 -3882 -7909 -9556 -4332 -5020 -6352 -5165 -3801 -8670 -8248 -13145 -12194 -2016 1887 6422
3666 6422 2852 3203 -2080 -3131 -115 3435 4569 4637 6509 -5445 -8219 -5551 -5506 -50 6079 798
3650 798 -4818 -1749 -1578 2322 4672 6877 7706 4375 -1754 -5385 -1916 -1505 2834 11607 6093 -2321
3634 -2321 -3644 910 1902 2049 4465 3435 4 -995 1478 5761 5533 947 674 -2629 -3130 -5660
3618 -5660 -4739 -8337 -5028 627 594 1133 -2262 -7965 -9767 -15445 -16409 -10149 5029 8730 10757 5890
3602 5890 -4836 -1649 -816 -762 3031 8703 16230 18674 6814 -1960 -4039 908 5468 97 2121
3587 2121 7866 12605 12378 7438 -180 -8818 -10239 -4531 -10962 -17393 -12671 -8495 -6098 -5210 -2615
3572 -2615 -1767 3644 5528 -1167 -2076 -3205 3637 5426 1988 -548 3894 1697 -3227 -3869 6727
3557 6727 11915 1534 -4741 -2378 -3595 -1232 3127 3020 -221 2333 2715 4121 6486 5656 1448
3542 1448 -136 -404 1346 2182 128 -3625 -3803 -599 -6431 -9075 -2063 -5172 -8894 -7181 -7091 -2671
3526 -2671 511 1300 985 1561 -3448 -4360 -6940 -2211 249 -3254 -3679 -8654 -12681 -6892 1553 2871
3510 2871 2756 6448 4768 -7230 -7568 -3646 -5454 -8861 -3062 -3897 -7851 1020 660 2295 5117 2001
3494 2001 188 7535 6361 4814 4606 6339 4081 -546 -5119 -2646 -4556 -10626 -6958 -1224 3243
3479 3243 1890 -221 4662 7213 5592 1522 -5251 -1786 -218 2344 -2810 -8095 -14755 -12392 -10448
3464 -10448 -9526 -3052 -4470 -1823 7061 5686 3336 2811 5397 5212 3148 2925 3175 5138 2954 -4506
3448 -4506 -3302 3725 12567 12908 13123 6953 -858 -4367 -6345 -5950 -2014 3640 4383 2701 4873 -2377
3432 -2377 -5247 -3539 -5191 -2518 2367 -447 -918 1798 2864 3582 -1125 -4096 -4956 4093 8946 7622
3416 7622 743 -236 3112 3427 -3431 -4436 -5288 1531 1382 -5100 565 5031 10543 11872 4252 1551
3400 1551 -2290 -5248 -4131 -4615 2197 10624 9164 2369 -1470 -2337 -1452 -981 -1030 2647 5570 4912 7091
3383 7091 1699 -7411 -8265 -11601 -10732 -7292 -3466 129 2259 1566 238 1557 5938 6302 9235 11016
3367 11016 4703 1968 -1712 -2190 2262 6393 6473 4775 826 505 3718 5215 5605 9028 6662 3282
3351 3282 -4462 -10918 -9528 -7031 -6095 -144 5799 4599 769 -3125 -2186 -5843 -6905 -6034 -3218 3082
3335 3082 3862 648 804 1690 2977 6347 5176 3175 6821 8243 3083 720 1424 383 -3403 -1842
3319 -1842 -780 3499 8944 11390 9208 10722 3868 -1143 -2189 -9213 -10336 -7151 -7879 -4053 -4903
3304 -4903 -2605 2960 4566 9661 8692 7297 9400 9183 5501 5814 3404 225 -493 -2237 -333 -873
3288 -873 -5379 -11456 -10447 -5014 -136 577 -781 -1720 1524 1650 4496 9727 5071 -1511 -5538 -2161
3272 -2161 921 7405 4241 2987 9997 13783 -1147 -7899 -21 3021 4143 8977 1159 -3327 1965
3257 1965 7004 3090 -3951 -4443 -3955 -4254 -5618 -5428 -9202 -8980 -9308 -7639 -7580 -5782 -3733 -1092 3695
3240 3695 1909 54 -682 3075 5314 5816 1968 3887 11752 16623 14089 5419 6144 11579 10313 7307
3224 7307 -2201 -8801 -5662 -3168 134 2181 -1811 1176 6251 6091 461 3766 8468 9500 11008
3209 11008 8640 9084 5974 1041 6750 13958 15459 9109 1440 2284 3795 2033 -1107 -2596 4080
3194 4080 8553 6393 1231 -3192 274 -3442 -7378 -9446 -2689 -1639 -1714 1636 6348 -1642 -6707
3179 -6707 -7393 -9398 -12635 -10839 -6040 -1957 907 841 668 -1087 -328 602 6962 12844 8265 -6177
3163 -6177 -6868 -4317 4823 4011 5384 5301 1024 703 -1988 -4485 1718 641 611 -2379 -23 -5087 -3015
3146 -3015 -6977 -6386 -4209 -5737 -7048 -4924 -8646 -7656 -2863 -681 -4212 -2239 -5406 -8412 -6377
3131 -6377 -6529 -10780 -10526 -6602 -1911 4830 6890 1566 -2579 947 2553 3353 6522 5116 6108 8350
3115 8350 5064 9239 10701 9807 5107 1573 -1446 889 3925 4221 3445 4648 4787 3110 -346 623
3099 623 5956 5669 4603 4777 4870 -4034 -5436 -1334 8026 16741 21263 13826 8221 3685 -2283 -6848
3083 -6848 -3157 4167 9725 10543 3595 -2484 -502 2288 1186 2515 8918 16988 17544 14947 7839
3068 7839 7169 4101 2855 3478 7888 17286 16432 12425 4831 -2713 -1626 1018 1108 -1853 -316 1021
3052 1021 4573 9006 10785 10130 1416 -1506 684 6135 13981 16925 16314 14897 9101 7095 10719
3037 10719 15416 12250 8264 9158 8338 7722 7295 8258 3472 -211 3559 3117 3967 3094 6117 8359 8245
3020 8245 7252 7417 5984 4665 7251 4640 2786 6759 5278 2859 -145 -2238 2919 3245 3552 3645
3004 3645 7323 10313 7873 105 -403 -640 -3554 -4406 -3595 3606 9068 7485 4808 -4008 -5640 -2449
2988 -2449 -3638 238 3644 3583 3286 2420 4925 4829 2794 -1020 4614 5553 4933 2952 1003 3305 8000
2971 8000 2012 -3867 -644 -2096 -1434 -2040 -6248 -3275 3293 5117 8568 7455 7652 6070 5449 118
2955 118 -6087 -6218 -11605 -22937 -29831 -19478 -7059 -2242 -220 2619 4560 2446 -2141 -96 24
2940 24 4465 4841 8467 5641 -299 -950 -4798 -9511 -6284 -1711 -6613 -4054 2066 3681 4640 514
2924 514 -2731 -4703 -3512 -9648 -4895 26 2869 2488 1912 4453 5511 1612 1510 1012 1485 419
2908 419 -2059 -8993 -12844 -11674 -3973 2706 8122 293 -1267 147 4317 7765 813 -412 -1342
2893 -1342 -3121 886 3968 5886 7485 4353 2028 3098 6763 1374 -4179 -4077 -2922 2431 -377
2878 -377 -1290 -1438 -2455 -2501 -1587 -7454 -11029 -17852 -18051 -14506 -13106 -10702 -8701 -9858 -9672 -5264 2901
2861 2901 8929 12679 11090 -4275 -12957 -9735 -5448 -3428 -4527 -4139 240 3698 3561 3074 1970
2846 1970 -1008 -2600 593 5875 -312 -7607 -9267 -5075 3505 -1730 -1191 4557 2236 -2803 -3370
2831 -3370 -516 2474 -2795 -8903 -6136 -5800 -7270 -11552 -8181 -4301 -4639 -4878 -4794 -1121 1382 -1727
2815 -1727 -1340 444 928 -38 -3872 -4219 -3952 5631 11893 14318 12872 9388 11604 15021 12209 9583
2799 9583 5683 3110 8282 10886 10930 9927 9457 9925 11880 12198 12253 13642 19817 12733 2462 -1178
2783 -1178 -6324 -3435 -2504 2041 4702 8724 10187 2004 -150 -1822 -6942 -7215 -1779 3967 3340 1920
2767 1920 -685 -9733 -9529 -7591 -1235 -1147 -2307 988 -2289 3711 11635 12566 7393 2847 5143 7144
2751 7144 4976 1781 -593 3593 -351 -1224 279 3995 3984 7732 7956 173 -2628 -477 4879 10101
2735 10101 7605 79 -2083 868 6951 382 -4677 441 5077 4554 4670 9771 9196 2107 519
2720 519 2869 1854 3300 6027 13592 11909 6479 816 2673 746 1211 232 -775 528 -677 -3898
2704 -3898 918 8789 11114 1368 -2737 -7434 -7767 -1679 -2261 -3857 -7559 -2191 2773 5374 4821 -239
2688 -239 -140 -540 -7714 -6021 -5020 -4258 -1035 1210 -2530 -8564 -9479 -1478 998 -3580 -10028 -4742
2672 -4742 -2578 -2616 -753 1086 785 3051 11190 14363 13268 7953 -1313 -3780 -4132 -4031 -13457 -17964
2656 -17964 -14279 -2247 3581 2026 -3725 -4802 -1569 -96 1017 3416 1717 511 3916 1668
2642 1668 -232 817 5703 3910 525 -5498 -4005 -2671 -3740 -9056 -5684 6419 9852 3013 3328
2627 3328 10773 15575 10238 6621 2566 -3612 -5104 -8859 -8692 -3972 3187 8552 8323 9460 8158
2612 8158 498 -1626 5144 12317 11725 3641 -1304 -6374 -2803 -601 -5219 -4122 -5629 -8380 -8743
2597 -8743 -8341 -8171 -7679 -80 -3258 -4757 -42 3276 -2238 -4372 -2122 756 3867 4068 1191 -1224
2581 -1224 -5509 -7426 -8780 -6644 -5297 -938 -6767 -875 5799 2358 298 1304 -959 -1481 7692
2566 7692 8483 2503 1527 3265 3915 3177 3199 9332 10814 9574 9936 8197 2931 -2174 -4941 -9708 -11555
2549 -11555 -13388 -13127 -10176 -4148 -857 577 6669 10551 5128 3697 6071 5721 2198 1834 3900
2534 3900 7375 3256 -7541 -8672 -4838 -2872 619 774 1242 -1913 -7459 -15840 -18834 -10909 -3253
2519 -3253 127 5921 -1460 -4520 -238 -2913 3380 12325 13295 11701 16153 10607 2499 3531 3864
2504 3864 -7579 -9043 -6975 -3801 -893 -830 2637 6194 12170 10531 2895 -223 -5468 -8184 -6433
2489 -6433 -4209 -6218 -3708 89 2171 5930 6874 6016 7775 5513 3259 -817 939 4281 9548
2474 9548 10157 14140 13251 10548 16077 17381 13138 4403 1269 -647 -969 -796 2190 8377 5009 2626
2458 2626 -3973 -457 3971 3161 2286 -3444 -7828 -5126 -2024 -6639 -6408 -371 -1382 -1607 4003 4125
2442 4125 1518 1123 1294 -1727 418 -2996 -574 3399 905 3510 9089 14645 11901 5344 -1491
2427 -1491 -4844 2352 4308 7001 7268 9977 9083 6715 2362 5251 11640 14289 16699 20701 16055
2412 16055 11626 14407 17693 12067 7748 5941 5949 3298 -3167 -4448 1229 7135 254 -2327 2483
2397 2483 2546 1452 8472 7254 2218 -2768 528 2111 -278 -9665 -11828 -9674 -6761 1483 5881
2382 5881 -669 158 -34 3302 12059 3914 -473 -2399 -2570 -5661 -6596 1064 8273 6793 1920 5110
2366 5110 -2348 -8541 -3303 -4418 -4460 -2130 2773 3314 335 -2982 -3180 -3902 -2755 -5673 -4310 -2198
2350 -2198 -5364 -6148 -4168 -7123 -6139 -4997 -4870 -1842 -1387 -6024 -4093 -1375 3924 4077 6499 10557
2334 10557 9089 3591 -1012 -696 5800 12157 13068 14476 14674 14384 11278 3533 1393 2482 10034 15399
2318 15399 10719 2328 -639 -2667 -2262 -1247 639 4943 6411 4907 5793 8051 4750 4930 2095
2303 2095 2825 7296 368 -3797 -4712 -7737 -9299 -7684 -7026 -6759 -2073 -637 1638 6595 9210 4252
2287 4252 806 940 -150 742 3650 3507 838 5049 3683 2686 4306 -4504 -6145 -1286 143 -1603
2271 -1603 -1085 3979 6173 8465 3616 188 -1841 -4336 -2312 -4242 -1781 2968 269 -580 1987
2256 1987 -2304 -8010 -13023 -10043 -4910 -3165 -360 253 105 -3581 -6425 -4591 -3718 -2876 -4867 -961
2240 -961 7401 5760 1638 -2574 4212 10356 10954 8043 8900 9766 5635 6510 7927 13008 7799 5516
2224 5516 6817 2409 2551 2427 9177 6104 2613 2997 4427 -131 6188 5220 3603 460 -3569 -5624
2208 -5624 -4744 -7126 -10523 -9992 -8734 -2714 2412 5867 7264 6937 8277 5784 9252 12480 14056 13974
2192 13974 13249 8814 5930 8118 3662 225 3721 15872 17453 10540 9130 10022 7518 4639 9423
2177 9423 6951 3355 -6572 -2176 2293 6141 1993 -604 -1370 42 2721 11140 8915 1988 6753
2162 6753 9827 8583 10076 8323 -2425 -5203 -192 4555 2681 -5003 -6532 -4598 -10142 -14258 -11269
2147 -11269 -10158 -12375 -14220 -11453 -5459 570 1727 -3949 -7824 -8087 -926 4382 3331 4544 4360
2132 4360 7129 10524 4147 9958 10318 1069 -1322 3354 2671 -1439 -4864 3703 2212 3127 181 -530
2116 -530 2702 -4284 -2607 -2442 -2208 -6503 -2097 6474 2794 -5217 -4789 -4433 -1259 7010 8343 9313
2100 9313 3826 4116 7439 8384 10216 5725 2631 2152 734 5073 4590 -4977 -5136 457 4879 8508
2084 8508 10623 14341 11780 1448 -3362 -3670 -4279 -4531 -2587 -6240 -7423 -4001 4506 6330 1363
2069 1363 -1781 125 779 5924 7310 3195 1885 3258 7707 8503 4192 -2034 -1078 -525 1457 -119
2053 -119 3366 7053 6744 7372 5608 4836 9997 5045 3915 6561 9542 6085 3656 5241 -1670 -2249
2037 -2249 1723 3055 2975 6227 4167 7327 10152 12552 12017 7686 6419 1053 -2586 2203 -1589 -1499
2021 -1499 481 -1972 -274 -254 -5250 -3486 -2084 -1833 -909 -3583 109 1071 -538 2070 3126 5164
2005 5164 -4958 -8680 -7164 -12238 -12611 -6145 -9133 -12994 -11214 -10463 -7941 -7362 -1575 3439 5525
1990 5525 3129 4653 -542 -3586 -1994 -2215 -134 589 3428 4170 4711 6093 1910 2671 5115 2563
1974 2563 -1286 -7823 -10305 -8091 -7801 -2762 337 3870 2600 -1282 -1299 739 1880 5242 3713 7060
1958 7060 10130 5556 6869 5340 2345 3300 1659 -237 -1810 -3874 -4650 -3786 2371 1187 4621 3631
1942 3631 624 3505 5097 1064 1432 3390 4020 187 -3269 4458 2160 -2623 -1863 -5155 -7629 -11089
1926 -11089 -14820 -9100 -10148 -15342 -12213 -7617 -5778 1869 5416 3229 1838 3100 1553 2902 5495
1911 5495 13020 13940 11027 10324 10005 7875 969 1031 5744 4964 6547 3474 6755 2113 -529 105 -3357
1894 -3357 499 391 -1243 3677 1300 990 3825 9779 8946 7502 10595 5279 2111 5054 2024 3301
1878 3301 431 3848 910 -4278 -4427 4683 7462 3037 -6315 -3768 1069 937 -2151 -2514 -3819 -3029
1862 -3029 -1571 4708 9469 10169 8788 223 -3530 -1752 1986 6273 -2594 -8876 -9744 -4291 -4636 -2899
1846 -2899 -3431 -2971 1752 -2200 548 5607 13586 15004 8233 4552 1756 -4002 -5389 -3421 -2360
1831 -2360 -1253 942 5828 4582 -255 2266 3941 4859 2023 2291 2337 1333 6372 3445 -6430 -6989
1815 -6989 -4814 1706 4001 4122 8467 2195 4337 3089 1500 8883 11315 4777 -1818 3886 4412
1800 4412 502 -1662 3615 -2626 -7353 -4795 -4120 -6445 -1876 2507 1853 76 -3921 -8011 -8445 -9494
1784 -9494 -16341 -11055 -11588 -3318 1942 85 -1143 352 4447 6741 3040 2906 -1078 -6257 -5060
1769 -5060 -3134 -1235 -1512 -1471 -2887 -7369 -847 3992 7658 8249 -359 -9025 -16462 -17302 -9831 -8919
1753 -8919 -10830 -8784 -4100 -3296 -7414 -9643 -9467 -4967 -2921 -4615 -4989 -806 5656 4649 682 -1572
1737 -1572 -3309 -1302 -1608 -2510 4754 5437 4873 4179 3549 -509 -3808 506 2785 -6593 -12133 -11675 -9713
1720 -9713 -12845 -11395 -4448 -3476 -6303 -6480 -5827 -6275 -9213 -10121 -13437 -11556 -8412 -8097 -4055 -2105
1704 -2105 -4529 -2280 3680 8076 13967 9474 337 6118 12156 6365 -2407 -480 4885 6323 8421
1689 8421 13664 11718 10861 14941 9744 1827 -3685 -3127 -235 2243 365 2604 4720 4351 -1013 -266
1673 -266 -380 3540 2728 -2142 -2395 1657 10065 3708 -3771 -1827 1312 -5354 -2377 2708 4092 3335
1657 3335 754 -1958 -1167 3966 3938 139 3013 4528 -2052 -7344 -5506 -3304 -12286 -8897 -7433 -2024
1641 -2024 6462 -859 -4174 -1445 3319 3243 -4538 -2599 -2311 -7821 -4554 1065 6432 9407 8130 1598
1625 1598 1271 2789 -2524 -8982 -14727 -10749 -6125 -3947 -4624 -3377 -4276 -3174 4037 5048 1500 -1669
1609 -1669 -7817 -7697 -7741 -11037 -641 547 -5774 -4700 1548 -782 -5701 -26 3115 -244 2618
1594 2618 5874 4223 -2028 -4272 -1587 -2362 -1534 785 5571 11187 14782 6486 -616 -249 663 5866
1578 5866 5933 1688 -4377 -6875 1990 -2785 -8533 -7806 -3808 787 807 1276 2063 1628 -5781 -9609 -11062
1561 -11062 -9114 -8080 -8899 -5941 -3669 -8507 -5040 -3364 -900 -2854 1048 -1274 -5198 -8063 -1204
1546 -1204 987 -1526 -3009 -4940 1360 7773 6856 3299 464 -6901 -9117 -3412 5491 5752 5208 4879
1530 4879 12172 15260 11113 4309 2688 5065 4498 3345 5951 7071 3326 2139 -1991 -902 5063
1515 5063 7001 3646 5074 5893 396 -10235 -10596 -5331 1753 -1795 -3713 -4548 -6738 -4997 -864
1500 -864 2869 626 -3706 -5104 -6197 -7101 -9801 -5463 -286 -2597 1003 4610 5007 3967 7995 11333
1484 11333 9324 3230 -402 -1690 -4093 -4512 -4459 -6532 -5423 -9481 -12327 -10172 -5807 -3830 -680
1469 -680 -3533 472 6818 5675 909 -1490 -2846 -10819 -4137 -3258 -2143 2611 13422 12362 8136
1454 8136 3959 -3483 -10339 -15425 -24107 -29429 -31850 -20861 -3741 3074 1433 -2856 -3207 -6136 -10729
1439 -10729 -11945 -10847 -4485 -2670 2268 4013 6828 8261 4999 1516 1935 3178 -2541 -2939 854
1424 854 1797 6011 7736 3458 -1094 -5160 1007 7676 7305 1091 2480 117 3054 9315 10963 5367
1408 5367 -4223 -7089 -3846 -32 -2671 -7589 -8003 -6267 -3830 -1387 3148 7372 7372 3393 8714 11368
1392 11368 7968 2175 -2150 -1058 -230 2430 2351 -926 -464 3295 -2109 -8424 -5056 -4024 -976 -1378
1376 -1378 -2439 5649 9182 1508 -7123 -4408 48 3959 9519 9373 9053 6793 5703 -88 -8154
1361 -8154 -4193 -5292 -2084 4047 3478 3302 -1771 -3809 -5300 -2091 2833 6483 10830 9836 13107 11457
1345 11457 7390 2185 2920 7201 10637 7893 7064 9389 7621 5559 2268 9478 16085 14372 14795
1330 14795 12199 5607 -2265 -3476 -2747 -1736 4097 6482 4418 -1390 -11152 -12893 -8241 -3226 -1543
1315 -1543 -2316 -4637 -5194 -2781 -1170 -1320 -7440 -7393 -6456 -4568 -2969 -2270 -2421 -3213 -1433 1243 6058
1298 6058 1423 -3887 1371 2726 8414 11694 10583 7575 5811 1295 1601 3267 5088 7524 10296
1283 10296 10622 10396 6894 2656 -1447 -468 840 -1194 3438 -865 -3189 4605 5628 3233 4982
1268 4982 5070 11421 14571 9569 3469 -1884 -3797 -757 -5530 2503 7446 4317 1054 -826 767
1253 767 2029 4595 1251 4538 8055 6280 3271 5858 3530 3130 8855 11265 4162 -210 -336 -2894
1237 -2894 -3130 2407 3016 2385 -1337 -990 917 997 -717 -4790 -1540 1227 4371 5027 4338 610 1110
1220 1110 -247 -7239 -1641 -104 2231 -6427 -8189 -6123 -478 -160 4763 4862 462 -1964 -7221 -1903
1204 -1903 4674 -2929 -3851 -3999 -9066 -11539 -4553 -3126 -2285 -1178 822 1307 557 880 2060 -303
1188 -303 -8603 -12031 -5544 -5307 -3021 5137 8550 6060 3402 -3154 -5610 -7749 -9331 -8643 -5318 -4453
1172 -4453 -2280 -1304 -884 1171 379 -2572 -2904 -3060 2239 3430 211 2575 2923 3232 2615 -3442 -8206
1155 -8206 -1631 507 2586 1476 -3672 -333 -2186 -4714 -6564 -8492 -507 749 4907 9000 11565
1140 11565 7550 5150 667 -3140 -1636 -8504 -13936 -12932 -3693 914 2015 1596 -308 -2866 -1087
1125 -1087 138 -2161 1641 2294 899 5714 4003 3896 3652 2835 -3229 574 3862 4328 4191 2027
1109 2027 9687 13049 10203 4684 -659 -446 1781 3195 6196 11378 8116 3251 5011 5406 1798
1094 1798 2507 1590 509 -2870 -3307 -2451 -6925 -10201 -13070 -12436 -5809 127 3165 1462 4098 11228
1078 11228 8784 7293 14395 7249 3090 -4660 -5558 -4583 -2284 4241 4851 851 1037 114 4976 8462
1062 8462 5475 2052 -9157 -9257 -13516 -13070 -10756 228 11044 5856 342 -535 -2626 -2614 -231
1047 -231 623 3305 -3419 -4545 2301 -2203 -2846 -8669 -5199 829 2524 4637 230 -967 7392 6526
1031 6526 4775 -1441 -7890 -6917 568 -399 2205 3294 6835 3601 2765 5554 6496 118 -677 -244
1015 -244 5119 12518 8382 1196 -3278 -2827 -722 2431 -2409 -6226 -4112 -3535 -4372 1569 5519 1661
999 1661 -3478 -9707 -3169 3712 -925 -4755 -4564 -1107 2352 2886 4916 3743 -4945 -5735 -2647 -3012
983 -3012 -683 -241 1288 6066 3562 3390 1998 -3675 -5527 -1466 -6897 -3286 -2549 -45 5621 4168
967 4168 -4730 -9847 -8443 -5542 -4189 -3675 -1792 -2063 761 3455 6841 6608 6715 8406 2634 155
951 155 -3264 -1880 -5302 -938 -4215 -10536 -3005 1533 -2123 -2178 2824 2787 -1006 -367 4620 1096 -3514
934 -3514 -2914 -9825 -8090 -6488 -2653 -2828 -711 -5422 -4560 571 -1739 -1220 -2541 765 1479 -118
918 -118 1819 4346 2852 3386 4493 2630 -2489 -6264 -6960 -6702 -8630 -13995 -14018 -13693 -7807 -2044 -2356
901 -2356 -1798 -2632 -4644 -5123 -2177 -2422 1511 2661 4508 6637 6361 5964 -1836 -6374 -2778 1377 -2831
884 -2831 259 36 448 -516 3181 1776 827 943 3253 3236 -6718 -14732 -17279 -10738 -7865 -5959 -4762
867 -4762 -3437 -3544 -4809 -6658 -3511 4060 9505 -2354 -12711 -16125 -4639 1894 152 6290 9125
852 9125 6178 4590 -1487 -4677 -6916 -9576 -8261 -8674 -1707 6302 6294 1036 1020 -191 -525 4924 3940
835 3940 -4620 -5294 -456 1336 1960 -5895 -7772 -4848 -7604 -5630 -3419 -2863 932 -2980 -11117 -11912
819 -11912 -13313 -5549 4223 5690 242 -1687 -1259 -853 -2644 -1301 -9435 -15164 -12992 -10922 -7885
804 -7885 -12811 -18631 -19986 -15674 -9585 -6398 -9901 -10886 -13321 -15555 -5927 166 3067 1096 -10152
789 -10152 -13461 -15255 -10857 -8733 -10461 -8293 -9261 -11157 -5442 -6497 -9809 -6637 -1081 -7427 -8916
774 -8916 -7978 -5176 -6192 -5447 -7519 -9357 -5296 -2031 -724 -312 -1247 -653 -2167 -1467 -6596 -8598 -13930
757 -13930 -11963 -8274 -9028 -7758 -5351 -13287 -19867 -23475 -18249 -9817 -5679 -3157 -2399 -780 -1722 -10124
741 -10124 -18403 -14421 -6774 -6645 -8979 -8029 448 3803 4005 3426 -6267 -12242 -10642 -7687 -9939 -12350
725 -12350 -9921 -9885 -10319 -7135 -5121 -4079 -6731 -10899 -10164 -1380 1506 1254 -2113 -5630 -4217 -3572
709 -3572 -5213 -4775 1172 3175 -1338 4682 11417 7268 3891 2096 564 -633 -2209 -1128 2186
694 2186 472 -6326 -14156 -15366 -18971 -17845 -14900 -10783 -5605 -1059 -3827 -7624 -5860 -8113 -6288
679 -6288 262 3825 373 -6672 -7587 -15764 -15582 -12485 -15025 -9402 -9584 -7781 -10881 -18190 -17386 -5612
663 -5612 2188 244 -4582 -3430 -3282 -2081 2529 6641 -93 -1441 -3238 -7767 -11486 -11003 -5858 -2653
647 -2653 -4990 -7990 -9834 -10942 -9095 -4034 -3503 -9692 -12891 -17157 -20552 -18544 -14548 -7827 -8689 -6010
631 -6010 -9634 -9591 -7690 -5149 -2429 -3883 -2133 3280 -3762 -5368 -5840 -15545 -15918 -15633 -14851 -7535 -5443
614 -5443 -14663 -8967 -6189 -12071 -12814 -9835 -10189 -11275 -10802 -7040 -3763 -7840 -397 2584 -1176 -12759
598 -12759 -18917 -18202 -15576 -7122 -7305 -9009 -10543 -8998 -8257 -6615 -3218 2017 -683 -5720 -12524 -18332
582 -18332 -17710 -14896 -12564 -15805 -17046 -14256 -9672 -4956 -1290 -1327 -1150 -3424 -2841 1830 197 -2270
566 -2270 -3634 -5781 -8354 -8292 -7186 -9298 -6515 -4955 -3971 -2873 -1094 -2664 -2582 -1009 -4574 -8582
550 -8582 -5102 -617 -3717 -6844 -11783 -12669 -13002 -10439 -6423 -4884 -7267 -10335 -10878 -7207 -7767 -7834 -7515
533 -7515 -3152 -194 1441 391 -2005 -4905 -1621 3507 5606 -1548 -10312 -17058 -19953 -15897 -5599
518 -5599 -2487 1563 -7779 -5809 -2637 290 -3044 -4056 -5659 -6983 -6203 -640 -3417 -10021 -9304 -12177
502 -12177 -9914 -5697 -3819 -2054 2813 -2659 -8171 -9608 -6960 -6889 -11981 -17676 -23593 -17372 -9563
487 -9563 -7678 -8518 -13717 -17718 -13096 -4915 -3527 -5425 -9247 -7183 -11422 -8800 -11080 -9527 -4086
472 -4086 -3248 -3906 -7791 -16257 -19681 -20280 -13532 -7643 -1326 -758 -4387 -2777 -3091 -3767 -5654 -7332 -4201
455 -4201 -2314 -11790 -15839 -10430 -5466 -11375 -14316 -14514 -11240 -3784 -5945 -4456 -9175 -10370 -5849
440 -5849 -2708 -1561 6029 2411 -2821 791 -2041 -8484 -9022 -12214 -12279 -13294 -19658 -14648 -2708 -3206
424 -3206 -6154 -6141 -5223 -6333 -4120 -4249 -8197 -13226 -13295 -11340 -13928 -13537 -11164 -7689 -1490 2603 2462
407 2462 -5304 -7606 -8403 -11534 -15167 -17254 -12785 -10132 -9768 -5436 -1536 -2898 -10277 -12147 -7305 1744
391 1744 3634 3651 -1114 -221 -3501 -11616 -9939 -9384 -8761 -11029 -12484 -8681 -2408 -3361 -4201 -4265 -3567 -1635
373 -1635 -5589 -5464 -6316 -5378 -1813 2118 1223 -2094 -2737 -3946 -10243 -15607 -6885 -3583 -6013 -10895
357 -10895 -10679 -14166 -13394 -11105 -5562 -6867 -12561 -11311 -9824 -11902 -11783 -5625 -529 -135 -2296 -7760
341 -7760 -13526 -8870 -3340 -5030 -7241 -7384 -5957 -7764 -10225 -7534 -8785 -11124 -13442 -13757 -11733 -6305
325 -6305 -1761 -1571 -7243 -8877 -11476 -10015 -9691 -5642 -6822 -7363 -5217 -5594 -12443 -10710 -3603 57
309 57 -2177 -5862 -9169 -11272 -9411 -10421 -10732 -6259 -1107 -1093 -5318 -10652 -8298 -8749 -6100 -5468 -7817
292 -7817 -13185 -14659 -10666 -10390 -10960 -9873 -6281 -4298 -7783 -11420 -11539 -14773 -11679 -4403 -5484 -7679
276 -7679 -7060 -4340 -3306 -646 -4331 -10651 -7424 -7615 -7513 -13134 -16390 -7292 -1382 -9405 -10915 -2472
260 -2472 -2565 -3639 -4567 -5601 -5091 -5129 -7182 -6256 -5353 -4393 -1585 -2488 2731 4078 -5503 -8029 -7453 -8109
242 -8109 -5612 -2797 -4338 -6382 -5029 -5611 -7622 -15792 -15518 -11082 -3634 1344 7703 3380 3595 2980
226 2980 -8970 -14627 -13873 -13133 -9787 -2737 -2069 -3391 -11374 -13115 -5602 -4546 193 3467 1969 -4038
210 -4038 -9320 -10379 -6357 -6576 -4138 -5562 -4363 -5406 -4341 13 2326 5308 -112 -8507 -10145
195 -10145 -8820 -11329 -11208 -10134 -7482 -8061 -10078 -9907 -3760 -3507 -2937 2144 -812 -4361 -4866 -7341
179 -7341 -9467 -11662 -11531 -5680 -3822 -3721 -2596 -2677 -9515 -12378 -6336 -4839 -4833 -9180 -13157 -16070 -11580
162 -11580 -11630 -11113 -9854 -6109 -3739 -4128 -8990 -10286 -8490 -9556 -8030 -3812 -5046 -5589 -9932 -13186
146 -13186 -7113 -2690 -4238 -4835 -7321 -7112 -10920 -11301 -14166 -16604 -8743 -6050 -9026 -9730 -8390 -4088
130 -4088 -90 -4644 -7941 -10557 -9015 -9781 -8355 -7639 -4344 -2861 -8482 -6484 -7721 -11381 -13540 -13525
114 -13525 -12799 -13620 -11272 -9000 -11193 -3883 -2117 -7522 -7873 -5642 -6562 -11957 -14076 -13587 -13603 -9993 -11694
97 -11694 -18774 -20692 -13205 -7018 -8414 -5263 -9492 -5316 -4126 -5790 -6804 -7246 -5255 -3098 -5168
82 -5168 -8076 -7867 -3367 -2190 -4835 -3519 -2896 -3381 -5666 -6132 -4741 -8897 -5157 -8138 -10785 -9714
66 -9714 -12064 -7092 -4379 -5179 -4686 -4647 -6683 -8423 -12477 -12230 -14907 -13733 -12665 -12606 -10035 -8907 -9179
49 -9179 -8180 -7110 -7099 -9115 -10262 -12438 -10093 -10717 -13484 -10354 -9537 -6059 -4985 -1562 -1503 -636 249 -3475
31 -3475 -6270 -7888 -7685 -6238 -5651 -5194 -4201 -1452 140 295 608 -3790 -8742 -11555 -9048 -5543 -1794
14 -1794 63 13 -4330 -9113 -8066 -7333 -7839 -9796 -14769 -13051 -9022 -8857 -5661 -959
0i59
$$ Imaginary data points
##PAGE= N=2
##DATA TABLE= (X++(I..I)), XYDATA
32767 37988 44345 50185 51769 49574 46076 47453 50350 51904 54835 55469 57288 54372 50334 53613 56607
32752 56607 54673 55827 55707 64788 71414 68097 66797 60532 58505 57725 55875 56613 57271 60567 61399 61659
32736 61659 64764 69304 70885 70930 69724 67937 63284 62094 68361 73370 74448 74054 76775 74632 75723
32721 75723 78459 79865 83622 84083 80991 79813 82700 81825 82773 81676 83745 86716 89377 97027 99282
32706 99282 101464 101709 98654 96024 92558 91195 88718 90959 89369 89224 93434 101551 100585 99404 98820
32691 98820 102672 104312 107123 105386 107054 107719 110273 110447 109896 109456 107307 104572 106250 106837 109167 105954
32675 105954 101563 103544 105735 108694 112223 114639 117530 123951 123005 119643 120611 120164 116461 117778 119091
32660 119091 117744 120672 125415 125335 124669 125905 126448 123880 127005 129459 131860 130155 128114 129041 130979
32645 130979 131760 138866 140808 143521 144818 146317 147917 149046 148733 147603 147992 147499 148540 150818 151764
32630 151764 143040 140747 148346 151499 152851 151038 151125 153956 152710 147224 142430 146594 151963 155307 155960
32615 155960 155563 156110 153023 155569 155598 157561 158843 157544 156270 160465 164568 168747 172664 171399 169257
32600 169257 162804 159948 162230 164957 166132 165093 170042 171589 171252 171784 171172 173003 176445 172664 168520
32585 168520 168512 172589 172999 171690 172075 176226 176647 175962 177967 179077 185131 187401 183326 179358 181864 187593
32569 187593 189047 185684 185570 189098 192640 188329 186486 184500 190529 192329 194366 196713 193187 195360
32555 195360 195662 198395 198370 196005 195388 193861 201780 208548 205147 193960 193128 197505 195549 194861 193713
32540 193713 194551 198490 203242 207156 208551 204770 207470 209674 209392 208921 209282 210459 213576 217818 218957
32525 218957 219511 215268 213456 217856 217706 218881 220558 217998 213681 215733 213281 211355 210847 212349 217402
32510 217402 219101 211197 209558 209591 211187 216006 222912 227604 218494 214316 216322 210495 213480 221762 222706
32495 222706 224454 226629 226386 228857 232101 230206 223486 216447 226025 233013 236942 235362 232187 231337 228742
32480 228742 225274 229344 230537 230359 230202 233730 234094 232733 232841 229880 235106 240453 243551 243570 240978 234970
32464 234970 231912 233642 241450 237910 236929 242401 244379 241881 240217 241017 243815 246545 247518 243912 244651
32449 244651 242256 240379 239022 237427 243287 245120 245228 247429 248017 244538 245816 249433 247360 245862 254527
32434 254527 261518 258442 253067 252746 254237 252430 255021 255871 255337 250071 250893 251610 252696 254640 258083
32419 258083 260612 256036 250271 252743 253600 249418 248266 245633 245439 248680 249700 250874 258066 261288 265832
32404 265832 264733 259494 258335 257119 254226 253104 253060 252487 254138 254391 251601 261753 261060 255041 248823
32389 248823 249759 255788 259970 264606 264958 265757 270027 267891 265818 270505 269968 269032 264206 261366 264610
32374 264610 269666 268634 260843 265704 274347 272733 273221 276915 276486 270402 268054 267789 269909 273724 273698
32359 273698 268561 265974 266932 268073 271691 272917 273153 268094 267801 268441 269992 274238 274302 279269 277843 273658
32343 273658 281034 282098 278401 281459 285894 279647 273643 269845 265301 273354 276485 274753 271322 269089
32329 269089 277449 284205 281439 278704 280276 284098 286611 281097 272009 272769 273918 276116 279930 276565
32315 276565 272585 270831 273667 276222 280931 279926 276337 281953 282993 278766 279384 279855 280596 279902 276318
32300 276318 278259 280244 281398 280692 279516 279988 282207 282124 282082 285132 280227 275733 277456 281395 286079 288580
32284 288580 287663 279963 278485 286182 289561 285221 281036 284291 286474 288936 290450 288037 290643 288706
32270 288706 282349 277035 271536 272745 281647 282595 282933 283343 289176 292344 294138 290618 288605 284344 285099
32255 285099 288110 292040 294489 289337 291604 294922 294770 287840 283804 283341 287443 290988 287280 283859 287267
32240 287267 290801 288119 286801 289820 291272 291362 297552 295743 290309 289358 287650 284212 282432 286064 288582
32225 288582 292216 290436 292645 292341 293587 300293 297985 296491 291003 295484 302630 299208 296621 297510 302891
32210 302891 307077 309941 302670 295045 288261 291311 293854 290602 291462 290521 288442 289760 291011 292176 290306
32195 290306 288734 287993 292615 295014 294316 294916 295141 294770 297370 296416 293572 294215 293076 297798 298420 293444
32179 293444 289568 293865 293107 299586 311769 313181 310089 307755 306803 302057 299873 299397 294825 293083 297451
32164 297451 299393 300259 298007 296516 291321 300483 305526 304144 302330 298989 297358 290873 286616 291143
32150 291143 298505 298457 299668 297366 300138 302323 300220 301849 300521 298348 296003 297954 295677 298964 304623
32135 304623 303456 299875 302401 304004 303102 300168 296954 296681 298190 299924 302637 299158 300249 297539 298000
32120 298000 299744 297458 293503 292291 294440 295279 297934 299656 297019 292039 284811 282143 283668 286372
32106 286372 295085 297809 293458 292536 294767 299399 301976 299499 300066 299315 299480 304478 300822 293367 293064
32091 293064 289256 293095 297418 298386 298081 297782 293714 287466 285985 294840 295812 298900 302202 305570 306965
32076 306965 297875 293149 291475 296342 300558 299939 295198 295075 294448 297346 292025 294052 293227 297151 297111 298409
32060 298409 299450 301278 306458 303478 294909 291181 291880 293631 293195 292862 297631 295647 295099 297655 308421
32045 308421 304934 302617 300060 294678 292954 292713 293262 299809 295705 293767 298375 300967 307357 308560 300365
32030 300365 297021 299606 301728 299495 294941 295320 289950 298004 299789 296628 295482 293159 295569 302250
32016 302250 304116 300569 301817 296897 302539 303923 300266 297892 298470 300107 296065 287757 289791 299184
32002 299184 300876 299082 303148 306225 305438 305862 302375 297058 291405 294697 298849 299441 290998 284744 287631
31987 287631 293879 298218 295168 296040 291123 288366 292902 295517 296781 299350 305611 298667 294621 296168
31973 296168 301835 299521 291133 292160 300918 302960 302961 303333 295690 297596 303574 305179 306133 308707 313234
31958 313234 315326 311514 308579 308263 305393 308926 308017 308761 308495 302207 296380 296392 298751 296392 299355 302501
31942 302501 298396 296005 293974 295369 303745 311359 312403 314503 314259 303736 298589 298480 304110 301256
31928 301256 297795 296596 304344 310068 309701 299637 305556 306104 304715 299476 305218 313070 315958 309474
31914 309474 299466 298146 290589 284489 285436 293581 300357 305410 305156 299018 297380 293938 296170 305838
31900 305838 304260 304147 308126 302694 298003 301057 304522 297136 293535 297156 297059 295227 301774 299017 290503
31885 290503 292832 302383 312385 310380 302517 298145 294629 290821 293584 298680 300260 296638 297566 295199
31871 295199 298157 301737 302222 305631 302668 303918 300461 296413 300012 300920 298277 299108 299680 300427 298583
31856 298583 299192 302329 303313 303178 305116 305756 302105 302829 308070 309298 310693 308915 308307 301976 292581 290192
31840 290192 295838 295154 297948 303961 306511 306777 307325 306334 301549 304403 308558 305670 304381 305193 301664
31825 301664 301499 300069 299113 297362 302152 306623 303669 300688 301708 297849 295237 295887 299615 298061 299040
31810 299040 302159 297632 296430 295379 292163 293398 296059 293782 290522 291963 296473 295926 301447 305868
31796 305868 306588 306876 308008 303455 305449 306439 304225 304151 303743 300689 300082 297218 304792 309717 303685 299522
31780 299522 303283 307329 303749 302178 305697 304920 305444 305179 312712 318202 318503 311457 305240 302219 301697
31765 301697 302747 297134 293515 294208 291868 294080 300714 301028 300200 298800 299897 299548 295943 295933 301861 304525
31749 304525 302154 304745 310520 308174 304076 307376 316664 311576 304806 300989 303260 303037 299523 299087 302286
31734 302286 306915 309042 312693 305961 299012 301708 303655 304803 305669 306829 306025 304367 298034 301191 304601
31719 304601 309080 314636 312939 309685 307935 304441 299182 294260 288960 290828 287911 291667 299422 303961
31705 303961 303399 300102 303884 304142 305297 309324 308647 303147 297853 300159 302725 303530 307282 297971 289283
31690 289283 293083 301285 303844 306712 312943 304963 299692 303477 307077 311495 304904 304844 299002 301421 296198
31675 296198 292483 296754 307563 310818 306422 301471 297352 298977 306676 313993 315101 313602 302854 302222
31661 302222 310510 315668 318458 313074 308699 305207 302373 302426 295904 298502 298287 294222 296078 298413 301572
31646 301572 303665 306586 308024 309781 313535 311244 313946 313069 310020 305634 305032 304711 299008 298501 294730
31631 294730 302644 307140 309692 307526 302696 305302 310275 310435 313784 315957 310756 304135 302158 307838
31617 307838 308471 306835 308255 313769 313404 309433 305659 308984 309423 311464 307905 305324 298261 298524 298741
31602 298741 295548 298150 305257 312151 313803 313119 316784 315903 305638 305992 303048 306217 311941 316340 316948
31587 316948 312838 309539 309532 304853 305968 304065 299776 299004 297409 302017 303504 304810 310574 310359 304905
31572 304905 306083 303778 301038 307020 308808 307374 303974 305311 309685 308599 307913 307890 312694 306919 301472
31557 301472 300112 297983 296123 293227 293315 298697 305681 308052 308419 305273 306884 305158 295389 298337 303469
31542 303469 306811 304811 311947 319314 316886 309725 311538 309059 312596 312261 308976 308301 307684 306690 299031
31527 299031 300308 297489 298375 305774 309482 304858 302412 303668 303364 298828 296543 299639 303405 308942 316552
31512 316552 314842 308134 310253 308944 308574 302209 298645 297318 294533 297673 310623 320619 317686 312455
31498 312455 310273 306457 300106 290690 292046 298748 304317 309778 308783 307610 307113 303426 306715 309019 310793
31483 310793 310410 311917 310313 306725 301068 304325 304927 302990 306611 306298 310735 308931 305033 306794 304025
31468 304025 301273 304036 305260 308230 310892 309388 305462 307065 307687 307471 302979 300351 299520 303743 311915
31453 311915 317251 313726 311095 311426 310680 304992 298844 303116 305202 312115 311226 314484 316039 317101 313975
$$ [...]
##END NTUPLES=NMR SPECTRUM
##END=
