##TITLE=Analysis number 321572
Compound Code tl 00192
Project Code adrs
Chemist Name andys
##JCAMPDX= 6.0         $$ Bruker NMR JCAMP-DX V2.0
##DATA TYPE= NMR SPECTRUM
##DATA CLASS= NTUPLES
##ORIGIN= Bruker BioSpin GmbH
##OWNER= nmr
$$ XWIN-NMR		Version 3.5
$$ Wed Aug 16 12:41:24 2006 GMT Daylight Time (UT+1h)  MAYBRIDGE\nmr@NMR_250MHZ
##.OBSERVE FREQUENCY= 250.131544655141
##.OBSERVE NUCLEUS= ^1H
##.ACQUISITION MODE= SIMULTANEOUS (DQD)
##.ACQUISITION SCHEME= undefined
##.AVERAGES= 16
##.DIGITISER RES= 18
##SPECTROMETER/DATA SYSTEM= dpx250
##.PULSE SEQUENCE= zg30
##.SOLVENT NAME= CDCl3
##.SHIFT REFERENCE= (INTERNAL, CDCl3, 0, 16.522)
##AUDIT TRAIL= $$ (NUMBER, WHEN, WHO, WHERE, WHAT)
$$ ##TITLE= Audit trail, XWIN-NMR		Version 3.5
$$ ##JCAMPDX= 5.01
$$ ##ORIGIN= Bruker BioSpin GmbH
$$ ##OWNER= nmr
$$ C:\u/data/dgb/nmr/ADRS/1030/pdata/1/auditp.txt
$$ ##AUDIT TRAIL=  $$ (NUMBER, WHEN, WHO, WHERE, WHAT)
(   1,<2006-08-16 12:40:51.47 +100>,<MAYBRIDGE\nmr>,<NMR_250MHZ>,
      <created by zg, POWCHK disabled, PULCHK disabled
       configuration hash MD5:
       E2 DF 36 D8 04 B2 41 60 5A D7 A3 38 5A 4B D0 FE
       data hash MD5: 64K
       EB A6 98 CC 69 48 68 22 2D 4E 8F FD 1D B4 D7 73>)
(   2,<2006-08-16 12:41:07.29 +100>,<MAYBRIDGE\nmr>,<NMR_250MHZ>,
      <Start of raw data processing
       ef LB = 0.3 FT_mod = 6 PKNL = 1 SI = 32K 
       data hash MD5: 32K
       95 11 50 BE 28 02 BE 6B F8 90 E0 09 F0 9E A8 E7>)
(   3,<2006-08-16 12:41:11.90 +100>,<MAYBRIDGE\nmr>,<NMR_250MHZ>,
      <apk 
       data hash MD5: 32K
       C5 8E BA C2 B0 63 3B D1 B8 76 0F F5 23 2D 90 0A>)
(   4,<2006-08-16 12:41:13.57 +100>,<MAYBRIDGE\nmr>,<NMR_250MHZ>,
      <abs ABSG = 5 
       data hash MD5: 32K
       83 79 9E 4D 26 54 17 8E 31 FB 98 A0 FE C7 EC 6C>)
$$ ##END=
$$ 
$$ hash MD5
$$ 4B 32 01 64 41 FE 01 37 CF BC 5A 9D 11 3F AA 07
##$RELAX= 
##$RELAX= 
##$RELAX= 
##$RELAX= 
##$RELAX= 
##$RELAX= 
##$RELAX= 
$$ Bruker specific parameters
$$ --------------------------
##$DU= <C:\u>
##$EXPNO= 1030
##$NAME= <ADRS>
##$PROCNO= 1
##$TYPE= <nmr>
##$USER= <dgb>
##$AMP= (0..31)
100 100 100 100 100 100 100 100 100 100 100 100 100 100 100 100 100 100 
100 100 100 100 100 100 100 100 100 100 100 100 100 100 
##$AQSEQ= 0
##$AQ_mod= 3
##$AUNM= <au_zg>
##$AUTOPOS= <28 >
##$BF1= 250.13
##$BF2= 250.13
##$BF3= 250.13
##$BF4= 250.13
##$BF5= 500.13
##$BF6= 500.13
##$BF7= 500.13
##$BF8= 500.13
##$BYTORDA= 1
##$CFDGTYP= 0
##$CFRGTYP= 5
##$CHEMSTR= <none>
##$CNST= (0..31)
1 1 145 1 1 1 1 1 1 1 1 1 1 1 1 1 1 1 1 1 1 1 1 1 1 1 1 1 1 1 1 1 
##$CPDPRG= <>
##$CPDPRG1= <>
##$CPDPRG2= <>
##$CPDPRG3= <>
##$CPDPRG4= <mlev>
##$CPDPRG5= <mlev>
##$CPDPRG6= <mlev>
##$CPDPRG7= <mlev>
##$CPDPRG8= <mlev>
##$CPDPRGB= <>
##$CPDPRGT= <>
##$D= (0..31)
0 1 0 0 0 0 0 0 0 0.06 0 0 0 0 0 0 0.0002 0 0 0 0 0 0 0 0 0 0 0 0 0 0 
0 
##$DATE= 1155728449
##$DBL= (0..7)
120 120 120 120 120 120 120 120 
##$DBP= (0..7)
150 150 150 150 150 150 150 150 
##$DBP07= 0
##$DBPNAM0= <>
##$DBPNAM1= <>
##$DBPNAM2= <>
$$ [...]
##$SUBNAM7= <"">
##$SUBNAM8= <"">
##$SUBNAM9= <"">
##$SW= 20.6930455092707
##$SWIBOX= (0..15)
0 0 3 0 0 0 0 0 0 0 0 0 0 0 0 0 
##$SW_h= 5175.983436853
##$TD= 65536
##$TD0= 1
##$TE= 295.16
##$TE2= 300
##$TE3= 300
##$TEG= 300
##$TL= (0..7)
0 120 120 120 120 120 120 120 
##$TP= (0..7)
150 150 150 150 150 150 150 150 
##$TP07= 0
##$TPNAME0= <>
##$TPNAME1= <>
##$TPNAME2= <>
##$TPNAME3= <>
##$TPNAME4= <>
##$TPNAME5= <>
##$TPNAME6= <>
##$TPNAME7= <>
##$TPOAL= (0..7)
0.5 0.5 0.5 0.5 0.5 0.5 0.5 0.5 
##$TPOFFS= (0..7)
0 0 0 0 0 0 0 0 
##$TUNHIN= 0
##$TUNHOUT= 0
##$TUNXOUT= 0
##$USERA1= <user>
##$USERA2= <user>
##$USERA3= <user>
##$USERA4= <user>
##$USERA5= <user>
##$V9= 5
##$VALIST= <valist>
##$VCLIST= <CCCCCCCCCCCCCCC>
##$VD= 0
##$VDLIST= <DDDDDDDDDDDDDDD>
##$VPLIST= <PPPPPPPPPPPPPPP>
##$VTLIST= <TTTTTTTTTTTTTTT>
##$WBST= 1024
##$WBSW= 4
##$XGAIN= (0..3)
0 0 0 0 
##$XL= 0
##$YL= 0
##$YMAX_a= 479240
##$YMIN_a= -461614
##$ZGOPTNS= <>
##$ZL1= 120
##$ZL2= 120
##$ZL3= 120
##$ZL4= 120
##$ABSF1= 16.522
##$ABSF2= -4.171173
##$ABSG= 5
##$ABSL= 3
##$ALPHA= 0
##$AQORDER= 0
##$ASSFAC= 0
##$ASSFACI= 0
##$ASSFACX= 0
##$ASSWID= 0
##$AUNMP= <proc_1d>
##$AZFE= 0.1
##$AZFW= 0.1
##$BCFW= 0
##$BC_mod= 0
##$BYTORDP= 0
##$COROFFS= 0
##$CY= 12.5
##$DATMOD= 1
##$DC= 0
##$DFILT= <>
##$DTYPP= 0
##$F1P= 14.0000005364418
##$F2P= -0.99999901652339
##$FCOR= 0.5
##$FTSIZE= 32768
##$FT_mod= 6
##$GAMMA= 0
##$GB= 0
##$INTBC= 1
##$INTSCL= 1
##$ISEN= 128
##$LB= 0.3
##$LEV0= 0
##$LPBIN= 0
##$MAXI= 10000
##$MC2= 0
##$MEAN= 0
##$ME_mod= 0
##$MI= 0
##$NCOEF= 0
##$NC_proc= -3
##$NLEV= 6
##$NOISF1= 0
##$NOISF2= 0
##$NSP= 0
##$NTH_PI= 0
##$NZP= 0
##$OFFSET= 16.522
##$PC= 1
##$PHC0= -4.531916
##$PHC1= 5.73618
##$PH_mod= 1
##$PKNL= yes
##$PPARMOD= 0
##$PSCAL= 4
##$PSIGN= 0
##$REVERSE= no
##$SF= 250.13
##$SI= 32768
##$SIGF1= 0
##$SIGF2= 0
##$SINO= 400
##$SIOLD= 32768
##$SREGLST= <1H.CDCl3>
##$SSB= 0
##$STSI= 32768
##$STSR= 0
##$SW_p= 5175.98343685301
##$SYMM= 0
##$S_DEV= 0
##$TDeff= 65536
##$TDoff= 0
##$TI= <Analysis number 999999
Compound Code 99
Book Reference 9
Project Code 9>
##$TILT= no
##$TM1= 0
##$TM2= 0
##$TOPLEV= 0
##$USERP1= <user>
##$USERP2= <user>
##$USERP3= <user>
##$USERP4= <user>
##$USERP5= <user>
##$WDW= 1
##$XDIM= 32768
##$YMAX_p= 363220308
##$YMIN_p= -35260
$$ End of Bruker specific parameters
$$ ---------------------------------
##NTUPLES= NMR SPECTRUM
##VAR_NAME=  FREQUENCY,     SPECTRUM/REAL,   SPECTRUM/IMAG
##SYMBOL=    X,             R,               I
##VAR_TYPE=  INDEPENDENT,   DEPENDENT,       DEPENDENT
##VAR_FORM=  AFFN,          ASDF,            ASDF
##VAR_DIM=   32768,         32768,           32768
##UNITS=     HZ,            ARBITRARY UNITS, ARBITRARY UNITS
##FACTOR=    0.157963299565203, 1,           1
##FIRST=     4132.6476996994, 0,             0
##LAST=      -1043.33573715361, 0,           0
##MIN=       -1043.33573715361, -35260,      0
##MAX=       4132.6476996994, 363220308,     0
$$ Real data points
##PAGE= N=1
##DATA TABLE= (X++(R..R)), XYDATA
$$ [...]
19298I9572k951Q544R720p292m609k279J284K409m640n280n082j1086r512L596
19284G2394P339L571k704l768k661l984m483l179n071K057j911J664Q157L171
19270G0592o217m847p826L966O589p51Q71O469N36L566J516M543k232l011o153
19255F7611J72L184R702L732n295j230j242j875n942n358L312Q74k520L381M438
19240G2944m134o387M54J619o582l379j81m13L307j60J859j967M931K829q05r082
19224E4853J415K153L712o675R54M778K053N459n00j046L797J365L554l530l14
19209G2028q23M432J166J270J883n22l95P089K950j873N33K403k988l128L012
19194H7037P797O899R256O640J5944J5221J0390J2273Q589P430R75r413J695P231
$$ y = [99572, 96621, 105165, 114885, 107593, 102984, 100705, 101989, 104398, 99758, 94478, 89396, 78310, 68798, 72394, 79733, 83304, 80600, 76832, 74171, 70187, 65704, 62525, 57454, 59511, 57600, 59264, 67421, 70592, 64375, 59528, 51702, 55668, 62257, 61506, 62377, 68846, 69382, 72948, 74464, 79007, 76775, 73764, 67611, 67783, 70967, 80669, 84401, 79106, 77876, 76634, 74759, 68817, 63459, 66771, 67645, 65125, 68506, 72944, 68810, 62423, 62877, 64496, 57914, 54535, 54354, 53941, 57248, 57088, 58947, 56980, 61911, 64740, 63935, 54853, 56268, 58421, 62133, 55458, 56412, 61190, 63243, 68702, 68202, 67156, 70953, 72318, 75872, 72342, 72028, 71205, 75637, 76803, 78073, 79956, 79434, 79039, 86128, 89078, 87205, 87738, 90141, 87153, 84025, 87037, 94834, 101733, 110989, 117629, 133573, 148794, 159184, 171457, 180046, 187476, 188451, 179038, 180733, 187964]
19180A87964P581O505M703Q517K176j929J1855Q453j272J69O939K909N783k109
19166B48244Q139R532M570J1530J3800O717O287M37l764m074Q534L931L683k73
19152C17293j440j036N971Q055J075J474K744Q474N697K340K692Q591N191J1488
19138C78609J0365J1770J1343J0904J962l426K394L073P439j056j088P220P109
19125D46618L48K839M405J2499P578P572Q941J2249O452j124O567Q819J0137J4097
19111E47997J3554J9692J8279J7109K0096K1961J7057J7824K0543K1298K2945
19100G58355K4737K7202L7238L3656L5483L7188N1450N0744M6671N2931N3744
19089A209399N9596P6346Q5569R7354J19813J32540J41725J55088J65619J98974
$$ y = [187964, 195545, 202050, 206753, 215270, 217446, 215517, 227372, 235825, 234553, 234722, 241661, 244570, 250353, 248244, 256383, 265915, 270485, 282015, 295815, 302532, 308819, 309256, 305492, 301418, 309952, 313883, 317566, 317293, 315853, 314817, 320788, 328843, 329918, 331392, 334136, 342610, 348307, 350647, 353339, 361930, 367121, 378609, 388974, 400744, 412087, 422991, 424953, 421527, 423921, 426994, 434433, 433377, 432289, 439509, 446618, 446966, 449805, 454210, 466709, 474287, 481859, 490800, 503049, 509501, 508377, 514944, 523763, 533900, 547997, 561551, 581243, 599522, 616631, 636727, 658688, 675745, 693569, 714112, 735410, 758355, 783092, 810294, 847532, 881188, 916671, 953859, 1005309, 1056053, 1102724, 1155655, 1209399, 1268995, 1345341, 1430910, 1528264, 1648077, 1780617, 1922342, 2077430, 2243049, 2442023]
19079B442023K57585L32896M11027M84424N77334P18372R00629J063847J129045
19070H317182J166798J354167J717930K117340K269960K108379K142489K775083
19062B3969328L705509M092015L463443K906311L566061M846446N274777M111338
19054E5935228K463905K319458L303167L744616K355312J14007r15483n45077
19046F8775133L48633L97521j089394k519606k303148j295256q53468j533886
19038E9926529k849359l624907l740943l451622l238628l685573m124661l958171
19030C1252665l170823k564232k221108j853466j473892j291891j253540j079468
19022A6344245p94845o70994p69388q65649o90039m55023k58653q2339J66601
$$ y = [2442023, 2699608, 3032504, 3443531, 3927955, 4505289, 5223661, 6124290, 7188137, 8317182, 9483980, 10838147, 12556077, 14673417, 16943377, 19051756, 21194245, 23969328, 27674837, 31766852, 35230295, 38136606, 41702667, 46549113, 51823890, 55935228, 58399133, 60718591, 64021758, 67766374, 70121686, 70235693, 69320210, 68775133, 69123766, 69521287, 68431893, 65912287, 63609139, 62313883, 61460415, 59926529, 57077170, 53452263, 49711320, 46259698, 43021070, 39335497, 35210836, 31252665, 28081842, 25517610, 23296502, 21443036, 19969144, 18677253, 17423713, 16344245, 15549400, 14878406, 14109018, 13243369, 12553330, 12098307, 11839654, 11757315, 11923916]
19013A1923916M87986Q12371J181715J525183J596046J567746J594698J357626
19005B2047287J037226P87100L91761L06484N21415O20001Q97634J235272J243366
18996B9087546J125506J014646O91452j33787j013725j520094j666240j679474
18988B5905830j745003j697722j306217q96494o66541n69273o39920r03118j160446
18979A6321096j096769j092857j378605j514583j247204j021824r16753p83347
18971G269154o03510m63884l76097l13002k75411k47540k17356j99188j91809
18962D381357j87024j77831j60660j48615j41719j34450j21691j07691r6032r6116
18952C009528r9389r5148r5247r0296q3300p9358p1730o6342n6159k2254k211
$$ y = [11923916, 12411902, 13224273, 14405988, 15931171, 17527217, 19094963, 20689661, 22047287, 23084513, 23871613, 24263374, 24569858, 25091273, 25711274, 26608908, 27844180, 29087546, 30213052, 31227698, 31919150, 31785363, 30771638, 29251544, 27585304, 25905830, 24160827, 22463105, 21156888, 20260394, 19593853, 19024580, 18384660, 17481542, 16321096, 15224327, 14131470, 12752865, 11238282, 9991078, 8969254, 8052501, 7269154, 6665644, 6201760, 5825663, 5512661, 5237250, 4989710, 4772354, 4573166, 4381357, 4194333, 4016502, 3855842, 3707227, 3565508, 3431058, 3309367, 3201676, 3105644, 3009528, 2910139, 2814991, 2719744, 2629448, 2546148, 2466790, 2395060, 2328718, 2272559, 2250305, 2248094]
18941B248094J1951m51n872k589J0460J2082j7044o4877r2972q4896p1569p1932
18929A870385j00421j39304j37716j12619q4674o4100n6212n5119m3175m1298
18919A035747l8100l9526k7198k5406l1028l0164k4971k5611k4778j7918r982
18908G41065k2536j9129j5720k0835j8059j6221k4148j3764k777p702j2470j7429
18896E50275j4972j6513j1812j2535j2043j1119j2012j1479n937q141r393j0480
18884D13839p958j5851j9989j3096q066p104j3746o486l585k084r672p706p912
18871B90584q954o011o75O34m080q520r129K000k375j764n634m923q608j536N626
18856B36635N203o12n041r688n622j375N77l43J563o35m72n810j3482j335n392
$$ y = [2248094, 2260045, 2259594, 2253722, 2251133, 2261593, 2273675, 2256631, 2191754, 2098782, 2013886, 1942317, 1870385, 1769964, 1630660, 1492944, 1380325, 1295651, 1231551, 1175339, 1120220, 1077045, 1035747, 997647, 958121, 930923, 905517, 874489, 844325, 819354, 793743, 768965, 751047, 741065, 718529, 699400, 683680, 662845, 644786, 628565, 604417, 590653, 587876, 580174, 567704, 550275, 535303, 518790, 506978, 494443, 482400, 471281, 459269, 447790, 441853, 433712, 424319, 413839, 405881, 390030, 370041, 356945, 348879, 341775, 328029, 321543, 317958, 315874, 306202, 298496, 290584, 281630, 275619, 274944, 275578, 271498, 262978, 253849, 255849, 253474, 251710, 246076, 241153, 232545, 231009, 236635, 241838, 241226, 236185, 226497, 220875, 219500, 220077, 219734, 221297, 220662, 220190, 214380, 200898, 199563, 194171]
18841A94171p698m776Q55M077j356q79j432j538J811l18m858k825l279O666P675
18826A86296l69n142r202j705M096L865L870k210q539M559l952n637K59n64o010
18811A59615m300K692M036n54K935j265n792l060K869Q965O0J314J097n656l059
18796A59897N87N062P50m99J0561J1942M321Q025O515L550N541N858m104L553
18782B21559N447k973q35J0573L088L933k003l160K377j0586n811r130j1286l182
18768A98011k105p327n111k959K037L357l877m717n23p125o339n523n523P294
18754A59570Q892Q975R726N456J3376J9608J0378P645N369J0321Q21K807j767
18741B61177L118Q58J624M13P07k077j0389m230K979K184p78j647p714m349J070
$$ y = [194171, 186473, 181697, 182552, 186629, 185273, 184394, 182962, 181424, 183235, 182917, 178059, 175234, 171955, 178621, 186296, 185927, 180785, 171583, 169878, 173974, 177839, 181709, 179499, 170960, 175519, 171567, 165930, 166189, 165625, 159615, 155315, 158007, 162043, 161489, 164424, 163159, 157367, 154307, 157176, 166141, 166201, 167515, 168612, 162956, 159897, 160484, 165546, 166296, 165797, 176358, 188300, 192621, 200646, 207161, 210711, 216252, 222110, 218006, 221559, 227006, 224033, 223198, 233771, 236859, 240792, 238789, 235629, 238006, 227420, 221609, 212479, 201193, 198011, 195906, 188579, 183468, 180509, 182546, 185903, 182026, 177309, 176786, 169661, 163322, 157799, 152276, 159570, 168462, 177437, 187163, 192619, 205995, 225603, 235981, 243626, 248995, 259316, 260137, 262944, 261177, 264295, 265153, 266777, 267190, 267897, 265820, 255431, 251201, 254180, 256364, 255586, 253939, 246225, 241876, 242946]
18726B42946k03m067n049o276l502q230r250j0279j3575j2625m101j759j0062
18713A53968j1488k457m913K580p85P938J2282J2118J7783K3462K0413J4673R591
18700B55165J3801J5163N85r734p720n144q314j3064k1264k0302k4095k6308j6364
18687A32405j0230n254p380o768p547m548J956p25m170n728n793j255m108m331
18673F6524K023K30j751J330P100O710k02R0k94k659k227K63M404K135N327J2329
18657A01332M430Q066Q343K375L681J1878J3096M347K658q823j2358k464l906
18644A32655j1031j8907j0916m191j3052j4513o36Q44j777j179M357N27l930J570
18630E9821M044l48l308m313J996p6K6O168N706o772n709L382L339k893N48k714
$$ y = [242946, 242743, 238676, 233627, 227351, 223849, 215619, 206369, 196090, 182515, 169890, 165789, 164030, 153968, 142480, 140023, 135110, 137690, 136905, 144843, 157125, 169243, 187026, 210488, 230901, 245574, 255165, 268966, 284129, 284714, 274980, 267260, 262116, 253802, 240738, 219474, 199172, 175077, 148769, 132405, 122175, 116921, 109541, 102773, 95226, 90678, 92634, 91909, 87739, 82011, 76218, 74963, 70855, 66524, 68547, 68777, 67026, 68356, 75456, 82166, 81964, 82054, 81760, 79101, 76874, 77137, 81541, 83676, 89003, 101332, 105762, 113828, 122171, 124546, 128227, 140105, 153201, 157548, 160206, 151383, 139025, 136561, 132655, 121624, 102717, 91801, 87610, 74558, 60045, 59409, 60253, 58476, 57297, 61654, 62181, 58251, 59821, 63865, 63517, 60209, 55896, 57892, 57816, 57842, 64010, 69716, 62944, 57235, 60617, 63956, 61063, 61611, 58897]
18614E8897j889J493L203L567m223r011k507L984j942J798r30n183R57J533n759
18599D3988j387k07J177O481j486J765j548k618j441k054k29L317J315J648k02
18584D8519j992K596J965M654n063n16O930m209K774J3713M856L683R249J1227
18570I8386J5955P722n857R61n48j104M502j093j708K843L820Q609L911J0842
18556A47241K3693J7717J3393J4098R902R141J2878J2327P017R807J0164J5781
18544C03159J1620J12Q04O076J2866L907L205k237n097q08J1334J0406k122j0511
18530C42714j0118M277O274n690j6462j1430j819r583q268l355r619o233p626
18517B63062j2223j8999j1927r103n004M701j3q063o886p707m351J428R24l310
$$ y = [58897, 57008, 58501, 61704, 65271, 61048, 52037, 49530, 53514, 51572, 53370, 52440, 47257, 48214, 49747, 43988, 42601, 42394, 43571, 50052, 48566, 50331, 48783, 46165, 44724, 42670, 42441, 45758, 47073, 48721, 48519, 46527, 49123, 51088, 55742, 50679, 50163, 57093, 52884, 55658, 69371, 74227, 77910, 87159, 98386, 114341, 122063, 116206, 117167, 116619, 115515, 120017, 118924, 117216, 120059, 123879, 132488, 136399, 147241, 170934, 188651, 202044, 216142, 226044, 235185, 248063, 260390, 267407, 277214, 287378, 303159, 314779, 314891, 315695, 321771, 334637, 338544, 341749, 339512, 334415, 333607, 344941, 355347, 353225, 342714, 332596, 336873, 343147, 337457, 320995, 309565, 307746, 298163, 289895, 286540, 276921, 270688, 263062, 250839, 231840, 219913, 210810, 205806, 210507, 210494, 202431, 195545, 187838, 183487, 184915, 185839, 182529]
18503A82529r168q380r738l956N539J043m94L334O371j801m075K111J2170J0124
18489A85609K870L815J0981J979j558j507J445L904J0904J6178P543l047J413
18476B40529l272l722r066j5020m641l850j1902o098M529L182P41m169j0021n677
18462A71543o399m518o106o407k606j1590j1667o958m185l743p954j1290N988
18449I4108O655J418n811l022J565J167j298j889l980j238L635M182M980M718
18435A05190M277l361k419M062M394K808N745J0961J0829J3544J1357P532K884
18422A77803j859p817p431j827j092l506p731k545k230o878k704m439M614p85
18408A31573q543n447L21j128k200j102O788p66L003O609R63o584m750J373j961
$$ y = [182529, 173361, 164981, 155243, 151287, 156826, 157869, 157375, 160709, 167080, 165279, 161204, 163315, 175485, 185609, 188479, 192294, 203275, 205254, 203696, 202189, 203634, 207538, 218442, 234620, 242163, 239116, 240529, 237257, 233535, 224469, 209449, 204808, 200958, 189056, 182958, 187487, 190669, 191410, 187241, 177220, 171543, 165144, 160626, 154520, 148113, 145507, 133917, 122250, 115292, 111107, 107364, 99410, 88120, 94108, 100763, 102181, 96370, 93348, 94913, 96080, 94782, 92893, 88913, 87675, 91310, 95492, 100472, 105190, 109467, 106106, 103687, 107749, 112143, 114951, 120696, 131657, 142486, 156030, 167387, 174919, 177803, 175944, 168127, 160696, 158869, 157777, 154271, 146540, 143995, 141765, 134887, 132183, 127744, 132358, 131573, 123030, 117583, 117904, 116776, 114576, 113474, 120262, 119496, 122499, 129108, 130071, 123487, 118737, 120110, 118149]
18393A18149j770K55P396J1373J833R325J2389L325J1076L952P418K0284J5384
18380B20389J1379P617Q614J0806J3042R123R075J0401M513O348l009j7136j6217
18367B74945L670P511o352m804L096K031J0842Q962k02q3l145K460J0532Q345
18353C17808l06L435J4986J2538J449r585o085m028l251J948L411Q502R203N249
18339C55274o46M051R518J0590M718K534Q710J0032R207J5244J6227J3606J4399
18326D73464J1877J3568J5073K2934J5248J7989K3841L9940N1675M3712M9127
18315G78448O0124P2435R1549J15835J57613K11050K65880L09389L72639M62533
18305B897495M66689M21824M23777M10776L74736L51866K89705K74797L88137
$$ y = [118149, 116379, 116634, 124030, 135403, 137236, 146561, 158950, 162275, 173351, 177303, 184721, 205005, 220389, 231768, 239385, 247999, 258805, 271847, 280970, 290045, 300446, 304959, 311307, 308298, 291162, 274945, 278615, 286126, 279774, 274970, 278066, 280097, 290939, 299901, 299699, 299616, 296471, 298931, 309463, 317808, 317502, 320937, 335923, 348461, 349910, 340325, 334240, 330212, 326961, 328909, 332320, 340822, 350025, 355274, 354628, 358679, 368197, 378787, 383505, 386039, 394749, 404781, 413988, 429232, 445459, 459065, 473464, 485341, 498909, 513982, 536916, 552164, 570153, 593994, 633934, 685609, 729321, 778448, 838572, 911007, 1002556, 1118391, 1276004, 1487054, 1752934, 2062323, 2434962, 2897495, 3364184, 3786008, 4209785, 4620561, 4995297, 5347163, 5636868, 5911665, 6299802]
18296F299802N06145O11148O72414O08365N41165N24826M68170K38240j38050
18287A0332225l41016k71468k45378k89590k67447j74992j09729k0897P0709M5884
18277H728301j41450l74489m03722l19454l76956n72931n53716l69697k67140
18268E348746j83277p3779O1372K13952M08977O61504R59469J273594J586631
18259A0257189K032866K553520K713876K612584K684508K648942K326830K008538
18251B9838853J552873J320156J750605K157950K198069K352802K523966K478833
18243D6174107K318263K113228J271287J16623K23573J307837J892644J792136
18235E7209698J193945R67673J651286K615594K563229M17839k688587m171444
$$ y = [6299802, 6805947, 7417095, 8089509, 8697874, 9239039, 9763865, 10232035, 10470275, 10332225, 9991209, 9719741, 9474363, 9184773, 8917326, 8742334, 8632605, 8611708, 8682417, 8728301, 8586851, 8212362, 7808640, 7489186, 7112230, 6539299, 5985583, 5615886, 5348746, 5165469, 5091690, 5153062, 5367014, 5775991, 6437495, 7396964, 8670558, 10257189, 12290055, 14843575, 17557451, 20170035, 22854543, 25503485, 27830315, 29838853, 31391726, 32711882, 34462487, 36620437, 38818506, 41171308, 43695274, 46174107, 48492370, 50605598, 51876885, 51993508, 52217081, 53524918, 55417562, 57209698, 58403643, 59371316, 61022602, 63638196, 66201425, 66619264, 63930677, 59759233]
18227E9759233l548271k556831l036726n540914p712704p126947n269255l775940
18219B1191645k753102j998692j480597j135120r13667p51619o34062n31577m54990
18210A0538219l90952l53978l35844l14093k72853k20700j73126j46296r2786
18201H237591k0755R5993K75053N25197Q98220J428994K093193K745748L191704
18192A9470938L394966L530439L724394L911513L499735K200865N93788o47573
18184C9679065j223065j512976k365721l639225m364607m190120l345490k490978
18176A6546883k028066j837666j526123j133108q36995o60368n52552m93323m37402
18167G041280l81018l47138l05248k53589k16050j98363j84328j86396j74291
$$ y = [59759233, 56210962, 53654131, 50617405, 45076491, 37363787, 30236840, 24967585, 21191645, 18438543, 16439851, 14959254, 13824134, 12910467, 12158848, 11524786, 10993209, 10538219, 10147267, 9793289, 9457445, 9143352, 8870499, 8649799, 8476673, 8330377, 8237591, 8216836, 8312829, 8587882, 9113079, 10011299, 11440293, 13533486, 16279234, 19470938, 22865904, 26396343, 30120737, 34032250, 37531985, 39732850, 40326638, 39679065, 38456000, 36943024, 34577303, 30938078, 26573471, 22383351, 19037861, 16546883, 14518817, 12681151, 11155028, 10021920, 9184925, 8524557, 7972005, 7478682, 7041280, 6660262, 6313124, 6007876, 5754287, 5538237, 5339874, 5155546, 4969150, 4794859]
18158D794859j64671j62360j50750j23736j02752p3919k4525K5644R2185J98789
18148D308764L54551N69499Q19676J016814J092229J082507J059233J077890R84246
18139A2365409O25001N8117m52225p40457p92521q85374j118743j299532j316821
18130F442854j094057p95331n33130l51518k49508j87460j48210j20058j07416
18121B856166j05352j09440j03712j14090r9949p0218n2170k0174N570M3970J12077
18110B342678K18462M18504P90779J210566J127539N06714K98394L23298L09247
18101G546181o53j033776j776733j255754o95907m08479k68134j91710j49304
18092A765731j16789r7813q1941p0412o7846n0065m8638n2421l9405l3146l0875
$$ y = [4794859, 4630188, 4467828, 4317078, 4193342, 4090590, 4016671, 3992146, 4017790, 4109975, 4308764, 4663315, 5232814, 6052490, 7069304, 8161533, 9244040, 10303273, 11381163, 12365409, 12990410, 13048527, 12596302, 11855845, 11063324, 10177950, 9059207, 7759675, 6442854, 5348797, 4553466, 4020336, 3668818, 3419310, 3231850, 3083640, 2963582, 2856166, 2750814, 2641374, 2537662, 2423572, 2323623, 2253405, 2201235, 2181061, 2186631, 2230601, 2342678, 2561140, 2979644, 3770423, 4980989, 6108528, 6615242, 6913636, 7236934, 7546181, 7545528, 6511752, 4735019, 3479265, 2783358, 2374879, 2106745, 1915035, 1765731, 1648942, 1551129, 1469188, 1398776, 1330930, 1280865, 1232227, 1179806, 1140401, 1107255, 1076380]
18081A076380k7191k5026j7765k8408k6770k3560l0686k9368l0600l5392l2778
18070G68836k9046l3312k3149j9491j9903k2117j5085j0751j1158o757j4737j5238
18058E48092r587r843o986j3240j2096j5298j2502j0379j6358n199r360j1659
18046D15585l310n208m787n498n578n572K393n106q199k630p613n22r379r414
18032C45162j582J231k206m75q222l179m918m587q735j0434r033j2832j1720o651
18018B61819j70j833n467k972k922r523m700p248p200J288K709k521J015m514
18004B17761k795L124k267m966m199j100n484r624o237l136l748O53r847q174
17990A59961J000r850o028K975O824L519n952m986q372l599n890q543j2578r356
$$ y = [1076380, 1049189, 1024163, 1006398, 977990, 951220, 927660, 896974, 867606, 837006, 801614, 768836, 739790, 706478, 683329, 663838, 643935, 621818, 606733, 595982, 584824, 578067, 563330, 548092, 538505, 528662, 521676, 508436, 496340, 481042, 468540, 458161, 441803, 436604, 427244, 415585, 412275, 407067, 402280, 396782, 391204, 385632, 388025, 382919, 374720, 372090, 364477, 363955, 354576, 345162, 343580, 344811, 342605, 342130, 333908, 330729, 325811, 321224, 312489, 302055, 293022, 280190, 268470, 261819, 261649, 259816, 254349, 251377, 248455, 238932, 234232, 226984, 219784, 221072, 223781, 221260, 222275, 217761, 214966, 218090, 215823, 210857, 206658, 205558, 200074, 190450, 184213, 181077, 177329, 177982, 168135, 159961, 160961, 151111, 145083, 148058, 154882, 158401, 152449, 147463, 139091, 135492, 129602, 121059, 108481, 99125]
17976I9125P555Q236L905o285j0456J219Ol179n103l579M674k7j0561k48O082
17961I1364P04o292L166M169j265l929L388k369l145l927J115r05K255l094j0259
17946G0976l768O68K422K255J774k795M83r183k781Q260L94j896P15J362l127
17931F5759k130o1k84m591O85o24j693J167k95k094o02j245M561M355Q77n524
17915E8261K513M611o634p115K067J120j963k875k255o731Q298P506j501n131
17901E0171o534N276j969j761J995K006m914k278L219k966Q99K585m102m396J011
17886C8242j03N024P230r47j717n042J364j677R11J798L856L656R10M34k010l478
17870D8451l321L121p84k334M44n48J893O91j0930m985J803m204m38k082M21N882
$$ y = [99125, 106680, 114916, 118821, 112536, 102080, 103299, 103305, 100126, 95023, 91444, 96118, 96091, 85530, 85282, 91364, 92068, 85776, 88942, 93111, 91846, 87917, 91305, 88936, 85791, 81864, 82979, 82074, 84329, 81235, 70976, 67208, 67876, 70298, 72553, 74327, 71532, 72015, 62832, 60051, 68311, 68705, 66809, 67524, 68886, 65759, 63629, 63568, 63284, 58693, 59378, 58754, 57061, 58228, 57933, 55839, 55237, 53992, 58553, 62908, 63785, 58261, 60774, 65385, 58751, 51636, 53703, 54823, 52860, 49985, 47730, 40999, 49297, 56803, 55302, 50171, 43637, 48913, 46944, 45183, 47178, 49184, 44270, 41992, 45211, 42245, 43144, 45729, 41627, 37231, 38242, 38139, 43163, 50393, 49446, 47729, 42687, 44051, 42374, 43285, 45083, 48939, 52595, 53505, 53939, 51929, 48451, 45130, 48251, 47467, 45133, 45577, 45029, 46922, 47613, 36683, 31698, 33501, 29297, 28859, 26777, 27198, 33080]
17854C3080K317K693J902k200O831L864j1184o216K16m826N73j081l574O8J707
17839B4170K153L967M399j523m604m096J009j484N334m70l106L816K293M071m518
17824C1411r267l318R65M901L338M69P81m482n883l174L931n555j927j141n84
17809A0465Q654M973k02P4j325k553K116O367L047J130N863N023Q048J5076l617
17794F3139l155J2275J2330N923L605J5136O700R863M462Q34Q395Q781N662J1417
17780A65367N101N895O733L440p94j712r17m492j4360j5548o51K015r826j3612
17766A26639r126p548l209r372j8113j0190j739j21p801J770O78r039n387k945
17752D4497q88N848K07K433N768L213P631J3551M992J165L911J2681J0270J5081
$$ y = [33080, 35397, 38090, 39992, 37792, 44623, 48487, 37303, 31087, 31303, 26477, 27050, 25969, 22395, 22463, 24170, 26323, 30290, 34689, 33166, 28562, 24466, 25475, 23991, 29325, 28855, 25749, 29565, 31858, 35929, 31411, 22144, 18826, 19791, 24692, 28030, 28499, 29280, 24798, 18915, 15741, 19672, 14117, 12190, 11049, 10465, 19119, 24092, 23890, 23964, 22639, 20086, 22202, 28569, 31616, 32746, 38609, 43632, 51680, 66756, 63139, 59984, 72259, 84589, 90512, 94117, 109253, 115953, 125816, 130278, 131112, 139507, 148288, 153950, 165367, 170468, 176363, 183096, 186536, 185742, 184030, 183113, 178621, 164261, 148713, 148062, 150077, 140251, 126639, 117513, 109965, 106756, 97384, 79271, 69081, 67342, 67221, 59420, 61190, 61868, 52829, 47442, 44497, 43609, 49457, 49664, 52097, 57865, 61078, 68709, 82260, 87252, 88417, 92328, 105009, 115279, 130360]
17738A30360J7201J2553J4979K5346K4042K6637J3423J1141R826J199n948j3192
17726B67567r652j7114j3929j7708k2080k0124j8132j8512q452n727n821m241
17714A06075k790r701j0710m999n970m371n993l201O671n040j772j443l405n010
17700D8341p355k731L319K50K793L918P503R011j410L977J0696Q151K1070K4089
17686A31622K2732K5613L7843J8549J7992J3412q460k415j6959k2849k4195k9538
17674A63347l3722k7270j2974p214p866j0658l902R87p360q319o296j462O181
17661D3472O14l019J021l8K66P39n584o598m345q487k522L710L802K043l20l659
17645B1095P81j344M126J2756J0330O266J0854J5394P311Q320K511J0007J2827
$$ y = [130360, 147561, 160114, 175093, 200439, 224481, 251118, 264541, 275682, 285508, 286707, 280759, 267567, 257915, 240801, 226872, 209164, 187084, 166960, 148828, 130316, 121864, 116137, 110316, 106075, 103285, 93584, 82874, 77875, 71905, 67534, 61541, 58340, 65011, 59971, 58199, 56756, 53351, 48341, 40986, 38255, 41574, 41824, 44617, 48535, 56038, 65049, 63639, 67616, 78312, 86463, 107533, 131622, 154354, 179967, 217810, 236359, 254351, 267763, 259303, 256888, 239929, 217080, 192885, 163347, 129625, 102355, 89381, 82167, 74301, 63643, 59741, 60728, 53368, 45049, 38753, 37291, 43472, 44086, 41067, 42088, 42050, 42316, 43055, 37471, 30873, 26528, 18041, 15519, 19229, 23031, 25074, 24754, 21095, 21876, 20532, 24658, 37414, 47744, 54010, 64864, 80258, 87569, 95889, 98400, 108407, 121234]
17632A21234N105m906j0445j2133q920j1924p787o156m500k706j0611q860m9k489
17618C4853n490o401j684K524o90M439q6j596J958j671l377p709r310j983J0419
17603A4196K643j141m969O021J51p496n70k465K190L092L173j987j18K8j342n97
17587A0809p17L692Q04K420L569m1O792j542m129m346j4560j8867n730K776o940
17572b6010k946L526j928j622K87M208K871M313R483O780M411P32L402l624L36
17557D219O326j931m999N60p44K877L178j63k100q46Q23L523J337j0756M187N770
17541A1261m179j497P225o99j954l358l725k082R60K583O405K665K193o384o498
17526B916l399m19l200P054M374M258K879m992q163J245L284K35k395P72J479
$$ y = [121234, 126339, 121433, 110988, 98855, 89935, 78011, 70224, 64068, 59568, 56862, 46251, 37391, 37342, 34853, 29363, 22962, 21278, 23802, 23112, 27551, 27465, 25869, 27827, 26156, 22779, 15070, 5760, 3777, 14196, 16839, 15698, 10729, 16750, 16901, 9405, 8835, 6370, 8560, 11652, 14825, 12838, 12720, 12748, 11406, 10809, 10092, 13784, 14588, 17008, 20577, 20536, 27328, 25786, 21657, 17311, 2751, -16116, -21846, -19070, -26010, -28956, -25430, -27358, -28980, -28693, -24485, -21614, -17301, -7818, -1038, 3373, 4105, 7507, 3883, 4219, 10545, 8614, 3615, 4175, 3431, 6308, 9486, 9323, 7223, 6377, 7200, 10723, 12060, 1304, 5491, 11261, 7082, 5585, 12810, 12111, 10157, 6799, 3074, 992, 1952, 4535, 10940, 13605, 15798, 9414, 2916, -483, -902, -4102, 2952, 7326, 11584, 14463, 9471, 1308, 2553, 5837, 6072, 3677, 4449, 5928]
17511E928L388P493J606p520j123P22n226j12M379N862l293j1625o335N425N835
17496E404M515P631k673n860j0353J290K465L199R96p79l323k988K677j573j306
17481f78R31J995k625j243j465m527M549O035m008m262k809j084O304Q82k331
17466d336L343J142L213M238J507o793r881J076L891O70j807N629P328J122n43
17451I799n64m453j266k94k937M554Q350j838K91K636K980R118R786K439L300
17436D1901M51p074m731n485j0975q760l445PQ3N615P737q302m143M520j562n28
17420E309p786l868O694N780O458k737m26n076m300L784K72L291j038l467R004
17405A1894L923j915n236l267l053M89Q49q88l245K682M312K278N17K193m633
$$ y = [5928, 9316, 16809, 18415, 10895, 9772, 10494, 5268, 5156, 9535, 15397, 12104, 479, -5856, -431, 5404, 9919, 17550, 14877, 9017, -1336, -46, 2419, 5618, 6614, 5835, 2512, -476, 2201, 628, -678, 253, 2248, -377, -1620, -3085, -7612, -3063, 2972, -1036, -5298, -8107, -9191, -2887, -2005, -4336, -993, 149, 3362, 7600, 9107, 2314, -7567, -6491, -2600, -1930, -3737, 1892, 9220, 10342, 9799, 9235, 4782, 3516, 3222, 285, 4839, 13189, 11351, 11642, 14278, 17258, 26376, 36162, 38601, 41901, 42352, 35278, 30547, 25062, 14087, 5327, 1882, 1889, 1972, 7587, 15324, 7022, 2879, 7399, 5837, 5309, -2477, -6345, 349, 6129, 12587, 9850, 9424, 4348, 48, 3832, 4104, 7395, 6357, 2890, 11894, 15817, 13902, 8666, 5399, 2346, 2835, 3684, 2796, -449, 2233, 6545, 8823, 9340, 11533, 6900]
17390F900k840J93J962J944o67k768N91J235N05k132J86q20j933l464P09m82J256
17373C75N197M876l15K039o597q58P05m283N11J918K163J514O122k818j927P8
17357H700k049j814M64n331m215J522L659l831J211K662K908j421j397k275L006
17342A799L280L41l077q150k057n465k962R202N117j818L160m632l740P833J806
17327F37J958l403n20N074K122J307k221q245k571L937J205M983J731n61j759
17312C674J599k491J516o20K997m164k850k4N78k932j97J931O34k338L093K291
17296B697o65M655K904K675K564L08J515k72o536m741m188n335j573N425N719
17281E152L236o944l872M217j545l37j497m62k139j823R76L130N296K56P28M192
$$ y = [6900, 4060, 4253, 6215, 8159, 7492, 4724, 5315, 6550, 7055, 4923, 5109, 4289, 2356, -1108, -399, -881, 375, 5572, 10448, 10133, 12172, 5575, 4717, 5422, 1139, 1650, 3568, 5731, 7245, 13367, 10549, 8622, 8700, 6651, 4837, 5301, -30, -4245, -2723, 936, -2895, -1684, 978, 3886, 2465, 1068, -1207, 1799, 5079, 5420, 2343, -5807, -7864, -13329, -16291, -7089, -1972, -3790, -630, -5262, -9002, -1169, 637, 2595, -808, -1328, 3746, 5868, 7175, 4954, -3291, -5862, -1925, -720, 4263, 5994, 5433, 3674, 5273, 2782, 4298, 3678, 6675, 2511, -339, -363, 215, -2717, -2914, -983, -349, -2687, 406, 2697, 2032, 6687, 9591, 12266, 14830, 15138, 16653, 16381, 9845, 5104, 916, -4419, -5992, -567, 5152, 8388, 1444, -2428, 1789, 244, -93, -1590, -2052, -4191, -6014, -5038, -1908, 3388, 3644, 4372, 8564]
17265H564P03m939o312n165j112K441J002j943O650O315J245l550m395r285l465
17250a3246M651k464O007J585K786L75n497k449K830L953k017j089o328L513O164
17235a226J594j798q2k645M045n735J615J681N85M122L301j349m746j39l810n503
17219a0090P226J835L951j801K024O295m852o919k662j184J421k88k135K2N44
17204f613m244k455K190R743K755M350n382j0305M42N713N141l491m33L782K753
17189C946k963m427j249j818M558J076k895k392O449K60L705O37m996m089J589
17174b609K273k897o620P662L355K781L661k542J654J304j716k347j679m090j438
17159c248j574j655K376k194L059K239p15q948q07P841M121l216j394N073J581
$$ y = [8564, 9267, 4328, -1984, -7149, -8261, -5820, -4818, -6761, -111, 6204, 7449, 3899, -496, -9781, -13246, -8595, -11059, -5052, -3467, -681, -306, -5803, -8252, -5422, -1469, -3486, -4575, -10903, -7390, -1226, 368, -1430, -1512, -4157, -112, -5847, -4232, -2551, -1966, 2156, 5457, 4108, -638, -777, -4587, -10090, -2864, -1029, 2922, 1121, 3145, 9440, 4588, -2331, -4993, -6177, -4756, -5044, -7179, -7157, -6613, -10857, -13312, -11122, -1379, 1376, 5726, 344, -9961, -9519, -3806, 1335, -2156, -2589, 1193, 3946, 983, -3444, -4693, -6511, -1953, -877, -3772, -6164, 285, 545, 4250, 4887, -109, -4198, -2609, -336, -3233, -9853, -2191, 1164, 3945, 7606, 5064, 6718, 8022, 6306, 3959, 2280, -1810, -3248, -4822, -6477, -4101, -6295, -3236, -997, -1712, -10660, -11467, -3626, 495, -2721, -4115, 958, 2539]
17144B539L735q869L681N90o34l568j264j26J789m313J403l59j550O913K361K008
17128D336k200l624m292J42J026k259N8Q062n58P038N036n997j3849L79q88j11
17112g701K886m312o21K070O170K034J37M975p323j898p26M863p59l121M282K446
17096C402J263K364n565K635p99n201L462N653k469k356R95j237k084j162k014
17081c113m830l28L54m101j044k01M011J010l307n348J478N515L694L90l872o81
17065a0373K027M000O149l09O230k250l523p993N764R027K004Q04m237o169p232
17050f081K227J552k455J329L58M196l520n612l825J904M80L821k542LN025O44
17034b496m6J689Q8K659J218L622k884q86j451j049l946K387Q440l818n980o628
$$ y = [2539, 6274, -2595, 1086, 1676, 1042, -2526, -3790, -3916, -2127, -6440, -5037, -5396, -6946, -33, 2328, 4336, 2136, -1488, -5780, -5638, -4612, -6871, -6813, 1249, 691, 7729, 12765, 6768, -7081, -6702, -7590, -7701, -4815, -9127, -9748, -7678, -1508, 526, 663, 5638, -1685, -3583, -4309, 554, -205, -3326, 956, 3402, 4665, 7029, 1464, 4099, 3300, -1901, 1561, 7214, 4745, 2389, 3384, 2147, 63, -1099, -3113, -7943, -8271, -7917, -12018, -13062, -13263, -9252, -8242, -11549, -16897, -15419, -9904, -6210, -5820, -9692, -10373, -8346, -4346, 1803, 1494, 7724, 5474, 1951, -6042, -278, 8749, 10753, 11557, 7320, 1151, -6081, -3854, -2302, -4757, -3428, -3070, 1126, -2394, -8006, -11831, -9927, -9447, -5626, -8168, -8165, -3140, -2496, -2542, -853, -765, 1894, 3112, 6734, 3850, 2964, 1513, 464, -3482, -1095, 7345, 3527, -2453, -9081]
17018i081j606Q649K535k791k279l516j390O308k852j850J543J853M345K12J236
17003A316j173j484m084r22l051N590O341l758L198p297J255p9k972o429M427
16988i122L808L870j998n129M544Q313L202J178m242o818p515k018J661Q969L453
16973B156k456p356J107L501J877l278r13K221K117pn733Q68N049k134j803J008
16957c776J0182p52q580O46J982n300n033M088j821j814K742L130J688j614j1100
16942a5332J861Q717m679l336K328N798Q520K71o117j519L263M006J270l762n88
16927G01j887M371M09K066J332n394n156n265Q79N748J538m82J81n69J750O324
16911F546J622m188n53L440J157K277l901l802k263j721l643l3j082N130K225
$$ y = [-9081, -10687, -2038, 497, -2294, -4573, -8089, -9479, -3171, -6023, -7873, -6330, -4477, -132, 80, 1316, 143, -1341, -5425, -6347, -9398, -3808, 2533, -1225, 1973, -5324, -4069, -4148, -7120, -13549, -9122, -5314, -1444, -3442, -8571, -4027, 4286, 7488, 8666, 4424, -2394, -9909, -11927, -10266, -1297, 2156, -300, -7656, -6549, -3048, -1171, -4449, -5362, -3141, -1024, -1031, -6764, -5896, -847, -2981, -4784, -3776, 6406, 5654, -2926, -2280, -298, -5598, -10631, -6543, -8364, -10178, -7436, -4306, -2618, -4232, -15332, -13471, -4754, -9433, -12769, -10441, -4643, 3877, 4148, -1969, -3488, -225, 3781, 5051, 1289, 701, -1186, 3185, 3594, 5660, 6992, 1598, -3558, -8823, -7944, -2196, -658, -1140, -959, -1528, 222, 6546, 8168, 3980, 3427, 6867, 8024, 10301, 6400, 2598, 335, -1386, -5029, -5062, -6144, -1014, 1211]
16896A211k444n257j732N978k123j679l394j240o98j537q22p36J1671R196J02
16881F496j029j919m171l729k79L526O332j461M217l810k99n894o518L586r27
16866e879m967K9M499J505N51L747N144O105m194r291p433q58P247P546j264p68
16850A719m011p263L987M853j301r096o38L165l60N750L634j559L930q83l123
16835a196k98M61j351k845R94K272k440q497q535O968J1165K916k708k524l82
16820f000q111k014O331L550l158J0386N864L254q41l067l300m161L739M128m009
16805B591p448J300J123O516j581p5M106l340n030M311o991m049J128J200J776
16790d463J814K681M410l844J0249J0858l538n709r65j204q46L621m673j4599
$$ y = [1211, -1233, -6490, -8222, -2244, -4367, -6046, -9440, -10680, -11378, -12915, -13737, -14473, -2802, 6394, 6496, 5467, 3548, -623, -4352, -4631, -1105, 5227, 3766, 7983, 4173, 3874, -2020, -8538, -4952, -5879, -10846, -10817, -6318, -4813, -4262, -515, 4629, 10734, 6540, -2751, -10184, -11042, -3795, 3751, 2487, 1719, -2292, -9555, -5568, -715, -2016, -11112, -11750, -8585, -8945, -3195, 439, -1120, 2810, 1927, -1196, -1494, -1033, -2384, -5229, -4235, -1963, -4403, -12900, -21435, -14467, -3302, -386, -3094, -5618, -6000, -14111, -16125, -9794, -6244, -9402, 984, 6848, 10102, 9261, 6194, 2894, -1267, 2472, 6600, 2591, -4857, -3557, -2434, 4082, 2501, 2426, 6532, 3192, -1838, 2473, -4518, -8567, -7439, -6239, -4463, -2649, 32, 4442, 598, 10847, 21705, 18167, 12458, 11493, 10289, 9443, 13064, 8391, -6208]
16776f208m029M914K793L240p91O537J73n028l232J911K355j850n463n40J921
16761c297O114K447m125K14Q015o54j782L754m441m894k095K821Ko045l075L186
16745c855k309J905N030N046l349k034l882k04J175M434M061j227n524M351k564
16730A054j493L663L30l336o601K06r65l421N238J1281K333k354k062M227n50
16715G550j509K54M422j938n512j84m819J692M899r677q21k547K594o7l487o207
16699a5357L856M315O854j215m866n3m16n218J449L775J207J607J162J271o125
16684g754m172O654O399J739K06l157M224O780k635o613n834l70n69Q680L765
16669G343J035l374k851K135O39j499j597L652l160k570J434P146L144k586l484
$$ y = [-6208, -10237, -5323, -2530, 710, -81, 6456, 6629, 1601, -1631, 280, 2635, 785, -4678, -5218, -3297, 2817, 5264, 1139, 1353, 9368, 8714, 6932, 10686, 6245, 1351, -744, 2077, 2079, -3966, -7041, -3855, -6164, -4259, 771, 5817, 2468, 434, -3448, -3652, -2477, 1957, 6018, 4791, -733, 3618, 1054, -439, 3224, 3554, 218, -6383, -6177, -7142, -10563, -5325, 5956, 8289, 5935, 3873, 8100, 7550, 6041, 6295, 10717, 8779, 3267, 3083, -1736, -44, 4855, -4822, -5643, -8190, -5596, -5663, -9150, -15357, -11501, -7186, -332, -1547, -6413, -6466, -6882, -12100, -10651, -6876, -5669, -4062, -2900, -1629, -7754, -11926, -5272, 1127, 2866, 3072, -85, 4139, 10919, 8284, 1671, -4163, -4533, -5102, 3578, 7343, 8378, 5004, 2153, 4288, 4927, 3428, 1831, 5483, 2323, -247, 1187, 8333, 11477, 8891, 5407]
16654E407J039n718J341m608j798O291O078q267j2399M03M707O374p273k056J2256
16639A777Q687K822m743j878k976q428j243N21P07k894Q044O83m628j0454j464
16624a5467o17L387N511M531l16K724j911n935L466N976l077K638J875n754k06
16609c175m807j785O786K354J521O830o04q148k945k836Q701O576m305l113p698
16594f648k749J821J718k514l244k033O881O459o875L274O288m301n247k52n73
16579g995j671O914J049O69o092k156o84k297p8L111k479k061P389P328J008m800
16563b845m42M51r019p908M569R971R07m39n740l962M445K085n71m886J506M564
16547g314K051q15m215j607O743M865l746M161r65K43L871J086n041j101L631
$$ y = [5407, 6446, 728, 2069, -2539, -4337, 1954, 8032, -235, -12634, -12231, -7524, -1150, -8423, -10479, 1777, 10464, 13286, 8543, 6665, 3689, -4739, -5982, -5461, -4754, -7648, 396, 1079, -3549, -14003, -15467, -16084, -12697, -7186, -2655, -2971, -247, -2158, -8093, -4627, 1349, -1728, 910, 2785, -2969, -3175, -7982, -9767, -2981, -627, 894, 7724, 7120, -1028, -3973, -6809, 1892, 8468, 4163, 1050, -6648, -9397, -7576, -5858, -8372, -11616, -13649, -6768, -309, -7184, -3910, 2378, -1923, -7170, -7422, -7995, -9666, -2752, -1703, -1034, -7126, -9282, -9966, -12263, -12341, -9230, -11709, -13770, -6381, 947, 1955, -2845, -3287, -2836, -11855, -19763, -15194, -5223, -4316, -4755, -10495, -14457, -10012, -7927, -8498, -13384, -11878, -7314, -5263, -6078, -10293, -11900, -5157, -292, -4038, 123, -842, -599, 3272, 4358, -683, -1784, 1847]
16532A847k123k890p237J164N560K088M324K743k278J32j876Q71o401j041K655
16517b462K104J722k840j940K642k317k539R76l654j705L845k657p53Q992m148
16502d734m403O124P97p49J161n755j0356j463N786M722k265m323N067J905n619
16487a4105q44k444j309J281K546j43J539P404P246K858O6k327k279j407k544
16472d462l343J944L191r702j381Q427K578L987R17l723q026l098N456p72m885
16457a2892J261K765Q834l047n559P73M793M536l94k574l514O615m107j1853J49
16442a4214M849K641l298L174K229L417k132N867K488K208l283k814o57o994l751
16427a0270l453j3015P98N421J624O136L893Q125O14j751N106K056K144o311O201
$$ y = [1847, -276, -3166, -10403, -9239, -3679, -1591, 2733, 5476, 3198, 3330, 1454, 2325, -4076, -5117, -2462, -358, 1364, -1476, -3416, -774, -3091, -5630, -4654, -8308, -10013, -6168, -8825, -9578, -586, -4734, -9137, -3013, -2216, -2965, -1804, -7559, -17915, -19378, -13592, -8870, -11135, -15458, -10391, -8486, -14105, -14949, -17393, -18702, -17421, -14875, -15018, -13479, -6075, 1171, 4029, 4095, 1768, -511, -1918, -4462, -7805, -5861, -2670, -12372, -13753, -5326, -2748, 1239, 2156, -1567, -9593, -12691, -7235, -8007, -12892, -11631, -8866, -32, -3079, -8638, -7865, -3072, 1464, 1070, -1504, -5018, 1597, -2510, -14363, -14214, -9365, -6724, -10022, -6848, -4619, -1202, -3334, 2533, 5021, 7229, 3946, 1132, 475, -6519, -10270, -13723, -26738, -25940, -20519, -18895, -12759, -8866, -741, -127, -1878, 3228, 5284, 7428, 1117, 7318]
16412G318q97K217J312n086j203k754l219K53M028m636L52J743L892k835k970
16397b485Q0l200n583K127N367N108K371O825M827m696n074K121K214j1187l333
16382d518p5k709l847l295O773Q95o422J325k451j041R46m642Q914J031k32K745
16366f603L388L62p100l076L405J829J137Q027j550q438q829L118O206K597L25
16351e202O244l477n75o982Q45L026N763M05k42J217P397l494l946J551N92j816
16335A306o427P136k684j2983K63N246l686K513M56L696k56L463J968l751l398
16320g138K79O63J161l419J328mN528M855k729L10m62M479P145n323l231M806
16304H248M653N90J540k816p693M351j582k959m698o114n63M650n320k157K993
$$ y = [7318, 6421, 8638, 9950, 4864, 3661, 907, -2312, -2059, 1969, -2667, -2315, -572, 3320, 485, -2485, -2405, -5605, -11188, -9061, -3694, 1414, 3785, 10610, 15437, 10741, 5667, 7788, 10002, -1185, -4518, -4593, -7302, -11149, -14444, -7671, -6776, -13198, -11873, -14324, -15365, -14419, -19061, -10147, -9116, -9348, -6603, -3215, -2853, -9953, -13029, -9624, -7795, -6658, 1369, -181, -8619, -17448, -14330, -8124, -5527, -5202, 1042, -2435, -3010, -9992, -9147, -6121, -358, 47, -195, 1022, 8419, 4925, 979, 2530, 3122, 1306, -5121, 2015, -669, -13652, -13389, -8143, -11829, -9316, -8860, -5164, -5420, -1957, 11, -3740, -7138, -6859, -6196, -5035, -8454, -7126, -7130, -1602, 3253, 524, 834, 372, 4851, 11996, 6673, 3442, 8248, 12901, 13491, 15031, 12215, 4522, 8873, 7291, 4332, -366, -6480, -7043, -2393, -7713, -9870, -6877]
16289f877M669m744L68n207M305k593o082O361R433J641P84m064O8O450P48P61
16273F021j1639L25k26n200q10m49J18j220L137j32N10o808Q951N588j970m51
16257d255k345k5L419j408j218L444L489k903m227J344N038N306j860q188m216
16242h605K214M161J714n809k378R72M820K220J526l675p05L079Q93k457O530
16227D500P715o084p481r017J303K422O782K655L827n158j057O37m938L34Q048
16212D488N20k017p33M642J360m908J30n500j663K817M366p49j510P0M214j720
16196C807l854L926l586r183q17M895J267K460K490J505m541m221N764J124m882
16181c846P543J785p76K548K947k66L05j316o168k520m616J44L265k306r452p94
$$ y = [-6877, -2208, -6952, -6584, -11791, -7486, -10079, -16161, -9800, -367, 1274, 2058, -2006, -1938, 4512, 5260, 6021, -5618, -5293, -5519, -10719, -11529, -11978, -11860, -13080, -9943, -10075, -9565, -16373, -7422, -1834, -3804, -4255, -6600, -6625, -3206, -4614, -5832, -2388, 1101, -1802, -6029, -4685, 353, 5659, 3799, -4389, -8605, -6391, -2230, -516, -6325, -8703, -7731, -2911, -691, 835, -2840, -3545, -466, 427, -2030, 4500, 12215, 6131, -1350, -10367, -9064, -6642, 140, 2795, 6622, 1464, 407, 1044, -3894, -3560, 4488, 5008, 2991, 2258, 6900, 8260, 3352, 3482, -2018, -3681, -864, 3502, 2753, 1243, 1313, 5527, 3807, -47, 3879, 293, -8890, -9707, -4812, -3545, -1085, 1405, 2910, -1631, -5852, -88, 1036, -3846, 3697, 5482, 4706, 7254, 10201, 9935, 10240, 8924, 2756, 236, -4380, -4236, -971, -3277, -12729, -13523]
16165a3523O233L916l24k445J595J917N781L677o003l719J218L105p150q239K383
16150a1578M48N580j65Q45l103k843Q158O952J909k006K978k720o771k132l566
16135h014r59L461K181n00m730J858J0370j228m141l318k459j534M133j622k307
16120h809k518K525K222k465N188j828k419j760M336K394P024M079j1360m397
16106g788L850J0693m82j1532p40P163K644n624l410n763o960l522q70L526M557
16091a4258J0263K102n988M88j761N414k230M76M635J243P175N978l355n359j720
16076C103o37l311j0686k82M822k170P99r52R97P510N857q264p67M633k193k885
16060d426m987n13K864O074j289k270K244k368M784M037k490n420j891p129l35
$$ y = [-13523, -7290, -3374, -3698, -6143, -4548, -2631, 3150, 6827, 824, -2895, -1677, 1428, -5722, -13961, -11578, -11130, -5550, -5715, -4870, -7973, -10816, -2658, 4294, 6203, 4197, 7175, 4455, -2316, -4448, -8014, -8973, -5512, -3331, -3831, -8561, -6703, 3667, 2439, -1702, -5020, -7479, -9013, -4880, -6502, -8809, -11327, -8802, -6580, -9045, -3857, -5685, -8104, -9864, -5528, -3134, 3890, 7969, -3391, -7788, -3938, 6755, 6273, -5259, -5999, 1164, 3808, -1816, -5226, -10989, -17949, -21471, -22341, -18815, -14258, -3995, -1893, -7881, -7393, -9154, -3740, -5970, -5494, -859, 384, 7559, 13537, 10182, 4823, 3103, 2466, -845, -11531, -11813, -6991, -9161, -8362, -9314, -8317, -807, 5050, -3214, -3981, 652, -1541, -4426, -9413, -9926, -7062, -988, -2277, -4547, -2303, -4671, 113, 4150, 1660, -3760, -5651, -12780, -13115]
16045a3115L677J207M70r83j874M306J285m718J355k951K946M678P352p2j037
16030B526J511M11L947k436K816l47k875q907M55j350n098l74k288k524O252M258
16014d023J81l937j388L647J0621p92J229J200l877L890L93r555j0245k163J093
15999a3726N441N237J199J876K338l98J576n261K289o577N36n22N520P596o770
15984C54r155PJ10k401L407O202L943l411l386j843O184L442l255n189r96l71
15968f358K485J0251K327L722o481n174m549n056k527m580K759O922j063K982
15954d340j320n56l715K687M078J376Q28q353o047L451k487J202L723N409M014
15939e0m858l702k951K221L028j322m628L008J894k557L846J835m093M481l15
$$ y = [-13115, -9438, -8231, -7761, -8744, -10618, -6312, -5027, -9745, -8390, -11341, -8395, -3717, 3635, 3563, 2526, 4037, 4448, 8395, 5959, 8775, 8428, 5553, -3354, -2899, -4249, -9347, -9721, -12009, -14533, -8281, -4023, -3842, -7779, -9167, -5520, 5101, 4309, 5538, 6738, 2861, 6751, 7144, -2411, -12656, -14819, -13726, -8285, -3048, -1849, 27, 2365, 1967, 3543, -1718, 571, -6006, -5470, -5992, -472, 7124, 354, -8801, -8794, -8684, -11085, -7678, -1476, 2467, -944, -4330, -6173, 11, 3453, 198, -4991, -5987, -6358, -3873, 6378, 8705, 12427, 5946, 772, -3777, -8833, -11360, -15940, -13181, -6259, -7322, -4340, -5660, -6216, -9931, -7244, -3166, -1790, -962, -9315, -15362, -11911, -14398, -13196, -9473, -4064, -50, -4908, -8610, -11561, -9340, -6312, -7634, -12262, -9254, -7360, -9917, -6071, -4236, -8329, -3848, -4163]
15924d163j695m588m55J585L229m81M285o663R67N755j903m001l107n572M512
15909a2295O369m043p314J244N12M625R71O576L641m403j83J073k42L878K424
15894B833l1o60k506j544m141J015L38l332j37P242N925J69n158r165k753M721
15878g184j815j449k899R00L049M71N440M502K366n256o11Q317J432n712l899
15863b348R78K517M609m220o944J103M908l67k17J490K598k167m415M879N35q064
15847e125m357M408m80O046O203k489p120k013n24M708J659M955N774J295p062
15832E878q734l787k189M653j445m773j117N16M001j742l656k247L775l493M596
15817i764N582p725n914l670j089J228J185L48l862l332M836O020N64M520K415
$$ y = [-4163, -5858, -10446, -10901, -9316, -6087, -6568, -2283, -8946, -7979, -2224, -4127, -8128, -11235, -16807, -12295, -5926, -9969, -17283, -16039, -15527, -10902, -9931, -3355, 286, -4117, -4300, -3227, -3469, 409, 2833, 2802, 2142, -364, -1908, -6049, -5034, -4696, -8028, -8165, -923, 5002, 5171, 13, -9152, -11905, -7184, -8999, -10448, -13347, -12447, -9398, -8927, -3487, 1015, 3381, -1875, -2486, 5831, 7263, 1551, -2348, -1370, 1147, 5756, 1536, -5408, -4305, 603, 236, 19, 1509, 4107, 1940, -2475, 2404, 2939, -5125, -9482, -5074, -5554, 492, 6695, 4206, -2914, -4927, -5451, -743, 916, 5871, 11645, 12940, 5878, -2856, -6643, -8832, -4179, -5624, -10397, -11514, -10998, -6997, -8739, -12395, -14642, -10867, -14360, -9764, -4182, -11907, -17821, -21491, -22580, -21352, -20167, -19819, -23681, -27013, -22177, -16157, -15593, -11073, -8658]
15802h658K498k231M465P044l999j618K785J328l326J465l562l72O020K309o402
15787b254o146m439O802M616k895l698N174k076p263l502l587L660Q136J472k9
15772f029j835j822l915j271Q105L612m616k96Q296L720j743K13k035k306l093
15757e015l580m092L22k62J055R298R022l318k952m06K339k725m92o78k460O2
15741c882p11l885k926j556n09N741M39k645l221R90M921j569n77k364o037J341
15725a6450Q421K646L91j631J449Q499L746o591n136j65q06l832L32J667l17J678
15709f099l010O354N786k363J431N460j782j601p947n007J325r50K792L152k690
15694e149O879m757l665P491k538p041M63k337j954L801O704L404r58m384j637
$$ y = [-8658, -6160, -8391, -3926, 3118, -881, -2499, 286, 1614, -1712, -247, -3809, -4181, 1839, 4148, -2254, -8400, -12839, -6037, -1421, -4316, -8014, -2840, -4916, -12179, -15681, -19268, -15608, -7472, -6000, -6029, -7864, -9686, -13601, -14872, -6767, -3155, -7771, -8067, 229, 3949, 2206, 2419, 384, -1922, -5015, -8595, -12687, -12365, -12627, -11572, -2274, 6748, 3430, 478, 72, 2411, -314, -806, -1484, -3944, -3882, -4593, -8478, -11404, -12960, -13469, -7728, -7289, -9934, -13155, -12165, -7244, -8813, -9390, -11754, -17791, -16450, -8029, -5383, -4992, -6623, -5174, 3325, 7071, 480, -4656, -4821, -5627, -9459, -9127, -7460, -7777, -6099, -9109, -2755, 3031, 668, 2099, 7559, 5777, 4176, -3771, -8778, -7453, -8403, -5611, -2459, -5149, 1730, -3027, -6692, 799, -1739, -8780, -8317, -10654, -12608, -8807, -2103, 1301, 343, -4041, -5678]
15679e678K177M356r52q536J74L575j956Q26M536j84m090M797j754n931M256k466
15663f850l177L071J521n021n42o372q80L437K346k63L588m29K224p64o109k744
15647a6964K548m928M024J129N155K274m805O65n38N247k074J143K222n486m520
15632a4908p79j862L869L13k449M98R46j248L4o29L524N950J855L591RN14l443
15615d215k905N376o24l30M40N415J103q147r467R1j282j036j815J510K521M072
15599i293M047M596m282n289Q567k553J129J64j090O659M576n732K17k508o163
15584f955M51j118l371K395J1477j562m61r21k547L88j291J141l67m460M512L617
15568I28M572N7L361p215q048k352k496M7K507K752j398M184K171p96j0491L450
$$ y = [-5678, -3501, 855, -97, -8633, -8459, -4884, -6840, -6014, -1478, -1662, -5752, -955, -2709, -8640, -4384, -6850, -10027, -6956, -5435, -10456, -10998, -17370, -18250, -14813, -12467, -12730, -9142, -9571, -7347, -8111, -14220, -16964, -14416, -19344, -15320, -14191, -9036, -6762, -11567, -10902, -11440, -6193, -8267, -7124, -4902, -10388, -14908, -15687, -17549, -13680, -13367, -15816, -15318, -14372, -15620, -15586, -16215, -12691, -6741, -4886, -1295, -1286, -772, -4215, -7120, -1744, -2368, -2698, -2258, 3157, 4260, -3887, -13354, -13263, -14545, -15581, -17396, -15886, -13365, -9293, -5246, -650, -4932, -10221, -1654, -4207, -3078, -2914, -4004, 2655, 7231, 1499, 1716, -792, -6955, -6504, -7622, -10993, -8598, 2879, 1317, 856, -65, -2612, -2224, -3515, -2374, -2741, -7201, -2689, 928, 5500, 5557, 8918, 1703, -6345, -8697, -11193, -11146, -8639, -5887, -7285, -3101, -930, -1726, -12217, -8767]
15552h767J6331n46n50l776k987l060o694L346L040J125m483r066J024j79J524
15537a3718j920j375O378R744o724n616L307K112Q03j931q149l169O183N335n943
15522a4683K584R71L55P588J176L229J198m800o134j631l218j841J56k628J224
15507a6454K528J855O211K134l060k253J93j662q84j842p81K528J636K326K258
15492e267J003R38J47j137M609l172p485O424N537o88N38Q2l150k032j190k222
15476g065L391J217j826m077P920Q82O5L465q94j174j46j211l22M496L924l943
15460D702o223K230k90k247N6o70J469Q404l934k827q008j0188L269O322O40L60
15444f935N500N065O37k677k405k047o80J151J90L481K228l31m94k05n630Q395
$$ y = [-8767, 7564, 7018, 6468, 2692, -295, -3355, -10049, -6703, -3663, -2538, -7021, -16087, -15063, -15242, -13718, -15638, -17013, -10635, -891, -7615, -13231, -9924, -7812, -7009, -8940, -17089, -20258, -14075, -8740, -14683, -12099, -11128, -10773, -3185, -2009, 1220, 2418, -2382, -8516, -10147, -13365, -15206, -15050, -17678, -16454, -13926, -12071, -5860, -3726, -6786, -9039, -8846, -10508, -11392, -13234, -14015, -11487, -9851, -7525, -5267, -4264, -3326, -3179, -4316, 293, -2879, -10364, -3940, 1597, 909, 1447, 1529, -1621, -3653, -4843, -7065, -3674, -2457, -4283, -8360, -440, 442, 507, 3972, 3078, 1904, 1758, 547, 225, 4721, 8645, 4702, -1521, 709, 419, -1828, -1772, -2442, -973, 7431, 3497, 670, -7338, -17526, -14257, -7935, -7295, -6935, -1435, 3630, 4267, 1590, -815, -2862, -3542, -2391, -2201, 1280, 3508, 3177, 2683, 2478, -3152, 5243]
15428E243M791l035K912k834j367j202p68P03q56n113M242M952j0075j1487L809
15413a0085K587O40J72J955n452K249K173r77n162q342J471j239K083O026M851
15398g050L147J013J238k697m653K531n64l371n869M167K206Q583O508j883N64
15383C870l994p348k702k157L196M442M984l230j0941j209O269Q459P166J257
15369H062m161m138K656l163m5k611O65l003K465J324Q72m260o193J303L810M447
15353a970J483k630J296L127j341o18j852l910j061M561K376n748J242J744M071
15338G70r88m607l243P245M52l717o23J270k848k254J637j332m775M131P497Q93
15322d92p539l207J521K164J146J718O942J0686o210p251j313R30L895j37q123
$$ y = [5243, 10034, 6999, 9911, 7077, 5710, 4508, 3740, 4443, 3587, -1526, 2716, 7668, -2407, -13894, -10085, -7498, -6858, -6686, -4731, -10183, -7934, -5761, -6738, -11900, -20242, -18771, -20010, -17927, -11901, -7050, -3903, -2890, -1652, -4349, -9002, -6471, -7035, -10406, -16275, -12108, -9902, -1319, 5189, 3306, 3870, -124, -7472, -10174, -12331, -9135, -4693, 291, -2939, -13880, -15089, -8820, -361, 6805, 8062, 3901, -237, 2419, -744, -789, -3400, -2735, -5738, -3273, -1949, -1077, -5337, -11530, -10227, -6417, -1970, -487, -3117, -1821, 1306, -35, -653, -2505, -6415, -7476, -2915, -539, -6287, -5045, -3301, 770, -218, -4825, -8068, -823, -371, -4088, -4711, -3441, -6289, -8543, -6906, -8238, -13013, -8882, -1385, -492, -8031, -11238, -9717, -7553, -6407, -4689, 2253, 12939, 6729, -522, -1835, -905, 2990, 2853, -5270]
15307e270j715k392L916J015J369j301n105P13K328K347M817l151N87o76K682
15292A64Q54j756O72l341m232m005n885K061K360R36N721k7J72L932J10k869J953
15275c180M690K139o035k207J493l126k448k911J198L378M252J364l577J122P6
15260c772M103M505L23m816p732p841N690M651J290n81k558M054N670n51N625
15245H060K316o719k793o019j011M70l917m768l108O399O557m690m281j396k804
15230a7704K313O724L463M331K093l685j250k379p292J287J917O960L464o264
15216f022p55k738M798J0401o282l533K369o51j862m712k052m256N241J86o267
15201a6135N013J080l53K764j463N255N403k019l902j1639q854N413P744N612
$$ y = [-5270, -6985, -9377, -5461, -4446, -3077, -4378, -9483, -8770, -6442, -4095, 722, -2429, -1842, -2518, 164, 1018, -738, -66, -3407, -7639, -11644, -17529, -15468, -13108, -12172, -6451, -6478, -6306, -2374, -2264, -5133, -3180, 1510, 3649, -2386, -4593, -3100, -6226, -8674, -11585, -10387, -7009, -2757, -1393, -4970, -3848, -3772, 331, 4836, 5159, 343, -7389, -15230, -9540, -4889, -3599, -4180, -6738, -2684, 2986, 2435, 8060, 10376, 3657, 864, -5155, -6166, -5696, -9613, -14381, -17489, -11090, -4533, -9223, -13504, -14900, -17704, -15391, -8667, -5204, -873, 1220, -2465, -3715, -6094, -13386, -12099, -10182, -3222, 242, -6022, -6777, -9515, -4717, 5684, -598, -4131, -1762, -2413, -4275, -8987, -11039, -15295, -10054, -9868, -16135, -11122, -10042, -10395, -7631, -9094, -3839, 1564, -455, -4357, -15996, -24850, -19437, -11693, -6081]
15187f081j335K902P428Q950R323M533J6513J7583Q258k617p183l594o515j9548
15173B8617j4891q197p841j6214j5008j726Q065J0761n9N045J454P492k31l735
15159f468k201q02N696O561q838N89O870j386q22K732K012k773m318l657j84J664
15143e325j023R30n207K692j208m47J444l96P047j381o723o175k201m37K127M376
15127a1907k847k014P421L642q95m599l937k060n483M966L980M443j575M057K800
15112d008l424N207k300l102J910J349J792l975n20M102k673m480L200L275N015
15097A368M199l04m695K079L26l97L583K142J29j503k325j5953k174M686J0011
15082A172K622m45p978j774L924j056L463n416r853J910O225L948l62o540m69
$$ y = [-6081, -7416, -4514, 2914, 11864, 21187, 25720, 42233, 59816, 68074, 65457, 58274, 54680, 48165, 28617, 13726, 5529, -2312, -18526, -33534, -35260, -27195, -16434, -16493, -11448, -9994, -2502, -2733, -6468, -8669, -9471, -3775, 2786, -6052, -5463, 1407, 21, -801, 1931, 3943, 1170, -3148, -6805, -6989, -5325, -6348, -5418, -10625, -7933, -9141, -9588, -8144, -8540, -1493, -2874, -9597, -15772, -17973, -18410, -16283, -11907, -14754, -16768, -9347, -5705, -6600, -11199, -15136, -17196, -22679, -17713, -13733, -9290, -10865, -6808, -4008, -7432, -2225, -4525, -7627, -5717, -4368, -2576, -6551, -7071, -2969, -5642, -10122, -6922, -3647, 1368, 5567, 5263, 568, 2647, 2973, 2576, 6159, 8301, 8430, 6927, 4602, -11351, -13525, -8839, 1172, 3794, 3349, -4629, -6403, -2479, -3535, -72, -5488, -15341, -13431, -7206, -3258, -3620, -10160, -10629]
15067a0629K847Q5M594l436k554O22J446o17j13k342J408J338n711k80N540m209
15051a2011K340J0362P80j3245l561L213K049Q26r736l77J0651N94m857l183O041
15036a0114M463j103J196o865J255m49K70J135L794o244l023N888J280j499N092
15021d924l091o83J755L317o045m159J015P567o71J337j464O59J762n476j923
15006a1024K621N032L867l428n070O56L771L481J633L595m167k487K318j282M56
14991b8K569m585m189p277J523M233L338l727j226K900k626L13L835J10k914q784
14975a6535n74L682N985K341k048J409o67K689M803l308j068n314l796L936n35
14960i000j327M263k238K340O021k213J162L11j406m190l288N192m031O798K986
$$ y = [-10629, -7782, -7697, -3103, -6539, -9093, -8471, -7025, -7642, -7755, -10097, -8689, -7351, -13062, -13342, -7802, -12011, -9671, 691, 1471, -11774, -15335, -12122, -10073, -9247, -18983, -19360, -8709, -8115, -12972, -16155, -10114, -5651, -6754, -5558, -12423, -11168, -11617, -11347, -10212, -6418, -12662, -15685, -9797, -8517, -10016, -4924, -8015, -8698, -6943, -3626, -9671, -13830, -12815, -5248, -5919, -4582, -6046, -5387, -3625, -9101, -11024, -8403, -3371, 496, -2932, -8002, -7346, -3575, -94, 1539, 5134, 967, -1520, 798, -484, -28, 2541, -2044, -6233, -13510, -11987, -7754, -4416, -8143, -9369, -6469, -9095, -8782, -4947, -4837, -7751, -16535, -17109, -13427, -7442, -5101, -7149, -5740, -6407, -3718, 1085, -2223, -3291, -8605, -12401, -8465, -9000, -10327, -6064, -8302, -5962, 59, -2154, -992, -681, -2087, -6277, -9565, -4373, -8404, -1606, 1380]
14945A380m313O22L37p961N97L369j92n730l017K646L694l737j311K295l941L635
14929a1627P14L557K614J934j07j29l205J281N731L073j566o020K478j059M77
14914a854o613q914K711K130J69L010O155M190q44L41Q409k308q313n370l108
14899a0209J219J663K638k346j369j0252j0557K799L331o95O391J188J612O923
14885g664m847k282M598O319R78M563N092q674o647m588P614N383J444l481j266
14870c458K169P139j7k456n844n842l444l089N622r2K279L309o79J923m056j813
14854h349q454j1640J266L160M256M206J927N988M509p43k067M09Q401J915n057
14839b73N22o00q782J124P094o156m852M365j6j929J630J822n055j448O302R226
$$ y = [1380, -2933, -2311, -1974, -9935, -9338, -5969, -6161, -11891, -14908, -12262, -8568, -12305, -13616, -11321, -15262, -11627, -10913, -7356, -4742, -2808, -2915, -3044, -6249, -4968, 763, 3836, 2270, -3750, -1272, -2331, -1854, -8467, -17381, -14670, -12540, -12371, -9361, -3206, 984, 140, 481, 8890, 6582, -1731, -7101, -10209, -8990, -7327, -4689, -7035, -8404, -18656, -29213, -26414, -23083, -23778, -17387, -16199, -14587, -7664, -12511, -14793, -10195, -3876, -2898, 1665, 6757, -1917, -8564, -13152, -5538, -155, 1289, -2192, -3458, -1289, 5850, 5833, 3377, -2467, -8309, -11753, -14842, -9220, -9312, -7033, -3724, -4403, -2480, -6536, -8349, -16803, -28443, -27177, -24017, -19761, -15555, -13628, -7640, -3131, -3874, -5941, -5532, 2869, 4784, -273, 249, -351, -9133, -8009, -915, -7071, -11923, -7558, -7574, -9503, -7873, -6051, -11106, -12554, -6252, 2974]
14823B974O3O479J777r117q605L408M051N824M78o627q142k474j801J461L545
14808f706M780N829l073o373j518j749K246J758l679l528j963J859Q519N89P81
14793b228j100N866j247l65L246o41j455J312j963j0554n094J475N498k772k239
14778a2261N691N042j70r65j346m185n642l345O627k739N219Q332o972j562M285
14763c991p61k49j407L406J493m008q667O15K787J765J148k56k667J623J523K517
14747e129n143J259Q843N057l741j0894j1M769n158j260m92l285j514l088K108
14732a7679Q932o03K865L78j040n32O621J640K017m52k569l051p138j555j632
14717a3798J434K0J810P810k170K261j666j477O66K507N54o093r09N027Q561J83
$$ y = [2974, 3037, 9516, 11293, 2176, -6429, -3021, 1030, 6854, 7332, 705, -7437, -9911, -11712, -10251, -6706, -1926, 3903, 830, -5543, -7061, -8810, -6564, -4806, -8485, -12013, -13976, -12117, -3598, -3009, -2228, -3328, 2538, 1291, 926, 4172, 3531, 2076, 3388, 1425, -9129, -14223, -12748, -7250, -10022, -12261, -6570, -1528, -1698, -2663, -4009, -8194, -13836, -17181, -10554, -13293, -8074, 258, -6714, -8276, -3991, -4752, -5001, -6408, -3002, -1509, -5517, -14184, -13569, -10782, -9017, -7869, -8125, -10792, -9169, -7646, -5129, -10272, -9013, -170, 4887, 1146, -9748, -9759, -4990, -10148, -11408, -11900, -15185, -16699, -19787, -17679, -8747, -9350, -6485, -6107, -7147, -7679, -1058, 582, 2599, 2147, -422, -3473, -10611, -12166, -13798, -12364, -12344, -10534, -2724, -4894, -2633, -4299, -5776, -5110, -2603, -2049, -8142, -9051, -4024, 4537, 4720]
14701D720K426p30m753P54L077j38k800j390l288N408l06o063k10Q74Q124L000
14685H705j913J778m264p966J812l390j923l667n514j968J77P562O012O74K029
14670a856K220J755K282P47O27n136o122L220J170O683L725k080p181k152K123
14655B5J150K4j288k86p884q47Q017M072q153L541l271n994o327j964R29N426
14639a2830L391k256n5l077Q221N182o782J411l953K428n735k72K663R07j45J365
14623i537K978l303n867k77O438L397l619K424J038O485J119n677m285J527R78
14608f181j242J790O724l35m675m252M429j29k518M7k353K744L994q31k480k425
14592g693j859N169L898l907k415K618J04r49K756M427M980k206n638j794k540
$$ y = [4720, 7146, 6416, 1663, 2417, 5494, 5356, 2556, 1166, -2122, 3286, 2980, -3083, -3293, -2419, 5705, 8705, 6792, 8570, 4306, -3660, -1848, -5238, -7161, -10828, -16342, -18310, -18133, -10571, -4559, -3885, -1856, 364, 2119, 4401, 5148, 5775, 639, -5483, -2263, -1093, 5590, 9315, 7235, 54, -2098, 25, 1175, 1199, -89, -375, -8259, -9106, -1089, 2983, -5170, -1629, -4900, -10894, -17221, -19185, -18256, -12830, -9439, -11695, -11750, -14827, -6606, -1424, -8206, -6795, -10748, -8320, -14055, -14327, -11664, -10757, -10902, -9537, -6559, -9862, -15729, -16006, -9568, -6171, -9790, -7366, -6328, 157, 1276, -4401, -8686, -7159, -6181, -7423, -5633, 1091, 756, -3919, -8171, -3742, -3871, -6389, -6342, -8695, -5951, -1957, -2788, -5268, -7693, -9552, -4383, -485, -4392, -6807, -4189, -4085, -5034, -2278, 2149, 7129, 4923, -715, -2509, -5049]
14577e049j239L013O220L159R63k158m380q710n279q74L471M688K953k864m044
14562a0130n750K929M634K881M627j258l528p96qJ230L02J0262K852k683O72n897
14546C39m374J680J331p690k043j446m731N898K29O50L601P80l323N25m961M095
14530i440Q379R82n533q681O364L319J703P917l248K654n401r84j219r749L589
14515i348M340j836m28J368m295J097M262L32m542K043J2304K869p164n423K190
14500b231l654O39k62o52J444k528J54K578L410j026M246P162l342p394j101L169
14484F12J784J195j179L436k348n421M798o63r913L605L555K539l660m731q734
14469a5125j98L969J022M178M216L511k008l311J903j974J772J998n634m402m007
$$ y = [-5049, -6288, -3275, 2945, 6104, 7067, 4909, 529, -8181, -13460, -14334, -10863, -6175, -3222, -6086, -10130, -15880, -12951, -8317, -5436, -809, -2067, -5595, -6391, -6399, -5169, -4867, 5395, 8247, 5564, 6236, 339, -4035, -2355, -1024, -8714, -10757, -12203, -16934, -11036, -10807, -10157, -6556, -5776, -9099, -8574, -13535, -9440, -1061, -79, -5612, -14293, -7929, -4610, -2907, 5010, 1762, 4416, -985, -1969, -3188, -12937, -9348, -5008, -6844, -7272, -5904, -10199, -9102, -4840, -4508, -9050, -7007, 5297, 8166, 1002, -4421, -2231, -5885, -5246, -5508, -6160, -4716, -7244, -7090, -4512, -1102, -2128, 2118, 9280, 5938, -1456, -2557, 612, 2396, 3591, 2412, 5848, 3500, -1921, 2877, 2214, -7699, -4094, -539, 2000, -1660, -6391, -15125, -15323, -11354, -10332, -6154, -1938, 1573, -435, -3746, -1843, -3817, -2045, -47, -5681, -10083, -14090]
14454a4090O141J456M398M595M968M498m660k542K130n551J773K574n253J762
14440B199M641n511j2253k783O06O949l34L25n081r97Q305q85J469K696l518m762
14424h934j275K140N375M23j030L141o498n109k411J695K575j159Q85O941P334
14409D093J001p477k443K847n235N543r81R93l006o722m500M64L869R701k575
14394d428j774k468o268N740L690J997K251m713l261l095O44j633J660J279J754
14379h625K594j42N42N850L397m153n979l736j1936m391j056J865M725K112n13
14364a9446j062O617K633J525J1797O54l718K27k826k270q41K703O22O636j669
14349A582k710k238j27L382m772o717J710j856L266M657O927M33n94n64K272J435
$$ y = [-14090, -7949, -6493, -2095, 2500, 7468, 11966, 7306, 4764, 6894, 1343, 3116, 5690, 437, 2199, 6840, 1329, -10924, -13707, -13101, -6152, -6486, -6161, -11242, -12239, -3934, -4819, -3350, -654, -4172, -8934, -10209, -8069, -2694, -2271, -3301, -160, -6658, -11767, -14178, -12483, -9908, -11067, -10182, -3241, 4093, 5094, -2383, -4826, -1979, -7214, -1671, -2652, -1659, -4665, -11387, -15887, -15423, -11554, -1853, -4428, -6202, -8670, -14938, -9198, -5508, -3511, -1260, -5973, -9234, -12329, -11685, -13318, -11658, -10379, -8625, -6031, -6173, -5631, 219, 3616, -537, -6516, -10252, -22188, -26579, -27635, -25770, -21045, -18933, -19446, -20508, -13891, -11258, -9733, 2064, 2718, -1000, -773, -3599, -5869, -6710, -4007, -3385, 3251, 1582, -1128, -3366, -3493, -111, -4883, -11600, -9890, -11746, -8480, -3823, 3104, 3537, 2943, 2379, 4651, 6086]
14333F086j397m902m124n322J636N72j652M701N047J35L313l6o474m483J138J768
14317c994L401O937N376k037p180n804M992L765o978n966M93j536Q37J125K407
14302d162M735O854O77N15K088k046k495o006l11O130O696q82o306o523m970J628
14286d378k259J283n170o50J0727K447Q40q049j1987O20O065o27j884l005K868
14271a3159N094L586k977m415K680L715j2323l628Q061o01m453O783R757m60l499
14256e839L092O364N64l298o75J538J018o965p393k455p41R58L462L823k170N90
14240h127K534k186r98Q772M310l005j677M16j839j846O135l890k998o265J849
14225h815O494K981J285j007m792j411m57j620N41l443r91k217L422M27K624K624
$$ y = [6086, 4689, -213, -4337, -9659, -8023, -7451, -9103, -4402, 645, 780, 4093, 4057, -2417, -6900, -5762, -3994, -593, 6344, 11720, 9683, 2503, -3301, 1691, 5456, -1522, -7488, -6995, -8531, -7694, -6569, -4162, 573, 7427, 8104, 8619, 10707, 8661, 6166, 160, -151, 5979, 12675, 11793, 5487, -1036, -6006, -4378, -6637, -5354, -10524, -11174, -447, 2000, 2840, -5209, -17196, -16576, -10511, -11138, -13022, -16027, -13159, -8065, -4479, -7456, -11871, -9191, -5476, -17799, -21427, -13366, -13967, -18420, -11637, -1880, -2340, -5839, -2747, 3617, 4181, 883, 208, 1746, 2764, -4201, -11594, -14049, -14790, -13832, -10370, -6547, -8717, -8127, -5593, -7779, -8777, -5, 4305, 1300, -377, 39, -1800, -3646, 2489, -1401, -4399, -10664, -8815, -2321, 660, 1945, 938, -3854, -5265, -5722, -7342, -6801, -10244, -11235, -13452, -10030, -9603, -6979, -4355]
14209d355P55J175K60l435L126J199p180r390J390O369J308K104L049L329K035
14194A739m739k304k665l140K914O042M75l610K204L668l143m063O346P974n29
14179G169o075k139J026K409k461N90K404N733M112m76n758m196J742O132K564
14164A2776l920o832p364o989m154K172J751K652J123k526n12N642k894L514R52
14149d609q9M758M483n006l414n98Q31k04k634k922j460L96J746M648Q94k200
14133e380n162m009M816N594O738k818L64k588l049M246k118k750m64q71K416
14118e035J343R553M56k344P86P992j0667j3977K662k189J829N544j477j337M050
14103b811K070K648M596O414n69r501j275Q843J693j2846p705m454O56K563J230
$$ y = [-4355, -3600, -2425, -2165, -5600, -2474, -1275, -8455, -17845, -16455, -10086, -8778, -6674, -3625, -296, 1739, -3000, -5304, -7969, -11109, -8195, -2153, -1678, -5288, -3084, 584, -2559, -6622, -276, 7698, 7169, 1094, -1045, -19, 2390, -71, 519, 2923, 8656, 12768, 12292, 6534, 2338, 4080, 10212, 12776, 8856, 2024, -5340, -12329, -16483, -14311, -12560, -9908, -8785, -11311, -11823, -6181, -9075, -5561, -4609, -4698, 60, 4543, -463, -3877, -4475, -3644, -3848, -6482, -9404, -10864, -10468, -8722, -4074, -3180, -5380, -10542, -14551, -9735, -4141, 2597, -221, 143, -2445, -5494, -1248, -3366, -6116, -6580, -7451, -5035, -3692, 5861, 6317, 3973, 4759, 12751, 2084, -11893, -9231, -11420, -9591, -4047, -5524, -6861, -2811, -741, 1907, 6503, 12917, 12348, 2847, 1572, 10415, 12108, -738, -8443, -12897, -12241, -9678, -8448]
14088h448J021j55k931M85P039K946M12j004j246l971P472j24J98J0005l718j0851
14072b870o601m788j486n43m45m98l330Q957M986k230L533p68q35N174J975R88
14056A219l047O086M439o115k467j236l636K651L963j246j010k44l809P425J876
14041D849k236j877k903l541O03r91M935j994P91K542K748K942k054r627n128
14026a0941k593M921M820N830l629o555P049N546n34n189l536J946L549l984K788
14011e12j47K179Q42o807m528J286K682M583L940Q40n17J639J085m565j715Q98
13995A183M443n142m330l078j156L752J992k798L033J863J695K079O18L134k297
13980D991k867R93N06o894J1206P351n810M658K284k298q096j711K778n314k963
$$ y = [-8448, -7427, -7582, -10513, -10028, -2989, -43, 369, -635, -1881, -5852, 1620, 1496, 1694, 11699, 7981, -2870, -9471, -14259, -15745, -16288, -16733, -17231, -20561, -11604, -6618, -8848, -5315, -6083, -6918, -1744, 231, 1219, -1828, 4258, 8697, 2582, 115, -1121, -4757, -2106, 1857, 611, -399, -643, -4452, 2973, 4849, 2613, 736, -2167, -5708, -5105, -6096, -1161, -3155, -2364, 178, 2926, 5868, 3814, -5813, -10941, -13534, -8613, -3793, 2037, -1592, -8147, -1098, 4448, 3914, -1275, -4811, -2865, 684, -3300, -512, -659, 1520, 2362, -4445, -8973, -7687, -5005, -422, 3518, 4358, 3841, 5480, 6565, 2000, 285, 1183, 5626, 484, -3846, -6924, -8080, -4328, -2336, -5134, -2101, -238, 1457, 3536, 4154, 7288, 4991, 2124, 3117, 3623, -3271, 7935, 15286, 9476, 14134, 16418, 14120, 6024, 4313, 7091, 1777, -1186]
13965a186O741l13K438M385m473Q206l170n250l709m669N992l13k76l244n017
13950c858Q9p000n422O966L924J256N239O692K085n117M46K425k347o951j152
13935b725N515k541k752J761P317J733N90l285l474L714J75L779m315n069k696
13920b273N278l433l67l13l064K229K223J781n367K510M62k219M047J267N98O517
13904I876L233R91l995m256J408l023j053p01j316m61K350k863L193k16k610n322
13888d765K783L530k338O326N647q570o480J641l512L995M65K134N554q820p623
13873a0033K124N9M128m156Q13j501J733N97J725N855N232N308j554o49J84J545
13857A1410L96J115m538J143N005j415j113l236J719n65m94m528m756R21P19l078
$$ y = [-1186, 5555, 5242, 7680, 12065, 7592, 15798, 12628, 7378, 3669, -1000, 4992, 4679, 4403, 1159, -3858, -3769, -10769, -16191, -9225, -5301, -4045, 1194, 7886, 9971, 4854, 5300, 7725, 5378, -1573, -2725, 2790, 249, -2503, -742, 6575, 8308, 8898, 5613, 2139, 5853, 6028, 9807, 5492, 423, -2273, 3005, -428, -795, -1108, -4172, -1943, 280, 2061, -3306, -796, -334, -2553, 1494, 2761, 3359, 9876, 13109, 14100, 10105, 5849, 7257, 4234, 3181, 2480, 1164, 703, 3053, 190, 3383, 3167, 557, -4765, -1982, 1548, -790, 5536, 11183, 2613, -3867, -2226, -5738, -1743, -1278, 856, 6410, -2410, -10033, -7909, -7850, -3722, -7878, -7065, -8566, -6833, -6236, -4511, 1344, 6576, 11884, 10330, 9681, 9865, 11410, 11806, 12921, 8383, 9526, 14531, 13116, 12003, 8767, 10486, 9921, 9427, 4899, 143, 1064, 1783, -1295]
13841a295j414O026L005J376m240m963L523N130o530m92l309m736p37P278K478
13826A100m622L467M560k00N018M806p2p288k991m117K270L181n992m280J989
13811c171M504k05r906n01o475M534R860l716j727K826L999K056L923J579l989
13796C591j484l639k275P415k57K147M738L19J95j601o291l187m948n76j46J410
13780d589M197M86N01l659k469K818J520K637Q669K252l391m152O58k24Q90l64
13764E780q826o407L774l90k415M092PJ109j584L39Q14M233P153n372n329J67
13748b855j32L973L504p611l068M03m122L54N179N075K531K545k788l875O066
13733E179M67n424m053L548J988M225o395l485J433L434L804P58n328k902M409
$$ y = [-1295, -2709, 3317, 6322, 7698, 3458, -1505, 2018, 7148, 618, 126, -3183, -7919, -8656, -1378, 1100, -3522, -55, 4505, 4305, 9323, 14129, 14057, 6769, 3778, -339, 1931, 5112, -880, -5160, -3171, 1333, 1128, -8778, -9279, -15754, -11220, -1360, -5076, -6803, -3977, 22, 2078, 6001, 7580, 3591, 2107, -1532, -3807, 3608, 3351, 5498, 10236, 10555, 10750, 9149, 2858, -329, -5277, -5853, -5999, -4589, -392, 94, 595, -3064, -5533, -2715, -1195, 1442, 10111, 12363, 8972, 4820, 5478, 5254, 6144, 5780, -3046, -9453, -5679, -6069, -8484, -4392, -4385, -3276, -4860, -4521, -3707, 526, 7679, 2307, -3022, -2855, -2987, 986, 4490, -3121, -6189, -5786, -9908, -9554, -4375, 700, 3231, 5776, 2988, -887, 5179, 5646, 222, -3831, -283, 1705, 5930, -465, -3950, -2517, 917, 4721, 5479, 151, -2751, 1658]
13718A658L576l504p55j825k500P192J52m776m156j240k703P982J569q38J284
13703A116K43j342k056k437j255L46j576j347K014K867k972o022J600N689K245
13688b887k057M553J386o480l42L093N131K072r8L074J420Q947n644q646J385
13673D907k575L90R77k094L381Q47j504K110j455l299K566J808r80R99J6l825
13657B269k634j510K321O700k150K075l634k118K843m95m35m28N756n682r272
13642f394j786P041L368l703N32M942O59l366J968j33K771O118n134l374j689
13627A820r438k425M831L796J553M427l018m934n624L746K139l138m065j206l271
13612a4807O157J3206j542L585K982m42j782j885j980m188k135J696J699j445
$$ y = [1658, 5234, 1730, 975, -850, -3350, 3842, 3994, -782, -4938, -6178, -8881, -899, 670, -168, 1116, 1359, 17, -2039, -4476, -5731, -5385, -6961, -8308, -6294, -3427, -6399, -12421, -10821, -5132, -2887, -4944, -391, 995, -5485, -5827, -2734, 2397, 4469, 4371, 7445, 8865, 17812, 12168, 3522, 4907, 2332, 2722, 3699, 1605, 4986, 5833, 4329, 6439, 4984, 1685, 4251, 6059, 5079, 6078, 6094, 2269, -365, -1875, 446, 7146, 4996, 7071, 3437, 1319, 4162, 3667, 3232, 2804, 8560, 2878, -6394, -8180, -1139, 2229, -1474, -942, 4000, 4659, 1293, 3261, 3128, 5899, 12017, 6883, 3509, 1820, -7618, -10043, -5212, -1416, 137, 4564, 1546, -3388, -9012, -5266, -3127, -6265, -10330, -11536, -14807, -8650, 4556, 3014, 6599, 9581, 9139, 7357, 5472, 3492, -696, -2831, -1135, 564, -881]
13598h81Q6K131p48Q289l360Q53J642o664m679K699n4k516j421m956m629O033
13582h175P727N481j093L245M755m255m812n234j026k859k270j755o83N27M748
13567e679L325R34k888l482M472Q217m74j0796k314K785R725Q834K383k864n036
13552G142k876O833P876J809m527n512m835m96N570P02m996j599K72L264L854
13537A2481M174n938p36M780K640k250k184O79M073j530N138P22m934J73M115
13522B1403J645K076j464l001R5m051k111K460K441j133L124M531k640L183L128
13507B9686K162j191L283n486j4k721o295k956Q8k414L685K251K206J404O856
13492C0544N614k251j0129m41K175k387o654l487J859K161N78L915K301k396J595
$$ y = [-881, -795, 1336, 588, 8877, 5517, 6370, 8012, 1348, -3331, -632, -686, -3202, -4623, -9579, -14208, -8175, -448, 5033, 3940, 7185, 11940, 7685, 2873, -2361, -3387, -6246, -8516, -10271, -10954, -10427, -5679, -2354, -1420, -4308, -7790, -3318, 4899, 4425, -6371, -8685, -5900, 3825, 12659, 15042, 12178, 7142, 4266, 11099, 18975, 20784, 16257, 10745, 5910, 5414, 10984, 11686, 6690, 5091, 5363, 8627, 12481, 16655, 10717, 9981, 14761, 17401, 15151, 12967, 13646, 17719, 16189, 21327, 22049, 17115, 17288, 21403, 23048, 25124, 23660, 20659, 20754, 16703, 14592, 17052, 19493, 18360, 21484, 26015, 23375, 26558, 29686, 31848, 30657, 33940, 28454, 28440, 25719, 19424, 16468, 16556, 14142, 17827, 20078, 22284, 23688, 30544, 36158, 33907, 23778, 23337, 25512, 23125, 16471, 12984, 14843, 17004, 17582, 21497, 23798, 21402, 22997]
13477B2997J240k685j600m28l119J458j465K448M649j886L044J077L79P19m241
13462B2587p163j714j252J317R94j318j056j911k83j478l42L721M211K067P48
13447A9128o402R02j530m052M746k348M475o82L561O728J335k404l33O051n206
13432B3969k553n36j1044r356J388J2084P910n873o134l834L309N741j946J274
13418A4399k644K560M790J377n874r34O217K182J29L357j63J034m643q251J780
13403A5316M048j235L83k332l442K766k87o12J1641N215k655p31m07n861L875
13388B5682Q753P72l419k616N327m839p600J2081M591j1854o585k611k972L319
13374A8029K848n443M963K807k401p63l873O741K810j900k845j246J433o179k581
$$ y = [22997, 24237, 21552, 19952, 19524, 16405, 17863, 16398, 18846, 23495, 21609, 24653, 25730, 26109, 26828, 22587, 15424, 13710, 12458, 13775, 14769, 13451, 12395, 10484, 10201, 8723, 8381, 12102, 16313, 18380, 19128, 12726, 13628, 12098, 8046, 12792, 10444, 14919, 14237, 17798, 24526, 25861, 23457, 23124, 29175, 23969, 21416, 20880, 9836, 480, 1868, 13952, 21862, 15989, 9855, 6021, 9330, 15071, 13125, 14399, 11755, 14315, 19105, 20482, 14608, 13674, 19891, 22073, 22202, 25559, 25396, 26430, 21787, 13536, 15316, 19364, 18129, 18512, 16180, 12738, 15504, 15217, 14605, 26246, 31461, 28806, 28075, 27668, 21807, 25682, 34435, 35207, 31788, 29172, 34499, 29660, 22060, 34141, 38732, 26878, 20293, 17682, 14710, 18029, 20877, 15434, 20397, 23204, 20803, 20040, 16167, 22908, 25718, 23818, 20973, 19727, 21160, 14981, 12400]
13359A2400j440k688l377m003k10K560N104O576M682j347j1208L203N620m582
13345A1290L387R05M555L174K392Q09R4M296O014Q41R31M65o171l401j118j231
13329B7232J485L837j842k666p092r255J70M044P526J957K975K16k647m265q070
13314A3605m567l73N459P77k829r95j408M435j855l029Q473M813P690J428k596
13299B9028j184M084l72m327j979p41K657j111O060N495J897l377o64K857l571
13284C4752n159O160K404L443l47N91m705l278N585p52j887L846N783L083L784
13269E3303P522K844Q317P624J4872L349N260P474J3947J5848K4064L5375L9347
13256B39146O0258R8286J62458K61655L66523L39407J75751J08338J00886P0191
$$ y = [12400, 10960, 8272, 4895, 892, 682, 3242, 8346, 14922, 19604, 18257, 7049, 10252, 15872, 11290, 14677, 15582, 20137, 23311, 25703, 26512, 26606, 30902, 36916, 37757, 38688, 39153, 32982, 29581, 28463, 27232, 28717, 32554, 30712, 28046, 20954, 11699, 11869, 15913, 23439, 25396, 28371, 28587, 25940, 21675, 13605, 9038, 8665, 14124, 14901, 12072, 11077, 9669, 14104, 12249, 9220, 17693, 22506, 30196, 31624, 29028, 27844, 31928, 31556, 27229, 25250, 24509, 27166, 26055, 32115, 37610, 39507, 36130, 35466, 38323, 34752, 29593, 35753, 38157, 41600, 41253, 41844, 37139, 33861, 39446, 38694, 36807, 40653, 46436, 49519, 53303, 60825, 63669, 71986, 79610, 94482, 97831, 103091, 110565, 124512, 140360, 164424, 199799, 239146, 299404, 397690, 560148, 821803, 1188326, 1527733, 1703484, 1811822, 1912708, 1982899]
13246A982899k9566k98296m73777l53310k18338j36587q0199m6872l6658k3916
13236B85380k3415j5683j2982j8801k3176k1505j4519j2741j7254m404l95n319
13224A15186J459N379N284p85j511j383k562j516J999q605j0229O99Q93k860k956
13209I8492m086K660j623l315p764r662l955J495J078j0445p669J106J284o28
13195E6968j27J887M120p15L34m491k881l665L149M965j725j2364o200L477M893
13180D7625J870l993m890n408K556O002N554J804p266M20P236L253L111l671l455
13165E0748l648L490n86J379K659l528j726J070j477o962m120m388J912M517M281
13150D3621q561o826j686q33K123k756O80R27m799j081K030k65j605P425L582
$$ y = [1982899, 1953333, 1655037, 1181260, 827950, 609612, 473025, 392826, 345954, 309296, 285380, 261965, 246282, 233300, 214499, 191323, 169818, 155299, 142558, 125304, 120900, 120505, 115186, 116645, 122024, 127308, 126523, 125012, 123629, 121067, 119551, 121550, 112945, 102716, 103415, 104308, 101448, 98492, 94406, 97066, 95443, 92128, 84364, 74702, 70747, 72242, 73320, 62875, 55206, 56312, 57596, 56968, 56841, 58728, 62848, 62133, 62467, 57976, 55095, 51430, 54579, 59544, 57819, 45455, 39255, 42732, 47625, 49495, 45502, 40612, 35204, 37760, 43762, 49316, 51120, 43854, 44274, 51510, 54763, 57874, 54203, 50748, 47100, 50590, 50004, 51383, 54042, 50514, 48788, 49858, 48381, 41419, 37299, 32911, 34823, 39340, 43621, 35060, 28234, 26548, 25715, 27838, 25082, 25762, 26689, 21890, 20809, 22839, 22574, 20969, 28394, 31976]
13135C1976j987Q30n123k497n937m486r33N466O064k277l765K149n64L70M906
13120B4192M966O34L382L205K298M376L169j918o43l98k259l422r337r667p518
13105A1060l424p99o071j2010O121K639P643J4440J0504l530k885P00k441n667
13091A6280j5242m660L350O550j742R066J6071P016Q429N317K070J110J6241M696
13077G4552k257r5j407m757o632L639O820M42J395P66L936K497K633m77j078J139
13061H1116N928P58k130n041R77M139k131n07N083K120n99P434J0676J2895K7219
13046A47937J6562K9525K1094M662J2296J1825n330q839K07j0886J349L993j4203
13033B10192k9817k6222j0967j2788j8070j0574K8j602j3992p686K917Q639k402
$$ y = [31976, 29989, 30819, 25696, 23199, 17262, 12776, 11843, 17309, 23373, 21096, 17331, 19480, 18916, 19286, 24192, 29158, 29792, 33174, 36379, 38677, 43053, 46222, 44304, 43661, 43263, 41004, 37582, 28245, 18578, 11060, 7636, 6837, 766, -11244, -5123, -2484, 5159, 19599, 30103, 26573, 23688, 24388, 21947, 16280, 1038, -3622, -272, 6278, 4536, 13602, 29673, 36689, 45118, 50435, 52505, 53615, 69856, 74552, 72295, 72200, 70793, 66036, 59404, 63043, 69863, 70305, 71700, 72466, 76402, 78899, 81532, 81055, 79977, 81116, 87044, 87802, 85672, 80631, 81608, 85747, 83616, 83109, 88192, 90312, 89713, 97147, 107823, 120718, 147937, 164499, 194024, 215118, 219780, 232076, 243901, 238571, 229732, 229939, 219053, 220402, 224395, 210192, 180375, 154153, 143186, 130398, 112328, 101754, 101782, 100180, 86188, 78502, 81419, 90058, 87656]
13020H7656o129K83m203k81q491p968L540L40k319L588J4362N764Q029L17J239
13005I5727l605l367q35O110N781P353J1343J3282R916k195n787n596o923J059
12991A22263n032j3934j6085j0158j0243o527R909K74k60J335l185q391j3412
12978D6554n539j5372r127J710M005O529O374J5446J8694J5016J5485O726k052
12965A04449K506J041n612k006q39m467p421o776m784p825R157J3709J5680J3985
12951A20797J5029J0617L602m834m783o039r928q841k99K509K839O432O862J234
12937A35197m89R9l698K23P916l303j3906j777j316l33O019M237k246j354M930
12922A30199O881O1J5880K5808J2210k4708r530R4652J49293R0373L9182R4652
$$ y = [87656, 81527, 81810, 77607, 77326, 68835, 60867, 64407, 64747, 62428, 66016, 80378, 86142, 94171, 94488, 95727, 92122, 88755, 87920, 94030, 99811, 107164, 118507, 131789, 141705, 139510, 133723, 128127, 121204, 122263, 117231, 103297, 87212, 77054, 66811, 60284, 70193, 70467, 70207, 71542, 68357, 59966, 46554, 41015, 25643, 16516, 18226, 22231, 28760, 35134, 50580, 69274, 84290, 99775, 106501, 104449, 106955, 107996, 102384, 100378, 99539, 95072, 87651, 80875, 76091, 68266, 77423, 91132, 106812, 120797, 135826, 146443, 150045, 145211, 140428, 134389, 124461, 115620, 115321, 117830, 120669, 127101, 133963, 135197, 134708, 134807, 131109, 131332, 139248, 135945, 122039, 120262, 118946, 118613, 124632, 128869, 126623, 125269, 130199, 137080, 137141, 153021, 178829, 191039, 166331, 156801, 251453, 400746, 491119, 530301, 624953]
12910F24953J21152K5753p8193r0860m3355j8751l0607o713J5823R327k661j342
12898E24526L999k202J973N520Q525l254J844K2570L1655J9931K161l72K764J3715
12884F33355J2366M946L535j58o582M855O926R01m991O206J4758K095O244K202
12870F86658p137p768M788J185J1029J0531J7169J7314J0225J7668K3533J8923
12858H04118K1176M2501L3748K6563L0907K7714L0287L1073P364k2605j2946Q204
12846A028104K4004J5725Q747J1021R980J4160L4887L6835J3361p381n939J1301
12834A194805L7872M2131K8419M7219O3100P6061R0404Q6558N7666L1705O8596
12823A824536J09030J13555J04547J10807J54467K05438K11410J99863K37546
$$ y = [624953, 746105, 771858, 693665, 602805, 559450, 540699, 510092, 503379, 519202, 528529, 525868, 524526, 528525, 526323, 528296, 533816, 542341, 539087, 540931, 563501, 595156, 615087, 617248, 616876, 619640, 633355, 645721, 650667, 654202, 654044, 647462, 652317, 659243, 660144, 655153, 661359, 676117, 678212, 684456, 686658, 679521, 671753, 676541, 677726, 688755, 699286, 716455, 733769, 743994, 761662, 785195, 804118, 825294, 867795, 901543, 928106, 959013, 986727, 1017014, 1048087, 1055451, 1032846, 1019900, 1028104, 1052108, 1067833, 1076580, 1087601, 1097581, 1111741, 1146628, 1183463, 1196824, 1189443, 1183504, 1194805, 1232677, 1274808, 1303227, 1350446, 1413546, 1489607, 1580011, 1666569, 1724235, 1755940, 1824536, 1933566, 2047121, 2151668, 2262475, 2416942, 2622380, 2833790, 3033653, 3271199]
12814C271199K88918L46443M46358N33440O12222P27998Q47302Q72690R21906
12805H868476J052462J246073J548739J808841K020587K422724L122005M087879
12797B6177786N487076P537774J0823404J6836377K7661308M5710738O5947572
12790B06182035O5011717L4278422J7508248J8073380J6906952N259554l5247655
12783C27972653q3334137p4916554m5677954k7215405j7067439j1353673q298251
12776F0109240o460999n059532m044526l323314k998295l020352k859591k458452
12768B9884179k076703j774658j506924j250883j052193q83790p84066p72404
12760A9782558p98595p77719p56106p41494p36334p30912o89292o17010n66784
$$ y = [3271199, 3560117, 3906560, 4352918, 4886358, 5498580, 6226578, 7073880, 7946570, 8868476, 9920938, 11167011, 12715750, 14524591, 16545178, 18967902, 22089907, 26177786, 31664862, 39202636, 50026040, 66862417, 94523725, 140234463, 206182035, 271193752, 305472174, 322980422, 341053802, 357960754, 363220308, 327972653, 244638516, 169721962, 124044008, 96828603, 79761164, 68407491, 60109240, 53648241, 48588709, 44544183, 41220869, 38222574, 35202222, 32342631, 29884179, 27807476, 26032818, 24525894, 23275011, 22222818, 21339028, 20554962, 19782558, 18983963, 18206244, 17450138, 16708644, 15972310, 15241398, 14552106, 13935096, 13368312]
12751A3368312n32778n05496m99913m70034m19296l78541l54088l56046l47791
12742I504329l28643l21974l10141l11702l06437l01723k95360k74552k61123
12733F792674k45963k30340k17693j98153j74659j46264j42562j33827j27673
12724E175540j28039j23231j10080j08461j20853j18721j16217j25066j31063
12715D093809j34551j33639j08375r5047j01202r7431r7943r5142q2608r4514
12705C053357j03848j17518j07127r9586r6271q1435p3347o4615n3742m4017n1878
12694B159973n9137o4372n7926n0295m9840m8953k6222j4938j8276k1999k0405
12683A727610j9269l6528n1636o6307q7384r1893p8898p1063p9085q5396q1097
$$ y = [13368312, 12835534, 12330038, 11830125, 11360091, 10940795, 10562254, 10208166, 9852120, 9504329, 9175686, 8853712, 8543571, 8231869, 7925432, 7623709, 7328349, 7053797, 6792674, 6546711, 6316371, 6098678, 5900525, 5725866, 5579602, 5437040, 5303213, 5175540, 5047501, 4924270, 4814190, 4705729, 4584876, 4466155, 4349938, 4224872, 4093809, 3959258, 3825619, 3717244, 3622197, 3520995, 3423564, 3325621, 3230479, 3147871, 3053357, 2949509, 2831991, 2724864, 2625278, 2529007, 2447572, 2374225, 2309610, 2255868, 2211851, 2159973, 2100836, 2036464, 1978538, 1928243, 1878403, 1829450, 1803228, 1788290, 1770014, 1748015, 1727610, 1708341, 1671813, 1620177, 1553870, 1466486, 1374593, 1295695, 1224632, 1145547, 1060151, 979054]
12672I79054o6667o4692o4173o8066o6561n6158m3728k9059l2320m6453l4509
12661D06668M4027J16671J00161K1043m6810n3837k3361j9629j8252j2734j0402
12650E03545q505k1078j3081q790p249j0970j2760j9584j1288K154l052m097j5519
12637C69726j2759M567Q840R240j617l539O888q647j3526l070j3430j5279j2804
12624C14590q843k416J3599J2877J2130M692P476R943j118n054j6186j6780j6872
12611C08038j2342k632O127o08o400L039Q294R259J3799L268N183L659J1256J814
12597C51754K137j3384j6988j9910k2820m545P339Q334J919p10N720o203p495
12584B85148m102p312k1729j3436j5164k0247p097J148p5j55l90O787Q921Q13
$$ y = [979054, 912387, 847695, 783522, 715456, 648895, 592737, 549009, 519950, 487630, 441177, 406668, 450695, 567366, 667527, 688570, 641760, 587923, 564562, 544933, 526681, 513947, 503545, 495040, 473962, 460881, 452091, 444842, 433872, 421112, 401528, 390240, 392394, 389342, 385245, 369726, 356967, 361534, 370374, 379614, 377997, 374458, 381346, 372699, 359173, 356103, 342673, 327394, 314590, 305747, 303331, 316930, 329807, 341937, 346629, 354105, 364048, 362930, 357876, 341690, 324910, 308038, 295696, 293064, 299191, 298583, 292183, 295222, 303516, 312775, 326574, 329842, 335025, 338684, 349940, 351754, 353891, 340507, 323519, 303609, 280789, 276244, 283583, 291917, 293836, 293126, 298846, 292643, 285148, 281046, 273734, 252005, 238569, 223405, 203158, 196061, 197209, 197134, 196979, 196589, 203376, 212297, 213110]
12570B13110K756l266q057J797K069K404J4N891R480R370L600O144O593N49q512
12555B43942m705l980j129n331O112K841R48K558j1264q330j978l851o074j0592
12541A99167j2854j1482n613o07O407r527r125j615k30K147j0616k1225j2641
12528A12186n648j327p885n930m311K767n042p640n122k837q185o874p849p080
12514C9223J570N178J830j601m440l465p491o678J132Q676J298n423M589J0805
12500D5203M371j2053r660J511L334k959k704J585K566L971K915P431R987P223
12486F2721M554P836L561n446o345l627n901r234o173N343Q649R443O199O417
12472G7997P020l612m619o009p147l862p225r377p270j834k295m392N85L259J3400
$$ y = [213110, 215866, 212600, 204543, 206340, 208409, 210813, 210827, 216718, 226198, 235568, 239168, 245312, 251905, 252454, 243942, 239237, 235257, 234128, 228797, 234909, 237750, 238698, 241256, 229992, 221662, 219684, 215833, 209759, 199167, 186313, 174831, 169218, 168611, 175018, 165491, 156366, 154751, 154521, 156668, 146052, 124827, 112186, 106538, 105211, 97326, 91396, 87085, 89852, 84810, 77170, 72048, 69211, 61026, 54152, 46303, 39223, 40793, 45971, 47801, 46200, 41760, 38295, 30804, 24126, 25258, 33934, 35232, 29809, 34398, 45203, 49574, 37521, 27861, 29372, 32706, 29747, 27043, 28628, 31194, 35165, 38080, 45511, 55498, 62721, 67275, 75111, 78672, 73226, 66881, 63254, 57353, 48119, 41946, 47289, 55938, 65381, 71580, 77997, 85017, 81405, 76786, 70777, 63630, 59768, 52543, 43166, 35896, 34062, 31767, 27375, 27960, 31219, 44619]
12457D4619J2543Q220k29l947m700K609q32j370n494Q31j775K757j02l297l070
12442D6763k843N187L546p619j798M771J0153M063l911o330l515K651J323n126
12428D7315L444N648l861k343p651l087m245q691N153J245n643l234J75N170O057
12413C5452m735L370M005k30k425J896N202l65N823m71k929o458p138l435j571
12398B5991k569K203K615J182N993O466r26n733l241q591n120m28m311J056J274
12383A5861k3M995Q545M44N543O55n341j27l865q66l55L389M105l789k117p49
12367B6305m791m130p78k981m148l839n200Q402J033l509N401J071K387K68q705
12352F786k736P242N341O032N180N407J3386J3859L514j639m663j347l065m248
$$ y = [44619, 57162, 65382, 65153, 61206, 56506, 59115, 58283, 56913, 51419, 52250, 50475, 53232, 53130, 49833, 46763, 43920, 49107, 52653, 45034, 43236, 48007, 58160, 62223, 58312, 51982, 48467, 51118, 52441, 47315, 50759, 56407, 52546, 50203, 42552, 39465, 35220, 26529, 31682, 32927, 27284, 24050, 24225, 29395, 35452, 30717, 34087, 38092, 37862, 35437, 37333, 42535, 42170, 47993, 47522, 44593, 38135, 30997, 27562, 25991, 23422, 25625, 28240, 29422, 35415, 41881, 40955, 35222, 31981, 23390, 18270, 17842, 13531, 14587, 15861, 15838, 20833, 29378, 29822, 35365, 36020, 30679, 30552, 26687, 25821, 25466, 28855, 32960, 29171, 27054, 26305, 21514, 17384, 16606, 13625, 9477, 5638, 438, 8840, 9873, 6364, 11765, 12836, 15223, 15491, 6786, 4050, 11292, 16633, 22665, 27845, 33252, 46638, 60497, 64011, 62372, 57709, 56362, 53297, 49049]
12338D9049n98P076J9275J8329J0034J3112J9638J4162J1822J8542J3520K2938
12326B16899N5597Q3839J25870K17142L27568L58476K25597J22937J13929R9937
12316A947791M6767j72926m48650m24187k65940j55179r8921o3948m4633k8391
12306B91783k4918k0608k2058j5082j3523j2923j1504j2071p505m326j0735j2407
12294A24123n350p724m138L246J83j0067n140j180p709p83k000k46k917o049J35
12279G4384j873m789k204l733j301j636m857K195P078K114r067l500N566P3o416
12264E2034j689r524l249K989J014J449J079l608m266l879J905k074n09m430N57
12249B7799l926n350j2P106R465K592r931n000j553J906j507J505K022k276m023
$$ y = [49049, 48451, 55527, 74802, 93131, 103165, 116277, 135915, 150077, 161899, 180441, 193961, 216899, 272496, 356335, 482205, 699347, 1026915, 1385391, 1610988, 1733925, 1847854, 1947791, 1994558, 1821632, 1372982, 948795, 682855, 527676, 428755, 364807, 320174, 291783, 266865, 246257, 224199, 209117, 195594, 182671, 171167, 159096, 151591, 147265, 136530, 124123, 118773, 111049, 106911, 110157, 110340, 100273, 95133, 93953, 86244, 85461, 83461, 83215, 80298, 74249, 74384, 72511, 67722, 65518, 61785, 60484, 58848, 53991, 56186, 63264, 65378, 56311, 52811, 58377, 58450, 52034, 50345, 40821, 37572, 40561, 41575, 43024, 44103, 40495, 36229, 32350, 34255, 32181, 31672, 27242, 27799, 23873, 18523, 18511, 25617, 35082, 37674, 27743, 22743, 21190, 23096, 21589, 23094, 25116, 22840, 18817]
12234A8817k515J956L081K412J142o873n831j272l605n147N475K404m388L114
12220H770q45r85m396O886L088O404L88l34K721R79L234M526j381p379m088M274
12204B1862k048m637m416n614N066L705m046n512r89o567m882K799K958N835R91
12189D505j856q001k939O512k143J660K840J086Q46l293n510J119Q743k120J542
12174B991J011K470K595m585n198j850p83M041L202N350l085m474P609J924p415
12159C803k537l984l1L339o66J837M14L288P337j673j602O497N653L39o608m544
12143A0862J913o26j014q234m030J0243L464m398L572P036K56o53n165j488L89
12128A2127O233o098n268j039J783K815o655k744K021K377m570j57l255m934l137
$$ y = [18817, 16302, 18258, 21339, 23751, 24893, 18020, 12189, 10917, 7312, 2165, 7640, 10044, 5656, 8770, 7925, 6940, 2544, 9430, 12518, 18922, 19310, 18976, 21697, 22676, 25910, 30436, 29055, 21676, 17588, 21862, 19814, 15177, 10761, 5147, 10213, 13918, 9872, 4360, 3371, -3196, -8078, -5279, -2321, 3514, 4505, 2649, -5352, -8291, -1779, -3922, -2262, 578, 1664, 2510, -783, -6293, -5174, 3569, 1449, 2991, 4002, 6472, 9067, 4482, -716, -2566, -3349, 692, 3894, 9244, 6159, 1685, 9294, 11218, 3803, 1266, -2718, -2749, 590, -76, 1761, 2175, 5463, 12800, 11127, 9525, 16022, 21675, 22014, 15406, 10862, 12775, 12149, 11135, 2901, -1129, 9114, 12578, 8180, 11752, 18788, 19044, 18391, 13226, 11738, 12127, 18360, 12262, 6994, 5955, 7738, 10553, 3898, 1154, 3175, 5552, 982, 825, -2430, -7364, -10501]
12113a0501k525O843M182K720j169O741k805l545l629J879J607P330J263r12m929
12098B550j245o03O346N214J316n439m482j484l348M279l315o056K118L647l112
12083c614J355m309p961k325Q319J4024M401L310n418l216l165N164j971o767
12069b173k434Q59K330N255Q417Q209j565q81p401l610J735k211J927P09RJ000
12053A0175L168q606j0597m20j933N525O651l878m09J669j796K228J423j892L71
12038A679j215L973j351j813J179J15M447J474j420N542n191o380r14k169n61
12023b605o75J986J705K995m525L079M503q21n447l287K410K191j670r1N020n411
12007f43J181N150M945p957m679K948n365j570J1834O963l879O148m922j0244
$$ y = [-10501, -13026, -6183, -2001, 719, -450, 6291, 3486, -59, -3688, -1809, -202, 7128, 8391, 7479, 2550, 1305, 702, 7048, 12262, 13578, 8139, 3657, 2173, -1175, 3104, -211, -6267, -4149, -502, -3614, -2259, -6568, -14529, -16854, -8535, 5489, 9890, 13200, 7782, 4566, 1401, 6565, 4594, -2173, -4607, -3748, -1418, 3837, 12254, 20463, 18898, 18017, 10616, 7006, 8741, 6530, 8457, 9166, 9175, 10175, 13343, 4737, -5860, -6280, -8213, -2688, 3963, 85, -324, 1345, -451, 1777, 3200, 1308, 1679, 464, 4437, 3086, 1273, 2452, 2567, 7014, 8488, 7068, 12610, 7419, 1039, 125, -2044, -2605, -3280, -1294, 411, 3406, -1119, 1960, 6463, 5642, 195, -3092, -682, 1509, -161, -252, 4768, -643, 538, 5688, 10633, 2676, -2003, 945, -4420, -5990, 5844, 12807, 8928, 15076, 10154, -90]
11993i0P96L912p50K83l054j498l674m083q19R561J402k145j080J190L752j436
11977B267r60l284L522l155J068R827M334q663l51k627k872k667P415N450r71
11962H333l927j010O073J717l952k29r090n514K648L191J209o185P3J026Q35n097
11946i899r93J2167J879k220j852l586l975m664L229K712J769K772j605n790K383
11931g673R892p25l201K142J707L174O258k943J525j162k911m608q655j709N430
11916c459K351m60l266k806l96N228Q63K54M783J003k372l872l2j387J660R13
11900i95l958j283L530J296R8o553P97M710K857N342L556l893o945K006m081J3
11884c503J008K797K643l943l347M117j443m313N708P051J473l5k206q135n005
$$ y = [-90, 706, 4618, 3868, 4151, 1097, -401, -4075, -8158, -8977, 584, 1986, -159, -1239, -49, 3703, 2267, 1307, -1977, 1545, -1610, -542, 9285, 13619, 4956, 4605, 1978, -894, -3561, 3854, 9304, 8333, 4406, 3396, 9469, 11186, 7234, 7005, -2085, -7599, -4951, -1760, -551, -6736, -6663, -5637, -4802, -9899, -10892, 1275, 3154, 934, -918, -4504, -8479, -13143, -9914, -7202, -5433, -2661, -4266, -10056, -7673, 2219, 1494, -1707, 435, 2142, 5316, 11574, 8631, 10156, 8994, 6083, 1475, -7180, -8889, -3459, -1108, -1568, -4834, -7640, -8036, -2808, -1945, -1691, 3092, 4095, 1723, -2149, -2181, -3568, -1908, -995, -4953, -6236, -2706, -1410, -1312, -7865, -7068, -2358, 499, 5841, 9397, 5504, -1441, 565, -3516, -3503, -2495, 302, 2945, -998, -4345, -228, -1671, -5984, -276, 6775, 8248, 8213, 6007, -2128, -7133]
11869g133J098K62N471J716N93J835k130k543m757L600m616n193O152J549M91
11854c605n033O095Q187j703o12P378M194l517k804q819j109K372L035l277Q353
11839I135K471k495M535q17p221J860j533p472M98N97p471m820J528O39O284j390
11823e672q143l484N316P482N470J45O439J556k047J014l783k029k929p6K279
11808A538n058K23M222m084m47M327L114q466k275J736q48K418j615k519k532
11793a0266M746K822P14M698k503K007k323O678J0359j814q799p539o819k972
11779a1011L230L117k009o78K713N398M183k645m750K801j139m753k700O747N466
11764C970N480j949j246k973j581j598N25L559J623L27m679M427J301q660r988
$$ y = [-7133, -6035, -5773, -302, 1414, 2007, 3842, 1712, -831, -5588, -1988, -6604, -11797, -5645, -4096, -3605, -8638, -2543, 5644, 3941, 3329, 10707, 14901, 11384, 8580, -239, -1348, 1024, 4059, 782, 9135, 11606, 9111, 13646, 12829, 5608, 7468, 5935, -1537, -1039, -442, -7913, -12733, -11205, -10566, -4282, -5672, -13815, -17299, -11983, -4501, 969, 1114, 7553, 9109, 7062, 8076, 4293, 2264, -665, -741, 1538, -3520, -3297, 925, -3159, -3606, 721, 3835, -4631, -6906, -5170, -6018, -3600, -5215, -7734, -10266, -5520, -2698, -1984, 2714, 211, 2218, -105, 6573, 16932, 15118, 6319, -1220, -8039, -11011, -7781, -4664, -6673, -7351, -4638, 760, 4943, 2298, -2452, 349, -790, -5543, -8243, -1496, 3970, 9450, 7501, 6255, 3282, 1701, 103, 628, 4187, 5810, 6137, 1458, 5885, 7186, -1474, -11462]
11749a1462K994O048J884k795N154j854l904j743j664J920J067l42J810J521m550
11734e916N356N660K323L520m508J532m431L360k351J334L95o69P4k615L132N231
11718A1427k191p640k528m10n0Q608J753K273n993j1697J392O122j462L638O238
11703I480m880j3681Q35L593N470L398l566K570J085O58M553k889o614P61J6M515
11687E304j991j265k84k998n381K967N914j216M998K325j866p282k530L165J451
11672A311m691m032L147J461j66J755J872l854n995l038L976j487P034j403L822
11657b88M801L304m658l467J897k504l939n378J043N292O077k834n632M026O134
11642C874q65n19j971L338j25k948R989J025m481p052j716J849k421J073l9j945
$$ y = [-11462, -8468, -2420, -536, -3331, 1823, -31, -3935, -5678, -7342, -5422, -4355, -4697, -2887, -1366, -5916, -560, 5100, 7423, 10943, 6435, 7967, 3536, 6896, 4545, 5879, 6274, 5605, 5679, 3064, 6196, 11427, 9236, 1596, -932, -1342, -1392, 7216, 8969, 11242, 5249, -6448, -5056, 1066, -396, 3242, 9480, 4600, -9081, -8246, -4653, 817, 4215, 649, 3219, 4304, 4962, 9515, 6626, 12, 773, 789, 5304, 3313, 2048, 1764, -1234, -6615, -3648, 2266, 1050, 6048, 8373, 6507, -775, -3305, -140, 1311, -3380, -7412, -4265, -2804, -2970, -1215, 657, -3197, -9192, -12230, -8254, -9741, -2707, -4110, -288, 4513, 7817, 3159, -308, 1589, -915, -4854, -10232, -9189, -3897, 2180, -654, -6286, -2260, 3874, 3009, 2490, 519, 3857, 3732, 784, 10773, 11798, 7317, 265, -1451, 398, -2023, -950, -989, -2934]
11626b934L589J577M626l883o393k168M568L72M79O761K589j66K961k107j905
11611G966j960m549j82K63K796L46m578j076L330O564O434L35m380p768%q46m869
11594b174j801K444J397L85j07j568k267j80P16N401j25n538M656J882k468L019
11578C672O124j493l508K44N757L72p008o42p995m394m38J361N861M299L809P19
11562F740q591j371J696r41J636o469j920l406M421Q466M105j785Q59l426M871
11547D885j294k696k424j905k72L749N131J654o286J395k555p636L175Q544K708
11532F173j0863J244m61k802K058K429n13O04M741K068k523l681J837J140m683
11517c232j084l507L566L239N53k751J290L65m558j010o208J39J0842k470j771
$$ y = [-2934, 655, 2232, 6858, 2975, -3418, -5586, -1018, -646, -167, 6594, 9183, 9017, 11978, 9871, 7966, 6006, 1457, 1275, 1538, 4334, 4680, 102, -974, 2356, 8920, 15354, 15689, 11309, 3541, 3541, 2695, -2174, -3975, -1531, -134, 251, 144, -1424, -3691, -3871, -3155, 2246, 2121, -3417, 1239, 3121, 653, 3672, 9796, 8303, 4795, 5039, 10796, 11168, 4160, 3518, -4477, -8871, -9309, -7948, -2087, 2212, 6021, 6740, -1851, -3222, -1526, -2467, -831, -7300, -9220, -12626, -8205, 261, 4366, 2581, 3440, 14, 4885, 3591, 895, -1529, -3434, -3706, 43, 5174, 6828, 542, 1937, -618, -8254, -5079, 3465, 6173, -4690, -3446, -3907, -6709, -4651, -2222, -2735, -2131, 2610, 4678, 2155, -1526, 311, 1451, -3232, -4316, -7823, -4257, -1018, -465, -3216, -1926, -1561, -6119, -7129, -13337, -13198, -2356, -4826, -6597]
11502f597N380j485r832j135P324L429j127k55r58L354L873k350j719l148N528
11487B82k49m690j322k872L105J0322N991m605m149m706m128J070L953l027M607
11472d18L566l901k056J271l627J782j744j515k962n19L556Q185R925K592l106
11457A1029l324m877n288k411J742k716L038j59P290P077O311j543l005k010j896
11442I258l605j728K391K02K758o045k097n19j996o343J945M754L841o743j469
11427e396M512N307l37l648N44M34k822N691q064k523L135P197J626k661L29j247
11411B077J085P94M18N818K916n231L106K800k364l487n968L053l118q832L259
11396c674J044K246j174r42k136m023J771P928J684m653m201k799N760K535n695
$$ y = [-6597, -1217, -2702, -12534, -13669, -6345, -2916, -4043, -4298, -5256, -1902, 1971, -379, -2098, -5246, 282, 33, -4657, -5979, -8851, -5746, 4576, 10567, 5962, 1813, -2893, -7021, -5951, -1998, -5025, -418, 3148, -753, -2809, -1538, -5165, -3383, -5127, -6642, -9604, -10123, -6567, 1618, 11543, 14135, 11029, 7705, 2828, -2460, -4871, -3129, -5845, -2807, -2966, 4324, 11401, 17712, 16169, 13164, 11154, 9258, 5653, 3925, 6316, 6518, 9276, 3231, 1134, 615, -1381, -7724, -5779, -1025, 2816, -3927, -5396, -884, 4423, 4086, 438, 982, 1416, -1406, 4285, -3779, -6302, -3167, 4030, 5656, 2995, 3324, 2077, 3162, 3956, 4374, 10192, 13108, 7877, 10983, 13783, 11419, 7932, 1964, 5017, 1899, -6933, -3674, -2630, -384, -1558, -2500, -4636, -8659, -6888, 1040, 2724, -1929, -6130, -8929, -3169, -634, -6329]
11381f329j529L347l297O062l369j496N661J695O752K853j019m244o910K716o78
11366B15j201j421L383J209N174j068K700J797M294p14n521p101K366K85p952
11351c555q34l365L174O324K462k745k865Q40m253r247k137J9131J1460l425l968
11336F997k008k446j531L015L476N93q26q315m44L529m79m244r789k792j160R89
11320a5435O905Q111J696N159r37l163j835L96N64n994l524n64J65L696R512M262
11304I014l693m051N245M192l046k146j210l090L924Q757m625n157j298M831O023
11289A3670l139r980J937R9k70N412J607j468R297m645j3391K488P565k077j634
11274E471q87J066L306k971R42k44r946o873J552O123N122l590m239j024l42Q14
$$ y = [-6329, -7858, -4511, -7808, -1746, -5115, -6611, -950, 745, 7497, 10350, 9331, 5087, -1823, 893, 215, -986, -2407, 976, 2185, 7359, 6291, 8991, 10788, 15082, 14368, 8847, 1746, 4112, 4397, -3555, -4389, -7754, -4580, 1744, 4206, 1461, -1404, -564, -4817, -14064, -16201, 2930, 14390, 10965, 6997, 4989, 2543, 1012, 4027, 7503, 8096, 7270, -1045, -1489, 2040, 1561, -2683, -12472, -15264, -16424, -15435, -8530, -419, 1277, 6436, 5499, 2336, 501, 897, 1461, -4533, -8057, -8621, -8456, -4760, 4752, 9014, 5321, 1270, 6515, 10707, 7661, 5515, 4305, 1215, 5139, 13896, 9271, 4114, 2816, 7647, 13670, 10531, 551, 2488, 2587, 2317, 7729, 9336, 7868, 17165, 12520, -871, 1617, 9182, 7105, 5471, 4584, 5650, 8956, 5985, 6927, 6683, -3263, -10136, -8584, -2461, 2661, -929, -5168, -6192, -6534, -5720]
11258e720O011M209q75k842k880P75K579P993N570k09l784n290L268J596o563
11243C838q998n774L541N587N219q54q603J083J1635M718m999j139K110n816k089
11228e41j464q99l865k78L059R702J747q928j289m694p907N988L727L962M813
11213C133j070J743L02j891l347J345J774L175J236J87R177k388o915M403J0361
11198B1225o003m563M171m607n911j324k594M765J589K941J179k712n464l068
11184c76j298O0n71j644J442O20L624R32J854j252r61r96m07K798l048n068J594
11167b697n66O134L985Q836L073m369n431J850J604J074l50L196L915J384m633
11152A7005j309l988K150k130n55J400q47L028L03M50r91J008l474Q61N681p42
$$ y = [-5720, 291, 4500, 3625, 783, -2097, -1322, 1257, 9250, 14820, 14611, 10827, 5537, 8805, 10401, 3838, -5160, -10934, -7393, -1806, 3413, 2559, -6044, -4961, 6674, 11392, 6393, 5254, 7364, 1548, -541, -2005, -2904, -6769, -7047, -3988, 5714, 7461, -1467, -2756, -7450, -15357, -9369, -5642, -1680, 3133, 2063, 3806, 4108, 2217, -1130, 215, 1989, 5164, 6400, 6587, 15764, 13376, 6461, 10864, 21225, 15222, 10659, 14830, 10223, 4312, 2988, 394, 5159, 6748, 9689, 10868, 8156, 2692, -376, -1674, -1614, -2185, -3829, -2387, -1767, 1857, 2789, 4643, 3391, 2430, 1434, 1027, 3825, 777, -4291, -2697, -3263, 2871, 6856, 15692, 18765, 14396, 8965, 10815, 12419, 13493, 13143, 16339, 20254, 21638, 17005, 15696, 11708, 13858, 11728, 11173, 12573, 11726, 14754, 15057, 15507, 14516, 15524, 12050, 12911, 18592, 17850]
11136A7850n273j756J060J140L686k793j152K98m884k988O453j293J09n063l182
11121B212n261M083m2K789M677M51K508Q778p097j219N305N081j297k417l807
11106A4744L623K326r88o142J710L77J489L845J524j57l266L087k907o153q603
11091D509N239L066K875K485j528k804J533N358K440l839N121J0450L745j2287
11077B6363n638k538L534k503Q38L599O207N13k028r220j485M723K997j822l629
11062A9911J766K284j084K202o163l072j753J864M459p3l655K62l34k476k096
11047A2042m623k968m333L347K814Q109l315m852P87K452m64k271J777O3K41L226
11031A2032q334P29Q66o619L036O656O909J661k380k480Q438J705j226J246J387
$$ y = [17850, 12577, 10821, 11881, 13021, 16707, 13914, 12762, 13060, 8176, 5188, 11641, 10348, 10457, 5394, 2212, -3049, 1034, 992, 3781, 8458, 8909, 11417, 20195, 13098, 11879, 17184, 22265, 20968, 18551, 14744, 18367, 20693, 19705, 13563, 15273, 15650, 17139, 20984, 22508, 22351, 19085, 22172, 19265, 13112, 4509, 9748, 12814, 15689, 18174, 16646, 13842, 15375, 20733, 23173, 19334, 24455, 34905, 38650, 26363, 20725, 18187, 21721, 19218, 20056, 23655, 29862, 30375, 28347, 19127, 17642, 22365, 25362, 23540, 19911, 21677, 23961, 22877, 25079, 18916, 15844, 14091, 15955, 20414, 20341, 16686, 16948, 16614, 14138, 12042, 7419, 4451, 118, 3465, 6279, 14388, 11073, 6221, 7008, 9460, 8996, 6725, 8502, 8565, 8806, 12032, 3698, 4427, 5293, -1326, 1710, 8366, 15275, 16936, 14556, 12076, 20514, 22219, 20993, 22239, 23626]
11016B3626N644J138q961m250N42J877l997l21P46j844J213k019K676L019Q39
11001A9928l17J65j364K63R77L093j240q876n869K273P181P68K422K328n328n087
10985A1317m612J2110K148k538j289q639L367N497M654K27o740n985l32j894o848
10970D43L922O281J1517O232j0202p759N356k66L36J178q51k894Q95P947L020
10955B5155J964q815J590O551m924o34l44k647J980k693j197m669K238J1379Q644
10940C3578K684k71p777j0024m010L089J490j0681m800O403O593m944J709N687
10926A8726N674J138K99M544K63l060n139j853J921k161P46n015j353N258J464
10911B1452q5k463o044n43n67J707p40l31O6N205N730j735P991M975L7l368q12
$$ y = [23626, 29270, 30408, 21447, 17197, 17739, 19616, 15619, 15298, 16044, 14200, 15413, 13394, 16070, 19089, 19928, 19611, 19776, 18412, 18675, 19652, 22745, 21505, 12629, 6760, 9033, 16214, 16982, 19404, 21732, 16404, 11317, 6705, 18815, 20963, 18425, 17136, 8497, 11864, 17361, 22015, 22242, 15502, 9517, 9185, 7291, 443, 4365, 10646, 22163, 28395, 18193, 10434, 15790, 15524, 15860, 17038, 16187, 13293, 14188, 22135, 25155, 27119, 18304, 19894, 26445, 21521, 20887, 20543, 17896, 19876, 17183, 15986, 11317, 13555, 24934, 33578, 36262, 35991, 28214, 18190, 14180, 17269, 18759, 8078, 3278, 9681, 16274, 11330, 13039, 18726, 24400, 25538, 25837, 30381, 30644, 27584, 22445, 20592, 22513, 20352, 21098, 16083, 14730, 19988, 21452, 21367, 18904, 12860, 12317, 11750, 13457, 12717, 12386, 12452, 17657, 23387, 21652, 29643, 34618, 34655, 31287, 30475]
10894C0475K463j431o165L521J082o16j390J693L89J827k296m941j1768m58L902
10879A6287ol994L466O731Q062L770l298o423q532l502O352M976K643J999P49
10864B9280L175K088l736n48q17l073n734l256j1797r651L536K600L189l773K765
10849D248M972k350o418O73J774l4K648M423J994m977K54P208N293k385L969L587
10833B4879l458Q835Q218J661M086N446o060J157P554k031J181N73N435J1521
10819F8997O731J640l077P47O163O793O536O769J3422J8961J7752J9212K5514
10806A96160M4645O3732P8097J01255J29183J54962J50444J35801J23460J27313
10796A305052J10311O6091N76n0733p2812r5517j33774j55887j52980j24500j11765
$$ y = [30475, 32938, 31507, 25342, 28863, 29945, 29329, 27939, 29632, 30021, 31848, 29552, 24611, 12843, 12385, 16287, 16281, 12287, 15753, 22484, 30546, 34316, 31018, 24595, 16063, 12561, 18913, 23889, 26532, 28531, 29280, 32455, 34543, 30807, 30259, 29442, 26369, 20635, 17379, 5582, -4069, -533, 2067, 5256, 1483, 4248, 9220, 6870, 452, 1125, 2899, 2865, 5513, 9936, 11930, 6953, 7207, 14415, 19708, 17323, 21292, 24879, 21421, 30256, 38474, 40135, 44221, 49667, 43607, 44764, 52318, 50287, 51468, 52041, 57476, 68997, 75728, 77368, 74291, 75038, 81201, 87994, 94530, 101299, 114721, 133682, 151434, 170646, 196160, 240805, 304537, 382634, 483889, 613072, 768034, 918478, 1054279, 1177739, 1305052, 1415363, 1481454, 1482030, 1431297, 1358485, 1262968, 1129194, 973307, 820327, 695827, 584062]
10785E84062j04166q1746n4684m1093l0398j7840r468j0644j3874j460m717k3202
10773A90770j3972J360m900p801n900j2061k318j0109o448m915m662j0041q388
10760A00615j11k771q858q106l485O14o904o873L840L920k325k018M82m928k664
10745F0428l231k524L245J810O327Q2j182o037m136O221J363q36L422j511J1629
10730G5070J6604K0247J9729J8053K0937K4120J5839J2609M659m741o666j7276
10718A99184k5179k4092k1419j6551k3536j8873r000m051p60m87k325M82o552
10705D6841n67K163j0848p781m439k989O029R431l592Q27L660R065N366R549L724
10690F6439K600J298L495P548K974K501q61l626o934K483J322k775L051K191O768
$$ y = [584062, 479896, 398150, 343466, 302373, 271975, 254135, 244667, 234023, 220149, 218689, 213972, 190770, 176798, 178158, 173258, 165457, 159557, 147496, 145178, 135069, 128621, 123706, 119044, 109003, 100615, 100504, 97733, 88875, 80769, 77284, 77898, 70994, 64121, 67961, 71881, 69556, 67538, 68020, 63092, 60428, 57197, 54673, 57918, 59728, 66055, 66137, 64955, 58918, 54782, 61003, 62366, 61530, 64952, 63441, 75070, 91674, 111921, 131650, 149703, 170640, 194760, 210599, 223208, 227867, 223126, 216460, 199184, 174005, 149913, 128494, 111943, 88407, 69534, 60534, 56483, 55723, 55236, 52911, 53393, 46841, 46274, 48437, 37589, 29808, 25369, 22380, 28409, 37840, 34248, 35075, 38735, 47800, 53166, 62715, 66439, 69039, 70337, 73832, 81380, 84354, 86855, 85994, 82368, 75434, 77917, 79239, 76464, 79515, 81706, 88474]
10675H8474M952k196L507n101L712q82l376l040P62L875j240L354M361N598N070
10660A07830J2509J1770J2632J5545J0872P550M282J5325Q701N621N678J369l52
10647B19332l963l202K953r447j8096j5967j1283j2700j1339j1910o830q721n507
10634A03320p105j532L660L429m612m441K326l933j1158m729K498q91J893L716
10620H2441L294N936O63N431N319J480j685m848n876L483K077M48M152k171l24
10605I9820M404n85q75m547r620q339n542L506P905l582r250R1k11n849q118n619
10589E3589l443j651J391m283l258p353m328O315Q263Q423Q473O844O455R410
10575H4847J1166k586k385l081k770O015O589K031Q825P997r979n602J391J0355
$$ y = [88474, 93426, 91230, 94737, 89636, 93348, 92466, 89090, 86050, 86812, 90687, 89447, 92801, 97162, 102760, 107830, 120339, 132109, 144741, 160286, 171158, 178708, 182990, 198315, 207016, 212637, 218315, 219684, 219332, 215369, 212167, 215120, 205673, 187577, 171610, 160327, 147627, 136288, 124378, 117548, 108827, 103320, 96215, 94683, 98343, 101772, 97160, 92719, 95045, 91112, 79954, 75225, 77723, 76832, 78725, 82441, 85735, 91671, 92334, 97765, 103084, 104564, 102879, 98031, 92155, 95638, 97715, 98163, 102315, 100144, 99820, 104224, 103639, 102764, 98217, 88597, 80258, 74716, 78222, 86127, 82545, 73295, 73386, 73175, 67326, 59208, 53589, 50146, 48495, 49886, 45603, 42345, 34992, 30664, 36979, 45242, 53665, 62138, 68982, 75437, 84847, 96013, 93427, 91042, 87961, 85191, 91206, 97795, 99826, 108651, 116648, 106669, 101067, 102458, 112813]
10561A12813O858J0403L748j766l733M434L064P50J045k933k180m418o167j134
10547A20784O160M935Q78J653l650n924n882j049O324R09N017L058J248J542J923
10532A37926L453N878K0517J9492J5111L1080M3968L9239L5152L8977O6309N8916
10520E16018K3959Q533K0496J8583m62j1223j2731r367k616j9544j2619p273M800
10507E16554k77K221R686R689J1705Q763Q040Q710R250L248K746L754K82N365
10493E99736M543O172O829M16K694M295O306J060k012Q799Q152J3517n512R8M838
10478F59931N353J3439R642L853M112N032O766P017Q523J1753O728K018J3746
10465G57913J5998K1292K7992K0402K1961L1567L3824L2075L2924K4293L0017
$$ y = [112813, 119671, 130074, 133822, 132056, 128323, 132757, 135821, 136571, 137616, 134683, 132503, 128085, 121918, 120784, 126944, 131879, 132757, 134410, 130760, 124836, 118954, 117905, 124229, 125138, 130155, 133213, 134461, 136003, 137926, 141379, 147257, 167774, 187266, 202377, 233457, 277425, 316664, 351816, 390793, 457102, 516018, 539977, 548510, 569006, 587589, 587127, 575904, 563173, 553806, 551190, 531646, 519027, 511754, 516554, 516277, 518498, 528184, 537873, 549578, 558341, 566381, 575091, 584341, 587589, 590335, 594089, 594371, 599736, 604279, 610451, 617280, 617696, 620390, 624685, 630991, 632051, 630039, 638838, 646990, 660507, 654995, 655093, 659931, 665284, 678723, 688365, 692218, 696330, 701362, 708128, 715145, 723668, 735421, 742149, 744167, 757913, 773911, 795203, 823195, 843597, 865558, 897125, 930949, 963024, 995948, 1020241, 1050258]
10454A050258K7359K1995J8774J7676L0660K4325J4431J3029J5213K6541K4337
10443A284598K3948K7410M1947M4234O0935O6810O6821P4689R2050J00215J07459
10432A991116J12175J38955J62123J90464K12313K37096K97131L67848M47245
10423D156466N35334O33203P47412Q59609R72328J066891J170821J268382J375358
10414A2785804J520728J732326K070698K620626L544606N124004P601823J0713548
10406D7714163J3456567J5893090J9568700K4865748K8996397K7867622K3635175
10399B01997462K1398920K0168203J5532461O085591n487214j2241602j4967819
10392B32486002j9654384k6020283k7861948k4969855k1274294j9691726j7176258
$$ y = [1050258, 1077617, 1099612, 1118386, 1136062, 1166722, 1191047, 1205478, 1218507, 1233720, 1260261, 1284598, 1308546, 1335956, 1377903, 1422137, 1483072, 1549882, 1616703, 1691392, 1783442, 1883657, 1991116, 2103291, 2242246, 2404369, 2594833, 2807146, 3044242, 3341373, 3709221, 4156466, 4691800, 5325003, 6072415, 6932024, 7904352, 8971243, 10142064, 11410446, 12785804, 14306532, 16038858, 18109556, 20730182, 24274788, 29398792, 37000615, 47714163, 61170730, 77063820, 96632520, 121498268, 150494665, 178362287, 201997462, 223396382, 243564585, 259097046, 265182637, 259695423, 247453821, 232486002, 212831618, 186811335, 158949387, 133979532, 112705238, 93013512, 75837254]
10385G5837254j2650710q629900o016985m402646l438927k858934k486618k208480
10377C3144054j994830j853245j760609j664120j535307j407669j297064j180617
10369B0450593j068022r65991q87158q20891p47042o94934o45993o08819n86341
10360A3425402n46833n10311m76667m56856m37499m11975l83808l64591l52261
10351I484601l33548l32200l24493l08502k96530k90349k71697k59572k46938
10342F820772k29047k15798k02842j94623j72240j60280j58036j34853j24501
10333E228552j23948j20675j17862j10820j11404j23437j24659j25499j23141
10324D147107j30235j21528j17053j08164j06245j16082j12367j02457r2539r9852
$$ y = [75837254, 63186544, 54556644, 48539659, 44137013, 40698086, 37839152, 35352534, 33144054, 31149224, 29295979, 27535370, 25871250, 24335943, 22928274, 21631210, 20450593, 19382571, 18416580, 17529422, 16708531, 15961489, 15266555, 14620562, 14011743, 13425402, 12878569, 12368258, 11891591, 11434735, 10997236, 10585261, 10201453, 9836862, 9484601, 9151053, 8818853, 8494360, 8185858, 7889328, 7598979, 7327282, 7067710, 6820772, 6591725, 6375927, 6173085, 5978462, 5806222, 5645942, 5487906, 5353053, 5228552, 5104604, 4983929, 4866067, 4755247, 4643843, 4520406, 4395747, 4270248, 4147107, 4016872, 3895344, 3778291, 3670127, 3563882, 3447800, 3335433, 3232976, 3140437, 3040585]
10314C040585r9148r6527r0557r0132q2278q2065p7871o4263o5990o1529o3672
10303B166553n5162n4514m1681l8609l5686l9674m2848m5422m2402l4342l5757
10292A700456l9007n3574n3723o3017p3694p0697o9541p6585p8039o6608o4972
10281I90999o4209o5965n9624o2706n6288m4123l2213k4732k2939k902M142Q441
10269E67881M247Q208J1215K054j3399j7686q307n133j0102j6613k1324j4667
10257D86374j3353r573j4632o465m330k963o464r681j4223q716L00K599K019m183
10243C96709o529p800o473K582j2120j4595k721m628q683j175J384O707J851P835
10229C52344j433n639N400L621o726m12K03j1021j4904r82l629r216J00k99n377
$$ y = [3040585, 2941437, 2844910, 2754353, 2664221, 2581943, 2499878, 2422007, 2357744, 2291754, 2230225, 2166553, 2111391, 2056877, 2015196, 1976587, 1940901, 1901227, 1858379, 1812957, 1770555, 1736213, 1700456, 1661449, 1607875, 1554152, 1491135, 1417441, 1346744, 1277203, 1200618, 1122579, 1055971, 990999, 926790, 860825, 801201, 738495, 682207, 638084, 605871, 581139, 558200, 555298, 559440, 567881, 572128, 580336, 591551, 593605, 580206, 562520, 554213, 549080, 538978, 522365, 501041, 486374, 473021, 463448, 448816, 442351, 438021, 435058, 428594, 418913, 404690, 395974, 396274, 398873, 400892, 396709, 390180, 382380, 375907, 378489, 366369, 351774, 349053, 344425, 335742, 334567, 335951, 342658, 344509, 352344, 350911, 345272, 350672, 354293, 347567, 347155, 347358, 336337, 321433, 320451, 316822, 307606, 307706, 307407, 302030]
10214C02030N967R621L470P209M135K378J110N953K198r561q782j1084l719o557
10200C04368o732L058r458p452n973j0559j1245q292L175n351j1080r910p892
10187B16657R05m912p219l100o23L406M422M882k761m427j635N329K118j050M854
10172B16846P128O639N404K449K664K164j810n85N007J631K358L747l32j2778
10158B40532p544K130k984j1275n537K308p24p677n643o661r013m701Q01p226
10144A76786r584r719r224m519m676r048l540J122q235m375l30o247q723l274
10130I6414j3255j2359m474j056r08m404k168j587n227o344l135j424L732k255
10116D1550m922L732L87j651o92N630K463R97o479r415k971J1826M445m573j975
$$ y = [302030, 307997, 317618, 321088, 328297, 332432, 334810, 335920, 341873, 344071, 334510, 325728, 314644, 310925, 304368, 297636, 300694, 291236, 283784, 277811, 267252, 256007, 247715, 250890, 245539, 234459, 224549, 216657, 217562, 212650, 205431, 202331, 201708, 205114, 209536, 214418, 211657, 207230, 205595, 210924, 213042, 211992, 216846, 223974, 230613, 236017, 238466, 241130, 243294, 241484, 240899, 245906, 247537, 249895, 253642, 253310, 240532, 232988, 235118, 232134, 220859, 215322, 217630, 216906, 209229, 203586, 196925, 187912, 183211, 184012, 176786, 167202, 157483, 148259, 143740, 139064, 130016, 126476, 127598, 119363, 114988, 114658, 108411, 99688, 96414, 83159, 70800, 66326, 65270, 64362, 59958, 57790, 56203, 50976, 44632, 41497, 40073, 43805, 41550, 36628, 40360, 40747, 39096, 38404, 44034, 46497, 47494, 41015, 31600, 28629, 40455, 44900, 40327, 38352]
10101C8352L04K510K302J0301R801K596R63K872N385K48L711J29m030o086q33
10086F8525j740k825L038Q406M615n163n988N67K860n293J3J723q608j625J157
10071E9662L216j0369K4L34J26l979n736J803N08k705P650M390L695O092m410
10056F0301K496L388l699k618J576M990L483j641k728l358K233j146j075M621
10042F6823J548L598K597M677P246J7178K6915K5462M4008P7424Q9567N1390K8071
10029D46504K6776K0119J4540n0177j24359r7471n1471k7704k0231k0525l759
10018A12242R71J627J013L202J748M181M166k055n77Q627R703J2416J9770K7866
10004B04900L5459N1902P6045Q1056R6492J31971J64419J64015J41331J31813
$$ y = [38352, 38656, 41166, 43468, 53769, 63570, 66166, 67129, 70001, 75386, 75634, 79345, 79474, 75444, 69358, 68525, 66785, 63960, 66998, 75404, 80019, 74856, 68868, 69435, 72295, 67002, 67015, 68738, 60130, 58505, 59662, 62878, 52509, 52533, 52867, 52993, 49014, 43278, 45081, 45589, 42884, 50534, 54924, 58619, 64711, 60301, 62797, 66185, 62486, 59868, 61444, 66434, 69917, 68276, 65548, 62190, 64423, 63277, 62202, 66823, 68371, 71969, 74566, 79243, 86489, 103667, 130582, 156044, 200052, 277476, 367043, 418433, 446504, 473280, 493399, 507939, 457762, 333403, 235932, 184461, 156757, 136526, 116001, 112242, 113213, 114840, 115853, 119055, 120803, 124984, 129150, 127095, 126518, 135145, 144848, 157264, 177034, 204900, 240359, 292261, 368306, 449362, 545854, 677825, 842244, 1006259, 1147590, 1279403]
9994A279403J20841R4250M6356k4599p7604r6994j26631j57211j58502j42067
9984G57242j19020j15524r4910o2130m2710k7642k6873j8679j3834r622r519j2071
9972B04708j4727j3460j1162j8292j1262n412K9q665p324J241n12o438P10K616
9958A12050k5l062m341m277q492r02O77M030K096l214o52l322o895k741J393N139
9942H7462r9k803l694o384o074L52p856j1320m86k162O71L143n96O900M294J536
9926F2884j0903j3707l251k885J01M227J138L811L761r230k8M551l855o103j032
9911B9479K488k342m431J296M437K447L626k700q989O888J582J4l325m354J44
9896B6260K811l74n268l623l901J453l51J41J521N434O991o999o065j029j368
$$ y = [1279403, 1400244, 1494494, 1540850, 1516251, 1438647, 1341653, 1215022, 1057811, 899309, 757242, 638222, 522698, 427788, 365658, 322948, 295306, 268433, 249754, 235920, 226298, 216779, 204708, 189981, 176521, 165359, 147067, 135805, 130393, 130422, 121757, 114433, 115674, 115162, 108724, 109434, 112050, 112025, 108963, 104622, 100345, 91853, 90951, 91628, 95658, 97754, 94540, 93888, 90566, 83671, 80930, 82323, 87462, 87363, 84560, 80866, 74482, 68408, 68760, 60904, 49584, 49098, 46936, 47607, 50750, 50154, 57054, 61348, 62884, 51981, 38274, 35023, 32138, 32239, 36466, 37604, 41415, 45176, 35946, 35918, 40469, 36614, 30511, 29479, 31967, 29625, 25194, 26490, 30927, 33374, 37000, 34300, 25311, 32199, 33781, 33795, 30470, 26116, 26260, 29071, 28697, 23429, 19806, 15905, 17358, 17007, 17148, 18669, 24103, 31094, 24095, 18030, 17001, 15633]
9881A5633M368O137r96J47N727K267P88l399l859L184r224K95O006M304k865p901
9865B0612j3518L985J0149K710n153l561o14l642R59J585M868M776m815o658N40
9850A2223M578p31J998j348M154O009n96p252m54k030J770R356n879j023O219
9835B6994KJ53M723l367q48l072n526q222k191k969o142P122Q658L923j009QJ614
9818A9851K751R42l223l241K933J116L405k309q053n123j345J433L215k120L614
9803A3846j699n983K09M348l297n609o35P89P355P090n694k539K564n407K131
9788G469M661m672j954j025J186J171l436J576J706k554q163K78L729L465O190
9773I627N057J150l240J160M575r275k472Q544J1878r40r020p288k731J944R694
$$ y = [15633, 20001, 26138, 25142, 25289, 31016, 33283, 34071, 30672, 26813, 29997, 20773, 21068, 27074, 31378, 28513, 20612, 7094, 11079, 21228, 23938, 18785, 15224, 14610, 10968, 11927, 13512, 18380, 23156, 18341, 11683, 12223, 16801, 16070, 18068, 16720, 20874, 26883, 26287, 19035, 18581, 16551, 18321, 27677, 21798, 20775, 26994, 26996, 27149, 31872, 28505, 27657, 24585, 19059, 10837, 8646, 5677, -465, 6657, 15315, 19238, 18229, 18237, 19851, 22602, 23544, 20321, 17080, 20013, 21129, 24534, 22225, 14172, 9049, 7704, 9137, 12352, 10232, 13846, 12147, 6164, 6373, 10721, 7424, 1815, 1180, 1969, 9324, 16414, 10720, 8181, 10745, 5338, 7469, 12130, 7458, 5504, 4479, 5665, 6836, 3400, 4976, 6682, 4128, -4035, -3757, -28, 3437, 9627, 14684, 15834, 12594, 13754, 18329, 9054, 6582, 15126, 27004, 26064, 17044, 9756, 7025, 8969, 18663]
9758A8663M469j140P13P617K08r910r198l582j541k485P112R577n4k681k644L271
9742A8395L327m781j920j276k940j196n0O534L254k854j904N047j220p708m865
9727E843j05J093M05M332J725j408L002q93m615K459K87m448p280j573P194K023
9711H041n400J104N1R50j439o095J443P386K987O180M464K92r126m214L154q91
9695H887m166j242r7n25j183j125l539Q130K835j131p369j727N608M761J563K429
9679A2109K341n04m192L164K120k037o769J017l965L899J031j102K077o30j0072
9664a513J573L553m63o89K845Q382K207K220l963K770l112k56j502k06L762O78
9648A6286j712l262j202J310Q1m373p020m274J655L793j617k010K285L383L63
$$ y = [18663, 23132, 21992, 22705, 30322, 30530, 20620, 11422, 7840, 6299, 3814, 10926, 20503, 20449, 17768, 15124, 18395, 21722, 16941, 15021, 13745, 10805, 9609, 9559, 16093, 19347, 16493, 14589, 19636, 18416, 10708, 5843, 5738, 6831, 7236, 11568, 13293, 11885, 14887, 13994, 9379, 11838, 12125, 7677, 397, -1176, 6018, 8041, 2641, 3745, 3796, 4746, 3307, -2788, -1345, 6041, 9028, 15208, 19672, 19964, 10838, 6624, 9778, 8887, 4721, 3479, 3382, 2857, 1674, 549, -2990, 5140, 7975, 6844, -525, -2252, 3356, 8117, 9680, 12109, 14450, 13946, 9754, 12918, 15038, 13001, 6232, 7249, 3284, 7183, 8214, 7112, 9189, 8559, -1513, 60, 3613, 3150, 2461, 5306, 13688, 15895, 18115, 14152, 16922, 13810, 13554, 12052, 11846, 15608, 16286, 14574, 11312, 10110, 11420, 11501, 7128, 108, -4166, -2511, 1282, -335, -2345, -60, 3323, 3686]
9633C686N980J019P64k967m774K601L445N548p38j656l776R8P535N257q283l51
9617A3388N442L979k006k815N05J286J316q52J997j867m177n308q302R04M115
9602G605O756P235P68j469n161j966l536o205p9M837M685j614J804p36q937Q85
9586D872L001M442M773m610l698k904j73P764J1481j0452j607N069k97K68L398
9571B1327K121l381j515n389n854N84K855o656o856L431N796L578m113K158J090
9556I176j039K563l338K830j199m105k453K167L309k919o86K401P300O54j305
9541A3356K857L463K02l226q53j232m960o088K997J025P756l790k282L479q81
9526A1823N218Q0n0m264m768L41N014K758P225l469L509l364o178k148N797J771
$$ y = [3686, 9666, 10685, 11449, 8482, 3708, 6309, 9754, 15302, 14564, 12908, 9132, 9230, 16765, 22022, 13739, 13388, 18830, 22809, 20803, 17988, 18493, 19779, 21095, 20243, 22240, 20373, 16196, 10888, 2586, 3490, 7605, 14361, 21596, 22364, 20895, 15734, 13768, 10232, 4027, 3948, 8785, 13470, 11856, 13660, 12924, 3987, 4872, 7873, 12315, 17088, 12478, 8780, 5876, 5703, 13467, 24948, 14496, 12889, 17958, 17661, 17929, 21327, 23448, 20067, 18552, 13163, 7309, 7893, 10748, 4092, -2764, 667, 6463, 10041, 5928, 8086, 9176, 8137, 10700, 7362, 10192, 8993, 4888, 2435, 4602, 7911, 4992, 4306, 6707, 14007, 14661, 13356, 16213, 19676, 19878, 16652, 15799, 14567, 9607, 3519, 6516, 7541, 15297, 11507, 9225, 12704, 11823, 17041, 17121, 17071, 12807, 8039, 8380, 13394, 16152, 23377, 19908, 23417, 20053, 13875, 11727, 17524, 19295]
9510A9295r016k302o505p802P455N550O540L729j708k947K305k899J068K277j0162
9495D878k388P532Q913P366l903p274q50j351J90p005m614Q735J617l111L640
9480A2375P593J82k889k791j812L133L669M412m229N142K627K01O726O72j564
9465C3447j616j861k327m921O25M771k063r97r10l495m050K573N510q537k329
9450A3820N218L413j429J338J865R197L654J066N04l23n536m110K582n564o961
9435A8734j358K274m167Q148J3329r03l843L945O695O84R994L38m101l962O497
9420E2304L241r02m293o656l927Q446O313K742N314O197L374N470L840k01l837
9405G7425J014r88L715L515N051M596O040M386J915J5130J2478J2633R534J3233
$$ y = [19295, 10279, 7977, 1472, -6330, 1125, 6675, 13215, 16944, 15236, 12289, 14594, 11695, 12763, 15040, 4878, 2490, 10022, 18935, 26301, 22398, 15124, 14274, 12923, 13113, 6108, 1494, 10229, 11846, 8735, 12375, 19968, 20150, 17261, 14470, 12658, 15791, 19460, 23872, 19643, 24785, 27412, 27613, 34339, 35011, 33447, 31831, 29970, 27643, 22722, 23347, 28118, 26055, 25058, 24148, 20653, 16603, 19176, 24686, 16149, 13820, 19038, 22451, 21022, 22360, 24225, 33422, 37076, 38142, 38646, 38323, 32787, 28677, 31259, 25695, 18734, 17376, 19650, 15483, 23631, 36960, 36057, 32214, 36159, 42854, 43538, 53532, 53870, 49769, 45807, 52304, 55545, 54643, 50350, 43694, 39767, 48213, 54526, 57268, 62582, 68779, 72153, 77623, 81463, 81262, 77425, 78439, 77451, 81166, 84681, 89732, 94328, 100368, 104754, 106669, 121799, 134277, 146910, 156444, 169677]
9391A69677J7056J1558J8093K4008K9748L9679M6703M5439N5294Q0558Q9329J12477
9379G39619J50079J99876K97691M23542O27400R44431J313252J482753J217663
9370G396306P88994N75981M10879R6945n63392j434877j734948j370570r27036
9361C238282o17825m17806l01013k34858j86254j46138j21744j00456q4632p5153
9351I52403o7267n4477n4917m3008m3085l2973l5355k7567j8583k4050k0540j6352
9339E14229k3615k5160j7596j4911j4943j3380k2061j9567j6953j3168q867q820
9327C15188r740j3047j6375j2079q316o999m855p441q598o423j0864p126l430
9314A99895q789q075k413j727R76o441j2937r530p420o432L112r52p318M150K147
$$ y = [169677, 186733, 198291, 216384, 240392, 270140, 309819, 356522, 401961, 457255, 537813, 627142, 739619, 889698, 1089574, 1387265, 1810807, 2438207, 3382638, 4695890, 6178643, 7396306, 8185300, 8761281, 9172160, 9269105, 8705713, 7270836, 5535888, 4165318, 3238282, 2620457, 2202651, 1901638, 1666780, 1480526, 1334388, 1212644, 1112188, 1027556, 952403, 885136, 830659, 775742, 732734, 689649, 656676, 621321, 593754, 575171, 551121, 530581, 514229, 490614, 465454, 447858, 432947, 418004, 404624, 382563, 362996, 346043, 332875, 324008, 315188, 305448, 292401, 276026, 263947, 255631, 248632, 243777, 236336, 227738, 221315, 210451, 203325, 199895, 191106, 183031, 180618, 178891, 179867, 173426, 160489, 150959, 143539, 137107, 140219, 139267, 131949, 136099, 138246]
9299A38246o579l945o290p06l690K154J897q853m095o810j448l747O17j633p885
9284H7233m36l646p454n577m267o79Q211Q613r144q473O93N789L27n396l243m685
9268E7866n310m941n241J835M832J833k546m943l053K309J596J941J548m262r769
9253C3695j949j170l337M092M073j562n662j2659J747P443J223M977Q626R366
9239D8903p881j8686j1025K65Q950P431r3J206p196q2p211n093K167N495l54K523
9223A9319J167p096o082L601p71k642o821M879M659M098Q892J060m21k637M90
9208B1695L64L171j416r439k692J130K530J012n702l459N360M233q04k806l356
9193I821o12j347K608l713p383k027M400Q351N947j033m14M378K162m101J792
$$ y = [138246, 131667, 127722, 121432, 120726, 117036, 119190, 121087, 112234, 108139, 101329, 99881, 96134, 96751, 95118, 87233, 86797, 83151, 75697, 70120, 65853, 65174, 73385, 81998, 72854, 64381, 65074, 70863, 71190, 65794, 62551, 57866, 52556, 47615, 42374, 44209, 49041, 50874, 48328, 43385, 40332, 42641, 44237, 46178, 47726, 43464, 33695, 31746, 30576, 27239, 31331, 35404, 33842, 28180, 15521, 17268, 24711, 25934, 30911, 39537, 48903, 41022, 22336, 11311, 11576, 20526, 27957, 27864, 29070, 21874, 21792, 14581, 9488, 11655, 17150, 16796, 19319, 20486, 13390, 7308, 10909, 10138, 7496, 675, 5554, 10213, 14311, 23203, 24263, 23842, 21205, 21695, 22059, 25230, 23814, 14375, 11683, 12813, 15343, 16355, 10653, 7194, 12554, 16787, 15983, 13177, 9821, 9209, 7862, 10470, 6757, -626, -2653, 1747, 10098, 16045, 15012, 14598, 18976, 21138, 17037, 18829]
9178A8829n32j858l43o36M54o13m204m482K44j708N03K965K175P830K048K205
9162B2877O10k771J72o613j1556K470J2429J348l470m051L341K475j226n053k358
9147H624j307j005k601J362j711J798J1126L652q885l008q05j284K61k417j798
9132B002O04n122k907L150J2120k94l70k018p059N830Q547N639O705K498l017
9117B6308q245Q21o291j193j331j803j343J459J951k396O6k568L388M374k859
9102A0338q001q77l036K094L01l649r63q77J0298N984m483j26M288M398n268n107
9086E314K295j784J901l229n10R89n07L048K687o504J096Q58N862j741K976m3
9070A2708l290l788n615k373O529M206p30J600o329K865Q292L921o956k783l66
$$ y = [18829, 18297, 16439, 16096, 15460, 15914, 15301, 11097, 6615, 6859, 5151, 5654, 8619, 10794, 18624, 20672, 22877, 23487, 20716, 20888, 14275, 2719, 5189, 17618, 18966, 15496, 11445, 14786, 17261, 16035, 10982, 8624, 7317, 6312, 3711, 5073, 3362, 5160, 16286, 19938, 11053, 8045, 7240, 5956, 6217, 3800, 2002, 2606, -2516, -5423, -2273, 9847, 9553, 9183, 7165, 106, 5936, 14483, 20122, 26827, 29325, 26308, 18063, 18884, 12593, 11400, 10069, 8266, 6923, 8382, 10333, 7937, 8003, 5435, 8823, 13197, 10338, 2337, 1460, -1576, 518, 819, -2830, -3793, -4670, 5628, 11612, 7129, 7003, 11291, 15689, 10421, 5314, 7609, 5825, 7726, 4497, 3987, 4976, 4469, 7517, 10204, 3700, 4796, 5654, 11516, 9775, 12751, 12708, 9418, 5630, 15, -2358, 4171, 8377, 7647, 9247, 2918, 5783, 14075, 17996, 11040, 8257, 7891]
9055G891Q292Q296K660j0079l783J495O602m465q06l382m385l350l744j936K825
9040B131k643K607M062N252M006j256l081J260j811J599q01k114N624j492l235
9025A0108p22n309o71m792L208L684k280M076N078J152n26k091r195n670M04k649
9009f195M07J0863j18m404L010L946N585n722J131j112k933o570J274K733q47
8994A048J3L005l70K657L768m749o180j065L846p10n78L649M484l672n855K379
8978A670O798l843n927L174M23n538k947m38P498Q81k603J966l725j554J228M83
8962b454L673L141L345l128m653l828o172P13L590R68J799k11R90p56M198M004
8946E219L151k920m674P179k266k556M483J429o735l958n968L511L520p58j424
$$ y = [7891, 16183, 24479, 27139, 17060, 13277, 14772, 21374, 16909, 16103, 12721, 8336, 4986, 1242, -694, 2131, -512, 2095, 6157, 11409, 15415, 14159, 11078, 12338, 10527, 12126, 11325, 9211, 14835, 13343, 10108, 9386, 4077, 3406, -1386, 1822, 5506, 3226, 7302, 12380, 13532, 13006, 10915, 1720, -3950, -3546, -6195, -5788, 5075, 4957, 553, 3563, 7509, 13094, 7372, 8503, 7391, 4458, -2112, -838, 1895, 1048, 1061, 4066, 3696, 6353, 10121, 5372, -808, -1873, 1973, 1263, 685, 4334, 8818, 5146, -709, 1670, 8468, 4625, -1302, 1872, 2295, -3243, -6190, -6628, 870, 1751, -852, 1114, -2611, -4165, -2937, -2454, 1219, 4360, 7705, 4577, -76, -3904, -10076, -9363, -5773, -4805, -3006, -3217, -2227, -2983, 1215, 5219, 8370, 5450, 776, 7955, 5689, 3133, 7616, 9045, 2310, -1648, -7616, -4105, -585, -1343, -2767]
8931b767l469m348J923K015Q89K560M058j634o92k819M488r04j819N12M287l124
8915h44k955m257m196m124n893l597M161N097R964L831j582l045R81k149M197
8900d411N524j207l677j792P1Q958L031m706o849L635P995j585p85q36n490M60
8884a664L894K882j240N49p031j273K639K670n557j131K593L394k432l70N009
8869B932m52O774L851p042p126m114M559r33n18J074K17J015O74k581K856L519
8853D705K546R531l993r392m418j364M198K195J120n072l218J654j478K935k027
8838b078o42j659J109M051k558n941K753J898P450J265n039L592j877n982Q77
8823b781J180O229l054l403j830J275M983K111n442l899M60l09M515k277Q047
$$ y = [-2767, -6236, -10584, -8661, -6646, -5757, -3197, 861, -773, -1465, -4284, 204, -700, -2519, -2007, 2280, -844, -3799, -8056, -12252, -16376, -22269, -25866, -21705, -16608, -6644, -2813, -4395, -7440, -6459, -8608, -4411, 1113, -94, -3771, -5563, -5492, 3466, 6497, 1791, -5058, -1423, 6572, 4987, 4202, 3366, -2124, -1664, 2230, 5112, 3872, 4421, -2610, -3883, -1244, 1426, -4131, -5262, -2669, 725, -1707, -2077, 2932, 2480, 9254, 13105, 6063, -1063, -5177, -618, -1551, -2069, -995, -778, 237, 911, -1670, 1186, 4705, 7251, 16782, 12789, 3397, -1021, -2385, 1813, 4008, 5128, 56, -3162, -1508, -2986, -51, -2078, -2720, -4379, -3270, 781, -1777, -7718, -4965, -3067, 4383, 5648, 609, 4201, 2324, -3658, -2781, -1601, 4628, 1574, -1829, -3659, -2384, 2599, 4710, -732, -4631, -4171, -4480, 35, -2242, 5805]
8808E805L456k516k621l114M719N595j783J57k343n474n233k553l82m242k006
8793a2535l216M666M857L343L573L42N892k220k415K139K127O23q01n94l302q035
8777e556j109K487L6P25L869O898K888k323l046r24M154O744p928m942j951J447
8761A469o17r22J478j297k871n822l06J291O480R82l411k140p040J186P852J975
8745a713L168j458M915N13l092K124M228N648n705p859K018LJ808r1M497R28n223
8728D709J699M563P77m146p872l740N901N355j119L024M228N554k01j068k869
8713A4795M719p84o93l414n419j998m481O71O81R64l752m933P653N535p664k440
8697e60K261J555m725N01n897L365O811M855nm921J105k086m244J144P32j601
$$ y = [5805, 9261, 6745, 4124, 1010, 5729, 11324, 9541, 9698, 7355, 1881, -3352, -5905, -6287, -10529, -12535, -15751, -11085, -6228, -2885, 688, 1030, 6922, 4702, 2287, 4426, 6553, 7176, 6375, 5781, 2479, -5556, -6665, -4178, -4142, -3417, 452, 7350, 10238, 7915, 4869, 3945, 8099, 14843, 6915, 1973, 22, 1469, 852, -70, 1408, 111, -2760, -8582, -8888, -7597, -1117, -135, -3546, -5686, -12726, -11540, -3688, -1713, 1455, -3, 4912, 5425, 2333, 4457, 8685, 14333, 8628, 769, 2787, 2790, 4598, 4507, 9004, 9932, 4709, 6408, 10971, 11748, 7602, -270, -4010, 1891, 7246, 6127, 9151, 13379, 18933, 18732, 17664, 14795, 19514, 18730, 18037, 14623, 9204, 7206, 2725, 3396, 4077, 5041, 1289, -3644, 4009, 9544, 1880, -560, 1701, 3256, -1469, -968, -6865, -3500, 3311, 8166, 8161, 3240, 4345, 2259, -1985, -841, -109, -1710]
8681a710j79J524K693K891Q40J870j164q72n70O81o52K845P95L524K320q787k499
8664C550l251n281K082P117J695P023j597J607O049O127m638l062n863k67j084
8649A0207j078R08J753J543K468P66K371P29n64n738K973j898j1693J801P414
8634A1962M873P51j0168j733N365K438K369N868k113q906K418l038o476M434L462
8619A1506l44K461K014O97N152L5K523k137j593L724M162k307K222Q251l25K267
8603C8308L938j26M740j134K189L490M355N437m075l890J72l166o710p477R06
8588C6957j678o533l463q93J274P60m776k245J259l641M32l202J762j673n133
8573I207N247K711J616j1446p726m22J1648J524j453m592M393P592p677q119M94
$$ y = [-1710, -1889, -365, 2328, 5219, 6059, 7929, 6765, 5893, 5323, 6004, 5352, 8197, 8992, 12516, 14836, 6049, 3550, 299, -4982, -2900, 4217, 5912, 12935, 11338, 12945, 18994, 25121, 20483, 17421, 11558, 11291, 10207, 9129, 10037, 11790, 13333, 15801, 16567, 18938, 19667, 19103, 13365, 16338, 14440, 2747, 4548, 11962, 16835, 17586, 7418, 5685, 11050, 13488, 15857, 21725, 19612, 10706, 13124, 10086, 3610, 8044, 11506, 11162, 13623, 15637, 16334, 21486, 21521, 24044, 21907, 20314, 24038, 28200, 25893, 28115, 36366, 36041, 38308, 42246, 42120, 46860, 45726, 47915, 51405, 55760, 61197, 57122, 53232, 53404, 50238, 43528, 36051, 36957, 35279, 28746, 25283, 24390, 25664, 26424, 21648, 19403, 20662, 17021, 17453, 14251, 16013, 14340, 9207, 14454, 17165, 18781, 7335, -391, -813, 10835, 12359, 10906, 6314, 10707, 18299, 10622, 2503, 2997]
8558B997l730l150L781K446r0K774J0001J780p089j232J274k492J0392k77l354
8543A4031n718J97m147K779k546M664p17M050P255o430l588K145m982m595l176
8528g78N755j09K232L414l747L231j281L913P789k890l348j020L84k228M477L270
8512A9064j729N668J789K695J935n937k925J958K283o01l753J380l852q864L726
8497A2837R90o012L850l749n418M668L172l458n69M482M816k797p057R80N696
8482A2431L536n059l435l270L129l498M196l954j656J359l242J641Q55j772l564
8467b303L70L605K966l64o825K579M410N16J287L091O742k682p293J300K14J515
8451I128L871J492k173K133j463m255j1294p133J196K198J309J702J463J102j786
$$ y = [2997, -733, -3883, -102, 2344, 2254, 5028, 15029, 16809, 9720, 8488, 9762, 7270, 17662, 17385, 14031, 8313, 8510, 4363, 7142, 4596, 9260, 8543, 12593, 19848, 13418, 9830, 11975, 6993, 2398, -778, 4977, 4868, 7100, 10514, 6767, 9998, 8717, 12630, 20419, 17529, 14181, 13161, 13545, 11317, 15794, 19064, 17335, 23003, 24792, 27487, 29422, 23485, 20560, 22518, 24801, 24200, 20447, 21827, 17975, 9111, 12837, 13827, 7815, 11665, 7916, 2498, 7166, 10338, 6880, 6311, 10793, 15609, 12812, 5755, 6735, 12431, 15967, 10908, 7473, 4203, 7332, 3834, 8030, 4076, 2420, 3779, 537, 2178, 3033, 1261, -2303, -1933, 1672, 4638, 4274, -2551, 28, 4438, 4954, 6241, 9332, 16074, 13392, 6099, 7399, 7613, 9128, 12999, 14491, 12318, 14451, 12988, 8733, -2561, -9694, -8498, -6300, -4991, -3289, -1826, -724, -2510]
8436b510o218M956k92J362m965r89k289q31P477P59J866J530j365o167L777L772
8420a27l306J049N572J716k940l226j211m257J636O719J901n401O324L505K686
8405A0640l66J20j248l20l059q598m766j516k446k691R179Q338m91J754o399m132
8389f001J394q53k113L303J442L349L648l081q846j211N496J723k406J260n149
8374h045J713n36k108k115M286J232k944J374N110K513k794n031J259N576K83
8359b27J223M281j971o060j001K898N199K663m488k420J0280j120r776k392P524
8344D613M868n20l317l433J929J798k608K499K460k575j5298n7N813K783n068
8329f113N497L100J873l802l546K774N239j198j749K437N20j423k473j079m940
$$ y = [-2510, -8728, -3772, -4064, -2702, -7667, -8656, -10945, -11776, -4299, -3540, -1674, -144, -1509, -7676, -3899, -127, -3433, -2384, 3188, 4904, 1964, -1262, -2473, -6730, -5094, 1625, 3526, -1875, 4449, 7954, 10640, 10274, 10394, 9146, 8826, 5767, -2831, -7597, -9113, -11559, -14250, -5071, 3267, 2776, 4530, -1869, -6001, -4607, -5460, -7573, -4270, -2828, 521, 4169, 1088, -7758, -8969, -3473, -1750, -4156, -2896, -8045, -6332, -6868, -8976, -11091, -6805, -5573, -8517, -7143, -2033, 480, -2314, -7345, -6086, -510, -227, 996, 5277, 3306, -2754, -3755, -857, 4342, 7005, 2517, 97, 10377, 9257, -519, -2911, 4613, 9481, 8961, 5644, 2211, 4140, 5938, 3330, 5829, 8289, 5714, -9584, -9641, -3828, -1045, -6113, -616, 2484, 4357, 555, -2991, -217, 5022, 3824, 2075, 4512, 5032, 3609, 1136, 57, -4883]
8314d883O20P507K61O51k447o744k504L22Q092J56P08r8j541K288L99n114l490
8297e817m04K620l179n29L625Q373l342j491N361n950l952J627J708L1r14k134
8281d367m934Q856r18K66K652l704J379J209J199K072J810o212p576j167O050
8266c385M665O488J077q239j133J164N673k930l72J202N679k27N6N642r860k023
8250C477K997J950K143p23N524j789p531J103l905j989r578L023K221L720j122
8235d79k862k413r88J460K713M742L006P14l767o01M53k33k569Q09K733n832o737
8218i851J209L06J099J714K264K530J60j181n37R069M729j117o382k160m390k619
8202e157N667Q461j787k975k199j307k088R45J068n239n517M004O413Q288n80
$$ y = [-4883, -4263, 3244, 3505, 4156, 1709, -5035, -7539, -7217, 875, 1031, 1739, 1641, 100, 2388, 2787, -2327, -5817, -6221, -3601, -6780, -7309, -3684, 4689, 1347, -144, 5217, -733, -4685, -3058, -1350, -1319, -2233, -4367, -9301, -445, -1363, -1097, 1555, -2149, -770, 439, 1638, 3710, 5520, -692, -8268, -9435, -3385, 1280, 7768, 8845, 606, -527, 637, 6310, 3380, 3008, 4210, 9889, 9662, 9718, 15360, 5500, 3477, 6474, 8424, 10567, 9844, 15368, 13579, 6048, 7151, 3246, 1257, -8321, -5298, -3077, 643, -479, -3341, -5754, -6742, -5282, -2569, 2173, 5179, 5893, 2126, 1525, 1978, 1745, -824, -15, 2718, -3114, -9851, -8642, -8336, -7237, -5523, -3259, -729, -569, -1750, -2287, 6782, 11511, 10394, 4012, 1852, -2538, -5157, 510, 8971, 7184, 4209, 2010, 703, -1385, -440, 628, -4611, -10128, -6124, 289, 8577, 7997]
8187G997n195k66O557k122q152P038K962j197m506J9j009n08K202l478Q76J802
8171C020O816J679l833k022k156J552j39k288O995K355k807J760O338K953n028
8156A5195r573n186J48r18J1275K206n291k664M662O518k659k799q022j869N456
8141F479K114m233n361j380r03N068O50M259R3m435Q75p89K302k005r570p667
8125a4503N195L641N905N412J887n774m497R390L388J542k335m733j3044P188
8111a338K835M031j5K877L909K852l648p001j622n429J185N704L905P32j180l926
8095C871m033l501L854K374n556J310Q241J079J00p36J951k59j312j913K049K44
8079G763l676j700L624n640p511R59J651K74M050L543k21j982j023n033J783J373
$$ y = [7997, 2802, 2536, 9093, 6971, -1181, 5857, 8819, 7622, 3116, 3135, 2126, 1618, 3820, 342, 1218, 3020, 9836, 11515, 7682, 5660, 3504, 5056, 4917, 2629, 9624, 11979, 9172, 10932, 17270, 20223, 15195, 5622, 436, 584, -334, 10941, 13147, 7856, 5192, 9854, 16372, 13713, 10914, 2892, 1023, 6479, 8593, 4360, -1001, -2381, -3284, 1784, 2434, 6693, 6786, 2351, 3226, 2437, 4739, 2734, -6836, -14503, -9308, -5667, 238, 5650, 7537, 1763, -2734, 6656, 10044, 11586, 9251, 4518, -8526, -1338, 1497, 5528, 5513, 8390, 12299, 15151, 11503, 4502, 2880, -2549, -1364, 4340, 8245, 8977, 7797, 3871, -162, -3663, 191, 2565, -2991, -1681, 6560, 7639, 7739, 7003, 8954, 8695, 7383, 5470, 7519, 7763, 4087, 2387, 6011, 371, -7140, -6181, -4530, -4256, -206, 3337, 3116, 1134, 111, -4922, -3139, -1766]
8063a766J712N648P170J666m918q81l989o627l3P100K443k875j722M116l161m413
8047e30k638M404M909J94m609m017L661L801p40r76l228j541q62L594N814j456
8031E780l71o477M98K984n920j747L69K619N339k239J390M06N428N211M514l43
8015A7441q258p4j398J706N540O034Q676R973J707K371l550o233n711L45j669
8000B6900O90j682L675l442o277k712L700m35o097m914k034k694N60M587P29l651
7984F903p028l263J032R440k222L02q50o734O080J0824K1p939K862P008N804k471
7968A9769o066m273j70L50j533J626N34N958J116k062K176L058q402n437O966
7953A3610j576j079r05p880k495J663L508L457P863M736k885l843p634J166M58
$$ y = [-1766, -54, 5594, 12764, 14430, 9512, 8631, 4642, -1985, -2018, 5082, 7525, 4650, 2928, 7044, 3883, -530, -3168, 1236, 6145, 6339, 1730, -2287, 1374, 5175, 4435, 3459, 231, -1310, -2172, 1422, 7236, 5780, 5409, -1068, -570, 2414, -3506, -5253, -4884, -2265, 3074, 835, 2225, 2631, 8059, 13270, 17784, 17441, 9183, 9109, 7711, 9417, 14957, 20991, 29667, 39640, 41347, 43718, 40168, 33935, 28224, 28569, 26900, 27590, 25908, 29583, 26141, 19864, 17152, 20852, 20417, 14320, 9406, 7372, 4678, 5238, 9825, 10554, 6903, -125, -3388, -2356, 7084, 4862, 5164, 4314, -2420, 3660, 14484, 14505, 6566, 9428, 16436, 22240, 19769, 13703, 9430, 9260, 9610, 8077, 9703, 10237, 16195, 17311, 15249, 17425, 20483, 12081, 6644, 13610, 12034, 10955, 10050, 2170, -325, 1338, 4846, 8303, 16166, 20902, 18017, 14174, 6540, 7706, 8164]
7938H164K90K352j469j113J0302j498n693L43l921J362o531l77L48l792L438M743
7922F948k681J095k93L835J779J690K309n04m823r296K47L697N811N61m026k860
7906C489J976O661N740L20o106l982N86l095r04l106j362k513J045K375K496l50
7890C270j793K815K362L045K26j47L74l591q386L58N75M36O76j657N402L937L261
7873A1163j223n168n217m027L764J509L974m318J223N99K890k29k183J456K721
7858F934m116m572N495L328k662j0180K381P849N415m630r641k544M511L105q8
7843E85N154n600M55O275m64k934l804M287M817K60k125j908k824O6o08l05K545
7826C872j359k718J347L764O876m851p527j121m403n217P192M144M102o210k808
$$ y = [8164, 8454, 10806, 9337, 8224, 18526, 17028, 11335, 11678, 7757, 9119, 2588, 2211, 2559, -1233, 2205, 6948, 4267, 5362, 5069, 8904, 10683, 12373, 14682, 14178, 9355, 59, 306, 4003, 9814, 10375, 6349, 3489, 5465, 12126, 17866, 18186, 12080, 8098, 8684, 5589, 4685, 1579, 217, -2296, -1251, 1124, 3620, 3270, 1477, 4292, 6654, 9699, 9925, 9778, 10152, 6561, -1825, -1467, -892, -456, 220, -1437, 3965, 7902, 11163, 9940, 4772, -445, -4472, -708, 801, 4775, 457, 1680, 2279, 5169, 4940, 2757, 4213, 6934, 2818, -1754, 3741, 7069, 4407, -5773, -3392, 4457, 9872, 5242, -4399, -6943, -2432, 673, 585, 5739, 139, 594, 6869, 6405, 3471, -333, 3954, 8771, 9031, 6906, 4998, 2174, 2240, 1632, 1327, 3872, 2513, -205, 1142, 4906, 11782, 6931, -596, -1717, -6120, -11337, -4145, -1, 4101, -2109, -4917]
7811d917n466L050K746l845L032R847k092j347j014j429K49k570K674l16j482
7796b880J167J960Q40O47M947N84q039o0L826j749l482l423M476j761k613r76
7780f536O688J121n323k713Q293k434p393M927K145J590J315Q233N100n353m914
7765D746l496r514j011R8l203j773J552L065Q406J268k703N160o77j184j213n737
7749f216K395K831j473l441o189J647j542N348R66l575k217R69N436r74j388L056
7733d367m204m27L105J229n757j878K455L715J372L557k040l404p901L034N415
7718f096K704J520j326j119J379K543K756k955R65k750N106p717k018K545K478
7703a985p115K375Q609J672M04o778M847K155o349j363L91J564k740k043Q90L222
$$ y = [-4917, -10383, -7333, -4587, -8432, -5400, 4447, 2355, 1008, -6, -1435, -1186, -3756, -1082, -1398, -2880, -1713, 247, 1087, 1734, 6681, 7265, -774, -834, 2992, 1243, -2239, -5662, -1186, -2947, -5560, -6536, 152, 1273, -4050, -6763, 1530, -904, -8297, -3370, -1225, 365, 1680, 9913, 15013, 9660, 4746, 1250, -8264, -9275, -9177, -12380, -14153, -12601, -9536, -1130, 138, -2565, 2595, 1918, 734, -479, -6216, -3821, -990, -2463, -5904, -12093, -10446, -11988, -6640, -5674, -9249, -11466, -10497, -5061, -6035, -7423, -4367, -8571, -8998, -5893, -4664, -10421, -12299, -9844, -6129, -4757, -1200, -3240, -6644, -14545, -11511, -6096, -3392, -1872, -3198, -4317, -2938, -395, 2361, -594, 371, -2379, 2727, -4990, -7008, -4463, -1985, -9100, -6725, 1884, 3556, 3960, -2818, 2029, 4184, -2165, -3528, -3137, -1573, -4313, -6356, -5466, -2244]
7687b244J199j96J443K223Q12P14j412m177P580L995l590r76M783N639n214o801
7671C778n645n806Q280k570n261n409J008J0695Q012Q49p131L159J394k070K808
7656F091N451p262j0457K183J934r96O891j51m453k428n063O026O699N019m924
7641D560l217J57j492m464L016R13p007N252M476n885M346N909l598m837m362
7626f233r48J209l46j252N397j968m676N495O665K126q506m158J717O845J772
7611C139m044J35j536m21j832l43K366O852L560l548J138K439l118o108m100l472
7595h893o00K926L952K322K522J033l342J857j971k217J770L133m944m781R594
7580B361J0207K896n903j1443m574L73N440R709N094n137K897l511L319R62m438
$$ y = [-2244, -1045, -1241, 202, 2425, 3237, 3951, 2539, -1638, 5942, 9937, 6347, 5371, 10154, 15793, 10579, 3778, -1867, -7673, 607, -1963, -7224, -12633, -11625, -930, 7082, 7931, 800, 3959, 5353, 3283, 6091, 11542, 4280, -6177, -3994, -2060, -3056, 3835, 3684, -769, -3197, -8260, -2234, 4465, 9484, 4560, 1343, 1500, 8, -4456, -1440, -527, -7534, -2282, 2194, -3691, 655, 6564, 2966, -1871, -6233, -7181, -5972, -6318, -7570, -2173, -4141, -8817, -3322, 3343, 5469, -3037, -7195, -5478, 1367, 3139, -905, -770, -2306, -2727, -4559, -4902, -2536, 4316, 7876, 4328, 5466, 7905, 4787, -1321, -5421, -8893, -9493, -6567, -2615, -293, 2229, 3262, -80, 1777, -194, -2411, -641, 2492, -2452, -7233, 2361, 12568, 15464, 9561, -1882, -6456, -6083, -643, 9066, 14160, 9023, 11920, 8409, 11728, 12690, 8252]
7565H252L347m030j0080J244j010k100k393l515N482n730J487N789O852j651n82
7550A362j614m386l399m76L886L866j325J229k36j341L658K83p873j743M152J354
7534b603o915j599J121k86L072K368J266K488n214J032Q967N964l382N28L673
7519A0480q872m138k641k848j362j096l773r09N08n80O173K797j87L766K015j519
7503b186p876K036N198k428k793M876K650K943K99M213o87p851l566j550j008
7488g730M275L746K845n408L331O583K544j0768j3790J280J802Q713n74j718M673
7473a96k152k462J862K576q806m024j557N826J164L01j19n939K137L101Q685M046
7457D443M838R85l447j0615n632O592J0072J073r75J956k959m922M083j883J022
$$ y = [8252, 11599, 7569, -2511, -1267, -2277, -4377, -6770, -10285, -4803, -10533, -9046, -3257, 3595, 1944, 1362, -252, -4638, -8037, -8513, -4627, -761, -2086, -857, -1093, -2434, 1224, 1507, -6366, -8109, -3957, -2603, -9518, -11117, -9996, -10282, -7210, -4842, -3576, -1088, -6302, -5270, 3697, 9661, 6279, 6807, 10480, 1608, -2530, -5171, -8019, -9381, -10477, -14250, -15159, -14651, -15231, -9058, -6261, -6448, -2682, -667, -2186, -10062, -8026, -2828, -5256, -8049, -3173, -523, 2420, 2719, 6932, 6245, -1606, -5172, -6722, -7730, -3455, 291, 3136, -2272, 1059, 7642, 10186, -582, -14372, -13092, -11290, -2577, -3151, -4869, -196, -2348, -4810, -2948, -372, -9178, -13202, -14759, -8933, -7769, -7468, -7587, -13526, -11389, -8288, 397, 4443, 9281, 10266, 6819, -3796, -9428, -2836, 7236, 8309, 7334, 9290, 6331, 1409, 5492, 3609, 4631]
7442D631m297k841m70n881Q685Q991K910j0225k701l738J145M817l172l171K712
7427b605M464K831N654o765n198M181o812o898J153M649M152K227j763k664n711
7412i105k929k345n06K687J0412J061K067k816J202l407j912M247N87n961l069
7397i787O63m819l793l027L475R275P34o22M728L951n67J207J35p126m985k346
7381a2904l20O222r19J853k467R97j119m48k259L84L025L46j523K417K744l35
7365d306l020m248J778J929l626l236m19P105N911L380L958o334k047j717p42
7350e634j209L74l004N686J0726l495n235j761l784j251J175J060j987j034N416
7335c957O85l480j46j580k96j099J302J726R36J33K636Q44l417L209l712j90M792
$$ y = [4631, 334, -2507, -2977, -8858, -173, 8818, 11728, 1503, -1198, -4936, -3791, 1026, -2146, -5317, -2605, 1859, 4690, 10344, 3579, -1619, 2562, -4250, -11148, -9995, -5346, -1194, 1033, -730, -3394, -9105, -12034, -14379, -14885, -12198, -1786, -725, 1342, -1474, -272, -3679, -5591, -1344, -757, -6718, -9787, -9124, -13943, -17736, -20763, -17288, -8013, -7279, -7901, -3173, 778, 211, 1418, 1553, -5573, -10558, -12904, -13224, -7002, -7921, -6068, -8535, -7538, -8657, -9105, -11364, -10980, -7955, -7609, -9132, -6715, -3971, -4306, -7326, -11574, -9796, -7867, -11493, -14729, -15148, -8043, -2132, 1248, 5206, -1128, -3175, -4892, -5634, -6843, -6469, -9473, -3787, 6939, 3444, -1791, -3552, -7336, -8587, -7412, -6352, -8339, -9373, -3957, -3272, -6752, -6898, -8478, -8774, -9873, -8571, -6845, -5909, -5776, -3140, -2296, -5713, -2504, -6216, -6406, -1614]
7318a614m9j180j236o025k553K987N562k677r324P02Q8K781k092p230j54J0505
7302a1509r9m752O44P342P885K295P14J675k544K704J620n267r852k060M000J0170
7286B966M130n050m039o183R137R208L153j899l87r82k668L861N405J485k547
7271A5590J420J700j3841o463K248k802j942n761k645L882L823J717J017n456
7257g513l322m97K234N872M56Q63l646m590J361N888j260M010q19k832j002L044
7241a753K31l670j998l092k640L82N588P20n515k915L310R682J513k071N83R28
7225g17l99j782p899K83O927M957M413j373j67r738r336k290k918P796O933l49
7209e659Q88K430n348k466K592n53N203M090M616J059L78j15m254o485j269L792
$$ y = [-1614, -1663, -2843, -4079, -10104, -12657, -9670, -4108, -6785, -16109, -15407, -15319, -12538, -14630, -21860, -22014, -11509, -11608, -16360, -15716, -8374, -489, 1806, 2520, 4195, 1651, 4355, 5975, 708, -9144, -11204, -7204, 2966, 7096, 2046, -1993, -8176, 961, 10169, 13322, 11423, 11036, 10054, 7386, 11247, 16652, 18137, 15590, 17010, 18710, 4869, -1594, 654, -2148, -4090, -9851, -12496, -8614, -4791, -3074, -2057, -7513, -10835, -11332, -9098, -3226, -2770, -1907, -5553, -10143, -8782, -2894, -4154, -144, -963, -3795, -4797, -1753, -1522, -5192, -7190, -10282, -12922, -12540, -6952, -6232, -11747, -14662, -11352, -1670, -157, -2228, -1645, -717, -1116, -2898, -10797, -10514, -3587, 1370, 5783, 4410, 4243, -5495, -14831, -17121, -20039, -12243, -5310, -5659, -4771, -2341, -7689, -10155, -7563, -8116, -2913, 1177, 5793, 6852, 7230, 7115, 2861, -3624, -4893, -1101]
7193a101L518n580k832J635m39K354K824O407k541q594l67J092L459L442k150
7178A127o149l80N071M776k485n805p33L589M076M30j747o297K246N753m293j0027
7162a0848j922l366m521o87O955O447l625M286Q638N734J789J97n693K50m43l263
7146g2l538n680L237j74J657L19l839P98q9J603l066P615M634p138n114K272L678
7129b897Nj821P008M244p418o509Q42p0j918k520n050R27P118L550j605K016M108
7112A0m433q199k876L832L145Q703P792L171P32j4697p238L982J753M776M547
7097E000j14m056K297L709l496r866l980J176K129m86k47n06J976k079k552R96
7081a0099M808M382k53K481N892m227m075K899M585K351q88j927m543l270j294
$$ y = [-1101, 2417, -3163, -5995, -4360, -4799, -2445, 379, 6786, 4245, -4349, -4716, -3624, -165, 3277, 1127, -5022, -5402, -331, 4445, 1960, -3845, -4578, -989, 3087, 3517, 1770, -4527, -2281, 3472, -821, -10848, -12770, -16136, -20657, -21344, -14389, -7942, -11567, -7281, 1357, 7091, 8880, 9077, 3384, 3634, 3191, -72, -3610, -9290, -6053, -6227, -4570, -4251, -8090, -7292, -7381, -5778, -8844, -1229, 3405, -3733, -8847, -6575, -2897, -2892, -4713, 2295, 6539, -879, -7388, -6546, -6616, -8534, -11054, -16104, -15177, -8059, -4509, -6114, -4098, 10, -4423, -12622, -15498, -11666, -8521, 182, 7974, 11145, 11877, -2820, -10058, -6076, -4323, 453, 5000, 4886, 830, 3127, 6836, 3340, -6526, -10506, -9330, -7201, -7687, -7934, -8440, -6464, -8543, -11095, -10099, -5291, -909, -1162, 1319, 7211, 2984, -1091, 1808, 6393, 8744, 7856, 5929, 1386, -1884, -3178]
7066c178L38k173j975J532N56Q74L225r09o441m204Q837R668o195n494n008n489
7050a6036J080L877N52k541m942j895J2689P308j279o499K416O635k217r22J486
7035b88k065J217K59k280L71l350j110Q153P553q602r78N685j12R9k138l553l061
7018d200l517K841n435m743O14J383K850N518L251Q79n158p10N17M87O762j963
7002f24K929L381n732n116j119M000K578J746n677K325K419L447M643l228n137
6987H35j916k143M504N774M741p92l808n448j570r38J495k088Q37P33o54j16l608
6970d162r95J697K466j102m492l658n704N801P070j213L529M090O077m60j023
6955G921n366n48j423K704k297j983O95m372n060l143K795o56L863Q491m477m390
$$ y = [-3178, -2840, -5013, -6988, -5456, -4900, -4026, -801, -1710, -8151, -12355, -3518, 6150, -45, -5539, -10547, -16036, -14956, -11079, -10527, -13068, -18010, -19905, -7216, 92, -1187, -7686, -5270, 1365, -852, -1774, -288, -2353, -1136, -877, -3157, -2786, -6136, -7246, 907, 8460, -142, -1120, 4565, 4453, 4552, 2414, -1139, -4200, -7717, -4876, -10311, -15054, -14440, -13057, -10207, -4689, -1438, -559, -5717, -6427, -5910, -5423, 1339, -624, 2305, 5686, -46, -5162, -6281, -2281, 297, 2043, -3634, -1309, 1110, 4557, 9200, 5972, 835, -1081, -3224, 1280, 7054, 11795, 11003, 7195, 1747, 177, -761, 734, -1354, -517, 216, -438, -554, -4162, -5157, -3460, -994, -2096, -6588, -10246, -15950, -10149, -3079, -4292, -763, 3327, 9404, 8944, 7921, 2555, 2007, 584, 3288, 991, -992, -297, -4669, -9729, -12872, -10077, -10733, -6870, 1621, -2856, -7246]
6939g246l38m752m625O902L273m729Q59j093O47M364L781P380k416l226J984N77
6923A342n899K180j917n577j345Q671K066K111J098j192J199o89K309n437r166
6908a0246L997L472L005Q29o751K290L344j990m229M630K54n313j338L906O179
6893B039L887l96n34m646l514N860K699l414K965K907m931o613k401M290m701
6878f503j336m172J981j97K110J872M5L074N256J379L669r645j0157p925J619
6863a8930J714L428N355K990P4L363J225r93K395j478L71K450r078K317J0677
6848E880m539n976o81K506n04k651L316L391o84n024M144J645J679k50o423r16
6832e087L204l004l487j636n18j177K851O893l918J582J411Q59K588k489M58k4
$$ y = [-7246, -7584, -12336, -16961, -10059, -6786, -11515, -10656, -11749, -11102, -6738, -2957, 4423, 2007, -1219, 765, 1342, -4557, -2377, -4294, -9871, -11216, -2545, -479, 1632, 2730, 1538, 2737, 2048, 4357, -1080, -10246, -6249, -2777, 228, 1057, -5694, -3404, -60, -2050, -6279, -1649, -1395, -6708, -8046, -4140, 2039, 5926, 5530, 4996, 350, -3164, 2696, 5395, 1981, 4946, 7853, 2922, -3691, -6092, -1802, -6503, -7839, -12011, -10030, -10227, -8117, -6245, -6200, -3126, 2130, 3509, 7178, -2467, -12624, -20549, -18930, -17216, -13788, -8433, -5443, -5369, -2006, -781, -1774, 621, -857, -486, 1964, -7114, -4797, 5880, 1341, -4635, -5316, -2810, -3314, -5965, -2649, 742, 58, -4966, -822, 823, 2502, 2252, -4171, -5087, -1883, -4887, -8374, -10010, -10528, -11705, -8854, -1961, -5879, -4297, -2886, -2027, 561, -1928, -1470, -1494]
6816a494j973l506m206J1996l919o466O895K629n557J967N825m524O405r50K050
6801E172J676P14k259p264J340L183m595J842L757M75n322o569m146L13N297R906
6785C520O113n385l891p089j171J537O36M11N293k455J759K802k46l277M411N090
6769H058m243J574P73J881K252o421j805J796P23K222o475l126j469k353O805
6754A92K833o690M533k828r27L247N980K769p240J669K72n290P51L107l240m778
6738e640M026K330M848N721l691m650l923m600p610K777O549J435P01k228L982
6723B7M863m46p155p207n37O848P58k656j133J868J027j264K333j594m835O824
6707b279K412J203m958n231N958Q408K834j467k342p89j250o131j326l515J455
$$ y = [-1494, -3467, -6973, -11179, 817, -3102, -9568, -2673, -44, -5601, -3634, 2191, -2333, 4072, 3122, 5172, 6848, 7562, 5303, -1961, -621, 2562, -2033, -191, 3566, 4041, -1281, -7850, -11996, -11683, -6386, 3520, 9633, 4248, 357, -6732, -7903, -6366, -5730, -5319, -26, -2481, -722, 2080, 1834, -1443, 2968, 8058, 3815, 5389, 6162, 8043, 10295, 3874, 2069, 3865, 4588, 6810, 335, -2791, -4260, -6613, 192, 3025, -3665, 868, -1960, -2887, 360, 6340, 9109, 1869, 3538, 3810, -1480, -729, 2378, -862, -5640, -1614, 716, 5564, 11285, 7594, 2944, -979, -5579, -13189, -10412, -3863, -2428, -1727, -3955, 27, 4890, 4444, -2711, -9918, -10455, -3607, -2849, -5505, -6638, -4770, -3743, -5007, -2674, -4268, -9103, -2279, 133, 1336, -3622, -8853, -2895, 5513, 8347, 6880, 4538, 3749, 2499, -3632, -4958, -8473, -7018]
6692g018P587L859J922k938p046n572O603K255k95J901M662N405R98Q37k21p315
6676E624n326M154o55m36K66n036l219P298L924m355l387n303p664l442O290J888
6660i379j281K281R700L047J14M792K971o217r692r388K556k483M248Q153J344
6645G66J274k389P538K662p833q639k742o308k005K673Q290J827K006q61L636
6630a05m101n440l170j194Q81p22k598K111L158O897J0079j080n265K821P465
6615I737n43j1207l874J457N179O357M411p206m301L114Q1o257p5r170j616R064
6599d849J5962Q396l710n747o887r960r486L28K043l907P22L993R51J879J607
6584h665k537j85K202N825M903L315O817K339l888r91K101l184r4J994R40l921
$$ y = [-7018, 569, 4428, 6350, 3412, -3634, -9206, -2603, -348, -643, 1258, 5920, 11325, 12323, 13160, 12939, 5624, 298, 4452, 3797, 3361, 3627, -1409, -4628, 2670, 6594, 2239, -1148, -6451, -14115, -17557, -11267, -9379, -10660, -8379, 1321, 4368, 4482, 9274, 12245, 6028, -3664, -13052, -10496, -12979, -8731, -578, 766, 2040, -349, 7189, 9851, 2018, -6621, -9363, -15671, -17676, -15003, -6713, -4886, -2880, -3741, -105, -4206, -9646, -12816, -14010, -13129, -13851, -16449, -14338, -11180, -4283, 5796, 4716, -549, 2272, 9737, 9194, -2013, -5887, -4430, 749, 7106, 11517, 4311, 10, 3124, 3205, -3052, -3127, -12297, -13913, -4849, 11113, 19509, 15799, 10052, 3165, -6795, -16281, -15953, -13910, -17817, -17095, -13102, -12151, -10272, -8665, -11202, -11387, -9185, -3360, 1543, 4858, 11675, 14014, 10126, 9135, 11236, 8052, 7958, 9952, 10892, 6971]
6568F971q785p022j54P737O36J961q765n342L67K464J363p99M260P330K325m76
6552D071m320n62k422l962l39J658R316l412q012J37O02R13N712M43O41j005r763
6535a0304k850J26K160L777Q034K230j99j0229K600M909j783m538p020M500j155
6520i742o10L88O91L801L730k902Q52O278j964j0559p000K918k98O61l244o78
6504a7678K57J039Q878J1841J228n21r539O02P588O264r066k27L023j476L74m399
6488a812l052l093J699K261R03o62K383K712M211M009J775k765o486k797N795
6473E081N29j175j681L884m520m997o312j123K652O287L191L34j144j45n984l457
6457h580K31M854J737K562K237M431j970n724k495J894n055q81K449J337K895
$$ y = [6971, -1814, -8836, -8990, -1253, -617, 1344, -7421, -12763, -12396, -9932, -8569, -9368, -5108, 2222, 4547, 4071, -249, -811, -3233, -7195, -7534, -5876, 3440, 28, -7984, -7847, -7245, -6332, -620, -177, 464, -541, -10304, -13154, -13028, -10868, -7091, 943, 3173, 2974, -7255, -4655, 254, -1529, -6067, -13087, -8587, -9742, -10352, -9964, -9273, -5472, -1742, -4644, -3792, 2486, 522, -10037, -17037, -14119, -14417, -13756, -17000, -17678, -17421, -16382, -7504, 4337, 5565, 5044, -4495, -3893, 3695, 9959, 893, 666, 3689, 2213, 2587, -1812, -4864, -7957, -6258, -3997, -3094, -3756, -1373, 1339, 5550, 9559, 11334, 8569, 2083, -714, 5081, 5610, 4435, 2754, 6638, 2118, -2879, -9191, -10314, -7662, -1375, 1816, 2150, 1006, 861, -5123, -8580, -8349, -3495, -1758, 804, 3041, 7472, 5502, -222, -2717, -823, -5878, -6759, -4310, -2973, -78]
6442g8N375L278L420m426k597l379k277P881k675j766n060m021j906N908Q333
6427F010L188j785o076n815j941K808L324M871K521j0361j077O25J351n14m966
6412g837o92j420j263R90l151j512L70R041N700q82J22P91k9n7p16J405l655q168
6394a0963N724J1160J823o058p696N333O946k676q537J839j701k847K997Q62k030
6379e824k110M417kk150j793J434L038J437o172j108L693K169L596j278p561K219
6363e995R983l460j119l146k50L257mp626n060N714P534M80K173J158o895j227
6347d483K406m642J275L216M26L188k613l900j773j482j186L026r72K418J814
6332c282Q450N351m235m664p729M46j041p51k239L277J004K496k551q82m499J237
$$ y = [-78, 5297, 8575, 11995, 7569, 4972, 1593, -684, 7197, 4522, 2756, -2304, -6325, -8231, -2323, 6010, 9198, 7413, 1337, -4478, -6419, -3611, -287, 4584, 7105, -3256, -4333, -3708, -2357, -2871, -7837, -8529, -9949, -11212, -10222, -13373, -14885, -14515, -5474, 226, -656, -534, 257, 228, 171, -545, 860, -2795, -10963, -5239, 5921, 7744, 1686, -6010, -677, 6269, 3593, -4944, -3105, -4806, -7653, -4656, -3794, -5824, -7934, -3517, -3519, -5669, -7462, -6028, -2990, -1553, -7725, -8833, -5140, -2971, 625, -653, -8214, -5995, 3988, 528, -591, -3737, -3987, -730, -734, -8360, -13420, -7706, -172, 308, 2481, 3639, -3256, -4483, -2077, -6719, -5444, -2228, -1802, 1386, -1227, -5127, -6900, -8382, -9568, -6542, -7514, -5096, -3282, 5168, 10519, 6284, 1620, -6109, -5663, -6704, -7455, -9694, -6417, -5413, -2917, -5468, -6350, -10849, -9612]
6316i612l727N512J36J709J508N51J913J294l566L874K169O173L511o940k360
6301B145k083k901M546r42J952M259j728o555q30j479n333J211N756k599N33K363
6285a685M644P52p552l003j956j705J654N935k340k053o75l54K267o016N822K849
6269c416j528m995L988M404j856j389L250l227L319P299m3M96m208J078j443k334
6253f05k42m924L032k74M506j328p43k438J32L354N537k1k00R2m129k438n164
6236e853J65K898j37q35k176o170l405N96N358L233L727P446j527k464m556j810
6220e510m585J179N708O56q993m966Q787P252J968Q49m357n483l758K884K706
6205e663r97j992L498p21m021J927Q370l510l011m759m229k400K082j432J270
$$ y = [-9612, -13339, -7827, -7691, -5982, -4474, -3923, -2010, -716, -4282, -408, 1761, 7934, 11445, 4505, 2145, 62, -2839, 1707, 765, 2717, 6976, 5248, -1307, -2137, -3616, -8949, -7738, -1982, -4581, -4048, -1685, 2959, 3711, -3841, -6844, -8800, -10505, -8851, -2916, -5256, -7309, -7984, -8338, -6071, -12087, -6265, -3416, -4944, -9939, -5951, -1547, -3403, -4792, -1542, -4769, -1450, 5849, 5806, 6302, 2094, 3172, 1729, -605, -847, -5771, -2739, -3013, 1493, 165, -578, -3016, -2884, 470, 6007, 5986, 5786, 5878, 1749, -689, -5853, -5688, -2790, -2927, -3762, -5938, -12108, -15513, -14917, -9559, -6326, -2599, 4847, 3320, 856, -3700, -5510, -10095, -8916, -3208, -2552, -11545, -16511, -7724, -472, 1496, 2345, -2012, -7495, -11253, -8369, -5663, -6660, -8652, -5154, -5875, -9896, -7969, 401, -3109, -6120, -10879, -15108, -17508, -15426, -16858, -15588]
6190a5588J394M348l16m361m206J689M376P623K429N632l520o116j039L10L173
6175d172K358r48j275M815k020n53o62r46J224j460k696k538k844j752O14L752
6159i103J165O271J610J903j809j992m646m377k163L698m587N841M129L12m09
6144d157L81j375l098j682K143O659P246l499n625R2R30l401O390N333j907n476
6128a046n896j942k156L773K375M99p769l74J88k095K386P786L647k231J706N107
6112C958J197n225M467n528o503l035P66P448N626J414L672J341p946n830J608
6097b570K126Q67k243n168r53K492o32j911J008P525N00J466m830k249L221j804
6081c155L506O69k565n869l879n17M977M180N378n886j0212N18R106O752k968
$$ y = [-15588, -14194, -9846, -10162, -14523, -18729, -17040, -12664, -5041, -2612, 3020, -500, -6616, -7655, -7345, -4172, -1814, -2762, -4037, 778, -1242, -1795, -2457, -3403, -2179, -3639, -6335, -8873, -11717, -13469, -12855, -9103, -7938, -1667, -57, 1846, 37, -1955, -6601, -10978, -13141, -9443, -14030, -8189, -4060, -3748, -4157, -3776, -5151, -8249, -9931, -7788, -1129, 6117, 2618, -3007, -2915, -1985, -5386, 1004, 6337, 4430, -1046, -6942, -8884, -11040, -7267, -4892, -4393, -12162, -12536, -12348, -14443, -12057, -4271, -624, -2855, -1149, 3958, 5155, -70, 4397, -1131, -7634, -10669, -9903, -2455, 3171, 4585, 8257, 9598, 1652, -4178, -2570, -444, 423, -1820, -6988, -7941, -5449, -6081, -7992, -6984, 541, 1041, 2507, -2323, -4572, -1351, -3155, 351, 1020, -1545, -7414, -11293, -11810, -6833, -2653, 2725, -3161, -13373, -12855, -3749, 3003, 35]
6066C5q593K94R251j412R67L606L765l638r217o641J849K819K933N362K270m950
$$ y = [35, -8558, -8264, 987, -425, 542, 4148, 7913, 4275, -4942, -11583, -9734, -6915, -3982, 1380, 3650, -1300]
$$ [...]
##END NTUPLES=NMR SPECTRUM
##END=
