##TITLE=Analysis number 321295
Compound Code tl 00368
Project Code adrs
Chemist Name ugmt
##JCAMPDX= 6.0         $$ Bruker NMR JCAMP-DX V2.0
##DATA TYPE= NMR SPECTRUM
##DATA CLASS= NTUPLES
##ORIGIN= Bruker BioSpin GmbH
##OWNER= nmr
$$ XWIN-NMR		Version 3.5
$$ Thu Aug  3 09:48:32 2006 GMT Daylight Time (UT+1h)  MAYBRIDGE\nmr@NMR_250MHZ
##.OBSERVE FREQUENCY= 250.131544655141
##.OBSERVE NUCLEUS= ^1H
##.ACQUISITION MODE= SIMULTANEOUS (DQD)
##.ACQUISITION SCHEME= undefined
##.AVERAGES= 16
##.DIGITISER RES= 18
##SPECTROMETER/DATA SYSTEM= dpx250
##.PULSE SEQUENCE= zg30
##.SOLVENT NAME= CDCl3
##.SHIFT REFERENCE= (INTERNAL, CDCl3, 0, 16.522)
##AUDIT TRAIL= $$ (NUMBER, WHEN, WHO, WHERE, WHAT)
$$ ##TITLE= Audit trail, XWIN-NMR		Version 3.5
$$ ##JCAMPDX= 5.01
$$ ##ORIGIN= Bruker BioSpin GmbH
$$ ##OWNER= nmr
$$ C:\u/data/dgb/nmr/ADRS/150/pdata/1/auditp.txt
$$ ##AUDIT TRAIL=  $$ (NUMBER, WHEN, WHO, WHERE, WHAT)
(   1,<2006-08-03 09:48:11.33 +100>,<MAYBRIDGE\nmr>,<NMR_250MHZ>,
      <created by zg, POWCHK disabled, PULCHK disabled
       configuration hash MD5:
       E2 DF 36 D8 04 B2 41 60 5A D7 A3 38 5A 4B D0 FE
       data hash MD5: 64K
       90 20 8E E0 B8 67 DE 46 3E 8B 30 55 04 43 6C 48>)
(   2,<2006-08-03 09:48:23.72 +100>,<MAYBRIDGE\nmr>,<NMR_250MHZ>,
      <Start of raw data processing
       ef LB = 0.3 FT_mod = 6 PKNL = 1 SI = 32K 
       data hash MD5: 32K
       AF 18 BF 96 3C 28 1E 5C 81 6C BB 26 2D 10 B8 E2>)
(   3,<2006-08-03 09:48:25.36 +100>,<MAYBRIDGE\nmr>,<NMR_250MHZ>,
      <apk 
       data hash MD5: 32K
       E5 5A 8A 5A 9F F8 C4 AA 52 2A A9 B1 CD D3 02 8D>)
(   4,<2006-08-03 09:48:26.21 +100>,<MAYBRIDGE\nmr>,<NMR_250MHZ>,
      <abs ABSG = 5 
       data hash MD5: 32K
       D9 FB 79 1B F6 58 54 4E 4A 32 5F F0 E2 FC E6 BF>)
$$ ##END=
$$ 
$$ hash MD5
$$ D6 08 86 FB FE 7A 12 57 70 EE B2 02 A9 57 BC C9
##$RELAX= 
##$RELAX= 
##$RELAX= 
##$RELAX= 
##$RELAX= 
##$RELAX= 
##$RELAX= 
$$ Bruker specific parameters
$$ --------------------------
##$DU= <C:\u>
##$EXPNO= 150
##$NAME= <ADRS>
##$PROCNO= 1
##$TYPE= <nmr>
##$USER= <dgb>
##$AMP= (0..31)
100 100 100 100 100 100 100 100 100 100 100 100 100 100 100 100 100 100 
100 100 100 100 100 100 100 100 100 100 100 100 100 100 
##$AQSEQ= 0
##$AQ_mod= 3
##$AUNM= <au_zg>
##$AUTOPOS= <9 >
##$BF1= 250.13
##$BF2= 250.13
##$BF3= 250.13
##$BF4= 250.13
##$BF5= 500.13
##$BF6= 500.13
##$BF7= 500.13
##$BF8= 500.13
##$BYTORDA= 1
##$CFDGTYP= 0
##$CFRGTYP= 5
##$CHEMSTR= <none>
##$CNST= (0..31)
1 1 145 1 1 1 1 1 1 1 1 1 1 1 1 1 1 1 1 1 1 1 1 1 1 1 1 1 1 1 1 1 
##$CPDPRG= <>
##$CPDPRG1= <>
##$CPDPRG2= <>
##$CPDPRG3= <>
##$CPDPRG4= <mlev>
##$CPDPRG5= <mlev>
##$CPDPRG6= <mlev>
##$CPDPRG7= <mlev>
##$CPDPRG8= <mlev>
##$CPDPRGB= <>
##$CPDPRGT= <>
##$D= (0..31)
0 1 0 0 0 0 0 0 0 0.06 0 0 0 0 0 0 0.0002 0 0 0 0 0 0 0 0 0 0 0 0 0 0 
0 
##$DATE= 1154594890
##$DBL= (0..7)
120 120 120 120 120 120 120 120 
##$DBP= (0..7)
150 150 150 150 150 150 150 150 
##$DBP07= 0
##$DBPNAM0= <>
##$DBPNAM1= <>
##$DBPNAM2= <>
##$DBPNAM3= <>
$$ [...]
##$SUBNAM7= <"">
##$SUBNAM8= <"">
##$SUBNAM9= <"">
##$SW= 20.6930455092707
##$SWIBOX= (0..15)
0 0 3 0 0 0 0 0 0 0 0 0 0 0 0 0 
##$SW_h= 5175.983436853
##$TD= 65536
##$TD0= 1
##$TE= 295.16
##$TE2= 300
##$TE3= 300
##$TEG= 300
##$TL= (0..7)
0 120 120 120 120 120 120 120 
##$TP= (0..7)
150 150 150 150 150 150 150 150 
##$TP07= 0
##$TPNAME0= <>
##$TPNAME1= <>
##$TPNAME2= <>
##$TPNAME3= <>
##$TPNAME4= <>
##$TPNAME5= <>
##$TPNAME6= <>
##$TPNAME7= <>
##$TPOAL= (0..7)
0.5 0.5 0.5 0.5 0.5 0.5 0.5 0.5 
##$TPOFFS= (0..7)
0 0 0 0 0 0 0 0 
##$TUNHIN= 0
##$TUNHOUT= 0
##$TUNXOUT= 0
##$USERA1= <user>
##$USERA2= <user>
##$USERA3= <user>
##$USERA4= <user>
##$USERA5= <user>
##$V9= 5
##$VALIST= <valist>
##$VCLIST= <CCCCCCCCCCCCCCC>
##$VD= 0
##$VDLIST= <DDDDDDDDDDDDDDD>
##$VPLIST= <PPPPPPPPPPPPPPP>
##$VTLIST= <TTTTTTTTTTTTTTT>
##$WBST= 1024
##$WBSW= 4
##$XGAIN= (0..3)
0 0 0 0 
##$XL= 0
##$YL= 0
##$YMAX_a= 497992
##$YMIN_a= -359104
##$ZGOPTNS= <>
##$ZL1= 120
##$ZL2= 120
##$ZL3= 120
##$ZL4= 120
##$ABSF1= 16.522
##$ABSF2= -4.171173
##$ABSG= 5
##$ABSL= 3
##$ALPHA= 0
##$AQORDER= 0
##$ASSFAC= 0
##$ASSFACI= 0
##$ASSFACX= 0
##$ASSWID= 0
##$AUNMP= <proc_1d>
##$AZFE= 0.1
##$AZFW= 0.1
##$BCFW= 0
##$BC_mod= 0
##$BYTORDP= 0
##$COROFFS= 0
##$CY= 12.5
##$DATMOD= 1
##$DC= 0
##$DFILT= <>
##$DTYPP= 0
##$F1P= 14.0000005364418
##$F2P= -0.99999901652339
##$FCOR= 0.5
##$FTSIZE= 32768
##$FT_mod= 6
##$GAMMA= 0
##$GB= 0
##$INTBC= 1
##$INTSCL= 1
##$ISEN= 128
##$LB= 0.3
##$LEV0= 0
##$LPBIN= 0
##$MAXI= 10000
##$MC2= 0
##$MEAN= 0
##$ME_mod= 0
##$MI= 0
##$NCOEF= 0
##$NC_proc= -3
##$NLEV= 6
##$NOISF1= 0
##$NOISF2= 0
##$NSP= 0
##$NTH_PI= 0
##$NZP= 0
##$OFFSET= 16.522
##$PC= 1
##$PHC0= -10.86868
##$PHC1= 4.050968
##$PH_mod= 1
##$PKNL= yes
##$PPARMOD= 0
##$PSCAL= 4
##$PSIGN= 0
##$REVERSE= no
##$SF= 250.13
##$SI= 32768
##$SIGF1= 0
##$SIGF2= 0
##$SINO= 400
##$SIOLD= 32768
##$SREGLST= <1H.CDCl3>
##$SSB= 0
##$STSI= 32768
##$STSR= 0
##$SW_p= 5175.98343685301
##$SYMM= 0
##$S_DEV= 0
##$TDeff= 65536
##$TDoff= 0
##$TI= <Analysis number 999999
Compound Code 99
Book Reference 9
Project Code 9>
##$TILT= no
##$TM1= 0
##$TM2= 0
##$TOPLEV= 0
##$USERP1= <user>
##$USERP2= <user>
##$USERP3= <user>
##$USERP4= <user>
##$USERP5= <user>
##$WDW= 1
##$XDIM= 32768
##$YMAX_p= 343374049
##$YMIN_p= -28895
$$ End of Bruker specific parameters
$$ ---------------------------------
##NTUPLES= NMR SPECTRUM
##VAR_NAME=  FREQUENCY,     SPECTRUM/REAL,   SPECTRUM/IMAG
##SYMBOL=    X,             R,               I
##VAR_TYPE=  INDEPENDENT,   DEPENDENT,       DEPENDENT
##VAR_FORM=  AFFN,          ASDF,            ASDF
##VAR_DIM=   32768,         32768,           32768
##UNITS=     HZ,            ARBITRARY UNITS, ARBITRARY UNITS
##FACTOR=    0.157963299565203, 1,           1
##FIRST=     4132.6476996994, 0,             0
##LAST=      -1043.33573715361, 0,           0
##MIN=       -1043.33573715361, -28895,      0
##MAX=       4132.6476996994, 343374049,     0
$$ Real data points
##PAGE= N=1
##DATA TABLE= (X++(R..R)), XYDATA
$$ [...]
17067b068N256K45r5J386l039j183N530m33J740r68n391N94k278l730P211L797
17051F574n283n943n588l89M542N321M555L681k1j986J208l680l891o696J34J874
17035e588l6J373K839K396K975m935q79M100m738p560L197k193l436J910K929
17020g646M199k6R88n57j181l804lJ478l353m179L230O683K135l225l675Q45O083
17003b008J088J192n826n855K362R366M774M13l493l741K085P38L308l120N54
16988A837N131n349j1341m924R815O271O915p934j2017o016J0828L429j00K319
16974a136O457k461J064o385n661N769k04j999N736J0777M51j831k827m119q748
16959e117J824N108m037L37J449J066l303K296K256o848K607K931l633n083J472
$$ plain form
17067 -2068 3188 3433 3338 4724 1685 502 6032 5599 7339 6371 980 1574 -704 -4434 2777 6574
17051 6574 1291 -4652 -10240 -10629 -6087 -766 3789 7470 7449 5463 6671 2991 -900 -7596 -7462 -5588
17035 -5588 -5624 -4251 -1412 984 3959 -976 -1855 2245 -2493 -10053 -6856 -9049 -12485 -10575 -7646
17020 -7646 -3447 -3473 -2485 -3042 -4223 -8027 -8030 -6552 -9905 -14084 -10854 -4171 -2036 -5261 -8936 -8091 -2008
17003 -2008 -920 272 -5554 -11409 -9047 319 5093 5506 2013 -1728 357 1095 4403 1283 1837
16988 1837 6968 1619 -9722 -14646 -4831 1440 8355 421 -11596 -17612 -6784 -3355 -3455 -1136
16974 -1136 5321 2860 3924 -2461 -8122 -2353 -2557 -4556 1180 11957 12408 10577 7750 3631 -5117
16959 -5117 -3293 1815 -2222 -1885 -436 630 -2673 -377 1879 -4969 -2362 569 -3064 -8147 -6675
16944f675L406L711N291j790k5k220o45l407J487Q77J986m05j11k410O084K506
16928G660k989k404L425O696P103k125m591m346l427j949L450J857l034r64N77
16913D939K480K572j330J037k3m812k79m065N238m08m325p12N588R530P32m137
16897A2025N67r508q568M048P271j563p758N30J786J534N259M924k860n128m943
16882b384K886k881J141L508J952j12r30J287L21J889n834m425j031K799P48O28
16866d38O545m6m500k71k071l737j200J752K94J501J706k190p37M838K4J466n588
16849b652n193K421M595j797K20m364J552N291M90j491K942q087m703L759j879
16834h896l75J709k186O008L55J50L366J585j06K390j051N434j986j581q28j1189
$$ plain form
16944 -6675 -3269 442 5733 3943 3918 1698 1053 -2354 -867 10 1996 1591 1480 -930 5154 7660
16928 7660 4671 2267 5692 12388 19491 17366 12775 8429 5002 3053 6503 8360 5326 4362 4939
16913 4939 7419 9991 8661 9698 9675 4863 4584 519 5757 5349 1024 312 5900 15430 16162 12025
16897 12025 12592 3084 -5484 -1436 5835 4272 -3486 -2956 -1170 364 5623 10547 7687 2559 -2384
16882 -2384 502 -2379 -1238 2270 4222 4110 3180 4467 4788 6677 843 -3582 -4613 -1814 -1066 -438
16866 -438 6107 6061 1561 1290 -781 -4518 -5718 -3966 -3672 -2171 -465 -2655 -3392 1446 1470 2936 -2652
16849 -2652 -7845 -5424 -829 -2626 -2406 -6770 -5218 73 563 -928 2014 -6073 -10776 -7017 -8896
16834 -8896 -9271 -7562 -9748 -3740 -3385 -3235 131 1716 1610 4000 2949 8383 6397 4816 3988 -7201
16818g201m256J784L811K021r87J675L132k430q588M280K27L197L646k908k725
16803e322M668l017j187j649k114n049k660k12N188M345N479J213l480J957M74
16788a366o44O357Q691K531j738p830j4650k775L316l308K576P359N190J63n607
16773a735n114K176O863J686o154m908m478j17Q908O973k862m686p53K089k781
16758d893n89K226J780N371J872l766r346j714J360j900o179K476J0848L752o362
16743e064J461L899L11o528J1K539L790J270j506K038M355q107j811p89j28M184
16727g5j500K29l419L40j351L40o02L536O156L911l068K478j595L65o851p127
16711h233M382M024j726n686n050J170O483K402q745j00L192j813K94N125O651
$$ plain form
16818 -7201 -11457 -9673 -5862 -3841 -4828 -3153 -21 -2451 -11039 -6759 -6532 -3335 311 -2597 -5322
16803 -5322 -654 -3671 -4858 -6507 -8621 -13670 -16330 -16542 -11354 -7009 -1530 -317 -3797 -1840 -1366
16788 -1366 -2010 4347 13038 15569 13831 6001 -8649 -11424 -8108 -11416 -8840 -1481 3709 3872 -1735
16773 -1735 -6849 -4673 2190 3876 -2278 -7186 -11664 -11781 -2873 4100 1238 -3448 -4201 -2112 -4893
16758 -4893 -5482 -3256 -1476 3895 5767 2001 -7345 -9059 -7699 -9599 -15778 -13302 -2454 1298 -5064
16743 -5064 -3603 296 607 -5921 -5910 -3371 419 1689 183 2221 6576 -1531 -3342 -4131 -4259 -75
16727 -75 -1575 -1346 -4765 -4425 -5776 -5436 -6038 -2502 3654 7565 4497 6975 5380 5745 -1106 -8233
16711 -8233 -3851 173 -1553 -7239 -12289 -11119 -4636 -2234 -10979 -11079 -7887 -9700 -9406 -4281 2370
16696B370N46k711q91M34j471l211M00J383q65M953N366m452m085k344q4K162
16680b500k40n78l052K951M799P496o45p654l314j484l910l354N524M727j682
16665b916k789K627j510l413K520N30K903J172J808J880o347j716K441o000n025
16650a3835O317L408L59O484K852j952l101L80K976n352L264K653L055j591k780
16635C137m706N9J930n181l343N761L308L216j395n983j977N29K049l778J408
16620d966k444q290L691Q766K208L406L364L809o623p184J42N409M142L654n424
16605C660q535l780J0277O923j850m178k908P288Q26k152j009J184P27m30K023
16590H066L32q295j4477O190O734M625K243p217k068l807O78J380K556Q157n087
$$ plain form
16696 2370 2916 205 -686 -252 -1723 -4934 -4534 -3151 -4016 937 6303 1851 -2234 -4578 -4662 -2500
16680 -2500 -2740 -3318 -6370 -3419 1380 8876 8231 577 -2737 -4221 -8131 -11485 -5961 -1234 -2916
16665 -2916 -5705 -3078 -4588 -8001 -5481 -4951 -2048 -876 932 2812 -3535 -5251 -2810 -8810 -13835
16650 -13835 -7518 -4110 -3751 2733 5585 3633 532 912 3888 -1464 1800 4453 7508 5917 3137
16635 3137 -1569 -1510 420 -4761 -8104 -2343 965 4181 2786 -3197 -5174 -4645 -2596 -6374 -4966
16620 -4966 -7410 -15700 -12009 -3243 -1035 2371 5735 9544 2921 -4263 -4121 1288 5430 9084 3660
16605 3660 -4875 -8655 1622 8545 6695 2517 -391 6897 7723 5571 4562 5746 6473 6043 8066
16590 8066 8398 103 -14374 -8184 -1450 3175 5418 -1799 -3867 -7674 -6996 -5616 -3060 5097 10
16575A0l977j153m831K798P103J762j839l398l913j363q39K110M874l442k402
16560h500K120L090M084O331Q42j617n323k202l798m674J040n747J486K933N671
16545d264l16l667L68M401L67L932k84j457N5N378K581m575l676L194p588J432
16529d119O05l029K264j165L365P61L608j71L119m513r147K078K942m014K103
16514e313K623Q66M924n127j0140L885P075q06m261r20N56K418L982L571j596
16499A737P91j204L295l168l932n76q89l308n57l746l115J067N193P19j769L21
16483i141m118n347m874Q616J562K20M131P466M514L636k267o441l49k15k159
16468d766L118K351K582j350M6J409j155l868p971j865k660L775J550k406L423
$$ plain form
16575 10 -3967 -5120 -9951 -7153 -50 1712 -127 -3525 -7438 -8801 -9640 -7530 -2656 -6098 -8500
16560 -8500 -6380 -3290 794 7125 7967 6350 1027 -1175 -4973 -9647 -8607 -14354 -12868 -9935 -4264
16545 -4264 -4580 -8247 -7879 -3478 -3111 821 537 -920 -865 4513 7094 2519 -1157 2037 -5551 -4119
16529 -4119 -3514 -6543 -4279 -5444 -2079 -1318 2290 2119 5238 725 -8422 -6344 -3402 -7416 -5313
16514 -5313 -2690 -1824 3100 -2027 -12167 -8282 -1207 -2013 -6274 -7194 -6638 -4220 -238 3333 1737
16499 1737 2528 1324 4619 1451 -2481 -3057 -3946 -7254 -7811 -11557 -14672 -13605 -8412 -7693 -9462 -9141
16483 -9141 -13259 -18606 -23480 -14864 -13302 -13082 -8951 -1485 3029 6665 4398 -2043 -2392 -2607 -4766
16468 -4766 -1648 703 3285 1935 1981 3390 2235 -1633 -9604 -11469 -14129 -10354 -8804 -11210 -7787
16453g787j725L710M922m251p76M550J850O69q59j1290K11J0206L14k039K424
16438A29J346K12m341J630L538K3K657p44m519j087k433o229K12Q179N635n467
16422a259m9R16J172k205J53j324Q26O64j386k283j43R69J058J349k160j900j860
16405g462N937j637p719J190P59k113m042L632J796K096P70J277n05N809L786
16390C574p019k664k41L621j598j942j506J787K64Q36o836N687M025j180K528
16375f64R45n094l750j25M696n62K180M699K565k586m959o733l725l769Q15l003
16359a9070J2M481R738N850L6n377M513O350J156L230p291q291k152L195O757
16344C137J222o579J45K623k653J169N272j740m885K444m979m100k049m21Q579
$$ plain form
16453 -7787 -9512 -5802 -880 -5131 -5907 -1357 493 1162 303 -10987 -10776 -570 -256 -2295 129
16438 129 1475 1687 -2654 -1024 2514 2537 5194 4450 -69 -1156 -3589 -9818 -9606 -1427 4208 -1259
16422 -1259 -1308 -392 780 -1425 -1272 -2596 -1770 -1106 -2492 -4775 -4918 -3949 -2891 -1542 -3702 -5602 -7462
16405 -7462 -1525 -3162 -10881 -9691 -8932 -11045 -15087 -11455 -9659 -7563 -6793 -5516 -6021 -212 3574
16390 3574 -3445 -6109 -6350 -2729 -4327 -6269 -7775 -5988 -5724 -4888 -11724 -6037 -2012 -3192 -664
16375 -664 281 -4813 -8563 -8688 -3992 -4554 -2374 2325 4890 2304 -2655 -9388 -13113 -16882 -16067 -19070
16359 -19070 -19058 -14577 -4839 1011 1047 -4330 183 6533 7689 10919 3628 -4663 -6815 -3620 3137
16344 3137 4359 -2220 -2075 548 -2105 -936 4336 2596 -2289 155 -4824 -8924 -10973 -11394 -2815
16329b815L168j189m434k845J275N801j17j859k796O48N469M627m037p098o79
16314f881J556J37J897j305j836L002K520o560o217K924j725R85j628L099k491
16299a2523J22L758k88J615L468k661l597P754j21J295K650m549n262l271j323
16284a2933N417N606n35k520J390M677k845k585K328l11k724L333O521R69p035
16269a247j249M326Q83l120n034j65l908n667j64L773r32m870j485j73O6P179
16253a1787P31n92K453L013L31o99L070j300k907L777Q94J344l556J073n092r19
16237a0166M162mL933R98l693l795K196J982k335J292J837Q272m441J567k014
16222b09k194r81J269J76L077k696p447m057L284O512m364J141P191O964l482
$$ plain form
16329 -2815 353 -836 -5270 -8115 -6840 -1039 -1156 -3015 -5811 -5163 306 4933 896 -6202 -6881
16314 -6881 -5325 -5188 -3291 -4596 -6432 -3430 -910 -7470 -13687 -10763 -12488 -11503 -13131 -10032 -12523
16299 -12523 -12401 -8643 -8931 -7316 -3848 -6509 -10106 -2352 -2473 -1178 1472 -3077 -8339 -11610 -12933
16284 -12933 -7516 -1910 -2445 -4965 -3575 1102 -1743 -4328 -2000 -2311 -5035 -1702 4819 5788 -1247
16269 -1247 -2496 1830 2713 -407 -5441 -5606 -9514 -15181 -15345 -11572 -12504 -17374 -18859 -19032 -18966 -11787
16253 -11787 -11056 -11648 -9195 -6182 -5851 -6550 -3480 -4780 -7687 -3910 -3016 -1672 -5228 -4155 -9247 -10166
16237 -10166 -6004 -6008 -2075 -1077 -4770 -8565 -6369 -4387 -6722 -5430 -3593 4679 238 1805 -209
16222 -209 -2403 -3384 -2115 -1939 1138 -1558 -9005 -13062 -9778 -3266 -7630 -6489 702 7666 4184
16207D184o568J153K161Q77k20j256M681K747j242k117K897m007m320q677l253
16192a2960N344J999j129k493m068O93Q129J133p867l593N961J2071M563o039
16178A744k115K408k831o757L148K460O164L244j72j857J026n736k803O436K38
16163D597r722k510O91O078J496M737K966o740o024k715j58L61L397L584k761
16148b723j611J323M205k352k859M500N70k691J391K161L06k357j306j26k483
16133d052n657M67K394N272J329M377J1442Q60n104n358K071j672p192j0498l633
16118a4954J990Q111O406L954p86L984j80o040k867m674J925L951M02P81j820
16103A83k317k075m67K145j572o471n44K691L175K857K463j28l395j038k829o640
$$ plain form
16207 4184 -2384 -1231 930 1807 1587 331 5012 7759 6517 4400 7297 3290 -1030 -9707 -12960
16192 -12960 -7616 -5617 -6746 -9239 -13307 -12614 -4485 -3352 -11219 -14812 -8851 3220 7783 1744
16178 1744 -371 2037 -794 -7551 -4403 -1943 4221 7465 7293 5436 6462 726 -2077 4359 4597
16163 4597 -5125 -7635 -6944 -866 630 5367 8333 1593 -4431 -7146 -7304 -6943 -3546 38 -2723
16148 -2723 -4334 -3011 1194 -1158 -4017 483 1053 -1638 -247 1914 2220 -137 -1443 -1569 -4052
16133 -4052 -9709 -9242 -6848 -1576 -247 4130 15572 16432 11328 5970 8041 6369 -823 -11321 -14954
16118 -14954 -12964 -4853 1553 5507 4721 8705 8525 2485 -382 -5056 -3131 820 1222 2003 183
16103 183 -2134 -4209 -4676 -2531 -4103 -10574 -11118 -8427 -5252 -2395 68 -60 -3455 -4493 -7322 -13962
16087a3962J527r61Q79L493j980k276J578J698L57j248J168L057K436N563q11
16072E18j492k732n517J205M483N359M663J957j684n560j388n752j1574N84Q368
16057h562R777r54j186n64P58m510m357N024K679J537L802M163R18l498j88k039
16041B800Q72L268L126Q16J700l370m722j158O60m077l977l342M487P598M313
16026H994j134l532K076l221m073M142L209L077J687l813p038L84J476l420m954
16011f140j450j60R697j087l055l098l097M333J500M289L446p753j755N154K918
15996C742j4046m232J0285Q828M065n547m279L013J403k69k060Q443l870J696
15982G172M026j729n354m705Q01N821m009q098l710P24l6l136J105K833L053R74
$$ plain form
16087 -13962 -12435 -13396 -12517 -9024 -11004 -13280 -11702 -10004 -9647 -10895 -9727 -6670 -4234 1329 518
16072 518 -974 -3706 -9223 -8018 -3535 1824 6487 8444 6760 1200 -188 -5940 -17514 -16930 -8562
16057 -8562 1215 261 -925 -1489 -731 -5241 -9598 -4574 -1895 -358 3444 7607 8525 5027 4839 2800
16041 2800 3672 6940 10066 10882 12582 9212 4490 3332 3992 -85 -4062 -7404 -2917 4681 8994
16026 8994 7860 4328 6404 3183 -890 3252 6461 9538 11225 7412 374 758 2234 -1186 -6140
16011 -6140 -7590 -7750 1947 860 -2195 -5293 -8390 -4057 -2557 1732 5178 -2575 -4330 824 3742
15996 3742 -10304 -14536 -4251 4577 8642 3095 -1184 1829 3232 2963 903 9346 5476 7172
15982 7172 11198 9469 4115 -590 211 6032 2023 -6075 -9785 -9061 -9097 -12233 -11128 -8295 -5242 -4268
15966d268L203K051l300O805P53o252m123p44L249j394j544J752m218O59N480
15951a891P30J641j139J074J953K355j515n82j673k202O686k644m363M896N96
15936C922l784n829j616Q029K694j702n983j485K575J862K015M30L534N020O466
15921A6148l571o274l481j500m09m892M87r11k862P31Q603L202m820n457k52J005
15905d253q499j421N823K868o336j336Q390K74j341p35m072O277J198N083j567
15890C53J838N51j828n176J841L850K57Q36m882j951o270n480M080l85L089O607
15874b670N409M896l648p034J625j952L339J512k398m847K687K710K052j513m34
15859b66O016R8m467l275j994J48p866l95M538K754l061O75K669M64K718P94k895
$$ plain form
15966 -4268 -1065 986 -2314 4491 5244 -1008 -5131 -5875 -2626 -4020 -5564 -3812 -8030 -7371 -1891
15951 -1891 -1161 480 -659 415 2368 4723 3208 2626 953 -1249 5437 2793 -1570 3326 3922
15936 3922 138 -5691 -7307 722 3416 1714 -4269 -5754 -3179 -1317 698 1128 4662 9682 16148
15921 16148 12577 6303 2822 1322 913 -3979 -3492 -4403 -7265 -6534 2069 5271 451 -5006 -5258 -4253
15905 -4253 -12752 -14173 -8350 -5482 -11818 -13154 -4764 -4490 -5831 -6566 -10638 -4361 -3163 1920 353
15890 353 2191 2742 914 -4262 -2421 1429 1686 2522 -2360 -4311 -10581 -16061 -11981 -12366 -9277 -2670
15874 -2670 2739 7635 3987 -3047 -1422 -3374 -35 1477 -921 -5768 -3081 -371 1681 168 -266
15859 -266 5750 5848 1381 -1894 -3888 -3740 -11606 -12001 -7463 -4709 -7770 -7095 -4426 -3962 -1244 -450 -3345
15842c345L71M364n966r695o46L897L818j920j244L891K20k583M275K446q71J22
15826b866M72k88n784M103M702p480q16M477l531L736p554m921R253L075n083
15811h505J017L253N38n011K649j077k035J109N927Q726k983j824j036k77O64
15796A135J47m077m276l432m806M795J617j67N465M222n580r824k125L148K865
15781a0893L353j043j658M408L911q413K673R27m915N179L370k166N288M997m211
15766H07J448K320k970k987M390N813j938o691m785J703N12K809N605L161m075
15751E122n531k746O19J858l300P35o1r197o908O19M788K753M503O453k184p816
15735a0293N286L961K152j071m379N76k525J498J321K088l061K374K293q652j0357
$$ plain form
15842 -3345 -2974 1390 -4576 -14271 -14917 -11020 -7202 -9122 -10366 -6475 -6255 -8838 -4563 -2117 -2988 -2866
15826 -2866 -2394 -2682 -8466 -4363 339 -7141 -7957 -3480 -7011 -3275 -10829 -15750 -6497 -3422 -8505
15811 -8505 -7488 -4235 -3697 -8708 -6059 -7136 -9171 -8062 -2135 6591 3608 1784 748 471 1135
15796 1135 1282 -2795 -7071 -10503 -15309 -10514 -8897 -9064 -3599 623 -4957 -14781 -16906 -13758 -10893
15781 -10893 -7540 -8583 -10241 -5833 -1922 -10335 -7662 -6735 -11650 -6471 -3101 -5267 21 5018 807
15766 807 2255 4575 1605 -1382 3008 8821 6883 192 -4593 -2890 -2378 431 6036 9197 5122
15751 5122 -409 -3155 -2536 -678 -3978 -3243 -3304 -12501 -19409 -18790 -14002 -11249 -6746 -293 -2477 -10293
15735 -10293 -5007 -1046 1106 35 -4344 -3768 -6293 -4795 -3474 -1386 -4447 -2073 220 -8432 -18789
15720a8789J459J947J656N138N159K347K404K043k950k234m323m210k302m529
15706a7184j265K802N914m51j436k421P316N930m624m582k703O218L930M118J078
15691B640m969j579K795L522J638L41N121l793o792n53l682o672l883K279R442
15676d145M755j344l412M567L842Q32N93N275q14o347o951m941O146p30n89L663
15660D00k599p209K647O064Q572K04r282p196k062N503L550N71l374j19N293R89
15644A952k059q36J731M742k107j612k301R74k941L647K433Pr64q634k499M267
15628d200j867j805q29L99P355L436K458M19j671m364n27n526m740K003L99j596
15612a0656j136N576k319l287N096M221j690k235L319R705o238m163L310k427
$$ plain form
15720 -18789 -17330 -15383 -13727 -8589 -3430 -1083 1321 3364 414 -1820 -6143 -10353 -12655 -17184
15706 -17184 -18449 -15647 -9733 -10184 -11620 -14041 -6725 -795 -5419 -10001 -12704 -6486 -2556 1562 2640
15691 2640 -2329 -3908 -1113 2409 4047 4388 9509 5716 -1076 -1629 -5311 -11983 -15866 -13587 -4145
15676 -4145 610 -734 -4146 421 4263 5095 5688 10963 10149 3802 -3149 -8090 -1944 -2674 -3263 400
15660 400 -2199 -9408 -6761 -697 7875 8079 -1203 -8399 -10461 -4958 -1408 -837 -4211 -4330 963 1952
15644 1952 -107 -943 788 5530 3423 1811 -490 484 -2457 1190 3623 3630 2666 -5968 -8467 -4200
15628 -4200 -6067 -7872 -8701 -8302 -947 2489 4947 5366 3695 -669 -1196 -6722 -11462 -9459 -9060 -10656
15612 -10656 -11792 -6216 -8535 -11822 -6726 -2505 -4195 -6430 -3111 6594 356 -3807 -497 -2924
15598b924l211k776L210k842m766K418J609M019N665K052L797k046k597J234J409
15583D251K73k006J96k505M580o244k50p13O693M155l901l801l658M736l787k323
15567d304P3o12k744o63K152J178m659M58K319m128N988J108k904N007P211M818
15551A0298k046k728K721K064o897q622N273N076p969k073L326K913j738n13J637
15536G22K024k656N21l326K95m349k335M501N72l21N165k590j533N71K808j751
15520a682m244j197N723M662N11l067p019l557l57o758R481P000l871j469J723
15505d121K159L692M121K741m39n10K755l952k495j603Q92K377m748k29M818m69
15489D989l600J346M776J674k671n900l507M211L162k43Q32K859o987K268O997
$$ plain form
15598 -2924 -6135 -8911 -5701 -8543 -13309 -10891 -9282 -5263 402 2454 6251 4205 1608 2842 4251
15583 4251 4524 2518 2714 209 4789 -1455 -1705 -2418 4275 8430 4529 728 -2930 1806 -1981 -4304
15567 -4304 -4231 -4843 -7587 -8250 -6098 -4920 -9579 -9121 -6802 -10930 -4942 -3834 -6738 -1731 5480 10298
15551 10298 8252 5524 8245 10309 3412 -5210 63 5139 -2830 -4903 -1577 1336 -402 -915 722
15536 722 2746 90 611 -2715 -2420 -6769 -9104 -4603 -4031 -4352 813 -1777 -3310 -2739 69 -1682
15520 -1682 -5926 -7123 -1400 3262 3773 706 -6313 -9870 -10227 -16985 -7504 -504 -4375 -5844 -4121
15505 -4121 -1962 1730 5851 8592 8153 7643 10398 6446 3951 2348 3240 5617 869 640 5458 4989
15489 4989 1389 2735 7511 9185 6514 614 -2893 1318 4480 4237 5069 7928 941 3209 10206
15474A0206J222j711l962n121m52j347L69n361J550R704J2j618P97j1764k929
15459a0405M466P037P73M766j865n259k138j12K806j558J828l44j048Jj690R46
15443a796n93l137q79K020m306n37L557K354L235K694J476n606k054P73P236L264
15427G701r82n486l655o98L161K689K595l901p716M386L843K213l838P42l106
15412b052n777j0429P437M576l732o8M232Q994K870Q1p181j970M066j821p158
15397g932J475j703m169m282m001N897J5912K964l027n051k126l814j488M190
15383g155J767k392O98J937j064p6K082J066n951k614M027J723m64q40K836m19
15367d839l397n23O04m034j962K959m882l452N069P311K914n70K023J139q90P40
$$ plain form
15474 10206 11428 9717 5755 634 182 -1165 -796 -6157 -4607 5097 5109 3491 4288 -7476 -10405
15459 -10405 -5939 1098 1871 6637 4772 -487 -2625 -2737 69 -1489 339 -5 -1053 -1052 -2742 -1796
15443 -1796 -2389 -5526 -6405 -4385 -8691 -9228 -5671 -3317 -82 2612 4088 -1518 -3572 -2799 4437 7701
15427 7701 6719 1233 -2422 -3120 41 2730 5325 1424 -6292 -1906 1937 4150 312 1054 -2052
15412 -2052 -7829 -18258 -10821 -6245 -9977 -10045 -5813 3181 6051 6132 -1049 -3019 1047 -774 -7932
15397 -7932 -6457 -8160 -12329 -16611 -20612 -14715 1197 4161 1134 -3917 -6043 -9857 -11345 -7155
15383 -7155 -5388 -7780 -7082 -5145 -6209 -6285 -4203 -3137 -9088 -11702 -7675 -5952 -6416 -7256 -4420 -4839
15367 -4839 -8236 -8759 -8155 -12189 -14151 -11192 -16074 -19526 -14457 -7146 -4232 -4802 -2779 -1640 -2530 -1790
15351a790K029j424K74m55r50M88K194n390k753J722L432L28m350k65J411Q701
15335C202O75r922k5J467l677K348N641l649j556R66o365J471J069k50l67M569
15319d403P399N877j431q888j1131l756L043K682O741K195l636L470J351N70m797
15304d714k614J559j388M023J360K73k61o368n252P87M894O942l658k305O128
15289e94Q20j398q96j603J171j198l279J332J944O388l549o055n22J363j582m54
15273h112J230m098q09P026m194l200K069j251o605J806O402P855J148K58L532
15258C057k989m634L5P885p507k466j966m012L459m6r94M747L959n709l395l401
15242a3977J797J354q627j731r28L317P965O237L650N91J763m370r05J497r95
$$ plain form
15351 -1790 239 -1185 -911 -1366 -2316 -1828 366 -5024 -7777 -6055 -2623 -2295 -6645 -6910 -5499 3202
15335 3202 3877 -6045 -6070 -4603 -8280 -5932 -291 -3940 -5496 -4530 -10895 -9424 -8355 -8605 -8972 -4403
15319 -4403 2996 8873 7442 -1446 -12577 -16333 -13290 -10608 -3867 -1672 -5308 -1838 -487 83 -4714
15304 -4714 -7328 -5769 -7157 -3134 -1774 -1501 -1762 -8130 -13382 -12595 -7701 -759 -4417 -6722 -594
15289 -594 226 -1172 -2068 -3671 -2500 -3698 -6977 -5645 -3701 2687 -862 -6917 -7439 -6076 -7658 -8112
15273 -8112 -6882 -10980 -11789 -4763 -8957 -12157 -10088 -11339 -17944 -16138 -9736 -1881 -733 -475 3057
15258 3057 68 -4566 -4531 3354 -4153 -6619 -8585 -12597 -9138 -9184 -10178 -5431 -1472 -7181 -10576 -13977
15242 -13977 -12180 -10826 -19453 -21184 -22112 -18795 -10830 -4593 -943 -352 1411 -2959 -3864 -2367 -3362
15227c362k771j841L53N011K947M23j632l359j784k545O99J260k227k789R510
15212b107m298o27K305m641l640P483j091j711R502L540k311l216n391m824l940
15197a4967o72O66J033O558l026L626r12j470m289k848%Q229J398L464l78q026
15181a1614m6N848M442k198l167k966q08M21K409m591j932J431Q33M194K820j686
15165f610j794l702L884L534O054K646K691L28J085k775l598l47j008J736K37
15150B361m366j670L40P82K688M498N223J906j047k240k705k592K356J485n182
15135A837l145K190k766l425l774N970J463J420L58k57j664j832j597m09r4K699
15119c026l205n3R63n717L23L516N65N769K776o492k973L094j386k26N388R53
$$ plain form
15227 -3362 -6133 -7974 -7621 -2610 337 760 -872 -4231 -6015 -8560 -7861 -6601 -8828 -11617 -2107
15212 -2107 -6405 -7032 -4727 -9368 -13008 -5525 -6616 -8327 1175 4715 2404 -812 -6203 -11027 -14967
15197 -14967 -15639 -14973 -13940 -7382 -10408 -6782 -7694 -9164 -13453 -16301 -16301 -8072 -6674 -3210 -3588 -11614
15181 -11614 -11660 -5812 -1370 -3568 -6735 -9701 -10509 -10088 -7679 -12270 -14202 -12771 -11938 -7744 -4924 -6610
15165 -6610 -8404 -12106 -8222 -4688 1366 4012 6703 7031 8116 5341 1743 1396 388 2124 2361
15150 2361 -2005 -3675 -3335 -2553 135 4633 9856 11762 10715 8475 5770 3178 5534 7019 1837
15135 1837 -1308 882 -1884 -5309 -9083 -3113 -1650 -230 128 -129 -1793 -3625 -5222 -5631 -5725 -3026
15119 -3026 -6231 -6284 -5321 -11038 -10715 -7199 -6634 -865 1911 -4581 -7554 -4460 -5846 -6072 -684 269
15103B69k768n023L071O463K06p193j112k931N735R771p26R21j440O9L87j061
15087D638j80o207R04r76N59O52j244O57k841N65M962k569K76j959j21l97m21
15070c702m81k762J700J1198j290k030m47M02l604j236j486k334L310J682o10
15055a690j806k229j577J91L677K493L242q052l414R34O611L811k749m433N731
15040G40q55j1791L270K740k828q89j120n25L923k248J807O14L1N400N334n089
15024a486m822j191p01P306L529k153M2n696l822k902R73j873k497J406O689K90
15008f908J223J618J270L009j009K309p857q277P72J516K855K636l446j363M183
14993g469M182j923m866m092J517M080N896J602R82J495K747k191j516M03M102
$$ plain form
15103 269 -2499 -7522 -4451 2012 2218 -4975 -6087 -9018 -3283 6488 5762 6683 5243 5312 5699 4638
15087 4638 4458 -1749 -845 -1821 -1262 -610 -1854 -1197 -4038 -3473 1489 -1080 -804 -2763 -2884 -3281 -3702
15070 -3702 -4183 -6945 -5245 5953 4663 2633 2186 2588 -1016 -2252 -3738 -6072 -2762 -1080 -1690
15055 -1690 -3496 -5725 -7302 -7111 -3434 -941 2301 -5751 -9165 -8231 -1620 2191 -558 -4991 740
15040 740 -115 -11906 -8636 -5896 -8724 -9613 -10733 -11258 -7335 -9583 -7776 -7162 -7131 -1731 3603 -1486
15024 -1486 -6308 -7499 -8200 -894 2635 482 524 -5172 -8994 -11896 -10923 -12796 -15293 -13887 -7198 -6908
15008 -6908 -5685 -4067 -2797 212 -797 1512 -6345 -14622 -13850 -12334 -9479 -6843 -10289 -11652 -7469
14993 -7469 -3287 -5210 -10076 -14168 -12651 -8571 -2675 -1073 -91 1404 4151 1960 444 847 4949
14978D949O105L639n365p896r34J637P371K974n489n590L384K763O19R47p473
14963A641q582l959L085J563M80M245M518M403q13O131m622p912l842n144K533
14948f275M018N562k913l708M018k966m625K9j42m513O809O338k807o936j882
14933i993k716K63L202K112J265N340L667J266M57M309o05o573j133M505m862
14918E04o498j834k547m08O932J379L716j513k105n32o430k672L351j923M748
14903e832J876M196O740N1n063o795Q15K141j688k47J075K66j606n974Q78j679
14887a0846K632J34J519K820K351K183m914q313J4N654K673k22l719l102J480
14872i656K509K071J559J843q89m321L574j730n28M898k007K72N55O02L294p113
$$ plain form
14978 4949 11054 14693 9328 1432 498 2135 9506 12480 6991 1401 4785 7548 8167 9114 1641
14963 1641 -6941 -10900 -7815 -6252 -5772 -1527 2991 7394 6581 12712 8090 178 -3664 -8808 -6275
14948 -6275 -2257 3305 392 -3316 702 -2264 -6889 -6860 -7002 -11515 -4706 1632 -1175 -8111 -9993
14933 -9993 -12709 -12446 -9244 -7132 -5867 -527 3140 4406 4863 9172 8567 1994 861 5366 504
14918 504 -5994 -7828 -10375 -10783 -3851 -2472 1244 -269 -2374 -2906 -9336 -12008 -8657 -10580 -5832
14903 -5832 -3956 240 6980 7031 1968 -4827 -4012 -1871 -3559 -3806 -2731 -2465 -4071 -10045 -9167 -10846
14887 -10846 -8214 -8080 -6561 -3741 -1390 793 -4121 -12434 -12420 -6766 -4093 -4315 -8034 -11136 -9656
14872 -9656 -7147 -5076 -3517 -1674 -2563 -6884 -3310 -5040 -5568 -670 -2677 -2405 -1850 -1248 2046 -5067
14856e067K171K514r44n525l077j579j214P848M369L954l293m117kJ342N33l29
14840b416m707l955J966R92K815j864Q76L561r256l248O941k374l413L395O079
14825d608K950j181n329M540l70k151m796J117K094K911L45p69J121j520l652
14810i298L946r85Q086j871l224O105m542L577L590r58m389n765j871N929K285
14795F15R84M455J101j692J84p787j0605j539l240k429L54J83M866N139J592K554
14779e265N407M992J494q714o311K521r54P703K232P330m734m344n468j917N481
14764e47l693l274k1J96q16l810O909L276n198j123K669K640m284m816j97N306
14748f783N73M741N884k924r647M43N175q44j8L727j614Q08K283m909j295Q61
$$ plain form
14856 -5067 -2896 -382 -1326 -6851 -9928 -11507 -12721 -4873 -504 3450 157 -3960 -3962 -2620 -2087 -2416
14840 -2416 -7123 -11078 -9112 -8120 -5305 -7169 -6293 -2732 -11988 -15236 -8295 -10669 -14082 -10687 -4608
14825 -4608 -1658 -2839 -8168 -3628 -3998 -6149 -10945 -9828 -7734 -4823 -4478 -5247 -4126 -5646 -9298
14810 -9298 -5352 -6337 1749 -122 -3346 2759 -1783 1794 5384 4426 37 -5728 -7599 -1670 615
14795 615 1599 6054 7155 5463 5647 -2140 -12745 -14284 -17524 -19953 -19599 -19416 -14550 -9411 -7819 -5265
14779 -5265 142 5134 6628 -2086 -8397 -5876 -6830 873 3105 10435 5701 1357 -4111 -6028 -547
14764 -547 -4240 -7514 -7535 -7339 -8155 -11965 -5056 -1780 -6978 -8101 -5432 -2792 -7076 -11892 -12089 -6783
14748 -6783 -6210 -1469 4415 1491 -8156 -7713 -2538 -3382 -3400 327 -1287 -479 1804 -3105 -4400 -3539
14732c539J932k328j406J905M231O544K094l99k665n188K463l062J603N42l38
14717B389J738l554j1070N309K777o59n08l092R86k71K214M053k289L503j033
14702D93m882J801l29k223j269m220Nl970j554l274M236K805N667M369J332j619
14686b632J83L112j439K723N549K424j1981l590k131p703j832M638J816k696k0
14671a3579P768J597j917j964o60K931N246j712k343p07J552n66m659J536K462
14656e015N922M461j124r194J786M999L19l385o639K59k300L941Q102k640l224
14641c732K049J488j808m042r22M386j052p08k797j935K765Q400j930j194k555
14626c587K138l421o57k236L873p44k027K259J053N496L720p760j123L044k529
$$ plain form
14732 -3539 -1607 -3935 -5341 -3436 795 7339 9433 9034 6369 1181 3644 582 2185 2727 2389
14717 2389 4127 573 -10497 -5188 -2411 -3070 -3578 -6670 -5684 -5955 -3741 312 -1977 1526 493
14702 493 -4389 -2588 -2917 -5140 -6409 -10629 -10624 -14594 -16148 -19422 -15186 -12381 -6714 -2345 -1013 -2632
14686 -2632 -2449 663 -776 1947 7496 9920 -2061 -5651 -7782 -15485 -17317 -12679 -10863 -13559 -13579
14671 -13579 -5811 -4214 -6131 -8095 -8755 -5824 -578 -2290 -4633 -5340 -3788 -4354 -9013 -7477 -5015
14656 -5015 907 5368 4244 -4950 -3164 1835 2154 -1231 -7870 -7611 -9911 -5970 2132 -508 -3732
14641 -3732 -1683 -195 -2003 -6045 -6967 -2581 -3633 -4341 -7138 -9073 -6308 2092 162 -1032 -3587
14626 -3587 -1449 -4870 -5527 -7763 -3890 -4634 -6661 -4402 -3349 2147 5867 -1893 -3016 28 -2501
14611b501l480O265m114O90N053p14l874j870j395m18P136P122j5433p857K549
14596a2841R734K50L128R92k14k172K129M808m774j033j59j489N886l063m335
14581c153J344K509P59M172k844m426K2M522K267p478j0070l568O168M315l288
14566h749n992j023J699K175Q0k993l032O014Q699k030r911m219L109L979N958
14551f236P56l579L571M284l331m725J93J776K655P23m165J473M154l188j689
14536g328P79L276N573K961k856j169k705Jm908o13J269L534N422j957n123O837
14520B993l944j0084k075J688j36l419M58K316M428k176m82k088L701M108N40
14505d172k137J622J586Q30k389J441k187J208L575K120o789j431L885k440m423
$$ plain form
14611 -2501 -5981 284 -3830 -3140 1913 1199 -2675 -4545 -5940 -6358 778 7900 -7533 -15390 -12841
14596 -12841 -3107 -2857 271 1263 1049 -1123 1006 5814 1040 7 -152 -1641 4245 1182 -3153
14581 -3153 -1809 700 1459 5631 2787 -1639 -1617 2905 5172 -2306 -12376 -15944 -9776 -5461 -8749
14566 -8749 -14741 -15764 -14065 -11890 -11810 -14803 -17835 -11821 -3122 -5152 -15063 -19282 -16173 -12194 -6236
14551 -6236 -5480 -9059 -5488 -1204 -4535 -9260 -9067 -7291 -4636 -3913 -8078 -6605 -2451 -5639 -7328
14536 -7328 -6549 -3273 2300 5261 2405 1236 -1469 -1468 -6376 -6989 -5720 -2186 3236 1279 -3844 2993
14520 2993 -951 -11035 -13110 -11422 -11558 -14977 -14519 -12203 -7775 -9951 -10433 -12521 -8820 -4712 -4172
14505 -4172 -6309 -4687 -3101 -2271 -4660 -3219 -5406 -4198 -623 1497 -5292 -6723 -2838 -5278 -9701
14490i701M233J933k756o298L557O943N179l165o488j268j578k712L379k867l501
14475a5110J745N967k138M22R667K893j846m110m568n786K429n15o019P76N607
14460a0586L197k502j497J959M196m75j125M54J759l38k020k36J527m857j918
14445a2462P320k121k678l340j648J549m65o49K051N028m241j648J970N673L075
14430b586m973J062J285r04K120M683K563q520q974q02R559l010K476M361J480
14415a80k201R08j670j001n71K494j390l128j839k74k964K068M524K821j247k869
14399f519k950n257j514O04K660K537L65j929k228P394P947M815K335p363n417
14384d520Q20j0210l395P980P33m127r12n39N479O612P48k370M297p428l912J740
$$ plain form
14490 -9701 -5468 -3535 -6291 -12589 -9032 -2089 3090 -75 -6563 -7831 -9409 -12121 -8742 -11609 -15110
14475 -15110 -13365 -7398 -9536 -9114 553 3446 1600 -2510 -7078 -12864 -10435 -10950 -16969 -16193 -10586
14460 -10586 -7389 -9891 -11388 -9429 -5233 -5708 -6833 -6379 -4620 -4958 -6978 -7214 -5687 -10544 -12462
14445 -12462 -5142 -7263 -9941 -13281 -14929 -13380 -13845 -14494 -12443 -7415 -11656 -13304 -11334 -5661 -2586
14430 -2586 -7559 -6497 -5212 -6116 -3996 687 3250 -5270 -14244 -15046 -5487 -8497 -6021 -1660 -180
14415 -180 -2381 -1473 -3143 -4144 -4715 -2221 -3611 -6739 -8578 -8852 -11816 -9748 -5224 -2403 -3650 -6519
14399 -6519 -9469 -14726 -16240 -15636 -12976 -10439 -10074 -12003 -14231 -6837 1110 5925 8260 897 -4520
14384 -4520 -3700 -13910 -17305 -9325 -8592 -12719 -13631 -14170 -8691 -2079 -1331 -3701 596 -6832 -10744 -9004
14368i004M831l214l469j02N206J926l133l514k1k686M603M55k946k699P517R57
14352e293j654q53J698L161J285J613j853J372m35k183j828k762J789J032k334
14337g245o812j206J522P950o973k527N371P87M295K532p71l992l229R387L505
14322B594l586p518R88P291O490p437o401m944O989P493m482m857K95j372K925
14307e532O607o822l11q73n83N860l583M399N488J90l800n138r7l334j17r89j88
14290h823J836J454j46L758j105n78R43k780n044p89L645J503J860L392K007K88
14274A421n685j990N629K791j355l427l351j379l120K144J027M85k823l711M561
14259h783J1433m36p566Q38p5j408k730K446J775k771k644j557L010k388K501
$$ plain form
14368 -9004 -4173 -7387 -10856 -10958 -5752 -3826 -6959 -10473 -10494 -13180 -8577 -8122 -11068 -13767 -6250 -5293
14352 -5293 -6947 -7800 -6102 -2941 -1656 -43 -1896 -524 -959 -3142 -4970 -7732 -5943 -4911 -7245
14337 -7245 -14057 -15263 -13741 -5791 -12764 -15291 -9920 -9133 -4838 -2306 -3077 -7069 -10298 -911 2594
14322 2594 -992 -8510 -7522 -231 6259 -1178 -7579 -12523 -5534 1959 -2523 -7380 -7085 -8457 -5532
14307 -5532 1075 -5747 -6058 -6931 -7514 -1654 -5237 -838 4650 4840 1040 -4098 -4195 -7529 -7646 -8635 -8823
14290 -8823 -6987 -5533 -5679 -1921 -3026 -3604 -2661 -5441 -10485 -11274 -7629 -6126 -4266 -874 1133 1421
14274 1421 -4264 -6254 -625 2166 811 -2616 -5967 -7346 -10466 -8322 -7295 -6810 -9633 -13344 -8783
14259 -8783 2650 2214 -5352 -4514 -4589 -5997 -8727 -6281 -4506 -7277 -9921 -11478 -8468 -10856 -8355
14244h355J268o709K216K347J820j334K923J918J880J715j881n671J528N407J670
14229G42j239m365J504K282r57k030K810q54N895L991q917L73K369K823l67Q38
14213D898j668n021n140j689m531m12L757L688J279k223n539K431J679O846k65
14198a910k719k320M675k605l679m861k644K030K562J544K333O607l078k299L056
14183c308M054j180O836m177o70p22j508l378n19j842j896P5N259L070l896j334
14167e136j637M667K649M422j02k080k388j590j764j416j0865O337J2648l500
14153B45j0207r43K637M222M722m49l075k950k884K826M767Q14l775M996M873
14138E819N298o829o406m519j185L431J099K346O02J911l255k986J344P88n70
$$ plain form
14244 -8355 -7087 -13796 -11580 -9233 -7413 -8747 -5824 -3906 -2026 -311 -2192 -7863 -6335 -928 742
14229 742 -497 -4862 -3358 -1076 -2033 -4063 -1253 -2107 3788 7779 -1138 -765 1604 4427 4060 4898
14213 4898 3230 -1791 -6931 -8620 -13151 -13563 -9806 -6118 -4839 -7062 -12601 -10170 -8491 -1645 -1910
14198 -1910 -4629 -6949 -2274 -4879 -8558 -13419 -16063 -14033 -11471 -9927 -7594 -987 -4065 -6364 -3308
14183 -3308 746 -434 6402 2225 1555 833 -675 -4053 -4572 -6414 -8310 -8235 -2976 94 -3802 -5136
14167 -5136 -6773 -2106 543 4965 4863 2783 395 -1195 -2959 -4375 -15240 -8903 3745 245
14153 245 -9962 -10905 -8268 -4046 676 227 -2848 -5798 -8682 -5856 -1089 -275 -4050 946 5819
14138 5819 11117 4288 -2118 -6637 -7822 -4391 -3292 -946 -344 1567 -1688 -4674 -3330 -2542 -3112
14123c112J317p94m386m716K04K474M073n81j277K260L040J409N58k282k708j445
14107e966j274M679r50n77L691J775P020l626m581n059o297L193R68j479r64M678
14091d769l353l891L098O404j410J072K33k099l337l270M951K957J035N37n4p899
14075i795k66K479m351n420j28o29P87L916J894r45O447Q056J38L960K067l612
14059D598l752L218J0169n144l271J717l98k760J65l597j548l041j07N19l091
14044f323k061j395Q05K105j341n033J191M331M185m570N438Q796l9q152n332
14029g395j713L821R136K333j365k280o434n512l009L053L785K508j17n654M645
14014d198j971L36O120m166l718K963N503K080K002j984Q30j186m673l813p90
$$ plain form
14123 -3112 -1795 -2589 -6975 -11691 -11487 -9013 -4940 -5521 -6798 -4538 -1498 -89 469 -1813 -4521 -5966
14107 -5966 -7240 -2561 -3511 -4088 -397 1378 8398 4772 191 -4868 -11165 -7972 -7004 -8483 -9447 -4769
14091 -4769 -8122 -12013 -8915 -2511 -3921 -2849 -2616 -4715 -8052 -11322 -6371 -3414 -2379 -1842 -1896 -9795
14075 -9795 -10061 -7582 -11933 -17353 -17481 -18110 -17323 -13407 -11513 -12458 -6011 2045 2183 6143 8210 4598
14059 4598 846 4064 14233 9089 5818 7535 7137 4377 4542 945 -603 -3644 -3751 -3232 -6323
14044 -6323 -8384 -9779 -8974 -6869 -8210 -13243 -12052 -7721 -3536 -8106 -2668 6128 6089 -2063 -7395
14029 -7395 -9108 -5287 3849 6182 4817 2537 -3897 -9409 -12418 -9365 -5580 -3072 -3189 -8843 -4198
14014 -4198 -6169 -5833 287 -3879 -7597 -4634 869 2949 4951 2967 3797 2611 -2062 -5875 -6665
13999f665L65K656n4N185J700l941k793q71o068J609M858P160Q253M12j629n066
13983E111l198o65M205J38l684O489K940r22L084P771L552j403k71P246J4952
13968D5345P601J4017K1489K3409K7995L2946M0879L8790M3393N2427L7958K9681
13956D15930K5541J7826L705j1663k6377l1103m0781m0939m3698l8116l3207l2218
13944A64900k9802j6880j8061k1726j7772q332o860K954L865l84l200o850r441
13931C2411o194k430k54l895j682J090K035K773o033k610j244L234j858m563L673
13916A4453N156l540q578K9j586o86l351J746N749K82l605k728j361o61j224O894
13900F989J1683r53k433k134K206n357l687o67p728l77j43p95K402p83J64J48
$$ plain form
13999 -6665 -6300 -3644 -3698 1487 3187 -754 -3547 -4418 -10486 -8877 -4019 3141 11394 11806 10177 5111
13983 5111 1913 1248 5453 5591 1907 8396 11336 10414 13498 21269 24821 23418 23147 30393 45345
13968 45345 52946 66963 88452 111861 139856 172802 213681 252471 295864 348291 386249 415930
13956 415930 441471 459297 463002 451339 424962 393859 353078 312139 268441 230325 197118 164900
13944 164900 135098 118218 100157 78431 60659 52327 45467 48421 52286 51902 48702 41852 32411
13931 32411 26217 23787 23533 19638 17956 19046 21081 23854 17821 15211 13967 17201 15343 10780 14453
13916 14453 19609 16069 7491 7520 5934 5248 1897 3643 9392 9674 6069 3341 1980 1319 95 6989
13900 6989 18672 17719 15286 13152 15358 10001 6314 5647 -2081 -2458 -2601 -3396 -994 -1777 -1613 -1465
13884a465m854j191O056N23k068l150M453M967L74J931M121m72m496J064L672
13869I465k179m739p969l492J963O405L367J201m500J517k939k140J106j70J480
13854a624j464j856Q381L681k131j700L708k727m777R02K534r87m765j425O10
13839c640k563K887l86k796k802l929L330j111O285L080k329m927L064K193l554
13824g198L755N152j96M033K003p257l176o15q24l161K758O95m876L253M931k345
13808c068q885n132j682K600L938L976K452M416j425l3K755M889R83n713p44M007
13792C334l999r41k927K319M227o38j259K170q159L382O665J122l597l232n153
13777f686o688N517L133J800n24M029L839l975k411k34j244o130j344K633J125
$$ plain form
13884 -1465 -6319 -7510 -1454 -931 -2999 -6149 -1696 3271 3645 5576 9697 9225 4729 5793 9465
13869 9465 7286 2547 -5422 -8914 -6951 -546 2821 4022 -478 1039 -1900 -4040 -2934 -3104 -1624
13854 -1624 -3088 -4944 3437 7118 4987 3287 6995 4268 -509 393 2927 1940 -2825 -4250 -3640
13839 -3640 -6203 -3316 -3702 -6498 -9300 -13229 -9899 -11010 -4725 -1645 -3974 -8901 -5837 -3644 -7198
13824 -7198 -3443 1709 1513 5546 7549 292 -2884 -3499 -4323 -7484 -4726 -4031 -8907 -5654 -723 -3068
13808 -3068 -11953 -17085 -18767 -16167 -12229 -8253 -5801 -1385 -2810 -2843 -88 4801 5784 71 -673 3334
13792 3334 -665 -1606 -4533 -2214 2013 1375 116 2286 -5873 -2491 4174 5296 1699 -1533 -6686
13777 -6686 -13374 -7857 -4724 -2924 -3448 581 4420 445 -1966 -2200 -3444 -9574 -10918 -8285 -7160
13762g160k745K615L248M025O033m382J030l161j929j190k731L29K420n477K149
13747f926L860K441K647K209M00n642J9L00l19o64K519Q729r69l794l440L33l609
13730a906r52j503J45m086L20M926Q75K104Q570L046n662J201R35k499n881l170
13714c537O255L415o368o302J228K802J567m854k035O156O42n639m269Q163N878
13699C102N60p59J598M028k427j802K736J405l767p769o672O301K250L46L733
13684B863j235O431M505o708J84k894l088L32L175K288j971K17M643j070N296
13669A2968J9p16J337r3p90K276J842k144M445K236M595N5k739O908O647J327
13653C8173J334Q85J470J0589L122q695J270M671l281p178k574q85n646k164n721
$$ plain form
13762 -7160 -9905 -7290 -4042 -17 6016 1634 2664 -497 -2426 -3616 -6347 -6018 -3598 -9075 -6926
13747 -6926 -3066 -625 2022 4231 4631 -1011 -992 -692 -1011 -1675 844 9573 8604 4810 1370 1703 -1906
13730 -1906 -2858 -4361 -4216 -8302 -7982 -3056 -2181 -77 8493 11539 5877 7078 8013 5514 -367 -3537
13714 -3537 2718 6133 -235 -6537 -5309 -2507 -940 -5794 -7829 -1673 -1031 -6670 -10939 -2776 3102
13699 3102 3662 2903 4501 8529 6102 4300 7036 8441 4674 -3095 -9767 -3466 -1216 -870 2863
13684 2863 1628 8059 12564 5856 6040 3146 58 390 3565 5853 3882 4099 8742 7672 12968
13669 12968 12987 12271 13608 13515 12725 15001 16843 14699 19144 21380 25975 26030 23291 30199 36846 38173
13653 38173 39507 40392 41862 52451 55573 46878 48148 52819 49538 42360 39786 38901 33255 31091 25370
13638B5370j286K339j554l47L58j916k573o633R61P265j852k032K164q47n931
13623A3486q77l088o190q21J990O635r19n103n343n057j033M0K484L345K620O38
13607B807q145j047K913J27M990k498q863j809M770p38O025J283l920M000k736
13592b841L383j942l923l97L960N582p37r57J742K123l365j679p54J005J690r96
13576A894l412m13o91O773K567K189j95q130p148J548O11N334N768J121m64j1149
13560c797p781L280M741K454N89L782j463Ll747O36N315o089k285j071o50k25
13544f308J949l466M489o52r10q88j817R57R744k452k949m188j013k283L49p13
13528a0151M195p250k633O685L831n048P82J215L206j016K393n0m079J393R66
$$ plain form
13638 25370 24084 26423 24869 24522 24880 22964 20391 13758 14719 21984 20132 18100 20264 19417 13486
13623 13486 12609 9521 3331 2510 4500 11135 10216 5113 -230 -5287 -6320 -6280 -3796 -451 2169 2807
13607 2807 -5338 -6385 -3472 -3345 1645 -853 -9716 -11525 -6755 -7493 -1468 -185 -4105 -105 -2841
13592 -2841 542 -1400 -5323 -5720 -1760 3822 3085 2128 3870 5993 2628 949 195 1200 2890 1894
13576 1894 -1518 -1931 -2622 4151 6718 8907 8712 582 -6566 -5018 -4407 927 6695 7816 7352 -3797
13560 -3797 -11578 -8298 -3557 -1103 -514 3268 1805 1808 -1939 -1303 4012 -2077 -4362 -5433 -6083 -6308
13544 -6308 -4359 -7825 -3336 -3988 -4898 -5786 -7603 -6646 3098 646 -2303 -6491 -7504 -9787 -9438 -10151
13528 -10151 -5956 -13206 -15839 -9154 -5323 -10371 -9589 -8374 -5168 -6184 -3791 -3841 -7920 -6527 -5561
13513e561K111Q64K501k568K793l067L445O698N031L696K04m476o096o559J275
13498B91M127j848n740o68O122j434q284j9N324O968l58K019j247O94l236m978
13482b267k306L103m177n366L079K22J045L022n485K151J679J316K295j361L046
13467dk098K067L752o19p911l089M77m846J86j33O270K565l543P342J215j242
13451C89N222o491l294n57j585k26L59m3J032R905m01n828j80N511Q456j357j001
13434I911l376o018J452n212j078M672q62n612N692J401l146l503J977R63K967
13419B28L181r33m578j609N26L543N446o440m407p359M415O229k299n91M779N841
13403E972J005k726K914K498l029j456j236l798r36k721k959L254L600N843J477
$$ plain form
13513 -5561 -3450 -2586 -85 -2653 140 -2927 518 7216 12247 15943 16147 11671 5575 -984 291
13498 291 4418 2570 -3170 -3838 2284 850 -7434 -7453 -2129 4839 4481 6500 5253 5947 2711 -2267
13482 -2267 -4573 -1470 -5647 -11013 -7934 -7712 -6667 -3645 -9130 -6979 -5300 -3984 -1689 -3050 -4
13467 -4 -2102 -35 3717 3098 -4813 -7902 -7425 -12271 -12085 -12218 -5948 -3383 -6926 416 1631 389
13451 389 5611 -880 -4174 -4731 -6316 -6542 -6183 -6226 -5194 4711 4310 -1518 -1698 3813 12269 10912 9911
13434 9911 6535 517 1969 -3243 -4321 351 -511 -6123 -431 970 -2176 -5679 -3702 -2739 228
13419 228 3409 2476 -2102 -3711 -3185 358 5804 -636 -5043 -12402 -7987 -1758 -4057 -4648 131 5972
13403 5972 6977 4251 7165 9663 6634 5178 3942 144 -792 -3513 -6472 -3218 382 6225 7702
13388G702l313N217J320o523L44L207J633L046o695q56k384q93J494k043k021
13373g65O22J198P633K164m747J242l64k493O5M07j474l983M321J399l173Q038
13357A0090O774o144l755L694J52J537P55m017k422M22k015j052o98l726m965
13342e370j527N665N878l55p076m861l627q31o40Q88P143J2363k637j1210l195
13327i392P01R75L95N912m143J57K186L208j50L93L79L429K593k025o579m584
13311f545o554K670M225P543M251K332J191m662p084n27j841J502N21j143l211
13296g332J0195N593l471O874M359n830m869q15K736l404m347J168N05J926j937
13281A351o356m056J238M823M641J12m11J719J034L566M903l128M526K244n730
$$ plain form
13388 7702 4389 9606 10926 4403 4747 7954 9587 12633 5938 5082 2698 1805 3299 1256 -765
13373 -765 -143 1055 8688 10852 6105 7347 6983 4490 4555 4962 3488 -495 3826 5225 2052 10090
13357 10090 16864 10720 6965 10659 10811 12348 13103 9086 6664 7086 5071 4019 3321 -405 -5370
13342 -5370 -6897 -1232 4646 4291 -2785 -7646 -11273 -12104 -12744 -11856 -4713 7650 5013 -6197 -9392
13327 -9392 -8691 -7716 -7321 -1409 -5552 -5395 -3209 -1 -151 242 621 4050 6643 4618 -1961 -6545
13311 -6545 -13099 -10429 -6204 1339 5590 7922 9113 4451 -2633 -3160 -5001 -3499 -2978 -4121 -7332
13296 -7332 2863 8456 4985 11859 16218 10388 5519 4704 7440 4036 -311 857 1362 3288 1351
13281 1351 -5005 -9061 -7823 -3000 1641 1753 1342 3061 4095 7661 12564 9436 13962 16206 10476
13266A0476n310O12j066l961l842L039j605K185O817j96L045N661J455K486l286
13251A6510n153n973l212K722k406K670L334M107k530l564r95K277n54m587L511
13236F157K800o251k740J502K378M400K90k306o052n114j55L425M530L773K255
13221H892J758l608k309K79N53K217k069m56j326n88M480M577j615j523l279J559
13205G542J38K949K52p12L521J76k608K024M627j697q535k754J578L059K876K859
13189A5295n331J277j398o857m802q56K786N377M098J270K725k708j359k853M250
13174A0914k797l210j391M75j280L489J212L446o06K856J244p688o358j947K156
13159E15M736K17j366N516j357j221J955n076O991J0061K161P40j684M635J093
$$ plain form
13266 10476 5166 5778 4712 751 -3091 -52 -1657 528 7345 7149 10194 15855 17310 19796 16510
13251 16510 11357 5384 2172 4894 2488 5158 8492 12599 10069 6505 5510 7787 7233 2646 6157
13236 6157 8957 2706 -34 1468 3846 8246 8536 6230 178 -4936 -5091 -1666 2864 6637 8892
13221 8892 10650 7042 4733 5012 5565 7782 5713 5257 3931 3343 7823 12400 10785 9262 5983 7542
13205 7542 7680 10629 10881 10169 13690 13866 11258 13282 17909 16212 7677 4923 6501 9560 12436 15295
13189 15295 9964 11241 9843 2986 -1816 -2672 114 5491 9589 10859 13584 10876 9517 6664 10914
13174 10914 8117 4907 3516 3991 2711 6200 7412 10858 10252 13108 14352 6664 306 -1641 515
13159 515 5251 5468 4102 9618 8261 7040 8995 3919 10910 20971 23132 23872 22188 26823 27916
13144B7916Q28l648J44l517J697M547m385j716k354J38K123J450j060Q47R90J460
13128B5460m16m973m881J76l784O751Q56j827J427J522r23L354J167m16m086j548
13112A7859r58M81J144N916m329K392k757r893k775m33J0485J0491k076j327Q75
13097B5095k595j852p684l840K902r22J239l054O203k893r86k956P777J885k108
13082A6211O566M652P53m130N45K419L245q723j131j911K335k534K138J713o228
13067A5920J75K030K562o860M949M165P860Q63R47L800l679m447l403j965K640
13052B5557K701J281l272l324j555j187j108k059k736J773L175Q97L823j169l107
13037A9690k478Q73K129N41l010k807N205l528L74j277k138n301J9J355O526L949
$$ plain form
13144 27916 28744 25096 25240 21723 23420 27967 23582 21866 19512 19650 21773 23223 22163 23010 24000 25460
13128 25460 25044 20071 15190 15366 11582 18333 19189 17362 18789 20311 19388 22742 23909 23493 19407 17859
13112 17859 16901 17382 18526 24442 20113 22505 19748 9855 7080 6647 17132 27623 25547 24220 25095
13097 25095 22500 20648 12964 9124 12026 11104 12343 9289 15492 12599 11613 8657 16434 18319 16211
13082 16211 22777 27429 28182 24052 24597 27016 30261 21538 20407 18496 20831 18297 20435 22148 15920
13067 15920 16095 18125 20687 13827 18776 22941 30801 31664 32611 36411 32732 28285 24882 22917 25557
13052 25557 28258 29539 26267 22943 21388 20201 19093 17034 14298 16071 19246 20143 23966 22797 19690
13037 19690 17212 18085 20214 20755 17745 14938 20143 16615 16989 15712 13574 8273 8292 9647 16173 20122
13021B0122q79j873k096K637P319J320j577q42J088l803n598j123R63K587N593
13006B3838l223l556N535P627l727o101L335N686n304l760K126j239j752M854
12992B4339N137Q2l182l688q78K690K732L802k97r519j194N174j793J898k33L158
12976B8228J335j208q34l973L194Q34l473l233M380p5N12K805M260J680O68M717
12960C9817K364k72k144m855k51m38j675J503j062j276J118N63M009O252R66K527
12944D7146n08k204M60k583K98J384l980L767J572n332o724J031n608m594m813
12929A9312j517R10M414R964L931%j0344m4L48M03k390k493N424k03o404O60q73
12912B1098K784K294O66M75J871M765L273j606O75N019J103M007Q991R106J2297
$$ plain form
13021 20122 19243 17370 15274 17911 25230 26550 24973 24131 25219 21416 15818 14695 15658 18245 23838
13006 23838 20615 17059 22594 30221 26494 20393 23728 29414 24110 20350 22476 21237 19485 24339
12992 24339 29476 29558 26376 22688 21810 24500 27232 31034 30737 21218 20024 25198 23405 25303 25070 28228
12976 28228 29563 28355 27521 23548 26742 27576 24103 20870 25250 25175 25687 28492 32752 34432 35100 39817
12960 39817 42181 41909 39765 34910 34659 34221 32546 34049 32987 31711 32829 33392 37401 43653 44619 47146
12944 47146 46638 44434 44894 42311 42609 43993 40013 43780 45352 40020 33296 34327 28719 24125 19312
12929 19312 17795 18705 23119 33083 37014 37014 26670 26626 26974 27377 24987 22494 27918 27715 21311 21971 21098
12912 21098 23882 26176 26842 27317 29188 33953 37226 35620 36295 41314 42417 46424 55415 64521 76818
12897G6818Q92r45Q540J3543J396J0097J4475J5579J5183J9858K7357L8830N0363
12884B91986P2179Q8699R5565R3994J01061R4383P8178N9371L6533J7710j2410
12873A017249m1838o5539q6511r0313r2651r2739q5892p4461n9087n8453m3581
12862B26184k9665j2213j3808p746j578j2323j5249p520q521j0614j634l089K26
12849A02450k133p361q93J687j959p515j98K878J243k766j350L804l294p028L796
12834H1361M40k768k454j851p363k088K38l644k913l825n462j255K868o141k023
12819D3120r53n389j998O895N244N109n987o721L553L03m630J621M78O413R14
12804D7972K684j553L013o811o814k078p03J858K685L837l823m541j409N027n669
$$ plain form
12897 76818 77710 76765 85305 98848 100244 110341 124816 140395 155578 175436 202793 241623 291986
12884 291986 364165 452864 548429 642423 743484 837867 916045 975416 1011949 1029659 1017249
12873 1017249 975411 909872 823361 733048 640397 547658 461766 387305 328218 269765 226184
12862 226184 196519 184306 170498 162752 161174 148851 133602 126082 117561 106947 105313 102224 102450
12849 102450 100317 92956 92063 93750 91791 84276 84078 86956 88199 85433 84083 87887 84593 77565 81361
12834 81361 81801 79033 76579 74728 67365 65277 65515 61871 58958 55133 49671 48416 51284 45143 43120
12819 43120 42167 36778 34780 41675 46919 52028 46041 39320 42873 43176 38546 40167 40645 47058 47972
12804 47972 50656 49103 52116 45305 38491 36413 35710 37568 40253 44090 40267 35726 34317 39344 33675
12789C3675O49p44l064K329K884L34L089M257J14j600p589P70k266k393O355R43
12773C7743n820r88N439P892R046J348j748O524N507M635m02n66m587l908k773
12758E7342J012m18K053M93O065J139r148p142m957O012L578j230l060j05o59
12743E0975k485k426K681N353J434q366n834L913K244K989J344P543J743j978
12729E9130k229l236L084L027k114n9N419M498Q102k124P356Q704N211J2390J8251
12714A25410J3998J3408J3195Q002N915M803K708k059p909r160r665K2p128q431
12700A43109m913q643q151j2251p057N163R68M260rp004n554k660m955o483l369
12685H2451q07k804J663n287L818J572l422m87m17k058o489l152k518o69J348
$$ plain form
12789 33675 34324 33580 30516 32845 35729 36063 39152 43409 43523 41923 34334 35104 32838 30445 36800 37743
12773 37743 31923 30935 36374 44266 53312 54660 52912 59436 64943 69578 69176 68610 64023 60115 57342
12758 57342 58354 57936 59989 60482 66547 67686 58538 51396 46439 52451 56029 54799 51739 51634 50975
12743 50975 48490 46064 48745 54098 55532 47166 41332 45245 47489 50478 51822 59365 61108 59130
12729 59130 56901 53665 56749 59776 57662 57603 63022 67520 75622 73498 80854 89558 94769 107159 125410
12714 125410 139408 152816 166011 174013 179928 184731 187439 185380 177471 168311 158646 158668 151540 143109
12700 143109 138196 129553 121402 109151 102094 107257 108225 112485 112476 105472 99918 97258 92303 85820 82451
12685 82451 81644 78840 80503 75216 79034 80606 77184 76697 76280 74222 67733 64581 62063 61394 62742
12670F2742j501l225j065k964l102Q41l078l970q178p246J516j476L801O54J164
12655C4913J755P251P619K525O093P029L644M793k194k184J100l919k718L906
12641F9613M083J464N785J0294K052Q226L878J802n5l037l85N703L959N328L908
12626A22618J4101J3669Q485Q076N229P248P075k011O75j601k65J1852J0328l664
12612B01815q50K733R307Q321j876N98n137p071j1480j5979j0664j0757j0839
12599A48121q931p982n489R34j0933n082m691J2711R099J0904J2117J3178J2086
12586A76042J7406J8491K4175K6952K0002J0791J6663J2201J4361J6079J5664
12575C68827O134k44L48O469m96j706l590L549L718O727r00o983k798L771M325
$$ plain form
12670 62742 61241 58016 56951 53987 50885 51726 48648 44678 36500 29254 30770 29294 33095 33749 34913
12655 34913 36668 43919 51538 54063 60156 67185 70829 75622 73428 71244 72344 68425 65707 69613
12641 69613 73696 75160 80945 91239 93291 101517 105395 107197 107142 104105 103720 109423 113382 118710 122618
12626 122618 136719 150388 158873 166949 172178 179426 186501 184490 185165 183564 183299 195151 205479 201815
12612 201815 200965 203698 213005 221326 219450 220048 214911 207840 196360 180381 169717 158960 148121
12599 148121 139190 131208 125719 126653 115720 110638 105947 118658 127757 138661 150778 163956 176042
12586 176042 193448 211939 236114 263066 283068 293859 310522 322723 337084 353163 368827
12575 368827 374961 374717 375065 381534 381038 379332 375742 379291 383009 389736 388836 381853 379055 382826 387151
12560C87151N529J0805J0014R998J0711J5050J7530P482P460J6223J7129J0573
12548E25655O026R608J4717Q423Q842L574q23N69K823j0965n328q57j180P047
12534E68131P704L538L380L53K824J2038J3103O824Q190J7884J7351J3772R856
12521F84948J9654K1420J9246J7146Q213Q443K0075K6675K1189J7775K6369K9235
12509I20388K4914K7341L1216K8915K0989K1211J9638K4143K9135L2676L9498
12498A220064M7792N1753O0565O7224Q3073R7093J03013J10790J18696J40897
12488B100960J59443J76818J86109K05145K33563K65061L07884L67817M48253
12479D451053N42840O52391P82797R17371J063694J213785J376416J550357J762936
$$ plain form
12560 387151 392680 403485 413499 423497 434208 449258 466788 474270 481730 497953 515082 525655
12548 525655 531681 541289 556006 564429 573271 576845 576022 576591 579414 568449 563121 562264 561084 568131
12534 568131 575835 579373 582753 583106 585930 597968 611071 617895 626085 643969 661320 675092 684948
12521 684948 704602 726022 745268 762414 770627 779070 799145 825820 847009 864784 891153 920388
12509 920388 945302 972643 1003859 1032774 1053763 1074974 1094612 1118755 1147890 1180566 1220064
12498 1220064 1267856 1319609 1380174 1447398 1530471 1627564 1730577 1841367 1960063 2100960
12488 2100960 2260403 2437221 2623330 2828475 3062038 3327099 3634983 4002800 4451053
12479 4451053 4993893 5646284 6429081 7346452 8410146 9623931 11000347 12550704 14313640
12470A4313640K060057K505792L207848M333054O001029Q137373J0579959J3208988
12462F4347740J5740583J7694976J8851313J9043743J7955402J5318266J1500229
12455A80452252P034985K108948l100541q040544j2176142j5386821j7422242
12448A33469895j8139970j7799256j6422946j4142323j1613632r315501p124478
12441C8911789n112800l614336k685500k158645j858297j672774j548425j429731
12433A8831281j318064j203780j091644r72040q65467p66488o78132o08982n55388
12424A0771296n20289m89363m69731m50141m26600l98625l71475l47991l26904
12415F970177k98843k81106k65431k52937k36907k22442k13703k02968j93602
$$ plain form
12470 14313640 16373697 18879489 22087337 26420391 32421420 40558793 51138752 64347740
12462 64347740 80088323 97783299 116634612 135678355 153633757 168952023 180452252
12455 180452252 187487237 189596185 186495644 178455100 166278958 150892137 133469895
12448 133469895 115329925 97530669 81107723 66965400 55351768 46036267 38911789
12441 38911789 33798989 30184653 27499153 25340508 23482211 21809437 20261012 18831281
12433 18831281 17513217 16309437 15217793 14245753 13380286 12613798 11935666 11326684 10771296
12424 10771296 10251007 9761644 9291913 8841772 8415172 8016547 7645072 7297081 6970177
12415 6970177 6671334 6390228 6124797 5871860 5634953 5412511 5198808 4995840 4802238
12406D802238j91804j79718j65210j52033j36791j34692j24011j07730j04435
12397C505814j00999j06548j08777j04572j04458j10190j08856r4858r1014q8678
12387B486864q3702p5568o5949o5917o0582o1120o8770o5200o2116n8226o2301
12376A757413n3834m5073m6227m1229m2509l5135m2152m3699m7638m5851m2031
12365A272035m4829m6838m8740m8085n4605n2676n3189n7833m5754m7265m0441
12354G31780l2008l6149l5468l7857m2306l1911k7301k4309k5165k1809k1072
12343C96425j9749j8890k0157k3105j6733p667m159l20K978N701J1967J3457J5916
12330C35664K1391J8897J6139J7069O910J6401J0603r982n942m084j740p048j0668
$$ plain form
12406 4802238 4610434 4430716 4265506 4113473 3976682 3841990 3717979 3610249 3505814
12397 3505814 3404815 3298267 3189490 3084918 2980460 2870270 2761414 2666556 2575542 2486864
12387 2486864 2403162 2327594 2261645 2195728 2135146 2074026 2005256 1940056 1877940 1819714 1757413
12376 1757413 1703579 1658506 1612279 1571050 1528541 1493406 1451254 1407555 1359917 1314066 1272035
12365 1272035 1227206 1180368 1131628 1083543 1028938 976262 923073 865240 819486 772221 731780
12354 731780 699772 663623 628155 590298 547992 516081 488780 464471 439306 417497 396425
12343 396425 376676 357786 337629 314524 297791 290124 285965 285645 288623 294324 306291 319748 335664
12330 335664 357055 375952 392091 409160 416070 432471 443074 433092 427150 423066 421326 414278 403610
12317D03610k031n290j5125q200R03j4171j0863n031j2804k2042k0845j8368j1838
12304B57905j2721j4510j1605j7529o007Q167K883m24r80J636R164J447K870J456
12290B21752m838N446J747j1617n232N724n220p666l231N362p725k481K949P8
12276A95048O889K266k819r524j619L436Q814J3159l725m762R86n09j874N395
12262B11161J026j340o445l39J466r50N267M838O758K618l361j758k021M615q1
12247B21454k930K944P106J2927N224n688r074m859m951j1748j0743r247r017
12234A81398p740p959r001j0583o124j730j05J414l624p779o108o81l331q405
12220A09642j0771j230o498j1802k596r31M057N210o849r219J630M711j743j823
$$ plain form
12317 403610 401579 396289 381164 372964 373867 359696 348833 343802 330998 308956 288111 269743 257905
12304 257905 245184 230674 219069 201540 195533 203700 206583 206159 205179 206815 215979 217426 220296 221752
12290 221752 216914 222360 224107 212490 207258 212982 207762 200096 196865 202227 194502 192021 194970 195048
12276 195048 201937 204203 201384 191860 190241 193677 202491 215650 211925 207163 208149 207640 205766 211161
12262 211161 212187 210847 204402 204063 205529 204579 209846 214684 221442 224060 220699 218941 216920 221535 221454
12247 221454 218524 221468 228574 241501 246725 241037 231963 227104 222153 210405 199662 190415 181398
12234 181398 173658 165699 156698 146115 139991 138261 138156 139570 135946 128167 122059 121378 118047 109642
12220 109642 98871 97641 91143 79341 76745 75814 79871 85081 78232 69013 70643 75354 73611 71788
12206G1788J197m062L868N349q358o548m969q84J620j557l594k280Q95k074r69
12191D9422k869K23N153N310n429r37k148Q44p932n329j397k003n77K538m795
12176C0074N274J988j321K930j463J087r05J120L076k625o274q215n494M244R2
12161B3588J76m253j931K209m675R52K292j731m783n234l706j891K6k665L705
12146B079j157M46M739J0286J176K738o64Q286O523O514L615M139P73J975R723
12131F1191J1153Q418Q167R545O436O871Q38j840J253l506j659o91m277O494J1625
12116A20018l17N84K307j2358q617k498k052l675m352q262p857l973r245n85k642
12101E6476p20M395l494p244J469j964L180o8L872m568j0678n545n022J080J633
$$ plain form
12206 71788 72985 68923 72791 78140 69782 63234 58265 57381 59001 57444 53850 51570 52465 50391 49422
12191 49422 46553 46776 51929 57239 51810 50873 48725 49569 41637 36308 34911 32908 32331 34869 30074
12176 30074 35348 37336 36015 38945 37482 38569 37664 38784 41860 39235 32961 24746 19252 23496 23588
12161 23588 23764 19511 17580 19789 15114 16066 18358 16627 11844 6610 2904 1013 1039 -1626 2079
12146 2079 922 1368 6107 16393 17569 20307 19643 27929 34452 40966 44581 48720 49493 51468 61191
12131 61191 72344 80762 88929 98474 104910 111781 112619 110779 112032 108526 106867 106176 101899 108393 120018
12116 120018 119701 120285 122592 110234 101617 99119 97067 93392 89040 80778 72921 68948 59703 59118 56476
12101 56476 55756 60151 56657 49413 50882 48918 52098 52030 55902 51334 40656 35111 30089 31169 32802
12086C2802k888k079M603L894m368m818j315K425R29J36P57l04k500m082r49l383
12070A8860K039K66m827j596R151J52j849J528O866O206N809Q176J886N525Q180
12055F6372N492J0307O094k221j42l87Q486M857n476M957J2900R940L795M823
12041A29797R045K1544K5111L8200N0092O2962P4594Q8462R5797R8395J05322
12030G99321R3442P2073M7549K2915o570l3643o6651q0727q6942r9963r6260r6493
12018D68051p7792o2704n3586m8184k8669k5545k1783m973j846r919j1618m464
12006A16968o601j2524n282n849k171j901J869J922k049n152m469l449k671m130
11992F4511m536j835J014p333o241k422k71k422n470m847l73p183l592J987L135
$$ plain form
12086 32802 29914 27835 32438 36332 31964 27146 25831 28256 29185 29321 30078 29774 27274 23192 22243 18860
12070 18860 20899 21165 16338 14742 23893 24045 22196 23724 30590 36796 42605 50781 52667 58192 66372
12055 66372 71864 82171 88265 86044 85902 85515 94001 98858 93382 98339 111239 121179 124974 129797
12041 129797 138842 160386 185497 223697 273789 336751 411345 499807 595604 693999 799321
12030 799321 892763 964836 1012385 1035300 1028730 995087 928436 847709 760767 660804 564544 468051
12018 468051 390259 327555 273969 225785 197116 171571 149788 144815 142969 133050 121432 116968
12006 116968 110367 97843 92561 86712 84541 82640 84509 86431 84382 79230 74761 71312 68641 64511
11992 64511 59975 58140 59154 51821 45580 43158 42887 40465 34995 30148 29775 22592 19000 20987 24122
11977B4122n089K98k852K943K293o88n378l974j039L215o18l193J886L696M809
11962B0431J755k426M829J86m407n308M341Q592K570J446n923N260J2573N234
11948D9153n450M271Q835L821K944J4845J4472J4860J1498J7022K9258M1972N0618
11935B58119N2239O9912R2384J16327J29855J27355J17945J07132R1371O8650
11925A231289L5875o795l8957p0659r1584j08685j22357j21454j08938r5473q4052
11914D18210p3211n6019l9483l2286k4949j2361j4109j2305j4897j3257q584q446
11902A08303Q31o673j1281n014n559r38L28q189j4539r129l023j756L165o37M991
11887E0880k266j2143j1681O328J565j894k390J285L540q627Q54l477l140J435
$$ plain form
11977 24122 19033 19331 16479 19422 21715 21027 15649 11675 10636 13851 13233 10040 11926 15622 20431
11962 20431 22186 19760 24589 24775 20368 15060 19401 27993 30563 32009 26086 31346 43919 49153
11948 49153 43703 47974 56809 60630 63574 78419 92891 107751 119249 136271 165529 207501 258119
11935 258119 310358 380270 472654 588981 718836 846191 964136 1071268 1162639 1231289
11925 1231289 1267164 1260369 1221412 1150753 1059169 950484 828127 706673 597735 502262 418210
11914 418210 344999 288980 249497 217211 192262 179901 165792 153487 138590 125333 116749 108303
11902 108303 109134 102461 91180 86166 80607 79669 79997 71808 57269 48140 45117 43361 46526 45889 50880
11887 50880 48614 36471 24790 31118 32683 30789 28399 29684 33224 24597 25451 21974 18834 20269
11873B0269m327J595N299m31j993L923p00n160n721k851O523P203o713k137K7
11858A4806l096m608L79K404n071N73N19o22P21O110L983q57m89j848n545k050
11842E309N030k960k297r23M842K828L569k562l743m088k653K53M344K686j608
11827H027r420K582N037N657K060n88m693r590m739k544P843O466L152J979p779
11812C450m343L345r21n730P032N655m459k229N96k829l80L018O654J390m64n269
11796D516o666K041O156j623m362P512Q765O173k956p683p618J232N136n548o143
11781a068n735o390j811K593Q436J0165O022k393o331k345l246q07o55J0044K204
11766H683r23j330l982J907J416n44L361O40N82Q54k735K810Q01k314l632j028
$$ plain form
11873 20269 15942 17537 22836 22405 20412 24335 23635 18475 12754 9903 16426 23629 16916 14779 14806
11858 14806 11710 7102 7481 9885 4814 5387 5906 5284 6005 12115 16098 15241 14752 12904 7359 5309
11842 5309 10339 7379 5082 4159 9001 11829 15398 12836 9093 5005 2352 2605 6949 9635 8027
11827 8027 -1393 1189 6226 11883 13943 13355 8662 -928 -5667 -8211 -368 6098 9250 11229 3450
11812 3450 -893 2452 1531 -4199 2833 8488 4029 1800 2396 -433 -813 2205 8859 10249 9785 4516
11796 4516 -2150 -109 6047 4424 62 7574 16339 22512 19556 11873 4255 5487 10623 5075 -1068
11781 -1068 -6803 -13193 -15004 -12411 -3975 6190 12212 9819 3488 1143 -2103 -2910 -3565 6479 8683
11766 8683 7760 6430 2448 4355 5771 5227 8588 9228 9810 10664 7929 10739 11540 9226 5594 4566
11750D566L772M349q19L712O536o75r068p179M12P372k946L380n63P058P327M640
11734C1874m950n968J1J148j31K793o42j152k479Q14m337j650m718P94k099m059
11718E249N498j049O411L795n084j053L604O026K006p820j315K400P47n644q32
11703A2939j570n270K35K500j612P082M164l160p035m754R44k049p55K557k51
11688C965m21Q512K92k471n317m324K69j865K869J36N527J290R20L337R92j636
11672A2075l741m394K703j394m341k377J080J499J125K193j281J416K709m608
11658B664j918k636P963L079M032n589l329r29k006K236M825Q14r54j257n009
11643A986l26J022M020L294K68R8J150q043q71m730j475Q108k054o064p4M843
$$ plain form
11750 4566 8338 12687 11868 15580 22116 21441 12373 5194 5606 12978 10032 13412 12849 19907 27234 31874
11734 31874 26924 20956 20967 22115 21984 24777 24135 22983 20504 21318 16981 15331 10613 11407 9308 5249
11718 5249 10747 9698 16109 19904 14820 13767 17371 23397 25403 17583 16268 18668 19415 13771 12939
11703 12939 11369 6099 6334 8834 7222 14304 18468 15308 8273 3519 4463 2414 1659 4216 3965
11688 3965 3544 12056 12348 9877 4560 236 505 -1360 1509 1645 7172 8462 9382 12719 13711 12075
11672 12075 8334 3940 6643 5249 908 -1469 -389 1110 2235 4428 3147 4563 7272 2664
11658 2664 746 -1890 6073 9152 13184 7595 4266 3337 1331 3567 8392 9206 8252 6995 1986
11643 1986 1660 2682 6702 9996 10264 10362 11512 3469 2598 -2132 -3607 4501 2447 -3617 -3691 1152
11627A152n900p471L365N748J016P618O38j579j593r60m740K872K095J20k498
11612a17l896l351M737k26j880R01N097J238N450J368m254l638R529L986n772
11597I172n789n282j197M118O46Q718O378q039o180l634o640j585m202j485Q795
11582f206M50O524J0271L076l99p385o782K633k153J753j953K388J125M128J154
11567H624n501k112Q08N143q264J164j510j742K748J360K919K301P888M281p746
11552A0361r410l488k95N23J810N583l230J184l069J44p38j792J527l561o52L815
11536a288r93j208K668L759k683j136N757j863l593l417K249O969j133J416k560
11521B944n639j608p69j207L357J385M073J101J67p64l034R18J548j850o12L453
$$ plain form
11627 1152 -4748 -12219 -8854 -3106 -2090 5528 6166 4587 2994 2034 -2706 166 2261 2381 -117
11612 -117 -4013 -7364 -2627 -2853 -4733 -3832 1265 2503 7953 9321 5067 1429 10958 14944 9172
11597 9172 3383 -1899 -3096 1022 1668 10386 16764 8725 2545 -1089 -7729 -9314 -13516 -15001 -6206
11582 -6206 -5756 768 11039 14115 13716 6331 -451 2182 29 1782 -171 2217 3342 7470 8624
11567 8624 3123 1011 1819 6962 -1302 -138 -1648 -3390 -642 718 3637 5938 13826 18107 10361
11552 10361 951 -2537 -2832 -2309 -499 5084 1854 3038 -31 113 -625 -2417 -890 -4451 -5103 -1288
11536 -1288 -2281 -3489 -821 2938 255 -881 4876 3013 -580 -3997 -1748 5221 4088 5504 2944
11521 2944 -2695 -4303 -5072 -6279 -2922 -1537 2536 3637 3804 3040 6 924 2472 622 10 3463
11505C463l56R29K427k918m8j693K523L424J642j634l52K68j545j42M435j462
11489H961L373k378L992r57k967k763J246n85m879k200O435J753m738k155J912
11474D050K514P015N849N66m688l725l859l733K133M158o352n316O146O392R99
11459A2149j160J827N73K587j498o092O598m14m837j256n44n107q05L785Q462
11444A4268j823p096m097M953J791N99J711l722J159p87M776k429J143l680P049
11429A3815Q942J023o000m092Nj276J074K078q180o577M576O104L91J09k497J97
11413I692K862J815J209m942L484M963j961o51j371j842j0367k661K542N936n4
11398H654M995o86L617n587J335Q087m029k416n031J318k60M321Q25L453p48n60
$$ plain form
11505 3463 3107 4036 6463 3545 3497 1804 4327 7751 9393 7759 7407 7675 6130 5988 10423 8961
11489 8961 12334 9956 13948 12991 10024 7261 8507 7922 3043 843 7278 9031 4293 2138 4050
11474 4050 6564 13579 19428 19994 15306 11581 7722 3989 6122 10280 3928 -1388 4758 11150 12149
11459 12149 10989 12816 13389 15976 14478 8386 14984 14570 9733 8477 7933 2826 2021 5806 14268
11444 14268 12445 5349 1252 6205 7996 8595 10306 6584 7743 6956 11732 9303 10446 6766 13815
11429 13815 22757 23780 17780 13688 13693 12417 13491 15569 7389 812 5388 11492 11883 11992 9495 9692
11413 9692 12554 14369 15578 10636 14120 19083 17122 16471 15100 13258 2891 230 2772 8708 8654
11398 8654 13649 12963 16580 10993 12328 20415 16386 13970 8939 10257 9997 14318 15143 18596 17848 17288
11382A7288k64N577M413O05p081n331L705O356M260k160m108L375Q240L661K493
11367D1029J588Q07R82m173p424K644R7n406L73M091l801O71k89l170l762M985
11351B9242k430k106j983o157l881L589L780l327L996n82k811P372j151n611J743
11336A9683l217n487l252L817l107N293P33J442J540l27J100m488o529N996l18
11321A2879Q57J247j866N551M682o097o229P443M12m334k602J73m174O276K469
11306A6687K799j706l01k050p13k704l515K823j519l207J093O78L427l338k885
11291E569M427K992J01k37K442L756l830m742N51k866m905l081k75L000M856l675
11275D083M016K879l542k547K776K987K879L03k352J81j887k301K98K310N380
$$ plain form
11382 17288 17024 22601 27014 27619 20538 15207 18912 25268 29528 27368 23260 26635 34875 38536 41029
11367 41029 42617 43424 44406 40233 32809 35453 35550 30144 30517 34608 30807 31478 31189 28019 24257 29242
11351 29242 26812 24706 22723 16566 12685 16274 20054 16727 20723 20141 17330 24702 23551 17940 19683
11336 19683 16466 10979 7727 11544 8437 13730 14463 15905 17445 17118 18218 13730 7201 13197 12879
11321 12879 13736 14983 13117 18668 23350 17253 11024 18467 18879 14545 11943 12116 7942 14218 16687
11306 16687 19486 17780 17479 15429 14716 12012 8497 11320 9801 6594 7687 8365 11792 8454 5569
11291 5569 9996 12988 13089 12852 15294 19050 15220 10478 11029 8163 3258 177 -98 2902 7758 4083
11275 4083 8099 10978 7436 4889 7665 10652 13531 13834 11482 11663 9776 7475 7773 10083 15463
11260A5463K233K056N238k438r120k480M53L140R12K397M179J10M943K945m357
11245B5674p562k426k10j070L096N111k991k692j49L131p81j055j74K040K696
11230B2638K480J870m220o816j397M298O459j010P09K136j259K824l649n170l357
11215A6536K67L596K853J480k716q594j365L210N723n27K831M902J516m258n513
11200A9941n479r08K789L440l280L954M99J52j116o002l112Q697L006m208j730
11185A6643J085p992l892N671L677M160K351M144k351k710o528J643L43l509l394
11170I341M472P623k426j595O665o02M537N252l860r846n56k668O984R11m297
11155A9935J515L269k711N128K172l434l314P023O383k543K098L137J083K80J444
$$ plain form
11260 15463 17696 19752 24990 22552 13432 10952 11405 14545 15457 17854 22033 22143 27086 30031 25674
11245 25674 18112 15686 15476 14406 17502 22613 19622 16930 16781 19912 19131 18076 17902 19942 22638
11230 22638 25118 26988 22768 15952 14555 18853 25312 24302 25011 27147 25888 28712 25063 19893 16536
11215 16536 16803 20399 23252 24732 22016 13422 12057 15267 20990 20463 23294 28196 29712 25454 19941
11200 19941 14462 13554 16343 19783 16503 20457 20956 21108 19992 13990 10878 19575 22581 18373 16643
11185 16643 17728 9736 5844 11515 15192 19352 21703 25847 23496 20786 14258 15901 16244 12735 9341
11170 9341 13813 21436 19010 17415 24080 23478 28015 33267 29407 19561 19005 16337 23321 24232 19935
11155 19935 21450 24719 22008 27136 29308 25874 22560 29583 35966 33423 35521 38658 39741 40021 41465
11140D1465O1N141L909j277j104l713m111r54m507m75N741L413M68j397n69r46
11124D1145N457m935j873J405k43J727L641j178N639N496o79J772J094P32k085
11109E7115L849J0233P145K859K843J335K931N852P880K7m465J655L995l235o364
11094I3655m684m545J140N667L865M030N796J543J452m6Q068P581P218P989M560
11079A43289j680K116J874M132M596n169k929k787k980L10o268K72q407q698k144
11064A15527k283k789l553l464j0764r430L734p69o78m346m113k079m8p36L651
11049G7860l51k041k382L331K320m318p861K903k964j625J0483P422K964o360
11035G9381p12k349l169N130P64p23n859j230M617m021o812P919O693l009l265
$$ plain form
11140 41465 41526 46667 50576 49299 48195 44482 40371 39417 34910 34435 40176 43589 44057 42660 42091 41145
11124 41145 46602 41667 39794 41199 40956 42683 46324 45146 50785 56281 55602 57374 58468 59200 57115
11109 57115 60964 71197 78342 81201 84044 85379 88310 94162 102042 102069 97604 99259 103254 100019 93655
11094 93655 88971 84426 85566 91233 95098 99128 104924 106467 107919 107873 115941 123522 130740 138729 143289
11079 143289 141609 143725 145599 149731 154327 149158 146229 143442 140462 140772 134504 134776 126369 117671 115527
11064 115527 113244 110455 106902 103438 92674 83244 86978 86209 85531 81185 77072 74993 74945 74209 77860
11049 77860 77509 75468 73086 76417 78737 74419 66558 69461 66497 64872 75355 82777 85741 79381
11035 79381 78669 76320 73151 78281 79045 78322 72463 71233 75850 71829 65017 72936 79629 76620 73355
11020G3355j161k73L465j751n864l374K228L24m273m954L181L518k626m778k441
11005E4576l357R18L459J593J746J408J2770P771m017R85k549O86j600o68l304
10990G0417q252n775j881r845k909J0469N604K641O91n111j86M584N44q20j338
10975E8833n85m08k067o84j017J783J134o08k814N172J408L49l575o405j24p27
10959D9665M983q69l869n391j798M317O477j978n17p90L376L683L479o38M072
10944F4202O202k804k525J758J557K031q76J802q29o62j254n358K77P492N221
10929G6234O408j38n832j668P47O248K3J287l022N40K715o97p19l5n935m116N567
10912G7607N740J207m652o209M178O571N558r72n350N769K04l457n70L137j325
$$ plain form
11020 73355 72194 71921 75386 73635 67771 64397 66625 66949 62676 57722 60903 64421 61795 57017 54576
11005 54576 51219 52137 55596 57189 58935 60343 73113 80884 76867 77852 75303 75989 74389 73721 70417
10990 70417 62165 56390 54509 44664 41755 52224 57828 60469 61160 56049 55863 60447 60991 60171 58833
10975 58833 58248 57840 55773 55089 54072 55855 56989 56381 53567 58739 60147 60496 56921 50516 50392 49665
10959 49665 54648 53779 49910 44519 42721 47038 53515 51537 51020 50230 53606 57289 60768 60130 64202
10944 64202 70404 67600 65075 66833 68390 70421 69545 71347 70518 69856 68602 63244 63521 71013 76234
10929 76234 82642 82504 76672 75004 75751 81999 82022 83309 80287 80827 83542 82845 82126 82091 76156 72040 77607
10912 77607 83347 84554 79902 73693 77871 84442 90000 89028 83678 89447 89651 86194 85624 88761 87436
10897H7436n994l161L967n131n755J020o33n358k331J284J411N19k223P848N091
10882G7990j381K07R19L748N27q23M905j844j24J115p98L098Q890l518M67J007
10866I4385j37m63k538k838J395l128q091j351r561L662J2463K853j0123r110
10852F7418n588j568J969K274O61P409Q776L235j072L557j703j039Q20L38L26
10837H5813M411J713P68J2761L305N208M673N36L905M976K859J978O333J8419
10823A57658P644O667M102J5663K0406K5914L8684N8833Q5455J40218K13766K97352
10811A072362L31417K81415J79419O4434j5284m4163l5327m3243j69858l31239
10801A289933l56577k49696j51922r5344n8683l7520l0231l3002j6493r094j3847
$$ plain form
10897 87436 81442 78281 82248 77117 71362 72382 71749 66391 64060 65344 66755 67274 65051 72899 77990
10882 77990 76609 76816 77735 81483 82010 81187 86092 84248 84124 85239 84441 87539 96429 92911 93378 94385
10866 94385 94248 93785 91247 88409 89804 86676 78585 77234 67673 71335 83798 86651 76528 67418
10852 67418 61830 60262 62231 64505 65166 72575 81351 84586 83514 87071 85368 84329 85149 85487 85813
10837 85813 90224 91937 92705 105466 108771 113979 118652 119188 123093 128069 130928 132906 139239 157658
10823 157658 165302 171969 176071 191734 212140 238054 276738 335571 421026 561244 775010 1072362
10811 1072362 1403779 1685194 1864613 1929047 1913763 1869600 1834273 1791030 1621172 1289933
10801 1289933 933356 683660 531738 436394 377711 340191 309960 276958 260465 251371 237524
10790B37524j2137j1077o849p464o094j3918j1261p199r216MJ930q398j153j47
10776A44545m025M040K832m82j448J215j792n133o964m451K012n035r368q048
10762A07898j4930j2756L325R976o60j025J426Q767L064j1763j1161j272p059
10749G3830k731O690Q649m738O08J039j781m193P99L518M684J489M91k162k397
10734H3795O913q83j040N47l214o515l34K586p64r779m35Q85k106n913M701J762
10718G0206Q51r87n555j450k972r96J669M593k540j544m87K86n42P021P979J4032
10702H9564J3571P555J1815O345K360N85M214k098n879n95j736n478p353o482
10688A06388L634K825o122j445K543j189p641o530k118N024L542k761k51m049
$$ plain form
10790 237524 225387 214310 207461 199997 193903 179985 168724 161525 152309 152313 154243 145845 144692 144545
10776 144545 140520 144560 147392 146910 145462 146677 144885 139752 132788 128337 130349 125314 115946 107898
10762 107898 92968 80212 83537 93513 92853 91828 93254 102021 105085 93322 82161 80889 73830
10749 73830 71099 77789 86438 81700 82308 83347 81566 77373 78172 81690 86374 87863 88354 86192 83795
10734 83795 90708 89825 88785 89332 86118 79603 79269 81855 81091 71312 70877 71762 69656 63743 68444 70206
10718 70206 71057 70070 64515 63065 60093 59097 60766 65359 62819 61275 60788 61074 60532 67553 75532 89564
10702 89564 103135 110690 122505 128850 131210 131795 136009 133911 128032 127437 125701 120223 112870 106388
10688 106388 110022 112847 106725 105280 107823 106634 98993 92463 90345 95369 98911 96150 95899 91850
10674I1850k985L507N525J246j102p48l0L48r70M281K756L724J669k405m316q231
10658I4119j5N208Q122K391k549O208Q372J6302K3554K4112K6186L3960L9979
10645B85949L5804K8054N409j2036p795j4942k5151j8653j6549r119j0208j5242
10633B25521j6454j3583o534m308J08l161n433k46L554j0Q41j1127j6102j5202
10619A37864q996n65O179K681L93j333K541r93l294r551j62j842r22L462O299
10604A31761p3m219Q64m683p966m290j0676j2541j1460n082n551k123M805N687
10590G4453M976M512J404P271M541P557J7490J7804N110r210j7147n673J0889
10577A23977J2724J5892Q663l638p438l694O080Q737K0440J154n61j392J50J210
$$ plain form
10674 91850 88865 92372 97897 99143 98041 97293 97263 97611 96641 100922 103678 107402 109071 106666 102350 94119
10658 94119 94104 99312 107434 109825 107276 113484 121856 138158 161712 185824 212010 245970 285949
10645 285949 321753 349807 355216 343180 335385 320443 295292 276639 260090 250971 240763 225521
10633 225521 209067 195484 188950 184642 184750 181589 176156 175910 179464 179454 180295 169168 153066 137864
10619 137864 128868 128303 134482 137163 137556 136223 138764 137771 134477 124926 124764 122922 122000 125462 131761
10604 131761 131688 127469 128333 123650 115684 111394 100718 88177 76717 71635 66084 63961 68766 74453
10590 74453 79429 83941 85345 92616 97157 104714 122204 140008 145118 135908 118761 113088 123977
10577 123977 136701 152593 161256 157618 150180 146486 152566 161303 181743 182897 182336 180944 181094 182304
10563A82304R938J5749R198P529R382N826L492M449l253n098p088m406J0673O848
10549B45543L464J1905J7205J9970K4610L5361K7004M509j614o731q612p767j3483
10536C51364j5492l1997l3182k0385j2587j0582j0246k329m591q760m854K759
10524A99118P347J3106K2818N0771Q1322Q9988Q1125M5674L1918J6997J7719Q76
10512F58779k4870P39M8085K2834j8395j9879m326j398j0283p603o861q298p663
10499F20861k999K37k764P765N979J1712J5038Q666J0524J1054J5966K4058K8487
10486G54584J6866R473Q633n8M254J4597J1704N274J224M776R084J5137J5610
10473H71158J9830R875k730L456K355J0715J1261R705P793O967P614J5754K7951
$$ plain form
10563 182304 192242 207991 217189 224718 234100 239926 243418 247867 244614 239516 232428 228022 238695 245543
10549 245543 249007 260912 278117 298087 322697 358058 385062 389571 387957 381226 372614 364847 351364
10536 351364 335872 303875 270693 250308 237721 227139 216893 214564 209973 201213 196359 199118
10524 199118 206465 219571 242389 293160 374482 464470 545595 591269 623187 640184 657903 658779
10512 658779 633909 634648 682733 705567 687172 667293 662967 661569 651286 643683 636822 628524 620861
10499 620861 617862 618099 615335 623100 629079 640791 655829 664495 675019 686073 702039 726097 754584
10486 754584 771450 780923 789556 789498 793752 808349 820053 825327 826551 831327 840411 855548 871158
10473 871158 890988 900863 898133 901589 903944 914659 925920 935625 943418 950385 957999 973753 1001704
10460A001704K8084K6085K1347J2836J5061L3524N0014L4166J7389J4906K1391
10449A276507K1597K5871L8453M6430M6102M3064M4466N4146M9898M4405M2653
10438A733592L0035L0582K6183L6375L7414M8830P3437R7700J21320J34594J53654
10427B523716J60768J58797J56055J74697J89258K03901K11634K05607K22016
10418D206449K69208L13175L51096L88978M54116N77404P21216Q80482R85728
10409I147852J029574J046252J094932J203815J391827J726371K181385K656004
10401B1478012L235837M165379N671084P914553J1364803J7120160K6937338M1800463
10393A39687629N7103352O1032603M8047472K7997491R505502n042511r925301
$$ plain form
10460 1001704 1029788 1055873 1077220 1090056 1105117 1138641 1188655 1222821 1240210 1255116 1276507
10449 1276507 1298104 1323975 1362428 1408858 1454960 1498024 1542490 1596636 1646534 1690939 1733592
10438 1733592 1763627 1794209 1820392 1856767 1894181 1943011 2016448 2114148 2235468 2370062 2523716
10427 2523716 2684484 2843281 2999336 3174033 3363291 3567192 3778826 3984433 4206449
10418 4206449 4475657 4788832 5139928 5528906 5983022 6560426 7281642 8162124 9147852
10409 9147852 10177426 11223678 12318610 13522425 14914252 16640623 18822008 21478012
10401 21478012 24713849 28879228 34550312 42464865 53829668 70949828 97887166 139687629
10393 139687629 196790981 257823584 305871056 333868547 343374049 338331538 328406237
10386C28406237n690950n899039k7435239n8618444o5070183m7346886k9071322
10379H9274174j7848195j1486616p812746n648507m306291l389125k767130k370561
10371C3645003k136743j959685j744014j548039j394138j338804j361169j291947
10363B0870464j124664r65487q52530p88937p64499p49039p41963p25667o90720
10354A3466958o62194o37828n87316n32097m87943m52745m18753l72444l41697
10345H973941l35369l39277l39529l35356l20658l08737k91594k66403k32461
10336F204557j96574j68341j49643j37894j28951j19404j13590j03518q7229r6707
10326D902706j13140j26421j40897j33022j12582r7156j14945j65948k09682j93308
$$ plain form
10386 328406237 322715287 316816248 289381009 230762565 165692382 118345496 89274174
10379 89274174 71425979 59939363 52126617 46478110 42171819 38782694 36015564 33645003
10371 33645003 31508260 29548575 27804561 26256522 24862384 23523580 22162411 20870464
10363 20870464 19745800 18780313 17927783 17138846 16374347 15625308 14883345 14157678 13466958
10354 13466958 12804764 12166936 11579620 11047523 10559580 10106835 9688082 9315638 8973941
10345 8973941 8638572 8299295 7959766 7624410 7303752 6995015 6703421 6437018 6204557
10336 6204557 6007983 5839642 5689999 5552105 5423154 5303750 5190160 5086642 4999413 4902706
10326 4902706 4789566 4663145 4522248 4389226 4276644 4179488 4064543 3898595 3688913 3495605
10316C495605j59252j27602j22648j18153j10893j08600j01012p9206p3937o3521
10306B430781n1334n5033n4424n3184n4391m8801o3937p5188q1412q0085q6290
10295A726702r0284q8962o9640n8737o5749o3438o5689o2138o2041n8387n1949
10284I89688o4023o5600n7112n8295n1616m8736m9052m4553l3764l1618k3753
10273D61566k4587l1795k5815j2904M259J2115K0361L5686L2782N4274P0561N3554
10261F50057K7266J6583J0849m681j1917j2921k1000k3926k2671k8099k4506j1663
10249E43371j0473j3014p132q968o547p211j7000k4604l1541l0934k2723k2098
10237C41126k4896k0104j0099j3855r051Q881K4250K8154J7019R053K289L358
$$ plain form
10316 3495605 3336353 3208751 3086103 2967950 2857057 2748457 2647445 2568239 2494302 2430781
10306 2430781 2379447 2324414 2269990 2216806 2162415 2113614 2049677 1974489 1893077 1812992 1726702
10295 1726702 1636418 1547456 1477816 1419079 1353330 1289892 1224203 1162065 1100024 1041637 989688
10284 989688 925665 860065 802953 744658 693042 644306 595254 550701 516937 485319 461566
10273 461566 436979 405184 379369 366465 370724 382839 403200 438886 471668 525942 596503 650057
10261 650057 677323 693906 704755 700074 688157 675236 654236 630310 607639 579540 555034 543371
10249 543371 532898 519884 512752 503784 497237 490026 473026 448422 416881 385947 363224 341126
10237 341126 316230 296126 286027 272172 263121 272002 296252 324406 341425 350478 352767 356125
10225C56125J313m527l988o857j1818j3763k671n119j0383N220Q078P944O328
10212C25882N666p971n184m349p273o359K779J9517J3733J946k954o671k591N575
10198C31746Q137M078j081q042j5659j1745L116J4490O695J004p010l198O416
10185C28947M264j400p103j994l247o082j1319o631j1647m460o575o166k224N77
10171B64940l576n930O33O764j903m342p761o631m233p294o160k675P439j1962
10157B17309j0818j6066r585j2432j4092j3761j2811p470n90j142j0863O74R4
10144A08447k658J678M629M709K385R886R73K099m820n404j1462N32j6r696q606
10129I2676K239K831J057M394Q334M424k139k613K372J300n751q328n222M802
$$ plain form
10225 356125 357438 352911 348923 342066 330248 316485 313814 308695 298312 303532 311610 319554 325882
10212 325882 331548 323577 318393 314044 306771 300412 303191 322708 336441 338387 335433 328762 326171 331746
10198 331746 339883 343961 342880 334838 319179 307434 310550 325040 331735 332739 325729 322531 328947
10185 328947 333211 331811 324708 322714 319467 313385 302066 295435 283788 279328 272753 266587 264363 264940
10171 264940 261364 255434 256067 262831 260928 256586 248825 242194 237961 230667 224507 221832 229271 217309
10157 217309 206491 190425 180840 168408 154316 140555 127744 120274 119684 118542 107679 108353 108447
10144 108447 105789 107467 112096 116805 119190 129076 130049 132148 127328 121924 110462 110994 110978 101282 92676
10129 92676 94915 97746 98803 103197 111531 115955 113816 111203 113575 114875 109124 100796 95574 100376
10115A00376K218j868q774j1965m450L746k280l57J668J877P628M223k98R21k82
10100I2383o399q31m190j991n051q954k905q39N57J748O163O447K248o986k745
10085F8655L500Q932k230o81N337J3633J2594J1385J6941J9377K1401L3688L5713
10072B48245M5048N4558O3532Q8059R5203Q6111P3683N1806L2255K9612M6034
10061I14146O0754O6602P3177J32732K84886M88135O74767P48658O57327M40057
10051D541241J91128L480q0577j08468k13355m63450p24760p79063o21465m21446
10041A323265k62961j60703j06475p8083n7051n1693m1161k9915k9730k5646k1588
10030D58259k2878k3674k4657k0379j5784j4837j2736j5622j4597j3705j0521
$$ plain form
10115 100376 102594 100726 91952 79987 75537 79283 77003 76646 78314 80191 87819 92042 91744 92665 92383
10100 92383 85984 85153 80963 78972 73921 64967 62062 61223 61780 63528 69691 76138 78386 71400 68655
10085 68655 72155 81087 78857 78176 83513 97146 109740 121125 138066 157443 178844 212532 248245
10072 248245 293293 347851 411383 499442 594645 680756 754439 806245 838500 868112 914146
10061 914146 974900 1041502 1114679 1247411 1532297 2020432 2695199 3443857 4101184 4541241
10051 4541241 4732369 4735849 4655272 4546804 4333449 3869999 3145239 2366176 1744711 1323265
10041 1323265 1060304 899601 793126 715043 657992 606299 565138 535223 505493 479847 458259
10030 458259 435381 411707 387050 366671 350887 336050 323314 307692 293095 279390 268869
10019B68869q832j6500j0388j2228j8919p093l433j1115n233k918r213o188n14
10006A56295m621p950o683k727l025j086j302J621j308n584J051M090K631J555
9992A32957m386o343M12N684L872J573L988r32o149J402L918O753M828q65P633
9977A54345O759K0377K3856K3734L5009N0781Q2707J21598J87217K76902L37415
9966A320700L10390K11973J05260J3316m3871m2577l4741j19715k93225l68317
9956A059193k92870j88209j18401p4147m6227l7357l1064j9219j6833j1754j1402
9945B11710j4230j5559j1761p554m700m511l445m015m12j07q160j5713N79K324
9931A24446m103q43k444m793m93N225J225n699n956J342j593j4106m218j980o747
$$ plain form
10019 268869 260037 243537 233149 220921 202002 194909 191476 180361 175128 172210 162997 156809 156295
10006 156295 151674 143724 137041 134314 131289 130203 128901 130522 129214 123630 124681 128771 131402 132957
9992 132957 128571 122228 122640 128324 132196 133769 137757 136825 130676 132078 135996 142749 147577 146712 154345
9977 154345 161104 181481 205337 229071 264080 314861 397568 519166 706383 983285 1320700
9966 1320700 1631090 1843063 1948323 1961639 1917768 1875191 1840450 1720735 1427510 1059193
9956 1059193 766323 578114 459713 385566 339339 301982 270918 251699 234866 223112 211710
9945 211710 197480 181921 170160 162606 157906 153395 149950 145935 145523 145416 137256 121543 122122 124446
9931 124446 120343 119500 117056 112263 111770 116995 118220 112521 106565 107907 106314 92208 87990 86010 79263
9916G9263l020k755o034j62n070j1654o591m031j459k385o30l274p867K288N030
9901C1649K079J28J956m056J110M010O546j193j610n85p61O95M245N437L697J3606
9885F6953N009M393R796L994L33N69l261K163N238p44j2613j2895k947n768j2648
9870D7572l857n924q865m694l27o086k435J382j220L869K489P86M297N103M09
9855C2499L684P357J212J641M785N256n316M385N004L944M440k019k356p18N64
9840F4362L210j1831j2072j667O354q988n336j266k580M416K289J632o876l892
9826B7755O83M311l032m438L392k606P615J468n765L697j21q687k62M466m374
9811B4102j420L593n827k343L64K494J946k83J983j684k575M047K009j236o778
$$ plain form
9916 79263 76243 73488 67454 67292 62222 50568 43977 39946 38487 36102 35472 32198 24331 26619 31649
9901 31649 33728 33856 35812 31756 32866 36876 43422 42229 40619 40034 39273 39968 44213 49650 53347 66953
9885 66953 71962 76355 86151 90145 90478 91047 87786 89949 95187 94443 81830 68935 65988 60220 47572
9870 47572 43715 37791 28926 24232 23905 17819 15384 16766 15546 19415 21904 22690 26987 32090 32499
9855 32499 36183 43540 44752 46393 51178 56434 51118 55503 60507 64451 68891 66872 64516 63798 64362
9840 64362 67572 55741 43669 42002 48356 39368 34032 32766 30186 34602 36891 38523 31647 27755
9826 27755 28438 32749 29717 25279 28671 26065 33680 35148 29383 33080 32959 24272 24010 28476 24102
9811 24102 22682 26275 20448 18105 18469 20963 22909 22626 24609 22925 20350 24397 26406 25170 18392
9796A8392J445K776K009L815L636r47L287J266J107k167p63j114P31o870j788
9781B4815N985M433M635K613l052j06N103L081r339k265j04L377P96o823m178
9766B8971N60N926j402n786J791K807J875Q55o344m24R20L714J035n09m997o94
9750B8298j48j124M727L920j1N6m847m470K325J088K419n397N176m197P14J800
9734C0329j564P70l28N390j130N40K591K748n40P73P29j993l545l315o59l580
9718B7216J192N309j492l75L172L578L096k006n870k495q701o226L227J027J891
9703B2543O392P276p448j868p87p366J796N139K625q22J298J060k134N61n703
9688B2562j094M872L236r49m823n25J798n73J420L581j477L185J913l713P03J05
$$ plain form
9796 18392 19837 22613 24622 28437 32073 31126 34413 35679 36786 34619 33856 32742 33473 26603 24815
9781 24815 30800 35233 39868 42481 39429 39323 44426 47507 38168 35903 35799 39176 39972 33149 28971
9766 28971 29531 35457 34055 28269 30060 32867 34742 35597 29253 28829 29749 33463 34498 33989 28992 28298
9750 28298 28150 27026 31753 35673 35662 35718 30871 26401 28726 29814 32233 26836 32012 27815 28529 30329
9734 30329 28765 29535 29207 34597 33467 34007 36598 39346 38806 39579 40308 38315 34770 31455 30796 27216
9718 27216 28408 33717 32225 31850 35022 38600 41696 39690 33820 31325 22624 16398 19625 20652 22543
9703 22543 28935 36211 28763 26895 26108 18742 20538 25677 28302 27480 28778 29838 27704 28265 22562
9688 22562 21468 26340 29576 28627 23804 23279 25077 24504 25924 29505 28028 31213 33126 29413 30116 30221
9672C0221k930M195K605J937L99K274k313o52N827n077l774m12M0j508l73P86
9656C1245j783J108J521J375j338Q68L570k39L08o506J388k015l547m875M155
9641B5235j974R8M613P7N70k929J782j904j019Q945M625n25R456Q260P579k703
9625F0186n886O16l56k059q994l979K159l37K421J543m294m070j00m57O561O549
9609D9503m752O65N57O288k950r95l415l056j652m992M439J120k421l893j867
9594C2579L387N617J334q145q025l784L832L404M223L345l547o334L634N29N2
9579C2101j761n25M567J34j783J078K209j710K049M95m954l910M081O465K829
9564D1365q430o456Q283O045q66L724k527j234J617r83O68m066Q047K54o105J730
$$ plain form
9672 30221 27291 31486 34091 36028 36427 38701 36388 35736 41563 36486 32712 32300 32340 30832 30459 31245
9656 31245 29462 30570 32091 33466 32128 32996 36566 36327 36635 30129 31517 29502 25955 21080 25235
9641 25235 23261 23359 27972 28049 28619 25690 27472 25568 24549 33494 38119 37594 47050 55310 62889 60186
9625 60186 54300 54916 54560 52501 43507 39528 41687 41350 43771 45314 41020 36950 36850 36393 42954 49503
9609 49503 44751 45416 45973 52261 49311 48316 44901 41845 40193 35201 39640 40760 38339 34446 32579
9594 32579 35966 41583 42917 34772 26747 22963 26795 30199 34422 37767 34220 27886 31520 32049 32101
9579 32101 30340 29815 34382 34516 32733 33811 36020 34310 36359 36854 31900 27990 32071 38536 41365
9564 41365 32935 26479 34762 40807 39941 43665 41138 39904 41521 40538 41206 37140 45187 45441 39336 41066
9548D1066n944l101j082L625M288N362K596m05m52M60q983k765O677P18j257J52
9532D0955l51L762p14L313J920J019Q70J208m44k26M856N139j850l358n924o88
9516D9487K793J425k062m337p733m83M344K064M295L862k327K573q29m56J302
9501E3918M479L717k721J04J059k480p749r211k47R809M796K638l767n194o2K526
9485E1615K542K989k780j671J230j446O5j218k32n230N381Q766j321k219K722
9470E9193K216J075k521l767j304r63N409M715l654M369m086O016L73K85L697
9455G1053P528N210M498L745m651N55K536J552o351m405L677M94J322m355J12
9440H2520o998l128J221O558J366J207J417j321K57K271m168k853k746L968j733
$$ plain form
9548 41066 35122 32021 30939 34564 38852 44214 46810 46405 45953 46413 37430 34665 41342 42060 40803 40955
9532 40955 40604 44366 43652 46965 48885 49904 50774 51982 51538 51312 56168 61307 59457 56099 50175 49487
9516 49487 52280 53705 51643 47306 39573 39090 43434 45498 49793 53655 51328 53901 53072 52616 53918
9501 53918 58397 62114 59393 59497 60556 58076 50327 41116 40869 50678 55474 58112 54345 49151 49089 51615
9485 51615 54157 57146 54366 52695 53925 52479 52544 51326 51094 45864 51245 60011 58690 56471 59193
9470 59193 61409 62484 59963 56196 54892 53929 59338 64053 60399 64768 60682 66698 67071 67356 71053
9455 71053 78581 83791 88289 92034 87383 87938 90474 92026 85675 81270 84947 85441 86763 82408 82520
9440 82520 75522 72394 73615 80173 81539 82746 84163 82842 83099 85370 81202 78349 75603 79571 77838
9425G7838J800J646O18M20P70k423J69L297l838n675J883L60l069q10J226j921
9409G2291m95N29j784j363K83l549j379R01O828M474r34M674L44J549k961l083
9393G6325O79L700k149K730O085j112l419%O223l176P145P340k551l770J0347
9378A04397m452l470P37L321l097j89k328n644l785K126N225m315m915j854l2
9363H1725O592P034L457n437j128l37J723N231o10k086j631l448q85j9j458J319
9347I0042N205K883j201j246l318k63l8q329N945M170P708J065k828k328L130
9332A00597K223J758k048k552L403J287m233m742p292O54L538Q642P068L10L992
9317A12605K738N487O629K624P71o462q341J87l335K991r55p100J895j607k600
$$ plain form
9425 77838 79638 81284 81902 82322 83092 80669 80838 84135 80297 74622 76505 76865 73796 72986 74212 72291
9409 72291 71796 72325 70541 69178 69461 65912 64533 65434 72262 76736 75802 80476 80820 82369 79408 76325
9393 76325 77004 80704 78555 81285 87370 86258 82839 82839 89062 85886 93031 100371 97820 94050 104397
9378 104397 99945 96475 97212 100533 97436 97247 94919 89275 85490 87616 92841 88526 83611 81757 81725
9363 81725 88317 95351 98808 93371 92243 91906 93629 98860 98250 96164 94533 91085 90200 90181 88723 90042
9347 90042 95247 98130 96929 95683 92365 92102 92064 83735 89680 93850 101558 102623 99795 97467 100597
9332 100597 102820 104578 102530 99978 103381 104668 100435 95693 88401 89055 92593 101235 108303 108613 112605
9317 112605 115343 120830 127459 130083 130854 124392 116051 116238 112903 115894 114939 107839 109734 108127 105527
9302A05527J096K588O393m8l968L716P713Q312J157l118j1%p748k596j255Q049
9286A25807Q123J257j325o485j083J871p46m691n172m963K913P920M978k959L441
9271A28886P503j739n327l005k21K898m071l982R077L850J330r72k507K226o662
9256A27284M69K242M254O299j782n905J11O121j45m321n188k634P368l69K744
9241A36548M257N815j0934j041Q844M069M463j127l355r438m244M881N058k331
9227A41465J826N841m695M383M77O41N667O934R02n891k024r49j493K052P766
9212A62902M400J104J52m563k391K065L304k046j79p14j286l478L109k38J600
9197A63741M234L698j249k358J326O979k879n538j338m255l006j466K503L698
$$ plain form
9302 105527 106623 109211 115604 115556 111588 115304 123017 131329 132486 129368 129357 129357 121609 119013 117758 125807
9286 125807 133930 135187 133862 127377 126294 128165 127419 122728 117556 112593 115506 123426 128404 125445 128886
9271 128886 136389 134650 129323 126318 126097 128995 124924 120942 130019 133869 135199 134227 131720 133946 127284
9256 127284 127753 129995 134249 140548 138766 132861 132972 139093 138948 134627 129439 126805 134173 133804 136548
9241 136548 140805 146620 135686 134645 143489 147558 152021 150894 147539 138101 133857 138738 143796 141465
9227 141465 143291 149132 144437 148820 149297 149938 155605 162539 163441 157550 155526 154577 153084 155136 162902
9212 162902 167302 168406 168558 163995 161604 163669 166973 164927 164748 164034 162748 159270 162379 162141 163741
9197 163741 167975 171673 170424 168066 169392 176371 173492 167954 166616 162361 159355 157889 160392 164090
9183A64090J369j452J145J183k369j161J017p95o986L212Q240K600P73q38j718
9168A68310q235J841N583J747M263J421j025j664L228Q46K343P067j105k36o193
9153A78191k107lN186O854K54j623J123j352J209L967P124L352O88j395K718q29
9137B03357K609N566P23K106k467j193O749L660J572N333J322P009J342L443M126
9122B45257J0370K654m828p069j223J744k127j119J951O364p361m362J531J752
9108B43534J962M873J858l559n293K355L056K710L665O77p965m200J993l084o58
9093B41924L965k19l212r932K786k898L696J493N790M794m30j86Q000M729L384
9078B63684J839J862P319L832j101j064l214n279K438q18J155R303L495Q484Q425
$$ plain form
9183 164090 165459 164007 165152 166335 163966 162805 163822 163027 156041 159253 167493 170093 170866 170028 168310
9168 168310 160075 161916 167499 169246 173509 174930 173905 172241 175469 176315 178658 185725 184620 184384 178191
9153 178191 176084 176081 181267 188121 188375 186752 187875 186523 187732 191699 198823 202175 202863 201468 204186 203357
9137 203357 205966 211532 212255 214361 211894 210701 217450 221110 222682 228015 229337 236346 237688 241131 245257
9122 245257 255627 258281 253453 246384 245161 246905 244778 243659 245610 251974 244613 240251 241782 243534
9108 243534 245496 250369 252227 248668 243375 245730 248786 251496 255161 255838 247873 243673 245666 242582 241924
9093 241924 245889 245670 242458 232526 235312 232414 236110 237603 243393 248187 247757 247571 255571 260300 263684
9078 263684 265523 267385 274704 278536 277435 276371 273157 267878 270316 269498 270653 279956 283451 291935 300360
9063C00360K59N588K154L595N020Q239j014j326l153n682R037J262J593k789l732
9048C19411k511L241j097J118p976k751N856K858K067m370k590K454Q278N966
9034C29954L801L658J391m44m251N188R500J197p027q762m219K75k74N689R455
9019C45131K227K887N460K880J657j212p060q05K210Q9J030M023L719J141m887
9004C58490K128R87m33o47R439Q155m071L159R691P939Q563M487N702M019k441
8989D15167P580q82k327j403J520J2301L684r32l351K919M806l41M911N762L253
8974D52667J242K648n00K101j280J148Q115P026L378K741K840O711N433P854P020
8959E09144R355L360m927L50L420j835N660M821M377O013M040O114j95O57M264
$$ plain form
9063 300360 300619 306207 308361 311956 316976 325215 324201 322875 319722 314040 323077 324339 325932 323143 319411
9048 319411 316900 320141 319044 320162 312186 309435 315291 318149 320216 315846 313256 315710 323988 329954
9034 329954 333755 337413 338804 338360 334109 339297 348797 349994 342967 334205 329986 330261 329987 335676 345131
9019 345131 347358 350245 355705 358585 360242 359030 351970 351165 353375 353464 354494 358517 362236 363377 358490
9004 358490 360618 361605 361172 360525 369964 378119 374048 377207 386898 394837 403400 407887 413589 417608 415167
8989 415167 422747 421865 419538 418135 419655 431956 435640 434708 431357 434276 439082 438741 443652 449414 452667
8974 452667 453909 456557 456057 458158 456878 458026 466141 473167 476545 479286 482126 488837 494270 502124 509144
8959 509144 518499 521859 516932 517282 520702 518867 524527 529348 533725 539738 543778 549892 549697 550354 554618
8944E54618J39k922P179J5480Q884R28J064j995RJ1032M432L228J4266N693O06
8929F22641P378K075j980N930J154J0988P606J4618N353K131K257N141R486J04
8915F94882J386P587O812J1286J5619Q157R25l02O659N575J1009R229P161J1739
8901G97724J1861J676P437J2940J0811J3153O532P455J0337M315P392R938J4378
8888I15949J0553R061P667R790J2965J4187J0585J0495R293J838R092J3326J2977
8875A047778J8176J0281J5285J2150J1634J5274N623J2857K4917K4617J5849O594
8863A221035Q236J7815R747J4914J9216J3762J9884J6111K2814K1612J6783J4021
8851A415950J9229K0314J1846J9899J9993J9830K5836K0834K2014K1900K2637
$$ plain form
8944 554618 554757 551835 559014 574494 583378 584306 585370 583375 583384 594416 598848 602076 616342 622035 622641
8929 622641 630019 632094 630114 636044 637198 648186 655792 670410 675763 677894 680151 685292 694778 694882
8915 694882 696268 703855 710667 721953 737572 745729 746654 746352 753011 758586 769595 778824 785985 797724
8901 797724 809585 811261 818698 831638 842449 855602 862134 869589 879926 884241 891633 901571 915949
8888 915949 926502 935563 943230 953020 965985 980172 990757 1001252 1010545 1012383 1021475 1034801 1047778
8875 1047778 1065954 1076235 1091520 1103670 1115304 1130578 1136201 1149058 1173975 1198592 1214441 1221035
8863 1221035 1229271 1247086 1256833 1271747 1290963 1304725 1324609 1340720 1363534 1385146 1401929 1415950
8851 1415950 1435179 1455493 1467339 1487238 1507231 1527061 1552897 1573731 1595745 1617645 1640282
8840A640282K6524L3205K1476J4497K3899K5529K5086K3640J9073K1264K5601
8829A900076L5856L1274L1970L1938L0624K8579L4940L4178L5702L9429L2179
8818B266745K6988L2948L7621L8710L8377L7223M1634M7707M4173M4242M1451
8807B697819M6963M8208M6672M8367N5182O2744N3420N0590N4940N8388N3078
8796C276371N8853N9285O5192O5701O4037P0242O8904P4300P2483O7063P4827
8785D017258Q2391Q9252Q4851Q6111Q3234Q4274R6472J00485R8213J00425J05531
8774E028497J08207J10339J04814J07085J19685J24671J28171J29312J25221J37543
8764F223545J29746J28190J38729J46796J50272J49585J51364J53646J54210J69164
$$ plain form
8840 1640282 1666806 1700011 1721487 1735984 1759883 1785412 1810498 1834138 1853211 1874475 1900076
8829 1900076 1935932 1967206 1999176 2031114 2061738 2090317 2125257 2159435 2195137 2234566 2266745
8818 2266745 2293733 2326681 2364302 2403012 2441389 2478612 2520246 2567953 2612126 2656368 2697819
8807 2697819 2744782 2792990 2839662 2888029 2943211 3005955 3059375 3109965 3164905 3223293 3276371
8796 3276371 3335224 3394509 3459701 3525402 3589439 3659681 3728585 3802885 3875368 3942431 4017258
8785 4017258 4099649 4188901 4273752 4359863 4443097 4527371 4623843 4724328 4822541 4922966 5028497
8774 5028497 5136704 5247043 5351857 5458942 5578627 5703298 5831469 5960781 6086002 6223545
8764 6223545 6353291 6481481 6620210 6767006 6917278 7066863 7218227 7371873 7526083 7695247
8754G695247J64156J64085J66198J76521J79713J82348J83830J84729J85209J77834
8744I459870J88108J96795J88231J88783J82171J84326J83603J91206J85657J80256
8734A1329006J75051J72825J68464J69836J66618J56547J48973J42380J23172
8725A2752872J13724J07339J12440R8921Q1516O4909O7895N8064M4268K9274J0751
8714A3541973k221j2828k2781l4983m1137n4473o4019p4671q6066r1451j05759
8703A2951584j15269j25349j33868j37307j47016j53411j50905j50682j60039
8694A1677738j79381j72939j74345j73977j75293j72706j75449j81168j80231
8685A0092249j80001j80405j74455j69139j67385j72023j72647j69282j64227
$$ plain form
8754 7695247 7859403 8023488 8189686 8366207 8545920 8728268 8912098 9096827 9282036 9459870
8744 9459870 9647978 9844773 10033004 10221787 10403958 10588284 10771887 10963093 11148750 11329006
8734 11329006 11504057 11676882 11845346 12015182 12181800 12338347 12487320 12629700 12752872
8725 12752872 12866596 12973935 13086375 13185296 13266812 13331721 13399616 13457680 13501948 13531222 13541973
8714 13541973 13539752 13526924 13504143 13469160 13428023 13373550 13309531 13234860 13148794 13057343 12951584
8703 12951584 12836315 12710966 12577098 12439791 12292775 12139364 11988459 11837777 11677738
8694 11677738 11498357 11325418 11151073 10977096 10801803 10629097 10453648 10272480 10092249
8685 10092249 9912248 9731843 9557388 9388249 9220864 9048841 8876194 8706912 8542685
8676H542685j64185j65137j61052j53954j60393j57511j47279j38945j39713j39647
8666G014869j41832j36698j32556j30737j27542j25299j30107j22316j18541j17218
8656E732023j14087j11006j04264j01665j03841j05115r7586r6842r7349r3763
8646D706505r0389q4926q1630q6607q2250p7571q1054q2295p3189o8440o2582
8635C835572o0114o6126q0489p3184o3474o5046o2550o2320n6019n4356n9970
8624C131924n2043m9745m9159m8080n1728n1290n2103l8965m6764m6492m3299
8613B602256m2595m3090m3883l7985l2828l7246l8073m0839l3869l6128l4234
8602B181486k8448k7569k9879l0550l4333l6303k7149k5383k3288l0222l5744
$$ plain form
8676 8542685 8378500 8213363 8052311 7898357 7737964 7580453 7433174 7294229 7154516 7014869
8666 7014869 6873037 6736339 6603783 6473046 6345504 6220205 6090098 5967782 5849241 5732023
8656 5732023 5617936 5506930 5402666 5301001 5197160 5092045 4994459 4897617 4800268 4706505
8646 4706505 4616116 4531190 4449560 4362953 4280703 4203132 4122078 4039783 3966594 3898154 3835572
8635 3835572 3775458 3709332 3628843 3555659 3492185 3427139 3364589 3302269 3246250 3191894 3131924
8624 3131924 3079881 3030136 2980977 2932897 2881169 2829879 2777776 2738811 2692047 2645555 2602256
8613 2602256 2559661 2516571 2472688 2434703 2401875 2364629 2326556 2285717 2251848 2215720 2181486
8602 2181486 2153038 2125469 2095590 2065040 2030707 1994404 1967255 1941872 1918584 1888362 1852618
8591A852618k2047k6356k5275k2090k7276k5995k7858k2512k1455k4474k4154
8580A583126k0975j5367k0160k1110k0904j8576j6514j7161k4074k1091j4551
8569A372643j3016k2192j3179j1874k3162j7299j7824p408j4401j5792r104j1481
8557A195911j2548j7951k1194j7635j3368j8872r129q583j3456q502j3259j4034
8545A027380r500p089q717p192p207j1578r670j2579l012j868j6358j4166r536
8532I08908j0967j4422j239r071j5123r965m763j554o459r052J333j0298j0517
8519H06811r135o555l462j1858l912o125q763n361j257q142n968o507q780m771
8505G16215L73j703p123j5077q713j98K83J859p123k555m113r007n175l888r430
$$ plain form
8591 1852618 1830571 1804215 1778940 1756850 1729574 1703579 1675721 1653209 1631754 1607280 1583126
8580 1583126 1562151 1546784 1526624 1505514 1484610 1466034 1449520 1432359 1408285 1387194 1372643
8569 1372643 1359627 1337435 1324256 1312382 1289220 1271921 1254097 1246689 1232288 1216496 1207392 1195911
8557 1195911 1183363 1165412 1144218 1126583 1113215 1094343 1085214 1076631 1063175 1054673 1041414 1027380
8545 1027380 1017880 1010791 1002074 994882 987675 976097 966427 953848 950836 948968 932610 918444 908908
8532 908908 897941 883519 882280 873209 858086 848121 843358 841804 835345 826293 827626 817328 806811
8519 806811 797676 791121 787659 775801 771889 765764 757001 751640 750383 742241 736273 729766 720986 716215
8505 716215 716588 714885 707762 692685 683972 683774 684057 685916 678793 676238 672125 663118 657943 654055 644625
8490F44625l825j601l849m577n592q735j0358m150j0487o678j2197j5669l997
8477E52910l100q985n872r680p094n9q166l833o020o110l907J104o701o316l341
8462D74830l362o834k242k100n691m278p648k893K408q475j587n305p090k755
8448D16978o582o23Q13l016m733m184o212p569r367n390l532J270N440l217l780
8433C66296k767o339k457j255j984j767k449n470K333n83o856j1205l739L580
8419C25338p552J325L285m924m158j082j069K911n610o534m994r127k129k106
8405B83574L286j934k600k370k980K019K29n233k259l032J745O83n749n958k917
8390B56504O686o062j3093m339M263o43L833o99j903L282P387k791o65n248o240
$$ plain form
8490 644625 640800 639199 635350 630773 625181 616446 606088 601938 591451 584773 572576 556907 552910
8477 552910 549810 540825 534953 525273 518179 518120 509954 506121 500101 493991 490084 491188 484487 478171 474830
8462 474830 471468 464634 462392 460292 454601 450323 442675 439782 442190 433715 432128 426823 419733 416978
8448 416978 410396 409773 410586 407570 402837 398653 392441 384872 375505 370115 366583 367853 373293 370076 366296
8433 366296 363529 357190 354733 353478 351494 349727 347278 341808 344141 343558 336702 325497 321758 325338
8419 325338 317786 319111 322396 317472 313314 312232 311163 314074 308464 301930 296936 287809 285680 283574
8405 283574 286860 284926 282326 279956 276976 278995 279224 273991 271732 268700 270445 271128 265379 259421 256504
8390 256504 263190 257128 244035 239696 243959 243316 247149 246450 244547 247829 255216 252425 251760 246512 240272
8375B40272l465k154k691N531K802r025l93j646n941k486k72L333J870J317o289
8360B20763j861q781k642M830j135M060J068o779m068k823J69L804j841n877k775
8345A96112l731j503n831l754L643K005j768j286l580j016k599k751J857N364
8331A81162M736L051k625j122J0642J0509J1147J0022J509L871k184j3235j2594
8318B04889r254l342o288j2375r081n190l056K208M033l660K588O120K648l671
8304A66569n667L03m134j982Q413l627n788J227P28m672j649j920l441l080n022
8289A36258j075N30P598j511m202r24J119k614n141N87L558J129J057L308K028
8274A41705k770l937M97j163o673o660j1530J529J039P284L172j15K417j706j381
$$ plain form
8375 240272 236807 234653 231962 237493 240295 231270 230877 229231 223290 220804 220532 223865 225735 227052 220763
8360 220763 218902 210121 207479 212309 211174 215234 216302 209523 205455 202632 202801 206605 204764 198887 196112
8345 196112 192381 190878 185047 181293 184936 186941 185173 183887 180307 179291 176692 173941 175798 181162
8331 181162 185898 188949 186324 185202 195844 206353 217500 227522 229031 232902 230718 217483 204889
8318 204889 195635 192293 186005 173630 164549 159359 156303 158511 162544 158884 161472 167592 170240 166569
8304 166569 160902 161205 157071 155089 163502 159875 154087 155314 156042 151370 149721 147801 144360 141280 136258
8289 136258 135183 135713 143311 141800 137598 136674 137793 135179 130038 130625 134183 135312 136369 139677 141705
8274 141705 138935 134998 135495 134332 127659 120999 109469 110998 112037 119321 122493 122378 124795 123089 121708
8259A21708l52o389o5N628L919M247k943l082k10k417q622k962j30O327O615N955
8243A27227o962p348j558r66m965m4M197J181m031K050O620J235L899l437K358
8228A19456l569N469L409l76J544M600M249Q798K0416J2506j830k789j067q19
8214A69997o01K486j1780j6496j7815r957M713K66k574J178m467J608j827k013
8200A12718J045k758m763l94J975j124l176m921J376m262r67n434J672J2931o08
8185A03310M172L447l229m851N113J3163J8544J1993R48J511j446n023J810J374
8171A50836K350l435j2443j4791q936p433m911n907R74k477n613j4m290O11Q973
8156I3494M458J264r677j0987q660K81L564O723j417j3647l395K590P396P550
$$ plain form
8259 121708 121356 114967 114902 120530 124449 128696 125753 122671 122461 120044 111422 108460 108330 114657 121272 127227
8243 127227 120265 112917 111359 110393 105428 105384 109581 110762 106731 108781 115401 116636 120535 117098 119456
8228 119456 115887 121356 124765 124389 125933 130533 134782 143580 163996 176502 174672 171883 170816 169997
8214 169997 169396 171882 160102 143606 125791 115834 120547 120813 118239 119417 114950 116558 114731 112718
8200 112718 113763 111005 106242 105848 107823 106699 103523 98602 99978 95716 94749 89315 90987 103918 103310
8185 103310 107482 110929 107700 102849 107962 121125 139669 151662 152610 154121 152675 147652 149462 150836
8171 150836 153186 149751 137308 122517 113581 106148 101237 95330 96304 93827 88214 88200 83910 84521 93494
8156 93494 97952 99216 89539 78552 69892 70173 73737 80460 79043 65396 62001 64591 71987 79537
8142G9537k345N735k534l434o879l181J481J611k266K149j722j790K760p97L82
8127F8707J191l888K671M552L584J934k977j629L669n112n919n92l696J410J623
8112F5528j373k092L019Q40K757j436M59L622l655p086n85M580K75j317K120j500
8096F4156r405n186K366K060K370l49P761P140J361k244m001o685J897K28O57
8081F2126k617k071J816K884m000r847Q277J40n324m04K095j892l376P197L653
8066E8657j182l772j805q3j76N705k004n512J888J771J506l840M393J965K013
8051E9524j188J280j586Q30o743k942l372K80K066K797k61J075k247k915N405
8036E2003n2J691J290j110j853K868n22l943K822k995k639N956J903l943L96n128
$$ plain form
8142 79537 77192 82927 80393 76959 70080 66899 68380 69991 67725 69874 68152 66362 69122 68325 68707
8127 68707 69898 66010 68681 73233 76817 78751 75774 74145 77814 72702 66783 66191 62495 63905 65528
8112 65528 64155 62063 65082 65922 68679 67243 67702 71324 67669 60583 59998 64578 64853 63536 65656 64156
8096 64156 54751 49565 51931 53991 56361 56012 63773 70913 72274 70030 66029 59344 61241 61469 62126
8081 62126 59509 57438 59254 62138 58138 48291 56568 56708 51384 50980 53075 51183 47807 55004 58657
8066 58657 57475 53703 51898 51815 51639 57344 55340 49828 51716 53487 54993 51153 55546 57511 59524
8051 59524 58336 59616 58030 58860 52117 49175 45803 46083 48149 50946 50685 51760 49513 46598 52003
8036 52003 51951 53642 54932 53822 51969 54837 54315 50372 53194 50199 47560 53516 55419 51476 51872 46744
8020D6744l277j44j273K569M46J110L166k180m426L643J085o034M197L792K834
8005E2252l529m298K637M670M86l03J581Q82m263m380K465K649j43j478n590L3
7989D3671p021j405M156L272O41J975P189j324k413q714j90L423l469J318P547
7974D8656L135n049k298m343q794K376L882K099P189j508M782l88j474N287R74
7959E4526J287l905r55p289M826R126l499k514L743k218k10K743k238k069J284
7944E2638L189j949Q45q35p653J144M05n275M431J766L098K653n236K032m120
7929D7133J833J0375k420k15q36m584r030o821K251N541k409M119k00O841J329
7914E2907n030Q28L318k907n84j457k971K280K619k73P01M67n754p224r20R304
$$ plain form
8020 46744 43467 43323 42050 44619 45065 46175 49341 47161 42735 46378 47463 41429 45626 49418 52252
8005 52252 48723 44425 47062 51732 52218 51915 53496 54378 50115 45735 48200 50849 50706 49228 43638 43671
7989 43671 36650 35245 39401 42673 43314 45289 52478 51154 48741 40027 39837 43260 39791 41109 48656
7974 48656 51791 46742 44444 40101 31307 33683 37565 39664 46853 45345 50127 49739 48265 53552 54526
7959 54526 55813 51908 50953 43664 48490 57616 54117 51603 55346 53128 52918 55661 53423 51354 52638
7944 52638 55827 53878 54723 53888 46235 47379 47784 42509 46940 48706 51804 54457 49221 51253 47133
7929 47133 48966 59341 56921 56706 55870 51286 42256 35435 37686 43227 40818 44937 44737 51578 52907
7914 52907 47877 48705 52023 49116 48532 47075 44104 46384 49003 48730 49431 49898 44144 36920 36000 45304
7898D5304R52j985N455J362o129K793M754J093n3j084K921Q69J329o606l172J403
7882D9206l57k317L333L474N32k161j894O64l87O70m094J930Q807K777k974k279
7866E4930M359m145m697q802n482L276k88k896j220N461L517m62Q34K283R6J033
7850D7797m154k936M326K767j023J629j883L61K440M889J512o517o822k551q455
7835C1380n276M35L526O40J734O941J457P91l871L874K38o536l638j279L318j454
7819C2280J969N38n60l6o48O269O780l683j455j144K904K521o372M91l343m468
7803C2043l751L499K860n37k333l978m870M939k972k439J481j153L431P642k35
7788C3627m425k501j393K408l907p028L906J0410m56p675K947J902k358J170K357
$$ plain form
7898 45304 46256 44271 49726 51088 44959 47752 52506 53599 53546 52462 55383 56252 57581 50975 47803 49206
7882 49206 48849 46532 49865 53339 53871 51710 49816 50480 50093 50763 46669 48599 57406 60183 57209 54930
7866 54930 59289 55144 50447 41645 36163 39439 39151 36255 35035 40496 44013 43551 44385 46668 46764 47797
7850 47797 43643 40707 45033 47800 46777 48406 46523 46884 49324 54213 55725 49208 42386 39835 31380
7835 31380 26104 26539 30065 30705 32439 39380 40837 41628 37757 41631 41869 35333 31695 30416 33734 32280
7819 32280 34249 34787 34227 34191 33543 39812 46592 42909 41454 40310 43214 45735 39363 39854 36511 32043
7803 32043 28292 31791 34651 34114 31781 27803 22933 27872 24900 22461 23942 22789 26220 33862 33627
7788 33627 29202 26701 25308 27716 23809 16781 20687 31097 30641 22966 25913 27815 25457 26627 28984
7773B8984M667k90q48k791l08Q4l728o273r42k472n456M31O283K201Q78K436K410
7756B5266M44L65k7j29j71j754J49M11K426L093j328n200m401m483O47j340N82
7739A4550l315j024N614L555L529k963m375J218N131m43J945K580l719l744L364
7724B1903Ol852m400q021K56m987N095O453n75j34K690M340N444m873o788M94
7708A3051K071o12k256k952m433n899Q729J0254N045M891m263k034l945q918o427
7693B302m334O481P514K648l662q32L948J903m63Q324P14k359o734m601j795P34
7677I788J88J289o759k152j924N64j381k278K109Q217N444L813M818O068j26m789
7661B2889k581l673l812l3K466J893L445l228k174K211M179j4l30n601p400j749
$$ plain form
7773 28984 33651 33361 32513 29722 29414 29498 25770 19497 18555 16083 10627 11058 17341 19542 20420 22856 25266
7756 25266 25710 26075 26048 25919 25748 23994 24143 24554 26980 30073 28745 23545 19144 14661 15308 13968 14550
7739 14550 11235 10211 15825 19380 22909 19946 15571 16789 21920 21477 23422 26002 22283 18539 21903
7724 21903 21909 18057 13657 5636 5892 905 6000 12453 11878 11744 14434 18774 24218 19345 12557 13051
7708 13051 15122 14510 12254 9302 4869 -1030 7699 17953 22998 27889 23626 21592 17647 8729 2302
7693 2302 -2032 4449 11963 14611 10949 10117 14065 15968 15505 23829 24543 22184 15450 10849 9054 9788
7677 9788 9976 11265 4506 2354 430 994 -387 -2665 -556 7661 13105 16918 21736 27804 27678 22889
7661 22889 20308 16635 12823 12790 15256 17149 20594 17366 15192 17403 21582 21568 21238 15637 8237 6488
7645F488M214K315m350m21j381j158O427k93l181N050Q226L392j399m721M51O595
7629B6254k425l433o869o88L988O383j554p223p561P253p08n305m645P492k430
7614H529k620J17L187J513J829K01l991m26L535K568l866K026j825j489k8q77
7598H383L479K459K341p65P73k555l867m83O05J182j281l966p409k732N02L866
7582E32M423O426J814j308l006J512K390K362L839N82m787j2304k380O519K258
7567H872L344K544j268p273l400L502K755k805j361j790J754N115R348M608q033
7552A5912j858j560J594k092o958o776o35L353r0K060J827K971L451J084m313
7537G970K842O953L034r93l834n3L18p124q030o025j719O529J0462N270J649m313
$$ plain form
7645 6488 10702 13017 8667 8246 6865 5707 12134 11841 8660 13710 21936 25328 23929 19208 19659 26254
7629 26254 23829 20396 13527 12839 16827 23210 21656 14433 6872 14125 13417 8112 3467 10959 8529
7614 8529 5909 6026 9213 10726 12555 12756 8765 8339 11874 14442 10576 12602 10777 9288 9260 8383
7598 8383 11862 14321 16662 15897 16670 14115 10248 9765 10370 11552 10271 6305 -1104 -3836 -3334 532
7582 532 4955 11381 13195 11887 8881 10393 12783 15145 18984 19566 14779 2475 95 6614 8872
7567 8872 12216 14760 13492 6219 2819 6321 9076 6271 4910 3120 4874 9989 19337 23945 15912
7552 15912 14054 12494 14088 11996 5038 -1738 -2373 980 890 2950 4777 7748 11199 12283 7970
7537 7970 10812 17765 20799 19806 15972 15919 16237 9113 1083 -4942 -6661 -132 10330 15600 17249 12936
7521A2936n258l646N836j44m653J014N699j037o503L557K523K895k300p60m278
7506E881p383j583N694L544k18k087J033k08j253j306K537M273j67m774M015j071
7490F927j239M548J995k59N591k733k743N36j427n982K647j234m375M818J581
7475H651K334j594k921K074K255j299K031k572K118q01Q89m535L195K695q02J81
7459A1899l679K71m76l340m93N016P976k702p133m379J305N58j215q359j67Q152
7443C234J962m146j815l518J357r17l459K791O055J184K843K900p082l679M74
7428a816K177O255k494n363l691o518M220P336p18J621L414J070l745o583p11
7413e546N979k786N553L071O652K291l761l123L025n549k73N874l913r25K800
$$ plain form
7521 12936 7678 4032 9868 9724 5071 6085 11784 10747 4244 7801 10324 13219 10919 10159 5881
7506 5881 -1502 -3085 2609 6153 5935 3848 4881 4673 3420 2114 4651 8924 8757 3983 7998 6927
7490 6927 5688 10236 12231 11972 17563 14830 12087 12623 11196 5214 7861 6627 2252 7070 8651
7475 8651 10985 9391 6470 8544 10799 9500 11531 8959 11077 10276 11165 6630 9825 12520 11718 11899
7459 11899 8220 8491 8015 4675 4182 9198 17174 14472 7339 2960 4265 4823 3608 -4751 -4918 3234
7443 3234 5196 1050 -765 -4283 -2926 -3843 -7302 -4511 1544 2728 5571 8471 1389 -2290 -1816
7428 -1816 361 6616 4122 -1241 -4932 -11450 -7230 106 -612 1009 4423 5493 1748 -4835 -5546
7413 -5546 433 -2353 3200 6271 12923 15214 11453 8330 11355 5806 5533 11407 7494 6569 9369
7398I369j812o965K791M425O542p156j1544p4O650P896M523o93o840n703L56N93
7382B358j798n010K297J1417J490l817n402j158m7K307J84L448L141L962k082
7367A1290l706l0K076J207m231l580m031L305J502K348j329p78p19p77K270j998
7351B819m397O752K686n239J395M348n308P67L845J222m235o45K697k695n803
7336a791K871J315K251k886j180O023L748k417l485n196K170l175p642L577N416
7321d01M142M506O007k481q399k199M030M786j238o749L7O854K390O750q340p089
7305B606n044l630l854o23M671n37m701N224n042M490O099m689m527K201n052
7290a2408n85Q547J862L89N474M436K961N45j61K446o63o728j361J566n608n212
$$ plain form
7398 9369 7557 592 3383 7808 14350 7194 -4350 -4424 2226 10122 14645 13952 7112 1409 1765 2358
7382 2358 560 -4450 -2153 9264 10754 6937 1535 377 330 2637 2821 6269 9410 13372 11290
7367 11290 7584 7554 9630 10837 6606 3026 -1005 2300 3802 6150 4821 4043 3324 2547 4817 2819
7351 2819 -1578 5174 7860 2621 4016 8364 3056 3823 7668 8890 4655 4010 6707 4012 -1791
7336 -1791 1080 2395 4646 1760 580 6603 10351 7934 4449 -747 1423 -1752 -9394 -5817 -401
7321 -401 3741 8247 14254 11773 3374 1175 5205 9991 8753 2004 2041 8895 11285 18035 9695 2606
7305 2606 -2438 -6068 -9922 -10545 -5874 -6411 -11112 -5888 -10930 -6440 -341 -5030 -9557 -7356 -12408
7290 -12408 -12993 -4446 -2584 -2195 3279 7715 10676 11221 11060 13506 12843 6115 4754 6320 712 -4500
7274d500n300j88P564M455O798O685n021m981j799m836j120l709k392K712O653
7259A021j308K103M482r00J772K302p585j31R00j314k960L284J775k873J568j542
7243E94J077m002l22l591M7L168q23q35R50k803m738l469J447O889k30R037L415
7226E811n82j350J090o301k737M889M484l879q390M462R27N31L121r63p01k262
7210a850j689O229k070r654l820J2782J1953o55m081p055l701J409J482J539M0
7195H59l172K902N097k859l341M04ol188K125J739K02J1013M741p127l590p065
7179a266l029l923n62N138M244j43j760l515j673P705p13k404J544o94m37m535
7163f023n896j40N889M173Q403M909q183k369p368o59M109M066M450j238m637
$$ plain form
7274 -4500 -9800 -9988 -2424 2031 8829 15514 10493 5512 3713 -1123 -2243 -5952 -8344 -5632 1021
7259 1021 -287 1816 6298 5398 7170 9472 1887 1756 2656 1342 -1618 1666 3441 568 2136 594
7243 594 1671 -2331 -2653 -6244 -6197 -3029 -3852 -4687 -3737 -6540 -11278 -14747 -13300 -6411 -6641 2396 5811
7226 5811 5229 3879 4969 -1332 -4069 820 5304 1425 -6965 -2503 -1576 -1045 2076 1113 412 -1850
7210 -1850 -3539 2690 620 -9034 -12854 -72 11881 11226 7145 90 -3611 -2202 -720 819 859
7195 859 -2313 589 5686 2827 -514 -110 -116 -3304 -1179 560 762 11775 16516 9389 5799 -1266
7179 -1266 -4295 -8218 -8780 -3642 602 459 -1301 -4816 -6489 1216 503 -1901 -357 -1051 -1488 -6023
7163 -6023 -11919 -12059 -6170 -1997 6406 11315 3132 763 -6605 -7264 -3155 911 5361 4123 -514
7148e14m409O51M71L996L377J72k936k249J830l830p029m361L797P715M987J406
7132C074P22k728J687M048l829n260K338l176L19J789l667o726l857O394Q053
7117h19J531J484M726J597j076k751l055l366J866l04m777k934m98l059K49N126
7101f060K890K796L871r42O760J899o079o355L329K603l223K353L170j933l466
7086A613L957N408j182L161M98k516q290k030k967K705k33m85L572J762P99l572
7070B200k332L499M55n563m24Rm877k095k303j667o993l91Q354K797k582L855
7054h058Q55j264M038k132J047k868R408O730J966o424o605m024L564K865P249
7039F347L175j440r402m428j368N851k745K020M799o52n053J222K880l559k039
$$ plain form
7148 -514 -4923 -4272 -3801 195 3572 3744 808 -1441 389 -3441 -10470 -14831 -11034 -3319 1668 3074
7132 3074 3796 1068 2755 6803 2974 -2286 52 -3124 -2805 -1016 -4683 -11409 -15266 -8872 -819
7117 -819 712 2196 6922 8519 7443 4692 1637 -1729 137 -167 -4944 -7878 -8376 -11435 -11186 -6060
7101 -6060 -3170 -374 3497 2555 9315 11214 5135 -1220 2109 4712 1489 3842 7012 5079 1613
7086 1613 5570 10978 9796 12957 13455 10939 2649 619 -2348 357 124 -361 3211 4973 5772 2200
7070 2200 -132 3367 3822 -1741 -2165 -2156 -7033 -9128 -11431 -13098 -20091 -20482 -12128 -9331 -11913 -8058
7054 -8058 -7203 -8467 -4429 -6561 -5514 -8382 1026 7756 9722 3298 -3307 -7331 -3767 -902 6347
7039 6347 9522 8082 -1320 -5748 -7116 -1265 -4010 -1990 2809 2157 -2896 -1674 1206 -2353 -4392
7024d392L314L208j562l445J438N630K567m75q86k694O068m83p468q309o36M040
7008d085j635M964k164k424q19j309l13P477J460l06j271o53R06k06k785q80P903
6991C860j75l497n059N403P25r47M631j084m322K833m16K226K784j848j652l919
6975d57M75p19l23m284j232N313k5n525M0M459O530m234n538j788J537J580q88
6958e079K540M340j07m930J68m065K515P443L493l571q771k202J532p241N967
6943g968K141K923j413N23L462j937l529j267J981L223N63J497K291q606n002
6928a1118J469m09K356K067N618J37n818M375m568n566o136O008O632J993J110
6913a850j657Q21k638k17J412L308j790j056k623j370m985O350J1459j46k555
$$ plain form
7024 -4392 -1078 2130 568 -2877 -1439 4191 6758 6283 5397 2703 8771 8288 820 -7489 -8125 -4085
7008 -4085 -5720 -756 -2920 -5344 -6163 -7472 -7785 -308 1152 846 -425 -1078 -172 -378 -3163 -4043 3860
6991 3860 3685 188 -4871 532 1257 310 4941 3857 -465 2368 1952 4178 6962 5114 3462 -457
6975 -457 18 -701 -1024 -5308 -6540 -1227 -1252 -6777 -6737 -2278 4252 18 -5520 -7308 -5771 -4191 -5079
6958 -5079 -2539 1801 1694 -3236 -3068 -7133 -4618 2825 6318 2747 -6024 -8226 -6694 -13935 -7968
6943 -7968 -5827 -2904 -4317 -3794 -332 -2269 -5798 -7065 -5084 -1861 -1298 199 2490 -6116 -11118
6928 -11118 -9649 -10058 -7702 -5635 -17 120 -5698 -1323 -5891 -11457 -17593 -11585 -4953 -2960 -1850
6913 -1850 -3507 -2686 -5324 -5541 -4129 -821 -2611 -3667 -6290 -7660 -12645 -6295 5164 5018 2463
6898B463o715j08K091j879J355l175K788K323l810J428L295M462j971l544o434
6883g431k245k571m407K109M611L903j951N687M090p58N40J560j996k384j435
6868b678j564O990R003j561p017p091K547j051k481K667j23k779l27L575k916
6853d806L514K239j934j267J406L044k496o175N684N172m211K601k147n374M161
6838e89L393p577m166j055j077N836j373L225Q844k536j005K570M141l744o416
6823a529J439n141j198J803M462K46q16N249o788j262K314m253R75j704L886J058
6807a259J195K823j43R40o19M587K795m035q810m699k238j927L393O380L308K517
6791D208K399j0038m603K047N56p25l987M072M211J286J719K667K904j811l208
$$ plain form
6898 2463 -4252 -4360 -2269 -4148 -2793 -5968 -3180 -857 -4667 -3239 56 4518 2547 -997 -7431
6883 -7431 -9676 -12247 -16654 -14545 -9934 -6031 -7982 -2295 1795 1037 1577 3137 1141 -1243 -2678
6868 -2678 -4242 2748 11751 10190 3173 -3918 -1371 -2422 -4903 -2236 -2359 -5138 -5465 -1890 -4806
6853 -4806 -1292 947 -987 -2254 -848 2196 -300 -6475 -791 4381 170 2771 624 -4750 -589
6838 -589 2804 -4773 -8939 -9994 -11071 -5235 -6608 -3383 5461 2925 1920 4490 8631 4887 -1529
6823 -1529 -90 -5231 -6429 -4626 -164 82 -734 4515 -2273 -3535 -1221 -5474 -4499 -6203 -2317 -1259
6807 -1259 -64 2759 2616 3556 2937 7524 10319 6284 -2526 -7225 -9463 -11390 -7997 -1617 1691 4208
6791 4208 6607 -3431 -8034 -5987 -5431 -6156 -10143 -6071 -1860 -574 1145 3812 6716 4905 1697
6776A697l839j07N252L082l512j984N849M805l58j124n597J950j096k133k800
6761H5m41K419k132q13k90J102j163m680l806m85N30L622K174m84p99j649O604
6744b06M991o027k150L817l097l65Q45K862j849J733o705k802L51J148N819K071
6728D36k581J289J395K819J864k204l14O46k501l135J767Q06K230R41l713k611
6712b866K690k793Q75j073k008k056k455m445M083P682O892l250L599l385P28
6697B218p80r73J966q82m109k163K991j994K870K61p07N266Q7m37j054K996l10
6680E246n157p81l793K942J671J846K782k331k217l251q712r200P42R90L576R263
6664f384K154L060J813k545p266k223r47j559J205J715L14J007R394Q229r476
$$ plain form
6776 1697 -2142 -2249 3003 6085 2573 589 6438 11243 10885 9761 4164 6114 5018 2885 85
6761 85 -356 2063 -69 -882 -1172 -70 -1233 -5913 -9719 -10204 -9674 -6052 -3878 -4362 -5161 -6810 -206
6744 -206 4785 -1242 -3392 425 -2672 -3037 -2192 670 -1179 554 -6151 -8953 -8602 -7454 -1635 436
6728 436 -2145 -856 539 3358 5222 3018 2704 3350 849 -2286 -519 287 2517 3458 -255 -2866
6712 -2866 -176 -2969 -2094 -3167 -5175 -7231 -9686 -14131 -10048 -2366 4526 1276 4875 1490 2218
6697 2218 1438 465 2431 1549 -2560 -4723 -1732 -3726 -856 -595 -1302 3964 4051 3614 2560 5556 5246
6680 5246 89 -692 -4485 -1543 128 1974 4756 2425 208 -3043 -11755 -20955 -20213 -19223 -15647 -6384
6664 -6384 -4230 -1170 643 -1902 -9168 -11391 -12338 -13897 -12692 -10977 -10663 -9656 -262 7967 -1509
6649a509o480N870J0098K160l477k046J420J760m014p431p529L93K334P56N234
6634b461N502N269n802j0009N775R659L89r489J888Q431l220n219k791j260M640
6619A302l009r310L650J739L013K806j89L684o39m508m600l60J479K582K208J927
6603A775j806k591M677k462M055K05q63N80K347L555j908n326n452L636k04k756
6587b538l052J338K103P13j479N218l785P02P30L389j187j131p119J10o094o2
6571a2144M896J594L00M072O835k733q751q954M79K599r3p79l355k143L589N386
6555i202K6K972k018O408J2674j36J996L092j95m416o995k334m749J102j64q5
6539b024O29J882K918j672m745j170M361N54j525k714L58q78J984j039p080k307
$$ plain form
6649 -1509 -7989 -2119 7979 10139 6662 4616 6036 7796 3782 -3649 -11178 -10785 -8451 -7695 -2461
6634 -2461 3041 8310 2508 -7501 -1726 7933 8322 -1167 721 9152 5932 713 -2078 -3338 1302
6619 1302 -1707 -11017 -7367 -5628 -2615 191 2 3686 3047 -1461 -6061 -6421 -4942 -2360 -152 1775
6603 1775 -31 -2622 2055 -407 3648 3853 2990 3570 5917 9472 7564 2238 -3214 422 218 -2538
6587 -2538 -5590 -4252 -2149 -1436 -2915 2303 -1482 -780 -50 3339 2152 1021 -6098 -5988 -12082 -12144
6571 -12144 -7248 -5654 -5354 -1282 5553 2820 -5931 -14885 -14406 -11807 -11900 -12679 -16034 -18177 -14588 -9202
6555 -9202 -9176 -6204 -8222 -1814 10860 10724 12720 15812 15617 11201 4206 1872 -2877 -1775 -1939 -2024
6539 -2024 -1395 487 3405 1733 -3012 -4182 179 733 -792 -3506 -3148 -4026 -2042 -3081 -10161 -12468
6523a2468M77l311K941J688m356j435Q933R041O091o605l005M08p88r48l475j287
6507h099P432j168l278J90l947k812j9j197l273L885Q694J09O437m44m792J429
6491h53J194j045m946j671J365L896K214j92J728l903n268R05L943p25l19K421
6475a256K957k060k362j206k661L15O21L099L36O72p50K07j149k113k455K17L459
6458d129Q42R346l17k177p64j709k852K129O191m730l574l645o63O341l437r285
6442a2433l794N855P870M09K297j830p46l062o112L158Q388N68J205j9M599K904
6426I257q117j082K231j806M614M55p352L4l922J623J124j42k867o62m77K767
6410d322R404K95p885l214m713k281K735J855O612M589J466m908l556J274L468
$$ plain form
6523 -12468 -11991 -15302 -12361 -10673 -15029 -16464 -7531 1510 7601 996 -2009 -1601 -2389 -3337 -6812 -8099
6507 -8099 -667 -1835 -5113 -4923 -8870 -11682 -11701 -12898 -16171 -12286 -3592 -3483 2954 2510 -2282 -853
6491 -853 341 -704 -5650 -7321 -5956 -2060 154 -38 1690 -2213 -7481 -6576 -2633 -3358 -3677 -1256
6475 -1256 1701 -359 -2721 -3927 -6588 -6273 -5652 -2553 -2217 -1545 -2295 -2088 -3237 -5350 -7805 -7588 -4129
6458 -4129 -3287 6059 5742 3565 2801 1092 -1760 369 6560 1830 -1744 -5389 -6052 289 -3148 -12433
6442 -12433 -16227 -10372 -2502 -2093 204 -1626 -2372 -5434 -11546 -8388 0 568 1773 1754 6353 9257
6426 9257 1140 58 2289 483 5097 5552 -1800 -1766 -5688 -4065 -2941 -3083 -5950 -6612 -7089 -4322
6410 -4322 5082 5377 -2508 -5722 -10435 -12716 -9981 -8126 -1514 3075 4541 -367 -3923 -2649 819
6395H19p85l076J509l360L000O750j0025j265l47M507L555J947J231l856j797
6380a193l317k358N458K779N524K925j331J623j58m630p76p004l515j679l902
6365a1554j681O553R410P210J247m726%l840o420n821l260O355R409j513l266
6350a897l972j973K628q33m90j088l200J743j742k709K901J520M436L158L325
6335A807j557M852K540N8n575n302n277o17K067J553J03M076N980M497J700R44
6319A1849j206r676p424J767K916j54L223j919j658q97l549K199M370l930l604
6304g693O717N074q29j381q89O248k411n271p110m072L756k845o93J244K234j08
6288h029n98P718J353J462M219m472q479M99m79k129l938j804L309L96q34Q35
$$ plain form
6395 819 34 -3042 -1533 -4893 -1893 4857 -5168 -6433 -6780 -2273 1282 3229 4460 604 -1193
6380 -1193 -4510 -6868 -1410 1369 6893 9818 8487 10110 9952 5322 4546 -2458 -5973 -7652 -11554
6365 -11554 -13235 -6682 2728 9938 11185 6459 6459 2619 -3801 -9622 -12882 -6527 2882 1369 -1897
6350 -1897 -5869 -7842 -5214 -6047 -6537 -7625 -10825 -9082 -10824 -13533 -10632 -9112 -4676 -1518 1807
6335 1807 250 5102 7642 7700 2125 -3177 -8454 -9071 -7004 -5451 -5348 -1272 4708 9205 10905 11849
6319 11849 10643 967 -6457 -4690 -1774 -1928 1295 -624 -2282 -3179 -6728 -4529 -159 -4089 -7693
6304 -7693 -976 4098 3269 1888 999 7247 4836 -435 -7545 -11617 -7861 -10706 -11399 -10155 -7921 -8029
6288 -8029 -8627 -909 444 1906 6125 1653 -6826 -6327 -6806 -8935 -12873 -14677 -11368 -10972 -11806 -10971
6272a0971J032K652P474R592J977m782n419M0j516j791j0455p553k536P49j1p377
6256b8895J717J100M180L118k936M034O708M560J550p541m211M014Q936J291p902
6241a0277j152J49K472L347K612m744P0P321M475n270P10Q608k892k761j588J943
6225C023N491k528k575J466j0121m494J069J600R17k310M250J636l027k495k988
6210a1086L122l92J536M53k440P89M945j136m320J579j652M209P919L050l041
6195C535l294o36k077m13j681j963k814j08K355N721L062r534n231K39P778p17
6179e778K68k569k052L233J373o453L652K594o619o366M074O377P906l496n777
6164i633K198N61j780J1205P189p952q306m411J820M430n603r98L482Q25L254
$$ plain form
6272 -10971 -9939 -7287 187 9779 11756 6974 1555 1595 79 -1712 -12167 -19720 -22256 -21507 -21518 -28895
6256 -28895 -27178 -26078 -21898 -18780 -21716 -17682 -10974 -6414 -4864 -12405 -16616 -12602 -3666 -2375 -10277
6241 -10277 -11429 -11280 -8808 -5461 -2849 -7593 -7523 -202 4273 -997 -287 8321 5429 2668 1080 3023
6225 3023 8514 5986 3411 4877 -5244 -9738 -8669 -7069 -6152 -8462 -4212 -2576 -5603 -8098 -11086
6210 -11086 -7964 -8356 -6820 -6367 -8807 -8018 -3073 -4209 -8529 -6950 -8602 -4393 3526 6576 3535
6195 3535 241 -395 -2472 -2885 -4566 -6529 -9343 -9451 -7096 -1375 1687 -7847 -13078 -12839 -5061 -5778
6179 -5778 -5510 -8079 -10131 -6898 -5525 -11978 -8326 -5732 -12351 -18717 -14643 -8266 -360 -3856 -9633
6164 -9633 -7435 -6874 -8654 2551 9740 1788 -6518 -10929 -9109 -4679 -10282 -11280 -7798 -6973 -3719
6149c719k855j0899k426L847j062K874M839K992N727k376l33m182o900K175P382
6134d916L113n66m006n413Q98l19L493L945L032L560j547M39j380m886n210j542
6118a1305N637R41n95k384L756N399n874j882P9L867J141O590l060m446n039o98
6102g873K922N902k557l308j890o80J890N405O490n03p366k660l916k935M942
6087f137J1786N263p037p139j296m02j956k353j041K938J80k495L443l61K300
6072d307K811k700J338K176l877J422L634p18K048Q490m233o836J841M79n03l613
6056b548j2985n354J828N150M838M81N88K533K25n702L7O464N909P84j730k22
6040B96j913q466l545k149O469J507M150j392L096M201J281k185m386l640j287
$$ plain form
6149 -3719 -6574 -17473 -19899 -16052 -17114 -14240 -9401 -6409 -682 -3058 -3391 -7573 -14473 -12298 -4916
6134 -4916 -1803 -2369 -6375 -11788 -10890 -11209 -7716 -3771 -739 2821 1274 1713 333 -4553 -9763 -11305
6118 -11305 -5668 -4727 -5322 -7706 -3950 1449 -4425 -6307 -6228 -2361 -1220 5370 2310 -2136 -7175 -7873
6102 -7873 -4951 951 -1606 -4914 -6804 -7484 -5594 -189 6301 5798 -1568 -4228 -8144 -11079 -6137
6087 -6137 5649 10912 3875 -3264 -4560 -4962 -6918 -9271 -10312 -7374 -7194 -9689 -6246 -6607 -4307
6072 -4307 -1496 -4196 -2858 -682 -4559 -3137 497 -221 1827 10317 6084 -752 1089 1568 1065 -2548
6056 -2548 -15533 -20887 -19059 -13909 -9071 -8590 -8002 -5469 -5244 -10946 -10909 -4445 1464 2248 518 296
6040 296 -1617 -10083 -13628 -15777 -9308 -7801 -3651 -5043 -1947 2254 3535 1350 -3036 -6676 -7963
6025g963N285m830r508j132N145Q564K491k327j829p5P03J747M316l611n834J013
6009g845M542M000J959n458m614M65M890L91Q10O993N20k687l430r476k287n46
5993a1773M262J484L31N610Q144m984n518L683K984l790l381N557L60n374o439
5978h844p128K511P025j306J820o06K016k359K65K550J959N047N581P21p720K30
5962A762p578q87N227K416l573R70n63k1j767J591M583n780l832N465L253k339
5946a073L669L377n245o98j982k706o193m99M97J21J0198Q183o455j708j195j391
5930c100o021n658N75K605J668L126P011M40J047k16k978R94n258o453o015K607
5914a5626L459J336M679r36P451M595o912j320K873j872k099K237M449q32J155
$$ plain form
6025 -7963 -2678 -7508 -17016 -18148 -13003 -4439 -1948 -4275 -6104 -6179 -5476 -3729 587 -3024 -8858 -7845
6009 -7845 -3303 697 2656 -2802 -7416 -6951 -2061 -1670 -860 6133 6653 3966 536 -8940 -11227 -11773
5993 -11773 -7511 -6027 -5696 -86 8058 3074 -2444 1239 4223 433 -2948 2609 2969 -2405 -8844
5978 -8844 -15972 -13461 -6436 -7742 -5922 -6528 -4512 -6871 -6606 -4056 -2097 2950 8531 9252 1532 1762
5962 1762 -5816 -6703 -1476 940 -2633 -1663 -2226 -2247 -4014 -2423 2160 -3620 -7452 -1987 1266 -1073
5946 -1073 2596 5973 728 30 -1952 -4658 -10851 -11350 -10853 -10732 -534 7649 1194 -514 -1709 -3100
5930 -3100 -9121 -14779 -14204 -11599 -9931 -6805 206 646 1693 1477 -1501 -507 -5765 -12218 -18233 -15626
5914 -15626 -12167 -10831 -6152 -7088 363 4958 -1954 -3274 -401 -2273 -4372 -2135 2314 1482 2637
5899B637n789K073L841M791p786l956k433o234L082M332M475n67k497l30l301
5884g662r17m67M470P232K277M4j435j718K44j279l16J040n931j581Q68J95J485
5867c451l02r47j378O79j690K205j368n337n97L964M268j722k283M429k729Q114
5851A855J345j229K878j889n365j343l943k194K546K447K737J935K887j57j896
5836F14o001o454l126L052P649o85r70m55l526m041m69Q626O193n534k618j01
5820g846J30l969L466L570N260L686m144q457P15O470O0K1p9R31l28M966j286
5803C166k438K339l778k160K622K74O186k866m908l597K180J951J822n235k847
5788g289J961N081L69n91P540j921l760m114k857k860L80N966J205n629k736J897
$$ plain form
5899 2637 -3152 -1079 2762 7553 -233 -4189 -6622 -12856 -9774 -5442 -967 -1534 -4031 -4361 -7662
5884 -7662 -8579 -9046 -4576 2656 4933 4977 3542 1824 2068 789 473 1513 -4418 -5999 -5131 -4936 -3451
5867 -3451 -3753 -4700 -6078 -5399 -7089 -4884 -6252 -11589 -12186 -8222 -3954 -5676 -7959 -3530 -6259 1855
5851 1855 3200 1971 4849 2960 -2405 -3748 -7691 -9885 -7339 -4892 -2155 -220 2667 2510 614
5836 614 -5387 -11841 -14967 -11915 -4266 -4951 -5921 -6376 -9902 -13943 -14412 -5786 407 -5127 -7745 -7846
5820 -7846 -7716 -11685 -8219 -4649 611 4297 153 -8304 -7589 -1119 -1059 -1038 -1117 -186 -514 4452 3166
5803 3166 728 3067 -711 -2871 -249 25 6211 3345 -1563 -5160 -2980 -1029 793 -4442 -7289
5788 -7289 -5328 -247 122 -469 7071 5150 1390 -2724 -5581 -8441 -8061 -2095 -890 -6519 -9255 -7358
5772g358K632K000l14l357k97j809J159K330j909K32N366J883j054k180J694k694
5756c676O93Q803J284k404r370m283J429J350O94j1933R68O900L356L58O058L579
5740C806L638n759k819N28j237N98j612K781K304L063k035l649o669L27J0346
5725C611K302j894p622j466P61j141M072K019n949l060K371O520M230n609p454
5710h309p420K604N398j141j695l864J704K118Q98J114J395l70m72m6M908N233
5694B055k214r321J320Q785j862o187l047P488J805N375N429m329o644j769M477
5679A361K74L463o233o06R4j095K751K360K737k641k537l341J462L8K598P49l314
5662a880Q02k409l86L811n851j812M427O18n031K753R102P273l796m410r800l932
$$ plain form
5772 -7358 -4726 -2726 -3040 -6397 -6694 -8503 -7344 -5014 -6923 -6691 -1325 558 -496 -2676 -982 -3676
5756 -3676 -2983 5820 7104 4700 -4670 -8953 -7524 -6174 -5480 -17413 -16445 -9545 -6189 -5831 227 3806
5740 3806 7444 1685 -1134 -606 -1843 -1245 -2857 -76 2228 5291 3256 -393 -7062 -6735 3611
5725 3611 5913 4019 -3603 -5069 -4308 -5449 -1377 642 -5307 -8367 -5996 524 4754 -855 -8309
5710 -8309 -15729 -13125 -7727 -8868 -10563 -14427 -12723 -10605 -9707 -8593 -7198 -7568 -8040 -8086 -3178 2055
5694 2055 -159 -9480 -8160 625 -1237 -7424 -10471 -2983 -1178 4197 9626 5297 -1347 -3116 1361
5679 1361 1635 5098 -1135 -1741 -1647 -2742 9 2369 5106 2465 -72 -3413 -1951 -1913 685 1434 -1880
5662 -1880 -1078 -3487 -3873 -62 -5913 -7725 -3298 -2680 -7711 -4958 4144 11417 7621 3211 -6589 -10521
5646a0521O509O100M23n114J110K179j772o214l399L005O208j445J156l192o84
5631e651p666j092Q97L134K331R97l96n093K796J0607k399n111k141o35N628N726
5615A932N88l309n436j205K554M578m079l572Q526R490m386l154n508j077M719
5600F61J795K039m730m310m003l758O353J0976j09p34m210j760M487K390j849
5585C238l783m399L924M436j242l309j984L004K929J800r079m210K343J092j845
5570g085L56N759J018l410m579j848j248L551O285K477k832q008k324L59j976
5555a3505n242J759R026L988J147N82l675m800L06j201l55J513j310N58R846M893
5539C530m175n082J511k046O433M182o97o400M45J574k572n189j696l304K891
$$ plain form
5646 -10521 -4012 2088 2511 -2603 -1493 686 -1086 -7300 -10699 -7694 -1486 -2931 -1775 -4967 -5651
5631 -5651 -13317 -14409 -13512 -10378 -8047 -7050 -7446 -12539 -9743 864 -1535 -6646 -8787 -9422 -3794 1932
5615 1932 2520 -789 -6225 -7430 -4876 -298 -4377 -7949 577 10067 5681 2527 -2981 -4058 661
5600 661 2456 4495 -235 -4545 -8548 -12306 -5953 5023 4914 4180 -30 -1790 2697 5087 3238
5585 3238 -545 -4944 -1020 3416 2174 -1135 -3119 -115 2814 4614 -4465 -8675 -6332 -5240 -7085
5570 -7085 -6729 -970 48 -3362 -7941 -9789 -11037 -7486 -1201 1276 -1556 -9564 -11888 -11529 -13505
5555 -13505 -18747 -16988 -7962 -3974 -2827 -2245 -5920 -10720 -10414 -11615 -11970 -10457 -11767 -11209 -1363 3530
5539 3530 -645 -5727 -4216 -6262 171 4353 3656 -2744 -2299 -725 -3297 -8486 -10182 -13486 -10595
5524a0595O259l040K855K260l425N863k494l52N099l595p078k074J284K732j233
5509g534k809R16K530N866J044o117o845J0291P466o048R68j295j106k947M818
5494h02M534j975N475q81o847K919k136l553P100N208n954m157m327j923k188
5479i507O366J184l707K323L849J241N02r45M44k480L420l370J014K841p789m795
5463i409j160j367j781O58o83L65M578L489O018p56p645m54P015L020K732n126
5447e06J016Q70m814l593j982M361L70O165L39l378m691N151L210k591k329k587
5431d989l193k732p19K067O186N444l107J169P058M405l060o253l256K573l125
5416a532L452n22Q30L598J96L085L243j992l482n027o514n996L757l748k581L083
$$ plain form
5524 -10595 -4336 -7376 -4521 -2261 -5686 177 -2317 -2669 2430 -1165 -8243 -10317 -9033 -6301 -7534
5509 -7534 -10343 -9427 -6897 -1031 13 -6104 -12949 -2658 4808 -1240 -272 -1567 -2673 -5620 -802
5494 -802 3732 1757 7232 6351 -496 2423 287 -3266 3834 9042 3088 -1069 -5396 -7319 -9507
5479 -9507 -3141 -1957 -5664 -3341 508 1749 2251 1306 1750 -730 2690 -680 334 3175 -4614 -9409
5463 -9409 -10569 -11936 -13717 -13059 -13742 -13377 -8799 -5310 708 -48 -7693 -8147 -1132 1888 4620 -506
5447 -506 510 1380 -3434 -7027 -9009 -4648 -4278 1887 2226 -1152 -5843 -692 2518 -73 -2402 -4989
5431 -4989 -8182 -10914 -11633 -9566 -3380 2064 -1043 126 7184 11589 8529 2276 -980 1593 -1532
5416 -1532 1920 1398 2228 5826 6022 9107 12350 10358 6876 1849 -4665 -10661 -6904 -10652 -13233 -10150
5400a0150O882K027l681m177M763L191J979P81K118J607n7j243k472n024q50M436
5384A30K169l650J446n48m413p006O71o50J616K261J826k588J067J958J678M069
5368C6l156J874q90j925J820k443K823M87K568M00k603l581P77J457M253J199
5352C096k751k083L431M477l422r186M922j596k563M807J56k679K574O528p44
5337D967k293J141j645j377Q624k880o307L661j714m654J354L662r99r3L119j433
5321C133M78o592j0386O65L256K648K276K379l916n730O619N997l961K708n74
5306a000K300J152l877M537Q59r21o376q753m57R432L770m138m83m68k811J464
5290e770k675J69J16N644P341l064q752n776M066L856J251l890O35J2674L240
$$ plain form
5400 -10150 -3268 -1241 -4922 -9099 -4336 -1145 834 1615 3733 5340 5283 4040 1568 -3456 -4306 130
5384 130 2299 -1351 95 -453 -4866 -11872 -11201 -11851 -10235 -7974 -6148 -8736 -7669 -5711 -4033 36
5368 36 -3120 -1246 -2136 -4061 -2241 -4684 -1861 -1374 1194 1594 -1009 -4590 -3813 -2356 1897 3096
5352 3096 345 -1738 1693 6170 2748 -6438 -1516 -3112 -5675 -868 -712 -3391 -817 5711 4967
5337 4967 2674 3815 2170 793 9417 6537 230 3891 2177 -2477 -1123 2539 1540 1447 4566 3133
5321 3133 3611 -2981 -13367 -12702 -9446 -6798 -4522 -2143 -6059 -11789 -5170 827 -3134 -426 -1000
5306 -1000 1300 2452 -1425 3112 3971 3050 -3326 -12079 -12536 -3104 666 -3472 -3955 -4423 -7234 -5770
5290 -5770 -8445 -8276 -8160 -2516 4825 1761 -6991 -12767 -8701 -4845 -3594 -7484 -6849 5825 9065
5275I065n101l055L318m889k756m916k096l385J584N037K555J730k469J567o87
5260d498J288N440L235M058l244m434l987o07j933r00K985O327k608N60m642m39
5244c399K295L916k532J943k685r398j716N755P500k8m895l31l021M954Q767J030
5228H155m494n543J799k523m498J628L650L355k653N14L615J109m938K055J509
5213B740K714m438m673k299M676K576R754k779k288j39m736n883N66K371n783
5198g621n494L813N40M767M117p80m212M896J893M222M27k402m078l04j074m597
5182e887N349j564l249k371p427N295R077K790j869m497k125K829K413o435o654
5167a4325m447L466L89K936M700l337K571N674l341J322k215o53m058l35J899
$$ plain form
5275 9065 3964 909 4227 -662 -3418 -8334 -10430 -13815 -12231 -7194 -4639 -2909 -5378 -3811 -4498
5260 -4498 -3210 2230 5465 9523 6279 1845 -2142 -2749 -4682 -5582 -2597 3730 1122 1682 -2960 -3399
5244 -3399 -1104 2812 280 2223 -462 -9860 -11576 -5821 1679 1651 -3244 -3575 -6596 -1642 7125 8155
5228 8155 3661 -1882 -83 -2606 -7104 -5476 -1826 1529 -1124 -610 3005 4114 -824 1231 2740
5213 2740 5454 1016 -3657 -5956 -1280 1296 11050 8271 5983 5844 1108 -4775 -4209 -1838 -7621
5198 -7621 -13115 -9302 -8762 -3995 122 -658 -4870 26 1919 6141 6568 4166 88 -216 -1290 -5887
5182 -5887 -538 -2102 -5351 -7722 -15149 -9854 -777 2013 144 -4353 -6478 -3649 -1236 -7671 -14325
5167 -14325 -18772 -15306 -14917 -11981 -7281 -10618 -8047 -2373 -5714 -4392 -6607 -7260 -11318 -11653 -9754
5152i754o37K090K486m984o38P444L013J377j546l41m75k960K817m550M491Q474
5136F307l214j799J450q01m474k722j743l579R5l322R19N004M242j857k961K228
5120f227K766K605k076J912K0k867k573N890m983p590L91P732J952l903m720l716
5104a5387L556n07l689J795J86N504j287j2865K28K211N000Q740R036Q62j679
5089A704R9L124J452m682p958o26K754R48N238K821q87k909m450q6J743O10J84
5072i21J997l828j713j0Q43K743m52K877n131J80J339J240n07L559J494j704Q89
5055B895L381n824l081k417l191l118K961M302k695j502l489J092L888R165K439
5040D806K644l309K074j755q055m655J919P527L428k134R18M998k988p355k58
$$ plain form
5152 -9754 -10391 -8301 -5815 -10799 -11437 -3993 -980 397 -1149 -1490 -1965 -4925 -2108 -6658 -2167 6307
5136 6307 3093 1294 2744 1943 -2531 -5253 -6996 -10575 -10480 -13802 -12883 -7879 -3637 -5494 -8455 -6227
5120 -6227 -3461 -856 -2932 -1020 -1000 -3867 -6440 -550 -5533 -13123 -12732 -5000 -3048 -6951 -11671 -15387
5104 -15387 -11831 -12338 -16027 -14232 -14046 -8542 -9829 -22694 -22466 -20255 -15255 -6515 2521 3383 1704
5089 1704 1803 4927 6379 1697 -6261 -6887 -4133 -3185 2053 4874 3987 1078 -3372 -3458 -1715 -1105 -921
5072 -921 1076 -2752 -4465 -4475 -3632 -889 -1341 1536 -3595 -3415 -2076 -836 -1343 2216 3710 2006 2895
5055 2895 6276 452 -2629 -5046 -8237 -11355 -8394 -4092 -6787 -8289 -11778 -10686 -6798 2367 4806
5040 4806 7450 4141 6215 4460 -3595 -8250 -6331 1196 4624 2490 3408 8406 5418 -1937 -2195
5025b195K493k878m43j355o0m97K507l725Mk99m94j89J057k034j260Q499q51j399
5007c119K292l809l180O547O708J224m829K043k503n33L267k774k354P158J765
4992G903J721J620m386j255l640n385L888j926l018k130p832R28J2052Q945l548
4977C937J658K014L495l408q978K9R9m017L250k217K661l145n46L383K720j530
4961e95j184l37N16M417qq011J816K967n912K312L111J33l665K177L578q57O026
4944F484N240q682o367r99M861r56p50J214Q63J455K203o818j103M3n5k485K858
4927b994N42K562m678m168j585N285J947m068k290L266M770J608m525jM517N82
4911G70K80L312k475l168m560j376Q972L719J58Q36l848l334Q66n912L13O394
$$ plain form
5025 -2195 298 -2580 -3023 -4378 -4438 -4935 -2428 -6153 -6149 -6448 -6942 -7131 -6074 -8108 -9368 -869 -1720 -3119
5007 -3119 -827 -4636 -7816 -1269 5439 6663 1834 3877 1374 841 4108 1334 -1020 6138 7903
4992 7903 9624 11244 6858 5603 1963 -3422 466 -1460 -4478 -6608 -14440 -13512 -1460 7485 3937
4977 3937 5595 7609 11104 7696 -1282 -1253 -1154 -5171 -1921 -4138 -1477 -4622 -5168 -1785 935 -595
4961 -595 -1779 -2116 -1600 2817 2809 -5202 -3386 -419 -6331 -4019 -908 -775 -4440 -2263 1315 458 6484
4944 6484 11724 3042 -3325 -4324 537 -419 -1169 45 908 2363 4566 -2252 -3355 -3312 -3367 -5852 -2994
4927 -2994 -2452 110 -4568 -8736 -10321 -5036 -3089 -7157 -9447 -6181 -1411 197 -4328 -4329 188 770
4911 770 1050 4362 1887 -1281 -5841 -7217 1755 5474 5632 6468 2620 -714 152 -5760 -5447 947
4895I47M980l165l299j874J705M157K285j849L583k136k481p798l732K111K087
4880d479L12O73l684K065j528r43Q737N111o369K364O929L770N26o435r598l460
4864f009J363j980j919K996J0541K944p897q124j463K221L983K73m192J1528M463
4849H728k319m1k531k387k147o68k034l246o16P343M051k264l363l058o667L042
4833h177L895L382K869K024o860o977j1663J821J1234O817k2L410K86l852l763
4818e576M261M458k520Q58j138P28k898L865O130N51M58l605n495q770j521L323
4802f891M520K909k543k980L799M857k47o87J345m48n85o394p488m403L235N149
4786f852R265K884J715Q42J152j61m906q41k173k344j147m557q03J527J381k794
$$ plain form
4895 947 5927 2762 -537 -2411 -706 3451 5736 3887 7470 5334 2853 -4945 -8677 -6566 -4479
4880 -4479 -4167 -3494 -7178 -5113 -6641 -7584 1153 6264 -105 2259 9188 12958 13484 7049 -2549 -6009
4864 -6009 -4646 -6626 -8545 -5549 4992 7936 39 -8085 -9548 -7327 -3344 -3071 -7263 4265 8728
4849 8728 6409 6368 3837 1450 -697 -1365 -3399 -6645 -7261 82 4133 1869 -1494 -4552 -11219 -8177
4833 -8177 -4282 -900 1969 3993 -2867 -9844 -21507 -19686 -8452 -1635 -1657 1753 2039 -1813 -5576
4818 -5576 -1315 3143 623 1481 343 1071 -1827 2038 8168 8719 9177 5572 77 -8693 -10214 -6891
4802 -6891 -2371 538 -2005 -4985 -1186 3671 3424 2737 4082 3634 3049 -3345 -10833 -15236 -12001 -6852
4786 -6852 2413 5297 7012 7854 9006 8845 3939 3098 925 -1419 -2566 -7123 -7926 -6399 -5018 -7812
4770g812K510J711J394N415L44k332j678m273j540k279M108l68k394p25m487j011
4754a3417N224j808n595O504L156n909J576K163M883J954Q109P39j54L18K86O06
4738H635K90J632K951j827m807r54l268Q7K373k458o315m204J093M751m467m127
4722a0615Q707O112j610M339K618o451m64J194R89o066m034k904M907l04l078
4707f660O66k843J0858L992o572l113P181k633q021K232k68l625J81R92K693J030
4691c910L543j183J163L633J796l186L671M583j206M19l857n434N18J259l193
4676a384o737K171O192M93L648l489O066K099n643k301n095k86Q122L520p705
4661c29n753l132J588L248L73p191N48N390L330N009O126k965j0278p487L42J0378
$$ plain form
4770 -7812 -5302 -3591 -2197 3218 3562 1230 -448 -4721 -6261 -8540 -4432 -4800 -7194 -7919 -12406 -13417
4754 -13417 -8193 -10001 -15596 -9092 -5936 -11845 -10269 -8106 -3223 -1269 6840 7579 7425 7743 8029 8635
4738 8635 8925 10557 13508 11681 6874 5920 2652 2739 5112 2654 -3661 -7865 -6772 -2021 -6488 -10615
4722 -10615 -1908 4204 2594 6933 9551 3100 2636 3830 4819 -1247 -5281 -8185 -3278 -3582 -6660
4707 -6660 -5994 -8837 2021 6013 -559 -3672 3509 876 -7145 -4913 -5181 -8806 -8625 -7633 -4940 -3910
4691 -3910 -367 -1550 -387 3246 5042 1856 5527 10110 8904 9323 5466 32 550 1809 -1384
4676 -1384 -8121 -5950 242 735 4383 894 6960 9059 3416 1115 -3980 -4266 3856 7376 -329
4661 -329 -6082 -9214 -7626 -4378 -4005 -11196 -10648 -5258 -1928 3081 9207 6242 -4036 -11523 -11181 -803
4645h03L581n109k072M571l867j327R21j974p0J784L327J479O106L202l185o24
4629E940l277r482L042J1394O972n006o211j103L789o662l560j6m83M056k924
4614c531j205L828M693P340l655p975K138k466q238J181K057L17L783p994m635
4599a4362m63M852J312L732L059L122N97p885l857N649O68l385J639k462m783
4584a2567R75K242O19N265J682rn901k365N340L887j243p406q347O559N265N026
4568i78Q646R96m469j0806m009L69L321K743L906P533J252n788n165l089k7J288
4552d277l438J227N774j8p616m434O37N262L27j79p94q35n131N037J447k070k65
4535i346j494N506j531k940k878P215N281K136M231r39p308r45M00N80P429k412
$$ plain form
4645 -803 2778 -2331 -4403 168 -3699 -5026 -4105 -6079 -6149 -4365 -1038 441 6547 9749 6564 5940
4629 5940 2663 -6819 -3777 7617 14589 9583 3372 2269 6058 -604 -4164 -4180 -4663 -607 -3531
4614 -3531 -4736 -908 3785 11125 7470 -505 1633 -833 -9071 -7890 -5833 -5516 -1733 -9727 -14362
4599 -14362 -14825 -9973 -8661 -4929 -1870 1252 1849 -6036 -9893 -4244 -3576 -6961 -5322 -7784 -12567
4584 -12567 -11592 -9350 -8731 -3466 -1784 -1793 -7694 -10059 -4719 -832 -2075 -9481 -17828 -11269 -6004 -978
4568 -978 7668 8664 4195 -6611 -10620 -10251 -6930 -4187 -281 7252 8504 2716 -2449 -5538 -5565 -4277
4552 -4277 -7715 -6488 -714 -732 -8348 -12782 -12145 -6883 -6556 -6735 -7529 -8364 -13495 -8458 -7011 -9081 -9346
4535 -9346 -10840 -5334 -6865 -9805 -12683 -5468 -187 1949 6180 5241 -2067 -3012 -2612 -2032 5397 2985
4519B985k532n168k724k134K850L665J133k817k236p72N913M364L027J596m558
4504B592o47n111k772K8K244m058l037O249J0066O45l397J872m792p239k002K954
4488f405M990n475J329j214J78p70K302K368J110J729L576L1J671M647N2m340
4472E779K48P274l23j437l876m646m548j913O02O746j722k584j670j605l961J243
4456f393K321O445J271K82J096j118K012p399m29O559o676n342m25M968K826j406
4440a408k403P418J644J172m187k998o400J239l453J584L700n152J505J649K843
4425c247O25o326p148Q011P989K462N499L017l803n956n212K025K264L88j409
4410h21K137L848L903j3P02k836p742r14J29o25j939n317j996L951k87L726m169
$$ plain form
4519 2985 453 -4715 -7439 -9573 -6723 -3058 -1925 -4742 -6978 -7750 -1837 2527 5554 7150 2592
4504 2592 1945 -3166 -5938 -5910 -3666 -7724 -10761 -4512 5554 6199 2802 4674 -118 -7357 -9359 -6405
4488 -6405 -1415 -6890 -5561 -6775 -6597 -7367 -5065 -2697 -1587 142 3718 3749 5420 10067 10119 5779
4472 5779 6027 13301 12978 11541 7665 3019 -1529 -3442 -2840 3906 2184 -400 -2070 -3675 -7636 -6393
4456 -6393 -4072 2373 3644 3926 5022 3904 5916 -1483 -1912 4647 -2029 -7371 -7796 -2828 -2 -1408
4440 -1408 -3811 3607 5251 6423 2236 -762 -7162 -5923 -9376 -7792 -4092 -9244 -7739 -6090 -3247
4425 -3247 -2622 -8948 -16096 -8085 -96 2366 7865 10882 7079 1123 -4089 -2064 200 588 -821
4410 -821 1316 5164 9067 9054 9756 6920 -822 -1736 -1607 -2232 -4171 -9488 -11484 -7533 -7820 -4094 -8263
4393h263l465L826l549K007P424m504l124N987J779J724j514m63L002J017j35
4378A749l136L304j778p845o055P118J364j359N324j405L822O89j153l258l387
4363f006j120m594M235M061K062j106J903k984m771N220M60k217m453k35O569
4348b976M096L849J24r502p036J150k242L996M447K849O67Q73l820k564j645j879
4332i613N787Q874o283l730l98J181J242M690N014l659m55K025o988P214k788
4317B113o351M838L482m737L785N288J764j228j1780l715N294L293l526j42m73
4302b095l407o302K354L013K503k992J997k8l095j463O491R834k596j919m06J593
4286C482L662l23l658L300p094p881o087K752N388O395k519L45j891j427l58j566
$$ plain form
4393 -8263 -11728 -7902 -11451 -9444 -2020 -6524 -9648 -3661 -1882 -158 -1672 -2135 867 1884 1749
4378 1749 -1387 1917 139 -7706 -13761 -6643 -5279 -6638 -1314 -2719 1103 1792 639 -2619 -6006
4363 -6006 -7126 -11720 -7485 -3424 -1362 -2468 -565 -3549 -8320 -3100 -2640 -4857 -9310 -9545 -2976
4348 -2976 1120 4969 5093 -4409 -11445 -10295 -12537 -8541 -4094 -1245 -578 295 -3525 -6089 -7734 -9613
4332 -9613 -3826 5048 -1235 -4965 -5363 -4182 -2940 1750 6764 3105 2650 4675 -2313 4901 2113
4317 2113 -4238 600 4082 -655 3130 8418 10182 8954 -2826 -6541 -1247 2046 -1480 -1622 -2095
4302 -2095 -5502 -11804 -9450 -6437 -3934 -6926 -4929 -4957 -8052 -9515 -3024 6810 4214 2295 1889 3482
4286 3482 7144 6821 3163 6463 -631 -8512 -14599 -11847 -6459 -64 -2583 -2238 -4129 -5556 -5914 -7480
4270g480J184L629L186J854m039j511J808O492j501q785k125r82J631O056k643
4255c226m973R68L033J983N368P55j1018n5N792j471K107K879k567m09N258J0621
4239A5045L752r910p204L105j616J38N902J59J024J199k937o882m489l730P13
4224e731j147k200O131L625L614Q246l789r212lj812j208k304m49n094Q22O808
4208c703O85l721M491j679M334L371o450j785M685K06n463l494J686L230L616
4193IO855K757M725m04p113K776L380J942j270q472o254j604j823k449O95L842
4177b408P172n33J30K98j157k075L299M451k4p871l314N598m914j510L180j928
4161a606l655O429N54k258L641m818m469m418k680M969M067P02K834M847j215
$$ plain form
4270 -7480 -6296 -2667 519 2373 -1666 -3177 -1369 5123 3622 -5163 -7288 -8270 -6639 -583 -3226
4255 -3226 -8199 -7231 -4198 -2215 3153 3908 -7110 -7165 -1373 -2844 -737 2142 -425 -834 4424 15045
4239 15045 18797 8887 1683 4788 3172 3310 9212 9371 10395 11594 8657 1775 -2714 -6444 -5731
4224 -5731 -6878 -9078 -2947 678 4292 12538 8749 -463 -466 -2278 -3486 -5790 -6239 -11333 -10511 -3703
4208 -3703 -3018 -6739 -2248 -3927 407 3778 -2672 -4457 228 434 -5029 -8523 -6837 -3607 9
4193 9 6864 9621 14346 13942 6829 9605 12985 14927 13657 5185 -1069 -2673 -4496 -6945 -6250 -2408
4177 -2408 4764 4231 4361 4659 3502 1427 4726 9177 9153 1282 -2032 3566 -1348 -2858 322 -1606
4161 -1606 -5261 1168 1722 -536 3105 -1713 -6182 -10600 -13280 -8311 -4244 -3542 -708 4139 2924
4146B924n521L60J845j573L981M798K44o409K239K851j793j017j648J299K76q21
4130B035p897l939R82n73k645Q634J951j394J24j133o79M801P990m507J51J25
4114D026o27j586k490l472K064q29j879J561l29j651j491J494L296L188k34k683
4098a642j400J463j981L596N63p384j544L293J478k904M773J450m123J438K668
4083b56J562Q7l4n259p240k901P093R991n573l881M359P801J078j442n535o507
4067f657j869M43o03K660P242j643M844M774k470r99M467m420j1530j892M315
4052c338N37J232M210j12o24l289q53K541K574O232p89n326o31j751l074M7j587
4035d001n721l745j8J299O632L468N19kj745j47K321l562O59P923M650j183m015
$$ plain form
4146 2924 -2597 -2237 -392 -1965 2016 6814 7058 649 2888 5739 3946 2929 1281 2580 2856 2035
4130 2035 -5862 -9801 -8819 -9392 -12037 -3403 -1452 -2846 -2722 -3855 -4534 267 8257 3750 3901 4026
4114 4026 3399 1813 -677 -4149 -2085 -2914 -4793 -3232 -3561 -5212 -6703 -5209 -1913 1275 1041 -1642
4098 -1642 -3042 -1579 -3560 36 599 -6785 -8329 -5036 -3558 -6462 -1689 -239 -4362 -2924 -256
4083 -256 1306 1393 1359 -3900 -11140 -14041 -6948 3043 -2530 -6411 -2052 5749 6827 5385 -150 -6657
4067 -6657 -8526 -8083 -8686 -6026 1216 -427 4417 9191 6721 5722 10189 5769 -5761 -7653 -3338
4052 -3338 -2801 -1569 2641 2529 1905 -1384 -2237 304 2878 9110 8321 2995 2364 613 -2461 -2414 -4001
4035 -4001 -9722 -13467 -13485 -12186 -5554 -2086 -1567 -1569 -3314 -3461 -1140 -4702 -4043 3880 8530 7347 3332
4018C332J072n612l168j365l333O120PK895k47j141j235l223l289j960M723j915
4002h339M711R76M538N48m488K235j877m579M255L35k647m099n70k587k975L540
3986a1023O802N71J815L074p23L269r87o402J15L223p552m930N214j364k03L34
3970h767p3k813R90k45M292J822j811L416J863l158m230k965L008K563L198l472
3954f382M35N51n202n498k587N918O699m30P39L769M179O580j867n628k108j6
3938h48l751n897P740O020o07n309p84O09J791o53j77K447J184l50k455L839L429
3921F228n304J230k1P64K537k052r871j0288o7Q974P850M505j331j395m1K383
3905D101k040K212M83k088k743L185p30mk171m901K56P998m790l517p46K562k674
$$ plain form
4018 3332 4404 -1208 -4376 -5741 -9074 -2954 -2947 -52 -299 -1440 -2675 -5898 -9187 -11147 -6424 -8339
4002 -8339 -3628 -2652 1886 2434 -2054 181 -1696 -6275 -2020 -1685 -4332 -8431 -9001 -11588 -14563 -11023
3986 -11023 -4221 -3650 -1835 1239 516 3785 2798 -3604 -3489 -266 -7818 -12748 -7534 -8898 -9101 -8767
3970 -8767 -8840 -11653 -10663 -10908 -6616 -4794 -6605 -3189 -1326 -4484 -8714 -11679 -8671 -6108 -2910 -6382
3954 -6382 -5947 -5396 -10598 -16096 -18683 -12765 -6066 -6496 -5757 -1988 2191 8771 6904 1276 -832 -848
3938 -848 -4599 -10496 -2756 3264 2657 -2652 -3436 -2827 -1036 -1689 -1866 581 1765 1415 -1040 2799 6228
3921 6228 924 2154 2133 2897 5434 3382 -6489 -16777 -16844 -7870 -20 4485 3154 1759 1718 4101
3905 4101 2061 4273 4756 2668 -75 3110 2380 2376 205 -4696 -4440 3558 -1232 -4749 -5495 -2933 -5607
3888e607k871O12m309P833P273K821l957J063L654o736o713L439M135J8l877L792
3872E70K159j586k398k365m939L206P205l79p624K139k831J972L077L224K515
3857C945j172m092l811j429J624k469k633Q64L560P123Q29l109N243o20k763J00
3841A190M210k838n40j957j931J395o08k155o520J723M269K539M970N599m227
3826E119K99R61k613K217j60o906J18O473J514K581j516J668m641n084k778K731
3810a7M00L552k55o360j210J107l973l967O366K712K254K467n92O187l899k923
3794A849N059l544k085j552j995J069L005K006m419n581K87M387r63M30k700n735
3778a0482l272k997R422K330K268M827l055l43L832k251l590j361N199L234j626
$$ plain form
3888 -5607 -8478 -7866 -12175 -4342 2931 5752 1795 2858 6512 -224 -6937 -3498 637 655 -3222 570
3872 570 2729 1143 -1255 -3620 -8559 -5353 1852 1473 -6151 -4012 -6843 -4871 -1794 1430 3945
3857 3945 2773 -1319 -5130 -6559 -4935 -7404 -10037 -9173 -5613 1510 2339 -770 4473 3853 1090 1190
3841 1190 5400 2562 2022 65 -1866 -471 -1079 -3234 -9754 -8031 -3762 -1223 3747 9346 5119
3826 5119 5418 6379 3766 5983 5823 -1083 -965 5508 7022 9603 8087 9755 5114 30 -2748 -17
3810 -17 383 3935 3680 -2680 -3890 -2783 -6756 -10723 -4357 -1645 609 3076 2484 8671 4772 1849
3794 1849 6908 3364 1279 -273 -2268 -1199 1806 3812 -607 -6188 -5901 -1514 -2477 -2047 -4747 -10482
3778 -10482 -13754 -16751 -7329 -4999 -2731 2096 -959 -1302 2530 279 -3311 -4672 527 3761 2135
3763B135L02m32L16n395j14j106J56q57K679L487j747R72O144K875j833n050k911
3746c79R20j556M97K490k726n685K95P221J970j662k675J435k988J179l35m284
3730f283m016M781M438N519p386J832N294n175p493N194K858j523j540R508N331
3715A1339n071L737N088k835K36o358j0041R78j322k683q483J056R840P370k243
3700F08L926K179K029K195j306k334M225r33K753l436n834j257L49Q183k502j0095
3684a250q391M459K645k404O7J4k914M702K942K240J175Q03m268j127L568L514
3668E775K079j378k085R5m586l559k937l512l40k439l043P297Q635P26N23k003
3652g52j468j83M248O127N95q845l380L10j112M022j152J467q000p553N492N418
$$ plain form
3763 2135 2437 2005 2321 -3074 -3188 -4294 -4138 -4995 -2316 1171 -576 396 6540 9415 7582 2532 -379
3746 -379 541 -1015 -518 1972 -754 -6439 -6144 1077 3047 1385 -1290 145 -2843 -1664 -1999 -6283
3730 -6283 -10299 -5518 -1080 4439 -2947 -1115 4179 -996 -8489 -3295 -437 -1960 -3500 6008 11339
3715 11339 6268 10005 15093 12258 12494 6136 -3905 -2927 -4249 -6932 -15415 -14359 -4519 2851 608
3700 608 4534 6713 8742 10937 9631 7297 11522 10589 13342 9906 4072 2815 3164 11347 8845 -1250
3684 -1250 -9641 -5182 -2537 -4941 -4874 -4860 -7774 -3072 -130 2110 3285 4088 -180 -1307 2261 5775
3668 5775 7854 6476 4391 4486 -100 -3659 -6596 -10108 -10448 -12887 -15930 -8633 2 728 1251 -752
3652 -752 -2220 -2403 1845 7972 8567 -278 -3658 -3348 -4460 -438 -1590 -123 -8123 -15676 -10184 -4766
3636d766P141L070o56L81n932m518M84m202j81O066N976M776m874m530K273N57
$$ plain form
3636 -4766 2375 5445 4789 5170 -762 -5280 -4796 -8998 -9179 -3113 2863 7639 2765 -1765 508 1065
$$ [...]
##END NTUPLES=NMR SPECTRUM
##END=
