##TITLE=Analysis number 321282
Compound Code tl 00571
Project Code adrs
Chemist Name stores
##JCAMPDX= 6.0         $$ Bruker NMR JCAMP-DX V2.0
##DATA TYPE= NMR SPECTRUM
##DATA CLASS= NTUPLES
##ORIGIN= Bruker BioSpin GmbH
##OWNER= nmr
$$ XWIN-NMR		Version 3.5
$$ Wed Aug  2 15:25:45 2006 GMT Daylight Time (UT+1h)  MAYBRIDGE\nmr@NMR_250MHZ
##.OBSERVE FREQUENCY= 250.131544655141
##.OBSERVE NUCLEUS= ^1H
##.ACQUISITION MODE= SIMULTANEOUS (DQD)
##.ACQUISITION SCHEME= undefined
##.AVERAGES= 16
##.DIGITISER RES= 18
##SPECTROMETER/DATA SYSTEM= dpx250
##.PULSE SEQUENCE= zg30
##.SOLVENT NAME= CDCl3
##.SHIFT REFERENCE= (INTERNAL, CDCl3, 0, 16.522)
##AUDIT TRAIL= $$ (NUMBER, WHEN, WHO, WHERE, WHAT)
$$ ##TITLE= Audit trail, XWIN-NMR		Version 3.5
$$ ##JCAMPDX= 5.01
$$ ##ORIGIN= Bruker BioSpin GmbH
$$ ##OWNER= nmr
$$ C:\u/data/dgb/nmr/ADRS/80/pdata/1/auditp.txt
$$ ##AUDIT TRAIL=  $$ (NUMBER, WHEN, WHO, WHERE, WHAT)
(   1,<2006-08-02 15:25:16.74 +100>,<MAYBRIDGE\nmr>,<NMR_250MHZ>,
      <created by zg, POWCHK disabled, PULCHK disabled
       configuration hash MD5:
       E2 DF 36 D8 04 B2 41 60 5A D7 A3 38 5A 4B D0 FE
       data hash MD5: 64K
       49 CC 7E 25 28 28 B3 1E F3 5E D2 7A E9 15 1D 42>)
(   2,<2006-08-02 15:25:33.36 +100>,<MAYBRIDGE\nmr>,<NMR_250MHZ>,
      <Start of raw data processing
       ef LB = 0.3 FT_mod = 6 PKNL = 1 SI = 32K 
       data hash MD5: 32K
       DD 5C 07 3E 8A 0C 65 91 F2 64 49 9E CA A6 CD E0>)
(   3,<2006-08-02 15:25:35.00 +100>,<MAYBRIDGE\nmr>,<NMR_250MHZ>,
      <apk 
       data hash MD5: 32K
       64 64 F3 90 CC F4 60 49 C0 52 E1 10 73 66 1E 06>)
(   4,<2006-08-02 15:25:35.86 +100>,<MAYBRIDGE\nmr>,<NMR_250MHZ>,
      <abs ABSG = 5 
       data hash MD5: 32K
       8E 5C 49 E6 38 86 E3 64 D7 66 81 35 92 D3 9A B7>)
$$ ##END=
$$ 
$$ hash MD5
$$ CD 99 33 DB AD 17 0A 46 C9 E6 4E 3B CB 10 21 70
##$RELAX= 
##$RELAX= 
##$RELAX= 
##$RELAX= 
##$RELAX= 
##$RELAX= 
##$RELAX= 
$$ Bruker specific parameters
$$ --------------------------
##$DU= <C:\u>
##$EXPNO= 80
##$NAME= <ADRS>
##$PROCNO= 1
##$TYPE= <nmr>
##$USER= <dgb>
##$AMP= (0..31)
100 100 100 100 100 100 100 100 100 100 100 100 100 100 100 100 100 100 
100 100 100 100 100 100 100 100 100 100 100 100 100 100 
##$AQSEQ= 0
##$AQ_mod= 3
##$AUNM= <au_zg>
##$AUTOPOS= <26 >
##$BF1= 250.13
##$BF2= 250.13
##$BF3= 250.13
##$BF4= 250.13
##$BF5= 500.13
##$BF6= 500.13
##$BF7= 500.13
##$BF8= 500.13
##$BYTORDA= 1
##$CFDGTYP= 0
##$CFRGTYP= 5
##$CHEMSTR= <none>
##$CNST= (0..31)
1 1 145 1 1 1 1 1 1 1 1 1 1 1 1 1 1 1 1 1 1 1 1 1 1 1 1 1 1 1 1 1 
##$CPDPRG= <>
##$CPDPRG1= <>
##$CPDPRG2= <>
##$CPDPRG3= <>
##$CPDPRG4= <mlev>
##$CPDPRG5= <mlev>
##$CPDPRG6= <mlev>
##$CPDPRG7= <mlev>
##$CPDPRG8= <mlev>
##$CPDPRGB= <>
##$CPDPRGT= <>
##$D= (0..31)
0 1 0 0 0 0 0 0 0 0.06 0 0 0 0 0 0 0.0002 0 0 0 0 0 0 0 0 0 0 0 0 0 0 
0 
##$DATE= 1154528715
##$DBL= (0..7)
120 120 120 120 120 120 120 120 
##$DBP= (0..7)
150 150 150 150 150 150 150 150 
##$DBP07= 0
##$DBPNAM0= <>
##$DBPNAM1= <>
##$DBPNAM2= <>
##$DBPNAM3= <>
$$ [...]
##$SUBNAM7= <"">
##$SUBNAM8= <"">
##$SUBNAM9= <"">
##$SW= 20.6930455092707
##$SWIBOX= (0..15)
0 0 3 0 0 0 0 0 0 0 0 0 0 0 0 0 
##$SW_h= 5175.983436853
##$TD= 65536
##$TD0= 1
##$TE= 295.16
##$TE2= 300
##$TE3= 300
##$TEG= 300
##$TL= (0..7)
0 120 120 120 120 120 120 120 
##$TP= (0..7)
150 150 150 150 150 150 150 150 
##$TP07= 0
##$TPNAME0= <>
##$TPNAME1= <>
##$TPNAME2= <>
##$TPNAME3= <>
##$TPNAME4= <>
##$TPNAME5= <>
##$TPNAME6= <>
##$TPNAME7= <>
##$TPOAL= (0..7)
0.5 0.5 0.5 0.5 0.5 0.5 0.5 0.5 
##$TPOFFS= (0..7)
0 0 0 0 0 0 0 0 
##$TUNHIN= 0
##$TUNHOUT= 0
##$TUNXOUT= 0
##$USERA1= <user>
##$USERA2= <user>
##$USERA3= <user>
##$USERA4= <user>
##$USERA5= <user>
##$V9= 5
##$VALIST= <valist>
##$VCLIST= <CCCCCCCCCCCCCCC>
##$VD= 0
##$VDLIST= <DDDDDDDDDDDDDDD>
##$VPLIST= <PPPPPPPPPPPPPPP>
##$VTLIST= <TTTTTTTTTTTTTTT>
##$WBST= 1024
##$WBSW= 4
##$XGAIN= (0..3)
0 0 0 0 
##$XL= 0
##$YL= 0
##$YMAX_a= 585502
##$YMIN_a= -530216
##$ZGOPTNS= <>
##$ZL1= 120
##$ZL2= 120
##$ZL3= 120
##$ZL4= 120
##$ABSF1= 16.522
##$ABSF2= -4.171173
##$ABSG= 5
##$ABSL= 3
##$ALPHA= 0
##$AQORDER= 0
##$ASSFAC= 0
##$ASSFACI= 0
##$ASSFACX= 0
##$ASSWID= 0
##$AUNMP= <proc_1d>
##$AZFE= 0.1
##$AZFW= 0.1
##$BCFW= 0
##$BC_mod= 0
##$BYTORDP= 0
##$COROFFS= 0
##$CY= 12.5
##$DATMOD= 1
##$DC= 0
##$DFILT= <>
##$DTYPP= 0
##$F1P= 14.0000005364418
##$F2P= -0.99999901652339
##$FCOR= 0.5
##$FTSIZE= 32768
##$FT_mod= 6
##$GAMMA= 0
##$GB= 0
##$INTBC= 1
##$INTSCL= 1
##$ISEN= 128
##$LB= 0.3
##$LEV0= 0
##$LPBIN= 0
##$MAXI= 10000
##$MC2= 0
##$MEAN= 0
##$ME_mod= 0
##$MI= 0
##$NCOEF= 0
##$NC_proc= -4
##$NLEV= 6
##$NOISF1= 0
##$NOISF2= 0
##$NSP= 0
##$NTH_PI= 0
##$NZP= 0
##$OFFSET= 16.522
##$PC= 1
##$PHC0= 140.1553
##$PHC1= 6.257493
##$PH_mod= 1
##$PKNL= yes
##$PPARMOD= 0
##$PSCAL= 4
##$PSIGN= 0
##$REVERSE= no
##$SF= 250.13
##$SI= 32768
##$SIGF1= 0
##$SIGF2= 0
##$SINO= 400
##$SIOLD= 32768
##$SREGLST= <1H.CDCl3>
##$SSB= 0
##$STSI= 32768
##$STSR= 0
##$SW_p= 5175.98343685301
##$SYMM= 0
##$S_DEV= 0
##$TDeff= 65536
##$TDoff= 0
##$TI= <Analysis number 999999
Compound Code 99
Book Reference 9
Project Code 9>
##$TILT= no
##$TM1= 0
##$TM2= 0
##$TOPLEV= 0
##$USERP1= <user>
##$USERP2= <user>
##$USERP3= <user>
##$USERP4= <user>
##$USERP5= <user>
##$WDW= 1
##$XDIM= 32768
##$YMAX_p= 517231041
##$YMIN_p= -374200
$$ End of Bruker specific parameters
$$ ---------------------------------
##NTUPLES= NMR SPECTRUM
##VAR_NAME=  FREQUENCY,     SPECTRUM/REAL,   SPECTRUM/IMAG
##SYMBOL=    X,             R,               I
##VAR_TYPE=  INDEPENDENT,   DEPENDENT,       DEPENDENT
##VAR_FORM=  AFFN,          ASDF,            ASDF
##VAR_DIM=   32768,         32768,           32768
##UNITS=     HZ,            ARBITRARY UNITS, ARBITRARY UNITS
##FACTOR=    0.157963299565203, 1,           1
##FIRST=     4132.6476996994, 0,             0
##LAST=      -1043.33573715361, 0,           0
##MIN=       -1043.33573715361, -374200,     0
##MAX=       4132.6476996994, 517231041,     0
$$ Real data points
##PAGE= N=1
##DATA TABLE= (X++(R..R)), XYDATA
$$ [...]
18507 408920 395634 403861 415498 426337 454352 518766 567992 601380 619682 639595 667381 661073
18495 661073 649384 679983 694246 692942 717198 757416 762004 744240 749076 740680 676410 600906
18483 600906 552961 501910 466352 451912 487520 454468 414124 383565 365179 377797 407193
18472 407193 414668 425230 439104 429458 416205 421658 413356 391227 369480 375967 379415 377867 393660
18459 393660 430220 494618 543032 602166 686738 760914 852520 961017 1061357 1140056 1174351
18448 1174351 1194005 1168077 1098854 1016087 916247 802936 692296 611545 563568 518747 492995
18437 492995 494642 504823 533975 569994 608471 646092 658468 660387 722457 762218 805074 808985
18425 808985 818969 856924 873993 883221 892201 908113 905172 878481 892035 877945 858382 851440
18413 851440 837151 829545 813486 778247 765652 800120 825105 866342 921468 990915 1056616 1098930
18401 1098930 1126133 1163233 1178354 1169268 1118715 1079398 1032437 957379 892487 865635 847192
18390 847192 856067 870112 881505 917324 977405 1007764 1020614 1039441 1067269 1111857 1153645 1175919
18378 1175919 1221942 1261351 1278954 1305447 1343328 1379077 1419909 1433528 1438093 1465106 1433210
18367 1433210 1395313 1395192 1397299 1364896 1296409 1236645 1194039 1146627 1149148 1127547 1070098 1045166
18355 1045166 1043573 1073388 1067032 1059414 1058481 1067492 1066513 1021070 987525 982642 951333 951930 939230
18342 939230 934181 931791 928038 910571 910163 928587 946952 959144 987517 1004747 1015442 1041710
18330 1041710 1097706 1126409 1144254 1157063 1172448 1215252 1237696 1267895 1306725 1342659 1378311
18319 1378311 1418612 1486996 1563213 1635113 1752574 1836858 1919015 2001770 2091777 2201529 2318256
18308 2318256 2460514 2595795 2699756 2826023 2968672 3171674 3399942 3658311 3921573
18299 3921573 4209014 4583297 4951342 5330204 5872246 6518368 7206194 8000213 9047076
18290 9047076 10375831 12195293 14707453 18002180 21858056 26222199 31758782 38859796
18282 38859796 46256674 52702435 58952616 65945367 73271156 79526380 84008449 88001083
18274 88001083 94261822 102277620 109765241 117563914 128834765 141884983 152332691 159432531
18266 159432531 165296591 169676472 171266532 169399733 164977231 160320027 155204921 146541733
18258 146541733 137403739 132617028 129827468 123376933 113573190 103553383 95242553 87866820
18250 87866820 78909430 68302118 59298437 53244734 48693474 44385698 41403599 40750925
18242 40750925 42283076 45186069 48880291 53401996 57598927 60431087 62379724 62727916
18234 62727916 61274122 59269484 55875916 51335086 48155813 46316466 45596953 47009095
18226 47009095 50999789 56951809 64307427 71779909 76750791 78608190 78349363 76428511
18218 76428511 73653430 69659896 63272787 56065467 50478926 47202557 45731695 45344958
18210 45344958 45424025 45323663 44777079 43485196 41527122 39633776 38016234 36782838 37000102
18201 37000102 39017709 41550201 43576097 45399919 48198511 52333510 56058586 57041347
18193 57041347 55056472 52095161 50452240 50350524 50558490 50546526 50860425 53047972 58484577
18184 58484577 66998597 77004745 86308533 92892727 96559110 99042191 99080766 95371605
18176 95371605 88379938 79371270 70740159 64482718 59270660 55560526 54730295 56255932
18168 56255932 57960336 59016782 59343204 57791090 54866358 51237911 45610667 39330528
18160 39330528 33956190 28866288 24453915 21333448 19366058 18155939 17366840 16799179
18152 16799179 16284098 15796640 15495573 15465272 15570057 15405880 14819555 14164292 13709161
18143 13709161 13454023 13249367 12698599 11887961 11252226 10888140 10684663 10478923 10106586
18134 10106586 9711123 9526433 9583089 9644332 9466853 9080901 8723083 8526705 8441474 8339337
18124 8339337 7975265 7417946 6969918 6685833 6526082 6430112 6289623 6104604 6013576 6020849
18114 6020849 6195944 6559810 7149982 8175977 10106864 13621737 19256587 25518336 28526306
18105 28526306 28451243 27827047 27824353 28703654 28109949 22236309 15331217 11032264 8721557
18096 8721557 7393948 6538033 5928687 5474350 5107990 4814552 4560904 4327364 4099280
18087 4099280 3910144 3762844 3608371 3460832 3366540 3288747 3198907 3081998 2978408 2896491
18077 2896491 2818536 2739339 2653428 2564727 2503497 2443383 2364544 2280114 2203230 2140107 2097374
18066 2097374 2061554 2018392 1993831 1963052 1961474 1937446 1900382 1885101 1902662 1910441 1872877 1846479
18054 1846479 1824582 1792281 1761846 1766271 1769547 1775712 1793075 1780424 1764775 1753172 1779258 1807784
18042 1807784 1875901 1957111 1978505 2006210 2043320 2081495 2162051 2231236 2279439 2266837 2262970
18031 2262970 2271906 2259839 2269205 2270554 2293933 2294719 2294373 2320596 2306547 2301515 2318082 2357399 2418551
18018 2418551 2473378 2559292 2612906 2653534 2719540 2805291 2916262 3078336 3287197 3527567
18008 3527567 3849660 4282889 4870574 5718164 7015539 9059827 12256689 16784322 21956214
17999 21956214 26586057 30645079 34949590 39217375 41984086 41884022 38822430 34750971
17991 34750971 31417133 27969675 23103432 17825619 13860629 11441333 10002421 9092156
17983 9092156 8495057 8067852 7716338 7424414 7203308 7042112 6926870 6844073 6795212 6807569
17973 6807569 6905729 7057257 7189105 7291060 7407492 7538446 7740825 7986287 8326618 8815784
17963 8815784 9461347 10330384 11511606 12995390 14896446 17424006 20938125 26185064
17955 26185064 34343565 47091419 65511650 87669658 108198445 122683947 131071846
17948 131071846 137385910 144991698 150320172 145015451 128299709 107166918 89409434
17941 89409434 78265540 70190579 59792632 48859717 40976071 36212670 33566383 32325600
17933 32325600 32103450 32849165 34840106 38555679 44255976 51397512 59222536 68278890
17925 68278890 78378667 87173765 94015348 99709323 104016131 108312753 112312340 112906358
17917 112906358 111861162 112201936 114773254 121482101 134705881 155186191 180906081 202365951
17909 202365951 215417108 225319315 237075130 252229192 265736756 262142328 242819891
17902 242819891 222584765 208837801 199219829 187069614 166653207 144514780 126254883
17895 126254883 110962287 95499226 81184825 69013273 58814560 51451830 46541008
17888 46541008 43101060 40482617 38353342 36603608 35094611 33885139 33001260 32490443
17880 32490443 32348539 32474059 32934101 33757351 34547935 34979094 35216854 35176665 34991687
17871 34991687 34907131 34333943 33406977 33138129 33223610 32812696 32307793 31861242 31143154 30233818
17861 30233818 28912637 26785667 24669280 23089439 21479280 19647694 18246486 17481057
17853 17481057 17137397 16816974 16346957 15811120 15207946 14591808 13904012 13011583 12038528
17844 12038528 11131858 10257584 9495076 8918545 8475208 8072137 7729433 7419138 7132133
17835 7132133 6862810 6623337 6413588 6219533 5995258 5780440 5574416 5388844 5204094
17826 5204094 5037662 4878950 4729569 4565443 4383839 4222355 4081156 3931415 3784436
17817 3784436 3634330 3499587 3352189 3208340 3060974 2931360 2787311 2663462 2552468
17808 2552468 2437510 2319231 2215908 2130424 2071761 2019769 1952881 1877045 1793264 1733473 1694856
17797 1694856 1608323 1545673 1484651 1450681 1395935 1390572 1388476 1370860 1341120 1318710 1233169 1192431
17785 1192431 1179818 1144759 1096300 1071727 1087735 1082124 1096542 1109687 1122090 1122307 1101536 1077147
17773 1077147 1078261 1078926 1086572 1112000 1112185 1099151 1091255 1078188 1090639 1129845 1174614 1205952 1210667
17760 1210667 1232829 1286486 1323231 1357787 1371821 1397174 1460250 1500000 1508298 1561827 1625955
17749 1625955 1675312 1708147 1712740 1711718 1700334 1700923 1652675 1578521 1557560 1542822 1507162 1483125
17737 1483125 1423710 1358658 1309965 1250628 1196448 1168968 1151131 1137019 1086364 1051353 1016001
17726 1016001 991297 934705 882636 839590 823623 785165 751347 716666 649509 603830 595223
17715 595223 602043 627196 639959 641687 644463 635626 641107 680968 716397 771877 817104 804901
17703 804901 804997 807606 822430 839394 828688 799720 762985 742424 775761 807251 855028 910262
17691 910262 955935 1010795 1029547 999756 968090 927923 892177 858889 824142 794073 786759 763193
17679 763193 742522 712179 687093 699629 669162 620883 556266 515745 462882 441874 419019
17668 419019 370494 370118 370123 401710 433276 458215 452031 461215 481350 500164 506529 533711 557272
17655 557272 545435 523768 523652 521392 524267 521875 513706 547159 566199 604807 636610 635460 600054
17642 600054 586223 575126 548170 494063 465107 470958 474999 498447 469510 423750 416038 416176
17630 416176 418458 399382 384194 349521 314457 299045 260560 235394 262087 294358 301383 296795
17618 296795 267827 227457 213643 229097 251394 223410 223667 221561 214099 193639 180335 162810
17606 162810 173472 173645 191885 174703 150590 164028 183252 186883 195641 176673 200181 184569
17594 184569 144795 149216 161092 184892 189673 178810 168587 150781 145669 159148 139555 131074
17582 131074 155718 150193 161850 167024 165558 162482 167443 170389 152440 156069 186079 215917 228823
17569 228823 205138 183492 176356 172591 177656 171841 161198 165236 176134 159714 182667 193374
17557 193374 186016 171187 164468 167953 155160 177023 209557 196583 186647 185952 186359 212712 199168
17544 199168 169965 152436 177891 171962 164760 130962 128624 166274 192375 167162 144140 127289
17532 127289 135321 144294 163829 156342 131644 111420 99205 101193 127896 141459 127905 139812
17520 139812 145650 141686 138397 134593 105296 102995 102693 73854 95482 124747 138589 119089 101151
17507 101151 129810 137876 146793 153101 144691 130140 122023 95995 94100 118858 99402 83558 102950
17494 102950 120666 106794 93157 80072 89008 111491 121065 131375 143471 147953 172655 220457
17482 220457 253766 323224 398158 470629 546001 597260 614479 610048 598791 574502 569163 542153
17470 542153 474588 405335 349469 279503 226344 197027 183932 180328 202358 207934 202160 194927
17458 194927 203015 211212 201759 200527 229905 222978 187081 164682 150578 178256 184275 196662 197332
17445 197332 210474 224028 248435 244072 270718 306030 351876 362341 371395 398961 429543 476059
17433 476059 507109 570812 691576 827209 988399 1124228 1211856 1297966 1345332 1353281 1320032
17422 1320032 1256943 1146225 1036757 964801 873991 808744 734652 704287 688123 655067 617702
17411 617702 578393 560338 530934 524032 486537 459743 410705 385497 371339 322192 287775 254661
17399 254661 222401 211339 234209 225158 196958 193454 208874 219921 252173 283081 279917 269975
17387 269975 265867 284212 320296 387525 425263 474236 534453 595834 654034 701539 736159 783883
17375 783883 809986 810538 783965 727097 673916 630564 604624 584764 570183 542139 532254 533968
17363 533968 498084 477070 432464 394754 341502 325471 331003 295554 277616 253270 255960 219066
17351 219066 205481 208550 178454 149038 124531 162880 175562 150046 117634 117252 119015 126093
17339 126093 118826 88930 56993 81797 118749 97674 46908 28752 49135 92643 116621 93395
17327 93395 100429 117891 123248 112562 92962 80191 90887 110479 83306 63646 70772 88029
17315 88029 60584 73848 85492 71192 37832 43074 58326 75902 97425 105417 106671 98765
17303 98765 64202 77244 80414 62542 47618 75449 72552 52323 19794 2920 12780 29313
17291 29313 20395 38600 40955 4244 -5418 18027 36312 48685 38541 32972 44726 45492 24341
17278 24341 14358 31958 19718 17926 39849 31815 30770 36236 18310 25159 26618 23303 37735
17265 37735 48481 47160 58333 46352 56088 48063 21818 -2924 -12444 -14345 -13163 4925 36239
17252 36239 47717 37437 14030 18216 30603 40347 18725 -1489 8762 34262 47952 59983
17240 59983 49633 43857 44591 33777 44940 33714 10076 1370 -18346 -35611 -13716 13048
17228 13048 17200 32022 37401 24281 45584 71241 80802 62481 39539 36909 44932 17880 6530
17215 6530 16777 31469 58458 59194 56840 30944 42093 41982 46050 30656 15346 21433 15534
17202 15534 22266 30323 32513 31761 25712 21932 19864 14946 -2305 2918 -22482 -46063 -34914 -27018
17188 -27018 -6615 -6054 6429 19571 19737 24024 46828 24559 18125 32562 36575 45445 28901
17175 28901 24870 54512 64047 36127 32142 41007 39271 25599 39148 26411 30670 73211 77270
17162 77270 75939 75457 57187 31762 33133 45521 60712 73002 106779 102037 103211 72976 63258
17149 63258 80532 57353 50004 61265 66137 41629 26693 23222 36373 56253 59495 31831
17137 31831 31005 30002 37341 31644 27660 20585 46217 50479 40818 16677 5962 22386 24381 33872
17123 33872 64769 71337 72211 58895 40454 31361 39323 67794 81707 68911 20717 24088 48177
17110 48177 83332 68681 56671 53420 44482 32453 44420 37564 54410 67561 71579 57023
17098 57023 56953 86030 95277 112871 122920 94135 62852 74514 75447 63018 63311 41134 33983
17085 33983 35256 22044 45701 65619 87989 97384 81685 61196 49604 59155 67154 12840
17073 12840 11035 2912 34677 52930 54448 48100 22604 15115 22812 32816 29351 18490 31992
17060 31992 62878 36575 11179 15199 -18721 -10379 14663 24114 16486 12184 25243 37611 30041
17047 30041 18690 17626 40255 49166 39506 29072 25393 42714 50570 39140 3927 6238 6241 32044
17033 32044 47104 49620 47110 14223 27022 44304 48178 35530 25553 27116 32010 20539 30220
17020 30220 32763 47052 35682 38064 72901 70393 66749 75920 71203 60408 44039 34577 22994
17007 22994 40486 50561 57573 61640 66257 63639 38647 11505 6969 18241 30330 16797 23177
16994 23177 29990 25901 35128 57284 57357 60132 38137 18774 9523 21668 36328 62784 59988
16981 59988 57220 64223 41017 25770 41652 27018 9060 23564 61148 69616 70198 23195 18737
16968 18737 28355 42208 60656 54835 46492 38899 48789 52569 44443 49005 46096 53437 44081 48942
16954 48942 81026 94619 66966 50398 43645 21945 4912 20962 48167 24216 -19034 -26686
16942 -26686 -16135 6694 21381 4062 23211 31888 39371 33593 14195 -8643 -21498 -8328
16930 -8328 26328 -3132 -21057 -1581 26132 45815 54455 56357 55771 54403 55547 68045 77986
16917 77986 62505 39545 28845 2861 -9718 5104 31781 28173 -16108 -10009 3044 20743
16905 20743 7394 -7468 17547 44481 42288 20404 10628 -10124 -15949 -28252 -37639 -39378 -51641
16892 -51641 -35914 -4604 8531 -13091 -27021 -22549 -3046 -5763 -23730 -22182 -12631 -7780 102
16879 102 10487 21057 16117 7130 40789 61281 60135 63069 43011 43067 59253 63768 61248 44396
16865 44396 34817 32210 13554 10588 18065 22120 21815 5804 -8158 -8202 -16743 -34823 -26582 1091
16851 1091 13862 22236 11067 15106 34130 37642 35042 39220 50574 29114 4766 9157 9761
16838 9761 24864 9019 5194 26424 18075 29665 25894 -662 16664 17222 -6420 -16432 -6317
16825 -6317 -3596 -21320 -22642 -7202 29041 53159 77362 68841 79700 65914 50657 48795 38326
16812 38326 46491 48503 47580 45631 21782 14619 14986 21613 17678 12330 11576 22826 50363 69043
16798 69043 63646 35139 5845 1705 -25379 -45184 -44117 -32231 9511 34741 35629 13171 20060
16785 20060 26901 38119 65978 54741 44163 25704 30180 40967 29198 32485 28349 8837
16773 8837 -19595 -9706 33610 67842 61033 35151 28065 49626 52343 25550 -4683 -2713 22358
16760 22358 26688 34588 46341 35919 21054 5028 -4390 -8655 1179 -516 -19362 -29396 -16841
16747 -16841 13515 -1951 -22687 -13264 11794 2001 -19079 -15310 2615 9083 -10955 -13706 -9742
16734 -9742 -16007 -27881 -13396 509 -18759 -19818 -7145 15779 -16663 -43437 -17401 6743
16722 6743 3412 -6942 -7514 23308 4967 -32347 -22599 -10762 3123 2750 -23664 -9766 -10443
16709 -10443 -13546 29736 66178 57245 26165 20624 11980 -2456 -1649 -20481 -41916 -17092 -3075
16696 -3075 1334 -3525 -5522 -1368 10266 13310 21013 6916 -8385 -27481 -30861 -29762 -34931 14279
16682 14279 25842 -11724 548 -13634 -6965 5174 -1552 2476 8597 20852 36523 33822 27258
16669 27258 3532 2064 10300 2830 -902 -4659 -9709 -9363 6699 32224 27274 14671 -7164
16656 -7164 5155 5088 16584 -500 -12029 7733 7407 3423 5511 10450 33420 48013 20563
16643 20563 31813 48303 54717 65255 76541 99113 90053 60696 50341 54981 66975 74931
16631 74931 27638 -34957 -23141 -4658 2242 1993 45405 82030 77439 54619 15291 21861 19481
16618 19481 -1943 -20432 437 12426 -27028 -8052 24237 43664 44916 30141 15827 20517
16606 20517 7110 -17398 -49628 -58078 -55643 -47192 -8430 8236 28779 23610 -434 5618 20592
16593 20592 9002 23327 5798 -33909 -33360 -17257 -11569 -1253 -11694 -15789 1960 -11221
16581 -11221 -18533 -1891 5246 14051 7685 5296 1800 3684 8561 2925 6137 46658 55780 12001
16567 12001 5289 -7267 -16821 5006 24318 27285 5503 -18289 -17790 -8375 3883 6546 15231
16554 15231 25013 5811 -464 22846 39466 11693 -12061 -395 -12224 -16355 -19115 -17121 -18641
16541 -18641 12652 21965 6117 15676 11936 33013 26121 -5858 -7829 9613 37799 30754 35947
16528 35947 35896 58097 58504 30545 15934 7678 -17943 -42001 -50717 -30495 -8187 5870 -5217
16515 -5217 2809 8747 14924 26680 27965 8157 6851 21096 12168 3938 7779 16026 4962 10633
16501 10633 -19423 -38568 -47082 -9440 17456 21717 14892 20273 29611 55752 38724 22186 -8876
16488 -8876 -15421 -6035 154 10513 12183 18661 -1206 -17274 8235 30967 14516 2980 10872
16475 10872 9381 1518 16251 5290 23736 20638 3468 -25332 -26958 -18154 -2950 24334 29028
16462 29028 7085 -2024 9498 17220 2111 -695 -6877 -4903 -7834 -26532 -24821 -12783 -4631
16449 -4631 -19072 -29791 -27380 2159 -68 8355 9324 27896 31313 6542 12019 24320 -4327
16436 -4327 -20923 -22925 -33442 -13641 -10538 -24912 -36491 -21871 -15091 -36483 -26188 -216
16424 -216 22921 16079 32335 31964 21321 35237 37315 39737 35256 23691 33315 21579 28360 24991
16410 24991 20095 36118 29473 21639 31912 3395 1445 -1685 -4070 -17110 -7036 2707 9370
16397 9370 29630 25456 17447 26535 21976 16935 -703 16004 -18452 -39916 -13681 7055 4324
16384 4324 1080 12159 23245 33344 33883 38786 17987 18203 4325 11443 19611 28421 21286 16261
16370 16261 -6854 -15461 -10589 2572 12784 14926 -7754 12799 10129 -7785 -9019 -6466 19583
16357 19583 4786 -7483 -4352 1007 20855 22451 3313 -23667 -19217 -17533 -21360 -37825 -32667
16344 -32667 -36958 -44097 -52488 -34441 11661 -1385 -40156 -53364 -57558 -29180 -4753 15141
16332 15141 27308 31479 41358 39218 29123 16770 11131 -17350 -14807 19967 43743 29474 -8477
16319 -8477 -29868 -19 32296 43286 16107 27139 71840 71584 30112 5736 -9692 -28011
16307 -28011 -16374 -12777 33557 44746 41039 35952 -5078 -24476 -17114 4508 5044 5852 6432 9845
16293 9845 3369 13065 25492 24533 26181 18031 -6755 -16749 -5031 -2990 -2120 56 -2510 -1074
16279 -1074 11628 12801 -3080 5591 26747 23685 -6723 -933 9068 12661 -7000 -2059 40658
16266 40658 37392 -1472 -35457 -15687 -21978 -23004 10925 23247 4992 5890 4204 36725 39535
16253 39535 -4232 -53034 -62502 -62974 -59316 -49980 -17100 22522 38789 23348 21811 22941 -13881
16240 -13881 -292 22999 26652 32505 41474 20633 10894 6434 -15224 -20507 -509 24622 12743
16227 12743 -3668 2283 -14378 -34156 -39553 -36967 -45122 -28910 -3895 14193 37952 14283
16215 14283 -11142 -17460 -32294 -31873 -21146 1375 1113 -1988 26995 23808 3008 4676 -8543
16202 -8543 -12733 -12407 7385 14453 21442 12027 9216 19813 16126 -6280 -37420 -49157 -39306 -20572
16188 -20572 6506 34375 38872 48943 29180 23359 -1025 -29619 -12284 -16475 -19954 -5187
16176 -5187 17349 21621 22274 14575 20757 19031 14993 7774 6909 -525 -25438 -2393 7607 2777
16162 2777 -1819 4184 17408 15021 9314 4113 -32745 -35672 -46276 -26774 -15031 -29268 -20565
16149 -20565 -29122 3400 20591 -29166 -43824 -25491 -4342 -8576 -10149 6962 46102 92336
16137 92336 95758 58803 10118 -12130 -13098 -866 5978 9635 -1061 9311 -7319 6313 22661
16124 22661 24212 15382 8701 14101 -6020 -8784 6886 5230 462 23500 12286 12191 6154 -11728
16110 -11728 -28536 -42714 -57766 -60376 -45152 -42976 -50866 -39935 -29713 -31938 -28555 -24056 -38809
16097 -38809 -33617 -9933 15466 5600 7167 25836 49421 50388 28895 27576 25908 11107 3278
16084 3278 15738 42075 30381 12362 33618 49045 29241 31482 22436 -19461 -26219 8451
16072 8451 13333 8599 13542 40140 13414 -6296 -6447 3287 37746 38827 11835 -4280 5403
16059 5403 -12034 -30426 -20514 726 12305 8965 8610 40325 54950 29773 -5519 19749 31764
16046 31764 51765 68447 68819 58608 58391 33616 16418 42820 69306 70408 56932 22692 53973
16033 53973 58276 26053 -1340 10572 19960 24642 22701 27310 23195 22922 -5154 -3600 -3121 -22584
16019 -22584 -21797 -24626 -31491 -19547 -8069 -4674 -6582 -8741 -3681 -187 -13035 -11985 -21968 -36687
16005 -36687 -41200 -24109 -8861 526 -1984 21013 39315 33994 -4052 -3373 11948 12290 9997
15992 9997 21258 19470 31583 36084 39688 60440 71319 53000 57631 54849 52929 45646 26661
15979 26661 20124 -16354 -33451 1540 19322 4582 -930 -12806 -17283 -6446 36283 29417
15967 29417 -82 18482 15229 6615 3747 1515 2462 17100 15226 827 -195 -3181 3718 33508
15953 33508 31348 17051 12787 23407 11111 -387 7485 17900 33615 24203 17444 7717 37503
15940 37503 49972 50703 41279 8634 17162 24593 42486 39749 25342 6158 -7740 -3568 -30577
15927 -30577 -56626 -23092 -21682 -23350 -29666 -37169 -46717 -17982 27545 36250 3573 22415 19062
15914 19062 -12201 -29972 -37202 -26449 -28747 -28359 -17792 -294 -2122 13107 34444 48343 26932
15901 26932 29861 36844 2391 3474 7604 27175 5974 -4057 -11073 -5764 16855 44290 38907
15888 38907 32180 35084 -42 -8513 6661 -34386 -50382 -23327 -18468 -11821 11326 -1958 -1487
15875 -1487 8302 1825 -7284 10510 5610 -1429 6334 40853 33094 33197 20977 5254 17873 42848
15861 42848 41702 37724 14509 9172 25314 5441 -42041 -37456 -20818 -25374 -32684 5629 26389
15848 26389 14073 12132 30455 39574 43458 48526 59072 44439 9881 2562 -101 13167 21297
15835 21297 -3458 -2899 23302 31820 40129 23730 22045 15695 12125 -480 -7 28903 25275 16408
15821 16408 20342 -969 -14598 -9708 -4005 -16351 3833 9568 -9080 4868 21718 25093 -9575
15808 -9575 -43061 -21742 -27249 -38218 -17429 -22678 19588 32373 11600 -14060 -27450 -62207
15796 -62207 -23677 24975 28027 28335 11176 -20635 -8916 -106 -20246 -48920 -50172 -33479 -18520
15783 -18520 -12962 -17455 8374 11619 -9972 -21592 -11938 13939 16281 10210 885 -47734 -41733
15770 -41733 -22361 -14395 -13374 -6899 -9888 -8422 -17136 -32606 -13035 -1641 -4147 -3015 -15342
15757 -15342 -16009 -14696 -11704 -6152 -26070 261 4575 3632 3959 -14507 -21572 -25941 -13191 -11903
15743 -11903 2382 11387 -17112 -37826 -45769 -18177 17321 27725 2055 -26733 -54346 -32354
15731 -32354 -16922 -1114 -8736 -13968 20480 47108 38251 24708 34391 11938 22389 58986
15719 58986 63574 52736 34656 30292 28734 2793 -7662 -3738 6720 9810 6592 10979 27174
15706 27174 6418 -18093 -19662 -6924 -8868 -22342 -15425 -36851 -57921 -54512 -51690 -43253 -40111
15693 -40111 -8473 -13811 2054 12808 15985 17563 28978 39403 15723 -29687 -53790 -47065
15681 -47065 -13565 20007 14233 20449 39479 49388 37764 24794 3770 18793 38289 49790
15669 49790 30688 6358 21221 19330 -7440 -24237 -15570 -2106 13478 43581 52017 42820
15657 42820 10738 -24763 -1735 31085 39230 52623 28188 -7345 -23129 -28123 -3280 7182
15645 7182 7997 -1292 -33230 -7034 8542 30589 7789 11464 7137 -19043 6497 19201 24905
15632 24905 26984 33888 11388 -9931 -12758 -39573 -37625 -25948 -10755 -2302 -4138 4781 8496
15619 8496 289 -32829 -22415 -2659 3343 17947 22373 8103 -2744 7702 10856 18767 -20147
15606 -20147 -54393 -37581 -24841 -26651 -14145 22508 42274 22414 22059 26591 19883 -6628 -28715
15593 -28715 -42547 -48326 -34881 -14343 -30440 -17545 -2106 -5733 -469 -2738 8214 25901
15581 25901 44266 27832 12011 13580 2338 -4899 3750 680 -9191 965 17253 13798 11214
15568 11214 13567 493 -18956 10168 13083 -4211 4670 26452 9689 8226 17597 33405 37370
15555 37370 13070 16702 6082 -24709 -20164 -44600 -67647 -63267 -39376 -10119 3644 12101
15543 12101 26311 23597 -5518 -59898 -55789 -35362 -15107 2946 -226 -9805 11971 12077 12537
15530 12537 33843 36905 13101 464 -11349 -22542 -50837 -45209 -28634 -25470 -19629 -9158
15518 -9158 -8956 -18771 -39952 -60095 -65426 -38421 4043 18770 24303 18666 4488 9369 -14568
15505 -14568 -57404 -60294 -47515 -27749 -25422 -30126 -34468 -7693 17564 34255 16057 4084
15493 4084 7198 17057 22260 19966 -14129 -17092 -1791 -10474 -5900 -4740 -13388 -7724 7623 -10531
15479 -10531 -12807 -15427 -2963 -11241 5993 -748 26024 34525 9441 7087 14947 6767 6664 -23913
15465 -23913 -11274 -10740 -47278 -53799 -28974 -657 -13226 -2507 -13024 -26005 -7769 -22076
15453 -22076 -5374 30360 17989 5430 -4298 -28575 -16402 26806 34667 40060 -7899 -25052
15441 -25052 -24674 -23235 8625 52722 64462 64754 52374 41194 36094 1548 -29322 -6614 -2993
15428 -2993 4389 -5153 -13296 -20735 -2020 10511 19135 -1351 -26701 -46837 -25560 -21982 -7146
15415 -7146 6116 14634 16202 -14298 -24155 -6564 -6975 -19395 -28502 -36931 -47055 -16330 -9643
15402 -9643 -17228 -25862 -18135 -28576 -9599 -270 13715 31945 7570 -9620 22714 52964 21675
15389 21675 -3272 -7639 -22092 -12016 -10649 -3524 -4330 -4111 2263 11501 -5090 -33874 -69380
15376 -69380 -21471 20998 31853 -8514 -13629 -14083 926 -2291 -4344 -13473 -17728 -2507 25605
15363 25605 37031 40758 16755 40748 36059 650 -11533 -44938 -57103 -56565 -46436 -40227 -37339
15350 -37339 -43047 -32140 3055 15126 8623 21057 -6993 -4738 13950 4860 -3448 -14196 -8471
15337 -8471 -18234 -16149 -24167 -35955 -29068 -16194 -8890 1969 25232 29896 -46 -16241 -23613
15324 -23613 -27662 -25838 -9584 -3139 -8712 -30296 -29201 3600 -1254 -6832 8190 3523 11220
15311 11220 4332 -4303 -35453 -55876 -62116 -52898 -30026 -56388 -83731 -105015 -86059 -51940
15299 -51940 -18789 -30359 -2148 -10093 -26872 -2125 -21283 -37313 359 21576 15882 16874
15287 16874 32002 13370 -8906 -16767 -53596 -33340 21226 37571 38506 9554 1047 1260 -24141
15274 -24141 -30823 -27372 -10376 28365 -388 -4240 11155 23056 10667 -12304 -40294 -39771 -43793
15261 -43793 -30480 -26043 -44758 -24625 10239 2923 -1179 -6931 -16306 -10319 7189 16160 -5914
15248 -5914 19172 25635 12629 -6273 -7206 -12172 -28452 -28081 -10412 7292 36927 36993 44703 34546
15234 34546 4030 -14000 -9402 -3938 -12372 -15269 -22715 -26542 -28825 -6892 8239 14292 -5853
15221 -5853 -4219 -24095 -47299 -65077 -42926 -7549 -8899 -13956 -34788 -47946 -25379 3409
15209 3409 149 318 9332 6986 9642 10928 -12673 -35278 -76624 -44854 -5398 -10275 -10664 7268
15195 7268 32981 50300 53381 60397 52398 32778 28857 12734 1750 -3081 -6058 -16242 -16501
15182 -16501 -20497 -28101 -25470 -42758 -44446 -38540 -20953 -339 15011 12037 -15493 3028 5826
15169 5826 18922 22553 44461 59208 48654 13828 11784 4368 6933 6354 25040 23565 -5414
15156 -5414 -13623 -8194 -13903 -7813 -2600 3361 25522 18180 6585 12570 25876 16260 3458 -12081
15142 -12081 3026 27607 32618 22154 593 -16266 -7674 12002 48679 25493 -11775 -27101
15130 -27101 -13450 1276 5520 15355 13595 15754 15043 -5202 774 5932 -19749 -14428 -19724 -18041
15116 -18041 387 -12328 -4290 3495 -27000 -37525 3229 3490 -26229 -29280 -31806 -30699 2174
15103 2174 21126 -210 13466 35241 15507 6048 -10254 -45847 -56828 -40492 -15209 -12073
15091 -12073 -40585 -40254 -3665 15776 14640 -12174 14676 61930 70003 49604 16341 -12608
15079 -12608 -24402 -24454 1659 11649 15908 30152 16648 4266 -6633 -8400 8645 25868 42122
15066 42122 34941 30424 32189 30311 7317 8370 -10827 -16680 1836 1570 13219 10176 -12160
15053 -12160 -19754 3852 27765 31138 23661 14494 1803 14114 22019 21822 15900 1056 -798
15040 -798 -62 8317 -7119 -9254 2524 -858 -14397 -19586 -20334 -3238 16958 13340 14130 -21083
15026 -21083 -17803 3555 15955 16380 40696 59380 50562 30702 42504 50691 42412 45464 77668
15013 77668 79744 103065 119496 116942 141112 208165 293703 444200 604148 654976 656295 642593
15001 642593 635683 657194 620802 438941 269521 206754 184153 146208 162860 142471 85915
14990 85915 37516 17056 24058 10107 13300 48586 55855 56823 48557 76017 91829 80827 52935
14977 52935 36571 42916 42807 66409 85842 62929 31836 44353 35554 5886 13406 3932 -13640
14964 -13640 -8457 5155 11767 -671 -17136 -25390 -24976 -23750 -3747 10636 16377 -13283 -19195
14951 -19195 -17951 -29190 -11351 5378 -3024 -18053 -15776 15239 25275 23509 22608 273 -19105
14938 -19105 -29195 -32703 -1742 30380 24702 36459 35469 45238 41034 35881 48348 38101 20700
14925 20700 10316 -9926 300 -3498 2651 22438 28065 -5340 -33265 -35566 -30800 -65230 -55943
14912 -55943 -18498 2297 3178 -7255 -7010 -24728 -11719 1898 -5132 11588 -13341 -45086 -25481
14899 -25481 -2536 5682 7124 -36703 -42309 -43470 -34471 -24186 -18729 -9508 -6647 -5575 3143 -5267
14885 -5267 -7076 -29191 -28655 -26677 -9765 11637 20911 27545 38812 34477 16759 -2376 5887
14872 5887 17997 12485 28315 8764 -20347 -31950 -40795 -33450 -48518 -78088 -85365 -73428 -53494
14859 -53494 -48053 -48732 -40617 -46263 -64159 -77775 -51220 -45710 -20417 10922 7947 -7306 4945
14846 4945 7089 -20489 -26716 -21169 -13611 -3489 6605 303 18135 31212 31813 21071 7462
14833 7462 6506 -60 -10062 -24390 -11597 8239 -78 -1046 5277 2626 2511 -6616 10886 -18904
14819 -18904 -36548 -24691 -21131 8651 9656 -10404 -3774 2480 370 -2491 6629 -9200 -18219
14806 -18219 -56986 -36613 -16527 -1396 -15074 -8436 -4496 -20984 -25167 4055 23708 21155
14794 21155 19039 -3374 -22575 -30954 -12987 3369 16163 30519 47548 27087 11884 1046
14782 1046 8621 2221 -2456 -14164 -37117 -66576 -90443 -84919 -57074 -36769 -15152 -17258 -19365
14769 -19365 -13186 -5607 -21085 -2351 -1228 -30047 -16095 -3345 23228 20271 12107 1986 -8751
14756 -8751 -2807 7383 -22761 -67592 -52177 -13210 -3512 -5816 -6718 11276 19776 24099 21178
14743 21178 19021 30400 28585 23587 31904 19946 -6731 -18764 -11677 7298 -8590 5415 -10653
14730 -10653 -27435 -27608 -28445 -19494 -11902 -15800 -27716 -29477 -9144 -13110 -40343 -46466 -31743 14078
14716 14078 20777 8190 22339 1844 -15192 17413 6578 -15320 -44326 -52612 -15259 15359
14704 15359 17319 26920 66862 86066 75204 29021 -10033 -19147 -2688 -2847 19831 34663 34699
14691 34699 3700 4053 25862 26201 29772 24513 -19284 -25454 -7761 7054 1323 1159 5206 -4298
14677 -4298 -14349 -42142 -40885 -17798 -35898 -65950 -44888 -17529 -28285 -37452 -30012 -26119 -52183
14664 -52183 -60101 -59171 -41728 -20531 -3497 -38142 -36833 -18009 -19377 -14847 -298 -505 -5413
14651 -5413 2384 -14497 -31201 -912 25256 16706 2183 -12955 -13162 -7917 -17922 -35888 -55421
14638 -55421 -31041 -3369 -9119 -27546 -48714 -41641 -46437 -83668 -72836 -38476 -19578 -43928
14626 -43928 -51408 -66691 -50318 -59972 -78093 -71446 -35835 -6555 8391 -24244 -27333 -19930 -16842
14613 -16842 22922 63157 41881 4353 -1067 -22458 -28122 -32814 -11815 -17176 -7940 -87 -2080
14600 -2080 -30416 -30153 -12417 -15931 -12376 -1887 23936 25291 6044 9902 -3983 -14790 -21739
14587 -21739 -44399 -69094 -67716 -55524 -31004 -10996 -22112 -33707 -34626 -18444 -16931 22098
14575 22098 43665 22852 -2089 -12967 -2411 -46729 -71057 -39905 -39897 -48608 -24492 15868 -18724
14562 -18724 -37845 -48236 -35590 -27430 -47862 -20655 2591 26694 19850 23239 28833 39141
14550 39141 18585 15600 6229 -35906 -32214 8560 2250 -2068 -1415 -858 -4922 -17765 -29143 -10095
14536 -10095 -13868 -27010 -32830 -39809 -28722 -26221 -40755 -53824 -49374 -24978 16062 9441 23468
14523 23468 26617 1030 -17221 -37035 -27867 -36422 -39824 -33031 -9306 3620 -2341 4335 17491
14510 17491 20679 19768 26308 27069 13872 -175 -30675 -31977 -10342 15711 5905 -8693 -29973
14497 -29973 -23087 -13700 -18182 -16646 18882 44546 40897 15446 8328 -9903 -15895 -2882 -5973
14484 -5973 -19153 -40913 -19374 -17839 -1006 9596 21225 -9924 -988 1212 -314 -24500 -24750
14471 -24750 4475 5676 -2747 -3643 -1256 678 -24908 -18982 -14647 -12659 -8841 9015 12131 13649
14457 13649 17203 11418 -3692 -21019 -10013 -1192 828 8619 6331 21548 3345 -3224 -10604
14444 -10604 22367 39348 13449 21737 43146 23610 5949 -12596 -19305 -2159 31276 45294
14432 45294 41172 11941 17580 31311 15161 16005 6041 -7546 -11462 -12933 -17327 -23713 13661
14419 13661 33581 8733 -12184 -41893 -38231 -22165 -16843 37 1728 -12965 -6289 -18127
14407 -18127 -37776 -34499 -30276 -10446 -8977 -5277 8821 3742 -15609 -32128 -35582 -14505 12205
14394 12205 -8596 -12680 -22708 -24662 -25402 -36367 -10374 -472 3079 -13912 -21035 -9123 9748
14381 9748 15629 15065 13857 7102 -4231 8960 15145 21105 -3342 -24057 -16233 -4338 -6042 5842
14367 5842 -6581 -28713 -14260 -1707 13542 10662 29635 15181 2479 19981 21278 -23825
14355 -23825 -56767 -31437 -9844 -27210 -14685 -3031 -8670 -11583 -609 20443 13156 -4045
14343 -4045 -37610 -36052 -36140 -17296 -41459 -45939 -13976 -3169 -14909 -21711 -23616 -23457 -23144 -13073
14329 -13073 -12385 3124 19432 23192 29726 15817 5296 1348 -2843 13755 9044 -9004 -5182
14316 -5182 9124 9884 13911 24450 16597 46507 66398 45650 -3311 -34604 -40349 -6716 26986
14303 26986 38471 40536 46694 10960 -15315 -30730 -52709 -53092 -37991 -11956 2121 -4285 2132
14290 2132 -5688 -25744 -17850 -1334 -3471 -1499 -13151 -22203 -22840 -6190 -22335 -39010 -15356
14277 -15356 9286 -1448 -6023 -2295 -13447 -16080 -1959 -3464 2311 -21953 -37634 -26038 -30622
14264 -30622 -26980 11489 42080 11120 16334 12393 2312 2783 8588 31163 39623 52976 51211
14251 51211 55003 45371 22161 -5441 -35513 -21834 -7926 -18070 -4511 1039 -13533 -10470
14239 -10470 14757 35717 33433 14310 -4706 -8337 -6156 9181 -8940 -12680 -2237 13104
14227 13104 23060 14881 5735 -14548 -4700 8465 21800 4885 -7092 18666 34994 28698 28560
14214 28560 8364 -8930 6548 10570 -13425 -12915 19388 7 -26235 -39894 -20562 -10746
14202 -10746 -7467 -19717 -31212 -32639 -21079 -32103 -23843 -9741 -13180 -32303 -19582 12791
14190 12791 42609 17209 4885 34995 32994 35218 19884 35277 42545 62460 40405 -6215
14178 -6215 -19633 -24760 -32685 -8864 -15877 -41777 -44298 -42133 -38049 -34491 -10645 -10344 3054 -5606
14164 -5606 10751 35700 8633 952 -5999 -29796 -39763 -48082 -61363 -25112 -6153 -13291 -7889
14151 -7889 5281 8852 9984 36089 25584 15618 9898 -5402 -26703 -42751 -30312 -10651 -12573
14138 -12573 -15134 -28599 -31912 -63436 -52494 -13769 -15522 -33411 -42006 -40309 -52870 -55275 -45445
14125 -45445 -27163 -18562 16959 35650 21091 19106 -5243 -12523 -180 -10333 -34644 -59817
14113 -59817 -62484 -22728 -31531 -55163 -37456 -20783 -18486 -19940 -37431 -40817 -19278 5021 39734
14100 39734 26989 8950 -12434 -29793 -37991 -29352 -30163 -19023 4370 8477 17 -16843 -27747
14087 -27747 -8489 4672 5816 15482 13030 19925 21245 25903 2406 -10252 -6474 6251 -6534
14074 -6534 -18429 2645 28280 8523 -11517 -24030 -44049 -59717 -62703 -40719 -35200 -27681
14062 -27681 -47943 -38842 -1869 34937 29153 -20845 -46285 -56229 -33047 -11705 -16067 -39048
14050 -39048 -51367 -22535 5512 -9943 -16662 2718 -8939 5062 -3161 -14960 -22671 -41431
14038 -41431 -27347 -17343 -23133 -21941 -17881 13 14043 11282 -15965 -17085 -27848 -32219 8903
14025 8903 25806 18557 -1816 -18806 -11038 -3883 14240 -4286 -29392 -40965 -54419 -53153 -48248
14012 -48248 -3278 18101 24731 -15215 -16734 3265 12475 13496 16345 -14562 -10932 25703 39654
13999 39654 22185 -12948 5097 19968 23892 -11271 -31527 -55701 -38976 -13403 -12846 -37050
13987 -37050 -38489 -15679 -11382 -33465 -43381 -45123 -51557 -42251 -23340 -52986 -40722 -34144 -42269
13974 -42269 -3471 -6095 -29083 -40407 -19607 -13754 281 -1507 264 -17992 -16361 -5687 -4226
13961 -4226 -11095 -1072 -4628 -10949 -27794 -32987 -31527 -55040 -57587 -31691 -14723 -36709 -47406
13948 -47406 -44393 -45512 -48658 -15567 -14691 -29881 1972 -820 -39503 -64427 -79736 -76384 -54784
13935 -54784 -64117 -60670 -28948 -15993 -15847 -13567 -18938 -29886 -26872 -27757 -16228 -4158 -13921 438
13921 438 11390 24954 14074 -11278 -18193 -13076 1065 -11740 -21752 -27733 -21269 -14120 -7924
13908 -7924 -29762 -25517 -24571 -24449 -25977 -15324 -7713 -35658 -39353 -16029 6698 998 9263 -710
13894 -710 -1133 -6210 -7804 -17945 -20128 -6866 -17791 1140 -9865 -19262 3815 23386 23633 22497
13880 22497 8413 -8798 5253 23860 47622 37330 20746 10445 5505 -3863 12979 34319
13868 34319 61333 48462 -9798 -46444 -58744 -52166 -30324 -38488 -11552 26520 20457 9254
13856 9254 -10417 -25972 -20741 11258 6103 -2965 -2700 -19926 -30944 -28802 -6919 -13062 -18144
13843 -18144 -1071 -13336 -27556 -37526 -6597 992 -1763 3306 2948 18258 37746 34826 23663
13830 23663 24831 3659 -28017 -22325 493 20600 6383 -8157 922 -11355 -16067 -6070 -28420
13817 -28420 -43210 -43835 -19420 -13769 -7966 -15834 6772 -6435 -24217 -42811 -13640 -1165 -40436
13804 -40436 -22852 -3392 -18468 -30467 -24771 -13492 -2476 -31744 -27382 -60158 -63516 -29808
13792 -29808 8023 -4111 -3427 17125 27514 212 -3260 -755 -12869 -11527 -9192 7253 643
13779 643 3610 8882 -13073 -1574 19172 23250 9999 15951 37134 39208 50652 36232 9758
13766 9758 -30194 -17640 -9661 -25414 -39206 -33630 -26022 -59854 -69809 -67162 -54931 -52165 -19015
13753 -19015 -24092 -48048 -26735 -3744 -19361 -35603 -17883 -37257 -51850 -50020 -39969 -26369
13741 -26369 -42860 -76893 -74733 -59494 -48136 -44499 -46192 -43492 -2713 11136 14249 11883 16395
13728 16395 15807 -18811 -7404 23098 27982 19705 24293 24542 4997 -271 19208 21611 -2562
13715 -2562 -24223 -6346 -5843 -16570 -38654 -50183 -48744 -36418 -18478 -21384 3046 -2732 -30722
13702 -30722 -52222 -54516 -28773 -7055 -7811 -38838 -41010 -19053 -38379 -52450 -49941 -41124 -34233
13689 -34233 -42827 -32615 -36517 -27380 -8216 1242 -18025 -35113 -40998 -39632 -26136 9297 24402
13676 24402 23724 3503 -28275 -44638 -42239 -40280 -17103 8258 11081 -11233 -31494 -57095 -71854
13663 -71854 -38033 -16674 3967 13117 18972 -20333 -31737 -18972 -7780 -4604 -6391 -21447
13651 -21447 -16553 -19211 -25678 -61343 -42497 -203 21216 49234 43236 -7405 -14648 -7381 3382
13638 3382 29078 24282 -5315 -4685 -7378 -21396 -32301 -38177 -30271 6464 -11336 -24397 -47491
13625 -47491 -36853 -13218 -14567 -10435 7678 7132 -5922 17222 51735 48907 46018 63566 74293
13612 74293 62417 34883 15138 3268 17186 4125 9185 31174 27276 -3884 1030 24775
13600 24775 12683 22866 48080 45072 5385 -18680 4336 21150 37016 6586 -26436 -12572
13588 -12572 -7793 18853 29711 32021 31669 11813 8100 -15647 -7183 27400 45331 37326 27018
13575 27018 6632 29767 22669 35881 37639 24671 23168 18040 52715 95855 87835 57491 58159
13562 58159 66039 72621 35948 38314 58461 47779 21882 -1965 -2609 13449 33510 32873 25324
13549 25324 20864 -969 -25582 -28224 -16169 -6145 4997 -989 -7964 -6274 -4849 2673 810
13536 810 -1143 -4235 -2019 -1095 10800 43189 37117 9962 19531 22907 11670 -796 -29200 -19127
13522 -19127 -8771 1222 -2530 -3287 -8003 -19931 -17973 2508 2228 8142 52737 69365 59954 43337
13508 43337 12724 10596 19900 6793 3040 21622 20252 10254 7500 32423 13543 6371 -12460
13495 -12460 -15522 -22575 -29844 -30837 -27953 -34354 -24431 -14911 -13889 -4613 11048 -5919 -30306 -63751
13481 -63751 -36996 -14031 -9560 -24925 -18141 -372 -9919 1340 19122 19886 24226 20271 -6262
13468 -6262 -22642 -13841 -378 -15038 -52836 -45764 -10336 -8170 -1728 -377 -5420 5642 -14541
13455 -14541 3048 -8277 -12302 14062 10583 -7548 -21999 -8695 -6353 -3400 -26347 -33433 -16213
13442 -16213 -2177 9979 15437 7844 -13011 -37844 -50392 -36862 -58594 -76871 -59453 -43796
13430 -43796 -42998 -26916 -36377 -37811 -9966 6408 -1142 -738 7029 22931 13126 -20209 -12340 18083
13416 18083 10802 -20185 -7475 -15688 -21720 7689 23957 24994 26006 17328 19837 43764 46257
13403 46257 18852 29746 32485 18441 16665 14279 16086 16623 -2865 -6744 20991 -525 2162
13390 2162 10084 3655 -21667 -39061 -35473 -27350 -33609 -34186 -39068 -41121 -67355 -93046 -67359 -27908
13376 -27908 33441 18036 2320 -21038 -37730 -43663 -63373 -48059 -37755 -43221 -35643 -39143
13364 -39143 -13498 -7703 -11447 -884 13868 21083 22316 17716 18955 10854 6950 441 -21471
13351 -21471 -5135 5101 -15663 -23886 -14863 -16319 8155 13773 23262 38101 26714 7477 -25002
13338 -25002 -50985 -44008 -16790 8854 -6556 -5715 12082 4291 4180 -12835 -8367 10663 29855
13325 29855 30112 34644 29303 41682 27628 16307 2751 1638 -5763 9394 6968 -521 -3852
13312 -3852 -1438 6764 8852 -17486 -53540 -25852 -4915 23728 25456 17097 20910 34592 5416
13299 5416 -20941 -32478 -43836 -49445 -30133 -15189 1179 -6604 -28991 -43305 -66637 -48085
13287 -48085 -32043 -50599 -58356 -28624 -26481 -36238 -34454 -17414 -11836 -6066 19590 12631 18407
13274 18407 21788 -7216 -24933 -29928 6508 12138 2123 -13879 11305 25344 9912 -6370
13262 -6370 -25848 -30783 -48907 -34003 -23827 -20950 -1672 12374 4609 -5583 -25178 -40589
13250 -40589 -19846 -4929 -2813 2218 6923 11084 86 -48831 -60598 -42912 -23198 2136
13238 2136 -11264 -50709 -62697 -45633 -28624 -35350 -3398 -3592 -10399 -27279 -31886 -13379 8266
13225 8266 20145 32907 8544 -8417 2014 27740 29883 16271 4589 35811 16307 2311
13213 2311 -33415 -48079 -42715 -58797 -53582 -19645 -18810 -20308 -6927 -1491 -16325 -13285 -28340
13200 -28340 -17099 -6624 6324 -1171 -8035 -10393 -24656 -29958 -25040 -9818 961 -1341 -6730
13187 -6730 16350 7917 9393 41375 79498 70623 56824 69858 68566 32819 31107 31092 25844 13003
13173 13003 6277 -9685 11140 12574 -24507 131 14446 -415 16333 46770 31447 3789
13161 3789 -7763 -24427 -10359 3150 -12433 -19147 1926 -9442 -10437 -17007 -11846 8395 -5408
13148 -5408 1371 18570 9646 -9217 -8511 -20934 -5377 13785 14127 1803 -8899 11446 4110
13135 4110 13867 2562 1252 25220 22658 29435 9607 -12345 514 25842 26832 -6267 -32892
13122 -32892 -28406 -34236 319 41028 53105 48495 36988 5902 -13761 -22789 -15854 -7450 -4463
13109 -4463 20774 16110 21260 10154 -1282 115 9435 -743 -27099 -9970 6600 -2602 -6126
13096 -6126 -15325 -16728 -36216 -17463 8156 -14418 -16887 6710 6663 5076 -5230 -37439 -5305
13083 -5305 12568 -2244 -25765 -38876 -15797 207 18075 12299 -1585 6368 21813 51840
13071 51840 58100 68887 46342 34097 39567 48292 23296 -5127 -6960 -3366 -3346 6248 -27340
13058 -27340 -86882 -87468 -42898 -31332 -35961 -13623 -18385 -65172 -83023 -62008 -40955 -38721 1512
13045 1512 18854 8692 -17543 -7672 -21986 -18247 16414 2510 -32623 -62022 -58686 -33022
13033 -33022 -27167 -38744 -73712 -61498 -32895 -37296 -36272 -37194 -42248 -23198 -41720 -42597 -27316
13020 -27316 -29600 -16251 5998 12839 -6596 -6824 7377 9134 -4897 -6424 725 25661 12829
13007 12829 4512 9922 -8485 -29804 -18815 -28255 -58410 -62136 -45113 -41515 -46921 -38219 -13371
12994 -13371 -24129 -16741 -11793 -13319 2388 9400 -2101 -37151 -13459 -19154 -60192 -84041 -70483
12981 -70483 -73233 -41100 -47442 -40496 -51996 -51861 -15157 18821 31677 24518 12577 -6719 1327
12968 1327 -9445 -19145 -31795 -33350 -24276 -13585 310 -26006 -48209 -62769 -48462 -42870 -32006
12955 -32006 -27615 -2089 -19200 -34360 -47799 -52356 -46083 535 13976 5658 -11573 -17111 -1810
12942 -1810 16895 -8121 -36445 -14990 -787 -37666 -61413 -73559 -63546 -26338 -6284 4960
12930 4960 -5737 -20911 -30765 -1484 -17979 -28590 -33997 -36777 -59320 -49900 -3765 -12058 -24752
12917 -24752 -10659 -9461 -16591 -16148 -34321 -21016 -10453 -54054 -46273 -29587 -24334 -45939 -39562
12904 -39562 2549 13139 33401 16297 -5675 -18487 -15912 15799 61681 45199 8410 -5244
12892 -5244 -18473 1239 -9716 -19258 -7960 -38320 -58587 -49281 -18423 -22384 -19226 -4545 -9688
12879 -9688 -36968 -31179 -14277 -14315 -5091 4801 1041 4058 10441 -19869 -26060 -17799 -23722 -23655 -8775
12864 -8775 11121 -8306 -22250 -17124 -27028 -3155 -12430 -12740 -43766 -54866 -41211 -62616 -73201
12851 -73201 -51258 7226 22453 1953 -48713 -55416 -12691 110 10707 28000 26172 8082
12839 8082 -8933 -22014 -35816 -22567 -10518 -19571 -28592 -30724 -18726 -27866 -39690 -31796 -55566
12826 -55566 -50829 -30784 774 -9899 -32085 -70923 -64881 -30026 7502 4162 -11279 -20792
12814 -20792 -56274 -57302 -30547 -791 -3449 -21037 -38185 -46475 -29466 -21619 6375 20087
12802 20087 10086 10641 9296 -10651 -23001 -55288 -65264 -20804 -16563 3568 13731 -13267 -29488
12789 -29488 -38864 -33552 -2959 -29389 -50538 -23770 -9007 6678 3674 17198 -7964 -20523
12777 -20523 -29945 -15528 -16808 -3517 6610 -18157 -13302 -7275 12873 23038 35625 33394 -2521
12764 -2521 -17935 -39623 -61206 -37880 -21918 -2206 -12341 -16713 -23482 -42116 -51621 -47721 -60183
12751 -60183 -51201 -49285 -52662 -33244 -46781 -32127 -37790 -40230 -43712 -41919 -39534 -27122 -25662
12738 -25662 -32247 -57235 -47600 -47581 -24564 -19297 -41640 -36552 -2204 -6739 -2553 -23386 -30056 -34714
12724 -34714 -14993 10790 30279 14377 -4576 -21612 -47734 -52742 -47906 -39749 -9669 21058
12712 21058 9360 3290 -390 5100 11692 16483 14639 31979 15892 8246 3027 5455 -2561 5439
12698 5439 4373 -10947 -42531 -30656 -51080 -60253 -43737 -47561 -54386 -72377 -72005 -54698 -31211
12685 -31211 -19578 -8044 -30969 -41819 -41702 -22854 -5315 -23637 -12098 -20402 -42709 -40553
12673 -40553 -35863 -38470 -25546 -33880 -54342 -63495 -60089 -45925 -46946 -16278 -1273 -25165 -33430
12660 -33430 -26482 -32751 -42289 -52451 -74583 -74838 -61353 -51627 -47726 -39630 -39474 -37764 -17326 406
12646 406 10642 2848 -24586 -29989 -31795 -14165 -2217 9074 8929 2208 -16025 -56363 -62969
12633 -62969 -47278 -29712 -36637 -60007 -42371 -7593 -6997 -9534 2782 -2580 -21108 -28774 1576
12620 1576 18612 7805 -508 -14084 -17982 1367 -22012 -31100 5054 55656 28185 -28484
12608 -28484 -43503 -24578 -22848 -21590 -21141 -29953 -35427 -6473 29466 33028 17772 1854 1527
12595 1527 -1020 -1160 -17761 -31668 -44581 -77007 -44740 -14043 -28126 -37361 -34490 -19856 -26668
12582 -26668 -38777 -44359 -65422 -81369 -92249 -94096 -75288 -35308 -25466 -25415 -10190 -18305 -29703
12569 -29703 -17184 11317 25274 35511 8270 -16602 -27349 -31162 -39576 -38501 -39429 -10529 -5676
12556 -5676 3000 24350 -4577 -64365 -37958 -22841 -45828 -34077 -45303 -61079 -64533 -65488 -75650
12543 -75650 -64910 -27922 -31394 -18878 -4279 -19179 -19891 -12570 1028 6014 -7195 -15466 8665
12530 8665 18806 2929 7302 4519 7858 -830 13860 21744 13478 20243 21360 23087 23176 43927
12516 43927 47529 11295 13698 21207 22371 39981 44065 45396 24205 5246 -9534 -20460 -24491
12503 -24491 -35888 -27416 -46628 -66808 -71185 -71780 -36296 -4359 -1683 -4954 -10042 -12270 -33005
12490 -33005 -19350 1653 12500 5731 -11217 -13842 -16049 -11808 -5034 -9730 -14915 -28387 -20544
12477 -20544 -1914 1 3286 -9409 -10483 5685 36190 28979 -1861 -2555 17463 14469 -26741
12464 -26741 -29178 -35047 -29926 -16807 -21067 -30747 -35487 -38221 -66171 -84796 -78304 -63101 -42331
12451 -42331 -17453 -19174 -23757 -36960 -32129 -16090 -22861 -29073 -18569 -29646 -38941 -35450 -39114
12438 -39114 -43835 -23202 -6868 -16483 45 -8160 -27877 -28039 -52826 -48844 -14736 7940 23199
12425 23199 33752 27414 -6693 -8077 7542 15255 24929 25761 26934 4443 -31646 -13490 16382
12412 16382 25418 21434 23469 14889 23054 40102 24208 -17764 -31421 -8787 26650 34753 30011
12399 30011 7694 -13020 -21310 -12882 -23972 -14049 -16821 -46316 -18881 -7380 -12749 -41330 -65635
12386 -65635 -67830 -57458 -45801 -50011 -36336 -7485 -31067 -71909 -59003 -26569 -4770 544
12374 544 -6869 -9256 -23440 -36845 -61327 -52323 -34998 -45914 -65144 -92582 -86422 -60592 -57652
12361 -57652 -56696 -56201 -41896 -21993 -27865 -29816 -26977 -35123 -36964 -32582 -20767 -26423 -19383 -12173
12347 -12173 -20751 -35464 -47830 -28150 -15010 -15207 -8154 -11396 -22755 -20802 14534 18669 15336
12334 15336 10271 3901 6948 -14600 -11986 -22327 -44394 -39985 -31785 -43619 -27835 3622 9950
12321 9950 -9702 -17098 -14607 -12841 -27074 -14916 -5406 -7752 -19709 -1090 -22305 -40717 -36629
12308 -36629 -46492 -41939 -8972 10653 36019 30480 14743 -7552 -20025 16738 17799 -19623
12296 -19623 -40774 -37920 -21141 -31660 -35587 -29494 -16407 -17435 -34292 -25090 -25641 -46993 -51525
12283 -51525 -31424 -7446 -12443 -2583 7767 -15354 -22757 -21831 -15397 -13055 -31026 -31823 -29171 -38793
12269 -38793 -41706 -17178 -12601 -26521 -26719 -31971 -49287 -51042 -54707 -19313 -6093 -14455 -31249
12256 -31249 -37816 -22382 -13607 -14849 -39025 -28693 -1984 5974 -24082 -52788 -51423 -29210 -40117
12243 -40117 -45950 -12660 9829 10860 -18935 -39504 -19257 -27293 -16532 -12499 -23820 -19817 -21802
12230 -21802 -32948 -40264 -18333 -19028 -22235 -8837 12645 10740 -7249 -15793 -15424 2163 2907 -26201
12216 -26201 -38787 -13340 717 7864 -19856 -39731 6175 17338 20791 39776 48131 66246
12204 66246 60588 45006 45973 13369 -21633 -20985 -4288 23989 789 -28874 -28850 -7941 -35239
12191 -35239 -49532 -41464 -33258 -12470 -36132 -32348 -36344 -26298 -1254 7055 -2976 19550 43583
12178 43583 58482 52763 51328 34919 26119 28127 38876 69040 59551 67497 72609 74049 72546
12165 72546 87334 113360 108785 83823 107348 90687 60592 47302 28560 13732 15986 -393
12153 -393 -2779 -3966 -20082 -15411 21651 23269 -10148 -9546 -13732 9838 18864 12526 -10101 -6967
12139 -6967 -15568 -26102 -9143 3798 2094 -29367 -21138 771 6032 15668 4045 11470 27592
12126 27592 62317 77228 49863 46881 45865 37912 30003 40185 25641 -15816 -3012 12952
12114 12952 -4911 -36442 -30521 -46636 -33109 -29387 -16150 -18661 -41853 -36260 -21263 -28317 -26458
12101 -26458 -24961 -30975 -19137 -4817 3310 -21504 -15109 -20729 -15086 -12132 5103 6117 11658
12088 11658 11046 -5027 -9830 -22391 -47518 -49848 -41032 -44383 -23694 -28388 -43821 -29033 -24401
12075 -24401 -5666 -11437 10476 -4243 -9529 -3555 1406 -11 24224 52610 34995 -11916 -57398
12062 -57398 -56828 -42553 -38121 -28118 -1832 3104 -1038 -8517 -5912 3875 -11544 -15788 -11709 1338
12048 1338 16409 972 -22600 -46441 -12312 19524 -9013 -11379 8125 6558 -7132 -13900
12036 -13900 -36347 -17036 -8250 11630 -14565 -32904 -22065 -14273 -32179 -22512 -14349 -23915 -23802
12023 -23802 -33653 -33803 -22497 -16037 -12031 -19430 -33708 -53633 -73308 -88116 -73622 -35699 -26058
12010 -26058 -3136 7840 4469 -9233 -15136 -29381 -33905 -18157 -36314 -43918 -39371 -40770 -26172
11997 -26172 -19537 -20245 -35360 -19667 -14422 -23220 -7491 -20128 -950 49984 32409 6696 12104
11984 12104 42102 18696 -26622 -21418 -35070 -46005 -41730 -22196 -24097 -25794 -37347 -38972 -43688
11971 -43688 -52177 -49723 -30749 -10383 -2306 -23042 -57855 -42328 -13784 -5877 -4408 27729 20174
11958 20174 -10811 1034 -1264 18342 10202 14500 -10786 -26561 -13408 -15835 -44924 -30899
11946 -30899 -27858 -25607 -68932 -52355 -36965 -26048 -21643 -29266 -25163 -21859 -26032 -2999 -10961
11933 -10961 -17602 -22128 -43851 -39443 -52880 -40086 -18014 -5081 -7613 -22322 -25534 -47013 -31171
11920 -31171 -13621 8177 7143 -32263 -57151 -47207 -38150 -58574 -53971 -9813 -8281 -10605 -12481
11907 -12481 -20928 -14064 12156 13926 6661 20915 18255 -21151 -27354 -33200 -23622 -13880 -1236
11894 -1236 12870 8714 -14891 -19776 -1565 5164 2439 8125 -6843 -18095 -15063 -5521 2554
11881 2554 -6902 -10706 -2336 881 -8153 -45196 -26990 -12374 -9926 -25253 -24297 -30712 -9088 -2792
11867 -2792 -8297 12206 26841 21790 979 7160 -10732 -3986 -309 20499 21024 24068 16911 15979
11853 15979 18834 -1923 596 -3630 729 5292 -4198 -28255 -55667 -50166 -15709 11813 16513
11840 16513 18776 20122 -8913 -45097 -36230 -17440 -7018 -7571 -12897 -13073 -375 -17330 -37275
11827 -37275 -60267 -62596 -47457 -27182 -34814 -25392 -9964 5084 19233 10126 7627 -9681 4081
11814 4081 23627 38291 32478 10556 2665 -5808 6161 44236 38168 -1731 -21233 -7936 -11593
11801 -11593 -9582 -20388 -21561 7166 8611 7958 -15768 -21734 -9167 -5388 2518 -21005 -9390
11788 -9390 8129 357 20572 18129 -3440 -4866 6692 -19012 -46072 -48551 -39937 -34754 -34370
11775 -34370 -50340 -33484 -4592 1829 1117 9398 -20587 -28793 -12734 15279 32397 18999 4746
11762 4746 -12822 -4564 20631 24660 11983 -3634 -22084 -21368 452 5774 -18174 -6345 -823
11749 -823 -7015 -10825 -10288 -1941 -1528 -12411 -40927 -21313 3784 -591 -42224 -55802 -35220 2040
11735 2040 12023 27157 50803 57593 33796 754 -18594 -14989 9009 -2143 -15058 6418
11723 6418 -15450 -42197 -20304 -1546 13919 37434 34325 -830 -22448 -19751 595 4276
11711 4276 2786 16715 16669 2254 6424 8474 9544 2211 -12983 -32005 -45627 -43597 -46567 -71926
11697 -71926 -47910 -182 11799 -8048 -11911 -2221 -9905 1815 44957 49101 53692 37363 48808
11684 48808 81646 76418 90241 68108 40763 31565 44222 43673 40170 36035 36266 30159 20841 36228
11670 36228 62891 53282 55072 44257 22826 4939 35037 41553 8343 -13720 -76 -4898
11658 -4898 -4377 15716 11510 -27584 -23759 -25390 -1401 13973 14753 46681 48472 42227 52750 67383
11644 67383 84442 113086 152530 159844 175542 208296 253878 294127 332032 369439 380581 342926
11632 342926 306395 266995 238080 226621 179626 154531 132670 94008 57569 75281 83016 112715
11620 112715 104414 84587 68760 49362 42455 41320 28497 39695 66873 68856 54488 39112
11608 39112 45905 48756 71633 75167 39323 20620 13255 38393 53251 51492 50964 88035 120595
11595 120595 111837 149392 190452 231580 258678 298045 338026 325074 332739 341445 309319 269828
11583 269828 230813 187252 147707 138700 122127 98920 85159 90337 85706 69417 73118 84012
11571 84012 60868 46937 73954 77426 63739 44544 54063 57772 64751 73384 94504 101048 88584
11558 88584 69924 42275 26421 45847 48318 49895 31597 48712 44561 54896 75274 101041
11546 101041 107169 108477 103618 102521 98410 110600 152181 150959 134707 118246 130153 132601 97960
11533 97960 72785 56993 37274 33948 60681 89658 54365 62580 83956 94523 89674 68306
11521 68306 71371 75041 53021 50777 58925 79817 83119 61575 56204 64406 53884 41915 20563
11508 20563 33798 18343 5525 1588 -3933 14385 24734 23402 43909 26799 -16148 -26771
11496 -26771 -41916 -58844 -38497 -6212 -21078 -6039 8186 33835 44854 43910 -2503 -31825
11484 -31825 -8476 4414 14836 8374 29955 47925 42414 17125 510 6371 34772 46315
11472 46315 62109 67883 51531 29858 18041 23426 19787 13836 29189 34114 -2008 -5452 18792
11459 18792 32005 46350 50222 48442 22036 13641 30903 14726 -9124 -33589 -37442 -15238
11447 -15238 8716 41175 67363 98000 109346 90004 61483 49753 44538 36862 33805 39061
11435 39061 68936 71140 67705 75096 81451 76099 46441 7955 19673 14407 1629 15920 15432
11422 15432 24240 17840 20245 22604 18239 42211 67063 53567 51373 59754 37764 29891 25267
11409 25267 30995 30017 42890 25118 12909 23614 16801 14059 23048 44305 31515 11770 17959
11396 17959 40028 36338 18954 22031 15880 -9777 -31717 -12218 -8393 12851 35375 29195 3917
11383 3917 19347 34456 42312 20890 44222 46432 37179 27760 63499 70586 48363 59618 49963
11370 49963 35292 30878 44974 32959 11470 -13332 -5162 1119 18519 4054 1232 26268
11358 26268 32646 45597 45132 38677 39497 48850 51760 26561 33077 66316 66859 52670 45818 27268
11344 27268 26836 30500 51428 54954 11026 -28291 -35695 -11451 15445 36828 43692 58034 41658
11331 41658 6687 -17463 -6962 13807 22527 16662 31871 40369 44531 15497 20231 23234 33620
11318 33620 93662 117018 61666 35106 52452 55402 36756 53568 60759 73051 67178 30531
11306 30531 16666 8756 9315 26909 31458 43464 34919 20195 21690 24571 30116 41676 32858
11293 32858 36923 42528 42851 46149 51519 65977 45684 37123 45810 27168 35533 42697 25387 4071
11279 4071 9785 19096 25326 30246 21786 14384 -3219 -11556 -1693 27669 41439 33016 40133 86362
11265 86362 85285 65151 103837 120934 144779 167096 195622 206819 206354 237610 282439 314037
11253 314037 331937 344697 349834 349547 358008 362149 346965 282025 223934 175937 146810 148669 156246
11240 156246 161706 142408 105624 84406 85153 103918 103482 96018 92876 90864 79422 73572 85534
11227 85534 95549 95850 111968 99820 86596 106008 128120 108051 118914 141363 135005 139042
11215 139042 135379 163019 217859 270884 320935 395411 501671 610315 733364 872695 1005229
11204 1005229 1094803 1162245 1167383 1154288 1096020 989194 887930 772500 650509 555243 483560
11193 483560 434113 354905 288484 254749 219259 195482 179359 165105 192469 211536 220460 230841
11181 230841 214531 188351 195205 206990 189626 183622 201483 198228 203530 174652 174126 195275 201838
11168 201838 245487 275780 266813 268653 315607 374644 445836 544390 661769 803301 949674
11157 949674 1078467 1201994 1264246 1297860 1267089 1193371 1097584 1036420 933999 811295 693589
11146 693589 578840 493226 400458 301004 260648 267476 283167 260390 229245 224604 228035 218105
11134 218105 202757 206106 188133 150562 159127 194734 203912 158965 146158 143334 158068 175291
11122 175291 169516 144030 148788 155493 145500 145906 147661 181683 228276 257862 299095 332230 389752
11109 389752 458052 507587 553129 591340 578676 548262 527359 501451 466573 396948 339525
11098 339525 309167 254544 240198 232008 195228 180541 195487 197479 200924 218682 225323 207305
11086 207305 187339 155181 131394 105940 102517 141074 127302 122941 124726 83619 79023 103333
11074 103333 119227 114898 84109 86744 67516 88046 102079 105236 131545 174399 210498 232085
11062 232085 222963 206155 208000 212001 263505 294318 267980 222239 218704 216527 202671 183178
11050 183178 143747 118978 125807 152226 179514 213366 207575 199415 215986 215213 221603 222336 225149
11037 225149 225297 231878 223564 202343 197087 207752 199305 191675 195924 174710 163836 167000 178820
11024 178820 172416 153376 162807 150680 121867 110353 149191 170135 168275 197313 196330 223665
11012 223665 273393 311007 308543 298231 285416 282424 295455 298396 295706 272595 230824 197223
11000 197223 203234 226419 216083 242919 278880 291609 303013 312778 322446 335427 344898 332080
10988 332080 332160 367388 383697 362950 338066 324608 304918 303238 301047 273072 282340 296597 289240
10975 289240 279968 244825 231861 250685 302384 309511 321497 319680 307384 300316 277194 286648
10963 286648 312476 379285 412481 440279 438004 436076 433876 411310 380206 372744 380628 370309
10951 370309 372182 372227 416796 471195 492751 488014 460038 474511 496554 527434 541464 510178
10939 510178 509446 508127 512015 502909 524504 517257 541871 583918 612782 611557 620539 620087 622846 634896
10925 634896 639254 621380 581394 562601 570697 586654 567304 547028 597935 659101 693560 709970
10913 709970 692228 705439 749074 772965 790085 805786 823126 822154 821204 785589 780015 796718
10901 796718 821604 851068 853502 834168 861725 898449 926989 935181 946042 942335 989635 1047190
10889 1047190 1075103 1095543 1152915 1242003 1294975 1366136 1441595 1532440 1655146 1760246 1827994
10878 1827994 1922065 2060022 2238154 2451344 2705223 3023565 3406933 3804287 4252087 4699343
10868 4699343 5141717 5601417 6173382 6884300 7788962 9081278 10990687 13756036 17632088
10859 17632088 22691365 28841810 35901132 43483783 51164014 58146016 63433839 66515961
10851 66515961 67375491 66165966 63030124 58060124 51507181 44075468 36861630 30710021
10843 30710021 25697595 21512677 18110145 15607102 13912820 12847794 12153387 11689968
10835 11689968 11339284 11108472 10944594 10820016 10733637 10724422 10809528 11001425 11390583 11892346
10825 11892346 12496083 13256168 14156255 15149388 16226715 17438402 18781829 20324905 22263785
10816 22263785 24850837 28481939 33818262 41763762 53124114 68270647 86762980 107917681
10808 107917681 131334957 155295058 177474721 195522526 206651190 209808121 206805319
10801 206805319 198095134 183481506 163768885 140661988 116856990 96024087 79648659
10794 79648659 66066620 54493381 45784507 39947541 36126353 33554577 31654728 30158908
10786 30158908 28910402 27830731 26865873 25983057 25146811 24410613 23833364 23479686 23328011
10777 23328011 23333654 23496955 23844529 24413259 25146889 26015894 27052222 28296322 29930286
10768 29930286 32205344 35495495 40463975 48009217 59017277 74040261 92705520 114062339
10760 114062339 137772973 162488308 185936195 205488398 218110892 222134863 219347143
10753 219347143 210948926 196613112 176593320 152578546 127433888 104828054 86892311
10746 86892311 72289423 59801476 50116310 43470195 39059394 36074008 33894303 32169599
10738 32169599 30765998 29595426 28577186 27552364 26438731 25317373 24225321 23252651
10730 23252651 22420750 21597614 20762346 20063914 19577175 19244768 19053217 18976100 19010214 19189545
10720 19189545 19577544 20335105 21656876 23839968 27274174 32138256 38246438 45281713
10712 45281713 53083799 61438142 69636909 76452675 80764350 82221120 81251115 78407903
10704 78407903 73575051 66501705 57870906 49023359 41078296 34525028 29120335 24599718
10696 24599718 21006675 18424223 16646386 15393298 14438992 13639630 12990954 12410466 11855570
10687 11855570 11312928 10771247 10227454 9737055 9277512 8848403 8437320 8054914 7705128
10678 7705128 7410991 7165451 6906619 6676543 6493722 6324735 6161717 5954324 5748628
10669 5748628 5558451 5356670 5140865 4916086 4699363 4506308 4306771 4124646 3964235
10660 3964235 3783260 3652673 3537412 3431954 3272688 3129999 3011948 2909426 2791377
10651 2791377 2695502 2618103 2519755 2444056 2332100 2239576 2172708 2108938 2058741 1988215 1914734
10640 1914734 1866712 1837792 1835626 1798946 1753161 1728514 1700071 1692166 1657466 1633496 1637403 1607193
10628 1607193 1587733 1575602 1536901 1507890 1463509 1427360 1382399 1352422 1332458 1299759 1259231
10617 1259231 1184581 1119650 1078683 1052208 1031543 973784 944768 964319 968154 936016 902004
10606 902004 893720 922002 920704 886495 874331 854368 830836 801675 780567 766590 747600 728841
10594 728841 711759 725202 720826 725158 741252 744409 765843 764071 725627 678306 671880 709420
10582 709420 725570 738370 752696 747282 753420 707853 682624 665393 672395 635100 593884 536642
10570 536642 515414 509238 461079 462335 484694 486699 493159 476891 477796 489353 494778 502576 535031
10557 535031 552341 573432 569717 562584 553066 533733 517057 469954 457582 462878 476101 459163
10545 459163 442287 465481 462068 454313 461343 481805 475024 449553 420740 443103 468718 474072
10533 474072 474620 476432 466078 474220 472798 465213 440729 423565 408366 383854 389460 375401 353604
10520 353604 313684 284118 273910 264443 273403 299218 318257 325005 322792 338581 349726 370718
10508 370718 372631 392053 383573 368423 321017 323568 315902 314083 295575 274365 288032 297555 323297
10495 323297 316209 306214 314906 320584 309743 271143 277165 290342 276023 267444 249789 232278 238079
10482 238079 262553 285753 302847 290658 282409 284893 310922 301515 277521 263253 267648 266989 270049
10469 270049 269005 278556 287803 297574 297459 293800 271082 265919 271762 296304 308136 308250 312810 317495
10455 317495 334783 351279 384967 391951 443537 478255 494419 502375 559401 615243 619089 593403
10443 593403 569328 488043 413732 368644 348212 333067 321451 313865 300195 272354 251489 237286
10431 237286 228986 248440 263621 266146 247158 247308 249908 257315 256673 259239 270398 300864 337095
10418 337095 320754 317546 347757 326103 315199 337074 366775 404970 433688 479784 505674 553045
10406 553045 647121 741806 857094 949215 1034435 1170506 1279461 1330694 1317933 1287617 1256450
10395 1256450 1204617 1101566 969826 830212 719935 653282 558791 484632 408269 358435
10385 358435 352531 342194 323637 333355 338633 330390 361868 363037 376552 360057 363045 349957 345299
10372 345299 351340 367340 396802 429298 447031 449747 460281 472265 468102 477693 502058 513860
10360 513860 569987 622468 698331 804781 908954 1001254 1097548 1190441 1297188 1379564 1401980
10349 1401980 1382089 1326746 1228248 1140452 1058528 907656 782248 689786 594401 520419 498580
10338 498580 441434 405851 384522 391347 384243 375210 362478 352961 367604 364798 365831 361241 358052
10325 358052 364245 346742 290993 260412 287783 303218 298128 324894 351586 361837 356244 356356
10313 356356 360276 371907 374779 369273 412969 460266 484870 512311 542159 580275 640774 677222
10301 677222 652030 630358 589260 548235 517063 472315 448967 418115 380297 350068 329941
10290 329941 325715 342526 320039 314148 306152 305253 324453 326322 286567 265193 250341 237300 237733
10277 237733 245319 252737 227312 213525 225668 242226 256499 240662 250497 257311 235323 247285
10265 247285 235102 229712 226602 212236 196359 202092 203215 229938 246144 253910 240955 243610 237705
10252 237705 230683 248118 277913 259872 280192 306302 281118 222087 206924 205159 215134 226449
10240 226449 226096 228254 198543 188660 190039 189970 181537 172055 190106 176911 157951 152984 180418 161229
10226 161229 143859 181950 186760 188115 197353 189252 170603 161567 156832 196286 234670 229023 212747
10213 212747 204346 188383 166308 145906 167027 170069 153782 121385 131621 180831 203150 195324
10201 195324 199359 178569 153052 120372 122534 129251 151904 180632 190814 184901 188701 176583
10189 176583 177650 181136 188611 186217 202042 218788 212364 200196 204336 185948 163588 159928 148819
10176 148819 184554 199651 193536 196312 202921 187806 180482 167021 158986 156045 169000 205964 201585
10163 201585 179459 182493 190225 195602 204144 206308 237602 254531 255219 247149 241037 242552 220535
10150 220535 185157 183621 176444 186658 195092 204761 217197 223562 186230 180353 186263 200074 208441
10137 208441 192569 155379 135678 140360 125391 114128 88160 90068 112373 135163 142146 136295
10125 136295 143571 139477 134863 137911 146210 162029 148425 147841 154198 159528 168607 172024 183079 179985
10111 179985 190901 200219 185510 163601 149073 146343 170235 198306 179604 139524 119058 126002
10099 126002 134742 122426 148686 180124 153026 162399 162231 149766 155683 168168 183918 181776 187216
10086 187216 197737 223409 249393 241518 227085 239858 218389 198658 182459 178587 188857 209077
10074 209077 232620 248504 280351 311535 329587 371669 469752 652078 947246 1397359 1838454
10063 1838454 2033166 2047720 2018469 2038075 2092490 2025695 1597490 1099345 792433 614432
10053 614432 515656 468236 423955 386285 359223 330834 315165 293367 291631 294366 252371 249696
10041 249696 266176 248303 251319 243664 217557 230881 252554 268268 255038 237181 238780 225572
10029 225572 202526 206004 212133 219425 225773 206128 215101 212268 221912 180603 171639 199516 217111
10016 217111 210504 194333 170706 159601 167003 172934 191232 218251 226428 214025 183345 173545
10004 173545 148147 147248 166054 177101 169567 179465 167168 170678 179717 176591 176694 168422 163757 173294
9990 173294 189737 183111 154174 140563 144031 164137 193682 191256 134274 136134 174206 191441
9978 191441 167559 165858 157789 146882 139773 144983 145707 134784 119502 110107 132073 134321 132708
9965 132708 131240 124018 115946 127761 131440 137472 150733 124597 128667 133728 152144 157168 159121
9952 159121 170206 162125 171730 200308 188682 160482 150267 142065 143872 153862 173674 186581 188676
9939 188676 190006 176827 172552 162314 151588 139028 133336 122836 137699 138435 90022 72174 85412
9926 85412 92457 98105 106797 113211 149164 152044 145824 141637 156148 142585 101289 115548 146045
9913 146045 170937 165898 156641 139025 136881 110318 80130 67584 85768 106204 120571 126836
9901 126836 95089 116071 151794 141295 122099 107826 105586 121311 160427 154360 129549 127506
9889 127506 127927 140618 176766 194764 187460 164254 130637 169506 207463 200509 185576 202882
9877 202882 249364 307024 331664 323558 340548 409599 435854 447948 457696 449371 452802 422297
9865 422297 393768 354800 287521 232281 189599 155722 125033 131631 133293 131320 125644 133045 172135
9852 172135 163678 144707 147211 136047 155874 162971 182918 180315 187068 196287 182862 174025 181210
9839 181210 172610 167113 155123 145573 147042 139917 139301 126054 103566 97637 94269 114428 107005 96079
9825 96079 83996 90855 105368 120457 112653 117441 109166 111608 118224 125757 118520 100484 93301 87703
9811 87703 96832 129482 139697 160729 154446 123910 144737 147638 146277 133917 135981 118271 118936
9798 118936 138903 130258 148832 135866 112472 124822 120068 115654 107551 109650 91013 94483 101691
9785 101691 130950 124783 113622 114674 117779 132312 153748 127507 112950 129379 158124 140596
9773 140596 119820 118587 127772 117719 138949 154189 168339 173673 149139 130008 116528 93710
9761 93710 103003 102504 96220 96350 100228 110221 90659 103918 141173 133162 121780 108780 115238 139755
9747 139755 169049 155864 138455 139642 130683 144063 128346 123539 131373 155408 147931 137943 136669
9734 136669 115649 108776 104266 133011 142627 126837 129768 143704 157383 162645 136085 124976 118881
9721 118881 135369 115726 117143 128587 131286 130367 161842 150400 125586 102663 97543 103124 92664
9708 92664 80020 56868 53767 64378 93706 114768 115785 84551 90788 79761 60897 60583 67764
9695 67764 85051 108178 120661 126904 96648 107037 122238 104677 105908 101145 100517 104806 85914
9682 85914 65162 76848 110807 107621 95499 92301 89865 103957 121144 138318 148666 130998
9670 130998 122230 109860 105494 126771 138623 143068 153217 123160 107005 100687 100417 94391 87269
9657 87269 90870 87382 89725 94134 91537 85529 69103 48285 32135 67132 112966 99841 87480
9644 87480 99946 110667 131589 143454 125516 121723 139869 152340 147904 126185 137896 127533
9632 127533 127622 91367 82998 116841 138851 151789 118266 93244 97030 100952 64569 64828 80847
9619 80847 81200 107345 103235 82376 56125 60824 88193 99933 103981 97734 78320 83339 113063
9606 113063 125865 102394 77390 54502 64170 59771 58497 79579 50062 45344 62800 75630
9594 75630 77256 66730 76288 98365 104510 144644 138529 97548 71348 80600 90878 84516 90607
9581 90607 108659 102863 83042 61582 93769 104301 73230 66367 93603 101033 84464 120696
9569 120696 108451 84879 56124 35068 48321 84189 104193 105264 75501 65991 56283 38337
9557 38337 62173 77632 102903 96921 83188 82179 70438 82918 121281 130915 91312 83992 102775
9544 102775 110231 152412 158237 146266 161523 148432 123955 148318 160896 175267 162876 132753
9532 132753 130902 126315 119586 97039 78134 67569 70377 74952 100051 120356 124886 118920 106967
9519 106967 105678 98597 108427 113887 85464 92579 97679 109502 99856 71891 77710 76755 80178 65885
9505 65885 49130 26859 43333 51730 75792 98134 103576 104487 124218 121541 108832 125067 140142
9492 140142 159360 143817 127547 108132 93871 105206 126211 118214 96815 86290 92855 88922
9480 88922 116341 134999 104458 86562 94083 114742 141613 100898 74705 64029 56755 59301
9468 59301 69370 128889 153241 141480 113315 91123 63838 57734 76644 77776 61387 62563
9456 62563 98145 134466 133800 115458 106653 86850 65511 54384 69778 83872 92213 103776 73799
9443 73799 53119 75029 91219 69496 56056 41105 45987 62550 101588 112257 110639 111425 107096
9430 107096 93090 85519 85607 83749 109839 127957 140627 143212 127786 92973 85465 93944 96139
9417 96139 91752 88292 98390 105293 124050 100484 75529 104052 116579 101331 85459 71189
9405 71189 119938 144553 134123 114188 112136 125511 116789 96122 112716 128665 125113 110833
9393 110833 116151 119048 130182 138380 129773 117974 109403 108521 99946 80514 66007 57763 71028
9380 71028 93077 113834 130246 156350 157110 127961 107991 113024 89984 76265 81506 93482 135006
9367 135006 138511 89329 78796 98339 94541 117861 115285 112047 129096 146568 142855 128201 121487
9354 121487 135448 119612 85670 77002 129260 159009 170623 174238 186339 175881 151754 152569
9342 152569 138889 149578 140772 136273 159321 178403 175565 148406 139338 104913 109726 112760 120013
9329 120013 126007 134108 143866 142220 176417 157880 173378 146015 122906 149375 159406 155951 163134
9316 163134 142142 138704 125527 130185 171130 189110 165721 136617 138042 164464 187083 166083
9304 166083 163179 168656 196183 195721 180108 191039 165279 140372 142357 135610 124083 130602 144248
9291 144248 164326 146277 110697 93058 110012 109625 124353 138497 158595 160948 138755 123168
9279 123168 122027 141262 145867 122431 138149 170050 161085 149297 162255 186893 178138 146433
9267 146433 132178 132016 133256 142817 145273 161006 139514 111442 105551 118982 125006 131080 150356
9254 150356 157254 154816 168165 148976 141916 137620 138037 146016 133392 129583 128358 111438 134521
9241 134521 150274 176523 162004 171054 151420 139023 144285 154399 145073 133944 158678 168088
9229 168088 160239 146100 147711 135791 121256 107149 92085 103341 105566 95411 111774 99359
9217 99359 114337 111647 119756 136034 136444 133795 133056 140554 134545 113823 106403 129385 156598 174145
9203 174145 167291 164151 182165 168996 155471 147170 155126 160189 152777 127456 119755 119469 136894
9190 136894 144227 126176 130283 138716 126326 112749 82220 84339 89304 126684 170163 163996 143651
9177 143651 133369 152535 163744 151037 129529 130277 124884 128805 123706 122528 130831 111312 91512
9164 91512 102028 90796 121765 148427 160201 165743 166576 187529 167002 155253 129525 117347
9152 117347 129466 135387 136438 137075 128064 127140 110926 109478 101130 95049 117000 107426 100668 94809
9138 94809 92381 102303 134066 136337 108309 108267 131806 150419 151895 150808 138489 140893 130672 126654
9124 126654 166124 173283 127598 133034 137257 142744 149225 126532 99091 116148 134826 114555 106847
9111 106847 114452 86515 114147 117587 109716 113249 133541 144745 138560 125161 129499 132640 116919
9098 116919 105376 136781 136933 113427 97131 89390 84258 76411 115051 139252 146762 167801 168387
9085 168387 180664 176270 157282 142649 130482 148929 162285 140287 120670 132411 149103 163923
9073 163923 175159 190202 177305 161156 133765 112290 132151 142154 151772 140596 135605 102623
9061 102623 61705 82290 96843 106680 119867 144386 141869 130622 111095 122809 127549 119999
9049 119999 96073 83356 87585 104462 147225 141870 146134 156981 160384 164363 140658 147915 174554
9036 174554 181369 187836 237841 242837 226522 190432 182167 235170 274466 270515 273101 317574 376634
9023 376634 467498 624337 856736 1128174 1382679 1510648 1559463 1554902 1500659 1425918 1266510
9012 1266510 1021901 767349 562714 440510 392649 373109 353292 373638 391407 388467 414129
9001 414129 415860 415163 397392 382147 373516 364387 329109 315723 324955 303664 267657 265197 280307
8988 280307 263956 284019 320573 329410 345137 343071 346511 331749 348275 389996 428703 503460
8976 503460 611441 776893 1079016 1568799 2130205 2552732 2755956 2814270 2858882 2921039
8966 2921039 2902524 2605635 2060815 1527021 1166254 935586 790268 716277 661787 629392
8956 629392 582558 537857 501167 455174 430708 411952 408474 400002 385016 398287 378019 342659
8944 342659 338806 334156 375496 383954 371484 363889 361998 329513 323708 321114 322776 333869 346007
8931 346007 328530 336071 355121 392257 492751 634254 829374 1071927 1309761 1453536 1488803
8920 1488803 1476000 1495450 1474579 1376836 1158391 892392 681072 545083 458462 389659 335444
8909 335444 347689 361736 342172 325031 331605 349821 319838 301897 310316 331548 354785 335255
8897 335255 320271 322514 333102 361628 375929 352163 327577 323192 313753 294580 300866 278616
8885 278616 266622 283790 289154 280599 279663 302684 290728 302195 352745 384473 402828 426744
8873 426744 451482 486557 484863 477845 432338 363131 310181 303912 304484 284803 270754 291547 318136
8860 318136 305553 312307 338718 342052 295148 292200 292919 260015 251242 279961 304653 294033 277213
8847 277213 261042 268747 281174 276229 286115 295610 323397 320882 325497 286699 271270 272778 279055
8834 279055 285152 300758 320246 348501 407234 470716 460758 484288 564502 608598 632381 614183
8822 614183 565055 511164 478021 430883 395118 358838 312249 304472 300327 304171 327268 392633
8810 392633 459754 516483 566297 583257 583556 555569 515857 475141 419422 371890 331654 290425
8798 290425 256546 253731 280420 286784 294934 304936 303403 302574 306457 324076 344791 360343 380833
8785 380833 400879 417332 448204 468909 479119 524946 540052 538172 552398 563160 540308 544637
8773 544637 495268 447315 420246 374380 349304 311405 301032 300081 327174 392647 493836 583304
8761 583304 639008 680932 717311 715057 698881 690284 622840 564641 522001 478678 462729 489082
8749 489082 585460 745840 872399 993243 1052824 1095713 1127096 1186169 1178802 1086334 1012965
8738 1012965 941038 914398 918142 914901 948721 965878 947675 924040 913099 872752 815856 787442
8726 787442 821756 830897 842876 827135 826306 861760 858025 840073 833277 821321 805603 849493 888766
8713 888766 933064 959064 951844 926340 927542 948033 996519 1067848 1112217 1148723 1212583 1306495
8701 1306495 1437075 1630774 1898199 2113193 2197538 2202976 2209127 2246241 2244562 2043661 1787385
8690 1787385 1612166 1553467 1508622 1441775 1442104 1463817 1497930 1519806 1545053 1561811 1572111 1559788
8678 1559788 1600753 1669753 1709723 1745068 1734307 1747281 1816564 1901038 1979671 2051555 2095541
8667 2095541 2137455 2194043 2225608 2242526 2240938 2200794 2227354 2293250 2378324 2502557 2616314
8656 2616314 2771975 2951962 3100044 3283316 3507190 3753847 3998617 4196004 4404035 4632913
8646 4632913 4884737 5139227 5380723 5645507 5960285 6394830 6986680 7721076 8681760 9819993
8636 9819993 11110958 12502936 14036872 15690759 17532324 19680404 22342230 25803320
8628 25803320 30384419 36823677 46633172 62551065 88851647 129595852 182169427 230802976
8620 230802976 258195921 265239260 265060738 266375993 265364915 244737750 196860848 141941607
8612 141941607 100819608 75606042 60548442 51157762 44955395 40726280 37805503 35594155
8604 35594155 33682974 32038344 30720716 29700735 28843547 27951954 27063584 26398009 25952311
8595 25952311 25620620 25399269 25416098 25701487 26327235 27353519 28816091 30651068 32700292
8586 32700292 34931319 37388410 40190862 43611322 47915697 53453876 60912447 71529086
8578 71529086 87792711 114459720 160070984 235686973 341741718 443042461 496262626
8571 496262626 507266960 504523655 508338802 517231041 485935937 389305258 278279600
8564 278279600 196444157 146472861 116446261 97548419 85105373 76621952 70580729
8557 70580729 65757078 61591540 57960167 54921682 52496021 50313101 47945195 45435705
8549 45435705 43191357 41359721 39762351 38330930 37124034 36112795 35276163 34655003
8541 34655003 34303926 34253347 34354095 34618450 35051827 35692725 36671659 38108340 40181814
8532 40181814 43164542 47610393 54586854 66168355 85783667 117778151 162942837 210574539
8524 210574539 242349091 252973295 252902409 252727778 253524057 242013287 204277571 152264982
8516 152264982 108906179 81197174 64575209 54239731 47437625 42772861 39452723
8509 39452723 36840226 34568062 32526228 30777846 29318536 28010938 26650336 25233015
8501 25233015 23888335 22705694 21702654 20785387 19912744 19066389 18259692 17488615 16749869
8492 16749869 16062131 15398965 14805750 14248435 13759466 13274877 12823649 12438060 12059856
8483 12059856 11639701 11186752 10717361 10245978 9817437 9439548 9087066 8734331 8391546
8474 8391546 8041444 7774083 7516457 7223240 6929353 6642879 6409561 6176247 5959620 5735345
8464 5735345 5525423 5302297 5134419 4978697 4823810 4645802 4459639 4322298 4234133 4152429
8454 4152429 4019193 3884933 3808401 3747620 3702976 3662526 3600802 3532562 3480331 3433141 3371620
8443 3371620 3303723 3238088 3151420 3083535 3031375 3008348 2932235 2881230 2825645 2740990 2624410
8432 2624410 2503249 2388764 2293200 2188284 2112156 2032576 1957832 1926648 1948214 1954053 1927839
8421 1927839 1844173 1763208 1712968 1680815 1626639 1575189 1523467 1486191 1466015 1443918 1360045
8410 1360045 1306756 1316309 1326538 1362649 1363049 1328801 1314948 1311609 1326711 1335575 1305473 1282317
8398 1282317 1284475 1316346 1348002 1346963 1350083 1355503 1337327 1344735 1317557 1241304 1162002 1079839
8386 1079839 1027430 999353 927326 862816 834656 816312 819170 860891 905327 929891 982678 1066405
8374 1066405 1135032 1160890 1181412 1159693 1114187 1091307 1057411 1032071 1018070 1025829 993569 943853
8362 943853 927576 937057 929491 908603 920432 940893 943437 936263 951343 952171 904730 867201 882271
8349 882271 898415 908247 903256 898709 892567 913041 919452 918007 889346 831122 786254 745675 683956
8336 683956 627069 553221 485664 451806 448900 474261 504905 553760 610927 660867 696096 697976
8324 697976 708322 709731 685445 676039 669390 642753 624634 618475 600390 566374 533276 524509 526426
8311 526426 544018 561191 549498 564859 571359 570956 564127 562303 535498 506849 473185 443512 444499
8298 444499 465907 490126 501750 519308 515960 524875 522369 512546 453384 424439 401454 364737
8286 364737 369632 376486 387224 357299 316567 345267 391814 423593 420630 436307 425985 397234
8274 397234 363787 354532 370317 372075 352172 327923 333132 354481 367986 353950 383309 369266
8262 369266 382657 400345 391374 382948 402201 407098 397591 381786 364328 356938 375904 360873 360442
8249 360442 348235 331929 290298 273804 291663 332588 373241 407116 408725 414391 420336 397639
8237 397639 409726 386365 382586 382560 376953 371328 397753 405425 430889 440613 444870 467051 463906 455421
8223 455421 481567 525980 599794 727377 966013 1248002 1528969 1707892 1727102 1714527 1719906
8212 1719906 1707326 1592513 1326821 1039575 805352 662380 588783 527951 516069 494453
8202 494453 494801 492877 477658 454149 425457 439242 437307 392597 341316 325458 361902 370216 329697
8189 329697 342815 361414 381459 400340 432164 436305 451173 471969 481576 502305 511847 525297
8177 525297 558960 617554 658078 753880 905338 1118688 1480063 2029225 2595321 2938911
8167 2938911 3033103 3013717 3001197 3040328 2867057 2341123 1755291 1314902 1053626 879771
8157 879771 787717 700854 646460 640680 634342 604643 577316 538120 505365 491975 496814 514875
8145 514875 471195 457628 463799 453027 442230 448130 463893 435381 408546 419430 394303 359189
8133 359189 380621 401755 394974 412875 442048 472008 500530 559553 622649 723138 899156
8122 899156 1120944 1377719 1539383 1583899 1609927 1625813 1625125 1543388 1361072 1076288 816311
8111 816311 642661 555259 536115 503006 486865 472102 473395 462593 454968 443428 458387 443881
8099 443881 439346 421935 428193 423255 400007 382823 363609 368811 364046 347366 377420 365429 322754
8086 322754 292146 309343 307508 299230 319540 323747 318535 313489 315040 313742 328685 329350 348860
8073 348860 327523 310632 336814 334784 305511 321403 374192 404868 411139 412665 412685 383283 376660
8060 376660 378008 345656 307753 297310 315647 366710 372205 367071 351852 358574 339592 326864
8048 326864 339678 335881 335211 298560 302357 347193 333474 321198 335111 349289 361023 359690 374642
8035 374642 378077 373261 387957 393717 365170 373185 397163 438572 421052 391428 359433 313089
8023 313089 296178 313227 337330 349168 356100 330884 328633 357065 350790 340862 320866 319313 328759
8010 328759 320318 319835 301027 284891 269743 299322 311144 314989 302442 281985 284786 285943 299704
7997 299704 298792 319594 337107 337337 328015 324933 341483 379568 390291 372723 371881 367230 375007 371087
7983 371087 379883 389194 371652 362741 341017 302258 277121 264420 273823 308036 299039 298356 283962
7970 283962 277837 287391 278097 256180 230120 252825 245467 224659 209816 193893 196207 226300 253379
7957 253379 260856 246749 260067 264978 264724 264801 267323 248917 246137 214120 199383 207090 209856 205535
7943 205535 196271 206565 225964 250194 259335 228149 201928 176135 156517 187514 181953 193108
7931 193108 199907 195927 198370 192892 198995 187872 170448 176153 167599 140422 156550 185174 161468
7918 161468 140236 140350 179997 185653 188199 164550 147666 154778 158010 163194 141301 148301 152357
7905 152357 139410 116688 131944 123238 111417 132092 118708 108097 123156 99787 67131 49353
7893 49353 42462 81243 91450 90683 80964 74834 88433 92228 92905 85992 92404 107165 106279 124189
7879 124189 127339 122184 125173 108503 97904 106647 105086 105245 85193 86465 83489 84058 85067 83729
7865 83729 70373 88787 109514 100420 80770 73536 92851 99412 94486 84914 94195 97592 97563 94948
7851 94948 75737 82145 86106 57827 61619 72752 40656 65076 55514 50790 61617 77208 86021
7838 86021 96246 108970 121198 99719 108714 116267 128278 138735 139758 140349 118569 110616 79683
7825 79683 64318 76317 87023 89850 96544 117372 102442 73669 55264 57615 48162 53524 71983
7812 71983 62924 56587 69761 76438 100135 112498 94265 63709 72686 118321 95115 54113 53941
7799 53941 61832 51611 28691 20956 28597 27753 43288 30150 41577 63957 73712 68403 83199
7786 83199 112321 116283 136149 135909 104265 93558 98970 75033 51928 53277 64204 62457 61930
7773 61930 53192 58897 65269 36575 22754 22145 11077 28737 55798 67475 37245 37106 77669
7760 77669 72473 61670 31704 36222 60137 73583 56809 37508 26776 55286 39344 44034
7748 44034 61077 73527 51384 37740 54796 45333 33626 36270 18558 13355 30539 33985 42464
7735 42464 43005 37778 59741 57365 45464 32917 34662 32507 24017 22394 10114 28592 41128
7722 41128 60520 71246 50714 34794 -4543 -25428 -13165 31678 42980 53618 72022 47842
7710 47842 44357 25815 34525 57591 51620 40717 76063 67326 71288 77703 54310 17524 22415
7697 22415 58703 70015 38608 31702 36838 56599 57065 51980 47223 59330 63321 37372 44706
7684 44706 63862 51909 30116 34856 41704 69913 79961 68944 46354 36456 35253 32789 13983
7671 13983 12794 27799 36507 46754 36636 72709 46791 19647 15511 4229 32559 57579
7659 57579 53309 35581 21680 28195 45869 53107 25646 -7920 7052 29603 33794 42988 32443
7646 32443 43785 52618 75359 69204 71913 55937 36502 61249 57663 31990 52476 76620 75850
7633 75850 57141 57575 49821 30457 51026 47823 37731 41627 68011 61026 65321 76808 79764
7620 79764 62922 64416 41842 23715 19344 34884 31141 26978 32243 32077 38372 62465 76918
7607 76918 54810 47602 43992 41368 49664 66837 102905 88087 60551 54522 50137 46485 36000
7594 36000 27568 30010 38312 24734 17233 41805 40974 26862 -24393 -24903 28630 36083 46867 62388
7580 62388 36317 29193 3490 -29070 -21096 8420 10276 -291 2614 19421 23009 20055 6260
7567 6260 2088 -3017 -16411 -11072 -23556 5703 15538 28061 31019 35759 18932 31296 76441
7554 76441 89036 86009 73488 51889 8489 -13644 24220 49782 31576 17384 -1227 950
7542 950 20348 53519 67736 63635 30842 33818 44515 20966 43331 63326 71191 42044 9895
7529 9895 20250 28119 11662 30265 24282 19467 13704 9552 6209 31984 45463 50880 29904
7516 29904 23186 42631 70971 86315 74183 68741 57808 34694 42480 36946 45645 66834 85209
7503 85209 65726 35379 52266 37740 -14172 -23433 -9476 -3668 5052 -8589 -56656 -28591
7491 -28591 5782 34304 26844 11909 9858 -10080 -20606 9127 13782 4851 28027 59398 39702
7478 39702 29714 28935 24363 6389 14487 42439 53452 34220 35659 23130 39549 64247 47106
7465 47106 30166 15372 15991 20334 13422 -119 -5683 -22444 -15691 5659 9029 827 -3922 14219
7451 14219 23462 -7258 7724 54189 55180 41121 54178 50733 22504 16074 16527 29452 -690
7438 -690 -26204 -7863 26252 27843 18533 -16080 -24294 -10728 5459 5828 -6390 -4661 4559 -10334
7424 -10334 8709 13370 15131 19690 -20102 -36279 2898 18603 34476 38418 13480 15946 4474
7411 4474 7793 -9485 -24602 -30946 -23160 -4295 -19359 -26144 -861 8160 17390 19922 -6136
7398 -6136 -1997 1168 -3371 21232 45381 62496 41153 29654 38889 32076 -8576 3944 32235
7385 32235 6962 -24182 -11106 1989 -4793 19243 23560 27025 22464 10658 232 16149 36352
7372 36352 31862 14335 922 2639 1194 14746 15845 37551 26162 23559 31577 41399 41200 39142
7358 39142 37859 28452 15078 27060 36932 34557 28555 31576 29730 40985 48853 60324 46471
7345 46471 36004 36055 27086 25584 21962 35458 52821 45341 23421 6052 19839 40391 41370 44121
7331 44121 84842 78348 60946 51995 54173 49330 52580 66295 34168 15169 19510 23876 13269
7318 13269 7864 14761 -5325 9743 32967 3097 360 -19020 -13466 -8457 353 -5089 10762
7305 10762 23100 39109 53511 58684 34959 10632 20679 28852 27706 6877 -12940 -37300
7293 -37300 -38777 -13108 30476 66919 67419 55292 44949 60871 64587 44936 8391 -26312 -25255
7280 -25255 -910 31398 34677 3183 -2890 21698 24114 17109 6651 -1539 -6005 -16480 -25028
7267 -25028 -17850 930 -7260 13469 10887 6156 7960 1227 -34 26045 9534 -10910 1004
7254 1004 27334 47902 15328 200 -2352 39321 42738 35329 37661 48995 37250 37346 3618
7241 3618 -5412 6115 -2162 -15264 -12961 17530 49615 44296 16547 19126 41910 32710 8193
7228 8193 27490 15808 21208 -2884 -23117 -9143 14669 33918 30106 23571 18007 24084 22156
7215 22156 14426 28231 1732 -7736 14597 21476 31959 34495 12821 20824 40693 33452 32745
7202 32745 3033 -12403 -16859 -6440 1079 27498 20279 12141 20712 10721 2635 16038 8555
7189 8555 -22758 -26926 11458 15446 11768 -1407 7808 12760 27472 38953 23545 11498 -3808
7176 -3808 -8540 11140 21132 -4473 -31240 -42987 -19343 -9361 -168 13354 24064 9091 15693
7163 15693 27997 49347 60700 61577 41837 35525 22523 19560 5147 -5689 3896 18905 3968
7150 3968 2461 -1271 -523 -6782 12810 52829 55477 41588 47896 37495 10267 -6172 -42584
7137 -42584 -51761 -61767 -52788 -56213 -39739 -25639 -15583 -20375 916 34597 12546 -2943 19255
7124 19255 35668 31179 22552 7315 -96 6221 17016 41019 22253 19179 18158 -21393 -28447
7111 -28447 5690 20935 13166 5718 1445 -2120 2306 11073 -1304 -6576 984 12502 -13189
7098 -13189 -26262 -25971 589 1930 -22047 -25271 -12711 -14040 -20999 -14306 4520 4014 -15923 -18712
7084 -18712 -23046 -16190 3605 9155 -6674 -1537 -13651 -24137 17160 34729 22726 33721 48442
7071 48442 49881 17817 -15550 -13018 7562 -4971 -17356 6789 27486 49824 21160 27628
7059 27628 49311 44370 46779 25576 18070 29786 -181 -5576 -4141 -6309 -8404 12781 30726
7046 30726 26099 27185 3061 1544 33586 35275 21877 9811 8710 43109 27841 2832 -14181
7033 -14181 -21802 -6619 30895 79091 53121 35274 -1772 -17142 -19671 -21654 399 12593
7021 12593 22086 35304 39147 43093 39461 26048 2584 -7873 14224 29976 29009 29215 13651
7008 13651 -15226 -12142 10767 21993 -3108 -25827 -11151 -3021 -15196 -24512 -26508 -29559 -14175
6995 -14175 10287 24486 30874 43906 33888 14804 42607 23280 1317 -18122 -20353 -3574
6983 -3574 26019 53631 50390 30980 2977 -3705 40065 56217 32331 52981 64007 56471 53664
6970 53664 69714 72374 84663 84924 48849 20215 2282 12583 17235 2377 1872 15896 11074
6957 11074 23715 25156 2228 23216 50809 45837 22498 11884 22140 19232 15948 3599 5759
6944 5759 23625 10181 -32135 -28089 -13428 2756 -26244 -32382 -2919 5113 9037 404 -18930
6931 -18930 -9773 1957 -11153 -9183 -43159 -49424 -35462 -29660 -24856 -41417 -8944 9315 16526
6918 16526 12376 33860 42389 39198 45424 55829 37959 18660 14718 21562 -21963 -14613 -4319
6905 -4319 -1472 10289 -7005 -19280 13283 29049 37384 35573 28522 -14173 -23780 -34236 -16410
6892 -16410 1818 21009 24794 34007 30093 19919 -1694 -9934 11869 34683 31069 36223 40415
6879 40415 43594 39544 30942 16666 8775 3895 -26017 -56530 -41580 41059 71356 59737 38376
6866 38376 19324 17914 4380 660 -257 -184 5085 -3440 -10736 17231 49466 31505 -964 -15097
6852 -15097 -28052 -29568 -22262 -29240 -43261 -31311 6383 9109 -29418 -44064 -50184 -61695 -66947
6839 -66947 -66872 -42964 -28789 -31604 -12738 10179 6171 -3186 -6621 409 -4520 -16383 -5261 8072
6825 8072 22860 -1808 -26487 1952 28738 5272 16330 -2787 -1946 9005 7926 -18819 -7998
6812 -7998 2873 -29977 -15632 -2266 -25602 -27349 -35981 -9042 6526 2243 -8054 -8723 -5305
6799 -5305 -16276 -16431 -3051 2641 30396 30265 22634 22462 15593 10797 11569 16892 -17703 -33916 -13003
6784 -13003 3237 -5258 -4535 628 -8776 -15211 2634 -8358 -19003 -3640 -2805 -3797 -11456 -18352
6770 -18352 -24521 -33778 -39237 -20479 2161 -8818 -18975 26124 42769 26679 30798 42126 21437
6757 21437 7542 -8728 3229 10149 -6918 -15334 -3809 -2828 -20707 -42912 -57163 -49070 -6936
6744 -6936 3765 8740 4319 -10357 354 14037 29852 50341 30796 -6108 -3964 1263 -7582
6731 -7582 -21854 8162 32454 25090 5592 6857 9570 -28640 -26607 -23777 -9582 -5526 -557
6718 -557 1965 15713 5893 24330 36944 31908 13291 3186 5908 22162 23997 6875 -21790
6705 -21790 -44846 -27617 -21953 -47371 -30847 -26544 -9308 -352 23752 37223 34896 31417 24254
6692 24254 12716 -12532 -29112 -29561 -48728 -34826 -35813 -31189 -58033 -60439 -30997 -221 12409
6679 12409 19997 31169 3989 -5949 -33777 -47913 -53461 -37594 -30388 -12015 -14743 -31567 -21252
6666 -21252 -31534 -12202 9740 29939 36537 14661 -30700 1331 -10940 -16643 -18076 -839
6654 -839 571 -22047 -22262 -34449 -7469 -23394 -17230 -5738 4208 -18501 -32644 -14332 8875
6641 8875 -10728 -9850 -17862 242 -469 1321 15171 15152 13796 -13702 7610 34650 16654 10396
6627 10396 -4358 -24969 -26722 -13409 -14965 -25085 -16721 10618 2650 -989 -19021 -37229 -15386
6614 -15386 -9066 -16905 7482 1590 15228 4070 -6545 -15034 -29605 -19145 -18142 -20466 -8339
6601 -8339 -3136 -4314 18245 -529 -20868 -29002 -21256 -31743 -8474 -234 28186 37938 34999
6588 34999 12182 -3758 24014 20382 9015 -21466 -28446 -4907 -5398 -7744 -21062 -10218 -28021
6575 -28021 -31066 -15497 12592 7135 -10513 -43756 -42028 -24932 -26308 -33265 -29960 -19440 -31917
6562 -31917 -5374 -911 -609 -1610 -8661 -14982 -38699 -47457 -52768 -54384 -53632 -53928 -35830 400
6548 400 41864 53320 36672 39523 32351 13776 -3878 -194 6558 1970 -88 15782 7559 9420
6534 9420 -1023 2049 -3771 -2663 11502 -24464 -22619 -6701 -18407 -45484 -18695 11089 28531
6521 28531 38577 27413 30247 26854 40766 48252 53742 42754 32768 6862 9702 26987 10059
6508 10059 616 -3853 3111 6291 24199 24749 8634 40195 53135 22044 -30832 -35591 -23012
6495 -23012 4540 41235 24063 10354 29900 41573 40792 28578 40933 42262 19411 -4324
6483 -4324 -23571 -33701 -61123 -44591 -21173 13567 27228 35166 49917 65230 70426 51882
6471 51882 53797 37590 2117 10728 -10729 -19756 -14897 -27608 -7263 -2189 -18613 -27377 -3608
6458 -3608 -20227 -1682 4630 -1717 -15347 -16278 10025 19106 2890 -6276 -3487 -25116 -35341
6445 -35341 -20358 455 30208 16866 5959 3516 -12207 18344 4856 9775 20400 26889
6433 26889 10359 -1959 8369 -20402 -51102 -45545 -15082 -4385 -52880 -52629 -36946 -18285
6421 -18285 -18229 -30182 -30168 -58110 -37636 2487 3621 -24557 -41056 -54432 -18976 -3052 -10641
6408 -10641 -9571 4006 19980 20809 12902 18356 42790 23715 15164 14584 7017 -22482 -29465 -15159
6394 -15159 -7529 -8510 5054 18090 31762 55532 67356 69361 26367 20100 25699 32274 27702
6381 27702 25433 -4765 -23237 -35087 -45064 -11837 -9161 -41278 -63750 -33316 -20620 -32234
6369 -32234 -30421 -51710 -52622 -57134 -58395 -34775 -32690 -15602 -13816 -22845 -46440 -71586 -92325
6356 -92325 -73497 -80199 -62928 -36865 -20578 -9292 -37988 -29113 -33130 -54117 -54229 -66192 -61087
6343 -61087 -29578 -2114 11339 -3086 7816 18896 13354 1393 20172 45389 46924 41016
6331 41016 18008 2521 -17132 -52204 -62520 -49925 -38864 -50290 -42235 -11922 -49200 -93460
6319 -93460 -115642 -98020 -45622 -19032 22901 13395 13462 16765 2363 -12297 -14959 -28340 -10954
6306 -10954 19364 29414 14032 -2580 -2772 -6441 -56718 -46045 -14984 -29277 -26087 -30170 -44610
6293 -44610 -54972 -29229 -1695 42149 65426 68136 63489 61895 33630 22838 36342 32812 -1327
6280 -1327 -21832 3426 -11929 -31946 -52705 -48126 -44213 -5787 -873 -17954 14102 38030 22867
6267 22867 29560 25856 24209 20431 16521 22645 46816 54420 22559 13058 9629 11753 -4448 -14297
6253 -14297 13453 11230 13539 -7323 -5557 -17375 1945 -5046 -20057 -60024 -80476 -74308 -24126
6240 -24126 -27019 -36933 -43019 -29092 -8381 2973 -11315 -11402 11008 36122 19647 4065 -22609
6227 -22609 -28241 -4387 90 -7227 2925 11680 21748 38140 44925 30841 -12317 -44771 -54502
6214 -54502 -61199 -49145 -45974 -34226 -6905 15653 29439 15394 24727 42947 39054 24271 27920
6201 27920 33464 36909 29171 17629 -1764 -12247 4256 12036 -6533 -41664 -62576 -49467 -30850
6188 -30850 -5660 9404 7319 -20374 -26848 -15105 -34945 -47700 -43458 -23763 -8589 16865
6176 16865 43547 50793 40382 40879 37152 41313 43280 34455 51 -15727 -26487 -10909 -2204
6163 -2204 -20594 -11217 -14855 2034 -1583 -9403 6006 3557 7941 4928 389 3458 34337 63317
6149 63317 55413 7971 -18220 -13105 895 9220 -10611 -27973 -31398 -22829 -1190 6458 -17556
6136 -17556 -4054 9661 3077 5569 22758 34337 18147 -21850 -21240 -13186 3924 -4302 4620
6123 4620 876 -2873 9639 13645 5075 -5667 -37914 -54387 -59741 -51899 -65554 -77965 -59413
6110 -59413 -35721 -17518 -7031 -18215 -22404 -2276 -4308 -15306 -23647 -34821 -29089 -10364 -30519
6097 -30519 -26781 2304 1679 -11484 -12362 9352 15479 -12405 -16439 40 2364 10652 4477 -3342
6083 -3342 -24398 -50644 -57072 -50658 -29778 -17389 -17886 -42187 -50341 -36831 -23652 -3932 -29745
6070 -29745 -65264 -59679 -27871 -19149 -22393 -42454 -23254 -21842 -28700 -8274 7991 -25022 -43567
6057 -43567 -53348 -20005 11684 1346 -2780 35364 35726 32203 12721 -10321 5006 36842 22154
6044 22154 -5298 -17031 -6302 -8053 -13302 -12480 -22653 -6979 -7103 -16150 -25868 -16768 -9476 -22151
6030 -22151 -20830 766 -7485 -10763 -5164 11729 -8942 1153 12848 -1531 -45483 -44320 -24680
6017 -24680 -39921 -68210 -60097 -64272 -69794 -47205 -23236 -28821 -41376 -78269 -62168 -14337 -2206
6004 -2206 -312 1349 -11279 -7309 -710 7263 -4937 -27742 -6928 5323 21167 35632 38239
5991 38239 33702 20458 4297 23944 26682 26888 26138 24136 13459 5260 20688 16407 -14572 9566
5977 9566 35075 29262 19254 605 -7127 4350 3211 -24602 -23369 -1319 15336 31313 38532
5964 38532 35937 14822 2906 24423 5301 -18666 -21413 -45513 -26045 88 270 1581 -3288
5951 -3288 40414 35144 -4503 -1839 -7126 -4427 -23096 -22752 -30849 -34489 -22866 -36671 -46160 -19359
5937 -19359 1424 27173 26710 23078 38540 30144 -7022 -9097 10879 15041 18597 -1785 -36351
5924 -36351 -66491 -23583 10913 10661 -16624 -31306 -14759 -18211 -9586 -7557 -27007 -37094 -33029
5911 -33029 -13868 4117 4332 4072 -4480 1900 19734 10402 1306 -7768 6556 18330 4955 -7857
5897 -7857 -699 34782 32255 24183 25996 35679 28492 24657 15595 8433 18098 44530 65221 64694
5883 64694 59752 38441 19995 20772 -3106 -18044 -24223 7745 15194 10083 -15847 -30073 -15560
5870 -15560 -737 17522 23696 22083 3711 -11042 -23800 -57563 -59746 -33776 -4351 -5042 1195
5857 1195 25495 23541 27585 30571 26592 21098 22599 -27067 -49478 -25626 -15104 -7550 -30200
5844 -30200 -32527 -25434 -21647 -20200 -21846 16596 12921 9078 2225 -9421 -7890 -5765 -14217 -16429
5830 -16429 -30904 -42330 -5515 10882 -7212 5997 557 16994 13853 16948 18297 22563 30136
5817 30136 40249 27095 19583 13754 30946 28947 -3875 -4377 -2173 3038 10457 -16247 -14809 6019
5803 6019 4160 15920 38351 -2317 -38675 -17945 6200 29437 35241 30713 17383 23218 26304
5790 26304 -434 3735 28460 45977 40559 25178 39013 24439 -7365 -10707 -15698 -1133 3003
5777 3003 15746 29933 30072 14502 12935 15721 -21061 -22473 6480 13990 5421 -12735 -21579 -32271
5763 -32271 -23162 -3364 18704 27773 26278 3388 -4016 -9030 4961 8796 8008 13164 45617 43798
5749 43798 9899 -18726 -21755 -19079 -14060 -1996 22504 35926 23271 5091 -5327 10189
5737 10189 -5979 -19805 -15621 3217 4869 8922 -9414 -39762 -49344 -53678 -23461 -12996 -20876
5724 -20876 37 14139 18975 60201 58411 41950 30646 36711 21575 -18722 -24313 562 -15322
5711 -15322 -38173 -41450 -40705 -36311 -19721 -12144 -17361 9888 -4395 -7044 -1823 -3579 5409 -6791
5697 -6791 -35734 -5434 14713 32248 -4715 -22048 -1671 7412 5336 -1784 -12455 -27940 -27822
5684 -27822 6944 -7844 -6813 931 1050 8722 18452 47317 33992 38617 38752 -2441 -14354 2739
5670 2739 -3289 -13324 -15376 -26191 -41598 -44237 -41801 -24874 -33674 -27104 -46111 -40167 -19797
5657 -19797 -15535 -24469 -28384 -26299 -26778 -8189 -13830 1699 28158 13040 17061 23967 34551 26965
5643 26965 36568 32185 29328 12550 -14955 -12625 -22343 -22819 -4827 -7219 -1325 22131 22771 1906
5629 1906 -14835 -8205 -34139 -38248 -28961 -32282 -30334 -34155 -30555 -17902 -31278 -62005 -80890
5616 -80890 -55676 -9241 -16865 -52796 -22103 8563 -7252 -21944 -36266 -35970 340 36276
5604 36276 -2576 -42817 -57311 -52422 -24125 -21476 -24190 -24195 -16362 9276 9736 18592 12874 11191
5590 11191 -80 30 19779 24549 24517 1644 -19978 -19872 -23289 -65950 -52971 -31927 -42347 -2005
5576 -2005 7025 110 -27384 -57887 -37360 -16279 -20712 -30944 -29035 1660 16495 17354 -4446
5563 -4446 -17432 -19071 -132 17535 22671 8315 -1693 11380 14509 3269 30950 17879 -10658
5550 -10658 8414 13482 18418 29113 23408 21551 -9018 -24085 -21433 -6755 -589 -8800 1869
5537 1869 1033 10985 11536 -11546 -19410 -4854 17607 14595 1670 11883 4605 2968 11408 16006
5523 16006 -11484 -10853 -23913 -23960 -26719 -26790 -19401 -16748 -2344 29895 31466 15648 35729 35131 31188
5508 31188 15839 17286 43436 71054 84902 74443 29483 7216 15467 40457 26777 26016 12643
5495 12643 -27976 -39842 -36887 -40868 -34194 -11148 14752 4174 3167 6827 16714 37478 34039
5482 34039 12099 649 -8858 353 -4931 -19502 2097 8671 3724 -4241 -14895 -1193 -8044
5469 -8044 -23607 -1249 25872 18497 -11200 -33337 -40671 -12716 6644 -10402 -34628 -45682
5457 -45682 -55587 -33374 5614 27816 44177 60160 47241 33184 31512 19980 18730 6928
5445 6928 17178 11985 28324 38242 13679 -18504 -25789 -22271 -24338 -47256 -60119 -30581 -31179
5432 -31179 -35292 -33362 -38367 2668 4855 -14521 -16691 -19092 -37843 -42167 -39815 -50362 -13859
5419 -13859 -20989 -32714 -22944 -19216 -31425 -27042 -26900 -15802 2692 9159 -15296 -5209 12179
5406 12179 16051 -5084 -9445 4305 12692 20614 -4233 5669 3372 18004 -18238 -34023 -15524
5393 -15524 8330 8224 21076 21066 28537 22325 913 2460 -2882 -17234 -21543 -14873 -17055 -19455
5379 -19455 -17060 -14660 5221 -4987 -17574 -9711 -35133 -25036 -2794 22340 28793 9927 11171
5366 11171 34875 37201 22290 28469 50310 27112 -9634 -8234 -9784 -8338 -1603 -9741 -41987
5353 -41987 -42218 -50848 -32805 -2929 5359 15525 1431 6477 2920 -16927 -5837 -16723 -21390
5340 -21390 -28781 -23774 10830 9751 -7044 -23590 -22289 -50272 -30179 -10928 -16192 -12329 -7166
5327 -7166 -22312 -46341 -74487 -53469 -29467 -30536 -14447 -19333 -29117 -21236 10985 27185 32781
5314 32781 2378 -2992 12946 15381 1755 -8743 -18372 -21317 -9247 2141 14700 19420 13859
5301 13859 -27842 -43915 -22253 9835 30785 23104 7414 3076 19149 14258 3207 -11564
5289 -11564 -15669 -23156 -17004 -8418 -33875 -23989 -16644 -24660 -22479 -9956 -21922 -28284 -12549 1324
5275 1324 -26826 -33491 -24091 -2406 19757 31002 13695 -8634 -23025 -5722 27276 42500
5263 42500 -21299 -42627 -18548 1786 14281 23273 -6855 -10003 -23786 -12624 5856 19817
5251 19817 11858 8475 12219 24307 29403 2093 13426 22947 30387 47457 40331 16432 -539
5238 -539 2955 35204 43903 25883 -5734 -3921 5641 20307 20092 9087 -12254 -33872 -21188
5225 -21188 -29026 -23494 4381 10518 8828 8110 4299 11648 16364 29039 29607 11469 -22191 -39857
5211 -39857 -44696 -35104 -12450 12552 31866 20841 43358 54570 36250 -6900 1469 22154
5199 22154 18077 21185 530 -18263 -36120 -26937 -5247 9791 23567 -2749 6150 12900 -1268
5186 -1268 -3170 7947 -7565 11110 30848 31502 -11370 -13775 16938 17028 15498 33224 44892 28262
5172 28262 -2208 -19577 -34852 -51143 -24374 17517 11889 29021 30525 11245 -13879 -37724
5160 -37724 -19305 -7216 -9040 -7441 -14947 -10397 -11267 -20514 -11598 2563 10004 16436 11198 12654
5146 12654 -11884 -13364 10973 3654 -10172 -16624 -33075 -44196 -58297 -49676 -55883 -37538 3462
5133 3462 2201 -28474 -36117 -27053 4054 -1577 624 -15323 -21943 -36 -4606 -20426 -33110
5120 -33110 -15544 -16416 -44711 -51282 -13993 -14408 -25706 -26609 -15692 -37568 -28287 -11792 -3417 4061
5106 4061 17531 2320 -768 14616 39733 40138 22397 4064 -28988 -27100 4689 21313 6053
5093 6053 6934 27748 25160 5152 23740 20223 18905 4937 -22345 4540 28838 26401 17368
5080 17368 28626 34231 8300 -4886 7120 534 -23791 -10830 17627 34226 16323 -2477
5068 -2477 584 -208 -7983 -10054 1533 4313 -14819 -23788 -13555 -901 -10127 -28108 -58207 -62729
5054 -62729 -64774 -59459 -15361 -11492 -21295 -15936 -27664 -22922 -17969 4184 13507 9750 17375 2338
5040 2338 -19357 -16465 -14955 -747 -21315 -21581 -17038 -8348 -7824 -9338 -20529 -11474 -6811 -25452
5026 -25452 -26788 -20850 -9823 -13989 14559 27697 31423 5784 -25546 -29768 -6288 -4768 -7912
5013 -7912 -22073 -53750 -49227 -32301 -31749 -14772 19470 40253 8718 -54217 -35547 -18457 1244
5000 1244 20540 5374 1212 14740 -1432 8978 17259 15397 11138 -2287 -28757 -34740 -25012
4987 -25012 -20013 -17160 4498 11922 -15083 -20264 -4478 1125 -298 -25965 -46256 -53132 -51831
4974 -51831 -47227 -32144 -11378 -10985 -10714 -9525 -26697 -18126 8757 25887 34944 56709 33986
4961 33986 -13353 -8252 -10307 -18282 -11966 -6211 -6540 -9900 -39597 -57084 -22197 4414 -3062 -33537
4947 -33537 -21790 5432 4305 -37133 -23421 -2413 -4056 -16337 -20300 -21229 -17162 4210 5830
4934 5830 16464 43140 37234 36643 14823 -4401 18885 50198 42050 45203 41603 31513 12547
4921 12547 -4413 -18448 -25918 -9363 -21249 -29919 -24475 -25080 -32057 -38149 -15030 14950 21571
4908 21571 2175 -8246 -39999 -38020 -36042 -46281 -19778 -17715 -21376 -36489 -30634 -18730 -4414
4895 -4414 -19485 -11680 11474 19181 13413 17564 -3942 -23653 -26800 -37424 -8209 -15068 -30428
4882 -30428 -18892 -9364 -1296 9715 10667 16876 20091 13591 10137 -4900 -31866 -29420 -879 27132
4868 27132 33907 30584 19752 -828 -44288 -49418 -40730 -12135 -2816 -15641 -1344 16605 4984
4855 4984 -10720 -27522 -34737 -9722 15671 10166 -509 -13089 -40068 -46025 -20397 8253 6830
4842 6830 -13770 -28142 -30934 -35749 -24720 -23874 -35914 -34145 -4641 13583 6685 -10420 7813
4829 7813 10103 23392 50827 28324 16222 3536 12361 53115 19580 2157 -4561 -5925 4419
4816 4419 -22227 -45777 -61691 -61427 -21976 -15016 -30144 -15354 21613 44900 44746 35519 9987
4803 9987 -5404 -3713 -7916 -22720 -8885 -12850 -16902 -34281 -10820 3504 -14253 -32819 -23459
4790 -23459 -14168 -9002 -973 21073 15023 11773 11523 -8050 -14851 -4623 28219 10748 -1475
4777 -1475 -13491 -34567 -30291 -21502 -28027 1130 2906 -25144 -40483 -32806 -26317 -13041 -2714
4764 -2714 -35132 -48652 -44212 -46711 -47668 -27562 -27071 -53137 -17916 -1058 -31305 -59228 -66475
4751 -66475 -77062 -71687 -35594 -16093 -16015 -24299 -21580 -10607 -14091 -16391 -52202 -70092 -42788
4738 -42788 -9353 -23694 -13389 17609 19055 -14641 -16506 18637 21071 16105 -3990 16033 19854
4725 19854 28769 32081 25865 34073 27759 16356 -19941 -32718 -51539 -57069 -52042 -43413 -16933
4712 -16933 16842 15170 4527 13277 5884 15440 4972 -11592 -36811 -40710 -4694 17614 5567
4699 5567 -16194 -22199 -4990 8112 -4846 3478 -15217 -19504 -18469 -21479 -24176 -30216 -45694
4686 -45694 -14522 13646 -351 -24474 -41052 -58509 -66443 -72423 -79804 -65624 -29311 -20547 -32843
4673 -32843 -6743 11662 30912 8472 2605 -23222 -69035 -78401 -38655 -12392 5412 25710
4661 25710 24537 25708 33213 12568 -16134 -45824 -17410 932 6379 -1743 -37821 -53920 -29108
4648 -29108 -8069 3965 -11134 -19160 -13756 20476 6103 -14165 -19940 -17810 -31065 -31398 -20479
4635 -20479 -5607 14915 -929 -14108 -29703 -50895 -63350 -51034 -48682 -45104 -46227 -30391
4623 -30391 -40789 -30186 -10091 -18155 -33376 -16656 -25100 -38654 -26391 -2334 801 16136
4611 16136 30812 60853 54775 13696 17171 26798 23165 -12901 -9635 29279 21356 -12316 -33805
4598 -33805 -24876 22187 33819 -34820 -32401 -7144 7188 -1901 -27501 -23680 -43875 -19607 4048
4585 4048 1715 -2468 995 -9786 -9615 3312 -7679 -17666 -22990 -17054 6604 -6932 -15380 13793
4571 13793 28838 27036 -14316 -28888 -5251 -3206 7746 26174 22361 35253 44936 37685 28219
4558 28219 21849 -5877 -23529 -16503 -26283 -22455 5281 24981 -3792 -19077 -37887 -19827 10500
4545 10500 40492 10531 -5820 -8668 -37574 -22757 321 -1085 -10630 -31511 -12087 -18385 -40017
4532 -40017 -14790 9753 23182 42379 50213 34193 21888 7999 -7288 -6890 5583 30632
4520 30632 36438 32112 35800 29774 21616 28531 37875 38794 34842 16582 19040 -20410 -29430 -55160
4506 -55160 -55987 -40567 -16320 -20904 1681 30435 38987 6044 -33984 -41803 -29316 732 18131
4493 18131 -35 22460 26325 56122 41310 15711 43605 47812 19908 7021 -1286 28028
4481 28028 46422 35180 13941 -11562 -11287 23414 29114 25352 22507 21002 25832 10348 -22444
4468 -22444 -25897 4509 26426 15033 -3631 -4474 -1541 -27740 -26588 -28824 -37065 -45423 -50892 -47298
4454 -47298 -22933 -6187 12436 8643 -17281 -37577 -18050 -10378 3209 -23870 -28174 -26128 739
4441 739 24230 54691 31403 26581 3579 -19917 -11944 15462 40959 44931 44884 39457 11164 -19628
4427 -19628 -21906 -19502 6378 10508 14949 -5572 -27126 -21869 -37053 -15035 -627 2179 -5663
4414 -5663 -41203 -6540 12771 569 7674 -5878 -2483 23365 13039 -21401 -5676 -3410 -16448
4401 -16448 -5962 -563 -8777 10902 34792 19915 -660 -6853 2262 9272 -8259 -36515 -12630
4388 -12630 -1504 2139 26858 28093 20583 16896 -3523 -19146 -37269 -70621 -62769 -53282 -44641
4375 -44641 -26648 -36149 -39843 -23011 -25799 -5476 19832 19352 12011 5004 -1734 4360 10286 -646
4361 -646 12460 24808 6832 18029 18418 -2153 -36856 -22660 -19133 -24414 -20823 -4326 3136
4348 3136 32761 39149 8566 5472 -9685 -6112 1525 13600 524 -1647 16160 24397 24698 13739
4334 13739 26308 22515 18459 37235 10152 -6715 12549 16918 -4274 -22615 -31696 -36575 -19723
4321 -19723 10940 10384 6106 22295 36333 38391 -3021 -22414 -3471 9253 1613 -12336 -12129
4308 -12129 -9951 -5404 5049 5900 -987 -14199 -26917 -33416 -33025 -6867 10104 -7015 8195
4295 8195 -2334 -9113 -2884 18291 45004 17444 -8963 11334 -14656 -16938 -7896 -10315 -9041
4282 -9041 -14531 -9413 11917 -2180 6757 32631 28132 -14910 -15536 -5772 -10727 -18906 -11178 345
4268 345 165 515 7146 5459 -14436 -10102 1459 25819 29967 19789 36531 64910 48541 24620
4254 24620 24852 22925 19031 1527 -12360 -747 -6121 16427 3192 -6626 -1923 -4576 -26174
4241 -26174 -19283 -19782 -27903 -28692 -34025 -15571 -30719 -20237 -25898 -13577 -4343 19579 16408 9568
4227 9568 15974 39056 17327 -39008 -56106 -29803 -25112 -29965 -10720 -9163 -5079 -10431 -18976
4214 -18976 -35751 -38166 -3437 7710 -30291 -51318 -38513 -34261 -22149 -15167 -25812 -33029 -34246
4201 -34246 -18206 8823 -10543 -26996 -28554 1342 5489 -8484 -15325 3647 7445 13150 37376
4188 37376 42106 14155 -1338 7393 31618 36138 8340 11971 43177 47317 27378 20256 11854
4175 11854 2805 -8419 -30948 -39634 -26028 -33883 -31043 -23462 -18622 16469 22393 -3614 -23991
4162 -23991 -35638 -47092 -45143 -63241 -72445 -76210 -70303 -42360 -34187 -47791 -50341 -64512 -43468
4149 -43468 -7591 20375 1716 -1042 34393 41206 14642 -697 3279 -4043 -22466 -39247 -53946
4136 -53946 -16463 -22216 -23360 19758 9525 21222 20645 -6513 -43531 -18221 -9480 -31284 -6628
4123 -6628 -3215 -25519 -19557 -22566 -24815 -11276 -28127 -22924 -9723 -10435 -12759 -23331 -38842 -30204
4109 -30204 -1978 1218 -8209 -15159 -18713 -29299 -24408 -21135 -35746 -31852 -28040 12082 31182
4096 31182 38912 15874 5138 -11985 -5313 -23028 6561 14439 5629 -5130 -13642 -32188 -65897
4083 -65897 -47493 -29563 -17994 -24583 -42395 -23545 -11217 -9448 -3373 -17486 -21872 -15891 -30730
4070 -30730 -41899 -68065 -71531 -53904 -30744 -14233 -21305 -2933 -19611 -21005 -15040 -17746 -15723
4057 -15723 -31204 -34750 -27648 6701 -3281 6810 30013 39402 26991 3894 -17542 -4756 15071
4044 15071 11190 13666 -5033 7339 17141 7323 11365 41431 48723 60452 73289 45270 10567
4031 10567 -20983 -32495 -36478 -35275 -19636 -41440 -30957 -2540 -9482 -16332 -38622 -17319 22739
4018 22739 28542 -7210 -37647 -37265 -31549 -26573 -37037 -29679 -29293 -8119 -11762 19904 23696 21690
4004 21690 26226 37763 31001 37849 50834 35899 12445 7695 -13304 -13504 11350 14776 9472
3991 9472 -5802 -15174 -6950 16938 27967 25966 41443 50912 34042 -3109 -1748 9277 -16414
3978 -16414 -29723 -36916 -28036 6754 31621 2133 -28028 -14004 -12464 8256 8772 3824 -27770
3965 -27770 -50276 -66708 -57677 -19973 -41068 -40596 -24866 -26102 -10359 -9673 -20986 -15515 -31650
3952 -31650 -35664 -21512 12314 25690 31756 26698 1169 -8503 -24234 -53264 -66286 -44101 -23250
3939 -23250 -16860 -35251 -64722 -66275 -17300 15606 33816 18715 -23714 -35967 -17316 10257
3927 10257 -9825 -28696 -52417 -47595 -29581 -23749 -6608 5034 6513 15758 21585 -5641 -3590
3914 -3590 -14355 -19471 -11629 -17678 -1376 4397 8799 -13326 -20107 -20734 -53329 -51559 -43713 -24400
3900 -24400 -38962 -36475 -8768 16799 -2285 5428 -27876 -40418 -17169 6697 27368 18350
3888 18350 -20680 -37723 -34545 1048 27168 42841 23216 -8606 -36735 -36995 -41037 -23743 16816
3875 16816 35276 36975 20841 -3114 -23913 -19724 -10303 -17842 325 5030 6901 -9219 -4842
3862 -4842 354 -5947 -11 -1049 -9478 -6176 -12742 -6679 -14798 -18101 -10987 -18710 -18096 -30601 -50333
3847 -50333 -40091 -13054 3858 24144 24102 22763 -4799 -4486 2092 -14524 -33457 -57480 -31258
3834 -31258 -14691 -14169 -37269 -60729 -45941 -24260 -13346 15638 5869 -21195 -37898 -61252
3822 -61252 -47302 -21349 -24869 -21747 -13826 -12230 2864 -5471 -55023 -40949 -23320 -3527 -1472
3809 -1472 -18664 -34633 -18926 -2390 -15521 -19614 -3959 -14200 -30164 -36774 -24361 -25738 -27416
3796 -27416 -14442 8602 10234 -3794 -19104 -25991 -30330 -14699 -3311 -3721 11188 19297 19991
3783 19991 -9903 -45255 -34863 -24340 -5129 -2383 -4789 -12016 -34158 1518 -9864 -556 -3237
3770 -3237 -25676 -39767 -58907 -75797 -56390 -32212 -16161 -9449 -29749 -44118 -52402 -53999 -57760
3757 -57760 -63941 -50033 -29619 -11061 -25476 -33715 -37714 -16591 -2982 -13510 -15380 -10575 6096
3744 6096 2110 15764 43040 56541 26016 3713 6479 1672 3039 1972 -488 25419 20952
3731 20952 22 10597 34925 18179 -17732 -40068 -45935 -40250 -7208 17600 37601 45039
3719 45039 30271 47527 55592 48737 10235 -2870 -7958 -38990 -59849 -66385 -57634 -24909 -3630
3706 -3630 -20074 -34563 -28002 -19924 -19317 -5860 3474 5166 1130 539 16140 28705 9643 19273
3692 19273 6994 4650 -7621 -18205 -28446 -2767 11313 4420 -28381 -43313 -27602 -22433
3680 -22433 8034 25522 1738 15490 37020 15157 -25148 -42168 -19998 -547 1061 -9047
3668 -9047 -24734 -3390 -22490 -4129 16116 17086 -4725 -12788 2791 9299 10995 2953 -6404
3655 -6404 -9610 490 -13399 -3093 -18430 -26294 15026 47826 57353 30481 20112 30168 20207
3642 20207 25659 15225 -606 16356 -3660 -16771 16003 33389 51854 77278 58835 39323
3630 39323 51014 50267 44466 59185 15260 -13074 -25757 -4443 18900 32655 30545 30312 35737
3617 35737 28923 11134 -1844 -16557 -11442 -21310 -19108 -26701 -18916 -26051 -21148 -23943 -5510 -5558
3603 -5558 -23830 -24551 -11788 12259 12877 26460 6951 -10096 19055 19299 15265 6287 -23474 -39165
3589 -39165 -34474 -18252 12266 20993 29299 23188 11367 5317 -13162 -20472 -29757 -9843 -13485
3576 -13485 -32308 -26443 -19010 4282 -9738 -143 -258 -4157 -3925 2200 4107 2897 1270 -37824
3562 -37824 -61043 -51086 -10815 4992 -14711 -45582 -36596 -16304 4119 10482 -28700 -14949
3550 -14949 16416 17085 15910 -2329 -7276 241 8662 -6034 -11531 -4237 16202 33498 10877
3537 10877 -801 -7029 -33329 -15625 6057 11152 27359 -3493 -28411 -15566 5057 21798
3525 21798 27607 28594 42590 6315 -7799 -3428 -2088 -28007 -17975 -19194 -23344 -29189 -31962 -43301
3511 -43301 -43510 -13271 -1824 -9460 -22442 -23151 -19243 -36471 -43812 -60914 -38081 5659 -14757
3498 -14757 -41316 -42816 -58060 -49093 -52350 -47168 -26626 -22646 -9878 -2766 4247 -13032 -37158
3485 -37158 -53056 -50847 -38852 -29537 -19627 -13006 -21477 -11520 -26361 -46689 -30445 -30490 -15004 -10075
3471 -10075 -7959 6757 -5980 -25010 -32913 -19870 -25380 -35613 -27449 14370 6417 -8123 -3949
3458 -3949 908 -7797 -24328 -23729 13610 38026 12840 -16614 -9169 23437 13443 -9014 5314
3445 5314 11074 117 -2567 -10921 -22969 -35865 -21425 -5960 -4867 8980 -1343 -12363 -1211
3432 -1211 -9508 -11699 16405 26976 10888 -16221 -11557 -18624 -19480 -1786 -934 -13641 4329 18166
3418 18166 33587 29177 -5300 -3578 -10970 -16472 -6235 -19413 -15428 -20664 -11323 -10748 -18873 -36077
3404 -36077 -27367 700 -9571 -1309 -9954 -22879 7526 3676 3705 33604 57220 59130 43560
3391 43560 31283 32429 44291 31315 -3427 -11251 -8578 2114 1949 -2258 -6443 -9171 1560
3378 1560 -33213 -58462 -35891 -36513 -15269 11811 34602 12641 -8189 -37649 -38116 -6228 4015
3365 4015 368 -4450 -9890 -9674 -40183 -41386 -20158 -38568 -50176 -28197 -19449 10300 -3233
3352 -3233 -29514 -6416 16193 47725 9826 -35157 -29089 -39783 -35469 -29101 -23242 -43260 -51709
3339 -51709 -55712 -45621 -25703 -37910 -33388 4287 14092 11261 -12728 -21117 -24958 -19186 -29503
3326 -29503 -25455 -10250 15550 6625 -18837 -11867 3603 -6224 2446 25042 19587 16039 22635
3313 22635 7865 5632 -6332 -22612 -17193 -25166 -36149 -7407 4666 1380 18456 34105 20951
3300 20951 268 -12670 -3183 12695 26628 11410 6001 15026 14411 28909 10495 -13512 -30819
3287 -30819 -33702 -13437 1916 10977 1060 13790 15263 5178 8784 -5385 -12110 -28526 -24344
3274 -24344 5742 -1745 -18211 -32855 -27057 -9488 -12789 -55 10597 13472 22321 40693 10596
3261 10596 -12078 -21884 -34088 -14252 -12519 -7756 -1277 11643 21739 38386 12563 -39725 -41545
3248 -41545 -45170 -32163 -36822 -42800 -13552 14697 497 -15193 -4167 4051 9702 -19406 -29256
3235 -29256 3181 17149 -2187 -14924 -11484 15896 37252 36943 32865 17313 16199 13543 28282
3222 28282 36088 11244 5364 1352 4868 -609 -12064 -3760 -1980 -24702 -29295 -30098 6669 23621
3208 23621 16891 8991 4319 -11525 -27131 -21201 5229 18924 24751 -330 -6291 12320 39582
3195 39582 27473 -8711 -8517 -2967 18390 12151 25177 27507 27668 32733 47157 43631 15139 27826
3181 27826 28251 32638 39374 10581 -13689 29145 33496 5346 8693 -4266 -15449 -12196 16056
3168 16056 10615 11847 -13822 -25561 -4791 16394 10920 -27997 -19240 -32246 -34311 -46368 -38685
3155 -38685 -40119 -24398 -4314 9975 15742 30736 44575 34668 20598 -7134 -7509 26772 24923
3142 24923 6203 -21158 -45235 -18690 -6439 -24466 -27450 2301 30661 34377 34576 28170 21559
3129 21559 -3419 -2444 38650 64854 38676 32045 43285 10878 -24460 -46932 -56124 -48464 -41432
3116 -41432 -16329 -4529 -3667 -25576 -57141 -53266 -22100 -45726 -55565 -72382 -73211 -52392 -34206
3103 -34206 -33996 -35821 -36753 -26833 -15269 -10266 -25029 -31740 -34541 -23558 -6010 17921 -5893 -6640
3089 -6640 38329 42722 8800 -19368 -3717 -6171 -4631 25853 44153 40921 11443 -4786 -17362
3076 -17362 -2331 -11468 11893 25829 19168 2987 -27984 -12732 6127 14885 27333 56448
3064 56448 33586 17551 14438 23770 18424 -24910 -38474 -40442 -21072 -7013 8177 31672 33397
3051 33397 -4120 -19470 -17334 -2174 24482 2851 -10692 15061 -13285 -20750 -16018 -36133
3039 -36133 -51770 -34915 -41162 -44886 -26091 -36664 -28062 -27971 -45995 -65240 -79147 -93788 -70609
3026 -70609 -23259 -2564 1861 -31780 -10819 22274 1851 -6078 -26171 -29252 -26346 -53853 -55216
3013 -55216 -38187 -30566 -6754 -10559 -17463 21166 25223 4956 -15603 -3919 584 -25189 -58082
3000 -58082 -66494 -39945 -48343 -34926 -7714 -2311 -15016 -8162 -13012 -51435 -46876 -25728 -29959
2987 -29959 -21346 -28216 -27708 -10123 -3717 -24122 -14677 -6027 -6384 -35817 9902 23962 10334 -12355
2973 -12355 -11361 -19201 -16418 -25763 -3847 -5891 -2216 10139 13414 38329 30522 24546 10436 -2119
2959 -2119 10847 -6033 -9860 -22868 -17330 -7583 24484 14189 8413 13031 7184 -5995 -6716 -5579
2945 -5579 -10597 -16713 9858 7435 114 -15319 -46273 -66975 -66213 -63177 -55879 -24622 -14983 -5118
2931 -5118 -1110 -14450 -19279 -129 18231 19341 -16115 -25443 -30573 -27229 -28468 -32984 -16887 9006
2917 9006 27738 37193 24300 22008 33180 9199 5569 -8341 -19447 -22621 -11526 30093 14353
2904 14353 3702 23518 26081 -8994 -8947 -1562 30213 29904 7315 -11971 -7440 15501 35648
2891 35648 25140 19045 32111 10775 9807 -7676 -6458 -10713 1672 12119 8724 15881 21144
2878 21144 27327 13058 -5663 -21714 -18399 3853 4131 -30383 -37724 -16099 -13421 -9632 138
2865 138 -16825 -30324 -18456 -22092 -56900 -63367 -34110 -32283 -18609 -4156 -19723 -7168 8213
2852 8213 18239 -19723 -35133 -33795 -11553 -14905 2663 15643 30823 15016 -13529 205
2840 205 8055 -7763 -10064 -10705 -21594 -10898 -1081 7342 12688 8141 -15404 -13619 -43626 -56265
2826 -56265 -30728 -16661 -47611 -61025 -30578 -23906 -20283 -33601 -72951 -78728 -59622 -45077
2814 -45077 -10535 22403 13128 25727 19444 11665 10593 -5939 8050 18111 32106 7290 -29121
2801 -29121 -6415 12657 -13181 -18377 -8656 -17666 -15958 -6557 440 -12131 -15348 -17046 -26910 -15321
2787 -15321 -33943 -47426 -45459 -23435 -95 26792 55271 90379 91768 73626 49641 27068
2775 27068 34897 4854 -12321 -2253 25410 53969 41559 20433 2261 22562 2844 -24627
2763 -24627 -3047 17152 19114 3965 18632 18248 44875 52365 25515 21657 36604 36157 4543
2750 4543 -9156 -20833 -44703 -11614 12265 20264 17580 41815 7880 -295 -3249 -9243 -22083
2737 -22083 -18028 -20751 -5824 3615 10753 32021 20136 -1574 -13023 -12195 -13612 -14076 -8538 9840
2723 9840 14163 22481 39929 42564 33051 18660 12822 612 11586 -6054 -31857 -48923 -46988
2710 -46988 -39107 -21712 6067 13118 21252 10934 -18357 -850 23096 8858 539 -11563 -20366
2697 -20366 -15626 10564 11435 -13306 -28395 -34571 -29978 -9072 36446 44429 41841 8998 -3067
2684 -3067 -14941 -25172 -17786 -5252 -20856 -8972 10978 22714 -2556 -7293 -9980 -19475 -32983
2671 -32983 -23159 -23745 -38808 -60447 -42960 -21022 -14340 -8496 9298 -1591 -692 -16892 -35483
2658 -35483 -28417 -30640 -9913 -10567 -19203 -17327 -17721 -371 13870 20798 19555 -7416 -10141 -20745
2644 -20745 -5424 25828 35788 45557 34736 -3552 -32100 -23821 -8488 -17234 -3953 -6088 -28336
2631 -28336 -46633 -40697 -43536 -5891 12754 -2377 -8273 -9449 3942 17392 13566 -18108 -25059
2618 -25059 -38225 -35823 -19521 9070 -3446 -20314 -20584 -23383 -2776 -14878 -23209 -26103 -36394
2605 -36394 -50038 -38154 -45235 -33347 -22291 -26227 -21509 -18016 -12236 -18114 -48514 -45439 -19478
2592 -19478 10608 14584 12414 -6645 -16127 -6992 -40182 -54733 -45995 -55935 -45680 -25869 -6040
2579 -6040 -14036 -15120 3732 11966 8098 5777 -12756 -14700 11 -33359 -38040 -13185 22989
2566 22989 34056 17801 8350 14619 11643 -1179 -26105 -16734 18772 8196 -1735 3061 -7667
2553 -7667 8485 13176 14497 423 -10304 -2045 10696 17489 19030 10157 17054 -16244 -33571
2540 -33571 29550 41410 44073 52185 60928 49730 15754 6000 -30113 -42903 -45275 -60358 -25916
2527 -25916 -8691 -17574 -16701 -4712 11291 7486 -16942 -18550 -22889 -33697 -39716 -19523 2260
2514 2260 8122 16553 22360 23329 43377 54430 23729 4891 -36531 -44355 -26001 -6544 -35658
2501 -35658 -41095 894 22914 12946 11863 35687 24346 -5405 -19161 -12332 5273 2552 -22483
2488 -22483 -12693 -25194 -45162 -54387 -61542 -32187 -17779 -29617 -4751 1146 -20592 -22054 6428
2475 6428 595 6637 -6813 3153 -14827 -42240 -55580 -46261 -16271 -7357 8150 9893 -6502
2462 -6502 5052 14230 14075 3169 -8144 -22760 -25485 -22281 -23434 -23400 -27370 -5367 11991 -4607
2448 -4607 -33758 -42976 -19971 20319 13479 -22012 -38663 -19297 -923 -8318 -24333 -47427 -38914
2435 -38914 7431 13065 34697 22261 -452 -17337 12267 41122 25743 12469 17268 12370
2423 12370 -6021 -16075 -11638 3146 -4170 -19447 -30749 -23782 -18737 3785 2731 -21313 -28829
2410 -28829 -21478 13137 46088 41699 15404 -1150 -3772 -1410 12212 20729 18655 36683 62655
2397 62655 42121 27126 44958 36204 -4808 1497 3762 -3000 3407 1082 -20840 -17199 -10200
2384 -10200 -4591 -6846 -12353 -8909 -7790 5008 11627 13999 10315 -20205 -45804 -42751 -30298 -21674
2370 -21674 -3002 -6577 -9933 2887 32268 37387 9158 -3143 -5442 4373 -14148 -10471 -22111
2357 -22111 -30454 -28894 -26941 15541 50404 49601 29630 7785 -11985 332 -10251 -22574 -31912
2344 -31912 -19991 -25924 -20298 -24775 -30516 -15392 7264 4412 -22976 -29548 -22379 -11100 -6953
2331 -6953 -3241 4654 -6544 11965 30548 -1752 -24643 -32180 -17995 267 -5320 -8303 3602
2318 3602 14346 7349 25284 18762 -20669 -23104 -7763 -8157 -29993 -42624 -34598 -10001 929
2305 929 213 -4890 -20497 -18343 -4575 6376 26410 26907 17609 -13795 -29640 -29422 -37607 -36853 -16421
2290 -16421 16843 29967 29465 25602 10175 -23311 -27551 -20796 -32457 -11398 27114 41243 20876
2277 20876 -4194 -11833 11208 30003 25745 28503 24580 -13261 -11991 -33362 -40019 -31765 -12177
2264 -12177 -24508 -37771 -18223 -11622 -13674 -46604 -65928 -74026 -53341 -30566 -38758 -26919 -9029
2251 -9029 -693 9966 2102 -6174 3964 22073 30145 29848 33339 13003 -10978 -350 -2645 8018
2237 8018 34884 41120 16280 9878 20758 8230 9244 32515 17743 -27484 -50853 -36977 -38953
2224 -38953 -40257 -45728 -59717 -58780 -45106 2584 13687 -1229 5607 -3269 -15204 3002 25817
2211 25817 27573 -14682 -49473 -81247 -64772 -34826 -27594 -14027 12315 22859 20754 18886 14043
2198 14043 22808 -2055 -29504 -56391 -31401 -23007 -10638 1817 -2596 9377 2883 8061 15523
2185 15523 27245 39046 45002 39532 10611 -10461 -15948 -23551 -17862 -10991 -13890 -15691 1192
2172 1192 -19261 -55597 -49433 -29988 -3560 -3749 1484 6974 7011 -6015 -4483 -46471 -49300 -31687
2158 -31687 -32394 -31735 -26628 -21300 5978 -75 -12736 -5500 -11013 -10570 -26623 -29277 -16968 -19750
2144 -19750 -24584 -16522 -16726 -9640 41100 30734 38974 74162 73604 15682 -7616 4352 -3650 9473
2130 9473 16406 24702 9535 6011 30006 5834 -8323 -7990 -4845 -3054 -35989 -56650 -36918
2117 -36918 -9787 -881 -8610 -24312 -32521 -1674 8629 16501 11302 2573 23762 33127 8870
2104 8870 18851 14303 -11803 -37675 -26739 4892 9871 17501 15667 -1204 2140 20405 8337
2091 8337 5366 17198 12160 2990 -11197 -14870 -18347 -25297 -37610 -35732 264 381 -6744 -14560
2077 -14560 -14669 -11384 7817 28429 26103 15289 25793 27404 16495 4014 13899 14959 32814
2064 32814 50613 45010 14562 -3501 -253 -8330 -6826 -4712 -16601 -23818 -22847 -18594 -4005 16119
2050 16119 33488 18441 -23650 -71980 -59002 -18442 3297 -582 -12471 -30378 -31464 -25800
2038 -25800 -8484 -31714 -27114 -9541 -22097 -10254 4865 21356 11931 13701 -10375 -30474
2026 -30474 -11769 24773 42949 30986 13996 2252 22045 33524 41424 21857 -7037 958
2014 958 18797 60765 86092 56217 52626 38153 28774 16438 -2067 -12383 -9642 15141 30919
2001 30919 57258 52645 21443 9945 13123 -21395 -42867 -17745 36019 53602 35181 19288
1989 19288 18493 14143 17751 30640 12889 7744 -8694 -10907 -14196 -19305 -28143 -18250 -17332 -16005
1975 -16005 3131 37012 27855 12053 -7123 14429 20208 -2498 18191 21332 6431 -7099
1963 -7099 -23508 -20271 -2629 7353 -2838 -2339 -1291 -12367 -31446 -57727 -82328 -51614 -35689
1950 -35689 -44023 -11551 -4332 6060 153 12891 28267 21401 9575 -16239 -10806 -2837 -44273
1937 -44273 -30171 -1038 18779 -5093 -17476 -3151 2308 11433 10536 29019 56994 49729 47544
1924 47544 47693 31359 26302 33823 36934 29131 -9825 -15725 -5805 -5116 -15585 -3921 10175 169
1910 169 -17045 -49845 -24148 7900 32588 36924 45215 31143 10494 24494 50887 54933 25372
1897 25372 21546 27865 22867 896 -8893 -9175 -4055 -7768 5997 32772 27658 1810 7159 21400
1883 21400 9058 -7804 -1087 -21531 -33813 -33507 -12086 -10255 -13339 5445 13231 -9757 -14286
1870 -14286 -4266 -12536 -18272 -46470 -62918 -14462 3064 -9048 -15385 6569 24553 43904
1858 43904 42899 27465 22258 -8875 4232 -8104 -33464 -39429 -25558 -17444 -9960 -4754 -15547
1845 -15547 -11413 -6138 -10763 -5903 -5396 -1455 -16486 -21751 20798 51659 23181 13396 37780 19642
1831 19642 18372 18307 13748 -3580 -7179 28532 58851 40159 15159 3932 -6823 -13714 -381
1818 -381 28950 38151 17306 19631 32796 -1512 -2946 -5089 -12926 -822 -5042 -9512 -15196 -18410
1804 -18410 13776 5450 3787 22905 24240 12940 13611 3072 261 12146 36409 13303 -9943
1791 -9943 -41522 -47300 -33625 -12341 -15790 -21993 -34271 -50405 -15489 -2276 12733 22915 18605
1778 18605 4582 -310 -4401 -20840 -46186 -41616 -23773 -35340 -25091 -24337 -3690 4283 -12558
1765 -12558 -20351 -9102 14869 14591 4464 23982 32087 30560 31621 18761 7749 -30382 -31690
1752 -31690 -11198 4221 12233 -2549 5678 2085 17770 28038 27506 15357 4986 -6429 -17227
1739 -17227 -1398 -1629 -16937 10209 18792 26902 28589 35989 48400 46439 28660 33371 10203
1726 10203 -12211 -28749 -9755 -777 1622 20835 42781 47395 52122 54117 13749 -19616 -38097
1713 -38097 -28301 -27142 -36709 -39967 -54596 -31353 -8966 18601 7722 -18697 -37404 -45427 -48812
1700 -48812 -33411 -20717 11838 40007 32453 36140 55443 40633 14106 33135 47213 37080
1688 37080 20491 32362 14595 -7237 -4834 -17807 -19696 12797 26358 38368 53035 26660
1676 26660 38107 33223 29070 26968 31972 16378 22488 25228 -11061 -10044 5219 18833 14018
1663 14018 15716 -6354 -22478 -32990 -31779 -30414 -9688 9853 35303 30147 -1036 1970 7621
1650 7621 -10043 -19250 -17127 -19062 -8595 -3796 27607 39412 31893 9201 -20045 -5400 43671
1637 43671 29986 -6777 -39013 -38539 -57283 -54648 -37114 -10015 30024 34488 36423 23136 4866
1624 4866 -587 9842 8408 -9604 1783 35381 47637 70427 66708 33537 26694 13198 -5563
1611 -5563 3764 -5375 -7747 7108 21833 21663 33100 61071 75145 72664 53122 42295 61481
1598 61481 49255 16765 12722 -9600 -7168 -9709 -18081 -16005 -7733 9659 23988 -22403 -22033
1585 -22033 -21457 -12363 -507 -451 -16450 -27541 -39272 -41652 -7815 -22472 -48049 -49292 -33280
1572 -33280 -18904 -23470 -3020 6984 4240 10471 33840 35616 29632 25796 5823 -15303 -9759
1559 -9759 -21566 -26995 -25714 -47833 -33596 -28777 -24212 -26077 -22899 23646 17766 3250 2633 7158
1545 7158 16922 17022 -423 -8173 9262 9262 6574 25207 36359 36846 49587 45533 23180 3878
1531 3878 6214 15228 39054 24223 25075 28576 45695 56375 12605 -22193 -22958 -20396 -22075 -16097
1517 -16097 -1962 9279 -2604 3023 11006 841 -8472 -17413 17639 43730 30186 20985 31110
1504 31110 36409 34537 17798 15543 4254 -22538 -40075 -29427 -25654 -10036 20187 23502 1339
1491 1339 5881 1312 -11263 -37632 -37660 -21757 -24593 -30622 -6796 33730 54866 37203 21229
1478 21229 17348 8387 22927 15683 -17534 -9468 -13835 -30355 -20902 -14207 3157 51121 39488
1465 39488 12807 -14127 -629 5015 9208 3740 1685 9639 23712 -14807 -45001 -41394 -42214
1452 -42214 -52546 -61568 -57253 -19993 -12677 -22543 -21304 -34152 -49405 -65017 -71245 -9887 20525
1439 20525 9391 -17737 -4822 22519 23818 18097 5787 -21065 5363 25692 36187 11778
1427 11778 -9587 -833 29898 36583 4457 15249 -5853 -16178 -5525 -9882 4839 30243
1415 30243 33535 44396 31964 27689 25520 22316 27864 40381 55221 53739 59511 15483 -14009
1402 -14009 -23951 -14878 -17655 -17246 -10201 -3688 -2945 5501 6472 3332 -3600 15319 17726 -2974 -22391
1387 -22391 9082 20769 -6080 -13126 1106 9613 29965 14142 -20944 -52804 -78746 -63282
1375 -63282 -26522 -3098 19147 28783 39736 30672 11158 -5576 -16957 -8205 2398 -2261 7737
1362 7737 3092 -14802 -15656 -13590 -34083 -30974 -39895 -24370 -35022 -41598 -46052 -36531 -30346 -9822
1348 -9822 -2149 3617 -37 -3175 -3290 -1961 -6343 -6526 -10521 -4233 17717 47581 51816 22717 -5986
1333 -5986 -12563 -12125 4366 14719 1685 -1866 -5964 36456 57269 32140 7301 -14412 -18052
1320 -18052 -7563 -629 -8282 -16174 -29754 -26957 -21451 -5785 -12659 -9335 -43264 -35702 -3657
1307 -3657 -11107 -28321 -22228 -25079 -60142 -28399 4066 -1085 5071 -6514 15434 23103 47522
1294 47522 34588 20094 19383 7636 -5635 27478 50225 37311 36040 27068 22109 23273 2825
1281 2825 -17928 -40365 -8948 10642 11234 3096 18985 20415 9500 9305 -6974 -5579 5773
1268 5773 7233 -15640 -32609 -25930 -16662 -18187 165 5174 2894 -12423 -21898 -21622 4679 21917
1254 21917 5749 -10605 -26989 -13049 117 18521 40980 30817 5589 6712 8011 5755
1242 5755 25747 31045 18350 12319 -1275 7460 16767 -15766 -4090 -16637 -35670 -35016 1159
1229 1159 23636 23508 773 -32715 -27268 -8621 9516 18256 7495 -898 -2023 -4339 -17029
1216 -17029 -7160 42474 64277 62709 39515 22003 7976 17188 41021 62450 36771 4411
1204 4411 18634 26854 15740 30967 7410 -16182 -24794 -19539 -7673 -16192 -14442 -4615 14461
1191 14461 28275 53686 42733 52272 35175 10093 35958 37442 16787 -663 -24413 -33757
1179 -33757 -28410 -36168 -22747 -2439 4660 -14490 -28495 -13705 3627 -8351 -10498 18347 27867
1166 27867 44355 33328 36354 46307 14832 20917 18618 5213 9649 -1206 -6914 -17014 -31191
1153 -31191 -2399 7429 -18277 2726 23945 55030 71156 64766 65693 50488 41004 26394 7168
1140 7168 730 4271 28317 26259 25865 26879 37068 43595 49879 20198 19553 23303 19853 47696
1126 47696 55375 41569 34029 19316 4817 8534 31869 39481 18984 40035 76984 74672 26463
1113 26463 -10621 -11296 23151 12366 23573 51749 47186 22219 7495 4254 -5980 8222 44489
1100 44489 51659 13331 19583 54276 47431 9378 -19603 4562 18156 -3341 -12397 -36873 -36620
1087 -36620 -13696 43871 83526 74436 56748 35366 18944 21998 24811 173 3059 3916 -12761
1074 -12761 -18223 15956 4635 -4080 -11977 -22030 -24366 -7772 13351 -13703 -15701 -16217 -9590
1061 -9590 -4732 -14816 2983 29990 26728 17291 14875 28073 39201 44191 48326 51518 67783
1048 67783 59947 34143 34572 38882 26592 3836 10948 16934 13834 -13332 -5962 22279 38716
1035 38716 44868 48597 51927 44351 55241 19497 2029 22234 50172 40143 30355 44481 35080
1022 35080 21811 15261 11993 22783 20835 12363 8707 44150 79334 71939 49349 23166 23803
1009 23803 23235 15019 -2315 -14064 7081 30456 35496 58926 60510 58028 53874 29032 8105
996 8105 -7071 7834 20632 17923 17692 31007 18221 4446 5820 -3879 -12142 -916 -18200
983 -18200 13370 23103 5061 16241 36643 15795 17649 18790 20207 9584 -16760 -22154 -2423
970 -2423 7213 6085 10240 11108 -214 -2305 10970 2707 -12869 -20916 -28243 -16293 -9789 2161
956 2161 -9775 -15928 -4268 5974 29686 37161 57605 43216 30130 53693 73941 51861 19738
943 19738 3754 21744 29144 22513 26930 20716 20251 4642 -12457 3450 22001 -9647 -11067
930 -11067 -26988 -26372 -2809 15233 21422 12917 15013 17940 28899 34603 20257 27898 48304 31347
916 31347 -11036 -20115 28025 38580 25006 27314 21476 11730 23055 12116 22066 25700 -6119
903 -6119 -32328 10885 37541 27028 31397 32402 42209 40935 222 -12864 2094 -3916 21737
890 21737 34675 51980 62481 78831 81728 52042 22760 32968 41667 59784 30363 28692 34600
877 34600 20515 2636 -11805 -16639 -8453 25409 20616 9487 26951 51161 45502 38660 34698
864 34698 15484 -251 13234 43578 51811 20275 -3803 3476 7463 21061 33395 28353 22015
851 22015 32833 43782 61588 62036 61629 61613 27987 -1829 -23815 -21262 -14608 -10067 585 12336
837 12336 3526 8402 12176 29555 41652 16403 -18720 -33476 -25810 5608 9012 2079 18645
824 18645 44489 54672 63241 72839 45364 23862 22942 26715 -8140 -27918 -2623 29530 56321
811 56321 69961 67155 52116 20361 16145 5422 -12547 -33832 -34087 -28157 -21451 -8552 20491
798 20491 20059 10990 -9398 9253 20541 27606 8781 23099 45501 26962 2965 -15472 -28672
785 -28672 -18940 -18577 -35005 -49700 -23438 -13081 4256 -22419 -6103 38445 38434 -9352 -10679
772 -10679 -1030 2232 16914 34790 31065 15040 -2911 33460 55871 80390 53221 33863 28802
759 28802 20857 14366 8880 9377 11950 14323 11138 35463 34428 24380 22431 -1208 -9875 4490
745 4490 17355 11567 10174 30044 20169 2273 8742 16983 -5434 -3269 26976 51631 52082 52044
731 52044 65339 33636 -18735 -27935 -25859 -48549 -48533 -43649 -46889 -5092 15964 13712 5591 5439
717 5439 30686 47346 17882 23870 34084 34747 35643 43848 47489 58796 57208 20860 41662 42460
703 42460 46035 35810 23674 15342 16081 4811 3149 -2832 -13744 -44415 -42900 -36715 -3772 7033
689 7033 -11109 -24265 -43420 -32885 -30074 -17787 10344 22510 22307 14222 -1910 3864 -15644
676 -15644 -26542 -21239 10059 38378 50675 42242 8419 22785 33309 20729 7704 -11095
664 -11095 -1187 10166 25707 39692 31624 21646 -21 5405 30586 12210 6983 18434 11695
651 11695 3908 14801 30014 20343 19803 20163 12419 9684 9868 30752 27280 24148 23698 24906 18638
636 18638 29150 50639 55909 55715 45060 55173 47597 39062 32699 21159 33212 39525 29784 7942
622 7942 18872 39950 36676 33866 37617 9117 -12927 -9651 1550 2278 -13913 -5980 17935 27175
608 27175 43228 26629 16546 323 18402 17230 18947 10242 20812 30835 46447 43055 42293
595 42293 18921 -1575 -24370 -31890 359 26112 10386 968 -11366 2796 10546 12325 3840
582 3840 -5028 7127 9150 16920 32164 -4790 -30465 -27591 -21250 -26369 -13964 -3360 9304
569 9304 18546 -1053 -29506 -3809 2919 -13986 -20183 -8917 -4975 -17229 -22374 -23368 -46812 -46000
555 -46000 -24315 -17376 -35353 -40244 -17581 -6631 -25724 -11838 6345 10277 4022 15315 -5515
542 -5515 -12967 818 14995 8678 1429 21279 31068 29330 55703 55597 47558 28990 12819 3975
528 3975 7412 6664 -10042 -16002 -19689 -6419 10175 -3250 3591 -14865 -962 -2957 -27680 -12856
514 -12856 32444 18484 2204 12011 48907 27210 7101 -10639 -12132 -21536 -26402 6688 11968
501 11968 12180 10182 13778 18613 4182 21230 30609 34686 39379 22361 3711 -9846 -3622 23124
487 23124 36173 49741 38906 28662 7745 -14637 -4089 2124 -28769 -28087 -7534 4386 -12557
474 -12557 -13322 -17383 3180 35247 17029 -22423 -17203 -3660 20295 13341 5502 9392 -652
461 -652 10327 27983 55561 38982 32424 39661 47956 20596 -21760 -20345 -40432 -50274 -61395
448 -61395 -50539 -42634 -53138 -21966 6716 14379 5807 -3068 -8064 -25465 -32698 -22260 -29068
435 -29068 -43176 -14640 2027 -14084 -35535 -41781 -10613 1165 -24880 -41954 -49103 -40829 -5377
422 -5377 -1797 -21234 -19508 5365 -9169 -15886 -14676 -6215 1012 -39804 -53370 -32357 -20036
409 -20036 -9906 -23163 -49909 -53780 -33364 -48491 -27944 -2941 -12298 -29542 -65327 -62465 -44882
396 -44882 -39421 -23836 -17761 2765 -17949 -45153 -27295 -39856 -40141 -3074 2407 -31074 -46100
383 -46100 -32075 -28982 -26711 -33399 -38040 -43098 -23398 -13272 -36799 -16730 2153 -14565 -24161
370 -24161 -14250 -18004 -50734 -60160 -59932 -29080 -26579 -27902 -54649 -21375 -3734 -16358 -10376 -39007
356 -39007 -70885 -73591 -59505 -40446 -34704 -46420 -41676 -31913 -69429 -86127 -98615 -102291 -97994
343 -97994 -73252 -62334 -36322 -35152 -41982 -16502 -14440 -40912 -32675 -34592 -44219 -61523 -57780
330 -57780 -49886 -65278 -78279 -79149 -70383 -49935 -38090 -45181 -40517 -39001 -46929 -59443 -81912 -103906
316 -103906 -94982 -107975 -95384 -62500 -61216 -49376 -51572 -58486 -53941 -72233 -64482 -64857 -48779
303 -48779 -62341 -97027 -92164 -104605 -94008 -96107 -108356 -110267 -92422 -83144 -73734 -60703 -67953
290 -67953 -67950 -71482 -74114 -76707 -88327 -93591 -99349 -102354 -92543 -98563 -89043 -81177 -71868 -74452 -99368
275 -99368 -95703 -86413 -83714 -93813 -132902 -122669 -106250 -126937 -122048 -110061 -116831 -135524 -144538
262 -144538 -129160 -125103 -120269 -122979 -141199 -150262 -155408 -148679 -134386 -153938 -148731 -130320 -142481
249 -142481 -164865 -155961 -131315 -131410 -147631 -137248 -126095 -126685 -129545 -119049 -109996 -111284 -139232 -139069
235 -139069 -127028 -136273 -129073 -146107 -162352 -164305 -138421 -122995 -130951 -142026 -156140 -146845 -129663
222 -129663 -143169 -182835 -196620 -172165 -158183 -139839 -156447 -188789 -204058 -201870 -180293 -183745
210 -183745 -162749 -158030 -151031 -156501 -151117 -159741 -163426 -155130 -148220 -155701 -138915 -160082 -175694 -193106
196 -193106 -197537 -205403 -211152 -196041 -199076 -188978 -161962 -165004 -184374 -176066 -158179 -145684 -155301
183 -155301 -161560 -170467 -188697 -182446 -181187 -171485 -164818 -163742 -167808 -159793 -171795 -164262 -156433 -152760
169 -152760 -155220 -153372 -141956 -159729 -169636 -149305 -145950 -146924 -168844 -183409 -191885 -208537 -209651
156 -209651 -200989 -184690 -155111 -157573 -186782 -197383 -187676 -216978 -220906 -219276 -216871 -201646 -205395
143 -205395 -201235 -193814 -194701 -193530 -179228 -195002 -210570 -217758 -216712 -207274 -228655 -233732 -230991 -233382
129 -233382 -237903 -221147 -213088 -224303 -213678 -215355 -228061 -263078 -273585 -259066 -260287 -242252 -223227
116 -223227 -237103 -238313 -243648 -251755 -242070 -237506 -246835 -250071 -252565 -244813 -250650 -256810 -266911 -259317
102 -259317 -250245 -261050 -288094 -300252 -275549 -268811 -245102 -237062 -232555 -240281 -229208 -225615 -249108
89 -249108 -260466 -249930 -240309 -236676 -239748 -226907 -234119 -280918 -287306 -290522 -290106 -285948 -298176 -295950
75 -295950 -277638 -277099 -284236 -278710 -293120 -281254 -296526 -291544 -296151 -304224 -280018 -253899 -255081 -281835
61 -281835 -302831 -314233 -307309 -307456 -312521 -310887 -305203 -315972 -328960 -333714 -335371 -336637 -334271 -309873
47 -309873 -301946 -298564 -303483 -303371 -302697 -303693 -309985 -323238 -336075 -339714 -317609 -307142 -325313 -333701
33 -333701 -342519 -338169 -344297 -358820 -374200 -363065 -358505 -362428 -361013 -351622 -344819 -324255 -333435 -349988
19 -349988 -350219 -349456 -358678 -359752 -356475 -364844 -366935 -360051 -357912 -352658 -357193 -364859 -354787 -353189 -335648
4 -335648 -332054 -322839 -332319 -346410
0 -346410
$$ Imaginary data points
##PAGE= N=2
##DATA TABLE= (X++(I..I)), XYDATA
32767 160794 169164 180431 189832 195703 207485 194006 180401 191374 206442 233040 230137 199796
32755 199796 202098 194282 196704 216800 213205 213832 228624 212341 214185 215359 237250 256718 249802
32742 249802 227690 213680 228433 230226 230216 232488 217309 214192 220597 225674 252166 243971 274622
32729 274622 280673 269213 264990 267821 283782 281420 277720 283502 295548 288869 285320 295309 300363
32716 300363 304524 299132 296788 317246 336612 342038 335484 332031 324497 333543 342987 352922 354070 345982
32702 345982 322769 312629 330144 333677 340640 335740 328362 338108 328354 320678 334734 330401 309412
32689 309412 337914 362213 364054 359529 347051 361180 367395 379735 381802 390552 369085 350164
32677 350164 344923 343463 367494 378012 381612 387532 395740 399826 393407 399046 388581 398734 399612
32664 399612 400372 415279 416815 429693 429803 438757 434398 434931 446033 443670 411989 404993 406913 407558
32650 407558 418810 435365 432047 428835 416973 434540 446151 458761 462359 450015 458446 492844
32638 492844 478800 483600 485515 477146 463424 464501 488419 502837 499371 496434 501984 511617 502879
32625 502879 486362 483421 494089 506269 524013 510067 489798 498678 501296 496994 480607 501023
32613 501023 518357 518180 520650 522717 531018 527124 515155 518969 532082 539116 511772 506430 522237
32600 522237 546838 554904 528267 526100 546336 555683 596617 591112 557220 554628 565049 568390 559672
32587 559672 549473 539627 520727 535024 546522 546687 557493 565312 579148 585681 585697 587592 557290
32574 557290 544603 538278 542805 570529 607494 600514 588524 568956 543669 555131 583918 585423
32562 585423 583542 589712 599907 592351 592145 578730 590348 587925 571535 570752 581512 594784 633722
32549 633722 652096 629814 604371 609301 614194 641582 633423 618016 614244 611835 596051 591850 591304
32536 591304 601618 603561 587736 603580 635780 621319 611301 627314 639671 628748 619187 620716
32524 620716 627407 621994 640948 663687 657816 636581 620200 612700 619240 641232 659945 660402 667067
32511 667067 696069 705414 684920 687365 676932 692610 705140 705873 693985 683395 666239 673591
32499 673591 697873 696651 684450 697801 712008 676122 658602 671770 687434 705224 700131 704566
32487 704566 713546 714350 718379 719598 709096 698722 687579 680847 688551 676723 657317 686585 721449
32474 721449 724332 713261 701490 705982 692595 693082 707802 695823 694837 712826 698935 704671 730255
32461 730255 727606 705691 698623 701452 698977 707650 728201 740257 767853 767629 784633 789856 758295
32448 758295 742130 743418 761182 760439 767755 774516 745973 726812 724670 734137 725631 725537 743618 738641
32434 738641 721452 723033 747044 745628 733052 736563 747561 766116 777395 785623 805835 804780
32422 804780 802069 798305 778458 768433 765831 778895 807795 787300 778081 785920 805815 795810
32410 795810 793701 782505 759225 758347 778597 778146 780949 774909 777467 789184 793137 772540 766073
32397 766073 760271 769002 773200 781913 785461 783963 783569 786776 781777 789595 765982 779209 805283 805517
32383 805517 794580 790822 791806 817731 813643 830081 828795 827707 845040 840167 813846 803290 806290
32370 806290 818714 807780 806116 804016 808214 784727 769837 789207 811575 817049 806283 798723
32358 798723 804757 818173 834781 836933 815298 805714 816335 808522 791804 801266 821989 812140 795470
32345 795470 784848 775021 772733 826675 869011 861165 843399 830393 855491 850550 835283 837682
32333 837682 839452 835546 833404 825316 825160 831011 816622 800352 794224 810645 816651 813176 845655
32320 845655 876703 864593 874450 902678 923624 930238 896516 888071 887081 866438 862212 841355 855174
32307 855174 856454 836463 804439 800792 819330 826759 812671 795828 812015 838824 816837 813839
32295 813839 820384 851697 889426 874869 865751 859208 860081 854450 857771 885422 910940 906377 875825
32282 875825 873707 855917 862498 868872 877123 839764 813200 824660 851383 864247 867123 862505 868779
32269 868779 846646 851181 887465 874921 840756 835600 840979 846479 855743 872341 880797 883460 877208
32256 877208 881600 875503 872823 864517 835276 838033 841995 854769 860941 867861 872902 913902 958075
32243 958075 970879 935527 914395 904784 881407 874202 891194 867022 860705 874731 893321 905384
32231 905384 906873 908566 904820 875309 863542 871304 870580 854769 855745 879598 863867 847081 865882
32218 865882 897126 892507 891302 896174 905186 914956 872158 839036 851757 867865 871898 831716 848133
32205 848133 864560 854052 854576 870440 865868 876280 892525 895162 909387 945176 935143 915300
32193 915300 904161 913824 917377 870555 859874 845262 850827 870929 867335 889581 888519 905536
32181 905536 920362 942862 920779 898547 902865 930959 923781 893270 883236 886768 894913 897044
32169 897044 902838 894884 886519 838337 810403 832345 859715 852657 866839 894337 898397 893988 910060
32156 910060 916991 931622 950095 924843 922373 910712 888378 898304 898722 904907 909752 865657 870946
32143 870946 869646 881598 874257 839412 836248 864562 869998 873676 873242 895248 899042 902221 898217
32130 898217 900350 903320 892192 873224 853960 862729 905705 902190 883884 873262 863986 855743 867105
32117 867105 855995 855982 874104 884565 894282 910500 896518 889642 884482 893959 909191 893543 897240
32104 897240 894249 875110 865424 883684 880393 857816 864669 886494 910526 908209 884329 878711 909341
32091 909341 916641 905125 909132 908129 889139 879287 897446 882753 865344 877398 872328 874542 898143
32078 898143 885921 869306 867258 883138 904857 913744 908509 894534 876461 875085 904774 924357
32066 924357 942881 937240 934732 923355 900486 869894 852475 865468 861106 866922 893634 880005
32054 880005 864596 893506 919565 890004 892473 933212 946136 945749 934094 920453 928219 917861
32042 917861 912422 928227 927319 885231 871817 876197 898205 912600 902885 887502 872845 899412
32030 899412 930034 918269 915422 918396 961842 983862 936833 930211 959810 964366 950075 946373
32018 946373 949640 952597 938572 922918 898669 881174 883819 879089 896871 928084 937503 960668
32006 960668 949670 937004 904462 872190 864423 889172 912424 930929 925529 920741 888905 885396
31994 885396 908708 922384 900344 859821 834960 838988 846876 876041 875899 874360 897807 912571
31982 912571 925460 905960 896553 900888 919274 903964 891496 921497 929242 935972 920048 900226
31970 900226 877553 890132 912186 932241 945148 948072 909831 871488 865574 865158 890670 944477
31958 944477 955080 938003 934478 908193 875044 870914 889835 883542 888113 897576 891716 866501 868393
31945 868393 865218 871349 864926 868141 888620 899353 903022 922857 900402 867047 858945 862732 868635
31932 868635 896661 891411 909146 934651 941063 946197 933862 927856 897185 902733 887890 873399
31920 873399 879504 884349 874636 856179 848669 887369 869241 870145 877742 899618 917095 906429 892196
31907 892196 903096 925736 929075 927942 907625 895723 879564 871849 872184 894551 923974 921273 903013
31894 903013 914911 930144 933528 900136 899135 906655 915947 926670 930704 897602 884342 881198 875021
31881 875021 888629 908664 927595 935939 927896 915788 910533 884551 889302 907153 910770 919016 909520
31868 909520 888613 870210 879822 904652 905712 880803 884876 884775 889650 883301 886781 891906 902779
31855 902779 881228 880650 888227 889482 893552 902448 902447 905803 914967 918617 899346 881518 876485 875047
31841 875047 917910 933164 928956 929008 927781 948115 934232 911800 915207 930232 936240 953144 957310
31828 957310 972277 980139 958834 927142 897194 905136 923180 929752 930777 928874 913884 910925 931978
31815 931978 941379 939257 897523 867180 861728 863174 856967 871502 896130 912005 905735 913122 903954
31802 903954 881200 870167 849061 875426 889597 884069 889726 898567 919989 923482 945090 934790
31790 934790 903918 891834 902119 912769 920239 921764 928586 909114 911186 920191 916835 925022 937846
31777 937846 919116 878033 908312 941307 955185 933984 913049 893087 880279 891287 917542
31766 917542 941964 937735 897254 892244 893979 900101 930662 929858 905417 914757 925101 911216 872363
31753 872363 835184 840201 865101 870583 864628 879141 897585 915715 895448 876722 870056 896275
31741 896275 924795 943356 928246 925485 924155 904027 904762 928634 923221 913917 899454 917918 933266
31728 933266 917585 921471 927325 903873 885018 893723 891199 896702 912608 932348 917616 883878
31716 883878 857511 864617 901249 924705 919596 923697 927486 921660 911686 925580 935704 912184 917086
31703 917086 932667 897145 900970 903113 905941 923449 923151 903922 894032 911696 917512 904066 907428
31690 907428 893208 911137 938727 935335 919766 923050 963951 967294 932041 887897 888777 898873
31678 898873 926545 944825 963321 940260 923524 925324 927379 932398 934633 924117 927517 956288
31666 956288 954036 958125 939996 917036 902235 886665 912802 937251 914114 892741 888444 880825
31654 880825 873594 878156 896697 893794 910660 901702 894546 872987 895932 912354 922262 939581 941814
31641 941814 934084 913144 899184 905176 896132 869342 887598 904159 923914 946632 935462 922483
31629 922483 920076 932327 933316 923209 896326 900464 903073 909577 888272 870401 864397 857643 883412
31616 883412 897579 908482 904502 899422 935215 944043 910018 875594 874494 885918 922495 944241
31604 944241 965293 943557 918869 931291 932436 930736 919288 911678 916624 922971 939790 935925 935592
31591 935592 940004 912341 907623 932868 955850 944867 955226 973374 962795 960000 947313 962921
31579 962921 963093 942834 922070 922201 925339 919398 908919 901001 896755 889127 902364 896562 913266
31566 913266 924457 930931 932453 946824 954377 961199 955869 932956 938357 943190 956202 963864 943890
31553 943890 943598 933180 918469 933796 941356 931722 956157 958042 950169 945550 957536 925808 900191
31540 900191 918373 944557 954845 946170 952706 927419 897550 884816 890507 907975 926713 935731
31528 935731 927887 924868 916456 909680 876670 874698 899049 926144 919113 902697 891475 882238 868101
31515 868101 912356 944730 960840 959789 961529 958805 977513 974219 938160 936643 930288 943552 960393
31502 960393 939474 922544 947606 951410 942429 943784 959300 953116 934090 928113 923072 916132 899354
31489 899354 900391 896837 915853 923205 911717 901876 899414 899627 900034 904046 898158 870205 849773 880236
31475 880236 889325 887602 907155 934176 929515 935559 954786 980102 967640 934364 890966 865389
31463 865389 884931 897000 913351 912760 930857 939005 943824 947011 944254 930102 896013 902352 900557
31450 900557 901925 934962 921626 908488 905987 897902 900783 917196 908394 901639 917776 913155 908746
31437 908746 924398 943018 928104 925865 934136 924557 900033 896386 920928 935791 934993 948376 939423
31424 939423 932808 930308 930478 921434 927535 944635 950863 948031 958621 949275 938160 922555 897105
31411 897105 884391 896836 915297 908588 904666 893480 892908 919702 932705 932014 913961 898424 923322
31398 923322 933503 916369 911714 911617 893129 913970 915804 900473 878755 897989 917669 924027 910561
31385 910561 898203 870297 892226 912610 919411 889604 874954 877161 897715 925820 939639 925229
31373 925229 915725 918164 915145 916699 939746 971878 971960 956516 953015 957121 945305 948485 936138
31360 936138 906424 917426 928876 926901 912121 863599 862309 872993 875247 876868 916345 943659
31348 943659 956391 976178 956393 937984 919290 900710 894192 878050 896631 904350 924325 956747
31336 956747 958091 929812 912887 902756 896240 900170 918414 935912 969029 965419 947206 936855
31324 936855 926939 924600 929031 944231 951078 954737 951782 933918 912247 938352 954517 926461 923471
31311 923471 951671 956404 939765 898442 917855 968806 985067 950115 938976 952505 976277 982736
31299 982736 987116 972243 945162 939781 951985 966708 940230 913502 919066 913569 904726 894032
31287 894032 903638 909909 936311 960147 959298 940234 936273 963222 953867 951294 954474 933875 954892
31274 954892 967974 972757 964373 962800 972692 973253 952010 929117 918742 928171 928226 942344 947364 980682
31260 980682 988382 974929 971260 971647 982126 998155 956666 948280 979851 970704 960067 929492 880987
31247 880987 873379 894227 913243 925075 928426 933111 951558 957886 974042 992335 1012274 956700
31235 956700 944113 931832 916966 940602 928132 935232 941429 953252 980275 955560 937046 921602
31223 921602 915063 909689 902768 908037 907650 919857 938052 965577 972426 954369 931695 921286 945551
31210 945551 978702 980531 975113 960210 944325 941114 933497 908408 931750 945232 947788 945081 948597
31197 948597 950555 950130 946569 919610 908238 894068 924283 934597 946347 961712 934226 948116
31185 948116 957658 950488 921456 915648 941857 961618 965669 975590 946054 915433 912454 904694 922876
31172 922876 938483 947449 950177 933119 929276 955569 955855 947820 951444 951066 952039 978439 968461 969961
31158 969961 971176 935776 937406 938875 949638 948699 942209 978237 984833 956623 950768 933065 947342
31145 947342 938271 926403 939571 951738 956217 970679 967765 946283 944869 952777 959240 961681 944188
31132 944188 914103 918949 950676 967418 990915 990963 990042 973100 967728 948294 928232 933644 968363
31119 968363 977472 968385 963824 956204 946394 941311 936831 931698 927055 949710 953835 955953 960953 962791
31105 962791 972743 961959 954472 954986 949654 942649 960787 956509 937486 929383 938194 953062 958067
31092 958067 954829 949727 947084 970162 944451 924530 931976 935689 945775 937287 941015 923144 907829
31079 907829 919791 935727 908148 899384 908673 924176 922704 921036 927273 934136 925990 927258 925835
31066 925835 962868 993970 972199 962395 952565 934602 936625 946062 967251 972718 956670 957990 977812
31053 977812 962439 940240 966926 990445 965407 988556 982047 1022066 1029332 1001694 981760 943943
31041 943943 910841 878131 905149 925488 934763 937343 948192 962701 959801 973682 989246 987888
31029 987888 966576 958467 958883 960458 958368 969411 963225 957687 947373 955027 984808 972936 967791
31016 967791 937846 918716 907050 940817 951375 936650 882584 877245 899683 938171 934452 926271
31004 926271 943468 959999 956710 931406 954820 955165 951800 973164 969162 956992 961754 961612 937377
30991 937377 942522 934552 941661 960027 960303 964756 990862 975962 929821 909594 923678 966672 963504
30978 963504 959586 959070 955687 968151 963769 951221 940782 934259 950933 966565 969042 960070 966993
30965 966993 970756 971480 964861 952383 974100 992875 973464 975082 968274 951237 941672 935549 934008
30952 934008 945409 937733 966917 1001492 1010146 984705 950890 940558 958364 990190 1015424 996962
30940 996962 966559 946932 959277 969531 977726 964447 937577 928347 940726 940920 934034 937444 941430
30927 941430 938529 947071 965121 980776 985777 959226 954325 932376 947397 973796 978235 973911 944861
30914 944861 950756 940952 946567 969409 1001763 980398 953298 949445 952882 943321 945928 953552 912872
30901 912872 903456 908342 923067 957137 994291 1008148 1023315 1029072 1016339 969942 978704 1007242
30889 1007242 1011940 976797 981994 981347 956337 962214 965153 982546 979951 955537 926357 927507 932957
$$ [...]
##END NTUPLES=NMR SPECTRUM
##END=
