##TITLE=Analysis number 321132
Compound Code ac 15867
Project Code adrs
Chemist Name acros organics
##JCAMPDX= 6.0         $$ Bruker NMR JCAMP-DX V2.0
##DATA TYPE= NMR SPECTRUM
##DATA CLASS= NTUPLES
##ORIGIN= Bruker BioSpin GmbH
##OWNER= nmr
$$ XWIN-NMR		Version 3.5
$$ Tue Jul 25 18:40:26 2006 GMT Daylight Time (UT+1h)  MAYBRIDGE\nmr@NMR_250MHZ
##.OBSERVE FREQUENCY= 250.131544655141
##.OBSERVE NUCLEUS= ^1H
##.ACQUISITION MODE= SIMULTANEOUS (DQD)
##.ACQUISITION SCHEME= undefined
##.AVERAGES= 16
##.DIGITISER RES= 18
##SPECTROMETER/DATA SYSTEM= dpx250
##.PULSE SEQUENCE= zg30
##.SOLVENT NAME= DMSO
##.SHIFT REFERENCE= (INTERNAL, DMSO, 0, 16.522)
##AUDIT TRAIL= $$ (NUMBER, WHEN, WHO, WHERE, WHAT)
$$ ##TITLE= Audit trail, XWIN-NMR		Version 3.5
$$ ##JCAMPDX= 5.01
$$ ##ORIGIN= Bruker BioSpin GmbH
$$ ##OWNER= nmr
$$ C:\u/data/dgb/nmr/ADRS/3560/pdata/1/auditp.txt
$$ ##AUDIT TRAIL=  $$ (NUMBER, WHEN, WHO, WHERE, WHAT)
(   1,<2006-07-25 18:39:38.04 +100>,<MAYBRIDGE\nmr>,<NMR_250MHZ>,
      <created by zg, POWCHK disabled, PULCHK disabled
       configuration hash MD5:
       E2 DF 36 D8 04 B2 41 60 5A D7 A3 38 5A 4B D0 FE
       data hash MD5: 64K
       AB 53 7B 1E 47 FB D9 13 D6 C4 72 FB 54 AE 18 80>)
(   2,<2006-07-25 18:40:00.27 +100>,<MAYBRIDGE\nmr>,<NMR_250MHZ>,
      <Start of raw data processing
       ef LB = 0.3 FT_mod = 6 PKNL = 1 SI = 32K 
       data hash MD5: 32K
       46 F6 7E 0C 02 1F D9 C2 3F EC C3 4C 13 64 FC 20>)
(   3,<2006-07-25 18:40:04.73 +100>,<MAYBRIDGE\nmr>,<NMR_250MHZ>,
      <apk 
       data hash MD5: 32K
       F4 D3 97 4B 70 4C CC 7D 69 AD 0A A7 47 98 B0 A6>)
(   4,<2006-07-25 18:40:06.34 +100>,<MAYBRIDGE\nmr>,<NMR_250MHZ>,
      <abs ABSG = 5 
       data hash MD5: 32K
       29 0E EB D9 24 4D F4 E1 06 F6 95 38 4E 44 E8 D7>)
$$ ##END=
$$ 
$$ hash MD5
$$ EF EC BD BC 50 B1 B3 B6 D9 B4 8F 7B D5 0B 0D 7B
##$RELAX= 
##$RELAX= 
##$RELAX= 
##$RELAX= 
##$RELAX= 
##$RELAX= 
##$RELAX= 
$$ Bruker specific parameters
$$ --------------------------
##$DU= <C:\u>
##$EXPNO= 3560
##$NAME= <ADRS>
##$PROCNO= 1
##$TYPE= <nmr>
##$USER= <dgb>
##$AMP= (0..31)
100 100 100 100 100 100 100 100 100 100 100 100 100 100 100 100 100 100 
100 100 100 100 100 100 100 100 100 100 100 100 100 100 
##$AQSEQ= 0
##$AQ_mod= 3
##$AUNM= <au_zg>
##$AUTOPOS= <9 >
##$BF1= 250.13
##$BF2= 250.13
##$BF3= 250.13
##$BF4= 250.13
##$BF5= 500.13
##$BF6= 500.13
##$BF7= 500.13
##$BF8= 500.13
##$BYTORDA= 1
##$CFDGTYP= 0
##$CFRGTYP= 5
##$CHEMSTR= <none>
##$CNST= (0..31)
1 1 145 1 1 1 1 1 1 1 1 1 1 1 1 1 1 1 1 1 1 1 1 1 1 1 1 1 1 1 1 1 
##$CPDPRG= <>
##$CPDPRG1= <>
##$CPDPRG2= <>
##$CPDPRG3= <>
##$CPDPRG4= <mlev>
##$CPDPRG5= <mlev>
##$CPDPRG6= <mlev>
##$CPDPRG7= <mlev>
##$CPDPRG8= <mlev>
##$CPDPRGB= <>
##$CPDPRGT= <>
##$D= (0..31)
0 1 0 0 0 0 0 0 0 0.06 0 0 0 0 0 0 0.0002 0 0 0 0 0 0 0 0 0 0 0 0 0 0 
0 
##$DATE= 1153849175
##$DBL= (0..7)
120 120 120 120 120 120 120 120 
##$DBP= (0..7)
150 150 150 150 150 150 150 150 
##$DBP07= 0
##$DBPNAM0= <>
##$DBPNAM1= <>
##$DBPNAM2= <>
$$ [...]
##$SUBNAM7= <"">
##$SUBNAM8= <"">
##$SUBNAM9= <"">
##$SW= 20.6930455092707
##$SWIBOX= (0..15)
0 0 3 0 0 0 0 0 0 0 0 0 0 0 0 0 
##$SW_h= 5175.983436853
##$TD= 65536
##$TD0= 1
##$TE= 295.16
##$TE2= 300
##$TE3= 300
##$TEG= 300
##$TL= (0..7)
0 120 120 120 120 120 120 120 
##$TP= (0..7)
150 150 150 150 150 150 150 150 
##$TP07= 0
##$TPNAME0= <>
##$TPNAME1= <>
##$TPNAME2= <>
##$TPNAME3= <>
##$TPNAME4= <>
##$TPNAME5= <>
##$TPNAME6= <>
##$TPNAME7= <>
##$TPOAL= (0..7)
0.5 0.5 0.5 0.5 0.5 0.5 0.5 0.5 
##$TPOFFS= (0..7)
0 0 0 0 0 0 0 0 
##$TUNHIN= 0
##$TUNHOUT= 0
##$TUNXOUT= 0
##$USERA1= <user>
##$USERA2= <user>
##$USERA3= <user>
##$USERA4= <user>
##$USERA5= <user>
##$V9= 5
##$VALIST= <valist>
##$VCLIST= <CCCCCCCCCCCCCCC>
##$VD= 0
##$VDLIST= <DDDDDDDDDDDDDDD>
##$VPLIST= <PPPPPPPPPPPPPPP>
##$VTLIST= <TTTTTTTTTTTTTTT>
##$WBST= 1024
##$WBSW= 4
##$XGAIN= (0..3)
0 0 0 0 
##$XL= 0
##$YL= 0
##$YMAX_a= 308125
##$YMIN_a= -506564
##$ZGOPTNS= <>
##$ZL1= 120
##$ZL2= 120
##$ZL3= 120
##$ZL4= 120
##$ABSF1= 16.522
##$ABSF2= -4.171173
##$ABSG= 5
##$ABSL= 3
##$ALPHA= 0
##$AQORDER= 0
##$ASSFAC= 0
##$ASSFACI= 0
##$ASSFACX= 0
##$ASSWID= 0
##$AUNMP= <proc_1d>
##$AZFE= 0.1
##$AZFW= 0.1
##$BCFW= 0
##$BC_mod= 0
##$BYTORDP= 0
##$COROFFS= 0
##$CY= 12.5
##$DATMOD= 1
##$DC= 0
##$DFILT= <>
##$DTYPP= 0
##$F1P= 14.0000005364418
##$F2P= -0.99999901652339
##$FCOR= 0.5
##$FTSIZE= 32768
##$FT_mod= 6
##$GAMMA= 0
##$GB= 0
##$INTBC= 1
##$INTSCL= 1
##$ISEN= 128
##$LB= 0.3
##$LEV0= 0
##$LPBIN= 0
##$MAXI= 10000
##$MC2= 0
##$MEAN= 0
##$ME_mod= 0
##$MI= 0
##$NCOEF= 0
##$NC_proc= -5
##$NLEV= 6
##$NOISF1= 0
##$NOISF2= 0
##$NSP= 0
##$NTH_PI= 0
##$NZP= 0
##$OFFSET= 16.522
##$PC= 1
##$PHC0= 156.7066
##$PHC1= 4.231589
##$PH_mod= 1
##$PKNL= yes
##$PPARMOD= 0
##$PSCAL= 4
##$PSIGN= 0
##$REVERSE= no
##$SF= 250.13
##$SI= 32768
##$SIGF1= 0
##$SIGF2= 0
##$SINO= 400
##$SIOLD= 32768
##$SREGLST= <1H.DMSO>
##$SSB= 0
##$STSI= 32768
##$STSR= 0
##$SW_p= 5175.98343685301
##$SYMM= 0
##$S_DEV= 0
##$TDeff= 65536
##$TDoff= 0
##$TI= <Analysis number 999999
Compound Code 99
Book Reference 9
Project Code 9>
##$TILT= no
##$TM1= 0
##$TM2= 0
##$TOPLEV= 0
##$USERP1= <user>
##$USERP2= <user>
##$USERP3= <user>
##$USERP4= <user>
##$USERP5= <user>
##$WDW= 1
##$XDIM= 32768
##$YMAX_p= 401251249
##$YMIN_p= -497288
$$ End of Bruker specific parameters
$$ ---------------------------------
##NTUPLES= NMR SPECTRUM
##VAR_NAME=  FREQUENCY,     SPECTRUM/REAL,   SPECTRUM/IMAG
##SYMBOL=    X,             R,               I
##VAR_TYPE=  INDEPENDENT,   DEPENDENT,       DEPENDENT
##VAR_FORM=  AFFN,          ASDF,            ASDF
##VAR_DIM=   32768,         32768,           32768
##UNITS=     HZ,            ARBITRARY UNITS, ARBITRARY UNITS
##FACTOR=    0.157963299565203, 1,           1
##FIRST=     4132.6476996994, 0,             0
##LAST=      -1043.33573715361, 0,           0
##MIN=       -1043.33573715361, -497288,     0
##MAX=       4132.6476996994, 401251249,     0
$$ Real data points
##PAGE= N=1
##DATA TABLE= (X++(R..R)), XYDATA
$$ [...]
$$ plain form
17316 134076 163772 237923 359299 399346 333271 102912 45515 113908 184885 237872 249691
17305 249691 265188 315886 321877 338506 228918 202237 345139 393676 440820 463146 448618
17294 448618 297453 175370 96076 75204 109449 128500 110642 106689 258390 476465 454165
17283 454165 404015 485568 377482 252679 138753 292449 336445 217766 304184 317595
17273 317595 215791 231079 259233 292515 165184 209634 295974 337837 274184 267238 164570
17262 164570 214214 219347 68259 77283 171569 321760 314995 228311 279282 272734 383456 393845
17250 393845 265057 291350 272388 221595 101870 227032 305308 298767 137760 58002 84933
17239 84933 14959 71198 292081 227054 65214 -24843 85631 387934 462661 256961 207529
$$ packed form
17316A34076K9696P4151J21376M0047o6075k30359n7397O8393P0977N2987J1819
17305B49691J5497N0698N991J6629j09588k6681J42902M8537M7144K2326j4528
17294D48618j51165j22083p9294k0872L4245J9051j7858l953J51701K18075k2300
17283D54165n0150Q1553j08086j24803j13926J53696M3996j18679Q6418J3411
17273C17595j01804J5288K8154L3282j27331M4450Q6340M1863o3653o946j02668
17262A64570M9644N133j51088R024R4286J50191o765q6684N0971o548J10722J0389
17250C93845j28788K6293j8962n0793j19725J25162P8276o541j61007p9758K6931
17239H4933o9974N6239K20883o5027j61840r0057J10474L02303P4727k05700m9432
$$ plain form
17228 207529 232998 209411 182186 116492 102161 117004 123271 46472 13876 45840 35026 181658
17216 181658 195995 216925 161996 148471 272955 330394 330392 152719 131449 147354 129444 139714
17204 139714 117228 259987 268954 312870 230616 4186 -20488 37506 -123090 -51071 -58521
17193 -58521 -49644 -30448 36781 257684 246798 140829 93487 42501 9852 -16387 33562
17182 33562 6620 -91340 -151524 -124987 -75540 -76666 -23462 33387 84455 207596 124837 201838
17170 201838 328579 168081 128902 62397 -24571 38427 72081 -17202 12289 -62067 -163684
17159 -163684 -174142 -53635 137246 150051 -23101 -76276 44799 157570 75543 54019
17149 54019 59780 -47653 -29537 -23809 111213 121501 59715 222191 399167 440598 539039
$$ packed form
17228B07529K5469k3587k7225o5694j4331J4843O267p6799l2596L1964j0814J46632
17216A81658J4337K0930n4929j3525J24484N7439kj77673k1270J5905j7910J0270
17204A39714k2486J42759Q967M3916q2254k26430k4674N7994j60596P2019p450
17193e8521Q877J9196O7229K20903j0886j05969m7342n0986l2649k6239M9949
17182C3562k6942r7960o0184K6537M9447j126N3204N6849N1068J23141q2759P7001
17170B01838J26741j60498l9179o6505q6968O2998L3654q9283K9491p4356j01617
17159a63684j0458J20507J90881J2805j73152n3175J21075J12771q2027k1524
17149E4019N761j07433J8116N728J35022J0288o1786J62476J76976M1431R8441
$$ plain form
17138 539039 432050 312382 283571 315990 258391 130739 116723 132257 156417 104620 16934
17127 16934 35704 88944 55166 -106055 -128241 10956 37904 82419 37346 14848 17365
17116 17365 68242 73090 120295 193413 300019 334065 394723 397279 422589 505382 483003 414448
17104 414448 421051 326633 346894 324811 298460 321630 376838 318353 189385 269613 367156
17093 367156 320758 300695 375001 247940 183270 105303 73447 185378 72653 75546 247776
17082 247776 349023 395504 447576 459514 234948 136396 121758 163127 143278 27437 105736
17071 105736 97679 167170 364415 319427 229220 200302 145923 171889 185018 118635 108787 252878
17059 252878 304463 368418 469320 413906 289151 378332 404739 521049 478643 433925 477850
$$ packed form
17138E39039j06989j19668k8811L2419n7599j27652j4016J5534K4160n1797q7686
17127A6934J8770N3240l3778j61221k2186J39197K6948M4515m5073k2498K517
17116A7365N0877M848M7205P3118J06606L4046O0658K556K5310Q2793k2379o8555
17104D14448O603r4418K0261k2083k6351K3170N5208n8485j28968Q0228R7543
17093C67156m6398k0063P4306j27061o4670p7967l1856J11931j12725K893J72230
17082B47776J01247M6481N2072J1938k24566r8552j4638M1369j9849j15841P8299
17071A05736q057O9491J97245m4988r0207k8918n4379K5966J3129o6383r848J44091
17059B52878N1585O3955J00902n5414j24755Q9181K6407J16310m2406m4718M3925
$$ plain form
17048 477850 369407 135123 68659 129771 123032 151042 62199 46072 26046 170905 266917
17037 266917 196316 165865 72348 110937 186349 206553 214074 182143 75704 -26141 5455
17026 5455 122660 141631 141991 146057 92465 152906 310417 342229 262656 90965 -86212 -114374
17014 -114374 -52464 -57312 -14742 -41536 -64933 -53918 26697 121365 210695 141633 75144 -45396
17002 -45396 -90587 -37340 36238 61089 55720 245 -40328 -105836 -214131 -206632 -29522 116585
16990 116585 240819 297695 217716 -41711 -154722 -115781 -29023 -2181 -76659 48693 8673
16979 8673 -30079 114949 133282 207483 145687 135189 206484 287628 257065 135715 111119
16968 111119 14670 -87068 -57546 72511 99850 79370 63745 -2571 53598 88047 155206
$$ packed form
17048D77850j08443k34284o6464O1112o739K8010q8843j6127k0026J44859R6012
17037B66917p0601l0451r3517L8589P5412K0204P521l1931j06439j01845L1596
17026E455J17205J8971L60M066n3592O0441J57511L1812p9573j71691j77177k8162
17014a14374O1910m848M2570k6794k3397J1015Q0615R4668Q9330o9062o6489j20540
17002d5396m5191N3247P3578K4851n369n5475m0573o5508j08295P499J77110J46107
16990A16585J24234N6876p9979k59427j13011L8941Q6758K6842p4478J25352m0020
16979H673l8752J45028J8333P4201o1796j0498P1295Q1144l0563j21350k4596
16968A11119r6449j01738K9522J30057K7339k0480j5625o6316N6169L4449O7159
$$ plain form
16957 155206 272080 170802 3091 89948 227175 198220 144508 209377 279234 164113
16947 164113 51331 143883 90728 62192 209330 213792 190961 191676 112117 121811 221345 144116
16935 144116 -623 32409 -3968 11714 91204 874 -75744 -36201 -19692 25734 -50887
16924 -50887 -44232 -66122 -156258 -231147 -75388 -116248 -181659 -168116 -37515 54248 12827
16913 12827 5451 1451 -113073 -46496 -89103 -91386 -58962 71278 70164 2595 -16649 -123101
16901 -123101 -58775 64746 68558 96353 6689 30044 15110 99921 113988 77859 41443
16890 41443 -104944 -129387 -37054 -78553 -17812 -25453 -95921 -95452 -110215 -58391 113010 193677
16878 193677 61793 -91518 -174479 -120587 3219 81733 -5358 2472 99697 125482 -27186
$$ packed form
16957A55206J16874j01278j67711Q6857J37227k8955n3712O4869O9857j15121
16947A64113j12782R2552n3155k8536J47138M462k2831P15p9559R694R9534p7229
16935A44116j44739L3032l6377J5682P9490r0330p6618L9543J6509M5426p6621
16924e0887O655k1890r0136p4889J55759m0860o5411J3543J30601R1763m1421
16913A2827p376m000j14524O6577m2607k283L2424J30240j114o7569j9244j06452
16901a23101O4326J23521L812K7795q9664K3355j4934Q4811J4067l6129l6416
16890D1443j46387k4443R2333m1499O0741p641p0468M69j4763N1824J71401Q0667
16878A93677j31884j53311q2961N3892J23806P8514q7091P830R7225K5785j52668
$$ plain form
16867 -27186 -10347 -10417 51841 51665 -138337 -24933 -31884 -61574 25128 135576 86008 64422
16855 64422 87771 89205 4892 80330 96852 26992 -33892 -69190 -152122 -72823 -32146 52985
16843 52985 102524 74036 41006 -52639 -162904 -259778 -285821 -143815 -97090 -104210 -96255 -165813
16831 -165813 -122588 -25252 32625 3684 -56587 -15252 43941 -52158 -1870 27626 -5122
16820 -5122 -71674 -30168 27937 12743 -23908 -89579 -83406 -25820 65424 22765 -56575 -187549
16808 -187549 -105941 -55570 2576 -43776 -50631 -124430 -102760 -21524 -8061 49574 13565 150569
16796 150569 185435 42802 34808 92194 226030 253464 181963 310503 365701 200981 135925
16785 135925 96891 -61663 -154431 22662 109474 198253 258760 136078 222589 105506 77853
$$ packed form
16867b7186J6839p0O2258j76j90002J13404o951k9690Q6702J10448m9568k1586
16855F4422K3349J434q4313P5438J6522o9860o0884l5298q2932P9299M0677Q5131
16843E2985M9539k8488l3030r3645j10265r6874k6043J42006M6725p120P955o9558
16831a65813M3225R7336N7877k8941o0271M1335N9193r6099N0288K9496l2748
16820e122o6552M1506N8105j5194l6651o5671O173N7586R1244m2659p9340j30974
16808a87549Q1608N0371N8146m6352o855p3799K1670Q1236J3463N7635l6009J37004
16796A50569L4866j42633p994N7386J33836K7434p1501J28540N5198j64720o5056
16785A35925l9034j58554r2768J77093Q6812Q8779O0507j22682Q6511j17083k7653
$$ plain form
16774 77853 69516 37429 66348 39299 47628 418 -27741 -36069 4806 23330 -30068 139585
16762 139585 73669 -44795 -29791 -35152 -63017 -151906 -187679 -69937 -26734 -15934 -57777
16751 -57777 153107 285345 176833 77992 105942 -7670 73900 28037 48196 102661 38981
16740 38981 -47222 47557 -24660 45943 43276 39064 61067 153072 159071 56235 -86610 -77462
16728 -77462 -93763 -121475 -130562 6989 94218 24303 -150066 -224645 -189579 -203286 -139763
16717 -139763 -176753 -99952 -186134 -145578 -45449 17748 74024 71773 -27119 -147073 -155177
16706 -155177 -40704 1896 84665 205404 147090 -45758 -64584 -53414 -50677 -61946 -135345
16695 -135345 19592 69393 -2940 -2408 -42064 -108350 -92406 1544 220235 286587 307852
$$ packed form
16774G7853q337l2087K8919k7049Q329m7210k8159q328M0875J8524n3398J69653
16762A39585o5916j18464J5004n361k7865q8889l5773J17742M3203J0800m1843
16751e7777K10884J32238j08512r8841K7950j13612Q1570m5863K0159N4465o3680
16740C8981q6203R4779p2217P0603k667m212K2003R2005N999j02836j42845R148
16728g7462j6301k7712r087J37551Q7229o9915j74369p4579L5066j3707O3523
16717a39763l6990P6801q6182M0556J00129O3197N6276k251r8892j19954q104
16706a55177J14473M2600Q2769J20739n8314j92848j8826J1170K737j1269p3399
16695a35345J54937M9801p2333N32l9656o6286J5944R3950K18691O6352K1265
$$ plain form
16684 307852 177919 19814 -4037 82941 68180 -18739 51386 -97024 -29615 56506 6598
16673 6598 110795 26899 76797 105510 91350 87653 8689 -104822 -22455 27834 28179 26158
16661 26158 97607 173402 158023 130002 29944 -6549 -4539 -28324 -38035 -117871 -97027 -1948
16649 -1948 -89511 -342936 -293274 -258289 -172932 -116414 -50600 12316 -21290 -88596 -39175 -148126
16637 -148126 -200775 -210011 -182665 -69738 -120656 -260237 -183234 -182832 -230705 -172053 -114032 -83892
16625 -83892 -64427 -739 -193482 -374482 -310957 -150568 -155114 -23255 -71155 -185185 -151092
16614 -151092 -82431 46952 151430 215946 172241 141803 75745 -11420 41126 53500 -16967
16603 -16967 33508 109005 51987 -40101 2635 49730 -53621 -91932 -82393 -22304 38296 -200180
$$ packed form
16684C07852j29933j58105k3851Q6978j4761q6919P0125j48410O7409Q6121m9908
16673F598J04197q3896M9898K8713j4160l697p8964j13511Q2367N0289L45k021
16661B6158P1449P5795j5379k8021j00058l6493K010k3785r711p9836K0844R5079
16649a948q7563k53425M9662L4985Q5357N6518O5814O2916l3606o7306M9421j08951
16637a48126n2649r236K7346J12927n0918j39581P7003M02m7873N8652N8021L0140
16625h3892J9465O3688j92743j81000O3525J60389m546J31859m7900j14030L4093
16614a51092O8661J29383J04478O4516m3705l0438o6058q7165N2546J2374p0467
16603a6967N0475P5497n7018r2088M2736M7095j03351l8311R539O0089O0600k38476
$$ plain form
16591 -200180 -334417 -242316 -228426 -37354 2228 59812 109316 36852 9786 -1261 -38368
16580 -38368 26517 95670 89990 116332 94061 96208 113522 122074 125000 163816 326013 171615
16568 171615 56208 48215 11238 -40306 -154800 -213610 -192378 -116821 -163401 -149947 -37790
16557 -37790 -14352 -12261 -182576 -224060 -178141 -191877 -204141 -122302 -120415 -158849 -145831 -32238
16545 -32238 22681 -29353 -145973 -98200 -79972 60406 173415 86458 37483 143429 204098
16534 204098 161945 51538 -6909 -148775 -205472 -75776 101614 169294 305334 363003
16524 363003 234131 132317 274854 191065 46920 93201 120473 108953 103132 130546 -68970
16513 -68970 -200644 -99579 25991 -53419 -121429 -155217 -94670 50181 61888 24236 -20484
$$ packed form
16591b00180j34237R2101J3890J91072L9582N7584M9504p2464k7066j1047l7107
16580c8368O4885O9153n680K6342k2271K147J7314Q552K926L8816J62197j54398
16568A71615j15407p993l6977n1544j14494n8810K1232P5557m6580J3454J12157
16557c7790K3438K091j70315m1484M5919j3736j2264Q1839J887l8434J3018J13593
16545c2238N4919n2034j16620M7773J8228J40378J13009q6957m8975J05946O0669
16534B04098m2153j10407n8447j41866n6697J29696J77390O7680J36040N7669
16524C63003j28872j01814J42537q3789j44145M6281K7272j1520n821K7414j99516
16513f8970j31674J01065J25570p9410o8010l3788O0547J44851J1707l7652m4720
$$ plain form
16502 -20484 -159482 -143566 -39074 62236 81044 53009 77151 123353 18827 -101026 -114488
16491 -114488 9355 7407 -39292 -120185 -121629 46165 132701 101150 -15739 -95591 -42868
16480 -42868 89496 -25237 -24744 -25047 8528 181477 217638 127430 71172 98284 91132 59117
16468 59117 96150 195312 233306 217623 76001 -20014 -61117 -68891 -101928 -81191 52705
16457 52705 103732 103529 46473 152381 196997 296085 308199 262945 221965 71351 -124563
16446 -124563 -82775 -76190 -61165 39993 119962 162531 304286 226484 158007 208606 126214
16435 126214 -93565 -144972 24772 122105 118324 69003 -4822 -37391 -28572 -43832 -43929 -117891
16423 -117891 -23929 31490 60706 137221 133944 40652 -36492 23127 42163 64483 -14343 -11075
$$ packed form
16502b0484j38998J5916J04492J01310J8808k8035K4142M6202j04526j19853j3462
16491a14488J23843j948m6699q0893j444J67794Q6536l1551j16889p9852N2723
16480d2868J32364j14733M93l03L3575J72949L6161r0208n6258K7112p152l2015
16468E9117L7033R9162L7994j5683j41622r6015m1103p774l3037K0737J33896
16457E2705N1027k03n7056J05908M4616R9088J2114m5254m0980j50614j95914
16446a24563M1788O585J5025J01158P9969M2569J41755p7802o8477N0599q2392
16435A26214k19779n1407J69744R7333l781m9321p3825l2569Q819j5260r7p3962
16423a17891R3962N5419K9216P6515l277r3292p7144N9619J9036K2320p8826L268
$$ plain form
16411 -11075 -3586 84888 10228 -96161 -20751 -15238 90871 54895 -42881 -140434 -250125
16400 -250125 -175205 -234015 -232264 -266604 -327063 -324509 -309236 -185857 -154627 -109845 93953
16389 93953 123069 -12595 -17830 98436 140541 50244 143987 29897 -50869 -20512 -42624
16378 -42624 -7943 -82503 -107468 2557 194242 233434 242528 204314 53411 -61390 -93784
16367 -93784 11442 181237 82771 46731 30450 20379 126604 164785 144543 43118 -148795
16356 -148795 -186695 -202181 -275805 -253626 -164553 -158725 -134761 -69739 -167558 -77845 -85895 -132772
16344 -132772 -186885 -208284 29509 50050 34313 43838 -50819 -237357 -271465 -408224 -347970
16333 -347970 -211875 -150704 -180494 -65551 117058 112592 -22384 -88652 -180376 -147539 -91501
$$ packed form
16411a1075P489Q8474p4660j06389P5410N513J06109l5976r7776r7553j09691
16400b50125P4920n8810J751l4340o0459K554J5273J23379L1230M4782K03798
16389I3953K9116j35664n235J16266M2105r0297R3743j14090q0766L0357k2112
16378d2624L4681p4560k4965J10025J91685L9192R094l8214j50903j14801l2394
16367i3784J05226J69795r8466l6040j6281j0071J06225L8181k0242j01425j91913
16356a48795l7900j5486p3624K2179Q9073N828K3964O5022r7819Q9713q050m6877
16344a32772n4113k1399K37793K0541j5737R525r4657j86538l4108j36759O0254
16333c47970J36095O1171k9790J14943J82609m466j34976o6268r1724L2837N6038
$$ plain form
16322 -91501 -30748 36755 75978 20473 -56554 -120010 -93869 -65272 -117509 -243332 -182367
16311 -182367 -56920 27302 96208 53039 59917 -4527 -144858 -42383 -69069 -169049 -197012
16300 -197012 -91253 -59090 -34296 -36277 -74450 -20475 -14174 13809 123401 59924 -34760
16289 -34760 908 32690 113550 57406 -64694 -133366 -44653 6800 -54322 67574 173998
16278 173998 137158 101651 101244 39365 -140386 -184744 -60899 7019 -20090 -4860 -1588 -79976
16266 -79976 -101048 -125757 -84980 -82068 -119671 39030 198321 146409 26166 41274 104930
16255 104930 78262 51367 -47837 19686 64730 -84805 -207386 -183590 -262895 -310555 -293492
16244 -293492 -262660 -97323 -114810 -152170 -144554 -93234 -22831 -159795 -238893 -313898 -322323
$$ packed form
16322i1501O0753O7503L9223n5505p7027o3456K6141K8597n2237j25823O0965
16311a82367J25447Q4222O8906m3169O878o4444j40331J02475k6686r9980k7963
16300a97012J05759L2163K4794j981l8173N3975O301K7983J09592o3477r4684
16289c4760L5668L1782Q0860n6144j22100o8672Q8713N1453o1122J21896J06424
16278A73998l6840l5507m07o1879j79751m4358J23845O7918k7109J5230L272p8388
16266g9976k1072k4709M0777K912l7603J58701J59291n1912j20243J5108O3656
16255A04930k6668k6895r9204O7523M5044j49535j22581K3796p9305m7660J7063
16244b93492L0832J65337j7487l7360P616N1320P0403j36964p9098p5005q425
$$ plain form
16233 -322323 -200950 -140671 -56499 -25170 1095 50717 28192 27060 -129440 -175760 -156470
16222 -156470 -170860 -93318 -5931 -17433 148038 109387 167065 149308 -37052 -88893 30187
16211 30187 -10424 -6218 52680 5458 -23549 -144324 -145623 -208061 -154522 -89243 34378 -77539
16199 -77539 -150005 60200 139365 252285 364957 221184 51914 63689 97037 157993 259561
16188 259561 349150 297302 210042 131930 90263 -19719 -4690 58011 -36735 72659 162940
16177 162940 162616 203269 228915 235697 93253 60687 75644 84208 36148 22373 53355 -12722
16165 -12722 19648 -39578 -33769 -5563 -126372 -111946 -114176 -98741 8154 17477 -33842 -48593
16153 -48593 -72098 -51969 -119741 -74363 -106219 -186160 -101331 35097 -24789 -145394 -69890
$$ packed form
16233c22323J21373O0279Q4172L1329K6265M9622k2525j132j56500m6320J9290
16222a56470j4390P7542Q7387j1502J65471l8651N7678j7757j86360n1841J19080
16211C0187m0611M206N8898m7222k9007j20775j299o2438N3539O5279J23621j11917
16199g7539p2466K10205P9165J12920J12672j43773j69270J1775L3348O0956J01568
16188B59561Q9589n1848q7260p8112m1667j09982J5029O2701r4746J09394R0281
16177A62940l24M0653K5646O782j42444l2566J4957Q564m8060j3775L0982o6077
16165a2722L2370n9226N809K8206j20809J4426k230J5435J06895R323n1319j4751
16153d8593k3505K0129o7772M5378l1856p9941Q4829J36428n9886j20605P5504
$$ plain form
16142 -69890 71553 43467 -96851 -187709 -47297 102008 -42062 -39448 141681 64179 29842
16131 29842 -36849 -15723 -28726 -24295 18930 13223 73440 145408 82490 47276 -55856 -81390
16119 -81390 -83968 -17587 84389 155368 80195 -116899 -172427 -65484 -16278 15939 101977
16108 101977 113987 54775 202417 244448 295329 176973 144605 78941 160173 99388 64439
16097 64439 60027 57321 102045 85304 89622 58539 53236 -27783 -35333 86321 175823 61241
16085 61241 37431 48377 116696 143586 139552 171607 237344 147167 22817 -127766 -219681
16074 -219681 -122406 59079 85750 49374 18825 20072 109587 74411 32844 67824 122529
16063 122529 51465 85594 264422 167218 36597 -17619 44971 138057 135239 -7812 -212293
$$ packed form
16142f9890J41443k8086j40318r0858J40412J49305j44070K614J81129p7502l4337
16131B9842o6691K1126j3003M431M3225n707O0217P1968o2918l5214j03132k5534
16119h1390k578O6381J01976P0979p5173j97094n5528J06943M9206L2217Q6038
16108A01977J2010n9212J47642M2031N0881j18356l2368o5664Q1232o0785l4949
16097F4439m412k706M4724j6741M318l1083n303q1019p550J21654Q9502j14582
16085F1241k3810J0946O8319K6890m034L2055O5737r0177j24350j50583r1915
16074b19681R7275J81485K6671l6376l0549J247Q9515l5176m1567L4980N4705
16063A22529p1064L4129J78828r7204j30621n4216O2590R3086k818j43051k04481
$$ plain form
16052 -212293 -337414 -88008 62763 53184 -26079 -70506 -151485 -133405 -146422 -193580 -147396
16041 -147396 -102950 -111840 19232 50548 129632 38660 -113808 -33886 99178 -26769 -96590
16030 -96590 -30880 3552 81325 89137 250940 203431 142807 165608 97743 -33338 -26706 74016
16018 74016 121153 116948 -53077 -165753 -182609 -149786 -190334 -181461 -99446 -68203 -48621 60975
16006 60975 223768 212337 -27046 -68434 -51178 53790 49394 -54420 -122118 -79910 -104130
15995 -104130 -171500 -82319 -201277 -193396 -136091 -187171 -185572 -151345 -176813 -160930 -166931 -105671
15983 -105671 -165314 -255069 -106498 -38634 -102628 -43888 -4734 92774 59283 55438 63292 68996
15971 68996 128972 -13698 -97285 -105621 31582 55763 100593 105980 2561 -59338 8835
$$ packed form
16052b12293j25121K49406J50771r579p9263m4427q0979J8080j3017m7158M6184
16041a47396M4446q890J31072L1316P9084r0972j52468P9922J33064j25947o9821
16030i6590O5710L4432P7773P812J61803m7509o0624K2801o7865j31081O632J00722
16018G4016M7137m205j70025j12676j6856L2823m0548Q873Q2015L1243J9582J09596
16006F0975J62793j1431k39383m1388J7256J04968m396j03814o7698M2208k4220
15995a04130o7370Q9181j18958P881N7305n1080J599L4227k5468J5883o001O1260
15983a05671n9643q9755J48571O7864o3994N8740L9154R7508l3491l845P854N704
15971F8996N9976j42670q3587q336J37203K4181M4830N387j03419o1899O8173
$$ plain form
15960 8835 -72521 -67093 287 23619 75358 48540 -59743 -34298 -70049 -52497 -45400 -69405
15948 -69405 -48592 -131378 -94778 -38400 -72836 -12786 54609 32750 112013 196861 91845
15937 91845 50784 9434 -18676 11224 -7503 -1830 102904 160617 155350 154904 148956 120277
15925 120277 110187 235286 176782 -29541 -152198 -25125 -15462 -145518 -119409 -35839 -131992
15914 -131992 -298950 -254856 -173250 -199821 -185469 -180623 -321507 -292212 -82122 -48225 -102091
15903 -102091 -47695 68799 58096 7506 19594 25774 16793 -16420 -33240 920 -17905 -32131
15891 -32131 -14785 51975 61481 -96457 -163169 -94718 -20606 -62970 -185755 7173 -90982
15880 -90982 -220389 -300385 -243031 -195418 -126031 -85851 -187760 -184952 -119703 -127493 -136442 -115697
$$ packed form
15960H835q1356N428O7380K3332N1739k6818j08283K5445l5751J7552P097k4005
15948f9405K0813q2786L6600N6378l4436O0050O7395k1859P9263Q4848j05016
15937I1845m1061m1350k8110K9900j8727N673J04734N7713n267m46n948k8679
15925A20277j0090J25099n8504k06323j22657J27073R663j30056K6109Q3570r6153
15914a31992j66958M4094Q1606k6571J4352M846j40884K9295K10090L3897n3866
15903a02091N4396J16494j0703n0590J2088O180q981l3213j6820L4160j8825j4226
15891c2131J7346O6760R506j57938o6712O8451P4112m2364j22785J92928r8155
15880i0982j29407p9996N7354M7613O9387M0180j01909K808O5249p790q949K0745
$$ plain form
15868 -115697 -108067 -141123 -63516 4569 35865 -16334 -119541 -63861 45441 75409 107068
15857 107068 63074 -4751 -29100 8007 81967 156087 182148 81831 83341 27571 -192474
15846 -192474 -283484 -254666 -215054 -141318 -128708 -27937 51583 -22515 -198628 -251249 -218584
15835 -218584 -176660 -236568 -260598 -132573 -17266 107251 65068 -58473 73701 115590
15825 115590 60687 -68007 30058 108787 7961 -68974 -80121 -21271 12431 52094 -42481
15814 -42481 -64864 155442 97679 -205482 -216508 -149123 2191 116221 246710 192202 159249
15803 159249 292011 232981 18726 -15455 28759 201673 214721 179181 114016 -70937 -150982
15792 -150982 -115862 43718 135695 234757 284582 194667 -3949 -192511 -215539 -160657 69518
$$ packed form
15868a15697P630l3056P7607O8085L1296n2199j03207N5680J09302K9968L1659
15857A07068m3994o7825k4349L7107P3960P4120K6061j00317J510n5770k20045
15846a92474r1010K8818L9612P3736J2610J00771P9520p4098j76113n2621L2665
15835b18584M1924n9908k4030J28025J15307J24517m2183j23541J32174M1889
15825A15590n4903j28694R8065P8729j00826p6935j1147N8850L3702L9663r4575
15814d2481k2383K20306n7763l03161j1026O7385J51314J14030J30489n4508l2953
15803A59249J32762n9030k14255l4181M4214J72914J3048l5540o5165j84953q0045
15792a50982L5120J59580R1977R9062M9825q9915j98616j88562k3028N4882K30175
$$ plain form
15781 69518 132470 114978 196851 177153 273370 129106 5633 -23032 -64188 -155738 -142504
15770 -142504 -164516 -235082 -157685 -132217 -18370 104519 41865 20732 -14126 -43247 -24481
15759 -24481 -19135 49769 -61335 -89718 -122677 28552 55179 11438 -9280 73200 60519
15748 60519 71655 -42041 20836 84320 -41982 -138967 -190244 -107975 93354 159341 76349
15737 76349 28253 -27865 19742 110624 134056 -74681 -205936 -179453 -123209 -13809 31357
15726 31357 27541 -4048 -121218 -99866 -77050 -114263 -114452 -75407 53268 126344 110937 153097
15714 153097 80877 -33646 990 6010 47688 92529 108984 40079 -27789 -114299 -167992
15703 -167992 -55814 162906 81026 -62515 -90098 43354 -47443 -36029 -10411 -216691
$$ packed form
15781F9518O2952j7492Q1873j9698R6217j44264j23473k8665m1156r1550J3234
15770a42504k2012p0566P7397K5468J13847J22889o2654k1133l4858k9121J8766
15759b4481N346O8904j11104k8383l2959J51229K6627m3741k0718Q2480j2681
15748F0519J1136j13696O2877O3484j26302r6985n1277Q2269K01329O5987q2992
15737G6349m8096n6118M7607R0882K3432k08737j31255K6483N6244J09400M5166
15726C1357l816l1589j17170K1352K2816l7213j89L9045J28675P3076j5407M2160
15714A53097p2220j14523L4636N020M1678M4841J6455o8905o7868q6510n3693
15703a67992J12178K18720q1880j43541k7583J33452r0797J1414K5618k06280
$$ plain form
15693 -216691 -249215 -192925 -113719 75163 172434 184566 165340 -4469 -38965 36411 83585
15682 83585 79472 172958 234435 118901 -83818 -266495 -244744 -141039 -3272 12501 -40406
15671 -40406 -63458 -211499 -229858 -250672 -175545 -78106 101649 33498 19806 74914 -42616
15660 -42616 -2913 33661 75717 189218 169617 109049 34166 4819 -114360 -116348 -162687
15649 -162687 -121777 68973 105403 142015 84689 54891 52531 37131 8108 -98832 -144520
15638 -144520 -46007 48982 65954 -74073 -45669 -18139 79464 75080 25703 -85371 57806
15627 57806 81531 12838 129017 58903 -18548 -105124 -76683 -140079 -87090 -13799 97030
15616 97030 110689 -49691 -92223 110269 102706 61710 107197 -21081 -73677 -199004 -181519
$$ packed form
15693b16691l2524N6290P9206J88882R7271J2132j9226j69809l4496P5376M7174
15682H3585m113R3486O1477j15534k02719j82677K1751J03705J37767J5773n2907
15671d0406k3052j48041j8359k0814P5127R7439J79755o8151j3692N5108j17530
15660d2616L9703L6574M2056J13501j9601o0568p4883k9347j19179j988m6339
15649a62687M0910J90750L6430L6612n7326k9798k360j5400k9023j06940m5688
15638a44520R8513R4989J6972j40027K8404K7530R7603m384m9377j11074J43177
15627E7806K3725o8693J16179p0114p7451q6576K8441o3396N2989P3291J10829
15616I7030J3659j60380m2532K02492p563m0996M5487j28278n2596j25327J7485
$$ plain form
15605 -181519 -166590 -83354 -159314 -155378 -2467 -39586 -142837 -132305 2384 9606 10278 32829
15593 32829 -52764 -100744 -185182 -188236 -151513 -142859 -200098 -106143 -132915 -113117 35681 35714
15581 35714 103124 159452 105445 151592 124074 -71754 -101444 -11366 116703 81879 -60288
15570 -60288 -121840 -46365 70355 209200 168883 137193 96438 78564 118271 196165 116104
15559 116104 -86078 -43741 86088 -101162 -157942 38530 62597 87154 -15338 -139638
15549 -139638 7371 67617 -31395 12550 -62488 -169737 -156393 -106152 21929 105638 49444
15538 49444 -50136 -96220 -284942 -353990 -378835 -394647 -321833 -362884 -389094 -272679 -107571
15527 -107571 -9166 -12872 -90423 44681 223563 67134 -12228 103817 90606 47091 57549
$$ packed form
15605a81519J4929Q3236p5960L936J52911l7119j03251J0532J34689P222O72K2551
15593C2829q5593m7980q4438l054L6723Q654n7239R3955k6772J9798J48798L3
15581C5714O7410N6328n4007M6147k7518j95828k9690R0078J28069l4824j42167
15570f0288o1552P5475J16720J38845m0317l1690m0755j7874L9707P7894q0061
15559A16104k02182M2337J29829j87250n6780J96472K4067K4557j02492j24300
15549a39638J47009O0246r9012M3945p5038j07249J3344N0241J28081Q3709n6194
15538D9444r9580m6084j88722o9048k4845j5812P2814m1051k6210J16415J65108
15527a07571R8405l706p7551J35104J78882j56429p9362J16045j3211m3515J0458
$$ plain form
15516 57549 41961 -32951 -85858 -113978 84512 21718 -137365 -132215 -158310 -87262 -175496
15505 -175496 -175172 -87570 -101154 -57632 -67402 112999 85886 36079 102202 84213 -88336 -85223
15493 -85223 -47251 56836 135305 58198 6117 -94740 -172160 -160492 -63714 -115412 -173459
15482 -173459 -1839 20416 -110926 -216868 -174901 -169258 -173515 -76807 31430 -79801 -117743
15471 -117743 -107773 -184319 -181214 -90384 25309 43308 -59477 -148821 -162708 -64400 -84965
15460 -84965 6948 123861 16744 -30483 -84483 -131108 -122597 -91821 99464 44043 -28142
15449 -28142 -31544 -68837 -89918 -9666 170688 -17356 -185995 -176336 -100696 -189025 -243821
15438 -243821 -277706 -75410 135365 247988 191805 188450 107599 -57629 -212791 -84230
$$ packed form
15516E7549j5588p4912n2907k8120J98490o2794j59083N150k6095P1048q8234
15505a75496L24Q7602j3584M3522r770J80401k7113m9807O6123j7989j72549L113
15493h5223L7972J04087P8469p7107n2081j00857p7420J1668R6778n1698n8047
15482a73459J71620K2255j31342j05942M1967N643m257R6708J08237j11231l7942
15471a17743R970p6546L105R0830J15693J7999j02785q9344j3887R8308k0565
15460h4965R1913J16913j07117m7227n4000m6625Q511L0776J91285n5421p2185
15449b8142l402l7293k1081Q0252J80354j88044j68639R659P5640q8329n4796
15438b43821l3885K02296K10775J12623n6183l355q0851j65228j55162J28561
$$ plain form
15428 -84230 -11435 59080 42147 -38360 -44262 -63611 -99207 -24984 -44291 -75537 -76156 -178891
15416 -178891 -246135 -254807 -115731 19723 17908 -24137 41158 54460 64545 71119 91923 174861
15404 174861 212806 122797 43133 32205 9471 41719 264581 335917 257522 9140 -88797
15393 -88797 -81193 -58527 -67504 27531 31478 132587 205743 210478 223244 298429 323870 57730
15381 57730 -52965 -43367 -139281 -227069 -133098 -17612 -27030 -30290 -14839 -29985 -113256 -51012
15369 -51012 -47343 -68877 -141753 -170350 -163043 -157604 -83417 -6932 -24778 73822 -3187 -92519
15357 -92519 -239924 -207522 -190001 -278828 -221044 -162563 -202027 -206973 -166064 -82778 -31350 -24235
15345 -24235 -65698 41261 102380 158638 151247 81687 141289 168078 111260 -32990 -72949
$$ packed form
15428h4230P2795P0515j6933q0507n902j9349l5596P4223j9307l1246o19j02735
15416a78891o7244q672J39076J35454j815m2045O5295J3302J0085O574K0804Q2938
15404A74861L7945r0009p9664j0928k2734L2248K22862P1336p8395k48382r7937
15393h8797P604K2666q977R5035L947J01109P3156M735J2766P5185K5441k66140
15381E7730j10695R598r5914q7788R3971J15486r418l260J5451j5146q3271O2244
15369e1012L669k1534p2876k8597P307N439P4187P6485j7846R8600p7009q9332
15357i2519j47405L2402J7521q8827N7784N8481l9464m946M0909Q3286N1428P115
15345b4235m1463J06959O1119N6258p391o9560N9602K6789n6818j44250l9959
$$ plain form
15334 -72949 -936 13494 -52765 -87188 6126 37863 -99089 -14584 45705 -9712 33650
15323 33650 23083 59679 81676 65368 -15989 -49904 -22183 -142386 -198647 -140882 -61811
15312 -61811 -53303 -6481 100073 87145 93793 52454 -110857 -151464 -36358 65931 120973
15301 120973 179796 99032 46839 -24815 -115452 -106203 -119539 -48562 8720 13562 92161 105368
15289 105368 -6860 -56711 -87992 -72036 35239 -5861 -111426 7237 191157 166792
15279 166792 115064 82089 4662 -86417 -24203 -41204 -61887 -47252 12201 35052 -32123
15268 -32123 -8417 -103689 -68429 -17783 -177761 -140719 -172120 -142309 54950 94009 -30263
15257 -30263 -124249 -128247 -128525 -107611 -14727 68669 12582 15048 20545 -8196 -90366 -90959 -251943
$$ packed form
15334g2949P2013J4430o6259l4423R3314L1737j36952Q4505O0289n5417M3362
15323C3650j0567L6596K1997j6308q1357l3915K7721j20203n6261N7765P9071
15312f1811Q508M6822J06554j2928O648m1339j63311m0607J15106J02289N5042
15301A20973N8823q0764n2193p1654r0637R249j3336P0977N7282M842P8599J3207
15289A05368j12228m9851l1281J5956J07275m1100j05565J18663J83920k4365
15279A66792n1728l2975p7427r1079O2214j7001k0683J4635N9453K2851o7175
15268c2123K3706r5272L5260N0646j59978L7042l1401K9811J97259L9059j24272
15257c0263r3986l998k78K0914R2884Q3396n6087K466N497k8741q2170n93j60984
$$ plain form
15244 -251943 -115411 117204 50478 -25058 -2414 -40639 -7505 12747 75390 144718 151187
15233 151187 64901 146688 156001 170985 59377 -40556 -24914 -20856 -98402 -115966 -164179 -105538
15221 -105538 -168461 -282459 -218792 -128035 -5536 -89001 -185326 -53371 37389 39330 153027
15210 153027 174467 78483 -98987 -155443 -250283 -262478 -211266 -68096 -17624 -37514 -8117
15199 -8117 87634 9277 -148896 -57036 -40178 123969 83621 -61222 -199049 -123486 -151909
15188 -151909 -147700 -183642 -155152 -281939 -272519 -107619 -180844 -146314 -47238 31866 -32496
15177 -32496 4185 4166 -68670 -176622 -192018 -251989 -88544 87283 49106 37444 -178064
15166 -178064 -314527 -167417 -99234 -17676 46311 15871 -17994 -61613 -69111 -51034 21233
$$ packed form
15244b51943J36532K32615o6726p5536K2644l8225L3134K0252O2643O9328O469
15233A51187q6286Q1787R313J4984j11608r9933J5642M058p7546j7564m8213N8641
15221a05538o2923j13998O3667R0757J22499q3465r6325J31955R0760J941J13697
15210A53027K1440r5984j77470n6456r4840j2195N1212J43170N0472j9890K9397
15199h117R5751p8357j58173R1860J6858J64147m0348j44843j37827P5563k8423
15188a51909M209l5942K8490j26787R420J64900p3225L4530R9076P9104o4362
15177c2496L6681j9p2836j07952j5396n9971J63445J75827l8177j1662k15508
15166a78064j36463J47110O8183Q1558O3987l0440l3865m3619p498J8077P2267
$$ plain form
15155 21233 121640 -14711 -47418 -179733 -17257 72148 -37009 -82542 -14275 24204 -83120
15144 -83120 -109462 -116382 -168686 -195464 -250336 -378248 -335475 -299487 -258583 -191408 -204488 -274280
15132 -274280 -220058 -196692 -214041 -192838 -83562 -29327 -81233 -215737 -77051 36083 28626
15121 28626 115719 121976 -8678 45499 -9689 -87521 -205541 -153010 -30303 1641 64595
15110 64595 77199 25181 -6168 -174834 -127136 -91358 -119680 -239986 -235300 -135975 -38167
15099 -38167 26779 42171 -58384 -92921 -121336 -177545 -94708 4249 43856 115073 176139
15088 176139 244125 138675 28183 -110689 -162009 -70910 -120241 -173473 -161783 -114075 15963
15077 15963 173172 272644 163812 68108 -55853 -4736 62872 56436 -6268 75338 98911
$$ packed form
15155B1233J00407j36351l2707j32315J62476Q9405j09157m5533O8267L8479j07324
15144h3120k6342o920n2304k6778n4872j27912M2773L5988M0904O7175j3080o9792
15132b74280N4222K3366j7349K1203J09276N4235n1906j34504J38686J13134p457
15121B8626Q7093O257j30654N4177n5188p7832j18020N2531J22707L1944O2954
15110F4595J2604n2018l1349j68666M7698L5778k8322j20306M686R9325R7808
15099c8167O4946J5392j00555l4537k8415n6209Q2837R8957L9607P1217O1066
15088A76139O7986j05450j10492j38872n1320R1099m9331n3232J1690M7708J30038
15077A5963J57209R9472j08832r5704j23961N1117O7608o436o2704Q1606K3573
$$ plain form
15066 98911 203704 360341 264751 64855 20283 -25688 20109 30406 119917 82258 -44422
15055 -44422 -130238 -116581 -110032 -92178 -177003 -112983 15205 82915 -128874 -277522 -200412
15044 -200412 -69823 39328 84061 37049 83144 118357 53136 -37471 -148727 -189457 -126697
15033 -126697 -54216 -52616 -9218 69874 105306 168369 236652 246897 46746 -16722 73006
15022 73006 4988 -70026 -105963 -94146 -90262 -54207 -165787 -318395 -236872 -276429 -218725
15011 -218725 11721 53293 25408 -108677 -106007 72285 152303 226086 189324 158022 9495
15000 9495 22325 196286 161260 60535 99661 -84446 -201413 -298714 -473142 -485262 -276620
14989 -276620 -181308 -109977 -124275 -175218 -133246 -80845 -40256 -74081 -24309 26770 31199 20851
$$ packed form
15066I8911J04793J56637r5590j99896m4572m5971M5797J0297Q9511l7659j26680
15055d4422q5816J3657O549J7854q4825O4020J28188O7710k11789j48648P7110
15044b00412J30589J09151M4733m7012M6095L5213o5221r0607j11256m0730O2760
15033a26697P2481J600M3398P9092L5432O3063O8283J0245k00151o3468Q9728
15022G3006o8018p5014l5937J1817L884L6055j11580j52608Q1523l9557N7704
15011b18725K30446M1572k7885j34085K670J78292Q0018P3783l6762l1302j48527
15000I495J2830J73961l5026j00725L9126j84107j16967r7301j74428j2120K08642
14989b76620R5312P1331j4298n0943M1972N2401M0589l3825M9772N1079M429j0348
$$ plain form
14977 20851 -65120 -90142 -144097 -100923 -93287 -44033 -35465 -66250 -125692 -23018 -46525 -101687
14965 -101687 -12747 -73267 -120349 -177642 -182302 -265802 -221254 -144301 -24039 -12281 53123
14954 53123 206560 110340 45863 76518 75782 -138411 -58242 88202 23519 -32486 -4433
14943 -4433 -14425 -69340 -149509 -164534 -213965 -224988 -213499 -94143 -56758 -105240 -145234 -23515
14931 -23515 -68000 -143477 -37116 -62866 -47969 -90808 -33410 -55604 2342 -22642 -59746
14920 -59746 -163636 -196603 -196732 -109769 -35472 -129066 -4809 -14062 49786 99567 147241 131629
14908 131629 106675 93744 54109 2958 71558 210594 289425 121418 71132 112454 142801
14897 142801 81942 -75227 -21477 58650 -17086 -109103 -24981 97981 29870 48239 -104853
$$ packed form
14977B0851q5971k5022n3955M3174P636M9254Q568l0785n9442J02674k3507n5162
14965a01687Q8940o0520m7082n7293m660q3500M4548P6953J20262J1758O5404
14954E3123J53437r6220o4477L0655p36k14193Q0169J46444o4683n6005K8053
14943d433r992n4915q0169j5025m9431j1023J1489J19356L7385m8482l9994J21719
14931b3515m4485p5477J06361k5750J4897m2839N7398k2194N7946k4984l7104
14920e9746j03890l2967j29Q6963P4297r3594J24257r253O3848M9781M7674j5612
14908A31629k4954j2931l9635n1151O8600J39036P8831j68007n0286M1322L0347
14897A42801o0859j57169N3750Q0127p5736r2017Q4122J22962o8111J8369j53092
$$ plain form
14886 -104853 -202082 -217892 -48033 -53032 -45145 -100950 -83941 -75539 -186441 -331260 -360769
14875 -360769 -349137 -190359 -66358 -38875 -10245 -206170 -239833 -169651 -151554 -117028 -157825
14864 -157825 -195884 -78911 -144032 -248419 -291332 -87464 32004 52427 224657 251347
14854 251347 110497 61122 31246 -25798 68186 153342 34254 -15631 33622 45797 1244
14843 1244 -26121 -21944 27022 -93219 -202608 -79220 17351 -46856 -75799 -52443 -57230 -13433
14831 -13433 -112756 -247157 -251049 -56270 109197 81197 60790 41389 188260 72982 -15095
14820 -15095 -69366 -140864 -165184 -83126 -72583 14886 115405 27927 -72316 -39749 -12053
14809 -12053 -69935 -155926 -236364 -213195 -215689 -257003 -22572 141914 204050 99985 -17178
$$ packed form
14886a04853r7229j5810J69859m999P887n5805J7009Q402j10902j44819k9509
14875c60769J1632J58778J24001K7483K8630j95925l3663P0182J8097L4526m0797
14864a57825l8059J16973o5121j04387m2913K03868J19468K0423J72230K6690
14854B51347j40850m9375k9876n7044R3984Q5156j19088m9885M9253J2175m4553
14843A244k7365M177M8966j20241j09389J23388R6571o4207k8943K3356m787M3797
14831a3433r9323j34401l892J94779J65467k8000k0407j9401J46871j15278q8077
14820a5095n4271p1498k4320Q2058J0543Q7469J00519q7478j00243L2567K7696
14809a2053n7882q5991q0438K3169k494m1314K34431J64486O2136j04065j17163
$$ plain form
14798 -17178 -120230 -225927 -309591 -223033 -126553 -73838 -3713 1744 -36622 -92822 -142388
14787 -142388 -74155 36360 -25104 -199542 -188127 -273239 -249404 -153850 41165 26444 -42003
14776 -42003 -169658 -233172 -192246 -103915 1969 131263 18101 -99031 -46275 66716
14766 66716 184211 239675 233985 345414 239297 79044 107811 6774 -29673 78406 187698
14755 187698 47039 -5114 -74395 -105283 55155 142352 100995 129719 186363 50255 5565
14744 5565 59194 -21300 66318 129022 94076 105136 62083 -31772 31162 19323 -27650 57018
14732 57018 9390 7790 2907 -98290 -208504 -240023 -118274 54686 239316 272486 265015
14721 265015 80976 -161334 -190956 21903 11221 -93750 -118271 -105919 25485 -110121
$$ packed form
14798a7178j03052j05697q3664Q6558R6480N2715P0125N457l8366n6200m9566
14787a42388O8233J10515o1464j74438J1415q5112K3835R5554J95015j4721o8447
14776d2003j27655o3514M0926Q8331J05884J29294j13162j17132N2756J12991
14766F6716J17495N5464n690J11429j06117j60253K8767j01037l6447J08079J09292
14755A87698j40659n2153o9281l0888J60438Q7197m1357K8724N6644j36108m4690
14744E565N3629q0494Q7618O2704l4946J1060m3053r3855O2934j1839m6973Q4668
14732E7018m7628j600m883j01197j10214l1519J21749J72960J84630L3170p471
14721B65015j84039k42310k9622K12859j0682j04971k4521J2352J31404j35606
$$ plain form
14711 -110121 -232478 -74248 -50503 11746 38219 82928 80495 37898 -56964 -96329 37267
14700 37267 175439 112830 -79512 -171376 -130803 -162301 -211890 -55068 4371 -141893 -222013
14689 -222013 -142249 -43369 69538 54446 96565 40282 33720 -60922 -48152 27534 122907
14678 122907 65465 109909 124219 79157 68212 64486 167653 129609 95383 38833 -79470
14667 -79470 54963 10914 -155182 -189177 -102950 32597 43192 -49653 -239733 -206751 -94516
14656 -94516 -1904 43341 208209 198489 24691 -60288 -48372 -76638 -111731 -106232 -80406 -136876
14644 -136876 -161436 -100950 -40355 -94713 57155 72930 64245 76849 3492 -3067 26722 -55200
14632 -55200 -220355 -226318 -106859 -20735 27743 112006 112777 -37590 -94929 23750 -443
$$ packed form
14711a10121j22357J58230K3745O2249K6473M4709k433m2597r4862l9365J33596
14700C7267J38172o2609j92342r1864M0573l1498m9589J56822N9439j46264q0120
14689b22013P9764R8880J12907j5092M2119n6283o562r4642J2770P5686R5373
14678A22907n7442M4444J4310m5062j0945l726J03167l8044l4226n6550j18303
14667g9470J34433m4049j66096l3995Q6227J35547J0595r2845j90080L2982J12235
14656i4516R2612M5245J64868r720j73798q4979J1916k8266l5093N499K5826n6470
14644a36876k4560O0486O0595n4358J51868J5775q685J2604p3357o559K9789q1922
14632e5200j65155n963J19459Q6124M8478Q4263P71j50367n7339J18679k4193
$$ plain form
14621 -443 -24565 -86154 -156333 -70437 -39335 -139802 -180870 -179381 -78878 -43134 65209 117087
14609 117087 39215 80803 37878 -71709 -294591 -256981 16034 116243 -9895 -34396
14599 -34396 21145 71277 -20639 -166000 -243421 -182824 -220573 -169042 -56211 -111179 -41000
14588 -41000 -163367 -188321 -5218 8331 -72221 -132309 19753 38489 -82264 -142514 -95349
14577 -95349 -63140 -58517 -25767 10564 78121 108244 147124 100647 5200 -68472 -21261 61603
14565 61603 109555 136127 135863 80097 43212 65617 -72793 -126272 -24817 -19046 -67770 -143141
14553 -143141 -250734 -320748 -272339 -162330 -108642 -37307 -10031 11883 -27464 -73500 -145047
14542 -145047 -81378 -199687 -272606 -281438 -202137 -7402 40697 39938 110064 111974 -266 33691
$$ packed form
14621d43k4122o1589p0179Q5896L1102j00467m1068J489J00503L5744J08343N1878
14609A17087p7872M1588m2925j09587k22882L7610K73015J00209j26138k4501
14599c4396N5541N0132r1916j45361p7421O0597l7749N1531J12831n4968P0179
14588d1000j22367k4954J83103J3549q0552o0088J52062J8736j20753o0250M7165
14577i5349L2209M623L2750L6331O7557L0123L8880m6477r5447p3672M7211Q2864
14565F1603M7952K6572k64n5766l6885K2405j38410n3479J01455N771m8724p5371
14553a43141j07593p0014M8409J10009N3688P1335K7276K1914l9347m6036p1547
14542a45047O3669j18309p2919q832P9301J94735M8099p59P0126J910j12240L3957
$$ plain form
14530 33691 181005 166632 153314 92413 112604 185114 94436 -118033 -212379 -179814 -75386
14519 -75386 383 -140457 -333244 -242923 -53655 -85910 -42738 36719 24688 48470 28809
14508 28809 -47627 26369 78872 115740 141103 71878 -46291 -124088 -12771 27138 -78562
14497 -78562 -105344 -155260 -191213 -189742 -156045 4333 -23654 -60574 -125513 -239445 -289627
14486 -289627 -282243 -178081 -234366 -341292 -341720 -477704 -455984 -270810 -175514 -223172 -285914
14475 -285914 -349113 -301472 -208375 -264921 -239394 -158152 -95512 5060 -16207 -106845 -252159
14464 -252159 -279947 -204392 -273609 -372109 -280813 -230112 -287128 -357821 -440220 -382219 -201315
14453 -201315 -67058 152165 137911 49417 -104090 -152161 -163423 -114751 -14011 -5432 30817
$$ packed form
14530C3691J47314j4373j3318o0901K0191P2510r0678k12469r4346L2565J04428
14519g5386P5769j40840j92787R0321J89268l2255M3172P9457j2031K3782j9661
14508B8809p6436P3996N2503L6868K5363o9225j18169p7797J11317L9909j05700
14497g8562k6782m9916l5953J471L3697J60378k7987l6920o4939j13932n0182
14486b89627P384J04162n6285j06926m28j35984K1720J85174R5296m7658o2742
14475b85914o3199M7641R3097n6546K5527Q1242O2640J00572k1267r0638j45314
14464b52159k7788P5555o9217r8500R1296N0701n7016p0693q2399N8001J80904
14453b01315J34257K19223j4254q8494j53507m8071j1262M8672J00740Q579L6249
$$ plain form
14442 30817 142906 133086 121223 38205 92730 -52546 -107143 67403 99059 128518 139106
14431 139106 140290 93085 -27037 31354 153468 117449 69041 114213 111688 -78448 -28999
14420 -28999 -45710 7461 94523 30159 -18099 66607 229234 54060 -156893 -70734 -57750
14409 -57750 -154174 -62573 -53616 -114239 -253362 -440371 -377357 -190949 -93450 -107492 -244403
14398 -244403 -180277 -78886 -3408 93784 230772 223628 147919 -14661 24409 49636 -19330
14387 -19330 68655 164448 56017 -20651 72012 64029 47834 -35292 -102225 -172692 -144458 -40113
14375 -40113 -112699 -158528 -206749 -198377 -82753 -27746 -89467 -209825 -248711 -164086 -56689
14364 -56689 11171 -65965 29470 65253 -90806 -90754 -170319 -300918 -428260 -320791 -180460
$$ packed form
14442C0817J12089r820j1863q3018N4525j45276n4597J74546L1656K9459J0588
14431A39106J184m7205j20122N8391J22114l6019m8408M5172k525j90136M9449
14420b8999j6711N3171Q7062o4364m8258Q4706J62627j75174k10953Q6159J2984
14409e7750r6424R1601Q957o0623j39123j87009O3014J86408R7499j4042j36911
14398b44403O4126J01391P5478R7192J36988p144p5709j62580L9070K5227o8966
14387a9330Q7985R5793j08431p6668R2663p983j6195q3126o6933p0467K8234J04345
14375d0113p2586m5829m8221Q372J15624N5007o1721j20358l8886Q4625J07397
14364e6689O7860p7136R5435L5783j56059N2p9565j30599j27342J07469J40331
$$ plain form
14353 -180460 -9463 84377 -122733 -211423 -94622 -80923 -61451 -87309 -258258 -201431 -116723
14342 -116723 -31353 -42438 -164624 -66037 26047 -27595 -104103 -106955 -149931 -241694 -129299
14331 -129299 -48567 -52301 -28860 -12656 -131654 -111228 -25123 13644 19395 13200 -77293 13659
14319 13659 10792 52703 -82098 -177820 -98983 -36753 -94924 -191431 -181182 -153353 -126916 -46989
14307 -46989 -102419 -168522 -190560 -222574 -197050 -142081 -92277 -42745 -58442 -158428 -295532
14296 -295532 -328195 -213782 -41091 143149 -17289 14761 90066 50941 133186 221522 113415
14285 113415 -78378 -199326 -166236 -193168 -194878 -147009 -8745 10132 -63444 29205 109529
14274 109529 105743 123048 47154 33466 32527 14798 -30576 -150143 -165129 294 55424 -53870
$$ packed form
14353a80460J70997R3840k07110q8690J16801J3699J9472k5858j70949N6827Q4708
14342a16723Q5370j1085j22186R8587R2084n3642p6508k852m2976r1763J12395
14331a29299Q0732l734K3441J6204j18998K0426Q6105L8767N751o195r0493R0952
14319A3659k867M1911j34801r5722P8837O2230n8171r6507J0249K7829K6437P9927
14307d6989n5430o6103k2038l2014K5524N4969M9804M9532j5697r9986j37104
14296b95532l2663J14413J72691J84240j60438L2050P5305l9125Q2245Q8336j08107
14285A13415j91793j20948L3090k6932j710M7869J38264J8877p3576R2649Q0324
14274A09529l786J7305p5894j3688r39j7729m5374j19567j4986J65423N5130j09294
$$ plain form
14262 -53870 -120484 -73648 -160039 -135768 -31627 68057 192821 224937 174035 256196 220063
14251 220063 88446 -7350 41912 124838 98607 64046 -61625 -67679 -80831 -31808 -13704
14240 -13704 -57797 -62108 -116088 -96304 -109821 -135227 -131832 -170849 -199760 -292302 -239364 -866
14228 -866 120759 3119 -138457 -29809 90052 121283 123777 54765 -70647 -202435 -212926
14217 -212926 -218546 -70001 -13851 -12966 -142062 -111377 -110756 -169227 -285327 -359573 -250774 -86623
14205 -86623 -4324 -62275 -103861 -204255 -208219 -160205 -126981 50190 33211 -56343 -132714
14194 -132714 -130201 -146017 -184010 -269913 -248354 -254530 -215656 -106566 -57848 -40024 -122430 -54687
14182 -54687 -48399 19129 91363 121415 263009 227675 78472 73904 96825 -19535 -3043
$$ packed form
14262e3870o6614M6836q6391K4271J04141R9684J24764L2116n0902Q2161l6133
14251B20063j31617r5796M9262Q2926k6231l4561j25671o054j3152M9023J8104
14240a3704m4093m311n3980J9784j3517k5406L395l9017k8911r2542N2938K38498
14228h66J21625j17640j41576J08648J19861L1231K494o9012j25412j31788j0491
14217b12926n620J48545N6150Q85j29096L0685O21n8471j16100p4246J08799J64151
14205h6623Q2299n7951m1586j00394l964M8014L3224J77171j6979q9554p6371
14194a32714K513j5816l7993q5903K1559o176L8874J09090M8718J7824q2406O7743
14182e4687O288O7528P2234L0052J41594l5334j49203m568K2921j16360J6492
$$ plain form
14171 -3043 101056 -11728 -56688 90645 -30381 -149729 -136031 -175077 -191183 -41389 9788
14160 9788 44391 143912 205250 189359 278252 61211 12337 91443 204003 171057 57220
14149 57220 -129320 -113473 -220831 -223403 -3502 141752 117264 126768 75050 11833 -11046
14138 -11046 -35302 35929 65972 10665 60826 5108 45149 31389 63588 39947 51758 -4923
14126 -4923 11350 -2945 -4063 -71112 -75757 -126892 -202941 -293369 -288213 -184744 -101385 -62116
14114 -62116 -127701 -206940 -76330 -109580 -130802 -184623 -191835 -202380 -142021 -143290 -85554 4328
14102 4328 -19384 -83562 -63077 65046 119639 149089 100467 -46141 -57847 -63643 59508
14091 59508 -32168 52035 73783 -52594 -236060 -107511 -21693 -429 -68023 -19321 96968
$$ packed form
14171c043J04099j12784m4960J47333j21026j19348J3698l9046j6106J49794N1177
14160I788L4603R9521O1338j5891Q8893k17041m8874P9106J12560l2946j13837
14149E7220j86540J5847j07358k572K19901J45254k4488R504n1718o3217k2879
14138a1046k4256P1231L0043n5307N0161n5718M0041j3760L2199k3641J1811n6681
14126d923J6273j4295j118o7049m645n1135p6049r0428N156J03469Q3359L9269
14114f2116o5585p9239J30610l3250k1222n3821p212j0545O0359j269N7736Q9882
14102D328k3712o4178K0485J28123N4593K9450m8622j46608j1706n796J23151
14091E9508r1676Q4203K1748j26377j83466J28549Q5818K1264o7594M8702J16289
$$ plain form
14080 96968 103795 43667 -45783 7090 90586 33589 8526 69375 113819 -11256 -65574 -255975
14068 -255975 -308051 -235579 -229810 -159691 -96482 -104046 21002 107753 59572 72755 21671 -75374
14056 -75374 -115442 -112746 -130277 -235248 -249533 -194777 -129809 -123287 -157235 -158089 -224134 -157086
14044 -157086 19809 85685 10353 -148131 -225017 -414095 -248699 -91188 -92400 -57228 4286
14033 4286 164027 128799 68919 -46480 52375 125209 -45051 -218899 -157612 -61903 28956
14022 28956 -96663 -137961 -55606 -141322 60775 59148 33325 39662 17877 1205 -38027 -64423
14010 -64423 57988 95008 75059 64210 -22181 -25202 82613 -67367 -140258 -113518 -20046
13999 -20046 -16514 -91992 -261872 -238852 -109565 -47669 -161315 -287554 -276305 -133221 32727
$$ packed form
14080I6968O827o0128q9450N2873Q3496n6997k5063O0849M4444j25075n4318j90401
14068b55975n2076P2472N769P0119O3209p564J25048Q6751m8181J3183n1084r7045
14056g5374m0068K696j7531j04971j4285N4756O4968O522l3948q54o6045O7048
14044a57086J76895O5876p5332j58484p6886j89078J65396J57511j212L5172O1514
14033D286J59741l5228n9880j15399R8855P2834j70260j73848O1287R5709R0859
14022B8956j25619m1298Q2355q5716K02097j627k5823O337k1785j6672l9232k6396
14010f4423J22411L7020j9949j0849q6391l021J07815j49980p2891K6740R3472
13999b0046L532p5478j69880K3020J29287O1896j13646j26239J1249J43084J65948
$$ plain form
13988 32727 -61809 -138607 -75763 -77207 -75596 -186061 -185381 -289250 -249934 -201501 -392067 -369228
13976 -369228 -331794 -276659 -211187 -5053 -50927 -230278 -370315 -463457 -324878 -190393
13966 -190393 -174391 -142304 -114570 -56688 -147348 -115580 -39229 -30758 -13753 10313 71064 35674
13954 35674 118213 159142 -7225 -131553 -147371 -161137 -41582 7285 49858 103218 65993
13943 65993 -15450 32395 149737 43651 19206 -103669 -154351 -148931 -258813 -164140 -82929
13932 -82929 27531 71486 12603 -70614 -187458 -142187 -259371 -279097 -265231 -204193 -168098
13921 -168098 -99403 -193876 -261674 -330567 -354774 -265332 -226957 -330276 -183782 -403 -31176
13910 -31176 -17288 -1942 7413 -77743 -165349 -156782 -166257 -64678 -51296 72806 67517 -23801
$$ packed form
13988C2727r4536p6798O2844j444J611j10465O80j03869L9316M8433j90566K2839
13976c69228L7434N5135O5472K06134m5874j79351j40037r3142J38579J34485
13966a90393J6002L2087K7734N7882r0660L1768P6351Q471J7005K4066O0751l5390
13954C5674Q2539M0929j66367j24328j5818j3766J19555M8867M2573N3360l7225
13943F5993q1443M7845J17342j06086k4445j22875n0682N420j09882R4673Q1211
13932h2929J10460M3955n8883q3217j16844M5271j17184j9726J3866O1038L6095
13921a68098O8695r4473o7798o8893k4207Q9442L8375j03319J46494J83379l0773
13910c1176J3888J5346R355q5156q7606Q567r475J01579J3382J24102n289r1318
$$ plain form
13898 -23801 52703 3637 -72763 -15852 7053 20092 40106 -69283 -207983 -146048 -29837
13887 -29837 135585 234729 253551 153856 31611 77394 -5362 -160915 -161414 -34690 -9573
13876 -9573 -68935 -14417 -23855 1815 9416 22248 -56434 -163476 -141379 -10282 20838 -120384
13864 -120384 -176192 -228971 -162454 -55626 -27122 -16195 -117026 -353190 -486827 -357224
13854 -357224 -265361 -242799 -67160 -76897 -121366 -40267 65854 40595 57888 175731 144538
13843 144538 89697 70186 -40013 -45940 41113 68364 72734 -37053 -180454 -138996 732
13832 732 101985 59156 -76201 -186164 -210661 -212899 -154807 -123167 -195558 -189910 -157383 -127056
13820 -127056 -139139 -229571 -228477 -138948 -118832 35709 -2360 -74511 -134943 -142076 -83219 -100900
$$ packed form
13898b3801P6504m9066p6400N6911K2905J3039K0014j09389j38700O1935J16211
13887b9837J65422R9144J8822r9695j22245M5783q2756j55553m99J26724K5117
13876i573n9362N4518r438K5670P601J2832p8682j07042K2097J31097L1120j41222
13864a20384n5808n2779O6517J06828K8504J0927j00831k36164j33637J29603
13854c57224R1863K2562J75639r737m4469Q1099J06121k5259J7293J17843l1193
13843A44538n4841j9511j10199n927Q7053K7251M370j09787j43401M1458J39728
13832G32J01253m2829j35357j09963k4497k238N8092L1640p2391N648L2527L0327
13820a27056j2083r0432J094Q9529K0116J54541l8069p2151o0432p133N8857j7681
$$ plain form
13808 -100900 -162034 -95973 -76856 39522 148468 94871 216062 204217 88303 -7733 -6430
13797 -6430 55525 211744 267055 198306 183888 24636 -116891 -167553 -64629 -50390 -121209
13786 -121209 -158372 -241818 -176208 -97589 -182840 -250719 -282062 -207916 -121568 -140384 -57880
13775 -57880 -85706 -124713 -109836 -83989 -91516 -39600 -15296 14559 15380 7856 -119513 -183641
13763 -183641 -101408 -1228 68411 175181 81632 71935 113292 29792 -88802 47152 210378
13752 210378 193600 90868 18479 -131967 -231798 -82253 43857 116901 114365 113720 117198
13741 117198 46060 -41365 -140113 -101657 -83119 -116050 -93704 -17505 -15415 29126 -49398 -135376
13729 -135376 -174396 -258112 -211407 -77919 -30000 -55635 -119322 -209095 -171908 -36673 -57011
$$ packed form
13808a00900o1134O6061J9117J16378J08946n3597J21191j1845j15914r6036J303
13797f430O1955J56219N5311o8749j4418j59252j41527n0662J02924J4239p0819
13786a21209l7163q3446O5610P8619q5251o7879l1343P4146Q6348j8816Q2504
13775e7880k7826l9007J4877K5847p527N1916K4304K9855Q21p524j27369o4128
13763a83641Q2233J00180O9639J06770r3549r697M1357q3500j18594J35954J63226
13752B10378j6778j02732p2389j50446r9831J49545J26110P3044k536o45L478
13741A17198p1138q7425r8748L8456J8538l2931K2346P6199K090M4541p8524q5978
13729a35376l9020q3716M6705J33488M7919k5635o3687q9773L7187J35235k0338
$$ plain form
13718 -57011 -31382 -80296 8149 -35963 -91062 -221779 -87687 -75085 -23995 -68660 35748
13707 35748 70611 46581 144701 198413 186002 242817 225864 203705 71564 -28148 -231310
13696 -231310 -321551 -332641 -219933 -272826 -324571 -233942 -49033 30731 52777 129032 164873
13685 164873 185043 74424 -25341 -156164 -180115 -163907 -109687 -135743 -105429 -84950 -191547
13674 -191547 -202826 -199196 -157581 -129957 -96575 50023 172095 174961 193089 92786 3320
13663 3320 -33805 -100197 -152277 -130595 34205 107981 82538 194076 261985 198438 187663
13652 187663 130188 38468 -199582 -268216 -169588 24715 5340 -43768 29598 31647 -151303
13641 -151303 -159269 -23982 99521 -74633 -137903 -110561 -39186 96961 54079 -59904 -24966
$$ packed form
13718e7011K5629m8914Q8445m4112n5099j30717J34092J2602N1090m4665J04408
13707C5748L4863k4030R8120N3712j2411N6815j6953k2159j32141r9712k03162
13696b31310r0241j1090J12708n2893n1745R0629J84909P9764K2046P6255L5841
13685A64873K0170j10619r9765j30823k3951J6208N4220k6056L0314K0479j06597
13674a91547j1279L630M1615K7624L3382J46598J22072K866J8128j00303q9466
13663C320l7125o6392n2080K1682J64800P3776k5443J11538O7909o3547j0775
13652A87663n7475r1720k38050o8634R8628J94303j9375m9108P3366K049j82950
13641a51303p966J35287J23503j74154o3270K7342P1375J36147m2882j13983L4938
$$ plain form
13630 -24966 47623 31022 -44373 -66773 71425 -67975 -101135 -126100 -188419 -201397 -127342
13619 -127342 -66705 -100846 -160846 -133486 -39071 -36136 -22451 -34484 -163681 -155595 -231161 -227173
13607 -227173 -102996 -79218 -53907 -6159 3087 2656 -142453 -359729 -316940 -128938 -48639
13596 -48639 -38460 120599 150382 86875 -53152 -72641 -28957 4814 86143 192101 193363
13585 193363 41781 40514 12606 77586 210349 335256 338187 198766 178669 182204 96633
13574 96633 127536 184322 128804 -13893 2635 121465 181653 311070 449499 440449 351965
13563 351965 169696 188969 126774 30271 80405 122824 121624 551 -107056 -20432 -47988
13552 -47988 33051 52990 35119 -25873 49900 133775 79406 2189 27777 95394 199953
$$ packed form
13630b4966P2589j6601p5395k2400J38198j39400l3160k4965o2319j2978P4055
13619a27342O0637l4141o0000K7360R4415K935J3685j2033j29197Q086p5566L988
13607b27173J24177K3778K5311M7748R246m31j45109k17276M2789J88002Q0299
13596d8639J0179J59059K9783o3507j40027j9489M3684L3771Q1329J05958J262
13585A93363j51582j267k7908O4980J32763J24907K931j39421k0097L535q5571
13574I6633L0903N6786n5518j42697J6528J18830O0188J29417J38429r050q8484
13563C51965j82269J9273o2195r6503N0134M2419j200j21073j07607Q6624k7556
13552d7988Q1039J9939j7871o0992P5773Q3875n4369p7217K5588O7617J04559
$$ plain form
13541 199953 301515 212834 139370 176021 51545 80814 -45219 -70774 -56676 -73328 -66228
13530 -66228 -84005 -9476 9385 -137789 -156399 -47116 -119421 -166269 -88428 110672 105595
13519 105595 30131 38730 48000 -154321 -252786 -289045 -238801 -101811 -7695 32552 21941
13508 21941 15571 141061 225881 176299 144268 250213 155276 22188 116141 127388 32325
13497 32325 87020 187648 254517 284889 119414 78691 120271 55540 -76663 -176380 -235760
13486 -235760 -200388 -160066 25562 -26883 -113447 -76167 -176411 -312711 -141565 72895
13476 72895 37173 -146337 -228282 -110747 56 26074 61421 -57766 -103842 -178993 -182126
13465 -182126 57398 48227 78038 71982 -80754 33915 132337 122025 -17036 -59794 -66285
$$ packed form
13541A99953J01562q8681p3464L6651j24476K9269j26033k5555J4098j6652P100
13530f6228j7777P4529J8861j47174j8610J09283p2305m6848P7841J99100n077
13519A05595p5464Q599R270k02321r8465l6259N0244J36990R4116M0247j0611
13508B1941o370J25490Q4820m9582l2031J05945r4937j33088R3953J1247r5063
13497C2325N4695J00628O6869L0372j65475m0723M1580o4731j32203r9717n9380
13486b35760L5372M0322J85628n2445q6564L7280j00244j36300J71146K14460
13476G2895l5722j83510q1945J17535J10803K6018L5347j19187m6076p5151l133
13465a82126K39524r171K9811o056j52736J14669R8422j0312j39061m2758o491
$$ plain form
13454 -66285 -172695 -52919 143574 221577 121895 28803 -40899 -69587 -32161 22033 15992
13443 15992 50489 18630 135903 165162 246352 166590 69378 -132277 -155341 -70131 -95141
13432 -95141 -143745 -147564 -124232 -55573 53680 -11623 -57785 -102353 -4707 163286 141265
13421 141265 117166 -64828 -141880 -177635 -211599 -146104 -89768 -213589 -172983 -31949 -3298
13410 -3298 143488 239878 80411 43318 27839 -118050 -168913 -68292 13347 -123089 -205070
13399 -205070 -187278 -121856 -59312 -12391 98154 83015 -47626 -58008 -46099 -36837 -65176
13388 -65176 -34348 20751 -28964 -34776 41961 -51344 -76461 -102953 -66100 -87764 -248000 -275904
13376 -275904 -151113 -118680 -84407 -7857 62968 96025 -20368 73011 -34466 -86142 -132930
$$ packed form
13454f6285j06410J19776J96493P8003r9682r3092o9702k8688L7426N4194o041
13443A5992L4497l1859J17273K9259Q1190p9762r7212k01655k3064Q5210k5010
13432i5141m8604l819K3332O8659J09253o5303m6162m4568R7646J67993k2021
13421A41265k4099j81994p7052l5755l3964O5495N6336j23821M0606J41034K8651
13410c298J46786R6390j59467l7093j5479j45889n0863J00621Q1639j36436q1981
13399b05070J7792O5422O2544M6921J10545j5139j30641j0382J1909R262k8339
13388f5176L0828N5099m9715n812P6737r3305k5117k6492L6853k1664j60236k7904
13376b75904J24791L2433L4273P6550P0825L3057j16393R3379j07477n1676m6788
$$ plain form
13365 -132930 67784 153199 113991 68889 61823 96012 117085 195622 198139 10604 -94901
13354 -94901 -56772 -40495 -10064 -22630 -45903 35009 204997 121907 99868 107672 95057 9621
13342 9621 -35414 -53043 -91731 -147980 -107244 -134938 -258739 -208851 -195690 -218074 -118978 -1199
13330 -1199 1614 94084 68305 94486 140602 161893 110623 26664 -61031 -140108 -156891 -109288
13318 -109288 -5884 76661 168275 57936 1686 90120 201517 262752 246623 138316 83889
13307 83889 93407 28488 -33790 -71670 -45287 -32347 -5717 77843 72832 95644 18353 -126096
13295 -126096 -32886 91543 46031 18475 -138931 -101114 4239 -122250 -102874 -73451 -37231
13284 -37231 26722 -43947 -16443 5477 -35172 13609 -77090 -104155 -93359 -119624 -91410 27660
$$ packed form
13365a32930K00714Q5415l9208m5102p066L4189K1073P8537K517j87535j05505
13354i4901L8129J6277L0431j2566k3273Q0912J69988q3090k2039P804j2615q5436
13342I621m5035j7629l8688n6249M0736k7694j23801M9888J3161k2384R9096J17779
13330a199K813R2470k5779K6181M6116K1291n1270q3959q7695p9077j6783M7603
13318a09288J03404Q2545R1614j10339n6250Q8434J11397O1235j6129j08307n4427
13307H3889R518o4919o2278l7880K6383J2940K6630Q3560n011K2812p7291j44449
13295a26096R3210J24429m5512k7556j57406L7817J05353j26489J9376K9423L6220
13284c7231O3953p0669K7504K1920m0649M8781r0699k7065J0796k6265K8214J19070
$$ plain form
13272 27660 87103 -40807 -201982 -278086 -194772 -169587 -18493 209053 212783 -91089 -219428
13261 -219428 -133036 176751 246249 158181 25146 13305 80394 99385 62016 -1643 -165774
13250 -165774 -145809 -108080 -165902 -209240 -109059 -40756 66136 147067 116342 73551 79108
13239 79108 107572 41002 -98485 -90206 -61995 -53795 -183423 -186371 -40426 96350 117665
13228 117665 -39875 -83874 -54860 -57417 -26357 46671 -53466 -135064 29334 235105 297536
13217 297536 276361 287373 125367 -25635 -70484 -38321 -20451 -95696 -159957 -39703 48305
13206 48305 34766 -44546 -21380 59783 129034 132093 92608 -86701 -156355 -144894 -80084 29328
13194 29328 127869 240428 145963 -17495 -53294 -39354 -64004 -154955 -54468 -79378 -36754
$$ packed form
13272B7660N9443j27910j61175p6104Q3314K5185J51094K27546L730l03872j28339
13261b19428Q6392L09787O9498q8068j33035j1841O7089J8991l7369o3659j64131
13250a65774J9965L7729n7822m3338J00181O8303J06892Q0931l0725m2791N557
13239G9108K8464o6570j39487Q279K8211Q200j29628k948J45945J36776K1315
13228A17665j57540m3999K9014k557L1060P3028j00137q1598J64398K05771O2431
13217B97536k1175J1012j62006j51002m4849L2163J7870p5245o4261J20254Q8008
13206D8305j3539p9312K3166Q1163O9251L059l9485j79309o9654J1461O4810J09412
13194B9328R8541J12559r4465j63458l5799J3940k4650r0951J00487k4910M2624
$$ plain form
13183 -36754 -15663 -22808 -52 -26532 -54284 -4480 33196 -55802 -135442 -2405 128043
13172 128043 75222 20013 128074 162885 18759 -30673 -64499 -16212 -29225 26300 30874
13161 30874 -76306 -140657 -140308 -88077 -7512 -84212 -40459 -88331 45786 167581 177878
13150 177878 65721 73619 211913 214853 224998 81700 72292 170272 199373 116776 -41601
13139 -41601 -32629 53360 59665 1917 -2510 109430 184352 195865 54224 -71172 74405
13128 74405 80971 -20964 53550 25840 49919 263936 324497 338232 175487 34782 43431
13117 43431 14649 -36625 44295 238058 271348 128740 176952 122274 66505 22860 48488
13106 48488 83235 126389 -39343 -234705 -173384 -102372 -101165 16277 88935 82702 211157
$$ packed form
13183c6754K1091p145K2756k6480k7752M9804L7676q8998p9640J33037J30448
13172A28043n2821n5209J08061L4811j44126m9432l3826M8287j3013N5525M574
13161C0874j07180o4351L49N2231Q0565p6700M3753m7872J34117J21795J0297
13150A77878j12157P898J38294K940J0145j43298r408R7980K9101q2597j58377
13139d1601Q972Q5989O305n7748m427J11940P4922J1513j41641j25396J45577
13128G4405O566j01935P4514k7710K4079K14017O0561J3735j62745j40705Q649
13117D3431k8782n1274Q0920J93763L3290j42608M8212n4678n5769m3645K5628
13106D8488L4747M3154j65732j95362O1321P1012J207J17442P2658o233J28455
$$ plain form
13095 211157 202842 143788 67962 3511 -29350 91615 139641 187515 186210 101126 37396 -15061
13083 -15061 -90604 -63335 76108 195784 110676 71538 136560 -15002 29184 -25566 -110946
13072 -110946 -118734 -202021 -141009 13490 153030 90815 -158829 -270014 -324340 -390657 -305628
13061 -305628 -275522 -229454 -223906 -301762 -231538 -113657 -182995 -179945 -178795 1358 -29844 25455
13049 25455 -17690 -145771 -25752 7856 -41491 49777 154469 196242 167354 84548 70759
13038 70759 67504 -43160 -127243 -105491 -42642 90151 179650 235110 104188 177901 219289
13027 219289 22875 -52678 -58983 -36272 -76586 -9999 84412 14865 -81427 -147736 -246351
13016 -246351 -108608 -10992 84666 77938 121253 123733 89675 21318 -19311 -59131 -64666 -78236
$$ packed form
13095B11157q315n9054p5826o4451l2861J20965M8026M7874j305q5084o3730n2457
13083a5061p5543K7269J39443J19676q5108l9138O5022j51562M4186n4750q5380
13072a10946p788q3287O1012J54499J39540o2215k49644j11185n4326o6317Q5029
13061c05628L0106M6068N548p7856P0224J17881o9338L050J150J80153l1202N5299
13049B5455m3145j28081J20019L3608m9347R1268J04692M1773k8888q2806j3789
13038G0759l255j10664q4083K1752O2849J32793Q9499N5460j30922P3713M1388
13027B19289j96414p5553o305K2711m0314O6587R4411o9547r6292o6309r8615
13016b46351J37743R7616R5658o728M3315K480l4058o8357m0629l9820n535j3570
$$ plain form
13004 -78236 -24368 -2996 -13199 34874 169082 207408 58311 -4908 -50234 -8963 8071
12993 8071 71479 17355 -163279 -157480 -5802 73909 35659 -4838 -58157 -87204 -87528 -16324
12981 -16324 -76683 -139909 -97711 -138931 -163369 -125994 -117292 -105165 -175116 -219108 -152337 68504
12969 68504 74337 88903 139627 81973 -14666 -53529 -26657 -25257 24541 181279 96256 8057
12957 8057 -22947 110043 92431 34449 100397 134050 144316 140808 90160 173187 176507 218349
12945 218349 123705 71575 96273 54276 -52833 25738 95910 106345 48218 -38350 -162371
12934 -162371 -126548 19288 62928 44653 57889 14252 -84899 -236931 -262457 -210578 -68810
12923 -68810 149887 107772 114027 66801 -24343 -39474 -153616 -249980 -184021 -189419 -161165 -177639
$$ packed form
13004g8236N3868K1372j0203M8073J34208L8326j49097o3219m5326M1271J7034
12993H071O3408n4124j80634N799J51678P9711l8250m0497n3319k9047l24P1204
12981a6324o0359o3226M2198m1220k4438L7375Q702J2127o9951m3992O6771K20841
12969F8504N833J4566N0724n7654r6639l8863K6872J400M9798J56738q5023q8199
12957H057l1004J32990j7612n7982O5948L3653J0266l508n0648Q3027L320M1842
12945B18349r4644n2130K4698m1997j07109P8571P0172J0435n8127q6568j24021
12934a62371L5823J45836M3640j8275J3236m3637r9151j52032k5526N1879J41768
12923f8810K18697m2115O255m7226r1144j5131j14142r6364O5959n398K8254j6474
$$ plain form
12911 -177639 -40532 86239 188688 162787 78320 162582 128692 129626 9880 -106212 -209588
12900 -209588 -214393 -46598 -4934 -25208 -73778 -110096 -12784 -8175 16735 44258 121926 72067
12888 72067 18137 -110964 -53126 -90394 -35660 131212 92740 8649 123205 28334 -83025
12877 -83025 -138497 -67002 -33584 -162422 -308720 -173474 1553 79091 110208 -21723 -163860
12866 -163860 -161301 -87355 -18585 -113008 -94760 -21538 68761 47193 57517 114056 1494
12855 1494 -40193 -58767 -23044 118579 296356 197050 93812 173508 145896 -44367 -131064
12844 -131064 -35512 90806 174080 175574 64717 106144 188389 189833 120610 42362 65717
12833 65717 166116 144209 179050 176556 -127415 -299268 -109395 27595 57351 181837 260916
$$ packed form
12911a77639J37107J26771J02449k5901q4467Q4262l3890R34j19746j16092j03376
12900b09588m805J67795M1664k0274m8570l6318R7312M609K4910K7523P7668m9859
12888G2067n3930j29101N7838l7268N4734J66872l8472q4091J14556r4871j11359
12877h3025n5472P1495L3418j28838j46298J35246J75027P7538L1117j31931j42137
12866a63860K559P3946O8770r4423J8248P3222R0299k1568J0324N6539j12562
12855A494m1687j8574L5723J41623J77777r9306j03238P9696k7612j90263q6697
12844a31064R5552J26318Q3274J494j10857M1427Q2245J444o9223p8248K3355
12833F5717J00399k1907L4841k494l03971j71853J89873J36990K9756J24486P9079
$$ plain form
12822 260916 167867 146670 187657 278263 207267 180820 105480 -272 -13397 5290 -70919
12811 -70919 -195867 -112574 -86976 -136350 -36839 -26287 51336 47828 30698 -85381 -40725
12800 -40725 94332 118800 78545 88370 59471 119670 118525 95718 41795 39736 76574 9743
12788 9743 -45248 -53569 77030 192259 287135 205760 182654 84173 104515 275531 240379
12777 240379 113896 6325 -22937 -91245 -225199 -283210 -265560 -322252 -430177 -368825 -178425
12766 -178425 -50689 -87011 -167613 -159053 -183592 -136730 -106430 -53624 -6696 30454 -33452
12755 -33452 82983 61252 -61061 19884 51630 80747 26264 101057 -10508 -59938 -98794
12744 -98794 -65684 21321 140124 69876 74717 29227 43089 54264 37531 50925 -99481
$$ packed form
12822B60916r3049k1197M0987R0606p0996k6447p5340j05752j3125J8687p6209
12811g0919j24948Q3293K5598m9374R9511J0552P7623l508j7130j16079M4656
12800d0725J35057K4468m0255R825k8899O0199j145k2807n3923k059L6838o6831
12788I743n4991q321J30599J15229R4876q1375k3106r8481K0342J71016l5152
12777B40379j26483j07571k9262o8308j33954n8011J7650n6692j07925O1352J90400
12766a78425J27736l6322q0602Q560k4539M6862L0300N2806M6928L7150o3906
12755c3452J16435k1731j22313Q0945L1746K9117n4483P4793j11565m9430l8856
12744i8794L3110Q7005J18803p0248M841m5490J3862J1175j6733J3394j50406
$$ plain form
12733 -99481 -160556 -207627 -280661 -147995 23365 122642 84756 15230 90123 45101 147221
12722 147221 240924 242316 121766 49307 -22160 -106090 -26214 -36196 -106517 -75277 321 197169
12710 197169 126484 16355 69464 -30808 -3928 -21770 -125721 -50824 38317 217126 261905
12699 261905 146802 87583 178419 180505 102489 97104 124807 130493 86770 87907 87552 -95738
12687 -95738 -179678 -111947 -75115 -208489 -92938 103337 171953 -2969 -128055 9547
12677 9547 102132 28089 -114712 -76275 -76311 -39168 36355 99394 68877 -104450 -125702 -187243
12665 -187243 -155907 -107594 -163816 -103716 12147 -96408 26973 241054 254694 268203 122418
12654 122418 -11543 24855 114343 142014 192956 181867 150305 45421 47823 197370 179252
$$ packed form
12733i9481o1075m7071p3034J32666J71360R9277l7886o9526P4893m5022J02120
12722A47221R3703J392j20550p2459p1467q3930P9876r982p0321L1240P5598J96848
12710A97169p0685j10129N3109j00272K6880j7842j03951P4897Q9141J78809M4779
12699B61905j15103n9219R0836K086p8016n385K7703N686m3723J137l55j83290
12687i5738q3940O7731L6832j33374J15551J96275O8616j74922j25086J37602
12677I547R2585p4043j42801L8437l6L7143P5523O3039l0517j73327k1252o1541
12665a87243L1336M8313n6222O0100J15863j08555J23381K14081J3640J3509j45785
12654A22418j33961L6398Q9488K7671N0942j1089l1562j04884K402J49547j8118
$$ plain form
12643 179252 86059 127732 240332 70012 -19113 -122167 -176598 -114418 -83446 -105189 30068
12632 30068 89182 175181 151219 18364 -46817 -60642 -106341 -83944 68812 -14784 -187481
12621 -187481 -136371 -47857 111764 -20028 -288134 -202399 -162320 -234139 -225193 -25832 79307
12610 79307 -114637 -134280 -161831 60245 123799 -95828 -185219 -27700 -4059 13635 -2372
12599 -2372 137393 268811 183022 29205 84228 115383 216870 248025 174593 63132 -2131
12588 -2131 -9175 49787 132505 189492 338678 424274 366846 114370 161689 261704 238570
12577 238570 160254 51481 78513 119667 181485 201161 64204 115695 232152 345879 408556
12566 408556 229649 135016 120984 133835 141410 119959 194607 143281 98582 -4440 121256
$$ packed form
12643A79252r3193M1673J12600j70320q9125j03054n4431O2180L0972k1743J35257
12632C0068N9114Q5999k3962j32855o5181j3825m5699K2397J52756q3596j72697
12621a87481N1110Q8514J59621j31792k68106Q5735M0079p1819Q946J99361J05139
12610G9307j93944j9643k7551K22076O3554k19627q9391J57519K3641J7694j6007
12599b372J39765J31418q5789j53817N5023L1155J01487L1155p3432j11461o5263
12588b131p044N8962Q2718N6987J49186Q5596n7428k52476M7319J00015k3134
12577B38570p8316j08773K7032M1154O1818J9676j36957N1491J16457J13727O2677
12566D08556j78907r4633j4032J2851P575k1451P4648n1326m4699j03022J25696
$$ plain form
12555 121256 254786 154516 219456 167198 264381 257594 180241 154895 56330 19847 71452
12544 71452 157171 68951 65879 162577 151322 83888 12492 -14380 39459 206350 179923 111671
12532 111671 210230 349294 321204 302358 295957 240454 198663 241372 145333 -13084 118760
12521 118760 352195 212931 88409 -7566 74995 81966 83801 92136 63043 147414 236283
12510 236283 297124 136556 93817 206950 171399 187720 199481 128702 128658 125948 134401 67018
12498 67018 21220 53810 33117 72594 72229 53331 64855 -60536 -141217 -118307 22268 117816
12486 117816 1160 -18278 -27440 58165 115997 153932 58849 89767 61828 70503 109171 39123
12474 39123 136860 113595 5284 33196 9229 -22531 -81486 -59726 7947 83853 100415
$$ packed form
12555A21256J33530j00270O4940n2258R7183o787p7353k5346r8565l6483N1605
12544G1452Q5719q8220l072R6698j1255o7434p1396k6872N3839J66891k6427o8252
12532A11671R8559J39064k8090j8846o401n5503m1791M2709r6039j58417J31844
12521A18760K33435j39264j24522r5975Q2561O971J835Q335k9093Q4371Q8869
12510B36283O0841j60568m2739J13133l5551J6321J1761p0779m4k710Q453o7383
12498F7018m5798L2590k0693L9477l65j8898J1524j25391q0681K2910J40575R5548
12486A17816j16656j9438r162Q5605N7832L7935r5083L0918k7939Q675L8668p0048
12474C9123R7737k3265j08311K7912k3967l1760n8955K1760O7673P5906J6562
$$ plain form
12463 100415 132482 75277 -115458 -221958 -138850 -8127 62362 66509 -1040 -75332 -63934
12452 -63934 82942 238565 222368 198102 272994 167143 65281 194046 284123 250404 179484
12441 179484 -36272 -72304 53440 98925 101864 173701 167428 211564 136080 61504 53443 37987
12429 37987 113521 261511 227860 135447 229407 307771 265736 249959 248325 196480 262333 246087
12417 246087 239658 182257 178020 98208 125570 164332 252982 240720 242826 284928 225198 250598
12405 250598 273141 195672 349737 455190 332606 196973 255535 257899 219690 190305 257509
12394 257509 231186 198211 196681 73440 -41638 99964 187564 150012 93591 45681 140820
12383 140820 257537 201009 143301 129302 160504 187884 351986 421042 254917 97329 94372
$$ packed form
12463A00415L2067n7205j90735j06500Q3108J30723P0489M147o7549p4292J1398
12452f3934J46876J55623j6197k4266P4892j05851j01862J28765R0077l3719p0920
12441A79484k15756l6032J25744M5485K939P1837o273M4136p5484p4576q061j5456
12429C7987P5534J47990l3651r2413R3960P8364m2035j5777j634n1845O5853j6246
12417B46087o429n7401m237p9812K7362L8762Q8650j2262K106M2102n9730K5400
12405B50598K2543p7469J54065J05453j22584j35633N8562K364l8209k9385O7204
12394B57509k6323l2975j530j23241j15078J41602Q7600l7552n6421m7910R5139
12383A40820J16717n6528n7708j3999L1202K7380J64102O9056j66125j57588k957
$$ plain form
12372 94372 31308 63868 208470 12506 -117289 -42243 -88767 -52479 12759 -40967 -38089
12361 -38089 -63093 -47352 65175 144099 74645 63136 72078 67012 127406 199464 184578 169959
12349 169959 221905 271182 325730 387887 429938 390360 178803 230243 152458 158314 228576
12338 228576 391695 421512 460597 362606 240637 105569 2263 129817 265829 160944
12328 160944 32331 154411 164005 152260 279124 463810 445590 229409 70381 45850
12318 45850 51787 88275 223528 245593 195163 263956 278900 226200 300843 308585 259785 414933
12306 414933 571549 550378 478685 448646 468254 490953 553764 454418 414399 344738 384280
12295 384280 463326 459045 288438 140993 175153 224406 283427 343383 271097 159665 200516
$$ packed form
12372I4372o3064L2560J44602j95964j29795P5046m6524L6288O5238n3726K878
12361c8089k5004J5741J12527P8924o9454j1509Q942n066O0394P2058j4886j4619
12349A69959N1946M9277N4548O2157M2051l9578k11557N1440p7785N856P0262
12338B28576J63119K9817L9085r7991j21969j35068j03306J27554J36012j04885
12328A60944j28613J22080R594j1745J26864J84686j8220k16181j59028k4531
12318D5850N937L6488J35253K2065n0430O8793J4944n2700P4643P742m8800J55148
12306D14933J56616k1171p1693l0039J9608K2699O2811r9346m0019o9661L9542
12295C84280P9046m281j70607j47445L4160M9253N9021N9956p2286j11432M0851
$$ plain form
12284 200516 282860 282926 290144 130656 101494 91063 91184 99885 88684 209620 296542 374367
12272 374367 332366 269596 250482 245383 208411 157947 49799 14251 166126 115589 150982
12261 150982 261596 183297 270439 363042 344151 204348 265186 344303 306489 368749 369922
12250 369922 307793 322889 369185 337692 176622 179517 258634 388257 444851 466883 404465
12239 404465 393375 304927 230712 330349 344008 339897 403373 344541 317129 372289 370945 403523
12227 403523 247681 220480 389178 493229 484076 502594 516347 440576 331132 252389 160198
12216 160198 224773 316460 310445 236097 221141 187769 259504 295158 303501 361276 420098 285739
12204 285739 242489 328904 359844 537263 566633 688629 625662 529404 578750 577500 601117
$$ packed form
12284B00516Q2344O6P218j59488k9162j0431J21Q701j1201J20936Q6922P7825
12272C74367m2001o2770j9114n099l6972n0464j08148l5548J51875n0537L5393
12261A50982J10614p8299Q7142R2603j8891j39803O0838P9117l7814O2260J173
12250C69922o2129J5096M6296l1493j61070K895P9117J29623N6594K2032o2418
12239D04465j1090q8448p4215R9637J3659m111O3476n8832k7412N5160j344L2578
12227D03523j55842k7201J68698J04051r153J8518J3753p5771j09444p8743r2191
12216A60198O4575R1687o015p4348j4956l3372P1735L5654Q343N7775N8822j34359
12204B85739m3250Q6415L0940J77419K9370J21996o2967r6258M9346j250K3617
$$ plain form
12193 601117 748309 700439 765344 815067 599102 472167 416035 486279 546142 530874 566342
12182 566342 777448 777855 567826 479743 540585 637470 574764 545684 649824 655761 675786
12171 675786 641692 718899 715629 621995 591038 667721 732676 780409 730974 729106 782416 825298
12159 825298 768078 806278 842417 731374 621485 763980 883907 932048 938533 849214 843610
12148 843610 742476 695067 757351 766344 745283 726988 878033 1002728 972718 890271 912219
12137 912219 1036544 808131 645333 729891 687250 802318 966248 1009608 1006822 943871 867008
12126 867008 918112 1016703 1043894 1053097 1105118 1170558 1113192 1160606 1341238 1374996 1405175
12115 1405175 1364060 1205083 1283310 1473771 1580013 1634648 1705323 1692463 1687329 1744154 1825210
$$ packed form
12193F01117J47192m7870O4905M9723k15965j26935n6132P0244N9863j5268L5468
12182E66342K11106M07k10029q8083O0842R6885o2706k9080J04140N937K0025
12171F75786l4094P7207l270r3634l0957P6683O4955M7733m9435j868N3310M2882
12159H25298n7220L8200L6139j11043j09889J42495J19927M8141O485q9319n604
12148H43610j01134m7409O2284Q993k1061j8295J51045J24695l0010q2447K1948
12137I12219J24325k28413j62798Q4558m2641J15068J63930M3360k786o2951p6863
12126H67008N1104R8591K7191R203N2021O5440n7366M7414J80632L3758L0179
12115A405175m1115j58977P8227J90461J06242N4635P0675j2860n134N6825Q1056
$$ plain form
12104 1825210 1877002 1852195 1819864 1834937 1899088 2098525 2176542 2062115 1869454 1913183 1973718
12093 1973718 2015285 2007637 1931712 1886511 2005438 1994309 2020265 2066925 2054454 2103150 2206492
12082 2206492 2208718 2241362 2313974 2243147 2220123 2410829 2568046 2466855 2435376 2526865 2569948
12071 2569948 2539844 2581475 2702412 2741445 2777379 2872895 2888592 2855258 2871764 2901398 3071149
12060 3071149 3254157 3276836 3260697 3262800 3198696 3073394 3296813 3470947 3528484 3520880 3585911
12049 3585911 3638746 3698030 3806088 3886107 3972812 4162806 4338917 4242747 4207244 4249125 4335840
12038 4335840 4392704 4507532 4691748 4929272 5170997 5387285 5572972 5712736 5878699 6000609
12028 6000609 6069860 6132423 6264712 6470362 6664546 6633196 6762873 7018938 7311239 7562231
$$ packed form
12104A825210N1792k4807l2331J5073O4151J99437P8017j14427j92661M3729O0535
12093A973718M1567p648p5925m5201J18927j1129K5956M6660j2471M8696J03342
12082B206492K226L2644P2612p0827k3024J90706J57217j01191l1479R1489M3083
12071B569948l0104M1631J20937L9033L5934R5516J5697l3334J6506K9634J69751
12060C071149J83008K2679j6139K103o4104j25302K23419J74134N7537p604O5031
12049C585911N2835N9284J08058Q0019Q6705J89994J76111r6170l5503M1881Q6715
12038D335840N6864J14828J84216K37524K41725K16288J85687J39764J65963J21910
12028F000609O9251O2563J32289K05650J94184l1350J29677K56065K92301K50992
$$ plain form
12018 7562231 7991372 8323357 8568749 8660008 8752173 9121448 9564127 9959550 10232735 10563436
12008 10563436 10936788 11342180 11779779 12146343 12573781 12991258 13489916 14073025 14693022
11999 14693022 15346808 16050817 16717523 17385148 18197012 19099312 20037884 20982404 22022793
11990 22022793 23073033 24235540 25590773 27113517 28897625 30465025 32158090 34174093
11982 34174093 36398536 39002446 41701754 44500145 47554767 51072255 55094058 59399310
11974 59399310 64075419 69402106 75116437 81450088 88660739 96869684 106209936 116430451
11966 116430451 128238159 141434054 156141134 172589085 190943475 211057845 232803782
11959 232803782 255918864 280028692 304398763 327964962 349857325 368942431 384079153
$$ packed form
12018G562231M29141L31985K45392R1259R2165L69275M42679L95423K73185L30701
12008A0563436L73352M05392M37599L66564M27438M17477M98658N83109O19997
11999A4693022O53786P04009O66706O67625Q11864R02300R38572R44520J040389
11990B2022793J050240J162507J355233J522744J784108J567400J693065K016003
11982C4174093K224443K603910K699308K798391L054622L517488M021803M305252
11974E9399310M676109N326687N714331O333651P210651Q208945R340252J0220515
11966A16430451J1807708J3195895J4707080J6447951J8354390K0114370K1745937
11959B32803782K3115082K4109828K4370071K3566199K1892363J9085106J5136722
$$ plain form
11952 384079153 394867240 400700672 401251249 396806026 387775266 374741209 358721877 340740844
11944 340740844 321496392 301744359 282156516 262981782 244652310 227580541 211550282
11937 211550282 196631672 182794525 170192733 158699325 148218019 138626795 129922262
11930 129922262 122032218 114871138 108470626 102770966 97481817 92679289 88572824 84875044
11922 84875044 81425821 78101392 74883638 72053493 69474840 67121269 65018036 62794854
11914 62794854 60740010 58753648 56850888 55338904 53904996 52277862 50601770 49045586
11906 49045586 47726714 46378788 45062858 43773377 42671517 41616703 40506928 39486604
11898 39486604 38403365 37317112 36408984 35470166 34577137 33685893 32931587 32217354 31527702
$$ packed form
11952C84079153J0788087N833432N50577m445223r030760j3034057j6019332j7981033
11944C40740844j9244452j9752033j9587843j9174734j8329472j7071769j6030259
11937B11550282j4918610j3837147j2601792j1493408j0481306r591224q704533
11930A29922262p890044p161080o400512n699660n289149m802528m106465l697780
11922H4875044l449223l324429l217754k830145k578653k353571k103233k223182
11914F2794854k054844j986362j902760j511984j433908j627134j676092j556184
11906D9045586j318872j347926j315930j289481j101860j054814j109775j020324
11898C9486604j083239j086253r08128r38818q93029q91244p54306p14233o89652
$$ plain form
11889 31527702 30770591 30049061 29359541 28665002 27964410 27376591 26921213 26291380 25640695
11880 25640695 25217079 24798289 24133678 23356258 22882569 22513026 22192814 21734743 21178205
11871 21178205 20758151 20443709 20023228 19637591 19176676 18806786 18563908 18295115 17954847
11862 17954847 17642680 17323612 17071943 16751704 16441944 16162892 15860247 15593276 15408981
11853 15408981 15210723 14959148 14583162 14427287 14114852 13807920 13639882 13571701 13470329
11844 13470329 13221238 12951679 12689013 12424558 12243033 12054495 11923428 11958341 11800623
11835 11800623 11574108 11319564 11160167 10911640 10570472 10326311 10156813 10063091 9897038
11826 9897038 9662543 9587931 9486809 9437869 9156856 8862535 8742366 8494829 8411030 8251561
$$ packed form
11889C1527702p57111p21530o89520o94539p00592n87819m55378o29833o50685
11880B5640695m23616m18790o64611p77420m73689l69543l20212m58071n56538
11871B1178205m20054l14442m20481l85637m60915l69890k42878k68793l40268
11862A7954847l12167l19068k51669l20239l09760k79052l02645k66971j84295
11853A5408981j98258k51575l75986j55875l12435l06932j68038o8181j01372
11844A3470329k49091k69559k62666k64455j81525j88538j31067L4913j57718
11835A1800623k26515k54544j59397k48527l41168k44161j69498r3722j66053
11826I897038k34495p4612j01122m8940k81013k94321j20169k47537q3799j59469
$$ plain form
11816 8251561 8125341 8016982 7828320 7700057 7755797 7679326 7448796 7221016 7027535 6897786
11806 6897786 6903790 6903142 6753863 6698380 6551204 6430933 6368042 6203219 5993125 5872968 5957348
11795 5957348 5852338 5867601 5861275 5877575 5957720 5965134 5747622 5522108 5521237 5567499 5384378
11784 5384378 5194894 5250048 5037165 4881345 4825566 4902053 4890252 4925310 4813761 4664501
11774 4664501 4614865 4625223 4500108 4364995 4352340 4439503 4478316 4392233 4248076 4173555 4143641
11763 4143641 4218172 4241758 4208240 4148177 4076483 4070405 3923871 3910900 3992721 3953394 3884558
11752 3884558 3733674 3667204 3848948 3821697 3907752 3969045 3869901 3627618 3449041 3399017
11742 3399017 3429008 3397519 3256852 3240929 3216892 3122502 3011693 2984123 3026782 2929837 2791197
$$ packed form
11816H251561j26220j08359j88662j28263N5740p6471k30530k27780j93481j29749
11806F897786O004o48j49279n5483j47176j20271o2891j64823k10094j20157Q4380
11795E957348j05010J5263o326J6300Q0145P414k17512k25514q71M6262j83121
11784E384378j89484N5154k12883j55820n5779P6487j1801L5058j11549j49260
11774D664501m9636J0358j25115j35113j2655Q7163L8813q6083j44157p4521k9914
11763D143641P4531K3586l3518o0063p1694o078j46534j2971Q1821l9327o8836
11752C884558j50884o6470J81744k7251Q6055O1293r9144k42283j78577n0024
11742C399017K9991l1489j40667j5923k4037r4390j10809k7570M2659r6945j38640
$$ plain form
11731 2791197 2692348 2846470 2874156 2759616 2689977 2717071 2788201 2855465 2791424 2719678 2688949
11720 2688949 2620748 2641292 2560648 2383120 2394150 2479335 2377634 2372924 2411844 2377034 2366046
11709 2366046 2449300 2363811 2226837 2445916 2608713 2538978 2423430 2393087 2514774 2492575
11699 2492575 2420715 2468037 2450772 2378256 2350300 2138907 2020391 2007523 2038373 2103863 2008446
11688 2008446 2033117 2015791 1860178 1630311 1445826 1398776 1517177 1570502 1633457 1663536
11678 1663536 1728503 1830307 1694415 1646225 1854505 1925010 1814380 1766453 1779859 1845315
11668 1845315 1771922 1736930 1710681 1659198 1563058 1447131 1535945 1652459 1701302 1781425 1657036
11657 1657036 1424872 1194974 1302194 1349628 1246798 1184633 1275021 1308501 1148875 1160212
$$ packed form
11731B791197r8849J54122K7686j14540o9639K7094P1130O7264o4041p1746l0729
11720B688949o8201K0544q0644j77528J1030Q5185j01701m710L8920l4810j0988
11709B366046Q3254q5489j36974K19079J62797o9735j15548l0343J21687k2199
11699B492575p1860M7322j7265p2516k7956k11393j18516j2868L0850O5490r5417
11688B008446K4671j7326j55613k29867j84485m7050J18401N3325O2955L0079
11678A663536O4967J01804j35892m8190K08280P0505j10630m7927J3406O5456
11668A845315p3393l4992k6249n1483r6140j15927Q8814J16514M8843Q0123j24389
11657A657036k32164k29898J07220M7434j02830o2165R0388L3480j59626J1337
$$ plain form
11647 1160212 1337945 1432255 1377025 1152546 1140340 1082302 1146004 1306681 1458604 1533691
11637 1533691 1408453 1251458 1095091 957116 921168 959495 1081877 1172612 1290849 1376155
11627 1376155 1351013 1259765 1249531 1198216 1228438 1178670 1252708 1325472 1351604 1309242 1221912
11616 1221912 1081739 1064800 1024916 1047168 1090877 1291656 1328168 1245620 1228749 1132215 1083840
11605 1083840 997712 1085612 1085203 1052342 1033111 1065896 1062834 1048361 968272 877081 906339 983224
11593 983224 1003809 1233297 1104142 1000431 886127 862780 1008385 1168905 1143354 1217704
11583 1217704 1311181 1261188 1253531 1199981 1072354 1160389 1198870 1198934 979370 940019 968627 1028456
11571 1028456 1080731 1301492 1243038 1033386 942174 1074616 1139434 917224 815496 927018
$$ packed form
11647A160212J77733R4310n5230k24479j2206n8038O3702J60677J51923P5087
11637A533691j25238j56995j56367j37975l5948L8327J22382R0735J18237Q5306
11627A376155k5142r1248j0234n1315L0222m9768P4038P2764K6132m2362q7330
11616A221912j40173j6939l9884K2252M3709K00779L6512q2548j6871r6534m8375
11605A083840q6128Q7900m09l2861j9231L2785l062j4473q0089r1191K9258P6885
11593I83224K0585K29488j29155j03711j14304k3347J45605J60520k5551P4350
11583A217704R3477m9993p657n3550j27627Q8035L8481O4k19564l9351K8608N9829
11571A028456N2275K20761n8454k09652r1212J32442O4818k22210j01728J11522
$$ plain form
11561 927018 1012882 1003204 839990 903105 942262 889044 875510 1125372 1378184 1360170 1209803
11550 1209803 1058204 1279920 1429226 1550592 1616042 1599588 1472686 1293810 1471546 1619049
11540 1619049 1560849 1370065 1367639 1454074 1484933 1597908 1793672 1969643 2047122 2071296 2082949
11529 2082949 2111987 2282317 2268277 2280198 2407393 2395851 2413935 2650932 2796009 3005650
11519 3005650 3360065 3573528 3835015 4023589 4125864 4515065 4925254 5374759 5848395
11510 5848395 6310576 6599602 7194435 7876591 8284590 8577783 8780294 8919857 9006307 9083033
11500 9083033 8986325 8860022 8724745 8620652 8631486 8678580 8640985 8856037 9109385 9382350
11490 9382350 9835587 10309520 10822814 11583712 12355818 13168052 14186832 15327426 16591234
$$ packed form
11561I27018Q5864r678j63214O3115L9157n3218j3534K49862K52812j8014j50367
11550A209803j51599K21716J49306J21366O5450j6454j26902j78876J77736J47503
11540A619049n8200j90784k426Q6435L0859J12975J95764J75971P7479K4174J1653
11529B082949K9038J70330j4040J1921J27195j1542J8084K36997J45077K09641
11519C005650L54415K13463K61487J88574J02275L89201M10189M49505M73636
11510E848395M62181K89026N94833O82156M07999K93193K02511J39563Q6450P6726
11500I083033r6708j26303j35277j04093J0834M7094l7595K15052K53348K72965
11490I382350M53237M73933N13294P60898P72106Q12234J018780J140594J263808
$$ plain form
11481 16591234 17870718 18771060 19620324 20363198 20836490 20952782 20797017 20524538 20180969
11472 20180969 19666140 18956737 18382913 17743829 16993668 16433963 15997399 15694765 15442893
11463 15442893 15284136 15328971 15507499 15851220 16436948 16981581 17659567 18140184 18800048
11454 18800048 19724467 20562389 21634808 22609633 23656617 24925960 26336032 28030090
11446 28030090 29847353 31732043 33827769 35892483 37774223 39514791 41242329 42818126
11438 42818126 44322825 45783499 47226694 48771385 50531116 52482352 54570211 56382036
11430 56382036 58104454 59710219 61119611 62138171 62805058 63082743 63097084 62945512 62569949
11421 62569949 62114439 61965720 62316165 63219701 64520791 66075520 68083965 70633427 73763319
$$ packed form
11481A6591234J279484R00342Q49264P42874M73292J16292j55765k72479l43569
11472B0180969n14829p09403n73824o39084p50161n59705m36564l02634k51872
11463A5442893j58757M4835J78528L43721N85728N44633O77986M80617O59864
11454A8800048R24419Q37922J072419R74825J046984J269343J410072J694058
11446B8030090J817263J884690K095726K064714J881740J740568J727538J575797
11438D2818126J504699J460674J443195J544691J759731J951236K087859J811825
11430E6382036J722418J605765J409392J018560O66887K77685J4341j51572l75563
11421F2569949m55510j48719L50445R03536J301090J554729K008445K549462L129892
$$ plain form
11412 73763319 77254703 81134972 85526148 90401450 95722128 101149875 106695944 112196565
11404 112196565 117303495 121809499 125532129 128445630 130266169 131015131 130775032 129904565
11396 129904565 128278509 126014572 123490733 121130321 119040811 117379403 116206292 115753407
11388 115753407 116102049 117298341 119169122 121525393 124161239 126854339 129483498 131799352
11380 131799352 133604996 134724177 134905671 134267665 132848683 130605516 127878295 124597134
11372 124597134 120915558 117026582 113041564 108900419 104669950 100723591 96947000 93433110
11364 93433110 90199197 87340719 85051704 83043939 81435645 80297879 79611691 79067079
11356 79067079 78731007 78661110 78509167 78357666 77893154 77343927 76586378 75566494 74193271
$$ packed form
11412G3763319L491384L880269M391176M875302N320678N427747N546069N500621
11404A12196565N106930M506004L722630K913501J820539P48962k40099q70467
11396A29904565j626056k263937k523839k360412k089510j661408j173111m52885
11388A15753407L48642J196292J870781K356271K635846K693100K629159K315854
11380A31799352J805644J119181J81494o38006j418982k243167k727221l281161
11372A24597134l681576l888976l985018m141145m230469l946359l776591l513890
11364I3433110l233913k858478k289015k007765j608294j137766o86188n44612
11356G9067079l36072o9897j51943j51501m64512n49227p57549j019884j373223
$$ plain form
11347 74193271 72802551 71328172 69866101 68383206 67109982 65770910 64422717 62880614
11339 62880614 61228493 59724376 57979121 56091251 54130616 52098659 50133910 48266461
11331 48266461 46519186 44892784 43244295 41546561 40001004 38768111 37643730 36396878
11323 36396878 35141737 34059284 33019021 32154900 31357295 30661719 29986248 29360928 28788949
11314 28788949 28519545 28264704 28170213 28373771 28634983 28990863 29463774 29904172 30374068
11305 30374068 30870650 31189956 31457269 31525121 31544452 31235096 30662960 30022129 29171860 28168672
11295 28168672 27019833 25991944 24809815 23754544 22895542 22157493 21432300 20723208 20088507
11286 20088507 19389718 18943077 18811640 18529599 18290458 18183712 18161064 18138130 18180598 18156112
$$ packed form
11347G4193271j390720j474379j462071j482895j273224j339072j348193j542103
11339F2880614j652121j504117j745255j887870j960635k031957j964749j867449
11331D8266461j747275j626402j648489j697734j545557j232893j124381j246852
11323C6396878j255141j082453j040263q64121p97605o95576o75471o25320n71979
11314B8788949k69404k54841r4491K03558K61212L55880M72911M40398M69896
11305C0374068M96582L19306K67313O7852J9331l09356n72136o40831q50269j003188
11295B8168672j148839j027889j182129j055271q59002p38049p25193p09092o34701
11286B0088507o98789m46641j31437k82041k39141j06746k2648k2934M2468k4486
$$ plain form
11276 18156112 17857159 17691429 17479682 17199117 16816692 16339697 15829378 15346581 14727819
11267 14727819 14232496 13728267 13036159 12416776 12119731 11893922 11655205 11183422 10797871
11258 10797871 10615300 10495418 10093650 9756513 9452645 9282465 9050357 8828847 8631881
11249 8631881 8325664 7990858 7752176 7551655 7180689 6956030 6890315 6972810 6931942 6674961
11239 6674961 6573555 6509640 6389873 6338601 6271349 6109547 5874433 5725668 5691490 5523531
11229 5523531 5346727 5241489 5123606 5140126 5308232 5297671 5062419 4725068 4683385 4692374
11219 4692374 4762253 4720210 4556611 4469339 4508626 4437851 4384113 4441706 4335549 4309038 4167496
11208 4167496 4001545 3755080 3611355 3675560 3675322 3551316 3512272 3597538 3683445 3572016 3451541
$$ packed form
11276A8156112k98953j65730k11747k80565l82425m76995n10319m82797o18762
11267A4727819m95323n04229o92108o19383k97045k25809k38717m71783l85551
11258A0797871j82571j19882m01768l37137l03868j70180k32108k21510j96966
11249H631881l06217l34806k38682k00521l70966k24659o5715Q2495m0868k56981
11239F674961j01406o3915j19767n1272o7252j61802k35114j48765l4178j67959
11229E523531j76804j05238j17883J6520J68106j0561k35252l37351m1683Q989
11219D692374O9879m2043j63599q7272L9287p0775n3738N7593j06157k6511j41542
11208D167496j65951k46465j43725O4205k38j24006l9044Q5266Q5907j11429j20475
$$ plain form
11197 3451541 3290721 3363923 3445880 3297037 3205303 3245634 3278199 3215152 3194596 3091976 2936252
11186 2936252 2829976 2931762 2916685 2834283 2937043 2840656 2775713 2815578 2731792 2727611 2698421
11175 2698421 2603972 2525456 2645365 2651520 2679507 2621213 2496964 2548729 2594258 2458997 2431158
11164 2431158 2462037 2481836 2264564 2145751 2065590 1928081 1959666 2036222 2100352 2010458 1990811
11153 1990811 2036390 2110543 1930461 1970328 1966210 1930161 1807452 1754228 1667440 1478282 1437038
11142 1437038 1558633 1713049 1834049 1800927 1711136 1633563 1449627 1553495 1699208 1660173
11132 1660173 1552127 1564755 1626423 1627206 1532226 1531314 1432356 1322165 1301121 1288269 1340623 1429450
11120 1429450 1333818 1358560 1375347 1308979 1218033 1194839 1249354 1322992 1340475 1423592 1463862
$$ packed form
11197C451541j60820P3202Q1957j48843r1734M0331L2565o3047k0556j02620j55724
11186B936252j06276J01786j5077q2402J02760r6387o4943L9865q3786m181k9190
11175B698421r4449p8516J19909O155K7987n8294j24249N1765M5529j35261k7839
11164B431158L0879J9799k17272j18813q0161j37509L1585P6556O4130q9894j9647
11153A990811M5579P4153j80082L9867m118l6049j22709n3224q6788j89158m1244
11142A437038J21595J54416J21000l3122q9791p7573j83936J03868J45713l9035
11132A660173j08046J2628O1668P83r4980r12r8958j10191k1044j2852N2354Q8827
11120A429450r5632K4742J6787o6368r0946k3194N4515P3638J7483Q3117M0270
$$ plain form
11109 1463862 1430445 1378215 1503710 1641742 1657867 1496441 1398118 1290419 1134555 1057085
11099 1057085 1112206 1117021 919789 824222 817681 914286 896345 798487 764639 804164 671463
11088 671463 733344 860406 944709 1026190 1071947 1108096 1076128 923738 800309 672207 618219
11077 618219 611778 701070 781444 758748 682703 667588 764267 910701 823929 937329 882929
11066 882929 751680 740381 791521 857839 916273 891763 931726 973296 936030 1055436 1241705
11055 1241705 1168472 972964 900944 1041293 1092517 1073129 1191486 1131928 1204569 1247868 1203484
11044 1203484 1163305 1214235 1181790 1209464 1363873 1543410 1509642 1481859 1541428 1527500 1328986
11033 1328986 1203907 1266652 1372345 1461166 1612926 1659415 1852723 2009831 1996432 1952582
$$ packed form
11109A463862l3417n2230J25495J38032J6125j61426r8323j07699j55864p7470
11099A057085N5121M815j97232r5567o541R6605j7941r7858l3848L9525j32701
11088F71463O1881J27062Q4303Q1481M5757L6149l1968j52390j23429j28102n3988
11077F18219o441Q9292Q0374k2696p6045j5115R6679J46434q6772J13400n4400
11066H82929j31249j1299N1140O6318N8434k4510L9963M1570l7266J19406J86269
11055A241705p3233j95508p2020J40349N1224j9388J18357n9558P2641M3299m4384
11044A203484m0179N0930l2445K7674J54409J79537l3768k7783N9569j3928j98514
11033A328986j25079O2745J05693Q8821J51760M6489J93308J57108j3399m3850
$$ plain form
11023 1952582 1959295 1919048 1848930 1798824 1821037 1809535 1662504 1549099 1609514 1690825 1645319
11012 1645319 1740529 1712337 1673365 1559777 1421425 1426795 1330718 1277661 1262663 1245142 1276041
11001 1276041 1386511 1236749 987406 1075200 1112486 1206049 1254255 1096651 1005279 887931
10991 887931 1051966 1231365 1266179 1120359 1039513 1053071 1058429 855115 915427 993096 930896
10980 930896 861467 940162 943737 945388 913605 1018704 1170857 1157874 1170595 1224312 1018655
10969 1018655 902145 979410 1016640 1065309 999994 1073905 1080390 871843 671653 613729 664644
10958 664644 648581 681246 763572 856900 803193 715449 850478 1052018 1116499 953820 758302
10947 758302 779693 814275 910678 971324 900622 696954 761877 737693 666400 868039 789075
$$ packed form
11023A952582O713m0247p0118n0106K2213j1502j47031j13405O0415Q1311m5506
11012A645319R5210k8192l8972j13588j38352N370r6077n3057j4998j7521L0899
11001A276041J10470j49762k49343Q7794L7286R3563M8206j57604r1372j17348
10991H87931J64035J79399L4814j45820q0846J3558N358k03314O0312P7669o2200
10980I30896o9429P8695L575J651l1783J05099J52153j2983J2721N3717k05657
10969A018655j16510P7265L7230M8669o5315P3911O485k08547k00190n7924N0915
10958F64644j6063L2665Q2326R3328n3707q7744J35029K01540O4481j62679j95518
10947G58302K1391L4582R6403O0646p0702k03668O4923k4184p1293K01639p8964
$$ plain form
10936 789075 743628 920717 974798 911335 725951 780704 901012 858594 870003 826025 727967
10925 727967 773874 861907 820381 873302 931999 1132392 1106584 932539 765098 718616 633832
10914 633832 621068 683706 671139 599637 522872 482285 484211 477957 406838 425013 590975 655672
10902 655672 645877 470688 414310 336477 286491 454291 551131 484488 400065 329021 415622
10891 415622 519441 591029 566517 600296 636821 647637 592133 519997 531365 524989 559447
10880 559447 588198 461588 431293 486454 605600 470688 370867 290383 388128 478616 463672
10869 463672 451741 464894 500771 431143 405807 449208 563436 559875 510886 492856 392400
10858 392400 253798 107809 28666 14710 20257 138305 224289 203934 275531 364526 495049
$$ packed form
10936G89075m5447J77089N4081o3463j85384N4753J20308m2418J1409m3978r8058
10925G27967M5907Q8033m1526N2921N8697K00393k5808j74045j67441m6482q4784
10914F33832j2764O2638j2567p1502p6765m0587J926o254p1119J8175J65962O4697
10902F55672r795j75189n6378p7833m9986J67800R6840o6643q4423p1044Q6601
10891D15622J03819P1588k4512L3779L6525J0816n5504p2136J1368o376L4458
10880E59447K8751j26610l0295N5161J19146j34912r9821q0484R7745R0488j4944
10869D63672j1931J3153L5877o9628k5336M3401J14228l561m8989j8030j00456
10858C92400j38602j45989p9143j3956N547J18048Q5984k0355P1597Q8995J30523
$$ plain form
10847 495049 527157 353847 393931 356792 389371 485566 590445 521777 320296 181501 249314
10836 249314 295374 291311 426953 427260 261671 184319 249063 329379 474644 460216 408169
10825 408169 400837 359512 483925 538492 376468 207210 248233 428226 399040 446452 521499
10814 521499 408412 353056 487131 666984 800648 811964 840933 893783 1028548 1391501
10804 1391501 1512698 1596872 1654475 1839977 1869984 2030006 2158885 2151440 2023639 1965712
10794 1965712 1962201 1870152 1718736 1502760 1211324 1084192 1040577 970420 852948 730021
10784 730021 583658 531756 586605 667748 695409 665289 527033 652730 721756 718978 682298
10773 682298 621322 655747 659476 568697 467774 368615 332661 344618 398512 419995 330479
$$ packed form
10847D95049L2108j73310M0084l7139L2579R6195J04879o8668k01481j38795O7813
10836B49314M6060m063J35642L07j65589p7352O4744Q0316J45265j4428n2047
10825D08169p332m1325J24413N4567j62024j69258M1023J79993k9186M7412P5047
10814E21499j13087n5356J34075J79853J33664J1316K8969N2850J34765L62953
10804A391501J21197Q4174N7603J85502L0007J60022J28879p445j27801n7927
10794A965712l511r2049j51416k15976k91436j27132m3615p0157j17472j22927
10784G30021j46363n1902N4849Q1143K7661l0120j38256J25697O9026k778l6680
10773F82298o0976L4425L729r0779j00923r9159l5954J1957N3894K1483q9516
$$ plain form
10762 330479 251050 299845 402741 436025 485472 505286 476598 574701 481830 413343 365694
10751 365694 333933 436093 524046 515970 338241 269514 299315 274086 264004 350097 468813
10740 468813 456222 419616 488971 508650 390532 317142 362101 346340 401690 332769 342993
10729 342993 453204 610739 529680 427160 468854 498991 509267 470121 398632 418263 404386
10718 404386 251022 296727 410011 525990 429548 328121 452977 611928 654586 592884
10708 592884 559717 444323 476710 473042 448844 530615 539653 502388 427807 427333 423487 343933
10696 343933 411170 491670 469191 342617 205219 315891 402232 467411 531927 461718 361739
10685 361739 457231 514818 560447 573796 517136 474846 440365 432180 398885 356726 435170 534889
$$ packed form
10762C30479p9429M8795J02896L3284M9447J9814k8688R8103r2871o8487m7649
10751C65694l1761J02160Q7953q076j77729o8727K9801k5229j0082Q6093J18716
10740D68813j2591l6606O9355J9679j18118p3390M4959j5761N5350o8921J0224
10729C42993J10211J57535q1059j02520M1694L0137J0276l9146p1489J9631j3877
10718D04386j53364M5705J13284J15979r6442j01427J24856J58951M2658o1702
10708E92884l3167j15394L2387l668k4198Q1771R038l7265p4581m74l846p9554
10696C43933O7237Q0500k2479j26574j37398J10672Q6341O5179O4516p0209r9979
10685C61739R5492N7587M5629J3349n6660m2290l4481q185l3295m2159P8444R9719
$$ plain form
10673 534889 631202 732321 786856 724767 716809 627984 678143 804968 897021 1030307 1206535
10662 1206535 1267075 1204968 1181894 1083432 1036542 1121006 1198209 1428078 1525557 1485064 1579133
10651 1579133 1632132 1812846 2141646 2394294 2626857 2786592 2935961 3136944 3487490 3846578
10641 3846578 4218152 4610653 5036186 5691867 6194334 6792887 7422191 8153122 9131756
10632 9131756 10216851 11364770 12840405 14847501 17257578 20200776 23433116 27330700
10624 27330700 31703160 36473180 41334627 45837132 50075129 54265038 58217489 62076444
10616 62076444 65969238 70137451 74862491 80525320 87097378 94304672 101423487 107772641
10608 107772641 113288744 117854318 121495475 124540772 127021460 129496292 132575739 137087176
$$ packed form
10673E34889R6313J01119N4535o2089p958q8825N0159J26825R2053J33286J76228
10662A206535O0540o2107k3074r8462m6890Q4464P7203K29869R7479m0493R4069
10651A579133N2999J80714L28800K52648K32563J59735J49369K00983L50546L59088
10641C846578L71574L92501M25533O55681N02467N98553O29304P30931R78634
10632I131756J085095J147919J475635K007096K410077K943198L232340L897584
10624B7330700M372460M770020M861447M502505M237997M189909L952451L858955
10616F2076444L892794M168213M725040N662829O572058P207294P118815O349154
10608A07772641N516103M565574L641157L045297K480688K474832L079447M511437
$$ plain form
10600 137087176 142804185 149260392 155307024 160040090 163035712 164392415 164112379 162216246
10592 162216246 158650153 154411480 150534751 147688173 145908195 144829785 143795593 142192007
10584 142192007 139723579 136313525 131991210 126610983 120469279 113992798 107749130 102292218
10576 102292218 97799172 93912880 90230844 86501081 82518603 78417296 74007204 69212134
10568 69212134 64341791 59270240 54382509 49826778 45737408 42083896 38797021 36044252
10560 36044252 33809381 31730158 29703999 28145954 26697486 25361492 24270443 23375784
10552 23375784 22404485 21426901 20611156 19888800 19283628 18799028 18271124 17728136 17200321
10543 17200321 16700265 16307397 15933083 15600025 15275434 14989850 14621375 14043717 13647231
$$ packed form
10600A37087176N717009O456207O046632M733066K995622J356703k80036j896133
10592A62216246l566093m238673l876729k846578j779978j078410j034192j603586
10584A42192007k468428l410054m322315n380227o141704o476481o243668n456912
10576A02292218m493046l886292l682036l729763l982478m101307m410092m795070
10568F9212134m870343n071551m887731m555731m089370l653512l286875k752769
10560C6044252k234871k079223k026159j558045j448468j335994j091049q94659
10552B3375784r71299r77584q15745p22356o05172m84600n27904n42988n27815
10543A7200321n00056l92868l74314l33058l24591k85584l68475n77658l96486
$$ plain form
10534 13647231 13436783 13136781 12869294 12559964 12246489 11988530 11725884 11517442 11453540
10525 11453540 11262530 11006416 10663788 10490861 10385512 10321455 10113419 9965294 9758403
10516 9758403 9602075 9441325 9231978 8964045 8767588 8650325 8625828 8537256 8381759 8285059
10506 8285059 8149853 7922198 7745183 7659834 7648367 7624249 7489703 7389810 7340840 7245110
10496 7245110 7220798 7189180 7079028 7077163 6954959 6608785 6486830 6456853 6365619 6335162 6286175
10485 6286175 6228626 6085929 6029414 6105033 6031583 5951207 5888765 5867923 5860282 6003708 5926324
10474 5926324 5756059 5639997 5492118 5492577 5560738 5524303 5641390 5658579 5666108 5647243 5494863
10463 5494863 5301113 5366193 5587248 5676752 5632868 5710516 5752270 5766375 5968449 6275528
$$ packed form
10534A3647231k10448l00002k67487l09330l13475k57959k62646k08442o3902
10525A1453540j91010k56114l42628j72927j05349o4057k08036j48125k06891
10516I758403j56328j60750k09347k67933j96457j17263k4497q8572j55497r6700
10506H285059j35206k27655j77015q5349j1467k4118j34546r9893m8970r5730
10496G245110k4312l1618j10152j865j22204l46174j21955k9977r1234l0457m8987
10485F286175n7549j42697n6515P5619p3450q0376o2442k0842p641J43426p7384
10474E926324j70265j16062j47879M59O8161l6435J17087J7189P529j8865j52380
10463E494863j93750O5080K21055Q9504m3884P7648M1754J4105K02074L07079
$$ plain form
10453 6275528 6471852 6668310 6733351 6796835 7006809 7314244 7582841 7714960 7995636 8311472
10443 8311472 8671871 9038359 9435120 9853084 10421008 10979627 11575442 12341405 13192140
10434 13192140 14018089 14894270 15967658 17333520 19028650 20808157 22748139 24899269
10426 24899269 27263089 29919403 33097459 36760324 40749851 45584170 51294837 58029621
10418 58029621 66342328 76675986 89384574 104929079 123767398 145991863 171330136
10411 171330136 199222519 228565278 258157097 286646614 312546548 334279134 350283424
10404 350283424 359782482 362376252 358111837 347533784 331256953 310702517 287741421
10397 287741421 263498697 238903115 215020401 192722094 172711875 155015304 139453145
$$ packed form
10453F275528J96324J96458O5041O3484K09974L07435K68597J32119K80676L15836
10443H311472L60399L66488L96761M17964N67924N58619N95815P65963Q50735
10434A3192140Q25949Q76181J073388J365862J695130J779507J939982K151130
10426B4899269K363820K656314L178056L662865L989527M834319N710667O734784
10418E8029621Q312707J0333658J2708588J5544505J8838319K2224465K5338273
10411A71330136K7892383K9342759K9591819K8489517K5899934K1732586J6004290
10404C50283424R499058K593770m264415j0578053j6276831k0554436k2961096
10397B87741421k4242724k4595582k3882714k2298307k0010219j7696571j5562159
$$ plain form
10390 139453145 125839377 114006178 103681737 94633364 86699621 79770414 73519858
10383 73519858 67941226 63128981 58883315 55152721 51717387 48722827 46293023 44181666
10375 44181666 42135710 40210702 38614780 37141441 35798970 34378495 33248954 32195601
10367 32195601 31179894 30135704 29324993 28550412 27766585 27055130 26394173 25722587 25007057
10358 25007057 24464498 23941265 23313477 22616703 22054386 21489215 21145134 20704567 20126864
10349 20126864 19644666 19078900 18577059 18091014 17710337 17448989 17043197 16618141 16336763
10340 16336763 15905303 15456743 15062818 14649339 14306588 14016176 13759974 13457844 13149492
10331 13149492 12946235 12861123 12660286 12491500 12329963 12253680 11986754 11682426 11347266 10985642
$$ packed form
10390A39453145j3613768j1833199j0324441r048373p933743o929207o250556
10383G3519858n578632m812245m245666l730594l435334k994560k429804k111357
10375D4181666k045956j925008j595922j473339j342471j420475j129541j053353
10367C2195601j015707j044190q10711p74581p83827p11455o60957o71586p15530
10358B5007057n42559n23233o27788o96774n62317n65171l44081m40567n77703
10349B0126864m82198n65766n01841m86045l80677k61348m05792m25056k81378
10340A6336763m31460m48560l93925m13479l42751k90412k56202l02130l08352
10331A3149492k03257q5112k00837j68786j61537p6283k66926l04328l35160l61624
$$ plain form
10321 10985642 10700121 10531522 10412587 10398960 10249758 9984334 9795130 9587324 9359297
10312 9359297 9135441 9055438 9068873 8861236 8697955 8586345 8462713 8236561 8106512 7841170
10302 7841170 7773715 7683747 7612480 7634718 7595138 7353389 7175993 7051526 6992193 6918323 6953958
10291 6953958 6771621 6558596 6383185 6246873 6126159 6002648 6051010 6022193 5971026 5975716
10281 5975716 5744606 5632224 5562852 5446541 5462577 5463661 5347010 5210971 5201400 4973755
10271 4973755 4829515 4836593 4789297 4599659 4412941 4313656 4415230 4330035 4277355 4200690 4175058
10260 4175058 4077753 3933169 3654632 3590732 3718897 3618896 3532788 3589287 3400290 3358816
10250 3358816 3400687 3430907 3519889 3440573 3300339 3245117 3101731 3102105 3103807 3130795 3004471
$$ packed form
10321A0985642k85521j68599j18935j3627j49202k65424j89204k07806k28027
10312I359297k23856q0003J3435k07637j63281j11610j23632k26152j30049k65342
10302G841170o7455q9968p1267K2238l9580k41749j77396j24467n9333p3870L5635
10291F953958j82337k13025j75411j36312j20714j23511M8362k8817n1167M690
10281E975716k31110j12382o9372j16311J6036J084j16651j36039r571k27645
10271D973755j44240P078m7296j89638j86718r9285J01574q5195n2680p6665k5632
10260D175058r7305j44584k78537o3900J28165j00001q6108N6499j88997m1474
10250C358816M1871L0220Q8982p9316j40234n5222j43386L74J702K6988j26324
$$ plain form
10239 3004471 2919507 2862246 2936076 3055435 3061649 2949567 2902266 2927616 2921849 2796304 2710573
10228 2710573 2643957 2419356 2471337 2551126 2553224 2433226 2355365 2380848 2302302 2245129 2272791
10217 2272791 2139240 2036724 2058779 2110598 2152720 2121625 2196985 2298303 2101193 1990908
10207 1990908 1942095 1880341 1887779 1887833 1803856 1772012 1889725 1910422 1889227 1929769 1969256 2014346
10195 2014346 1898561 1847539 1873229 1711292 1646275 1653960 1693330 1677611 1711933 1811671 1762544
10184 1762544 1714927 1648203 1676122 1724975 1779478 1871360 1806015 1859171 1848316 1827997 1850016
10173 1850016 1786304 1741875 1775263 1834550 1885710 1869955 1850522 1761789 1663404 1764427 1804759
10162 1804759 1820269 1952558 1940204 1993582 2041040 2094530 2016672 1962423 1940754 1887784 1770247
$$ packed form
10239C004471q4964n7261P3830J19359O214j12082m7301K5350n767j25545q5731
10228B710573o6616k24601N1981P9789K098j19998p7861K5483p8546n7173K7662
10217B272791j33551j02516K2055N1819M2122l1095P5360J01318j97110j10285
10207A990908m8813o1754P438N4q3977l1844J17713K0697k1195M0542L9487M5090
10195B014346j15785n1022K5690j61937o5017P685L9370j5719L4322R9738m9127
10184A762544m7617o6724K7919M8853N4503R1882o5345N3156j0855k0319K2019
10173A850016o3712m4429L3388N9287N1160j5755j9433q8733r8385J01023M0332
10162A804759J5510J32289j2354N3378M7458N3490p7858n4249k1669n2970j17537
$$ plain form
10151 1770247 1632813 1498079 1523540 1674435 1556709 1442735 1430899 1504118 1656225 1671115
10141 1671115 1516885 1522921 1399731 1379156 1296786 1200822 1095826 1110891 1172256 1211844 1153797
10130 1153797 1098006 1102100 1059384 1030408 1045661 1007420 990383 947264 840133 865011 829117
10119 829117 733164 780416 770915 797155 881774 883409 815615 743961 701521 814527 796013 748027
10107 748027 838532 852313 900972 880807 837057 872225 877008 768943 590550 578065 555904
10096 555904 416739 482126 482279 531657 554986 600641 619284 587445 541507 582843 617749 618308
10084 618308 723907 782396 879838 896975 846968 718689 633536 559490 534513 531692 593982
10073 593982 586895 543477 535407 619153 680702 668248 590165 615788 597556 608558 687370 524772
$$ packed form
10151A770247j37434j34734K5461J50895j17726j13974j1836P3219J52107J4890
10141A671115j54230O036j23190k0575q2370r5964j04996J5065O1365L9588n8047
10130A153797n5791M094m2716k8976J5253l8241j7037m3119j07131K4878l5894
10119H29117r5953M7252r501K6240Q4619J635o7794p1654m2440J13006j8514m7986
10107G48027R0505J3781M8659k0165m3750L5168M783j08065j78393j2485k2161
10096E55904j39165O5387J53M9378K3329M5655J8643l1839m5938M1336L4906N59
10084F18308J05599N8489R7442J7137n0007j28279q5153p4046k4977k821O2290
10073E93982p087m3418q070Q3746O1549j2454p8083K5623j8232J1002P8812j62598
$$ plain form
10061 524772 462842 489703 527879 498532 629502 650114 730711 798060 741621 554543 421057
10050 421057 375787 392143 447678 367637 422862 444823 400711 377304 344038 488608 633565
10039 633565 501173 417617 556816 610561 697008 687351 580314 680092 712388 591157 654246
10028 654246 602363 526830 603182 767217 866700 836179 826108 853963 928407 857413 779147
10017 779147 712493 763093 739161 925527 1197517 1447583 1555288 1651571 1834217 2015153
10007 2015153 2072143 2180194 2272436 2251058 2323987 2186047 2055540 1893954 1737919 1730813
9997 1730813 1734445 1511315 1377926 1330125 1324833 1305404 1109114 810083 675095 622208 721008
9986 721008 749620 766451 667858 644638 653023 624273 529194 408499 300684 339979 468145
$$ packed form
10061E24772o1930K6861L8176k9347J30970K0612Q0597O7349n6439j87078j33486
10050D21057m5270J6356N5535q0041N5225K1961m4112k3407l3266J44570J44957
10039F33565j32392q3556J39199N3745Q6447r657j07037R9778L2296j21231O3089
10028F54246n1883p5533P6352J64035R9483l0521j0071K7855P4444p0994p8266
10017G79147o6654N0600k3932J86366K71990K50066J07705R6283J82646J80936
10007B015153N6990J08051R2242k1378P2929j37940j30507j61586j56035p106
9997A730813L632k23130j33389m7801n292j9429j96290k99031j34988n2887R8800
9986G21008K8612J6831r8593k3220Q385k8750r5079j20695j07815L9295J28166
$$ plain form
9975 468145 566566 569357 515223 575683 521555 430310 415799 396861 327748 336987 338555 464836
9963 464836 469129 516843 543987 415484 311358 317830 269334 238918 400618 492922 496728 457191
9951 457191 358933 471423 449801 488875 520381 493888 453748 413470 384124 355783 191041
9940 191041 108322 193647 285418 361288 326256 330282 265887 106396 197669 345964 492043
9929 492043 669050 588345 458012 393497 359338 367756 405690 382865 443090 302214 217111
9918 217111 306864 264849 104450 8095 129388 210951 204546 80828 -75255 -34134 40294
9907 40294 177227 299924 278086 193009 122220 84514 52208 136495 208753 191356 175224
9896 175224 233336 398003 530979 419107 374810 444548 312956 214716 238400 111980 4212
$$ packed form
9975D68145R8421K791n4134O0460n4128r1245j4511j8938o9113R239J568J26281
9963D64836M293M7714K7144j28503j04126O472m8496l0416J61700R2304L806l9537
9951D57191r8258J12490k1622L9074L1506k6493m0140m0278k9346k8341j64742
9940A91041q2719Q5325R1771P5870l5032M026o4395j59491R1273J48295J46079
9929D92043J77007q0705j30333o4515l4159Q418L7934k2825O0225j40876q5103
9918B17111Q9753m2015j60399r6355J21293Q1563o405j23718j56083M1121P4428
9907D0294J36933J22697k1838q5077p0789l7706l2306Q4287P2258j7397j6132
9896A75224N8112J64667J32976j11872m4297O9738j31592r8240K3684j26420j07768
$$ plain form
9885 4212 -191908 -209409 -43982 -101265 -82689 171001 233931 113338 2074 136775 315485
9874 315485 395637 382338 374752 225494 82596 106167 163151 134971 94249 159338 173214
9863 173214 186205 280463 359014 436254 387973 353175 510691 575170 567223 486421 427817 486694
9851 486694 442719 409125 369843 244185 217932 109700 134976 60002 101025 63218 8670
9840 8670 87673 269779 258565 187863 231633 190025 43110 -79159 158945 306730 256112
9829 256112 120022 146949 86808 -63531 53389 159067 254758 184770 111135 73467 53718
9818 53718 25059 29181 101081 47655 34793 4395 -33868 54502 272965 388943 211930
9807 211930 98289 88510 287564 290909 219683 208924 135327 117573 88522 -12847 -44153
$$ packed form
9885D212j96120j7501J65427n7283J8576K53690O2930j20593j11264J34701J78710
9874C15485Q0152j3299p586j49258j42898K3571N6984k8180m0722O5089J3876
9863A73214J2991R4258P8551P7240m8281l4798J57516O4479p947q0802n8604N8877
9851D86694m3975l3594l9282j25658k6253j08232K5276p4974M1023l7807n4548
9840H670P9003J82106j1214p0702M3770m1608j46915j22269K38104J47785n0618
9829B56112j36090K6927o0141j50339J16920J05678R5691o9988p3635l7668j9749
9818E3718k8659M122P1900n3426j2862l0398l8263Q8370K18463J15978j77013
9807B11930j13641r779J99054L345p1226j0759p3597j7754k9051j01369l1306
$$ plain form
9796 -44153 -274097 -168311 80102 123299 240017 296340 246330 145275 125405 62556 -10688
9785 -10688 17472 88048 95965 148819 181412 125543 54736 98571 60435 93452 69839 56990
9773 56990 -100479 -130855 -30928 -85026 -146866 -132499 -222616 -246019 -126460 -73632 85541
9762 85541 164227 251987 352842 295019 291095 241768 136736 152978 151942 155849 119818 23257
9750 23257 58035 76144 164194 236671 329451 313183 241137 309941 302782 275803 251607 146989
9738 146989 162347 153379 102649 76190 164666 190460 144508 143933 181827 222821 203191 281980
9726 281980 276017 155654 109204 8634 -71145 26024 140505 267325 225543 139393 75741
9715 75741 228286 194912 109912 101577 74580 -3578 21539 -15320 -15868 -30902 19756 9333
$$ packed form
9796d4153k29944J05786K48413M3197J16718N6323n0010j01055j9870o2849p3244
9785a0688K8160P0576P917N2854L2593n5869p0807M3835l8136L3017k3613j2849
9773E6990j57469l0376R9927n4098o1840J4367r0117k3403J19559N2828J59173
9762H5541P8686Q7760J00855n7823l924m9327j05032J6242j036L907l6031r6561
9750B3257L4778J8109Q8050P2477R2780j6268p2046O8804p159k6979k4196j04618
9738A46989J5358q968n0730k6459Q8476K5794m5952n75L7894M0994j9630P8789
9726B81980n963j20363m6450j00570p9779R7169J14481J26820m1782q6150o3652
9715G5741J52545l3374q5000q335k6997p8158K5117l6859n48j5034N0658j0423
$$ plain form
9703 9333 162399 196487 247945 252721 226743 250816 184666 148569 217708 101755 -66696 13794
9691 13794 114894 179892 111079 55351 117792 147035 126175 232968 156531 90702 -20225
9680 -20225 -41737 22536 47238 -121 28496 198100 298476 169191 56937 33026 52085
9669 52085 37607 94725 163112 76460 7946 7762 -13455 29112 -44288 15373 188681 302427
9657 302427 286818 247842 330917 312166 277634 345355 221621 183869 203656 217738 57360
9646 57360 98511 189245 290571 450999 369078 201478 118425 193900 204596 85112 67158
9635 67158 59861 -43482 23603 -24864 35195 162880 143778 46758 -14733 45031 48304 45792
9623 45792 137433 200407 50924 -106882 -66174 -79068 1318 -47213 -91662 -88069 34969
$$ packed form
9703I333J53066L4088N1458M776k5978K4073o6150l6097O9139j15953j68451Q0490
9691A3794J01100O4998o8813n5728O2441K9243k0860J06793p6437o5829j10927
9680b0225k1512O4273K4702m7359K8617J69604J00376j29285j12254k3911J9059
9669E2085j4478N7118O8387q6652o8514j84k1217M2567p3400N9661J73308J13746
9657C02427j5609l8976Q3075j8751l4532O7721j23734l7752J9787J4082j60378
9646E7360M1151R0734J01326J60428q1921j67600q3053P5475J0696j19484j7954
9635F7158p297j03343O7085m8467O0059J27685j9102r7020o1491N9764L273k512
9623D5792R1641O2974j49483j57806M0708j2894Q0386m8531m4449L593J23038
$$ plain form
9612 34969 72315 -32128 -69114 -52930 50132 -14707 -138219 -168709 -90647 -44644 42107
9601 42107 61080 31042 130514 145242 91270 32212 197742 282854 249304 277339 255115 227659
9589 227659 179487 213401 216144 325818 359232 277890 81038 57912 50567 -134641 -58662
9578 -58662 118904 138883 34788 2775 -61532 -124247 -69959 -78259 -37457 -16962 10614 -34755
9566 -34755 145451 268859 221548 151493 125139 127977 310919 385213 290444 176073 -1414
9555 -1414 -46143 26304 196209 288031 300399 184675 -57858 -24271 23183 -41600 -105246
9544 -105246 -103918 -83441 214 22786 49944 55033 112895 189694 262997 305164 226046 141051
9532 141051 -11252 -218902 -190953 -143467 -200780 -273310 -128495 -77462 -33352 27237 44121
$$ packed form
9612C4969L7346j04443l6986J6184J03062o4839j23512l0490P8062M6003Q6751
9601D2107J8973l0038R9472J4728n3972n9058J65530Q5112l3550K8035k2224k7456
9589B27659m8172L3914K743J09674L3414q1342j96852k3126p345j85208P5979
9578e8662J77566J9979j04095l2013o4307o2715N4288q300M0802K0495K7576m5369
9566c4755J80206J23408m7311p0055k6354K838J82942P4294r4769j14371j77487
9555a414m4729P2447J69905R1822J2368j15724k42533L3587M7454o4783o3646
9544a05246J328K0477Q3655K2572K7158N089N7862P6799P3303M2167p9118q4995
9532A41051j52303k07650K7949M7486n7313p2530J44815N1033M4110O0589J6884
$$ plain form
9521 44121 80714 87152 100328 17755 63478 152867 192865 56100 36983 -13676 33375 110776
9509 110776 161131 135231 121332 127256 182785 233172 171243 217687 309273 294140 281439 277827
9497 277827 213143 163674 34849 -24586 -105333 21323 74661 78111 149955 140032 135415 104957
9485 104957 65886 63600 -73859 36720 152946 248335 286871 314859 171381 -56709 24356
9474 24356 20330 157839 191456 -6615 -64752 108473 132968 223511 321882 315262 174969
9463 174969 -29350 -103306 -43383 40936 107596 23403 16530 -147965 -116110 -95321 -92070 152370
9451 152370 246234 231957 10129 -66281 -99260 -141903 -31320 -44944 1606 -113924 -107910
9440 -107910 30823 4070 -89762 -4787 16769 -82492 -104048 10948 12419 -43916 4227
$$ packed form
9521D4121L6593O438J3176q2573M5723Q9389L9998j36765j9117n0659M7051P7401
9509A10776N0355k5900j3899N924N5529N0387o1929M6444R1586j5133j2701l612
9497B77827o4684m9469j28825n9435q0747J26656N3338L450P1844r923m617l0458
9485A04957l9071k286j37459J10579J16226R5389L8536K7988j43478k28090Q1065
9474B4356m026J37509L3617j98071n8137J73225K4495R0543R8371o620j40293
9463A74969k04319p3956N9923Q4319O6660q4193o873j64495L1855K0789L251K44440
9451A52370R3864j4277k21828p6410l2979m2643J10583j3624M6550j15530O014
9440a07910J38733k6753r3832Q4975K1556r9261k1556J14996J471n6335M8143
$$ plain form
9429 4227 159378 94439 -51879 113994 208883 54243 -75174 -40407 -74949 -130756 -79013
9418 -79013 -1228 56726 -22566 -45941 -126609 -166291 -256869 -165758 -119493 -2811 -16629 116378
9406 116378 117769 -57179 -85033 -25092 42565 -34868 -20160 -169 -9366 -28957 84077 102895
9394 102895 39708 -87207 -153448 -144093 -117071 6482 32096 42549 31961 83197 46716
9383 46716 -44043 -10820 -54989 -201685 -349739 -326375 -122418 -58223 -136545 -219847 -22686
9372 -22686 -19644 16233 33727 48129 -23563 -100600 7655 122661 225544 91011 75373
9361 75373 117881 54405 -48178 -56675 -41115 72859 4367 14361 -8235 145382 25596
9350 25596 -41290 53504 126006 179601 173926 109435 132750 267570 227525 147272 159659 160616
$$ packed form
9429D227J55151o4939j46318J65873R4889j54640j29417L4767l4542n5807N1743
9418g9013P7785N7954p9292k3375q0668l9682r0578R1111M6265J16682j3818J33007
9406A16378J391j74948k7854N9941O7657p7433J4708J9991r197j9591J13034J8818
9394A02895o3187j26915o6241R355K7022J23553K5614J0453j0588N1236l6481
9383D6716r0759L3223m4169j46696j48054K3364K03957O4195p8322q3302J97161
9372b2686L042L5877J7494J4402p1692p7037J08255J15006J02883j34533j5638
9361G5373M2508o3476j02583q497J5560J13974o8492R994k2596J53617j19786
9350B5596o6886R4794P2502N3595n675o4491K3315J34820m0045q0253J2387R57
$$ plain form
9338 160616 119690 -29864 -63438 6047 35393 157786 186503 79755 118527 158798 165138
9327 165138 141783 142793 168518 174686 156486 135420 63583 7241 -9826 -61748 -68446 -42119
9315 -42119 -86924 -73322 -65605 -39882 125663 1843 -84822 -116771 -65722 19551 57334 214263
9303 214263 191882 70898 41041 65421 212762 357628 280087 150820 184945 145885 93991
9292 93991 -48474 -152704 -68066 -50126 8443 -70228 -87604 -18693 -43421 -14535 49063
9281 49063 73195 135325 106925 92591 143043 249027 127589 38841 -69589 -46619 -50708
9270 -50708 57196 191177 117122 106821 137980 104295 54282 18805 -78966 -133610 -28312
9259 -28312 30915 110315 270909 225063 -9922 -129779 -213873 -274039 -153399 -93100 -106335
$$ packed form
9338A60616m0926j49554l3574O9485K9346J22393K8717j06748L8772M0271O340
9327A65138k3355J010K5725O168j8200k1066p1837n6342j7067n1922o698K6327
9315d2119m4805J3602P717K5723J65545j23820q6665l1949N1049Q5273L7783J56929
9303B14263k2381j20984k9857K4380J47341J44866p7541j29267L4125l9060n1894
9292I3991j42465j04230Q4638J7940N8569p8671j7376O8911k4728K8886O3598
9281D9063K4132O2130k8400j4334N0452J05984j21438q8748j08430K2970m089
9270e0708J07904J33981p4055j0301L1159l3685n0013l5477r7771n4644J05298
9259b8312N9227P9400J60594m5846k34985j19857q4094o0166J20640O0299j3235
$$ plain form
9248 -106335 9200 192469 159574 203978 86045 -7672 4886 80423 81562 76305 41421
9237 41421 57176 11889 77311 42850 -59456 59602 81681 131848 48693 23672 -63544
9226 -63544 -8719 97425 48942 -78148 -167588 -104404 76931 140976 81670 77133 -30977
9215 -30977 -89162 -84413 11145 37136 70169 10634 -93574 -121538 -8813 193762 115618
9204 115618 109190 174020 143647 159693 240422 263466 144815 5643 -51097 -175453 -183872
9193 -183872 -103051 -47574 -60816 88343 53537 127725 101338 18026 -27904 83497 175939
9182 175939 69148 63092 110106 147765 86522 69296 36897 40502 275231 176830 150910 148460
9170 148460 227386 155039 124859 109693 143376 116458 88017 172392 136603 153018 182635 107875
$$ packed form
9248a06335J15535J83269l2895M4404j17933r3717J2558P5537J139n257l4884
9237D1421J5755m5287O5422l4461j02306J19058K2079N0167q3155k5021q7216
9226f3544N4825J06144m8483j27090q9440O3184J81335O4045n9306m537j08110
9215c0977n8185M749R5558K5991L3033n9535j04208k7964J12725K02575p8144
9204A15618o428O4830l0373J6046Q0729K3044j18651j39172n6740j24356q419
9193a83872Q0821N5477j3242J49159l4806P4188k6387q3312m5930J11401R2442
9182A75939j06791o056M7014L7659o1243j7226l2399L605K34729r8401k5920k450
9170A48460P8926p2347l0180j5166L3683k6918k8441Q4375l5789J6415K9617p4760
$$ plain form
9158 107875 -69137 -173110 -250629 -90530 16499 121069 209129 198682 76262 143260
9148 143260 90906 73021 100538 -20772 -47394 -4488 96138 117585 -5879 -86495 -24046
9137 -24046 86799 249708 345357 188771 -49930 -81581 -28990 -14294 -156702 -129734 -114478
9126 -114478 -160998 -148085 8866 127934 138090 8746 -81590 -125127 14919 152403 88750
9115 88750 -28180 -144381 -164540 -91815 1288 152329 258184 247036 164770 129053 53906
9104 53906 -112046 -68046 121515 297613 262153 148474 28575 112881 230476 271084 268065
9093 268065 143529 34331 125903 145296 165109 109090 -1557 6225 32802 121931 211192
9082 211192 295107 169140 54533 70644 137612 35249 10795 57969 -727 114983 210637
$$ packed form
9158A07875j77012j03973p7519J60099J07029J04570Q8060j0447j22420O6998
9148A43260n2354j7885K7517j21310k6622M2906J00626K1447j23464q0616O2449
9137b4046J10845J62909R5649j56586k38701l1651N2591J4696j42408K6968J5256
9126a14478m6520J2913J56951J19068J0156j29344r0336m3537J40046J37484o3653
9115H8750j16930j16201k0159P2725R3103J51041J05855j1148q2266l5717p5147
9104E3906j65952M4000J89561J76098l5460j13679j19899Q4306J17595M0608l019
9093B68065j24536j09198R1572J9393J9813n6019j10647P782K6577Q9129Q9261
9082B11192Q3915j25967j14607J6111O6968j02363k4454M7174n8696J15710R5654
$$ plain form
9071 210637 238691 233547 221856 221036 280159 172946 6829 4164 8637 -23866 -3896 42491
9059 42491 67653 33609 13345 93514 76963 -50114 -48935 -33004 12076 141227 116223 -45565
9047 -45565 -87552 81472 101643 -118223 -122119 -34442 -132002 -181281 -202894 -137938 -83477 -39767
9035 -39767 74389 7605 -38187 98518 171065 212160 280700 304324 287190 122891 96552
9024 96552 10253 33949 58550 26950 -111874 -214211 -217019 -167925 -70927 -23059 -55035 55380
9012 55380 -3599 61043 68620 19817 -93689 -104105 -107297 -51058 -30774 3792 78389 124579
9000 124579 89153 4496 -132344 -158908 -289987 -171847 -23554 106482 107493 52312 136095
8989 136095 125743 83130 50336 16125 42158 7985 86742 -71108 -233622 -136370 63067
$$ packed form
9071B10637K8054n144j1691q20N9123j07213j66117k665M473l2503J9970M6387
9059D2491K5162l4044k0264Q0169j6551j27077J179J5931M5080J29151k5004j61788
9047d5565m1987J69024K0171k19866l896Q7677r7560m9279k1613O4956N4461M3710
9035c9767J14156o6784m5792J36705P2547M1095O8540K3624j7134j64299k6339
9024I6552q6299K3696K4601l1600j38824j02337k808M9094R6998M7868l1976J10415
9012E5380n8979O4642P577m8803j13506j0416l192N6239K0284L4566P4597M6190
9000A24579l5426q4657j36840k6564j31079J18140J48293J30036J011n5181Q3783
8989A36095j0352m2613l2794l4211K6033l4173P8757j57850j62514R7252J99437
$$ plain form
8978 63067 86754 12725 2447 -62486 -79036 7971 67775 -16782 -175962 -136110 -36985 92446
8966 92446 53924 59464 53672 -92374 -230224 -335649 -369110 -244028 -174060 -133927 2253
8955 2253 37948 -58700 -110743 -26111 106316 295204 322192 296462 218476 51501 -54824
8944 -54824 -43293 125570 259462 281594 288541 287655 215162 173020 20581 -63426 -50112 192278
8932 192278 187517 78950 48364 9071 6938 -12100 -69675 -41748 -75303 25046 40419 145135
8920 145135 277663 209863 -58630 -62823 85777 262672 154166 31551 -50395 -93622 -175947
8909 -175947 -158516 -36059 146655 121900 -8654 -22862 -74552 -159124 -124709 -33062 18139
8898 18139 20094 47701 108440 32155 -41464 -19766 110611 289936 269967 186605 125960 -16179
$$ packed form
8978F3067K3687p4029j0278o4933j6550Q7007N9804q4557j59180L9852R9125J29431
8966I2446l8522N540n792j46046j37850j05425l3461J25082O9968M0133J36180
8955B253L5695r6648n2043Q4632J32427J88888K6988k5730p7986j66975j06325
8944e4824J1531J68863J33892K2132O947q86p2493m2142j52439q4007J3314K42390
8932A92278m761j08567l0586l9293k133j9038n7575K7927l3555J00349J5373J04716
8920A45135J32528o7800k68493m193J48600J76895j08506j22615q1946m3227q2325
8909a75947J7431J22457J82714k4755j30554j4208n1690q4572L4415R1647N1201
8898A8139J955K7607O0739p6285p3619K1698J30377J79325j9969q3362o0645j42139
$$ plain form
8886 -16179 -108105 -93564 -464 85144 5236 -119228 -210408 -196793 -116499 -58965 34657 87632
8874 87632 241480 245869 250189 253337 239460 151835 158943 23707 28680 171362 208073 228109
8862 228109 148357 150155 199757 318299 539283 580777 503375 358957 288416 243729 375654
8851 375654 258743 81639 147640 133712 88281 59690 33463 -95849 -112794 -163673 -53229
8840 -53229 -17228 56490 63167 3502 23027 9745 -94845 -1378 24462 -118072 -201015 -167347
8828 -167347 -101178 -77475 -97321 -6272 110965 175554 153518 24905 -73186 -77027 -61852
8817 -61852 -68595 -56196 -172167 -86821 46082 93749 -1183 -154546 -138064 -144040 -125949 -124150
8805 -124150 -68762 65296 14787 -87086 -41314 39874 132278 84634 -53999 -54660 -88103
$$ packed form
8886a6179r1926J4541R3100Q5608p9908j24464r1180J3615Q0294N7534R3622N2975
8874H7632J53848M389M320L148j3877q7625P108j35236M973J42682L6711K0036
8862B28109p9752J798M9602J18542K20984M1494p7402j44418p0541m4687J31925
8851C75654j16911j77104O6001j3928m5431k8591k6227j29312j6945n0879J10444
8840e3229L6001P3718O677n9665J9525j3282j04590R3467K5840j42534q2943L3668
8828a67347O6169K3703j9846R1049J17237O4589k2036j28613r8091l841J5175
8817f1852o743J2399j15971Q5346J32903M7667r4932j53363J6482n976J8091J799
8805a24150N5388J34058n0509j01873M5772Q1188R2404m7644j38633o61l3443
$$ plain form
8794 -88103 -85352 73190 225874 358471 318020 181889 259121 335813 128412 83101 97011
8783 97011 220069 206125 53512 23750 -7428 -92525 6195 1014 81380 73543 122785 101661
8771 101661 -43572 -95860 -73265 3960 108153 117866 113166 58130 -17574 -151480 -199114
8760 -199114 -129336 -19454 -5249 -80808 -32159 115164 215137 207688 215723 246227 220773 1563
8748 1563 -152630 -279620 -182851 -83255 -90133 -29029 -11789 -77366 -39097 -49464 -110276 4555
8736 4555 2686 76517 185450 82946 98124 19461 -93260 -239720 -173681 10386 35667
8725 35667 74689 81402 35128 -59072 -50020 -63646 -58 -138569 -178516 -90576 -99538 -189972
8713 -189972 -105941 -7877 101128 173219 111058 34771 56577 -67865 22060 -13136 -129219
$$ packed form
8794h8103K751J58542J52684J32597m0451j36131P7232P6692k07401m5311J3910
8783I7011J23058j3944j52613k9762l1178q5097R8720n181Q0366p837M9242k1124
8771A01661j45233n2288K2595P7225J04193R713m700n5036p5704j33906m7634
8760a99114O9778J09882J4205p5559M8649J47323R9973p449Q035L0504k5454k19210
8748A563j54193j26990R6769R9596o878O1104J7240o5577L8269j0367o0812J14831
8736D555j869P3831J08933j02504J5178p8663j12721j46460O6039J84067K5281
8725C5667L9022O713m6274r4200R052j3626O3588j38511l9947Q7940q962r0434
8713a89972Q4031R8064J09005P2091o2161p6287K1806j24442Q9925l5196j16083
$$ plain form
8702 -129219 -16386 -51223 10480 154548 111408 22416 -137439 -130183 43196 -30329 -122597
8691 -122597 -176629 -132994 -203950 -177346 -152778 -149649 10199 49455 -80697 -146445 -179569
8680 -179569 -153015 -60412 -113221 -185951 -214038 -247720 -300876 -351657 -306086 -189385 -144360
8669 -144360 -186160 -288772 -290988 -272597 -320046 -260333 -85928 -4512 -15921 6989 -68009
8658 -68009 -164463 -158861 -83996 -129123 -149967 -106027 -56693 51257 39924 -29476 -80017 108646
8646 108646 120473 132470 58509 -5777 70911 175763 81270 -53244 -69363 -66006 -186135
8635 -186135 -141059 -266 172646 5773 -21027 -194074 -236215 -65390 45902 11892
8625 11892 -47172 19389 -16099 51219 122862 213045 226064 211656 229921 152196 105388 69666
$$ packed form
8702a29219J12833l4837O1703J44068m3140q8992j59855P256J73379p3525r2268
8691a22597n4032M3635p0956K6604K4568L129J59848L9256j30152o5748l3124
8680a79569K6554R2603n2809p2730k8087l3682n3156n0781M5571J16701M5025
8669a44360m1800j02612k216J8391m7449N9713J74405Q1416j1409K2910p4998
8658f8009r6454N602P4865m5127k0844M3940M9334J07950j1333o9400n0541J88663
8646A08646J1827J1997p3961o4286P6688J04852r4493j34514j6119L357j20129
8635a86135M5076J40793J72912j66873k6800j73047m2141J70825J11292l4010
8625A1892n9064O6561l5488O7318P1643R0183J3019j4408J8265p7725m6808l5722
$$ plain form
8613 69666 30367 33477 -5311 -37175 -109689 -245153 -178285 81152 130753 125187 134395 185108
8601 185108 264862 280677 186282 53231 55776 89957 135602 134671 48910 79623 134804 306926
8589 306926 321388 181678 235862 253194 72690 -5269 -14944 26476 68377 38090 -44865
8578 -44865 131938 129748 4082 -18600 13200 29099 -25539 -44503 -129302 -239172 -62593
8567 -62593 182656 190265 140057 200032 241476 74996 36281 237072 139692 -32094 -25503
8556 -25503 -11859 -40474 -54212 7302 -160756 -104411 -20394 82063 209995 235150 218362
8545 218362 91244 123871 144617 153547 101769 56466 78861 173928 114381 4447 -22743
8534 -22743 -84226 23441 66182 155096 49792 97929 -3865 -60766 -22138 153 69006
$$ packed form
8613F9666l9299L110l8788l1864p2514j35464O6868K59437M9601n566R208N0713
8601A85108P9754J5815r4395j33051K545L4181M5645r31q5761L0713N5181J72122
8589C06926J4462j39710N4184J7332j80504p7959r675M1420M1901l0287q2955
8578d4865J76803k190j25666k2682L1800J5899n4638j8964q4799j09870J76579
8567f2593K45249P609n0208N9975M1444j66480l8715K00791r7380j71786O591
8556b5503J3644k8615j3738O1514j68058N6345Q4017J02457J27932K5155j6788
8545B18362j27118L2627K0746Q930n1778m5303K2395R5067n9547j09934k7190
8534b2743o1483J07667M2741Q8914j05304M8137j01794n6901L8628K2291O8853
$$ plain form
8523 69006 154565 133441 -14390 -82266 -72236 -53521 -21231 -33285 -125778 -105263 -96445 -32853
8511 -32853 59708 -14257 -52133 -66097 -32112 -50006 -152517 -132162 -67612 -118820 -74300 -106091
8499 -106091 -103270 22653 118948 96379 -28030 -106162 -70648 30858 -23312 -29966 -23655 860
8487 860 21937 154148 277951 289020 162233 56507 63097 84024 68958 148815 116255 125435
8475 125435 141916 97128 200238 243662 241393 95652 11345 -146267 -202776 -166329 -76438
8464 -76438 -15696 -34385 118919 27826 47699 73686 -74358 -205461 -157821 -130381 -191482
8453 -191482 -123502 -83184 49374 -26996 -110557 -140023 -37977 131012 169460 18008 -62661
8442 -62661 -146482 -128359 -152826 -87707 159537 52881 -69318 -83561 -65122 -53633 -8771
$$ packed form
8523F9006Q5559k1124j47831o7876J0030J8715L2290j2054r2493K0515Q818O3592
8511c2853R2561p3965l7876j3964L3985j7894j02511K0355O4550n1208M4520l1791
8499a06091K821J25923R6295k2569j24409p8132L5514J01506n4170o654O311K4515
8487H60K1077J32211J23803J1069j26787j05726O590K0927j5066P9857l2560R180
8475A25435J6481m4788J03110M3424k269j45741q4307j57612n6509L6447Q9891
8464g6438O0742j8689J53304r1093J9873K5987j48044j31103M7640K7440o1101
8453a91482O7980M0318J32558p6370q3561k9466J02046J68989L8448j51452q0669
8442f2661q3821J8123k4467O5119K47244j06656j22199j4243J8439J1489M4862
$$ plain form
8431 -8771 -33357 -67599 10412 94860 -106 -66232 -133413 97434 249603 257094 197012 256413
8419 256413 230998 61464 79280 129517 72013 -108621 -63572 -75194 -48083 58572 4259
8408 4259 -71136 -89074 38369 111445 84252 -56420 -110579 -96299 -58177 -154552 -81711 33971
8396 33971 144807 -61784 -48740 76439 114560 90493 81822 105502 175842 100514 145849
8385 145849 147471 193450 269544 274208 237381 161836 -66375 26307 88752 74844 -29173 -43159
8373 -43159 27379 10306 -54722 -100291 -146401 -201791 -138336 -22500 -93648 -128009 45829
8362 45829 50412 30210 107994 163006 111253 63963 108506 158663 115024 67106 196363 378424
8350 378424 326778 175707 204028 412015 434443 357555 275843 471340 410519 374115 267029
$$ packed form
8431h771k4586l4242P8011Q4448r4966o6126o7181K30847J52169P491o0082N9401
8419B56413k5415j69534J7816N0237n7504j80634M5049j1622K7111J06655n4313
8408D259p5395j7938J27443P3076k7193j40672n4159J4280L8122r6375P2841J15682
8396C3971J10836k06591J3044J25179L8121k4067q671K3680P0340p5328M5335
8385A45849J622M5979P6094M664l6827p5545k28211R2682O2445j3908j04017j3986
8373d3159P0538j7073o5028m5569m6110n5390O3455J15836p1148l4361J73838
8362D5829M583k0202P7784N5012n1753m7290M4543N0157m3639m7918J29257J82061
8350C78424n1646j51071K8321K07987K2428p6888q1712J95497o0821l6404j07086
$$ plain form
8339 267029 158433 69359 103066 42001 132 69176 135467 62160 71898 -83398 -34879
8328 -34879 78692 62355 127293 252133 191839 200252 145853 36448 127121 155296 -5476
8317 -5476 69517 161127 89640 76556 32842 -27785 144599 435433 507940 635336 689848
8306 689848 705684 819136 860443 1012979 1113007 1173334 1094787 1000212 932819 734599 638674
8295 638674 610206 507944 566966 401256 344789 453782 424026 274140 217989 177355 75087
8284 75087 16524 105166 110293 -17400 -23903 -55780 -123188 -228547 -269377 -194142 -144340 19462
8272 19462 57099 80560 106575 58570 115426 166096 132920 242873 377074 487919 433130
8261 433130 346609 449986 593691 634296 612676 602418 579814 502860 509357 484825 447809
$$ packed form
8339B67029j08596q9074L3707o1065m1869O9044O6291p3307R738j55296M8519
8328c4879J13571j6337O4938J24840o0294Q413n4399j09405R0673K8175j60772
8317e476P4993R1610p1487j3084m3714o0627J72384K90834P2507J27396N4512
8306F89848J5836J13452M1307J52536J00028O0327p8547r4575o7393j98220r5925
8295F38674k8468j02262N9022j65710n6467J08993k9756j49886n6151m0634j02268
8284G5087n8563Q8642N127j27693o503l1877o7408j05359m0830P5235M9802J63802
8272A9462L7637K3461K6015m8005N6856N0670l3176J09953J34201J10845n4789
8261D33130q6521J03377J43705M0605k1620j0258k2604p6954O497k4532l7016
$$ plain form
8250 447809 366712 455995 532247 437872 341279 221043 111019 5021 -77654 -54205 41125
8239 41125 158990 288205 199865 132750 88925 128940 174883 154716 30245 49977 99153
8228 99153 34797 25854 168083 181499 201737 95278 -33358 -117893 -95039 -39929 -27741
8217 -27741 -69945 -192352 -229698 -63602 -119725 -26548 27481 -693 -88211 -67893 39321
8206 39321 37683 72094 101898 245682 183553 259684 222979 187169 219940 123722 19920 -26216
8194 -26216 -76213 -61210 -134146 -191575 -84066 15565 6035 9345 -65604 -171806 -84383 1768
8182 1768 21316 -56508 -131799 -101502 -120139 -75291 -181130 -106553 -60244 -93595 -180597 -159016
8170 -159016 -31738 95811 -83600 -116947 -52922 -125110 -166633 -108989 50076 76264 -50098
$$ packed form
8250D47809q1097Q9283P6252r4375r6593j20236j10024j05998q2675K3449R5330
8239D1125J17865J29215q8340o7115m3825M0015M5943k0167j24471J9732M9176
8228I9153o4356q943J42229J3416K0238j06459j28636q4535K2854N5110J2188
8217b7741m2204j22407l7346J66096n6123R3177N4029k8174q7518K0318J07214
8206C9321j638L4411K9804J43784o2129P6131l6705l5810L2771r6218j03802m6136
8194b6216m9997J5003p2936n7429J07509R9631r530L310p4949j06202Q7423Q6151
8182A768J9548p7824p5291L0297j8637M4848j05839P4577M6309l3351q7002K1581
8170a59016J27278J27549j79411l3347O4025p2188m1523N7644J59065K6188j26362
$$ plain form
8159 -50098 24983 135184 136693 171595 145412 168980 116918 94322 66953 53827 128757 145503
8147 145503 49752 47041 102035 166406 219685 142373 13943 -80093 -66539 -62889 104866 206847
8135 206847 125135 53031 76586 12099 -55156 7416 26156 164627 138942 161030 107686
8124 107686 -107892 -109485 -92578 -14702 -43024 -28214 21328 -79152 -182008 -81354 -22063
8113 -22063 -20840 78383 131009 128694 196557 157813 159329 134325 124081 225930 275077 270282
8101 270282 319217 303826 232024 181798 145901 149384 134064 185612 200417 84342 65542 12306
8089 12306 22223 55546 11139 -38836 11316 52631 -23688 2932 -21615 56500 -16225 -21600
8077 -21600 93576 109588 47114 -59799 -98262 -33558 81932 103854 212732 187568 247151
$$ packed form
8159e0098P5081J10201J509L4902k6183K3568n2062k2596k7369j3126P4930J6746
8147A45503r5751k711N4994O4371N3279p7312j28430r4036J3554L650J67755J01981
8135B06847q1712p2104K3555o4487o7255O2572J8740J38471k5685K2088n3344
8124A07686k15578j593J6907P7876k8322J4810M9542j00480j02856J00654N9291
8113b2063J223R9223N2626k315O7863l8744J516k5004j0244J01849M9147m795
8101B70282M8935j5391p1802n0226l5897L483j5320N1548J4805j16075j8800n3236
8089A2306R917L3323m4407m9975N0152M1315p6319K6620k4547P8115p2725n375
8077b1600J15176J6012o2474j06913l8463O4704J15490K1922J08878k5164N9583
$$ plain form
8066 247151 230276 219265 152940 81449 -64494 -170814 -140635 -101354 -74303 38979 109701
8055 109701 -13108 -101702 -140824 -86229 -143540 -73599 -79243 -109861 -232019 -167320 -60441
8044 -60441 -87033 -65346 22562 -61251 -37988 -46535 -160643 -121742 -86004 56258 78092 111285
8032 111285 54273 -98838 -261022 -298763 -226080 -134710 -19149 -33218 -113198 -93398 -133851
8021 -133851 -120205 -10077 146192 99525 98328 56810 274 116522 -72875 -27526 71924
8010 71924 -14166 -162382 -130774 4704 -2506 90754 85490 34144 -35975 -53931 -99252 -36216
7998 -36216 -92258 -142123 -222040 -311030 -314981 -307388 -274104 -191157 -199036 -154224 20142 -17948
7986 -17948 112138 4847 -58201 88228 5868 -58148 55367 -142933 -128959 -22894 66829
$$ packed form
8066B47151j6875j1011o6325p1491j45943j06320L0179L9281K7051J13282P0722
8055A09701j22809q8594l9122N4595n7311O9941n644l0618j22158O4699J06879
8044f0441k6592K1687Q7908q3813K3263q547j14108L8901L5738J42262K1834L3193
8032A11285n7012j53111j62184l7741P2683R1370J15561j4069p9980J9800m0453
8021a33851J3646J10128J56269m6667j197m1518n6536J16248j89397M5349R9450
8010G1924q6090j48216L1608J35478p210R3260n264n1346p0119j7956m5321O3036
7998c6216n6042m9865p9917q8990l951P593L3284Q2947p879M4812J74366l8090
7986a7948J30086j07291o3048J46429q2360o4016J13515j98300J3974J06065Q9723
$$ plain form
7975 66829 151663 47697 -12938 22135 38792 80822 75008 70154 -48451 -128776 -16793 -147618
7963 -147618 -201509 -283548 -171300 -132585 -103843 -40185 -95852 -91399 18375 33332 -21121
7952 -21121 55516 -5687 -181585 -98651 41998 117804 -90729 -186075 -65640 17906 49595
7941 49595 23891 164136 141815 47471 72663 32705 19087 7305 -47935 -16450 22500 -88527
7929 -88527 -200871 -263374 -221456 -157352 -62140 -65105 60051 215078 113882 31049 -62205
7918 -62205 -92658 -89736 -78484 -145866 -150155 -157600 -130949 -96857 -165305 -296101 -304929 -255619
7906 -255619 -181967 -61114 -46476 3822 -37886 -20453 28135 -132494 -165277 -134427 -105023
7895 -105023 37941 118060 199067 68947 4142 52007 76084 -10113 -86785 -144090 -111086
$$ packed form
7975F6829Q4834j03966o0635L5073J6657M2030n814m854j18605q0325J11983j30825
7963a47618n3891q2039J12248L8715K8742O3658n5667M453J09774J4957n4453
7952b1121P6637o1203j75898Q2934J40649P5806k08533r5346J20435Q3546L1689
7941D9595k5704J40245k2321r4344K5192l9958j3618j1782n5240L1485L8950j11027
7929h8527j12344o2503M1918O4104R5212k965J25156J55027j01196q2833r3254
7918f2205l0453K922J1252o7382m289p445K6651L4092o8448j30796q828M9310
7906b55619P3652J20853J4638N0298m1708J7433M8588j60629l2783L0850K9404
7895a05023J42964Q0119Q1007j30120o4805M7865K4077q6197p6672n7305L3004
$$ plain form
7884 -111086 -38449 -75561 -15558 145600 331932 299156 193700 155649 108802 89215 -32283
7873 -32283 -96110 -174046 -141319 1999 14890 -29111 39181 142441 -12729 -3914 151620
7862 151620 231179 261085 157202 162509 141442 92638 95935 53466 100302 131072 248805 310090
7850 310090 227080 124941 68665 -43243 38119 169281 137082 89933 58074 23818 150100
7839 150100 222336 231251 192832 197669 108341 14013 -87953 -24460 127226 80037 -29296
7828 -29296 -208696 -279694 -167241 -132862 -240786 -222783 -45985 -20033 10618 124079 120984
7817 120984 1314 -56959 -49390 -112895 -45358 -73419 -93580 -24002 32240 -99697 -125013
7806 -125013 -120204 -44507 51361 95401 202538 177183 92889 -34283 -98972 -43195 81915
$$ packed form
7884a11086P2637l7112O0003J61158J86332l2776j05456l8051m6847j9587j21498
7873c2283o3827p7936L2727J43318J2891m4001O8292J03260j55170Q815J55534
7862A51620P9559K9906j03883N307k1067m8804L297m2469M6836L0770J17733O1285
7850C10090q3010j02139n6276j11908Q1362J31162l2199m7149l1859l4256J26282
7839A50100P2236Q915l8419M837q9328r4328j01966O3493J51686m7189j09333
7828b9296j79400p0998J12453L4379j07924J8003J76798K5952L0651J13461l095
7817A20984j19670n8273P569o3505O7537k8061k0161O9578N6242j31937k5316
7806a25013M809P5697R5868M4040J07137k5355q4294j27172o4689N5777J25110
$$ plain form
7795 81915 84699 74207 100541 197715 221695 349054 327682 247074 89420 51477 129357 99734
7783 99734 -104625 -124209 43404 35434 -164574 -196606 -126260 -88431 -77717 26670 71482
7772 71482 92462 86142 171524 116780 39662 6550 111247 194740 247484 139776 -40399
7761 -40399 -41729 -155372 -174403 -206416 -241001 -39254 231124 293821 82766 69158 -21998
7750 -21998 -6990 -22837 1819 50427 13351 57603 130543 175130 151697 75035 63991 86267
7738 86267 19725 -62658 -25828 71041 -30354 -124569 -175596 -147452 -64028 69792 56854
7727 56854 -79115 59359 119829 72856 30078 41498 52576 156411 235759 207231 189545
7716 189545 107382 69990 74248 181860 211455 108237 -77610 -139987 -43566 7741 -43796
$$ packed form
7795H1915K784j0492K6334R7174K3980J27359k1372q0608j57654l7943P7880k9623
7783I9734k04359j9584J67613p970k00008l2032P0346L7829J0714J04387M4812
7772G1482K0980o320Q5382n4744p7118l3112J04697Q3493N2744j07708j80175
7761d0399j330j13643j9031l2013l4585K01747K70378O2697k11055j3608r1156
7750b1998J5008j5847K4656M8608l7076M4252P2940M4587k3433p6662j1044K2276
7738H6267o6542q2383L6830R6869j01395r4215n1027K8144Q3424J33820j2938
7727E6854j35969J38474O0470m6973m2778J1420J1078J03835P9348k8528j7686
7716A89545q2163l7392M258J07612K9595j03218j85847o2377R6421N1307n1537
$$ plain form
7705 -43796 42680 107528 15142 -21465 -188228 -253854 -159449 -148117 -44002 -8305 -146784
7694 -146784 -165379 -126474 -157025 -54055 -36181 -61053 -27882 18352 -32533 48 112839
7683 112839 220269 163215 173975 30135 24332 76864 12837 -35794 -12709 16656 261406
7672 261406 183015 76065 -7310 88605 88199 961 59149 112467 112372 26112 109135 114371 68698
7659 68698 -45160 -21347 -53675 -179891 -130538 73612 51203 -97171 -132350 -143502 -267410
7648 -267410 -214094 -1913 86583 172397 164524 72991 49415 -44441 -150159 -75890 33129
7637 33129 66101 101118 219420 250589 119101 85643 22473 90035 -69350 -85255 -100585
7626 -100585 -99442 37003 -43326 -112972 -25414 11338 -80054 -10699 105083 97444 101318 84060
$$ packed form
7705d3796Q6476O4848r2386l6607j66763o5626R4405J1332J04115L5697j38479
7694a46784j8595L8905l0551J02970J7874k4872L3171M6234n0885L2581J12791
7683A12839J07430n7054J0760j43840n803N2532o4027m8631K3085K9365K44750
7672B61406p8391j06950q3375R5915m06q7238N8188N3318r5q6260Q3023N236m5673
7659F8698j13858K3813l2328j26216M9353K04150k2409j48374l5179j1152j23908
7648b67410N3316K12181Q8496Q5814p873r1533k3576r3856j05718P4269J09019
7637C3129L2972L5017J18302L1169j31488l3458o3170O7562j59385j5905j5330
7626a00585J143J36445q0329o9646Q7558L6752r1392O9355J15782p639L874j7258
$$ plain form
7614 84060 2509 13663 51866 190264 205770 73861 9438 70320 206881 170029 194489
7603 194489 127903 39833 72146 24117 33737 -66507 -75014 -4800 6990 77306 95282 18827
7591 18827 95152 -7819 105165 135158 -6348 -104347 -56824 18613 93338 71071 117882
7580 117882 111351 -13475 -5022 113326 134624 -8017 -152412 -197685 -162085 -9043 206339
7569 206339 154697 71164 68214 -94801 -230295 -249475 -53027 117749 52943 121128 87972
7558 87972 22580 -3233 -103163 -126294 -179236 -231677 -224061 -126643 -43691 95998 -5681 -192677
7546 -192677 19880 125756 72828 42259 34053 84533 92500 75857 -52989 73418 76142
7535 76142 -20774 -40260 30471 12031 -34638 87631 178824 165519 332669 368861 240348
$$ packed form
7614H4060q1551J1154L8203J38398J5506j31909o4423O0882J36561l6852K4460
7603A94489o6586q8070L2313m8029R620j00244q507P0214J1790P0316J7976p6455
7591A8827P6325j02971J12984K9993j41506r7999M7523P5437P4725k2267M6811
7580A17882o531j24826Q453J18348K1298j42641j44395m5273L5600J53042K15382
7569B06339n1642q3533k950j63015j35494j9180J96448J70776o4806O8185l3156
7558H7972o5392k5813r9930k3131n2942n2441P616R7418Q2952J39689j01679j86996
7546a92677K12557J05876n2928l0569q206N0480P967j6643j28846J26407K724
7535G6142r6916j9486P0731j8440m6669J22269R1193j3305J67150L6192j28513
$$ plain form
7524 240348 129121 84243 91234 89359 83001 -2074 104585 160677 168805 191704 277521 249490
7512 249490 237191 283454 243291 142135 -20461 46157 45197 75023 137200 169623 108869 9484
7500 9484 77627 133293 139831 94439 1179 -103280 -115226 -18057 27885 23050 -438 -28926
7488 -28926 -52696 -13092 -45713 -225563 -264840 -149502 -101285 -139606 -206308 -195600 -25061
7477 -25061 116122 92260 149352 289381 153600 -28133 -48130 -98240 -146132 -84266 -32994
7466 -32994 110265 88553 -72549 -97819 -186947 -106472 -16337 -98856 -198526 -119333 -115734 -159987
7454 -159987 -133560 -24851 -6324 114896 121923 3599 14590 475 17099 36282 -14597
7443 -14597 -25993 22905 104066 143319 -4441 22348 59384 171878 186861 154706 121108
$$ packed form
7524B40348j11227m4878O991j875o358q5075J06659N6092Q128K2899Q5817k8031
7512B49490j2299M6263m0163j01156j62596O6618r60K9826O2177L2423o0754r9385
7500I484O8143N5666O538m5392r3260j04459j1946R7169M5942m835k3488k8488
7488b8926k3770L9604l2621j79850l9277J15338M8217l8321o6702J0708J70539
7477b5061J41183k3862N7092J40029j35781j81733j9997n0110m7892O1866N1272
7466c2994J43259k1712j61102k5270q9128Q0475R0135q2519r9670P9193L599m4253
7454a59987K6427J08709J8527J21220P027j18324J0991j4115J6624J9183n0879
7443a4597j1396M8898Q1161L9253j47760K6789L7036J12494J4983l2155l3598
$$ plain form
7432 121108 -36563 -39487 -70880 39823 44045 -51712 -66071 43321 65272 -74924 -107402
7421 -107402 -129541 -53996 -110940 82048 154909 56599 109667 106364 118534 231660 230826 3618
7409 3618 -56394 -12540 -130421 -94296 -68127 -15950 56607 76816 -99572 -151948 -45696
7398 -45696 2515 -30785 -112030 -2229 83093 -27155 -33963 -42204 30059 134441 121809 -65766
7386 -65766 -76415 -23202 50749 4231 -10262 121967 128549 -3537 -135651 -61301 -133341
7375 -133341 -164412 -121298 -118704 -71492 -109504 -122041 -124692 -84175 -54184 -39280 -195 121083
7363 121083 -62741 -104892 -98446 -121538 -140663 -36979 -4503 40682 26608 26906 -269 37120
7351 37120 158332 12764 -54756 123324 209254 95511 12896 -51964 -73536 -141585 -135500
$$ packed form
7432A21108j57671k924l1393J10703M222r5757j4359J09392K1951j40196l2478
7421a07402k2139P5545n6944J92988P2861r8310N3068l303J2170J13126q34k27208
7409C618o0012M3854j17881L6125K6169N2177P2557K0209j76388n2376J06252
7398d5696M8211l3300q1245J09801Q5322j10248o808q241P2263J04382j2632j87575
7386f5766j0649N3213P3951m6518j4493J32229O582j32086j32114P4350p2040
7375a33341l1071M3114K594M7212l8012j2537k651M0517K9991J4904L9085J21278
7363A21083j83824m2151O446k3092j9125J03684L2476M5185j4074K98k7175L7389
7351C7120J21212j45568o7520J78080Q5930j13743q2615o4860k1572o8049O085
$$ plain form
7340 -135500 -83219 -78563 -182231 -227577 -192042 -67053 30414 4134 14815 -28150 -10596
7329 -10596 39583 -40866 -43596 -91708 -68853 45153 220676 260278 105363 11100 -35117
7318 -35117 40309 22904 52036 -79264 -58220 -100371 -166864 -293086 -321318 -256876 -113687
7307 -113687 -52406 9099 57369 154184 79734 -65341 -85278 -97495 -232324 -258072 -203388
7296 -203388 -108724 -127905 -140630 -143088 -80201 -24717 -186262 -301350 -268715 -120525 -89390
7285 -89390 -50878 47964 67023 -8978 -10071 -121846 -118083 -22640 96979 119027 180310 180067
7273 180067 84389 -21126 -9302 -39173 66536 -5812 -188689 -162457 -181176 -167792 -30598
7262 -30598 29518 -21991 -92789 -51902 -91404 -151954 -211557 -138369 128901 117287 -40544
$$ packed form
7340a35500N2281M656j03668m5346L5535J24989R7467k6280J0681m2965J7554
7329a0596N0179q0449k730m8112K2855J14006J75523L9602j54915r4263m6217
7318c5117P5426j7405K9132j31300K1044m2151o6493j26222k8232O4442J43189
7307a13687O1281O1505M8270R6815p4450j45075j9937j2217j34829k5748N4684
7296b03388R4664j9181j2725k458O2887N5484j61545j15088L2635J48190L1135
7285h9390L8512R8842J9059p6001j093j11775L763R5443J19619K2048O1283k43
7273A80067r5678j05515J1824k9871J05709p2348j82877K6232j8719J3384J37194
7262c0598O0116n1509p0798M0887l9502o0550n9603P3188K67270j1614j57831
$$ plain form
7251 -40544 -97111 -62177 76736 97977 -61984 -207142 -222998 -35608 -109337 -162500 -261467
7240 -261467 -329315 -328474 -261012 -222572 -213575 -79499 40453 73779 56331 89919 99178 11928
7228 11928 21775 -71570 -172608 -143588 -131309 -69097 35457 93520 61409 75844 6042 -44467
7216 -44467 -107626 -88173 -3270 96670 147365 41625 -28053 -135672 -87239 29007 18563
7205 18563 -53338 -57602 -15949 2605 86699 151646 72976 -10078 -64047 -60718 8561 90419
7193 90419 -12327 -28420 -174928 -288862 -237310 -87987 13270 107517 172563 96530 -51193
7182 -51193 -118256 -67620 -73684 -81220 -106770 -209487 -159610 -2052 -36950 -134011 -72845 -54769
7170 -54769 -40464 -31807 -58129 -44617 57074 23176 -39451 19858 -96593 -20914 94269
$$ packed form
7251d0544n6567L4934J38913K1241j59961j45158j5856J87390p3729n3163r8967
7240b61467o7848Q41O7462L8440Q997J34076J19952L3326j7448L3588R259q7250
7228A1928R847r3345j01038K9020J2279O2212J04554N8063l2111J4435o9802n0509
7216d4467o3159J9453Q4903R9940N0695j05740o9678j07619M8433J16246j0444
7205A8563p1901m264M1653J8554Q4094O4947p8670q3054n3969L329O9279Q1858
7193I0419j02746j6093j46508j13934N1552J49323J01257R4247O5046p6033j47723
7182e1193o7063N0636o064p536k5550j02717M9877J57558l4898r7061O1166J8076
7170e4769J4305Q657k6322J3512J01691l3898o2627N9309j16451P5679J15183
$$ plain form
7159 94269 25463 -25341 -96697 -2898 27306 -42374 -54700 -138749 -67971 -65570 -44937 41637
7147 41637 -23301 10543 -120686 -155305 -5517 9528 -21714 -12086 41743 116996 52314 46041
7135 46041 31896 73258 169629 87637 19125 85220 160366 68492 39170 31512 66474 141256
7123 141256 105950 71571 127013 151433 128228 227108 253249 80532 23791 93100 145819
7112 145819 201714 142356 106995 204575 230627 16984 -122256 -99998 66386 81813 59063
7101 59063 -45392 -90086 -228052 -251455 -181909 -73091 -25312 38423 47111 32704 -4460
7090 -4460 -3210 -76621 -18900 -22102 -30623 -42551 -11527 175509 201702 124811 116491 112303 120308
7077 120308 2293 10358 62703 -58057 -246485 -320455 -249569 5860 101350 93894 94501 45537
$$ packed form
7159I4269o8806n0804p1356R3799L0204o9680j2326q4049P0778K401K0633Q6574
7147D1637o4938L3844j31229l4619J49788J5045l1242R628N3829P5253o4682o273
7135D6041j4145M1362R6371q1992o8512O6095P5146r1874k9322p658L4962P4782
7123A41256l5306l4379N5442K4420k3205R8880K6141j72717n6741O9309N2719
7112A45819N5895n9358l5361R7580K6052k13643j39240K2258J66384J5427k2750
7101E9063j04455m4694j37966k3403O9546J08818M7779O3735Q688j4407l7164
7090d460J250p3411N7721l202q521j1928L1024J87036K6193p6891q320m188Q005
7077A20308j18015Q065N2345j20760j88428p3970P0886K55429R5490p456O07m8964
$$ plain form
7065 45537 -167937 -304209 -194240 -31429 36989 -1483 -108154 -39975 -140479 -212645 -156793
7054 -156793 -103516 6502 190077 153942 85015 -57797 -43792 36032 227902 234563 154175
7043 154175 126366 22178 51947 24210 73814 -1560 -53589 22941 47911 209787 258285
7032 258285 157973 32885 31604 16307 -86934 2858 173764 166971 93674 124125 8673
7021 8673 -77546 -167032 -82692 -26281 -67183 -12704 -27721 -62220 52667 51782 130710 182809
7009 182809 171455 149205 72973 47272 -10814 -2434 -35915 -49362 -17752 187529 239402 220345
6997 220345 327286 339208 292162 160691 16657 85590 107407 -1908 -22694 89063 114772
6986 114772 156225 167931 21737 1624 -12292 8735 36953 -67365 -115796 30901 57186
$$ packed form
7065D5537k13474j36272J09969J62811O8418l8472j06671O8179j00504p2166N5852
7054a56793N3277J10018J83575l6135o8927j42812J4005P9824J91870O661q0388
7043A54175k7809j04188K9769k7737M9604p5374n2029P6530K4970J61876M8498
7032B58285j00312j25088j281j5297j03241Q9792J70906o793p3297L0451j15452
7021H673q6219q9486Q4340N6411m0902N4479j5017l4499J14887q85P8928N2099
7009A82809j1354k2250p6232k5701n8086Q380l3481j3447L1610K05281N1873j9057
6997B20345J06941J1922m7046j31471j44034O8933K1817j09315k0786J11757K5709
6986A14772M1453J1706j46194k0113j3916K1027K8218j04318m8431J46697K6285
$$ plain form
6975 57186 58709 -31866 -110351 4630 -3526 87629 177811 227852 257368 161559 59537 -76551
6963 -76551 -75296 -169276 -27916 136622 89131 -102484 -54292 -19847 -31957 -5975 74776
6952 74776 141319 166583 207832 140065 11827 -78719 -47761 74452 120978 210930 231215
6941 231215 62309 -9845 -49832 -69653 33009 131840 176919 145027 88976 -41321 -53213
6930 -53213 69281 157466 316192 285286 261482 203302 107595 138666 24010 85531 122360
6919 122360 211181 299087 163472 155259 84887 -4530 159843 143731 107617 91042 -57058
6908 -57058 -105011 -77231 -18918 99133 137270 79134 73137 103161 191418 177894 117261 -32761
6896 -32761 -136030 -209432 -205345 -230593 -176487 -3991 77000 99576 18345 55217 80269 198358
$$ packed form
6975E7186J523r0575p8485J14981q156R1155R0182N0041K9516r5809j02022j36088
6963g6551J255r3980J41360J64538m7491j91615M8192L4445j2110K5982Q0751
6952G4776O6543K5264M1249o7767j28238r0546L0958J22213M6526Q9952K0285
6941B31215j68906p2154l9987j9821J02662R8831M5079l1892n6051j30297j1892
6930e3213J22494Q8185J58726l0906k3804n8180r5707L1071j14656O1521L6829
6919A22360Q8821Q7906j35615q213p0372q9417J64373j6112l6114j6575j48100
6908e7058m7953K7780N8313J18051L8137n8136n997L0024Q8257j3524o0633j50022
6896c2761j03269p3402M087k5248N4106J72496Q0991K2576q1231L6872K5052J18089
$$ plain form
6884 198358 218392 168896 34673 -19165 30908 6407 -114003 -202137 -170475 -83120 -100740
6873 -100740 -5438 109445 115089 125685 275019 329314 228041 227638 105859 -33269 -90350
6862 -90350 -44091 -29638 -25906 125114 143739 -9397 -59817 -34452 817 -24561 -218973
6851 -218973 -171383 130853 177717 143684 54169 -4563 54798 231609 162136 -33208 -33827
6840 -33827 77434 156893 164570 106808 7157 85388 2354 -14238 77620 176412 192340 112730
6828 112730 127530 142901 56318 45380 -41134 -89698 -44789 -111666 -192100 -266203 -207574 -84061
6816 -84061 -158307 -102433 19754 79446 9638 -136882 -93674 6136 -41701 -18979 -189413
6805 -189413 -104934 94995 103642 -2223 32473 66629 -2049 -53498 -19366 -15665 78770 136823
$$ packed form
6884A98358K0034m9496j34223n3838N0073k4501j20410q8134L1662Q7355j7620
6873a00740R5302J14883N644J0596J49334N4295j01273m03j21779j39128n7081
6862i0350M6259J4453L732J51020J8625j53136n0420K5365L5269k5378j94412
6851b18973M7590L02236M6864l4033q9515n8732N9361J76811o9473j95344o19
6840c3827J11261P9459P677n7762r9651P8231q3034j6592R1858R8792J5928p9610
6828A12730J4800J5371q6583j0938q6514m8564M4909o6877q0434p4103N8629J23513
6816h4061p4246N5874J22187N9692o9808j46520M3208R9810m7837K2722j70434
6805a89413Q4479J99929Q647j05865L4696L4156o8678n1449L4132L701R4435N8053
$$ plain form
6793 136823 34357 -33583 -22111 -48333 30502 45347 91651 92645 67496 146970 144352 19198
$$ packed form
6793A36823j02466o7940J1472k6222P8835J4845M6304R94k5149P9474k618j25154
$$ [...]
##END NTUPLES=NMR SPECTRUM
##END=
