##TITLE=Analysis number 320868
Compound Code cc 38109
Book Reference 468/111
Project Code adrs
Chemist Name colinb
##JCAMPDX= 6.0         $$ Bruker NMR JCAMP-DX V2.0
##DATA TYPE= NMR SPECTRUM
##DATA CLASS= NTUPLES
##ORIGIN= Bruker BioSpin GmbH
##OWNER= nmr
$$ XWIN-NMR		Version 3.5
$$ Fri Jul 14 09:34:14 2006 GMT Daylight Time (UT+1h)  MAYBRIDGE\nmr@NMR_250MHZ
##.OBSERVE FREQUENCY= 250.131544655141
##.OBSERVE NUCLEUS= ^1H
##.ACQUISITION MODE= SIMULTANEOUS (DQD)
##.ACQUISITION SCHEME= undefined
##.AVERAGES= 16
##.DIGITISER RES= 18
##SPECTROMETER/DATA SYSTEM= dpx250
##.PULSE SEQUENCE= zg30
##.SOLVENT NAME= CDCl3
##.SHIFT REFERENCE= (INTERNAL, CDCl3, 0, 16.522)
##AUDIT TRAIL= $$ (NUMBER, WHEN, WHO, WHERE, WHAT)
$$ ##TITLE= Audit trail, XWIN-NMR		Version 3.5
$$ ##JCAMPDX= 5.01
$$ ##ORIGIN= Bruker BioSpin GmbH
$$ ##OWNER= nmr
$$ C:\u/data/dgb/nmr/ADRS/2740/pdata/1/auditp.txt
$$ ##AUDIT TRAIL=  $$ (NUMBER, WHEN, WHO, WHERE, WHAT)
(   1,<2006-07-14 09:33:52.77 +100>,<MAYBRIDGE\nmr>,<NMR_250MHZ>,
      <created by zg, POWCHK disabled, PULCHK disabled
       configuration hash MD5:
       E2 DF 36 D8 04 B2 41 60 5A D7 A3 38 5A 4B D0 FE
       data hash MD5: 64K
       5F BB 01 37 63 AB 0E B2 AD B9 11 95 3F 6E 6E E8>)
(   2,<2006-07-14 09:34:05.24 +100>,<MAYBRIDGE\nmr>,<NMR_250MHZ>,
      <Start of raw data processing
       ef LB = 0.3 FT_mod = 6 PKNL = 1 SI = 32K 
       data hash MD5: 32K
       F2 B2 10 A8 E1 EF 14 13 AC 87 FE F4 01 F1 21 1F>)
(   3,<2006-07-14 09:34:06.91 +100>,<MAYBRIDGE\nmr>,<NMR_250MHZ>,
      <apk 
       data hash MD5: 32K
       04 AC 6A 62 23 93 D6 2A 9F 73 BA AE 66 1C 99 C8>)
(   4,<2006-07-14 09:34:08.00 +100>,<MAYBRIDGE\nmr>,<NMR_250MHZ>,
      <abs ABSG = 5 
       data hash MD5: 32K
       29 7C 78 A7 EE ED 94 BA CA F8 A5 30 3D B5 92 B6>)
$$ ##END=
$$ 
$$ hash MD5
$$ 5E A2 DC 66 4C 5E FE 55 DC 44 32 22 B9 34 A1 D3
##$RELAX= 
##$RELAX= 
##$RELAX= 
##$RELAX= 
##$RELAX= 
##$RELAX= 
##$RELAX= 
$$ Bruker specific parameters
$$ --------------------------
##$DU= <C:\u>
##$EXPNO= 2740
##$NAME= <ADRS>
##$PROCNO= 1
##$TYPE= <nmr>
##$USER= <dgb>
##$AMP= (0..31)
100 100 100 100 100 100 100 100 100 100 100 100 100 100 100 100 100 100 
100 100 100 100 100 100 100 100 100 100 100 100 100 100 
##$AQSEQ= 0
##$AQ_mod= 3
##$AUNM= <au_zg>
##$AUTOPOS= <51 >
##$BF1= 250.13
##$BF2= 250.13
##$BF3= 250.13
##$BF4= 250.13
##$BF5= 500.13
##$BF6= 500.13
##$BF7= 500.13
##$BF8= 500.13
##$BYTORDA= 1
##$CFDGTYP= 0
##$CFRGTYP= 5
##$CHEMSTR= <none>
##$CNST= (0..31)
1 1 145 1 1 1 1 1 1 1 1 1 1 1 1 1 1 1 1 1 1 1 1 1 1 1 1 1 1 1 1 1 
##$CPDPRG= <>
##$CPDPRG1= <>
##$CPDPRG2= <>
##$CPDPRG3= <>
##$CPDPRG4= <mlev>
##$CPDPRG5= <mlev>
##$CPDPRG6= <mlev>
##$CPDPRG7= <mlev>
##$CPDPRG8= <mlev>
##$CPDPRGB= <>
##$CPDPRGT= <>
##$D= (0..31)
0 1 0 0 0 0 0 0 0 0.06 0 0 0 0 0 0 0.0002 0 0 0 0 0 0 0 0 0 0 0 0 0 0 
0 
##$DATE= 1152866031
##$DBL= (0..7)
120 120 120 120 120 120 120 120 
##$DBP= (0..7)
150 150 150 150 150 150 150 150 
##$DBP07= 0
##$DBPNAM0= <>
##$DBPNAM1= <>
$$ [...]
##$SUBNAM7= <"">
##$SUBNAM8= <"">
##$SUBNAM9= <"">
##$SW= 20.6930455092707
##$SWIBOX= (0..15)
0 0 3 0 0 0 0 0 0 0 0 0 0 0 0 0 
##$SW_h= 5175.983436853
##$TD= 65536
##$TD0= 1
##$TE= 296.16
##$TE2= 300
##$TE3= 300
##$TEG= 300
##$TL= (0..7)
0 120 120 120 120 120 120 120 
##$TP= (0..7)
150 150 150 150 150 150 150 150 
##$TP07= 0
##$TPNAME0= <>
##$TPNAME1= <>
##$TPNAME2= <>
##$TPNAME3= <>
##$TPNAME4= <>
##$TPNAME5= <>
##$TPNAME6= <>
##$TPNAME7= <>
##$TPOAL= (0..7)
0.5 0.5 0.5 0.5 0.5 0.5 0.5 0.5 
##$TPOFFS= (0..7)
0 0 0 0 0 0 0 0 
##$TUNHIN= 0
##$TUNHOUT= 0
##$TUNXOUT= 0
##$USERA1= <user>
##$USERA2= <user>
##$USERA3= <user>
##$USERA4= <user>
##$USERA5= <user>
##$V9= 5
##$VALIST= <valist>
##$VCLIST= <CCCCCCCCCCCCCCC>
##$VD= 0
##$VDLIST= <DDDDDDDDDDDDDDD>
##$VPLIST= <PPPPPPPPPPPPPPP>
##$VTLIST= <TTTTTTTTTTTTTTT>
##$WBST= 1024
##$WBSW= 4
##$XGAIN= (0..3)
0 0 0 0 
##$XL= 0
##$YL= 0
##$YMAX_a= 378523
##$YMIN_a= -476104
##$ZGOPTNS= <>
##$ZL1= 120
##$ZL2= 120
##$ZL3= 120
##$ZL4= 120
##$ABSF1= 16.522
##$ABSF2= -4.171173
##$ABSG= 5
##$ABSL= 3
##$ALPHA= 0
##$AQORDER= 0
##$ASSFAC= 0
##$ASSFACI= 0
##$ASSFACX= 0
##$ASSWID= 0
##$AUNMP= <proc_1d>
##$AZFE= 0.1
##$AZFW= 0.1
##$BCFW= 0
##$BC_mod= 0
##$BYTORDP= 0
##$COROFFS= 0
##$CY= 12.5
##$DATMOD= 1
##$DC= 0
##$DFILT= <>
##$DTYPP= 0
##$F1P= 14.0000005364418
##$F2P= -0.99999901652339
##$FCOR= 0.5
##$FTSIZE= 32768
##$FT_mod= 6
##$GAMMA= 0
##$GB= 0
##$INTBC= 1
##$INTSCL= 1
##$ISEN= 128
##$LB= 0.3
##$LEV0= 0
##$LPBIN= 0
##$MAXI= 10000
##$MC2= 0
##$MEAN= 0
##$ME_mod= 0
##$MI= 0
##$NCOEF= 0
##$NC_proc= -5
##$NLEV= 6
##$NOISF1= 0
##$NOISF2= 0
##$NSP= 0
##$NTH_PI= 0
##$NZP= 0
##$OFFSET= 16.522
##$PC= 1
##$PHC0= 163.7891
##$PHC1= 6.447554
##$PH_mod= 1
##$PKNL= yes
##$PPARMOD= 0
##$PSCAL= 4
##$PSIGN= 0
##$REVERSE= no
##$SF= 250.13
##$SI= 32768
##$SIGF1= 0
##$SIGF2= 0
##$SINO= 400
##$SIOLD= 32768
##$SREGLST= <1H.CDCl3>
##$SSB= 0
##$STSI= 32768
##$STSR= 0
##$SW_p= 5175.98343685301
##$SYMM= 0
##$S_DEV= 0
##$TDeff= 65536
##$TDoff= 0
##$TI= <Analysis number 999999
Compound Code 99
Book Reference 9
Project Code 9>
##$TILT= no
##$TM1= 0
##$TM2= 0
##$TOPLEV= 0
##$USERP1= <user>
##$USERP2= <user>
##$USERP3= <user>
##$USERP4= <user>
##$USERP5= <user>
##$WDW= 1
##$XDIM= 32768
##$YMAX_p= 485122983
##$YMIN_p= -201302
$$ End of Bruker specific parameters
$$ ---------------------------------
##NTUPLES= NMR SPECTRUM
##VAR_NAME=  FREQUENCY,     SPECTRUM/REAL,   SPECTRUM/IMAG
##SYMBOL=    X,             R,               I
##VAR_TYPE=  INDEPENDENT,   DEPENDENT,       DEPENDENT
##VAR_FORM=  AFFN,          ASDF,            ASDF
##VAR_DIM=   32768,         32768,           32768
##UNITS=     HZ,            ARBITRARY UNITS, ARBITRARY UNITS
##FACTOR=    0.157963299565203, 1,           1
##FIRST=     4132.6476996994, 0,             0
##LAST=      -1043.33573715361, 0,           0
##MIN=       -1043.33573715361, -201302,     0
##MAX=       4132.6476996994, 485122983,     0
$$ Real data points
##PAGE= N=1
##DATA TABLE= (X++(R..R)), XYDATA
$$ [...]
14652E6738k8596p6726Q841K2996q397j8101n9750r306N9006J3918J6704N775
14640a6898O6455n524l5071M9129O5397n5235p2748k1915l2017L5994N533J6508
14628c92k4840j694L7045P3743K9770m3335l9121m7769p2413M7530P0537K2611
14616E1672n5936j7204J2137O3106P931n5478n400p337m8022K2417q230j2098
14604e2442J4044K9873r757k538K1458M792j7736Q747n667N5603J9399n5684l1533
14591b1441J8195K6570J665k7282k6256K2105j7856J8745M0217j9506L4342M1547
14579I1045j6156j7204j3810R660L5814P21M254K6241l82n3314r917o772J3354
14566F3534L77O9139P1894N7910r16J0752P2578k3129o7089o5740o5870l1235
$$ y = [56738, 28142, -48584, -39743, -16747, -25144, -43245, -102995, -112301, -53295, -39377, -22673, -16898, 49557, 44033, 8962, 58091, 123488, 68253, -4495, -26410, -58427, -22433, -16900, -392, -25232, -26926, 10119, 83862, 113632, 70297, 31176, -16593, -89006, -41476, 29061, 51672, -4264, -21468, -9331, 53775, 61706, 6228, 828, -6509, -54531, -32114, -40344, -52442, -38398, -8525, -18282, -20820, 638, 5430, -12306, -3559, -9226, 46377, 65776, 10092, -21441, -3246, 23324, 24989, -2293, -28549, -6444, -24300, -5555, 34662, 15156, 49498, 91045, 74889, 57685, 43875, 53535, 89349, 90070, 94324, 120565, 120183, 66869, 56952, 50180, 63534, 63911, 133050, 204944, 262854, 261938, 272690, 345268, 322139, 255050, 189310, 123440, 92205]
14554I2205l676k2522Q540J2312K4309K6788n8823o2680k8511J1419L3899L1558
14542F4818r628k4785n3863K5436m8054p0019J2166Q1262m727K3432l96J6258
14530A1900M5508k5171j3415K6861J9887j0100K117q203Q42j0052Q256r908K7735
14517F6257l910j7967j6975L7919m4910m0351L772M4508j9652J5399j692k1579
14505H19M5586L9307O496k5923l3538L161j6690k1599k1635P4886O2575l4640
14493G8805l7210j5240j9452m5511n441M9365K6359l4107l223n3035r363L6589
14481c1464K8058m8403p9383L4216N1520O9032O340n1460L0910L7802j7842j0161
14469A9165q146J5489j0396K0606K5746j9354l6519p746n8389l4363O4431N936
$$ y = [92205, 88529, 66007, 74547, 86859, 111168, 137956, 79133, 16453, -12058, -639, 33260, 64818, 55190, 30405, -23458, 1978, -46076, -116095, -103929, -22667, -27394, -3962, -4358, 11900, 57408, 32237, 18822, 45683, 65570, 55470, 57587, 49384, 50226, 40174, 48430, 38522, 66257, 62347, 44380, 27405, 65324, 20414, -19937, -16165, 28343, 8691, 24090, 22398, 819, 46405, 85712, 92208, 66285, 32747, 35908, 19218, -2381, -24016, 50870, 113445, 78805, 41595, 26355, 6903, -38608, -44049, 5316, 31675, -2432, -5655, -58690, -68053, -31464, -3406, -51809, -131192, -96976, -45456, 23576, 29916, -21544, 9366, 47168, 29326, 19165, 11019, 26508, 16112, 36718, 62464, 43110, 6591, -1155, -59544, -93907, -29476, -23540]
14457b3540k8876M9174M6887N7792P352J5454O187l1156j4741k0548J9039o1236
14445B1788m3904j9351Q5K1717k8309k4822J6351P2672M3135K8929k4270k4164
14433C9857J8993N5171o1299o0068j9562l1252L594K5175N499l997K4923M1275
14421C8309k843l5430o7729k4615K4059Q0545J3074m4061j3075L5549J6922k3919
14409c214o5919J8441Q9595P1686L0739M369J848p4580k6845l2891K5542k3115
14397A5656L5638l5276R70M0368L951J1015n983k5604K7511J3597m1004l2743
14385H096J8807O0982n910n8134M4295Q4247m4279p0682k9160K8738K3509k0261
14373D0248N0170J36237J9177q5557n8404R1078L2338L199j9711L9117J27986
$$ y = [-23540, -52416, -3242, 43645, 101437, 108789, 124243, 130430, 99274, 84533, 63985, 83024, 21788, -22116, -41467, -41382, -19665, -47974, -72796, -56445, 16227, 59362, 88291, 64021, 39857, 58850, 114021, 52722, -7346, -26908, -58160, -54566, -29391, -23892, -27889, -2966, 38309, 35466, 36, -67693, -92308, -68249, 12296, 25370, -18691, -31766, 3783, 20705, -3214, -69133, -50692, 38903, 110589, 141328, 145697, 147545, 72965, 46120, 13229, 38771, 15656, 51294, 16018, 16988, 57356, 61307, 72322, 66339, 40735, 68246, 81843, 40839, 8096, 26903, 87885, 81975, 23841, 68136, 152383, 108104, 37422, 8262, 37000, 60509, 40248, 90418, 226655, 245832, 160275, 101871, 192949, 225287, 228486, 208775, 247892, 375878]
14362C75878Q3146j037L5967P8558N9611N7941M2114J7210N2985M0437M359J9365
14350H66534K1621P5112q12L0823j92l0858l6351m2527j8342L6515q80Q828m1303
14337H68168l8331J5989O4144k6505j1986k4110Q3403J5116J5247k1344l1373
14326I08418k1589k6741k2188j7186m3970j03336l7414n0631r3511l4380l7622
14315D19850p1986p7417N862m3245k5946M4392M1267N0907K5932o3586q8901j3121
14303B04008J2940K5718K1001j943k3608j6438o013k7939l8617m2850l9169j1980
14291E5110L4424K5555l1969O270K4126M266l2941J8577j4855J8536l5048m6789
14279B5262J300m5777L6437Q1076K3313k1071o2132m3407k4206N9525J7174k0701
$$ y = [375878, 459024, 457987, 493954, 572512, 632123, 690064, 732178, 749388, 802373, 842810, 847169, 866534, 888155, 963267, 962455, 993278, 993086, 962228, 925877, 883350, 865008, 901523, 900643, 909471, 868168, 829837, 845826, 909970, 883465, 871479, 847369, 930772, 945888, 961135, 939791, 908418, 886829, 860088, 837900, 820714, 776744, 673408, 635994, 585363, 491852, 457472, 419850, 347864, 270447, 276309, 233064, 207118, 251510, 292777, 343684, 369616, 306030, 217129, 204008, 216948, 242666, 263667, 261724, 238116, 221678, 215665, 187726, 149109, 106259, 67090, 55110, 89534, 115089, 83120, 89390, 113516, 117782, 84841, 103418, 88563, 107099, 72051, 25262, 26562, -19215, 17222, 98298, 121611, 100540, 38408, -4999, -29205, 30320, 47494, 26793]
14267B6793L4297Q161q602O763K4032J7302Q292k9511K6500J3574n2277n0676
14255B4648J5378M354K6188M515j1362L2323J8636L6201k6295j3490N999J4093
14243A31188o331L9719l5311p69N2558n893l1571k9568k7282m3227m9073K5453
14231A9893M5568N733k5864J9843j461J6622L2613l496q778l2082m3974K8120
14219E2737R2016J0559n7720m105m1905N304K6806M6745L3188l736k163L2598
14207A90324l0420l724o747m6480J294K2616j4846K350R944k6776k2815N2846
14195A27566k0652m1934l1396m5255M6843K1240J8934k0036K0111J4252m7881
14184D1792J2205n101J4948L5790L1273j0252m5451k6802l9K1806M1731M8923
$$ y = [26793, 61090, 69251, 60649, 67412, 91444, 108746, 117038, 87527, 114027, 127601, 75324, 24648, 40026, 44380, 70568, 75083, 63721, 96044, 114680, 150881, 124586, 111096, 117095, 131188, 124857, 164576, 129265, 128496, 181054, 175161, 143590, 114022, 86740, 43513, -5560, 19893, 65461, 71194, 45330, 65173, 63712, 80334, 112947, 109451, 100673, 68591, 24617, 52737, 144753, 155312, 97592, 93487, 51582, 56886, 83692, 130437, 163625, 159889, 157726, 190324, 159904, 156180, 149433, 102953, 104247, 126863, 112017, 114367, 124311, 97535, 74720, 127566, 106914, 64980, 33584, -11671, 35172, 56412, 75346, 55310, 75421, 89673, 41792, 53997, 48896, 63844, 99634, 130907, 120655, 75204, 48402, 48363, 70169, 111900, 160823]
14172A60823l8382O441m4082L1689M9741p3166l2267N4424K4281l4460k2982K1687
14160A03747N0257j8221o2222K4521J3846N5469k998J0306P6969j4455q1667m3759
14148A11793m1987m2408j9247O922J9357L5590M6768J6785j7885p029j4333K5670
14136A19996M7958K8780J2611K6644K9312p741J6028L6243l2802j5903k8427N1061
14124B83760n9678n3676M4375J9702J43K8011L9603m2505o3429l9636L2747j2553
14112A76864o0915j0792N931K3505M8770r390n7662m993k9587K5148M4605j798
14100A49686J8663J8035j6397n5505J6847M1776M8347L8931M3945j1188K0229
14089C13369k0674n4100R918O0644L408j8454q782K7524r970l0740j7356k300
$$ y = [160823, 122441, 128882, 84800, 116489, 166230, 93064, 60797, 115221, 139502, 105042, 82060, 103747, 154004, 135783, 73561, 98082, 111928, 167397, 164399, 174705, 251674, 237219, 155552, 111793, 69806, 27398, 8151, 15073, 34430, 70020, 116788, 133573, 115688, 108659, 94326, 119996, 167954, 196734, 209345, 235989, 265301, 257560, 273588, 309831, 277029, 261126, 232699, 283760, 224082, 170406, 214781, 234483, 234626, 262637, 302240, 259735, 196306, 156670, 189417, 176864, 115949, 105157, 111088, 134593, 183363, 173973, 116311, 111318, 81731, 106879, 151484, 149686, 168349, 186384, 169987, 114482, 131329, 173105, 221452, 260383, 304328, 293140, 313369, 292695, 238595, 248513, 309157, 312565, 294111, 285329, 312853, 302883, 272143, 254787, 252487]
14077B52487l6000k8263L9191J8142N7221j0545k2716L7121M201p267M9889L7554
14065C91015m210O0353j46j3099J423j2053l3954l8982m6765q604N1880l7632
14053C09226j9062j1652j0172j154j587j9141M3341M3495J3848j5414k182p423
14041C22123p0014K1519M8965j5142J2894p330K238K0736L2309M9949l6892k5692
14029C55663L7835q342l1594N266J6738R441j2486N9463Q9791J3459m2495k3023
14017D69716j4255l0227J9148M1998M2470M0200K7335N1681M2650L9397M6201
14006G76314L6885P608L1568l8069j3276r347L7408N4533J7327l4655m3444Q844
13994H31696N9109P097Q187L4921l7994o818L5933l8295P686J941K5582j4843
$$ y = [252487, 216487, 188224, 227415, 245557, 302778, 292233, 269517, 306638, 310839, 303572, 353461, 391015, 386805, 447158, 447012, 433913, 435336, 423283, 389329, 350347, 303582, 294978, 346858, 309226, 290164, 278512, 268340, 267186, 265599, 246458, 289799, 333294, 347142, 331728, 329546, 322123, 252109, 273628, 322593, 307451, 320345, 313015, 315253, 335989, 368298, 418247, 381355, 355663, 393498, 385156, 353562, 358828, 375566, 385007, 372521, 431984, 521775, 535234, 492739, 469716, 455461, 425234, 444382, 486380, 528850, 569050, 596385, 648066, 690716, 730113, 776314, 813199, 820807, 852375, 814306, 801030, 791683, 829091, 883624, 900951, 866296, 822852, 831696, 890805, 897902, 906089, 941010, 903016, 896198, 932131, 893836, 901522, 903463, 929045, 914202]
13982I14202l2072N355K3849K1386M8293j1512J920Q302K0777O3150J6155J5989
13970A095794m930Q809o4232Q089J9532O9425L6658K8227K6283j1733M4595P2490
13958A329007K1030J4625L6684K4815M0039L5503J11816J03220N9596N1558L4802
13947A862695Q9090J14618J11351Q0997J36871J25820J41405P9384J25996J38269
13937C006496K01434K44524J82020K40420L09449L42894M00964M50412M35989
13928E814602N16404N88798O38429P55291R13564J056948J200489J400092J618202
13919A4502819J920565K259181K621659L047445L607492M281928N107188N965463
13911D3313740O857270P748764Q650516R393963R934432J0124822J0042401R600642
$$ y = [914202, 882130, 887485, 911334, 932720, 981013, 969501, 971421, 979723, 1000500, 1063650, 1079805, 1095794, 1090864, 1099673, 1035441, 1043530, 1063062, 1132487, 1169145, 1197372, 1223655, 1211922, 1256517, 1329007, 1350037, 1364662, 1401346, 1426161, 1466200, 1501703, 1613519, 1716739, 1776335, 1827893, 1862695, 1951785, 2066403, 2177754, 2258751, 2395622, 2521442, 2662847, 2742231, 2868227, 3006496, 3207930, 3452454, 3634474, 3874894, 4184343, 4527237, 4928201, 5378613, 5814602, 6331006, 6919804, 7558233, 8313524, 9227088, 10284036, 11484525, 12884617, 14502819, 16423384, 18682565, 21304224, 24351669, 27959161, 32241089, 37348277, 43313740, 50171010, 57919774, 66570290, 75964253, 85898685, 96023507, 106065908, 115666550]
13903A15666550Q711206P639333O169333M571418L031673J478791J98698q91067
13895A46575935j819892k251500k326944k085301j698292j158600m06279M69088
13887A35298215J381539K245443K971428L656189M175400M387611M384852L945937
13879A62446614L202406K158758P10432q96585k731555m588139o265642p616668
13871A46419621q734417r491829r852785r858579r474895q906477q151149p380549
13863G4568941o539904n768579m902069m284198l773001l244059k869894k480000
13855D0707237k152782j996755j814372j641467j509563j404850j263183j226127
13847B7698138j207474j086813j039248j006724r89356q87285q42336p45481p28359
$$ y = [115666550, 124377756, 132017089, 138186422, 142757840, 145789513, 147268304, 147467002, 146575935, 144756043, 142504543, 140177599, 138092298, 136394006, 135235406, 134829127, 135298215, 136679754, 138925197, 141896625, 145552814, 149728214, 154115825, 158500677, 162446614, 165649020, 167807778, 168518210, 167621625, 164890070, 160301931, 154036289, 146419621, 137685204, 128193375, 118340590, 108482011, 99007116, 90100639, 81949490, 74568941, 68029037, 62260458, 57358389, 53074191, 49301190, 46057131, 43187237, 40707237, 38554455, 36557700, 34743328, 33101861, 31592298, 30187448, 28924265, 27698138, 26490664, 25403851, 24364603, 23357879, 22368523, 21481238, 20638902, 19893421, 19165062]
13838A9165062p74173p00140o50825n36050m87158n09435n16319n07257m38387
13829A4045318l81614m19714m64209m05588m11616l51991l31368l42864l03971
13820A0632383l19640k87375k77472l11874k99533k93523k50636k24472k73500
13811H094358k55661k08588j48294j81887j95370j73714j92096j86572j07798
13802F444378j64725j77619j81722j73969j87465k22955j64672n9394j14086k07666
13792D790105j79028j23222j28095j50523j52736p4033p3716j17989r7377o7196
13782C626190j17762m9857l3667q3146p3330k01945j42653q998m8101j46201q0457
13771B640073q3590j07530l7659K9085j8665p9106m7861l2564k4158k5165l0600
$$ y = [19165062, 18390889, 17690749, 17039924, 16503874, 16016716, 15507281, 14990962, 14483705, 14045318, 13663704, 13243990, 12779781, 12374193, 11962577, 11610586, 11279218, 10936354, 10632383, 10312743, 10025368, 9747896, 9436022, 9136489, 8842966, 8592330, 8367858, 8094358, 7838697, 7630109, 7481815, 7299928, 7104558, 6930844, 6738748, 6552176, 6444378, 6279653, 6102034, 5920312, 5746343, 5558878, 5335923, 5171251, 5111857, 4997771, 4790105, 4611077, 4487855, 4359760, 4209237, 4056501, 3982468, 3908752, 3790763, 3693386, 3626190, 3508428, 3458571, 3424904, 3341758, 3268428, 3066483, 2923830, 2914832, 2866731, 2720530, 2640073, 2556483, 2448953, 2411294, 2440379, 2421714, 2342608, 2294747, 2262183, 2238025, 2212860, 2182260]
13760B182260p8304m4870l4896q0944o5864n2445L2362j587N292J4154j4473l9403
13748A821282o4856m0690L066o808n5247r1025n1929j5624P333L0328K693k1121
13736A517402j046o4625o4814k6163n6599k9124j9913P913k5451k8552o1823j06042
13724A041163q7001o4420r2512o4065N1316M0416J6153r5900m4559l1642q0672
13713E88277l4643j4978j3547j1569M4710j8523j4512k9230j4093l6414m1290
13702D04188o2219o1712k4789M1615J2278l3600L7594N2433m1694j0187m6233
13691B67674J2061l2160J1312J8496m0434J7514N7250n2486m9027K0791K2442
13680B53433K3216l9258L700Q5997M3808k4547m1264O324j2860j4528J7968q446
$$ y = [2182260, 2103956, 2059086, 2024190, 1943246, 1877382, 1824937, 1857299, 1855712, 1861004, 1875158, 1860685, 1821282, 1756426, 1715736, 1718802, 1711994, 1656747, 1565722, 1513793, 1498169, 1505502, 1535830, 1538523, 1517402, 1516356, 1451731, 1386917, 1360754, 1304155, 1275031, 1255118, 1263031, 1237580, 1209028, 1147205, 1041163, 954162, 889742, 797230, 733165, 784481, 824897, 841050, 745150, 700591, 668949, 588277, 553634, 538656, 525109, 513540, 558250, 539727, 525215, 495985, 481892, 445478, 404188, 341969, 280257, 255468, 297083, 309361, 275761, 313355, 365788, 324094, 313907, 267674, 279735, 247575, 258887, 277383, 236949, 254463, 311713, 259227, 210200, 230991, 253433, 276649, 237391, 241091, 327088, 370896, 346349, 305085, 311409, 298549, 284021, 301989, 293543]
13668B93543o410j080L2786J8664L7213L8679o3362m6949O149J5961J090K3550
13656C49834l025K3968k3782m928M2531M1830m9847n6565L7718M0917J0141J1767
13644D20559P637p089l3169m1476l6185o611m612L5358K441q622p2432m9436N877
13631B12240q478J6435J9422l1301K9774K7557J7214l1311m6569J2904k4456K4338
13619B17769P9550J3187q1494J9447L032k17j3224k1005J0630L3551M7800m3486
13607B65540q1539n7501j6570j7098k4869J5172Q494k230N1603o2298m5011N4399
13595H8092Q3044O8787m1493J0247j7790p1426j1895q115L2866p82o0581k7856
13583D3098L0820J4115O3321P3521L6975j8517o6448r5563l9228L243j4843j5212
$$ y = [293543, 287133, 286053, 318839, 337503, 374716, 413395, 350033, 303084, 309233, 325194, 326284, 349834, 346809, 370777, 346995, 342067, 384598, 426428, 376581, 320016, 357734, 398651, 408792, 420559, 428196, 421107, 387938, 346462, 310277, 303666, 299054, 334412, 336853, 328231, 255799, 206363, 212240, 203762, 220197, 239619, 208318, 238092, 265649, 282863, 251552, 204983, 217887, 193431, 217769, 297319, 310506, 229012, 248459, 251491, 251274, 238050, 217045, 227675, 261226, 309026, 265540, 184001, 126500, 109930, 92832, 67963, 83135, 91629, 89399, 141002, 78704, 33693, 88092, 171136, 239923, 198430, 208677, 190887, 119461, 107566, 99451, 132317, 131535, 70954, 43098, 73918, 88033, 151354, 224875, 261850, 243333, 176885, 81322, 42094, 45337, 30494, 15282]
13571A5282J6727L1931M1313J9226p5585o1146l6109J9661L9298k21n457j325
13559C595K5008K7248L0349K5440O8906k153m3941m3049J8056k327N631M248k3832
13546I3179k6332P7222k31k1411m1109k3986M9930J4991o8761m960M7055k13k5709
13533F9665k8812k7975L27j5592l3141J6821O8892R049L2944j7248J6640k82n9051
13520C2237k9487L0534N5576j8910J9663L2119j4045j0518l1607l4493N4341N1801
13508A37211l2793l738l0095p288n0569L430j84l865k0476N0841M8132J261l2737
13495E9130M61L0128L6737m345o1640l5697L0072p935Q643N6218p95n1008l4518
13482B5451J7806M2762L7377L1412K6440k1594p0810J5458r180P659L4340n601
$$ y = [15282, 32009, 63940, 105253, 124479, 48894, -12252, -48361, -28700, 10598, 10377, 4920, 3595, 28603, 55851, 86200, 111640, 180546, 178393, 134452, 91403, 109459, 107132, 112763, 117011, 93179, 66847, 144069, 143838, 122427, 81318, 57332, 107262, 122253, 53492, 48532, 95587, 95374, 69665, 40853, 12878, 13205, -2387, -35528, -18707, 50185, 59234, 92178, 74930, 91570, 91288, 32237, 2750, 33284, 88860, 69950, 89613, 121732, 107687, 97169, 65562, 31069, 85410, 137211, 104418, 100680, 70585, 63297, 12728, 16158, 15974, 12109, -8367, 42474, 90606, 91867, 59130, 59591, 89719, 126456, 122111, 60471, 24774, 54846, 46911, 55554, 111772, 110977, 59969, 25451, 43257, 86019, 123396, 154808, 181248, 159654, 88844, 104302, 95122, 102781, 137121, 131520]
13470A31520J2203m7301m2543N797J4953K3481J0591J1683K6L2698M0900J7980
13458B11988L1446N3037k6675l5554L4756N0437N636K9968N6036M9983M771O1390
13446E27219P4095O9700P9878L0011J9998j0435l8190k1328J8064o091j6591K3646
13434G49976k9312j8777Q470J432J8473j2016O8141R3152j578m636K0963m4310
13422H49978L6891J4812K0125j4899j6742k6585K034R332M407k2512r2961q6321
13410F77559p2988p5562L837k5815k3000q4265J8899J7779n5168k3499k85n8259
13398B99233l7604m8121L1683k0653l5989j8074K7229j9457l6527M2862N2491
13387B37073M7367o0658p7911L2960l9251j1256r963j0095j1439L4929n1871k7072
$$ y = [131520, 143723, 96422, 53879, 59676, 74629, 98110, 108701, 120384, 120410, 153108, 194008, 211988, 243434, 296471, 269796, 234242, 268998, 319435, 325071, 355039, 411075, 461058, 465829, 527219, 601314, 671014, 750892, 780903, 800901, 790466, 752276, 730948, 749012, 742921, 726330, 749976, 720664, 701887, 710357, 711789, 730262, 718246, 786387, 879539, 877961, 873325, 894288, 849978, 886869, 901681, 921806, 906907, 890165, 863580, 865614, 874946, 879353, 856841, 763880, 677559, 604571, 529009, 532846, 507031, 484031, 399766, 418665, 436444, 381276, 357777, 357492, 299233, 261629, 213508, 245191, 224538, 188549, 170475, 197704, 178247, 141720, 184582, 237073, 284440, 223782, 145871, 178831, 139580, 128324, 118361, 108266, 96827, 131756, 79885, 52813]
13375E2813M5022O307K3927m717k4250J2361o1596k6141O2150k5710j5702J6391
13363F0855P4742J0147q1566l8633k3859N2418J430M4737P1533k0323j3146m0826
13351I7509J0332O0152p7374Q124k8874K4194J0623J2866M231m505k0160Q630
13339A05748M460k5368J6115J6153N6918J8994o805m4837Q071K9768k7884J6035
13327A67368L7144j6889r533r180l4647j1044K9031m0793m0241L4408n2394J7688
13315G0918J8660L5237M3460J0067j3237J574J3833p038k0486j8017N834J8626
13303A59431j6280p091L9878l0619m1858J5515k581j3441k0323L3385q762o1413
13291D5841K6608J9367L3973M8754K3844k0445j0518K9507j3558K3588L5147m8480
$$ y = [52813, 97835, 104142, 128069, 123352, 99102, 111463, 49867, 23726, 85876, 60166, 44464, 60855, 135597, 145744, 64178, 25545, 1686, 54104, 55534, 100271, 171804, 151481, 138335, 97509, 107841, 167993, 90619, 98743, 69869, 94063, 104686, 117552, 121783, 117278, 97118, 105748, 110208, 84840, 100955, 117108, 174026, 193020, 186215, 141378, 149449, 179217, 151333, 167368, 204512, 187623, 178090, 168910, 134263, 123219, 152250, 111457, 71216, 105624, 53230, 70918, 89578, 124815, 168275, 178342, 165105, 166679, 180512, 173474, 152988, 134971, 140805, 159431, 143151, 136060, 175938, 145319, 103461, 118976, 116395, 102954, 82631, 116016, 107254, 45841, 72449, 91816, 125789, 174543, 198387, 177942, 167424, 196931, 183373, 206961, 242108, 193628]
13279A93628n2880j6322J3882L4395J7199j9333j4276k59k5122q3870j0909l879
13267C2254M6497P7141j8952k0946j0349n0499l6741r008K1871L5961N6513k7628
13255I6114j8163P1256P2994m0401k4680k9816L2630J5240K6243q372m3254P062
13243A56853Q534j4524k8130M0652k7014Q63R801K3613j5466o211L3034K4856
13231B06861K7731k1753N01M1984J9861J0753l3237J976N390l2139j8292K4686
13219B34322J0784L1187N2332o677p1984l7881N8046J3393R998k4493j3515j2773
13207B42739j7504o202J4468K3533L8519K7384N5541m2695K3237M2394N124m8360
13195C58178q4331J6041J5283J3844J2198n340J4232m1297m8971L8923K5982N008
$$ y = [193628, 140748, 124426, 138308, 172703, 189902, 170569, 156293, 156034, 130912, 47042, 36133, 32254, 78751, 155892, 136940, 115994, 105645, 55146, 18405, 9397, 31268, 67229, 123742, 96114, 77951, 149207, 222201, 181800, 157120, 127304, 159934, 175174, 201417, 193045, 149791, 156853, 165387, 150863, 122733, 163385, 136371, 137234, 147035, 170648, 155182, 148971, 182005, 206861, 234592, 212839, 213340, 255324, 275185, 285938, 252701, 254677, 260067, 227928, 209636, 234322, 245106, 276293, 328625, 321948, 249964, 212083, 270129, 283522, 293520, 269027, 255512, 242739, 225235, 219033, 233501, 257034, 295553, 322937, 378478, 335783, 359020, 401414, 406538, 358178, 273847, 289888, 305171, 319015, 331213, 325873, 340105, 298808, 249837, 288760, 314742, 319750]
13183C19750N870N1167J2927o693N0967j4230l7924j8770m13Q1650j3215p2960
13171C58126K5359N6032N9836L322j6173k8088P9362P2326o09L1429L399o0854
13159E83467k5211Q925L1259K3435M5017J5464l9783j3951o706l7603k2404M0726
13147F02635K6753m084l2591N3724O2998K2957k2994N332P3533N1585L338p4082
13135G69104K2138J8080M4116Q4469M7049Q203l2754k4374N6700O8414K0196o411
13123A074930R207J3113O622L2083M1583M2731M5739P7082Q1574J21145L5953
13112A581762J3312L1942J20997N5002R7119P6268O6794Q7381Q4668J36176J17221
13101B468642P9877J62531K19716J88463J81977J94253K21093J94719K43064L13059
$$ y = [319750, 325620, 376787, 389714, 383021, 433988, 419758, 381834, 363064, 362651, 444301, 431086, 358126, 383485, 439517, 499353, 502675, 486502, 458414, 537776, 610102, 609493, 640922, 644321, 583467, 558256, 567181, 598440, 621875, 666892, 682356, 642573, 628622, 621916, 584313, 561909, 602635, 629388, 625304, 592713, 646437, 709435, 732392, 709398, 714730, 788263, 839848, 843186, 769104, 791242, 809322, 853438, 937907, 984956, 993159, 960405, 936031, 992731, 1061145, 1081341, 1074930, 1084137, 1097250, 1103872, 1135955, 1177538, 1220269, 1266008, 1343090, 1424664, 1545809, 1581762, 1595074, 1627016, 1748013, 1803015, 1900134, 1976402, 2043196, 2130577, 2215245, 2351421, 2468642, 2548519, 2711050, 2930766, 3119229, 3301206, 3495459, 3716552, 3911271, 4154335, 4467394]
13091D467394L55134M47996M43739N24968O24548O56363P21413P54238Q80829
13082I876622J041068J074049J237241J411212J574434J651857J801228J888755
13074B1556466J930944J940720J767336J646334J474722J195741R84191P59565
13066C3256019M95352K82307J42109P1624M3294J36875J34266J89717M16578N99306
13056C5767447Q40054J084540J341967J717811K020022K322522K778103L149707
13048E1022173L569671L954940M159800M207306L949097L327347K498075J386752
13040G8075161J53022j133437k171703l034182l551684l747840l686733l454812
13032E7447792l286235k898143k495142k176897j838107j509910j302635r97688
$$ y = [4467394, 4822528, 5270524, 5714263, 6239231, 6863779, 7520142, 8241555, 8995793, 9876622, 10917690, 11991739, 13228980, 14640192, 16214626, 17866483, 19667711, 21556466, 23487410, 25428130, 27195466, 28841800, 30316522, 31512263, 32496454, 33256019, 33751371, 34033678, 34175787, 34247411, 34290705, 34427580, 34561846, 34751563, 35168141, 35767447, 36607501, 37692041, 39034008, 40751819, 42771841, 45094363, 47872466, 51022173, 54591844, 58546784, 62706584, 66913890, 70862987, 74190334, 76688409, 78075161, 78228183, 77094746, 74923043, 71888861, 68337177, 64589337, 60902604, 57447792, 54161557, 51263414, 48768272, 46591375, 44753268, 43243358, 41940723, 40943035]
13024D0943035p37912n72007m37957k67850j43678o2767p9155r5737r8689k19879
13014C8227404l98940o19370q17744j038573j273464j391920j563917j671011
13006B9452465j714888j622926j597912j484851j397850j360153j205820j036865
12998A8031200r80941q92212q32926p34199o95239o69356n88893n85684n31044
12989A1520706m71075l91230m24966l84852l41613l47621l92505k74211k62795
12980H229838l23906l03734k71472k16701k35070k59167j94675k02386j33449
12971F089278j55801k33719k08702k25367j81235j16823j13427j22655j28359
12962D603190j38029o5996j00952k06216j42264j06304j00727o0470n4064j52346
$$ y = [40943035, 40205123, 39633116, 39195159, 38927309, 38783631, 38720864, 38641709, 38545972, 38447283, 38227404, 37828464, 37209094, 36391350, 35352777, 34079313, 32687393, 31123476, 29452465, 27737577, 26114651, 24516739, 23031888, 21634038, 20273885, 19068065, 18031200, 17050259, 16158047, 15325121, 14590922, 13895683, 13226327, 12637434, 12051750, 11520706, 11049631, 10658401, 10233435, 9848583, 9506970, 9159349, 8766844, 8492633, 8229838, 7905932, 7602198, 7330726, 7114025, 6878955, 6619788, 6425113, 6222727, 6089278, 5933477, 5699758, 5491056, 5265689, 5084454, 4967631, 4854204, 4731549, 4603190, 4465161, 4399165, 4298213, 4091997, 3949733, 3843429, 3742702, 3682232, 3628168, 3475822]
12952C475822l6859J224j37443j85252j07538j9465m1502r7778m4042j10580j21443
12941B575144m1503k0062o5925o1271m7510n7283r0441j04738n8157k4517j5057
12930A988680k1444p6706r1847n2760J24J4700K6293m8988o2389r7045o0229l6043
12918A482346j2767L224m6543n9525n0946K380J6768l6809l5060m5807n6086L4866
12906A196041L3333l350j7890n1546m2085o3177j2417L4635j116r578n9110m7017
12894I56723m6779k0910j3596n7177l6136K5936P4275j1975K6579j8776r8982
12883G79182m8567l7300l7554L4908L441m3137l1854o4169j8635O8229n794L9847
12871F38597p673l7714r414k4047k7579p992j3273J3304l4293m7653k5496K0685
$$ y = [3475822, 3438963, 3440187, 3302744, 3117492, 3009954, 2990489, 2948987, 2851209, 2807167, 2696587, 2575144, 2533641, 2513579, 2447654, 2386383, 2338873, 2281590, 2191149, 2086411, 2028254, 2003737, 1988680, 1967236, 1890530, 1798683, 1745923, 1746047, 1760747, 1787040, 1738052, 1675663, 1578618, 1518389, 1482346, 1469579, 1472803, 1426260, 1366735, 1315789, 1318169, 1334937, 1298128, 1263068, 1217261, 1161175, 1196041, 1229374, 1226024, 1208134, 1156588, 1114503, 1051326, 1038909, 1073544, 1072428, 1062850, 1003740, 956723, 909944, 889034, 875438, 818261, 782125, 808061, 882336, 870361, 896940, 878164, 779182, 730615, 693315, 655761, 690669, 694110, 650973, 619119, 554950, 536315, 604544, 598750, 638597, 630924, 593210, 583796, 559749, 532170, 524178, 510905, 524209, 489916, 442263, 416767, 437452]
12859D37452L7319j3575m8063j8259l847k1845k5895J5676J0578l8542k6112L6603
12847C41490M8276k2444k9160Q544j3264l9511K8179l7372l6032r03L2945J8264
12835B99012q5R2504K2570J9007k3650n9480n7472m9957L0783K8415k1506m0600
12823B39541R144K6757N9651p41n1729j4370J2362L8868j1785q831K5159O391
12811C30417l2448j3136l1170l8603J3160O2936L3843k2192k6929L057L1946L4374
12799C45255k2006k3936j0375j0479k9664m130L3873J8994J7622j1600J4209l1490
12787B86273r2943L1633O0029k8942l8762O44K4778J47p469J9826K5122J1894
12775B92230N849M0392m7762J9292M2962l0411q6933l1589J1314p0617k1605K1490
$$ y = [437452, 474771, 461196, 413133, 394874, 391027, 369182, 343287, 358963, 369541, 330999, 304887, 341490, 389766, 367322, 338162, 346706, 333442, 293931, 322110, 284738, 248706, 247803, 280748, 299012, 298927, 391431, 414001, 433008, 409358, 349878, 292406, 242449, 273232, 301647, 280141, 239541, 248685, 275442, 335093, 334352, 282623, 268253, 280615, 319483, 307698, 298867, 324026, 330417, 297969, 284833, 253663, 215060, 228220, 291156, 324999, 302807, 275878, 278935, 310881, 345255, 323249, 299313, 288938, 278459, 248795, 244665, 278538, 297532, 315154, 303554, 317763, 286273, 193330, 224963, 284992, 256050, 217288, 217932, 242710, 242857, 235388, 255214, 280336, 292230, 298079, 338471, 290709, 310001, 352963, 322552, 235619, 204030, 215344, 144727, 123122, 144612]
12763A44612N243p235j233M095R941N6503J6732k3887J0292K3271l1192j8423
12751A88719l692k1570L1474l5252J4198K7077J5086j0712m982j4409Q3N2869
12739B38889M4117K7376n2582k9757l5774k4176j2728J2134M4374k7458K0242
12728B04657K324l9709l4645l429N089M1703r001J7712M1190K4229M1235r4472
12716A96883L0501R1952N0990J4525p9911j8146M4785L4012M397J9535j7274M8142
12704D20391l3110p9092J7687Q3209q98P039R4994J04634J02308L9697J7387J7208
12692G91454Q4773N3718O82K7303k1767m9873m7916j2559o5055l8225O420p734
12680G21221P4191O5291M648K3193k3642k045k6905o3172L4502N7357M3245M1645
$$ y = [144612, 149855, 142620, 141387, 145482, 155423, 211926, 228658, 204771, 215063, 238334, 207142, 188719, 185027, 163457, 194931, 159679, 173877, 200954, 216040, 205328, 200346, 185937, 186020, 238889, 283006, 310382, 257800, 228043, 192269, 168093, 155365, 167499, 211873, 184415, 204657, 206981, 167272, 132627, 129198, 134287, 175990, 166989, 184701, 225891, 250120, 291355, 196883, 227384, 319336, 370326, 384851, 304940, 286794, 331579, 365591, 369988, 389523, 372249, 420391, 387281, 308189, 325876, 409085, 408187, 415226, 510220, 614854, 717162, 756859, 774246, 791454, 876227, 929945, 930627, 957930, 936163, 886290, 838374, 825815, 760760, 722535, 728955, 721221, 795412, 860703, 865351, 888544, 864902, 862857, 835952, 772780, 807282, 864639, 907884, 949529]
12668I49529L1089N1837L8401N0373k3312M092M8868J1452M4064J18755P5235
12657A400383j575k4809l7401k5996j8552k5335k7040p2112k2218J082k9364k2755
12645A094308j0901N049N4125l3242o240k2332K0222Q2848M1808k0136K3891n403
12633A223997k8084l7868o3036K0423j6378o2836j8024j9580j9655J1578L1938
12622A022475j12066l7885l6415j06811j2443l4107J5522k3026m5640m4019n299
12611E80286j7406j8672k2554j0936o9212m6028j9886j1016M2458Q0991j1394
12600D76631j05905p1623K306J7914j976j6085q979o61j0165L5454M6063M3878
12588D06852m4057k2233K7887l4005n7788k1160J6063P4945J4382n1196k8536
$$ y = [949529, 980618, 1032455, 1070856, 1121229, 1097917, 1102009, 1150877, 1162329, 1206393, 1325148, 1400383, 1398808, 1373999, 1336598, 1310602, 1292050, 1266715, 1239675, 1167563, 1145345, 1146427, 1117063, 1094308, 1083407, 1088456, 1142581, 1109339, 1103099, 1080767, 1100989, 1183837, 1225645, 1205509, 1229400, 1223997, 1195913, 1158045, 1095009, 1115432, 1099054, 1036218, 1018194, 998614, 978959, 990537, 1022475, 910409, 872524, 836109, 729298, 716855, 682748, 698270, 675244, 629604, 585585, 580286, 562880, 544208, 521654, 510718, 441506, 395478, 375592, 364576, 407034, 488025, 476631, 370726, 299103, 301409, 319323, 317347, 301262, 292283, 291622, 281457, 316911, 362974, 406852, 362795, 340562, 368449, 334444, 276656, 255496, 271559, 346504, 360886, 309690, 281154]
12577B81154k7177Q538K045j8491k9916J3543J0235j1293n225L162N3659Om4517
12564B35723J1523k5632K2571q640n6454j7989L7126J2742N5741m5284m2325n5557
12552A23545o340M6875K7913L584n8474M6104J15418j346J2463j4900o5923j493
12540B27426Q4296l967j3422m0607k5032K9543k0979j6293K7720K0785n1088N039
12528B23421O216M1181n880J1845K5078K5503l8155q037Q257J1671P459j432l1553
12515B75574l8755J5013J0906R563l6194r240j0036k061k7049L7334O5096p180
12503B82971p672p488j8056K3699K6994r301k7660k3767N316J3814K293L4845
12491B95988L0745j739k5706k4055R814L4329O852J5563k5154J9094L140j2134
$$ y = [281154, 253977, 262515, 264560, 246069, 216153, 229696, 239931, 228638, 223413, 226575, 280234, 280240, 235723, 247246, 221614, 244185, 235545, 179091, 161102, 198228, 210970, 266711, 221427, 179102, 123545, 117205, 164080, 191993, 195577, 137103, 183207, 298625, 297279, 309742, 294842, 228919, 227426, 311722, 307755, 294333, 253726, 228694, 258237, 237258, 220965, 248685, 269470, 218382, 223421, 229637, 270818, 264938, 276783, 301861, 327364, 289209, 281172, 289429, 301100, 308559, 307127, 275574, 236819, 251832, 262738, 272301, 236107, 226867, 216831, 214770, 187721, 225055, 290151, 282971, 275299, 267811, 249755, 273454, 300448, 291147, 263487, 239720, 245036, 258850, 261143, 295988, 326733, 324994, 299288, 275233, 285047, 319376, 326228, 341791, 316637, 335731, 338871, 326737]
12479C26737M9698p928P663l0682l6226k2660m5507n1206J8033k8031J7936L5466
12467B33293o971q885l0131M8640K2948L2760J2921L7311n812q195J4425L3870
12455C76174n871J9792Q5609M6443n7385P750r107k4005J4873m9729P217j5126
12443C96635K3347J2322m3819J460P4501N9299j7365o835k3220l0701L415J7897
12431D66936Q397m4516L2847O9491N1426K9705K5779l2342L6660K4515K7411P2095
12419G68404M1292J621l0954q1560p967M0921n410P4055J0832J9353m1860j3793
12407G74934k7530K680q83M4075Q0666K4879k945l1821L0403N2470l4555n2460
12395H59913K8602O2586m648k742P2963M4621K1053N5859K9931O3928P1155k653
$$ y = [326737, 376435, 368507, 376170, 345488, 309262, 286602, 241095, 189889, 207922, 179891, 197827, 233293, 226322, 217437, 187306, 235946, 258894, 291654, 304575, 341886, 336074, 327879, 342304, 376174, 370303, 390095, 475704, 522147, 464762, 472512, 463405, 439400, 454273, 404544, 411761, 396635, 419982, 432304, 388485, 389945, 464446, 523745, 506380, 499545, 476325, 445624, 449039, 466936, 475333, 430817, 463664, 533155, 584581, 614286, 640065, 607723, 644383, 668898, 696309, 768404, 809696, 811317, 780363, 698803, 690836, 731757, 726347, 800402, 811234, 830587, 788727, 774934, 747404, 750084, 749201, 793276, 873942, 898821, 895876, 864055, 894458, 946928, 912373, 859913, 888515, 951101, 946453, 943711, 1016674, 1061295, 1082348, 1138207, 1168138, 1232066, 1303221, 1300568]
12383A300568J05229O7583K5056M5224j6060Q648n6188l1055m1130k8201K9856
12372A409530L3258K8052N2783K4729L2649L9329j7499K1294K9230M8618L0185
12361A732158P6665Q3138P4689K2740O9392O6790J7495K9296O5432Q5702M6676
12350B370173N9745L5655L1786M9009R854l0143M2673O4350L6922L3714M1666
12339B745404N9778O570O194L1127M1816N7749Q140J2691O9347J61061P4787N1442
12327C326106J46060J10162R6113P2792J19437P7282J34469J10779Q0536R7899
12317D371635J30995J25094N6777N2441P9416N2479O9555J14778J27477Q1520
12307E262167J19912J84202K61763K70101J95279K22785K47896L47380L65767
$$ y = [1300568, 1405797, 1473380, 1498436, 1543660, 1527600, 1536248, 1480060, 1449005, 1407875, 1379674, 1409530, 1442788, 1470840, 1523623, 1548352, 1581001, 1620330, 1602831, 1624125, 1653355, 1701973, 1732158, 1808823, 1891961, 1966650, 1989390, 2058782, 2125572, 2143067, 2172363, 2237795, 2323497, 2370173, 2429918, 2465573, 2497359, 2546368, 2556222, 2526079, 2568752, 2633102, 2670024, 2703738, 2745404, 2805182, 2811752, 2817946, 2849073, 2890889, 2948638, 2956778, 2969469, 3038816, 3199877, 3274664, 3326106, 3472166, 3582328, 3678441, 3751233, 3870670, 3947952, 4082421, 4193200, 4273736, 4371635, 4502630, 4627724, 4684501, 4736942, 4816358, 4868837, 4938392, 5053170, 5180647, 5262167, 5382079, 5566281, 5828044, 6098145, 6293424, 6516209, 6764105, 7111485, 7477252]
12298G477252L41292M65121M88452N18451N77983O29899P15463P54347P71971
12289A2740231P69471Q10922R34031J057238J202902J420871J594499J663828
12281B2193993J668806J736952J835548J851590K093483K418614K740081L086648
12273C9625715L511279M200758N234417O682198Q335422R828334J0744538J0882760
12265I9045421J0014034Q471200O560308M667478K781705R29792p09911j882645
12257A29877382k288867k044495j396217p67143m4241P94001J649305K592537
12249A28372262L457035M161469M668215M759102M669770M484512M410663M216299
12241A63199327M138588M183982M141177M148053M384420M866929N602646O941475
$$ y = [7477252, 7818544, 8283665, 8772117, 9290568, 9868551, 10498450, 11213913, 11968260, 12740231, 13509702, 14320624, 15254655, 16311893, 17514795, 18935666, 20530165, 22193993, 23862799, 25599751, 27435299, 29286889, 31380372, 33798986, 36539067, 39625715, 43136994, 47337752, 52572169, 59254367, 67589789, 77418123, 88162661, 99045421, 109059455, 117530655, 124090963, 128758441, 131540146, 132469938, 131760027, 129877382, 127588515, 125544020, 124147803, 123380660, 123336419, 124130420, 125779725, 128372262, 131829297, 135990766, 140658981, 145418083, 150087853, 154572365, 158983028, 163199327, 167337915, 171521897, 175663074, 179811127, 184195547, 189062476, 194665122, 201606597]
12233B01606597Q514261R547784R483637Q096428N498569K241836r28635l133993
12225B40926484m137777m446587m596536m731955m937100n128673n241740n156570
12217B02549546m905700m638038m279527l914138l296986k353858j491273p76563
12209A76893463m58158m30814q14994j536287k384453l156761l679925l940222
12201A60491849m002968l953985m057777m298034m390444m425357m554013m969214
12193A25840057n710020o719169p393210p272901o473700n431185m498112l883626
12185G8458134l454687l228144l021790k780181k617422k594196k592668k630294
12177E5538752k562874k450940k333247k220354k123707j924072j717016j616717
$$ y = [201606597, 210120858, 219668642, 229152279, 237248707, 242747276, 244989112, 244060477, 240926484, 236788707, 232342120, 227745584, 223013629, 218076529, 212947856, 207706116, 202549546, 197643846, 193005808, 188726281, 184812143, 181515157, 179161299, 177670026, 176893463, 176435305, 176004491, 175189497, 173653210, 171268757, 168111996, 164432071, 160491849, 156488881, 152534896, 148477119, 144179085, 139788641, 135363284, 130809271, 125840057, 120130037, 113410868, 106017658, 98744757, 92271057, 86839872, 82341760, 78458134, 75003447, 71775303, 68753513, 65973332, 63355910, 60761714, 58169046, 55538752, 52975878, 50524938, 48191691, 45971337, 43847630, 41923558, 40206542, 38589825]
12169C8589825j488917j332494j223458j234939j128401r72156q99629q69903
12161B9439928q36772q79728r07680r00048q14211p45339p49872o86147p25379
12152B2194752p04247o26691n97696n86899n52600n16096m81892n43261n25723
12143A7059647m92182m99776m54369n21215m64174m19453m22380l53496m00504
12134A3032098m01682l41006m05281l76336m30593l49412l01007l42078k61596
12125I823107j93998k53001k30969k52402k36085k70468j99954j06507j68277
12116G911446j30032k02610k23406k25753j44835j18657j80612j45697j38506
12107F401338j66194j47013j54279j61473j30642j17410j01345j14534j36078
$$ y = [38589825, 37100908, 35768414, 34544956, 33310017, 32181616, 31209460, 30309831, 29439928, 28603156, 27723428, 26815748, 25915700, 25101489, 24356150, 23606278, 22920131, 22194752, 21490505, 20863814, 20266118, 19679219, 19126619, 18610523, 18128631, 17585370, 17059647, 16567465, 16067689, 15613320, 15092105, 14627931, 14208478, 13786098, 13432602, 13032098, 12630416, 12289410, 11884129, 11507793, 11077200, 10727788, 10426781, 10084703, 9823107, 9629109, 9376108, 9145139, 8892737, 8656652, 8386184, 8186230, 8079723, 7911446, 7781414, 7578804, 7355398, 7129645, 6984810, 6866153, 6685541, 6539844, 6401338, 6235144, 6088131, 5933852, 5772379, 5641737, 5524327, 5422982, 5308448, 5172370]
12098E172370j21579j26173j41457q5077o6986r5963r8202j02632q2113q8449
12088D163739r6036q7103j57690j35197k8443o2498r2152q9493o6204r5960r7577
12077C155386r4293o8673m9520m2109m1925o4361o9948J1534o9190q8674n2906
12066B525321m0579k6952p4540o3104q3057q1038j01488q0112l8782n6390m7978
12055A831301p4346r2355j7597l16l1238m0046o2398j10525p7619R91m9042m0277
12043A236533J1855r155n8907l0304k2389k500K1771j9282j5186J6958l0164q1388
12031A017842o6587j0648m022L4114m593p7076m5683J5150J6231o2295k0971K5354
12019H16816j6331k5247k7721m7241l5894L3289j8619J7482K2748k9566k1899
$$ y = [5172370, 5050791, 4924618, 4783161, 4698084, 4631098, 4535135, 4436933, 4334301, 4252188, 4163739, 4067703, 3980600, 3822910, 3687713, 3659270, 3596772, 3504620, 3415127, 3348923, 3252963, 3155386, 3061093, 2992420, 2942900, 2900791, 2858866, 2794505, 2724557, 2736091, 2666901, 2578227, 2525321, 2484742, 2457790, 2383250, 2320146, 2237089, 2156051, 2054563, 1974451, 1935669, 1879279, 1831301, 1756955, 1664600, 1647003, 1646687, 1615449, 1575403, 1513005, 1402480, 1324861, 1325852, 1276810, 1236533, 1248388, 1239233, 1180326, 1150022, 1127633, 1125133, 1146904, 1127622, 1112436, 1129394, 1099230, 1017842, 951255, 940607, 936585, 970699, 966106, 889030, 843347, 858497, 874728, 812433, 791462, 816816, 800485, 775238, 747517, 700276, 664382, 697671, 679052, 696534, 719282, 689716, 667817]
12008F67817K5203j3750l5874j4666L1239O6010J68j5283K128q9091J2586N6149
11996F92636K3066j9628k842J6566n940j9641k6126J1701M3093j2324m2269n0642
11984F07650N3201O309j8613K2085j2228N464N949k4793n5371P165M3750j7902
11972F22666m946l7636n1519K3505j5922M572l2282k6306J6093j9049Lj95J9239
11959D98223m0958k9443j6583l706p884j2470J0945J9814j2695J3703j300k5046
11947C92600K0954k0387m4043l289J2563J2249o1899R03K2618K8810K8201k2785
11935C66495O434k2158k8494O890l1327m0400k4438K186l4022l2357j8531K8175
11923A78453m4859o4349L8900L0154l1110k8497L9097j74J9931j8830m4077K4669
$$ y = [667817, 693020, 679270, 643396, 628730, 659969, 725979, 726147, 710864, 712992, 623901, 636487, 692636, 715702, 696074, 693232, 709798, 703858, 684217, 658091, 669792, 712885, 700561, 658292, 607650, 660851, 667160, 648547, 670632, 658404, 663868, 669817, 645024, 589653, 596818, 640568, 622666, 617720, 580084, 528565, 552070, 536148, 540720, 508438, 482132, 498225, 479176, 479179, 478984, 498223, 457265, 427822, 411239, 407533, 399649, 387179, 398124, 417938, 405243, 418946, 417646, 392600, 413554, 393167, 349124, 345835, 358398, 370647, 308748, 309651, 332269, 361079, 389280, 366495, 372929, 350771, 322277, 329167, 297840, 257440, 233002, 235188, 201166, 168809, 150278, 178453, 133594, 69245, 108145, 138299, 107189, 78692, 117789, 117615, 137546, 118716, 74639, 99308]
11911I9308n776k2102J1954j060K233k1025k4682J1175L823M2232M993J3057L891
11898A18021j4149L593o7l0750j8678Q8835p590l0120k0746K9036R657p021J2558
11885A32579L1114l5633l2844l4689J5752Q27k4667P1278n7093j1460K0202l728
11873G1638J5312m9835j3206L0535n2021p1700L7271J13887M0387m1003j8556
11862F2709L0941Q015J6650K4665K8919m7442m4540m809O881M1497L0534L4160
11850A88180J83N119l001m5477J6707k8535p194M9247N1894K5333J6860l4257
11838B35059j2343N8654M6892N604k9896J4485N5428J02935J15999M8781k2408
11827F19190n35K8783J880J0678K7030J3514j7550K4981L5369j221J843k4011
$$ y = [99308, 93532, 71430, 83384, 82324, 84557, 63532, 38850, 50025, 53848, 96080, 101073, 114130, 118021, 103872, 107465, 107398, 76648, 57970, 146805, 139215, 109095, 88349, 117385, 127042, 120021, 132579, 163693, 128060, 95216, 60527, 76279, 77106, 52439, 123717, 66624, 55164, 75366, 71638, 86950, 37115, 23909, 54444, 2423, -69277, -32006, 81881, 122268, 81265, 62709, 93650, 101665, 118315, 142980, 171899, 124457, 79917, 75108, 81989, 123486, 154020, 188180, 188363, 193482, 190481, 145004, 161711, 133176, 125982, 175229, 227123, 252456, 269316, 235059, 222716, 281370, 328262, 333866, 303970, 318455, 373883, 476818, 592817, 641598, 619190, 618655, 647438, 649318, 659996, 687026, 700540, 682990, 707971, 743340, 742119, 743962, 719951]
11815G19951O855O9638L7239K9791L7854K3182m6744k3272N1172P657O2328R6467
11803A072118Q0599N5232R768R028j0546J9058O5073J076r798j5433j9823j7842
11791A238510L6685O1496k9712o4383n3836m5965j8062N8032j0053n5722o1945
11780A055045o0151m5002o0912K8390K5306k8474p326o150l5323o5502J9222O9948
11768H89071L9593q5677l4204J00084K0356q1698k8310Q959k9912n9401p5795
11757F63066r8556o283K5421n5670p4779k497m10j9j8098p7800l5567k9435K9864
11744C19237N1084J6329n7502p8315j7254m4365m6573R590m2041N076O3151O440
11732A84857l4617k4178N639O3853K1231K5984L9955m0617M638r7457m8925N734
$$ y = [719951, 726806, 796444, 833683, 863474, 901328, 924510, 877766, 854494, 905666, 913323, 975651, 1072118, 1152717, 1207949, 1217717, 1226745, 1216199, 1235257, 1300330, 1301406, 1291608, 1276175, 1256352, 1238510, 1275195, 1336691, 1306979, 1242596, 1188760, 1142795, 1124733, 1182765, 1172712, 1116990, 1055045, 994894, 949892, 888980, 917370, 942676, 914202, 906876, 900726, 865403, 799901, 819123, 889071, 928664, 842987, 808783, 908867, 929223, 847525, 819215, 828174, 798262, 738861, 663066, 564510, 558227, 583648, 527978, 453199, 450702, 450292, 450273, 432175, 354375, 318808, 289373, 319237, 370321, 386650, 329148, 250833, 233579, 189214, 142641, 152231, 110190, 115266, 178417, 184857, 150240, 126062, 131701, 195554, 216785, 242769, 282724, 242107, 246745, 149288, 100363, 106097]
11720A06097N075J3150k0097j775J3736L4020l8798l3149l964k0905j3280J0703
11708E0813R387m0103J9417N853L8540K8940j333k0057n757o5145n752M758K4005
11695D3566J724J8190p1025m9416L6744N7037K3283k1513j7045N2527L0381o4159
11683D0294M237k6593n5429J3010K6015J6986M2905M0664k6925n4193p454M5107
11671E8624J9871l8650r384l40K3076K2990J5478J1247j2582O51l6372m3763j0015
11658H31M5796K2729p3420k1081O3427k7503n9940m5744O2275L6839L3223O955
11646D4387k397m3016J3074O7848m121k5939p589k7802N862k2835j0487l3535
11634d6550K0577J7489L1246M3625Q298L800K8660k9927l9111k1238j0444k001
$$ y = [106097, 111172, 124322, 104225, 102450, 116186, 150206, 111408, 78259, 74295, 53390, 40110, 50813, 60200, 20097, 39514, 45367, 83907, 112847, 111514, 91457, 85700, 20555, 14803, 19561, 43566, 45290, 63480, -7545, -56961, -20217, 36820, 60103, 38590, 21545, 74072, 104453, 40294, 44531, 17938, -37491, -24481, 1534, 18520, 61425, 102089, 75164, 20971, 13517, 58624, 78495, 39845, 30461, 30121, 53197, 76187, 91665, 102912, 90330, 90981, 54609, 10846, 831, 46627, 69356, -4064, -25145, 38282, 10779, -49161, -94905, -32630, 4209, 37432, 44387, 41990, -1026, 12048, 79896, 75775, 49836, 42247, 14445, 20307, -2528, -13015, -46550, -25973, -8484, 22762, 66387, 74685, 78485, 107145, 77218, 38107, 16869, 6425, 4424]
11622D424K6168L769k1224J7400L0964n0431l6930O1944P5394k4493J7791J7214
11610A21990n4998K6431L2045j0768L81n018o4184m3010n3562P286L9662J0464
11598F719J755K1851K5905l8047m4833K1666K0591J3702k1564P469K0226j1365
11586B4075l5966o357Q271L6877n004L2634K5859j2232j998K9619J6868q568j059
11573A03019k4432N439M100m117L0631M896o332m5958m7768m0406L0208J0534
11561A9814K1276K2412L040J0007K6288m723K3366O399k5792n3931K7164P8205
11549A53525L4590N6152J9631m5026m9046m0526k6218k5377J5635K6084K8940
11538A48364J0056L7058O4443J0189k2132J3006n667n0882j4869k2360o5049J5800
$$ y = [4424, 30592, 34361, 13137, 30537, 61501, 11070, -25860, 36084, 111478, 86985, 104776, 121990, 66992, 93423, 125468, 114700, 115081, 110063, 45879, 2869, -50693, -43407, -3745, 6719, 8474, 30325, 56230, 18183, -26650, -4984, 15607, 29309, 7745, 15214, 35440, 24075, -11891, -18248, -9977, 26900, 21896, 54530, 80389, 68157, 66159, 95778, 112646, 104078, 103019, 78587, 84026, 88126, 84009, 114640, 119536, 113204, 67246, 19478, -20928, 9280, 19814, 41090, 63502, 66542, 76549, 102837, 98114, 121480, 127879, 102087, 48156, 75320, 153525, 188115, 244267, 263898, 218872, 169826, 129300, 103082, 77705, 93340, 119424, 148364, 158420, 195478, 259921, 270110, 247978, 260984, 255317, 204435, 189566, 167206, 102157, 117957]
11526A17957M0042N754k1505k1099J5747o641p949k6001q018n0369n164l8658
11514e904r028L945L5199M6538j1600j7474M5010O9652J3058L4643j6411k3844
11502A63784K4618l2343j05732n5000j0763K6564J3373L235J936J2951K6946j6576
11490E2993k908L0327n042j4180j4015j6787q075k1177L803q807R0044k2366n4776
11477I034j1468K9983Q571J6656P4924M8868L3894m6456o2547j2722o0169k3925
11465D643j1204n8219L212j7478k0945M8846M7526k993J113J2267Q957m6242l2716
11452f3233J4920J1670K0334k8797J6042L3072M6785j3256l4275K2902K9812P3906
11440A29882k495p6903n2785l0539L1647N9712j9847m7534l9721k4321J8871P340
$$ y = [117957, 157999, 163753, 142248, 121149, 136896, 130255, 122306, 96305, 88287, 37918, 32754, -5904, -14932, -10987, 24212, 70750, 59150, 41676, 86686, 156338, 169396, 204039, 187628, 163784, 188402, 156059, 50327, -4673, -15436, 11128, 24501, 27736, 29672, 42623, 69569, 52993, 50085, 80412, 75370, 61190, 47175, 30388, 22313, 1136, 4939, -3868, 86176, 63810, 9034, -2434, 27549, 36120, 52776, 127700, 176568, 210462, 164006, 101459, 88737, 28568, 4643, -6561, -64780, -61568, -79046, -99991, -51145, -3619, -6612, -5499, 6768, 15725, -30517, -63233, -48313, -36643, -16309, -45106, -29064, 4008, 50793, 37537, 3262, 26164, 55976, 129882, 127387, 50484, -2301, -32840, -1193, 58519, 38672, -8862, -48583, -72904, -54033, -46693]
11428d6693L2168L9132j3562K503k1416l787j7781n0464m7026L8450N8377K484
11416b7615k0117L918k689l1017j670k9461K3824J8545J5075l9698N414K8494
11404e6997j1276J9144M4942n0057o171J397K1307L0553k0553l8968l3059q205
11392a07943k7881M2881N6738k3365K5046l1134K5408J6661M3479J2324j4975
11381A7239m7951n2583n6914L9166K9239k861n015J9587M0923N8617K8673k548
11369F5572k6613m6837J7621O4399l238j7841k770N182m6913j2962L4533m3004
11357a2871m1430o0284k1519Q209j3892j5484K5768M531M7319L7285k4084M4701
11345b1751N8867J532M2076L396L1803j879q3508k8855M682K0033l8812q78M6750
$$ y = [-46693, -14525, 24607, 11045, 13548, -7868, -11655, -29436, -79900, -126926, -88476, -30099, -27615, -47732, -43814, -46503, -77520, -79190, -108651, -84827, -66282, -51207, -90905, -85491, -56997, -68273, -49129, -4187, -54244, -60415, -59018, -37711, -7158, -27711, -66679, -99738, -107943, -135824, -92943, -36205, -59570, -34524, -65658, -40250, -23589, 19890, 32214, 17239, -30712, -83295, -140209, -101043, -71804, -74665, -79680, -60093, -19170, 39447, 68120, 65572, 38959, -7878, 9743, 74142, 70904, 53063, 50293, 55475, 8562, -4400, 30133, -12871, -54301, -114585, -136104, -127895, -141787, -157271, -131503, -126972, -79653, -42368, -66452, -21751, 37116, 38648, 80724, 84120, 115923, 114044, 30536, 1681, 6363, 26396, -12416, -13294, 33456]
11332C3456P512J4317Q277m9425r618J728m8394J5928J8220J8754K3686p620k8077
11319a256n4524j0757K7991j669K2272K4813Q181p7442J6426O9515j5073M69J5917
11306B4863n5740P897k3861Q250M2123l0258j2916N9359J0728l0376k1054n708
11294b6693j7017P383O928N6357Q115J3744j6886l0451Q165Q023L6507l2723m2424
11281b0972N4463k4081P100J0007j2328j4816k7368K649q545m271L9825M4217
11269D5880P970m3724m9732M1519J2020k7810L3274J4588M2471l9239n5021j0170
11257b7974l3637L7431N8661M1812p6419j1710P5000J4738m1938l669L9450J2675
11245H4420n5819J2358M3988N9714k8267m0573k7826K6028m2098n8995o2111m4796
$$ y = [33456, 40968, 55285, 63562, 14137, 4519, 6247, -42147, -26219, -7999, 10755, 34441, 26821, -1256, -55780, -66537, -38546, -40215, -17943, 6870, 15051, -62391, -45965, 23550, 8477, 8946, 24863, -30877, -22980, -46841, -38591, 3532, -26726, -39642, 19717, 30445, 69, -20985, -26693, -43710, -36327, -29399, 26958, 35073, 48817, 31931, 1480, 9645, 17668, 54175, 21452, -20972, 33491, 9410, 16510, 26517, 14189, -627, -27995, -25346, -33891, -38162, 1663, 45880, 53850, 10126, -39606, 1913, 13933, -13877, 19397, 33985, 76456, 37217, -17804, -27974, -61611, -24180, 34481, 76293, -126, -11836, 63164, 77902, 35964, 32295, 71745, 84420, 28601, 40959, 84947, 144661, 116394, 75821, 47995, 74023, 31925, -27070, -89181, -133977]
11233a33977N4439J2476J8127K9234J1775q765p769L4018k4933j6204j5072N382
11221d1269J4337L7907l3268m028O4787M533o583J9553L3169J0989m5668j04033
11209d9574j0705N8490m0420n6068k0525K5695p952M4171R6520k1663K2956l6486
11197D439P397O937O764m1864k6090K0744n238j0319q187m0727j9703L4992Q2508
11184A1653J7152j00364k4722L0163N6812K8960q929R564M5785p207r340k0638
11172B8889n3350k7009m1585O074Q0518N9710o896p113k0616L1802K8108l4518
11160D4014j1717R016m1464J9655M3503p4214j5846K6571Q926k0393O417k0122
11148b5654R905K937j9963N7960L1881L0701j2840n8595j9736o990L4215R756
$$ y = [-133977, -79538, -67062, -48935, -19701, -7926, -16691, -24460, 9558, -15375, -31579, -46651, -41269, -26932, 10975, -22293, -26321, 38466, 42999, 36416, 55969, 89138, 100127, 54459, -49574, -60279, -1789, -42209, -98277, -118802, -93107, -101059, -56888, 39632, 17969, 40925, 4439, 11836, 18773, 25537, -16327, -42417, -21673, -26911, -37230, -45417, -86144, -105847, -70855, 11653, 28805, -71559, -96281, -66118, -9306, 19654, 10725, 20289, 66074, 58867, 49527, 28889, -24461, -51470, -93055, -86981, -6463, 53247, 46351, 39238, 18622, 50424, 78532, 44014, 32297, 41313, -151, 19504, 63007, -11207, -27053, -482, 8444, -11949, -5532, -25654, -15749, -12812, -32775, 25185, 57066, 87767, 74927, 16332, -3404, -10394, 23821, 33577]
11136C3577r5800j0978M2647N9150j5600n1692k6407L7190j498j6095L2755q68
11124a3619j321K2883L0574Q689Q43m203p3473m6541M542K7547o172k168J2383
11111d0036M8604j0852J3930L0426n0531l8721J3319j9279N7955m5846n0023L756
11099h7298M7588J8470m8972j0324M0550M4780Q175K456J8997m3015q3417R1041
11087i69Q82p8250j0126L7655l1170p31J4170Q2023J0994l5361o5882n945j3469
11074i6179n065N4790N9988k2506l2111K0611j8230J9455k288j9105K6239J9716
11062E315j0317M0051j0085n324l9418l3855j9069m1808P1771M0648K1709J8124
11050C7742L8284J7103k3720l6101J2846Q169l58m9447P262K2075k5067l5866
$$ y = [33577, -62223, -73201, -30554, 28596, 12996, -38696, -65103, -27913, -29411, -45506, -12751, -13619, -14940, 7943, 38517, 47206, 48049, 43846, -29627, -76168, -71626, -44079, -50251, -52419, -40036, 8568, -2284, 11646, 42072, -8459, -47180, -33861, -53140, 4815, -41031, -91054, -87298, -39710, -21240, -70212, -80536, -39986, 4794, 12969, 15425, 34422, -8593, -92010, -969, -87, -78337, -88463, -50808, -81978, -82709, -68539, 13484, 24478, -10883, -76765, -82710, -96179, -101244, -46454, 13534, -8972, -41083, -20472, -38702, -19247, -21535, -40640, -14401, 5315, -5002, 35049, 24964, 19640, -19778, -53633, -72702, -114510, -42739, -2091, 19618, 37742, 76026, 93129, 69409, 33308, 46154, 54323, 53965, 4518, 11780, 33855, 8788, -27078]
11038b7078J8217j9991J5815Q310j8207L3063O0884O8257L574l5509p3160q1998
11026d7823m0356J2877N8540K8135l8302l8213k3170L7381N6936O5979M8233L003
11014A23220l6851r1464M5889M8563q9257n9132K2066K8451j0443r357M8914k1962
11002a363m48l5l5369j6073j5844J8657m2759j3045P5439M1551l5512m0044J1152
10989e3693J4701J4009j362J1831l1404m6286m7413l224N5878N3404M8111m3518
10977b8966l4311J1991K7523j1405J8121K2010O8972m592j1500n6421l7751J1597
10965b4732n7125M5769L2007k3981r549j2502K6057J3369J3276j5895l1760j1863
10953e6929L961L3967j091M357o3176j7615K3358J1110j3459L8894M6476j661
$$ y = [-27078, -8861, -28852, -13037, -4727, -22934, 10129, 71013, 139270, 142844, 107335, 34175, -47823, -88179, -75302, -16762, 11373, -26929, -65142, -88312, -50931, 6005, 71984, 120217, 123220, 86369, -5095, 40794, 89357, 100, -59032, -36966, -8515, -18958, -28315, 20599, -1363, -1811, -1846, -37215, -53288, -69132, -50475, -93234, -106279, -30840, 10711, -24801, -64845, -53693, -38992, -24983, -26345, -14514, -45918, -92204, -139617, -142841, -86963, -33559, 14552, -28966, -63277, -51286, -23763, -35168, -17047, 4963, 73935, 69343, 57843, 1422, -36329, -24732, -81857, -36088, -4081, -28062, -37611, -50113, -24056, -10687, 2589, -13306, -45066, -56929, -52968, -19001, -20092, -15735, -78911, -96526, -73168, -62058, -75517, -36623, 9853, 8192]
10941H192l2756p8703k3680K6110L5133K8996q234J1774L840k2743K6276M4068
10929A8273P5963m5184o3983j9561p559J6554O9035m3821r6106J8796j1139o2959
10917a51691j6458M0488J2773M923L5586K2538J4025l180j0597l995O639K6866
10905b2083K2923J08R115m2521k5862K6588J8090l4530l393K6543n435N6142J0789
10892C6474m3675J5287L8016j2582l9930J6960k6780p3687j913M8506J8315J5092
10880i917L9505K4950l3456M208M551j4355K6869J04673L0081J5919k7895l462
10868A61671p9997o5083m4944k5664j3635n8794J7628L2783R8623O57j8570m9495
10856d4820j4305l4422k5384L4500M3077k04N6641K3629l2506J812J4727l6294
$$ y = [8192, -24564, -103267, -126947, -100837, -65704, -36708, -44942, -33168, -29328, -52071, -25795, 18273, 94236, 49052, -14931, -34492, -42051, -25497, 43538, -283, -96389, -77593, -88732, -151691, -168149, -127661, -114888, -109965, -74379, -51841, -37816, -40996, -51593, -55588, -48949, -22083, 840, 948, 10063, -32458, -58320, -31732, -13642, -48172, -51565, -25022, -30457, 25685, 36474, -7201, 8086, 46102, 33520, -6410, 10550, -16230, -89917, -91830, -43324, -25009, -9917, 29588, 54538, 21082, 25290, 29841, 15486, 42355, 147028, 177109, 193028, 165133, 161671, 81674, 16591, -28353, -54017, -67652, -126446, -108818, -76035, 22588, 23245, 4675, -44820, -59125, -93547, -118931, -84431, -41354, -41558, 15083, 38712, 6206, 8018, 22745, -13549]
10844a3549n807K7889j3681l6969r33M7904M4062j3497J925K4468L2611r8859
10832d436k5230J9051L5145m7163n036J9006L6379K2252J275M0611l3054m7120
10820A1680O462l2430L637l5026l0617k3574r576J1605R570J548J8873K608R096
10807e6144K6182L3012o4316l0119L290M7504Q060P041M0681n7402j9883j0329
10795g2423K4836L5302N741m6221m2867J9812L2660O132r003K787r861j3767l147
10782g0019P732j4095L1558j0404m5916k3849K1409M7652O4694n3095K9830K5493
10770A0990o0869l304J0077L3326K5895l1221K1354J1887r2828o376J1691P5812
10758F434P0659l2048m3153l8340m0634j5882o328l1264k8618R90P3866N355l0493
$$ y = [-13549, -19356, 8533, -5148, -42117, -43050, 4854, 48916, 35419, 37344, 61812, 94423, -4436, -29666, -10615, 24530, -22633, -27669, -8663, 27716, 49968, 51243, 91854, 58800, 11680, 18142, -14288, -10651, -45677, -76294, -99868, -109444, -97839, -88269, -86721, -67848, -65240, -56144, -29962, 3050, -61266, -91385, -88095, -40591, -32531, -25490, 15191, -42211, -62094, -72423, -47587, -12285, -6544, -52765, -95632, -75820, -43160, -37028, -46031, -43244, -53105, -66872, -70019, -62287, -76382, -44824, -55228, -101144, -124993, -103584, -55932, 8762, -44333, -14503, 10990, -49879, -53183, -43106, -9780, 16115, -15106, 6248, 18135, -74693, -81069, -69378, 6434, 77093, 45045, 1892, -36448, -77082, -92964, -99292, -130556, -159174, -158184, -84318, -78963, -109456]
10745a09456k2467K9487l5202J2607M5261Q8798Q3161m2929k8071O919m880n6880
10733c3652P247J0886L7492j8833k4810j0615n0669k0091L3206J0899l0058k2694
10721a11692l0873N794L1199N4875L9605J8586K0206P601p4716K6498L6664l2614
10709h867l3353j1119L0388J6864k2391J7192J7343m9525k3811K5370M095m2476
10697h0290q660L2942M1756q353n9083K658O4268j6693R585m9573J1380L8067
10685b1996p052J8726R105j2379J411m4529R175K3103j4493k0625p265k7796q71
10672i5486L2290O836m3266l054K4415M7416J6521m5334j6115O1183M2498J3738
10660D1642j0959m1628n9429J9195M433M0747l885k4247k464J1683N4529L408
$$ y = [-109456, -131923, -102436, -137638, -125031, -79770, 9028, 92189, 49260, 21189, 28108, 23228, -33652, -26405, -15519, 21973, 3140, -21670, -32285, -82954, -103045, -69839, -58940, -88998, -111692, -142565, -136771, -105572, -50697, -11092, 7494, 27700, 35301, -39415, -12917, 23747, -8867, -42220, -53339, -22951, -6087, -28478, -11286, 6057, -43468, -67279, -41909, -37814, -80290, -88950, -56008, -14252, -22605, -81688, -79030, -14762, -31455, -21870, -71443, -60063, -21996, -29048, -10322, -1217, -13596, -12185, -56714, -47539, -24436, -38929, -59554, -66819, -94615, -95486, -63196, -56360, -99626, -102680, -78265, -30849, -14328, -59662, -75777, -14594, 27904, 41642, 30683, -10945, -70374, -51179, -46746, -5999, -9884, -34131, -36595, -24912, 29617, 33025]
10648C3025k7632l0918j8656m8744j0286Q6773J4853K6737m725K471N3770M3467
10636A20135k8769l4560j9316J791J9974k5680m9320q0052k5304j5466K4097N5515
10624e6955O032j3304r421M1409N6062J6271l4696l4366l5326P1034K4377j9130
10612A1987l5868k4959J1570L16m0385N353K9671l940M091J7358m0903M2289J3996
10599i424j8488J0214J9405K0796J6455q708k8742J5079j0120k5943M2191O5089
10587H7804J0878n2180l1426M633J9701r371j4065J0967N3104K6386p3425l4591
10575a585J059m6406J0561p470l82k6018j9059O082P7729K8364o2488K2043L4242
10562A6672k2575N2094K1167l8622k0196k6443l1560m1837L4876N4725j0158J5990
$$ y = [33025, 5393, -25525, -44181, -92925, -103211, -16438, -1585, 25152, 20427, 22898, 76668, 120135, 91366, 56806, 37490, 39281, 59255, 33575, -15745, -95797, -121101, -136567, -112470, -56955, -50923, -64227, -73648, -32239, 23823, 40094, 5398, -28968, -64294, 6740, 31117, 11987, -23881, -48840, -37270, -36954, -77339, -71986, -42315, -46255, -42164, -24806, -65709, -23420, -9424, -27912, -17698, 1707, 22503, 38958, 30250, 1508, 16587, 6467, -19476, 22715, 87804, 98682, 46502, 15076, 19709, 39410, 30039, 15974, 26941, 80045, 106431, 33006, -1585, -526, -46932, -36371, -43841, -44223, -70241, -89300, -83218, -5489, 22875, -39613, -17570, 16672, -5903, 46191, 67358, 28736, 8540, -17903, -49463, -91300, -56424, -1699, -11857, 4133]
10550D133m250K7938n4927l3562p100J7344j148K3676L5775K2146m8759m801K4126
10537E91m8528P996L6290l1800m1243J9800K3889j537K053r364j01718J0081Q2590
10524e0900N5895o104l144j3906k5502j231N3912L4344l8638K6260l9872L4357
10512B5471N522m6881L1969l2728n5189j4580L1616N555R301M6177J3077J1520
10500C0830j1574l3268M2090N6758j2278l3047K1339l6225o5507M130N6032O807
10488B6087k8614l245n44M70p1963k071J8275M7744O7930p485m5590K712J7088
10475B0794J998J2142q940m1842P4866L9231p782l6770l9026j1769L2274j8368
10463A6808Q511o1287k0598k1323K1400m517K7107L1448M9081j7611k8884J0672
$$ y = [4133, -117, 27821, -27106, -60668, -67768, -50424, -51572, -27896, 7879, 30025, -18734, -23535, 591, -47937, -39941, -3651, -35451, -76694, -56894, -33005, -34542, -32489, -41853, -143571, -133490, -50900, 4995, -1109, -4253, -18159, -43661, -44892, 9020, 43364, 4726, 30986, -8886, 25471, 30993, -15888, 16081, -16647, -71836, -86416, -54800, -49245, -39944, 6233, 19310, 30830, 19256, -14012, 28078, 84836, 72558, 39511, 60850, 24625, -40882, -36752, 19280, 26087, -2527, -5772, -6316, -5846, -77809, -79880, -61605, -13861, 54069, 46584, 994, 3706, 20794, 22792, 34934, 25994, -15848, 59018, 98249, 90467, 53697, 14671, 2902, 35176, 16808, 25319, -35968, -56566, -77889, -56489, -61006, -33899, -2451, 46630, 29019, 135, 10807]
10451A0807j2051P521M3838N9077K526l3134J0654p0673k83J4479r023m714k1219
10438b195l5540l2913j454K8866M5826L2899q43k1930k3887k2485L5294L9034
10426D0672q037J8929m035p3046n856N9176K6563k5599k8055j7036J1714M1779
10414C7169K4718p4454K61p019l26N5337j8399m4386m1519O0431L0254l2720j6168
10401b6821j1499K9862J0987l6884l7349K7398L3271L9446K3901O409M8141K849
10389A09711L5871K3786K5196L2617m4822l031j9810K7246j0583o7708q552k9069
10377G0852m3658k5799J6331L3164J248R964K5817m2688q998K8508k0030o0986
10365a6275n610M3812L2692l8593r197j4087l3730O4514M2655r35K0073K602N947
$$ y = [10807, -1244, 6277, 50115, 109192, 111718, 78584, 89238, 18565, 18282, 32761, 23738, 19024, -2195, -37735, -70648, -72102, -43236, 2590, 35489, 34646, 12716, -11171, -33656, 1638, 40672, 32635, 51564, 47529, -25517, -31373, 27803, 54366, 28767, 712, -16324, -4610, 37169, 61887, -12567, -12306, -19325, -19651, 35686, 17287, -27099, -68618, -8187, 22067, -10653, -26821, -38320, -8458, 2529, -34355, -71704, -44306, -11035, 28411, 52312, 58721, 106862, 109711, 145582, 169368, 194564, 227181, 182359, 179328, 159518, 186764, 176181, 108473, 99921, 70852, 27194, 1395, 17726, 50890, 52138, 62102, 87919, 45231, 36233, 64741, 44711, -16275, -21885, 21927, 54619, 16026, 6829, -7258, -40988, 23526, 66181, 65246, 85319, 87921, 93868]
10352I3868K4101k8358N201R024K4189k8735n0542K7141L8184n7225l3685l3645
10340a0482q461r923l2676k4222O1603O4723k074K0920q8639k7036k5707L4036
10328d7938N1939J8903K347K114M055m5639l6446K5349M1999k9296r877j4565
10316c7055m2151K73L9472M0584K7427l4225N981L916J1327J6474m3198j4190
10304b5365N5876L3492l6814J3108L2196m8092o7075j065J1344j6842k8639k3541
10292a01417J22J4331L6626J31813L8238j2200q2254m3500k7474n532M6039K8963
10280B3755k9170m7998P767L8310N8336q046k6249k0444L018M9646M8516l8636
10268E8805k1537j5357k7095K5471o1406j9661q180O7951M1757k1591k1530m5507
$$ y = [93868, 117969, 89611, 94812, 103836, 128025, 99290, 48748, 75889, 114073, 56848, 23163, -10482, -18943, -28866, -61542, -85764, -24161, 40562, 38488, 59408, -29231, -56267, -81974, -47938, 4001, 22904, 25251, 27365, 31420, -14219, -50665, -25316, 16683, -12613, -22490, -37055, -79206, -78933, -39461, 1123, 28550, -5675, 306, 4222, 15549, 32023, -11175, -25365, 30511, 64003, 27189, 40297, 72493, 24401, -42674, -43739, -32395, -49237, -77876, -101417, -101295, -86964, -50338, 81475, 119713, 107513, 25259, -18241, -45715, -51247, -5208, 23755, -5415, -53413, -45646, -7336, 51000, 42954, 16705, -3739, -721, 48925, 97441, 58805, 37268, 21911, -5184, 20287, -41119, -60780, -68960, -1009, 40748, 19157, -2373, -47880]
10256d7880Q047p059O4559j3202L777R038M9630L6j0952j3112J2211J2512J7582
10243H5187l8399p8807k7786L5191j60M1976K5310M3484m3099l7359j038M5971
10231E0471n0997n6061K7617M0543J7741J3594L1798J8679Q409n1643j0463j9325
10219B0363o2267o81k0093N573P7265J15329J12532J33948O8591M0201J08157
10208E98918J04989O0996J4515P4140J8343o1912j18350n6929n6760j31001j35860
10197C11089j00264l4035M2468m553k9734K6592j3348O287K8490k9511j8406p610
10185A77465M9040L9495j8255j586K2842L9309N8877P0840Q1126J1911j9115k9128
10173D82821j9910J948n720O088k7699r4293m7112j6746o7154n1846J0517J484
$$ y = [-47880, -39833, -46892, 17667, 4465, 8242, 17280, 66910, 66946, 55994, 42882, 55093, 67605, 85187, 46788, -32019, -59805, -24614, -24774, 17202, 42512, 85996, 42897, 5538, 4500, 50471, -526, -56587, -28970, 11573, 29314, 42908, 74706, 93385, 101794, 50151, 39688, 20363, -41904, -42585, -62678, -57105, 20160, 135489, 248021, 381969, 450560, 490761, 598918, 703907, 764903, 779418, 853558, 871901, 809989, 691639, 634710, 577950, 446949, 311089, 210825, 176790, 219258, 214705, 184971, 211563, 198215, 204502, 232992, 203481, 185075, 177465, 226505, 266000, 247745, 246159, 269001, 308310, 367187, 438027, 519153, 531064, 511949, 482821, 462911, 464859, 459139, 465227, 437528, 343235, 296123, 279377, 212223, 160377, 170894, 172378]
10161A72378l8197L4264P336j8528m498l1823l7714L2793k5175m7071j2329N4625
10149H6061P9353J1917j361o7550L2331k2335n9129l207j1962q211L0849L911
10137G0667j1767p9755l8914J1520K258q913p856M5218P9508q724m5185k894O6716
10124G1879J1026j6771J9351p6738j7783K0582k6455k0701M817J4315l7100o7764
10112a21342J1790M6767O9199k425L0127N2945J7657j6308p337o2358o1732L4039
10100h978M4655n508l093L5226l5588J226J9704O615m340j247P5750l0704l9964
10087E3754l0420Q939m211K2066m9348n161K5104k2343J7390J3313k2611l767
10075B705Q99P8655R3501J074n6931o3248q4046J692Q0279O2159J7471m7454q8392
$$ y = [172378, 134181, 168445, 175781, 157253, 152755, 120932, 83218, 116011, 90836, 43765, 31436, 86061, 165414, 177331, 175970, 108420, 140751, 118416, 59287, 56080, 44118, 35907, 66756, 70667, 58900, -20855, -59769, -48249, -45991, -54904, -62760, -17542, 61966, 53242, 8057, 5163, 71879, 82905, 66134, 85485, 8747, -9036, 11546, -14909, -35610, -30793, -16478, -53578, -121342, -109552, -62785, 6414, 3989, 34116, 87061, 104718, 88410, 81073, 18715, -43017, -8978, 35677, 30169, 27076, 62302, 26714, 27940, 47644, 54259, 49919, 48672, 124422, 93718, 53754, 23334, 32273, 28062, 50128, 780, -4381, 20723, -1620, 15770, 29083, 6472, 2705, 3604, 82259, 175760, 176834, 119903, 56655, -27391, -25699, 54580, 116739, 134210, 86756, -1636]
10062a636l2772M5565L4073L8920J76J9773P101O3217j9436k243L7935j9354j8910
10049A52409n57k6792j5954L1206J3481M4068K9837n1955p7309P235m3761L234
10037F5142N5999o310k9502m1861P37p1481o0931K9695N1358K6959j8836O1057
10025F2026J7093N2249j2725k3685L1048K3544J3692J8984o3862n9724l690M4331
10013I9281q733K4319N0413k4394k3935j2781p343j2571K1348P6237j6536j6234
10001A49071L0880n3956o956k7987l5515J3212J0907O359n2480p340J2784r179
9989B9800r636m1788k049J8563r594j241k0447K636M4885M9238k1456l3567N0140
9976E5484N9756l2091q7725n682M3388J6789j2186L2769r503L0784K1586k6367
$$ y = [-1636, -34408, 11157, 45230, 84150, 84326, 104099, 111200, 174417, 154981, 152738, 190673, 171319, 152409, 151852, 125060, 109106, 140312, 153793, 197861, 227698, 175743, 98434, 105669, 61908, 65142, 121141, 114831, 85329, 43468, 44205, -27276, -88207, -58512, -7154, 19805, 969, 62026, 79119, 131368, 118643, 94958, 126006, 149550, 163242, 182226, 118364, 58640, 54950, 99281, 90548, 114867, 165280, 140886, 116951, 104170, 96827, 84256, 105604, 181841, 165305, 149071, 179951, 125995, 119039, 91052, 55537, 68749, 79656, 86015, 33535, 26195, 38979, 29800, 20164, -21624, -23673, -5110, -14704, -15945, -36392, -33756, 11129, 60367, 38911, 5344, 55484, 115240, 83149, -4576, -10258, 33130, 49919, 37733, 70502, 60999, 91783, 113369, 87002]
9964H7002j4184j8712J7740M1114l2220o6260k0547Q422J2268J1042j2103L3824
9952D7386J08N494J3115Q320K9384K2974L4663N79n0140j1673J4809N81n490M304
9938A14414l1328L8372R037k3006m8498J5007L5326j0377l982n659J7932K3640
9926A30878q1611j698P3703K0641l8839J0067m897l5141l0993j1877L630O6429
9914A00292O7635k9860q138K2086P418j4258k0263j8834M2302j9943n877K5643
9902A48203P2875K3057k2462k6999p8022p4902L6842N5434M6556k9728l0637J5983
9890A36200K6878k486K9789J8146j1872Q272L6709l77N2939p3373p5425J6717
9878A62117K7071l6451j7180j4490l8364J4126K2299J6794M883m1085n1780l2350
$$ y = [87002, 72818, 54106, 71846, 112960, 80740, 14480, -6067, 2355, 14623, 25665, 13562, 47386, 47494, 52988, 66103, 74423, 103807, 126781, 161444, 162023, 111883, 100210, 115019, 115600, 110110, 114414, 83086, 121458, 130495, 107489, 58991, 73998, 109324, 98947, 94965, 89306, 107238, 130878, 49267, 47569, 121272, 141913, 103074, 113141, 108244, 73103, 42110, 30233, 33863, 100292, 167927, 138067, 129929, 152015, 159433, 145175, 124912, 106078, 148380, 128437, 122560, 148203, 221078, 244135, 221673, 194674, 116652, 41750, 78592, 134026, 180582, 150854, 120217, 136200, 163078, 160592, 190381, 208527, 196655, 204927, 241636, 241259, 294198, 220825, 145400, 162117, 189188, 152737, 135557, 121067, 82703, 96829, 119128, 135922, 140805, 99720, 47940, 15590]
9866A5590N2197J1216L2190K7374J0092m1837l5342l314M9995j7549p8389j9023
9854C200M2977M9837N3846N9570L4861N5872l4754l2396K1240j03755j04016j974
9842D4508L3481j2767n0708M7861Q5996N6505M0597J5817m3607p3819M851L4093
9830A82808L142o8673p0941k326J01857J2387J377n0337m336j7780j6729k3229
9818D7220q277j3283P591L0481L233k7986J4834L1368L1788r686l6982j1689J4717
9805G3329M1200J6413j6995J5211L8454K4999k6023K678k2126k7833J461r72J0627
9792A30423j0743k0974j273j68L5221Q7511p1764k7161K5989q007L6799Q890j321
9779A83422J4673k1104k2019L588K7079j299l4354L805L9108k1719p849N8086
$$ y = [15590, 67787, 79003, 111193, 138567, 148659, 106822, 71480, 68166, 118161, 100612, 22223, 3200, 46177, 96014, 149860, 209430, 244291, 300163, 265409, 233013, 254253, 150498, 46482, 44508, 77989, 65222, 14514, 62375, 148371, 204876, 245473, 261290, 217683, 143864, 148715, 182808, 185950, 117277, 46336, 44010, 145867, 158254, 159631, 109294, 104958, 87178, 70449, 47220, 38943, 25660, 33251, 63732, 66965, 38979, 53813, 85181, 116969, 107283, 70301, 58612, 73329, 114529, 130942, 113947, 129158, 167612, 192611, 166588, 169266, 147140, 119307, 120768, 119796, 130423, 119680, 98706, 97433, 97265, 132486, 219997, 148233, 121072, 147061, 139054, 175853, 184743, 183422, 198095, 176991, 154972, 158560, 185639, 184340, 149986, 153791, 192899, 171180, 163331, 221417]
9767B21417N1661k4998Q198P790m1784l4164K0500m3627m5768M1715L5084j6782
9755A79242k9012M8704q674k8140J9814o36N454l7636m4596k6351n5195l0004
9743g030N0487N8477l127J8175l422J2058M4238L2539n5983L2667J3351k6870
9731A65560N508N1149n1822J193N9934Q402J7833m9810R237j8967j326L4547k1047
9718B10391k6365j0238P51J788j9439L8991P8574j7436P975M766P7924q325l7901
9705C01456l3114l035l4541N503O3082k2419n6640K3429M2158L986K8495k7834
9693B90526J09P1593K4838k6731j9742K1874M2357R4319J8802k6415m291J5396
9681E02635O6941j8223l7690L6561j0559r793K3934J3311M1053K2452j4396K8170
$$ y = [221417, 273078, 248080, 256278, 264068, 222284, 188120, 208620, 164993, 119225, 160940, 196024, 179242, 150230, 198934, 190260, 162120, 181934, 181298, 186752, 149116, 104520, 78169, 22974, -7030, 43457, 101934, 98807, 116982, 113560, 125618, 169856, 202395, 146412, 179079, 192430, 165560, 171068, 222217, 170395, 171588, 231522, 239924, 257757, 207947, 217184, 198217, 196891, 231438, 210391, 184026, 173788, 174539, 176327, 156888, 195879, 274453, 257017, 264992, 269758, 347682, 339357, 301456, 268342, 265307, 230766, 236269, 299351, 276932, 220292, 243721, 285879, 289865, 318360, 290526, 290635, 362228, 387066, 360335, 340593, 362467, 404824, 499143, 517945, 491530, 487239, 502635, 569576, 551353, 513663, 550224, 539665, 529872, 553806, 567117, 608170, 630622, 616226, 644396]
9669F44396K8097M3416P9360l3996o4020K6781q852P193l551k4371N915P091j3388
9656F94071j0365j2195J3816J8063K9113k8246k7008Q3877J03614J41991J2972
9645A019703j7724n286L486L2252L0597j3453K1889K3492j1357J0188N9180L0281
9633A183248k763K7412P4908J2161k2258k4653q447N9470n2809k8902M0429J6699
9621A274495m8637p9539J8256M4054l2830k686Q0549p475J3131L9652K9885J4754
9609A343609l106j7558L0063P643K4072L9595j4461P416N8396O733m6479k9479
9597A406444J4498N4233J1235j9104J9551j4551j6528l8363n8298j5822m780m1626
9585A296889m3269j7322k7019Q309J5285l1715j356l3720O028j2243o663n750
$$ y = [644396, 672493, 715909, 795269, 761273, 697253, 724034, 715182, 722375, 718824, 694453, 700368, 707459, 694071, 683706, 671511, 685327, 703390, 732503, 704257, 677249, 761126, 864740, 1006731, 1019703, 1001979, 996693, 1000179, 1032431, 1063028, 1049575, 1071464, 1094956, 1083599, 1093787, 1152967, 1183248, 1180485, 1207897, 1282805, 1294966, 1272708, 1248055, 1239608, 1299078, 1246269, 1217367, 1257796, 1274495, 1225858, 1146319, 1164575, 1208629, 1175799, 1173113, 1253662, 1246187, 1259318, 1298970, 1328855, 1343609, 1340503, 1322945, 1353008, 1360651, 1384723, 1424318, 1409857, 1417273, 1475669, 1482402, 1435923, 1406444, 1420942, 1475175, 1486410, 1467306, 1486857, 1472306, 1455778, 1417415, 1359117, 1343295, 1338515, 1296889, 1253620, 1236298, 1209279, 1217588, 1232873, 1201158, 1199802, 1166082, 1172110, 1159867, 1153204, 1147454]
9573A147454o1285k3339O8314M9400j8155j4137k7273l0191k0223q33k2641j8231
9561A028860m6517J3280K9718N957n4404l4289K739K0154j6223k2565o2499L2004
9549H96215L8066o801p8542p0530k1714m3441l2895K3212J3289M537k2034O3831
9537G63193O6826l4869j3614p356l3019p256j2405k215n604k2647m7313l5631
9525F08090o6230N9390P7013J8969j7520j9837q9230n883m354k3317k942K799
9513E36948J7394M2551k1420k5322M3235n7985m7939k2231P753M528L1758Q8354
9501E97624K6396o9604l9326J3908m4197j7567Q0219L1684p2131l1139R849P225
9489D92941R507M4182N2598k0542k7811K1833J2922m0764J010j9645J2933K9806
$$ y = [1147454, 1086169, 1062830, 1131144, 1180544, 1162389, 1148252, 1120979, 1090788, 1070565, 1069732, 1047091, 1028860, 982343, 995623, 1025341, 1031298, 976894, 942605, 945344, 965498, 949275, 926710, 864211, 896215, 934281, 927480, 848938, 778408, 756694, 713253, 680358, 703570, 716859, 721396, 699362, 763193, 830019, 795150, 781536, 774180, 741161, 733905, 721500, 719285, 713681, 691034, 643721, 608090, 541860, 601250, 678263, 697232, 679712, 659875, 570645, 564762, 560408, 537091, 534149, 536948, 554342, 596893, 575473, 550151, 593386, 535401, 487462, 465231, 472984, 477512, 509270, 597624, 624020, 554416, 515090, 528998, 484801, 467234, 547453, 579137, 507006, 475867, 485716, 492941, 502448, 546630, 599228, 578686, 550875, 572708, 585630, 544866, 545876, 526231, 539164, 568970]
9477E68970j0583L5907L2281R00l6083n1831R1675O3398J2086P724m0660k7605
9465F46179k3863K5163N2693Q768m965n451j9863q8093k3264P4117K6193j0358
9453F57256j6436p092j5429K5125k0428L586N6033R541k7485j4610K2086P691
9441F79838l7931k1591m284n016k6347P924M4268N4753Q8626L320J1965L7719
9429H33244l2328l0870J4551L0427R1918J7140q751K2704J00236L3824J5356O8954
9417A156405J3751j1680l4652k0520L0779K1662J3777R3828J09266Q7230J8362
9406A478208N9755P3958J08214J16702N7869L1103m6824j815J5798l6771R2P9438
9394A935727J6163j8946o85L0482K5379M1257j7629L296O0874R0212N5163K65
$$ y = [568970, 558387, 594294, 626575, 627475, 591392, 539561, 631236, 694634, 706720, 714444, 673784, 646179, 622316, 647479, 700172, 708940, 703975, 698524, 678661, 590568, 567304, 641421, 667614, 657256, 640820, 633728, 618299, 643424, 622996, 626582, 682615, 692156, 664671, 650061, 672147, 679838, 641907, 620316, 616032, 611016, 584669, 592593, 636861, 691614, 780240, 783560, 795525, 833244, 800916, 770046, 784597, 815024, 906942, 924082, 915331, 938035, 1038271, 1072095, 1087451, 1156405, 1170156, 1158476, 1123824, 1103304, 1134083, 1155745, 1169522, 1263350, 1372616, 1459846, 1478208, 1537963, 1611921, 1720135, 1836837, 1894706, 1925809, 1878985, 1877170, 1892968, 1856197, 1856289, 1935727, 1951890, 1932944, 1932259, 1962741, 1988120, 2029377, 2011748, 2015044, 2075918, 2166130, 2221293, 2221558]
9382B221558M9487Q0209J02946k539O7790J44576Q2123L3975M5313P4859J42924
9371C043221J42702J02265N2315J34058K22271K29233J78991K42786K61496K18466
9361D827804J74881K78149K76619L03744L46776L52861L65749L74264M05254M94288
9351H200389N14820M05197M16049M97053N28776M82431M23583M33650L70480K29670
9341A2502098K04861J80051O3701m8316q6202j28174k28127k22351k58794k72249
9331A1706498k81262k94313l08516l08290l76121l53653k66392k66496k38914
9322I012541k48238j95004j88357k07113j39008j41645j13152n9375p0289p4359
9312G576001n7337o5825k0599m4117k957L6061k4719O044J52631J95843K38102
$$ y = [2221558, 2271045, 2351254, 2454200, 2451661, 2519451, 2664027, 2746150, 2780125, 2825438, 2900297, 3043221, 3185923, 3288188, 3340503, 3474561, 3696832, 3926065, 4105056, 4347842, 4609338, 4827804, 5002685, 5280834, 5557453, 5861197, 6207973, 6560834, 6926583, 7300847, 7706101, 8200389, 8715209, 9120406, 9536455, 10033508, 10562284, 11044715, 11468298, 11901948, 12272428, 12502098, 12706959, 12887010, 12950711, 12902395, 12816193, 12688019, 12459892, 12237541, 11978747, 11706498, 11425236, 11130923, 10822407, 10514117, 10137996, 9784343, 9517951, 9251455, 9012541, 8764303, 8569299, 8380942, 8173829, 8034821, 7893176, 7780024, 7720649, 7650360, 7576001, 7518664, 7452839, 7432240, 7388123, 7385166, 7421227, 7396508, 7402552, 7555183, 7751026, 7989128]
9301G989128J56492Q9277O8033L7904O1114P2197Q4371J03896J45846Q4201P9560
9290H972019o531M5407Q0537J02537J61934K40156K89301M01427M13754N03066
9280A1203607O33200P11921P12210P46534Q18785Q32211Q76450Q99956J014636
9271A8449510J097866J194569J292181J329934J368515J451320J513690J653619
9263B9351204J874884K067466K064065J984604J732186J507531J248719J316975
9255D3147634J468303J842143K336413K798609L205203L666163M345281N166818
9247F7976567O322438P991784J0022223J2239524J4336521J6102767J7561101
9240A52552925J8379748J8254550J7243492J5434556J2406679R244602P288517
$$ y = [7989128, 8145620, 8234897, 8302930, 8340834, 8401948, 8474145, 8558516, 8662412, 8808258, 8892459, 8972019, 8965488, 9010895, 9091432, 9193969, 9355903, 9596059, 9885360, 10286787, 10700541, 11203607, 11836807, 12548728, 13260938, 14007472, 14826257, 15658468, 16534918, 17434874, 18449510, 19547376, 20741945, 22034126, 23364060, 24732575, 26183895, 27697585, 29351204, 31226088, 33293554, 35357619, 37342223, 39074409, 40581940, 41830659, 43147634, 44615937, 46458080, 48794493, 51593102, 54798305, 58464468, 62809749, 67976567, 74299005, 82290789, 92313012, 104552536, 118889057, 134991824, 152552925, 170932673, 189187223, 206430715, 221865271, 234271950, 243516552, 250805069]
9233B50805069P225355Q794707J1256628J3294948J3989723J3518125J2225000
9226C31109555J0633042R016322P631708P189031Q045653J0703712J4517330J8057303
9218D16903656K0080770J9883762J6545063R916063J793669o202450j3523080
9211D65397453j8962783k1056485k0040571j7383117j4839235j3282221j2603533
9204C47229508j2993736j4213708j5427573j5492754j3954061j1612902r097003
9197B54437771o597668m466082l144176k887944l588488m657459n882135p019778
9189B16194041p813020q534881r415212j0016788j0113694r619101q632892p327858
9181A44720595n650408l990578k539113j349634p34199o27883j004588j915664
$$ y = [250805069, 258030424, 266825131, 278081759, 291376707, 305366430, 318884555, 331109555, 341742597, 350758919, 358390627, 365579658, 373625311, 384329023, 398846353, 416903656, 436984426, 456868188, 473413251, 483329314, 485122983, 478920533, 465397453, 446434670, 425378185, 405337614, 387954497, 373115262, 359833041, 347229508, 334235772, 320022064, 304594491, 289101737, 275147676, 263534774, 254437771, 247840103, 243374021, 240229845, 237341901, 233753413, 229095954, 223213819, 216194041, 208381021, 199846140, 190430928, 180414140, 170300446, 160681345, 152048453, 144720595, 139070187, 135079609, 132540496, 131190862, 130456663, 129828780, 128824192, 126908528]
9173A26908528k980188l959691m579354m606256m358209m111348l968291l964679
9165I4380512m003934m084317m123157m105773l834662l519601l272770l016559
9157F4419739k629002k319525k113212j878465j591788j357000j214522j054373
9149E0261852r28721r42790r89522j075025j199666j372753j414269j445030j407129
9140C9486947j335330j259016j183966j103050j038787r10234p98990q39994q37169
9131C0180411r48029r69818j017456r17094q49472p46461n95618o00427o47195
9122B2888841o54242o94852p19592p09395o70797o03528n69388m88112m68594
9113A7310341n03761m74550m49704m99882n33829m68078l66703k96931k72010
$$ y = [126908528, 123928340, 119968649, 115389295, 110783039, 106424830, 102313482, 98345191, 94380512, 90376578, 86292261, 82169104, 78063331, 74228669, 70709068, 67436298, 64419739, 61790737, 59471212, 57358000, 55479535, 53887747, 52530747, 51316225, 50261852, 49333131, 48390341, 47400819, 46325794, 45126128, 43753375, 42339106, 40894076, 39486947, 38151617, 36892601, 35708635, 34605585, 33566798, 32656564, 31857574, 31017580, 30180411, 29232382, 28262564, 27245108, 26328014, 25478542, 24732081, 24136463, 23536036, 22888841, 22234599, 21539747, 20820155, 20110760, 19439963, 18836435, 18267047, 17778935, 17310341, 16806580, 16332030, 15882326, 15382444, 14848615, 14380537, 14013834, 13716903, 13444893]
9104A3444893l27405l34570l34800l26240k64555k00494j90602j34860j73766
9095A1157601k47399k45562k33101l22507l43389k87667k87244k05095k33560
9086H752077k57111k14796k64433k23955j65361j47580j63699j89761m8917j05933
9076F970531k31548j78597q4799n7724j29799j24706j62166j70890j26918j52729
9066E550655j66825k00021j57844j14954o9234o4122p6022j43732j09560p9297
9056D369044j26578j88121k12006j53065r3754r8134j13240q4454j33545q1706
9046C084441q4525q5212n7904p5637o6593o6056r1403r6672j24027p0011l2120
9035B234281r2626p9263m8355q2030o7794j7325p7942j05954j02354r4639L2741
$$ y = [13444893, 13117488, 12782918, 12448118, 12121878, 11857323, 11656829, 11466227, 11331367, 11157601, 10910202, 10664640, 10431539, 10109032, 9765643, 9477976, 9190732, 8985637, 8752077, 8494966, 8280170, 8015737, 7791782, 7626421, 7478841, 7315142, 7125381, 7076464, 6970531, 6738983, 6560386, 6475587, 6417863, 6288064, 6163358, 6001192, 5830302, 5703384, 5550655, 5383830, 5183809, 5025965, 4911011, 4841777, 4777655, 4701633, 4557901, 4448341, 4369044, 4242466, 4054345, 3842339, 3689274, 3595520, 3497386, 3384146, 3299692, 3166147, 3084441, 2999916, 2914704, 2856800, 2781163, 2714570, 2648514, 2557111, 2460439, 2336412, 2266401, 2234281, 2141655, 2062392, 2014037, 1932007, 1864213, 1846888, 1768946, 1662992, 1560638, 1465999, 1498740]
9024A498740Q7093m5293k474J2659J1442K3349o4388m4157k4374R145K2116k1315
9012A462543j7388J0649l3251l5711l3061l2617p3281K8444M0070j3393J7443
9001A320447l3326l8115k947J0639P120L4123q786j6688J8224k3151j6833j7485
8989A233222l6939q5384O978O63J9572j3128J1428L282k0189k601N5269J4109
8977A186282J1041K4948j6435K2294J4334n6750o7902K1438K2845m2994n0610
8966A068491l9293l859J4260k1064J787L3746k8914o4406j2131K9016q8309n5720
8954H33604l428P606K3178k6903l1392n302m6824J5889m642j0410K1133R471q48
8941G81132O078Q188P075l2901k7873O202j7321J03l4387j5042N999J7545n1109
$$ y = [1498740, 1585833, 1540540, 1538066, 1550725, 1562167, 1585516, 1521128, 1476971, 1452597, 1461742, 1483858, 1462543, 1445155, 1455804, 1422553, 1386842, 1353781, 1321164, 1247883, 1276327, 1316397, 1303004, 1320447, 1287121, 1249006, 1246059, 1256698, 1263818, 1297941, 1289155, 1272467, 1290691, 1267540, 1250707, 1233222, 1196283, 1110899, 1117877, 1118540, 1138112, 1124984, 1136412, 1139694, 1119505, 1116904, 1172173, 1186282, 1197323, 1222271, 1205836, 1228130, 1242464, 1185714, 1117812, 1139250, 1162095, 1119101, 1068491, 1029198, 1025339, 1039599, 1018535, 1020322, 1054068, 1025154, 960748, 948617, 977633, 889324, 833604, 830176, 837782, 860960, 834057, 802665, 797363, 750539, 766428, 761786, 751376, 772509, 781980, 781132, 787210, 795398, 802473, 769572, 741699, 747901, 730580, 730683, 696296, 681254, 687253, 704798, 653689]
8928F53689N1984l911J9964m0423n4026L730n026p3662k4991L3257M2390O3518
8916F66493n0260l0814j9620q2107l6117M9721K585M199m9757m0180O417K3686
8904D44246K9438L3308J3135j4096J4724L401K4018R569O0017N2921K1181n4362
8892F37500K7825L2584P0968L4390M0258P5358N5302J2972L0222K5899J08930
8881A152208K14707L11831N17899R02574J369287J382140J034923M92183l05649
8872G072103j168611j522943j082908p05328m82193k67856k25237m1709l9990
8863A535328r3043r5194q8001Q86K2869l9834k475O4852K8095K459K0623j9184
8851A337381p3550k894J712P275M783j7074L6544L0436n4497p5565P009R4815
$$ y = [653689, 705673, 701762, 721726, 681303, 627277, 631007, 625981, 552319, 527328, 560585, 602975, 666493, 616233, 585419, 565799, 483692, 447575, 497296, 499881, 504080, 454323, 414143, 420560, 444246, 473684, 506992, 520127, 506031, 520755, 524156, 548174, 557743, 617760, 670681, 691862, 637500, 665325, 697909, 768877, 803267, 843525, 918883, 974185, 987157, 1017379, 1043278, 1152208, 1366915, 1678746, 2196645, 3099219, 4468506, 5850646, 6885569, 7377752, 7072103, 5903492, 4380549, 3297641, 2592313, 2110120, 1842264, 1617027, 1575318, 1535328, 1442285, 1347091, 1259090, 1259976, 1282845, 1243011, 1240536, 1305388, 1333483, 1335942, 1356565, 1337381, 1263831, 1260937, 1262649, 1269924, 1274707, 1257633, 1294177, 1324613, 1270116, 1194551, 1201560, 1296375]
8839A296375j3404J8114K1339l8050n606m1020p9565k7552J351q588R111j1788
8827A120717k049P1910P4862P1302J1968L438J4083O4292K3200n118p805J9625
8815A460425J9364k2230O065L1436n1499m0793n468l6161o031L0831M1739J6804
8803A444482n529k9017m4933R650J2967N9070n7958k0481j2330l4831k2231p7392
8791A221467p3114l089l4684l5494l5456J1886O6772J9021K9421L3489m1293k4230
8779A134696q966k302J6183j8560L4542N0281p5517q2656o2911M4931M3557m781
8767A068497l2379r6921j15306n736J9708l5198j5313j7789k7742p022k209j7851
8755G14739o5958q5619l5594L5914K2479j2318l2664o3610J0648j8308o1799j7147
$$ y = [1296375, 1282971, 1301085, 1322424, 1284374, 1278768, 1237748, 1158183, 1130631, 1131982, 1123394, 1132505, 1120717, 1118668, 1190578, 1265440, 1336742, 1348710, 1352148, 1366231, 1430523, 1453723, 1448605, 1440800, 1460425, 1479789, 1457559, 1463624, 1495060, 1443561, 1402768, 1397300, 1361139, 1355108, 1385939, 1427678, 1444482, 1438953, 1409936, 1365003, 1374653, 1387620, 1446690, 1388732, 1368251, 1355921, 1321090, 1298859, 1221467, 1148353, 1145264, 1110580, 1075086, 1039630, 1051516, 1118288, 1137309, 1166730, 1200219, 1158926, 1134696, 1125730, 1123428, 1139611, 1121051, 1155593, 1205874, 1130357, 1047701, 984790, 1029721, 1073278, 1068497, 1036118, 939197, 823891, 818155, 837863, 802665, 787352, 769563, 741821, 734799, 732590, 714739, 648781, 563162, 527568, 563482, 585961, 573643, 540979, 477369, 488017, 469709, 407910, 390763]
8743C90763L8390Q422J9695K2398K2615J379l8071n2374J0853K0468j8400j8183
8731D07955p314p461j5061J107l9068J9958j1641k7521m6685o396k0392l4104
8719B13377O1034M8774j0077l5202J7642m3121n8370l04O2359J9767j3377l6174
8707B26328n8572J0179L7103j249j0142K4456L1162j788l1757k1338l2424q839
8695A63119M889j9895O6083K158J333j005k1109N407K7302N627o3781k3956l2112
8682A14060N0943J3158O211K3193o1292j5723P112j2587K143M79L3450L2103j9774
8669A73476q901L8161q996p396j0191r688o268j6616q1482l702L318K958K2237
8656H6910M9508N032L813N4920q78k5156j0651M3623j3003L4553L2747k972j05927
$$ y = [390763, 429153, 437575, 457270, 479668, 502283, 503662, 465591, 413217, 424070, 444538, 426138, 407955, 400641, 393180, 378119, 379226, 340158, 360116, 348475, 320954, 274269, 267873, 247481, 213377, 274411, 323185, 313108, 277906, 295548, 252427, 194057, 193753, 256112, 275879, 262502, 226328, 167756, 177935, 215038, 213789, 203647, 228103, 259265, 257477, 225720, 204382, 171958, 163119, 168008, 148113, 214196, 216354, 217687, 216682, 195573, 200980, 228282, 233909, 170128, 146172, 114060, 165003, 178161, 184372, 207565, 146273, 130550, 137662, 125075, 127218, 127697, 161147, 193250, 173476, 164575, 202736, 193740, 186344, 176153, 166465, 160197, 143581, 62099, 58397, 61715, 64673, 86910, 136418, 141450, 145263, 200183, 199305, 174149, 163498, 207121, 194118, 228671, 261418, 258446, 152519]
8643A52519m275M5032k4279p2649m3768k7016J0032L5177l342J688L7631M6316
8631A53066M9341R969j1617p6624k7772M3475J4179l3504O730L0547J8948K0227
8619A96965j782l3606K9696l5224K688m8847J7371O2350l919K8342j4838k1435
8607A77761P6141M1813Q859j7816n2100k6329j2005J2468R4017O4356K1092p855
8595C80402n1168M1807m1993o4941O974P150J065k3961m5177L440N2652m4501
8583B21749l1011J2365m1421m1418n482j5031l969J8296K1867L0380L433J1619
8571A81377L4880N9958m4831j8572k442p3375n8983M079N2896J8198P969J6567
8559A77721j2269k5359J3892j5047m7232Q783l5848P198L5218p114m7430L4977
$$ y = [152519, 148244, 193276, 168997, 96348, 52580, 25564, 35596, 70773, 67431, 69119, 106750, 153066, 202407, 212376, 200759, 124135, 96363, 139838, 154017, 120513, 127243, 157790, 176738, 196965, 195183, 161577, 191273, 156049, 158737, 109890, 127261, 189611, 185692, 214034, 199196, 177761, 253902, 295715, 304574, 286758, 234658, 208329, 196324, 208792, 302809, 367165, 388257, 380402, 329234, 371041, 329048, 264107, 271081, 278231, 279296, 255335, 210158, 213598, 266250, 221749, 190738, 203103, 161682, 120264, 114782, 99751, 95782, 114078, 135945, 166325, 169758, 181377, 216257, 276215, 231384, 212812, 210370, 136995, 78012, 82091, 134987, 153185, 161154, 177721, 165452, 140093, 153985, 138938, 91706, 100489, 64641, 71839, 107057, 99943, 52513, 87490]
8547H7490J1057R842n2945j4628M4166K8223M0753k5162o306K792M1778L6569
8535B03629k6674K270J5873n513L0723J5710j9686l3141K3522l2723m2124j1306
8523A20560k8457k7942k0292k678J4864m144K2887Q198m3533p0946J7727O3570
8511D9814l1313j3394L8433J4479J3069O505k1917P521k5651m7516l500k7561
8499d1031J899K5654R273r724P411K3661K76J5816J6638K0262M6349j5254L9625
8486A40855j9599k4846l2083L3265l2698j6250m1284m963J3998R886M021R255
8474C9557K396N2124K4731K2930m6405K9503m49J8525P467k4796k8274l4562L2426
8461I5173k6826k38J4478J9956M2566n2795q7501j6106n3882L558L7681M5071
$$ y = [87490, 98547, 108389, 55444, 40816, 84982, 113205, 153958, 128796, 122490, 125282, 167060, 203629, 176955, 179225, 195098, 189585, 220308, 236018, 216332, 183191, 206713, 173990, 131866, 120560, 92103, 64161, 43869, 41191, 56055, 51911, 74798, 82996, 39463, -31483, -13756, 49814, 18501, 5107, 43540, 58019, 71088, 77593, 55676, 63197, 37546, -9970, -13470, -41031, -39132, -13478, -4205, -13929, -6518, 17143, 17419, 33235, 49873, 70135, 116484, 101230, 140855, 121256, 96410, 64327, 97592, 64894, 48644, 7360, 2397, 16395, 26281, 30302, 39557, 41953, 94077, 118808, 141738, 95333, 124836, 124387, 142912, 150379, 125583, 97309, 62747, 95173, 68347, 68109, 82587, 102543, 145109, 92314, 4813, -11293, -65175, -61617, -23936, 21135]
8449B1135J1391l94L2889j2789J8256O633k6722k0793J3333N0651K6545J4791
8437A34926p8179r133m4353k5550M324k0649k9558P127k3579J3007N5897M659
8425a1061L9076Q801m1622j430k1698L0314Q7480j5890j1872n552k872K0114l27
8412G3461J2754k2203J1815J448l9705k274M049m9036l3944L3578k7620j7737
8400e5414M1054p05j2267m5260p518M4740P7689N1793l3676k5666m1349q8262
8388i4841J6428P9599K0765k1788J7351M3568L3990M8251L238n9924l750J8942
8376A01829q848N0906p0837l2258R9539K5142n1604p6847o7294M8677R060l0800
8364c335j5953L4443N4362l8262l6420J7176j6083j4667K3739L2760L1628m1020
$$ y = [21135, 32526, 32132, 65021, 52232, 70488, 77121, 50399, 29606, 42939, 93590, 120135, 134926, 56747, 47614, 3261, -22289, -17965, -38614, -68172, -61045, -84624, -71617, -15720, -11061, 28015, 36816, -4806, -6236, -27934, 2380, 89860, 73970, 62098, 56546, 53674, 73788, 73461, 86215, 64012, 75827, 77275, 37570, 35296, 39345, -9691, -43635, -10057, -37677, -55414, -14360, -15065, -27332, -72592, -80110, -35370, 42319, 94112, 60436, 34770, -6579, -94841, -78413, 1186, 21951, 163, 17514, 61082, 95072, 143323, 146561, 86637, 82887, 101829, 92981, 143887, 73050, 40792, 140331, 165473, 113869, 37022, -30272, 18405, 27465, -3335, -19288, 15155, 69517, 31255, -5165, 12011, -4072, -18739, 5000, 37760, 69388, 28368]
8352B8368L1870R118l5844l2650m415K078Q728L4621l8147p9150M5286K7927k2708
8339b4918K5702J4340L803J9612J0561n45j4640L6996J1169n4080Q630l7227r5118
8326i5715N603N7797L3643M986J1091K6055l8842j8707K752P188K5759n468L6184
8313E2326J2343Q748J201j7193n6219O464J1565l6437L6604M3889m7996J7208
8301C2503K3548l2125j1080k8264k9147N2072J0069j9207p5037J620K4336J6654
8289c4058k1224q243k7242J2419L9667O2380K0190k4036l9381j3406j5974K7771
8277b1137K9121k4994Q375j7971L8248k2893n4777K8231J9249l6107k4399j132
8265h0186q771o88J6233O923K2375L6035L906j8772p601J1693M0591N3197k1910
$$ y = [28368, 60238, 69356, 33512, 862, -3553, -1475, 7253, 41874, 3727, -75423, -30137, -2210, -24918, 784, 15124, 18927, 38539, 49100, 48555, 33915, 70911, 82080, 28000, 36630, -597, -95715, -90112, -32315, 1328, 6314, 17405, 43460, 4618, -14089, -11337, -4149, 21610, 16142, 52326, 64669, 73417, 74618, 57425, 1206, 7670, 19235, -17202, 19402, 63291, 15295, 32503, 56051, 23926, 12846, -15418, -44565, 7507, 17576, -1631, -76668, -75048, -50712, -34058, -55282, -63525, -90767, -78348, -38681, 23699, 43889, 19853, -19528, -32934, -48908, -21137, 7984, -17010, -8635, -26606, 11642, -11251, -66028, -37797, -18548, -54655, -79054, -80186, -88957, -89645, -73412, -66489, -44114, -8079, -4173, -22945, -30546, -18853, 21738, 74935, 53025]
8252E3025p9014l7193J1791L7648M2491k376J3567l7650K0664l7657m6445J4728
8240d6421L7405L8004K3079l5583K0926K6130p894P380j5249l491p0237k330k1567
8227d9848j8041K5141K519K2592M9216L1272K5630o460j6380p211Q97m7871O350
8214A7806K7885M0432k2082j0805O6224N265j7395q1980m1723J1435j6199N1411
8202C0274k789q810M5041n6605n8048M459R1080K1780l4757n1972N6857L2682
8190F9192N2455R549m0808O721J9887n7259r709N542l6443r868o3630K5131K8227
8177a013o9159l811J3270N6834K7686j5429P394j504r986k3906o270r819n1156
8164h6869m7864N1568K7013J2542P6215K6626m5203o2680K340P9969K5432l2858
$$ y = [53025, -25989, -63182, -51391, -13743, 28748, 26372, 39939, 2289, 22953, -14704, -61149, -46421, -9016, 28988, 52067, 16484, 37410, 63540, 55646, 63026, 47777, 44286, -25951, -28281, -49848, -67889, -42748, -40229, -17637, 31579, 62851, 88481, 82021, 65641, 58430, 59327, 11456, 17806, 45691, 86123, 64041, 53236, 119460, 124725, 107330, 25350, -16373, -4938, -21137, 30274, 27485, 18675, 63716, 7111, -50937, -46478, 44602, 66382, 31625, -20347, 36510, 69192, 121647, 131196, 90388, 97109, 116996, 59737, 50028, 55570, 19127, 9259, -54371, -29240, -1013, -70172, -73983, -60713, -3879, 23807, 8378, 15772, 14268, 4282, -19624, -25894, -35713, -86869, -134733, -83165, -56152, -43610, 32605, 59231, 14028, -48652, -46312, 33657, 59089, 26231]
8152B6231R196j1793P14L3451l6037M6670J7435k7118m0575j7103J073l016j7653
8139a8525K0186q191j3945l0723l267m346L116N0732j295O436j6078L0071L9570
8126E3741P118n0318J303K2505L124L0003P493O1264q625q886n3661m5476L4946
8113E4531Q5o8309k7548K1290j669l8116l4128N1334L3846L9139J8102p9376o696
8100c7515O7493L7348J6207J6665J7057l1775o4738k9447J6200n6151J3272N2510
8088A7126M3281n6102l8628Q7017M5902k3456n585o837k2174k0510J813R0122
8076A11969M1497k5975R713K9768j3913l5748l6529p01O285k7898m5947o0372
8064d7851L2967N7853N7878j7808m8890J6617j8426L2922M5796k9876q4700m5313
$$ y = [26231, 35427, 23634, 24348, 57799, 21762, 68432, 85867, 58749, 18174, 1071, 2144, -872, -18525, 1661, -6530, -20475, -51198, -54465, -58811, -55695, -4963, -6258, 178, -15900, 14171, 53741, 60859, 10541, 11844, 34349, 37473, 67476, 74969, 136233, 127608, 118722, 65061, 19585, 54531, 54616, -13693, -41241, -19951, -21620, -59736, -93864, -42530, -8684, 30455, 48557, -30819, -37515, 29978, 67326, 83533, 100198, 117255, 85480, 20742, -8705, 7495, -48656, -35384, 17126, 60407, 4305, -34323, 52694, 98596, 75140, 69555, 62718, 40544, 20034, 21847, 111969, 153466, 127491, 137204, 166972, 153059, 117311, 80782, 80081, 86366, 58468, 12521, -47851, -14884, 42969, 100847, 83039, 34149, 50766, 32340, 65262, 111058, 81182, -3518, -48831]
8052d8831L2467j6265l022R064J2475J0005J7416l6291K5156P1054K9204J0095
8040A12527n2257M8644p124o1991K9195J6729K7453l5964l8469J1499n914J7357
8028F1685l3781l2406K8031j497j4149K1358j2097N9127K7406O526l5940n6189
8016A8074n9815K2653L4633N5126m6697m395R477l6920N243M0820M1631k3509
8004E6321k9464L8455K6375J6539l0080o437L01n558r267M5328K4916K0158m2378
7991A05209M0440K952K3435j1322q2638N26n632n6543l8991J1584j7927L7702
7979H795J0717J537n8398M3523M2541l4352k205L7106N3537M6863o756n5977N91
7966H7522j1896n9977K1547K2448k8662n7549L2137Q2274R649m7724R45l161J9097
$$ y = [-48831, -16364, -32629, -35651, -26587, -14112, -4107, 13309, -22982, 2174, 73228, 102432, 112527, 60270, 108914, 101790, 39799, 68994, 85723, 113176, 77212, 38743, 50242, 44328, 61685, 27904, -4502, 23529, 22032, 7883, 29241, 17144, 76271, 103677, 110203, 74263, 18074, -41741, -19088, 15545, 70671, 23974, 19579, 29056, -7864, -2621, 38199, 79830, 56321, 26857, 65312, 91687, 108226, 78146, 71709, 72010, 66452, 57185, 102513, 127429, 147587, 105209, 145649, 148601, 172036, 160714, 78076, 78602, 72970, 16427, -22564, -10980, -28907, 8795, 19512, 21049, -37349, 6174, 48715, 14363, 12158, 49264, 102801, 149664, 142908, 86931, 87522, 75626, 15649, 37196, 59644, 30982, -26567, 5570, 87844, 97493, 49769, 50714, 47553, 66650]
7953F6650j5597N6022K3780n0156K63j9263n82K1796M8594l912p8964m9862J1229
7940I998K7548k7703k5953j8639j3910P5514M4711K0487L9142k0857l8138o349
7928F5851J390N702r547j535J576M8368M702k8169j7494L521N8902J1982j6288
7915A28961R62k2723J523m3400n7897P0627K2257o0031m2581O474r153j8761O6172
7902D2430J3425k8001J6512J5227j3087l1308J5969L4477q416J067r637r959p795
7889C0904L004J6644k4375o0107k4293O384O0004N3180K2638l650j1052O365m2451
7876C3195m488K2780n9344l3678J5787L4051L9742q68P096L0320j6213L9344J4266
7863A21990m8359l8262m875l573j7519o0029L0975K0834K0443l2723l3058O4821
$$ y = [66650, 51053, 107075, 130855, 80699, 80962, 61699, 61117, 82913, 131507, 127595, 48631, -1231, 9998, 37546, 9843, -16110, -34749, -48659, 26855, 71566, 92053, 131195, 110338, 72200, 65851, 67241, 72943, 63396, 61861, 63437, 111805, 116507, 88338, 70844, 74365, 133267, 145249, 128961, 129923, 107200, 108723, 65323, 7426, 78053, 100310, 40279, -2302, 4172, -4981, -23742, 42430, 55855, 27854, 44366, 59593, 46506, 15198, 31167, 65644, 57228, 58295, 48658, 38699, 30904, 33908, 50552, 26177, -33930, -58223, -51839, 8165, 61345, 83983, 80333, 69281, 75646, 33195, 28707, 51487, -7857, -41535, -25748, 8303, 48045, 47177, 54273, 84593, 68380, 107724, 121990, 73631, 35369, 30494, 26921, 9402, -50627, -19652, 1182, 21625, -11098, -44156, 20665]
7851B0665K5308L5501n9598o8055O6768R385m9911k58J7331L817K1524l1126M2542
7838C3893J736l3431l8222k6657k4431N5765k3744o686N556k0523O2497Q7348
7826G3101M931J705n5956j4059L7868l8632j07155K9999J008j4515k7924O076
7814a03553p41L206L8879J5203L5942L2013l9264j7387J9457O096j5550J3817
7802a1882M5595N7619p5001j1183j862M9008l2598n8008k3138K2905L7197P6709
7790G5361j9754j5013k1211L6774p561n030l2307n5708m2035p70J1235N117J7551
7777e3351L488K3826l6531k6586n73N0189k6435j5759j8009p790k4244M9094M8862
7764c3819k934L8170J4938j3085k3553l4789K5502L9185O980m4887m0641L1051
$$ y = [20665, 45973, 81474, 21876, -46179, 20589, 29974, -19937, -20195, -2864, 953, 22477, -8649, 33893, 35629, 2198, -36024, -62681, -87112, -31347, -55091, -61777, -56221, -76744, -14247, 73101, 78032, 79737, 23781, 9722, 47590, 8958, -98197, -68198, -67190, -81705, -109629, -103553, -104294, -101088, -62209, -47006, -11064, 20949, -18315, -35702, -16245, -10149, -25699, -11882, 33713, 91332, 16331, 5148, 3286, 52294, 19696, -38312, -61450, -38545, -1348, 75361, 55607, 40594, 19383, 56157, 48596, 43566, 11259, -44449, -86484, -87254, -76019, -70902, -53351, -49863, -26037, -62568, -89154, -89727, -39538, -65973, -81732, -99741, -107531, -131775, -82681, -33819, -36753, 1417, 16355, 3270, -20283, -55072, -29570, 9615, 16595, -28292, -68933, -37882]
7752c7882K3989r835P5342R8320o7691l6360j077L8287m1488o9547J6871n1745
7740f2816j3417P3396K6189k0594J4609J0778J029l4188k654N5637L1064j6960
7728F2073p242r949n3217l8338j3052M4560L1392n4916j8801P982J4561P204L3061
7715E318M5830o5964k4127J6004L7643J1406M4665O2920N2649j2602m2384p6851
7703E4507n7201L9594k4303J2618M1429L9818l646p9659k5577K1729K408j7764
7691C953l949o1571n0289M8861N0122l3208l9987J6811M4396L4278K9173j1557
7679B7033j5768m7473P799K2495M7721m1468l0520O9119J4160m8397r8j4512J1969
7666B060k4625j0530l8268L2120L0260j688K4729k4592j3599L4762J4054J9373
$$ y = [-37882, -13893, -23728, 51614, 149934, 82243, 45883, 44806, 83093, 41605, -27942, -11071, -62816, -76233, -2837, 23352, 2758, 17367, 28145, 29174, -5014, -7668, 47969, 79033, 62073, 54831, 44882, -8335, -46673, -59725, -15165, 16227, -38689, -57490, -49508, -34947, -27743, 5318, 51148, -14816, -38943, -22939, 14704, 26110, 70775, 133695, 186344, 173742, 131358, 54507, -2694, 36900, 12597, 25215, 66644, 106462, 102816, 23157, -2420, 19309, 21717, 3953, 4, -61567, -111856, -62995, -12873, -46081, -86068, -69257, -24861, 9417, 38590, 27033, 11265, -36208, -28409, -5914, 41807, 339, -30181, 38938, 53098, 4701, 4603, -9909, 2060, -22565, -33095, -71363, -39243, -8983, -10671, 14058, -10534, -24133, 10629, 24683, 44056]
7654D4056J4952l2494K0595k5495k258L3949n0066R495k1614L336O204k3569l1696
7641e4605j7363j1760N1798j5330l076O8683M0943p0106R346O2884L4569M851
7629A00834r5711n3832N1202K9038o470r600k2607L1562k1687q3134M6M6870j9365
7616e2854m8428P2711L1058q4966o7113K9225P7743M1982M649n4026n5190M7641
7604e7568K7247j2418j606M2139O115n3092m2907J6990M1544N4362K3487l2459
7592A1834p5888k0693K2286J2405j8949j7533o419j1443J8201Q6382J5488l5129
7580a9458k9822j9933J8529L0764l382L0997N5780j7907n2694Q812L7316m1258
7568b256M1953N5154K0247o016l5729m2544n5722j1479K1688Q619J8778J826N756
$$ y = [44056, 59008, 26514, 47109, 21614, 19356, 53305, 3239, 12734, -8880, -5544, 660, -22909, -54605, -71968, -83728, -31930, -47260, -50336, 18347, 59290, -10816, -1470, 61414, 95983, 100834, 5123, -48709, 2493, 31531, 25061, 15461, -7146, 24416, 2729, -80405, -80359, -33489, -52854, -101282, -28571, 2487, -82479, -149592, -120367, -42624, -642, 4007, -50019, -105209, -57568, -30321, -42739, -44345, -2206, 3909, -49183, -92090, -75100, -33556, 20806, 44293, 11834, -64054, -84747, -62461, -50056, -69005, -86538, -92957, -104400, -86199, 183, 15671, -19458, -49280, -69213, -50684, -19920, -23302, 7695, 63475, 45568, -7126, 1686, 39002, -2256, 39697, 94851, 115098, 109082, 73353, 30809, -24913, -36392, -14704, -6085, 12693, 14519, 20275]
7555B0275K5952j1333j5721L018J7955J7418R75q1953m8980o3827m6408J5137
7543a67492P7188K5991J7833j7841q774j2910N479l6955r865N4823L8006k3590
7531e8107j4634K2827J5242J2505L0717N5958m6231r0873Q300O3332K2632o2K1649
7518D3255n380o666l4950q3169L5470O4099j0789p788J6686J6015L1602q775K3994
7505G3604J3984m9805l177Q954o1541k4696K8553l8415R020l5921P323Q922l3598
7492i6793J3600M9077Q460K2164k3670K089L1155k4489R327n297m7968m738k6989
7479i4072m8821J1156J8633M9633L1540j3136l6440L2813L3506J6868J5539J8833
7467C6052j0682k636p650N892k6154q2772o9011O0548Q951q552J16837O8502o6928
$$ y = [20275, 46227, 34894, 19173, 22191, 40146, 57564, 58539, -23414, -72394, -136221, -182629, -167492, -90304, -64313, -46480, -64321, -73095, -86005, -80526, -117481, -127346, -72523, -34517, -58107, -72741, -49914, -34672, -22167, 8550, 64508, 18277, -72596, -64296, -964, 21668, 21606, 43255, 37875, 31209, -3741, -86910, -51440, 12659, 1870, -5918, 10768, 26783, 58385, 49610, 73604, 87588, 37783, 34606, 43560, -17981, -42677, -14124, -52539, -43519, -79440, -72117, -63195, -96793, -83193, -34116, -25656, -3492, -27162, -25073, 6082, -18407, -9080, -14377, -62345, -67083, -94072, -142893, -131737, -113104, -63471, -31931, -45067, -81507, -48694, -15188, 1680, 17219, 36052, 25370, 22734, 15084, 20976, -5178, -87950, -156961, -96413, -87462, -96014, 20823, 89325, 22397]
7454B2397l4422J4524l6381k6359P014p495k7523k8966P3115J2176l8185O3716
7442f389J4184J407Q815L6198M0022q0192l7647O9399k1014l0344m9373j2652
7430f7586K3547J6424K6964J839j8338M2719N23k4139o605l8508k6559o0500L4942
7417i5277N6365q71J7120M0875J1900m2334j2687K3184n844L7266M027j7961k1466
7404e703m2095M8980J6319o508r317n5476j11590O413N3237N5007K5837m5317
7392g0213j4570O950J2806l3383L5587J4982N8224l573m1424p149L901j8758J5985
7379d0635J7573J802k9400L111M4617L1447J2592p8796o895N5386J0323J2440
7367C3565M050m4536O906J5069N1789m6329l5550m522J982l2001K2978M6121L4984
$$ y = [22397, -12025, 2499, -33882, -60241, -53227, -60722, -88245, -117211, -44096, -31920, -70105, -6389, 7795, 9202, 18017, 54215, 94237, 14045, -23602, 45797, 24783, -5561, -54934, -67586, -44039, -27615, -651, 1188, -17150, 25569, 26092, 1953, -4652, -43160, -69719, -130219, -95277, -38912, -39783, -22663, 18212, 30112, -12222, -24909, -1725, -7569, 29697, 33724, 15763, -5703, -47798, 1182, 17501, 10993, 1676, -53800, -165390, -158977, -105740, -50733, -24896, -70213, -84783, -77833, -65027, -98410, -62823, -47841, 10383, 6810, -34614, -41763, -37862, -56620, -40635, -23062, -21260, -50660, -47549, -2932, 28515, 41107, -37689, -44584, 10802, 21125, 33565, 37615, -6921, -15, 15054, 66843, 20514, -15036, -19558, -17576, -49577, -26599, 19522, 54506]
7354E4506l590K0765j3479l4007K7780L6553k8765r2801j533J0243M6260K0668
7342D2600j4734L7744o328n5145n5923m1765j4925K5949N2244J7047k6208O537
7330c2907k418p314K263L976k4767r242n2078L2770J9159j4583J3349M3564K5957
7317b271j5625J1377O437J1040L1499L0156M3729O199n2627p5226l5177q01K3548
7304a7742k9687l998M7123j78r45o1476l764L5799L1748j7096K4560J7299l2352
7291a0709m6870n762j937L5570j3195n9021q8503N8952K2374M9660M7742n042
7279a6741j1413P2964O1158k2545n1494q845m61r807k6342k851j026P939j1249
7266b0713j2161L6090K6505j7016l2918K3260j5815j4651k1555M99K8445J6938
$$ y = [54506, 50916, 71681, 58202, 24195, 51975, 88528, 59763, -33038, -34571, -24328, 21932, 42600, 27866, 65610, 59282, 4137, -51786, -93551, -108476, -82527, -30283, -13236, -39444, -32907, -35325, -42639, -40376, -36400, -61167, -70409, -122487, -89717, -70558, -85141, -71792, -28228, -2271, -17896, -6519, -82, 10958, 42457, 72613, 116342, 122541, 69914, -5312, -40489, -41290, -17742, -47429, -51427, -4304, -4482, -5427, -66903, -70667, -34868, -3120, -20216, 4344, 21643, -10709, -57579, -63341, -65278, -29708, -42903, -101924, -190427, -131475, -109101, -59441, -11699, -16741, -28154, 44810, 105968, 83423, 31929, 23084, 22623, 12816, -13526, -16377, -17403, -9464, -20713, -32874, 3216, 29721, 12705, -20213, 3047, -12768, -27419, -48974, -48475, -20030, -3092]
7254c092j0757J5461j6653K791M1446k6038j3367k0574j661P338n1755o7469K1193
7241a23137L3717Q4498M0114J5892L176k6481n4639p263L6358j2484k424k8065
7229d0738l3403N7330N8720J3487l8850J7182K2378j3526l3660L457q147P591
7217A1821l5701j9500J5164J1889k4401K4871O7958J752K6946J1849q756J5103
7205I8995q975L877n0872o4411n6429l1893N332K5963K3017J1069O3717L1963
7193E1353l9300n2989J1526K7000m4483j0364K3502k0760J4413j2206j5354L5111
7181c2551l6688l4834L2119M9591N0505N0942m2891j6109M7939k7194r695K1450
7169E2584j3331k3970k3028n3202K4598J3765L1586m0667O0020j561n1636L6404
$$ y = [-3092, -13849, 1612, -15041, -12250, 29196, 3158, -10209, -30783, -32444, -25106, -76861, -144330, -123137, -89420, -4922, 35192, 51084, 54260, 27779, -26860, -34123, 2235, -10249, -12673, -40738, -74141, -16811, 41909, 55396, 16546, 33728, 56106, 42580, 8920, 12377, 4230, 11821, -23880, -43380, -28216, -16327, -40728, -15857, 52101, 53853, 80799, 92648, 83892, 98995, 90020, 93897, 43025, -21386, -77815, -109708, -104376, -78413, -55396, -44327, 19390, 51353, 12053, -40936, -29410, -2410, -46893, -57257, -33755, -54515, -40102, -52308, -67662, -32551, -69239, -104073, -71954, -22363, 28142, 79084, 36193, 20084, 68023, 40829, 31134, 52584, 39253, 15283, -7745, -60947, -36349, -22584, 9002, -31665, 28355, 26794, -24842, 11562]
7157A1562M1491m3193n6938p770l0018k5481K8297N5179j4107L685J1402J8330
7145g561j2430k8507n3185o03N8587R580m1249K3865P1208j6478k2212M7832r789
7132A9058j6665m7338L2231N4178m9436n2507J2008L0739M539K7535O407n2789
7120c2040J7714O321o1859J6583q52K993l679m9715l4023O3147N3908O938P403
7107g161P9600L6341j0837p412k7013r0704J549J3810o562K4166O412q329L4026
7094C7886n0655j4408j1086k287o93l0048K108k4810L8568n022K7877O4145L883
7081C5458j6747l606j9424L8631p637K0017M0341o2484l7752K9626p733L9741
7069D8431l1984j9879r600k0378l8495k2851m8496k3782M4994L3893L6644N901
$$ y = [11562, 53053, 9860, -47078, -54848, -84866, -110347, -82050, -26871, -40978, -37293, -25891, -7561, -19991, -48498, -101683, -102286, -43699, -34119, -75368, -51503, 19705, 3227, -18985, 28847, 19058, 2393, -44945, -12714, 41464, -7972, -60479, -48471, -17732, -13193, 14342, 20749, -32040, -14326, -8005, -69864, -53281, -54133, -51140, -54819, -104534, -138557, -75410, -21502, -14564, -7161, 72439, 108780, 97943, 90531, 63518, -27186, -25637, -11827, -18389, 5777, 12189, 3860, 37886, -12769, -27177, -38263, -40550, -41243, -71291, -69183, -93993, -55425, -60447, -32570, 31575, 35458, 18711, 15105, -4319, 34312, 26675, 46692, 87033, 24549, -13203, 16423, 8690, 48431, 16447, -3432, -13032, -33410, -71905, -94756, -143252, -167034, -122040, -88147, -51503, -45602]
7057d5602l4544Q151J8527Q932O6311Q681n5693J60p802N8259J7163l7792N1569
7044E6320m4106L0647O2958m8600q0416j2646Q1471m0148j01206K0579K6285J6108
7032c2754k780L546j9354L041k6810L1210m2542n4625L1034J5829k8995k2646
7020a45846P4931k624J6494L4901M524o0704k0554j6952L796L7499J3836J4155
7008d6544j698k4749K1566J0499l1423l7108L6861N3257J5339M3363l0353j6306
6996g296p999m836j9377m6268J1257L5317L6423l3383o6936m3638N780q361N3296
6983i6021O9115K101r10M3199L4215j7671r1967l9339l983M7679L1708r944K6542
6970e276O0269P577l3961K9407j8396o7048m7701J2149O7304K0594K2131J1636
$$ y = [-45602, -80146, -71995, -53468, -44536, 21775, 30456, -25237, -25077, -32879, 25380, 42543, 4751, 56320, 12214, 42861, 105819, 57219, -23197, -35843, 45628, 5480, -95726, -75147, -48862, -32754, -35534, -31988, -51342, -48301, -75111, -43901, -86443, -141068, -110034, -94205, -123200, -145846, -70915, -73539, -57045, -22144, -17620, -78324, -98878, -115830, -112034, -74535, -60699, -46544, -48242, -72991, -51425, -40926, -72349, -109457, -72596, -19339, -4000, 39363, 9010, -7296, -15295, -20131, -39508, -85776, -74519, -39202, -2779, -36162, -103098, -146736, -140956, -149317, -96021, -26906, -24805, -25715, 17484, 51699, 34028, -57939, -97278, -101261, -53582, -21874, -31818, -5276, 54993, 62570, 28609, 58016, 39620, -27428, -75129, -62980, 4324, 24918, 47049, 58685]
6958E8685K1205o2894m1359k0099p929O885K2091k0717k2170N9869K4517l175
6946A4909r613J7166K6277M360m9030n3965J5129R489J1049L2345k1232L8114
6934C4998L9596j627J064n5533o0743o7776k0060M8453P6217N3538p263m1348
6922d84k7685K764O4266K9488l1031m8880O297n496L243N7860j2017P180k2585
6909B2920j5036j3418j7512k8129j1484L1359j0627J2064k6880L7429k965k2420
6897d4699k1307k320N500n054L4884K5230J031k337m6038j9614N71L2690N9241
6884A7778J6316l0522n1195j0265L8023j4468j0956M6969L961P409J4015q592
6872A8473n949j8461l7483L4639J4822L393l0368K4880k018m4598k8301k1779
$$ y = [58685, 79890, 16996, -24363, -44462, -52391, -45506, -23415, -44132, -66302, -6433, 18084, 14909, 5296, 22462, 48739, 53099, 4069, -49896, -34767, -25278, -14229, 18116, -3116, 34998, 74594, 72967, 74031, 18498, -42245, -110021, -130081, -81628, -5411, 48127, 40864, -484, -28169, -25405, 38861, 68349, 37318, -11562, -5265, -10761, -7518, 50342, 38325, 45505, 22920, 7884, -5534, -23046, -51175, -62659, -31300, -41927, -29863, -56743, -19314, -22279, -44699, -66006, -68326, -62826, -67880, -32996, -7766, -6735, -9072, -55110, -74724, -74153, -41463, 17778, 34094, 3572, -47623, -57888, -19865, -34333, -45289, 1680, 5641, 13050, 27065, 18473, 12524, -5937, -43420, -8781, 6041, 9434, -20934, 3946, 1928, -42670, -70971, -92750]
6860i2750K8547J1672J3035K7470M9906K7262o0957P454k1322m269L3347k2608
6848c213k4147P139k175k1955N5166O6761J522o7476j3441J8038k9995o9402J8509
6835f4669K4119l0921p988O6608L2609j2646p4910l4609K3899l9640m5139L6686
6823a26601O1203k5765J2609O5921j8066l1958K9384L6926L2187J4155k2218l932
6811B3845j8603J8136K8395J551Q370j4293l4663J3023l1299n187J412m8973P1898
6798A3612P0849q3249l7850n5741J7880P657L5028K6022J6074K648M592K43r1335
6785g3570R308M5373N453K4482M2094J1368k9694j1447o9517n1991J8078L6332
6773d3731K0053J9746j2843N264O691M610n585L3076P252k1325K1425M5297j0653
$$ y = [-92750, -64203, -52531, -39496, -12026, 37880, 65142, 4185, 11639, -9683, -13952, 19395, -3213, -27360, -20221, -22396, -44351, 10815, 77576, 79098, 11622, -1819, 16219, -13776, -83178, -64669, -40550, -71471, -79459, -12851, 19758, 7112, -67798, -102407, -78508, -118148, -163287, -126601, -65398, -91163, -78554, -12633, -30699, -62657, -33273, 3653, 35840, 49995, 27777, 23845, 5242, 23378, 51773, 53324, 61694, 47401, 12738, 25761, -5538, -10725, -9313, -58286, 13612, 84461, 1212, -36638, -92379, -74499, -66842, -31814, -5792, 10282, 12930, 17522, 17765, -73570, -64262, -18889, -13436, 11046, 53140, 64508, 34814, 23367, -46150, -98141, -80063, -43731, -23678, -3932, -16775, -11511, -4820, -210, -5795, 27281, 34533, 13208, 34633, 79930, 69277]
6760F9277o5488j8800K6072m3273q470L0278L2137O0310M8904J0958o1347q264
6748G2294l6367q2366Q810N5043K1103j9775n5880k0381Q483n6583J8990M1298
6736d5331N8031R956k2954K3905L9013J746j7905l5215R957M265k9317L9073n8300
6723b3076Q732j9041m711l8486k6480L9918L8806j1596J8978M5391J199M2403
6711G2037n9480m9687J6380K5917j7862K733n758n3106N94L8157M5356J4650j8881
6698A1050k968J7574o397k0151l2083p234m2562R806L3064q389Q574p6326j3549
6685a29591L3141L4361o386L7085L0960j4861L8362J5815j8743m0995M9878N2157
6673H1183l5195l4094K6408p6175j3889N9340K4187m55l4638J982o1061J8865
$$ y = [69277, 3789, -15011, 11061, -32212, -40682, -10404, 21733, 82043, 130947, 141905, 80558, 72294, 35927, -46439, -37629, 17414, 38517, 18742, -37138, -57519, -49036, -105619, -86629, -45331, 12700, 22656, -298, 23607, 62620, 64366, 46461, 11246, 21203, 25468, -3849, 35224, -23076, -14344, -33385, -38096, -76582, -103062, -63144, -24338, -35934, -16956, 28435, 29634, 72037, 12557, -37130, -20750, 5167, -12695, -9962, -15720, -68826, -68232, -30075, 15281, 29931, 11050, 8082, 25656, 19259, -892, -32975, -40209, -82771, -72965, -39901, -48290, -39716, -116042, -129591, -96450, -62089, -68475, -31390, -430, -15291, 23071, 38886, 20143, -20852, 29026, 81183, 45988, 11894, 38302, -37873, -51762, 7578, 31765, 31310, -3328, -1346, -62407, -43542]
6661d3542P9520O291o3580k5614l608M2250R376m8634J2613p583K0217J531l3027
6648e3790m1254p31M4664M4158N1304M6978p1041q4805m8844L1778M2857j2539
6636e1265K0168k6200n0528L2885N2069K6917p021K5854l45K2164j6748K198n5856
6623b5708J6758j3798K5427M0063N480k1680r945k4828l9382j4371K581o5923
6611a25326M831P8902L8780J0690L1434L2962k8815k940l98J7832l5531k3823
6599a402l3879O1938O1478M949j2901k7285J1199k9746l1560M5029J3745k4275
6587C7290K2385j3111k6975m2943l2321O628L4548M0771n694l0267q529O281K8889
6574A6952J4857J8161j1703k8331k8318P013K4441k5571o4194J0435O8947K0182
$$ y = [-43542, 35978, 42269, -21311, -46925, -50533, -8283, 1093, -47541, -34928, -42511, -22294, -20763, -53790, -95044, -95775, -51111, -6953, 44351, 91329, 20288, -64517, -113361, -81583, -38726, -51265, -31097, -57297, -107825, -74940, -22871, 4046, -2975, 22879, 22534, 44698, 27950, 30148, -25708, -8950, -22748, 2679, 42742, 48222, 26542, 16597, -8231, -47613, -61984, -59403, -125326, -120495, -41593, -2813, 7877, 39311, 72273, 43458, 40518, 40120, 57952, 22421, -1402, -35281, 26657, 88135, 93084, 80183, 52898, 64097, 34351, 2791, 47820, 61565, 37290, 59675, 46564, 19589, -23354, -55675, -49047, -14499, 26272, 20578, -9689, -18218, -11937, 16952, 31809, 49970, 38267, 9936, -18382, -11369, 13072, -12499, -76693, -66258, 2689, 22871]
6562B2871K0577J8009K0882k8957n9469l6947N5779K2125o0606p362O6961K2762
6550E6625j0487N014j9860l8351K7M4289L7513m596o1518k2481j4471k791K3169
6537g918j5359o830L4662L1753O842l9971p7552k3483N4765L2086R890M5650O011
6524E0546k7317J9270J6392l3016L0830N7624m7673m1001k1580K558m2322m6875
6512h2564K863J9916m996P5728K2217l4275m416J2510k8909M2424L7427P110n5232
6499I803r62k4095m1211N1633M8587k263o6638m0307M2125N5139J0455o6927l2202
6486e6863P191N0612J0194m8987p772l443k0517M549o308J5898K876O3919M1620
6473E2969n5056j8633J7480J8729k4929K4363L1121n2588k720o8951r664N942
$$ y = [22871, 43448, 61457, 82339, 53382, -6087, -43034, 12745, 34870, -25736, -33098, 33863, 56625, 46138, 51152, 31292, -7059, -7032, 37257, 74770, 70174, 8656, -13825, -28296, -31087, -7918, -23277, -30107, 4555, 36308, 43150, 3179, -74373, -97856, -43091, -11005, -1115, 44535, 50546, 23229, 42499, 58891, 25875, 56705, 114329, 66656, 25655, 4075, 6633, -35689, -82564, -79701, -59785, -64781, 10947, 33164, -1111, -5527, 6983, -21926, 20498, 57925, 65035, 9803, 8841, -15254, -56465, -4832, 43755, 41492, -25146, -65453, -23328, 31811, 42266, -24661, -56863, -49672, 940, 11134, -37853, -45625, -49068, -69585, -65036, -71344, -55446, -52570, 11349, 52969, -2087, -20720, -3240, 15489, -9440, 14923, 46044, -6544, -9264, -78215, -87879, -81937]
6461h1937J5059J8805k999k2153L3644k516K0067m176M5093L588l1632L8450M3068
6448G2361m2485m2764k5086l8306j4404L2447L9259L3143P986m141J1814j0751
6436A9073J1893j2602l5131j1771J5443r179j1063O488k89J3847m084j8510L4547
6423a338J6646k697m8974j5216K3501p44n502k4445O6332L6074l2199l4498O958
6410a6102K3686J4883L20j3212l4474O324L8003J0808k7139q566O785q452R2583
6397H5447L454k3845j2751k6713q207J6188j9780k5898n9106j1555j8928M1226
6385f0468J48696O9780n7180q2716p0338J0439P3710L1152j3344l9491m2923J150
6373c1533k4799j7966O6609J5883K5814J8262j5110M4278q277k2590o1635n2909
$$ y = [-81937, -66878, -48073, -51072, -73225, -39581, -42097, -22030, -26206, 18887, 22475, -9157, 29293, 72361, 29876, -12888, -37974, -76280, -90684, -58237, -18978, 14165, 22151, 18010, 29824, 19073, 30966, 18364, -16767, -28538, -13095, -22274, -33337, -26849, -27138, -13291, -17375, -35885, -1338, 15308, 12611, -36363, -51579, -28078, -28822, -34324, -58769, 7563, 43637, 11438, -23060, -16102, 7584, 22467, 22787, 9575, -24899, -18575, 19428, 30236, 3097, -5469, 1316, -7136, 85447, 88901, 65056, 52305, 25592, 17385, 33573, 13793, -12105, -71211, -82766, -101694, -60468, 88228, 158008, 100828, 18112, -52226, -41787, 31923, 63075, 49731, 10240, -32683, -31533, -56332, -74298, -7689, 8194, 34008, 52270, 37160, 81438, 73161, 50571, -11064, -63973]
6361f3973k4989J814O499P0728n488n4841K4579J7215m5204J3221N2236J302m1421
6348d8322J2251m855P500K9293q568P2l898N3716k5080p0908p0229M5565j0530
6335i3993k8757k186K9836K221L0201P9978M9746j681R041k2841m4402m5141J584
6322c6394k6964J6634K0662M3378o8137j2312L9165J3472k1753k1742k0914J1251
6310f3654J6633O3721K506J2978m846j6434K0778o310k5814l6412k443k0228P086
6297e2439P3227K2574O195l567L4620o38R43R761J4649j1483q9714J835m6347
6284d0384M1575J7808l6072m0592K7113o633K6414R916J9147k7571l8948L4316
6272a3911Q0530J8018m4604l3914k4600j4527k5241m114j5091j9641K3268n0350
$$ y = [-63973, -88962, -87148, -80649, -9921, -15409, -70250, -45671, -28456, -73660, -60439, -8203, -6901, -48322, -36071, -40926, -33426, -4133, -12701, -12629, -16527, 37189, 12109, -58799, -129028, -83463, -93993, -122750, -124936, -95100, -92879, -62678, 17300, 67046, 65365, 74406, 51565, 7163, -37978, -36394, -63358, -46724, -26062, 17316, -50821, -63133, -23968, -10496, -32249, -53991, -74905, -63654, -47021, 16700, 19206, 32184, 27338, 10904, 31682, 25372, -442, -36854, -39297, -59525, -52439, 20788, 43362, 49557, 45990, 80610, 79972, 80915, 90676, 105325, 93842, 4128, 5963, -40384, 1191, 18999, -17073, -57665, -30552, -37185, -10771, -855, 18292, -9279, -48227, -13911, 66619, 84637, 40033, 6119, -18481, -33008, -58249, -62363, -77454, -97095, -73827, -124177]
6260a24177O560P4803J5137j8238J9816K1879j1955j4166L6889M1525n2926k1261
6248b6114K5090M3225K0488o926n8598j5384K1998J3968n1374n0030J6891j316
6236f8082j0068R543N5673P8018L8110m2024m9277Q390p762j8943p657M7418J5858
6223D9197q201j3400n3049J9744L5112k1572k9699K1825Q3269k8624m8872J5780
6211B1510K6401k8416j2329j2094m8K4151L7264m4082K1835K1806k9564m7970
6199b1536K6807O7005m96l0033J838M8469K1365r8467k4560L0870Q930j0689m4368
6186b4865K3160r533M876J8643K101r89o332j3905q669k2607j6550N3471K5858
6173B4659l1063M0591K1357j2443j1841j4312j9576p6650k4187K0448J4487J8788
$$ y = [-124177, -117617, -42814, -27677, -45915, -26099, -4220, -16175, -30341, 6548, 48073, -4853, -26114, -1024, 42201, 62689, 55763, -2835, -18219, 3779, 17747, -33627, -83657, -66766, -68082, -78150, -68607, -12934, 65084, 103194, 61170, 11893, 20283, 12521, -6422, -14079, 33339, 49197, 40996, 27596, -25453, -5709, 29403, 7831, -21868, -43, 83226, 54602, 5730, 21510, 47911, 19495, 7166, -4928, -4976, 19175, 56439, 12357, 34192, 55998, 26434, -21536, 5271, 72276, 71780, 41747, 43585, 92054, 113419, 14952, -9608, 21262, 30192, 19503, -24865, -1705, -11238, -6362, 12281, 14382, 13393, 7061, -6844, -15513, -38120, -54670, -1199, 24659, -6404, 34187, 55544, 43101, 31260, 16948, -2628, -79278, -103465, -83017, -68530, -49742]
6161d9742L6113J7023J060j175l1142M0759k5476j3829J780L5659k0134J6992
6149G888M1169o243k5505J7964J8341k0j0548K1290O780l9742l7762Q832K6796
6136B9240o6933m0286K6073P8923l2260k5941M4811N6325l5533p971J3841J3354
6124E3643L3782k2634n9918j0214l7547j6668O5884K6055j8711k9765m869K0870
6112i2J0512M378K2974J2747j3735L4332m0519p6361k2839k3282L3357K7836K2878
6099g814k8375m6658N653M2123K9904M9676l733r3888m7014j677j7991K0318M6430
6086e3046M2396L170J5037J2595K9734m5789l9801j113K1685j7068o928l7106
6074g6234k0563p903j1346O7455M0883J0201r2488o1856M8994K2349r878L992
$$ y = [-49742, -13629, 3394, 4454, 3279, -27863, 12896, -12580, -26409, -24629, 11030, -9104, 7888, 49057, 42814, 17309, 35273, 53614, 53594, 43046, 64336, 71116, 31374, -6388, 2444, 29240, -37693, -77979, -51906, 27017, -5243, -31184, 13627, 69952, 34419, 26448, 40289, 53643, 87425, 64791, 4873, -5341, -42888, -59556, 6328, 32383, 13672, -16093, -20962, -92, 10420, 14798, 37772, 50519, 36784, 71116, 30597, -45764, -68603, -91885, -58528, -30692, -7814, -36189, -82847, -77194, -35071, -5167, 44509, 40776, -53112, -100126, -101803, -119794, -99476, -53046, -10650, -7480, 7557, 20152, 49886, 4097, -35704, -36817, -15132, -32200, -39128, -76234, -96797, -104700, -116046, -48591, -7708, 2493, -89995, -151851, -102857, -80508, -90386, -86394]
6062h6394K3176M0303J2627J2570J2642m6617m2189K817l8735J6169Q9836O7471
6050F3676M613o3152m5289m0513K0035K5548L648L0413L5072k7675n6269n1471
6038a01364M8400L7169J1938O59j4156J2622J6654K9472k1134l1005m2533k544
6026e5822K6372P158j3197Q103N3978J3406M539N6833k9660k6046j6775j575o0349
6013c3035J449L4123M8377N883K1001n477k0068l3885l1763L6273J7003l2847
6001G034J2388K0171K2295J4824l4424K7514q168l1262L8537K1064j09971m3668
5989f3666k6645N647p784p435j036j468M2503K7692M444L4947R3817k9544j9270
5976E2202k3812Q754l455l4202l7L3292K2812o3282L064Q452Q855J4810j6273
$$ y = [-86394, -63218, -22915, -10288, 2282, 14924, -31693, -73882, -71065, -109800, -93631, -3795, 63676, 68289, 5137, -40152, -80665, -60630, -35082, -31434, -1021, 34051, 6376, -49893, -101364, -52964, -15795, -3857, -3198, -17354, -4732, 11922, 41394, 20260, -10745, -53278, -55822, -29450, -22292, -35489, -27386, 26592, 39998, 44537, 101370, 71710, 45664, 28889, 27314, -33035, -31586, 2537, 50914, 56797, 77798, 72321, 52253, 18368, -13395, 22878, 39881, 7034, 19422, 39593, 61888, 76712, 42288, 69802, 61634, 30372, 68909, 89973, -19998, -63666, -90311, -84664, -92448, -99883, -100919, -102387, -59884, -32192, -27748, 7199, 101016, 71472, 52202, 28390, 37144, 33689, -513, -550, 32742, 55554, -7728, -4664, 3788, 12643, 27453, 11180]
5963A1180o6961p650N2483K612Q182j350l5635Q642M662k6302M6614J0677j3478
5950f324j3124Q818L754k1034P492l9411p6359j2619L4946M6044M4445k1631J1600
5937c3403M6615J9464n8696o77L3414L1466j327m7102M6429j8784K5381j3478
5925B9302j8845j0747n4571k5307K6388L5754K2624l5328l8985L5250J225n4427
5913h7667l1932K6932k5577k6488M4177K9371k0092m0979J0552N4944r135J0944
5901f4950R1650l483l117O3618J5803m9576K2124o2678n4313M816j6575M2900
5889a3781K5727o8131j7643j6460J6608L7507M5649K19l108Q24k5581p978L02
5876b5846J7899J9119k921M8342l531k9754l1988m4697n5952L76p902j3794l212
$$ y = [11180, -55781, -63431, -10948, -8336, -154, -1504, -37139, -28497, -23835, -50137, -3523, 7154, -6324, -19448, -10630, -6876, -27910, -20418, -59829, -136188, -148807, -113861, -67817, -23372, -45003, -33403, 13212, 32676, -26020, -26697, 6717, 38183, 36856, -10246, 36183, 17399, 42780, 29302, 10457, -290, -54861, -80168, -53780, -18026, 4598, -30730, -69715, -34465, -33240, -87667, -119599, -92667, -118244, -144732, -100555, -71184, -91276, -132255, -121703, -66759, -75894, -64950, 26700, 23217, 20100, 83718, 99521, 49945, 72069, 9391, -44922, -40106, -56681, -13781, 11946, -56185, -73828, -90288, -73680, -36173, 9476, 9695, 6587, 7411, -18170, -26148, -25846, -7947, 11172, 8251, 56593, 53062, 23308, -8680, -53377, -109329, -108953, -116855, -130649, -133861]
5863a33861M3499o597L1947M5015k7450N519M4866J1015m2600o687n41m1667K5282
5850e2260M90K05k4649J7410K4001J4002L5306J3758m5883K36j4593k8023L1803
5837b8197K667n4885l045L8064J6099K2608k748N0196J318J0442k382n2116p925
5824i904l618p734J6509k1576m0081j9416J4282Q327J778k893J1380m419r59K3179
5810c5145R576L7113N2274j7356l5397J5456J9196P724k0999p7420k6568J1689
5798e9857J6536Q1335l6786o2899k6197L6101K3829J157r08L3075O1169J5075
5786H1630n5583l0510J4641J853j9449k7353o951k7769j914R773k8272k039O4556
5773b7387j8163Q100K1866l6362J0162M2996L015J8560K3016n2579j9466J5366
$$ y = [-133861, -90362, -96959, -65012, -19997, -47447, -41928, 2938, 13953, -28647, -35334, -35875, -77542, -52260, -51770, -51565, -76214, -58804, -34803, -20801, 14505, 28263, -17620, -17384, -31977, -60000, -28197, -25530, -80415, -83460, -45396, -29297, -6689, -9437, 40759, 42077, 52519, 50137, -1979, -9904, -13522, -21256, -4747, -26323, -66404, -85820, -71538, -63211, -61433, -64326, -52946, -57365, -58324, -35145, -25569, 11544, 63818, 46462, 11065, 26521, 45717, 53441, 32442, -44978, -71546, -59857, -43321, 38014, 1228, -61671, -87868, -51767, -27938, -26781, -27689, 5386, 66555, 81630, 26047, -4463, 10178, 12031, -7418, -34771, -41722, -69491, -71405, -61632, -89904, -91943, -27387, -45550, -37450, -15584, -51946, -41784, 1212, 4227, 22787, 45803, -6776, -26242, -10876]
5761a0876m0386l3092j3224J6256P975k839P383L0863N1352K0147j1864q5925
5749f4230M3121O2599k7774j8041L3198k614j6126m1124j0964m9561K1935N1867
5737a7714P7035j3083j5638N4826J842p5246o056L5654L5848n7344n2037P814
5725b4099L2878K2211k3367j0626P8035J921k8762j4365l8169J1624K2010j3716
5713A5575j3286J0747K5323J7833m7293m765K480K0247J3220o4922m2608L333
5701f4116j020L3162J6548l6752k8264N173o855j6448p164K4222N1911J9357l6541
5688d6787L446R469m1566L544J5428J3660K7325m210l2684K3281M0443k1683k4601
5675c4935L299J6894J6921J6736j1479j9978L0499O100m3471j9806j9156K8035
$$ y = [-10876, -51262, -84354, -97578, -81322, -73347, -76186, -68803, -37940, 13412, 33559, 21695, -64230, -21109, 41490, 13716, -4325, 28873, 26259, 10133, -30991, -41955, -91516, -69581, -17714, 59321, 46238, 30600, 85426, 87268, 12022, 5966, 41620, 77468, 20124, -31913, -24099, 8779, 30990, 7623, -3003, 75032, 76953, 48191, 33826, -4343, 7281, 29291, 15575, 2289, 13036, 38359, 56192, 8899, 4134, 6614, 26861, 40081, -24841, -67449, -64116, -65136, -31974, -15426, -52178, -80442, -75269, -82124, -98572, -105736, -81514, -29603, -10246, -46787, -43341, -33872, -75438, -71894, -56466, -42806, -15481, -19691, -52375, -29094, 11349, -10334, -34935, -31636, -14742, 2179, 18915, 7436, -12542, 17957, 24057, -19414, -39220, -58376, -30341]
5663c0341J8580O7605k9598j9437j40l4095K8944P9875l1124l1241k761K1053
5651C7320K238l0284j5339L9008p149j2289k8442L2170j4721J1788J9206k8926
5639D580q587M0719j9406M2633K4547l7240l085k310k7081j0794Q885l8242k4050
5626d9431J8053j3415L7962N2600j8033j6598l8079n3554K0135P9954O790j8073
5614H311J7603q343J3184J5725r514L1641k28k3075l5636j4902K2341K8337m4093
5601A351m4502m1211J2585K0653k1050j686k259K2450j7946j6663Q8831J0146
5589A0699m7861J0922R130p062L6150K0293l1399l2495O168j3386M159J9807N7498
5576D2623j3737m8201r570L4913j9520R936k9905q5265k833M0020n514J7208J1647
$$ y = [-30341, -11761, 55844, 26246, 6809, 6669, -27426, 1518, 81393, 50269, 19028, 16267, 37320, 39558, 9274, -6065, 32943, 25794, 13505, -14937, 17233, 2512, 14300, 33506, 4580, -4007, 36712, 17306, 59939, 84486, 47246, 44161, 41851, 14770, 3976, 12861, -25381, -49431, -31378, -44793, -6831, 45769, 27736, 11138, -26941, -80495, -60360, 19594, 26384, 8311, 25914, 17571, 30755, 46480, 36966, 68607, 68379, 45304, 9668, -5234, 17107, 45444, 1351, -43151, -84362, -71777, -51124, -72174, -73860, -76119, -53669, -71615, -88278, 553, 10699, -37162, -26240, -17110, -24172, 11978, 32271, 872, -31623, -25455, -38841, -34682, -14875, 42623, 28886, -19315, -28885, 6028, -13492, -3556, -33461, -118726, -121559, -81539, -87053, -69845, -58198]
5563e8198q838M3382M4858q349j3425k12r504M3070J0075k8727K935L8308P374
5550F2749K893n0137l8286J2618L4500m7466o2492L2649N211J1538N3302l1660
5538a4581J6339O3358p6108n7907L6851J8697K6745J7608l0397k3404K008L071
5526a7720N5658j617p548Q496j2021L1678l495m0509m4494q6672K3902K5264M2022
5513b7056K8594l5135k4520j419k3885L9715N1724l82m2703K3123J5374k3132
5501a9702n883m8305K5449M7605N280K9508R315m9786j5460M1101K2605j731K4512
5488F4508K3071j2388j5530o605m602o079R209j8355J4704n686j119K9039n9530
5475A0637p0945K2117j9776O3613L3290l0075N01K8356M101n065J0464k5540m8576
$$ y = [-58198, -67036, -23654, 21204, 12855, -570, -782, -10286, 32784, 42859, 14132, 17067, 55375, 62749, 65642, 15505, -22781, -10163, 24337, -23129, -85621, -52972, -47761, -36223, 17079, -14581, 1758, 65116, -10992, -68899, -32048, -13351, 13394, 31002, 605, -22799, -20791, -17720, 37938, 36321, 28773, 37269, 25248, 56926, 53431, 12922, -31572, -118244, -94342, -69078, -27056, 1538, -33597, -58117, -59536, -83421, -43706, 8018, 7636, -35067, -11944, 3430, -19702, -25585, -73890, -48441, -836, 4444, 33952, 43267, -6519, -21979, 19122, 41727, 39996, 64508, 87579, 75191, 59661, 53056, 48454, 42375, 51584, 33229, 47933, 42247, 41128, 70167, 10637, -60308, -38191, -57967, 5646, 38936, 8861, 9362, 37718, 41819, 36754, 47218, 21678, -26898]
5462b6898K5713O231l0805j2242M067K7705K4584N1239K5902k8673j1532k7017
5450B8274l283K536q233J8399m9790P782N1930p589o4673o4599J5956L7360r957
5437d5887j5826J082K2885K7955K5472J0067J8635o1288l1701M1392J8820q0079
5425f8473L1485M4091Q106J0489j4386K0880n284p7306k3680P0569J0756J212
5413H459Q851K7891J4008k0803k3534j9503J1382P085k1520L5702m662Q753J9004
5400E1113j90n744n9492l9565j9249K6773m227j3092M5793N2707L8899m1758k7008
5387D960l3647j3041L5052r20l3086R766K6479J1529j092K896J4101J2795j0868
5374B4924k0824L4161J010K3623o305k0957l1593K24J2372o1272m1938k0790p711
$$ y = [-26898, -1185, 5046, -25759, -38001, -33934, -6229, 18355, 69594, 95496, 66823, 55291, 28274, 24991, 27527, 19294, 37693, -12097, -4315, 47615, 40026, -24647, -89246, -73290, -35930, -45887, -61713, -60631, -37746, -9791, 15681, 25748, 44383, -16905, -48606, -7214, 11606, -68473, -36988, 7103, 15209, 25698, 11312, 32192, 26908, -50398, -74078, -3509, 7247, 8459, 17310, 45201, 59209, 38406, 14872, -4631, 6751, 13836, -7684, 28018, 23356, 32109, 51113, 50923, 45179, -14313, -53878, -73127, -46354, -50581, -63673, -17880, 34827, 73726, 31968, 4960, -28687, -41728, -6676, -7596, -40682, -30916, -4437, 7092, 6000, 8896, 22997, 35792, 24924, 4100, 38261, 39271, 62894, 56589, 35632, 4039, 4263, 16635, -44637, -86575, -107365, -115076]
5361a15076K5825M7914K3660J8974l5070j5969K258n5707j2291O1960L1594J6933
5349d995k9531k6084L3829M8582N6057o5914o1750N0723L0070k5678J4555K1129
5337D0993M1285o760n5360n9715O1166N7640P805j1990J784k0240m0806l3154
5325a7352n839L4265Q503K9700p375J471K785m0819l1733K117J6595K3533k8758
5312a2907l6755J9343J0472m1414N7025L3544K0616j6712r9p4j1802k2103l5775
5299c6641J589j1881J0847K7577q311L5142O0926J9151J4600l8480J0846q75j1597
5286G2893q6215o5943J9050K1175l6033J4999R135K2788K678M2769k7577k248
5274a2529J4893j3814k5795J6864k5908K796J7324j3084J7823L5290P4207l0294
$$ y = [-115076, -89251, -41337, -17677, 1297, -33773, -49742, -47484, -103191, -115482, -53522, -21928, -4995, -34526, -60610, -26781, 21801, 77858, 11944, -49806, 917, 30987, 5309, 19864, 40993, 82278, 75518, 20158, -39557, 21609, 79249, 87054, 75064, 76848, 56608, 15802, -17352, -23191, 11074, 19577, 49277, 41902, 43373, 46158, 5339, -26394, -24277, -7682, 15851, -12907, -49662, -30319, -19847, -61261, -4236, 29308, 49924, 33212, 33113, 33039, 21237, -866, -36641, -35052, -46933, -36086, -8509, -16820, 18322, 79248, 98399, 112999, 74519, 85365, 84490, 72893, -13322, -79265, -60215, -39040, -75073, -60074, -50939, -28151, -25473, 17296, -10281, -12529, 2364, -11450, -37245, -20381, -46289, -43493, -26169, -39253, -21430, 13860, 88067, 57773]
5262E7773o8056m3432M4100N2815l0526J3605L4604j9304j7420p825k2317j0385
5250a6368j2673K4895j3204o4652m129K9938m3619j0569J4374J02985M1818k8215
5238B0581l7824J9904K7967M5150N0273n7122K0743R209J1702m0640j5161J313
5226E6095J7311n1339o4170N556j2000M1935o111m085m190k6721o3016q5346J872
5213a94209K5182M2120k3887L7304O9765L3412J3254L7m2875K8003J6964k2762
5201a7692q244L2165k7161k5172m654J4380J8967J4021o299n8279N10o158J8808
5188e4808J6245n4J572Q176l262O193K8229J2538k6089m3009r619k11K6703Q128
5174b9268K0713L8574j6315n4075p845K2055k1931j5564O7106N4116l242J7260
$$ y = [57773, -10283, -53715, -9615, 43200, 12674, 26279, 60883, 41579, 24159, 16334, -5983, -16368, -29041, -4146, -17350, -82002, -86131, -56193, -99812, -110381, -96007, 6978, 48796, 20581, -17243, 2661, 30628, 75778, 126051, 68929, 89672, 98881, 110583, 69943, 54782, 56095, 73406, 22067, -42103, -36547, -48547, -6612, -12723, -16808, -20998, -47719, -110735, -196081, -194209, -169027, -126907, -150794, -113490, -43725, -10313, 2941, 2978, -39897, -11894, 5070, -17692, -25936, 6229, -20932, -46104, -50758, -36378, -17411, -3390, -9689, -67968, -67458, -73616, -54808, -38563, -38617, -37045, -28869, -32131, -25938, 2291, 14829, -11260, -54269, -63888, -64099, -37396, -29268, -8555, 30019, 13704, -40371, -48216, -26161, -48092, -63656, 3450, 57566, 54324, 71584]
5162G1584J676o0706k8952L1489j6345M1095k6300L7898M1336l3048n2459O176
5150A3444j0388n1446N202L5211m2885l1217l4094m0530M3997O8790J5784L8341
5138A0209P910K1512P564j7119n5452k4513m2273O2657M9680o5651m7891J6776
5126g6591N3681J3231J4473l6855j4776J125m770K494R04j764r400P100m5791
5113i6939k4085l0719J6346N7354J46l7892q368L7356o351l2279j2913L745R408
5100a25191L7035j2272k3837L5095P5637J4568k06n9353M9118L0557L6599M1847
5088I9597K6106o8736q2839j1446N4206M2289l8718o1877j8036k1520j2529J574
5076i1929K8873K0177K877k0785L6929K8791j930k3697l3755K7371J9942m375
$$ y = [71584, 73260, 12554, -16398, 15091, -1254, 39841, 13541, 51439, 92775, 59727, 7268, 13444, 3056, -48390, -43188, -7977, -50862, -82079, -116173, -156703, -112706, -43916, -28132, 10209, 18119, 39631, 47195, 30076, -25376, -49889, -92162, -29505, 20175, -45476, -93367, -76591, -22910, -9679, 4794, -32061, -46837, -45712, -50482, -47988, -47084, -48848, -58248, -51148, -96939, -121024, -151743, -135397, -78043, -77897, -115789, -124157, -86801, -93152, -125431, -138344, -134599, -125191, -88156, -100428, -124265, -89170, -13533, 1035, 829, -58524, -9406, 21151, 57750, 99597, 125703, 56967, -25872, -37318, 16888, 59177, 20459, -41418, -59454, -80974, -93503, -91929, -63056, -42879, -40002, -60787, -23858, 4933, 3003, -20694, -54449, -27078, -7136, -11511]
5064a1511j318K000J4657J462k7814n0701k219N1591j5037m2512R946M4129M123
5051b3204N5454L6913n1024m7361l0362j8892L5910K5815l4212l0542R206K2456
5039d9843O3388L3881l9494j0445L2473j0637l3674n678k6225k9434o1484r999
5027a47171L1023L7020N539m7571L1027N5823Q564M823r18n0051j832K4609R078
5014d0037m0851m3782N5260O7126l5534j5519M567j3564O0240R0195l014K1247
5002A06334j3556o5610O244j1844j8004o8605J1513K7037j5217k9538K8352O3743
4990B0849J1747j8110m2465n1648R871R2966N8684M264l5256j7343j0979m711
4978A7869L8355J858k2031l3842J1024j7068l530L1685p428J102j4510R602M7137
$$ y = [-11511, -12829, -10829, 3828, 5290, -22524, -73225, -75444, -23853, -38890, -81402, -71456, -27327, -23204, 32250, 69163, 18139, -29222, -59584, -78476, -42566, -16751, -50963, -81505, -72299, -49843, 13545, 47426, 7932, -2513, 29960, 19323, -14351, -20029, -46254, -75688, -137172, -147171, -116148, -79128, -73589, -121160, -90133, -34310, -25746, -20923, -21841, -71892, -73724, -49115, -40037, -80888, -124670, -69410, -2284, -37818, -53337, -48770, -62334, -2094, 88101, 85087, 106334, 92778, 27168, 33412, 21568, 3564, -65041, -53528, -26491, -41708, -71246, -42894, 20849, 32596, 14486, -27979, -79627, -69756, 23210, 81894, 86158, 50902, 33559, 22580, 17869, 56224, 58082, 36051, 2209, 13233, -3835, -7365, 24320, 16892, 17994, 3484, 13086, 60223]
4965F0223j3470o2256l5567n295M9936O2566N761k3097m8341k363k5111m3486
4953h0500K9267O9041N4445N1498j05952l8870L6916j6204l3057j3601L070P901
4941c6046M8360O3470K9671R913k3117m0375R277r197j8428N7311m4171n6330
4929i662l4012N753n372N7989R636j02529r4642J6800L4649L440L5093L7596m3557
4916h8818M5890N3625J1144o9166m2261n194N9560L9024J5607J1355o8813p7435
4904a15482l945O4858n768L4045j5871j6617N5415J0881o3211j2423J8877J5518
4892c3723j502M1018O25k477N730m9952L5232K8365o860M5952k826l584n3615
4879B383l2216q315l1181O9815P2371n586l0108p880J6212q992L4041j185k3046
$$ y = [60223, 46753, -15503, -51070, -56365, -6429, 56137, 61898, 38801, -9540, -11903, -37014, -80500, -51233, 17808, 72253, 123751, 17799, -21071, 15845, -359, -33416, -47017, -43947, -36046, 12314, 75784, 105455, 115368, 92251, 51876, 61153, 51956, 33528, 90839, 46668, -9662, -43674, -37921, -43293, 14696, 24332, -78197, -172839, -156039, -121390, -117950, -82857, -45261, -88818, -42928, 10697, 21841, -47325, -89586, -94780, -35220, 3804, 19411, 30766, -38047, -115482, -119427, -54569, -60337, -26292, -42163, -58780, -3365, 7516, -55695, -68118, -49241, -33723, -35225, 5793, 6418, 3941, 9671, -40281, -5049, 23316, 16456, 62408, 59582, 55998, 2383, -29833, -38148, -69329, 486, 72857, 67271, 37163, 29283, 45495, 36503, 70544, 69359, 46313]
4866D6313k0735p363q4019j2229M1421l8661l6433M1712L9795k9946N1683R258
4854G96r842j4591l6279j5578L1525J1814K1112M1651K4945k7609m0818K9423
4842A6549m011j4008j3072N0824K0154M4244k441q8454m7019M1900K5873K5734
4830E6273K4975M122o6952l7411J6493M0309J8676k1162k9705L1754K6290J1403
4818G5065j0121o0021L4677N5732O306k3484q4835o7825r295J7963j8061l4876
4806a18775J9587K4406K6133l794l6678N2079N6990J3882l993p413L4667p0445
4794a3354j4685J4647J8818K5172j9897J955J8870K0402R121n2936K6498j2658
4782B1953j6840L6204K9810n1371p2858k4754N7641k4644J0421L9602k2179k3804
$$ y = [46313, 25578, 18215, -65804, -78033, -36612, -75273, -111706, -69994, -30199, -60145, -8462, 796, -9046, -23637, -59916, -75494, -43969, -32155, -11043, 30608, 55553, 27944, -12874, 16549, 12538, -1470, -14542, 36282, 56436, 100680, 98239, 9785, -37234, 4666, 30539, 56273, 81248, 85370, 18418, -18993, -2500, 37809, 56485, 35323, 5618, 37372, 63662, 75065, 64944, 4923, 39600, 95332, 101638, 78154, -6681, -74506, -83801, -65838, -83899, -118775, -99188, -74782, -48649, -52443, -89121, -37042, 19948, 33830, 29837, 22424, 57091, -13354, -28039, -13392, 5426, 30598, 10701, 12656, 31526, 51928, 61049, 8113, 34611, 21953, 5113, 41317, 71127, 19756, -53102, -77856, -20215, -44859, -34438, 5164, -17015, -40819]
4770d0819l8970J5156M4917O202j2355L6536N8988n5507L8200j6597N882j24m8686
4757g177L3413J4239l2519J2377K4809q6336p1013L7074P5763J6089K728R491
4745B8938l9744m6055k5688P621k5764J623K5879J2741N9373L9706l2291J3581
4733A9920L4059J0759l4375j1175p941J4244k8797o6739R279M8065j4051m3015
4721f9767r810Q859K8131N2901N7492N5308k1118n9392R215j479k3123j0213l0333
4708a3329N026R957K2330j2676j5615O572l591j8689N616J421J9745K7164L1342
4695F5273k9340j0609l6963m2556K6272J0597J3074K0979l225l8954J2986M0269
4683B7803L8389J6289l3517n2214p3236k083K8300J8677m9809l3306N224O1993
$$ y = [-40819, -79789, -64633, -19716, -13514, -25869, 10667, 69655, 14148, 52348, 35751, 41633, 41509, -7177, 26236, 40475, 7956, 20333, 45142, -41194, -112207, -75133, 630, 16719, 19447, 28938, -10806, -56861, -82549, -74928, -100692, -99069, -73190, -60449, -1076, 38630, 6339, 19920, 53979, 64738, 30363, 19188, 11247, 25491, -3306, -70045, -60766, -12701, -26752, -69767, -79577, -70718, -42587, 10314, 67806, 123114, 101996, 42604, 51819, 50340, 27217, 17004, -13329, -8303, 1654, 23984, 11308, -4307, 2265, -1326, -20015, -14399, -12978, 6767, 33931, 65273, 35933, 25324, -11639, -54195, -27923, -17326, -4252, 16727, 13502, -25452, -12466, 27803, 66192, 82481, 48964, -3250, -76486, -78569, -50269, -31592, -81401, -114707, -109483, -47490]
4671d7490O2989r584L500K0735j0171j438k9532n7092k6512J2937M5146L2171
4659d341L0164N497l7117j6149Q627J5560K3328J5209K1915K4387k9642k2060
4647C5378j096j2998n4858k0422L9274R4491k7346o2341k0543k487K9191N8033
4635E4276J948o9060J199P287K584l913P5608M4009K3258p6464m9007L1678J2880
4622E6283L863K0325k139l3929k3736M149l2310l1039N0708L9524l2997j3366
4610E336n0830O445l606M6948K8398j3354L9955M4902n0197j694l2999m0947K687
4597a8956K746L1299M319m0430p7117p9043K254K6627p295L8376L4682m8296k4669
4584a55503M2812L0024m4293N1402O9400l1188L083k4596k6616r633o944N0377
$$ y = [-47490, 15499, 5915, 9415, 30150, 19979, 18541, -10991, -68083, -94595, -81658, -36512, -4341, 25823, 31320, -5797, -21946, -13319, 2241, 25569, 40778, 62693, 87080, 57438, 35378, 34282, 21284, -33574, -53996, -14722, 79769, 52423, -9918, -30461, -32948, -3757, 54276, 56224, -12836, -11637, -4350, -1766, -5679, 69929, 113938, 137196, 60732, 11725, 43403, 56283, 60146, 80471, 78332, 44403, 20667, 24816, -7494, -38533, 12175, 51699, 18702, 5336, -45494, -39049, -42655, 4293, 32691, 19337, 59292, 104194, 53997, 52303, 19304, -21643, -18956, -16210, 15089, 19408, -21022, -98139, -177182, -174928, -148301, -155596, -117220, -82538, -130834, -155503, -112691, -82667, -126960, -75558, -6158, -37346, -34263, -58859, -85475, -95108, -102052, -51675]
4572e1675L3966k8098J3494M020l6192N8610L3940O044r899j5488j6465k1769
4560b9512Q7902k9020k345p554J7615Q0528M6230j8241l9659o8017l6180K6702
4548B8449J722k7490J4079k2551l4598j7515P0360J8517l8802L302K61k2841O698
4535b0409l6440J5538N4548m3666r4234J5584P2529j4112j7917J4871J3672n460
4523d5496M5998J7243L8838l4542m9402K4987L8831k7886o1722m0135j5652N9501
4511d9437O4383M6746j4263m4711j2688r589K2340K600L6412K1665N493j8476
4499E0475k440n005o3279q6592j3765N172O3517l9034m5048J4699M6375L9217
4487c5708j194O0189J9342l9733l3911N055O2334N7162k0197m9260N532K434n6744
$$ y = [-51675, -17709, -45807, -32313, -28293, -64485, -5875, 28065, 34109, 24210, 8722, -7743, -29512, 58390, 29370, 27025, 19471, 37086, 117614, 163844, 145603, 105944, 37927, 1747, 28449, 30171, 2681, 16760, -5791, -40389, -57904, 12456, 30973, -7829, -4527, -4266, -27107, -20409, -56849, -41311, 13237, -30429, -124663, -109079, -36550, -50662, -68579, -53708, -40036, -45496, 502, 17745, 56583, 22041, -27361, -2374, 36457, 8571, -53151, -93286, -108938, -49437, 14946, 61692, 47429, 2718, -9970, -19559, 2781, 5381, 41793, 63458, 68951, 50475, 48035, 43030, -20249, -106841, -120606, -115434, -51917, -90951, -135999, -121300, -74925, -35708, -36902, 23287, 42629, 2896, -31015, -25960, 36374, 93536, 73339, 24079, 29611, 32045, -24699]
4474b4699k4194L030L0294M7099K2910p3029k6691K7193j8924j0143J6610M1726
4462A1182K7282k6255j6660j9442M4504n769J9555j3100k1344M1080L7028j3302
4450F4759o5495k4609L8394K4922k5959k2613j9090l2269J141j6392j2886J4299
4438g5798K6138J7109L5480p4318J1873K8158N1981L2270j18933K630M1956K3911
4426B457N0153l9588l8713J2246l4654j9126p157J7199J6663J5278K6297r2436
4414i1381k6214Q844l0774J8257J00462L2591k2222p3919q7275j1459O8871O2944
4402e1275O4407J8116K2880O0240J1112q0549q7054M8642k5952k3061J3216l3197
4390f2475K3330J8270j162k755k1253j5981J0796L810M8186p713j7856J1190K6830
$$ y = [-24699, -48893, -45863, -15569, 31530, 54440, -18589, -45280, -18087, -37011, -47154, -30544, 11182, 38464, 12209, -4451, -23893, 20611, 14842, 34397, 21297, -47, 41033, 78061, 64759, -736, -25345, 13049, 37971, 12012, -10601, -29691, -61960, -60819, -77211, -90097, -75798, -49660, -32551, 2929, -71389, -59516, -31358, 20623, 52893, -66040, -63410, -21454, 2457, 52610, 13022, -25691, -13445, -48099, -67225, -74382, -57183, -40520, -25242, 1055, -91381, -117595, -108751, -139525, -121268, -20806, 11785, -10437, -84356, -171631, -183090, -114219, -51275, 13132, 31248, 54128, 114368, 125480, 44931, -42123, 6519, -19433, -42494, -29278, -62475, -39145, -20875, -22037, -24792, -46045, -62026, -51230, -47420, 766, -6947, -24803, -13613, 13217]
4377A3217n4098l3054j6696j1424p673M7001M0124j4786O069P8430K3915o4576
4365F449k5265m666p1954m6867M213O3759N5084L4307O073j7392j8089R020P3050
4352F7722J300l1120J341n3143q5716o2786J5904O0608M8147P4457K3034N4668
4340A14416j0660n880k777l181J1162q748q1414n1302k8377l6931j4632K4605
4328i3719N9042l710j2866N6541J5795M480k3465O0853R710m1318k1122n4971
4316d4750q7396l2767l637O0214J11126K1722j8252m321l7648o826P6975J01k5088
4303I453M4426L8266m9427o8589r249M3698M2104p686k3125P272o3935k2913K3815
4290c5890J7484m9090k5047p01L6873M4684J8963J0950k1153J2120M804J1404
$$ y = [13217, -40881, -73935, -90631, -102055, -109728, -62727, -22603, -37389, -31320, 47110, 71025, 6449, -18816, -23482, -95436, -142303, -138090, -74331, -19247, 15060, 21133, 3741, -14348, -5328, 67722, 69022, 37902, 39243, -13900, -99616, -162402, -146498, -85890, -37743, 36714, 59748, 114416, 103756, 97876, 95099, 91918, 103080, 94332, 12918, -38384, -66761, -103692, -118324, -93719, -34677, -38387, -51253, 5288, 21083, 25563, 2098, 62951, 72661, 31343, 10221, -44750, -132146, -164913, -168550, -108336, 2790, 24512, 6260, 1939, -35709, -42535, 34440, 34541, 9453, 53879, 92145, 42718, -25871, -35120, 8578, 50682, 42996, 19871, 27143, -36792, -59705, -35890, -18406, -67496, -92543, -93244, -56371, -11687, 7276, 18226, -2927, 9193, 13997, 25401]
4278B5401K4424j7746p4898j8157P4478O7003p383K8359p897j6794R47R078k2212
4265F4603l265l5365q986R194q41m1490l5115J5097O7327K8207l7883m211n894
4252A1378L0233j2763q931J4100j7962j3911l6945n6227J1848K7653O75j5639
4240f6491L5990l0738p913P4078J3945m7064K8448M1994J7651K4837P797Q135
4228A00669j2519n5012p210P652K6367j1204o5602K6313o4621K325M3452q496
4216a7886k7837j575j4591k3241r195P2774L2615O327k0002l5094K27j2977K0534
4203b9921m800j9897o298M4842N4049k8621J1581n049J046r655m7937L3418N1620
4190D4378l092K2181k0509l9188k0944N708j8977R871L9202N057k392K5879P695
$$ y = [25401, 49825, 32079, -42819, -60976, 13502, 80505, 73122, 101481, 93584, 76790, 77737, 86815, 64603, 61338, 25973, 16987, 26181, 25340, -16150, -51265, -36168, 31159, 59366, 21483, 17272, 11378, 41611, 28848, 19917, 34017, 16055, 2144, -34801, -91028, -79180, -51527, -50852, -66491, -30501, -61239, -69152, 4926, 18871, -28193, 255, 42249, 59900, 84737, 92534, 100669, 88150, 33138, 25928, 33580, 59947, 48743, -16859, 9454, -55167, -52842, -9390, -17886, -45723, -47298, -61889, -85130, -94325, -21551, 11064, 17391, -2611, -37705, -37478, -50455, -29921, -34721, -54618, -60916, -16074, 37975, 9354, 20935, 15886, 16932, 7277, -40660, -7242, 44378, 41286, 63467, 42958, 3770, -17174, -11466, -30443, -20572, 18630, 23687, 21295, 47174, 54869]
4177E4869O745j8821K0423p231l7100o4707L4494N3102J356l501P59L444o5272
4164b1440j0355O2421J9189M050q352K5997p749n5840K936j5124M138k519o1036
4151f3684K2867J400l5371K2474L4605j1155q970M5698j2173K6661K3665j5954
4139C0063j06459o1554K0949N1533l0579L13N4196K6115L5334J1817p745j9982
4127D001K3265O7757K4833Q756K8822m0711j5512j07234l2832K8916k9624J5217
4115b4346N1436R416j4115k9313k2101r973J9291K0785O2042M0931J3740L5476
4103A53269L986q8991p2691k5490L141K1804K9842M5171l6938M1652o142k2064
4091D6549o391P846K3100l8567J4088j7555j0354R432l0167m8863k7608M1993
$$ y = [54869, 61614, 42793, 63216, 55985, 18885, -45822, -11328, 41774, 43130, 39629, 40388, 43832, -21440, -31795, 30626, 49815, 53865, 45513, 71510, 63761, 7921, 10857, -4267, -129, -2648, -63684, -40817, -39417, -74788, -52314, -17709, -28864, -37834, 7864, -4309, 22352, 46017, 30063, -76396, -137950, -117001, -65468, -96047, -95734, -41538, -15423, 19911, 31728, 23983, 4001, 27266, 95023, 119856, 128612, 157434, 116723, 101211, -6023, -38855, -9939, -39563, -24346, 27090, 36506, 22391, -6922, -29023, -38996, -19705, 1080, 63122, 104053, 117793, 153269, 157255, 68264, -4427, -29917, -26776, -4972, 24870, 70041, 33103, 74755, 68613, 46549, 40158, 48004, 71104, 32537, 46625, 29070, 18716, 28148, -2019, -50882, -78490, -36497]
4079c6497N8727o045k2554j1095J8539J4289n9548l2913J1568L2652J9196K2985
4067I304j8095k7927k1537j9850J2342P461J417P0101n991J2666q011o389J7725
4054B3216j8642l7450j2358L848L9830n897N7229j5842p4352L84N1778M3921k8657
4041B7008Q28j4991l0934j6280k851M2420K8764K9393J0547K5787k6037o136j9308
4028D8210p0343k5553J4429O326j1396o978O9940j7093k6365L500l1650k416K2323
4015b7066k0202L3994M673J2430K9876j3840l7724m6187j0936l2639K1519K0234
4003f5868L9883j0428L5243j7497J4261p2336L3156O1086M0215l1987k5197K2056
3991B2587K204j4268j0076l1048J6617K1290Q619j3265M7478M6887m3796j8689
$$ y = [-36497, 22230, 16185, -6369, -17464, 1075, 15364, -44184, -77097, -65529, -32877, -13681, 9304, -8791, -36718, -58255, -78105, -65763, -58302, -56885, 13216, 7225, 19891, 11880, 5491, 23216, 4574, -32876, -45234, -41386, -1556, -7453, 49776, 33934, -40418, -40034, 11744, 55665, 27008, 27836, 12845, -18089, -34369, -37220, 5200, 33964, 63357, 73904, 99691, 73654, 67518, 48210, -22133, -47686, -33257, -26931, -38327, -45305, 24635, 7542, -18823, -15323, -46973, -49389, -27066, -47268, -13274, -8601, 3829, 33705, 19865, -17859, -64046, -74982, -107621, -86102, -65868, -25985, -36413, -1170, -18667, -4406, -76742, -43586, 17500, 57715, 25728, 531, 22587, 24791, 10523, 447, -30601, -13984, 7306, 15925, 2660, 50138, 97025, 53229, 34540]
3979C4540j9078M090K5262k3134m309j3404l1015j4681j6875n2290J8381O894
3967h5619K6398K4901M1551k1255K666R721N5115P189m1407o1653m396J1211O9719
3954C4141J0256o4051l7200J7061L0507K5349p270M673r3L7828L0774j2762j6754
3941E2459m7469k7341r713K3383J3731K0726o1329j7110N9294m093j5416n50n3703
3928f7131K2409j570k375q188l2153j4162j2561p012K4012O3717L3198K7428j9870
3915E742k8459j6181o648M8372m0077k496K5854K0497j243k3282L83k0922J6371
3902b2089L0995r43Q429J3129j7540N3310J0243k8113k4415k5623n3998j3857
3890g0472L8548m64j2077M1935l0709r266p146k0168K5879k5352O7499J4166j8827
$$ y = [34540, 15462, 19552, 44814, 21680, 17371, 3967, -27048, -41729, -58604, -110894, -92513, -85619, -59221, -34320, 7231, -14024, -11358, -1637, 53478, 60667, 19260, -42393, -46789, -35578, 34141, 44397, -19654, -56854, -39793, -9286, 16063, 8793, 13466, 13373, 51201, 81975, 69213, 52459, 4990, -22351, -32064, -8681, 5050, 25776, -35553, -52663, 6631, 2538, -12878, -13428, -67131, -44722, -46292, -48667, -56855, -89008, -103170, -115731, -122743, -98731, -35014, -1816, 25612, 5742, -22717, -38898, -45546, 2826, -37251, -39747, -13893, 6604, 5361, -17921, -17538, -38460, -22089, 8906, 7963, 16392, 29521, 11981, 65291, 75534, 47421, 23006, -2617, -56615, -70472, -31924, -32388, -44465, -2530, -33239, -42505, -49651, -69819, -43940, -69292, -1793, 12373, -6454]
3877f454K829j3742J2235J0120J1576m8244J3084k8016M515O031K6974J0669M630
3864F207L8776K8122n908J6610k2501O007K6133l9526j9186m0560R080m0421J2416
3851b4751Q0558n6951k9100j600J2038P379j4231l7102k260K9308J1585J9834
3839e293o918L6518l6323p2878m105j4533M8626N5199o836Q159M2372L2508l7681
3826C8815k1916M3991l0017k3593J390m7516K0094P0172M1334j2901k9510J8009
3814F8352K7823m1422p8142M1305J5516k0171M8823J9788l2449K8442L5497n3129
3802F0233o6603j4423Q8853L4681O044j4085m6044k3340k7963J8723l8048O58
3790b1314l8003K705R988O6053J1305j4486l9529l833N1262L383L7953l1796q0835
$$ y = [-6454, -3625, -17367, -5132, 4988, 16564, -31680, -18596, -46612, -42097, -36066, -9092, 1577, 6207, 44983, 73105, 67197, 83807, 61306, 67313, 93446, 53920, 34734, -5826, 3254, -37167, -24751, 55807, -1144, -30244, -31844, -19806, -12427, -26658, -63760, -66020, -36712, -25127, -5293, -12211, 24307, -12016, -84894, -88999, -103532, -54906, 293, -6543, 1616, 43988, 76496, 38815, 16899, 60890, 30873, 7280, 8670, -38846, -18752, 51420, 92754, 79853, 50343, 68352, 96175, 54753, -23389, 17916, 33432, 13261, 62084, 81872, 49423, 77865, 113362, 60233, -6370, -20793, 68060, 102741, 108785, 94700, 48656, 25316, -2647, 16076, -21972, -21314, -59317, -56612, -46624, 19429, 30734, 16248, -23281, -27114, 24148, 27531, 65484, 33688, -47147]
3777d7147m6698n627M3153J9124K1666K1630j0078o4870m7853Q2660O9392K3202
3765E8554K0286l1167n1596J2540L3488M0941l6311k0940k209q311K1734R6409
3753A33418N864r7611n0249k0818j1930k870m7661q307K1351o101J90P759L8253
3740c8712L8462l4651k659N9924K4327n7613q401j8112k1498l7802j2147K5334
3728h3548o998j5063L4227M6608k325j9552n1219M7904M7078o869K7078k3260
3716e939l2961J9703O344n542o2577j5483K2496P4011M7541j1115l6171r159Q815
3703c7J639j5075N2234R176l3569n6932L5425M7316l8020r42l3303j0054Q4206
3690D2064N0731l7825l8822N294K2343k8417m6934K8418k0888m6114J4411J9719
$$ y = [-47147, -93845, -99472, -56319, -37195, -15529, 6101, -3977, -68847, -116700, -34040, 35352, 58554, 78840, 47673, -3923, 8617, 42105, 83046, 46735, 25795, 23586, 15275, 37009, 133418, 139282, 41671, -8578, -29396, -41326, -44196, -91857, -100164, -78813, -84914, -84724, -76965, -38712, -250, -34901, -37560, 22364, 46691, -10922, -19323, -37435, -58933, -96735, -108882, -83548, -90546, -105609, -71382, -24774, -27099, -46651, -97870, -49966, -2888, -9757, 17321, -5939, -38900, -19197, -12853, -18395, -80972, -96455, -73959, 52, 47593, 36478, 307, -8852, -37, 1602, -13473, 38761, 47937, 14368, -42564, -7139, 40177, 2157, 1215, -32088, -42142, 42064, 92795, 54970, 16148, 21442, 43785, 15368, -31566, -3148, -24036, -70150, -55739, -36020]
3678c6020l539J8363L3554J8106R181k9822k1172K5901j4914K2834k220m2401
3666b2149J9277N3183K6492k4035l4308l2579J1900L5270o336m9534M7527l333
3654B1375N74L6775M4100n400m9773j23525k2048J2811K5703P0157L7410j6561
3642C1598K6612l2546l0146L37N5K3672O412l4975N06N769M62L1376k1043m8287
3628d0198J4649N1184J6970O4J6272m6555k7723j926Q950j727J7717q996M3903
3615D2584l1676j1813J7869N365L5385o3257o0578M2596J3237m1489l7286N3887
3603c5176N8709K2095k7719k6639l2750k3902k706O0772O1806l2756m8468l9336
3591f6070L2054O8143k0151K2214p438j7635j7102m0309K213P6951L1567k9889
$$ y = [-36020, -39559, -21196, 12358, 30464, 39645, 9823, -11349, 14552, -362, 22472, 20252, -22149, -2872, 50311, 76803, 52768, 18460, -14119, -2219, 33051, 26715, -22819, 24708, 21375, 21949, 58724, 102824, 97424, 47651, -75874, -97922, -85111, -59408, 10749, 48159, 31598, 58210, 25664, -4482, -4145, -4090, 19582, 25994, -8981, -8475, -2706, -2244, 29132, 8089, -40198, -25549, 25635, 42605, 42669, 58941, 12386, -15337, -17263, -8313, -10040, 7677, -1319, 42584, 10908, -905, 16964, 22329, 57714, -5543, -66121, -23525, -10288, -51777, -89063, -35176, 23533, 45628, 17909, -8730, -41480, -65382, -68088, -7316, 54490, 21734, -26734, -66070, -34016, 34127, 13976, 36190, 28752, 11117, -5985, -46294, -44081, 32870, 64437, 34548]
3579C4548K0649j4210k9261k1984J2770K7660M0580k7538k5950l5351o784k4413
3567d9284M0982j0711n2536j6854k8568l9683N4771R3283O1369n7227p2139J7267
3555e9330j3638j4865o39m876J8249J8986L651L0294N1217j7258n3128Q363K7377
3542e597Q078k9680k8661L2882L1696K7813q344k8550P581N979j4142k0155k1858
3529d2958R859M4596M1382n0180j076L2726J0838J0121k887J2648J0986J66j8199
3516E8022k5734P962j6470k33l0485N1026j213j8714q575L1720M2093K1838k8448
3503H2789j00283J382M3056j7898J8081m9893L8375n7065j7268M0341M257M457
3491i669r470n4719l0285J3098M8613K7992K3826L7479n9977P392J8438k016L9230
$$ y = [34548, 55197, 40987, 11726, -10258, 2512, 30172, 70752, 43214, 17264, -18087, -24871, -49284, -8302, -19013, -71549, -88403, -116971, -156654, -101883, -8600, 52769, -4458, -76597, -59330, -72968, -87833, -88472, -93348, -75099, -56113, -52462, -22168, 29049, 11791, -41337, -32974, -5597, 2481, -27199, -55860, -22978, 8718, 36531, 28187, -363, 7218, 13197, -945, -21100, -42958, -33099, 11497, 52879, 2699, 1623, 34349, 45187, 55308, 52421, 65069, 76055, 76221, 58022, 32288, 40250, 23780, 23547, -6938, 44088, 42875, 24161, 15586, 47306, 89399, 111237, 82789, -17494, -16112, 26944, 9046, 27127, -22766, 15609, -41456, -58724, -18383, -14126, -9669, -19139, -73858, -104143, -91045, -42432, -14440, 9386, 46865, -13112, -5720, 12718, 10702, 49932]
3478D9932o100J3980m48n4722R856m138P356k8236j8836M0767P7764k477m2976
3465D1722l3132k2294k4333k5925J1026m2792L2910R0396J4599J3821q103j5572
3453C2323m3779n1597r931L2188q528K0251K2088M852j4405j967j779o675L1597
3440D638N5543J7522j8560o1420J3052O7964R568l6758o7702r0714J2721O7320
3428b6826P4165R133J8582M2463j0934K2965p998n5694n8241l3264J702L9173
3416A5226N529J6187O1436K0567o6496l7910m8439n885M6977L8855J3191p148
3404E2090Q346L6211l209l1335m362k5381K312K296j0527n8796j1472k6991M5208
$$ y = [49932, 43832, 57812, 57364, 2642, 12498, 8360, 15716, -12520, -31356, 9411, 87175, 84698, 41722, 8590, -13704, -38037, -63962, -52936, -95728, -62818, 27578, 42177, 55998, 47895, 32323, -11456, -63053, -72984, -40796, -49324, -29073, -6985, -2133, -16538, -18505, -20284, -26959, 4638, 60181, 77703, 59143, -2277, 10775, 78739, 88307, 51549, -16153, -106867, -94146, -26826, 47339, 56472, 75054, 117517, 106583, 129548, 121550, 65856, 7615, -25649, -23947, 15226, 20755, 36942, 98378, 118945, 52449, 14539, -33900, -39785, 7192, 46047, 59238, 52090, 60436, 96647, 93438, 62103, 57741, 32360, 34672, 36968, 26441, -32355, -43827, -70818, -25610]
$$ [...]
##END NTUPLES=NMR SPECTRUM
##END=
