##TITLE=Analysis number 321204
Compound Code cc 42204
Book Reference 458/176
Project Code adrs
Chemist Name stevem
##JCAMPDX= 6.0         $$ Bruker NMR JCAMP-DX V2.0
##DATA TYPE= NMR SPECTRUM
##DATA CLASS= NTUPLES
##ORIGIN= Bruker BioSpin GmbH
##OWNER= nmr
$$ XWIN-NMR		Version 3.5
$$ Thu Jul 27 13:30:54 2006 GMT Daylight Time (UT+1h)  MAYBRIDGE\nmr@NMR_250MHZ
##.OBSERVE FREQUENCY= 250.131544655141
##.OBSERVE NUCLEUS= ^1H
##.ACQUISITION MODE= SIMULTANEOUS (DQD)
##.ACQUISITION SCHEME= undefined
##.AVERAGES= 16
##.DIGITISER RES= 18
##SPECTROMETER/DATA SYSTEM= dpx250
##.PULSE SEQUENCE= zg30
##.SOLVENT NAME= CDCl3
##.SHIFT REFERENCE= (INTERNAL, CDCl3, 0, 16.522)
##AUDIT TRAIL= $$ (NUMBER, WHEN, WHO, WHERE, WHAT)
$$ ##TITLE= Audit trail, XWIN-NMR		Version 3.5
$$ ##JCAMPDX= 5.01
$$ ##ORIGIN= Bruker BioSpin GmbH
$$ ##OWNER= nmr
$$ C:\u/data/dgb/nmr/ADRS/3770/pdata/1/auditp.txt
$$ ##AUDIT TRAIL=  $$ (NUMBER, WHEN, WHO, WHERE, WHAT)
(   1,<2006-07-27 13:30:28.74 +100>,<MAYBRIDGE\nmr>,<NMR_250MHZ>,
      <created by zg, POWCHK disabled, PULCHK disabled
       configuration hash MD5:
       E2 DF 36 D8 04 B2 41 60 5A D7 A3 38 5A 4B D0 FE
       data hash MD5: 64K
       BB C6 D2 4E 04 43 0B E7 7A 63 26 FC 75 2C A0 F6>)
(   2,<2006-07-27 13:30:45.19 +100>,<MAYBRIDGE\nmr>,<NMR_250MHZ>,
      <Start of raw data processing
       ef LB = 0.3 FT_mod = 6 PKNL = 1 SI = 32K 
       data hash MD5: 32K
       9C 65 5D 27 8E F7 26 CB A6 76 C1 F3 E4 DA 3C 3D>)
(   3,<2006-07-27 13:30:46.75 +100>,<MAYBRIDGE\nmr>,<NMR_250MHZ>,
      <apk 
       data hash MD5: 32K
       8F 8C 6F 94 22 35 74 C9 30 6D 2A D7 86 07 F4 0B>)
(   4,<2006-07-27 13:30:47.57 +100>,<MAYBRIDGE\nmr>,<NMR_250MHZ>,
      <abs ABSG = 5 
       data hash MD5: 32K
       E5 C0 11 A8 C4 00 CA 5E E7 9B 1B 0B 96 C6 A2 03>)
$$ ##END=
$$ 
$$ hash MD5
$$ B0 DC 9C 21 02 AA 3E 25 03 67 F1 15 DC F5 EB A0
##$RELAX= 
##$RELAX= 
##$RELAX= 
##$RELAX= 
##$RELAX= 
##$RELAX= 
##$RELAX= 
$$ Bruker specific parameters
$$ --------------------------
##$DU= <C:\u>
##$EXPNO= 3770
##$NAME= <ADRS>
##$PROCNO= 1
##$TYPE= <nmr>
##$USER= <dgb>
##$AMP= (0..31)
100 100 100 100 100 100 100 100 100 100 100 100 100 100 100 100 100 100 
100 100 100 100 100 100 100 100 100 100 100 100 100 100 
##$AQSEQ= 0
##$AQ_mod= 3
##$AUNM= <au_zg>
##$AUTOPOS= <35 >
##$BF1= 250.13
##$BF2= 250.13
##$BF3= 250.13
##$BF4= 250.13
##$BF5= 500.13
##$BF6= 500.13
##$BF7= 500.13
##$BF8= 500.13
##$BYTORDA= 1
##$CFDGTYP= 0
##$CFRGTYP= 5
##$CHEMSTR= <none>
##$CNST= (0..31)
1 1 145 1 1 1 1 1 1 1 1 1 1 1 1 1 1 1 1 1 1 1 1 1 1 1 1 1 1 1 1 1 
##$CPDPRG= <>
##$CPDPRG1= <>
##$CPDPRG2= <>
##$CPDPRG3= <>
##$CPDPRG4= <mlev>
##$CPDPRG5= <mlev>
##$CPDPRG6= <mlev>
##$CPDPRG7= <mlev>
##$CPDPRG8= <mlev>
##$CPDPRGB= <>
##$CPDPRGT= <>
##$D= (0..31)
0 1 0 0 0 0 0 0 0 0.06 0 0 0 0 0 0 0.0002 0 0 0 0 0 0 0 0 0 0 0 0 0 0 
0 
##$DATE= 1154003426
##$DBL= (0..7)
120 120 120 120 120 120 120 120 
##$DBP= (0..7)
150 150 150 150 150 150 150 150 
##$DBP07= 0
##$DBPNAM0= <>
##$DBPNAM1= <>
$$ [...]
##$SUBNAM7= <"">
##$SUBNAM8= <"">
##$SUBNAM9= <"">
##$SW= 20.6930455092707
##$SWIBOX= (0..15)
0 0 3 0 0 0 0 0 0 0 0 0 0 0 0 0 
##$SW_h= 5175.983436853
##$TD= 65536
##$TD0= 1
##$TE= 295.16
##$TE2= 300
##$TE3= 300
##$TEG= 300
##$TL= (0..7)
0 120 120 120 120 120 120 120 
##$TP= (0..7)
150 150 150 150 150 150 150 150 
##$TP07= 0
##$TPNAME0= <>
##$TPNAME1= <>
##$TPNAME2= <>
##$TPNAME3= <>
##$TPNAME4= <>
##$TPNAME5= <>
##$TPNAME6= <>
##$TPNAME7= <>
##$TPOAL= (0..7)
0.5 0.5 0.5 0.5 0.5 0.5 0.5 0.5 
##$TPOFFS= (0..7)
0 0 0 0 0 0 0 0 
##$TUNHIN= 0
##$TUNHOUT= 0
##$TUNXOUT= 0
##$USERA1= <user>
##$USERA2= <user>
##$USERA3= <user>
##$USERA4= <user>
##$USERA5= <user>
##$V9= 5
##$VALIST= <valist>
##$VCLIST= <CCCCCCCCCCCCCCC>
##$VD= 0
##$VDLIST= <DDDDDDDDDDDDDDD>
##$VPLIST= <PPPPPPPPPPPPPPP>
##$VTLIST= <TTTTTTTTTTTTTTT>
##$WBST= 1024
##$WBSW= 4
##$XGAIN= (0..3)
0 0 0 0 
##$XL= 0
##$YL= 0
##$YMAX_a= 326383
##$YMIN_a= -437959
##$ZGOPTNS= <>
##$ZL1= 120
##$ZL2= 120
##$ZL3= 120
##$ZL4= 120
##$ABSF1= 16.522
##$ABSF2= -4.171173
##$ABSG= 5
##$ABSL= 3
##$ALPHA= 0
##$AQORDER= 0
##$ASSFAC= 0
##$ASSFACI= 0
##$ASSFACX= 0
##$ASSWID= 0
##$AUNMP= <proc_1d>
##$AZFE= 0.1
##$AZFW= 0.1
##$BCFW= 0
##$BC_mod= 0
##$BYTORDP= 0
##$COROFFS= 0
##$CY= 12.5
##$DATMOD= 1
##$DC= 0
##$DFILT= <>
##$DTYPP= 0
##$F1P= 14.0000005364418
##$F2P= -0.99999901652339
##$FCOR= 0.5
##$FTSIZE= 32768
##$FT_mod= 6
##$GAMMA= 0
##$GB= 0
##$INTBC= 1
##$INTSCL= 1
##$ISEN= 128
##$LB= 0.3
##$LEV0= 0
##$LPBIN= 0
##$MAXI= 10000
##$MC2= 0
##$MEAN= 0
##$ME_mod= 0
##$MI= 0
##$NCOEF= 0
##$NC_proc= -4
##$NLEV= 6
##$NOISF1= 0
##$NOISF2= 0
##$NSP= 0
##$NTH_PI= 0
##$NZP= 0
##$OFFSET= 16.522
##$PC= 1
##$PHC0= 170.5182
##$PHC1= 1.172108
##$PH_mod= 1
##$PKNL= yes
##$PPARMOD= 0
##$PSCAL= 4
##$PSIGN= 0
##$REVERSE= no
##$SF= 250.13
##$SI= 32768
##$SIGF1= 0
##$SIGF2= 0
##$SINO= 400
##$SIOLD= 32768
##$SREGLST= <1H.CDCl3>
##$SSB= 0
##$STSI= 32768
##$STSR= 0
##$SW_p= 5175.98343685301
##$SYMM= 0
##$S_DEV= 0
##$TDeff= 65536
##$TDoff= 0
##$TI= <Analysis number 999999
Compound Code 99
Book Reference 9
Project Code 9>
##$TILT= no
##$TM1= 0
##$TM2= 0
##$TOPLEV= 0
##$USERP1= <user>
##$USERP2= <user>
##$USERP3= <user>
##$USERP4= <user>
##$USERP5= <user>
##$WDW= 1
##$XDIM= 32768
##$YMAX_p= 313496300
##$YMIN_p= -341923
$$ End of Bruker specific parameters
$$ ---------------------------------
##NTUPLES= NMR SPECTRUM
##VAR_NAME=  FREQUENCY,     SPECTRUM/REAL,   SPECTRUM/IMAG
##SYMBOL=    X,             R,               I
##VAR_TYPE=  INDEPENDENT,   DEPENDENT,       DEPENDENT
##VAR_FORM=  AFFN,          ASDF,            ASDF
##VAR_DIM=   32768,         32768,           32768
##UNITS=     HZ,            ARBITRARY UNITS, ARBITRARY UNITS
##FACTOR=    0.157963299565203, 1,           1
##FIRST=     4132.6476996994, 0,             0
##LAST=      -1043.33573715361, 0,           0
##MIN=       -1043.33573715361, -341923,     0
##MAX=       4132.6476996994, 313496300,     0
$$ Real data points
##PAGE= N=1
##DATA TABLE= (X++(R..R)), XYDATA
$$ [...]
20614 26540 84312 77433 4207 7441 7081 40236 33760 -54161 -43044 28860 9597 -72304 -91433
20601 -91433 -2514 21016 -11609 -103947 -113843 -104936 -141244 -133260 -135916 -79429 -23908 -84335
20589 -84335 -116989 -171362 -155555 -66884 -52951 -25459 66385 126722 87971 78206 30580 -46049
20577 -46049 -26640 -18063 84043 81892 35794 -48135 -105502 -127820 -111522 -134839 -141042 -126669
20565 -126669 -144251 -80500 37343 69481 -28746 -80425 -82098 -42906 -77964 -133802 -196586
20554 -196586 -174759 -156472 -48485 77020 121688 49433 12208 -53491 -40719 -18722 51459
20543 51459 17270 -75223 -51348 -46031 7292 51618 9960 17020 46856 42585 27875 -41155
20531 -41155 -85175 -103359 -83741 -97325 -132480 -93153 -48921 26520 90861 109534 172573 192206
20519 192206 119348 119575 67697 51716 -607 -8147 -60296 -82605 -54018 -83744 -62004 2974
20507 2974 -15265 -50736 -39511 -29408 37214 110974 173245 104842 65047 63221 2274 -2462
20495 -2462 66854 83316 31505 -38072 15700 7101 -7654 30063 14940 65503 89504 71222
20483 71222 50359 863 -80576 -120572 -65803 -64081 56590 76887 30968 81019 116470 39189
20471 39189 -38530 -46572 34000 29932 17862 -20289 255 20867 -23689 -50753 45585 93125
20459 93125 72720 -12811 -135457 -125165 -105134 -118842 -122537 -91222 -99668 -82490 -16753 -10854
20447 -10854 3882 -39477 -71628 -22349 71341 79429 27334 33049 -27178 -112324 -112298 -96667 -98030
20434 -98030 -153761 -171315 -119185 -101572 -35346 1060 53302 101159 82694 -17944 -73451
20423 -73451 -18184 -16881 5783 15801 -3551 -47492 4967 -27474 -57712 -4184 -15988 -44785
20411 -44785 17249 67791 11541 -4352 -56813 35381 69928 54672 7707 34861 37361 57945
20399 57945 18052 94386 70320 70180 51164 31898 21549 -32537 -62684 -39117 -69428 -6133
20387 -6133 73789 82074 7223 81697 150464 129603 80128 30883 3087 1650 -34711 -20524
20375 -20524 28492 40865 94498 98364 80468 72049 93116 74639 83327 91646 62253 66945 -15649
20362 -15649 -99755 -101835 -70446 -12981 -937 18605 29203 54973 3489 -11497 13099 42347
20350 42347 6783 -49180 -46932 -23567 -64261 -34661 44438 2930 -19834 97095 197953
20339 197953 199931 188403 146431 143928 115406 145181 213853 120491 21075 -61121 -75875 -47006
20327 -47006 -23218 22451 -36056 -61358 -15384 41543 68086 76694 42367 23075 -26628 -80541
20315 -80541 -109284 -23013 12517 21741 -20538 -28196 -66419 -61091 14252 138383 164578 60054
20303 60054 -5033 4982 18968 39647 -35246 -38332 -42387 -81098 -76052 -61345 -90263 -91993
20291 -91993 -49516 -85427 -41756 -69572 -61253 -48555 -4311 52584 109975 100453 76526 72236
20279 72236 128839 111516 92592 70743 112338 134799 162213 130440 92065 64881 -77953
20268 -77953 -140849 -121856 -156002 -170948 -93402 -51154 -1528 -59213 -103841 -46849 -32370 -1392
20256 -1392 71126 132082 140100 -46125 -82101 -82549 -110211 -86842 -58118 -42141 -40192 -81613
20244 -81613 -59291 -14893 -16739 -45057 -53528 -46192 -51627 -9984 16220 124148 161970 32608
20232 32608 -10096 -81833 -23138 -29667 -62083 -66541 -175909 -153608 -21204 84980 154772
20221 154772 115906 38282 -76617 -75701 -24580 -70448 -81423 -41048 -75942 -2118 43401 76370
20209 76370 69255 106763 73679 -66919 -199563 -198111 -93074 -48219 -54904 -94651 -91707 -63763
20197 -63763 -12991 44181 -7335 -48332 4734 44857 39164 -514 -37287 -37602 -49482 -75574
20185 -75574 -100817 -18173 60139 70639 -56567 -113165 -41744 -21061 -21785 -21898 -29053 -20
20173 -20 -15476 -36550 66637 145103 180684 216252 209947 206712 101512 -4795 54894 115683
20161 115683 177130 204582 123452 75783 51891 -49443 -87641 38432 81958 34082 -41779
20150 -41779 -77357 -25233 -27657 -7699 32866 36255 29565 85456 127263 39118 -46287 -68281
20138 -68281 -48526 -71099 -130887 -80443 -47868 -38573 -62416 -114695 -82108 -92055 -43273 -46256
20126 -46256 -102584 -37900 -19598 -3797 -14169 -116648 -88029 -12587 6619 3098 128883
20115 128883 205377 76091 20840 -59679 -66850 -52035 -29183 54930 47919 6165 -41972 -59440
20103 -59440 -64809 -55021 31111 58176 57270 50260 41296 -34805 -104810 -64362 54167 53978 108898
20090 108898 173262 179239 176648 92257 41557 41288 -5305 -19380 33314 3659 -31056 -18038
20078 -18038 -47466 -33373 7268 25815 43720 23862 -46052 -69774 -14720 5556 30842 91837
20066 91837 28258 -32936 -50771 -69354 -74803 -93691 -111559 -102776 -20334 58286 5985 27168
20054 27168 49294 39404 -7389 64673 113682 141441 22283 -7188 24499 65145 22852 5860
20042 5860 28950 67809 26386 -58592 -88231 -204235 -179058 -124492 -112364 -105461 -47459 19335
20030 19335 26692 -61706 -60444 -72242 -26042 6219 -56911 -96818 -62431 -27034 -14982 -5946
20018 -5946 -22076 -28781 -168717 -188303 -129504 -92770 -24717 -57438 -85079 -133257 -80697 -28262
20006 -28262 46984 131340 115205 30406 -13617 -5869 59341 19428 -6003 14395 53657 51363
19994 51363 -46134 61116 173183 146847 143632 167236 195056 159874 120377 108838 46792
19983 46792 77733 108662 65033 40428 59964 37649 48514 60005 16460 -4183 -30785 -13583
19971 -13583 21504 -28435 -25788 32882 36517 4051 -28742 -71309 -51165 -80735 -52660 22799
19959 22799 -3517 -6331 33227 52918 -735 10225 -43359 -61906 5901 14417 73894 74727
19947 74727 29120 -49360 85442 129477 142988 104362 -5920 -52293 -48062 -77304 -77401 -68267
19935 -68267 21319 82821 20772 46571 103739 82081 37688 74850 47461 44517 38956 4813
19923 4813 -16856 12190 -42204 -137032 -134283 -121843 -61523 -24711 -66646 -61301 -90406 -113796
19911 -113796 -32261 13157 40198 157539 113095 5248 -67470 -93846 -56976 -49938 -42279
19900 -42279 5140 -6614 3908 7832 -71190 -119778 -46572 -3307 -70 14744 -47530 -2614
19888 -2614 -40203 -59044 -10667 3487 -27895 66196 211250 220855 73942 16713 67241 10781
19876 10781 -85613 -111605 -108825 -83930 -96190 -59403 11804 -31068 -77513 -52724 18217 58074
19864 58074 119779 179238 91274 83318 77556 73677 -26220 -101857 -116384 -110175 -95534 -76258
19852 -76258 -19601 85011 178716 227846 171583 72712 31474 16200 13001 -18551 -62988 -49834
19840 -49834 -19802 -42109 -44971 -125180 -134529 -182897 -179375 -31360 82406 62604 7597 36298
19828 36298 28362 -13919 -80820 -46616 -52967 -88999 -89330 -73328 1483 15429 -25852 -13062
19816 -13062 13091 50439 26278 -25154 -26534 -83940 -63563 -97365 -131702 -142371 -16797 20004
19804 20004 47323 40723 8296 -241 -4899 33839 -15323 -2177 47783 -5802 -28851 -31182
19792 -31182 -96674 -128509 -75225 57037 179436 79326 56723 90584 80844 96413 -56481
19781 -56481 -81486 -46976 42959 51101 137928 78447 -32499 -88968 -126235 -195207 -184115 -123034
19769 -123034 -80618 -110372 -114390 -19521 19362 27863 72520 67879 69841 -51446 -126271 -163375
19757 -163375 -166588 -146058 -111849 -87344 -27419 125445 116785 -36868 -21994 -14114 12787 24734
19745 24734 26610 21452 -20615 88609 146646 75454 109545 76371 73749 50204 82288 48450
19733 48450 -482 -44143 -14983 -155951 -225650 -158260 -92005 -67128 -83010 -62200 35669
19722 35669 106586 103097 109049 68900 73300 159638 146098 -3293 -26054 -28014 -15296 2417
19710 2417 -44353 -108126 -162744 -123922 -9782 93265 68285 -43920 -94950 -66052 -30205
19699 -30205 -43458 -1336 -19644 -60835 -144160 -158993 -96487 20131 -26734 -99538 -167013
19688 -167013 -150507 -54432 -51213 -64118 -143759 -102897 27683 93687 119113 67820 -22518
19677 -22518 -29173 -13654 -14639 -28413 -5536 -68605 -179750 -140210 -65016 27730 34264 38514
19665 38514 60720 13514 52305 35484 -84613 -103308 -39988 -21309 11741 43007 53987
19654 53987 49544 59910 62530 63159 65785 146254 70101 83125 102976 81140 -4386 -55481 -64256
19641 -64256 -11018 56568 91853 136270 131464 1786 -102382 -35387 41519 101981 56747
19630 56747 -40061 -27918 -11891 -111761 -104162 1436 -34573 -76593 -64528 -73547 -68884 -98887
19618 -98887 1181 80197 63927 31079 -31474 62234 167516 229879 236840 144102 133560
19607 133560 113324 20069 17938 56147 96869 99198 36722 -16966 -1583 -23053 -1934 58353
19595 58353 30877 56027 65381 57428 34219 19974 66896 112046 89504 54471 63102 56133
19583 56133 129346 60582 -17512 44577 50387 -2425 -8776 109464 165030 176193 137043 186087
19571 186087 210997 174017 166545 199357 195055 209506 244702 202023 155329 225395 201237 240931
19559 240931 306288 311877 324431 321318 268653 270938 316920 299177 234829 207614 196097 147345
19547 147345 168991 200103 239016 330457 244254 187265 273395 359908 353495 308102 287679 222522
19535 222522 217885 217244 195655 303099 381861 386556 342485 295304 259101 246559 215542 226833
19523 226833 253587 272854 234618 225668 247781 335577 373057 390714 342814 348512 349818 384496
19511 384496 438147 462540 444209 402844 319588 286288 362295 317860 193718 161506 170483
19500 170483 161158 133184 177052 184869 218088 199052 175912 241353 229714 163662 116039 142063
19488 142063 235690 222251 156435 93799 187489 191403 99225 100743 72465 32560 87088 193835
19476 193835 254805 285414 261926 261797 234003 285083 302809 273549 303587 236739 189084 172921
19464 172921 153716 119505 221767 149086 117054 191899 187920 208768 298506 279293 163775
19453 163775 4446 -66673 31248 188816 193327 129762 180852 200958 205533 152883 169609
19442 169609 222391 186243 180577 248695 278796 171932 66172 73604 73763 8680 -12610 -45808
19430 -45808 -18851 62801 129517 40442 77325 145529 135852 170307 197251 172468 106807 84659
19418 84659 124533 59256 31826 143258 90277 73893 131137 266052 339740 288247 267208
19407 267208 159512 167619 184016 155391 202180 196835 137031 100812 131270 119457 122909 116756
19395 116756 54462 69819 46005 67317 147008 222731 347968 364520 247291 127702 106439
19384 106439 124923 178001 115532 105999 99124 114423 145080 146723 117612 98483 98856 137304
19372 137304 49663 -78393 -5583 124290 177965 126229 205779 303343 253200 202272 274879
19361 274879 335246 286837 248851 284002 292040 291860 267841 228941 245577 213135 205975 254967
19349 254967 270019 281649 318690 290990 262320 268516 327166 270668 265655 318973 306955 297295
19337 297295 309955 294891 335522 421371 365534 398444 466802 536968 584698 592755 572058 539943
19325 539943 515728 494730 421026 382391 424755 422120 376599 369561 402577 341126 316746 427967
19313 427967 408754 346462 334144 302045 339305 403226 448131 476162 462837 392581 416227
19302 416227 413820 348115 334064 424344 492030 405538 417225 509738 521440 465534 463619 529625
19290 529625 493675 436869 431843 451627 472460 457133 466751 445080 475730 509556 549898 570699
19278 570699 506550 515163 544029 528855 466634 378084 287614 247046 202308 246688 322810 389497
19266 389497 335265 343169 280146 260195 322751 345008 296586 283753 258848 285190 242982 236719
19254 236719 242653 289619 253447 169141 145932 180268 217115 224567 230208 234991 235023 134700 111820
19241 111820 97622 78808 171604 178742 97672 78960 89769 292060 283229 245190 174241 200770
19229 200770 206555 232080 217358 300267 405822 459731 436913 401609 322349 226972 217344 229682
19217 229682 250415 196698 246271 247035 264957 251515 215677 190689 193547 201967 240537 233120
19205 233120 251281 245524 119879 74103 122822 203244 291522 335596 336762 374081 420341 424309
19193 424309 439713 352405 304461 281818 314164 299349 250362 217019 274938 389508 395432
19182 395432 424105 476246 449547 449900 407718 411728 398018 354586 350044 339428 300663 388319
19170 388319 404509 279027 215857 219330 276602 239233 199065 245223 240839 234923 314231 341633
19158 341633 324319 261063 266703 287449 323724 309239 256212 151965 201429 305168 365939
19147 365939 291307 253122 280575 308541 310437 275202 265142 176731 144790 210063 281960 300815
19135 300815 291698 276085 296830 239642 179337 241946 216610 223290 232825 289351 254050 245840
19123 245840 213401 177582 182866 331211 365739 291818 294771 370415 400698 381232 361476 362063
19111 362063 365482 305173 290139 355482 481914 404342 255124 298620 373482 427555 449852
19100 449852 447766 413317 530001 540870 475098 405811 432186 441921 472143 464617 473772 504041
19088 504041 480325 527339 598169 499422 505680 541647 510197 552601 673082 607974 548770
19077 548770 598888 665573 665561 677252 633585 598147 628610 644018 662570 674555 722381 749414
19065 749414 781974 745685 701121 795402 853432 876808 966406 926698 832498 835867 772291 753176
19053 753176 871168 925537 892401 871244 933596 851851 814786 834586 890786 904093 827298
19042 827298 848360 878942 843866 805582 852708 875432 872277 916997 997909 925460 821310
19031 821310 884837 1021576 1062073 958073 850742 767865 781501 838100 899424 947111 988249
19020 988249 989034 999187 1079097 1088300 1002892 966345 910857 949025 908548 833113 868638 820473
19008 820473 810240 829297 901177 934760 884003 825627 694295 715213 867885 896249 830240
18997 830240 836714 889169 920334 883298 905933 931066 905766 889577 901509 1041381 1077151
18986 1077151 1003056 983893 1026084 1066649 1128612 1192119 1168907 1222544 1263374 1221626 1310487
18975 1310487 1420543 1395730 1336998 1409598 1518412 1555389 1604797 1643917 1684586 1640474 1670404
18964 1670404 1771228 1805675 1810058 1834441 1866066 1966095 1955285 1947747 1904056 1948562 1957908
18953 1957908 1975117 2024219 1965519 1927511 1965786 2071279 2136129 2201354 2171403 2187830 2228879
18942 2228879 2156750 2142432 2166025 2219131 2262124 2270918 2310961 2328352 2249036 2216536 2278656
18931 2278656 2373512 2392492 2305843 2328085 2324496 2236078 2266894 2323722 2396417 2378948 2453507
18920 2453507 2415161 2324029 2326048 2304164 2256203 2174810 2195103 2269274 2324588 2426471 2378344
18909 2378344 2344581 2313673 2193047 2163819 2181788 2141920 2054165 2168284 2207835 2128775 2106460
18898 2106460 2017127 1948579 1957302 1858676 1774176 1822960 1920727 1966305 1922625 1886085 1912252
18887 1912252 1957167 1943840 1905640 1968224 2055663 2090817 2104791 2032393 2033750 2213505 2302783
18876 2302783 2334655 2465358 2590275 2788696 3006064 3183876 3325021 3605727 3848474 3996898
18866 3996898 4137994 4391392 4659157 4823221 5130569 5422496 5791087 6195182 6536190
18857 6536190 6878691 7260549 7574419 7860465 8209582 8601235 9095164 9692898 10366247
18848 10366247 11007557 11720329 12699911 13830499 15174793 16599028 17960577 19411617
18840 19411617 21165909 23055303 24858515 26319282 27685357 29311350 31622894 34404381
18832 34404381 36798335 38240990 39031245 39237142 38831697 37979998 37498450 37718423 38486473
18823 38486473 39537992 40403631 41338256 42643544 44122667 45342721 46302117 46968549 47616298
18814 47616298 48745044 50398254 52192417 53669297 54632611 55440940 56220519 56538121 56091160
18805 56091160 55157147 53900944 52684035 51673903 51405768 52198277 53523428 54491310 55081387
18796 55081387 55380494 55299533 55094743 54891330 55030171 55752026 57424527 59857189 62313477
18787 62313477 63896934 64527979 64007810 62655986 61177593 60094463 59599773 59190671 58879160
18778 58879160 58708803 58438105 57865122 57188482 57105694 58102555 59986809 61601236 61480579
18769 61480579 59952027 57461226 54131168 50324870 46537605 43228657 40398961 37967303
18761 37967303 35885438 34171234 32718469 31620436 30843066 30021941 29332197 28602282 27860316
18752 27860316 27038084 26079548 25274124 24595020 23953735 23396445 23031087 22617536 22117336
18743 22117336 21552323 20981587 20501081 19996427 19371073 18863012 18424860 17966334 17517486
18734 17517486 17072551 16608893 16142900 15718294 15387548 15035919 14770008 14577551 14328588
18725 14328588 14117771 13947174 13783919 13597338 13453837 13365190 13259882 13086332 12946628
18716 12946628 12888932 12801838 12712337 12651822 12590622 12468452 12421645 12372180 12404496 12438161 12411910
18705 12411910 12365199 12278101 12124549 11971954 11879451 11910950 11902714 11858352 11850578 11913634 11913758
18694 11913758 11861694 11815624 11761084 11705911 11660169 11605950 11544466 11515658 11505895 11524723 11540317
18683 11540317 11530224 11501582 11588982 11621666 11609105 11561366 11558207 11537752 11573682 11507316 11477249
18672 11477249 11515954 11574338 11605827 11578850 11491433 11500354 11529596 11470370 11495401 11481012 11359150
18661 11359150 11287026 11217587 11212478 11158607 11062418 10921217 10963725 10943201 10830683 10717211 10651578
18650 10651578 10633914 10508297 10379903 10303708 10183012 9996578 9842374 9786367 9735812 9616404
18640 9616404 9449816 9356976 9294464 9213222 9111458 9001739 8887079 8712578 8691003 8682819
18630 8682819 8608946 8543207 8370689 8258445 8194810 8174409 8086219 7966946 7872810 7731397
18620 7731397 7510614 7363270 7270571 7164943 7076757 6963086 6841820 6693482 6476842 6356828
18610 6356828 6339846 6373572 6374011 6230660 6151195 6058732 5947369 5929768 6023853 5961590 5807609
18599 5807609 5785319 5726245 5719255 5824710 5950237 5910381 5784359 5913437 5926155 5923675 5890362
18588 5890362 5852955 5887810 5805835 5771852 5815183 5819150 5808378 5872648 5915021 5975396 6013294
18577 6013294 6012519 5978654 6015597 6171303 6297642 6324388 6467874 6735522 7025075 7321846
18567 7321846 7672966 8110931 8472535 8937224 9543556 10217103 10910130 11666767 12484282
18558 12484282 13401890 14344241 15317501 16343108 17449416 18626200 19931444 21261677
18550 21261677 22585883 23853179 25195566 26629348 28158236 29888776 31636651 33525111
18542 33525111 35815228 38666197 41693325 44512901 47219399 49963861 52822387 56172660
18534 56172660 59912915 63503598 66924146 70300690 73935730 78572643 84157897 89714835
18526 89714835 94527865 97990050 99866642 99443861 97009304 93964028 91566322 90170485
18518 90170485 89602027 89203551 89224894 89920445 91381776 93932002 96888872 99393790 101106091
18509 101106091 102216539 103161647 104905052 107689487 111005953 113448772 113643254 112043844
18501 112043844 109539163 106320828 102847525 99579401 97210983 96147506 95688824 94797055
18493 94797055 93736205 93011961 92004320 90463930 88450499 87347403 88353691 91809402
18485 91809402 95644157 96232750 93947555 90244530 84627194 77898164 71789757 66970544
18477 66970544 63221463 60467198 58311631 56091162 53705712 51023585 48335572 45692684
18469 45692684 43299160 41209431 39419777 37987074 36779516 35724334 34709901 33838180
18461 33838180 33180601 32591743 31872727 31074488 30158390 29204095 28320051 27435807 26516090
18452 26516090 25692257 25140657 24584616 24012251 23489802 22990732 22533850 22217012 21927162
18443 21927162 21622690 21313148 21057953 20809200 20595602 20426624 20275853 20108666 20004966
18434 20004966 19932315 19905176 19713435 19525068 19285292 19158544 19098997 18994556 18915286 18924706
18424 18924706 18825462 18700013 18649714 18554744 18556573 18532942 18467931 18426329 18244443 18157855 18110735
18413 18110735 18077520 18069363 18110650 18024318 17905359 17820096 17704130 17592414 17467425 17387115
18403 17387115 17212888 17093718 17011748 16997305 16954420 16881106 16751109 16603593 16523701 16458960
18393 16458960 16334159 16142681 15978605 15969599 15852762 15693920 15552645 15352198 15216271 15116818
18383 15116818 15008966 14889094 14823038 14671789 14401148 14079401 13969041 13867993 13641452
18374 13641452 13479033 13221841 13047346 12833212 12633023 12476215 12301552 12209054 12008803
18365 12008803 11845780 11664899 11481260 11267051 11070857 10837518 10620693 10537311 10406480
18356 10406480 10246708 10098810 9943187 9781324 9644501 9477247 9270326 9095940 8976097
18347 8976097 8880401 8821617 8662041 8514886 8454838 8330570 8170967 8118685 8090712 8025565
18337 8025565 7895527 7807840 7674160 7592811 7471362 7313190 7229644 7099105 6975594 6988540
18327 6988540 7045996 6978926 6831558 6701500 6621334 6615462 6558889 6349484 6169068 6084264 5960750
18316 5960750 5779381 5637318 5544594 5451958 5392601 5372801 5298777 5223712 5211008 5092363 4968051
18305 4968051 4879159 4873734 4881786 4883442 4763545 4597969 4479233 4360217 4239215 4182503 4076909
18294 4076909 4087238 4021674 3974458 3892498 3754711 3702735 3601657 3426626 3348906 3283647 3230110
18283 3230110 3193075 3134607 3008894 2923917 2908348 2872508 2857965 2804065 2647731 2555326 2594439
18272 2594439 2530924 2464061 2444447 2384066 2394211 2373882 2261583 2290637 2240531 2166455 2036953
18261 2036953 2022705 2022898 2031150 2002267 1942799 2020360 2025252 1996172 1989460 1972374 1913879 1904716
18249 1904716 1991942 1994799 1959624 1905823 1745198 1655077 1658148 1670848 1646269 1686410 1704710
18238 1704710 1727119 1675822 1614840 1583187 1593350 1576383 1537478 1472789 1425002 1451511 1419015
18227 1419015 1427868 1363765 1319749 1320188 1306944 1338458 1351926 1372652 1390854 1352779 1329450 1299330
18215 1299330 1301555 1307376 1327638 1367363 1373604 1384648 1352057 1326163 1314838 1339520 1385649 1384847
18203 1384847 1423202 1483596 1439082 1452957 1455625 1457539 1448060 1440354 1444403 1483738 1448301 1406032
18191 1406032 1390837 1383176 1385133 1346771 1390343 1437937 1456580 1555637 1601287 1563691 1597839 1523314
18179 1523314 1494972 1465435 1412249 1477510 1587957 1676253 1702067 1775244 1768132 1722692 1663319
18168 1663319 1561343 1571561 1617796 1608329 1625709 1644056 1645547 1631377 1609255 1581619 1624407
18157 1624407 1721130 1820127 1853221 1898884 1808768 1827088 1915242 1966289 2031177 2108983 2140119
18146 2140119 2120208 2194705 2264692 2295064 2310544 2391184 2495246 2609076 2784748 2985721
18136 2985721 3201356 3373324 3578997 3857567 4150887 4346506 4547079 4919422 5454875
18127 5454875 6041564 6685340 7395490 8231616 9272776 10389155 11547878 12990032 14754391
18118 14754391 16961199 19412407 21737963 23414497 24491299 26003667 28870088 33544594
18110 33544594 37459773 37957732 36759273 34469329 30359433 25629186 21618923 18438667
18102 18438667 16170991 14598263 13313825 12400341 11583499 10764985 10007537 9258615 8599891
18093 8599891 8188873 7687144 7245848 6915214 6555185 6272840 5991015 5657667 5332936
18084 5332936 5154556 4932664 4705228 4481730 4327024 4139035 4011398 3878476 3711428
18075 3711428 3572310 3470265 3461188 3334137 3165619 3056379 3049689 3020654 2991756 2952993 2890891
18064 2890891 2879937 2845383 2800227 2869384 2837634 2691958 2611229 2632443 2673486 2658104 2634190
18053 2634190 2628877 2565561 2554067 2558072 2551475 2499082 2499416 2580237 2623387 2647883 2545191 2523175
18041 2523175 2499024 2500028 2546029 2687166 2703307 2652066 2561698 2620876 2669365 2665283 2552433
18030 2552433 2537666 2591059 2624847 2625452 2674997 2675320 2571840 2599606 2650914 2632828 2634915 2656280
18018 2656280 2642338 2724199 2684774 2615747 2578866 2599074 2671734 2754459 2795116 2826796 2785538
18007 2785538 2748527 2783369 2836208 2926104 3064036 3093086 3077821 3064132 3038581 2946258 2912173
17996 2912173 2950195 2937454 2946383 2901392 2832038 2853088 2760170 2680380 2620157 2631602 2644852
17985 2644852 2535872 2542534 2524552 2420037 2408457 2402664 2290876 2297376 2380923 2280617 2131609
17974 2131609 1977473 1810170 1729494 1778021 1802160 1840874 1782649 1738937 1770634 1745374 1639252
17963 1639252 1657498 1624710 1628114 1648037 1557473 1485290 1554774 1607837 1565040 1539565 1500445
17952 1500445 1408060 1364990 1220560 1151053 1125480 1161287 1238440 1201602 1236691 1314911 1393690
17941 1393690 1357007 1223706 1153567 1242322 1222521 1096188 1107814 1133093 1176174 1200372 1065396
17930 1065396 965050 931853 1027840 1055884 1046886 1037591 1111119 1101483 1044220 1078576 992366 962525
17918 962525 1042630 1080128 987404 885926 884383 1006362 1020844 1048247 968866 905059 807481
17907 807481 744546 760478 889474 838293 836910 845740 809306 697250 652812 685044 727568
17896 727568 680498 677659 641506 644064 595744 618334 732239 778369 710044 614588 545824 541459
17884 541459 552212 502099 538574 533617 536180 585266 619908 563705 568938 495065 433692 363063
17872 363063 417451 371614 370994 437971 509073 508651 493412 548365 532826 501968 498977 383095
17860 383095 298723 241809 345011 389817 313437 317907 363284 455728 402026 255323 287057
17849 287057 328090 323865 265242 269708 285845 260095 333168 318803 208484 248512 324309 295498
17837 295498 254738 291129 306292 313333 294980 260636 266339 283936 316916 386207 430979 424089
17825 424089 270539 241338 347003 400917 367584 331090 339677 299954 293162 242687 178376
17814 178376 179138 135025 215993 174275 257026 324921 273526 264751 335009 304952 259776 339486
17802 339486 329246 313550 340222 358703 415394 491583 424886 358240 318179 329215 339790
17791 339790 289171 273045 230445 222502 239514 288798 241669 280350 314478 309504 252512 246543
17779 246543 330887 294213 393674 396847 335168 369954 358316 336071 370808 344219 341616 338658
17767 338658 324454 287040 269529 216504 164230 121790 175349 277951 305804 272449 316362
17756 316362 336708 294290 269514 206075 149557 134110 221052 180334 137117 113271 139396
17745 139396 68568 -39624 -972 89388 86773 90232 159944 297842 257539 252896 263641 207743
17733 207743 152498 98577 197170 225294 195765 200638 195234 200164 260095 283970 193661 136314
17721 136314 141766 176159 125509 108547 178449 114585 45314 117793 130451 119287 63697 27470
17709 27470 -25912 12976 8825 -22301 32673 26682 18051 54047 67084 129489 116927 114022
17697 114022 119993 119231 158828 232249 209928 160167 188698 248674 229795 236011 213595 229177
17685 229177 249496 248790 225133 238769 247906 248374 271986 271332 263244 302175 367020 396324 285575
17672 285575 107101 32861 29086 8885 74401 105774 120332 206110 189225 205854 239130
17661 239130 147454 69272 50944 46464 30270 102928 157889 105664 -3176 19396 73654
17650 73654 5209 51613 179526 255055 225830 124984 86106 82494 147373 223236 229474 182058
17638 182058 88436 193324 212837 156854 11064 13753 108517 194390 137280 70229 64950
17627 64950 41816 -3125 -18490 38499 48418 17107 -59179 -65389 -1951 130640 211478 135899
17615 135899 93443 27170 -31867 -17998 8355 42127 48762 88820 114911 75230 -39284
17604 -39284 -78847 -33319 -42295 -31973 41598 143391 201433 233125 196103 115210 118476 115093
17592 115093 138025 107692 50974 67599 -20634 -3789 28024 62694 107052 150732 141976 115789
17580 115789 165726 115855 69143 31627 14305 143944 254806 138777 100070 106852 182415
17569 182415 190253 153804 136493 102062 162018 171103 84221 99474 72624 4992 77453 141520
17557 141520 97203 96135 57720 127521 189362 160168 69714 31410 2776 -27856 -38803 -41880
17545 -41880 81208 86632 95324 65555 65368 131159 121538 58318 69742 113028 120341 94571 187710
17532 187710 225325 228076 181819 139136 120452 99010 96307 90396 56867 88256 108919 88377
17520 88377 54876 5135 9196 98571 91690 59714 6603 -19761 20151 19240 55607 37656
17508 37656 -31275 21044 95520 134806 110049 60414 43880 63845 105580 122543 162679 198713
17496 198713 106486 29175 61566 57360 61955 9418 11695 61627 147294 22232 -114666 -106145
17484 -106145 -30580 -68662 52694 116360 123374 154705 91161 -6397 2026 12767 70219 41597
17472 41597 37923 75481 108332 47325 -29746 33961 152229 224285 239709 59792 -3790
17461 -3790 74195 88090 61852 72699 106070 47749 24620 99127 157863 154540 158561 184863
17449 184863 169453 245416 243782 224009 203016 353331 352569 249412 196530 186174 111730 173087
17437 173087 187234 176093 202052 220577 278062 249423 170981 118532 148687 126761 90519
17426 90519 134599 134801 66787 24246 32693 61114 75807 57614 31302 79025 83208 92771 78559
17413 78559 75245 112379 105804 65950 32056 -2627 -31387 36784 105105 133178 74431 -19697
17401 -19697 -19528 8015 14610 -24808 -88825 -148461 -63233 -19499 22336 134756 117944 87578
17389 87578 48788 113515 89462 -12668 -2846 38963 55773 71320 38123 67521 27937 -26580
17377 -26580 1381 -1781 22826 38911 43339 53321 9638 -34266 -93552 -70716 17892 93531
17365 93531 32219 33030 145075 166373 30400 -60428 -63989 -53750 -74004 -95639 -66885 -44266
17353 -44266 -61211 -88166 -5964 65745 57176 -37207 -40507 87973 114974 136599 96766 107562
17341 107562 128599 133790 40682 -207 40291 42188 -18908 -13161 33569 96659 142499 112156
17329 112156 14289 -53459 -28638 33869 37319 29605 36835 13322 -25892 7188 66423 36771
17317 36771 43967 35894 57423 86033 18225 34096 71448 51172 25175 29349 19291 36950
17305 36950 -61392 -64622 -44574 -56159 26274 29483 88478 61785 -33697 -27243 42910 -13890
17293 -13890 -87054 -124815 -68781 -9590 -43528 -91776 -31475 -17386 -165001 -201157 -171133
17282 -171133 -74660 72391 121457 113839 98461 139680 164839 148427 130984 136284 135480 162426
17270 162426 153927 34685 -88011 -110507 -51133 62108 59997 73334 50424 25748 4984
17259 4984 -34245 -37790 90587 196300 116229 -28085 -29807 -3412 75454 195569 200350 131277
17247 131277 118013 70559 3928 -45199 -29783 -22604 -12153 61889 50916 -20856 -11464 -66039
17235 -66039 -57732 10319 35038 71435 85344 171798 250373 210664 104613 40593 50949 81284
17223 81284 125766 96931 138281 121498 138704 115321 167762 185141 99548 2989 -56501 -89680
17211 -89680 -80696 -45105 -30410 -20913 -19576 -8310 24275 45936 94676 44195 -492 -40524
17199 -40524 -53120 -25373 -20192 22302 22123 -7700 44232 47744 50404 -28348 -32377 17676 3511
17186 3511 -1999 3682 19548 -2188 87864 145886 180488 15885 -53806 -48548 18209 -58245
17174 -58245 -66857 -151173 -153936 -75611 -14297 19459 -5370 -17407 8381 19776 -32452 -101242
17162 -101242 -62223 8593 113527 50811 20452 62185 70726 112185 122019 53068 928 8329
17150 8329 29792 70260 103595 120848 128851 115772 77942 46099 71363 22908 -35989 -94259
17138 -94259 -4450 47650 22756 30152 10530 -8753 -46439 -116065 -105438 -28691 26527 -33238
17126 -33238 -4366 16769 -54051 -48209 -15018 -108680 -134211 -7541 7927 -6473 -71552 -189535
17114 -189535 -221614 -230579 -211186 -110778 11748 50411 23062 89192 89019 22070 30528 58235
17102 58235 84954 132952 90016 97557 43859 43608 60640 -36822 -25377 -60558 -92961 -51629
17090 -51629 1959 79463 56627 -4406 -14533 -33587 -69640 -24342 23009 32341 -49492 -116343
17078 -116343 -128277 -23436 -70151 -70294 -62474 -157704 -99693 -106982 -172786 -110143 22205 123431
17066 123431 73383 43784 -7132 -51644 13108 63425 128143 166527 143654 129319 86715
17055 86715 -24 479 59084 -1710 -37189 10411 -47327 -103553 -42377 -9473 -13763 -41335
17043 -41335 -81677 -71267 -53921 -75095 -44435 85779 86398 113943 208993 156869 125208 98314
17031 98314 84735 96281 93557 24171 16202 -28266 -30050 -10123 -66556 -116768 -174416 -132185
17019 -132185 -110182 -81953 -81468 -29350 -35696 -140297 -205799 -169461 -75952 -49828 23403 61333
17007 61333 112330 157199 124467 68684 57849 20229 -1970 101056 85378 50753 36588
16996 36588 11287 54436 25397 5923 51165 173801 57599 70496 87409 91154 25523
16985 25523 -13407 -11955 26330 77617 22644 11859 17284 37446 -54977 -106520 -99380 -54155
16973 -54155 -86750 -133332 -157152 -146367 -72182 -82375 -103331 -57284 28291 77447 76878 122191
16961 122191 109033 49536 -32419 -9105 23331 -5393 -105052 -136487 -155519 -166445 -89465
16950 -89465 -84092 -64277 -139212 -163075 -225734 -242005 -205069 -233709 -261901 -98362 -80667 -30636
16938 -30636 -49806 -28110 64290 82103 26322 -40472 -67836 -51140 -93496 -179764 -179632 -114811
16926 -114811 -68887 -51637 -1628 41772 26560 33269 53689 134072 89166 18012 8866 18694
16914 18694 -33213 -2429 -11874 -86688 -162667 -174079 -79052 9151 93184 42636 1739 -54818
16902 -54818 -82592 -50779 -2547 53294 39763 23046 -34895 -71712 -53009 -82310 -62935 -36265
16890 -36265 -23424 -19859 -26790 3143 42068 -35809 -48939 -41335 -75935 -36221 -58292 -159987
16878 -159987 -180728 -42185 -2470 -139 -37747 -50031 -92454 -31412 79282 102767 76093
16867 76093 57744 89838 20434 -25502 -42285 -90656 -32436 51161 32508 14763 64852 -5264
16855 -5264 -59062 -52800 -70930 -15874 -41839 -58191 -68420 -18811 3786 82015 38644 -42142
16843 -42142 -97578 -81445 2699 85601 555 -13053 23071 7602 -38755 -73516 -58730 2287
16831 2287 20775 72456 58342 11159 -18877 -35393 -20566 -70177 7221 -42517 -153911 -160291
16819 -160291 -56975 -33702 -14190 -9194 -50485 -123142 -64612 -14884 70563 82774 29757
16808 29757 -49048 -85227 -117004 -127496 -61361 4275 -5065 31872 61651 65869 15437 -26838
16796 -26838 -22692 60272 46453 -14569 24842 -49606 -123036 -204097 -163047 -144122 -43825 -5081
16784 -5081 34292 17510 -46772 37949 -24188 -89064 -72817 -79221 -124236 -192041 -125206 -3224
16772 -3224 -22065 31926 32692 -13233 17543 41637 59033 25974 -95772 -97231 -110624 -104197
16760 -104197 -83998 -16312 -5504 -11036 -58284 -22850 12124 22619 9839 -26594 29895 60625
16748 60625 29826 -48501 7730 -34093 -90016 -120565 -132084 -128285 -153199 -101820 -126869 -95736
16736 -95736 -31188 -68474 -21508 -80392 -127643 -133465 -141267 -115775 -69291 -42075 30778 120285
16724 120285 71222 38653 65551 153479 142791 47872 26600 11907 -52749 -129271 -66886
16713 -66886 -35137 -87172 -78353 -115357 -140668 -170978 -176302 -116501 -77697 -23251 3063 -80149
16701 -80149 -22881 -45890 -30690 59445 -4656 -62720 -135265 -113097 -57342 19374 108291 98138
16689 98138 57589 -19172 -101162 -131275 -14774 27677 10229 -76209 -55865 17863 -10806
16678 -10806 -26163 -53670 -56098 -91774 -120578 -158075 -223649 -164415 -144986 -161913 -129511 -5439
16666 -5439 14398 24715 13222 -76954 -71591 -27580 -69392 -56043 -17217 -7118 -6594 29731
16654 29731 87647 97648 1210 -12563 -43320 -39116 -10750 -936 18850 -9800 26593 58838
16642 58838 -23996 -140979 -124665 -80166 -31599 -72556 -107414 -116199 -87051 -52942 -100904 -84925
16630 -84925 -168444 -68336 12549 -43130 -161025 -151133 -39950 22223 66941 49730 76390
16619 76390 80191 31784 -35065 -54893 28766 -25303 -20716 8065 -109818 -96157 -64926 -150855
16607 -150855 -138380 -130973 -119953 -40111 -56138 -59198 7642 -14115 -22504 -5244 -63431 -9365
16595 -9365 -1961 -53384 -98874 -76171 -95435 -79009 -39977 21765 -57484 -220455 -235992 -224126
16583 -224126 -108418 -44499 -51096 -13879 -58995 -33406 -23697 63034 89152 58084 23343 31381
16571 31381 888 -25836 -54473 -14482 41924 30776 31399 27850 34815 -28766 -42754 -20539
16559 -20539 -485 -12320 5072 51533 34617 -76252 -114206 -23077 -5331 2828 56087 133157
16547 133157 128511 34174 33200 51252 42408 126466 139602 -32613 -94286 -89246 -15123 -26046
16535 -26046 -81036 -93216 -185540 -151593 -187971 -125974 -20302 -38644 -72211 -84922 8813
16524 8813 38192 68343 69261 112400 169827 167812 118994 137450 181937 113754 82092 72969 -84020
16511 -84020 -132570 -132218 -137115 -126031 -131446 -56120 -87702 -47515 -69552 -73681 -54512 -29804 -59374
16498 -59374 -65731 -92516 -64707 -15594 2879 42370 -73104 -96278 -112275 -23661 122108
16487 122108 173699 86965 -16940 1115 -33944 -134390 -78983 -74290 -43401 -32654 -59658
16476 -59658 -26947 -68252 -62296 -590 48302 42584 -47772 -21503 -41980 -39883 -132222 -114047
16464 -114047 -56277 -109821 -148529 -74423 -30049 -7457 -31786 -6188 28132 43358 -72618
16453 -72618 -185761 -162552 -135695 -119139 -52905 -28156 -93555 -62525 -36151 16951 17356 24127
16441 24127 54740 66369 57263 36441 80118 127435 119491 77541 -11681 -43736 -27996 -56887
16429 -56887 -28180 -28856 -82791 -88295 -98184 -84345 -133146 -67779 -52739 -447 58223 28271
16417 28271 72619 100748 84476 56045 9691 -75249 -87421 -68493 -55682 -93849 -80598 -61220
16405 -61220 -37131 -35791 -80429 -40088 59031 79453 2488 -48991 -99291 -88108 -35000 -25221
16393 -25221 -45830 -71508 -110296 -32957 54215 34633 -33616 -147242 -188759 -162034 -17446
16382 -17446 13046 28669 -17899 -125331 -107283 -88093 -143307 -138283 -93232 -67234 4966 109270
16370 109270 92578 16643 9103 9926 35009 68337 51989 -10514 -28567 -64915 -115286 -33494
16358 -33494 25254 -32738 -6516 3215 -15366 -92117 -69001 -31101 -60267 -21193 -50473 -1856
16346 -1856 25855 82919 80637 -15514 -40150 -47027 -57627 -3496 -31962 -119649 -111653 -89588
16334 -89588 -43495 -52837 -37817 -39865 -51474 58502 56072 42152 35550 -31725 -91424 -47342
16322 -47342 54294 62064 153585 86999 111462 90738 98571 63795 -37874 -91957 -49425 46905
16310 46905 139425 85284 8801 -29387 -54154 -36599 8116 89221 60020 37574 -24120 -51771
16298 -51771 -83406 -142050 -36592 31970 -10939 18197 20361 -21538 -37373 -28623 22420 65311
16286 65311 84579 73985 92388 77246 59258 46809 23905 28376 -27418 -63033 -72009 -88632
16274 -88632 -61401 17787 29432 -44622 -31595 -46355 -56509 -132725 -136279 -75178 -77695 -98984
16262 -98984 -115946 -117058 -67605 -100393 -142049 -161630 -170984 -118593 -91842 15044 -8237 -131132
16250 -131132 -97793 -56055 -130952 -119186 -46747 -15330 -34816 32702 60028 62060 -19906 -15589
16238 -15589 -25748 -100015 -140324 -85324 36485 44171 -38238 -19655 58175 43123 35866 19672
16226 19672 48803 73216 118401 164264 95299 -19680 -124363 -177607 -125722 -65505 -69291
16215 -69291 -38849 -7473 -131024 -250266 -276305 -179708 -154924 -125750 -167503 -239577 -252330
16204 -252330 -186630 -120987 18124 -14953 -109250 -130217 -57514 67822 70953 45992 67852
16193 67852 97526 94493 73560 44550 -46633 -85562 -98718 -29422 -50753 -135771 -93608 -68428
16181 -68428 -23833 -121473 -83252 51893 129868 164738 133119 41439 -64426 -162864 -182242
16170 -182242 -91764 -56359 -71448 -64149 -40966 -37736 7138 49736 -43810 -94355 -85634 -42891
16158 -42891 -87439 -64807 -88723 -139899 -157500 -148279 -108229 -80987 -52838 -71023 -184074 -224148
16146 -224148 -168361 -151745 -103141 -70701 -100524 -62483 14980 36472 75980 59050 -28469
16135 -28469 -71986 -32930 -22906 -43717 -117079 -161513 -137579 -57128 -74561 -65042 -126859 -61417
16123 -61417 -34771 -75256 -88459 -133351 -87886 -144769 -95204 -63076 -16257 16081 30495 15526
16111 15526 58743 103394 -36325 -80937 -93718 -73296 -3750 48818 98684 99459 66744 -27588
16099 -27588 -131576 -116271 -117920 -142037 -131704 -71443 -4164 16762 -35083 -52543 21868 57609
16087 57609 22142 -24689 12737 -61441 -193547 -162197 -105470 -201528 -215746 -132012 -50525
16076 -50525 -17222 -42167 -31860 -26646 -29809 -42365 -59615 -133065 -160597 -93946 -40893 39734
16064 39734 96404 72691 74153 18972 -1636 -32351 -55821 -35565 -19412 56559 19076 -19940
16052 -19940 -53974 -60034 -25411 36167 85297 79243 8514 -22508 -73048 -69103 -4676 -19910
16040 -19910 -3518 -32801 -12743 -18711 -21528 -75513 -68415 -53851 -49941 -81175 -101536 -45935
16028 -45935 40166 82751 137094 157267 140278 162441 87370 15081 46416 28791 -4178 -35129
16016 -35129 -1735 2107 63258 35876 -45911 -58092 -48268 -56906 -72426 -58883 -97957 -119246
16004 -119246 -61826 -10401 -2519 -42783 -17644 830 -24608 15959 -6841 -37680 -80605 -113410
15992 -113410 -87393 -100928 -73750 6867 -18245 -48247 -70454 -33177 40954 89369 111355
15981 111355 81090 -16300 -90763 -157862 -192184 -82519 89808 81695 -52220 -63804 -81508
15970 -81508 -95920 -64386 -83852 -88300 -140063 -86654 -47828 -78408 -134522 -100073 -55302 -80976
15958 -80976 -13921 45428 75918 77820 39225 7444 63910 50265 73042 23711 -25176 -37228
15946 -37228 6028 40930 41607 34308 53596 84055 45727 -3769 -92290 -137983 -79834 -36987
15934 -36987 -71496 -114656 -128782 -41164 -13667 -51217 -52788 -133438 -147406 -128817 -99841 -99132
15922 -99132 -75171 -55934 -87037 -118843 -34038 12156 13126 -12558 -50504 -15809 713 61842
15910 61842 34885 23506 76322 30013 -21710 -45429 -30839 1469 -82398 -91419 -71455 -37208
15898 -37208 -75726 -83332 -120244 -8198 75801 43507 14119 -14421 -37653 -63265 -87633 -103480
15886 -103480 -143965 -167015 -66239 4711 48283 14048 -47600 -101368 -103520 -162917 -197098
15875 -197098 -159391 -189150 -187306 -110502 -76392 -113108 -169722 -174053 -129829 -82554 -10030 87341
15863 87341 42918 -57959 -60891 14948 -1773 -21297 -96592 -135451 -169215 -146839 -124031 -167201
15851 -167201 -114416 -78146 -113063 -50728 23195 -9587 -51810 -20243 -37716 -61751 -40209
15840 -40209 -142078 -126157 -20791 45784 74472 127019 158211 166722 147044 122127 63667
15829 63667 -14222 -62783 -48881 24655 74916 62439 19269 33760 31060 -50182 -56070 -33130
15817 -33130 -80013 -94398 -52078 -42124 -15574 -20105 -149439 -161308 -80341 -12589 -42931 -143521
15805 -143521 -183011 -187176 -165045 -151345 -52955 -16938 -36029 33083 96276 70410 -9546 -27120
15793 -27120 -79238 -101754 -51394 17017 82038 21653 998 -7124 -54915 -37673 -17519 -118226
15781 -118226 -140320 -139015 -68647 256 -378 -96295 -119142 -132563 -134588 -31719 21417 52417
15769 52417 16130 -106025 -113937 -124278 -66217 85555 120544 59753 -16326 8114 79754
15758 79754 32639 35246 19344 -37599 -40201 15866 61062 -34794 -107314 -136793 -123060 -138869
15746 -138869 -128438 -144943 -82446 -47675 -92485 -144504 -116677 -57911 -56832 -16609 35566 -1733
15734 -1733 -85818 -117646 -47730 61011 89986 42097 -55549 -82018 -63912 -55473 -35393 -30328
15722 -30328 16730 79248 91054 54459 4093 -94197 -61275 -604 27677 -12966 31191 19817
15710 19817 -17162 -11803 33879 82402 33823 2256 75978 84767 -43793 -65376 -40584 -21445
15698 -21445 -63842 -46386 -46639 19416 2582 -35899 32253 68931 33033 10055 -9516 -58046
15686 -58046 -53670 126493 194819 117212 22375 -78655 -45926 -52325 -31744 -36363 -7144 -94208
15674 -94208 -128154 -183784 -109804 -118859 -103203 5434 51511 27003 -31080 -34385 -20941 48977
15662 48977 7468 1207 62 -25363 -31116 -81199 -46735 61171 138781 123448 11615 -6890
15650 -6890 43323 443 -38016 7119 67980 48193 -40451 -82244 -20262 67893 66222 9324
15638 9324 -35572 -2010 52271 83404 225029 216331 136475 52403 77832 75585 102635 50821
15626 50821 53862 24254 17803 -4290 -79528 -93129 14711 105798 111058 63064 39160 3666
15614 3666 11939 -40085 -96740 -112136 -74736 -55597 -63303 -130651 -64565 -10288 -102867 -89393
15602 -89393 -58755 -25729 -47170 -74879 -143643 -172933 -91372 -108183 -205251 -244880 -266253 -164494
15590 -164494 -38318 -37977 -63518 -154504 -117828 6084 27228 33017 289 -98092 -178756 -207696
15578 -207696 -230790 -142907 -38935 -20500 -60958 -57785 18468 -40472 -114892 -20788 126366
15567 126366 184761 111994 17908 -26177 55833 32059 -74361 -34887 -70219 -52583 -46772
15556 -46772 -85454 -118808 -123785 -153164 -111576 -144117 -118461 -44630 -4464 -51468 -72540 17773
15544 17773 5508 -53202 -70330 -86955 -59051 3960 114524 49194 22612 -45561 -33070
15533 -33070 -7412 -50266 33240 35825 -16168 35438 70479 18166 22079 -45599 -97373 -54664
15521 -54664 -70038 -122792 -120174 -96181 -47003 -23714 -24641 -95601 -35315 678 7966 53785
15509 53785 6213 -41707 -125716 -160283 -113642 -75240 -145992 -221462 -113592 -31673 14884
15498 14884 -16624 -42876 -115477 -122246 -165487 -220405 -188724 -73111 -14024 23382 15179 -11535
15486 -11535 -23746 -25710 -69348 -46941 -948 30240 21044 -30351 -72412 9226 45454 69244
15474 69244 48815 32905 -42769 -140015 -187297 -37825 105650 50194 -6228 -24881 -55943
15463 -55943 34653 91758 85079 68860 32043 42130 27383 37570 -40040 -36716 21356 69274
15451 69274 28232 6450 6006 21654 -24541 -34939 -17097 -33595 -62482 -10132 -14868 -20936
15439 -20936 59498 -6375 -17153 -42101 -69380 -77914 -75211 -41655 -8209 -20470 -17255 -98171
15427 -98171 -92800 -24871 -7933 14068 -28275 -58983 -84255 -83796 -50099 -20394 38199 -14334
15415 -14334 -17417 61144 105982 49726 -37676 -120611 -110159 -120867 -72052 -88007 -97270 -141049
15403 -141049 -114981 -22950 92155 47172 67498 100810 127025 63753 68729 56531 40584
15392 40584 78065 51073 94512 130570 23538 -21856 -25252 -17471 -47134 -78942 -58000 -35494
15380 -35494 -57720 -118594 -47300 -21793 -18145 -4006 -21828 -24730 15556 25862 -37060 -34407
15368 -34407 -5751 7859 63042 2986 -48592 -44251 -30269 -6791 -21209 -56226 -54668 -34642
15356 -34642 -35488 -4995 -9801 43117 43405 115281 148314 97127 30925 -35028 -101599 -67282 -112557
15343 -112557 -125553 -170281 -244606 -232360 -166780 -108490 -96722 -159606 -125728 -73668 -102392
15332 -102392 -88405 -97325 -165404 -225163 -100389 -22473 17245 22384 -16526 -34428 52078 77781
15320 77781 89289 127168 52725 -31701 3843 14607 61210 15057 20207 56923 -903 -30171
15308 -30171 -76914 -161007 -112361 -64933 -48319 47132 4106 -35038 24790 112038 83219 126723
15296 126723 154454 90022 20354 -17200 -11841 5451 3882 -92203 -192004 -132528 -107203 -87691
15284 -87691 -40566 -53999 -75771 -36360 2397 94903 201543 124331 6806 -38073 10912
15273 10912 49449 -84146 -192263 -148950 -99287 -109103 -138719 -91970 -85555 -27263 -1881 9725
15261 9725 -62637 -65116 -89925 -55530 8249 50108 39882 84089 25551 -576 -62629 -10121
15249 -10121 53661 29533 20638 126 -31185 -95434 -101426 -102699 -108713 -74946 -36779 -52962
15237 -52962 -109638 -43923 -16215 40887 -77744 -134300 -36958 122771 146391 121641 -80886
15226 -80886 -229767 -180024 -78140 -66046 -86071 -143510 -129369 1008 -47956 -112618 -80246
15215 -80246 -4924 66409 20289 22036 95771 57061 -46859 25422 42376 -55571 -47320 -16474
15203 -16474 -87087 -34571 51454 94924 113206 23859 39367 -6293 -123469 -256345 -197365
15192 -197365 -88661 -84411 -64010 -7923 31260 95963 12399 16930 57356 64785 -6414 -55316
15180 -55316 -32336 -52529 -33988 -37832 -24647 14731 -3786 -26698 -14185 -4270 3860 51421
15168 51421 62074 82575 92595 47024 36152 59912 74014 75804 -7811 -73318 -115000 -98841
15156 -98841 -32194 -14466 14468 -20107 8408 27597 -88421 -184142 -149590 -88472 -10561
15145 -10561 -4590 -48736 -102320 -104511 -203639 -142028 -129278 -87378 -63112 -24755 -9609 -1794
15133 -1794 22357 85658 67321 -15196 36396 56203 -45125 -52207 -80331 -121870 -111871 19343
15121 19343 125073 156754 175496 82702 53246 32471 -19902 -68861 -12089 5486 -27949
15110 -27949 -92815 -133061 -107932 -65646 -45558 -7052 -16907 -51128 -86006 -118229 -107495 -62219
15098 -62219 -65900 -51875 -44848 -54092 -34121 -64117 -135062 -240975 -117020 -40190 -138689 -158265
15086 -158265 -114116 -87689 -70335 -49464 -77215 -74542 -155192 -255656 -243309 -180574 -87604
15075 -87604 -61678 -103081 -87627 -45793 -9412 20908 72572 30753 -59275 -63737 -24387 -55657
15063 -55657 -72964 -79923 -78996 -73001 -50943 -18941 51954 59154 -10504 -35685 -41792 -22380 -71104
15050 -71104 -10875 -28471 -76788 -49102 -48389 -62412 -18038 12137 -5941 -11257 21242 36527
15038 36527 -17409 -20460 76935 87157 68691 116423 23338 -107531 -161809 -82940 -131910 -136675
15026 -136675 -7790 77829 87553 68037 50609 -63995 -109372 -11795 -84880 -87484 -2481
15015 -2481 -78097 -39399 -46194 12164 -40691 3257 39124 -25808 22494 65631 30504 -2568
15003 -2568 -37257 -37553 -121452 -145840 -129361 -111057 -110892 -80743 -100388 -56765 -7539 -7493 14802
14990 14802 27551 -32544 2128 23284 44905 78641 73827 -16389 -21471 -9061 -57412 -126189
14978 -126189 -148931 -107634 -104734 -64599 -45549 -25373 -13690 -46975 18950 94993 89735 -8799
14966 -8799 -38037 81094 98884 78617 -63104 -198363 -185895 -28749 -44869 -75760 -98149
14955 -98149 -81673 -24300 -48808 30134 -18245 6289 44181 32051 13060 -112075 -121984 -112706
14943 -112706 -48081 -47005 88739 126929 103538 38270 -37918 -72883 -65138 -87608 -16550 -47628
14931 -47628 -76534 -73903 -107422 -73742 -104728 -75229 -48063 -58078 -70914 -61773 31518 131654
14919 131654 91781 127888 93057 77216 39191 27687 83378 32153 -24578 -98854 -139580
14908 -139580 -94456 -75645 -118295 -108827 -96971 -12879 20520 24487 47785 -18438 -109660 -54925
14896 -54925 -85456 -25072 -89448 -130478 -86799 -100581 -53064 -44882 -37994 8578 135098 130310
14884 130310 41191 -42769 34760 73295 -21833 -88128 -140484 -150523 -170990 -74446 -28181
14873 -28181 56615 5772 -39228 -10370 75848 85682 -33455 -81128 -113117 -104350 -102871 -59115
14861 -59115 -80290 -103756 -68536 -16817 -1316 76110 113222 107947 61499 -4776 42549 145483
14849 145483 151516 104444 76810 131776 92623 2855 -41169 -60659 -101635 -181025 -61070
14838 -61070 -13651 -36604 -117967 -143344 -85461 -23089 -56880 -62942 29197 76179 -4753 -26773
14826 -26773 49794 82493 -9806 -173610 -104495 -87243 -146889 -77197 -34049 -42606 -67536 -86668
14814 -86668 -151290 -143759 -174267 -207683 -228191 -174050 -85084 -52687 -43250 -19307 -24278 -37487
14802 -37487 -45359 -18101 20631 -45025 7908 -57125 -68911 -63487 -107079 -114901 -105259 -113932 -101596
14789 -101596 -131655 -128844 -29739 -639 -47628 -61399 -206 4506 10573 -6574 -126385 -120932
14777 -120932 -112257 -58977 1758 15210 63366 145874 79462 52911 20359 -22274 11162 8121
14765 8121 23928 -41008 -73419 -47837 5935 -14588 -40004 -10212 60237 -27002 -75963 -62459
14753 -62459 -118529 -85535 -71925 -49001 -77812 -45918 -16553 16288 49019 55933 57471 62514
14741 62514 19889 -44464 -68903 -26725 11489 25219 -19771 -93697 -71587 47896 63685
14730 63685 62300 106106 74703 47521 93762 142181 153970 145041 180346 75089 6872 27846
14718 27846 -20938 -29964 -25778 -81351 -95244 -39892 -79442 -21012 14738 3583 15397 -15622
14706 -15622 6016 -117870 -199994 -172351 -44913 -49341 -86069 -57888 -20946 -6146 42395
14695 42395 71042 51964 70768 83348 137696 213589 181053 89813 7805 -29322 -26897 -5681
14683 -5681 59828 106551 33482 49113 40125 -5695 -172182 -278421 -207613 20100 67307
14672 67307 -30529 -30686 -5269 -37808 -39415 -19044 -39292 -103569 -69833 -71044 -39665 -45789 -48080
14659 -48080 -44040 80963 118993 121950 96772 98487 140864 97722 93904 135475 53890 -54615
14647 -54615 -110417 -74626 -10826 -24391 -38220 -65973 -36494 4666 23183 12152 35593 -23693
14635 -23693 -25648 1265 78781 56916 11747 73690 45171 40086 28455 -16172 -94672 -159949
14623 -159949 -89438 -71511 -1720 83924 126257 90796 14350 -27539 -37305 -51374 -10242 32645
14611 32645 57475 34000 47655 13570 -1730 -61601 -96295 2201 -25948 -42941 -15916 -21732
14599 -21732 94453 98863 98051 23326 -72289 -102442 -68515 -74491 -101592 -49931 -9048 -43427
14587 -43427 -89618 -61097 -47488 104749 172285 91467 -6801 -68111 -8949 38871 45155 -13882
14575 -13882 -53227 -129445 -110649 6716 29604 53728 36663 -3248 -5781 4686 9817 4164
14563 4164 65405 71211 52679 92692 118096 132623 78963 115456 63806 39481 53378 103839
14551 103839 79716 -51176 -112024 -145505 -132331 -108989 -153814 -69704 -17013 -34086 -103164
14540 -103164 -153736 -112920 -116280 -143362 -58627 5565 64886 114990 -3248 -133910 -31420
14529 -31420 -36977 -255 -25397 -37610 -70504 -94779 -146756 -175249 -156785 -221048 -295912 -262092
14517 -262092 -66189 96567 116596 176540 34710 -72735 -2233 -38394 -49614 -62738 -81337
14506 -81337 -81640 -89981 -22570 -33140 -25371 -19659 -87617 -141821 -158740 -136460 -71873 -71748 -123177
14493 -123177 -63913 -20960 -15874 -56855 -8052 89007 105988 -16428 -46658 -2516 38843
14482 38843 9937 -66943 -16116 15877 -12423 66898 50774 -28740 -5279 22538 30474 -16464
14470 -16464 -45724 -19432 16132 120712 163553 75927 66065 68647 -10228 -60628 -20611 -67010
14458 -67010 -47604 -61297 -102997 -206163 -145612 -11886 -59870 -39649 -16068 -14657 -83039
14447 -83039 -9357 109097 119226 144175 209995 180501 151826 117453 137003 100473 -13293
14436 -13293 -40344 -25695 -60870 -46921 -76730 -58664 -46999 -18132 25803 91089 -30143
14425 -30143 -58662 -97502 -40855 21946 -5004 82533 64025 26103 53839 -7984 -107456 -130854
14413 -130854 -99959 -205178 -180828 -99423 -36897 -63157 -89578 -73402 -62205 -93896 -114032
14402 -114032 -158642 -98610 -67881 -90604 -120342 -90748 -121176 -93736 -7430 3048 -68575
14391 -68575 -46924 -76562 -106989 26476 58481 -34179 -102957 -117351 -53607 -45539 -24834 59976
14379 59976 27793 1701 -16130 -41057 -29203 70024 127265 4659 5884 25377 41049 53740
14367 53740 35432 -21402 -7968 -50987 21703 4639 34311 114734 107673 31080 -90970 -117419
14355 -117419 -41000 403 6114 70667 29651 37933 63765 89967 117906 110317 175317 81066
14343 81066 2610 23464 74575 100083 89543 126906 88647 32903 10642 18311 99277 65537
14331 65537 -1410 37604 162162 85912 18242 38332 59987 109923 8277 -39070 -31453
14320 -31453 -87884 -117525 -85900 -91971 21955 36994 48273 25755 27327 35460 17309 -74134
14308 -74134 -132559 -115379 -49932 29999 -44607 -104835 -109521 -88605 -55669 -48662 -63161 -23350
14296 -23350 -34857 -116746 -125571 -18021 64882 80455 135530 115226 48955 693 -77976 -54205
14284 -54205 -91519 -50713 37729 59812 1057 -50590 5236 22725 13414 18654 62678 67559
14272 67559 49704 21676 -19184 -43196 -44491 -20310 16056 95396 87148 26119 60630 24183
14260 24183 -73695 -59305 -69820 -90650 -100238 -37882 4453 14238 -1972 -56820 -108183 -136852
14248 -136852 -35024 30798 46293 -42428 -128224 -171248 -109592 -85004 -198914 -188328 -64489
14237 -64489 -62801 -114853 -128235 -114823 -121749 -87165 -69359 -79781 -554 100835 56976 33319
14225 33319 12471 -29601 -93067 -153787 -162271 -98422 838 -49020 -61367 -87215 -60047 -91734
14213 -91734 -86122 -40981 -59648 -19836 39363 29412 -37555 7417 84406 117649 99931 68589
14201 68589 42747 6783 47630 60275 71971 -64580 -107874 -68578 -34520 -23110 -36204
14190 -36204 24098 55421 2664 28030 60302 108580 97254 68484 32575 -50193 -130116 -93667
14178 -93667 -138126 -132850 -176567 -154876 -31106 67701 76091 115834 90998 38835 52393 138754
14166 138754 64936 -101430 -156484 -91894 -47372 29317 105 -74445 -91919 -96072 -139439
14155 -139439 -181443 -70633 -62852 -144272 -88480 -24340 -131242 -248767 -268313 -240063 -246820
14144 -246820 -163943 -67848 -34500 -46702 22812 42775 21624 10257 57533 56187 59938 99800
14132 99800 147876 158654 138759 146712 140716 100036 6982 -2999 48792 93105 33109 -71699
14120 -71699 -62265 -23167 -49146 -35041 -93241 -156973 -126131 -46073 7976 -29780 -48111 -80246
14108 -80246 -88885 -57126 44449 43806 -18029 -17151 -57220 -71521 -19802 7564 36275 -29728
14096 -29728 23162 864 -9191 -22467 29268 77607 111040 79393 101536 34841 -32337 -79539
14084 -79539 -77605 -47739 -66667 -87983 -91435 -54182 38976 51532 67842 69684 120340 72579
14072 72579 -20681 -34041 -77586 -132438 -82678 -62163 -41892 -11995 -65509 -121733 -129872 -80291
14060 -80291 -67126 -74711 -97846 -124165 -39809 78168 70938 -23754 -69577 -64709 -78600 -80636
14048 -80636 -36591 -37905 21708 89900 41570 -11098 7341 -13260 -54215 -15214 29994 59146
14036 59146 18304 11669 54082 18740 -14009 21911 2150 -73416 -63850 -81348 -109100 -88115
14024 -88115 -39576 -83302 -121363 -73670 -59931 -57950 9502 41926 51864 6191 -18656 -22298
14012 -22298 -41403 66215 97527 -19932 -11717 7666 5824 -21257 17051 51080 86106 59640
14000 59640 46891 -51846 -116325 -89432 -103303 -121478 -52227 -32752 -31813 6140 29298 -30853
13988 -30853 -96675 -151429 -78504 -29186 -124175 -207213 -217470 -143261 -76009 -56712 -47750 -25788
13976 -25788 36261 44509 64317 96863 139621 91117 50206 78110 49839 -21822 -83663 -116176
13964 -116176 -78064 -41835 -26833 -10393 46324 123421 112505 -2300 -49411 -58640 -47021
13953 -47021 -96398 -88090 -113501 -194571 -191448 -141632 -93948 -109194 -160734 -148725 -184670 -213878
13941 -213878 -168677 -130926 -84871 -69334 -92955 -43873 -63791 -77865 -43292 -36892 -17354 -40804
13929 -40804 -67483 -129798 -103095 -95036 -37757 9012 20415 103441 151533 166925 101367 -12017
13917 -12017 -31096 -67887 -96180 -96883 -65884 16973 49133 -25562 -152377 -179163 -108618 -101819
13905 -101819 -164857 -187483 -99662 -11045 61304 53574 58484 53612 30130 -24219 -132 77282
13893 77282 45610 -35236 -45332 -52377 -76289 -24451 -23331 -59296 -44449 -70423 -80481 -88020
13881 -88020 -55156 -44876 -37821 12699 3745 -31661 -24602 22189 45128 48709 5170 -85485
13869 -85485 -140503 -210544 -35973 30151 -5507 -164878 -203298 -113035 -63777 -85035 -16493
13858 -16493 -44741 -109310 -9624 76444 46380 2055 -106316 -117449 25901 13959 -18085
13847 -18085 67008 59650 32145 3453 -22058 -8314 26854 24477 -96429 -138892 -148632 -160571
13835 -160571 -147793 -147201 -85898 7468 91849 109839 93500 24558 -58993 12024 66704 48145
13823 48145 -31962 26496 107225 106134 20174 -61636 -139988 -146895 -139932 -173180 -131279 -93671
13811 -93671 -96226 -131837 -81434 -112132 -168107 -114395 -49918 -35273 -15781 2674 -55581 -108577
13799 -108577 -92874 -107559 -110909 -158832 -130065 -85086 -145310 -128210 -103003 -20079 793 39366
13787 39366 -57447 -51874 -4726 -46184 -82692 -54941 -52466 -81944 -39935 -2455 13528 -81158
13775 -81158 -98804 -66355 -14447 15710 -23289 -9265 32699 66496 58220 63404 24658 38945
13763 38945 28913 24706 -40349 -185563 -180054 -158212 -116120 -33914 -72736 -111949 -144700 -76171
13751 -76171 -63405 40808 114632 49469 4065 16847 77416 76075 65060 138191 112614 88162
13739 88162 46361 24335 -34075 -32231 -35278 -30244 -110241 -143807 -137231 -68107 -68789 -123205 -57472
13726 -57472 -20162 -87852 -86717 -22484 -39660 -43616 -73668 42093 13623 -744 -60834 -78039
13714 -78039 6704 90606 59308 -37996 -66290 34048 49232 -13236 -22494 -120292 -135252 -137367
13702 -137367 -86159 -133490 -43863 42502 6176 -85869 -105250 -49046 -17128 -79497 -94786
13691 -94786 -67497 49130 -42178 -114777 -116346 -70683 -39931 -48898 -46724 27324 36773 -3639
13679 -3639 17327 -6626 -33134 26631 -58049 -168784 -138219 -141721 -130342 -123916 -141160 -108781
13667 -108781 -39980 17192 99692 63670 -27754 -111385 -154725 -135386 -211156 -238204 -260300
13656 -260300 -187046 -79597 -141123 -199817 -152314 -108628 -106255 -141806 -96579 -14725 -18320 -87347
13644 -87347 -45225 68241 49387 16598 -24647 -11142 2856 -66500 -69106 -53813 27026 -11024
13632 -11024 -47088 -46633 -38652 30298 82237 -11631 -59581 -104746 -35337 74021 46390 38431
13620 38431 69902 115692 48438 67076 133187 135266 98484 79333 56915 22524 1071 45762
13608 45762 37318 -34575 -51987 -91487 -83849 -43050 -85548 -158539 -208666 -128709 -106175 -56701
13596 -56701 -112769 -78255 -64822 -37129 -80562 -81252 -85925 -58146 -39819 -39563 -119504 -75921 -62005
13583 -62005 -68384 -42477 -53321 -9005 46715 76072 -2844 7064 -13342 -43566 -33792 -8986
13571 -8986 43736 86215 64149 9899 863 -77021 -60818 -39256 8156 5719 -20362 738
13559 738 41486 42720 1761 -12934 1458 -11538 107174 68339 -21213 -53827 -12835 -62778
13547 -62778 38390 102886 -53872 -107875 -53806 -100345 -117320 -78044 -106361 -133287 -215672
13536 -215672 -201922 -168561 -160941 -126245 -67625 -44289 -35992 -35085 -98635 -139625 -72172 -78459
13524 -78459 -19396 65833 -14200 -100006 -93953 -71219 -108659 -136043 -117799 -62809 -20339 9084
13512 9084 -18555 -64037 -81919 -120072 -75385 23192 -14237 -101340 -76252 -83201 -28505 -22067
13500 -22067 -29221 90800 72037 -18267 -25158 -16387 -66400 8614 50557 46284 -26294 -52303
13488 -52303 -76042 -76548 -72824 12276 71026 121256 175016 144259 92051 27327 51988 20540
13476 20540 17912 -41332 -40403 -34687 -72428 -90602 -111731 -66842 -66670 -123262 -110080 -71788 -82411
13463 -82411 -31984 55571 -11749 2853 50943 19284 -23429 -36016 -24614 -18810 47846 69398
13451 69398 -12042 -77247 -103422 -57885 -42593 16027 -64361 -65566 -11013 -47657 -17715 31231
13439 31231 27519 68551 107370 98364 -30181 28277 19774 113635 162103 157516 67424 77575
13427 77575 115078 69324 -32573 -116754 -32583 27929 12250 -21882 -67310 1697 13261
13416 13261 29097 -77834 -82302 -48531 5515 26102 116562 126373 64987 20164 -30701 835
13404 835 15847 -16894 -71034 -153721 -207962 -160582 -109524 -61483 -80682 -104024 -120112 -70663
13392 -70663 48410 89018 -72447 -168240 -128253 -61634 -20548 19536 13345 46736 -78318
13381 -78318 -90308 6523 11908 -34751 -82766 -113242 -74131 -68349 -221713 -184374 -114443 -101494
13369 -101494 -70689 -108449 -69901 3985 41690 76488 44872 -7379 -8238 -96334 -117135 -114549
13357 -114549 -142321 -126812 -51816 -57974 -37560 28265 79403 52984 -9484 -32720 -40121 7510
13345 7510 100570 145157 139907 128161 116955 47183 20560 -29447 -4696 -45658 -18583 -37267
13333 -37267 -142304 -105656 -65379 -24513 16601 10637 117468 138910 59577 -26762 -62613
13322 -62613 -67354 -93455 -114088 -47616 -29744 471 10308 39706 45608 -90522 -175004 -164794
13310 -164794 -134822 -79174 -10470 -12945 -42039 15909 23889 -17015 -63103 -69308 -121841 -124463
13298 -124463 -49818 -24222 16066 37877 90363 21163 -25265 -14054 67804 117000 103255
13287 103255 75893 -14515 6388 -17536 -6919 7532 8223 -80523 -126950 -51897 -6154 -66566
13275 -66566 -87722 -43964 -11777 -54658 -19304 -14464 -41037 -89715 -86542 -69301 5579 131159
13263 131159 232534 206082 53229 -10363 -13023 25665 23845 39686 -8515 -16773 -38622 -30109
13251 -30109 18812 17143 -17328 -20524 -11168 -2960 8902 -75720 -28639 -38106 -27980 -4908 -24399
13238 -24399 60107 93431 56619 78991 47066 15512 8204 54899 52899 91560 11699 -45516
13226 -45516 -17797 -7478 -68491 -56741 6761 93979 37590 -40948 15556 51764 80182 43704
13214 43704 46428 87802 87913 99145 16658 -31515 -64723 -95481 -108071 -61660 79432 112222
13202 112222 102955 11333 -101490 -84984 12693 67282 22564 -25946 -57238 -43127 -22650
13191 -22650 -34742 -70206 -124635 -46607 -4716 -24712 -31481 -34318 52939 57596 12986 26123
13179 26123 -120 67477 19927 5185 -29912 -40392 -76070 -54826 -13416 45375 64679 10287
13167 10287 -20766 -119367 -98762 -58913 -93606 -89112 -158819 -169223 -80700 -29348 -26701 -51864
13155 -51864 -39378 -19999 -43778 -21270 -41633 76592 113622 86502 133361 157448 158608 55512
13143 55512 5034 -74769 -63173 -20395 32288 57340 77210 83412 102492 99811 69070 10423
13131 10423 -28927 -59961 -47981 -71794 -29776 55649 -27960 -75502 -15602 -29663 -2583 -3139
13119 -3139 58303 54901 83524 -10136 -132529 -80605 -86068 -76521 -25671 7319 65369 124650
13107 124650 30370 79986 123010 20512 -50440 -39596 -63727 -45381 -3737 27425 34143
13096 34143 95592 168159 123376 42952 749 1246 -1275 47838 75742 23391 -29335 -49384
13084 -49384 -44655 -34498 -64573 -25019 92097 66879 46760 82184 67044 53809 -20399 -57994
13072 -57994 -27001 77488 65183 -93306 -96244 -83903 -167784 -117453 -7452 40518 73818
13061 73818 14637 61837 133111 76222 -20385 -73 -27078 -57034 -81460 -121545 -106726 -56201
13049 -56201 -63292 -64092 -35691 14892 58759 56405 6329 20326 -65181 -176260 -91469 -83710
13037 -83710 -23149 54209 84175 39911 -74201 -81189 -15637 31970 61795 72248 57377 53467
13025 53467 -27279 -58230 8846 -21231 -64543 -80651 -52977 7959 32509 -16403 -85357 -69126
13013 -69126 -97616 -36317 -35869 -96807 -91984 71631 146321 73602 82892 107063 119275 4981
13001 4981 -72098 -98733 -60904 34902 119385 148608 53233 51944 -8465 -101892 -92257 -5982
12989 -5982 28297 2972 5460 100697 120599 60304 30916 40150 -38131 -80011 -14381 7759
12977 7759 42679 44813 13038 -33629 -28206 19962 53811 29018 9486 -20705 -41607 -91690
12965 -91690 -160740 -140577 -96331 -101649 -100028 -117325 -99860 -102175 -80514 -20980 37684 51931
12953 51931 -6542 -33506 -56777 -66660 -54051 -105632 -105459 -121468 -71787 -20862 78642 179221
12941 179221 125008 10508 -47196 -28248 -33724 27498 -17490 9683 79410 63422 52284
12930 52284 -9891 31729 103379 95071 52054 76864 51515 -14028 -17643 -38984 51039 -17435
12918 -17435 -110751 -111505 -50722 -23383 -72344 -36883 -55644 -64724 -48085 36105 65440 -50483
12906 -50483 -84378 -40765 -38212 3979 -21617 -82597 -103532 -41439 -6857 63448 26254 -11459
12894 -11459 -82402 -143043 -70398 36665 75504 64036 96171 70142 53638 78195 71898 42484
12882 42484 36871 58643 -5918 -82286 -138807 -217886 -148352 -57076 -78756 -161700 -109139 -66052
12870 -66052 -29888 28731 117896 63964 2148 14116 33737 74769 142678 214855 167537 84509
12858 84509 23854 52058 26849 -70891 -94347 -51774 -23045 -37787 42372 24837 101401 26119
12846 26119 8328 -15915 77294 102591 32739 62760 33828 32756 65849 54048 -17654 4804
12834 4804 36644 43717 -77991 -62715 -15485 -46628 -11794 111788 116794 51874 38990 -622
12822 -622 41148 79187 44378 -891 -49648 -131505 -118201 -133820 -75438 51642 90166 146045
12810 146045 133444 25376 -45981 -28301 -8169 19612 24273 40072 188311 247686 168118
12799 168118 90513 61214 88695 85589 142020 145318 209161 130094 58621 26591 19848 63743
12787 63743 104991 152933 33804 66478 105022 -5552 -63466 -98439 -136630 -120571 -101264
12776 -101264 -62479 3638 11828 55533 111811 54197 -84602 -131471 -168586 -124052 -82318
12765 -82318 -121194 -90378 -42938 -2181 6860 -83032 -118097 -99163 -56498 -26638 -77326 -23536
12753 -23536 -29802 -11576 -31226 -65524 -62039 -74699 -24358 2640 -42163 -91017 -82065 -15139
12741 -15139 24428 15672 -3543 26117 24820 -46067 20503 -19662 -9752 -6044 94698 209157
12729 209157 241447 174875 227919 206846 152389 79723 14004 41912 142144 101317 99785
12718 99785 27065 -39660 -40042 15095 12985 82604 129085 48376 81471 113012 94032 59686
12706 59686 -1418 -41353 -6708 83634 111083 90938 50731 51853 -2276 5901 54587 126195
12694 126195 96272 126880 153261 80902 -29900 -70386 -21294 4884 48262 73434 13237
12683 13237 38493 10146 60091 44206 94003 86088 10600 -18732 2839 11515 19393 101600
12671 101600 67288 38457 70447 -27354 2790 64647 82843 -42419 -54868 22227 13468
12660 13468 8460 -3911 -26889 -6324 27073 40521 52581 -23739 -62465 -76898 -102178 -79124
12648 -79124 -53886 -49053 43948 52360 -9486 7346 35287 89399 137838 199754 190799 201701
12636 201701 161938 88631 65001 18705 -1429 -16231 -68940 -52292 16309 -4305 28816
12625 28816 33021 47769 65107 67250 96331 119624 105102 24051 -23272 -88412 -71567 -74787
12613 -74787 -90940 10643 112004 67036 61525 -48824 -67921 -31674 59713 2138 -2371
12602 -2371 57281 81918 -14779 -76931 5284 23263 94438 121499 58240 22791 4445 40418
12590 40418 26019 44357 50394 91231 156350 206692 172233 236920 159886 4553 101347 217652
12578 217652 177285 139203 80761 65541 57187 109974 132613 128123 93472 -562 -38508 -11945
12566 -11945 -72088 -75636 -48705 -54283 -3106 32967 -1428 -23133 -56937 -138731 -111439 -15389
12554 -15389 -6009 -20334 -51198 -96730 -151000 -116467 -85312 -138762 -160696 -124742 -44261 -51950
12542 -51950 -82023 -74755 -6382 -35050 -40842 -43531 -13353 82019 126707 94234 99584 80808
12530 80808 47420 95831 51031 -18124 -12084 -85023 -126003 -140903 -8095 85270 35188 86933
12518 86933 139541 114422 91333 112296 53868 38913 41929 59566 122191 133193 125433 159004
12506 159004 86699 92359 92065 29239 17947 54532 32361 -62612 -49561 -65834 -12559 46689
12494 46689 22968 37778 81704 93631 89893 84081 -1387 -9771 -116451 -135842 -158137 -129596
12482 -129596 -78529 -84266 -62303 -34426 -25258 -51981 34072 108541 97950 83479 58097 29881
12470 29881 4781 -114 -34565 -49035 -26698 34687 1712 -50417 -46820 -88905 -121616 -73309
12458 -73309 -7721 64164 69825 8691 13165 11332 70455 46943 3804 -38394 19441 78099
12446 78099 56946 -4063 5790 72139 53047 -21306 -30436 -75989 -78532 -105931 -109677 -56260
12434 -56260 -114581 -102650 -125366 -87239 -22504 -20294 -37033 -61626 5158 40292 30944 3753
12422 3753 -3486 80041 78517 13984 -63401 -49906 16530 68287 64009 75178 77193 34058 -9681
12409 -9681 -17577 3279 -28618 -30273 81123 40112 31459 -29691 -170590 -137353 32262 62972
12397 62972 132634 114245 108731 39806 -44830 -8873 105362 134153 143631 33266 -52062 -39262
12385 -39262 106679 148225 141599 128052 109299 103718 23299 -22758 59820 86950 -21522 -94072
12373 -94072 -34315 26105 24784 -37771 42638 114559 87668 58283 85361 128757 131069 159752
12361 159752 54776 25801 48296 114116 210095 80652 -50390 -28611 -57732 -65572 -7503
12350 -7503 -17966 -23906 -14966 -142 47337 100179 59851 -9970 7144 99400 125991 100466
12338 100466 92778 90563 27997 39241 111820 149937 162500 163615 148049 136524 76169 -46672
12326 -46672 -75646 952 98721 147861 112890 110157 52902 -16074 -51039 -117009 -118945 -74159
12314 -74159 17041 63785 65811 51148 -38200 -35562 -21301 14743 44317 -271 49057 63162
12302 63162 72605 75118 12627 16483 107916 96859 72888 35857 26175 11658 22269 -12594
12290 -12594 -29805 -88313 -86167 -90582 -108467 -38642 -24120 36433 66771 22454 -8322 -59141
12278 -59141 -37780 -78249 2550 -16880 -47749 -56744 -76348 33506 -26709 -70728 -69585 -47979
12266 -47979 -19217 84939 150561 106995 -27756 -109218 -151884 -30050 29069 42233 7949
12255 7949 64360 91797 38051 3773 61431 97478 110822 73988 48181 18090 -62161 -91883
12243 -91883 39865 95589 15941 31862 7566 -46184 52458 159426 191773 136653 127552
12232 127552 111310 15189 40246 83766 57286 32293 123552 176051 44900 -10305 -31237
12221 -31237 43797 85818 41414 60811 33234 68825 65955 29075 89949 66856 72434 12800
12209 12800 -7815 -48572 -25648 16080 -3110 -4288 -52153 -87333 -140156 -192783 -120910 -101623
12197 -101623 -59129 -27056 -75701 -97565 -62536 -38964 -421 31487 57550 25455 -14961
12186 -14961 -11527 32683 -24970 91682 113096 90557 17053 -13143 72360 187223 220032
12175 220032 160987 126772 151128 112244 68161 121245 187197 192734 165630 53083 -940
12164 -940 68983 133666 86520 97288 148369 66730 15318 28101 10773 47122 121498 39998
12152 39998 -18441 13337 26044 52341 200427 300095 272983 188402 151088 67866 11801
12141 11801 49083 78346 82106 63788 77651 111367 145879 118236 136126 57855 4472 -74329
12129 -74329 -49272 -36325 -44839 -96399 -98153 -54561 50691 104757 174441 153099 171704 190545
12117 190545 149154 98762 134698 155891 55690 36806 -4661 -74568 -139240 -47054 -7047
12106 -7047 -56945 -83258 -73575 -136041 -176627 -174514 -80873 -48893 -100704 -82910 -98714 -68512
12094 -68512 -97180 -72405 4705 108484 98984 63706 75475 36671 44135 4501 39877 39591
12082 39591 29375 63960 99046 75834 42226 94392 129250 120355 169122 241292 217106 139612
12070 139612 75770 129346 142131 150156 174042 154720 94884 113132 23846 -52556 -10275 84793
12058 84793 144502 97763 65101 49380 55520 27123 -16334 -10298 -5863 15426 50151 85183
12046 85183 51940 -82779 -196160 -200187 -98122 -27562 -66719 -76634 -67233 1506 108449
12035 108449 155677 115241 107318 188138 153160 100760 108444 121169 104304 47136 -28304 12650
12023 12650 51990 126690 205474 161880 31617 -39917 -42485 18831 93631 50034 122997 111012
12011 111012 217244 249756 189210 225006 178243 96256 53770 -15295 8536 88224 42438
12000 42438 -31186 53621 109570 98065 79703 83636 65336 21130 9085 47669 86688 19213
11988 19213 48969 91603 127163 187898 177544 84680 58679 67321 116183 153173 137077 108251
11976 108251 -10675 -11999 42755 40548 41418 123508 126966 49396 8551 10182 72962 121053
11964 121053 69571 66550 -19188 57095 137072 113765 58212 101455 182685 151611 71167 -5738
11952 -5738 -86927 -89364 -10118 -27638 -114122 -180302 -66464 -23030 42609 63829 76375 -25033
11940 -25033 -64473 -96661 -94508 -45646 -8988 -22911 -96233 -121630 -156208 -125301 -53941 -78536
11928 -78536 -119399 -169113 -90454 -45214 -25388 -33923 -25797 -45315 5023 81608 106601 42203
11916 42203 24183 7958 -30835 -43965 -75249 -75527 -54881 -21945 46278 45713 62133 118267
11904 118267 111271 35437 18799 449 -42242 -37629 -6142 70298 67184 -6135 -10613 66216
11892 66216 97576 79827 77389 138255 145726 179380 164242 169856 89605 95680 83428 -20135
11880 -20135 -111989 -11215 79830 142252 112814 6469 -9768 114810 159643 203116 184111
11869 184111 146309 69307 91562 86985 90738 61018 139354 277669 311090 285353 244718 215559
11857 215559 164648 116965 143978 152966 170717 211690 211101 115156 90570 81809 80138 90403
11845 90403 144521 140325 127933 200142 218599 140228 82461 31114 -16547 10977 92346 128328
11833 128328 79839 3669 18223 -417 -1827 -53969 4607 11744 -4089 47805 70126 101668
11821 101668 168797 240507 216136 172804 209200 224328 127606 74619 62060 54557 139651 139582
11809 139582 84866 13875 22880 -10973 -4951 83162 127106 71637 98532 115495 156949 165764
11797 165764 154090 184200 173619 181192 197343 175310 158594 111496 80325 105220 146902 186312
11785 186312 124660 103752 210859 249976 94634 -20956 50503 130635 120378 172565 155824
11774 155824 151101 53686 -13461 42850 146982 180923 257378 292672 271235 175753 62037
11763 62037 56157 113782 76888 69391 77966 15968 23523 70041 188130 282574 245202 184332
11751 184332 136945 143953 162733 135495 191609 136980 112529 155604 205100 223042 268419 331344
11739 331344 286347 174234 129938 154596 218620 180710 154209 169236 155255 169216 186901
11728 186901 187288 199418 161213 163034 192623 181369 257487 292654 247422 204475 206252 161417
11716 161417 168110 133797 55307 101823 101755 48619 40825 125855 155583 120365 181952 198192
11704 198192 233325 156293 177349 171717 143208 54242 78202 118160 135984 118686 80518 22447
11692 22447 40264 144832 115597 136577 141927 140933 150208 117150 115150 196457 261350 254013 207929
11679 207929 175782 155829 198540 234284 284581 279745 230452 132451 84159 23726 59750 167896
11667 167896 169825 163914 103727 148327 137960 162097 112010 31140 68427 86748 89363 18325
11655 18325 -21287 37960 127581 111493 79795 89052 167830 153710 209231 170668 73374 93647
11643 93647 128620 200732 231614 174306 109430 149500 165849 199306 173979 176231 185947 109602
11631 109602 145377 195737 223456 277609 317308 310811 279017 248964 305877 333096 371584 351786
11619 351786 335402 362258 405090 393823 427843 498763 529009 467337 370642 317712 328397
11608 328397 215949 261107 325107 369984 370350 341257 275514 296170 364770 416521 412495 381202
11596 381202 461445 510754 430543 378103 314974 345713 360771 382973 387712 412490 414298 439060
11584 439060 437675 379862 379943 364339 301850 290948 367864 371081 298873 146477 129627 163577
11572 163577 146336 230552 294142 291885 349524 328127 322652 268926 233108 252583 255137 173661
11560 173661 130876 135900 179116 224207 220186 172914 128155 146752 152983 140541 117612 109254
11548 109254 197774 245933 267604 294987 352320 268021 143596 122940 272727 298452 265253
11537 265253 251618 210744 152701 99660 180858 225654 182967 94517 104078 117354 118375 59814
11525 59814 43885 70271 189096 206290 192458 277523 262461 268465 277191 255207 292461 248456
11513 248456 171833 184622 263232 256926 242841 261058 254853 295790 413479 536429 527914 483738
11501 483738 480200 544005 655181 714998 666959 624008 720236 874819 1077432 1159592 1194228
11490 1194228 1347780 1417770 1429600 1426767 1539410 1654058 1738661 1860239 2008215 2116994
11480 2116994 2082396 2028299 1875562 1779747 1607862 1400887 1252809 1177991 1133947 1040412
11470 1040412 1022352 990681 940276 937643 864698 772170 731872 758955 735637 652219 598427
11459 598427 610021 596312 647242 684664 705445 671129 712190 642832 608120 624829 577101
11448 577101 480092 449603 473994 546923 557194 500667 476564 421125 372533 345118 376487
11437 376487 409970 502829 526250 498861 468814 493272 492412 513855 446122 313446 290767 282355
11425 282355 342927 386340 361148 367835 461930 526641 525680 456148 373573 264223 241446 352302
11413 352302 434035 504115 451233 281041 237577 251759 281573 346989 365233 294883 240134
11402 240134 238395 271999 306861 351073 367088 385490 441415 477638 525138 603066 552468 462649
11390 462649 523223 595016 621169 612989 520746 436911 521096 469537 416131 384733 356422 419302
11378 419302 490744 470624 461471 513685 577362 634707 658280 652266 571401 495859 518458 638265
11366 638265 660312 658723 784256 767275 729587 793131 863808 929069 994937 1058148 1104231
11355 1104231 1088431 1030238 986578 1037364 1091703 1103838 1078796 1002201 1040735 1136648 1216317
11344 1216317 1217148 1271388 1197596 1131603 1200226 1298336 1282657 1263759 1239500 1187670 1122569 1090663
11332 1090663 1154272 1200901 1148616 1181480 1230115 1216071 1297525 1327186 1260592 1231126 1244891
11321 1244891 1168317 1075697 1083275 1037512 934569 874212 857909 717409 729228 804999 870381
11310 870381 873893 732006 643116 651620 715229 788228 789118 675689 699910 700465 730255 744703
11298 744703 645502 646645 618897 561546 577663 671083 652087 614238 585290 661883 650119 610945
11286 610945 495575 492925 597231 685916 674231 556222 524144 567582 545636 648375 632124
11275 632124 713796 733702 686326 649590 616234 622015 675357 673486 611678 602206 619382 613974
11263 613974 632390 669237 700672 643753 671938 691841 694823 718397 696783 756589 849062 901286
11251 901286 917308 940291 863247 857970 946484 1090058 1117967 1144404 1215240 1252993 1267173
11240 1267173 1358550 1512875 1592362 1631717 1709291 1756071 1786321 1909969 2145319 2238724 2337527
11229 2337527 2531901 2702513 2862984 3035100 3148106 3367768 3534775 3588452 3714075 3977327
11219 3977327 4229921 4468060 4606297 4736378 4915997 5023762 5089905 5140285 5292639 5393680
11209 5393680 5479630 5519594 5574699 5682128 5584688 5448820 5347980 5204106 5069783 4950051
11199 4950051 4998822 4906665 4707756 4620500 4466150 4177014 3985366 3771265 3396068 3112989
11189 3112989 2967799 2909581 2818178 2637052 2482473 2450646 2466379 2452234 2430979 2395152 2343889
11178 2343889 2277687 2264264 2249243 2271741 2254545 2253696 2204827 2133121 2067659 2000523 1895318
11167 1895318 1839307 1796345 1795500 1802297 1799059 1803720 1857204 1910954 1864105 1860888 1841109 1836922 1866442
11154 1866442 1851753 1777413 1641761 1637400 1829331 2026452 2119893 2098152 2162844 2242267 2299462
11143 2299462 2339510 2365586 2384383 2432190 2493776 2560451 2619732 2692493 2681724 2682428 2656901 2720867
11131 2720867 2782178 2887383 2997943 3063584 3204451 3420812 3598971 3726905 3850906 4015028
11121 4015028 4209142 4480029 4815596 5159694 5417678 5797751 6217782 6635863 7028619
11112 7028619 7439502 7942936 8467508 9110084 9735104 10406117 11181902 12035939 13017950
11103 13017950 14029794 15159232 16348431 17580875 18913111 20442193 22238508 24188980
11095 24188980 26528296 29229436 32122444 35274391 38617724 42332439 46450435 51203095
11087 51203095 56727011 63246115 70944835 79805266 89925120 101552072 115197781 131257202
11079 131257202 150019744 170409678 189057945 202378597 212696309 227613379 252861219
11072 252861219 287395224 312268955 313496300 301472478 280210920 247079292 210853941
11065 210853941 179413213 154166491 135264238 121531099 111328131 103137875 95596252
11058 95596252 88450274 82040559 76215282 70989743 66543133 62763486 59423883 56300339
11050 56300339 53374334 50673540 48282615 46046203 43969237 41864079 39820435 37904177
11042 37904177 36052615 34412219 32914179 31532874 30277098 29062352 27928258 26973250
11034 26973250 26198954 25421659 24654614 24007214 23416695 22974994 22602505 22139973 21691901
11025 21691901 21328291 21035199 20656991 20296605 19985882 19715202 19392887 19048064 18760770
11016 18760770 18487571 18253662 18058180 17850808 17697547 17457875 17182864 17105784 17011189 17034370
11006 17034370 17092621 17080905 17024289 16938795 16868071 16824568 16805148 16716973 16661614 16556819 16499903
10995 16499903 16457282 16397279 16326764 16324439 16375838 16422754 16566442 16637775 16663310 16629167 16620123
10984 16620123 16689967 16809240 16862702 16860413 16915886 17016317 17064874 17111141 17142403 17319395 17445328
10973 17445328 17609639 17705798 17722274 17871763 18008216 18027817 18069235 18190518 18339041 18470083
10963 18470083 18553284 18567536 18506838 18448256 18350451 18325953 18144098 17955999 17867616 17611569
10953 17611569 17463964 17172527 16786416 16412410 16148208 15793844 15306109 14936360 14618869
10944 14618869 14299108 14006899 13634682 13271606 12779959 12394786 12103368 11787732 11505641
10935 11505641 11251848 11080120 10993913 10855609 10710900 10555641 10286615 10046796 9872410
10926 9872410 9684964 9581207 9455419 9262513 9065794 8856109 8624176 8473729 8385431 8262810
10916 8262810 8119835 8112052 8059511 7943190 7905495 7728127 7521946 7434169 7304774 7130257
10906 7130257 7032040 6975295 6915926 6774444 6722559 6669077 6642328 6575560 6419473 6344970 6262320
10895 6262320 6155541 5997007 5909418 5879547 5914967 5787985 5680842 5651013 5600514 5475471
10885 5475471 5403988 5316927 5203006 5181261 5301882 5284381 5112516 5002086 5011536 5036892 5002353
10874 5002353 5075177 5107630 5014345 4862408 4762728 4646544 4517471 4409845 4173754 3893009
10864 3893009 3717505 3546139 3343669 3227962 3112903 3005299 2941982 2867180 2752176 2687413
10854 2687413 2528788 2356922 2191197 2025705 2009414 2020953 1965494 1903932 1745858 1653511
10844 1653511 1624187 1479090 1325351 1311631 1261563 1158720 1126535 1140944 1163427 1011831
10834 1011831 881608 890576 953757 913946 865874 767279 800591 849592 802580 680143 587748
10823 587748 635772 559881 488793 551382 580016 541740 531697 455735 484680 516670 448681
10812 448681 392531 364550 343827 356434 391905 387438 496804 467329 476513 545300 517946 426718
10800 426718 468553 567516 542048 564004 609377 626989 575826 663976 670739 604380 607404 521501
10788 521501 441264 517234 597149 690653 744274 749174 695886 769627 801166 826478 836716 874691
10776 874691 918499 969674 971971 1019382 1037688 955005 881811 869186 907884 908792 910098 924046
10764 924046 919648 894334 904901 881618 908837 942890 955017 958330 982658 972882 1037300 1014388
10752 1014388 1028951 1008579 982514 985607 989407 1069453 1159793 1215824 1318751 1340552 1252248
10741 1252248 1212860 1154176 1181487 1205466 1134482 1116948 1180336 1216691 1232610 1164294 1155625
10730 1155625 1154601 1144956 1184394 1225354 1240744 1174407 1116777 1084765 1028364 1013666 1128299
10719 1128299 1141059 1026173 1066858 1168171 1157330 1129311 997672 928727 874628 861089 837219
10708 837219 794496 802706 794639 809580 765979 740699 756229 739935 715113 684816 624818 612927
10696 612927 574864 596058 630975 607834 560866 490036 494331 527049 543603 542844 578137 526816
10684 526816 467938 455645 481462 490675 418394 450762 473694 404048 402515 457399 451606 556452
10672 556452 531782 474559 519037 495414 519626 561103 669748 798068 915259 980137 1038455
10661 1038455 1107534 1195252 1253479 1384791 1515675 1596081 1702262 1726516 1692357 1596170 1389251
10650 1389251 1152400 966183 927417 924820 820869 698127 548209 494013 563894 571088 512760
10639 512760 477141 511811 410499 324597 300700 315951 331495 383196 455907 384434 269599
10628 269599 313912 364747 355644 287358 254237 201365 229696 287508 363369 325888 281933 253513
10616 253513 297383 417389 442345 472333 505057 479099 477056 411568 304380 270619 301495
10605 301495 346930 367288 400985 481497 473075 477595 430446 458331 524151 547560 430458 373336
10593 373336 432313 393454 296846 298522 320946 314979 340197 304469 365227 413898 396202 389065
10581 389065 402628 404590 431698 484474 427193 392825 379677 394119 435210 458595 403353 378416
10569 378416 361991 328289 311285 300434 269798 356712 429809 431438 446234 422700 340415 345207
10557 345207 336482 371612 392926 423392 430936 354404 307023 314968 261519 247252 237044 225231
10545 225231 129953 186063 220152 201284 240204 247636 181356 117228 117026 104004 181548 198552
10533 198552 163253 124490 76958 30567 122853 174455 74465 71211 79028 94466 175674 196578
10521 196578 195339 136775 150246 210197 229892 124370 60376 91282 26008 38295 35659 43677
10509 43677 26527 25143 90890 136584 111100 58411 47049 5412 6326 76406 30625 -100147
10497 -100147 -191880 -150332 -134366 -92782 19556 37028 -14234 76318 89920 90775 120375 163345
10485 163345 112344 20119 -46853 -47446 2668 -25255 -97074 -51448 -80309 -136420 -148669 -104346
10473 -104346 -83657 -49361 -103440 -62562 -96282 -69695 4381 69469 67379 115801 63953 -71337
10461 -71337 -92369 -6240 36247 88324 104546 78921 68306 55574 45630 47344 29149 71676
10449 71676 194900 202112 110578 51604 -23038 -32618 43771 64142 82937 125904 129495 201712
10437 201712 206575 145154 156880 140153 139001 129326 -317 -43593 44682 157918 144386 63004
10425 63004 31666 37729 152312 170929 164730 192293 202740 210152 277062 339936 293277 222367
10413 222367 136340 112290 182002 185418 118948 73153 57271 -6687 -41064 1197 103295
10402 103295 213401 291939 264169 143178 184225 256685 264762 237653 147656 54267 -34762
10391 -34762 -3331 103126 152264 172115 159494 131855 111616 111255 88543 173416 135610 48897
10379 48897 41831 40289 -39265 -38542 34630 30825 -14239 -45635 28301 120204 72975 -38405
10367 -38405 -2050 108882 108332 85011 93307 106795 130398 101199 15587 75143 119876 138583
10355 138583 138579 127805 174191 143883 87973 -35969 -138209 -146344 -32539 -1973 19545 -8383
10343 -8383 -4815 78027 76222 -9849 -43423 -96068 -88525 -97742 -53468 -43358 -89222 -67748 -100155
10330 -100155 -140110 -175021 -134915 -132419 -104262 -166241 -149041 -45496 51898 7654 93547
10319 93547 166006 155732 153936 178722 102756 80452 -41021 21439 76927 91478 119254 117796
10307 117796 49534 67458 23783 8009 27032 36597 75236 129516 95798 126532 118395 99479
10295 99479 81251 29679 30827 16662 -37892 28568 76434 47969 45420 50388 106807 61494
10283 61494 36622 77997 124935 136922 54438 -11317 -7021 101402 166813 269168 255546
10272 255546 148098 61366 152006 155408 59405 98502 21799 19328 61166 10587 40812 62074
10260 62074 40141 78403 131279 144616 113041 110297 99381 26468 71573 17091 20418 172758
10248 172758 209887 126749 108105 34493 70572 149373 137148 143546 149052 134923 102282 87709
10236 87709 28513 -45048 -70095 -33868 -8540 -3354 70654 88459 72636 54688 99636 138796
10224 138796 79687 -23395 -65778 -33523 -59427 -60184 -29390 136400 148555 90838 29751
10213 29751 -21518 -31478 -14905 38899 49999 78272 -35831 -87685 -129992 -153104 -157634 -149639
10201 -149639 -75178 59913 24473 -24812 -65920 -19280 -63781 -101406 -114789 -66990 34782
10190 34782 120352 110794 129733 96399 112016 67301 68614 39260 18811 -119151 -156096 -149381
10178 -149381 -126346 -95619 -136373 -168801 -148398 -112762 -48160 -42109 31922 -15879 -26459 -31066
10166 -31066 38699 48026 51893 123127 135610 45988 -26315 37459 78529 23783 111018 167870
10154 167870 191089 151003 143957 52453 78277 123488 156881 89481 151485 195371 91150
10143 91150 70006 78533 17695 -6104 21725 -25393 -64193 -31424 19148 8122 -6747 -26090
10131 -26090 5782 -64697 -130480 -93940 -20601 2147 -11298 -18543 27416 41134 -17823 -62312
10119 -62312 687 -39049 -37307 15598 1951 8556 81295 54438 -16729 58247 122804 121102
10107 121102 161776 151745 100023 66194 70767 147472 178568 110098 -6468 -18580 -23169 -48047
10095 -48047 16109 16141 30370 61277 33295 89922 139486 135944 102542 143217 256062 247595
10083 247595 217894 177690 133351 110155 9149 15457 46921 42667 100240 148448 121477 18227
10071 18227 18203 54006 -7755 -44438 60766 70609 17611 51173 71354 43135 7151 88829
10059 88829 77585 59210 69730 -13089 -73152 -126400 -61051 30473 -105477 -202209 -142983
10048 -142983 -20544 -39458 -75635 -43604 -68405 -56494 -31697 -64465 -68306 -19141 5745
10037 5745 56115 66997 73698 52868 13841 -22523 -69681 -90772 -58783 -90021 -152428 -143124
10025 -143124 -15163 85672 -343 -26574 -68848 -98841 -23606 -2925 -10265 -12894 46561
10014 46561 6997 -28906 21061 57419 -74271 -213513 -191759 -109071 -74533 -14658 2066
10003 2066 -3429 -2112 11522 -15833 -16491 19203 -3666 -39496 4724 12229 100399 157843 86498
9990 86498 117093 136407 100294 58781 34560 122261 154329 165238 216257 231506 207925 208038
9978 208038 196226 249318 184603 74181 105369 155818 170975 118370 138510 190147 137550
9967 137550 28326 15858 -12026 23499 43373 72872 42039 72367 -12740 -28811 47853
9956 47853 127352 78651 28149 22730 11221 -24902 -88237 -48811 -13022 39795 29471 797
9944 797 -37339 -37166 -32425 -26701 -58414 11436 73239 118248 74014 23894 -8192 65925 71881
9931 71881 53921 41372 -65933 -59608 -46364 -57777 -58388 -19588 36196 56626 -21346 -120221
9919 -120221 -185035 -109428 -81324 -9487 34188 -17616 -32303 31555 -1155 7016 -28417 -74279
9907 -74279 -3308 54815 119176 79086 73287 -20267 685 2850 -58794 -163102 -139830 -58360
9895 -58360 14949 7667 -29432 -22382 11827 -7812 66721 71649 66694 16557 104397 110746 57016
9882 57016 56215 86820 107931 27896 -51851 54369 162966 189729 147358 93778 119455 188718
9870 188718 177842 301142 331198 176381 109688 149955 138426 173318 182501 223836 282023
9859 282023 316407 345601 480236 485696 513381 529950 574436 613128 603182 673403 758862 789131
9847 789131 791736 866067 1060655 1166978 1176298 1138960 1094217 1048304 934397 888674 894437 822125
9835 822125 751992 650150 646408 617075 582866 574911 514293 475668 370510 215420 185983
9824 185983 188369 150317 221475 188510 155585 184199 267543 316352 230867 253738 273666 235462
9812 235462 201467 143434 110300 103920 153126 143368 87744 26825 66953 100314 82051 52357
9800 52357 12981 51898 91577 96137 48658 34004 16026 48643 63184 73806 111123 111648
9788 111648 45666 6650 32628 165202 202620 220870 122273 54452 4485 -14526 22483
9777 22483 -4323 44896 220549 224660 126779 99722 52675 4937 55541 87014 79455 36052
9765 36052 109965 134526 130272 96123 100706 80459 18463 -11460 6343 91488 142755 186817
9753 186817 157108 188440 193011 147954 100998 138186 268749 314333 318249 291930 278552 204505
9741 204505 212542 221935 165691 129035 176656 217284 130775 198768 180544 178397 211602 220717
9729 220717 165178 140473 141640 99368 9627 -9757 57017 66822 123057 174552 150402 94311
9717 94311 39169 90928 94769 97717 116422 83433 96813 133317 117735 168855 179632 217629
9705 217629 208329 147580 109836 120982 136320 140390 118821 157748 120496 82650 38672 47047
9693 47047 28325 2714 12668 75096 96171 64241 21556 9231 -18984 -22848 -47948 -59197
9681 -59197 -10815 8695 -7426 13962 -93090 -87244 -12274 84987 74388 46923 -2801 -34664
9669 -34664 37538 63624 93040 123253 111604 165696 173326 121096 171653 162857 117753 42105
9657 42105 64087 13121 14668 95734 164316 124216 126993 80271 58385 94801 -5521 -19781
9645 -19781 56120 75911 97271 67626 75655 82649 524 -5563 53106 30548 -32228 -32333 -84872
9632 -84872 -102382 -41036 53829 95489 36247 7159 38040 1989 -1633 -65007 -26889 55413
9620 55413 42809 -14890 -32409 30965 37097 48121 130327 97637 17718 -11995 47506 52196
9608 52196 -10656 -15129 -36907 -66950 -8821 -11334 -33248 -35526 -49342 -18484 -36310 -96434
9596 -96434 -108870 -14510 102503 55058 -8937 19195 3606 -65677 -85097 -43492 70096
9585 70096 181496 163258 101478 118573 188789 158027 90985 132336 147666 200609 222748 187875
9573 187875 51868 -34066 -72648 -38922 -58604 -58290 126295 177467 94031 27283 9034 5251
9561 5251 -34118 49635 107368 126994 49086 90559 81040 68973 130043 177074 153703 110633
9549 110633 -332 56190 48470 53048 48593 24702 76856 148215 130630 17533 -4846 22882
9537 22882 -3407 855 24284 49533 115702 76713 17034 83392 117328 99956 109940 51565
9525 51565 -29000 -37609 30553 11831 26696 1626 18116 7840 35429 -6269 -62375 9462
9513 9462 22792 23534 79835 38817 44037 70551 119762 37450 -4666 15564 71733 69083 134687
9500 134687 187420 150442 158102 148122 114629 33680 21396 98471 146696 114537 110615 132873
9488 132873 112625 116394 166678 177808 115867 21430 70375 121675 177268 193645 193866 147009
9476 147009 131782 131679 166181 222465 278101 301938 288931 222848 214493 136057 63252 136936
9464 136936 252448 249769 228784 245457 299878 368214 288467 170596 113945 79693 27162
9453 27162 16288 21434 119727 145232 162050 243614 288856 183094 151300 179127 236902 291214
9441 291214 234170 129207 152508 252046 277852 163629 138584 70778 85225 69447 19739
9430 19739 28245 91484 160981 87983 151036 223004 222167 157658 179304 158773 84706 82411 63639
9417 63639 6213 116201 133546 74663 45082 -3723 24462 65656 30947 71240 114935 130147
9405 130147 126179 154841 129062 56170 169318 192403 175553 120353 81545 100337 58988 101583
9393 101583 73127 124364 135233 124125 161611 272359 294012 244054 282536 295833 253814
9382 253814 177174 175909 133801 225350 234045 218922 198729 195707 233111 222870 179471 203314
9370 203314 212453 323274 260632 205841 143339 158953 235333 260105 273301 278800 312750 361726
9358 361726 417970 368407 312220 293719 242918 253305 332671 428501 505349 488867 395824 367863
9346 367863 491452 518117 608640 615806 619718 630282 668024 765678 829110 864417 848391 901689
9334 901689 1000344 972884 941207 1026237 1141662 1151052 1175359 1188684 1189382 1138008 1104483 1120218
9322 1120218 1139642 1116397 1153407 1256649 1207055 1031933 952984 970349 977987 986273 1013163
9311 1013163 1049598 1088085 965204 832023 790552 858088 820343 749102 594318 529491 531896
9300 531896 636487 655126 550111 464907 404693 374761 413218 383336 471797 487467 500112
9289 500112 482072 453937 422099 417974 429826 436105 431722 470877 485188 505280 471892 328257
9277 328257 294245 265413 229081 286372 308856 344199 396442 430443 405738 389866 429237 534139
9265 534139 548951 473220 437901 395909 441603 522101 612932 596337 626571 627482 685869 724297
9253 724297 700498 666501 647114 606870 602255 621979 530593 543672 580247 594701 591964 654671
9241 654671 786976 868867 906654 933970 899423 900283 956715 952401 1084957 1219422 1262602 1319078
9229 1319078 1454122 1548879 1651766 1759603 1814207 1906406 2079304 2285626 2400789 2464798
9219 2464798 2670638 2931691 3159789 3358196 3666778 3979954 4255975 4562961 5057992 5604605
9209 5604605 6261068 6897661 7571043 8259396 9075423 10131039 11325553 12634515 14203763
9200 14203763 15979075 18019824 20410838 23165796 26470515 30420287 34608316 38311500
9192 38311500 40850237 42726663 45663829 50904073 58250210 63180461 62993963 60394612
9184 60394612 55868684 48872575 41422197 35079782 30066207 26401878 23770460 21766420
9176 21766420 20126770 18620141 17188675 15944018 14862264 13903695 13087698 12295565 11554317
9167 11554317 11010706 10384865 9801006 9213548 8759972 8331542 7966469 7654470 7296504
9158 7296504 6965843 6664890 6384994 6129051 5834866 5509964 5326476 5158453 4991509 4900472
9148 4900472 4869183 4840641 4728331 4524667 4368920 4335063 4284516 4283352 4297576 4187020 3985691
9137 3985691 3926486 3966047 3937854 3878690 3827740 3789689 3811280 3732746 3554751 3402612 3357869
9126 3357869 3398804 3338899 3416862 3487983 3491843 3581763 3550708 3444260 3314722 3238993 3230951
9115 3230951 3261375 3218861 3232766 3200993 3145086 3151106 3198344 3254944 3328548 3334593 3343059 3394562
9103 3394562 3443092 3449712 3413276 3410912 3421393 3395001 3415977 3413820 3439801 3462184 3548795 3581038
9091 3581038 3613668 3570964 3581307 3606602 3634159 3715139 3768039 3748889 3746430 3763941 3792269 3851478
9079 3851478 3896799 3796797 3762317 3770955 3747214 3662647 3573804 3616006 3680397 3619352 3628704 3626309
9067 3626309 3580258 3443131 3288100 3126226 3008790 3013422 2940879 2901345 2821684 2818170 2733028
9056 2733028 2557240 2446669 2323955 2249515 2220059 2169821 2099170 2115685 2116431 2144633 2133792
9045 2133792 2126334 2064132 1918261 1776957 1793870 1852831 1789997 1789367 1816570 1758230 1791549 1775415
9033 1775415 1685042 1645971 1699161 1640035 1584043 1670942 1647947 1601416 1537800 1544075 1515421 1529529
9021 1529529 1496596 1354075 1299611 1322486 1271048 1298655 1346811 1304394 1282245 1269140 1255840
9010 1255840 1265641 1228487 1217741 1233147 1215085 1188437 1185117 1181698 1129148 1024822 1023181 1018116
8998 1018116 1015769 1036488 1099171 1084109 995710 1059896 1112662 1063114 1090543 986227 952834
8987 952834 1030688 1156417 1093114 1055641 1033250 949157 851070 712203 635692 655552 605435
8976 605435 565127 622089 601824 542782 521235 456111 457714 495569 519174 438953 401109 374042
8964 374042 380689 397948 381496 403386 467444 518562 481258 408991 368131 309866 245862 184662
8952 184662 164875 139098 124945 136686 82216 115815 132152 142654 184128 159494 131416 134837
8940 134837 131245 119781 121212 182033 232775 256914 294214 201475 67472 29100 66121 95680
8928 95680 69198 7199 10412 10059 12741 88534 174339 161918 193089 163475 132830 172441 221253
8915 221253 166863 113298 132294 171667 246941 220398 123349 94724 136121 121229 260064
8904 260064 354138 299547 207513 140911 162726 195572 154408 139124 194441 152877 154870 138274
8892 138274 205006 194606 220964 225722 225513 270172 295408 262301 234389 167837 133639 197264
8880 197264 310670 353143 349696 364685 353338 306442 321242 353410 476245 584860 651303
8869 651303 604442 525425 530770 598012 556253 532502 559328 581417 497141 442510 419235 363938
8857 363938 334624 338709 275140 267278 301251 395392 379124 329760 325965 408428 402423 375101
8845 375101 351014 288560 242743 284524 278905 220477 260890 326914 354197 340880 303018 315108
8833 315108 284488 235397 200880 197928 218684 257198 183486 90769 137416 269755 255824 220033
8821 220033 197833 256366 233434 134829 84685 49695 126265 194270 198361 230813 240674 186085
8809 186085 247613 227172 195272 182039 190439 278529 276470 263896 236778 314813 341998 210293
8797 210293 143353 123661 90319 111832 101377 6356 11158 155353 176569 158528 85437 111898
8785 111898 162086 163745 165957 130805 115720 173415 151616 35880 19660 69959 89012 39738
8773 39738 -16988 66706 168346 200587 121548 -3471 36129 159288 238284 226415 174305
8762 174305 143551 171822 126249 134482 198643 197598 204613 259487 233486 119537 76611 88457
8750 88457 114174 154952 127449 56095 120692 210493 265800 194780 209807 224251 290138 279204
8738 279204 240963 301279 271613 230212 250005 210454 240944 188279 250618 321181 328889 339507
8726 339507 355305 260728 168387 166069 225990 346023 348216 303408 378763 398054 355552 340936
8714 340936 349241 352234 421995 415262 374648 398736 326471 391289 389462 408565 423072 477020
8702 477020 445231 311122 294615 363806 387608 295521 269778 368558 463411 446306 420730
8691 420730 395709 377807 361233 372496 432185 461855 455052 407503 427565 441388 486357 456258
8679 456258 459692 462554 463831 453546 345859 316692 297003 392178 390129 398236 426108 430946 463957
8666 463957 549930 480323 492333 485717 402642 393599 522766 641305 649862 578046 533523 568293
8654 568293 582248 634994 553649 606464 696692 711814 651507 663596 674853 808495 895823
8643 895823 903710 938746 967000 965339 874923 816558 839832 891566 818282 768308 847062 936864
8631 936864 1035519 1115941 1097477 1037567 1085236 1114349 1142366 1143133 1191389 1262912 1323370 1353355
8619 1353355 1410409 1521860 1480568 1439026 1537076 1674006 1707745 1706601 1602925 1609618 1676199
8608 1676199 1692962 1623685 1635273 1699476 1738710 1815696 1819257 1908616 1985185 1891710 1831959 1852501
8596 1852501 1882748 1936725 1919865 1889710 1907643 1914847 1825466 1740074 1713995 1666170 1523750
8585 1523750 1376472 1246855 1156646 1137286 1096137 1106999 976005 866213 853123 859614 826826
8574 826826 773067 722626 717730 690019 770190 808309 779942 674440 618171 588874 641145 612311
8562 612311 584954 618390 627872 586463 517606 547218 668454 730219 617685 596863 664506
8551 664506 688527 616235 473742 364087 411649 516612 549988 543925 571954 482953 398680
8540 398680 468248 526614 481611 497154 506539 480195 492988 497430 526186 523364 601822 554618
8528 554618 450649 396998 378538 324039 350843 400781 459257 477311 448557 468036 519965
8517 519965 428378 407348 463908 523923 639468 623608 531650 462552 511773 560531 534759
8506 534759 486336 391402 331479 364399 383117 427745 462813 491130 365580 312768 311768 346321
8494 346321 289944 267071 294937 312562 369306 361270 320706 256452 256142 307949 364185 356009
8482 356009 423460 486310 425310 367708 364590 292470 330279 356956 267433 284625 224386 291093
8470 291093 312788 284612 201285 236673 245361 214864 193746 234288 302671 437314 434220 359971
8458 359971 330258 361507 367916 316868 242949 265266 219148 193051 224994 243006 245012 197951
8446 197951 181931 236140 202049 160173 80827 67565 119226 177720 189652 167886 206284 335265
8434 335265 400279 368787 287579 364691 363985 218255 206334 292220 275816 243110 210637 228886
8422 228886 274727 301057 220934 221068 282577 294686 300807 241946 210938 257009 242691 159408
8410 159408 233292 169550 92933 140279 187651 169583 190365 190412 167721 132449 140711 151117
8398 151117 136059 135276 155450 200188 252632 259771 207787 141173 83504 18463 36266 76645
8386 76645 70685 33226 41276 151959 189841 164647 160159 177757 165988 181970 127266 90509
8374 90509 111841 154452 189110 199256 194274 142214 185075 239410 222941 227890 246272 165020
8362 165020 113023 145062 159272 183025 195453 76271 -8675 116247 247347 210155 75766
8351 75766 95918 112775 92638 108074 124643 75869 -16025 105365 128756 129676 207565 178237
8339 178237 115920 48575 -4220 10778 23770 -30592 17949 88175 166866 148922 179030 172457
8327 172457 55840 -50379 48265 93958 75057 77632 140875 170404 257103 312854 271225
8316 271225 203792 177170 117616 97046 81137 23214 35747 102734 101093 90119 -3618 12332
8304 12332 52989 99520 112721 211743 225537 126519 113715 136733 159542 145855 142741 125750
8292 125750 130695 139034 82315 92836 159295 142590 139788 199072 222011 234707 216538 136710
8280 136710 164373 189645 137093 63603 75626 91011 95410 117057 133518 175681 154486 90293
8268 90293 57552 28747 62929 101728 72760 100631 143377 92120 115923 160823 192917 180047
8256 180047 153738 67523 -33138 6749 49941 77424 90141 103423 89684 79979 60124 58676
8244 58676 84769 182967 163563 174497 220333 219126 233191 229908 260465 220524 76305 53500
8232 53500 122073 172507 169152 188379 205879 163512 203202 204656 100671 48428 101402 174959
8220 174959 120799 64506 -38056 -73475 -61902 -39861 14697 44022 44586 117864 81821 54101
8208 54101 -5748 -85490 566 56193 106119 121743 167694 165822 181426 205746 141759 43044
8196 43044 -16269 -28169 77024 147398 164744 168544 155537 136207 122470 206077 138060 86636
8184 86636 -29893 -36268 -24431 9992 -2704 -77201 -147418 -68011 55076 114106 137921 140146
8172 140146 29130 -28394 -53853 -38821 -54461 -944 49214 177302 305323 322536 259945
8161 259945 233090 178547 210517 229569 201667 216040 229896 263202 193931 144095 98615 119477
8149 119477 188263 86291 64666 126398 164519 137299 126613 197562 203980 100846 131085
8138 131085 170173 90194 -48645 -27201 50230 88162 128834 30896 -27100 12158 46726
8127 46726 59435 45229 130068 146833 163326 175694 232234 285484 252934 174507 141879 175687
8115 175687 135077 90115 125107 150045 184775 268817 302142 308229 221926 245528 279888 190393
8103 190393 136774 87871 103047 175228 202115 243629 192456 74374 69818 107592 84891 93078
8091 93078 169133 134110 153828 117975 111174 82725 34386 94966 115118 62412 71499 111168
8079 111168 148382 149035 115815 74178 114981 171563 184406 97155 65524 94208 114642 180721
8067 180721 286713 314710 229223 180262 206341 319915 322294 319254 249752 279583 251614 248044
8055 248044 352813 468785 479350 518929 547514 526050 468379 537333 638481 629130 608765
8044 608765 727163 781150 714390 663023 626729 623713 644092 692652 735600 792487 698094 684215
8032 684215 698615 732510 688203 667159 721936 722195 734562 717468 730795 744751 744249 750449 791901
8019 791901 767230 773669 739570 781584 734811 708457 823031 1007905 1111550 1204604 1258899
8008 1258899 1238733 1229238 1328628 1377413 1392443 1479149 1498624 1530851 1470057 1392133 1358804 1239116
7996 1239116 1215136 1202427 1228289 1207262 1229522 1270195 1163884 1069648 1080004 1081796 1020747
7985 1020747 984589 911200 905765 917416 851997 886266 1001208 1077250 1065017 974773 985357
7974 985357 1000316 1022237 1031008 1018704 1043940 1074843 1135161 1131884 1158910 1240941 1343765 1315605
7962 1315605 1337093 1331981 1338083 1353840 1335816 1269493 1203894 1221656 1254222 1279614 1238477 1241878
7950 1241878 1265553 1233882 1205970 1160645 1071624 951709 978270 980901 963114 841940 844368
7939 844368 868533 842817 844220 899475 971085 953774 899955 801086 788242 751647 696158 746419
7927 746419 835510 968330 1032673 973744 946059 875159 861332 926526 974611 874844 878486 982670
7915 982670 985766 882204 784691 807332 734792 776708 785093 816436 801566 771724 678385 550547
7903 550547 499692 570933 636781 644550 619760 589131 579052 596654 580422 499991 473208 529991
7891 529991 506375 448992 512512 470239 403639 346059 411741 446682 412344 419090 400874 430565
7879 430565 492039 547032 468217 425501 445754 472234 498861 490672 419063 448189 542913 530673
7867 530673 500529 473152 430243 393861 412457 419682 414473 429307 432224 400131 399528 349389 369596
7854 369596 420493 387809 345390 236445 230214 258912 221262 316279 370544 330026 356842 355186
7842 355186 349452 288211 260487 268202 239437 316601 320291 351617 307173 206079 189705 179693
7830 179693 273704 263825 182011 190870 182174 198161 211246 271079 358087 342441 418874 362608
7818 362608 297061 178806 126774 118032 78701 111755 126064 119280 109257 96563 103767 191431
7806 191431 210609 289489 311494 369326 342380 306172 359137 370273 354638 357502 420010 341208
7794 341208 209667 141540 131726 182959 186227 231658 311586 320817 255818 209947 183679 179432
7782 179432 167838 149175 78975 -21738 81521 176503 183656 182450 80340 85027 113372 124733
7770 124733 38570 20907 -5902 -20629 26227 -4132 -1936 -27138 -107642 -53185 8814 -3335
7758 -3335 66152 59774 76338 110555 65712 -7434 -39712 -76477 -60856 -48458 82 9815
7746 9815 -49547 -2654 -31616 -3479 42470 98065 56690 60023 62126 -30986 -8129 -64932
7734 -64932 -109888 -162809 -218235 -167230 -62593 -98614 -52402 -61737 -86090 -9034 -15073 -40795
7722 -40795 -28601 -21572 -12788 -65415 -44334 -89513 -64774 -3904 47597 47691 -3379 -32957 -57987
7709 -57987 -139486 -97336 14438 84461 119388 12600 -83852 19634 207082 236916 181227
7698 181227 142746 56938 12022 49930 45647 62078 71310 -17857 -27097 1305 -2415 -14117
7686 -14117 -35128 -30125 -86565 -49652 15559 -99254 -134134 -140154 -81473 -55792 -52757 -44658
7674 -44658 -38777 -22055 -12942 5283 3691 -36505 -9279 1869 14389 19511 26905 71635 36933
7661 36933 66555 137572 115554 111856 86149 103797 147989 104921 115259 152068 76629 45826
7649 45826 -24998 -93728 -94293 -81132 -109494 -114786 -83831 -46120 -60512 -79365 -112903 -93825
7637 -93825 -79885 -14447 7134 -77153 -63554 24156 -3669 -71609 -134543 -118150 -80648 -106299
7625 -106299 -129233 -71598 -9886 -17031 -35534 -39190 110288 205394 259450 287292 219359 106705
7613 106705 51515 25059 8601 -38539 -74649 -6518 50191 7309 24915 -39802 -42831 -53582
7601 -53582 -102947 -23051 -9436 -49419 -98633 -108380 -50536 53761 6722 31547 42950 16486
7589 16486 40584 26930 19628 -6292 -35139 -24430 18735 -28644 -19515 3159 43153 75816
7577 75816 65983 -31636 -74359 -103405 -103910 -81962 -13059 52611 109840 42071 -41465 -57789
7565 -57789 17509 100722 140375 80089 83508 118490 103762 62598 -73954 -82920 -28738 -10350
7553 -10350 317 18496 -30944 16322 30782 -26893 -123239 -194914 -160871 -33053 26185 -12449
7541 -12449 -25039 -80810 -46744 -36735 -66050 -127143 -56709 -57546 -110358 -112293 -60431 -46626
7529 -46626 -10579 -22322 -80438 -124646 -22803 114786 104628 52860 -58592 -136703 -99962
7518 -99962 -64901 -48043 -185566 -172518 -120821 -88035 -11506 60705 30096 68892 104646 8966
7506 8966 -49489 17929 68560 46115 14424 115362 88064 15147 4411 31476 -51873 -71007
7494 -71007 -32444 -40892 -105607 -72373 18366 61431 48477 25011 -19284 -48980 -96924 -60801
7482 -60801 -15995 -20617 -48275 -89289 -39850 -33735 -48930 -49672 -62339 -93187 -57394 -107815 -170823
7469 -170823 -133850 -103664 -81765 -35622 -33787 6045 141479 195534 98328 36099 -8441 7667
7457 7667 82652 69715 -45571 -145085 -36450 36380 -28314 15963 3041 -12311 3753 -24129
7445 -24129 -40632 -51660 -70451 -74738 -21639 13248 -103224 -98789 -97544 -8895 -43718 -107813
7433 -107813 -106663 -73347 -114003 4945 68966 81499 33609 -40014 -17412 27144 2437 -116781
7421 -116781 -164166 -95289 -14627 63519 -7519 -50899 7921 -101940 -64606 -2720 -47325
7410 -47325 -35900 24990 27004 8923 85525 153475 69116 98572 119788 89127 24523 -89252
7398 -89252 -91893 -12210 -25051 5086 -17262 -28206 -49474 -103233 -79859 -30127 -23633 -23014 -8146
7385 -8146 29003 40235 67110 26430 -87227 -85198 -44690 2935 -15004 -66563 -58647 -22855
7373 -22855 -72252 -64197 -94384 -86074 -92740 -64394 -52284 15175 17948 -66981 -114214 -120877 -75473
7360 -75473 -58555 -71393 17851 35714 5541 -96109 -138832 -109647 -174856 -110034 -43028 -80610
7348 -80610 -67065 -4483 -3489 -7632 4198 -3195 -74846 -80430 -34147 -26742 -78093 -92570 -136549
7335 -136549 -132777 -87736 -42943 37545 -5088 -92632 -96378 9506 -13351 -29159 -107436 -227890
7323 -227890 -210967 -127068 -33687 -45822 -58914 -75076 -25301 33859 34783 37304 50217 87176
7311 87176 40033 -23147 -77069 -60031 -25038 -30029 -121527 -239812 -125304 -48766 -169397
7300 -169397 -197076 -121978 -145557 -126277 -128783 -124138 -100391 -56367 -35590 -37860 90373 63015
7288 63015 86412 135432 120200 106781 132655 82612 80077 -58788 -29246 27328 -5169 10243
7276 10243 -20842 -63083 -76382 -37465 2665 26040 -4124 -11780 3289 3889 -51657 -8980
7264 -8980 92492 60829 -47351 -47390 -84385 -166554 -134406 -143011 -89392 -40565 -35747 -7639 31634
7251 31634 34331 48309 -27476 43650 169470 178071 77271 -3624 -53254 -21903 -38392 -108678
7239 -108678 -72705 28049 99629 40222 -49526 -72032 -38662 -31378 -28800 -58332 -71911 -92022
7227 -92022 -116979 -28818 -26736 -44664 -100004 -143849 -88095 -58669 -76314 -67111 -14443 -24228
7215 -24228 -42471 -37179 -23613 798 42179 34659 103231 93403 108241 62027 12988 -1078
7203 -1078 -28180 -76476 -52725 -138696 -145302 -77553 -81367 -77165 -82400 -42662 -29693 42138 98077
7190 98077 52889 791 -75217 -62598 -11529 57276 65160 42906 70172 6958 -41125 -119254
7178 -119254 -138058 -86634 -116049 -116539 -34301 -32117 -68164 -144433 -121027 -89691 -94161 -84551 -49911
7165 -49911 -85297 -135446 -84713 -97086 -109448 -74863 -27033 -55827 -74703 -55730 -69243 -29495
7153 -29495 -48687 -32576 66098 110117 113145 91352 49126 43276 20843 -39896 -42013 12813
7141 12813 2567 -16934 21661 8805 -46777 -102419 -152224 -169055 -137490 -104886 -102948 -63988
7129 -63988 -54106 -26318 -19671 15797 -27184 -60579 -42622 -52846 -28812 -31191 -42183 -21891
7117 -21891 -42086 -85264 -106828 -86776 -9318 -50218 -47244 -102003 -12676 -9985 -62936 -67073
7105 -67073 -131091 -83687 3695 -62623 -152010 -191522 -142635 -133688 -86224 39951 -34345 -74705
7093 -74705 -60375 -20580 -39892 -90396 -116852 -4267 61039 37135 49527 15974 5379 -24588
7081 -24588 -56378 -80445 -25528 -45421 -124587 -158397 -106987 -229 24962 190893 186444 141229
7069 141229 69353 23566 56860 7769 -54666 -72778 -69121 -19320 -56161 -104386 -68872 -70350
7057 -70350 -91013 -67698 -67729 -88445 13135 62426 20835 -13453 -98193 -89799 -29336 -93261
7045 -93261 -58167 -25929 -32304 -76384 -102235 -124103 -108692 -289 87342 63069 -20535 -62666
7033 -62666 -56819 -61996 -41430 -81304 -23632 10523 -142331 -275907 -286425 -290796 -240088 -195843
7021 -195843 -176656 -100868 -76417 -150211 -116017 -45363 -27264 -18970 10931 32938 41675 -12397
7009 -12397 1729 11627 36469 -62044 -112909 -34754 -5389 -52051 -103442 -146258 -84762 34129
6997 34129 46745 72810 113997 39018 -30589 -46735 -4138 -54624 -69467 -22953 17192 -34048
6985 -34048 -76618 -141949 -199709 -168627 -36859 26236 -24829 -73138 -54775 -40319 -16828 -3890
6973 -3890 3461 -10882 1485 27724 18555 -8086 20621 132819 112898 69048 146677 154012
6961 154012 102453 57473 96809 33189 -12062 34841 56691 84885 47304 48543 11361 -49208
6949 -49208 -23636 67117 34064 -94681 -153975 -141992 -59820 2415 10299 -71571 -37978 -8608
6937 -8608 -2838 -22097 -63661 -133909 -129150 -71490 -84714 -132266 -70527 -40341 -100738 -76932
6925 -76932 16434 111748 115366 133224 120357 65610 38221 24074 -12545 9371 59203 28859
6913 28859 21424 -31715 1287 -14200 -400 7614 -26295 -48416 -87876 -81065 -24168 -22899 1661
6900 1661 39134 37551 -69 -69669 -78222 -39610 -71101 -46063 -64393 -140147 -63660 13067
6888 13067 62027 19727 12006 -55576 -73654 -36107 35725 81012 87439 28530 -26039 -111909
6876 -111909 -87719 -60227 -45968 -20533 -39668 4166 40984 20971 110137 138369 53682 45323
6864 45323 34829 2352 23340 93146 60370 24858 -15233 -51906 -27664 -77894 -116475 -68218
6852 -68218 -14978 -117183 -128236 -156067 -130974 -88441 -122427 -151309 -145286 -213308 -197526 -82337
6840 -82337 -86274 -107756 -78382 -27124 -50006 -93130 -195127 -204292 -145453 -28505 630 -17594
6828 -17594 -21981 -26075 -4059 47708 65585 28199 -16568 -37075 -21480 47723 117670 66373
6816 66373 -46699 -154900 -189987 -116279 -117553 -101954 -80752 -9531 84449 111198 75643 -18560
6804 -18560 23502 25990 71702 68597 15172 12574 -65941 -60074 -19776 -107704 -136476 -18079
6792 -18079 -7677 34067 73464 23429 33396 -14493 -57794 -127895 -66552 5565 -41234 -90356
6780 -90356 -56266 -21576 -1495 95495 86636 89581 17321 -1678 -28485 -112866 -184558 -134281
6768 -134281 -146134 -153492 -70067 -79609 -113328 -139053 -175480 -160870 -112719 -160555 -177801 -142367
6756 -142367 -162529 -171691 -95853 -18736 43990 53755 58564 18798 -12364 -76841 -92525 -42895
6744 -42895 -20680 -59737 -100978 -140825 -90815 -5003 -30643 -81910 -90511 -112874 -133971 -32260
6732 -32260 54469 87217 128274 114416 105579 94236 35014 44461 100377 100399 53340 65385 98540
6719 98540 111862 20565 13940 -44733 -47918 5823 100610 77856 -60856 -53064 11958 16641
6707 16641 -97204 -127302 -44152 -14418 -6600 -32367 -71882 -70451 -5112 -13199 -45283 -24033
6695 -24033 -1058 -45477 -124292 -107278 16935 47176 53515 70606 48471 93044 99112 26935
6683 26935 -57112 -157145 -99099 -43219 24653 -34247 -73909 -53420 -52755 -42209 -101595 -173725
6671 -173725 -68513 -29774 -38294 -82594 -148203 -171179 -184053 -139223 -25530 32524 25905 -23148
6659 -23148 -36136 -66585 -147262 -99281 -2856 1869 -31037 -5795 -32130 -123502 -115853 -119019
6647 -119019 -106759 -59246 -41191 53339 90613 135878 141223 199288 193513 211627 167214 128094
6635 128094 60039 51578 -17139 -13942 88006 120028 71071 10185 -43293 -48817 -48356 -19309
6623 -19309 69598 62831 24944 18077 -48273 -44880 -81469 -144892 -221436 -191338 -97560 -12730
6611 -12730 9149 22410 37295 -10120 -14446 -78881 -106298 -28469 -16800 -24856 28001 25708
6599 25708 31361 27022 30520 -17065 34587 18494 -28857 8972 58171 16237 -90784 -120919
6587 -120919 -107015 -147237 -134472 -107493 -23301 5829 91790 154257 122362 95782 15710 -69480
6575 -69480 -48626 -5274 58009 118510 50311 -28430 -70089 49009 41030 -46021 -156406 -123468
6563 -123468 -45207 -54864 -6797 -49221 -148146 -87764 27490 -30189 -105589 -170741 -197893 -112796
6551 -112796 -82521 -101570 -136166 -81892 63040 159866 67926 -56050 -33774 -43214 -73141
6540 -73141 -91565 -76492 -66585 -85049 -99673 -119756 9770 137805 69104 25650 -33269 -146953
6528 -146953 -235468 -132523 -93798 -69142 -111907 -63097 -109605 -144485 -112979 -56044 -82250
6517 -82250 -163347 -145845 -45645 -31734 49970 131677 200741 139185 143687 56625 -114752 -142352
6505 -142352 -45343 15022 66966 2970 -9012 2435 -61173 -68812 -20391 17042 -42610 -74733
6493 -74733 -62393 -68628 -98970 -126688 -81161 11478 -41897 -32764 -81130 -131142 -92232 -30450
6481 -30450 -1412 -21603 6833 38903 -28423 -26241 33465 27149 -54129 -9843 -4493 -33450
6469 -33450 -71397 -129350 -121983 -92782 -34749 -24311 -91988 -142178 -71793 -27977 -51908 -17523
6457 -17523 83453 111786 115018 71757 -12690 -92000 -127391 -141533 -114072 -162204 -131386 -18433
6445 -18433 18669 16155 -34025 -192776 -115037 -3412 38316 95103 147289 120946 77133 91668
6433 91668 69423 85130 62513 -30788 -17872 15556 -108708 -118674 -152560 -74114 22169 48457
6421 48457 69881 93875 132465 102691 69705 34728 35478 11519 22610 12410 -56388 -72270
6409 -72270 -26443 25621 103787 177776 87923 -63100 -172338 -175774 -107510 -62678 -48445 -156510
6397 -156510 -199413 -172850 -7300 20170 -2691 6903 -84394 -173360 -122754 -86605 -88103 -130125
6385 -130125 -149177 -158070 -129556 -54029 -49865 -55432 24214 33424 -38328 4158 18209 -8752
6373 -8752 23088 -77879 -123613 -107304 -16810 -34005 -34069 -55797 -15098 -20954 4061 9863 -46776
6360 -46776 -19232 -18858 15923 -37188 -118268 -123001 -67819 -109928 -96683 -103129 -132249 -141866 -116212
6347 -116212 25471 70486 20673 71734 123684 134604 162928 112507 64019 102499 57636
6336 57636 -84581 -108663 -55004 -79819 -165440 -129672 -36853 10243 48933 -46732 -19374 -30080
6324 -30080 21471 -18303 -13544 -13728 -105750 -186383 -125340 -80158 -56066 -13981 5071 3684 16851
6311 16851 25742 -25882 -26788 -40413 -85273 -98666 -25433 69280 77662 91172 92959 47072 13811
6298 13811 40289 -3328 -23074 75076 69365 -52151 -86438 1236 16219 5748 17495 48902
6286 48902 54411 -35649 -79778 -84476 -27145 -6507 -57250 -44292 -47970 -95470 -146634 -73905
6274 -73905 -9234 24040 -70048 -98290 -25016 -4956 -118952 -158835 -143302 -102279 -141704 -169027
6262 -169027 -91050 -78723 -2669 23539 10506 -65208 -84811 -152073 -102948 -61351 -83262 -116114
6250 -116114 -37077 -22503 76777 114679 71822 108022 117234 150901 97876 33435 62675 46862
6238 46862 -61053 -96620 -64531 -32389 13172 70129 52828 -58986 -130441 -138994 -62379 -65261
6226 -65261 -110255 -106508 -135244 -202728 -161648 -117492 -86232 -120261 -85201 -92707 -94402 -40887
6214 -40887 -54762 -46249 -3164 -17953 15840 -36746 -65768 -8753 25310 -39157 -134307 -128731
6202 -128731 -54688 -108768 -192825 -212418 -156964 -93545 -20557 -19907 -45870 -23233 41560 13598
6190 13598 -100683 -136016 -140547 -55139 -23391 5560 -16766 21439 21047 -19663 -132725 -165499
6178 -165499 -104751 -95285 -61633 84750 195691 185115 163680 109430 77191 90783 54703
6167 54703 10604 65929 53879 -11310 -130103 -140746 -28541 -5084 -14853 -35141 -60543 -85761
6155 -85761 -82669 -74075 -69237 -90329 -87387 -61793 -6813 6939 51822 61508 69961 94331 31050
6142 31050 47031 82303 21625 -72146 -141386 -136128 -182821 -72456 -39083 -72023 -63288 -56727
6130 -56727 -148714 -185518 -107809 -30615 2300 -13783 -104083 -155201 -169858 -135809 -78113 -122101
6118 -122101 -157591 -71231 -56575 -40982 20099 -10594 -94797 -150415 -61652 -78781 -176051 -113881
6106 -113881 -99110 -133280 -124221 -171229 -157035 -102917 -76844 -124431 -104433 -72501 -131386 -147413
6094 -147413 -185692 -113000 -70493 -81406 -58533 -22204 -25347 174 -64125 -53195 58855 109980
6082 109980 60824 91004 165687 194353 160710 79642 21058 97887 37460 80141 149523 64209
6070 64209 2936 54606 95821 104179 7411 -41141 -41392 -86358 -65374 -58000 -39811 -51943 -16603
6057 -16603 52208 -3198 -45277 -70948 -42612 -10340 -32218 -1872 57839 46776 2752 -45452
6045 -45452 -14627 67155 40852 -46885 -108392 -175879 -183210 -97336 -59226 -77054 15843 88627
6033 88627 77994 107135 103114 58527 21923 54189 99195 69412 149995 93443 21078 -7412
6021 -7412 6877 83427 130011 140776 38995 52726 67792 70327 82153 51727 58620 3478
6009 3478 -42024 -49801 -101629 -50802 -60284 -78953 -65603 -41768 -42576 -77807 -41951 23719 -60333
5996 -60333 -98161 -116304 -26951 -63362 -121825 -142149 -106453 -68632 -98938 -95027 -203971 -242964
5984 -242964 -156270 -89536 -108062 -138368 -137743 -64270 -57272 -60571 -84441 -145330 -104038 -29658
5972 -29658 -75550 -74471 -73374 -18682 -35316 -90360 -48528 9006 11606 63505 -12710 -85927
5960 -85927 -125056 -105707 -65363 -109928 -55436 4384 23528 -12913 -47677 67567 28376 18343
5948 18343 -5416 32490 52842 9246 13272 -76372 -240095 -284391 -173061 -15694 28402
5937 28402 13583 -23192 32853 34382 37007 61383 50857 11859 -70106 -147339 -139340 -159007
5925 -159007 -139059 -129094 -137469 -150702 -148275 -132403 -159187 -73088 63666 84135 38036 -42553
5913 -42553 -91857 -76389 -103629 -123616 -118726 -66925 -69518 -2853 62300 19020 41302 62114
5901 62114 18819 -10871 -29100 -52210 -143795 -96982 -57448 -18422 28464 29728 -22732 -45168
5889 -45168 -99378 -133258 -113976 -59014 -123960 -85895 -32130 -39086 -37748 -28355 -29048 -55598 -37627
5876 -37627 82078 147856 121260 63160 -1927 -32844 -71885 -75894 -28344 12899 73742 100924
5864 100924 49955 60135 -5347 2414 46292 8183 -70994 -59477 -67165 -6340 -55854 -157484
5852 -157484 -26609 58541 24635 3659 91225 80091 13912 -31505 10005 46261 35364
5841 35364 27155 98775 104836 93710 -13024 -82292 -139531 -169845 -127450 -50674 -29567 -3680
5829 -3680 -3053 -18472 -12361 -95959 -90991 -64034 -158255 -194011 -112044 -64644 -42537 55478 94782
5816 94782 32673 -31369 10811 10775 -26388 -50987 -70287 -78503 -28956 -24664 -79258 -76732 -35764
5803 -35764 -20392 -22619 -41836 -82393 -85059 -15439 94915 103009 33028 52700 70679 -34018
5791 -34018 -85252 -173341 -135109 -26338 -91845 -175015 -178112 -82820 -22003 -16145 19774 64405
5779 64405 116585 63126 97005 135805 164145 100976 40992 33479 12988 2647 -46479 8468
5767 8468 -61410 -155697 -84601 9813 85815 36223 -14388 -121562 -119487 -94186 -66297 78
5755 78 17856 12756 -36880 -39907 -63313 -69767 -111823 -93407 -42617 106165 154826 49617 -37517
5742 -37517 -12840 13841 96307 66194 9404 45717 87769 -13339 -55373 33389 38945 -12277
5730 -12277 49124 -2027 -81334 -78767 -18978 -112839 -140629 -133919 -90087 -45341 -39511 -52460
5718 -52460 -159121 -155337 -53399 37456 66193 92744 124524 163879 92599 20901 -77660 -67663
5706 -67663 61785 17316 -8145 -8233 18694 -11715 -29935 45955 -41569 -106129 -131135 -111061
5694 -111061 -144207 -138555 -57993 -32505 -27171 -9152 3165 -1166 14226 112096 199590 211374
5682 211374 130953 79366 57842 65134 -13313 -102368 -104575 -104955 -197322 -265790 -150428 -105139
5670 -105139 -62563 -76243 -121952 -173049 -162543 -173840 -163088 -136553 -264068 -268442 -239489 -158286
5658 -158286 -115643 -150995 -44034 43790 69650 70662 59488 5550 -38348 13019 68773 48853
5646 48853 60710 78616 90318 49165 67717 99351 91411 47752 -45181 -94733 -6900 -26179
5634 -26179 -42485 -26924 -135807 -146006 -27429 78933 72963 29450 78258 63131 47263
5623 47263 42522 -634 23645 112576 65991 72404 60958 -61587 -41994 -78539 8110 83401
5611 83401 31055 22423 13489 -3108 43636 94198 79123 21270 -73872 -56086 10966 62061
5599 62061 110973 103217 32687 -29135 -18268 11930 -36456 -67569 -70129 -8271 -41181 -107097
5587 -107097 -112240 -85682 -32510 -23815 -55605 -674 29566 61934 24036 -17591 -22201 -54784
5575 -54784 -108897 -83056 -35275 82511 124381 25261 14304 34343 -2113 9611 -34846 -60957
5563 -60957 -30012 -14045 -86948 -60658 -81432 -100657 -54642 -1671 33882 21873 24306 -4188
5551 -4188 -83589 -68561 20634 -43711 -98069 -129011 -120973 -56710 -65474 -93275 -88507 -152787 -186316
5538 -186316 -138080 -29850 68032 46398 -22767 -6688 67176 15657 -622 -21288 -40669
5527 -40669 -68413 -74848 -46833 -28522 25260 -7881 -42287 -38075 -11926 -90991 -110027 -40093
5515 -40093 42815 135886 167053 178550 115418 77958 65436 24634 -58752 -97831 -72649 -51675
5503 -51675 -47823 -18199 19819 -31933 -28177 -41520 -103547 -116043 -81969 -71332 -73517 -75255 -58920
5490 -58920 -26930 54138 31857 78202 -71698 -11763 -11466 21670 -1290 -112267 -90283 -100611
5478 -100611 -32178 -4402 -6221 -77213 -42625 -60740 -28535 41315 93957 56420 -8209 3019
5466 3019 -10897 -55257 -7949 -45891 -82663 -87003 -66456 -27171 -14655 19191 -30260 -51350
5454 -51350 -6872 40125 111419 162006 176845 170039 95779 18395 -10087 -34234 -35098 -12503
5442 -12503 -30130 -18446 -44625 -64785 -83085 -49580 -11583 -11625 58147 61199 24161 5557 -48175
5429 -48175 -76434 -110748 -148542 -161678 -104577 -3199 20886 -17592 -131348 -96554 -142597
5418 -142597 -79390 9479 -29689 -104839 -124445 -105975 -68239 -52855 -116733 -87860 -131467 -137462
5406 -137462 -117221 -146632 -116718 -7443 -93637 -102191 -52036 -65674 -72671 -135769 -99769 -145337
5394 -145337 -42024 7012 -6636 7149 -47651 -101950 -84262 -28791 -41151 14713 46861
5383 46861 -4307 32034 49685 104487 71979 -9743 5417 63610 78513 49805 101546 95935
5371 95935 86243 79039 98346 77259 11803 -23744 80955 165349 181790 31527 -60413 -2362
5359 -2362 53540 5953 15982 37201 35897 -30718 -22993 49957 35501 -26248 -71496 -148112
5347 -148112 -184629 -225827 -145384 -62607 73933 66048 -21469 -31880 79 22087 14594 -37736
5335 -37736 -52432 -90822 -89680 -11572 -54483 -42864 34471 8349 -82832 -122019 -131609 -183819
5323 -183819 -158202 -57626 5798 -43565 -113354 -60651 32408 74651 98094 134270 89771
5312 89771 132082 108354 11497 -7488 12625 43255 141766 133791 142364 74859 -56613 -52756
5300 -52756 -41817 -19180 -12003 -12035 47258 14083 -17310 15657 62982 156494 198068 191873 129688
5287 129688 84475 87873 -7435 -71493 -61887 -77710 -151798 -174570 -79019 -3598 -26797 -52616
5275 -52616 -112572 -207868 -183717 -84645 27439 -17391 -107809 -98154 -10734 -7430 -52036 -31038
5263 -31038 -16774 52569 80385 50977 31102 -23901 -81660 -149919 -219165 -224610 -196495 -198109
5251 -198109 -154499 -91597 17640 54023 63657 47317 44122 -3525 -120234 -79444 12403 58163
5239 58163 22577 -38809 41003 24565 23208 -11344 -30167 23546 35041 36674 39893 -17249
5227 -17249 19140 -21269 -55236 -24439 -81264 -165876 -98338 14116 59305 -421 -14150 25459
5215 25459 36366 77931 73360 -9079 10774 70769 79936 93686 27301 -69932 -40692 -19309
5203 -19309 -69883 -63971 -71299 -63720 25444 15569 22067 -20349 45814 -2194 -56695 -44725 -51523
5190 -51523 -119086 -126604 -33108 51290 96088 137378 109915 -26095 -37739 -22006 -103928 -126340
5178 -126340 -126486 -61827 -80342 5619 13981 40869 39409 -20675 -27705 -54801 -74490 -88499 -80899
5165 -80899 -212676 -288698 -163452 -84300 -48732 -33824 1995 -3730 17758 -60124 -37693 29395
5153 29395 114311 38546 20353 47693 128876 191096 35504 -43718 33235 62296 79242 24056
5141 24056 -55988 -54440 -76274 -187501 -248691 -157434 -33446 -68421 -90004 -111298 -52109 -38058
5129 -38058 19369 22375 -8622 -11749 -2750 -9802 -40735 -102678 -89672 -74888 -67627 -74587 6702
5116 6702 29382 42996 -34126 -104321 -116521 -110206 9517 27830 -27729 -135051 -159023 -82994
5104 -82994 -58821 -80448 -72251 -73156 -37290 40177 111174 171947 236952 202468 191167 166975
5092 166975 92854 50665 20513 -9266 -28337 2610 -48498 7749 30841 -1031 -24683 -64316
5080 -64316 25731 -3840 -120239 -163026 -110973 -81214 -61351 -9527 38553 11479 -71304 -96973
5068 -96973 -28092 24343 -3249 -39047 -22545 -79483 -11628 31396 36872 25173 -26283 -20798
5056 -20798 -53966 14167 -3894 -76501 -69716 -30571 64034 94329 110803 130312 103750 36801
5044 36801 93160 -11514 -35965 16610 43861 80127 73063 57910 44355 68409 87353 21204
5032 21204 86947 87179 29666 13226 74145 79331 65417 32840 12155 -26077 4495 14693
5020 14693 10208 28922 42853 103050 148990 109380 101137 83108 31614 43747 32786 -5668
5008 -5668 -54306 -94710 -82634 -12060 -104274 -143856 -43865 4387 -1074 11318 -19234 21582
4996 21582 90744 107482 48657 26191 -41448 -100566 -87743 -85573 -64589 24616 49224 71105
4984 71105 63493 86777 78874 159621 71198 -104812 -175249 -100008 -77452 -20716 -1249 -45527
4972 -45527 -133566 -113754 -67885 -42130 32990 1052 -46848 17775 46845 72686 97359 80540
4960 80540 79241 93496 90263 71136 12967 -16038 -3983 -46732 -68918 -142451 -132523 -76522
4948 -76522 -42231 -58022 -89301 -21132 115240 199540 182630 76437 102276 63153 -61920
4937 -61920 -109085 -127645 -137480 -135345 -122485 11255 61317 -5012 -65621 -63352 -28182 2945
4925 2945 -104382 -163776 -108537 -41615 5694 -47479 -92563 -15723 26256 31845 121470 105243
4913 105243 130629 170552 151062 105959 93057 79560 -30853 4749 -7380 -95163 -121093
4902 -121093 -120026 -60568 -17737 -34465 -55324 -101660 -64983 -77364 -106962 -137428 -139919 -119217
4890 -119217 -52490 -29251 20432 100698 27097 -122635 -50325 29495 120834 63266 144937
4879 144937 193019 119089 96116 83155 25383 -9557 25139 8152 18488 24701 -1941 -13415
4867 -13415 -5386 -53224 -42315 -3975 -41915 -40849 -42005 -82932 -53344 -58318 -63151 -28056 18280
4854 18280 11521 33036 -21944 -48371 -5626 -20394 -79684 -23061 9054 26320 50607 4947
4842 4947 46910 47598 -4569 -92616 -88133 -49114 -72850 -94291 -15286 8267 9910 36758 114836
4829 114836 184799 62410 49958 97593 102978 70328 33194 -4304 -23419 -106123 -105189 -12630
4817 -12630 23372 -14193 -33249 -26747 -37897 -17979 -1175 6656 42913 19296 26537 -91354
4805 -91354 -184494 -200578 -112267 -101849 -134214 -180573 -230930 -246061 -239322 -199638 -84795 10417
4793 10417 72009 97213 93827 23544 73074 129694 81685 -22609 -67276 6316 33886 21860
4781 21860 -15897 -66498 -1592 -71693 -114356 -51471 -40290 -3438 -25429 -109058 -48958 33776
4769 33776 -27492 -132208 -105219 -66719 -74457 -85586 -164796 -135768 -118907 -67806 35994 71025
4757 71025 13484 15081 82067 98073 70007 -16248 -71127 -52344 -5322 49504 -16668 -48220
4745 -48220 -13656 53225 127113 44548 -32494 -52305 -63241 -107545 -125464 -63988 -48737 36530
4733 36530 27886 -25706 -43446 -8407 -10146 -17963 -79049 -86016 -77764 36805 62714 59549 34618
4720 34618 72069 64630 90830 79924 119524 96530 81175 11796 -91281 -109178 -118280 -147528
4708 -147528 -93334 -62028 1095 17759 -56014 -1624 52885 29837 -3074 -23524 -81494 -99028
4696 -99028 -5958 13804 -87361 -112459 -88532 -26417 75134 7446 -80432 -7330 -67080
4685 -67080 -113952 -46379 -35552 -63596 -38058 -54014 -55374 -31334 -4101 33613 70232 78767
4673 78767 65130 84570 85881 39462 39762 52420 28082 -15968 -23233 34502 50157 44343 16404
4660 16404 10088 -10070 -40828 14239 79745 15318 22056 6134 -87237 -117114 -60165 -87308
4648 -87308 -109375 -23399 67430 53597 45998 59103 91427 64866 -77781 -140058 -165867 -79242
4636 -79242 -51365 -6279 -93936 -123946 -62649 -110961 -24463 11139 33739 20146 18812 -19824
4624 -19824 -42571 -50697 -67064 -75168 -54912 47771 155735 185304 177001 51639 -33848 17759
4612 17759 88688 34329 -38526 -47675 -26755 33592 41901 24197 27896 108972 137962 158665
4600 158665 185360 137876 107689 203129 172864 123695 89045 47343 54203 82125 6120 -84993
4588 -84993 -69396 -25079 11878 76984 41154 23169 19232 61058 81619 98637 156626 127972
4576 127972 223167 174304 171371 137691 74058 118846 122418 67297 48041 63176 65184 33500
4564 33500 -30785 -71562 -87173 8660 7604 -53456 -86360 -68523 -50241 -95934 -46312 18104
4552 18104 23976 76 44730 -45012 -58185 76531 56646 31666 30624 -2670 -56017 -83712
4540 -83712 -133114 -32671 26419 -27544 -33823 -9145 22112 -24229 -90942 -108162 -131487 -158786
4528 -158786 -91973 -97088 -45592 -31357 68767 132248 76892 71782 62550 -4322 -26560 58345
4516 58345 50411 66885 79134 79060 125479 105116 37921 14031 46350 55805 133960 160157 60224
4503 60224 81040 125079 62442 64926 114619 1262 54469 -17513 -1945 11372 -7463 19931
4491 19931 63755 63989 68445 77439 -55713 -132503 -181550 -105847 -30143 -83593 -101416 -64973
4479 -64973 -34828 -49083 -14726 6045 15518 22375 -16935 -32944 44183 32860 695 -22385
4467 -22385 16425 -17374 5499 19937 -48640 -94360 -106086 -111063 -110921 -102168 -139606 -130542 -61900
4454 -61900 26543 38404 11350 50498 -4430 -132242 -174136 -114763 3990 78945 28948
4443 28948 -59752 914 -32819 -79713 -137220 -73344 32733 84579 28944 -38939 -56949 -39189
4431 -39189 -36325 -39248 26994 28302 65419 108103 105626 85261 58819 44168 -41910 -104241 -157446
4418 -157446 -156974 -83420 4811 97648 115798 8900 -13690 18421 32881 28069 78517 60099
4406 60099 4839 -25209 4740 50718 22898 7983 -24925 -35353 -61443 -87210 -100857 -97027
4394 -97027 -37298 -42408 -70354 17028 -1908 -75553 -88651 -112458 -113275 -125407 -59895 -79495
4382 -79495 -104548 -119596 -58260 28945 66702 -65684 -89468 -18435 -45788 -47108 -22113 22436
4370 22436 94577 330 -44305 -100686 -78877 -50568 -80020 -47169 -52869 40019 76230 118583
4358 118583 61529 -51690 -98772 -120382 -136316 -165418 -136107 -139784 -158988 -143955 -81627 -54531
4346 -54531 -48289 -53253 -25296 11554 11586 114175 81423 54641 43259 -10093 -37179 37267 40141
4333 40141 42030 42328 65086 20156 4124 -23488 -44701 81267 109172 67482 171659 126374
4321 126374 3489 -58586 -122257 -111350 -51020 48997 58544 -6848 -5520 55107 64461 115844
4309 115844 69126 28981 11996 -11384 -9717 2537 75487 118108 94437 92708 107506 25835
4297 25835 1768 -17645 1171 70226 5433 -29727 -48068 30827 13076 -44404 -65923 6939
4285 6939 11848 -67329 -34685 -10719 -23239 -68797 -114304 -147565 -135680 -61205 24949 8666
4273 8666 -69838 -37783 -44874 -42135 -51394 17092 -10994 72839 127690 105347 83782 24535 -5018
4260 -5018 17875 50425 71347 117262 116466 77898 19037 -7314 -12818 -69059 -112452 -72216 93045
4247 93045 218921 168899 41798 -14657 29446 61898 50436 11156 -39182 -44232 13742 30501
4235 30501 43129 18377 -6712 -70618 -9685 24053 -11323 33390 65798 118540 15412 -25382
4223 -25382 18055 26235 34852 -47031 -79862 -17154 55726 121385 89515 7187 -27613 -113469
4211 -113469 -174457 -179075 -149340 -59765 -19226 -25198 -33965 -28258 -18344 -292 65816 89203 48947
4198 48947 36264 23387 70933 63474 60255 74868 -10892 -59735 -26653 -44627 -89303 -117571
4186 -117571 -94339 -47634 7935 48973 20447 5054 -36030 -50045 -89578 48503 113254
4175 113254 65255 56356 426 -166889 -183313 -117229 -99198 -83017 -41214 12498 56363 23478
4163 23478 1815 30357 81882 16471 -38437 -92898 4637 21115 -107685 -130943 -99239 -77530
4151 -77530 17513 56110 52570 -3990 15607 220 -24258 -48402 -15088 -49528 -163351 -142866
4139 -142866 -20687 -2496 41777 68321 -2247 -42977 -31049 44315 97432 68030 23495
4128 23495 -89488 -72622 -89030 -116577 -101816 -37747 -94335 -153228 -110155 -56718 -50273 -189391
4116 -189391 -224104 -97614 -42218 -20425 20762 46961 -8695 -89816 -152115 -98381 -38657
4105 -38657 -39553 1938 41108 60595 64515 -2079 55639 146225 202761 197148 90713 66251
4093 66251 33795 -10345 -97575 -74138 -54204 -33788 -31002 8170 19445 -20972 -15567 -3324
4081 -3324 2068 -27109 -62109 12777 11168 18557 -66710 -64181 -31439 1299 1160 -1252 86287
4068 86287 140623 143793 55275 -25793 6375 60572 135772 137758 111925 4224 -55935 3603
4056 3603 51039 67258 19050 -27610 -84524 -19813 -26775 -50847 -50936 -125519 -62488 33012 45044
4043 45044 23453 14893 -63216 -97568 -27921 72944 114130 44206 -21480 3483 24516 38970
4031 38970 -3189 -40816 8771 29508 30643 34932 46833 144568 183692 126344 54998 14225
4019 14225 -60037 -164538 -158192 -126539 -167110 -132323 -159186 -146164 -104167 -82411 -72075 -3426
4007 -3426 54151 40428 60091 -33814 -28299 47087 111665 43460 11635 -34968 -340 52625
3995 52625 211653 235183 185995 187849 94581 27557 91887 184116 215589 120208 56604 17503
3983 17503 77696 57311 22891 66510 79460 49097 -49287 -35265 20608 71517 52600 74744
3971 74744 60660 89231 54834 5126 18303 32727 -9146 -46550 29782 52647 21652 12652
3959 12652 -8823 16773 9562 36834 11262 -51135 -24516 -24529 -62332 -39786 -51928 -63248 49225
3946 49225 52974 -55413 -120452 -88451 -52113 -48883 -109194 -110460 -32377 -34554 -30714 -25268 -89265
3933 -89265 -91846 -106222 -71522 -102640 -95315 -38779 -69675 -143909 -107954 -39239 -15652 -59575
3921 -59575 -47018 -37879 -29252 -24227 -75276 -64021 -63546 -3057 29296 14179 -11478 -60935 -89796
3908 -89796 -64613 -41298 -47610 -92060 -87006 -63123 -129755 -146406 -81983 -32663 -31098 -11596
3896 -11596 -22342 -34720 -71548 -76685 39173 31186 -36450 -43099 -92173 -168601 -186760 -174715
3884 -174715 -146192 -77804 -50613 -75535 -71755 -22357 -57002 -33945 137524 121759 -62111
3873 -62111 -129354 -44019 98012 121674 53415 -10464 -41560 -7373 21813 111100 109284 61500
3861 61500 45834 92506 98511 9426 49913 52351 65072 5878 -37355 -29549 -31255 72593
3849 72593 178926 162954 83147 -85873 -176420 -79802 -29382 -20824 -26085 -55845 -110911 -68025
3837 -68025 -98763 -57651 -3314 60293 65997 19148 40988 87760 -4099 4586 91357 91956 67384
3824 67384 129533 88427 -13011 29530 40567 -5724 -71763 -57568 -3292 -29167 -28863 62066
3812 62066 26186 -58361 -138087 -123780 -71538 -74544 -113428 -109367 -108923 -155273 -88664 -29643 4674
3799 4674 2723 -29256 10826 28857 98282 96147 94473 105419 84299 87431 4328 -94582 -54982
3786 -54982 5455 37021 3183 -41285 -52007 -16233 -15673 -47919 -59929 -69513 -46064 68640
3774 68640 -13065 -120440 -177336 -144024 -31072 27857 -39863 -14888 28327 -44525 -113067
3763 -113067 -183209 -206746 -178275 -174719 -165995 -57901 33220 40563 16358 39336 55900 71844
3751 71844 87159 -12862 -32195 9118 44441 46672 36896 53285 61514 -6635 43343 95832
3739 95832 -6435 -110781 -12548 46792 61770 140970 153909 176996 150854 73853 33947
3728 33947 -24686 -67087 -12704 -32318 -158785 -144187 -21954 59752 145260 205970 293543
3717 293543 250647 169976 125543 -13233 -2811 20036 -41955 -36378 33266 12485 9041 60073
3705 60073 89175 92040 92644 25513 80644 147908 71961 1591 -67447 -57030 -12437 -45207
3693 -45207 -39922 -62506 -67109 -67877 -158268 -111840 -31336 -37133 -25602 -66152 -109159 -125677 -67249
3680 -67249 -63149 -123712 -139422 -131249 -136702 -192719 -86508 24876 -42239 -20647 16116 -16475
3668 -16475 44155 40336 24569 23512 -21667 -1845 36755 28894 -17998 7892 66997 113790
3656 113790 29617 44937 38053 81648 178876 176705 8214 -138888 -140794 -205270 -190482 -105404
3644 -105404 -107359 -74741 -46716 26590 51103 34764 83938 88413 66196 -22113 -5032 44041
3632 44041 92649 95725 127694 100133 -32701 -63189 -55949 -96649 -98512 -57358 -8057 -9790
3620 -9790 40841 63874 32996 5233 -33485 -91840 -7752 15844 73988 91229 43567 -1989
3608 -1989 20759 105781 -7793 -100511 -155248 -200479 -141758 -43724 -57198 3825 19437 -32109
3596 -32109 -61187 -76976 38905 30973 -49882 -76563 -11368 -26881 -72324 -48699 -53756 -84993
3584 -84993 -98760 -52691 3535 51651 63649 4466 6176 -66561 -60390 9683 19042 -40321
3572 -40321 -62239 -130969 -205890 -239386 -187972 -89512 -67770 -31344 -16533 -143628 -166937 -102026
3560 -102026 -11850 66032 56454 79162 159233 32212 -64459 -44958 -25911 -17086 -12403 25710
3548 25710 77786 58394 -22304 19747 44814 40128 28814 74249 9624 -83460 -32800 23248
3536 23248 45594 106213 63136 -67248 -71603 -14216 38155 112626 116674 91505 57375 27625
3524 27625 25859 121348 57358 14362 117710 192058 154374 116446 113878 183749 249923 73588
3512 73588 11463 29663 -81249 -115762 -21277 33374 51451 43220 -37513 11517 71201 89178
3500 89178 109093 3760 -87157 -96799 -87035 -52951 3017 -9708 -65955 -74674 -59628 -72319
3488 -72319 -69741 -25244 14254 -40273 -111479 -68121 72938 88717 55795 -4957 -33135 -83888
3476 -83888 -147153 -131961 -89585 -38751 -23304 -59467 -68631 -46364 -22037 -52892 -130395 -83624
3464 -83624 12025 53390 -27360 -107288 -81124 -85202 -73138 -58301 -70654 -58668 -17545 -6177
3452 -6177 66689 171278 178578 127619 43639 -8148 -39806 -29977 -105487 -106078 -121039 -48721 -80753
3439 -80753 -32238 -20954 111846 116935 96056 152926 156416 145319 106412 81880 106054 45048
3427 45048 -65554 -62140 23497 22589 50393 -3811 -86487 -39203 18076 99716 125477 63760
3415 63760 78479 11819 14409 14926 46537 90646 -24062 -62628 -11692 25254 -44968 -102861
3403 -102861 12964 49571 44088 45034 99910 155902 100479 72092 55810 1744 52669 44509
3391 44509 -23897 -95409 -113947 -101308 -57389 -69862 -12965 77921 81200 53122 70597 81192
3379 81192 111545 106505 70011 -15096 -686 -20466 -63738 -104382 -157786 -161422 -230200 -97760
3367 -97760 -34825 -75448 -83576 -56585 10641 22184 30038 38086 64028 106738 79604 18746
3355 18746 64849 105733 112459 97127 26333 -29355 -78918 -102161 -55440 35972 138271 102347
3343 102347 94320 94513 95926 101916 49942 38282 30441 64159 68917 -32243 -48949 -38922 4300
3330 4300 55078 84472 79312 59072 -32045 -85246 -88077 -40124 34967 102350 6513 -25153
3318 -25153 -92477 -53018 111709 184026 195118 54607 -108111 -167759 -137467 -113507 -33159
3307 -33159 -10514 -68200 -74734 -49118 -4634 26770 45239 -97696 -111136 -114095 -95390 -71040
3295 -71040 -76409 -154851 -105783 -96152 -106728 -53272 -53486 -139535 -94870 -62058 -21428 -22461 39538
3282 39538 62584 85459 90992 69765 34773 12951 -34153 -71800 -95851 26923 67825 -9207
3270 -9207 -16841 -5963 47795 71901 64145 53820 70888 170187 134584 82069 57155 20914
3258 20914 3533 42814 61457 97015 60867 -54658 -34312 -49976 -97130 -28614 -3317 -50266
3246 -50266 -87578 -31002 -37640 -77872 -48678 -56873 -51766 565 -27555 22050 140454 108449
3234 108449 39327 30702 28301 2858 78750 89203 85731 83871 77216 71675 42522 25829 -40248
3221 -40248 -35570 -34581 -22083 3025 -61617 -35027 19520 20937 -15456 -38835 -23640 -83268 -82881
3208 -82881 -29788 40107 157380 241141 207626 140908 94267 47485 -8428 -56242 -90981 -117987
3196 -117987 -122489 -134235 -30756 -39440 -79000 -282 1091 -13306 3313 -24594 -38569 -29944
3184 -29944 -118834 -194471 -202558 -144478 -69260 -14068 51666 20046 26082 15679 11624 19005 8548
3171 8548 -39448 -6270 -33272 -81492 -59373 -40926 -978 -47838 -9979 34245 36497 59527
3159 59527 34027 -42632 -148973 -69752 51756 37770 -19072 20250 -1506 10600 -8283
3148 -8283 -38549 5475 16916 16756 -24070 -772 -47694 -193701 -235956 -91915 -66640 -68244
3136 -68244 -95790 -16402 21609 -9168 -14444 -22793 -53910 -56187 -20699 -2419 -10575 -39286 -32670
3123 -32670 -2223 -2833 6695 15028 3974 20509 51663 62973 56136 168732 132247 94166 66659
3110 66659 52721 51246 -13469 -94735 -131177 -40264 102928 121997 2836 -33285 25419 -18406
3098 -18406 20828 82709 69092 28716 -54718 -87731 -73723 3038 26094 -64026 -38172 40142
3086 40142 49719 39028 92641 27547 -62469 -77170 1249 96404 81296 -16931 11859 -26461
3074 -26461 1298 48799 91695 114132 136292 144468 88034 75631 -17160 -9545 86700 66135
3062 66135 57690 96604 129608 135862 7037 -130256 -136859 -9595 57883 26702 -143021 -80458
3050 -80458 51559 113109 119331 86743 102517 120250 66394 38084 -24471 -81337 -25095 31495
3038 31495 14027 16563 47537 50719 75999 35026 21104 -10031 -5462 28171 -7223 -115039
3026 -115039 -107393 -57533 -20403 20302 -58781 -107857 -36542 51310 63677 53708 77142 59793
3014 59793 -10330 -26859 -119639 -141212 -39148 -45899 -71760 -98874 -107832 -92723 -62249 -73668
3002 -73668 -82771 -115011 -96987 -63840 -121668 -208045 -186037 -144260 -113511 -35879 48563 67371
2990 67371 8864 -51277 -15874 -26340 -2470 63019 89988 81161 22217 25260 47327 8711
2978 8711 -81955 -26614 109171 77548 89566 81380 65400 31347 -25368 -41213 -38224 -72279
2966 -72279 -36196 -21349 -12023 7120 -75777 -42736 -63916 -93667 -79446 -20109 33613 76441
2954 76441 13929 -70440 -82143 -53850 -77209 -37877 20959 -60202 -6491 88114 40657 -27313
2942 -27313 -38454 -20361 -33643 -79086 -68046 19775 102181 86957 14248 -4552 -64999 -80657
2930 -80657 -31712 64578 74117 97229 93804 72805 68419 129736 162007 120081 126407 139756 123644
2917 123644 106734 17521 -9210 -54730 -77315 -53018 39921 31531 2017 -27173 -51060 -49287
2905 -49287 -31808 -31520 -18072 -4580 -23696 -63427 -85345 -124227 -29129 95056 49921 62289
2893 62289 101606 149406 94999 57617 40607 120196 99172 22549 16957 35801 80262 100414
2881 100414 60539 -54763 -133463 -102748 -78343 -88421 -55300 40571 145528 66682 9577
2870 9577 8612 -18182 -88637 -25133 20282 35159 165718 68729 595 56145 22630 -47992
2858 -47992 -108502 -104059 -47279 18482 49486 -16892 -30575 12767 3276 75527 -14745 -105895
2846 -105895 -72952 -2409 89549 162214 148782 59647 67387 78025 119669 67287 7525 45030
2834 45030 35069 -20484 -39165 -34175 34328 4199 -11010 -52341 -104330 -53213 -39889 -62340
2822 -62340 -117522 -94799 -55225 -41787 -255 17489 2192 36502 104702 83149 6153 -31718
2810 -31718 21152 100025 37102 328 -14645 -65508 -63949 3273 73308 41520 79195 56683
2798 56683 -36197 -35053 -18666 61081 113695 89992 18714 43138 33759 6663 54361 -57763
2786 -57763 -55586 853 114624 63863 18960 32975 2863 -52271 -97120 -4876 37011 5817
2774 5817 9155 17286 -100959 -161456 -134619 -192812 -228996 -241805 -56802 27034 83614 95186
2762 95186 115650 193115 183962 167083 25090 14412 32245 59322 47416 101090 80653 40597
2750 40597 48634 62824 170771 177516 97153 6307 -41630 -10646 40266 51810 -15218 5302
2738 5302 -20515 -88239 -36726 -95292 -102954 -263 3699 -17317 14075 -10321 -48309 21863
2726 21863 39267 60419 69985 25839 114193 228794 272522 193788 76504 -18921 -129377
2715 -129377 -105875 -74866 -53712 95547 51091 48974 6359 -8589 -13001 -39340 69947 46495
2703 46495 51030 7413 -25511 -52337 -40258 -94363 -111790 -119931 -65428 93486 40886 -760
2691 -760 62541 10576 -71916 -118412 -96541 -55728 35023 102505 36075 -74562 -144526 -85766
2679 -85766 -95555 -84122 -67276 -84614 -10653 70969 56971 101846 59481 53149 56165 114877
2667 114877 129731 64860 43973 31232 -37455 -83677 -53255 -66798 -12129 38083 -32701 -109281
2655 -109281 -92634 -32817 -67279 -118125 -110763 -41131 44378 86302 -33681 -12297 34233 6728
2643 6728 13390 -15129 6160 82109 81653 -68139 -167315 -246885 -159619 5334 41649 -25416
2631 -25416 -33562 32802 98495 37909 5254 -773 -46882 -110391 -139587 -119548 -58597 12512
2619 12512 112191 87163 62050 188806 183478 142113 66090 35058 -38142 -73049 4537 119676
2607 119676 69806 -4069 45239 13227 -90424 -126837 -71283 -5196 -1071 -34653 -36186 -49672
2595 -49672 -64128 -32252 42247 -36155 -200259 -183067 -163453 -148868 -130940 -77619 -9274 -5544
2583 -5544 -44325 -35560 -17745 20382 -14411 -19668 11398 110142 116795 50550 36359 53875 59967
2570 59967 126668 134030 107845 101363 106035 106948 135376 33269 -82480 -120842 -159370 -129779
2558 -129779 -63603 -42665 -70709 -16425 50242 58984 58678 56612 60340 -39834 -52014 81985
2546 81985 92790 51747 74347 84855 87455 99019 114412 74269 -36624 10695 63174 90719
2534 90719 82231 8194 -8742 51003 133102 119591 125303 95215 74230 2278 40937 20752
2522 20752 -57728 -113657 -106304 -49474 -72974 -44137 26189 104672 140895 50283 -48008 3809
2510 3809 73197 97058 56381 59728 86234 106080 152614 130857 45722 78388 94954 77365
2498 77365 71658 24312 38739 120686 211023 134220 121546 132550 154748 183929 135666 21525
2486 21525 -1846 29226 53170 105328 160214 85090 38738 69229 53219 2302 -46052 -120490
2474 -120490 -27129 -4129 7735 12256 -43764 -90596 -88406 -52311 23655 -12018 -94456 -13305
2462 -13305 -11506 -79757 31837 73731 30100 50747 115490 9192 -59510 -149134 -165714 -97061
2450 -97061 -20117 -29115 -151677 -69241 23438 65063 -27435 -74507 -64892 -38469 53637 53819
2438 53819 6153 -16138 26022 48509 79733 95183 89759 68457 58897 30567 11813 2041
2426 2041 -4995 -78118 -101804 -35821 17913 -29253 -42251 6092 23920 22809 64756 17126
2414 17126 28452 60527 85536 -13458 -120543 -77842 -19488 13830 10212 -71560 -169646 -120152
2402 -120152 4038 18138 5528 102963 56310 -1622 -59517 -233 55882 18505 -42715
2391 -42715 -46921 -28392 108374 115472 4705 18879 37314 48790 152564 196103 116007 69590
2379 69590 119661 85760 32089 -85318 -104097 -71082 -48720 -64803 -18280 32214 112127 166169
2367 166169 125045 70160 -56853 -50061 52195 92863 26761 22809 108301 187149 36245
2356 36245 -56116 62629 109779 121877 190752 99629 8509 90816 92086 52913 15140 47488
2344 47488 108805 118607 28909 -117719 -155790 -128675 -68462 -54566 -76900 -95743 -123139 -138784
2332 -138784 -77040 -39226 -23364 -77307 -124205 -121435 -124486 -102651 -36939 20448 60383 66466
2320 66466 144610 42254 -85787 -153003 -115427 -14801 20679 32374 25046 49048 67925
2309 67925 54652 73945 32018 -27737 41416 47813 -22539 -30362 -15024 66742 158358 116083
2297 116083 64359 61257 -7269 -29271 35953 17530 -52346 -91780 -148239 -132614 -78211 1566
2285 1566 59125 79014 22886 21619 49067 11773 8262 46159 -8710 -20047 -26887 33226 93074
2272 93074 68887 42296 58487 -16940 -45625 -43862 27224 1288 -7925 -31192 -11008 12969
2260 12969 57627 131188 97180 42507 49218 43076 33982 -25530 -109550 -28165 -80540 -122580
2248 -122580 -85917 8895 31750 100285 98619 63077 -7262 -23618 34269 -11084 -4840 11057
2236 11057 5562 -39287 -59241 -112220 -78424 -40016 -23822 10162 -88083 -122100 -123497 -67939
2224 -67939 100696 226273 179855 69001 -14570 -14343 2932 914 -10995 -55676 -53236 52180
2212 52180 16360 15468 81995 20237 -14895 -59363 -50528 -3913 124368 143048 85268 18978
2200 18978 37595 96692 163318 97210 65328 42710 97981 89466 15061 -31520 -59190 40168
2188 40168 145672 231999 150155 26844 -3662 39240 -36433 -4036 70580 92881 48657
2177 48657 21131 -9098 15677 24125 -39270 42207 110822 83595 -11563 -51566 55168 124208
2165 124208 85154 37016 49730 -3789 -50890 -113598 -113811 -57953 -27905 -8557 30101 13104
2153 13104 26238 23120 -2450 75563 3932 -100355 -32313 -23931 -48001 -109125 -122308 -136710
2141 -136710 -137737 -137930 -114347 -50554 49700 130503 178766 103967 83118 45380 101293 131691
2129 131691 60275 24200 -3477 -2649 -25577 -109769 -90612 14559 8728 29863 -49334 -129612
2117 -129612 -80466 -112315 -60285 -25076 -55325 -37290 -27529 -40192 -111880 -175442 -117486 -62929
2105 -62929 -39648 -7436 -7538 15199 -29449 -58931 47421 123802 114507 56978 34820 3839
2093 3839 5453 -52901 -104415 -49812 -62018 -82178 -65751 -32507 17562 96237 46548 -35656
2081 -35656 -88469 -89601 -119818 -21458 797 -30245 -39485 54801 72716 43603 98132 103692
2069 103692 59124 73241 116185 165956 144589 76906 40128 -33029 -71287 -77314 -75437 -3762
2057 -3762 -40325 -4860 134163 169539 152490 99620 49105 -18242 4126 64975 196720 205039
2045 205039 182439 106312 70240 21655 -15276 -345 -30131 41718 149658 136044 87406
2034 87406 68912 50223 7606 -44500 -56769 14396 41448 128624 104122 -5923 -44793 64532
2022 64532 125257 127940 146242 126711 105815 90305 72916 85642 105829 69082 35114 3171
2010 3171 25391 12604 -62928 -170402 -53000 61247 -1599 -17726 -26286 -73770 -55244 -71814
1998 -71814 -78796 -92673 -65361 788 79134 103013 62204 82067 120885 128708 67523 6614
1986 6614 -10560 6029 13392 -27634 -37004 -29858 -71020 -141454 -224134 -141003 -17821 21198
1974 21198 58298 59750 12537 -38326 -43739 21818 -127448 -207702 -203962 -109680 -72926 -88833
1962 -88833 -53009 -29130 -40641 -16557 -54713 -103756 -117619 -51902 -59971 13623 -4478 37935
1950 37935 -31107 -58735 -35230 9733 30049 62361 62052 112124 152095 119370 59234 13471
1938 13471 15825 16588 54094 71693 60916 19171 -78217 -33271 66770 76307 102386 111513 88949
1925 88949 11697 -24223 -25686 -23292 -6617 59244 101359 118608 172606 207471 136497 102674
1913 102674 -1183 -31520 -14726 22811 14850 68444 111490 161029 110898 43533 11922 31091
1901 31091 82550 182099 240052 139244 39277 -14994 -108706 -69133 9707 -30667 -74834 -71515
1889 -71515 -53037 -29433 52160 124815 40566 -7361 -46822 -33479 -103103 -158464 -131112 -85154
1877 -85154 -15061 22145 -9577 26380 7763 -8308 4119 124881 145854 54144 4543 19633
1865 19633 40178 43522 14877 20115 31748 29212 34543 -6369 -2624 31175 24828 74718 172243
1852 172243 171029 73126 48238 -64921 -44676 -46630 -113504 -136200 -102635 -20588 86832 121764
1840 121764 95190 71595 132543 84954 126841 68811 -41399 -52433 35486 87850 49769
1829 49769 -7396 -16365 194 -9147 -71004 -140022 -138736 -92434 -109902 -62513 -28916 74372
1817 74372 126049 139911 96488 105856 134110 128153 122688 100061 80674 -11265 -6797 -3995 -63569
1804 -63569 -87202 -123096 -96287 -51640 -145295 -39258 48990 56925 -27985 -28619 62560 48565
1792 48565 98968 101116 77873 42763 23662 46963 68471 115992 194677 240802 222020 153411
1780 153411 76020 51389 76704 29440 24760 17971 8090 34975 98020 186576 131488 -18703
1768 -18703 -40204 1933 -11324 -55575 -140869 -83029 91217 69962 1899 54505 19971 22390
1756 22390 -66730 -69610 -44337 49322 96649 59401 -4534 27701 75427 -10664 -70098 -113785
1744 -113785 -107389 -66866 46951 95634 36000 70949 59419 42603 37443 59036 111638 75740
1732 75740 27479 -10882 -26527 16476 78974 106195 -6441 -109286 -142572 -205543 -157068
1721 -157068 -39035 30278 140530 185897 207369 184701 79933 55551 68104 -6803 37579
1710 37579 83589 117075 38587 14663 2395 37317 5787 -13209 -12835 -51819 -52943 -39079
1698 -39079 -56619 39675 89958 116057 138392 26661 -50613 3083 73136 57729 36367 70332
1686 70332 46574 -3261 35924 43090 66272 57286 13503 73130 73151 47445 33602 70924 131734
1673 131734 57483 -27413 -139862 -181023 -39290 30029 -22523 -71152 -16583 7405 -8066
1662 -8066 -55701 -29474 -17837 -26288 -6408 -28091 -27044 -52099 -78766 36761 35964 91529 130659
1649 130659 150088 83344 530 24350 67152 136655 119079 108097 84922 151394 124611 7604
1637 7604 -58628 -77121 -112139 -80319 -31268 -57371 39521 76422 9550 -27233 -24634 17633
1625 17633 4352 -9001 -64727 -169730 -66668 2125 143690 118117 23554 52485 26498
1614 26498 -22153 -64491 -75898 -39927 -81261 -74003 47722 58512 -30703 -54156 -79212 -96342
1602 -96342 -34622 15727 -21172 29935 26578 -15605 -33602 25783 -18060 10727 9779 -100974
1590 -100974 -117485 16499 54751 -10777 -90085 -11178 -26228 -182704 -192097 -119954 -119144 -96266
1578 -96266 -72185 -76867 -70555 -62212 -89738 -97166 -141417 -142324 -70095 -13093 -21682 -89626 -121643
1565 -121643 -46719 -9084 47112 90715 78049 -4626 -124980 -147350 -162878 -185960 -124063
1554 -124063 -49819 15092 -13983 12360 73807 56510 -1294 6878 -33012 -31615 -41703 -108388
1542 -108388 -106015 -105747 -94042 -104555 -129027 -58353 -8623 -67509 -59952 -94673 -139905 -69832
1530 -69832 -21015 31776 -4470 -6617 51713 88285 23124 101046 87777 128395 106800 1095
1518 1095 -94757 -90459 -45939 79018 141957 49642 23872 65921 30537 1487 -2053 37802
1506 37802 100043 15057 -72090 -75270 -49984 3709 16827 -16531 -35605 -94174 -97408 -80440
1494 -80440 -65269 -58172 5878 45497 21472 -31350 -60552 -89644 -95908 -153951 -128329 -100904
1482 -100904 -55342 -5783 122431 124073 85748 176665 139772 65368 57150 108456 89100 1739
1470 1739 -33905 -51082 -67771 -116028 -150824 -103136 23657 135635 129226 127273 -3489 -57458
1458 -57458 -55519 16457 -4134 -14550 7817 -13014 -75933 -112643 -62139 73104 62364 100329
1446 100329 97359 -28619 2078 59576 68280 14146 -1534 -21636 -18000 -94861 -94374 -82561
1434 -82561 -33104 -7460 -31579 -11751 28484 32485 472 -3505 -32031 43962 82217 -26984
1422 -26984 -45246 -48758 -126511 -157811 -83417 10850 74740 89480 130757 162477 178461 77140
1410 77140 33222 73816 148304 179200 105660 84652 71262 19749 9321 -44240 -90102 -128032
1398 -128032 -147297 -130862 -33839 -49303 34479 93714 159618 69363 -76603 -81148 -106167 -166812
1386 -166812 -101449 -93748 -78580 -44290 19115 21884 -26299 -58917 -53422 -77777 -61281 -55084
1374 -55084 -10885 -3926 -29344 -81405 -98636 -106084 -88800 -93790 15203 16811 -45339 -56544
1362 -56544 -41080 -12664 101649 133606 5154 -90647 -3586 106914 130173 93374 29107
1351 29107 11135 41165 71281 -25836 -6681 26874 47468 -8443 -30056 19838 34943 68763
1339 68763 153764 161502 141940 101875 113576 136927 151703 92227 27338 63471 157796 101622
1327 101622 60065 20282 8873 58122 107842 39658 -53729 -62828 -25364 -32283 -41707 5207
1315 5207 11484 129109 223929 175573 122745 88177 33375 20768 8077 84217 159637 154679
1303 154679 47457 37632 72892 25877 16201 -54703 -56266 -34037 8623 -74874 -102241 -174930
1291 -174930 -138110 -66996 -52859 -24853 -92130 -146789 -119279 -65279 -70937 4709 70688 121535
1279 121535 151454 157220 77985 4129 16549 26847 51393 33227 21301 29091 10430 -59891
1267 -59891 -20807 10500 15283 -13353 -25505 -81893 -84044 -7748 85516 55453 69794 50644
1255 50644 -75555 -46720 -20453 1232 -74208 -125949 -78984 -45431 16227 26385 -42586 -60239
1243 -60239 10620 -619 -34155 -1252 23856 50637 -17279 -89481 -142184 -119830 -85864 -108296
$$ [...]
##END NTUPLES=NMR SPECTRUM
##END=
