##TITLE=Analysis number 320649
Compound Code cc 45813
Book Reference 468/105
Project Code adrs
Chemist Name colinb
##JCAMPDX= 6.0         $$ Bruker NMR JCAMP-DX V2.0
##DATA TYPE= NMR SPECTRUM
##DATA CLASS= NTUPLES
##ORIGIN= Bruker BioSpin GmbH
##OWNER= nmr
$$ XWIN-NMR		Version 3.5
$$ Tue Jul  4 11:32:19 2006 GMT Daylight Time (UT+1h)  MAYBRIDGE\nmr@NMR_250MHZ
##.OBSERVE FREQUENCY= 250.131544655141
##.OBSERVE NUCLEUS= ^1H
##.ACQUISITION MODE= SIMULTANEOUS (DQD)
##.ACQUISITION SCHEME= undefined
##.AVERAGES= 16
##.DIGITISER RES= 18
##SPECTROMETER/DATA SYSTEM= dpx250
##.PULSE SEQUENCE= zg30
##.SOLVENT NAME= CDCl3
##.SHIFT REFERENCE= (INTERNAL, CDCl3, 0, 16.522)
##AUDIT TRAIL= $$ (NUMBER, WHEN, WHO, WHERE, WHAT)
$$ ##TITLE= Audit trail, XWIN-NMR		Version 3.5
$$ ##JCAMPDX= 5.01
$$ ##ORIGIN= Bruker BioSpin GmbH
$$ ##OWNER= nmr
$$ C:\u/data/dgb/nmr/ADRS/2170/pdata/1/auditp.txt
$$ ##AUDIT TRAIL=  $$ (NUMBER, WHEN, WHO, WHERE, WHAT)
(   1,<2006-07-04 11:31:48.73 +100>,<MAYBRIDGE\nmr>,<NMR_250MHZ>,
      <created by zg, POWCHK disabled, PULCHK disabled
       configuration hash MD5:
       E2 DF 36 D8 04 B2 41 60 5A D7 A3 38 5A 4B D0 FE
       data hash MD5: 64K
       37 88 77 4A 67 22 3D 88 D9 26 C4 95 E1 72 BD 41>)
(   2,<2006-07-04 11:32:09.70 +100>,<MAYBRIDGE\nmr>,<NMR_250MHZ>,
      <Start of raw data processing
       ef LB = 0.3 FT_mod = 6 PKNL = 1 SI = 32K 
       data hash MD5: 32K
       2C 65 29 73 30 7B 74 64 CA 84 74 B5 A0 7E 28 8A>)
(   3,<2006-07-04 11:32:11.38 +100>,<MAYBRIDGE\nmr>,<NMR_250MHZ>,
      <apk 
       data hash MD5: 32K
       34 B8 32 6E AF FC 93 D6 9C 7A E9 1A C0 58 92 AA>)
(   4,<2006-07-04 11:32:12.15 +100>,<MAYBRIDGE\nmr>,<NMR_250MHZ>,
      <abs ABSG = 5 
       data hash MD5: 32K
       C4 7B 31 B2 5D E4 51 BD 79 87 5A CE BC 17 90 1A>)
$$ ##END=
$$ 
$$ hash MD5
$$ C2 72 AC 85 7E 4F A2 6C 8A 01 1E 98 E1 B2 4F AE
##$RELAX= 
##$RELAX= 
##$RELAX= 
##$RELAX= 
##$RELAX= 
##$RELAX= 
##$RELAX= 
$$ Bruker specific parameters
$$ --------------------------
##$DU= <C:\u>
##$EXPNO= 2170
##$NAME= <ADRS>
##$PROCNO= 1
##$TYPE= <nmr>
##$USER= <dgb>
##$AMP= (0..31)
100 100 100 100 100 100 100 100 100 100 100 100 100 100 100 100 100 100 
100 100 100 100 100 100 100 100 100 100 100 100 100 100 
##$AQSEQ= 0
##$AQ_mod= 3
##$AUNM= <au_zg>
##$AUTOPOS= <17 >
##$BF1= 250.13
##$BF2= 250.13
##$BF3= 250.13
##$BF4= 250.13
##$BF5= 500.13
##$BF6= 500.13
##$BF7= 500.13
##$BF8= 500.13
##$BYTORDA= 1
##$CFDGTYP= 0
##$CFRGTYP= 5
##$CHEMSTR= <none>
##$CNST= (0..31)
1 1 145 1 1 1 1 1 1 1 1 1 1 1 1 1 1 1 1 1 1 1 1 1 1 1 1 1 1 1 1 1 
##$CPDPRG= <>
##$CPDPRG1= <>
##$CPDPRG2= <>
##$CPDPRG3= <>
##$CPDPRG4= <mlev>
##$CPDPRG5= <mlev>
##$CPDPRG6= <mlev>
##$CPDPRG7= <mlev>
##$CPDPRG8= <mlev>
##$CPDPRGB= <>
##$CPDPRGT= <>
##$D= (0..31)
0 1 0 0 0 0 0 0 0 0.06 0 0 0 0 0 0 0.0002 0 0 0 0 0 0 0 0 0 0 0 0 0 0 
0 
##$DATE= 1152009106
##$DBL= (0..7)
120 120 120 120 120 120 120 120 
##$DBP= (0..7)
150 150 150 150 150 150 150 150 
##$DBP07= 0
##$DBPNAM0= <>
##$DBPNAM1= <>
$$ [...]
##$SUBNAM7= <"">
##$SUBNAM8= <"">
##$SUBNAM9= <"">
##$SW= 20.6930455092707
##$SWIBOX= (0..15)
0 0 3 0 0 0 0 0 0 0 0 0 0 0 0 0 
##$SW_h= 5175.983436853
##$TD= 65536
##$TD0= 1
##$TE= 296.16
##$TE2= 300
##$TE3= 300
##$TEG= 300
##$TL= (0..7)
0 120 120 120 120 120 120 120 
##$TP= (0..7)
150 150 150 150 150 150 150 150 
##$TP07= 0
##$TPNAME0= <>
##$TPNAME1= <>
##$TPNAME2= <>
##$TPNAME3= <>
##$TPNAME4= <>
##$TPNAME5= <>
##$TPNAME6= <>
##$TPNAME7= <>
##$TPOAL= (0..7)
0.5 0.5 0.5 0.5 0.5 0.5 0.5 0.5 
##$TPOFFS= (0..7)
0 0 0 0 0 0 0 0 
##$TUNHIN= 0
##$TUNHOUT= 0
##$TUNXOUT= 0
##$USERA1= <user>
##$USERA2= <user>
##$USERA3= <user>
##$USERA4= <user>
##$USERA5= <user>
##$V9= 5
##$VALIST= <valist>
##$VCLIST= <CCCCCCCCCCCCCCC>
##$VD= 0
##$VDLIST= <DDDDDDDDDDDDDDD>
##$VPLIST= <PPPPPPPPPPPPPPP>
##$VTLIST= <TTTTTTTTTTTTTTT>
##$WBST= 1024
##$WBSW= 4
##$XGAIN= (0..3)
0 0 0 0 
##$XL= 0
##$YL= 0
##$YMAX_a= 411670
##$YMIN_a= -626454
##$ZGOPTNS= <>
##$ZL1= 120
##$ZL2= 120
##$ZL3= 120
##$ZL4= 120
##$ABSF1= 16.522
##$ABSF2= -4.171173
##$ABSG= 5
##$ABSL= 3
##$ALPHA= 0
##$AQORDER= 0
##$ASSFAC= 0
##$ASSFACI= 0
##$ASSFACX= 0
##$ASSWID= 0
##$AUNMP= <proc_1d>
##$AZFE= 0.1
##$AZFW= 0.1
##$BCFW= 0
##$BC_mod= 0
##$BYTORDP= 0
##$COROFFS= 0
##$CY= 12.5
##$DATMOD= 1
##$DC= 0
##$DFILT= <>
##$DTYPP= 0
##$F1P= 14.0000005364418
##$F2P= -0.99999901652339
##$FCOR= 0.5
##$FTSIZE= 32768
##$FT_mod= 6
##$GAMMA= 0
##$GB= 0
##$INTBC= 1
##$INTSCL= 1
##$ISEN= 128
##$LB= 0.3
##$LEV0= 0
##$LPBIN= 0
##$MAXI= 10000
##$MC2= 0
##$MEAN= 0
##$ME_mod= 0
##$MI= 0
##$NCOEF= 0
##$NC_proc= -3
##$NLEV= 6
##$NOISF1= 0
##$NOISF2= 0
##$NSP= 0
##$NTH_PI= 0
##$NZP= 0
##$OFFSET= 16.522
##$PC= 1
##$PHC0= 166.2497
##$PHC1= 9.213115
##$PH_mod= 1
##$PKNL= yes
##$PPARMOD= 0
##$PSCAL= 4
##$PSIGN= 0
##$REVERSE= no
##$SF= 250.13
##$SI= 32768
##$SIGF1= 0
##$SIGF2= 0
##$SINO= 400
##$SIOLD= 32768
##$SREGLST= <1H.CDCl3>
##$SSB= 0
##$STSI= 32768
##$STSR= 0
##$SW_p= 5175.98343685301
##$SYMM= 0
##$S_DEV= 0
##$TDeff= 65536
##$TDoff= 0
##$TI= <Analysis number 999999
Compound Code 99
Book Reference 9
Project Code 9>
##$TILT= no
##$TM1= 0
##$TM2= 0
##$TOPLEV= 0
##$USERP1= <user>
##$USERP2= <user>
##$USERP3= <user>
##$USERP4= <user>
##$USERP5= <user>
##$WDW= 1
##$XDIM= 32768
##$YMAX_p= 364053660
##$YMIN_p= -179220
$$ End of Bruker specific parameters
$$ ---------------------------------
##NTUPLES= NMR SPECTRUM
##VAR_NAME=  FREQUENCY,     SPECTRUM/REAL,   SPECTRUM/IMAG
##SYMBOL=    X,             R,               I
##VAR_TYPE=  INDEPENDENT,   DEPENDENT,       DEPENDENT
##VAR_FORM=  AFFN,          ASDF,            ASDF
##VAR_DIM=   32768,         32768,           32768
##UNITS=     HZ,            ARBITRARY UNITS, ARBITRARY UNITS
##FACTOR=    0.157963299565203, 1,           1
##FIRST=     4132.6476996994, 0,             0
##LAST=      -1043.33573715361, 0,           0
##MIN=       -1043.33573715361, -179220,     0
##MAX=       4132.6476996994, 364053660,     0
$$ Real data points
##PAGE= N=1
##DATA TABLE= (X++(R..R)), XYDATA
$$ [...]
$$ plain form
18265 228850 188847 214643 239652 268839 262017 265040 277014 316612 295126 265003 315275 308279
18253 308279 304176 348247 356276 315714 299856 342592 306965 262817 232850 236687 248311 240282
18241 240282 283626 327727 339543 328002 341812 385790 369910 367731 420995 471720 470420 430669
18229 430669 393071 429970 456809 445058 388210 374538 381558 401933 428553 479104 501871 472106
18217 472106 467028 476117 513921 540449 548172 564023 605161 592832 562946 525030 547891 559559
18205 559559 526075 495409 448740 433966 423671 451241 511364 491644 473469 447051 413834
18194 413834 428773 461735 459247 498239 501618 539787 569366 544458 503341 483580 513950 576890
18182 576890 598521 612029 597794 616165 613565 569843 539513 589360 645615 672652 716096 765986
$$ packed form
18265B28850m0003K5796K5009K9187o822L023J1974L9598k1486l0123N0272o996
18253C08279m103M4071Q029m0562j5858M2736l5627m4148k9967L837J1624q029
18241B40282M3344M4101J1816j1541J3810M3978j5880k179N3264N0725j300l9751
18229D30669l7598L6899K6839j1751n6848j3672P020K0375K6620N0551K2767k9765
18217D72106n078R089L7804K6528P723J5851M1138j2329k9886l7916K2861J1668
18205E59559l3484l0666m6669j4774j0295K7570O0123j9720j8175k6418l3217
18194D13834J4939L2962k488L8992L379L8169K9579k4908m1117j9761L0370O2940
18182E76890K1631J3508j4235J8371k600m3722l0330M9847N6255K7037M3444M9890
$$ plain form
18170 765986 796865 831139 807900 784637 809735 836204 844178 865155 867066 885756 943095 1018556
18158 1018556 1092022 1140274 1194205 1275879 1386782 1494815 1588801 1758472 2021655 2432094
18148 2432094 2946477 3512310 4063012 4648266 5236949 5742894 6030052 6082641 6024839 6115159
18138 6115159 6419520 6796409 7328979 7956586 8682859 9529379 10267295 10800096 11014858
18129 11014858 10843876 10451406 9909234 9308097 8616034 7771347 7022134 6456812 6085137
18120 6085137 5929560 6000678 6327545 6989173 8049231 9866552 13162415 19327031 29102101
18111 29102101 38248686 41701583 42520581 44132259 47587057 43946317 30641598 21156865
18103 21156865 16819586 14943648 14350799 14581335 15548474 17487739 20709258 25063270
$$ packed form
18170G65986L0879L4274k3239k3263K5098K6469P974K0977J911J8690N7339P5461
18158A018556P3466M8252N3931Q1674J10903J08033R3986J69671K63183M10439
18148B432094N14383N65833N50702N85254N88683N05945K87158N2589n7802R0320
18138F115159L04361L76889N32570O27607P26273Q46520P37916N32801K14762
18129A1014858j70982l92470n42172o01137o92063q44687p49213n65322l71675
18120F085137j55577P1118L26867O61628J060058J817321L295863O164616R775070
18111B9102101R146585L452897Q18998J611678L454798l640740j3304719r484733
18103B1156865m337279j875938n92849K30536R67139J939265L221519M354012
$$ plain form
18095 25063270 30196594 35565976 41007350 46674614 52105538 56159823 58144602 59291592
18087 59291592 61959190 67176315 73626980 79321290 83586153 86862421 89681922 90625937
18079 90625937 87433855 79729246 69619416 60369246 53051013 47000441 41458482 35938579
18071 35938579 30727216 26270172 22720693 20183437 18461111 17182725 16126120 15267836
18063 15267836 14603779 14090793 13664962 13246409 12883001 12559547 12306622 12161607 12137548
18054 12137548 12221017 12506108 12974006 13767634 15202277 17672029 21817219 27964255 35567614
18045 35567614 43280340 49809350 54412675 56715321 56201920 52260780 45343761 36661163
18037 36661163 28225059 21827260 17760113 15357321 14009434 13212629 12618217 12113780
$$ packed form
18095B5063270N133324N369382N441374N667264N430924M054285J984779J146990
18087E9291592K667598N217125O450665N694310M264863L276268K819501R44015
18079I0625937l192082p704609j0109830r250170p318233o050572n541959n519903
18071C5938579n211363m457044l549479k537256j722326j278386j056605q58284
18063A5267836o64057n12986m25831m18553l63408l23454k52925j45015k4059
18054A2137548Q3469K85091M67898P93628J434643K469752M145190O147036P603359
18045C5567614P712726O529010M603325K302646n13401l941140o917019q682598
18037C6661163q436104o397799m067147k402792j347887p96805n94412n04437
$$ plain form
18029 12113780 11616039 11119012 10506186 9761305 8994725 8373754 7927631 7570875 7275733
18020 7275733 7014119 6750571 6490335 6269500 6051635 5879835 5747574 5549518 5399675
18011 5399675 5232895 5078550 4995358 4943121 4883467 4877498 4895193 4915376 5000387 5103817 5208190
18000 5208190 5372506 5641455 5986993 6541976 7552240 9197177 11388476 13721174 15733817
17991 15733817 17107153 17820305 17721924 16646704 14707531 12119601 9454768 7373309
17983 7373309 6107498 5318285 4720737 4291564 3977652 3760257 3575251 3440146 3340436
17974 3340436 3271024 3218341 3170478 3133005 3124892 3066905 3034078 2995113 2954059 2916750 2822615
17963 2822615 2682331 2563707 2448477 2340009 2240523 2135824 2036533 1915364 1843760 1811839
$$ packed form
18029A2113780m97741m97027o12826p44881p66580o20971m46123l56756k95142
18020G275733k61614k63548k60236k20835k17865j71800j32261j98056j49843
18011E399675j66780j54345q3192n2237n9654n969J7695K0183Q5011J03430J04373
18000E208190J64316K68949L45538N54983J010264J644937K191299K332698K012643
17991A5733817J373336P13152r8381j075220j939173k587930k664833k081459
17983G373309j265811p89213n97548m29173l13912k17395j85006j35105r9710
17974C340436o9412n2683m7863l7473q113n7987l2827l8965m1054l7309r4135
17963B822615j40284j18624j15230j08468r9486j04699r9291j21169p1604l1921
$$ plain form
17953 1811839 1795780 1740161 1712346 1682823 1647234 1594502 1545593 1552406 1470682 1390962 1362002
17942 1362002 1376482 1386866 1347177 1239301 1174846 1179104 1138948 1093176 1046058 1047021 1081447 1156816
17930 1156816 1171863 1152887 1135907 1108970 1071643 1078628 1065332 1065573 1062362 1085831 1061789 1000156
17918 1000156 992439 1033832 1007308 972237 1003321 1042648 1050183 1020127 1012790 1013820 988093 1009722
17906 1009722 994600 944427 927042 910548 918803 921247 956380 993218 1037647 1027302 1065523 1126698
17894 1126698 1192102 1267275 1364860 1470412 1548661 1638228 1729924 1841628 1969004 2007533 1995877
17883 1995877 2038831 2095542 2095014 2071927 2046654 2041780 2031694 1985309 1972747 1951277 1926323 1929321
17871 1929321 1945965 1959082 2018309 2155050 2343918 2516518 2720786 2869005 3016360 3166631
$$ packed form
17953A811839j6059n5619k7815k9523l5589n2732m8909O813q1724p9720k8960
17942A362002J4480J0384l9689j07876o4455M258m0156m5772m7118R63L4426P5369
17930A156816J5047j8976j6980k6937l7327O985j3296K41l211K3469k4042o1633
17918A000156p717M1393k6524l5071L1084L9327P535l0056p337J030k5727K1629
17906A009722j5122n0173j7385j6494Q255K444L5133L6838M4429j0345L8221O1175
17894A126698O5404P5173R7585J05552P8249Q9567R1696J11704J27376L8529j1656
17883A995877M2954N6711n28k3087k5273m874j0086m6385j2562k1470k4954K998
17871A929321J6644J3117N9227J36741J88868J72600K04268J48219J47355J50271
$$ plain form
17861 3166631 3306526 3486699 3617310 3812416 4049893 4336974 4751683 5213247 5782579
17852 5782579 6564228 7546185 8860947 10789165 13643403 17908385 23973380 31859285
17844 31859285 40979305 50375974 58966851 65655920 69668423 71057711 70265907 67114699
17836 67114699 61343285 54521447 49748979 47934599 47062598 44946230 42927819 42763778
17828 42763778 44604961 48290305 54072484 61566072 69155441 75834104 81526977 85675232
17820 85675232 86427369 82118181 73565836 62982834 52353804 42833320 34806273 28518187
17812 28518187 24093734 21163580 19211817 17904695 17031644 16403326 16021212 15903473 16183189
17803 16183189 16851290 18041386 19479152 21104082 23167376 25636794 27788079 28869194
$$ packed form
17861C166631J39895J80173J30611J95106K37477K87081M14709M61564N69332
17852E782579P81649R81957J314762J928218K854238M264982O064995P885905
17844C1859285R120020R396669Q590877O689069M012503J389288p91804l151208
17836F7114699n771414o821838m772468j814380q72001k116368k018411j64041
17828D2763778J841183L685344N782179P493588P589369O678663N692873M148255
17820H5675232P52137m309188q552345j0583002j0629030r520484q027047o288086
17812B8518187m424453k930154j951763j307122q73051o28318l82114j17739K79716
17803A6183189O68101J190096J437766J624930K063294K469418K151285J081115
$$ plain form
17795 28869194 29132609 29377739 29428285 28539948 26906710 25692516 25019798 24480588 24458090
17786 24458090 25352298 26167193 25845517 25185288 25104621 25111832 23624346 20666567 18050155
17777 18050155 16321093 14721518 12748673 10861294 9459294 8532666 7909199 7398673
17769 7398673 6981938 6651805 6399855 6155446 5943669 5727387 5533448 5312308 5119767
17760 5119767 4929781 4781372 4670237 4537623 4304394 4060287 3879711 3716233 3600413
17751 3600413 3532536 3426935 3273540 3127017 3055195 2990078 2899825 2805517 2738684 2735707 2728477
17740 2728477 2722782 2707263 2678018 2658825 2665358 2645503 2607748 2612235 2561751 2420899 2283382
17729 2283382 2179239 2041597 1973874 1925274 1847561 1762300 1725313 1673777 1597462 1508370 1432893
$$ packed form
17795B8869194K63415K45130N0546q88337j633238j214194o72718n39210k2498
17786B4458090Q94208Q14895l21676o60229q0667P211j487486k957779k616412
17777A8050155j729062j599575j972845j887379j402000r26628o23467n10526
17769G398673m16735l30133k51950k44409k11777k16282j93939k21140j92541
17760E119767j89986j48409j11135j32614k33229k44107j80576j63478j15820
17751C600413o7877j05601j53395j46523p1822o5117r0253r4308o6833k977p230
17740B728477n695j5519k9245j9193O533j9855l7755M487n0484j40852j37517
17729B283382j04143j37642o7723m8600p7713q5261l6987n1536p6315q9092p5477
$$ plain form
17718 1432893 1364260 1337983 1362054 1325349 1289582 1261582 1239979 1196515 1155756 1119334 1121499
17707 1121499 1109813 1083771 1042341 1008430 941471 872516 857585 853199 802294 732855 723240 734248
17695 734248 744536 722135 688608 648049 617474 595988 614593 609660 596941 552042 591095 632735
17683 632735 631813 616343 620059 646396 621955 558742 539751 536371 552395 559168 505754 496112 456364
17670 456364 444254 384100 321332 310131 288193 252932 229631 260457 305933 308718 299769 271197
17658 271197 229356 214387 192763 176112 229894 281944 284426 310885 279835 245132 208403 214698
17646 214698 194146 179250 220932 242777 216388 166546 162174 158891 181309 238217 265198 250470
17634 250470 227606 200173 144194 166212 184577 224196 234575 214622 238135 277564 289306
$$ packed form
17718A432893o8633k6277K4071l6705l5767k8000k1603m3464m0759l6422K165
17707A121499j1686k6042m1430l3911o6959o8955j4931m386n0905o9439r615J1008
17695G34248J0288k2401l3527m0559l0575k1486J8605m933j2719m4899L9053M1640
17683F32735r22j5470L716K6337k4441o3213j8991l380J6024O773n3414r642l9748
17670D56364j2110o0154o2768j1201k1938l5261k3301L0826M5476K785q949k8572
17658B71197m1841j4969k1624j6651N3782N2050K482K6459l1050l4703l6729O295
17646B14698k0552j4896M1682K1845k6389m9842m372l283K2418N6908K6981j4728
17634B50470k2864k7433n5979K2018J8365L9619J0379j9953K3513L9429J1742
$$ plain form
17623 289306 311713 338113 298817 291830 321483 344832 358176 328745 340531 311309 291211 334075
17611 334075 369775 309080 266434 272357 261427 248611 218947 239857 249373 217752 176534 125815
17599 125815 79919 51197 111621 131983 137765 143988 145882 189990 204376 218527 274896 288869
17587 288869 301149 322111 326752 269295 266021 273474 260876 214058 198585 192214 162049 164504
17575 164504 159222 142957 146120 168071 244955 293725 314949 302544 327674 327038 272527 283325
17563 283325 318663 361429 362433 359490 336079 317565 360957 369044 364481 331670 368793 409664
17551 409664 431726 472781 453619 422685 414831 430114 450627 403434 387034 377802 379789 361645
17539 361645 361193 385889 409174 430645 480505 491591 460349 471357 475856 400086 366951 337935
$$ packed form
17623B89306K2407K6400l9296o987K9653K3349J3344k9431J1786k9222k0098M2864
17611C34075L5700o0695m2646N923j0930j2816k9664K0910R516l1621m1218n0719
17599A25815m5896k8722O0424K0362N782O223J894M4108J4386J4151N6369J3973
17587B88869J2280K0962M641n7457l274P453j2598m6818j5473o371l0165K455
17575A64504n282j6265L163K1951P6884M8770K1224j2405K5130o36n4511J0798
17563B83325L5338M2766J004k943k3411j8514M3392Q087m563l2811L7123M0871
17551D09664K2062M1055j9162l0934p854J5283K0513m7193j6400r232J987j8144
17539C61645m52K4696K3285K1471M9860J1086l1242J1008M499p5770l3135k9016
$$ plain form
17527 337935 321502 304118 252638 224204 194256 191488 144876 131856 165217 159676 118469 149263
17515 149263 132654 117959 112923 111107 109887 74131 61177 121315 121843 73319 31242 13998
17503 13998 54704 85148 17204 20842 53909 67427 37220 41000 69564 95359 162191 173789
17491 173789 160953 179803 199315 194058 172233 176658 160981 128249 109371 116724 117394 108473 81585
17478 81585 69163 39489 10592 23042 53369 33991 71919 75710 14416 -31976 1111 20007
17466 20007 1438 -9670 -4476 30094 43527 36824 30826 43421 14513 19323 56422 90235
17454 90235 121005 95382 122559 120237 120301 86397 49340 20151 50318 121388 208757 252648
17442 252648 246546 261891 267040 189817 135011 135125 108645 66187 51116 52723 73862 101157
$$ packed form
17527C37935j6433j7384n1480k8434k9948k768m6612j3020L3361n541m1207L0794
17515A49263j6609j4695n036j816j220l5756j2954O0138N28m8524m2077j7244
17503A3998M0706L0444o7944L638L3067J3518l0207L780K8564K5795O6832J1598
17491A73789j2836J8850J9512n257k1825M425j5677l2732j8878P353O70q921k6888
17478H1585j2422k9674k8897J2450L0327j9378L7928L791o1294m6392L3087J8896
17466B0007j8569j1108N194L4570J3433o703n998J2595k8908M810L7099L3813
17454I0235L0770k5623K7177k322O4l3904l7057k9189L0167P1070Q7369M3891
17442B52648o102J5345N149p7223n4806J14k6480m2458j5071J607K1139K7295
$$ plain form
17430 101157 100619 68991 105470 143883 171493 170292 195151 235920 256620 237087 207621 247732
17418 247732 298872 336938 338537 350192 361263 341310 276254 274183 271620 284002 291235 282465
17406 282465 253950 243978 216513 176220 186252 199683 143113 111451 96393 104955 103244 138924
17394 138924 108292 83615 27206 -14750 -8290 11751 35282 62261 54345 33904 44026 43446
17382 43446 60137 39734 -10016 8384 32377 6231 46340 66508 40286 32749 42537 924
17370 924 515 -4467 16044 -2557 -7036 41722 74145 44778 15090 2254 11808 25302 24533
17357 24533 -5857 -25142 -37031 -7960 41228 74887 48882 40864 41730 87058 99738 69227
17345 69227 66230 78096 74761 112967 119806 129542 156270 194744 230175 246955 208852 152135
$$ packed form
17430A01157n38l1628L6479L8413K7610j201K4859M0769K0700j9533k9466M0111
17418B47732N1140L8066J599J1655J1071j9953o5056k071k563J2382P233q770
17406B82465k8515r972k7465m0293J0032J3431n6570l1662j5058Q562j711L5680
17394A38924l0632k4677n6409m1956O460K0041K3531K6979p916k0441J0122n80
17382D3446J6691k0403m9750J8400K3993k6146M0109K0168k6222p537R788m1613
17370I24m09m982K0511j8601m479M8758L2423k9367k9688j2836R554J3494p69
17357B4533l0390j9285j1889K9071M9188L3659k6005q018Q66M5328J2680l0511
17345F9227k997J1866l335L8206O839R736K6728L8474L5431J6780l8103n6717
$$ plain form
17333 152135 112469 98425 82403 85638 101946 122272 123783 79781 96221 131656 124755 90035
17321 90035 79007 101694 94164 93796 84333 69031 56105 61846 38002 27397 44563 62972 46234
17308 46234 57173 110054 146241 112409 92947 68534 85987 104500 109451 96369 125973 123213
17296 123213 90669 74617 57911 84021 89747 63110 81504 109535 127517 135144 182842 131969
17284 131969 130275 163019 150838 167812 196344 143071 69158 64607 46977 8028 14847 7659
17272 7659 4496 53548 113849 88747 129805 221160 254453 266318 310487 290673 317544 282727
17260 282727 269208 253118 230755 234995 243469 190483 170190 184727 172153 151500 177090 219838
17248 219838 239158 243478 251677 318265 390462 410221 405693 383265 295184 220830 195962 167806
$$ packed form
17333A52135l9666j4044j6022L235J6308K0326J511m4002J6440L5435o901l4720
17321I0035j1028K2687p530l68r463j5302j2926N741k3844j0605J7166J8409j6738
17308D6234J0939N2881L6187l3832j9462k4413J7453J8513M951j3082K9604k760
17296A23213l2544j6052j6706K6110N726k6637J8394K8031J7982P627M7698n0873
17284A31969j694L2744j2181J6974K8532n3273p3913m551j7630l8949O819p188
17272G659l163M9052O0301k5102M1058R1355L3293J1865M4169j9814K6871l4817
17260B82727j3519j6090k2363M240Q474n2986k0293J4537j2574k0653K5590M2748
17248B19838J9320M320Q199O6588P2197J9759m528k2428q8081p4354k4868k8156
$$ plain form
17236 167806 146340 133411 84586 65545 51968 99415 173592 198627 157446 126643 112163
17225 112163 115311 100171 119571 178386 190069 128639 87639 67443 70950 118232 86711 76748
17213 76748 104719 122487 144366 121176 102338 105212 80370 89241 112488 109615 65846 74115
17201 74115 52826 36963 37513 77354 109505 114272 61776 16987 32874 32495 56335 99047 105184
17188 105184 106979 87004 123158 172513 172363 131131 140344 172281 181697 174819 156273 115124 74045
17175 74045 66478 43907 48602 37265 55175 88351 122721 160394 141647 155076 180663 173484
17163 173484 176722 210851 180196 137395 154729 146750 160795 90706 96758 114014 153487 178741
17151 178741 117556 119501 135016 141494 132112 128563 143670 112430 48946 41741 78731 135110
$$ packed form
17236A67806k1466j2929m8825j9041j3577M7447P4177K5035m1181l0803j4480
17225A12163L148j5140J9400N8815J1683o1430m1000k0196L507M7282l1521r963
17213G6748K7971J7768K1879k3190j8838K874k4842Q871K3247k873m3769Q269
17201G4115k1289j5863N50L9841L2151M767n2496m4789J5887l79K3840M2712O137
17188A05184J795j9975L6154M9355j50m1232R213L1937R416o878j8546m1149m1079
17175G4045p567k2571M695j1337J7910L3176L4370L7673j8747J3429K5587p179
17163A73484L238L4129l0655m2801J7334p979J4045p0089O052J7256L9473K5254
17151A78741o1185J945J5515O478r382l549J5107l1240o3484p205L6990N6379
$$ plain form
17139 135110 182348 217609 237935 199143 177803 229114 236529 229596 228751 225763 232412 220867 200204
17126 200204 185227 175991 161146 229486 249980 264101 257426 286928 314719 337417 345950 352220
17114 352220 345998 359504 353848 264268 252900 233601 206953 168260 163964 222994 247429 203294
17102 203294 219842 290274 319899 312705 278589 266770 268471 267554 261270 272551 276779 310724 300491
17089 300491 273723 243354 178729 182174 234289 246240 198863 148488 200027 183841 189394 204817
17077 204817 210635 234638 250001 211921 210191 241502 228215 210800 235960 280669 304300 304614
17065 304614 304602 297807 350271 405578 359076 314180 306027 309473 329147 341291 367677 387110 439680
17052 439680 471505 464952 454571 471357 493307 496642 492116 538791 570000 569394 607071 624037
$$ packed form
17139A35110M7238L5261K0326l8792k1340N1311P415o933q45k988O649j1545k0663
17126B00204j4977r236j4845O8340K0494J4121o675K9502K7791K2698Q533O270
17114C52220o222J3506n656q9580j1368j9299k6648l8693m296N9030K4435m4135
17102B03294J6548P0432K9625p194l4116j1819J701r17o284J1281M228L3945j0233
17089C00491k6768l0369o4625L445N2115J1951m7377n0375N1539j6186N553J5423
17077B04817N818K4003J5363l8080j730L1311j3287j7415K5160M4709K3631L14
17065C04614j2o795N2464N5307m6502m4896q153L446J9674J2144K6386J9433N2570
17052D39680L1825o553j0381J6786K1950L335m526M6675L1209o06L7677J6966
$$ plain form
17040 624037 630636 711588 796083 858013 905668 997811 1123123 1241926 1415680 1599721 1699584
17029 1699584 1827641 1973108 2117577 2264633 2474023 2684997 2958672 3285241 3688142
17020 3688142 4162667 4802417 5712079 7012975 9014196 12273613 17446581 24268638 30815866
17011 30815866 35772701 40595714 46859710 53079583 53885337 49167585 44406288 41560970
17003 41560970 38574881 32573550 25098392 19684754 16782147 15486389 15387558 16423605
16995 16423605 18875609 23372003 29500834 35149231 39236213 43303318 48839499 54205912
16987 54205912 54082728 48851143 43904438 40846920 37711090 31441352 23636501 17903396
16979 17903396 14485507 12399191 10999554 10048567 9311861 8774717 8339366 7906175 7524846
$$ packed form
17040F24037O599Q0952Q4495O1930M7655R2143J25312J18803J73754J84041R9863
17029A699584J28057J45467J44469J47056K09390K10974K73675L26569M02901
17020C688142M74525O39750R09662J300896K001221L259417N172968O822057O547228
17011C0815866M956835M823013O263996O219873Q05754m717752m761297k845318
17003D1560970k986089o001331p475158n413638k902607j295758r8831J036047
16995A6423605K452004M496394O128831N648397M086982M067105N536181N366413
16987E4205912j23184n231585m946705l057518l135830o269738p804851n733105
16979A7903396l417889k086316j399637r50987p36706n37144m35351m33191l81329
$$ plain form
16970 7524846 7174917 6895182 6521656 6164716 5879321 5625566 5401094 5149767 4884854
16961 4884854 4693140 4467912 4274726 4090695 3932406 3791497 3655873 3523182 3316616
16952 3316616 3137313 3002444 2859118 2753548 2658430 2582909 2490506 2407559 2313455 2260247
16942 2260247 2181694 2124769 2050080 1984908 1950411 1929488 1880225 1795313 1723935 1694651 1663040
16931 1663040 1570454 1468306 1431191 1416045 1368113 1336005 1301207 1267003 1230877 1202658 1182720
16920 1182720 1134774 1116580 1105744 1048744 1009687 990880 947745 926927 937153 900494 860776
16909 860776 809293 781728 775920 720237 681922 692437 699397 686505 659622 648045 634489 636019
16897 636019 617049 585433 568203 567923 545560 533139 518031 504193 460602 408825 401519 386332
$$ packed form
16970G524846l49929k79735l73526l56940k85395k53755k24472k51327k64913
16961D884854j91714k25228j93186j84031j58289j40909j35624j32691k06566
16952C316616j79303j34869j43326j05570r5118p5521r2403q2947r4104n3208
16942B260247p8553n6925p4689o5172l4497k0923m9263q4912p1378k9284l1611
16931A663040r2586j02148l7115j5146m7932l2108l4798l4204l6126k8219j9938
16920A182720m7946j8194j0836n7000l9057j8807m3135k0818J0226l6659l9718
16909H60776n1483k7565n808n5683l8315J0515O960j2892k6883j1577j3556J530
16897F36019j8970l1616j7230k80k2363j2421j5108j3838m3591n1777p306j5187
$$ plain form
16885 386332 352183 352839 327822 305242 299983 284708 286403 285483 273664 281018 301611 294750 275773
16872 275773 275719 264729 266276 227098 213084 206008 217677 249734 240309 244555 233751 191897 154017
16859 154017 154692 140053 146575 142413 134381 124248 154777 125192 137677 133407 88094 64201 56021
16846 56021 103723 98904 70521 60659 37411 30321 7796 -13214 66653 69046 45535 12646
16834 12646 114 13323 53187 33900 15708 -15867 1218 4487 4081 44251 73496 76668
16822 76668 72271 71594 85335 84051 83603 46294 18517 27498 53503 22693 -323 -7271 -25974
16809 -25974 -20985 -27812 815 22048 61325 104631 117008 69628 47432 33301 8837 18831
16797 18831 51125 64349 34135 34492 32968 13575 25333 46611 52853 30610 26076 3394 17496
$$ packed form
16885C86332l4149O56k5017k2580n259j5275J695r20j1819P354K0593o861j8977
16872B75773n4j0990J547l9178j4014p076J1669L2057r425M246j0804m1854l7880
16859A54017O75j4639O522m162q032j0133L0529k9585J2485m270m5313k3893q180
16846E6021M7702m819k8383r862k3248p090k2525k1010P9867K393k3511l2889
16834A2646j2532J3209L9864j9287j8192l1575J7085L269m06M0170K9245L172
16822G6668m397o77J3741j284m48l7309k7777Q981K6005l0810k3016o948j8703
16809b5974M989o827K8627K1233L9277M3306J2377m7380k2196j4131k4464R994
16797A8831L2294J3224l0214L57j524j9393J1758K1278O242k2243m534k2682J4102
$$ plain form
16784 17496 15357 14531 29044 47707 58695 75849 79810 82308 100391 111183 100337 84271 83388
16771 83388 34668 17944 19192 8288 39282 58569 58665 63365 66765 43826 51609 31888 -24481
16758 -24481 -37278 -37437 1233 35667 30991 30801 25207 940 -4515 26837 44910 63806 39242
16745 39242 47529 55947 80378 73961 40904 11822 9092 26194 25053 10826 -19408 -44078 -3453
16732 -3453 6981 10739 1095 8004 73176 82495 61690 26518 -3839 15923 23782 12223 -22985
16719 -22985 5353 31377 10479 3508 -2329 -7203 -6912 15328 20030 1153 -6689 12461 6062
16706 6062 22709 46376 67352 50503 24159 5641 6147 13190 20743 11671 -36274 -27280 6093
16693 6093 14863 18103 51799 28086 21208 12174 36356 55407 69579 48183 36194 5042 -31797
$$ packed form
16784A7496k139q26J4513J8663J0988J7154L961K498J8083J0792j0846j6066q83
16771H3388m8720j6724J248j0904L0994J9287R6M700L400k2939P783j9721n6369
16758b4481j2797j59L8670L4434m676j90n594k4267n455L1352J8073J8896k4564
16745C9242Q287Q418K4431o417l3057k9082k730J7102j141j4227l0234k4670M0625
16732c453J0434L758r644O909O5172R319k0805l5172l0357J9762P859j1559l5208
16719b2985K8338K6024k0898o971n837m874K91K2240M702j8877p842J9150o399
16706F062J6647K3667K0976j6849k6344j8518N06P043P553r072m7945Q994L3373
16693F093Q770L240L3696k3713o878r034K4182J9051J4172k1396j1989l1152l6839
$$ plain form
16680 -31797 -46423 -68681 -15699 53183 54554 40150 76555 69751 39973 664 -30066 -37980
16668 -37980 17356 40428 11364 -12130 -35530 -20364 8738 -10298 -24775 -54645 -75387 -64707
16656 -64707 -28206 11642 25721 32050 33049 7388 6614 -4602 -14255 -30535 -22442 -14360 -21251
16643 -21251 4772 1537 9995 19137 -22302 -98172 -74055 -31617 16089 -4492 -16833 -5102
16631 -5102 -436 -30507 -64209 -20356 -6695 -24561 -33173 -51187 -2043 34702 49093 46252
16619 46252 74824 49573 15496 -13497 -884 6538 2195 17240 -11006 -14893 11309 8736
16607 8736 5887 -27426 -55055 -76431 -79149 -45677 -54163 -65877 -31078 -24471 -37979 -22820 -38078
16594 -38078 -47880 -15230 -32319 -49728 -44339 -71298 -80920 -59251 2288 -9539 -47571 -62427
$$ packed form
16680c1797j4626k2258N2982O8882J371j4404L6405o804k9778l9309l0730p914
16668c7980N5336K3072k9064k3494k3400J5166K9102j9036j4477k9870k0742J0680
16656f4707L6501L9848J4079O329R99k5661p74j1216r653j6280Q093Q082o891
16643b1251K6023l235Q458R142m1439p5870K4117M2438M7706k0581j2341J1731
16631e102M666l0071l3702M3853J3661j7866q612j8014M9144L6745J4391k841
16619D6252K8572k5251l4077k8993J2613P422m343J5045k8246l887K6202k573
16607H736k849l3313k7629k1376k718L3472q486j1714L4799O607j3508J5159j5258
16594c8078r802L2650j7089j7409N389k6959r622K1669O1539j1827l8032j4856
$$ plain form
16582 -62427 -74789 -47205 -24044 -9344 -7762 6043 13581 31937 38755 -20126 -6532 26982
16570 26982 3580 36984 70586 72495 66754 44711 39381 52139 62159 47767 34241 8060
16558 8060 -14541 -3580 6883 -7466 -30956 -45587 -47672 -83443 -99656 -8204 18643 26245
16546 26245 30745 22030 28466 25784 25949 20338 -422 -50483 -80423 -69167 -41902 -45673 -32322
16533 -32322 -23485 -19179 4759 3805 -6380 -58451 -72032 -51012 -21958 -19527 -47439 -34953 -73166
16520 -73166 -41160 -28461 -29938 -40032 -10713 -26250 -30961 -44949 -49821 -50541 -55148 -83035 -97170
16507 -97170 -91985 -30173 8793 8361 6679 283 -9428 -43797 -77332 -80527 -25426 -4858 -7550
16494 -7550 913 -29714 -59299 -62134 -38315 -17544 27607 49194 970 -28266 -31345 -13984
$$ packed form
16582f2427j2362K7584K3161J4700J582J3805P538J8356O818n8881J3594L3514
16570B6982k3402L3404L3602J909n741k2043n330J2758J0020j4392j3526k6181
16558H060k2601J0961J0463j4349k3490j4631k085l5771j6213R1452K6847P602
16546B6245M500q715O436k682J65n611k0760n0061k9940J1256K7265l771J3351
16533c2322Q837M306K3938r54j0185n2071j3581K1020K9054K431k7912J2486l8213
16520g3166L2006J2699j477j0094K9319j5537m711j3988m872p20m607k7887j4135
16507i7170N185O1812L8966m32j682o396r711l4369l3535l195N5101K0568k692
16494g550Q463l0627k9585k835K3819K0771M5151K1587m8224k9236l079J7361
$$ plain form
16482 -13984 -7987 14934 43660 1608 2302 48675 46519 48673 68297 19351 36193 54045 114024
16469 114024 126807 96003 93966 118431 147134 165734 126671 195439 260240 283260 286165 264512
16457 264512 269028 250930 237866 212570 186140 195661 199587 133925 64936 36371 70027 102783
16445 102783 127668 150308 164183 206118 210000 240227 246069 222031 194410 168064 178263 167330
16433 167330 143385 130958 87648 42979 48186 46036 71085 96931 72252 27507 -22905 -21036
16421 -21036 2365 27686 11673 30148 58061 60109 34848 54603 81228 41974 30268 -38418
16409 -38418 -75898 -81389 -65919 -33179 -19672 -52479 -71592 -54805 -65360 -48314 -36043 -34750
16397 -34750 -19831 -10180 -47017 -49360 -48682 -82418 -67366 -38997 -62854 -70662 -24728 -13871 -55527
$$ packed form
16482a3984N997K2921K8726m2052O94M6373k156K154J9624m8946J6842J7852N9979
16469A14024J2783l0804k037K4465K8703J8600l9063O8768O4801K3020K905k1653
16457B64512M516j8098j3064k5296k6430R521L926o5662o8989k8565L3656L2756
16445A02783K4885K2640J3875M1935L882L0227N842k4038k7621k6346J0199j0933
16433A67330k3945j2427m3310m4669N207k150K5049K5846k4679m4745n0412J869
16421b1036K3401K5321j6013J8475K7913K048k5261J9755K6625l9254j1706o8686
16409c8418l7480n491J5470L2740J3507l2807j9113J6787j0555J7046J2271J293
16397c4750J4919R651l6837k343O78l3736J5052K8369k3857p808M5934J0857m1656
$$ plain form
16384 -55527 -62796 -66511 -55761 -28229 -51804 -91605 -78234 -13356 -46012 -18930 26062 525
16372 525 -36041 -18552 27491 -34703 -59795 -60655 -55940 -39661 -65980 -93440 -79361 -6910 -16443
16359 -16443 -25952 -68886 -79275 -48532 -48080 -25388 -16469 -33486 -19503 -5187 -35990 -42545 -62398
16346 -62398 -34463 -13299 -9444 2292 -7174 -7728 5138 24227 -1213 -26991 -54844 -73526
16334 -73526 -40440 -17420 -10604 18581 9696 -30444 -45175 -73165 -65244 -45575 -32822 -45099
16322 -45099 -53106 -39741 -6135 15416 -3920 11257 20424 38217 31904 8654 21554 34461
16310 34461 43261 45395 29299 28669 25476 52468 36291 52430 66735 74006 38758 -2935 -49
16297 -49 20789 30257 38269 18884 12974 5977 -11027 -58034 -73464 -37062 -27553 3590 738
$$ packed form
16384e5527p269l715J0750K7532k3575l9801J3371O4878l2656K7082M4992k5537
16372E25l6566J7489M6043o2194k5092q60M715J6279k6319k7460J4079P2451r533
16359a6443r509m2934j0389L0743M52K2692Q919j7017J3983J4316l0803o555j9853
16346f2398K7935K1164L855J1736r466n54J2866J9089k5440k5778k7853j8682
16334g3526L3086K3020O816K9185q885m0140j4731k7990P921J9669J2753j2277
16322d5099q007J3365L3606K1551j9336J5177R167J7793o313k3250J2900J2907
16310C4461Q800K134j6096o30l193K6992j6177J6139J4305P271l5248m1693K886
16297d9K0838R468Q012j9385n910o997j7004m7007j5430L6402R509L1143k852
$$ plain form
16284 738 2921 -5442 38831 55555 15165 11214 -40484 -55362 -35924 -47029 -65718 -87475 -60818
16271 -60818 9724 16079 -19343 -26008 -26638 -36466 -25056 27676 13445 -38960 -81748 -33667 18559
16258 18559 -32639 -80964 -67089 -45530 -52345 -35532 -7855 -8576 -15503 -27589 -50297 -43949 7262
16245 7262 -20844 -8395 -1551 8959 5866 43502 14318 -58635 -80384 -34615 20065 36673
16233 36673 46424 29511 41340 46338 9247 -20494 -31334 -48379 -44839 -37225 -6451 9596
16221 9596 15106 47242 33175 50237 39386 28794 25890 -13296 -4331 34254 39111 19540 -21607
16208 -21607 -62962 -109314 -96893 -76656 -44011 -77100 -88787 -87506 -56426 -21326 -14351 -56855
16196 -56855 -75221 -13633 -13639 -52136 -31845 21636 42740 -13027 -46673 -59170 -64499 -58585 -30379
$$ packed form
16284G38K183q363M4273J6724m0390l951n1698j4878J9438j1105j8689k1757K6657
16271f0818P0542O355l5422o665o30r828J1410N2732j4231n2405m2788M8081N2226
16258A8559n1198m8325J3875K1559o815J6813K7677p21o927j2086k2708O348N1211
16245G262k8106J2449O844J0510l093L7636k9184p2953k1749M5769N4680J6608
16233C6673R751j6913J1829M998l7091k9741j0840j7045L540P614L0774J6047
16221I596N510L2136j4067J7062j0851j0592k904l9186Q965L8585M857j9571m1147
16208b1607m1355m6352J2421K0237L2645l3089j1687J281L1080L5100O975m2504
16196e6855j8366O1588ol8497K0291N3481K1104n5767l3646j2497n329N914K8206
$$ plain form
16183 -30379 -4434 -16081 -9604 23303 17244 -10105 -50690 -22177 33006 47284 3045 -31684
16171 -31684 -14315 -18838 -64379 -74674 -73783 -61055 -64894 -47659 -64264 -58313 -46337 -72868 -64476
16158 -64476 -41479 -46990 -66374 -70116 -49515 -42481 -37238 -43899 -36077 -16669 10279 -22220 -79322
16145 -79322 -85726 -62968 -27605 -23074 -12531 7227 -28635 -45360 -55073 -60348 -88456 -124741
16133 -124741 -73785 -30480 -57003 -39409 -33 657 -70818 -123932 -84054 -46003 -55798 -62839
16121 -62839 -49553 -27092 -24314 -22534 -69492 -110443 -81888 -55648 -41809 -20792 -3160 -5732
16109 -5732 -26488 -10339 -12059 -11834 -26846 -6360 11530 -5833 -15532 -22702 4723 17979 -11365
16096 -11365 -45455 -15947 -19365 -4148 -42511 -67365 -59449 -39649 -39167 -52150 -85646 -80586 -62437
$$ packed form
16183c0379K5945j1647O477L2907o059k7349m0585K8513N5183J4278m4239l4729
16171c1684J7369m523m5541j0295Q91J2728l839J7235j6605N951J1976k6531Q392
16158f4476K2997n511j9384l742K0601P034N243o661P822J9408K6948l2499n7102
16145g9322o404K2758L5363M531J0543J9758l5862j6725r713n275k8108l6285
16133a24741N0956M3305k6523J7594L9376O90p1475n3114L9878L8051r795p041
16121f2839J3286K2461K778J780m6958m0951K8555K6240J3839K1017J7632k572
16109e732k0756J6149j720K25j5012K0486J7890j7363r699p170K7425J3256k9344
16096a1365l4090K9508l418J5217l8363k4854P916J9800M82j2983l3496N060J8149
$$ plain form
16083 -62437 -52250 -14538 -5409 5630 -9680 -19382 -67120 -64759 -39766 -30122 -29427 29804 96482
16070 96482 81942 41645 39822 20094 -626 -11977 -12457 11971 36300 8641 13494 2319
16058 2319 16149 16030 21940 35014 3306 -9722 16971 686 12098 30218 58546 -15617
16046 -15617 -9224 13701 17255 -24132 -34863 4084 6632 -32072 -66232 -78584 -70055 -48475
16034 -48475 15264 -8555 -27250 -20919 -58472 -51301 15622 48766 15699 1557 -22590 -16217
16022 -16217 -47661 -61011 -53071 -43471 -58082 -106001 -98203 -72151 -75107 -55241 -41799 -30826
16010 -30826 3921 -19019 5730 -41962 -69408 -30017 -8115 -72248 -82765 -62532 -30637 -20595
15998 -20595 -28587 -1514 11629 23186 2465 -23719 -31126 -42000 -32707 -1560 -16211 -47703
$$ packed form
16083f2437J0187L7712R129J1039j5310r702m7738K361K4993R644O95N9231O6678
16070I6482j4540m0297j823j9728k0720j1351m80K4428K4329k7659M853j1175
16058B319J3830j19N910J3074l1708j3028K6693j6285J1412J8120K8328p4163
16046a5617O393K2925L554m1387j0731L8947K548l8704l4160j2352Q529K1580
16034d8475O3739k3819j8695O331l7553P171O6923L3144l3067j4142k4147O373
16022a6217l1444j3350P940R600j4611m7919P798K6052k956J9866J3442J0973
16010c0826L4747k2940K4749m7692k7446L9391K1902o4133j0517K0233L1895J0042
15998b0595p992K7073J3143J1557k0721k6184p407j0874R293L1147j4651l1492
$$ plain form
15986 -47703 -45126 -3056 13007 -10411 -24612 -26236 -33314 -20170 -15257 -34912 -22807 -12581
15974 -12581 -39850 -62994 -53748 -46478 -62827 -82393 -70462 -55921 -42386 -31598 -21199 -59777
15962 -59777 -110565 -103284 -65491 -76060 -51912 -18277 7705 36104 17420 -2827 -4637 -18377
15950 -18377 -22468 -8367 31606 75916 53349 56052 9614 -41679 -35019 -5250 -4898 -5509 -32498
15937 -32498 2782 -3536 -7104 36355 -4348 -13573 11493 37502 79829 31463 -52497 -59779
15925 -59779 -29171 -26524 -21546 -36690 -47093 -63970 -88639 -73466 -68909 -61411 -59233 -118070 -152363
15912 -152363 -58186 7925 13377 -18258 -55924 -50087 -64972 -41940 -31421 -27148 -35625 -25607
15900 -25607 -32939 7491 48232 24306 7460 9265 -28065 -46066 -31694 -27292 20400 54097
$$ packed form
15986d7703K577M2070J6063k3418j4201j624p078J3144M913j9655J2105J0226
15974a2581k7269k3144R246P270j6349j9566J1931J4541J3535J0788J0399l8578
15962e9777n0788P281L7793j0569K4148L3635K5982K8399j8684k0247j810j3740
15950a8377m091J4101L9973M4310k2567K703m6438n1293O660K9769L52o11k6989
15937c2498L5280o318l568M3459m0703r225K5066K6009M2327m8366q3960p282
15925e9779L0608K647M978j5144j0403j6877k4669J5173M557P498K178n8837l4293
15912a52363R4177O6111N452l1635l7666N837j4885K3032J0519M273q477J0018
15900b5607p332M0430M0741k3926j6846J805l7330j8001J4372M402M7692L3697
$$ plain form
15888 54097 40443 53429 72352 96107 74617 49981 30469 31998 62736 43388 27085 8764
15876 8764 34889 31909 4959 -26331 -28019 -42494 -8901 33483 11336 -28543 -64383 -53885
15864 -53885 -23532 -12845 5023 19608 25003 44794 48410 73872 69718 20049 -5661 -54048
15852 -54048 -61779 -63665 -22310 -53374 -50108 -39568 -19351 30544 35754 8974 -23138 -86070
15840 -86070 -63444 -68720 -68538 -48747 -20629 29598 31150 54061 36630 -19533 -66382 -69314 -101509
15827 -101509 -63838 -47051 -15008 11296 21015 12982 -2189 -5725 -27991 -56533 -28386 12672
15815 12672 31034 21724 26873 -6859 1566 13135 -1184 -7928 -38493 -40374 -61096 -87888 -72065
15802 -72065 -32045 -16047 -39095 -58106 -28145 -30560 -23846 -28244 -23838 -24905 -8106 27124 -4507
$$ packed form
15888E4097j3654J2986J8923K3755k1490k4636j9512J529L0738j9348j6303j8321
15876H764K6125k980k6950l1290j688j4475L3593M2384k2147l9879l5840J0498
15864e3885L0353J0687J7868J4585N395J9791L616K5462m154m9669k5710m8387
15852e4048p731j886M1355l1064L266J0540K0217M9895N210k6780l2112o2932
15840h6070K2626n276J82J9791K8118N0227J552K2911j7431n6163m6849k932l2195
15827a01509L7671J6787L2043K6304R719q033j5171l536k2266k8542K8147M1058
15815A2672J8362r310N149l3732Q425J1569j4319o744l0565j881k0722k6792J5823
15802g2065M0020J5998k3048j9011K9961k415O714m398M406j067J6799L5230l1631
$$ plain form
15789 -4507 -61713 -77440 -69322 -44635 -21190 -28324 -29137 -47160 -43371 8477 8414 10093 41121 57640
15775 57640 48429 17 1357 -10651 -25242 -12276 -3959 -22600 -10211 1079 -7331 -15487 -30981
15762 -30981 -59140 -33975 15826 36069 26366 30807 17088 -8799 -46890 -12246 -5131 9378
15750 9378 -5882 378 -18052 -10896 33948 49220 42934 41547 9430 -2676 1861 -7510 -18361
15737 -18361 -38493 -50051 -40246 -24539 -11607 -15544 -21817 -4442 38137 39412 62021 46827
15725 46827 9291 -9041 5704 18429 -10480 -17319 -28295 -32590 -27400 39966 68191 71621
15713 71621 55240 30206 11751 -23368 -54258 -48604 -42501 -33727 -42964 -74809 -51926 -23762
15701 -23762 8250 21740 51818 68930 27371 3967 20472 48509 5475 -2438 -23716 -29290
$$ packed form
15789d507n7206j5727Q118K4687K3445p134q13j8023L789N1848o3J679L1028J6519
15775E7640r211m8412J340j2008j4591J2966Q317j8641J2389J1290q410q156j5494
15762c0981k8159K5165M9801K0243r703M441j3719k5887l8091L4644P115J4509
15750I378j5260O260j8430P156M4844J5272o286j387l2117j2106M537r371j0851
15737a8361k0132j1558R805J5707J2932l937o273J7375M2579J275K2609j5194
15725D6827l7536j8332J4745J2725k8909o839j0976m295N190O7366K8225L430
15713G1621j6381k5034j8455l5119l0890N654O103Q774r237l1845K2883K8164
15701b3762L2012J3490L0078J7112m1559k3404J6505K8037m3034p913k1278n574
$$ plain form
15689 -29290 -19254 -5571 -25984 -11763 -16113 -55739 -88504 -104398 -83874 -69952 -46594 -16066
15677 -16066 -13993 -28277 -19379 -21048 -23394 -38501 -42422 -31827 -37894 -13102 -29806 -16895 594
15664 594 -29534 -12540 6584 24170 -287 21788 48704 13481 1310 -31795 -53926 -67134
15652 -67134 -70021 -56900 -49608 -38817 -16541 19317 18092 20469 23325 23049 2609 -15645 -25282
15639 -25282 -40384 -43312 -26260 -5493 -13498 -8741 -2677 -13233 -41665 4791 19050 31052
15627 31052 15725 -23268 -62877 -71172 -88939 -68937 -13353 10940 10883 -26297 -52185 -53063 -12643
15614 -12643 -3141 8046 9485 -20402 -34310 -77998 -71643 -36229 -23766 -55907 -63175 -15290
15602 -15290 -12905 -11469 -5560 -19948 -47870 -63405 -57333 -87866 -78765 -59762 -46377 -1170 21470
$$ packed form
15689b9290J0036J3683k0413J4221m350l9626l2765j5894K0524J3922K3358L0528
15677a6066K073j4284Q898j669k346j5107l921J0595o067K4792j6704J2911J7489
15664E94l0128J6994J9124J7586k4457K2075K6916l5223j2171l3105k2131j3208
15652f7134k887J3121P292J0791K2276L5858j225K377K856k76k0440j8254r637
15639b5282j5102k928J7052K0767q005M757O064j0556k8432M6456J4259J2002
15627C1052j5327l8993l9609q295j7767K0002N5584K4293n7l7180k5888q78M0420
15614a2643R502J1187J439k9887j3908m3688O355L5414J2463l2141p268M7885
15602a5290K385J436N909j4388k7922j5535O072l0533R101J9003J3385M5207K2640
$$ plain form
15589 21470 23592 27392 36984 -33612 -112470 -165358 -133592 -114563 -68627 6700 -27364 -76371
15577 -76371 -62381 -54544 -32375 -13769 -20219 14093 -17063 -64488 -100384 -99034 -85890 -87285
15565 -87285 -98873 -68135 603 45004 47008 31972 21038 -41057 -58844 -67017 -58614 -54502
15553 -54502 -30085 3745 170 -49150 -14103 29125 34444 11181 -19643 -51629 -85616 -76466
15541 -76466 -102515 -122320 -72234 -60225 -68461 -81438 -107994 -95541 -71711 -63203 -40049 2218
15529 2218 33136 70679 129698 141268 27479 -24931 -44248 -62047 -90842 -96893 -67236 -55458
15517 -55458 -48436 -35144 -55600 6935 54340 62743 37578 -19198 -10791 8481 -9756 -33150
15505 -33150 -47439 -17028 23497 48157 24858 -13597 -37255 -20194 -29316 -46824 -75657 -109300
$$ packed form
15589B1470K122L800R592p0596p8858n2888L1766J9029M5936P5327l4064m9007
15577g6371J3990P837K2169J8606o450L4312l1156m7425l5896J350J3144j395
15565h7285j1588L0738O8738M4401K004j5036j0934o2095j7787q173Q403M112
15553e4502K4417L3830l575m9320L5047M3228N319k3263l0824l1986l3987R150
15541g6466k6049j9805N0086J2009q236j2977k6556J2453K3830Q508K3154M2267
15529B218L0918L7543N9019J1570j13789n2410j9317j7799k8795o051K9657J1778
15517e5458P022J3292k0456O2535M7405Q403k5165n6776Q407J9272j8237k3394
15505c3150j4289L0411M0525K4660k3299l8455k3658J7061r122j7508k8833l3643
$$ plain form
15493 -109300 -124696 -147885 -126239 -68842 -31883 3887 6788 12979 -10196 5479 15254 9732
15481 9732 -15975 -741 10884 -34713 -51723 -59023 -53910 -25605 -2331 11988 15020 -37971
15469 -37971 -51098 -31647 -48826 -78379 -61716 -65753 -88145 -97639 -53994 -37688 -59032 -41633
15457 -41633 -29944 -12307 -11093 3048 -5622 4517 20687 28568 -15053 -51848 -41957 -59437
15445 -59437 -29701 -21300 -44195 -55801 -17764 -29090 -37072 -29498 -32313 -38593 -25790 -30485 -54208
15432 -54208 -77193 -76922 -67502 -76234 -61760 -50464 -42153 -30740 -12341 -14205 -19657 -21242 -26218
15419 -26218 -35290 -67650 -20482 -23898 -73771 -62794 -26373 -15472 -32725 -15970 5226 15536
15407 15536 13777 -10744 -9636 53 -36951 -47897 -41968 -35474 -7058 -18173 -47067 -70937 -56755
$$ packed form
15493a09300j5396k3189K1646N7397L6959L5770K901O191k3175J5675R775n522
15481I732k5707J5234J1625m5597j7010p300N113K8305K3274J4319L032n2991
15469c7971j3127J9451j7179k9553J6663m037k2392r494M3645J6306k1344J7399
15457d1633J1689J7637J214J4141q670J0139J6170P881m3621l6795R891j7480
15445e9437K9736Q401k2895j1606L8037j1326p982P574k815o280J2803m695k3723
15432e4208k2985K71R420q732J4474J1296Q311J1413J8399j864n452j585m976
15419b6218r072l2360M7168l416m9873J0977L6421J0901j7253J6755K1196J0310
15407A5536j759k4521J108R689l7004j0946N929O494K8416j1115k8894k3870J4182
$$ plain form
15394 -56755 -46100 -28630 -85937 -98554 -62082 -29380 -46189 -35732 -58101 -73140 -70525 -31463
15382 -31463 5786 50991 73504 57954 43533 6554 -23362 -34609 -53538 -10390 -18715 261
15370 261 13761 -25385 -44720 -13519 -3891 -41781 -106428 -95757 -69347 -103714 -111500 -50490
15358 -50490 -23454 -38499 511 1946 -34878 -62472 -53199 -50039 -17572 12874 19044 20804 29368
15345 29368 45912 51456 69822 69146 14324 4884 37606 6259 -27661 -30701 -31063 -40285 -16820
15332 -16820 34604 40268 44962 42439 45504 56684 63592 31137 -10526 -11930 -6931 -3881 12877
15319 12877 3363 -9101 -24833 -8317 -16116 -31632 -97 9817 20997 26212 12182 -1533
15307 -1533 -8651 -1081 -34305 -48904 -50938 -71268 -57371 -74833 -62674 -99733 -112363 -61679
$$ packed form
15394e6755J0655J7470n7307j2617L6472L2702j6809J0457k2369j5039K615L9062
15382c1463L7249M5205K2513j5550j4421l6979k9916j1247j8929M3148q325J8976
15370B61J3500l9146j9335L1201R628l7890o4647J0671K6410l4367p786O1010
15358e0490K7036j5045L9010J435l6824k7594R273L160L2467L0446O170J760Q564
15345B9368J6544N544J8366o76n4822r440L2722l1347l3920l040l62r222K3465
15332a6820N1424N664M694k523L065J1180O908l2455m1663j404M999L050J6758
15319A2877r514j2464j5732J6516p799j5516L1535R914J1180N215j4030j3715
15307a533p118P570l3224j4599k034k0330J3897j7462J2159l7059j2630N0684
$$ plain form
15295 -61679 -21650 -373 -5034 8240 7493 -926 7158 -49760 -63399 -34233 35790 29380 12134
15282 12134 14835 27187 -23750 -79464 -75368 -24609 -29549 -83741 -95094 -74668 -37409 47558
15270 47558 58123 -6863 -3495 -3717 13575 14888 -9436 -34728 -937 -9189 -35857 -31857 1501
15257 1501 21561 11728 -14460 -19527 -34467 -40963 -43093 -53287 -89915 -112614 -94793 -54209 -54823
15244 -54823 -43260 -5067 842 -9698 9957 5507 -20944 -24811 -37731 -20164 -11040 5118
15232 5118 5494 -10087 -10369 -8183 -9122 -21415 12105 8885 -34441 -27744 15204 74392 80069 -27231
15218 -27231 -69144 -40144 -49800 -56686 -51863 -51923 -56086 -77937 -44718 -54589 -62405 -39247 -31547 -14942
15204 -14942 -18949 -22751 -17860 -12723 -30982 -40818 -71110 -57262 -38968 9166 15555 -45869 -107865
$$ packed form
15295f1679M0029K1277m661J3274p47q419Q084n6918j3639K9166P0023o410j7246
15282A2134K701J2352n0937n5714M096N0759m940n4192j1353K0426L7259Q4967
15270D7558J0565o4986L368k22J7292J313k4324k5292L3791q252k6668M000L3358
15257A501K0060r833k6188n067j4940o496k130j0194l6628k2699J7821M0584o14
15244e4823J1563L8193N909j0540J9655m450k6451l867j2920J7567R124J6158
15232E118L76j5581k82K186r39j2293L3520l220m3326O697M2948N9188N677j07300
15218b7231m1913K9000r656o886M823o0m163k1851L3219r871p816K3158P700J6605
15204a4942m007l802M891N137j8259r836l0292J3848J8294M8134O389o1424o1996
$$ plain form
15191 -107865 -74114 -40472 -7088 -13524 -63852 -29291 11265 -947 -45218 -75058 -57118 -75492
15179 -75492 -61738 -15956 28211 -8103 -18036 -8526 -69785 -55195 -23765 -50590 -35433 21885
15167 21885 430 -10652 6491 541 -32573 -85092 -67117 -36673 -27336 -30769 -57532 -53282
15155 -53282 -46789 -22930 2455 14819 -43387 -77116 -99105 -118733 -101936 -70003 -35819 -14997
15143 -14997 26769 43343 19418 -45668 -41483 6144 59250 29760 40094 50530 29585 9986
15131 9986 7001 -28291 -63947 -75853 -67104 -24527 -12816 -51834 -61706 -9003 27253 33896 4224
15118 4224 -10971 -8751 16997 38920 1664 -29366 -3626 -24067 -32729 -38650 -6288 34958
15106 34958 19437 -10593 -71522 -35744 1913 -9512 6017 46236 53138 27289 30171 34692
$$ packed form
15191a07865L3751L3642L3384o436n0328L4561M0556j2212m4271k9840J7940j8374
15179g5492J3754M5782M4167l6314r933R510o1259J4590L1430k6825J5157N7318
15167B1885k1455j1082J7143n950l3114n2519J7975L0444R337l433k6763M250
15155e3282O493K3859K5385J2364n8206l3729k1989j9628J6797L1933L4184K0822
15143a4997M1766J6574k3925o5086M185M7627N3106k9490J0334J0436k0945j9599
15131I986k985l5292l5656j1906Q749M2577J1711l9018r872N2703L6256O643k9672
15118D224j5195K220K5748K1923l7256l1030K5740k0441q662n921L2362M1246
15106C4958j5521l0030o0929L5778L7657j1425J5529M0219O902k5849K882M521
$$ plain form
15094 34692 26356 40150 -15204 -22846 -36735 -56456 -58727 -46190 -33680 -32719 -33940 -92608 -110154
15081 -110154 -47043 -54210 -91954 -106450 -67650 -22968 -35873 -16397 5899 -34844 -30275 -57513
15069 -57513 -51051 -48766 -43208 7146 38771 20606 28645 -5352 -41840 -11929 23447 37486
15057 37486 56550 99609 82043 40573 10000 -39902 -42212 -24498 -45935 -70466 -87197 -59866
15045 -59866 -55653 -65663 -37210 -285 4083 9245 -24810 -40793 -18019 -18795 -32737 -22459 -3756
15032 -3756 15401 47575 40829 20193 -1484 -18065 -35707 -18724 -14138 1235 465 -19513 5436
15019 5436 -3771 31002 31535 12221 -22827 -43980 -48100 -53425 -56443 -33424 -23881 -30999 -48435
15006 -48435 -51719 5967 -894 44805 54308 -6870 -12586 28248 10403 -16084 -17665 -58478 -54148
$$ packed form
15094C4692q336J3794n5354p642j3889j9721k271J2537J2510R61j221n8668j7546
15081a10154O3111p167l7744j4496L8800M4682j2905J9476K2296m0743M569k7238
15069e7513O462K285N558N0354L1625j8165Q039l3997l6488K9911L5376J4039
15057C7486J9064M3059j7566m1470l0573m9902k310J7714k1437k4531j6731K7331
15045e9866M213j0010K8453L6925M368N162l4055j5983K2774p76j3942J0278J8703
15032c756J9157L2174o746k0636k1677j6581j7642J6983M586J5373p70j9978K4949
15019E436r207L4773N33j9314l5048k1153m120n325l018K3019R543p118j7436
15006d8435l284N7686o861M5699R503o1178n716M0834j7845k6487j581m0813M330
$$ plain form
14993 -54148 -33638 -63937 -124554 -76299 15681 -3315 7774 44137 45898 33351 -10102 -31709
14981 -31709 -57137 -205 19101 -3781 -18015 -16266 -16250 -1376 -17367 795 -14426 -40601
14969 -40601 -27767 -61961 -49916 -44641 -36525 -19820 -28004 -16854 -2603 29933 -2464 -4917
14957 -4917 -7539 -2499 12347 8500 15734 35620 17201 -13497 -19930 -36684 -61914 -43567 25423
14944 25423 58218 52219 -4254 -65140 -70372 -71574 -120945 -124962 -72293 -72801 -35037 -29120 -32814
14931 -32814 -73057 -59523 -33658 24379 18519 -20516 -49426 -88678 -125661 -179220 -155458 -76281
14919 -76281 -24427 -15713 -41707 -43461 -5043 -15599 -39098 -70081 -17081 6596 20853 31190
14907 31190 16806 15138 -20043 -10055 35064 92938 56896 -9362 6188 10587 -7705 -9993
$$ packed form
14993e4148K0510l0299o0617M8255R1980j8996J1089L6363J761j2547m3453k1607
14981c1709k5428N6932J9306k2882j4234J749J6J4874j5991J8162j5221k6175
14969d0601J2834l4194J2045N275Q116J6705q184J1150J4251L2536l2397k453
14957d917k622N040J4846l847P234J9886j8419l0698o433j6754k5230J8347O8990
14944B5423L2795n999n6473o0886n232j202m9371m017N2669n08L7764N917l694
14931c2814m0243J3534K5865N8037n860l9035k8910l9252l6983n3559K3762P9177
14919g6281N1854Q714k5994j754L8418j0556k3499l0983N3000K3677J4257J0337
14907C1190j4384j668l5181R988M5119N7874l6042o6258J5550M399j8292k288
$$ plain form
14895 -9993 -10171 1707 43393 35562 2842 24095 43100 73019 91739 96193 66707 45660 23167
14882 23167 14828 7380 -11373 -1803 53387 114843 132642 146129 186048 205035 224397 253695
14870 253695 274267 255494 288132 318468 310801 276662 236487 236127 204836 191837 157621 129103
14858 129103 102678 90454 72198 42034 37724 15373 3421 33098 31319 37771 8572 8868
14846 8868 18411 17756 23778 36595 31606 9727 7953 32055 60613 55171 37671 33404 16661
14833 16661 -54460 -65510 -47281 -19881 18809 29744 20916 -1685 -29428 -24880 31864 23923
14821 23923 30815 16651 11133 3672 -33159 -38144 -3581 56840 65514 20507 64484 109400 91776
14808 91776 75113 57702 31920 27202 12640 22730 -1238 -39052 -31223 13330 -10751 -45985
$$ packed form
14895i993j78J1878M1686p831l2720K1253J9005K9919J8720M454k9486k1047k2493
14882B3167q339p448j8753R570N5190O1456J7799J3487L9919J8987J9362K9298
14870B53695K0572j8773L2638L0336p667l4139m0175l60l1291j2999l4216k8518
14858A29103k6425j2224j8256l0164m310k2351j1952K9677j779O452k9199K96
14846H868R543o55O022J2817m989k1879j774K4102K8558n442j7500m267j6743
14833A6661p1121j1050J8229K7400L8690J0935q828k2601k7743M548N6744p941
14821B3923O892j4164n518p461l6831m985L4563O0421Q674m5007M3977M4916j7624
14808I1776j6663j7411k5782m718j4562J0090k3968l7814P829M4553k4081l5234
$$ plain form
14796 -45985 -44628 -40306 -167 9995 -36047 -69461 -34410 1210 8454 18355 -13670 -6574 -31965
14783 -31965 -37172 -37440 -44483 -47828 -49376 -63819 -63479 -26686 -18747 -56949 -57948 -48206 -47918 -46878 -77994
14768 -77994 -39851 21763 19654 -31947 -62702 -74285 -69706 -86925 -97473 -60963 -65012 -51439
14756 -51439 -37521 -36670 -15199 5603 -57045 -71358 -11809 -720 40449 49326 21014 -828
14744 -828 -47602 -16660 39753 38955 28171 11042 38343 44524 17012 17066 56119 82008 103764
14731 103764 98372 52142 41450 6258 1192 -17566 3010 -31364 -77870 -100053 -107011 -110397
14719 -110397 -78837 -90071 -74781 -24909 -28874 -77984 -47942 4603 50082 82396 30711 -22787
14707 -22787 -55973 -37172 -37534 -62067 -62294 -83210 -92375 -79841 -69389 -59175 -23494 -7779 -1474
$$ packed form
14796d5985J357M322M0139J0162m6042l3414L5051L5620P244R901l2025P096k5391
14783c1965n207k68p043l345j548j4443L40L6793P939l8202r99R742K88J040l1116
14768g7994L8143O1614k109n1601l0755j1583M579j7219j0548L6510m049J3573
14756e1439J3918Q51K1471K0802o2648j4313N9549J1089M1169Q877k8312k1842
14744h28m6774L0942N6413p98j0784j7129K7301O181k7512N4L9053K5889K1756
14731A03764n392m6230j0692l5192n066j8758K0576l4374m6506k2183o958l386
14719a10397L1560j1234J5290M9872l965m9110L0042N2545M5479L2314n1685n3498
14707b2787l3186J8801l62k4533k27k0916r165J2534J0452J0214L5681J5715O305
$$ plain form
14694 -1474 -22338 -36813 -30134 -45066 -10460 29489 -48081 -64883 -56145 -59632 -64240 -41423 -1767
14681 -1767 18913 26738 -1103 -6766 -19734 -58694 -79508 -123540 -126873 -87491 -68245 -45405
14669 -45405 -76988 -58103 -22969 3525 16530 27917 31557 39026 35802 46042 41500 39070 4403
14656 4403 -13703 -20736 10335 40105 -3918 -88117 -96479 -26145 36643 3726 -29087 -32627
14644 -32627 -25887 -8996 21396 30998 16028 23831 14614 1546 30925 88230 72699 51212
14632 51212 59496 72927 115867 120632 99249 68165 58204 41018 -29073 -27489 -37528 -70707
14620 -70707 -39663 -57365 -63918 -51931 -47826 -79954 -64059 18248 29625 -12061 -55219 -66287
14608 -66287 -60173 -38160 -23797 -23602 -3608 -24557 -90596 -17681 37121 6081 19285 23686
$$ packed form
14694a474k0864j4475O679j4932L4606L9949p7570j6802Q738l487m608K2817L9656
14681a767K0680P825k7841n663j2968l8960k0814m4032l333L9382J9246K2840
14669d5405l1583J8885L5134K6494J3005J1387L640P469l224J0240m542k430l4667
14656D403j8106p033L1071K9770m4023q4199q362P0334O2788l2917l2813l540
14644c2627O740J6891L0392R602j4970P803r217j3068K9379N7305j5531k1487
14632E1212Q284J3431M2940M765k1383l1084r961j7186p0091J584j0039l3179
14620g0707L1044j7702o553J1987M105l2128J5895Q2307J1377m1686m3158j1068
14608f6287O114K2013J4363J95J9994k0949o6039P2915N4802l1040J3204M401
$$ plain form
14596 23686 17639 -22777 -76316 -80782 -54812 -26717 -43538 -51977 -57270 -46793 -16700 19701
14584 19701 35293 87946 131927 83344 26864 34892 19864 -8082 -42969 -13255 -5883 -19599
14572 -19599 -890 13413 30491 21117 59689 71699 69761 61486 31958 24305 -13639 -3906 -15911
14559 -15911 1081 21349 18426 19107 -21653 -15882 9707 10760 7931 6188 -2483 13780 63089
14546 63089 53129 64230 51091 32652 28707 31293 -1607 -19802 -1244 -4663 13132 -12958
14534 -12958 -32656 -12585 51574 65107 3154 -45028 -33167 -15328 55302 73083 55304 35187
14522 35187 63262 39423 17328 42987 38878 19438 4843 14018 10355 -11747 -29024 -31267
14510 -31267 -26276 -4844 -320 14464 3798 -3026 30073 16385 -4033 14276 41687 30416
$$ packed form
14596B3686o047m0416n3539m466K5970K8095j6821q439n293J0477L0093L6401
14584A9701J5592N2653M3981m8583n6480Q028j5028k7946l4887K9714P372j3716
14572a9599J8709J4303J7078r374L8572J2010j938q275k9528p653l7944R733j2005
14559a5911J6992K0268k923O81m0760N771K5589J053k829j743q671J6263M9309
14546F3089r960J1101j3139j8439l945K586l2900j8195J8558l419J7795k6090
14534a2958j9698K0071O4159J3533o1953m8182J1861J7839P0630J7781j7779k0117
14522C5187K8075k3839k2095K5659m109j9440j4595R175l663k2102j7277k243
14510c1267M991K1432M524J4784j0666o824L3099j3688k0418J8309K7411j1271
$$ plain form
14498 30416 51726 30276 28326 49414 35195 20250 14484 -13612 -33979 -47018 -28702 -39810
14486 -39810 -34087 -42400 -79841 -22682 1379 -23789 -66640 -93809 -88347 -58137 -34137 -28092
14474 -28092 21914 32318 35328 76899 60657 20781 318 -34929 -44107 -83816 -80924 -50543
14462 -50543 -14987 -7153 -34705 -24259 5622 602 -21250 -58229 -64087 -60653 -24316 7769
14450 7769 -4232 -26471 -34779 -38346 -17180 -10021 25781 34882 -23806 -9347 43049 25177 9489
14437 9489 17211 18756 36017 51564 58760 49779 36595 4205 -39416 -30407 -12654 -33902 -76391
14424 -76391 -98291 -70212 -32837 -41114 -57897 -82901 -67885 -21596 -27756 -2828 7820 29259
14412 29259 53058 -17135 -57899 -50863 -37382 -51098 -36410 -19814 -53815 -74071 -68500 -47939
$$ packed form
14498C0416K1310k1450j950K1088j4219j4945n766k8096k0367j3039J8316j1108
14486c9810N723q313l7441N7159K4061k5168m2851k7169N462L0210K4000O045
14474b8092N0006J0404L010M1571j6242l9876k0463l5247r178l9709K892L0381
14462e0543L5556P834k7552J0446K9881n020k1852l6979n858L434L6337L2085
14450G769j2001k2239q308l567K1166P159L5802R101n8688J4459N2396j7872j5688
14437I489P722J545J7261J5547P196q981j3184l2390m3621R009J7753k1248m2489
14424g6391k1900K8079L7375q277j6783k5004J5016M6289o160K4928J0648K1439
14412B9259K3799p0193m0764P036J3481j3716J4688J6596l4001k0256N571K0561
$$ plain form
14400 -47939 -78113 -103895 -76228 -84935 -49076 -10847 -4763 -7844 -22053 -40191 -44964 -43817 -55015
14387 -55015 -38789 -20979 24463 30641 -17183 -74887 -66986 -59259 -34269 -34150 -19571 -13439 -7115
14374 -7115 -18188 8740 2021 -17292 -24738 -29369 -18982 -41141 -70408 -39327 3253 16782
14362 16782 -7164 -22731 -58366 -60671 -10813 11766 1252 47645 63443 98137 93379 72619
14350 72619 43106 -9779 -787 307 40567 38877 -6019 -43975 -62703 -59919 -45509 -41845 -47267
14337 -47267 -35743 -21060 -6634 49494 53573 48386 23869 9188 -2098 13498 11933 -15350
14325 -15350 -52344 -19661 -10258 7601 -10294 28597 23172 -37391 -39719 -21225 -37284 -45208
14313 -45208 -66491 -97299 -100562 -80930 -68842 -55782 -40280 -20774 -23047 1327 31459 41266
$$ packed form
14400d7939l0174k5782K7667q707L5859L8229O084l081j4209j8138m773J147j1198
14387e5015J6226J7810M5442O178m7824n7704P901P727K4990J19J4579O132O324
14374g115j1073K6928o719j9313p446m631J0387k2159k9267L1081M2580J3529
14362A6782k3946j5567l5635k305M9858K2579j0514M6393J5798L4694m758k0760
14350G2619k9513n2885Q992J094M0260j690m4896l7956j8728K784J4410L664n422
14337d7267J1524J4683J4426N6128M079n187k4517j4681j1286J5596j565k7283
14325a5350l6994L2683R403J7859j7895L8891n425o0563k328J8494j6059p924
14313d5208k1283l0808l263J9632J2088J3060J5502J9506k273K4374L0132R807
$$ plain form
14301 41266 27645 37007 18104 6981 5693 31532 48560 32092 -600 -40988 -46809 -22143
14289 -22143 -9137 -2007 12578 27540 34419 20934 2416 68113 75935 79975 107928 109762 69159
14276 69159 53719 56603 21114 28682 -47311 -68607 -21632 9460 2403 -35990 -50995 -52677
14264 -52677 -74340 -89366 -32979 -22 1871 3575 37075 34650 11804 2966 22715 4251
14252 4251 -5550 -22342 -21452 8531 5447 2947 -29416 -36213 -41067 -57522 -36700 1365 -401
14239 -401 -54366 -55949 -56163 -47982 -64567 -45054 -35781 -36801 -22443 8548 65402 84431 79990
14226 79990 25082 -56384 -98009 -121334 -141209 -133980 -87952 -66355 -16222 -18372 -15823 -26317
14214 -26317 -18580 -6382 -17361 -40413 -22382 -36491 -39210 987 -1174 639 -22803 -17571 -15726
$$ packed form
14301D1266j3621R362j8903j1123j288K5839J7028j6468l2692m0388n821K4666
14289b2143J3006P130J4585J4962O879j3485j8518O5697P822M040K7953J834m0603
14276F9159j5440K884l5489P568p5993k1296M6975L1092p057l8393j5005j682
14264e2677k1663j5026N6387L2957J893J704L3500k425k2846q838J9749j8464
14252D251r801j6792Q90K9983l084k500l2363o797m854j6455K0822L8065j766
14239d01n3965j583k14Q181j6585J9513R273j020J4358L0991N6854J9029m441
14226G9990n4908q1466m1625k3325j9875P229M6028K1597N0133k150K549j0494
14214b6317P737J2198j0979k3052J8031j4109k719M0197k161J813k3442N232J845
$$ plain form
14201 -15726 -43294 -72347 -53245 -7020 53788 28985 -17749 -6596 -11582 -57414 -70751 -33574
14189 -33574 -22288 -11002 -5178 -10119 -31058 -14575 6008 -4794 -22566 -12619 -22866 -11797
14177 -11797 -24743 -23264 -23313 -2398 -19548 -7298 -38439 -2461 -16098 -52031 -25265 -53446
14165 -53446 -29201 -36760 -40130 -42377 -19491 -20061 -51069 -35163 -39296 -43331 -49719 -69977 -49643
14152 -49643 -21447 -67110 -77182 -50831 -44710 -30222 -44509 -67926 -51238 -3389 12049 -7995
14140 -7995 -25541 -34426 -65012 -63345 -24640 -4282 -34757 -35490 -52849 -68045 -85033 -54764 -4299
14127 -4299 -53299 -43262 -7387 2265 50123 45976 43826 19081 17295 11358 16054 65712 41913
14114 41913 39593 62326 32563 63106 101585 101918 79401 48111 7619 -17786 -3808 -10156
$$ packed form
14201a5726k7568k9053J9102M6225O0808k4803m6734J1153m986m5832j3337L7177
14189c3574J1286J1286N824m941k0939J6483K0583j0802j7772R947j0247J1069
14177a1797j2946J479m9K0915j7150J2250l1141L5978j3637l5933K6766k8181
14165e3446K4245p559l370k247K2886n70l1008J5906m133m035o388k0258K0334
14152d9643K8196m5663j0072K6351O121J4488j4287k3417J6688M7849J5438k0044
14140g995j7546q885l0586J667L8705K0358l0475p33j7359j5196j6988L0269N0465
14127d299m9000J0037L5875R652M7858m147k150k4745j786n937M696M9658k3799
14114D1913k320K2733k9763L0543L8479L33k2517l1290m0492k5405J3978o348
$$ plain form
14102 -10156 -31613 -34658 -44545 -22151 -16227 -33447 -13171 -17534 -28466 -9728 7796 5968 6127
14089 6127 11560 3647 -6025 -21185 8556 39357 25989 34298 41708 -772 7408 56051 85141
14076 85141 89821 64171 4516 -27738 -25438 27023 81086 124663 74037 64209 45822 2598
14064 2598 42328 56285 46778 17534 20610 63640 74152 10312 -19590 -38593 -43250 -25644
14052 -25644 -21735 -14979 -21329 -64614 -46248 -32509 -21127 8511 -20118 -80555 -104296 -67411
14040 -67411 -1651 71126 87507 136628 103368 27549 -63489 -74389 -11461 30924 30278 29565
14028 29565 15772 -2589 -11570 -4993 -33271 -31494 10651 25236 24937 25888 49193 28594 4239
14015 4239 -11139 -28933 -11970 8677 48454 53305 55566 69782 61068 63415 60621 56614 41482
$$ packed form
14102a0156k1457l045r887K2394N924j7220K0276m363j0932J8738J7524j828J59
14089F127N433p913r672j5160K9741L0801j3368Q309P410m2480Q180M8643K9090
14076H5141M680k5650n9655l2254K300N2461N4063M3577n0626r828j8387m3224
14064B598L9730J3957r507k9244L076M3030J0512o3840k9902j9003m657J7606
14052b5644L909O756o350m3285J8366J3739J1382K9638k8629o0437k3741L6885
14040f7411O5760P2777J6381M9121l3260p5819r1038j0900O2928M2385o46p13
14028B9565j3793j8361q981O577k8278J777M2145J4585k99R51K3305k0599k4355
14015D239j5378j7794J6963K0647L9777M851K261J4216q714K347k794m007j5132
$$ plain form
14002 41482 50752 45133 37494 48478 -7783 -29654 -25460 -10360 -22589 -23148 -39391 -21001 -19082
13989 -19082 -25038 -44071 -19426 24709 -24410 -14941 25380 32778 -7761 -1379 29194 4411
13977 4411 8766 13236 -7623 156 460 -3968 3586 15907 -9554 14961 36563 8718 38479
13964 38479 56289 15586 -8019 -36229 -25647 32500 43422 25619 61845 90901 70812 35044
13952 35044 4740 443 10155 10463 14044 -3086 -31936 2304 37376 -13088 -70306 -68012 -59275
13939 -59275 -53323 -31517 -6740 13327 16583 -8415 7163 -6051 -11744 8983 -17442 -70925
13927 -70925 -58397 -10800 31447 2939 -39380 -26729 -47821 -1004 -1558 -27203 -35186 14895
13915 14895 11976 1922 -28746 -5117 48903 42411 33892 10322 5800 -7143 -19567 10247
$$ packed form
14002D1482R270n619p639J0984n6261k1871M194J5100j2229n59j6243J8390J919
13989a9082n956j9033K4645M4135m9119R469M0321P398m0539O382L0573k4783
13977D411M355M470k0859P779L04m428P554J2321k5461K4515K1602k7845K9761
13964C8479J7810m0703k3605k8210J0582N8147J0922j7803L6226K9056k0089l5768
13952C5044l0304m297R712L08L581j7130k8850L4240L5072n0464n7218K294Q737
13939e9275N952K1806K4777K0067L256k4998J5578j3214n693K0727k6425n3483
13927g0925J2528M7597M2247k8508m2319J2651k1092M6817n54k5645p983N0081
13915A4895k919j0054l0668K3629N4020o492q519k3570m522j2943j2424K9814
$$ plain form
13903 10247 35983 27364 -34346 -10057 39297 36114 7281 16676 57382 40523 1890 -2316
13891 -2316 -16854 -23568 -44361 -17996 -4947 4181 27141 74527 70738 9335 2165 31018 -8284
13878 -8284 -18929 -21125 -46941 -37811 -14441 -8406 23570 12809 -26987 16172 17917 9804 12089
13865 12089 12335 -18148 -28698 -45689 6293 53423 33704 4271 -12017 -1024 -51538 -34090
13853 -34090 19332 42223 108141 99153 73885 89502 66614 18861 -25733 -35752 -47973 -22709
13841 -22709 18741 4085 -1323 8610 -12290 -27311 26511 34600 -9399 -11733 13754 31845
13829 31845 16313 -4060 39054 2250 -4774 9204 2858 11740 900 -15569 -26514 -35398
13817 -35398 -11948 -22016 10409 21748 -18661 -27815 13478 54722 69465 58619 36483 30030
$$ packed form
13903A0247K5736q619o1710K4289M9354l183k8833R395M0706j6859l8633m206
13891b316j4538o714k0793K6365J3049R128K2960M7386l789o1403p170K8853l9302
13878h284j0645k196k5816R130K3370O035L1976j0761l9796M3159J745q113K285
13865A2089K46l0483j0550j6991N1982M7130j9719k9433j6288J0993n0514J7448
13853c4090N3422K2891O5918q988k5268J5617k2888m7753m4594j0019j2221K5264
13841b2709M1450j4656n408R933k0900j5021N3822Q089m3999k334K5487J8091
13829C1845j5532k0373M3114l6804p024J3978o346Q882j0840j6469j0945q884
13817c5398K3450j0068L2425J1339m0409r154M1293M1244J4743j0846k2136o453
$$ plain form
13805 30030 7853 -5355 -25037 716 -4557 32434 12541 62043 61340 44167 -4980 -48737
13793 -48737 7498 41215 61976 56833 31942 29718 -18835 -37891 7689 41896 54411 59980
13781 59980 59969 49414 42589 19171 5103 12005 -9947 -36153 -13545 -8165 14398 41970 11338
13768 11338 -8183 -47206 -74248 -68588 -46293 -22076 1057 17753 44410 56498 69922 101206
13756 101206 106150 70055 39417 48040 37271 39256 51935 91920 80323 20442 -31899 -35591
13744 -35591 -67925 -60238 16249 39450 8088 5591 -13843 4963 26358 -20542 -39044 -76388
13732 -76388 -81467 -40376 7357 -3448 -5002 17965 -4595 13298 32692 61234 68865 36250
13720 36250 -6896 14745 -834 -18645 -6974 -32678 -59679 -52367 -12350 -12231 -52570 -25425
$$ packed form
13805C0030k2177j3208j9682K5753n273L6991j9893M9502p03j7173m9147m3757
13793d8737N6235L3717K0761n143k4891k224m8553j9056M5580L4207J2515N569
13781E9980j1j0555o825k3418j4068O902k1952k6206K2608N380K2563K7572l0632
13768A1338j9521l9023k7042N660K2295K4217K3133J6696K6657J2088J3424L1284
13756A01206M944l6095l0638Q623j0769J985J2679L9985j1597n9881n2341l692
13744c5591l2334P687P6487K3201l1362k497j9434J8806K1395m6900j8502l7344
13732g6388n079M1091M7733j0805j554K2967k2560J7893J9394K8542P631l2615
13720C6250m3146K1641j5579j7811J1671k5704k7001P312M0017J19m0339K7145
$$ plain form
13708 -25425 -36221 -20091 -9818 5526 45782 58277 36675 17680 -1008 -39465 -20908 -7700
13696 -7700 -64815 -53324 -28549 15128 32746 8261 4087 -3230 2505 -43140 -60828 -37330
13684 -37330 -9088 -20049 -15644 -27272 -52108 -66521 -26450 -7305 20973 38016 55188 59440
13672 59440 2104 -21307 -20159 42 9264 -27914 -44664 -36635 -62368 -61165 -48498 -1104
13660 -1104 34444 38305 23934 -1948 -40739 -35718 -16190 -35374 -10937 4941 -15196 -22467
13648 -22467 -37228 -42033 10636 59904 50545 42007 24712 21589 42244 15438 13389 46905 69233
13635 69233 37148 25381 13289 -4725 1886 -7102 -751 -6828 -28449 -54613 -42863 8689
13623 8689 54296 62631 73683 109454 144592 190998 210147 221634 258063 327653 443351 585002
$$ packed form
13708b5425j0796J6130J0273J5344M0256J2495k1602j8995j8688l8457J8557J3208
13696g700n7115J1491K4775M3677J7618k4485m174p317N735m5645j7688K3498
13684c7330K8242j0961M405j1628k4836j4413M0071J9145K8278J7043J7172M252
13672E9440n7336k3411J148K0201R222l7178j6750Q029k5733J203J2667M7394
13660a104L5548L861j4371k5882l8791N021J9528j9184K4437J5878k0137p271
13648b2467j4761m805N2669M9268r359q538j7295l123K0655k6806k049L3516K2328
13635F9233l2085j1767j2092j8014O611q988O351o077k1621k6164J1750N1552
13623H689M5607Q335J1052L5771L5138M6406J9149J1487L6429O9590J15698J41651
$$ plain form
13611 585002 651338 697669 814785 914674 988899 977967 929629 881104 800338 669890 531568
13600 531568 427837 353863 289412 256227 241405 204871 184188 168341 183084 161975 173579
13589 173579 141264 95078 80117 69796 93259 80942 79717 89862 69334 38825 35235 52838
13577 52838 65891 70569 59332 50898 37419 50227 38064 33640 62858 81960 92433 50350
13565 50350 49332 32590 44301 77121 72191 42657 -8205 -9504 16586 -2982 17634 17120 10401
13552 10401 29556 43914 36789 13676 7961 -19542 -38934 -28251 -35437 -29005 -16274 14297
13540 14297 -6259 -19816 39740 47400 36767 27705 31726 -7094 -24384 -32978 -6511 11472
13528 11472 2969 3349 14527 53593 86310 113203 88710 86092 108567 89279 60891 48900
$$ packed form
13611E85002O6336M6331J17116R9889P4225j0932m8338m8525q0766j30448j38322
13600E31568j03731p3974o4451l3185j4822l6534k0683j5847J4743k1109J1604
13589A73579l2315m6186j4961j0321K3463j2317j225J0145k0528l0509l590J7603
13577E2838J3053M678j1237q434j3479J2808j2163m424K9218J9102J0473m2083
13565E0350j018j6742J1711L2820m930k9534n0862j299K6090j9568K0616n14o719
13552A0401J9155J4358p125k3113n715k7503j9392J0683p186O432J2731L0571
13540A4297k0556j3557N9556P660j0633r062M021l8820j7290q594K6467J7983
13528A1472q503L80J1178L9066L2717K6893k4493k618K2475j9288k8388j1991
$$ plain form
13516 48900 45691 44495 64124 55314 14888 31502 43714 24012 33262 36783 42985 14205 50248
13503 50248 82817 94411 84727 42191 51749 40045 7503 10024 19177 -12405 -39781 -50394
13491 -50394 -51531 -103781 -78980 -17859 -6878 -63384 -53748 -15256 -10167 8645 -25743 -65506
13479 -65506 -7455 27633 -9656 -40647 182 -5793 15868 35528 -22589 -61806 -52632 -16747
13467 -16747 -31711 -48931 795 14698 18526 42715 45277 36488 62185 37322 6878 15369
13455 15369 14031 33083 43056 30804 38384 10989 23140 53954 105584 132359 121116 94525
13443 94525 75781 70957 64998 93199 125979 110782 145171 175443 197751 161053 123174 140547
13431 140547 137201 91975 80721 58004 31370 21469 40834 77129 77403 68367 85100 92607 36667
$$ packed form
13516D8900l209j196J9629q810m0426J6614J2212j9702R250L521O202k8780L6043
13503E0248L2569J1594r684m2536R558j1704l2542K521R153l1582k7376j0613
13491e0394j137n2250K4801O1121J0981n6506R636L8492N089J8812l4388l9763
13479f5506N8051L5088l7289l0991M0829n975K1661J9660n8117l9217R174L5885
13467a6747j4964j7220M9726J3903L828K4189K562q789K5697k4863l0444Q491
13455A5369j338J9052R973j2252P580k7395J2151L0814N1630K6775j1243k6591
13443I4525j8744m824n959K8201L2780j5197L4389L0272K2308l6698l7879J7373
13431A40547l346m5226j1254k2717k6634r901J9365L6295K74r036J6733P507n5940
$$ plain form
13418 36667 43342 65088 87956 118869 102553 43664 23954 51318 70778 69064 63828 59190
13406 59190 45363 49575 70405 56143 30344 45438 44833 17440 5248 -23289 -17796 44078
13394 44078 85782 64534 58045 2459 12467 -18783 -5852 15110 9528 -2371 27246 6008
13382 6008 21083 79888 92598 76439 93662 81960 60681 85312 104185 112971 126730 136543
13370 136543 124232 131860 173873 152648 157464 200294 185766 204260 205848 218560 238012 251202
13358 251202 256496 313301 420584 517419 636443 769906 854954 932987 1018134 1086363 1111685
13347 1111685 1041175 943443 865334 709470 597634 518987 447154 418923 354977 313936 299127
13336 299127 298333 279027 229341 203856 208793 238550 246742 254309 281951 279519 256012 273133 277042
$$ packed form
13418C6667O675K1746K2868L0913j6316n8889j9710K7364J9460j714n236m638
13406E9190j3827M212K0830j4262k5799J5094o05k7393j2192k8537N493O1874
13394D4078M1704k1248o489n5586J0008l1250J2931K0962n582j1899K9617k1238
13382F008J5075N8805J2710j6159J7223j1702k1279K4631J8873Q786J3759R813
13370A36543j2311P628M2013k1225M816M2830j4528J8494J588J2712J9452J3190
13358B51202N294N6805J07283R6835J19024J33463Q5048P8033Q5147O8229K5322
13347A111685p0510r7732p8109j55864j11836p8647p1833k8231o3946m1041j4809
13336B99127p94j9306m9686k5485M937K9757Q192P567K7642k432k3507J7121L909
$$ plain form
13323 277042 323283 332571 297084 323910 360109 356050 337282 395045 466120 501793 547025 597070
13311 597070 620935 625546 607961 538229 554016 564492 551169 482271 429415 372097 358587 374254
13299 374254 401941 419655 399197 404712 426701 425186 400588 356573 348629 347741 341288 329720 320760
13286 320760 293848 271799 311980 345564 308527 297123 312317 282360 321253 348178 337678
13275 337678 372693 382062 388404 441098 484620 506552 497340 496007 491933 457624 439963 454448
13263 454448 477667 495425 542318 580702 608081 611828 573571 545716 574282 547770 504833 509378
13251 509378 506175 489707 502452 549125 554543 521645 490204 544035 562001 576051 591546 588239
13239 588239 630671 627483 674866 734178 718079 724411 777629 826220 881135 956056 990258 1048637
$$ packed form
13323B77042M6241R288l5487K6826L6199m059j8768N7763P1075L5673M5232N0045
13311E97070K3865M611j7585o9732J5787J0476j3323o8898n2856n7318j3510J5667
13299C74254K7687J7714k0458N515K1989j515k4598m4015p944q88o453j1568q960
13286C20760k6912k2049M0181L3584l7037j1404J5194k9957L8893K6925j0500
13275C37678L5015R369O342N2694M3522K1932r212j333m074l4309j7661J4485
13263D54448K3219J7758M6893L8384K7379L747l8257k7855K8566k6512m2937M545
13251E09378l203j6468J2745M6673N418l2898l1441N3831J7966J4050J5495l307
13239E88239M2432l188M7383N9312j6099O332N3218M8591N4915P4921L4202N8379
$$ plain form
13227 1048637 1104705 1135008 1170175 1218189 1245721 1316028 1407273 1473499 1529973 1653304 1792406
13216 1792406 1932960 2089643 2270430 2462317 2691870 2946791 3221067 3566724 3930803
13207 3930803 4319993 4783407 5352538 6069426 6928287 7978062 9174329 10459975 11900609
13198 11900609 13550167 15450879 17763806 20637343 24539075 30186919 38592060 50801747
13190 50801747 67011823 86137853 106679067 127374644 147952129 167270436 181863879
13183 181863879 187470984 182503219 170539629 156207128 139356200 117733751 93134155
13176 93134155 71493034 56227188 46378576 39915323 35484963 32291112 29808721 27813821
13168 27813821 26129233 24629706 23205690 21840469 20537857 19238206 18039565 16960857
$$ packed form
13227A048637N6068L0303L5167M8014K7532P0307R1245O6226N6474J23331J39102
13216A792406J40554J56683J80787J91887K29553K54921K74276L45657L64079
13207C930803L89190M63414N69131P16888Q58861J049775J196267J285646J440634
13198A1900609J649558J900712K312927K873537L901732N647844Q405141J2209687
13190E0801747J6210076J9126030K0541214K0695577K0577485J9318307J4593443
13183A81863879N607105m967765j1963590j4332501j6850928k1622449k4599596
13176I3134155k1641121j5265846r848612o463253m430360l193851k482391j994900
13168B7813821j684588j499527j424016j365221j302612j299651j198641j078708
$$ plain form
13160 16960857 16017743 15138835 14293881 13561525 12910308 12325045 11757132 11223841 10734279
13151 10734279 10257061 9806762 9420032 9103100 8794777 8446071 8104461 7757053 7437024
13142 7437024 7174008 6868091 6609376 6385322 6176769 6023052 5827121 5659918 5471098
13133 5471098 5258348 5090049 4950538 4832941 4710588 4582015 4462119 4301133 4166466
13124 4166466 4077121 3975506 3843500 3687086 3554255 3458371 3357845 3277490 3219447 3092014
13114 3092014 2968767 2859345 2793739 2713907 2647972 2603384 2546154 2504732 2430080 2349358 2283012
13103 2283012 2218515 2140971 2094150 2018827 1985943 1944965 1910501 1883171 1868347 1856316 1828978
13092 1828978 1770197 1730227 1707920 1725126 1787003 1891982 2031975 2238119 2519755 2751572
$$ packed form
13160A6960857r43114q78908q44954p32356o51217n85263n67913n33291m89562
13151A0734279m77218m50299l86730l16932l08323l48706l41610l47408l20029
13142G437024k63016l05917k58715k24054k08553j53717j95931j67203j88820
13133E471098k12750j68299j39511j17597j22353j28573j19896j60986j34667
13124D166466q9345j01615j32006j56414j32831r5884j00526q0355n8043j27433
13114C092014j23247j09422o5606p9832o5935m4588n7230m1422p4652q0722o6346
13103B283012o4497p7544m6821p5323l2884m0978l4464k7330j4824j2031k7338
13092A828978n8781l9970k2307J7206O1877J04979J39993K06144K81636K31817
$$ plain form
13082 2751572 2865310 2974626 3049259 3007268 2741148 2354798 1989757 1775468 1616730 1448839
13072 1448839 1351741 1325125 1289726 1223063 1157466 1117936 1086840 1026187 1002981 957461 923171
13061 923171 910110 889500 850359 819059 788331 744040 683695 678297 680525 663087 632500 619425
13049 619425 611089 607388 564635 606704 579633 503208 466096 387792 376293 395838 405199 351841
13037 351841 300538 301589 360553 384747 368662 377110 360279 344593 319718 294350 312422 306488
13025 306488 306298 287107 246836 258189 286467 294690 295864 281510 228574 212122 217352 200616
13013 200616 201086 167889 150843 123730 148597 161403 124392 99647 120524 151568 177206 216628
13001 216628 207134 150663 127741 148786 156649 159161 195559 239865 260749 294884 337163 316371
$$ packed form
13082B751572J13738J09316P4633m1991k66120l86350l65041k14289j58738j67891
13072A448839r7098k6616l5399o6663o5597l9530l1096o0653k3206m5520l4290
13061I23171j3061k0610l9141l1300l0728m4291o0345n398K228j7438l0587j3075
13049F19425q336l701m2753M2069k7071p6425l7112p8304j1499J9545R361n3358
13037C51841n1303J051N8964K4194j6085Q448j6831j5686k4875k5368J8072n934
13025C06488j90j9191m0271J1353K8278Q223J174j4354n2936j6452N230j6736
13013B00616M70l3197j7046k7113K4867J2806l7011k4745K0877L1044K5638L9422
13001B16628r494n6471k2922K1045P863K512L6398M4306K0884L4135M2279k0792
$$ plain form
12989 316371 276660 242402 205736 133779 120086 174575 175621 195330 206801 189080 231859 293887
12977 293887 293343 269772 213137 162436 155291 128547 163580 193809 193640 183483 145654 173986
12965 173986 165746 148781 150999 173091 182305 156624 146409 168200 192475 210005 176147 152157
12953 152157 114246 81385 111116 123673 115594 72504 53445 72191 104530 106358 145768 145187
12941 145187 144761 166126 150969 189717 210149 186908 175643 141351 131249 128581 102859 95725
12929 95725 133601 156866 205738 199027 194416 185641 193698 176937 189084 148567 185028 231531
12917 231531 184656 169079 181191 203232 205342 166880 179806 218063 238779 216482 194688 204599
12905 204599 223925 271826 358402 409879 450716 449640 369675 259828 190326 138224 148800
$$ packed form
12989C16371l9711l4258l6666p1957j3693N4489J046J9709J1471j7721M2779O2028
12977B93887n44k3571n6635n0701p145k6744L5033L0229j69j0157l7829K8332
12965A73986q240j6965K218K2092R214k5681j0215K1791K4275J7530l3858k3990
12953A52157l7911l2861K9731J2557q079m3090j9059J8746L2339J828L9410n81
12941A45187m26K1365j5157L8748K0432k3241j1265l4292j0102k668k5722p134
12929I5725L7876K3265M8872o711m611q775Q057j6761J2147m0517L6461M6503
12917B31531m6875j5577J2112K2041K110l8462J2926L8257K0716k2297k1794R911
12905B04599J9326M7901Q6576N1477M0837j076p9965j09847o9502n2102J0576
$$ plain form
12894 148800 164505 158698 156608 116935 104838 118235 212239 227054 185912 208900 179497 171143
12882 171143 185255 185310 159883 163308 206078 224335 216011 181483 122501 113533 148795 134483 126309
12869 126309 152048 102748 66257 92826 105121 108377 131053 132063 146277 98573 66989 62562
12857 62562 49756 50622 66756 83110 85392 48594 52256 59326 56924 81697 92870 95401 109388
12844 109388 105709 112822 78881 38284 31154 -31412 -55666 25166 21481 20763 68187 136284 208119
12831 208119 242392 236098 192112 170615 139080 146091 217287 247601 240375 248218 274944 282786
12819 282786 286636 297043 295281 242572 214027 223780 238198 243807 250670 265510 229933 204412
12807 204412 190643 158790 115348 116893 138508 183399 219660 246950 258189 267232 279157 263976
$$ packed form
12894A48800J5705n807k090l9673j2097J3397R4004J4815m1142K2988k9403q354
12882A71143J4112N5k5427L425M2770J8257q324l4528n8982q968L5262j4312q174
12869A26309K5739m9300l6491K6569J2295L256K2676J010J4214m7704l1584m427
12857F2562j2806Q66J6134J6354K282l6798L662P070k402K4773J1173K531J3987
12844A09388l679P113l3941m0597p130o2566k4254Q0832l685p18M7424O8097P1835
12831B08119L4273o294m3986k1497l1535P011P1196L0314p226P843K6726P842
12819B82786L850J0407j762n2709k8545R753J4418N609O863J4840l5577k5521
12807B04412j3769l1853m3442J545K1615M4891L6261K7290J1239R043J1925j5181
$$ plain form
12795 263976 299827 302629 359862 381070 338044 280886 268597 316098 317201 294559 272788 300648
12783 300648 309991 328055 363154 423523 509286 638626 774928 838862 838816 778760 767457 808055
12771 808055 779643 665847 534690 441911 435312 457861 482752 532806 545996 614818 734807
12760 734807 848254 888464 983740 1109746 1195276 1254161 1349733 1418367 1408509 1388676 1315025
12749 1315025 1238947 1112286 997262 924773 811775 695450 660482 686577 675656 638356
12739 638356 660398 687632 645449 636965 634878 660707 685762 678064 623929 626769 699402 744819
12727 744819 742472 794551 797149 768149 734504 717401 679512 637874 677785 730105 752219 771101
12715 771101 777044 775479 777305 761724 789875 782042 770053 805293 857252 864240 881425 947682
$$ packed form
12795B63976L5851K802N7233K1208m3026n7158j2289M7501J103k2642k1771K7860
12783C00648R343J8064L5099O0369Q5763J29340J36302O3934m6o0056j1303M0598
12771H08055k8412j13796j31157r2779o599K2549K4891N0054J3190O8822J19989
12760G34807J13447M0210R5276J26006Q5530N8885R5572O8634r858j9833p3651
12749A315025p6078j26661j15024p2489j12998j16325l4968K6095j0921l7300
12739F38356K2042K7234m2183q484k087K5829K5055p698n4135K840P2633M5417
12727G44819k347N2079K598k9000l3645j7103l7889m1638L9911N2320K2114J8882
12715G71101N943j565J826j5581K8151p833j1989L5240N1959O988J7185O6257
$$ plain form
12703 947682 968603 1025521 1042271 1046188 1072534 1137160 1127330 1057657 1093579 1185770 1291807 1379234
12691 1379234 1438309 1487034 1581537 1686090 1736618 1784516 1813814 1872949 1952049 2025350 2127839
12680 2127839 2294481 2568537 2869584 3148067 3423032 3767337 4121336 4392445 4593424
12671 4593424 4788530 5079217 5379636 5809297 6398025 7168524 8124302 9286567 10823008
12662 10823008 12710220 15108107 18019684 21371883 25319691 30107266 36320740 45099382
12654 45099382 58544723 80799901 118753741 176701053 244670660 301639387 335339561
12647 335339561 352380418 364053660 355164567 307716892 231606888 158910145 112552602
12640 112552602 86817452 71558729 61433816 54180956 48868575 44791021 41386085
$$ packed form
12703I47682K0921N6918J6750L917K6346O4626r830o9673L5922R2191J06037Q7427
12691A379234N9075M8725R4503J04553N0528M7898K9298N9135P9100P3301J02489
12680B127839J66642K74056L01047K78483K74965L44305L53999K71109K00979
12671D593424J95106K90687L00419M29661N88728P70499R55778J162265J536441
12662A0823008J887212K397887K911577L352199L947808M787575O213474Q778642
12654D5099382J3445341K2255178L7953840N7947312O7969607N6968727L3700174
12647C35339561J7040857J1673242q889093m7447675p6110004p2696743m6357543
12640A12552602k5735150j5258723j0124913p252860n312381m077554l404936
$$ plain form
12633 41386085 38350328 35731199 33469536 31562866 30005723 28730511 27529702 26279649
12625 26279649 24895627 23460405 22140865 20924547 19763720 18754243 17942827 17234258
12617 17234258 16547359 15891056 15261784 14673263 14134448 13569275 13063995 12603538 12092471
12608 12092471 11588894 11107524 10638785 10233083 9868895 9520707 9215676 8932083 8647165
12599 8647165 8334248 8059923 7801503 7648954 7477029 7255244 7074248 6870458 6710321
12590 6710321 6600757 6526655 6430789 6251651 6105098 5952231 5745598 5502829 5249479 5026996
12580 5026996 4857350 4710957 4606852 4503388 4407114 4333126 4181154 4024505 3873244 3726732
12570 3726732 3630133 3549372 3481959 3362572 3287804 3208728 3085146 2969197 2901353 2836301 2769232
$$ packed form
12633D1386085l035757k619129k261663j906670j557143j275212j200809j250053
12625B6279649j384022j435222j319540j216318j160827j009477q11416p08569
12617A7234258o86899o56303o29272n88521n38815n65173n05280m60457n11067
12608A2092471n03577m81370m68739m05702l64188l48188l05031k83593k84918
12599H647165l12917k74325k58420j52549j71925k21785j80996k03790j60137
12590F710321j09564p4102r5866j79138j46553j52867k06633k42769k53350k22483
12580E026996j69646j46393j04105j03464r6274p3988j51972j56649j51261j46512
12570C726732r6599q0761o7413j19387p4768p9076j23582j15949o7844o5052o7069
$$ plain form
12559 2769232 2704595 2638083 2507085 2401673 2356715 2326536 2291395 2271699 2255508 2199621 2133664
12548 2133664 2062607 1992161 1920740 1862512 1803940 1760659 1755786 1756329 1729286 1674514 1648857 1649688
12536 1649688 1640112 1559174 1515850 1480780 1377730 1335279 1291171 1263769 1325041 1328162 1341752
12525 1341752 1340555 1306077 1244744 1227891 1178370 1062782 1016683 1011491 987691 981821 981663 973661
12513 973661 1009791 1063494 1103979 1177740 1331405 1554709 1827874 2007426 2163003 2310465
12503 2310465 2346633 2211303 1889594 1526802 1201984 971201 843307 743739 717659 723241
12493 723241 733062 723867 681014 617741 604814 617079 624423 577317 530813 511811 484883 459601
12481 459601 498735 496606 495389 473475 458367 429237 433787 447633 384828 294614 248856 254306
$$ packed form
12559B769232o4637o6512j30998j05412m4958l0179l5141j9696j6191n5887o5957
12548B133664p1057p0446p1421n8228n8572m3281m873N43k7043n4772k5657Q31
12536A649688r576q0938m3324l5070j03050m2451m4108k7402O1272L121J3590
12525A341752j197l4478o1333j6853m9521j15588m6099n192k3800n870j58q002
12513I73661L6130N3703M0485P3761J53665K23304K73165J79552J55577J47462
12503B310465L6168j35330l21709l62792l24818k30783j27894r9568k6080N582
12493G23241R821r195m2853o3273j2927J2265P344m7106m6504j9002k6928k5282
12481D59601L9134k129j217k1914j5108k9130M550J3846o2805r0214m5758N450
$$ plain form
12469 254306 277538 311107 346117 375319 371119 317105 288172 285210 298879 368219 407884 438983
12457 438983 470023 450760 454613 489050 453304 425622 437841 453682 417972 411802 438654 431967
12445 431967 417754 454776 479225 459825 474780 487173 432703 407904 370751 341286 329041
12434 329041 300187 251717 229005 225324 187794 184068 195189 174582 178039 245946 258623 250537
12422 250537 244565 237429 236714 243880 264732 314077 289159 280301 272807 239895 202745 199501 165081
12409 165081 232323 322887 338842 311295 306260 301100 262096 255148 236462 224727 226661 231003
12397 231003 223066 149954 160449 208172 248567 268509 284585 257286 249613 253542 254288 226037
12385 226037 179843 146982 173890 197603 199670 186771 175073 214137 234496 238891 221167 210640
$$ packed form
12469B54306K3232L3569L5010K9202m200n4014k8933k962J3669O9340L9665L1099
12457D38983L1040j9263L853L4437l5746k7682J2219J5841l5710o170K6852o687
12445D31967j4213L7022K4449j9400J4955J2393n4470k4799l7153k9465j2245
12434C29041k8854m8470k2712l681l7530l726J1121k0607L457O7907J2677q086
12422B50537n972p136p15P166K0852M9345k4918q858p494l2912l7150l244l4420
12409A65081O7242R0564J5955k7547n035n160l9004o948j8686j1735J934M342
12397B31003p937p3112J0495M7723M0395J9942J6076k7299p673L929P46k8251
12385B26037m6194l2861K6908K3713K067j2899j1698L9064K0359M395j7724j0527
$$ plain form
12373 210640 163416 134109 147302 165603 142503 128730 152079 135188 132406 57328 17167 23340
12361 23340 73930 149624 155905 151861 114388 84714 110092 112133 111187 134750 157846 153707 192103
12348 192103 201844 203505 231128 215704 185725 165958 132154 128454 149218 113560 86153 77863
12336 77863 101124 150369 167956 127347 91673 69184 83246 68247 47569 52240 59803 67051
12324 67051 65165 40396 34101 71512 84806 48143 20079 4624 -13882 40323 84455 72335
12312 72335 35519 36324 51490 63393 75292 105064 114275 71594 41905 94389 111901 116212
12300 116212 91124 62442 69055 73520 88006 72850 63278 41959 25211 57508 47427 37585
12288 37585 55359 61008 43782 59514 78421 95561 78599 47842 90013 89435 90347 100440 76631
$$ packed form
12373B10640m7224k9307J3193J8301k3100j3773K3349j6891k782p5078m0161O173
12361B3340N0590P5694O281m044l7473k9674K5378K041r46K3563K3096m139L8396
12348A92103R741J661K7623j5424k9979j9767l3804l700K0764l5658k7407q290
12336G7863K3261M9245J7587m0609l5674k2489J4062j4999k0678M671P563P248
12324F7051j886k4769o295L7411J3294l6663k8064j5455j8506N4205M4132j2120
12312G2335l6816Q05J5166J1903J1899K9772R211m2681k9689N2484J7512M311
12300A16212k5088k8682O613M465J4486j5156r572k1319j6748L2297j0081r842
12288C7585J7774N649j7226J5732J8907J7140j6962l0757M2171n78R12J0093k3809
$$ plain form
12275 76631 93638 96261 54057 36476 18143 13964 27304 31479 90836 66492 58882 55545 23426
12262 23426 -20181 2835 33276 68844 53250 46714 46697 12549 14578 -33854 -40004 -24369 -4202
12249 -4202 9155 14543 17841 16200 16258 36604 31292 24402 57737 59823 24817 40272 71592 81227
12235 81227 86523 74320 31174 5629 22314 21573 31270 93901 86210 82460 117152 118583 125080
12222 125080 149021 177399 211698 243237 186222 108727 67778 87415 190657 323365 506673
12211 506673 771108 1099156 1408073 1606403 1719695 1804706 1870269 1762415 1462139 1095131
12201 1095131 784845 596753 489621 407564 339858 258241 180042 179815 173505 176492 190207
12190 190207 176243 140927 132189 146056 146606 196641 170319 139979 126638 115101 117509 131277
$$ packed form
12275G6631J7007K623m2204j7581j8333m179J3340M175N9357k4344p610l337l2119
12262B3426m3607K3016L0441L5568j5594o536j7l4148K029m8432o150J5635K0167
12249d202J3357N388L298j641N8K0346n312o890L3335K086l5006J5455L1320R635
12235H1227N296j2203m3146k5545J6685p41R697O2631p691l750L4692J431O497
12222A25080K3941K8378L4299L1539n7015p7495m0949J9637J03242J32708J83308
12211E06673K64435L28048L08917J98330J13292Q5011O5563j07854l00276l67008
12201A095131l10286j88092j07132q2057o7706q1617p8199k27o310K987J3715
12190A90207j3964l5316q738J3867N50N0035k6322l0340j3341j1537K408J3768
$$ plain form
12178 131277 138016 122779 135548 154101 139308 122712 129903 143022 197980 224518 196205 164176
12166 164176 129120 109339 96650 105127 105918 90411 67785 89776 114334 67965 59367 55519
12154 55519 44182 16919 19685 16645 66798 95107 57225 56095 98294 109891 98564 108374
12142 108374 50895 -8147 -21397 10810 38691 67407 57081 10253 -24011 -32946 7764 30298
12130 30298 62972 82989 72280 39511 6687 -2499 29635 64422 55888 28749 27278 4782
12118 4782 -36558 25472 69118 78996 88915 91738 21659 -17238 33003 10020 -47104 2759
12106 2759 48104 32994 46690 44317 4367 3860 14413 21456 24402 15370 6293 -13432 11277
12093 11277 17754 8986 8539 58854 80966 57977 54483 68505 60178 43139 13345 -3214 18143
$$ packed form
12178A31277O739j5237J2769J8553j4793j6596P191J3119N4958K6538k8313l2029
12166A64176l5056j9781j2689Q477P91j5507k2626K1991K4558m6369q598l848
12154E5519j1337k7263K766l040N0153K8309l7882j130M2199J1597j1327R810
12142A08374n7479n9042j3250L2207K7881K8716j0326m6828l4264q935M0710K2534
12130C0298L2674K0017j0709l2769l2824r186L2134L4787q534k7139j471k2496
12118D782m1340O2030M3646R878R919K823p0079l8897N0241k2983n7124M9863
12106B759M5345j5110J3696k373l9950n07J0553P043K946r032r077j9725K4709
12093A1277O477q768m47N0315K2112k2989l494J4022q327j7039k9794j6559K1357
$$ plain form
12080 18143 44129 28576 12210 9414 -18605 -7924 43845 58066 20354 -12001 -35907 -32197
12068 -32197 -22869 -26321 -27627 -60372 -51136 -6513 29110 24495 42445 64387 26056 29043 33464
12055 33464 32642 4800 14422 34622 26041 56101 75285 45101 -18732 10263 37670 -8150
12043 -8150 -13903 -36590 -5912 6587 7209 5626 -14780 20564 65771 107325 104661 68296 52679
12030 52679 28106 39376 14660 -17512 -23719 -27375 -38417 -11809 -16534 -51659 -52548 3998 28215
12017 28215 5472 39886 94421 70321 53896 27883 -3711 -31542 -42325 -9588 38232 42179
12005 42179 16573 27254 1565 -22175 -23306 -2225 -20882 -27115 -24460 -50154 -57793 -49366 -29048
11992 -29048 -10849 -27937 -34719 -16936 7004 7223 11871 -34039 10521 29535 27190 50947 22555
$$ packed form
12080A8143K5986j5553j6366k796k8019J0681N1769J4221l7712l2355k3906L710
12068c2197R328l452j306l2745R236M4623L5623m615J7950K1942l8331K987M421
12055C3464q22k7842R622K0200q581L0060J9184l0184o3833K8995K7407m5820
12043h150n753k2687L0678J2499O22j583k0406L5344M5207M1554k664l6365j5617
12030E2679k4573J1270k4716l2172o207l656j1042K6608m725l5125q89N6546K4217
12017B8215k2743L4414N4535k4100j6425k6013l1594k7831j0783L2737M7820L947
12005D2179k5606J0681k5689k3740j131K1081j8657o233K655k5694p639Q427K0318
11992b9048J8199j7088o782J7783K3940K19M648m5910M4560J9014k345K3757k8392
$$ plain form
11979 22555 -19971 -31199 22625 65831 34561 -8140 16717 17608 11591 10524 19306 53228 7479
11966 7479 -56713 -53539 -44153 -55018 -21869 -17871 13097 77134 77493 14352 20360 -6408 -44771
11953 -44771 -57350 -46366 -7806 48943 78928 46028 12253 -27859 18061 21383 -8882 10367
11941 10367 -2393 -24132 -53866 -70611 -47156 -29965 -18825 -36813 -27522 20652 28364 -4724
11929 -4724 -22825 -58585 -49924 -27362 -31995 -8126 53708 58607 30554 15756 23391 679 -5991
11916 -5991 -55575 -81819 -66940 -60887 -43059 -20710 18231 33041 24700 67366 102557 116355
11904 116355 127894 86683 78254 46885 34569 33383 50287 75032 54058 63483 33538 7119
11892 7119 4251 38294 65406 55532 27870 18326 31049 8203 -11242 8848 45494 31538
$$ packed form
11979B2555m2526j1228N3824M3206l1270m2701K4857Q91o017j067Q782L3922m5749
11966G479o4192L174R386j0865L3149L998L0968O4037L59o3141O008k6768l8363
11953d4771j2579J0984L8560N6749K9985l2900l3775m0112M5920L322l0265J9249
11941A0367j2760k1739k9734j6745K3455J7191J1140j7988R291M8174P712l3088
11929d724j8101l5760Q661K2562m633K3869O1834M899k8053j4798P635k2712o670
11916e991m9584k6244J4879O053J7828K2349L8941J4810q341M2666L5191J3798
11904A16355J1539m1211q429l1369j2316j186J6904K4745k0974R425k9945k6419
11892G119k868L4043K7112r874k7662r544J2723k2846j9445K0090L6646j3956
$$ plain form
11880 31538 41444 65861 52112 21788 -8119 -40415 -68811 -106435 -114458 -111977 -72183 -1827
11868 -1827 11100 -19729 -27274 -17034 26692 15043 3418 -6354 47950 63811 40836 44423
11856 44423 35410 -16269 -36467 -5970 -10444 -23995 -2933 -5466 -48188 -59894 -33681 -7886
11844 -7886 23030 -16534 -18788 -7447 -6583 -20763 -28038 -38549 -18111 12324 19036 23262 18503
11831 18503 26480 11018 -21122 -55704 -55435 -54281 -49440 -57267 -40045 -5256 42950 80775 49383
11818 49383 2896 15399 51656 58665 48985 93662 85740 17262 22200 51045 20545 8115
11806 8115 -11840 -37454 -789 600 -818 16603 26793 31987 21472 -19244 -102248 -100816 -44263
11793 -44263 -13420 -2269 -14180 11884 33373 5855 13846 -8426 -31667 -32884 -4756 10934
$$ packed form
11880C1538R906K4417j3749l0324k9907l2296k8396l7624q023K481L9794P0356
11868a827J2927l0829p545J0240M3726j1649j1625r772N4304J5861k2975L587
11856D4423r013n1679k0198L0497m474j3551K1062k533m2722j1706K6213K5795
11844g886L0916l9564k254J1341Q64j4180p275j0511K0438L0435O712M226m759
11831A8503P977j5462l2140l4582K69J154M841p827J7222L4789M8206L7825l1392
11818D9383m6487J2503L6257P009r680M4677p922o8478M938K8845l0500j2430
11806H115j9955k5614L6665J389j418J7421J0190N194j0515m0716q3004J432N6553
11793d4263L0843J1151j1911K6064K1489k7518P991k2272k3241j217K8128J5690
$$ plain form
11781 10934 16464 -21902 -39906 -62168 -51714 -5344 50296 36528 10302 32149 53920 34179
11769 34179 26503 41529 29839 31415 11148 -16987 -13673 8901 5371 -29252 -52512 -15854
11757 -15854 -3698 -34699 -14879 -15514 -50567 -28286 -28410 -42274 -40593 1909 -26398 -29137 -21187
11744 -21187 -8480 10320 -23680 -66467 -56671 -35315 -24170 -42181 -93644 -104889 -51509 -30078
11732 -30078 -69837 -60445 -61990 -31236 9481 27983 17416 11332 27784 25152 16324 20914 35365
11719 35365 33543 15897 -28010 4069 4743 10976 -2363 -18983 -12869 -36482 -26026 13344 21436
11706 21436 40595 15691 -12793 -33101 -31208 -16175 -11791 6497 -1908 -11129 -26566 -18127 6430
11693 6430 30379 19644 7870 3535 -22735 -31473 -38298 -20481 -48064 -43195 -37395 -34516 -7836
$$ packed form
11781A0934N530l8366j8004k2262J0454M6370N5640j3768k6226K1847K1771j9741
11769C4179p676J5026j1690J576k0267k8135L314K2574l530l4623k3260L6658
11757a5854J2156l1001J9820o35l5053K2281j24j3864J681M2502k8307k739P950
11744b1187J2707J8800l4000m2787R796K1356J1145j8011n1463j1245N3380K1431
11732c0078l9759R392j545L0754M0717J8502j0567o084J6452k632q828M590J4451
11719C5365j822j7646m3907L2079O74O233j3339j6620O114k3613J0456L9370Q092
11706B1436J9159k4904k8484k0308J893J5033M384J8288q405r221j5437Q439K4557
11693F430K3949j0735j1774m335k6270q738o825J7817k7583M869N800K879K6680
$$ plain form
11680 -7836 44270 86997 93589 33694 -11276 -59663 -68899 -54419 23456 39720 58201 38507
11668 38507 8792 13776 -18372 -55411 -63239 -60656 -64988 -53570 -72710 -51253 -13795 -25573
11656 -25573 -41757 -47885 -49167 -61936 -62623 -51336 -52311 -47222 10120 51897 36919 31576 -2175
11643 -2175 -15430 -17484 2441 24576 34495 26823 47040 23479 4667 -15159 -17891 -37406 -50140
11630 -50140 -59040 -20399 -13517 -15349 -995 -9663 22928 25550 25225 6857 -8006 -9173 -9502 -13438
11616 -13438 4117 21489 -20135 -51682 -65126 2891 61411 26559 -17855 -16555 33323 21352
11604 21352 -42553 -41963 -55979 -66065 -33675 -6116 -4661 18585 15167 -29861 -46676 -85485
11592 -85485 -91506 -24353 -49595 -23718 -18061 -35499 -26163 -10390 587 -4916 -7091 -6054 -18261
$$ packed form
11680g836N2106M2727O592n9895m4970m8387r236J4480P7875J6264J8481j9694
11668C8507k9715M984l2148l7039p828K583m332J1418j9140K1457L7458j1778
11656b5573j6184o128j282j2769o87J1287r75N089N7342M1777j4978n343l3751
11643b175j3255k054J9925K2135R919p672K0217k3561j8812j9826k732j9515j2734
11630e0140q900L8641O882j832J4354q668L2591K622l25j8368j4863j167l29l936
11616a3438J7555J7372m1624l1547j3444O8017N8520l4852m4414J300M9878j1971
11604B1352o3905N90j4016j0086L2390K7559J455K3246l418m5028j6815l8809
11592h5485o021O7153k5242K5877N657j7438R336J5773J0977n503k175J037j2207
$$ plain form
11579 -18261 19708 21738 -14988 -20792 -21239 -9500 -6063 -42745 -54906 -27157 -15674 -48809 -71310
11566 -71310 -54896 -26111 -24509 -16715 311 -7776 -27251 -28143 -27484 -36721 -963 5803 41358
11553 41358 4005 -13292 -39307 -60590 -35735 -6187 -37678 -54710 -16489 -24662 -45660 -53572
11541 -53572 -37999 -32069 -39310 90 32074 47774 28492 14527 9996 -4530 -67198 -54552
11529 -54552 -27505 -24359 -62013 -66047 -61423 -55761 -18249 5378 -8793 -23518 -20611 -2964 -10492
11516 -10492 -32048 -41651 -67944 -48190 -22471 -4159 -14381 -1800 -26855 -74034 -61887 -31648
11504 -31648 -5868 -14339 -56534 -72988 -31777 -64313 -101345 -96120 -33873 -1796 -1142 -36034
11492 -36034 -27555 -7997 -2257 -37182 -44513 22084 49135 45756 34727 -6487 -26871 -1118
$$ packed form
11579a8261L7969K030l6726n804m47J1739L437l6682j2161K7749J1483l3135k2501
11566g1310J6414K8785J602P794J7026q087j9475q92O59r237L5758O766L5555
11553D1358l7353j7297k6015k1283K4855K9548l1491j7032L8221q173k0998p912
11541e3572J5573N930p241L9400L1984J5700j9282j3965m531j4526o2668J2646
11529e4552K7047L146l7654m034M624N662L7512K3627j4171j4725K907J7647p528
11516a0492k1556r603k6293J9754K5719J8312j0222J2581k5055m7179J2147L0239
11504c1648K5780q471m2195j6454M1211l2536l7032N225O2247L2077O54l4892
11492c6034Q479J9558N740l4925p331O6597K7051l379j1029m1214k0384K5753
$$ plain form
11480 -1118 669 14544 32792 1043 -3029 -7100 -36826 -72093 -48588 10706 18158 11327 48382
11467 48382 32473 24741 4210 207 21865 12517 -16369 -3883 36773 44985 27502 34153 29849
11454 29849 35455 48841 10862 -24138 -47353 -53780 3417 -26757 -32996 33728 59889 24408
11442 24408 18625 54090 25979 624 2453 7486 -18160 -11647 2102 -16565 -26867 -83828
11430 -83828 -105890 -62889 -51243 -19959 -15594 16551 22042 7631 -7043 -12953 31106 47247
11418 47247 -2750 -6093 32549 74177 100524 103096 66299 14194 21151 -9470 -20608 19060
11406 19060 24751 -22416 -41862 -32087 -62017 -95137 -66077 -31640 -15580 56524 85281 85023
11394 85023 68465 77637 73010 75406 43499 53025 34967 -15696 -36974 -25435 -2747 -33432
$$ packed form
11480a118J787J3875J8248l1749m072m071k9726l5267K3505N9294P452o831L7055
11467D8382j5909p732k0531m003K1658r348k8886J2486M0656Q212j7483O651m304
11454B9849N606J3386l7979l5000k3215o427N7197l0174o239O6724K6161l5481
11442B4408n783L5465k8111k5355J829N033k5646O513J3749j8667j0302n6961
11430h3828k2062M3001J1646L1284M365L2145N491j4411j4674n910M4059J6141
11418D7247m9997l343L8642M1628K6347K572l6797n2105O957l0621j1138L9668
11406A9060N691m7167j9446R775k9930l3120K9060L4437J6060P2104K8757k58
11394H5023j6558R172m627K396l1907R526j8058n0663k1278J1539K2688l0685
$$ plain form
11382 -33432 -46026 -25627 -41289 -33521 -8857 7721 32195 17726 -26114 -67372 -43790 -18092
11370 -18092 12101 66488 76562 6900 -32099 -2020 11715 903 -28332 -52781 -44500 -16107
11358 -16107 -17335 -41756 -43860 -50468 -67541 -67701 -46323 -75652 -64701 -29663 -23335 -51049 -49608
11345 -49608 -8501 -5638 23067 42118 35362 15028 5193 -4711 8187 3547 -17056 3883 17730
11332 17730 26858 28942 52835 64252 41803 -5398 7839 23053 102119 114672 90686 53451
11320 53451 -26445 -58895 -14481 -7539 -38600 -55431 -33992 2074 -29691 -45932 -50293 -22682
11308 -22682 17312 -14231 -29185 -60381 -78334 -61781 -31844 -57802 -78157 -49315 -53010 -72758
11296 -72758 -48721 8391 25391 -13135 -43617 -38797 -43627 -31735 -52429 -39830 -36560 -40703
$$ packed form
11382c3432j2594K0399j5662P768K4664J6578K4474j4469m3840m1258K3582K5698
11370a8092L0193N4387J0074o9662l8999L0079J3735j0812k9235k4449Q281K8393
11358a6107j228k4421k104o608j7073j60K1378k9329J0951L5038O328k7714J441
11345d9608M1107K863K8705J9051o756k0334r835r904J2898m640k0603K0939J3847
11332A7730R128K084K3893J1417k2449m7201J3237J5214P9066J2553k3986l7235
11320E3451p9896l2450M4414O942l1061j6831K1439L6066l1765j6241m361K7611
11308b2682L9994l1543j4954l1196j7953J6553K9937k5958k0355K8842l695j9748
11296g2758K4037N7112J7000l8526l0482M820m830J1892k0694J2599L270m143
$$ plain form
11284 -40703 -24564 42665 53183 43122 30270 8498 -9125 -43253 -28649 -4931 -739 38728
11272 38728 32929 19446 -14775 -39149 -38146 -3427 -1475 15895 23 -3394 10813 16133 49584
11259 49584 88290 137387 126912 99840 72992 80034 113573 111571 172791 270512 366518 473089
11247 473089 532982 534975 524449 534082 482840 354363 228263 143840 138153 181176 160963 123946
11235 123946 115346 107640 96802 124057 121502 83174 37847 81417 134424 150488 77709 23510
11223 23510 15825 67134 57066 5411 23032 35751 25999 44408 52987 86235 92526 90374 74945
11210 74945 92858 138475 158528 133459 132560 133114 83756 13791 -34573 -4594 14978 2410
11198 2410 -10862 -18519 4311 9029 -52820 -44021 26543 42511 71563 81083 51665 24564 41629
$$ packed form
11284d0703J6139O7229J0518j0061j2852k1772j7623l4128J4604K3718M192L9467
11272C8728n799j3483l4221k4374J003L4719J952J7370j5872l417J4207N320L3451
11259D9584L8706M9097j0475k7072k6848P042L3539k002O1220R7721R6006J06571
11247D73089N9893J993j0526R633n1242j28477j26100q4423n687M3023k0213l7017
11235A23946q600p706j0838K7255k555l8328m5327M3570N3007J6064p2779n4199
11223B3510p685N1309j0068n1655J7621J2719r752J8409Q579L3248O291k152j5429
11210G4945J7913M5617K0053k5069q99N54m9358o9965m8364K9979J9572j2568
11198B410j3272p657K2830M718o1849Q799P0564J5968K9052R520k9418k7101J7065
$$ plain form
11185 41629 54142 39924 6067 17220 23373 -21429 9278 4689 -22024 -57252 -18304 11278
11173 11278 -25152 3237 12144 46618 57929 28674 -2098 -17335 -17279 -23408 -22831 5115 48363
11160 48363 64654 54992 31018 -10807 -10363 -19167 -856 -24448 -22009 9660 22165 17337 -1663
11147 -1663 2796 20740 52232 54123 50523 12621 39445 52526 9989 5186 -10034 -6968 -7669
11134 -7669 -24948 -46400 -36003 -42884 -18061 23684 25248 27917 44612 31227 -43684 -18374
11122 -18374 28412 25687 15427 -14280 -47451 -36616 -12853 1050 333 -18843 -22056 11310
11110 11310 34241 43196 44259 56550 28635 -4658 12331 15053 46476 76512 85356 80291 103556
11097 103556 112435 75138 79058 59242 72329 73427 64531 48951 74774 25384 -29249 -63413
$$ packed form
11185D1629J2513j4218l3857J1153O153m4802L0707m589k6713l5228L8948K9582
11173A1278l6430K8389Q907L4474J1311k9255l0772j5237N6o129N77K7946M3248
11160D8363J6291r662k3974m1825M44q804J8311k3592K439L1669J2505m828j9000
11147a663M459J7944L1492J891l600l7902K6824J3081m2537m803j5220L066p01
11134g669j7279k1452J0397o881K4823M1745J564K669J6695j3385p4911K5310
11122a8374M6786k725j0260k9707l3171J0835K3763J3903p17j9176l213L3366
11110A1310K2931Q955J063J2291k7915l3293J6989K722L1423L0036Q844n065K3265
11097A03556Q879l7297L920j9816J3087J098q896j5580K5823m9390n4633l4164
$$ plain form
11085 -63413 -97567 -55137 -40034 1796 -17856 3681 -18070 5848 25070 964 -7876 -14719
11073 -14719 -6966 10676 38045 49023 -20886 -48469 -36038 4146 39429 34779 21679 15869
11061 15869 -1858 -27282 -20887 6781 -24792 -67926 -10570 -12632 -15856 -3809 -22890 -438
11049 -438 35810 35798 32553 43087 17772 11760 22100 14788 24334 71804 69588 75056 82291 59936
11035 59936 43844 52974 33853 3263 -5004 26115 52624 63420 80232 76476 34951 -25282
11023 -25282 -62480 -35105 -8750 38673 64895 29289 -10985 -26133 -33170 -60207 -63492 -58059
11011 -58059 -55115 -45597 -35706 -43615 -94524 -89663 -69663 -34934 -46760 -33435 -6161 35696 52054
10998 52054 34314 14059 38257 37359 19362 3117 6053 7334 -2503 46015 20447 -5787 9813
$$ packed form
11085f3413l4154M2430J5103M1830j9652K1537k1751K3918J9222k4106q840o843
11073a4719P753J7642K7369J0978o9909k7583J2431M0184L5283m650j3100n810
11061A5869j7727k5424O395K7668l1573m3134N7356k062l224J2047j9081K2452
11049d38L6248j2l245J0534k5315o012J0340p312R546M7470k216N468P235k2355
11035E9936j6092R130j9121l0590q267L1119K6509J0796J6812l756m1525o0233
11023b5282l7198K7375K6355M7423K6222l5606m0274j5148p037k7037l285N433
11011e8059K944R518R891p909n0909M861K0000L4729j1826J3325K7274M1857J6358
10998E2054j7740k0255K4198q98j7997j6245K936J281r837M8518k5568k6234J5600
$$ plain form
10985 9813 23631 40271 37359 143 16420 28626 22297 -22920 -54594 -40633 -32471 -21529
10973 -21529 10686 34350 39026 45162 44933 24815 25525 40167 22101 10387 16335 7123 4182
10960 4182 30741 55701 7338 -21135 -30173 7318 21990 23505 14802 -5466 2052 -2373 14790
10947 14790 40759 59273 87078 33585 15687 31232 17389 -17657 -34026 -9518 62045 91398
10935 91398 33965 -8380 -36535 -54912 -46060 -33429 -17228 5248 -9102 -10531 14441 38582
10923 38582 46631 25605 -8933 -35079 -37793 -50876 -28170 -16881 -10468 19069 35643 28883
10911 28883 19834 29759 57920 93387 85331 90683 107235 73815 10377 -126 18026 35072
10899 35072 -9070 -15555 20758 20713 53693 22356 -9316 13086 -10538 -3129 33957 59165 79152
$$ packed form
10985I813J3818J6640k912l7216J6277J2206o329m5217l1674J3961Q162J0942
10973b1529L2215K3664M676O136k29k0118P10J4642j8066j1714N948r212k941
10960D182K6559K4960m8363k8473r038L7491J4672J515q703k0268P518m425J7163
10947A4790K5969J8514K7805n3493j7898J5545j3843l5046j6369K4508P1563K9353
10935I1398n7433m2345k8155j8377Q852J2631J6201K2476j4350j429K4972K4141
10923C8582Q049k1026l4538k6146k714j3083K2706J1289O413K9537J6574o760
10911B8883r049R925K8161L5467q056N352J6552l3420o3438j0503J8152J7046
10899C5072m4142o485L6313m5L2980l1337l1672K2402k3624P409L7086K5208J9987
$$ plain form
10886 79152 64978 68144 57362 22961 -766 29890 10326 7119 28025 19972 9345 -14726
10874 -14726 -11376 -2851 3781 24590 34923 45027 84886 95802 54695 27658 29013 36520 38814
10861 38814 43245 1710 27620 61133 41608 38935 70853 78601 49992 2136 -37439 -43478
10849 -43478 -7243 23095 32125 7051 22626 20129 12553 33122 28976 44663 62733 61515 -5917
10836 -5917 -10506 12389 75917 77547 105921 116834 84406 66390 73276 93357 106204 87147
10824 87147 59942 32492 30614 30829 4452 -12146 -19601 37365 58061 45152 32413 54439
10812 54439 60613 41848 56816 28248 26128 46056 28246 -5522 1964 5732 38496 79836
10800 79836 89211 81020 71731 66233 70784 104748 101731 70246 40002 69486 69277 71852 86905
$$ packed form
10886G9152j4174L166j0782l4401k3727L0656j9564l207K0906q053j0627k4071
10874a4726L350Q525O632K0809J0333J0104L9859J0916m1107k7037J355P507K294
10861C8814M431m1535K5910L3513j9525k673L1918P748k8609m7856l9575o039
10849d3478L6235L0338R030k5074J5575k497p576K0569m146J5687J8070j218o7432
10836e917m589K2895O3528J630K8374J0913l2428j8016O886K0081J2847j9057
10824H7147k7205k7450j878K15k6377j6598p455N6966K0696j2909j2739K2026
10812E4439O174j8765J4968k8568k120J9928j7810l3768P486L768L2764M1340
10800G9836R375q191r289n498M551L3964l017l1485l0244K9484k09K575J5053
$$ plain form
10787 86905 97452 106726 120903 98460 71755 35442 44554 51935 25127 17896 29340 57470
10775 57470 27038 -21477 17641 33327 -16179 -37825 -20029 -10958 -20779 -3030 -10974 -20545
10763 -20545 34474 33480 20528 -31325 -12113 -11009 -17307 -57863 -67631 -39070 -13255 18661 29505
10750 29505 7861 -10036 -6975 -4440 27179 26583 35704 -2348 1575 16290 -2881 -13091 10115
10737 10115 -3533 16089 9472 37293 59545 25906 -48261 -36408 17481 29261 20641 -33409
10725 -33409 -27056 -12031 -31681 -19347 11490 13404 27835 29190 -1513 -63692 -101046 -79191
10713 -79191 -53860 -30574 -13884 22721 28866 7573 7497 20616 31980 11595 -25640 -42830
10701 -42830 -64112 -79043 -63213 -14896 -16583 -46778 -5948 49033 13773 -65851 -56774 -31834
$$ packed form
10787H6905J0547R274J4177k2443k6705l6313R112P381k6808p231J1444K8130
10775E7470l0432m8515L9118J5686m9506k1646J7796R071r821J7749p944r571
10763b0545N5019r94j2952n1853J9212J104o298m0556r768K8561K5815L1916J0844
10750B9505k1644j7897L061K535L1619n96R121l8052L923J4715j9171j0210K3206
10737A0115j3648J9622o617K7821K2252l3639p4167J1853N3889J1780q620n4050
10725c3409O353J5025j9650J2334L0837J914J4431J355l0703o2179l7354K1855
10713g9191K5331K3286J6690L6605O145k1293p6J3119J1364k0385l7235j7190
10701d2830k1282j4931J5830M8317j687l0195M0830N4981l5260p9624R077K4940
$$ plain form
10689 -31834 -15176 -15493 -76451 -70472 -31877 -5174 8720 34167 43938 14163 13599 26400 4420
10676 4420 -6004 -30728 -21546 -16114 -18320 18772 29078 21154 68964 69008 83015 84051 32270
10663 32270 8873 6574 -16437 -352 21430 2775 18443 16665 -8105 -36357 -83195 -73418
10651 -73418 -58793 -74493 -73469 -38674 -17267 4416 17748 8902 10927 57939 28009 4859
10639 4859 -7319 27400 73180 108615 101859 43394 -20838 -68231 -46938 -15841 14947 6497
10627 6497 18498 930 -10737 -20219 -35724 6751 12600 -17299 -1613 10184 37333 62948
10615 62948 53558 99944 139899 155085 134187 93764 45568 24211 46893 93024 95381 88641
10603 88641 155969 180138 226486 288627 346311 478266 682948 850085 981798 1053826 1136453
$$ packed form
10689c1834J6658l17o0958N979L8595K6703J3894K5447R771k9775n64J2801k1980
10676D420j0424k4724R182N432k206L7092J0306p924M7810M4J4007J036n1781
10663C2270k3397k299k3011J6085K1782j8655J5668j778k4770k8252m6838R777
10651g3418J4625j5700J024L4795K1407K1683J3332q846K025M7012k9930k3150
10639D859j2178L4719M5780L5435o756n8465o4232m7393K1293L1097L0788q450
10627F497J2001j7568j1667r482j5505M2475N849k9899J5686J1797K7149K5615
10615F2948r390M6386L9955J5186k0898m0423m8196k1357K2682M6131K357o740
10603H8641O7328K4169M6348O2141N7684J31955K04682J67137J31713P2028Q2627
$$ plain form
10592 1136453 1205494 1213400 1219794 1187150 1115046 1108674 1111794 1071510 911432 719740 564517
10581 564517 475581 351519 257706 254111 260123 205428 186311 220556 201036 139605 111795 83328
10569 83328 86174 161434 191530 149808 108578 121647 97838 61814 64861 111899 100259 80908
10557 80908 84111 95033 95133 75654 6935 27476 32041 46329 29253 63623 83196 77506 61685
10544 61685 82069 83863 56315 55249 44089 34495 79155 54941 83141 86637 31784 16502
10532 16502 40720 51513 65367 74576 82631 102169 80578 65535 35124 29203 28837 55240 58874
10519 58874 28070 35778 31372 15305 5308 -14704 -27805 -24375 -13132 30099 63923 94326
10507 94326 79961 68664 61076 29943 753 -26400 -15877 33138 46934 63014 27326 -13009
$$ packed form
10592A136453O9041P906O394l2644p2104o372L120m0284j60078j91692j55223
10581E64517q8936j24062r3813l595O012n4695j9117L4245j9520o1431k7810k8467
10569H3328K846P5260L0096m1722m1230J3069k3809l6024L047M7038j1640j9351
10557H0908L203J0922J00j9479o8719K0541M565J4288j7076L4370J9573n690j5821
10544F1685K0384J794k7548j066j1160r594M4660k4214K8200L496n4853j5282
10532A6502K4218J0793J3854R209Q055J9538k1591j5043l0411n921l66K6403L634
10519E8874l0804P708m406j6067r997k0012j3101L430J1243M3231L3824L0403
10507I4326j4365j1297p588l1133k9190k7153J0523M9015J3796J6080l5688m0335
$$ plain form
10495 -13009 49832 106511 119062 81611 72317 40197 55125 39915 7720 -169 50749 30641
10483 30641 22765 18401 48250 61103 134169 158110 173460 179326 180298 171416 173188 165246 156530
10470 156530 116005 88366 118819 67173 55042 59537 56687 41143 32048 22639 21303 33238
10458 33238 6680 -17881 -41445 -29815 -51869 -50010 -26991 -43046 -28915 -30814 -3152 27865
10446 27865 27688 43330 70668 -720 -31050 -7473 -3049 17335 -5432 -7031 3897 20198
10434 20198 36286 27484 42297 17442 -4741 13433 20457 -19353 -3938 -15384 -25892 -73418
10422 -73418 -42255 44290 53387 65317 46535 41228 24266 -37027 -111049 -80847 -22707 -24981
10410 -24981 -38540 -19818 -6950 16312 39461 3001 -18607 -33435 -21000 -27509 -33951 37356
$$ packed form
10495a3009O2841N6679J2551l7451r294l2120J4928j5210l2195p889N0918k0108
10483C0641p876m364K9849J2853P3066K3941J5350N866R72q882J772p942q716
10470A56530m0525k7639L0453n1646j2131M495k850j5544r095r409j336J1935
10458C3238k6558k4561k3564J1630k2054J859K3019j6055J4131j899K7662L1017
10446B7865j77J5642K7338p1388l0330K3577M424K0384k2767j599J0928J6301
10434B0198J6088q802J4813k4855k2183J8174P024l9810J5415j1446j0508m7526
10422g3418L1163Q6545R097J1930j8782n307j6962o1293p4022L0202N8140k274
10410b4981j3559J8722J2868K3262K3149l6460k1608j4828J2435o509o442P1307
$$ plain form
10398 37356 23814 -41336 -54154 -32269 8405 76698 82301 90534 80579 69607 45901 40001
10386 40001 54493 71019 66879 95982 56795 -245 -7094 14069 49393 21404 -7589 -342
10374 -342 -10691 -15572 -8349 -11642 -3220 41732 46106 1425 500 -23624 -26121 28282 55615 73679
10360 73679 44807 28588 61259 42636 25532 47369 47486 39465 21685 41499 29370 -13768
10348 -13768 -15207 -5867 -3145 29231 75615 59064 23879 3785 21277 36015 46838 60763
10336 60763 74550 51485 25395 21635 14164 21128 -4020 26120 35097 50854 83014 104716
10324 104716 103850 125807 77078 46558 26697 43138 9999 -24745 62301 74315 45053 -14452
10312 -14452 -18471 -20084 -16358 -3441 -16504 -34015 -22079 -31202 -29812 -23797 -27144 -39407 -56117
$$ packed form
10398C7356j3542o5150j2818K1885M0674O8293N603Q233r955j0972k3706n900
10386D0001J4492J6526m140K9103l9187n7040o849K1163L5324k7989k8993P247
10374c42j0349m881P223l293Q422M4952M374m4681r25k4124k497N4403K7333J8064
10360G3679k8872j6219L2671j8623j7104K1837J17q021j7780J9814j2129m3138
10348a3768j439R340K722L2376M6384j6551l5185k0094J7492J4738J0823J3925
10336F0763J3787k3065k6090l760p471O964k5148L0140Q977J5757L2160K1702
10324A04716q66K1957m8729l0520j9861J6441l3139l4744Q7046J2014k9262n9505
10312a4452m019j613L726J2917j3063j7511J1936r123J390O015l347j2263j6710
$$ plain form
10299 -56117 -55803 -53165 -62307 -25196 11015 9509 34145 23776 -14447 -11586 823 29477 30046
10286 30046 13121 42147 48829 27326 40529 13717 -9187 -4061 -16085 31749 38828 54339
10274 54339 92646 94954 16322 -8960 20880 68679 70319 62769 70202 53640 23313 29547 68942
10261 68942 81330 61418 29973 19413 74718 94578 67993 47041 11356 -38734 -29339 30924
10249 30924 64350 117339 52819 11887 -11011 -40710 -49003 -36754 6692 46684 95621 111176
10237 111176 129309 136403 163883 152115 148717 162900 192205 277618 371083 443295 439271 445019
10225 445019 501150 520502 586057 542402 453240 365960 334433 308538 286185 219425 181467
10214 181467 127455 106114 63421 78037 53871 34862 66334 122237 106779 85446 38045
$$ packed form
10299e6117L14K638r142L7111L6211j506K4636j0369l8223K861J2409K8654N69
10286C0046j6925K9026O682k1503J3203k6812k2904N126j2024M7834P079J5511
10274E4339L8307K308p8632k5282K9840M7799J640p550P433j6562l0327O234L9395
10261F8942J2388j9912l1445j0560N5305J9860k6585k0952l5685n0090R395O0263
10249C0924L3426N2989o4520m0932k2898k9699q293J2249M3446L9992M8937J5555
10237A11176J8133P094K7480j1768l398J4183K9305Q5413R3465P2212m024N748
10225D45019N6131J9352O5555m3655q9162q7280l1527k5895k2353o6760l7958
10214A81467n4012k1341m2693J4616k4166j9009L1472N5903j5458k1333m7401
$$ plain form
10203 38045 19443 -18 21804 15829 30556 70963 105247 121549 75424 9871 6817 6397
10191 6397 3907 -771 -34898 -7342 22886 57310 54190 59448 27503 11281 17674 12076 3112
10178 3112 24742 28036 43059 76325 48514 17864 26079 78804 80174 28194 -8904 -26548
10166 -26548 -32338 -12892 7862 8417 -11329 -32958 -10569 -34213 20762 52255 24952 23666
10154 23666 15754 -6240 1134 23153 8113 20172 46666 59234 80195 103407 65448 59929
10142 59929 24700 29775 55205 56902 34805 28090 39343 16982 -9088 -4420 17505 43862
10130 43862 30686 -3199 9193 14219 36262 56631 39449 24764 36642 2315 2748 12318
10118 12318 17066 24451 23869 36656 57524 71660 58322 12128 15562 35443 28416 44816 59592
$$ packed form
10203C8045j8602j9461K1822n975J4727M0407L4284J6302m6125o5553l054m20
10191F397k490m678l4127K7556L0228L4424l120N258l1945j6222O393n598q964
10178C112K1630L294J5023L3266k7811l0650Q215N2725J370n1980l7098j7644
10166b6548n790J9446K0754N55j9746k1629K2389k3644N4975L1493k7303j286
10154B3666p912k1994P374K2019j5040J2059K6494J2568K0961K3212l7959n519
10142E9929l5229N075K5430J697k2097o715J1253k2361k6070M668K1925K6357
10130D3862j3176l3885J2392N026K2043K0369j7182j4685J1878l4327M33R570
10118A2318M748P385n82J2787K0868J4136j3338m6194L434J9881p027J6400J4776
$$ plain form
10105 59592 35141 317 18385 41124 26464 45162 62627 57188 22461 2497 7395 -13059
10093 -13059 -61689 -41041 14980 -209 -31368 -5022 19643 -6076 -31596 -53774 -61052 -66783
10081 -66783 -51083 -41442 -11818 -17065 -47775 -53872 -94762 -169637 -150060 -80912 -57310 -63800
10069 -63800 -41779 -148 -1565 -17773 -48363 -64010 -25664 3364 19135 18755 22077 40299
10057 40299 9012 -18004 -3961 -23896 -45436 -41028 -19350 12263 25755 48608 46033 13102
10045 13102 33107 -27457 -67557 -79828 -76159 -31170 -14053 -24561 -32080 -61248 -89471 -111517
10033 -111517 -90608 -42885 -6986 25697 62934 59419 50306 20982 18496 -2210 58160 87336
10021 87336 92111 78441 43842 73377 103010 108967 118044 135375 89584 51421 50299 68607
$$ packed form
10105E9592k4451l4824J8068K2739j4660J8698J7465n439l4727j9964M898k0454
10093a3059m8630K0648N6021j5189l1159K6346K4665k5719k5520k2178p278n731
10081f6783J5700R641K9624n247l0710o097m0890p4875J9577O9148K3602o490
10069f3800K2021M1631j417j6208l0590j5647L8346K9028J5771l80L322J8222
10057D0299l1287k7016J4043j9935k1540M408K1678L1613J3492K2853k575l2931
10045A3102K0005o0564m0100j2271L669M4989J7117j0508p519k9168k8223k2046
10033a11517K0909M7723L5899L2683L7237l515r113k9324k486k0706O0370K9176
10021H7336M775j3670l4599K9535K9633N957R077J7331m5791l8163j122J8308
$$ plain form
10009 68607 27630 31181 22162 29460 58195 61814 51020 63089 71711 62622 42654 49521 63892
9996 63892 67856 38797 54480 34641 -22510 -38613 18038 53329 -13681 -65683 -20110 5269
9984 5269 2028 -20789 -28327 -29755 2931 38011 -4552 -16124 -11699 -22351 35192 85222 99949
9971 99949 62541 35391 29602 77687 114453 83761 106649 138113 145986 193514 190599 162019
9959 162019 171130 166649 144230 84005 66118 104493 88898 44800 40175 28417 30746 61509
9947 61509 69105 40048 29832 6190 -12613 10617 6191 -25334 -41637 -2803 29441 25589
9935 25589 46561 58938 9493 -23003 -26219 -29675 -29138 -29554 -45667 -42899 20187 21834 41155
9922 41155 24943 -350 36000 819 -18499 -7765 -468 -30179 -33716 -12894 -27273 20434
$$ packed form
10009F8607m0977L551r019P298K8735L619j0794J2069Q622r089j9968O867J4371
9996F3892L964k9059J5683j9839n7151j6103N6651L5291o7010n2002M5573K5379
9984E269l241k2817p538j428L2686L5080m2563j1572M425j0652N7543N0030J4727
9971I9949l7408k7150n789M8085L6766l0692K2888L1464P873M7528k915k8580
9959A62019R111m481k2419o0225j7887L8375j5595m4098m625j1758K329L0763
9947F1509P596k9057j0216k3642j8803K3230m426l1525j6303L8834L2244l852
9935B5589K0972J2377m9445l2496l216l456N37m16j6113K768O3086J647J9321
9922D1155j6212k5293L6350l5181j9318J0734P297k9711l537K0822j4379M7707
$$ plain form
9910 20434 1913 -19635 -33246 -36081 18401 66733 79371 21954 5673 27848 29746 32017
9898 32017 20730 4937 -19165 -38641 1106 47847 45560 14893 724 5788 50317 75210
9886 75210 80863 85093 66042 74387 87000 78696 19916 -6661 -1841 6017 -56172 -70218 -3327
9873 -3327 16799 47415 78525 99996 129662 110917 39456 35393 106961 119180 134711 178419
9861 178419 182900 161335 145722 90999 82413 64028 34375 22530 72679 78043 52169 49503
9849 49503 64994 65490 72510 61067 59702 56413 -10084 -12203 5104 21892 47753 64321 62543
9836 62543 84175 99944 121412 145128 130976 102867 138159 136643 105139 84534 96928 72953
9824 72953 96324 87521 87263 51984 33245 39649 22326 45551 72305 117746 96222 71531 47749
$$ packed form
9910B0434j8521k1548j3611k835N4482M8332J2638n7417j6281K2175J898K271
9898C2017j1287j5793k4102j9476L9747M6741k287l0667j4169N064M4529K4893
9886G5210N653M230j9051Q345J2613q304n8780k6577M820P858o2189j4046O6891
9873c327K0126L0616L1110K1471K9666j8745p1461m063P1568J2219J5531M3708
9861A78419M481k1565j5613n4723q586j8385k9653j1845N0149N364k5874k666
9849D9503J5491M96P020j1443j365l289o6497k119J7307J6788K5861J6568j778
9836F2543K1632J5769K1468K3716j4152k8109L5292j516l1504k0605J2394k3975
9824G2953K3371q803k58l5279j8739O404j7323K3225K6754M5441k1524k4691k3782
$$ plain form
9811 47749 28147 24808 80854 122586 115853 85066 53016 57236 37488 28234 57447 72869 99570
9798 99570 95055 78090 80229 86588 142439 151232 153305 185817 206254 232992 264269 283558 309446
9785 309446 331936 304114 241021 150398 142469 135549 83798 35462 36608 14575 15608 41382
9773 41382 103865 120150 115409 109096 68288 22917 20523 60116 80700 101987 114658 64380
9761 64380 65193 101784 45628 -7263 6047 11847 -10891 43658 61207 59569 61711 45372 58870
9748 58870 66443 85700 68758 43171 91652 84055 94856 114063 75521 46576 14298 -8775
9736 -8775 2765 22208 49602 47066 60876 45260 7996 31692 70531 69452 101249 126612
9724 126612 103055 146687 142756 137064 130099 76947 36959 45611 130246 146946 89647 61406
$$ packed form
9811D7749j9602l339N6046M1732o733l0787l2050M220j9748r254K9213J5422K6701
9798I9570m515j6965K139O359N5851Q793K073L2512K0437K6738L1277J9289K5888
9785C09446K2490k7822o3093r0623p929o920n1751m8336J146k2033J033K5774
9773D1382O2483J6285m741o313m0808m5371k394L9593K0584K1287J2671n0278
9761F4380Q13L6591n6156n2891J3310N800k2738N4549J7549j638K142j6339J3498
9748E8870P573J9257j6942k5587M8481p597J0801J9207l8542k8945l2278k3073
9736h775J1540J9443K7394k536J3810j5616l7264K3696L8839j079L1797K5363
9724A26612k3557M3632l931n692o965n3152l9988Q652Q4635J6700n7299k8241
$$ plain form
9712 61406 48402 83014 102305 101049 76796 13751 19934 47042 55595 54803 63187 38731 36669
9699 36669 8282 7043 31009 71156 69034 66086 5008 -24267 -47601 -16064 -12918 37081 50056
9686 50056 60131 69187 62902 88455 70244 68799 102082 97596 79712 49671 28475 40514 41885
9673 41885 38514 30265 698 34553 84466 43351 19273 -6470 -36512 -31730 -15626 2807
9661 2807 36127 60470 82949 77276 47535 45512 30452 -9328 414 24661 29496 18022 7155
9648 7155 36021 43762 22157 26592 70616 88452 84429 64627 89454 93091 67138 49103 13397
9635 13397 21275 29638 36802 42958 120912 161515 135243 78124 88116 119197 132163 103917 89839
9622 89839 73466 61641 32961 8622 26182 -278 12640 57693 66571 12622 -488 25172
$$ packed form
9712F1406j3004L4612J9291j256k4253o3045O183K7108Q553p92Q384k4456k062
9699C6669k8387j239K3966M0147k122k948o1078k9275k3334L1537L146M9999J2975
9686E0056J0075R056o285K5553j8211j445L3283m486j7884l0041k1196J2039J371
9673D1885l371q249k9567L3855M9913m1115k4078k5743l0042M782J6104J8433
9661B807L3320K4343K2479n673k9741k023j5060l9780R742K4247M835j1474j0867
9648G155K8866P741k1605M435M4024J7836m023j9802K4827L637k5953j8035l5706
9635A3397P878Q363P164O156P7954M0603k6272n7119R992L1081J2966k8246j4078
9622H9839j6373j1825k8680k4339J7560k6460J2918M5053Q878n3949j3110K5660
$$ plain form
9610 25172 50226 33406 13532 32940 57932 87755 79909 27733 -295 -25086 13382 1298
9598 1298 5893 66163 115123 135262 73222 41295 49034 77596 121749 103423 73219 56397
9586 56397 31010 9078 7376 28156 65815 54950 44864 56421 29506 24677 29228 20054 45733
9573 45733 51700 63104 92651 92799 81660 91406 108163 76040 72395 52243 68579 45928 17196
9560 17196 24970 29769 32091 23978 38252 39863 52541 57070 68224 84059 54364 37247 18141
9547 18141 13459 65127 88282 83894 59134 58360 69045 111008 115326 91551 84896 8687 9921
9534 9921 -9232 36229 80680 110780 126796 117116 70177 63661 67377 126944 142057 126274 121093
9521 121093 78522 82202 69866 25858 4027 32400 38586 -8262 -14906 -12335 -6103 36793 65679
$$ packed form
9610B5172K5054j6820j9874J9408K4992K9823p846n2176k8028k4791L8468j2084
9598A298M595O0270M8960K0139o2040l1927P739K8562M4153j8326l0204j6822
9586E6397k5387k1932j702K0780L7659j0865j0086J1557k6915m829M551r174K5679
9573D5733N967J1404K9547J48j1139R746J6757l2123l645k0152J6336k2651k8732
9560A7196P774M799K322q113J4274J611J2678M529J1154J5835k9695j7117j9106
9547A8141m682N1668K3155m388k4760p74J0685M1963M318k3775o655p6209J234
9534I921j9153M5461M4451L0100J6016r680m6939o516L716N9567J5113j5783n181
9521A21093m2571L680j2336m4008k1831K8373O186m6848o644K571O232M2896K8886
$$ plain form
9508 65679 56210 47202 70146 102352 84851 78327 99563 107096 109239 120668 127555 119748 92340
9495 92340 90287 85855 62632 34854 63603 114350 143809 140445 114055 112339 135807 126592 100609
9482 100609 127683 180354 182484 146626 113374 68184 61209 98950 101109 102289 153512 185021
9470 185021 185667 150042 83312 60511 89245 103591 102934 41236 4631 21238 45839 71301
9458 71301 89582 99291 102951 47153 22502 3544 18661 58918 82154 47552 23143 17405
9446 17405 30308 49693 70458 89896 119929 154229 135557 79422 67762 91341 113348 94576
9434 94576 57264 46576 54510 90733 136969 123960 94767 102083 142425 144875 105543 87409
9422 87409 79569 69635 67334 60827 51638 60987 76313 121019 161132 135562 121413 106484 113394
$$ packed form
9508F5679r469r008K2944L2206j7501o524K1236P533K143J1429O887p807k7408
9495I2340k053m432k3223k7778K8749N0747K9459l364k6390j716K3468r215k5983
9482A00609K7074N2671K130l5858l3252m5190o975L7741K159J180N1223L1509
9470A85021O46l5625o6730k2801K8734J4346o57o1698l6605J6607K4601K5462
9458G1301J8281R709L660n5798k4651j8958J5117M0257K3236l4602k4409n738
9446A7405J2903J9385K0765J9438L0033L4300j8672n6135j1660K3579K2007j8772
9434I4576l7312j0688P934L6223M6236j3009k9193P316M0342K450l9332j8134
9422H7409p840r934k301o507r189R349J5326M4706M0113k5570j4149j4929O910
$$ plain form
9409 113394 129309 160863 196403 188726 188466 169862 136231 123939 112635 89311 79681 88227 86240
9396 86240 90452 83058 94860 85878 70096 45023 80101 78277 52060 88083 91345 94806 99093
9383 99093 89220 95004 46398 -7052 24690 44593 64258 48777 45369 73806 113499 195702
9371 195702 256145 212089 167074 204711 208691 231901 224931 208840 215616 215934 190741 174483 151295
9358 151295 178905 186015 181778 181434 162250 186788 209730 222749 178608 160849 175783 202023
9346 202023 220089 212423 180336 160128 144439 189962 240055 228346 185439 191311 189690 178773
9334 178773 190669 239520 215933 233526 246929 252567 280997 317021 304549 221550 169223 186637
9322 186637 226343 228309 192293 176355 161428 183525 193478 217217 209362 187717 175929 152611
$$ packed form
9409A13394J5915L1554L5540p677k60j8604l3631j2292j1304k3324r630Q546j987
9396H6240M212p394J1802q982j5782k5073L5078j824k6217L6023L262L461M287
9383I9093r873N784m8606n3450L1742J9903J9665j5481l408K8437L9693Q2203
9371A95702O0443m4056m5015L7637L980K3210o970j6091O776L18k5193j6258k3188
9358A51295K7610P110m237l44j9184K4538K2942J3019m4141j7759J4934K6240
9346B02023J8066p666l2087k0208j5689M5523N0093j1709m2907N872j621j0917
9334A78773J1896M8851k3587J7593J3403N638K8430L6024j2472q2999n2327J7414
9322A86637L9706J966l6016j5938j4927K2097R953K3739p855k1645j1788k3318
$$ plain form
9310 152611 138184 169680 194536 203240 233741 224317 226145 265671 304969 302371 286343 298435
9298 298435 345432 311252 240057 236482 257999 310457 302712 266467 245077 222785 225988 251052
9286 251052 280530 275224 315315 349550 386486 369653 372413 373965 338197 337967 365434 402474 431987
9273 431987 427608 443565 413813 400147 403979 444134 464322 443350 430241 462751 503489 516877
9261 516877 531105 527731 501855 464270 500359 529323 512721 517429 581671 569450 546729 505735
9249 505735 568567 639132 604935 587106 559359 550275 551088 581681 571624 578468 649953 704145
9237 704145 731152 740267 724911 702379 702286 722209 760623 761986 780169 765459 750378 766652 820757
9224 820757 832013 852588 865777 887442 916358 924841 951179 952372 909250 878253 908500 941503
$$ packed form
9310A52611j4427L1496K4856Q704L0501r424J828L9526L9298k598j6028J2092
9298B98435M6997l4180p1195l575K1517N2458p745l6245k1390k2292L203K5064
9286B51052K9478n306M0091L4235L6936j6833K760J552l5768k30K7467L7040K9513
9273D31987m379J5957k9752j3666L832M0155K0188k0972j3109L2510M0738J3388
9261E16877J4228l374k5876l7585L6089K8964j6602M708O4242j2221k2721m0994
9249E05735O2832P0565l4197j7829k7747r084Q13L0593j0057O844P1485N4192
9237G04145K7007R115j5356k2532r3J9923L8414J363J8183j4710j5081J6274N4105
9224H20757J1256K0575J3189K1665K8916Q483K6338J193m3122l0997L0247L3003
$$ plain form
9212 941503 931832 911943 942918 994413 1007605 1050778 1078522 1036173 1015983 1064207 1057071 1089923
9200 1089923 1124233 1135241 1172303 1202392 1215772 1232254 1231913 1232206 1212901 1190272 1220133 1269263
9188 1269263 1322589 1385677 1431080 1455371 1435573 1438105 1469500 1506869 1599023 1633942 1636045 1648666
9176 1648666 1668494 1708021 1776267 1771227 1790373 1838873 1887465 1899763 1910199 1962506 2033129 2081310
9164 2081310 2118201 2167183 2242890 2336623 2370457 2440602 2522929 2560470 2631174 2717956 2824528
9153 2824528 2899733 2943536 3034560 3123969 3227749 3310206 3436455 3542636 3661204 3815218
9143 3815218 3937985 4088740 4205165 4364489 4535958 4712678 4868992 5084164 5313280 5524599
9133 5524599 5755029 6036786 6287368 6531169 6857301 7208634 7508141 7851488 8266497 8712353
$$ packed form
9212I41503r671j9889L0975N1495J3192M3173K7744m2349k0190M8224p136L2852
9200A089923L4310J1008L7062L0089J3380J6482l41K93j9305k2629K9861M9130
9188A269263N3326O3088M5403K4291j9798K532L1395L7369R2154L4919K103J2621
9176A648666J9828L9527O8246n040J9146M8500M8592J2298J0436N2307P0623M8181
9164B081310L6891M8982P5707R3733L3834P0145Q2327L7541P0704Q6782J06572
9153B824528P5205M3803R1024Q9409J03780Q2457J26249J06181J18568J54014
9143C815218J22767J50755J16425J59324J71469J76720J56314K15172K29116K11319
9133E524599K30430K81757K50582K43801L26132L51333K99507L43347M15009M45856
$$ plain form
9123 8712353 9197421 9677839 10182775 10766502 11397348 12087145 12893618 13679468 14527217 15528931
9113 15528931 16589993 17777985 19105879 20505832 22019085 23670058 25526172 27544786
9105 27544786 29713644 32187559 34886644 37820870 41038876 44510669 48256685 52221478
9097 52221478 56333870 60534884 64741177 68810201 72638762 76045944 78833553 80870812
9089 80870812 82040946 82320384 81696658 80187152 77944134 75068298 71808014 68330031
9081 68330031 64735239 61067741 57457473 53985582 50714441 47686548 44885179 42257640
9073 42257640 39828336 37577148 35484539 33601770 31850417 30241778 28796658 27398761
9065 27398761 26073018 24850975 23697731 22633860 21620315 20726994 19887850 19089120 18303538
$$ packed form
9123H712353M85068M80418N04936N83727O30846O89797Q06473P85850Q47749J001714
9113A5528931J061062J187992J327894J399953J513253J650973J856114K018614
9105B7544786K168858K473915K699085K934226L218006L471793L746016L964793
9097E2221478M112392M201014M206293M069024L828561L407182K787609K037259
9089H0870812J170134K79438o23726j509506k243018k875836l260284l477983
9081F8330031l594792l667498l610268l471891l271141l027893k801369k627539
9073D2257640k429304k251188k092609j882769j751353j608639j445120j397897
9065B7398761j325743j222043j153244j063871j013545q93321q39144p98730p85582
$$ plain form
9056 18303538 17593483 16935411 16311586 15681734 15073546 14528428 13997661 13508440 13054517
9047 13054517 12582281 12163388 11795709 11414564 11045485 10744485 10410393 10091052 9775322
9038 9775322 9523475 9291347 8984467 8691650 8454123 8194590 7964350 7740399 7495086 7290746
9028 7290746 7099466 6897342 6694027 6476990 6313181 6161175 6034566 5882983 5709437 5537427
9018 5537427 5362185 5233641 5136046 5027313 4905718 4761086 4661114 4546146 4424730 4323623
9008 4323623 4225489 4128116 4016795 3882666 3746851 3609057 3533417 3495720 3476969 3398158 3345206
8997 3345206 3282525 3218301 3166311 3058544 2995326 2965397 2870393 2818837 2781456 2688773 2639704
8986 2639704 2576553 2525034 2439628 2390309 2396142 2371348 2314393 2262482 2202212 2157506 2147337 2116765
$$ packed form
9056A8303538p10055o58072o23825o29852o08188n45118n30767m89221m53923
9047A3054517m72236m18893l67679l81145l69079l01000l34092l19341l15730
9038I775322k51847k32128l06880k92817k37527k59533k30240k23951k45313k04340
9028G290746j91280k02124k03315k17037j63809j52006j26609j51583j73546j72010
9018E537427j75242j28544r7595j08733j21595j44632r9972j14968j21416j01107
9008D323623r8134r7373j11321j34129j35815j37794p5640l7697j8751p8811n2952
8997C345206o2681o4224n1990j07767o3218k9929r5004n1556l7381r2683m9069
8986B639704o3151n1519q5406m9319N833k4794n6955n1911o0270m4706j0169l0572
$$ plain form
8974 2116765 2076836 2039226 1968607 1931994 1913137 1887606 1836530 1775847 1739059 1723493 1679150
8963 1679150 1620099 1567814 1542453 1524397 1508663 1470573 1411462 1362179 1357071 1317481 1250129 1224489
8951 1224489 1239027 1238126 1219640 1192313 1190849 1178595 1162655 1131647 1077430 1028357 1002506 997965
8939 997965 1003557 988076 979878 938341 894679 907384 892625 853727 813174 806492 763316 760559
8927 760559 748468 707220 714379 718332 731709 754525 744964 740845 756820 691246 651222 684690
8915 684690 734021 762491 735656 713086 716164 721789 713349 697632 736539 778963 780037 736173
8903 736173 748857 795015 842819 870702 897891 977612 1116949 1349478 1607814 1733824 1786995
8892 1786995 1840406 1844715 1782794 1508630 1215907 1027876 924029 871081 797880 808622 803564
$$ packed form
8974B116765l9929l7610p0619l6613j8857k5531n1076o0683l6788j5566m4343
8963A679150n9051n2285k5361j8056j5734l8090n9111m9283n108l9590o7352k5640
8951A224489J4538r01j8486k7327j464j2254j5940l1008n4217m9073k5851m541
8939I97965N592j5481q198m1537m3662J2705j4759l8898m0553o682m3176k757
8927G60559j2091m1248P159L953J3377K2816r561m119J5975o5574m0024L3468
8915F84690M9331K8470k6835k2570L078N625q440j5717L8907M2424J074m3864
8903G36173J2684M6158M7804K7883K7189P9721J39337K32529K58336J26010N3171
8892A786995N3411M309o1921k74164k92723j88031j03847n2948p3201J0742n058
$$ plain form
8881 803564 773539 752477 755436 723908 680979 599974 587657 616016 678918 651268 604947 613052
8869 613052 651832 663007 643137 559868 523453 515939 499251 512133 484049 508123 542809 496305
8857 496305 494051 499686 530217 554205 559596 515558 498782 478890 486046 496155 524722 492672
8845 492672 458685 426781 450746 450584 473867 445227 395965 383880 359607 384028 406105 428921
8833 428921 442827 443846 445471 415101 409205 423651 426331 410787 385542 348073 332782 335115 308362
8820 308362 308680 334047 364488 356466 363547 358729 326256 317489 326731 311928 299260 270751 257049
8807 257049 247170 258752 255778 273923 284459 304617 251469 284446 330567 325851 299205 289718
8795 289718 271242 276582 277851 270126 238587 230980 260347 262341 243105 236599 261921 239858 250388
$$ packed form
8881H03564l0025k1062K959l1528m2929q1005j2317K8359O2902k7650m6321Q105
8869F13052L8780J1175j9870q3269l6415p514j6688J2882k8084K4074L4686m6504
8857D96305k254N635L0531K3988N391m4038j6776j9892P156J0109K8567l2050
8845D92672l3987l1904K3965j62K3283k8640m9262j2085k4273K4421K2077K2816
8833D28921J3906J019J625l0370n896J4446K680j5544k5245l7469j5291K333k6753
8820C08362L18K5367L0441q022P081m818l2473q767R242j4803j2668k8509j3702
8807B57049r879J1582k974J8145J0536K0158n3148L2977M6121m716k6646r487
8795B89718j8476N340J269p725l1539p607K9367J994j9236o506K5322k2063J0530
$$ plain form
8782 250388 241779 278408 311720 292882 269838 222730 221957 214715 219260 229629 188344 189504 238171
8769 238171 240373 217203 239198 233108 182200 155175 183299 160331 187491 201328 197303 201223
8757 201223 210903 189735 145268 166845 234880 279673 260032 242626 247988 216858 178974 164353
8745 164353 191728 192337 167262 160053 148193 117065 126295 125326 123288 147511 157606 160742 139690
8732 139690 153295 159488 179791 169486 204395 248566 215491 168821 185149 173186 167494 123651
8720 123651 76789 97977 155170 183940 192413 170543 145828 127743 137062 82443 56805 38110
8708 38110 48049 47322 92295 131398 154458 169568 196652 201218 146873 139084 164336 167855 163733
8695 163733 177508 179820 204709 211046 246172 315170 289265 234850 224033 213106 198756 206086
$$ packed form
8782B50388q609L6629L3312j8838k3044m7108p73p242M545J0369m1285J160M8667
8769B38171K202k3170K1995o090n0908k7025K8124k2968K7160J3837m025L920
8757B01223R680k1168m4467K1577O8035M4793j9641j7406N362l1130l7884j4621
8745A64353K7375O09k5075p209j1860l1128R230r69k038K4223J0095L136k1052
8732A39690J3605O193K0303j0305L4909M4171l3075m6670J6328j1963n692m3843
8720A23651m6862K1188N7193K8770Q473k1870k4715j8085R319n4619k5638j8695
8708C8110R939p27M4973L9103K3060J5110K7084M566n4345p789K5252L519m122
8695A63733J3775K312K4889O337L5126O8998k5905n4415j0817j0927j4350P330
$$ plain form
8683 206086 193918 159400 151005 165607 136368 136941 148350 171159 165438 148550 154963 168190 142965
8670 142965 188993 237151 208925 210570 238969 215063 173047 118692 110396 93743 114004 105247
8658 105247 99147 114529 87284 67194 97908 124337 140949 116878 139302 186108 167278 148998
8646 148998 127104 120609 117904 114142 135298 130933 163521 187930 183369 127584 97359 111325 95256
8633 95256 80510 70947 108323 120346 119233 132125 160266 132213 139561 84806 66755 50297
8621 50297 70243 148968 194185 191619 224842 295336 261508 229916 229429 193124 201430 184350 137148
8608 137148 130777 139297 155854 152431 153426 124828 75397 84830 113467 170859 210915 179439 184763
8595 184763 207056 188323 167490 237491 253119 241088 215933 211493 177411 149538 122977 117013
$$ packed form
8683B06086j2168l4518q395J4602k9239N73J1409K2809n721j6888O413J3227k5225
8670A42965M6028M8158k8226J645K8399k3906m2016n4355q296j6653K0261q757
8658A05247o100J5382k7245k0090L0714K6429J6612k4071K2424M6806j8830j8280
8646A48998k1894o495k705l762K1156m365L2588K4409m561n5785l0225J3966j6069
8633I5256j4746r563L7376J2023j113J2892K8141k8053P348n4755j8051j6458
8621E0297J9946P8725M5217k566L3223P0494l3828l1592m87l6305Q306j7080m7202
8608A37148o371Q520J6557l423R95k8598m9431R433K8637N7392M0056l1476N324
8595A84763K2293j8733k0833P0001J5628j2031k5155m440l4082k7873k6561n964
$$ plain form
8583 117013 154140 165672 156944 120233 107107 116499 136416 131646 133093 123262 146425 138327 130191
8570 130191 153377 143541 125896 138055 134309 139934 135048 113743 131252 139845 143885 122289 145596
8557 145596 137694 87359 76385 101664 111941 72309 74994 72430 91532 105362 136996 129058
8545 129058 141836 175578 176573 132153 81995 67585 71470 67989 84945 72851 72261 94978 93084
8532 93084 74160 57568 48152 98109 121544 115602 76901 45303 5548 30659 69515 16959
8520 16959 13986 95235 93950 65713 59551 60070 79705 69511 36452 30759 -5140 -9552 24857
8507 24857 27522 48253 69701 111145 133073 131817 108053 82817 60569 50425 38770 67043
8495 67043 108574 119465 125594 87939 80647 69101 60952 44340 -8 -14244 -17710 12274 4958
$$ packed form
8583A17013L7127J1532q728l6711j3126R392J9917m770J447r831K3163q098q136
8570A30191K3186r836j7645J2159l746N625m886k1305J7509Q593M040k1596K3307
8557A45596p902n0335j0974K5279J0277l9632K685k564J9102J3830L1634p938
8545A29058J2778L3742R95m4420n0158j4410L885l481J6956j2094n90K2717j894
8532I3084j8924j6592r416M9957K3435n942l8701l1598l9755K5111L8856n2556
8520A6959k973Q1249j285k8237o162N19J9635j0194l3059n693l5899m412L4409
8507B4857K665K0731K1448M1444K1928j256k3764k5236k2248j0144j1655K8273
8495F7043M1531J0891O129l7655p292j1546q149j6612m4348j4236l466K9984p316
$$ plain form
8482 4958 23312 50924 57423 41266 66559 71400 52546 107610 117246 91135 76822 93850 77129
8469 77129 39174 35102 96616 106184 65246 43162 21855 22720 48981 93828 95119 58953 -2785
8456 -2785 -25162 -4556 2604 40149 6807 -18424 12901 75754 109023 67337 -3812 52731
8444 52731 92003 103072 54556 9283 -18957 10019 21853 46905 67274 47531 22552 412
8432 412 26188 71358 91423 92532 72713 60464 42797 10395 14965 8189 6438 45610 62373
8419 62373 54770 63631 82851 52001 7882 -23029 -14353 50205 86367 61680 52100 1512 9354
8406 9354 28172 72240 84556 86486 60157 33671 19214 33534 57132 95728 60968 32247
8394 32247 47411 11793 7275 52195 91896 76157 39805 57024 42067 60791 45693 53386
$$ packed form
8482D958J8354K7612O499j6157K5293M841j8854N5064R636k6111j4313J7028j6721
8469G7129l7955m072O1514R568m0938k2084k1307Q65K6261M4847J291l6166o1738
8456b785k2377K0606P160L7545l3342k5231L1325O2853L3269m1686p1149N6543
8444E2731L9272J1069m8516m5273k8240K8976J1834K5052K0369j9743k4979k2140
8432D12K5776M5170K0065J109j9819j2249j7667l2402M570o776j751L9172J6763
8419F2373p603Q861J9220l0850m4119l0911Q676O4558L6162k4687r580n0588P842
8406I354J8818M4068J2316J930k6329k6486j4457J4320K3598L8596l4760k8721
8394C2247J5164l5618m518M4920L9701j5739l6352J7219j4957J8724j5098P693
$$ plain form
8382 53386 41675 43248 9261 -6692 24161 57521 48185 47944 47067 30696 37243 52013 38857
8369 38857 30668 47502 88939 56996 53619 14945 -5025 51936 104400 111858 76416 -15628
8357 -15628 -20226 -9255 5973 7040 37531 63172 69768 72479 74332 43324 10849 57032 77413
8344 77413 41137 21695 26262 37011 48668 48300 73222 59847 81062 81889 73042 98063 82843
8331 82843 -1464 -25720 -4767 56515 78850 49564 48720 42473 -15022 -6052 32739 44770 51496
8318 51496 60655 65768 65733 84469 89540 58469 60603 38830 25921 55100 60626 61057 58002 93549
8304 93549 106997 104752 131891 102275 82627 74513 49215 10234 51519 111592 99768 104711
8292 104711 91226 73226 37045 15590 31612 35566 9883 10298 43437 51106 61553 68864 46898
$$ packed form
8382E3386j1711J573l3987j5953L0853L3360r336k41q77j6371O547J4770j3156
8369C8857q189J6834M1437l1943l377l8674j9970N6961N2464P458l5442r2044
8357a5628m598J0971J5228J067L0491K5641O596K711J853l1008l2475M6183K0381
8344G7413l6276j9442M567J0749J1657l68K4922j3375K1215Q27q847K5021j5220
8331H2843q4307k4256K0953O1282K2335k9286q44o247n7495Q970L8791J2031O726
8318E1496R159N113l5J8736N071l1071K134k1773j2909K9179N526M31l055L5547
8304I3549J3448k245K7139k9616j9648q114k5298l8981M1285O0073j1824M943
8292A04711j3485j8000l6181k1455J6022L954k5683M15L3139P669J0447P311k1966
$$ plain form
8279 46898 73838 71546 83326 125672 118538 69340 29094 17277 5286 -20089 -6359 17561
8267 17561 13226 -20158 -41752 -15561 -19685 4467 32006 12916 31995 3220 121 39047
8255 39047 26682 34939 44573 79787 72404 61822 62407 19767 -3894 2966 16442 11944 35288
8242 35288 50412 81529 53395 41725 58063 44368 37302 -1807 -21862 14671 40619 63166
8230 63166 73284 51029 14862 8776 15336 13313 13251 8962 -12460 25503 41431 21693 2490
8217 2490 13192 2946 47462 83021 99696 80169 62350 87343 34370 -31397 -32453 41797
8205 41797 41016 65837 74077 67148 36800 36577 62324 72111 44035 -2872 2290 43907 70799
8192 70799 89708 56885 46663 45555 19794 -13388 -26166 31641 60029 67833 96753 94128
$$ packed form
8279D6898K6940k292J1780M2346p134m9198m0246j1817j1991k5375J3730K3920
8267A7561m335l3384k1594K6191m124K4152K7539j9090J9079k8775l099L8926
8255C9047j2365Q257R634L5214p383j0582N85m2640k3661O860J3476m498K3344
8242C5288J5124L1117k8134j1670J6338j3695p066l9109k0055L6533K5948K2547
8230F3166J0118k2255l6167o086O560k023o2m289k1422L7963J5928j9738j9203
8217B490J0702j0246M4516L5559J6675j9527j7819K4993n2973o5767j056P4250
8205D1797p81K4821Q240o929l0348k23K5747R787k8076m6907N162M1617K6892
8192G0799J8909l2823j0222j108k5761l3182j2778N7807K8388P804K8920k625
$$ plain form
8180 94128 65267 34918 38885 40548 29639 27890 15934 33780 54201 38353 17414 -14779
8168 -14779 -9046 26901 29730 73058 81476 72382 43845 60434 58540 2480 -9296 45431 71267
8155 71267 66404 38526 25640 43852 83973 60824 41877 30064 24120 -11051 -21291 23729
8143 23729 -369 -17130 -13209 -2778 -27342 3173 4903 7438 28133 20956 21650 23010 6322
8130 6322 -41667 -58049 -44617 -42018 -10651 341 31798 48330 20980 -10343 -14697 -46044
8118 -46044 -4107 44751 28168 15910 38687 33561 -677 -6225 -500 -7395 -12384 13506 1557
8105 1557 -8914 3327 49894 34757 10413 56505 68427 34477 51890 53268 12066 45890
8093 45890 46336 36801 -26 -35707 -24302 -58328 -91068 -73066 -60431 -36471 5542 -15301
$$ packed form
8180I4128k8861l0349L967J663j0909j749j1956J7846K0421j5848k0939l2193
8168a4779N733L5947K829M3328Q418r094k8537J6589j894n6060j1776N4727K5836
8155G1267m863k7878j2886J8212M0121k3149j8947j1813n944l5171j0240M5020
8143B3729k4098j6761L921J0431k4564L0515J730K535K0695p177O94J360j6688
8130F322m7989j6382J3432K599L1367J0992L1457J6532k7350l1323m354l1347
8118d6044M1937M8858j6583j2258K2777n126l4238n548N725o895m989K5890j1949
8105A557j0471J2241M6567j5137k4344M6092J1922l3950J7413J378m1202L3824
8093D5890M46r535l6827l5681J1405l4026l2740J8002J2635K3960M2013k0843
$$ plain form
8081 -15301 -31537 23681 12697 -23954 -95242 -63882 -19493 -417 13315 -1721 -33116 -23690
8069 -23690 13244 3640 10448 -5969 -33020 -15537 26757 19245 15446 3862 -31103 -51182 19213
8056 19213 55040 46154 -4232 -29916 653 19037 372 25397 -9672 -9452 31458 19701
8044 19701 20799 26692 36946 15324 17776 2921 -485 -47510 -39897 -35455 -51608 -14619 44306
8031 44306 82010 80102 67882 47525 45704 62314 35088 43608 53197 6603 36741 57128 72217
8018 72217 83955 79125 82651 25359 18547 51135 37639 20742 12977 -2783 -21763 -12777 14917
8005 14917 1438 -22242 -30381 -8767 2616 11144 31283 -23058 -41793 -21420 -11814 32209
7993 32209 -18749 -37887 20683 22348 4081 4316 -33935 -24572 -3927 -2462 1243 30271 64527
$$ packed form
8081a5301j6236N5218j0984l6651p1288L1360M4389J9076J3732j5036l1395R426
8069b3690L6934r604O808j6417k7051J7483M2294p512l799j1584l4965k0079P0395
8056A9213L5827q886n0386k5684L0569J8384j8665K5025l5069K20M0910j1757
8044A9701J098N893J0254k1622K452j4855l406m7025P613M442j6153L6989N8925
8031D4306L7704j908j2220k0357j821J6610k7226Q520R589m6594L0138K0387J5089
8018G2217J1738m830L526n7292o812L2588j3496j6897p765j5760j8980Q986K7694
8005A4917j3479k3680q139K1614J1383Q528K0139n4341j8735K0373R606M4023
7993C2209n0958j9138N8570J665j8267K35l8251R363K0645J465L705K9028L4256
$$ plain form
7980 64527 94109 104036 83844 55286 45160 73344 92417 45571 49868 74588 89417 114273
7968 114273 156814 130294 56250 32620 16530 -7738 -18453 13074 51646 72680 38888 28220
7956 28220 56796 -19250 -48988 -38641 -40541 -75463 -70348 -2969 15297 8615 2808 -22817 -20665
7943 -20665 26309 38536 14129 30745 27838 63770 79422 86209 17663 -13679 26584 43467
7931 43467 54157 27902 -33103 -17110 22549 10643 37884 66732 56801 34968 43372 -9021
7919 -9021 -44996 -66474 -59602 -25145 -6803 13840 30821 33647 -10654 -18502 -15629 16708 2227
7906 2227 9494 34190 13174 -29149 -32242 -40609 -49178 -34203 -17279 -9793 -1986 14581 38727
7893 38727 15284 15547 -3514 -5002 25088 41013 1547 -519 10291 -4911 -9104 6957 19068
$$ packed form
7980F4527K9582R927k0192k8558j0126K8184J9073m6846M297K4720J4829K4856
7968A14273M2541k6520p4044k3630j6090k4268j0715L1527L8572K1034l3792j0668
7956B8220K8576p6046k9738J0347j900l4922N115O7379J8266o682n807k5625K152
7943b0665M6974J2227k4407J6616k907L5932J5652O787o8546l1342M0263J6883
7931D3467J0690k6255o1005J5993L9659j1906K7241K8848r931k1833Q404n2393
7919i021l5975k1478O872L4457J8342K0643J6981K826m4301p848K873L2337j4481
7906B227P267K4696k1016m2323l093q367q569J4975J6924P486P807J6567K4146
7893C8727k3443K63j9061j488L0090J5925l9466k066J0810j5202m193J6061J2111
$$ plain form
7880 19068 -7031 22495 34847 39904 39838 36663 26172 21877 -1256 -19443 4512 34884 20407
7867 20407 -18803 -34441 -24441 -35015 -28927 -17174 -23499 2784 23304 -30761 -58058 -44237
7855 -44237 -37204 -46238 -39187 -34822 -13465 37660 45971 16707 37740 88859 66030 79219 100385
7842 100385 107486 65445 60071 26056 11977 -6267 15264 2966 21733 -2752 -2047 30452
7830 30452 34161 32009 -155 -49887 -19296 -8974 -12425 -33080 -37579 -52757 -61105 -32351 17771
7817 17771 35667 -7717 -2045 16795 28416 68 -24294 24262 41039 -3243 -39558 -57354
7805 -57354 -26385 -9006 -40605 -64989 -77626 -11581 20376 -5243 4265 16162 10686 4362
7793 4362 34075 17340 -28867 -64977 -12927 50102 66791 19405 8486 38926 55112 42316
$$ packed form
7880A9068k6099K9526J2352N057o6l175j0491m295k3133j8187K3955L0372j4477
7867B0407l9210j5638J0000j0574O088J1753o325K6283K0520n4065k7297J3821
7855d4237P033r034P051M365K1357N1125Q311k9264K1033N1119k2829J3189K1166
7842A00385P101m2041n374l4015j4079j8244K1531j2298J8767k4485P05L2499
7830C0452L709k152l2164m9732L0591J0322l451k0655m499j5178q348K8754N0122
7817A7771J7896m3384N672J8840J1621k8348k4362M8556J6777m4282l6315j7796
7805e7354L0969J7379l1599k4384j2637O6045L1957k5619R508J1897n476o324
7793D362K9713j6735m6207l6110N2050O3029J6689m7386j0919L0440J6186j2796
$$ plain form
7781 42316 31714 59110 93312 67154 54612 62951 50812 28934 52966 36445 -10489 29237
7769 29237 10478 -7653 20173 -1445 -33142 -59380 -75522 -47979 -22479 -6513 24158 -11586
7757 -11586 -20702 -6378 -15880 -26519 -8204 -9308 12277 -7658 -21857 -13818 -7217 -36107 -4069
7744 -4069 71414 105870 97143 59901 18492 30139 18058 24841 23269 -4943 -39088 -32690 -38145
7731 -38145 148 -30348 -53957 -19587 -14653 -78 8290 -42874 -41442 2377 44787 68286
7719 68286 53451 42730 103 -38815 -25898 -15475 -8639 -28197 -36174 -12135 43419 34556
7707 34556 44284 45769 12370 -2816 -21645 -17095 -2064 -8252 27797 15644 -3978 -17929 10461
7694 10461 48337 78453 24320 -21812 -32070 -13437 -19991 -14063 22429 70734 90584 25245
$$ packed form
7781D2316j0602K7396L4202k6158j2542Q339j2139k1878K4032j6521m6934L9726
7769B9237j8759j8131K7826k1618l1697k6238j6142K7543K5500J5966L0671l5744
7757a1586r116J4324r502j0639J8315j104K1585j9935j4199Q039O601k8890L2038
7744d069P5483L4456q727l7242m1409J1647j2081O783j572k8212l4145O398n455
7731c8145L8293l0496k3609L4370M934J4575Q368n1164J432M3819M2410K3499
7719F8286j4835j0721m2627l8918J2917J0423O836j9558p977K4039N5554q863
7707C4556R728J485l3399j5186j8829M550J5031o188L6049j2153j9622j3951K8390
7694A0461L7876L0116n4133m6132j0258J8633o554N928L6492M8305J9850o5339
$$ plain form
7682 25245 57790 71447 35033 20175 10583 22524 -5251 -39854 -16313 -6485 -18789 -38339
7670 -38339 -39650 -67443 -22279 1048 1574 -22053 -38706 -24885 -29511 -5938 20864 -14229 -48320
7657 -48320 -25264 -34111 3389 55258 59750 15991 -21773 -47597 -52122 -25349 -35873 -42978 -11458
7644 -11458 5234 9415 -10687 -31275 -12819 737 -18187 -14237 -22292 -3118 13798 4230 -6514
7631 -6514 -9006 -13856 -1694 25039 -1727 -13157 -37915 -10938 -63782 -11132 37798 46050 64024
7618 64024 59749 41726 29368 27947 9731 21566 34814 44825 26593 14955 6954 -14851
7606 -14851 14974 33492 -6437 -58666 -63890 -25700 -18236 20670 52986 53567 30323 8673 -7925
7593 -7925 5138 11021 22264 22397 70334 71270 65229 49989 15050 -13932 -49523 -40704 -18317
$$ packed form
7682B5245L2545J3657l6414j4858r592J1941k7775l4603K3541R828j2304j9550
7670c8339j311k7793M5164K3327N26k3627j6653J3821m626K3573K6802l5093l4091
7657d8320K3056q847L7500N1869M492m3759l7764k5824m525K6773j0524p105L1520
7644a1458J6692M181k0102k0588J8456J3556j8924L950q055J9174J6916r568j0744
7631f514k492m850J2162K6733k6766j1430k4758K6977n2844N2650M8930Q252J7974
7618F4024m275j8023j2358j421j8216J1835J3248J0011j8232j1638q001k1805
7606a4851K9825J8518l9929n2229n224L8190P464L8906L2316N81k3244k1650j6598
7593g925J3063N883J1243J33M7937R36o041j5240l4939k8982l5591Q819K2387
$$ plain form
7580 -18317 -14883 -6813 -32271 -16744 6474 -1662 -32280 -33370 -5481 14787 17084 28652 17493
7567 17493 -2955 12606 47565 30648 36390 62031 29001 -4974 21744 27200 -3196 -37109
7555 -37109 -46383 -74061 -76923 -81450 -40404 -38276 -52111 -40930 -46941 -65932 -82230 -44748 -2938
7542 -2938 11737 27749 -1142 -15801 14260 -7981 -25999 -24045 -40254 -29418 -9255 -33787
7530 -33787 -47749 -73541 -37295 -11521 -8302 1912 20511 21309 5664 3799 -23783 -17863 -897
7517 -897 13961 -7149 -18640 9 -12246 4383 48256 35207 -13283 -18987 5798 -12316
7505 -12316 -10914 -65 -25774 -57636 -15694 1990 -4395 -21057 -855 -20104 -55482 4416
7493 4416 39866 -7445 -34688 -17991 -13024 -34988 -18937 -11056 -56199 -35802 -5530 -34449
$$ packed form
7580a8317L434Q070k5458J5527K3218q136l0618j090K7889K0268K297J1568j1159
7567A7493k0448J5561L4959j6917N742K5641l3030l3975K6718N456l0396l3913
7555c7109r274k7678k862m527M1046K128j3835J1181o011j8991j6298L7482M1810
7542b938J4675J6012k8891j4659L0061k2241j8018J954j6209J0836K0163k4532
7530c3787j3962k5792L6246K5774L219J0214J8599P98j5645j865k7582N920J6966
7517h97J4858k1110j1491J8649j2255J6629M3873j3049m8490n704K4785j8114
7505a2316J402J0849k5709l1862M1942J7684o385j6662K0202j9249l5378N9898
7493D416L5450m7311k7243J6697M967k1964J6051P881m5143K0397L0272k8919
$$ plain form
7481 -34449 -33899 -6453 23074 58092 43733 35526 25219 44489 23095 39943 16010 -7781
7469 -7781 -48635 -65057 -28417 -23786 -45207 -24023 -9744 9241 35429 31395 17311 -12269
7457 -12269 -3684 11552 32206 57052 32958 -17701 10645 36793 7872 -21972 -5420 10002
7445 10002 10577 4193 23802 14748 22001 -14574 -32565 -38301 -38227 -51987 -62075 -55552 -22402 1233
7431 1233 18504 8899 -29771 -26758 7237 30866 26073 3560 -39641 -69000 -73927 -47995 5221
7418 5221 -16272 -59067 -26417 9412 17864 39677 19599 -9453 -44481 -82360 -108085 -81031
7406 -81031 -35340 -6383 997 44023 17876 -9992 -8881 5902 56597 69150 47216 14687
7394 14687 -40555 -37442 22777 22726 5617 9230 -3074 -47249 -68158 -69923 -29721 19422 40764
$$ packed form
7481c4449N50K7446K9527L5018j4359q207j0307J9270k1394J6848k3933k3791
7469g781m0854j6422L6640M631k1421K1184J4279J8985K6188m034j4084k9580
7457a2269Q585J5236K0654K4846k4094n0659K8346K6148k8921k9844J6552J5422
7445A0002N75o384J9609r054P253l6575j7991n736P4j3760j0088O523L3150K3635
7431A233J7271r605l8670L013L3995K3629m793k2513m3201k9359m927K5932N3216
7418E221k1493m2795L2650L5829Q452K1813k0078k9052l5028l7879k5725K7054
7406h1031M5691K8957P380M3026k6147k7868J111J4783N0695J2553k1934l2529
7394A4687n5242L113O0219n1j7109L613j2304m4175k0909j765M0202M9143K1342
$$ plain form
7381 40764 56751 49813 44381 32135 37335 -565 26091 10780 -18138 -49634 -17259 161
7369 161 -873 42389 -7704 -71778 -94633 -98442 -79116 -43587 -436 -2298 13113 20891 -24421
7356 -24421 -46719 -59600 -57552 -50298 -31525 -43423 -27582 -14141 12412 -23876 -76341 -90609
7344 -90609 -30179 9470 16834 469 -13800 -26222 -28925 -31877 -36214 -11456 56289 54896 -37390
7331 -37390 -47093 -17256 -11661 9910 70880 38133 -8597 6744 -26093 -96350 -112784 -81852
7319 -81852 -50838 -40234 -19385 10012 33717 64205 53759 20932 17928 -23040 -8605 14440
7307 14440 -10714 -28877 -12306 8726 -17153 -23899 -15266 37098 26570 18714 14940 2104 -29009
7294 -29009 -45460 -47971 -56347 -48051 -11769 25952 -682 9276 30859 14922 -6849 -431 32701
$$ packed form
7381D0764J5987o938n432j2246N200l7900K6656j5311k8918l1496L2375J7420
7369A61j034M3262n0093o4074k2855l809J9326L5529M3151j862J5411P778m5312
7356b4421k2298j2881K048P254J8773j1898J5841J3441K6553l6288n2465j4268
7344i0609O0430L9649P364j6365j4269j2422k703k952m337K4758O7745j393r2286
7331c7390r703K9837N595K1571O0970l2747m6730J5341l2837p0257j6434L0932
7319h1852L1014J0604K0849K9397K3705L0488j0446l2827l004m0968J4435K3045
7307A4440k5154j8163J6571K1032k5879o746Q633N2364j0528p856l774j2836l1113
7294b9009j6451k511q376Q296L6282L7721k6634R958K1583j5937k1771O418L3132
$$ plain form
7281 32701 -8432 -34627 -7830 20267 53067 6133 -50974 -39380 -18025 4375 -14388 -18057
7269 -18057 -36186 -22437 -16114 10400 25809 -14714 -27991 -9258 -25640 -72583 -91337 -91795
7257 -91795 -96547 -83793 -107081 -71133 -91 29389 54433 32143 20455 35284 35096 21722
7245 21722 -5183 -16963 -42349 -63626 -29872 -50347 -7497 7357 1080 6425 -2796 3526 20008
7232 20008 -57762 -128295 -115760 -102858 -60338 -30931 6301 -10231 -48762 -13704 40515 23433
7220 23433 -24146 -34996 -3040 34922 60416 37901 28407 37882 11273 22089 9342 -9260
7208 -9260 7114 55447 35331 53068 57557 59349 73942 81108 57058 54001 17081 -4334 -42303
7195 -42303 -51042 -40057 -45797 -37065 -15939 24136 54033 64191 56094 48094 19310 5747 7450
$$ packed form
7281C2701m1133k6195K6797K8097L2800m6934n7107J1594K1355K2400j8763l669
7269a8057j8129J3749O323K6514J5409m0523j3277J8733j6382m6943j8754m58
7257i1795m752J2754k3288L5948P1042K9480K5044k2290j1688J4829j88j3374
7245B1722k6905j1780k5386k1277L3754k0475M2850J4854o277N345r221O322J6482
7232B0008p7770p0533J2535J2902M2520K9407L7232j6532l8531L5058N4219j7082
7220B3433m7579j0850L1956L7962K5494k2515r494R475k6609J0816j2747j8602
7208i260J6374M8333k0116J7737M489J792J4593P166k4050l057l6920k1415l7969
7195d2303q739J0985n740Q732K1126M0075K9897J0158q097q000k8784j3563J703
$$ plain form
7182 7450 37930 60013 28821 -6274 -32486 -14697 -30317 40191 73980 66424 63691 61700 58716
7169 58716 1915 -59976 -69869 -39880 -37086 -62603 -61699 -63535 -55416 -75416 -54674 -37619 -34455
7156 -34455 -51199 -31820 -6364 9354 2941 -20119 -24082 -25770 8839 40883 22802 -30260
7144 -30260 -42377 -24465 16332 14149 -16007 -35927 -57292 -72284 -34953 -8520 21382 29928
7132 29928 55241 71825 85753 53141 12438 -5139 -6754 -36776 708 25651 22680 27922
7120 27922 17493 23261 26354 3774 -6278 8752 5883 -18158 -29593 437 3428 -12627 -38588
7107 -38588 -23734 -11964 20153 156 -26433 -35857 -13135 -64660 -63928 -22859 631 767 -15063
7094 -15063 -14448 -14107 -39568 -49697 -87005 -83504 -133748 -124220 -65531 5238 8203 -6052 7828
$$ packed form
7182G450L0480K2083l1192l5095k6212J7789j5620P0508L3789p556k733j991k984
7169E8716n6801o1891r893K9989K794k5517R04j836Q119k0000K0742J7055L164
7156c4455j6744J9379K5456J5718o413k3060l963j688L4609L2044j8081n3062
7144c0260j2117J7912M0797k183l0156j9920k1365j4992L7331K6433K9902Q546
7132B9928K5313J6584J3928l2612m0703j7577j615l0022L7484K4943k971N242
7120B7922j0429N768L093k2580j0052J5030k869k4041j1435L0030K991j6055k5961
7107c8588J4854J1770L2117j9997k6589r424K2722n1525P32M1069K3490J36j5830
7094a5063O15L41k5461j0129l7308L501n0244R528N8689P0769K965j4255J3880
$$ plain form
7081 7828 24751 17431 -34475 -54739 -46439 -52660 -37364 -3056 5257 -12335 -39797 -60605 -53655
7068 -53655 -63593 -64020 -78391 -83395 -78410 -11548 -26193 -15280 -23523 -70924 -48677 -12599 17063
7055 17063 34955 23187 4260 -14365 -22146 -44310 -46409 -19292 -11428 33472 35528 13474 -17313
7042 -17313 -63993 -90799 -125998 -73918 -27355 -14028 -19756 -28776 -16420 -5686 32568 47420
7030 47420 66246 46686 43686 37144 41708 49892 75640 75215 41736 -30868 -15994 9876 16079
7017 16079 17715 49432 32108 -18964 -2103 36473 29059 9417 -4068 1690 102 -15433 15146
7004 15146 29998 5795 -33940 -23259 -25562 -1274 5573 -38481 -47683 -52512 -30417 -7397 856
6991 856 -2759 -39686 -61208 -38632 -23243 10572 20441 4020 -30224 -21331 29977 64024 41992
$$ packed form
7081G828J6923p320n1906k0264Q300o221J5296L4308Q313j7592k7462k0808O950
7068e3655r938m27j4371n004M985O6862j4645J0913q243m7401K2247L6078K9662
7055A7063J7892j1768j8927j8625p781k2164k099K7117P864M4900K056k2054l0787
7042a7313m6680k6806l5199N2080M6563J3327n728r020J2356J0734L8254J4852
7030D7420J8826j9560l000o542M564Q184K5748m25l3479p2604J4874K5870O203
7017A6079J636L1717j7324n1072J6861L8576p414j9642j3485N758j588j5535L0579
7004A5146J4852k4203l9735J0681k303K4288O847m4054r202m829K2095K3020Q253
6991H56l615l6927k1522K2576J5389L3815R869j6421l4244Q893N1308L4047k2032
$$ plain form
6978 41992 40422 -5375 8557 43007 16687 -10417 24061 33484 59549 35116 4153 -27467
6966 -27467 -49640 -83284 -71677 -45978 -47234 -30994 -30054 -18242 -15585 -8877 24046 -6398 -39002
6953 -39002 -46312 -19255 -5383 -52939 -77096 -83480 -45028 13627 -79 -21201 -9842 16859
6941 16859 15407 -15354 -3476 43817 4706 -16509 -24574 -53477 -19984 -1656 -10100 -35608
6929 -35608 -35603 -22522 -38614 -32607 16168 20596 35284 58423 67668 42315 -3077 -33966 -80014
6916 -80014 -89691 -75631 -46728 -36849 -7439 -12386 25990 44431 22613 10439 -7384 -30600
6904 -30600 -43360 -57400 -25076 -27103 9439 -3378 -35112 -14441 1842 11350 11156 12910 18670
6891 18670 26104 12145 4567 -10054 -44150 -31124 30669 33002 3188 -9316 -2361 -37527 -85993
$$ packed form
6978D1992j570m5797J3932L4450k6320k7104L4478R423K6065k4433l0963l1620
6966b7467k2173l3644J1607K5699j256J6240R40J1812K657O708L2923l0444l2604
6953c9002p310K7057J3872m7556k4157o384L8452N8655j3706k1122J1359K6701
6941A6859j452l0761J1878M7293l9111k1215q065k8903L3493J8328q444k5508
6929c5608NJ3081j6092O007M8775M428J4688K3139R245k5353m5392l0889m6048
6916h0014r677J4060K8903R879K9410m947L8376J8441k1818j2174j7823k3216
6904c0600j2760j4040L2324k027L6542j2817l1734K0671J6283R508j94J754N760
6891A8670P434j3959p578j4621l4096J3026O1793K333k9814j2504O955l5166m8466
$$ plain form
6878 -85993 -59959 -20301 -11235 5117 3275 701 402 -2526 1482 -25275 -18426 4322 7213 -14064
6864 -14064 -19167 -1173 -19117 -23461 -14934 24078 65659 48312 21246 17724 -12289 -48744 -17117
6851 -17117 -11821 -24043 -34113 -42313 -44963 43711 54881 2832 1210 42676 38253 11875 -10466
6838 -10466 -59664 -18753 -6107 -11339 -25918 -32994 7495 11562 -17449 -59615 -75678 -46986
6826 -46986 -24675 -2940 -22576 -37428 -48286 -30177 -41973 -55628 -23504 -3085 28329 -17054
6814 -17054 -33877 -36385 -48319 -2578 13664 -31022 -96890 -85925 -33215 -57677 -51026 -22074
$$ packed form
6878h5993K6034L9658R066J6352j842k574k99k928M008k6757O849K2748K891k1277
6864a4064n103J7994j7944m344Q527L9012M1581j7347k7066l522l0013l6455L1627
6851a7117N296j2222j0070q200k650Q8674J1170n2049j622M1466m423k6378k2341
6838a0466m9198M0911J2646n232j4579p076M0489M067k9011m2166j6063K8692
6826d6986K2311K1735j9636j4852j0858J8109j1796j3655L2124K0419L1414m5383
6814a7054j6823k508j1934M5741J6242m4686o5868J0965N2710k4462O651K8952
$$ [...]
##END NTUPLES=NMR SPECTRUM
##END=
