##TITLE=Analysis number 321214
Compound Code cc 46709
Book Reference 449/130
Project Code adrs
Chemist Name davee
##JCAMPDX= 6.0         $$ Bruker NMR JCAMP-DX V2.0
##DATA TYPE= NMR SPECTRUM
##DATA CLASS= NTUPLES
##ORIGIN= Bruker BioSpin GmbH
##OWNER= nmr
$$ XWIN-NMR		Version 3.5
$$ Fri Jul 28 12:29:13 2006 GMT Daylight Time (UT+1h)  MAYBRIDGE\nmr@NMR_250MHZ
##.OBSERVE FREQUENCY= 250.131544655141
##.OBSERVE NUCLEUS= ^1H
##.ACQUISITION MODE= SIMULTANEOUS (DQD)
##.ACQUISITION SCHEME= undefined
##.AVERAGES= 16
##.DIGITISER RES= 18
##SPECTROMETER/DATA SYSTEM= dpx250
##.PULSE SEQUENCE= zg30
##.SOLVENT NAME= CDCl3
##.SHIFT REFERENCE= (INTERNAL, CDCl3, 0, 16.522)
##AUDIT TRAIL= $$ (NUMBER, WHEN, WHO, WHERE, WHAT)
$$ ##TITLE= Audit trail, XWIN-NMR		Version 3.5
$$ ##JCAMPDX= 5.01
$$ ##ORIGIN= Bruker BioSpin GmbH
$$ ##OWNER= nmr
$$ C:\u/data/dgb/nmr/ADRS/3800/pdata/1/auditp.txt
$$ ##AUDIT TRAIL=  $$ (NUMBER, WHEN, WHO, WHERE, WHAT)
(   1,<2006-07-28 12:28:45.22 +100>,<MAYBRIDGE\nmr>,<NMR_250MHZ>,
      <created by zg, POWCHK disabled, PULCHK disabled
       configuration hash MD5:
       E2 DF 36 D8 04 B2 41 60 5A D7 A3 38 5A 4B D0 FE
       data hash MD5: 64K
       EE 4E 63 20 F0 37 83 D7 EF CB 49 71 DB A1 BE 1F>)
(   2,<2006-07-28 12:29:01.85 +100>,<MAYBRIDGE\nmr>,<NMR_250MHZ>,
      <Start of raw data processing
       ef LB = 0.3 FT_mod = 6 PKNL = 1 SI = 32K 
       data hash MD5: 32K
       43 31 4E CB 0A 8E FB 32 C2 14 2F 61 DD 5A 36 87>)
(   3,<2006-07-28 12:29:03.38 +100>,<MAYBRIDGE\nmr>,<NMR_250MHZ>,
      <apk 
       data hash MD5: 32K
       C5 41 8D D4 4F E3 13 9E 9A D1 9C 59 6D 2D BA 43>)
(   4,<2006-07-28 12:29:04.10 +100>,<MAYBRIDGE\nmr>,<NMR_250MHZ>,
      <abs ABSG = 5 
       data hash MD5: 32K
       6A 90 4D 00 52 20 98 0A B1 44 21 88 B7 28 06 81>)
$$ ##END=
$$ 
$$ hash MD5
$$ 28 46 63 79 33 BC B4 06 0F 9E 0C 1F C2 E9 B1 CD
##$RELAX= 
##$RELAX= 
##$RELAX= 
##$RELAX= 
##$RELAX= 
##$RELAX= 
##$RELAX= 
$$ Bruker specific parameters
$$ --------------------------
##$DU= <C:\u>
##$EXPNO= 3800
##$NAME= <ADRS>
##$PROCNO= 1
##$TYPE= <nmr>
##$USER= <dgb>
##$AMP= (0..31)
100 100 100 100 100 100 100 100 100 100 100 100 100 100 100 100 100 100 
100 100 100 100 100 100 100 100 100 100 100 100 100 100 
##$AQSEQ= 0
##$AQ_mod= 3
##$AUNM= <au_zg>
##$AUTOPOS= <6 >
##$BF1= 250.13
##$BF2= 250.13
##$BF3= 250.13
##$BF4= 250.13
##$BF5= 500.13
##$BF6= 500.13
##$BF7= 500.13
##$BF8= 500.13
##$BYTORDA= 1
##$CFDGTYP= 0
##$CFRGTYP= 5
##$CHEMSTR= <none>
##$CNST= (0..31)
1 1 145 1 1 1 1 1 1 1 1 1 1 1 1 1 1 1 1 1 1 1 1 1 1 1 1 1 1 1 1 1 
##$CPDPRG= <>
##$CPDPRG1= <>
##$CPDPRG2= <>
##$CPDPRG3= <>
##$CPDPRG4= <mlev>
##$CPDPRG5= <mlev>
##$CPDPRG6= <mlev>
##$CPDPRG7= <mlev>
##$CPDPRG8= <mlev>
##$CPDPRGB= <>
##$CPDPRGT= <>
##$D= (0..31)
0 1 0 0 0 0 0 0 0 0.06 0 0 0 0 0 0 0.0002 0 0 0 0 0 0 0 0 0 0 0 0 0 0 
0 
##$DATE= 1154086122
##$DBL= (0..7)
120 120 120 120 120 120 120 120 
##$DBP= (0..7)
150 150 150 150 150 150 150 150 
##$DBP07= 0
##$DBPNAM0= <>
##$DBPNAM1= <>
$$ [...]
##$SUBNAM7= <"">
##$SUBNAM8= <"">
##$SUBNAM9= <"">
##$SW= 20.6930455092707
##$SWIBOX= (0..15)
0 0 3 0 0 0 0 0 0 0 0 0 0 0 0 0 
##$SW_h= 5175.983436853
##$TD= 65536
##$TD0= 1
##$TE= 295.16
##$TE2= 300
##$TE3= 300
##$TEG= 300
##$TL= (0..7)
0 120 120 120 120 120 120 120 
##$TP= (0..7)
150 150 150 150 150 150 150 150 
##$TP07= 0
##$TPNAME0= <>
##$TPNAME1= <>
##$TPNAME2= <>
##$TPNAME3= <>
##$TPNAME4= <>
##$TPNAME5= <>
##$TPNAME6= <>
##$TPNAME7= <>
##$TPOAL= (0..7)
0.5 0.5 0.5 0.5 0.5 0.5 0.5 0.5 
##$TPOFFS= (0..7)
0 0 0 0 0 0 0 0 
##$TUNHIN= 0
##$TUNHOUT= 0
##$TUNXOUT= 0
##$USERA1= <user>
##$USERA2= <user>
##$USERA3= <user>
##$USERA4= <user>
##$USERA5= <user>
##$V9= 5
##$VALIST= <valist>
##$VCLIST= <CCCCCCCCCCCCCCC>
##$VD= 0
##$VDLIST= <DDDDDDDDDDDDDDD>
##$VPLIST= <PPPPPPPPPPPPPPP>
##$VTLIST= <TTTTTTTTTTTTTTT>
##$WBST= 1024
##$WBSW= 4
##$XGAIN= (0..3)
0 0 0 0 
##$XL= 0
##$YL= 0
##$YMAX_a= 242792
##$YMIN_a= -332133
##$ZGOPTNS= <>
##$ZL1= 120
##$ZL2= 120
##$ZL3= 120
##$ZL4= 120
##$ABSF1= 16.522
##$ABSF2= -4.171173
##$ABSG= 5
##$ABSL= 3
##$ALPHA= 0
##$AQORDER= 0
##$ASSFAC= 0
##$ASSFACI= 0
##$ASSFACX= 0
##$ASSWID= 0
##$AUNMP= <proc_1d>
##$AZFE= 0.1
##$AZFW= 0.1
##$BCFW= 0
##$BC_mod= 0
##$BYTORDP= 0
##$COROFFS= 0
##$CY= 12.5
##$DATMOD= 1
##$DC= 0
##$DFILT= <>
##$DTYPP= 0
##$F1P= 14.0000005364418
##$F2P= -0.99999901652339
##$FCOR= 0.5
##$FTSIZE= 32768
##$FT_mod= 6
##$GAMMA= 0
##$GB= 0
##$INTBC= 1
##$INTSCL= 1
##$ISEN= 128
##$LB= 0.3
##$LEV0= 0
##$LPBIN= 0
##$MAXI= 10000
##$MC2= 0
##$MEAN= 0
##$ME_mod= 0
##$MI= 0
##$NCOEF= 0
##$NC_proc= -7
##$NLEV= 6
##$NOISF1= 0
##$NOISF2= 0
##$NSP= 0
##$NTH_PI= 0
##$NZP= 0
##$OFFSET= 16.522
##$PC= 1
##$PHC0= 170.8432
##$PHC1= 1.222878
##$PH_mod= 1
##$PKNL= yes
##$PPARMOD= 0
##$PSCAL= 4
##$PSIGN= 0
##$REVERSE= no
##$SF= 250.13
##$SI= 32768
##$SIGF1= 0
##$SIGF2= 0
##$SINO= 400
##$SIOLD= 32768
##$SREGLST= <1H.CDCl3>
##$SSB= 0
##$STSI= 32768
##$STSR= 0
##$SW_p= 5175.98343685301
##$SYMM= 0
##$S_DEV= 0
##$TDeff= 65536
##$TDoff= 0
##$TI= <Analysis number 999999
Compound Code 99
Book Reference 9
Project Code 9>
##$TILT= no
##$TM1= 0
##$TM2= 0
##$TOPLEV= 0
##$USERP1= <user>
##$USERP2= <user>
##$USERP3= <user>
##$USERP4= <user>
##$USERP5= <user>
##$WDW= 1
##$XDIM= 32768
##$YMAX_p= 511997817
##$YMIN_p= -5595214
$$ End of Bruker specific parameters
$$ ---------------------------------
##NTUPLES= NMR SPECTRUM
##VAR_NAME=  FREQUENCY,     SPECTRUM/REAL,   SPECTRUM/IMAG
##SYMBOL=    X,             R,               I
##VAR_TYPE=  INDEPENDENT,   DEPENDENT,       DEPENDENT
##VAR_FORM=  AFFN,          ASDF,            ASDF
##VAR_DIM=   32768,         32768,           32768
##UNITS=     HZ,            ARBITRARY UNITS, ARBITRARY UNITS
##FACTOR=    0.157963299565203, 1,           1
##FIRST=     4132.6476996994, 0,             0
##LAST=      -1043.33573715361, 0,           0
##MIN=       -1043.33573715361, -5595214,    0
##MAX=       4132.6476996994, 511997817,     0
$$ Real data points
##PAGE= N=1
##DATA TABLE= (X++(R..R)), XYDATA
$$ [...]
22555H46412m63640j164363J70602J157914J259521K48539j637300l2645J479918
22546A864958l11203j252174l40109N81128Q8748j459690j306700K83527N70603
22537a280912M86474J27848K77474J48643m75135l42610P25900J022988N22765
22528A213435q22892K94471p39891o86221J185252K5183p65278r5146J170472
22519G79385Q39604k30463M26309q53224o4061N88749j095018j379334M6333J14015
22509h27705J553059J134658r46476K16429p57524N12270K2080j177894m42944
22500g14047p14897J542632J127703j288086K43315J054208p53664j272552l80594
22491a155982K01103k34838m12690N22446J044302M32641J587066Q7222j315831
$$ y = [846412, 382772, -781591, -610989, 546925, 1806446, 2054985, 417685, 385040, 1864958, 1553755, 301581, -38528, 542600, 631348, -828342, -2135042, -1851515, -1280912, -794438, -666590, -389116, -240473, -715608, -1058218, -332318, 690670, 1213435, 390543, 685014, -54877, -741098, 444154, 469337, -295941, -391087, 779385, 1618989, 1388526, 1814835, 961611, 897550, 1486299, 391281, -988053, -941720, -827705, 725354, 1860012, 913536, 1129965, 372441, 884711, 906791, -271103, -714047, -1428944, 113688, 1241391, -46695, 196620, 1250828, 497164, -775388, -1155982, -954879, -1189717, -1602407, -1079961, -35659, 396982, 1984048, 2071270, 755439]
22482G55439K77119O77331k35735r35427j39896M08383O42602K05318O50080N337
22472B310551o96120m28887p01006J183313o22268M89888R76801L8116j470208
22463A080180j419731k18358L58561M96566l44489p54142k51109K05841O29207
22454b17474m46628J041897J247620L26392j786032j027680J58827l58579K97317
22445g64340Q68470n81487K15692m50336q3992M01150K92621j967238j667019
22436c736479k46106N08463K016399J255075n73998j244051k09271k26506Q1059
22427b375415N12506J334257j98064m02318K58284r87989N63602J59289N99623
22418e36225P456p26326k31740r1467q70545J532757K299096J033236q62451j982477
$$ y = [755439, 1032558, 1709889, 1474154, 538727, 398831, 807214, 1449816, 1655134, 2305214, 2310551, 1614431, 1185544, 484538, 1667851, 1045583, 1535471, 2512272, 2550388, 1080180, -339551, -557909, -199348, 297218, -47271, -801413, -1052522, -846681, -217474, -664102, 377795, 1625415, 1951807, 165775, -861905, -703078, -1061657, -764340, 104130, -477357, -261665, -712001, -795993, -394843, -102222, -2069460, -3736479, -3982585, -3474122, -1457723, -202648, -776646, -2020697, -2229968, -2456474, -2375415, -1862909, -528652, -726716, -1129034, -870750, -1858739, -1295137, -1135848, -536225, -528769, -1255095, -1486835, -1578302, -2448847, -916090, 1383006, 2416242, 1553791, -428686]
22408d28686j068192J399322R79440j147756j19611K79646L63384Q37858l30891
22399G64514j066751j271053Q33563O55016p5597Q66779N5336l73217n71060J40335
22389d2135l89231l43799l48975p0556K18825J114101q26071k39010R37180O54227
22379F64556J12573N09632n22833q94595J09535m78406o12637L7873K21858j391963
22369b244407j044438J310684N93722j508524m40708P4699J672741J541680K95930
22360B51379J48362M36003r67475o57467n88766Q87917Q34538O63051q41595j115071
22350i49124J74427M00537J053794l97739j721786k02512j39584O24740J013377
22341a43870p50952m0982O57424K9397j142185R3951J033664m45059n4561R04667
$$ y = [-428686, -1496878, -97556, 881884, -265872, -385483, -105837, 257547, 1095405, 764514, -302237, -1573290, -739727, -84711, -160308, 706471, 761807, 388590, -182470, -42135, -431366, -775165, -1124140, -1194696, -975871, 138230, -687841, -926851, 10329, 664556, 777129, 1286761, 763928, -130667, -21132, -499538, -1112175, -1074302, -852444, -2244407, -3288845, -1978161, -1384439, -2892963, -3333671, -3258972, -1586231, -44551, 251379, 399741, 835744, -131731, -789198, -1377964, -490047, 344491, 1007542, 165947, -949124, -774697, -374160, 679634, 281895, -1439891, -1642403, -1781987, -1157247, -143870, -894822, -935804, -278380, -248983, -1391168, -1297217, -263553, -708612, -763173, 141494]
22331A41494j111135q80344M77082J355251k36448k098602K81565N49269l77842
22322a899710m90539n47831P27639n0155N87672L16907Q5956p10992m94490J593374
22312h82169N11562N12372Q7032J191340N52804p88391j583987J44728J029247
22303G74538p9891j95563j683226r56699N98178k40386o70936L14742Q94977K26003
22293a018263l72183k24559J978276M23802j270028n22130Q73997M24338J20189
22284D13439q74764K29565j30087m44124J128289J230649n91836l04805m41985
22275B14341p69657k44063p7977k17479j28719M43433J78388j20349J154042q18827
22265c86867l12678J4512k28447j906435j018154K72041J153252J007325N8784
$$ y = [141494, -969641, -1849985, -1372903, -17652, -254100, -2352702, -2071137, -1521868, -1899710, -2390249, -2938080, -2210441, -2260596, -1672924, -1356017, -1270061, -1981053, -2475543, -882169, -370607, 141765, 228797, 1420137, 1972941, 1184550, -399437, -254709, 774538, 694647, 499084, -1184142, -2140841, -1542663, -1783049, -2453985, -2139243, -1244266, -1018263, -1390446, -1615005, 363271, 787073, -482955, -1005085, -131088, 293250, 413439, -461325, -231760, -361847, -805971, 322318, 1552967, 961131, 656326, 214341, -555316, -799379, -877356, -1094835, -1223554, -780121, -601733, -722082, 431960, -386867, -699545, -685033, -913480, -2819915, -3838069, -3566028, -2412776, -1405451, -1346667]
22256a346667J019257R10016j191573R20706J201798P10507L55858p29341j424241
22247D26320r31929O81348K68366p33881q67670q42414J738024K226413o31030
22238A333547j11076p00209r3027p8123o26872p50301m93439J803547M87057j351147
22228e80043j825994j550450m57688N94924R02658M83914R91216N30449o87292
22219a598306J582378M07030j082107N3217J768456N1000r26917N86960j69571
22210F72140r39398j21116j542695q19249O41875L18453J381533l36018l71067
22201a115542r44933J330750n67216l90727m8365K16738L53426j06174n7065l15636
22191a644744N12084N0930J126663P20263l59649n20427O36069J408773l57985
$$ y = [-1346667, -327410, 582606, -608967, 311739, 1513537, 2224044, 2579902, 1850561, 426320, -505609, 175739, 444105, -289776, -1157446, -1999860, -261836, 1964577, 1333547, 1222471, 522262, 429235, 351112, -275760, -1026061, -1519500, 284047, 771104, -580043, -2406037, -3956487, -4414175, -3819251, -2916593, -2432679, -1441463, -911014, -1598306, -15928, 391102, -691005, -637788, 1130668, 1181668, 254751, 841711, 672140, -267258, -388374, -1931069, -2750318, -2108443, -1789990, -408457, -744475, -1115542, -2060475, -729725, -1296941, -1687668, -1736033, -1519295, -1165869, -1272043, -1329108, -1644744, -1132660, -1081730, 44933, 765196, 405547, -114880, 521189, 1929962, 1571977]
22182A571977M1417k76730q0941j269887j6741M50994l72338q82785k84242N17489
22172f01787J208233j95930L47068M6202p1015k50788Q21529j242191n77776p94045
22162a310500j78797J54021K620751J351860j310578j492058m96592k40193j56512
22153a058598R17187L74651j338729o60787o74855o92625J225894l32215L80766
22144a859311n44901l21696J438885q3201J070135j368088M12219Q50222J04082
22135c01654J055342j52627m64715q4087q28766k046230J109216R91608O40217
22126h1696k39047j117845M97456J030618O59390O24927J50421P63137q81170
22117A406191r58494P38800P00103o47021j811767o09891J394898J384290j592416
$$ y = [1571977, 1613394, 1336664, 1255723, -14164, -30905, 420089, 47751, -835034, -1119276, -601787, 606446, 410516, 757584, 803786, 732771, 481983, 1303512, 61321, -516455, -1310500, -1489297, -1335276, 1285475, 2637335, 1326757, -165301, -661893, -902086, -1058598, -141411, 233240, -1105489, -1766276, -2441131, -3133756, -1907862, -2240077, -1859311, -2404212, -2725908, -1287023, -1370224, -300089, -1668177, -1255958, -405736, -301654, 753688, 601061, 136346, 52259, -776507, -2822737, -1713521, -721913, -81696, -320743, -1438588, -941132, 89486, 748876, 1373803, 1524224, 2287361, 1406191, 447697, 1186497, 1886600, 1239579, -572188, -1182079, 212819, 1597109, 4693]
22108D693j248945o94601J180059K384047o16616r33994J487482J488529j267871
22099A782783k522523m09368K020236R19496o38477j08632j21276L09093O97614
22090A928946j058362N15665j5945q99455k87281P70948K80464J1481m08449N64606
22080A402618L77670N40573N83896O48j597111j421488l90694j405514j015851
22071b925253J351046J273494R2716k20815K35056q52603j668949J512633R57955
22062b44720J712089P29361O79333m13899J7682m15752l57993j008123K27119
22053I25097j33010M56885o59529J28064o47870j502519L30425L26874J7785n71965
22043a329763J284404R14523k55245o23880R50518n72075j23755J247206J335283
$$ y = [4693, -1244252, -1938853, -758794, 1625253, 1008637, 74643, 1562125, 3050654, 1782783, -739740, -1149108, 871128, 1790624, 1152147, 1043515, 922239, 1231332, 1928946, 870584, 1386249, 1370304, 470849, 183568, 954516, 1234980, 1246461, 838012, 1402618, 1780288, 2320861, 2904757, 2905405, 1308294, -113194, -503888, -1909402, -2925253, -1574207, -300713, -207997, -428812, -193756, -1046359, -2715308, -1202675, -244720, 1467369, 2196730, 2876063, 2462164, 2479846, 2064094, 1706101, 697978, 925097, 792087, 1248972, 589443, 717507, 69637, -1432882, -1102457, -775583, -757798, -1329763, -45359, 869164, 613919, -9961, 940557, 368482, 244727, 1491933, 2827216]
22034B827216N91238j020422n40442J74259n58205k3009n18076j839713j560705
22025b467859L99855K270843J560792j15654r68226K55502p35130j053201L07336
22016e45742R68504M746j054186j802178R32049J175704Q7392j533201J39077
22007a627835M31565K44362M59053K008813k36776k248546p53037P84198J938132
21998I99929J96247j535533Q9700R0838p52908Q94311M5383j18407Q26625P71708
21988A507893k216389j314837Q96758j23622J619243q1866j12805j273542N06119
21979e93048J124638J48389j39544k8737l74069R35669K20138j535087j936965
21970b178616j518350J665027J079905O1919k14559k9513J529663K59594o70320
$$ y = [2827216, 3418454, 2398032, 1857590, 2031849, 1473644, 1450635, 932559, -907154, -2467859, -2068004, 202839, 1763631, 1647977, 679751, 935253, 200123, -853078, -545742, 422762, 427508, -626678, -2428856, -1496807, -321103, -233711, -1766912, -1627835, -1196270, -951908, -492855, 1515958, 1279182, -969364, -1722401, -938203, 999929, 1196176, -339357, -249657, -158819, -911727, -17416, 27967, -90440, 736185, 1507893, -708496, -2023333, -1126575, -1250197, 369046, 287180, 174375, -1099167, -593048, 531590, 679979, 540435, 511698, 137629, 1073298, 1293436, -241651, -2178616, -3696966, -2031939, -952034, -890115, -1104674, -1134187, 395476, 655070, -15250]
21961a5250P33951L91792L36340n81506j72582r05250K35792n4979r62132R22212
21951g1612N60956l50918p77766K78482N08129o90132L37229J070440l70738j077982
21941e83912k41135m5041M48896P30115j42534n62103k47975J033925m5700r67403
21931f22867p01869M95802k06123Q31592Q37449o38576p06005N61894M55359J088330
21921A394986J271286l71532j603380j820021r00516L03749P54238Q61286J54251
21912D4347J62065n39022q4460J157455J166185j413769j310224N31806l60160
21903f45777Q08110J821647J04064m35114k399056k56276l8975J135424J28709
21894B22756N33142P28915N13643L67807k48171j841952j908620n8859J829443
$$ y = [-15250, 718701, 1110493, 1446833, 865327, 692745, -212505, 23287, -31692, -993824, -71612, 489344, 138426, -639340, -360858, 147271, -542861, -205632, 864808, 494070, -583912, -825047, -870088, -421192, 308923, 166389, -395714, -643689, 390236, 344536, -622867, -1324736, -828934, -1035057, -203465, 633984, -4592, -710597, -148703, 306656, 1394986, 2666272, 2294740, 691360, -1128661, -2029177, -1725428, -971190, -109904, 44347, 206412, -332610, -417070, 740385, 1906570, 492801, -817423, -285617, -645777, 162333, 1983980, 2088044, 1652930, -746126, -1002402, -1041377, 94047, 222756, 755898, 1484813, 1998456, 2366263, 2118092, 276140, -1632480, -1691339, 138104]
21885A38104m66394j846436L16906Q99563J299395L17900q67256Q1701N1804J88491
21875A13778j51657J54052K20911P76884l88968k13964R21344J34149n39878K2264
21865A048915J41503K59358K62527J59051j580120j117914O88034J350712p09854
21856E02212j128571j018359n29835Q12447Q46980K30101N56584j149954O37602
21847b40793K276314n35699k233256j674985J679020K761408J337548q80351j292539
21838A196667l47123M07501k5537m96125n5399Q27116M92314j178010o8337j621285
21828h68218p2331R67834Q26569M70778q03657n74569J23906q5731n47536l58767
21818i21722r00949p01921J512997O63462j60572J364437j88497O836j229055
$$ y = [138104, -328290, -2174726, -1857820, -958257, 341138, 659038, -208218, -126517, -74713, 113778, -37879, 116173, 337084, 1113968, 725000, 511036, 1432380, 1566529, 1026651, 1048915, 1190418, 1449776, 1712303, 1871354, 291234, -826680, -138646, 1212066, 502212, -626359, -1644718, -2174553, -1362106, -515126, -285025, 271559, -878395, -240793, 2035521, 1499822, -733434, -2408419, -729399, 2032009, 3369557, 2489206, 1196667, 849544, 1257045, 1231508, 735383, 679984, 1507100, 1999414, 821404, 753067, -868218, -940549, 27285, 853854, 1324632, 520975, -53594, 70312, -15419, -562955, -921722, -1822671, -2524592, -1011595, -348133, -508705, 855732, 667235, 674071, -554984]
21809e54984n70264K14062o95562J055858k15581j008663N4413K84534m34571
21800a870758O43315Q80666R67175J185401j439245n55562q90751P53280N42534
21791B16055l85478M76951J212060r95199j093034j263657Q68226J488041m78006
21782D5959P01187J672478j005659r49138j071148K63505J25893p96410l85538
21773a398871O56355J428246L00640m33287o0607K04216o95444j622544p38450
21764b359746P15565l08564n1841J011844m94204k85127L37791R91383o19291
21755a062190L91041L20092J144911n26748k216533o46800J011289j3121o30773
21746b228832Q59986O46453j70232j813337k108038M54260N31016J771867J816651
$$ y = [-554984, -1125248, -911186, -1606748, -550890, -766471, -1775134, -1720721, -1436187, -1870758, -1227443, -346777, 620398, 1805799, 366554, -189008, -1079759, -326479, 216055, -169423, 307528, 1519588, 524389, -568645, -1832302, -964076, 523965, 45959, 747146, 2419624, 1413965, 464827, -606321, -342816, -216923, -1013333, -1398871, -742516, 685730, 986370, 553083, 492476, 696692, 1248, -1621296, -2359746, -1644181, -1952745, -2004586, -992742, -1486946, -1772073, -1434282, -442899, -1062190, -671149, -351057, 793854, 267106, -1949427, -2596227, -1584938, -1598059, -2228832, -1368846, -722393, -892625, -2705962, -4814000, -4359740, -3828724, -2056857, -240206]
21737b40206J5484o71339J237758O7349q16348M6128o62746L87872J019782k36338
21727A47396k75594o52813l87211K082203Q22204N27405o04254k29615j99349
21718A230372r15480o8062q71075L86654J084562r88023o5952K91677P38467J66345
21708I89485P43504j4709j291935P11253n1772J131606j194628j102498p6374
21699a56068m48733j537165M64257J112013M58978L53045K41755j026789J172945
21690F34238j192173j650193L7411O63021l38194O32075K113548m52034k013980
21681a566281k100675r27291J325791K139557J933554j039419r43891m57293P45306
21672h90642J073364L24308N77027r76146o68712l64883k40239J264535M66117
$$ y = [-240206, -224722, -896061, 341697, 409046, -407302, -361174, -1023920, -636048, 383734, 147396, -128198, -781011, -1168222, 913981, 1736185, 2263590, 1659336, 1429721, 1230372, 314892, 246830, -624245, -237591, 846971, -141052, -207004, 84673, 823140, 989485, 1732989, 1718280, 426345, 1137598, 1085826, 2217432, 1022804, -79694, -156068, -604801, -2141966, -1677709, -565696, -106718, 246327, 488082, -538707, 634238, -557935, -2208128, -2170717, -1507696, -1845890, -1213815, 899733, 447699, -1566281, -3666956, -4594247, -3268456, -1128899, 804655, -234764, -1178655, -1635948, -890642, 182722, 507030, 1084057, 107911, -560801, -925684, -1165923, 98612, 564729]
21663E64729Q43493q88315n0118j063713j604858k9565J444452J528074J227849
21654A972028J262399q17093j292844N73754O87295k34337n81709o87460r5345
21645G86688L55693Q26160j150995q46418Q35343J7542j702948L23666L94820
21636a60449o90740n47931K98182m90708q8390r0355J23807M00283m80919K26432
21626a500788Q68949J70688m87855k02438j28345p5245l66736j72480K57266n23188
21616b160172P22317L39032K37898m07386q659O15868O80869N738o73299q2529
21606g30323k36959M28490L42521O38721k50651J62707r4339n96552j161371k43072
21596a740828j129207L59797O22669J509688M854j787088j29191J812967Q16444
$$ y = [564729, 1408222, 519907, 469789, -593924, -2198782, -2228347, -783895, 744179, 1972028, 3234427, 2417334, 1124490, 1698244, 2385539, 2151202, 1569493, 882033, 786688, 1142381, 1968541, 817546, -28872, 806471, 824013, -878935, -555269, -160449, -851189, -1399120, -1100938, -1591646, -1680036, -1770391, -1646584, -1246301, -1727220, -1500788, -631839, -461151, -949006, -1151444, -1279789, -1355034, -1721770, -1894250, -1636984, -2160172, -1437855, -1098823, -860925, -1268311, -1276970, -661102, 19767, 25505, -647794, -730323, -967282, -538792, -196271, 442450, 191799, 354506, 260167, -336385, -1497756, -1740828, -2870035, -2510238, -1887569, -377881, -373027, -2160115, -2289306, -476339, 340105]
21587C40105M87589q36825k144583l50842Q87668k3503j008942K96749J636597
21578g15987J39762K44398J79771o2233j7926N67451K00817j087263N18653J484757
21568A452200K69005J67547q38201o41866q0358j227041n88059R34927p22079
21559a273925K97825K242424k93370o20224Q18603N59315R65952K04632j257051
21550A644181m78164n99492k76659k07541Q54049J2348R5155R57586q5171l4865
21540A881427P30784n29506j089504M77933j283400j033604j369369k4825K30797
21531b009267J097121l1630J236820l08588l92828M47117N33515j207995j081010
21522a716745M49589m5637q6551q5888r95698o27695j99361L43052q75308P54143
$$ y = [340105, 827694, -9131, -2153714, -2504556, -1616888, -1640391, -2649333, -2352584, -715987, -576225, -331827, -152056, -214289, -232215, 335236, 536053, -551210, -32557, 1452200, 1721205, 1888752, 1050551, 408685, 328327, -898714, -1486773, -551846, -1273925, -976100, 1266324, 972954, 352730, 1171333, 1730648, 2696600, 2901232, 1644181, 1166017, 566525, 289866, 82325, 936374, 948722, 1043877, 2001463, 1916292, 1881427, 2612211, 2082705, 993201, 1471134, 187734, -845870, -2215239, -2240064, -2009267, -912146, -943776, 293044, -15544, -408372, 38745, 572260, -635735, -1716745, -1267156, -1312793, -1399344, -1485232, -2480930, -3108625, -3307986, -2964934, -3840242, -3086099]
21512c086099J063355J517758J045703R5241k020284R2174O27143K55487K07135
21503b02387q1212J56531J64455P75099m51749j38101N07286n16055o43872j35256
21493e65261M17904Q35013j71867J44560n14838K06586n02842k11733R37593r33868
21483c58753m91570L56134J882409R7093j364493r90881P30480O97813j467553
21474i09321o55292L0208j17654j11671Q33423P2181P60064K50307n9778K2187
21464A14654O25535L54972p24407K11034j34827o08028J178027O78413j068815
21455F26558q27726j856496j163595N61938O69831K47330J06822J615895j57737
21446a77180P29N23854J418057l1889r62517l71077K92280P28255M92724L3838
$$ y = [-3086099, -2022744, -504986, 540717, 635958, -1384326, -1292152, -665009, -409522, -202387, -283599, -127068, 37387, 812486, 360737, 222636, 729922, 213867, -430005, -565261, -147357, 687656, 515789, 660349, 145511, 352097, -150745, -362478, 575115, -358753, -850323, -494189, 1388220, 1485313, 120820, -870061, -139581, 558232, -909321, -1564613, -1534405, -1652059, -1763730, -930307, -858126, -98062, 152245, 92467, 114654, 740189, 1095161, 370754, 581788, 446961, -161067, 1016960, 1695373, 626558, -201168, -2057664, -3221259, -2659321, -1989490, -1742160, -1635338, -19443, -177180, -176451, 347403, 1765460, 1733571, 771054, 399977, 692257, 1420512, 1913236, 1947074]
21436A947074O2039q34353j925223m7744l28993j02217n5102j47416q68419J905949
21426c94405Q83131M0988o55640N14000J327462j071138j101172N95824j51209
21417a2159r6017P72402L03824Q84935J04347n34659j025041j022883j141736
21408a766987K127027O35629j92768l5560n91044Q07584N11313l25852o29169
21399E40173q10324N03235K35475q69173j318879J82638O9454M95381K091766
21390A119746R17659j236829j882907L73022J430733N41536j479040N47356N9700
21381C90976l26038J122635k58354j087331o25299j156981J7536O19901O77723
21372f25232k8971l5960j331856N9120N60589j09808R13994Q59850K22839R0010
$$ y = [1947074, 2009113, 1174760, -750463, -798207, -1127200, -1229417, -1284519, -1431935, -2300354, -394405, 488726, 529714, -125926, 388074, 1715536, 644398, -456774, 139050, -12159, -108176, 664226, 968050, 1852985, 1957332, 1422673, 397632, -625251, -1766987, 360040, 995669, 802901, 767341, 176297, 983881, 1495194, 1169342, 540173, -270151, 233084, 468559, -400614, -1719493, -1536855, -1467401, -972020, 1119746, 2037405, 800576, -1082331, -709309, 721424, 1262960, -216080, 331276, 390976, 64938, 1187573, 929219, -158112, -783411, -1940392, -1922856, -1302955, -625232, -654203, -690163, -2022019, -1962899, -1402310, -1512118, -598124, 261726, 484565, 574575]
21362E74575J386885p72212j468122L92207J30341J6570j12166n26960J15381
21353b63501N68500j187311j107269R28159R2370J08206J99557p88042p2364l51433
21343a873128P44952J17611P2557k4684P33960J258463k8807J238110J344525
21334C583559r58760k466178j708138J70193N6635Q66514Q01101K14717m25222
21325A34421j235728P43583M34249p77504j387351l88501K8763l07350P98426
21316a956992N85747J465714L14930L19874l45360j175247m44305J009619N57721
21307C31701L57167M61940r85139k91008j97068j65558P63665k49146P22845n31644
21297B17755j767507K23085O63918m0978o46767R8776K05998q31393P73388J258173
$$ y = [574575, 1961460, 1189248, -278874, 113333, 243674, 260244, 148078, -378882, -263501, 304999, -882312, -1989581, -1061422, -969052, -860846, -661289, -1449331, -1521695, -1873128, -1128176, -1010565, -938008, -962692, -228732, 1029731, 1000924, 2239034, 3583559, 2624799, 158621, -1549517, -1379324, -1322689, -456175, 344926, 559643, 134421, -1101307, -357724, 76525, -700979, -2088330, -2476831, -2448068, -2755418, -1956992, -1371245, 94469, 409399, 729273, 383913, -791334, -1235639, -226020, 331701, 688868, 1150808, 165669, -125339, -322407, -487965, 275700, 26554, 749399, 217755, -1549752, -1326667, -662749, -703727, -1350494, -1251718, -1045720, -1877113, -1103725, 154448]
21287A54448O84549j63607j585844m04934n7610m72479j108449J36417J305116
21278a512393J155285l26136L63386M86978p48059K43720r50351o62372J962000
21269A2058J009230r045L97577j69921p29725k897496N47616J239637M15089P1540
21259a13440N78919J562434p7471r09370q84231M76596N82136j00459l79180r3353
21249F42581k004837j079290N98353N23087M35694L96716J404080l88146j494405
21240i66167M0906J98898J255263N86165j323461n17444j26093Q50072K31569
21231B29708K76246j02718k063691l72889J2417N57680P69257m89004M81567j598854
21221b300281L50366R31781J234726j10343j635123J122727J889587k84930P48570
$$ y = [154448, 838997, 675390, -910454, -1315388, -1372998, -1845477, -2953926, -2817509, -1512393, -357108, -683244, -319858, 167120, -580939, -337219, -1287570, -1949942, 12058, 1021288, 1012243, 1409820, 1239899, 510174, -2387322, -1839706, -600069, -184980, -113440, 465479, 2027913, 1950442, 1041072, 156841, 633437, 1215573, 1115114, 735934, 642581, -1362256, -2441546, -1843193, -1320106, -884412, -487696, 916384, 528238, -966167, -925261, -726363, 528900, 1115065, -208396, -725840, -851933, -1861, 229708, 505954, 403236, -1660455, -2033344, -2020927, -1463247, -693990, -1182994, -701427, -2300281, -1949915, -1018134, 216592, 106249, -1528874, -406147, 1483440, 1198510, 1947080]
21212A947080q0947m39532o04376M17426J038264m81227o655k067634m3053L6891
21202b83763o35943M15502j975415R23611J146329M49057j866150m10350k17707
21193b454829R04680k04890n13723L2508p68296k56590J939933L32694j3192J068972
21183F7267J24970L6266K07609J97058m43418J26184k44186j042834l87455L82383
21173i76156m14087l5486P18053Q39215J143715r41026J07415P59010k82424K74001
21163A192230p81492P6803j558633M14716q67372q27685R36128L16298P22042
21154c76965J0740L96145m8680j58914j104568p6273L18332P5594k20558o16872
21144a802019L95769m40847n70087Q02403J349550Q95379p65888j506682J61263
$$ y = [1947080, 1866133, 1426601, 822225, 1239651, 2277915, 1796688, 1790033, -277601, -320654, -283763, -919706, -504204, -2479619, -1556008, -409679, 39378, -1826772, -2237122, -2454829, -1550149, -1755039, -2268762, -2236254, -3004550, -3261140, -1321207, -988513, -1001705, 67267, 192237, 228503, 436112, 633170, 189752, 315936, 71750, -971084, -1358539, -976156, -1390243, -1425729, -707676, 131539, 1275254, 334228, 441643, 1200653, 918229, 1192230, 410738, 487541, -1071092, -656376, -1523748, -2351433, -1415305, -1099007, -376965, -366225, 29920, -18760, -177674, -1282242, -1358515, -1040183, -964589, -1185147, -1802019, -1406250, -1847097, -2417184, -1614781, -265231, 630148, -135740, -1642422, -1481159]
21135a481159K559973Q42257k046005j343219J51897K47154K16790L40243L26887
21126a85182j107997L22876J304036M95060Q2394J267355J40522p75053j363579
21117A80432q23401m00691r2042o5002p1294k54947Q03407K61529o44587r1703
21107a198299J415103J571097J73698R8080J149063q43893j097491m20565o328
21098H40465k07697j527631K2912R72645M04879j137824m21108k95868M29486
21089i19741r21743P65261R94810N889R46119m1099n42533j203912p80177j255078
21079b952204K36764M92326N95641J465976p39649j545864O63433J612563J122349
21070I51335K83539N29479j5461l98627m97234m34957o68614j28149K39421J13633
$$ y = [-1481159, 1078814, 1921071, -124934, -1468153, -1316256, -1069102, -852312, -512069, -185182, -1293179, -970303, 333733, 828793, 911187, 2178542, 2319064, 1544011, 180432, -642969, -1043660, -1135702, -1200704, -1271998, -1526945, -723538, -462009, -1106596, -1198299, 216804, 1787901, 1961599, 2059679, 3208742, 2364849, 1267358, 846793, 840465, 632768, -894863, -871951, 100694, 505573, -632251, -1053359, -1349227, -919741, -1841484, -1076223, -81413, -75524, 870595, 829496, 286963, -916949, -1697126, -2952204, -2715440, -2223114, -1627473, -161497, -901146, -2447010, -1783577, -171014, 951335, 1234874, 1764353, 1748892, 1350265, 853031, 418074, -250540, -378689, -139268, -25635]
21060b5635M60643j618283j88849R11207M57675M90928P0764j018747j495019
21051a955316r58211R07364J123969K44020o6877K53717q58670J454235q62644
21042g18413j587223N6923J284576N84532K99510O99776O82993j370309L37401
21033B69766j025812j325002K28870J034919J094573J221898l01667p24769j78575
21024B94201l56135M73581J64861n78866j171188m72527J268369P2286j108387
21015a413805O17844R27743p67517M56789P20097O93347O01907M81222M36342
21006B753969K52096p16492p67026k31729q45577r88198j098928q19447P40219
20997a721113j45286O4620K76890J537756m02614j534270j917J197042j61432
$$ y = [-25635, 435008, -1183275, -1372124, -460917, -3242, 487686, 558450, -460297, -1955316, -2913527, -2006163, -882194, -638174, -705051, -451334, -1310004, 144231, -718413, -2305636, -2248713, -964137, -379605, -80095, 619681, 1302674, -67635, 269766, -756046, -2081048, -1852178, -817259, 277314, 1499212, 1197545, 472776, 294201, -61934, 411647, 576508, -2358, -1173546, -1646073, -377704, -305418, -1413805, -795961, 131782, -635735, -178946, 541151, 1234498, 1836405, 2317627, 2753969, 3006065, 2289573, 1522547, 1290818, 445241, -542957, -1641885, -2461332, -1721113, -1866399, -1801779, -1524889, 12867, -389747, -1924017, -1925934, -728892, -890324]
20988h90324j445247l43021j74559J37936P44637P82826L79416R17606o68003
20979e58733R07861o1439r18634r09590J561953J036589q80938L38347O34981
20970A150397k581506q11540k37608P42642J99927L23068k56753l80595q80748
20961b732716P57268R8586J131581m16717P23486J38976M24465n50802k24238
20952f50111l97974m58823l42165J264123l99683o90817J592971k72484o32255
20943i87218P08426o43754Q71782N26496j24079j700904k410921r22341J505410
20934c177103Q98635N85218p47204L39659o8808Q31535J096584R69412l66913
20925C61015n71866N7634J95434j72727j79908J61453q19875j415452j77664l52337
$$ y = [-890324, -2335571, -2678592, -2853151, -2715215, -1970578, -1187752, -808336, 109270, -558733, 349128, 287689, -630945, -1540535, 21418, 1058007, 177069, 515416, 1150397, -1431109, -2242649, -2480257, -1737615, -1537688, -1214620, -1471373, -1851968, -2732716, -1975448, -1876862, -745281, -1161998, -438512, -299536, 124929, -425873, -650111, -1048085, -1506908, -1849073, -584950, -984633, -1675450, -82479, -354963, -987218, -278792, -922546, -50764, 475732, 351653, -1349251, -3760172, -4682513, -3177103, -2278468, -1693250, -2440454, -2100795, -2169603, -1338068, -241484, 727928, 361015, -210851, -153217, 42217, -130510, -310418, -148965, -968840, -2384292, -2561956, -2914293]
20915b914293L44121K512287O05562k63662k68844M55773k20684M44249k17656
20906D76853J11913l7743j689431n00920K2517N76928j51785Q88900J51693K86547
20896A35472j40663o32082j72385O12536K75599Q25184N36218j90363j044867
20887B04649j499542p85736J188144N21111J914676M49637k19054J34290P21641
20878B629816j093365k175085Q85131J71161n39087q34783J39926M91022J249851
20869I24587R00967j423120q36025M84006Q48884O60876J324156k55688O68772
20860C297415J121056j130770j071971j631936l45184L16664m4686j448355N47002
20851c90765Q2040O1886k41352l82828p32525n14597N20964M83732K030210P62420
$$ y = [-2914293, -2570172, -57885, 547677, 284015, 15171, 470944, 250260, 694509, 476853, 588766, 551023, -1138408, -1639328, -1616811, -1039883, -1191668, -302768, -151075, 135472, -5191, -637273, -809658, -197122, 78477, 903661, 1439879, 1249516, 204649, -1294893, -2080629, -892485, -371374, 1543302, 1992939, 1773885, 1908175, 2629816, 1536451, -638634, 246497, 417658, -121429, -956212, -816286, -325264, 924587, 1825554, 402434, -433591, 50415, 899299, 1560175, 2884331, 2628643, 3297415, 4418471, 3287701, 2215730, 583794, 238610, 555274, 510588, -937767, -390765, -308725, -246839, -488191, -871019, -1603544, -2118141, -1597177, -1113445, 916765, 1679185]
20841A679185k041003r79470P62963O6120j6089N19082J15660R2953l0058o42247
20831d72904Q78618J617877r59042p89559j154357O89324l8123j03380J364532
20822A032986q37139j024074m30632p61246J072083J176653m02733k87434j45079
20813f06615j88819j07394K10183j153825j044259J583270L55467N75395M04183
20804B7586Q90835j296267r63595n24293p30479J383576J728830J043613j641197
20795h1391M24856j517642M21613J174436l02370M47445n14127P12854n63707
20786B01967o9920Q56426j031819P53191p22937l17674k86639k2847L16733q4015
20776d07534k08801l45607L48443K82450P26511j35773j98317o75677L06151O6901
$$ y = [1679185, -361818, -1341288, -578325, -512205, -528294, -9212, 106448, 199401, 169343, -472904, 405714, 2023591, 1064549, 274990, -879367, -190043, -228166, -331546, 1032986, 195847, -828227, -1258859, -2020105, -948022, 228631, -174102, -461536, -606615, -795434, -902828, -692645, -1846470, -2890729, -1307459, -951992, -376597, 27586, 918421, -377846, -1341441, -1865734, -2596213, -1212637, 516193, 1559806, -81391, 343465, -1174177, -752564, 421872, 119502, 566947, 52820, 765674, 201967, 132047, 988473, -43346, 709845, -13092, -330766, -617405, -640252, -323519, -407534, -616335, -961942, -613499, -331049, 395462, 259689, 61372, -614305, -308154, -241253]
20766b41253K002620Q97246j380834j580606n57183m79252j29582P71120J94246
20757e03478R01254P8921j018380o39498j052365O58784P85252j62140p12473
20748a664123K46637J166311J080932j06429p16044j18774l25298L16465O3868
20739e6455p99991o0661j66710J08337Q5676O47841K718398K40175L5264j689314
20729A062560j296687j765262m91162N78191J172186n05220q97298J604695J111127
20720E73130l19532J1277R11249N20773m65103j301830M821j5647j79363j73263
20710d33488P35949k89376P5993o76456m3739j223643l99905J072365R90751M25354
20700B33805q2686N77185p72668j719175n75205r7463N21632K14352K2281L69756
$$ y = [-241253, 1761367, 2658613, 1277779, -302827, -860010, -1339262, -1468844, -697724, -503478, 397776, 476697, -541683, -1181181, -2233546, -1574762, -789510, -951650, -1664123, -1417486, -251175, 829757, 723328, 7284, -111490, -436788, -120323, -56455, -856446, -917107, -1083817, -975480, -889804, -241963, 2476435, 2716610, 2751874, 1062560, -234127, -1999389, -2490551, -1912360, -740174, -1245394, -2142692, -537997, 573130, 253598, 264875, 1176124, 1696897, 1231794, -70036, -65215, -80862, -260225, -433488, 302461, 13085, 89078, -587378, -631117, -1854760, -2254665, -1182300, -191549, 233805, 151119, 728304, -44364, -1763539, -2338744, -2436207, -1914575, -1700223, -1677942, -1308186]
20690a308186O48552J694931M85843J57559p49409j779317M26617J187870m75138
20681B89322J896276J47407j278034j362163o68868k22731M24713O8872J65806
20672e39400J169095O05981p8790j540832j290027j49204J174407J39995m63511
20663i72286o5167P20889p3000l25134J96927J37564k4343j387721N18359J53753
20653a120159o70544P32382N39069O75936N06108Q8951p11381p72172j360253
20644b092063M09501P66375O75846k19537l86166j65504o81850j170022J02264
20635b761156Q20349J171846R19399n0760j347548O55258L39947Q32775K00455
20626G80565O14168j441964q69448N3331q51359N96078L96230P64648n56694J99118
$$ y = [-1308186, -659634, 1035297, 1521140, 1678699, 929290, -850027, -423410, 764460, 289322, 2185598, 2333005, 1054971, -307192, -976060, -1198791, -774078, -705206, -539400, 629695, 1235676, 1156886, -383946, -1673973, -1823177, -648770, -508775, -972286, -1037453, -316564, -389564, -714698, -517771, -380207, -404550, -1792271, -1273912, -1120159, -1790703, -1058321, -519252, 156684, 662792, 751743, 40362, -731810, -2092063, -1682562, -916187, -240341, -459878, -846044, -1011548, -1693398, -2863420, -2761156, -1940807, -768961, 150438, 99678, -1247870, -592612, -252665, 580110, 780565, 1394733, -47231, -916679, -863348, -1714707, -1118629, -722399, 42249, -514445, -315327]
20616c15327K058712k04064j001687r16904o54708J886227J28077m96559L62223
20607H45990j236351m15349N33783L40385m25845q38657m99930J897783n00873
20598b99064l91008K68597m69917R26221r8176q25511o43389n8343J073298O97352
20588A80060M45168m71897j000086K07970J991049R39844p12858j900375l84074
20579g05199r59711J081869J563621J85659k82718O69572j324675k19048J101691
20570A111061J062151l25729j646778p42238L66609P8595O60414L43736n6884
20561H50937P33178j002988K65408P07033m72331Q26797J27651m40602j260170
20552C34913J75582j700087j817584J353072N43485j30297M38355R12276j052674
$$ y = [-315327, 1743385, 1539321, 537634, -379270, -1033978, 852249, 980326, 483767, 845990, -390361, -805710, -271927, 68458, -357387, -1196044, -1695974, 201809, -299064, -690072, -421475, -891392, 34829, -63347, -888858, -1532247, -1590590, -517292, 180060, 625228, 153331, -846755, -638785, 1352264, 2292108, 1579250, -321125, -705199, -1664910, -583041, 980580, 1166239, 883521, 1553093, 228418, 9370, 1111061, 2173212, 1847483, 200705, -541533, -174924, -96329, 564085, 907821, 850937, 1584115, 581127, 846535, 1553568, 1081237, 1908034, 2035685, 1595083, 334913, 510495, -1189592, -3007176, -1654104, -1110619, -1240916, -802561, 109715, -942959]
20543i42959o63308K88599P96559J029J064477n17673j233827K49207Q12310M36994
20533B91408j28320r69772l09737O14840j83066k37901M11492n7327j268643N10612
20523a326414Q27382N59399j74893M81342O4281O2482K94395O20329n50372J04137
20513I62068J136867l21972k030743p32220L2702J012601J392413p41422J54113
20504H64407j38776q8981l4536J104411j22170P37733j767097k295461M68818
20495a271652J543231R92837l34607J021789p71303j152756L55651R06937j133972
20486A56155k225137p12830r25058M17727Q66917J074306R65541M99919L59494
20477D77034n46537j002141Q27054J424365r90423l51653j129259M9975n46294
$$ y = [-942959, -1606267, -1317668, -521109, -520080, 544397, 26724, -1207103, -957896, -145586, 291408, 163088, -806684, -1116421, -501581, -684647, -922548, -511056, -568383, -1837026, -1326414, -499032, 60367, -114526, 366816, 431097, 493579, 787974, 1408303, 857931, 962068, 2098935, 1776963, -253780, -986000, -953298, 59303, 1451716, 710294, 864407, 725631, 636650, 602114, 1706525, 1584355, 2322088, 554991, -1740470, -1271652, 271579, 1264416, 929809, 1951598, 1180295, 27539, 383190, 1290127, 156155, -2068982, -2781812, -3706870, -3289143, -2422226, -1347920, -382379, 117540, 477034, -69503, -1071644, -244590, 1179775, 189352, -162301, -1291560, -1241585, -1787879]
20468a787879P99891M22419r49289j65633l12826m41742J100261J088766J83071
20459f2961o86414r96484o18014k41008j027194R69353J071893J57355r34802
20450b368276O40913O26850Q79433M25240K76528m13726o13732J31068J86510
20441b29192k02697L46026J047885N16505J34273N84298r84993j172178k32426
20432a92499j741J016453N3059j299016n01518j045750l14372O93712k82107R6503
20422a777276J289161J556637Q1555p83927j250169M96391L81659q39827n06885
20413a352681J83978j57800L27908N57200N74785O00788K62036n56354l72731
20404F7129R07813R65679j187283j223821K74493K43337R1040m79401M81735p5003
$$ y = [-1787879, -987988, -565569, -1514858, -1680491, -1993317, -2435059, -1334798, -246032, -62961, -749375, -1745859, -2363873, -2604881, -3632075, -2662722, -1590829, -1433474, -2368276, -1727363, -1100513, -221080, 204160, 480688, 66962, -546770, -415702, -229192, -431889, -85863, 962022, 1478527, 1612800, 2197098, 1212105, 39927, -192499, -194240, 822213, 875272, -423744, -925262, -1971012, -2285384, -1591672, -1873779, -1777276, -488115, 1068522, 1150077, 366150, -884019, -387628, -5969, -845796, -1352681, -1168703, -1326503, -998595, -441395, 133390, 734178, 996214, 439860, 67129, 974942, 1940621, 753338, -470483, -195990, 47347, 138387, -341014, 140721, 65718]
20394F5718k37943m9974m34466J1135n05356p74302p97887k252374J057014J993475
20384a924960Q24219J140307M73577j74350k7666o49850l27474P87661R12852
20375A034316J93496j144810k53904K58405J500625l42895o73010j384963k71807
20366a084547l918p69795j6414J627121k6457j122128n3047N92476n4615j85981
20356a097305M40116m6403K28366p29723J239960p85677J38602K41184L94068
20347B3188K01468o76905m56082J325556R74713n01313j297805o4220J57238J54147
20337a60015O48511l21463M88891m68502j388335n278r54230K47873R57871l5367
20327i90044j248109P35474J801684n80454k25956L52252L84419K38891q79688
$$ y = [65718, -172225, -222199, -656665, -645530, -1150886, -1925188, -2723075, -4975449, -3918435, -1924960, -1100741, 39566, 513143, 338793, 311127, -338723, -666197, 121464, 1034316, 1227812, 83002, -170902, 87503, 1588128, 1245233, 572223, -812740, -1084547, -1088465, -1858260, -1874674, -247553, -274010, -1396138, -1449185, -856709, -911324, -1097305, -657189, -703592, -475226, -1204949, 35011, -750666, -612064, -370880, 23188, 224656, -452249, -908331, 417225, 1391938, 890625, -407180, -471400, -314162, -160015, 488496, 167033, 655924, 187422, -1200913, -1206191, -2160421, -1912548, -954677, -990044, -2238153, -1502679, 299005, -281449, -507405, -155153, 229266, 468157, -411531]
20318d11531p74997R63785J118732J31194o31407o62521j222441j242315J158675
20309a572826J540469P5010J015483n37300j668704P83307m93753m70597R17748
20300d11163P92968j807839k92506J986427l01902j082745L05370o42312n28272
20291a981974K77031J456626K071365J720147p12218l37250P26082J57471R25706
20282D302986K53267j260903q61728o78029l81333j063371p45946n44623j128035
20273b107715O40326R6243K60997J054919J254436k79637l40108N16200r392L25087
20263A411356J8473j633871j136318k26059L14831R15057K21885O7140J80436
20254A32930j035345n27520j57168J5690m70372q14604P45293O92936m8291L90109
$$ y = [-411531, -1186528, -222743, 895989, 1027183, 395776, -266745, -1489186, -2731501, -1572826, -32357, 42653, 1058136, 520836, -1147868, -364561, -858314, -1328911, -411163, 381805, -1426034, -1718540, 267887, -34015, -1116760, -811390, -1453702, -1981974, -1704943, -248317, 1823048, 3543195, 2830977, 2493727, 3219809, 3377280, 4302986, 4556253, 3295350, 2433622, 1755593, 1374260, 310889, -435057, -979680, -2107715, -1467389, -1371146, -1110149, -55230, 1199206, 919569, 579461, 1095661, 1086269, 1411356, 1429829, -204042, -1340360, -1566419, -1251588, -336531, -114646, -47506, 132930, -902415, -1429935, -1587103, -1571413, -2041785, -2856389, -2111096, -1418160, -1466451, -1076342]
20244a076342k7770l74784q38199L53382M84083J203647J67118j427853j12443
20235a649161J34416k81358M30364J591689N05062l73501q16472N43634N82389
20226F67062j483616Q61010J035661r19896l11927J24682K30874o63800o78237
20217a138187J29547L25586J72264O22420N09063j032806k2710q9760n8586Q63614
20207B80445k41495N7374J389227m50298k79734J032813L92976J6055n32028O3594
20197A728929q10982j280724J27541o67095o5102k5752K40186k78499L14523L34738
20187c82237Q64943N37838k29076j711277p37882J387084k63760O74652J012576
20178A152861j68743q58165m04135m1766M4889R70525M54167m11116O65253o73108
$$ y = [-1076342, -1104112, -1478896, -2317095, -1963713, -1479630, -275983, -108865, -1536718, -1649161, -1514745, -1796103, -1365739, 225950, 731012, 357511, -458961, 84673, 667062, -816554, 44456, 1080117, 160221, -151706, -27024, 203850, -459950, -1138187, -1008640, -683054, -510790, 111630, 620693, -412113, -434823, -524583, -583169, 280445, 38950, 96324, 1485551, 1035253, 755519, 1788332, 2181308, 2197363, 1665335, 1728929, 917947, -362777, -235236, -902331, -967433, -993185, -752999, -1031498, -716975, -382237, 482706, 1020544, 791468, -919809, -1657691, -270607, -534367, 140285, 1152861, 984118, 125953, -278182, -319948, -275059, 695466, 1149633, 738517, 1403770, 730662]
20168G30662M68676P69619k21001J273235n32365q55925r12667O226J2903j086129
20158c46766j219585O60060J690015J095216K65150q22564o65999J27380J105249
20149A888156L65432M02987Q72201k30206j417501o47726J130938P50127n73114
20140B541294p76086j882795o28264r91791o87358R76425J263384N92530K28332
20131F35671k64100j63312R74046L21753j86001Q15576o46575k212828M82172
20122b43598j9432j81518N62487j053250q98276j015302m75723O05712J135916
20113a582984J259764R90110J037761j010211j081506j584956r56813J815952
20105a112883J539266j362463o16709j14217J105860J106450j480863o28210O83086
$$ y = [730662, 1199338, 1968957, 1747956, 3021191, 2488826, 1632901, 720234, 726460, 739363, -346766, -1566351, -906291, 783724, 1878940, 2144090, 1321526, 655527, 782907, 1888156, 2253588, 2656575, 3528776, 3298570, 1881069, 1233343, 2364281, 3114408, 2541294, 1765208, -117587, -745851, -1737642, -2425000, -1448575, -185191, 407339, 635671, 371571, 208259, 1182305, 1504058, 1318057, 2133633, 1487058, -725770, -243598, -263030, -444548, 117939, -935311, -1833587, -2848889, -3324612, -2718900, -1582984, -323220, 666890, 1704651, 694440, -387066, -1972022, -2928835, -1112883, 426383, -936080, -1552789, -1667006, -561146, 545304, -935559, -1563769, -880683]
20096h80683R05856k2718j072249k61017R36839O89921l25252J883168J430542
20087C284407M42083q59112j693482p24847m24318o67015N40306O12281J36448
20078F46751r23594m23826N46743j575548P51120J14204J60932J474992o69627
20069A02147j224671J22966M01268J88101o20008j46326R90672R24787K33588
20060I72524P50063M97672L41689j874916m4611j331880j81272O80093M56924
20051B66286j771042J987551R62692j446433J73970J650948m366J36348n62588
20042A393366k93799O7722j323701j593033j42206N58566r0484q15686m96111
20033b735366M39898J160368J183401R42845q89755j789649M31748L76568l55726
$$ y = [-880683, 25173, 2455, -1069794, -1330811, -393972, 295949, -29303, 1853865, 3284407, 3726490, 2867378, 1173896, 449049, 24731, -642284, -101978, 510303, 646751, -276843, -700669, -153926, -1729474, -978354, -864150, -703218, 771774, 102147, -1122524, -999558, -598290, -410189, -1030197, -1176523, -185851, 738936, 972524, 1722587, 2220259, 2561948, 687032, 642421, -689459, -870731, -190638, 266286, -1504756, 482795, 1445487, -946, 173024, 1823972, 1819606, 1955954, 1393366, 1099567, 1167289, -156412, -1749445, -1891651, -1333085, -1423569, -2239255, -2735366, -2295468, -1135100, 48301, 991146, 101391, -1688258, -1256510, -879942, -1235668]
20024a235668J7325Q23510p38544r24244m13284k13666J222998N78130M17722
20015d65721N66715P82065m51635L4959j11970k9115j026887j300563R78966J786686
20005G63500J216963J719534M62868j706297j474051p29845k51678P43788j6360
19996G28422j23358o93076j120410J54584N47594O53557J091237r8465r01968
19987B38117K64752q91313k25631M08314p4524j304292K82862O25466J129127
19978D52878k68801p15148J67820J014436J110703p51903j987772m32354K83180
19969a126961O37808Q54208N42827J181794J431092Q930o06676l48073r12648
19960A662301r61155j64069j104591m55520P89151J127599O39558o07568q94655
$$ y = [-1235668, -1218343, -394833, -1133377, -2057621, -2470905, -2684571, -1461573, -883443, -465721, 100994, 883059, 431424, 466383, 354413, 325298, -701589, -2002152, -1023186, 763500, 1980463, 3699997, 4162865, 2456568, 982517, 252672, 994, 744782, 728422, 605064, -88012, -1208422, -1053838, -506244, 147313, 1238550, 1140085, 238117, 502869, -388444, -614075, -205761, -280285, -1584577, -1301715, -676249, 452878, 184077, -531071, -363251, 651185, 1761888, 1009985, -977787, -1410141, -1126961, -489153, 365055, 907882, 2089676, 3520768, 3529698, 2923022, 2574949, 1662301, 701146, 537077, -567514, -1023034, -233883, 893716, 1533274, 925706, 31051]
19951C1051Q43958J569790P50389j452750j916667j106554q18871N70822K75802
19942a253030K73414j686591m46181J080166J325158O39925k95158L76813J536409
19933A550925K88164l50126k218703k09610k10461j22529O17136R560L07396l76475
19923g14723o95056K7968p58338r87319l51099K09544Q02974J980577J728531
19914A243059l56877j107212j309092q01501J004774K71360n842N5571K2930J031873
19904D9043P67808m7796r03848k67203j358664O30811M1208k03190P0039Q28548
19894c93244J190915J98229r5843j241743K05179p3769k00205P16165p75579j507457
19884a977352Q04227P39808n94097J476453P24910q43680o41528J266523L38559
$$ y = [31051, 875009, 2444799, 3195188, 1742438, -174229, -1280783, -2099654, -1528832, -1253030, -979616, -2666207, -3112388, -2032222, -707064, -67139, -362297, 14516, 1550925, 1839089, 1488963, -729740, -939350, -1149811, -1272340, -655204, -645644, -338248, -714723, -1409779, -1381811, -2140149, -3127468, -3478567, -3269023, -2466049, -485472, 1243059, 886182, -221030, -1530122, -2331623, -1326849, -1055489, -1061331, -1005760, -982830, 49043, 816851, 769055, -134793, -401996, -1760660, -1129849, -1088641, -1291831, -1221792, -393244, 797671, 995900, 900057, -341686, -136507, -210276, -410481, 305684, -469895, -1977352, -1173125, -433317, -1027414, 449039, 1173949, 330269, -311259, 955264, 1293823]
19875A293823m95790n1412Q25584j14862n63471N29175j13046l35124j309347
19866c34470J258264k59084o2575l54475p66423N06327K91322K41035J751438
19857B271359J334744k223298j706082o85631M19482K026851J263387r79445J71514
19848A892881Q80435j008859j057562M14931j61433l87057j546019j302633N02200
19839a773116Q91359P77147P53647J598848m68745j001874j52988k018048j019789
19830b413559J073227j073869N65416j25058M57342J793675k53954j300895p76492
19821b054167M78635O0220O55740k00682R63991O27152J190388j57819j350841
19812B12617j969890K51841N23409q41392L01135K492923J057488j311718j107657
$$ y = [1293823, 798033, 746621, 1572205, 1457343, 893872, 1423047, 1310001, 974877, -334470, 923794, 664710, 602135, 247660, -518763, -12436, 278886, 519921, 2271359, 3606103, 1382805, -323277, -1008908, -589426, 1437425, 2700812, 1721367, 1892881, 2773316, 1764457, 706895, 1121826, 960393, 573336, -972683, -2275316, -1773116, -881757, -104610, 649037, 2247885, 1779140, 777266, 624278, -1393770, -2413559, -1340332, -2414201, -1848785, -1973843, -1516501, 277174, 23220, -1277675, -2054167, -1575532, -1515312, -859572, -1060254, -96263, 530889, 1721277, 1563458, 212617, -1757273, -1505432, -982023, -1823415, -1522280, 970643, 2028131, 716413, -391244]
19803c91244L33755n35122p9442p64488q32207R57138l18843Q83484L65705J227362
19793H46098Q62182L49020q54600l72270j043379j15650J23852N98095O16832
19784A010180L45262O65188j567335l71222N65503K24635j298481m97658K17248
19775g06680J318126J870923k87935l4886n53566m00506p2175p01853m17140R77478
19765I91786J201093n24939R1207P68779Q41202k03533l54368J170190q50242
19756C131175m43896J755276q79665j702739l15234l65541K59165P43559J27354
19747B309454j30324o41427j609801M79961J042843Q16992L51892j008690K80697
19738A891597j074588J445085j092488j808078M03331J48622j92655J185022J054350
$$ y = [-391244, -57489, -592611, -672053, -1436541, -2268748, -1311610, -1630453, -746969, -381264, 846098, 1708280, 2057300, 1202700, 830430, -212949, -328599, -204747, 393348, 1010180, 1355442, 2020630, 453295, 82073, 647576, 872211, -426270, -923928, -706680, 611446, 2482369, 2194434, 2159548, 1605982, 1205476, 1133301, 431448, 14308, 991786, 2192879, 1667940, 1759147, 2527926, 3369128, 3165595, 2811227, 3981417, 3131175, 2687279, 4442555, 3562890, 1860151, 1544917, 1179376, 1438541, 2182100, 2309454, 2179130, 1537703, -72098, 407863, 1450706, 2267698, 2619590, 1610900, 1891597, 817009, 2262094, 1169606, -638472, -235141, -86519, -279174, 905848, 1960198]
19729A960198O5716m059P65990K248p24722j466326M8667j00916N82152N91450
19719A720398j501235j316109K28825L60909j53602J22687M55090K22005k72782
19710a33814o76572j7089p47649q20389J335039K038474R69662K25395L3565m60868
19700A745754o12165J064560k12847o32443L82441K41566o93105N90463o45481
19691A228743r23397J366926p58933j805177j69201l85895L13486K484525J173414
19682B524491L45253q43655k022619r19433R0999J87265q2065J665974q39632
19673A06578o81649N16769P64302n29664j476658J496949R85940j098860j484759
19664a401052J493737K810819O26976n16793L20818k52840k81645o99751o28404
$$ y = [1960198, 2025914, 2021855, 2787845, 2790093, 2065371, 599045, 647712, 546796, 1128948, 1720398, 219163, -1096946, -868121, -507212, -660814, -538127, -83037, 138968, -133814, -810386, -827475, -1575124, -2395513, -1060474, 978000, 1947662, 2173057, 2206622, 1745754, 1133589, 2198149, 1985302, 1352859, 1735300, 1976866, 1283761, 1874224, 1228743, 305346, 1672272, 913339, -891838, -1061039, -1446934, -1133448, 1351077, 2524491, 2869744, 2026089, 3470, -915963, -824964, -637699, -719764, 946210, 106578, -575071, -58302, 706000, 176336, -1300322, 196627, 1182567, 83707, -1401052, 92685, 2903504, 3530480, 3013687, 3334505, 3081665, 2800020, 2100269, 1471865]
19655A471865K13163K0349l0127P50488P2431j141028L92722j012973q66469r45831
19645a075410L51931J304151k89618Q67206J210858J242935l47018j984081J21975
19636A402929k85780r10219N88679l52739K60433m69584k58943M69305j11722
19627C32359l48449n17952K58383k37223j272931k36265P44355R21261J461766
19618A105304R99708L56701r62586j245878j07068M20123N97743P10895r9322
19609A775620o18521r94844n26647P84931R17936o54014N56158J7447P89037o70847
19599A376256p82044p70279l13364R70982O39351j128433j96972K13132J466344
19590A474973j477736k236713o28810L85972R27359J785016p78049j01213M52742
$$ y = [1471865, 1685028, 1705377, 1675250, 2425738, 2498169, 1357141, 1749863, 736890, -129579, -1075410, -723479, 580672, 291054, 1158260, 2369118, 3612053, 3265035, 1280954, 1402929, 1117149, 206930, 795609, 442870, 703303, 233719, -25224, 444081, 332359, -16090, -534042, -275659, -512882, -1785813, -2022078, -1277723, -356462, 1105304, 2105012, 2461713, 1499127, 253249, 146181, 566304, 1164047, 1874942, 1775620, 1157099, 162255, -364392, 420539, 1338475, 684461, 1240619, 1258066, 2047103, 1376256, 594212, -176067, -489431, 481551, 1120902, -7531, -204503, 8629, 1474973, -2763, -2239476, -2868286, -2482314, -1554955, 230061, -547988, -649201, -196459]
19581a96459r34994q02897R50370p43563M77231J823796N66808k22855j142659
19572b25222L17410n44381n35719M87977P62948m39642r25533n20459J823801
19563B01180J096623k1814N27078M97425j194611j17417J102049k41774n0237
19554A798502Q76981j42984n51508p31871K64008l49310M29070J018264J01485
19545B712637n51655m73020q72471M8575J772694J738262L01055j328114j577292
19536A770671j229374J248038J541661p68738j969712L63047j48639p19312J022254
19527A109896l6571K3116J074071r29098L09606l3406R19195O15873j386004k84981
19517A381697M60783Q19844J756641n40679j304367m86336j549952r12194Q45087
$$ y = [-196459, -1131453, -1934350, -983980, -1727543, -1250312, 573484, 1140292, 917437, -225222, 92188, -452193, -987912, -499935, 263013, -176629, -1102162, -1622621, 201180, 1297803, 1275989, 1803067, 2300492, 1105881, 988464, 2090513, 1848739, 1798502, 2675483, 2532499, 1980991, 1249120, 1513128, 1163818, 1592888, 2611152, 2712637, 2160982, 1687962, 815491, 864066, 2636760, 4375022, 4676077, 3347963, 1770671, 541297, 1789335, 3330996, 2562258, 592546, 955593, 806954, 87642, 1109896, 1073325, 1096441, 2170512, 1241414, 1551020, 1517614, 2436809, 3052682, 1666678, 1381697, 1842480, 2662324, 4418965, 3878286, 2573919, 2087583, 537631, -374563, 470524]
19508D70524P38472N18104j21281O93582K263558p21263k73697L29215N44514
19499D441728J00676p24534k74645n77051k007989o11889J051984K79794Q06890
19490B484964J208636j47795j009370j687429j9725M01120N67736P02399p80558
19481A719978j111910j61066K35293j70871M46108q82744k5606O22889J033763
19472A705834j442291k76338J576742Q04834p41436k82919n39106M79700n14350
19463G70670j72925L160588Q34470m3445j533377m78902n47296l89643j105598
19454D94542J226384J203125O14863p01907O30781p97262p1247p42160J4903Q23391
19444B695413q933Q18425P52202j592077j27843j588283J045602J069124p78113
$$ y = [470524, 1208996, 1727100, 1605819, 2299401, 4562959, 3841696, 3567999, 3897214, 4441728, 4542404, 3817870, 3543225, 2966174, 958185, 346296, 1398280, 1678074, 2484964, 3693600, 3545805, 2536435, 849006, 829281, 1230401, 1798137, 2500536, 1719978, 608068, 447002, 682295, 511424, 957532, 74788, 49182, 672071, 1705834, 263543, -12795, 1563947, 2368781, 1627345, 1344426, 805320, 1285020, 770670, 597745, 3758333, 4592803, 4549358, 3015981, 2537079, 1989783, 1600140, 494542, 1720926, 2924051, 3538914, 2837007, 3467788, 2670526, 2599279, 1857119, 1872022, 2695413, 2686480, 3504905, 4257107, 2665030, 2537187, 948904, 1994506, 3063630, 2285517]
19435B285517K88931K39978j36231O266q1625j485489m06600p11719N13169O46453
19425A158650l32268L1997L10180L90044J6737l2810K61979L85151J145426P11652
19415D046738j604092k26871R41815j55486j491922j005394l00889k59955l26041
19406c82097L58141j1360L14613k27993J279267R52160l01655N49464J081174
19397C611714M61297q19965Q82433K6850J703790L46024j554636L91583L56982
19388E406072j213139j286029Q59962K177128K09524o34796L14391k30736p39842
19379D862535M41273P54488o31831R06572p4891j198308r86580M22709K047103
19370F543070P48215l1865J071389M08276j043663j907415m20300P06343O26136
$$ y = [2285517, 2574448, 2814426, 2678195, 2684461, 2602836, 1117347, 710747, -972, 512197, 1158650, 826382, 858379, 1168559, 1558603, 1575340, 1542530, 1804509, 2189660, 3335086, 4046738, 2442646, 2215775, 3157590, 3002104, 1510182, 504788, 203899, -56056, -382097, -23956, -35316, 279297, 51304, 1330571, 2282731, 1981076, 2530540, 3611714, 4073011, 3253046, 4135479, 4162329, 5866119, 6212143, 4657507, 5049090, 5406072, 4192933, 2906904, 3766866, 5943994, 6153518, 5518722, 5833113, 5602377, 4862535, 5303808, 6058296, 5426465, 6333037, 6258146, 5059838, 4073258, 4495967, 6543070, 7291285, 7259420, 8330809, 8739085, 7695422, 5788007, 5367707, 6074050, 6700186]
19361F700186l1720r01696j255940O40831j091847N10790J495547O48835j340906
19352E374080o41984j86795M45939M96291N32951R4179j310148l32912m02603
19343D068998l15458L28883N15165M24881q04218j692007j67843Q76242N98967
19334C833610N4993k48969M73396O45323j398730j612292p17142n1320J83759
19325A162628J254429R8607M43387R06027L32878p34960r49728r66082j325929
19316B21257m21281R47189j59408L1250M17700O76383K086833L81732l46893J612499
19306E447261K33678L55551k86441M2125l84367q59242j318825l61541J048756
19297C916955o62135j17997q39670p31208J101148J924657L13900J41102o52804
$$ y = [6700186, 6668466, 5766770, 4510830, 5151661, 4059814, 4570604, 6066151, 6714986, 5374080, 4732096, 4545301, 4991240, 5487531, 6020482, 6114661, 4804513, 4471601, 4068998, 3753540, 4082423, 4597588, 5022469, 4218251, 2526244, 2358401, 3234643, 3833610, 3888603, 3639634, 4113030, 4758353, 3359623, 1747331, 1030189, 978869, 1162628, 2417057, 2515664, 2959051, 3865078, 4197956, 3462996, 2513268, 1547186, 221257, -200024, 747165, 587757, 619007, 1036707, 1713090, 3799923, 4181655, 3834762, 5447261, 5680939, 6036490, 5750049, 5792174, 5407807, 4548565, 3229740, 2868199, 3916955, 3254820, 3136823, 2297153, 1565945, 2667093, 4591750, 4905650, 5046752, 4393948]
19288D393948q98028l94483J73042Q49014P96924L00085O1385N65780n87038J45685
19278E406314M67013j71181K76715J041566J475509J256247J219323R15285m48933
19269A1437858r37348M78039O49211R78971J515219J463308J318217J250684J061595
19260A9215754K659699J988165Q71685K386714J958727L632851K557399K684672
19252C7955666L933753M615816N139211O349426O287440O643481O033672O011960
19244H2970425Q367479Q032446P693863J0388837J1646327J2430926J4150945
19237A55681248J3469732J0559169R903568R350248Q471418Q961274Q964680R338893
19229B34700230R749495R248089O319979L944021J542695J711013J14507j360859
$$ y = [4393948, 3495920, 3101437, 3274479, 4123493, 4920417, 5220502, 5281887, 5847667, 5260629, 5406314, 5873327, 5702146, 5978861, 7020427, 8495936, 9752183, 10971506, 11886791, 11437858, 10500510, 10978549, 11627760, 12606731, 14121950, 15585258, 16903475, 18154159, 19215754, 21875453, 23863618, 24735303, 27122017, 29080744, 32713595, 35270994, 37955666, 41889419, 46505235, 51644446, 57993872, 64281312, 70924793, 76958465, 82970425, 91337904, 99370350, 107064213, 117453050, 129099377, 141530303, 155681248, 169150980, 179710149, 189613717, 198963965, 207435383, 216396657, 225361337, 234700230, 244449725, 253697814, 260017793, 263961814, 265504509, 267215522, 267330029, 265969170]
19221B65969170m502850p662720r440870q433708q781085p570822n876493n523054
19213B08177568o348854o452114n503023p718847r493630j1264083j0813595r897090
19205A40686332j0734122q830215r171864p135217o212885o510654n612500l687124
19197H2791751l873044m454055k253824j867452k418694k668497m088696m593586
19189E6573903k323098J47928j546445j392545k287279l487083j418167M39589
19181D4706803r68878j69672q35556j791082p12279j95003m80656r38130p12223
19172C7903324o38478j909914n488o01120M4381n95405r11171j486481j212564
19163C0587084P30934k11943J4911P75986L58442m01903p57115N75428N63039
$$ y = [265969170, 261466320, 253803600, 244362730, 235929022, 227147937, 219577115, 213700622, 208177568, 201828714, 195376600, 189873577, 182154730, 172661100, 161397017, 150583422, 140686332, 129952210, 121121995, 111950131, 104814914, 98602029, 92091375, 86478875, 82791751, 78918707, 74464652, 72210828, 70343376, 67924682, 65256185, 61167489, 56573903, 54250805, 54398733, 52852288, 51459743, 49172464, 45685381, 44267214, 44706803, 43737925, 43568253, 42732697, 40941615, 40229336, 40034333, 39553677, 38615547, 37903324, 37264846, 35354932, 35349444, 34748324, 34792705, 34197300, 33286129, 31799648, 30587084, 31318018, 31106075, 31120986, 31896972, 32255414, 31853511, 31096396, 31671824, 32234863]
19154C2234863j764768n89874l91943r8698O17358K218828R58122m0176p26011
19145C2417701o68972J0415N09263J399708j93049m72012j307610j420378N68229
19136C0843295R72326K007182L51803k56547l25839j381401M85478O41019m47247
19127C2890069O10575p20175q95318m78415M9861q17941n7032J876474q51543
19118C1606555q84824o07470K78947M27496N5682o16584j91394n01545O30485
19109C0197348j678928j664783O95574N69364L75024j101632j875737N18402J64819
19100B6199451K93080O34703j349807m67753l57474q58065o7344Q18611K33247
19091B5078649j092647M42812q14691j220392j043790j106185P76371N50666j264041
$$ y = [32234863, 30470095, 29880221, 29488278, 29389580, 30006938, 32225766, 33183888, 33143712, 32417701, 31748729, 31759144, 32268407, 33668115, 33475066, 33003054, 31695444, 30275066, 30843295, 31815621, 33822803, 34174606, 33918059, 33592220, 32210819, 32696297, 33337316, 32890069, 33500644, 32780469, 31885151, 31406736, 31456597, 30638656, 30581624, 32458098, 31606555, 30721731, 30114261, 30393208, 30820704, 30876386, 30259802, 30068408, 29566863, 30197348, 28518420, 26853637, 27549211, 28118575, 28493599, 27391967, 25516230, 26034632, 26199451, 26492531, 27127234, 25777427, 25309674, 24952200, 24094135, 24026791, 24845402, 25078649, 23986002, 24428814, 23614123, 22393731, 21349941, 20243756, 21020127, 21570793, 20306752]
19082B0306752k079829J584847M16289m83988k10480p28674j741764r72655j682365
19073A4408133l63443Q55981j41579j73855q40965k02512R1734J89342J43309
19064A3966145M37970m91064K66640m93198p86180K33182M11765L71519p73521
19055A3143258J103681J652444J219076p25244j140622n76652o37280O6591J039619
19046A5144871J206766L56061O23661J585708j01662o08201J209300R85494l68426
19037B0033572j605024r10139L55015j496568M57538N32160J552137J568284M08603
19028B0895578J175170M63681l58988O07435J949566K114657J212995J289419
19020B9349513J819757N06388N04985L06222J167455K097220L036583K686246
$$ y = [20306752, 18226923, 19811770, 20228059, 19744071, 19533591, 18804917, 17063153, 16090498, 14408133, 14044690, 14900671, 14759092, 14585237, 13744272, 13541760, 13633494, 13822836, 13966145, 14404115, 13913051, 14179691, 13686493, 12900313, 13133495, 13545260, 13916779, 13143258, 14246939, 15899383, 17118459, 16393215, 15252593, 14675941, 14038661, 14105252, 15144871, 16351637, 16707698, 17331359, 18917067, 18815405, 18207204, 19416504, 20401998, 20033572, 18428548, 17518409, 17873424, 16376856, 16834394, 17366554, 18918691, 20486975, 20895578, 22070748, 22534429, 22175441, 22782876, 24732442, 26847099, 28060094, 29349513, 31169270, 31675658, 32180643, 32486865, 33654320, 35751540, 38788123, 41474369]
19012D1474369L667538M219407M402683L402732L248788K385287L354938P454228
19004G3609970O730807O017728O448930N351132M309363K543645P81578J04693
18996A05897846J108896M69579J988099K810135L202303M187951L028007J616862
18988A24309678K642858J084555j921230k510199l219493m660099m169722m921807
18980A06634541m126377r76825Q5858J182677L555108L727018L578502J309409
18972A14969911l00511j409983j220262L13798j47269N26913O1335k36810K580210
18963A15137332M606904M866938O519181N585255K816460q81741j12754K307021
18955A40844596K720654J806899l54474j075639L24246J10247J040178K619282
$$ y = [41474369, 45141907, 49361314, 53763997, 57166729, 60415517, 62800804, 66155742, 73609970, 80340777, 86358505, 92807435, 98158567, 102467930, 105011575, 105793153, 105897846, 107006742, 107476321, 109464420, 112274555, 115476858, 119664809, 122692816, 124309678, 126952536, 128037091, 126115861, 123605662, 120386169, 115726070, 111556348, 106634541, 102508164, 101531339, 101617197, 102799874, 106354982, 110082000, 113660502, 114969911, 114669400, 113259417, 112039155, 112352953, 112205684, 112732597, 112793932, 112557122, 115137332, 119744236, 124611174, 131130355, 136715610, 139532070, 138650329, 138537575, 140844596, 143565250, 145372149, 145017675, 143942036, 144266282, 144376529, 145416707, 148035989]
18947A48035989K176808O96234j047613k783235l731648m535354o464838m705248
18939A27641095m624979k528630o91868r80194k315837l211924m390553n163255
18931A03733855n597536m290619n152731o365470o832322n302248l138710j667122
18923F5387097q2292j208533l339381l015266j305481l60529j017607k069828
18915E2988180k812119r55378J72399r3491l50676L65825q83960j614062j15791
18906D6700927Q4764M90931n71879j827396k47606j532720P3350O37950j109024
18897D2699297m46736K87535j246220k736621j565930o2334J240160o33867l86501
18888C7148783l13193j719453q52645p22155J223j844419j098126j072342O57902
$$ y = [148035989, 150212797, 150909031, 149861418, 147078183, 143346535, 138811181, 132346343, 127641095, 123016116, 120487486, 119795618, 118815424, 116499587, 113287663, 108897110, 103733855, 98136319, 93845700, 88692969, 82327499, 75495177, 70192929, 67054219, 65387097, 65304805, 64096272, 60756891, 57741625, 56436144, 56075615, 55058008, 52988180, 50176061, 49220683, 49393082, 49299591, 48948915, 49314740, 48430780, 46816718, 46700927, 46785691, 47276622, 46704743, 44877347, 44629741, 43097021, 43170371, 43808321, 42699297, 42252561, 42540096, 41293876, 38557255, 36991325, 36928991, 38169151, 37535284, 37148783, 36835590, 35116137, 34263492, 33541337, 33542560, 31698141, 30600015, 29527673, 30185575]
18879C0185575Q53924N04741o8001n30184m57152J35446J157482o16710m88387
18870C0676734J019302M67659k40260r01918j244613M13560K33320Q40198O4701
18861C1328683L02638l93095k042626j436360K96543q44626r38387K83361L52212
18852B6908343j364811r83346k77833N66247J108426q28349j143591J371276r21512
18843B4434850k360944j877919n76731k29828O60012J196914l04107L69573o87665
18834B0624155J55481J15379O37217J90156P9639l27762m82400j390505j240793
18825A8360567J31542K03296O56604J22086q02467n44547r29147j676841j011341
18816A4509752M80341r52354r03578J083639L86653M5867J065233m75159k65399
$$ y = [30185575, 31039499, 31544240, 31476239, 30946055, 30488903, 30624349, 31781831, 31165121, 30676734, 31696036, 32163695, 31923435, 31021517, 29776904, 30190464, 30423784, 31263982, 31328683, 31631321, 31238226, 29195600, 27759240, 28055783, 27211157, 26272770, 26556131, 26908343, 25543532, 24560186, 24282353, 24848600, 25957026, 25128677, 23985086, 25356362, 24434850, 22073906, 20195987, 19619256, 19389428, 20049440, 21246354, 20942247, 21311820, 20624155, 20779636, 20895015, 21532232, 21722388, 21802027, 21474265, 20991865, 19601360, 18360567, 18492109, 18695405, 19352009, 19474095, 18671628, 18127081, 17197934, 15521093, 14509752, 14990093, 14037739, 13134161, 14217800, 14604453, 14650320, 15715553, 15240394, 14974995]
18807A4974995o09142j227890q52039L11830M84735J159298J35316j669190q2757
18798A2625156J210383q45530l27974k01715j682785P5165Q27905J506432p0420
18789A3116617q0605p89828L2104m87725M26086J07950r72813j715768k2882R57044
18779A0570180q87781l13907L01457J162483J108303p2063L6106p70077N07889
18770A1642590p86402M20458l8498O1933j65448q18114j283086j087907q62221
18761G083305J406026L62890n33148q96350j547700k37905J815473P37953J86439
18752H376983N03904o58125j228008j229214J17094K15848K01625R28755j440526
18743E788336j578563J92173L75985R28998N79784j86281j193354Q4710Q38327
$$ y = [14974995, 14365853, 13137963, 12285924, 12597754, 13082489, 14241787, 14377103, 12707913, 12625156, 13835539, 12990009, 12662035, 12460320, 10777535, 10852700, 11680605, 13187037, 13116617, 13036012, 12246184, 12278288, 11790563, 12216649, 12324599, 11351786, 9636018, 9613136, 10570180, 9682399, 9368492, 9669949, 10832432, 11940735, 11868672, 11904778, 11134701, 11642590, 10856188, 11276646, 11238148, 11300081, 11134633, 10316519, 9033433, 7945526, 7083305, 8489331, 8852221, 8319073, 7422723, 5875023, 5637118, 7452591, 8190544, 8376983, 8880887, 8222762, 6994754, 5765540, 5882634, 6098482, 6300107, 7228862, 5788336, 4209773, 4401946, 4777931, 5706929, 6286713, 6100432, 4907078, 4991788, 5830115]
18734E830115R980M53151M31631Q9564j395903o36026o35573J064924m68934O6526
18724D809455R10433r13861O0928J934769J055941q23755r93507n52606j001465
18715D486332O17479L2027q02716k13055P14637Q43746O41118o35437j73423L40464
18705E851172o20860j343555k012638J502590M68888R72801J602011J017030l10504
18696G126935p20227j928902j196956O2156l757J2767K308072j16383j375264
18687D168441Q65423O48732p02904p61765l7544q9521l12831m66654j069434j376248
18677H65695q01560N74055K358023J812028O38507J53668j048775j409440M00925
18668C543126L33542J046760K65264j546631p91303L39753M52607M63384K7264
$$ y = [5830115, 5840095, 6293246, 6724877, 6814441, 5418538, 4782512, 4146939, 5211863, 4742929, 4809455, 5719888, 4806027, 4866955, 6801724, 7857665, 7033910, 6040403, 5487797, 4486332, 5103811, 5135838, 4333122, 4120067, 4834704, 5678450, 6319568, 5684131, 5510708, 5851172, 5230312, 3886757, 1874119, 3376709, 3845597, 4818398, 6420409, 7437439, 7126935, 6406708, 4477806, 3280850, 3343006, 3339249, 3352016, 5660088, 5543705, 4168441, 5033864, 5682596, 4979692, 4217927, 4180383, 4090862, 3778031, 3311377, 2241943, 865695, 64135, 638190, 2996213, 4808241, 5446748, 5600416, 4551641, 3142201, 3543126, 3876668, 4923428, 5188692, 3642061, 2850758, 3190511, 3643118, 4106502, 4133766]
18659D133766j053521j40609K351945J38354k27846J065493M86072j91643m52228
18650F109783K80501R8654n91137Q68294j895041q53632J188775P56540j003447
18641D959290j409877J686658J026839J90145j425961p02796j037503J864665
18633E151460K072556Q27925n64690j666151j188890n41066L17762j291465o43073
18624B474368J235565o0675p18769L3593n70736Q32369J895543M64610J79604
18615E765472o08026o84793n40641n08364m20251o967l4032Q16007J255156M90006
18605E523567K16138j523649r70552p85082K50740J052630j19648N48968l86961
18596C806151o21915O10002l914m60597N44267n34399q09791L92092m84500L23178
$$ y = [4133766, 3080245, 2939636, 5291581, 5429935, 5202089, 6267582, 6753654, 6562011, 6109783, 6390284, 6488938, 5897801, 6766095, 4871054, 4017422, 5206197, 5962737, 4959290, 3549413, 5236071, 6262910, 6453055, 5027094, 4324298, 3286795, 5151460, 7224016, 8051941, 7487251, 5821100, 4632210, 4091144, 4408906, 3117441, 2474368, 3709933, 3649258, 2930489, 2964082, 2393346, 3225715, 5121258, 5585868, 5765472, 5157446, 4472653, 3932012, 3423648, 3003397, 2996430, 2962398, 3778405, 5033561, 5523567, 5739705, 4216056, 3245504, 2460422, 2711162, 3763792, 3644144, 4193112, 3806151, 3184236, 3794238, 3790324, 3329727, 3873994, 3339595, 2529804, 2921896, 2437396, 2760574]
18586B760574J503005l35274j027486J985469K17977O27046q52385j823656j031847
18577B023423p74115P63305N31691k23634J384687M25740n34340k69442p2806
18568C254509L00769M57683J004236m50916j561803j08781m12654j183527N83761
18559A883277O52830R11564J68638J36690R81128L25258j008541J59239K47706
18550D457789k05870M45413o84916r16479J834100R93404K41577q24168q87013
18541D453837j302431L76129Q55420q43595J14351n29945l59068K09176P87255
18532C761129J58556k81371Q21864K35244p95248M83578j065896k66679J962763
18523E013940J025744P9470l34007j060498j660971q32264k8047n4461O82827
$$ y = [2760574, 4263579, 3928305, 2900819, 4886288, 5104265, 5731311, 4878926, 3055270, 2023423, 1249308, 2012613, 2544304, 2320670, 3705357, 4131097, 3596757, 3327315, 3254509, 3555278, 4012961, 5017197, 4566281, 3004478, 2895697, 2483043, 1299516, 1883277, 2536107, 3447671, 3616309, 3752999, 4734127, 5059385, 4050844, 4210083, 4457789, 4251919, 4697332, 4012416, 3095937, 4930037, 5923441, 6165018, 5340850, 4453837, 3151406, 3527535, 4382955, 3539360, 3653711, 3123766, 2764698, 2973874, 3761129, 3919685, 3638314, 4460178, 4695422, 3900174, 4383752, 3317856, 3051177, 5013940, 6039684, 6119154, 5785147, 4724649, 3063678, 2231414, 2203367, 2148906, 2831733]
18514B831733J243293k28998K47847L42700J580290K12515j942118j598117N76741
18505C265886N79961L46666j732826k8925L98352O90727N67556m01264M63976
18496D150109k88468K84919J042562J210317j448398L00673J439014J920332Q56549
18487I467609p21917o28995N35984L8777j264352m94132K1247N31378J119231
18478H604830k75830l55787m15865R28382M57740K10591N35317Q73313K622953
18469A3185644m66692r77568j001153M38759J263115J171970n52507j214819N61084
18460A2407833K254188j066178r65791j022350J44432R26750P62526j35389P6640
18451A3382661L7029l8258j466335l59492O10708R06977j023548j601972M27594
$$ y = [2831733, 4075026, 3846028, 4093875, 4436575, 6016865, 6229380, 4287262, 2689145, 3265886, 3845847, 4192513, 2459687, 2430762, 2829114, 3519841, 4087397, 3686133, 4150109, 3861641, 4146560, 5189122, 6399439, 4951041, 5251714, 6690728, 8611060, 9467609, 8745692, 8116697, 8652681, 8691458, 7427106, 6932974, 6954221, 7485599, 8604830, 8329000, 7973213, 7557348, 8485730, 8943470, 9154061, 9689378, 10562691, 13185644, 12718952, 11741384, 10740231, 11178990, 12442105, 13614075, 13061568, 11846749, 12407833, 14662021, 13595843, 12630052, 11607702, 11752134, 12678884, 13441410, 13306021, 13382661, 13419690, 13381432, 11915097, 11555605, 12166313, 13073290, 12049742, 10447770, 10875364]
18442A0875364m9937j34417J623423P01266j488502k214538j214823O65155J207341
18433I970332l41403j096354k12923J134498K23085j073699m37373M62362P13946
18424I342471L80032l19782n64212O27816j78792O72917J348033n91870j09117
18415A0607496L79608o97518j501221j614452n96205Q94069Q19807r46328j130855
18406F214401J098902J079324K47183P13539r16829J42493J117269J687480O05093
18397A1988855q91183j392110r34238L64685M84388J523435J169314N41727L37940
18388A3192813J474527k28858l45347q28060J389998K375626J021347K883091
18380B0935137k01518j60084J716463J539811J035553J355695J597669J065428
$$ y = [10875364, 10825427, 10691010, 12314433, 13015699, 11527197, 9312659, 8097836, 8762991, 9970332, 9628929, 8532575, 8319652, 9454150, 9677235, 8603536, 8166163, 8628525, 9342471, 9722503, 9402721, 8838509, 9466325, 9287533, 9960450, 11308483, 10716613, 10607496, 10987104, 10289586, 8788365, 7173913, 6577708, 7471777, 8291584, 7345256, 6214401, 7313303, 8392627, 8639810, 9353349, 8436520, 8579013, 9696282, 11383762, 11988855, 11097672, 9705562, 8771324, 9136009, 9620397, 11143832, 12313146, 12854873, 13192813, 14667340, 14438482, 14093135, 13265075, 14655073, 17030699, 18052046, 20935137, 20733619, 20573535, 22289998, 23829809, 24865362, 26221057, 27818726, 28884154]
18372B8884154R18365J802523K031028J384081P89301J071197J632521K035231
18364D0548401K784577L074713J711277N99841k61383P01675L87031R7307N55254
18355E0198693K6727K314767K924522L369299L655779K628763K112657L046860
18347G0278067L724104L560345J553920M196711N332291N969687P733803Q616613
18339A10965541R023087J0962738J2099921J4191806J3099821J3139154J3121104
18332A96603172J4003597J6195681K0341234K2052385K1692297K0949075J9694112
18325C31531553J7605371J4891168J3439275P727976L492096K717972M891668
18318C96297079O936904N060616Q22828m781819o569525p147653j2349519j6180129
$$ y = [28884154, 29802519, 31605042, 33636070, 35020151, 35809452, 36880649, 38513170, 40548401, 43332978, 46407691, 48118968, 48718809, 48457426, 49159101, 49546132, 49643439, 50198693, 50225420, 52540187, 55464709, 58834008, 62489787, 65118550, 67231207, 70278067, 74002171, 77562516, 79116436, 83313147, 88645438, 94615125, 102348928, 110965541, 119988628, 130951366, 143051287, 157243093, 170342914, 183482068, 196603172, 210606769, 226802450, 247143684, 269196069, 290888366, 311837441, 331531553, 349136924, 364028092, 377467367, 385195343, 388687439, 391405411, 396297079, 403233983, 408294599, 409117427, 404335608, 397766083, 390618430, 378268911, 362088782]
18310C62088782k0004833j8961745j7922030j6594583j5346398j1264390q273102
18303B53721701m067051j143485p44828j063053n843339q283113q436085o976332
18295B17164415n382905m479518n064950m303311k010396n87549R22525K266533
18287A98524844P93273J368140K721976M344375N092390M681021L576963J751978
18279B22854960O04131J057794m7668m143319p853326r918622j1102556j1063845
18271A80387549j2298634j0358287q435734o674211q780697o849721m469336l825448
18263A18695481l351058k026168k523181k634639k947532k481544l940362l065540
18255I5725457j979256O48568j05311j089151q19010j213489j055536Q6340n51831
$$ y = [362088782, 342083949, 323122204, 305200174, 288605591, 273259193, 261994803, 253721701, 249654650, 248511165, 247766337, 246703284, 240859945, 232576832, 224140747, 217164415, 211781510, 207301992, 202237042, 197933731, 195923335, 195335786, 196258311, 198524844, 199318117, 200686257, 203408233, 207752608, 212844998, 217526019, 221102982, 222854960, 223459091, 224516885, 224469217, 220325898, 212472572, 202553950, 191451394, 180387549, 168088915, 157730628, 149294894, 142620683, 133839986, 126990265, 122520929, 118695481, 115344423, 113318255, 110795074, 108160435, 105212903, 102731359, 98790997, 95725457, 93746201, 94394769, 94289458, 93200307, 92381297, 91167808, 90112272, 90198612, 89646781]
18246H9646781j283714j873904q78773k0544k64726j574047N26165O99825J148060
18237H6125123O67214p02755J67260J910027J061811l64636Q78760Q04251J994390
18228I2541445K402651l07254j458202j724686k268059l772845k006999j705652
18220H1700399k331452l087999j581101K55711L32431m8118j221547k223922p30085
18211G1064317j36652q68511p45301K16827j706640q07829J77690r51245k5695
18202F6216961J249142j27756m03425j622273j656545j599233j881845j372599
18194E8802427p60358j752681j420281j116621K81347N3574n56870p02487j25951
18185E2702099n29074j437211j016698l65974q08988j687833j180955p98504J5392
$$ y = [89646781, 88363067, 86489163, 85610390, 85589846, 85325120, 83751073, 84277238, 84977063, 86125123, 86792337, 86089582, 86256842, 88166869, 89228680, 88864044, 89742804, 90547055, 92541445, 94944096, 94636842, 93178640, 91453954, 89185895, 85413050, 83406051, 81700399, 79368947, 76280948, 74699847, 74955558, 75287989, 75239871, 74018324, 71794402, 71064317, 70927665, 70059154, 69313853, 69530680, 67824040, 67016211, 67193901, 66242656, 66216961, 67466103, 67338347, 66934922, 65312649, 63656104, 62056871, 60175026, 58802427, 58042069, 56289388, 54869107, 53752486, 54033833, 54087407, 53530537, 52828050, 52702099, 52173025, 50735814, 49719116, 49353142, 48544154, 46856321, 45675366, 44876862, 44892254]
18176D4892254N2117O4684j210485j660753j72665J239351J103234m94739J26925
18167D3939923q5209j965900r32995j5154N57755J99590q60026L0488j42799L4383
18157D0760056l76388j554835Q21487p52890q50558J381995J217220l6967J55820
18148D0764940K52123J076679J424192J071711J116115K076870J454029K245762
18140E1482421L898410L262601J750621L073169M019375L220133M922494M406963
18132H0036187M783233O333794P556217J0063719J0128179J1636620J1253832
18125A41791781J2219660J5831822J9927539K4979065K6800436K7053677K6162318
18118B94766298K0606639J2746634P738604J3126629J8952895K9946933M1517563
$$ y = [44892254, 44944371, 45009055, 43798570, 42137817, 41965152, 43204503, 44307737, 43812998, 43939923, 43854714, 41888814, 40955819, 40940665, 41498420, 41698010, 40837984, 40868472, 40725673, 40760056, 40383668, 38828833, 39650320, 38897430, 38046872, 39428867, 40646087, 40609120, 40764940, 41017063, 42093742, 43517934, 44589645, 45705760, 47782630, 49236659, 51482421, 55380831, 58643432, 60394053, 63467222, 67486597, 70706730, 75629224, 80036187, 84819420, 91153214, 98709431, 108773150, 118901329, 130537949, 141791781, 154011441, 169843263, 189770802, 214749867, 241550303, 268603980, 294766298, 315372937, 328119571, 335858175, 348984804, 367937699, 397884632, 439402195]
18111D39402195M4309378K7246156J040088j4811534k3297746l1057990l9018840
18104D03811707m1715242m0132316l7538130l2790007k4505209j6271748j2429197
18097A98429858r533731p889073p982575q021825p954983q283413o817845n642119
18089A36304294m512090k732060q71574m83088j779351j810431j213505n23895
18081A22378300o46154J031110K541385L622963M152926L316600M146602N595562
18073A46139294P804483R195326J0037755J1301211J1961583J0742809J1636371
18066B18818832J2585283J4858384J7556284J8995655J7484617J3533464J3333269
18059C27165788J1532097J1186378J4102285J1941387L946652l673802p384622
$$ y = [439402195, 483711573, 510957729, 511997817, 497186283, 473888537, 442830547, 403811707, 362096465, 321964149, 284426019, 251636012, 227130803, 210859055, 198429858, 188896127, 181007054, 173024479, 165002654, 157047671, 148764258, 141946413, 136304294, 131792204, 129060144, 128188570, 127705482, 125926131, 124115700, 122902195, 122378300, 121732146, 122763256, 125304641, 128927604, 133080530, 136397130, 140543732, 146139294, 153943777, 163139103, 173176858, 184478069, 196439652, 207182461, 218818832, 231404115, 246262499, 263818783, 282814438, 300299055, 313832519, 327165788, 338697885, 349884263, 363986548, 375927935, 379874587, 376200785, 368816163]
18052C68816163r285634j0202804j2807636j4262606j8866881k0306253k1335283
18045B61749066k0114029j8084318j3442728j2974223j2216279j1112495q480321
18038A65324673p000497p875064p015863n190662n425469o191315m525781l944789
18030A18155233m490571m722615l401226k235703p99865k274639l118955k572858
18022I4538801j699313q42478k098876r95519p84080k221370l135147j296075
18014H1465943q00398j350542j626565j941585j659568r9654n1098J44983m65382
18005G3616134j437824j32408r94432j488292K31213r53236k04275m41464M79323
17996F8674739p1334n61979j116255n39348j334809k344297k442948J03631l73023
$$ y = [368816163, 359530529, 349327725, 336520089, 322257483, 303390602, 283084349, 261749066, 241635037, 223550719, 210107991, 197133768, 184917489, 173804994, 165324673, 158324176, 150449112, 143433249, 138242587, 132817118, 126625803, 122100022, 118155233, 113664662, 108942047, 105540821, 103305118, 102505253, 100230614, 97111659, 94538801, 92839488, 91997010, 89898134, 88902615, 88118535, 85897165, 82762018, 81465943, 80665545, 79315003, 77688438, 75746853, 74087285, 73987631, 73936533, 74081516, 73616134, 72178310, 72045902, 71051470, 69563178, 69794391, 68841155, 68636880, 68195416, 68674739, 68603405, 68041426, 66925171, 66385823, 65051014, 62706717, 60263769, 60367400, 59994377]
17987E9994377K24124n19161j826409n07625q73833k29498j296152j073235q86092
17978E3006496l38827q38834r65769k02793J520598O4408q86021j013498k0311
17969E0325449p92935j017288k27238m06882l65970p886l52882p62343m15039
17960D5976986P606m40726O0030J272747l0663j051884m17362r11428r54804n65908
17950D2944594j008894K49064J80904p39729o2216J54771M16746n53176j54989
17941D1427075m36264r76840q84229o23941l23150j54746l10603l38524L99153
17932C7777931j393576k328014j207575j720137j444824k75202q53690K67746
17924B8822659P41189M17872Q35180m79525k392901j401995j831145l14342P03625
$$ y = [59994377, 60218501, 59699340, 57872931, 57365306, 56491473, 56261975, 54965823, 53892588, 53006496, 52667669, 51828835, 50863066, 50660273, 52180871, 52245279, 51359258, 50345760, 50325449, 49532514, 48515226, 48287988, 47881106, 47515136, 47507250, 47154368, 46392025, 45976986, 45984592, 45543866, 45603896, 46876643, 46845980, 45794096, 45376734, 44465306, 43510502, 42944594, 41935700, 42184764, 42365668, 41625939, 41563723, 41718494, 42135240, 41582064, 41427075, 40990811, 40013971, 39129742, 38505801, 38182651, 38027905, 37717302, 37378778, 37777931, 36384355, 34056341, 32848766, 31128629, 29683805, 29408603, 28554913, 28822659, 29563848, 29981720, 30816900, 30337375, 27944474, 26542479, 24711334, 24396992, 25100617]
17915B5100617O64467k01330m04155n49819j180538K81809O62154p80414k197960
17906B1394831j452002r78039J268515m9910m67295k05054j012332o13422l94298
17897A7490994q21058Q32951n78474j075000L51480J126452l82660j515169q8843
17888A5340673j354495p95507k15143K04083j836364l56674o99900J234796n25084
17879A0996385j070383J99368L72112R51068J54478m71527m92478o33328J248173
17870A1253868L42183j327353j02148L56901j646013K92532J028131K92540j70674
17861A0319967Q945l237n78859M20370r30315P70455Q20718j461823j677109m85515
17851G203597P47107l21628o185p590j636845k23411M32783q61691j828268N19122
$$ y = [25100617, 25765084, 25563754, 25159599, 24609780, 23429242, 23711051, 24373205, 23592791, 21394831, 19942829, 18964790, 20233305, 20183395, 19716100, 19511046, 18498714, 17885292, 17490994, 16669936, 17502887, 16924413, 15849413, 16200893, 17327345, 16944685, 15429516, 15340673, 13986178, 13190671, 12975528, 13179611, 11343247, 10986573, 10286673, 11521469, 10996385, 9926002, 10125370, 10497482, 11448550, 11603028, 11131501, 10639023, 10005695, 11253868, 11596051, 10268698, 10166550, 10523451, 8877438, 9169970, 10198101, 10490641, 10319967, 10328912, 10325675, 9746816, 10167186, 9236871, 10007326, 10828044, 9366221, 7689112, 7203597, 7950704, 7629076, 7622891, 7615301, 5978456, 5755045, 6187828, 5326137, 3497869, 4016991]
17841D016991J667657P69874O99423o72870l12505l84851l9342J274343J50488
17832G169208q66993p83027m50196m79052j048711n58672j76565J557973Q99798
17823E263763j093114L01405J97446j0657R67026J47767p43347N83195Q15979
17814F429463m38199J69348j1806o43616o62703o63235q08427m15143R54980J88892
17804D099554R59011Q1243j626082j011949N1301N68793O42895J132123N3266
17795D950155n54658P43271R06618j073258j190687R23947K4356N54207O50046
17786E933997j053824k90475J214890O30860O28354p66926l05802m4730j214287
17777D732057j197121K51850Q54364J011506J901868l33587k97750P62218R1954
$$ y = [4016991, 5684648, 6454522, 7153945, 6481075, 6168570, 5783719, 5744377, 7018720, 7169208, 6302215, 5519188, 5068992, 4589940, 3541229, 2982557, 2805992, 4363965, 5263763, 4170649, 4472054, 4669500, 4658843, 5625869, 5773636, 5030289, 5613484, 6429463, 5991264, 6160612, 6148806, 5505190, 4842487, 4179252, 3370825, 2955682, 3910662, 4099554, 5058565, 5139808, 3513726, 2501777, 2553078, 3121871, 3764766, 4896889, 4950155, 4395497, 5138768, 6045386, 4972128, 3781441, 4705388, 4729744, 5283951, 5933997, 4880173, 4589698, 5804588, 6435448, 7063802, 6296876, 5991074, 5946344, 4732057, 3534936, 3786786, 4641150, 5652656, 7554524, 7220937, 6923187, 7685405, 7777359]
17768G777359L23868O86204l48233j109386J08117j110286j725132m89363j464576
17759B648572P23046l74274p18433J81261J42746q04748Q83805J097747m17123
17750C362599p90814J950689J104004j299819m14137k46528n1081L24113J185222
17741E124248K92390q99891j006318j41085l92814J75648p37482J20430j30444
17732B404682K82180Q20870J274887J974092J097849j191330N71031j00339j398273
17723E735649j936141j712999q9107R8870L99191O02426K02476J022453J71062
17714D493880N52411m70171k367749j173877j25487q2133l45817N43122L85102
17705A409281J19560J105034P81105m76606p1600L87539k588306o71083J382035
$$ y = [7777359, 8101227, 8787431, 8439198, 7329812, 7437929, 6327643, 4602511, 4113148, 2648572, 3371618, 2997344, 2278911, 2460172, 2602918, 1798170, 2681975, 3779722, 3362599, 2571785, 4522474, 5626478, 4326659, 3912522, 3665994, 3614913, 3939026, 5124248, 5416638, 4516747, 3510429, 3369344, 2976530, 3152178, 2414696, 2535126, 2404682, 2686862, 3507732, 4782619, 6756711, 7854560, 6663230, 7234261, 7133922, 5735649, 3799508, 2086509, 1997402, 2096272, 2495463, 3097889, 3300365, 4322818, 4493880, 5046291, 4576120, 2208371, 1034494, 909007, 826874, 481057, 1024179, 1409281, 1528841, 2633875, 3414980, 2938374, 2866774, 3254313, 666007, -5076, 1376959]
17696A376959M2679j7950q93982j931464J881215J371800o3602J810383j86825
17687C389213p01511m67098M26960o73006o79005J93709K00620o99878n716k71697
17677G12591n53855j60042P29973K29367N6082N4277J104949k92013K25855K313416
17667D420600l48788l76869l09745n92949j051056q96241m99139m32319O52559
17658E66053M68141j23945q64621R7413P03722N62445P79947L70491j069089o3908
17648A426649o16085R48706k7318l47879M29115r41382J669024l01112j03897
17639B135821O56681j67675j371464j11817q9505o26373N05382K351367L83847
17630C666264k236194l57660j330176J76309J590149K57999O87238j04175r22832
$$ y = [1376959, 1419638, 1401688, 507706, -1423758, 457457, 1829257, 1765655, 3576038, 3389213, 2687702, 2220604, 2647564, 1974558, 1295553, 1489262, 1689882, 990004, 984288, 712591, 158736, -1306, 728667, 958034, 1014116, 1068393, 2173342, 1881329, 2107184, 4420600, 4071812, 3694943, 3385198, 2792249, 1741193, 844952, 345813, -86506, 566053, 1034194, 910249, 45628, 143041, 846763, 1409208, 2189155, 2559646, 1490557, 1426649, 810564, 1759270, 1731952, 1384073, 1813188, 871806, 2540830, 2239718, 2135821, 2792502, 2624827, 1253363, 1141546, 1052041, 425668, 931050, 3282417, 3666264, 1430070, 1072410, -257766, -81457, 1508692, 1766691, 2453929, 2349754, 1426922]
17621A426922q16651N82305J106442P49716Q56635q20076k53859L17485o26346
17612B522573r4355m16719j091713P52204o54062j05262n24941o26653K92125
17603E3197J124467j19212m36067k58208O27925O27231R60178J57254q01067o42444
17593A293254k44289M99512n55593N0266l80842l58939J71940k26929J099937
17584A348317P49649j50763M1233Q07772K24728o93560L54566l80071j007191
17575A294680l64876R50410l00950j160513p98574l2304N03746J54166J19634
17566C65419j549395Q57331M38275o4329l2480M17031Q79528M57980n3480O50180
17556B366060n24045l11469q07679j08888m74079P07643Q40137L7657j463997
$$ y = [1426922, 610271, 1192576, 2299018, 3048734, 3905369, 3085293, 2831434, 3148919, 2522573, 2428218, 2011499, 919786, 1671990, 1017928, 912666, 387725, -238928, 53197, 1177664, 1058452, 622385, 364177, 992102, 1619333, 2579511, 2736765, 1935698, 1293254, 1048965, 1548477, 992884, 1043150, 662308, 303369, 475309, 248380, 1348317, 2097966, 1947203, 1988436, 2796208, 3020936, 2327376, 2681942, 2301871, 1294680, 929804, 1880214, 1579264, 418751, -379823, -412127, 91619, 245785, 365419, -1183976, -326645, 111630, 47301, 14821, 431852, 1311380, 1769360, 1715880, 2366060, 1842015, 1530546, 722867, 613979, 139900, 847543, 1687680, 1725337, 261340]
17547B61340o32986Q54534k97686P44214Q05941N47638M21911p4130m13452M63825
17537B681149j683331j064225m23292j34691q71931M94372J1171q46068L41764
17528a495082J345577J670681K18061O3870P29849J000533r52019K44935J16185
17519B942590j374097k484415l22925J217315P79378M64227j243524P42277J741350
17510B462176j053468p84105j66844J57558m09162p6508L78745K046969J210863
17501C766224J50516j054456p23325J052j382531n32128P86825K62545n26289
17492G48433j53003J6123l95606p05459q98714M93697J458129K23804l65966l42672
17482G8766J879022j173852J79499P69341Q44708j213149j845545j167383K53491
$$ y = [261340, -371646, 482888, 185202, 929416, 1735357, 2282995, 2704906, 2630776, 2217324, 2681149, 997818, -66407, -489699, -624390, -1496321, -1001949, -990778, -1836846, -1495082, -149505, 1521176, 1739237, 1803107, 2532956, 3533489, 2581470, 2826405, 2942590, 1568493, -915922, -1238847, -21532, 757846, 1222073, -21451, 720826, 2462176, 1408708, 624603, 457759, 615317, 206155, 129647, 508392, 2555361, 3766224, 3916740, 2862284, 2138959, 2140011, 757480, 225352, 1012177, 1274722, 748433, 595430, 611553, 215947, -489512, -1388226, -894529, 563600, 787404, 421438, 78766, 1957788, 783936, 963435, 1732776, 2577484, 1364335, -481210, -1648593, -1395102]
17473a395102R52594N56457L78451o15772p09688K16635k12386L22676O83878
17464A77743K93018L92731P41230M31723K42580J113505j33808j661542j770966
17455a73786J815085P71524Q48159L13765J540632R41170j176578n2633M25876
17446E253214J20651N1241o04411j30517j179932r23066L37040R15374r6721N5547
17436C798420K4013j97152l06815j028131j058193J063883K00973j93722Q44486
17427C147762m30055k54471l84231m38454M23218p67532J58799J2615p74948j642386
17417i49683j932188J43689o1580K83228o4718K71919J007588J63411j39716M28805
17407h49245o22769q10430J469356J640045n94068m18591J06794K19953j044202
$$ y = [-1395102, -442508, 113949, 492400, -123372, -833060, -616425, -828811, -506135, 177743, 470761, 863492, 1604722, 2036445, 2279025, 3392530, 3258722, 1597180, -173786, 1641299, 2412823, 3260982, 3574747, 5115379, 6056549, 4879971, 4827338, 5253214, 5373865, 5425106, 4820695, 4690178, 3510246, 2587180, 2924220, 3839594, 3742873, 3798420, 3822433, 3625281, 3318466, 2290335, 1232142, 2296025, 2496998, 2303276, 3147762, 2717707, 2463236, 2079005, 1640551, 2063769, 1296237, 1455036, 1467651, 692703, -949683, -2881871, -2738182, -2799762, -2516534, -2581252, -2309333, -1301745, -1138334, -1278050, -849245, -1472014, -2282444, -813088, 826957, 232889, -185702, -78908, 141045, -903157]
17398i03157j223316M54850J159402J96500J017952J008908J79471j95686l54213
17389A340711p26052L79337P59434M65472O25609j678782j109406Q97665j44453
17380H09535j81520r75535n93717K75143n57445l86874Q52231J398717m5498k29055
17370C65982p25558l23152J176776m81069p84249l21876K71890J46684K66219
17361d08353p49712l19907M34687q6802K88043N73041Q36916J95496o89826M13236
17351D86819n99189J323959R66756r3529p16056j327548o40828j433444P67409
17342a265651M32230j153895J37579N46691P78119J021025M62043k28483L92546
17333A122204o95289O94566j120953p19364L12936m22120k278606j57762J569389
$$ y = [-903157, -2126473, -1671623, -512221, -315721, 702231, 1711139, 1890610, 1694924, 1340711, 614659, 993996, 1753430, 2218902, 2844511, 1165729, 56323, 953988, 809535, 628015, -347520, -941237, -666094, -1223539, -1610413, -758182, 640535, 595037, 365982, -359576, -682728, 494048, 12979, -771270, -1093146, -821256, -674572, -408353, -1158065, -1477972, -1043285, -1130087, -842044, -269003, 567913, 763409, 73583, 486819, -112370, 1211589, 2178345, 2084816, 1368760, 41212, -599616, -2033060, -1265651, -833421, -1987316, -1849737, -1303046, -524927, 496098, 958141, 729658, 1122204, 426915, 1121481, 528, -718836, -405900, -828020, -3106626, -3264388, -1694999]
17324a694999K079262L87764q95935r53425J278205P67081J43078J05995R81325
17315B198351j778227p57609l1550n05757J336376K35673R89851K99863j366247
17306F20724n79038r021o84613n32777R79036J133042j18795j324886j581350
17297b097678K37925J147879P16898R57588Q70584l81735p44406o60203M55744
17288E02596P68876J190326K5518l85041j443995J06039q08580M08560J254354
17279A618653L28572R80981J294200j324229k214569r35842r38341k67979J596933
17270A38379k98102n0089J12452M09341m32888J011082R65802K0124R17382k65940
17260B527543n57499j026801p50531J232014J056073j655513q87016J209564J461941
$$ y = [-1694999, 384263, 772027, -123908, -1077333, 200872, 967953, 1111031, 1217026, 2198351, 420124, -337485, -369035, -874792, 461584, 697257, 1687108, 1986971, 620724, 41686, 32665, -651948, -1184725, -205689, 927353, 808558, -516328, -2097678, -1859753, -711874, 5024, 962612, 1833196, 1451461, 707055, 46852, 502596, 1271472, 2461798, 2487316, 2102275, 658280, 764319, -44261, 364299, 1618653, 1947225, 2928206, 4222406, 2898177, 683608, -252234, -1190575, -1458554, 138379, -159723, -209812, -97360, 311981, -120907, 890175, 1855977, 1876101, 2793483, 2527543, 1970044, 943243, 192712, 1424726, 2480799, 825286, -61730, 1147834, 2609775]
17251B609775M62338o39541K12452L82066q59591j615468j949536j689611K195288
17242h91828J332565l90608n96953L00554J58211l082l15229k13705P07071j79407
17232i2411j42758L02674j382445j218269J161174M33743j43787K50069M89585
17223c42425L76807J679557O21308q25860j408069j509794O81437K206609r84593
17214D94977k84969J012289K08865o53288q16559j53802o52627M81399L38367
17205b5348J915044n55008j201984N01354j093610p54167L55276K072564p36260
17196D77861r71127K56927O52322J10416k26287j793899k14891J896655N80435
17187G68412p60664N37510k45460j226623P7238n95712O69214j87534r5436m96652
$$ y = [2609775, 3072113, 2432572, 2645024, 3027090, 2167499, 552031, -1397505, -3087116, -891828, 440737, 50129, -546824, -246270, -88059, -91141, -406370, -620075, 86996, -92411, -235169, 67505, -1314940, -2533209, -1372035, -938292, -1082079, -832010, -342425, 34382, 1713939, 2335247, 1509387, 101318, -1408476, -727039, 1479570, 494977, 210008, 1222297, 1431162, 777874, -38685, -192487, -845114, -363715, -25348, 1889696, 1334688, 132704, 634058, -459552, -1213719, -858443, 1214121, 477861, -493266, -236339, 415983, 526399, 300112, -1493787, -1708678, 187977, 768412, 7748, 545258, 299798, -926825, -849587, -1445299, -776085, -963619, -1059055, -1555707]
17177a555707Q40233J839695m23661j367154l12007p23161Q83j864k66455O09412
17167a359786n60857r32131M32318J121988L67414l79912p2332K205r55185o09796
17157b946074J335116O15555l75013M36902J436660j100302j836498M84211p18911
17148b668354L83841M01761O83712R12291P93310K3790m18184k59459l20223l43653
17138h11168O60277J22814l79090Q20519K74129m30053J47160l52228L09588J33104
17128D95052Q8338l71130L66387r0606r10537K936L42304J540363O34354n60328
17118A537133j043898j847287R81432M17671k65607K43668M41609J79294j020984
17109c76969j812360p88963O73253J236204p55310q60477M43856K347575P77450
$$ y = [-1555707, -715474, 1124221, 700560, -666594, -978601, -1701762, -1700879, -1702743, -1969198, -1359786, -1920643, -2852774, -2420456, -1298468, -931054, -1310966, -1383298, -1381093, -2336278, -2946074, -1610958, -995403, -1370416, -933514, 503146, -597156, -2433654, -1949443, -2668354, -2284513, -1882752, -1199040, -286749, 506561, 530351, 112167, -147292, -467515, -811168, -150891, -28077, -407167, 413352, 687481, 257428, 404588, 52360, 361948, 495052, 583390, 212260, 578647, 488041, -422496, -419560, -77256, 1463107, 2097461, 1537133, 493235, -1354052, -372620, 45051, -220556, 23112, 464721, 644015, -376969, -2189329, -2978292, -2305039, -1068835, -1824145, -2684622, -2240766, 106809, 884259]
17100H84259r42564n65585J47638o56994r9552J318091J727036n7553l82844o18731
17090G53201p70608J150907N77407l89756R9259J17615q70672J438772j30095
17081A976030j667704n7873o7634o98559M57799L31237K9769r75552o50063O82125
17071f40425n7482L85764m8719m89158l00270j23194q06677J14749m9804m13969
17061b429185R93029K811761M46734n79324p40754J544671O59289j859478j346126
17052d99383l12839N41083L8117q66659n99321K60894q3561j169102L62088J018696
17042a309987l51636Q03029J033852m05136q30778K38582L22683P14959j95987
17033A9581M17837l41725J51314n77729j562440J292783N23910j392295j128704
$$ y = [884259, -58305, -623890, -476252, -1133246, -1232798, 85293, 1812329, 1754776, 1371932, 753201, -17407, 1133500, 1710907, 1321151, 1420410, 1538025, 667353, 2106125, 1976030, 308326, 250453, 182819, -515740, -57941, 273296, 303065, -672487, -1322550, -640425, -697907, -312143, -360862, -850020, -1150290, -1273484, -2080161, -1965412, -2015216, -2429185, -1436156, 1375605, 1822339, 1243015, 502261, 2046932, 2706221, 846743, -499383, -812222, -271139, -233022, -1099681, -1699002, -1438108, -1521669, -2690771, -2328683, -1309987, -1661623, -858594, 175258, -229878, -1060656, -822074, -499391, 215568, 19581, 437418, 95693, 247007, -330722, -1893162, -600379, -76469, -1468764, -2597468]
17024b597468J35174K10638k5912Q85015R89705N83427j55203k01657m27380J469847
17014H66186P1118j348033l57638j173604l89412N80333Q60907J777510o66006
17005B21361p05818k11633J217974n9035r63721P91078Q6319M60313Q01323j05954
16995A532207m51243j610360O80605K059230p16362j282858n83615J27124r61832
16986a207104l07828j53817K763975J840544J92718j393891r02237P62425q00996
16977G93789L15740k79386j403913j608189q48556O69855p51636N31740K309728
16968b70828J180272N6359M90743m47738j142418L87399J304326k59682n64402
16959G34031o02278k12251j753465J2951N68231K54901o40462N4887J754407L10122
$$ y = [-2597468, -2462294, -2251656, -2277568, -1392553, -402848, 180579, 25376, -176281, -603661, 866186, 937304, -410729, -768367, -1941971, -2331383, -1751050, -890143, 887367, 221361, -484457, -696090, 521884, 462849, -500872, 290206, 376525, 836838, 1638161, 1532207, 1080964, -529396, 151209, 2210439, 1494077, 211219, -372396, -245272, -1207104, -1514932, -1668749, 1095226, 2935770, 3128488, 1734597, 832360, 1594785, 793789, 1109529, 830143, -573770, -2181959, -3030515, -2360660, -3112296, -2580556, -270828, 909444, 965803, 1456546, 1008808, -133610, 253789, 1558115, 1298433, 734031, 131753, -80498, -1833963, -1821012, -1252781, -997880, -1638342, -1583455, 170952, 481074]
16949D81074j540671j119987r18288O68069L017235L67785q02633J391792M37269
16940A981645j429304n47720N22982O29563k88662j053569j80591k91133m89031
16931a145820J165216K24450R89627j07233j67723k61279m97018J658406J207329
16922C065955j57219j302698p69935k312998N64607J225616J019374n9124j038273
16913B35305j198002j64741J310399k1114m69687q6588l21636R0500K14798K86460
16903a24306J075460L25172J377948M87125M77625j79747k64840r72700r44552
16894A257185O18828P3793r83009j840000M37881N72291J93998m39837m17779
16885e26649j040584m40062N91354M36599J072214J837390O34642j472194o23960
$$ y = [481074, -1059597, -2179584, -3097872, -2429803, 587432, 955217, 152584, 1544376, 1981645, 552341, 4621, 527603, 1157166, 868504, -185065, -365656, -656789, -1145820, 19396, 243846, 1233473, 1126240, 958517, 697238, 200220, 1858626, 3065955, 2908736, 1606038, 836103, -1476895, -912288, 313328, 1332702, 1273578, 235305, -962697, -1127438, 182961, 161847, -307840, -394428, -716064, -625564, -410766, -124306, 951154, 1276326, 2654274, 3141399, 3619024, 3439277, 3174437, 2201737, 1257185, 1876013, 1949806, 966797, -873203, -435322, 136969, 330967, -108870, -526649, -1567233, -2007295, -1415941, -979342, 92872, 1930262, 2564904, 1092710, 468750]
16876D68750M4594p53488L69425L34868j287341J039215O49239r61753j495358
16867a591849P22828J886810N44572q61393K98831P32838J14044p31413n97673
16858E17595k248246J082469J057959p09509j490599l65535J62325L65463O98603
16849i29475Q97550J499360N62758N77653m89208m75717r11267j240625p47993
16840a256964j89397j821l86123o42450Q13204O83199J111620k7481o97635j516979
16830b110827M20010R40849j8322r32048l06229l8878P25826J51782J98821R56590
16820a2426q47136k25787J068269j219242q05782m20518J169270j35820r60530
16811b389702k29156J088214J889251J022306j182118N94761J943473p67334l43952
$$ y = [468750, 513344, -240144, 129281, 464149, -823192, 216023, 865262, -96491, -1591849, -869021, 1017789, 1562361, 700968, 999799, 1732637, 1846681, 1115268, 517595, -1730651, -648182, 409777, -299732, -1790331, -2155866, -1993541, -1628078, -929475, -31925, 1467435, 2030193, 2607846, 2118638, 1642921, 731654, -508971, -1256964, -1446361, -1448182, -1834305, -2476755, -1663551, -980352, 131268, 103787, -593848, -2110827, -1690817, -749968, -768290, -1700338, -2006567, -2045445, -1319619, -1167837, -969016, -12426, -859562, -1085349, -17080, -1236322, -2042104, -2462622, -1293352, -1429172, -2389702, -2618858, -1530644, 358607, 1380913, 198795, 793556, 2737029, 1969695, 1625743]
16802A625743P46600Q71485M94430n14357j469240j55277J29746q60042j170611
16793c01523o05437K54403j453327l35662M91747J134424J653910j134221q37529
16784a133215j62893P78666J197065R76368n74422R95336N03020j224843j012024
16775C43058L83189m43740K64467M11344l39460m50198j13746n18911O33519J32728
16765C02250k5002j924113n38904J751412M05235N2264J47602j046116J166694
16756B91322l96323j07889K203397j000779j527600j307745P60404N599M79345
16747f00269J199578N36621r80585M77814P48410l21522o39573n25534j60776
16738b65836n16970j345447n38098j264027J219850P10868N46472J026581j75655
$$ y = [1625743, 2372343, 3243828, 3738258, 3223901, 1754661, 1599384, 1729130, 869088, -301523, -906960, -652557, -2105884, -2441546, -1949799, -815375, 838535, -295686, -1133215, -1296108, -517442, 679623, 1655991, 1081569, 2076905, 2579925, 1355082, 343058, 726247, 282507, 546974, 958318, 618858, 168660, 54914, -463997, 169522, 302250, 277248, -1646865, -2185769, -434357, -29122, 23142, 170744, -875372, 291322, -105001, -212890, 1990507, 989728, -537872, -1845617, -1085213, -1079614, -600269, 599309, 1135930, 155345, 633159, 1381569, 1060047, 420474, -105060, -265836, -782806, -2128253, -2666351, -3930378, -2710528, -1999660, -1453188, -426607, -602262]
16729f02262K0402m59389o21473K04593K84023N44137J360456P18560j527400
16720g8353j09977J607760l2037k230808o37545J545507l81410M8609l73486j090013
16710a731753M53909L24275j55312q90028O21090J46524N38919J005083o64895
16701c52188P40778l59869L49023n89352P95443k18797Q68745j43665K3970m88436
16691F25652N4020j231792r8905L79707N16474j250166j986656K7842J294815
16682a669009J642911Q23159K0874J680515j437652r25104K38300l30488j345104
16673a301598n59819j9049N68866r65991j70085r47370Q31261J568966N23935
16664d70884M50282o16443r24575k98921J763398J787687j6305M4470q29190q30390
$$ y = [-602262, -581860, -1041249, -1662722, -1458129, -1174106, -629969, 730487, 1449047, -78353, -188330, 1419430, 1387393, -843415, -1480960, 64547, -316863, -268254, -641740, -1731753, -1277844, -953569, -1108881, -1998909, -1377819, -1231295, -692376, 312707, -352188, 388590, 28721, 377744, -211608, 583835, 365038, 1233783, 1090118, 1114088, 625652, 679672, -552120, -651025, -271318, 245156, -1005010, -2991666, -2963824, -1669009, -26098, 797061, 817935, 2498450, 1060798, 135694, 373994, 43506, -1301598, -1861417, -1880466, -1311600, -2277591, -2447676, -3395046, -2563785, -994819, -470884, -20602, -637045, -1561620, -1860541, -97143, 1690544, 1674239, 1718709, 889519, 59129]
16654E9129j354750l34138J806176r89177j125299K60997J29840k6636N86141
16645i87717J164875n2597q15233j042489l95033q34553J31895J714715M50053
16636f66084l31939J65434p27695P95440L29939o77142o78339J211600O96135
16627A17349j6068q0081j142285O47978n77996k47686o65506Q20633P47331P74526
16617C78195l76508q48748l18897J263520L23654o3487K8737K025053K07834k160623
16607D58730m83573K57229J007046o57233q49179j612742j294710J252581J253434
16598f68417N22131M72393L35900j286715Q48314q9535J066941n14943J18951
16589H05020K00861l89220o50265r06815Q08092n98716r6386j96997P41701j060468
$$ y = [59129, -1295621, -1629759, 176417, -812760, -1938059, -1677062, -1547222, -1573858, -987717, 177158, 124561, -690672, -1733161, -2128194, -2962747, -2830852, -1116137, -666084, -998023, -832589, -1560284, -764844, -434905, -1112047, -1790386, -578786, 117349, 101281, 21200, -1121085, -473107, -1051103, -1298789, -1964295, -1143662, -396331, 378195, 1687, -847061, -1165958, 97562, 421216, 357729, 386466, 2411519, 2619353, 458730, -24843, 232386, 1239432, 582199, -266980, -1879722, -3174432, -1921851, -668417, -146286, 326107, 662007, -624708, 223606, 134071, 1201012, 686069, 805020, 1005881, 616661, -33604, -940419, -132327, -731043, -827429, -1024426, -282725, -1343193]
16579a343193k09856J234391J016447J073343n86342j649167j093546K44512j0165
16570a323576L10906K83089p13292l78397O11237K83223K99760K39386n92108
16561i79772O00981P25567j089341j505211J042332K36740j8234J307284q49995
16552e29649m77061P45864P55545p75526M37671L07060j62913J58476p38533L85697
16542A06631J032940J51827K14744n93940o63364m20672r1893l47184k85404J056765
16532A60450q6919o56303O31339O2302P97485J040818m08866n39880k48679N81032
16522A332779m49003m20011p60738n03712k02272J025515N24924j061864j029465
16513a543847K76686o75229o0662n8245o08397J280792J30332k88522k58579m36270
$$ y = [-1343193, -1553049, -318658, 697789, 1771132, 1184790, -464377, -1557923, -1313411, -1323576, -1012670, -729581, -1442873, -1821270, -1210033, -926810, -627050, -387664, -979772, -378791, 346776, -742565, -2247776, -1205444, -968704, -986938, 320346, -529649, -1006710, -260846, 494699, -280827, 156844, 463904, 300991, 459467, -279066, 106631, 1139571, 1291398, 1506142, 912202, 248838, -171834, -263727, -610911, -896315, 160450, 73531, -582772, 48567, 110869, 908354, 1949172, 1540306, 1000426, 751747, 1332779, 883776, 463765, -296973, -800685, -1002957, 22558, 547482, -514382, -1543847, -1267161, -1942390, -2003052, -2061297, -2669694, -1388902, -1258570, -1547092, -1805671, -2241941]
16503b241941o47580k74126J351054l2656M92196q19738J084990J460705J54800
16494E27704K18056l5238r24336q0498k52919m64599N60100j35431R92903K337965
16484B743707j083103q92360n83355j195406j01282m98432N14953J636172J03700
16475F44594m93826j369606m6489O79864R67196J3971q18064o42361J296467o7614
16465A64132N07804R04991m72174p08341J58825j200542j061655J049981o25528
16456a282507J271993P50862j391410M07841j80606N10886O4070J61938Q32158
16447A145225J893402l52325l90596j497390j549372j037391Q65091P57144L18420
16438A52208O15188j063282m16784J046609j328763j725175L38713L06348o27295
$$ y = [-2241941, -2889521, -3163647, -1812593, -1845249, -1353053, -2172791, -1087801, 372904, 527704, 745760, 710522, -213814, -294312, -547231, -1011830, -451730, -587161, 405742, 2743707, 1660604, 768244, 184889, -1010517, -1111799, -1610231, -1095278, 540894, 644594, 150768, -1218838, -1265327, -585463, 381733, 395704, -422360, -1064721, 231746, 164132, 671936, 1576927, 1104753, 396412, 555237, -645305, -1706960, -656979, -1282507, -10514, 740348, -651062, -243221, -423827, 87059, 151129, 313067, 1145225, 3038627, 2686302, 2295706, 798316, -751056, -1788447, -923356, -166212, 152208, 767396, -295886, -712670, 333939, -994824, -2719999, -2381286, -2074938, -2702233]
16429b702233K16070J096354k35276o34107l91063J873751j81338p56807M28516
16420a286133L17296n65746N94754O71478R61686k09057J216411p64172p85421
16411A51096N92868R90918o47088K6686m63158q3370J49078O17722q64410p26746
16401b56404k53377N75345O40290j435062q92116N09709j082858q36870K5549
16392c005794K87244J618817J100631p26927M34738L78194n12577o96700j083751
16383b206125J19632N81484P56884j22561o83417p43323J24258o43299n6943M10185
16373b463225J824676r9874o74531R28110o0469p25563j233496j084949R63070
16364b626251J623960J166071K04924l69369l81913J491378R53439o71998k289322
$$ y = [-2702233, -2486163, -1389809, -1625085, -2259192, -2650255, -776504, -957842, -1714649, -1286133, -968837, -1534583, -939829, -268351, 693335, 484278, 1700689, 936517, 151096, 743964, 1734882, 1087794, 1114480, 651322, 567952, 717030, 1334752, 470342, -256404, -509781, 65564, 705854, -729208, -1621324, -1111615, -2194473, -3031343, -3005794, -2718550, -1099733, 898, -726029, -291291, 86903, -425674, -1122374, -2206125, -2086493, -1505009, -748125, -870686, -1554103, -2297426, -2173168, -2816467, -2873410, -2463225, -638549, -738423, -1412954, -484844, -545313, -1270876, -2504372, -3589321, -2626251, -1002291, 163780, 368704, -665, -382578, 1108800, 2062239, 1390241, -899081]
16355h99081n84052R57693N24576M53699j23033r31773q51290J6169K024477J183803
16345A771188J3399j516937o41848M98360J487917j3697j494734n25825j024218
16336a446395o64540M08408p6620R94087O40612K93608R63870j250734N7827R96426
16326I16549n16046j373549J79637l48954L05057R73458L86592q30046J81759
16317a25543j28978N20717P84504M49391l87325j379251q81497O85249k98489
16308g61222n25582j016865N61531M25307L2435J58691O82022L65200J237567
16299A159084K44632o16029M9625m85290Q43037m84770J076265r59803q63155
16290c6404R20676N94639J544114j574446k094050N75555m86612J256286R01863
$$ y = [-899081, -1483133, -525440, -864, 452835, 329802, -601971, -1453261, -1437092, 587385, 1771188, 1784587, 267650, -374198, 124162, 1612079, 1598382, 103648, -422177, -1446395, -2110935, -1702527, -1779147, -785060, -144448, 149160, 1113030, -137704, -79877, 916549, 400503, -973046, -793409, -1142363, -837306, 136152, 522744, -307302, -125543, -254521, 266196, 1050700, 1500091, 1112766, -266485, -1147982, -462733, -761222, -1286804, -2303669, -1742138, -1316831, -1284396, -1125705, -443683, -78483, 1159084, 1403716, 787687, 837312, 352022, 1195059, 710289, 1786554, 826751, -36404, 884272, 1478911, 3023025, 1448579, -645471, -69916, -556528, 699758, 1601621]
16281A601621K95950j800178k426481o66011J19089M51548J707418J645698P3999
16272A002653q08188j009569j018743K71920J185238P15996j39207N86232r00813
16263a14481n33734O15713N90669j14697J84894P41585o38883r03028o39495j017145
16253a828602l81112P10517R41922R58363p23738J465739j22704j015748j621159
16244a616522o68697J81739J383306J312942j51166M47267M957J304154R71367
16235C169347p81139n19644p2559K72268l20474k80037n43235N74777m25958k58686
16225H14660P8962k30644o95993p43788J216402J193626q18401M16415k31147
16216A000092j329296r20691L87535M05937l18264k55271k43270M42541R0599
$$ y = [1601621, 1897571, 97393, -2329088, -2995099, -2876010, -2424462, -717044, 928654, 1002653, 194465, -815104, -1833847, -1561927, -376689, 339307, 200100, 786332, -114481, -648215, -32502, 558167, 443470, 628364, 1369949, 731066, -171962, -811457, -1828602, -2209714, -1499197, -557275, 401088, -322650, 1143089, 1020385, 4637, -1616522, -2285219, -2103480, -720174, 592768, 441602, 888869, 893826, 2197980, 3169347, 2388208, 1868564, 1796005, 2068273, 1747799, 1467762, 924527, 1499304, 1073346, 814660, 893622, 662978, -33015, -776803, 439599, 1633225, 814824, 1231239, 1000092, -329204, -1249895, -862360, -456423, -774687, -1029958, -1273228, -830687, -740088]
16207g40088l74148j98915j19478O22735l58291J285891O28999P37451r70109
16198E14047Q50426R94033n58243j148511k36112j468192m20712J849358J544942
16189A921036Q0387j865033j285766J113973O73012n45634r890J85467J223920
16180A491472n04647j157106l06913m01318k84151J43784O90469j800064m94484
16171b622958L64808K322159K016995p18578r34043J646591L12501j665628j189628
16162d67781p909N83176R78351P4713j535283j289286L13085L06142n45171L98036
16152a191927J729481N68696j7876m09716k11088Q59729q54849N95940k48896
16143H19494k047324q63603Q72059o52368L73363N48387J188068p10298L16162
$$ y = [-740088, -1114236, -1313151, -1432629, -809894, -1168185, 117706, 746705, 1484156, 514047, 1364473, 2358506, 1800263, 651752, 415640, -1052552, -1473264, 376094, 1921036, 2001423, 136390, -1149376, -35403, 637609, 91975, 82085, 267552, 1491472, 986825, -170281, -477194, -878512, -1162663, -1018879, -328410, -2128474, -2622958, -2258150, 64009, 2081004, 1362426, 428383, 2074974, 2387475, 721847, -467781, -475690, 107486, 1085837, 1160550, -374733, -1664019, -1350934, -1044792, -1589963, -1191927, 537554, 1106250, 1088374, 678658, 467570, 1327299, 472450, 1068390, 819494, -1227830, -2091433, -1219374, -1871742, -1498379, -949992, 238076, -472222, -156060]
16134a56060j02714J556790r73220J15721j172690q04812j21740l70645M64425
16125a564945P36080O25070l25320L05661o58560p21587J647179L32186m81115
16116a05351j44254o31717j96602n70496R93983J097442j64023k57523j570130
16107a548671r48387N64727O83588o7657K32977M65346J685916M42516O8746L22083
16097A901184M55057m4529j451985j781434j61805L63658o86968O53557j53992
16088i07257q60902m35677K06707P84690m74955N72026M42742O64951l33318J43589
16078a97404j24240o79234q8950p18718J57946J43618j97952K21143n14718J014322
16068i84187O10672N34226R18181J158311o4934K60520p31618j696849l66338
$$ y = [-156060, -258774, 1298016, 324796, 440517, -732173, -1536985, -1658725, -2029370, -1564945, -828865, -203795, -529115, -223454, -882014, -1603601, 43578, 375764, -105351, -249605, -881322, -1077924, -1648420, -654437, 443005, 278982, 21459, -1548671, -2497058, -1932331, -1248743, -1316400, -1083423, -618077, 1067839, 1510355, 1579101, 1901184, 2356241, 2311712, 859727, -921707, -1083512, -719854, -1406822, -753265, -907257, -1768159, -2203836, -1997129, -1212439, -1687394, -1115368, -672626, -7675, -340993, -197404, -321644, -1000878, -1089828, -1808546, -1650600, -1506982, -1704934, -1483791, -1998509, -984187, -373515, 160711, 1078892, 2237203, 2172269, 2432789, 1701171, 4322, -362016]
16059c62016n15154R46032l04228j412434p46832J921444J187427J32124k147286
16050a300923j253406Q50971N69097k66702J022847J303217m54r68890k5673M8442
16040b1474j527040k98911J308996J131330J57509K8652j266237M34030N58387
16031E05242n41343l88694N33501O62865o82329p86918R580P11732J224626j406453
16021a58191j73258j19534K54423j01713p39923k48809J14993K09539L77297P69426
16011A84250l7096r39782o98362j339548k19947J597911R21560j50773m64313
16002a146100O20737R09972J28038O03819L4369n81178j11200j004350M38027
15993a07866N51868J191318O19353M45296o35198j350072r05661j256069p44575
$$ y = [-362016, -877170, 68862, -235366, -1647800, -2394632, -473188, 714239, 846363, -1300923, -2554329, -1703358, -1134261, -1400963, -378116, 925101, 924647, -44243, -69916, -21474, -1548514, -1847425, -538429, 592901, 750410, 779062, -487175, -53145, 505242, -36101, -424795, 108706, 771571, 89242, -697676, -688096, 23636, 1248262, -158191, -331449, -450983, -196560, -298273, -1038196, -1287005, -1172012, -962473, -585176, 184250, 147154, -792628, -1490990, -2830538, -3050485, -1452574, -531014, -681787, -1146100, -525363, 384609, 512647, 1116466, 1150835, 569657, 458457, -545893, -107866, 444002, 1635320, 2254673, 2699969, 2064771, 714699, -190962, -1447031, -2191606]
15984b191606O26817J102328p72345Q35898J96235k10279R15974j02778K01792
15975F02036k95319k37148P3763k58184k080n10067O52009J069374l10245k441716
15965a657577K35044K09775K090171J661197j130460j455880n44680p70416J049211
15956c13615r47149K03466M75561p09729M91832J361124O30865k07000r80077
15947E278n12154p73253j215327R79304J040442J239224J087410O06294n05424
15938A951794j4139N92801q48844p35522n10710Q4699j614390j546054N00463
15929b139902N36851R68034R12602K86413P0026m90936j091581j185029J103594
15920a029928J304959O66804m43429l05065O54124J078757n55995Q4839j000085
$$ y = [-2191606, -1564789, -462461, -1234806, -398908, -202673, -412952, 503022, 400244, 602036, 306717, 69569, 143332, -114852, -116932, -626999, 25010, 1094384, 784139, -1657577, -1422533, -1212758, 877413, 2538610, 1408150, -47730, -592410, -1362826, -313615, -1260764, -1057298, -581737, -1291466, -799634, 561490, 1192355, 985355, 5278, -506876, -1280129, -2495456, -1516152, -475710, 763514, 1850924, 2457218, 1951794, 1937655, 2530456, 1681612, 946090, 435380, 520079, -1094311, -2640365, -2139902, -1603051, -635017, 277585, 563998, 634024, 143088, -948493, -2133522, -1029928, 275031, 941835, 498406, 193341, 847465, 1926222, 1370227, 1455066, 454981]
15911D54981p8408K01150p11557m55012K02946q15976J06312J14782m31565J075328
15901c37019N79845j869464j057004P75927L64818J634810J88875j108901L96915
15892d31198L807K18794J176930J07536m36265Q15145k58480r10846O46377J063963
15882A995763q57116k424128o80406J097460L84967L70381M91876J88622k155
15873E65264n12954o71929m95528M1136m82456J247804N75664N9639M60579m99792
15863B87427p30297k56802m25583j341403j921256O6973J732232J142692M04418
15854a041599K7239M90185N09076Q30599J178441J19725j504571p62779n73080
15845g26764n37150k99997K80097J213926j1774K51816o73077k46185P13144J08838
$$ y = [454981, 376573, 577723, -133834, -588846, -385900, -1201876, -1095564, -980782, -1412347, -337019, 242826, -1626638, -2683642, -1907715, -1542897, 91913, 280788, -828113, -431198, -427391, -208597, 968333, 1075869, 639604, 1454749, 1196269, 285423, 931800, 1995763, 1138647, -1285481, -1965887, -868427, -483460, -113079, 378797, 567419, 565264, 52310, -619619, -1115147, -1074011, -1556467, -308663, 267001, 326640, 787219, 287427, -442870, -699672, -1125255, -2466658, -4387914, -4320941, -2588709, -1446017, -1041599, -1014360, -524175, -15099, 815500, 1993941, 2113666, 609095, -153684, -726764, -1263914, -1563911, -1283814, -69888, -81662, 170154, -502923, -749108, -35964, 72874]
15835G2874k125747p88988R54179j96995J361627J946732k13905j308601r68111
15826a266935n7619k74132L48336l99683o7941M66017j69091J22316R90928K92886
15816a4918l62571O7423N81738j339843j299484l74858J294926L64889K05435
15807h77263j278580O11182L51113J27281J081389R3886j027323j845559Q5722
15798b678152O61678m55952N13442L51188n10668j19754J426856q56549J808069
15789A40158J304914l95000j101667k245280O59793J377467N85512q15014l17572
15780h06689K145194J71257K19888q68559j007126m51737o45112j195653N13958
15771a924579N51892M88232O93264m0591R69615P42709o05104j008903o74842
$$ y = [72874, -2052873, -2841861, -1887682, -2084677, -723050, 1223682, 1009777, -298824, -1266935, -1324554, -1598686, -1250350, -1650033, -1717974, -1251957, -1421048, -1298732, -307804, -14918, -377489, -310066, 271672, -1068171, -2367655, -2742513, -1447587, -1082698, -877263, -2155843, -1544661, -1193548, -1066267, 15122, 109008, -918315, -2763874, -2678152, -2016474, -2472426, -1958984, -1607796, -2118464, -2238218, -811362, -1667911, 140158, 1445072, 1050072, -51595, -2296875, -1637082, -259615, 325897, -489117, -806689, 1338505, 1509762, 1729650, 861091, -146035, -597772, -1242884, -2438537, -1924579, -1372687, -884455, -191191, -231782, 737833, 1480542, 875438, -133465, -808307]
15762h08307L57287O35391J374316R956j012459r70168L59502J674103R81091
15753B600712M1979M59420k020699k430113q63115J14437J233452N41323L47582
15744B4978m90742o70078P40790p7578P34655k24563N51594j019728j060573J113021
15734c78224O51475O21606P55539m958p14502O37669J004316n83265p55806p84958
15724D48892r88708n28715j38466R4665J624110K2407j809309n34L97272j279806
15714b158192P45204K09216K36986P7086P92951k38471j4160o06902J4322j58069
15704a100029j82749j025459M41735J944903J412654n10823j049150q19850M00508
15695d88260r4036M84884j95976j487785k165601Q7858K239964N85427q2320j262828
$$ y = [-808307, -451020, 184371, 1558687, 1568643, 556184, -413984, -54482, 1619621, 2600712, 2642691, 3102111, 1081412, -1348701, -2211816, -2097379, -863927, -322604, 24978, -465764, -1135842, -395052, -472630, 262025, 37462, 589056, -430672, -1491245, -378224, 273251, 894857, 1650396, 1645438, 930936, 1568605, 2572921, 1989656, 1233850, 448892, -539816, -1068531, -1206997, -1112332, 511778, 534185, -1275124, -1275658, -878386, -2158192, -1412988, -1203772, -966786, -889700, -96749, -335220, -349380, -956282, -941960, -1100029, -1282778, -2308237, -1866502, 78401, 1491055, 980232, -68918, -888768, -488260, -582296, -97412, -293388, -1781173, -3946774, -3858916, -1618952, -1033525, -1115845, -2378673]
15685b378673j249051J014693J722680p01222l40045o39715p8471K312650q0186
15676d17340k48681j23336J30321J48508l56847N1877m85590j13947J346223m35926
15666e04738r72228j576650j21076J312008O02856k89832m61844j53001J206099
15657i58406m89758j60207l70675m38710N54857k8221J594601Q86987J386157
15648A976625L63544p98295n80973m83276p23814m00863M9638J717773l57720
15639G62639j604040r9377O41852J326222J055315j240256k332463p02768J447586
15630g45290J552807M65328r55731l05797l96768l15484O05024j52283j645651
15621a893845l7365m00479J40216J357509N38364j49819N24859p94583k44873
$$ y = [-2378673, -3627724, -2613031, -890351, -1591573, -1931618, -2571333, -2649804, -337154, -417340, -666021, -789357, -659036, -510528, -867375, -815498, -1301088, -1415035, -68812, -504738, -1476966, -3053616, -3174692, -1862684, -1259828, -1549660, -2011504, -2164505, -958406, -1448164, -1608371, -1979046, -2417756, -1862899, -1891120, -296519, 590468, 1976625, 2340169, 1541874, 960901, 477625, -246189, -647052, -597414, 1120359, 762639, -841401, -940778, -298926, 1027296, 2082611, 842355, -1490108, -2192876, -745290, 807517, 1272845, 317114, 11317, -385451, -700935, -95911, -248194, -1893845, -1931210, -2331689, -2191473, -833964, -295600, -445419, 79440, -715143, -960016]
15612i60016j18296M8959j026839K05456N7831L52194j00223o64425P45696k21039
15602a680702N49092J169462R68904m30453J85308P74963Q4730j222866o48358
15593b49920j97099j039202r73324N36052N84158Q80487M30162N07248j562577
15584a084015k3280J546815Q28894p105L53943o65080k7162j37814o45278j014597
15574h74679l3926J710217k60514M64735J16532o07794L02084J433730p23634
15565A526751p48838J35053p71210j316447P41388J032730K40112o26774p7442
15556A35323J182220J06677k08186l26318j45649K1798p91005r94527J101340
15547H1673K62393N02240O18258R25970j368213p80086M26755o56447j24494Q91551
$$ y = [-960016, -1078312, -1029353, -2056192, -1850736, -1792905, -1440711, -1540934, -2205359, -1459663, -1680702, -1131610, 37852, 1006756, 576303, 761611, 1536574, 1621304, 398438, -249920, -447019, -1486221, -2459545, -1923493, -1339335, -458848, -28686, 478562, -1084015, -1107295, 439520, 1268414, 1261309, 1615252, 950172, 923010, 785196, 139918, -874679, -908605, 801612, 541098, 1005833, 1122365, 514571, 816655, 2250385, 1526751, 777913, 912966, 141756, -1174691, -433303, 599427, 839539, 212765, 135323, 1317543, 1424220, 1216034, 889716, 744067, 765865, -25140, -1019667, 81673, 344066, 846306, 1464564, 2390534, 1022321, 242235, 668990, 12543, -111951, 779600]
15537G79600m11431k02622M34362J15015j628421j769255J562697K873233M43187
15528B196365r02681j730342K69012J214434o90827r75520j597707J24606K993203
15519I00543l73248j135521O92246N7778P72280n82070K85059R84009J060722
15510B661798j820717k272O56506N2172j879209o01455J195818J064660n79620
15501G47681m24629J247555o58968o76323O37518j88297k24775q04819j006683
15492a351740l79416j59144O38208o85771j94693P0136P50875P84718o07473P44792
15482c89508K23363M03342O75157m04543r90882O5102m51748m55375q6148L83715
15472a027525J3582l74546L29482j450215J770086Q61449j106036m98307P67293
$$ y = [779600, 368169, 165547, 599909, 714924, -913497, -2682752, -1120055, 1753178, 2196365, 1293684, -436658, -167646, 1046788, 355961, -619559, -2217266, -2092660, 900543, 527295, -608226, 84020, 141798, 914078, 332008, 617067, 1601076, 2661798, 841081, 838809, 1495315, 1547487, -331722, -933177, 262641, 1327301, 747681, 323052, 1570607, 911639, 235316, 872834, 684537, 459762, -345057, -1351740, -1731156, -1890300, -1252092, -1937863, -2132556, -2062420, -1311545, -526827, -1134300, -389508, -166145, 237197, 912354, 507811, -483071, -417969, -869717, -1325092, -1411240, -1027525, -1013943, -1388489, -1059007, -2509222, -739136, 122313, -983723, -1482030, -714737]
15463g14737P90540o24437m36497J25763m52907k18186q70649K60953R17514R68935
15453b53708J358428n23494p05940J706842n1387o78656k23657L19546l1392j69378
15443G47204Q25588K29688k19761J781513n22037j581257l33438m64116K9177
15434D92561o45125K7109J75221K5392J141666q60170r80965J289750J121344
15425A786783K09201j202535m86984n49646j019602l98794L92636J031424K192963
15416A955446N09970j452667n30388j22388M4211k040423N57941J761217R15209
15407A598128p09262r54084Q73049N85990k19727j373273P98894J09469q88289
15398a79105n83482p50994R15081J368687L7306L59385L35922P83521j620323
$$ y = [-714737, 75803, -548634, -985131, -859368, -1312275, -1530461, -2401110, -2140157, -1222643, -253708, 1104720, 581226, -124714, 1582128, 1530741, 852085, 628428, 947974, 916582, 747204, 1572792, 1802480, 1582719, 3364232, 2842195, 1260938, 927500, 463384, 492561, -152564, -125455, 49766, 75158, 1216824, 356654, -624311, 665439, 1786783, 1995984, 793449, 306465, -243181, -1262783, -1661577, -1268941, -237517, 1955446, 2465416, 1012749, 482361, 359973, 404184, -1636239, -1078298, 682919, 1598128, 888866, -65218, 807831, 1393821, 1174094, -199179, 599715, 709184, -179105, -762587, -1513581, -598500, 770187, 807493, 1166878, 1502800, 2286321, 665998]
15389F65998j857328j140118J421368L782k27838p6j73469Q34579m95888j77090
15379a146080Q43524K98751P21472j75563Q30936J396059m11856k338080j026474
15370a007311R02434P82318n52704k037523n97899j1447J791205J775590N44104
15361A588767J107490j345439n74026J78638O46445q1154j653887r03822l13261
15352a350249m31416L06176K168653k25850j121467o67021K42377R97144r6298
15343a77951m04696j01102n83478j535349N83546O26327J589183M04592k15977
15334A85095n23088o33761m05648P90715l83886r46590k63616r627J97724l70350
15324b363032N81198K062022k74299J29782J50914l22699j0424R86829J076638
$$ y = [665998, -1191330, -2331448, -910080, -906298, -1134136, -1134212, -1307681, -473102, -968990, -1146080, -302556, -3805, 717667, 542104, 1373040, 2769099, 2357243, 19163, -1007311, -104877, 677441, 124737, -1912786, -2510685, -2522132, -730927, 1044663, 1588767, 2696257, 1350818, 776792, 955430, 1601875, 1520721, -133166, -1036988, -1350249, -1781665, -1475489, 693164, 467314, -654153, -1321174, -1078797, -81653, -177951, -582647, -683749, -1267227, -2802576, -2219030, -1592703, -3520, 401072, 185095, -337993, -971754, -1377402, -586687, -970573, -1917163, -2180779, -2190406, -1992682, -2363032, -1781834, 280188, 5889, 135671, 286585, -36114, -46538, 940291, 2016929]
15315B016929k51853l64300o01491K334129l08686k945590n01071K02619J473194
15306A053880K29562j96626Q22512P51932k37762q09717R731n22414p08909k6891
15296C65298p11373m64482l84197K15590Q25281M71491l17287j696803K8974O44434
15286a023074j7313j038177J080040K049109J087168j386834K95897j025470j16612
15277i5266O90700j233122j276592j30076J273099J881590R46031j570309L07000
15268G93055r2074n25846j211322j40572L03663K91631l18026m18175o96547J044205
15258i70008J448064J201614P7941j445121J56809J094076J061290J062558j300083
15249B387140j312185P2055J129223K97594N27861j333910j467275r17171L34194
$$ y = [2016929, 1765076, 1400776, 799285, 3133414, 2824728, -120862, -621933, -419314, 1053880, 1283442, 1086816, 1909328, 2661260, 2423498, 1613781, 1623512, 1101098, 392189, 365298, -346075, -810557, -1194754, -979164, -153883, 317608, 321, -1696482, -1667508, -1023074, -1040387, -2078564, -998524, 1050585, 2137753, 750919, 1046816, 21346, -95266, 595434, -637688, -1914280, -2044356, -771257, 1110333, 2056364, 486055, 793055, 700981, 175135, -1036187, -1176759, -873096, -581465, -899491, -1317666, -2014213, -970008, 478056, 1679670, 1757611, 312490, 469299, 1563375, 2624665, 3687223, 2387140, 1074955, 1147010, 2276233, 2573827, 3101688, 1767778, 300503, -616668, -282474]
15240b82474m04363N2414P14972j40952p20022K40998P65315m37728r71409m13954
15230a597203n53651n90443R66297n25058o68108J58573O70999R77327P17519
15221d43748n48121P10012N06435n22063j095781K23201J326219R05380L61279
15212A422813L61132n23732M25821p53794p34544K59614Q19468P72959O6352j315215
15202H00874m79151o75776o18037M72012M20188j780672M0855J490248l21977
15193f51436L37541J045345Q61631l7196j195580O64992j028571m11540M0224
15184c74590J259871k73979L06851L92482o23426l10244J994j34455j313373j51545
15174a220414k62612Q59934K357722K38984j248460n1272o63546j580544p76018
$$ y = [-282474, -686837, -634423, 80549, -60403, -780425, -539427, 225888, -211840, -1183249, -1597203, -2150854, -2741297, -1775000, -2300058, -2968166, -2809593, -2138594, -1161267, -443748, -991869, -281857, 224578, -297485, -1393266, -1170065, 156154, 1061534, 1422813, 1783945, 1260213, 1686034, 932240, 197696, 457310, 1276778, 2049737, 2116089, 800874, 321723, -354053, -972090, -500078, -79890, -1860562, -1819707, -329459, -651436, -313895, 731450, 1593081, 1555885, 360305, 1025297, -3274, -414814, -374590, 885281, 611302, 918153, 1310635, 687209, 376965, 378959, 244504, -1068869, -1220414, -1483026, -623092, 1734630, 1973614, 725154, 673882, 10336, -1570208, -2346226]
15165b346226K72159R45025l59745J66232J63119R23721r75466l10961L70165
15156a151977J990065o93555J91961J734567P99474j230975j718264o10391m62901
15147a151996q6217n52995N58581J027174j32914q66829L30455j390055K09523
15138b055273J218593J625990O92428M1880J162538K3526j31941m29471K97709
15129B445979O9016k67825o30925j043448M50491J463338q4086n59991j726375
15120A16174l4765j76797l59708J188647K64238n68468J193337J368144j019276
15111A971526q75450j252197j298490J152614M76279o29168j505831l16037J21275
15102b155479J733071R22011l95503r78464P9013m17580J397p67096O21417R94401
$$ y = [-2346226, -2074067, -1129042, -1488787, -1322555, -1159436, -235715, -1211181, -1522142, -1151977, 838088, 144533, 336494, 2071061, 2870535, 1639560, -78704, -689095, -1151996, -1238213, -1791208, -1232627, -205453, -338367, -1205196, -874741, -2264796, -2055273, -836680, 789310, 1481738, 1523618, 2686156, 2709682, 2577741, 2148270, 2445979, 2514995, 2247170, 1616245, 572797, 1023288, 2486626, 2402540, 1842549, 116174, 81409, -95388, -455096, 733551, 997789, 429321, 1622658, 2990802, 1971526, 1096076, -156121, -1454611, -301997, 174282, -454886, -1960717, -2276754, -2155479, -422408, 499603, 104100, -874364, -795351, -1212931, -1211534, -1978630, -1357213, -362812]
15092c62812P19810j034515k244653N56931R09606m34562j05529N25644J232446
15083b37634O12319j18157R87909L56456r52012j056322n67937J298104l7296
15074B85430j79193o67875j91985K5307l0808J524931J368844R5431L02468j578699
15064I53851r71362m63237Q40663R27987P0693r71475k66605R26637o19217m40583
15054a2648J13124p75306k37812K67163M74289K90942O98396M29675j521998j496620
15044a770795J85269M79448L95104K37127O35170N22114r49538k62174P73342
15035B45067L18831l69121q62344P25302L82566o76558L63382r5632P74593m4213
15025G61873n14456O8628P44770O29160p97022m70977M59460l08188J084101m55173
$$ y = [-362812, 356998, -677517, -2922170, -2365239, -1455633, -1890195, -1995724, -1470080, -237634, 374685, 256528, 1244437, 1600893, 648881, -407441, -975378, 322726, 285430, 106237, -561638, -753623, -728316, -759124, 765807, 2134651, 2230082, 2532550, 953851, -17511, -480748, 359915, 1287902, 1358595, 387120, 120515, 1047152, 427935, -12648, 100476, -674830, -912642, -645479, -171190, 119752, 818148, 1247823, -274175, -1770795, -1585526, -1106078, -710974, -473847, 161323, 683437, -266101, -528275, 245067, 563898, 194777, -667567, 57735, 440301, -236257, 127125, 31493, 806086, 761873, 247417, 316045, 1060815, 1689975, 892953, 421976, 881436, 573248, 1657349, 1202176]
15015A202176k67219m29274J3213k01335O72021k8259r77288n0340j17215o52819
15005h36339o31562R17737M90060j659421J527033J476576r7562k119321O58312
14996b74487R14923J351191O99025L40753l08197j095181r64929j65996j69693
14987C27409K20869N86137k43567k40116r02693j117375K11806k07422M38246
14978i26706L58748Q54236q63949j67117P38257M56225J001589J22271l25704
14969A247850m02502J56626M30493n83871P23240j06222k49452L1423J457353
14960B704938j04056q18523j68246p10174R02372k69581n65733q81742O6336J337742
14950A493333K65153k34922j936870n37528O09702J176449M16495N0303o50829
$$ y = [1202176, 934957, 505683, 518896, 317561, 989582, 961323, -15965, -66305, -183520, -836339, -1467901, -550164, -60104, -1719525, -192492, 1284084, 1186522, -932799, -274487, 640436, 1991627, 2690652, 3031405, 2723208, 1628027, 663098, 497102, 327409, 548278, 1134415, 890848, 650732, -251961, -1369336, -1157530, -1364952, -926706, -567958, 286278, -577671, -744788, -6531, 449694, 1451283, 1573554, 1247850, 845348, 1001974, 1432467, 848596, 1571836, 1465614, 1216162, 1247585, 2704938, 2600882, 1782359, 1614113, 903939, 1806311, 1536730, 970997, 89255, 155591, 1493333, 1758486, 1523564, -413306, -950834, -341132, 835317, 1251812, 1302115, 651286]
14941F51286l64737q26584L59218K59661l13665o15318Q75823L21188L23233K49401
14931I19506j420244J49325J344392M72299p80563p27516k53003J19473N24096
14922C47765J245749P9379J39586P04263j304625j054782q58367R7478q12482
14913a416036o97626J140142J136706l90340l21072P34877J839622Q74607l16934
14904B583946j438673q49966j351815j56q82272j142606L63581J398971l33811
14895a652801l39135k5133J592256j40542n45093j2491Q35812O77238j109022
14886g18911k106799R09641j7274P91556J424192j038997k5722q26391J883433
14877B74728K815082L2353j262106j475386k26016o97179L16545K53089J654207
$$ y = [651286, 286549, -540035, -180817, 78844, -234821, -850139, 25684, 346872, 670105, 919506, -500738, -351413, 992979, 1465278, 684715, -42801, -295804, -176331, 347765, 1593514, 1672893, 1812479, 2516742, 1212117, 157335, -701032, -603554, -1416036, -2113662, -973520, 163186, -227154, -548226, 186651, 2026273, 2900880, 2583946, 1145273, 295307, -1056508, -1056664, -1938936, -3081542, -2717961, -1318990, -1652801, -1991936, -2017069, -424813, -565355, -1110448, -1122939, -287127, 390111, -718911, -2825710, -1916069, -1933343, -1141787, 282405, -756592, -782314, -1608705, 274728, 3089810, 3122163, 1860057, 384671, 158655, -538524, -221979, 31110, 1685317]
14868A685317J176390l41972l56472j640103j337747j60425J4577L89778J70606
14859d00051J591285j86976j842276r82177R62148J315034O25916o07491j047591
14850e72179m82797l46119M86111L59477r5869m96068N58931O60162M73451j43503
14840D01597j023359N16742k13675k40963J209838L45425l34506r62826L47779
14831D6052O20020M53488J74152r98399p04188p21760m77822P01701J082395J461424
14821A637063m07443j662336j84555l93292J79628N88708N7420K95922J288096
14812A399211J869517J170117j094742K7715q3314k206318j001995R75118o17120
14803D38189j34590k40791K28999n23645J019618l36837J46004k93254m4424P85740
$$ y = [1685317, 2861707, 2519735, 2163263, 523160, -814587, -975012, -960435, -570657, -400051, 1191234, 1004258, -838018, -1820195, -858047, 456987, 1082903, 475412, -572179, -1054976, -1401095, -914984, -555507, -651376, -1147444, -588513, 71649, 545100, 401597, -621762, -105020, -318695, -559658, 650180, 995605, 661099, -301727, 46052, 666072, 1119560, 1293712, 295313, -408875, -1130635, -1608457, -906756, 175639, 1637063, 1229620, -432716, -617271, -1010563, -830935, -242227, -184807, 111115, 1399211, 3268728, 4438845, 3344103, 3371818, 3288504, 1082186, 80191, 1055309, 438189, 303599, 62808, 291807, -231838, 787780, 450943, 596947, 303693, 259269, 1045009]
14793A045009q36649k77351J265982M00320j28799j093263q19686o01499r73839
14784b019775K57638J1137j7847N93334L35693L87687P01847r88995k334579P86907
14774b286953J065071M55254l4332n87486k4214P91067n0552J125110J524340
14765A977305p80721n62378R1932P0391J596546L50311j222217N86286M58893
14756B566348m88018q54759l71079j356743L50470O35648n81645j8062m15599
14747e33439M18064M16332p51758N0682N03302j491908j90733J042608J382094
14738H45244K35508j19906j058789J510687N49916n39099l20219n66201J75360
14729G12501J812440j10233r19735j352466Q51720N26724J190693J83139p77102
$$ y = [1045009, 208360, -68991, 1196991, 1597311, 1468512, 375249, -444437, -1045936, -2019775, -1762137, -1751000, -1768847, -1175513, -839820, -452133, 249714, -739281, -3073860, -2286953, -1221882, -766628, -800960, -1388446, -1412660, -621593, -672145, 452965, 1977305, 1196584, 634206, 726138, 796529, 2393075, 2743386, 1521169, 2107455, 2566348, 2078330, 1223571, 852492, -504251, -153781, 481867, -99778, -117840, -533439, -115375, 300957, -450801, -400119, 103183, -1388725, -1579458, -536850, 845244, 1080752, 960846, -97943, 1412744, 1962660, 1423561, 1103342, 537141, 712501, 2524941, 2414708, 1494973, 142507, 994227, 1520951, 2711644, 2894783, 2117681]
14720B117681j00891l55656m37080L74326M89219Q07813M25118O61445j288203
14711B693772j677768Q40493j83358j326149J723395J20948m42246r06013m12815
14702D30259J815518m97136P34882J162914J45241r53637j355218j02305R93834
14693B374352O44711l60364o39603Q0542j042985l24603L16652Q00806p13319
14684A136189k61628j323723K52961j48376o25728J710004J155103q31222K8889
14675A092469M53693M13506l51031k12512K13849m35496j306712Q96631J821189
14666B585586k30580j706086l27395M30422R40977O10464J368395n19260k006089
14657A146434L85478K200080L39440k694735j013302j95370m7595L39182j99821
$$ y = [2117681, 2016790, 1661134, 1224054, 1598380, 2087599, 2895412, 3320530, 3981975, 2693772, 1016004, 1856497, 1673139, 346990, 2070385, 2191333, 1749087, 843074, 430259, 2245777, 1748641, 2483523, 3646437, 3791678, 2838041, 1482823, 1380518, 2374352, 3019063, 2658699, 2019096, 2099638, 1056653, 732050, 1048702, 1849508, 1136189, 874561, -449162, -196201, -344577, -970305, 739699, 1894802, 1063580, 1092469, 1546162, 1959668, 1608637, 1396125, 1609974, 1174478, -132234, 764397, 2585586, 2355006, 648920, 321525, 751947, 1692924, 2303388, 3671783, 3152523, 1146434, 1531912, 3731992, 4071432, 1376697, 363395, 168025, 120430, 459612, 259791]
14648B59791j3189q266L88521k19630m65236P51060M14740M94944j93175q9868
14638A319692Q61249r65548j528800m05734N04166J60679J299775K38451m89941
14629I93989o62479Q75267k20547k80269k75190r70193M14433J91727J779385
14620A846123J523341J60333m07421l25827p86743K58580n70009m24088m02638
14611H71651j317982K5162J287728m76195l80329L42201R25341j61088M39609
14602A556098R87838K7415j237522o90148M64509R45599l63057q74447K85867
14593A102152N03967K66053n52697L6152j60741o22212M63301p60242n40075M04706
14583A40364J247154r667p23265n32625q3326N10080L21670K33712Q54516K50019
$$ y = [259791, 246602, 238336, 626857, 407227, -58009, 693051, 1107791, 1602735, 1409560, 1319692, 2180941, 1215393, -313407, -719141, -214975, -54296, 1245479, 1483930, 993989, 331510, 1206777, 986230, 705961, 430771, -539422, -124989, 66738, 1846123, 3369464, 3529797, 3122376, 2796549, 2009806, 2268386, 1698377, 1274289, 871651, -446331, -421169, 866559, 390364, 10035, 352236, 1277577, 1116489, 1556098, 2543936, 2571351, 1333829, 643681, 1108190, 2053789, 1690732, 816285, 1102152, 1606119, 1872172, 1319475, 1355627, 1194886, 572674, 1035975, 275733, -264342, 140364, 1387518, 1377851, 654586, 121961, 38635, 548715, 870385, 1104097, 1958613, 2208632]
14573B208632q53428q12312M32872J309401M80643m90269J39485K66080o18213
14564B062891n80079j092594J699541N7458q33417M26745P80486K77629l56828
14555B441832j090212Q88631J269584N89957j380101j462473N40546R50308P74137
14546C522209M11726J92715k68881N15745n59215p14241R10020l91520j787116
14537A831442K2381M05283m76723l04605J418219M77036n6803n27635k75537l89267
14527B123791j70543L18891o51111O3527j046283Q83828J085829J306390j087238
14518B827081j934128k88874Q12239K012016J164254j780722P0676Q12615r27533
14509B767624n68127O69533j73019j718846L03494J125157J588248o38916q30447
$$ y = [2208632, 1355204, 542892, 975764, 2285165, 2765808, 2275539, 2415024, 2681104, 2062891, 1482812, 390218, 2089759, 2147217, 1313800, 1740545, 2521031, 2798660, 2441832, 1351620, 2240251, 3509835, 4099792, 2719691, 1257218, 1797764, 2748072, 3522209, 3933935, 4126650, 3857769, 4373514, 3814299, 3100058, 4010078, 3618558, 1831442, 1853823, 2259106, 1782383, 1477778, 2895997, 3373033, 3316230, 2788595, 2513058, 2123791, 1953248, 2272139, 1621028, 1684555, 638272, 1522100, 2607929, 3914319, 2827081, 892953, 604079, 1416318, 3428334, 4592588, 2811866, 2882542, 3695157, 2767624, 2199497, 2869030, 2696011, 977165, 1280659, 2405816, 3994064, 3355148, 2524701]
14500B524701J168798r45716j409637l41472m77853r5073Q7955K02733n50863
14491A63573R80211J375394N27011n82324m23302q65969L8R6447n38216O11400
14481A344263J33139k31527O76764J702205J97972l164776k13349n2625n724J197828
14471A584170J512819p35172j117925j74036J33017q30968M9060O56338o4819
14462A012484p4934K42301R03134J130860o92617J522306J006360k37271p0546
14453D742077o02565l67694n91664Q8002J225111n07964q43482J314099P89885
14444E245805l05163L8435k20737J043505Q92949p8530n6285k61849O23445L39736
14434G261311j48229J577164P99663K60117p25283r99013P29130L3513R13932
$$ y = [2524701, 3693499, 2747783, 1338146, 996674, 518821, 423748, 511703, 714436, 163573, 1143784, 2519178, 3046189, 2463865, 2040563, 1174594, 1174632, 1271079, 732863, 1344263, 1477402, 1245875, 1922639, 3624844, 3822816, 658040, 444691, 392066, 386342, 1584170, 3096989, 2361817, 1243892, 1069856, 1202873, 371905, 420965, 1077303, 1012484, 937550, 1179851, 2082985, 3213845, 2521228, 4043534, 5049894, 4812623, 4742077, 4139512, 3771818, 3180154, 3268156, 4493267, 3985303, 3141821, 4455920, 5245805, 4940642, 4979077, 4758340, 5801845, 6694794, 6616264, 6559979, 6298130, 6921575, 7261311, 7113082, 8690246, 9489909, 9750026, 9024743, 8025730, 8754860, 8788373, 9702305]
14425I702305K46812k80378p43257r6823L87046Q28671k02966m26125J303585
14416A0718870K364L0357j473370n85961J369378K444359j30446l65247r4752
14407A1915552j420405j220283L5066j039658J048988N23663k64624k90314o8382
14398I219603K42452J6894O5984J341795m71920o46176M57873Q30366O6529J18945
14388A1242345m95334j075094j746916p50985J836372Q92636j276454n12127M01992
14379H516435j165994j788804j216701L84525Q47956M70319O11326P21117r02974
14370F477205l68895Q58904m56206J94091k52043j73625o24851k5738J72296n87232
14360E213906J384953R9154p614Q46459J675184M48777j500644J52325J91061
$$ y = [9702305, 9949117, 9668739, 8925482, 8828659, 9215705, 10044376, 9841410, 9415285, 10718870, 10721234, 10751591, 9278221, 8692260, 10061638, 12505997, 12375551, 12010304, 11915552, 10495147, 9274864, 9309930, 8270272, 9319260, 9842923, 9578299, 9287985, 9219603, 9462055, 9478949, 9544933, 10886728, 10414808, 9768632, 10226505, 11056871, 11123400, 11242345, 10747011, 9671917, 7925001, 7174016, 9010388, 9903024, 8626570, 8114443, 8516435, 7350441, 5561637, 4344936, 4729461, 5577417, 6047736, 6659062, 7380179, 6477205, 6108310, 6967214, 6511008, 6705099, 6453056, 6279431, 5654580, 5628842, 5801138, 5213906, 6598859, 6698013, 6690399, 7536858, 9212042, 9660819, 8160175, 8312500, 8503561]
14351H503561L25920O1132M50754k22219j018377M36230k92634Q5180M96642Q05596
14341I631785J357858Q59410Q1607K84693J675946J253485N08583o71202j28614
14332A4853551P91920J108046L68847N76306J345407R05307O53284J605461l06208
14323B1901921J133066L422424J672666J536373J660109L361201N235813M689503
14315D4613076L204058L584097L893064M493890M576483N429860O601105P447438
14307H3843071O440456P224360R189863Q916547Q684627J1781503J1299894J1939010
14299A59319331J2566736J3001090J4108812J4471667J2928191J3655367J4277848
14292B54329042J2680098J0255914R603283Q582231R196216N174993K829412J939128
$$ y = [8503561, 8829481, 8890613, 9341367, 9119148, 8100771, 8537001, 8244367, 8329547, 8826189, 9631785, 10989643, 11849053, 11930660, 12215353, 13891299, 15144784, 15653367, 14982165, 14853551, 15645471, 16753517, 17122364, 17698670, 19044077, 19949384, 20602668, 22208129, 21901921, 23034987, 26457411, 28130077, 29666450, 31326559, 34687760, 39923573, 44613076, 47817134, 51401231, 55294295, 59788185, 64364668, 69794528, 76395633, 83843071, 90283527, 97507887, 106697750, 115614297, 124298924, 136080427, 147380321, 159319331, 171886067, 184887157, 198995969, 213467636, 226395827, 240051194, 254329042, 267009140, 277265054, 286868337, 295450568, 304646784, 309821777, 312651189, 314590317]
14284C14590317N22044o10957k245920m719426m701212n054122m345022m166440
14276B89269262l846609l812212r12385j130435j345217R60502M21931K092729
14268B81697566L323193L316567L206719M332461M922687O099632N923837O450930
14260C19273592O792635N728820M815300K382583J525638L068466L642345N24851
14252C47754230k286035n103563p407963p408931j0219977j2472805j2961115
14245B89893841j3012896j0962795j3717333j3414379j5172049j3570966j0836505
14238A99206918j1329103r289326q594969p213933q158607q269891q548777n034791
14230A32767521n037879n542408n696159n211931k809708k955115p82765l075721
$$ y = [314590317, 315112361, 314501404, 312255484, 307536058, 302834846, 297780724, 293435702, 289269262, 285422653, 281610441, 280698056, 279567621, 278222404, 279182906, 279604837, 281697566, 285020759, 288337326, 291544045, 295876506, 300799193, 306898825, 312822662, 319273592, 326066227, 331795047, 336610347, 338992930, 340518568, 343587034, 347229379, 347754230, 345468195, 340364632, 332956669, 325547738, 315327761, 302854956, 289893841, 276880945, 265918150, 252200817, 238786438, 223614389, 210043423, 199206918, 187877815, 178588489, 169993520, 162779587, 154620980, 146351089, 137802312, 132767521, 127729642, 122187234, 116491075, 111279144, 108469436, 105514321, 104731556, 101655835]
14222A01655835m253745k863325k636495k614396k237363j957143k522193n44612
14214H2026563j495767k098833j795184r69561k262878n27734j391904k127607
14206F9357095j940471r89140j465501n16792p05733o56191N87628K76852m57303
14197F3490444k094529N07262P21120K05660j044130N71761J395857o03366p91696
14188F2358383r61180k490089p86610N2367n4149P14332k40655m5155n84070q15021
14178E7148153j864101k09074J069091l39254K81926N07049p02517m19054j121784
14169E4350435j982178j799079l15094R73495p11157P64818o48424k06025n93200
14160D9833591L14476j280580k311297n01587o16403k86776p58857J198753O99778
$$ y = [101655835, 97402090, 94538765, 91902270, 89287874, 87050511, 85093368, 82571175, 82026563, 80530796, 78431963, 76636779, 75667218, 73404340, 72876606, 71484702, 69357095, 67416624, 66427484, 64961983, 64445191, 63739458, 63083267, 63670895, 63947747, 63490444, 61395915, 61903177, 62624297, 62829957, 61785827, 62357588, 63753445, 63150079, 62358383, 61397203, 58907114, 58120504, 58172871, 58118722, 58833054, 58592399, 58547244, 57963174, 57148153, 55284052, 55074978, 56144069, 55804815, 56086741, 56593790, 55891273, 55472219, 54350435, 52368257, 50569178, 50254084, 51227579, 50516422, 51281240, 50632816, 50426791, 49833591, 50148067, 48867487, 46556190, 46054603, 45438200, 45151424, 44392567, 45591320, 46291098]
14151D6291098j481967j506448j746916J84803J078945O80842n22873q41912j066077
14142D1069495K29964j257418m84122l01743l75965n79036k098429k173716n44103
14133C3484927J75562L10555p36926K18073l99096j599684j683800q81811r76388
14124B7911412j86273O82659l38617j303210j745159O15601Q56879n81265l18957
14115B5593070J81144l51880P2033J025420p4566j046561k205070k17834J50061
14106B3125817K40885p16312R34218j468855j840950j789239r7111K6081j36105
14097A8278429P30484J55865l98694j078493j196862K53498K06150Q61283J292569
14088A9104229k178696j109417r18186l02548K54765j586989J078176l70400j621539
$$ y = [46291098, 44809131, 43302683, 41555767, 41740570, 42819515, 43500357, 42977484, 42135572, 41069495, 41299459, 40042041, 39557919, 39256176, 38880211, 38301175, 36202746, 34029030, 33484927, 33660489, 33971044, 33234118, 33452191, 33053095, 31453411, 29769611, 28887800, 27911412, 27725139, 28407798, 28069181, 26765971, 25020812, 25636413, 26493292, 25912027, 25593070, 25774214, 25422334, 25494367, 26519787, 26445221, 25398660, 23193590, 22975756, 23125817, 23366702, 22650390, 23584608, 22115753, 20274803, 18485564, 18388453, 18414534, 18278429, 19008913, 19164778, 18766084, 17687591, 16490729, 16744227, 16950377, 17811660, 19104229, 16925533, 15816116, 14897930, 14595382, 14850147, 13263158, 14341334, 13970934, 12349395]
14079A2349395K50363L23185J782408O14575P17974l88586j815267j662585l27401
14070A1844061K88949n79769k332356n24704J441955o25475j218784m67084N35251
14061H362044O04748K46835j054528p8238O1618O78397K54594j064149j521445
14052F489876j270309l2769N05343Q04472O01740K03029j232757l74488J4940
14043E709077N45348n28810j971596J0405j143911l19296N17939j002186j059123
14034G57847n35904O84048J666472k67563N20462K4169j321562n23986n78331
14025D25652p1179N33716n52317q46678l48309J560800J319876l339J97349O97391
14015B912962L94519p39904j281663k021632j912701L95680K052867K46277o44004
$$ y = [12349395, 12599758, 12922943, 14705351, 15319926, 16037900, 15649314, 13834047, 12171462, 11844061, 12133010, 11553241, 9220885, 8696181, 10138136, 9512661, 8293877, 7826793, 8362044, 8966792, 9213627, 8159099, 8080861, 8142479, 8820876, 9075470, 8011321, 6489876, 5219567, 5186798, 5692141, 6496613, 7098353, 7301382, 6068625, 5694137, 5709077, 6254425, 5725615, 3754019, 3764424, 2620513, 2301217, 2819156, 1816970, 757847, 221943, 905991, 2572463, 2304900, 2825362, 2849531, 1527969, 1003983, 425652, 354473, 888189, 335872, -510806, -859115, 701685, 2021561, 2018222, 2215571, 2912962, 3307481, 2567577, 1285914, -735718, -2648419, -2252739, -199872, 46405, -597599]
14006e97599L60572J483984J267814k28375j563344J84119J924220M2210j001554
13997A872047Q55494K21916o78460M54967l3369K82794r59588j925549P08704
13988G98956J024668J32470K8072l91842K08973p13983Q58656J136329L29435
13979C411734j560438j82844J559615k49334p85653R58892O81278K90660k42534
13970C881376n48862M94812m11066r58636p98710J924780M59197j643263N16075
13961B915703k64492m14466R845N95080M86374r07788R91817p56975j7982N08877
13951C145993m60195j555989j02822J12980O50287O02154J272630q22759j742013
13942A100266j18145M22531N85589P97985j2349j55932p13154J959624k85487
$$ y = [-597599, -237027, 1246957, 2514771, 2286396, 723052, 907171, 2831391, 2873601, 1872047, 2727541, 2949457, 2270997, 2725964, 2692595, 2975389, 2015801, 90252, 798956, 1823624, 1956094, 1984166, 1592324, 1801297, 1087314, 1945970, 3082299, 3411734, 1851296, 1668452, 3228067, 2978733, 2193080, 3151972, 3833250, 4123910, 3881376, 3332514, 3827326, 3416260, 2457624, 1658914, 3583694, 4042891, 2399628, 2915703, 2651211, 2236745, 2246590, 2841670, 3328044, 2420256, 3412073, 2655098, 2637116, 3145993, 2685798, 1129809, 1026987, 1139967, 1790254, 2392408, 3665038, 2842279, 1100266, 982121, 1404652, 1990241, 2788226, 2775877, 2619945, 1906791, 3866415, 3580928]
13933C580928P46288J270901J4971j228820j162308l34912J56682m82079M8292
13924B609943n81928P17409j572443n4648Q62423P76647N42864m11670L9448K65074
13914C193119p79902o43110J32949J92848P12191N76567p27122m76130j024198
13905A157212k76378J295919j049126O88097R37549L04992n95458l35298j393976
13896G33533r0941k42804o03044p8077M11162L41962N56077L74680N0389J16511
13886A569448L81115j142433p4558l08561j9580M54273J880421L4318l13104p59411
13876A701928L80871o08821q35871r75655j383429j64454J29943M47517k48580
13867a556551N64860O11210j46681j190594n01505P79108O76554N21276P98731
$$ y = [3580928, 4327216, 5598117, 5613088, 4384268, 3221960, 2887048, 3043730, 2561651, 2609943, 2028015, 2745424, 1172981, 1118333, 1980756, 2757403, 3300267, 2888597, 2928045, 3193119, 2413217, 1770107, 1903056, 2095904, 2808095, 3384662, 2657540, 2181410, 1157212, 880834, 2176753, 1127627, 1815724, 2753273, 3058265, 2462807, 2127509, 733533, 642592, 399788, -203256, -281333, 129829, 471791, 1027868, 1402548, 1452937, 1569448, 1950563, 808130, 733572, 425011, 405431, 859704, 2740125, 2774443, 2461339, 1701928, 2082799, 1473978, 638107, -337548, -1720977, -1885431, -1755488, -1307971, -1556551, -991691, -380481, -527162, -1717756, -2219261, -1440153, -763599, -242323, 556408]
13858E56408P38570j61996j164045j089959K6878J829225L57962M68277k63252
13849A298068k08999J125104p25427j717623Q85386l44683j2657m31168o89036
13840h21035m93552k95891J014437J56607J655646n95366j97184J197670R16856
13831B538188K09502k75092q5388J58245n54549j150838O78350J041560l24934
13822B235044l38915r94682K479372n42747l18607R65392R32292j629626j722547
13813A064976M07830K42061r39947j282014n09899Q97585p6573m22183n10549
13804a128713r4203k62280J974846P15364k07531L32213J812103O89184n61732
13795C269251j492894j87254O41026R62584m86648p08472l86796n26548K04059
$$ y = [556408, 1294978, 1132982, -31063, -1121022, -1094144, 735081, 1093043, 1561320, 1298068, 1089069, 2214173, 1488746, -228877, 656509, 311826, 299169, -131999, -821035, -1314587, -1610478, -596041, -439434, 1216212, 620846, 423662, 1621332, 2538188, 2747690, 2472598, 2387210, 2545455, 1990906, 840068, 1518418, 2559978, 2235044, 1896129, 901447, 3380819, 2838072, 2519465, 3484857, 4417149, 2787523, 1064976, 1472806, 1714867, 774920, -507094, -1016993, -119408, -195981, -618164, -1128713, -1222916, -1485196, 489650, 1205014, 997483, 1329696, 3141799, 3830983, 3269251, 1776357, 1589103, 2230129, 3192713, 2706065, 1997593, 1610797, 1084249, 1288308]
13786A288308o57017m1778J515358M46804j15600k08564N85532J56517r52470
13777B017090J79001M6440j206760r21213j125615O53901J375334M81050j58658
13768A340570L71863J475099j635267J206900o88100j254088J070639J197036
13760C084652q14786j183360j05235P28649j65413j206982K46236j397814K81408
13751e32645R75050O53230j55035j45336o23548M1952K78879K86298n69875R44277
13741A153247J585955J62230k374109k072745k13227J082920J236406R9183M14573
13732A074433l10109K84267j307220j307797j232558K763227K434606j317050
13724A081799j52903K88120m97912r7743j068179n8825L19750L44040j213414
$$ y = [1288308, 631291, 589513, 2104871, 2551675, 2436075, 2227511, 2813043, 2969560, 2017090, 2196091, 2242531, 1035771, 114558, -1011057, -357156, 1018178, 1499228, 1340570, 1712433, 3187532, 1552265, 2759165, 2071065, 816977, 1887616, 3084652, 2269866, 1086506, 981271, 1709920, 1544507, 337525, 583761, -814053, -532645, 442405, 1095635, 940600, 795264, 171716, 213668, 492547, 778845, 208970, 1153247, 2739202, 2901432, 527323, -1545422, -1758649, -675729, 560677, 659860, 1074433, 764324, 1048591, -258629, -1566426, -2798984, -35757, 2398849, 1081799, 928896, 1217016, 719104, 621361, -446818, -505643, -185893, 158147, -1055267]
13715a055267l09865M20119J348848L09954l59390K4349l5598j333855J429672
13706D38967P02551o02592J17792Q59623K99475J118637m98716k22937o38454
13697A574346k493420j547492N89577P44097L96050R21944N91567m73445J037523
13688A340747N01072j820870m99455J170784J17802J97532j196465M86329j026487
13679g29011k85834O07511N15734k73718j988288J521405M00684m8037n08562
13670g88116P09053L98149M28151k42246m10462J75221j389039j47680N43170
13661g23799j9060j78449N29298O17038l71094Q25533j19164m28010L51258J65288
13651F48839j176749P39918o20709l55521L74465L55246o92208q01513n27583
$$ y = [-1055267, -1365132, -945013, 403835, 713789, 354399, 378748, 343150, -990705, 438967, 1141518, 538926, 656718, 1516341, 1815816, 2934453, 2435737, 2212800, 1574346, -919074, -2466566, -1876989, -1132892, -736842, 185102, 776669, 303224, 1340747, 1841819, 20949, -478506, 692278, 810080, 1007612, -188853, 297476, -729011, -1014845, -407334, 108400, -165318, -2153606, -632201, -231517, -279554, -788116, -79063, 319086, 747237, 504991, 94529, 269750, -1119289, -1266969, -723799, -742859, -921308, -392010, 225028, -146066, 679467, 560303, 132293, 483551, 648839, -527910, 212008, -408701, -764222, -389757, -34511, -726719, -1528232, -2055815]
13642b055815n80610R70964K17664j54008J55421r84302l74403J770167J655014
$$ y = [-2055815, -2636425, -1665461, -1447797, -1601805, -1446384, -2430686, -2805089, -1034922, 620092]
$$ [...]
##END NTUPLES=NMR SPECTRUM
##END=
