##TITLE=Analysis number 321202
Compound Code cc 46924
Book Reference 422/197
Project Code adrs
Chemist Name robb
##JCAMPDX= 6.0         $$ Bruker NMR JCAMP-DX V2.0
##DATA TYPE= NMR SPECTRUM
##DATA CLASS= NTUPLES
##ORIGIN= Bruker BioSpin GmbH
##OWNER= nmr
$$ XWIN-NMR		Version 3.5
$$ Thu Jul 27 13:22:22 2006 GMT Daylight Time (UT+1h)  MAYBRIDGE\nmr@NMR_250MHZ
##.OBSERVE FREQUENCY= 250.131544655141
##.OBSERVE NUCLEUS= ^1H
##.ACQUISITION MODE= SIMULTANEOUS (DQD)
##.ACQUISITION SCHEME= undefined
##.AVERAGES= 16
##.DIGITISER RES= 18
##SPECTROMETER/DATA SYSTEM= dpx250
##.PULSE SEQUENCE= zg30
##.SOLVENT NAME= CDCl3
##.SHIFT REFERENCE= (INTERNAL, CDCl3, 0, 16.522)
##AUDIT TRAIL= $$ (NUMBER, WHEN, WHO, WHERE, WHAT)
$$ ##TITLE= Audit trail, XWIN-NMR		Version 3.5
$$ ##JCAMPDX= 5.01
$$ ##ORIGIN= Bruker BioSpin GmbH
$$ ##OWNER= nmr
$$ C:\u/data/dgb/nmr/ADRS/3760/pdata/1/auditp.txt
$$ ##AUDIT TRAIL=  $$ (NUMBER, WHEN, WHO, WHERE, WHAT)
(   1,<2006-07-27 13:21:59.52 +100>,<MAYBRIDGE\nmr>,<NMR_250MHZ>,
      <created by zg, POWCHK disabled, PULCHK disabled
       configuration hash MD5:
       E2 DF 36 D8 04 B2 41 60 5A D7 A3 38 5A 4B D0 FE
       data hash MD5: 64K
       6C 0A EC 7C CD 70 2D 5C 58 CC 45 3D BF 10 93 4A>)
(   2,<2006-07-27 13:22:12.85 +100>,<MAYBRIDGE\nmr>,<NMR_250MHZ>,
      <Start of raw data processing
       ef LB = 0.3 FT_mod = 6 PKNL = 1 SI = 32K 
       data hash MD5: 32K
       2A E5 A9 FF 62 44 CE F2 91 BB E4 9E AC A6 C5 9D>)
(   3,<2006-07-27 13:22:14.43 +100>,<MAYBRIDGE\nmr>,<NMR_250MHZ>,
      <apk 
       data hash MD5: 32K
       FE 22 A1 39 B9 9F DC 61 F3 85 C8 FC 77 D8 28 A2>)
(   4,<2006-07-27 13:22:15.25 +100>,<MAYBRIDGE\nmr>,<NMR_250MHZ>,
      <abs ABSG = 5 
       data hash MD5: 32K
       E8 3A AF AB CB 12 74 BE 1C 86 5F 3A B7 D1 8F D5>)
$$ ##END=
$$ 
$$ hash MD5
$$ 68 5D E0 B0 83 F8 86 84 73 43 BA E1 23 F9 11 DE
##$RELAX= 
##$RELAX= 
##$RELAX= 
##$RELAX= 
##$RELAX= 
##$RELAX= 
##$RELAX= 
$$ Bruker specific parameters
$$ --------------------------
##$DU= <C:\u>
##$EXPNO= 3760
##$NAME= <ADRS>
##$PROCNO= 1
##$TYPE= <nmr>
##$USER= <dgb>
##$AMP= (0..31)
100 100 100 100 100 100 100 100 100 100 100 100 100 100 100 100 100 100 
100 100 100 100 100 100 100 100 100 100 100 100 100 100 
##$AQSEQ= 0
##$AQ_mod= 3
##$AUNM= <au_zg>
##$AUTOPOS= <34 >
##$BF1= 250.13
##$BF2= 250.13
##$BF3= 250.13
##$BF4= 250.13
##$BF5= 500.13
##$BF6= 500.13
##$BF7= 500.13
##$BF8= 500.13
##$BYTORDA= 1
##$CFDGTYP= 0
##$CFRGTYP= 5
##$CHEMSTR= <none>
##$CNST= (0..31)
1 1 145 1 1 1 1 1 1 1 1 1 1 1 1 1 1 1 1 1 1 1 1 1 1 1 1 1 1 1 1 1 
##$CPDPRG= <>
##$CPDPRG1= <>
##$CPDPRG2= <>
##$CPDPRG3= <>
##$CPDPRG4= <mlev>
##$CPDPRG5= <mlev>
##$CPDPRG6= <mlev>
##$CPDPRG7= <mlev>
##$CPDPRG8= <mlev>
##$CPDPRGB= <>
##$CPDPRGT= <>
##$D= (0..31)
0 1 0 0 0 0 0 0 0 0.06 0 0 0 0 0 0 0.0002 0 0 0 0 0 0 0 0 0 0 0 0 0 0 
0 
##$DATE= 1154002918
##$DBL= (0..7)
120 120 120 120 120 120 120 120 
##$DBP= (0..7)
150 150 150 150 150 150 150 150 
##$DBP07= 0
##$DBPNAM0= <>
##$DBPNAM1= <>
$$ [...]
##$SUBNAM7= <"">
##$SUBNAM8= <"">
##$SUBNAM9= <"">
##$SW= 20.6930455092707
##$SWIBOX= (0..15)
0 0 3 0 0 0 0 0 0 0 0 0 0 0 0 0 
##$SW_h= 5175.983436853
##$TD= 65536
##$TD0= 1
##$TE= 295.16
##$TE2= 300
##$TE3= 300
##$TEG= 300
##$TL= (0..7)
0 120 120 120 120 120 120 120 
##$TP= (0..7)
150 150 150 150 150 150 150 150 
##$TP07= 0
##$TPNAME0= <>
##$TPNAME1= <>
##$TPNAME2= <>
##$TPNAME3= <>
##$TPNAME4= <>
##$TPNAME5= <>
##$TPNAME6= <>
##$TPNAME7= <>
##$TPOAL= (0..7)
0.5 0.5 0.5 0.5 0.5 0.5 0.5 0.5 
##$TPOFFS= (0..7)
0 0 0 0 0 0 0 0 
##$TUNHIN= 0
##$TUNHOUT= 0
##$TUNXOUT= 0
##$USERA1= <user>
##$USERA2= <user>
##$USERA3= <user>
##$USERA4= <user>
##$USERA5= <user>
##$V9= 5
##$VALIST= <valist>
##$VCLIST= <CCCCCCCCCCCCCCC>
##$VD= 0
##$VDLIST= <DDDDDDDDDDDDDDD>
##$VPLIST= <PPPPPPPPPPPPPPP>
##$VTLIST= <TTTTTTTTTTTTTTT>
##$WBST= 1024
##$WBSW= 4
##$XGAIN= (0..3)
0 0 0 0 
##$XL= 0
##$YL= 0
##$YMAX_a= 329852
##$YMIN_a= -523545
##$ZGOPTNS= <>
##$ZL1= 120
##$ZL2= 120
##$ZL3= 120
##$ZL4= 120
##$ABSF1= 16.522
##$ABSF2= -4.171173
##$ABSG= 5
##$ABSL= 3
##$ALPHA= 0
##$AQORDER= 0
##$ASSFAC= 0
##$ASSFACI= 0
##$ASSFACX= 0
##$ASSWID= 0
##$AUNMP= <proc_1d>
##$AZFE= 0.1
##$AZFW= 0.1
##$BCFW= 0
##$BC_mod= 0
##$BYTORDP= 0
##$COROFFS= 0
##$CY= 12.5
##$DATMOD= 1
##$DC= 0
##$DFILT= <>
##$DTYPP= 0
##$F1P= 14.0000005364418
##$F2P= -0.99999901652339
##$FCOR= 0.5
##$FTSIZE= 32768
##$FT_mod= 6
##$GAMMA= 0
##$GB= 0
##$INTBC= 1
##$INTSCL= 1
##$ISEN= 128
##$LB= 0.3
##$LEV0= 0
##$LPBIN= 0
##$MAXI= 10000
##$MC2= 0
##$MEAN= 0
##$ME_mod= 0
##$MI= 0
##$NCOEF= 0
##$NC_proc= -4
##$NLEV= 6
##$NOISF1= 0
##$NOISF2= 0
##$NSP= 0
##$NTH_PI= 0
##$NZP= 0
##$OFFSET= 16.522
##$PC= 1
##$PHC0= 168.3215
##$PHC1= 7.675341
##$PH_mod= 1
##$PKNL= yes
##$PPARMOD= 0
##$PSCAL= 4
##$PSIGN= 0
##$REVERSE= no
##$SF= 250.13
##$SI= 32768
##$SIGF1= 0
##$SIGF2= 0
##$SINO= 400
##$SIOLD= 32768
##$SREGLST= <1H.CDCl3>
##$SSB= 0
##$STSI= 32768
##$STSR= 0
##$SW_p= 5175.98343685301
##$SYMM= 0
##$S_DEV= 0
##$TDeff= 65536
##$TDoff= 0
##$TI= <Analysis number 999999
Compound Code 99
Book Reference 9
Project Code 9>
##$TILT= no
##$TM1= 0
##$TM2= 0
##$TOPLEV= 0
##$USERP1= <user>
##$USERP2= <user>
##$USERP3= <user>
##$USERP4= <user>
##$USERP5= <user>
##$WDW= 1
##$XDIM= 32768
##$YMAX_p= 272681379
##$YMIN_p= -439507
$$ End of Bruker specific parameters
$$ ---------------------------------
##NTUPLES= NMR SPECTRUM
##VAR_NAME=  FREQUENCY,     SPECTRUM/REAL,   SPECTRUM/IMAG
##SYMBOL=    X,             R,               I
##VAR_TYPE=  INDEPENDENT,   DEPENDENT,       DEPENDENT
##VAR_FORM=  AFFN,          ASDF,            ASDF
##VAR_DIM=   32768,         32768,           32768
##UNITS=     HZ,            ARBITRARY UNITS, ARBITRARY UNITS
##FACTOR=    0.157963299565203, 1,           1
##FIRST=     4132.6476996994, 0,             0
##LAST=      -1043.33573715361, 0,           0
##MIN=       -1043.33573715361, -439507,     0
##MAX=       4132.6476996994, 272681379,     0
$$ Real data points
##PAGE= N=1
##DATA TABLE= (X++(R..R)), XYDATA
$$ [...]
18206D09529J7159k2111j0548q4864L0543L8892J2541J3372K596N291R236p1021
18194C50615j30855J00412J20463J1536N1070J6728m3881j2779o6395n4105N4402
18183C97211J59250L0254r5089k734o7915j1622M0910j10881P6958j48400N0583
18172C18525K27591K3775o2856L535m5905L1618O9368K3040K8162Q9744P7425
18161G84022M1426M3522p47j53694o7517r780P2331J26828O3261K1999Q1476N3486
18149A056613l728J4053N5856n0004P3096J11180K28440P356R8483K17817J44765
18138A953927J78248J30916K56193L05309L83781L60028L00031M02899M34034
18129D705366M69274N67016N28035P69873Q65295J088075J167198J419520J583291
$$ y = [409529, 426688, 404577, 394029, 309165, 339708, 378600, 391141, 404513, 407109, 412400, 421636, 350615, 219760, 320172, 440635, 452171, 503241, 519969, 476088, 463309, 396914, 342809, 397211, 556461, 586715, 491626, 488892, 420977, 409355, 450265, 339384, 416342, 267942, 318525, 546116, 569891, 507035, 510570, 464665, 496283, 565651, 588691, 616853, 706597, 784022, 825448, 868970, 868223, 714529, 647012, 637232, 709563, 836391, 899652, 921651, 1003127, 1056613, 1052885, 1066938, 1122794, 1072790, 1145886, 1257066, 1485506, 1492862, 1591345, 1809162, 1953927, 2132175, 2263091, 2519284, 2824593, 3208374, 3568402, 3868433, 4271332, 4705366, 5174640, 5741656, 6269691, 7039564, 7904859, 8992934, 10160132, 11579652, 13162943]
18120A3162943J833753K331341K672822K740587K277687J260010R48749J505474
18112B8733366K423198L367145L451933J224768j587793k951667l224832l380924
18104B8055194l421064l219762k710892j992422j526060j135115q98002q64492
18096A2287385p43076p69084o88744o09276n87383n21263m98628l99542l60236
18087G110153l73647l55922k56994k36195k10966j68756k38658l66426k66056
18078D636533k45249j01763j07294j48342j49300j48004j57351r6334p3559n7579
18068C351758l3941j04776r8437o2056j39314l9698J250n910J6343L0006N5616
18057B970841k0484k14074j08166L6006k0956q1542L8629N8247l9728P0524j5150
$$ y = [13162943, 14996696, 17328037, 20000859, 22741446, 25019133, 26279143, 27227892, 28733366, 31156564, 34523709, 37975642, 39200410, 37612617, 34660950, 31436118, 28055194, 24634130, 21414368, 18703476, 16711054, 15184994, 14049879, 13151877, 12287385, 11544309, 10775225, 10086481, 9477205, 8889822, 8368559, 7869931, 7470389, 7110153, 6736506, 6380584, 6123590, 5887395, 5676429, 5507673, 5269015, 4902589, 4636533, 4391284, 4289521, 4182227, 4033885, 3884585, 3736581, 3579230, 3482896, 3409337, 3351758, 3317817, 3213041, 3114604, 3052548, 2913234, 2873536, 2874786, 2868876, 2885219, 2915225, 2970841, 2950357, 2736283, 2628117, 2664123, 2643167, 2561625, 2600254, 2658501, 2618773, 2689297, 2674147]
18046B674147L1231J44963k0118k00805r3298r0715k4423J31648P5991k1586J0311
18035B617346m2583R727P508o2946l4357j1367k6819K8960R8957l1310j16659
18024B436457L4857N143r2875o2390R4551M5955R0919N6324L9504k0123l539L7187
18012B661970l2566M7183P0478n1168j32318P8441l766M880J35621M5m1358k7283
18000B710159K370l9130p4490k9444J1100L3943P4881j5410n5741J925j55575
17989B464588j39207o0416r2883n5880p1784o6172k5579k2602l7886j40058p6200
17978A675921n5698j08393J7672J23684k9063j58897L2362o369L8315m8100l0011
17967A451423m0130L9900j06618p1168M6826P8774Q7693r8406j66062O4106R1160
$$ y = [2674147, 2705378, 2850341, 2830223, 2629418, 2536120, 2445405, 2420982, 2552630, 2628621, 2607035, 2617346, 2574763, 2584490, 2591998, 2529052, 2494695, 2483328, 2456509, 2485469, 2584426, 2553116, 2436457, 2471314, 2476457, 2383582, 2321192, 2415743, 2461698, 2552617, 2608941, 2648445, 2628322, 2624783, 2661970, 2629404, 2676587, 2747065, 2695897, 2563579, 2642020, 2638254, 2643134, 2778755, 2778800, 2737442, 2710159, 2712529, 2673399, 2598909, 2569465, 2580565, 2614508, 2689389, 2673979, 2618238, 2620163, 2464588, 2325381, 2264965, 2172082, 2116202, 2044418, 1978246, 1952667, 1930065, 1892179, 1752121, 1675921, 1620223, 1511830, 1529502, 1653186, 1624123, 1465226, 1497588, 1491219, 1529534, 1481434, 1451423, 1411293, 1451193, 1344575, 1273407, 1320233, 1399007, 1486700, 1388294, 1222232, 1286338, 1377498]
17956A377498j31672p6472j0943k1618J1542j3734L0766k4432K2650o9037p3671
17945A020877K5505k7204P643O8682N7095o7324r4262N8430r488R347k9801r595
17933A009905K1475L1420l3806n4933M4011n3855O8840N4341j9900q8201q1946
17922H97351p9731J01510O4323l1390j6650j05413j04502N2666k0061k9807R1687
17911H19983N5660q7261q7048J956r023M6760P5547l9344k6304j81276j35270
17900D34380R0942j1610m9004M5240M9693n3375j18454p686R3697K9502j10261
17889C93064K0863l9006J7313l8445L0116J3356p9732r2967j6822k3463j4862
17878A69415j3175l5324L6018P9964r84m097O4748k4891j2886J52525J60939o8891
$$ y = [1377498, 1245826, 1169354, 1158411, 1136793, 1148335, 1134601, 1165367, 1140935, 1163585, 1094548, 1020877, 1046382, 1019178, 1026821, 1095503, 1152598, 1085274, 991012, 1049442, 1039954, 1049301, 1019500, 1009905, 1031380, 1062800, 1028994, 974061, 1018072, 964217, 1033057, 1087398, 1067498, 979297, 897351, 817620, 919130, 983453, 952063, 935413, 830000, 725498, 778164, 758103, 728296, 819983, 875643, 788382, 701334, 703290, 694267, 741027, 816574, 777230, 750926, 569650, 434380, 525322, 513712, 464708, 509948, 559641, 506266, 387812, 380126, 473823, 503325, 393064, 413927, 374921, 392234, 353789, 383905, 397261, 317529, 224562, 207740, 184277, 169415, 156240, 120916, 156934, 236898, 235914, 231817, 296565, 271674, 258788, 411313, 572252, 503361]
17866E03361n9832J02948J48858K4878q7071l4997J6757Q9604n6l9428q2984L836
17854E85874m6292J6080L8734j14070J00722Q7361j17775o8065j07992q916J67183
17843E32844J30946o2259j21439l9747p5k381n4765l8239P9763N5420l8945l1476
17831D09647O9205n4213r564J4651k6437n9582n6058q463j5665r584K8513N9388
17819C41838M3877Q701n1094j1529m6966q3391k8238Q1166N248m3374J14144O3825
17807C94207K1735k4049L5266L9927n0473j559L1615n5630L7947j005n877o7712
17795C54392n3980L6907O3636J7150l508K9318m07J5447k854p7862L0302q809
17783C99732n667j4148l6881J07551K2022J1127n7960q9935M250J5262l3611r4187
$$ y = [503361, 443529, 546477, 695335, 720213, 633142, 598145, 614902, 704506, 704450, 665022, 582038, 585874, 539582, 555662, 594396, 480326, 581048, 668409, 550634, 482569, 374577, 365661, 532844, 663790, 601531, 480092, 440345, 440270, 437889, 383124, 344885, 424648, 480068, 441123, 409647, 478852, 424639, 415075, 429726, 403289, 343707, 287649, 279186, 263521, 253937, 282450, 341838, 385715, 394416, 343322, 331793, 284827, 201436, 173198, 254364, 259612, 216238, 330382, 394207, 415942, 391893, 427159, 467086, 416613, 415054, 446669, 391039, 428986, 427981, 422104, 354392, 300412, 337319, 400955, 418105, 414597, 443915, 443508, 458955, 456101, 378239, 408541, 399732, 394065, 379917, 343036, 450587, 472609, 483736, 425776, 335841, 340091, 355353, 321742, 227555]
17771B27555O0185O5692Q2276j8379p4059M5597Q3468M8725j43938q9006l470
17760B84646K8826n607J6175N6582N8666j08118j04047l4500J7334R308O6968
17749B86233L1676q7024r2827O3388J00860K4518n0677j15259j2432k6062O3237
17738A85631K6772O1149n3303k9163J58312N8421q6324L5345n7496j52836p4442
17727G2066p8035l438J60119o264Q944l1216J5978O51m813k1725R5829j4592r07
17714A92597K6391j9482n0339n0644P2628J7749J8304m85K4115o7363k1779l6648
17702A05044J4959P0291j9562K5166J17348M961j39630P8187L3365N063o7466
17691B27726q7536L4053J09071P776m5582L0231N4894J2502o0438j03758m033
$$ y = [227555, 287740, 353432, 435708, 417329, 343270, 388867, 472335, 521060, 377122, 288116, 284646, 313472, 307865, 324040, 380622, 439288, 331170, 227123, 192623, 209957, 219265, 286233, 317909, 230885, 138058, 201446, 302306, 326824, 276147, 160888, 148456, 122394, 185631, 212403, 273552, 220249, 191086, 349398, 407819, 321495, 356840, 299344, 146508, 72066, -5969, -9407, 150712, 144448, 153392, 122176, 138154, 138805, 133992, 112267, 208096, 193504, 192597, 218988, 199506, 149167, 98523, 171151, 188900, 207204, 206719, 230834, 163471, 141692, 105044, 120003, 190294, 170732, 195898, 313246, 318207, 178577, 256764, 290129, 295192, 227726, 140190, 174243, 283314, 291090, 245508, 275739, 330633, 343135, 282697, 178939, 174906]
17680A74906J33328r2380j18731Q8916L6570l7506m6926o2199m7046K3827r2010
17669c9251p227L9804J18796J01831o9367j61787p4275L9596J66840R1653m5105
17658A61508k90K6716Q453p8061k6725n172k3814J30207J380k7977J5227L0222
17646B11674j8515O0688N1950l4070j23878j7237K0228P6263M0984L7833L1157
17635C37077j19169m4265o358j8766K8179j6599P5603J7685q9368j1247k1808
17624A30964Q947J8968J58562P0341q5028p0858q893p4097k2027o5276K4249J45133
17612B30985L7114r1262j14538l435L0021K0190k9934L8702J09709Q3811J02354
17601D13717J3991j6088j00174r8168j06394O8524M9070L7363M8190q0830j10320
$$ y = [174906, 308234, 215854, 97123, 186039, 222609, 185103, 138177, 75978, 28932, 52759, -39251, -46478, -6674, 112122, 213953, 144586, -17201, -91476, -51880, 114960, 206613, 161508, 161218, 187934, 196387, 118326, 91601, 86429, 62615, 192822, 194202, 166225, 181452, 211674, 193159, 253847, 305797, 271727, 147849, 130612, 150840, 227103, 268087, 305920, 337077, 217908, 173643, 167285, 148519, 176698, 160099, 235702, 253387, 164019, 152772, 130964, 139911, 158879, 317441, 387782, 302754, 231896, 223003, 148906, 126879, 61603, 85852, 230985, 268099, 176837, 62299, 58864, 88885, 109075, 79141, 117843, 227552, 311363, 413717, 427708, 411620, 311446, 213278, 106884, 175408, 224478, 261841, 310031, 229201, 118881]
17590A18881P1262L8199L081n695P909O0848M9220M3638k2654n3690n4720N3459
17578C09738N6541n9410N2804o3931N375N3561O2850k7388Q287r8552k7115M66
17566B73226k097N728M0389J10232l6433n1224N9535J7667p5291K6579K4995m0450
17554C52856L3191r1027L5857J70137Q1564l9410p3880m9463R4958j9699R43j6595
17542D79432r7903j5292M0687l2009o932m1699M5523K4806j44621j2431K0086
17531B59647p8292o6064m3573O8652N9541m4968L5444L9989P2699J42614N4597
17520E00286j1683j22539o7478Q039L0494K2954m2580m4710n9043O4367J45038
17509D23145N7099j0100O1710O7759p713K9379O4404L6316q2552j6225k051N3401
$$ y = [118881, 190143, 228342, 231423, 225728, 233637, 294485, 343705, 387343, 364689, 310999, 256279, 309738, 366279, 306869, 359673, 295742, 301117, 354678, 417528, 390140, 398427, 299875, 272760, 273226, 271129, 276857, 317246, 427478, 391045, 339821, 399356, 417023, 341732, 368311, 393306, 352856, 386047, 295020, 330877, 501014, 582578, 543168, 469288, 419825, 514783, 495084, 496027, 479432, 381529, 366237, 406924, 374915, 367983, 326284, 371807, 396613, 251992, 239561, 259647, 181355, 115291, 71718, 140370, 199911, 154943, 190387, 230376, 303075, 445689, 500286, 488603, 366064, 298586, 306625, 337119, 360073, 317493, 272783, 213740, 278107, 423145, 480244, 470144, 531854, 599613, 591900, 621279, 685683, 721999, 639447, 623222, 621171, 674572]
17497F74572m6912J6976r484r7140k260K9633L8529m9345l0598j4392k1366M708
17485D92921J4906R2916m4181m9951o3399q5149k7639J44517N0160k7551k773
17474D94777N9843q9369K2526Q9505O4891J11794k1076o2996L040j4564K0085
17463F78456o1451r2569L7180k3274m9000L7104o6330l6075M3661L2710L0065
17452E30477Q7178J08598k2476n8450m9887r9856p5819k3323M5463O2497M2024
17441E46426j03594K0281N7257r415k9437o6045j4185q2504J833o9259j18539
17430A32819J26154Q1474q8429J8477Q4937o9317l9375m3830n5601M9526L4242
17419B31077L9005m84L1108O767p2086q2681N4155M0270n7265r6504J7176J21291
$$ y = [674572, 627660, 644636, 635152, 538012, 535752, 565385, 603914, 554569, 523971, 509579, 488213, 492921, 507827, 600743, 556562, 506611, 443212, 358063, 330424, 474941, 525101, 497550, 494777, 554620, 465251, 487777, 577282, 642173, 753967, 732891, 669895, 672935, 658371, 678456, 617005, 524436, 561616, 538342, 489342, 526446, 460116, 424041, 467702, 500412, 530477, 617655, 726253, 703777, 645327, 595440, 495584, 419765, 396442, 441905, 504402, 546426, 442832, 463113, 520370, 510955, 481518, 415473, 401288, 318784, 320617, 251358, 132819, 258973, 340447, 252018, 270495, 355432, 286115, 246740, 202910, 147309, 196835, 231077, 270082, 269598, 300706, 307473, 235387, 152706, 206861, 247131, 189866, 93362, 110538, 231829]
17407B31829O1414o9708k5501K328k0616N6213M0038l9002M433R193L1095N7309
17395C39025l5600j13669l2170K6899R5897L8598J3354r105q8826J0527R218j8147
17383B36001p9863n2815J7683J10256K1574J1736J642J3000P7996K0092q3346
17372B93956q9706L458l5530M2037K8952O3074J0456p4750l3085J00054K0942
17361C29858k0404r249k8926p4164O9780J64228J00659j8999j20750J6303j09449
17350B98887L0615M6214p7550K3032p689j2488K3281K5373P9553q547n5065M4954
17338D10570N4007L5133m2697n9926j01496l2957p599l9501P098J22159J27346
17327D72137j27956j07084O0437k1669J03604J15298j22112q6527K5363R9682
$$ y = [231829, 293243, 223535, 198034, 200362, 179746, 235959, 275997, 236995, 241428, 250621, 281716, 339025, 303425, 189756, 157586, 184485, 280382, 318980, 332334, 323229, 234403, 244930, 254148, 236001, 156138, 103323, 121006, 231262, 252836, 264572, 266214, 279214, 357210, 377302, 293956, 204250, 207708, 172178, 214215, 243167, 306241, 316697, 241947, 208862, 308916, 329858, 309454, 300205, 271279, 197115, 266895, 431123, 531782, 512783, 392033, 408336, 298887, 329502, 375716, 298166, 321198, 313509, 301021, 324302, 349675, 429228, 420681, 365616, 410570, 464577, 499710, 457013, 397087, 295591, 262634, 255035, 215534, 222632, 344791, 472137, 344181, 237097, 297534, 275865, 379469, 494767, 372655, 286128, 311491, 411173]
17317D11173L4588l5318l6188P970o2398l7045J05481L6577o24K2975l5794J90
17305D11587q264J791m3646R8172L8420j3111n3064J87970Q1320o7455J1658M3221
17293F88599l750p6376r1663K0541O4434r396n5584p4432m1718r652M4337P182
17281D62522p7855L4690j637l6948K7895L0646M6758J54919L3613l0887o1971
17270E81745J5014J11269Q2696M646j60300p1724K4913m0897o6340j5525K8140
17259D93637k22n9409m1540p046J4525j6869r2065k1574k0014m7147j3461J48690
17247C37505K1873k8167O3245l1855j5319K2179m540k9413l1692R7408l594n0306
17235C47324p4128p8259N5550P0886Q9843Q7583r9175J7355O3299o0266N0858
$$ y = [411173, 445761, 410443, 374255, 382225, 319827, 282782, 388263, 424840, 424216, 447191, 411397, 411587, 403323, 405114, 361468, 459640, 498060, 484949, 431885, 619855, 701175, 633720, 645378, 688599, 684849, 608473, 516810, 537351, 601785, 592389, 536805, 462373, 420655, 411003, 455340, 462522, 384667, 419357, 417720, 380772, 408667, 439313, 486071, 640990, 674603, 643716, 581745, 596759, 708028, 790724, 795370, 635070, 563346, 588259, 547362, 481022, 465497, 493637, 493415, 434006, 392466, 385420, 399945, 383076, 291011, 269437, 249423, 202276, 188815, 337505, 359378, 331211, 394456, 362601, 347282, 369461, 364921, 335508, 303816, 401224, 397630, 347324, 273196, 194937, 250487, 321373, 411216, 498799, 399624, 416979, 480278, 420012, 470870]
17224D70870K6090L5387K9093J092N4843o352j31791m6509O8030k904k2431j10110
17212C65308J02091n7280j04427R3354J84458J8769p289n8679R649L1278K1433
17201E98665k3503n8009l8262m9462k6093K0255O2282M0901j1922O4941q6245
17190D93548n663R9627l2049J6313J17092J18035N9790j37229j04162o9704q9808
17179D65790Q4186P3653J2212m8964R8004Q2804M1694Q5939O1557n8119r7967
17168H00789o7539K1366R4313J16392K5715l7616n6007o371k3663L264L7244O4864
17156I72751k8535M3204J11937J7225o974n1803p5975J034J10956J18278M3102
17145A255200l4633k5423J0590N1308O316J471K462J22742K2958p9550J6134o591
$$ y = [470870, 496960, 532347, 561440, 562532, 617375, 611023, 479232, 432723, 500753, 497849, 475418, 365308, 467399, 410119, 305692, 399046, 583504, 602273, 594984, 536305, 545954, 577232, 598665, 575162, 517153, 478891, 429429, 403336, 423591, 485873, 526774, 514852, 579793, 493548, 487885, 587512, 555463, 571776, 688868, 806903, 866693, 729464, 625302, 555598, 465790, 549976, 623629, 635841, 586877, 684881, 767685, 809379, 895318, 956875, 898756, 800789, 733250, 754616, 848929, 965321, 991036, 953420, 897413, 891042, 867379, 870643, 907887, 972751, 944216, 987420, 1099357, 1116582, 1109608, 1057805, 981830, 982864, 1093820, 1212098, 1255200, 1220567, 1195144, 1205734, 1257042, 1263358, 1264829, 1267291, 1390033, 1412991, 1333441, 1349575, 1342984]
17133A342984q251n0680j38565j1499K9698r5098k1000O9171l2425l7609r5871
17122I50855k2500M8449n5892n0685L3690N3001J508k4107M3729N5342J31250
17111A164640K8348j10890L145L7910O0042l0525J60685K84494K30597L3250m091
17100A857605n3376Q6862J56658M4568J11839Q4357m290J11229J3172J55452J48262
17089B712338P8705J7037m3831j4740J67178Q7109J01455q343K2877L5020k1924
17078C132881r3248n4577j6372o6434o0336j4259N7773P606l8339j2623n2519
17067B789553O224l65K055N891M9554N5538J8990O3380j1659k701J52814J44812
17055C274086J6154N1992M2352J72069J14493R6486J17890J90350K46000K77959
$$ y = [1342984, 1334733, 1284053, 1145488, 1133989, 1163687, 1068589, 1047589, 1116760, 1084335, 1046726, 950855, 928355, 976804, 920912, 870227, 903917, 956918, 958426, 934319, 978048, 1033390, 1164640, 1192988, 1082098, 1085243, 1123153, 1183195, 1152670, 1313355, 1597849, 1828446, 1861696, 1857605, 1804229, 1891091, 2047749, 2092317, 2204156, 2288513, 2284223, 2395452, 2408624, 2564076, 2712338, 2791043, 2808080, 2764249, 2749509, 2916687, 3003796, 3105251, 3096908, 3119785, 3154805, 3132881, 3039633, 2985056, 2968684, 2902250, 2841914, 2827655, 2885428, 2893034, 2854695, 2842072, 2789553, 2795777, 2795412, 2797467, 2803358, 2852912, 2908450, 2927440, 2990820, 2979161, 2976460, 3129274, 3274086, 3290240, 3342232, 3384584, 3556653, 3671146, 3767632, 3885522, 4075872, 4321872, 4599831]
17045D599831L67011L44189K94259M07446M65935O10357O10501N57829O86504
17036H943862Q76714J123917J190645J375266J661758J769186J927356J959652
17028B0828356J812722J791660K088057K492564K631574K403436J621322Q38027
17020C6507718N27370O61868N64831J6084q18000j132031r34690o77076k71391
17011C4444683K23975R09563J610367J730493J797684J869275J930843K495334
17003D7012217K977985L008983K411584R84613l09966m94954l23045r78467k376547
16994E1912403l438163l882883l801679l486737l205709k752764k321005j933310
16986B7090153j529516j285813j056579q51961r54611p85334n72988n28319m80153
$$ y = [4599831, 4966842, 5311031, 5605290, 6012736, 6478671, 7089028, 7699529, 8257358, 8943862, 9820576, 10944493, 12135138, 13510404, 15172162, 16941348, 18868704, 20828356, 22641078, 24432738, 26520795, 29013359, 31644933, 34048369, 35669691, 36507718, 37035088, 37696956, 38261787, 38277871, 37459871, 36327840, 35393150, 34716074, 34444683, 34668658, 35578221, 37188588, 38919081, 40716765, 42586040, 44516883, 47012217, 49990202, 52999185, 55410769, 56395382, 56085416, 55590462, 55267417, 54288950, 51912403, 48474240, 44591357, 40789678, 37302941, 34097232, 31344468, 29023463, 27090153, 25560637, 24274824, 23218245, 22366284, 21411673, 20626339, 20053351, 19525032, 19044879]
16977A9044879l05402j65609R3269J34017J56114K60192L00394L93164N24175
16968B0435193N32418P05167Q30370R75294J159964J251992J496257J716323K095273
16959C1198251K519225L023968L458520L930894M501453N013758N199681N179079
16951F4024829N024323M726912M843912N245676N523925N412524M575116K939097
16943A02316314Q25789j182436k718366l905898m760186m878911m053199k548081
16935G9095026r72953L51110L79840r38954j846603j799064j578129j994979k276400
16926F8418894k062435j158706o0351J102569J561240P67898q55501j834466k076640
16917F3802502k563775k596567j970440j068943l00135J53593l8919q99526j345532
$$ y = [19044879, 18739477, 18573868, 18667137, 18801154, 18957268, 19217460, 19517854, 19911018, 20435193, 20967611, 21672778, 22503148, 23478442, 24638406, 25890398, 27386655, 29102978, 31198251, 33717476, 36741444, 40199964, 44130858, 48632311, 53646069, 58845750, 64024829, 69049152, 73776064, 78619976, 83865652, 89389577, 94802101, 99377217, 102316314, 103142103, 101959667, 99241301, 95335403, 90575217, 85696306, 81643107, 79095026, 78122073, 78473183, 78853023, 77914069, 76067466, 74268402, 72690273, 70695294, 68418894, 66356459, 65197753, 65137402, 66239971, 67801211, 68569109, 67713608, 65879142, 63802502, 61238727, 58642160, 56671720, 55602777, 55302642, 55456235, 55417316, 54517790, 53172258]
16908E3172258j344246j322196j504239j738862j575757j056527l43115L03031
16900D4590347J96152q82371j808130k017171k065812k165953k202318k058787
16892C1585957j711862j418615j193281q79829p84689q08624p32831o26389o34018
16883B2795819p59804o93771n52300m64566l90747l92155m98755m07171l73066
16874A8263484l47912l69489m03457k61256l67765l30647j78044j91216k08412
16865A5605286k07476j72687j62718j14836j49577j0648o4895m2924p8133j53609
16855A4447783r6381k7156l5194K738o8682l9125J8525O875j4829p027m1516n0904
16843A4095107K03J2984J0470j06869j42305j21636R8997m1483j40872m5163R0619
$$ y = [53172258, 51828012, 50505816, 49001577, 47262715, 45686958, 44630431, 44287316, 44590347, 44786499, 43904128, 42095998, 40078827, 38013015, 35847062, 33644744, 31585957, 29874095, 28455480, 27262199, 26382370, 25597681, 24789057, 24056226, 23429837, 22795819, 22036015, 21342244, 20789944, 20325378, 19934631, 19542476, 19043721, 18636550, 18263484, 17915572, 17546083, 17142626, 16881370, 16513605, 16182958, 16004914, 15813698, 15605286, 15397810, 15225123, 15062405, 14947569, 14797992, 14787344, 14722449, 14679525, 14601392, 14447783, 14351402, 14324246, 14289052, 14291790, 14223108, 14183983, 14202508, 14209383, 14194554, 14187527, 14146011, 14095107, 14095310, 14108294, 14118764, 14011895, 13869590, 13747954, 13846951, 13805468, 13664596, 13619433, 13710052]
16832A3710052q4016r645K8033K6360j41924j16920j30432j80878r4096n8609
16822A2947925r0718q9078k70696k19799j96255j82754j10158q2965j82295r2861
16812A1430346j18668p0786k76740k12092r0239p8620j66147j37128j51242p5921
16802A0052763k7277r8911j68081j52222j2013m7740m2537r5809j19693k20858
16792I067622k01096k22064j56587j36576k22583k17559j63144j08110q4109q6963
16782G468831j89648j64385j85556p8858j25801k40165q5793j19103j02272p9087
16772F098163r7628j33134k12466j28204o6128k598P476q8451j33372o260p7900
16761E159498l0198J6196p2220k2625k8992q943j13239o8384l2211p2684p4021
$$ y = [13710052, 13626036, 13616391, 13644424, 13670784, 13528860, 13411940, 13281508, 13100630, 13006534, 12947925, 12857207, 12768129, 12497433, 12277634, 12081379, 11898625, 11788467, 11705502, 11523207, 11430346, 11311678, 11240892, 10964152, 10752060, 10661821, 10583201, 10417054, 10279926, 10128684, 10052763, 10025486, 9926575, 9758494, 9606272, 9594259, 9546519, 9503982, 9408173, 9288480, 9067622, 8866526, 8644462, 8487875, 8351299, 8128716, 7911157, 7748013, 7639903, 7555794, 7468831, 7279183, 7114798, 6929242, 6850384, 6724583, 6484418, 6398625, 6279522, 6177250, 6098163, 6000535, 5867401, 5654935, 5526731, 5460603, 5458005, 5465481, 5377030, 5243658, 5237398, 5159498, 5129300, 5145496, 5073276, 5050651, 5021659, 5012716, 4899477, 4831093, 4798882, 4726198, 4652177]
16750D652177j52473j23327r3947n1797n5380q2966j8356O0092j36464j70086
16740C827473j14348o5349J7752j03546p4491k6835l2101p2176N9481O208n4936
16729C367132r8194n6645o4272j47896q1740j1167J5377l6749n6488n0796m3705
16718B734857j35165j50261R520L0283p5741r5608m787q002o4515r2836q2510
16707B065235j31944p3163R7700k2602q5582k3598k1679q062q4433P4395P4864
16696A861131j66810j80481j0445K1334L0259o6481k03017k7507J06975N9240
16686A424198n3299q8252O977L150k1926Q3184R6350p2276l9460p5774q862P1451
16674A325461J2277r3596p9117R9591r409k4193P3298R4467k6081j03228q2426
$$ y = [4652177, 4499704, 4376377, 4282430, 4230633, 4175253, 4092287, 4073931, 4134023, 3997559, 3827473, 3713125, 3647776, 3665528, 3561982, 3487491, 3460656, 3428555, 3356379, 3415860, 3422068, 3367132, 3268938, 3212293, 3148021, 3000125, 2918385, 2907218, 2922595, 2885846, 2829358, 2778562, 2734857, 2599692, 2449431, 2458951, 2489234, 2413493, 2317885, 2313098, 2305096, 2240581, 2147745, 2065235, 1933291, 1860128, 1957828, 1935226, 1849644, 1826046, 1804367, 1796305, 1711872, 1786267, 1861131, 1694321, 1513840, 1503395, 1524729, 1554988, 1488507, 1285490, 1257983, 1364958, 1424198, 1370899, 1282647, 1289624, 1292774, 1270848, 1354032, 1450382, 1378106, 1338646, 1262872, 1254010, 1325461, 1337738, 1244142, 1165025, 1264616, 1255207, 1231014, 1304312, 1398779, 1372698, 1269470, 1187044]
16663A187044n7829O4159q780j08367J5779Q0657P7518P6237L0442m7182l0701
16652A278977j5384l4237k9713o9694m7307m3345k422O0764N5854q6989k4601
16641A041903J16491j13675J1590J8942L4710J9578P8542P0640r348P202k9896
16630A246679J9109r1283o2178k5719o5337K7960Q8578K673L9896J6486o7112
16619A129752L8535P2785j5097O7760N0261p1126J011O9737o8565k1488m1965
16608A211600j24209l2303Q6916J02039l2676k9967q0107q4413J8806N1418l6858
16597A050246n2287K3155L8219J5657l1821L3779k9885K8586N3180J03159K33945
16586A465933j9132l6325P4561o7917r7474Q8465N3022M1183p6654j29669j53430
$$ y = [1187044, 1129215, 1193374, 1184594, 1076227, 1092006, 1172663, 1250181, 1326418, 1356860, 1309678, 1278977, 1263593, 1229356, 1199643, 1129949, 1082642, 1039297, 1036875, 1097639, 1153493, 1066504, 1041903, 1158394, 1044719, 1056309, 1075251, 1109961, 1129539, 1208081, 1278721, 1269373, 1276575, 1246679, 1265788, 1174505, 1112327, 1086608, 1021271, 1049231, 1137809, 1140482, 1180378, 1196864, 1129752, 1168287, 1241072, 1225975, 1293735, 1343996, 1272870, 1273881, 1343618, 1275053, 1253565, 1211600, 1087391, 1055088, 1142004, 1244043, 1211367, 1181400, 1101293, 1016880, 1035686, 1087104, 1050246, 997959, 1021114, 1059333, 1074990, 1043169, 1076948, 1047063, 1075649, 1128829, 1231988, 1465933, 1446801, 1410476, 1485037, 1417120, 1319646, 1408111, 1461133, 1502316, 1425662, 1295993, 1142563]
16575A142563o9808J8099o4805k5810p6780j02578J6864Q8093O0420J7310J4337
16564A017905l1279l2507Q4580o634Q3670l741j06465m0122l9267p7912m2677
16553H05551L9828K9637m8772r8119n8806p1075k1049K1641m0892P346k8734j2178
16541E24378J4651Q4365L2148l9915L3958p2064j7358N6359j6067k0613j0318
16530E69524J3972p7076K1809P7288M6450j4851o4727l6018j7995o1783M4088
16519E00681P3854N8448l6798m9270J9978R7858k234r2027l7043r7193j19401
16508C16853L8965J27431o183o9086M7746n11m0176L5957O05N7343o7307M7266
16496D88903l0537r6728L9173L0020n6056N9865q384R4027J20899K0667m2187
$$ y = [1142563, 1072755, 1090854, 1026049, 1000239, 923459, 820881, 837745, 925838, 986258, 1003568, 1017905, 986626, 954119, 1038699, 1032065, 1115735, 1111994, 1005529, 965407, 926140, 848228, 805551, 845379, 875016, 826244, 728125, 669319, 598244, 577195, 598836, 557944, 565290, 536556, 524378, 539029, 623394, 655542, 615627, 649585, 577521, 560163, 616522, 600455, 579842, 569524, 583496, 506420, 528229, 605517, 651967, 637116, 572389, 536371, 518376, 456593, 500681, 574535, 632983, 596185, 546915, 566893, 664751, 662517, 570490, 533447, 436254, 316853, 355818, 483249, 477066, 407980, 455726, 455215, 415039, 450996, 451601, 508944, 441637, 488903, 458366, 361638, 400811, 430831, 374775, 434640, 426256, 520283, 641182, 661849, 619662]
16485F19662j7047j35282j36283O6057J5161o5131J6740J58979K129k1471M2097
16474E45611R3072L6319j6031r6292p6071j4888p104m8721J78727M6369N5209
16463F96200Q7253O1381k1891m0902j7408J5835j4189R5116Q192o1126M9875J3206
16451H71542l1845o8179j2910j582j6907m6514m6245p0494M5985J4053J02919
16440G39823m7724j10094O052P1538L9612o5040k082L547P6299l5081n2906K5212
16428F49156m2499J8697P3869L5261L907J7303m7298j77524p7131J2160m5720
16417D20181N4734j3500K6765m5633m0055N0283J12267L5675n4632k5126j6875
16406E04084l3828K1747L4307n6868m0989j8296o1656J07980J21313K6282J7160
$$ y = [619662, 602615, 467333, 331050, 397107, 412268, 347137, 363877, 522856, 524985, 503514, 545611, 638683, 675002, 658971, 562679, 486608, 471720, 464616, 415895, 594622, 640991, 696200, 783453, 844834, 822943, 782041, 764633, 780468, 766279, 861395, 869587, 808461, 858336, 871542, 839697, 771518, 758608, 757026, 740119, 693605, 647360, 576866, 622851, 636904, 739823, 692099, 582005, 588057, 659595, 699207, 634167, 632085, 635632, 711931, 676850, 623944, 649156, 606657, 625354, 699223, 734484, 738391, 755694, 708396, 530872, 453741, 465901, 420181, 474915, 461415, 488180, 442547, 402492, 452775, 565042, 600717, 546085, 520959, 504084, 470256, 492003, 526310, 469442, 428453, 410157, 348501, 456481, 577794, 604076, 621236]
16395F21236K7301p9115l789k9928m1284K2124O6592L7463M0749J5855J25742
16384H02946K8367k9082L0613J19152L0201q338j8513j3596j02815l9573o966
16373G92396P2107j21359j31912K5124O6604M6533J1634p093n4231m3488K7192
16362F83507J28020o4520p5087j38925p1940R145k7363J20986J34691M2547P395
16351G48456M6684j68028n3467K1880j8603J0637r7950L7305J7641m3990Q452
16340E09017j5503k8034p8924q0113N9114M3460k899k9894J1002l2337L8825J54913
16328E48627n3255k13157j18967n397J17483R2534k2347J795K6291k2141R710
16317C61176P700L0134n5916r5171k6480n2598j03498P9121O9112P9973O1398
$$ y = [621236, 648537, 569422, 565633, 535705, 494421, 516545, 583137, 620600, 661349, 677204, 802946, 831313, 802231, 832844, 951996, 982197, 973859, 955346, 941750, 838935, 799362, 792396, 864503, 743144, 611232, 636356, 702960, 749493, 761127, 754034, 699803, 656315, 683507, 811527, 747007, 671920, 532995, 461055, 470200, 442837, 563823, 698514, 741061, 748456, 795140, 627112, 573645, 595525, 576922, 587559, 489609, 526914, 544555, 500565, 509017, 493514, 465480, 386556, 306443, 365557, 409017, 406118, 376224, 387226, 354889, 393714, 548627, 495372, 282215, 163248, 157851, 275334, 367868, 345521, 347316, 373607, 351466, 361176, 368876, 399010, 343094, 247923, 221443, 168845, 65347, 144468, 213580, 293553, 354951]
16306C54951M6367k3202J04057o4438r0584K4263l9197j01473k242R1751J7623
16295C17876J0514L8801m1374J0390l3238p6048q812p3367l3501O7225M307P3
16283A82846P018R5518l9490O0893K2069Q7579m1845L5317l0601k8151o7445m1564
16271B42144j02607J19780J99778J74411o4355j24035j02977p3280j4460j18228
16261A36171P3226N7057p8064K3143O6803j5234j8191k1393j1540M8117R5022
16250C55117J860r248k1189j17407M8626m983r367n2920j2433L2475O1797n6633
16238B15695j6572k2754M6802n611R745L4888k8602J8487O5585l1697o2400N596
16226B29162K2572l2992M4672K6568L732k3894m8161j22697q2496p6584J3369
$$ y = [354951, 401318, 378116, 482173, 417735, 327151, 351414, 312217, 210744, 208502, 300253, 317876, 328390, 367191, 325817, 336207, 302969, 226921, 218109, 144742, 111241, 178466, 182773, 182846, 189864, 285382, 245892, 306785, 328854, 416433, 374588, 409905, 379304, 351153, 283708, 242144, 139537, 259317, 459095, 633506, 569151, 445116, 342139, 268859, 254399, 136171, 209397, 266454, 188390, 211533, 278336, 263102, 244911, 223518, 211978, 260095, 355117, 356977, 347729, 326540, 209133, 257759, 252776, 243409, 190489, 178056, 210531, 272328, 215695, 199123, 176369, 223171, 217560, 227305, 262193, 233591, 252078, 317663, 285966, 223566, 229162, 251734, 218742, 263414, 289982, 293714, 269820, 221659, 98962, 16466, -60118, -46749]
16215d6749O0131K7767J0414P8383K0991J3485k4659m8522J01305J03098j08145
16204A87499j57164m7203M3265M7186j4949o4876L4201n4192L9772K3633l1692
16193E480p9625K9116j0627L2720N3626K5892l4209J197N4225j780J6705J7070
16181A09790r802O028m3631n0669r314K3784Q0325J5922N9045k2860m3764L8533
16169A53387M3379R7323k5435k1156o4n3588m0244j2249M2919K3594o7398k8888
16157A11580R334m0405j4897k515J4308K7423n4989M8183K593K6325o2640K5474
16145H9774P6589j9061j55022J1387J66176M1789n855N5782J3160j38955o979
16134A28785J19465J0898q3252M2732o6673j40968n3039p0468J39239L9577k3969
$$ y = [-46749, 13382, 41149, 51563, 129946, 150937, 164422, 139763, 91241, 192546, 295644, 187499, 30335, -16868, 26397, 73583, 58634, -6242, 27959, -26233, 13539, 37172, 5480, -74145, -45029, -55656, -22936, 30690, 56582, 22373, 23570, 77795, 76015, 92720, 109790, 99988, 106016, 62385, 11716, 2402, 26186, 106511, 122433, 181478, 158618, 114854, 153387, 196766, 294089, 268654, 247498, 247434, 193846, 153602, 141353, 184272, 207866, 140468, 111580, 120914, 80509, 65612, 63097, 77405, 104828, 49839, 98022, 100615, 126940, 64300, 89774, 166363, 147302, -7720, 3667, 169843, 211632, 205777, 261559, 274719, 135764, 128785, 248250, 259148, 175896, 218628, 151955, 10987, -42052, -112520, 26719, 66296, 42327]
16123D2327K1678J32781L3634m9167Q543N5590o0724j9546O3749l5092j22675
16112G1098P8439N8588j4211l6713o0981P3724K0218j14144j1877o9096K1317
16101A6362M7074M4674m392o5484p2931J6992J24968k4485k020k1914K5536J05442
16089A89822n0647q9888k5827N2561L6336L8740L049m8352K1760O7069O0443l0073
16077B24993N0480n6799o83j1664j66832n4000l0347M5916J23109M2778p9589
16066H7362p940J7191L0638j4300J0324K6107j0632M7364o0138j98231n2808J00664
16054b4399J13849L8546n682L5031J8951P9902M2136L7521o0221j693k0201m1093
16042B12647q1273L819m9842n8566J24232J07248l3279l7752k4550n7545r0156
$$ y = [42327, 64005, 196786, 230420, 181253, 189796, 245386, 184662, 165116, 228865, 193773, 71098, 149537, 208125, 193914, 157201, 96220, 169944, 190162, 76018, 64141, -4955, 16362, 63436, 108110, 103718, 38234, -34697, -17705, 107263, 82778, 80758, 58844, 84380, 189822, 139175, 49287, 23460, 76021, 112357, 151097, 154146, 105794, 127554, 194623, 255066, 224993, 275473, 218674, 217991, 206327, 39495, -14505, -44852, 1064, 124173, 166951, 87362, 79422, 96613, 127251, 112951, 123275, 149382, 138750, 186114, 125976, -72255, -125063, -24399, 89450, 127996, 122314, 157345, 176296, 256198, 298334, 335855, 275634, 273941, 253740, 212647, 131374, 135193, 85351, 26785, 151017, 258265, 224986, 187234, 162684, 105139, 14983]
16031A4983N8616l0467r4488O6902J53744j00227K6547m480K8743k548J0505N6126
16019A83956L0003m5195j18396q0680o363L5707O8330M7024j2288o707N420R2767
16007A93578j0522o2745j419j5685J3280m4250l3151j1170J143P6274K5141j00247
15995C0227M4499Q3585O345r3636q84J9799Q6292J08344k9573j78532N6710N621
15983A38797J8204k4348m9509N4424p913Q3879M604o9449M444K1840l2332j29416
15971A3225K286J41951J25273k7420l5266p5177r8139o4197k0212Q4786J7807
15960F4917m4934p910j5193R85N540p231Q7386J16827k60k5164J4884l997k1506
15947A64344k5996j0883q195K1789m5040r3652L4333M7629j7654o3670p8732n9118
$$ y = [14983, 73599, 43132, -51356, 15546, 169290, 69063, 95610, 91130, 119873, 117325, 127830, 183956, 213959, 168764, 50368, -30312, -36675, -968, 67362, 114386, 102098, 95391, 100811, 193578, 183056, 120311, 118892, 103207, 116487, 72237, 39086, 27916, 29059, 105333, 130474, 30227, 74726, 158311, 164656, 71020, 70136, 89935, 176227, 284571, 254998, 76466, 133176, 138797, 157001, 132653, 83144, 137568, 129655, 213534, 218138, 148689, 153133, 174973, 142641, 13225, 15511, 157462, 282735, 255315, 220049, 144872, 46733, -17464, -37676, 47110, 64917, 19983, 12073, -3120, -2135, 3405, -3826, 83560, 200387, 200127, 174963, 189847, 185850, 164344, 138348, 127465, 119270, 141059, 96019, 2367, 36700, 84329, 66675, 3005, -75727, -134845]
15935a34845Q0395R4210L0543r7752j29840O041J89464O849j1923M5487j3953
15924F4676r628J7644J2867K9720J7806R6806J1864q0354o8650M585q9681o0638
15912e2983K8747L2766O9874K3178m4700O6302k6292j86151k6501P1456K7799
15901a6505l6029R6340P4356o9292K3096M567m4553p3081r366N1496N4300L1175
15889H6504L6473p1113q5663K726m8812n8562p693N0142L3613J1984j9009k299
15877g1709k3921J1J11367M8088L6201j2313j4539P0680m7834J4363j5814j9866
15865G4714n8566j2837q259K3902k1404Q621j126N9794R0309l9262J3401J2476
15853A41763P7667r0297l9803n1319j16628n5517P5215J36323P0446o8186J17630
$$ y = [-134845, -54450, 39760, 70303, -27449, -157289, -151248, 38216, 45065, 33142, 78629, 64676, 55048, 72692, 85559, 115279, 133085, 229891, 241755, 161401, 92751, 97336, 7655, -52983, -24236, 8530, 78404, 101582, 56882, 123184, 96892, -89259, -115760, -44304, -16505, -52534, 43806, 118162, 48870, 71966, 76533, 31980, -41101, -50467, 1029, 55329, 86504, 122977, 51864, -33799, -31073, -79885, -138447, -146140, -95998, -62385, -50401, -69410, -71709, -95630, -95619, 15748, 63836, 100037, 87724, 73185, 143865, 96031, 110394, 94580, 74714, 16148, 3311, -4948, 18954, -2450, 6171, 5045, 64839, 155148, 115886, 129287, 141763, 219430, 129133, 89330, 38011, -78617, -134134, -58919, 77404, 147850, 79664, 197294]
15842A97294m856j33217n8504J9619j1391J3789L1314L6807M9076o8p0615k8661
15830D0587r782n3396l5814p3456q2204L7871N5316O0127K0416R4844R5545M1205
15818A91259L5115k1011k5757j05030q9937m2362O9633m4868j5301M0922J2560
15807E223r0201j15623j9181L0681J30111k1643Q1142J7686r90l3470p3538N8407
15795c1396Q970n9821n8083J30704N8832p6120r3420Q9407R1787K2485j5754P0720
15783A38311O6113J0648M05N8112j12865j39236m0766p3933M8238R1857J00029
15772A46913J840l1744q7644p3364J1951o4067o7224O362j7579Q6692J00406O2462
15760G5004N604J7466L2031J09904M8910j49006k7975J1674l1404o0206l7244
$$ y = [197294, 192438, 59221, 717, 20336, 8945, 22734, 54048, 90855, 139931, 139863, 69248, 40587, 30805, -22591, -58405, -131861, -214065, -176194, -120878, -60751, -40335, 54509, 150054, 191259, 226374, 205363, 179606, 74576, -15361, -57723, 11910, -32958, -48259, -7337, 5223, -84978, -200601, -219782, -189101, -58990, -80633, 509, 18195, 17205, -16265, -89803, -31396, -22426, -82247, -140330, -9626, 49206, -26914, -120334, -30927, 60860, 83345, 67591, 138311, 204424, 215072, 215477, 273589, 160724, 21488, -19278, -93211, -44973, 46884, 146913, 148753, 117009, 29365, -43999, -32048, -96115, -163339, -156977, -174556, -87864, 12542, 75004, 80608, 98074, 130105, 240009, 288919, 139913, 111938, 123612, 92208, 32002, -5242]
15749e242o3907N5489j039M0404O1721P3915l827k343l2909j56752n8104L9460
15737e3134J30182R6073j74779j72801l9665J18331P0950J01219j08907N062q8005
15726a15474k4340M9076O4038p0098J02485M4767p4658n4208K6438P5340j7315
15715F051J3269J0112j6023n0504L1404O97N9801j8278j34342J2019N2775j4846
15703d7865Q7563o443n3129o4090J03919M8927J3085P6048p0278r4877o936M7720
15691C3644J2329m4997J2062l0215m2094q0258K8226k4279m5912M7474R409Q8944
15679c5667R3171m2661m9887j5090o7689P1219J9942o055j5975K3664M0846Q4107
15667I9925L0522r6329n6769K0845j3772N547M3709J63299L5088n8712j17203
$$ y = [-5242, -69149, -13660, -14699, 25705, 87426, 161341, 157514, 155171, 122262, -34490, -92594, -53134, 77048, 173121, -1658, -174459, -214124, -95793, -24843, 76376, -32531, -27469, -115474, -139814, -90738, -26700, -96798, 5687, 50454, -24204, -78412, -51974, 23366, 6051, 19320, 29432, 13409, -37095, -5691, -4994, 54807, 36529, -97813, -85794, -33019, -47865, 39698, 33255, -19874, -83964, 19955, 68882, 81967, 158015, 87737, -7140, -14076, 33644, 45973, 976, 13038, -17177, -59271, -139529, -111303, -135582, -181494, -134020, -124611, -35667, 57504, 14843, -35044, -50134, -117823, -46604, -26662, -32717, -48692, -25028, 15818, 99925, 130447, 34118, -22651, -1806, -15578, -10031, 33678, 196977, 232065, 173353, 56150]
15656E6150r4401L9252n6790q1639o2184M5295O1930K2480j9287M639L0890k0609
15644g4274k9105J1154J17338N8096m5848k0712J3414k1764r26K4482N436o773
15632C0518M9074j92320j03809K3106P8783J70623J40140M4018p7249n5107m2378
15621F5399j8605m8250l9058k4022o6602J0248J16182O4894N7359j8630l9696
15610E9219N2k549j75438o5431N8199M2865j6694j1092m0615n9623Q6263k8950
15598a53794L6412J34064M8475k1475o9519O0161J42201L3384p9844N1485K4536
15587B06086j02969O414J4036m1968p7068k7723K0765Q5117m612r1549M0245K5038
15575E1812M3846m1130R1928p5605j02843K2546k169P1659O6103m7664k5258Q2473
$$ y = [56150, -38251, 1001, -55789, -137428, -199612, -154317, -92387, -69907, -89194, -84555, -53665, -74274, -103379, -92225, 25113, 83209, 37361, 16649, 30063, 8299, 7373, 31855, 37291, 30518, 79592, -112728, -216537, -193431, -114648, 55975, 196115, 240133, 162884, 107777, 65399, 46794, -1456, -40514, -64536, -131138, -120890, -4708, 60186, 117545, 98915, 59219, 59271, 56722, -118716, -184147, -125948, -83083, -99777, -110869, -151484, -211107, -124844, -153794, -117382, 16682, 65157, 43682, -25837, 34324, 176525, 209909, 130065, 181550, 206086, 103117, 109531, 123567, 81599, 4531, -23192, -2427, 82690, 78078, -13471, 26774, 51812, 95658, 54528, 146456, 70851, -31992, -9446, -11615, 60044, 126147, 78483, 53225, 135698]
15563A35698M8893p048n2124o4390m0967O2270N1099j06210n6502K3199P83M9452
15551D4153l3714J2430N7557M0181k0734R227p7331L8214M3417j30225j42782
15540a59607L6559Q0561R1448L2994j2661N1218J08025K0457o1314n2958j3917
15529A20805m125L280l3201j4622J1568Q470J2633N9703l9650j37654P6050Q0650
15517A43907o8767j3996M6935o4771k3063K5289N8915J9371K304o9219m1719l9877
15505b4691k8568R9350o9132j29988o623J14355R4331n0357q3589Q323r1248P8971
15493h8866J16528O2228M5583n5163R9320J2970N356L076j44866j14055Q6769
15482B8880O2375j8757m6609p9277O5195J01213K4786J5270p959J0927O9640l9579
$$ y = [135698, 184591, 177543, 125419, 61029, 20062, 82332, 133431, 27221, -29281, -6082, -5299, 44153, 10439, 22869, 80426, 120607, 99873, 109100, 31769, 69983, 113400, -16825, -159607, -123048, -42487, 48961, 81955, 69294, 120512, 228537, 248994, 187680, 134722, 120805, 116680, 119960, 86759, 72137, 83705, 92175, 104808, 164511, 124861, -12793, 63257, 143907, 75140, 61144, 108079, 43308, 20245, 45534, 104449, 123820, 126124, 56905, 15186, -24691, -53259, 46091, -23041, -153029, -159652, -45297, 49034, -1323, -84912, -76589, -167837, -88866, 27662, 89890, 135473, 80310, 179630, 192600, 197956, 201032, 56166, -57889, 28880, 91255, 72498, 25889, -53388, 11807, 113020, 137806, 153076, 145117, 156044, 225684, 186105]
15470A86105o0232j9291K9029M2040n2571o1258J1187L2942m8533j66659K9316
15459g7925J20089m3193M5634r201q6949n8605R6364l7382r098q6070n0155O8639
15447a27852J7783l1362j6518k3161l7956L1445Q8989j2318j3895o2085K1836
15436a65094L2358o4353L616R6211Q6183N9081o1118n1840n5040j9110L2157J63305
15424E6356o8841j2331j1500O7109k8363m4800M5426R262P706P513o2950n2663
15412h8076m7016Q7727J32709k8460j65336n2398O8449J03808M3150L9299L1942
15401A25798l7950L3430j3457p0159J6688K1621n7946m8328p7597k220J8822N2663
15389c8635K3104j8642n8959m9795J34813N8713k8952O4935n8585j12530p959
$$ y = [186105, 125873, 106582, 135611, 177651, 125080, 63822, 75009, 107951, 59418, -107241, -77925, 42164, -1029, 44605, 35404, -51545, -110150, -13786, -51168, -60266, -146336, -196491, -127852, -110069, -141431, -157949, -181110, -219066, -187621, -98632, -110950, -124845, -186930, -165094, -132736, -197089, -193473, -97262, -11079, 48002, -13116, -64956, -119996, -139106, -106949, 56356, -12485, -24816, -36316, 30793, 2430, -42370, 3056, 12318, 20024, 27537, -35413, -88076, -135092, -47365, 85344, 56884, -108452, -160850, -92401, 11407, 54557, 93856, 125798, 87848, 121278, 107821, 37662, 54350, 75971, 18025, -30303, -107900, -110120, -91298, -38635, -15531, -34173, -93132, -142927, -8114, 50599, 21647, 86582, 27997, -84533, -92492]
15378i2492P5061j8143j03588j1456L642J06001p573k500J2456n079q6819k8682
15366a59172J7000j3414J9680Q4947L8537l250j3925r6360k9136P8622P8392L8346
15354D0267k8391j48236l5192J27004O136r7549j0685M1923J15932J8166L1719
15343F1094M7430k1003l9689K0667R7810J9732j5317p0553m4335l61J1576j1153
15331E5898M5474j523q7967J2014O3233m7908m3917Q052j9900K7413M3038K1462
15319G5369r8221n9558J11591O8988J05121O5674k9248j0319j14041j68494J21382
15308F8244k0374K2272Q7945L0839j5930N3328M7305m4930m3034p7103j18253
15297i691p0501J8569J290p2066K5070m2923L7336N6450K7202k7432j2815N9958
$$ y = [-92492, -17431, -35574, -139162, -150618, -146976, -40975, -48548, -51048, -38592, -43671, -130490, -159172, -142172, -155586, -135906, -50959, -12422, -15672, -29597, -125957, -155093, -76471, 1921, 40267, 11876, -136360, -171552, -44548, -38412, -135961, -146646, -104723, 11209, 29375, 61094, 108524, 87521, 47832, 68499, 166309, 186041, 170724, 100171, 55836, 55475, 67051, 55898, 101372, 99849, 11882, 23896, 87129, 39221, -4696, 3356, -16544, 10869, 53907, 75369, -22852, -82410, 29181, 98169, 203290, 268964, 239716, 229397, 115356, -53138, 68244, 47870, 70142, 158087, 188926, 172996, 226324, 273629, 228699, 185665, 108562, -9691, -80192, -61623, -60333, -132399, -107329, -150252, -112916, -56466, -29264, -56696, -69511, -9553]
15285i553k9048M6813Q3122k4000l5298m5901p2178j44815N1433J13082K8653
15274c7690N8741K2534j03735q6090J20221L0356R0919M8116o4493J2824N9212
15263A50915r7310l7093o7693L2722k0948k3926J58735j443p0281R17M8937K6141
15251I9673m0900O6704J50718k5876q7750k7927j25834r5328k6732M8529o2806
15240a27529K4716N3956l3306j2336M0829P3028L1822M596m0051M3022k0781j3760
15228B4206j6600n9887j60299O8756N4351m5575k0127K5349k8045l7533J9354
15217a76050N6958P0854K9683j6371M883N4991O9808J7952J1252p8568o0302j02023
15205a16933N1808P7532k2930O992j5194o2490k5095Q0748N1733k1633j1725j44973
$$ y = [-9553, -38601, 8212, 91334, 67334, 32036, -13865, -86043, -230858, -179425, -66343, -37690, 21051, 43585, -60150, -146240, -26019, 4337, 95256, 143372, 78879, 91703, 150915, 53605, 16512, -51181, -18459, -39407, -63333, 95402, 93959, 23678, 24595, 73532, 99673, 58773, 125477, 276195, 250319, 162569, 134642, 8808, -86520, -113252, -64723, -127529, -102813, -48857, -82163, -94499, -53670, 19358, 51180, 55776, 15725, 58747, 37966, 24206, 7606, -52281, -212580, -143824, -89473, -135048, -155175, -129826, -157871, -195404, -176050, -119092, -48238, -18555, -34926, -30043, 24948, 94756, 112708, 123960, 45392, -14910, -116933, -65125, 12407, -10523, -3531, -18725, -81215, -106310, -25562, 26171, 4538, -7187, -152160]
15193a52160p1880j5531N4000J01994l1354J9091J10830j0465J5249K396j22196
15182a00026K6827Q3366o6872o936R8348k6157j25727m2915K4615K9659l5089
15171a40907L6655O4151o778N6443m268m9913n4405r4079j8725O0454K6595o80
15159a25457L8015L4769k5743n4857J04923l2152j7801o424m3908J0079Q8369
15148c0187J65578R888m0833m7086j01624n0308n52k2803l4674O7974J0633o6531
15136a40525p161M1485m5931M2645L8753m7234L3950J4582m8935O47Q4704R3956
15124F0936L5011n4697j01122M7973P2515o5099m7666j27028K8749N4559l2862
15113a28731q0848M7055J55886O6422r4270o2702p366k669k9439R3877J436p0282
$$ y = [-152160, -224040, -239571, -185571, -83577, -114931, -95840, 14990, 4525, 19774, 22170, -100026, -73199, 10167, -56705, -63641, 34707, 8550, -117177, -160092, -135477, -105818, -140907, -104252, -40101, -46879, 9564, 5296, -44617, -99022, -193101, -211826, -151372, -124777, -125457, -87442, -52673, -78416, -133273, -28350, -60502, -78303, -84727, -128635, -118556, -30187, 135391, 145279, 104446, 57360, -44264, -94572, -95124, -117927, -152601, -84627, -73994, -140525, -147686, -106201, -152132, -109487, -70734, -117968, -84018, -69436, -118371, -117724, -33020, 60936, 95947, 41250, -59872, -11899, 60616, -4483, -52149, -179177, -150428, -95869, -128731, -209579, -162524, -6638, 59784, -34486, -97188, -104554, -107223, -136662, -42785, -41349, -111631]
15101a11631N4936Q3147l1018l6948R1595l672j34827M5356P610o8194J4288Q2061
15089g297P1181J0025p0481j07804L4440K9823O5682N76m0137K5105n2192l2224
15077g3303N6334R977l0406k2465P2778j3618j075P903O5577N0466j46290j59107
15065a83229k3903Q2275R7118R470L2474J55074J5095k0207m3378j73376p2995
15054a25582o078n708O2224j9813L0892R7L3338M0174j6358L8910O4948Q044p3884
15041C1204o6906R8064j5892p7107m0675q0042L2719J29123j12755j37344M8784
15030a90827N7949O0976J7352M1869J1581K1390k9181r2033q1530m5971r065O5353
15018a72137N8150q3398M4075P420P1443L1163K9017j1584m3222J66604K2633
$$ y = [-111631, -56695, 26452, -4566, -41514, 50081, 46409, -88418, -43062, -35452, -103646, -89358, -7297, 63884, 73909, 3428, -104376, -69936, -40113, 25569, 26145, -13992, 11113, -41079, -73303, -16969, -6992, -37398, -59863, 12915, -703, -1778, 6125, 71702, 122168, -24122, -183229, -207132, -124857, -27739, -18269, 14205, 169279, 184374, 164167, 120789, -52587, -125582, -131660, -137368, -75144, -94957, -64065, -63968, -30630, 9544, -6814, 32096, 97044, 105088, 31204, -35702, 62362, 46470, -30637, -71312, -151354, -118635, 10488, -102267, -239611, -190827, -132878, -71902, -54550, -12681, -1100, 20290, -8891, -100924, -182454, -228425, -237490, -172137, -113987, -197385, -153310, -145890, -74447, -43284, -14267, -25851, -69073, 97531, 120164]
15007A20164j42152n209L1909O2651j1788N0454M8596l8575o1068n3700J869m3114
14995c9963n419K6310L8900j08904o0721J3647J8748M0962J06905J1147O1693
14984A03305r899k5986j14844j2249m8785j07933n8009o22M3929M0934K7066P3669
14972h9424J13069J01356O1510o4298p0939K2156M6433r1031P4807Q0122q9441
14961I4320K8044k1468l7848j44582N8051M8127Q177m536l0734m9975r736n3792
14949a15952q182L7020m85p5021k8935j2749M5412J0157O9945Q9366J7437M5342
14937G3355j03343q8960q1121J25549J06982N4437o8223o2082M87L44P6685O9352
14925A03462j16219l7922K099N0003M7228J4139n7092Q645M9098J11927n4548
$$ y = [120164, -21988, -27197, 4712, 67363, 55575, 106029, 154625, 116050, 54982, 1282, 3151, -39963, -45382, -19072, 19828, -89076, -149797, -136150, -117402, -76440, 30465, 41612, 103305, 93406, 67420, -47424, -59673, -108458, -216391, -274400, -275022, -231093, -190159, -163093, -89424, 23645, 125001, 186511, 122213, 51274, 73430, 119863, 28832, 103639, 183761, 94320, 122364, 100896, 63048, -81534, -23483, 24644, 32821, 28285, -2449, -52424, -62160, -115952, -124134, -87114, -87599, -162620, -191555, -204304, -158892, -148735, -78790, 10576, 28013, 73355, -29988, -118948, -200069, -74520, 32462, 86899, 18676, -43406, -42919, -42575, 34110, 103462, -12757, -50679, -48580, 1423, 48651, 62790, 5698, 14343, 63441, 175368, 120820]
14914A20820j02595p2018n0665J05570K6415K6926o7601r518N7212q264k6107
14903A75k2299o3080k0212M047j25288n8736J8011P1576P28k1578O7501J24973
14891b4182M7637o2323J4936P095J0205m390r9642j11922R4378Q7397N0902m966
14879E125l8846o1053r6453m0307l1351J8457j05219o0861J17201J17188O7065
14868a09054M2941p4370j24007J24860J38394J37186q5985q6422m7804J4449r846
14857g9658K3836K7520l809P7550J8318o5875k9659j3562j72273J01186J74445
14846E8019M1723k5696J20719l0472k02480j23355J14455P9438O2314J48912Q101
14835B51678j21670j2460l6720n4499l0432k6262L8436o8784p3028n03Q7336Q6396
$$ y = [120820, 18225, -53793, -104458, 1112, 27527, 54453, -13148, -22666, 34546, 26282, 175, -22124, -85204, -105416, -101369, -226657, -285393, -267382, -195806, -195078, -216656, -149155, -24182, 23455, -38868, -23932, -16837, -6632, -11022, -110664, -222586, -128208, -40811, 10091, 5125, -33721, -94774, -191227, -231534, -262885, -244428, -349647, -410508, -293307, -176119, -109054, -66113, -140483, -264490, -139630, -1236, 135950, 49965, -36457, -84261, -69812, -79658, -55822, -28302, -32111, 45439, 63757, -2118, -31777, -45339, -217612, -116426, 58019, 99742, 74046, 194765, 164293, -38187, -161542, -47087, 32351, 94665, 243577, 251678, 130008, 117548, 80828, 26329, -4103, -30365, 8071, -60713, -133741, -134244, -46908, 39488]
14823C9488L8251j25037j40727R1825O6013N388r582k8075L3624m8577P2980L044
14811a385l663M26l6818m6966P8969M4424Qj27000o6443m520L3070Q3492l5742
14798h2148K4613J03788L9186o7711l7572j3784j7540j2891R066o516K3M8097
14786a3389p3356Q4299K4292j43306m9976L3410O4311k8011N506L4545o0532o968
14774a29175P679O9275J3210l0732J08375K3037k0050j14453j2017R748l1608
14763a06711k2249m9853j05315K5761R4603J01564K3375K5520M9038k4097L1710
14752D3346P6683k6487p0666L1860j5643N189j6505j49328n940M7776q900L6754
14740e1861l4735n4277q2614M9404J6277K1432P3794k4878m7507J7211M6657N080
$$ y = [39488, 77739, -47298, -188025, -96200, -30187, -24799, -34381, -62456, -28832, -77409, -4429, -1385, -5048, -4622, -41440, -88406, -9437, 34987, 34995, -92005, -158448, -162968, -129898, -46406, -82148, -57535, 46253, 85439, 17728, -19844, -33628, -51168, -64059, -54993, -61509, -61486, -13389, -86745, -2446, 21846, -121460, -171436, -138026, -73715, -101726, -96220, -61675, -122207, -129175, -121496, -52221, -39011, -69743, 38632, 61669, 41619, -72834, -84851, -75103, -106711, -128960, -178813, -284128, -258367, -163764, -62200, -38825, -13305, 35733, 11636, 43346, 120029, 93542, 22876, 54736, 39093, 44282, 27777, -121551, -127491, -79715, -88615, -51861, -86596, -140873, -223487, -174083, -157806, -136374, -62580, -87458, -134965, -117754, -71097, -66017]
14728f6017o517M0636m854j00312j28997R561l018m7207Q0641N8003j6376M0800
14716a43657K4370J27376o023j07505n6037l666K7508P6960L9318p6890j5550
14705a13796O9759N3456O0216o7751m3260k7319o1092P2019K3276j714J27653
14694I1447k0962q5878p6023J4769O8267k5476J30859P9483j33255q2409M1245
14683B067J12592j0837J0633k9098j12612j39987N4458R6912n23n4444N3972L9518
14671B2651M4817j8608j24126p9535R5957J38818M5429p032N9461j4446j38440
14660B4946q2193q2067Q7570O2471j1720n0230n5615P083Q1796J38706j3565r7599
14648I583j906J30312O5474l0790r7475l6484j3058J34038L6319q8722L6203k5704
$$ y = [-66017, -72534, -31898, -36752, -137064, -266061, -256500, -259518, -306725, -226084, -168081, -184457, -143657, -119287, 8089, 2066, -105439, -161476, -165142, -137634, -60674, -21356, -98246, -113796, -44037, 9419, 69635, 1884, -41376, -68695, -129787, -57768, -34492, -36206, 91447, 70485, -15393, -91416, -76647, -8380, -33856, 97003, 176486, 43231, -39178, 2067, 114659, 103822, 114455, 85357, -27255, -167242, -112784, -15872, -16395, -70839, -16867, 22651, 67468, 48860, -75266, -154801, -58844, 79974, 125403, 118371, 177832, 163386, 24946, -57247, -139314, -51744, 10727, -993, -51223, -106838, -99755, -17959, 120747, 107182, 9583, 7677, 137989, 203463, 172673, 75198, 38714, 25656, 159694, 196013, 107291, 143494, 117790]
14636A17790Q6149J8725j60902p2036j05380m6246Q6982j4605M6338Q8906K3728
14625F9449K4758N4007p5437l0173K0111q8292o7213m916J06661N2318j58327
14614i7054r6869P2013R7067L1646J18173k0041N184K2809J2819p0087l1504N6162
14602A00318L4001k0872n0696r8981n6171n2030J00914L4970l9031P5518J6670
14591D4610l3094P4242K2043l3238j29976j1651j6938M467j9938l7491r84J8082
14579a19866J1210J0728L4895P8902M4489O317M6679o2991o8449k2096L4251N6643
14567E0712J8611j7400p5433o6992n734R0855P6628L0210j03231n0629k9427J22732
14555D0902l5570o2685k6341R7626J8169k1011n2691Q5656j9406p099o2612r5060
$$ y = [117790, 203939, 222664, 61762, -10274, -115654, -161900, -74918, -89523, -43185, 45721, 69449, 94207, 148214, 72777, 42604, 62715, -25577, -92790, -97706, 8955, 61273, -97054, -193923, -121910, -24843, 6803, 124976, 104935, 110119, 132928, 145747, 75660, 44156, 100318, 134319, 113447, 62751, -36230, -92401, -144431, -43517, -8547, -47578, 27940, 44610, 11516, 85758, 107801, 74563, -55413, -67064, -84002, -79535, -99473, -136964, -137948, -119866, -108656, -97928, -63033, 15869, 60358, 66675, 113354, 50363, -18086, -40182, -5931, 50712, 69323, 51923, -23510, -90502, -96236, -5381, 71247, 101457, -1774, -52403, -81830, 40902, 5332, -57353, -83694, 13932, 32101, 11090, -41601, 44055, 24649, 17550, -45062, -140122]
14543a40122M692o978O9729N8724k6325p2715N6654Q9699k8049J3026Q356k9081
14531b390q6458r3605k146J31624j7851J681N5377J9886J1672J1480j9880O5977
14519G5367L019Q933J6857Q1693K5588l6769q7284j6894J4627k8873q1075n4523
14507g9334L0205O5118M6729j0198O0629O3526m1536Q2066P6375n6356l6864J1895
14495B12255L1294J03292m0997N1525J6666n4451q2488P4447R2015r8339j94516
14484A10703m0601o453l3033P418L5640M291L2091N8975l0785k9377N4825L8097
14472B01791l6776n2068j9449q1868m8123m5124L0289j549j4914o2855J13147
14461a7499K8573k7813j234j13324q4828K2091R6829l3835m5088O5634O3467k720
$$ y = [-140122, -135430, -142408, -72679, -13955, -40280, -112995, -56341, 33358, 5309, 18335, 26691, -2390, -88848, -182453, -184599, -52975, -70826, -69145, -13768, 6118, 17790, 29270, 9390, 75367, 78386, 87319, 104176, 185869, 211457, 174688, 87404, 70510, 85137, 56264, -24811, -79334, -49129, 15989, 62718, 52520, 113149, 176675, 135139, 217205, 293580, 237224, 200360, 212255, 243549, 346841, 305844, 357369, 374035, 319584, 237096, 311543, 403558, 305219, 110703, 70102, 63649, 30616, 38034, 73674, 77965, 110056, 169031, 138246, 108869, 163694, 201791, 165015, 112947, 93498, 11630, -36493, -81617, -51328, -52877, -67791, -130646, -17499, 11074, -16739, -17973, -131297, -216125, -194034, -97205, -131040, -176128, -110494, -47027, -49747]
14449d9747J54335m324j3458m3232K1285R8261j3561j3380O8347k1220o7409K689
14437A18586L9102m5429j05200L4519J31043O2325r4599m1995L2038O0446O6941
14426B57777o6075q59p0766J2296r999j4874P39O6784L2296j1457J9603L1392
14414B46857j24461j03436k6928r665O6202J07417p2341l7133p8702L1628J61352
14403A60790R9287j21656p1110r4155r06Q1083J80534P562q5477q5793L612O5178
14391A38949j138K4366l2186r1443R5865P3775j04418m4863R2936L8656J9926
14380B10425J3706n2151M6777j8M0649J09147M2325N2565J6888J21284J17717
14369G19314O0648p8016o1885Q1232J38522P9414L109J17248R615n1902l2662
$$ y = [-49747, 104588, 100264, 86806, 43574, 64859, 163120, 149559, 136179, 204526, 183306, 115897, 118586, 157688, 112259, 7059, 41578, 172621, 234946, 140347, 98352, 130390, 190836, 257777, 191702, 190843, 120077, 132373, 122374, 107500, 108239, 175023, 207319, 195862, 215465, 246857, 122396, 18960, -7968, -17633, 48569, 155986, 83645, 46512, -32190, -562, 160790, 260077, 138421, 67311, -26844, -27750, 53333, 233867, 241429, 155952, 70159, 73771, 138949, 137811, 162177, 129991, 38548, 134413, 208188, 103770, 58907, 151843, 190499, 210425, 224131, 171980, 218757, 218739, 259388, 368535, 410860, 463425, 480313, 601597, 719314, 779962, 701946, 640061, 721293, 859815, 939229, 942338, 1059586, 1069201, 1017299, 984637]
14358I84637j15775k2915m0443k4746J1459j28755j68236r9535p1777K682K5232
14347C51828L7811J0572J8880q4593k0747L9407J7298p0244j44608k18921K3614
14336c9703O6550M6137K7111J46065M3047l2405j21813o6975N792N0688J57935
14325B82429M6522j42128J5775j33699K4847N5918p2975l6180p0320K3632J82426
14314A76247J30231Q831j61682j09192N6497Q9796K8023l031j16256O3147J41436
14303C04047j4655p5606M0760Q4749m0439K100o1686j03991j77484n096Q2102
14292C4801J56311J29354L6126p2668l986L1586k3162M7911o2096j16963J27R6353
14280B53694M7504M2948K7425p8845j05547p8621L8250k0817M6135p3032j37285
$$ y = [984637, 868862, 845947, 805504, 780758, 792217, 663462, 495226, 395691, 323914, 326596, 351828, 389639, 400211, 419091, 334498, 313751, 353158, 370456, 300212, 155604, -63317, -39703, 26847, 72984, 100095, 246160, 289207, 256802, 134989, 68014, 73806, 124494, 282429, 328951, 186823, 202598, 68899, 93746, 149664, 76689, 40509, -29811, -6179, 176247, 306478, 315309, 153627, 44435, 100932, 190728, 218751, 215720, 99464, 162611, 304047, 289392, 213786, 254546, 339295, 298856, 300956, 239270, 135279, -42205, -47301, 34801, 191112, 320466, 356592, 283924, 279938, 311524, 288362, 336273, 274177, 157214, 157341, 253694, 301198, 344146, 371571, 292726, 187179, 108558, 146808, 125991, 172126, 99094, -38191]
14269c8191n5493m1518m0026R9584J69539O3755j11421p783K2857L2610n3244
14258D0669p4179R3353P0459n1544M5437P9641N2389k4982O4209m0399j25731
14247A29322q9569P0604M3906o4148n2535K4225O2445J0968k1944L606m3545R3061
14235A66396O956n0769j16215j1619J6822K0246J3602m3040o0265o2416P8280
14224d2022M5348J1317j5370Q4764R872l2501j4677J0812l7416k419P7454M4584
14212A39746k6830o5110J09075L2360K9230K6243J513p51J21383J7535j2370K9047
14200D01071J676k4422k7846n436k4360o15k0031l6604o206M4861j6373l2054
14188B53661J17506l9333j11617N012O3882J5921J5246K3019m4269K0843P0242
$$ y = [-38191, -93684, -135202, -175228, -75644, 93895, 157650, 46229, 38446, 61303, 93913, 40669, -33510, 59843, 130302, 78758, 124195, 203836, 256225, 231243, 295452, 255053, 129322, 39753, 110357, 154263, 90115, 37580, 61805, 124250, 135218, 113274, 116880, 73335, 166396, 173352, 122583, 6368, -5251, 11571, 31817, 45419, 2379, -57886, -120302, -42022, 3326, 14643, -727, 84037, 93909, 61408, 46731, 57543, 20127, 17708, 95162, 139746, 112916, 47806, 156881, 189241, 218471, 244714, 246227, 245476, 366859, 384394, 372024, 401071, 402747, 378325, 350479, 345043, 320683, 320068, 300037, 263433, 257227, 302088, 285715, 253661, 371167, 331834, 220217, 225229, 289111, 305032, 320278, 343297, 299028, 319871, 390113]
14177C90113J30865L5176q793M4209m7721R7285P606l579p8444j5169J27295P2134
14165G50977J07142N3541p1976p4335n3937J46927R9200M1402Q3918J96234K4320
14154A303413k4881p8158L5550J31440o623M1217J38532J18990M0378n9182r3454
14143A547222r3425j31300p7436j54028j62372r944J44935P0443j06644j88869
14133H38582m7330j32358l3206j03027j43558m6146M5475P4552r941l5248J55550
14122E63345k930p9589k5734Q807m8922r9024j23481q2785j12095Q7451O9684
14111A54727j2600k7656K1353J3044l7196J0925Q922o214R5518k8613r8171O0894
14099A54933K9741o6457j3086K2899Q5154M1077n759Q5784J1634n9079o9241k4749
$$ y = [390113, 520978, 556154, 547361, 591570, 543849, 641134, 648740, 645161, 566717, 551548, 678843, 750977, 858119, 911660, 839684, 765349, 711412, 858339, 957539, 998941, 1082859, 1279093, 1303413, 1278532, 1200374, 1235924, 1367364, 1360741, 1401958, 1540490, 1659480, 1699858, 1640676, 1547222, 1453797, 1322497, 1245061, 1091033, 928661, 918717, 1063652, 1134095, 1027451, 838582, 791252, 658894, 625688, 522661, 379103, 332957, 378432, 452984, 443043, 407795, 563345, 560415, 480826, 455092, 463899, 414977, 315953, 192472, 109687, -2408, 85043, 154727, 142127, 114471, 135824, 148868, 111672, 122597, 131519, 125305, 220823, 192210, 94039, 154933, 184674, 118217, 105131, 128030, 213184, 254261, 248502, 334286, 345920, 286841, 217600, 192851]
14087A92851l5689K99p5818j55219l8820N5119J15174J1639J1322j9778k149Q4827
14075A43758Q6977J1868j01521l0356K8355o7728k3883O6758Q1271N5727k4609
14064B26617j6456L1321Q8635n202O587N429j6741P4796O5217J40980j0183J6967
14052F07967j7533Q1283J52621J92985O2841m0838O7557Q1133J55936M9515L4179
14041A427646J33174J97835J14079N5991L4120J11919J97788J32822J64524L8642
14031B608540M598J60589J08902K9330N4596O5993L0139N7284k5630j6389l0464
14020C047488k3560k9213j19242q3036m2012k76410k62169q6836j56655k24181
14010A744174q0095p9654j21918j92237q9114p8604n0347P5119J1548K4068j3677
$$ y = [192851, 157162, 157461, 81643, -73576, -112396, -57277, 57897, 69536, 80858, 61080, 58931, 143758, 230735, 242603, 141082, 110726, 139081, 71353, 47470, 114228, 195499, 251226, 226617, 210161, 241482, 330117, 324915, 331502, 336931, 320190, 394986, 460203, 601183, 591000, 607967, 590434, 671717, 824338, 1017323, 1080164, 1039326, 1106883, 1188016, 1343952, 1393467, 1427646, 1560820, 1758655, 1872734, 1928725, 1962845, 2074764, 2272552, 2405374, 2569898, 2608540, 2613138, 2773727, 2882629, 2911959, 2966555, 3032548, 3062687, 3119971, 3094341, 3077952, 3047488, 3023928, 2994715, 2875473, 2792437, 2750425, 2474015, 2211846, 2125010, 1968355, 1744174, 1664079, 1584425, 1462507, 1270270, 1181156, 1102552, 1052205, 1127324, 1138872, 1162940, 1149263]
13999A149263j14656j7124L2925l3567q3955n1602j8580r9050K9179R0159n9482
13988H23510o0124m7448j11254l6261o0101k5339L5794j2827L8835J793m8757
13977D97821l8383J06294R0173K2856M7801k5864p0404j9674n5467J9568j1358
13966E63363M8438O3101Q0619m0625K3918j15934J9744P6022J1794n2011n9737
13955F18692p1177j7925Q2734M9780R1633J14598J2290l9829P9493R4471N5130
13944A069890J9148k7087p121n8180l8277J33285J94263J30454l9573P7107J16917
13933A570826J67481K89571J44616R9861J78977J14681J26345K77360K72959K92796
13923C535473L17904L69669M06861L68666M80801N78280N89292O83752R09078
$$ y = [1149263, 1034607, 1017483, 1050408, 1016841, 932886, 881284, 862704, 763654, 792833, 882992, 823510, 763386, 715938, 604684, 568423, 508322, 482983, 518777, 505950, 544785, 546578, 497821, 459438, 565732, 655905, 678761, 726562, 700698, 630294, 610620, 555153, 574721, 563363, 611801, 674902, 755521, 714896, 738814, 622880, 642624, 718646, 730440, 678429, 618692, 547515, 529590, 612324, 662104, 753737, 868335, 880625, 840796, 920289, 1014760, 1069890, 1089038, 1061951, 1054830, 996650, 958373, 1091658, 1285921, 1416375, 1376802, 1453909, 1570826, 1738307, 2027878, 2172494, 2272355, 2451332, 2566013, 2692358, 2969718, 3242677, 3535473, 3853377, 4223046, 4629907, 4998573, 5479374, 6057654, 6646946, 7330698, 8239776]
13914H239776Q96976Q86588J201150J167791J236496J357419J639850J823062
13906A8449108K061553K274246K562956K865770L165675L594644M136126M838071
13898D3948149N660143O577956P547235Q638690R826040J0632001J0444039R562293
13890A12836546Q595154P927183Q317483R702623J0547416R090485N145690l25467
13882A71837113o271717j1212044j3753740j4157435j3513619j2274164j0479406
13875I0174988q617409o778917n411005m557462l947903l634437l400358l335816
13867E0491681k968206k748229k491552k365558k153275j829576j615378j585165
13859C2734742j482355j387935j149086r97413j061946j018285q95183q98193
$$ y = [8239776, 9136752, 10023340, 11224490, 12392281, 13628777, 14986196, 16626046, 18449108, 20510661, 22784907, 25347863, 28213633, 31379308, 34973952, 39110078, 43948149, 49608292, 56186248, 63733483, 72372173, 82198213, 92830214, 103274253, 112836546, 121431700, 129358883, 137676366, 147378989, 157926405, 167016890, 172162580, 171837113, 165565396, 154353352, 140599612, 126442177, 112928558, 100654394, 90174988, 81557579, 74778662, 69367657, 64810195, 60862292, 57227855, 53827497, 50491681, 47523475, 44775246, 42283694, 39918136, 37764861, 35935285, 34319907, 32734742, 31252387, 29864452, 28715366, 27717953, 26656007, 25637722, 24742539, 23844346]
13851B3844346q94215o23237n81134o54917o01809n65476n47828n84389n55765
13842A8235576m54107l92015l73624m37511m23169l61426l34522m22717k81593
13833A4754892k72828k88352j75854j53230k62857j58058j41158j48756o8697
13824A3085102j70921q5529j36753o6102Q1179j22853j82122j39250r0705j36486
13814A2035560k6975m3489j08480j26865p4165j3058r9554L912j16612q3937k0295
13803A1326042o9682r4922P3886M6179J7170R8471P3689j15057l1497J21149j627
13792A1443801j5366J14210K7769N3514Q4547J01107Q3309J06944J83316P1936
13782A2255087N9586J08476M4426p9499j2488J96424Q5630n7651o4691p3270M7316
$$ y = [23844346, 22950131, 22326894, 21745760, 21090843, 20489034, 19923558, 19375730, 18791341, 18235576, 17781469, 17389454, 17015830, 16578319, 16155150, 15793724, 15459202, 15036485, 14754892, 14482064, 14193712, 14017858, 13864628, 13601771, 13443713, 13302555, 13153799, 13085102, 12914181, 12828652, 12691899, 12625797, 12706976, 12584123, 12402001, 12262751, 12172046, 12035560, 12008585, 11965096, 11856616, 11729751, 11655586, 11642528, 11542974, 11546886, 11430274, 11346337, 11326042, 11256360, 11161438, 11235324, 11281503, 11298673, 11397144, 11470833, 11355776, 11324279, 11445428, 11443801, 11428435, 11542645, 11570414, 11623928, 11708475, 11809582, 11892891, 11999835, 12183151, 12255087, 12314673, 12423149, 12467575, 12388076, 12375588, 12572012, 12657642, 12599991, 12535300, 12462030, 12509346]
13771A2509346r06q3041j58517j53321j03421j54203k28299j55366l21595l17782
13761A0832895k18145j67986j04705j69305k93376l18692k91918k09281k37021
13752H822466j81028k38917p8061j79820j79999k03108j72550k55987j77158j14314
13742G041524j0088L1008j7451j91996j10830n5204o4598q6401j51142j65408
13732F219414j42012j73356q7098r8303j42857j5296M6845r0586r0680j6649p7509
13721E331913k74808n9179K1666k0881M6498j9483j119j00365j45667j6027l6744
13710D725804p5694q712j02782j72415q3392l5416j1270M2490j34654j59780N1085
13699D035264N4215Q7771l9750J7267o8311o8896j9873J6137k5403j26032q5113
$$ y = [12509346, 12508440, 12425399, 12266882, 12113561, 12010140, 11855937, 11627638, 11472272, 11150677, 10832895, 10614750, 10446764, 10342059, 10172754, 9879378, 9560686, 9268768, 9059487, 8822466, 8641438, 8402521, 8324460, 8144640, 7964641, 7761533, 7588983, 7332996, 7155838, 7041524, 7031436, 7062444, 7044993, 6852997, 6742167, 6686963, 6622365, 6535964, 6384822, 6219414, 6077402, 5904046, 5816948, 5718645, 5575788, 5560492, 5607337, 5516751, 5426071, 5409422, 5331913, 5057105, 4997926, 5019592, 4998711, 5045209, 5025726, 5024607, 4924242, 4778575, 4762548, 4725804, 4650110, 4641398, 4538616, 4366201, 4282809, 4247393, 4236123, 4278613, 4143959, 3984179, 4035264, 4089479, 4177250, 4137500, 4154767, 4086456, 4017560, 3997687, 4013824, 3988421, 3862389, 3777276]
13688C777276j27842j55621j90372r6499l6210k3939o8729j47900j46298L7859
13678B821725k5089j91271r4818j09739p9468q471N509j19039k01057j05879l2888
13667A859515j71192n9642M3549K3025m4445m0051p6192k0135r489p6493m1427
13656A387023J4281q5992q2856n2396O3350K7389r5623j10013q3459m6853p6817
13645H58034l7870M1542O9054L2897j4774M2458q6365Q377r0882l3865j00218
13634F88388j01869r775J04299N3156m876K5592l5578j882m5791k2348j62M9358
13622F98512Q1310J4579l3209M4003l7431L9338q4077o0231O5874N7761l817k8638
13610G53974r9367L8318M5380q7294O5350J3245n7572n0450M2366N4320m5903
$$ y = [3777276, 3649434, 3493813, 3303441, 3206942, 3170732, 3146793, 3078064, 2930164, 2783866, 2821725, 2796636, 2605365, 2510547, 2400808, 2321340, 2312869, 2318378, 2199339, 1998282, 1892403, 1859515, 1688323, 1628681, 1672230, 1695255, 1650810, 1610759, 1534567, 1514432, 1504943, 1428450, 1387023, 1401304, 1315312, 1232456, 1180060, 1243410, 1270799, 1175176, 1065163, 981704, 934851, 858034, 820164, 861706, 930760, 963657, 948883, 991341, 904976, 913353, 822471, 788606, 688388, 586519, 576744, 681043, 734199, 729323, 754915, 719337, 717455, 671664, 649316, 649154, 698512, 779822, 794401, 761192, 805195, 767764, 807102, 723025, 662794, 728668, 786429, 782612, 753974, 654607, 692925, 738305, 651011, 716361, 729606, 672034, 621584, 663950, 718270, 672367]
13599F72367K8750m9337j1562k3856M362q423J10718L7094k6610p5967n9541O8065
13587F66060l440M3319P0751k6565L1546Q132K5656Q3087N8231k2248K2340K9498
13575I86367m9298n0167N0183M1685j23783q0744m4196J02579J49140k8664N5863
13564A008965N7012K5560p3087J4195m1935R345j7147k6301N163p7860P8652J4346
13552I76908n8238k2906j8808M8727M4565N2015J538l5837J40073N7650j00788
13541A084899k9018r767n8003L1978J748j6147M5385M6417k344K283q5507j63611
13529H48313j9658M8343k6668j1775K5155P7229P791K1445L7936k9263r6262M348
13517H86934L0966n9341j22128l6381m0147l1708n3680J21625R2122l303k955
$$ y = [672367, 701117, 651780, 640218, 616362, 620724, 612301, 723019, 760113, 733503, 657536, 597995, 666060, 662620, 705939, 776690, 750125, 781671, 789803, 815459, 898546, 956777, 934529, 956869, 986367, 937069, 886902, 937085, 978770, 854987, 774243, 730047, 832626, 981766, 953102, 1008965, 1065977, 1091537, 1018450, 1032645, 990710, 1000055, 982908, 956607, 961770, 883910, 962562, 976908, 918670, 895764, 876956, 925683, 970248, 1022263, 1023801, 987964, 1128037, 1185687, 1084899, 1055881, 1046114, 988111, 1020089, 1021837, 1005690, 1051075, 1097492, 1095148, 1097431, 1011924, 848313, 828655, 876998, 850330, 838555, 863710, 940939, 948730, 970175, 1008111, 978848, 882586, 886934, 917900, 858559, 736431, 700050, 659903, 628195, 574515, 696140, 788262, 784959, 782004]
13506G82004P40j0100j09069j28332N1695J0772q4003N5657P6207J3794j5228
13495F44137J8649m934M3483Q4519m2685o0902p1808M899m9380N6919O6043k8049
13483F60891J05118r356k2897k0251j18415j08487o0638l8872R828J7548o4787
13472C49682r7872J33387M9419r5003L4946k0157j08507J18650J61436k6747n4944
13461D44290M584j8463J2287m9678m4691n5949M9232p9407o0668M7367N0272N0840
13449C50016m8243N571J9602m2517o495M8777P673Q0403L9662j9552N16M9374
13437D84787Q3797j1719j3019Q8397J48943J17408j8186P1905P4312J05037J15646
13426A247308M8051n7546J38949Q7557J27592J07342J33568P0302l0664p7330
$$ y = [782004, 782744, 772644, 663575, 535243, 586938, 597710, 513707, 569364, 645571, 659365, 644137, 662786, 657852, 701335, 785854, 743169, 682267, 610459, 615358, 565978, 622897, 688940, 660891, 766009, 756653, 733756, 713505, 595090, 486603, 425965, 387093, 396921, 414469, 349682, 251810, 385197, 434616, 339613, 374559, 354402, 245895, 364545, 525981, 499234, 444290, 448874, 430411, 442698, 393020, 348329, 292380, 341612, 262205, 201537, 248904, 299176, 350016, 301773, 307344, 326946, 284429, 277934, 326711, 334384, 414787, 454449, 434897, 435413, 484787, 568584, 556865, 543846, 632243, 781186, 898594, 880408, 952313, 1026625, 1131662, 1247308, 1295359, 1237813, 1376762, 1464319, 1591911, 1699253, 1832821, 1903123, 1872459, 1795129]
13416A795129K2201N7441K5571j11433j49498o8810r7265R5626k7711m9277m537
13405A487437r3727J10436J36093l5053J03207L3791j2797Q5946n641j53168j35035
13394A521489m6017K5975j16579j20990k3797j38775l2948R5505O2742K356q1159
13383A147802j15195l0981n3287M699Q8523K3466n5358m7428L0806k0878j18319
13372H53850n8521O1738K4399j14132j62621k8453K9156o4098L1268N4994N6121
13361F83701L9314L6213o9104p8043j9672Q1885m6880M0996q1728l5724m778M3629
13349E89809J5674N2726M135o9554n1392k6754r9889J5510J32501M4097j25355
13338D81508j56282j6559n4034J4717M2715O8403l4091j1628P9264J8584n6169
$$ y = [1795129, 1817330, 1874771, 1900342, 1788909, 1639411, 1570601, 1473336, 1568962, 1541251, 1491974, 1487437, 1393710, 1504146, 1640239, 1605186, 1708393, 1742184, 1729387, 1815333, 1809692, 1656524, 1521489, 1475472, 1501447, 1384868, 1263878, 1240081, 1101306, 1068358, 1163863, 1226605, 1228961, 1147802, 1032607, 1001626, 948339, 953038, 1041561, 1065027, 1009669, 962241, 993047, 972169, 853850, 795329, 857067, 881466, 767334, 604713, 576260, 605416, 541318, 572586, 627580, 683701, 723015, 759228, 690124, 612081, 592409, 674294, 627414, 668410, 586682, 550958, 546180, 589809, 605483, 658209, 662344, 592790, 541398, 514644, 414755, 430265, 562766, 606863, 481508, 325226, 308667, 254633, 269350, 312065, 380468, 346377, 334749, 414013, 432597, 376428]
13327C76428O0045J02794J31322l0345K864j25934j56693j00240k4561J1269O0525
13316C07474r87k391K0648Q6190L1172q9204m4784L766N2948j6020j4055K9821
13304C64578n4598N2317J23212j8767j53652m3806j0794j1990M4013m2274L2651
13293B80890K4331j1219k0720L7598K7279L9203J2336k7677Q1527Q4131r2221
13282D35458k9228R463M4149P6872M0K922J0487M3329L3509j1458M7628J18857
13270G82028M5181M7785j43542n8955P0924K2134O8248N3297K4997O0366K5238
13259I97701J0907l444M6278J1273j703L9536J7140r1375p9360M7287j5861l2633
13247I45746k8902J03960j661n2111j27136l2503L7343l0447K0046P0066J35209
$$ y = [376428, 436473, 539267, 670589, 640244, 643108, 517174, 360481, 260241, 235680, 246949, 307474, 306487, 304096, 324744, 410934, 442106, 352902, 308118, 311884, 364832, 348812, 334757, 364578, 309980, 362297, 485509, 466742, 313090, 269284, 258490, 246500, 290513, 248239, 280890, 305221, 294002, 273282, 310880, 338159, 377362, 389698, 362021, 443548, 527679, 435458, 406230, 415693, 459842, 536714, 536754, 539676, 550163, 593492, 627001, 615543, 663171, 782028, 827209, 874994, 731452, 672497, 743421, 765555, 833803, 887100, 912097, 972463, 997701, 1008608, 1005164, 1051442, 1062715, 1061012, 1100548, 1117688, 1026313, 946953, 994240, 978379, 945746, 916844, 1020804, 1019143, 967032, 839896, 807393, 844736, 814289, 834335, 904401, 1039610]
13236A039610n7357j46401j29466r9178O5989J6994R7295O0868n211l9194j64610
13225F39339j2071P3338k3844q2321K144K8404p3349J0056K6689l883j3897k7539
13213E43066j18754m6322o7560o411L3338k5992N8730R4790l9187j23402m6262
13202B56034K175j0925O1279K4051m0342K4995j90061q9630O4661P8798M514n5020
13190A30529r5685N1753N1511O1829K331m7874N1837P2306N5622k4377n4560j07829
13178A47393R2618P3736N921J2544R007o5873m3732Q394N4632m4191j1240M4622
13166B83831p227j1648J00448J75020N767r7391N0045L2731n6899r8344l3843
13155C42490p5872J6432K13884J54169j904M3849J04975O9058J15998R4042P0491
$$ y = [1039610, 982253, 835852, 706386, 607208, 673197, 690191, 787486, 848354, 843143, 803949, 639339, 627268, 700606, 676762, 594441, 596585, 624989, 551640, 561696, 588385, 584502, 570605, 543066, 424312, 377990, 310430, 304019, 337357, 311365, 370095, 464885, 425698, 302296, 256034, 258209, 247284, 308563, 332614, 292272, 317267, 127206, 37576, 102237, 181035, 185549, 130529, 34844, 86597, 138108, 199937, 202268, 154394, 206231, 278537, 334159, 309782, 255222, 147393, 240011, 313747, 319668, 332212, 341219, 275346, 231614, 240008, 294640, 250449, 239209, 283831, 276604, 264956, 365404, 540424, 546191, 448800, 498845, 531576, 474677, 376333, 342490, 266618, 283050, 496934, 651103, 649199, 693048, 798023, 867081, 983079, 1077121, 1147612]
13144A147612R7909J68036J69304L1396J424J05664K11963J66648J35512J51991
13134B387459J79811J06528J55219J95814J58335J95648K15275J88050J36858
13125C918997J01023J64069K8744J68333P1928J9033L4003L0659K3799O4179p16
13114D624051k3156q1817j42806q3095k20352l90875k10134j77347k64598l11249
13104B718622k23753k63243k03982j83868j35258O4653L4366O2033o7703j33016
13094A668851m2282K6187q838M0215j11836j02551j06467l3308k6143J7180O5528
13083A386536j085p1282M6464J80r0126j33489j00327l4443J102q0077m9276Q5763
13071I59940M0998K1814L4348O859r5533j1071J33882K7268l5819j44246J9130
$$ y = [1147612, 1245521, 1413557, 1582861, 1614257, 1615681, 1721345, 1933308, 2099956, 2235468, 2387459, 2567270, 2673798, 2829017, 3024831, 3183166, 3378814, 3594089, 3782139, 3918997, 4020020, 4184089, 4212833, 4381166, 4453094, 4472127, 4506130, 4536789, 4560588, 4624767, 4624051, 4600895, 4519078, 4376272, 4293177, 4072825, 3681950, 3471816, 3294469, 3029871, 2718622, 2494869, 2231626, 2027644, 1843776, 1708518, 1773171, 1807537, 1869570, 1801867, 1668851, 1626569, 1652756, 1643918, 1684133, 1572297, 1469746, 1363279, 1329971, 1303828, 1321008, 1386536, 1385451, 1314169, 1360633, 1360813, 1270687, 1137198, 1036871, 1002428, 1003530, 923453, 874177, 959940, 1000938, 1022752, 1057100, 1063959, 968426, 957355, 1091237, 1118505, 1082686, 938440, 957570]
13060I57570J51456J40937N3508o1942r0704m2070l1957m3540L3111K9435m0972
13049A054832N4823L3825Q2707L6680K8141P2073J27524J10564J10844J45221
13039A857234K17803K12487Q5153O7192J32257J78947J03155K00933R5171J89358
13029C339690K15425J82872J45875J41798K67502L52722L67412M56585K20701
13020E690582J85078K39918K93836K95518K79404M05181O46469O66410P48860
13011I451256P51682R44435J055859J201122J419969J439760J566432J767912
13003A9598427J952561K278688K567185K835386K954287L510966L902550M413984
12995D4014034N040592N589289O755029Q102066R400412J0831795J2507121J4430845
$$ y = [957570, 1109026, 1249963, 1303471, 1241529, 1150825, 1108755, 1076798, 1033258, 1066369, 1095804, 1054832, 1109655, 1143480, 1226187, 1262867, 1291008, 1363081, 1490605, 1601169, 1712013, 1857234, 2075037, 2287524, 2372677, 2439869, 2572126, 2751073, 2854228, 3055161, 3150332, 3339690, 3555115, 3737987, 3883862, 4025660, 4293162, 4645884, 5013296, 5469881, 5690582, 5875660, 6115578, 6409414, 6704932, 6984336, 7389517, 8035986, 8702396, 9451256, 10202938, 11147373, 12203232, 13404354, 14824323, 16264083, 17830515, 19598427, 21550988, 23829676, 26396861, 29232247, 32186534, 35697500, 39600050, 44014034, 49054626, 54643915, 61398944, 69501010, 78901422, 89733217, 102240338, 116671183]
12987A16671183J6711169J8357730J7499497J3511366R366024R230655J2877889
12980B14225513J8198675K1386925J6415173K455093j2176089k0031709k2190149
12973B18283432k2613441k2040087k0185210j7119503j3747452j0665196q129326
12966A03783217o753716o171541n695885n340060n055274m760266m383617l885110
12958F1737748l401366k949962k653872k382010k235700k063014j790505j608062
12950D2653257j465786j545241j411450j257687j132055j173635j146449j024821
12942C2496133q35550p20392n01377m87418o35683p73031p75994o86421q07063
12933B6273204o70091n88237o69669o09789n57585n63660n56138n48968l57986
$$ y = [116671183, 133382352, 151740082, 169239579, 182750945, 192116969, 201347624, 214225513, 232424188, 253811113, 270226286, 272681379, 260505290, 240473581, 218283432, 195669991, 173629904, 153444694, 136325191, 122577739, 111912543, 103783217, 97029501, 90857960, 85162075, 79822015, 74766741, 70006475, 65622858, 61737748, 58336382, 55386420, 52732548, 50350538, 48114838, 46051824, 44261319, 42653257, 41187471, 39642230, 38230780, 36973093, 35841038, 34667403, 33520954, 32496133, 31660583, 30940191, 30438814, 29951396, 29315713, 28542682, 27766688, 27080267, 26273204, 25603113, 25014876, 24345207, 23735418, 23177833, 22614173, 22058035, 21509067, 21151081]
12924B1151081l15792n53643m45180k41246k30153k61950k05007l02562j55790
12915A8439758j13111k41482j97995k03623o7818o8454m1321L19p2113j24260
12905A7309900q8824j58029j82937q2423p899n7158p7772o2817J2752R5976R6717
12894A6797486Q9280R9004J25478J21639K6348K2276j820Q2158P7898J35903J22163
12883A7697813N7174J58113J03215J03717Q6750J20717Q6565Q7386R3181J05268
12873A8699899J20160K09471M4392L9495Q9067r87p7399p4602n2161n2891p5455
12862A8868989q4188k06044l02072m64105n26597m49866n10098l10482k18484
12853A5797053l50398m83308n11918n28982l39692l96496l09743l24383l29474
$$ y = [21151081, 20835289, 20281646, 19836466, 19595220, 19365067, 19103117, 18898110, 18595548, 18439758, 18326647, 18085165, 17887170, 17683547, 17615729, 17547275, 17505954, 17506273, 17434160, 17309900, 17221076, 17063047, 16880110, 16797687, 16789788, 16732630, 16654858, 16592041, 16604793, 16700769, 16797486, 16886766, 16985770, 17111248, 17232887, 17259235, 17281511, 17279691, 17361849, 17439747, 17575650, 17697813, 17754987, 17913100, 18016315, 18120032, 18206782, 18327499, 18414064, 18501450, 18594631, 18699899, 18820059, 19029530, 19073922, 19113417, 19202484, 19201497, 19124098, 19049496, 18997335, 18944444, 18868989, 18784801, 18578757, 18276685, 17812580, 17285983, 16836117, 16326019, 16015537, 15797053, 15446655, 14963347, 14451429, 13922447, 13582755, 13186259, 12876516, 12552133, 12222659]
12844A2222659j65410k07798j59141j63544j79466j63678j80916o7550j17106
12835A0818050j31145j77081j56495r2978j34146o5491j68383j58512r5099j82967
12825I455753k33911m9361n9714m0226j69675r9286j58306j29472j13188j50915
12815H251699k07721j11537r0335j06705n4011k5100q5863j66720k16330l494
12805G183883m3507j02912j46780p0636r626j1918m5758j14185j04900K8698J4555
12794F576914k6157o1116k3155Q0556P7880k4605o731N3929o5678j87162j47165
12783F247510r8792k8327k60084l01616j79155n7514j51279j74476p7569j08264
12773D810434j28928r2081j27317k0276k061j21775p5462o3925j06948n4555M0960
$$ y = [12222659, 12057249, 11849451, 11690310, 11526766, 11347300, 11183622, 11002706, 10935156, 10818050, 10686905, 10509824, 10353329, 10260351, 10126205, 10060714, 9892331, 9733819, 9638720, 9455753, 9221842, 9172481, 9112767, 9072541, 8902866, 8803580, 8645274, 8515802, 8402614, 8251699, 8043978, 7932441, 7842106, 7735401, 7681390, 7656290, 7570427, 7403707, 7187377, 7183883, 7140376, 7037464, 6890684, 6820048, 6810422, 6798504, 6752746, 6638561, 6533661, 6562359, 6576914, 6550757, 6489641, 6466486, 6547042, 6624922, 6600317, 6593586, 6647515, 6581837, 6394675, 6247510, 6148718, 6120391, 5860307, 5558691, 5379536, 5322022, 5170743, 4996267, 4918698, 4810434, 4681506, 4589425, 4462108, 4441832, 4439771, 4317996, 4242534, 4178609, 4071661, 4017106, 4058066]
12762D058066m4307Q846J27898J42869p3899m7361N9553j09740j16181M5964P2126
12751D123834O0861j13335k07566j37979k48945j46965j74923j53003j36121j17563
12741B748295r4954j11423j26971j41482Q137q0248k0951l5239n3013j47817j33224
12730A811110r6473l7116O6396L2520l9981k7071O2928L8877O691j17601o579
12719A693701Q8657J40355Q8525j64385p1313P8811M294m30P4768Q7634j0963
12708B009654J8760P8627L2249r5838n0658k9879n7260j67099l7005J7681O036
12697A725268K6622J9544O6373p0253n6274R2881J72449J03712j8861Q7021J7639
12686B166121n742K284p058J45853M5105l9699Q9168j4152O2203Q0003j20817
$$ y = [4058066, 4013759, 4022605, 4150503, 4293372, 4219473, 4172112, 4231665, 4121925, 4005744, 4051708, 4123834, 4184695, 4071360, 3863794, 3725815, 3476870, 3329905, 3154982, 3001979, 2865858, 2748295, 2653341, 2541918, 2414947, 2273465, 2281602, 2201354, 2180403, 2145164, 2092151, 1944334, 1811110, 1714637, 1677521, 1743917, 1776437, 1736456, 1709385, 1772313, 1811190, 1817881, 1700280, 1693701, 1782358, 1922713, 2011238, 1846853, 1775540, 1854351, 1858645, 1858215, 1932983, 2020617, 2009654, 2028414, 2107041, 2139290, 2043452, 1992794, 1962915, 1905655, 1738556, 1701551, 1719232, 1725268, 1751890, 1771434, 1837807, 1767554, 1711280, 1804161, 1976610, 2080322, 2061461, 2148482, 2166121, 2160379, 2162663, 2155605, 2301458, 2346563, 2306864, 2396032, 2381880, 2444083, 2524086, 2403269]
12675B403269o5126j26578J4930j3942l3829M94J1696n0482L326K5710n685p3240
12663B090543j13137j06750P8026K9912j8503o0534L3166J81298P6249j58730
12653B031540l2273m5328j12273M775Q390M8030K1158M9876o121J4575N5571k8733
12641B009187o556K6768m5925q3153M9807J1796j24726q1054p3447Q5852n1827
12630A716722r7111k8623j4989P8919o32Q1851K5585q7194j72506N461n037j09269
12618A393177J5313Q4931l5780m4020J0923p7439m8994Q5425M1786j06266j15022
12607A204034J3522j4769r6454l0106K5236k8611k9893N0645l3486Q5444J09835
12596A255397r1161j09217n7783j10024j8075N5759r3202m5826K2411R1530j3737
$$ y = [2403269, 2338143, 2211565, 2226495, 2212553, 2178724, 2179218, 2190914, 2140432, 2143758, 2169468, 2163783, 2090543, 1977406, 1870656, 1948682, 1978594, 1960091, 1899557, 1932723, 2114021, 2190270, 2031540, 1999267, 1953939, 1841666, 1846441, 1854831, 1902861, 1924019, 1973895, 1967774, 1982349, 2037920, 2009187, 2002631, 2029399, 1983474, 1900321, 1950128, 1961924, 1837198, 1756144, 1682697, 1768549, 1716722, 1619611, 1590988, 1575999, 1654918, 1654286, 1736137, 1761722, 1674528, 1502022, 1507483, 1502446, 1393177, 1408490, 1493421, 1457641, 1413621, 1424544, 1347105, 1298111, 1383536, 1425322, 1319056, 1204034, 1217556, 1202787, 1106333, 1076227, 1101463, 1072852, 1042959, 1093604, 1060118, 1145562, 1255397, 1164236, 1055019, 997236, 887212, 869137, 924896, 831694, 785868, 808279, 899809, 886072]
12585H86072p6499M435Q8465O2028n0391m3886m8769O3116J3020O5276m9664o5788
12573H47415J0511n775n3572q8932J693O6071L2335j18536l6160P5086M3721j7670
12561G56187J20891k6807j19257j29977J8834P6042J21232m1152l5219L884L3672
12550G78330j09180n0462O1113J29543m09p9428J9084M9764Q2316K16748R8198
12539A195617Q5518J15213N6050O4728N3358R0208J7539K7527O6181J13744P8804
12528A964487q494p6473o8453j50845j00859j62779k06660j8421N553L8265J0725
12517A226046n6799p8076j10062M0407Q3238k7576j14614q862q1859m6675J1239
12506H36407r6r5552O6648K6183r2475j4829R5577R8510O6345m0321l7724O8087
$$ y = [886072, 809573, 814008, 902473, 964501, 914110, 870224, 821455, 884571, 897591, 962867, 913203, 847415, 857926, 852151, 798579, 709647, 711340, 777411, 809746, 691210, 655050, 730136, 773857, 756187, 877078, 850271, 731014, 601037, 619871, 695913, 817145, 775993, 740774, 744658, 778330, 669150, 618688, 679801, 809344, 808935, 729507, 748591, 798355, 880671, 1097419, 1195617, 1281135, 1396348, 1452398, 1517126, 1570484, 1660692, 1678231, 1705758, 1771939, 1885683, 1964487, 1955993, 1879520, 1811067, 1660222, 1559363, 1396584, 1189924, 1171503, 1177056, 1215321, 1226046, 1169247, 1091171, 981109, 1021516, 1104754, 1077178, 962564, 953702, 871843, 825168, 836407, 836311, 740759, 807407, 833590, 741115, 726286, 821863, 920373, 986718, 946397, 908673, 976760]
12494I76760K4097j9466o5122p3526L2128O7463l1179p9329o0916m3031k7847
12483G00032K0551J01707P223p0037l5110J0511L1658l6047M8191L175l5832M136
12471G50158o4539J9817J15871K2983m2909k323l8359m7908p9782j13274r1105
12460D28630M4472J16553J8717J0429l9151j9762o092L8607L2150L3875n2395
12449F06033K3423N1555O0420Q0190r3293q1827o5110j8405n9045L5452o970q5444
12437D46979l7863J07731k516m9838O6982k578L4173K4344n3842j606K8460M7624
12425F08050k09676J6832R6957l322n6710o9536n7262M773N9666L3218J2267L7818
12413D73075O1853k5322j38253m852N3448N9593j8570o5927n1890r8208m9854
$$ y = [976760, 1000857, 981391, 916269, 842743, 874871, 942334, 911155, 831826, 770910, 727879, 700032, 720583, 822290, 829513, 759476, 724366, 734877, 766535, 730488, 778679, 781854, 746022, 750158, 685619, 705436, 821307, 844290, 801381, 799058, 760699, 712791, 633009, 519735, 428630, 473102, 589655, 608372, 618801, 579650, 559888, 553796, 592403, 624553, 658428, 606033, 629456, 681011, 741431, 821621, 728328, 646501, 581391, 562986, 503941, 539393, 532423, 446979, 409116, 516847, 514331, 464493, 531475, 528897, 563070, 587414, 533572, 531966, 560426, 608050, 398374, 415206, 512163, 508841, 452131, 382595, 325333, 330106, 389772, 422990, 435257, 473075, 534928, 509606, 371353, 366501, 419949, 479542, 460972, 395045, 343155, 244947, 195093]
12402A95093M8562J27732m8650p0796j08197l5121n8471Q7969L0224n0951j5771
12391A01623P2675J11133Q7311l7664j41674L534K9622L4515R9474O2772n2357
12380C70964N0324M3141k6817L0741q5021k5110K5078n2480L3032j0690k1737
12369C31425J9250k242m0251K6804Q3152M9851p3079k1171r7055k5495R7904r851
12357C39242M339J08963n5608o1812J01542l3251J8039K4619j806n5613k0427
12346C68227m4636k3400L9512N7487Q5140m8264j1559J7790j4391k6838R9486
12335D98554r4521q5710L9867j879K3570J710l255O8979L3146m04m413n8644J5490
12322D32490J00957n568q2203j03054n64M5486J3618R1184m3372J7522p1653p0
$$ y = [195093, 243655, 371387, 322737, 251941, 143744, 108623, 50152, 138121, 168345, 117394, 101623, 174298, 285431, 372742, 335078, 193404, 196938, 226560, 261075, 360549, 423321, 370964, 421288, 464429, 437612, 468353, 383332, 358222, 383300, 330820, 363852, 353162, 331425, 350675, 348433, 308182, 334986, 418138, 467989, 394910, 373739, 276684, 251189, 349093, 339242, 343581, 452544, 396936, 335124, 436666, 403415, 421454, 446073, 444267, 388654, 368227, 323591, 300191, 339703, 397190, 482330, 434066, 422507, 440297, 425906, 399068, 498554, 404033, 318323, 358190, 356311, 379881, 381591, 378336, 447315, 480461, 480057, 475644, 417000, 432490, 533447, 527879, 445676, 342622, 342058, 387544, 401162, 492346, 448974, 466496, 394843, 394773]
12310C94773o917j2891N3947o794l8383R621j5987P741n7503l621K9616l7318
12298C16284O568L0379J680j10002j6540N4338R717N284Q9444m6487O0350k5413
12286C75602p5656j48996N122P2109O8139m4996j6795k4082j1212K6748R1151
12275C17134l1468q1673K5163m961M8861L5961q8087K783o2656m3688N7162o8848
12263A05683k1436l7307M2320k4990r5623j5735j3083O1770M7250J35321N6330
12252B40500j26394L1074N1450o997q6318n6420J4328J29387P9118m1355k0707
12241B07666J2099j0330Q5333o255r8656N0774M5256q697M096q0517q2754n3925
12229F4090k8143J05233R1880M9963m7398l9759M4583M3166k3648R3671M0310
$$ y = [394773, 387856, 374965, 428912, 422118, 383735, 393356, 377369, 385110, 327607, 323986, 353602, 316284, 322852, 353231, 354911, 244909, 228369, 282707, 292424, 297708, 387152, 340665, 401015, 375602, 299946, 150950, 156072, 228181, 296320, 251324, 234529, 210447, 199235, 225983, 317134, 285666, 203993, 229156, 224195, 273056, 309017, 220930, 223713, 161057, 117369, 174531, 105683, 84247, 46940, 89260, 64270, -31353, -47088, -60171, 1599, 48849, 184170, 240500, 114106, 145180, 196630, 189633, 103315, 46895, 61223, 190610, 269728, 228373, 207666, 219765, 209435, 294768, 288513, 189857, 240631, 285887, 277190, 281286, 200769, 118015, 64090, 35947, 141180, 233060, 283023, 235625, 195866, 240449, 283615, 259967, 353638, 393948]
12218C93948r5384j31422L8641p920j7131m1219k4737K2140M8147K4273P4527
12207B83863O504l3261k8835n3789m6403m518J3123J1484k5254l0082N7183K2239
12195A72254P5149N8468R824r0420M336k5775P455J2608l320Q853O0221N4732
12183C44385J6092p7355l0331J9136J63102k7553j4584p2717k1719n0860J7465
12172B65061l335j653n5190r3925k5961J2263J08755Q902L0746o4727n6722l4174
12160I0040J17415P3636n8741R2640J37167n2238n3257k3391j8474j2349L2009
12149C24457l0574q7210J2406P5248J858r4857M7909k2078m2841L9141K611m9207
12137A76863M2068p862m5896P8177R9671n7401r6606k1936l8071k255o235Q0602
$$ y = [393948, 298564, 167142, 205783, 197863, 180732, 139513, 114776, 136916, 185063, 209336, 283863, 290367, 257106, 228271, 174482, 128079, 123561, 136684, 148168, 122914, 92832, 150015, 172254, 247403, 305871, 315695, 225275, 229611, 203836, 211291, 223899, 220579, 229432, 289653, 344385, 360477, 283122, 252791, 271927, 435029, 407476, 392892, 320175, 298456, 247596, 265061, 261726, 260073, 204883, 110958, 84997, 97260, 206015, 214917, 245663, 180936, 124214, 90040, 207455, 281091, 222350, 314990, 452157, 399919, 346662, 323271, 304797, 292448, 324457, 293883, 206673, 219079, 294327, 296185, 201328, 249237, 227159, 184318, 223459, 226070, 176863, 218931, 211069, 165173, 243350, 343021, 285620, 189014, 167078, 129007, 126752, 120517, 201119]
12125B01119L9710n0520l9377J9248J282J8166K245N8972n4435L8327L5142p0253
12113A99626l0882Q1202P8177O1379q1160j05345J5871p581r7313n1012R8493
12102A61455N4196m1695Q4943L7396N8947j16444j04156m9459l110J03282n4522
12091A30833j230Q1822k0534m5621K9291j4980P6396K1050k9720j19938l7976
12080F9393l7041n084O4278o6534O7822J6552P3437R0361O3844j23796o3665Q159
12068A57726j57361m7556L1069M3133k3093k9441J02009J76809K9075K3052j5290
12057B90132q9255o7939p413J7889M039Q074l9452L3739P2920J06j4618j176p5455
12044A31591q6189j60085P134O1006n43j3566k2922Q5129O3031L3364O3860N6605
$$ y = [201119, 240829, 190309, 150932, 170180, 171462, 189628, 191873, 250845, 196410, 234737, 269879, 199626, 168744, 249946, 328123, 389502, 308342, 202997, 218868, 211287, 113974, 62962, 161455, 215651, 173956, 258899, 296295, 355242, 238798, 134642, 85183, 82073, 185355, 130833, 129603, 211425, 190891, 145270, 174561, 159581, 235977, 257027, 227307, 107369, 69393, 32352, 27268, 91546, 25012, 92834, 109386, 182823, 273184, 337028, 213232, 149567, 157726, 365, -47191, -16122, 27011, 3918, -25523, 76486, 253295, 282370, 305422, 290132, 200877, 132938, 125525, 143414, 147453, 155527, 116075, 149814, 222734, 222840, 208222, 207046, 131591, 45402, -114683, -107549, -46543, -47086, -60652, -83574, 1555, 64586, 97950, 161810, 218415]
12032B18415k0435q9280k2790O1867l1228k8704n4486k4859J15923J33402M8499
12021C06324r773P3618k8977j46845k1725M7664k9154k1065m1480N5549j4218
12010A69918N8410o273k5793M9061L9581j803k1105j73083j08880O2316M8170
11999I0519L5018m1502L5131l3372n4737k3521k5537j4792k2942M0566J1248l8200
11987d2121l8874L6832L0059K1100J02728m2751n6205Q2436O7622m7130m6539
11976F7157L8496k1002K5139m8482o4711o456N8940k4947j7178n1549L5994O2477
11964E3878l5909N4654R293r0152n7216L1203M8076o6003j2400K4619K3044O4413
11952D7500R6341j01468n0405o9741j09813N2977K5938Q0883J37169J06034m4481
$$ y = [218415, 197980, 108700, 85910, 147777, 116549, 87845, 33359, 8500, 124423, 257825, 306324, 296551, 370169, 341192, 194347, 172622, 220286, 191132, 170067, 128587, 184136, 169918, 228328, 222055, 196262, 245323, 284904, 283101, 261996, 88913, -19967, 42349, 90519, 125537, 84035, 119166, 85794, 31057, 7536, -18001, -32793, -55735, -15169, -3921, -42121, -80995, -44163, -14104, 6996, 109724, 66973, 10768, 93204, 160826, 113696, 67157, 105653, 84651, 109790, 61308, -3403, -9859, 49081, 24134, 6956, -44593, -8599, 53878, 17969, 72623, 81916, -8236, -65452, -34249, 13827, -52176, -64576, -39957, -16913, 47500, 143841, 42373, -8032, -77773, -187586, -134609, -108671, -27788, 109381, 215415, 170934]
11941A70934k4088K5346q3756n5992q6798Q4080P5761M2904r65q3430J06482K4834
11929A95312K316j22293p2902m3339M8961J59780L0545j10039m7005j06538k604
11918f7806M5183K5350J13414N9017N6369L103r2937j55640k6952J70519J08291
11907B37911J1215K2971j03086o6053n4022n9800K1699r299j7244L6694j8822
11896B164o3850M7354J08900m371L4865j1382p738N2902K0572O3465r6935o8647
11884G7299k7030k0613O6329M8555J378j9689m8048l3528j7435J7103o4767n4050
11872g4496M9297L8748P0367J14771J2612p4232o7688L8925m7713o3094J5784
11861A3281K5456r854l8451j9573Q7007P3379M1380K2121j34998o4185Q8454K4932
$$ y = [170934, 146846, 172192, 88436, 32444, -54354, 29726, 105487, 148391, 147426, 63996, 170478, 195312, 197628, 75335, 2433, -40906, 8055, 167835, 198380, 88341, 41336, -65202, -67806, -22623, 2727, 116141, 175158, 231527, 234630, 141693, -13947, -40899, 129620, 237911, 249126, 272097, 169011, 102958, 48936, -10864, 10835, 1536, -15708, 20986, 2164, -61686, -14332, 94568, 90197, 125062, 113680, 105942, 158844, 179416, 242881, 145946, 77299, 50269, 29656, 95985, 144540, 145918, 126229, 78181, 44653, 27218, 44321, -20446, -74496, -25199, 13549, 83916, 198687, 211299, 137067, 69379, 108304, 60591, -2503, 13281, 38737, 28883, -9568, -29141, 57866, 131245, 172625, 194746, 59748, -4437, 84017, 108949]
11849A08949n7144l8426r311O4859R979j9434j2950o6459M0975j766M7466j948
11837F4790Q1154J7355o3200n5983j9873K8486K1096O7657k2458j13955p9634
11826g4565K2961L6244P4197l0288l8952J15659m2529o7728P5461O0909p3408
11815E7961j13797o3552j6395J9501J01573J15096l6326K8435M0454j872o1286
11804F9792O732j6990p8023M2574P1946R758r3833J7626K1782j04341j9836J16307
11792D3494J9938q101p6532O571J06587p805p6688N1631r645k0588m6689j5823
11780c3650j2020J44497L6598m4960j17623m0824M7030Q6944k2348Q2273M8872
11769A74789n9050q1515j41865p2005J04717J07281O6011j3872m4810M8021J5124
$$ y = [108949, 51805, 13379, 4068, 68927, 78906, 59472, 46522, -19937, 21038, 19272, 66738, 64790, 145944, 163299, 100099, 44116, 24243, 52729, 73825, 141482, 119024, 5069, -74565, -51604, -15360, 58837, 28549, -10403, 105256, 62727, -5001, 70460, 131369, 57961, -55836, -119388, -135783, -116282, -14709, 100387, 64061, 92496, 132950, 131078, 69792, 76524, 59534, -18489, 24085, 96031, 105789, 11956, 29582, 51364, -52977, -72813, 43494, 63432, 55331, -21201, -14630, 91957, 84152, 7464, 59095, 49450, 28862, -17827, -33650, -45670, 98827, 135425, 90465, -27158, -67982, -20952, 65992, 43644, 125917, 174789, 115739, 34224, -107641, -179646, -74929, 32352, 98363, 84491, 39681, 87702, 102826]
11758A02826m2566j09948K0137K9740M4435J5252R3858J19773l8282l5822M0924
11747B40327n8601k1038k5886R667j7453N5648j23159l3520M6143k2725J08j8055
11735C1456l6994k6196J1460Q0130o1983k6284Q3741O3772p8576l5174J00657
11724A06009J03773j39230r2391M2460J11759O4262m7671q8929m7671n7177j6083
11713f0889k8915K1671K8036P8709P7701l7598p4702l0599m0422m3547P3905R5779
11701E9129j2202n9162J1586m3600L261Q4190M4043q594j11019m4641R5115P9333
11689I7439j3505p106n670m1297P5516N0144j4192l5554J17092P3267q7451q4060
11677A24623j14210p4347l5417J2359M523q7555j334J5570j5542N3616J13697
$$ y = [102826, 60260, -49688, -29551, 189, 44624, 59876, 153734, 273507, 235225, 199403, 240327, 181726, 160688, 134802, 144469, 127016, 182664, 59505, 25985, 72128, 49403, 49511, 31456, -5538, -31734, -20274, 59856, -2127, -28411, 55330, 119102, 40526, 5352, 106009, 209782, 70552, -21839, 20621, 132380, 196642, 148971, 60042, 12371, -44806, -60889, -89804, -68133, -40097, 38612, 116313, 78715, 4013, -26586, -67008, -110555, -36650, 59129, 46927, -12235, -649, -44249, -40988, 43202, 87245, 78651, -32368, -77009, 18106, 97439, 83934, 76828, 71158, 29861, 105377, 155521, 141329, 105775, 222867, 296134, 208683, 124623, 10413, -63934, -99351, -86992, -82469, -170024, -171358, -155788, -171330, -117714, -4017]
11666d017o006k6832M6938Q3631K9986r6503n0005J07m0270j5886p571J2748j05448
11653a79128R3979J22985r971K3068m7098M3988J4630n5575K6825p590N413M0867
11641G2393j4859K4579j2874j5063k6769l2375p5405m8148l467J22079P7620P3210
11629A40921J00779n6356j61590M291J287L7537Q02O9258J4390K9802j22095L2394
11617I1420N2206j2227o0889o1841N0060l1062P3643P0165n3164m3761j9802K3624
11605G8372K9020k6783o4253q5940K9549J02410j7189J8644J7327n4628n4207
11594b7678J06924p766J9794K973M0158Q1356j14834j47861K1145J14363p912
11583H0662M6159p9863j02764J09325J20551J1978o2241j7703M5703N2704Q946
$$ y = [-4017, -10023, -36855, 10083, 93714, 123700, 27197, -22808, -22701, -62971, -78857, -86428, -73680, -179128, -85149, 37836, 27865, 50933, 3835, 47823, 62453, 6878, 33703, 26113, 31526, 72393, 57534, 82113, 69239, 54176, 27407, -4968, -80373, -128521, -131988, -9909, 67711, 140921, 241700, 185344, 23754, 28045, 29332, 66869, 67671, 136929, 151319, 181121, 59026, 91420, 143626, 131399, 70510, 8669, 58729, 27667, 101310, 171475, 118311, 74550, 54748, 78372, 107392, 80609, 16356, -69584, -40035, 62375, 45186, 63830, 81157, 26529, -27678, 79246, 71480, 91274, 94247, 134405, 215761, 100927, -46934, -25789, 88574, 80662, 126821, 46958, -55806, 53519, 174070, 186048, 123807, 106104, 151807, 204511, 213457]
11572B13457m7443m2609N2813J14109j43489j44406M8791K9980q4848k3153P039
11561a9759O8016J05830j5747j12834M2440J12657q3170q8912j14619k2329M1258
11550h7169J03144k5358L555R4772J17484K3791j29002K325m1964M2626K0935
11539A25139n2837n3568o7034o2087Q9813J15809K7901J9331L7561n2460K131
11528A29699k5324k749O7665k7172j1857l5773k5750k6172J4460k2628j09924
11517g5525J4108k1780J049N8052N9581J02592K3690j13423k722R8333l5435j2583
11505I5937R8910l5810j15471j3848L3358L2382r3576j247l2567M8165J40762
11494A56995J05555q2215n8361o1653k2634O0054m0306l82M6846p4747l6207R8282
$$ y = [213457, 166014, 123405, 176218, 290327, 146838, 2432, 51223, 81203, -3645, -26798, -19759, 48257, 154087, 138340, 25506, 67946, 180603, 97433, 8521, -106098, -128427, -87169, 15975, -9383, -5828, 88944, 206428, 230219, 101217, 103542, 61578, 104204, 125139, 72302, 18734, -48300, -110387, -20574, 95235, 123136, 142467, 180028, 127568, 129699, 104375, 101626, 169291, 142119, 130262, 94489, 68739, 42567, 57027, 34399, -75525, -61417, -83197, -82148, -24096, 35485, 138077, 161767, 48344, 45622, 143955, 108520, 95937, 194847, 159037, 43566, 29718, 63076, 95458, 1882, 635, -31932, 16233, 156995, 262550, 180335, 121974, 60321, 37687, 97741, 57435, 57053, 103899, 29152, -7055, 91227]
11482I1227L1636N642k6049l5260k0913o4645n382J19549J05436K1438k6373j25427
11470G0879j09129P0990N8673M5385p0245m7839j7564n8861L9540O1366L2889
11459G6084p641J5501Q9123J31375o8745n2596p537r4845L6895J7682L9290r7000
11447G7586K0688K9441r0795j41893l3218n272R4397J5195l7996k0295L852J5669
11435g2641Q2873O515j0332J22041N1930k1877m7023O1948Q2750o8379p9389p0021
11423C8395q1482m8821R6355n5763o6780N4622M2575K1558K9339O1660o2109q0379
11411e0830o8940Q3497P7846K7433o9875p3715r0725m832j4519J5963J7990J6170
11399a34537o6352O1976R1917J39496K7651j1573j19483p0722O0368j0202m1167
$$ y = [91227, 122863, 128505, 102456, 67196, 46283, -18362, -23744, 95805, 201241, 222679, 196306, 70879, -38250, 32740, 91413, 136798, 66553, 18714, 1150, -57711, -18171, 43195, 76084, 68443, 83944, 173067, 304442, 235697, 183101, 175564, 80719, 117614, 135296, 174586, 77586, 98274, 127715, 36920, -104973, -138191, -143463, -49066, -33871, -71867, -92162, -88310, -72641, 10232, 16747, 6415, 128456, 180386, 158509, 111486, 173434, 256184, 187805, 108416, 38395, -43087, -91908, 4447, -51316, -118096, -63474, -20899, 659, 29998, 91658, 29549, -50830, -119770, -36273, 41573, 69006, -869, -74584, -165309, -170141, -184660, -168697, -150707, -134537, -200889, -138913, -46996, 92500, 120151, 108578, -10905, -81627, -21259, -31461, -72628]
11388g2628J0911O2578N3064l4867m8180l3168k6612P9950j1274k6182m7813L1473
11376f2748J9529R3574L2668m1071K4725n091j17227K8180l6276L51N7191l6592
11364d2787O3677O5652P599o784l6728o078J8855m1245Q3668N1607J6797J897
11352A76130J028p6630j6783J33317O7026j14091o5691K6415O3635j1007k0730
11341A62619j00521J3324k9597K865J0412j24562n7843k5563j4664M0985k0085
11330a42630o8179L4733J7259L7494Q1315L9681J6035M1753m8313Q3630O2290
11319A55068j52579k9646K1388L8026N0009j6706o0749j17972l6778l9432N4342
11308a35029P4006k9311P064O1118N9272j6725K4108K6190M8649o8373p4148k2766
$$ y = [-72628, -61717, 861, 53925, 19058, -29122, -62290, -88902, -8952, -20226, -46408, -94221, -62748, -43219, 50355, 83023, 41952, 66677, 61586, -55641, -27461, -63737, -63386, -6195, -42787, 20890, 86542, 94141, 87357, 50629, 44551, 63406, 22161, 105829, 157436, 174233, 176130, 177158, 100528, 83745, 217062, 284088, 169997, 104306, 130721, 194356, 183349, 162619, 62098, 75422, 45825, 48690, 59102, -65460, -123303, -148866, -163530, -122545, -142630, -210809, -176076, -158817, -121323, -40008, -327, 15708, 57461, 9148, 92778, 155068, 2489, -27157, -5769, 32257, 82266, 65560, 4811, -113161, -149939, -189371, -135029, -61023, -90334, -83270, -22152, 37120, 20395, 44503, 70693, 119342, 50969, -23179, -45945]
11296d5945N6005n3855K4207k7822n6185q6546m160J5884J26994N89j2915n8550
11284a22299R0049J6851L5384R545j2268l1660J6193m5654M910r489Q6721o6566
11272b8283r2317K7159O4927n0903j44431M3956O1715J15573J15612J5432k6019
11261A02421k3914J14613o1998o8410r007K6195k9137j6668o2999m661K4745K715
11249f105r3769n6653O1581O7955L2199m3070n5478q0352N078J0545R2161J01481
11237C5573J36753n0045j13436L7661m7320o668k2461M5385Q8860K2531l4033
11226I2800n5336j9431r8248n4384L6118M3161M2470L7979J3511Q3084J1526J4436
11214A47686r7943J3337J52845o2213j32228o2812N2401J18457l0800j39554n8626
$$ y = [-45945, 10060, -43795, -19588, -47410, -103595, -190141, -194301, -178417, -51423, -50834, -63749, -122299, -32250, -15399, 19985, 29530, 17262, -14398, 1795, -43859, -38949, -48438, 38283, -28283, -120600, -93441, -28514, -79417, -223848, -179892, -118177, -2604, 113008, 128440, 102421, 78507, 193120, 131122, 62712, 53705, 79900, 50763, 34095, -28904, -33565, -8820, -6105, -99874, -156527, -94946, -26991, 5208, -37862, -93340, -173692, -168614, -158069, -65908, 35573, 172326, 122281, 8845, 46506, -814, -7482, -29943, 15442, 104302, 126833, 92800, 37464, 18033, -80215, -134599, -98481, -55320, -12850, 25129, 38640, 121724, 133250, 147686, 49743, 63080, 215925, 153712, 21484, -41328, 11073, 129530, 98730, -40824, -99450]
11203i9450k9205j3585N2419Q0380K7491O3448j4848l4605m5318k3365k1346J2046
11191d5938N2342q129J27507k2926j6048M8488K0714q6353n0245o186j6390k4486
11179b7650j283p9377j00097M7447K3869n1356J5428K7377R5155M5194M6891K0975
11167F2573l2987K6099N7667o4723r3643k2347L7770j07899J14734P569M7468
11156C2281J2281j125q065p4513rK383l6490Q5703k496L6164M7220j06442K5795
11143A2687K9030J00482P5764l4369j11653k0660j35431p2616J64528M1667j9260
11132C0169p3016K3154n6521q5352K9288j4836J511k6758O5772P2262M6063o4276
11120e2540N9785J22612m4856j05226N9215Q6931o9301K8801N9897o3543q9312
$$ y = [-99450, -128655, -142240, -89821, -9441, 18050, 81498, 66650, 32045, -13273, -36638, -57984, -45938, 6404, -1725, 125782, 102856, 86808, 135296, 156010, 69657, 19412, 13226, -3164, -27650, -28933, -108310, -208407, -160960, -137091, -188447, -173019, -145642, -50487, -5293, 41598, 62573, 29586, 55685, 113352, 48629, -45014, -67361, -29591, -137490, -22756, -15187, 32281, 44562, 43437, 35372, -39141, -39150, -36767, -73257, 12446, 9950, 46114, 93334, -13108, 12687, 41717, 142199, 217963, 183594, 71941, 51281, -84150, -156766, 7762, 49429, 30169, -42847, -19693, -76214, -161566, -132278, -147114, -145603, -172361, -106589, -34327, 11736, -52540, 7245, 129857, 85001, -20225, 38990, 125921, 56620, 85421, 145318, 81775, -7537]
11109g537k3403J68322m650j09814k879J7043J3440q1670L0448m3512j04850J6134
11097a32928O9660M3089L0129k3990j8494O5859p0157o5488o323J9987J4865L3030
11085d0761M6795J34824r792n8138r7516n4445J08233J39645q9290j16053p1264
11074a07762m8919J86896J17818m8274K3516o2424K3571J00833j8662q3129m9207
11063C4257p2734N8577J4047j5562j1231P0455k365M364m8999J00495M4935j84399
11051h160n2359M53o1312J0444O1961J31312J2647l7321l4358p2825N6453J6760
11039B3695r1738n3787J02746M0943K5735m6044o9506n9153N1593p041R4560k1800
11027i797m834j005j2687j10720l0748J18036M4094J6449j8044l4765K5328O0162
$$ y = [-7537, -30940, 137382, 132732, 22918, 20039, 37082, 50522, -31148, -700, -44212, -149062, -132928, -63268, -20179, 9950, -14040, -32534, 33325, -36832, -102320, -108643, -88656, -73791, -40761, 6034, 140858, 131066, 72928, -24588, -79033, 29200, 168845, 79555, -36498, -107762, -156681, 30215, 148033, 99759, 123275, 60851, 84422, 185255, 166593, 83464, 34257, -38477, 20100, 34147, 18585, 7354, 77809, 75444, 79808, 30809, 131304, 176239, -8160, -60519, -60066, -121378, -110934, -48973, 82339, 94986, 57665, 23307, -49518, 6935, 23695, -68043, -121830, -19084, 21859, 47594, 1550, -67956, -127109, -75516, -82557, 12003, -9797, -14631, -15636, -28323, -139043, -169791, -51755, -7661, 8788, -9256, -44021, -18693, 41469]
11015D1469k721j61250N6597M0365P4376o010o5652M1304L671n3842p5047m4434
11003a51174k322m1176Q4003J43930P8057k3043m8488O9249m1264o7701p2258
10992g2187r9758N5362k9585M8477k0805k5202l2929O6031N9597N5758K9403j00052
10980f5890q692J0308K268l4578J05563J12263k4824j201L09J8175k9152o3764
10968B0785J6224L8036K1527M9300j26000q9n1870r2172M6980J09883o6144k4071
10956e7611L8186K0215j2150n7791j2938Q8456J2066j4846M3201k3846N3358n1075
10944B5225q2507N1429O7428O0235j35152l5922k2561l609J22016J19418m3116
10933A22884p3722O556m5908n1643L0492l158j01691p6491J3188M3256k740M7134
$$ y = [41469, 38748, -122502, -65905, -25540, 48836, 42826, -22826, 18478, 22149, -31693, -106740, -151174, -153496, -194672, -110669, 33261, 111318, 88275, 39787, 109036, 67772, 71, -72187, -171945, -116583, -146168, -97691, -118496, -143698, -176627, -110596, -50999, 4759, 34162, -65890, -74582, -64274, -62006, -96584, 8979, 121242, 96418, 95217, 95526, 113701, 84549, 20785, 37009, 75045, 96572, 145872, 19872, 19783, -32087, -124259, -77279, 32604, -33540, -57611, -19425, 790, -11360, -69151, -82089, 6367, 18433, 3587, 46788, 22942, 76300, 25225, -57282, -5853, 61575, 121810, -13342, -49264, -71825, -75434, 46582, 166000, 122884, 49162, 55718, 9810, -41833, -11341, -14499, -116190, -192681, -179493, -136237, -138977, -91843]
10921i1843Q7027P259k18685k5415J00630L3049m6764L2962l1009J3522P1555
10910f7712J5596L7241r2835m6279J68082O2446p5417j009J1782q0967M7200k1590
10898d3462l7184m3503o3392o5211J04072N2723R1472N2599K1772q4741k6153
10887d1008M0310J1893p3565q7607Q1957L3073l6470q8930J08020Q3357O4017
10876I5047p25k1590l7261j38570K9724O9838P9965m9958o3196n4126j5729K2310
10864h4271P4161j1637l5397j3687N4590j501k057M226K1570M3206m9078j958
10852a833N6182P1595P6634n1310n6665j12042j65289R596J6275J27696J19659
10841I0498q810k903K5132l5972j36638l131m8231o6634K447M610q018P4381j231
$$ y = [-91843, -4816, 2443, -216242, -241657, -141027, -107978, -154742, -121780, -152789, -139267, -67712, -52116, -14875, -107710, -153989, 14093, 76539, 1122, 113, 11895, -69072, -21872, -43462, -80646, -124149, -187541, -252752, -148680, -95957, -4485, 48114, 69886, -14855, -41008, -698, 11195, -62370, -149977, -68020, -34947, -71417, -160347, -52327, 31030, 95047, 94322, 72732, 35471, -103099, -73375, -3537, 76428, 26470, -36726, -90852, -106581, -84271, -10110, -21747, -57144, -70831, -16241, -17742, -19799, -15573, 5997, 49203, 125, -1833, 54349, 125944, 202578, 151268, 94603, -17439, -182728, -173132, -156857, -29161, 90498, 81688, 78785, 103917, 67945, -68693, -71824, -120055, -186689, -184242, -179632, -187650, -113269, -114500]
10828a14500j7275R8474M4861j0440l4048k8520p9931N5330M3642R7428K8162
10817H3183J05539n5932j37350q7170n3232Q7292J06211R662J3949N6472M1385
10806A70009N798O6172r5076l4835N5492o1569m3951k2413p1191O542j3637L4155
10794d504o6866j30292l7580O8856M6795P7992O3840l3324K1487p432J9105J1158
10782B9235n2194M8450m6845j19542n3042J25310j1564J5820N1608j3992P1428
10771D4672O4060R4723K5479J2951j11477m9617l8219l490p7420N6455J12891
10760A31008l6882n6924m6221j37411m9216N2610n0873Q0475O7876J00682J07356
10749A62480j5516O6337j9865j0762K7945p7951o288L4005p4835n9672o9855M4756
$$ y = [-114500, -131775, -33301, 11560, 1120, -32928, -61448, -141379, -86049, -42407, 55021, 83183, 188722, 132790, -4560, -91730, -144962, -57670, 48541, 58203, 72152, 128624, 170009, 175807, 241979, 146903, 112068, 167560, 105991, 62040, 39627, -31564, -25022, -38659, -4504, -71370, -201662, -239242, -170386, -123591, -45599, 18241, -15083, 6404, -1028, 18077, 29235, -22959, 25491, -21354, -140896, -193938, -68628, -80192, -64372, -12764, -26756, 44672, 108732, 203455, 228934, 241885, 130408, 80791, 42572, 39082, -38338, 18117, 131008, 94126, 37202, -9019, -146430, -195646, -143036, -193909, -113434, -45558, 55124, 162480, 146964, 213301, 193436, 182674, 210619, 132668, 126380, 160385, 85550, 25878, -43977, 779]
10737G79k3424k0255l7021m1333J3199l0665j3251N4367J07989J10212j43651
10726b3054k4354R9908K4400m9423r0431l7694k6977j61317l2793P9167O2144
10715a80424J27937N8309m9970k0999k1485k3600k5114O2338K5296R1910O2752
10704A06950n0263j2863j2543Q392N7606l6559j9895o0745o9399P8947J50856
10693A40484J6261j06954R40R7217o4864j00403q0479L086O4618k576L3956M4929
10681D6215L8039N5705k7798j9208o0095N345l3921r87J7015O679l3017M1625
10669C5597J05406j04352m3540j4301K8526L9038M8784L9882K519L125k539n2549
10657H5596j17927K2834L0912n569N885l8163K0393O028l6130q536j8034k6395
$$ y = [779, -22645, -42900, -79921, -121254, -108055, -138720, -151971, -97604, 10385, 120597, -23054, -47408, 52500, 76900, 27477, -62954, -100648, -127625, -288942, -321735, -242568, -180424, -52487, 5822, -44148, -65147, -86632, -110232, -135346, -73008, -47712, 44198, 106950, 56687, 43824, 31281, 39673, 97279, 60720, 40825, -19920, -89319, -10372, 140484, 156745, 49791, 50731, 147948, 83084, -17319, -97798, -94712, -30094, -32670, 1286, 46215, 84254, 139959, 112161, 92953, 32858, 38203, 4282, 3295, 20310, 26989, -6028, 35597, 141003, 36651, -6889, -21190, 7336, 46374, 95158, 135040, 137559, 140684, 138145, 85596, -32331, -9497, 21415, 15846, 21731, -16432, 3961, 9989, -26141, -34677, -52711, -79106]
10645g9106r0189n5252Q4767P7250J1330J0104r1898n4620P7787J565l7917J5921
10633a30258l3190p096P377L8842k2146l6576R6417O6971j5232j1921n8758J614
10621a03956K210p6413J565O7025J34638Q1100j7372o5399l2490r5855O360J46169
10609D7582K212p8327q7261J6490J7302n6894R0365N7421j14812n2081N7794K2668
10597g7541j18209n4329N7455J31196j84420J315J07678P8911P6994m6294m5511
10586g2755l3882N9633n3051r0225J698J8285R2620K6260q1204l7377J60399J08244
10574I8645K0098j8485j12284j08304K983J08501J25693R634p5874m3580l9404
10563c2377r8559O444O3055J7456K463o5275Q734J3678P9519J5254l5560N1636
$$ y = [-79106, -169295, -224547, -139780, -62530, -51200, -41096, -132994, -187614, -109827, -108262, -146179, -130258, -163448, -170544, -163167, -124325, -146471, -183047, -86630, -19659, -34891, -46812, -105570, -103956, -101746, -178159, -176594, -109569, 25069, 106169, 88797, 23398, -9092, -104947, -98587, 47582, 49794, -28533, -115794, -99304, -82002, -138896, -48531, 8890, -105922, -158003, -100209, -77541, -195750, -250079, -192624, -61428, -245848, -244533, -136855, -57944, 19050, -27244, -72755, -106637, -47004, -100055, -190280, -188582, -170297, -77677, -51417, -132621, -169998, -9599, 98645, 118743, 100258, -12026, -120330, -117347, -8846, 116847, 126481, 50607, 7027, -32377, -130936, -124492, -61437, -43981, -41518, -106793, -98059, -84381, -4862, 10392, -25168, 26468]
10551B6468O1729m720k3236q7524q4076R230J6248P564m1740r2345J7932J05012
10539h9458J45106K6580o2464o9698O6457K4848J0915l9604o0523N5630L2237
10528D0026M7354j02310k9640L2552K5414Q4937l9307k3039j8436q9158K2942
10517d8665k3645j6768j6124O1208O0046J8816L678J591P5817L6274r5503j11871
10505e5146o9726j562M8093J12206m3357p5870j1823m1605j8692N3697O9892q4380
10493a18273n0184N380m255L5933L6837q1410J02408L5586K3538P8143O9575M5773
10481A79051J23j49450j6468M9125Q7938K008o3062J561k2354j06252k5753J2670
10469e0863J1738N9668k6850n9961l5307p7134K3037J22573k6569k006O5756J26285
$$ y = [26468, 88197, 83477, 60241, -27283, -111359, -102129, -85881, -78317, -120057, -212402, -194470, -89458, 55648, 82228, 19764, -49934, 16523, 41371, 52286, 12682, -47841, 7789, 40026, 87380, -14930, -44570, -12018, 13396, 98333, 59026, 35987, 17551, -71607, -48665, -72310, -89078, -105202, -43994, 16052, 34868, 38546, 40137, 115954, 152228, 56725, -55146, -124872, -126434, -78341, 33865, -9492, -85362, -97185, -138790, -157482, -103785, -33893, -118273, -168457, -163077, -167332, -131399, -94562, -175972, -73564, -37978, -14440, 63703, 133278, 179051, 179174, 29724, 13256, 62381, 150319, 152327, 89265, 90826, 68472, -37780, -63533, -50863, -39125, 20543, -6307, -66268, -101575, -178709, -155672, -33099, -59668, -61674, 4082, 130367]
10457A30367N1310O5605M0450k9593j40280j09484M3853M9246m6755J3225q7941
10446a9997j11608J07529R4996p6226o5322K0388l714O4045J21984k6772n1180
10435E4123L2540l822K7870q5645m3128jm2556r416k829L6991N5776k7546q1304
10422h8947P1318J5232P1698M2898K5953Q7057q0972n0659j41204p8347l0614
10411a56587R6906J0361J01041K2129j40810m3868R3262P7736k0603q4191N0352
10400E728N365n3159k8266R94J3371p2441K8102o3865j43936L3090M6111J02137
10388a26769O5226K0546K7911M9373m540k1637P8761L6814k1632p4252M1886J3083
10376H4770j4095k3432m9176o6468M5718m960L9765Q570l5256M9314q072Q1841
$$ y = [130367, 181677, 247282, 287732, 258139, 117859, 8375, 52228, 101474, 54719, 67944, -19997, -131605, -24076, 70920, -5306, -70628, -50240, -53954, 10091, 132075, 105303, 54123, 86663, 82841, 110711, 25066, -18062, -18063, -60619, -70035, -72864, -35873, 19903, -7643, -88947, -17629, -2397, 69301, 112199, 138152, 225209, 144237, 93578, -47626, -125973, -156587, -59681, -49320, 51721, 73850, -66960, -110828, -17566, 60170, 39567, -44624, 5728, 11093, -42066, -70332, -69338, -55967, -128408, -100306, -164171, -308107, -275017, -228906, -126769, -61543, -40997, -13086, 36287, 31747, 10110, 88871, 125685, 104053, 29801, 71687, 84770, 70675, 47243, -1933, -68401, -22683, -27643, 12122, 20692, -14564, 34750, 26678, 108519]
10364A08519P8746j93133j01369M4473O063j9965k2694M0998R4613l1881Q184
10353A2554O021Q7383N5260q9212r2905j9168O1941J03852n8379k8862O8569J40707
10341B47761J0469q4142r3763r7536R3138J9874l3407n8096O7302o2897m4046
10330c5343j27970k7375J1133O6572P3476p580m9547o8568o1502M9576J35598
10319d1530P4588N0073j740l5774M8765r7649m3790J333J4105j25558m7405J9808
10307a84774M2933O4217J02935k9552P1429P668p8648k3901j02038l5728O2457
10296a03002J1775l6782K1480k413n559M8541M5257k9731O579O5318J6649K8899
10284F7011o364o3792n9890l0323k3889L9505L3732q2996k3726Q5186J06399L2363
$$ y = [108519, 187265, -5868, -107237, -62764, -56701, -76666, -99360, -58362, 36251, 4370, 12554, 18575, 105958, 161218, 72006, -20899, -40067, 21874, 125726, 67347, 38485, 107054, 247761, 258230, 174088, 80325, -17211, 75927, 95801, 62394, 4298, 71600, 8703, -35343, -163313, -190688, -179555, -112983, -39507, -47087, -96634, -165202, -226704, -177128, -41530, 33058, 83131, 81391, 45617, 94382, -3267, -47057, -45724, -31619, -157177, -204582, -184774, -141841, -77624, 25311, -4241, 67188, 74856, -3792, -27693, -129731, -165459, -103002, -91227, -128009, -106529, -108942, -114501, -65960, -20703, -50434, -43855, 21463, 38112, 67011, 60647, -3145, -63035, -93358, -117247, -77742, -44010, -127006, -150732, -65546, 40853, 73216]
10272G3216q5678m5649K4039J16413K8560r7742k0550N907m7528k9263L3150j1839
10260e6964l335P6288J37253J5157q2169n1320R4559Q6469q4106j60177j823P6131
10248D5963O9121l9541q603o2640K3339P312r3147k2971Q2876J339k1085O0646
10236D2609k6723k6560l3049q6968M276J4398J0096q164n0316L8308P0480K1487
10224c0126m5409m005Q2160J1927m2359j54804m2040P9381L1609J4309M3642Q4004
10212B8289p728j9666N3337l72n172Q538m3559q9347N8714M4803n5715J4953J09666
10199I6741J46998j6089m5609M5102k1470j14790l8881R4943m149o8021j29092
10188e4317m0430Q7269j6872k3038n036m467L1025p4392m3928M1400J88626J10394
$$ y = [73216, -12462, -58111, -34072, 82341, 110901, 13159, -7391, -1484, -49012, -78275, -45125, -56964, -60299, 15989, 153242, 168399, 86230, 34910, 129469, 215938, 131832, -28345, -30168, 45963, 115084, 75543, 66940, 4300, 27639, 34951, -58196, -81167, 1709, 3048, -18037, 42609, 15886, -10674, -43723, -130691, -126415, -112017, -101921, -110085, -160401, -122093, -51613, -30126, -75535, -79540, 2620, 14547, -27812, -182616, -224656, -145275, -113666, -99357, -55715, 28289, 20561, 895, 54232, 53860, 48688, 57226, 13667, -75680, -16966, 27837, -27878, -12925, 96741, 243739, 227650, 182041, 227143, 205673, 90883, 52002, 146945, 142796, 74775, -54317, -94747, -7478, -24350, -47388, -52424, -56891, -25866, -100258, -144186, -102786, 85840, 196234]
10176A96234p8065q0158J1245K8966P2750r200j54171n4799K274j5271m3795N5627
10164f8363p3770n9137l7417M8669M1040L0076Q4255J03077l019r801J12218k3859
10152A43969n8498n8708o0144m3496j5105K1602R485Q0037j03109q4150M3002
10141a25115J4255j2468M3063Q7825Q7416R820k7858j7207j1969R8206k3270n8209
10129F4489k247J6298j45924j209N7755J9294N5968L5502M854l537l5249l7020
10117B8974p0703Q7536R1705O8739p1964p507r8497j9600J0537q1689m524R0736
10105B3743K1276L2101k4361j2881n0667m2871J08798l5418m0242n8895J874n9756
10093a37299N9807M7281l6108k6734P1626j1228M7804j7177k4114l2995m1400
$$ y = [196234, 118169, 38011, 49256, 78222, 150972, 141772, -12399, -67198, -64924, -80195, -123990, -68363, -142133, -201270, -238687, -190018, -148978, -118902, -34647, 68430, 65411, 55610, 167828, 143969, 85471, 26763, -33381, -76877, -91982, -70380, -60895, 19142, -83967, -168117, -125115, -110860, -123328, -80265, 7560, 94976, 104796, 76938, 59731, 47762, 145968, 122698, 64489, 62242, 78540, -67384, -68593, -10838, 8456, 64424, 99926, 104780, 101243, 65994, 28974, -41729, 45807, 137512, 206251, 134287, 126780, 28283, 8683, 19220, -62469, -66993, 23743, 45019, 77120, 52759, 39878, -10789, -53660, 55138, 19720, -20522, -79417, -77543, -137299, -77492, -30211, -66319, -93053, -21427, -32655, 15149, -2028, -26142, -59137, -100537]
10082a00537o7003j8680J32554R9356m2112l0030k4050J0239M9570J13484k0658
10071A02133j09925j15936r1985j8679J57781N9448j86590k7917P5050J54362
10061b258O2466L0969M19l2108p0424N7811q2692N9309j9877j646K3787J4048
10049C9804l767o4325j8641J2886M2917N8033M162n7662l6417p7767p440P2377
10037c5840L6317J04226o1230j00347k5172L8867K6990O9676N538N0322k8326
10026H1021l6559K0748L1199l51j00337k8668K4747L4365K4057m2951k9666L7178
10014A4783P1849j7993M2682J1217p8475Q407n5300J6798n0314l3210j00813Q7666
10002h2703M2871M0233n6192L5571N4436l5967p2726N0546O0890o3094r7569Q5501
$$ y = [-100537, -167540, -186220, -53666, 45690, 3578, -26452, -50502, -40263, 9307, 122791, 102133, -7792, -123728, -215713, -234392, -76611, -17163, -203753, -231670, -156620, -2258, 60208, 91177, 91596, 59488, -10936, 46875, -35817, 23492, 3615, 1969, 25756, 39804, 36037, -28288, -46929, -34043, 8874, 66907, 71069, 13407, -23010, -100777, -108217, -35840, 477, 104703, 43473, -56874, -82046, -43179, -16189, 53487, 59025, 109347, 81021, 44462, 65210, 96409, 96058, -4279, -32947, -8200, 26165, 50222, 7271, -22395, 14783, 86632, 68639, 111321, 122538, 44063, 52470, -2830, 13968, -36346, -69556, -170369, -82703, -39832, 401, -55791, -20220, 34216, -1751, -74477, -23931, 36959, -26135, -123704, -38203]
9990c8203k8085p8590N0555R2356J3532j26562N71P1881L3105Q3263j56519j72629
9978b55325M7266J19721J01279m4643r1428k0692N4513K9291O3035K7144J0353
9967D0514P2628k0266m310k4396p7713j5084m4017J2879J1884k6387L8976j9268
9955e4560N2756R27M7343M4871K6345K8454L3732n2416p9963N1217o7712p1553
9943d0559M6805O6923l8392l48j4493K7792Q4564N3847q1298j05724K9617L9618
9931F8352l3497J3856L0848L0844l3110r0462N3289O2207p5126Q6416k9685p9346
9919D586M1072Q5229J3626M9532J875n7364r3840J1277N786l4279k3261K6136
9907C0375L7060O7698K4737m5669j88769j36728L0263L8862k7944L6128J11058
$$ y = [-38203, -66288, -144878, -94323, -1967, 11565, -114997, -114426, -42545, -9440, 73823, -82696, -255325, -208059, -88338, 12941, -31702, -123130, -143822, -89309, -60018, 3017, 30161, 40514, 113142, 92876, 88566, 64170, -13543, -28627, -72644, -59765, -47881, -74268, -35292, -54560, -1804, -877, 46466, 91337, 117682, 146136, 179868, 127452, 47489, 98706, 30994, -40559, 6246, 73169, 34777, 34429, 19936, 47728, 132292, 186139, 104841, -883, 28734, 68352, 34855, 48711, 79559, 110403, 77293, -13169, 40120, 102327, 27201, 113617, 83932, 4586, 45658, 130887, 144513, 194045, 195920, 138556, 44716, 55993, 61779, 27500, 4239, 30375, 67435, 135133, 159870, 114201, -74568, -211296, -181033, -142171, -170115, -133987, -22929]
9896b2929P8340M6038j6806L484j0700p2687j8232J1894j41791m2570N8163l7276
9884a65072l8030M0791Q2827J09742K8174q3299K6537n8292J7311L6793j0902
9873a3420j922K2525r1512O1862K6154m4240M50M4920n2780L3844J3195Q215j11632
9860a04341j0747J71796n288l131j3715j007M734k474J2329p1743j9667R066Q0652
9847D6464l093J10450K6284o1306j39310M68J12940M4481P203q2084p0435m6366
9835e4304k0278l110J5381K6598P123Q814M1821K7407L4782R252p8722l4397j13396
9822a33029k5614P705K7256J35523L7254Q1304J8785j20579P6972M2432j10936
9811C7073j0447k5356m6562l8034K4157O9013O1037j3260q7700O4985K4294l7448
$$ y = [-22929, 55411, 101449, 84643, 88127, 77427, 4740, -13492, -1598, -143389, -185959, -127796, -165072, -203102, -162311, -79484, 30258, 58432, -24867, 1670, -56622, -39311, -2518, -13420, -15342, 7183, -84329, -22467, 3687, -40553, -40103, 4817, -47963, -14119, -924, 7291, -104341, -115088, 56708, 51420, 48289, 34574, 33567, 38301, 35827, 48156, -23587, -43254, -34188, 46464, 43371, 153821, 180105, 118799, -20511, -20043, 92897, 137378, 144581, 62497, -7938, -54304, -74582, -77692, -62311, -35713, -28590, -19776, 22045, 49452, 84234, 93486, 14764, -19633, -133029, -158643, -150938, -123682, 11841, 49095, 130399, 149184, 28605, 105577, 148009, 37073, 26626, 1270, -45292, -83326, -59169, 9844, 70881, 57621, -30079, 34906, 59200, 21752]
9799B1752l3726k3892Q7882R3361p2209j519J2910O5391k5975q4737j05572j00492
9787a66826M8551J16922K9214j719j8604p7890m4394K4396J3981N463J1136J1359
9775d8411J5099k1138J84130N2487r6945j50102L7142N9995p092P1315q913j65187
9763g7620J984L1412k3088L5761J17023K4939J2859k4747j5169N0153l9040J086
9751I5553k9492k2792k0385J51684O406j43418J784k5864M0751P8030l8341k1620
9739G2296j4681r7930j28511L5437O2704P1279j0929J370k8463r907J0907M896
9727c1532O3034M1389k2759J2189j3689Q929n4650j0467O045m4905R2704J1506
9715E7794m7449l4394O1629Q3968k1227m279j9925q7961l0667n302n1381k2054
$$ y = [21752, -11974, -35866, 52016, 145377, 73168, 71649, 84559, 149950, 123975, 39238, -66334, -166826, -118275, -1353, 27861, 26142, 7538, -70352, -114746, -90350, -76369, -70906, -59770, -48411, -33312, -54450, 129680, 182167, 85222, -64880, -27738, 32257, 25165, 96480, 87567, -77620, -75636, -44224, -67312, -31551, 85472, 110411, 123270, 98523, 83354, 133507, 94467, 95553, 66061, 43269, 22884, 174568, 180974, 37556, 39340, 13476, 54227, 132257, 93916, 72296, 57615, -40315, -168826, -133389, -70685, 594, -10335, -8965, -37428, -47335, -36428, -31532, 31502, 72891, 50132, 62321, 48632, 57561, 2911, -7556, -1511, -46416, 46288, 57794, 10345, -24049, 37580, 121548, 100321, 96042, 76117, -11844, -42511, -47813, -99194, -121248]
9703a21248j02622k8303o651M0974J51283J33692Q650j29064j197m9705k7184
9692a31375O1166k357J36200m0621j14753l8609L4670L6565m9843L578j0018j1099
9680a26496J45109Q9374n4758l9778m4917K4159j6969J0262J09026n774p2138
9669A7100R9373K0881m3648j7747P7158l2887j5253m650m1612N0230J23582o5233
9657A67294o6765o5956R5688m0347M835P105j13986M7383N2354L6289J00154P1137
9645B95185o5892k9966p1024m0659Q1797P5993k2411p6462j04868O522L8705L36
9633H7256P8177n6883j18113P8290K5450J6560P9922J2898o2221M991q868n9075
9621G8384L4730O0979K2047O5827j10163l1219n196O0104J4475r9068j3396m1580
$$ y = [-121248, -223870, -252173, -258824, -217850, -66567, 67125, 75775, -53289, -54486, -104191, -131375, -70209, -72566, 63634, 23013, -91740, -130349, -95679, -59114, -108957, -105379, -115397, -126496, 18613, 107987, 53229, 13451, -31466, -7307, -24276, -14014, 95012, 89238, 17100, 116473, 137354, 93706, 75959, 153117, 120230, 104977, 100327, 58715, 108945, 232527, 167294, 100529, 34573, 130261, 89914, 94749, 101854, -12132, 35251, 87605, 123894, 224048, 295185, 229293, 199327, 128303, 87644, 169441, 245434, 223023, 146561, 41693, 48215, 86920, 87256, 165433, 108550, -9563, 68727, 94177, 110737, 190659, 203557, 141336, 146327, 137459, 78384, 113114, 174093, 196140, 261967, 151804, 120585, 115389, 175493, 189968, 90900, 77504, 35924]
9609C5924m9627k2146J52213r1735o9886n9764M626M7305N8630N5538J14717R7209
9597B73004j58750r9292j4638m584J9086N037j05728l4999P9879R2265J35969
9586A87249J6192j51913n0349N1499J17367J13307K4073M1443m873l5776j64066
9575A44153j55016R5158Q3130P1853K7947J8681j6750m6603n8602J13795o1911
9564B15835j03662m3084j1519n9595m2181O7732K7813L8949j2190P6899L3134
9553A88131l0437J6154N5673r2025O831j475J061j3092j7678k8271p1294P5587
9541H9165J4111m085P9748O5088k3540m5963l3493o1653r291j9902m8006J07719
9529A09898L4649l6086j15350K6234M0855O808K8906P1377J4544j0816J2144o8975
$$ y = [35924, -13703, -35849, 116364, 24629, -45257, -105021, -100395, -53090, 5540, 61078, 175795, 273004, 114254, 14962, 324, -4260, 14826, 19863, -85865, -120864, -40985, 51280, 187249, 203441, 51528, 1179, 52678, 170045, 283352, 307425, 348868, 343995, 308219, 144153, -10863, 84295, 167425, 239278, 267225, 285906, 269156, 222553, 163951, 277746, 215835, 112173, 69089, 57570, -2025, -44206, 23526, 51339, 90288, 78098, 154997, 188131, 157694, 173848, 229521, 137496, 144327, 142852, 143913, 130821, 113143, 84872, 13578, 89165, 103276, 99191, 178939, 244027, 220487, 174524, 141031, 79378, 70087, 50185, 2179, 109898, 144547, 108461, -6889, 19345, 60200, 67008, 95914, 167291, 181835, 171019, 183163, 114188]
9517A14188j3731R8638l3397L6175M9063o0295j8337R3709N2771p3585q0992L0234
9505A94441N4278N288j44533q3755K5872M2812J05231J09309J62757m1638Q817
9494D38879N7185P9128r5973j0605q2640j30719j24317o4633J46931o989q2469
9483A23778r832j6538M1968L8992N3509K1993M1604J5920n8812m43L9246R4774
9471C86159j4375n0860m9536L2722Q9129j02778l0649J1781J5024K6882M3775
9460C57274K2796n4146n1534O64M8457Q336o5726j02396q012q646L2030R6093
9448B75190K5037n3165j2145k4197j9870m554N4546k4716J0237j4448j5599J16161
9436C12477J81445k1066j42359k6373n9686q4168l3403J17795k4432K445J20852
$$ y = [114188, 100457, 199095, 165698, 201873, 250936, 190641, 172304, 266013, 318784, 245199, 164207, 194441, 248719, 254007, 109474, 25719, 51591, 94403, 199634, 308943, 471700, 430062, 438879, 496064, 575192, 479219, 468614, 385974, 255255, 130938, 66305, 213236, 206247, 123778, 113946, 97408, 139376, 178368, 231877, 253870, 295474, 311394, 252582, 252139, 291385, 386159, 371784, 320924, 271388, 304110, 393239, 290461, 259812, 271593, 286617, 313499, 357274, 380070, 325924, 274390, 275054, 323511, 331847, 266121, 163725, 155713, 147067, 179097, 275190, 300227, 247062, 234917, 210720, 190850, 186296, 240842, 216126, 226363, 211915, 196316, 312477, 493922, 472856, 330497, 304124, 244438, 160270, 126867, 244662, 220230, 222675, 343527]
9425C43527K5118p440N0109j5610L9380l5796n2146o0913l0948P0202J53547k4162
9413D54868j3192n1687q726J00890J8819J1401L6313K8319M3576m6514j64172
9402D09895m4700L6319J1610R7288J7935K7930R211J1517O5201k384n8462p1537
9390E09823O7649R3324R3953J6028r9512q7315J0030M4352P0406M0725J0601k5747
9378G44317O9563R3426R3043O501q3585l0957J1478R7419K7494K5529N2949K863
9366A110040p6685M450J5717P2523Q3570O726J9392J1889m4552N5934K2612j14134
9354A167482Q130j8839P2350L3180m900r3069n5949J5394K2896k5443n3887l7785
9342A029560K221l1387p09j7176O4551O7577J10202L1984p9707P7616K7834J5371
$$ y = [343527, 368645, 361205, 411314, 395704, 435084, 399288, 347142, 286229, 255281, 325483, 479030, 454868, 441676, 389989, 381263, 482153, 500972, 512373, 548686, 577005, 620581, 574067, 409895, 365195, 401514, 413124, 510412, 528347, 556277, 565488, 577005, 642206, 639822, 581360, 509823, 577472, 670796, 764749, 780777, 681265, 593950, 603980, 648332, 718738, 759463, 770064, 744317, 813880, 907306, 1000349, 1006850, 923265, 892308, 903786, 1001205, 1028699, 1054228, 1107177, 1110040, 1033355, 1037805, 1053522, 1126045, 1209615, 1216341, 1235733, 1247622, 1203070, 1259004, 1281616, 1167482, 1175612, 1156773, 1229123, 1262303, 1257403, 1164334, 1108385, 1123779, 1146675, 1121232, 1067345, 1029560, 1031781, 1000394, 999685, 982509, 1047060, 1114637, 1224839, 1256823, 1177116, 1254732, 1282566, 1297937]
9330A297937j2394m5251P639n980j4856L3329q453j6224j3949l52L0645N716L005
9317A260812M1333M2089L8127Q2844K7390L6947l2012N2555R7335P6881j31j03875
9305A620295j0040N2072N714l2810M2650K03698R5264O9330R9133L8529J5697
9294B199532j9208O2297J58081O3167q5642K5876Q1748j2608L4048J36198Q8915
9283B732404J2143J23524J64572J25959L4058P8851J11235J69504J45693N0711
9273C748654R9023N5850L3695K66363K53277J29387K02325K36599K08967K18931
9263E453071K08877J53848K02555L28370K08016K45055K24096K36984L34877L77331
9253G973080L53557M08683L82428M74112M74144M98983L70156L55364M70537M80883
$$ y = [1297937, 1285543, 1240292, 1247931, 1241951, 1227095, 1260424, 1251971, 1235747, 1221798, 1221446, 1252091, 1257807, 1260812, 1302145, 1344234, 1382361, 1465205, 1492595, 1529542, 1497530, 1550085, 1647420, 1724301, 1724170, 1620295, 1610255, 1662327, 1668041, 1635231, 1677881, 1881579, 1976843, 2046173, 2145306, 2183835, 2199532, 2180324, 2242621, 2400702, 2463869, 2378227, 2404103, 2485851, 2473243, 2507291, 2643489, 2732404, 2744547, 2868071, 3032643, 3158602, 3192660, 3271511, 3382746, 3552250, 3697943, 3748654, 3847677, 3903527, 3937222, 4203585, 4456862, 4586249, 4788574, 5025173, 5234140, 5453071, 5661948, 5815796, 6018351, 6346721, 6554737, 6799792, 7023888, 7260872, 7595749, 7973080, 8326637, 8735320, 9117748, 9591860, 10066004, 10564987, 10935143, 11290507, 11761044, 12241927]
9243A2241927N16552O21122O28911N55471N99064N53389O39259P01771P51109
9234A7808575N30014M83492O56905O64712N18373M32826M56832N30867N99196
9225B2681792N35955L19516K64073K19427L01604K1469q9160j40868j63033p6070
9215B3874705k02398l33570k23041j98479l00748m73915m62563m08432o18750
9206B0652809m87485m23090o13136n32717m21928n24391n05695m80999n03421
9197A6159947l93009l65931l68659l55876k46500m36161n41003m23514l07473
9188A2721821l31610l43117l36763k42689l19136k79059k04930j86032j95483
9179A0283002k96119m06619k58711k61002k09599j55991q3718j19517j53331k02544
$$ y = [12241927, 12758479, 13379601, 14008512, 14563983, 15163047, 15716436, 16355695, 17057466, 17808575, 18338589, 18822081, 19478986, 20143698, 20662071, 21094897, 21551729, 22082596, 22681792, 23217747, 23537263, 23801336, 24020763, 24322367, 24343836, 24254676, 24113808, 23950775, 23874705, 23672307, 23338737, 23115696, 22917217, 22616469, 22142554, 21679991, 21271559, 20652809, 20165324, 19742234, 19129098, 18596381, 18174453, 17650062, 17144367, 16663368, 16159947, 15766938, 15401007, 15032348, 14676472, 14429972, 13993811, 13452808, 13029294, 12721821, 12390211, 12047094, 11710331, 11467642, 11148506, 10869447, 10664517, 10478485, 10283002, 9986883, 9580264, 9321553, 9060551, 8850952, 8694961, 8611243, 8491726, 8338395, 8135851]
9169H135851k04636j52661j27454j19972j96434j64963j62091j54407j13006k1743
9159F718484j08467r9487j03545r0511q6324j22588m1406K4855N6048l120k22772
9148E921167j13644n5328j53999m1589O205k4757k2299l0335p5190p5716j14847
9137E219668k0256N4717R7802L3276l8131j27368j07853o7241K7670p800n4496
9126E009988M2790J37447n8891j50062p0536j2265M2465J8246j7189J1911n835
9115D948069M5897l7755j14333m7846j46634n9279m7738n9553o6719p0050J8607
9104D362666J39113l3352j31296m6684p9793m9586L5322o7873p8402P7884q9983
9093D038016j29547J6211n4685o9979m7105k4354J8711j1607p2970n3857r0067
$$ y = [8135851, 7931215, 7778554, 7651100, 7531128, 7334694, 7169731, 7007640, 6853233, 6740227, 6718484, 6610017, 6510530, 6406985, 6316474, 6230150, 6107562, 6066156, 6091011, 6147059, 6143939, 5921167, 5807523, 5752195, 5598196, 5556607, 5562812, 5538055, 5515756, 5485421, 5410231, 5334515, 5219668, 5199412, 5254129, 5351931, 5385207, 5347076, 5219708, 5111855, 5044614, 5072284, 5064484, 5009988, 5052778, 5190225, 5131334, 4981272, 4910736, 4898471, 4940936, 4959182, 4941993, 4953904, 4948069, 4993966, 4956211, 4841878, 4794032, 4647398, 4588119, 4540381, 4480828, 4414109, 4344059, 4362666, 4501779, 4468427, 4337131, 4290447, 4210654, 4161068, 4196390, 4128517, 4050115, 4127999, 4038016, 3908469, 3924680, 3869995, 3800016, 3752911, 3728557, 3747268, 3735661, 3662691, 3608834, 3518767]
9082C518767p9529j17874j41377j34234L2654O5000j251m4642o5527p4668J4476
9071B971795R9k2365k5139m5514q1221J56N2252j51876k3943K1758k6689N043
9059B674356J6098k3085k8371j17772j29683L479l8927J8146q3624j04296P654
9048B193975L9194P6144L0951j43119r1848l6099O6539J2146j1884K0267m483
9037B151783n4232j6425o5222l3319R1117k9335o5517k10942n4849J02788l0474
9026A785373K96o7365J9911j2199m4742O5996l5798q3425L9978M2298n3459o5904
9014A590960j4455p3294o780L303n2671k4692K8579r6863j00667k7830O8796J1068
9002A305454n9339l355k5609r9984o0559j0781n803K1187k1401n4637l0001o9482
$$ y = [3518767, 3439238, 3321364, 3179987, 3045753, 3078407, 3143407, 3142156, 3097514, 3031987, 2957319, 2971795, 2971894, 2949529, 2924390, 2878876, 2797655, 2797811, 2850063, 2698187, 2674244, 2696002, 2669313, 2674356, 2690454, 2667369, 2638998, 2521226, 2391543, 2395022, 2356095, 2374241, 2290617, 2186321, 2193975, 2233169, 2309313, 2340264, 2197145, 2105297, 2069198, 2135737, 2147883, 2135999, 2156266, 2151783, 2097551, 2081126, 2015904, 1982585, 2073702, 2044367, 1978850, 1767908, 1713059, 1815847, 1785373, 1785669, 1718304, 1738215, 1726016, 1681274, 1747270, 1711472, 1628047, 1668025, 1710323, 1656864, 1590960, 1576505, 1503211, 1496431, 1499734, 1447063, 1422371, 1450950, 1354087, 1253420, 1225590, 1294386, 1305454, 1246115, 1242760, 1217151, 1117167, 1056608, 1045827, 1040024, 1061211, 1039810, 985173, 955172, 885690]
8990H85690l5876J8160o7182L1258R112M6110l340j9418k0790R2223R2845n4107
8978I74685o2463l7780R0928l2778n4965m4028O8497k1582j05234l4014K0049
8967G61315M6103J773j9616j02525q8992m9137p78n614M2662Q5497J00144J646
8955G72478m3084J8819n1785N0239o4775r4634J0699N1836K4811o1227p6955O681
8943E43103L6002l8748R427J5273l3606J3312j30804M6371P7632k6648J1139N1825
8931E74278l9293K3922j0232J0708J22894L9637r0048l487k6560l5003k3012L5370
8919E79174L7228o3199r7808M1427j9648r7749P1299L8777m3362M461k7327J7143
8907D40416J36116P2878o5137J8250k4878N048o907j5159N2688L87j10927k1887
$$ y = [885690, 849814, 867974, 800792, 832050, 841162, 887272, 883932, 864514, 843724, 935947, 1028792, 974685, 912222, 874442, 965370, 932592, 877627, 833599, 902096, 880514, 775280, 741266, 761315, 807418, 809191, 789575, 687050, 598058, 548921, 548143, 542529, 585191, 670688, 770832, 772478, 729394, 748213, 696428, 746667, 681892, 587258, 597957, 649793, 674604, 613377, 536422, 543103, 579105, 540357, 549784, 565057, 531451, 544763, 413959, 460330, 537962, 511314, 522453, 574278, 534985, 558907, 548675, 559383, 682277, 721914, 631866, 628379, 601819, 566816, 543804, 579174, 616402, 553203, 455395, 496822, 477174, 379425, 450724, 489501, 446139, 450600, 423273, 440416, 576532, 649410, 584273, 602523, 577645, 582693, 575786, 560627, 613315, 613702, 502775, 480888]
8895D80888J0555M7760J24786n3917O8880p1045m4668N509j5937M151R8373k1809
8883F33526q613L236k095P6326l5612m5810R0492j1603J7864M9120N9578p5839
8871G50570j24602l7718J48273K0282o5322o4133J02876N7839L0840j04189p0709
8860F44007k9726q504k0937K7513m1922l4967m3020m3013P3862N8473q377L7120
8848F10509j01364r9041o5084K05119M0522k4019m2707m7259K997j01931j09158
8837B68584L3281J02866K6764L5971o0687o874M5697o7098o8651m8607J3246J36426
8825D10918l5097m0976K3446q3061k2008M2111j24366l361P4149M8182J3679M5556
8813C49172Q6507P5210K6881j10019m0918K2689J2092K7802k6106K5195J01005
$$ y = [480888, 491443, 539203, 663989, 610072, 678952, 607907, 563239, 568748, 552811, 556962, 655335, 633526, 624913, 628149, 626054, 702380, 666768, 620958, 711450, 699847, 717711, 766831, 826409, 750570, 625968, 588250, 736523, 756805, 691483, 627350, 730226, 788065, 818905, 714716, 644007, 614281, 605777, 584840, 612353, 570431, 535464, 492444, 449431, 523293, 581766, 573389, 610509, 509145, 410104, 345020, 550139, 590661, 566642, 523935, 476676, 479673, 377742, 268584, 301865, 404731, 431495, 467466, 406779, 399905, 445602, 378504, 309853, 261246, 274492, 410918, 375821, 334845, 358291, 275230, 253222, 295333, 170967, 167606, 241755, 289937, 303616, 349172, 435679, 510889, 537770, 427751, 386833, 409522, 421614, 449416, 423310, 448505, 549510]
8802E49510q13n2765p3955l6911M1880j836M1616L2077J310m4886m5782l5734
8790C73711o5145o5506r1021n3365J28108Q4816N2268n3450Q8500O4638k5044
8779D38510q5245q6076j22362J77665O8485J3854Q04j9658p0450L0535J01997
8768D48059j4685o054J3053L957M1091P157n4902q698M5336J0562o288m5016P624
8755D41196O2302o44q1274j4181J4462l3286J1064O7745M9559R3890K1950q1898
8743E50885P372r6914n8899K2323p7920n5272j426O2166J2158N7955k2631j6686
8731C83111J1452L3127j8647K441l284n9379O722R5861j2810m769J03267R481
8719E46573J8684n1469J7915M4785p1179j42012p8802j4001M5042K3464M8877
$$ y = [549510, 548697, 495932, 421977, 385066, 426946, 425110, 466726, 498803, 500113, 455227, 409445, 373711, 308566, 243060, 152039, 98674, 226782, 311598, 363866, 310416, 398916, 463554, 438510, 353265, 267189, 144827, 322492, 390977, 404831, 405635, 385977, 315527, 346062, 448059, 433374, 427320, 440373, 444330, 485421, 492578, 437676, 428978, 474314, 484876, 478588, 433572, 441196, 503498, 502854, 421580, 407399, 421861, 388575, 399639, 467384, 516943, 610833, 632783, 550885, 558257, 461343, 402444, 424767, 346847, 291575, 290149, 352315, 364473, 422428, 399797, 383111, 394563, 427690, 409043, 411484, 408200, 348821, 355543, 451404, 438594, 433825, 537092, 546573, 565257, 513788, 531703, 576488, 505309, 363297, 284495, 270494, 315536, 339000, 387877]
8708C87877M3866j7408j49641p6405N3180K3350N3736J02300J08362n7989j58986
8697C12242n098j21803K6124J09806P1009O0123p1909q5372j6103R3594P9114
8686D51727p2407l0922k863Q01K9154K9086K6739p3648N3987K3327m6211K1527
8674D10297o1570m6979L6923K2614L016R0083l9706L7265N5309k6075J3214J7011
8662E11402j10998O9477P8720n5041n7362Q493m701m268r7822M9129J06750L5040
8650E28819l1618O6311O6805R4291J0840N5202r8384j40205N1132K4241l6158
8639E91276n112Q2122L7039n8898j1726J8793J4875J04961J05316m0438q8688
8628G49520L1850M1307J7916m2931k2011J9023n1851J70613Q5255J5179r087k3766
$$ y = [387877, 431743, 414335, 264694, 188289, 241469, 264819, 318555, 420855, 529217, 471228, 312242, 307144, 185341, 211465, 321271, 392280, 452403, 380494, 295122, 279019, 372613, 451727, 379320, 348398, 345535, 346336, 375490, 404576, 431315, 357667, 411654, 434981, 388770, 410297, 348727, 301748, 338671, 361285, 364301, 454384, 414678, 451943, 507252, 481177, 494391, 511402, 400404, 469881, 548601, 493560, 436198, 444691, 439990, 435722, 337900, 387029, 493779, 528819, 497201, 563512, 630317, 724608, 735448, 790650, 692266, 552061, 603193, 627434, 591276, 586164, 668286, 705325, 646427, 634701, 653494, 668369, 773330, 878646, 838208, 749520, 781370, 822677, 840593, 797662, 775651, 794674, 742823, 913436, 998691, 1013870, 1004783, 981017]
8616I81017O1003O2716m8407Q8807R284Q9076J02475L1476M4376J40447Q2580
8605A644850q047M4311K9968O3170J0791O3848j0545K6774L3915J20681J606q6203
8593A935119J4159P0793j48440q3562K0642o5740r6686j38396r9897p3357o4081
8582A270554q9828l6559L4091j01454j01243L3761O1407L7027Q4144j35447j04774
8571I51679j1400N5347J0431O6079P652n7299j13728p9557p3263K1301j838j8707
8559G56697M9409L1912K1050m5018k0272r8042Q7735Q2137j2828L5575o2751L5981
8547H61585J6777j12525j06060K9216J5763L5807J14158J092q8236r7991J708
8536F71294N5699m6118q4573N703P1826Q205M7210l4090j28814j5927J3981o98
$$ y = [981017, 1042020, 1104736, 1056329, 1145136, 1154420, 1243496, 1345971, 1377447, 1421823, 1562270, 1644850, 1636803, 1681114, 1711082, 1774252, 1785043, 1848891, 1838346, 1865120, 1899035, 2019716, 2021322, 1935119, 1949278, 2020071, 1871631, 1788069, 1808711, 1742971, 1646285, 1507889, 1407992, 1334635, 1270554, 1180726, 1144167, 1178258, 1076804, 975561, 1009322, 1070729, 1107756, 1191900, 1056453, 951679, 940279, 995626, 1006057, 1072136, 1079788, 1022489, 908761, 829204, 755941, 777242, 775404, 756697, 806106, 838018, 859068, 814050, 793778, 695736, 783471, 865608, 852780, 888355, 825604, 861585, 878362, 765837, 659777, 688993, 704756, 740563, 854721, 855813, 767577, 669586, 671294, 726993, 680875, 596302, 602005, 673831, 682036, 729246, 695156, 566342, 550415, 564396, 563698]
8524E63698n9049L3498l9518J6518K3912M043m3387K7925p8649l3631L2212K7185
8512D74757n1698K3544P6217R7696r6376o0080P362k5355K3293j8975r1593O1399
8500D20191K1527l7774P2672M0130Q3935J2499j0529N1074J1466N2815j06815
8489F11191r6737j62483k2203k9240O733R134J9053O8992J89539p124r7076j9217
8477D70562p8425R3070J30109l5122J1775J25278n2331j35075o6955j8723K3293
8466D67456l8929k6996M8979J67J0891J1607m4601L1174O7079m250j07806r846
8454D04925J7848p6334Q7728K5264N2150L6391q5191q6618M9490k8114P556r059
8442C96036j43731K4685J72978k8788o9783L7502o566k8045N4315J08248o9345
$$ y = [563698, 504649, 538147, 498629, 515147, 539059, 543102, 499715, 527640, 448991, 415360, 447572, 474757, 423059, 446603, 522820, 620516, 524140, 464060, 471422, 446067, 469360, 450385, 358792, 420191, 441718, 403944, 476616, 516746, 600681, 613180, 602651, 653725, 665191, 718006, 611191, 514454, 351971, 329768, 300528, 307261, 316395, 335448, 404440, 593979, 586855, 489779, 470562, 392137, 485207, 615316, 580194, 591969, 717247, 664916, 529841, 462886, 444163, 467456, 428527, 401531, 450510, 450677, 461568, 473175, 428574, 459748, 526827, 522577, 414771, 404925, 422773, 346439, 434167, 459431, 511581, 547972, 462781, 376163, 425653, 397539, 405095, 396036, 252305, 276990, 449968, 421180, 351397, 388899, 382333, 354288, 408603, 516851, 447506]
8431D47506n2360J6004l9568m1220j3198N2164J0647o1197l2190q081m8560K2385
8419B52332L6413p336j04973J8257L4119Q8488M5050r6360q8133K898L8263j3374
8407B05644p712J61468L7551j7729p0266l9636q2860m0260Q6648K6682j7304k6982
8395B15244J5100M006N50l8073o8192J9460K8556m2532R1159J17237n6760N8829
8383C44584M0528j9449m9064o9497r7077j2862m7246N9353J11812L3552Q49o015
8371B89468k0040Q0296P4692q6513n4587l9808o8552r9799q694M4758O9237K7839
8359B08297J8434N7134l014q6912M2494J17815m1010q5622M2262L2292J291m2434
8347B61027q8904j0484L086L2981N2994Q5089P9783n9325j55624J6521j23574
$$ y = [447506, 395146, 411150, 371582, 330362, 317164, 369328, 379975, 318778, 286588, 278507, 229947, 252332, 288745, 281409, 176436, 194693, 228812, 317300, 362350, 265990, 177857, 180755, 219018, 205644, 197932, 359400, 396951, 379222, 308956, 269320, 186460, 146200, 232848, 259530, 242226, 215244, 230344, 234350, 234900, 196827, 128635, 148095, 176651, 134119, 225278, 342515, 285755, 344584, 385112, 365663, 316599, 247102, 150025, 137163, 89917, 149270, 261082, 294634, 295483, 289468, 269428, 349724, 424416, 337903, 283316, 243508, 174956, 75157, 66463, 111221, 180458, 208297, 226731, 283865, 280851, 193939, 236433, 354248, 313238, 227616, 269878, 302170, 303461, 261027, 172123, 161639, 164725, 197706, 250700, 335789, 415572, 356247, 200623, 217144, 93570]
8336I3570n951J4428K8320N546k7826r80K3494J58196M8943p2784o4103j4985
8324A85868l7694p9136K8882j3577N9583Q2648J02402p9609j12045o2937j02916
8313b8531K6203J11787L5531l4659l5357n930j0481Q7254L741N0938J8251j40738
8301G8009m3153R823L8354K953n2163n3020q943L9246j4836j1376M8878J28551
8289A62323J1642Q933k0502M5881j7873r4925p3934J14792J07139p5299q7502
8278H0675m5711r5069L8248K0833N038O5459L7587J21286K264K6255q1136j15633
8266F0096N4285J59306l9148l9420K1912m9474j9741O7583J45172N8132j14669
8255C04034m5257j7035K0890l7166o6761n5084k7221p321j2063n1469j22142j9380
$$ y = [93570, 87619, 102047, 130367, 135913, 108087, 107107, 130601, 288797, 337740, 264956, 200853, 185868, 148174, 69038, 97920, 84343, 143926, 226574, 328976, 249367, 137322, 74385, -28531, -2328, 109459, 144990, 110331, 74974, 69044, 58563, 145817, 149558, 200496, 218747, 78009, 34856, 44679, 83033, 85986, 33823, -19197, -28140, 11106, -3730, -15106, 33772, 162323, 173965, 182898, 162396, 208277, 190404, 95479, 21545, 136337, 243476, 168177, 80675, 34964, -60105, -21857, -1024, 4014, 69473, 107060, 228346, 230610, 256865, 175729, 60096, 114381, 273687, 234539, 195119, 217031, 167557, 147816, 215399, 360571, 418703, 304034, 258777, 241742, 262632, 225466, 158705, 103621, 76400, 69079, 57016, 5547, -116595, -135975]
8243a35975k5322J30768P7744J5454Q9490J23549L3072m6504K6824j3155L4432
8232C10377J2062O3483j4927n4502q2482r5733l4068N994m0768n8869j1913k926
8220d272O7707k8732q8241n9116Q9635J03322j7432n053m5894O5584m0000j3660
8208B3848P8835J34243l4532j53199l0453J05163P0232N252l9657m6765N7906
8197A70873M2713L0923k2568o2282n1450L3720O2274n4141N2912M2764P673J4512
8185B67923o7777N402Q729M4088q6251n0026k8784m1449L9570j9800M4632J3392
8173A29649k7886k0860N3185L5698N9626M7422J6000l4695K9503K4940p682L1922
8161C36822M0742j04366r7058o837J9606M2542J1192l9312l5257o3197j6900O1340
$$ y = [-135975, -161297, -30529, 47215, 62669, 152159, 275708, 308780, 262276, 289100, 275945, 310377, 322439, 385922, 370995, 316493, 234011, 138278, 104210, 110204, 69436, 10567, -1346, -4272, 63435, 34703, -53538, -112654, -23019, 80303, 62871, 57818, 11924, 77508, 37508, 23848, 102683, 236926, 202394, 49195, 18742, 123905, 194137, 199389, 159732, 112967, 170873, 213586, 244509, 221941, 159659, 108209, 141929, 204203, 150062, 202974, 245738, 253411, 267923, 200146, 205548, 214277, 258365, 172114, 122088, 93304, 51855, 91425, 71625, 116257, 129649, 101763, 80903, 134088, 169786, 229412, 276834, 292834, 258139, 287642, 312582, 304900, 336822, 377564, 273198, 176140, 169303, 188909, 231451, 242643, 203331, 168074, 104877, 87977, 149317]
8149A49317L0842k2590j9217m1190j5945k1708M6566Q5035n2196K4247N4251M181
8137B21593k0224l6876k3182l0427o4717K3040M6201J07369k2277j07043Q842
8126A02299N4703J37740R3331K5281m846j20731q0166O397N6031n8854M6790J06196
8114C64171J86j06629m3466q3227n0562l7864j4865K1968J9799O1370M3778m8731
8102A25928J6825n3134M9613P7741P9348j8428o0593j33319j5768J8572L9792
8091A26577J1086O2134J09273L2034r787j07651p9603M7171J06589O1936l2189
8080C27570l8621L140r0520k4928j4939O3909J04812o628q5950j5699l3443k4484
8068A64219O2042Q406M8359n2691r5384J39191P2683J3139O4095J874k8307j01623
$$ y = [149317, 180159, 157569, 138352, 97162, 81217, 59509, 106075, 191110, 138914, 163161, 217412, 221593, 201369, 164493, 141311, 110884, 46167, 69207, 115408, 222777, 200500, 93457, 102299, 157002, 294742, 388073, 413354, 408508, 287777, 207611, 214008, 270039, 211185, 257975, 364171, 364357, 257728, 214262, 131035, 80473, 42609, 27744, 49712, 69511, 130881, 174659, 125928, 142753, 89619, 139232, 216973, 296321, 277893, 217300, 83981, 68213, 86785, 126577, 137663, 199797, 309070, 341104, 331317, 223666, 144063, 191234, 297823, 359759, 327570, 288949, 292089, 201569, 176641, 161702, 225611, 330423, 323795, 237845, 222146, 188703, 164219, 226261, 234667, 283026, 230335, 134951, 274142, 346825, 359964, 424059, 425933, 397626, 296003]
8056B96003o7535j389P5207J1468J25633q4891O3300L5093o6708p004J0706J9878
8044D09761J9189J0931j0236l3082q1670q1833L5487K10653Q3595k2030l5084
8033E05681M2079r1295l6607R8172m5525j24298J3347M7516Q2644R2174l2408
8022E51480j04562n3000K5278R0490Q0707K4807l3510j18754Q1243K2783O666
8011E73628M0980k2880p0909K1477J39199m2805q0416J09195j0337M6361P9874
8000G83367m4371j18216J6266j766L5285L9348l2152m2640L4641K5812q0747r8412
7988E16415k4718m9280O0374K3499j4009l1089J7267m1934P5117M4602R0150K4962
7976F91356M4673k2491j0764o8820P4617N8784j3962R1689k2760l6033n4860l5397
$$ y = [296003, 228468, 227079, 302286, 313754, 439387, 354496, 417796, 452889, 386181, 379177, 389883, 409761, 428950, 439881, 429645, 396563, 314893, 233060, 268547, 479200, 562795, 540765, 505681, 547760, 456465, 419858, 518030, 472505, 348207, 361554, 409070, 491714, 583888, 551480, 446918, 393918, 419196, 509686, 590393, 615200, 581690, 462936, 544179, 566962, 573628, 614608, 591728, 520819, 542296, 681495, 638690, 558274, 667469, 657132, 703493, 783367, 738996, 620780, 637046, 635280, 670565, 709913, 677761, 635121, 669762, 695574, 614827, 516415, 491697, 442417, 502791, 526290, 512281, 481192, 498459, 456525, 531642, 576244, 666394, 691356, 736029, 713538, 702774, 633954, 708571, 767355, 753393, 845082, 822322, 786289, 731429, 696032]
7964F96032Q3607J18827Q0716l6765p9134j3329p1536K9658J2862M841j942J5223
7952H39060j15904q3319K741P4641P5582L8129l6960o0218j882O0461n1807J974
7940G42498J6889Q752L755j00041j5696Q6169M5110r4091j40431k1206M617m042
7928E32283M5433J68173J25985O2838P5671j07813r3588r7300j9147P4406o5716
7917G01225n7022L2285l921j4402r838K6313O2962k3224p0762l2236q2170k8535
7905E00675J02691O8920M4516l3023k5322o6168m5082L2571O163j3065l1553Q1057
7893F22380J5205o4957j7327Q906M17n8094P2374K345o3086j80875O5881k5763
7881C77406L0583R5123K566r1615j0658Q4813l088j18549K9812R6462L692R2554
$$ y = [696032, 779639, 898466, 979182, 942417, 863283, 849954, 778418, 808076, 820938, 825779, 823837, 839060, 723156, 639837, 642578, 717219, 792801, 830930, 793970, 733752, 731870, 792331, 740524, 742498, 759387, 768139, 771894, 671853, 656157, 742326, 787436, 693345, 552914, 531708, 536325, 532283, 577716, 745889, 871874, 934712, 1010383, 902570, 808982, 711682, 692535, 766941, 701225, 644203, 676488, 672567, 658165, 648327, 674640, 737602, 714378, 643616, 611380, 529210, 500675, 603366, 672286, 716802, 683779, 658457, 592289, 547207, 579778, 585941, 572876, 541323, 622380, 637585, 572628, 555301, 564207, 564624, 506530, 578904, 581249, 518163, 337288, 403169, 377406, 407989, 503112, 505678, 414063, 403405, 488218, 485130, 366581, 396393, 492855, 496547, 589101]
7869E89101l3138m9026p6138Q694L6872j01536k1874Q987K6766q2445p9126O6529
7857B93666Q1534P5948K9128q9946K0052M889o1391m5458k734n750J72563N7647
7845E30148q2437o0385j9307k6940n7616p8206N0189J35073M2941j1892k2738
7834C98830L5339N3875K1807Q1j3812j22372j08226K1189r6613j7027J09988j10156
7822A72903o6432Q747J146L0559J03354q831q7423k6634k1961L5775M6160L3578
7810B20941m0303m9676n7255M3922L5614J0306Q1926P2983n952l273R813q8052
7798B30994M6106K5463n76K5649R370n4673K9944N2854j5594p8786m3942K831
7786B29640k2760R881J9381r1877o2015l9516L0160Q0176O5489L5742n0596q1774
$$ y = [589101, 555963, 506937, 430799, 439493, 476365, 374829, 352955, 361942, 388708, 306263, 227137, 293666, 375200, 451148, 480276, 390330, 410382, 415271, 353880, 308422, 305688, 299938, 472501, 530148, 447711, 387326, 368019, 341079, 283463, 205257, 255446, 390519, 433460, 421568, 398830, 434169, 488044, 509851, 509932, 496120, 373748, 265522, 286711, 190098, 173071, 283059, 172903, 106471, 115218, 116364, 146923, 250277, 241446, 154023, 127389, 105428, 141203, 187363, 220941, 180638, 130962, 73707, 117629, 153243, 163549, 245475, 318458, 312506, 309233, 319046, 230994, 277100, 302563, 301987, 327636, 337006, 282333, 312277, 365131, 349537, 270751, 226809, 229640, 206880, 216761, 236142, 144265, 82250, 42734, 72894, 153070, 218559, 254301, 203705, 121931]
7774A21931l4514L954Q3106R2766J02547Q158k21703r6747J27077L5414n1072
7763A70917j8167m5984L780N3619J0829r4902O0455L9069k3600L79j1993J8177
7751A62579R1043M5408r4022j01841l2054J4578M1316p373m6678J7534j2448J6431
7739I4473K6363L2642Q657L7200r991k7946p6269J5685M3011j00835n494l5697
7727A799q6730K8087L928O1203j762M2882Q2864P029N1046K3320n7321N783m4383
7714A17745p9012K9771m6238m6392L9594M2028p8574R2709O2185j59281M1534
7703A6069l6530m316L5904j1138J3462j13371j7799k8468k0672r8947L5268N4070
7691a76468N5034J29989N0262J6792j992J20735O861o5586q6875j37498J2656
$$ y = [121931, 87417, 91371, 174477, 267243, 369790, 377948, 156245, 59498, 186575, 221989, 170917, 152750, 106766, 110546, 164165, 174994, 80092, 140547, 179616, 156016, 156395, 144402, 162579, 253622, 299030, 205008, 103167, 71113, 85691, 127007, 119634, 72956, 90490, 78042, 94473, 120836, 153478, 162135, 199335, 189344, 161398, 85129, 100814, 143825, 42990, 37496, 1799, -84931, -56844, -52916, 8287, 6525, 49407, 132271, 139300, 190346, 213666, 156345, 162128, 117745, 38733, 68504, 22266, -24126, 15468, 57496, -21078, 71631, 133816, -25465, 16069, -20461, -24777, 11127, -11, 13451, -99920, -117719, -146187, -166859, -265806, -230538, -176468, -121434, 8555, 58817, 75609, 73617, 194352, 201213, 135627, 48752, -88746, -76090]
7680g6090N6206L0839N6184q3312J7648K4446M9858P0576m322q1725j56407K4842
7668g1257P3488o6148j4058J892J08604P9731Q941J6505m8473j47676J1937N3418
7656F904K7447K4242j960r7352k375M9401O3405k0934N968P996N7292Q6235J1648
7643B17917j53625p2417n7224l5215M8041p1009k1976L1354m2797o8917O2152
7632a63716J40133P0887k9618r4067P7679L4077r5540n6020J23413K7467K0292
7621E4987J1090m0910q4936Q3787P22o6045j13195r022K4847L9206K7681P5477
7609C689j304p4672o5436k4016K8445J46102J00443o3084k3130K1479J10606j02755
7597E6367K1715K2139l6583o9996k7627J8543k9185j2942N3390j7946r655r03
$$ y = [-76090, -19884, 10955, 67139, -16173, 1475, 25921, 75779, 146355, 142033, 60308, -96099, -71257, 2231, -63917, -77975, -76083, 32521, 112252, 121193, 137698, 89225, -58451, -46514, 6904, 34351, 58593, 56633, -40719, -43094, 6307, 69712, 48778, 54746, 62742, 120034, 206269, 217917, 64292, -8125, -65349, -100564, -52523, -123532, -145508, -114154, -156951, -225868, -163716, -23583, 47304, 17686, -76381, 1298, 35375, -60165, -116185, 7228, 34695, 54987, 66077, 25167, -59769, 24018, 24740, -41305, -154500, -163522, -138675, -99469, -71788, 3689, 2385, -72287, -137723, -161739, -133294, 12808, 113251, 50167, 27037, 48516, 159122, 56367, 78082, 100221, 63638, -6358, -33985, -15442, -44627, -57569, -4179, -22125, -31780, -32683]
7585c2683N8254O7794J6263j10543p6625k228j7608M0274J32145M8394J7991j00348
7573D1080m2180L9584J7219L0752n7703L0387J2301p3836M6822J9780l8690k6539
7561a023K2491N3228j03372o967N2837M3889R337M9680j1171K8689M5326n9572
7549A23372r2378n7858K8570r9019K419K6028Q005O678N7402k701m731L5336K0832
7536E1955M9438q117n0997J6476O318K5848P2245n6637k1878J2512l0961o9774
$$ y = [-32683, 25571, 93365, 109628, -915, -77540, -79768, -97376, -57102, 75043, 123437, 141428, 41080, -1100, 38484, 55703, 86455, 28752, 59139, 71440, -2396, 44426, 64206, 25516, -1023, 21468, 74696, -28676, -35643, 17194, 61083, 70420, 120100, 108929, 137618, 182944, 123372, 30994, -26864, 1706, -97313, -94894, -68866, -60861, -54183, 3219, 518, -4213, 31123, 51955, 101393, 93276, 42279, 58755, 65073, 90921, 163166, 106529, 84651, 97163, 66202, -3572]
$$ [...]
##END NTUPLES=NMR SPECTRUM
##END=
