##TITLE=Analysis number 320863
Compound Code cc 47213
Book Reference 437/78/6
Project Code adrs
Chemist Name wendyb
##JCAMPDX= 6.0         $$ Bruker NMR JCAMP-DX V2.0
##DATA TYPE= NMR SPECTRUM
##DATA CLASS= NTUPLES
##ORIGIN= Bruker BioSpin GmbH
##OWNER= nmr
$$ XWIN-NMR		Version 3.5
$$ Fri Jul 14 09:19:46 2006 GMT Daylight Time (UT+1h)  MAYBRIDGE\nmr@NMR_250MHZ
##.OBSERVE FREQUENCY= 250.131544655141
##.OBSERVE NUCLEUS= ^1H
##.ACQUISITION MODE= SIMULTANEOUS (DQD)
##.ACQUISITION SCHEME= undefined
##.AVERAGES= 16
##.DIGITISER RES= 18
##SPECTROMETER/DATA SYSTEM= dpx250
##.PULSE SEQUENCE= zg30
##.SOLVENT NAME= CDCl3
##.SHIFT REFERENCE= (INTERNAL, CDCl3, 0, 16.522)
##AUDIT TRAIL= $$ (NUMBER, WHEN, WHO, WHERE, WHAT)
$$ ##TITLE= Audit trail, XWIN-NMR		Version 3.5
$$ ##JCAMPDX= 5.01
$$ ##ORIGIN= Bruker BioSpin GmbH
$$ ##OWNER= nmr
$$ C:\u/data/dgb/nmr/ADRS/2720/pdata/1/auditp.txt
$$ ##AUDIT TRAIL=  $$ (NUMBER, WHEN, WHO, WHERE, WHAT)
(   1,<2006-07-14 09:19:24.92 +100>,<MAYBRIDGE\nmr>,<NMR_250MHZ>,
      <created by zg, POWCHK disabled, PULCHK disabled
       configuration hash MD5:
       E2 DF 36 D8 04 B2 41 60 5A D7 A3 38 5A 4B D0 FE
       data hash MD5: 64K
       36 A1 45 97 C8 52 42 5B EF 31 92 CD 8D 7E EB 2A>)
(   2,<2006-07-14 09:19:37.78 +100>,<MAYBRIDGE\nmr>,<NMR_250MHZ>,
      <Start of raw data processing
       ef LB = 0.3 FT_mod = 6 PKNL = 1 SI = 32K 
       data hash MD5: 32K
       E0 46 A8 B1 A8 86 18 7A 23 C1 01 73 EE 30 E2 9E>)
(   3,<2006-07-14 09:19:39.33 +100>,<MAYBRIDGE\nmr>,<NMR_250MHZ>,
      <apk 
       data hash MD5: 32K
       DF 93 75 3D 1D A6 4F CA CB 15 62 3A 4C 23 A2 4B>)
(   4,<2006-07-14 09:19:40.05 +100>,<MAYBRIDGE\nmr>,<NMR_250MHZ>,
      <abs ABSG = 5 
       data hash MD5: 32K
       B8 FE AA BF 8C 1F F0 86 22 27 6A 54 50 EC 5B 97>)
$$ ##END=
$$ 
$$ hash MD5
$$ 76 55 23 2A 04 11 D4 B5 08 9A 2E 81 02 9C 51 81
##$RELAX= 
##$RELAX= 
##$RELAX= 
##$RELAX= 
##$RELAX= 
##$RELAX= 
##$RELAX= 
$$ Bruker specific parameters
$$ --------------------------
##$DU= <C:\u>
##$EXPNO= 2720
##$NAME= <ADRS>
##$PROCNO= 1
##$TYPE= <nmr>
##$USER= <dgb>
##$AMP= (0..31)
100 100 100 100 100 100 100 100 100 100 100 100 100 100 100 100 100 100 
100 100 100 100 100 100 100 100 100 100 100 100 100 100 
##$AQSEQ= 0
##$AQ_mod= 3
##$AUNM= <au_zg>
##$AUTOPOS= <49 >
##$BF1= 250.13
##$BF2= 250.13
##$BF3= 250.13
##$BF4= 250.13
##$BF5= 500.13
##$BF6= 500.13
##$BF7= 500.13
##$BF8= 500.13
##$BYTORDA= 1
##$CFDGTYP= 0
##$CFRGTYP= 5
##$CHEMSTR= <none>
##$CNST= (0..31)
1 1 145 1 1 1 1 1 1 1 1 1 1 1 1 1 1 1 1 1 1 1 1 1 1 1 1 1 1 1 1 1 
##$CPDPRG= <>
##$CPDPRG1= <>
##$CPDPRG2= <>
##$CPDPRG3= <>
##$CPDPRG4= <mlev>
##$CPDPRG5= <mlev>
##$CPDPRG6= <mlev>
##$CPDPRG7= <mlev>
##$CPDPRG8= <mlev>
##$CPDPRGB= <>
##$CPDPRGT= <>
##$D= (0..31)
0 1 0 0 0 0 0 0 0 0.06 0 0 0 0 0 0 0.0002 0 0 0 0 0 0 0 0 0 0 0 0 0 0 
0 
##$DATE= 1152865163
##$DBL= (0..7)
120 120 120 120 120 120 120 120 
##$DBP= (0..7)
150 150 150 150 150 150 150 150 
##$DBP07= 0
##$DBPNAM0= <>
##$DBPNAM1= <>
$$ [...]
##$SUBNAM7= <"">
##$SUBNAM8= <"">
##$SUBNAM9= <"">
##$SW= 20.6930455092707
##$SWIBOX= (0..15)
0 0 3 0 0 0 0 0 0 0 0 0 0 0 0 0 
##$SW_h= 5175.983436853
##$TD= 65536
##$TD0= 1
##$TE= 296.16
##$TE2= 300
##$TE3= 300
##$TEG= 300
##$TL= (0..7)
0 120 120 120 120 120 120 120 
##$TP= (0..7)
150 150 150 150 150 150 150 150 
##$TP07= 0
##$TPNAME0= <>
##$TPNAME1= <>
##$TPNAME2= <>
##$TPNAME3= <>
##$TPNAME4= <>
##$TPNAME5= <>
##$TPNAME6= <>
##$TPNAME7= <>
##$TPOAL= (0..7)
0.5 0.5 0.5 0.5 0.5 0.5 0.5 0.5 
##$TPOFFS= (0..7)
0 0 0 0 0 0 0 0 
##$TUNHIN= 0
##$TUNHOUT= 0
##$TUNXOUT= 0
##$USERA1= <user>
##$USERA2= <user>
##$USERA3= <user>
##$USERA4= <user>
##$USERA5= <user>
##$V9= 5
##$VALIST= <valist>
##$VCLIST= <CCCCCCCCCCCCCCC>
##$VD= 0
##$VDLIST= <DDDDDDDDDDDDDDD>
##$VPLIST= <PPPPPPPPPPPPPPP>
##$VTLIST= <TTTTTTTTTTTTTTT>
##$WBST= 1024
##$WBSW= 4
##$XGAIN= (0..3)
0 0 0 0 
##$XL= 0
##$YL= 0
##$YMAX_a= 297005
##$YMIN_a= -540876
##$ZGOPTNS= <>
##$ZL1= 120
##$ZL2= 120
##$ZL3= 120
##$ZL4= 120
##$ABSF1= 16.522
##$ABSF2= -4.171173
##$ABSG= 5
##$ABSL= 3
##$ALPHA= 0
##$AQORDER= 0
##$ASSFAC= 0
##$ASSFACI= 0
##$ASSFACX= 0
##$ASSWID= 0
##$AUNMP= <proc_1d>
##$AZFE= 0.1
##$AZFW= 0.1
##$BCFW= 0
##$BC_mod= 0
##$BYTORDP= 0
##$COROFFS= 0
##$CY= 12.5
##$DATMOD= 1
##$DC= 0
##$DFILT= <>
##$DTYPP= 0
##$F1P= 14.0000005364418
##$F2P= -0.99999901652339
##$FCOR= 0.5
##$FTSIZE= 32768
##$FT_mod= 6
##$GAMMA= 0
##$GB= 0
##$INTBC= 1
##$INTSCL= 1
##$ISEN= 128
##$LB= 0.3
##$LEV0= 0
##$LPBIN= 0
##$MAXI= 10000
##$MC2= 0
##$MEAN= 0
##$ME_mod= 0
##$MI= 0
##$NCOEF= 0
##$NC_proc= -3
##$NLEV= 6
##$NOISF1= 0
##$NOISF2= 0
##$NSP= 0
##$NTH_PI= 0
##$NZP= 0
##$OFFSET= 16.522
##$PC= 1
##$PHC0= 166.2711
##$PHC1= 13.00017
##$PH_mod= 1
##$PKNL= yes
##$PPARMOD= 0
##$PSCAL= 4
##$PSIGN= 0
##$REVERSE= no
##$SF= 250.13
##$SI= 32768
##$SIGF1= 0
##$SIGF2= 0
##$SINO= 400
##$SIOLD= 32768
##$SREGLST= <1H.CDCl3>
##$SSB= 0
##$STSI= 32768
##$STSR= 0
##$SW_p= 5175.98343685301
##$SYMM= 0
##$S_DEV= 0
##$TDeff= 65536
##$TDoff= 0
##$TI= <Analysis number 999999
Compound Code 99
Book Reference 9
Project Code 9>
##$TILT= no
##$TM1= 0
##$TM2= 0
##$TOPLEV= 0
##$USERP1= <user>
##$USERP2= <user>
##$USERP3= <user>
##$USERP4= <user>
##$USERP5= <user>
##$WDW= 1
##$XDIM= 32768
##$YMAX_p= 364184652
##$YMIN_p= -169314
$$ End of Bruker specific parameters
$$ ---------------------------------
##NTUPLES= NMR SPECTRUM
##VAR_NAME=  FREQUENCY,     SPECTRUM/REAL,   SPECTRUM/IMAG
##SYMBOL=    X,             R,               I
##VAR_TYPE=  INDEPENDENT,   DEPENDENT,       DEPENDENT
##VAR_FORM=  AFFN,          ASDF,            ASDF
##VAR_DIM=   32768,         32768,           32768
##UNITS=     HZ,            ARBITRARY UNITS, ARBITRARY UNITS
##FACTOR=    0.157963299565203, 1,           1
##FIRST=     4132.6476996994, 0,             0
##LAST=      -1043.33573715361, 0,           0
##MIN=       -1043.33573715361, -169314,     0
##MAX=       4132.6476996994, 364184652,     0
$$ Real data points
##PAGE= N=1
##DATA TABLE= (X++(R..R)), XYDATA
$$ [...]
18326A52504p093j3706M4015J1261q933j8941J989N4122N7L32k0533k3419l2069
18313A39586l4795J5334r975o540k5170J5860K2498K9596N6950O1266L6544N1979
18301C53133L9187k5922m5736k1363j2310m4348q208K5629k9370k5690l195M0171
18289B41978J6233k6335j0499j8834l4285P238K0247M8134M5391O6410K7580J9031
18277D02289J9831k9533p7560n4081L1651K8162L6065K3114J9603J3613J9033
18266D32187q2764o8770j9494j337j1471j1265R073K9535j17k3317J7261k7101
18254B42420k7840J4345N9728R1538M4596K4171N0215k183J6213m8021n3480l6658
18242C75044l2971m2573l3892Q539j1526L428N5589K2063K0827m1394j742k6119
$$ plain form
18326 152504 145411 131705 175720 186981 178048 159107 161096 215218 215275 215607 195074 171655 139586
18313 139586 104791 120125 110150 103610 78440 94300 116798 146394 203344 264610 301154 353133
18301 353133 392320 366398 320662 299299 286989 242641 234433 260062 230692 205002 201807 241978
18289 241978 258211 231876 221377 202543 168258 175496 195743 243877 289268 355678 383258 402289
18277 402289 422120 392587 315027 260946 292597 320759 356824 379938 399541 413154 432187
18266 432187 349423 280653 261159 259822 248351 237086 246159 275694 275577 252260 269521 242420
18254 242420 214580 228925 288653 380191 424787 448958 499173 496990 513203 465182 411702 375044
18242 375044 342073 299500 265608 274147 262621 266049 321638 343701 364528 323134 321392 295273
18230B95273J5506j3493j8341L1517K1516j0440J6469M5994L7969J4470k0146
18219D16294J9272M1950K0662n5517j6837R093j1429J8853K8745j2903P546M0777
18207E06506J8265l9723j6108M506J5455K1639J9864J1711J5713j2049j2113L309
18195E36975O265l864j9787J0393M1626K3990L4734K853J3176m613O025K7664
18183F75437l6638o5157j0053j9571K023L2050K0290P1536L5838K7467J7869M099
18171G55190J3757M3359N1128N9283N3181N1033K5458K4314L8092N1113J0383
18160A176291j45L6647N7371L9347O9741M5002L9953M2986R0745Q8751J14619
18149A801308R2611Q1283J45174K30064K30332K94701L50907M06751M85105N33107
$$ plain form
18230 295273 310779 297286 278945 310462 331978 321538 338007 384001 421970 436440 416294
18219 416294 435566 477516 498178 442661 425824 434917 423488 442341 471086 458183 465729 506506
18207 506506 524771 485048 468940 473446 488901 510540 530404 542115 557828 545779 533666 536975
18195 536975 543240 539376 519589 529982 571608 595598 630332 633185 646361 641748 647773 675437
18183 675437 638799 573642 563589 544018 546041 578091 598381 669917 705755 733222 751091 755190
18171 755190 768947 812306 863434 922717 975898 1026931 1052389 1076703 1114795 1165908 1176291
18160 1176291 1176146 1212793 1270164 1309511 1379252 1424254 1464207 1507193 1597938 1686689 1801308
18149 1801308 1893919 1975202 2120376 2350440 2580772 2875473 3226380 3633131 4118236 4651343
18139D651343O16856R55945J572405K642867M202514N549488N505812M077640
18131B9774870J542122k646666m305597j053631K741001M688574M226863K190802
18123C7158338j978292p023333o733181l503975j251856m594Q22027J530818K602197
18114B1618149N060767R400502J4724517J6892865J3348460P345736n096559k1026648
18106F2267789j5635416n013453J091061L095047K210835p95255o636967r662597
18098C0921044o931631l764349j977226j177269q46612q89219j015312o93902
18090A3625524k78738q1761K401n6798m20298j012663j022611o91563n35621m13346
18080I114526l01279k97913l13164k64184k44120j94706j77378j85999j68405
$$ plain form
18139 4651343 5268199 6224144 7796549 10439416 14641930 20191418 25697230 29774870
18131 29774870 31316992 28670326 24364729 23311098 26052099 30740673 34967536 37158338
18123 37158338 35180046 28156713 21423532 17919557 16667701 16663107 17485134 19015952 21618149
18114 21618149 26678916 36079418 50803935 67696800 81045260 88390996 83294437 62267789
18106 62267789 46632373 41618920 42709981 45805028 48015863 47220608 40583641 30921044
18098 30921044 23989413 20225064 18247838 17070569 16223957 15334738 14319426 13625524
18090 13625524 13346786 13265025 13267426 13210628 12790330 11777667 10755056 10063493 9527872 9114526
18080 9114526 8813247 8515334 8202170 7937986 7693866 7499160 7321782 7135783 6967378
18071F967378r4755m8677j1775l1222j8476m493k3765R1428K91124N33344P18375
18060H368486P86446P11560N29249m105R1440Q44900J907965L321837M991630
18051B1549408O054283N199085L004690r0809n213429n491038j370617K144106
18043B5785679L409031K653675P61330l472874p270483n527400k994418j623122
18035A1721418r03027n00022k27485k33282K7064L37729O02803Q52134P68480
18026A2445812O26192J87011k4692P99918K014832L687166N880858P578395P000616
18017D0196108M377833R23768n490731p914207l185698J571936L731105L177551
18009C7387665J240718k993336q370858p512538m316989k401322j539069j044787
$$ plain form
18071 6967378 6872623 6823946 6812171 6780949 6762473 6757980 6734215 6825643 7116767 7650111 8368486
18060 8368486 9154932 9866492 10395741 10391636 10483076 11327976 13235941 16557778 21549408
18051 21549408 27603691 32802776 35807466 35716657 30503228 25012190 23641573 25785679
18043 25785679 29194710 31848385 32609715 29136841 21866358 16338958 13344540 11721418
18035 11721418 10818391 10318369 10090884 9857602 9884666 10222395 10825198 11677332 12445812
18026 12445812 13072004 13259015 13234323 14034241 16049073 19736239 25617097 33195492 40196108
18017 40196108 44573941 45497709 40006978 32092771 28907073 30479009 34210114 37387665
18009 37387665 38628383 35635047 27264189 19751651 15434662 13033340 11494271 10449484
18001A0449484p15779n89413m65868l97250l87549l29150k32864k18597j98803
17992F914211j62511j41598r7861j04195j86271j71671k56805k43345j01267q2577
17982E366110j29422k09410k19534j62704j27537j35547r3374k5245k6437j21538
17972D115362k04729j99725j73554p1381o0767n0263m8893j13678j14092r1242
17962B987038p3898l2088P954L9738Q0725o510o5735q7459q8667o6925J9670J7791
17950B731634p180j05989j67694j45075j03257o8207j9139J4040p1485n6721j2002
17939A988925n7153q6217q4200n4982n0707r4911q7174m9398r4165n1914K4603
17928A302707j001j3197p512o2913o4022l2753k9410m0347k0640o7865k9215K0926
$$ plain form
18001 10449484 9733705 9144292 8678424 8281174 7893625 7564475 7331611 7113014 6914211
17992 6914211 6751700 6610102 6512241 6408046 6221775 6050104 5793299 5549954 5448687 5366110
17982 5366110 5236688 5027278 4807744 4645040 4517503 4381956 4288582 4263337 4236900 4115362
17972 4115362 3910633 3710908 3537354 3465973 3405206 3354943 3306050 3192372 3078280 2987038
17962 2987038 2913140 2881052 2889006 2928744 3009469 3002959 2937224 2849765 2761098 2694173 2713843 2731634
17950 2731634 2724454 2618465 2450771 2305696 2202439 2134232 2115093 2129133 2057648 2000927 1988925
17939 1988925 1931772 1845555 1761355 1706373 1655666 1560755 1473581 1424183 1330018 1278104 1302707
17928 1302707 1301706 1288509 1280997 1218084 1154062 1121309 1091899 1051552 1030912 963047 933832 954758
17916I54758J6842L413n5147J120P232j535N513n3374m3298o1186m3416K6179
17904G57101j5954r286K091m1937p2589k5004J3056J0148M4418J1092J5948j43
17892F88941p597K2123K9218m0313k3064l038J4397l1410n5681o6437m3270J387
17880D85256K2067M679n950p590j5263j0131J3806L0371j8228p059m1815n1346
17868C98797M3206L2578j046o102K204J4071N2258J9491l178k7716j2350k2523
17856D89690m2699K936o3369k7920M7343j4521j1244K7375L3513m526j305J2925
17844D48198q010J241P0927M6107N466l8944m0463J6805n869r486l781k4249L3790
17831D91732J9139j207K8159J7417k6115m4534k4354O3623M5882L8688N4750K9244
$$ plain form
17916 954758 971600 975013 919866 920986 928218 926683 932196 878822 835524 774338 730922 757101
17904 757101 741147 731861 733952 692015 619426 594422 607478 617626 662044 673136 689084 688941
17892 688941 681344 703467 732685 692372 669308 666270 680667 649257 593576 527139 483869 485256
17880 485256 507323 512002 506052 498462 483199 473068 486874 517245 499017 491958 450143 398797
17868 398797 442003 474581 473535 467433 469637 483708 535966 555457 552279 524563 512213 489690
17856 489690 446991 449927 386558 358638 405981 391460 380216 407591 441104 436578 435273 448198
17844 448198 440188 441429 512356 558463 563929 524985 484522 501327 495458 485972 482191 457942 491732
17831 491732 510871 509664 537823 555240 529125 484591 460237 523860 569742 608430 663180 692424
17819F92424l9582m9698k3992L6682O876k1276p751l4361q757K2692J18066P5390
17807G66713K1688N876L2550J5229J03106O3886N9703J0730o5584k9355K4889
17796A009431L2952K0009N8271N0313O7446J15132L7128N1568N0084M2273Q7865
17785A622472J22131J09669J85963K84722L96129N45711O99908Q59617J141067
17776E967389J745260K945011M912011P283267Q191041O359739L180845k822735
17768C7761828j0523560r090480n006699k665061j509288r04747o34861l42059
17760G085073j95536q8781N5940K56367M48240P88571J220721J990298L356687
17751A4917580N430093P105278O683020M403275R85462n988858q844428m908890
$$ plain form
17819 692424 652842 603144 579152 615834 622710 601434 593683 559322 550565 573257 691323 766713
17807 766713 788401 794277 826827 842056 945162 1009048 1068751 1079481 1013897 984542 1009431
17796 1009431 1042383 1062392 1120663 1170976 1238422 1353554 1390682 1442250 1492334 1534607 1622472
17785 1622472 1744603 1854272 2040235 2324957 2721086 3266797 3966705 4826322 5967389
17776 5967389 7712649 10657660 15569671 22852938 31043979 37403718 40584563 37761828
17768 37761828 27238268 18147788 13141089 10476028 8966740 8061993 7427132 7085073
17760 7085073 6889537 6800756 6856696 7113063 7561303 8349874 9570595 11560893 14917580
17751 14917580 20347673 27452951 34135971 38539246 39524708 33535850 24691422 19782532
17743A9782532j264307J623500M263232N722368M820226K526918j391836p818500
17735B8264133q111448m691561k499265j502357j054451p65267m66427k53512
17727H919845j09784l4779m562R5727K92455O19798J170458K221462L736895N354569
17717B2262084N391730L622702J032974m202475q297969n788647l062334j672572
17709I285493j008378o96214n60552m81876m33075l51829l25418k74163j80982
17700D973006j07592r8405o1187n8915j68074k12896j81865j02108r9355r5027
17690C787582j00876m0819m9828j49805j70639j32550j79757j55505j00501r7471
17680B609831q9026m5784o7383q0283q7257m9859m8887m4490r1612q7099n6119
$$ plain form
17743 19782532 18518225 20141725 24404957 30127325 34947551 37474469 36082633 28264133
17735 28264133 20152685 15461124 12961859 11459502 10405051 9639784 9173357 8919845
17727 8919845 8810061 8775282 8770720 8866447 9158902 9778700 10949158 13170620 16907515 22262084
17717 22262084 27653814 31276516 32309490 28107015 19809046 14020399 10958065 9285493
17709 9285493 8277115 7580901 7020349 6538473 6105398 5753569 5428151 5153988 4973006
17700 4973006 4865414 4767009 4705822 4646907 4478833 4265937 4084072 3981964 3882609 3787582
17690 3787582 3686706 3645887 3596059 3446254 3275615 3143065 2963308 2807803 2707302 2609831
17680 2609831 2520805 2475021 2407638 2327355 2240098 2190239 2141352 2096862 2005250 1918151 1862032
17669A862032j2811k1206P416k830P24q0299r8458o9199l1831K6941p040l2750
17657A540689l8548m6432q5078p0455k1641m0880k1424o3940j7960l3369n4712
17646A046250k0238n01M027J5946l7426k5946m142o451O085l3268M1069M2201
17634A027606k8907k5942n7085j27474o3315j8155l2688k0331k825M6756L8165
17623G35805m7270n8029n7159q334l2078m7336L2573L6059k0672m341M507J5392
17611E49117j5679q056l2445j9099K8754K1623n5015k7289M7021O976j9845L960
17599D80023j8311K4437K4229K5399J082j2472l9917O199j2073Q676k5121k5672
17587D36479l2485m7018L9153O174J9069j0071J05m408N4647L6867j3878n1435
$$ plain form
17669 1862032 1849221 1828015 1835431 1832601 1833325 1753026 1654568 1585369 1553538 1580479 1573439 1540689
17657 1540689 1502141 1455709 1370631 1300176 1278535 1237655 1216231 1152291 1134331 1100962 1046250
17646 1046250 1026012 1025511 1029538 1045484 1008058 982112 977970 971519 977604 944336 985405 1027606
17634 1027606 998699 972757 915672 788198 724883 706728 674040 653709 650884 697640 735805
17623 735805 688535 630506 573347 565013 532935 485599 518172 554231 533559 529218 533725 549117
17611 549117 533438 525382 492937 473838 502592 524215 469200 441911 488932 495908 476063 480023
17599 480023 461712 486149 510378 535777 536859 524387 484470 490669 478596 487272 462151 436479
17587 436479 403994 356976 396129 402303 421372 411301 411406 406998 461645 498512 484634 433199
17575D33199n5771m9590j4323J3816p818k0256j0953j1430j9004P049k6823j4533
17563B23563J3787J7208o816j1209k6559n1353l5895L6257K5930o451j579P061
17551A83944K6233J9213J6m6553l5198j2732J1603k4266K2016J3997J2197m855
17539A65615j4222l8306K2622n1091o9648J6306k1360j3510L5378J5262J6394
17528F3440L7504j6123J2380k628J8686k0172l3144M329Q324K1431k76j4585j3071
17515F6095k302j843J7484J0358k9744l7420j9321L7628M900j3379m248P509k4266
17502A1451l6896J1096N1030j8839m6048J3565J6983J193m054m637M95J7972M575
17489A7886M129k4666k1955n5527m5N579J27J9148M8913N5246J360l7974l1239
$$ plain form
17575 433199 377428 327838 313515 327331 319513 299257 288304 276874 257870 264919 238096 223563
17563 223563 237350 254558 247742 236533 209974 158621 122726 158983 184913 178462 176883 183944
17551 183944 210177 229390 229406 182853 147655 134923 146526 122260 144276 158273 170470 165615
17539 165615 151393 113087 135709 84618 14970 31276 9916 -3594 31784 47046 63440
17528 63440 100944 84821 97201 94573 113259 93087 59943 64272 72596 94027 93751 79166 66095
17515 66095 63793 61950 79434 89792 60048 22628 3307 40935 45835 32456 28208 35717 11451
17502 11451 -25445 -14349 36681 17842 -28206 -14641 2342 3535 -519 -5156 -4661 13311 17886
17489 17886 22015 -2651 -24606 -80133 -80178 -74599 -74472 -55324 -6411 48835 50195 12221 -19018
17476a9018J9815O0996k2619O433K540j6894m4984L158M2021M5482P0856K7194
17464A74980j9139l7451j2469l470N2183O7710j7035o64k38n215m636o807M5318
17451B33067M3308l1630j5824L2209K7311l940l271J0582K9322N573r7161o3868
17439A65678k1057p793l5431k7700K1587M9999P194m4257o1380N4952L2741J5367
17427A49900L5418K9434m10L46p644j2181j5207O825K3568Q265Q37p416m8647
17414A63088j9541k5385l0234N2392L5835n951o8374l9996l192J3496j5233R609
17402F6514J872k5086J1813J4656k9360N115l6342k685j7834n3332p103N6880
17390a4892n862k8562K8667L8847L2599l0538J3999o895J5473K4395j8500l2828
$$ plain form
17476 -19018 797 61793 39174 45607 48147 31253 -13731 -10573 31448 76930 147786 174980
17464 174980 155841 118390 105921 102451 154634 222344 205309 204645 204407 199192 194556 187749 233067
17451 233067 276375 244745 228921 261130 288441 284501 281230 291812 321134 326707 229546 165678
17439 165678 144621 136828 101397 73697 95284 145283 152477 108220 46840 101792 134533 149900
17427 149900 185318 214752 214342 214688 207044 194863 179656 186481 210049 218314 219151 211735 163088
17414 163088 143547 118162 87928 140320 176155 170204 101830 61834 58642 72138 56905 66514
17402 66514 68386 43300 55113 69769 40409 45524 9182 6497 -11337 -64669 -71772 -14892
17390 -14892 -20754 -49316 -20649 18198 50797 20259 34258 27363 42836 67231 48731 15903
17378A5903J4346k5143j0485j7807R865R271P292M6402k1800o2328N845J6386
17366a2253P8310K0288j067J3316J7901l8411l6382L7905N604j8881k3889j8476
17354B3965J2549o171n7289P449P2397q345m3380M8828j1546J3241k171j3274
17342C6253j6753N2058m639m1771l3305k5743J4157K3742J7206L9871L3511j2605
17330H1982J3243l6231N388L897k5234r213k7017m6622M1140N1513l0009j9958
17318B879j1281J4264O6009L3388k0082k935k1929j9196k2237l1741K2693K8258
17306C8090j4824j670K9325k7979k0781k3656L8308L3939L6816o351L5306M2915
17294A59438N1190L8723O1261J33987R7247J4356p0140j40416j11073m0352m3548
$$ plain form
17378 15903 30249 5106 -5379 -23186 -13321 -4050 3242 49644 27844 -34484 -28639 -12253
17366 -12253 66057 86345 85278 98594 116495 78084 41702 79607 85211 66330 42441 23965
17354 23965 36514 30343 -26946 -19497 52900 44555 1175 50003 38457 51698 49527 36253
17342 36253 19500 71558 66919 25148 -8157 -33900 -19743 3999 21205 61076 94587 81982
17330 81982 95225 58994 64382 68279 43045 33832 6815 -39807 1333 52846 22837 2879
17318 2879 -8402 5862 71871 105259 85177 82242 60313 41117 18880 -12861 9832 38090
17306 38090 23266 21596 50921 22942 2161 -21495 16813 50752 87568 81217 116523 159438
17294 159438 210628 249351 310612 444599 541846 556202 486062 345646 234573 194221 150673
17283A50673j3472J7948m2332M058K2152k5006p699N688M310J4168l6761O287
17271A00014J8773K7882j4982K0231j450J6371J4956j6105J1195J96K4753K4466
17259B26300K5980J819j8990k8551k268K3558q365K9990O8304M1828L3563O5111
17247D58279P5190J8370o584m6088n5497m4501R075l0475k1200j8367l8101k0981
17235B79120j5200j4142m2959k6544o896n160j7332j4308o554l018k8576n4582
17223D3849l1651N2193J1723K4734P3282K6090J1751O42M4119J7050l7936n2264
17211A83582m414j1228J1453R31L9437O2076Q851l6140q4684k8819m065j1388
17199A25592m5092l1475j5001L8986K1486j3963l029N122J2147n67k9235J4703
$$ plain form
17283 150673 137201 155149 112817 116875 139027 114021 106322 112010 116320 130488 93727 100014
17271 100014 118787 146669 131687 151918 150468 166839 181795 165690 176885 177081 201834 226300
17259 226300 252280 254099 235109 206558 204290 227848 219483 249473 317777 359605 393168 458279
17247 458279 533469 551839 545255 499167 443670 399169 408244 377769 356569 338202 300101 279120
17235 279120 263920 249778 206819 180275 173379 168219 150887 136579 130025 127007 98431 43849
17223 43849 12198 64391 76114 100848 174130 200220 211971 212613 256732 273782 235846 183582
17211 183582 179168 167940 179393 180324 219761 281837 290688 254548 169864 141045 136980 125592
17199 125592 80500 49025 34024 73010 94496 80533 77504 82626 94773 94206 64971 79674
17187G9674M0517L9152O528L1435j0376o537k0668m9523l0572r874M586j2968
17175F1374J9134r521Q120M2786j7060k4321M3957K261k0063k5871J1391J5648
17163A07835m2612j2631R508j4753l862j2434L8282K7195o397k6342m5337j0125
17151H327J2815n468M2802j6813j3137J2279K4458M92l8674k4263J43j7617k6482
17138d1138J2309k3124l7122P678K6118n503j2298J9986N2528L7832j5673n2749
17126c1156n024O97J3016L854P633k2209J7924M5246o509O424j4076l9088k635
17113b5903K911j5800m401P875M8499Q696k0072O274o260K0591L1036l3707k9661
17100i922k4030k4147M2386j0276j5945m6792J7537M2765K2097J9007l8616l1558
$$ plain form
17187 79674 120191 159343 165871 197306 186930 180393 159725 110202 79630 69756 74342 61374
17175 61374 80508 70987 79107 121893 104833 80512 124469 126730 106667 80796 92187 107835
17163 107835 65223 52592 62100 47347 43485 31051 69333 96528 90131 63789 18452 8327
17151 8327 21142 15674 58476 41663 28526 40805 65263 65755 27081 2818 2961 -14656 -41138
17138 -41138 -28829 -51953 -89075 -81397 -55279 -60782 -73080 -53094 -566 37266 21593 -31156
17126 -31156 -36180 -35483 -22467 -18613 -10980 -33189 -15265 29981 23472 29896 15820 -23268 -25903
17113 -25903 -22992 -38792 -43193 -35318 13181 21877 1805 8079 1819 22410 53446 19739 -9922
17100 -9922 -33952 -58099 -15713 -25989 -41934 -88726 -71189 -28424 -6327 12680 -25936 -57494
17088e7494r297J6859M0501N3933j7129o88K1261q652q652L6546m984k2240j6400
17075B3564p8387r614M9209N2872K5945k9760n2629J9382K3387l9981K734J7602
17063D324J540l7752j0754o102L02L1985O1684K4303k2046n7684J357J1132Q51
17050C140j0750K107k6809J64K306j1803K3438o619M8729J2404o5q963J4010L894
17036D5183r198k1207J8850J4008l0721k7631J0297L0603J2031K9717L5036N371
17024A12339N03N510l3366j3228o185l4189k4731l4682l2598K7036M7750l951
17012A0208l0342r511L411k3525J8935L4395M9523l3351l8611l7004k0355N2369
17000b3858L2026j5458J0073L8490k421k5670j338L5437k061L09J3591L591L6751
$$ plain form
17088 -57494 -66791 -49932 -9431 44502 27373 26685 47946 39294 30642 67188 62204 39964 23564
17075 23564 -54823 -64437 -15228 37644 63589 33829 -18800 582 23969 -16012 -13278 4324
17063 4324 5864 -31888 -42642 -48744 -48442 -16457 45227 69530 47484 -10200 -8843 2289 3140
17050 3140 -7610 -5503 -32312 -32148 -29842 -41645 -18207 -24826 23903 36307 36242 27279 41289 45183
17036 45183 35985 14778 33628 47636 16915 -10716 -419 30184 42215 71932 106968 112339
17024 112339 112842 118352 84986 71758 65573 31384 6653 -28029 -60627 -33591 14159 10208
17012 10208 -20134 -29645 -26234 -49759 -30824 3571 53094 19743 -18868 -55872 -76227 -23858
17000 -23858 8168 -7290 2783 41273 38852 13182 11844 47281 45220 45529 59120 62711 99462
16987I9462O603o1578J3145K26J4175J0802j2501R05l9628m9613L7823L4464L5164
16974H9449N0351Q093k1935j2177j2556l3077j5522k2900L131Q830k6047k0115
16962d475M3176M033l4558k518J1739Q03K1399M5308J5620r660r822M1093M986
16949A27124M654l7875l2201l3853j2059J5497l062k5679J0293L2835l5089j3516
16937b931J885j2651N551m501L5443M3015k9897k2420k4733l5334J8821N7553
16925B9801L7265j221N474l7188p188j984J0228K2753m0534L4136J9719l9423
16913C1838k3407L8476j8935q880K3694O130k9943l0393l2409J3824L6828R967
16901A6790j3081j8926R104o469k4822L0637L654O782L2238K1306k3001M429j7147
$$ plain form
16987 99462 106065 44487 57632 57858 72033 82835 70334 71239 31611 -18002 19821 54285 89449
16974 89449 139800 147893 125958 113781 101225 68148 52626 29726 32857 41687 15640 -4475
16962 -4475 38701 42734 8176 5658 17397 18200 39599 84907 100527 90867 81045 122138 127124
16949 127124 131778 93903 61702 27849 15790 31287 28225 2546 12839 45674 10585 -2931
16937 -2931 -1046 -13697 -8146 -12647 22796 65811 35914 13494 -11239 -46573 -27752 29801
16925 29801 67066 65845 71319 34131 26943 24959 35187 57940 17406 51542 71261 31838
16913 31838 8431 46907 27972 19092 42786 48916 18973 -11420 -43829 -30005 6823 16790
16901 16790 3709 -15217 -6113 -12582 -37404 -6767 -3113 3669 35907 57213 34212 38641 21494
16888B1494M0341K0187n0670l0616J6243M440n917k2756m6106M2494K6673n254
16876A0553j2131l4539J8762q868L9215K832k1725M8068N4080j93m8267k9865
16864A7922L7657L4622j7722l3775l6552N647j3139j8687P999N5615L2871J5086
16852H7544m0290J0388m9022l5264J5823j7229L2819K4624K9069J6573n8164l1450
16840a4579K3110m54m7931Q040M7678l6179j5974J4385J5488N673j114l7555K192
16827c7220K5703K6217J6229l2570n0232L0992K6828K1088l9730L7166J8875J9982
16815F3328L2770J7654J5645M180n1699j3924N0311K1832l1945m6325K2835j2042
16803G2620J8198K0816j0781j6595Q450N8617k549o6743m1150L3070L7923L0896
$$ plain form
16888 21494 61835 82022 31352 736 16979 21419 15502 -7254 -53360 -10866 15807 10553
16876 10553 -1578 -36117 -17355 -26223 12992 15824 -5901 42167 96247 96054 47787 17922
16864 17922 55579 90201 72479 38704 2152 7799 -5340 -24027 -16028 39587 72458 87544
16852 87544 47254 57642 8620 -26644 -10821 -28050 4769 29393 58462 75035 16871 -14579
16840 -14579 8531 8077 -39854 -31814 15864 -20315 -36289 -21904 -6416 -743 -1857 -39412 -37220
16827 -37220 -11517 14700 30929 -1641 -51873 -20881 5947 27035 -12695 24471 43346 63328
16815 63328 96098 113752 129397 133577 81878 67954 118265 140097 108152 61827 84662 72620
16803 72620 90818 111634 100853 84258 92708 151325 148776 82033 40883 73953 111876 142772
16791A42772L2396K6708J7013N528l2628l2081L0142J5856Q781j7722j8556k597
16779A75612L2675J1665k3742N7177L6035m6735l7193o753N3683M2577m6180J1023
16767B59844R483l8878K0159L3195J0771M5047P4692Q0991J28881J40898J46226
16756I11309O9072m538n0750p6060j18399j03629q6252p437j9059j4137j1173
16745D88947k9634Q923M9454J073l3780P597J1945P099M7012K1433r166J2164
16733E83067N2177O0149K3411J0590M3997M8475K2153N7233J53879J61003J48361
16722A364495J75627J82530J99900K27683K38619K19222K90095L45457K84750
16713C528378L60528L73903N12643O96102R25526J156932J523503K118610L121481
$$ plain form
16791 142772 175168 201876 218889 224417 191789 159708 189850 205706 214487 196765 178209 175612
16779 175612 208287 219952 196210 253387 289422 242687 205494 198741 252424 295001 248821 259844
16767 259844 269327 230449 250608 283803 294574 339621 414313 495304 624185 765083 911309
16756 911309 980381 975843 925093 849033 730634 627005 540753 533316 514257 500120 488947
16745 488947 459313 468236 517690 518763 484983 492580 504525 511624 558636 580069 570903 583067
16733 583067 635244 695393 718804 729394 773391 821866 844019 901252 1055131 1216134 1364495
16722 1364495 1540122 1722652 1922552 2150235 2388854 2608076 2898171 3243628 3528378
16713 3528378 3888906 4262809 4775452 5471554 6397080 7554012 9077515 11196125 14317606
16704A4317606M571886O497391Q240913R217470R841012R460390P602786O063684
16696G5813138M574698M45500o445919q478633o533054o491116q424607q905054
16688C5554953p335631n230559l707022k874670k162920j554316j172065q93601
16680A0624169o49779n63695n17601m20099l46392k41847j64387j41187j25734
16671G453448j42992j54267j49824j61511k00263k02340k25991k83701l00651
16662E631908k71823k26071j45902j83217j82485j21914r4297q1566r5916j70548
16652D058169j97232k11561j97952j78087j28472p7950o1011r0502j00778q0555
16642B734069o7056k9213l8364q3482m0101p3292q7276p3009j09390r8752m1564
$$ plain form
16704 14317606 18889492 25386883 33627796 42845266 52686278 62146668 69749454 75813138
16696 75813138 80387836 80833336 74387417 65908784 59375730 52884614 44460007 35554953
16688 35554953 28219322 22988763 19281741 16407071 14244151 12689835 11517770 10624169
16680 10624169 9974390 9410695 8893094 8472995 8126603 7884756 7720369 7579182 7453448
16671 7453448 7310456 7156189 7006365 6844854 6644591 6442251 6216260 5932559 5631908
16662 5631908 5360085 5134014 4988112 4804895 4622410 4500496 4406199 4324633 4228717 4058169
16652 4058169 3860937 3649376 3451424 3273337 3144865 3066915 3005904 2915402 2814624 2734069
16642 2734069 2667013 2637800 2599436 2515954 2475853 2402561 2315285 2242276 2132886 2034134 1992570
16631A992570k1387j2765o061k1275K1564j8278q931n2831n6401m2700m5943r3348
16619A634214p8200j03423n4441k8175n7000l7543p208m4915o6550n5060l5740
16608A065959l332j8014r54m3266k4711m2969o8388j2520j768j6458l2061n4452
16596G47066P749L0580j5837R160j830o6349n0437q8825k0313k8528K4709J7807
16584E64952K0795N772L255k4126L261k8379p429k2037m533M4033M8513o384m0485
16571E57208J4995N331j7724n1091k4285N276L496j2508l5423m9572K349l4045
16559C64007J8475J2269l652J6416n506R789j7189n0742l440K24j3463R168K8426
16546C64782p390K5312m7271o4499L0500N104m8655n3952j71j7914J2434N3316
$$ plain form
16631 1992570 1971183 1958418 1952357 1931082 1952646 1934368 1925437 1872606 1816205 1773505 1727562 1634214
16619 1634214 1556014 1452591 1398150 1369975 1312975 1275432 1268224 1223309 1156759 1101699 1065959
16608 1065959 1062627 1044613 1043659 1000393 975682 932713 864325 851805 850037 833579 801518 747066
16596 747066 754815 785395 769558 778718 776888 710539 660102 571277 550964 522436 547145 564952
16584 564952 585747 591519 594774 570648 573909 545530 538101 516064 511531 555564 604077 597693 557208
16571 557208 572203 577534 559810 508719 484434 489710 493206 480698 445275 395703 398052 364007
16559 364007 382482 394751 391099 407515 402009 411798 394609 343867 340427 340651 327188 336356 364782
16546 364782 357392 382704 335433 270934 301434 306538 257883 203931 203760 185846 198280 251596
16534B51596L2533q373J0056J8659q120J4548j1999j3081K0151K1964M0153O132
16522C74219l0455k6125l6842L869q3184j1553j3480K6218K346m870p763j7614
16510A74766j7590k4344j7130J4972O752j9491k641P637J0585l3839p000K1629
16498A14306j4530k3609K7042p524N687J0161k2452j8233j6392k0487J2458L208
16486D9635L0021K29k6562K7761l2649l9455J648K0268K7908M5986j9158n3875
16474C1757K7863l7580J9455L6276L100l1541J4696l0739n12k2409k6795R27L4491
16461A8989J1550n280M7223k339k4099J3732J4108m649J3122k185j2891m5422
16449B1859j1713K1797j175k5270j0569k8693N2175R879l6380m231K4214J183
$$ plain form
16534 251596 284129 275756 285812 304471 296351 310899 298900 285819 305970 327934 368087 374219
16522 374219 343764 317639 280797 284666 201482 189929 176449 202667 205013 200143 192380 174766
16510 174766 157176 132832 115702 130674 137426 117935 115294 122931 133516 99677 92677 114306
16498 114306 99776 76167 103209 95685 101372 111533 89081 70848 54456 33969 46427 49635
16486 49635 79656 79885 53323 81084 48435 8980 10628 30896 58804 104790 85632 31757
16474 31757 59620 22040 41495 77771 80871 49330 64026 33287 32775 10366 -16429 -15502 18989
16461 18989 30539 25259 72482 70143 46044 59776 73884 69235 82357 80172 67281 21859
16449 21859 10146 31943 30768 5498 -5071 -33764 18411 28290 -8090 -12321 11893 13076
16437A3076J8775K5014J3763k1620K4665J3532J7184m2371p245l8296M897j0432
16425A0942l5041k0761n468M20Q0087L9879K3694L0231j5316p675N351L7991j6518
16412A27816r303n390r271r212k2568n0932m0061K0140j905k760M0694Q549K163
16399D7960p497k2947K5044Q165l0302l2886j1293J992L5668N0275K773k0922
16387D6030P087q948J0756P316l4060n879q187O204L1200l6321k3072o74R888
16374A340K4586m358J351n4949j9721K1380L1240L7595k6610l7076J1086K0910
16362F774J7333K7403j6767m4716o078k172j4220k9261J0907L4472M6607J3948
16350D4230l4296J228j2337J1666k9803l8462J9078MN140J1347R784l6007n8327
$$ plain form
16437 13076 31851 56865 70628 49008 73673 87205 104389 62018 54773 16477 21374 10942
16425 10942 -24099 -44860 -50328 -49908 30179 70058 93752 123983 108667 100992 106343 144334 127816
16412 127816 118513 113123 103852 94640 72072 21140 -18921 1219 -686 -3446 37248 45797 47960
16399 47960 40463 17516 42560 50725 20423 -12463 -23756 -21764 13904 64179 66952 46030
16387 46030 53117 44169 54925 62241 28181 22302 14115 20319 51519 15198 -7874 -8548 1340
16374 1340 25926 21568 22919 -32030 -51751 -30371 869 38464 11854 -25222 -14136 6774
16362 6774 24107 51510 34743 -9973 -16051 -18223 -32443 -61704 -50797 -16325 30282 44230
16350 44230 9934 11162 -1175 10491 -19312 -57774 -38696 -38692 -33552 -22205 -12421 -48428 -106755
16337a06755K0074M2632L9684M741k9062R518K4530l4419m266P208J3099J9593
16325F577j9616J080k4198j6149Q0416P74m4328k3711J113l322j4914j9582K8296
16312d7564L5384q522l102r098K1057J8843m6710l1329J5923N564R29k0407N1194
16299a7838J3366j4494Q151k8018j533m2437k8313M059K8792L7526j9732l792
16287f4263n701k7024K9193J7173r015L2434K8874m869J047l2266L9305K201k7507
16274b0418l9778N9904K6897l2861n2563J472N302J6237J5016j0396m0489J2164
16262e9513N0521L0531j7043k8197k4532K4699J7181J9937J1147n6659n190r577
16250d6695J8626P353p396K3567J0860j5000k7796k9396P4K8933J884J5568J5756
$$ plain form
16337 -106755 -86681 -44049 -4365 376 -28686 -19168 5362 -29057 -33323 -26115 -13016 6577
16325 6577 -13039 -11959 -36157 -52306 28110 28884 -15444 -39155 -38042 -41364 -56278 -75860 -47564
16312 -47564 -12180 -20702 -23804 -32902 -11845 6998 -39712 -71041 -55118 -49554 -48625 -69032 -17838
16299 -17838 -4472 -18966 -10815 -38833 -40366 -82803 -111116 -107057 -78265 -40739 -60471 -64263
16287 -64263 -69964 -96988 -67795 -50622 -59637 -27203 1671 -3198 -2151 -34417 4888 7089 -20418
16274 -20418 -60196 -292 26605 -6256 -58819 -57347 -52045 -35808 -20792 -31188 -71677 -59513
16262 -59513 -8992 21539 4496 -23701 -48233 -23534 -6353 13584 24731 -31928 -37118 -46695
16250 -46695 -28069 -20716 -28112 -4545 6315 -8685 -36481 -65877 -65803 -36870 -34986 -19418 -3662
16237c662N83Q446L494j4069n1173k9049K9949M4025k9135j8895k5463M6404j5012
16224e3557P307k275J5216J6110k7250j9207k968n644p228P604K6237k8814o2300
16211a36769j619n923J5039M374O362N3666N0361m8101k844K4183m195L1075j0190
16198b4581m668K1227q02p433N94K044J1631O394M9545p322o3244p655O324O038
16184a1908L8626k6072l7076k6749Q099L4095M807k9026M4734K7096Q808J1207
16172D6641m844P168L2782j8987o5081N866R389M44m5251o017K0494J950j4801
16159c0247j8725j43N770L6236M0325L6347k692K579j6439R934O353m847N6771
16146A21222L5528M9485Q9639J11627P3218K6878j57K0799K8165l1382o5465n5105
$$ plain form
16237 -3662 -3079 5367 8861 -5208 -56381 -85430 -55481 -11456 -40591 -59486 -84949 -38545 -53557
16224 -53557 -46250 -48525 -33309 -17199 -44449 -63656 -66624 -72268 -79496 -71892 -45655 -74469 -136769
16211 -136769 -138388 -144311 -129272 -124898 -118536 -64870 -14509 -62610 -65454 -41271 -45466 -14391 -24581
16198 -24581 -29249 -8022 -8824 -16257 -15663 -13619 -1988 4406 53951 46629 -16615 -24270 -17946 -11908
16184 -11908 26718 646 -36430 -63179 -55080 -20985 -16178 -45204 -470 26626 35434 46641
16172 46641 41797 48965 81747 62760 -2321 3545 12934 13378 -31873 -37890 -17396 -15446 -30247
16159 -30247 -48972 -49115 -43345 -7109 33216 69563 66871 69450 53011 62945 69298 64451 121222
16146 121222 156750 206235 295874 407501 480719 507597 507440 528239 556404 525022 459557 404452
16134D04452l847J878n7765m2804M390k4300J7790j2674l761P7435P0105L3392
16122D64291L4380N8184L3866R7503J02513K3622q5027j17421j08435l4345P271
16111D76402l8709m1430m1775m8279o3912j5904p561m1460k0808j6200K1682k2096
16099A39950k026O07l4470j9728P67j2530p084M2497Q500k7405n9266J3142K8565
16086G1519k2774m7931K510J8140K023k0655k2099R672M4543M0349O011k5691
16074E5617k1991n8409m9385K5619O3919J8831L2980O207Q438m058l3659k3205
16062B0904J4466l0511k2378P215J0995j255r47J7910k0312k379J8925k582J0298
16049B0349K3401j0256M298l201j9807N96K6742o260J8429M9790L2025n9482m8895
$$ plain form
16134 404452 400605 402483 344718 301914 306304 282004 299794 287120 283359 360794 430899 464291
16122 464291 498671 556855 590721 688224 790737 814359 729332 611911 503476 469131 476402
16111 476402 437693 396263 354488 306209 242297 226393 218832 177372 156564 140364 162046 139950
16099 139950 137924 138531 104061 84333 85100 72570 65486 107983 116483 89078 29812 42954 71519
16086 71519 48745 814 3324 21464 23487 2832 -19267 -9595 34948 75297 81308 55617
16074 55617 33626 -24783 -74168 -48549 15370 34201 67181 73388 81826 77768 44109 20904
16062 20904 35370 4859 -17519 -10304 691 -564 -1511 16399 -3913 -6292 12633 10051 20349
16049 20349 43750 33494 37792 34591 14784 15380 42122 35862 54291 104081 136106 76624 27729
16036B7729K6131J0031j8819m0314O817j3504l3608q72K3333j6647O429L8839
16024A5545K7822j2986n0873K152j8508J8910r41L9649K4723Q64k103j9741n9152
16011c4639N36l056o999J490L1591l136k6041k019P484l0956L755L0082J9341
15998a2567L511m924j4566j575K5212K9942J8227k3028j8739k5104P352j7540
15986c3799P699J3347J3288L369m9256J5681J056P750L8587j267n5876J3465K3343
15973b613k6583K4346L563N3238L752k5557j0663j6642j9204J5191K2062r849
15961A1041K6022q723K603K4400L2130j2835J2133k0415m2076k4896L0491j952
15949B7923l354J8821J8227M139p7090l6158R944o46K9846J6776J3939l5383l0967
$$ plain form
16036 27729 53860 63891 45072 4758 11575 -1929 -35537 -36409 -13076 -29723 -23294 15545
16024 15545 43367 30381 -20492 -18340 -36848 -17938 -18879 20770 45493 46357 44254 24513 -34639
16011 -34639 -34103 -37159 -44158 -42668 -11077 -14213 -40254 -42273 -34789 -65745 -61990 -31908 -12567
15998 -12567 -9056 -13980 -28546 -30121 -4909 25033 43260 20232 1493 -23611 -16259 -33799
15986 -33799 -26100 -12753 535 3904 -45352 -29671 -28615 -20865 17722 16455 -39421 -25956 -2613
15973 -2613 -29196 -4850 -1287 51951 55703 30146 19483 2841 -16363 -1172 20890 11041
15961 11041 37063 28340 30943 55343 87473 74638 86771 66356 24280 -616 29875 27923
15949 27923 24569 43390 61617 65756 -11334 -47492 -37548 -38194 -8348 8428 22367 -13016 -43983
15936d3983L5092L9871O877n1596k6960L0622N3166M18l2276k6456K2828j8251
15924a0648l6377l3327k0946J7980J9562L8058o344l2626J2343l747q306m19K8523
15911c6274L0722N227k6908k6815q766K5578j5580j4407J5406L955K4852j1664
15899c4674P74P431j776J7000Q87m0172r821P678J3878J8289p151K3740N065L310
15885D458Q381o482K1273o813n4215k7440N948O3620j1173o915P4564k3399o0451
15872a8644m1302n516O3496L8165l7930m9010o90J6381K9404K5310j6605J3868
15860A6927N8135L4157j3180p1702j7032K1362M144k3307o504L40j4804j9742
15848c1206j1173Q973L9686j4771l391J4623L6205M690k0744J361k5939m9041
$$ plain form
15936 -43983 -8891 30980 37857 -13739 -40699 -10077 43089 43507 11231 -15225 7603 -10648
15924 -10648 -47025 -80352 -101298 -83318 -63756 -25698 -32042 -64668 -52325 -56072 -64378 -64797 -36274
15911 -36274 -5552 -325 -27233 -54048 -62814 -37236 -52816 -67223 -51817 -47862 -23010 -34674
15899 -34674 -33900 -26469 -28245 -11245 -10358 -50530 -60351 -52673 -38795 -20506 -27657 -3917 1148 4458
15885 4458 12839 6357 27630 20817 -33398 -60838 -54890 8730 -2443 -9358 65206 41807 -18644
15872 -18644 -59946 -65462 -1966 36199 -1731 -50741 -51431 -35050 -5646 19664 3059 16927
15860 16927 75062 109219 96039 24337 7305 28667 32811 9504 3000 3340 -11464 -31206
15848 -31206 -42379 -33406 6280 -8491 -11882 2741 38946 43636 22892 24253 -1686 -50727
15836e0727N318k5145k3549O503J0017L5217J2399J0089k3748k0906K9141J9976
15824a5415J7152K8129l2214n8087n676j1213J7123M2539J8814k0950K2154j2280
15812i924k5177M3109K3742j0331l7323J3144k8964m6903o559M5044M0145j4233
15800a4230J0330j966m0408l0306J5091K2896M5873n164k2820j0489j0495j6937
15788e8625J5996L281l2318K3943L6675M8038n8827l3084k4985k823J1511R553
15776f1665O329r924J1684l1808m2745l669Q6660K8439o237m193J6880J5533J8611
15763B3895j0784n002P341m7373N901M5580n4684l4840M3418K4850J2972l5494
15751b4220n3578N0506K9616n2437l2020J2494M2023l6675M0606Q59L4027L626
$$ plain form
15836 -50727 -45409 -70554 -94103 -87600 -77583 -42366 -29967 -19878 -43626 -64532 -35391 -15415
15824 -15415 1737 29866 -2348 -60435 -66111 -77324 -60201 -17662 1152 -19798 2356 -9924
15812 -9924 -35101 8008 31750 21419 -15904 -2760 -31724 -78627 -85186 -40142 3 -14230
15800 -14230 -3900 -5866 -46274 -76580 -61489 -38593 7280 2116 -20704 -31193 -41688 -58625
15788 -58625 -42629 -39348 -71666 -47723 -11048 36990 -21837 -54921 -79906 -82729 -71218 -61665
15776 -61665 -55336 -65260 -53576 -85384 -128129 -131798 -45138 -16699 -22936 -27129 -10249 5284 23895
15763 23895 13111 8109 15450 -31923 -26022 19558 -35126 -69966 -26548 -1698 11274 -24220
15751 -24220 -77798 -27292 2324 -50113 -82133 -69639 -27616 -64291 -23685 -22826 11201 14827
15739A4827M2127j5334k2292k3895k842k1450M9100j5670m3427j5352R713M7737
15727C242k3358m9054m580L5461L8556J2551j4270p2093M987l530j3097K7333
15715e7852K7992k3312J3587K5283N5383J5219m2362l0870J0001j3140j2592j2313
15703d4976M9677M0221L4146l3556j8266j406n4819l8101L9085J6970k6566J8130
15691a9461j0155l5291K1603j4602m2950M5105K3956k9203k7819J2814M8115L8457
15679A0569k8043k0831N9333o320r2188R094j3266Q416m572j1229J6001L3103
15667c9933L6208l163N6590K3121k0248l0117m4918l8366J399N0312J0177j0548
15655i486l1915j4916K6281j068J0525q197M3649O355j8632K0333k3473n0095
$$ plain form
15739 14827 56954 41620 19328 -4567 -7409 -28859 20241 4571 -38856 -54208 -44495 3242
15727 3242 -20116 -69170 -73750 -38289 267 12818 -1452 -73545 -68558 -72088 -85185 -57852
15715 -57852 -29860 -53172 -39585 -14302 41081 56300 13938 -16932 -6931 -20071 -32663 -44976
15703 -44976 4701 44922 79068 45512 27246 25840 -28979 -67080 -27995 -11025 -37591 -19461
15691 -19461 -29616 -64907 -43304 -57906 -100856 -55751 -31795 -60998 -88817 -76003 -27888 10569
15679 10569 -17474 -38305 21028 14708 -77480 -68386 -81652 -73236 -77808 -89037 -73036 -39933
15667 -39933 -3725 -6888 49702 72823 52575 22458 -22460 -60826 -59427 -9115 1062 -9486
15655 -9486 -41401 -56317 -30036 -31104 -20579 -28776 14873 21228 2596 22929 -544 -50639
15643e0639j4928J9320m573N2477M7867l5476k9439n8038m044K1316K657O430
15631d7070j19r72L2844m548k6452N1086j1762o111j9606j0263O547j647n704
15618d3777J2176K4030K689j7839k962n9666M667j880l2870J4487q763J3018P2043
15605b4647J9625j0813n17o0j8423j4426M6915m9652j8697K100K2392L3044o804
15592a9963k4136J3595l287j9450P570M854k1837l491J7943L7061j8041k4600
15580e3782k3581L0177L2305j0322R182L056K4098J6689j3087k9085l9647J9675
15568c4322N367L6672m906j3694l740k2018R049O718P362k9341M6066J2347k4974
15555i414k5106l5705k5579m0074K215L3867L3461K4738J8171K2979o8104K6281
$$ plain form
15643 -50639 -65567 -46247 -50820 1657 49524 14048 -15391 -73429 -77473 -56157 -53500 -47070
15631 -47070 -47189 -48161 -15317 -19865 -46317 4769 -6993 -13104 -32710 -42973 -36426 -38073 -43777
15618 -43777 -31601 -7571 -4882 -22721 -25683 -85349 -80682 -82562 -115432 -100945 -109708 -96690 -24647
15605 -24647 -5022 -15835 -16352 -16412 -34835 -49261 -2346 -51998 -70695 -68595 -46203 -13159 -19963
15592 -19963 -44099 -30504 -33791 -53241 -45671 -40817 -62654 -66145 -48202 -11141 -29182 -53782
15580 -53782 -77363 -47186 -14881 -25203 -16021 -12965 11133 27822 14735 -14350 -53997 -34322
15568 -34322 -28955 7717 2811 -10883 -14623 -36641 -27592 -20874 -13512 -42853 3213 15560 -9414
15555 -9414 -34520 -70225 -95804 -135878 -133663 -99796 -66335 -41597 -23426 -447 -68551 -42270
15543d2270K2875K253P536R621J4421k9532l1892k7894M214M970L6718M252l800
15530b8528P466r455J1654P880O784J170N8661j6105n818R934j3445J575L1867
15517F3640R735o7259k7295J0508m0670l2477P121M0969J9603j6519k9082J6797
15505d4929J481J9561M1053j9213M651J2686n482N4q789N7166q205r284K9788
15492G0538k4689m8977q635K0922m336J4253j2716l4175j260k3074k4558j7223
15480i3930j1632O923J3154K4665K3162j4975l1184K4754O7377J9160J2497K8758
15468F8729k1300l9706j0711j9558N167Q529k5960m3191K5228Q715K1663N2201
15456B9806R395Q529l5107m5147K9641j106k931M329p5681M161M4185j0608P605
$$ plain form
15543 -42270 -19395 -17142 -9606 15 14436 -15096 -46988 -74882 -70668 -65698 -28980 -24728 -28528
15530 -28528 -21062 -30517 -18863 -10983 -4199 -3029 55632 39527 33709 43643 30198 31773 63640
15517 63640 73375 6116 -21179 -10671 -51341 -83818 -76697 -35728 -16125 -32644 -61726 -44929
15505 -44929 -43448 -23887 17166 -2047 2604 15290 9808 9862 1073 58239 50034 40750 70538
15492 70538 45849 -3128 -11763 9159 4823 19076 6360 -27815 -29075 -52149 -76707 -93930
15480 -93930 -105562 -98639 -85485 -60820 -37658 -52633 -83817 -59063 8314 27474 39971 68729
15468 68729 47429 7723 -2988 -22546 -17379 -8850 -34810 -78001 -52773 -44058 -22395 29806
15456 29806 39201 47730 12623 -32524 -2883 -3989 -6920 -2591 -78272 -74111 -29926 -40534 -32929
15443c2929O279q564J2131k5848J671j5642k0735o23M4491M2839n4475K5257K2974
15430c174j5314j8923r460o460m119j2966O761Q562k6699j5673J2789M5645J9979
15417a9052P092l1560l0505L823L2331p90j8135K6836Q078q553j7329j8785J6740
15404d9809K2244j545n076l3559k5755K9722M4791K1789p882j2571j1744o8816
15392i8211M6765O5597M1105m5882n1249k2244m4913j2306M9046N6620L7982k1500
15380H10l0202k4091J5309L4667j7490k3281K2556J4574j6832q665m8058K0874
15368e9829L4238l6038o1884j6747J5320K6972J0461J0965k4342K7038L545j4509
15356h4810P4249N59J0683L8482J695J6307J0886N625m7410l3990m5939J5902
$$ plain form
15443 -32929 -26650 -35214 -23083 -48931 -47260 -62902 -83637 -84260 -39769 3070 -51405 -26148 -3174
15430 -3174 -18488 -37411 -46871 -53331 -57450 -70416 -63655 -55093 -81792 -97465 -84676 -39031 -19052
15417 -19052 -11960 -43520 -74025 -70202 -37871 -38661 -56796 -29960 -21882 -30435 -47764 -66549 -49809
15404 -49809 -27565 -29110 -34186 -67745 -93500 -63778 -18987 2802 -5080 -17651 -29395 -98211
15392 -98211 -51446 14151 55256 9374 -41875 -64119 -109032 -121338 -72292 -15672 22310 810
15380 810 -29392 -53483 -38174 -3507 -20997 -44278 -21722 -7148 -23980 -32645 -80703 -59829
15368 -59829 -25591 -61629 -123513 -140260 -124940 -97968 -87507 -76542 -100884 -73846 -70301 -84810
15356 -84810 -10561 -10002 681 39163 40858 57165 68051 73676 26266 -7724 -53663 -37761
15344c7761J0756R056k6471j434J597L8901K5826j6079l4818j8548J9455R927
15332a9593J2440k7581k892j4419k1308K4637r696m0731L5014R759J483j6788
15320f9675K7907M4618J118j3083j3427l5317K8859l2735j4178N898k1676J0592
15308h1099j81k7362J731K5631O6471L077k1263O5378K4720n3506l5587l5175
15296f7165l0792l804M2669L3155K064N663J4599K6575n9173m7244J2793M0543
15284c0117J5512j0799j188N8987L0433k7027j5919n7021m7551J2009O0780k2663
15272c4564j5444L5581J2598j4659L2467l776j3342L5611L8745k4311k900j5058
15260C0948q185j4041j5196m2401L223Q065l0810j4001L3969j2065m524L8421
$$ plain form
15344 -37761 -27005 -17949 -44420 -45854 -44257 -5356 20470 4391 -30427 -48975 -29520 -19593
15332 -19593 -7153 -34734 -37626 -52045 -73353 -48716 -58412 -99143 -64129 -54370 -52887 -69675
15320 -69675 -41768 2850 3968 -9115 -22542 -57859 -29000 -61735 -75913 -70015 -91691 -81099
15308 -81099 -81280 -108642 -106911 -81280 -14809 -11732 -32995 32383 57103 3597 -31990 -67165
15296 -67165 -97957 -101761 -59092 -25937 -23873 -18210 -3611 22964 -36209 -83453 -70660 -30117
15284 -30117 -14605 -25404 -26592 32395 62828 35801 19882 -37139 -84690 -72681 -11901 -34564
15272 -34564 -50008 -14427 -1829 -16488 15979 12203 -1139 34472 73217 48906 46006 30948
15260 30948 22763 8722 -6474 -48875 -45652 -37587 -68397 -82398 -48429 -60494 -65018 -26597
15248b6597L975j2200n946L5809K7342j8014j5619K0000K655n6325j6303J0202
15236e1021N357k001l2006j8178L6180K2715Q319l827J6660J0794k198K637j1265
15223a7834J6360K3723K3899p338p4864l6684L049K7964J6453j6997k6693n7470
15211a26432j4460P2380O6386L925j4904J3252J0181k1287k5258m162O330J9956
15199a4093R979o056k0249J6192J1493l5804j5219k946J2529L3245M218j5976
15187b2687J7580J3717J4777Q323L4527j1288q468p775j4794l2614r400K0311
15175B209m288K829p885l1962p916K6395J1955l1422K1884M991K0416J8012j1782
15162A3436l4809K4024J6772P073l4294K007l407k634j7917j0068k6632N6202
$$ plain form
15248 -26597 -22622 -34822 -40768 -4959 22383 4369 -11250 8750 11405 -44920 -61223 -51021
15236 -51021 -45664 -47665 -79671 -97849 -61669 -38954 -30635 -34462 -17802 -7008 -9206 -6569 -17834
15223 -17834 -1474 22249 46148 38810 -36054 -72738 -69689 -41725 -25272 -42269 -68962 -126432
15211 -126432 -140892 -68512 -2126 1799 -13105 147 10328 -10959 -36217 -40379 -34049 -14093
15199 -14093 -4114 -10170 -30419 -14227 -2734 -38538 -53757 -56703 -44174 -10929 -6711 -22687
15187 -22687 -5107 8610 23387 31710 66237 54949 46481 38706 23912 -8702 -18102 2209
15175 2209 -2079 750 -7135 -39097 -47013 -20618 -8663 -40085 -18201 -13210 7206 25218 13436
15162 13436 -21373 2651 19423 26496 -7798 -5791 -9198 -11832 -29749 -39817 -66449 -10247
15150a0247q065M070J749j5746K4866J805l8899m464K5271M2197J8469r634j5293
15137A6079N134n5272o578J3556N438j3763J3301R385l548k584Q5k6252k5897
15124g0916l8146J8405Q6683L6919r237l9664M330K6652k0060m4573J7354k020
15112c4273l852k2049L860P0982K6067k7143m8894l1653J9414k7752N0399L3039
15100H145j9966p995j207j9083K9306K3504p25Q536k1487j4133K3158M4688J3417
15087F6158p592n1187k2139k5033L8796p363J2103K620l129l64m3549j9215j6609
15074g6503k9029k8778K3450M1436M696L2243N2319m89J5234O795p270j4546k1548
15061a990k9805K3079L5558k4281l7430k4041J1251J9747J1315j9530l7813k1799
$$ plain form
15150 -10247 -18312 -14242 -12493 -28239 -3373 -1568 -40467 -44931 -19660 22537 41006 31372 16079
15137 16079 21213 -34059 -40637 -27081 -21643 -35406 -22105 -12720 -16268 -18852 -18767 -45019 -70916
15124 -70916 -109062 -90657 -3974 32945 23708 -15956 -11626 15026 -5034 -49607 -32253 -34273
15112 -34273 -38125 -60174 -56314 14668 40735 13592 -35302 -66955 -47541 -75293 -24894 8145
15100 8145 -11821 -19816 -21023 -40106 -10800 12704 11979 20515 -972 -15105 8053 52741 66158
15087 66158 58566 7379 -14760 -39793 -997 -8360 3743 6363 3234 2870 -40679 -59894 -76503
15074 -76503 -105532 -134310 -110860 -69424 -64728 -32485 19834 19345 34579 41374 34104 19558 -1990
15061 -1990 -31795 -8716 26842 2561 -34869 -58910 -47659 -27912 -16597 -36127 -73940 -95739
15049i5739R0359N2573o495k3550n8220q459Q645k6615P437L8759K2968k0910
15037a9247m7457K5447J5693K3246R445j9387j3145O422J2434j9422M975J8886
15025b110j1038j5756j4028O2523J1614j0735L673k0321k9678q057l373J460l7186
15012g3012l871N2252m524j9842K4212L4161j5499j6634K3884J4499j532k2818
15000h724n3262n9008J0708M1894P769N918n2621n04N4520m946m8009R799O4099
14987c2367J7031M794l2128m1153N548N0943L2714m2488n239j0401k888N193K4619
14974b5822K4060r323N589o633k4411k3786l933n2512l1605J6289O052l979J6695
14961a13319J5876J6648m32R588K1885N65M520M3446M1476k2871j5086M671j2570
$$ plain form
15049 -95739 -5380 47193 40698 17148 -41072 -49531 -40886 -67501 -60064 -21305 1663 -19247
15037 -19247 -66704 -41257 -25564 -2318 7127 -12260 -25405 -18983 -6549 -25971 -20996 -2110
15025 -2110 -13148 -28904 -42932 19591 31205 20470 24143 3822 -25856 -33913 -37286 -35826 -73012
15012 -73012 -76883 -24631 -29155 -48997 -24785 9376 -6123 -22757 1127 15626 14094 -8724
15000 -8724 -61986 -120994 -110286 -68392 -60623 -54705 -107326 -107830 -53310 -58256 -106265 -96466 -32367
14987 -32367 -15336 -10542 -42670 -83823 -78275 -27332 5382 -37106 -42345 -52746 -55634 -50441 -25822
14974 -25822 -1762 -11085 -5496 -12129 -36540 -60326 -64259 -116771 -148376 -132087 -126035 -130014 -113319
14961 -113319 -97443 -80795 -81227 -71639 -49754 -49189 -44669 -1223 40253 17382 2296 6967 -5603
14948e603O77n614K48j5226K897K827J5357l1277j5982O0870K5516Q143j4176
14935B8657J2646K438k8115N665J5693l8507k0758j9649k3990j5316L0418j0120
14923f0938j8273N2250M5732j5797p6579M336L7440J3956L8040k7782p8568K1420
14911f4763l3027K3037J4578l495j0109M3549L5573M7641M1368k6029o3430m572
14899C21j7564m2736M187K5439p714l6179r464K7086q861J1762j3965k2789q336
14886i8813L2315J9841M824J2057l8919J7473K0529J1712K2417L842k1670k2960
14874c7352j3232j9982J4330N582J7988l8819R776M6137K9686J0725l5967m2433
14862e3561j8528J4164J4146o217J752M9945J1576J8488K5118L6743j7643l7263
$$ plain form
14948 -5603 -4926 -10540 -10292 -25518 -22621 -19794 -4437 -35714 -51696 9174 34690 42833 28657
14935 28657 41303 43741 15626 21291 36984 -1523 -22281 -41930 -65920 -81236 -50818 -60938
14923 -60938 -79211 -26961 18771 2974 -73605 -69269 -31829 -17873 20167 -7615 -86183 -64763
14911 -64763 -97790 -74753 -60175 -63670 -73779 -30230 5343 52984 94352 68323 4893 321
14899 321 -17243 -59979 -55792 -30353 -38067 -74246 -83710 -56624 -65485 -53723 -67688 -90477 -98813
14886 -98813 -66498 -46657 -41833 -29776 -68695 -51222 -30693 -18981 3436 7278 -14392 -37352
14874 -37352 -50584 -70566 -56236 -50654 -32666 -71485 -61709 -15572 14114 24839 -11128 -53561
14862 -53561 -72089 -57925 -43779 -49996 -48244 1701 13277 31765 56883 93626 75983 38720
14850C8720m1375l519k4593L510j9454K1901J2702j9435J6400J309L9431l4253
14838h656l1568j6979m004N7158J735l2560Q902K0943k2237l9830m1190M640N1323
14825e2323K2918j1940k3936J3738J9969k5587j1754M926j1700M4863j2694j0765
14813e4285l1264L0436R665m1867K2327L8007k449K6449q05m2126k5329J7696
14801e3545N342M3308J6197k0754m2727Q259J3718P4017O541k4152j2471j1673
14789B060j3562J0532J316M482q334m6121l1923p287l348L1629L4646J0237M1727
14776B6054p174P800Q825m61j3617J758k9565k5802k4266P098N1314j6340l7484
14763e1860N775J5402Q025J4542Q693j7532J8168j4874m385j7378P174K047n684
$$ plain form
14850 38720 -2655 -6174 -30767 -27257 -46711 -24810 -12108 -31543 -15143 -13834 25597 -8656
14838 -8656 -40224 -57203 -61207 -4049 -2314 -34874 -25972 -5029 -27266 -67096 -108286 -103646 -52323
14825 -52323 -29405 -41345 -65281 -51543 -31574 -57161 -68915 -63989 -75689 -30826 -43520 -54285
14813 -54285 -85549 -55113 -45448 -87315 -64988 -26981 -29430 -2981 -3786 -45912 -71241 -53545
14801 -53545 -48203 -4895 11302 -9452 -52179 -43920 -30202 43815 50356 26204 13733 2060
14789 2060 -11502 -970 346 4828 -3506 -49627 -81550 -88837 -92185 -60556 -25910 -15673 26054
14776 26054 18880 26680 35505 35044 21427 23185 -6380 -32182 -56448 -49350 1964 -14376 -51860
14763 -51860 -46085 -30683 -22658 -8116 577 -16955 1213 -13661 -18046 -35424 -28250 -26203 -31887
14750c1887J8585M4893L572m2687l4127O914L4183N738j8266J2671J6504N772
14738B1865k889j4482l7029J4950L9844m1248k5214k558j3996L8137L6771k3064
14726h913q796P2221l517l2887l1036l893M443N182Q871n5931k9368m509n153
14713i3286J7643K2918k0406k6138K4115M6815J7011J196J8382N12j0753P911
14701E920k1667n654J8204M904O6M003l5383q705l416J4778J7500l249J3112K5098
14687B5511J4128k8014k1523p174K9389j3964j8374M326K8453m1374Q683M1093
14675B1160k4506k4403J060J2975O451J5532k5703L0990K3579l3820l3831k249
14663c2765j1963N6789L4131n3402k1539M2768J0365J014L0388m9965l5765M050
$$ plain form
14750 -31887 -13302 31591 35163 -7524 -41651 -34737 -554 5184 -13082 -411 16093 21865
14738 21865 18976 4494 -32535 -17585 22259 -18989 -44203 -46761 -60757 -22620 14151 -8913
14726 -8913 -17709 54512 50995 18108 -12928 -16821 -12378 -7196 1675 -54256 -83624 -88133 -93286
14713 -93286 -75643 -52725 -73131 -99269 -75154 -28339 -11328 -10132 8250 8762 -1991 5920
14701 5920 -15747 -21401 -3197 1707 1773 5776 -29607 -38312 -41728 -26950 -9450 -12699 413 25511
14687 25511 39639 11625 -9898 -17072 12317 -1647 -20021 -15695 12758 -28616 -19933 21160
14675 21160 -3346 -27749 -26689 -13714 -7263 8269 -17434 13556 37135 3315 -30516 -32765
14663 -32765 -44728 12061 46192 -7210 -28749 14019 24384 25398 55786 5821 -29944 -25894
14651b5894R668l4949l2264j7459J3889M7278N4267M9042k1462k6745J9650K043
14639C7064m1620j9966k864L213j7267p218J6665M7105K2582K429l3591k2372
14627a5840j8804J6959J3248j7554l694O140K2510J9342j3375q981N738l2952
14615b7263p994j9844P204l4219j7265J813N9812J1176m487k3926j0642p351K2093
14602e0893q246p109L8173L2042r743J6001M682J6028N933o150l9833n1713k1238
14589h2066J3785j0857j6174r585L1900N7919l3343o0733K705K1979J7596j705
14577f8579P613K9246K3750K5448O392K3666k3826p6401j6581R197K9471K8591
14565b013l0958k813J8201j4544O696L981J1869J043L6492J4103P512J1179m4446
$$ plain form
14651 -25894 -16226 -51175 -83439 -100898 -87009 -39731 14536 63578 42116 15371 35021 37064
14639 37064 -4556 -24522 -27386 -24173 -41440 -48658 -31993 15112 37694 40123 6532 -15840
14627 -15840 -34644 -17685 -4437 -21991 -25685 -19545 2965 22307 8932 -49 5689 -27263
14615 -27263 -35257 -55101 -47897 -82116 -99381 -97568 -37756 -26580 -31067 -54993 -65635 -72986 -50893
14602 -50893 -59139 -66248 -28075 3967 -5776 10225 14907 30935 36868 30718 -9115 -60828 -82066
14589 -82066 -68281 -79138 -95312 -104897 -72997 -15078 -48421 -109154 -106449 -84470 -66874 -68579
14577 -68579 -60966 -31720 -7970 17478 23870 47536 23710 -52691 -69272 -60075 -30604 -2013
14565 -2013 -32971 -35784 -17583 -32127 -25431 -21450 -9581 -8538 27954 42057 49569 60748 16302
14552A6302l5141J0543n2292m353J3842n0807m1557N8164N6835M054j8036k3992
14540f6438M4995M7607j3517j4169J378l6697o005L8549l645j8688L0819K1227
14528B5416k767K9463m0092Q687j1085k4675n6273n659N5091M405m879l2278j1706
14515f6352l4700k364J9656L9732K6159r725n789l5436j0250l7484M0930L2477
14503d3146L789j3764R426N4690q673p768k0248J5774J6433l15l7902j6756l4908
14490h3368q40K6014K3979K046j6990L2436n829O774k0253J8150q462k8458m170
14477e8971O909J810l571L5921N7601J9703j0157l8924m3648J3983l2802l444
14465e5590N4187K8173j6704M946L3555k4284J8796j2458l4274j7761J5015k1223
$$ plain form
14552 16302 -18839 -8296 -60588 -64941 -51099 -101906 -143463 -85299 -28464 -24410 -42446 -66438
14540 -66438 -21443 26164 12647 -1522 -144 -36841 -42846 -4297 -7942 -26630 4189 25416
14528 25416 22649 52112 12020 20707 9622 -15053 -71326 -76985 -21894 -17489 -22368 -54646 -66352
14515 -66352 -101052 -103416 -83760 -44028 -17869 -27594 -33383 -68819 -79069 -116553 -75623 -43146
14503 -43146 -39357 -53121 -43695 10995 2322 -5446 -25694 -9920 6513 6198 -31704 -48460 -83368
14490 -83368 -84208 -58194 -34215 -32169 -49159 -16723 -22552 -15778 -36031 -17881 -26343 -54801 -58971
14477 -58971 -52062 -50252 -53823 -17902 39699 59402 49245 10321 -33327 -19344 -52146 -55590
14465 -55590 -1403 26770 10066 15012 48567 24283 43079 30621 -3653 -21414 -6399 -27622
14453b7622o828J161K6830J1940j3790p259k4487k973J4232J5355L2791M9693
14441F9043K3321m0487K291K3648m00K632j6856o1420n0106j8504J4433o668K8609
14428c0464L7070P437l6481J1195K9806j489q428j4836j6931p180m319R501K0070
14415e049N0088J3128K6933j8196m5260l0075k3628m596N416N667J7324J9506
14403A1258J9638m355k0581o0340l1178M9568M1709J1118K9366j3388l0043l5640
14391c2868p68R117J3635k3015j5420K5317P991k9091M299K6048j4498K3035n502
14378a1720N068j8768L6376O979l8623J2880L4697J1667j5443l4741K5779O143
14366B0294j7104K806J1973K0725j6316l9203p7167m0591J5914M6168L2326p679
$$ plain form
14453 -27622 -34450 -33289 -6459 5481 -8309 -15568 -40055 -43028 -28796 -13441 19350 69043
14441 69043 92364 51877 54168 77816 77416 80048 63192 1772 -48334 -66838 -52405 -59073 -30464
14428 -30464 6606 14043 -22438 -11243 18563 17074 8646 -6190 -23121 -30301 -34620 -25119 -5049
14415 -5049 45039 58167 85100 66904 21644 -8431 -32059 -36655 -31239 -25572 -8248 11258
14403 11258 30896 26541 5960 -54380 -85558 -35990 5719 16837 46203 32815 2772 -32868
14391 -32868 -33636 -24519 -10884 -33899 -49319 -24002 -16011 -45102 -40803 -14755 -29253 -6218 -11720
14378 -11720 -6652 -25420 10956 17935 -20688 -7808 26889 38556 23113 -11628 14151 20294
14366 20294 3190 5996 17969 38694 22378 -16825 -93992 -134583 -118669 -72501 -40175 -47854
14354d7854l456j2543L8362M7206q99n0093p993k5132p815L0270L222L669j9715
14341e2771J2597m0991j3765L160K9035J4859P245J2846P0688M375n2407O887
14329A758N1961K6775l8972l8175K5612J6081j6790J9254L7075k2689l9362O040
14317B8568l0014j9448J4755j5410j6748n6579j0779N0335J7699j6424J8797Q859
14305b6389j199O350J7251j026p540N830j8936q484j3657l822j3518K9084K0385
14292a5671j437J2311k4193j0692p973K2414K0692j7199j4282M3821k6397m3558
14280f2164K1893K3224j6587P758L5436J0305l0984k0152M7450M4364J8916l5668
14268D3791r406L4240k1370k6225k1773p85n7934j3218M2282M8754k9322m0728
$$ plain form
14354 -47854 -51310 -63853 -25491 21715 20816 -29277 -37270 -62402 -70217 -39947 -36725 -33056 -52771
14341 -52771 -40174 -81165 -94930 -91770 -62735 -47876 -40631 -27785 42903 47278 -5129 1758
14329 1758 53719 80494 41522 3347 28959 45040 28250 47504 84579 61890 22528 28568
14317 28568 -1446 -20894 -6139 -21549 -38297 -94876 -105655 -55320 -37621 -54045 -35248 -26389
14305 -26389 -27588 -21238 -3987 -5013 -12553 -6723 -25659 -34143 -47800 -51622 -65140 -36056 -15671
14292 -15671 -17108 -4797 -28990 -39682 -47655 -25241 -4549 -21748 -36030 7791 -18606 -62164
14280 -62164 -40271 -17047 -33634 -25876 9560 19865 -11119 -31271 16179 60543 79459 43791
14268 43791 34385 68625 47255 21030 -743 -1528 -59462 -72680 -30398 18356 -10966 -51694
14256e1694K4664L1220K475p236L0876K6331j5203l1861k5575k2302J4056N453
14244a8796O253R125L0138P279k4191l8804J6126M5458M7417M3240l0468Q21K3343
14231A16941n0896Q454O3430O8958M4265j2824K8289O4475O0413M2526l6934j5433
14219C81664p590l7078M292L7788J5510O398J7700J3984l3707p5434l0504J9149
14207C12172r657o3330p7494j8918J3807m0393j0390l1464J3945M827k0889l3097
14195C9119M7253J0466j9132Q544M3355k641n2124k969J5148J943k2o217R989
14182I2712J4179m1734j2821L2899M964n1224k2225J6266J296K5900q673J186
14170E2725p088l1906K2242m1036K4578J6399l1465K3537J5145O170J7691j3361
$$ plain form
14256 -51694 -27030 4190 6665 -571 30305 56636 41433 9572 -16003 -38305 -24249 -18796
14244 -18796 -12543 -3418 26720 33999 9808 -28996 -12870 32588 80005 123245 92777 93598 116941
14231 116941 66045 74499 137929 206887 251152 238328 266617 331092 391505 434031 397097 381664
14219 381664 374074 336996 341288 379076 394586 400984 418684 432668 398961 323527 293023 312172
14207 312172 302515 239185 161691 142773 156580 116187 105797 74333 88278 93105 72216 39119
14195 39119 86372 96838 77706 86250 129605 126964 74840 71871 87019 88962 88940 82723 92712
14182 92712 106891 65157 52336 85235 90199 38975 16750 33016 34312 60212 51539 52725
14170 52725 45637 13731 35973 -5063 19515 35914 4449 27986 43131 49301 66992 53631
14158E3631l1207L848L8639k0348m4788K3870k4025n926o19j6271k0123J4751
14146b8568j4325J0353J2702J1735J3776P499L0031k0944k5224j1921j7277L5551
14134C388J4937J742K8980l0172l5894k1433P148j9619K6241Q0289K5455l4859
14122D6203j4924k3341k5653R297j729j4273Q387q883l7108J7648K7261L1908
14110A4793j3987J8816J7133J0383R782m0166j2383j0064J933K7601M54P914M817
14097C7026K803m625J8222m2771O577M5772n368j4581k0144j247k7480j2678K5347
14084F853L464q222j9779j8790k7998k2808N465L893M7423K4151L0727P9230M2928
14071A46537o3508l9156n1995k1441J7027L4032J3787R910n414J012l8752J8577
$$ plain form
14158 53631 22424 26272 64911 44563 -225 23645 -380 -6306 -6925 -23196 -43319 -28568
14146 -28568 -42893 -32540 -19838 -8103 5673 13172 43203 22259 -2965 -14886 -32163 3388
14134 3388 18325 20067 49047 18875 -17019 -38452 -31304 -50923 -24682 55607 81062 46203
14122 46203 31279 7938 -17715 -8418 -10147 -24420 -16033 -24916 -62024 -44376 -17115 14793
14110 14793 806 19622 36755 47138 56920 16754 4371 -5693 -3760 23841 24295 32209 37026
14097 37026 39829 35204 53426 10655 17232 63004 57636 43055 22911 21664 -5816 -18494 6853
14084 6853 10317 2095 -17684 -36474 -64472 -87280 -81815 -77922 -30499 -6348 24379 103609 146537
14071 146537 83029 43873 -8122 -29563 -12536 21496 35283 45193 39779 40791 2039 20616
14059B0616L6116m1824k1375j5638r01K0870O823J8521L5904k2482l1973l4646
14047b9989L1165L1088M0967J468j5034J6615J7906l3510l391k7985j5466Q282
14035B2116m4298J4463M3413J2970K9981k5804j8909L7745L3403L7019m461N05
14023A38143k9059O213N8470L9310J0432k8666k016o583l4486J7738M4601L1716
14011B45813M756J0965L591Q1975P7348M6611P3069Q1760M7453Q7075J21625J40156
13999A022197K25342K22272K49502M11927O66254J107230J704195K462087K981173
13990A1052179L030221K712412J418982p24459j609894k336454l352685k935017
13982G255285j893050j137033p05417m08508l51788k42417j90186j68575j54054
$$ plain form
14059 20616 56732 14908 -6467 -22105 -23006 -2136 4687 23208 59112 36630 4657 -29989
14047 -29989 1176 32264 73231 74699 59665 76280 94186 60676 57285 29300 13834 22116
14035 22116 -22182 -7719 35694 48664 78645 52841 33932 71677 105080 142099 137638 138143
14023 138143 109084 115297 173767 213077 223509 194843 192827 186244 151758 169496 214097 245813
14011 245813 250569 261534 265125 347100 424448 471059 544128 625888 673341 760416 882041 1022197
13999 1022197 1247539 1469811 1719313 2131240 2797494 3904724 5608919 8071006 11052179
13990 11052179 14082400 16794812 18213794 17489335 15879441 13542987 10190302 7255285
13982 7255285 5362235 4225202 3519785 3111277 2759489 2517072 2326886 2158311 2004257
13973B004257j75881j58346j23639j02029r5045l7967l9746j2891k9729j6382
13963A212602m7122o0310l6566l3408n1110m7828r005K0062l766m4295n7291n7790
13951G84173l3458K8702j3603k1515l6798m6333m1649r011k3132m7627K6624K3231
13939E89604m252K4455l9769j07023o5936n4182J5811L5715K670j5116K0558L630
13927D06165k4257m1996k1893m319M196L233j5351l9336j2110j0047l4264R628
13915B19649L6697K8867p431l8625m9173j600J4610J0106n763Q801l4844j1310
13903A69984l1087n613J8778O4027j3292j0828j1108p2852j1504k7432M544M2485
13891A16102R520J3818K1747J3555m0526R994K5301j7255j841k1300j9026J497
$$ plain form
13973 2004257 1828376 1670030 1546391 1444362 1349317 1311350 1271604 1258713 1228984 1212602
13963 1212602 1165480 1105170 1068604 1035196 984086 936258 927253 947315 943549 899254 841963 784173
13951 784173 750715 779417 765814 744299 707501 661168 619519 610508 587376 539749 566373 589604
13939 589604 585352 609807 570038 463015 397079 342897 358708 394423 397093 381977 402535 406165
13927 406165 381908 339912 318019 313700 317896 321129 305778 266442 254332 244285 210021 219649
13915 219649 256346 285213 277782 239157 189984 188384 202994 213100 207337 216138 181294 169984
13903 169984 138897 133284 152062 216089 202797 191969 180861 108009 96505 69073 73617 116102
13891 116102 125622 139440 161187 174742 134216 144210 169511 152256 150415 129115 110089 111586
13879A11586l83j8788O506k239j9820j0144M1247R244m5344k6135m25j2355N303
13866C8253k7847j3889J0960N1026J5255m132J79j5579J2541K6138J9615o6551
13854D5969n1681l924n693j2432K573L1741K8410L2672K1867j8688l0093m4963
13842d242K8145J305J6229k526l4420J8918K9262j6943J2800J8840L6091j2193
13830I1266K165L7763o239n4479J0684N3178K5825L5169N0128N2487M6569O2086
13818D06602P4910M1120M9147O4173j4438l7229k8973r608l8191J305l9168j1227
13806D58423J6936J1144j0329K6835N918m0900r052n1582o2923l561J6185m7008
13794C10086l4160j4137J6876p006m0996k9266Q973K9850O9986Q0620P6072J8959
$$ plain form
13879 111586 111203 92415 98921 96682 76862 66718 107965 117209 71865 45730 45305 32950 38253
13866 38253 10406 -3483 7477 58503 73758 69626 69805 54226 66767 92905 112520 45969
13854 45969 -5712 -9636 -15329 -27761 -25188 6553 34963 67635 89502 70814 40721 -4242
13842 -4242 23903 25208 41437 38911 4491 23409 52671 35728 48528 67368 103459 91266
13830 91266 93431 131194 124955 70476 81160 134338 160163 195332 245460 297947 344516 406602
13818 406602 481512 522632 571779 635952 621514 584285 555312 545704 507513 508818 469650 458423
13806 458423 475359 486503 476174 503009 508927 468027 458975 407393 344470 340909 357094 310086
13794 310086 275926 261789 278665 271659 230663 201397 210370 240220 310206 390826 466898 485857
13782D85857J9588N6322Q5545N4418M9977p520l5569o8922m8185n5496m5189j3078
13770D77748q970j3793K1528M4955J2588J9645j9677q5308N56r991j7254o9934
13758C52093m6875R83l9008o3433k6574K3127K522j4007q174l1100K3153J0950
13746A83657r424m801M2230K2564j4580j3780l9282m7301N228L5654l3198k6677
13734A00290k6991J3128j023M2696K5601O3338k9732o3376L9220J6419J1912m5567
13722A45915m7302Q902K9993K1932N4336k2036J5364k847l3870r5934l4496K5903
13710F5860k3576m8095R450L8891q007m3322M175K6885o011p778L2662K0003k4823
13697C6314J2397k9033o515L7120o886j5396j3900J365j7265J9672N1678J5799
$$ plain form
13782 485857 505445 561767 647312 701730 751707 744187 708618 639696 591511 536015 490826 477748
13770 477748 468778 454985 476513 521468 534056 553701 534024 448716 449272 439281 422027 352093
13758 352093 305218 306201 267193 203760 177186 200313 202835 188828 180654 149554 172707 183657
13746 183657 174233 169432 211662 234226 219646 205866 166584 119283 124511 160165 126967 100290
13734 100290 73299 86427 85404 128100 153701 217039 187307 123931 163151 179570 191482 145915
13722 145915 98613 107515 137508 159440 213776 191740 207104 204257 170387 74453 39957 65860
13710 65860 42284 -5811 3639 42530 34523 -8799 -4624 22261 16250 8472 41134 61137 36314
13697 36314 48711 19678 13163 50283 43397 28001 14101 15466 -1799 17873 69551 85350
13685H5350j312j5709n2007K0286r842J565l583J6052J0935l2028n705j7502j2671
13672a6171m283K7500J4302k7895M2901M3271l4303k4495P892R40k177K5480M1980
13659I4942l2744k8954N7712k1298p6348p6689L0089N2370K0033M7038j4431k2363
13647B9357j9187J0816J0636j0159j0838J1506j0167j3037L1159M0862L3305o566
13635I7687l6203m1017j8705L2364q254n2239J8075L0911K0457K1433p765l5592
13623B1152n52l308K8094L050j3464J4982K7650k0667N261J2112j1420k9993k397
13610C0500p165j289O842J4365j5845l39k3610O781J4545k6763M920M1048Q454
13597E2444n504J2067k1278n311m1059k9773n0023J5224L463K5449M1666k7566
$$ plain form
13685 85350 84038 68329 16322 36608 26766 28331 24748 40800 51735 19707 14002 -3500 -16171
13672 -16171 -20454 7046 21348 -6547 36354 79625 45322 20827 28719 29659 27482 52962 94942
13659 94942 62198 33244 90956 69658 -6690 -83379 -53290 -920 19113 66151 51720 29357
13647 29357 10170 20986 31622 21463 10625 22131 11964 -1073 30086 70948 104253 97687
13635 97687 61484 20467 1762 34126 25872 -26367 -8292 22619 43076 64509 56744 21152
13623 21152 20600 17292 45386 48436 34972 49954 77604 56937 62198 74310 62890 32897 30500
13610 30500 23335 22046 28888 43253 27408 27069 3459 10240 24785 -1978 2942 43990 52444
13597 52444 46940 59007 37729 32418 -8641 -38414 -88437 -73213 -69750 -44301 -2635 -30201
13585c0201k4172L5556K4509K8038l7799l5901K8567k69K600l0615o5460M0586
13573f4561O0898q853k04J6188J100n1340K5770N4303J564J0455o031J2605P024
13560E8918j5452K333J7870p50n5867k6566j5031J2356k4858n56K7018l901j2169
13547c6655J6118M7344L6284k1259k8997k0512K6843J8693K2242J4884K3019k0320
13535G7684k7900q022n0997j1583K6833L2560R30K8076n518m4330k6355K0567
13523A1945L8598J8473r908j2225Q781q989k5513j5946j1157m495L1771K769m4649
13510b0545n2562j6356M0828K678L8040J8231M297j1201L6001j534k4621J6813
13498C0069M1913J5511N216k6064l28O483n9945j1637J51p870p946J9625k6100
$$ plain form
13585 -30201 -54373 -18817 5692 33730 -4069 -39970 -11403 -11672 -9072 -39687 -105147 -64561
13573 -64561 -3663 -12516 -12720 3468 4568 -46772 -21002 33301 34865 45320 39289 51894 58918
13560 58918 43466 45799 63669 62919 7052 -19514 -34545 -22189 -47047 -47603 -20585 -24486 -36655
13547 -36655 -20537 26807 63091 41832 12835 -7677 19166 37859 60101 74985 98004 77684
13535 77684 49784 41762 -9235 -20818 6015 38575 39505 67581 62063 17733 -8622 11945
13523 11945 50543 69016 59108 46883 55664 46675 21162 5216 -5941 -10436 21335 24104 -20545
13510 -20545 -73107 -89463 -48635 -45957 -7917 10314 14611 3410 39411 37877 13256 30069
13498 30069 71982 87493 92709 66645 66317 72800 12855 1218 1369 -6501 -14447 5178 -20922
13485b0922K7214K1084j5123L963k251m1655J517M4774K6432l0424n7642n735
13473d8768K1908O8417P017l1934m6918l2654J8722N0227Q55j745L4264j206K0197
13460E8382k0147j3492J5379J2099K0857m8762n5533J0486J7716j7531J0200J0511
13448A65J3233m978O499K3958K4532r064L4519l163k1647l3592l898m9132n0554
13435g3122K4970L6609O724P613l2988o514M4212j9028p447J5143M5087j8026
13423B3233n2944j9856k064P350m543n44R275k3087k943K1316K3859K3629K8304
13410C0985K0674j6586n8658n272J4428p199j1000P900J1312J9095K8234J7881
13398E1794K6897j0108n724k4313j0034j9660K6384j6789j3137l3125M808K8413
$$ plain form
13485 -20922 6292 27376 12253 16216 13965 -27690 -26173 18601 45033 14609 -43033 -48768
13473 -48768 -26860 41557 48574 16640 -30278 -62932 -44210 6017 6872 5127 39391 38185 58382
13460 58382 38235 24743 40122 52221 73078 24316 -31217 -20731 -3015 -20546 -10346 165
13448 165 13398 8420 14919 38877 63409 54345 88864 85701 64054 30462 26564 -22568 -73122
13435 -73122 -48152 -11543 -4819 2794 -30194 -36708 7504 -11524 -18971 -3828 41259 23233
13423 23233 -29711 -49567 -51631 -44281 -48824 -49368 -40093 -63180 -66123 -44807 -20948 2681 30985
13410 30985 51659 35073 -23585 -28857 -14429 -21628 -32628 -24728 -13416 5679 33913 51794
13398 51794 78691 68583 62859 38546 28512 8852 35236 18447 5310 -27815 -23007 5406
13386E406l5548k2443K0877j1330j1534L8030L2045J5966m9353m4037J5117M3248
13374c556R345r260k9670J1771M2860N1223m9715k9898O9488J8579j00j995q849
13361G0223K1458j9185l0096m2163r196L6178k3829m1667j13J2631L2882M2892
13349E0015J6896j3222j0077k0073o78L4363o638m3464J7364P9009l0852o1439
13337A1204o302R176L0511K0318J6349m5223k2478K2202q222k5311k375J0686
13325A0535o358J4559O877L6708L1960M702M0376K8764L0591J2531M6724M2170
13313C00139L5204q836J8647j0142q0854l3833k4727k0612l1171j1839K19n373
13301A26822m5473o887o019j7728J444K1252J3313J7994L3946k2977j3102J6914
$$ plain form
13386 5406 -30142 -52585 -31708 -43038 -54572 -16542 15503 31469 -17884 -61921 -46804 -3556
13374 -3556 5789 -3471 -33141 -21370 21490 72713 22998 -6900 62588 81167 81067 79072 70223
13361 70223 91681 72496 42400 237 -8959 27219 3390 -38277 -38390 -25759 7123 50015
13349 50015 66911 53689 43612 23539 22861 57224 50586 7122 24486 103495 72643 11204
13337 11204 4902 14078 44589 64907 81256 36033 13555 35757 27535 2224 -151 10535
13325 10535 4177 18736 25613 62321 94281 98983 139359 168123 198714 211245 257969 300139
13313 300139 335343 326507 345154 335012 254158 220325 195598 174986 143815 131976 132195 126822
13301 126822 81349 74462 68443 50715 52159 73411 86724 104718 138664 115687 102585 119499
13289A19499K0019j2553k104j6496J7309P661j2417K5251J4419m588J815j9059
13277A38756k3447M800n9025m9672k1826K0189O249R306J4977j4244K51K6544
13265E2858P72k0965n501J1411J1894J7904k9326j323j2838K7456K8119p065K2233
13252I5629L3481j6002j9078L8941J5774j2527l7699l5548j5538M3883M9088M7509
13240A87913N167k5167Q992J4481n5899l4103k0319m5214k817L8407M1271K8887
13228A41599p854M7679n904L543m7512j7862k1314j0953K2546M6455R546J0152
13216A70121k2722j6292J670l9322J7534L7732M476K333l91J4922M3494O7233
13204B80788M5899J0850N8653J32932K08128K75337L44121K75874K57111R6478
$$ plain form
13289 119499 139518 126965 124861 108365 125674 133335 120918 146169 160588 156000 157815 138756
13277 138756 115309 120109 61084 11412 -10414 9775 16024 25330 40307 26063 26314 52858
13265 52858 53630 32665 27164 38575 50469 68373 39047 37724 24886 52342 80461 73396 95629
13252 95629 129110 113108 94030 132971 148745 136218 98519 62971 47433 91316 140404 187913
13240 187913 193080 167913 176905 191386 135487 101384 81065 35851 33034 71441 112712 141599
13228 141599 133745 181424 175520 179063 131551 113689 92375 81422 103968 150423 159969 170121
13216 170121 147399 131107 132777 93455 110989 148721 153197 155530 155139 170061 213555 280788
13204 280788 326687 337537 396190 529122 737250 1012587 1356708 1632582 1889693 1986171
13194A986171j82718k35529j83230m5549p3468q1231l5484o8927j49157j49446
13184G81432o2501j2662Q674m0125o196K3495J2666P996j7397l8408m7389O044
13172F15629M589m0052o0852l0272k3893K946R205p584k6815M406K3065L8647
13160E09019N5252Q6111J35736J83464K78455L51807K77044R9428q7295l79321
13150A509700m23112k50992j61482q4040n8317o0726o7913m5173Q574K1985Q984
13139C97488j5284n8310l3263j791j966k9934j1086J2970j7530J7184j6260J7412
13127B59630j5524J7383j5005k7324J9318J7490j2969j4778j9106j2135l2263
13116A64717J1308M2354L3623L3076j244k7780k5074k7374m8845j6850M75k643
$$ plain form
13194 1986171 1803453 1567924 1384694 1339145 1265677 1184446 1148962 1080035 930878 781432
13184 781432 718931 706269 714943 674818 668622 692117 704783 712779 695382 656974 609585 615629
13172 615629 620218 580166 519314 489042 465149 468095 477300 469716 442901 447307 470372 509019
13160 509019 564271 650382 786118 969582 1248037 1599844 1876888 1976316 1889021 1509700
13150 1509700 1086588 835596 674114 590074 531757 471031 403118 357945 366519 388504 397488
13139 397488 382204 323894 290631 288840 286874 256940 245854 258824 241294 258478 242218 259630
13127 259630 244106 261489 246484 219160 238478 255968 242999 228221 209115 196980 164717
13116 164717 176025 218379 252002 285078 283834 256054 230980 203606 154761 137911 138386 135743
13104A35743n9479n3562L6587O6929M0797k5339k9413L5975k38j3767q812Q922
13092A34343J5331m451l545m3551j7219R203j912k1446L3009M8754K539k4026
13080A27029n1849j3278r283K1178j6437n438J1820J325J0709J588j350l5986
13068D0028n630K0658O932m9392k0234J2659j4191k7081l5906L8770N7182K5862
13056D9657L3151k353O946L5347p483j2478J6998l0816k443k1982J4310n03j9132
13043E9219J4288m388j6130R40j3442q20j8739l1879J6480J7669J3114k3294L7465
13030E0483L7244m1700n5178m6067L2659M7341M4878K7384p123R381l9528m229
13018E5545L8299l701N02j8839k329L5526P271L8235n1146o430N0373Q2464O3769
$$ plain form
13104 135743 76264 22702 59289 126218 167015 141676 112263 148238 148000 134233 125421 134343
13092 134343 149674 145223 141678 98127 80908 90111 88199 66753 99762 148516 151055 127029
13080 127029 75180 61902 52619 73797 57360 51922 63742 65067 75776 77364 76014 40028
13068 40028 34398 55056 61988 12596 -7638 5021 -9170 -36251 -72157 -33387 23795 49657
13056 49657 82808 80455 87401 122748 115265 102787 119785 88969 86526 64544 78854 78351 59219
13043 59219 73507 69119 52989 53929 40487 39667 20928 -10951 5529 23198 36312 13018 50483
13030 50483 87727 46027 -9151 -55218 -22559 24782 69660 97044 89921 99302 59774 55545
13018 55545 93844 90143 90645 71806 69477 105003 112274 150509 99363 92933 143306 225770 289539
13005B89539Q732M0907L3818N3706J2941o4379r9239o6531l6173J3058l99J1983
12993A97963N07j3094q855j9432n7171O36J3925M627J0117L6112j5801L2500p024
12980A75010j6992j8841R367J4686j2708L7352M5580J4512K4771K4669M0596K0180
12968C58182j5480L7341R6872M3006j7134o5213p7123n2383n1829n968L1157k709
12956B78719M59n600K1697r659r484l8933r1761k9476R0151K2448n3844m1449
12944A33268J2347M4944j0251L997K707J331J8786M3002l002J5054o731j1766
12932B43686m0187l6215j2658J5060L1931k8547k7136j3636K9194N640K8094P5187
12920B70413O0576K4967N4571L4388Q6983J51919K00199K66044L87993N50920
$$ plain form
13005 289539 298271 339178 372996 426702 439643 375264 276025 209494 173321 186379 185980 197963
12993 197963 198470 185376 176521 157089 99918 100554 114479 119106 129223 165335 149534 182034 175010
12980 175010 158018 139177 148544 163230 150522 187874 233454 247966 272737 297406 338002 358182
12968 358182 342702 380043 476915 519921 502787 437574 360451 308068 256239 250271 281428 278719
12956 278719 279178 273578 295275 285616 276132 237199 145438 115962 206113 228561 174717 133268
12944 133268 145615 190559 180308 184305 187012 188343 207129 250131 247129 262183 255452 243686
12932 243686 203499 167284 154626 169686 201617 173070 145934 132298 161492 167132 195226 270413
12920 270413 330989 355956 410527 444915 531898 683817 884016 1150060 1538053 2088973
12910B088973O21368M80406J67179k30204o53667o55525m19508k81148k12504
12901I05370r7212j09988p4198o4967q4337j1678l7363j6747K2451J7392k6944
12890D21779L314J7027J1603O3922O3643L2321j191m907n5957p881k8520k1034
12878D94119J5189k3751l1760O520K6093J3248J9546j3255j9704l227K3432m037
12866E02413k1996j719L6801K4269M6781M4391L4917N0999K2795K764k9558k5853
12854F87004R789j8220n4958n4494j3395j633J1997Q618K2475j5173j0363k9455
12842E42192O4652J55957K37601L46848L76366K47557K24429L544k89908l01202
12832A608036j84524p1999P5832J79141K00042K31482J82430J3515j65903j19007
$$ plain form
12910 2088973 2710341 3190747 3357926 3127722 2474055 1818530 1399022 1117874 905370
12901 905370 808158 698170 623972 559005 474668 462990 425627 408880 431331 448723 421779
12890 421779 425093 442120 453723 517645 581288 613609 612418 607511 551554 543673 515153 494119
12878 494119 509308 485557 453797 460317 486410 499658 519204 505949 486245 483018 506450 502413
12866 502413 480417 478698 515499 539768 586549 630940 665857 716856 739651 742415 712857 687004
12854 687004 696793 678573 623615 569121 555726 554093 566090 574708 597183 582010 571647 542192
12842 542192 606844 762801 1000402 1347250 1723616 1971173 2195602 2199146 1909238 1608036
12832 1608036 1423512 1351513 1427345 1606486 1806528 2038010 2220440 2233955 2068052 1949045
12822A949045L3834J01419J22124J31873J52054J77924K00561K33941J96913J88266
12812C487954J36159q600q0338N7483K93866N73733Q72413J350940K120633L578393
12802A2382636N631167P045738O355630L985906p9059o941751r003608n710839
12794A3665820l056395j733418j033822o48584m19966l78965k63252j41337L0206
12785F020287Q2608K83916M09935M88389O36480P21117P75897R47044J154289
12776A1519962J299172J581013K123929L004659M369169O769204J0668359J6350956
12768E7686423K2857933K6909577K6302320K2003108J2232168j072145o429943
12761A60489441p593757j4726033k6804752k8606091k0213081j2430186p878123
$$ plain form
12822 1949045 1982879 2084298 2206422 2338295 2490349 2668273 2868834 3102775 3299688 3487954
12812 3487954 3624113 3615513 3535175 3592658 3886524 4460257 5332670 6683610 8804243 12382636
12802 12382636 18013803 25059541 31415171 35401077 35322018 28380267 19376659 13665820
12794 13665820 10609425 8876007 7842185 7193601 6773635 6394670 6131418 5990081 6020287
12785 6020287 6102895 6386811 6796746 7285135 7921615 8642732 9418629 10365673 11519962
12776 11519962 12819134 14400147 16524076 19528735 23897904 30667108 41335467 57686423
12768 57686423 80544356 107453933 133756253 155759361 167991529 166919384 160489441
12761 160489441 152895684 138169651 111364899 82758808 62545727 50115541 42237418
12754D2237418n387521l918826l085072k544178k087652j672562j338175j069131
12746B1134301q14794p44705p12087n87713m91192l30428k48273k09349j77946
12737A6817814j24999j40158p4074P9132J32056K07244L21715N49001Q49508J265408
12727A9882647J801711K436368L197359M154405N459930P297424J0874102J7832952
12719G2936898L0084497M8914415O7927067P1140669N3013324K0167782l9468082
12712C24716570r1082213p7303358m4664519k4753036j4704211r466561o910713
12705E5831959n616238m419112l443504k753952k327232k154051k158592j989221
12697C0970057j677076j407237j229678j058326p81268n17943l63846k99389l07318
$$ plain form
12754 42237418 36849897 32931071 29845999 27301821 25214169 23541607 22203432 21134301
12746 21134301 20319507 19574802 18862715 18275002 17783810 17453382 17205109 16995760 16817814
12737 16817814 16692815 16552657 16478583 16557715 16689771 16897015 17218730 17767731 18617239 19882647
12727 19882647 21684358 24120726 27318085 31472490 36932420 44229844 55103946 72936898
12719 72936898 103021395 151935810 219862877 291003546 344016870 364184652 324716570
12712 324716570 233634357 156330999 111666480 86913444 72209233 62742672 55831959
12705 55831959 50215721 45796609 42353105 39599153 37271921 35117870 32959278 30970057
12697 30970057 29292981 27885744 26656066 25597740 24816472 24298529 23934683 23635294 23327976
12688B3327976m20472n41319n70554n44626m68819l39374k08876o9595l246r0427
12678B0070668n04240q90244j272662j381600j017912p96396o74271n06203m76444
12669A2550696m60366m51469m01650l61642l60059l09239k32208k26232k32246
12660I515585k76170k36286k28960j83453j73352j61025j87693k14072j88832
12651G665742j42053r2668o5868m5898k9028n922M1575J05636K47231M20296N63369
12640H662412O88344O82349M16432m3644n85082j083656j086449p91467n12543
12631F346696l67324l46173k86925k65343k45794j92207j64021j54137n2588r6045
12621D176139o5673O797l8355q4887r7201p3700o4811j14735j20069p4030m8944
$$ plain form
12688 23327976 22907504 22366185 21795631 21251005 20782186 20442812 20233936 20164341 20161095 20070668
12678 20070668 19566428 18676184 17403522 16021922 15004010 14207614 13533343 13027140 12550696
12669 12550696 12090330 11638861 11237211 10875569 10515510 10206271 9974063 9747831 9515585
12660 9515585 9239415 9003129 8774169 8590716 8417364 8256339 8068646 7854574 7665742
12651 7665742 7523689 7431021 7365153 7319255 7290227 7284305 7325880 7431516 7678747 8099043 8662412
12640 8662412 9350756 10033105 10449537 10405893 9820811 8737155 7650706 6859239 6346696
12631 6346696 5979372 5633199 5346274 5080931 4835137 4642930 4478909 4324772 4272184 4176139
12621 4176139 4110466 4117263 4078908 3994021 3896820 3823120 3758309 3643574 3523505 3449475 3400531
12610C400531n7258m0767J2345m1645n8473L0603J31894J51690J43982J54079
12600C826981j0612k29865l51854k60085j52778j19038r6836m5517N2006O7285
12590B679687J07880J03033Q2083l9973j44850j79500j59973r1211q3281k7044
12580B246851k7478j08619j06166n1489p7219j29712j10337m9596K1952J7323
12570A625510k9031k4026n8500k8969k1046k2159k0177j5819M2635Q34m3190k4209
12558A381853R746j2695k9159J1249j7454l5361j2781k5698n2966l4212m6300
12547A136222k4991m8740r931L6785o219o4615n2535K0990l3401m0270M1972L4305
12535I89572k8849m6441J675K9848L8144K9691K3139K738l1301j45986j39555
$$ plain form
12610 3400531 3343273 3302506 3314851 3273206 3214733 3245336 3377230 3528920 3672902 3826981
12600 3826981 3816369 3586504 3234650 2974565 2821787 2702749 2605913 2560396 2612402 2679687
12590 2679687 2787567 2890600 2972683 2932710 2787860 2608360 2448387 2357176 2273895 2246851
12580 2246851 2219373 2110754 2004588 1953099 1875880 1746168 1635831 1586235 1608187 1625510
12570 1625510 1596479 1572453 1513953 1484984 1463938 1441779 1421602 1405783 1448418 1449252 1406062 1381853
12558 1381853 1391599 1378904 1349745 1360994 1343540 1308179 1295398 1269700 1216734 1182522 1136222
12547 1136222 1111231 1062491 1052560 1089345 1083126 1018511 965976 986966 953565 913295 955267 989572
12535 989572 960723 914282 915957 945805 983949 1013640 1036779 1039517 1008216 862230 722675
12524G22675q4484l3374M3434M2761l7218k6279K1622o526O079K2895K8897P422
12512G07904K5494k5060l458R0155J79904J14554J00819J03323l5346j48517j84599
12501I25173q8385j5378n2104q5465l6976n4445m0189K7943J8807N838o8803m4984
12489D91032j1013J6387m5337m0752L29p508N9705r860n834P1340j3550j5537
12477D89402O1174J9884O8567J35481Q0000P9041m568j18962j51613o0395m2470
12466E55541m8798l1625L3110L9316l5565k5210K2761j5543k9754j9916j5974
12455D28343j5684j3367j2244j3906K4189L5176k8812m5355J3637j0177o7053
12444B94747q380N3186J0568L8721j0527k9830k4746l3914k050J2706Q795j0021
$$ plain form
12524 722675 638191 604817 648251 691012 653794 627515 649137 642611 648690 671585 700482 707904
12512 707904 733398 708338 704880 795035 974939 1089493 1190312 1293635 1258289 1109772 925173
12501 925173 836788 821410 769306 683841 646865 592420 552231 580174 598981 604819 536016 491032
12489 491032 480019 496406 451069 410317 410646 403138 462843 452983 447149 518489 504939 489402
12477 489402 550576 570460 639027 774508 854508 933549 928981 810019 658406 598011 555541
12466 555541 506743 475118 508228 547544 511979 486769 509530 493987 464233 444317 428343
12455 428343 412659 399292 387048 373142 397331 432507 403695 358340 371977 361800 294747
12444 294747 286367 339553 350121 388842 378315 348485 323739 289825 287775 300481 309276 299255
12432B99255j709J8313j1618r521j8305m7242N569J7015N3353L9333q240j3155
12420C23048J4254N8024k3068J2124j5727m965m3460j0377J2761o999n4081n9294
12408B02240Q631r137J6414L9701P568k9909K7942R794k3065j3021J590K1323
12396B60071R886n2558o153L6636j4269o0661l0598M0174k0197O734j916M4752
12384B11901O1028o908r3965p7087K9374M5596K5868l324j9336Q955q66l2597
12372A48639K1126k2070j427K5698O384j7513j5671J132L6201K6132m1754J0006
12360A76883L1320k980l9498m478L0167J9817K6017J8067L8935J4514k5227j1661
12348B71876n0373k7112r487L8985k2507K2337N3468J3209K2590j497J1971L4478
$$ plain form
12432 299255 297546 315859 304241 294720 276415 229173 234742 251757 305110 344443 336203 323048
12420 323048 337302 395326 372258 384382 368655 363690 320230 309853 322614 315615 261534 202240
12408 202240 210871 201734 218148 257849 265417 235508 263450 273244 250179 237158 238748 260071
12396 260071 269957 217399 211246 247882 233613 172952 142354 182528 162331 169065 167149 211901
12384 211901 272929 266021 172056 94969 124343 169939 195807 192483 173147 182102 181236 148639
12372 148639 169765 147695 146268 171966 178350 160837 145166 146298 182499 208631 166877 176883
12360 176883 208203 205223 165725 161247 191414 211231 237248 255315 294250 308764 283537 271876
12348 271876 221503 194391 184904 223889 201382 223719 277187 290396 312986 311489 323460 357938
12336C57938N8719J07259J57177J25134J59826P3043K6884k9012n3391p7600j29871
12325G76106j91175j64404j08527L307k4526j603M9003m2404o3518j1667l4351
12314A86241k3208K1208L6880l779k5045q926M7433K8616N225J201k8633m1911
12302A95302J3815M0750O400K9207k6720n2893j1609k966J2390j7263j5423J3237
12290A84227K2253j1870J1742k2310J9689J1238o129M0402j4538N754J1737J5588
12278B67783K5857N6767Q3815J03600Q7676J72096K56715L53601L30489J69092
12268A907491p5372l26233m16349l06806j69154j03187j08902m4459j8846q538
12258C29645l5059n7437j9578P431j5596L0800j007k7041O6704R874j0743l4665
$$ plain form
12336 357938 416657 523916 681093 806227 966053 1039096 1065980 1036968 983577 905977 776106
12325 776106 584931 420527 312000 315307 290781 289178 338181 295777 232259 220592 186241
12314 186241 163033 184241 221121 217342 192297 183371 230804 259420 264645 265846 237213 195302
12302 195302 209117 249867 256267 285474 258754 205861 194252 191286 203676 186413 170990 184227
12290 184227 206480 194610 206352 184042 203731 214969 208840 249242 234704 240458 252195 267783
12278 267783 293640 350407 434222 537822 625498 797594 1054309 1407910 1738399 1907491
12268 1907491 1832119 1505886 1089537 782731 613577 510390 401488 357029 338183 329645
12258 329645 294586 237149 217571 225002 209406 240206 239199 212158 278862 288736 277993 243328
12246B43328l8702M3832N9726J0136q3705P51K1523j2360l5015J3601j9334n529
12234A98252J617Q8259j521k1180k3226k8809J5478j5210K1650K128l8851L979
12222B02566n02K9730J5278M3611P0861n095o5320l3463k2312N608r382l4211
12210A97369L6834K5073N6814M2947L4501J7694j8106O2235R9130J11467J41433
12199H07391J63801K29503K32609J60197Q1920L148r0856j60770j89632j84697
12189A052614j76533j32094r8524j00969n5314n5478l4059j6906k0948L728k1555
12178C43962j1473J8922K4996m5999n2262k1896k1171l835O736k3189k1177q110
12166A85504J2688o323M566R220m073j1770q658L4768J6290k1918l9103p916m906
$$ plain form
12246 243328 204626 248458 308184 318320 234615 235366 256889 244529 209514 223115 203781 198252
12234 198252 199869 288128 286607 265427 242201 213392 228870 213660 235310 237438 198587 202566
12222 202566 202064 231794 247072 290683 361544 356449 291129 257666 235354 240962 231580 197369
12210 197369 234203 259276 316090 359037 393538 411232 393126 455361 554491 665958 807391
12199 807391 971192 1200695 1433304 1593501 1675421 1678569 1587713 1426943 1237311 1052614
12189 1052614 876081 743987 645463 544494 489180 433702 399643 382737 361789 365517 343962
12178 343962 332489 351411 376407 330408 278146 256250 235079 231244 237980 214791 193614 185504
12166 185504 198192 191869 196435 205655 201582 189812 181154 215922 232212 210294 171191 163275 158369
12153A58369K8737k5307m131r03J9056M710J1144n164j0941m3209p659j9528k8894
12140G6280K9020M7111k3961m477J7033L204N1282O0498J1873j7670m9686l9068
12128A61439L709L1024M8748k3702m3776l1216L5603J3923K5447K8622l5241k4213
12116A90367K891K539m0920l3785P380o395K7218L6561j9104j5949j703l0792
12104A18308l158K5955j7465m4825n1515l217K3488M3893L4373j0280L372L7708
12092A56637j5445m1907j4380l433j6003k9916k687J7133J8808J0240N7427L3493
12080A69967l6217o4583j8176Q422l8233J2084L9382N766j0771K5010L9436L4273
12068A66360m226n921l45k6245k2780k0413j0241R647o50r750K898q185o551l0108
$$ plain form
12153 158369 187106 161799 157668 156765 175821 180531 191675 186511 175570 132361 124702 105174 76280
12140 76280 105300 152411 128450 123973 141006 144210 195492 255990 267863 250193 200507 161439
12128 161439 165148 196172 244920 221218 177442 146226 181829 195752 221199 249821 214580 190367
12116 190367 193258 195797 154877 121092 128472 122077 149295 185856 166752 150803 149100 118308
12104 118308 115150 141105 123640 78815 27300 24083 47571 91464 125837 115557 118929 156637
12092 156637 141192 99285 84905 81472 65469 35553 32866 49999 68807 79047 136474 169967
12080 169967 133750 69167 50991 59413 21180 33264 72646 78412 67641 92651 132087 166360
12068 166360 162134 156213 155868 129623 106843 86430 76189 85836 85186 75436 78334 70149 63598 33490
12054C3490k2996J2612N215l2626l2706J7308L7009M1372L1709j1956j1572k3007
12042D3852L6973J8931m9852m2080J5831J9945M3044L782K0111k563M4903k0493
12030A32384j1072M8684J4580O782p626J4460k4533n0710J4612O5776O6358Q1272
12018C50967N1248Q2985J22258J24709N9630L6537j8644n5935r1892q7106j03003
12007D71754j24108m4259k1316k6603j0014J4106o9340j8502J6955O85l2437j1517
11995A45404k890j1531J7892k4726r926J0124j3715J646K5634O9697P7228J6040
11983C00877L0852R920m8774j22185n7052j561k537l0094p716K0494j5907L8433
11971A14750n709q569n346J1741Q700j3062n3984O053l536L3248O9336r682l684
$$ plain form
12054 33490 10494 23106 28321 -4305 -37011 -19703 17306 58678 90387 78431 66859 43852
12042 43852 80825 99756 49904 7824 23655 43600 86644 90426 110537 107974 152877 132384
12030 132384 121312 169996 184576 191358 183732 198192 173659 122949 137561 203337 269695 350967
12018 350967 402215 485200 607458 732167 791797 828334 809690 753755 661863 574757 471754
12007 471754 347646 303387 282071 255468 245454 259560 190220 171718 188673 189358 156921 145404
11995 145404 142514 130983 148875 124149 114223 124347 110632 112278 137912 207609 284837 300877
11983 300877 331729 341649 292875 170690 113638 112077 109540 79446 71730 92224 76317 114750
11971 114750 109041 100472 95126 106867 115567 102505 48521 54574 51038 84286 153622 143940 140256
11958A40256m032l3162J494j724k6297k8170L9088L1054j2243k1506K5150L1704
11946A41612P97O2799Q3131J28259K03613K43898J53514O5832r0003k77124k52832
11935D63496j04688j01648q1273k4994L915k4045l3331l1238J109L514N212J6007
11923I2036M893n098J2753P397j6037K3337O1199J0426l4678k9248j2129j1514
11911A03337Q252n221M203j0822J033K0326J241j8200K1007J55L166k5934l4737
11898F7806j7106L2367k1084j2504k934J2490m957K154l1486q64k1077p163K8610
11885B4252K8343k8410j1743m291J2877J1980K7613k5777n4324R43K7902J0117
11873A9482K6182p477l8103m0876J2546O4604l3831k582m508m636M2616k091j2255
$$ plain form
11958 140256 136224 103062 104556 102832 76535 48365 87453 118507 106264 84758 109908 141612
11946 141612 142409 205208 288339 416598 620211 864109 1017623 1083455 993452 716328 463496
11935 463496 358808 257160 175887 150893 154808 130763 97432 66194 67303 70817 76029 92036
11923 92036 96929 91831 104584 111981 95944 119281 180480 190906 156228 126980 114851 103337
11911 103337 111589 106368 110571 99749 100782 121108 122349 104149 125156 125311 128477 102543 67806
11898 67806 50700 83067 61983 49479 46545 59035 54078 56232 24746 23882 2805 -4358 24252
11885 24252 52595 24185 12442 8151 21028 33008 60621 34844 -19480 -18537 9365 19482
11873 19482 45664 38187 84 -40792 -28246 36358 2527 -55 -4563 -9199 33417 31326 19071
11860A9071j7464l5336O552K8151J3193R206L885m697n569J7673m6739o4670M0773
11847c5971N8960N029m3677L979k5263K2432J9723k555J3943K4204J6108K6429
11835H3341k5173l5789l5697k9717K8497j5095j5552o625K5336j8279m3062J8980
11823f8835M5522M2721K0297l6886j6483J1649k6211k0752M1519K2338j1310j4249
11811a0680k6371j884N3533r852K9170L0930k0056k4884j2573K892J3792K0085
11799D4102K9259l5417n2565K5644q599j2521K6730M4294K5177l4302l4405R89
11787A8386J3512j1378k916k0531n7991j6852J7444J1972K2542M3791k3269L1251
11775B5961K1801j3486k4509k7954j0499M2503p625J2764k275l2869k8851K1847
$$ plain form
11860 19071 1607 -33729 -27177 974 14167 23373 27258 22561 16992 34665 -12074 -76744 -35971
11847 -35971 22989 28018 -15659 -11680 -36943 -14511 5212 2657 16600 40804 56912 83341
11835 83341 58168 22379 -13318 -43035 -14538 -29633 -45185 -51810 -26474 -44753 -87815 -68835
11823 -68835 -23313 19408 39705 2819 -13664 -2015 -28226 -48978 -7459 14879 3569 -10680
11811 -10680 -37051 -38935 14598 4746 33916 64846 44790 19906 7333 10225 24017 44102
11799 44102 73361 37944 -14621 11023 2424 -10097 16633 60927 86104 51802 17397 18386
11787 18386 31898 20520 17604 -2927 -60918 -77770 -60326 -48354 -25812 17979 -5290 25961
11775 25961 47762 34276 9767 -18187 -28686 13817 6192 18956 16681 -16188 -45039 -23192
11763b3192M3295J5946m4597k1368K8134n670L3442M72m4401k0526j0216l4246
11751h2927q171K3834o611J5755N2934K0410p062J6891n132k0703J6028k0344
11739e098j7710L173L1461m66m6331n427N250K6275N096j8619k1748L0428P054
11726f662J4918L2078M517k5866J0470m122k4444j0119n300K6342L9570j1839
11714C9543J5342J7570p322r451k8857J222K2391K753j7175l0986j5450J494J5786
11701F860K1108K2606n049k070j688o512K5020k6557m0579J7828p225L132k6069
11688a9195l062J3890n860J1847N335p255P341K6252k30n2963M8366K2137N911
11675E2514k9839M4431k4115n5328J8570l484p161k7791j3378r519J6982K7423
$$ plain form
11763 -23192 20103 36049 -8548 -29916 -1782 -7452 25990 26462 -17939 -38465 -48681 -82927
11751 -82927 -91098 -67264 -73875 -58120 -5186 15224 8162 25053 19921 -782 15246 -5098
11739 -5098 -22808 -19635 11826 11360 -34971 -40398 -35148 -8873 -3777 -22396 -44144 -13716 -6662
11726 -6662 8256 40334 44851 18985 29455 25333 889 -9230 -14530 11812 51382 39543
11714 39543 54885 72455 65133 55682 26825 28047 50438 53191 36016 5030 -10420 -8926 6860
11701 6860 27968 50574 45525 43455 41767 35255 60275 33718 -6861 10967 3742 6874 -19195
11688 -19195 -22257 -8367 -14227 -2380 2955 -4300 3041 29293 29063 -23900 24466 46603 52514
11675 52514 22675 67106 42991 -12337 6233 2749 -4412 -32203 -45581 -55100 -38118 -10695
11663a0695J1620m593L702l191J9566M4136K59p202k4579M785k571k630j1830
11650A6777j734m269N011k2187K6752K7008N204L3538K3033k7366k4088j2855
11638D4824k6233L9160K2455r111k2191r585M26K0259K0789m16l1774l3186q266
11625G151J8751n391l6309j4975K6019O476j5278K116K2944j7024j7164K8261
11613E577j225l1473k1013K5633N2185J8020k4245K7266K5650m6209m6673Q605
11601g902L679P493P951Q770L9230j9436J0430l979k7977j0543r661O261J0432
11588A4748k3529J766L41l288p188j5821j1262j199L0563K0202L844L809m310
11575H676K722k8594J3759J000m0114N578L6383R563R949j3250k5012K5349J8190
$$ plain form
11663 -10695 925 -3668 34 -3157 16409 60545 60804 53602 29023 33808 31237 28607 16777
11650 16777 15043 10774 15785 -6402 20350 47358 52562 86100 109133 81767 57679 44824
11638 44824 18591 57751 80206 71095 48904 39319 39745 60004 80793 80377 48603 15417 7151
11625 7151 25902 20511 -15798 -30773 -4754 1722 -13556 -11440 11504 -5520 -22684 5577
11613 5577 4352 -27121 -48134 -22501 29684 47704 23459 50725 76375 30166 -16507 -7902
11601 -7902 -4223 3270 11221 19991 59221 39785 50215 46236 18259 7716 -1945 4316 14748
11588 14748 -8781 -7015 -6674 -9962 -17150 -32971 -44233 -45432 -14869 5333 9177 12986 8676
11575 8676 11398 -17196 -3437 -2437 -42551 -36973 -590 8973 18922 5672 -19340 6009 24199
11562B4199M2738J3421N273r235K0461n1572o0007L825O1143j9023n8742l7336
11550f4855R070J8104n875J0740L8435K1932J629J4518j4446m2655j0937K6581
11538B241j2222k6083j3440j7132L8019M2571K783m5660n9413J5305L3041j2103
11526e2093k8121M0841K8023n949q248K2312n515K094R857M726K3038j8384n9686
11513d7105K6191K2868O244q67l3225L959m2300k200O2828J7785j0659n887L2158
11500B9790J1671l2196J4201R872k6318j6695L4162J9439r353k6907k7887L2256
11488A2035n518o1229L5286J8467l5929l3714j4717R083K8461K3892J1304k2035
11476c4614j9415J6916K3953n481J5229k6174m695P952l7403k1553N2500O0743
$$ plain form
11562 24199 66937 80358 85631 76396 96857 45285 -14722 -10897 50246 31223 -27519 -64855
11550 -64855 -55785 -37681 -43556 -32816 5619 27551 29180 43698 29252 -13403 -24340 2241
11538 2241 -9981 -36064 -49504 -66636 -28617 13954 16737 -28923 -88336 -73031 -39990 -52093
11526 -52093 -80214 -39373 -11350 -17299 -25547 -3235 -8750 -6656 3201 7927 30965 12581 -47105
11513 -47105 -20914 1954 8198 7331 -25894 -21935 -64235 -66435 -3607 14178 3519 -2368 29790
11500 29790 41461 9265 23466 33338 7020 -9675 24487 43926 34573 7666 -20221 12035
11488 12035 6517 -54712 -19426 -959 -36888 -70602 -85319 -76236 -47775 -23883 -12579 -34614
11476 -34614 -54029 -37113 -13160 -18641 -3412 -29586 -34281 -26329 -63732 -85285 -32785 27958
11464B7958K2645K7564l2226m5068l478n6346k8188l364L0826K8469O992q326
11452c2542K758M1060l936k501k2440Q561j531N6497Q2604j043p6740o0463k8118
11439c7834K2947R0783K5608n2207n8195j9400K7603O6139l4601J8753n608j3327
11427C0661p166M926O733l2030k3884K5843o2931L4346M6797m4471j6907L6476
11415a607J0242K0477j4429K0904j0681l3875l9598M3309K2039l7105J1917n165
11403a3572L286M873o552K640Q533M4388q866m2696m4770K5094M1455J2630j9678
11390F765j1282K729R574k1196j5119l5033K4420q732N77k4617J0075N4705P2096
11377F4962l5012n8980p489J1613J549K6899n4118k8394J1831J2644K1736O951
$$ plain form
11464 27958 50603 78167 45941 873 -2605 -58951 -87139 -90503 -59677 -31208 -24216 -32542
11452 -32542 -29784 11276 7340 4839 -17601 -9040 -10571 45926 128530 127487 50747 -9716 -37834
11439 -37834 -14887 75896 101504 49297 -8898 -28298 -695 65444 30843 49596 43988 30661
11427 30661 23495 28421 35154 3124 -20760 5083 -57848 -23502 23295 -21176 -38083 -1607
11415 -1607 8635 29112 14683 35587 24906 -8969 -48567 -5258 16781 -20324 -8407 -13572
11403 -13572 -10286 -5413 -11965 -9325 -792 43596 34730 -7966 -52736 -27642 13813 26443 6765
11390 6765 -4517 -1788 7786 -13410 -28529 -63562 -39142 -47874 -47297 -71914 -61839 -7134 64962
11377 64962 29950 -29030 -36519 -24906 -23357 3542 -50576 -78970 -67139 -54495 -32759 -25808
11365b5808l6835M635L3165K724J3881o240j0409L5118q564n8260J3083K4484
11353a9026K2191q063k8168J7054M7318o735n0739j8007l2020J3686Q983M092
11341d9434j4279j2069L399n729L6286J6049K2426M5818k1921l2076L2573J235
11329B2278r65M6153j9875n3927M2233J9699J4464M8168K986l9848l3505l8182
11317I679j5539j5439j5561J814p56K0276M003j5752K0667J9294K7827j8080l724
11304A8709j2628j788K8175J4216J6507q030K2079M123m3390m0273J1927K8902
11292C8529N0766Q279p5155l1442O2638R561O958J6625L1735P2336J04879J34138
11280D29847J12726J06048J17417Q7053n4821r3222j16403j48399j33182j01624
$$ plain form
11365 -25808 -62643 -58008 -24843 -22119 -8238 -14478 -24887 10231 1667 -56593 -43510 -19026
11353 -19026 3165 -4898 -33066 -16012 31306 24571 -26168 -44175 -76195 -62509 -53526 -49434
11341 -49434 -63713 -75782 -72383 -78112 -41826 -25777 -3351 42467 20546 -11530 21043 22278
11329 22278 21313 67466 47591 -6336 35897 55596 70060 118228 121214 81366 47861 9679
11317 9679 -5860 -21299 -36860 -35046 -35802 -15526 -11523 -27275 -6608 12686 40513 22433 18709
11304 18709 6081 4293 32468 46684 63191 55161 77240 81363 37973 -2300 9627 38529
11292 38529 89295 97574 22419 -9023 53615 63176 70134 86759 118494 190830 295709 429847
11280 429847 542573 648621 766038 853091 798270 705048 588645 440246 307064 205440
11270B05440m1612j2795j3721k5426k3145L1967M0728k5941m5307o247p514J6072
11258I2499j0128j7587l0447J0163L5508k1618O549n729j9328k3173K1310n86
11246C7433l4953l7460j9875m523K5821J0709K2492O575r014Q072j7990m9661
11234f2374M5121M7854R314Q284K2859K5856j9759K479o394l1670l4863l0344
11222b3637J4608M3521l469j9353P507L279O976j4680K0072J8748k7026M557L3351
11209F4454J548n4831k5680j0075p089L4412J3344K489J1090j9626m5400J2365
11197b2999J0953k7J6255M8846M0984l0245j6876l6852K4820l245L083l9861n627
11184a0791K8644J913k5700K4141m252J6832M781O0590K1721k0746j8253m3651
$$ plain form
11270 205440 163828 151033 137312 111886 88741 120708 161436 135495 90188 83941 76427 92499
11258 92499 82371 64784 34337 44500 80008 58390 64939 59210 39882 16709 38019 37433
11246 37433 2480 -34980 -54855 -59378 -33557 -22848 -356 6219 -2795 5277 -12713 -62374
11234 -62374 -17253 30601 39915 48199 71058 96914 77155 79634 73240 41570 6707 -23637
11222 -23637 -9029 34492 31023 11670 19177 22456 29432 14752 34824 53572 26546 31103 64454
11209 64454 66002 11171 -14509 -24584 -31673 2739 16083 18572 29662 10036 -35364 -22999
11197 -22999 -12046 -12073 4182 53028 94012 63767 46891 10039 34859 31614 34697 -5164 -10791
11184 -10791 17853 19766 -5934 18207 13955 30787 35568 96158 117879 97133 78880 35229
11172C5229k3112J13836J62194J17634Q4106J01682J33598K0979j4621q0816o8333
11161E82376j17736r8013q7817n0063k2846k446Q162n6266m1271k2080J5179J0781
11149A17960m6155j21J0850q629J316J5605J2361j8634j8427j6323o2707j1293
11137b4197M5815p586J9000p289k7682J0400L4702J7231l7029l9796K962J278
11125a2191J9089l8140J0626L2233j4074j2379K1197n506r815K1461J2765l2192
11113f926j8993m15O918j0188R475J2539j8592j2228J1750P1799j1545j5986Q863
11100B6471k2841J8014j918l5743k1837M1205N572L799m2624J6172Q867M2144
11088C7281J7565L574m0404p417n6340m2003k512J4967J4389J1566N9904j194
$$ plain form
11172 35229 12117 125953 288147 405781 489887 591569 725167 746146 731525 650709 582376
11161 582376 464640 366627 278810 228747 205901 203455 211617 155351 114080 92000 107179 117960
11149 117960 71805 71684 82534 73905 75221 90826 103187 84553 66126 49803 -12904 -24197
11137 -24197 21618 14032 33032 25743 -1939 8461 43163 60394 23365 -16431 -13469 -12191
11125 -12191 6898 -31242 -20616 11617 -2457 -14836 6361 855 -8960 12501 25266 -6926
11113 -6926 -25919 -26334 -19416 -29604 -20129 -7590 -26182 -38410 -26660 45139 33594 17608 26471
11100 26471 3630 21644 19726 -16017 -37854 3351 8923 12722 -29902 -13730 -4863 37281
11088 37281 54846 58420 18016 10599 -45741 -87744 -90256 -75289 -60900 -49334 10570 9376
11076I376j6364q470n683P512J2959M985j5199J4718J63l9027J420P6298J6038
11063E8726p9326k8606j0031l4340O252M4261N8907L8111m8327j9044q828R641
11051a2604L303j7563J5442j4118m080J9095J9396M1241j8868l4689J5030J5674
11039B7259J9044k3247l2568J7323L932J6113K0307M4316j9450m9481k1264K766
11027E050k2365J6262L4585k8393j6725l2755j0576L2323r607M3602K1886m2556
11015i269L635N0380l8682p571j445k7857j3586O7121L8915l4796l2455j4319
11003a9929J9758k8565J989K9414K1968k857k1378p193k456N0893j2941R983l481
10990C5205j4905j2560l6644K1335L1042k6053j4021J7864J2785l9473Q120M5372
$$ plain form
11076 9376 -6988 -15458 -21141 -13629 -670 4315 -10884 3834 3997 -35030 -33610 42688 58726
11063 58726 -20600 -49206 -59237 -93577 -87325 -43064 15843 53954 5627 -13417 -22245 -12604
11051 -12604 -9301 -26864 -11422 -25540 -29620 -10525 8871 50112 31244 -3445 11585 27259
11039 27259 46303 23056 -9512 7811 11743 27856 48163 92479 73029 23548 2284 5050
11027 5050 -17315 -1053 33532 5139 -11586 -44341 -54917 -22594 -32201 11401 33287 -9269
11015 -9269 -5634 44746 6064 -1507 -2952 -30809 -44395 22726 61641 26845 -5610 -19929
11003 -19929 -171 -28736 -26747 2667 24635 21778 400 -6793 -9249 41644 28703 38686 35205
10990 35205 20300 7740 -28904 -7569 23473 -2580 -16601 1263 14048 -25425 -17305 28067
10978B8067J7095j3295l9310N859Q317o064l1648J244J094k888K4270J5533J0510
10965A8784J7427l735j3908K6832N252J3228k6102K20k8808l2032J6548j065m652
10952a2011J4135n0231M006j7979j9013n34L851M5047j4126l292L5218K3466n02
10939H035l8015o5734J0435P8050J2575n1436L574Q694j3891J9374K6994q380
10927i725k9200k9105r920l0213N3150O4080J7340j5258j7055q254o764m8049
10915f8973L9647N5432J6553j6041m7755k9891J72j1843l91L5893m242J6523L7002
10902B2086o273n7038M2941N4754m4331k7887K2083r232j0802m280j0420Q485
10890a9914P957j97M9825L9838j7680L012k4173j5137l3834J223L2325j0585m245
$$ plain form
10978 28067 45162 31867 -7443 -1584 6733 669 -30979 -29735 -28641 -31529 -7259 8274 18784
10965 18784 36211 32476 18568 45400 50652 63880 37778 37998 9190 -22842 -6294 -7359 -12011
10952 -12011 2124 -48107 -44101 -62080 -81093 -81627 -77776 -32729 -46855 -50147 -14929 8537 8035
10939 8035 -29980 -95714 -85279 -7229 5346 -46090 -42516 -33822 -47713 -28339 -1345 -9725
10927 -9725 -38925 -68030 -77950 -108163 -55013 9067 26407 11149 -5906 -14160 -20924 -68973
10915 -68973 -29326 26106 42659 26618 -21137 -51028 -50856 -62699 -63090 -27197 -31439 -14916 22086
10902 22086 15813 -41225 1716 56470 12139 -15748 6335 -2897 -13699 -17979 -28399 -19914
10890 -19914 -11957 -12154 37671 77509 59829 62841 38668 23531 -10303 -9080 23245 12660 8415
10877H415r899P185o99k1494J1601k7324K3486K2266j5095m443K8704K9390J4072
10864F6165o369k7562l5531k9890L037J4018k9683q391J7296P479M6518K1125
10852C8212p445R184k9174K3918N5630K1389P742O5329J3759j5271k6252o2015
10840I5006n2846n743K8087J8296j9108n072K4662k157k6174k8060M919k3850
10828G960O369k0397k1745j7170R351J6198J485J1216L4982j6037k7088M0094
10816B5218K260j2561l5103m739K3946L9467O1027N4080K3416l5740m1710l4266
10804F5295k1605k8240m3284j796L9152L0364l2089l3132L1926l666n3038N5207
10792E094J4619O94o85l1108m5034n0589J2425N097M8264M6010j4643r492K8550
$$ plain form
10877 8415 -1484 5701 5002 -16492 -4891 -32215 -8729 13537 -1558 -6001 22703 52093 66165
10864 66165 59796 32234 -3297 -33187 -30150 -16132 -45815 -54206 -36910 -29431 17087 38212
10852 38212 30767 39951 10777 34695 90325 111714 119456 184785 198544 183273 157021 95006
10840 95006 42160 36417 64504 82800 63692 58620 83282 81125 54951 26891 31810 7960
10828 7960 14329 -6068 -27813 -44983 -35632 -19434 -17949 -6733 28249 12212 -14876 25218
10816 25218 27478 14917 -20186 -24925 -979 38488 99515 153595 177011 141271 99561 65295
10804 65295 43690 15450 -27834 -29630 9522 39886 7797 -25335 6591 2925 -50113 5094
10792 5094 19713 20407 19722 -11386 -56420 -107009 -94584 -89487 -41223 4787 -9856 -19348 9202
10779I202J7309k4886O828J8327K1068n4056j6439L8633N1476L4013k4433m5702
10767C1340J2087j7759j6319k814o390m1441l2357P5981M9989k5840j646j2581
10755A2250M593K172j7871k6543l406K2991J4092n551m867L894l2979m27LJ5254
10741a6395P250L2441M3904p116L1298R0081J07094J06556Q2006L1667r4051j75203
10729B39532j02931o8117l5630o301M8548r413J085J8772k04Q892j5760p4025
10717D448m6229j2490L0592M6774p783l1641j2733Q370k6697J1759J6076L5928
10705A6374n46o7966j3408j1698l807K4013l4155k799L2885L5271J0160n249L8497
10692A7572L914l349J2159m857k3887N391R329p309J6023N459l6370k9882k3038
$$ plain form
10779 9202 26511 1625 8453 26780 47848 -6208 -22647 15986 67462 101475 77042 31340
10767 31340 43427 25668 9349 6535 145 -41296 -73653 2328 52317 26477 24831 12250
10755 12250 16843 19015 1144 -25399 -28805 -5814 8278 2727 -2140 1754 -31225 -31652 -31649 -16395
10741 -16395 -9145 23296 67200 60084 91382 181463 288557 395113 477119 508786 414735 239532
10729 239532 136601 68484 32854 26553 75101 65688 66773 85545 85341 94233 78473 4448
10717 4448 -41781 -54271 -23679 23095 15312 -16329 -29062 -20692 -47389 -35630 -19554 16374
10705 16374 15828 -52138 -65546 -77244 -81051 -57038 -91193 -93992 -61107 -25836 -15676 -20925 17572
10692 17572 21486 18137 30296 25439 1552 6943 16272 8963 24986 30445 -5925 -35807 -58845
10679e8845L0963j4663N428P7132L1464n4753m9297J090L9776N924J5913J5079
10667D5211J9930j2809k823m7400l8993k6972k8342L2181M6957J2910R479Q734
10655A8063J5792k9637j801K402L9702j1770k6373j3852l794J0008J1254j2511
10643b517Q248n101J97M3689M253n1938j6200l7066n0036l1429M0497P1595M9756
10630B3948M9771J2045m0693m6546m0090O779k0502O961L3598J2867j7752m625
10618b4239p070N2524k84r387j3780m3895L3889j355j0282J3399n418K0585j3018
10605h331k1788m228p836j3735K0868K1913J8620j3863m3367Q479K4207L5764
10593A6703K1355J0654m6078k1750J7825L3538n683n9528n1246K5317L9009L7277
$$ plain form
10679 -58845 -27882 -42545 -37117 40015 71479 16726 -32571 -31481 8295 14219 30132 45211
10667 45211 65141 52332 49509 2109 -36884 -63856 -92198 -60017 -13060 -150 9329 18063
10655 18063 33855 4218 2417 4819 44521 32751 6378 -7474 -11268 -1260 9994 -2517
10643 -2517 5731 630 827 44516 48769 -3169 -19369 -56435 -106471 -137900 -97403 -25808 23948
10630 23948 73719 85764 45071 -1475 -41565 -34786 -55288 -48327 -14729 -1862 -19614 -24239
10618 -24239 -31309 21215 20931 11544 -2236 -46131 -12242 -13597 -23879 -10480 -15898 4687 -8331
10605 -8331 -30119 -34347 -42183 -55918 -35050 -13137 5483 -8380 -51747 -43268 -19061 16703
10593 16703 38058 48712 2634 -19116 -1291 32247 26564 -32964 -84210 -58893 -19884 17393
10581A7393j3301M105N099P645J3965l9935m170q378J3913n0689j8166L9388R180
10568b3951j5221M8785R2K0890L3809m4442k2494k0013q722L1203M8300K7061
10556G5297k7696n1370m5164M4443N096j2950j2361R095j1437p302L9367L187
10544H205l6664N8466M7391j7997l006k5697J5290j5744r309M536K002K1080L6672
10531H5225j8717m1134j1336L3764j9555k8576J9718J7508J587k2687K9166k2076
10519B2887o5216K899J1006j9186k0573K2281L0120P946q435N265J1410k8714
10507b8310j588j014l1338L0419L6654j384j5469j8788k3431K5401R753J7288
10495a807J4491J5199p448r414Q678J9014J7823J7985p809n436l5805k9089j00
$$ plain form
10581 17393 4092 8197 13296 20941 34906 -5029 -9199 -17577 -3664 -54353 -72519 -33131 -23951
10568 -23951 -39172 9613 9705 30595 64404 19962 -2532 -22545 -31267 -64 48236 75297
10556 75297 47601 -3769 -48933 -4490 606 -12344 -24705 -15610 -27047 -34349 5018 8205
10544 8205 -28459 30007 77398 59401 56395 30698 45988 30244 20935 25471 27473 48553 85225
10531 85225 66508 25374 14038 47802 28247 -329 19389 36897 38484 15797 44963 22887
10519 22887 -42329 -39430 -28424 -47610 -68183 -45902 -15782 -7836 -16271 -11006 404 -28310
10507 -28310 -29898 -30912 -62250 -31831 4823 3439 -12030 -30818 -54249 -28848 -19095 -1807
10495 -1807 12684 27883 20435 11021 19699 38713 56536 74521 66712 61276 25471 -3618 -3718
10482c718P287L1450j3815k3002L858j0199k001K6892r747k6647l0972j6432K7043
10469d0003J6309m1318m8336L6994O1624j7458k1600j3658J7769Q95L5653K6054
10457A2925j0901j8542K2025K0140k9639l8248J0894K4596Q714j0655M2012L3987
10445F7308j4670j7102l39j3589o391j3596k8324l0262k9525J4506j212j4773
10433h7969N300K3714L8039j6389k8675M2751J4586m4854m6936k3720L7022J6572
10421g0559P2l558M0465P0532L6327m0135Q917K8184O385j7000n592L0143Q958
10408I3139k9535k5931J9572r20k9184n2605l7101l0469Q282M0849K7181J4682
10396b040j9692K1641K6747j4694j9553J0363J0319M604j8278L2287j4302k9945
$$ plain form
10482 -3718 3569 35019 21204 -1798 2060 -8139 -10140 16752 7005 -19642 -50614 -67046 -40003
10469 -40003 -23694 -65012 -113348 -76354 -14730 -32188 -53788 -67446 -49677 -48782 -13129 12925
10457 12925 2024 -16518 5507 25647 -3992 -42240 -31346 -6750 1964 -8691 33321 67308
10445 67308 52638 35536 35197 21608 15217 1621 -26703 -56965 -86490 -71984 -73196 -87969
10433 -87969 -82669 -58955 -20916 -37305 -65980 -23229 -8643 -53497 -100433 -124153 -87131 -70559
10421 -70559 -70487 -74045 -33580 36952 73279 33144 42061 70245 76630 59630 54038 84181 93139
10408 93139 63604 37673 57245 56325 27141 -25464 -62565 -93034 -84752 -43903 -16722 -2040
10396 -2040 -21732 -91 26656 11962 -7591 2772 13091 17695 -583 31704 17402 -12543
10384a2543o5833J3962j3003j2365L7493L0891J5174n930k6391M3419k2214j8271
10372c5611L9487N2685j9570k0646j1528K6041J222J0554j2116K975J388m1417
10360f536J0527K8080K7157J3123j3832J5830l4780k5360N2030K4814J595j598
10348I1050K7299Q1463R5035Q8570J15166R0947R8026J09966J63093J12508K5299
10337A098422J6178R076l7736j12772j31419j15502r4579q9854j13297n9974m8484
10326C20059q8079m1157P358j2967m9460j8481O555m2465n4839j4194j2598o166
10314f434K6838K994M6052K5983J9945k156P620k717p741J7140j4232j1380j8692
10301H3220l3332j726K5127Q608N404o390o354k3739m4904o724M2707K2336k8671
$$ plain form
10384 -12543 -78376 -64414 -77417 -89782 -52289 -21398 -6224 -12154 -38545 4874 -17340 -35611
10372 -35611 3876 56561 36991 16345 4817 30858 32080 42634 30518 33493 34881 -6536
10360 -6536 3991 32071 59228 72351 58519 74349 39569 14209 66239 91053 92648 91050
10348 91050 118349 199812 294847 383417 498583 589530 687556 797522 960615 1073123 1098422
10337 1098422 1114600 1123676 1085940 973168 841749 726247 631668 541814 428517 368543 320059
10326 320059 231980 190823 198181 185214 135754 117273 123828 81363 26524 12330 -268 -6434
10314 -6434 20404 23398 69450 95433 115378 113222 120842 118125 110384 127524 113292 101912 83220
10301 83220 49888 48162 73289 81897 87301 80911 74557 50818 5914 -810 41897 64233 35562
10288C5562l3251J498q968k7631O771m096o625L1466J7417K2177P076n606Q694
10275D4484Q366j2834L661q752m6105M190J1985K1511l462n5496L0706N9272J4853
10262G2379L052k7382l6629l4122J8107M2106K7985L8301k1016m5205m8844m4166
10250e5434k6059L9116M5405K1887j1083J740K0431K6645k6810o961J144K376
10238C2397K1699R32K2747J7442m921k9159l2018n11M1348n0461k801k145n3200
10225c8651q396J8051M2288j188j0506K5834M2076o903l250J0913J3580j8185
10213F5663k7144m6011Q239J827K7966J3874K331K046l4675j5955K6750l2452
10201g541k2691P440M0357R372L6521J0702M552J4619j5020R503k3398J1704P0177
$$ plain form
10288 35562 2311 3809 -5159 -32790 -26019 -30115 -36740 -5274 12143 34320 41396 35790 44484
10275 44484 52850 40016 43677 34925 -11180 -6990 4995 26506 23044 -32452 -1746 57526 72379
10262 72379 75431 48049 11420 -22702 -4595 37511 65496 103797 82781 37576 -11268 -55434
10250 -55434 -81493 -42377 3028 24915 13832 15572 36003 62648 35838 28877 30021 32397
10238 32397 54096 55028 77775 95217 90296 61137 29119 28608 69956 19495 16694 14549 -38651
10225 -38651 -47047 -28996 13292 12104 1598 27432 69508 62605 59355 70268 83848 65663
10213 65663 38519 -7492 747 2574 30540 44414 46745 48791 14116 -1839 24911 -7541
10201 -7541 -30232 -22792 17565 26937 63458 74160 78712 93331 78311 87814 64416 76120 146297
10188A46297K9673k5072k4493J5570K5184j3008O4304P0381P7556J21896J33061
10177F21349K03416K28979L28606M70297N82259O72049N75838L32482n0920m45337
10167C519018p15779o43253m86645l51592j82241j63153j30945r4376l1974l0814
10157F88246j0151m7428q2780o6464q932R980n7741m9308N146o5798l9600k3j8400
10144B56747O5938n128p6259J60o457O0275k842L830o2929j1851p821q217k8617
10131A76829l1230J478q9K1182L7063K0715M4838m2445n2559l401j1568l0274
10119A30539l1989j5640q898l594j2191q368k1727l3133K2317L2002K9718P562
10107H6598K0900k7821k0017m5633L446M353J4770J6202M657J1560L0307m9679
$$ plain form
10188 146297 175970 150898 126405 141975 167159 154151 218455 288836 366392 488288 621349
10177 621349 824765 1053744 1382350 1852647 2434906 3106955 3682793 4015275 3964355 3519018
10167 3519018 2803239 2159986 1673341 1321749 1139508 976355 845410 751034 719060 688246
10157 688246 678095 630667 547887 481423 472491 482471 424730 375422 380568 314770 275170 275147 256747
10144 256747 322685 317557 241298 241458 235001 295276 292434 296264 233335 221484 213663 205446 176829
10131 176829 145599 147077 146988 168170 205233 225948 270786 228341 175782 172381 160813 130539
10119 130539 98550 82910 74012 70418 58227 49859 28132 -5001 17316 49318 79036 86598
10107 86598 107498 79677 59660 14027 17473 21826 36596 52798 57455 69015 99322 49643
10095D9643n0442K5105L1375n3914j6885J6501L9245j2667Q031K1485K7096M220
10083H8793n3871R487J1309m0988K6759j8004j8587L118L8449M0152p917J6596
10071I5296j5449j9608n220k1158J2596k2459m0636l2252l538N601K4761M4113
10059B2047J5736P082K7056o814o1250q485K6526o616j6031K6802K6529K967m4522
10046A1027L1877J7180M0961l5373l719q724j7286N7k7230n6886k1601L7940K2250
10033i527M1140k3525k7752K659l1291n22K6258L2505r665k5645j8578k7407M068
10020f7282m034j8989l9203J3123M7610J06193K305n5687j7466O7809N1156j6595
10008F8940n3172q555j8469n9433r014M1395N4656j2596j2746j9704l17k4207
$$ plain form
10095 49643 -799 24306 55681 1767 -15118 1383 40628 27961 35992 57477 84573 88793
10083 88793 34922 44409 55718 14730 41489 23485 4898 8016 46465 86617 78700 95296
10071 95296 79847 60239 55019 33861 46457 23998 -16638 -48890 -52428 -46827 -22066 22047
10059 22047 37783 44865 71921 65107 3857 -4628 21898 15282 -749 26053 52582 55549 11027
10046 11027 42904 60084 101045 65672 61953 53229 35943 36000 8770 -48116 -69717 -31777 -9527
10033 -9527 31613 8088 -19664 -17005 -48296 -48818 -22560 9945 280 -25365 -43943 -71350 -67282
10020 -67282 -71316 -90305 -129508 -116385 -68775 37418 39723 -15964 -33430 34379 85535 68940
10008 68940 15768 7213 -11256 -70689 -79703 -38308 16348 3752 -8994 -28698 -29015 -53222
9996e3222n826O2987O2662O232q838O202k5877k1457L4556k2849P485M860o048
9983D0867N269J2191m0660j7943j0870r777K8600l071J5160K8957j5777j5335
9971A7611m8070j3354J1296J601R53J1455L9036O379l9732R37j988k7597J0691
9958c0782o196K1158J4204l238k5657P361k401j7447r433L4686J8848m271k8673
9945c1841o60N509K4013J3855r703m510O3428K005r1624k0163L4799j5109q450
9932c8451N8328K8239m7195k9612n640J1990L8145R346K5808k4258l9494J6236
9920C442J9256k6877O769J2448n71L5620J7371k771j9635P7Q615m943P539p072
9906D9268j41k6040j0138j5451p156K2080k1504l3198j6958L4013N838k4585M4032
$$ plain form
9996 -53222 -59048 3939 66601 72833 63995 70197 44320 22863 57419 34570 42055 46915 40867
9983 40867 46136 58327 17667 -276 -11146 -20923 7677 4606 19766 48723 32946 17611
9971 17611 -30459 -43813 -32517 -30916 -29963 -18508 20528 26907 -12825 -11888 -13876 -41473 -30782
9958 -30782 -36978 -15820 -1616 -4854 -30511 -23150 -25551 -42998 -52431 -17745 1103 -3168 -31841
9945 -31841 -32501 -26992 -2979 10876 1173 -3337 60091 62096 -29528 -49691 -14892 -30001 -38451
9932 -38451 19877 48116 921 -28691 -34331 -22341 15804 25150 50958 26700 -12794 3442
9920 3442 22698 -4179 2590 15038 14467 50087 67458 64687 45052 45129 53744 48801 56340 49268
9906 49268 49127 23087 12949 -2502 -9658 12422 -9082 -42280 -59238 -25225 -19387 -43972 60
9893F0N789k7161M0934N1221L6878k5458l5384j8532o1388L215K7968m39l5608
9880c7905o904L8377m23J5787l2073Q102N7864j4700J3473O1431j1844N913j3449
9867H3649j8035o9918l2393l9884K2352M6558k1384R724M6694K6191N6160l140
9855A06574j8460M4085J2198k3341l5330l5999K577l1868j3536K013j2069L7832
9843C4676P629R687M1907K0548L0470R9884K7443L9394J4818k7195K4446j8523
9831C05184m0633K6346l0824q8202j6753k1256J0459j4881l7774l7740n036P066
9819E5956r636J4307m3969J6853J9454j3980k0058l12l2939j8210j9380L8973
9807a2941M0721J3136m1698J9915L4322j8782J3556j0628K891p322l1543j3105
$$ plain form
9893 60 5849 -21312 19622 70843 107721 82263 46879 28347 -33041 -29826 -1858 -2297 -37905
9880 -37905 -44809 -6432 -6855 8932 -23141 -15039 42825 28125 41598 103029 91185 97098 83649
9867 83649 65614 -4304 -36697 -76581 -54229 -7671 -29055 -19331 27363 53554 109714 106574
9855 106574 88114 132199 144397 121056 85726 49727 52304 20436 6900 8913 -3156 34676
9843 34676 42305 51992 93899 114447 144917 244801 272244 311638 326456 299261 323707 305184
9831 305184 264551 290897 260073 171871 155118 133862 144321 129440 91666 53926 48890 55956
9819 55956 46320 60627 16658 33511 52965 38985 18927 18615 -14324 -32534 -51914 -12941
9807 -12941 27780 40916 -782 19133 53455 34673 48229 37601 40492 33170 1627 -11478
9795a1478k8451l0777L5317K8395N1517K6689L8494n615j8079k9060l4408q480
9783A4064m205j3829k0670q525J9852J3416K2988N495N249j6358R297J0385j2076
9770B5083P408M1806P116P63J9357k2548n4632K1886M6386k8185j1648k9384m1153
9757a7745L4550M3704M7820K7938m3582m294J770j1223k5377k197J1029K1313
9745H3706k7980j2349l1084j4107M1602j7666j9629K9342J0411J6873m6801K4420
9733C6738J2488m138p881K7171j3058j2538j4284L008L6875q973l7319J1885J2717
9720D2691J5344k2622j9505j994J7571K27O611j1208k6782L1284L808m9862K6204
9707A1767Q871K0922J727j0094l9072l0794l363K2057M5518M4795k8024l3406
$$ plain form
9795 -11478 -39929 -70706 -35389 -6994 44523 71212 109706 104091 86012 56952 22544 14064
9783 14064 9859 -3970 -24640 -33165 -13313 103 23091 28586 33835 17477 26774 37159 25083
9770 25083 32491 74297 81413 82176 101533 78985 24353 46239 92625 64440 52792 23408 -17745
9757 -17745 16805 60509 108329 136267 92685 88391 90161 78938 53561 51364 62393 83706
9745 83706 55726 43377 12293 -1814 39788 22122 2493 31835 42246 59119 12318 36738
9733 36738 49226 45088 37207 64378 51320 38782 24498 27506 64381 55408 18089 29974 42691
9720 42691 58035 35413 15908 13914 31485 31712 38323 27115 333 31617 35425 -14437 11767
9707 11767 20638 41560 43287 33193 -5879 -36673 -40036 -17979 27539 72334 44310 10904
9695A0904l6702K1583P147l2874p230K0462j3263j8929J4016L0360O578k0355
9683a8303l1160N5680L8366k4945k1913l028N8186l140j4822m0934L4480K5294
9671E3761m2056q442K1070J6003o854p279K0302L6504J4442o4529m2925L7571
9659B7568K1422L1372k3587j1400M0073p011m4696p7217k4896J7958M4197M222
9647a995L1763O038m130L393M0519r039o5110P762k011P625K4872M0456j5544
9634F4599l5659J2806k059k0383k024R885R6J4232j6743l8510j3922O20L1823
9621D761L3708P727k3417J8248L819N2127L0966r261r963m7799l9214J4293k4458
9608A1537o1221j8668N9163Q7850K5097n019o037l2744l3037m9859K807K1328
$$ plain form
9695 10904 -25798 -4215 2932 -29942 -37172 -16710 -29973 -48902 -34886 -4526 2052 -18303
9683 -18303 -49463 6217 44583 19638 -2275 -5303 52883 49743 34921 -6013 28467 53761
9671 53761 11705 3263 24333 40336 33482 26203 46505 83009 97451 32922 -10003 27568
9659 27568 48990 80362 56775 45375 85448 78437 33741 -43476 -68372 -50414 -6217 -1995
9647 -1995 29768 35806 31676 35069 75588 66549 1439 9201 7190 14815 39687 80143 64599
9634 64599 28940 41746 39687 19304 17280 27165 27261 41493 24750 -13760 -27682 -27062 4761
9621 4761 38469 46196 22779 41027 44846 96973 127939 118678 108715 60916 21702 35995 11537
9608 11537 -49684 -68352 -9189 78661 103758 98739 92702 59958 26921 -22938 -20131 1197
9596A197N9221J499L403r93k7983j7427j1170M1001K1868n6648j4833l3703j2022
9583d6590J7753J4206M900J7512K3136j8030k5901r269K9223K6566p841p618K2675
9570D0722l8028P110L3539n6l6245n8649l3227j0783J4706M8441M1488P394k065
9557A4347k0110l5108q919O548k813J0278K4983M7645M2531q938l4855M997K7601
9544F8187N458n107q441l048k3335L8896P502l0759k0666L0854L748m008p139
9531E2142p746O0356L2297J3894J822j5286l5433j9261k1722l0126J4166J97j3437
9518C1863k8731j204m002K9802q868m2266K0629K480J2817L5242k4808l0500k1241
9505b8787J9246M4744L2444k507j8981l3955j6959L2515P7602J3273l5034l3828
$$ plain form
9596 1197 60418 61917 65320 64327 36344 18917 7747 48748 70616 13968 -865 -34568 -46590
9583 -46590 -28837 -14631 -9731 7781 30917 12887 -13014 -22283 6940 33506 25665 18047 40722
9570 40722 2694 9804 43343 43287 7042 -51607 -84834 -95617 -80911 -32470 9018 16412 14347
9557 14347 -5763 -40871 -49790 -43242 -46055 -35777 -10794 36851 79382 70444 35589 40586 68187
9544 68187 73645 68538 60097 57049 33714 72610 80112 49353 28687 59541 63289 59281 52142
9531 52142 44396 104752 137049 150943 152765 137479 102046 82785 61063 30937 45103 45300 31863
9518 31863 3132 1928 -2074 27728 18860 -23406 -2777 -297 12520 47762 22954 -7546 -28787
9505 -28787 -9541 35203 67647 65140 46159 12204 -4755 27760 105362 118635 83601 49773
9493D9773k6429j8330J953j3001k9636j6998l8069L4317K9800J5468J7042Q021
9481A3911k8609j8459j1728L135L3570j2701J5475J439J8875J0347n4252L1053
9469B056L2672j1957j270j9355P295Q476k0654J7274j436L8641J9329k1762m7678
9456A631l436J8126J9525K3216j3514p129P499m78j2034l9736k5164k7426N2953
9443e967K9643j8241K9900p137J3418o318q416l7925n355K1655L9864l7703j0898
9430c480o155M1082j6785K3967J4790p312J8038M1289K3895l628n7251n3234N94
9417A5810L2227l163m3057l2459N5755L9522K0812l099J7546k0507J2708n3099
9405C8996k2455k9391J9082J2819K3561k5549K2440r885n10M251Q230J753K3127
$$ plain form
9493 49773 23344 5014 6967 -6034 -35670 -52668 -90737 -56420 -26620 -11152 5890 13911
9481 13911 -14698 -33157 -44885 -41750 -8180 -20881 -5406 -3967 14908 25255 -28997 2056
9469 2056 34728 22771 21501 2146 9441 17917 -2737 14537 13101 51742 71071 49309 1631
9456 1631 -1805 16321 35846 59062 45548 38419 45918 45440 33406 -6330 -31494 -58920 -5967
9443 -5967 23676 5435 35335 28198 41616 35298 26882 -11043 -16398 5257 45121 7418 -3480
9430 -3480 -9635 31447 14662 38629 53419 46107 64145 105434 129329 125701 68450 15216 15810
9417 15810 48037 44874 1817 -30642 25113 64635 85447 82348 99894 79387 92095 38996
9405 38996 16541 -12850 6232 19051 42612 17063 39503 29618 29108 33359 41589 43342 66469
9392F6469L819o639k8421J0187l2793p437l9162j2729J1235k75L6887J0926n1040
9379c8973m2143K1414N5228L9491r403l150k2594J126J4446J2638Q525J0675n775
9366D1505m292j8482k2881M5593O6895K3507q511m5586l9980J4347K5608l955
9354G3768q294L9254L3002l0195n6810J7574M410P520j4288r892J146k9686M5171
9341G2680J4800l2719q334k4138j0273J7466k8494r826K5852M2396K6857M9804
9329A36071J8378k5844l2142m1473j4301M9851J1120k8365p65O417m0549R193
9317D7591L3258j889o2220n1N6362J3502j6339l785j060l224K99R200m3893k1334
9303F417J8800N0465L1532K7059j0364l1006L6861L0614o145j8218q064l2298
$$ plain form
9392 66469 70288 63649 35228 45415 12622 5185 -33977 -46706 -35471 -35746 1141 12067 -38973
9379 -38973 -81116 -59702 -4474 35017 25614 22464 -130 996 15442 28080 36605 47280 41505
9366 41505 37213 18731 -4150 41443 108338 131845 123334 77748 37768 52115 77723 73768
9354 73768 65474 104728 137730 107535 50725 68299 72709 80229 65941 56049 57195 27509 72680
9341 72680 87480 54761 46427 22289 12016 29482 988 -8838 17014 59410 86267 136071
9329 136071 154449 128605 96463 54990 40689 90540 101660 73295 72530 78947 38398 47591
9317 47591 80849 78960 16740 16689 73051 86553 70214 66429 65369 62145 62444 71644 27751 6417
9303 6417 25217 75682 107214 134273 123909 92903 129764 160378 154233 136015 127951 95653
9291I5653n5382K0489J7651N263m769j2607l6066J3629J6152K5900o605m5348
9279C3960j7504K9930L3467N6906Q0211L5485m3605m0056o110m315r01k9217K227
9266A30478J735j1002L100k1602j8889R222M9067L8082J3142M778m6451l2537
9254A19123L6112K9611j6864K4457P009J6331O632J300p441n7286j3544j9014
9242A26426J1772L0470J8750m2602K3079N2354J4054o697l1204m4652r38L004
9230A53816m677L6667N1242P787j1012L3215M632j4553L3238K968n0680o085l7579
9217A98979l2346J7517L2457J0832j5724J9270O6k5270L2234q544L8152L9498
9205C07121n257n308l5780n1352l5050P895L4122Q833l1675m5919j7299J5139
$$ plain form
9291 95653 40271 60760 78411 83674 78905 66298 30232 43861 60013 85913 79308 33960
9279 33960 16456 46386 79853 136759 216970 252455 208850 168794 162684 158369 157468 128251 130478
9266 130478 132213 121211 124311 102709 83820 93042 142109 180191 193333 198111 151660 119123
9254 119123 155235 184846 167982 192439 199448 215779 222411 223711 216270 158984 145440 126426
9242 126426 138198 168668 187418 144816 167895 220249 234303 227606 196402 151750 150812 153816
9230 153816 149139 185806 237048 244835 233823 267038 271670 257117 290355 293323 242643 236558 198979
9217 198979 166633 184150 216607 227439 211715 230985 231051 205781 238015 229471 267623 307121
9205 307121 301864 296556 260776 209424 174374 182269 216391 225224 193549 147630 130331 145470
9193A45470O648M5649N9970L7046j3089m0805K3070J0973K2668l6980k9271O398
9181B37747K9525R037J3449R812K9353L4921J1661j8185l6069M6756L3987p180
9169C94814j2514N012l9063o1553K973Q962J8132n179k5227R052M1024J1095L3609
9156C81137L0468r29l3812J279l9157k5005j0062N4760M140K1235L7448J0294
9144D31796j8713j8178K5314J9356J9752m490j2786L7552J4667J0412J2796J0290
9132E27768m846r291l5785p595P848J7432L8561L1583N212n0287j3805r413K1539
9119E18921N5277K0609k4594j1176L6878J6076K1594k1144M335O704O947j681
9107F28746J9953L4828J6544Q15M649L2267P1179M8464J8015M1253J6495k0342
$$ plain form
9193 145470 152118 197767 257737 294783 281694 240889 263959 274932 297600 260620 231349 237747
9181 237747 267272 276309 289758 299570 328923 363844 375505 357320 321251 368007 401994 394814
9169 394814 382300 387312 348249 286696 289669 298631 316763 311584 286357 295409 336433 347528 381137
9156 381137 411605 410676 376864 378143 338986 313981 303919 358679 362819 384054 421502 431796
9144 431796 413083 394905 420219 439575 459327 454837 442051 479603 494270 504682 517478 527768
9132 527768 522922 513631 477846 470251 478099 495531 534092 565675 570887 520600 506795 497382 518921
9119 518921 574198 594807 570213 559037 595915 611991 633585 612441 616776 623480 630427 628746
9107 628746 648699 683527 700071 700886 705535 737802 808981 857445 875460 916713 933208 912866
9095I12866K3433N193J0510K0533j3784J3102L7482q591R405N4788N4217J8890
9083A138044N5597L6617j5844M8177M5751j9880M0430N8511K4980N5074l078p55
9071A463624R597R3387J9592K1095L7274P5495L9731O3336M1993K2392K1477O3868
9059A972861J22485O1133J3816J8624M1714P4918N0198Q0586K9183O3915R6025
9048B625458R4392R2464J15873O2679J09540J05587P2285Q4925O9179J07223J37065
9037C676670J27381J76825K01517J60212J36356J37773J66737K28863K36116J91124
9027E439574K00872K63864K79578K28216K48108L33352L48964L44136M13687M17766
9017H518117M24356M16028M94594N38965N39019N67121O67179P09289P66510Q18192
$$ plain form
9095 912866 936299 941492 952002 972535 958751 971853 1009335 1000744 1010149 1064937 1119154 1138044
9083 1138044 1193641 1230258 1214414 1262591 1308342 1288462 1328892 1387403 1412383 1467457 1464379 1463624
9071 1463624 1473221 1566608 1586200 1607295 1644569 1720064 1759795 1823131 1865124 1887516 1908993 1972861
9059 1972861 2095346 2156479 2170295 2188919 2230633 2305551 2355749 2436335 2465518 2529433 2625458
9048 2625458 2719850 2812314 2928187 2990866 3100406 3205993 3278278 3363203 3432382 3539605 3676670
9037 3676670 3804051 3980876 4182393 4342605 4478961 4616734 4783471 5012334 5248450 5439574
9027 5439574 5640446 5904310 6183888 6412104 6660212 6993564 7342528 7686664 8100351 8518117
9017 8518117 8942473 9358501 9853095 10392060 10931079 11498200 12165379 12874668 13641178 14459370
9007A4459370Q90702R79265J024652J135511J201488J227215J410115J552932
8999B3881250J622571J710511J814054J901768K041745K098457K165729K204209
8991C9440294K217288K150373K042775J869517J646169J421049J156369P17831
8983E2661665L38428j4680l54293o86126j053681j263489j434054j611039j749709
8974D4833022j784311j756851j781071j742674j682319j621950j542848j451445
8966C1469553j367597j373526j243039j166922j056164r66865r71722q83304q32540
8957B1607874p96121p28157p37835p18093o89835o42256n70818n25623m82909
8948A5716227n06043n17097m89619m90287m46408l80309l63242l63162l54477
$$ plain form
9007 14459370 15350072 16329337 17353989 18489500 19690988 20918203 22328318 23881250
8999 23881250 25503821 27214332 29028386 30930154 32971899 35070356 37236085 39440294
8991 39440294 41657582 43807955 45850730 47720247 49366416 50787465 51943834 52661665
8983 52661665 53000093 52985413 52631120 51944994 50891313 49627824 48193770 46582731 44833022
8974 44833022 43048711 41291860 39510789 37768115 36085796 34463846 32920998 31469553
8966 31469553 30101956 28728430 27485391 26318469 25262305 24295440 23323718 22440414 21607874
8957 21607874 20811753 20083596 19345761 18627668 17937833 17295577 16724759 16199136 15716227
8948 15716227 15210184 14693087 14203468 13713181 13266773 12886464 12523222 12160060 11805583
8939A1805583l51804l30927l35998l26862k60990l10102k99016k33724j94457
8930I161703k67844k88295k35330j75396j79599j62375k02036k23903k06086j42556
8920G078283j58926j53495j49326j64916j59966j38599j48570j09175j07073j90056
8910E598181j76462j23934q7193q8212j00934j15576j24550j13801r1837o8081
8900D507601j04833r6775j01781r1864r4442r9630n7608l1213q2827j00395r6787
8889C549446p7619r4171k8017m1814r3606o0662o7100q0350o2860l3332k8077
8878B881838m3675m6220k7167n2231l5164N625o7327n3959m3473k6972K4308r144
8866B506439m7258j7905q1900p2130m5748n0270m1056o0560n0873j6453m527m062
$$ plain form
8939 11805583 11453779 11122852 10786854 10459992 10199002 9888900 9589884 9356160 9161703
8930 9161703 8893859 8605564 8370234 8194838 8015239 7852864 7650828 7426925 7220839 7078283
8920 7078283 6919357 6765862 6616536 6451620 6291654 6153055 6004485 5895310 5788237 5598181
8910 5598181 5421719 5297785 5210592 5122380 5021446 4905870 4781320 4667519 4575682 4507601
8900 4507601 4402768 4305993 4204212 4112348 4017906 3918276 3860668 3829455 3746628 3646233 3549446
8889 3549446 3471827 3377656 3349639 3307825 3214219 3153557 3086457 3006107 2943247 2909915 2881838
8878 2881838 2838163 2791943 2764776 2712545 2677381 2683006 2615679 2561720 2518247 2491275 2515583 2506439
8866 2506439 2459181 2441276 2359376 2287246 2241498 2191228 2150172 2089612 2038739 2022286 2017759 2013697
8854B013697O69n630m7804m643J0630n3927k8992K3097l3683j9161n7100n8833
8842A738320r3188l3419l6696j6158n1326r567J7685l9462J67m6788n6390l9419
8830A333759J946Q934R884P635q605l5701Q234n7969l9236J614n4155j5446j8123
8817A142771l795o500M515k9687j7117k7606n327j7420p281M460j62k6889n1312
8804I58650n5148n0158K0585R312J822j8223l358m281j2973j2390J024o1442l5011
8791G38409k4752K4617N2150k6767l5182l9515m7475N5900j4086m8687k4984j9
8779F09609Q995m7546j7264K0500N563R208J1058K4414K4041Q412q558j7987R490
8766F39935J0618k9667k1455l0010l5736k3240J4206m959j8681N08N080K2085
$$ plain form
8854 2013697 2014366 2008736 1960932 1956289 1966919 1912992 1884000 1907097 1873414 1854253 1797153 1738320
8842 1738320 1645132 1611713 1575017 1558859 1507533 1497966 1515651 1476189 1476356 1429568 1373178 1333759
8830 1333759 1335705 1344639 1354523 1362158 1353553 1317852 1326086 1268117 1228881 1230495 1176340 1160894 1142771
8817 1142771 1138976 1132476 1136991 1107304 1090187 1062581 1057254 1039834 1032553 1037013 1036851 1009962 958650
8804 958650 903502 853344 873929 883241 885063 866840 863482 859201 846228 833838 834862 773420 738409
8791 738409 713657 738274 790424 763657 728475 688960 641485 697385 683299 634612 609628 609609
8779 609609 618604 571058 553794 574294 579857 589065 600123 624537 648578 656990 648432 630445 639935
8766 639935 650553 620886 599431 569421 533685 510445 524651 519692 501011 501519 506599 528684
8754E28684K8151M7282j5810l9664j7507l1142J3185L7250l6175m4748l187K925
8742D69244q638K9391l1243m722J6210J1012Q901m0892j5467K8035J3938k0168
8730D55601M4989j6878k3585k2800K1134J6724k6624o4371M131N200J6081l3957
8718C75645l4746K9083R32l704K1118N916k4055r022L172P771k4795L5347K1505
8705D04167r983J205l940J4881j0199p4844l4220K800K5475Q306R766m814J1219
8692C39819q793l1911k0623L4956k1703k3708P3601K3094k1928n216K3066N403
8680C66057J3670k0197n858j918m02R398o774m920l1193l5122l6011N920m2412
8667B10238j0697M3978K3920L6841K6209K1666l0653m7291j1282J1209L5495l6341
$$ plain form
8754 528684 556835 604117 588307 548643 531136 499994 513179 550429 514254 469506 466319 469244
8742 469244 460606 489997 458754 454032 470242 481254 490155 449263 433796 461831 475769 455601
8730 455601 500590 483712 460127 437327 458461 475185 448561 384190 388321 393521 409602 375645
8718 375645 340899 369982 370914 367210 388328 394244 370189 361167 364339 372110 347315 382662 404167
8705 404167 394184 395389 391449 406330 396131 321287 287067 289867 315342 323648 333414 328600 339819
8692 339819 331026 299115 278492 313448 291745 268037 341638 364732 342804 337588 360654 366057
8680 366057 379727 359530 353672 351754 351352 360750 353976 349056 317863 282741 246730 252650 210238
8667 210238 199541 243519 267439 304280 330489 352155 321502 274211 262929 274138 309633 273292
8655B73292j5516L2123L1738J556K8443J3936k0537l4239j1M0577P449Q737K0229
8642C87777j3008j4634k5696n8772r410L8607P883j5307M373k489j2753r888O797
8629B83480l255J8150k0286J5435N3091L6536m0452o3825r415M958N4442N0599
8617C79458L5857l817O263l823K578J0635k1687l1489j528J1691k0897k1568M2567
8604C84240M1349Q149L702j5943M532m1301k8194j2647j8939K1815N3485L5583
8592D35831Q3q508m9213n1257j4287r947m9274l8436J7015o459O478R735K8977
8579B70738K905k4944k4997l6105k5674O5301L1084o232p593l5872j8406m182
8567A86023N791j6399O243j2654j4708K4863K7961j7563n4199l1920L4319N3891
$$ plain form
8655 273292 257776 289899 321637 323193 351636 365572 345035 310796 310785 351362 358811 367548 387777
8642 387777 374769 360135 334439 275667 266257 304864 312747 297440 301813 299324 286571 276683 283480
8629 283480 280225 298375 278089 293524 346615 383151 342699 278874 269459 274417 328859 379458
8617 379458 415315 411498 417761 413938 416516 427151 405464 373975 372447 384138 363241 341673 384240
8604 384240 425589 433738 437440 421497 426029 384728 356534 343887 324948 346763 400248 435831
8592 435831 435914 427406 378193 326936 312649 302702 253428 214992 232007 225548 232026 241761 270738
8579 270738 273643 248699 223702 187597 161923 227224 258308 252076 244483 208611 190205 186023
8567 186023 191814 175415 181658 169004 154296 179159 207120 189557 135358 103438 137757 191648
8555A91648l323l2357n11j7909N5341J388J2246l339N894l8938L1923N809q857
8542A99015o775j4679J6471l073q398K6078L0552l3726j7903l2544j388j2360
8530A41270l0595K5595m428j3782j4549j3231N946M7105j5372K0141n55K2095
8518A69640j5636j0501l464K6972L9029J0660K3447k4058l2465n7562k6923O808
8506A05947Q019p000j6535m547M673K4791L8998k4088n7452m230J0349J4595n626
8493H7894L5595J4833J4087L321n315R141o414o2037p735j2k1583N244K8282N5506
8479A50807L4069o619j5178J8496m8510R86K1182j6711K6471N521J2618K2119
8467B05251m0981n3230l8363m480L3172o55j8928L7881L5808k6624n875K6621
$$ plain form
8555 191648 188325 155968 155457 137548 192889 194277 206523 203184 209078 170140 202063 207872 199015
8542 199015 192240 177561 194032 190959 182561 208639 239191 205465 187562 155018 153630 141270
8530 141270 110675 136270 131842 118060 103511 90280 96226 143331 127959 148100 147545 169640
8518 169640 154004 143503 140039 167011 206040 216700 240147 216089 183624 126062 99139 105947
8506 105947 113966 106966 90431 85884 90557 115348 154346 130258 72806 68576 78925 93520 87894
8493 87894 123489 138322 152409 155730 150415 159556 153142 91105 83370 83358 61775 67019 95301 150807
8479 150807 184876 178257 163079 181575 133065 134051 155233 138522 164993 170514 183132 205251
8467 205251 164270 111040 72677 68197 101369 100714 81786 119667 155475 128851 122976 149597
8455A49597P853j1280m0216K0610M134O469K9932J9176j9879o0691l6799j2566
8443E6340m5456R042M3755N8207J4827p776l4136k0100K510Q710J2959L3937L6439
8430A69258j9316M266j9872j9480o908L9095J9414j4357l2057K6426K237k4650
8418A24056J113k0973m7334J8640K6592j887K1122r440k123K885L1312r17J2138
8405A55184r660j6022j8101k5569j9181J9598J3726L730k6712j0084L1024j2008
8393H5925M349j6405k9032p695N059K3272O2026k900j6130k6427r458l610l1998
8380C6976j3249M5117j0639L005L9630j9725m9493l0196K3476j8884L4133J8390
8368E8541l99R199L7952K8835m726O907K9710j7825m4006j8657J4416j8087l7403
$$ plain form
8455 149597 157450 146170 105954 126564 130698 137167 167099 186275 166396 105705 68906 56340
8443 56340 10884 19926 63681 121888 136715 128939 94803 74703 77213 85923 98882 132819 169258
8430 169258 149942 154208 134336 114856 107948 147043 166457 152100 120043 146469 148706 124056
8418 124056 125169 104196 56862 75502 102094 100207 121329 111889 109766 112651 143963 143046 155184
8405 155184 145524 129502 111401 85832 66651 86249 99975 103705 76993 66909 97933 85925
8393 85925 90274 73869 44837 37142 42201 65473 127499 124599 108469 82042 72584 68974 36976
8380 36976 23727 68844 58205 61210 100840 81115 31622 1426 24902 6018 40151 58541
8368 58541 58142 67341 105293 134128 129402 136309 166019 148194 104188 85531 99947 81860 44457
8355D4457j2788M3816M4923o465o2655l276M3969J3282M042R596m6745J3974L0818
8342A16948q542m2347J6047M0043r280l0201k38K1901kj101o4712j9773L3311
8329E2054L5883k3470j4420J0519n0514j6768K5789O211l704K0119K4169P1226
8317A37094L4267m3538l335J033J2932m6458o631K0415J0127p211J2496l7657
8305H3534k6999k2516M965K4291K5056k3142n2793Q737K4007K4942J2153J3026
8293I5261j3549j087K0417m5970l4989N6909P6663J8667l6351n3161P394O909
8281I7113L968k3990j8041l4420p133P220M145j966j7775K0757k615Q534K7813
8268F3610P00J2898K7847P05r301K3999p251o557l6011k7740n2597J3492M8147
$$ plain form
8355 44457 31669 75485 120408 113943 51288 48012 91981 105263 109305 118901 72156 86130 116948
8342 116948 108406 66059 82106 122149 112869 82668 82430 104331 104329 103228 38516 18743 52054
8329 52054 87937 64467 50047 60566 10052 -6716 19073 25284 21580 41699 65868 137094
8317 137094 171361 127823 124488 125521 138453 91995 85364 105779 115906 108695 121191 83534
8305 83534 56535 34019 38984 63275 88331 65189 12396 21133 45140 70082 82235 95261
8293 95261 81712 80625 101042 55072 20083 76992 153655 172322 135971 82810 90204 97113
8281 97113 101081 77091 59050 24630 17497 24717 28862 26896 9121 29878 27263 35797 63610
8268 63610 64310 77208 105055 105760 96459 120458 113207 106650 70639 42899 -9698 3794 51941
8255E1941m6549j4192O626K9429J8536L1964L3980P368j6611l5842n0630o4709
8243d8689l2620Q0345Q8351K6670k5256k5076J1841K6521l0954n0633j9104K7882
8231B9278N2948L9380K0173n2165l6905J2156r230n156J3882l2099n056K3396
8219E0602J5993j2143k2154J9909m54p054p196J8777l1290J1984K9861k63l93
8206F6179K92j0238l1947Q336m676J286R354k1018j4448k075L6209M0196k6642
8193E0808l429R480j102K4976J8205j7129j9725k8081k4394L2743p823l4019J5454
8180A5964J9374J939j7982O441o535l5680J7963j0324J3706K8926R812m690J0995
8167D9909J0614k0587m3890O0540M8338q794l5295l657J8935L3001r579J1131
$$ plain form
8255 51941 5392 -8800 -2174 27255 45791 77755 111735 119103 102492 66650 16020 -48689
8243 -48689 -81309 -964 87387 114057 88801 63725 75566 102087 71133 20500 1396 29278
8231 29278 82226 121606 141779 89614 52709 64865 55635 50479 64361 32262 27206 50602
8219 50602 66595 54452 32298 52207 51753 44699 37503 56280 24990 36974 66835 66572 66179
8206 66179 66471 56233 24286 32622 27946 29232 38586 17568 3120 1045 37254 77450 50808
8193 50808 47379 56859 55757 80733 98938 81809 62084 34003 9609 42352 34529 510 15964
8180 15964 35338 37277 19295 25736 19201 -16479 1484 -8840 4866 33792 43604 38914 49909
8167 49909 60523 39936 -3954 56586 104924 96130 60835 57178 76113 109114 99535 110666
8155A10666j5104j761j1555q372l7905j4291m048L7439j4749j8721l028o188K0089
8142C2472M2080l0154m7742j0786O780K782L442R101K5512K1579l5132l8181k1344
8129c9591M2206L4125M294j5232M3336L8499J7884K69J2575l219J4837N145J0963
8116A66091M041l9529n6741l2765k6405m3509N0746l3394k8542Q717K4671M9610
8104D2991o139M442o923j8306k1325l0678l873M0911P6593K3525l5883k4552j4612
8091B6171K7607o305k1540M366L548J8411M7095o968J4258n5244J0402N3674P929
8078A23404j6451m7832o726M1372J0574J2214K8876l1772m4529K925L6803n251
8066A03607k8827j5807K3976K3009j3931j9431j0452L213L7947l3141k3846r102
$$ plain form
8155 110666 95562 93801 82246 73874 35969 21678 17630 55069 40320 21599 18571 12383 32472
8142 32472 74552 44398 -3344 -14130 -7350 -4568 -1126 7975 33487 55066 19934 -18247 -39591
8129 -39591 2615 36740 41034 25802 69138 107637 125521 125790 138365 135146 149983 155128 166091
8116 166091 170132 130603 73862 41097 14692 -28817 21929 -11465 -40007 -31290 -6619 42991
8104 42991 36852 41294 34371 16065 -5260 -35938 -39811 1100 77693 101218 65335 40783 26171
8091 26171 53778 47473 25933 30299 33847 52258 99353 92385 106643 51399 61801 115475 123404
8078 123404 106953 59121 52395 93767 104341 116555 145431 113659 69130 72055 108858 103607
8066 103607 74780 58973 82949 105958 92027 72596 62144 65357 103304 70163 46317 37215
8054C7215K9475P850K8539j6353k740J3152Q778n788q968L445N1245m336Q325
8041A49839l8941j2659R743N2633L6552J5064l4695j1612O887n9597l735j8142
8029I1337j5865l56J1399j0351J0238Q639O190l8718j6741J9949N211L705J802
8016G6439r047j6703r076M7368M5560M9033L2910J1778K9895L009K0656J505k2343
8003B60984J1901m2287k1374J4436k8562l2859K2492O2281K8222J1654K1205k4505
7991B83588r2201l5528o6086q693j4584J2426K832l021R131L5612M765P486j0003
7978A25724l0923J803M1296K2291l173n4962j0098N768k2471L9548K8669j4304
7966A29168k6532K1415L4287J2866k7509O528J079J0780J2669N5307K5417j9033
$$ plain form
8054 37215 66690 74540 103079 86726 83986 97138 105916 100128 91160 94605 145850 141514 149839
8041 149839 110898 98239 107982 160615 197167 212231 177536 165924 172811 113214 109479 91337
8029 91337 75472 75116 86515 76164 86402 95041 101231 62513 45772 65721 70932 74637 76439
8016 76439 67392 50689 41613 88981 134541 183574 216484 228262 258157 261166 281822 283327 260984
8003 260984 272885 230598 209224 223660 195098 162239 184731 247012 275234 286888 308093 283588
7991 283588 191387 155859 89773 81080 66496 78922 81754 78733 87864 123476 128241 135727 125724
7978 125724 94801 96604 137900 160191 157018 102056 91958 97726 75255 114803 143472 129168
7966 129168 102636 124051 158338 171204 143695 150223 151302 162082 174751 230058 255475 236442
7954B36442j8772l294l648M164n9310j11891j7879L9005L4013J6010k2572R3K7153
7941A19514l2607k2156K6393M249j1151J1650q085j5073M5576L9520n688j437
7929A50705L2125k6627m7406M6651R813j2026j8819l7514k6590L3974N1979j487
7917A54778M288M3083k0494k0405m456j1603L7237p243k2790J7890l2884j8760
7905A18641K192J6165J9926k5006m7045J4780m723l9685L581J313J2629M882R213
7892H6863p907l7191J571K1020o000l7478N3004O0037n0160l7883k0150j751K7941
7879E1916J9894K0991j9101k5667M7572k0685l1671J0432l8851k6150n636M326
7867a2630L0172R933K3138j7403n3857J0178L1327L814L8859j8059j0848O762
$$ plain form
7954 236442 217670 214376 210728 214892 155582 43691 25812 64817 98830 114840 92268 92361 119514
7941 119514 86907 64751 91144 95393 84242 95892 87807 72734 118310 157830 152142 150705
7929 150705 182830 156203 108797 155448 165261 153235 134416 96902 70312 104286 156265 154778
7917 154778 159066 202149 181655 161250 156794 145191 182428 175185 152395 170285 137401 118641
7905 118641 120833 136998 156924 131918 84873 99653 94930 55245 58826 60139 72768 77650 86863
7892 86863 78956 41765 43336 64356 58356 20878 73882 133919 83759 45876 25726 23975 51916
7879 51916 71810 92801 73700 48033 95605 74920 43249 53681 14830 -11320 -16956 -12630
7867 -12630 17542 27475 50613 33210 -20647 -10469 20858 24672 63531 45472 34624 41386
7855D1386J6833K868k5712n5560L135R81o437k2471J1634K7808l716M3784L7370
7842G1903j2709J5216m5925l598K5262j1889j5188m5827m8308L2017Q391p322
7830c7977L347K7524J7888l877L708M5830J8148R734K6458l9335o9241l5704L2847
7817f50M2610J0844l092r435p530M253J2629K153P300k1229j4747L5282l3548
7804B4840l2293j6721p556O571P7390J2066j5163j514m656j9266L9787J3651Q298
7791H5434j5035J519j7306j0113j7970k9756m3257P186J503q302M3517J7843j123
7778A4140J8952L265k9147k5061l563k762k9970o2J8421N5816L7216K3425l3137
7765D7533k822k9408p597o737m9478l8983R149N4158O2807L0503p4055o7630k2194
$$ plain form
7855 41386 58219 61087 35375 -20185 -17050 -16069 -22506 -44977 -33343 -5535 -9251 34533 71903
7842 71903 59194 74410 28485 24887 50149 38260 23072 -22755 -71063 -39046 -30655 -37977
7830 -37977 -34630 -7106 10782 6905 10613 56443 74591 84325 110783 71448 2207 -33497 -650
7817 -650 41960 52804 49712 40277 32747 37000 49629 51782 59082 37853 23106 58388 24840
7804 24840 -7453 -24174 -31730 -25159 52231 64297 49134 47620 42964 23698 63485 77136 85434
7791 85434 70399 71918 54612 44499 26529 -3227 -46484 -39298 -37795 -46097 -2580 15263 14140
7778 14140 33092 36357 7210 -17851 -21414 -24176 -54146 -54208 -35787 20029 57245 80670 47533
7765 47533 44711 15303 7706 969 -48509 -87492 -78343 -24185 38622 69125 -4930 -72560 -94754
7752i4754J6453K426K9149N8770L2396R347M5588K6450l1371l9762q583K6414
7740G2523P159m0135n6366m967J491J6651L0284j9799k5890l1687K2991L3845
7728F100j5550N7896k16l106J6495m8695m1843K537j0338m1804k6185L3581M2791
7715b8337L3519q89K895m3639j9138J4434Q151j2864L2098J8450J4934J188m1121
7702b0319J164k3027j0872K82N8549L0807m6815K8943K6502M867j7351K6209o132
7689E2807l1835J008j7597n6315O329J5344M1744L0026J3052k7335j3660M6557
7677F0125n066k581k4532k4283j2404J414R649L739M926l0353Q260Q0411P885
7664G7190p63l749j658l8017J421k0113j5952k1724L467L5033j2021k6438Q369
$$ plain form
7752 -94754 -78301 -75875 -46726 12044 44440 53787 99375 125825 94454 54692 46109 72523
7740 72523 79682 39547 -16819 -21786 -20295 -3644 26640 6841 -19049 -50736 -27745 6100
7728 6100 -9450 48446 48230 45124 61619 12924 -28919 -26382 -36720 -78524 -104709 -71128 -28337
7715 -28337 5182 4293 7188 -36451 -55589 -41155 -33004 -45868 -13770 4680 19614 20802 -20319
7702 -20319 -19155 -42182 -53054 -52772 5777 36584 -10231 18712 45214 50081 32730 58939 52807
7689 52807 20972 21980 4383 -51932 -45603 -30259 11485 41511 54563 27228 13568 60125
7677 60125 55059 52478 27946 3663 -8741 -7327 2322 6061 10987 -19366 -11106 69305 77190
7664 77190 76427 72678 71020 33003 34424 14311 -1641 -23365 -19898 15135 3114 -23324 -14955
7651a4955p007m5090L6958M3999J0067j9648m9050L631N5212J1437l3938p1005
7639g9389j4830L1248J0426K6470L3910j2903J5678k766j5973k8424l339o296
7627d6188j4887K245M2689P447m4868j2741q153p007j879j1191J5180M6660L2845
7614A52J2738M77l5587q501J6256j4932j6368Q290K242P334L0884J5223K4116
7601D2324o952p6876r337K6628N78n0500q11l07K3387J2254J4678L1641J0926
7588A7633O001m1539k6868J0780J8578K0839K0281j0649j4425K1143j6788m8830
7576d3844l6457J2960L1741l8418k016N4931K9418l9348J7239L0629J8274k4603
7564A0506k0554k4858N5811J5644k1276k7009k4286M1852J5971m7759l0795l6986
$$ plain form
7651 -14955 -21962 -67052 -30094 13905 23972 4324 -44726 -41095 14117 25554 -8384 -79389
7639 -79389 -94219 -62971 -52545 -26075 7835 -5068 10610 7844 -8129 -36553 -39892 -46188
7627 -46188 -61075 -58830 -16141 -8694 -53562 -66303 -74456 -81463 -83342 -94533 -79353 -32693 152
7614 152 12890 13367 -22220 -30721 -14465 -29397 -45765 -37475 -35233 -27899 2985 18208 42324
7601 42324 35372 -41504 -50841 -24213 -23635 -74135 -74946 -75253 -51866 -39612 -24934 6707 17633
7588 17633 23634 -17905 -44773 -33993 -15415 5424 25705 15056 631 21774 4986 -43844
7576 -43844 -80301 -67341 -35600 -74018 -76034 -21103 8315 -31033 -13794 16835 35109 10506
7564 10506 -10048 -34906 20905 36549 15273 -11736 -36022 5830 21801 -25958 -56753 -93739
7552i3739R735J9121J1215J9676L2102L3252L2454p994l7822k9222o467J2927
7540d762J764k1618k707K4591k2356J1756J8193J9752n69K0643m5q346M4654K9098
7526A10048l2519j8776J9191k4337R106q261l6415j2771K0375M554l5612j4033
7514a9450J2451L8214k5322O805J3254p584j5132j032P680j6399j2208Q2411N718
7501F9406k5751q228Q68P631M022j9394m7256j2864N432M4395L7700j136p62Q575
7487F2638J8330M636J9508l7718k7005l6063l5941L5391J8951l2176r377O4032
7475D5206j564j6202j164j3226j8775l0517J0732J5640n77n516O723J5034O9270
7462G5064K5064N348k632k2446n4165l0389j399K5589M424O34k9711k5751l2117
$$ plain form
7552 -93739 -84004 -64883 -53668 -33992 -1890 31362 63816 55822 18000 -11222 -17689 -4762
7540 -4762 -2998 -24616 -27323 -2732 -25088 -13332 4861 24613 24044 44687 44642 36296 80950 110048
7526 110048 77529 58753 77944 53607 62713 54452 18037 5266 25641 30195 -5417 -19450
7514 -19450 -6999 31215 5893 12698 25952 18368 3236 2204 9884 -6515 -18723 63688 69406
7501 69406 43655 35427 36295 43926 47948 28554 -18702 -31566 -26134 18261 55961 54825 54063 62638
7487 62638 80968 85604 105112 67394 40389 4326 -31615 3776 22727 -9449 -18826 45206
7475 45206 43642 27440 26276 13050 -5725 -36242 -25510 -9870 -10447 -15963 -9240 5794 75064
7462 75064 100128 105476 102844 80398 26233 -4156 -5555 20034 24458 25092 -4619 -30370 -62487
7449f2487q026k35K2739J9922N9321J0886k4456P262M3853l7236m1168j4899J2681
7436a1843J7028K6737m1422K5677M293L427l0641J2119J9846o3359J357J689k2133
7423e7225j8246J7534k1215J5825K0667n189K5284J6266L837J2424N943J4321
7411C0226L4716J6778l0237j6242K0600n5810k8919L0335j4680L685k091k0804
7399c2443J7913J3269K1928k434K2789J9042P02l4466k4647l0895k2542j6811
7387f8595j9622L6938n0286q244L4880M6442L6685J7297j9848q446j7351k4759
7375d4909n203J9147M0713L7346L991K2127j8363k1279k2353j8272j7934N0685
7363B5696J8289K6974J8521K660J2118o4760p5306m0293L5452J5825K9491J6166
$$ plain form
7449 -62487 -70513 -70748 -48009 -28087 31234 42120 17664 24926 68779 31543 -9625 -24524 -11843
7436 -11843 5185 31922 -9500 16177 20470 23897 -6744 5375 25221 -38138 -36781 -35092 -57225
7423 -57225 -75471 -57937 -79152 -63327 -42660 -47849 -22565 -6299 -2462 9962 15905 30226
7411 30226 64942 81720 51483 35241 55841 31 -28888 1447 -13233 -9548 -11639 -32443
7399 -32443 -14530 -1261 20667 18233 41022 60064 60766 26300 1653 -29242 -51784 -68595
7387 -68595 -88217 -51279 -101565 -109809 -74929 -28487 8198 25495 5647 -2799 -20150 -44909
7375 -44909 -50112 -30965 9748 47094 51085 73212 54849 33570 11217 -7055 -24989 25696
7363 25696 43985 70959 89480 92140 104258 39498 -35808 -76101 -40649 -24824 4667 20833
7351B0833j5319J5802K0962J2003m7004j6290K2715M042n0759O331N9940L4247
7339F7503k5216p3825k0140n2318R074L8882O3610J6605o038l0639J4758J2127
7327A4383k7445j8428k920K2443L1395J6711j1280k775k2915J189o256J9755k1543
7314g686k3325N1652N239J467J890k1280j9457J8364N5554K6265j0570J761j1348
7301F8526k4864q276J0585k0252p5484k8066Q038L3930K6126j6845j3861j2896
7289e3339J4068n918k845K4549k2342n8931K595J9847L1344N747J7912J0961l2844
7276d9196p517o980O233j8766j2534L0590j4614k5715N405N5389K3789n272K5707
7263F519k1035O903k255j7352l1501J3878L682J9943K3739j9177j8251P83m130
$$ plain form
7351 20833 5514 21316 42278 54281 7277 -9013 13702 17744 -33015 -26684 33256 67503
7339 67503 42287 -31538 -51678 -103996 -94922 -56040 7570 24175 18137 -12502 2256 14383
7327 14383 -13062 -31490 -34410 -11967 19428 36139 24859 22084 -831 358 -5898 13857 -7686
7314 -7686 -31011 20641 25880 27347 29237 7957 -11500 6864 62418 88683 78113 79874 68526
7301 68526 43662 35386 45971 25719 -49765 -77831 -69793 -35863 -9737 -26582 -40443 -53339
7289 -53339 -39271 -45189 -48034 -23485 -45827 -104758 -102163 -82316 -50972 -45225 -27313 -16352 -49196
7276 -49196 -56713 -63693 -57460 -76226 -88760 -58170 -72784 -98499 -93094 -37705 -13916 -19188 6519
7263 6519 -14516 -7613 -9868 -27220 -58721 -44843 -41161 -21218 2521 -16656 -34907 -34124 -38254
7250c8254K391M284M4064j1730o1028k8156j8575L8312L0326J6552M235L1292
7238A3713n33l4746m4765K3450M3915N84K2511L839q32m327L4018m884l5659n782
7224A0502K0969n906k1467j8710K3885L4263J418k7039m1045j618K8287j0603
7212g064l8239l821J3465N4662P4780m5164j8101m9487r037K7555j7709M566Q76
7199a2718l7628k1744K8959j0780K569J3060P732L0088K1653l2979j3337M6002
7187B0877K8568l1260P601k0282k9762K4910K1281p404n2640L1234K9060K3808
7175D5991K349m5520J0415L7060J4202k5260j7791J501l5542l4588J9234L624
7163b4325Q376j223K4165J5124J4642k189j3404o082j9199o281m8498l0468K4781
$$ plain form
7250 -38254 -35863 -31579 12485 755 -60273 -88429 -107004 -68692 -38366 -21814 -17579 13713
7238 13713 13180 -21566 -66331 -42881 1034 1618 24129 27968 27136 22809 56827 51943 16284 10502
7224 10502 31471 25565 4098 -14612 9273 43536 44954 17915 -23130 -24748 3539 -7064
7212 -7064 -45303 -49124 -35659 19003 93783 48619 30518 -18969 -28006 -451 -18160 -13594 -12718
7199 -12718 -50346 -72090 -43131 -53911 -51342 -38282 -30550 -462 21191 -11788 -25125 20877
7187 20877 49445 18185 25786 5504 -24258 652 21933 14529 -38111 -6877 22183 45991
7175 45991 48340 2820 13235 50295 64497 39237 21446 22947 -12595 -47183 -27949 -24325
7163 -24325 -15949 -17172 6993 22117 36759 34570 21166 15084 -4115 -10396 -58894 -89362 -64581
7150f4581K2526J1887K9857j9097J4155M3404P0177m8401n5209R765J7654j3906
7138A8231j4818P460N537j5585n7556k5749k5443N1546M5932k332k4419N5764
7126A8568L842l154L135j1520m0550p516J1559k558J3118l1532k4639O4145k4844
7113c1946P895K6579K4579m011J2736M3333J7929j0410j5384o357q001j4330j2775
7100B9837Q488k0584n0103k5155J6827L4399J4852l1410j3674J9322M7680l2841
7088b362k0154L9688l1474m3784K4422M5205m5656m0821J9401K0814P104J6247
7076a1370k6886j8658M1509K2829j4135L1708J4938K456P427j9952j9197J4934
7064B5603j4635R385N2110k3805j5845m6722q60k1174J6820p305J8835M0141j3009
$$ plain form
7150 -64581 -42055 -30168 -311 -19408 -5253 38151 108328 59927 4718 14483 32137 18231
7138 18231 3413 10873 16410 825 -56731 -82480 -107923 -56377 -10445 -12777 -37196 18568
7126 18568 22410 19256 22391 10871 -29679 -37195 -25636 -28194 -15076 -46608 -71247 -7102 -31946
7113 -31946 -24051 2528 27107 23096 35832 79165 97094 86684 71300 64943 56942 42612 29837
7100 29837 38325 17741 -32362 -57517 -40690 -6291 8561 -22849 -36523 -17201 30479 -2362
7088 -2362 -22516 17172 -14302 -58086 -33664 11541 -34115 -74936 -55535 -34721 -27617 -11370
7076 -11370 -38256 -56914 -15405 7424 -6711 24997 39935 42391 49818 29866 10669 25603
7064 25603 10968 20353 72463 48658 32813 -13909 -14769 -35943 -19123 -26428 -7593 32548 19539
7051A9539l3687J8309q13o909j2206m1072j7741M7322l0323K326J9854R054K7968
7038A621J7580m0215k4167L6683L5405j7217l0336q845r499M36K2857l667j4762
7025c4126l2532J3319L0046L8755L2448J9404r908k580K516m1784j5795l412J168
7012b481j9461R140N486L5358m8615k2685L2695J8126p678n552m5433j7549J4345
6999e4304N3221n550k313J142l0878j0420J2720L5932J3536j5151j9694K5438
6987C679j7686K964N1302K1067j6248q210j3470l7945R158K9480O188k1762k751
6974E766K0573j5775m2637j9905K244Q818N2472K1803k9646m8928N381J3670J1122
6961a5042Q730m9911k4827M4742N2747l1544k0053M1R614k3659J3102K3739O459
$$ plain form
7051 19539 -14148 4161 3348 -3561 -15767 -56839 -74580 -27258 -57581 -55255 -35401 -26347 1621
7038 1621 19201 -21014 -45181 -8498 26907 9690 -20646 -29491 -38990 -38554 -15697 -19364 -34126
7025 -34126 -66658 -53339 -23293 15462 47910 67314 57406 54826 57342 15558 -237 -3649 -2481
7012 -2481 -21942 -12802 -7316 28042 -20573 -43258 -10563 7563 -115 -5667 -51100 -68649 -54304
6999 -54304 -1083 -6633 -8946 -7804 -38682 -49102 -36382 -450 13086 -2065 -21759 3679
6987 3679 -14007 -11043 40259 61326 45078 36868 23398 -14547 -5389 24091 30279 8517 5766
6974 5766 26339 10564 -32073 -51978 -49734 -40916 11556 33359 3713 -45215 -39834 -26164 -15042
6961 -15042 -6312 -56223 -81050 -36308 16439 -15105 -35158 -35117 -25503 -49162 -36060 -12321 -5862
6948e862l8659K232M2904P337L7596k333l6459l0218k3971O352J6865L2367n361
6935B790l5395K6585M1415J8194m499p3457k7708L8565P492n0973j0764L0310
6923c7445P171l3822L9033k5578K449J7124L0824p539j115r451Q926k3631j4150
$$ plain form
6948 -5862 -44521 -42289 615 7952 45548 43215 6756 -23462 -47433 -41081 -24216 8151 2790
6935 2790 -32605 -6020 35395 53589 49090 -24367 -52075 -13510 -6018 -56991 -67755 -37445
6923 -37445 -30274 -64096 -25063 -50641 -48192 -31068 -244 -7783 -8898 -18349 -9423 -33054 -47204
$$ [...]
##END NTUPLES=NMR SPECTRUM
##END=
