##TITLE=Analysis number 321125
Compound Code cc 48651
Book Reference 483/44
Project Code adrs
Chemist Name mattw
##JCAMPDX= 6.0         $$ Bruker NMR JCAMP-DX V2.0
##DATA TYPE= NMR SPECTRUM
##DATA CLASS= NTUPLES
##ORIGIN= Bruker BioSpin GmbH
##OWNER= nmr
$$ XWIN-NMR		Version 3.5
$$ Mon Jul 31 14:03:21 2006 GMT Daylight Time (UT+1h)  MAYBRIDGE\nmr@NMR_250MHZ
##.OBSERVE FREQUENCY= 250.131544655141
##.OBSERVE NUCLEUS= ^1H
##.ACQUISITION MODE= SIMULTANEOUS (DQD)
##.ACQUISITION SCHEME= undefined
##.AVERAGES= 16
##.DIGITISER RES= 18
##SPECTROMETER/DATA SYSTEM= dpx250
##.PULSE SEQUENCE= zg30
##.SOLVENT NAME= D2O
##.SHIFT REFERENCE= (INTERNAL, D2O, 0, 16.522)
##AUDIT TRAIL= $$ (NUMBER, WHEN, WHO, WHERE, WHAT)
$$ ##TITLE= Audit trail, XWIN-NMR		Version 3.5
$$ ##JCAMPDX= 5.01
$$ ##ORIGIN= Bruker BioSpin GmbH
$$ ##OWNER= nmr
$$ C:\u/data/dgb/nmr/ADRS/3860/pdata/1/auditp.txt
$$ ##AUDIT TRAIL=  $$ (NUMBER, WHEN, WHO, WHERE, WHAT)
(   1,<2006-07-31 14:02:53.78 +100>,<MAYBRIDGE\nmr>,<NMR_250MHZ>,
      <created by zg, POWCHK disabled, PULCHK disabled
       configuration hash MD5:
       E2 DF 36 D8 04 B2 41 60 5A D7 A3 38 5A 4B D0 FE
       data hash MD5: 64K
       FB 42 28 B9 6F A9 DE CD 27 B3 59 5C FE 5B 66 A4>)
(   2,<2006-07-31 14:03:08.40 +100>,<MAYBRIDGE\nmr>,<NMR_250MHZ>,
      <Start of raw data processing
       ef LB = 0.3 FT_mod = 6 PKNL = 1 SI = 32K 
       data hash MD5: 32K
       0F 16 5A 7B 9A B9 84 60 53 FE 74 8C FC E6 91 BE>)
(   3,<2006-07-31 14:03:10.11 +100>,<MAYBRIDGE\nmr>,<NMR_250MHZ>,
      <apk 
       data hash MD5: 32K
       B6 46 BF 06 9D 4B 82 78 0C ED 30 B3 A4 AE 19 5B>)
(   4,<2006-07-31 14:03:11.09 +100>,<MAYBRIDGE\nmr>,<NMR_250MHZ>,
      <abs ABSG = 5 
       data hash MD5: 32K
       CA 79 F0 B8 C9 AB 6E 48 EA 5D 41 74 3B 0B 1C 63>)
$$ ##END=
$$ 
$$ hash MD5
$$ 57 1F D1 A1 42 58 E7 25 B6 97 5A F3 6E 1E BC E2
##$RELAX= 
##$RELAX= 
##$RELAX= 
##$RELAX= 
##$RELAX= 
##$RELAX= 
##$RELAX= 
$$ Bruker specific parameters
$$ --------------------------
##$DU= <C:\u>
##$EXPNO= 3860
##$NAME= <ADRS>
##$PROCNO= 1
##$TYPE= <nmr>
##$USER= <dgb>
##$AMP= (0..31)
100 100 100 100 100 100 100 100 100 100 100 100 100 100 100 100 100 100 
100 100 100 100 100 100 100 100 100 100 100 100 100 100 
##$AQSEQ= 0
##$AQ_mod= 3
##$AUNM= <au_zg>
##$AUTOPOS= <48 >
##$BF1= 250.13
##$BF2= 250.13
##$BF3= 250.13
##$BF4= 250.13
##$BF5= 500.13
##$BF6= 500.13
##$BF7= 500.13
##$BF8= 500.13
##$BYTORDA= 1
##$CFDGTYP= 0
##$CFRGTYP= 5
##$CHEMSTR= <none>
##$CNST= (0..31)
1 1 145 1 1 1 1 1 1 1 1 1 1 1 1 1 1 1 1 1 1 1 1 1 1 1 1 1 1 1 1 1 
##$CPDPRG= <>
##$CPDPRG1= <>
##$CPDPRG2= <>
##$CPDPRG3= <>
##$CPDPRG4= <mlev>
##$CPDPRG5= <mlev>
##$CPDPRG6= <mlev>
##$CPDPRG7= <mlev>
##$CPDPRG8= <mlev>
##$CPDPRGB= <>
##$CPDPRGT= <>
##$D= (0..31)
0 1 0 0 0 0 0 0 0 0.06 0 0 0 0 0 0 0.0002 0 0 0 0 0 0 0 0 0 0 0 0 0 0 
0 
##$DATE= 1154350972
##$DBL= (0..7)
120 120 120 120 120 120 120 120 
##$DBP= (0..7)
150 150 150 150 150 150 150 150 
##$DBP07= 0
##$DBPNAM0= <>
##$DBPNAM1= <>
$$ [...]
##$SUBNAM6= <"">
##$SUBNAM7= <"">
##$SUBNAM8= <"">
##$SUBNAM9= <"">
##$SW= 20.6930455092707
##$SWIBOX= (0..15)
0 0 3 0 0 0 0 0 0 0 0 0 0 0 0 0 
##$SW_h= 5175.983436853
##$TD= 65536
##$TD0= 1
##$TE= 295.16
##$TE2= 300
##$TE3= 300
##$TEG= 300
##$TL= (0..7)
0 120 120 120 120 120 120 120 
##$TP= (0..7)
150 150 150 150 150 150 150 150 
##$TP07= 0
##$TPNAME0= <>
##$TPNAME1= <>
##$TPNAME2= <>
##$TPNAME3= <>
##$TPNAME4= <>
##$TPNAME5= <>
##$TPNAME6= <>
##$TPNAME7= <>
##$TPOAL= (0..7)
0.5 0.5 0.5 0.5 0.5 0.5 0.5 0.5 
##$TPOFFS= (0..7)
0 0 0 0 0 0 0 0 
##$TUNHIN= 0
##$TUNHOUT= 0
##$TUNXOUT= 0
##$USERA1= <user>
##$USERA2= <user>
##$USERA3= <user>
##$USERA4= <user>
##$USERA5= <user>
##$V9= 5
##$VALIST= <valist>
##$VCLIST= <CCCCCCCCCCCCCCC>
##$VD= 0
##$VDLIST= <DDDDDDDDDDDDDDD>
##$VPLIST= <PPPPPPPPPPPPPPP>
##$VTLIST= <TTTTTTTTTTTTTTT>
##$WBST= 1024
##$WBSW= 4
##$XGAIN= (0..3)
0 0 0 0 
##$XL= 0
##$YL= 0
##$YMAX_a= 387901
##$YMIN_a= -369224
##$ZGOPTNS= <>
##$ZL1= 120
##$ZL2= 120
##$ZL3= 120
##$ZL4= 120
##$ABSF1= 16.522
##$ABSF2= -4.171173
##$ABSG= 5
##$ABSL= 3
##$ALPHA= 0
##$AQORDER= 0
##$ASSFAC= 0
##$ASSFACI= 0
##$ASSFACX= 0
##$ASSWID= 0
##$AUNMP= <proc_1d>
##$AZFE= 0.1
##$AZFW= 0.1
##$BCFW= 0
##$BC_mod= 0
##$BYTORDP= 0
##$COROFFS= 0
##$CY= 12.5
##$DATMOD= 1
##$DC= 0
##$DFILT= <>
##$DTYPP= 0
##$F1P= 14.0000005364418
##$F2P= -0.99999901652339
##$FCOR= 0.5
##$FTSIZE= 32768
##$FT_mod= 6
##$GAMMA= 0
##$GB= 0
##$INTBC= 1
##$INTSCL= 1
##$ISEN= 128
##$LB= 0.3
##$LEV0= 0
##$LPBIN= 0
##$MAXI= 10000
##$MC2= 0
##$MEAN= 0
##$ME_mod= 0
##$MI= 0
##$NCOEF= 0
##$NC_proc= -4
##$NLEV= 6
##$NOISF1= 0
##$NOISF2= 0
##$NSP= 0
##$NTH_PI= 0
##$NZP= 0
##$OFFSET= 16.522
##$PC= 1
##$PHC0= 129.7043
##$PHC1= 12.48304
##$PH_mod= 1
##$PKNL= yes
##$PPARMOD= 0
##$PSCAL= 4
##$PSIGN= 0
##$REVERSE= no
##$SF= 250.13
##$SI= 32768
##$SIGF1= 0
##$SIGF2= 0
##$SINO= 400
##$SIOLD= 32768
##$SREGLST= <1H.D2O>
##$SSB= 0
##$STSI= 32768
##$STSR= 0
##$SW_p= 5175.98343685301
##$SYMM= 0
##$S_DEV= 0
##$TDeff= 65536
##$TDoff= 0
##$TI= <Analysis number 999999
Compound Code 99
Book Reference 9
Project Code 9>
##$TILT= no
##$TM1= 0
##$TM2= 0
##$TOPLEV= 0
##$USERP1= <user>
##$USERP2= <user>
##$USERP3= <user>
##$USERP4= <user>
##$USERP5= <user>
##$WDW= 1
##$XDIM= 32768
##$YMAX_p= 442927716
##$YMIN_p= -275076
$$ End of Bruker specific parameters
$$ ---------------------------------
##NTUPLES= NMR SPECTRUM
##VAR_NAME=  FREQUENCY,     SPECTRUM/REAL,   SPECTRUM/IMAG
##SYMBOL=    X,             R,               I
##VAR_TYPE=  INDEPENDENT,   DEPENDENT,       DEPENDENT
##VAR_FORM=  AFFN,          ASDF,            ASDF
##VAR_DIM=   32768,         32768,           32768
##UNITS=     HZ,            ARBITRARY UNITS, ARBITRARY UNITS
##FACTOR=    0.157963299565203, 1,           1
##FIRST=     4132.6476996994, 0,             0
##LAST=      -1043.33573715361, 0,           0
##MIN=       -1043.33573715361, -275076,     0
##MAX=       4132.6476996994, 442927716,     0
$$ Real data points
##PAGE= N=1
##DATA TABLE= (X++(R..R)), XYDATA
$$ [...]
19588A7834M3106J4697l6184k5231J2602m8254M6416O5503l7942m6039K789K8455
19576C7752K1462j6588l6710p1846j3283J01505L2876K1686J7906p668j02596
19565a5504m2702N9609n254l7982m375J8675N5657L2483m6854k9974o7005l2238
19553a15464L7565L1623O848J4762l777m2116M1153O7767l5783l6784P147k4627
19541e1686J9171m351o5642L1932K726J8026O3313j9458K6630K3768n963K8960
19529F7426J9534M5515p427j14361m0001L2009r10J5285j3546O771l1636n4452
19517g5793k8605P5070k9279l2989K1804M6948M9833m0513l5836M0897M5263N8043
19505I4843L3966q9866n1509K5010n960R3915J5828p3851L1912J4582n384q6937
$$ plain form
19588 17834 60940 75637 39453 14222 26824 -21430 24986 90489 52547 6508 9297 37752
19576 37752 59214 42626 5916 -65930 -79213 22292 55168 76854 94760 87092 -15504
19565 -15504 -58206 1403 -3851 -41833 -46208 -27533 28124 60607 13753 -16221 -83226 -115464
19553 -115464 -77899 -46276 -39428 -24666 -28443 -70559 -29406 38361 2578 -34206 -27059 -51686
19541 -51686 -32515 -36866 -102508 -70576 -67850 -49824 13489 -5969 20661 44429 38466 67426
19529 67426 86960 132475 125048 10687 -29314 2695 1785 17070 3524 10295 -21341 -75793
19517 -75793 -104398 -29328 -58607 -91596 -69792 -22844 26989 -13524 -49360 -8463 36800 94843
19505 94843 128809 38943 -12566 12444 6484 100399 116227 42376 74288 88870 83486 -3451
19493c451n8696l0524L2516J037O7190M9402m8097j03882j9501N0485L7324L5804
19481I607l2590j4997K7935J7643n489l1691K840l462k7694j9377j8759l2979
19469a29013j7528L7508N3833L4181l321J742j6859o4638o8641j1989K4449N7895
19457a02381o73M2361O2335N9264l0658n7817N4467N096K8438L1752l086q5576
19445C522m9655N4110K9585j80q693p766N6400l2576m9219R402k5188K6163M5496
19432E1401M5183K3422k3397J7195l6570L1562n6012l9175l5882J1376J6122Q869
19420A4094L3725o1672l5365k6862K852n2340k3147K0050O0612P2534L2086L1153
19408F7720m1452m2616l3283K4453l8860M125K2356M3593l1774j2988J4474K6828
$$ plain form
19493 -3451 -62147 -92671 -60155 -59118 8072 57474 9377 -94505 -114006 -63521 -26197 9607
19481 9607 -22983 -37980 -10045 7598 2109 -29582 -26742 -30204 -57898 -77275 -96034 -129013
19469 -129013 -146541 -109033 -55200 -21019 -24340 -22598 -39457 -104095 -172736 -184725 -160276 -102381
19457 -102381 -103054 -60693 1642 60906 30248 -27569 26898 31994 60432 92184 89098 3522
19445 3522 -46133 7977 37562 37382 28689 20923 77323 44747 -4472 4930 -20258 5905 51401
19432 51401 96584 120006 96609 113804 77234 108796 52784 13609 -22273 -10897 5225 14094
19420 14094 47819 -13853 -49218 -76080 -73228 -125568 -148715 -128665 -68053 4481 36567 67720
19408 67720 26268 -16348 -49631 -25178 -64038 -59913 -37557 6036 -25738 -38726 -24252 2576
19396B576k2907l488j7249o397k4682m4159O1270P8713j2628o8116J4692L0454
19384a1921K7164M4571j3425k5325O6439l5269n0978j7291j4307r507O105J4358
19372a9386K5890Q507q643j7941l2249j9740K9491M289k7004p2087J2204K8217
19360h8452L2250O9865k599p2053j1445K050J5086l7737r4654N2067J20054K1419
19348E851K983k633n400O45k4909K1404M2852k0155o9354l119O6375K5154k8704
19335A0990m2167k1413J4685j6208J04043L8085l2534k2415J3129L3616p7807
19324B004M621J6599K1820j2843m5573j3060l3500N02J6294M4033K0222o992J4193
19311B8320L0239R159j9392m1363j9653L6976K7290k4953k7084j5838k4686R102
$$ plain form
19396 2576 -20331 -23819 -41068 -47465 -72147 -116306 -55036 23677 11049 -57067 -42375 -11921
19384 -11921 15243 59814 46389 21064 87503 52234 1256 -16035 -30342 -39849 -33744 -19386
19372 -19386 6504 15011 6368 -11573 -43822 -63562 -34071 -29782 -56786 -128873 -116669 -88452
19360 -88452 -56202 13663 11064 -60989 -72434 -70384 -55298 -93035 -187689 -135622 -15568 5851
19348 5851 8834 6201 801 1446 -23463 -2059 40793 20638 -48716 -51835 14540 39694 10990
19335 10990 -31177 -52590 -37905 -54113 49930 88015 55481 33066 46195 79811 2004
19324 2004 6625 23224 45044 32201 -13372 -26432 -59932 -59430 -43136 897 21119 14127 28320
19311 28320 58559 67718 48326 6963 -12690 24286 51576 26623 -461 -16299 -40985 -31883
19299c1883j7771k3388o6446l693j8384o775K9529O7849P3583k7363n4909m41
19287h0092R269J1150k9258l8072l0900O623l3307N6612O1790M1412M769R935
19275a0069K8113m487P2950l339r7413k1024O8814K0293K7293N0323N6274p1065
19263A16663j41030o4482N646n4869J333Q0156M7854L6152K8381m2971L5503M057
19251E2393r652O296K835m8015l3201N462M7626o1973l3891L5872Q2095L571l5463
19238A3955l5832N6997j0192r210Q444l0901l5485K7156K5078J9791J228k4998
19226F031k8506k8457k2825J2328R7857n3482m2197J7444O219J7412j3958l3607
19214f5741J5776k9950r046Q2877N1810K9130n9619m4103l7078Q7493M1454K9652
$$ plain form
19299 -31883 -49654 -73042 -139488 -143181 -161565 -168340 -138811 -70962 2621 -24742 -79651 -80092
19287 -80092 -70823 -59673 -88931 -127003 -157903 -151280 -184587 -127975 -66185 -24773 -20004 -10069
19275 -10069 18044 13557 86507 83168 -14245 -35269 33545 53838 81131 131454 187728 116663
19263 116663 -24367 -88849 -83203 -138072 -136739 -56583 -8729 27423 55804 12833 48336 52393
19251 52393 42741 49037 51872 3857 -29344 -23882 23744 -38229 -72120 -36248 45847 49418 13955
19238 13955 -21877 35120 24928 15718 24162 -6739 -42224 -15068 10010 29801 31029 6031
19226 6031 -22475 -50932 -73757 -61429 36428 -17054 -59251 -41807 -35588 -18176 -32134 -65741
19214 -65741 -49965 -79915 -88961 -6084 45726 74856 15237 -28866 -65944 21549 63003 92655
19202I2655j8912o72k3090n5284n4249k3436J5955l215K8753k2868K9055K3435
19190a1873k6352L351J9633K8906L8513Q6020L6878N987l3074m9330l0764m9065
19178A8830j2656K12k7964m5929j2889P9722J7351M6196P627Q736k5693l4501
19166A9042o5520M755Q0285L3387q7840k2167l3094j1266Q065j401Q8989J6455
19154B9690o4053k9126M0325P5835q018l4717L164k0445Q3086n5253m9541J4788
19142a4265o226p511n0089q045L8327J1728j393J4227L1182l067n5454q1669J6331
19129a15924L2038O3590K813o9559j0243J4677L0131R508O1878J8701k930m3520
19117h840p3945J1619K6763n6866K7336K819J9224N9038k2098j3257k8956Q607
$$ plain form
19202 92655 73743 73071 49981 -5303 -59552 -82988 -67033 -70248 -41495 -64363 -35308 -11873
19190 -11873 -38225 -34874 -15241 13665 52178 138198 175076 181063 147989 98659 67895 18830
19178 18830 6174 6386 -21578 -67507 -80396 -674 16677 62873 70500 79236 53543 19042
19166 19042 -46478 -41723 38562 71949 -15891 -38058 -71152 -82418 -74353 -75754 13235 29690
19154 29690 -34363 -63489 -23164 52671 44653 9936 13100 -7345 75741 20488 -29053 -14265
19142 -14265 -20491 -28002 -78091 -86136 -47809 -36081 -37474 -23247 7935 4868 -50586 -132255 -115924
19129 -115924 -83886 -20296 -17483 -87042 -97285 -82608 -52477 -42969 18909 37610 34680 -8840
19117 -8840 -82785 -71166 -44403 -101269 -73933 -71114 -51890 7148 -14950 -28207 -57163 -48556
19105d8556N8664O1726j8141l4856o1948o9762M718o2176K6914N09L3619Q493
19093a00796K5828M7232J0284J5001O4443L6270l6855l8210o757K0588n0502n3741
19081f7215L8540P5607m852m6017J4534Q787o425k685M563n5001J6403j3581O3627
19068B6285R473l6915J0909M965K5779J6731K7513l8839o1935M0936j8489n9612
19056e3199k723m044r9l0913m765J7840M9719P1163l7353L4490K65m4576J5506
19043A1311j8363k0284L1451L5009R666j2099L2372J4654k5665p0063r4988k768
19031a09767n731M7660k23R092R9907L6963L2434N253J0605j1800k2801j31062
19019c9470m9664m398K686O4300j6259P838M7289J2821M843p461M2399n7669l4735
$$ plain form
19105 -48556 10108 71834 53693 18837 -43111 -112873 -108155 -170331 -143417 -142908 -109289 -100796
19093 -100796 -74968 -27736 -17452 -2451 61992 98262 61407 23197 16440 37028 -13474 -67215
19081 -67215 -28675 46932 42080 -3937 10597 19384 12959 10274 14837 -40164 -23761 -37342 26285
19068 26285 35758 -1157 9752 14717 40496 57227 84740 45901 -16034 24902 6413 -53199
19056 -53199 -55922 -59966 -60065 -90978 -95743 -77903 -28184 42979 5626 40116 40381 -4195 11311
19043 11311 -7052 -27336 4115 39124 48790 36691 69063 83717 58052 -12011 -106999 -109767
19031 -109767 -115498 -67838 -68061 -58969 40938 77901 110335 115588 126193 114393 91592 -39470
19019 -39470 -89134 -93532 -90846 -26546 -42805 -34967 12322 25143 29986 22525 64924 7255 -27480
19006b7480m1792j280J21025M3456p1097n5663K6564K5677L9872l4618J5744o999
18994C3409n4135l8199k9876K4391M5523N6669O9654o279k6376k3686l7556p079
18982F460J9903j0309m3583N0158k080j0628L9382J7013M3546q0716l5621N855
18970f20j4897j5751K9042k1594L4867M1872j02342q965O0582O9044p302r1444
18958b7508n867P9587K8704l3784l3867m4084R483l6829J0200O3155L1748k8773
18946A2165k8910J2600l002m152R47k6964n7467o2449L4550L1383m948m1613L2196
18933a05664L6229k6900n779L5919N538O4300m75N25K2168n12j7515L8576L8386
18920H4796l1239O5195J499p2489j05238o7167O9462P704K088L9913J2471J1072
$$ plain form
19006 -27480 -69272 -70552 50473 93929 22832 -32831 -6267 19410 59282 24664 40408 33409
18994 33409 -20726 -58925 -88801 -64410 -18887 37782 107436 101157 74781 51095 13539 6460
18982 6460 26363 16054 -27529 22629 20549 9921 49303 66316 109862 29146 -6475 -620
18970 -620 -15517 -31268 -2226 -23820 11047 52919 -49423 -58388 2194 71238 63936 -27508
18958 -27508 -33375 46212 74916 41132 7265 -36819 -27336 -64165 -53965 9190 40938 12165
18946 12165 -16745 -4145 -7147 -11299 -10352 -37316 -94783 -157232 -122682 -91299 -96247 -137860 -105664
18933 -105664 -69435 -96335 -102114 -66195 -60657 3643 3168 3693 25861 25349 7834 46410 84796
18920 84796 53557 118752 120251 47762 -57476 -124643 -55181 -47477 -45389 -5476 6995 18067
18908A8067j863l2246k2600N8484k762k5953l0233l5265J09760P6085j2794k1537
18896G7143n0976l8113p251l7804k0811K887K2927Q3940L4114M252l9990J6997
18884D7315M0071k4903J6651J2078K6210k3025o0954j1885N0370j4345j4124L5785
18872G9244J4578l3273n7567P67J5995K9749O1179j5874l7552j1347o423k32J3149
18859E2393O8754L9373K7083k2086o8456o8066j0879k0984m8672J6658j0791O1098
18847A5425N7980P1009m7316p7978n4030l7211n810J06619N0470O1385N7198J8261
18835B16002L6656q4760q6227J1620j2087j9536k8716P480l5290K1285M7068J5801
18823H9296o6369p3393j7040L2496M9388R3086l5241j11502k4285R7583M2774
$$ plain form
18908 18067 16204 -16042 -38642 19842 17080 -8873 -39106 -74371 35389 111474 98680 77143
18896 77143 26167 -11946 -19197 -57001 -77812 -74925 -51998 31942 66056 70308 30318 47315
18884 47315 87386 62483 79134 91212 117422 94397 33443 21558 71928 57583 43459 79244
18872 79244 93822 60549 2982 3749 19744 49493 110672 94798 57246 45899 39476 39244 52393
18859 52393 121147 160520 187603 165517 97061 28995 18116 -2868 -51540 -34882 -45673 15425
18847 15425 73405 144414 97098 19120 -34910 -72121 -77931 28688 79158 140543 197741 216002
18835 216002 252658 167898 81671 93291 81204 61668 32952 40432 5142 26427 73495 89296
18823 89296 22927 -50466 -67506 -35010 14378 107464 72223 -39279 -63564 34019 76793
18812G6793J2730M160R462K8081j8870r443k6585J6252l9902l5699K25N1813M1855
18799A10872K9538M571j8653j736l197k0113p6208m0995K0158K9807K0044M8528
18787A02616L9913k2140K1402j0918j058l7477J1544n7354l9712K0922q7409n3321
18775a12992O845M1606K8581j8233m2792K5040J8630r835k4338j2692o381N4577
18763e1984J3604J7412M5704k4659L1897L9317l1601m2280K0878o329o2336j7491
18751f7868K0568J2179J711M2185P9517Q298n0971j1473K7852Q1652m4531l9079
18739F0040J6875m5895l0150R9742P8845j2890r4704n4144m6552m8686P413l8892
18727a08998J3646N9451K216M284J4329n4624J0265J2260k1537J7272J0773K5264
$$ plain form
18812 76793 89523 93683 103145 131226 112356 102913 76328 92580 52678 16979 17204 69017 110872
18799 110872 140410 144981 126328 124592 121395 101282 25074 -15921 4237 34044 54088 102616
18787 102616 142529 120389 141791 130873 129815 92338 103882 46528 6816 27738 -59671 -112992
18775 -112992 -106147 -64541 -35960 -54193 -96985 -71945 -53315 -63150 -87488 -100180 -106561 -51984
18763 -51984 -38380 -20968 24736 77 31974 71291 39690 -2590 18288 11959 -50377 -67868
18751 -67868 -47300 -35121 -33410 8775 88292 96590 45619 34146 61998 143650 99119 60040
18739 60040 76915 31020 870 100612 179457 166567 71863 17719 -28833 -77519 -70106 -108998
18727 -108998 -95352 -35901 -33685 -29401 -15072 -69696 -59431 -47171 -68708 -51436 -40663 -15399
18715a5399k1638j5587L9684P962m4053J0799J5327O4911K2283K7788j7909m8431
18703B5737k7390k0530n0339K0496O2346J6131o6387j02304P7356P6806J062o492
18691F492j8895R344m6349N67N905J3833K7013K2448j5952K6787J7389K8770K459
18678G9811p532P282l3900n0762p247L6366J5289L4255K7713j4110l0005L8405
18666I5565M0209j4275K179k6757l812j0485m1454N686m1152o01L7239M6146Q413
18653I6901L6401k1378M640P9193j0794L3994L587o5211k8104j0580j4009L8420
18641A43060J616n56N618k6258L4057K2985L2562J1817K3649J8801m1674l4202
18629A91475n4880j7472O1045n443j4120J1163l8024L625k8137k3000Q3474L0432
$$ plain form
18715 -15399 -37037 -52624 -12940 -4978 -49031 -38232 -22905 42006 64289 92077 74168 25737
18703 25737 -1653 -22183 -72522 -52026 10320 26451 -39936 -142240 -64884 11922 12984 6492
18691 6492 -12403 -3059 -49408 -48841 -42936 -29103 -2090 20358 4406 31193 48582 77352 79811
18678 79811 72279 79561 45661 -5101 -12348 24018 39307 73562 101275 87165 57160 95565
18666 95565 135774 121499 123678 96921 93109 82624 41170 46856 5704 5103 42342 88488 96901
18653 96901 133302 111924 116564 195757 184963 218957 222544 157333 129229 118649 104640 143060
18641 143060 144676 144120 149738 123480 157537 180522 213084 224901 248550 267351 225677 191475
18629 191475 136595 119123 180168 174725 160605 171768 133744 137369 109232 86232 169706 200138
18617B00138l3905J2156l6706j1858P8721l8332j952J4126K7465L8255p711q3065
18605A57332q115Q9985O2848j3523j0343L5339N7445L1223m0271l0773N366K5133
18593C61646m4351J0661n8820m7892Q4024K2256r0636m4448O6631K8176l4382
18582B52865j5817R231n0914m807m8654n4506K9771j0737J7809n0956m9980L6678
18570E9983M7334K1321K2586J8602J3200Q5874n747k2577N3282Q634m9718m6272
18558B06502p910P7169N5425k924J8211n1925l819n422l0411J068k1105O8089
18546C02948n5136n2525j4548M6864l2955l0270K690L3818J5986k2910O2937N7775
18534C14674q0499o105r942q35K2690l6405j3870L1877j5719m7911O096N0697
$$ plain form
18617 200138 166233 178389 141683 129825 208546 170214 168262 182388 209853 248108 240397 157332
18605 157332 149217 239202 302050 288527 278184 313523 370968 402191 361920 331147 336513 361646
18593 361646 317295 327956 269136 221244 305268 327524 236888 192440 259071 287247 252865
18582 252865 237048 246279 195365 190558 141904 87398 117169 106432 124241 73285 23305 59983
18570 59983 107317 128638 151224 169826 183026 268900 263153 240576 293858 302492 252774 206502
18558 206502 198592 275761 331186 328262 346473 294548 290729 285307 254896 255964 234859 302948
18546 302948 247812 195287 180739 227603 194648 164378 167068 200886 216872 193962 256899 314674
18534 314674 234175 228070 218128 217293 239983 203578 189708 221585 205866 157955 164051 214748
18522B14748J1779m7272q5938k0403R926K291j7835N0792N8797M2503M2873r66
18510B61295n3162n8853m4790J6288k475q610M2968j6392m6253J9723N5342k8747
18498A36334N5506K4629r838j5910n2297l4210m4603P618j9368Q023K5179K3182
18486A04245M096j1495p768k265L8872M3155O089j2854P615k7599p6306K6160
18474I1945L4504M6801m0943j4627M9168R178k4204o1632K1208L6016p760o1008
18462G8646J0921M5878L8090l4333j6905n674o5627L0034J0469M97k2574l5314
18450C4108p5657J8253N9596J00019N6361n4694j6525L2732k4119l7386k2649
18439G0039l4037M1520q192o4493l5724J3645R2476L8941k8763p904j433l8838
$$ plain form
18522 214748 226527 179255 93317 72914 82840 85131 67296 118088 176885 219388 262261 261295
18510 261295 208133 149280 104490 120778 118303 109693 152661 136269 90016 109739 165081 136334
18498 136334 191840 216469 206631 190721 138424 104214 59611 67229 47861 55884 81063 104245
18486 104245 108341 96846 89078 86813 125685 168840 174929 162075 169690 142091 65785 91945
18474 91945 126449 173250 132307 117680 166848 176026 151822 90190 111398 147414 139654 78646
18462 78646 89567 135445 173535 139202 122297 116623 50996 81030 91499 91996 69422 34108
18450 34108 -41549 -23296 36300 136319 192680 137986 121461 154193 130074 92688 70039
18439 70039 36002 77522 69330 4837 -30887 -17242 75234 114175 85412 77508 76075 37237
18427C7237j7232p4917M3468N2118O9821K601p2492j2684Q3135K346P219k3151
18415I7469o9292k0438L6759M2446K062n6789J9005N3909M012J8339M4275K8969
18403B00726L6726J5354n4613k0035L086q4435l7093j4518k6174n16L7437j515
18391E4430P121j9247o1972O868Q6085N2835j9827l7868J0041N6981k0326l3357
18379H1764n3555l0103Q2800O5175m112l0884L595m915K2528k2106n9920p683
18367D2584M7224j7262j8796M1010O6362J8933j5799J3491k822l9348R99o134
18355A30442o81L5795M11n169j3473l6216O263L0277k9619M3773k4723J7354k3563
18342A30871P029O7064L4819j8856M8878R64j7877r3254p5051j2755K3947K9373
$$ plain form
18427 37237 20005 -54912 -11444 40674 110495 113096 40604 27920 111055 113401 120620 97469
18415 97469 28177 7739 44498 86944 89006 32217 51222 105131 109143 127482 171757 200726
18403 200726 237452 252806 198193 178158 181244 96809 59716 45198 19024 18508 55945 54430
18391 54430 61551 42304 -19668 -12800 73285 126120 106293 68425 78466 135447 115121 81764
18379 81764 28209 -1894 80906 146081 141969 111085 114680 109765 132293 110187 50267 42584
18367 42584 89808 72546 53750 94760 161122 180055 164256 177747 174925 135577 136576 130442
18355 130442 129761 165556 165967 160798 147325 111109 117372 147649 118030 161803 137080 154434 130871
18342 130871 137900 204964 239783 220927 269805 270769 252892 159638 84587 71832 95779 125152
18330A25152k7196L9159j7718q59M0519k4243J491j324m9127Q3902N1833j9422
18318B02167k3501J9513k2906n0713k2231K0083M4555J69l3747m0092L2089P56
18306A26142n1328N7969L3818j346K3553N109K6408P1558L2042l5578j2825k0725
18294B54797N7808K4752o8351p3613K6403J6557k1262q277n440m7434M13k7628
18282A28725J4816J5451N7280N370j11o886l3610K3344J9354l4113j3143M0933
18270B17410L0350m187l1957L108L7832K4848K4151J2152p781K2507Q1706Q4470
18258D94609L0795p5117j4971J4833n3530k5461J4118N080J7132M6315J0912p1302
18246C93413p2982m803M5081L5492m610k6341k92O0760j449J3964m375K3506J4995
$$ plain form
18330 125152 97956 137115 119397 118538 159057 134814 136305 134981 85854 169756 221589 202167
18318 202167 178666 198179 175273 124560 102329 122412 166967 167136 133389 93297 125386 126142
18306 126142 74814 132783 166601 165255 188808 193917 220325 291883 323925 288347 275522 254797
18294 254797 312605 337357 269006 195393 221796 238353 217091 208814 203374 155940 156353 128725
18282 128725 143541 158992 216272 221642 221531 214645 181035 204379 223733 189620 176477 217410
18270 217410 247760 243573 211616 214724 252556 277404 301555 313707 305926 328433 410139 494609
18258 494609 525404 450287 435316 450149 396619 371158 385276 390356 407488 453803 464715 393413
18246 393413 320431 315628 360709 396201 391591 365250 364958 425718 424269 438233 433858 457364 472359
18233D72359J4042J9085m7929j4020r3499l0083N4469Q4743M3531M3033O1718
18222F07449j5712j1356j3613j657N928l2747k1477l2893q326Q5716J09040P1587
18210G41939K6752p3705J9672L5900k0440J1544j2858L7305J6328j8646O2627
18199H26418j4989l7524k0309M3994J19799j8426J2207O1295O489p464M6600O3499
18187A081589R1114Q950L6204O1387P9218k0412q213N2530k0343K4727M5787P6671
18175A509209J34587O2476N4235O4059M8044J09166J00132J9302J62674J25860
18165B389744N9911P1834J58753J71351R2195J79539K04262J90315J33715K57157
18155C908776L29034K86732K08825K13184K25492L12401K91766K54731K40710
$$ plain form
18233 472359 486401 505486 457557 443537 350038 319955 374424 459167 502698 545731 607449
18222 607449 591737 580381 566768 565111 571039 538292 516815 483922 475596 561312 670352 741939
18210 741939 768691 694986 714658 750558 730118 741662 728804 766109 782437 763791 826418
18199 826418 811429 773905 753596 797590 917389 898963 911170 972465 978954 971490 1018090 1081589
18187 1081589 1172703 1181653 1217857 1279244 1358462 1338050 1329837 1382367 1362024 1386751 1432538 1509209
18175 1509209 1643796 1706272 1760507 1824566 1872610 1981776 2081908 2101210 2263884 2389744
18165 2389744 2449655 2521489 2680242 2851593 2943788 3123327 3327589 3517904 3651619 3908776
18155 3908776 4237810 4524542 4733367 4946551 5172043 5484444 5776210 6030941 6271651
18146F271651J71692J62959Q9275O5097J19884J84456K93969M30364N22358N99824
18136H911529P08409R54309J164374J191522J364526J619346J655870J585000
18128A9154885J567606J685423J672809J624107J652911J518537J349719J276001
18120C1501998J080287O94372L62639n7909m60451n40433j94354L90694Q06725
18111C3583568P42068M03924K62407M8799l08125o0916O95550J428784J969806
18102C8765865K340750K544451K241224J808143J539532J697881J761160J517456
18094E4216462Q52868q5876p95588j383842k223707k472339k032778j250167p11919
18085D4113114l74071k88977j62034J84259O32374R72804J004353N59971J08917
$$ plain form
18146 6271651 6443343 6606302 6695577 6760674 6880558 7065014 7358983 7789347 8311705 8911529
18136 8911529 9619938 10574247 11738621 12930143 14294669 15914015 17569885 19154885
18128 19154885 20722491 22407914 24080723 25704830 27357741 28876278 30225997 31501998
18120 31501998 32582285 33276657 33639296 33581387 33120936 32580503 32386149 32776843 33583568
18111 33583568 34325636 34729560 34991967 35040766 34732641 34671725 35367275 36796059 38765865
18102 38765865 41106615 43651066 45892290 47700433 49239965 50937846 52699006 54216462
18094 54216462 55069330 54983454 54187866 52804024 50580317 48107978 46075200 44825033 44113114
18085 44113114 43739043 43450066 43288032 43472291 44104665 45077469 46081822 46641793 46750710
18076D6750710k48428q32716j169463r38437l67124K02609O76600J077777R84250
18067D6135778P41053P82376P93109O08792N45906N8907q11341j290597j488881
18058D6075102j813266j717873p93886J23640N28674Q72538J209044J503560J616029
18049D7603562J456718J133313P40138K87778j99814r49070j660803j954125k248570
18040D4209127k903678l105042k827480k617375k285482j647313j048327o55239
18032B7119191m31685j77366K9364K7084L6633m8990p5236q1139m5413j74094
18022B6178349l48097n82253q21892j099604j168522r76396p96610o77553o03814
18013A9103608o03333p51881r22172r81145j155866j052407r55494o88163n20387
$$ plain form
18076 46750710 46502282 45669566 44500103 43561666 43194542 43397151 44073751 45151528 46135778
18067 46135778 46876831 47659207 48452316 49061108 49607014 49665921 48854580 47563983 46075102
18058 46075102 44261836 42543963 41750077 41873717 42402391 43274929 44483973 45987533 47603562
18049 47603562 49060280 50193593 50933731 51221509 51021695 50072625 48411822 46457697 44209127
18040 44209127 41305449 38200407 35372927 32755552 30470070 28822757 27774430 27119191
18032 27119191 26687506 26510140 26539504 26566588 26603221 26554231 26478995 26397856 26352443 26178349
18022 26178349 25830252 25247999 24426107 23326503 22157981 21181585 20384975 19707422 19103608
18013 19103608 18500275 17748394 16826222 15845077 14689211 13636804 12681310 11993147 11472760
18004A1472760l47612k62366j69275j79348j67374j01964P012O2588J21042J39575
17994A0575038P4639j27275j06640r9809j34258j50117j73134j43855j28382k70388
17984I315819l30724k95781l89418m84492m35430l76247l77223l17077k65081
17975F044346j55558j30641q7856k1694N0657O5751L4981R190p5845J1251p313
17964E737269k6853n1714l7283p4776j70366k67332j87416j72144j73838m0482
17954D535065n1773m7041J1643p1866k5891p6293k2288l0795j73650j62556j58329
17943C726226j98417k11608k52002k57137j37689r4125j64949j44690j16436m3532
17933B105641l2384l7230p7745p3617j6766p21k8702q7822n3795m7980k2417l7648
$$ plain form
18004 11472760 11125148 10862782 10693507 10514159 10346785 10244821 10251833 10314421 10435463 10575038
17994 10575038 10649677 10522402 10415762 10315953 10181695 10031578 9858444 9714589 9586207 9315819
17984 9315819 8985095 8689314 8299896 7815404 7379974 7003727 6626504 6309427 6044346
17975 6044346 5888788 5758147 5670291 5648597 5699254 5765005 5799986 5809176 5733331 5744582 5737269
17964 5737269 5710416 5658702 5621419 5546643 5376277 5108945 4921529 4749385 4575547 4535065
17954 4535065 4483292 4436251 4447894 4376028 4350137 4273844 4251556 4220761 4047111 3884555 3726226
17943 3726226 3527809 3316201 3064199 2807062 2669373 2575248 2410299 2265609 2149173 2105641
17933 2105641 2073257 2036027 1958282 1884665 1867899 1867178 1838476 1750654 1696859 1648879 1626462 1588814
17921A588814m4064J3884l0251k6162n5655K367m3950q0881m0555p2921o0528
17910A150098m999k717j6384J230J0310k5119m8911K1233k0582n222j5582n1634
17898I91721p6025J6420m1226m9212j2583j8116j3863k765k287j7994l0340K8477
17886G72207J2991l8389q2725L74O36j5516l4717o4286L1931J3741k0332L9708
17874F15623K252n7984m4768J5741J9832N959l4341J0283p536r265N6506K627
17862E74929o0702k3950q0823M260o607O9688Q4067k9053o0170J3478r081n8336
17850D17700l8086o9218P407M9040N6858N7648k3799n6563r1407N5559K2215k2250
17838C65104K8795l2664m9303J7615j0216o36Q631j2194j6903N6238J9253j0447
$$ plain form
17921 1588814 1544750 1558634 1528383 1502221 1446566 1448933 1404983 1324102 1283547 1210626 1150098
17910 1150098 1145099 1142382 1125998 1127228 1137538 1112419 1063508 1084741 1064159 1058937 1043355 991721
17898 991721 915696 932116 890890 841678 829095 810979 797116 794351 792064 774070 743730 772207
17886 772207 785198 746809 664084 664458 665094 649578 614861 550575 582506 596247 575915 615623
17874 615623 617875 559891 515123 530864 550696 556655 522314 532597 525061 515796 572302 574929
17862 574929 514227 490277 409454 413714 407107 476795 560862 531809 471639 485117 476036 417700
17850 417700 379614 310396 317803 366843 423701 481349 457550 400987 309580 365139 387354 365104
17838 365104 393899 361235 311932 329547 319331 318695 327326 315132 298229 354467 373720 363273
17826C63273n227k0052o0331l8033j043m0396Q2802J0626P932M3646L1137n2676
17814C21658o1671l169j0025k378K8306Q4348J0294K96k143P9974k4835j19240
17802C01415k9716M3663m888R627J0128p87k3295m1595J7750L7794n8302n6487
17790B05307q4577M3733Q5109N2167k4823j6691p3163k2932q406M4327n306j9902
17778A74843l970r140P599k1172M9176N9777l7779m9267L8735k7481j5380O318
17766A72259K7553j7240J0000L8296m0216q120j4523j3177L3277j3494k6044k8910
17754A19661l29j8766L9948o909l5958n1993q4245M3349N6226J4758J6567k879
17742H9430P864K3755J7355K6500m5327j3409m4405K9973L2596o268L963m5195
$$ plain form
17826 363273 358046 337994 277663 239630 238587 198191 280993 291619 299551 343197 374334 321658
17814 321658 259987 256818 246793 244415 272721 357069 367363 367659 365516 445490 420655 301415
17802 301415 271699 315362 310474 320101 330229 329442 306147 264552 282302 320096 261794 205307
17790 205307 120730 164463 249572 301739 276916 260225 187062 164130 155724 200051 194745 174843
17778 174843 170873 161733 169332 148160 197336 257113 219334 170067 208802 181321 165941 172259
17766 172259 199812 182572 192572 230868 190652 182532 168009 154832 188109 174615 148571 119661
17754 119661 119332 100566 140514 133605 97647 45654 -38591 4758 60984 75742 92309 89430
17742 89430 97294 121049 138404 164904 119577 106168 61763 91736 124332 118064 122027 76832
17730G6832L1633j1019l3024l4076J0170k9390n6954j7715N3524L7314N2699M991
17718H4985j0317m035M6736O088j521r802k2681P400J2889k0245j53O7821K6555
17705A83720j7998o6135o061n908M2785l4294o9994R0453q846m7939K7174n1365
17693C5592q1331l6792P8464O1260N818J1989J80o475n6519p271k0031m7499M2087
17680b0528P426K0235Q1480l179l0385N3230j9517K8746l2090j1517o9777k0393
17668a6269K6289L0719L6991K2018M7260J8330p5106p2939k629J2733L0996M0623
17656I9016k7884L2619M2595M0535k268k7149j907o2766q6516l932N1369J6215
17644F9927J2945L4443k1135K6329M6003K1114Q8917o0733J9309R4235o841q1793
$$ plain form
17730 76832 108465 97446 64422 30346 40516 11126 -45828 -63543 -10019 27295 79994 84985
17718 84985 74668 70633 117369 123457 121936 112134 89453 96853 109742 89497 89344 157165 183720
17705 183720 165722 99587 93526 87618 130403 96109 26115 116568 107722 59783 86957 35592
17693 35592 -45739 -82531 -4067 57193 63011 75000 75180 68705 12186 4915 -15116 -62615 -20528
17680 -20528 -13102 7133 88613 85434 55049 108279 88762 117508 85418 73901 4124 -16269
17668 -16269 10020 40739 77730 99748 147008 165338 90232 17293 14664 27397 58393 99016
17656 99016 71132 103751 146346 186881 184613 157464 155557 92791 6275 2343 53712 69927
17644 69927 82872 117315 96180 122509 168512 189626 278543 217810 237119 331354 324513 242720
17632B42720N459K8615n7426m3833K1829j391k622N5030m8074o7571K5284j0428
17620A47592R247J2391l138o6632L6413K7771j8618J7013j7939l6486J4379R0154
17608B12147P5154j8319p451N232n9152j342j1402l870L0680k1230K3361N5169
17596B78977k7428R301L0407k7913j8278M2420j6582K3891j2850K2210m7622J1814
17584B68347K7746k6153r7709L7846J9864l6625N4894L7658J3968l9917q7349
17573A72570j0045J5448o116P3491J6757j8865J8563l726K2842n3775n7047M0118
17561B10215j8155j8392O1181k2848q2217j0194P453J5710j8886P735j6267n7475
17549E7860P3601R1124L5945J8036K0759k1011k6325P150j1899M2156l491o4277
$$ plain form
17632 242720 248179 276794 219368 175535 197364 195973 193351 248381 200307 132736 158020 147592
17620 147592 156839 169230 166092 99460 135873 163644 145026 162039 144100 107614 121993 212147
17608 212147 287301 268982 261531 266763 207611 206269 194867 190997 221677 200447 223808 278977
17596 278977 251549 260850 291257 263344 245066 287486 270904 294795 281945 304155 256533 268347
17584 268347 296093 269940 172231 210077 229941 193316 248210 285868 299836 259919 172570
17573 172570 162525 177973 171857 245348 262105 243240 261803 258077 280919 227144 170097 210215
17561 210215 192060 173668 234849 212001 129784 119590 127043 142753 123867 131602 115335 57860
17549 57860 131461 222585 258530 276566 297325 276314 249989 257139 245240 287396 283905 219628
17537B19628j220O00o8540m0847L2583K019L1664N0215n006K218L7188J1228l1599
17524B40131K3064n2674p5094k3320M5275l9708N1303O6030K7830j6917p8119
17513A67801N2983q358k5367M7573k5774j15824m9469r48J7330K9119L5502L180
17501A27748j9312j6051m5900m1052n657J9106M8531N5837p398k647l2749j1147
17489F9309k6715J7677l4471k1363j431j2920P7963O8615L705j3476j0208K2250
17477A38935j6400n2341p3338M785J7293K8525K4076N1193M1193K8246m5567k994
17465A43606o6433m8297l1360j4563j7366N101N350K9363R201K0132K0699J5422
17453G0855N8153L6804m6601L2344n8143m5670j9205j4052j1038n994l0326p292
$$ plain form
17537 219628 218408 219008 150468 109621 142204 144223 175887 226102 221096 223314 260502 271730 240131
17524 240131 263195 210521 135427 112107 157382 117674 168977 235007 262837 245920 167801
17513 167801 220784 212426 187059 234632 208858 93034 43565 42617 59947 89066 124568 127748
17501 127748 108436 92385 46485 5433 -224 18882 67413 123250 115852 113205 80456 69309
17489 69309 42594 60271 25800 4437 3006 -9914 68049 136664 140369 126893 116685 138935
17477 138935 122535 70194 -3144 1641 18934 47459 71535 122728 163921 192167 146600 143606
17465 143606 77173 28876 -2484 -17047 -34413 -29312 -23962 5401 14602 34734 55433 70855
17453 70855 129008 165812 119211 151555 93412 47742 28537 14485 3447 -2547 -32873 -40165
17441d0165O6793K2546o1999n0930k3308K2611P1679M8114o3695k486K8947l1202
17429a3095q399m3919j7805K6180n327K0606K1828L3367j3504M5442K0170l8266
17417B7278n3148q1530j7203R544M0511K256M5980P3066m1531P5796J4071k7264
17405F7826n6891k7683o1962n526K4061J5442N9601K2176p9146l6412K2065j6681
17393g3130j3844p568K2428R166M6770O003J02749P496m1859M2481n2539p5196
17381b7043K2497M3870n930m3260K2697J1915n1393J3215Q65o3499K6366L0875
17369a8825M1722J03997K686m2929R627p7374l9829r177K3448q4652J2614K48
17357g8444N0472K6267N5317l5072p6094j302Q3197l009k1273P451n2833o321
$$ plain form
17441 -40165 26628 49174 -12825 -63755 -87063 -64452 7227 55341 -8354 -10840 18107 -13095
17429 -13095 -21494 -65413 -83218 -57038 -62365 -41759 -19931 13436 -68 45374 65544 27278
17417 27278 -25870 -107400 -124603 -115059 -74548 -72292 -26312 46754 5223 81019 95090 67826
17405 67826 10935 -16748 -78710 -84236 -60175 -44733 14868 37044 -42102 -78514 -56449 -73130
17393 -73130 -86974 -94542 -72114 -62948 -16178 -10175 92574 100070 58211 100692 48153 -27043
17381 -27043 -4546 39324 33394 -9866 12831 24746 -26647 -13432 -12567 -76066 -49700 -18825
17369 -18825 22897 126894 129580 86651 96278 18904 -20925 -30102 -6654 -91306 -78692 -78444
17357 -78444 -27972 -1705 53612 18540 -57554 -58856 24341 21332 59 7510 -45323 -51644
17345e1644Q3373M5416n3858j17027j103K4080O7313o357P746K3107J8193n0325
17333a1086n805K3306j0599M290M1271P4103L2377r785n3268k1170j2349k7660
17321B3625j0935p793J0473L66L2012P5845j9136k1615l9344n2342o0774J7053
17309e2565N1966q552k8352j65J3973J5153j805k5590n2645l4087N5107j1863
17297g9425O0995J06582R289q7404o8113J3061J4492R460k9250M1018P86q1760
17285i0269l6725K2991P9868N5708N459J7222L909k1132K9134r126o703k7917
17273B2419M703Q7124n7276n1186K8965n7414n4482k2771L0809J5989r701n79
17261f3400L833j6352J871R113k0206r878l8742O2389P2605k2139P1762k8505
$$ plain form
17345 -51644 31729 77145 23287 -93740 -94843 -70763 -3450 -9807 -2061 21046 39239 -11086
17333 -11086 -16891 6415 -4184 106 41377 115480 147857 138072 84804 63634 51285 23625
17321 23625 12690 4897 15370 15736 47748 123593 104457 82842 43498 -8844 -69618 -52565
17309 -52565 -599 -9151 -37503 -37668 -23695 -8542 -10347 -35937 -88582 -122669 -67562 -79425
17297 -79425 -18430 88152 97441 10037 -58076 -45015 -30523 -21063 -50313 -9295 -8509 -90269
17285 -90269 -126994 -104003 -24135 31573 37032 54254 58163 37031 66165 57039 50336 22419
17273 22419 27122 114246 56970 5784 34749 -22665 -77147 -99918 -69109 -53120 -62821 -63400
17261 -63400 -59567 -75919 -74048 -64935 -85141 -95019 -133761 -71372 1233 -20906 50856 22351
17249B2351p6267L2265M3795N2339J5101j3286k5071l4961p3513N630M1862k6619
17237c6374Q808O2419O5963n7981o5389p681k6866o7407M2216K3256K9747O5189
17225C5900j1592K6754M4895j3545n3524o6821r238L2137P897k1736l2894M7552
17213a4215N0567m0693j8442P0686L1557j01079j0366O1648k8303J296P9220M1024
17201A22900j5829m5922p5680k3505J6699k2512j4231n897L8468K8096k5534L6345
17189A3398N503j9080j6517o321P372K9510j5175q037L1850j8745l3440K4759
17177d923m2716n6454K1813Q0700Q4895m4916l0882K7936j1132M2455j8434n3376
17165e034k0241K4007J3385N2124o5899j1274O4642Oj5975L1925J9092p05R396
$$ plain form
17249 22351 -53916 -21651 22144 74483 89584 76298 51227 16266 -57247 -51617 -9755 -36374
17237 -36374 -27566 34853 100816 42835 -22554 -30235 -57101 -124508 -82292 -59036 -29289 35900
17225 35900 24308 51062 95957 82412 28888 -37933 -47171 -15034 -7137 -28873 -61767 -14215
17213 -14215 36352 -4341 -22783 47903 79460 -21619 -31985 29663 1360 2656 81876 122900
17201 122900 107071 61149 -14531 -38036 -21337 -43849 -58080 -63977 -25509 2587 -22947 13398
17189 13398 18901 -179 -16696 -23017 -15645 13865 -1310 -9347 22503 3758 -29682 -4923
17177 -4923 -47639 -104093 -82280 -1580 83315 38399 7517 35453 24321 66776 48342 -5034
17165 -5034 -25275 -1268 12117 64241 -1658 -12932 51710 51716 35741 67666 86758 86053 95449
17152I5449J8480n6489n6657k3313J2034j6565m4170P5295N6596n4518o0016P3727
17140A9853k7760P330l619N1082q956l2442q3508k9657L92K997j8968J0727j901
17127a14430q01K9707j2358K0050N6865N1855N1908k262k2219J9264K453n9139
17115B0893j2982N3982K187l1110o8083M32M0437p745n372k6669Q508J6741l7878
17102d6659k4033j9583j4232N0101L286k4077N8153R935J578N0503L9185Q9J331
17089H5577L2950n2525l0273l1892k9342K9824Q0062J2092r0686m1308K4397L9204
17077B8080n5342L0861M7370m1461j8934j0248o6270o5980L658N7578Q793M3849
17065c8046J0903R2731L5277k2102l1256l5520m0319J0431q356N1114q632k5830
$$ plain form
17152 95449 113929 57440 783 -22530 -10496 -27061 -71231 4064 60660 6142 -53874 19853
17140 19853 -7907 -577 -4196 46886 37930 5488 -78020 -107677 -107285 -104288 -123256 -112529 -114430
17127 -114430 -115231 -85524 -97882 -77832 -20967 30888 82796 80534 58315 77579 80032 20893
17115 20893 7911 61893 64080 32970 -35113 -34681 5756 -1989 -7361 -34030 -25522 -8781 -46659
17102 -46659 -70692 -90275 -104507 -54406 -51120 -75197 -17044 -7109 -5531 44972 84157 84246 85577
17089 85577 118527 66002 35729 3837 -25505 4319 84381 96473 5787 -35521 -11124 28080
17077 28080 -27262 3599 50969 9508 -9426 -19674 -85944 -151924 -148266 -90688 -81895 -38046
17065 -38046 -27143 65588 100865 78763 47507 11987 -28332 -17901 -26257 24857 16225 -9605
17053i605p3950M2107l1376J5929L6100l0873l5107N8093L4513K2132p630k2720
17041b387J2829j1720K1457K3693M502l4153m792l2962j7995N363J5596J03342
17029H2773K9580l6842k9437l740k6727p661j0254K14J1678k6950o7576J9165
17017f5777J19172K2125l7695o4606q950K7080K3274j4411O6784K3318n3242l805
17005C3267R232J7812K4003L950m0784k9431L8211K5991j5675j1420k6020q67
16993B8269J3841m0751N86K6317k2597J9758k0611o482k1647l595M2581l5399
16981a9730o3711K3374M5096R653N7802K9369m8464L9344q823m4346m1005j01340
16969a22781j4087J23514P743q9222m8974P1716J8716k2543l0168K4366J6973
$$ plain form
17053 -9605 -83555 -41448 -72824 -56895 -20795 -51668 -86775 -28682 5831 27963 20333 -2387
17041 -2387 10442 -1278 20179 43872 48374 14221 9429 -23533 -41528 -36165 -20569 82773
17029 82773 112353 75511 46074 42334 15607 7946 -2308 -2094 9584 -17366 -84942 -65777
17017 -65777 53395 75520 37825 -26781 -35731 -8651 14623 212 66996 90314 37072 33267
17005 33267 42499 60311 84314 88264 47480 18049 56260 82251 66576 55156 29136 28269
16993 28269 42110 1359 1945 28262 5665 25423 4812 -1670 -23317 -26912 15669 -19730
16981 -19730 -83441 -60067 -14971 -5318 52484 81853 33389 72733 63910 19564 -21441 -122781
16969 -122781 -136868 -13354 -5611 -94833 -143807 -72091 -53375 -75918 -106086 -81720 -64747
16958f4747k7501l0604j736m7622l8778o233M5714K7552J9124Q0519r567m0347
16946i4226L3758N0052M521N72J037m479m13n7760k1787l12N4807K5465K1396
16933A2631q782o5964K3744K5208j78n9567l8208J6479O2282M2601o139L8428
16921D2535K4463n3256n6103k2650K6818L0677k2956J0077J5210k150k7393O712
16909b8016l5793l962O879k4511P8637N2073l6748m0258M105K276L026q174M027
16896b6439o66M1840m818k8626R514K1360n9693o52k2600L227L6359L6392J8112
16883B3310n1335N532l8495k8718L4337l6738p3472K3462O5619o012M3989k9674
16871f8195n1575M12J9608Q9683Q1777O46j8685j2490R275m4780m8708o8314M8124
$$ plain form
16958 -64747 -92248 -122852 -124588 -172210 -210988 -217221 -171507 -143955 -124831 -44312 -53879 -94226
16946 -94226 -60468 -10416 -5895 -5323 -4286 -8765 -9178 -66938 -88725 -89037 -34230 -8765 12631
16933 12631 3849 -62115 -38371 -13163 -13341 -72908 -111116 -94637 -32355 10246 4107 42535
16921 42535 66998 13742 -42361 -65011 -38193 -7516 -30472 -20395 -5185 -7335 -34728 -28016
16909 -28016 -63809 -67771 -60892 -85403 -6766 45307 8559 -31699 -27594 -25318 -22292 -30466 -26439
16896 -26439 -27105 14735 9917 -18709 -9195 12165 -47528 -48180 -70780 -67553 -31194 5198 23310
16883 23310 -28025 -22493 -60988 -89706 -55369 -92107 -165579 -142117 -76498 -82510 -38521 -68195
16871 -68195 -119770 -119358 -99750 -10067 71710 72356 53671 41181 50456 5676 -43032 -111346 -63222
16858f3222L7722J3714l5990k3772r500J5430k6968o4718j7055J23364J05523
16847E4528l3989J1171n2060J061m687l0575q461k8724l6103P960K0891j7459
16835a16447Q893M4787K2329P00p416M14k1733n3523p0301O6552O2407l4794j1260
16822a09392p4132K6893P5240P570R921k9160L7679N7460K0085j7572K4414M8710
16810G7716k2438k9195K9394k1226k2219m9273m0583q846j852P7930N4695q7326
16798d3223l2930n970K9417P9790O4021J0701p408q6488j8278q78M8157K3731
16786F0642L3508R496q147L6498l2627k1064k5877N141M008m2538j1390l1235
16774b3585o5311Q518M9289p680Q303O3459J5202J693p2815P352j9438k532P9946
$$ plain form
16858 -63222 -25500 -11786 -47776 -71548 -81048 -65618 -92586 -157304 -174359 -50995 54528
16847 54528 20539 31710 -20350 -19289 -23976 -54551 -63012 -91736 -127839 -119879 -98988 -116447
16835 -116447 -107554 -62767 -40438 -39738 -47154 -46740 -68473 -121996 -192297 -125745 -63338 -98132 -109392
16822 -109392 -183524 -156631 -81391 -73821 -63900 -93060 -55381 2079 22164 4592 29006 77716
16810 77716 55278 26083 55477 34251 12032 -37241 -77824 -86670 -88522 -10592 44103 -43223
16798 -43223 -76153 -82123 -52706 27084 91105 101806 94398 7910 -10368 -11246 36911 60642
16786 60642 94150 103646 95499 131997 99370 78306 52429 57570 61578 19040 7650 -23585
16774 -23585 -88896 -80378 -31089 -38769 -30466 32993 48195 49888 -22927 -15575 -35013 -37545 42401
16761D2401K8186Q27p9529q3203k9245P2186J03975j5825r2407Q506Q1298M917
16749D2087K084M424j09580r0279P888l2174j9026P2025N1514Q812k7145q4426
16737a73796k5078J06164P9736p194M1072O6842m5601o0451M7167J1231l9939
16726A53K0264k6184m5777q3746k0121L3863Q8595O1569l2782r4387m3761o264
16714a48578P4206J2432L3343L6340O0501P1066j1340M5117m4818n8597L505P40
16702G3917l6387j9863l0046r0731l7432J357L7371R6724R170j27537m378M0401
16690h7434q439k1620J0813O844K5333K8814J8049L181R495k7655l2636m6689
16678a21944N0010K1515J5093O0279J218k6912J3695J16796j1101m4138m9007
$$ plain form
16761 42401 70587 71414 -8115 -91318 -120563 -48377 55598 39773 -52634 -44128 37170 42087
16749 42087 44171 48595 -60985 -151264 -143376 -175550 -194576 -122551 -71037 -62225 -89370 -173796
16737 -173796 -198874 -92710 -12974 -20168 20904 87746 42145 -18306 28861 40092 153
16726 153 20417 -5767 -51544 -135290 -155411 -121548 -32953 28616 -4166 -98553 -142314 -148578
16714 -148578 -74372 -61940 -28597 7743 68244 139310 127970 173087 128269 69672 73177 73917
16702 73917 37530 17667 -12379 -103110 -140542 -139185 -101814 -5090 4080 -123457 -127835 -87434
16690 -87434 -95873 -117493 -106680 -99836 -74503 -45689 -27640 -24459 -14964 -42619 -75255 -121944
16678 -121944 -71934 -50419 -35326 24953 26171 -741 12954 129750 118649 74511 25504
16667B5504m7248L1782J0528M3741j1150L5743P8459p2642q4225o6392n2436J4094
16655i4242Q4283N0824p4007k2288P1716j7922o5728R084K3548N0080J1860p972
16643A9236J3764m5408n9046m0568m8741N8658M2105j4279N4281J8629K9907j2890
16631A5648R401o604j8088L6372J4548m577k6363P157m5414k0760J6261l2666
16619e5085k540l8039K6720N5575k5120K7968K2885N4276m5461p3133j5522n8109
16607a25585k0413m8942l6814N2438N5581K2020K1528K5319k5865n832P637J0752
16595f8176O3553p053j4441K2708o821n6758J9781R800j3132L1734L8010m43L8492
16582E7254O094k0871j1584o8818m0715M0419L0627N027o7117l7493N8195L9357
$$ plain form
16667 25504 -21744 10038 20566 64307 53157 88900 167359 94717 10492 -55900 -108336 -94242
16655 -94242 -9959 40865 -33142 -55430 16286 -1636 -67364 -58280 -34732 15348 27208 19236
16643 19236 33000 -12408 -71454 -112022 -160763 -102105 -60000 -74279 -19998 -1369 28538 15648
16631 15648 25049 18445 357 36729 51277 46700 20337 27494 -17920 -38680 -22419 -55085
16619 -55085 -57625 -95664 -68944 -13369 -38489 -10521 12364 66640 21179 -51954 -67476 -125585
16607 -125585 -145998 -194940 -231754 -179316 -123735 -101715 -80187 -54868 -80733 -86565 -78928 -68176
16595 -68176 -4623 -11676 -26117 -3409 -10230 -66988 -47207 -37407 -50539 -18805 19205 18762 57254
16582 57254 63348 42477 30893 -37925 -78640 -38221 -7594 -2567 -69684 -107177 -48982 -9625
16570i625M0115k0838j7364m7614J5369p9081k0656l760N0551O4350m2250n9341
16558a30144j6183m658N711j4356N6776K4504l695l6262k3660O2971M9091L5007
16546E102J8486L3908l9106k0969j9866p614O769k3507L5903J973J8499l874Q577
16533A4281l4637n9483J2167j069M403K9979O4820j4442n9605K1070M7096L3207
16521E7787m1261j9100k5159j7206J467L9181k0757q6615j883L8950M4519O316
16509b3761M3265j2956n8350n774j4050Q0860O2191l1076Q597r0740o6400q922
16497a17116K3023L0499J8742L8163r487J322K7777m0934Q182j3341o4480l9832
16485a37482K1933J1735j6546m888L3002N152P4754n3442m9628L2735J7541K7037
$$ plain form
16570 -9625 30490 9652 -7712 -55326 -39957 -119038 -139694 -143454 -92903 -28553 -70803 -130144
16558 -130144 -146327 -150985 -145274 -159630 -102854 -78350 -82045 -118307 -141967 -78996 -29905 5102
16546 5102 23588 57496 18390 -2579 -22445 -30059 -23290 -46797 -10894 -8921 9578 5704 14281
16533 14281 -20356 -79839 -67672 -68741 -64338 -34359 30461 16019 -43586 -22516 24580 57787
16521 57787 16526 -2574 -27733 -44939 -43472 -4291 -25048 -111663 -113546 -74596 -30077 -23761
16509 -23761 19504 6548 -51802 -57576 -71626 9234 71425 40349 48946 -41794 -108194 -117116
16497 -117116 -94093 -63594 -44852 -6689 -16176 -14854 12923 -28011 -19829 -33170 -97650 -137482
16485 -137482 -115549 -103814 -120360 -125248 -92246 -87094 -12340 -65782 -115410 -82675 -65134 -38097
16473c8097j6058n9226l6115M7203L3077J61k8168M7613p879J2946J13646M30
16461F9533q2161n3372J5949J6243m5666j5069J9480N6752J6579l9159K1103R0043
16449G0255j9490J3394o305k9066q315J6979J3433n0329k9780k4239N2989J0846
16437A0372p251K312j073o758L9439M792j02439j882J759M9211L7875p520p2043
16424e3206p4231N7420k8623Q4400L4365n5075K5778J1685k7344N3774o4407o7533
16412a02997k6599R641O9822N3639r713N4953J1919m3457q9187m4184n8439q438
16400a83040P7524K0150K8153J01031j7470m1714K2787N5274J0065m2551j0617
16389A9592l8232N4862L8488k723j1363l5323P2925m3968J6755k0874l0931j6229
$$ plain form
16473 -38097 -54155 -113381 -149496 -102293 -69216 -69055 -97223 -49610 -57489 -44543 69103 69533
16461 69533 -12628 -66000 -50051 -33808 -79474 -94543 -75063 -18311 -1732 -40891 -19788 70255
16449 70255 50765 64159 57854 28788 20473 37452 50885 556 -29224 -53463 -474 10372
16437 10372 3121 5433 4360 -2398 37041 41833 -60606 -62488 -60729 -11518 26357 18837 -53206
16424 -53206 -127437 -70017 -98640 -14240 20125 -34950 -9172 2513 -24831 28943 -35464 -102997
16412 -102997 -129596 -119955 -50133 3506 -6207 48746 60665 17208 -71979 -116163 -174602 -183040
16400 -183040 -105516 -85366 -57213 43818 26348 -15366 7421 62695 72760 30209 19592
16389 19592 -18640 36222 74710 71987 60624 25301 98226 54258 71013 50139 19208 2979
16377B979j6276j0697L5705j9535L5639L3012J4252p6109m1484K2423k857K417
16365b0531k6352p2941P156p178n0490n746K1883q8536l2341R6980R5335O2217
16353b0544q636m891j8803J1111K2546n627K010l8087r253O3894l8579k9517o6581
16340a40957j5885J3419o638K4818r52k8572M7467M0581L2126n990p7752J3412
16328a04923L1326m844K5204R515j3010r044L6198L2410j3970Q193n2976p8932
16316a34853M5612J14238J3284p0951k4616L2411J5818N4882k6383p3664R969
16305d4253L0392o0849j0333O8439J9435n7546m8333L0745K9700q540j6344k393
16293f9880P068m067O903l527m7019P433M0159j2144n4876L2816N7157J7369N727
$$ plain form
16377 2979 -13297 -23994 11711 -7824 27815 60827 75079 -1030 -42514 -20091 -22948 -20531
16365 -20531 -46883 -119824 -112668 -119846 -170336 -176082 -154199 -242735 -275076 -178096 -82761 -20544
16353 -20544 -29180 -34071 -52874 -41763 -19217 -24844 -22834 -60921 -70174 -6280 -44859 -74376 -140957
16340 -140957 -156842 -143423 -150061 -125243 -126195 -154767 -107300 -66719 -34593 -40583 -118335 -104923
16328 -104923 -73597 -78441 -53237 -43722 -56732 -65776 -29578 2832 -11138 -2945 -55921 -134853
16316 -134853 -89241 24997 38281 -32670 -57286 -24875 -9057 45825 19442 -54222 -44253
16305 -44253 -13861 -74710 -85043 -16604 2831 -54715 -103048 -72303 -42603 -51143 -67487 -69880
16293 -69880 -62812 -66879 -59976 -63503 -110522 -103089 -62930 -75074 -129950 -97134 -39977 -22608 -16881
16280a6881m3494J7887k9877j5707J7232J691k2259N9301M3715p2781k4075m0215
16268a25463M6027N0800J0831k987O890K940Q961m647j0345P736L7343K7928l6489
16255A9525L0514q0894l0224L2208K2446l2410L0684Q642n463l5016k8527O7764
16243g51K9351n883l8031k3246L7765M9382k6090m108j3703n8881p2549K9536
16231i7208K1422m9L0951R421L806L4472J5608p2303o8675O41m2558N4045M7778
16218f2649L8758O8273k7016j3153K6550j218j7061M741J0438m3678m5893o300
16206f8208O966J2066q137k6338M4496J5822J0863M7239k799j9829m9060J998
16194c4921J7282L3345n8574m5638N7632M5272q6229j9740M8455P803J6513p1472
$$ plain form
16280 -16881 -60375 -42488 -72365 -88072 -70840 -69149 -91408 -32107 11608 -61173 -85248 -125463
16268 -125463 -79436 -28636 -17805 -20792 -13902 -10962 -2001 -6648 -16993 -9257 28086 56014 19525
16255 19525 50039 -30855 -61079 -28871 -6425 -38835 -8151 491 -4972 -39988 -68515 -751
16243 -751 28600 22717 -15314 -38560 -795 48587 22497 18389 4686 -54195 -126744 -97208
16231 -97208 -75786 -75835 -44884 -35463 -31657 2815 18423 -53880 -122555 -121914 -164472 -110427 -62649
16218 -62649 -23891 44382 17366 4213 30763 29545 12484 17225 27663 -16015 -61908 -68208
16206 -68208 -61242 -49176 -57313 -83651 -39155 -23333 -12470 34769 31970 12141 -36919 -34921
16194 -34921 -17639 15706 -42868 -88506 -30874 14398 -71831 -91571 -43116 -35313 -18800 -90272
16182i0272j0159K5307J1395O4613N6644M4616p457q2352q9927k6250P5079N2235
16170B3472K0168j2892k0405m7542j3342N2199L4205K4977Q06J153m81m7753J6244
16157C0809o831n9554L4612j1335j3115M5690m1548j0785P2038J5130r833n5564
16145a0286j8605l7784p9708Q059R450M0379L8082M9241l5348k0120J699k7384
16133h2325j6067O7304J3492k4436J1844j5287K0887O4770n1189j10631p8179
16122a99817K7163Q2342K4937P990K043l0369K3463L5542O801Q398k0233m0204
16110g1944K8727J2353k7240O90J7689L5865K273n5770J0759n7263J6995P6209
16098a0657j4170k9648k4777k136N3931Q0954J3579k4612k4496k5506l6868l2353
$$ plain form
16182 -90272 -100431 -75124 -63729 884 57528 102144 94687 12335 -77592 -103842 -28763 23472
16170 23472 43640 30748 10343 -37199 -50541 1658 35863 60840 61646 62799 62318 14565 30809
16157 30809 23978 -35576 -964 -12299 -25414 20276 -21272 -32057 39981 55111 45278 -10286
16145 -10286 -28891 -66675 -146383 -138324 -128874 -88495 -50413 -1172 -36520 -56640 -54941 -82325
16133 -82325 -98392 -31088 -17596 -42032 -30188 -45475 -24588 40182 -11007 -121638 -199817
16122 -199817 -172654 -90312 -65375 -57385 -55342 -85711 -62248 -26706 -19905 -11507 -31740 -71944
16110 -71944 -43217 -30864 -58104 -57414 -39725 -3860 -1587 -57357 -46598 -103861 -86866 -10657
16098 -10657 -24827 -54475 -79252 -81388 -27457 53497 67076 42464 17968 -7538 -44406 -76759
16086g6759o1810M7437J8914j2725M4389M685M8462K3836j1441l239K9592O255
16074E7596q4801o4762K4577M6663k7705j1620m564k1116N4414O9007l1834n801
16062E4k5841p704m133j5823n7859R015q519l0472O7454L8696q0004q8021N2417
16049a50740O7355N2980N294P161N2697K1999J842k3277k9922L1090J0141k1027
16037B5593L0562J3539J1701M9366m2731o8204l1964l2109J0223J6764o3399m3080
16025a23739l783j3890j5736N150M6924L0269O205L671m2535L8956Q42J3383l064
16012e7347R162m2166J1561N5506Q1550j798m7599n5299L0005k9943o2228l4865
16000a43461J1463k5088L1471j8351k2534L4887Q0991K6294L734L5326m5238o4209
$$ plain form
16086 -76759 -138569 -91132 -72218 -84943 -40554 -35869 12593 36429 24988 21749 51341 57596
16074 57596 -27205 -91967 -67390 -20727 -48432 -60052 -64616 -85732 -31318 37689 5855 54
16062 54 -25787 -33491 -37624 -53447 -111306 -102291 -110810 -141282 -73828 -35132 -115136 -203157 -150740
16049 -150740 -83385 -30405 -25111 -17950 34747 56746 58588 35311 5389 36479 46620 25593
16037 25593 56155 69694 81395 130761 88030 19826 -12138 -44247 -34024 -17260 -80659 -123739
16025 -123739 -127522 -141412 -157148 -151998 -105074 -74805 -68600 -64929 -107464 -68508 -67666 -54283 -57347
16012 -57347 -48185 -90351 -78790 -23284 58266 56468 8869 -46430 -16425 -46368 -108596 -143461
16000 -143461 -131998 -157086 -125615 -143966 -166500 -131613 -50622 -24328 -20594 14732 -30506 -94715
15988i4715L1077N1649k6800l5819k1536L9736N2011j5918p700N2779N6571n0518
15976C0817p277k9483J973m247J266J0797N1606N382N970n8625n5306k484N8710
15963I099j7225K5903k4174l6932k9397k8443J2238M199l059O0472K1746L6982
15951C1409J7274K0689R488l9132k3941k3594l5830k2674P9371j6781j1060L8851
15939B4070m7435J311k601K5417j4511L1956j7048m9268J4171k298P210j8813
15927d7839R9056N0749o5562k8481J3074l2877j51664J756J31931L2636J0982
15916A3761o0135l5982R9714o635k2763M6479O0889k2130k5666q911L0659N6459
15904A25739m3192q8744o0514q819P2256K0728j5485l9748l2451m2046K1766M5663
$$ plain form
15988 -94715 -63638 -11989 -38789 -74608 -96144 -56408 -4397 -20315 -28015 24764 81335 30817
15976 30817 23540 -5943 -3970 -8217 -6951 3846 55452 60834 66804 8179 -47127 -49611 9099
15963 9099 -8126 17777 -6397 -43329 -72726 -101169 -88931 -84732 -87791 -27319 -5573 31409
15951 31409 48683 69372 78860 39728 15787 -7807 -43637 -66311 13060 -3721 -14781 24070
15939 24070 -23365 -22054 -24655 762 -13749 18207 1159 -48109 -33938 -36236 -29026 -47839
15927 -47839 51217 101966 36404 7923 20997 -11880 -163544 -161788 -29857 2779 13761
15916 13761 -46374 -82356 17358 10723 -12040 34439 95328 73198 47532 38621 69280 125739
15904 125739 82547 -6197 -66711 -75530 -3274 17454 1969 -37779 -70230 -112276 -90510 -44847
15892d4847l6775m1594M009L2826M4352o6691j8092K5753j2081N140O7193K3519
15880a7288N1492m0800L1085J9876p6230l0998L661R1243q398q761m2191j3255
15868d0564m3752j9355m715j2687n7030O9362O1244L6885q685m4740m7717m751
15856a16505L9732L1393P41j07880l0991P3466P8579M7002K0797l489K7629k1729
15844C8745n4754M8857L2765j6930K6030n5995o2933J0819Q1487r922J623J7576
15832E7368K0894l7605n9767j6822l0245l8216J5246J0099L3057l1796L4486o7266
15820a10567l2393O1489q229O8917j2705j5941k2872k3249P1911K857J0153M1238
15808C0609k8384j3239K6580K0016k2322n509J2016L0990k0494n3447o1915j7688
$$ plain form
15892 -44847 -81622 -123216 -119207 -86381 -42029 -108720 -126812 -101059 -113140 -108000 -40807 -17288
15880 -17288 34204 -6596 24489 44365 -31865 -62863 -59202 32041 23643 14882 -27309 -40564
15868 -40564 -84316 -103671 -108386 -121073 -178103 -108741 -47497 -10612 -19297 -64037 -111754 -116505
15856 -116505 -76773 -45380 -44639 -152519 -183510 -110044 -31465 15537 36334 32845 60474 38745
15844 38745 -16009 32848 65613 48683 74713 18718 -44215 -33396 48091 38169 39792 57368
15832 57368 78262 40657 -19110 -35932 -66177 -104393 -89147 -79048 -45991 -77787 -43301 -110567
15820 -110567 -142960 -81471 -89700 -20783 -33488 -49429 -72301 -95550 -23639 -20782 -10629 30609
15808 30609 2225 -11014 15566 35582 13260 7751 19767 50757 30263 -23184 -85099 -102787
15796a02787j7388J6415L2267j97L2146l0406k0074j3413j7086l9222J02092O5291
15784G638k719n4358M694R806j9928N5826n1559J259J1730j6964L2194j1603n5414
15771h9398j6008M5335j3598j0426r144l421P077m1415k060L6891L035l3820m0867
15758a67819j7619Q7066K581j1705J03785P8718n6637m5006L868P302K6443k9960
15746a8983n1489l3701m6927o594J4206P9250M2878O364k9482K3181J0036M067
15734g194l9041q2941J809J9797l5151O124M9247P444P8581L199J436K1191l9078
15721a4577l350r060M9132j6323m7487M8146J3602j7258L2846o0761N1142N6947
15709H2999l0283o2943l6382K274l1091J199k0561J07070K802l6550k0008M7694
$$ plain form
15796 -102787 -120175 -103760 -71493 -71690 -39544 -69950 -90024 -103437 -120523 -159745 -57653 7638
15784 7638 4919 -49439 -44745 -34939 -54867 959 -50600 -49341 -37611 -54575 -22381 -33984 -89398
15771 -89398 -105406 -60071 -73669 -84095 -93239 -96660 -89583 -130998 -133058 -96167 -93132 -126952 -167819
15758 -167819 -185438 -98372 -95791 -107496 -3711 75007 18370 -26636 -22768 -15466 10977 -18983
15746 -18983 -70472 -104173 -151100 -157694 -143488 -64238 -21360 -14996 -44478 -21297 -11261 -7194
15734 -7194 -46235 -129176 -127367 -107570 -142721 -136597 -87350 -79906 -1325 1874 3310 24501 -14577
15721 -14577 -17927 -26987 22145 5822 -41665 6481 20083 2825 35671 -25090 26052 82999
15709 82999 52716 -10227 -46609 -44335 -75426 -74227 -94788 12282 15084 -21466 -41474 6220
15697F220K9106L0151N2675M349p143n6026p9352Q415j04366m5202M8004L3957
15685g9212K6004j23232P3854J21080k3222k6634K5125j1538Q412m8337j0109
15674f7809Q4444n432N837J8256l0835J8039q3142k6589K2974l5079j3482J5855
15662i6963J35L996p957K9721P6213j763l7416l3225n3065m288K5618K6422k1606
15649i4178J6119R9952j6694o4607k6589m7440O2495K1072K2147O7078N1145l0999
15637E9501m3397n8393m5852j7204l5172R887O6701R1284K4050o1864l8554m8486
15625i7499o2736K6794J03390M5263l6283J6764n4153k0975K2805L5079j0632
15614c2183k3916j4212O1388K1702p7304j2867M9976L8860j4931P3121l8055K9001
$$ plain form
15697 6220 35326 65477 118152 122501 115358 59332 -20020 -11605 -115971 -161173 -113169 -79212
15685 -79212 -53208 -176440 -102586 18494 -4728 -31362 -6237 -17775 -9363 -57700 -67809
15674 -67809 16635 11203 17040 35296 4461 22500 -60642 -87231 -64257 -99336 -112818 -96963
15662 -96963 -96828 -92832 -100789 -71068 5145 3382 -34034 -67259 -120324 -124612 -98994 -72572 -94178
15649 -94178 -78059 21893 5199 -59408 -85997 -133437 -70942 -49870 -27723 39355 90500 59501
15637 59501 16104 -42289 -88141 -105345 -140517 -130630 -63929 27355 51405 -10459 -49013 -97499
15625 -97499 -160235 -133441 -30051 15212 -21071 -4307 -58460 -79435 -56630 -21551 -32183
15614 -32183 -56099 -70311 -8923 12779 -64525 -77392 -27416 11444 -3487 69634 31579 60580
15602F0580L9918l6468n1171p4383K6324k7553o9304l0342j5507L5230P3366O6235
15590c075k6756j6845O8726L0418n3063n9183q2665J9476r080N2037Q8275O3340
15578G1605k5193p5646k9353N0875l5519O7137J31090K635j49236n6587K5795
15567b2397O8535m2070n8450J5225l1708P767N9616k1894o5795k1822m5144n4672
15555b12809N3925Q7787K7408n3537m8429M5412L2497J9728o4572k767K5128p18
15543i0947L8965K3983j106J0083R474l1539L6140l517l9366K4898P116J1701
15531d115J622l6893q24L0424M7356j7949j02098n0119l7047J2363R4763R616
15519e2901j7030j554P4291M0030l6303J5393N976N100j8171j9421k4129J8685
$$ plain form
15602 60580 100498 64030 12859 -61524 -35200 -62753 -132057 -162399 -177906 -142676 -69310 -3075
15590 -3075 -29831 -46676 22050 52468 -595 -59778 -142443 -122967 -132047 -80010 8265 71605
15578 71605 46412 -29234 -58587 -7712 -43231 23906 154996 157631 8395 -48192 -22397
15567 -22397 46138 4068 -54382 -39157 -70865 -63098 -3482 -25376 -91171 -112993 -158137 -212809
15555 -212809 -158884 -71097 -43689 -97226 -145655 -100243 -67746 -48018 -112590 -115357 -90229 -90947
15543 -90947 -51982 -27999 -29105 -19022 -9548 -41087 -4947 -8464 -47830 -22932 -15816 -4115
15531 -4115 -2493 -39386 -40210 -9786 37570 19621 -82477 -132596 -169643 -157280 -62517 -52901
15519 -52901 -69931 -71485 2806 42836 6533 21926 27902 33002 14831 -4590 -28719 -10034
15507a0034J9349K9269k3789k7509k4606N0143K5053l051Q889l9292m169J1565
15495A1818k7624j2564K8425K3588R8570J34097j2274j26189q8864m0745k6192
15484c7954m4905J1438L584M5169K3610M1635K9169J3030n5104j4451l3911j4569
15472c3259j5593k131k8624m0151k7644j7665j4600K4223l897N0938L4984N6985
15460a6434N5828L2305l8143k0834n3668k7621K9053M1390M6435q0517p2774J1929
15448i3051j5571l0179O1220M7061j7469m3913Q675J851j4731j211P1799N374
15436b0145M694K5178n5996k4737j5239j0189K5593l5413j5262k2005j4564M5631
15424a12454L8079N77M4781M9436L9220L7517M6482l9273j43211k5233r2477j499
$$ plain form
15507 -10034 9315 38584 14795 -12714 -37320 12823 37876 34825 43714 4422 253 11818
15495 11818 -15806 -28370 55 23643 122213 256310 244036 117847 28983 -11762 -37954
15484 -37954 -82859 -71421 -67837 -22668 942 42577 71746 84776 29672 15221 -18690 -33259
15472 -33259 -48852 -50983 -79607 -119758 -147402 -165067 -179667 -155444 -159341 -108403 -73419 -16434
15460 -16434 39394 71699 33556 12722 -40946 -68567 -39514 1876 48311 -32206 -104980 -93051
15448 -93051 -108622 -138801 -77581 -30520 -47989 -91902 -83227 -81376 -96107 -97318 -25519 -20145
15436 -20145 -15451 9727 -46269 -71006 -86245 -96434 -70841 -106254 -121516 -143521 -158085 -112454
15424 -112454 -74375 -73798 -29017 20419 59639 97156 143638 104365 -38846 -64079 -156556 -158055
15412a58055N2474P7367j4709J6086n4010m5295r890l9400M4828M6514J5170n4037
15400a22957j9055P9746K8564o3814L339M0761n1572n4979L3865O5271K0576k5643
15388f5898o6074o6049l1776n700L4702K0219K5228J5497L2094o008o8075J9451
15376a62389O5287Q169m2911o305j6433J6563K1836k2O641O4329p680j6530l9334
15363a08779N2992O5470J0464o528k8799k7407l1506K4855J9339j5373n6897J2243
15351h9926K8298L3085J1665K2311m9189o3849j2943L1714K5447L2486K6716k6478
15339c0663n6014J0188n8203l8094O5247K7088K014O2033Q3385K5393p5225k2119
15327d970k2734M917J4966Q790k6200j3661l4852o2653N5253Q4643L9420k0460
$$ plain form
15412 -158055 -105581 -28214 -42923 -26837 -80847 -126142 -136032 -175432 -130604 -84090 -68920 -122957
15400 -122957 -142012 -62266 -33702 -97516 -94177 -53416 -104988 -159967 -126102 -60831 -40255 -65898
15388 -65898 -131972 -198021 -229797 -235497 -200795 -180576 -155348 -139851 -107757 -113765 -181840 -162389
15376 -162389 -97102 -88933 -131844 -138149 -154582 -138019 -116183 -116205 -109564 -45235 -52915 -69445 -108779
15363 -108779 -55787 9683 20147 13619 -15180 -42587 -74093 -49238 -29899 -45272 -102169 -89926
15351 -89926 -61628 -28543 -16878 5433 -43756 -107605 -120548 -88834 -63387 -30901 -4185 -30663
15339 -30663 -86677 -76489 -134692 -172786 -107539 -80451 -78437 -16404 66981 92374 17149 -4970
15327 -4970 -27704 -22787 -7821 969 -25231 -38892 -73744 -136397 -81144 3499 42919 22459
15315B2459J0622j2798p7732q7262q688M0560J2199K7793j585L2146L7181j4359
15303a9464j7135M2515J1420K7185k336l0843m4632m1585j7107L410k4381M0910
15291g2043O0613K5435k4457p1973m6807L6281Q9050k4756q2811P294M1330N298
15279e7546L2574R383l5694m1515j7697N5281M6341Q8940n0638r6146l2927j8184
15267a17828m6305N828Q8608R8452K3686p3980j30994Q686N349j4236K5283O7459
15255e9992L1781n0857q527K0397j8123l0643J1627L6210P1775Q336j5802n7732
15243f1550m0916K0656k4867o0427M2101R2132k0616P3538O931l9183q2233j9492
15231a13926P6717P170k3603j4726n3817l9175j9063K6857O6190M0275Q9109J522
$$ plain form
15315 22459 33081 20283 -57449 -144711 -153399 -112839 -100640 -72847 -74432 -42286 -5105 -19464
15303 -19464 -36599 5916 17336 44521 42185 11342 -33290 -74875 -91982 -88572 -112953 -72043
15291 -72043 -11430 14005 -10452 -82425 -129232 -92951 -3901 -28657 -111468 -104174 -62844 -57546
15279 -57546 -24972 -15589 -51283 -92798 -110495 -55214 -8873 80067 29429 -66717 -99644 -117828
15267 -117828 -164133 -158305 -69697 28755 52441 -21539 -152533 -143847 -138498 -152734 -127451 -59992
15255 -59992 -28211 -79068 -87595 -67198 -85321 -115964 -104337 -68127 3648 11984 -3818 -61550
15243 -61550 -102466 -81810 -106677 -167104 -125003 -32871 -53487 20051 26982 -12201 -94434 -113926
15231 -113926 -37209 -30039 -53642 -68368 -122185 -161360 -180423 -153566 -87376 -47101 42008 43530
15219D3530J6777l7308K7371L7001o7566l1645k7617J2697j0113J3264m424n6841
15207h4874j0754k6383j6729J5395L6824K0488j0316K1637L518M2907M510J9274
15195A5497k2114n5434j3610K5587k3218j607J0654L3347Q0301j9925r0206M990
15183e5738R0894O8519j2066l6703j9389k9845j9524k3246N3322K0971l2258j3243
15171h306O9194L0961n8199n8963p540l5537k0422M3338l6455K5222J044l5894
15159i1557k6546r417L7519K5686N7449L2497K6914R042n0465m6839m9746J4666
15147g0797n5225P13M7935m7496j7464P1854l1073k9239J4468J3677L8282K2308
15135d2057j9619J624K5457q897J6680m9233O532K6844O3207l3836p1318K8968
$$ plain form
15219 43530 60307 22999 50370 87371 19805 -11840 -39457 -26760 -36873 -23609 -28033 -84874
15207 -84874 -95628 -122011 -138740 -123345 -86521 -66033 -76349 -54712 -51194 -8287 -3777 15497
15195 15497 -6617 -62051 -75661 -50074 -73292 -74899 -64245 -30898 49403 29478 -60728 -55738
15183 -55738 35156 103675 91609 54906 35517 5672 -13852 -37098 16224 37195 4937 -8306
15171 -8306 60888 91849 33650 -25313 -32853 -68390 -88812 -45474 -81929 -56707 -55663 -91557
15159 -91557 -118103 -127520 -90001 -64315 -6866 25631 52545 61587 11122 -35717 -85463 -70797
15147 -70797 -126022 -125309 -77374 -124870 -142334 -70480 -101553 -130792 -116324 -102647 -64365 -42057
15135 -42057 -61676 -60052 -34595 -43492 -26812 -76045 -69513 -42669 20538 -13298 -84616 -55648
15123e5648m2873M5184r355M473Q1456l1076r5574l0228O5493J3299j9843j6069
15111i0761r324K5325K9954l792o1263N329K8232J6750m0463o898J6880j9486
15099a09517J6746l7581M0226P1332J8369k3978R93o336k2165o3764m4011j1245
15087a70931K1274l9401L9464L9466O0844J1998j6171M8899K5068r4182k9216
15076a02888K4998N984m684M1926J4794J4149m8066k7803M5819n770K6548J1151
15064c842j0402p3672k9176m2528M6596J05118K3185L2088o683n3121l5691p123
15052e5251L2096L7601n7496l1545j061j3245J1157L725M8234J3885l1348K426
15040d0822N6901L3712k9255o5524m8887L528M7364J8527P522J7574j9174p6N3898
$$ plain form
15123 -55648 -98521 -53337 -62692 -58219 23237 -7839 -103413 -133641 -68148 -54849 -74692 -90761
15111 -90761 -100085 -74760 -44806 -48598 -109861 -104532 -76300 -59550 -100013 -106911 -90031 -109517
15099 -109517 -92771 -130352 -90126 -18794 -425 -24403 -23410 -29746 -51911 -115675 -159686 -170931
15087 -170931 -149657 -189058 -149594 -110128 -49284 -37286 -53457 -4558 20510 -73672 -102888
15076 -102888 -77890 -71906 -76590 -34664 -19870 -5721 -53787 -81590 -35771 -41541 -14993 -3842
15064 -3842 -14244 -87916 -117092 -159620 -113024 -7906 15279 47367 40684 -12437 -48128 -55251
15052 -55251 -23155 14446 -43050 -74595 -75656 -88901 -77744 -74019 -25785 -11900 -43248 -40822
15040 -40822 16079 49791 20536 -44988 -93875 -90347 -42983 -24456 -16934 640 -18534 -18610 35288
15027C5288M749j5963o9972o9892N8198O3983j6887Q693J00480j7370m6524l0444
15015D339J2526K9257r848o8209l6242J0624l9109K8015j8800J877k0882r986
15003a16438l1413q821R9531l0725N096J4592k2437Q8050N0558m4155r6805L2032
14991f0935o3634r4747N8898Q905k3437K2023J7601M1918J5337r901J6081K2599
14979d9292N228o7723R1929K5276o1474k0681q488o7849k6203L8398N0036R1913
14967A070M2689Q573k5491p5783l527l478o4968M194J9265o5766j6404N2107R6223
14954c1296J7472N430M4782j362j0527p189m0992J0862m2664N0289m382k9762
14942c9339l442m5819J9987Q041J991K5129J8407L867n237M8492M1112m3889p7841
$$ plain form
15027 35288 40037 24074 -45898 -115790 -57592 6391 -10496 -1803 98677 81307 34783 4339
15015 4339 16865 46122 36274 -31935 -68177 -57553 -96662 -68647 -87447 -85570 -106452 -116438
15003 -116438 -147851 -156672 -57141 -87866 -82770 -68178 -90615 -2565 47993 3838 -92967 -60935
14991 -60935 -124569 -219316 -160418 -151513 -174950 -152927 -135326 -93408 -78071 -87972 -71891 -49292
14979 -49292 -44064 -111787 -19858 5418 -56056 -76737 -85225 -153074 -179277 -140879 -90843 1070
14967 1070 43759 52332 26841 -48942 -52469 -55947 -120915 -116721 -97456 -163222 -179626 -127519 -31296
14954 -31296 -13824 -8394 36388 35026 24499 17310 -23682 -12820 -55484 -5195 -9577 -39339
14942 -39339 -42781 -88600 -68613 -60572 -58581 -33452 -15045 -11178 -16415 32077 73189 29300 -48541
14929d8541p7183q6705M3114Q5324J9297r2837k3057J20327M1971r6416j3816
14918a28522J6935K3192K1529L3092m8328r8456k2687M7476N8003J0884Q677K9052
14906d9153N2339o1373M3100K6133r6405l0031n0166l0781M2768L9261q638R925
14894a13021M8998P008q3603o0021K9213M6731m0076k0764Q7943J5584m7982K4651
14882a05339R504n9223k139N8589K1992r585N0252K2893k6254M2637l9545l3776
14870f9994M6754L4397j8059o8756m7680M9357J13300j1015o3605r0808N5919
14859g0190K2085j8318L657j1642M0154k709K2864N3605j3571p2680n3451k8863
14847a29059N7422O1307l2762r147K7484K9654k8940o3141J9359L4687N352J577
$$ plain form
14929 -48541 -125724 -212429 -169315 -83991 -64694 -157531 -180588 -60261 -18290 -114706 -128522
14918 -128522 -111587 -88395 -66866 -33774 -82102 -180558 -203245 -155769 -97766 -86882 -78205 -49153
14906 -49153 3186 -58187 -15087 11046 -85359 -115390 -165556 -196337 -153569 -114308 -122946 -113021
14894 -113021 -64023 -57015 -140618 -200639 -171426 -124695 -164771 -185535 -97592 -82008 -129990 -105339
14882 -105339 -95835 -155058 -157197 -98608 -76616 -86201 -35949 -13056 -39310 3327 -36218 -69994
14870 -69994 -23240 11157 -6902 -75658 -123338 -73981 39319 28304 -35301 -126109 -70190
14859 -70190 -48105 -66423 -62766 -74408 -34254 -36963 -14099 39506 25935 -46745 -100196 -129059
14847 -129059 -71637 -10330 -43092 -52239 -24755 4899 -24041 -87182 -67823 -33136 -27784 -26207
14835b6207L1273M8890j6288k3378m0647j6848m001n693l1740K850N0053j9019
14823e0755m1763J2967j7757k8738L6730q254r164J02549L7708l7501Q148M1802
14811D5972j5072j1264O4722j5450o7835m3494k9283p0375M2499L5372j2656j2641
14799h9505j0062N4423K4514m3008J3691l7141k2055K730P536k1035J5547J2215
14787i2150k1580m7964N3495k0441m222K8378n4043K7508j1941k374r127m6300
14775b00761j1903J04930P3462l9185m5635P885j1606M0695N5651L8219K2398
14764C4150k736k7344Q185k3877m6002J1269K5721j0393k9631O2902l339m5179
14752d6274R593O5723k8834l842k615j9996Q234p2529o4506p344P9839O8977l4990
$$ plain form
14835 -26207 5066 53956 37668 14290 -26357 -43205 -47206 -52899 -84639 -81789 -31736 -50755
14823 -50755 -92518 -79551 -97308 -126046 -89316 -97570 -106734 -4185 33523 -3978 4170 45972
14811 45972 30900 19636 84358 68908 1073 -42421 -71704 -142079 -99580 -64208 -76864 -89505
14799 -89505 -99567 -45144 -20630 -63638 -49947 -87088 -109143 -106413 -98877 -119912 -104365 -92150
14787 -92150 -113730 -161694 -108199 -128640 -132862 -104484 -158527 -131019 -142960 -145334 -154461 -200761
14775 -200761 -212664 -107734 -34272 -73457 -119092 -111207 -122813 -82118 -26467 11752 34150
14764 34150 31414 4070 12255 -11622 -57624 -46355 -20634 -31027 -60658 2244 -1095 -46274
14752 -46274 -36681 29042 208 -3634 -6249 -26245 -18011 -90540 -155046 -162390 -82551 -13574 -48564
14739d8564m6926o605l7179P9693j1604l009M0162M6895j1189K2559L2974l3058
14727B4149m8532M636o4472o1339M6739K7731j368k0332N0103k0765L9476k1653
14715d5627n1990P109J9101J0201K5916M8707l2021J5984O6963m763j1518R901
14703E7963o8364m0713r913J3973k040k4292J2903P478N0937k508k8985O778l3931
14690f0714J9614N605k5591o6046j2728O6373N8752J4606M2751N232q930k7624
14678A1300l563p475J4184m3786m5574J9616L3223Q094K8034l1039K4496N0575
14666E8085k9930m7872n6564L1582K9119K4118k2407k3608K5835K2078J5492R878
14654C5806q2197p1660k9295o511j8580J7674L4397P317M7003O340O1064K5136
$$ plain form
14739 -48564 -95490 -102095 -139274 -59581 -71185 -74194 -34032 12863 1674 24233 57207 24149
14727 24149 -24383 -19747 -84219 -145558 -98819 -71088 -72456 -92788 -42685 -63450 -23974 -45627
14715 -45627 -97617 -90508 -71407 -61206 -35290 13417 -18604 -2620 64343 59580 48062 57963
14703 57963 -10401 -51114 -61027 -47054 -49094 -73386 -60483 -53005 -2068 -4576 -33561 -26783 -60714
14690 -60714 -41100 -35495 -61086 -127132 -139860 -73487 -14735 -129 42622 47854 38924 11300
14678 11300 7737 262 14446 -29340 -74914 -55298 -22075 -13981 14053 -16986 7510 58085
14666 58085 28155 -19717 -76281 -44699 -15580 8538 -13869 -37477 -11642 10436 25928 35806
14654 35806 -46391 -118051 -147346 -153857 -172437 -154763 -120366 -113049 -66046 -59706 1358 26494
14642B6494l2463L643q309k3038n8164K9625l7363k4061K2301R4145l8075l7872
14630h3137J27230N8439j08475k1127J4896n7399n4881J0519Q137N6210J4287
14619c5301J7956k8427q825o6313K1665L7916m672l112M6799l5163k6469j8404
14607a02350K6633J4798J9310l8043n5392m103o0861O5536K1663j2116l776r148
14595a37849M1982j9001P204K8529j2354M8606j901j8235P7244O048J6403J4248
14583E0924q1449p5532n1178k0180K0080N2009O6028Q3115k7707m0912o9924J7395
14571g7331J4361O6067J01108q778m5565p7902n7162L0004Q8487J4483N8080M8736
14559A54588j22433m7136Q693m3713m0951J269m404Q9959K6725M4235m0452m9074
$$ plain form
14642 26494 -5969 -2326 -10635 -33673 -91837 -62212 -99575 -123636 -101335 -7190 -45265 -83137
14630 -83137 44093 102532 -5943 -27070 -12174 -69573 -124454 -113935 -105798 -49588 -35301
14619 -35301 -17345 -45772 -54597 -120910 -99245 -61329 -66001 -69113 -22314 -57477 -83946 -102350
14607 -102350 -75717 -60919 -41609 -79652 -135044 -139147 -200008 -134472 -112809 -124925 -128701 -137849
14595 -137849 -95867 -114868 -107664 -79135 -91489 -42883 -44784 -63019 14225 20273 36676 50924
14583 50924 -30525 -106057 -157235 -177415 -157335 -105326 -39298 43817 16110 -24802 -94726 -77331
14571 -77331 -62970 3097 104205 95427 49862 -28040 -85202 -55198 33289 47772 105852 154588
14559 154588 32155 -14981 -6288 -50001 -90952 -89683 -94087 -4128 22597 66832 26380 -22694
14547b2694L2738o0435n7808J3854P2065k0732M6108J14999J5532J1156m3665
14536A01118q4191r497N8829L1270K0091J7776M2848l7898q8840n246J3577J5960
14524G5797k6064K3927J8521n1745l476K7958m4146j0283o7880n4973n319n54
14512a18237L0533N3348L961R965K9236k7279K4386k8129o2801m3846m4562M8388
14500a25037J9599L0530j8889l697K7769M7464j6710l7178n8186L5433M0385L7314
14488b1203L1911J9291m8202K6919K7062K5789o1891o5749K9928O1478J4469k9409
14476A0393Q133l1002o7728K4712J6652J7891P03j9748l5614J7664K4299J7142
14464a6503L7008l6748m7001R0164M0960m2188j12590N7371M4232j9801O677l0875
$$ plain form
14547 -22694 10044 -50391 -108199 -94345 -22280 -43012 3096 118095 133627 144783 101118
14536 101118 16927 7430 66259 97529 117620 135396 178244 140346 51506 46260 59837 75797
14524 75797 49733 73660 92181 40436 36960 64918 20772 10489 -57391 -112364 -117683 -118237
14512 -118237 -87704 -34356 -30395 -20430 8806 -18473 5913 -22216 -85017 -128863 -173425 -125037
14500 -125037 -105438 -74908 -93797 -97494 -69725 -22261 -38971 -76149 -134335 -98902 -58517 -21203
14488 -21203 10708 29999 -18203 8716 35778 61567 -324 -66073 -36145 25333 39802 10393
14476 10393 18526 -12476 -80204 -55492 -38840 -20949 -20246 -39994 -75608 -57944 -33645 -16503
14464 -16503 20505 -16243 -63244 26920 67880 25692 -86898 -29527 14705 -5096 1581 -29294
14452b9294p7494K0260R6965J8443N733l1673k2520q6662J367K8804K8973k8034
14440g5132j2234k8879k3996J2844P5785k6618q1329L0500L5269m3791m2061L7926
14428a41716L6169J8953J5267l0010L4089o78l3172O746J9333k5837r561K8636
14416h1781M8596k4067n312j2585L8382M7405O660L0660n4718o8058m4866M599
14404a15085J3530K2190k1067l4185L8577M3699N8906K954p483q7561o120k130
14392i3775K6712O7358J6020n6935m9988O9179L2275O776n0714J7241M6632J0520
14380D1301J6235m5272L7790k6513o3792n0386o0479O239Q8581L69m283Q3286
14368B3076j983J5768K985k5122J3676j11346K4051O4628k9998n8454L3268N4172
$$ plain form
14452 -29294 -106788 -86528 10437 28880 34613 2940 -19580 -106242 -104875 -76071 -47098 -75132
14440 -75132 -87366 -116245 -140241 -127397 -51612 -78230 -159559 -129059 -93790 -137581 -179642 -141716
14428 -141716 -105547 -86594 -71327 -101337 -67248 -67926 -101098 -94352 -75019 -100856 -110417 -81781
14416 -81781 -33185 -57252 -62564 -75149 -36767 10638 17298 47958 -6760 -74818 -119684 -115085
14404 -115085 -101555 -79365 -100432 -134617 -96040 -52341 6565 9519 2036 -85525 -91645 -93775
14392 -93775 -67063 295 16315 -40620 -90608 -21429 10846 17622 -33092 -15851 30781 41301
14380 41301 57536 12264 50054 23541 -40251 -90637 -151116 -144877 -56296 -55927 -60210 23076
14368 23076 21093 36861 39846 14724 28400 -82946 -58895 5733 -24265 -82719 -49451 4721
14356D721n355N0999m4121K3777k7719r0083M7106K0406q5834k0247L3274P8915
14344a4161J1639n5506K5343k838R910P1498J9202p5831j4536J00955l9947n9351
14332b3623K9569L4542k0478L7860q708l0247k9832O4798O020l1996K4619m0129
14320A2395L216q9316l2308k4703K022K0797L4936J1892m22M74L8142m5183K7202
14307d0856K3649L4972K4075N0771k4584m7044n6318P2488J04652R840k0640m2509
14295H8496k4887J2636p486k8763o1562j7255l2396L507N4371o0964n2809N3045
14283g4067K6742P7935J09367p442o2476n820l8063p8881L8806K3770j8123k3009
14271c1261j8363O5959n0419q7362r2665k8532N7201K4983P0159O4233J4986L9001
$$ plain form
14356 4721 -634 50365 6244 30021 2302 -87781 -40675 -20269 -106103 -126350 -93076 -14161
14344 -14161 -2522 -58028 -32685 -35523 -25613 45885 65087 -10744 -25280 75675 35728 -23623
14332 -23623 5946 40488 20010 57870 49162 18915 -10917 53881 59901 27905 52524 12395
14320 12395 15611 -73705 -106013 -130716 -128694 -107897 -72961 -61069 -61491 -61017 -22875 -68058 -40856
14307 -40856 -17207 17765 41840 92611 68027 20983 -35335 37153 141805 151645 131005 88496
14295 88496 63609 76245 68759 39996 -21566 -38821 -71217 -67710 -13339 -74303 -127112 -74067
14283 -74067 -47325 30610 139977 132535 70059 64239 26176 -52705 -13899 9871 -8252 -31261
14271 -31261 -49624 16335 -34084 -121446 -214111 -242643 -185442 -160459 -90300 -26067 -11081 27920
14259B7920p543p8368j4665n1877l4500M4663R4728J61945Q6151L972l8144n785
14247A88497Q1985P5154M6822r330k9372n9491k5804k7366p4496k7991j6131p311
14235A15166o8869N9408M4306n8030p5980L6145P4714J0860P9697K5970J0501
14224B53888j7168L314m2479p1809n2823J7804P2673j2965r5290n6121J9979J5171
14212C4174j6682Q323K2313K3309K164l8436M145k8477l3651K3978L221j6868
14200a2487J4112l3413l2804q3021N1960R0348Q9952K5345l3981J1353J8045M644
14188A10053K0214k2006j8881j00120M592P3374J18395P0732L8488r2056j03663
14177I9122m4177L8552R1426j6985J1864L8129P521J0726m04J5743p521p3791
$$ plain form
14259 27920 20377 -57991 -72656 -124533 -159033 -114370 -19642 142303 228454 232426 194282 188497
14247 188497 270482 345636 392458 383128 353756 294265 268461 241095 166599 138608 122477 115166
14235 115166 46297 105705 150011 91981 16001 52146 126860 137720 217417 243387 253888
14224 253888 236720 240034 197555 125746 72923 90727 163400 150435 55145 -976 19003 34174
14212 34174 17492 25815 48128 71437 73601 35165 39310 10833 -22818 1160 4381 -12487
14200 -12487 1625 -31788 -64592 -147613 -95653 -5305 84647 109992 76011 87364 105409 110053
14188 110053 130267 108261 89380 -10740 -6148 67226 185621 256353 294841 202785 99122
14177 99122 54945 93497 184923 167938 179802 217931 225452 236178 235774 251517 243996 170205
14165A70205r2215n5276O5585Q0127L9334L7185k3863M014L7384K9831M0003K6847
14153C59161q957M2164o113q183K7951M0492l7593n0695j1549k9244O9179N5663
14141D42276O8437L0225n3813j9249K6654j7066K4903R4212J15839L8862O0094
14130H11374K0516J5196M8188J13634L9115n9011M7326M1764j2856k6527J1778
14119A050497k1429J8193L6462K686l3228l0402p409K2097O552N6240K2117R035
14107A131411k4339m223K7240M2228O3330N5260j0570j5476O8628Q1830L9977
14096A455296K3880L328n2325J3575J4753N4842O0243n3537L4316R5441O9167
14085A718979N4235K123M4463J7172Q6918M0J4225O5390K6116J11136J24992P4010
$$ plain form
14165 170205 77990 22714 88299 168426 207760 244945 221082 225096 262480 292311 332314 359161
14153 359161 350204 392368 386255 378072 406023 446515 408922 358227 346678 317434 386613 442276
14141 442276 510713 540938 487125 467876 494530 477464 502367 596579 712418 751280 811374
14130 811374 831890 847086 895274 1008908 1048023 989012 1036338 1078102 1065246 1038719 1050497
14119 1050497 1029068 1047261 1083723 1086409 1053181 1022779 1015370 1037467 1044019 1100259 1122376 1131411
14107 1131411 1107072 1102849 1130089 1172317 1235647 1290907 1280337 1264861 1333489 1415319 1455296
14096 1455296 1479176 1482504 1430179 1443754 1458507 1513349 1573592 1520055 1554371 1649812 1718979
14085 1718979 1773214 1775337 1819800 1836972 1923890 1923930 1938155 2003545 2029661 2140797 2265789 2339799
14073B339799K8790Q0400J00434J21472J34942J07941N8285N5738Q8957N1562
14063C168320M9855J00362J16349O7788J29540J38903N2904M9086J01213J39323
14053D113643J83936K31218J41913J58444K27003K52800J95030J86629J97355
14044E887971L02833L43944L05342L50085L53382L82982M08136N12358N91058
14035I438091O71811O59740P27041Q21984Q78527R86491J189797J333105J471185
14026A8177772J795168J973109K266566K717696L040077L527659M224108N150020
14018D2872175O332549P714968R439482J1393791J4561851J9030921K3387251
14011A34732988K5044677K6320704L2779079M2682377M4865970K3285261Q325718
$$ plain form
14073 2339799 2368589 2448989 2549423 2670895 2805837 2913778 2972063 3027801 3116758 3168320
14063 3168320 3218175 3318537 3434886 3502674 3632214 3771117 3824021 3873107 3974320 4113643
14053 4113643 4297579 4528797 4670710 4829154 5056157 5308957 5503987 5690616 5887971
14044 5887971 6190804 6534748 6840090 7190175 7543557 7926539 8334675 8847033 9438091
14035 9438091 10109902 10769642 11496683 12318667 13197194 14183685 15373482 16706587 18177772
14026 18177772 19972940 21946049 24212615 26930311 29970388 33498047 37722155 42872175
14018 42872175 49204724 56919692 66359174 77752965 92314816 111345737 134732988
14011 134732988 159777665 186098369 218877448 261559825 306425795 329711056 338036774
14004C38036774J1146951J7729770K6066076L5271693J4676452j4824413j5522530
13997D12580773l6303352p0195638o8157543m8190109l2888908k3321603j7466000
13990A16057620j4327137j1558074q631142o622870n247145m469240m029309l682721
13982E7489982l391524l046945k669446k154272j877558j671549j482290j290558
13974C9905840j199849j077370q52313q27585r17520j036214j166853j375310
13966C1452826j477182j360972j276856j236498j106437j016115q19788p84734
13958B2374244p65844o09279o42142o13524o97716p36084n55515n36273n17344
13949A6700523n51164n00677m62241m20490l76217k51750k28561k72390l29996
$$ plain form
14004 338036774 349183725 366913495 392979571 428251264 442927716 428103303 412580773
13997 412580773 376277421 306081783 237924240 189734131 156845223 133523620 116057620
13990 116057620 101730483 90172409 81541267 74918397 69671252 65202012 61172703 57489982
13982 57489982 54098458 51051513 48382067 46227795 44350237 42678688 41196398 39905840
13974 39905840 38705991 37628621 36776308 35948723 35031203 33994989 32828136 31452826
13966 31452826 29975644 28614672 27337816 26101318 24994881 23978766 23158978 22374244
13958 22374244 21608400 20999121 20356979 19743455 19045739 18309655 17754140 17217867 16700523
13949 16700523 16149359 15648682 15186441 14765951 14389734 14137984 13909423 13637033 13307037
13940A3307037l44364k69775j85745k74745k85232k61854l05311l47299k73758
13931A0758954l21292k49173k80103l00623k48662j98401k48856k13382j43365
13922H555097k36725l05140l03155k81267k40184j95371j30608k14116j97882
13913F450649j59681k39393j45148q3873j24339j62466r0772j57968k20163q7751
13903D979095n5885j19269j05002j22879n4831j03029j31501j61624p5263n0419
13893C999393m8162j9301J3755m4206o9106r3273o9346j4341R480n6992j24158
13882C483743n3607l641N430l425k4569k9895J5789K3286k1203j5430l4429r8633
13870C243416j49466j06623p7412m0321l2415J2583j12996r8155J1675k1797k8562
$$ plain form
13940 13307037 12962673 12692898 12507153 12232408 11947176 11685322 11380011 11032712 10758954
13931 10758954 10437662 10188489 9908386 9607763 9359101 9160700 8911844 8698462 8555097
13922 8555097 8318372 8013232 7710077 7428810 7188626 6993255 6862647 6648531 6450649
13913 6450649 6290968 6051575 5906427 5822554 5698215 5535749 5444977 5287009 5066846 4979095
13903 4979095 4923210 4803941 4698939 4576060 4521229 4418200 4286699 4125075 4049812 3999393
13893 3999393 3951231 3931930 3945685 3901479 3832373 3739100 3669754 3655413 3664893 3607901 3483743
13882 3483743 3430136 3426495 3431925 3428500 3403931 3374036 3389825 3413111 3391908 3376478 3342049 3243416
13870 3243416 3093950 2987327 2909915 2869594 2837179 2849762 2736766 2638611 2650286 2628489 2599927
13859B599927m1395q9593k0578o1689q1390o5353q4560l5958r1198j3219j8634
13848A996360o1919r2298o5667l8235j4467M5086n8053j6066n5636L3581l3020
13837A639666j50624m0677j3776j2522k5270j5878j7922K1434n9102p1682n9569
13826A194078j2435k5784j9419q0414L0397J2799L2833N5919j2048p0912J8354
13815A123368L6176L1k0770k9423k2242O1534L4729p7856l6803j9189J3396M3861
13803A106812q5525m6163j564L7761P2633P4736N1613j08589o3634N201o6233
13792I77048m5635n2780L4641J30261O9073m8140n1215o3714j06168l1970l3333
13781G78068j3711n366K1019K8114j1688l4775l4506N949K2028n4066k8396J2741
$$ plain form
13859 2599927 2558532 2468939 2448361 2386672 2305282 2239929 2155369 2119411 2028213 2014994 1996360
13848 1996360 1934441 1842143 1776476 1738241 1723774 1768860 1710807 1694741 1639105 1672686 1639666
13837 1639666 1489042 1448365 1434589 1422067 1396797 1380919 1362997 1384431 1325329 1253647 1194078
13826 1194078 1181643 1155859 1136440 1056026 1086423 1099222 1132055 1187974 1175926 1105014 1123368
13815 1123368 1159544 1159575 1138805 1109382 1087140 1148674 1183403 1105547 1068744 1049555 1062951 1106812
13803 1106812 1021287 975124 973560 1011321 1083954 1158690 1210303 1101714 1038080 1043281 977048
13792 977048 931413 878633 913274 1043535 1112608 1064468 1013253 949539 843371 811401 778068
13781 778068 764357 758991 780010 808124 796436 761661 727155 733104 755132 701066 672670 685411
13769F85411L0459K8175K0192k1419k9467P571m3281n1437L3989j1913K0735P7097
13757G46112J03882R895o5330q563M0771M4091o1724m6172p510R5011L1360J4110
13745H95933n4235o2714l2315n6648p2830Q442M6527j3978L6232j7251p0041l3862
13733E73260k5004J5197k2799n9317O120M0006j8527L1385K742r8045j0617P5988
13721E10389M0551J31322m2270j6101k890m8838J0844M339l4000l7835l7071m3697
13709D34743k2809o6819l6402k793J0235j9664o0859k4938K9995L3958p468J8231
13697B85410L8596j1442r488K667M5294o890n1729J2308R109m9698P948O4734
13685C36819M4235k9114K7678N3831q505j6111k1633m2098m5273l4489j5619q013
$$ plain form
13769 685411 715870 744045 764237 742818 713351 720922 677641 626204 660193 648280 669015 746112
13757 746112 849994 859889 794559 785996 826767 870858 809134 762962 755452 850463 881823 895933
13745 895933 841698 778984 746669 690021 617191 625633 672160 658182 694414 677163 607122 573260
13733 573260 548256 563453 540654 481337 487457 527463 508936 540321 543063 445018 434401 510389
13721 510389 550940 682262 639992 623891 621001 572163 583007 587346 553346 515511 478440 434743
13709 434743 411934 345115 308713 305920 316155 296491 235632 210694 240689 274647 267179 285410
13697 285410 324006 312564 303076 305743 351037 344147 292418 304726 313835 264137 272085 336819
13685 336819 381054 351940 379618 433449 424944 408833 387200 345102 299829 265340 249721 241708
13673B41708O318L372j8112m5346n0787K6526O9154k269J6237P850J5146O6603
13661C36400m564l7839M743j5324j29199k3272L9761K1891L9798L1263Q074n6207
13649B15525N658M6494p911R926L531K1317j2591m1141o3878N64k6861J5738j8680
13636A47691l2468K2029J8971P2757p151k3317K376m4648N9096J5023j6995Q554
13624B21918J3077p576j1507K1461J5059M1699K4805m6606k9568k0510o7916l0475
13612A23861M2933O4083P7516J1586n6476m1767m4745j8000K6760K8141J6268
13601B30160j7511K65j76M7829l8792o2981p645n0730L0707L8003q55K1709J2627
13588B02610k0873O5179L8171k9492M0303J1239m981k5830l3629J0673p291J7457
$$ plain form
13673 241708 248026 251398 233286 187940 137153 163679 232833 230564 246801 254651 269797 336400
13661 336400 331836 293997 298740 283416 154217 130945 170706 192597 232395 263658 271732 215525
13649 215525 221183 267677 259766 269692 273223 294540 281949 240808 176930 177494 150633 166371 147691
13636 147691 115223 137252 156223 228980 221829 198512 200888 156240 215336 230359 213364 221918
13624 221918 234995 227419 215912 237373 252432 294131 318936 272330 242762 222252 154336 123861
13612 123861 166794 230877 308393 319979 263503 221736 176991 158991 185751 213892 230160
13601 230160 212649 212914 212738 260567 221775 158794 151149 100419 131126 169129 168274 189983 202610
13588 202610 181737 246916 285087 255595 295898 307137 302156 276326 242697 253370 246079 263536
13576B63536J2157j6779n9124m6425j7726l1735j670O6847L3462k8229L2597P823
13564B14734K4642o490o1071K564N1409J7781l3808m9645m3019j1417P2212n456
13552A72436k7780P423L4377L936k1529n9842L0689P5423K0320m769k9929j5935
13540A84820L5161q8645n3883J39615O1755n2294m0581r976j1129J5229M0682
13529B20754O523k3761j4170j6752k9283l3213K4405O1783m60o197o7670r670
13517A12289k5370m627M0068P557L7088L3987k3807m7495l9872K7427j676O8099
13505A83668J2264q788L1272L8282k3816p8415m5401K6546m940O423N5294n406
13493A86983k1810l4260o1369P173K1850L8434N9898j711J4979K817l2410J4155
$$ plain form
13576 263536 275693 258914 199790 153365 135639 103904 102234 169081 202543 174314 206911 214734
13564 214734 239376 232886 171815 174379 225788 243569 209761 160116 117097 105680 177892 172436
13552 172436 144656 152079 186456 190392 168863 109021 139710 215133 235453 230684 200755 184820
13540 184820 219981 131336 77453 217068 278823 226529 185948 175972 164843 180072 220754
13529 220754 227277 203516 189346 172594 143311 110098 134503 196286 195826 189629 121959 112289
13517 112289 86919 82292 122360 129917 167005 200992 177185 129690 89818 117245 115569 183668
13505 183668 195932 187144 218416 256698 232882 154467 109066 135612 130672 137095 192389 186983
13493 186983 165173 130913 69544 76717 98567 137001 196899 195188 210167 212984 180574 194729
13481A94729J3756k3921l3601N9724J797n6915j8231o793m467l1951l0694N243
13469F8676j242m3852m7779j4491k1335J0534J5342l320k224l7220P0961R9367
13457I3417K8656n761j9437j9756j4699K0293O4146k603n9733p7800K624O0453
13445F9800M1617J1698j075Q233l5158L363n1467k6361K7841K335N8310M6543
13433A55679n4907l1437j2765N7223M5451j7052o0672N963j2427l3907O8045M0534
13421A49728J8356n0452n7196J4431P088q638l279p02N207k4791j9439L2360L6798
13408I9471L0614k1214k3366L1059N5091k2257k9754j159r0993o5369Q6869L5722
13396H4714j4903r120j0265M7751J5159n8254l1868m3460p425J098O0430L4443
$$ plain form
13481 194729 208485 184564 150963 210687 212484 155569 137338 130545 126078 94127 63433 68676
13469 68676 67434 23582 -24197 -38688 -60023 -49489 -34147 -37467 -39691 -76911 -5950 93417
13457 93417 122073 116312 96875 77119 62420 82713 146859 144256 84523 6723 9347 69800
13445 69800 111417 123115 122040 130273 95115 98478 47011 20650 48491 50826 109136 155679
13433 155679 100772 69335 56570 113793 159244 142192 81520 87483 75056 41149 109194 149728
13421 149728 168084 117632 60436 74867 81955 73317 70038 69336 74543 49752 30313 62673 99471
13408 99471 130085 108871 85505 116564 171655 149398 119644 118485 27492 -37877 48992 84714
13396 84714 69811 60691 50426 98177 113336 55082 23214 -20246 -27671 -26573 33857 68300
13384F8300O2100j0565M8034P514o8586p1439j6440K493M0774M0393N817p661
13372A00734K1667n7570n8940m0147N2118P2515j5024k1546k3087l3787k7954
13361c1021J9997J2797J9819K9581J1520N41L528l2486J8247M0037l0452L298
13349F5406J899j02810O547M9442L8343o8344m580R6580L095l9946J3578O2737
13337A21947P193o9725q299L5946M630k3346j7989J9393k2816m4594M0783N3889
13325I7012j519L5760O992j09938j4439l1791j1407K2969l3952L4813J6116m8289
13313c7673J6594L6579j4729Q143N3021K1365L8311K6271m0663j4298j1166r2426
13301a0671N5441O4486M3386L3440j22212n9962l3541j08578O589P5700N3671
$$ plain form
13384 68300 130400 119835 167869 175383 106797 35358 18918 21411 62185 102578 108395 100734
13372 100734 122401 64831 5891 -34256 17862 90377 75353 53807 30720 -3067 -31021
13361 -31021 -11024 1773 21592 51173 62693 63234 66762 34276 52523 92560 62108 65406
13349 65406 67305 -35505 -28958 20484 58827 -9517 -14097 82483 85578 45632 59210 121947
13337 121947 129140 59415 51116 87062 91692 68346 50357 69750 46934 2340 43123 97012
13325 97012 95493 131253 138245 28307 13868 -17923 -29330 -6361 -40313 -5500 10616 -37673
13313 -37673 -21079 15500 771 8914 61935 83300 121611 147882 107219 92921 81755 -10671
13301 -10671 44770 109256 152642 186082 63870 3908 -29633 -138211 -131622 -55922 -2251
13290b251O233M7598J9242J0440o5633k7828J7220L2460p283m8666n895R0185
13278F5822L5795K8145k5964k7814R0359M1589j078k4774p2488o8606k9352L00
13266A1934J9763l938p6823K5415L3452l585q6256M5797P8667L4863j1808l653
13254F3828L2956l4345o0165J5049O3035P9404K0103k3605p1004o6163P65R0413
13242A10271N3469r46j18683j04527k5714n61Q2110P6819M0833m617j8879k4268
13230F5307m1012M4978O3401L9283J6313o2650M296m0936L003q3590m4222K0003
13218a5826J8357O3813N1647J4720j6531n2943j3061L5672m2414L570K3315K0505
13206I0824k1089l886L1932K9297o0821n4638J8990N7722r877L643n4370K1288
$$ plain form
13290 -2251 3982 51580 70822 81262 15629 -12199 5021 37481 30198 -18468 -24363 65822
13278 65822 101617 129762 103798 75984 166343 207932 206854 182080 109592 40986 11634 11934
13266 11934 31697 27759 -49064 -23649 9803 6218 -80038 -34241 44426 79289 67481 63828
13254 63828 96784 62439 2274 17323 80358 159762 179865 156260 85256 19093 19858 110271
13242 110271 163740 162794 44111 -60416 -86130 -86691 -4581 72238 113071 108454 89575 65307
13230 65307 24295 69273 132674 171957 188270 125620 129916 88980 91983 8393 -35829 -15826
13218 -15826 2531 66344 117991 132711 116180 63237 50176 85848 43434 47004 70319 90824
13206 90824 69735 65849 97781 127078 66257 11619 30609 88331 78454 82097 27727 49015
13194D9015J1176j02909l7246Q661K5618L1371M668q92L9960O3855l9663m8068
13182E546K0131m9802k8547R2863J12080m6070l3852m2335N110k2404k9012p203
13170b3495m713l8694M9268K3823k4311J0590r053j4210K3484l8445j4483P2539
13158A2300Q2544j1928j01303j4324j9787J2511K5945P35j7854o5605O789N6414
13146c3563Q6226O6755k7996r4709k8935L375P5092J11777j2719k2745r679m794
13134A08085j0352o5491k6810l1398k0240R680P861r010n4697K0825L7200q172
13122d2519k1086k9245K2178O1716r001J407R875r0860j1986P0072L2446O81l1091
13109c7413k134M4133J1933q356l0456J1935Q9888J0634k4912m0856o2141k880
$$ plain form
13194 49015 60191 -42718 -79964 -71303 -45685 -14314 -9646 -10538 29422 93277 53614 5546
13182 5546 25677 -24125 -52672 40191 152271 106201 72349 30014 35124 12720 -16292 -23495
13170 -23495 -28208 -66902 -17634 6189 -18122 -7532 -16585 -30795 -7311 -45756 -60239 12300
13158 12300 94844 82916 -18387 -32711 -52498 -39987 -14042 -13307 -31161 -96766 -89977 -33563
13146 -33563 52663 119418 91422 -3287 -32222 -28847 46245 158022 145303 122558 112879 108085
13134 108085 97733 32242 5432 -25966 -46206 -36526 -28665 -37675 -92372 -71547 -34347 -42519
13122 -42519 -63605 -92850 -70672 -8956 -17957 -16550 -6675 -97535 -109521 -39449 -7003 -6322 -37413
13109 -37413 -39547 4586 16519 8163 -22293 -10358 79530 90164 65252 24396 -37745 -40625
13097d0625m2617M7694N9238n571J0251L8438l3338o0135j0367K3030p3300K7441
13085e9861l75P0228R2474l0448n0819j3430J4232N9982J9516J2922l593J0574
13073A21402R934n1824o0671O821N0473J9736L6915k8320p776R967j2854K698
13061I6501l6112j2845P989J0017N077J8351l0271j6265k2297O967l039j0349
13049A3724J5214j5488m7810J2293O4437J809J5261o1184m8669K9078j4872K7586
13037h621P1161P3171m259m7233j0005k9874k6525l1421Q6126N9667l6647p4360
13025B1180p6884O3393P0218l7242o9790J4655O2695j273K6509L1702k7652n3737
13013B3774K0773j0084N6480J5119j4451p5213K2285J9484n6686n9801j7332O7615
$$ plain form
13097 -40625 -83242 -35548 23690 18119 28370 66808 33470 -26665 -37032 -14002 -87302 -59861
13085 -59861 -60236 9992 102466 72018 21199 7769 22001 81983 101499 114421 110828 121402
13073 121402 131336 79512 18841 25662 76135 95871 132786 104466 96690 106657 93803 96501
13061 96501 60389 47544 55533 65550 70627 88978 58707 42442 20145 27112 24073 13724
13049 13724 28938 13450 -34360 -22067 42370 44179 59440 -1744 -50413 -21335 -36207 -8621
13037 -8621 62540 135711 131452 84219 74214 44340 17815 -13606 72520 132187 95540 21180
13025 21180 -55704 7689 77907 40665 -29125 -14470 48225 46952 73461 105163 77511 23774
13013 23774 44547 34463 90943 106062 91611 16398 38683 58167 1481 -58320 -75652 -8037
13001h037J00185P48k2839q4318o231K1793m1086m274r956M6968k3738n6968Q0161
12988g592P5623K2532o865o35q4269o2269P5516N8447J565L160J0179k0451K0193
12975H5134K1285o5889l3619o461L854l622K3819O3123r490o7456K2644M2258
12963G5580m457L048j1875M961q6188p8730r210Q5009K0365m0239j9032J4833
12951d5935M218P8723K6988k8019r218M4771M4467o7077m536J7407j7211P445
12939E2023k9634N0043K7388L0108R525q913j9180l0391k269l95l8726K7265K7269
12926I4113l4104M928J5188j0631p9734M1218K7058l4731N6222n0877m6247K9201
12914A1604k3400J4920N4921Q3653p06n0888j0141n5822P73O2060n8701K0108
$$ plain form
13001 -8037 92148 92896 70057 -14261 -20492 1301 -39785 -44059 -54015 -7047 -30785 -87753 -7592
12988 -7592 68031 90563 83698 83063 -1206 -63475 12041 70488 72053 75213 85392 64941 85134
12975 85134 106419 40530 6911 450 4304 682 24501 87624 78134 10678 33322 75580
12963 75580 71123 74171 62296 67257 -18931 -97661 -106871 -21862 -1497 -41736 -60768 -45935
12951 -45935 -41717 37006 63994 35975 26757 71528 115995 48918 44382 61789 44578 52023
12939 52023 22389 72432 99820 129928 139453 130540 111360 80969 78700 78305 39579 66844 94113
12926 94113 60009 64937 80125 69494 -10240 30978 58036 23305 79527 28650 -17597 11604
12914 11604 -11796 3124 58045 141698 140992 90104 79963 24141 24914 86974 28273 48381
12902D8381L2372K2833O992l3655J9660M3290k0535P475n4200m3487K6471L327
12890E8924l4043j0683q408J5618M5892P6933Q1896J3575n6808l2590M3527L6243
12878B30076j5977m5979r0384J949M4347k6546m7406K0967P295m2342n2521R552
12866f969M6715J3230J5417n0464l7991O8947L3532l9330J5171Q656j0976K5774
12854H1712j4019j5854l5960N6463N6495m0217K241J6518J5126L0021m4225j17203
12842h902l2173L1877K4528L6522j8957J8557J1397j1600j8703J7930j7413N0164
12830H3227M3407k7557o1688n0404j1087P1292L4525p9685o9393L8543L577R119
12818a6124L3235O2185j6047J6754K8117n233L756n3598l5056Q3396O749l0528
$$ plain form
12902 48381 80753 103586 110578 76923 96583 139873 119338 126813 72613 29126 55597 58924
12890 58924 24881 14198 5790 21408 67300 144233 226129 239704 182896 150306 193833 230076
12878 230076 214099 168120 77736 79685 124032 97486 50080 71047 78342 36000 -16521 -6969
12866 -6969 39746 52976 68393 17929 -20062 48885 82417 43087 58258 66914 55938 81712
12854 81712 67693 51839 15879 72342 128837 88620 90861 107379 122505 152526 108301 -8902
12842 -8902 -41075 -9198 15330 51852 32895 51452 62849 51249 32546 50476 33063 83227
12830 83227 126634 99077 37389 -13015 -24102 47190 81715 2030 -67363 -28820 -25243 -16124
12818 -16124 17111 79296 63249 80003 108120 102887 106643 53045 17989 101385 108134 77606
12806G7606o1791n3633K6086k2431N816O1133j988m054j3894N4775L8156j5665
12794I0116J3128O8392Q1968l1230j29776k5265O8729R1471l5240j00375N3317
12783A45235L0329O531p023N2470L9101L3924N0958L8719o1121l7536N8070L344
12771C53001J9075L9383k3004P0873N2344l6808J7408J6140J8056r135j20370
12760C96963o318O8445m6764J6293j8005m1226O3410M7303q616m9072j6419l834
12748D02160M5430K2338J1024k7002m9243m2769k5785J2511J4992L4717K0619
12737D18992j0925k0500l9946P4660J5366m1138m9729k8905k6737J7556L0357
12726C39051J4295J6977m825k7655l1704N2437M9303L5646l4362q9713j8470M3146
$$ plain form
12806 77606 15815 -37818 -11732 -34163 -28347 32786 30798 26744 12850 67625 105781 90116
12794 90116 103244 171636 253604 222374 92598 67333 136062 227533 192293 91918 145235
12783 145235 175564 182095 175072 227542 266643 300567 351525 390244 329123 291587 349657 353001
12771 353001 372076 411459 388455 459328 511672 474864 492272 508412 526468 517333 396963
12760 396963 390645 459090 412326 428619 410614 369388 432798 480101 471485 422413 405994 402160
12748 402160 447590 469928 480952 453950 404707 361938 336153 348664 363656 398373 418992
12737 418992 408067 387567 347621 422281 437647 396509 346780 317875 291138 308694 339051
12726 339051 353346 370323 365498 337843 306139 358576 407879 443525 409163 319450 300980 344126
12714C44126O3870K1812J7141j9900N1460P925r0595n5264J0157P6362L5942m7684
12702D15352o4085k0463R434J5914L8606r937m0644k4545N6792P86L0799L46o714
12689D01641K5137k0882J9691N1857k4778p7577n7607J6477j8684n2789k9365
12678B33121j2502J866q316o825k8358L6066N7426J9087k2117l1482L0386O279
12666B74631J6868k7281n1629k2678L042k6148M9732l3935o3916l3367M9031O0217
12654A94567k1689M5226Q951n2360k5437n9222r5755j3186N2562J01451K7437
12643A62545r647j5645J20m1758n607j9134K9875m6829j7935K3075P0162M0649
12631A69871k5212l6006J4182P605k4262l0647J9139K2787L255R8975L3868l0267
$$ plain form
12714 344126 407996 429808 446949 427049 478509 486434 395839 340575 350732 427094 463036 415352
12702 415352 351267 330804 340238 356152 394758 384821 344177 319632 376424 377210 408009 408355 401641
12689 401641 426778 405896 425587 477444 452666 375089 317482 333959 315275 262486 233121
12678 233121 220619 222485 214169 207344 178986 215052 272478 291565 269448 237966 268352 274631
12666 274631 291499 264218 212589 189911 192953 166805 216537 182602 118686 85319 134350 194567
12654 194567 172878 218104 227055 174695 149258 90036 -5719 -18905 33657 135108 162545
12643 162545 152898 137253 137373 95615 90008 70874 100749 53920 35985 59060 129222 169871
12631 169871 144659 108653 122835 130440 106178 75531 94670 117457 120712 219687 253555 223288
12619B23288L466M7694n836N609j5188n4389j4666L4560M069l6324n7557k2271
12607A12455K91j2637Q26j8769P611L4282k6662K3447R706L3130K3445k6818Q8717
12594B49024N6753n96J2929K6651J03504J1456q7498l9561N431k834L4648R669
12582C79576l6356m3232m7856K9619K5506J2449L0264m579K1679j3806r0094m410
12570B58760K301M3113J0632o3407q7504l0060O4053M858N3698J1769M370j9351
12558B53232k3799N1634J04279P8583R150K170K5581l865m9776M7572N4079J0486
12546E59326o0628l0753o3943k9558r2039M599K5626Q4303J6695n2247r7111q2108
12534A82162L0590M3394K4451j3330o2325k3853O4890j2368m0646N43M8444J0886
$$ plain form
12619 223288 226754 274448 268612 274221 259033 204644 189978 224538 228607 192283 134726 112455
12607 112455 112746 100109 100935 82166 89777 124059 97397 120844 130550 163680 187125 160307 249024
12594 249024 305777 305181 318110 344761 448265 459721 372223 332662 338093 335259 369907 379576
12582 379576 343220 299988 252132 281751 307257 319706 349970 345391 367070 353264 263170 258760
12570 258760 261061 304174 314806 251399 163895 133835 197888 202746 256444 268213 272583 253232
12558 253232 229433 281067 385346 463929 473079 475249 500830 496965 447189 494761 548840 559326
12546 559326 498698 467945 404002 374444 282405 287004 312630 396933 413628 361381 264270 182162
12534 182162 212752 256146 280597 267267 204942 181089 245979 233611 192965 193508 241952 252838
12522B52838L4450N929j1938j9732R8315K9166k2776K4454K3740P3386J7389k3795
12510D81426k7433j1105J7303L3205n141N8021N0752j8415l5929n6906n7748o2364
12498C65666K0193J3850k0682o8137O2557J8463M3756K547k2328N0993N4133o906
12486E14105L376n4384k3577K7969k8121o4440N6001K5014m10m0196q7164K3364
12474C51537N8374L5106n615j8562J2993K8101N566K7878L665J5861O8658K5321
12462F08883K2283l7643m4258m2870o2736J3550M9131P4436O5748L0024K2608
12451F99156n2175p877N4354J4583J8315o985k5972n8080M7510N317O7730L1108
12439G86984J3666l3870L4360L4212l7463J8226P3792N4852p339K8630M7883L0432
$$ plain form
12522 252838 287288 293217 281279 261547 359862 389028 366252 390706 414446 487832 505221 481426
12510 481426 453993 442888 460191 493396 488255 546276 597028 578613 542684 485778 428030 365666
12498 365666 385859 399709 379027 310890 373447 391910 435666 438213 415885 466878 521011 514105
12486 514105 517481 463097 439520 467489 439368 374928 430929 455943 455533 415337 328173 351537
12474 351537 409911 445017 439402 420840 433833 461934 467500 495378 499043 514904 583562 608883
12462 608883 631166 593523 549265 506395 443659 457209 506340 580776 646524 676548 699156
12451 699156 646981 639104 693458 708041 726356 719371 693399 635319 682829 688146 755876 786984
12439 786984 800650 766780 801140 835352 797889 816115 889907 944759 937420 966050 1013933 1044365
12427A044365o2793j303M4147M9330O5392M7665m9282p574O2513L4175l50M3665
12415A269950Q0536R5630Q4384m1912m9893L4838M7551J25284Q1508k2235P2591
12404A778232M2025M6827J14746J6332p113K9454J08810J28000N4613M7575P1749
12393B431250O5271P4519J31408R8276N9232K6305R0410J19969J26834J46474
12383C369948J28771K17541J87925J01394J94388K58570K10536K15124K79898
12374E164095L03085L62837M10643L85610M88607N48748O05533O94311P34637
12365I698106P30207Q84680J026677J175467J302674J509288J755677J930597
12357B0013373K239510K605877L052535L486333M009171M506259M989464N499378
$$ plain form
12427 1044365 981572 980269 1024416 1073746 1139138 1186803 1137521 1129947 1192460 1226635 1226285 1269950
12415 1269950 1350486 1446116 1530500 1488588 1438695 1473533 1521084 1646368 1727876 1705641 1778232
12404 1778232 1820257 1867084 1981830 1998162 1991049 2020503 2129313 2257313 2311926 2359501 2431250
12393 2431250 2496521 2571040 2702448 2800724 2859956 2886261 2976671 3096640 3223474 3369948
12383 3369948 3498719 3716260 3904185 4005579 4199967 4458537 4669073 4884197 5164095
12374 5164095 5467180 5830017 6240660 6626270 7114877 7663625 8269158 8963469 9698106
12365 9698106 10428313 11312993 12339670 13515137 14817811 16327099 18082776 20013373
12357 20013373 22252883 24858760 27911295 31397628 35406799 39913058 44902522 50401900
12349E0401900N885069O179127O151086N711409M964127M249232L717007L327703
12341I0586660K538831J312341m15754k408613m497131o454653p569253p929298
12333F5163130p413909o432851n478683m579866l727997k975622k449558k137115
12325B9967529j701741j473412j333119j201497j028647q66520q19377p20860
12317B0822356o26979n25217k84638j98072j90361o1046J13532J94138J77541
12308A9421254K58684L70374M87094N74945N95224Q62945J129778J350667J502057
12299B6553022J674159J838954K026496K197984K326257K417077K413738K209768
12291D3657455K035663J938787J738066J443642J149977Q75762M12337j02157
$$ plain form
12349 50401900 56286969 62466096 68617182 74328591 79292718 83541950 87258957 90586660
12341 90586660 93125491 94437832 94022078 91613465 87116334 80661681 73092428 65163130
12333 65163130 57749221 51316370 45837687 41257821 37529824 34554202 32104644 29967529
12325 29967529 28265788 26792376 25459257 24257760 23229113 22362593 21543216 20822356
12317 20822356 20195377 19670160 19385522 19187450 18997089 18936043 19049575 19243713 19421254
12308 19421254 19679938 20050312 20537406 21112351 21707575 22570520 23700298 25050965 26553022
12299 26553022 28227181 30066135 32092631 34290615 36616872 39033949 41447687 43657455
12291 43657455 45693118 47631905 49369971 50813613 51963590 52839352 53251689 53149532
12283E3149532m84116p48955r00889r31274p44608m97265k94174M5949M51320
12274D9045520P05760J018875J278639J494038J567505J758201J900553J964486
12266F0733577J905255J869017J833164J719670J546091J436055J148784Q80833
12258G3072446N28758K27162m7448m36339p75555j045141j331766j415325j585116
12249F7191676j636339j684470j722122j732352j619046j504574j326864j060115
12241E4905794r05232o54672m48081k25183J29193L07096M50620O03525O74558
12232E4837618O81767O06172M60435K97226L2282k49454o33505j020374j472395
12223E3539772j938106k297299k710558k911691k963023k900794k702911k506053
$$ plain form
12283 53149532 52665416 51916461 51015572 50084298 49339690 48842425 48548251 48594200 49045520
12274 49045520 49751280 50770155 52048794 53542832 55110337 56868538 58769091 60733577
12266 60733577 62638832 64507849 66341013 68060683 69606774 71042829 72191613 73072446
12258 73072446 73601204 73828366 73780918 73344579 72569024 71523883 70192117 68776792 67191676
12249 67191676 65555337 63870867 62148745 60416393 58797347 57292773 55965909 54905794
12241 54905794 54000562 53345890 52897809 52672626 52801819 53108915 53559535 54163060 54837618
12232 54837618 55519385 56125557 56585992 56883218 56915500 56666046 56032541 55012167 53539772
12223 53539772 51601666 49304367 46593809 43682118 40719095 37818301 35115390 32609337
12215C2609337k246218k005400j792815j624621j413052j250452j180976j103384
12207A9992419j023359q77346p89042p21677o40404o22542n82410n83176n59208
12198A3593255m72725m12213l85024m30180l65110l70398l70701l17951l06351
12189A0162602l40848k11114k65645l23655k73278k68356k80301j60570j87338
12180G851497k05204j62583k24383j99938k23498k10477j48110j30176j75735
12171F171393j63980j69626r7405j68884j16206j52009j74833r3903l1655j36718
12161D866174j21073p0963p4847j25519j11976j47579n4680n2927j02174q6598
12151C917838l6208o8335o8047p0948r1355l6622l1105n3065m6615j63038j04493
$$ plain form
12215 32609337 30363119 28357719 26564904 24940283 23527231 22276779 21095803 19992419
12207 19992419 18969060 18091714 17302672 16580995 15940591 15318049 14735639 14152463 13593255
12198 13593255 13120530 12708317 12323293 11893113 11528003 11157605 10786904 10468953 10162602
12189 10162602 9821754 9610640 9344995 9021340 8748062 8479706 8199405 8038835 7851497
12180 7851497 7646293 7483710 7259327 7059389 6835891 6625414 6477304 6347128 6171393
12171 6171393 6007413 5837787 5740382 5571498 5455292 5303283 5128450 5034547 5002892 4866174
12161 4866174 4745101 4674138 4599291 4473772 4361796 4214217 4159537 4106610 4004436 3917838
12151 3917838 3881630 3813295 3745248 3674300 3582945 3546323 3515218 3462153 3415538 3252500 3148007
12140C148007J7715m1364p7435q6311l3948n2354p0391j2519K8894K3842o6564
12129B777572o3080q6657J8589n4265K2997L7167R37J6692n126o5193q1613n2967
12117B465053l2115o7780l0411o0728o071P6412J2491q2555l7231j04194j18699
12106B014172p0800m8025J4500k499l793m4811k1793M2517j8028r6956n6363j4306
12094A693815m6116M1049L9143j0388k2259p8393k8208j2639R582m5084r378j8779
12082A512345j841l1334O7472k8564M7431o4435k0164J7438j459o3254q1585j0101
12070A341949L3521J4452j7770j9320K1955k8997L9235j1315j12198o6834j3638
12059A181040P083l5182j5589m6880n2013m5946m3073N8862J16540K7723n9287
$$ plain form
12140 3148007 3165722 3124358 3046923 2960612 2926664 2874310 2803919 2791400 2820294 2844136 2777572
12129 2777572 2714492 2627835 2646424 2592159 2615156 2652323 2653260 2669952 2664826 2599633 2518020 2465053
12117 2465053 2432938 2365158 2334747 2274019 2267948 2344360 2356851 2274296 2237065 2132871 2014172
12106 2014172 1943372 1895347 1909847 1907348 1903555 1858744 1836951 1879468 1861440 1764484 1708121 1693815
12094 1693815 1647699 1688748 1727891 1717503 1695244 1616851 1588643 1576004 1585586 1540502 1531124 1512345
12082 1512345 1510504 1479170 1546642 1518078 1565509 1501074 1480910 1498348 1496889 1433635 1352050 1341949
12070 1341949 1375470 1389922 1372152 1352832 1374787 1345790 1385025 1373710 1261512 1194678 1181040
12059 1181040 1188123 1152941 1137352 1090472 1038459 992513 949440 1008302 1124842 1152565 1093278
12048A093278n8049K1306K413L3170M1801l110k5578J4362L367j2622l017M2924
12036A150245J05813o128q7670r499o960M4611K6592l6955k7561m9145k3529n2859
12024A026955P820o0671L6248m5865m3102j28451n6914L9269M7578m4992j5828
12013G62047J9350N3647k2693K3131n545m96k0149k5840O462K9553j5432k9024
12001G75011l5165O2885J45342N7989o2667j7395n60L2830K9128o85n3858m9791
11989H83064K4235r212L7934K6410J0178l0391q0172n9171j7700J6214l4938K2598
11977G89049K7977O3797n8638o7989N7842O0072m9087L1261l3991K3674O8559
11966I12526K22L7756N9381O3252O7305O299k292p620j0628l6426P589j07131
$$ plain form
12048 1093278 1035229 1056535 1058948 1092118 1133919 1130809 1105231 1119593 1122960 1110338 1107321 1150245
12036 1150245 1256058 1249930 1162260 1152761 1145801 1190412 1217004 1180049 1152488 1103343 1079814 1026955
12024 1026955 1034775 974104 1010352 964487 921385 792934 736020 775289 822867 777875 762047
12013 762047 781397 835044 812351 835482 829937 829441 809292 783452 789914 819467 804035 775011
12001 775011 739846 802731 948073 1006062 943395 926000 925440 958270 987398 986713 932855 883064
11989 883064 907299 898087 936021 962431 972609 942218 862046 802875 785175 801389 766451 789049
11977 789049 817026 880823 822185 754196 812038 872110 823023 854284 820293 843967 912526
11966 912526 912748 950504 1009885 1073137 1140442 1146741 1144449 1136829 1126201 1089775 1097364 990233
11954I90233r9782n1337J2196j6792n170l4303j05279k5988O1541J2258l6800
11943G00777j6537N7302k080o6267n3720o406L8112J7066j03l3447L5743l7574
11931F32866r3633J7807L8270K9495K9018K2722j3020o0205j9283J0130J2325
11920F06492J5083K0292j036N9137J00431L1678l6866R185j2138M6420j813n599
11908H31266J8256J9344J4525k0041l2983o033k296p2045r7187r3878m0948K8977
11896E46957J5364j2332j1816k7578K620n1600M049n3190j0744L4213N409n313
11884D36039j0275j1929j3475L3564j4574K4236P523j03733P729M9199q548o126
11872C89630m0756r618J2767r340K7479P3452p631l6702m7044P574L7576L3673
$$ plain form
11954 990233 890451 839114 851310 834518 829348 795045 689766 663778 725319 737577 700777
11943 700777 684240 741542 739462 673195 619475 613069 651181 668247 668144 634697 670440 632866
11931 632866 539233 557040 595310 624805 653823 676545 663525 603320 584037 594167 606492
11920 606492 621575 641867 640831 699968 800399 832077 795211 804396 792258 838678 836865 831266
11908 831266 849522 868866 883391 863350 830367 824334 822038 749993 652806 558928 517980 546957
11896 546957 562321 549989 538173 510595 513215 461615 465664 412474 401730 435943 441352 436039
11884 436039 425764 413835 400360 433924 419350 443586 451109 347376 355105 404304 395756 389630
11872 389630 348874 339256 352023 342683 370162 443614 435983 399281 352237 359811 397387 431060
11860D31060O150p1420J8314k1430K5361l6714m5193J3199O3005k0274j2961M969
11848C54066N4975L9542j5865p2213Q755K0508l8492J8884k7222k971R905o2073
11836B87799k5977P6498k5187j6666N2224K0592P9081L9018k2255M6186N680k1699
11824D95294m2443k1832j1085J36803J03819k4049k6393J7609m6193o134l687
11813E71709m6591q1092k9857K2759k1827q7400P6535J07131q070k769J262K5841
11801E27631J5220l738K9026k766l0447L672l998K3851K5247L1621J8398N1288
11789F85005N7145k3712p8428m610K8288m5099n4293n3777p012K3841P317o0088
11777D74577m5747K0419l449n0931m922N0934j5087l2626K8782L5614j1776k0019
$$ plain form
11860 431060 437210 365790 384104 362674 388035 351321 306128 319327 382332 362058 349097 354066
11848 354066 409041 448583 432718 360505 369260 389768 351276 370160 342938 339967 349872 287799
11836 287799 261822 338320 313133 296467 348691 369283 448364 487382 465127 511313 516993 495294
11824 495294 452851 431019 419934 556737 660556 636507 610114 627723 581530 575396 571709
11813 571709 525118 444026 414169 436928 415101 327701 404236 511367 503297 500528 501790 527631
11801 527631 542851 539113 568139 565373 534926 538598 534600 558451 583698 615319 633717 685005
11789 685005 742150 718438 640010 635400 663688 618589 564296 510519 503507 527348 534665 474577
11777 474577 428830 449249 445800 394869 389947 440881 425794 393168 421950 457564 445788 425769
11765D25769L1516J2436j1932J1792k0324o4024j754K6782M585K0316l2739n7738
11753C44685L6449O1562L3135m6847n9972r5445r947M1031O5455r0215k2553K1350
11741B78688L2933k940k0005j4757N343J5546j5108o8486O806K3093J700r652
11729B33161K7897N5726J6437R001l4729k970k4915K63q375J8577n8594m480L0866
11716B57865k8739L0139k667n0177k7782Q3544m058n751O6133K7936M7417Q5627
11704D79487j2084p7066j2450m7760q419Q2854O1530L2425j4312l2811J6716Q3875
11692E51985K9003O256O4399k1603K0638Q9369O7020J66927J64042J09948J39385
11681A387369J37033J94286L00351L66825M10094N18969O46869O18815Q30231
$$ plain form
11765 425769 457285 469721 457789 469581 449257 385233 383479 410261 414846 435162 402423 344685
11753 344685 381134 442696 475831 428984 369012 273567 263620 304651 370106 279891 257338 278688
11741 278688 311621 308681 288676 273919 279262 294808 279700 211214 218020 241113 242813 233161
11729 233161 261058 316784 333221 342222 307493 304523 279608 279871 271496 290073 231479 226999 257865
11716 257865 229126 259265 256598 206421 178639 262183 258125 252374 318507 346443 393860 479487
11704 479487 467403 390337 377887 330127 321708 404562 466092 498517 484205 451394 468110 551985
11692 551985 580988 587244 651643 630040 650678 740047 807067 973994 1138036 1247984 1387369
11681 1387369 1524402 1718688 2019039 2385864 2795958 3314927 3961796 4580611 5410842
11672E410842R88025Q01288L57837J72354L26682N04702O50993O20685j29625
11663I703783l02366m57053j232401j591753j263091q33685o27522m85389l11532
11654B598991k77480k39931j70589o4386p4809j00445n1502r8974j11831j60609
11644A248435R478L2478j17798j18777l2179n957K8954n8933l4685m073o1314
11633H85629n9930J3766k3284n8011N5896K1417n4241r8955K0192K4081r683J7267
11621G34144k5490o5163p0380j4982R0981l6122p437J4857K5862n944k6144m8534
11609E65648o1985J1032J2954j10853r7262k9627J0444P103j4838J6799o314M0333
11597C43434k0882j153M2387k1497J199k2141K5460j5943l234j3126N2046l1206
$$ plain form
11672 5410842 6398867 7200155 7557992 7730346 8057028 8561730 9212723 9833408 9703783
11663 9703783 9401417 8944364 7711963 6120210 4857119 4023434 3395912 2910523 2598991
11654 2598991 2321511 2081580 1910991 1846605 1771796 1671351 1619849 1520875 1409044 1248435
11644 1248435 1257913 1290391 1172593 1053816 1021637 1015680 1044634 985701 951016 946943 885629
11633 885629 825699 839465 816181 758170 814066 835483 781242 682287 702479 726560 716877 734144
11621 734144 708654 643491 573111 558129 649110 612988 605551 620408 646270 640326 614182 565648
11609 565648 503663 514695 527649 416796 319534 289907 300351 307454 292616 309415 303101 343434
11597 343434 322552 321399 363786 342289 343488 321347 346807 330864 327630 314504 366550 335344
11585C35344L279l4198j4249m0790o0753j2061K5882m122K6715J4779o6458m9455
11573A23913L0780J9667N3950k205k4699j15993J3492M7356Q2610k347p88L3378
11561B59114k8159j555k7489k3045K6542n5702j6380Q0959K5705J6266j0210L3735
11549B79781m5127o6238p3746k2957L6390J6425K3516O6101R4602K100J2125m0021
11537B82951m8463j4968n8970m8045J6086J9069K8151l3725M7995O2898o0402
11526A92577k1638j1447j3962o199L043j8329j2284k499j6943o7014L6523N5725
11514A17553n07J1376q256n6040L0693M4720K1457m5436m3559m7259j229M5502
11502F9015o0012M4671K7806J3854O1732K704k4625o3794L631K2862k9539K8498
$$ plain form
11585 335344 338623 304425 290176 249386 188633 176572 202454 198332 225047 239826 173368 123913
11573 123913 154693 174360 228310 226105 201406 85413 98905 146261 228871 226524 225736 259114
11561 259114 230955 229400 201911 178866 205408 149706 133326 214285 239990 256256 246046 279781
11549 279781 234654 168416 94670 71713 108103 124528 148044 214145 308747 310847 322972 282951
11537 282951 234488 219520 160550 112505 128591 147660 175811 142086 190081 252979 192577
11526 192577 170939 159492 145530 139331 142374 124045 111761 109262 92319 25305 61828 117553
11514 117553 117046 128422 120166 64126 94819 139539 160996 115560 72001 24742 23513 69015
11502 69015 9003 53674 81480 95334 157066 159770 135145 71351 74982 97844 68305 96803
11490I6803M8870M4616M7236n0140p6195k8704p494K3520R853j0322j9488J01142
11478A79697L4027q5098n8187O9951K7154j8460o644n0668k8383l2704M4778L3268
11466A08731k0373j0043J022j1090M3714M986l8672M4198K5373J2643J569K1152
11454A83210l7733j37133N9452K8835K8506J287n1251O101M0935O951k5795M373
11442A07738L607p632L9688M1047L7224m3214q6936l4444o0124k4571K7803Q0642
11430H0828N7860l8023q7082l3795l8861L9237P2198J3039o523M2578M2285m2546
11418A01195p3737j4322j4136n434J16305O3759N836M4755J9046p6957j11020
11407E5290k5261J7862J716L8683K8128k8554l039q1992O5225j5037L2687M2969
$$ plain form
11490 96803 145673 190289 237525 187385 111190 82486 74992 98512 108365 98043 78555 179697
11478 179697 213724 128626 70439 140390 167544 149084 142440 91772 63389 30685 75463 108731
11466 108731 88358 78315 79337 68247 111961 116947 78275 122473 147846 160489 162058 183210
11454 183210 145477 8344 67796 96631 125137 126424 75173 81274 122209 129160 103365 107738
11442 107738 111345 103713 143401 184448 221672 178458 91522 57078 -3046 -27617 186 80828
11430 80828 138688 100665 13583 -20212 -59073 -19836 52362 65401 58878 101456 143741 101195
11418 101195 27458 13136 -1000 -6434 109871 173630 179466 224221 243267 166310 55290
11407 55290 30029 47891 49607 88290 116418 87864 84825 2833 68058 53021 85708 128677
11395A28677L6466p284n0025l4810M5350N9288j5960o0421l5086p6157N5063N3396
11383I8497n0139j4343M7086o9525j1357J3880N0716J6809p9006p0588K8932N1079
11371A2041O8000k9710k4818L8116N8600r085l0485J0641J4403L0399j7561n4240
11359F6301k8952L3343N6512j0108j04627q059L5069q556J4429m312K5284O145
11347G2469L9724o077m2811k2325P697L8631j7424l9000n2006k2563J6632j2454
11335c9507k4837M99P6412K1518R574j2495m1844N344J4028J5577K750j9386O7566
11322G5199J3237L0211P782n2214k7544O1245P2458m1827n6545l2180L6010N2577
11310A38409j5110m8768n9241J448N3366P868k9614m0481J4567L3688Q737m2080
$$ plain form
11395 128677 165143 157859 107834 73024 118374 177662 161702 101281 66195 -9962 45101 98497
11383 98497 48358 34015 81101 11576 219 14099 64815 81624 2618 -67970 -39038 12041
11371 12041 80041 50331 25513 63629 122229 113144 82659 93300 107703 138102 120541 66301
11359 66301 37349 70692 127204 117096 12469 4410 39479 30923 45352 41040 66324 72469
11347 72469 112193 106116 63305 40980 48677 87308 69884 30884 -21122 -43685 -27053 -39507
11335 -39507 -64344 -63845 12567 34085 43659 31164 -10680 -5336 8692 24269 27019 7633 75199
11322 75199 88436 118647 126429 74215 46671 107916 180374 138547 82002 49822 85832 138409
11310 138409 123299 74531 15290 16738 70104 77972 48358 7877 22444 56132 64869 22789
11298B2789m5158j8611Q7314M0333r263M9762J7262p2857j9924J1827j1113k382
11286D9979p824R5627L1162k7297j1567K5843l595p437k3622l9354K8892r8387
11274A2420j1908K5738J3915O000j1451j3027L459K0698K3889J2370O5948q959
11262A39092m0905j6544j4268j5249j2538J1383k9525K2269M8229K4992j9642
11251I7294m3744l7505q210M016L1452P4804k0625J8619J1722r089l4317J474
11239H5891o4963l7303L3772M6616M2768M0436r178j7766p52J164k7286k774l555
11226H7070n7772p7252M4537J16858J4192J0801k2112L3177P0593K4335l3363
11215B11064l3486m5678l3469P9362J9620k6375p743n3822m3318l5476N591q097
$$ plain form
11298 22789 -22369 -40980 46334 86667 77404 127166 144428 71571 51647 63474 52361 49979
11286 49979 42155 137782 168944 141647 130080 155923 152328 144891 121269 81915 110807 12420
11274 12420 512 26250 40165 46165 34714 21687 25146 45844 69733 82103 148051 139092
11262 139092 98187 81643 67375 52126 39588 50971 21446 43715 91944 116936 97294
11251 97294 53550 16045 7835 11851 43303 118107 97482 116101 127823 118734 84417 85891
11239 85891 20928 -16375 17397 64013 106781 147217 138039 120273 119521 120685 93399 90625 87070
11226 87070 29298 -47954 -3417 113441 127633 138434 116322 149499 220092 244427 211064
11215 211064 177578 131900 98431 177793 197413 171038 163295 109473 66155 30679 36270 28173
11203B8173J5567r07J1169j3530n657P501P923K7972L4822m1068M6815K0272O3383
11190B02435M202p3449n9149P186L3212J0282l2785J7101n3639l6704R783l8334
11178i859Q335N5419J5762j3932o3561l4791k2036l4177N4861Q0703J8530o904
11166D8350R581l0383l3255l6568K4237k7881k320m023N4766M1255m951l8247
11154E61l328M6926N9115k83N9900K9352k8212j34764o4956k9368k5415Q20N1358
11141c8294L528M3641J5098k093K2175J4070j1934k6922K2429M5324L5373n241
11129A17154k4405k8427q1291N4190N6620k0403k3584N243n1258j2522l0423r560
11117d8666J6603L4228N7859L8128R402p5881J21N319J5198m9214j8830N7990
$$ plain form
11203 28173 43740 42833 54002 40472 34815 42316 50239 78211 113033 71965 118780 139052 202435
11190 202435 206637 133188 74039 81225 114437 124719 91934 109035 55396 18692 28475 -9859
11178 -9859 -1524 53895 69657 55725 -7836 -42627 -64663 -98840 -43979 36724 55254 48350
11166 48350 57931 27548 -5707 -42275 -18038 -45919 -48239 -52262 2504 43759 38808 561
11154 561 -2767 44159 103274 102991 162891 192243 164031 29267 -35689 -65057 -90472 -89652 -38294
11141 -38294 -34766 8875 23973 21880 44055 58125 46191 19269 41698 87022 122395 117154
11129 117154 92749 64322 -16969 37221 93841 73438 49854 55097 3839 -8683 -39106 -48666
11117 -48666 -32063 2165 60024 98152 107554 31673 31794 37113 52311 3097 -15733 42257
11105D2257L3174L0953J5866l3680K6650M9021R449j7816L4409k0838q6371m246
11093G8828q4437n3469k113J07M7830N9879J5423M7483O9686L641r000m6956o1604
11080F5298J0658L3355j4425l7575k7264o6552l24K4513O7611j0199q282k1110
11068A5704j4030M8311J2614J432l7553l3066M5799J2624j5600m1304J6759k9734
11056a8044J3861K3585J5911l7767n314M9444Q1332j7821K8559l415j2610m0459
11044G7262k2518j6650l1501L4196k1960Q397J2501P1495N7170k0893m7680l0281
11032F9538l8397Q042J5636Q532J4880J172M306M5638l6851n237r67j5447N1536
11019A22381O877J1926m2129r5954j3042K0634L678M806L0235K6673K780J1013
$$ plain form
11105 42257 75431 106384 122250 88570 115220 164241 173690 155874 190283 169445 83074 78828
11093 78828 -5609 -59078 -61191 -61084 -13254 46625 62048 109531 179217 182858 173858 126902 65298
11080 65298 75956 109311 94886 57311 30047 -36505 -36829 -12316 55295 45096 36814 15704
11068 15704 1674 49985 62599 64031 26478 -6588 39211 51835 36235 -5069 11690 -18044
11056 -18044 -4183 19402 35313 -2454 -7768 41676 123008 105187 133746 130331 117721 77262
11044 77262 54744 38094 6593 40789 18829 27226 39727 111222 168392 147499 99819 69538
11032 69538 31141 39183 54819 63351 78231 79403 83709 129347 92496 87259 86292 70845 122381
11019 122381 129258 141184 99055 3101 -9941 10693 14371 19177 49412 76085 78865 89878
11007H9878m6557L6554K134j3219K0611L7368M1630l1136m4856j6844l4561O883
10995D7885N0223K1647q1548o8481O41O1075J9168R5M8002M6696n1194n3839l0886
10982I484l9608J8644Q3983k5323K8585J5134J6672R034n659J2755K940j5288
10970A11353p312k1403k6958J0705J8821o1503j9709M1402k8998r881Q8050J00811
10958A95378m4601o6730o7904J4573Q50k2752r0666q159J0063j4784J8722N0350
10946b5660J8646L8173j616j7435j8873l4207k5982L4420M5166J6240k3948O3381
10934F8305M2210n121k9965K4527p886K3478j0009n8710m5693O909P64q857k3389
10921b3437K4452O2195j390k9162n2565l8819M4805q475J3599j0656l398L6438
$$ plain form
11007 89878 43321 79875 82009 68790 89401 126769 168399 137263 92407 75563 41002 47885
10995 47885 98108 119755 38207 -30274 -29633 31442 50610 50705 98707 145403 94209 40370 9484
10982 9484 -30124 -11480 72503 47180 75765 90899 107571 116605 110946 123701 126641 111353
10970 111353 104041 82638 55680 66385 85206 23703 3994 45396 16398 6517 94567 195378
10958 195378 150777 84047 16143 30716 31566 8814 -81852 -90011 -79948 -94732 -76010 -25660
10946 -25660 -7014 31159 29543 12108 -6765 -40972 -66954 -32534 12632 28872 4924 68305
10934 68305 110515 105394 75429 99956 92070 115548 105539 46829 1136 8045 8809 -48 -23437
10921 -23437 1015 63210 61820 32658 -19907 -58726 -13921 -22396 -8797 -19453 -22851 13587
10909A3587K6259K4711L7404r201r4996O321R519j2066m7507p695J2039l0640
10897g2265r215M7281M5087k4754n3368p0K499p27J2042L8341K5143Q9326K5234
10884A24554M3461M2075n8737m8602q5454o0217j0030l8848j4350L8463J19669
10873E1984J3537j4783M4290j4274Q335N8995L3135k654m8782k221L91q8755L0211
10860F9409M1538J5202k1809K059j2548L7984j0734n0559j6923P200j1167N813
10848E5465j7438l5423%K3559k872k8384M098N3706K2186K1482L401J7024k0662
10835I6142J687n447k6837k2748l2184J5812l1760J14456R9227p936K9663Q382
10823B38457k6359J1760j7484J1278j4625j2976K5086J728j1697K1854K2374K8611
$$ plain form
10909 13587 39846 64557 101961 92760 -2236 4085 13604 1538 -45969 -53664 -41625 -72265
10897 -72265 -81480 -34199 10888 -13866 -67234 -67304 -64805 -65532 -53490 -15149 9994 99320 124554
10884 124554 168015 210090 151353 102751 17297 -42920 -52950 -91798 -106148 -67685 51984
10873 51984 65521 50738 95028 80754 89089 148084 181219 178565 129783 127562 127953 39198 69409
10860 69409 110947 126149 104340 106399 93851 131835 121101 70542 53619 60819 49652 55465
10848 55465 38027 2604 2604 26163 23291 -5093 -995 52711 74897 96379 99780 116804 96142
10835 96142 97829 92382 65545 42797 10613 26425 -5335 109121 208348 200412 230075 238457
10823 238457 212098 223858 206374 217652 203027 190051 215137 216865 205168 227022 249396 278007
10811B78007K0673L9522n9875l588o2032J2857Q571J0197m8717L702M6608M0557
10799B86482n6692k9496L4681K9120j7120P98P3547K1454P113K162j3391L10J9160
10786C58128Q9123J1666j02744k5208J4906o156J1052J1271N538j3571o4845J6199
10774C05359M2306m557n839m9334J8732P9709K927k6766j03957l8694P4709O5487
10762C60082L5015O186m0032l2687o3389o9126K8177K3714K9277l96M0722Q5162
10750D02705j0649o0807r8509q671L3521k0233P847M8319l4035j3071K9510n9364
10738B16563l9049n8699P5289J37076J2609n9116m2896M0320l3463n7277J481
10727A92838n1552J21m2291k7282l405l84N4430J9581k9187q086k082M976K0831
$$ plain form
10811 278007 298680 338202 278327 274739 212707 225564 234135 244332 195615 199317 245925 286482
10799 286482 229790 200294 234975 264095 246975 247773 321320 342774 349887 352049 338658 338968 358128
10786 358128 447251 458917 356173 330965 345871 339715 350767 362038 367576 354005 289160 305359
10774 305359 347665 343108 337269 287935 306667 386376 389303 362537 258580 219886 294595 360082
10762 360082 395097 401283 361251 328564 265175 196049 224226 247940 277217 276821 317543 402705
10750 402705 392056 331249 232740 224069 257590 237357 245204 293523 259488 246417 275927 216563
10738 216563 177514 118815 194104 331180 343789 284673 241777 282097 248634 191357 192838
10727 192838 141286 141407 99116 71834 68429 68045 122475 142056 112869 104783 102701 107677 128508
10714A28508L5671l873l9978K029p650p3345p55L7097J770k4170m3382j5560j3838
10701a7476J5018M1160K7465L7206M6844L2513k0425m2318l5708J9718Q96L2981
10689A37874l415r3809n4444N283J7019J8646L3869J0260N7383J1938j7087P5405
10677A98922m5421o238J8116n078n9094j8551J9214K0528j0531p679l7057K9736
10665I6867j5034N0245j8805J4079K7667m5974l2305K0240K9869O785L3936L778
10653A71348L4937J6824N405m7589n1112J5149M5849n012j3071l2187J0470P401
10641A58412l1333L6122N3475L0608L4879m6454n7238l7465j0276K4469J4281
10630A69480m9285m3679N3201R957p8487k7725K7314j2720M1996M0578J3126K6691
$$ plain form
10714 128508 164179 160306 120328 122357 114707 41362 40607 77704 79474 55304 11922 -3638 -17476
10701 -17476 -2458 38702 66167 103373 150217 182730 162305 119987 84279 103997 104893 137874
10689 137874 134459 40650 -13794 -8511 8508 27154 61023 71283 128666 140604 123517 198922
10677 198922 153501 147263 165379 160301 101207 82656 101870 122398 111867 104188 67131 96867
10665 96867 81833 132078 113273 127352 155019 109045 76740 96980 126849 133634 167570 171348
10653 171348 206285 223109 228514 180925 129813 144962 190811 185799 172728 140541 151011 158412
10641 158412 127079 163201 216676 247284 282163 235709 178471 141006 130730 155199 169480
10630 169480 120195 76516 129717 139674 61187 33462 60776 48056 90052 130630 143756 170447
10618A70447m9496j5871l3413j2834q043r790P1359l0670o9231N7247q672J9275
10606H0308R1343m7457j22099Q682J03853M5650R91J823R3800M48m0935l0245
10594A86162K5214L9295M6436n6709n904o2876m6807K8925P5924L3378k1506L9912
10582B81444j5174L8462l153j4342J334k0674q1713k1736N9618J6584J1880m006
10570B48524q451O8205j1517l3564r8074p920O528M6285K9258K9339m0272k7950
10558B00391l4863l913K7035R1842N5648J2343j1142q011K1122m1743k6723j4608
10546B67378O56J8412n6421j0349m1486k7585L4167Q8293P9863r072k6687m2811
10534B74358M0256O8545j6007K4269L5276N1737J5490l448m2486K696R9642k4731
$$ plain form
10618 170447 120951 105080 71667 58833 50790 41000 112359 81689 12458 69705 61033 80308
10606 80308 171651 124194 2095 10777 114630 160280 161271 163094 256894 257342 216407 186162
10594 186162 211376 250671 297107 240398 234494 171618 124811 153736 229660 263038 241532 281444
10582 281444 266270 304732 301579 287237 288571 267897 186184 164448 224066 240650 252530 248524
10570 248524 240073 308278 296761 263197 165123 157203 163731 210016 239274 268613 228341 200391
10558 200391 165528 161615 188650 280492 336140 348483 337341 329330 350452 308709 281986 267378
10546 267378 268034 286446 230025 219676 178190 150605 184772 273065 352928 343856 317169 274358
10534 274358 314614 383159 367152 391421 426697 478434 493924 490476 447990 450686 550328 525597
10522E25597k506K3886q363L4124M9009m197l4727l5660J6904J7274K4522m3276
10510E62587l3471O7907Q8779k0968m2239j5231O3213Q8924k9556k5491N2049
10499G56503q9314O608l886K2819J07255N7137l2093k5866m8442l794N5719O5702
10487H68348n118l813k6484J4242M8185P1737N1613L0716M6852R639j9742k589
10475A083586L4949n812K057M0112P6237N8434J234o0724M0039R1931L9134l952
10463A397225R620M1409J0454j544K6174N8093N8775N2534O2402K7019K9241J0135
10451A781537J09705M4337N1686J23692R0835L3818K318K3824M7092P6556K3988
10440B409388N8072J00694J47670J12091P8282J06502P3658L7805J31382J86963
$$ plain form
10522 525597 523091 546977 538614 572738 621747 617550 582823 547163 564067 581341 605863 562587
10510 562587 529116 597023 685802 664834 622595 607364 670577 759501 729945 704454 756503
10499 756503 667189 673797 669911 692730 799985 857122 825029 799163 750721 746927 802646 868348
10487 868348 863230 859417 832933 847175 895360 967097 1018710 1049426 1096278 1105917 1086175 1083586
10475 1083586 1118535 1112723 1114780 1154892 1231129 1289563 1290797 1230073 1270112 1362043 1401177 1397225
10463 1397225 1406845 1448254 1458708 1457164 1483338 1541431 1600206 1652740 1715142 1742161 1771402 1781537
10451 1781537 1891242 1935579 1987265 2110957 2201792 2235610 2237928 2261752 2308844 2385400 2409388
10440 2409388 2467460 2568154 2715824 2827915 2906197 3012699 3086357 3124162 3255544 3442507
10430C442507J74929J80116J56159L1310J59737J60176J60155K73603K26485J97772
10420E162949K23747K95386K66818K88971K69724L85862M06268M87655M90252
10411H277632N26619N65434O34887O58796P88908R45299R10323J001372J168309
10402A5477579J273893J409385J406271J520311J820104J942643J988998K091252
10394B8930436K116592K134989K004996J982688J913074J730375J531672J359072
10386D3703894J206798R84997O02972L51576K15585L8566j01648j41886k5980
10377D6834874M3799J51807L02307M95569O24681P81041R10378J062634J131690
10368E2338780J132289J230215J223909J212903J188282J012605Q49880Q11174
$$ plain form
10430 3442507 3617436 3797552 3953711 3985021 4144758 4304934 4465089 4738692 4965177 5162949
10420 5162949 5386696 5682082 5948900 6237871 6507595 6893457 7299725 7787380 8277632
10411 8277632 8804251 9369685 10004572 10663368 11452276 12397575 13307898 14309270 15477579
10402 15477579 16751472 18160857 19567128 21087439 22907543 24850186 26839184 28930436
10394 28930436 31047028 33182017 35187013 37169701 39082775 40813150 42344822 43703894
10386 43703894 44910692 45895689 46498661 46850237 47065822 47104388 47002740 46860854 46834874
10377 46834874 46878673 47030480 47332787 47828356 48453037 49234078 50144456 51207090 52338780
10368 52338780 53471069 54701284 55925193 57138096 58326378 59338983 60188863 61000037
10360F1000037P46564N34133N20493M98669L20405O6179q3934k61679m13519n83073
10350F2344275p57444q66398j005172r64467r60366r72329r34676r07024r06429
10341E4069970q49157q09399p46559o56560n80948l96464l57651k45941j27020
10332D9300271p641l7835n8537q8948k30434l05053m75436o42394q89592j114984
10322D5449417j386905j603072j681525j830646j972509j919807j900148j828862
10314C1325943j709111j655652j537055j503844j410111j170005j055863j034572
10306B0249730q90677q53741p96308p22246p39459p03624n68810n36321m71215
10297A3967329m95040m78261m74477m46283m39683l79975l19601l32219l22609
$$ plain form
10360 61000037 61746601 62280734 62801227 63299896 63620301 63686480 63602546 63340867 62927348 62344275
10350 62344275 61586831 60720433 59715261 58750794 57790428 56818099 55883423 54976399 54069970
10341 54069970 53220813 52411414 51664855 51008295 50427347 50030883 49673232 49427291 49300271
10332 49300271 49292630 49254795 49196258 49107310 48876876 48571823 48096387 47453993 46564401 45449417
10322 45449417 44062512 42459440 40777915 38947269 36974760 35054953 33154805 31325943
10314 31325943 29616832 27961180 26424125 24920281 23510170 22340165 21284302 20249730
10306 20249730 19359053 18505312 17709004 16986758 16247299 15543675 14974865 14438544 13967329
10297 13967329 13472289 12994028 12519551 12073268 11633585 11253610 10934009 10601790 10279181
10288A0279181l41136k97036k71048k61912k71498k48642k69498k49754k00884
10279G867773j87522j97630k15107j61449j86360k35862j64254j59240j76603
10270F183746q1178j27318j42459j85722j46827p8491q6106r6008j45323j50606
10260D943708m5187j31864j76779q0939n0071j19904j06719j10725j38988o4232
10250C918300o696k2918j08861r9219o9687j5159j9697n1779r1078j66602q4597
10239C182007J149j6116q4552n7079o1127p4570L9128n5847j02707n9597j8985
10228B691704l8050n329K665k8852o5024Q150j5856p6693j00126j09234n3548
10217B209807q4154J9720K5017Q465l3345o1732J6842j4644k2126q139L722K9796
$$ plain form
10288 10279181 9938045 9641009 9369961 9108049 8836551 8587909 8318411 8068657 7867773
10279 7867773 7680251 7482621 7267514 7106065 6919705 6683843 6519589 6360349 6183746
10270 6183746 6102568 5975250 5832791 5647069 5500242 5421751 5335645 5239637 5094314 4943708
10260 4943708 4898521 4766657 4589878 4508939 4458868 4338964 4232245 4121520 3982532 3918300
10250 3918300 3911604 3888686 3779825 3680606 3610919 3595760 3576063 3524284 3433206 3266604 3182007
10239 3182007 3183156 3167040 3082488 3025409 2964282 2889712 2928840 2872993 2770286 2710689 2691704
10228 2691704 2653654 2648325 2650990 2622138 2557114 2565264 2549408 2472715 2372589 2263355 2209807
10217 2209807 2125653 2145373 2170390 2178855 2145510 2083778 2100620 2085976 2063850 2055711 2059433 2089229
10205B089229L978j08394j15069p4280j3656J8034p5191m1946M3060J9411l8929
10194A706247q8615n7912K5950K251m7841l8831L5478N4479n768j8095n4441j7580
10182A495322o351l7777j0127K9923l0283n4135L949l9371j7309n1078l6513l3971
10170A212279j08075L4930O0636j7070P049l8008l4214o3544k6248l4744l8105
10159I54886K5222M3495m9627n4529K3540J894n2008k367N156j4203p806N2189
10147I25842O7310n4349m2017q815j3643k61P673J5378J115R778J8908L511k4174
10134I06256n5641n4943M810Q8313k991j27237n6977J7213J08506P8398J6212
10123I21919o2410q125n3775n702K3697k4348M3336L0986p6817m8129m074r973
$$ plain form
10205 2089229 2093207 1984813 1869744 1795464 1781808 1799842 1724651 1682705 1725765 1745176 1706247
10194 1706247 1617632 1559720 1585670 1587921 1540080 1501249 1536727 1591206 1585438 1567343 1512902 1495322
10182 1495322 1488971 1451194 1441067 1470990 1440707 1386572 1390521 1351150 1333841 1282763 1246250 1212279
10170 1212279 1104204 1139134 1199770 1182700 1189749 1151741 1117527 1053983 1027735 992991 954886
10159 954886 980108 1023603 973976 919447 942987 944881 892873 890506 895662 881459 873653 925842
10147 925842 993152 938803 896786 887971 874328 874067 881740 897118 898233 908011 926919 930430 906256
10134 906256 850615 795672 800482 888795 885804 758567 701590 718803 827309 905707 921919
10123 921919 859509 851384 797609 791907 815604 791256 834592 865578 788761 740632 736558 726585
10111G26585J8079L0963R535L0753k5080n2365n1177j5706k744o7072p2083N7196
10099E86884Q7159M8272L2770M4341o2311q1617j7223M36N9912k4638M668P483
10087F86136m6879J8675j3013k0467k4531l0425m0645M8792J9505l5664J9068
10076E80552k2410r910J6679O5359L2281m6408p276k5643l6401l9386r63l7477
10064D68997j9321N961J6301M7770k0178k1591N8857K4392j02532J5616J2974
10053D87246k7699j1857R393L1353J5235o0295p278K9407L4080K2673L68L9796
10041E62422m5100p5013k7496M2009r844K8434J2148o1630K2405N0218P451m320
10029E01684k8065O563J05p5092l8615M7157M789j0615L4205m057k8054P752M585
$$ plain form
10111 726585 744664 775627 785162 815915 790835 738470 687293 671587 668843 601771 529688 586884
10099 586884 674043 722315 755085 799426 737115 655498 638275 638711 698623 673985 678653 686136
10087 686136 639257 657932 644919 624452 599921 569496 528851 577643 597148 561484 580552
10076 580552 558142 548232 564911 630270 662551 616143 608867 583224 546823 507437 506474 468997
10064 468997 449676 455637 471938 519708 499530 477939 536796 561188 458656 474272 487246
10053 487246 459547 447690 457083 488436 503671 443376 436098 465505 499585 522258 522626 562422
10041 562422 517322 442309 414813 456822 446978 475412 487560 425930 448335 498553 506004 501684
10029 501684 473619 480182 480287 405195 366580 413737 418526 407911 442116 438059 410005 417757 422342
10016D22342m6361m2063Q7279J8930j03581o3659K9387L1943M0500L9629J1980
10005D26326l0381O0272k403j4796l5469o8205m7757o989O3323O2596k199J2665
9993D16983o4144l547j6367q990k082K0557L15M11L0448J1089K2246k6434o1854
9980C18631K4956j5340l795M063N8376j2457n1913l0063M2997M7403M5691M5027
9968D73576m559n9675M7138J799m9004P216L8310k7101j312M1929L4911K11j8591
9955D84848L5852j8957L3415L9507j5251o4218j1524K6953M7971m7410k2968K8851
9943E17069J9160L5244K4655l9761m4747n8240j1569P1764P5011J7208J0348J3649
9931F29791j3437j23757o9210K1856R2592P9533L7059n9070o9913K1255P020j9370
$$ plain form
10016 422342 375981 333918 421197 440127 336546 272887 302274 334217 374717 414346 426326
10005 426326 395945 456217 453814 439018 403549 335344 287587 280598 343921 406517 404318 416983
9993 416983 352839 349292 332925 323935 321853 342410 342725 343136 373584 384673 406919 380485 318631
9980 318631 343587 328247 324452 328515 386891 374434 322521 292458 335455 382858 428549 473576
9968 473576 469017 409342 456480 458279 409275 416491 454801 427700 426388 468317 503228 503439 484848
9955 484848 520700 501743 535158 574665 559414 495196 483672 510625 558596 511186 488218 517069
9943 517069 536229 571473 596128 556367 511620 453380 441811 513575 588586 605794 616142 629791
9931 629791 616354 492597 423387 445243 537835 617368 654427 595357 525444 546699 553719 534349
9919E34349m4336O2J4614L6385J0538m344j7361k5093j9442l3021L57L3310M9123
9906E35141P904L3896J8496J5605J2049P060k151l2951K3914k9179K1674k9227
9894E82231q3164l9724M1587M5975K1606q4024j3750j7539L6146p0960M6369J5481
9882D80234l5011l5464k3499O350J10263k7478L105r420o4989q358j4785n114
9870C75834l2270k6449K9266L4402Q819P2840L664J9606N7201M2536M4984o4041
9858E66392k5078M6382M3131N3225n9883j03019m9359k1603N218L0382n4473r1540
9846C39775l82K932L6565n9907k207M6604K3297m7495q030k183Q826L1156Q0866
9833D49817M225l7110n706n8128o5829N903M2361J9784l7976L1772N5860r991
$$ plain form
9919 534349 490013 490075 504689 541074 551612 547268 529907 504814 485372 452351 452708 486018 535141
9906 535141 543045 576941 595437 611042 623091 630151 628000 595049 618963 589784 611458 582231
9894 582231 499067 459343 500930 546905 568511 484487 470737 453198 489344 418384 464753 480234
9882 480234 445223 409759 386260 392610 502873 475395 478500 469080 404091 395733 380948 375834
9870 375834 343564 317115 346381 380783 389602 462442 466106 485712 542913 585449 630433 566392
9858 566392 541314 587696 630827 684052 624169 521150 471791 450188 455406 485788 431315 339775
9846 339775 339393 342325 378890 318983 316776 363380 386677 339182 331152 328969 337795 368951 449817
9833 449817 454042 416932 411226 353098 287269 293172 335533 355317 317341 349113 404973 394982
9821C94982j0772J15964J02941K6046k656P1216M9252N334k0228K5722K9946N0675
9809H38422Q6389n8593n4431n3051n0238p9246j12756l8732j5520j8598J3951
9798D57597m4256l2203r238m5425P776k8326k5943J8468K5380N4545R586o8442
9786C19519k6746J9322N2958L7421P964n263K4224M0381J721j895j3204q7408
9774C68994j5551P2940R0979m915p9884K8283R0871N8589j4028K2532q8378j4858
9762E15574l3227j5005M6093N9606J9207j56114o9608L5189l6684j2631R3166
9751D45566m0638r1514K7463K6130K0019l8432o8948l768m9096k3913N5627M2131
9739C00627M8515j5199k1828K5097m8897j07285o9643q219N09O5015L7636J132
$$ plain form
9821 394982 384210 500174 603115 629161 626505 697721 746973 752307 732079 757801 787747 838422
9809 838422 924811 866218 811787 758736 708498 629252 516496 477764 462244 443646 457597
9798 457597 413341 381138 371900 326475 334251 305925 279982 298450 323830 378375 387961 319519
9786 319519 292773 312095 365053 402474 410438 405175 429399 469780 471501 469606 456402 368994
9774 368994 353443 426383 517362 512447 432563 460846 551717 610306 596278 618810 530432 515574
9762 515574 482347 467342 513435 573041 592248 436134 366526 401715 365031 352400 445566
9751 445566 404928 313414 340877 367007 387026 348594 279646 275878 226782 202869 258496 300627
9739 300627 349142 333943 312115 337212 288315 181030 111387 103168 103677 168692 206328 207460
9727B07460j908J4639m2194K3116L2643Q9679N2426L5822o4221j49323j07377
9716I0762K292L8112M2463K428K2985j4677P4997M4396o9714o3399j4889L6118
9704A91874L0820j5770L5106p191p3271N523L832R915k988o7082n6399K9803J2199
9691I6371J13809j1132r6880l9988l9323N4185Q0512o851k5833m886l3791L0478
9679A16671j9060k5493m899k4090Q9698M5735p4571l8245N2264M1198l1768l0412
9667I7028J6932R471P8682M9475k8027o1926K4704j763m7177L7423P047l5819
9655A46050j0638l1753l3878K981K0635M8671P6876K7700m323M2420m7739m0248
9643A96754K1511K8538l7591N957M8019L6313J0193j8274m6175l4997j2113k5426
$$ plain form
9727 207460 205552 220191 177997 201113 233756 323435 375861 411683 347462 198139 90762
9716 90762 93054 131166 173629 176057 199042 184365 259362 303758 234044 170645 155756 191874
9704 191874 222694 206924 242030 234839 161568 167091 170923 180838 177850 110768 54369 84172 96371
9691 96371 210180 199048 102168 62180 22857 77042 157554 150703 124870 119984 86193 116671
9679 116671 97611 72118 67219 43129 132827 178562 103991 65746 118010 159208 127440 97028
9667 97028 113960 123431 202113 251588 223561 161635 186339 184576 137399 174822 181869 146050
9655 146050 135412 103659 69781 72762 93397 142068 218944 246644 242321 284741 237002 196754
9643 196754 218265 246803 209212 215169 263188 299501 309694 291420 245245 210248 198135 172709
9631A72709o0212M989J833N9334k861q9090l4407J9994R4274j7494k9901j4493
9619A04675Q867L5177J7175j8266m1612j3459r681M8679K7047j2004r778P327
9607A44147K6650j1451K797Q457j3552r474o6938n0358Q610J2006K6242O4432
9595A41568M6001p0770n348L1266K7770J6062J345q921j7280r6603m792J9463
9583G9761J2124L1487K4371J4452K3372P340k6220k9916l8349n611k8511l5893
9571B8407q2348k9169M6022J18917j315K8165P5299j4755J7411l6560k2262n41
9559A27271q9743k236M4815l8514M0958l6484n5870L4187l3293K1335K5693M4118
9547H2237M7373j9974j00779M4766K4229M3844J1905k6253r1638p035O5194M1950
$$ plain form
9631 172709 112497 117486 119319 178653 175792 86702 52295 72289 166563 149069 119168 104675
9619 104675 113542 148719 165894 147628 106016 92557 82876 131555 158602 146598 136820 144147
9607 144147 170797 159346 162143 170600 157048 147574 80636 30278 38888 50894 77136 141568
9595 141568 187569 116799 111451 142717 170487 186549 187894 178973 161693 65090 60298 79761
9583 79761 91885 123372 147743 162195 185567 192907 166687 136771 98422 92811 64300 28407
9571 28407 -53941 -83110 -37088 81829 80514 108679 183978 169223 186634 150074 127812 127271
9559 127271 37528 35292 80107 41593 82551 46067 -9803 24384 -8909 12426 38119 82237
9547 82237 129610 109636 8857 53623 77852 121696 133601 107348 15710 8675 73869 115819
9535A15819P3476J04544m907r6880k3113k2461m535k6988N79n6435L3822K6938
9523A19859n196N1198l7063k8264P9969m0824m5588q8059J0287k039N4893K9618
9511I8791K1227J7741l4006K6606L7046L0631o5549M750k1001j0843r347N5864
9499A51910k4485p0426m7397P1141R3834J1801l4542j7817p7379M4245J2652K9830
9487A43367M1536o628r7295J7211L8434m301J5748L4399r7122j4094k3587J0626
9475E8294R3416K7788m4232k3731o0993K0912l9859o394K3292l136j0729l1354
9463C274m5752J9169M2360L6068Q6548M5717k5683L251o8162m8156N2857K4777
9451A26268q3578N838J9316n4304L3158N4448l5653l25k5336L9864R8417m9766
$$ plain form
9535 115819 189295 293839 288932 192052 168939 146478 141943 114955 115534 59099 92921 119859
9523 119859 114663 165861 128798 100534 180503 139679 94091 6032 16319 14280 69173 98791
9511 98791 120018 137759 103753 130359 167405 198036 132487 137237 116236 105393 96046 151910
9499 151910 127425 56999 9602 80743 174577 186378 151836 134019 56640 100885 113537 143367
9487 143367 184903 178275 80980 98191 136625 132324 148072 182471 85349 71255 47668 58294
9475 58294 151710 179498 135266 111535 50542 71454 31595 25201 48493 45357 34628 3274
9463 3274 -42478 -23309 19051 55119 141667 187384 161701 164952 96790 48634 101491 126268
9451 126268 42690 48528 67844 13540 46698 101146 65493 65168 39832 79696 178113 128347
9439A28347n7975p927L2247J1335m7675j7890J0079l0301p0993O3456N2706m882
9427F0527K7164o1800J4664L2984j3999j6545m3851R646K5311J7802M5686l9533
9415E8056L1547N4869L2695o5400n1725O5262J5172J0528o919J4670n1399k1159
9403H6197N1064J6553N3843j17097j16567J5338N9717Q5674m7413N7568J2998
9392A57875p2890k319K3504l4178l3273P834N7876O1576k9385o4280n0458j0659
9380A1223J14991K265n6919k3692k1007O3748K6353o1552M155M3308n3665j6400
9368C2808n448j267k361K3125J1807o9297r237J2487K8076P1787J09399R890l7026
9355A74743r2036m0171K5316L4825m042L5415l9343Q062J2364l1190K250k5340
$$ plain form
9439 128347 70372 62445 94692 106027 58352 40462 50541 20240 -50753 12703 65409 60527
9427 60527 87691 25891 40555 73539 59540 42995 -856 8790 34101 51903 97589 58056
9415 58056 89603 144472 177167 111767 60042 125304 140476 151004 144085 158755 107356 86197
9403 86197 137261 153814 207657 90560 -26007 -10669 49048 134722 87309 144877 157875
9392 157875 84985 82666 106170 71992 38719 46553 104429 166005 136620 72340 21882 11223
9380 11223 126214 128479 71560 47868 26861 90609 116962 55410 59565 102873 49208 32808
9368 32808 27360 26093 23732 46857 58664 -10633 -19870 -7383 20693 92480 201879 211769 174743
9355 174743 82707 42536 67852 102677 98635 134050 94707 102769 115133 83943 86193 60853
9343F0853l5214J0013l8959J1769L5196L4473m390j2138K2057m9602K8593N7445
9331A20096P9754L4087p8986P289r335k0020m284l828J8660p917K3798M8294k9134
9318A78474n849n8308p0658m4078l5766J0477N1109L3691o7626J7013j9535m0877
9306e1933k2533N6122J422L3261L2504R8806M584r290l5314K117p4554P262Q9100
9293A31554j9629m7074k4767M6449K1950j7972l1729J918M5192O821j4123p6323
9281B2267j5022R091l3925R128j1346N1885K1320k0714k0967K8913q086L1926
9269F4470K9526j6767l3765m1251K799K2401K1339J724K2867n9375k6368M4357
9257C1957o9696L6268K6279J3597J5240K2301K9656m9774K119J4280K8001l1722
$$ plain form
9343 60853 25639 35652 -3307 8462 43658 78131 73741 61603 83660 34058 62651 120096
9331 120096 199850 233937 154951 162240 152905 132885 128601 124773 143433 135516 159314 207608 178474
9318 178474 172625 114317 43659 -419 -36185 -25708 25401 59092 -8534 8479 -11056 -51933
9306 -51933 -74466 -18344 -16922 16339 48843 147649 152233 142943 107629 109746 35192 42454 131554
9293 131554 111925 64851 40084 86533 108483 90511 58782 60700 105892 112713 98590 22267
9281 22267 7245 16336 -17589 -8461 -19807 32078 53398 32684 11717 40630 32544 64470
9269 64470 93996 77229 43464 2213 5012 27413 48752 50476 73343 13968 -12400 31957
9257 31957 -37739 -1471 24808 38405 53645 75946 105602 55828 57947 72227 100228 68506
9245F8506p685P906J6827Q741K8873L6343j1541j7828j05587p9045j3711O0244
9233g957L4227l8287J7872M9117N4752M671m9358k1381K7853k648J6406O3455
9221A48722l5426J9925n390l1884J0539k7256J0771M381o429m0875N656K9619
9209H2353k2191L0073O825K391p823p1259j2848M3146o860j1798M8095P26O940
9196H7770J6729j1255p2435k4542M8635N0722j20m9097J3264k6253n25N9551k7623
9183F4821j1427L0814Q6779N9358j3867p6616n5430O510k903L0983M6463L4853
9171B00338q1697m7243M1782j8982q215n4488j3905j0500M3606R3629Q795l4715
9159A18405l4361j1853K4672M3644M1478l1899l7992k1422N439j26944N5165l2149
$$ plain form
9245 68506 60821 68727 85554 94295 123168 159511 147970 130142 24555 -54490 -68201 -7957
9233 -7957 26270 -12017 5855 54972 109724 114395 65037 43656 71509 68861 85267 148722
9221 148722 113296 133221 127831 95947 106486 79230 90001 94382 87953 47078 52734 82353
9209 82353 60162 90235 97060 99451 91628 20369 7521 50667 43807 32009 80104 80830 87770
9196 87770 104499 93244 20809 -3733 44902 95624 95504 46407 59671 33418 32893 92444 64821
9183 64821 53394 84208 170987 230345 216478 139862 84432 90942 88039 119022 165485 200338
9171 200338 118641 71398 113180 94198 85983 31495 17590 7090 50696 144325 153120 118405
9159 118405 84044 72191 96863 140507 181985 150086 112094 90672 96111 -30833 24332 -7817
9147g817n9035J9801R5146L213m3104J703q413O018k5722L1406J7508K4818J172
9134E6694n1707r8330M7428Q5631J8881K2875K0238L1697O036m6762o1077q248
9122B3356L5226L7374R966j0013r051m7546j6467J0779N7205K8390k880J2639
9110A28978M0904l1014r2711m4737p4810L05O9004L5108l8987N5161K5840k330
9098G0711K3765L3946J9047j5882n1702k0790J7291J9853P618k4469q177j7185
9086E4026j5152l000K6713N6326L8861m984l0968n4628M4K6279k2659n6821M9167
9073F3204R965M3044K1718q7410q9678K160N9093l2383M632K3582M9925L1576
9061I9428n4929p5151M9739O4084j9713k9904m1062q487j1711O5900k8381j5249
$$ plain form
9147 -7817 -66852 -47051 48095 51308 8204 9907 1494 7512 -18210 13196 30704 55522 56694
9134 56694 4987 -93343 -45915 39716 58597 81472 101710 133407 139443 92681 31604 23356
9122 23356 58582 95956 105922 95909 86858 39312 22845 33624 90829 119219 116339 128978
9110 128978 169882 138868 46157 1420 -73390 -73085 -4081 31027 -7960 47201 73041 70711
9098 70711 94476 128422 147469 131587 79885 59095 76386 96239 103857 79388 71211 54026
9086 54026 38874 35874 62587 118913 157774 152790 121822 67194 67238 93517 70858 14037 63204
9073 63204 73169 116213 137931 50521 -39157 -36997 22096 -10287 -5655 17927 67852 99428
9061 99428 44499 -30652 19087 83171 63458 33554 -7508 -15995 -27706 38194 9813 -5436
9049e436J1968L3443L7429J1229l4651L2020J2359K5876N712J0912j3955j1130
9037A15776K2979m7214m3881j3360j7296K5758J2382k6446j6999M917k10o5811
9025d9405l9522N4037J02643N9498m4326J2424m6859j3986K0323r131k3202R233
9013C1727l3312j5840J28076N9964k7283l5575l9696M8905Q675K2041k4000l1975
9001I1707N8587J8415J482m1440n0915K2737J7848l2267P8193q1992l8373Q0721
8989A24703K7035J5190n7756n497M5839M8907n8079j5027m7231P905M3408l6629
8977I2768k2098P5342K9585m5727l2875k3297r877N6414L73k4672J4804N531n0456
8964F5815m1820M5337Q4031L5860J7264q045k6408k205n1286m0953q427j6856
$$ plain form
9049 -5436 6532 39975 77404 88633 53982 86002 98361 124237 129949 140861 126906 115776
9037 115776 138755 91541 47660 34300 17004 42762 55144 28698 11699 16616 16406 -49405
9025 -49405 -88927 -34890 67753 127251 82925 95349 48490 34504 54827 45696 22494 31727
9013 31727 -1585 -17425 110651 170615 143332 107757 68061 116966 125641 147682 123682 91707
9001 91707 150294 168709 170191 128751 77836 100573 118421 86154 164347 82355 43982 124703
8989 124703 151738 166928 109172 103675 149514 198421 140342 125315 78084 85989 129397 92768
8977 92768 70670 146012 175597 129870 96995 73698 63821 120235 120608 95936 110740 116271 65815
8964 65815 23995 69332 153363 189223 206487 198442 172034 169829 118543 77590 69163 52307
8952E2307o3761K272j5828L1040m2769l5137K1893Q3490O5810k9327J254O285
8940G7529m6057l6422M0810N1086L7235j437N2516k1083k4218l67J4873o7755
8928G6710m1947q4996j370k8796N3256N3656M7158J2503K0107r383K169M0777
8916A39844j5440J2442K4291q3896k9783N4038Q4466L7660m9982k5615P9807o356
8904B21476n2024o728l0178q9012K961O5243M8897j4920L3465M6765K9138k8892
8892B26191j6198r4407K570O7281L2324K3862J8990n9231J682J041m691K6356
8880B25770n166k244m1112l8634j8563O3372L2202p3352j7865J2152K688N0588
8868A89836J6836R38k971L552o759j0039K5077p101M4179O458p8190k5061J5966
$$ plain form
8952 52307 -11454 -9182 -25010 6030 -36739 -71876 -49983 33507 99317 69990 71244 77529
8940 77529 31472 -4950 35860 86946 124181 122744 175260 154177 129959 129592 144465 76710
8928 76710 34763 -50233 -51603 -80399 -27143 26513 73671 86174 106281 96898 99067 139844
8916 139844 124404 136846 161137 77241 47458 101496 185962 223622 173640 148025 227832 221476
8904 221476 169452 162724 132546 43534 46495 111738 160635 145715 179180 225945 255083 226191
8892 226191 209993 115586 118156 185437 217761 241623 260613 201382 203064 204105 199414 225770
8880 225770 220604 218360 177248 138614 120051 183423 215625 142273 124408 136560 139248 189836
8868 189836 206672 207610 204639 208191 201432 191393 216470 209369 253548 260006 181816 156755 172721
8855A72721J2288P230N1509J3641R592R968K825l3937J7128N0010j2688J6368
8843C16655k9008j9231Q3125M4561O6362O4659N6258l4926n9825n0432j4373L7199
8831D61024N313K0325K6590K378o648k390k807J3999n0083j0220J5877m2238l7079
8818C94041j2130N270N2397k5136l0751l7295j6998k3571M7278L8530O4528k6352
8806D29811p6585k4269O1645J28485j6309o7701k3762R13j8702L0499m756l1507
8794C87762r5414q3665P6494N9517L5685O6056J8308L7427L1039M8184l6022N3207
8782E98578N4625J2218J7257m7047m3620M6779m6191o8419l8548j6498j1192k9395
8770D28547m0888n185M4116J0682k4048k1211O6742J6730p6208n6140l4860k3692
$$ plain form
8855 172721 185009 192239 243748 257389 266981 276949 279774 245837 262965 312975 300287 316655
8843 316655 287647 268416 351541 396102 462464 527123 583381 548455 488630 438198 423825 461024
8831 461024 466337 486662 513252 515630 508982 506592 503785 517784 467701 457481 473358 431120 394041
8818 394041 381911 387181 439578 414442 383691 346396 329398 305827 353105 391635 456163 429811
8806 429811 353226 328957 390602 519087 502778 435077 411315 412228 393526 424025 419269 387762
8794 387762 292348 208683 285177 344694 380379 446435 464743 502170 533209 581393 545371 598578
8782 598578 653203 665421 682678 635631 592011 638790 592599 524180 485632 469134 457942 428547
8770 428547 387659 382474 426590 437272 413224 392013 458755 475485 399277 343137 308277 284585
8758B84585K6386M5524l646m6165n9521N707N3949O7037j335o6143j0101q035
8746B88242l668Q4027m0173K275m0785k6208j329N7950J02640L6827o29k3068
8734D36101J1724M095J0268M6949n7151j0920J7053m0813p3704j4823l2484R392
8722C05687N1973k3196j0595k1709n2357l2593L3734k3167j8469J684k4324R710
8710A96378K120k0646p1513l9015k487J7583L5713O5303L885j5372l8651j9582
8698A13716j1100K2354O0648K6605j0710k5650k3351M1092Q918l3844q8160k5740
8686E4778P3247L7238L3014l1876j5840p9287k6775Q0299N7277L9207k7084M339
8674A98537M3889j5655o8653J4410P2994m0083o9988K1450K9190m9100j0907j599
$$ plain form
8758 284585 310971 356495 352849 306684 247163 252870 306819 373856 372521 306378 296277 288242
8746 288242 284574 368601 328428 330703 289918 263710 262381 320331 422971 459798 459169 436101
8734 436101 447825 451920 462188 509137 451986 441066 458119 417306 343602 328779 296295 305687
8722 305687 357660 334464 323869 302160 249803 217210 250944 227777 209308 210992 186668 196378
8710 196378 198498 177852 106339 67324 64837 82420 118133 183436 187321 171949 133298 113716
8698 113716 102616 124970 185618 212223 201513 175863 152512 193604 202522 168678 80518 54778
8686 54778 128025 165263 198277 166401 150561 71274 44499 124798 182075 221282 194198 198537
8674 198537 242426 226771 158118 172528 245522 205439 135451 156901 186091 136991 126084 124485
8662A24485n5683K8546j3292r115l6291n3648J3295n446m9189O9985Q2022k5427
8650G0242K7137N7232q9215l935k0009m118N5808j4712J116j4992j4661O4339
8638A14232r06n817L1733n6926k3369O8842K4673n3254n9291p549j2069P3058
8626I3357Q098J5736p940J3234r205J8344K36j7571l6477P084P666K2118J472
8613A16152q516m7262m4713N1811K3892l0915K8175O91m898K4987M6732n843n07
8600A49786j9663M838K6630J5679k9935j695l6800J9214K3187k843l3257o6034
8588D9107P0551n791k1181O5669J7701j7858q2526j4753N9320K607p0391P403
8576E9858O7485j50R429m3683L570n034k560n3919K4075O8955l470j7656l8510
$$ plain form
8662 124485 68802 97348 84056 74941 38650 -14998 -1703 -7149 -56338 13647 95669 70242
8650 70242 97379 154611 65396 61461 41452 37334 93142 78430 79546 64554 49893 114232
8638 114232 113326 107509 139242 82316 58947 127789 152462 99208 39917 32368 20299 93357
8626 93357 101455 117191 109251 122485 113280 131624 131860 114289 77812 84896 92562 114680 116152
8613 116152 107636 60374 15661 67472 91364 60449 88624 89315 84417 109404 156136 150293 149786
8600 149786 130123 134961 161591 177270 147335 145640 108840 128054 151241 148398 115141 49107
8588 49107 119658 113867 92686 158355 176056 158198 75672 60919 120239 122846 52455 59858
8576 59858 127343 127193 136622 92939 96509 91475 88915 34996 59071 128026 124556 106900 68390
8563F8390j2865J0657k2585k8316k371J4985P707l549l0168N9062L0400q1589
8551I758L6568O1882K6375M5824L2496K8192n6671k8748M4540O1753M052J5659
8539B81680L48j566N370k9444K9604R2518j0882n7153k0792L7427j4818k9485
8527B82807o4226j136L0761j8109n133k2023n6214m9891K0588O0667L6587O709
$$ plain form
8563 68390 55525 66182 43597 15281 12910 27895 35602 32053 1885 60947 91347 9758
8551 9758 46326 108208 134583 180407 212903 241095 184424 155676 200216 261969 266021 281680
8539 281680 282028 280462 285832 256388 285992 378510 367628 310475 289683 327110 312292 282807
8527 282807 218581 217445 248206 230097 224964 202941 146727 96836 117424 178091 214678 221387
$$ [...]
##END NTUPLES=NMR SPECTRUM
##END=
