##TITLE=Analysis number 320752
Compound Code cc 51322
Book Reference 494/32
Project Code adrs
Chemist Name craigr
##JCAMPDX= 6.0         $$ Bruker NMR JCAMP-DX V2.0
##DATA TYPE= NMR SPECTRUM
##DATA CLASS= NTUPLES
##ORIGIN= Bruker BioSpin GmbH
##OWNER= nmr
$$ XWIN-NMR		Version 3.5
$$ Mon Jul 10 08:56:49 2006 GMT Daylight Time (UT+1h)  MAYBRIDGE\nmr@NMR_250MHZ
##.OBSERVE FREQUENCY= 250.131544655141
##.OBSERVE NUCLEUS= ^1H
##.ACQUISITION MODE= SIMULTANEOUS (DQD)
##.ACQUISITION SCHEME= undefined
##.AVERAGES= 16
##.DIGITISER RES= 18
##SPECTROMETER/DATA SYSTEM= dpx250
##.PULSE SEQUENCE= zg30
##.SOLVENT NAME= CDCl3
##.SHIFT REFERENCE= (INTERNAL, CDCl3, 0, 16.522)
##AUDIT TRAIL= $$ (NUMBER, WHEN, WHO, WHERE, WHAT)
$$ ##TITLE= Audit trail, XWIN-NMR		Version 3.5
$$ ##JCAMPDX= 5.01
$$ ##ORIGIN= Bruker BioSpin GmbH
$$ ##OWNER= nmr
$$ C:\u/data/dgb/nmr/ADRS/2510/pdata/1/auditp.txt
$$ ##AUDIT TRAIL=  $$ (NUMBER, WHEN, WHO, WHERE, WHAT)
(   1,<2006-07-10 08:56:21.31 +100>,<MAYBRIDGE\nmr>,<NMR_250MHZ>,
      <created by zg, POWCHK disabled, PULCHK disabled
       configuration hash MD5:
       E2 DF 36 D8 04 B2 41 60 5A D7 A3 38 5A 4B D0 FE
       data hash MD5: 64K
       A0 88 E5 1B 9D 29 65 2F 83 89 E2 31 FC 3F 3E ED>)
(   2,<2006-07-10 08:56:39.75 +100>,<MAYBRIDGE\nmr>,<NMR_250MHZ>,
      <Start of raw data processing
       ef LB = 0.3 FT_mod = 6 PKNL = 1 SI = 32K 
       data hash MD5: 32K
       81 06 89 B0 46 9D 13 40 8F EF 51 BD A6 C2 5B C6>)
(   3,<2006-07-10 08:56:41.40 +100>,<MAYBRIDGE\nmr>,<NMR_250MHZ>,
      <apk 
       data hash MD5: 32K
       7E C8 08 43 27 21 34 A9 2B 72 20 9B 76 11 50 A8>)
(   4,<2006-07-10 08:56:42.10 +100>,<MAYBRIDGE\nmr>,<NMR_250MHZ>,
      <abs ABSG = 5 
       data hash MD5: 32K
       2A 65 26 BA 9C 37 37 B4 C1 61 27 E5 E0 D7 38 18>)
$$ ##END=
$$ 
$$ hash MD5
$$ E6 DB 46 D7 6B 08 D0 30 97 26 52 80 C8 71 A1 8A
##$RELAX= 
##$RELAX= 
##$RELAX= 
##$RELAX= 
##$RELAX= 
##$RELAX= 
##$RELAX= 
$$ Bruker specific parameters
$$ --------------------------
##$DU= <C:\u>
##$EXPNO= 2510
##$NAME= <ADRS>
##$PROCNO= 1
##$TYPE= <nmr>
##$USER= <dgb>
##$AMP= (0..31)
100 100 100 100 100 100 100 100 100 100 100 100 100 100 100 100 100 100 
100 100 100 100 100 100 100 100 100 100 100 100 100 100 
##$AQSEQ= 0
##$AQ_mod= 3
##$AUNM= <au_zg>
##$AUTOPOS= <1 >
##$BF1= 250.13
##$BF2= 250.13
##$BF3= 250.13
##$BF4= 250.13
##$BF5= 500.13
##$BF6= 500.13
##$BF7= 500.13
##$BF8= 500.13
##$BYTORDA= 1
##$CFDGTYP= 0
##$CFRGTYP= 5
##$CHEMSTR= <none>
##$CNST= (0..31)
1 1 145 1 1 1 1 1 1 1 1 1 1 1 1 1 1 1 1 1 1 1 1 1 1 1 1 1 1 1 1 1 
##$CPDPRG= <>
##$CPDPRG1= <>
##$CPDPRG2= <>
##$CPDPRG3= <>
##$CPDPRG4= <mlev>
##$CPDPRG5= <mlev>
##$CPDPRG6= <mlev>
##$CPDPRG7= <mlev>
##$CPDPRG8= <mlev>
##$CPDPRGB= <>
##$CPDPRGT= <>
##$D= (0..31)
0 1 0 0 0 0 0 0 0 0.06 0 0 0 0 0 0 0.0002 0 0 0 0 0 0 0 0 0 0 0 0 0 0 
0 
##$DATE= 1152518180
##$DBL= (0..7)
120 120 120 120 120 120 120 120 
##$DBP= (0..7)
150 150 150 150 150 150 150 150 
##$DBP07= 0
##$DBPNAM0= <>
##$DBPNAM1= <>
$$ [...]
##$SUBNAM7= <"">
##$SUBNAM8= <"">
##$SUBNAM9= <"">
##$SW= 20.6930455092707
##$SWIBOX= (0..15)
0 0 3 0 0 0 0 0 0 0 0 0 0 0 0 0 
##$SW_h= 5175.983436853
##$TD= 65536
##$TD0= 1
##$TE= 295.16
##$TE2= 300
##$TE3= 300
##$TEG= 300
##$TL= (0..7)
0 120 120 120 120 120 120 120 
##$TP= (0..7)
150 150 150 150 150 150 150 150 
##$TP07= 0
##$TPNAME0= <>
##$TPNAME1= <>
##$TPNAME2= <>
##$TPNAME3= <>
##$TPNAME4= <>
##$TPNAME5= <>
##$TPNAME6= <>
##$TPNAME7= <>
##$TPOAL= (0..7)
0.5 0.5 0.5 0.5 0.5 0.5 0.5 0.5 
##$TPOFFS= (0..7)
0 0 0 0 0 0 0 0 
##$TUNHIN= 0
##$TUNHOUT= 0
##$TUNXOUT= 0
##$USERA1= <user>
##$USERA2= <user>
##$USERA3= <user>
##$USERA4= <user>
##$USERA5= <user>
##$V9= 5
##$VALIST= <valist>
##$VCLIST= <CCCCCCCCCCCCCCC>
##$VD= 0
##$VDLIST= <DDDDDDDDDDDDDDD>
##$VPLIST= <PPPPPPPPPPPPPPP>
##$VTLIST= <TTTTTTTTTTTTTTT>
##$WBST= 1024
##$WBSW= 4
##$XGAIN= (0..3)
0 0 0 0 
##$XL= 0
##$YL= 0
##$YMAX_a= 444284
##$YMIN_a= -642429
##$ZGOPTNS= <>
##$ZL1= 120
##$ZL2= 120
##$ZL3= 120
##$ZL4= 120
##$ABSF1= 16.522
##$ABSF2= -4.171173
##$ABSG= 5
##$ABSL= 3
##$ALPHA= 0
##$AQORDER= 0
##$ASSFAC= 0
##$ASSFACI= 0
##$ASSFACX= 0
##$ASSWID= 0
##$AUNMP= <proc_1d>
##$AZFE= 0.1
##$AZFW= 0.1
##$BCFW= 0
##$BC_mod= 0
##$BYTORDP= 0
##$COROFFS= 0
##$CY= 12.5
##$DATMOD= 1
##$DC= 0
##$DFILT= <>
##$DTYPP= 0
##$F1P= 14.0000005364418
##$F2P= -0.99999901652339
##$FCOR= 0.5
##$FTSIZE= 32768
##$FT_mod= 6
##$GAMMA= 0
##$GB= 0
##$INTBC= 1
##$INTSCL= 1
##$ISEN= 128
##$LB= 0.3
##$LEV0= 0
##$LPBIN= 0
##$MAXI= 10000
##$MC2= 0
##$MEAN= 0
##$ME_mod= 0
##$MI= 0
##$NCOEF= 0
##$NC_proc= -3
##$NLEV= 6
##$NOISF1= 0
##$NOISF2= 0
##$NSP= 0
##$NTH_PI= 0
##$NZP= 0
##$OFFSET= 16.522
##$PC= 1
##$PHC0= 162.1284
##$PHC1= 6.259764
##$PH_mod= 1
##$PKNL= yes
##$PPARMOD= 0
##$PSCAL= 4
##$PSIGN= 0
##$REVERSE= no
##$SF= 250.13
##$SI= 32768
##$SIGF1= 0
##$SIGF2= 0
##$SINO= 400
##$SIOLD= 32768
##$SREGLST= <1H.CDCl3>
##$SSB= 0
##$STSI= 32768
##$STSR= 0
##$SW_p= 5175.98343685301
##$SYMM= 0
##$S_DEV= 0
##$TDeff= 65536
##$TDoff= 0
##$TI= <Analysis number 999999
Compound Code 99
Book Reference 9
Project Code 9>
##$TILT= no
##$TM1= 0
##$TM2= 0
##$TOPLEV= 0
##$USERP1= <user>
##$USERP2= <user>
##$USERP3= <user>
##$USERP4= <user>
##$USERP5= <user>
##$WDW= 1
##$XDIM= 32768
##$YMAX_p= 521796265
##$YMIN_p= -57582
$$ End of Bruker specific parameters
$$ ---------------------------------
##NTUPLES= NMR SPECTRUM
##VAR_NAME=  FREQUENCY,     SPECTRUM/REAL,   SPECTRUM/IMAG
##SYMBOL=    X,             R,               I
##VAR_TYPE=  INDEPENDENT,   DEPENDENT,       DEPENDENT
##VAR_FORM=  AFFN,          ASDF,            ASDF
##VAR_DIM=   32768,         32768,           32768
##UNITS=     HZ,            ARBITRARY UNITS, ARBITRARY UNITS
##FACTOR=    0.157963299565203, 1,           1
##FIRST=     4132.6476996994, 0,             0
##LAST=      -1043.33573715361, 0,           0
##MIN=       -1043.33573715361, -57582,      0
##MAX=       4132.6476996994, 521796265,     0
$$ Real data points
##PAGE= N=1
##DATA TABLE= (X++(R..R)), XYDATA
$$ [...]
16335b5363J6970J0039n397K756N726q643p647p72K111Q874K1835M093j8280q37
16321E465r411J664R559j7856L076L237k8814j3773M274J0290L045j50o450N008
16307c0836J5837J850L428n000O242O174j838L055p269N887K108j3327L552o012
16293a6149P82j954%j02o816k110N325l54r647K463J0322J5635N651j3195j2198
16278b2347N949M931Q485J500n502J8737q429r057K040K766J825m835k0745K992
16264b1690o23K612O717m712M442J1854j4355N855J1199N001J530p463k416L890
16250A841j8506j648j82K636R944J1940j7545j3070q269n49J5292J1291N16j0521
16236a6830K364J0286J1917K350j6379p276o244L676L590j4808M732Q374l833
$$ y = [-25363, -8393, 1646, -3751, -995, 4731, -3912, -11559, -12331, -10220, -1346, 20489, 24582, 6302, 5465, -3946, -2282, 7277, -10579, -7503, -4266, -33080, -46853, -42579, -32289, -29244, -29394, -35844, -30836, -14999, -13149, -9721, -14721, -8479, -2305, -4143, -1088, -8357, -2470, -362, -13689, -10137, -16149, -15367, -17321, -17321, -17423, -24239, -26349, -21024, -21378, -31025, -28562, -18240, -2605, 3046, -10149, -22347, -16398, -11467, -2982, -1482, -6984, 11753, 3324, -5733, -3693, -927, 898, -3937, -24682, -21690, -22313, -19701, -12984, -17696, -13254, -1400, -15755, -9900, 1299, 6300, 7830, 367, -2049, 1841, -16665, -18313, -18495, -15859, -5915, 6025, -11520, -24590, -32859, -33408, -18116, -6825, -6309, -16830, -14466, -4180, 7737, 10087, -6292, -13568, -19812, -16136, -12546, -27354, -22622, -14248, -18081]
16223a8081M064q08k363J8661K3402l147j4141j4936j0043L362m457N729j726
16210a4484j1235J3618j113q111j751Q906k69j1708L745O74J2610L508N882O662
16196F934l782j9230j0685m511P639J2434M363m662N477j1732l433J2965l775
16183a1998M267m106J725k21O493j3436o706o482N887Q935J2665R133k08J020
16169F968K556n598k2238O37L643J128m46l458M987m062j421k687N530J0600n438
16154i299l669Q751j134N297m259o575k887J1358P175L106q106j8814j0949L063
16140b6942J361J3396J0681R310Q930p410q688p175K617K83L362P944N473p564
16126E578K542r759j6296o720l998n89R350K205r834J714J4121J1962J1771J032
$$ y = [-18081, -14017, -14825, -17188, 1473, 24875, 21728, 7587, -7349, -17392, -14030, -18487, -12758, -14484, -25719, -12101, -13214, -21325, -23076, -14170, -14439, -26147, -22402, -21728, -9118, -5610, 272, 6934, 3152, -16078, -26763, -31274, -23635, -11201, -6838, -11500, -6023, -17755, -21188, -8223, -11998, -7731, -11837, -10112, -10333, -3840, -17276, -23982, -30464, -24577, -15642, -2977, 6156, 5948, 6968, 9524, 3926, -18312, -17675, -14032, -12904, -13350, -16808, -11821, -15883, -17304, -19991, -14461, -3861, -9299, -12968, -4217, -5351, -54, -4313, -10888, -13775, -2417, 4758, 7864, -242, -19056, -30005, -26942, -25581, -12185, -1504, 7806, 16736, 9326, 638, -6537, -3920, -3637, -275, 7669, 13142, 5578, 8120, -1639, -17935, -24655, -28653, -29242, -19892, -17687, -27521, -25807, -11686, 276, 12047, 13079]
16112A3079q290L109n151n26P219j2941k062M672k709j1923L610Q615m344J1542
16098C900j0313q230J3175o10j1474q939N584L792K710j6604j9779J8245J2503
16085a6040l513q586q675n467P247K3178K677n503R265M05r27N845r988k800K717
16070a0165o898P17R31q733Q314n966P024L979N922o263J35O939Q339O246j3350
16055b829j0522R577p164r411l383k967J4273P056M949n961k0021k463J0340j325
16041a9851j191P155p278n154J8082K1716R812j5896j6062Q37M753M408L28r91
16027F68o157j8077O849J853l484J1552J6063L824j838L00p295q842o955r795
16013b1334M521j100m754l302L601l400n336N741M185J1917k663k738K3083K0525
$$ y = [13079, 4789, 7898, 2747, 2221, 9440, -3501, -5563, -891, -3600, -15523, -11913, -3298, -7642, 3900, -6413, -14643, -1468, -2078, -13552, -22491, -16907, -13115, -10405, -27009, -46788, -28543, -16040, -19553, -28139, -36814, -42281, -35034, -11856, -9179, -14682, -5417, -5012, -5939, -94, -10082, -12882, -10165, -17063, -16346, -15415, -24148, -15834, -21800, -14776, -10797, -4875, -11138, -11003, -4064, 4275, 10521, -2829, -13351, -3774, -10938, -20349, -23732, -26699, -12426, -5370, -421, -6382, -26403, -28866, -18526, -19851, -21042, -13887, -21165, -26319, -8237, 13479, 23291, 7395, -8667, -7830, -3077, 1331, 1659, 668, -5489, -23566, -16717, -14864, -18348, -6796, 9267, 13091, 11253, 11553, 4258, -4584, -11539, -21334, -16813, -17913, -22667, -25969, -22368, -25768, -31104, -25363, -21178, -9261, -11924, -14662, 8421, 28946]
15999B8946n234n570r855J720m991j8900m491q876n289J4676J6583M485P830L215
15985A4249j6796q268K911l128J32M57R214P267P576j199l726m527k734j5005
15971a3577k636K082M849J702j783j010Q92p682p055P524O809j1862R762m718
15957a6703m357m170N045J3327J0888N124L238K764J1574J572k800o014j4049
15944E439r495K457j1473N104P913J906o122k292m670J0977J457p717n523Q4J701
15929a0254O355P57j0669L789M571m218J0610k375j5702J0566q857r705J0690
15916a4442J4393K47o707n055P181J1457o545j1186j9218J2555J1366J2760k191
15903D615Q99q087j3416j3057j916J0185n82N627m285L226K995J033Q123n044
$$ y = [28946, 23712, 18142, 8287, 10007, 5016, -13884, -18375, -27251, -32540, -17864, -1281, 3204, 11034, 14249, -2547, -10815, -7904, -11032, -10900, -10443, -1229, 6038, 13614, 12415, 8689, 4162, 1428, -13577, -16213, -14131, -9282, -7580, -9363, -10373, -9481, -17163, -24218, -16694, -9885, -21747, -11985, -16703, -21060, -25230, -20185, -6858, 4030, 9154, 12392, 15156, 26730, 28302, 25502, 19488, 5439, -4056, -1599, -13072, -7968, -55, 1851, -4271, -6563, -11233, -256, 1201, -6516, -12039, -11955, -10254, -3899, -3142, -13811, -10022, -5451, -9669, 941, -1434, -17136, -6570, -15427, -25132, -14442, -49, 198, -6509, -11564, -4383, 7074, 529, -10657, -29875, -17320, -5954, 6806, 4615, 5514, -2573, -15989, -29046, -30962, -20777, -21359, -15732, -20017, -16791, -13796, -12763, -4640, -9684]
15889i684j5316J0208J2205l484r393j0825k7O134Q147L922j7035l917L419O488
15875a9158K346J6400M571j1713j0423P248R84j0867m684m819K3098J7553m765
15862E771o277k74R618k098N344r89k837P649k251j1430N24J6798j4567j2304
15848g323J3018j354j1922M263N272k160j5869j795J1095M806k998q124M91M636
15834g964k016k33P823J0781m715j268p410k95J0975M009j2353l606n671k073
15820a4016K194P53Q356K2759o451p493L279j6526j5677j473J2323J5858j1584
15807g698L407J5808L373j4187j2848j0586J7101L774j14p170l800M101k08j220
15793a0267P119j1127n988K225k214M978Q579j5353R758N691R157L176J0831j2976
$$ y = [-9684, -25000, -14792, -2587, -6071, -15464, -26289, -26316, -20182, -12035, -8113, -25148, -29065, -25646, -19158, -16812, -412, 4159, -7554, -17977, -10729, -9745, -20612, -25296, -30115, -7017, 10536, 5771, -506, -780, 8838, 6740, 12084, 11095, 8258, 15907, 13656, 2226, 2750, 19548, 4981, -7323, 5695, 4341, -7581, -3318, 1954, -206, -16075, -17870, -6775, -1969, -4967, -13091, -12600, -7964, -9980, -10213, -2390, 8391, 3676, 2408, -5002, -5297, 5678, 9687, -2666, -6272, -11943, -14016, -11822, -11069, -2713, 20046, 13595, 6102, 9381, -7145, -22822, -24295, -11972, 3886, -7698, -4291, 11517, 14890, 703, -12145, -22731, -5630, -1856, -1970, -9140, -12940, -8839, -9047, -10267, -3148, -14275, -20263, -18038, -20252, -15274, -6695, -22048, -12290, -6599, 2558, 5734, 16565, 3589]
15779C589p571l115P936l366j0013j604P104P638M073P167j3714k4892o083m143
15765c6994R291J0295M910N143O290R075n87N969m5k867N114j1859m357k893m64
15750c979J4345J1280q898j0649M887P02k0336j5380J99J5617J8015l208P403
15737I998M743r676j520q66M054J0068J0795r276j5111n572q763j1787P057J5755
15723a01m301q685O356m362l14N612R147j5346p202L483J6185J3434j8137k2472
15709b6703J0525J3621j0051M240J5462K947P072r858j3184N535j1831K835L535
15696e855Q548o641N176O984J4325j1720j9749m952J0142m03L271K167r813o328
15682a4848K99N353M799M097K153N396N060N326J2187j2714j0981j410K657j2286
$$ y = [3589, -3982, -7097, 839, -2527, -12540, -14144, -7040, 598, 4671, 11838, -1876, -26768, -32851, -36994, -27703, -17408, -12498, -7355, -1065, 8010, 7423, 13392, 13347, 10480, 15594, 3735, -622, -3515, -3979, 10366, 21646, 12748, 2099, 6986, 7688, -12648, -28028, -27829, -12212, 5803, 2595, 9998, 14741, 5065, 3545, 2679, 6733, 16801, 27596, 18320, 3209, -2363, -11126, -22913, -15856, -101, -4402, -13087, -6731, -11093, -11407, -5795, 3352, -11994, -19196, -15713, 472, 13906, -4231, -26703, -16178, -2557, -12608, -8368, 7094, 10041, 17113, 7255, -5929, -394, -12225, -9390, -5855, 2693, -3948, 1228, 8212, 22537, 10817, -8932, -13884, -3742, -4145, -874, 1293, -8520, -14848, -14549, -9196, -4397, -300, 1853, 7249, 12309, 17635, 29822, 17108, 6127, 4717, 7374, -4912]
15668d912r158N195L51k126M105J0771j1924n864r343J768J0268J3623q57J0441
15654A2338o46n078k844j3619L554l875J0281R632N162j0417j1212M967M197L947
15640F387O955q97j3223L996m552L039k543j8308J0954L394j7155K860J4896J0666
15626F469M959p841l435p474L450K0269p836L007p897j6383k243O995O19q422
15612a5763J4316J360o380l991p603N03n986r991l390m639K61J3786K15k718Q51
15597b9169P318l388k613K010J2915N918N61j865J6480k45l335L830J4818K0127
15583D3362L41j8200m626j2276j5637N968k481r259J386Rj201j2286p968M158
15569b8710J643R075O145R958J1193j1611j2506n442J392R929J1725R823l262
$$ y = [-4912, -14070, -8875, -8524, -10650, -6545, 4226, -7698, -13562, -22905, -21137, -10869, 2754, 1897, 12338, 11692, 6614, 3770, -9849, -6295, -10170, 111, 9743, 14905, 4488, -6724, -1757, 2440, 6387, 13342, 12445, -778, 3218, -1334, 1705, -838, -19146, -8192, -4798, -21953, -19093, -4197, 6469, 11428, 3587, 152, -7322, -3872, 16397, 8561, 11568, 3671, -12712, -14955, -7960, -7341, -15763, -1447, -87, -6467, -10458, -18061, -17558, -23544, -33535, -36925, -41564, -41303, -27517, -27302, -30020, -29169, -21851, -25239, -27852, -25842, -12927, -7009, -6448, -8313, 8167, 7922, 4587, 8417, 23235, 43362, 43703, 25503, 20877, 8601, -7036, -1068, -3549, -12808, -11422, -11413, -12614, -24900, -32868, -28710, -27067, -17992, -11847, -1889, 9304, -2307, -14813, -20255, -18863, -8934, 2791, 12614, 9352]
15556I352q387l672l219L257Q219j32j0924j693l759K061N843J3060J54o601R111
15541A2670j2107q538p29n919j05O309J4741J4425Q156R20j9226q820j676p579
15527g478l884J6774L821p401J7128O344O34n484k3301k7063o148J1505J4124
15514a0429J5782R911j1772P27q958o87Q919j056J859l228j339Q117m4j3174m228
15499i600m562K87Q899j1092j5362J1836J8096p013n599K183p425Q199J5837K437
15485G121r011j5042L339J0190L323o607j327m260m362j660J1142J3608K488j9514
15471a0572j904N246J930K969M436J965j611n07R965P560p999o359q676L740k122
15456a939O120M269l693p992r558N099P182j7226j3504J0626m910o74J8178k180
$$ y = [9352, 965, -2707, -5926, -2669, 5550, 5418, -5506, -7199, -10958, -8897, -3054, 10006, 10160, 3559, 12670, 563, -7975, -8704, -14623, -14728, -8419, 6322, 20747, 28903, 29823, 10597, 1777, 101, -7478, -11362, 5412, 9233, 1832, 18960, 25304, 25938, 20454, -2847, -29910, -36058, -24553, -10429, 5353, 15264, 3492, 4219, -4739, -5426, 3493, 2437, 4296, 1068, -271, 7846, 7802, -5372, -9600, -14162, -13875, -4976, -16068, -31430, -19594, -1498, -8511, -14110, -11927, -19352, -11153, 4684, 7121, -1890, -16932, -13593, -3403, -80, -6687, -8014, -12274, -16636, -18296, -7154, 6454, 8942, -10572, -12476, -7230, -5300, -2331, 2105, 4070, 2459, 1952, 11917, 19477, 11478, 5119, -3557, 183, -1939, 4181, 8450, 4757, -3235, -12793, -7694, -512, -17738, -31242, -20616, -25526, -26200, -8022, -10202]
15442a0202j1073K228P786m567j0433M024J3326J1156j4395j868J614M370J0570
15429B536p41j0528k598N760P607k74j0243j366l897Q298J1223J703n137k946
15415f03M470M193K194p259o538l995J646R401q488o482p183n36l274l551M74
15400b5531P61P030R036O500j259K027j758j7920J3582J7334r043N319l68k164
15386C546R14l397k7201m395J6784Q822N440j682L903J1779L084k829m563K131
15372A2336M125P282n787o659m933m436J0619j4474q625k638K1835J3402j5472
15359F575m322Q51j389L51M609j4866K43J6658J2170j833j1472L491o507n003
15345d44M700K186R043M055P607j1502q852K280L478j1499l912p863q756l157
$$ y = [-10202, -21275, -19047, -11261, -15828, -26261, -22237, -8911, 2245, -12150, -14018, -12404, -8034, 2536, 1795, -8733, -11331, -5571, 2036, 1762, -8481, -9847, -13744, -5446, 5777, 7480, 2343, -603, 3867, 8060, 10254, 2995, -3543, -7538, -5892, 3509, -4979, -11461, -18644, -19180, -22454, -26005, -25531, -24770, -17740, -8704, -2204, -3463, -1436, -3194, -21114, -7532, 9802, 759, 6078, 5710, 3546, 4460, 1063, -26138, -30533, -13749, -4927, 513, -1169, 2734, 14513, 17597, 14768, 10205, 12336, 16461, 23743, 17956, 11297, 6364, 1928, 12547, -1927, -10552, -13190, 8645, 22047, 6575, 2253, 3104, 1715, 2066, 6675, -8191, -7948, 8710, 20880, 19047, 7575, 11066, 4559, -444, 4256, 6442, 15485, 19540, 27147, 15645, 6793, 9073, 12551, 1052, -2860, -10723, -19479, -22636]
15331b2636n974J0844K3385L573L496k646j2267j8502m264K0806J4061o188m467
15318g79Q116j000o294q08o598o896j212K0534P520o926j197M406k22r269m865
15303e490M837J7614k258j3190K464J0358o336o65m733M994k431O192O089n410
15289A2035J1018n852j3622M04L818K626j5065j0211P251J741o994J0283P853
15276E285j5260n565o430j758n304M560L1560J328j4984l279m485m56l3J3483
15262a338l424j885r595l890J2966Q496J0483Q120j8969j3731q020J0067J7174
15249F454J8673j3238j5160j1804K719J1374j7288j4602m026J2213J8017J7856
15237A1188L69l74r233j833j1578q919L5q8J4273J2553Q579r649L273k610J3138
$$ y = [-22636, -28610, -17766, 5619, 9192, 12688, 10042, -2225, -20727, -24991, -4185, 9876, 3688, -779, 7337, 6337, 43, -765, -7363, -14259, -15471, 5063, 12583, 5657, 4460, 8866, 8644, -625, -5490, -653, 16961, 14703, 1513, 3977, 14335, 7999, 7334, 2601, 7595, 5164, 11356, 17445, 12035, 23053, 17201, 3579, 3983, 7801, 10427, -4638, -14849, -7598, -5857, -12851, -2568, 5285, -9975, -15540, -21970, -23728, -29032, -24472, 7088, 8416, -6568, -9847, -14332, -14788, -14821, -1338, -4762, -6647, -16242, -20132, -7166, 1330, 11813, 19933, 964, -12767, -20787, -10720, 6454, 25127, 11889, -3271, -15075, -12356, -982, -18270, -32872, -36898, -24685, -6668, 11188, 11557, 11183, 1950, 117, -11461, -20380, -20345, -20433, -6160, 6393, 14972, 5323, 8596, 5986, 19124]
15222A9124l548m001J198M110k996k808l226k055J2933L680K936j4631j3652K679
15208b57P780j0773N666J0295o132J380m617M935l874j2487m319O911J3388P093
15194A4989j728p448L772k738P843j0388j3633J3568j358Q82K173K5N209m30j02
15179A0636p333N393l596j1994Q779J4288L771k388l774N653P035j093k5032m105
15165c760J0904R245J3021K460j0510j8294P900J4074j487P982J1128J2388K801
15152E7852j3247r480j8512j9174N80Q111j3334p170R184J1585m494j0695P238
15139a556M383J321j6499R311P560N620L285j2345q134O573R594L848Q262j305
15125A9918k231n416p02J3916k779o422j106O677R077m836l200j2193m892r110
$$ y = [19124, 15576, 11575, 12773, 16883, 13887, 11079, 7853, 5798, 18731, 22411, 25347, 10716, -2936, -257, 7523, -3250, 2416, 12711, 6579, 7959, 3342, 8277, 4403, -8084, -12403, -5492, 7896, 14989, 13261, 5813, 9585, 6847, 14690, 4302, -9331, 4237, 2879, 3761, 5934, 5959, 11168, 10738, 10636, 3303, 8696, 5100, -6894, 1885, 16173, 19944, 17556, 13782, 19435, 26470, 25377, 345, -3760, 7144, 16389, 29410, 31870, 21360, 3066, 10966, 25040, 23553, 31535, 42663, 55051, 57852, 44605, 35125, 16613, -2561, -1981, 6130, -7204, -14374, -5190, 6395, 1901, -8794, -1556, 2827, 4148, -12351, -3040, 4520, 10140, 13425, 1080, -7054, -481, 9113, 12961, 21223, 19918, 17687, 12271, 11569, 25485, 22706, 16284, 15178, 21855, 30932, 26096, 22896, 10703, 5811, -3299]
15111c299K51M428J7940J5013p599k3844q131N780n730K8554R301j9043l074K0007
15097C0554K0955j1126k7090j4142l38r915m425P696J4339Q519P426k463K014
15084B2004M362j2550j3186j300P056o907p041J234k419p376J972L867P204j505
15070d585j8053j1288R227J3404L454m717M481L935J0977K736M572o702j3811
15057f370K281j214J2148Q677N951o257j1468m497L587K15j3783Q749J3116k622
15043H513n513k064n32p712j3289j957Q994J2244P048P58q879J1758J0121j0259
15029I231r425J0354K874q218p428J056m37R596j357n722Q79n486R10J3897J1701
15014B2425r413R54j0807L532p323O994J4829L497n903M103N591q505K273J3817
$$ y = [-3299, -3048, 1380, 19320, 34333, 26734, 2890, -5241, 539, -5191, 23363, 32664, 13621, 10547, 30554, 51509, 40383, 13293, -849, -1187, -11102, -15527, -7831, 6508, 15027, 22453, 19990, 22004, 26366, 13816, 630, -670, 6386, -521, -7562, -6328, -8747, -16123, -14151, -10284, -3080, -4585, -22638, -33926, -24699, -11295, -7841, -12558, -8077, -4142, 6835, 9571, 14143, 7441, -6370, -4089, -5303, 6845, 15522, 21473, 15216, 3748, -749, 2838, 3053, -10730, -1981, 11135, 8513, 3000, 936, 404, -7308, -20597, -22554, -13560, -1316, 5732, 6490, -2389, 9369, 19490, 9231, -194, 10160, 13034, 4816, -2612, -1556, -1993, 7603, 6246, 524, 1403, -4083, -3173, 10724, 22425, 13012, 13966, 3159, 6691, -632, 6362, 21191, 24688, 18785, 22888, 28479, 19974, 22247, 36064]
15000C6064M441r855p107j5191n093J0859r237J0554O613o295j2466O478O195
14987A5960j8623P38J1639R007k384Q037N906j4418j3211j310J51L187j5275J1457
14973H61R299J1130K738n424j476Q285m585q478Q997J0236O219j738o068j0989
14959A9007M115P794q137k3600L0M258R971O053q362j467o88l984J5142o172j8054
14944d094j176J6996N113l831q34k878J1194M211L563n197m022O926r046l939
14930A2986L106O302N78Q168Q15j5473j072J827j3109R203N556J695k032l936
14916A4614k950L051j838r327l419j897N767J1511M440n633j206J0201J1507j4556
14902B0265k2191P189J3202J5910m804r888M849M591q827K479l688j657k461L856
$$ y = [36064, 40505, 30650, 23543, 8352, 3259, 14118, 4881, 15435, 22048, 15753, 3287, 9765, 15960, -2663, -1925, 9714, 18721, 16337, 24374, 30280, 15862, 2651, 1341, 1492, 4679, -10596, 861, 10160, 21290, 24028, 18604, 17128, 25413, 20828, 12350, 21347, 31583, 37802, 36064, 29996, 19007, 23122, 30916, 22779, -821, -791, 3467, 13438, 19491, 11129, 9662, 8974, 4990, 20132, 13960, -4094, -5270, 11726, 16839, 13008, 12174, 9296, 20490, 24701, 28264, 23067, 19045, 25971, 16925, 12986, 16092, 22394, 22972, 31140, 31955, 16482, 15410, 17237, 4128, 13331, 18887, 20582, 18550, 14614, 11664, 14715, 12877, 3550, 131, -1766, 4001, 15512, 19952, 14319, 13113, 23314, 34821, 20265, -1926, 5263, 18465, 34375, 29571, 19683, 24532, 29123, 20296, 22775, 19087, 17430, 14969, 18825]
14888A8825M48J57j2450j2437p398j663L86j46L560J091Q701K1289J1901m737
14874B7527K65J2766k149M381m694k295n376K983j5963j0644j3098l874J4168
14861C997J3689M781P058P571M319j3038j045J1129J0098q253p769m674j4110
14848A3753m908J2594r00q523J9042J8522N619q323j9497q836J500L738M928J604
14834C0313J2036R180n258j9704j0989J6434M681q72m115J3186l260j0434n684
14821B5514J760l240m280J986K137l104M544j3751l080J835J2630M771J1781L024
14807D2527j0223p566l498p228P095j0927j8028J2276J3174p241l557n646o497
14794e339P21J9905J4516L279L78R146k48j5544j3173K056O077j075k201J1547
$$ y = [18825, 19273, 19430, 6980, -5457, -12855, -14518, -14132, -14278, -10718, -9627, -926, 20363, 32264, 27527, 27792, 40558, 38409, 42790, 38096, 35801, 30425, 33408, 17445, 6801, -6297, -10171, 3997, 17686, 22467, 29525, 37096, 41415, 28377, 27332, 38461, 48559, 40306, 32537, 27863, 13753, 8845, 21439, 20539, 12016, 31058, 49580, 55199, 46876, 27379, 18543, 20043, 23781, 28709, 30313, 42349, 51529, 46271, 26567, 15578, 32012, 36693, 35821, 31706, 44892, 41632, 31198, 25514, 27274, 24034, 19754, 21740, 23877, 20773, 25317, 11566, 8486, 10321, 22951, 27722, 39503, 42527, 32304, 24738, 21240, 14012, 21107, 10180, -7848, 4428, 17602, 10361, 6804, 1158, -5339, -4618, 15287, 29803, 33082, 33460, 42606, 42358, 26814, 13641, 15697, 21774, 20699, 18498, 30045]
14780C0045J2976M65p512n584p491N068Q446m175l884Q59R255j152j804l663r355
14765B2494j0819N14J9440o985j5978P766N821j3879Q577J7936J1694Q494o09
14752E4466j175j5425j2427j0341j0332J3987J2414n999K77k616K262K324j697
14739B5718J8730J6424j1045j2865j3058R362j001n29R32q285j0574j7322N725
14726B212J9765K1207N070j6386j6662j0382o902J915J7025R150Q180M159J80
14713C8531j957m381j6245Q240J1459j069j103n380j218J8906m768j2132j509
14700B7374R70R84o959l906N192R84R077L702O394j343J388o574k271l653M929
14685C6288J8362L366j8122o368j0794k028R876l070K752J5340j2334n278n445
$$ y = [30045, 43021, 43486, 35974, 30390, 22899, 27967, 36413, 32238, 28354, 29213, 38468, 37316, 35512, 31849, 22494, 11675, 12189, 31629, 24644, 8666, 16432, 22253, 8374, 16951, 34887, 46581, 55075, 54466, 53291, 37866, 25439, 15098, 4766, 18753, 31167, 25168, 25445, 22829, 25091, 27415, 25718, 44448, 60872, 49827, 36962, 23904, 33266, 32265, 31736, 32668, 24383, 13809, -3513, 2212, 21977, 43184, 48254, 31868, 15206, 4824, -2078, -163, 16862, 26012, 34192, 38351, 38531, 36574, 32193, 15948, 24188, 35647, 34578, 33475, 28095, 26877, 45783, 41015, 28883, 27374, 28344, 29328, 22369, 18463, 23655, 24639, 33716, 37418, 43812, 42469, 43857, 37283, 35012, 31359, 36288, 54650, 58016, 39894, 33526, 22732, 20704, 30580, 27510, 30262, 45602, 33268, 27990, 22545]
14672B2545j2998r795l411J009L366q754J5208J8024K0465Q761j2639k189m870
14659C4722k836O560M574p815j2457j291l035J329Q944R18J825j715j55p24n972
14644B2872r29M191Q872J806j1115r398R125J0544J5145l368k0408j1123M911
14631B1125m62j259J610P695J6321n363p114j491Q068L307m425K44J737n039j447
14616C3507j2920j3358J2443j529q455J5566R212N118k186p000p381N805N735
14603C4557j231o774n118M234K971j168m54R363n937p308p091M41O207O011Q028
14588C6731R304L661l947N388j788m824k288Q99r28Q075K666J0637M86j8154j6572
14573B9346K720J2977J2238R230J969K345l870l943j2905m152K0555L756p808
$$ y = [22545, 9547, -248, -3659, -2650, 716, -8038, 7170, 25194, 45659, 54420, 41781, 39592, 34722, 31886, 38446, 43020, 35205, 22748, 21457, 18422, 19751, 28695, 29613, 31438, 29723, 29568, 28844, 22872, 21943, 26134, 35006, 36812, 25697, 16299, 25424, 35968, 51113, 47745, 27337, 16214, 21125, 20663, 19404, 21014, 28709, 45030, 39667, 32553, 31062, 39130, 42437, 38012, 38256, 39993, 34954, 33507, 20587, 7229, 19672, 18143, 9688, 25254, 34466, 39584, 37398, 30398, 23017, 28822, 34557, 33326, 26552, 21434, 25668, 28639, 27471, 27017, 36380, 30443, 23135, 16044, 16485, 22692, 28703, 36731, 46035, 49696, 45749, 51137, 49349, 44525, 42237, 43136, 42208, 50283, 52949, 63586, 64072, 45918, 29346, 32066, 45043, 57281, 66511, 68480, 70825, 66955, 63012, 50107, 45955, 66510, 70266, 62458]
14560F2458J367p828m140m66n831l952M249L849k586n955J2273J738q948Q98N256
14545E2382r092K518O854o971J2384j392m038l638J1838J3073J505r102j0414
14532E5907q485k294N878K619j8876m728j734m712J4095K402j1788J1040k83n763
14518C3278j1292L932J4295k870k460J5831r75N247o302j4918M927O282l180r3
14504D1702L557L252k203L060K0728J20j7275k26n138k1830q965J3234J6117M126
14490E0259Q151J6849P11j4146j2205J5087K3034L951k2585j5799Q706M021J4527
14477H0561m32l614j6997j1417m484J0597J2315Q401n356O120L00j2147J970K084
14463F7901j0276J1424N054p512j7107Q745J0089M5p373o038m232r29R016j98
$$ y = [62458, 63825, 55997, 51857, 51391, 45560, 41608, 45857, 49706, 47120, 41165, 53438, 55176, 46228, 47126, 52382, 43290, 45808, 52662, 45691, 58075, 56683, 52645, 49007, 60845, 73918, 75423, 66321, 55907, 47422, 45128, 51006, 53625, 34749, 30021, 28287, 23575, 37670, 40072, 28284, 39324, 39041, 33278, 21986, 25918, 40213, 37343, 34883, 50714, 49739, 54986, 48684, 33766, 38693, 44975, 41795, 41702, 45259, 48511, 46308, 49368, 70096, 70216, 52941, 52715, 47577, 25747, 16782, 30016, 46133, 50259, 58410, 75259, 75970, 61824, 49619, 64706, 87740, 91691, 69106, 53307, 62013, 66034, 80561, 80129, 76515, 59518, 48101, 43617, 54214, 66529, 74930, 69574, 75694, 75994, 63847, 65817, 67901, 57625, 69049, 74103, 66591, 49484, 58229, 68318, 68363, 60990, 54952, 50720, 49791, 58807, 58609]
14449E8609o959m417k12Q212K1816J222O292J646p130l464j3626j5770Q510M030
14435E8759R763J1672m987N554M635l969q144j690J212m349n190n368M198R441
14421G1537J0785r23m251R431K505j4530j0722m399J2964M735q727o005R782k470
14407F9712n832m049m106J762O319L842l754o293j444J560Q565M038m601j0602
14393E5117j369P860N866N602K535Q344J143j232J0093p237m871k219P275o849
14379H0058J59N191r589o229N545J0493o634M060R222j1105m56j708j532J658
14365G9133Q476K829o043j704J3724j1624j3260j2285P740Q83J1880L745j309
14352H2185o04J0492O460j3296M289K846K623J892j061J540j5379J620m70l240
$$ y = [58609, 51650, 47233, 47021, 55233, 77049, 78271, 84563, 86209, 79079, 75615, 61989, 46219, 54729, 58759, 68522, 80194, 75207, 80761, 85396, 81427, 73283, 71593, 72805, 68456, 63266, 57898, 62096, 71537, 82322, 81399, 77148, 86579, 89084, 74554, 63832, 59433, 72397, 77132, 68405, 62400, 72182, 69712, 63880, 59831, 55725, 57487, 63806, 67648, 63894, 57601, 56157, 57717, 66282, 70320, 65719, 55117, 53748, 61608, 67474, 73076, 75611, 83955, 85098, 83866, 93959, 86722, 81851, 79632, 86907, 80058, 80217, 85408, 75819, 69590, 75135, 85628, 78994, 83054, 92276, 81171, 80715, 79007, 77475, 79133, 87609, 90438, 84395, 82691, 96415, 84791, 71531, 59246, 66986, 67869, 79749, 83494, 82185, 81581, 92073, 98533, 85237, 89526, 92372, 94995, 96887, 95826, 97366, 81987, 83607, 83137, 79897]
14338G9897O151k058n041M80K691J2935K024L6J289q811J585P929K658k590q199
14323I0976j6848p855J3073J3329l052M915O663j9797j5710r018J5519J4572k276
14310H4491j461P101J2545J0468o60n78L868j8615n506R827M230l012l139r451
14296I0108Q464P203M01k6065q740P394J4724P055J3384l470p079n101m84K095
14282I9889k794J596k754K465J4980J1101l186M209n841O45j1554q85M489K393
14268A14753l966n257P273R163J0030Or450m465K21j908j8317k170J1651J2086
14254A19650p90N546l003n113n398J029M071J3988p2j4842P715R82r234n454Q368
14239A17443r005j1645J0385J5457k677j2373N355R037O307q150q838l841J9929
$$ y = [79897, 86048, 83990, 78949, 79429, 82120, 95055, 97079, 97115, 98404, 89593, 91178, 99107, 101765, 99175, 90976, 74128, 66273, 79346, 92675, 89623, 94538, 101201, 81404, 65694, 56676, 72195, 86767, 84491, 83030, 90131, 102676, 113144, 112484, 111906, 115774, 97159, 91653, 101480, 105710, 102698, 99559, 90108, 98572, 105775, 106176, 80111, 71371, 78765, 93489, 100544, 113928, 110458, 103379, 98278, 97794, 99889, 97095, 98691, 95937, 98402, 113382, 124483, 121297, 125506, 119665, 120310, 108756, 107871, 112360, 114753, 110787, 105530, 112803, 121966, 131996, 132002, 122552, 118087, 118308, 116400, 98083, 95913, 107564, 119650, 118860, 124406, 121403, 116290, 110892, 111921, 115992, 129980, 129908, 115066, 122781, 123763, 114529, 109075, 117443, 108438, 96793, 107178, 122635, 119958, 107585, 112940, 121977, 128284, 120134, 111296, 107455, 127384]
14226A27384J3210P136L922q444m244K915K802n346L775J5561j06j7516j0089
14213A30960r607P131m952m15Q348j0067l03l642M857R389Q114M943k41q359M325
14198A40481l086j5936J041J0653j797J108J1664q126o672Q859J2213J51J738
14185A52291k906o02J3282J089j6760k366m19R321L800n829j5215k042q07M540
14171A37377L344J871J37j128L823L170R94j424P014l120p255N902M856J808K097
14156A59466j562j1991r160K810J709k641J1496R494P210m709j341q8j97M511
14142A65007J0818j1490j1758o388P280l266j779J0514J588J741K586J1798O214
14129A82865L474k803n821r303M391m411j1809m784J145o619n959l707P17J8770
$$ y = [127384, 140594, 147730, 151652, 143208, 138964, 141879, 144681, 139335, 143110, 158671, 158565, 141049, 130960, 121353, 128484, 123532, 123117, 131465, 121398, 121095, 117453, 122310, 131699, 139813, 144756, 144515, 136156, 140481, 137395, 121459, 122500, 133153, 131356, 132464, 144128, 136002, 129330, 138189, 150402, 150553, 152291, 149385, 148783, 162065, 163154, 146394, 144028, 143609, 152930, 156730, 150901, 135686, 133644, 132837, 137377, 140721, 142592, 142729, 141601, 145424, 148594, 149588, 148164, 155178, 152058, 144803, 150705, 155561, 157369, 159466, 157904, 145913, 136753, 139563, 141272, 138631, 150127, 159621, 166831, 162122, 160781, 160693, 160496, 165007, 175825, 164335, 152577, 146189, 153469, 150203, 148424, 158938, 160526, 162267, 164853, 176651, 182865, 186339, 183536, 177715, 168412, 172803, 168392, 156583, 151799, 152944, 146325, 140366, 136659, 137376, 156146]
14115A56146R028J1352O404j4810j4848r212m396n643l900L073J106M23M596J6315
14101A55634R407l56J741j737k22p642N097L128j994L835Q124Q813q372l699K935
14086A74692m318L102m817j0493r356O068P245k132J233P601O166j616m24j442
14072A71509k456K421j5624n555N816K869K885j3370R944L191j777M571l926J0773
14058A71271o975L003J734J605k477k866O533M668M857J533K945p441j742M821
14044A81469K728r276p081m098J0462N931L337j989J0064j632o310o115J655j952
14030A77193o48j4558O9K744k121O207M694J867J0938J348r606o094N934M978
14016A82945J2793j416p834J621m632p174n241P004k956L401O841j0522j911P284
$$ y = [156146, 165174, 176526, 182930, 168120, 153272, 144060, 139664, 134021, 130121, 133194, 134300, 134723, 139319, 155634, 165041, 164685, 166426, 164689, 164467, 156825, 161922, 165050, 163056, 166891, 175015, 183828, 175456, 171757, 174692, 170374, 173476, 168659, 158166, 148810, 154878, 162123, 159991, 161224, 168825, 174991, 173375, 172951, 171509, 169053, 171474, 155850, 150295, 156111, 158980, 161865, 148495, 158439, 161630, 159853, 164424, 160498, 171271, 164296, 167299, 169033, 170638, 168161, 165295, 171828, 176496, 181353, 182886, 185831, 178390, 176648, 181469, 184197, 174921, 167840, 163742, 174204, 180135, 183472, 181483, 191547, 189915, 183605, 177490, 179145, 177193, 176545, 161987, 162056, 164800, 162679, 168886, 173580, 175447, 186385, 187733, 178127, 172033, 177967, 182945, 195738, 194322, 186488, 188109, 183477, 176303, 171062, 178066, 175110, 178511, 185352, 174830, 172919, 180203]
14002A80203n142M436q35J6009J4114m183j0918j0046O778J2705m454l829q683
13989A86155j0900Q341J794P67J4508K855n995o016N259n100l752m385J384J292
13975A86207Q242P69j2186J5638J7386m240j0858p162j5208k760R021K646K010
13962A89505M48j146l300j204O047l077j0899M794n925j6527j983J1723J7765
13949A86221n413j1131l249O122Q13M007Q050o29L817K627n686k496J398J0519
13935A94970j318N699K008j23J287l914j4202j069j2116J761j309J6l293k952
13921A65445O62q766p42k65M820R783n613P348l393n543J0209p480j593R728K2265
13906A96865R515L344J232j472j7294j2236J986n541R48m932k735j7292j587J0467
$$ y = [180203, 175061, 179497, 178662, 194671, 208785, 204602, 193684, 183638, 190416, 203121, 198667, 194838, 186155, 175255, 183596, 185390, 186157, 200665, 203520, 197525, 191509, 196768, 191668, 187916, 183531, 184915, 186207, 194449, 195218, 183032, 198670, 216056, 211816, 200958, 193796, 178588, 175828, 184849, 187495, 189505, 189953, 188807, 185507, 184303, 190350, 187273, 176374, 181168, 175243, 158716, 156733, 168456, 186221, 180808, 169677, 166428, 172550, 173363, 177370, 185420, 184791, 188608, 191235, 185549, 183053, 184451, 194970, 193652, 199351, 201359, 201236, 202523, 198609, 184407, 183338, 171222, 172983, 171674, 171690, 168397, 165445, 166107, 157341, 156599, 156334, 161154, 170937, 165324, 172672, 169279, 163736, 173945, 166465, 164872, 174600, 196865, 206380, 209724, 210956, 209484, 192190, 179954, 181940, 176399, 177347, 172415, 169680, 152388, 150801, 161268]
13892A61268J0696q376j510o689O023J8553o657m698J35K515L372M597l828k5958
13878A49443l974J3149J8238O789n734o877J50L145n834j4689l862O677J4277
13865A70898l989j2915m972n378j1669L488J9649J0407M251R588j0039j5229q152
13852A45938J3011J0491j2879J8233j029j4654m915O166j403M896R991K299j0636
13839A65509p76j607j4079j1589o370P802J4732P446o081J4212o564j6556M057
13826A50136J2964O257K436J0401m83j6955j0821r926L172J5406N377O808R669
13813A84441j3603j5525m611J517n443k639O049K970M578o15J5534P156m27N498
13799A84880n018j2434j363J9907J009j6472j2207J65M009j662J6824J725o008
$$ y = [161268, 171964, 163588, 162078, 155389, 161412, 179965, 173308, 168610, 168745, 171260, 174632, 179229, 175401, 149443, 145469, 158618, 176856, 183645, 177911, 171034, 171184, 174329, 168495, 153806, 149944, 156621, 170898, 166909, 153994, 149022, 143644, 131975, 135463, 155112, 165519, 169770, 179358, 169319, 154090, 145938, 158949, 169440, 156561, 174794, 173765, 159111, 154196, 160362, 158959, 163855, 173846, 176145, 165509, 164733, 163126, 149047, 137458, 131088, 138890, 153622, 161068, 154987, 169199, 162635, 146079, 150136, 163100, 169357, 171793, 182194, 181711, 164756, 153935, 144009, 147181, 162587, 167964, 174772, 184441, 170838, 155313, 150702, 152219, 146776, 144137, 150186, 153156, 157734, 157119, 172653, 179809, 179382, 184880, 179862, 167428, 166065, 185972, 186981, 170509, 158302, 158467, 162476, 160814, 177638, 179363, 173355]
13786A73355p410l657p051N000O688m540k319k20L13J392l71m116r914K219o111
13771A43258L43J4129J62j5631l737J2104l516J1106J9975o997o357o937j2335
13758A45567o614Q605l017k600j619j1188o272J2315L187k538Q479N609n348J45
13744A44711n454l608q120M014P075J241r065m669J749J2304o86k952o969O934
13730A36505O208j0757k540j558L02O049J2167o501k005M447r789o50N405L423
13716A40706P097k3144j0861J2775J0574r247J3301L215r990j8526l409l73j853
13703A10265K808M789M85l220P98P862O808J4455q330m35N590L692J496N593K744
13688A55400L238K923L159M04R528J1449J4493L8580M9901L9869J7169p899j3042
$$ y = [173355, 165945, 162288, 155237, 160237, 166925, 162385, 160066, 159846, 160159, 161551, 161180, 157064, 147150, 149369, 143258, 143601, 157730, 157892, 142261, 138524, 150628, 147112, 158218, 178193, 171196, 164839, 157902, 145567, 138953, 147558, 144541, 141941, 140322, 129134, 122862, 135177, 138364, 135826, 144305, 149914, 144566, 144711, 139257, 135649, 127529, 131543, 138618, 139859, 130794, 126125, 127874, 140178, 139492, 136540, 129571, 136505, 142713, 131956, 129416, 127858, 128160, 134209, 146376, 139875, 137870, 142317, 132528, 131878, 137283, 140706, 147803, 124659, 113798, 126573, 137147, 127900, 141201, 144416, 134426, 115900, 112491, 112118, 110265, 113073, 117862, 118347, 115127, 115925, 123787, 130595, 145050, 136720, 136285, 141875, 145567, 147063, 152656, 155400, 158638, 161561, 164720, 165124, 174652, 186101, 200594, 239174, 289075, 328944, 346113, 338214, 325172]
13675C25172j9064k8818l2630j8175j2565k559o071L525O971K900Q014K3356L2594
13662B82650L7612J8786N579Q172n437j2475o046j5603k5716j0133p764k2095
13650B47530p383M836N115J9747M3436N5192O7745L8329L7111K0831P770k8911
13638E11348l7564o4515o6392m6833q564p274m740J977J4708K1189O997K8575
13626C48912M1697M9889N7355M8897L1588O159k4573m2430n7400o2149l2998k3495
13614C41452j8524k318k8939j5763K078Q711J7317L6914M1702O287j4727J473
13602C75663k3160m9875l8374j5604p455j0934j1643j8132j5070J4513M578J2776
13590B17283K4793L2341J2901L0968J2273J8176L18k8097l4779k8450j7379p949
$$ y = [325172, 306108, 277290, 244660, 226485, 213920, 211361, 205290, 208815, 215786, 218686, 226700, 250056, 282650, 320262, 339048, 344627, 352799, 347362, 334887, 328841, 313238, 287522, 277389, 269625, 247530, 240147, 244983, 250098, 269845, 313281, 368473, 436218, 474547, 511658, 532489, 540259, 511348, 473784, 409269, 342877, 296044, 287480, 280206, 275466, 277443, 292151, 313340, 320337, 348912, 390609, 440498, 497853, 546750, 578338, 584497, 559924, 517494, 460094, 397945, 364947, 341452, 322928, 320610, 291671, 275908, 277986, 286697, 304014, 340928, 382630, 388917, 374190, 375663, 352503, 302628, 264254, 248650, 241195, 230261, 218618, 200486, 185416, 199929, 204507, 217283, 242076, 274417, 287318, 318286, 330559, 348735, 349053, 320956, 286177, 257727, 240348, 232399]
13578B32399j8937j5867p108j1805j0625q181j6022J434R847j658j0620l311m457
13565A35089N273P18N838J2558r421j1933m814R700J860j3593Q485p793j1620
13552A20347Q690M876l61Q121j377l606J2449K231j6889k2174K051R17r82n634
13538A08659p222P459j147j2420j4035L605l467J1231J0709J621N604O336J559
13525A18492q168n389l843P690l08J553j5694n240P634P748L88M138L909N946
13511A18856k71o398l424k254M775N592l617j236Q655p021n575J0265k156j502
13497A14689J2287j948j2018P7j530J375J2016L372q878j0142L424N56p485K05
13483A06000J5537J5774J0894r777q247n925q39N626k306k208Q59O528L837N381
$$ y = [232399, 213462, 197595, 190487, 178682, 168057, 159876, 143854, 145288, 155135, 153477, 142857, 139546, 135089, 140362, 141080, 146918, 159476, 150055, 138122, 133308, 143008, 144868, 131275, 139760, 131967, 120347, 129037, 133913, 133552, 141673, 140296, 136690, 149139, 151370, 134481, 112307, 114358, 115275, 114293, 108659, 101437, 108896, 107749, 95329, 81294, 84899, 81432, 92663, 103372, 104993, 110597, 116933, 118492, 110324, 104935, 101092, 108782, 108474, 110027, 94333, 89093, 96727, 104475, 104863, 109001, 112910, 118856, 118585, 112187, 108763, 106509, 111284, 116876, 113259, 112023, 120678, 113657, 108082, 118347, 116191, 114689, 126976, 125028, 113010, 113087, 111557, 112932, 124948, 128320, 119442, 109300, 112724, 113280, 105795, 106000, 121537, 137311, 148205, 138428, 130181, 124256, 123417, 129043, 126737, 124529, 125388, 131916, 135753, 141134]
13469A41134J4892N704j0518p175J5427L634K0159K1303J0838R109j0865k1936
13457A91706k0218j6075j4647p518m247n415p325L763R026r060J403O375P219
13444A34987P336l756l654Q084J147m478m375O428n756k665M635Q178L433J3671
13430A63215M652R050J268m048O589R156M952m246j828l399m685j035j3549o447
13416A59645R95J4709M173K191j117l376m419n287q354j1534J252l291J3072J4911
13402A73570P720j4767j3223N427o736j550M643o653J372q41J7145r44j6375N753
13388A54541J1916P434J800M756N656L557m348m562k1589j4233j920M264n641
13375A41631j0211n805P085p550l004J0593m063o607J1450J3813J6531o04j6704
$$ y = [141134, 156026, 161730, 151212, 144037, 159464, 163098, 183257, 204560, 215398, 224507, 213642, 191706, 171488, 155413, 140766, 133248, 129001, 123586, 116261, 120024, 129050, 119990, 121393, 127768, 134987, 142323, 138567, 134913, 142997, 144144, 139666, 135291, 141719, 135963, 133298, 137933, 146111, 149544, 163215, 167867, 176917, 178185, 174137, 180726, 189882, 194834, 190588, 188760, 185361, 180676, 179641, 166092, 159645, 160640, 175349, 179522, 181713, 180596, 177220, 172801, 167514, 159160, 147626, 148878, 145587, 158659, 173570, 181290, 166523, 153300, 158727, 151991, 150441, 155084, 148431, 149803, 148962, 166107, 165163, 148788, 154541, 166457, 173891, 175691, 180447, 186103, 189660, 185312, 180750, 159161, 144928, 143008, 147272, 141631, 131420, 125615, 132700, 125150, 122146, 132739, 128676, 122069, 133519, 147332, 163863, 163259, 146555]
13362A46555J4445j69M402N877j6155j5682L126M123n630r482p1R694J4166N671
13348A60870L711o28p347j924L200J348o234q582r418Q127j743p048R282J9021
13334A62635J1199j6116n163k981k848N641J5907k14j7565n89O169J5960J7074
13321A89109O28P842J0273r389k114J1219O435K0565J2508K662j6976K529j817
13308B33474j035L155M034r275j5884J087J2030J2007P092r406j531l784J96J7208
13294B49368J5719J6924J0237K0591R914k827J9507o426j1106N326N965R21j0108
13281C24005J0851J6030J0206j1464n46Q665K5517Q876M743J5371L003l46R067
13268D23978j523j1662k521K077k286M170J2493K0444N739R647K1711J5981L2864
$$ y = [146555, 161000, 160831, 165233, 171110, 154955, 139273, 142399, 146522, 140892, 131410, 131339, 141033, 155199, 160870, 164581, 163953, 156606, 154682, 157882, 159230, 152996, 144414, 134996, 143123, 141380, 134332, 143614, 162635, 173834, 157718, 152555, 149574, 146726, 152367, 168274, 168060, 150495, 149906, 156075, 172035, 189109, 189737, 197579, 207852, 198463, 196349, 207568, 214003, 234568, 247076, 249738, 232762, 235291, 233474, 232439, 235594, 239628, 230353, 214469, 215556, 227586, 239593, 246685, 237279, 235748, 231964, 232160, 249368, 265087, 282011, 292248, 312839, 322753, 319926, 339433, 333007, 321901, 327227, 333192, 334113, 324005, 334856, 350886, 361092, 349628, 349082, 357747, 383264, 392140, 396883, 412254, 415257, 414911, 423978, 422455, 410793, 408272, 410349, 408063, 412233, 424726, 445170, 450909, 460556, 482267, 498248, 531112]
13255E31112K5991K2803Q05J2908O668r891l048J5234J9751J4821p61R436K8269
13242F74098K6504L1573K8807K3203N9285O6943N5060N4737M1994M3657O2172
13231A168033P8531Q7031Q5024J05327J32861J65743J91826K53704K93561L66320
13221B927961M49913N38749O98190Q90237J126786J495979K029384K831054L965148
13212A6953401N217135O127920N979450M511392K150089o11225l130163m773178
13204C2424821n455932n175107m200761l084128k170873j533558j091207p87510
13196H925745n75439m04283k61623j35942l6255P5288K02062L83167N24870N37757
13186I235347M27135M22720N32133O12656P96558J195946J730819K412602L367615
$$ y = [531112, 557103, 579906, 580711, 593619, 600287, 590396, 587348, 602582, 622333, 637154, 636393, 645829, 674098, 700602, 732175, 760982, 784185, 843470, 910413, 965473, 1020210, 1062204, 1105861, 1168033, 1246564, 1333595, 1418619, 1523946, 1656807, 1822550, 2014376, 2268080, 2561641, 2927961, 3377874, 3916623, 4614813, 5505050, 6631836, 8127815, 10157199, 12988253, 16953401, 22170536, 28298456, 34277906, 38789298, 40939387, 40328162, 37197999, 32424821, 26968889, 21793782, 17593021, 14508893, 12338020, 10804462, 9713255, 8925745, 8350306, 7946023, 7684400, 7548458, 7512203, 7587491, 7789553, 8172720, 8697590, 9235347, 9662482, 10085202, 10617335, 11229991, 12026549, 13222495, 14953314, 17365916, 20733531]
13177B0733531M772054O823959R482987J2156069J3346134J1567739P215727J461791
13169H7559991m681709r352779j1687573j2144931j0571777p915534n525391l833180
13161B1847117k769435k070591j587126j225732r58488p47388n71819m31368l10381
13152A1174789k32219j87140j62980j22315l4899L6092J16039K34896M16651O20808
13142A1859722R24589J388946K015069K920728M124969N464562O340167O022758
13134D1061510M340089J734315j304652l934973n539256o169550n806856m643969
13126A9736658l411216k426325j767587j322418j010360p94729o50790n48543
13118G804690m45827l86468l25691k98183k78806k80273k67664k56506k33414
$$ y = [20733531, 25505585, 32329544, 41812531, 53968600, 67314734, 78882473, 86098200, 87559991, 82878282, 73525503, 61837930, 49692999, 39121222, 31205688, 25680297, 21847117, 19077682, 17007091, 15419965, 14194233, 13235745, 12488357, 11916538, 11485170, 11174789, 10942570, 10755430, 10592450, 10470135, 10435236, 10471328, 10587367, 10822263, 11238914, 11859722, 12784311, 14173257, 16188326, 19109054, 23234023, 28698585, 35038752, 41061510, 45401599, 47135914, 45831262, 41896289, 36357033, 30187483, 24380627, 19736658, 16325442, 13899117, 12131530, 10809112, 9798752, 9004023, 8353233, 7804690, 7358863, 6972395, 6646704, 6348521, 6069715, 5789442, 5521778, 5265272, 5031858]
13109E031858k25288k14471k17220k06676k07293j82954j71706j54912j40570
13100C310768j37165j16673r6683j02564j04746p6289m3749l0148m3104n5261
13090B504386p0425o8157r0324r8080r7277p8388o7185o4224n4248n7671n8563
13079A699844p0793o9363n6870n7185n0929n5672k5390l5632l8902m5261k4470
13068A169377k2179l3541m0630l8275m9868m3458k6934m4330m1530j9363j7817
13057G91452j7251j2767k7447k7510k8189l097j120p784m986K0489J6810K01N73
13044F99374k1582l1198k7048m7710n0721k9113j0635n6M127O710j9270j1117
13032D61761l06l420j9606k4525j9774j2044Q796p446j6200j8373R226q810k370
$$ y = [5031858, 4806570, 4592099, 4374879, 4168203, 3960910, 3777956, 3606250, 3451338, 3310768, 3173603, 3056930, 2960247, 2857683, 2752937, 2676648, 2632899, 2602751, 2559647, 2504386, 2433961, 2365804, 2275480, 2177400, 2080123, 2001735, 1934550, 1870326, 1816078, 1758407, 1699844, 1629051, 1559688, 1502818, 1445633, 1394704, 1339032, 1313642, 1278010, 1239108, 1193847, 1169377, 1147198, 1113657, 1073027, 1034752, 984884, 941426, 914492, 870162, 828632, 809269, 791452, 774201, 761434, 733987, 706477, 678288, 675191, 674071, 666287, 661301, 681790, 698600, 698801, 699374, 677792, 646594, 619546, 571836, 521115, 492002, 481367, 481311, 485438, 492148, 472878, 461761, 461455, 458035, 438429, 413904, 394130, 382086, 390882, 383436, 367236, 348863, 358089, 349279, 346909]
13019C46909j0515r21r952j0986j2956r865N369K843o948N825J226K074k138j779
13005B98186j7867k1538o12N490k393n18k4627n263o49J4507j1279j0723R741
12992B32455O850q146K32O244J8184R611p149J1274J6482J7608j292j5995n307
12979B81051M0298M3008K4899K991r126l5641l7156m057J5096j1841q319n207
12967B95996p551J033j0312j4636k6928o528J5052k629j211n102J8292O562j4499
12954B47539j2187l221J1471j4416j5926J006o383j3414j4740l929J194P148K315
12941A86457j683O769j1462l828o518m79n78j4552p71j129j5876j3066m394r019
12927A09871k6539j6076j1071O162J5462J6831K5627J9875J5664J5382P901J786
$$ y = [346909, 336394, 335473, 325521, 314535, 301579, 291714, 297083, 299926, 292978, 298803, 300029, 302103, 299965, 298186, 280319, 258781, 258169, 263659, 261266, 260748, 236121, 230858, 230209, 244716, 233437, 222714, 232455, 239305, 231159, 231391, 237635, 255819, 265430, 258281, 269555, 286037, 303645, 302353, 286358, 281051, 321349, 364357, 389256, 392247, 383121, 347480, 310324, 306267, 321363, 309522, 301203, 295996, 288445, 289478, 279166, 264530, 237602, 231074, 246126, 243497, 242286, 237184, 255476, 262038, 247539, 235352, 232131, 243602, 229186, 213260, 214266, 207883, 194469, 179729, 175800, 176994, 184142, 186457, 184774, 191543, 180081, 176253, 169735, 169256, 168678, 154126, 153355, 152226, 136350, 123284, 118890, 109871, 83332, 67256, 56185, 62347, 77809, 94640, 120267, 140142, 155806, 171188, 179089, 180875]
12915A80875j7818k4737J625M941m360j0180P09q074P318K3506K0991K1190K2752
12902B18738J9264J7703j827k7903j1931J253R29l271p244j1853j3733j0386j6738
12889A53001j955R059j3540j5400J6078K2498M532k1341j1462Q400j118n281m487
12876A38984l786K911o49o122k214J9418J6073R621j1290j2123O642M212Q54L85
12862A62916k020n190M439O317M178j2368l0187j3721M8108O2316R187R762j7384
12849B26353k7204P2323J15255J21081J22866J13748N3480k4126k9612m3464j02947
12838E97753q2892l9025p499M260J1480K9068J8537J606J6437J0960K0118J4101
12826E94904m1j7754r010k0588k8419j7723n257k986m185q804j0316k3977k6319
$$ y = [180875, 163057, 138320, 139945, 144886, 140526, 130346, 131055, 122981, 130299, 153805, 174796, 195986, 218738, 238002, 255705, 253878, 225975, 214044, 215297, 216226, 212955, 205711, 193858, 180125, 169739, 153001, 151046, 160105, 146565, 131165, 147243, 169741, 174273, 152932, 141470, 149870, 148752, 143471, 138984, 135198, 138109, 137460, 131338, 129124, 148542, 164615, 174236, 162946, 150823, 157465, 161677, 162531, 162916, 160896, 155706, 160145, 166462, 170640, 158272, 128085, 114364, 162472, 224788, 233975, 243737, 226353, 199149, 271472, 386727, 507808, 630674, 744422, 797902, 773776, 744164, 700700, 597753, 514861, 475836, 468337, 472597, 484077, 513145, 531682, 533288, 549725, 560685, 580803, 594904, 594863, 577109, 568099, 547511, 519092, 501369, 496112, 493126, 488941, 480137, 469821, 445844, 419525]
12813D19525k2412m805j2430n176J5396K2655J5817K3655J8883K7942K4087K6462
12801E49599L0626M5355K4542O04j3424L065O847J5029R119J0055K7572J9148
12789G28137L2423K0423l524J6612J7125P856Q747j0539j0033J1770K2155N174
12777H46326J5974M3639N1444N4003O8282P0470O3875Q3732Q4524Q7334N9737
12766A529340M1938L4205J8865p189J2702J3065J5336O7377R8790J40197K26022
12755B190648K92438L10291L49254L55250K92666K46557K70643K59533K53382
12746D820662L38165M52768N60296P68981J056499J336022J642281K038363K288732
12737A5302769K422667K877109L729813M887877O702748R798565J4730752K2580247
$$ y = [419525, 397113, 392308, 379878, 374702, 390098, 412753, 428570, 452225, 471108, 499050, 523137, 549599, 580225, 625580, 650122, 650726, 637302, 640367, 647214, 662243, 671362, 681417, 708989, 728137, 760560, 780983, 777459, 794071, 811196, 819052, 827799, 817260, 807227, 818997, 841152, 846326, 862300, 905939, 957383, 1011386, 1079668, 1150138, 1214013, 1297745, 1382269, 1469603, 1529340, 1571278, 1605483, 1624348, 1617159, 1629861, 1642926, 1658262, 1725639, 1824429, 1964626, 2190648, 2483086, 2793377, 3142631, 3497881, 3790547, 4037104, 4307747, 4567280, 4820662, 5158827, 5611595, 6171891, 6940872, 7997371, 9333393, 10975674, 13014037, 15302769, 17725436, 20602545, 24332358, 29220235, 35922983, 45721548, 60452300, 83032547]
12729H3032547L5571621N3972319O8548597N4467502J0308784j3582761k0166813
12722B72151796m7916905o1881973m6601864k9675335j8512685j1923905q145799
12715D7493330n796928m096178k988914k429935j952255j593510j440124j250843
12707B5944643j009605r75356j115054j191498j115158j030587j017547j057580
12699A7432258j048200j025633r38710q08579p28799o14023n16227m71741m80161
12690A0800185m81252m76798m76240m25359l77255l44886l31199k85637k61190
12681G340369k44368k08610j51678j32465j36713j25617j34823j75999k03410
12672E826686k41999k55568k46875k42363k18500j92730k04711j75071j49074
$$ y = [83032547, 118604168, 172576487, 241125084, 295592586, 305901370, 292318609, 272151796, 224234891, 162352918, 115751054, 86075719, 67563034, 55639129, 47493330, 41696402, 37600224, 34611310, 32181375, 30229120, 28635610, 27195486, 25944643, 24935038, 23959682, 22844628, 21653130, 20537972, 19507385, 18489838, 17432258, 16384058, 15358425, 14419715, 13611136, 12882337, 12268314, 11752087, 11280346, 10800185, 10318933, 9842135, 9365895, 8940536, 8563281, 8218395, 7887196, 7601559, 7340369, 7096001, 6887391, 6735713, 6603248, 6466535, 6340918, 6206095, 6030096, 5826686, 5584687, 5329119, 5082244, 4839881, 4621381, 4428651, 4223940, 4048869, 3899795]
12663C899795j41297j27365j17786j00452j03385r6301j00750q6576r1685q9102
12653B845096p7013p0841o5154o9971l0021l9186n9631p2137o7242p1419q2788
12642B139693n4981n1477o0662n4571m3288o1092o5696n3111n2456n9358n4975
12631A528026l6565l3367m1258k1078k1922l9907k5512l2810o2015o8111n8267
12620A087214o1054n9738m3541l8451n8921n1234l5693m5052k8356k9485j3904
12609F21785l9460k7773k6196k2719j5681o364j9849k88K6042O9651J875k8925
12597E32098J968j9346m6671m3698n0064m5685l8174k0287j3123K187R515r795
12585B58925k140J1776P197O418n297J281k476L633k042L325j8526j4921p142
$$ y = [3899795, 3758498, 3631133, 3513347, 3412895, 3309510, 3213209, 3112459, 3025883, 2934198, 2845096, 2768083, 2697242, 2632088, 2562117, 2532096, 2492910, 2433279, 2361142, 2293900, 2222481, 2139693, 2084712, 2033235, 1972573, 1918002, 1874714, 1813622, 1747926, 1694815, 1642359, 1583001, 1528026, 1491461, 1458094, 1416836, 1395758, 1373836, 1333929, 1308417, 1275607, 1213592, 1145481, 1087214, 1026160, 966422, 922881, 884430, 825509, 774275, 738582, 693530, 665174, 635689, 621785, 582325, 554552, 528356, 505637, 489956, 483592, 463743, 463455, 489497, 559148, 561023, 532098, 534066, 514720, 468049, 424351, 374287, 328602, 290428, 270141, 257018, 259205, 268720, 258925, 256785, 268561, 275758, 282176, 276879, 278160, 275684, 279317, 277275, 280600, 262074, 247153, 240011]
12572B40011l429L086q532j8021j383L125P31P33J1998P610j1359j0039p947m862
12558B01722Q992p635j4799m956j069j1753j0937m542q722p864J8670J7675J3369
12545A88151J2061J6629J0157k1518j8562l652M549m587j4813L936J802m961j1477
12532A57715j2206k379J4056J1325K0861L2631K6344O279M972k077j6416j6205
12520B24900r884j7570j8105q381k887k775K78j3439j2621m266K1255K0174R146
12507A85825q189j0238O057J102k988j1241j5354j0557j4359p171l008N760J54
12494A15793J1229n088J979K0181M207j6020j2162j1071j3440j0796p662q00l226
12481G3124k096J2998O473J2456J2432l59M942k0067j9964j3932K0276K0804m071
$$ y = [240011, 236582, 239668, 231136, 213115, 211732, 214857, 215588, 216321, 228319, 235929, 224570, 214531, 206584, 201722, 210714, 203079, 188280, 183324, 182255, 170502, 159565, 155023, 146301, 138437, 157107, 174782, 188151, 200212, 216841, 226998, 205480, 186918, 183266, 187815, 183228, 168415, 172351, 174153, 169192, 157715, 145509, 143130, 157186, 168511, 189372, 222003, 248347, 254626, 259598, 257521, 241105, 224900, 215016, 197446, 179341, 170960, 168073, 165298, 165576, 152137, 139516, 135250, 156505, 176679, 185825, 177636, 167398, 173455, 174557, 171569, 160328, 144974, 134417, 120058, 112887, 109879, 115639, 115793, 127022, 121934, 123913, 144094, 148301, 132281, 120119, 109048, 95608, 84812, 77150, 76350, 73124, 71028, 84026, 90499, 102955, 115387, 115028, 119970, 99903, 79939, 66007, 86283, 107087, 103016]
12468A03016j9466k7312j196K304m516p568M5j648P81q87J175J083q109J0245
12454D7947J0661q549o124J2689J640j0751j1306j9012O227j908o471n992J5935
12441B4986J9593l221q260j1772j3673j4772q701J0577o419M999P038q801n077
12428a3503n091M549J6225P9L001K171K533n21L294P084O329J5837J2611k7611
12414B6987j0706R302k066j5249K679j0623J4548Q850j0477j4442K608l964j3125
12401a5678n652K2606K3073Q065j0152L270O832j2015j9612n030J3546L158L426
12388A5837k888M43R075J6917P410N05m492n364j916j693L125o328o981K07q138
12373A5719n709J963P3J6481L247j422j6316q217O94Q663N469J684J1763O935
$$ y = [103016, 83550, 56238, 55042, 57346, 52830, 45262, 45307, 43659, 44440, 43553, 44728, 45811, 37702, 47947, 58608, 50059, 43935, 56624, 58264, 47513, 36207, 17195, 23422, 21514, 15043, 9051, 24986, 44579, 41358, 33098, 21326, 7653, -7119, -15820, -5243, -11662, -6663, 375, -8426, -13503, -18594, -14045, 2180, 2259, 5260, 7431, 9964, 9443, 12737, 19821, 26150, 41987, 54598, 26987, 16281, 25583, 23517, 8268, 10947, 324, 14872, 23722, 13245, -1197, 1411, -2553, -15678, -21330, 1276, 24349, 32414, 22262, 25532, 32364, 20349, 737, -4293, 9253, 12411, 15837, 12949, 13392, 22467, 39384, 46794, 47299, 42807, 37443, 35527, 33834, 36959, 30631, 23650, 23857, 15719, 10010, 11973, 12046, 28527, 31774, 30352, 14036, 5819, 6513, 15176, 20645, 22329, 34092, 41027]
12359D1027O898K757q680k117n367k169n66P255R0K709J659J1371J773n055r110
12344D2475q769n05j991r499J7290J6272L206q4p519j7501m21Q974l838R775N541
12329E3406R439K124j0375j1767k2386q216q56M041n178M321P162J288J2354Q101
12315D3458M693o979o578l435j1606Q339J5062l829j4146J5121R008n801q503
12302C4804j2810J778J1135J5247J0137j8459n591n68p084r640J0202J7571k540
12289D4182J629m556l274L614P84n816j505M672k545l21p496J2582L909N00J3370
12274E9729N784P161N408K2434L0834J6387P381J2493J5784K9795J7799M2193
12262B73182P9339J32055K06125L00678L45584K37226L1821q3396j43411k64209
$$ y = [41027, 47925, 50682, 42002, 39885, 34518, 32349, 31783, 39038, 39128, 41837, 43496, 54867, 56640, 51585, 42475, 33706, 33201, 31210, 21711, 39001, 55273, 58479, 58395, 50876, 33375, 32954, 41928, 38090, 47865, 53406, 62845, 64969, 54594, 42827, 20441, 12225, 11369, 15410, 10232, 14553, 21715, 23003, 35357, 43458, 48151, 41172, 34594, 31159, 19553, 27892, 42954, 39125, 24979, 40100, 49108, 43307, 34804, 21994, 23772, 34907, 50154, 60291, 41832, 36241, 35673, 28589, 18949, 29151, 46722, 44182, 45811, 41255, 37981, 41595, 42379, 36563, 35058, 39730, 37185, 36864, 29368, 41950, 45859, 46359, 59729, 65513, 72674, 78082, 100516, 131350, 147737, 155118, 167611, 183395, 213190, 230989, 273182, 352521, 484576, 690701, 991379, 1336963, 1574189, 1606010, 1522614, 1379203, 1114994]
12252A114994k91155k10374j44951r2269o1742l4035l4499k4908j9516p167j5177
12241A79201n560j6556j0542p569K450N184P440n761k2017p255p77K607o470M239
12227A18614P14j2517L949L72o582r332k18M645J0638J5928n94o469m638j1619
12213A02891n776m227r61n256p479j8629k0884O011q981p939j2130J702R645L063
12199C1050j2165P183N324j24N446m057N252r152q477j8742o664K1115J3391N611
12185C4991P522K200j9112o08J1870L669j7857j1998l109O136O490M367m321P528
12171B7768K4861N139j1837m013J0363N748p703K439J6351J1195o343j8065j2154
12158D3749n984q140K519P796N771m085n424m709m672K714N491O380o943q637
$$ y = [1114994, 823839, 613465, 468514, 376245, 314503, 280468, 245969, 221061, 201545, 194378, 179201, 173641, 157085, 146543, 138974, 141424, 146608, 154048, 148287, 126270, 119015, 118238, 120845, 114375, 118614, 119328, 106811, 110760, 111132, 104550, 95218, 95000, 99645, 110283, 126211, 125617, 119148, 114510, 102891, 97115, 92888, 91927, 86671, 79192, 60563, 39679, 45690, 36709, 28770, 16640, 18342, 27987, 31050, 18885, 26068, 31392, 31268, 36714, 32657, 37909, 28757, 20280, 1538, -5126, 15989, 29380, 34991, 42513, 44713, 25601, 24993, 36863, 40532, 22675, 10677, 7568, 13704, 20194, 24561, 20240, 27768, 52629, 57768, 45931, 41918, 52281, 58029, 50326, 52765, 69116, 80311, 73968, 55903, 43749, 37765, 29625, 32144, 39940, 45711, 41626, 36202, 31493, 26821, 29535, 35026, 41406, 34463, 25826]
12144B5826L445L046K971j343l524o649J831J6035P838j3035m427l899O032n64
12130C3583Q242Q701N969j514j6508p270M010R219J3259J3476J297j8707j9016
12117C4741n782J5279P908k260O717q094j21J900r459p75N951J704O031j078k666
12102D9996j184m876k499n340L472o547j477K345k187K374O362O692q694k13m620
12087C3604P999J0573r098n961k401j4311q230J671O083P108o283J149L455Q011
12073C3369K907o067j6793K386N333m536J5081K922J378N979p293j4055j09k47
12059B0255p157l116M821n34L545k04Q033Q337L549j2643N133j111j3464j988
12045A3456N985P41K770m310R429O858p378j9746l808M138l168l933j57K5086
$$ y = [25826, 29271, 32317, 35288, 33945, 30421, 23772, 25603, 41638, 49476, 36441, 32014, 28115, 34147, 33583, 41825, 50526, 56495, 54981, 38473, 31203, 35213, 44432, 57691, 71167, 72464, 53757, 34741, 28959, 44238, 52146, 49886, 56603, 48509, 48388, 50288, 40829, 40054, 46005, 47709, 53740, 52662, 49996, 48812, 43936, 41437, 36097, 39569, 33022, 31545, 33890, 31703, 34077, 40439, 47131, 38437, 38224, 33604, 41603, 52176, 43078, 37117, 34716, 20405, 12175, 13846, 19929, 27037, 20754, 21903, 25358, 33369, 36276, 30209, 13416, 15802, 21135, 16599, 31680, 34602, 35980, 41959, 34666, 20611, 20502, 20255, 13098, 9982, 14803, 14269, 17814, 17610, 25643, 33980, 37529, 24886, 30019, 28908, 15444, 13456, 19441, 20182, 22952, 18642, 28071, 34929, 27551, 7805, 3997, 8135, 4967, 1034, 877, 25963]
12031B5963J3218K68o913l635m094k6746j5887L875J0502Q715Q552J545r308j500
12017D555K637j8464K066J6660n456o863L078Q923k928l874j1924J640N344l537
12003h143R20O52Q117P773M131O150Q598j0044m644K734n809n808J530J5174k055
11988A9276M67n515l852o573L317K510N54Q253M080q191Q348J2721j2281j4847
11974H267M33q984J7238P695j1535p366p700R719P143q605l573r26k798K506Q994
11959A0508M697j0399r250j292J1108o050m301n680M049R228N282q454N975j08
11945E313k0079L199O391k167J1651R161N186J517n336j1604M574J1377N506r547
11931A5142o77j587p664j354p938m610J9131R836j0110j0987m631J6804P796k868
$$ y = [25963, 39181, 39449, 32536, 28901, 24807, -1939, -17826, -13951, -3449, 5266, 13818, 15363, 6055, 4555, 7192, -11272, -9206, 7454, 1998, -4865, -1787, 7136, 4208, 334, -11590, -9950, -4606, -8143, -7223, -6571, 1546, 9319, 13450, 19600, 28198, 18154, 13510, 16244, 10435, 4627, 6157, 21331, 19276, 19743, 14228, 10376, 3803, 7120, 9630, 10184, 18437, 22517, 14326, 22674, 35395, 23114, 8267, 8700, -284, 16954, 24649, 13114, 5748, -1952, 7767, 14910, 6305, 2732, 1806, -992, 1514, 10508, 15205, 4806, -4444, -5736, 5372, -678, -4979, -10659, -6610, 2618, 7900, -554, 5421, 5313, -14766, -11567, -5176, -7343, 4308, 13469, 18655, 20172, 14836, 3232, 7806, 19183, 24689, 15142, 14465, 12878, 5214, 3860, -4078, -8688, 10443, 20279, 10169, -818, -5449, 11355, 19151, 16283]
11917A6283n894k910l69L028P284Q688q915l517r93J3993j2087j8589j623m504
11903a0125J1951R671k874q737N209N905K396P201M008j529k868O756j0928o876
11889I160m046L745j904O429M158j0899M892Q058l841R790O944J5109o942k6924
11875A3729j9675J290N935K666o956l366k135K557K962O258K765O054O844j0845
11861H083j0139J4156N067j696J600J290K768k2696O505n036n355N037Q250n013
11847B821j0358N982P269l205j1833l854Q972o620j1282K280M386J6595j447Q345
11833H051J8493N13m219j1128j077L281K2992j1266j7587k393M733l618n521j3557
11819a2303m238R173o69m020J4561Q860k3048q634J7979R720K830J5222N009l767
$$ y = [16283, 10389, 7479, 7110, 10138, 17422, 26110, 17195, 13678, 12685, 26678, 14591, -3998, -5621, -10125, 1826, 11497, 8623, -114, 5095, 11000, 13396, 20597, 24605, 23076, 20208, 26964, 16036, 9160, 5114, 8859, 6955, 13384, 17542, 6643, 11535, 19593, 15752, 25542, 32486, 47595, 40653, 13729, -5946, -4656, 1279, 3945, -3011, -6377, -8512, -5955, -2993, 3265, 6030, 12084, 18928, 8083, -2056, 12100, 17167, 15471, 17071, 18361, 21129, -1567, 4938, -98, -5453, -416, 7834, 2821, -7537, -1555, 5714, 2509, -9324, -13178, -4206, -10826, -22108, -19828, -15442, 1153, -294, 8051, 26544, 27057, 22838, 11710, 10633, 13914, 36906, 25640, 8053, 5660, 10393, 6775, 1254, -12303, -16541, -7368, -8037, -12057, 2504, 11364, -11684, -20318, -2339, 7381, 10211, 25433, 30442, 26675]
11805B6675m891j1404n6j0324k116K769l471Q379Q754J0247R42j5112j6515l665
11791i788R357P195o92L127J593M729o15L854L259m001m538m63r469q600j218
11776f270L066R370J113q625O101J9910o316j2250J840l277J0405J3976K5682
11763E4725j0314j8310p416l116J463P269J7684j1568j0981K039p027R270N175
11750B8893O80k623K864l8o344j008q4N429J1492o801j5433l359o19k921l398
11735F730N093P103J6776K714k297K090j0064j61L886J0175P865j3222j2616j4623
11721I449j6590n644O622J3758J0250J886n086N576p079n289J3497J2890L174
11708C7414l063l24m48N585K791m041n596j7025j6420K707J0116N55J780j5519
$$ y = [26675, 21784, 10380, 10324, 0, -2116, 653, -2818, 5561, 14315, 24562, 25504, 10392, -6123, -9788, -431, 6764, 6072, 9199, 10792, 15521, 14906, 18760, 22019, 18018, 13480, 13017, 3548, -5052, -6270, -3204, 6166, 7279, -1346, 4755, 24665, 18349, 6099, 7939, 4662, 15067, 29043, 54725, 44411, 26101, 18685, 15569, 17032, 24301, 41985, 30417, 19436, 21475, 14448, 23718, 28893, 29573, 26950, 29814, 29776, 23432, 22424, 22340, 27769, 39261, 32460, 17027, 13668, 13049, 10128, 6730, 11823, 18926, 35702, 38416, 36119, 38209, 28145, 27984, 31870, 42045, 49910, 36688, 24072, 9449, -7141, -12785, -6163, 7595, 17845, 19731, 14645, 20221, 13142, 7853, 21350, 34240, 37414, 34351, 34027, 33579, 39164, 41955, 37914, 32318, 15293, -1127, 1580, 11696, 12251, 14031, -1488]
11694a488J0121K2126P919K11j219Q034O551o242k0329r625Q508m95J5706m57
11680C9321o209k259n108o642l565O979n282N44K262J402J0454J437j0767l011
11666A9556m308K090K169J0426M98j4985l984M907l216j2795l762K797Q550k101
11652E842p633j803m195M690J0173j7380r851k765J6946O459N252M285O949o162
11638A0807k540o935o6J7858Q923J1783M404o746j6218k413O32J0725k413j2323
11624A5478K112M598J7255k050n458j7523l40P775m990J881R476J884j1388J548
11610B0258O477J116l780n140r310J656M995K567L442P552Q28j869j1341j2070
11596E381J2864J3242j1994m668J316m402Q242K5570L751q558j2408r108Q703
$$ y = [-1488, 8633, 30759, 38678, 38889, 37670, 45704, 52255, 46013, 25684, 16059, 24567, 24072, 39778, 39321, 33112, 30853, 25745, 19103, 15538, 22517, 17235, 17779, 20041, 21443, 31897, 33334, 22567, 19556, 15248, 17338, 19507, 29933, 30431, 15446, 11462, 16369, 13153, 358, -3404, -607, 7943, 5842, -1791, -3594, -7789, -3099, 7074, -10306, -20157, -22922, -5976, 483, 5735, 10020, 16969, 10807, 8267, 1332, 1266, 19124, 28047, 39830, 44234, 37488, 21270, 18857, 19489, 30214, 27801, 15478, 17590, 22188, 39443, 37393, 31935, 14412, 14072, 21847, 16857, 18738, 28214, 30098, 18710, 20258, 26735, 27851, 24071, 18931, 9621, 11277, 16272, 18839, 22281, 29833, 30661, 28792, 17451, 5381, 18245, 31487, 19493, 14825, 16141, 11739, 19981, 45551, 49302, 40744, 28336, 19228, 27931]
11583B7931r682o415K91K80N388J3670M228L657O043n87r74j7323N90J318q74
11568B7541P465O896N751R303n319q313j9144l298J0520O747P925M493m022j8130
11554B8415p731J357J165K399R56M662L022J0093J4201K749j6698n776J1017o209
11540D3622M654Q402p616n544K191q97n554M22Q749M371n403j7441q301K5319
11526D6974Q002k126l938J990m412m173J748M195J4925Q314j3032j6103M253P939
11512E4556J8031K3274K5664K1326N077J9516L4232K8235K1753k746j3513J882
11500B37287j8081l6146l0515l2602l5582p789N961j5324O50J0915p856j021j472
11487F8425j118Q207Q085L19O74J1708m698M209L924R277J614J2739K0325J7112
$$ y = [27931, 18249, 11834, 12125, 12405, 17793, 31463, 35691, 39348, 45391, 44804, 43830, 26507, 27097, 28415, 27541, 35006, 41902, 47653, 56956, 51637, 43324, 24180, 20882, 31402, 38149, 46074, 50567, 46545, 28415, 20684, 22041, 23206, 25605, 26561, 31223, 34245, 44338, 58539, 61288, 44590, 38814, 49831, 43622, 48276, 56678, 49062, 43518, 45709, 44812, 39258, 39680, 48429, 52800, 47397, 29956, 21655, 46974, 54976, 52850, 48912, 50902, 46490, 42317, 44065, 48260, 63185, 71499, 58467, 42364, 46617, 54556, 72587, 95861, 121525, 142851, 147928, 167444, 201676, 229911, 251664, 248918, 235405, 237287, 219206, 183060, 152545, 119943, 84361, 76572, 82533, 67209, 67859, 78774, 70918, 69897, 68425, 67307, 75514, 83599, 83918, 84592, 96300, 91602, 95811, 99735, 109012, 110626, 123365, 143690, 160802]
11473A60802J2640L6192N0164N5015N9373M4708M0218M969l6777k7128l3886o2477
11461C03813n1698m1491j0983j3801q463k8336l2866j5279L644o638j6579K7872
11449A09195K3058L861j7270o055p542L937P880q529j263N515q25R526J5360O843
11435A43691J0707K1018K5253K6913J7017J3525m3p777j9053l5402j5659q776
11423A71414k5043k6681j9278m426M043k377N751N431l790n799m013m216j6499
11410G4517j2328O551J053J062J49N84O289J1432p040q964P502j9346j8223m983
11396C8255Q961J3058n692r244J1585K64r966l899p024k680J430j603M195N222
11382D2862M177j9607j539K0888O812O159J0786L764l358j4826L44K068M54J529
$$ y = [160802, 173442, 209634, 259798, 314813, 374186, 418894, 459112, 464081, 427304, 400176, 366290, 303813, 252115, 210624, 199641, 185840, 177377, 149041, 116175, 100896, 104540, 97902, 81323, 109195, 132253, 136114, 118844, 112789, 105247, 109184, 117064, 108535, 107272, 112787, 111962, 121488, 136848, 143691, 154398, 175416, 200669, 227582, 244599, 258124, 258081, 250304, 231251, 195849, 180190, 171414, 146371, 119690, 100412, 95986, 100029, 97652, 103403, 108834, 105044, 99245, 95232, 91016, 74517, 62189, 68740, 69793, 70855, 71004, 71588, 77877, 89309, 82269, 73305, 80807, 61461, 43238, 38255, 47216, 60274, 54582, 45338, 56923, 57187, 47221, 43322, 36298, 33618, 35048, 33445, 37640, 42862, 47039, 27432, 25893, 46781, 53593, 59752, 70538, 74302, 70944, 56118, 56462, 58530, 58984, 60513]
11368F0513K305o073j824N613N440L971m415n753l001k987P526K712J002j362
11354F3667j6028l108J07J2224K057P030L852J3456m005P00J2962o572L10J4072
11340A00724J3963l557L843p294j6680l291k519Q30R493k936j5219J3331O23n579
11326H5732q146M819L398P080p005j051j1212n355O681J7156j1825j9581r350
11313E1341P483K0007J7919O790k1760j1256K904P559J4858K1243J1149n497K47
11300A22987j181j709P2p055k241m700n612j1277q924p352N308j115J260J5193
11286I3654N498j3026j5291R130J6907j0220m641K382J3752p680j7270o967J2471
11273G8699k406P09P539N367J738J0597R823r698M730N092J9274J299j888K273
$$ y = [60513, 62818, 56745, 54921, 60534, 65974, 69945, 65530, 59777, 56776, 53789, 61315, 64027, 65029, 63667, 47639, 44531, 44638, 56862, 58919, 65949, 69801, 83257, 79252, 79952, 92914, 86342, 86652, 100724, 114687, 111130, 114973, 107679, 90999, 87708, 85189, 86019, 95512, 92576, 77357, 90688, 91311, 85732, 77586, 82405, 85803, 92883, 85878, 84827, 73615, 68260, 74941, 92097, 80272, 60691, 51341, 58824, 78831, 96750, 103540, 81780, 70524, 73428, 80987, 95845, 117088, 128237, 122740, 122987, 121806, 120097, 120169, 113114, 110873, 106173, 100561, 89284, 80360, 73008, 78316, 77201, 78461, 93654, 99152, 86126, 70835, 79965, 96872, 86652, 82011, 84393, 98145, 90465, 73195, 66228, 78699, 76293, 77002, 84541, 89908, 91646, 102243, 112066, 102368, 107098, 112190, 131464, 132763, 130875, 133148]
11259A33148M366k1299n238p277L528k209p966n054j1606j0687k92O406M304N880
11245H6004n813O340J0359l96J515Q188j3853k860K43r785J295M31R139N605P227
11230A03639o572k78N763P48k067P396J2188K1781r868j6684j855j5884j0371
11217H7936j149P012O435J853n169o363O634n749J3296Q151O748J8819Q704m9
11203A47109q611j3363m189O062J7086K0197J5482J2028j1790o567J6870K1304
11191B11618J692o427m70O252j410k207m840j4807j4042o236N38J920R921J1175
11177A92677N525R094K5831K8652L4338M8230N9418J8742j4288p375k5119l9668
11165C36057k9133j7852m743R311O288J2084R907J1372J7093J4992n669m950J6288
$$ y = [133148, 137514, 116215, 110977, 103700, 107228, 105019, 97053, 91999, 80393, 69706, 69414, 75820, 80124, 86004, 80191, 86531, 96890, 96494, 98009, 106197, 92344, 89484, 89727, 79942, 81237, 81668, 90807, 96412, 103639, 97067, 96789, 102552, 103300, 101233, 108629, 120817, 142598, 132730, 116046, 114191, 98307, 87936, 86787, 93799, 100234, 102087, 96918, 90555, 97189, 91440, 104736, 112887, 119635, 138454, 147158, 147109, 138498, 125135, 120946, 127008, 144094, 164291, 179773, 191801, 180011, 173444, 190314, 211618, 213310, 206883, 206413, 212665, 211255, 209048, 204208, 189401, 175359, 169123, 169661, 171581, 181502, 192677, 198202, 207296, 233127, 261779, 296117, 344347, 403765, 422507, 408219, 400844, 375725, 336057, 306924, 289072, 284329, 293640, 299928, 312012, 321919, 333291, 350384, 365376, 359707, 354757, 371045]
11152C71045k140R707k663n968J6215K622j9519j2604m874J1787J3601J1384m883
11139C83710m33L522J3019m180J4343J1376K384O550J8905K0462K0675J8645J4029
11126E23007K0308K1122K0073K3706K6138M3282K5638L0130M1560N7083N3320
11115H85367O6800N8056P6845O9135P0930Q5212J00742J32074J41918J77276K10641
11104B074996K52398K91125L32441L74578M40784N21884O50806P95759J028309
11095F763080J396684J912788K624462L527495M532175N319192N503964M787649
11087C6367489L118475Q62765j436947l346498m571342m942130m570340l772164
11079A7709308k874949k086564j489637j049277p30199n02927l21890k00751j16964
$$ y = [371045, 368905, 378612, 375949, 369981, 386196, 388818, 369299, 356695, 351821, 363608, 377209, 388593, 383710, 383277, 386799, 399818, 395638, 409981, 421357, 423741, 430291, 449196, 469658, 490333, 508978, 523007, 543315, 564437, 584510, 608216, 634354, 677636, 703274, 733404, 774964, 832047, 885367, 952167, 1010223, 1087068, 1156203, 1227133, 1312345, 1413087, 1545161, 1687079, 1864355, 2074996, 2327394, 2618519, 2950960, 3325538, 3766322, 4288206, 4939012, 5734771, 6763080, 8159764, 10072552, 12697014, 16224509, 20756684, 26075876, 31579840, 36367489, 39485964, 40348729, 38911782, 35565284, 30993942, 26051812, 21481472, 17709308, 14834359, 12747795, 11258158, 10208881, 9478682, 8975755, 8653865, 8453114, 8336150]
11070H336150m8405k080Q5802J71699K63515L49431M42513N45404O64392Q52457
11060A1660878J133335J545755K140077L035326M292002N993947Q030698R985664
11052D7817682J1090818J0450341P716593L435092j374584n693760q790391j0195995
11044E4455796r897136q446679o588579m857218l488514k496830j782683j305005
11036A5593152r77960p43384n92601m99466m38152l85846l13969k54757k02145
11027A1184872j41499p8532J096R6167K26564M09854O77939J052496J562919K240560
11017A7232436L102083M009770M656009M749645L984608K362138K92244j817342
11009C8571591l520227m562037m838029m431928l655008k787425k076493j531320
$$ y = [8336150, 8287745, 8285665, 8371467, 8543166, 8806681, 9156112, 9598625, 10144029, 10808421, 11660878, 12794213, 14339968, 16480045, 19515371, 23807373, 29801320, 37832018, 47817682, 58908500, 69358841, 77075434, 80510526, 79135942, 73442182, 64651791, 54455796, 44558660, 36111981, 29523402, 24666184, 21177670, 18680840, 16898157, 15593152, 14615192, 13871808, 13279207, 12779741, 12341589, 11955743, 11641774, 11387017, 11184872, 11043373, 10964841, 10965937, 11062104, 11288668, 11698522, 12376461, 13428957, 14991876, 17232436, 20334519, 24344289, 29000298, 33749943, 37734551, 40096689, 40388933, 38571591, 35051364, 30489327, 25651298, 21219370, 17564362, 14776937, 12700444, 11169124]
11001A1169124j111083q17730o38090n26551m47602l93972l66949l46953l17250
10992F202944k99448k96987l06877k78235k49023k34666k18379k14239j90935
10983C914155j75231j55174j51809j51130j51531j32111j18798j17928q6820r1198
10973B582425j04150j05242p4878p8651o6415m2834o8189p3171l8317m5517o0459
10962A824602n7780n5449o5849n5987m2782o5659n0025l4653m8398n8305n2346
10951A237369m0901k4060j3922k2370l3068m3556n5740k5235j1030n038L36O140
10939I68925P859k573J701k6182l8524n1971k4682k6186n2446l5074l1434k3063
10927F66350k6540j6249k2251j4116q621j5057p837j0116j7294k7039k9596j0867
$$ y = [11169124, 10058041, 9240311, 8602221, 8075670, 7628068, 7234096, 6867147, 6520194, 6202944, 5903496, 5606509, 5299632, 5021397, 4772374, 4537708, 4319329, 4105090, 3914155, 3738924, 3583750, 3431941, 3280811, 3129280, 2997169, 2878371, 2760443, 2673623, 2582425, 2478275, 2373033, 2298155, 2219504, 2153089, 2110255, 2042066, 1968895, 1930578, 1885061, 1824602, 1766822, 1711373, 1645524, 1589537, 1546755, 1481096, 1431071, 1396418, 1348020, 1289715, 1237369, 1196468, 1172408, 1158486, 1136116, 1103048, 1059492, 1003752, 978517, 967487, 962449, 962785, 968925, 976784, 974211, 975912, 949730, 911206, 859235, 834553, 808367, 755921, 720847, 689413, 666350, 639810, 623561, 601310, 587194, 578573, 563516, 555679, 545563, 528269, 501230, 471634, 460767]
10915D60767J221L165j2612j9490O40M619P885K0565J0794K4973M4996M3128K2645
10902F13296L0318K1197J0212j5972l2551l8461n1467n4010o2177n3217j7428
10891C49740K567r013j1142j0993n424K216M847J521J45k777j1579j3592j1561
10878B84955m814k0541n113R215K0555K5949K2604K333L595M560K8971L4344K0836
10865D27449J1187R921Q7l1474k6102l6876l6616l1413m970Q12l5148k7630K413
10852B21640O427L237J0569M473r517l167M717j4211r522q328j133L06K875N235
10838B13601j0040j139j2196j9152m088q066j4837L738Q468j202R226R446P168
10825A80927J2771j0045j8644o508n339J540L143m73j0094R346R992L252m272
$$ y = [460767, 461988, 465153, 452541, 433051, 433691, 438310, 446195, 466760, 477554, 502527, 547523, 590651, 613296, 643614, 664811, 675023, 659051, 626500, 588039, 536572, 482562, 420385, 367168, 349740, 352307, 343294, 332152, 321159, 315735, 317951, 322798, 324319, 324464, 321687, 310108, 296516, 284955, 280141, 259600, 254487, 263702, 284257, 310206, 332810, 335143, 338738, 343298, 372269, 406613, 427449, 438636, 448557, 448644, 417170, 391068, 354192, 317576, 286163, 281193, 282005, 246857, 219227, 221640, 228067, 231304, 241873, 246346, 236829, 233662, 238379, 224168, 214646, 206318, 205185, 205491, 208366, 213601, 203561, 202422, 190226, 171074, 166986, 158920, 144083, 147821, 156289, 155087, 164313, 173759, 180927, 193698, 183653, 165009, 158501, 153162, 154702, 157845, 157372, 147278, 156624, 166616, 169868, 165596]
10812A65596q86N047M766r76N466J011j318q281k3408P315J3110O289K2423K0118
10798B16272l724j5002m582k096m547O623O284J618K958P745L5014M1616K3675
10785C11854K4324K2101L0154M1249O1696R5608J40573J95787K34050K80314K97053
10774A734763K80378K46110J48399L4856q4558j81500k44331k79945k62151k40627
10764A151394j96133j47854j11852p0365o7985o0932m2043k4215j9040l5006k7701
10753C48268j1182q961j1024o404q032K314Q775r180p356l757j0362j2985j2339
10740B57775j1463j1208j0718l968j7948N410n237M914J1636j2056k1020p337
10728A78780j550j8004M075P634N295o873k3694n297P511p79m663L509J3340J0023
$$ y = [165596, 164710, 169757, 174523, 173547, 179013, 180024, 178706, 170425, 147017, 154332, 167442, 173731, 196154, 216272, 212548, 197546, 192964, 190868, 186321, 192944, 199228, 200846, 203804, 211549, 246563, 288179, 311854, 336178, 358279, 388433, 429682, 491378, 586986, 727559, 923346, 1157396, 1437710, 1734763, 2015141, 2261251, 2409650, 2444506, 2359948, 2178448, 1934117, 1654172, 1392021, 1151394, 955261, 807407, 695555, 625190, 557205, 496273, 454230, 430015, 410975, 375969, 348268, 337086, 328125, 317101, 310697, 302665, 304979, 313754, 304574, 297218, 293461, 283099, 270114, 257775, 246312, 235104, 224386, 220418, 202470, 207880, 202643, 207557, 219193, 207137, 186117, 178780, 177230, 159226, 163301, 170935, 176230, 169357, 145663, 140366, 147877, 147098, 142435, 145944, 159284, 169307]
10714A69307P35j0165J292J4302O809k619r808P186j2871j4948l711o828j6227
10701A22454M83Q058m853o260L063J3692J1120J6538O825L124j797m349m065j459
10687A62574P168q139l779Q010N696j2382q678p952l76K0972Q052l805Q834J3573
10673A89768O78J415k62j503J2825K4398K6213J9809J7228K6818M4949J9324j7372
10660C64288j7725j1745j9937l5824j3148n480J454q394j309K537P236O937o191
10647B62699j1200j5844j059J0575J5128l367q383j9487M462J68p265P577J1504
10634B45508J3667K5738K1295L2427M5393L4331M6385N5648M6823J7930j125k7431
10622E56589m1518m3522m4476m3072k9454o672j0067m947J7191L8097L4148K6615
$$ y = [169307, 170042, 159877, 161169, 175471, 182280, 179661, 169853, 177039, 164168, 149220, 145509, 138681, 122454, 122937, 130995, 126142, 119882, 122945, 136637, 147757, 164295, 171120, 174244, 172447, 168098, 164033, 162574, 169742, 161603, 157824, 165834, 171530, 159148, 150470, 142518, 142142, 163114, 171166, 167361, 176195, 189768, 190446, 191861, 191599, 190096, 202921, 227319, 253532, 273341, 290569, 317387, 362336, 381660, 364288, 346563, 334818, 314881, 279057, 265909, 260429, 261883, 253489, 252180, 254717, 261953, 268890, 262699, 251499, 235655, 234596, 245171, 260299, 256932, 248549, 229062, 233524, 233692, 226427, 234004, 245508, 259175, 284913, 306208, 338635, 384028, 418359, 464744, 520392, 567215, 585145, 584020, 556589, 515071, 471549, 427073, 384001, 354547, 347875, 337808, 332861, 350052, 388149, 422297, 448912]
10610D48912K815l265P184L0108L5974K3495o658j7239n1371m7226m4452k5160
10598C53117j306R497m984P865J7730K1654J8425J7424K2564K2872J7677J9012
10586E21547j0113k2578k7083k0004m9092n3130k2592q927q126q189j718n585
10574B84410j2807n179k75j7069r712O876j728j2022k590L362j1293k2572j7254
10561A82147k6107j8338j4436j4592k080j6502k3645j0294k2506l983K7573L0243
10549H7480L2890M3095L1789J4285J718L94j4960m711K114q51J1341K741j2623
10536A94702n281m685Q385K4856J1826J0160J6123K2881J1016J3341Q931L710
10524C15965O252o22R855J0844o816j8019n745k4344k3513l440J7966r850k506
$$ y = [448912, 451727, 448462, 455646, 485754, 521728, 545223, 538565, 521326, 469955, 422729, 378277, 353117, 351811, 361308, 356324, 364189, 381919, 403573, 421998, 439422, 461986, 484858, 502535, 521547, 511434, 488856, 461773, 441769, 392677, 339547, 316955, 308028, 299902, 291713, 289995, 284410, 271603, 266424, 266149, 249080, 239368, 246244, 244516, 232494, 229904, 233266, 221973, 199401, 182147, 156040, 137702, 123266, 108674, 106594, 90092, 66447, 56153, 33647, 29664, 57237, 87480, 120370, 163465, 195254, 209539, 211257, 211651, 196691, 191980, 194094, 193243, 204584, 207325, 194702, 189421, 184736, 193121, 217977, 229803, 239963, 256086, 278967, 289983, 303324, 312255, 315965, 322217, 321595, 331450, 342294, 335478, 317459, 311714, 287370, 263857, 260417, 278383, 268533, 266027]
10511B66027J2852J1988P901J1103j608j1147j281q181j2248L881J4575j748P619
10498B99733Q03R96N363J4162J6149j016R26q635j2925o996o568k4788j8614k6808
10484B31782j6223K803N9149O0729M2878O862n941j1550K7698P0245N6447K8386
10472E53265J2939K2437J7259P749M402Q223L6410L7309N8769N9556N7611M5885
10460I21814M2419K6864K8579L1415K0315P750n469m681j0485l3244j8834k3251
10448I83192q07o980j9150j0791j9150j9995j3853j5359J2081o14P183k609K5572
10435I18720K7020K6933M3110M7391M4567O7940M5193M1556L9374L9659K7532
10424A368995R356J9238J7139J2348K5730M6166N3404L7929L0289K6044K4243
$$ y = [266027, 278879, 290867, 298768, 309871, 308263, 297116, 295835, 287654, 275406, 279287, 293862, 292114, 299733, 300536, 301532, 306895, 321057, 337206, 336190, 337116, 328481, 315556, 308560, 301992, 277204, 258590, 231782, 215559, 218362, 277511, 338240, 381118, 387980, 382039, 370489, 398187, 468432, 524879, 553265, 566204, 588641, 605900, 613649, 618051, 626274, 662684, 699993, 758762, 818318, 875929, 921814, 964233, 991097, 1019676, 1051091, 1071406, 1079156, 1073687, 1069006, 1058521, 1025277, 1006443, 983192, 982385, 975405, 956255, 945464, 926314, 906319, 892466, 877107, 889188, 888574, 895757, 893148, 918720, 945740, 972673, 1015783, 1063174, 1107741, 1175681, 1220874, 1262430, 1301804, 1341463, 1368995, 1378351, 1397589, 1414728, 1427076, 1452806, 1498972, 1552376, 1590305, 1620594, 1646638, 1670881]
10413A670881M0857L8656J7992O780J3364P005J7094L2264L4916M1070N1405Q6993
10401B059277J13209R3945Q6402Q0221R0965Q6003J06409J19370J46450J57423
10391C139674J43896J59784J73953J87601J98410K54474L38162M21400M91195
10382E508549N54296O08177O46195O89832P51312Q63780J025228J210119J430263
10373A3287751J726730K061268K384957K690208K910513L083109L382979L900108
10365C5427623M722765O037501Q050768J0971910J5153666K1320139L0572190
10358A32256562M4171634O2431502Q1363534Q9524270P4334533L7714230j578962
10351E20217303l3304733o0985391p9193579p7870977o2361107m4477674l0620606
$$ y = [1670881, 1711738, 1750394, 1768386, 1775166, 1788530, 1795535, 1812629, 1844893, 1879809, 1920879, 1972284, 2059277, 2172486, 2266431, 2352833, 2433054, 2524019, 2610022, 2716431, 2835801, 2982251, 3139674, 3283570, 3443354, 3617307, 3804908, 4003318, 4257792, 4595954, 5017354, 5508549, 6062845, 6671022, 7317217, 8007049, 8758361, 9622141, 10647369, 11857488, 13287751, 15014481, 17075749, 19460706, 22150914, 25061427, 28144536, 31527515, 35427623, 40150388, 46187889, 54238657, 65210567, 80364233, 101684372, 132256562, 176428196, 238859698, 320223232, 409747502, 484082035, 521796265, 520217303, 486912570, 425927179, 346733600, 268862623, 206501516, 162023842, 131403236]
10344A31403236k1349881j5292461j1125446q093411n829356m185551l098598
10337F2428532k472842k201916k131429k303881k604717k786882k778009k642153
10329D2506703k507313k387189k293238k212632k012805j803332j604809j413463
10321B6271922j240679j126989j067814j018445r81588r43239q77723q11695p59918
10312A7443832o69117o03921n58836m97223m53387m08848l28799k61960k46235
10303A3415506k62929k70175k50598k27791j89145q2650j1991o6520k39367m15753
10293A1398587n41493o74245p20136o43044n25733m24220l61113l09326k85015
10284F914262k42501k22500k30835j88862j55809j59178j35408j32129j15024
$$ y = [131403236, 110053355, 94760894, 83635448, 75542037, 69712681, 65527130, 62428532, 59955690, 57753774, 55622345, 53318464, 50713747, 47926865, 45148856, 42506703, 39999390, 37612201, 35318963, 33106331, 31093526, 29290194, 27685385, 26271922, 25031243, 23904254, 22836440, 21817995, 20836407, 19893168, 19015445, 18203750, 17443832, 16774715, 16170794, 15611958, 15114735, 14661348, 14252500, 13923701, 13661741, 13415506, 13152577, 12882402, 12631804, 12404013, 12214868, 12132218, 12120227, 12053707, 11814340, 11398587, 10857094, 10182849, 9462713, 8819669, 8293936, 7869716, 7508603, 7199277, 6914262, 6671761, 6449261, 6218426, 6029564, 5873755, 5714577, 5579169, 5447040, 5332016]
10275E332016j21341j46290j55962j32471j41488j43084j21600j13799j35003
10266D120978j24067j12026j21204j33265j18923r8865q7414q5404p7903o2686
10256C099221o6973o0319p3302r0455j03120j10688j05904j30739j29495j29200
10246B099026j13184r8293r5092o9265p2946p8444o7538n4311p0755o6504n5998
10235A256696n1346n2776m4141k4843j7348M919K6736N4395L6167O682k6961n7983
10223A110197o9224p3430p6009q9461o8202n2191j8569p235k0398j6122J0771
10212F30127R426J4836K4494N123J1613O303j7635j6421k3012k5135l5352l6050
10200E48317j6027j3636j7417J241l14j5272K784K0775J65j3615l375l778j3809
$$ y = [5332016, 5210675, 5064385, 4908423, 4775952, 4634464, 4491380, 4369780, 4255981, 4120978, 3996911, 3884885, 3763681, 3630416, 3511493, 3412628, 3325214, 3239810, 3161907, 3099221, 3032248, 2971929, 2898627, 2808172, 2705052, 2594364, 2488460, 2357721, 2228226, 2099026, 1985842, 1887549, 1792457, 1723192, 1650246, 1571802, 1504264, 1449953, 1379198, 1312694, 1256696, 1205350, 1152574, 1108433, 1083590, 1066242, 1071161, 1097897, 1152292, 1188459, 1195141, 1168180, 1110197, 1040973, 967543, 891534, 802073, 733871, 681680, 663111, 655876, 635478, 619356, 630127, 639553, 654389, 678883, 684006, 695619, 701922, 684287, 667866, 644854, 619719, 584367, 548317, 532290, 518654, 501237, 502478, 502164, 486892, 489676, 510451, 510616, 497001, 493626, 489848, 476039]
10187D76039j2362k4426k6534r509K391j7871n909J919p970J2493R732R748J4878
10174D22619j569J2235J2522J0604Q758k402r825j0229r332p735J0054k4214k3414
10161C88072j5328L402J8535K6149L2889K9829L4386M5825K6378Q395q581j9183
10149E70768k7867l1879k7428k7491m3801l1619j6724k7092k6570k6576o753K55
10137B77223J6041J0675M660p939j5952L895O023P347J1897q968n318M21j7583
10124B82422j1144K255n987P469j4167j9588n453o180N236j2622j4138j6286r200
10111A82617Q278p035r57Q78N342J722P67K631o690j5157k437J1675J498l691
10097A79441j4212j5612l762j7060k527N56k2466j2240M442L614R440j790J05
$$ y = [476039, 463677, 439251, 412717, 403208, 405599, 387728, 381819, 383738, 375768, 388261, 397993, 407741, 422619, 421050, 433285, 445807, 456411, 465169, 462767, 452942, 442713, 433381, 425646, 435700, 411486, 388072, 372744, 376146, 394681, 420830, 453719, 483548, 517934, 563759, 590137, 598532, 589951, 570768, 542901, 511022, 483594, 456103, 412302, 380683, 363959, 336867, 310297, 283721, 276968, 277223, 293264, 303939, 308599, 300660, 284708, 288603, 294626, 301973, 313870, 304902, 299584, 300005, 282422, 271278, 273533, 267546, 275015, 260848, 241260, 235807, 229627, 234863, 222241, 208103, 191817, 182617, 190895, 183860, 182903, 183781, 189123, 190845, 191612, 194243, 187553, 172396, 169959, 181634, 183132, 179441, 165229, 149617, 145855, 128795, 126268, 126824, 104358, 92118, 96560, 100174, 109614, 107824, 107929]
10084A07929J459j2598n813P210Q87p544l303R491R370k4438q182M552l785k8
10070G5207j6825k3597l90n317n374o934N83l75j1738m997M803p018m046m952
10056a0970k013m165Q023N575J0761O681M479P192N287l166j2655r647Q788J0376
10042B4546R85N210J8119j509j591j4104k896O761j2053k0499L403P56n731r91
10028D06K294q471k864J9853Q708n750n186o131P171J1308N657n529q021J457
10014A4902q317p662O288k43J1447L607L526P713j1535j1265j0248l119M185K547
10000A826O662L778K513o342P377J2873m164k531o056j046j130J9114L3759J0261
9986G6894K232p568p997K950J78k696o887l923J181n025k722J1174P926R29l236
$$ y = [107929, 109388, 96790, 90977, 98187, 99074, 91530, 88227, 97718, 107088, 82650, 74468, 79020, 75235, 75207, 58382, 34785, 34395, 29078, 23704, 16770, 17353, 16978, 5240, 243, 5046, -1972, -6018, -10970, -12983, -17148, -9125, -3550, 7211, 13892, 18371, 25563, 30850, 27684, 15029, 5382, 14170, 24546, 25531, 30741, 48860, 47351, 45760, 31656, 28760, 35521, 23468, 2969, 6372, 7128, 1397, 406, 2700, -5771, -8635, 11218, 19926, 14176, 8990, 2859, 10030, 21338, 26995, 21466, 13445, 14902, 6585, -1077, 5211, 4968, 16415, 20022, 23548, 31261, 19726, 8461, -1787, -4906, -721, 1826, 8488, 12266, 14779, 8437, 15814, 28687, 24523, 21992, 15936, 14890, 13760, 32874, 66633, 76894, 79126, 71558, 63561, 66511, 66689, 63993, 57106, 53183, 54364, 49339, 46617, 57791, 65717, 66646, 63410]
9971F3410q447j1557q847M443J2743r645j830N139r679P849k252j6115P735M076
9957C7023Q286L839K66l487J9046J6175J6350J3304O708P379r72N983K5556J7067
9943A72523N234J3554K7039K2846M3821N2513O5738R3838J44621J81752K27394
9932A050873K77235K93180K91186K42076J58832M6471p2576j60792k37444k71572
9922A617469k89498k51397k03945j48969j11085q3571p8351m5964j4294j6090
9912C74305k0197j6804m335k0305j1290j7322j6917j3786r072j4285j5798j9567
9900A94627k8118k5170q993j1460M584j9867j6165k041j630J5282K313j2845M892
9887I5409P296M658o090o541k130j2421P65l822P334k217J1775J2770K123P232
$$ y = [63410, 54963, 43406, 34559, 39002, 51745, 42100, 40270, 45409, 35730, 43579, 41327, 25212, 32947, 37023, 45309, 49148, 49414, 45927, 64973, 81148, 97498, 110802, 117510, 124889, 123917, 129900, 155456, 172523, 177757, 191311, 218350, 241196, 285017, 337530, 403268, 497106, 641727, 823479, 1050873, 1328108, 1621288, 1912474, 2154550, 2313382, 2359853, 2287277, 2126485, 1889041, 1617469, 1327971, 1076574, 872629, 723660, 612575, 529004, 450653, 404689, 390395, 374305, 354108, 337304, 332969, 312664, 301374, 284052, 267135, 253349, 244277, 229992, 214194, 194627, 166509, 141339, 132346, 120886, 125470, 105603, 89438, 87397, 85767, 101049, 103362, 90517, 95409, 102705, 107363, 101273, 94732, 92602, 80181, 80946, 77124, 84458, 82241, 94016, 106786, 108909, 116141]
9873A16141N100l414o260q265J859L347j5680j8900p718r088P26n934j775P826
9859E7965O612m38O253K505l01K070L354M172o663k0486J719N680l151r35k483
9844E5873J0199q597o031j1282J6745J7798L903J1668K3522K5356K7579M4931
9832B11664Q9150J36088K07535K72762K26106R0257k0433j01758j59936k27747
9822G23688k07758j40824j01508n5146l5316k3846k2558j9549K451R138n838J525
9810A24459n682k759q228m810j5572j589K70o673Q65o461j0893j9974m046O352
9796D5259N602J960R827J379j7039r060L46K752L289J811J4747J630j0j1239j8345
9781C2909M761K140l040M78K624j494J689P53j437j530k2655r812O661R565M010
$$ y = [116141, 121241, 117827, 111567, 103302, 105161, 108508, 92828, 73928, 66210, 57122, 57848, 51914, 50139, 57965, 64577, 64139, 70392, 72897, 72596, 74666, 78020, 82192, 75529, 55043, 56762, 62442, 59291, 58356, 55873, 66072, 57475, 51444, 40162, 56907, 74705, 78608, 90276, 113798, 139154, 166733, 211664, 300814, 436902, 644437, 917199, 1143305, 1233562, 1213129, 1111371, 951435, 723688, 515930, 375106, 273598, 218452, 183136, 159290, 136732, 117183, 119634, 128772, 122934, 124459, 118777, 116018, 107790, 102980, 87408, 85819, 86089, 79416, 80281, 73820, 62927, 42953, 38907, 45259, 50861, 52821, 62648, 64027, 46988, 37928, 38274, 41026, 44315, 46126, 60873, 62503, 62493, 51254, 32909, 37670, 39810, 36770, 37248, 39872, 38378, 40067, 40820, 39383, 37853, 15198, 5386, 12047, 21612, 25622]
9766B5622J9862M047o173j7289L934J378M324n614J398k539j1203J315j5331n449
9752a718K0653N219l154J143M239L665J977J3938m847j3510N249J9161K0081Q611
9738H0707P579k009j7816r662N282j2115j0096m071j3783k967M523J707l519k844
9724B0916n934o689q645O65j572J1018P7o353q4N000q876j0788N452m84p635Q036
9708e896n511j797J1522J1230n640j2462j9460j273L564O341K0362Q799j2739
9695b960n913L230R997j214k736J0586j799k1851n616j0652n986R025l474J941
9681b7422P613J1269J5385j2751J813O665J071j2629j54J212J1501Q344j75m818
9667F924k709J3037P699l061j8512j1258k534J4197L352q020M145P481O148r997
$$ y = [25622, 45484, 49531, 43358, 26069, 30003, 31381, 35705, 30091, 31489, 28950, 17747, 19062, 3731, -1718, 18935, 24154, 21000, 22143, 26382, 30047, 32024, 45962, 41115, 27605, 32854, 52015, 72096, 80707, 88286, 86277, 68461, 58799, 64081, 51966, 41870, 37799, 24016, 21049, 25572, 27279, 23760, 20916, 14982, 8293, -352, 313, -1259, 9759, 9836, 3483, 3399, 8399, -477, -11265, -5813, -6297, -13932, -5896, -11407, -13204, -1682, 9548, 3908, -8554, -28014, -29287, -25723, -19382, 980, 9779, -2960, -8873, -5643, 4354, 3140, 404, 10990, 9191, -12660, -18276, -28928, -34914, -25889, -29363, -27422, -19809, -8540, 6845, -5906, -4093, 2572, 3643, -8986, -9140, -7928, 3573, 11917, 11742, 6924, 4215, 17252, 24951, 21890, 3378, -7880, -10414, 3783, 7135, -885, 3260, 10741, 16889, 6892]
9653F892n150L567j06m651k89j706Q073m47j1151P062N742l347R391L124K87j0844
9637F447r816j4272k600P089N975J750N668k901k224q93P712q937l391J4448k5
9622D030m401l072r410q849o205p37M969J2221Q645n000r015r683N958K933k616
9607b0232O249R080J3493L619k687L212L519N12j3162r283j0073j5248M333k813
9593b9481J9599L175j9789r142Q452N841N884L482k414J6531K091L61n648n481
9579f539M108K050r452N084M01p857o31J3995J0591n603R782o346q123N54R333
9564A1347J467j7976l962Q090J1121j894j0878m337K80j5256J0059N717m599K727
9550h094K356J826k89q879l029o600j647Q218M549K339r6O091J72N478j0119j3806
$$ y = [6892, 1742, 5309, 5203, 552, 263, -1443, 6630, 6183, -4968, 2094, 7836, 4489, 13880, 17004, 17291, 6447, -3369, -17641, -20241, -13152, -7177, -5427, 241, -2660, -4884, -5777, 1935, -7002, -10393, 4055, 4030, -371, -3443, -12853, -21702, -27907, -28644, -23675, -11454, -2809, -7809, -16824, -26507, -20549, -17616, -20232, -13983, -4903, 8590, 12209, 9522, 12734, 16253, 16765, 3603, -5680, -15753, -31001, -26668, -29481, -9882, -6707, -26496, -35638, -27186, -21345, -15461, -11979, -14393, 2138, 4229, 4590, -1058, -6539, -2431, -381, -9833, -4749, -4348, -12205, -12836, 1159, 11750, 6147, 15929, 9583, 1460, 2014, 11347, 12814, -5162, -9124, -1034, 10087, 8193, -2685, -7022, -6742, -21998, -11939, -6222, -10821, -8094, -5738, -3912, -4201, -13080, -16109, -22709, -24356, -16138, -11589, -9250, -9346, -3255, -3083, 2395, -7724, -21530]
9534b1530n760J6089n05p484P288j0892j4316L551J7597K262j8774j9393J593
9521e0274K4889J6471M876J871O870N609R374J0061l186q669o753o967j2426l042
9507a1296M732K969j5616o074L180k42J3704K214j0284N270m71J1261J10J720
9493A177R863j1756k762M29K308O640M486J0783J4799j5401j5172R161l524k3432
9479a2401q876j557k305p14K666j131J4393J7956J334q157j6062q263Q258P192
9465g667P370M723j0304l177k774k0m174k66j267m076o095O117O280J1324R513
9450E507L000j9955q303J3857L99l071m678n217O260J7735m285o160O26P534M229
9435G478K729o724o841q171j4793j893Q358P309q911J4284K037O19n06K65q287
$$ y = [-21530, -27290, -11201, -11706, -19190, -11902, -22794, -37110, -33559, -15962, -13700, -32474, -51867, -50274, -25385, -8914, -4038, -2167, 4703, 10312, 19686, 29747, 26561, 17892, 11139, 4172, -8254, -11296, -6564, -3595, -19211, -25285, -22105, -22347, -8643, -6429, -16713, -11443, -11914, -653, -543, 1177, 11040, -716, -3478, -3049, -741, 5899, 10385, 21168, 35967, 20566, 5394, 14555, 11031, -12401, -21277, -22834, -25139, -25853, -23187, -24318, -9925, 8031, 9365, 1208, -14854, -23117, -14859, -7667, -297, 4426, -5878, -9055, -11829, -11849, -16023, -16289, -17556, -21632, -27727, -21610, -15330, -4006, 5507, 8507, -11448, -19751, -5894, -5495, -8566, -13244, -18461, -12201, 5534, 1249, -4911, -4285, 3249, 7478, 10207, 3483, -3358, -11529, -26322, -28215, -19857, -12548, -21459, -7175, -5138, -4519, -5025, -4760, -13047]
9420a3047j823k622J2861J5502P58o361j5095j580l252j1729n180J148P258R997
9406a3165j5171j535o118Q168Q264N905j885L346K650J4754M185K527P5m616j71
9391G213n24j0941n400k846M322n481j4219k245k375J2417M956m860M790N538
9377i655J7794M497k497k616j2963K645J722k775K068Q223j2638j8643J0647J1229
9363b962o030M009j43j5389j1302m430K1893J9855n110j1856L228j3384p09K950
9349a9380m728j0923L328J2887j222l787j0962J2330K6239Rl456j1918N96O246
9335d741Q736N885M480n110l317M6l897j2876P12o486k30p829k255K423j996J1464
9319a4991j0289o885P897N642K0155K1709j4928n003q406j0834P278P144N860
$$ y = [-13047, -14870, -17492, -4631, 10871, 11629, 5268, -9827, -11407, -14659, -26388, -31568, -30420, -23162, -13165, -28336, -29871, -35989, -27821, -19557, -13652, -15537, -12191, -9541, 5213, 9398, 11925, 12000, 7384, 7213, 6689, -4252, -9652, -12498, -8176, -13657, -27876, -30121, -32496, -20079, -15123, -19983, -15193, -9655, 8139, 12636, 10139, 7523, -5440, -2795, -1073, -3848, -1780, 6443, -6195, -24838, -14191, -2962, -8992, -4983, -5126, -20515, -31817, -36247, -14354, 5501, 391, -11465, -8237, -21621, -22330, -19380, -24108, -35031, -31703, -18816, -20038, -23825, -34787, -22457, 3782, 3791, 335, -11583, -10987, -4741, 3995, 9880, 14360, 9250, 5933, 5979, 2082, -10794, -10082, -16568, -16798, -24627, -26882, -24459, -26455, -14991, -25280, -32165, -24268, -18626, 1529, 23238, 8310, 3307, -5099, -15933, -8655, -1511, 4349]
9306D349j802r835j2370m756R636M978j4400K929m48J1079o459q837O397Q715
9292a0824L016o909J743J5177q525m058J1775K658j329o715j6669j477J557l040
9278b3620L473p854Q097J1212N362J3788m822n655n367j1399J371O266J3000Q986
9264A2838P123m438k929n397R34J8465o733q561J511N067L703k522k041N218n449
9249A6789o899j6539o362J0416p311Q105P478n198q679n943J242k868M631P015
9235d123L737pP930L538j6902l820r460m898J625J2052o738L718J4440j728j1251
9220a1887r893l136j1093j4487Q999K7695J542j1496R03P139Q356k554n273l422
9206a8607N252O743j795J0401P196L40n369L631O989K584l63l38l231j6430j2633
$$ y = [4349, 2547, -7288, -19658, -24414, -14778, -9800, -24200, -21271, -21719, -10640, -17099, -25936, -19539, -10824, -7808, -14717, -12974, 2203, -6322, -10380, 1395, 4053, 2724, -3991, -20660, -22137, -20580, -23620, -20147, -28001, -19904, -8692, -3330, 10458, 5636, -19, -5386, -16785, -15414, -9148, 3852, 12838, 19961, 15523, 12594, 7197, 8131, 26596, 19863, 11302, 12813, 17880, 21583, 19061, 17020, 22238, 16789, 9890, -6649, -13011, -2595, -9906, -1801, 5677, 479, -8200, -14143, -12901, -15769, -11138, -4123, -386, -393, 7537, 11075, -5827, -9647, -19107, -24005, -22380, -10328, -17066, -13348, 1092, -636, -11887, -21780, -24916, -36009, -50496, -41497, -13802, -12260, -23756, -22853, -15714, -7358, -9912, -15185, -18607, -13355, -6612, -8407, 1994, 9190, 9530, 4161, 7792, 14781, 17365, 17002, 16664, 13433, -2997, -15630]
9191a5630j0506K940J2736J4558q317o941R22J510J0985j283m860K579K190N650
9177F533J699R28o032P428J4363J5484j2142k0264j0737j639P290J769J1013l012
9163A2681L879J5471m65n271l347J460p665j5375Q9N456o819r668k614P042Q048
9148B902j213k242o033r254j0460j0184K3001J4791q945M367r596q8P519J0641
9134E206Q153l785j8781n218L046J5133k01k1925j665J3779J8347L16k1252P08
9120h139Q94o853M473J1677P581j788J939R263p695o826j918K109o021J484J588
9105A768r172R77J0482p035j4522l914J250L839m268o968m225O93J2322k787J322
9090b0238J0812l738r316N323Q597P94N793L613O334m572j6178j1125J1960N666
$$ y = [-15630, -26136, -23196, -10460, 4098, -4219, -11160, -10238, -8728, 2257, 974, -3886, -1307, 883, 6533, 8232, 9160, 3128, 10556, 24919, 40403, 28261, 7997, -2740, -4379, 2911, 4680, 15693, 12681, 16560, 32031, 31566, 26295, 22948, 24408, 16743, 1368, 1457, 6913, 94, -9574, -12188, -5146, 2902, 1689, -553, -6586, -15840, -26300, -36484, -13483, 1308, -7637, -3270, -12866, -12954, -5435, 5206, 13359, 9574, -9207, -14425, -11379, 3754, 3553, -18372, -20037, -6258, 12089, 12405, -8847, -8139, -7245, -14098, -9625, 2052, 9633, 7845, 9784, 19047, 11352, 4526, 2608, 4717, -1304, 180, 1768, -7404, -6427, 4055, -2980, -17502, -21416, -20166, -16327, -20595, -27563, -31788, -31095, -18773, -21560, -20238, -9426, -13164, -22480, -17157, -8560, -7766, -1973, 1640, 7974, 3402, -12776, -23901, -11941, -6275]
9076f275p02O819m988j3104r421q446N829K2687M422L744p89m599N607K623q793
9061e386l053O051K87k281J3013k271p144R361q63p713j339K699m505R193J0897
9046A6946j3722j4196m66m29L157M137M805P584k849K69l606n701j2906j480J2016
9031f441J720R684L296O323N666J94j1813r551L11P41K730p075m199n201N024
9016h591O478O952J266j1682o959J1540l326K634P745p795n542K763O949K205
9002D637K039L160n759j3732K505P970j418j0694Q393O298N948o678q41r29j6673
8987a5774m649l3N280q420O715J3680q689o052J060J8340O986J4762p282j6597
8973f73j992r67K32n465J715q182O168m319n476r593Q452R942K816N603k1554
$$ y = [-6275, -6977, -158, -5146, -18250, -27671, -36117, -30288, -7601, -3179, 565, -224, -4823, 784, 3407, -5386, -8439, -2388, -2101, -4382, 8631, 6360, -784, 8577, 7714, 1, -1338, 1361, -3144, 6049, 16946, 3224, -10972, -11438, -11867, -8710, -4573, 232, 7816, 4967, 5236, 1630, -4071, -16977, -18457, -6441, -4721, 4963, 8259, 14582, 20248, 20442, 8629, -922, -611, 130, 2860, -4215, -8414, -13615, -8591, -2113, 4839, 6105, -5577, -12536, -996, -4322, -1688, 6057, -1738, -7280, -4517, 2432, 4637, 6676, 9836, 4077, -9655, -7150, 820, -598, -11292, -2899, 3399, 9347, 2669, 1828, 899, -15774, -20423, -20456, -15176, -23596, -16881, -3201, -11890, -17942, -16882, 1458, 8444, 23206, 15924, -673, -2665, -3632, -3400, -8865, -7150, -15332, -9164, -13483, -18959, -28552, -20100, -10158, -7342, -1739, -23293]
8958b3293q687N617N752Q7K389M533J3458N933n060j444k166o426P74j5812m29
8943b4774O858J40j260K566K0731l954q762j9220j650J2164J4131O332j1100R244
8929A446J8045j1021K313P341J949q697j5987p479J0870L218K581M727j1600p117
8915i411m455M28n956N190l74M720O880L363n458m46J1308P741n317j023j3755
8900f565m635J0124K774P95L354R880J1992r553q105k0000j6799k234Q358L959
8886a6655J5495J2512l542Q01q335M190O274K29j4421o838N836J4243R119q894
8872A0014j2475q605J8462J5117P139j6684j9816L050N520J321O767K44k562M737
8858A2229M552l201j7404J0373J3903M045j395L165l37j283r814j2107P635J8176
$$ y = [-23293, -31980, -26363, -20611, -20524, -18135, -13602, -144, 5789, 729, -715, -2881, -9307, -8533, -24345, -24774, -17916, -17776, -19036, -16470, 4261, 307, -8455, -27675, -29325, -17161, -3030, 3302, -7798, 1446, 19491, 8470, 10783, 18124, 20073, 11376, -4611, -12090, -1220, 1998, 4579, 9306, -2294, -9411, -13866, -13438, -19394, -14204, -14578, -9858, -2978, 385, -5073, -5519, 5789, 13530, 8213, 7190, -6565, -11200, -1076, 1698, 2493, 5847, 15727, 27719, 18166, 10061, -9939, -26738, -28972, -20614, -16655, -1160, 11352, 7810, 8611, 276, 4466, 10740, 10969, -3452, -10290, -4454, 9789, 18908, 10014, -2461, -11066, 7396, 22513, 29652, 12968, -6848, -3798, 1722, 3043, 9810, 10054, 7492, 12229, 16781, 13580, -3824, 6549, 20452, 24497, 23102, 26267, 25930, 24647, 14833, 2726, 10361, 28537]
8844B8537m190p154p883K328K32m920O463J6N692k820j2032K357J4940N792m97
8829B6861k365r458q880R021N116L35O891o007M230j943j1698p723L442N479K158
8814A5459K655j1157j2982j1832j462J2660j032R307K1253J1996j9250k0564n587
8801a0536J3054J1008o436R259m611J674N48J033m718R63O935J957J246p293p725
8786F358m822N95J4579O227p45j4804J539P260m064l521R967l494o696N510p416
8771F473J0431O179r994m351N173L239K491r068J1973N694m28o63j4358j740J6623
8756B7674P228o052N67j0797j600M58l771j0227N92j750q375J2452N084L253j016
8741A3720M836j0158j3645k629Q49J812R539j267r096K904j0479m936L724j785
$$ y = [28537, 24347, 17193, 9310, 11638, 11870, 6950, 13413, 13429, 19121, 16301, 4269, 6626, 21566, 27358, 26861, 24496, 15038, 6158, 15179, 20295, 20630, 27521, 21514, 25744, 23801, 12103, 4380, 7822, 13301, 15459, 18114, 6957, -6025, -17857, -19319, -6659, -7691, 1616, 22869, 34865, 15615, -4949, -10536, 2518, 13526, 7090, 16349, 11738, 13412, 13960, 14993, 10275, 11238, 18173, 20130, 21376, 14083, 6358, 1536, 2131, 16710, 22937, 22192, 7388, 8927, 16187, 12123, 8602, 18569, 15075, 8379, 13889, 6473, 16904, 23083, 13089, 8738, 13911, 17150, 19641, 10573, 22546, 28240, 27812, 27149, 12791, 11051, 27674, 34902, 28850, 29417, 18620, 17020, 17478, 13707, 3480, 4072, 2322, -6053, 6399, 11483, 14736, 13720, 18556, 8398, -5247, -7876, -7027, -5215, 4324, 3057, -6039, -3135, -13614, -18550, -14826, -16611]
8727a6611n2K0690L790J2242j676l327J3168j8852p214Q453k528J1595J3680M411
8713C7769j5778j1767j223L629N638l911m720m598j5317j1868k612r39J2218J3776
8699B97P221K850n476J0232K950n320J2584n192m257P694J3615Q200L15j0196
8685C5517K156P806N370J3688o995k631M692P535K190q65j4947m620P336p024
8671D9208n047J4804J0768o436n317K7562K1989m436o007K1641J7412L5607N3440
8658B25188M6224K1908L932j2146l2065n4168n4528k2070O89n539j9850K820p517
8645I2878N095l770J3954l174j2349l136P812R328Q927r222o823J1613J4864L0086
8631A56083K7240L6883N2496R0744N9354J1851j5886k4136m2582m6457k5585j0848
$$ y = [-16611, -16663, 4027, 7817, 20059, 18383, 15056, 28224, 9372, 2158, 10611, 8083, 19678, 33358, 37769, 21991, 10224, 9001, 12630, 18268, 14357, 9637, 5039, -10278, -22146, -24758, -25697, -13479, 297, 7518, 10368, 4892, 15124, 18074, 12754, 25338, 20146, 15889, 23583, 37198, 45398, 45713, 35517, 37673, 45479, 50849, 64537, 57542, 54911, 59603, 67138, 69328, 68463, 53516, 48896, 56232, 49208, 44161, 58965, 69733, 63297, 57980, 85542, 107531, 103095, 97088, 118729, 136141, 171748, 225188, 271412, 293320, 297252, 285106, 253041, 198873, 144345, 122275, 122964, 117425, 97575, 100395, 92878, 97973, 94203, 108157, 104983, 92634, 89498, 97310, 106638, 115565, 106343, 99520, 111133, 125997, 156083, 183323, 220206, 272702, 363446, 422800, 434651, 418765, 394629, 352047, 305590, 280005, 269157]
8619B69157K5811M7572J7045q74p019k3738m2912o0917m1283k2070q752J13L164
8606A55297P03p582j5005p749l08J2211J3673j248J1817k269j698p351K589K0689
8592A73769J7299J7909P526J8398L3483M5332K9671N9610R2463J37259J50954
8581G83673O8272j1481k7421p5437j13138j05564o7600o1921m4911l4915k6804
8570B82753k4436j6092j6023j9221r930j2791k244k6509l705l966m115q032q441
8557A27248o355q232j0184k01n771j73P146j985j0225O682M718L926Q265j0256
8543A04603N193L099J2385L3502N5496N9266M8179L0340J0151j0082l8435p0550
8531B43147o5306l5463j7937j5887J100k2118j3480J641P1R158j945n137j2551
$$ y = [269157, 294968, 342540, 359585, 358711, 351692, 327954, 285042, 224125, 182842, 160772, 152020, 152133, 155297, 156000, 148418, 133413, 125664, 125356, 137567, 151240, 149992, 161809, 159540, 157842, 150491, 153080, 173769, 191068, 208977, 216503, 234901, 268384, 313716, 343387, 402997, 495460, 632719, 783673, 851945, 840464, 813043, 737606, 624468, 518904, 451304, 389383, 344472, 309557, 282753, 258317, 242225, 226202, 206981, 197051, 184260, 182016, 155507, 151802, 147836, 143721, 135689, 127248, 120893, 112661, 102477, 102276, 96505, 96332, 103478, 101493, 91268, 97950, 102668, 106594, 114859, 104603, 109796, 112895, 125280, 158782, 214278, 273544, 321723, 352063, 362214, 352132, 313697, 243147, 177841, 142378, 124441, 108554, 109654, 87536, 74056, 75697, 75768, 84926, 82981, 77844, 65293]
8518F5293N877M511j5769K930P006J5765m313j9191j775k572k3464o180Q297o598
8504B9817O740m857K153N811m225p764l003r293j0821M797O704j657L40L688J5797
8489C4227R445j0099j3188K857j694k331n632q068J0287L33K177J2579q709j4916
8475G268j2190P966N398M071m239j0704p468M420M467N396j4896O552N616k676
8461a019R990o373j2951N547J5165J6775j1494J0821M930l126L14j60j853m017
8447B2549R780p13j2146j5548M886J0865J0518j726M11j1825j1254j068L631J4016
8433B2376J1997l428j1719n456j0206M843J363o081j9771p368m830J2403J4104
8420a773J0794J337m598k744L170j83O913J2986Q739j940j6454j4043k340J6049
$$ y = [65293, 71170, 75681, 59912, 62842, 69848, 85613, 81300, 62109, 60334, 57762, 34298, 28118, 36415, 29817, 36557, 31700, 33853, 39664, 35439, 27675, 24672, 15379, 4558, 9355, 16059, 14402, 14742, 18430, 34227, 43672, 33573, 20385, 23242, 21548, 19217, 13585, 5517, 15804, 16137, 18314, 30893, 22184, 7268, -4922, 3044, 8442, 12513, 8274, -2430, -9898, -5478, -1011, 4385, -10511, -3959, 1657, -1019, 8971, 2598, -10353, -4806, 10359, 27134, 15640, 26461, 31391, 28265, 28579, 28419, 26566, 22549, 32329, 31616, 19470, 3922, 8808, 19673, 30191, 28465, 28876, 17051, 5797, 4729, 8360, 22376, 34373, 30945, 19226, 13770, 3564, 8407, 9770, 3689, -16082, -23450, -28280, -15877, -1773, 9021, 10358, 5760, 3016, 6186, 6003, 12916, 25902, 34641, 32701, 16247, 2204, -136, 15913]
8406A5913M723o313m658N468J5402J633j1105j0709N600Q239Q695N082l323l247
8392C1400r694j045R484J1584j1492o401j7555J057K1834o507N554k1k840k038
8378B3320N236J0182N928J4942J6028o173r72k4021k9312N378J1942O567m818
8365C4227j5521q10R404j0514o106R947n323m783R69o819l660p258J0776R37r222
8350c756J1293M234J323J0004N587o717M078O106j322K070k446J5698J1911r040
8336D9023j7318o033J383L725J1943J164k528M63k533l686p872p558p88j3509
8322E876O774M270k420K828O974j6025k435K013J7464J0307r978K498k36m444
8308B3466J454K339n932n810o870j56Q253o769L606J5855L559M565J0558j5476
$$ y = [15913, 20636, 14323, 9665, 15133, 30535, 32168, 21063, 10354, 15954, 24193, 32888, 37970, 34647, 31400, 21706, 20661, 30145, 41729, 30237, 23836, 6281, 7338, 29172, 22665, 28219, 28198, 25358, 23320, 28556, 38738, 44666, 59608, 75636, 69463, 68491, 44470, 15158, 20536, 32478, 39045, 34227, 18706, 17896, 27300, 16786, 10680, 20627, 15304, 10521, 11490, 4671, 1011, -6247, 4529, 5466, -3756, 7537, 11771, 13094, 23098, 28685, 21968, 26046, 32152, 30830, 32900, 30454, 46152, 58063, 49023, 31705, 25672, 27055, 30780, 42723, 43887, 41359, 41822, 39289, 35603, 27731, 20173, 19385, 5876, 12650, 16920, 14500, 17328, 24302, 8277, 5842, 7855, 25319, 35626, 25648, 28146, 27910, 23466, 24920, 27259, 21327, 15517, 8647, 8491, 16744, 9975, 13581, 29436, 32995, 37560, 48118, 32642]
8294C2642M73l731r228J662k000J026r122n986n588n513K27Q888R03l114N287
8279F826o796N3L286r483k801n155K836J1020J4629K573K264k115P037j258q824
8264A4092l072m400o492n859p066J75o467J905j916P47J4655J3621Q229J453o951
8249A2654j9255n187L663M594J6000k759K73L991j2771L621J4855j0001p791l560
8235a673J3605J2202N921o899q601n160J0817l427j0796j1943R80J7019J0371
8222B2416q73j0211O848p745L978Q134j0960j0034P722n827K930K1590m900q473
8208A4595p674q219J1558k845j0976Q174L005O107J0168J175j5322k603l918K804
8194F029q508o01o058k882M055m475N559O451k300J593j516O990m575j559N622
$$ y = [32642, 33115, 29384, 20156, 21818, 19818, 20844, 11722, 5736, 148, -5365, -5138, 3750, 4653, 1539, 6826, 30, 83, 3369, -6114, -8915, -14070, -11234, -214, 14415, 16988, 19252, 17137, 24174, 22916, 14092, 11020, 6620, 128, -5731, -12797, -12622, -19089, -17184, -19100, -18353, -3698, 9923, 18152, 19605, 12654, -6601, -11788, -8125, -3531, 12469, 9710, 9983, 13974, 1203, 4824, 19679, 9678, 1887, -1673, 11932, 24134, 30055, 23156, 14555, 9395, 20212, 16785, 5989, -5954, -4974, 12045, 22416, 21543, 11332, 18180, 10435, 14413, 22547, 11587, 1553, 9275, 3448, 6378, 27968, 23068, 14595, 6921, -1298, 10260, 7415, -3561, 4613, 7618, 13725, 23893, 25068, 9746, 7143, 3225, 6029, -2479, -3080, -9138, -12020, -7965, -12440, -6881, -430, -2730, -1137, -2653, 4337, -238, -1797, 3825]
8179C825R428N097j1225j2580L22L788l564q790Q011J176j907P619L725p302R03
8164a474m447m30O718J0541M349r67k48N351J852m664j2789o246N788j2787K22
8149i231j099N693J0935K882o511k154r359Q346K644j1143J140Q097r218L930
8135e048O361j1757j0630J2053O866r496N06J0657J267n652o585Q036l546P06
8121f262R247r477q739L561Q808J2836J586r676J8899N759j2548q521n134q227
8107g888m663M46J3940P854N889j680p670M439Q552p476j0625L223n035J3925
8093A3231l080j2227k134K209O005j7184J719J7328o04m343O754J192L43j2409
8079c200n095P256J0989k647n083J6757m499L128J648n779j1357j2596O890R838
$$ y = [3825, 13253, 18350, 7125, -5455, -5133, -1345, -4909, -13699, -5688, -4512, -6419, 1200, 4925, -2377, -1474, -5921, -6351, 367, 10908, 15257, 14290, 14042, 19393, 21245, 16581, 3792, -2454, 3334, -9453, -9231, -10330, -4637, 6298, 9180, 2669, 515, -8844, -498, 2146, -8997, -7857, 240, -8978, -5048, 1313, -10444, -21074, -9021, -2155, -11651, -11145, -488, 779, -4873, -11458, -3422, -6968, -6262, 2985, -6492, -15231, -11670, -2862, 9974, 11560, 1884, 20783, 26542, 13994, 5473, 339, -7888, -12551, -12105, 1835, 9689, 15578, 13898, 6228, 10667, 19219, 11743, 1118, 4341, -694, 13231, 10151, -2076, -4210, -2001, 4004, -13180, -11461, 5867, 5263, 920, 7674, 8866, 9209, -3200, -8295, -1039, 9950, 7303, 2220, 18977, 14478, 17606, 19254, 13475, 2118, -10478, -3588, 6250]
8065F250J4721j676j9311m249R992J9998Q427M368j2338j8499L843o465K008J9369
8051B6438N396o567M168O979p26l136N414P132L724j6517j3281j0169n427N69
8037C997J0796j2293j1241o724N460K7274J7718K577o91j5938j5356l361K743
8024D961M658J7712J3414J445j4440j0110j3563O853j0459j164K3067N755k97
8011B7832K446N023p945k5290j4009L0816J1592J5571o16P221j661k667J665k597
7997D7381n622M758j1759l48m070J2597L330p65o572j1591O75J9909Q258K1107
7983G7288K5706K9012K8112m137l0906l6909k3617j2188o777n033l881M482L260
7970D4412n340l884l104P651k2341J234K1764J5560l060r66J194n564r057k238
$$ y = [6250, 20971, 19295, -16, -4265, 5727, 25725, 34152, 38520, 26182, 7683, 11526, 5061, 7069, 26438, 31834, 25267, 29435, 36414, 35688, 32552, 37966, 45098, 48822, 32305, 19024, 8855, 3428, 3997, 14793, 2500, -8741, -15465, -10005, 17269, 34987, 37564, 36873, 20935, 5579, 2218, 4961, 9619, 27331, 40745, 42190, 27750, 17640, 4077, 10930, 471, -693, 22374, 28129, 27832, 30278, 35301, 27356, 2066, -11943, 18873, 30465, 46036, 45420, 52641, 50980, 48313, 49978, 47381, 41759, 46517, 34758, 34410, 30340, 42937, 46267, 45502, 38930, 27339, 28014, 47923, 56181, 77288, 102994, 132006, 160118, 155981, 125075, 88166, 64549, 52361, 45584, 40551, 36670, 41152, 44412, 39072, 35188, 32084, 39735, 17394, 18628, 40392, 55952, 52892, 51926, 53120, 47556, 38499, 36261]
7956C6261K896M331N465R879j778k0883J525J879K73O719J7447J468j0778l961
7942E0743L661P45m602o783K2642k557m030J195P304L467j5463k4468m617P635
7928C4872j3703l32J1085j4144j1057R841N767P861J1613j374N946J961n000m774
7914C8562r84Q825j823j1807o124l976p711m102j844k939o187L24J7761O936o043
7899A8868K872o346M138K480m532p593J3579J850J268K444j083r873K338J1162
7885C1572O988K618j391R254l529j3404k2521J43j628K734K908N849o207o191
7871G195j4427P146J8873o164n187n02n682P542N179j074q214j4765p18J6277
7857E479Q740J2941Q854N428j0120M52q683p236j238j613k042m005L565O570l346
$$ y = [36261, 39157, 43488, 48953, 58832, 57054, 36171, 37696, 39575, 39848, 46567, 64014, 65482, 54704, 50743, 54404, 55149, 50547, 43764, 66406, 63849, 59819, 61014, 68318, 71785, 56322, 31854, 27237, 34872, 21169, 20837, 31922, 17778, 6721, 16562, 22329, 30190, 41803, 40429, 46375, 48336, 43336, 38562, 37578, 46403, 44580, 32773, 26649, 22673, 14962, 10860, 9016, 6077, -110, 214, 17975, 24911, 18868, 21740, 15394, 19532, 22012, 17480, 9887, 23466, 25316, 26584, 29028, 27945, 18072, 20410, 31572, 38560, 41178, 39787, 49041, 45512, 32108, 9587, 9730, 8102, 10836, 13744, 19593, 13386, 7195, -7232, -86, 18787, 12623, 7436, 6934, 1252, 8794, 13973, 12899, 4685, -10080, -10798, 5479, 14219, 27160, 36014, 41442, 31322, 31774, 23091, 15855, 14617, 13004, 10962, 6957, 10522, 17092, 13746]
7842A3746p895M164K268n228n758M681k205j3054M002k247Q706J4564o058m875
7828D811n476J859J6261m433n799J094l861o202L226M572m654q589J1356J0320
7814A4485q489p002L796Q0j6876o677J2686O566N504O585P940O618n577j6891
7800B748OJ2294Q297j0989k1275p426J7926Q829j1835K541M96L345L246j746k381
7785D076J831j6728m025K432L47n521Q304L992j0321O978N618J3518l713J253
7771H041N192N103j2615j0006P731M355l325J18o130m056n716l215N12m226P579
7756a0658J1416J0360O662m835J3052P610m888j0285j0788P197j1690j0242J293
7743e796n648Q08q40J2402l425j7015L813J274n043J4019J6189K808J612k471
$$ y = [13746, 5851, 10015, 12283, 7055, 1297, 5978, 3773, -9281, -5279, -7526, 1180, 15744, 9686, 4811, -665, 1194, 17455, 13022, 7223, 8317, 4456, -1746, 1480, 6052, 1398, -7191, 4165, 14485, 5996, -1006, 2790, 2870, -14006, -20683, -7997, -1431, 4073, 10658, 18598, 25216, 19639, 2748, 2754, 15048, 23345, 12356, -8919, -16345, 1581, 10410, -1425, 1116, 1612, 4957, 8203, 6457, 4076, 5907, -10821, -14846, -12414, -12067, -17588, -9284, -5292, -15613, -8635, -3017, 10501, 6788, 8041, 13233, 18336, 5721, -4285, 3446, 7801, 4476, 4594, -1536, -5592, -11308, -14523, -14011, -18237, -10658, 758, 11118, 17780, 12945, 25997, 33607, 28719, 18434, 7646, 14843, 3153, -7089, -5796, -11444, -10636, -11476, 926, -2499, -19514, -15701, -14427, -19470, -5451, 10738, 13546, 15158, 12687]
7729A2687j3153K644q786j4564r475p20J7106q341m362O072P948J2382r166P958
7715a770q635j0543P460p91n343l380R657M194o135J206O637p606n832P82K8784
7700H685j232j3021K21n031p825L048Q899O435K158q181J287n334l774R407L907
7685c51L197j1826o721N017J5482N997K229N000j1352m337j317r364k870J8718
7671G502J620j0389o114n340n402J2458Q597l516P109M644n090j3478p689n129
7657b0217K314M508p115O270J2890l769L195O359M145l25L466j6886j7448J8053
7643d560J0973o927j1839j6539n406R924j537j2484j8988K0921J6108l897L696
7630b0555j1220L795J1625N420j2927q863n652J3200J7968K1053j2658j2724k148
$$ y = [12687, -466, 2178, -6608, -21172, -30647, -31367, -14261, -22602, -26964, -20892, -12944, -562, -9728, -1770, -10405, -20948, -13488, -14279, -19622, -23002, -13345, -9151, -15286, -14080, -7443, -15049, -20881, -20099, 8685, 7453, -5568, -5347, -10378, -18203, -15155, -6256, 179, 2337, -5844, -4557, -9891, -13665, -4258, -351, 2846, -8980, -15701, -10684, 4798, 10795, 13024, 18024, 6672, 2335, 1018, -8346, -11216, 7502, 9122, -1267, -7381, -12721, -18123, -5665, 2932, -584, 6525, 11169, 6079, -7399, -15088, -20217, -17903, -13395, -20510, -14240, -1350, -5119, -1924, 4435, 8580, 8255, 11721, -5165, -22613, -4560, 6413, -514, -12353, -28892, -34298, -24374, -25911, -38395, -57383, -36462, -20354, -24251, -20555, -31775, -27980, -16355, -10935, -23862, -32725, -38377, -25177, -7209, 13844, 1186, -11538, -13686]
7617a3686R202j478r109j554M242N587J262j180J1540j2448o929o59j5129N949
7603b4390J9217K795J53N049l220M804j0800m071r411P114l585r767J1284M018
7589a0810p810O2j0337l480J0257J9187J2885p79K639l502L749O98j984k0159
7575i384l432Q038j342m580r554q468o887N696J2147K264o230m799M244J9427
7561b860N466K325L717r442q907j788J86n434K71k198k646N182Q299n278j5887
7546b8994N263J3801J0665R931j0569m149J6860O141O276N18j009l96r324j6423
7532a409p100o034j058P56j794j790Q143n68J966j745P521n886j3995o697J3712
7517a5978J1994L19j0667q025Q436R982r320j6555J4543P223k859n336L760j654
$$ y = [-13686, -4484, -5962, -15071, -16625, -12383, -6796, -5534, -6714, 4826, -7622, -14551, -15210, -30339, -24390, -5173, -2378, -2225, 2824, -396, 4408, -6392, -10463, -19874, -12760, -16345, -26112, -14828, -10810, -18620, -18558, -28895, -32375, -22118, -2931, 9954, 9175, 11814, 8312, 12061, 12759, 10775, -9384, -12816, -4778, -6120, -10700, -20254, -28722, -35609, -29913, -17766, -15502, -21732, -26531, -22287, -2860, 2606, 4931, 8648, -794, -9701, -11489, -11303, -16737, -16466, -18664, -21310, -16128, -7829, -13107, -28994, -23731, -9930, 735, 10666, 97, -4052, 12808, 18949, 25225, 25743, 24734, 24338, 15014, -1409, -8509, -14543, -15601, -14845, -16639, -18429, -10286, -10854, -8888, -10633, -3112, -8998, -22993, -29690, -15978, -3984, -3665, -14332, -22357, -13921, -3939, -13259, -29814, -15271, -8048, -10907, -16243, -12483, -14137]
7503a4137p24K451N733K382j1559L449Q730J873J858Q386L677P952J5791N196
7489D1058j6884j1197Q31r801N080j1066k296P537m562k0226r524J0189R694m246
7475a5413K42l52L792J0109J3854J4414R87p659j2282n673q457r599n406k513
7461b3956O653J1168l227o236L133J7538J7370r341N186P794L977k2910p755N707
7447E101R278j2502k0362k957J9313J133j2652j1211Q103l960L003J3578q37n158
7433a0130L943j519j1733N433K3117J425m173j9334J633R483m286p082N000n195
7419a3418m352P588P056J4750q44K887k1316j4906o678j299L73M324Q636j794
7405a8993N160K538l919j3150Q936Q156p052J0064m958n354l22m9N042l26Q630
$$ y = [-14137, -14861, -12410, -6677, -4295, -15854, -12405, -3675, -1802, 56, 8442, 12119, 20071, 35862, 41058, 24174, 12977, 13808, 4007, 9087, -1979, -4275, 3262, -1300, -21526, -31050, -20861, -11167, -15413, -15171, -15523, -11731, -1622, 12232, 26646, 27633, 19974, 7692, 2019, -6438, -16037, -21443, -23956, -17303, -6135, -9362, -15598, -12465, 5073, 22443, 13102, 18288, 26082, 30059, 7149, -606, 5101, 14379, 1877, -18485, -21442, -2129, -996, -13648, -24859, -16756, -20716, -17713, -4135, -4972, -10130, -6187, -7706, -19439, -14006, 9111, 10536, 6363, -12971, -11338, -1855, -6141, -13223, -8223, -13418, -17770, -10182, -3126, 11624, 10780, 13667, -7649, -22555, -29233, -30532, -30159, -25835, -17199, -18993, -13833, -11295, -15214, -28364, -19428, -11272, -18324, -8260, -13218, -18572, -18894, -18943, -13901, -14227, -5597]
7390e597J862J2669K205j643j4071M995l586j1161j0155Q346J5470P862o008J462
7376B650N250n01j1671j4533r20o639J5698n161q740O221j0741Q359M852n682
7362b1558j744J8451o555q513J3281L499J066M099j833l721n475J4647L097M266
7348A3007p635j5833j710O101l069j22O276j0360j6221J154K835P292O449N450
7334f386l740p144j3411K471N327O031M939m501J1794J6386M56Q602N086j5628
7320A0282j4480j55J1021Q595j6703j2009j6480J4537P089n022P359j1070r090
7307b6126N236J1926j1717q861L594J644O048J3033Q594l344j0768P186L575q942
7293h922k0267j1613N725R709K386K88k658M255J5735K829r131j2754j2041K071
$$ y = [-5597, -3735, 8934, 11139, 9496, -4575, 420, -3166, -14327, -24482, -16136, -666, 7196, 1188, 2650, 7900, 7399, -4272, -18805, -19725, -26364, -10666, -15827, -24567, -18346, -29087, -20728, -15876, -21558, -23302, -4851, -11406, -19919, -6638, -3139, -2073, 2026, 193, -3528, -9003, 5644, 8741, 13007, 5372, -10461, -12171, -6070, -9139, -9261, -2985, -13345, -29566, -28412, -25577, -18285, -11836, -6386, -10126, -17270, -30681, -28210, -22883, -16852, -11913, -16414, -4620, 11766, 12222, 20824, 25910, 10282, -4198, -4353, 6668, 15263, -1440, -13449, -29929, -15392, -8303, -13325, -5966, -17036, -26126, -20890, -8964, -20681, -29542, -25948, -24304, -18256, -5223, 3371, 27, -10741, -3555, 20, -8922, -29189, -40802, -35077, -25368, -22982, -22694, -25352, -21097, -5362, -2533, -11664, -24418, -36459, -34388]
7279c4388N794N531J9305J4773j1920n994O393N313l832o076p919m742J7203j720
7265b279j1293j319J6674N228p438J506p347j2928K953m485M109M931J0571p531
7251h648n733Q5J662L502L699J8190J937L457j5872m512M733J5146j2508j6486
7237a1348r25N250P334j1723k2479k691J54O078J8519J0604n28r134o96o77j1313
7222b3575k214N302J331J0590K075m802j528P227J1513k515q136N597N003K623
7208H491o577j0051L805N52j2222r355K370Q46r959M538J8728J649O856j4593
7194a4922o035N343N316j047Q623N303q739r755P335K42j3316l559Q362L738j736
7179a4847J622L623q529j138J3720Q86j0214Q741M854L193j1395l99j361J971
$$ y = [-34388, -28594, -23063, -3758, 11015, -905, -6899, -506, 4807, 975, -5101, -13020, -17762, -559, -2279, -13572, -14891, 1783, 7011, -427, 1079, -6268, -19196, -16243, -20728, -16619, -11688, -1117, -8648, -14381, -14296, -12634, -9132, -5433, 12757, 14694, 18151, 2279, -2233, 2500, 17646, 5138, -11348, -12273, -7023, 311, -11412, -33891, -36582, -36428, -30350, -11831, -1227, -1755, -10889, -11585, -12262, -23575, -25789, -20487, -19156, -8566, -6491, -11293, -12821, -5594, 5919, 3404, -4732, 865, 5868, 8491, 1914, -8137, -4332, -3780, -16002, -25357, -22987, -22141, -32100, -27562, -8834, -7185, -329, -14922, -20957, -15614, -10298, -11345, -2722, 2581, -6158, -15913, -8578, -8336, -21652, -25211, -16849, -13111, -14847, -13225, -9602, -18131, -19269, -5549, -4663, -14877, -6136, -1282, 1911, -9484, -9883, -11244, -9273]
7165i273r481m849o534K975J4903p562o436n823o55J4959MM33r052j363p188J4535
7149b0407J6851J2617R043K60j4035j0328K020o626N790j223M442K321J267N95
7135B587p395o773r388N0J4482L914j6206M325M538J1551J0736j5660j5089K058
7121a6270J0115J2738L493j2886j1628k378J7286R408j2898M125O456R49p084
7108A426p900o354l644n176M412L973M317P666k222o44m238J1014m277j3846j364
7093a6857m524r599K911J9683L218o914Q013k141p57l147K933L512j1634p370
7079b2673L864L146N561l727J0873o524j0732Q967q47j0103J086L137R870O629
7065a473M898m872k859k815O87j1049M636R821j0098K020L380j187j0490k416
$$ y = [-9273, -18754, -23603, -30137, -27162, -12259, -19821, -26257, -32080, -32735, -17776, -17772, -17339, -26391, -27754, -34942, -20407, -3556, 9061, 18104, 18364, 4329, -5999, -3979, -10605, -4815, -6038, -1596, 725, 1992, 2587, -4808, -11581, -20969, -20919, -6437, -2523, -18729, -14404, -9866, 1685, 12421, -3239, -18328, -16270, -6155, 6583, 10076, -2810, -14438, -16816, 470, 9878, -3020, 1105, 7561, 8510, 1426, -6474, -12828, -16472, -21648, -17236, -13263, -8946, -1280, -3502, -4146, -8384, 2630, -1647, -15493, -16857, -21381, -30980, -28069, -8386, -5168, -12082, -4069, -6210, -6967, -10114, -7181, -3669, -15303, -22673, -18809, -15663, -10102, -13829, -2956, -9480, -20212, -11245, -12092, -22195, -21109, -17972, -8102, -1473, 3425, -1447, -4306, -7121, -6434, -17483, -12847, -3026, -13124, -11104, -7724, -8911, -19401, -21817]
7051b1817J1941R253P154q656j605L575K765o587m836k713O915N743L293k946
7037A479K009J532Q64m274k737k674M853P613k873j3160J215k943N7k369l197
7022a4605M575O810r109m222J2288M600J176j2435j4854M530N826K66P380o099
7008a3873L88R21q39Q748J290j361l263k00N981J405j190j959o431o367o144R988
6992a2906J6871j1143j4130j2200J4258J7967O101j0658j2197p63O078N203P165
6979c54j1211Q013M662jJ5481m70r281l723q642j0816L200J857J0416P136n253
6964A014R104o54n818k179p50j3308j1817K83Q920J793l633l226N819k013L07
6949a6158j809q958R276N010q267J946n147p631R417k62n02l700o58m622J0730
$$ y = [-21817, -9876, -623, 6531, -2125, -3730, -155, 2610, -3977, -8813, -11526, -4611, 1132, 4425, 1479, 3488, 5020, 5884, 1610, -1127, -3801, 1052, 8665, 5792, -7368, -6153, -9096, -9039, -11408, -14605, -10030, -3220, -12329, -16551, -4263, 337, 1513, -10922, -25776, -21246, -15420, -15154, -7774, -13873, -13485, -12564, -13403, -4655, -3365, -4726, -7989, -8189, -2208, -803, -1993, -3952, -10383, -16750, -22894, -12906, 3965, -7178, -21308, -33508, -19250, -1283, 4818, -5840, -18037, -18800, -12722, -7519, -354, -11565, -3552, 1110, 1109, 16590, 16120, 6839, 3116, -5526, -16342, -13142, -11285, -869, 6267, 1014, 10118, 9464, 3646, 1467, 717, -12591, -24408, -24125, -15205, -13412, -17045, -20271, -14452, -16465, -16158, -17967, -26925, -17649, -12639, -20906, -18960, -24107, -31738, -22321, -22583, -23085, -26785, -27443, -32065, -21335]
6934b1335j005o775O828j269K146l067r896N640K1005J5890n68n043n419r024
6920a1892m657o192R097k434j5071k795P471J3277J5310O937O923K412l024l411
6906A1951r359K898n267p784K066n936M388N263J0634p077q681J0237J2358q177
6892G514o691m536p6m494j2022J262Q826N194J1022j975p157O618J4089m585j4868
6877a879j881N620m912j0226J589N91R255k587J551j5591m479O823m342j2785
6863c3253J7407Q781N904j827J323J077J0625l138j0385j444o371j853J819R367
6849a968P60m021m423R913N053m298j7391j1892p378n312P39Q037O352O911j775
6834b0693j1874J4641K2962j189M303N085M262k290j0557N99R767j1586j6625
$$ y = [-21335, -22340, -29115, -22287, -23556, -21410, -24477, -34373, -28733, -7728, 8162, 7594, 2551, -2868, -11892, -16549, -22741, -13644, -16078, -31149, -33944, -26473, -13196, 2114, 9051, 15974, 18386, 15362, 11951, 2592, 5490, 223, -7561, -5495, -11431, -7043, -1780, 8854, 1777, -6904, 3333, 15691, 7514, 823, -3713, -3789, -8283, -20305, -19043, -10217, -5023, 5999, 4024, -3133, 3485, 17574, 12989, -1879, -3760, 1860, -3052, -13278, -11689, -11098, -1843, -4430, -2879, -18470, -22949, -16126, -20468, -33253, -15846, -7065, -1161, -2988, -1665, -588, 10037, 6899, -3486, -4930, -11301, -13154, -11335, -1968, -1208, -5229, -9652, 261, 5314, 1016, -16375, -28267, -35645, -40957, -40218, -32181, -25829, -18918, -20693, -32567, -17926, 5036, 3847, 8150, 13235, 17497, 15207, 4650, 5249, 15016, 3430, -13195]
6821a3195o306J0033M887J5660p784j2631j323J5681r219l439m175p060M542P510
6807f819P697j4135J474m764P777J5661P321l820j8474q094Q185N287L485o9k0972
6792b0260m298k995J4274M759N67K148J9877N248k5026q969J4675p515p704k665
6778a7884M247J7912K830J539r835l778R24k677R15J0628k568j3407o524L784
6764a3894n38J257K107K894O739J421k060K285k677j324n501K700O877L87M785
6749E458L34q831q971j4781J5879K0136n427j3530l754q859n871J4412n36n043
6735a9384M075o685l929J3730K912N670L292M544o065r214K248Q689k658p60R29
6720b606r845L176o742r22J2050J2478J371j7679J51J0499K0026J2870K563o548
$$ y = [-13195, -19501, -9468, -4581, 11079, 3295, -9336, -10659, 5022, -4197, -7636, -11811, -18871, -14329, -6819, 878, -13257, -11783, -16547, -8770, 6891, 14212, 10392, -8082, -16176, -7991, -2704, 781, 712, -20260, -24558, -27553, -13279, -8520, -7953, -5805, 14072, 19320, -5706, -14675, 0, -7515, -15219, -17884, -13637, 4275, 7105, 8644, -1191, -4969, -4045, -6722, -5807, 4821, 2253, -11154, -17678, -13894, -14432, -13175, -11068, -8174, -1435, -14, -2074, 211, -2466, -3790, -9291, -6591, 286, 673, 5458, 5792, -3039, -12010, -26791, -10912, 9224, 3797, -9733, -13487, -22346, -28217, -13805, -14341, -19384, -15309, -21994, -25923, -12193, -9281, -3611, -319, 4225, -1840, -11054, -8806, -117, -2775, -3535, -2606, -12451, -9275, -16017, -16939, -4889, 7589, 8960, -8719, -8568, 1931, 21957, 34827, 37390, 30842]
6706C0842j0703o841p1N739L184r971N33m144O48k243o027j7092K6N356m613P
6690a5370Q096J2242J2268M93j7824j767k823M418m135L307J4980k861j3269k9410
6676c1655n48O613k809R946N970J35P679L247J0086K960j972M666M591M856j3955
6661I810k0870l263R907M660P409P938J460k030M670l584l863q157L90O648l418
6646G707r595k734M922r937r394L961P042j418k972J981K831j4072K154M213J0135
6631e176p20k515N10J489O811J4433p082J2398J7050j9575k2195LJ255l047j2072
6616a8433l69R072J6170j638K258k745k6466j1666K656J3606M559L293r660R327
6602a0036K226n040J11K284Q061M826L301P119j1157k293o39N42m539n30j444
$$ y = [30842, 20139, 13298, 13227, 18966, 22150, 12179, 12712, 8568, 9216, 6973, 946, -16146, -16120, -10764, -15377, -15370, -7274, 4968, 17236, 17729, -95, -1862, -4685, -267, -4402, -1095, 13885, 11024, -2245, -31655, -32203, -25590, -28399, -18453, -12483, -12348, -4669, -1422, 8664, 11624, 9652, 14318, 18909, 23765, 9810, -11060, -14323, -4416, 244, 7653, 15591, 17051, 15021, 19691, 16107, 12244, 4087, 4477, 11125, 7707, -1888, -4622, 300, -9637, -19031, -15070, -8028, -9446, -12418, -10437, -7606, -21678, -19524, -15311, -5176, -5896, -8411, -7901, -6412, 399, 14832, 7750, 20148, 37198, 17623, -4572, -4569, -3314, -6361, -18433, -18802, -9730, 6440, 4802, 7060, 4315, -22151, -33817, -31161, -17555, -12996, -9703, -19363, -10036, -7810, -12850, -12739, -10455, -2394, 2432, 5733, 12852, 1695, -598, -1237, -695, -5234, -5764, -7208]
6587g208J671j6663m498J6466P184o109j1376q012P178N746N973l616r144L339
6573a9069Q840M365J967N209M741o069p386N50N815M207m410p823q850k27R882
6558h258K6274R461j1642j7212j2659k487l925l236Q534J1854Q967rJ0689m970
6544A1381J151j2682r181n583j1224L800N645J0081M722j256N989m461j1078N243
6530g453k285j1684P181R273K126n535k563Q935m24J539n072k184N125p293o610
6515a6924j0670j757J8145J9896n269j4051L296P964k060N016n700N147L364q009
6501a612o701L126J146M969j459n383k0599m952p740J3998J6727P993M759J2043
6487A6315j6217o129K321j1199r454J0855l959M495j110J4450N873r651o806J0853
$$ y = [-7208, -5537, -22200, -26698, -10232, -3048, -9157, -20533, -28545, -21367, -15621, -9648, -13264, -22408, -19069, -10229, -5864, -3897, 1312, 6053, -16, -7402, -6852, -1037, 3170, -1240, -9063, -17913, -18140, -8258, 18016, 27477, 15835, -1377, -14036, -16523, -20448, -23684, -15150, -3296, 5671, 5662, 16351, 11381, 12532, -150, -9331, -14914, -26138, -22338, -16693, -6612, -1890, -3146, 2843, -1618, -12696, -7453, -9738, -21422, -14241, -4968, -2842, -8377, -10940, -2005, -2429, -890, -5962, -8146, -3021, -10314, -16924, -27594, -29351, -11206, 8690, 3421, -10630, -7334, 630, -1430, 3586, -2114, 3033, 6397, -1612, -8313, -5187, -4041, 928, -531, -5914, -26513, -31465, -39205, -25207, -8480, -487, 4272, 16315, 98, -6031, -3710, -14909, -24363, -13508, -17467, -12972, -14082, 368, 6241, -3410, -10216, 637]
6473F37k217Q09o006n412K656j599k360J3580J0474l672k946j1388K32M232k23
6458c203o334j3799j1887J9913J8497L033j6044m681R804J0583L985n154M20l498
6444A635K774m238j5380N855N637N056K784l090N165N022j0543j5137j2088j347
6430b7895K1951J1521L343j397q328l804j414Q177P147P459K915j5233j3579j1826
6416b0963J173Q781k709Q80k030p818R783K4755J505j3080k842L102L196j0008
6402f275j387J2284Q443L543l881j0470r101l189M864J5819P83q056P742l937
6388G182k308J744P275P389j4774j2624N693K275L709l433o630j810q651j1920
6374b6883Q644J7346O763j256O114j2869r739m617M491k850l48k038o237J121
$$ y = [637, -1580, -771, -6777, -12189, -9533, -11132, -13492, 88, 10562, 6890, 3944, -7444, -7212, -2980, -3203, -9537, -23336, -35223, -15310, 3187, 6220, -9824, -14505, -4701, 5882, 9867, 4713, 5133, 1635, 4409, 171, -15209, -9354, -3717, 1339, 4123, 1033, 6198, 11220, 677, -14460, -26548, -27895, -5944, 5577, 8920, 7523, -805, -4609, -6023, 2154, 9301, 16760, 19675, 4442, -9137, -20963, -19790, -11009, -13718, -12838, -14868, -22686, -12903, 11852, 13357, 277, -2565, 537, 3733, -6275, -7662, 4622, 13065, 16608, 12727, 2257, -6844, -10033, -5169, 10650, 11433, 3377, 11119, 7182, 4874, 6618, 13893, 21282, 6508, -6116, -423, 1852, 5561, 2128, -4502, -6312, -14963, -26883, -18239, -893, 5870, 4614, 10728, -2141, -11880, -16497, -12006, -14856, -15204, -17242, -23479, -22358]
6360b2358Q758M994o234K3305N874j5103p068n006N568L964n221J1405k646J272
6346A504O08O773L130k988r297j0777L257K288K520N519j964q189Q071R561L319
6331A3335j3452P328L519j5032j7575J5461J1036k1898Q569j0051K534L827L054
6318i345l23l947R476O866m545n231M35N431J509m51R563r177k3315L742P108
6303a2204K500q548j325j276M555J9596J391m539k132n748p854J162J7875O777
6289A0230j4217p884M614J0584J772q009n638N883Q827n277q932m575O725k180
6275h077R85R842K441k074j395q095n412j0806J733K781j545J2485K0088M737
6261A7688j371o205p402r101n060M232K0292L048j2851j5771M883O072r85J2080
$$ y = [-22358, -13600, -8606, -14840, 8465, 14339, -764, -7832, -12838, -7270, -3306, -8527, 2878, 232, 1504, 2112, 8885, 12015, 9027, -270, -11047, -7790, -5502, -2982, 2537, 573, -7616, 455, 10016, 13335, -117, 7211, 10730, -4302, -21877, -6416, 4620, -17278, -8709, -18760, -16226, -12399, -9345, -9668, -13615, -4139, 2727, -1818, -7049, -6614, -1183, 326, -125, 9438, 261, -23054, -19312, -12204, -9704, -18252, -19577, -20853, -16298, 3298, 4689, 150, -1982, -7730, -15584, -14422, 3453, 10230, -3987, -11871, -7257, 3327, 5099, -2910, -8548, -2665, 6162, 885, -8047, -12622, -5897, -8077, -7092, 2750, 5191, 3117, 1722, -6373, -11785, -22591, -20858, -18077, -19622, -7137, 12951, 17688, 16317, 10112, 2710, -6391, -11451, -7219, 13073, 16121, 3270, -12501, -7618, -1546, -2531, 9549]
6247I549J1462o116j5923j5659J18O002j692P086j126R338J6195R993k359o739
6233B0129l947j2425P194m553j1144r206P320K257k729q841r540M630o226l591
6219c0672L271Q297L792J2435N917j118l831M961N745j002q188r368K025m09K65
6204g880K209l683l743j4909J3765L760m03J3518K0416M698p521L673q403p208
6190H289J0916j085l218o835p586o080p601N657P155p794j6242J0293J7735n649
6176b045l303j0614l142N572P041N368k195k406k1272J921K6564L819n398R777
6162I687r378j1828r01N798L858p904m403J687N340l088l286J6187O579k506j1854
6147f012R15m253K636l683O47r297Q479J0362M601K887J625j1374L173j5335k096
$$ y = [9549, 21011, 14895, -1028, -16687, -16569, -10567, -12259, -5173, -6299, 3039, 19234, 29227, 26868, 20129, 16182, 3757, 10951, 6398, -4746, -13952, -6632, -4375, -7104, -15945, -25485, -20855, -27081, -30672, -27401, -19104, -15312, -2877, 3040, 1922, -1909, 3052, 8797, 7795, -393, -9761, -7736, -8145, -7880, -5671, -9354, -13097, -28006, -14241, -10481, -10884, 2634, 23050, 27748, 20227, 23900, 15497, 8289, 19205, 18120, 14902, 8067, 481, -5599, -13200, -7543, -388, -8182, -24424, -14131, 3604, -2045, -5348, -15962, -19104, -13532, -6491, -1123, -3318, -5724, -26996, -25075, 1489, 5308, -90, 9687, 309, -11519, -12420, -6622, -2764, -10668, -15071, -13384, -8044, -11132, -14418, 1769, 8348, 5842, -6012, -5097, -9350, -6714, -10397, -9750, -19047, -10568, -206, 4395, 7282, 8907, -2467, 706, -14629, -16725]
6132a6725j5512M646J383J3739J6327n429o069o073j0974J1270J8615m117j2856
6119a1775q065n830M23R777Q764N45k364K428O658P651j525M833j782K098n296
6104F540Q12j73j8740M049L428O60k065O388L092j227j572j4729M888J5813j3328
6089f164m959J4966L176n341Q365N324q517j6387o887J3319J1999J903K340P408
6075B0545K228j058j8136r262q147j3545R660J8250N271m830M403K528k096k23
6061E588q036o885R522J0899P699p326p988M708n050l024m952k214K70p867l131
6046a7787P361K440n320Q831J4816o31j655P45l671J144K902l625m937M66n392
6031d313J866L057P420L146n385K959L788p464p560J541N611o625Q730J0907j551
$$ y = [-16725, -32237, -27591, -26208, -12469, 3858, -1571, -7640, -13713, -24687, -13417, 5198, 1081, -11775, -19840, -25670, -25247, -15470, -6706, -6161, -8525, -6097, 561, 8212, 6687, 11520, 9738, 11836, 6540, 7352, 7179, -11561, -7512, -4084, -3424, -5489, 899, 3991, 2764, 1192, -13537, -8649, 7164, -6164, -11123, 3843, 7019, 1678, 10043, 15367, 6850, -9537, -16424, -3105, 8894, 10797, 13137, 20545, 22773, 21715, 3579, -5683, -13830, -27375, -17715, 535, 5806, 976, 5379, 7907, 5811, 5588, -2448, -9333, 189, 11088, 18787, 11461, 3473, 8181, 3131, 107, -4845, -7059, -6789, -14656, -17787, -10426, -7986, -13306, -4475, 10341, 9710, 8055, 8800, 5129, 6273, 9175, 5550, 613, 1079, -4313, -2447, 610, 8030, 11176, 5791, 8750, 12538, 5074, -2486, -945, 4666, -1959, 6771, 17678, 16127]
6016A6127n15q862j517n261P166K934j2359N661P525n290r913O205O528j0568
6002b139L561J0823j0389p674j2259J084L806J8388L893p314l564j9236j1906
5989c2926O097j80J2835J7607N981o400O717J0362j385m571j300J0534m55o462
5975A6454j7873j3659J840J2870J5871l691L291m598k037l97O7M644j98j2849
5961b65M272l145j3426P136N978J205j040j87Q687P578k618o023J954K778J52
5946A3036l73L964R492j4963m243J1614l059M073k262j4466k968R586N149n293
5932I287k473O913K099l196j2557k0385P951K4764L03n481j2695m717N101q754
5918a3840r98J0690J7526J183j1948q891L730O07k656k605m50j96o05R431J50
$$ y = [16127, 15612, 6750, 5233, -28, 7138, 10072, -2287, 3374, 10899, 5609, -4304, 1901, 8429, -2139, 1422, 12245, 1856, -5818, -18077, -16993, -13187, 5201, 9094, 1780, -1784, -21020, -32926, -26829, -27009, -14174, 3433, 9414, 3014, 9731, 20093, 18708, 14137, 12837, 23371, 22916, 16454, -1419, -15078, -13238, -368, 15503, 11812, 15103, 10505, 8468, 8071, 8138, 12782, 12584, -265, 4007, 862, -12564, -5428, 550, 1755, 715, 528, 9215, 16793, 14175, 8152, 10106, 12884, 13036, 12663, 16627, 26119, 11156, 6913, 18527, 15468, 19541, 17279, 2813, -155, 9431, 14580, 9287, 6814, 13727, 15826, 12630, 73, -20312, -12361, 12403, 12706, 7225, -5470, -10187, -5086, -13840, -14838, -4148, 13378, 14561, 2613, -6278, -2548, -1941, -4597, -7202, -7652, -7848, -8453, 978, 1128]
5903A128j2345M150J521j4307r9K3214j046K023j095j0243J3645O689p938L843
5889I140r5l694m106o335L1J290o339j607r17K1549J6006p068k0795K336j308
5874a912o694m665J2610p95n217L358P013k869K259j616J1683l326k611J981j0554
5859a355o357j0461j4620L025J7825J9966Q554J131J273j9782j4039o999l89K341
5845a9887J5212J0581P004K747j1969k586j0914m291j799j877J441M50n039J3404
5831g523O841Q232q17q093r082N597K667j273M94L974p540O62J0979P662K776
5816A5556L595k679K742n159o518p907M98l654Q152Q106n181j1992N600M376p637
5801b102m911N349m8l134j2677J000R060J0484R081j566r953L747Q323J64j1614
$$ y = [1128, -11217, -7067, -5546, -19853, -19952, 3262, 2216, 4239, 3144, -7099, 6546, 13235, 5297, 9140, 9045, 5351, 1245, -5090, -5059, -3769, -10108, -11715, -12632, 8917, 24923, 17855, -2940, -604, -1912, -8606, -13271, -661, -1456, -6673, -3315, 3698, 829, 3088, 1472, 13155, 9829, 7218, 9199, -1355, -7712, -18173, -32793, -29768, -11943, 8023, 16577, 17708, 18981, -801, -14840, -21839, -22228, -19887, -4675, 5906, 12910, 15657, 3688, 1102, -9812, -14103, -15902, -17779, -16338, -15888, -20927, -7523, -682, 7550, 6733, -1360, -10442, -4845, -2178, -3451, -2957, 1017, -6523, -5861, 5118, 12780, 15556, 19151, 16472, 19214, 14055, 7537, -370, 128, -3526, 4626, 12732, 7551, -4441, 1159, 5535, -2102, -7013, -1664, -1712, -4846, -17523, -16523, -7463, 3021, 12102, 10536, 583, 4330, 12653, 12817, 1203]
5786A203j148J321j988m112r956J61L121j1545o760M464J175L528J3224O564J1589
5771A0841j2776o148l315p05M12P890l131j0841n58N012k073j322J6309m505j0658
5756a5568K193Q987J4772j4425r33Q235j35j0993o919j8767l44J4441J918P689
5742i849Q403J6291L756j1930J358K448j361j2552j4369J0511j895q244N553Q237
5728c643l486M353J1196N798j0195j6141r645O241R776Q478n393o143M948kP677
5713C819N267M251N411j0081j3857k76O59L527q520j4583J2931L815L138J3664
5699I165l143M778l709p757j0863l789J332P418O128N509Q631M509r471j821O559
5684A3476j4517k015Q311j1227p110J153J2452J7344L417j3711l429j4245o131
$$ y = [1203, 55, 1376, -612, -4724, -14680, -14519, -11398, -22943, -29703, -25239, -24064, -20536, -7312, -748, 10841, -1935, -8083, -11398, -12103, -11691, -3801, -6932, -17773, -18331, -13319, -15392, -16714, -405, -4910, -15568, -13375, -4388, 10384, -4041, -4974, 3261, 3126, -7867, -14786, -33553, -33897, -19456, -17538, -9849, -1446, 14845, 18601, 6671, 8029, 10477, 9116, -3436, -17805, -7294, -9189, -17433, -11880, -3643, -7129, -2776, 8420, 14218, 4023, -12118, -21763, -15522, -5746, 2732, -2661, -8804, -3856, -3858, 3819, 9086, 13337, 18748, 8667, -5190, -5466, -4807, -1280, -9800, -24383, -11452, -7637, -4499, 9165, 6022, 10800, 7091, -666, -11529, -15318, -13986, -6568, -440, 5069, 13700, 18209, 8738, 6917, 13476, -1041, -3056, 5255, -5972, -13082, -11929, 523, 17867, 21284, 7573, 4144, -10101, -16232]
5671a6232j2357R97N102K476J1300K436j515j6038O819K0819K484m629p583L592
5657b329K799k816Q067J767q293K099L853n101k667m757K675M704R02O106p25
5642F284N105K50l398p213M026J332M963l340j0836Q486R400p981j3239J15j357
5627g403m29O84K854r151L661j7964R600J0225Q568L494K45k590o307O137N282
5612F906j9238k8422j1361l383M256M306R125K7059J5114R356l023q946j2386
5599a0637K609l217j2083p420L129K1040K824k891l399J4605J4220j4062j4688
5586i970j1920J0981Q953K723N344o55j7434P165J3556n289p163R910J093J355
5572H649N50J17K59j725L60k005q249j6313j3290P579J4399Q864r774J0999L111
$$ y = [-16232, -28589, -27592, -22490, -20014, -8714, -6278, -7793, -23831, -17012, 3807, 6291, 1662, -5921, -2329, 470, -2346, 5721, 7488, -805, 1294, 5147, 46, -2621, -7378, -4703, 1, 903, 7009, 6284, 11389, 11639, 8241, 1028, 5054, 6386, 11349, 8009, -2827, 5659, 15059, 7078, -6161, -6046, -7403, -7832, -7148, -4294, -13445, -9784, -27748, -18148, -7923, 645, 4139, 4384, 1794, -4513, 1624, 6906, -12332, -40754, -52115, -55498, -51242, -46936, -37811, -10752, 4362, 13718, 10695, 1749, -10637, -8028, -11245, -23328, -30748, -27619, -6579, -3755, -6646, -10045, 4560, 18780, 4718, -9970, -21890, -10909, -1956, 767, 6111, 5456, -11978, -4813, 8743, 3454, -3709, 6201, 7294, 8649, 9199, 9316, 9575, 7850, 8210, 6205, -2044, -18357, -31647, -24068, -9669, -805, -10579, 420, 3531]
5557C531k039q507J0042K0894J040r392j3583O393r15l730m263P043J6253J629
5543B4396j0836j33l732l566K109J0499j728l497j7102O240q112j3745j0342K629
5529b6920J6588J0682J757R788l110n922M166J0292k498l643r878m896k470L882
5515b182N584j1253J6611L595j5366r431o421K672k025j29P783R241n875L674
5501c522J8049P785m029j3615r494L1j6332p360j0080M764K2460N584J338l041
5487g462j0770J2300O030n180j3146m035k472l054Q530J5116J6944J498l365q92
5473A0042N351L127N05j0104j4938j1956m208n452O769Q103R371m688j930n334
5459a5342L069q469O390K330p17M091j283K399Q634M196q628n06R543M396j0966
$$ y = [3531, 1492, -7015, 3027, 23921, 24961, 15569, 1986, 8379, 7464, 3734, -529, 6514, 22767, 24396, 13560, 13427, 9695, 6129, 8238, 18737, 17009, 13512, -3590, 2650, -5462, -19207, -29549, -26920, -10332, 350, 2107, 11895, 8785, 2863, 7029, 17321, 14823, 11180, 1302, -3594, -6064, -2182, 3402, -7851, 8760, 12355, -3011, -12442, -18863, -16191, -18216, -18345, -10562, -1321, -7196, -3522, 14527, 22312, 18283, 4668, -4826, -4795, -21127, -28487, -38567, -33803, -11343, -5759, -4421, -7462, -18232, -5932, 98, -5082, -18228, -22263, -24735, -27789, -19259, -4143, 12801, 14299, 10934, 10042, 15393, 18520, 19025, 8921, -6017, -17973, -22181, -27633, -20864, -12761, -3390, -8078, -10008, -15342, -12273, -20742, -14352, -12022, -12739, -8648, -9931, -7532, 1102, 5298, -3330, -3836, 5707, 10103, -863]
5444h63q079O487L84o960M994R206o04P005J1688j6449j9035K141N034J1694n701
5429I42k1705j0331l563J2775P198K0775J3153j913l383j2265j4697L708R476
5416A70p239m037L810O523J0215R908j1450o353J193K402J5201J544j6180j0992
5402e285P259N406J092j0089M785M811R574j050j6242M39p67L760N428m114J287
5387F294O118j025q87P082r948j1778Q296J2398J319N259M675r774j2082o961
5373a014o584r263K492Q179R789l915j3605j2709R322J4462q764r385N285O505
5359i205k572p187q825P175K911P343M232P297L977m13P149J647r458q074m831
5344h834o704O666N462p999l591j939j283p37P997N279j362N524P01m975R344
$$ y = [-863, -8942, -2455, -2071, -9031, -4037, 5169, 4565, 11570, 23258, 6809, -12226, -10085, -5051, 6643, 942, -20763, -31094, -34657, -21882, -14684, 6091, 19244, 17331, 13948, 1683, -13014, -9306, 170, -7069, -11106, -7296, -773, 9442, 19350, 7900, 1547, 2740, 5142, 20343, 21887, 5707, -5285, 1974, 7380, 8472, -1617, 3168, 7979, 17553, 16503, 261, 700, -67, 3693, 9121, 5007, 6294, 12412, 11387, 10500, 17582, 7634, -4144, 4152, 16550, 17869, 23128, 27803, 18029, 5947, -1014, -7598, -16861, -14369, -6190, 3599, -316, -13921, -26630, -17308, -2846, -11610, -20995, -15710, -9205, -11777, -18964, -27789, -20614, -17703, -10360, -6128, 1169, 5146, 4733, 11882, 13529, 4071, -4003, -8834, -15538, -8872, -3410, -11409, -15000, -16939, -18222, -18959, -10962, -5683, -7045, -1521, -820, -5795, 3549]
5329C549K785l447N374R013l131j895P023q05j7835j2887j943Q241m130q640q107
5314b6835Q036J9025J1140m392j18j0205k254O942K1781l459q086o217J280k015
5300D623j3710J0609j060j2796m110J5422k43j1647O407J8548J1339J148j4253
5287A0277l608o892M911j0482o582L148O93k751N952J460p522M850K716j1781
5273a5611L523J1175J534l222L530j6673K755J1448j077j9385J3210J0041j5652
5260a4404p425k956K519k959L422n83l995Q617J2156J5257k093p86k448l687n974
5245e339j68O963l89k782r50M353J5771j684j8068O171J0433K769J0391q038r717
5230I716J641J100J526j283p308j1113m212J231M434M592j0620l985Q904J0770
$$ y = [3549, 6334, 2887, 8261, 17274, 14143, 12248, 19271, 18466, 631, -12256, -14199, -5958, -10088, -18728, -26835, -18799, 226, 11366, 6974, 6856, -3349, -5603, 1339, 23120, 19661, 11575, 5358, 6638, 4623, -9087, 1522, 462, -12334, -16444, -1022, -1265, -12912, -6505, 12043, 23382, 24530, 10277, 6669, -223, 4688, -5794, -12376, -9228, -8535, -11286, -5334, -3874, -11396, -6546, -3830, -15611, -12088, -913, 621, -2601, 929, -15744, -12989, -1541, -2618, -22003, -8793, 1248, -14404, -21829, -24785, -22266, -25225, -21803, -22386, -26381, -17764, -5608, 9649, 7556, 6770, 4322, 635, -5339, -5507, 1456, 1067, -1715, -2665, 1688, 17459, 15775, -2293, 3878, 14311, 17080, 27471, 19433, 9716, 11357, 12457, 13983, 12700, 5392, -5721, -9933, -8702, -4268, 324, -10296, -14281, -5377, 5393]
5216E393K0012k163j4148j0029p294J5386L000o080j049P368L670l082j3613p979
5202a0608K002O97k106n840n361J2779J5859O981j2930P225P863K368p316L758
5188A5371l776K655q908j397j7p291Q942J4054l071j8407K224p176n502q852L469
5173a7682K168J359J6268k879j2567J941L056m772m240j084K326O656l493Q88
5159a2055R68P210K375n987P604P284o07k634n9L439P759n464j5109K513l962
5144f725J3370J299N083m091j1366P759n854j4376r682L538L482P59J6784M26
5130D06j0208p313j3418k667K401J6374N018L40r257p084R971J8058M369k111
5116D879J485j5303p174O945N909p431n732Q651J1598o663j761J449k33L257M30
$$ y = [5393, 25405, 23242, 9094, -935, -8229, 7157, 10157, 4077, 3028, 10396, 14066, 10984, -2629, -10608, -8606, -7909, -10015, -15855, -21216, -8437, 7422, 14403, 1473, 8698, 16561, 18929, 11613, 15371, 11595, 14250, 5342, 3945, 3928, -3363, 5579, 19633, 16562, -1845, 379, -6797, -12299, -21151, -17682, -15514, -14155, 2113, -766, -13333, -11392, -8336, -13108, -17348, -18432, -16106, -9450, -12943, -12055, -11087, -3877, -1502, -7489, 115, 7399, 6792, 4158, 4099, 7538, 15297, 9833, -5276, -2763, -6725, 6645, 7944, 13027, 8936, -2430, 5329, -525, -14901, -24583, -21045, -17563, -16804, -20, 406, -9802, -17115, -30533, -33200, -30799, -14425, -9407, -9067, -18324, -25408, -15437, 2621, 6990, 4879, 6364, -8939, -16113, -9168, -3259, -10690, -16422, -7771, 3827, -2836, -4597, -3148, -3381, -124, 306]
5101C06q32P56j268J225o186j589n837P907M832R354J843q713j617J852M730N177
5085A1940j374M21j330Q62K59q836m937J805K040j4792k403J754j371N452o85
5070a1195p079M8K0024j609M269O124O22K290P504q943j0009n776j3034n0P018
5055i796m59k862J2511J5543O410j703m960m902K659M786j1035m069j3044p706
5041a8627K311P854J7435N605k0544j2744J3624J1148n260M583J589p629k422
5028c077m16k535Q635J938q686M365J845j893k256M441P969j3952l838J774J0170
5013D484P664j4304j9959j1323q58K1433O963j4201P221J0331O369j0689k220
5000i089J5976j6105j1408J1501J2471m734j225K4j0310J5234J6495j0913j2682
$$ y = [306, -526, 230, -1038, 187, -5999, -7588, -13425, -5518, -686, 8668, 10511, 1798, 181, 2033, 6763, 11940, 10566, 10987, 9657, 10519, 10778, 1942, -2995, -1190, 850, -13942, -16345, -14591, -15962, -10510, -11195, -18274, -18226, 1798, 189, 4458, 10582, 11204, 13494, 20998, 12055, 2046, -3730, -16764, -16814, -9796, -10255, -13117, -606, 14937, 21347, 19644, 14684, 9782, 12441, 17227, 6192, 2123, -10921, -18627, -16316, -8462, 8973, 14578, -5966, -18710, -5086, 6062, 802, 5385, 6974, -655, -3077, -3493, -6028, 2607, 4545, -4141, 224, 2069, 176, -2080, 2361, 10330, -3622, -7460, -5686, 4484, 12148, -2156, -22115, -33438, -34296, -12863, -5900, -20101, -12880, -2549, 3820, -6869, -9089, 6887, -9218, -20626, -9125, 3346, -1388, -2613, -2589, -12899, 2335, 18830, 7917, -4765]
4987d765p482n549j581J2756N22J578J4389M179o700J12j4598k0111N222J8181
4973c847n027r546P800J1924o622q197M894Q911o640J719Q276J3002Q795j1485
4959A3957k0425m642j0743p203j1341K2271L559p800J853L813j1011o42N526N06
4945b2322J1364J5138k348r213k462Q786J2341l62P336k519q344k1737o471K05
4931b0608K104J0216j020J3447n711J652R209j950J343J0598P302J231j795j2675
4917A3343l20l287o626M496o253l874L814K002l072L82L118R116j752L306l785
4902A0608n136J3373J575q612k837l478j5956q16M343Q549P267Q106P627j0349
4888A4264P866J3057q685k1830j384R139r6q15J936p293j1776o157J0381Q411
$$ y = [-4765, -12247, -17796, -19377, -6621, -6099, -4521, 9868, 14047, 7347, 7459, -7139, -27250, -22028, -3847, -8874, -18420, -10620, 1304, -5318, -13515, -8621, 290, -6350, -4631, 3645, 16647, 25442, 13957, -6468, -11110, -21853, -29056, -40397, -18126, -14567, -22367, -20514, -16701, -27712, -28354, -22828, -22322, -10958, 4180, 1832, -7381, -9843, -1057, 11284, 10922, 18258, 15739, 7395, -14342, -20813, -20608, -18504, -8288, -9308, 4139, -1572, 80, 9289, 7339, 8682, 19280, 26582, 27813, 26018, 13343, 13023, 9736, 3110, 7606, 1353, -2521, 1293, 3295, 223, 605, 3723, 12839, 11087, 14393, 10608, 5472, 18845, 20420, 11808, 8971, 5493, -10463, -11279, -6936, 1613, 8880, 16986, 24613, 14264, 22130, 35187, 26502, 4672, 3288, 12427, 12331, 11516, 13452, 6159, -5617, -11774, -1393, 7018]
4874G018o093j1413J1377j873m185K221M822Q301R689m575j8085o367n48L199
4860f512k558N948Q930j4246j8524N300J9011J0614n976Q440J2858M925j2339
4847A5871j2728K067J4416N059j0939k4509n127O623K642j1565J6459P268j41
4834E396J4285l446j1707j0640J0247k594r221J1839J7906j2690o793K123K825
4821G530m894J669Q61L106j1653m252j955p133p946R853K3826j2991j097J025
4807d051N723j060Q493L190M252m35q960p309j5862l528j422l812J1121J2977
4793f83m78j5568K6L520P834j622o024K14N34j905p37j502P320M72j7150n770
4777c1519O996M755o159M144J858J1760O207p039Q277O944r990M12O572M521r448
$$ y = [7018, 925, -10488, 889, -984, -5169, -2948, 1874, 10175, 19864, 15289, -2796, -9163, -9711, -6512, -9070, -3122, 5808, -8438, -26962, -21662, -2651, 7963, 1987, 10427, 23285, 28210, 15871, 3143, 5210, 19626, 24685, 13746, -10763, -15890, -9267, -6625, -18190, -1731, 5537, 5396, 19681, 16235, 4528, -6112, 4135, 1541, -7680, 4159, 22065, 9375, 2582, 4705, 7530, 2636, 4305, 5166, 8272, -3381, -7633, -9588, -16721, -24667, -14814, 9012, -3979, -5076, -4051, 1672, 612, 9105, 12295, 16547, 16112, 7152, -157, -16019, -19547, -20969, -24781, -13660, -683, -1161, -16729, -16703, -13183, -5349, -6971, -12995, -12781, -12247, -14152, -14889, -16391, -9071, -8599, -25749, -31519, -24523, -19768, -25927, -21783, -19925, -8165, -1958, -8997, -720, 6224, -3766, -3354, 3218, 7739, -1709]
4762a709k356J4008Q28j919k747j2301R071p092j675J0612J060l546j0732O355
4748b143m283q089l118K108L525R813J0042m175O475P451j31o65j6020o490j559
4733g259q078N486q114O168L929l747J0977j828J190J9373J0850Q50j8685j1905
4719g93l942L967j553j4685j9306j66J6033J0297n571O342O137q426j3618O007
4705a9277J6746k368O299P287j2694J376n57m439L939j841n880M792j3597k765
4691b2979J3510J8648N538n101q742r798n864K229Q166k2121P96O963K631n139
4677b1263m18n299p013O889j0803Q331Q778J0543J1083j66M225L266J105K429
4663A1687J68N210j693l681J86n442M079k4097o168M879l737O596J3768R929j924
$$ y = [-1709, -4065, 9943, 10771, 8852, 6105, -6196, 2875, -4217, -5892, 4720, 5780, 2234, -8498, -2143, -6426, -14515, -17633, -15525, -12000, -2187, 7855, 3680, 10155, 17606, 17475, 16810, 790, -5700, -7259, -15337, -9851, -17965, -11797, -7868, -11615, -638, -2466, -1276, 18097, 28947, 29797, 11112, -793, -4735, -768, -2321, -17006, -36312, -36478, -20445, -10148, -15719, -9377, -3240, -11666, -25284, -19277, -2531, -4899, 1400, 8687, -4007, -2631, -3188, -7627, -3688, -5529, -11409, -6617, -20214, -22979, -9469, 9179, 14717, 9616, 874, -8924, -14788, -12559, -4393, -26514, -25718, -18755, -16124, -21263, -21681, -26980, -33993, -27104, -37907, -29576, -20798, -10255, 828, 662, 4887, 8153, 9258, 11687, 11855, 17065, 15372, 11691, 11877, 6435, 10514, -13583, -19751, -14872, -18609, -12013, 1755, 11684, 9760]
4648I760m948p997J746J1656m265n233P799q324K566N96M584N360J67j979j928
4633I560j0299j0885M397L552N953j1052l926K683J3318o257L469j348j2390J9171
4619E946J8356q423k64j54N65l386k985N908l924n597o509l700L083J0075M596
4604A3587p804n378p65M585j1658K298R789L003q018m317R732J1784R2l069k163
4589A1698j1709j810N233l222K673O550n700N199P54j3899J246k34j9784j1100
4575c4105Q308p223K271Q340M560M684r216j1133M500p95O814L501l853O5l25
4560b3607J2954K166k764j876K176J5524J570j2256j439R022L739N189Q378k5032
4546f256o433O8N890p818q469J1518J5061L793m357j109r491k118J3297R039L803
$$ y = [9760, 4812, -3185, -1439, 10217, 5952, 719, 8518, 194, 2760, 3356, 7940, 13300, 13467, 11488, 9560, -739, -11624, -7227, -3675, 2278, -8774, -12700, -10017, 3301, -2956, 513, -835, -13225, 5946, 24302, 15879, 15615, 15461, 16026, 12640, 9655, 15563, 11639, 6042, -467, -4167, -1084, 8991, 13587, 5783, 405, -360, 4225, -7433, -5135, 4654, 7657, -361, -4678, 5054, 16838, 16930, 13861, 11698, -11, -1821, 3412, 190, 2863, 9413, 3713, 8912, 9666, -4233, -2987, -3221, -23005, -34105, -25797, -33020, -30749, -22409, -17849, -13165, -22381, -33514, -29014, -29809, -22995, -19494, -23347, -23282, -23607, -10653, -8487, -11251, -13127, -10951, 4573, 6143, -6113, -7552, 1470, 5209, 10398, 18776, -6256, -12689, -12621, -6731, -14549, -23018, -11500, 3561, 7354, 2997, 1888, -7603, -9721, 3576, 12615, 16418]
4531A6418j3577m794m727Q857k56j283l151N32K892o072K876M541m551M533r317
4516g079N486J8678K433j4727n569k33Q603Q14K048M224J510p277j3636k841J7350
4501I784N968o052l380J222O877k541p616k812K550q568k239k785m644O434J257
4486f545O004j599R694J2849K040q811j482l935K564m699l591n42j984K721M645
4471G329L345j122k710q807J0796O763p893k0832j0732K882J5395L227L252K394
4457C287j0832l297m383o998M885P846J9045J0125M092l918j9294l043J223J0470
4443I208p825L121n91N070o577j4583k949Q441P542K635l926j1121n203L806n76
4428a3528p197Q854M706M76J3733m227j9061K497L335n35m86J1943N739n472R88
$$ y = [16418, 2841, -1953, -6680, 2177, 1921, 638, -2513, -1981, 911, -5161, -2285, 2256, -2295, 2238, -7079, -1593, 17085, 19518, 4791, -778, -1011, 7592, 8406, 10454, 14678, 16188, 8911, -4725, -7566, 9784, 15752, 9700, 6320, 7542, 14419, 11878, 4262, 1450, 4000, -4568, -6807, -9592, -14236, -7802, -6545, -541, -2140, 7554, 20403, 22443, 13632, 12150, 8215, 10779, 6080, 2489, 1947, -37, 2684, 7329, 10674, 9552, 6842, -1965, 8831, 15594, 7701, -13131, -23863, -20981, -5586, -2359, 893, 3287, -7545, -10842, -15225, -22223, -17338, -9492, 9553, 19678, 23770, 19852, 558, -2485, -1262, 9208, 1383, 4504, 3913, 8983, 2406, -12177, -15126, -6685, 857, 3492, -434, -11555, -16758, -12952, -13528, -20725, -11871, -7165, -6689, 7044, 2817, -16244, -13747, -10412, -10947, -11433, 510, 6249, 777, 1765]
4413A765l862M253J9117J0546m979j3579j661j2986j055J589M422n137j3332q307
4399b3206n22K646J0213J1423Q926q198p642P406K190O000m79M289J3863O534
4385C3443k0120l754o443L271J408k918n677J420Q255n160L841m61m926K290r203
4370d734O156J147q251N493L684m476m326m152m408n789o142K546N258J106L1
4355a6857k000J277J6184O564m35L096j790P43p263n918o078J064M167j5145l636
4340b6027J4167R868L662q576q306l412K2193N343m081R484q686k4139L07J1417
4326f786Q385L365J1179k920j569K619o284n045r364j0825Q935J1693J0381o119
4312G645j5793j3683R007J1886P816j043j880j9546M562Q334J2863L808m051j0043
$$ y = [1765, -2097, 2156, 21273, 31819, 26840, 13261, 11600, -1386, -2441, -852, 3570, -1567, -14899, -23206, -23728, -21082, -10869, 554, 9480, 1282, -6360, 1046, 3236, 9236, 8757, 13046, 26909, 33443, 13323, 9569, 3126, 6397, 7805, 4887, -790, 630, 8885, 3725, 7566, 7105, 2179, 4469, -4734, 1422, 2569, -5682, -189, 3495, -981, -5307, -9459, -13867, -19656, -25798, -23252, -17994, -16888, -16857, -18857, -17580, -1396, 5168, 4733, 7829, 6039, 6782, -481, -6399, -12477, -11413, -7246, -22391, -26027, -11860, -1992, 1670, -6906, -15212, -18624, 3569, 8912, 4831, 14315, 5629, -18510, -18203, -6786, 1599, 4964, 16143, 13223, 11654, 14273, 7989, 2944, -6420, -17245, -8310, 3383, 13764, 7645, -8148, -21831, -12824, -938, 6878, 5835, 3955, -15591, -11029, -2695, 10168, 13976, 9925, -118]
4298a18j1121N358K039q333n094q50J0886M552L901j2193p180l336R905R253J1211
4283H880o982l901J077j202J4512l5j943O200L577k055O4k0473k0017k114l765
4268b8177O507P770J3860M970j5936k821N169J1899j587J624R083l234j0166o896
4254g935l38K284l43j2292k36m90K318k433Q599J4179r72M888R055p814p603q808
4238g941m878m995k10J9894O240n396j234J3899J2370R97n990m224m312k805n092
4223F323l590p978K797O892l047l936J59N180N76q802M338J6723n501q162j0761
4208h789l703O219J4769N339q497P691j004j0500j1417N437k138j258K659P457
4194B265k834n898l113r936j8648J531J6926Q312N611J433m297k055m801L619
$$ y = [-118, -11239, -5881, -3842, -12175, -17269, -18119, -7233, -2681, 1220, -10973, -18153, -21489, -11584, -2331, 8880, 1898, -2003, -926, -2128, 12384, 12349, 10406, 16606, 20183, 18128, 18192, -2281, -22298, -24412, -28177, -21670, -13900, -40, 4930, -11006, -13827, -8658, 3241, 1654, 3278, 12361, 9127, -1039, -7935, -8273, -5989, -6332, -18624, -18860, -19350, -17032, -19465, -10866, 3313, 2341, 7229, 16284, 8470, 867, -7941, -12819, -17814, -18024, 1870, 8110, 2714, 1480, 15379, 27749, 28746, 22756, 18532, 14220, 11415, 6323, 2733, -5245, -2448, 4444, 1397, -2539, -2380, 2800, 3376, -5426, -1088, 15635, 10134, 1972, -8789, -12492, -6273, 8496, 13835, 5338, 13029, 12025, 1525, -9892, -4455, -6593, -7851, -5192, 2265, -569, -6467, -9580, -19516, -38164, -36633, -19707, -11395, -5784, -4351, -8648, -10703, -15504, -11885]
4180a1885M840l308J5951R025j2209j541Q714q359j0886k164r49J106Q136m703
4166h232K807n583j0392r964N484p953J4455P038M218n619K488J3474M547q077
4152a309m583K7106J4081j2370j1550q871M815N18j159J432M775O315l640k4888
4138i328l785J0480K686p915M63k81j0140N98N034J1003K646P699N270n568m394
4123D468m26P210J281o485J495N604j4354r60O451l909j1451l597Q444J536n103
4108i796n137L062r118l713J7004J1585l080R887P593n802m941p143q564Q53L042
4093d268j0690R369m97J9376J328j3161j7034j200K490r308Q079O373J1347L727
4079E931r211J3607M6j3089Q337n385m201J367K750O079n681j569K070J4253j94
$$ y = [-11885, -7045, -10353, 5598, 14623, 2414, 873, 9587, 1228, -9658, -11822, -12771, -11665, -3529, -8232, -5425, -11008, -21400, -31364, -25880, -33833, -19378, -12340, -8122, -13741, -11253, 2221, 6768, -1309, -5892, 21214, 35295, 22925, 11375, 2504, 7319, 7837, 6678, 8110, 12885, 19200, 15560, -9328, -13113, -2633, 53, -7862, -7399, -7680, -17820, -17222, -12188, -1185, 1461, 9160, 14430, 8862, 4468, 4042, 11252, 12533, 6048, 7543, 13147, -1207, -2167, 4284, 375, -11076, -14673, -6229, -4693, -9796, -14933, -11871, -20989, -24702, -7698, 3887, 807, 10694, 18287, 12485, 7544, 401, -8163, -7310, -4268, -14958, -5589, -6086, 13290, 14618, 1457, -15577, -16777, -14287, -23595, -15516, -9143, 2204, 5931, -3280, 10327, 10373, -2716, 5621, 236, -3965, -2598, 152, 6231, 550, -1019, 1051, 15304, 15110]
4064A5110k484j3899j5422P841Q261j1821j128K720n969J0508Q421Q47k104p081
4050f200k160J1456O082j35L549q467Q63M472j4427j0783J0604J4017j6274k762
4036a0165Q423L317N421P826j6587j1117M009P617P132M371k633j0224r914k774
4022a5298N758m452K072k404q647J0902j1330P536K6140J5142m962o593p126j701
4008E037O717l010J516o482O355Q478J0336Q17l129l528j9529m597q025N197N785
3993A938K500l937j4520k0766J3884J4523O154m259q683O545J4624o302l2099
3980c0398l755O669J6547q381o328j678l901l601J380P529J8065r138k040k046
3966b1076Q827P898q735o899l217O476p760P768J1521J3718J1259r015j3147L091
$$ y = [15110, 12626, -1273, -16695, -8854, -593, -12414, -13542, -10822, -16791, -6283, 2138, 2985, 881, -6200, -8360, 3096, 9178, 9043, 12592, 4125, 4988, 9460, -4967, -15750, -5146, 8871, -7403, -10165, -1742, 1575, 6996, 14822, -1765, -12882, -8873, -1256, 5876, 10247, 7614, -2610, -12524, -15298, -9540, -13992, -11920, -14324, -22971, -12069, -23399, -15863, 10277, 25419, 20457, 13864, 6738, 5037, 11754, 8744, 10260, 3778, 10133, 18611, 28947, 29764, 26635, 23107, 3578, -1019, -9044, -3847, 1938, 4438, 501, -14019, -34785, -20901, -6378, -224, -4483, -13166, -6621, 8003, 1701, -30398, -34153, -27484, -10937, -19318, -25646, -27324, -31225, -34826, -33446, -25917, -7852, -16990, -19030, -21076, -12249, -4351, -13086, -19985, -23202, -16726, -24486, -16718, -5197, 8521, 19780, 10765, -2382, 709]
3952G09l711k900J49O439J2513n62L845R026n606j9156p650O853J6489n350m708
3937F380J2333j2222k2744Q697P230o057o770l095j3659p742r023J7714o324k2300
3923e7582L946K1754P526J9293R410j0621j0242j819O018J8347j867j144l019
3910@J0033K545m215p189m605l191j141M770J4029p970p142j1635j0604K3213
3896c102N069j9649k1268R04J6449Q771J2662j159j0130q30N872L770J227K355
3882I41L839l637R501M778r521j0264k196K435j447p468l295m58N584o831R431
3867h608J5356M16j2242m297J3635J884j9247j7084J6125P133J980j546l146j7572
3853b7213k760Q850N869l578N657j346k719K498J1835O650j219j34o121N932m966
$$ y = [709, -3002, -5902, -5753, 686, 13199, 12637, 16482, 25508, 19902, 746, -6904, -51, 16438, 11088, 6380, 18713, 6491, -16253, -7556, -326, -6383, -13153, -16248, -29907, -37649, -46672, -28958, -35282, -57582, -53636, -31882, -24356, -5063, 4347, -6274, -16516, -18335, -12317, 6030, 4163, 3019, 0, 10033, 12578, 8363, 1174, -3431, -6622, -7763, -2993, 11036, 3066, -4076, -15711, -26315, -3102, 1967, -17682, -38950, -38046, -21597, -12826, -164, -1323, -11453, -12283, -6411, -2641, -1414, 941, 4780, 1143, 10644, 15422, 5901, -4363, -6559, -4124, -5571, -13039, -16334, -16792, -11208, -18039, -8608, 6748, 7164, -5078, -9375, 4260, 6144, -13103, -30187, -14062, -6929, -4949, -6495, -9641, -27213, -29973, -21123, -15254, -18832, -13175, -14521, -17240, -14742, -2907, 3743, 2524, 2390, -3731, 2201, -2765]
$$ [...]
##END NTUPLES=NMR SPECTRUM
##END=
