##TITLE=Analysis number 320897
Compound Code cc 53305
Book Reference 469/190/2/2
Project Code adrs
Chemist Name davec
##JCAMPDX= 6.0         $$ Bruker NMR JCAMP-DX V2.0
##DATA TYPE= NMR SPECTRUM
##DATA CLASS= NTUPLES
##ORIGIN= Bruker BioSpin GmbH
##OWNER= nmr
$$ XWIN-NMR		Version 3.5
$$ Mon Jul 17 12:18:21 2006 GMT Daylight Time (UT+1h)  MAYBRIDGE\nmr@NMR_250MHZ
##.OBSERVE FREQUENCY= 250.131544655141
##.OBSERVE NUCLEUS= ^1H
##.ACQUISITION MODE= SIMULTANEOUS (DQD)
##.ACQUISITION SCHEME= undefined
##.AVERAGES= 16
##.DIGITISER RES= 18
##SPECTROMETER/DATA SYSTEM= dpx250
##.PULSE SEQUENCE= zg30
##.SOLVENT NAME= DMSO
##.SHIFT REFERENCE= (INTERNAL, DMSO, 0, 16.522)
##AUDIT TRAIL= $$ (NUMBER, WHEN, WHO, WHERE, WHAT)
$$ ##TITLE= Audit trail, XWIN-NMR		Version 3.5
$$ ##JCAMPDX= 5.01
$$ ##ORIGIN= Bruker BioSpin GmbH
$$ ##OWNER= nmr
$$ C:\u/data/dgb/nmr/ADRS/2850/pdata/1/auditp.txt
$$ ##AUDIT TRAIL=  $$ (NUMBER, WHEN, WHO, WHERE, WHAT)
(   1,<2006-07-17 12:17:55.20 +100>,<MAYBRIDGE\nmr>,<NMR_250MHZ>,
      <created by zg, POWCHK disabled, PULCHK disabled
       configuration hash MD5:
       E2 DF 36 D8 04 B2 41 60 5A D7 A3 38 5A 4B D0 FE
       data hash MD5: 64K
       B2 2A CC AD 02 C1 95 7C 5A F0 21 81 22 ED 3C B9>)
(   2,<2006-07-17 12:18:10.09 +100>,<MAYBRIDGE\nmr>,<NMR_250MHZ>,
      <Start of raw data processing
       ef LB = 0.3 FT_mod = 6 PKNL = 1 SI = 32K 
       data hash MD5: 32K
       A9 2F 21 7F 01 D5 B6 75 72 45 FB 05 B4 9D 24 52>)
(   3,<2006-07-17 12:18:11.78 +100>,<MAYBRIDGE\nmr>,<NMR_250MHZ>,
      <apk 
       data hash MD5: 32K
       85 EF A5 01 60 EA A5 BA 27 4A 1A 03 80 56 F7 00>)
(   4,<2006-07-17 12:18:12.65 +100>,<MAYBRIDGE\nmr>,<NMR_250MHZ>,
      <abs ABSG = 5 
       data hash MD5: 32K
       B3 7C 23 72 5E 5E E0 37 16 33 64 C8 C6 F9 3D CC>)
$$ ##END=
$$ 
$$ hash MD5
$$ 7E 41 4C C7 F2 2E CF D9 E1 1B E8 2E BF FA 67 5B
##$RELAX= 
##$RELAX= 
##$RELAX= 
##$RELAX= 
##$RELAX= 
##$RELAX= 
##$RELAX= 
$$ Bruker specific parameters
$$ --------------------------
##$DU= <C:\u>
##$EXPNO= 2850
##$NAME= <ADRS>
##$PROCNO= 1
##$TYPE= <nmr>
##$USER= <dgb>
##$AMP= (0..31)
100 100 100 100 100 100 100 100 100 100 100 100 100 100 100 100 100 100 
100 100 100 100 100 100 100 100 100 100 100 100 100 100 
##$AQSEQ= 0
##$AQ_mod= 3
##$AUNM= <au_zg>
##$AUTOPOS= <25 >
##$BF1= 250.13
##$BF2= 250.13
##$BF3= 250.13
##$BF4= 250.13
##$BF5= 500.13
##$BF6= 500.13
##$BF7= 500.13
##$BF8= 500.13
##$BYTORDA= 1
##$CFDGTYP= 0
##$CFRGTYP= 5
##$CHEMSTR= <none>
##$CNST= (0..31)
1 1 145 1 1 1 1 1 1 1 1 1 1 1 1 1 1 1 1 1 1 1 1 1 1 1 1 1 1 1 1 1 
##$CPDPRG= <>
##$CPDPRG1= <>
##$CPDPRG2= <>
##$CPDPRG3= <>
##$CPDPRG4= <mlev>
##$CPDPRG5= <mlev>
##$CPDPRG6= <mlev>
##$CPDPRG7= <mlev>
##$CPDPRG8= <mlev>
##$CPDPRGB= <>
##$CPDPRGT= <>
##$D= (0..31)
0 1 0 0 0 0 0 0 0 0.06 0 0 0 0 0 0 0.0002 0 0 0 0 0 0 0 0 0 0 0 0 0 0 
0 
##$DATE= 1153135074
##$DBL= (0..7)
120 120 120 120 120 120 120 120 
##$DBP= (0..7)
150 150 150 150 150 150 150 150 
##$DBP07= 0
##$DBPNAM0= <>
##$DBPNAM1= <>
$$ [...]
##$SUBNAM7= <"">
##$SUBNAM8= <"">
##$SUBNAM9= <"">
##$SW= 20.6930455092707
##$SWIBOX= (0..15)
0 0 3 0 0 0 0 0 0 0 0 0 0 0 0 0 
##$SW_h= 5175.983436853
##$TD= 65536
##$TD0= 1
##$TE= 296.16
##$TE2= 300
##$TE3= 300
##$TEG= 300
##$TL= (0..7)
0 120 120 120 120 120 120 120 
##$TP= (0..7)
150 150 150 150 150 150 150 150 
##$TP07= 0
##$TPNAME0= <>
##$TPNAME1= <>
##$TPNAME2= <>
##$TPNAME3= <>
##$TPNAME4= <>
##$TPNAME5= <>
##$TPNAME6= <>
##$TPNAME7= <>
##$TPOAL= (0..7)
0.5 0.5 0.5 0.5 0.5 0.5 0.5 0.5 
##$TPOFFS= (0..7)
0 0 0 0 0 0 0 0 
##$TUNHIN= 0
##$TUNHOUT= 0
##$TUNXOUT= 0
##$USERA1= <user>
##$USERA2= <user>
##$USERA3= <user>
##$USERA4= <user>
##$USERA5= <user>
##$V9= 5
##$VALIST= <valist>
##$VCLIST= <CCCCCCCCCCCCCCC>
##$VD= 0
##$VDLIST= <DDDDDDDDDDDDDDD>
##$VPLIST= <PPPPPPPPPPPPPPP>
##$VTLIST= <TTTTTTTTTTTTTTT>
##$WBST= 1024
##$WBSW= 4
##$XGAIN= (0..3)
0 0 0 0 
##$XL= 0
##$YL= 0
##$YMAX_a= 304983
##$YMIN_a= -525449
##$ZGOPTNS= <>
##$ZL1= 120
##$ZL2= 120
##$ZL3= 120
##$ZL4= 120
##$ABSF1= 16.522
##$ABSF2= -4.171173
##$ABSG= 5
##$ABSL= 3
##$ALPHA= 0
##$AQORDER= 0
##$ASSFAC= 0
##$ASSFACI= 0
##$ASSFACX= 0
##$ASSWID= 0
##$AUNMP= <proc_1d>
##$AZFE= 0.1
##$AZFW= 0.1
##$BCFW= 0
##$BC_mod= 0
##$BYTORDP= 0
##$COROFFS= 0
##$CY= 12.5
##$DATMOD= 1
##$DC= 0
##$DFILT= <>
##$DTYPP= 0
##$F1P= 14.0000005364418
##$F2P= -0.99999901652339
##$FCOR= 0.5
##$FTSIZE= 32768
##$FT_mod= 6
##$GAMMA= 0
##$GB= 0
##$INTBC= 1
##$INTSCL= 1
##$ISEN= 128
##$LB= 0.3
##$LEV0= 0
##$LPBIN= 0
##$MAXI= 10000
##$MC2= 0
##$MEAN= 0
##$ME_mod= 0
##$MI= 0
##$NCOEF= 0
##$NC_proc= -4
##$NLEV= 6
##$NOISF1= 0
##$NOISF2= 0
##$NSP= 0
##$NTH_PI= 0
##$NZP= 0
##$OFFSET= 16.522
##$PC= 1
##$PHC0= 156.9027
##$PHC1= 9.798326
##$PH_mod= 1
##$PKNL= yes
##$PPARMOD= 0
##$PSCAL= 4
##$PSIGN= 0
##$REVERSE= no
##$SF= 250.13
##$SI= 32768
##$SIGF1= 0
##$SIGF2= 0
##$SINO= 400
##$SIOLD= 32768
##$SREGLST= <1H.DMSO>
##$SSB= 0
##$STSI= 32768
##$STSR= 0
##$SW_p= 5175.98343685301
##$SYMM= 0
##$S_DEV= 0
##$TDeff= 65536
##$TDoff= 0
##$TI= <Analysis number 999999
Compound Code 99
Book Reference 9
Project Code 9>
##$TILT= no
##$TM1= 0
##$TM2= 0
##$TOPLEV= 0
##$USERP1= <user>
##$USERP2= <user>
##$USERP3= <user>
##$USERP4= <user>
##$USERP5= <user>
##$WDW= 1
##$XDIM= 32768
##$YMAX_p= 528474267
##$YMIN_p= -349128
$$ End of Bruker specific parameters
$$ ---------------------------------
##NTUPLES= NMR SPECTRUM
##VAR_NAME=  FREQUENCY,     SPECTRUM/REAL,   SPECTRUM/IMAG
##SYMBOL=    X,             R,               I
##VAR_TYPE=  INDEPENDENT,   DEPENDENT,       DEPENDENT
##VAR_FORM=  AFFN,          ASDF,            ASDF
##VAR_DIM=   32768,         32768,           32768
##UNITS=     HZ,            ARBITRARY UNITS, ARBITRARY UNITS
##FACTOR=    0.157963299565203, 1,           1
##FIRST=     4132.6476996994, 0,             0
##LAST=      -1043.33573715361, 0,           0
##MIN=       -1043.33573715361, -349128,     0
##MAX=       4132.6476996994, 528474267,     0
$$ Real data points
##PAGE= N=1
##DATA TABLE= (X++(R..R)), XYDATA
$$ [...]
$$ plain form
17394 153612 152412 94561 12702 -22956 89156 139491 40510 -11251 -46549 -50560 -63670 -40946
17382 -40946 -92182 -50574 -278 152117 186635 166608 155997 37234 31090 13561 -10962
17371 -10962 33848 125138 172799 141696 62096 4950 -12849 1098 119879 173429 167480 126726
17359 126726 60976 15810 20123 35187 108453 102218 99476 86647 40278 -37408 -92531 -44957
17347 -44957 -77628 -134159 -71110 -96003 -49342 23554 123026 101771 39738 32462 -23541 -31725
17335 -31725 24961 55297 74467 19451 63847 92970 84530 57077 34615 67982 61069 84160
17323 84160 14371 39373 61959 33091 14024 1735 -18186 -91767 -98521 -86911 -149174 -117277
17311 -117277 9025 74802 12508 -41480 -56097 -128238 -89802 5886 61283 46940 -40429
$$ packed form
17394A53612j200n7851q1859l5658J12112N0335r8981n1761l5298m011j3110K2724
17382d0946n1236M1608N0296J52395L4518k0027j0611j18763o144j7529k4523
17371a0962M4810R1290M7661l1103p9600n7146j7799J3947J18781N3550n949m0754
17359A26726o5750m5166M313J5064P3266o235k742j2829m6369p7686n5123M7574
17347d4957l2671n6531O3049k4893M6661P2896R9472k1255o2033p276n6003q184
17335c1725N6686L0336J9170n5016M4396K9123q440k7453k2462L3367o913K3091
17323H4160o9789K5002K2586k8868j9067j2289j9921p3581o754J1610o2263L1897
17311a17277J26302O5777o2294n3988j4617p2141L8436R5688N5397j4343q7369
$$ plain form
17300 -40429 -71898 -71346 -106653 -132014 -72150 -71722 -14985 12422 -900 -44923 -108854 -99273 -83282
17287 -83282 -9004 -19216 -58754 -104355 -9599 82295 145554 -11976 -22300 35347 50169
17276 50169 63826 84298 22899 2348 52855 44752 37708 70807 15000 -38771 -35657 -64144
17264 -64144 -90272 -81525 -113408 -93548 -55088 -52231 -81224 -77390 -54541 -116137 -77146 -85983
17252 -85983 -59052 -62132 -120718 -102553 -64837 -89497 -116142 -32521 -24468 -27774 -47175 47875
17240 47875 156609 148498 89967 -27364 -106055 -126907 -86312 -43822 64596 46102 433
17229 433 -11200 -56335 -41372 -20874 2508 22946 44553 27939 -91895 -202690 -216341 -145447
17217 -145447 -49634 -56995 -96475 -128727 -147086 -130755 -137417 -81495 415 9426 29534 55386
$$ packed form
17300d0429l1469N52l5307k5361N9864M28N6737K7407j3322m4023o3931R581J5991
17287h3282P4278j0212l9538m5601R4756R1894O3259j57530j0324N7647J4822
17276E0169J3657K0472o1399k0551N0507q103p044L3099n5807n3771L114k8487
17264f4144k6128Q747l1883J9860L8460K857k8993L834K2849o1596L8991q837
17252h5983K6931l080n8586J8165L7716k4660k6645Q3621Q053l306j9401R5050
17240D7875J08734q111n8531j17331p8691k0852M0595M2490J08418j8494m5669
17229D33j1633m5135J4963K0498K3382K0438K1607j6614j19834j10795j3651P0894
17217a45447R5813p361l9480l2252j8359J6331o662N5922Q1910R011K0108K5852
$$ plain form
17205 55386 45590 38370 22151 -38170 -70110 -87913 -40196 -46331 -43042 -4807 -15902 -80849
17193 -80849 -67822 67744 152681 137053 128661 93669 13044 -42328 -113133 -116675 -137672 -171370
17181 -171370 -238548 -237509 -227905 -194993 -170606 -122953 -46274 21409 16812 3255 14780 14869 -10754
17168 -10754 -7159 -33055 -62616 -56968 -51706 -33470 -17545 -59543 -99628 -96226 -99996 -130063 -73876
17155 -73876 -33052 -51386 -12775 -16931 -29834 -38106 19236 42981 -37974 -113304 -143377 -125260
17143 -125260 -98543 5719 27262 34003 -73884 -65536 -73779 -130340 -171570 -205089 -121562 -84769
17131 -84769 -94806 -116153 -80155 -9628 -27326 -66583 -76518 55320 96658 150464 176704 102537
17119 102537 45218 108318 19524 33646 70100 59869 64002 122320 113717 118869 191755 205209
$$ packed form
17205E5386r796p220j6219o0321l1940j7803M7717o135L289L8235j1095o4947
17193h0849J3027J35566Q4937j5628q392l4992q0625n5372p0805l542k0997l3698
17181a71370o7178J039R604L2912K4387M7653P6679O7683m597j3557J1525Q9k5623
17168a0754L595k5896k9561N648N262J8236J5925m1998m0085L402l770l0067N6187
17155g3876M0824j8334L8611m156j2903q272N7342K3745q0955p5330l0073J8117
17143a25260K6717J04262K1543O741j07887Q348q243n6561m1230l3519Q3527L6793
17131h4769j0037k1347L5998P0527j7698l9257r935J31838M1338N3806K6240p4167
17119A02537n7319O3100q8794J4122L6454j0231M133N8318q603N152P2886J3454
$$ plain form
17107 205209 197934 272851 218964 167725 102894 80180 52812 987 -14288 -2703 33778 110395
17095 110395 133989 108700 30821 -3574 35256 47360 12337 -48679 -54806 -1741 62819 206520
17083 206520 190101 79254 -61326 -104249 -118900 -144857 -79542 -9031 37289 45762 40589
17072 40589 36148 59795 71220 62824 52955 16083 35071 46901 59843 63423 151865 247102
17060 247102 270660 125062 80534 60183 106908 80756 96147 141553 171124 190276 114300
17049 114300 50386 10446 38825 11265 -32392 -40070 -87820 -59522 -11047 68826 87124 59174
17037 59174 12591 -97663 -143264 -100313 864 64127 112581 82156 -8856 10662 -61824
17026 -61824 -77216 -47878 -62439 -83575 -37151 -79670 -106096 -66326 28762 -20042 -102390 -44871
$$ packed form
17107B05209p275P4917n3887n1239o4831k2714k7368n1825j5275J1585L6481P6617
17095A10395K3594k5289p7879l4395L8830J2104l5023o1016o127N3065O4560J43701
17083B06520j6419j10847j40580m2923j4651k5957O5315P0511M6320Q473n173
17072D0589m441K3647J1425q396r869l6872J8988J1830J2942L580Q8442R5237
17060B47102K3558j45598m4528k0351M6725k6152J5391M5406K9571J9152p5976
17049A14300o3914l9940K8379k7560m3657p678m7750K8298M8475P9873J8298k7950
17037E9174m6583j10254m5601M2951J01177O3263M8454l0425r1012J9518p2486
17026f1824j5392K9338j4561k1136M6424m2519k6426L9770R5088m8804q2348N7519
$$ plain form
17014 -44871 19857 -28976 -141388 -241417 -201220 -15973 66140 8014 -46120 -119682 -116536
17003 -116536 -56336 -25729 -39603 -48567 -57096 -54168 -74107 -100215 -135647 -150885 -127080 -120576
16991 -120576 -156605 -184690 -156657 -109524 -88288 38836 90995 51759 -33947 -63989 -39644
16980 -39644 -21570 -71331 -136725 -146810 -115140 -62398 2903 -19495 -41151 -100837 -211314
16969 -211314 -194579 -93194 -35378 -65195 -124054 -87397 -27330 -7724 -12232 22635 1366
16958 1366 -42460 -31145 -61753 -76962 -121521 -62552 -15219 73527 58076 -22082 -59436 -42806
16946 -42806 -74730 -97769 -103279 -54747 -16369 -8036 -7182 17500 476 -36372 -51283 2752
16934 2752 -16417 8493 34248 -59796 -168389 -160543 -90765 -43686 -38638 -22203 -91628 -53493
$$ packed form
17014d4871O4728m8833j12412j00029M0197J85247Q2113n8126n4134p3562L146
17003a16536O0200L0607j3874q964q529K928j9939k6108l5432j5238K3805O504
16991a20576l6029k8085K8033M7133K1236J27124N2159l9236q5706l0042K4345
16980c9644J8074m9761o5394j0085L1670N2742O5301k2398k1656n9686j10477
16969b11314J6735J01385N7816k9817n8859L6657O0067J9606m508L4867k1269
16958A366m3826J1315l0608j5209m4559N8969M7333Q8746j5451q0158l7354J6630
16946d2806l1924k3039n510M8532L8378Q333Q54K4682j7024l6848j4911N4035
16934B752j9169K4910K5755r4044j08593P846O9778M7079N048J6435o9425L8135
$$ plain form
16922 -53493 -22871 -24807 -41391 -10656 111296 113143 117035 112234 135375 70947 18501 -53801
16910 -53801 -886 -64676 -98498 -104905 -130224 -156627 -86486 -91428 -87629 -130018 -167502 -132757
16898 -132757 -131845 -98464 -164294 -129862 -9657 -69854 -129062 -68979 -38985 -51128 -27836 -1400
16886 -1400 -33533 -1540 71738 44621 -72031 -133248 -130995 -164621 -279346 -332499 -302643 -258166
16874 -258166 -246340 -288191 -326145 -238390 -235936 -194677 -85619 -137781 -236404 -267664 -243480
16863 -243480 -196548 -226149 -230180 -189640 -126310 -121015 -109989 -155129 -178003 -75269 -32915 -43535
16851 -43535 -60585 -132096 -108964 -40511 -32437 -50521 -39127 -2951 -87290 -211975 -206232 -266050
16839 -266050 -283399 -205658 -43152 74437 -4055 -31041 -68301 -57665 1293 10783 3505
$$ packed form
16922e3493L0622j936j6584L0735J21952J847L892m801K3141o4428n2446p2302
16910e3801N2915o3790l3822o407k5319k6403P0141m942L799m2389l7484L4745
16898a32757R12L3381o5830L4432J20205o0197n9208O0083K9994j2143K3292K6436
16886a400l2133L1993P3278k7117j16652o1217K253l3626j14725n3153K9856M4477
16874b58166J1826m1851l7954Q7755K454M1259J09058n2162r8623l1260K4184
16863b43480M6932k9601m031M0540O3330N295J1026m5140k2874J02734M2354j0620
16851d3535j7050p1511K3132O8453Q074j8084J1394L6176q4339j24685N743n9818
16839b66050j7349P7741J62506J17589p8492k6986l7260J0636N8958R490p278
$$ plain form
16828 3505 12747 58366 113970 23692 -92189 -126303 -79712 -120192 -182609 -98409 -65041 -77405
16816 -77405 -81254 -67549 -55048 -81855 -62174 -90172 -76284 -76718 -97853 -67719 -110708 -193235
16804 -193235 -103959 -35966 -53171 -178538 -183871 -50144 -10408 -3262 -8699 -23090 -51450 -161018
16792 -161018 -128074 -39313 5756 5517 -39114 -66956 -60653 -6025 22949 59210 66771 -8236
16780 -8236 -8656 -15100 -9637 -12765 -54790 -50624 -57331 -147256 -112372 -67477 -51874 -45329 -66609
16767 -66609 -99181 -97164 -11479 -76337 -115019 -103281 -31009 -114349 -195217 -187131 -201026 -211143
16755 -211143 -167907 -186883 -180207 -150642 -100515 -57432 -28824 -30326 2770 -6113 -17818 -63303
16743 -63303 -86436 -33823 -15056 -51807 -25748 -21802 2874 -1252 48421 -28342 -67332 -99120
$$ packed form
16828C505R242M5619N5604r0278j15881l4114M6591m0480o2417Q4200L3368j2364
16816g7405l849J3705J2501k6807J9681k7998J3888m34k1135L0134m2989q2527
16804a93235Q9276O7993j7205j25367n333J33727L9736P146n437j4391k8360j09568
16792a61018L2944Q8761M5069k39m4631k7842O303N4628K8974L6261P561p5007
16780h236m20o444N463l128m2025M166o707q9925L4884M4895J5603O545k1280
16767f6609l2572K017Q5685o4858l8682J1738P2272q3340q0868Q086j3895j0117
16755b11143M3236j8976O676K9565N0127M3083K8608j502L3096q883j1705m5485
16743f3303k3133N2613J8767l6751K6059L946K4676m126M9673p6763l8990l1788
$$ plain form
16731 -99120 -102092 -119440 -106269 -94114 -93266 -43560 7085 -44658 -176160 -271287 -192231 -208770
16719 -208770 -204189 -182351 -97677 -88302 -103878 -96847 -167966 -154112 -129973 -120649 -100587 -66318
16707 -66318 -12505 54528 38835 -13673 -31412 -129635 -99996 -9466 660 31401 6901 -65707
16695 -65707 -24758 -28440 -69145 -104866 -213924 -187490 -141344 -42946 60511 25626 -52201
16684 -52201 -53335 -109626 -190840 -208049 -131790 -28320 21639 -8586 -24894 -48955 -29371 -18313
16672 -18313 -23993 4334 22767 -23878 -20397 -39457 -21091 22597 -71242 -79306 -31846 39291
16660 39291 42379 -25198 -37807 -96693 -72542 -28339 5323 -19398 -55937 -54557 2341 26755
16648 26755 72215 63597 115671 109456 58082 1369 -30956 -23685 4194 -30094 -28462 -1082
$$ packed form
16731i9120k972j7348J3171J2155Q48M9706N0645n1743j31502r5127P9056j6539
16719b08770M581K1838Q4674R375j5576P031p1119J3854K4139R324K0062L4269
16707f6318N3813O7033j5693n2508j7739r8223K9639R0530J0126L0741k4500p2608
16695f5707M0949l682m0705l5721j09058K6434M6146R8398J03457l4885p7827
16684e2201j134n6291q1214j7209P6259J03470M9959l0225j6308k4061J9584J1058
16672a8313n680K8327J8433m6645L481j9060J8366M3688r3839q064M7460P1137
16660C9291L088o7577j2609n8886K4151M4203L3662k4721l6539J380N6898K4414
16648B6755M5460q618N2074o215n1374n6713l2325P271K7879l4288J632K7380
$$ plain form
16636 -1082 15477 -53153 -71738 -64025 -123550 -98382 -113891 -107158 -81663 8569 -62641 -72522
16624 -72522 -144691 -150469 -133562 -100617 -27865 -19642 -84518 -53294 -129144 -161415 -135530 -132600
16612 -132600 -138551 -71012 -18284 45368 49915 29686 16105 -27801 -101630 -139516 -104789 -49742
16600 -49742 -128313 -142960 -136003 -126206 -30869 -18064 -80307 -118544 -63032 -90315 -166778 -173701
16588 -173701 -137222 -143688 -168243 -150058 -99211 -97546 -113399 -90253 -84509 -55695 -137662 -123167
16576 -123167 -73354 17522 -8129 -87733 -107016 -84802 -131967 -165241 -69000 -31211 -50181
16565 -50181 -49022 -118920 -97956 -93374 -48642 -39815 -17150 11236 32303 -40887 -83707 -72569
16553 -72569 -111351 -128835 -124353 -131713 -89053 -97261 -132924 -145181 -82781 58062 44248 46770
$$ packed form
16636a082J6559o8630j8585P713n9525K5168j5509O733K5495R0232p1210r881
16624g2522p2169n778J6907L2945P2752Q223o4876L1224p5850l2271K5885K930
16612a32600n951O7539N2728O3652M547k0229j3581m3906p3829l7886L4727N5047
16600d9742p8571j4647O957R797R5337J2805o2243l8237N5512k7283p6463o923
16588a73701L6479o466k4555J8185N0847J665j5853K3146N744K8814q1967J4495
16576a23167M9813R0876k5651p9604j9283K2214m7165l3274R6241L7789j8970
16565e0181J159o9898K0964M582M4732Q827K2665K8386K1067p3190m2820J1138
16553g2569l8782j7484M482p360M2660q208l5663j2257O2400J40843j3814K522
$$ plain form
16541 46770 83860 47919 6762 -3633 38478 109893 26491 -92592 -97874 -111845 -152184 -132416
16529 -132416 -86326 -125147 -103234 -76876 -93422 -165389 -209086 -137026 -130805 -109295 -52671 -58859
16517 -58859 -81148 -88719 -110777 -127924 -145820 -176137 -185284 -219060 -185695 -114347 -62344 -66817
16505 -66817 -137865 -118896 -102599 -95654 -85472 -53912 -73765 -13424 -10217 -124838 -78334 5613
16493 5613 67721 32336 61842 24331 -39949 -73256 -132793 -63087 6068 -99984 -156009 -115176
16481 -115176 -50887 -128133 -195333 -195155 -194613 -182241 -108488 -48361 -7065 -4063 -86755 -142560
16469 -142560 -121770 -101660 -87594 -76199 -62211 -53641 -59745 -21116 22831 61446 25398 1209
16457 1209 -35119 -124675 -181912 -208545 -165322 -95738 -79639 -152486 -145982 -168445 -297511 -285097
$$ packed form
16541D6770L7090l5941m1157j0395M2111P1415q3402j19083n282j3971m0339J9768
16529a32416M6090l8821K1913K6358j6546p1967m3697P2060O221K1510N6624o188
16517e8859k2289p571k2058j7147j7896l0317r147l3776L3365P1348N2003m473
16505f6817p1048J8969J6297O945J0182L1560j9853O0341L207j14621M6504Q3947
16493E613O2108l5385K9506l7511o4280l3307n9537O9706O9155j06052n6025M0833
16481a15176O4289p7246o7200J78N42J2372P3753O0127M1296L002q2692n5805
16469a42560K0790K0110J4066J1395J3988Q570o104L8629M3947L8615l6048k4189
16457A209l6328q9556n7237k6633M3223O9584J6099p2847O504k2463j29066J2414
$$ plain form
16445 -285097 -220278 -230237 -151061 -110397 -67857 843 37689 92329 98670 66376 -30433 -39160
16433 -39160 -5179 21027 57462 80204 28530 -56034 -87103 -22612 -6575 -119910 -237752
16422 -237752 -279533 -217210 -112172 -133395 -138382 -77791 -26024 24654 44420 -1733 -62909
16411 -62909 -59875 -40023 -19764 -8626 -27893 -21397 32560 42320 82734 121931 65952 24043
16399 24043 45514 -31118 -64134 -94635 -106200 -150352 -154533 -69063 -64246 -29137 -33773 -49935
16387 -49935 -78130 -130992 -177641 -92783 -78585 -118507 -118217 -147478 -166767 -165894 -131628 -89965
16375 -89965 -50287 -35310 -103228 -128578 -170987 -242727 -175350 -168627 -201621 -125702 -106551 -83002
16363 -83002 -49492 -136920 -140811 -105077 -108983 -11689 -60842 -104347 -26066 -37749 -101539 -107486
$$ packed form
16445b85097O4819r959P9176M0664M2540O8700L6846N4640O341l2294r6809q727
16433c9160L3981K6206L6435K2742n1674q4564l1069O4491J6037j13335j17842
16422b37752m1781O2323J05038k1223m987O0591N1767N0678J9766m6153o1176
16411f2909L034J9852K0259J1138j9267O496N3957R760M0414L9197n5979m1909
16399B4043K1471p6632l3016l0501j1565m4152m181Q5470M817L5109m636j6162
16387d9935k8195n2862m6649Q4858J4198l9922K90k9261j9289Q73L4266M1663
16375h9965L9678J4977o7918k5350m2409p1740O7377O723l2994P5919J9151K3549
16363h3002L3510q7428l891L5734l906R7294m9153m3505P8281j1683o3790n947
$$ plain form
16351 -107486 -54012 -100817 -96477 -70866 -33881 -73871 -129951 -99430 -36327 -67116 -179630
16340 -179630 -190096 -132382 -105071 -25275 -43872 -75427 -55228 -100779 -174934 -106751 -40780
16329 -40780 -134970 -165246 -165356 -175429 -160281 -91326 -68611 -76519 11961 11661 -77536 -43805 -101715
16316 -101715 -119006 -65026 -3476 -28423 -52146 -154836 -111728 -76488 -164947 -160719 -144649
16305 -144649 -116125 -98846 -66417 -85616 -89332 -48299 -18945 10017 -69546 -133828 -108064 -69210
16293 -69210 -37599 -49892 -110903 -115271 -37899 82792 111062 -8079 -92315 -147907 -69252
16282 -69252 2316 42320 39955 10097 -61325 -19184 17941 -5512 -45803 -99835 -94572 -44151
16270 -44151 -22229 -23655 -57169 -34772 21513 34295 33460 43698 56183 137918 54118 -39061
$$ packed form
16351a07486N3474m6805M340K5611L6985l9990n6080L0521O3103l0789j12514
16340a79630j0466N7714K7311P9796j8597l1555K0199m5551p4155O8183O5971
16329d0780r4190l0276j10j0073J5148O8955K2715p908Q8480l00q9197L3731n7910
16316a01715j7291N3980O1550k4947k3723j02690M3108L5240q8459M228J6070
16305a44649K8524J7279L2429j9199l716M1033K9354K8962p9563o4282K5764L8854
16293f9210L1611j2293o1011m368P7372J20691K8270j19141q4236n5592P8655
16282f9252P1568M0004k365k9858p1422M2141L7125k3453m0291n4032N263N0421
16270d4151K1922j426l3514K2397N6285J2782q35J0238J2485Q1735q3800r3179
$$ plain form
16258 -39061 -106871 -113101 -50345 -38503 -95842 -131837 -43849 58132 46924 41094 -76427 -129136
16246 -129136 -83670 -131843 -161825 -217977 -209729 -115525 -65767 -114042 -106767 -55347 -155747 -205626
16234 -205626 -230102 -176108 -143815 -129300 -89655 -134817 -128848 -187462 -171489 -151016 -121114 -65382
16222 -65382 -59353 -7911 58111 20466 -20075 74710 86958 -5714 -35543 -22914 -79596 -49447
16210 -49447 -99416 -115329 -87397 -101749 -97954 -89390 -131099 -111436 -88948 -147793 -188342 -67516
16198 -67516 -32650 -11093 -39632 -29045 -64127 -61476 -100379 -151300 -112910 -84221 -45852 -48914
16186 -48914 -182547 -103689 -94954 -135275 -77508 -55254 -14125 36852 -19520 -45324 -16224 -47939
16174 -47939 -70477 -58465 29735 23262 19367 30776 -30489 -103359 -111247 -70527 1805 22660
$$ packed form
16258c9061o7810o230O2756J1842n7339l5995Q7988J01981j1208n830j17521n2709
16246a29136M5466m8173k9982n6152Q248R4204M9758m8275P275N1420j00400m9879
16234b05626k4476N3994L2293J4515L9645m5162N969n8614J5973K0473K9902N5732
16222f5382O029N1442O6022l7645m0541R4785J2248r2672k9829J2629n6682L0149
16210d9447m9969j5913K7932j4352L795Q564m1709J9663K2488n8845m0549J20826
16198f7516L4866K1557k8539J0587l5082K651l8903n0921L8390K8689L8369l062
16186d8914j33633P8858Q735m0321N7767K2254M1129N0977n6372k5804K9100l1715
16174d7939k2538J2012Q8200o473l895J1409o1265p2870p888M0720P2332K0855
$$ plain form
16162 22660 -7840 24740 17533 -71658 -84004 -41879 -96259 -115387 -110965 -161785 -195378 -250519
16150 -250519 -225230 -131235 -148368 -172330 -118962 -78061 -110192 -73244 32468 -21681 -124593
16139 -124593 -164665 -189674 -168782 -96573 -44982 -2129 66988 91127 65846 50203 58478 -68029
16127 -68029 -99128 -111538 -121004 -110837 -2372 -24594 -46342 -71581 -77649 -65800 -107568 -68454
16115 -68454 -52435 -36197 -20614 -53859 -104647 -47740 53721 52117 -41049 -46293 -8027 3309
16103 3309 -41978 -28798 -6431 21910 47565 15576 -18296 -63753 -79804 2751 33960 85650
16091 85650 101262 41939 -75269 -43424 -7261 -19374 -39633 -15467 -32402 -4691 -52241
16080 -52241 -14551 -51853 -100524 -80902 -47075 -21313 -43899 -20622 -81675 -44859 24631 27659
$$ packed form
16162B2660l0500L2580p207q9191j2346M2125n4380j9128M422n0820l3593n5141
16150b50519K5289R3995j7133k3962N3368M0901l2131L6948J05712n4149j02912
16139a24593m0072k5009K0892P2209N1591M2853O9117K4139k5281j5643Q275j26507
16127f8029l1099j2410r466J0167J08465k2222k1748k5239o068J1849m1768L9114
16115f8454J6019J6238J5583l3245n0788N6907J01461j604r3166n244L8266J1336
16103C309m5287J3180K2367K8341K5655l1989l3872m5457j6051Q2555L1209N1690
16091H5650J5612n9323j17208L1845L6163j2113k0259K4166j6935K7711m7550
16080e2241L7690l7302m8671J9622L3827K5762k2586K3277o1053L6816O9490L028
$$ plain form
16068 27659 64107 57399 30971 -2673 -94982 -112218 -32801 -57367 -36730 30993 -30954 -125982
16056 -125982 -192769 -181109 -88283 -33601 -45147 -46184 -35153 59153 111359 114549 84931 8484
16044 8484 -56043 -17617 -112919 -170551 -146789 -139693 -161063 -81564 -50244 -149172 -232826 -134771
16032 -134771 -27683 7783 28647 25381 -19296 -46147 -265 655 -7363 -30746 -18681 19619
16020 19619 48150 66081 87639 158368 130979 71503 16444 -273 -66206 -89084 -67903 5184
16008 5184 13058 4247 -9277 -35270 -76892 -73563 -85906 -159219 -100103 34165 107829 44709
15996 44709 -46857 -40469 28406 73636 -21538 -104885 -60870 -106114 -107128 -30393 -27722 -21664
15984 -21664 -99606 -103527 -118714 -107919 -67521 8506 16393 3362 11105 41859 52469 5460
$$ packed form
16068B7659L6448o708k6428l3644r2309j7236P9417k4566K0637O7723o1947r5028
16056a25982o6787J1660R2826N4682j1546j037J1031R4306N2206L190k9618p6447
16044H484o4527L8426r5302n7632K3762P096k1370P9499L1320r8928q3654R8055
16032a34771J07088L5466K0864l266m4677k6851M5882R20q018k3383J2065L8300
16020A9619K8531J7931K1558P0729k7389n9476n5059j6717o5933k2878K1181P3087
16008E184P874q811j3524k5993m1622L329j2343p3313N9116J34268P3664o3120
15996D4709r1566O388O8875M5230r5174q3347M4015m5244j014P6735K671O058
15984b1664p7942l921j5187J0795M0398P6027P887j3031P743L0754J0610m7009
$$ plain form
15972 5460 -51918 -123801 -75659 13721 53406 4629 -93006 -113641 -50335 -13496 16616 11220
15960 11220 -8004 -10092 63838 65112 66399 48767 -27832 -3351 34168 52132 73867 39731
15948 39731 -11687 7435 8983 -69431 -47766 -45008 -56955 -84689 -68727 29751 32775 -4241
15936 -4241 -23056 -35600 -77937 -111193 -48434 -16770 41214 106295 99438 37103 -7665 -57004
15924 -57004 33203 120687 179308 126634 80816 9270 10113 34629 51820 76827 74881 41607
15912 41607 43913 33892 -101406 -151961 -90880 -68776 -58763 -89186 -99652 -113219 -63679 -58792
15900 -58792 -114838 -133755 -38906 64068 -24631 -106049 -55690 -47942 -74846 -61619 9560 51475
15888 51475 -7062 -12719 10190 -38612 -97244 28021 70546 16740 -18111 9319 -9068 71845
$$ packed form
15972E460n7378p1883M8142Q9380L9685m8777r7635k0635O3306L6839L0112n396
15960A1220j9224k088P3930J274J287j7632p6599K4481L7519J7964K1735l4136
15948C9731n1418J9122J548p8414K1665K758j1947k7734J5962R8478L024l7016
15936d241j8815j2544m2337l3256O2759L1664N7984O5081o857o2335m4768m9339
15924e7004R0207Q7484N8621n2674m5818p1546Q43K4516J7191K5007j946l3274
15912D1607K306j0021j35298n0555O1081K2104J0013l0423j0466j3567M9540M887
15900e8792n6046j8917R4849J02974q8699q1418N0359P748k6904J3227P1179M1915
15888E1475n8537n657K2909m8802n8632J25265M2525n3806l4851K7430j8387Q0913
$$ plain form
15876 71845 62197 8859 -68767 -135255 -132502 -37022 -65928 -109254 -127884 -141293 -120763 -114111
15864 -114111 -100820 -117469 -90912 -119714 -107566 -19904 22178 63528 83361 -7783 -33074
15853 -33074 -7778 39263 10515 -28400 -94240 -127119 -80170 22773 71005 25442 10816
15842 10816 -3734 41622 29475 13875 -22953 -11184 65886 166013 158453 75575 42080 74990
15830 74990 78825 58603 120331 123501 18184 16651 -23118 41813 72794 26326 41370 4784
15818 4784 -52392 28384 26344 -74998 -52597 -107985 -109155 -119890 -108197 -91714 -9175 106681
15806 106681 107381 36488 6349 -3152 -68586 -10010 41005 59563 91084 138964 77231 -80622
15794 -80622 -107040 -10209 75710 42351 57794 55584 36736 4712 18586 65037 28125 59182
$$ packed form
15876G1845r648n3338p7626o6488K753R5480k8906m3326j8630j3409K0530O652
15864a14111J3291j6649K6557k8802J2148Q7662M2082M1350J9833r1144k5291
15853c3074K5296M7041k8748l8915o5840l2879M6949J02943M8232m5563j4626
15842A0816j4550M5356j2147j5600l6828J1769P7070J00127p560q2878l3495L2910
15830G4990L835k0222O1728L170j05317j533l9769O4931L0981m6468J5044l6586
15818D784n7176Q0776k040j01342K2401n5388j170j0735J1693J6483Q2539J15856
15806A06681P00p0893l0139r501o5434N8576N1015J8558L1521M7880o1733j57853
15794h0622k6418R6831Q5919l3359J5443k210j8848l2024J3874M6451l6912L1057
$$ plain form
15782 59182 -11685 20661 18027 33631 51907 1441 18032 92048 128350 96606 63122 21492
15770 21492 95990 105964 80577 -8164 -13869 -12779 7061 133067 145328 129320 182046 266995
15758 266995 188683 167177 395108 668183 1019719 1293149 1418499 1554115 1688230 1828486
15748 1828486 1940536 2020102 2046637 1582834 947358 595695 481217 374174 367714 418566
15738 418566 335664 199455 131152 220013 248030 243366 139450 21733 12869 53910 66884
15727 66884 18284 34079 59483 166185 194244 248427 182745 183803 125413 -19373 -98375
15716 -98375 -158028 -103634 -52315 -12757 43908 32354 32974 109879 86030 99705 -3506 -71361
15704 -71361 -67666 -74243 -84362 -83666 -44073 4317 29893 25830 43001 20286 5988 46504 36273
$$ packed form
15782E9182p0867L2346k634J5604J8276n0466J6591P4016L6302l1744l3484m1630
15770B1492P4498R974k5387q8741n705J090J9840J26006J2261j6008N2726Q4949
15758B66995p8312k1506K27931K73075L51536K73430J25350J35616J34115J40256
15748A828486J12050P9566K6535m63803o35476l51663j14478j07043o460N0852
15738D18566q2902j36209o8303Q8861K8017m664j03916j17717q864M1041J2974
15727F6884m8600J5795K5404J06702K8059N4183o5682J058n8390j44786p9002
15716i8375n9653N4394N1319L9558N6665j1554O20P6905k3849J3675j03211o7855
15704g1361L695o577j0119O96L9593M8390K5576m063J7171k2715j4298M0516j0231
$$ plain form
15691 36273 22405 -48712 -5708 5949 3331 8182 69634 24333 23482 11688 17762 -28643 -10678
15678 -10678 73955 84405 81833 -93167 -140649 -97549 -123784 -130972 -133726 -136966 -86399 -35900
15666 -35900 -38791 -82662 -131892 -67732 -9591 -3091 -30061 6909 58304 7169 -94466 -80080
15654 -80080 -86826 -83405 20092 25303 -63365 -9932 -8511 -23042 7148 -17482 -6095 33224
15642 33224 -45018 -62715 -13180 -69926 -182617 -219798 -198885 -164151 -76867 -85059 -80208 -120287
15630 -120287 -94820 -42083 -5649 -80876 -56947 -494 -7126 -17056 -69915 -27076 -10882 8130
15618 8130 1178 -48284 -145032 -63655 -42167 -107038 -125013 -91571 -113095 -58002 -55055 -77850
15606 -77850 -122651 -90026 23229 -25153 -35720 -34569 -14598 25267 89495 140496 58193 26286
$$ packed form
15691C6273j3868p1117M3004J1657k618M851O1452m5301q51j1794O074m6405J7965
15678a0678Q4633J0450k572j75000m7482M3100k6235p188k754l240N0567N0499
15666c5900k891m3871m9230O4160N8141O500k6970L6970N1395n1135j01635J4386
15654h0080o746L421J03497N211q8668N3433J421j4531L0190k4630J1387L9319
15642C3224p8242j7697M9535n6746j12691l7181K0913L4734Q7284q192M851m0079
15630a20287K5467N2737L6434p5227K3929N6453o632r930n2859M2839J6194J9012
15618H130o952m9462r6748Q1377K1488o4871j7975L3442k1524N5093K947k2795
15606g7850m4801L2625J13255m8382j0567J151J9971L9865O4228N1001q2303l1907
$$ plain form
15594 26286 -15460 -56948 -6530 30570 88142 96270 44815 -59452 -128211 -124750 -114695 -68391
15582 -68391 -27607 14271 -3182 -25414 -38683 -177049 -217852 -207627 -122320 -87828 -15352
15571 -15352 540 -14317 -27205 -18281 -38848 -42397 -25088 -36670 -48706 -47993 -60135 -151175
15559 -151175 -212545 -225760 -204848 -181299 -109995 -124001 -136276 -121306 -180674 -272972 -230387
15548 -230387 -159706 -148915 -196205 -176076 -121753 -103658 -72847 -127979 -111026 -50403 48295
15537 48295 43135 20062 -25198 -10703 -3213 -144178 -139340 -121407 -196617 -123158 -144575 -139048
15525 -139048 -98785 -81840 -5597 3887 -42818 30437 136260 108811 75530 72839 72290 65976
15513 65976 100800 86537 8912 -44965 -30505 8473 85469 45863 -29482 16636 33482 18677
$$ packed form
15594B6286m1746m1488N0418L7100N7572Q128n1455j04267o8759L461J0055M6304
15582f8391M0784M1878j7453k2232j3269j38366m0803J0225Q5307L4492P2476
15571a5352J5892j4857j2888Q924k0567l549J7309j1582j2036P13j2142r1040
15559a51175o1370j3215K0912K3549P1304j4006j2275J4970n9368r2298M2585
15548b30387P0681J0791m7290K0129N4323J8095L0811n5132J6953O0623R8698
15537D8295n160k3073m5260J4495P490j40965M838J7933p5210P3459k1417N527
15525a39048M0263J6945P6243R484m6705P3255J05823k7449l3281k691n49o314
15513F5976L4824j4263p7625n3877J4460L8978P6996l9606p5345M6118J6846j4805
$$ plain form
15501 18677 16778 -48643 -79842 -3142 56911 8238 -291 45167 39553 27278 18523 8473
15489 8473 51320 12797 -34867 -26968 -2384 24563 58708 105646 69067 31632 42306 40632
15477 40632 -39022 -40620 -90794 -127118 -109129 -100897 -85957 43822 157741 140962 37338
15466 37338 -7998 2665 -14690 -22026 -100467 -142519 -86038 -81375 -37071 -24396 -32496 -14657
15454 -14657 -9583 56323 97467 135747 186597 96652 16604 -20588 -46377 -1695 -5588 34487
15442 34487 -34717 -53443 -9991 -33892 -126957 -221488 -187690 -119815 -113300 -99116 -87230 -23413
15430 -23413 23322 37212 11567 -39825 -75637 -92595 -40149 53440 28973 -17176 -25606 -27182
15418 -27182 3490 77415 54202 -22178 -7738 -64766 -77440 -23153 31201 -33964 7173 80587
$$ packed form
15501A8677j899o5421l1199P6700O0053m8673q529M5458n614j2275q755j0050
15489H473M2847l8523m7664P899K4584K6947L4145M6938l6579l7435J0674j674
15477D0632p9654j598n0174l6324J7989Q232J4940J29779J13919j6779j03624
15466C7338m5336J0663j7355p336p8441m2052N6481M663M4304J2675q100J7839
15454a4657N074O5906M1144L8280N0850q9945q0048l7192k5789M4682l893M0075
15442C4487o9204j8726M3452k3901r3065r4531L3798O7875O515J4184J1886O3817
15430b3413M6735J3890k5645n1392l5812j6958N2446R3589k4467m6149q430j576
15418b7182L0672P3925k3213p6380J4440n7028j2674N4287N4354o5165M1137P3414
$$ plain form
15406 80587 35699 -46554 -2768 14612 17377 -40294 -63423 23983 26891 -36105 -71103 -35576
15394 -35576 28587 -15506 31869 133736 30074 9604 -40752 -164753 -128783 -76908 -38340
15383 -38340 4079 52966 22349 -35535 -48083 4510 3027 -59053 -95456 -91075 -3110 92929
15371 92929 97972 134765 90282 -52853 -55720 42573 155260 126471 55560 84541 20086 37803
15359 37803 21692 7199 53825 80325 32675 11470 16083 -8104 -1610 -46342 -84143 42569
15347 42569 157799 67019 1868 -12529 -8078 53856 78272 92928 101355 -10876 36943 95649
15335 95649 -32717 -125216 -73621 -1030 40788 -8777 -16190 -50492 -84401 -97274 -122543 -142582
15323 -142582 -76866 -124707 -216001 -163634 -22713 33766 -34250 -58164 -51277 -143805 -79362
$$ packed form
15406H0587m4888q2253M3786J7380K765n7671k3129Q7406K908o2996l4998L5527
15394c5576O4163m4093M7375J01867j03662k0470n0356j24001L5970N1875L8568
15383c8340M2419M8887l0617n7884j2548N2593j483o2080l6403M381Q7965R6039
15371I2929N043L6793m4483j43135k867R8293J12687k8789p0911K8981o4455J7717
15359C7803j6111j4493M6626K6500m7650k1205M613k4187O494m4732l7801J26712
15347D2569J15230r0780o5151j4397M451O1934K4416J4656Q427j12231M7819N8706
15335I5649j28366r2499N1595P2591M1818m9565p413l4302l3909j2873k5269k0039
15323a42582O5716m7841r1294N2367J40921N6479o8016k3914O887r2528O4443
$$ plain form
15312 -79362 -45184 -1462 30521 46208 64216 72545 85856 53874 32187 50722 17919 -16601
15300 -16601 24364 2349 -5740 -45751 -90038 -69261 54299 105175 112212 -7296 -67127 45842
15288 45842 187145 182064 101822 67159 10639 -26525 -12983 11045 20425 34411 -17052 -44942
15276 -44942 -60756 -39073 -7468 42061 67577 -25341 -134508 -77749 -47631 -80720 -102831
15265 -102831 -80739 -73301 -94056 -64205 -58784 -3174 62007 -7230 -87601 -73760 -43387 -12912
15253 -12912 -16628 -97016 -97445 -50417 50699 142516 116035 26918 35625 67687 111744 82980
15241 82980 21675 -31833 -75498 -126937 -121411 -40164 37031 26751 16142 48847 11263 -62755
15229 -62755 -43060 12579 17776 -23701 -131624 -93220 -65414 -98890 -105050 -5956 -53026 -94582
$$ packed form
15312g9362L4178M3722L1983J5687J8008Q329J3311l1982k1687J8535l2803l4520
15300a6601M0965k2015q089m0011m4287K0777J23560N0876P037j19508n9831J12969
15288D5842J41303n081q0242l4663n6520l7164J3542K4028R380J3986n1463k7890
15276d4942j5814K1683L1605M9529K5516r2918j09167N6759L0118l3089k2111
15265a02831K2092P438k0755K9851N421N5610O5181o9237q0371J3841L0373L0475
15253a2912l716q0388m29M7028J01116R1817k6481q9117Q707L2062M4057k8764
15241H2980o1305n3508m3665n1439N526Q1247P7195j0280j0609L2705l7584p4018
15229f2755J9695N5639N197m1477j07923L8404K7806l3476o160R9094m7070m1556
$$ plain form
15217 -94582 -190025 -206077 -169648 -87455 -25670 29439 5480 10444 71912 82552 53432 39059
15205 39059 -21438 -62349 -92894 -70909 -6200 34290 23882 53795 45003 56281 89246 100139
15193 100139 132991 136809 70862 67008 99343 46658 65451 65022 -4238 137970 205725 136734
15181 136734 102132 72539 101957 146583 137818 72120 97046 103063 129362 195642 339327 419723
15169 419723 475049 479444 585907 721778 887824 1048130 1244915 1388998 1457275 1495186
15159 1495186 1445133 1347811 1214668 1010323 814505 672619 564744 515449 462960 443497
15149 443497 434782 404077 373294 321556 264122 279530 295125 269028 128692 13022 58304
15138 58304 160849 242235 158094 82090 170505 155103 117146 110792 133932 108713 113868 151757
$$ packed form
15217i4582r5443j6052L6429Q2193O1785N5109k3959M964O1468J0640k9120j4373
15205C9059o0497m0911l0545K1985O4709M0490j0408K9913q792J1278L2965J0893
15193A00139L2852L818o5947l854L2335n2685J8793m29o9260J42208O7755o8991
15181A36734l4602k9593K9418M4626q765o5698K4926O017K6299O6280J43685Q0396
15169D19723N5326M395J06463J35871J66046J60306J96785J44083O8277L7911
15159A495186n0053r7322j33143k04345j95818j41886j07875m9295n2489j9463
15149D43497q715l0705l0783n1738n7434J5408J5595k6097j40336j15670M5282
15138E8304J02545Q1386q4141p6004Q8415j5402l7957o354K3140k5219N155L7889
$$ plain form
15126 151757 149536 121516 203896 146198 106048 193606 252976 226389 158156 151425 117901 206176
15114 206176 299000 226775 146499 175844 192826 156180 171977 136522 148663 232508 305835
15103 305835 355265 456166 532230 536914 579199 605071 548191 446614 357251 349642 301735
15092 301735 159162 105550 121291 77249 131896 149369 161492 134016 83151 112867 139487
15081 139487 121369 101198 61475 94622 71705 44376 27926 28681 86763 6589 -45686 -20926
15069 -20926 -392 21807 14616 25093 21878 53765 118269 154137 177373 95355 123857 180565
15057 180565 135532 169720 154754 48830 21044 -44129 -42900 45866 28589 63017 111269
15046 111269 159044 143911 180108 192089 104912 102568 76203 118358 188195 212121 140543 117785
$$ packed form
15126A51757k221k8020Q2380n7698m0150Q7558N9370k6587o8233o731l3524Q8275
15114B06176R2824p2225q0276K9345J6982l6646J5797l5455J2141Q3845P3327
15103C05835M9430J00901P6064M684M2285K5872n6880j01577q9363p609m7907
15092C01735j42573n3612J5741m4042N4647J7473J2123k7476n0865K9716K6620
15081A39487j8118k0171l9723L3147k2917k7329j6450P55N8082q0174n2275K4760
15069b0926K0534K2199p191J0477l215L1887O4504L5868K3236q2018K8502N6708
15057A80565m5033L4188j4966j05924k7786o5173J229Q8766j7277L4428M8252
15046A11269M7775j5133L6197J1981q7177k344k6365M2155O9837K3926p1578k2758
$$ plain form
15034 117785 115543 27944 -18878 102919 68710 115878 93322 61955 125721 152555 109873
15023 109873 86559 117285 76662 36194 18829 -23786 -15233 -48649 -70168 -35381 11996 -33124
15011 -33124 -15962 87181 206210 231491 142717 45793 89652 102527 60941 41276 87501
15000 87501 63257 42281 -8668 -58049 -1342 24082 1158 4312 114217 212554 142843 116236
14988 116236 95884 94552 105032 59170 28060 65186 120927 129767 32065 57723 57614 66396
14976 66396 6213 8069 126307 135923 109989 100648 3345 -94632 -22408 -1851 -25457 -3542
14964 -3542 1639 124206 171401 37366 -7936 79061 124599 96893 169358 198892 131295 35499
14952 35499 -94102 -69834 45618 52485 13230 27958 1575 16377 158958 196368 134152
$$ packed form
15034A17785k242q7599m6822J21797l4209M7168k2556l1367O3766K6834m2682
15023A09873k3314L0726m0623m0468j7365m2615Q553l3416k1519L4787M7377m5120
15011c3124J7162J03143J19029K5281q8774r6924M3859J2875m1586j9665M6225
15000H7501k4244k0976n0949m9381N6707K5424k2924L154J09905R8337o9711k6607
14988A16236k0352j332J0480m5862l1110L7126N5741Q840r7702K5658j09Q782
14976F6396o0183J856J18238R616k5934r341r7303r7977P2224K0557k3606K1915
14964c542N181J22567M7195j34035m5302Q6997M5538k7706P2465K9534o7597r5796
14952C5499j29601K4268J15452O867l9255J4728k6383J4802J42581L7410o2216
$$ plain form
14941 134152 152540 196529 184646 190282 241530 248122 249420 133744 80767 185319 196805 192361
14929 192361 164883 218354 303717 221875 116217 95456 123502 49046 19242 50484 45363
14918 45363 90914 122281 105810 143968 163954 137880 63005 36963 61270 78184 45698 75636
14906 75636 119595 173300 199047 65405 13262 44568 64678 60668 -44150 -56730 18428
14895 18428 114652 189515 154310 120802 99833 86789 109670 96969 76693 55465 75965 35395
14883 35395 62212 99672 83563 55978 -8142 2788 38808 -24742 -54227 -11681 28516 23069
14871 23069 77300 156700 162093 195215 233673 267095 197734 144209 164221 112205 130501 240058
14859 240058 306608 243407 257107 224515 251946 284341 307673 324328 329413 378479 344106 379029
$$ packed form
14941A34152J8388M3989j1883N636N1248O592J298j15676n2977J04552J1486m444
14929A92361k7478N3471Q5363q1842j05658k0761K8046p4456k9804L1242n121
14918D5363M5551L1367j6471L8158J9986k6074p4875k6042K4307J6914l2486K9938
14906G5636M3959N3705K5747j33642n2143L1306K0110m010j04818j2580P5158
14895A8428R6224P4863l5205l3508k0969j3044K2881j2701k0276k1228K0500m0570
14883C5395K6817L7460j6109k7585o4120J0930L6020o3550k9485M2546M0197n447
14871B3069N4231P9400N393L3122L8458L3422o9361n3525K0012n2016J8296J09557
14859B40058O6550o3201J3700l2592K7431L2395K3332J6655N085M9066l4373L4923
$$ plain form
14847 379029 363650 244034 126544 125321 181557 183306 190685 171903 165823 167055 187245 287778
14835 287778 261420 277128 332702 374564 420613 433734 420293 447235 443672 457424 573296
14824 573296 716047 709740 750002 817124 877253 963279 992987 940422 829609 773359 780028
14813 780028 895250 960219 1004981 1083658 1151588 1174785 1152519 1074573 1029942 986566 1015145
14802 1015145 1038011 986095 886776 797258 734198 758484 809180 812038 851490 836452 823817
14791 823817 801606 740958 756987 866343 874755 901053 861810 890555 932421 919605 981301
14780 981301 982738 956796 1003769 997787 1003560 1094695 1099629 1131908 1244602 1315420 1245954 1276721
14768 1276721 1350197 1417594 1493189 1626156 1650603 1632564 1668390 1694183 1718355 1603951 1427136
$$ packed form
14847C79029j5379j19616j17490j223N6236J749P379j8782o080J232K0190J00533
14835B87778k6358J5708N5574M1862M6049J3121j3441K6942l563J3752J15872
14824E73296J42751o307M0262O7122O0129Q6026K9708n2565j10813n6250O669
14813G80028J15222O4969M4762P8677O7930K3197k2266p7946m4631m3376K8579
14802A015145K2866n1916r9319q9518o3060K4286N0696K858L9452j5038j2635
14791H23817k2211o0648J6029J09356Q412K6298l9243K8745M1866j2816O1696
14780I81301J437k5942M6973n982N773R1135M934L2279J12694P0818o9466L0767
14768A276721P3476O7397P5595J32967K4447j8039L5826K5793K4172j14404j76815
$$ plain form
14757 1427136 1310129 1298589 1350773 1373617 1371383 1356652 1412624 1446680 1550603 1604546 1566109
14746 1566109 1505862 1595536 1632135 1610305 1661036 1678277 1673136 1767280 1878555 1946907 1942482
14735 1942482 1971613 2074630 2231162 2340063 2434832 2526404 2614344 2867834 3070880 3206067
14725 3206067 3339152 3419325 3559369 3591232 3793022 4032394 4252343 4632824 5060597 5341767
14715 5341767 5697513 6223225 6810637 7332725 7956072 8720276 9600557 10519941 11664078
14706 11664078 13013947 14601371 16558067 18791851 21444453 24759096 28885935 34301074
14698 34301074 41383343 50863711 64169585 82803442 108574872 141574437 177383415
14691 177383415 208491373 231684546 250918097 269197634 284350322 292579850 287767982
$$ packed form
14757A427136j17007j1540N2184K2844k234j4731N5972L4056J03923N3943l8437
14746A566109o0247Q9674L6599k1830N0731J7241n141R4144J11275O8352m425
14735A942482K9131J03017J56532J08901R4769R1572Q7940K53490K03046J35187
14725C206067J33085Q0173J40044L1863K01790K39372K19949L80481M27773K81170
14715E341767L55746N25712N87412N22088O23347P64204Q80281R19384J144137
14706A1664078J349869J587424J956696K233784K652602L314643M126839N415139
14698C4301074P082269R480368J3305874J8633857K5771430L2999565L5808978
14691A77383415L1107958K3193173J9233551J8279537J5152688Q229528m811868
$$ plain form
14684 287767982 260173873 212047742 162586937 124657874 98608151 80960079 68622700
14677 68622700 59709572 53038458 47935629 43905957 40535339 37672924 35024684 32477874
14669 32477874 30200417 28238284 26521120 25040080 23699834 22510158 21364567 20367982
14661 20367982 19470660 18527380 17670387 16858041 16130819 15497410 14947215 14364161 13825527
14652 13825527 13201775 12698200 12244037 11800285 11378720 10891640 10445075 10064509 9614642
14643 9614642 9330105 9034899 8718900 8337621 7973760 7803859 7641274 7408050 7213519
14634 7213519 6978062 6730669 6503557 6272138 6050240 5772784 5588588 5414566 5318578 5140803
14624 5140803 4985654 4912696 4804219 4681600 4590444 4431759 4293824 4236901 4131339 4065139
$$ packed form
14684B87767982k7594109m8126131m9460805l7929063k6049723j7648072j2337379
14677F8622700q913128o671114n102829m029672l370618k862415k648240k546810
14669C2477874k277457j962133j717164j481040j340246j189676j145591r96585
14661B0367982q97322r43280q56993q12346p27222o33409n50195n83054n38634
14652A3825527o23752n03575m54163m43752m21565m87080m46565l80566m49867
14643I614642k84537k95206l15999l81279l63861j69901j62585k33224j94531
14634G213519k35457k47393k27112k31419k21898k77456j84196j74022r5988j77775
14624E140803j55149p2958j08477j22619r1156j58685j37935n6923j05562o6200
$$ plain form
14614 4065139 3867691 3706346 3480109 3270366 3163407 3056569 2953572 2947242 2954827 2852792
14604 2852792 2767800 2651672 2494792 2549983 2529574 2507422 2438464 2378858 2244800 2138190
14594 2138190 2068646 2071531 2042852 1929226 1832389 1689244 1587025 1525819 1449904 1489614 1492445
14583 1492445 1484707 1419480 1400144 1444077 1397719 1333396 1268286 1352603 1365284 1277192 1237630
14572 1237630 1140341 1048437 1090214 1070839 1031263 1048000 1043101 1023320 974300 936229 970181
14561 970181 1059615 1065945 1062505 1095007 1024436 987411 958199 932655 978947 985776 950362 870041
14549 870041 810985 729483 683699 690102 656160 602785 586818 644398 731441 766978 735545 711648
14537 711648 713390 670625 543029 586421 582364 493766 391122 315131 297070 382486 448759
$$ packed form
14614D065139j97448j61345k26237k09743j06959j06838j02997o330P585j02035
14604B852792q4992j16128j56880N5191k0409k2152o8958n9606j34058j06610
14594B138190o9544K885k8679j13626r6837j43145j02219o1206p5915L9710K831
14583A492445p738o5227j9336M3933m6358o4323o5110Q4317J2681q8092l9562
14572A237630r7289r1904M1777j9375l9576J6737m899j9781m9020l8071L3952
14561I70181Q9434O330l440L2502p0571l7025k9212k5544M6292O829l5414q0321
14549H70041n9056q1502m5784O403l3942n3375j5967N7580Q7043L5537l1433k3897
14537G11648J742m2765j27596M3392m057q8598j02644p5991j8061Q5416O6273
$$ plain form
14526 448759 419396 334957 296883 233303 251762 284462 322677 284881 296695 281466 263563
14515 263563 310337 382293 355763 285227 265302 286331 281988 344740 370544 291215 189165
14504 189165 149198 149207 172308 214509 278889 328548 350056 377165 418212 356822 298509 355329
14492 355329 401369 359502 337409 337250 296912 286000 284440 364201 409807 357332 267114 266365
14480 266365 332338 306418 227598 141890 121880 159141 190086 314258 278993 254933 302550
14469 302550 342277 281203 269216 296269 256161 252377 276557 222722 262085 330836 356303 316877
14457 316877 344408 273737 236585 252744 181605 115622 157908 133951 22381 -24883 -25314 22799
14445 22799 44739 83442 79359 70749 102271 198617 249635 213858 170759 170742 192539 165623 189208
$$ packed form
14526D48759k9363q4439l8074o3580J8459L2700L8215l7796J1814j5229j7903
14515B63563M6774P1956k6530p0536j9925K1029m343O2752K5804p9329j02050
14504A89165l9967RK3101M2201O4380M9659K1508K7109M1047o1390n8313N6820
14492C55329M6040m1867k2093j59m0338j0912j560P9761M5606n2475r0218p49
14480B66365O5973k5920p8820q5708k0010L7261L0945J24172l5265k4060M7617
14469C02550L9727o1074j1987K7053m0108l784K4180n3835L9363O8751K5467l9426
14457C16877K7531p0671l7152J6159p1139o5983M2286k3957j11570m7264m31M8113
14445B2799K1940L8703m083q610L1522R6346N1018l5777m3099j7K1797k6916K3585
$$ plain form
14432 189208 134600 71541 27384 53644 123144 171228 214357 315597 255438 241256 315411
14421 315411 365934 340595 215411 143655 52815 -5062 -32109 3587 47319 91669 42060
14410 42060 -84005 79696 238005 239161 212483 218634 241599 80200 -19498 -8506 119605
14399 119605 187727 149828 136780 81708 76014 113804 20273 -35453 -73334 -81285 -69178 -31097
14387 -31097 29167 60405 29053 -8472 64071 149723 131982 50945 1173 102794 154518
14376 154518 200409 179526 125569 4834 -103021 -66191 -36623 -56301 -62292 -44143 -37243
14365 -37243 -12462 3964 -58082 -30225 53076 105886 184925 130712 40984 -23235 -6304 -16075
14353 -16075 13584 45581 46007 42167 81455 43578 -41211 1336 57297 19045 31821 42249
$$ packed form
14432A89208n4608o3059m4157K6260O9500M8084M3129J01240o0159j4182P4155
14421C15411N0523k5339j25184p1756r0840n7877k7047L5696M3732M4350m9609
14410D2060j26065J63701J58309J156k6678O151K2965j61399r9698J0992J28111
14399A19605O8122l7899j3048n5072n694L7790r3531n5726l7881p951J2107L8081
14387c1097O0264L1238l1352l7525P2543Q5652j7741q1037m9772J01621N1724
14376A54518M5891k0883n3957j20735j07855L6830K9568j9678n991J8149O900
14365c7243K4781J6426o2046K7857Q3301N2810P9039n4213q9728o4219J6931r771
14353a6075K9659L1997M26l840L9288l7877q4789M2547N5961l8252J2776J0428
$$ plain form
14341 42249 50707 112334 133879 37557 -23451 -69353 -14996 13216 20445 72178 22255 -37527
14329 -37527 -27306 -38460 -101208 -80093 -90025 -106841 -20585 -6792 -64538 -57646 25513 77055
14317 77055 -14921 16798 65633 60587 16865 13818 126215 127345 -55429 -127906 -44427 32949
14305 32949 -22977 -15041 19492 67824 95055 90237 -10315 -63240 37897 87482 -22203
14294 -22203 660 7751 -70026 -72144 -107659 -119456 -75409 -41961 -44299 -204735 -194388 -105881
14282 -105881 -57329 -64855 -32921 24589 8098 39509 162566 137227 73039 83480 66765
14271 66765 6907 -16464 12763 -36982 -68759 -58283 -92680 -58136 -61190 -49259 -52891 -67704
14259 -67704 -48282 -46727 -41882 -44760 -113808 -111142 -107365 -31041 -33166 -88015 -76080 -63526 -35905
$$ packed form
14341D2249Q458O1627K1545r6322o1008m5902N4357K8212P229N1733m9923n9782
14329c7527J0221j1154o2748K1115r932j6816Q6256J3793n7746O892Q3159N1542
14317G7055r1976L1719M8835n046m3722l047J12397J130j82774p2477Q3479P7376
14305C2949n5926P936L4533M8332K7231m818j00552n2925J01137M9585j09685
14294b2203K2863P091p7777k118l5515j1797M4047L3448k338j60436J0347Q8507
14282a05881M8552p526L1934N7510j6491L1411J23057k5339o4188J0441j6715
14271F6765n9858k3371K9227m9745l1777J0476l4397L4544l054J1931l632j4813
14259f7704J9422J555M845k878o9048K666L777P6324k125n4849J1935J2554K7621
$$ plain form
14246 -35905 40435 19603 -85798 -79102 -7270 56273 95449 24022 28498 -16081 -96734 -83149
14234 -83149 10786 91533 55868 -79558 -140393 -103310 64634 36569 61631 110328 147602
14223 147602 197172 252048 260407 279038 229777 209590 292778 397155 507703 630112 751919
14212 751919 913410 1004061 1131175 1219876 1321226 1319523 1209507 1165879 1006455 837217
14202 837217 716048 541448 463572 391148 381016 359081 305675 351292 303526 236939 161692
14191 161692 114493 98050 96259 125562 160649 179044 234747 217580 182105 139852 167323 167423
14179 167423 200109 130151 134216 139888 86045 22378 58856 4670 -4408 -18142 13265 21165
14167 21165 -9690 -22610 -1863 -31765 -24490 -3757 19043 41887 -40207 54733 130660 195431
$$ packed form
14246c5905P6340k0832j05401O696P1832O3543L9176p1427M476m4579q0653J3585
14234h3149R3935Q0747l5665j35426o0835L7083J67944k8065K5062M8697L7274
14223A47602M9570N4876Q359J8631m9261k0187Q3188J04377J10548J22409J21807
14212G51919J61491R0651J27114Q8701J01350j703j10016m3628j59424j69238
14202H37217j21169j74600p7876p2424j0132k1935n3406M5617m7766o6587p5247
14191A61692m7199j6443j791K9303L5087J8395N5703j7167l5475m2253K7471J00
14179A67423L2686o9958M065N672n3843o3667L6478n4186r078j3734L1407P900
14167B1165l0855j2920K0747k9902P275K0733K2800K2844q2094R4940P5927O4771
$$ plain form
14155 195431 135457 17914 23944 47355 50875 33241 71952 106850 123638 119015 41948 25272
14143 25272 46046 67825 90565 -2450 65854 109502 64017 -3319 -5266 -28145 -682 2103
14131 2103 10186 20611 68445 47462 86259 27754 -17436 -41765 -42207 -40971 -82362 -77109 -98485
14118 -98485 -55234 41585 155755 188663 186084 159516 76078 118759 150057 136699 116231 118591
14106 118591 79149 27555 -46469 -117334 -110083 -79818 -75742 -32656 6226 70829 98897 -665
14094 -665 -7415 33940 72623 82331 -44211 -2511 92795 -26066 -87481 5146 26830 5621
14082 5621 83159 91357 -15138 -68275 -85054 -34887 2875 -52011 -123283 -88116 -51313 -24617
14070 -24617 10846 14339 33165 28359 16348 -33634 -89425 -31297 109916 86718 43212 20948
$$ packed form
14155A95431n9974j17543O030K3411L520j7634L8711L4898J6788m623p7067j6676
14143B5272K0774K1779K2740r3015O8304M3648m5485o7336j947k2879K7463K785
14131B103Q083J0425M7834k0983L8797n8505m5190k4329m42J236m1391N253k1376
14118i8485M3251R6819J14170L2908k579k6568q3438M2681L1298j3358k0468K360
14106A18591l9442n1594p4024p0865P251L0265M076M3086L8882O4603K8068r9562
14094f65o750M1355L8683R708j26542M1700R5306j18861o1415R2627K1684k1209
14082E621P7538Q198j06495n3137j6779N0167L7762n4886p1272L5167L6803K6696
14070b4617L5463L493J8826m806j2011m9982n5791N8128J41213k3198m3506k2264
$$ plain form
14058 20948 -25226 -14318 31201 24418 9650 53086 92339 -40351 -80402 -52861 33338 99422
14046 99422 47503 -3790 -4957 1051 992 66678 97172 32836 35337 -9064 -37533 26658 27544
14033 27544 52385 22786 61051 72549 61997 62033 121085 64754 -35604 -82707 -38808 33013
14021 33013 103068 7572 -32479 39178 101070 860 -70893 -20229 -12513 -31308 -24310 125037
14009 125037 151046 97002 156720 201614 63334 -2192 -59556 -71157 -18336 35434 45557
13998 45557 -16322 -80601 -99910 -76514 -88107 -12780 -2681 -83865 -60338 -70947 -81744 -51568
13986 -51568 36702 55889 25991 -68180 -74617 -45219 17676 -16814 -11408 36548 72498 106186
13974 106186 63728 36317 38181 -78171 -127418 -93582 -37864 -77657 -138956 -173584 -243382
$$ packed form
14058B0948m6174J0908M5519o783j4768M3436L9253j32690m0051K7541Q6199O6084
14046I9422n1919n1293j167O008n9O5686L0494o4336K501m4401k8469O4191Q86
14033B7544K4841k9599L8265J1498j0552L6N9052n6331j00358m7103M3899P1821
14021C3013P0055r5496m0051P1657O1892j00210p1753N0664P716j8795O998J49347
14009A25037K6009n4044N9718M4894j38280o5526n7364j1601N2821N3770J0123
13998D5557o1879o4279j9309K3396j1593P5327J0099q1184K3527j0609j0797L0176
13986e1568Q8270J9187k9898r4171o437K9398O2895l4490N406M7956L5950L3688
13974A06186m2458k7411J864j16352m9247L3836N5718l9793o1299l4628o9798
$$ plain form
13963 -243382 -199809 -131607 -83780 20217 92972 48422 -42142 -83875 54737 39229 -18178
13952 -18178 -82448 -77400 55918 162071 111159 94399 90545 145778 156512 190029 254348 207237
13940 207237 187801 150138 63626 -33224 -72979 -39337 -321 59957 -14871 -36346 -29740 36085
13928 36085 24115 27855 -7034 48271 54109 37890 133365 228859 235080 162012 98831 73215
13916 73215 108987 197151 279332 275547 219046 176964 237314 262170 257963 251304 191636 240646
13904 240646 330745 374048 351771 308261 264292 290493 369533 420482 409333 389105 335199
13893 335199 255206 267687 306427 286739 301429 265303 174533 202950 186474 264013 302704
13882 302704 290847 169765 90090 57483 -56 117193 211430 215638 228523 216450 171415
$$ packed form
13963b43382M3573O8202M7827J03997P2755m4550r0564m1733J38612j5508n7407
13952a8178o4270N048J33318J06153n0912j6760l854N5233J0734L3517O4319m7111
13940B07237j9436l7663q6512r6850l9755L3642L9016O0278p4828k1475O606O5825
13928C6085j1970L740l4889N5305N838j6219R5475R5494O221p3068o3181k5616
13916G3215L5772Q8164Q2181l785n6501m2082O0350K4856m207o659n9668M9010
13904B40646R0099M3303k2277m3510m3969K6201P9040N0949j1149k0228n3906
13893C35199p9993J2481L8740j9688J4690l6126r0770K8417j6476P7539L8691
13882C02704j1857j21082p9675l2607n7539J17249R4237M208J2885j2073m5035
$$ plain form
13871 171415 207684 208898 90431 13458 69494 89062 91840 131443 151390 111051 115680 71313
13859 71313 97754 113801 69156 79813 165781 181665 88722 84935 92228 97208 100121 26879
13847 26879 8056 26890 -31377 -37852 34663 79399 72599 20685 36430 33295 127017 159264
13835 159264 127585 120895 106996 106888 95913 33002 97238 152511 91794 74847 82530 57138
13823 57138 36510 -45364 -70578 -35994 3779 81724 116215 174295 146103 40694 -76712
13812 -76712 -64488 -4002 28081 -10068 -3991 24848 63190 36786 24325 16749 -82674 -118654
13800 -118654 -87020 14394 61457 -11310 22734 99451 155932 163089 88728 92026 53294 104275
13788 104275 104019 50072 19927 40193 17413 -51088 -90484 -103695 -110437 -50482 -38157 -6383
$$ packed form
13871A71415L6269J214j18467p6973N6036J9568K778L9603J9947m0339M629m4367
13859G1313K6441J6047m4645J0657Q5968J5884r2943l787P293M980K913p3242
13847B6879j8823J8834n8267o475P2515M4736o800n1914J5745l135R3722L2247
13835A59264l1679o690j3899j08j0975o2911O4236N5273o0717j6947P683k5392
13823E7138k0628q1874k5214L4584L9773P7945L4491N8080k8192j05409j17406
13812g6712J2224O0486L2083l8149O077K8839L8342k6404j2461p576r9423l5980
13800a18654L1634J01414M7063p2767L4044P6717N6481P157p4361L298l8732N0981
13788A04275k56n3947l0145K0266k2780o8501l9396j3211o742N9955J2325L1774
$$ plain form
13776 -6383 88560 21319 -21042 -11052 -26687 -89662 -137724 -91038 -26334 -94515 -177214 -156797
13764 -156797 -193363 -174986 -168825 -121780 -50535 29162 91859 57385 17222 -34687 -11847 24769
13752 24769 -30605 -69394 -97559 -169853 -121243 -24524 -60308 -159708 -183180 -113414 -114683 -96889
13740 -96889 -109250 -102808 -59140 -66889 -60754 -35439 -28 51600 72562 22852 -56701 -119449
13728 -119449 -178145 -127986 -31034 88953 78056 -17396 -43537 -10411 52578 13700 39263
13717 39263 79769 90062 69525 20126 5233 23946 56862 41069 23890 -82111 -140441
13706 -140441 -91224 3639 33385 31521 15259 -5523 14044 31610 132297 89913 -18636
13695 -18636 56153 137654 140799 180632 220045 155834 149646 234823 278677 252005 187238 82221
$$ packed form
13776f383R4943o7241m2361R990j5635o2975m8062M6686O4704o8181q2699K0417
13764a56797l6566J8377O161M7045P1245P9697O2697l4474m0163n1909K2840L6616
13752B4769n5374l8789k8165p2294M8610R6719l5784r9400k3472O9766j269J7794
13740i6889j2361O442M3668p749O135K5315L5411N1628K0962m9710p9553o2748
13728a19449n8696N0159R6952J19987j0897r5452k6141L3126O2989l8878K5563
13717C9263M0506J0293k0537m9399j4893J8713L2916j5793j7179j06001n8330
13706a40441M9217R4863K9746j864j6262k0782J9567J7566J00687m2384j08549
13695a8636P4789Q1501L145L9833L9413o4211o188Q5177M3854k6672o4767j05017
$$ plain form
13683 82221 62392 156485 258763 308275 376303 422289 402301 360491 405857 530906 482494
13672 482494 384645 270032 213509 240462 302969 221888 120056 71097 27944 32314 75841
13661 75841 121795 152634 174708 90867 46052 49461 33519 121767 89441 81484 157214 80320
13649 80320 -51403 -39954 -17499 -13972 30084 95673 157400 183198 218455 175628 110070 28876
13637 28876 -1362 -28802 -66804 -82061 -48405 -78525 -89173 -55994 -57796 -23434 -10319 -74865
13625 -74865 -68563 -11691 -18051 26998 121514 203189 167863 98112 125184 93140 35339 -335
13613 -335 17453 32936 96178 169957 150876 98189 27230 -30369 -35193 3317 100454 127526
13601 127526 -15386 21970 109651 117030 81079 -46335 -127068 -183482 -170153 -63561 -52372
$$ packed form
13683H2221j9829R4093J02278M9512O8028M5986j9988m1810M5366J25049m8412
13672D82494r7849j14613n6523K6953O2507q1081j01832m8959m3153M370M3527
13661G5841M5954L0839K2074q3841m4815L409j5942Q8248l2326p957P5730p6894
13649H0320j31723J1449K2455L527M4056O5589O1727K5798L5257m2827o5558q1194
13637B8876l0238k7440l8002j5257L3656l0120j0648L3179j802L4362J3115o4546
13625g4865O302N6872o360M5049R4516Q1675l5326o9751K7072l2044n7801l5674
13613c35J7788J5483O3242P3779j9081n2687p0959n7599m824L8510R7137K7072
13601A27526j42912L7356Q7681P379l5951j27414q0733n6414J3329J06592J1189
$$ plain form
13590 -52372 -35956 31461 78211 10365 17511 41736 44617 12766 28339 -38217 -30897 17368
13578 17368 59250 21698 42602 -3346 -5939 -15083 -25311 -11303 14695 10975 14148 -17984
13566 -17984 63458 89859 -36807 -129479 -157381 -91049 -8629 98362 170789 161280 136621
13555 136621 102913 39357 151876 178287 135724 119327 134232 180923 190056 138808 54990
13544 54990 97115 118145 44714 8092 15927 -18247 -5259 47659 6368 -66407 2243 79358
13532 79358 68723 43592 -2373 -43372 11766 107717 68867 14295 -80700 -115762 -68381 -5804
13520 -5804 25716 13330 -17348 17663 -32079 -22413 47065 3605 -31198 -63262 -114243 -78216
13508 -78216 -37786 -70363 23601 83060 -3523 -52452 10550 54399 36400 -29541 27765 126854
$$ packed form
13590e2372J6416O7417M6750o7846P146K4225K881l1851J5573o6556P320M8265
13578A7368M1882l7552K0904m5948k593r144j0228J4008K5998l720L173l2132
13566a7984Q1442K6401j26666r2672k7902O6332Q2420J06991P2427r509k4659
13555A36621l3708o3556J12519K6411m2563j6397J4905M6691R133n1248q3818
13544E4990M2125K1030p3431l6622P835l4174J2988N2918m1291p2775O8650P7115
13532G9358j0635k5131m5965m0999N5138R5951l8850n4572r4995l5062M7381O2577
13520e804L1520j2386l0678L5011m9742R666O9478m3460l4803l2064n0981L6027
13508g8216M0430l2577R3964N9459q6583m8929O3002M3849j7999o5941N7306R9089
$$ plain form
13496 126854 117580 135095 -10154 -76999 5665 -68878 -104205 -51495 -20194 69369 101592
13485 101592 -49059 -30902 -9424 -27991 12147 17023 70132 15837 20731 -48933 -159530
13474 -159530 -147832 -121674 -102171 -92694 -47237 -4538 -81743 -97717 -110996 -3495 76118
13463 76118 2931 -75987 -59296 29779 42233 58642 42219 49597 44588 -10447 38869 -7468
13451 -7468 -22865 -33570 -47359 -100554 -21796 127704 147219 57051 -2553 -39890 -110459 -53037
13439 -53037 -49767 -78200 -79607 -46586 -74589 -26236 57629 38800 577 -38034 -25409 -42991
13427 -42991 -20864 -52475 -53147 -11674 -64510 -163796 -154240 -101890 2623 -28056 -77801 -3187
13415 -3187 54100 33137 -72004 -54048 -63869 25383 112765 85844 129152 158027 88087 91010
$$ packed form
13496A26854r274J7515j45249o6845Q2664p4543l5327N2710L1301Q9563L2223
13485A01592j50651J8157K1478j8567M0138M876N3109n4295M894o9664j10597
13474a59530J1698K6158J9503R477M5457M2699p7205j5974j3279J07501P9613
13463G6118p3187p8918J6691Q9075J2454J6409j6423P378n009n5035M9316m6337
13451g468j5397j0705j3789n3195P8758J49500J9515r0168n9604l7337p0569N7422
13439e3037L270k8433j407L3021k8003M8353Q3865j8829l8223l8611J2625j7582
13427d2991K2127l1611o72M1473n2836r9286R556N2350J04513l0679m9745P4614
13415c187N7287k0963j05141J7956r821Q9252Q7382k6921M3308K8875o9940K923
$$ plain form
13403 91010 115981 54735 26717 79815 66706 15320 -15921 -13995 -51657 10545 102225 137135
13391 137135 74796 70068 95225 32791 -68241 -85 62671 37049 16288 -77057 -92573
13380 -92573 14798 157390 125150 -10682 -33296 -67951 -53799 -85947 -72476 -60055 -57229
13369 -57229 -54088 52083 77955 32184 -46489 -45015 82624 70308 -39254 -65354 -29872
13358 -29872 -66448 -36081 -81984 -179115 -181158 -187112 -142919 -148406 -173563 -205753 -233673 -264687
13346 -264687 -192778 -136897 -169300 -171423 -113128 -23303 4740 -7705 -38327 -119502 -194197 -105903
13334 -105903 -89985 -77547 -66466 32934 -26458 -36058 -69570 -35649 31020 31726 32756 70864
13322 70864 78001 21450 11332 63006 43194 58890 27285 2728 3510 -8291 80057 115302
$$ packed form
13403I1010K4971o1246k8018N3098j3109n1386l1241J926l7662O2202R1680L4910
13391A37135o2339m728K5157o2434j01032O8156O2756k5622k0761r3345j5516
13380i2573J07371J42592l2240j35832k2614l4655J4152l2148J3471J2421K826
13369e7229L141J06171K5872m5771p8673J474J27639j2316j09562k6100L5482
13358b9872l6576L0367m5903r7131k043n954M4193n487k5157l2190k7920l1014
13346b64687P1909N5881l2403k123N8295Q9825K8043j2445l0622q1175p4695Q8294
13334a05903J5918J2438J1081R9400n9392r600l3512L3921O6669P06J030L8108
13322G0864P137n6551j0118N1674j9812J5696l1605k4557P82j1801Q8348L5245
$$ plain form
13310 115302 80818 96941 102011 34217 -396 -26293 -10170 11785 46271 86592 34121 33813
13298 33813 59322 87968 12867 27279 44598 -18607 -80947 -65044 -99996 -76889 18879 63764
13286 63764 62755 104454 165050 92853 -17811 -72086 -44752 30720 -39558 -46341 16772 41295
13274 41295 35909 28256 84013 159634 147755 106719 119259 40011 34045 120441 31046 26815
13262 26815 89539 45812 -17131 -5606 -2301 -81697 -98416 -84042 27088 90688 128966 175820
13250 175820 165257 33669 -9497 -44346 -59113 42653 142972 169703 90025 29100 -28261
13239 -28261 51769 29410 -25381 -25991 18728 9252 12065 -13286 -6136 -71090 -64232 -22970 4840
13226 4840 32048 59261 68313 84083 101473 126848 155550 238372 368594 317259 237654 159017
$$ packed form
13310A15302l4484J6123N070o7794l4613k5897J6123K1955L4486M0321n2471l08
13298C3813K5509K8646p5101J4412J7319o3205o2340J5903l4952K3107R5768M4885
13286F3764j009M1699O0596p2197j10664n4275K7334P5472p0278o783O3113K4523
13274D1295n386p653N5757P5621j1879m1036J2540p9248n966Q6396q9395m231
13262B6815O2724m3727o2943J1525L305p9396j6719J4374J11130O3600L8278M6854
13250A75820j0563j31588m3166l4849j4767J01766J00319K6731p9678o0925n7361
13239b8261Q0030k2359n4791o10M4719r476K813k5351P150o4954O858M1262K7810
13226D840K7208K7213R052J5770J7390K5375K8702Q2822J30222n1335p9605p8637
$$ plain form
13214 159017 82965 35035 14426 7958 -35978 248 -43730 4999 50217 50352 -8540 -348
13202 -348 64501 117872 37552 2009 40174 88835 138738 145781 93857 43758 -2834 11876
13190 11876 87632 47662 56793 90678 145902 106279 50350 1207 -12183 71622 141917 83894
13178 83894 37917 34400 47165 101878 84954 37715 63687 163585 212769 152967 92278 89083
13166 89083 150380 196995 216322 223725 215077 227111 142420 51676 51649 86268 5838 -152973
13154 -152973 -107304 -57659 53136 23673 -17879 -42047 -69455 -59354 -10502 -2989 -5414 81887
13142 81887 81363 84388 162919 166809 143928 168197 123456 99937 180896 188858 110405 105805 250949
13129 250949 231693 162999 143097 85215 93004 64513 129762 219060 242537 285317 277048 230911
$$ packed form
13214A59017p6052m7930k0609o468m3936L6226m3978M8729M5218J35n8892Q192
13202c48O4849N3371q0320l5543L8165M8661M9903P043n1924n0099m6592J4710
13190A1876P5756l9970R131L3885N5224l9623n5929m9143j3390Q3805P0295n8023
13178H3894m5977l517J2765N4713j6924m7239K5972R9898M9184n9802o0689l195
13166H9083O1297M6615J9327P403q648J2034q4691r0744k7L4619q0430j58811
13154a52973M5669M9645J10795k9463m1552k4168k7408J0101M8852P513k425Q7301
13142H1887n24L025P8531L890k2881K4269m4741k3519Q0959P962p8453m600J45144
13129B50949j9256o8694j9902n7882P789k8491O5249Q9298K3477M2780q269m6137
$$ plain form
13117 230911 141415 97700 100005 85287 88052 64624 44447 -10508 -26040 -12445 27396 51760
13105 51760 23714 2826 -34445 49677 158014 188528 128205 80670 77799 54092 90021 99201
13093 99201 45509 52990 74473 30810 -73514 -114485 -89604 -6131 48003 441 -27632 -42605
13081 -42605 -42603 -23432 4645 69265 62213 95382 56660 33860 117362 114953 43633 -36230 -76152
13068 -76152 83192 105552 112704 51705 59309 83478 87185 99054 130915 132559 158596 70117
13056 70117 47706 1479 -138 -10437 -63428 -76204 -109460 -67228 -109505 -125139 -70182 -41372
13044 -41372 73912 63542 19374 -69853 -73724 -39765 -22099 2804 -6200 56900 80791 23491
13032 23491 -36327 10316 46950 34161 11480 -34664 -87673 -9113 41426 -22336 -44190 -76244
$$ packed form
13117B30911q9496m3715K305j4718K765k3428k0177n4955j5532J3595L9841K4364
13105E1760k8046k0888l7271Q4122J08337L0514o0323m7535k871k3707L5929R180
13093I9201n3692P481K1483m3663j04324m0971K4881Q3473N4134m7562k8073j4973
13081d2605KJ9171K8077O4620p052L3169l8722k2800Q3502k409p1320p9863l9922
13068g6152J59344K2360P152o0999P604K4169L707J1869L1861J644K6037q8479
13056G0117k2411m6227j617j0299n2991j2776l3256M2232m2277j5634N4957K8810
13044d1372J15284j0370m4168q9227l871L3959J7666K4903r004O3100K3891n7300
13032B3491n9818M6643L6634j2789k2681m6144n3009P8560N0539o3762k1854l2054
$$ plain form
13020 -76244 -87520 -22898 81620 127223 169929 113863 142643 208136 153027 102850 130233
13009 130233 65705 -12352 -3263 -73866 -58556 23099 47755 167692 271542 256340 252023
12998 252023 199630 119951 52098 -11280 -25223 65444 75693 64326 73908 90519 64836 -5207
12986 -5207 -54141 -89366 7093 66145 -57315 -96133 -39471 -20737 1555 -24021 -28633 -27163
12974 -27163 -1992 44234 15318 1793 -16150 -13822 17236 -53934 -44022 -63302 -33651 24936
12962 24936 62543 33811 93559 155809 124203 160422 150446 86569 114761 88986 112245 105083
12950 105083 67447 43650 55680 82689 141757 168534 50165 -25161 28466 97963 66026
12939 66026 -11467 -14116 37703 90177 64190 49066 120240 252459 226959 84602 18427
$$ packed form
13020g6244j1276O4622J04518M5603M2706n6066K8780O5493n5109n0177K7383
13009A30233o4528p8057R089p0603J5310Q1655K4656J19937J03850j5202m317
12998B52023n2393p9679o7853o3378j3943R0667J0249j1367R582J6611k5683p0043
12986e207m8934l5225R6459N9052j23460l8818N6662J8734K2292k5576m612J470
12974b7163K5171M6226k8916j3525j7943K328L1058p1170R912j9280K9651N8587
12962B4936L7607k8732N9748O2250l1606L6219r976o3877K8192k5775K3259p162
12950A05083l7636k3797J2030K7009N9068K6777j18369p5326N3627O9497l1937
12939F6026p7493k649N1819N2474k5987j5124P1174J32219k5500j42357o6175
$$ plain form
12928 18427 39327 -9463 -73259 -83200 -72662 -78304 -81885 13645 43839 -31997 -4803 -95194
12916 -95194 -107739 -37913 7820 -57781 -121824 -165724 -155587 -161875 -124569 -135073 -176958 -130559
12904 -130559 -88301 -88216 -85727 -156852 -150627 -45952 29210 -1303 -20749 9421 46568 106019
12892 106019 140636 142581 138567 210200 190201 125676 32866 -16483 -15425 -44520 -108434 -32877
12880 -32877 -5258 44511 92194 64172 10133 -41154 -31729 -9846 -2250 -22367 8648 5860
12868 5860 92451 158158 133993 121281 69626 31022 40436 41401 18852 -32161 6404 82162
12856 82162 97561 122429 139369 166149 192312 171175 160815 164394 154918 109826 -5801 -43245
12844 -43245 7972 45871 86846 213883 196379 176569 110476 126463 81699 79717 58145 55052
$$ packed form
12928A8427K0900m8790o3796r941J0538n642l581R5530L0194p5836K7194r0391
12916i5194j2545O9826M5733o5601o4043m3900J0137o288L7306j0504m1885M6399
12904a30559M2258Q5K489p1125O225J04675P5162l0513j9446L0170L7147N9451
12892A06019L4617J945m014P1633j9999o4525r2810m9349J058k9095o3914P5557
12880c2877K7619M9769M7683k8022n4039n1287R425K1883P596k0117L1015k788
12868E860Q6591O5707k4165j2712n1655l8604R414R65k2549n1013L8565P5758
12856H2162J5399K4868J6940K6780K6163k1137j0360L579r476m5092j15627l7444
12844d3245N1217L7899M0975J27037j7504j9810o6093J5987m4764j982k1572l093
$$ plain form
12832 55052 31586 119898 108253 131002 303693 444660 376116 282884 201013 202440 216427
12821 216427 238291 239776 188468 138798 106434 56678 -14412 52789 86723 103627 55856 -43334
12809 -43334 -63790 71760 105396 43005 75085 175381 132299 118748 30924 3397 -7765
12798 -7765 28336 33091 -16 1372 41970 39205 42082 22982 24514 -9962 17947 28053 110121
12785 110121 91467 62373 93088 50173 -12778 74157 118765 174682 205828 151840 123428
12774 123428 124281 107236 158825 172861 132731 126346 115357 130210 193385 222152 173920 197256
12762 197256 179576 98014 -22001 -28835 93445 144429 123245 84315 57765 64804 16274
12751 16274 -22021 -6812 -15843 81160 177806 205768 146716 169863 168542 222403 281090 163542
$$ packed form
12832E5052k3466Q8312j1645K2749J72691J40967o8544r3232q1871J427J3987
12821B16427K1864J485n1308m9670l2364m9756p1090O7201L3934J6904m7771r9190
12809d3334k0456J35550L3636o2391L2080J00296m3082j3551q7824k7527j1162
12798g765L6101M755l3107J388M0598k765K877j9100J532l4476K7909J0106Q2068
12785A10121j8654k9094L0715m2915o2951Q6935M4608N5917L1146n3988k8412
12774A23428Q53j7045N1589J4036m0130o385j0989J4853O3175K8767m8232K3336
12762A97256j7680q1562j20015o834J22280N0984k1184l8930k6550P039m8530
12751A6274l8295J5209r031R7003R6646K7962n9052K3147j321N3861N8687j17548
$$ plain form
12739 163542 67812 86999 194094 252687 273892 204253 139035 102004 125882 159682 183641
12728 183641 299999 342829 305370 364202 459461 430861 431162 480327 453754 440390 481835 547691
12716 547691 568075 660588 671155 618537 667561 808238 900540 858028 823189 846378 775708
12705 775708 718062 738179 709553 700530 685117 580199 481458 518740 587649 540075 515729
12694 515729 510071 494194 467021 432957 435400 489231 539711 483288 403681 410659 383407 266680
12682 266680 294966 444246 505943 497690 539736 554247 593675 610114 576661 612154 571203
12671 571203 549965 581963 559527 639361 628780 651387 646129 652049 562227 491429 400251 330328
12659 330328 299112 259343 218912 198452 236098 253634 298287 198883 190971 152333 124626 172985
$$ packed form
12739A63542r5730J9187J07095N8593K1205o9639o5218l7031K3878L3800K3959
12728A83641J16358M2830l7459N8832R5259k8600L01M9165k6573j3364M1445O5856
12716E47691K0384R2513J0567n2618M9024J40677R2302m2512l4839K3189p0670
12705G75708n7646K0117k8626r023j5413j04918r8741L7282O8909m7574k4346
12694E15729n658j5877k7173l4064K443N3831N0480n6423p9607O978k7252j16727
12682B66680K8286J49280O1697q253M2046J4511L9428J6439l3453L5493m0951
12671E71203k1238L1998k2436P9834j0581K2607n258N920q9822p0798r1178o9923
12659C30328l1216l9769m0431k0460L7646J7536M4653r9404p912l8638k7707M8359
$$ plain form
12647 172985 278623 302514 284612 285263 306301 212963 215193 235922 239766 236510 196103 253029
12635 253029 253592 189608 127475 39708 75178 208495 297234 253664 269285 247338 278190 272519
12623 272519 281588 313738 321000 248108 157295 143246 96917 64438 50033 90823 144171 61298
12611 61298 82333 216702 292607 200504 133892 27772 12149 166847 145742 136497 182856
12600 182856 208890 258498 318736 344246 320981 332832 274755 298666 237063 188248 216146
12589 216146 282664 344701 348600 350957 251498 153351 215726 257811 203001 241926 280080 220038
12577 220038 208692 275987 288156 337642 460398 534808 545253 508767 408790 341440 322731
12566 322731 393565 409396 482233 473284 359229 333888 375240 415251 526344 629619 693128
$$ packed form
12647A72985J05638K3891j7902O51K1038r3338K230K0729L844l256m0407N6926
12635B53029N63o3984o2133q7767L5470J33317Q8739m3570J5621k1947L0852n671
12623B72519R069L2150P262p2892r0813j4049m6329l2479j4405M0790N3348q2873
12611F1298K1035J34369P5905r2103o6612j06120j5623J54698k1105r245M6359
12600A82856K6034M9608O0238K5510k3265J1851n8077K3911o1603m8815K7898
12589B16146O6518O2037L899K357r9459r8147O2375M2085n4810L8925L8154o0042
12577B20038j1346O7295J2169M9486J22756P4410J0445l6486r9977o7350j8709
12566C22731P0834J5831P2837q949j14055k5341M1352M0011J11093J03275O3509
$$ plain form
12555 693128 741106 705263 638587 498284 351946 385560 397565 448201 413935 404123 366474
12544 366474 358919 380840 425496 468623 377197 353197 386763 541840 659588 648436 537268
12533 537268 463938 533527 506760 441787 403252 373634 394883 411274 400119 332943 364368
12522 364368 321140 301959 349267 380594 403870 405419 374851 376426 331294 346343 275471 211140
12510 211140 220349 234982 268122 288543 290160 201511 219855 277556 307358 341848 448674 435640
12498 435640 351258 324227 218628 155628 202844 265730 294907 337347 264051 211361 128924
12487 128924 153305 143285 182875 235148 247099 266662 201311 138692 175776 202270 314320
12476 314320 260699 187689 196658 302375 311447 332717 325455 309261 310587 369359 393621 317835
$$ packed form
12555F93128M7978l5843o6676j40303j46338L3614J2005N0636l4266r812l7649
12544C66474p555K1921M4656M3127r1426k4000L3566J55077J17748j1152j11168
12533E37268p3330O9589k6767o4973l8535k9618K1249J6391j1155o7176L1425
12522C64368m3228j9181M7308L1327K3276J549l0568J575m5132J5049p0872o4331
12510B11140R209J4633L3140K0421J617q8649J8344N7701K9802L4490J06826j3034
12498D35640q4382k7031j05599o3000M7216O2886K9177M2440p3296n2690q2437
12487A28924K4381j0020L9590N2273J1951J9563o5351o2619L7084K6494J12050
12476C14320n3621p3010Q969J05717R072K1270p262j6194J326N8772K4262p5786
$$ plain form
12464 317835 232183 239776 385165 406708 394655 309330 251221 263846 291391 346612 324822
12453 324822 317850 358593 376004 399700 405099 388965 396818 323424 328977 359261 348463 315744
12441 315744 287466 321996 412077 421441 419333 434099 519459 522099 456592 412520 400882 494599
12429 494599 441987 398169 358712 366467 287103 339962 353030 361232 457593 404469 417742 412360
12417 412360 488481 633773 711201 708436 750653 733871 770007 841150 907841 961146 1037820
12406 1037820 1018694 975502 974620 992849 957765 924342 868533 874330 890584 935434 977226 969444
12394 969444 946178 947426 919601 875424 960108 1013217 1059644 1029010 976996 956920 956131 931861
12382 931861 896350 885473 931128 967298 1045570 1063507 1024550 1061898 1068244 964832 954271
$$ packed form
12464C17835q5652P593J45389K1543j2053q5325n8109J2625K7545N5221k1790
12453C24822o972M0743J7411K3696N399j6134P853p3394N553L0284j0798l2719
12441C15744k8278L4530R0081R364k108J4766Q5360K640o5507m4072j1638R3717
12429D94599n2612m3818l9457P755p9364N2859J3068Q202R6361n3124J3273n382
12417D12360P6121J45292P7428k765M2217j6782L6136P1143O6691N3305P6674
12406A037820j9126m3192q82J8229l5084l3423n5809N797J6254M4850M1792p782
12394I69444k3266J248k7825m4177Q4684N3109M6427l0634n2014k0076p89k4270
12382I31861l5511j0877M5655L6170P8272J7937l8957L7348O346j03412j0561
$$ plain form
12371 954271 992885 1055209 1094442 1083828 1120095 1100519 1146163 1177562 1111386 1192624 1272703
12360 1272703 1303656 1333373 1372906 1349454 1314228 1297167 1319788 1290464 1333237 1512189 1589308
12349 1589308 1529630 1524224 1571779 1611288 1642257 1731020 1780243 1893944 2016367 2104165 2173010
12338 2173010 2272335 2369452 2501839 2589725 2682168 2792630 2928742 2974936 3132599 3331718
12328 3331718 3498333 3599625 3732193 3854777 4050064 4295134 4566684 4805007 5124534
12319 5124534 5485155 5850004 6330024 6774940 7176691 7776436 8478393 9257420 10241886
12310 10241886 11363424 12622775 13953043 15529006 17388494 19476650 22082448 25364448
12302 25364448 29265029 34002503 39869895 46931921 55187085 64783171 75481363 87244810
$$ packed form
12371I54271L8614O2324L9233j0614L6267j9576M5644L1399o6176Q1238Q0079
12360A272703L0953K9717L9533k3452l5226j7061K2621k9324M2773J78952P7119
12349A589308n9678n406M7555L9509L0969Q8763M9223J13701J22423Q7798O8845
12338B173010R9325R7117J32387Q7886R2443J10462J36112M6194J57663J99119
12328C331718J66615J01292J32568J22584J95287K45070K71550K38323L19527
12319E124534L60621L64849M80020M44916M01751N99745P01957P79027R84466
12310A0241886J121538J259351J330268J575963J859488K088156K605798L282000
12302B5364448L900581M737474N867392P062026Q255164R596086J0698192J1763447
$$ plain form
12294 87244810 99914350 113179949 126575218 139500244 151301489 161532126 169946311
12287 169946311 176381891 180428618 181820525 180622359 176857429 170682232 162295536 152120942
12279 152120942 140856739 128947436 116681927 104638503 93103305 82189073 72275366
12272 72275366 63642269 56419326 50420366 45550325 41587132 38440252 35689817 33217433
12264 33217433 31034397 29086700 27378529 25838353 24326472 23006289 21837488 20753321
12256 20753321 19636253 18627308 17647495 16796279 16094855 15400519 14666488 14086153 13537603
12247 13537603 12967374 12343939 11795007 11350673 10949121 10631033 10316769 9902671 9544779
12238 9544779 9219196 8914629 8694142 8383375 8066496 7882620 7726958 7463006 7149392
$$ packed form
12294H7244810J2669540J3265599J3395269J2925026J1801245J0230637Q414185
12287A69946311O435580M046727J391907j198166l764930o175197q386696j0174594
12279A52120942j1264203j1909303j2265509j2043424j1535198j0914232r913707
12272G2275366q633097p222943n998960m870041l963193l146880k750435k472384
12264C3217433k183036j947697j708171j540176j511881j320183j168801j084167
12256B0753321j117068j008945r79813q51216p01424o94336p34031n80335n48550
12247A3537603n70229o23435n48932m44334m01552l18088l14264m14098l57892
12238I544779l25583l04567k20487l10767l16879j83876j55662k63952l13614
$$ plain form
12229 7149392 6859747 6587569 6418596 6250862 6107624 5978912 5817133 5665035 5556749
12220 5556749 5331760 5221885 5127686 5008040 4828722 4666644 4535729 4432330 4352130 4273277
12210 4273277 4174540 4021064 3794513 3584871 3505867 3515908 3499746 3388705 3276429 3233492
12200 3233492 3148280 3038357 2939743 2848459 2805751 2813817 2808536 2776785 2709968 2577348 2495885
12189 2495885 2446835 2386552 2381192 2360724 2349426 2277349 2204415 2280610 2373143 2301928 2267460
12178 2267460 2204661 2081431 1915284 1805948 1773291 1745541 1707061 1575216 1638750 1723575
12168 1723575 1638312 1574914 1593925 1471044 1433830 1470438 1535985 1515484 1409679 1367714 1338799
12157 1338799 1312374 1277037 1187286 1227214 1299416 1203181 1189157 1246710 1265949 1240204 1235358
$$ packed form
12229G149392k89645k72178j68973j67734j43238j28712j61779j52098j08286
12220E556749k24989j09875r4199j19646j79318j62078j30915j03399q0200p8853
12210D273277r8737j53476k26551k09642p9004J0041j6162j11041j12276m2937
12200C233492q5212j09923r8614r1284m2708Q066n281l1751o6817j32620q1463
12189B495885m9050o0283n360k0468j1298p2077p2934P6195R2533p1215l4468
12178B267460o2799j23230j66147j09336l2657k7750l8480j31845O3534Q4825
12168A723575q5263o3398J9011j22881l7214L6608O5547k0501j05805m1965k8915
12157A338799k6425l5337q9751L9928P2202r6235j4024N7553J9239k5745m846
$$ plain form
12146 1235358 1227680 1182531 1091113 1039410 1048005 1054461 1083598 1053635 979764 940457 883727 853021
12134 853021 871669 960550 954253 934122 982727 967159 895264 735475 695303 646171 714167
12123 714167 760843 731996 666783 633617 616392 592476 597929 671443 757157 837242 851779 871220
12111 871220 882455 887643 884733 816890 845655 948836 960356 935152 908146 934608 902438 883055
12099 883055 874099 949764 863553 826901 811764 815195 782406 743230 764415 795411 869484 977353
12087 977353 1007087 1025320 1008145 962141 961325 937279 932273 852545 868897 852269 798139 741268
12075 741268 815916 872468 938664 922921 903236 878548 807938 795566 777543 760587 815966
12064 815966 881724 994642 1094788 1155225 1218171 1316544 1462560 1593560 1709726 1834335
$$ packed form
12146A235358p678m5149r1418n1703Q595O456K9137k9963p3871l9307n6730l0706
12134H53021J8648Q8881o297k0131M8605j5568p1895j59789m0172m9132O7996
12123G14167M6676k8847o5213l3166j7225k3916N453P3514Q5714Q0085J4537J9441
12111H71220J1235N188k910o7843K8765J03181J1520k5204k7006K6462l2170j9383
12099H83055q956P5665q6211l6652j5137L431l2789l9176K1185L0996P4073J07869
12087I77353K9734J8233j7175m6004q16k4046n006p9728J6352j6628n4130n6871
12075G41268P4648N6552O6196j5743j9685k4688p0610j2372j8023j6956N5379
12064H15966O5758J12918J00146O0437O2946R8373J46016J31000J16166J24609
$$ plain form
12054 1834335 1932392 2021154 2172556 2287181 2369076 2475526 2582543 2510374 2364748 2245302
12044 2245302 2216467 2173385 2107644 2148345 2104953 2110221 2130048 2128393 2079859 2047661 2070432 2087038
12032 2087038 2003518 2015276 2050004 2015558 2001347 2038559 1987352 1878258 1824406 1948293 1972350
12021 1972350 1957181 1959154 1966601 2038338 2113492 2138143 2144201 2218926 2254394 2265236 2254897 2214956
12009 2214956 2180393 2207259 2252822 2262706 2220662 2217560 2209407 2304483 2408012 2410659 2525698 2525796
11997 2525796 2558098 2787844 2895843 2986942 3060460 3139019 3294146 3371194 3383275 3439578 3457138
11986 3457138 3498034 3607068 3732278 3903095 4112983 4210345 4278448 4433071 4616039 4748040
11976 4748040 4926316 5138003 5347874 5707643 5985208 6274244 6483187 6752632 7083069
$$ packed form
12054A834335R8057Q8762J51402J14625Q1895J06450J07017p2169j45626j19446
12044B245302k8835m3082o5741M0701m3392N268J9827j655m8534l2198K2771J6606
12032B087038q3520J1758L4728l4446j4211L7212n1207j09094n3852J23887K4057
12021A972350j5169J973P447P1737P5154K4651O058P4725L5468J0842j0339l9941
12009B214956l4563K6866M5563R884m2044l102q153R5076J03529K647J15039R8
11997B525796L2302K29746J07999R1099P3518P8559J55127P7048J2081N6303J7560
11986C457138M0896J09034J25210J70817K09888R7362O8103J54623J82968J32001
11976D748040J78276K11687K09871L59769K77565K89036K08943K69445L30437
$$ plain form
11967 7083069 7484114 7931140 8383456 8856028 9331104 9951651 10604439 11237090 11977590
11958 11977590 12874815 13816399 14854197 16107463 17585044 19147131 20886868 22852257
11950 22852257 25082582 27742310 30833021 34413958 38588298 43625623 49851341 57435743
11942 57435743 66944054 79114087 94864037 115745701 143292115 179659185 225949393
11935 225949393 280603493 337669361 389239689 431719828 467223176 497391038 519413118
11928 519413118 528474267 518331475 480590884 415648415 340910375 274519604 223010413
11921 223010413 184864356 156757900 135687162 119616230 106976456 96941313 88592245
11914 88592245 81557465 75635864 70411013 65795425 61590238 57817341 54509863 51544715
$$ packed form
11967G083069M01045M47026M52316M72572M75076O20547O52788O32651P40500
11958A1977590Q97225R41584J037798J253266J477581J562087J739737J965389
11950B2852257K230325K659728L090711L580937M174340N037325O225718P584402
11942E7435743R508311J2170033J5749950K0881664K7546414L6367070M6290208
11935B25949393N4654100N7065868N1570328M2480139L5503348L0167862K2022080
11928E19413118R061149j0142792l7740591o4942469p4738040o6390771n1509191
11921B23010413l8146057k8106456k1070738j6070932j2639774j0035143q349068
11914H8592245p034780n921601n224851m615588m205187l772897l307478k965148
$$ plain form
11906 51544715 48683208 46159569 43899696 41667402 39565309 37695874 36029150 34402652
11898 34402652 32857936 31510150 30252450 28929098 27712849 26550224 25368667 24335804
11890 24335804 23406288 22419986 21510465 20715325 20064504 19416307 18875973 18293210 17711337
11881 17711337 17081170 16576845 16134758 15588217 14995244 14605339 14209198 13768522 13508608
11872 13508608 13130261 12727760 12423000 12158799 11931013 11658253 11342764 11195529 11008018
11863 11008018 10716768 10419461 10178376 9962159 9739281 9457083 9237809 8978871 8687723
11854 8687723 8431702 8225628 7901432 7539063 7295897 7117573 6892151 6654315 6387967
11845 6387967 6138424 5926134 5693799 5576160 5429147 5296505 5112922 4980191 4889435 4683268
$$ packed form
11906E1544715k861507k523639k259873k232294k102093j869435j666724j626498
11898C4402652j544716j347786j257700j323352j216249j162625j181557j032863
11890B4335804r29516r86302r09521p95140o50821o48197n40334n82763n81873
11881A7711337o30167n04325m42087n46541n92973l89905l96141m40676k59914
11872A3508608l78347m02501l04760k64201k27786k72760l15489j47235j87511
11863A1008018k91250k97307k41085k16217k22878k82198k19274k58938k91148
11854H687723k56021k06074l24196l62369k43166j78324k25422k37836k66348
11845F387967k49543k12290k32335j17639j47013j32642j83583j32731r0756k06167
$$ plain form
11835 4683268 4500606 4324552 4262788 4265755 4134355 3927433 3821357 3665312 3569407 3579691
11825 3579691 3485843 3400603 3304733 3219700 3127189 3112309 3150607 3045822 2937299 2854117 2840082
11814 2840082 2726844 2615173 2594328 2528187 2322998 2262524 2287247 2310164 2293245 2285235 2281868
11803 2281868 2256148 2160883 2138350 2139315 2178576 2113479 2009896 1910304 1902005 1909900 1872562 1809597
11791 1809597 1690713 1611240 1642130 1660835 1625854 1546239 1415341 1386214 1402618 1444310 1367656
11780 1367656 1245229 1184083 1151154 1141484 1170309 1153125 1087459 1090504 1063133 1072929 1054946 1018441
11768 1018441 994354 1008256 1004814 982516 965701 927326 860629 892515 1006631 1027821 866670
11757 866670 763217 754956 820762 791429 705857 734567 728551 762611 782621 800667 723015 689869
$$ packed form
11835D683268j82662j76054o1764K967j31400k06922j06076j56045r5905J0284
11825C579691r3848q5240r5870q5033r2511j4880L8298j04785j08523q3182j4035
11814B840082j13238j11671k0845o6141k05189o0474K4723K2917j6919q010l367
11803B281868k5720r5265k2533R65L9261o5097j03583r9592q299P895l7338o2965
11791A809597j18884p9473L0890J8705l4981p9615j30898k9127J6404M1692p6654
11780A367656j22427o1146l2929r670K8825j7184o5666L045k7371R796j7983l6505
11768A018441k4087J3902l442k2298j6815l8375o6697L1886J14116K1190j61151
11757H66670j03453q261O5806k9333q5572K8710o016L4060K0010J8046p7652l3146
$$ plain form
11745 689869 803412 830840 813220 882306 893589 866895 776560 766817 731466 776714 828499
11734 828499 800721 734397 697138 688701 737015 841597 846823 827631 807465 765235 754049 659523
11722 659523 649131 713307 647309 556260 524295 474556 450863 426329 449062 542582 580785
11711 580785 587937 653933 676046 691404 657891 661435 666260 591699 540392 537852 594842 610765
11699 610765 620685 638857 648029 618715 592133 630360 629184 520550 489846 522081 427673 451043
11687 451043 477998 497284 514784 465650 455313 472992 642185 733166 768697 741312 674955
11676 674955 620399 645276 679739 671328 675753 726731 849699 869977 832433 788288 821719 862570
11664 862570 838311 850924 809167 760127 796762 825865 764932 697851 727484 734111 715962 713627
$$ packed form
11745F89869J13543K7428j7620O9086J1283k6694r0335r743l5351M5248N1785
11734H28499k7778o6324l7259q437M8314J04582N226j9192k0166m2230j1186r4526
11722F59523j0392O4176o5998r1049l1965m9739k3693k4534K2733R3520L8203
11711E80785P152O5996K2113J5358l3513L544M825p4561n1307k540N6990J5923
11699F10765R920J8172R172k9314k6582L8227j176j08634l0704L2235r4408K3370
11687D51043K6955J9286J7500m9134j0337J7679J69193R0981L5531k7385o6357
11676F74955n4556K4877L4463q411M425N0978J22968K0278l7544m4145L3431M0851
11664H62570k4259J2613m1757m9040L6635K9103o0933o7081K9633O627j8149k335
$$ plain form
11652 713627 633674 552572 631936 684691 654448 638732 608124 612427 628475 646738 706081 766249
11640 766249 818087 726091 724350 783898 882427 997432 995573 887606 887299 926166 866380 848898
11628 848898 812570 670566 570693 440258 406366 406547 465528 424241 406617 402647 362194 305517
11616 305517 212017 189847 150144 36067 80449 134350 188714 155524 188389 181326 197199
11605 197199 315765 351976 361348 311887 253498 178891 77083 33364 54767 155298 273971
11594 273971 276667 166384 155655 130510 136487 146683 100953 41037 56491 100978 144196 155304
11582 155304 191787 218737 242050 285244 202824 209125 298602 229848 149011 163706 158025 176483
11570 176483 205997 161519 141823 140477 148436 72218 30794 5276 -8608 2540 60646 130440
$$ packed form
11652G13627p9953q1102P9364N2755l0243j5716l0608M303J6048J8263N9343O0168
11640G66249N1838r1996j741N9548R8529J15005j859j07967l07L8867n9786j7482
11628H48898l6328j42004r9873j30435l3892J81N8981m1287j7624l970m0453n6677
11616C05517r3500k2170l9703j14077M4382N3901N4364l3190L2865p063J5873
11605A97199J18566L6211R372m9461n8389p4607j01808m3719K1403J00531J18673
11594B73971K696j10283j0729k5145N977J0196m5730n9916J5454M4487M3218J1108
11582A55304L6483K6950K3313M3194q2420O301Q9477o8754q0837J4695n681J8458
11570A76483K9514m4478j9696j346P959p6218m1424k5518j3884J1148N8106O9794
$$ plain form
11558 130440 157376 128375 59754 -27658 28975 72826 196712 164648 122085 106897 44827
11547 44827 47277 85879 1710 -43322 42864 134627 188766 174294 151104 167609 148315 121035
11535 121035 79719 137599 87656 -8138 11072 17924 -12216 53450 108690 133002 98953 70224
11523 70224 54301 115358 132876 130959 156587 129257 176306 232828 199951 217150 277150 239472
11511 239472 195529 159024 110709 163069 141717 47656 50904 80279 124156 151092 157700 186662
11499 186662 78276 47865 -73622 13026 1675 3733 19885 1765 58266 173859 169494
11488 169494 122621 132131 206554 177550 94479 61017 5926 -23942 6323 107946 126617
11477 126617 70623 -19803 -54784 -89083 -29847 83264 113317 25527 -50359 -79021 -52513
$$ packed form
11558A30440K6936k9001o8621q7412N6633M3851J23886l2064m2563j5188o2070
11547D4827K450L8602q4169m5032Q6186R1763N4139j4472k3190J6505j9294k7280
11535A21035m1316N7880m9943r5794J9210O852l0140O5666N5240K4312l4049k8729
11523G0224j5923O1057J7518j917K5628k7330M7049N6522l2877J7199O0000l7678
11511B39472m3943l6505m8315N2360k1352r4061L248K9375M3877K6936O608K8962
11499A86662j08386l0411j21487Q6648j1351K058J6152j8120N6501J15593m365
11488A69494m6873R510P4423k9004q3071l3462n5091k9868L0265J01623J8671
11477A26617n5994r0426l4981l4299N9236J13111L0053q7790p5886k8662K6508
$$ plain form
11466 -52513 26556 8686 -58000 -15492 128653 177412 146532 103202 103263 74232 37968 112186
11454 112186 183509 96786 58337 96551 191934 223174 179616 139102 157158 116287 138930
11443 138930 149118 109035 154656 286054 234107 234614 183966 124101 117561 163994 147502 49208
11431 49208 -40357 -136661 -62373 61195 124639 93454 34630 54073 54454 92413 156372 235351
11419 235351 163188 106058 103742 105025 123211 171943 203537 243366 186555 186595 164199 161506 142743
11406 142743 56446 36947 59923 106536 141734 156171 233121 261421 281815 254291 165794
11395 165794 88736 81286 87850 181464 181963 164005 163072 194988 258606 251885 211933 213079 186797
11382 186797 112770 191999 162646 120450 124421 185465 153714 142206 267020 301730 207408
$$ packed form
11466e2513P9069j7870o6686M2508J44145M8759l0880m3330O1k9031l6264P4218
11454A12186P1323q6723l8449L8214R5383L1240m3558m0514J8056m0871K2643
11443A38930J0188m0083M5621J31398n1947N07n0648n9865o540M6433j6492r8294
11431D9208q9565r6304P4288J23568O3444l1185n8824J9443L81L7959O3959P8979
11419B35351p2163n7130k316J283J8186M8732L1594L9829n6811M0k2396k693j8763
11406A42743q6297j9499K2976M6613L5198J4437P6950K8300K0394k7524q8497
11395A65794p7058p450O564R3614M99j7958r33L1916O3618o721l9952J146k6282
11382A86797p4027P9229k9353m2196L971O1044l1751j1508J24814L4710r4322
$$ plain form
11371 207408 212786 192685 200892 199221 94398 31534 -12517 11640 -33663 -112026 -34366 51051
11359 51051 50367 -17394 -54386 -111799 -215271 -130615 17812 18128 -3205 29671 129582 179854
11347 179854 328460 353801 318404 434636 611476 692067 618015 578067 568647 495604 367978
11336 367978 306482 200599 188394 126991 53400 138991 172100 141159 112421 86998 78386
11325 78386 79348 85458 128479 168156 201745 193607 178213 103052 58094 72674 79100 8728 -33061
11312 -33061 -17850 -52740 9011 45179 49520 -10875 1355 -49585 -2029 74204 107763 96056
11300 96056 100488 92348 120055 96311 105694 137149 145018 175321 132130 14433 23476 65282
11288 65282 -13870 -26901 -18974 -13825 62425 135917 84149 45487 52682 112469 143653 145904
$$ packed form
11371B07408N378k0101Q207j671j04823o2864m4051K4157m5303p8363P7660Q5417
11359E1051o84o7761l6992n7413j03472Q4656J48427L16k1333L2876R9911N0272
11347A79854J48606K5341l5397J16232J76840Q0591p4052l9948r420p3043j27626
11336C67978o1496j05883j2205o1403p3591Q5591L3109l0941k8738k5423q612
11325G8386R62O110M3021L9677L3589q138j5394p5161m4958J4580O426p0372m1789
11312c3061J5211l4890O1751L6168M341o0395J2230n0940M7556P6233L3559j1707
11300I6056M432q140K7707k3744R383L1455P869L0303m3191j17697R043M1806
11288F5282p9152j3031P927N149P6250P3492n1768l8662P195N9787L1184K251
$$ plain form
11276 145904 150292 155942 135945 115821 120359 53010 47966 172 14476 117711 51391 -58563
11264 -58563 -11453 42219 71871 94755 19065 2955 13161 81605 49262 -11354 24150 81550
11252 81550 101373 49173 101720 127104 98014 51480 3370 4525 24912 16891 67192 63063
11240 63063 40388 43462 17332 103016 191292 271116 323762 384269 352250 289876 292509 361616
11228 361616 427655 417778 425617 466540 580849 611991 706374 844386 1013230 1185225 1324626
11217 1324626 1625624 2147513 3031317 4310066 5845380 7360954 8940431 10566043 12004342
11208 12004342 13088091 14010040 14598736 14192084 12839563 11243514 9316677 6905629
11200 6905629 4900443 3601064 2928612 2511567 2240892 2067891 1935185 1812375 1692260
$$ packed form
11276A45904M388N650j9997k0124M538o7349n044m7794J4304J03235o6320j09954
11264e8563M7110N3672K9652K2884p5690j6110J0206O8444l2343o0616L5504N7400
11252H1550J9823n2200N2547K5384k9090m6534m8110J155K0387q021N0301m129
11240F3063k2675L074k6130Q5684Q8276P9824N2646O0507l2019o2374K633O9107
11228C61616O6039r877P839M0923J14309L1142R4383J38012J68844J71995J39401
11217A324626L00998N21889Q83804J278749J535314J515574J579477J625612J438299
11208A2004342J083749R21949N88696m06652j352521j596049j926837k411048
11200F905629k005186j299379o72452m17045k70675j73001j32706j22810j20115
$$ plain form
11191 1692260 1536963 1360059 1275782 1216313 1151120 1143521 1182375 1165089 1075577 969570 893595
11180 893595 921158 944372 938172 851072 716446 665460 687989 687396 647284 632954 588736 561460
11168 561460 499054 477842 456181 357819 371582 338269 281679 302500 286072 259988 221648
11157 221648 197131 228498 307747 349006 293876 292349 322372 272406 178857 187911 237741 268598
11145 268598 246635 214799 140400 157827 128222 148678 188294 204742 198911 112491 158052 224555
11133 224555 237449 204705 165941 164316 223151 263028 281723 184792 96894 126807 167469 147366
11121 147366 226977 321966 317205 305883 262646 146999 73021 108325 86226 99387 106542 148559
11109 148559 165250 61809 -3969 56505 146725 137938 66272 128866 212159 216469 158559 86662
$$ packed form
11191A692260j55297j76904q4277n9469o5193p599L8854j7286q9512j06007p5975
11180H93595K7563K3214o200q7100j34626n0986K2529n93m0112j4330m4218k7276
11168E61460o2406k1212k1661r8362J3763l3313n6590K0821j6428k6084l8340
11157B21648k4517L1367P9249M1259n5130j527L0023m9966r3549R054M9830L0857
11145B68598k1963l1836p4399J7427k9605K0456L9616J6448n831q6420M5561O6503
11133B24555J2894l2744l8764j625N8835L9877J8695r6931q7898K9913M0662k0103
11121A47366P9611R4989m761j1322m3237j15647p3978L5304k2099J3161P155M2017
11109A48559J6691j03441o5778O0474R0220q787p1666O2594Q3293M310n7910p1897
$$ plain form
11097 86662 56742 50768 75608 129780 91151 -26976 -23400 -58003 -54963 -37541 19685 100099
11085 100099 82185 -9571 101568 112207 30584 24108 -8443 -27736 -30065 -13697 4139 35017
11073 35017 85982 90940 144741 114545 137181 130513 87002 10940 49191 85996 61429 135730
11061 135730 149214 95947 140464 209846 191036 114948 98752 184372 216354 198222 135988
11050 135988 159774 238475 229171 243712 333898 341959 338261 370881 393777 429863 494204 453103
11038 453103 472650 541522 579714 561867 525115 512828 632325 598140 493288 552413 608153
11027 608153 647261 739557 788331 749815 634314 579365 605058 688768 657670 582194 636283
11016 636283 691458 662364 608475 558116 493664 472474 510079 524062 524975 459828 469373 479709
$$ packed form
11097H6662k9920n974K4840N4172l8629j18127L576l4603L040J7422N7226Q0414
11085A00099j7914r1756J11139J0639q1623o476l2551j9293k329J6368J7836L0878
11073C5017N0965M958N3801l0196K2636o668m3511p6062L8251L6805k4567P4301
11061A35730J3484n3267M4517O9382j8810p6088j6196Q5620L1982j8132o2234
11050A35988K3786P8701r304J4541R0186Q061l698L2620K2896L6086O4341m1101
11038D53103J9547O8872L8192j7847l6752j2287J19497l4185j04852N9125N5740
11027F08153L9108R2296M8774l8516j15501n4949K5693Q3710l1098p5476N4089
11016F36283N5175k9094n3889n0359o4452k1190L7605J3983R13o5147R545J0336
$$ plain form
11004 479709 447008 425119 438958 438642 387855 354208 391007 357849 350561 314207 278071 166941
10992 166941 194283 208315 117877 96501 35494 25395 79053 62050 -1940 -61911 13300
10981 13300 169935 253757 262110 224033 215654 183400 325763 374591 441081 418721 475185 557152
10969 557152 701725 885941 1095256 1243556 1496968 1955593 2644497 3706551 5084114
10960 5084114 6397617 7539045 8793405 10380329 11806879 12850566 13532971 13447670 12401649
10951 12401649 11102905 10126233 8984757 7139304 5191366 3784785 3001052 2470656
10943 2470656 2210980 2046667 1875574 1722214 1589955 1437545 1297105 1258317 1190217 1039008
10933 1039008 976865 934486 869984 864760 940294 875157 786662 736785 746967 708130 661600
$$ packed form
11004D79709l2701k1889J3839l16n0787l3647L6799l3158p288l6354l6136j11130
10992A66941K7342J4032r0438k1376o1007j0099N3658j7003o3990n9971P5211
10981A3300J56635Q3822Q353l8077q379l2254J42363M8828O6490k2360N6464Q1967
10969E57152J44573J84216K09315J48300K53412M58625O88904J062054J377563
10960E084114J313503J141428J254360J586924J426550J043687O82405q5301j046021
10951A2401649j298744r76672j141476j845453j947938j406581p83733n30396
10943B470656k59676j64313j71093j53360j32259j52410j40440l8788o8100j51209
10933A039008o2143m2379o4502n224P5534o5137q8495m9877J0182l8837m6530
$$ plain form
10922 661600 589258 631640 698550 646824 608337 579991 594654 552301 499381 502718 495148 402484
10910 402484 299896 287984 318837 327387 365571 337368 270582 211110 250310 176401 231886
10899 231886 334361 316163 196653 117651 100657 158306 173739 282978 319931 275883 197342
10888 197342 145331 124802 105140 146645 171221 202076 201484 147991 188610 245879 263116 225017
10876 225017 144487 101302 147732 64944 74825 66822 -4649 -19626 -42661 -76499 -26012 4532
10864 4532 118150 172847 151842 122332 113166 152191 149934 89436 74035 57336 116353 74506
10852 74506 137912 204115 191768 166437 115523 96428 85173 186390 260138 275774 200089
10841 200089 170880 210507 211866 195993 205523 106045 44412 38805 94246 58081 -20517 -56397
$$ packed form
10922F61600p2342M2382O6910n1726l8487k8346J4663m2353n2920L337p570r2664
10910D02484j02588j1912L0853Q550L8184k8203o6786n9472L9200p3909N5485
10899B31886J02475j8198j19510p9002j6994N7649J5433J09239L6953m4048p8541
10888A97342n2011k0529j9662M1505K4576L0855n92n3493M0619N7269J7237l8099
10876B25017q0530m3185M6430q2788R881q003p1471j4977k3035l3838N0487L0544
10864D532J13618N4697k1005k9510r166L9025k257o0498j5401j6699N9017m1847
10852G4506O3406O6203j2347k5331n0914j9095j1255J01217P3748J5636p5685
10841B00089k9209L9627J359j5873R530r9478o1633n607N5441l6165p8598l5880
$$ plain form
10829 -56397 -12326 50537 116900 119207 99379 166353 119329 97427 124052 104230 162654 174825
10817 174825 195793 313054 243145 55842 -87977 -221858 -126549 19570 33454 68341
10807 68341 117468 60788 -88590 -83235 -82022 -47897 11033 135813 151608 65678 14729 -40000
10795 -40000 -87343 -44650 -49709 -14308 53160 92167 88064 65196 135660 159901 141399 142380
10783 142380 80430 -10133 -8203 -49540 -32184 -11088 88506 90770 62713 72935 158029 265852
10771 265852 188043 148645 185358 130391 63464 72990 79765 76995 114990 132819 92152 40466
10759 40466 27000 49087 116998 87280 29697 99120 102175 71923 142630 112465 95746 31810
10747 31810 -33567 25748 140503 121879 132566 209805 179110 176857 168182 94862 81203 124374
$$ packed form
10829e6397M4071O2863O6363K307j9828O6974m7024k1902K6625j9822N8424J2171
10817A74825K0968J17261o9909j87303j43819j33881R5309J46119J3884L4887
10807F8341M9127n6680j49378N355J213L4125N8930J24780J5795q5930n0949n4729
10795d0000m7343M2693n059L5401O7468L9007m103k2868P0464K4241j8502R81
10783A42380o1950r0563J930m1337J7356K1096R9594K264k8057J0222Q5094J07823
10771B65852p7809l9398L6713n4967o6927R526O775k770L7995J7829m0667n1686
10759D0466j3466K2087O7911k9718n7583O9423L055l0252P0707l0165j6719o3936
10747C1810o5377N9315J14755j8624J0687P7239l0695k253q675p3320j3659M3171
$$ plain form
10735 124374 132407 180748 205167 228782 212545 125755 255163 400678 415093 425845 387069
10724 387069 297862 296526 339087 375509 383178 397387 363726 424027 388839 383528 430333 478505
10712 478505 482084 442796 509771 578952 542904 466826 456807 470647 524926 571203 520594 519949
10700 519949 472808 450312 465860 565720 582165 640216 609292 592720 583670 657847 634099 518832
10688 518832 401508 435814 425701 448809 430697 462765 504027 475564 478729 479916 417568 427299
10676 427299 415288 452984 531741 663076 591629 613391 677915 671268 660162 584435 511764
10665 511764 503814 607965 725637 856946 905396 942944 959568 1005694 1092393 1137771 1155565
10654 1155565 1298636 1283984 1248274 1188449 1082324 1090215 1119631 1214902 1295420 1393998 1504094
$$ packed form
10735A24374Q033M8341K4419K3615j6237q6790J29408J45515J4415J0752l8776
10724C87069q9207j336M2561L6422P669J4209l3661O0301l5188n311M6805M8172
10712D78505L579l9288O6975O9181l6048p6078j0019J3840N4279M6277n0609o45
10700E19949m7141k2496J5548R9860J6445N8051l0924j6572r050P4177k3748j15267
10688E18832j17324L4306j0113K3108j8112L2068M1262k8463L165J187o2348R731
10676D27299j2011L7696P8757J31335p1447K1762O4524o647j1106p5727p2671
10665E11764p950J04151J17672J31309M8450L7548J6624M6126Q6699M5378J7794
10654A155565J43071j4652l5710n9825j06125P891K9416R5271Q0518R8578J10096
$$ plain form
10643 1504094 1575411 1716476 1802229 1934076 2121622 2352552 2508707 2650796 2914452 3213225
10633 3213225 3573754 4053009 4610948 5210906 5942349 6964521 8233935 9978403 12240476
10624 12240476 15086092 18319253 21791135 25164740 28443546 31716121 34830398 37899983
10616 37899983 40717235 43024348 44816666 46826569 49810974 53906219 58849527 63878248
10608 63878248 68614844 73275543 77926107 82215681 85464884 87025078 86770556 86082654
10600 86082654 86984831 90007718 94312158 98701873 102940061 107056622 110711620 113253163
10592 113253163 113705039 110987688 104936172 97773127 92169115 89009784 87740900 87442458
10584 87442458 87370944 87598187 87792704 87113610 85082697 80800669 74269699 67063982 61095319
$$ packed form
10643A504094P1317J41065Q5753J31847J87546K30930J56155J42089K63656K98773
10633C213225L60529M79255N57939N99958P31443J022172J269414J744468K262073
10624A2240476K845616L233161L471882L373605L278806L272575L114277L069585
10616C7899983K817252K307113J792318K009903K984405M095245M943308N028721
10608F3878248M736596M660699M650564M289574L249203J560194k54522o87902
10600H6082654R02177L022887M304440M389715M238188M116561L654998K541543
10592A13253163M51876k717351o051516p163045n604012l159331j268884k98442
10584H7442458p1514K27243J94517o79094k030913m282028o530970p205717n968663
$$ plain form
10575 61095319 56865043 54077202 52110770 50608299 49220787 47703376 45808610 43347972
10567 43347972 39840799 35505950 30940230 26916313 23665884 21129531 19181465 17566538
10559 17566538 16281585 15239627 14429630 13697355 12961401 12373813 11811081 11213863 10577837
10550 10577837 10079765 9635490 9321017 8999948 8660280 8336297 8078308 7773356 7497283
10541 7497283 7223486 6860682 6676351 6475917 6189156 6033203 5913873 5702079 5474835
10532 5474835 5267194 5035691 4885394 4828239 4714858 4529123 4392182 4370742 4266501 4099093
10522 4099093 4011366 3940208 3767638 3635490 3564147 3523452 3428030 3389180 3335167 3304801 3215632
10511 3215632 3026275 2834967 2783590 2778260 2631364 2522003 2463494 2357324 2261753 2188989
$$ packed form
10575F1095319m230276k787841j966432j502471j387512j517411j894766k460638
10567D3347972l507173m334849m565720m023917l250429k536353j948066j614927
10559A7566538j284953j041958q09997p32275p35954n87588n62732n97218o36026
10550A0577837m98072m44275l14473l21069l39668l23983k57989l04952k76073
10541G497283k73797l62804j84331k00434k86761j55953j19330k11794k27244
10532E474835k07641k31503j50297n7155j13381j85735j36941k1440j04241j67408
10522D099093q7727p1158j72570j32148p1343m0695r5422l8850n4013l0366q9169
10511C215632j89357j91308n1377n330j46896j09361n8509j06170r5571p2764
$$ plain form
10501 2188989 2093993 2121420 2078674 2086675 2082960 1929314 1805254 1834778 1740791 1666600 1683729
10490 1683729 1654502 1577724 1559757 1418103 1297398 1245225 1257765 1234912 1300194 1326383 1346694
10479 1346694 1356449 1250452 1179529 1051181 1058375 1127910 1089417 994058 940158 979590 929138
10468 929138 907854 914547 908062 889028 916033 885359 937650 945883 883497 827649 774435 750190
10456 750190 682556 548515 469075 517655 574100 595802 638537 536386 563525 583180 568890
10445 568890 528978 465717 442182 390069 331959 393789 441797 444977 470915 516669 541411 506803
10433 506803 500334 446588 406054 403641 413504 348825 301210 232217 157988 223221 176656 140607
10421 140607 167717 217983 278151 306651 271191 279117 378918 396120 350680 358935 377862 382600
$$ packed form
10501B188989r4996K7427m2746Q001l715j53646j24060K9524r3987p4191J7129
10490A683729k9227p6778j7967j41654j20705n2173J2540k2853O5282K6189K0311
10479A346694R755j05997p0923j28348P194O9535l8493r5359n3900L9432n0452
10468I29138k1284O693o485j9034K7005l0674N2291Q233o2386n5848n3214k4245
10456G50190o7634j34041p9440M8580N6445K1702M2735j02151K7139J9655j4290
10445E68890l9912o3261k3535n2113n8110O1830M8008L180K5938M5754K4742l4608
10433E06803o469n3746m0534k413R863o4679m7615o8993p4229O5233m6565l6049
10421A40607K7110N0266O0168K8500l5460P926R9801J7202m5440Q255J8927M738
$$ plain form
10409 382600 327343 285349 261465 277536 266060 248588 245915 354025 401597 326477 290208
10398 290208 287712 333093 316771 347470 409824 391656 267426 179749 204025 241427 264650
10387 264650 396356 406867 296549 327453 274702 175922 181293 203467 258015 304702 251158
10376 251158 155953 196497 242918 268319 266849 273849 270288 220171 187000 227822 192173 171210
10364 171210 154310 229987 264971 302768 287081 204460 189652 267083 299420 271321 229985
10353 229985 195825 260679 322666 269510 224087 162281 195433 242115 262736 271151 179789 112408
10341 112408 193416 194323 180262 163168 106029 58355 32558 120162 144528 98036 56283 -4124
10329 -4124 38405 62721 69498 91445 94885 97506 104000 208944 115748 114731 165465 113372 136454
$$ packed form
10409C82600n5257m1994k3884J6071j1476j7472k673J08110M7572p5120l6269
10398B90208k496M5381j6322L0699O2354j8168j24230q7677K4276L7402K3223
10387B64650J31706J0511j10318L0904n2751r8780N371K2174N4548M6687n3544
10376B51158r5205M0544M6421K5401j470P000l561n0117l3171M0822l5649k0963
10364A71210j6900P5677L4984L7797j5687q2621j4808P7431L2337k8099m1336
10353B29985l4160O4854O1987n3156m5423o1806L3152M6682K0621Q415r1362o7381
10341A12408Q1008R07j4061j7094n7139m7674k5797Q7604K4366m6492m1753o0407
10329d124M2529K4316O777K1947L440K621O494J04944r3196j017N0734n2093K3082
$$ plain form
10316 136454 164649 118246 166096 216037 200934 140035 132571 115476 143784 241580 225992 85131
10304 85131 57376 116773 115910 154040 154603 204528 192738 194618 169704 151212 147693 193650 153129
10291 153129 148043 93013 36574 -35916 -33917 -35283 -36653 -22262 -14639 69190 115750 130615
10279 130615 184311 182195 69306 27257 -38698 -8489 135262 204177 185276 117739 130717
10268 130717 44945 17290 9120 50163 89707 57708 45765 67641 7616 -17362 -23194 -36876
10256 -36876 -81868 -3107 22737 -3198 36580 33590 4151 -32975 -70606 -52933 -7724 98693
10244 98693 159599 86233 97164 132473 125225 82553 33848 75357 91700 123034 94541 77982
10232 77982 81852 80196 75778 133813 165186 143405 87778 50263 137040 142725 75000 70698 134108
$$ packed form
10316A36454K8195m6403M7850M9941j5103o0899p464j7095K8308R7796j5588j40861
10304H5131k7755N9397q63L8130N63M9925j1790J880k4914j8492l519M5957m0521
10291A53129n086n5030n6439p2490J999j366j370J4391P623Q3829M6560J4865
10279A30615N3696k116j12889m2049o5955L0209J43751O8915j8901o7537J2978
10268A30717q5772k7655q170M1043L9544l1999j1943K1876o0025k4978n832j3682
10256c6876m4992P8761K5844k5935L9778k990k9439l7126l7631J7673M5209J06417
10244I8693O0906p3366J0931L5309p248m2672m8705M1509J6343L1334k8493j6559
10232G7982L870j656m418N8035L1373k1781n5627l7515Q6777N685o7725m302O3410
$$ plain form
10219 134108 114962 52499 84895 93671 93423 99863 39802 -94856 -55270 56161 139203 64894
10207 64894 -10936 -57418 -31196 -21300 -32029 16669 50722 -6229 -164251 -101718 -13220 62782
10195 62782 120637 86978 62177 45111 147515 163500 101800 28962 82551 121946 210083
10184 210083 242110 196157 192851 160524 254609 355000 393131 369070 460287 471649 463877 446519
10172 446519 313735 335077 483121 469820 407793 389523 499386 545721 584693 592299 566761
10161 566761 576664 551416 594081 547763 545815 522350 539642 557721 532167 540517 494188 460607
10149 460607 486920 428439 445698 471094 515783 520320 476312 436273 404355 271344 264139 331032
10137 331032 342447 276110 327799 257965 142302 188211 210492 251404 126401 -1937 7100
$$ packed form
10219A34108j9146o2463L2396Q776k48O440o0061j34658L9586J11431Q3042p4309
10207F4894p5830m6482K6222R896j0729M8698L4053n6951j58022O2533Q8498P6002
10195F2782N7855l3659k4801j7066J02404J5985o1700p2838N3589L9395Q8137
10184B10083L2027m5953l306l2327R4085J00391L8131k4061R1217J1362p772j7358
10172D46519j32784K1342J48044j3301o2027j8270J09863M6335L8972P606k5538
10161E66761R903k5248M2665m6318j948k3465J7292J8079k5554Q350m6329l3581
10149D60607K6313n8481J7259K5396M4689M537m4008m0039l1918j33011p205O6893
10137C31032J1415o6337N1689o9834j15663M5909K2281M0912j25003j28338R037
$$ plain form
10126 7100 24199 57900 100715 238092 281402 240306 229345 233228 264614 177987 192248 193265
10114 193265 188871 54036 2098 -22617 -61470 -3214 82964 42147 33895 47406 85087 7952
10102 7952 -68778 -52338 37311 47448 55862 43845 31028 62429 51603 25762 9653 -43003
10090 -43003 -27158 13546 -43464 -118301 -112804 -91260 -86261 -33446 -48968 -14826 -41433 -50376
10078 -50376 -10100 80917 62993 -35358 6515 -1163 -22828 -1094 16621 21343 38459 9661
10066 9661 6351 18760 15061 -4284 14662 1580 -43589 -79213 -107672 -61707 -87848 -124575
10054 -124575 -100029 10117 39162 -43806 -51929 -8156 19154 88947 111177 80063 34994
10043 34994 40387 67052 116064 89047 113329 121911 34769 -15702 -6245 40201 -8417 75786
$$ packed form
10126G100J7099L3701M2815J37377M3310m1096j0961L883L1386q6627J4261J017
10114A93265m394j34835n1938k4715l8853N8256Q6178m0817q252J3511L7681p7135
10102G952p6730J6440Q9649J0137Q414j2017j2817L1401j0826k5841j6109n2656
10090d3003J5845M0704n7010p4837N497K1544M999N2815j5522L4142k6607q943
10078e0376M0276R1017j7924r8351M1873p678k1665K1734J7715M722J7116k8798
10066I661l310J2409l699j9345J8946j3082m5169l5624k8459M5965k6141l6727
10054a24575K4546J10146K9045q2968q123M3773K7310O9793K2230l1114m5069
10043C4994N393K6665M9012k7017K4282Q582q7142n0471R457M6446m8618Q4203
$$ plain form
10031 75786 228239 201519 139493 22368 1736 85214 130579 71726 -68715 -66768 -47839
10020 -47839 -36257 9171 49696 9368 -58698 -14135 -2788 -65124 34652 99705 183132 179834
10008 179834 134789 23615 693 -26760 -98444 -146986 -158177 -132931 -75494 -34755 28361
9997 28361 59786 87057 79743 18226 51808 29895 -31952 -25769 22486 -27864 -50214 25332
9985 25332 86646 142746 157332 134870 8284 -14041 32889 53416 -61015 -57811 -6791 65030
9973 65030 107706 129025 29645 -17768 52678 137850 106230 14300 49034 60994 61771 22571
9961 22571 31486 36525 47911 85795 118374 123047 81149 -34043 -2277 21628 9217 -55010
9949 -55010 -101485 -93014 -60159 -7682 1652 50258 120363 127326 114261 104080 78003 82231 116351
$$ packed form
10031G5786J52453k6720o2026j17125k0632Q3478M5365n8853j40441J947J8929
10020d7839J1582M5428M0525m0328o8066M4563J1347o2336R9776O5053Q3427l298
10008A79834m5045j11174k2922k7453p1684m8542j1191K5246N7437M0739O3116
9997B8361L1425K7271p314o1517L3582k1913o1847O183M8255n0350k2350P5546
9985B5332O1314N6100J4586k2462j26586k2325M6930K0527j14431L204N1020P1821
9973F5030M2676K1319r9380m7413P0446Q5172l1620r1930L4734J1960P77l9200
9961B2571Q915N039J1386L7884L2579M673m1898j15192L1766K3905j2411o4227
9949e5010m6475Q471L2855N2477R334M8606P0105O963j3065j0181k6077M228L4120
$$ plain form
9936 116351 100515 145294 179672 175554 193752 294533 282467 105965 25704 -14925 50375
9925 50375 48287 46621 -33318 -37031 -17082 -56257 -312 13069 20673 -18554 -16999 50073 59640
9912 59640 54144 -32501 -8736 -51181 -11248 46313 65952 41650 51933 30784 -5055 841
9900 841 5813 59714 58743 -53912 -84016 -53339 -23145 -22646 -66841 -12366 100531 104192 174299
9887 174299 245542 277508 284362 313374 254064 242939 217400 166354 182690 152856 135329 178548
9875 178548 191080 58751 19469 -31556 2945 36034 15147 68 38413 118134 140797
9864 140797 155618 122490 146074 157564 155465 93833 67725 37833 105306 211779 231941 200493
9852 200493 91488 -748 -27430 53814 58763 33177 79874 100816 118066 151161 82241 24328
$$ packed form
9936A16351j5836M4779L4378m118J8198J00781j2066j76502q0261m0629O5300
9925E0375k088j666p9939l713J9949l9175N5945J3381P604l9227J555O7072R567
9912E9640n496q6645K3765m2445L9933N7561J9639k4302J0283k1149l5839N896
9900H41M972N3901r71j12655l0104L0677L0194M99m4195N4475J12897L661P0107
9887A74299P1243L1966O854K9012n9310j1125k5539n1046J6336k9834j7527M3219
9875A78548J2532j32329l9282n1025L4501L3089k0887j5079L8345P9721K2663
9864A40797J4821l3128K3584J1490k099o1632k6108k9892O7473J06473K0162l1448
9852B00493j09005r2236k6682Q1244M949k5586M6697K0942J7250L3095o8920n7913
$$ plain form
9840 24328 106082 67812 -56510 -55305 2838 58268 13508 -50153 -35476 -140303 -239544 -50606
9828 -50606 79620 75524 64909 80589 53218 11896 -27245 -42090 -36093 45099 42622 25586
9816 25586 7014 -6328 -51652 -74394 -111960 -105394 -99349 -49774 29711 16953 30889 -10399
9804 -10399 10724 12374 12389 -70821 -81414 -97679 -147386 -96819 -63940 -24204 7391 -6772 37029
9791 37029 93665 108541 113579 89314 67104 18377 45815 105445 142253 99679 -21573 -88584
9779 -88584 -73758 -18047 31626 -4853 -27793 -37656 734 -28268 55558 99640 109965 88965
9767 88965 53431 -45717 -64945 -21778 -25581 -54975 51242 111795 79567 34755 -44856 -48044
9755 -48044 -4627 -51100 43452 14103 14476 20771 -4750 -61559 -51892 -60414 -47910 37962 46582
$$ packed form
9840B4328Q1754l8270j24322J205N8143N5430m4760o3661J4677j04827r9241J88938
9828e0606J30226m096j0615J5680k7371m1322l9141j4845N997Q1192k477j7036
9816B5586j8572j3342m5324k2742l7566O566O045M9575P9485j2758J3936m1288
9804a0399K1123J650J5q3210j0593j6265m9707N0567L2879L9736L1595j4163M3801
9791C7029N6636J4876N038k4265k2210m8727K7438N9630L6808m2574j21252o7011
9779h8584J4826N5711M9673l6479k2940r863L8390k9002Q3826M4082J0325k1000
9767H8965l5534r9148j9228M3167l803k9394J06217O0553l2228m4812p9611l188
9755d8044M3417m6473R4552k9349L73O295k5521n6809R667q522J2504Q5872Q620
$$ plain form
9742 46582 1463 4123 92912 158904 187729 146263 91057 35177 52120 93187 49891 -27094
9730 -27094 -53052 -15320 9059 14400 114562 16005 -118029 -69581 -47973 -19804 -24921 -36753
9718 -36753 -25502 -93358 -101380 -101440 -9150 713 -52846 -85855 -35188 -63842 -104110 -49210 -29202
9705 -29202 -126092 -134553 -11124 35904 103454 101954 87940 133184 132633 133516 113437 79358 49984
9692 49984 49303 122161 154658 68153 -7860 -29558 -177778 -147524 -46375 -24244 -66187 -64850
9680 -64850 -97365 -83116 -79260 -42901 11454 -15225 -27867 77526 110715 116844 122986 108312
9668 108312 131738 66018 -5672 39845 118166 29367 101581 104765 22615 -17035 -43730 -8040
9656 -8040 1021 -18718 -13412 54256 45737 39254 4780 -22018 -33879 -10760 4020 -54268 -83481
$$ packed form
9742D6582m5119K660Q8789O5992K8825m1466n5206n5880J6943M1067m3296p6985
9730b7094k5958L7732K4379N341J00162r8557j34034M8448K1608K8169n117j1832
9718c6753J1251o7856q022o0R2290R863n3559l3009N0667k8654m0268N4900K0008
9705b9202r6890q461J23429M7028O7550j500j4014M5244n51Q83k0079l4079k9374
9692D9984o81P2858L2497q6505p6013k1698j48220L0254J01149K2131m1943J337
9680f4850l2515J4249L856L6359N4355k6679j2642J05393L3189O129O142j4674
9668A08312K3426o5720p1690M5517P8321q8799P2214L184q2150l9650k6695L5690
9656h040R061j9739N306O7668q519o483l4474k6798j1861K3119J4780n8288k9213
$$ plain form
9643 -83481 -43325 9437 -35346 517 -4831 58842 57886 26488 30716 -50173 -50627 -31026 -73366
9630 -73366 -69697 -98802 -160700 -109514 -88372 -129303 -68186 -46514 -19367 55232 6540 -16484
9618 -16484 -56724 -84336 -7813 47152 67971 81455 29177 -63660 -100852 -36324 -7694 52412
9606 52412 -6222 -80932 -16378 -35383 -68643 -53532 -95328 -96823 -71289 16097 84885 75205
9594 75205 37861 -28051 -31082 -54993 -40726 -102752 -48878 2186 106732 117558 90139 557
9582 557 11720 -43557 -55704 27144 12514 -96863 -69126 -21479 9100 -25425 42731 61947
9570 61947 113969 170006 173504 235566 211251 131106 36660 -36617 13700 -43502 -111479 -44791
9558 -44791 -4636 21878 82037 141064 214021 227796 220208 77134 -30521 -37093 -33779 -95531
$$ packed form
9643h3481M0156N2762m4783L5863n348O3673r56l1398M228q0889m54J9601m2340
9630g3366L669k9105o1898N1186K1142m0931O1117K1672K7147P4599m8692k3024
9618a6484m0240k7612P6523N4965K0819J3484n2278r2837l7192O4528K8630O0106
9606E2412n8634p4710O4554j9005l3260J5111m1796j495K5534Q7386O8788r680
9594G5205l7344o5912l031k3911J4267o2026N3874N1064J04546J0826k7419q9582
9582E57J1163n5277j2147Q2848j4630j09377K7737M7647L0579l4525O8156J9216
9570F1947N2022N6037L498O2062k4315q0145r4446p3277N0317n7202o7977O6688
9558d4791M0155K6514O0159N9027P2957J3775p588j43074j07655o572L314o1752
$$ plain form
9546 -95531 -85746 -5831 -16444 -45005 -23962 -3866 -14986 5777 25957 15519 -45518 -88976
9534 -88976 -55618 -67290 21375 45629 75345 109382 41368 -16860 -16257 13298 82001 81150 32736
9521 32736 45098 143824 178402 112582 94498 111652 117768 17748 -3714 -69304 -175733 -231505
9509 -231505 -217475 -273500 -279938 -130136 -18749 14293 -6613 5612 1290 -35857 8125 9403
9497 9403 47459 62359 -1502 -36214 -47317 -67935 -146331 -164297 -21853 57007 62951 132215
9485 132215 92095 50208 19525 4847 -91240 -135658 -109845 -114451 -63487 1178 -61406 -153649
9473 -153649 -170119 -127527 -90265 6055 24598 -27713 -62483 -61236 32006 42903 27193 54035
9461 54035 54120 10423 90025 39709 16684 39567 -27527 -43091 -24064 -32285 -95733 -128333 -108428
$$ packed form
9546i5531R785P9915j0613k8561K1043K0096j1120K0763K0180j0438o1037m3458
9534h8976L3358j1672Q8665K4254K9716L4037o8014n8228O03K9555O8703q51m8414
9521C2736J2362R8726L4578o5820j8084J7154O116j00020k1462o5590j06429n5772
9509b31505J4030n6025o438J49802J11387L3042k0906J2225m322l7147M3982J278
9497I403L8056J4900o3861l4712j1103k0618p8396j7966J42444P8860N944O9264
9485A32215m0120m1887l0683j4678r6087m4418K5813m606N0964O4665o2584r2243
9473a53649j6470M2592L7262R6320J8543n2311l4770J247R3242J0897j5710K6842
9461E4035Q5m3697P9602n0316k3025K2883o7094j5564J9027q221o3448l2600J9905
$$ plain form
9448 -108428 -116217 -79626 -41159 -56569 -50275 -38600 30603 87683 100913 124649 75483 7235
9436 7235 -56363 -29758 52154 108575 66207 37850 27440 15551 55646 116999 100032 9746
9424 9746 -17886 -31786 -10293 -1326 -138691 -214309 -198535 -85058 -41592 -15464 54351 67551
9412 67551 42639 99964 63455 18380 -17495 -32985 -12186 -33676 4811 16427 52423 36731
9400 36731 -23410 -53189 53578 7274 -51133 24392 9131 -102255 -150938 -98660 -38264
9389 -38264 -30922 23116 -40698 -3667 75641 122254 93729 27752 62518 -40514 -73257 42874
9377 42874 5726 35023 101435 66154 -1289 97212 112698 19932 1097 64157 75031 121517
9365 121517 111329 144593 158182 207170 224915 233149 214532 184674 39924 -41934 -58694 19027
$$ packed form
9448a08428p789L6591L8467j5410O294J1675O9203N7080J3230K3736m9166o8248
9436G235o3598K6605Q1912N6421m2368k8357j0410j1889M0095O1353j6967r0286
9424I746k7632j3900K1493Q967j37365p5618J5774J13477M3466K6128O9815J3200
9412F7551k4912N7325l6509m5075l5875j5490K0799k1490L8487J1616L5996j5692
9400C6731o0141k9779J06767m6304n8407P5525j5261j11386m8683N2278O0396
9389c8264P342N4038o3814L7031P9308M6613k8525o5977L4766j03032l2743J16131
9377D2874l7148K9297O6412l5281o7443R8501J5486r2766j8835O3060J0874M6486
9365A21517j0188L3264J3589M8988J7745Q234j8617k9858j44750q1858j6760P7721
$$ plain form
9353 19027 94770 102998 130682 50645 51030 -67133 -173570 -95955 -37946 -69782 -76547 -90074
9341 -90074 -54945 -117107 -115597 -49049 -53730 -78136 -68778 -3501 -54907 -101677 -92751 -51481 -78135
9328 -78135 -51016 -18046 18580 78877 66262 -13976 -44064 -81632 -119352 -63601 -36710 -68899
9316 -68899 -65472 -102803 -105222 -99222 -71793 -38132 24520 -28888 7189 53518 38346 -100042
9304 -100042 18959 17476 -45024 -26702 -17136 -94708 -95721 -8401 29849 -52944 -76777 17023
9292 17023 4101 30480 11962 -11373 -22611 -93986 -100821 21310 51820 28415 26924 -11159
9280 -11159 5139 57339 -50045 -188338 -163018 -148492 -121418 -27891 -9268 -72640 -72959 -58366
9268 -58366 -23888 48499 66953 26474 48586 83103 10261 -5112 133903 113206 -37238
$$ packed form
9353A9027P5743Q228K7684q0037L85j18163j06437P7615N8009l1836o765j3527
9341i0074L5129o2162J510O6548m681k4406R358O5277n1406m6770Q926M1270k6654
9328g8135K7119L2970L6626O0297j2615q0238l0088l7568l7720N5751K6891l2189
9316f8899L427l7331k419O000K7429L3661O2652n3408L6077M6329j5172j38388
9304a00042J19001j483o2500J8322R566p7572j013Q7320L8250q2793k3833R3800
9292A7023j2922K6379j8518k3335j1238p1375o835J22131L0510k3405j491l8083
9280a1159J6298N2200j07384j38293K5320J4526K7074R3527J8623o3372l19J4593
9268e8366L4478P2387J8454m0479K2112L4517p2842j5373J39015k0697j50444
$$ plain form
9257 -37238 -22153 -25997 -31499 -31346 -1644 42490 -50786 -29644 78186 102750 61186 94853
9245 94853 40609 13253 70910 134882 29604 -23517 -12303 -12364 30576 25777 45794 12464
9233 12464 -42900 -78471 -34283 35615 59328 109556 43380 -16455 17508 74664 76540 59164
9221 59164 21605 19249 -62099 -43951 -46842 -26115 40065 103365 25357 24837 28604 -31766 12631
9208 12631 14593 33303 40502 -63051 -108148 -64350 -9223 -13185 -38988 -182019 -198662 -191060
9196 -191060 -153043 -132158 -124494 -106275 -200788 -133894 -127177 -83198 4514 48612 35574 51959
9184 51959 49281 -3613 -48652 -91344 -73880 -58317 6710 26202 -49751 -73613 -12030 84177
9172 84177 116608 81743 122323 77209 112989 191413 151907 39923 -5873 -43487 -110717 -153501
$$ packed form
9257c7238J5085l844n502J53K9702M4134r3276K1142J07830K4564m1564L3667
9245I4853n4244k7356N7657O3972j05278n3121J1214o1M2940m799K0017l3330
9233A2464n5364l5571M4188O9898K3713N0228o6176n9835L3963N7156J876j7376
9221E9164l7559k356q1348J8148k891K0727O6180O3300p8008n20L767o0370M4397
9208A2631J962J8710P199j03553m5097M3798N5127l962k5803j43031j6643P602
9196a91060L8017K0885P664J8219r4513O6894O717M3979Q7712M4098j3038J6385
9184E1959k678n2894m5039m2692J7464J5563O5027J9492p5953k3862O1583R6207
9172H4177L2431l4865M0580m5114L5780P8424l9506j11984m5796l7614o7230m2784
$$ plain form
9160 -153501 -87109 3553 46816 1568 -14442 -16786 -49790 -48717 -4921 -77043 -107101 -96915
9148 -96915 -141716 -77021 44095 78996 -63798 -76167 -31522 -46138 -55450 -66306 -75493 -64232
9136 -64232 -77156 -164223 -151035 -67164 20600 57328 40396 26118 -21852 -69915 -142085 -128830
9124 -128830 -100445 -93891 -118990 -96889 -42182 34264 123106 42582 -29676 -136854 -154962 -26769
9112 -26769 95251 51683 -11982 -126881 -111893 -127136 -176060 -100451 -5106 -26286 -44716
9101 -44716 39050 47012 -30985 -145019 -118688 -37853 -54589 -86835 -9709 -4008 19664 101994
9089 101994 74141 -6401 -9423 -23385 -5203 -44800 -109862 -54888 -29956 -27663 -70603 -49760
9077 -49760 -50041 -55347 -67790 -138968 -112234 -67424 -30334 11347 981 97399 93134 113096 18586
$$ packed form
9160a53501O6392R0662M3263m5248j6010k344l3004J073M3796p2122l0058J0186
9148i6915m4801O4695J21116L4901j42794j2369M4645j4616r312j0856r187J1261
9136f4232j2924q7067J3188Q3871Q7764L6728j6932j4278m7970m8063p2170J3255
9124a28830K8385O554k5099K2101N4707P6446Q8842q0524p2258j07178j8108J28193
9112b6769J22020m3568o3665j14899J4988j5243m8924P5609R5345k1180j8430
9101d4716Q3766P962p7997j14034K6331Q0835j6736l2246P7126N701K3672Q2330
9089A01994k7853q0542l022j3962J8182l9597o5062N4974K4932K293m2940K0843
9077d9760k81n306j2443p1178K6734M4810L7090M1681j0366R6418m265J9962r4510
$$ plain form
9064 18586 -63617 -38466 -11771 -31582 -102700 -245245 -222331 -135475 -125499 -58606 -34901 -57931
9052 -57931 -21600 -10390 20801 92356 26630 -60474 -57715 -12971 -20263 -68728 -120055 -100285
9040 -100285 -117553 -163730 -21657 97545 -18150 -62868 -101267 -110654 -145244 -235273 -180718
9029 -180718 -97929 -116181 -65460 -98302 -93057 -37642 -57726 -104354 -29487 -36535 -21900 -46955
9017 -46955 -77771 -99103 -33567 -51918 -97746 -59400 -111960 -106127 -92049 -89325 -71768 -2184
9005 -2184 -20828 -41977 -56281 -76276 -1386 61823 77695 21512 -29580 -21635 10703 45788
8993 45788 16014 -6566 -2569 -88481 -140620 -146227 -131546 -99359 -63717 -35863 97812 98233
8981 98233 -26909 -98978 -89821 -85758 -45560 -66600 -38678 -41102 -4582 42996 32914 38974
$$ packed form
9064A8586q2203K5151K6695j9811p1118j42545K2914Q6856R976O6893K3705k3030
9052e7931L6331J1210L1191P1555o5726q7104K759M4744p292m8465n1327J9770
9040a00285j7268m6177J42073J19202j15695m4718l8399r387l4590r0029N4555
9029a80718Q2789j8252N0721l2842N245N5415k0084m6628P4867p048J4635k5055
9017d6955l0816k1332O5536j8351m5828L8346n2560N833J4078K724J7557O9584
9005b184j8644k1149j4304j9995P4890O3209J5872n6183n1092P945L2338L5085
8993D5788k9774k2580L997q5912n2139n607J4681L2187L5642K7854J33675M21
8981I8233j25142p2069R157M063M0198k1040K7922k424L6520M7578j0082O060
$$ plain form
8969 38974 74709 81269 84375 79588 70063 104794 58306 27158 99188 134013 126248 88144 53783
8956 53783 -13044 1546 -3728 -3396 52365 143091 79106 16283 -41481 -83819 -127905 -173081
8944 -173081 -11896 -48303 -105764 -87684 31873 15367 1450 -26349 64362 62191 9223
8933 9223 -32301 31770 51733 78086 121857 102595 6582 -13335 -41804 -53731 -69831 -64064
8921 -64064 -126539 -113516 -57117 -20855 -33019 23115 14693 30174 40598 101615 31777 -31029
8909 -31029 35533 -24192 -33190 -51870 -83016 -79511 -85460 -110561 -104224 -110299 -89318 23922 1547
8896 1547 -106246 -66114 54808 65531 -65069 -125039 -71969 -55699 -79876 -55372 -37306
8885 -37306 -92971 -184099 -218678 -163220 -117720 -23812 40396 -49365 -144862 -89059 -119809 -154363
$$ packed form
8969C8974L5735O560L106m787r525L4731m6488l1148P2030L4825p765l8104l4361
8956E3783o6827J4590n274L32N5761R0726o3985o2823n7764m2338m4086m5176
8944a73081J61185l6407n7461J8080J19557j6506j3917k7799R0711k171n2968
8933I223m1524O4071J9963K6353M3771j9262r6013j9917k8469j1927j6100N767
8921f4064o2475J3023N6399L6262j2164N6134q422J5481J0424O1017o9838o2806
8909c1029O6562n9725q998j8680l1146L505n949k5101O337o075K0981J13240k2375
8896A547j07793M0132J20922J0723j30600n9970N3070J6270k4177K4504J8066
8885c7306n5665r1128l4579N5458M5500R3908O4208q9761r5497N5803l0750l4554
$$ plain form
8873 -154363 -224616 -202877 -135899 -73414 -20335 67471 110371 23712 -35891 27362 32453 32059
8861 32059 13180 -14296 66059 146254 107287 15118 -79767 -103210 -44678 46758 25589 -82815
8849 -82815 -79577 -31371 -12399 -70813 -60052 -70793 -80651 -39135 -25080 13587 95294 37804
8837 37804 -1379 -19793 -38453 -70067 -131496 -224633 -179300 -28190 32127 56328 104866 2056
8825 2056 -135145 -130388 -178241 -136382 -108114 -153816 -234731 -139355 -34818 -97642 -150110 -168617
8813 -168617 -97254 -57314 -125229 -93485 -41877 -46259 1477 41782 117395 99646 18735 -96833
8801 -96833 -138402 -77462 -122288 -118490 -53887 -11956 -108888 -161002 -106844 -50157 -44305 -104665
8789 -104665 -153699 -112243 -70799 -7781 -1186 120540 154194 98178 60505 -8151 -65852 -20374
$$ packed form
8873a54363p0253K1739O6978O2485N3079Q7806M2900q6659n9603O3253N091l94
8861C2059j8879k7476Q0355Q0195l8967r2169r4885k3443N8532R1436k1169j08404
8849h2815L238M8206J8972n8414J0761j0741r858M1516J4055L8667Q1707n7490
8837C7804l9183j8414j8660l1614o1429r3137M5333J51110O0317K4201M8538j02810
8825B056j37201M757m7853M1859K8268m5702q0915R5376J04537o2824n2468j8507
8813a68617P1363L9940o7915L1744N1608m382M7736M0305P5613j7749q0911j15568
8801i6833m1569O0940m4826L798O4603M1931r6932n2114N4158N6687N852o0360
8789a04665m9034M1456M1444O3018O595J21726L3654n6016l7673o8656n7701M5478
$$ plain form
8777 -20374 38263 50851 43178 88479 91656 -27087 -69571 -92122 -79535 32303 45430 116166
8765 116166 61214 94383 158146 88470 -4884 -84072 -15232 -29452 -28208 -22815 -29503 -17481
8753 -17481 18889 -36341 3356 27420 5574 -6673 33545 -6405 -14524 -1579 107180 144071
8741 144071 132803 67781 99704 126849 100730 132571 83615 33630 80968 123336 76136 44319
8729 44319 82791 66471 64879 56913 33831 4210 -55869 -3460 -722 -75401 -135186 -88695
8717 -88695 -69799 -11248 -67544 -131251 -99526 -16176 133892 64523 -66418 -89142 -44443
8706 -44443 -17886 -27153 5810 -15051 -33771 11576 38168 -3080 -68269 -70875 -43872 -15457
8694 -15457 8182 -29195 -29396 96092 129456 71043 3531 -78973 -35645 -19751 -33617 -79622
$$ packed form
8777b0374N8637J2588p673M5301L177j18743m2484k2551J2587J11838J3127P0736
8765A16166n4952L3169O3763o9676r3354p9188O8840j4220J244N393o688J2022
8753a7481L6370n5230L9697K4064k1846j2247M0218l9950q119J2945J08759L6891
8741A44071j1268o5022L1923K7145k6119L1841m8956m9985M7338M2368m7200l1817
8729D4319L8472j6320j592p966k3082k9621o0079N2409K738p4679n9785M6491
8717h8695J8896N8551n6296o3707L1725Q3350J50068o9369j30941k2724M4699
8706d4443K6557r267L2963k0861j8720M5347K6592m1248o5189k606K7003K8415
8694a5457K3639l7377k01J25488L3364n8413o7512q2504M3328J5894j3866m6005
$$ plain form
8682 -79622 -20354 -16665 -7427 19001 79971 -14816 -132180 -130461 -120625 -19294 62425 54979
8670 54979 40604 81046 89902 79147 79889 69180 31182 -8051 -31095 -18186 -26037 58521 105003
8657 105003 157577 143782 86572 61513 123472 182653 47400 -31005 -118088 -81397 -112025
8646 -112025 -136273 -152298 -135888 -56622 2481 42772 63007 40284 -14629 2233 43382 23965
8634 23965 -14199 52644 96773 104888 38497 -30881 14691 1282 -97723 -77316 -87767 -84277
8622 -84277 -41464 -53040 -106777 -109963 -68940 -3790 -2947 39503 77930 41570 14983 -36761
8610 -36761 -56642 -40582 4113 7346 25285 -1894 -77120 -87894 -69459 -68792 -45422 29407
8598 29407 131362 144884 64195 62843 22988 -38610 -118562 -76299 14915 15695 20126 46107
$$ packed form
8682g9622N9268L689R238K6428O0970r4787j17364J719R836J01331Q1719p446
8670E4979j4375M0442Q856j0755P42j0709l7998l9233k3044J2909p851Q4558M6482
8657A05003N2574j3795n7210k5059O1959N9181j35253p8405q7083L6691l0628
8646a12025k4248j6025J6410P9266N9103M0291K0235k2723n4913J6862M1149j9417
8634B3965l8164O6843M4129Q115o6391o9378M5572j3409r9005K0407j0451L490
8622h4277M2813j1576n3737l186M1023O5150Q43M2450L8427l6360k6587n1744
8610c6761j9881J6060M4695L233J7939k7179p5226j0774J8435O67K3370P4829
8598B9407J01955J3522q0689j352l9855o1598p9952M2263R1214P80M431K5981
$$ plain form
8586 46107 -14507 -53593 -99031 -141200 -119722 -155548 -104567 -80786 -70957 -107208 -151676 -76433
8574 -76433 -19121 -35280 -44159 -46361 -1878 44613 83403 106754 81008 44009 27684 42824
8562 42824 3668 1320 4076 -5213 -84182 -57867 1515 27087 85452 84557 53241 20687 -57268
8549 -57268 -46873 2891 84890 8941 10211 26915 47327 20326 9858 -6232 -11176 51496
8537 51496 40041 -317 17643 57342 29069 13830 46425 27444 -21039 20625 -1246 -49816
8525 -49816 -49496 -76608 -120367 -12178 83181 107134 99378 20908 28862 -5737 -108754 -116040
8513 -116040 14364 93323 43805 18462 -11836 -7548 -46402 -60203 -31140 30791 83229 -8146
8501 -8146 -2242 10813 -69301 -65862 -85914 -59196 -40743 -21366 -21357 45359 3468 -59646 -130419
$$ packed form
8586D6107o0614l9086m5438m2169K1478l5826N0981K3781R829l6251m4468P5243
8574g6433N7312j6159q879k202M4483M6491L8790K3351k5746l6999j6325J5140
8562D2824l9156k348K756r289p8969K6315N9382K5572N8365q95l1316l2554p7955
8549e7268J0395M9764Q1999p5949J270J6704K0412k7001j0468j6090m944O2672
8537E1496j1455m0358J7960L9699k8273j5239L2595j8981m8483M1664k1871m8570
8525d9816L20k7112m3759J08189R5359K3953p756p8470P954l4599j03017p286
8513a16040J30404P8959m9518k5343l0298M288l8854j3801K9063O1931N2438r1375
8501h146N904J3055q0114L439k0052K6718J8453J9377RO6716m1891o3114p0773
$$ plain form
8488 -130419 -120943 -19135 13230 -45858 -100836 -181286 -190333 -142273 -173870 -155892 -44799 81232
8476 81232 119677 58682 33038 14507 -6866 46831 33989 -15892 26567 27023 7337 16813
8464 16813 56908 22647 51067 -13014 -14665 6385 -68127 -68325 27946 96841 36808 -81120
8452 -81120 -48298 53462 21404 82681 219131 187191 224500 228382 177803 161745 144766 119848
8440 119848 182754 150236 55443 -19787 -79228 11688 79712 22675 -34489 -74085 -67746 42893
8428 42893 71346 75755 49104 3472 -21840 -22847 -10676 -62903 5443 166272 144239 98574
8416 98574 126259 149320 103964 48837 60856 21690 9698 -35799 -34237 245 35378 87026
8404 87026 74700 72192 3168 -2202 43873 41204 42119 -76329 -88832 9767 110954 146265
$$ packed form
8488a30419R476J01808L2365n9088n4978q0450r047M8060l1597J7978J11093J26031
8476H1232L8445o0995k5644j8531k1373N3697j2842m9881M2459M56j9686R476
8464A6813M0095l4261K8420o4081j651K1050p4512j98R6271O8895o0033j17928
8452h1120L2822J01760l2058O1277J36450l1940L7309L882n0579j6058j6979k4918
8440A19848O2906l2518r4793p5230n9441R0916O8024n7037n7164l9596O339J10639
8428D2893K8453M409k6651m5632k5312j007J2171n2227O8346J60829k2033m5665
8416I8574K7685K3061m5356n5127J2019l9166j1992m5497J562L4482L5133N1648
8404H7026j2326k508o9024n370M6075k669R15j18448j2503R8599J01187L5311
$$ plain form
8392 146265 74622 62058 -4403 -27498 -3013 -22321 -20829 -66608 -48852 8974 51633 55621
8380 55621 32478 -27336 -71900 -81181 -34847 -6554 23614 92747 23513 4841 39251 23719
8368 23719 90843 108497 24180 -1220 67773 89225 70254 -37781 -115541 -134149 -39501 -2475
8356 -2475 -45872 -40739 -43979 -8742 -4120 -15025 11390 3639 -25310 -59181 -93618 -11125 -29749
8343 -29749 30856 13089 1909 51666 98811 -31577 -101971 -99828 -65971 -49296 -41774 -44192
8331 -44192 -20780 9035 -5555 -103654 -120372 -17815 62332 56675 86196 64837 35659 21577
8319 21577 -10820 -21152 -33372 -62292 -57426 -49722 -127765 -126063 15544 4561 -80112 -38666
8307 -38666 4905 46884 38801 -27596 -113783 -118720 -113627 -86031 -20622 -20666 24226 -32152 -91296
$$ packed form
8392A46265p1643j2564o6461k3095K4485j9308J492m5779J7756N7826M2659L988
8380E5621k3143n9814m4564r281M6334K8293L0168O9133o9234j8672L4410j5532
8368B3719O7124J7654q4317k5400O8993K1452j8971j08035p7760j8608R4648L7026
8356b475m3397N133l240L5237M622j0905K6415p751k8949l3871l4437Q2493j8624
8343b9749O0605j7767j1180M9757M7145j30388p0394K143L3857J6675P522k418
8331d4192K3412K9815j4590r8099j6718J02557Q0147n657K9521k1359k9178j4082
8319B1577l2397j0332j2220k8920M866P704p8043J702J41607j0983q4673M1446
8307c8666M3571M1979q083o6397q6187m937N093K7596O5409m4M4892n6378n9144
$$ plain form
8294 -91296 -87339 -23351 -68736 -105687 -55655 -62917 -50883 -8906 53604 30284 6037 14601
8282 14601 -46800 -35015 45227 22885 -66577 -70837 -81118 -87096 -44782 -13420 -23906 -45209
8270 -45209 -36639 -32419 -19864 79190 179461 150120 63732 21587 -68044 -40507 -22890 21594
8258 21594 -4168 34992 7308 25628 43041 13629 10141 -33724 -95535 -79793 -87762 -88478 -47282
8245 -47282 -114540 -175358 -70823 27817 -46768 -53043 88760 128620 86166 92917 102366 -23552
8233 -23552 -63985 5409 32168 72130 61440 2045 -95101 -63842 -11097 -59862 -3930 521
8221 521 10710 68369 36071 -101310 -181849 -175515 -176019 -176884 -156548 -124415 -31555 79429 53845
8208 53845 -23571 -20611 10463 31045 70574 39108 -42930 -117114 -158190 -165667 -83925 -33303
$$ packed form
8294i1296L957O3988m5385l6951N0032p262J2034M1977O2510k3320k4247Q564
8282A4601o1401J1785Q0242k2342q9462m260j0281n978M2314L1362j0486k1303
8270d5209Q570M220J2555R9054J00271k9341q6388m2145q9631K7537J7617M4484
8258B1594k5762L9160k7684J8320J7413k9412l488m3865o1811J5742p969p16M1196
8245d7282o7258o0818J04535R8640p4585o275J41803L9860m2454O751R449j25918
8233b3552m0433O9394K6759L9962j0690n9395r7146L1259N2745m8765N5932M451
8221E21J0189N7659l2298j37381q0539O334n04q65K0336L2133R2860J10984k5584
8208E3845p7416K960L1074K0582L9529l1466q2038p4184m1076p477Q1742N0622
$$ plain form
8196 -33303 -97331 -47948 -1098 6703 3065 -24769 -115597 -109735 -33940 4217 83753 57270
8184 57270 47673 48881 -38597 -68976 -78033 -23273 -9260 -13398 -2539 -2546 -44104 -34089 -4512
8171 -4512 -16675 -65195 -123708 -23109 14669 -79613 -144525 -144401 -115357 -68489 -20645 -66884
8159 -66884 -96938 -50189 -22210 -42151 -31913 -41740 -107496 -108248 -71394 -106797 -89650 -48292
8147 -48292 -36088 -77026 -57442 -41937 3727 -51240 -81071 -56166 -43893 27928 -51728 -93571
8135 -93571 -53075 -23676 -42647 -59860 -51222 -10513 37474 51332 -39571 -97754 -89515 -166499
8123 -166499 -142695 -173539 -133235 -37638 29155 44124 126524 220090 135532 13610 -18701
8112 -18701 -131582 -162323 -148963 -131670 -132061 -44442 10126 9111 52783 87604 79571 68875
$$ packed form
8196c3303o4028M9383M6850P801l638k7834r0828N862P5795L8157P9536k6483
8184E7270r597J208q7478l0379r057N4760J4013m138J0859pm1558J0015K9577
8171d512j2163m8520n8513J00599L7778r4282o4912J24K9044M6868M7844m6239
8159f6884l0054M6749K7979j9941J0238r827o5756p52L6854l5403J7147M1358
8147d8292J2204m0938J9584J5505M5664n4967k9831K4905J2273P1821p9656m1843
8135i3571M0496K9399j8971j7213Q638M0709M7987J3858r0903n8183Q239p6984
8123a66499K3804l0844M0304R5597O6793J4969Q2400R3566q4558j21922l2311
8112a8701j12881l0741J3360J7293l91Q7619N4568j015M3672L4821q033j0696
$$ plain form
8100 68875 119204 153862 146739 122184 34271 17315 9867 -67434 -84442 42435 70173 40018
8088 40018 -26225 10511 -12675 -129856 -199008 -150645 -55360 -2893 13987 41221 65364 719
8076 719 21708 -3172 69689 90273 17774 -13325 -43825 -23871 -12691 -15225 48253 17532
8064 17532 -78149 -563 7432 -43092 -46802 -56054 -96354 -148382 -144857 -103000 -63099 -59909 8605
8051 8605 41209 87947 100955 103580 28228 -12883 -42718 -56164 -68891 -69977 -10643 -41810
8039 -41810 -47875 -52310 -36744 10879 -7879 -1078 8283 6315 40054 50090 -7648 -23975 -54678
8026 -54678 -26481 -63992 -88368 -95093 -30875 3375 -12307 -29742 11925 -24619 -33868 1423
8014 1423 38529 14100 64995 39191 2002 -39934 1670 64754 83508 71143 59357 62012
$$ packed form
8100F8875N0329L4658p123k4555q7913j6956p448p7301j7008J26877K7738l0155
8088D0018o6243L6736k3186j17181o9152M8363R5285N2467J6880K7234K4143o4645
8076G19K0989k4880P2861K0584p2499l1099l0500J9954J1180k534O3478l0721
8064A7532r5681P7586P995n0524l710r252m0300n2028L525M1857L9901L190O8514
8051H605L2604M6738J3008K625p5352m1111k9835j3446j2727j086N9334l1167
8039d1810o065m435J5566M7623j8758O801R361j968L3739J0036n7738j6327l0703
8026e4678K8197l7511k4376o725O4218L4250j5682j7435M1667l6544r249L5291
8014A423L7106k4429N0895k5804l7189m1936M1604O3084J8754j2365j1786K655
$$ plain form
8002 62012 -2811 -124836 -186232 -90968 -39503 -15777 20519 9956 -47900 -90010 -47009 -72096
7990 -72096 2105 93920 55021 37886 22256 -31014 -15459 -68175 -113118 -30695 -38475 -34975
7978 -34975 -28794 27869 30454 -90321 -133146 -54640 17258 75251 91612 88540 70325 -11191
7966 -11191 -3998 20077 21560 -19343 -47152 -37840 30831 4604 -106385 -170705 -105284 -49287
7954 -49287 -6658 -7191 -5101 -42018 -59096 -20975 -57776 -69232 -12554 -68216 -38972 -13111
7942 -13111 52264 4428 -59571 -44459 -101403 -104018 -60249 -63649 -34086 -64174 -76256 -28964
7930 -28964 49664 742 -29835 -7134 -32665 -77308 -34603 -21111 19118 35168 -30543 -39925
7918 -39925 14778 -81823 -108574 -21757 48060 -50690 -104082 -64683 -86159 -111944 -78696 -53004
$$ packed form
8002F2012o4823j22025o1396R5264N1465K3726L6296j0563n7856m2110M3001k5087
7990g2096P4201R1815l8899j7135j5630n3270J5555n2716m4943Q2423p780L500
7978c4975O181N6663K585j20775m2825P8506P1898N7993J6361l072j8215q1516
7966a1191P193K4075J483m0903k7809R312O8671k6227j10989o4320O5421N5997
7954d9287M2629n33K090l6917j7078L8121l6801j1456N6678n5662K9244K5861
7942a3111O5375m7836o3999J5112n6944k615M3769l400K9563l0088j2082M7292
7930b8964P8628m8922l0577K2701k5531m4643M2705J3492M0229J6050o5711r382
7918c9925N4703r6601k6751Q6817O9817r8750n3392L9399k1476k5785L3248K5692
$$ plain form
7906 -53004 -6864 965 -62331 -91733 -34826 13908 -18103 -72313 -90731 -83905 -75827 -95786
7894 -95786 -83431 5830 37044 52772 98995 -2000 1985 -8286 -20700 -67325 -66314 -93410
7882 -93410 -109805 -174892 -140642 -88088 -92719 -66802 -16442 6327 -4981 42796 49398 32425
7870 32425 15855 -13653 -46163 -29284 13560 16565 -18404 -82195 -84648 -119405 -128699 -77706
7858 -77706 -62182 -24959 -49997 -99975 -97156 -51203 -4240 -36884 -15973 -9743 -55356 -62580
7846 -62580 -61974 -76310 -104695 -165814 -114775 -113402 -115393 -59391 16687 21896 -28071 -56576 -17478
7833 -17478 38108 86001 35116 13398 -61163 -81406 57427 172954 124162 140546 137985 78764
7821 78764 128493 196283 139952 117779 81305 79543 41927 -37621 -121300 -127748 -77386 -97773
$$ packed form
7906e3004M6140P829o3296k9402N6907M8734l2011n4210j8418O826Q078j9959
7894i5786J2355Q9261L1214J5728M6223j00995L985j0271j2414m6625J011k7096
7882i3410j6395o5087L4250N2554m631K5917N0360K2769j1308M7777O602j6973
7870C2425j6570k9508l2510J6879M2844L005l4969o3791k453l4757r294N0993
7858g7706J5524L7223k5038m9978K819M5953M6963l2644K0911O230m5613p224
7846f2580O06j4336k8385o1119N1039J373j991N6002P6078N209m9967k8505L9098
7833a7478N5586M7893n0885k1718p4561k0243J38833J15527m8792J6384k561n9221
7821G8764M9729O7790n6331k2173l6474j762l7616p9548q3679o448N0362k0387
$$ plain form
7809 -97773 -63742 15278 -14053 -50110 -150418 -156363 -150838 -180067 -102131 41821 103836 62789
7797 62789 20417 5785 99698 57439 -43237 -27248 44330 91006 88136 145186 65920 -63254
7785 -63254 -119760 -141728 -110378 -38393 -78013 -41442 76804 138089 104164 -18398 -3665
7774 -3665 -43040 -91729 -89753 -98718 -16396 40987 117508 40086 -20672 24336 14595 -19025 -76483
7761 -76483 -106807 -102522 -92731 31949 126931 93727 62994 82550 71311 3933 7240 27481
7749 27481 22879 -2406 12785 1406 -47872 -85875 -58152 49227 46935 88934 124179 127605
7737 127605 13902 -48923 -11020 -27338 -39895 -137020 -126047 -70764 -40292 8258 37721
7726 37721 -8881 -93755 -85680 -52897 -39187 -1782 34451 95622 114584 79698 54942 -2405
$$ packed form
7809i7773L4031P9020k9331l6057j00308n945N525k9229P7936J43952O2015m1047
7797F2789m2372j4632R3913m2259j00676J5989P1578M6676k870N7050p9266j29174
7785f3254n6506k1968L1350P1985l9620L6571J18246O1285l3925j22562J4733
7774c665l9375m8689J976q965Q2322N7383P6521p7422o0758M5008r741l3620n7458
7761g6483l0324M285R791J24680R4982l3204l0733J9556j1239o7378L307K0241
7749B7481m602k5285J5191j1379m9278l8003K7723J07379k292M1999L5245L426
7737A27605j13703o2825L7903j6318j2557r7125J0973N5283L0472M8550K9463
7726C7721m6602q4874Q075L2783J3710L7405L6233O1171J8962l4886k4756n7347
$$ plain form
7714 -2405 16791 32838 61961 8372 -16537 -17151 -10103 55230 45957 69628 136196 72970 -21324
7701 -21324 -52816 9401 90557 36908 -48102 10396 62461 24760 44193 49817 80345 81561
7689 81561 19200 62932 -14209 -111936 -101627 -104742 -73644 -47019 -69647 -68783 -97914 -44427
7677 -44427 -7700 52972 91056 68319 15688 4918 -19597 -21320 -35399 -68215 27045 91124
7665 91124 99413 42197 34634 23796 8180 -66377 -71549 -54965 -12007 12728 -2063 -13008
7653 -13008 66080 58680 52057 60942 74896 29081 -35888 -41271 8809 23784 -26153 25984 62889
7640 62889 75868 69051 19546 51507 94275 57718 -27987 -36205 -37383 15169 -80497 -61345
7628 -61345 -35983 52077 18343 11726 77598 57864 55490 39506 24166 -49450 -92637 -89373
$$ packed form
7714b405J9196J6047K9123n3589k4909o14P048O5333r273K3671O6568o3226r4294
7701b1324l1492O2217Q1156n3649q5010N8498N2065l7701J9433N624L0528J216
7689H1561o2361M3732p7141r7727J0309l115L1098K6625k2628Q64k9131N3487
7677d4427L6727O0672L8084k2737n2631j0770k4515j723j4079l2816R5260O4079
7665I1124Q289n7216p563j0838j5616p4557n172J6584M2958K4735j4791j0945
7653a3008P9088p400o623Q885J3954m5815o4969n383N0080J4975m9937N2137L6905
7640F2889J2979o817m9505L1961M2768l6557q5705q218j178N2552r5666J9152
7628f1345K5362Q8060l3734o617O5872j9734k374j5984j5340p3616m3187L264
$$ plain form
7616 -89373 -32803 112374 141687 82676 50133 -28083 -38214 46928 66093 32246 920 -47145
7604 -47145 -103885 -70302 -35228 17671 57611 56285 53454 19583 -19517 -15775 -6053 -24485 39474
7591 39474 67486 -54628 -132952 -67369 5286 -14883 -36177 -16406 -45104 -64270 -47784 -87615
7579 -87615 -78003 -28251 -33515 -35956 32281 112941 165858 90586 51913 56998 41391 29814 -26065
7566 -26065 -19861 57428 19773 -38588 -15360 20842 -31268 -65765 -107684 -72367 -33064 9586
7554 9586 73279 40070 7386 940 11600 2461 -91754 -122876 -44037 -4455 5023 -17841 -23484
7541 -23484 -103334 -160841 -173392 -77249 -40917 -44566 -103854 -102818 -109942 -38170 -8059 -34687
7529 -34687 -45450 -120100 -97303 -63580 -43339 1817 59811 99327 86002 69914 53149 68218
$$ packed form
7616h9373N6570J45177K9313n9011l2543p8216j0131Q5142J9165l3847l1326m8065
7604d7145n6740L3583L5074N2899L9940j326k831l3871l9100L742R722j8432O3959
7591C9474K8012j22114p8324O5583P2655k0169k1294J9771k8698j9166J6486l9831
7579h7615R612M9752n264k441O8237Q0660N2917p5272l8673N085j5607j1577n5879
7566b6065O204P7289l7655n8361K3228L6202n2110l4497m1919L5317L9303M2650
7554I586O3693l3209l2684o446J0660r139r4215l1122P8839L9582R478k2864n643
7541b3484p9850n7507j2551R6143L6332l649n9288J036p124P1772L0111k6628
7529c4687j0763p4650K2797L3723K0241M5156N7994L9516j3325j6088j6765J5069
$$ plain form
7517 68218 -10914 54350 101844 80640 -9895 -24219 43095 89594 26491 45873 89205 72708
7505 72708 46312 44139 60116 65327 -3783 -28505 4129 79611 81192 28102 17753 9712 34470
7492 34470 -42296 -102115 -51361 -12496 -12322 -60731 -56587 40829 129762 61714 31215 25539 41976
7479 41976 92319 159665 80739 104930 125637 35186 834 -24876 -40637 -78034 -50042 5869
7467 5869 35509 -25785 -43387 32723 64887 29035 -95394 -93350 -82232 -124170 -127931 -86116
7455 -86116 -38462 63581 68382 -11749 -41175 -75187 -134178 -111125 37122 91201 109565 78195
7443 78195 -6177 -75174 -126177 -128696 -112741 -8534 76993 48680 49130 108451 28636 47178
7431 47178 134919 105538 58366 -5102 -22701 -69676 -61128 -51757 30492 115362 159274 148778
$$ packed form
7517F8218p9132O5264M7494k1204r0535j4324O7314M6499o3103J9382M3332j6497
7505G2708k6396k173J5977N211o9110k4722L2634P5482J581n3090j0349q041K4758
7492C4470p6766n9819N0754L8865J74m8409M144R7416Q8933o8048l0499n676J6437
7479D1976N0343O7346p8926K4191K0707r0451l4352k5710j5761l7397K7992N5911
7467E869K9640o1294j7602P6110L2164l5852j24429K044J1118m1938l761M1815
7455h6116M7654J02043M801q0131k9426l4012n8991K3053J48247N4079J8364l1370
7443G8195q4372o8997n1003k519J5955J04207Q5527k8313M50N9321p9815J8542
7431D7178Q7741k9381m7172o3468j7599m6975Q548R371Q2249Q4870M3912j0496
$$ plain form
7419 148778 65107 -101327 -105840 -135301 -159602 -154360 -173232 -85598 2497 32885 16020 -41989
7407 -41989 6783 -76621 -75026 -20173 -90514 -65841 -104361 -160970 -89067 -52901 -56334 -81280
7395 -81280 -66238 -28896 -37915 -26570 15544 8706 -10277 -33941 -31348 1352 17157 -71510
7383 -71510 -68160 44994 126292 38895 -44634 17126 -25446 -86948 -25634 51535 37549 -14463
7371 -14463 -96766 -106855 -101566 -20858 -15337 2554 14086 84359 91653 51323 95194 85667 16477
7358 16477 37063 40992 47385 131319 183155 153435 90964 -21664 -70151 -68906 -26216 -38842
7346 -38842 -113552 -154904 -136123 -190555 -127712 -131888 -95065 -41187 -109237 -73313 -41890 18303
7334 18303 51734 118686 125521 119724 40862 -24184 -78435 -30994 -49488 -69054 -74005 -39538
$$ packed form
7419A48778q3671j66434m513k9461k4301N242j8872Q7634Q8095L0388j6865n8009
7407d1989M8772q3404J595N4853p0341K4673l8520n6609P1903L6166l433k4946
7395h1280J5042L7342r019J1345M2114o838j8983k3664K593L2700J5805q8667
7383g1510L350J13154Q1298q7397q3529O1760m2572o1502O1314P7169j3986n2012
7371a4463q2303j0089N289Q0708N521J7891J1532P0273P294m0330M3871r527o9190
7358A6477K0586L929O393Q3934N1836k9720o2471j12628m8487J245M2690j2626
7346c8842p4710m1352J8781n4432O2843m176L6823N3878o8050L5924L1423O0193
7334A8303L3431O6952O835n797p8862o5046n4251M7441j8494j9566m951L4467
$$ plain form
7322 -39538 44137 12446 -27685 -33911 6076 70704 64041 -3830 -13084 -101588 -31409 -20329
7310 -20329 51446 95260 74921 42596 -9828 -15079 -24112 83645 26182 -157372 -122404 -88879
7298 -88879 -132078 -213597 -212644 -128347 70 21087 13235 9628 -48117 -36856 46 -96885
7286 -96885 -73402 -6719 34684 33931 48498 135254 143927 102089 7825 -3770 90818 63784
7274 63784 -17433 -56066 -27668 -66546 -14928 55791 74900 80558 32832 26187 67517 123772
7262 123772 76316 78616 76803 -15713 10227 89987 17347 -41872 -103317 -101802 -32380 -122362
7250 -122362 -170559 -43475 23347 88948 84768 13540 -31279 -69402 -89272 -27539 -34235 -73692
7238 -73692 -127163 -186212 -196487 -127929 -41299 3800 -39070 -74932 37091 -30437 -175257
$$ packed form
7322c9538Q3675l1691m0131o226L9987O4628o663o7871r254q8504P0179J1080
7310b0329P1775M3814k0339l2325n2424n251r033J07757n7463j83554L4968L3525
7298h8879m3199q1519R53Q4297J28417K1017p852l607n7745J1261L6902r6931
7286i6885K3483O6683M1403p53J4567Q6756Q673m1838r4264j1595R4588k7034
7274F3784q1217l8633K8398l8878N1618P0719J9109N658m7726o645M1330N6255
7262A23772m7456K300j813r2516K5940P9760p2640n9219o1445J515O9422q9982
7250a22362m8197J27084O6822O5601m180p1228m4819l8123j9870O1733o696l9457
7238g3692n3471n9049j0275O8558Q6630M5099m2870l5862J12023o7528j44820
$$ plain form
7227 -175257 -163825 -108191 57871 58693 -2073 -9789 -14575 -54961 -37146 -11313 -52613 -34685
7215 -34685 -22803 64969 62363 7815 4388 1142 43175 92477 -2880 -38053 13627 17637 71880
7202 71880 62270 52215 66897 63895 5388 -82768 -70247 -69599 -91167 7679 40847 42961 -79548
7189 -79548 -163143 -181321 -148502 -118262 -68112 34210 68997 56569 25929 -31612 -108618 -111842
7177 -111842 -50073 51219 30072 -65418 -70825 -86183 -128609 -69833 -47421 -68615 -74427 -115451
7165 -115451 -155852 -146963 -175416 -156009 -117274 -79617 -42698 -93751 -106557 -60202 -101108 -136968
7153 -136968 -104718 -93746 -52658 30334 12615 -65191 -25681 44491 -22374 -120519 -107032 -119689
7141 -119689 -168333 -113865 -49664 14908 -17090 18968 16736 2182 48610 107496 174656 58194
$$ packed form
7227a75257J1432N5634J66062Q22o0766p716m786m0386J7815K5833m1300J7928
7215c4685J1882Q7772k606n4548l427l246M2033M9302r5357l5173N1680M010N4243
7202G1880r610j0055J4682l002n8507q8156J2521O48k1568R8846L3168K114j22509
7189g9548q3595j8178L2819L0240N0150J02322L4787j2428l0640n7541p7006l224
7177a11842O1769J01292k1147r5490n407j5358m2426N8776K2412k1194n812m1024
7165a15451m0401Q889k8453J9407L8735L7657L6919n1053j2806M6355m0906l5860
7153a36968L2250J0972M1088Q2992j7719p7806L9510P0172o6865r8145J3487j2657
7141a19689m8644N4468O4201O4572l1998L6058k232j4554M6428N8886O7160j16462
$$ plain form
7129 58194 28553 130871 172197 141727 102081 58427 80018 34044 -44778 -2725 60203 32616
7117 32616 -40542 -22917 41757 7211 -40066 -5715 592 -4108 -48126 -63279 -93075 2649
7105 2649 63869 127143 101985 1651 -6868 72553 150102 118297 70001 44192 63277 47755
7093 47755 -22714 -31656 21669 -16831 -76634 -119211 -188754 -146476 -55280 38020 52848 32341
7081 32341 -31730 -53195 -46040 -74844 -47461 -70162 -185935 -121390 -38502 22567 46174 -59833
7069 -59833 -164406 -153898 -59745 -21362 13314 -50641 -68985 -32864 33709 83490 99996 1102
7057 1102 -97711 -8366 16076 23750 -62542 -124844 -106817 -61421 -70685 -94250 -48136 63313
7045 63313 70260 60674 38541 63551 140745 125531 66500 55764 18005 14905 49283 24388
$$ packed form
7129E8194k9641J02318M1326l0470l9646m3654K1591m5974p8822M2053O2928k7587
7117C2616p3158J7625O4674l4546m7277L4351O307m700m4018j5153k9796R5724
7105B649O1220O3274k5158j00334q519P9421P7549l1805m8296k5809J9085j5522
7093D7755p0469q942N3325l8500n9803m2577o9543M2278R1196R3300J4828k0507
7081C2341o4071k1465P155k8804K7383k2701j15773O4545Q2888O1069K3607j06007
7069e9833j04573J0508R4153L8383L4676o3955j8344L6121O6573M9781J6506r8894
7057A102r8813Q9345K4442P674q6292o2302J8027M5396r264k3565M6114J11449
7045F3313O947r586k2133K5010P7194j5214n9031j0736l7759l100L4378k4895
$$ plain form
7033 24388 -22743 16306 25118 64241 68768 48559 24864 -42859 -89645 -77575 -162833 -86733
7021 -86733 6262 -9438 -27743 -2667 20840 17262 18430 -44155 -62825 -44944 -43671 25300
7009 25300 32917 -26429 -120401 -178055 -109497 -43781 30908 75325 -15309 -136393 -161305 -145661
6997 -145661 -64359 -44271 -72537 -49726 -122267 -162533 -111994 -39498 27084 18477 41458 75843
6985 75843 64122 113352 14194 26042 94587 91290 50600 34847 21283 -5849 -56953 -41497
6973 -41497 -82983 -49104 1483 25434 84063 105422 68470 -13281 -116333 -190487 -149180 -38416
6961 -38416 -84074 -154016 -132859 -154477 -199096 -112252 -76921 19830 50051 -16054 -38980 -43742
6949 -43742 -108611 -74696 -90789 -134939 -50550 6725 24041 -7654 14195 14118 -44557 -71929
$$ packed form
7033B4388m7131L9049Q812L9123M527k0209k3695o7723m6786J2070q5258P6100
7021h6733R2995j5700j8305K5076K3507l578J168o2585j8670J7881J273O8971
7009B5300P617n9346r3972n7654O8558O5716P4689M4417r0634j21084k4912J5644
6997a45661Q1302K0088k8266K2811p2541m0266N0539P2496O6582q607K2981L4385
6985G5843j1721M9230r9158J1848O8545l297m0690j5753j3564k7132n1104J5456
6973d1497m1486L3879N0587K3951N8629K1359l6952q1751j03052p4154M1307J10764
6961c8416m5658o9942K1157k1618m4619Q6844L5331R6751L0221o6105k2926m762
6949d3742o4869L3915j6093m4150Q4389N7275J7316l1695K1849p7n8675k7372
$$ plain form
6937 -71929 -47685 -118178 -26615 -42769 -26030 42991 71854 89434 92028 -2284 -37658 2619
6925 2619 26718 -12861 -210 -22478 -28381 40050 34931 -7282 -46856 -70616 37026 14244
6913 14244 -22572 -22028 -62963 -40194 14037 91093 122938 36887 18490 81754 70990 31436
6901 31436 38432 48305 80044 9154 -34813 -10240 -33685 -24648 -3001 34540 105517 36102
6889 36102 -59643 -41120 18260 26989 58652 56104 83386 81055 21753 18536 48115 6510 60653
6876 60653 79729 20799 100840 99983 80296 11864 -151684 -162563 -29600 28498 81349 91483
6864 91483 119831 107663 90485 63774 19174 28837 91684 81608 98688 63336 13836 59259
6852 59259 63562 -11350 -113522 -99300 -182255 -237095 -168510 -85932 15018 2562 -11660 -25184
$$ packed form
6937g1929K4244p0493R1563j6154J6739O9021K8863J7580K594r4312l5374M0277
6925B619K4099l9579J2651k2268n903O8431n119m2213l9574k3760J07642k2782
6913A4244l6816N44m0935K2769N4231P7056L1845q6051j8397O3264j0764l9554
6901C1436O996R873L1739p0890m3967K4573k3445R037K1647L7541P0977o9415
6889C6102r5745J8523N9380Q729L1663k548K7282k331n9302l217K9579m1605N4143
6876F0653J9076n8930Q0041q57j9687o8432j63548j0879J32963N8098N2851J0134
6864I1483K8348j2168j7178k6711m4600R663O2847j0076J7080l5352m9500M5423
6852E9259M303p4912j02172J4222q2955n4840O8585Q2578J00950j2456j4222j3524
$$ plain form
6840 -25184 -97252 -74638 330 39130 52283 30324 -15184 18536 -31510 -97604 -66646 -11924
6828 -11924 15974 67770 4023 -13504 -73373 -53059 -165714 -177982 -54164 -1640 -51402
6817 -51402 -43283 -95837 -52968 -13275 11003 12323 60244 95205 26078 -51980 -23019 -71751
6805 -71751 29688 97607 85325 141474 122003 -28662 -104662 -71526 -14401 8874 32692
6794 32692 22124 54234 109034 94633 48249 -46136 -95825 -134304 -108071 -27897 1440 -41098
6782 -41098 -41751 3299 110714 121235 111540 63501 -21017 -32713 -29523 -58908 -71856 -18079
6770 -18079 16902 -40296 -5458 -33705 -76558 -122463 -123112 -3377 53888 27636 24421 23229
6758 23229 58971 6398 -43352 -102960 -94885 -83661 -147396 -92341 -23397 -33228 -36073 -38
$$ packed form
6840b5184p2068K2614P4968L8800J3153k1959m5508L3720n0046o6094L0958N4722
6828a1924K7898N1796o3747j7527n9869K0314j12655j2268J23818N2524m9762
6817e1402Q119n2554M2869L9693K4278J320M7921L4961o9127p8058K8961m8732
6805g1751J01439O7919j2282N6149j9471j50665p6000L3136N7125K3275K3818
6794C2692j0568L2110N4800j4401m6384r4385m9689l8479K6233Q0174K9337m2538
6782d1098o53M5050J07415J0521r695m8039q4518j1696L190k9385j2948N3777
6770a8079L4981n7198L4838k8247m2853m5905o49J19735N7265k6252l215j192
6758B3229L5742n2573m9750n9608Q075J1224o3735N5055O8944r831k845L6035
$$ plain form
6746 -38 36200 -21954 -4406 28608 1094 -20055 -14927 85351 107234 4447 -77467 19011
6734 19011 107262 103019 108009 119738 180725 245000 201094 155060 174073 127983 13945 -29867
6722 -29867 -70254 -35116 -70610 -98737 -105757 -187611 -117160 -69842 -43434 -1364 69079 92575
6710 92575 73768 -29968 -338 62976 23378 14377 19716 -42897 35755 66407 51338 64642
6698 64642 159210 124547 -33470 -92049 -58634 -23814 20534 24379 65235 98926 54109 -6364
6686 -6364 -31648 -161139 -159443 -152699 -74797 57377 129623 12057 -56928 -67907 -1035 98543
6674 98543 59698 117141 86129 6799 33897 -6732 -98809 -53934 4807 -36305 -39643 -44698
6662 -44698 -8396 -46956 11105 65582 24357 3805 -41725 -65768 -48545 5536 -47142 -19147
$$ packed form
6746c8L6238n8154J7548L3014k7514k1149N128J00278K1883j02787q1914R6478
6734A9011Q8251m243M990J1729O0987O4275m3906m6034J9013m6090j14038m3812
6722b9867m0387L5138l5494k8127p020q1854P0451M7318K6408M2070P0443K3496
6710I2575j8807j03736K9630O3314l9598r001N339o2613P8652L0652j5069J3304
6698F4642R4568l4663j58017n8579L3415L4820M4348L845M0856L3691m4817o0473
6686f364k5284j29491J696O744P7902J32174P2246j17566o8985j0979O6872R9578
6674I8543l8845N7443l1012p9330K7098m0629r2077M4875N8741m1112l338n055
6662d4698L6302l8560N8061N4477m1225k0552m5530k4043J7223N4081n2678K7995
$$ plain form
6650 -19147 -17037 -38632 -12973 23420 22160 6747 30974 66789 47091 -8198 40849 66209
6638 66209 -1879 -7961 -8343 14902 -3887 -10542 -3513 16498 67041 109439 24281 44713 116470
6625 116470 192177 60649 15042 -21070 -63952 17859 -42885 -92181 -41744 59243 91606
6614 91606 46496 -27394 21803 85790 11585 -71780 -87628 -143147 -162199 -84911 -77648 -22063
6602 -22063 -24099 -130350 -117112 -24635 18331 17837 53891 65909 40680 10320 -57463 -89386
6590 -89386 -70151 -49982 -11785 -22809 -68408 -164535 -171708 -97013 -120256 -148339 -79361 -10462
6578 -10462 -37379 -40766 -19423 -40173 -98365 -154146 -152546 -115053 -124300 -142128 -130818 -128059 -124918
6565 -124918 -42685 -57088 -36375 -47788 -85123 -65040 -27071 41818 118510 90606 88663 34472
$$ packed form
6650a9147K110k1595K5659L6393j260j5413K4227L5815j9698n5289M9047K5360
6638F6209o8088o082l82K3245j8789o655P029K0011N0543M2398q5158K0432P1757
6625A16470P5707j31528m5607l6112m2882Q1811o0744m9296N0437J00987L2363
6614I1606m5110p3890M9197O3987p4205q3365j5848n5519j9052P7288P263N5585
6602b2063k036j06251J3238R2477M2966m94L6054J2018k5229l0360o7783l1923
6590h9386J9235K0169L8197j1024m5599r6127p173P4695k3243k8083O8978O8899
6578a0462k6917l387K1343k0750n8192n5781J600L7493r247j7828J1310K759L141
6565a24918Q2233j4403K0713j1413l7335K0083L7969O8889P6692k7904j943n4191
$$ plain form
6553 34472 21474 -25956 -61480 -33057 -29547 -70864 -42357 2707 98325 46346 26192 11943
6541 11943 4995 -93546 -85337 -32806 -7783 67360 71910 79031 52961 -60738 -134650 -87500
6529 -87500 -19497 25735 113386 161943 127655 112311 61608 -47363 -74025 -12970 -7476 -71960
6517 -71960 -101204 -52259 10426 18068 80253 170324 135627 46585 -11160 31730 60789 48206
6505 48206 2485 17497 79160 19530 31508 60848 92660 85817 32520 -872 -28739 -113330
6493 -113330 -119982 -66068 12725 7593 103139 117363 165772 147942 135075 103296 60361 91678
6481 91678 171789 190704 107981 63535 18909 15174 -7258 8220 21731 9668 20392 -15252
6469 -15252 13187 -22987 -76305 -53615 -30226 -52867 -138103 -62625 -14005 42427 90680 468
$$ packed form
6553C4472j2998m7430l5524K8423L510m1317K8507M5064R5618n1979k0154j4249
6541A1943o948r8541Q209N2531K5023P5143M550P121k6070j13699p3912M7150
6529h7500O8003M5232Q7651M8557l4288j5344n0703j08971k6662O1055N494o4484
6517g1960k9244M8945O2685P642O2185R0071l4697q9042n7745M2890K9059j2583
6505D8206m5721J5012O1663n9630J1978K9340L1812o843n3297l3392k7867q4591
6493a13330o652N3914P8793n132R5546J4224M8409j7830j2867l1779m2935L1317
6481I1678Q0111J8915q2723m4446m4626l735k2432J5478J3511j2063J0724l5644
6469a5252K8439l6174n3318K2690K3389k2641q5236P5478M8620N6432M8253r0212
$$ plain form
6457 468 -103341 -120624 -77999 -95269 -78063 -89137 -68408 -118986 -99749 -54867 6217 56462
6445 56462 75259 90231 23122 39878 -5274 -107736 -60333 -74704 -62328 -64917 -157409 -201302
6433 -201302 -180001 -116895 -65145 -58537 -62119 33822 72900 72691 80638 31665 -18051 -48537 -18913
6420 -18913 -9893 13490 5500 -31341 26533 27502 -96760 4500 129243 165114 80824 9447
6408 9447 19268 88886 66707 62257 24124 65146 58467 1090 -13566 -10027 -20550 49288 74001
6395 74001 64340 41027 45657 2128 17359 63798 7720 -100421 -97625 -58926 -57302 41567
6383 41567 102796 18095 -9720 -47256 -97636 -58874 4474 -59054 -75604 5138 21299 41342
6371 41342 106545 97340 104214 107013 24112 47040 133780 164955 172049 104516 46937 35199 -11118
$$ packed form
6457D68j03809j7283M2625j7270J7206j1074K0729n0578J9237M4882O1084N0245
6445E6462J8797J4972o7109J6756m5152j02462M7403j4371J2376k589r2492m3893
6433b01302K1301O3106N1750O608l582R5941L9078k09P947m8973m9716l0486K9624
6420a8913R020K3383p990l6841N7874R69j24262J01260J24743L5871q4290p1377
6408I447R821O9618k2179m450l8133M1022o679n7377j4656L539j0523O9838K4713
6395G4001r661k3313M630m3529J5231M6439n6078j08141K796L8699J624R8869
6383D1567O1229q4701k7815l7536n0380L8762O3348o3528j6550Q0742J6161K0043
6371D1342O5203r205O874K799q2901K2928Q6740L1175P094o7533n7579j1738m6317
$$ plain form
6358 -11118 -51063 7846 47570 33738 38971 32117 52915 64991 25297 32015 2350 20814
6346 20814 23114 16453 -24466 -50761 -133106 -127450 -68890 -56441 -93201 12904 100655 19602
6334 19602 31046 56590 12774 21736 84799 114683 190296 158152 89553 35983 -1377 -53586
6322 -53586 -51459 -62351 -28453 -60346 -115401 -16701 26570 28784 4747 -20163 -95209 -125314
$$ packed form
6358a1118l9945N8909L9724j3832N233o854K0798J2076l9694O718k9665J8464
6346B0814K300o661m0919k6295q2345N656N8560J2449l6760J06105Q7751q1053
6334A9602J1444K5544m3816Q962O3063K9884P5613l2144o8599n3570l7360n2209
6322e3586K127j0892L3898l1893n5055R8700M3271K214k4037k4910p5046l0105
$$ [...]
##END NTUPLES=NMR SPECTRUM
##END=
