##TITLE=Analysis number 321155
Compound Code cc 54711
Book Reference 439/167/14
Project Code adrs
Chemist Name ronp
##JCAMPDX= 6.0         $$ Bruker NMR JCAMP-DX V2.0
##DATA TYPE= NMR SPECTRUM
##DATA CLASS= NTUPLES
##ORIGIN= Bruker BioSpin GmbH
##OWNER= nmr
$$ XWIN-NMR		Version 3.5
$$ Wed Jul 26 15:46:52 2006 GMT Daylight Time (UT+1h)  MAYBRIDGE\nmr@NMR_250MHZ
##.OBSERVE FREQUENCY= 250.131544655141
##.OBSERVE NUCLEUS= ^1H
##.ACQUISITION MODE= SIMULTANEOUS (DQD)
##.ACQUISITION SCHEME= undefined
##.AVERAGES= 16
##.DIGITISER RES= 18
##SPECTROMETER/DATA SYSTEM= dpx250
##.PULSE SEQUENCE= zg30
##.SOLVENT NAME= CDCl3
##.SHIFT REFERENCE= (INTERNAL, CDCl3, 0, 16.522)
##AUDIT TRAIL= $$ (NUMBER, WHEN, WHO, WHERE, WHAT)
$$ ##TITLE= Audit trail, XWIN-NMR		Version 3.5
$$ ##JCAMPDX= 5.01
$$ ##ORIGIN= Bruker BioSpin GmbH
$$ ##OWNER= nmr
$$ C:\u/data/dgb/nmr/ADRS/3640/pdata/1/auditp.txt
$$ ##AUDIT TRAIL=  $$ (NUMBER, WHEN, WHO, WHERE, WHAT)
(   1,<2006-07-26 15:46:15.41 +100>,<MAYBRIDGE\nmr>,<NMR_250MHZ>,
      <created by zg, POWCHK disabled, PULCHK disabled
       configuration hash MD5:
       E2 DF 36 D8 04 B2 41 60 5A D7 A3 38 5A 4B D0 FE
       data hash MD5: 64K
       E1 D3 A3 AE C7 1B B9 F8 F8 84 96 4C FF 33 88 08>)
(   2,<2006-07-26 15:46:37.10 +100>,<MAYBRIDGE\nmr>,<NMR_250MHZ>,
      <Start of raw data processing
       ef LB = 0.3 FT_mod = 6 PKNL = 1 SI = 32K 
       data hash MD5: 32K
       30 19 E3 22 CD 61 2F 59 88 4C A9 24 FF 9E D9 A0>)
(   3,<2006-07-26 15:46:39.60 +100>,<MAYBRIDGE\nmr>,<NMR_250MHZ>,
      <apk 
       data hash MD5: 32K
       DE BC 8B 2C 3D F8 2C 6A 9B F3 83 95 EF FC E5 EF>)
(   4,<2006-07-26 15:46:40.34 +100>,<MAYBRIDGE\nmr>,<NMR_250MHZ>,
      <abs ABSG = 5 
       data hash MD5: 32K
       B8 33 75 6E 84 82 A0 A5 77 9D 90 6B 44 93 7C 03>)
$$ ##END=
$$ 
$$ hash MD5
$$ 63 AF F3 1F 68 B4 BF 88 1C B9 06 3B 73 D3 0E 3F
##$RELAX= 
##$RELAX= 
##$RELAX= 
##$RELAX= 
##$RELAX= 
##$RELAX= 
##$RELAX= 
$$ Bruker specific parameters
$$ --------------------------
##$DU= <C:\u>
##$EXPNO= 3640
##$NAME= <ADRS>
##$PROCNO= 1
##$TYPE= <nmr>
##$USER= <dgb>
##$AMP= (0..31)
100 100 100 100 100 100 100 100 100 100 100 100 100 100 100 100 100 100 
100 100 100 100 100 100 100 100 100 100 100 100 100 100 
##$AQSEQ= 0
##$AQ_mod= 3
##$AUNM= <au_zg>
##$AUTOPOS= <36 >
##$BF1= 250.13
##$BF2= 250.13
##$BF3= 250.13
##$BF4= 250.13
##$BF5= 500.13
##$BF6= 500.13
##$BF7= 500.13
##$BF8= 500.13
##$BYTORDA= 1
##$CFDGTYP= 0
##$CFRGTYP= 5
##$CHEMSTR= <none>
##$CNST= (0..31)
1 1 145 1 1 1 1 1 1 1 1 1 1 1 1 1 1 1 1 1 1 1 1 1 1 1 1 1 1 1 1 1 
##$CPDPRG= <>
##$CPDPRG1= <>
##$CPDPRG2= <>
##$CPDPRG3= <>
##$CPDPRG4= <mlev>
##$CPDPRG5= <mlev>
##$CPDPRG6= <mlev>
##$CPDPRG7= <mlev>
##$CPDPRG8= <mlev>
##$CPDPRGB= <>
##$CPDPRGT= <>
##$D= (0..31)
0 1 0 0 0 0 0 0 0 0.06 0 0 0 0 0 0 0.0002 0 0 0 0 0 0 0 0 0 0 0 0 0 0 
0 
##$DATE= 1153925172
##$DBL= (0..7)
120 120 120 120 120 120 120 120 
##$DBP= (0..7)
150 150 150 150 150 150 150 150 
##$DBP07= 0
##$DBPNAM0= <>
##$DBPNAM1= <>
$$ [...]
##$SUBNAM7= <"">
##$SUBNAM8= <"">
##$SUBNAM9= <"">
##$SW= 20.6930455092707
##$SWIBOX= (0..15)
0 0 3 0 0 0 0 0 0 0 0 0 0 0 0 0 
##$SW_h= 5175.983436853
##$TD= 65536
##$TD0= 1
##$TE= 295.16
##$TE2= 300
##$TE3= 300
##$TEG= 300
##$TL= (0..7)
0 120 120 120 120 120 120 120 
##$TP= (0..7)
150 150 150 150 150 150 150 150 
##$TP07= 0
##$TPNAME0= <>
##$TPNAME1= <>
##$TPNAME2= <>
##$TPNAME3= <>
##$TPNAME4= <>
##$TPNAME5= <>
##$TPNAME6= <>
##$TPNAME7= <>
##$TPOAL= (0..7)
0.5 0.5 0.5 0.5 0.5 0.5 0.5 0.5 
##$TPOFFS= (0..7)
0 0 0 0 0 0 0 0 
##$TUNHIN= 0
##$TUNHOUT= 0
##$TUNXOUT= 0
##$USERA1= <user>
##$USERA2= <user>
##$USERA3= <user>
##$USERA4= <user>
##$USERA5= <user>
##$V9= 5
##$VALIST= <valist>
##$VCLIST= <CCCCCCCCCCCCCCC>
##$VD= 0
##$VDLIST= <DDDDDDDDDDDDDDD>
##$VPLIST= <PPPPPPPPPPPPPPP>
##$VTLIST= <TTTTTTTTTTTTTTT>
##$WBST= 1024
##$WBSW= 4
##$XGAIN= (0..3)
0 0 0 0 
##$XL= 0
##$YL= 0
##$YMAX_a= 228783
##$YMIN_a= -309714
##$ZGOPTNS= <>
##$ZL1= 120
##$ZL2= 120
##$ZL3= 120
##$ZL4= 120
##$ABSF1= 16.522
##$ABSF2= -4.171173
##$ABSG= 5
##$ABSL= 3
##$ALPHA= 0
##$AQORDER= 0
##$ASSFAC= 0
##$ASSFACI= 0
##$ASSFACX= 0
##$ASSWID= 0
##$AUNMP= <proc_1d>
##$AZFE= 0.1
##$AZFW= 0.1
##$BCFW= 0
##$BC_mod= 0
##$BYTORDP= 0
##$COROFFS= 0
##$CY= 12.5
##$DATMOD= 1
##$DC= 0
##$DFILT= <>
##$DTYPP= 0
##$F1P= 14.0000005364418
##$F2P= -0.99999901652339
##$FCOR= 0.5
##$FTSIZE= 32768
##$FT_mod= 6
##$GAMMA= 0
##$GB= 0
##$INTBC= 1
##$INTSCL= 1
##$ISEN= 128
##$LB= 0.3
##$LEV0= 0
##$LPBIN= 0
##$MAXI= 10000
##$MC2= 0
##$MEAN= 0
##$ME_mod= 0
##$MI= 0
##$NCOEF= 0
##$NC_proc= -4
##$NLEV= 6
##$NOISF1= 0
##$NOISF2= 0
##$NSP= 0
##$NTH_PI= 0
##$NZP= 0
##$OFFSET= 16.522
##$PC= 1
##$PHC0= 161.7355
##$PHC1= 18.06192
##$PH_mod= 1
##$PKNL= yes
##$PPARMOD= 0
##$PSCAL= 4
##$PSIGN= 0
##$REVERSE= no
##$SF= 250.13
##$SI= 32768
##$SIGF1= 0
##$SIGF2= 0
##$SINO= 400
##$SIOLD= 32768
##$SREGLST= <1H.CDCl3>
##$SSB= 0
##$STSI= 32768
##$STSR= 0
##$SW_p= 5175.98343685301
##$SYMM= 0
##$S_DEV= 0
##$TDeff= 65536
##$TDoff= 0
##$TI= <Analysis number 999999
Compound Code 99
Book Reference 9
Project Code 9>
##$TILT= no
##$TM1= 0
##$TM2= 0
##$TOPLEV= 0
##$USERP1= <user>
##$USERP2= <user>
##$USERP3= <user>
##$USERP4= <user>
##$USERP5= <user>
##$WDW= 1
##$XDIM= 32768
##$YMAX_p= 465979266
##$YMIN_p= -581106
$$ End of Bruker specific parameters
$$ ---------------------------------
##NTUPLES= NMR SPECTRUM
##VAR_NAME=  FREQUENCY,     SPECTRUM/REAL,   SPECTRUM/IMAG
##SYMBOL=    X,             R,               I
##VAR_TYPE=  INDEPENDENT,   DEPENDENT,       DEPENDENT
##VAR_FORM=  AFFN,          ASDF,            ASDF
##VAR_DIM=   32768,         32768,           32768
##UNITS=     HZ,            ARBITRARY UNITS, ARBITRARY UNITS
##FACTOR=    0.157963299565203, 1,           1
##FIRST=     4132.6476996994, 0,             0
##LAST=      -1043.33573715361, 0,           0
##MIN=       -1043.33573715361, -581106,     0
##MAX=       4132.6476996994, 465979266,     0
$$ Real data points
##PAGE= N=1
##DATA TABLE= (X++(R..R)), XYDATA
$$ [...]
20415 34604 146095 220035 42823 108618 189203 34937 -1402 -54845 -163783 -16493 75184
20404 75184 4027 -67932 -28814 -93185 -107485 55549 -20001 25008 226407 189216 57561
20393 57561 59620 176681 206281 186793 162169 65738 -72842 25690 -29582 58630 28374
20382 28374 15058 -47868 -9931 120319 201593 126490 11504 17044 199445 274262 298769
20371 298769 322159 144707 131853 338377 362394 194440 180842 168803 130997 82555 268176
20360 268176 225260 129131 57545 -806 22233 125665 225570 226591 225557 203551 191805 157251
20348 157251 166159 166011 27971 -25545 53577 197262 295516 236526 132292 82884 164434
20337 164434 152702 163497 203471 289206 255737 270547 119899 61400 62260 105609 106604 52752
20325 52752 -39290 -114575 -44411 -22887 -115206 -148910 -81379 -15780 -100316 -141923 -210184 800
20313 800 175118 248957 271816 288334 364098 337675 410322 493728 366440 315983 305684 274094
20301 274094 185387 176444 117739 157875 134322 119121 144940 154135 68751 -30613 -55193 148871
20289 148871 345674 352918 276688 152172 219323 450991 331582 84587 182720 335078
20279 335078 310525 220134 252610 278351 389941 391720 257373 239766 120053 136940 120049
20268 120049 121658 151024 169021 267078 293859 285912 253489 217201 249459 154005 162352 168458
20256 168458 127356 79585 203164 191891 119267 151829 152749 52603 -36298 74033 95341
20245 95341 109308 139737 68762 91357 118265 95351 128365 40943 -29714 -23760 -52766 -70739
20233 -70739 137689 229622 217986 138733 82089 208977 244956 118449 -5257 8671 -192213
20222 -192213 -193268 77813 144145 -18845 -79494 -61817 -41266 3734 130580 128124 122775
20211 122775 88949 69191 65637 62018 112384 301246 292328 125814 122148 115157 121673 263768
20199 263768 288819 224435 167545 126946 127747 51302 117855 54966 -104451 -77119 -38165 -38831
20187 -38831 -74754 24038 31359 -15634 -24643 -130672 -123332 -28860 51130 74553 -36119 87665
20175 87665 141224 90805 54111 -75233 -207120 -163007 -168918 -179233 -147655 -146347 -210875 -159128
20163 -159128 -822 162990 311909 311411 127738 42992 120235 133407 138967 100798 160629
20152 160629 256988 212917 137141 99294 108701 319873 460978 379728 225339 126866 77602
20141 77602 249327 249843 68347 109242 69468 114387 129167 107932 -80704 -138233 -103523
20130 -103523 -162870 -219887 -70338 28191 177381 161748 160464 239687 151295 -56204 -8017
20119 -8017 53405 174230 308194 221129 199880 321915 258719 344396 471055 276221 217617
20108 217617 219971 189304 237814 244901 318620 247397 153376 141861 149358 216161 221835 156094
20096 156094 204599 271426 328287 286526 336127 398365 306637 211786 229029 164523 17617
20085 17617 -181315 -184219 -104816 4160 65018 -8351 -85875 41090 324950 382409 287352
20074 287352 194700 333052 511448 610566 525808 565922 549918 666166 682627 618088 641016
20063 641016 677255 616163 636511 653742 646873 658396 749552 768458 766864 662786 687846 621693
20051 621693 504843 484048 492823 482935 442603 251514 147187 82299 26775 68023 143443
20040 143443 136419 151772 165228 141871 214991 257176 221455 75358 137309 142364 98014 79842
20028 79842 138149 237184 331455 317088 266103 294650 230013 84813 46846 173184 321820
20017 321820 290741 208461 63295 79106 111314 121671 121879 210355 278061 215596 196098 153916
20005 153916 180455 109617 40556 75544 162229 187982 143460 228146 235849 209258 305164 330813
19993 330813 239506 149595 43207 93025 18853 133089 378925 394797 284006 249986 185011
19982 185011 138212 225755 218626 68823 144317 330885 410674 360706 139586 189885 225725
19971 225725 228213 255709 416009 533348 615293 527375 629409 762744 674136 449197 384442
19960 384442 468498 453213 411521 446838 438806 384489 320401 312862 408329 417994 416719 461913
19948 461913 388863 316770 405763 469138 496636 445035 280363 404372 585375 525542 610601
19937 610601 718211 638834 636186 667857 609782 471959 337468 433568 511960 565202 508221
19926 508221 430686 531601 605227 567641 564719 492531 578870 558783 515780 587504 464667
19915 464667 340286 512090 596109 535443 450570 543897 541495 587821 483129 416958 487626
19904 487626 425579 314836 335856 278859 318421 351702 284042 363931 480357 437910 407273
19893 407273 473559 562427 548287 521901 441585 306373 170126 241762 271953 366857 436073
19882 436073 494661 576303 543342 301574 295432 306107 217406 240142 230519 129771 69877
19871 69877 94700 141378 298980 353142 271878 328183 309184 274514 325473 340335 273143
19860 273143 282575 354407 404970 458302 440967 389214 357051 314220 203629 219933 239399
19849 239399 256690 285619 315528 509448 624146 549429 551179 512194 367298 227040 260005
19838 260005 384298 421406 439058 425250 556209 444177 403429 367472 383585 425276 365334
19827 365334 457024 460670 338495 323648 314926 375093 412397 334460 276291 299632 338780 434934
19815 434934 442148 334076 439902 396495 346332 398250 395510 261650 194906 205531 219668
19804 219668 223265 296341 467865 489968 366347 245135 173120 94197 296403 511204 488085
19793 488085 465143 459575 394714 401525 363195 341299 413632 345422 302366 141286 163837 337338
19781 337338 295275 154349 130854 121107 228454 340861 423118 502721 620110 635803 621960
19770 621960 637523 602334 421312 402727 327835 387593 488359 469475 374466 305375 326719
19759 326719 367144 411931 526035 545251 582302 439533 258486 218494 200505 234105 465269
19748 465269 494315 276136 239136 218675 110783 212988 206418 103761 84247 152387 301908
19737 301908 344088 314041 370672 337170 342689 356184 214623 224621 216609 329762 340403 283862
19725 283862 433467 585297 635226 614816 695076 628470 715964 905532 942885 914291 825169
19714 825169 757887 827839 816163 887167 943055 796250 848802 952464 1004918 960360 733446
19703 733446 531172 632751 658129 529194 647073 716701 678801 568556 531007 442075
19693 442075 342365 263156 281609 297226 181951 235128 397494 423858 318309 244368 230184
19682 230184 245828 317232 329530 366310 513860 613546 656663 686805 502823 498438 576843
19671 576843 487298 447264 450557 481133 562835 591888 744544 811786 645490 502378 509556
19660 509556 458111 482895 551211 567648 560075 695533 644162 497798 494585 592898 497426
19649 497426 386792 483429 578399 615086 632871 632466 600718 644565 622221 692045 844298
19638 844298 906566 886750 806200 698703 586983 599970 710663 677767 728113 772464 678127
19627 678127 769308 766150 637028 566602 533792 532029 583847 718619 793819 939725 979072
19616 979072 923644 875097 916879 911029 803417 777167 820317 803925 738983 810742 804427 815279
19604 815279 992587 964385 969988 1048412 1074564 1112035 1047977 1036857 973722 848843 858447
19593 858447 891226 1025899 1069265 1083556 1046221 1118657 1170598 1195393 1240500 1309729 1261683
19582 1261683 1310243 1259300 1029532 899904 918974 894568 1010302 1119227 1161651 1262308
19572 1262308 1308630 1357979 1430911 1571368 1707547 1810889 1782046 1592685 1567920 1747295
19562 1747295 1996452 2056144 2303968 2571782 2642701 2694637 2882162 3188903 3483002 3836242
19552 3836242 4233133 4492897 4813965 5140561 5572968 6042284 6420144 6911679 7582321
19543 7582321 8460757 9505292 10832750 12581785 14875014 18433892 24045597 32840764
19535 32840764 44377339 54410479 61031796 68162385 76962985 82690597 82867939 78732696
19527 78732696 74763669 76490316 81891276 83459291 80521007 80339835 84674080 87722206
19519 87722206 84975178 76416300 65106313 56945717 50657146 41621060 31404526 24481067
19511 24481067 20566268 18183477 16534800 15200911 13954687 12853946 11933617 11095211
19503 11095211 10339156 9714320 9235917 8732699 8204653 7866881 7569109 7205465 6837061
19494 6837061 6506346 6067992 5664510 5492224 5282929 4916726 4797447 4702917 4617268 4448839
19484 4448839 4173617 4031097 3796615 3485289 3284329 3124882 2888258 2756741 2661259 2620129
19474 2620129 2566687 2284711 1968278 1771565 1738136 1737702 1475874 1230382 1069519 828996
19464 828996 746831 694510 681881 708950 659185 680732 634692 634962 556039 576887 572447 547808
19452 547808 411596 452973 462958 588285 664706 676569 629890 604810 568935 501518 432694
19441 432694 479154 279791 237534 260453 242129 319194 467921 538690 544949 569334 626960
19430 626960 718387 768066 737231 605844 508092 492307 421799 311961 311435 467726 548272
19419 548272 605211 592648 603193 609518 688598 731631 765789 784969 824050 963963 1056571
19408 1056571 1161852 1335078 1557646 1670581 1641804 1594833 1465796 1453328 1440703 1358735
19398 1358735 1282453 1241077 1204317 1247408 1442932 1452456 1420237 1391442 1343990 1246701 1167744
19387 1167744 1016496 826113 769923 736114 631222 734101 628376 589190 593125 615231
19377 615231 784044 673102 546940 495586 718103 854452 862657 769519 714708 823574
19367 823574 958257 953389 968338 964572 924276 845567 851115 1056941 1211139 1363007 1354198
19356 1354198 1513026 1721036 1753560 1732316 1781469 1681068 1512998 1396846 1278285 1133389
19346 1133389 1087448 1171074 1078024 973522 823936 633859 527249 658784 819965 811301
19336 811301 970254 1175080 1230673 1138144 1063405 1015477 909102 906854 865989 946167 1112352
19325 1112352 1263703 1456308 1674260 1841334 1894947 1839245 1655879 1703218 1757731 1715247
19315 1715247 1561098 1441017 1356143 1352438 1276524 1170531 1214325 1088063 866442 751593
19305 751593 744327 693516 731320 660126 487461 416648 334259 373397 487492 575968 556857
19294 556857 502958 379384 368400 602174 467306 424910 385646 302613 368599 480856 501669
19283 501669 632755 483339 500242 403820 334922 447782 545885 703637 741708 706481 666415
19272 666415 677337 801976 1019490 1528317 1825221 1918703 1903885 1874657 1864078 1726092
19262 1726092 1541714 1331574 1296116 1326236 1279058 1120621 1040383 886166 750277 688418
19252 688418 400889 399960 461204 478372 366690 386051 467409 259634 171257 169633 181946
19241 181946 97749 157287 272999 343997 424612 509607 528848 495777 510033 560691 592902
19230 592902 595646 405661 392379 468461 436850 486169 662742 636338 612189 523231 395509
19219 395509 333111 287324 218365 275871 394648 425355 386508 354875 197283 246132 331650
19208 331650 291444 320545 325432 293613 324829 369457 487392 608458 484909 519868 472358
19197 472358 252302 332567 459701 447192 395372 446678 484700 435480 468270 451608 572594
19186 572594 660979 740135 579833 447603 382949 489525 476916 504188 638183 593989 629373
19175 629373 541988 417656 473543 423524 258400 287227 315441 201274 356493 365299 288367
19164 288367 363916 440648 400836 363823 178656 151089 242348 433240 560921 442038 431636
19153 431636 468114 527845 613392 656910 558798 631639 657483 712356 935232 976709 902789
19142 902789 736672 699011 701438 691285 571962 541209 478397 438198 520263 579456 460285
19131 460285 355932 396996 584289 547381 532583 538620 631469 604102 428123 328577 448452
19120 448452 309656 225468 389328 444329 450364 413523 372145 408849 482271 565230 575431
19109 575431 477843 312184 239012 313235 352855 467275 503754 479616 427021 500663 507652
19098 507652 498467 569972 535420 575096 590621 554138 653394 799126 889915 890110 785305 746769
19086 746769 890140 860378 844210 820435 758130 692950 929363 1098067 1020164 850524 734561
19075 734561 715998 837171 1016694 1018871 847101 780901 864928 835017 873100 811644 844220
19064 844220 1007086 884649 860373 955887 1051202 984778 880571 980926 1072351 1040295 909536
19053 909536 818270 791840 925448 1141101 1201201 1298312 1332757 1309786 1340536 1328777 1160381
19042 1160381 1052959 971746 878935 834656 934193 984767 1117077 1127608 1167530 1096198 1173476
19031 1173476 1211874 1262165 1221955 1129448 1066317 1111729 1147841 1095833 1097054 1056680 911174
19020 911174 956204 915462 808994 868181 975565 1060712 1091376 999066 908574 995317 1048729
19009 1048729 1086298 1192460 1244161 1322839 1444259 1478935 1555061 1688593 1784296 1824299 1756380
18998 1756380 1664884 1661503 1592524 1657585 1812212 1890563 1849258 1974642 2049768 2199618 2234321
18987 2234321 2139663 2002443 1877201 1949116 1911679 1738594 1540566 1502957 1661150 1690084
18977 1690084 1546360 1390009 1319708 1271356 1083300 977887 933324 961208 961897 919537 1069269
18966 1069269 1204092 1135305 1147761 1241813 1201169 1168726 1076278 922622 1008096 1039299 1080838
18955 1080838 1054960 1034574 1007587 959084 980581 1016660 1062859 1069746 994016 904339 866472
18944 866472 911659 900219 872963 737134 719523 806758 882422 880859 894056 958079 813285
18933 813285 670006 819121 833090 935190 990673 1075707 1015864 1153775 1094409 1140272 1285432
18922 1285432 1251271 989858 926005 1124147 1388116 1399867 1243696 1225114 1204687 1119058
18912 1119058 1118298 1227505 1293687 1239359 1278648 1380938 1463840 1537980 1661390 1705180 1772035
18901 1772035 1869596 1977171 2184059 2321774 2347624 2417306 2655241 2908507 3040704 3128229
18891 3128229 3355686 3816569 4476036 5459887 7053848 9644216 13283223 17284362 19343449
18882 19343449 19239414 18788163 18813639 19061899 18824578 16663195 15019021 15928487 18346312
18873 18346312 19714815 19154447 18217681 17446912 16997493 16098665 13253825 10013623 7977751
18864 7977751 6792941 6090785 5905734 5670628 5459371 5330304 5212608 5153633 5013419
18855 5013419 4972665 4992343 5010404 5079510 5319176 5392040 5402428 5608770 5996721 6241851
18845 6241851 6363563 6453524 6649096 7241306 7709259 8277490 9092378 10109833 11333861
18836 11333861 12906489 15049092 18261959 23334701 31510316 44525950 60067939 69695041
18828 69695041 70453610 68824936 68662578 69643532 68914459 62257942 56408975 59742708 70104729
18819 70104729 77659002 76651410 72625606 69883449 68202020 64807039 54353721 39967435
18811 39967435 30234377 24946851 21879948 19927168 18698600 17987638 17697443 17486690
18803 17486690 17264401 17212377 17484972 17808619 18480807 19590161 21318629 23828453 27648659
18794 27648659 33572843 42964779 56548676 72394931 86511937 97773180 108590025
18787 108590025 118340561 122347025 117921048 106645749 93291355 81323071 69153388
18780 69153388 54889616 41395244 31654192 25479563 21616881 19090452 17353527 15868475
18772 15868475 14750691 13961269 13356129 12688097 11936088 11247014 10704899 10117996 9619390
18763 9619390 9045461 8507049 8189647 7775728 7467641 7246133 7000427 6789218 6713477 6504776
18753 6504776 6233955 6061408 5904504 5812770 5647301 5819672 5847776 6064879 6426878 6891320
18743 6891320 7442858 8156066 9181820 10801213 13016919 16132410 19844741 23327860
18735 23327860 25938279 28214974 30317713 31377905 30461457 27416795 23550688 20271519
18727 20271519 17349687 13827911 10297387 7753908 6154478 5100032 4383612 4009283
18719 4009283 3699005 3330510 3153801 2996012 2785978 2581941 2416957 2314836 2285077 2078221
18709 2078221 1954996 1852052 1869082 1982435 1803241 1802697 1795850 1813565 1711440 1562002 1573116
18698 1573116 1575026 1569665 1563564 1404631 1313259 1124420 1126280 1187408 1210566 1204628 1285382 1438060
18686 1438060 1423142 1519602 1557407 1569410 1406956 1273896 1087531 839554 546794 316631
18676 316631 341118 457021 565954 545672 487516 332312 288513 358796 280121 279119 263169
18665 263169 293417 312946 303745 366968 369348 213144 288097 218816 -2682 -105176 -120015
18654 -120015 -142118 -144136 -149498 -44476 123021 147737 80677 66277 185848 60772 8049
18643 8049 -30881 -108156 -42078 -20345 -37323 77988 229762 292494 391299 308292 223636
18632 223636 145070 135042 238889 305565 338189 278294 286540 213247 155263 7059 -44516
18621 -44516 71218 -32280 65155 85463 95408 161198 192799 36871 10247 31280 45243
18610 45243 158954 323963 326892 265204 224453 184421 94148 103670 89036 97564 -31429 23609
18598 23609 73909 -29618 -213445 -192400 -258372 -197112 -179964 -152647 -142490 -26750 -17658
18587 -17658 -111503 -127026 -92811 14295 73339 166643 90614 23707 -83704 -135803 -132624
18576 -132624 -40180 119532 113818 165478 334235 283522 195745 156240 95936 472 -55020
18565 -55020 51833 218478 196692 236524 169416 229559 145932 6167 83470 -5669 -60373
18554 -60373 -118553 -58678 36972 17541 85102 -60752 -96468 -57552 59425 161430 225385
18543 225385 200942 171724 152020 105715 7907 -25026 -18986 26726 44495 87553 136253 35736
18531 35736 44022 88027 16626 -46685 155283 149959 23738 133904 188368 54022 3124
18520 3124 70393 165224 74440 31028 24026 100465 62860 165429 146993 121011 142083 133516
18508 133516 66222 -4440 -22699 -16845 34128 46458 144481 183960 122520 16211 -98900
18497 -98900 -127941 -144149 -157908 -212389 -236338 -183163 -104256 -15020 171135 351207 264410
18486 264410 82221 -159979 -352048 -188066 -18756 25782 159405 248373 178754 106910
18476 106910 35480 121245 62223 13681 -42671 -37596 76501 78229 124309 39807 -130723
18465 -130723 -245327 -161149 -71595 3153 1057 135584 135729 76228 56669 80560 158068 246420
18453 246420 188851 142808 237253 111552 122146 210851 142442 283938 290596 96511 -24691
18442 -24691 36160 84679 134756 250655 271726 207122 211373 296707 333208 336851 207541 159079
18430 159079 94027 140070 304372 418873 399096 387181 414313 604024 651718 615452 644264
18419 644264 766627 804150 716788 596710 626981 598228 709003 871182 775180 706717 663836
18408 663836 594408 581858 604328 464901 276695 303209 354267 437397 353462 227534 147372
18397 147372 198483 224011 265972 273965 275838 287930 303145 293511 214519 213099 220589 196440
18385 196440 127768 6233 -558 100342 199020 114003 145763 204623 281692 117564 -14084
18374 -14084 57874 309155 577960 735002 706689 682527 667444 655317 678860 670394 803870
18363 803870 672523 562646 602405 651528 722472 755671 767373 840877 765461 625469 572069
18352 572069 402188 311136 529918 459714 327069 265925 338414 379266 320399 159892 133351
18341 133351 67922 181366 336870 385194 210651 93770 55599 83427 65733 121321 198634
18330 198634 280578 319110 276865 218261 161030 215213 195773 211368 224701 269890 291954
18319 291954 215299 137221 298507 390679 273198 201262 219763 109590 56074 -80088 -128141
18308 -128141 -34752 110457 91492 116928 148768 135673 144945 -12862 -94197 -89014 894
18297 894 81872 177063 231861 275744 233040 237919 208561 225110 418678 465719 590431 588149
18285 588149 533938 319446 75804 -50118 87531 243574 290774 266411 258027 318491 379478
18274 379478 447409 544083 629357 497101 446073 530875 540745 485911 448187 460801 373936
18263 373936 147237 131648 158535 264066 387743 508785 577704 472175 279929 214550
18253 214550 165221 113186 104568 358782 341579 362665 335261 408903 516374 604026 748300
18242 748300 795702 764429 664110 461026 351418 375134 238396 155412 -54567 -39092
18232 -39092 62585 146610 194484 135025 64108 89800 69494 170155 297563 439271 443988
18221 443988 412832 456155 348939 425116 479146 531095 450494 664928 743752 635420 528093
18210 528093 506111 480556 528940 558381 421544 375722 389782 473031 488653 377502 319565
18199 319565 217014 202035 257554 270307 262126 366519 395636 374511 371970 276009 275670 337118
18187 337118 468868 443378 254067 250173 118807 173650 258904 255116 283926 234523 199991
18176 199991 333026 411900 391129 261736 195066 295233 465816 425108 182750 185355 406159
18165 406159 455271 427064 590940 570331 524212 418979 477406 706987 877596 864727 881580
18154 881580 777290 773180 721893 712139 789701 780148 940378 1125440 1194242 1213103 1294536
18143 1294536 1408129 1471499 1451754 1500817 1582672 1603454 1751336 1830708 1976335 2102552
18133 2102552 2208403 2389834 2614272 3001323 3474075 3850970 4196198 4696291 5125816
18124 5125816 5673208 6441166 7526499 8777975 10324881 12354596 15093470 19005203
18116 19005203 25509585 36251368 54853966 83594362 111537036 118939213 112704318
18109 112704318 107750001 106288105 104868788 92773910 64063457 41050281 28969929
18102 28969929 22616062 18734894 16130238 14252467 12770051 11626770 10784632 10066976
18094 10066976 9385943 8820099 8299301 7843475 7453899 7127686 6780897 6413675 6111429
18085 6111429 5941417 5645015 5208633 4876153 4516991 4145896 3847637 3680205 3404866
18076 3404866 3341029 3384236 3412246 3393977 3229087 3113334 2967265 2946018 2793678 2660616
18066 2660616 2511494 2339981 2293822 2241880 2060680 1760079 1686018 1524052 1381007 1265316
18056 1265316 1132625 939843 942002 834075 673702 519043 310500 286936 319544 252187
18046 252187 291316 166448 -11854 -72932 -3521 142530 112489 209835 191025 -4244 -69991
18035 -69991 -169708 -273767 -140391 -37489 -128671 -183799 -166490 -118264 11228 164114 57965
18024 57965 -71457 -196884 -115775 -153509 -104530 -4188 5294 -11959 -78712 -167608 -286967
18013 -286967 -207559 -34058 -119826 -47150 -17735 -78483 -137439 -222556 -323619 -253215 -120035
18002 -120035 -94378 -48051 -15783 83555 109311 199261 144882 -21391 -51692 18526 104158
17991 104158 135843 188040 139948 39362 251572 340812 306860 205463 221785 193989 64888
17980 64888 -82989 -53057 -36414 55221 45016 -116882 -144063 -63202 -129334 -158423 -145738
17969 -145738 -85917 -125337 -108055 -75347 -55189 -46882 -54341 4299 116087 142570 195559 -63935
17957 -63935 -143919 -43448 27926 -30027 -151429 -141377 -78634 -42047 -61124 -127075 -66417
17946 -66417 46937 205841 151815 121508 96582 35291 161264 169795 119496 82342 19579
17935 19579 7324 81563 146140 68379 -3742 -8174 88476 127401 208234 150641 -2945 -53085
17923 -53085 -176600 -135979 -89085 -124353 -115311 -33131 97567 130880 219713 129893 107014
17912 107014 40134 -87969 -112571 -138679 -185847 -167666 -33818 -71334 -127127 -60617 -56538
17901 -56538 -13176 -16438 -330 -21973 -92612 -94433 -86346 -71070 33120 20449 80468 45520
17889 45520 65066 -19309 -73181 -120769 -187100 -132712 -37408 -3449 -67109 57765 61862 -200534
17877 -200534 -228038 -164806 -85766 30509 -140023 -411592 -529443 -367733 -249937 -217338
17867 -217338 -200874 -40327 58061 19592 4973 -8353 -100118 -173492 -222648 -84291 -74084
17856 -74084 32513 137756 85204 90153 -21466 -64538 -74247 -79553 -120638 -89354 26858
17845 26858 5691 -147570 -195722 -56672 10869 87520 116359 52285 40942 -41076 -166369
17834 -166369 -166741 28886 165804 79560 -27015 9540 -9831 -16241 33894 67457 121176
17823 121176 113844 111486 31406 36877 -61181 -259709 -242236 -48826 -10267 21097 72142 103015
17811 103015 118127 62152 3425 198567 216142 235590 171315 222667 278754 283784 261148
17800 261148 265854 204249 48440 -74279 -20683 -104185 -207862 -214879 -212150 -191393 -63670
17789 -63670 105633 30772 -37481 87904 193028 3455 -214452 -126708 -91554 -44008 -42752
17778 -42752 -116449 -120006 82217 177296 108121 183950 89953 -79931 -113811 -47367 -2078
17767 -2078 31928 158543 223055 295833 274743 254380 237054 122087 5598 -75355 -18707
17756 -18707 187930 299719 197973 167860 74253 26483 16284 7403 -70047 -136232 -209399
17745 -209399 -199430 -156354 67567 203881 69588 -94870 -204335 -334006 -380144 -320201
17735 -320201 -257181 -65671 163504 143571 141833 195123 111437 13445 -10367 -64884 -79749
17724 -79749 -2285 22029 131458 105751 154434 218572 152217 -11739 -136940 -152442 -59641
17713 -59641 85641 157668 102743 -3167 -80328 -180975 -227789 -179894 -126799 6336 -89086
17702 -89086 -128072 -196926 -249056 -306209 -210693 -136502 -170839 -84113 -144946 -190422 -187059 -207221
17690 -207221 -96078 -140374 -123539 -53847 50942 130354 281511 231012 7549 -184238
17680 -184238 -302754 -198359 -132367 -148723 -71686 -83864 -137586 -124389 -94177 45962 -77515
17669 -77515 -123368 -246427 -169168 -48582 -43204 -68797 36579 68145 -47959 -121552 -49164
17658 -49164 -147047 -282376 -300416 -201349 -24089 80928 186902 158435 123595 160870 13175
17647 13175 -89224 -153344 -271626 -323700 -202207 -143564 92498 181622 101604 96567 69048
17636 69048 -75584 -177748 -184521 -251625 -321134 -234085 -198645 -188769 -200562 -195090 -93035 -62299
17624 -62299 -17409 -50561 -108350 -96458 41427 78267 35942 -50443 -70351 -165229 -209747
17613 -209747 -153742 -147565 -139587 -94587 -135939 -190586 -142032 -179982 -220013 -109480 -147986 -99029
17601 -99029 45439 46093 -27481 -200272 -179940 -51764 55489 92298 78201 172375 153226
17590 153226 98243 52333 164212 -2381 -94772 -145769 -116627 -181599 -144681 -196337 -207903
17579 -207903 -194712 -128426 -58513 25748 -22074 -28172 57484 148522 23432 -14356 7958
17568 7958 -58719 -103317 -151023 -5778 -24071 -23136 -106101 -65905 -124260 -326247 -284491 -288733
17556 -288733 -284322 -312800 -261044 -221778 -49204 -6928 62414 136132 50829 -3440 28635
17545 28635 39461 190860 109027 158672 214922 247513 238953 322729 387205 388223 376721 262531
17533 262531 131232 17981 -42733 -73589 -48981 2338 -83356 -54705 -65766 -184442 -217322
17522 -217322 -145141 -119979 -76062 -102010 -289212 -251220 -77066 -69676 39972 50909 -140626
17511 -140626 -259249 -208416 -200521 -130316 -481 -31151 27529 -24022 -31722 25297 -61098
17500 -61098 -201750 -224469 -170838 -287590 -311907 -393005 -304201 -382753 -473409 -343399 -164404
17489 -164404 -29443 -122033 13822 -15316 -132743 -159885 -94720 -132317 -201663 -131608 -62136
17478 -62136 -154120 -186370 -162443 -263159 -274589 -178021 -153234 -113640 -16470 83047 26222
17467 26222 -100726 -102282 -44561 82030 43045 -167382 -161114 -1516 -25171 -96383 -122807
17456 -122807 -222926 -253338 -153343 1306 57625 65159 74031 38299 167736 322849 503578
17445 503578 551607 583171 618917 606004 477119 405379 386297 344647 121362 -74646 -57117
17434 -57117 -74502 -58058 -116134 -67814 -88948 -165105 -262035 -372864 -375201 -297244 -209503 -152939
17422 -152939 -72579 -1344 -18460 -104779 -247209 -213728 -178664 -237869 -299039 -353503 -370951
17411 -370951 -295006 -242940 -257358 -207612 -113280 -154322 -160980 -287721 -210152 -142218 -128855
17400 -128855 -172697 -139575 -140190 -76658 -54705 -228078 -228454 -185532 -168008 -80876 -26970 -1602
17388 -1602 -89741 -192234 -199099 -162849 -114885 -85179 -31107 -75822 -387987 -425027 -327723 -199705
17376 -199705 -56342 103269 110302 1057 -63808 -153937 -170632 -84994 14908 7063 21699
17365 21699 -123081 -239743 -340983 -314883 -191562 -126198 -90814 -116269 -87154 13636 201910
17354 201910 310903 309987 226052 73850 -118362 -74168 -35518 46246 24951 -71364 -22239
17343 -22239 1644 -8928 -66517 -177965 -123719 -50530 -6005 28446 527 -37445 -91414
17332 -91414 -168667 -242230 -227190 -278439 -319945 -326209 -207550 -158184 -121849 -161813 -148579 -90170
17320 -90170 57709 117699 73784 163573 86618 47153 -59155 13685 33032 -94290 -114138
17309 -114138 -99569 -30374 81892 118937 67742 84281 186571 56744 -100638 -61565 -68028
17298 -68028 -23730 -199451 -195198 -10758 -14028 -49930 -51416 -56705 -164681 -110000 -83478 -128939
17286 -128939 -118687 -12580 -9633 40849 -16086 -42574 -87672 -155283 -162408 -125222 -70569 -32218
17274 -32218 -134065 -135108 -7244 14218 -25040 -12407 20545 80378 235478 319475 199991
17263 199991 40691 -88754 -81543 -118730 -145431 -153392 -148217 -50604 57083 95033 60413
17252 60413 73232 67478 113513 45310 -9042 16302 -133141 -104209 -112694 -70869 39663 -25180
17240 -25180 -178851 -281761 -270098 -319328 -332375 -331299 -223948 -169112 -37755 98819 172581
17229 172581 193452 243190 221685 148598 113100 11070 107984 120040 74255 -4727 -91188
17218 -91188 21801 138652 -43705 -112282 -91608 -106365 -59680 69485 174672 104684 6274
17207 6274 -56242 -51603 -68058 -120634 -274388 -315573 -149039 -9929 27546 15630 -83781
17196 -83781 -76781 -5449 40294 6044 2245 25267 102619 -52103 -101316 -67298 -70530 -103282
17184 -103282 -143208 -104490 1568 39335 53647 57053 -14900 -124151 -143684 34466 -14558
17173 -14558 -87167 -128658 -316973 -300517 -197625 -47050 -71814 -223353 -213144 -213596 -145771
17162 -145771 46793 -52720 -68427 59996 -31781 -166083 -151155 -217138 -248617 -132500 -141828
17151 -141828 -168852 -82619 -55347 -115430 -155389 -73622 7139 -66766 -231878 -212718 -75092
17140 -75092 -135255 -103067 62185 71865 185706 146412 169382 195244 14552 8652 34405
17129 34405 -144769 -258407 -245119 -159264 -75065 -107844 -49905 216120 317637 276975 220228
17118 220228 151136 189404 190861 12823 67621 -27984 -94656 -70007 -46167 36125 49032
17107 49032 60130 -40129 -117793 -55157 -151770 -164412 -119925 -115927 -112339 -146130 -246661 -160929
17095 -160929 -53237 -11870 19944 23357 1326 6910 -23228 12511 158151 80456 57284
17084 57284 51434 15636 -154797 -251039 -244727 -166471 -113983 -111387 -89148 -60807 -155416 -64799
17072 -64799 89175 41926 -38526 -21872 -90195 -102020 -97778 30984 -55762 -127316 -148682
17061 -148682 -118868 -105300 -212645 -184061 -260712 -232158 -186464 -31652 36659 37579 51265
17050 51265 -75729 -227408 -337556 -384673 -185721 -85897 56205 188957 235927 175045
17040 175045 107886 80503 145395 11615 -118552 27891 54367 23529 -5003 -93996 -64063
17029 -64063 44082 -109932 -206549 -252358 -252814 -209767 -165206 -143826 -86616 15277 32002
17018 32002 -16263 -65538 -165033 -125486 -41570 -51155 -12439 -57492 -127931 -63432 66969 27460
17006 27460 -71778 -122289 -89457 -30541 -24654 -162089 -179437 -113887 -141341 -45312 -164232
16995 -164232 -224321 -152781 15004 35770 -122194 -142583 52103 205485 223317 17579
16985 17579 -132029 -241765 -442663 -355429 -265404 -226174 -140995 -46801 -60509 -161713 -127459
16974 -127459 -29903 -61475 -67975 -111521 -185564 -241050 -273191 -291852 -205141 -41675 17574
16963 17574 5574 -33168 -80137 -38586 -58824 -127503 -83489 -71620 -70981 -34774 6466 17535
16951 17535 -71496 -140818 -195768 -74073 51429 76611 21710 -30219 -135246 -147692 -169176
16940 -169176 -238193 -236802 -125228 -148355 -261337 -274478 -284511 -310594 -242480 -189732 -244105
16929 -244105 -306999 -209063 -59190 53088 -52361 -88308 -10182 67949 63268 121206 149985
16918 149985 231224 193771 165142 184361 24666 -19688 -136290 -103412 -255976 -235027 -197167
16907 -197167 -113368 -36376 38596 -5514 -199 -28216 -60507 -120322 -84330 -159149 -171815 -189858
16895 -189858 -318427 -291232 -152874 -170917 -88479 -22934 69138 61644 13758 -108186 -129306
16884 -129306 -72075 -104863 -37946 55176 72270 25580 90236 176787 194353 135846 172245
16873 172245 46345 7143 -71787 -136245 -109569 -230122 -251877 -183801 -28519 92440 173424
16862 173424 104384 -38548 -188592 -141107 -85385 -120960 -145514 -176332 -84137 -102358 -196327
16851 -196327 -141509 -98079 -60587 -1975 -45178 -158089 -181063 -176687 -101880 -78066 -59952
16840 -59952 -33361 85852 149156 301670 177193 58773 12121 -121465 -358676 -474596
16830 -474596 -404009 -368300 -286235 -182745 -136028 -162492 -213077 -58099 101261 23880 -143354
16819 -143354 -155315 -118236 -99905 -5296 -46021 -23706 -25658 -103453 -132876 -105265 -227683
16808 -227683 -195759 -25770 94889 193645 142517 24909 -168163 -125151 -100936 -85491 -205907
16797 -205907 -139324 49011 133041 60564 58750 90533 -1707 -96348 -138555 -215266 -203709
16786 -203709 -119761 23090 75618 4835 -110384 -128835 -67916 6981 68056 54202 55902
16775 55902 127734 75249 38439 75188 50332 119262 37977 154195 241424 147637 10679
16764 10679 -8678 12202 28061 24371 -34025 -41165 29567 -28473 -140548 -220205 -359871 -368080
16752 -368080 -294253 -265382 -108612 39041 -56846 -156724 -116186 -187022 -189327 -184911 -162869
16741 -162869 -64566 -92420 -153984 -205928 -132457 -97448 -80879 -76666 -149843 -78740 -51415 -67152
16729 -67152 1628 -94370 -115901 -32317 -15886 44267 77996 188164 190782 52766 -43811
16718 -43811 4667 -24881 3386 135792 10873 -46553 -18922 69699 11492 -63263 -103046
16707 -103046 -176112 -241421 -317236 -284638 -244846 -26467 -40156 -156551 -211664 -227256 -250393
16696 -250393 -311492 -258928 -202808 -193073 -118302 -118341 -34693 -111219 -56671 17848 -13327 -29795
16684 -29795 -9249 -97298 -110302 -94929 -127945 -24031 3996 -21367 -36285 73561 63529
16673 63529 -114106 -227618 -269764 -295818 -143222 -51672 -59338 -11000 -20937 -14682 -26119 -186850
16661 -186850 -110123 35076 164388 129391 23632 -14509 -32813 -26622 -91230 -88103 -18175
16650 -18175 51916 40125 -32386 -58029 -6418 -64923 -95222 -86159 -60572 -30152 -10058 67121
16638 67121 143457 -79786 -67826 398 14194 57400 15468 -40166 -2516 -35337 27029
16627 27029 51255 3939 -45412 47402 28010 -58986 -191198 -222909 -303053 -173744 26328
16616 26328 -7251 -242139 -315104 -260431 -91105 -76198 -13994 3285 -21701 33562 65080
16605 65080 86098 82173 53427 136234 198636 223480 182127 82481 -57165 -48667 -65463 -48324
16593 -48324 126757 303273 95347 -14343 -124286 -173229 -74764 -31198 -98077 -103635 -119637
16582 -119637 -39385 57978 182267 166373 204230 254218 222553 112817 -113015 -72537 181974
16571 181974 178040 126011 60454 -132153 -94512 -31346 -123887 -114937 -83325 -144219 -199833 -244512
16559 -244512 -178131 -42297 -51312 -110799 -132968 -188256 -128116 -95535 -43328 -41665 -79396 -67775
16547 -67775 54756 138991 -19787 -131205 -99715 41 -28100 -13383 -8656 82559 113168
16536 113168 -11652 -167734 -177709 208 107266 137344 -22331 -62393 -189231 -254329
16526 -254329 -284466 -132017 -48184 -73909 -200033 -237029 -290210 -98765 -43949 -71344 -104517
16515 -104517 -11188 112719 107842 83056 91149 99610 22261 95937 -12524 -53579 -186820
16504 -186820 -203283 -269815 -448891 -431032 -364086 -294967 -178060 -136119 -102640 -86837 7779
16493 7779 -57433 -66913 -50672 -133038 -60244 -137522 -160768 32333 101884 3858 -51488 73877
16481 73877 46310 -105774 -4873 26691 188358 158743 6375 -49287 46470 51413 -79475
16470 -79475 -60951 -27537 -104909 -3948 138722 99784 -4081 -34339 -58777 -161865 -245354
16459 -245354 -206864 -90007 177817 153139 87711 -74662 -229718 -209595 -95515 -134058
16449 -134058 -51104 140601 288919 285883 195219 126487 155851 155322 110590 60057 -60803
16438 -60803 -72644 -51270 -1857 -114159 -151232 -80810 -51925 -90738 -42652 -28745 -57083
16427 -57083 22061 -10437 -29025 -100329 -63495 130920 162725 113964 37710 -86409 -137040
16416 -137040 -42179 6884 56478 -27612 -68748 -46528 -55347 -99238 -103069 -127691 -3128 121412
16404 121412 117183 66312 -6386 137917 187769 215014 88793 4652 38390 105866 78111
16393 78111 -32251 -162580 -9920 113984 -30480 -173003 -218814 -139809 -60518 -201449
16383 -201449 -283452 -203766 -169900 -211103 -264272 -167802 -123821 -70614 -113597 -126054 -131037 -144352
16371 -144352 -236772 -326013 -342928 -199831 -124807 -120450 -35196 -74075 33844 199739 109040
16360 109040 161848 207730 250385 172522 -5410 -194182 -206742 -106979 -195084 -85470 -3734
16349 -3734 90495 -17795 8757 28950 -37658 6950 252098 287255 153972 114744 74785
16338 74785 66592 13751 -30306 66035 11114 30346 21619 56059 20458 -21439 2594 57902
16326 57902 126768 73489 47110 118237 93629 67468 31876 132093 109436 -87155 -60251
16315 -60251 137266 235226 113216 168386 229137 107380 94761 104042 20183 -65082 -104715
16304 -104715 -180192 -152503 -134278 -62238 18232 193945 345152 215352 59055 -6451 -145462
16293 -145462 -208189 -173186 -160334 -203644 -169641 -50705 -21778 -84434 -137463 -4734 -33510
16282 -33510 49262 161201 134786 76436 -10965 -93968 63693 67518 -141830 -107706 14269
16271 14269 -153134 -68495 56744 162936 68989 -59435 -92990 -50466 43418 28338 22304
16260 22304 226017 292887 81922 -56472 -83974 -217384 -323412 -246780 -180550 -176733 -110376
16249 -110376 91917 52778 6503 155040 133618 88739 74778 109024 9097 -7918 -42466
16238 -42466 -124623 -253386 -334689 -242712 -147892 -19925 10172 41168 96366 69633 42996
16227 42996 14553 -33201 -120448 -46289 -65480 7301 10906 46138 83754 87344 -31072 -109033
16215 -109033 -33851 -111077 -71571 -52043 66668 78752 -44916 -7547 87095 231580 216155
16204 216155 4534 -74274 -67915 79237 54053 -24853 4062 33094 59258 92008 37297
16193 37297 -99626 -101981 -135702 -172921 -98160 -172027 -227826 -336296 -327755 -159679 -81001
16182 -81001 -181781 -191223 -123888 -105106 -50532 11101 -30258 -30225 33707 -27810 16247 -8027
16170 -8027 -88268 34971 -38441 -43123 -32 -21557 -188305 -234389 -165104 -118993 -107942 -163953
16158 -163953 -177616 -153801 -79974 -36061 42354 25294 -100443 -55695 3049 8238 30143
16147 30143 -18480 -52965 -118752 -132696 -150340 -52730 196553 238986 206361 109112 69507
16136 69507 129047 120982 11234 -46638 -70235 25221 154358 265119 104035 -9724 120955
16125 120955 101303 14896 -19624 -84403 21220 -66377 -145061 -71345 -82520 -50009 142346
16114 142346 127705 -74892 -109379 -185780 -207902 -259156 -304616 -279264 -317729 -367180 -278373
16103 -278373 -89440 -82416 -150169 -178865 -89408 -85150 -119716 -45605 4009 38986 57633 -65819
16091 -65819 -168490 -169331 -142668 -85848 -239469 -327194 -392336 -425692 -179852 -61638 175216
16080 175216 313887 115014 -144651 -162317 7965 9245 -56616 -90035 -118110 -84025 -46421
16069 -46421 -104604 -58870 -22736 -2646 -28438 -32149 -55820 -102112 -143726 -117440 -70957 -17311
16057 -17311 15084 111690 73678 48574 -24720 -105858 -31400 130749 135788 3418 -171717
16046 -171717 -120497 111427 176654 109885 53220 83838 254223 93950 -192314 -251290 -236074
16035 -236074 -32161 37509 -113352 -339954 -189565 -31893 -40745 -9457 -22137 -31931 10401
16024 10401 -9104 28159 -2277 87091 57522 170480 168334 133135 133884 136451 64054 90228
16012 90228 -4677 -83788 120947 139767 93097 98202 30058 -56772 -127922 -144202 -42432
16001 -42432 6822 44278 131710 153659 126389 68475 91911 24304 -79555 -244836 -289834
15990 -289834 -282414 -241652 -314000 -269055 -200587 -153744 -78114 -48526 -53086 65201 116532 176176
15978 176176 64683 870 9340 6091 24641 54910 -34636 -82045 -23951 -21480 -26084 -64369
15966 -64369 33665 30781 -29155 -151502 -124734 -112464 -200280 -145265 -174186 -213662 -212787 -99940
15954 -99940 -26751 19488 28779 72986 33783 -57644 56007 168390 92624 26296 13291
15943 13291 132590 36562 -52441 -27357 140256 322368 316989 191680 139144 95257 293
15932 293 -33833 48214 -7951 -38313 31977 -8859 -42749 -75085 -47946 62834 -18113 -70415
15920 -70415 -108660 -181781 -291774 -356218 -322032 -133329 -77235 -191943 -277105 -215579 -218205
15909 -218205 -238611 -267101 -192736 -117321 -47815 134929 126355 -31032 -51185 -51426 -63979 -89034
15897 -89034 -90945 -142636 -130892 -178411 -108035 17193 -21294 10874 -120625 -203249 -138826
15886 -138826 -157004 -140753 -43752 71374 41337 41610 -66327 32595 -15678 -95863 -106419
15875 -106419 -138712 -159467 -78122 -63920 50096 -18237 -171583 -172336 -173951 -155946 -60467 -113881
15863 -113881 -90974 -75061 12474 81527 133250 174208 255325 183917 42464 -83742 30310
15852 30310 65314 60626 86275 44264 -17337 1190 -66280 -120692 -106841 -49549 31234 86665
15840 86665 79935 99971 109675 171133 284913 197946 105103 3325 -27734 -124092 -140862 29563
15828 29563 79763 62880 125137 104771 -16488 -35091 -71509 -38912 -57609 -76681 -6713
15817 -6713 -20737 69054 224183 256786 183181 92147 12218 -137125 -45385 20148 -19956
15806 -19956 27657 -68241 -201694 -92875 -265294 -327651 -164758 -185574 -264721 -332413 -252961
15795 -252961 -188682 -118732 37339 -50750 -231768 -220142 -155569 -99534 -136694 -168074 -324370
15784 -324370 -460920 -381626 -323410 -217875 -25907 31944 -93932 -118796 19217 32325
15774 32325 -25051 -204404 -198298 -171875 -184430 -125563 -32939 -94044 -123966 -47825 4975 46636
15762 46636 125946 110127 -72296 -169711 -64628 -180153 -257188 -234076 -187403 -164700 -73217
15751 -73217 67661 21488 -8059 -55104 31558 144272 96277 -15278 33188 102339 110693
15740 110693 3480 -73150 11918 21431 -93058 -60781 -155321 -61784 176849 219602 184988
15729 184988 95217 -82191 -246718 -215193 -111097 -5387 114046 154103 50882 15061
15719 15061 103709 77956 26836 63877 32169 -152639 -217091 -156198 10783 84394 185766
15708 185766 293408 144037 -64144 -222885 -243535 -200487 -51519 87726 144960 53200
15698 53200 45162 -56321 -147731 -184932 -68508 -104136 -11969 61134 129256 133120 8487
15687 8487 101826 256383 271675 268305 323589 286699 114750 2962 -145016 -176417 51778
15676 51778 107689 71751 10306 -23733 8198 94435 58360 -64877 -71256 3716 108229
15665 108229 148678 132608 -25612 -62208 -89002 -1226 56667 46841 2955 22811 128246
15654 128246 137328 72009 16141 -15325 -5667 35679 69193 129307 62282 -87136 -261250
15643 -261250 -227871 -160803 -227205 -87561 68902 79581 -44858 -275603 -286092 -198336 -87384
15632 -87384 -133875 -76745 -172990 -221174 -226914 -176010 -179511 -208148 -203903 -77417 -44651 -142835
15620 -142835 -75628 -132084 -222911 -239057 -130731 -41598 -22769 -63803 -12469 -46698 -226371
15609 -226371 -366882 -345884 -222371 -198666 -165723 -107490 -42745 -18775 17778 -289 -85397
15598 -85397 -114662 -166803 -315512 -248469 -13774 85277 171716 145753 33344 -89673 -186194
15587 -186194 -136758 -62619 24283 -41308 -130658 -24747 2979 -54275 7575 182753 211711
15576 211711 255537 229634 189188 294106 249941 99745 88109 128425 -15735 -54805 -123315
15565 -123315 -106557 -51222 -11605 -62927 -123246 -2152 26961 100561 87754 -66441 -217264
15554 -217264 -276611 -267275 -355797 -246790 -224342 -69693 80231 58626 -17325 72850 170204
15543 170204 -45811 -218711 -198669 -181966 -201228 -181156 -62213 -42408 -18772 64433 11687
15532 11687 78703 102137 81840 178427 109545 25853 131984 21151 -16959 -17646 -73704 -67873
15520 -67873 9600 153068 -63507 -204446 -82758 59345 28544 70068 116248 41907 7818
15509 7818 142004 192663 78559 -3281 12579 -109717 86308 104308 121599 180859 214001
15498 214001 123096 141217 77845 -60134 -68552 -39137 62191 10324 -79572 -141207 -27220
15487 -27220 -92899 -115317 -165560 -207104 -159305 -48500 -9322 -75772 -72342 -57223 -14715 -29893
15475 -29893 76264 254135 235262 229060 176960 141003 101410 81714 51385 -17474 29582
15464 29582 20808 61711 61099 -39639 -43621 -42782 52180 162603 163744 93274 24025 61595 156176
15451 156176 114299 3722 -4298 25330 -34166 -23025 23407 206824 172765 92260 31733
15440 31733 -24953 -110761 -20959 -2062 -169511 -33527 117585 121202 121791 123414 51760 -18230
15428 -18230 -177139 -194188 -194089 -59710 -42220 51150 82729 -886 -65801 -70205 -36198 62371
15416 62371 136957 1648 -50972 -71869 -47851 -42627 49126 32407 -119807 -276837 -227838
15405 -227838 -144701 -252655 -169259 -111349 -174718 -174516 -157692 -156574 -83213 -114783 -212739 -156631
15393 -156631 -148206 75497 140696 139863 147334 84948 -23432 -55416 -155842 -103155 -44640 -123602
15381 -123602 -69574 -1836 89154 -58587 -183316 -175715 -160290 -21458 114467 224850 190641
15370 190641 117631 31179 -13111 62679 96537 9801 1491 124295 73403 -31335 69508
15359 69508 56212 12731 -111646 -131959 -233448 -274216 -258039 -215444 -112901 -72843 -78552
15348 -78552 -28818 24493 48830 117274 193772 260776 47431 70882 128648 71469 19372
15337 19372 8328 44028 95297 92568 512 19318 22770 -4322 -13059 39344 31925 63839
15325 63839 132588 163619 91173 -81246 -51713 -118018 -109697 -84789 -26598 7471 49469 41077
15313 41077 -58112 -88295 -123493 -220826 -181525 -116756 -7756 -10460 28119 9121 -85773 -152083
15301 -152083 -122256 -115796 -180493 -121630 -131872 -157920 -162946 67574 23658 9790 -27785 24084
15289 24084 -24068 -5232 83438 139381 101267 26345 -55396 67759 225970 114631 139813
15278 139813 97136 25635 -68179 -159065 -54406 -59097 -140673 -55861 117083 127281 83017
15267 83017 107929 85208 16300 140876 64465 -124144 -120730 -151710 -47876 1497 1505 -69680
15255 -69680 -139796 -258634 -270056 -268373 -205725 -288136 -304865 -212366 -228301 -219148 -167167 -118035
15243 -118035 -134623 -160829 -287081 -379911 -389963 -406964 -432733 -292469 -70431 192052 223315
15232 223315 160487 246998 188572 72382 146822 280448 190237 209662 159221 -1172 -123176
15221 -123176 -88746 -23785 -79914 -52430 -56269 8521 -60251 -71812 -57823 55396 52431 -72908
15209 -72908 -111117 -8756 -26716 -29349 -16503 -123817 -63750 9064 5015 -17968 44697 43047
15197 43047 -164615 -178455 -17077 -91929 -48837 -4130 -83401 -100045 12134 27148 97643
15186 97643 66036 83279 27405 57587 80230 125495 152793 199139 243634 231882 214311 56508
15174 56508 18690 110738 136333 235467 202241 65434 -24615 -36400 -44315 -76039 -48671 332
15162 332 41702 30689 49821 55784 9212 52215 28235 111987 94627 52991 -30143 363
15150 363 28936 29801 27321 -57325 29901 13169 -110816 2308 56255 162655 152686 86601
15138 86601 91204 -38018 -35569 -107055 -42099 22203 107549 41176 15430 23547 -47392 -87198
15126 -87198 -89800 368 99502 91848 158363 182596 171392 216412 55718 -74708 -71106 -16690
15114 -16690 -71417 -175044 -121422 -109808 -14478 5000 -11856 73666 1164 -79592 -20290
15103 -20290 -18084 -89998 -132379 -71450 81506 -31422 -269615 -362252 -188746 -14124 -374
15092 -374 7540 110676 172997 78196 18055 2103 18709 31468 6074 -58571 -106421 -42947
15080 -42947 58557 -30258 -98819 -83652 45547 25461 -61668 -139607 -88213 119065 92572
15069 92572 110990 69511 -30257 10283 -21048 -7726 14529 -151307 -252126 -284228 -175363
15058 -175363 -159392 -77560 -21939 6718 33646 77559 -52820 -147220 -71302 56166 -31673
15047 -31673 -67129 -14919 74980 90817 5049 -48854 -51630 -66646 -14840 10711 -15644 -156021
15035 -156021 -110323 47947 68833 -47180 -131897 -124982 -138126 -141136 -214223 -181374 -163543
15024 -163543 -85948 -57894 6732 121234 119239 -106737 -183766 -153234 -142515 -248234 -64399
15013 -64399 71333 -29781 -275164 -339098 -286670 -258750 -176401 -58225 22936 -15098 -60620
15002 -60620 -16585 -12632 -32165 20749 -81061 -141298 -175232 -6948 123305 240736 203550
14991 203550 125905 34905 55005 129317 85832 6008 116562 81053 49311 99853 26971
14980 26971 9147 -50735 -47570 -193386 -214305 -135161 -155192 -157252 -58728 -16074 -56914 -80113
14968 -80113 -75646 -31599 40679 80281 14669 -7869 -100554 -99605 1567 36881 38536 170181
14956 170181 142938 -105027 -235405 -120374 -27607 -68351 51412 180170 127124 114969
14946 114969 37917 -30684 -78361 -74060 -52533 12307 -55728 -7517 31174 -92393 -105340
14935 -105340 -46703 66738 201251 135562 112991 107322 143893 75709 24455 52079 20216
14924 20216 -14870 -28944 -56033 -146776 -99041 -125037 1653 -48206 -55038 28888 18090 -11601
14912 -11601 -114525 19295 106897 3091 -132941 -115011 -108892 -18848 32090 -58679 -45767
14901 -45767 -95877 -100398 -248160 -159016 -98092 -146321 -251786 -347002 -304617 -185696 -110513
14890 -110513 -74663 16933 -40525 -125200 -74995 19754 60434 23226 42700 -112014 -94193
14879 -94193 -98427 25962 32583 -123205 -93327 -37582 27388 -105607 -63831 -13329 24365
14868 24365 60412 6785 57498 153995 171276 64472 -92077 -1550 158481 229375 122898
14857 122898 -20057 13886 13703 17909 -88118 -200899 -235506 -86031 -30069 -100891 -25433
14846 -25433 -4182 68016 -37861 -112497 19655 105195 41235 37754 49554 51494 142868 96074
14834 96074 142021 91205 4901 -134665 -133659 -103622 -22069 -65181 -293304 -220378 -190017
14823 -190017 -125938 -47604 -105783 -255529 -148253 -35659 -60041 -144951 -112458 -59520 -37393
14812 -37393 -76356 -118174 -82820 -50666 14280 143171 60887 -22675 -95388 48225 146455
14801 146455 115659 22944 -92041 -147853 -137241 -36265 -114106 -44377 -55837 -102130 -187497
14790 -187497 -68528 3733 -16551 -50715 -69445 -101103 -67288 -26072 -45954 -96109 -148505
14779 -148505 16313 198273 145684 113255 9489 -35490 -30307 32537 -79305 -228343 -203624
14768 -203624 -194725 -325017 -303155 -205248 -307325 -315074 -189641 -108198 -320765 -256924 -44281
14757 -44281 42656 -23571 123605 153558 80366 136412 70557 67296 72604 132331 8390 -179816
14745 -179816 -84432 53374 83569 59144 117581 130309 11644 -128061 -117927 -86843 16189
14734 16189 148250 158269 103719 32221 28115 -56305 41587 152888 194534 205010 54527
14723 54527 -1973 4246 -32108 -116375 -93757 230 37889 5159 28717 75638 176909 189646
14711 189646 -72390 -148015 3793 112132 213427 179250 116717 239456 240496 75579
14701 75579 183113 166394 99949 207411 197962 185136 37316 134405 256484 223732 181817
14690 181817 100997 53023 79990 233809 334848 298681 257690 89315 -64808 -16629 -42733
14679 -42733 -114733 31592 11472 -121796 -150441 -156707 -152867 -155958 -40340 -20331 -65551 -113621
14667 -113621 -34258 -78628 -166486 -174006 -84559 -10870 -9301 63901 194581 180078 -50262
14656 -50262 -266965 -115832 67245 50521 -42301 127948 59523 14446 -106654 -59272 -68673
14645 -68673 -115408 -105091 -53944 -4080 -52593 -98645 28556 115752 95537 -41592 -90281
14634 -90281 -318 30528 95101 175641 74499 96880 60762 70405 212164 311025 304526 143952
14622 143952 -79838 -63275 -28796 -191399 -195743 -160922 -149643 -165456 -51318 -92943 -129442
14611 -129442 2549 49333 42687 128083 289533 236388 -25373 -124425 -113805 -11975 133091
14600 133091 107292 55242 64287 124599 47295 8606 194274 88496 -81685 -116374 -124306
14589 -124306 -177083 -202025 -116769 -72993 -25330 31284 123827 263019 262820 170381 165877 14324
14577 14324 -179877 -322648 -226421 -154583 -13212 86869 -19581 -170243 -198595 -207206 -305708
14566 -305708 -305726 -149346 84742 31697 -138407 -157899 -69228 -37453 37832 142822 114775
14555 114775 131646 126179 131037 146328 45572 -55518 27005 -12041 -5440 -56281 -153700 -75075
14543 -75075 43988 -7688 -7970 -61736 -110151 -95861 -188874 -41122 1137 -82505 -133892 -224958
14531 -224958 -276814 -234511 -110553 -137972 -93170 -88717 100168 243228 142877 92148 -44655
14520 -44655 69448 224001 143785 37374 37544 113646 162303 155101 26574 -176433 -220897
14509 -220897 -195907 -188569 -107269 45239 95837 11682 307 -178437 -254377 -109505 124841
14498 124841 236315 211715 155814 89106 82912 113857 226099 185081 95329 130269 192075
14487 192075 181621 1024 -14345 187912 143219 249880 230237 77286 -110469 -291287
14477 -291287 -189678 -91765 -98602 -107017 -126031 -460 28569 48596 21551 -42125 -99218
14466 -99218 -167635 -203688 -56961 40311 83529 170473 169506 50958 -60498 -169297 -47891
14455 -47891 22030 19316 28474 30346 16879 13184 96897 119399 49524 -19554 54277 17481
14443 17481 -75197 -104938 -33531 18180 55065 135856 83599 -95246 -321450 -411163 -329700
14432 -329700 -134137 41218 164482 105722 47761 -50178 -7026 17681 -65388 -192987 -103635
14421 -103635 -159988 -282170 -137327 -108627 -215144 -212450 -235544 -57719 83230 235014
14411 235014 255159 78057 -75400 -116325 -218559 -237193 -245076 -187616 -2111 116395 190925
14400 190925 246647 251435 188737 52035 31491 25574 -14212 -138951 -239527 -204572 -269291
14389 -269291 -235185 -151498 -20611 -78171 -156445 -98250 84576 22470 -36808 -139297 -151308
14378 -151308 -125763 -97679 -11102 -6823 -4714 -57416 -1770 28377 -91851 -24083 86135
14367 86135 -33914 45708 -3765 -5916 90610 76707 -22775 -77865 -71588 69322 126708 18446
14355 18446 -45193 -98703 -103239 -191815 -231652 -160738 -97680 -135008 -109709 -154303 -150537 -22654
14343 -22654 54226 -15372 -58577 -77075 4344 98741 965 -87791 -119580 -90561 69220
14332 69220 48110 25590 -322 92478 78573 144662 216231 210180 130737 15156 -31853 -62650
14320 -62650 -125075 -183542 -104560 -113087 -181593 -110782 -88196 109733 102783 34095 -44311 -120504
14308 -120504 -98061 -92800 -193857 -206021 27554 109587 -37574 -68992 -22112 21424 13514
14297 13514 10287 78402 136030 13704 -38336 -72254 -139578 -86373 59720 160842 92602
14286 92602 105464 24905 5971 5914 91346 143676 64398 30166 103027 16346 -92478 -12927
14274 -12927 711 -39999 -153746 -170562 -98052 -121834 -119959 -98705 24838 100229 152025
14263 152025 212839 423643 348988 206404 169471 259333 278825 218861 189253 95901 147828
14252 147828 284317 231122 159466 85501 17637 5874 -3984 121370 71468 219086 182786
14241 182786 2280 -30256 -52574 -107310 -27724 36649 58237 182457 229088 198408 124299
14230 124299 121688 112456 185018 246490 210093 33659 -126961 -35731 68788 -3979 35513
14219 35513 189192 168494 144794 129790 115816 141620 191901 86223 -50066 -134523 -106832
14208 -106832 74264 97074 94827 77923 155317 271382 131356 104438 157073 157991 194168
14197 194168 128627 137890 161525 19601 70836 16242 34003 -22958 -79159 -169459 -300338
14186 -300338 -79722 62073 174973 118684 -60311 -185954 -76343 14759 -68764 -111967
14176 -111967 -3947 -71001 -148397 -23788 9159 2719 -11723 -36085 -45695 -199789 -243288
14165 -243288 -179170 -14005 -16706 -42400 -180020 -162138 -139711 -161849 -136576 -132159 -18687
14154 -18687 10878 -12114 -26037 39993 73139 48414 112035 48114 -20067 24278 166890
14143 166890 165279 50734 -26366 -46634 -17243 39188 -13949 -30134 21749 18417 139668
14132 139668 242634 173820 118617 247292 309766 364685 263536 160843 61663 116901 151192
14121 151192 7157 -116336 -149937 -153670 -111208 -43711 -67690 -64753 785 -84763 -203069
14110 -203069 -90590 102389 159716 35780 -84488 -107268 -87482 -127792 -149233 -45719
14100 -45719 25279 -343 -130358 -142269 -160574 -228801 -216588 -356428 -375970 -148820 -49780
14089 -49780 -131316 -66946 -33778 -20323 37719 -80574 -69549 -2418 8386 -4423 -31897
14078 -31897 -139289 -179685 -169764 90691 249929 125513 80895 49381 -34306 -40057 -145869
14067 -145869 -1145 178069 231892 220326 98882 -39719 -64743 -35345 6661 -4017 25932
14056 25932 21492 123820 -37409 -142958 -189213 -109524 -130063 -170568 -24949 37302 -43799
14045 -43799 -182268 -238388 -116384 -102104 -140052 426 91754 85554 106420 -86594 -210262
14034 -210262 -201811 -99753 -90363 -155305 -128116 -50354 -127589 -55661 -8599 -16824 -14030 -72280
14022 -72280 -104794 -27490 89125 199928 159519 184767 90734 -81291 -123880 -270675 -304474
14011 -304474 -176001 -44480 51836 -80521 -248914 -308724 -277471 -225230 -139434 -27977
14001 -27977 39463 146094 240194 269822 79815 68698 1777 -92181 -151863 -53583 5701
13990 5701 -217848 -266012 -253716 -232742 -101637 -85091 -107201 -79833 -92877 -209484 -142120
13979 -142120 106529 190925 150759 92125 121845 112195 68676 139627 311832 258453 174518
13968 174518 168180 110719 51277 22019 -26479 65141 -60186 -101980 88167 240947 344326
13957 344326 260820 124476 -32548 -118064 -129851 -22645 91971 1133 -132083 -76354
13947 -76354 -24741 32739 65170 -142537 -168331 -88540 -114931 29311 81677 17947 -104757
13936 -104757 -142248 -249409 -155262 -102992 -79391 -55681 -14684 89887 99627 -52833 -140245
13925 -140245 -55975 4963 -69036 -211519 -80161 -29208 -21289 -249054 -377772 -329411 -226039
13914 -226039 -86818 -32373 -12062 83549 60859 -92137 -107510 -84989 25691 133110 99876
13903 99876 125121 138903 91004 44940 -23583 67778 22546 -156385 -184949 -85403 -86305 -173299
13891 -173299 -123333 -139655 -172113 -236237 -167322 -33820 2731 -8079 -1937 78962 143499
13880 143499 166964 261900 276692 227552 298501 197605 240253 328475 159847 83729 172342
13869 172342 253903 262290 97362 -38293 -26753 -111130 -234129 -214743 -144094 -68129 13258
13858 13258 -59579 9722 75258 -131 -62663 -94538 -29337 -1723 -10442 35566 18734 -83052
13846 -83052 -137788 -107784 -207638 -283508 -161566 -158851 -89683 -106491 -152204 -36010 -2343
13835 -2343 88691 99670 145027 72478 31597 67574 2540 39408 70285 70982 97514 91845
13823 91845 78294 -189266 -186074 -56531 -82264 -102783 -151540 -279809 -273664 -230444 -290535
13812 -290535 -307451 -173710 -72956 -149380 -123934 -166615 -219556 -176667 -139158 -109371 -199881
13801 -199881 -308179 -335495 -233197 -88774 -26747 89851 201181 130540 102870 88995
13791 88995 192463 175636 172898 192851 165980 1707 -56998 -42447 19291 -56946 -79428
13780 -79428 -129269 -135221 -106158 92163 152213 88871 111735 124941 168201 117521 -21920
13769 -21920 -33919 -76453 -49353 76959 95921 94863 110956 -17469 140240 199545 206952
13758 206952 121035 -21034 -88556 -140035 -115030 -25936 -35509 -64519 39957 42597 -11525
13747 -11525 70272 212322 247220 329898 404432 268979 69524 -27680 72762 -27921 -9559
13736 -9559 106206 205305 85534 -21442 -19229 -68197 169862 158818 57781 114275 125800
13725 125800 58338 41204 96591 47326 -151157 -125875 -39052 40634 105985 -3400 -134226
13714 -134226 60792 158173 308102 176327 107698 7821 -104488 -44046 60758 102239
13704 102239 -146898 -286542 -363083 -396356 -360899 -240789 -46824 30130 -34804 -76389 -17869
13693 -17869 94336 128760 54139 106613 178024 137130 32884 11961 14651 87379 76792
13682 76792 50295 100466 168489 -20356 -182597 -15427 -91182 -12342 41997 -11332 -85266
13671 -85266 -75076 20511 9296 -52725 64461 61402 72757 129240 230239 223000 150133 190400
13659 190400 197228 259080 183133 78259 48996 231025 229395 104734 -8227 -92175 -39005
13648 -39005 2104 -91052 -97489 -50571 99894 108568 -453 -9466 15508 105352 83942 18282
13636 18282 20363 -26586 47705 65022 38296 6644 61982 33350 28167 80446 71950 145947
13624 145947 186512 96903 -28898 36903 78734 104504 163202 105359 41683 13422 19360
13613 19360 -17784 -46663 -132875 -95172 -75606 -38061 87713 181579 113503 14188 20676 -20494
13601 -20494 -199603 -280631 -189150 -140416 -236818 -238196 -45801 31108 10266 44638 182446
13590 182446 244248 273751 313567 207109 -67345 -98234 -97877 -190623 -129473 -72034 1059
13579 1059 -115065 -168301 -144014 -157076 -189060 -52627 30166 -52812 -142647 -188492 -140997
13568 -140997 -30993 22611 213766 211754 82665 -17654 -91284 -25622 -100418 -216315 -183695
13557 -183695 -69551 -100236 -64787 17384 -24737 -100280 -191569 -216019 -169333 -79119 -29770
13546 -29770 76057 124326 74107 -28545 -56322 -65408 16918 139897 76211 9689 -27555
13535 -27555 -90842 -121471 2599 -130878 -219845 -109456 -12366 -61654 -632 140573 198875
13524 198875 198058 270035 248475 187142 130089 125410 133723 23341 -1062 23570 35611 55771
13512 55771 131897 216233 132394 71713 81725 102730 48593 10998 112142 71877 -32644
13501 -32644 -41573 -31963 -41278 -55595 -23972 -39095 -3457 -71639 -152235 -157002 -64186 -28253
13489 -28253 -50205 42022 13390 137986 279620 253297 249773 78735 22518 -12515 45838
13478 45838 -37640 -13854 146175 80534 82718 -4008 -212720 -234212 -73279 -3766 131346
13467 131346 80190 -107342 -134681 -62792 -58176 17321 -61392 -308962 -232960 -142751 -57265
13456 -57265 -165498 -153480 -28215 15663 -14964 48065 52827 -91150 -114240 -61151 -54540
13445 -54540 -75778 110895 53388 -67682 -140359 -98230 10172 5067 -1862 -56202 -80578
13434 -80578 -137151 -173884 -71620 -9715 66848 54983 67993 20811 -75635 -128073 -62078
13423 -62078 54698 -116345 -179439 -129883 -76517 77891 61740 140617 176818 214153 177452
13412 177452 56508 -52781 -47206 -141591 -243615 -240878 -92177 68478 178513 195172 278971
13401 278971 292688 160143 76056 125704 107116 65089 120270 48866 -65352 -39301 -23592
13390 -23592 -40249 13977 -157998 -248995 -225911 -57164 112748 180600 147285 111211 63232
13379 63232 98342 75333 -28983 -76151 -46491 45699 67751 163657 299023 512155 549358
13368 549358 336988 103199 103310 97796 41144 -55946 -103064 -43163 48088 105596 -263
13357 -263 -48838 -58043 -93606 -49659 57143 109536 150923 13893 1752 7338 37038 205097
13345 205097 185176 236616 206609 116534 10439 25951 54608 163728 177754 22713 -60718
13334 -60718 16275 93151 268086 273812 186736 133531 156195 192841 126413 -49356 -69887
13323 -69887 -61437 -72733 -67112 -95447 -143476 -53690 115674 200847 58724 -18782 41244 4067
13311 4067 72239 66265 5091 10517 59948 95403 46747 -61490 -87006 18863 -781 2732
13299 2732 -63895 -56697 -99579 24446 -23114 -75531 72754 66050 -67359 -156800 -168659 49822
13287 49822 55366 -72764 -144668 -175550 -46665 32106 -31651 85092 74916 47281 159784
13276 159784 97663 -64017 -179736 -205190 -243042 -207166 -130007 -25581 -106419 -25588 77444
13265 77444 91279 81719 13387 17274 -66553 -124219 -143782 -155150 -121656 -65853 -68694 -42156
13253 -42156 854 8447 47055 35728 -79984 -174353 -131013 -85872 -115456 -139771 -149536 -117486
13241 -117486 -28366 48752 37560 50267 36458 -71197 -128291 -20047 92850 74560 37695
13230 37695 163987 251407 282733 183656 40913 -70667 -45481 3480 -54787 -184209 -212426
13219 -212426 -182884 -272868 -117569 50886 -34987 -41417 96396 74782 91681 11968 36787
13208 36787 62128 53308 -16854 -48644 40273 41004 172909 2627 -106584 -29982 30268 4632
13196 4632 24667 105077 199396 230372 35270 -125174 -231861 -298583 -500119 -418258 -281141
13185 -281141 -40095 -2865 -53872 -43179 -2222 102212 142572 246173 256302 235005 51734
13174 51734 -23993 -91194 -178982 -320947 -351576 -241201 -275294 -323084 -371017 -140205 680
13163 680 66873 76787 164818 285877 295078 312851 370152 246771 -4868 -69461 -135548 -103205
13151 -103205 -148391 -148427 -171823 -166958 70244 137354 183924 98893 16327 -40486 -69765 -256657
13139 -256657 -390939 -306115 -233941 -57363 15678 -112403 -167024 -260665 -268032 -241426 -184947
13128 -184947 -87112 21096 43770 -4259 -172531 -98946 11824 -40876 -148087 -168959 -131225
13117 -131225 -125176 -8583 -42176 -131126 -28468 142678 91128 33212 -41426 -60790 60180
13106 60180 109964 91212 269893 297976 270201 216377 116757 -29366 -33270 84942 244276
13095 244276 135554 73477 69820 -129837 -261291 -122175 -37466 53792 42345 203120 159623
13084 159623 176883 225215 243970 191632 155482 96762 121299 50393 -161815 -277214 -157941
13073 -157941 82676 189989 74894 -39977 -50843 65459 217942 201207 38428 -14329
13063 -14329 -26594 -57059 -53760 86413 140527 54314 5263 -20780 -58550 -70081 61533
13052 61533 -48333 -212970 -305099 -267898 -113709 -34020 -182633 -206748 -191728 -221962 -189295
13041 -189295 -284201 -313382 -186357 -71075 -99987 -239253 -358898 -212556 -33919 -38620
13031 -38620 -6213 28042 49602 48033 53650 -23339 67380 304361 258952 206689 256160 199072
13019 199072 59764 -52667 -61066 -66385 -108670 -123719 -78916 -34483 -74640 -132395 -174844
13008 -174844 -142191 -6279 32468 -11635 102999 24217 -131882 -287682 -300321 -269388 -183014
12997 -183014 -154344 -104087 -64710 42162 84656 161497 279169 309469 325404 341399 166841
12986 166841 71229 -16896 -22642 116275 32471 -13582 51999 132393 51811 -16287 -14894 2339
12974 2339 12483 -84864 -33470 1031 -95381 -227030 -327008 -205292 -130226 -140021 -238903 -53425
12962 -53425 22103 -18998 104753 52755 -82793 -20216 -36206 -18356 58366 -19160 14805
12951 14805 68696 -28319 -29514 -21385 -12621 8581 1728 114455 -10959 40150 -6464 28514
12939 28514 -66941 -52996 20623 56159 46426 120680 210402 49497 -81268 -40702 -64388
12928 -64388 -86449 -342436 -232026 -132430 -5201 98686 40367 -152751 -312869 -321815 -206763
12917 -206763 -313816 -275361 20810 227576 233833 130021 50102 65046 -94329 -45042 61285
12906 61285 176474 81778 -38062 -66967 47125 51944 1644 1592 -183554 -334434 -256862
12895 -256862 -187839 -195495 -220455 -267439 -300488 -351466 -335791 -197067 -200845 -148419 -87865 -22027
12883 -22027 -42367 3580 9348 -103339 -160929 -122686 -41122 -73722 -76293 -153739 -174860 -1906
12871 -1906 98472 20747 -42156 -34813 -135474 -102195 23179 129074 127070 112574 33089
12860 33089 -60075 -158300 -76914 79787 20167 -43571 11894 -10629 21193 34499 -100863
12849 -100863 -208283 -183714 -169289 28387 142651 181188 58935 -67146 -115383 -93649
12839 -93649 -137363 -43311 33193 -70033 -77470 79865 101304 45638 -146188 -185942 -200971
12828 -200971 -87055 25643 -26619 -61196 -116077 -94533 -85258 -39544 71745 99591 70822
12817 70822 -85246 61741 228408 90789 -46495 -94363 -74051 -205287 -105216 -8354
12807 -8354 -23808 -59260 -34989 74830 19805 -33661 -137535 -244308 -348960 -350922 -308967
12796 -308967 -76696 -2540 57880 -17069 -64524 -99558 -89237 -236751 -213173 -91236 -40442
12785 -40442 -3716 -44681 -74952 -108589 -226958 -68249 18570 36610 127977 176939 60570
12774 60570 -8345 -46002 -57909 -101759 -161665 -199999 -110097 79425 154373 97565 111036
12763 111036 -7387 -154533 -81639 29752 138510 141141 53674 8640 69283 96177 34704
12752 34704 -25242 17775 -6955 108803 145856 63116 86444 20125 -18308 20915 34722
12741 34722 162127 278615 46093 -82988 64276 167034 76409 57300 16380 -46315
12731 -46315 -173397 -147194 -195036 -119556 -180085 -228624 -170535 -28697 -26695 -76628 -143904
12720 -143904 -62233 47686 -1276 -136867 -211478 -76479 9692 57429 -83098 -157969 -115774
12709 -115774 185492 223599 183473 90174 5969 -96234 -233010 -260586 -69974 -66552 -220556
12698 -220556 -123568 -65119 -58560 -30566 118238 107690 99958 37923 -149646 -224397 -199157
12687 -199157 -234085 -155531 -116280 -135904 20319 21295 -70240 -100926 -27548 64178 15850 104980
12675 104980 225245 236637 -9226 -82937 -101838 -85054 -2752 85995 -62214 -126083 29484
12664 29484 56847 -30215 -73122 -76302 -170845 -262540 -289602 -143975 8217 -9113 22060
12653 22060 -63643 -161910 -202048 -259607 -283520 -199991 -124866 -174745 -180789 -75023 -43406 -177995
12641 -177995 -263656 -156488 16736 174915 100655 5085 -113291 -196593 -296916 -200484
12631 -200484 -62055 68852 40115 -74574 -74371 4184 56730 31680 50383 -22133 -7282
12620 -7282 -14813 -8687 241204 393653 402952 226630 21742 -2480 77616 93740 31592 -4200
12608 -4200 81873 89925 98022 83978 72160 163999 145012 99835 84703 205526 108557 -113707
12596 -113707 -414840 -341196 -241310 -134969 -80715 20574 54090 22805 -39744 -130171 -192394
12585 -192394 20053 90681 95110 19910 -108611 -183810 -193371 -227647 -114583 -63214 -3588
12574 -3588 109377 28009 -82134 -174461 -120893 -66195 -19342 23346 -106781 -201515 -198090
12563 -198090 -147340 -198980 -157464 -90449 -34310 -113334 -153649 -187962 -157994 -16207 103194
12552 103194 4440 -82302 -52535 37752 177445 53691 -183911 -165270 -148845 -112231 -190437
12541 -190437 -186369 -282104 -145928 -29648 74985 125235 115704 90298 141724 143707 103837
12530 103837 76211 5159 -29680 -138888 -169733 -75934 -99798 -146538 -129175 -173522 -43902
12519 -43902 56201 339 55673 83415 60073 26697 19786 -34885 -20271 47844 3795 -74494
12507 -74494 12279 95804 80002 -49853 -185116 -171853 -201485 -87894 17118 -42660 -51094
12496 -51094 -25518 -57441 15350 128927 89241 -87445 -320567 -317668 -319791 -265505 -126762
12485 -126762 -134070 -58667 61974 131785 100880 72838 56992 56601 131033 152271 66254 -95565
12473 -95565 -174222 -134451 -137821 -63456 1083 -53507 -125590 -107158 -80571 -59223 -30610 -17267
12461 -17267 -69949 -51253 90103 97142 58674 -37962 -8270 162208 183520 84905 -21890
12450 -21890 42086 125508 -17704 -83061 55930 65865 -65720 -54662 41440 58143 -121105
12439 -121105 -217437 -76505 -106877 -72517 -41851 -95783 -62622 -17554 7857 -17606 -23202
12428 -23202 184 -48249 -4020 87543 200325 148234 -13323 -90937 -2746 -8660 47868
12417 47868 81145 27023 -16684 106867 179571 40285 18594 61749 27433 -19302 18802
12406 18802 20734 119150 42617 -66257 -54330 -6320 -63416 -26092 123400 173938 113370
12395 113370 102300 149779 223990 226984 123495 25951 -26642 -131018 -112810 -41893 26143
12384 26143 67388 42279 -58341 -36952 -72205 26759 71948 38915 50782 -21382 -19306 -41895
12372 -41895 101626 133033 5391 -52461 -54170 127350 195310 225321 175763 -20728 -27068
12361 -27068 91369 55031 18816 85494 84326 83400 131151 100296 137064 113593 122160 104184
12349 104184 149786 109429 120498 79261 1717 -118258 -112728 -131052 -158550 -265342 -127055
12338 -127055 -37769 -49676 -131695 -281886 -381816 -393394 -218121 -8632 16991 -37354 -110055
12327 -110055 -343939 -406223 -288454 -174678 -170311 -134567 -166518 15594 18845 -114641 -201986
12316 -201986 -193348 -43042 3403 81337 131687 -2332 -76315 -83189 -91337 -90489 -98388 -140274
12304 -140274 25109 16330 -175916 -259090 -340079 -184182 -83471 -37413 23791 95938 120227
12293 120227 11765 -177212 -216462 -97118 -73858 -72290 -44713 -110216 -225118 -356386 -109428
12282 -109428 63025 -45304 -78376 -30279 -20649 -167626 -171581 -187916 -108032 -83165 -235465
12271 -235465 -209702 -168518 -200638 -108236 -110266 -150755 -183523 -21640 175497 189378 51803
12260 51803 -1816 -22985 83255 70481 -85218 -30601 -7177 -1715 -28231 11805 27788
12249 27788 -49618 -75354 -81283 -85006 -43155 -52156 -110877 13460 103584 92319 -115044 -108238
12237 -108238 -97581 -79194 -41180 -311 -241456 -419405 -375830 -286099 -214029 -266551 -260414
12226 -260414 -98689 -39718 -70907 -72900 -234516 -271356 -251509 -174218 -57071 30077 87106
12215 87106 184700 202256 92595 37815 101973 30697 -195477 -129599 -35829 176168 97051
12204 97051 17943 14055 63532 134762 55650 175334 129903 125606 256328 173705 37535
12193 37535 44916 -59469 -101847 -158303 -134671 -2224 -28136 -9744 -39111 -51997 -94155
12182 -94155 -44278 7838 2541 29507 30580 -44587 109950 206798 161922 87271 -40607 -126304
12170 -126304 -68582 -20717 24202 -31769 -33811 -46110 -37267 78138 166557 99328 -66463
12159 -66463 -17290 53906 14417 18729 37554 41068 57791 -22088 -123663 -102374 9499 46796
12147 46796 149329 211370 143437 33555 88066 -9889 -158363 -268965 -172329 -147597 -119696
12136 -119696 32072 52261 96522 124061 -97567 -102874 -131495 -272369 -398092 -404292 -377685
12125 -377685 -280474 -184574 -126620 -191070 -167467 -149712 -124315 -213939 -178256 -108917 -90858
12114 -90858 -84253 -31851 141825 262079 181974 49394 168179 239901 202529 89041 -35175
12103 -35175 -159388 -213387 -166505 -184159 -178891 -177264 -125386 46987 73578 12555 -60706 -158648
12091 -158648 -133042 -160768 -50592 27657 3131 76338 51272 66091 191975 202777 163449
12080 163449 72509 -136437 -112261 -190968 -329637 -236020 -83565 -19117 -2887 -93344 -51509
12069 -51509 -82606 -53907 29809 42390 70762 -65870 -115649 -54327 75993 102417 -7631
12058 -7631 -71959 -151557 -165156 -307015 -359075 -300548 -188373 -212612 -275890 -216679 -80441
12047 -80441 21126 59016 8579 -54249 -207181 -158654 -61037 96200 253534 382348 178956
12036 178956 148943 82861 -38138 -104832 106115 324532 253910 198086 187706 154543 17462
12025 17462 -84407 25138 65808 90257 -38866 -168826 -164997 -106872 102307 40199 -75039
12014 -75039 -190205 -275176 -308583 -284297 -170371 -126967 -150101 2153 120498 100021 118811
12003 118811 165259 91874 -43672 -105914 15986 150365 125156 30695 92862 150530 86649
11992 86649 125672 234929 100991 6991 -6658 66575 121778 41757 50894 -4291 24223
11981 24223 51028 5524 61724 9452 15675 -89729 -78901 -68041 47629 14676 -89392
11970 -89392 -202365 -165077 -103747 -103666 -116338 -180592 -81570 -62081 -63651 -170909 -273784 -246685
11958 -246685 -282843 -356027 -257935 -121977 -59782 -94213 14977 -25493 -7487 -2500 17165
11947 17165 -3119 -69097 1332 23439 -37243 -27661 -21904 -40477 -54549 -63587 93540 119970
11935 119970 185320 211669 256141 103230 -35866 -207559 -98701 -123470 -114022 -82244 -23316
11924 -23316 120941 40780 -54858 11230 -96364 -175620 -206019 -91287 -277 -2127 -42383
11913 -42383 67151 56119 -69009 -85648 -205362 -249197 -227932 -18095 50123 24205 -29787
11902 -29787 -64984 164873 245764 254751 149948 -56842 -92787 -99020 -280677 -263813 -308352
11891 -308352 -315843 -158948 -248626 -304320 -176284 -224390 -137438 2982 -42148 -24626 41404
11880 41404 102889 208151 111408 123735 189675 33782 -119115 -71955 -837 -50710 -174380
11869 -174380 -283204 -137338 -85149 -68933 69698 139925 74800 -70589 -86781 -42371 80167
11858 80167 63762 2362 -190894 -167466 -182752 -217402 -23390 28780 -2247 35789 21121
11847 21121 -23521 -155783 -150633 4696 131323 152125 183410 240738 233664 251181 218966
11836 218966 170218 193782 -38061 -184229 -92932 92492 172786 99310 150199 114821 22941
11825 22941 -23203 6923 12673 -202217 -192690 79578 1037 -77859 -16612 120299 74263
11814 74263 -105208 -164096 -96796 -101444 -196822 -164591 -234024 -234985 -137350 -131405 -81791 -63355
11802 -63355 -123714 -131418 -72885 -106659 -71731 -77973 41563 62115 99439 164473 55205 31601
11790 31601 21204 216783 214341 135720 55296 -20494 42837 4029 -75049 -130007 -131073 -189663
11778 -189663 -134567 -61850 -140724 -177307 -109157 -79531 -25937 -49463 -66170 -12674 84276
11767 84276 182729 205757 24314 -56307 -13354 28042 41031 104885 65333 -99176 -84271
11756 -84271 -79375 -46209 7041 76892 38087 -126619 -287505 -319059 -171536 -155212 -156297
11745 -156297 30021 130382 69060 5251 -42300 -1566 48997 87975 -73499 -30857 -42339
11734 -42339 89988 7159 -37773 -24180 83008 -36357 -76530 -44180 12779 119223 211680
11723 211680 319489 224747 46251 8201 -27256 -4298 58430 77793 -54261 -90706 -86133
11712 -86133 -191978 -193841 -150432 -173910 -205686 -222695 -181416 -85836 67860 101239 41524
11701 41524 -69846 -146217 -153288 -45425 -70503 20236 -69813 27203 82764 -45029 -139461
11690 -139461 -276734 -314854 -286059 -235517 -285014 -313690 -298710 -207681 -213174 -48648 165823
11679 165823 81624 24936 95452 38550 44209 60014 125991 123102 70522 -129956 -240475
11668 -240475 -64270 15772 25184 110107 63905 -87729 -196890 -300091 -259508 -139943 129129
11657 129129 173893 -51928 -81813 -49477 -63844 -109294 -55733 70446 -355 -83579 -48731
11646 -48731 -43863 -146178 -237172 -185688 -172021 -171925 -185596 -166425 -275520 -328728 -369900 -210525
11634 -210525 -79702 -1814 95459 220009 238937 139632 1930 -23651 -119275 -37232 69175
11623 69175 34311 60008 46983 48456 68104 -20723 -40696 68577 167975 218199 133355 -124135
11611 -124135 -172510 -42826 72241 146240 246842 317565 178084 47173 -17369 -81682
11601 -81682 13958 100578 -118931 -235253 -239244 -110859 39116 4945 -146002 -176707 -255619
11590 -255619 -198669 84271 154537 67468 51068 88146 160796 149317 -15012 -156572 -167795
11579 -167795 -123695 -154574 -133673 11254 -20725 47570 -86483 -119921 -151424 -183430 -123063
11568 -123063 -96146 -103210 -139261 -189627 -169221 -201444 -181816 -134180 -51770 34744 -107012
11557 -107012 -207085 -190022 -216725 -246750 -251767 -252264 -107682 -78062 -87508 -56894 15316 31081
11545 31081 -69444 49461 170712 76419 -57939 -131287 -112951 39656 176304 240652
11535 240652 226606 123236 -11755 1135 -71847 -171599 -197881 -170845 -168980 -137392 -63486
11524 -63486 -55701 -32071 -132011 -190698 -183314 -177120 -117944 -79325 -42840 -12408 43466 -6122
11512 -6122 -34598 -74005 -9091 -31978 34066 118219 108967 77179 -20211 15439 73548 111050
11500 111050 211200 388564 385896 417158 567246 951566 1414181 1916246 2304730 2525158
11490 2525158 2559297 2450413 2256953 2068249 1823704 1311611 919589 651288 324753 9299
11480 9299 44270 133944 78427 123410 244053 157943 52409 63923 53040 198099 303123
11469 303123 232924 163874 161122 217285 136042 57702 56015 62123 -129990 -145508 -75924 -78686
11457 -78686 39830 -43888 -153357 -165024 -129948 -170050 -201572 -190752 -7640 112528 -16172
11446 -16172 12279 -1513 -75507 -111290 -144219 -25448 -38415 14471 98270 5248 -128431
11435 -128431 -131724 -162917 -147586 -61692 46955 40152 57693 182987 190081 66816 129005
11424 129005 147020 204347 254165 333820 279996 192160 91690 62731 75510 121972 219385
11413 219385 275824 416524 378926 236867 161789 174465 195978 215386 112063 223755 331773
11402 331773 354210 322099 350787 311674 401307 365617 332935 294534 255695 120765 14608
11391 14608 -32822 -59869 -2940 102932 9585 -627 37455 -13966 -91927 -10471 71712
11380 71712 121338 50477 76860 -42756 36401 186262 255720 231068 233069 348141 358075
11369 358075 149166 147609 156996 53844 98972 153512 85344 79186 50691 88265 296427
11358 296427 255341 49804 -13936 -75428 2358 64546 125904 254117 248550 199558 180322
11347 180322 254451 309454 261231 351665 279669 248745 247856 254675 288223 205400 223237 313757
11335 313757 404444 412051 492457 510040 539443 686530 502850 336239 233549 176363 186765
11324 186765 162306 207046 237345 219955 248021 377898 246660 140428 226686 141093 -68418
11313 -68418 -49705 90437 145185 193898 54884 -181354 -78217 44208 100549 270216
11303 270216 338853 312929 225427 217158 243006 214624 287774 321423 181427 203914 374614
11292 374614 373061 234552 150950 273169 374481 354709 250098 136610 136579 329743 334274
11281 334274 258365 230763 240548 343879 431720 414619 390854 386913 391586 377777 379086 344285
11269 344285 284403 190971 156139 192327 187359 353671 335508 248319 239283 320211 340707 275308
11257 275308 362606 527700 598244 582438 553355 392551 363364 361346 318262 274910 326876
11246 326876 350064 441316 557734 759620 1029818 1229995 1395720 1562547 1545442 1384929
11236 1384929 1437506 1579848 1479971 1421906 1228462 1063084 816220 600602 543940 710296
11226 710296 859719 895976 810972 868449 875165 848433 864517 1279149 1524027 1624690 1752974
11215 1752974 1915517 2082182 2171887 2221165 2221521 1875954 1554453 1511107 1536398 1351631 1367861
11204 1367861 1574620 1857851 2160743 2441642 2828380 3524565 4506188 5736705 6815406
11195 6815406 7526624 7642218 7560120 7509814 7370286 6778380 5775898 4704957 4085123
11186 4085123 3717919 3520198 3408061 3354799 3196086 3048752 2965626 2990954 2965149 2867293
11176 2867293 2938610 2927337 3007123 3140963 3150425 3158462 3182270 3284528 3572611 3950853 4371747
11165 4371747 4761759 5003293 4971814 4820452 4659786 4510475 4222247 3883468 3490597 3263566
11155 3263566 3018320 2801445 2540451 2316250 2235389 2165013 2099572 2098056 2053875 1957198 2006827
11144 2006827 2088604 2116984 2222277 2161633 2196804 2168884 2256184 2353087 2350102 2351696 2427717
11133 2427717 2423666 2357968 2380666 2439367 2476433 2553853 2694855 2980290 3241140 3507870 3796776
11122 3796776 4171805 4452556 4595868 4961359 5392814 5723311 5696551 5676872 5743980 5980626
11112 5980626 6324367 6649337 7002558 7376980 7972476 8777056 9666095 10703708 11558436
11103 11558436 12277576 13235536 14169718 15060926 16139983 17437064 19267226 21611328 24917925
11094 24917925 29073438 33630597 39206193 46556125 56170822 69906386 90112002 121520029
11086 121520029 172408616 251430506 351535201 434614191 465979266 460379023 449401394
11079 449401394 440888189 420831636 363779440 275655130 197539556 147093548 116623028
11072 116623028 97205376 84158639 74525472 67343149 61645172 56846265 52676457 48965524
11064 48965524 45768687 43150213 41119870 39510155 38209322 37003671 35585076 34049666
11056 34049666 32446851 30871356 29150716 27283891 25386882 23719868 22388789 21234133
11048 21234133 20365112 19596848 18858904 18155670 17557017 16961817 16601621 16372201 15891033
11039 15891033 15484212 15165625 14847796 14433479 13877067 13167244 12350289 11270711 10398303
11030 10398303 9759196 9011272 8249111 7453649 6895712 6459206 6031609 5619951 5208042
11021 5208042 4876464 4499431 4069708 3585014 3258776 3232016 3214236 3145216 3147189 3046392
11011 3046392 3096737 2930478 2854784 2936189 2944155 2848628 2828638 2799970 2661253 2507934 2464935
11000 2464935 2536128 2380750 2263928 2242908 2429509 2370015 2310757 2560287 2800904 3002386
10990 3002386 3307231 3880536 4743888 5724204 6705139 7264666 7272554 6986886 6720191 6610220
10980 6610220 6101190 5081653 4076445 3439563 3064975 2774150 2551800 2425186 2302488
10971 2302488 2332655 2378760 2177239 2105331 1983783 1886020 2170580 2212924 1922667 1944430
10961 1944430 1915029 2079592 2316040 2515672 2523036 2230307 1899006 1804228 1806542 1684142
10951 1684142 1421401 1128194 754489 692699 780490 881078 852298 852871 879429 952912 946850
10940 946850 1089574 1132774 1009253 963420 1039850 1047725 1224261 1119793 1004741 1027603 1102655
10929 1102655 1062210 1011101 1029110 986859 887178 777459 749287 815121 822224 953173 1073764
10918 1073764 1044308 938224 849467 824954 886294 928060 867653 817518 898006 843336 745544
10907 745544 922735 950665 872099 902445 835725 848799 755568 647682 443863 486660 558711
10896 558711 539109 519494 483211 366573 346410 322006 348404 287666 300901 183003 256315
10885 256315 379748 262508 165114 215070 331855 408332 451719 501108 465267 507672 573366
10874 573366 515490 495440 635115 543165 481018 383961 191226 189338 213450 228860 147567
10863 147567 294395 291265 200788 302804 340007 279149 341606 380068 196799 224800 383986
10852 383986 436291 423175 267296 119743 150013 77480 95698 227395 294671 262482 245995
10841 245995 173585 263363 529749 558091 456346 495031 458268 472121 429850 319979 152259
10830 152259 91992 275256 394662 366638 394961 277034 61587 134202 201431 191837 210157
10819 210157 271597 202644 188516 291112 421695 263306 293344 277957 282508 171928 68077
10808 68077 171582 76070 108771 95233 12029 31619 -107804 -79143 -91377 -254747 -181086
10797 -181086 134126 300363 296196 190090 143626 197024 193345 182047 234947 76014 44489
10786 44489 61798 -12888 -26876 -9632 177673 361465 426021 466390 509256 330236 244675
10775 244675 144168 257802 399240 405491 467029 361268 170373 59348 219117 223916
10765 223916 243158 147831 59093 203641 233579 350521 332252 247568 99109 141312 283789
10754 283789 328277 206607 121840 150478 213207 277321 341738 341920 431710 405212 310663 260760
10742 260760 238987 209501 169809 131052 -17950 -106208 -120311 -115574 -81710 15742 170299
10731 170299 115775 191096 352626 155812 159229 229317 109188 182209 265357 158761 173044
10720 173044 201274 158372 66190 -8031 -22911 -104099 -57139 62711 152850 163222 30734
10709 30734 255508 292739 551 -127032 -44513 -2756 154870 173615 114913 222009 277755
10698 277755 258808 132771 253373 259457 210131 188562 204771 176997 -13568 -35172 71776
10687 71776 118904 71857 113882 142334 138479 152924 296103 384475 499361 539016 392709
10676 392709 262365 325216 590724 762131 981691 1090693 1465839 1858394 2219828 2380696
10666 2380696 2418700 2442233 2331421 2123988 1840381 1469867 1044304 759587 590031 443894
10656 443894 475282 515189 528474 531904 564706 509396 494457 306233 345365 286808 219804
10645 219804 298245 437628 228423 160737 74860 125262 107500 172468 218043 276352 324565
10634 324565 366365 317617 291467 346616 305100 232579 293240 280658 216484 442099 323496
10623 323496 174102 241918 300550 365924 263465 80297 28352 178564 232601 208801 189600
10612 189600 100168 129204 45092 -6959 110677 141793 167642 259242 245979 124360 -22936
10601 -22936 36067 72836 77546 202309 86355 -48719 -8432 -34147 -97706 -33950 51779
10590 51779 83980 216372 237527 97935 -23272 -43002 -18322 -70034 -237698 -176056 -76434
10579 -76434 -33704 50433 63020 -17558 -80091 36174 295515 296148 301576 297658 231911 239217
10567 239217 169099 270427 326113 231770 -5469 -70316 58084 98480 19224 41779 254829
10556 254829 341022 240405 116276 76106 -43974 -111326 -389 126917 29415 -133498
10546 -133498 -168700 -141690 -89215 -36890 98201 287556 373990 306392 176776 194600 287263
10535 287263 246463 126746 162286 171077 135817 138143 213377 260466 220929 133300 123423 237762
10523 237762 159085 172551 176675 237302 362365 345920 177584 84862 -5304 -88097 -27043
10512 -27043 -86972 -81146 58674 156725 72867 82902 16340 -7525 77787 203263 292339
10501 292339 219372 216469 196425 15766 -77880 -27778 -8372 -46370 -219207 -219625 -84318
10490 -84318 -64691 76247 85385 31793 -33020 -71920 -45746 -36324 7664 -34214 -6589 69339
10478 69339 110203 70361 42261 144 71314 68669 65158 66604 64681 148769 173957 97866
10466 97866 18469 126118 139417 120120 123107 295592 337240 237764 182687 197305 120150
10455 120150 119789 53306 63400 55293 69084 39480 31673 100319 125624 118397 205269 218188
10443 218188 178927 98780 8037 -4922 57655 12233 -9342 31643 204183 166251 75166
10432 75166 34081 65533 63896 74342 67758 197249 344615 183690 -26284 27135 101449
10421 101449 168433 232330 132117 663 85856 130024 61991 5315 71260 59545 -116423
10410 -116423 -207095 -223517 -103247 -115699 -26631 -49007 -23591 -91309 -116327 14378 134058
10399 134058 57358 102489 196014 168827 76079 6365 -76114 -73456 35425 163218 65779
10388 65779 -31128 22753 127212 27555 48905 50726 94002 183675 158815 118865 -11516
10377 -11516 -29166 7123 -27806 -74866 51393 171408 253814 132421 107495 -53736 -42475
10366 -42475 -3942 -134548 -159659 33339 95529 -13592 14733 -5278 -63959 -164040 -67568
10355 -67568 39177 -22793 -57590 -3260 -46115 -82916 -72190 42882 46368 28898 -49754
10344 -49754 -183149 -121383 102471 134067 56528 66163 231251 147921 71981 147173 22090
10333 22090 -39352 -75809 -29098 99964 -15042 -118528 58910 187772 265839 335042 136027
10322 136027 22745 -57920 -75048 73336 314869 267508 254302 276715 216458 214234 240883
10311 240883 133739 125403 154457 97687 80648 12599 -6275 100153 58869 96866 60942
10300 60942 26099 -8587 28883 132443 106484 73275 71778 -23236 2459 -20455 -6928 27140
10288 27140 72181 144934 55794 32351 -15681 -59648 -59946 9988 43789 -53853 -188712 -222626
10276 -222626 -47083 -6295 27787 71752 135706 206887 120865 76532 60418 -8529 -60315
10265 -60315 -113013 -52476 15287 49051 -9965 -51028 17781 -115378 -193854 -238925 -185074
10254 -185074 -120614 -164478 -70592 -74821 -32087 32781 103154 141088 300632 274696 195812
10243 195812 99968 6963 -45461 17753 8256 -73066 -115470 -32745 -87231 -98347 10832
10232 10832 56389 128605 100427 128667 76165 64352 -46412 -13029 59970 87971 127302
10221 127302 110245 20581 127706 244491 225745 112535 62416 9670 28885 56533 59837
10210 59837 64509 -35376 139772 158548 -17188 -238544 -251672 -199537 -78329 72698 103266
10199 103266 -61446 -163819 -171406 -18850 49622 94000 1397 -93526 -94379 -22716 66187
10188 66187 -45220 -130139 -13539 144371 135035 46118 39400 -9915 -120922 -59210 145219
10177 145219 151310 63020 -58910 -88915 45421 231475 248238 148054 124512 139728 53314
10166 53314 37080 110099 224910 293752 251916 126361 149437 49836 -8973 91486 31347
10155 31347 94432 74190 29628 39036 88941 -14259 -17452 96582 114176 114312 134301 122930
10143 122930 163716 179636 762 -68515 -121620 -195715 -114732 -67760 -112232 -38317 -33715
10132 -33715 -8278 -37713 23869 89623 81476 29366 71669 240093 231267 249764 169295 154789
10120 154789 160676 136920 190428 121521 176876 184522 169035 145393 114709 176713 15194 73069
10108 73069 163517 55210 63540 -17694 -277754 -292907 -122319 85001 15385 -87065 -34395
10097 -34395 -88026 -63836 121583 60016 -50581 64650 124680 66364 67689 47310 7848
10086 7848 -11701 94498 210803 237281 164094 -9662 -92134 -95538 -86416 5835 120721
10075 120721 -45676 -186568 -272942 -175030 -160783 -93131 -17410 -12648 -704 89401 112293
10064 112293 45813 95405 268271 254509 119261 159739 242063 242875 240296 467836 788554
10053 788554 979555 1067213 885429 845493 845768 828379 748729 396554 136494 92739 166783
10042 166783 76332 59890 152062 188587 220402 143537 -11427 71087 163352 347090 370667
10031 370667 301345 327374 285365 203945 79264 56775 56843 74771 30011 -2166 -40699 -119444
10019 -119444 -1322 155006 221602 168558 103404 60683 40844 171236 174719 194057 308057
10008 308057 341658 377978 264622 75721 5924 54548 183655 79032 -26389 -23106 30134
9997 30134 26416 90150 127152 9435 -34376 -84116 -85412 -149877 38761 223940 240917 163342
9985 163342 79527 178037 271146 122391 33069 10339 -54740 -29928 29825 -92692 -250771
9974 -250771 -170726 -29788 -11877 -87190 -110534 -99134 -14982 42074 106514 128112 107359
9963 107359 221392 270815 92371 73008 150493 140802 65881 -48031 93749 107918 89804
9952 89804 715 109071 248380 133225 -18758 56251 136969 141459 129537 77336 -65877
9941 -65877 -109904 -100424 -103835 -90794 21177 46031 68959 104569 132968 1104 -96367 -66714
9929 -66714 -3259 -45013 -12166 -30328 43613 59277 83147 148199 192132 328947 322610 142371
9917 142371 22560 75318 -45563 -196360 -111409 -98957 -30537 -6896 122783 191883 258437
9906 258437 302174 274752 266164 105590 145224 172085 110863 60171 82227 165330 211449 213052
9894 213052 201798 203297 227952 283155 242312 165571 113423 -31780 -30620 -43722 32891 46279
9882 46279 93189 -44282 -117960 -811 93755 118280 216797 199938 131359 106336 67194
9871 67194 58635 200830 349807 275994 121760 9157 56254 213291 225465 210056 360505
9860 360505 428362 333124 344457 379532 269820 346292 509756 368951 307677 278697 176797
9849 176797 45550 101880 85755 58849 169637 212608 229609 238802 154162 -45944 -69829
9838 -69829 46716 15900 -88875 -56738 12039 108724 127299 128050 244517 224108 328126
9827 328126 452997 465556 398527 342927 424208 616275 608852 691951 609197 469488 350423
9816 350423 290355 282691 306619 292126 233052 407035 585545 635248 838750 895881 942474
9805 942474 1071543 1069104 1192712 1508600 1831734 2242778 2844290 3722737 5285325 8053089
9795 8053089 12756999 18986289 23180992 23285156 22253533 21868183 21875286 21223198 17288754
9786 17288754 11633802 7922648 5832383 4627861 4083081 3481873 3047022 2821979 2693422
9777 2693422 2579524 2428037 2195952 1984126 1959072 1918150 1876554 1699954 1583547 1499868
9767 1499868 1495832 1347173 1309809 1265337 1211939 1055871 1120167 1096050 1054154 959009 898958
9756 898958 894338 943767 779590 757109 808533 624497 569265 652337 739386 695396 622780
9745 622780 582732 641196 688581 711031 664538 580519 482488 273108 264544 317722 273342 280736
9733 280736 249808 348939 297470 157163 206399 287209 359857 278933 181478 117296 90461
9722 90461 154363 242285 185243 147332 49794 107669 200464 139469 152667 223696 208588 297636
9710 297636 375238 329411 188008 231996 318907 197906 121844 98047 95191 218471 242029
9699 242029 348893 245627 279416 216911 316343 408942 235598 83160 -15973 -80975 -188736
9688 -188736 -143766 -99097 -93094 107009 250990 301448 347910 358168 438370 463016 402620
9677 402620 285354 260715 221467 267032 69006 -151442 995 199074 262156 236290 188841
9666 188841 221569 197707 50381 8160 87974 135364 263380 282822 316967 240629 236408
9655 236408 318127 407777 371699 282325 403164 521068 503290 187180 102376 97692 156002
9644 156002 87374 -34398 118663 135424 122937 188267 137876 155590 117057 143876 138030
9633 138030 76936 155076 153227 200341 271174 285971 270819 219481 240838 286867 288816 299062
9621 299062 185903 -23893 28063 109667 135620 -18731 -142165 -63468 64362 98900 97017
9610 97017 147305 157189 62514 -184669 -135826 -62344 -50145 -82271 -155014 -69439 -237734 -364600
9598 -364600 -243345 -261438 -143213 38138 91725 -18996 -106168 -25698 24177 5364 -49683
9587 -49683 -52145 -40714 8284 142473 292431 164152 -126768 -129817 -42525 47661 106842
9576 106842 106208 21351 133995 183036 156404 93331 13839 1966 80387 92731 132817 51006
9564 51006 -101144 -68431 -14889 59753 66619 55444 146109 104553 -106470 -72457 -78283 4112
9552 4112 -8669 -122608 -45156 -200775 -292562 -203828 -200109 -96691 -47185 75978 85298 160540
9540 160540 208601 50927 85221 138764 39472 -65239 -131384 -54016 -102474 -45978 78785
9529 78785 95672 32044 -1280 88564 61011 -67898 -135138 -63152 45551 193208 243606
9518 243606 235365 13665 -71378 -105883 -55658 -48024 81726 162950 280092 274523 159096
9507 159096 235964 128484 16656 -3392 -2694 -79375 -105419 -190593 -220608 -268860 -228870 -146295
9495 -146295 -142845 -73942 4297 36669 6936 126215 112719 95408 -19570 -187615 -238350
9484 -238350 -181142 -225532 -248837 -267603 -230032 -272380 -158536 -87824 -97785 -27232 -43315 23744
9472 23744 76854 12164 -6 87563 94693 84314 59604 -115212 -10359 114856 -14291
9461 -14291 -19817 -158381 -226637 -236433 -204202 -64031 30656 -99657 -135720 -97469 -53549 3664
9449 3664 44075 39508 67334 51993 -78892 -90031 -33136 -124820 -72109 67206 197697 226640
9437 226640 285144 198955 93453 136182 113643 47627 25846 -95477 -122747 173156 308089
9426 308089 295341 233070 202989 235189 165605 76595 157448 165964 74737 79654 15952 -45023
9414 -45023 -71599 -6976 -2303 16770 -8916 -58284 -117625 67640 209025 198212 153443 86336
9402 86336 43420 138520 134883 -9880 -70083 -12398 -15163 65508 125653 207991 237923 297325
9390 297325 242992 150093 55330 -1373 -2728 56540 33825 23868 7953 -37758 -136724 -68324
9378 -68324 -71230 -29695 -39275 -133559 -85976 -62961 15552 51466 -74755 -77531 -119987 -152395
9366 -152395 62025 274321 249323 177663 175416 320375 345663 181911 205199 238047 222219
9355 222219 163488 123755 91297 74834 56359 -22690 -57154 104301 170979 145357 170752
9344 170752 59939 104278 216265 185525 205712 195495 22718 -120706 -170737 -127404 -724
9333 -724 145664 136304 126107 133910 55543 -44804 2951 20532 26379 52730 131882 73300
9321 73300 -5412 -21123 81566 119105 51941 86231 166939 184559 98035 -5300 12323
9310 12323 -1354 8407 118396 79225 -23830 -74375 -108311 -111377 -135960 -87599 12206 170246
9298 170246 332850 314575 304860 379459 413017 432070 375531 339875 178301 90072 118903
9287 118903 157929 167276 221620 144522 83249 106731 -5304 28474 45493 37458 67026 242953
9275 242953 238741 312632 406708 512364 540580 581149 495786 208290 150550 179039 114200
9264 114200 145360 -10160 -40012 -7006 -49837 33266 129203 278091 216410 89524 129138
9253 129138 201343 194181 238593 355200 273852 333928 260891 218564 364687 433040 464068
9242 464068 358160 360817 448479 295901 207230 289491 270965 260933 364509 366357 273917
9231 273917 186063 279246 254192 145172 261104 291620 310945 497085 449592 389372 490636
9220 490636 545232 544406 455252 335215 333758 291261 243886 140283 113649 203648 149117 113733
9208 113733 105807 309522 431237 262962 342356 420359 544976 551415 378826 357656 330940
9197 330940 448434 557520 664504 745581 620067 613360 557864 567612 626419 579006 614459
9186 614459 694111 846597 888135 797587 777739 817341 937293 1054278 1168869 1170302 1186926
9175 1186926 1151611 1272071 1327099 1522531 1724710 1844405 1992415 2183013 2274159 2508871
9165 2508871 2697852 2829820 2900737 3133319 3546120 3929358 4224531 4524706 5055300 5866518
9155 5866518 6566185 7440178 8500628 9532390 10851828 12924165 15398937 18636245 23285590
9146 23285590 29892667 39942432 56033836 81463766 116049591 147639504 160892956
9139 160892956 159604381 155986918 153504580 148037590 129751852 98754412 71899448 54566390
9131 54566390 43786375 36848537 31973573 28231693 25528358 23343975 21511802 20107615
9123 20107615 18929332 17762910 16732405 15897097 15042284 14219156 13481378 12979947 12604844
9114 12604844 11928043 11196682 10640427 10275548 9957825 9511091 9151111 8741573 8417360
9105 8417360 8069551 7661934 7400047 7113437 6933389 6840541 6709487 6529590 6378153 6356407
9095 6356407 6274619 6120493 6005419 5840339 5613371 5264809 4890105 4560034 4183987 3943177
9085 3943177 3705476 3532868 3240277 3010207 2973167 2761576 2598530 2442629 2322578 2153263
9075 2153263 2010791 1858878 1878989 1811521 1909495 1892429 1697010 1586271 1504216 1439718 1484933
9064 1484933 1548221 1536618 1619582 1605190 1448038 1343324 1307991 1336909 1233940 1246861 1299678
9053 1299678 1310778 1226994 1231668 1302414 1284771 1235717 1243779 1211516 1222896 1244176 1223753 1232073
9041 1232073 1205003 1236095 1198694 1156642 1226711 1323592 1168668 947321 998430 1137584 1080034
9030 1080034 1024160 1023300 961544 971939 921943 881594 962250 1093284 1023858 1068340 1056707 1096384
9018 1096384 1013846 1021887 1031683 1105942 1193202 1061090 900521 1011960 1058480 898725 901169
9007 901169 876029 818467 832336 702881 711550 679763 736918 787806 866322 952706 927841 909541
8995 909541 847025 798240 797350 827135 814747 642634 703708 728055 622531 805412 916934
8984 916934 670816 526136 568827 675519 779117 711517 650896 661586 727621 744185 677100
8973 677100 663809 691690 856496 1019079 955121 854529 752382 641578 555419 598604 717345
8962 717345 766590 904860 850507 627391 678700 804051 817991 647456 701778 755406 627661
8951 627661 574136 480548 483575 554035 612668 499641 466732 461654 373131 485288 526460 557212
8939 557212 672755 525962 383242 478188 422704 363270 483562 417557 424189 613437 710071
8928 710071 578567 487709 475521 577162 644888 514756 501151 588362 522098 409171 262160
8917 262160 205258 256472 334033 390596 441374 458610 300503 382424 457156 452404 429899 343812
8905 343812 339459 527055 541734 549308 404015 335365 366113 454655 450258 346776 237712
8894 237712 225304 394186 449682 521859 686496 624733 408143 209744 254425 399479 470390
8883 470390 426602 429885 382590 344947 319077 118815 154103 159608 64818 144205 249534 283488
8871 283488 315257 324484 343679 410458 600589 632724 627956 666061 681720 626818 535699 448108
8859 448108 403318 381145 476144 464848 547874 508599 478640 429285 277500 222106 272343
8848 272343 357118 270473 82267 102895 207531 195484 214218 324159 406978 321703 327781
8837 327781 450054 547016 335161 101800 165398 338279 473083 555765 402821 272792
8827 272792 303740 314793 367484 232492 162015 270716 394842 545084 529533 444875 431439
8816 431439 508569 444818 422225 391521 336677 305884 456207 459818 609836 546670 282614
8805 282614 281556 455075 460921 416306 289484 338584 429148 409481 383339 296195 264726 392229
8793 392229 590011 691925 609386 633527 558710 611282 719282 867918 1066167 1298940
8783 1298940 1423761 1599685 1721079 1662589 1553089 1475695 1446485 1380970 1214390 1042370
8773 1042370 783345 722834 882099 933309 777698 675289 775107 756810 720365 656516 671457
8762 671457 672253 794940 802066 785120 712659 705914 691048 837403 861243 798986 807266 746261
8750 746261 697868 683446 674452 680799 713045 494593 528327 738695 849058 830277 602831
8739 602831 461832 533630 608054 565932 408673 513475 694976 684772 733296 760359 829313
8728 829313 795631 959515 1053581 1181866 1387577 1495917 1669188 1834721 1803581 1755560
8718 1755560 1648343 1566800 1332328 1172922 1148615 997439 893074 794899 699162 593103
8708 593103 636805 673291 673624 661735 623555 692098 713260 708052 772296 740912 594841 575967
8696 575967 582509 591956 739231 827820 918769 813015 699340 651419 657277 693379 639634 644644
8684 644644 851171 907936 899378 749237 720478 787668 831320 813846 858406 973581 1100782
8673 1100782 1040246 942404 998431 1029802 1082631 1097007 1040831 937403 907686 877041 1063566
8662 1063566 1223485 1290971 1209907 1163139 1109571 1033834 1139164 1124041 1170855 1276824 1465148
8651 1465148 1588473 1882206 2266518 2584381 2842856 3019253 3082705 3367702 3532315 3554190
8641 3554190 3386815 3227597 3108720 2845544 2683000 2629753 2374169 2077502 1986045 1953670
8631 1953670 1853347 1691213 1652993 1572850 1597874 1655448 1585712 1658884 1641929 1691304 1573658
8620 1573658 1413268 1446939 1451833 1573372 1623782 1593753 1546661 1678725 1768675 1845782 1823833
8609 1823833 1877185 1994383 2013592 2081249 2043465 2062893 2245880 2298020 2336949 2411858 2382945
8598 2382945 2419667 2561866 2752283 2886639 2991314 2810062 2617992 2485638 2367061 2220404
8588 2220404 2045896 1926296 1770613 1797085 1711614 1536123 1447764 1350816 1464444 1531925
8578 1531925 1433917 1362334 1307564 1246252 1232340 1256891 1213148 1171109 1213797 1087903 1009081
8567 1009081 1048963 1062586 1014231 884402 859199 919572 1028893 1030553 993963 887948 871844
8556 871844 912429 857313 870028 1000308 1042649 1075474 1138269 1091885 858047 740417 783539
8545 783539 846762 938308 972657 894341 975920 978046 840289 792034 862909 923867 935675 954758
8533 954758 896340 902079 862000 898580 788706 698154 668306 658991 804855 873456 962404 1075217
8521 1075217 1129015 1124661 1136483 1069796 1029466 888709 724144 756088 842388 764975 720476
8510 720476 794851 936067 840735 922473 994992 982831 985341 942235 1016315 1063416 1083468 1012668
8498 1012668 938755 1030676 897724 838736 914999 899188 883383 931859 1067848 1084530 1081416
8487 1081416 1044496 870736 845576 958839 894139 855565 944427 833393 756184 798296 952487
8476 952487 914476 929414 990117 975890 808921 805122 740562 695105 613891 640042 659623 688920
8464 688920 625882 663624 710682 823784 889126 778622 747544 808658 834957 716695 652528
8453 652528 684570 704384 693304 728461 717644 751892 736988 761170 760241 769137 784743 787187
8441 787187 808731 864501 804100 672149 679345 622707 544055 726044 691979 660944 572268
8430 572268 613740 796806 755499 667181 662003 606376 637870 532389 646057 756999 592930
8419 592930 476790 555209 628735 759875 788736 710523 743494 690742 557232 588757 576687
8408 576687 517929 545878 663318 830564 846118 733191 722918 676787 609472 579830 530759
8397 530759 567981 605002 556832 508325 389758 308534 404339 518711 413264 377757 495561
8386 495561 453169 488872 585048 627074 658929 670223 644341 603083 439626 395971 310100
8375 310100 300236 488979 578657 705490 638843 571811 303099 128400 210327 354295 502751
8364 502751 582034 711925 798637 883968 850507 730762 616033 520485 594964 713062 739510
8353 739510 652943 594970 644707 525344 297944 332076 410100 499409 625981 598652 657111
8342 657111 605264 531992 612504 662368 640857 538402 440484 437444 502301 565403 602994 659871
8330 659871 593704 433137 470623 512565 620625 634808 617928 589077 543235 738420 635435
8319 635435 515016 424549 437791 462577 605391 630744 650068 689534 574043 598355 567354
8308 567354 449804 444124 478926 426767 562871 556011 570108 577113 690771 872905 876605 903232
8296 903232 839024 712220 699651 703720 781117 829719 890758 874742 859185 767533 789335 725409
8284 725409 585261 509072 438416 524392 537891 603798 631630 614158 616359 494586 441321
8273 441321 418478 450810 529626 651961 771719 560957 414099 412630 414985 611974 824825
8262 824825 758153 688452 622469 659728 712501 494655 397544 366946 592200 928392 923181
8251 923181 767802 729289 842917 859715 823724 857276 884493 844058 771026 863379 863014 911723
8239 911723 919493 1007690 1008220 921220 883049 882242 862164 849002 981370 1026651 1032978 987601 737336
8226 737336 775466 830221 766795 789569 726788 806879 824872 768514 749349 793169 999021
8215 999021 942765 842201 789102 767448 591010 735303 970427 961043 890644 746005 795451
8204 795451 881831 959042 908997 830307 959751 1026869 841623 759308 875273 856952 741258
8193 741258 703533 815406 859652 925617 800202 780242 738056 751291 708552 736207 834607
8182 834607 832624 683255 549902 422738 443513 498255 583266 707203 852770 738391 605541
8171 605541 655696 600245 652296 740417 765076 692636 610468 578559 599665 640893 744064
8160 744064 575930 523256 643303 666438 731944 834936 887478 769513 785029 807257 749416
8149 749416 634670 621079 511434 477992 419489 495086 477292 432311 466141 542625 436385
8138 436385 381215 395137 396199 319685 369018 406602 406988 467933 423741 415255 475670 395791
8126 395791 432064 564733 526591 537649 548524 455430 481124 570911 564220 579532 374709
8115 374709 293368 365409 365492 331040 306953 437691 542012 480415 427980 464001 486956 335972
8103 335972 334497 513814 736409 761155 621975 666844 600380 584735 641126 625581 611249
8092 611249 523061 592809 535926 489264 667253 593539 483297 534382 624268 535466 432560
8081 432560 485801 568633 530739 544004 489861 446198 586748 704182 670848 678924 780678
8070 780678 762625 550458 483700 527224 580517 664374 628658 709340 808422 909688 887405
8059 887405 829236 856546 908082 968723 905899 931738 971648 1034317 1226096 1287059 1128355
8048 1128355 1112133 1291763 1333750 1323291 1336956 1510414 1584636 1728615 1813916 1808847 1775895
8037 1775895 1844303 1886419 1758689 1674464 1518009 1420897 1373532 1413458 1448962 1499258 1422853
8026 1422853 1360322 1366560 1432178 1424606 1592121 1698433 1683782 1875763 1975279 2006770 1937350
8015 1937350 1919879 1924573 1942239 2074573 2099337 2202297 2236920 2333735 2519696 2630674 2749753
8004 2749753 2759999 2822676 2927403 3183869 3355828 3581950 3912007 4165100 4304306 4332235
7994 4332235 4249853 4208508 4153364 3983216 3577173 3230628 2993455 2878396 2780963 2698731
7984 2698731 2684050 2685297 2773145 2851995 2900778 2984607 3160206 3206012 3191528 3424116 3784508
7973 3784508 4019004 4018488 4045292 4112082 4373609 4489424 4615614 4668100 4693526 4922919 5163332
7962 5163332 5236690 5256521 5424382 5707589 5929090 6081182 6242509 6645721 6877267 6939685
7952 6939685 6930642 6851625 6841507 6644952 6417449 6261968 6110193 5796298 5354924 5137286
7942 5137286 5151922 5148474 5106119 5167630 5223813 5200757 5106830 5245369 5390082 5476485 5620771
7931 5620771 5683424 5820126 6003724 6068903 6185945 6281559 6370739 6472041 6527975 6641606
7921 6641606 6702897 6629973 6476153 6446058 6582905 6705151 6476039 6410882 6417675 6466618 6216146
7910 6216146 6028717 5796428 5547692 5467997 5476793 5476285 5576398 5606486 5529513 5617103 5554265
7899 5554265 5478763 5463073 5498043 5368052 5273055 5021123 4932293 4831016 4789723 4770369 4679447
7888 4679447 4631648 4614711 4478438 4237852 4172224 4170288 4189153 4226834 4130505 3906406 3763982
7877 3763982 3724300 3459311 3241668 3079021 3003599 2782539 2764414 2771348 2778643 2654895 2716919
7866 2716919 2680331 2712482 2826737 2784181 2792493 2834526 2837988 2779764 2758603 2656063 2553026
7855 2553026 2656480 2636742 2617622 2644582 2628188 2475664 2272560 2087582 1968652 2096217
7845 2096217 2090216 2107539 2160787 2005658 1795751 1741123 1760850 1713442 1641171 1609015 1523090
7834 1523090 1464940 1227206 1119355 1080886 1117938 1005085 937401 866297 839039 778237 781794
7823 781794 876051 935860 889629 840455 761584 755870 732825 770118 878375 798992 797880 789979
7811 789979 759143 742055 731954 753892 735422 701984 791203 916687 951186 866878 716499
7800 716499 712906 797302 746826 686502 815762 655119 585536 842401 827528 622091 522643
7789 522643 474230 469312 663345 713560 585158 539843 554064 418806 393724 343897 314197
7778 314197 378865 323019 243294 240081 276015 213639 208633 314797 476342 486700 337078
7767 337078 308764 282376 263550 265146 266667 212360 220398 351007 432694 467125 483380 414105
7755 414105 298875 198038 251235 212211 99057 85807 46572 116351 234988 319070 298704
7744 298704 241146 401122 354216 174137 203722 146185 210881 410693 402146 370746 448385
7733 448385 341760 162347 104958 179893 193965 196973 93326 32551 1057 -74380 21788
7722 21788 4420 50145 -19055 53411 113060 65838 -1102 18392 90439 107718 165157 207501
7710 207501 163762 102533 80052 63498 107991 120223 68689 249029 211453 67766 59643
7699 59643 118753 155428 42619 122134 231896 282796 162994 130288 48716 102057 182538
7688 182538 138709 67236 -84697 -60685 -78903 -18809 -21972 16820 53235 15040 -80148 -186098
7676 -186098 -210154 -179074 -199452 -145820 -73268 -105486 43428 154899 53248 -125209 -186553
7665 -186553 -299906 -303402 -113568 -10015 118230 125164 143625 267787 284523 309141 293782
7654 293782 164625 131382 66898 -7732 53040 72298 55151 58671 167923 201632 176714
7643 176714 140939 177302 69874 -89225 -107788 25548 116383 192326 234404 257908 129449
7632 129449 167393 34119 -225451 -218708 -72970 47356 163096 67607 -75749 -102634 -152483
7621 -152483 -71261 90024 153415 188361 197475 103153 7995 5651 22628 168151 131728 67911
7609 67911 40545 -50586 -24751 87298 104485 192175 285569 273505 204952 181975 327149
7598 327149 301995 168444 25578 -272822 -329839 -222278 -195329 -195815 -221942 -197227 -43890
7587 -43890 -40742 81023 215683 124363 109886 12013 -82242 -119125 -264990 -139115 2652
7576 2652 115370 197467 231644 297573 307423 174592 141255 136609 75588 65913 113020 -32011
7564 -32011 -41056 72078 104428 -106910 -167259 -148741 -43650 38905 -39979 -131191 -75539
7553 -75539 -21862 -45515 -92173 -19739 141052 144261 63956 -57654 1015 237195 289359
7542 289359 109793 87023 110453 91037 119506 167411 367927 399210 175394 -41444 -34470
7531 -34470 43470 -103527 -166643 -231639 -225294 -172085 -157841 -24490 -46528 876 1770 -9012
7519 -9012 -13049 40959 111501 77657 34551 20989 10226 -63806 -120724 -95931 -64284 -62293
7507 -62293 -9609 27635 -106535 -174941 -50494 -3208 -63993 -98081 -116870 -114540 98916
7496 98916 201661 36512 28495 56973 -30049 -41887 7339 159386 165657 149344 207936 230878
7484 230878 123773 47208 -21451 -93147 -152293 -171897 -110246 -11109 118882 164149 175314
7473 175314 337307 429635 357295 334315 112409 111864 96725 110141 120421 20084 119798
7462 119798 110121 8939 -74351 -30614 107241 165017 177396 120436 -10857 150309 69238
7451 69238 -47186 -69791 -88164 -94303 -211798 -251348 -75947 103924 72143 -21955 -68348
7440 -68348 7225 126026 -28347 -166775 -229447 -68675 9210 123290 155467 69251 -33834
7429 -33834 -43814 -102245 -95118 -83123 -60956 54464 10791 -162497 -204320 -151746 -797 65346
7417 65346 -26283 123583 71835 -101987 -109606 -27688 75333 87644 28173 -68250 -82355
7406 -82355 34329 73910 52557 -21084 -21120 119863 223185 188779 131981 109820 36608 53265
7394 53265 90268 -4969 12885 -42866 -79080 -116535 -134187 -73528 -109856 -102967 -83140 -57090
7382 -57090 -58130 6022 -59035 -120407 -195726 -116592 -179178 -129470 16321 96951 158181 196532
7370 196532 125606 181156 228264 123112 -9895 -66366 -22780 62632 127508 22514 31525
7359 31525 153772 217159 215654 200353 147082 1835 48698 69773 -44265 33960 42262 41290
7347 41290 62016 45424 26946 -33524 97557 144196 151078 159427 161512 157844 233817 230284 150770
7334 150770 149208 113564 91620 162384 90795 70539 15100 84754 153881 65040 15900 -5731
7322 -5731 -28409 95911 145198 77586 -101299 -308345 -272228 -325958 -292363 -233911 -189135
7311 -189135 -109897 20592 -5192 -54614 22527 -77416 -276418 -278983 -171735 -117425 63547
7300 63547 182743 88985 -29939 -90196 -90125 -39720 1760 4407 2643 90867 202077 122462
7288 122462 -80826 -73547 41120 30063 4373 5467 -31542 -31636 -27586 -124385 -151841 68359
7276 68359 212177 208822 187967 212629 132275 82267 108749 162406 249885 293796 186173 166812
7264 166812 248669 104318 -7326 34088 44891 -30677 134419 130434 171631 177743 54536
7253 54536 -43531 -98341 -130980 -93197 -57360 -143010 -90274 -55529 -111068 -196359 -167856 -88142
7241 -88142 -135502 -300564 -370886 -309652 -66802 40500 22130 9674 -56766 -146509 -87366
7230 -87366 -43135 -28701 -45974 -10656 32766 175239 137440 92802 32757 -44991 -82946 -178956
7218 -178956 -128596 171344 330620 299161 265944 179301 212105 246000 145475 83678 56725
7207 56725 181026 69801 47264 177081 215127 189822 145296 286694 385228 277537 79454
7196 79454 30439 14741 -34821 -70160 -71786 -95342 -194776 -185883 -132360 -115804 -137913 -39379
7184 -39379 33887 118829 95319 60413 36651 -1261 -54615 -12589 -28944 -128878 -38596 68386
7172 68386 11240 58934 97913 149436 140680 63383 83023 72082 84169 188833 167511 156184
7160 156184 49135 104897 191308 169395 66501 9342 125662 133937 53510 -25736 38118
7149 38118 45810 104536 9542 -85235 -103357 -30267 -150397 -290662 -199474 -187980 -185188 -104498
7137 -104498 -123776 -116517 10591 52363 106157 80200 -4584 66150 230462 192139 155954
7126 155954 147959 26201 -42775 -39797 88291 161383 -13290 -74503 44390 69480 91839
7115 91839 53338 46878 -54719 -79665 -104626 -162033 -140656 -195139 -190087 -129555 104617 285362
7103 285362 244352 124943 114133 49242 -68601 -56874 -173553 -220029 -91647 -103038 -71508
7092 -71508 -76780 -227400 -314855 -163063 -175678 -240591 -249610 -161217 91249 110878 52737 2085
7080 2085 -85849 51506 171352 108788 90912 157146 65887 17931 62499 112970 102572 80586
7068 80586 82874 -11514 93615 295419 160171 -34435 116807 247991 341781 257946 90637
7057 90637 74831 96111 175761 99168 -40324 -146587 -154570 -87052 -2905 -116720 -129751
7046 -129751 -129646 -163668 -156451 -272462 -287771 -178624 7432 -50359 -155921 -69574 -32345
7035 -32345 5150 164468 317355 90121 -104888 -50374 -50733 -144840 -45006 -73817 -97217
7024 -97217 -119639 -77549 -42891 -96744 -99159 -97334 -62016 -10818 -59720 35093 145853 67789
7012 67789 -53519 -49918 -3751 -816 -34972 66968 204996 165022 11011 -224676 -169008
7001 -169008 -43841 112539 169568 167710 53473 -13430 -166757 -169551 -121887 -75525 26554
6990 26554 -62599 -215040 -208817 -197915 -239196 -184765 -183188 -78674 34318 156727 141150
6979 141150 172050 59456 10639 84567 164639 54963 -88608 -75833 -46836 -63694 -84379
6968 -84379 -81428 -113787 -149025 -162084 -86504 -4249 -6027 -3155 2966 -43899 -88329 -72251 -140526
6955 -140526 -241230 -298278 -222643 -53979 27374 -22595 -56589 24600 113103 65243 -88543
6944 -88543 -46185 3166 169024 188002 60938 -6602 -37277 -139569 -120455 -74296 -33357
6933 -33357 76830 189520 218107 136744 -24027 -49386 -37462 -28228 -70408 -52588 77827
6922 77827 148670 113793 6410 -94362 -39034 43996 148994 183787 223730 70757 -86321
6911 -86321 -90211 -144204 -1652 82635 94832 -3440 -103852 36456 53778 133063 65530
6900 65530 -11562 -26515 4564 -39441 -84214 -157602 -137921 -101705 -90028 -119821 -112731 -87524
6888 -87524 9116 84789 92590 71030 -44138 -100837 -140911 43168 73772 -98826 -103891 4435
6876 4435 -47882 -201142 -250309 -140517 -219833 -328072 -268325 -190847 -94494 -30307 16104
6865 16104 7633 -37762 -85441 4830 -8678 -133005 -15431 89474 64944 91835 127379
6854 127379 214095 189951 107234 6854 -33914 -77127 -169925 -105420 -91975 -65338 -12332
6843 -12332 119181 80897 -26001 -147344 -59141 -803 -85934 1967 25664 -41531 -167309
6832 -167309 -96996 28721 157936 53006 -31359 -26946 -54326 -31044 98265 142675 45852
6821 45852 44236 173592 145465 137814 -15697 -62509 -78446 22534 192976 187008 199036 115384
6809 115384 -105132 -128899 -201329 -184124 -218390 -129534 143282 116264 664 -41459 -180098
6798 -180098 -231038 -130405 68910 172483 188787 202572 237644 208160 160702 163053 66373
6787 66373 -121351 -79831 -43745 -199324 -167320 -79237 -4017 105210 132448 99701 148065
6776 148065 139668 -7168 -46660 42095 164281 158213 122274 111848 75533 13228 119592
6765 119592 12340 26857 248556 398302 444075 417155 313412 207782 137115 115312 82631
6754 82631 -77265 -49243 12216 11395 -75367 -168868 -311802 -325656 -269366 -33543 42214 -117464
6742 -117464 -114750 -27326 102296 8414 -11202 -62118 1683 78997 151802 264878 230273
6731 230273 193413 178875 248433 281316 243632 177830 169613 81399 61743 18117 5706 99573
6719 99573 -45395 -187688 -113513 -86004 56718 1149 -193319 -86749 -76131 -199744 -150981
6708 -150981 4444 -23532 -106030 6611 129021 50365 81101 124571 43029 -140973 -162908
6697 -162908 -27531 37611 90900 138813 229905 147379 154904 183811 27294 9979 36175
6686 36175 97069 201653 183402 100129 25445 25777 146905 77465 134991 211902 187394 149756
6674 149756 165115 167413 145114 111200 57830 -16243 12150 108871 98097 -71998 -141602 -127924
6662 -127924 -191977 -182021 -88184 -37778 -19668 -47907 10261 27938 128496 124246 26678 15343
6650 15343 -13783 -89203 -132997 -131349 -115830 -3789 4297 -5236 -61077 8287 141726 188508
6638 188508 55579 -47225 -59532 61174 237285 169736 -10692 -191914 -370533 -269980
6628 -269980 -250265 -192316 -42170 -351 -85116 -159712 -135285 -26895 27311 49124 31343
6617 31343 -39202 -10706 -91069 -45100 87225 3645 -60816 12275 27678 90774 134068 243867
6605 243867 98447 29684 82118 86950 33336 -9552 23059 -94135 -115924 -161878 -294337
6594 -294337 -158064 -5982 -15440 41979 115837 95941 32386 139032 201904 100146 102041
6583 102041 60380 108445 -35486 -90994 -33541 5522 -69651 -193837 -197430 -174850 -54318
6572 -54318 -111159 -53789 -100599 -118981 -112522 -156653 -196030 -187409 -84323 30423 196468 141857
6560 141857 -32082 28190 189421 102524 -22850 -67018 -40711 12671 -7348 34598 81542
6549 81542 38008 -60896 -16695 -146048 -68474 86590 184785 98866 -90966 -141810 -23067
6538 -23067 63208 196252 214536 204125 -127 -202519 -164191 -186552 -236972 -69024 -117023
6527 -117023 -115260 -43245 -205305 -188565 -87351 -116874 -52469 29024 152786 151554 35785
6516 35785 -33497 57775 -47070 -72473 -29652 37006 -8105 -7353 -88522 -69438 -148006 -148303
6504 -148303 45942 87539 89886 134219 86811 25442 -43280 18370 108481 155648 96746 22014
6492 22014 22538 -5810 -29638 -157248 -164140 -228608 -274528 -295889 -261281 -172579 -108358 -146743
6480 -146743 -219877 -248216 -221510 -146627 -101417 90010 90760 -41397 -174316 -189111 -79727
6469 -79727 1532 47970 27911 -93187 -294492 -223761 -114300 -174010 58435 235840 162177
6458 162177 134376 216933 287489 152913 49127 91799 94900 86443 -2209 -68177 -18655 -79179
6446 -79179 -174905 -252678 -76908 128445 145521 169998 133986 -49159 -81353 -61411 -82347
6435 -82347 -146498 -237532 -192061 -111580 -30515 -103893 -47657 35064 86098 1349 -97124 -92171
6423 -92171 -103102 -223349 -237922 -80930 -5423 -12135 62092 158169 127001 -56730 -74820
6412 -74820 -27935 46090 118830 214780 254647 184717 48687 109526 170411 55405 15280
6401 15280 10161 88800 110224 54871 33154 117197 -12788 -25849 -36872 96347 139307 73283
6389 73283 13695 43273 -46265 -324096 -334111 -281311 -183795 -173704 -187013 -122361 -89132 15776
6377 15776 17692 -51125 33780 28499 -14184 -30499 -32099 -22751 64704 173612 223150 155960
6365 155960 35802 27292 87292 11987 -47286 -72693 -42988 70803 87282 -62294 -192099
6354 -192099 -87684 -110352 -171242 -163970 20728 102754 -25652 -236412 -228388 -91584 37432
6343 37432 81154 8221 41220 -6637 -74256 -209523 -147299 166521 222992 184522 169795
6332 169795 106116 36736 35806 136059 84680 -17022 -13305 -3840 -3548 1366 1866 -68356 -19139
6319 -19139 151189 253483 -17933 -123977 88547 43308 -11199 -7660 -124139 -139955 34644
6308 34644 44154 -17587 155205 229717 176507 51708 -51244 69650 198583 174326 125591
6297 125591 94802 287722 273273 273933 175974 13072 -38442 -88989 -11186 60981 85097 214925
6285 214925 197545 147320 90190 68837 153351 178494 41549 -41243 -34628 34412 27791 -162655
6273 -162655 -168388 -96262 84256 61468 62151 75276 -18888 -98246 80597 314237 273472 90359
6261 90359 111675 95822 110746 86768 20985 -16615 -59371 -227540 -238378 -217284 -64258
6250 -64258 75819 -58256 -174869 -203530 -79948 107227 160162 53122 132562 222034 265008
6239 265008 297404 199834 52922 -96645 -98883 -46015 61101 213010 167886 -34814 -49834
6228 -49834 19020 6275 -32516 -18951 69309 26233 -98813 -226314 -98985 65613 113632
6217 113632 148095 147856 201120 257521 226624 139528 91606 27721 24663 -5927 -91630 8846
6205 8846 144765 98306 126177 64351 -33460 -57101 -76429 117726 201571 140477 -13324
6194 -13324 47522 42042 15499 28530 -10016 -51884 -73616 -34272 -70293 -1644 -199619 -282453
6182 -282453 -80822 -100038 -5016 -26195 -40287 18057 109552 62174 -207375 -214347 -106252
6171 -106252 -20762 -56509 17180 128662 121206 233418 260878 271095 125095 -48256 -71653
6160 -71653 22913 33690 132179 100552 -48466 -8957 126469 134646 165925 162343 9980 -126805
6148 -126805 -116823 -85361 -70606 -231103 -213513 -142093 -158832 -194647 -224126 -246158 -144339
6137 -144339 -78650 -108466 -158383 -162690 -139123 -131948 -150751 -165100 -198718 -82246 37689 79929
6125 79929 47982 99798 221709 183323 85399 274 50852 34786 49163 184120 135101
6114 135101 187523 82572 102119 110291 31459 105171 181126 37337 -70949 -34900 42236
6103 42236 174633 99709 18254 -100763 -21587 3089 481 10914 72473 44232 54586 64704
6091 64704 11789 156565 144325 47432 -12285 -38442 -109631 -116991 -62741 -114094 -37117 46664
6079 46664 16149 -31855 -28258 -77739 -10445 91677 79687 -79308 -25819 -96184 33892
6068 33892 17551 -35583 -150234 -83497 -7493 -42613 -66699 -50093 -27442 -115995 -70006 -1560
6056 -1560 63859 109562 179315 332563 163781 -133030 -92662 99940 1917 -117991 -91855
6045 -91855 -121315 -178637 -125718 -75267 -121562 6645 48043 -34268 31840 78686 113219 98997
6033 98997 88379 13784 16988 44331 -91355 -92816 -15663 42967 -100211 -168280 -149528 -57050
6021 -57050 27400 59009 203835 114182 -30030 -148864 -37308 -76624 -68600 69977 59912
6010 59912 -77181 19839 34833 83679 106698 85688 13269 36458 -43872 -90998 -65119 -39936
5998 -39936 17574 -26665 -117899 -145825 -141696 -146764 -51673 -112139 -10143 151081 148904 -18756
5986 -18756 -19931 -62988 -77171 -61323 -66373 35316 -59332 -27906 -38159 -26432 75006 101722
5974 101722 96696 -10754 -105833 1375 121065 141969 146842 165845 139508 76353 -43717
5963 -43717 -37991 32666 46119 26356 213234 248288 146163 122998 32047 40386 72225 39451
5951 39451 114202 28785 -27144 -18253 18818 -57986 -117655 -41966 53208 13103 18048 1047
5939 1047 -127595 -300090 -229966 -296019 -242286 -220253 -211553 -147610 -104071 -140984 -197070 -322171
5927 -322171 -213520 -208943 -215221 -121350 -107288 -268603 -118523 44911 126140 124666 38486
5916 38486 50177 -10338 -36247 -114998 -142419 -247067 -247595 -235052 -81210 -115319 -111719 -86706
5904 -86706 -100730 -183727 -245913 -325805 -96189 -3939 -35491 -108258 -54813 23531 -128511
5893 -128511 -304974 -328563 -427566 -368823 -149931 35281 57268 -78297 -119842 98848 252346
5882 252346 155337 116511 123986 179062 235140 255741 135208 -123386 -277807 -229134 -179935
5871 -179935 -172881 -135423 47716 43673 142592 220243 176928 108532 32372 58561 150079 201503
5859 201503 159692 78766 173921 206912 184429 203081 131519 133102 71094 22344 -26701 -93723
5847 -93723 -163041 -62837 -37227 -57964 -146473 -40019 42146 72177 138034 165354 160328 -35591
5835 -35591 -202919 -285318 -179499 -23829 139993 179666 76115 63533 42359 -61795 -17385
5824 -17385 -133909 -117317 107760 175450 68703 36447 18810 -41013 -59947 -112943 -96635
5813 -96635 -54944 112454 139123 77024 5085 -86535 -65917 15937 -99590 37588 70871
5802 70871 3926 -26619 9870 -145756 -318274 -295492 -81149 -35610 -15883 -51348 -263904
5791 -263904 -106949 156865 226180 274410 182407 133092 299993 162056 114729 83312 17553
5780 17553 1504 -27378 -134504 -264207 -183287 -133215 62824 172151 82580 220406 88009
5769 88009 13299 -134830 -280827 -253550 -102057 96449 181038 146280 112848 27707 -48830
5758 -48830 -65587 -53244 -63030 -94556 -123995 -258500 -355897 -293802 -202994 -66261 145146
5747 145146 258392 339082 303351 124181 -25579 -48744 -5669 -14946 31673 36847 33797 47405
5735 47405 -2818 -158056 -241445 -144165 -84808 -50193 26687 41315 -14045 -16277 37757 15765
5723 15765 15020 149456 19916 -101958 -76556 -128920 -118836 28830 42607 75498 -69419
5712 -69419 -196209 -11321 132560 220033 166736 130312 115314 17912 -132488 -129446 -64836
5701 -64836 -63094 -198411 -173784 -110557 -148670 -211863 -128595 -44682 52215 48768 -7495 53198
5689 53198 41011 28279 -11407 -6656 14189 -297 -57906 -124685 -12174 102237 40701 -68859
5677 -68859 -70414 -86803 -100165 -87648 -61060 -53214 -75945 11233 42190 41933 -7724 -72624 4927
5664 4927 107579 134847 -15951 -174214 -97284 13395 42071 185373 271453 248898 264226
5653 264226 163363 -40994 -64106 -113113 -123695 -21603 74910 94541 41799 -28209 -1620
5642 -1620 -135115 -158571 -56972 49187 -64701 -182082 -109445 111867 139785 -48911 -154488
5631 -154488 -56406 -4542 19658 4304 47428 52268 62537 -3078 40240 73612 85119 173418
5619 173418 78867 30092 37386 132735 100793 82761 -45553 -89436 -65648 -51179 -47182 11772
5607 11772 79920 83229 -3106 76002 84584 -37581 -19249 25405 -19360 -2736 -21493 14558
5595 14558 2648 -26709 -115082 -317629 -276620 -62786 -71558 -83190 -117154 -122674 -191317 -125052
5583 -125052 1826 126212 162665 73428 -25332 47992 93249 18998 21801 57183 205069
5572 205069 190161 145560 185845 166816 141774 76807 -57773 -130054 -284863 -264453 -182731
5561 -182731 -58584 -28352 -9706 -177411 -162610 15654 40140 -20041 -68893 -61565 -89446
5550 -89446 -26398 22271 -16689 40169 54273 953 -8830 56150 23713 -73618 -96304 -92581
5538 -92581 58139 121751 125206 264429 131816 13274 -47093 -3049 -35078 -42153 -89110
5527 -89110 -102995 -104574 -73064 -86484 -140648 -177941 -123122 -88950 58815 145928 32282 -45835
5515 -45835 -118108 -124279 -136361 -138169 -76939 -16648 4730 -13365 -51469 -10565 105782 154127
5503 154127 112317 195717 150396 177114 238193 234034 162449 44878 -7751 120758 162414
5492 162414 -54262 -122253 -125230 -58998 11232 83822 247456 288802 166666 65613 -24402
5481 -24402 -97633 -44568 -8801 -5158 -76262 -97205 -16151 49489 210120 273378 226735 116556
5469 116556 136917 62303 -50934 -130404 -183740 -188494 -56192 108500 8548 -235221 -181163
5458 -181163 -114138 22381 116144 16898 -56452 -71680 -119849 -159359 -99098 -60758 -63105 -249811
5446 -249811 -193191 -143104 -101932 -44975 -62914 -146554 -265591 -320665 -299476 -177206 -150525
5435 -150525 -197242 -176892 -76206 -102153 -120213 -223624 -360801 -367841 -265089 -85233 -39281
5424 -39281 70808 125075 124769 172817 126201 38834 49503 50497 179 -10052 76599 -50643
5412 -50643 -132921 -155428 -182187 -173434 -51521 -8118 92016 125765 -35344 -92809 -49917
5401 -49917 -52287 81758 46535 -158447 -182605 -87242 -57451 -23801 86511 8423 -114877
5390 -114877 -165241 -52561 -24643 -9339 31514 55670 147085 71513 543 59693 157814
5379 157814 250948 264257 127154 104898 137656 182398 113860 -45269 -120465 17034 83005
5368 83005 -38055 -41515 26756 61518 43080 -30218 -33562 108311 92755 37526 7358 -162804
5356 -162804 -280132 -340417 -305709 -178909 -38637 -65162 -93945 -172155 -60556 -53599 -196175
5345 -196175 -71689 96118 -2043 -56660 -42855 43493 -99952 -101114 -26685 63685 13223
5334 13223 -36658 -62236 -140438 -147218 31637 -54822 -83540 -6998 -1930 -23218 -20311 -63526
5322 -63526 -100350 -141422 -270672 -285401 -233295 -59732 -37925 -33926 -75306 -205315 -178497
5311 -178497 -224408 -85694 -21450 47964 261092 278954 180965 60299 -140012 -102737 -57453
5300 -57453 -179316 -206028 -70133 -79578 14645 55248 -48946 -9417 90931 155380 85885
5289 85885 -9374 81228 159772 126140 63028 131462 39642 -125711 -116758 -28257 12558 65254
5277 65254 97233 -25468 -150431 -78572 -42598 -90570 -94427 38245 72467 62050 105038
5266 105038 19579 -124406 -140918 4346 103797 237924 330188 293792 322698 350641 329277
5255 329277 229370 149784 34513 39616 25077 140523 243173 168580 76032 47571 70348
5244 70348 35628 41689 83100 36128 -32207 -24915 -14984 59450 -25325 -164577 -319689 -361900
5232 -361900 -227852 -257776 -285800 -268099 -138003 102455 250864 108427 -89222 -131447
5222 -131447 -173544 -119942 -57205 -53643 -56198 -23413 -153050 -139370 -127027 62438 54695 23941
5210 23941 -22545 -33360 -71476 -113681 -161746 -95708 -132447 -181601 -99570 24114 158687
5199 158687 101908 -74147 -159146 -119923 37590 58665 -68674 -38416 160320 61489 -170615
5188 -170615 -154559 -38064 -23784 -74318 -104690 -128393 27625 -89701 -215342 -190625 -151093
5177 -151093 68513 169536 147197 246773 206875 97553 40240 16177 -32908 -23486 -25624
5166 -25624 64119 49230 65464 76773 122888 141523 52116 -25563 -120803 -88808 -114115 -94991
5154 -94991 -50619 -46362 111975 211964 224120 168847 135635 877 -54641 150575 183403
5143 183403 37491 -5889 38377 87388 -9467 114424 224264 176304 62893 80774 70347
5132 70347 -42547 47394 -26340 -128802 -95893 -93646 -114003 -36792 63963 110901 3205
5121 3205 -84975 -89603 40279 -49598 -158631 -103757 -110393 -245734 -168009 -194640 -180369 -123860
5109 -123860 -71510 -40885 18792 65659 68835 66795 163478 80383 26554 -1607 23283 -222
5097 -222 13455 -15332 705 -154241 -166491 -65166 68527 70359 115130 132432 4145 -223793
5085 -223793 -265044 -64363 69242 98245 63028 15704 99764 65325 -33199 -5076 22031
5074 22031 92410 209704 236594 -10030 -62376 -26936 -53403 -157497 -146532 -100296 -53039
5063 -53039 -28458 -15546 -42758 -102502 -137356 -40111 67101 33710 20213 -9174 -171723
5052 -171723 -193592 -210125 -171490 -88986 -34152 31662 106003 34448 -40329 -167878 -268777
5041 -268777 -65296 19972 -38479 -94212 -105723 -244398 -216513 -192626 -129042 -46512 -65003
5030 -65003 -132216 -185454 -96553 -21790 -68372 -80267 -70801 -34490 67813 77887 113444 -18664
5018 -18664 -25109 39810 28727 44597 8907 50654 72181 86710 97523 42064 219612 180728
5006 180728 -79394 -159194 -69588 45452 141007 112109 137294 136851 87257 77196 131729 208425
4994 208425 142407 149035 57782 -20366 -145774 -88520 2978 -49025 -69908 -2964 98265
4983 98265 41476 94670 111545 139699 63508 120714 1356 -80487 -88032 -43441 -148014 -253355
4971 -253355 -159950 -79394 -78178 -33315 -88593 -91949 86151 71950 67943 79777 -47246 -94694
4959 -94694 -37947 -150192 -118253 -34775 131744 142292 141232 121855 82164 68395 144270 223376
4947 223376 223820 278830 175046 127639 233977 160908 69713 116193 15830 -54821 -85411
4936 -85411 -172983 -219589 -33236 50727 32819 69601 118771 221351 230655 186642 -6456
4925 -6456 -59124 -10242 -41338 -26775 96847 17152 -24696 34245 80017 75053 90396 62938
4913 62938 -44289 -62770 -145941 -215369 -174331 42509 70601 87673 -65391 -284891 -328539
4902 -328539 -284221 -161780 -25168 171408 138580 68213 -73300 -726 -55318 -160843 -327233
4891 -327233 -333368 -243184 -270414 -415147 -419656 -164109 -110758 -224518 -237288 -158973 -121617
4880 -121617 -156908 -102277 -38115 -90805 -284326 -319388 -222485 -102406 -37860 -15751 -54865
4869 -54865 -191266 -279715 -190749 -35918 103895 129401 91279 72863 122764 249356 136942
4858 136942 -20156 25669 -53164 -189176 -220332 -110150 -41272 -87233 -165651 -159774 -54237
4847 -54237 -77967 -73834 11321 85722 41092 82618 35057 24494 79910 -5731 -135304 -107294
4835 -107294 -55265 -64849 -104484 46471 133491 37585 -2422 38401 86904 109229 146698 33100
4823 33100 -150760 -187675 -113389 -233968 -277812 -182884 -12108 30206 93998 182299 246059
4812 246059 277733 221144 333987 284977 198764 236963 163263 25193 -81050 -60317 -93328
4801 -93328 -76827 -139365 -244405 -150149 -145194 -108780 71553 62551 -15992 -108104 -27451 95408
4789 95408 -12856 9948 185112 230210 152207 -17846 -73913 -111241 2775 32794 38356
4778 38356 88905 27587 21629 11369 7432 -81413 -80666 -80677 -87904 -79067 -97720 -92924 -157176 -223249
4764 -223249 -72081 -61818 -52512 54236 110592 137095 27017 -66645 -79550 109889 190159
4753 190159 46050 -28315 -48901 32923 126837 101952 51574 131089 124080 24894 -44037 -65939
4741 -65939 -97192 -146877 -97856 -62418 -16730 -14338 -23332 67760 172379 3344 -77585 -96844
4729 -96844 -114076 -108147 -54865 15860 10145 39331 106247 22547 68140 106546 -52637 -154945
4717 -154945 -126882 25614 102295 50988 91009 179877 194817 126886 200801 57920 -54124
4706 -54124 -19600 -85882 -211620 -216281 -119765 -17153 22835 -53620 -85050 92904 138541
4695 138541 -3217 -67251 -87393 -51600 46199 93016 23644 -56523 -117089 -121523 -104879 19345
4683 19345 -26757 -53605 -285983 -281148 -249883 -340520 -251209 -235175 -226079 -87588 -100249 169721
4671 169721 143816 -19053 -123930 -173912 -50688 41164 2001 85433 143065 49439 -34928
4660 -34928 -80190 7502 -112278 -49309 94208 81128 111267 54665 -33269 -18560 -61154
4649 -61154 -119673 -97900 -72253 -92105 19993 30612 -50275 -62520 -1800 87554 61022 4666
4637 4666 -358 153352 161012 79053 121083 22003 -42614 -114690 -62422 -7332 -21611 -123735
4625 -123735 -344029 -418015 -358335 -281319 -115184 106730 121510 78555 59742 -27443 -121619
4614 -121619 -43690 154618 178521 217143 194265 125442 181180 206738 92760 201758 153856
4603 153856 137401 145640 157398 29154 -19412 -40957 -43947 28493 233913 210793 40953
4592 40953 -39970 -88584 19480 31172 -68672 -203826 -371313 -446270 -430216 -382311 -314377
4581 -314377 -257828 -142407 -39017 1607 -96907 -94376 -60932 12662 25891 48498 -85654
4570 -85654 -145862 -44427 -143627 -107755 -169746 -119348 -46800 34550 97355 90268 -2653 -55917
4558 -55917 -42159 -74481 -155986 -88769 -40513 -106023 -6016 149806 161715 168821 161115 91417
4546 91417 29959 -23303 -39117 -117119 -27384 158103 125300 -16099 -103047 -140465 -265938
4535 -265938 -242333 -183779 -185389 -203228 -208679 -180274 -5126 144564 51138 -52154 -46739 23709
4523 23709 61750 168341 148353 106214 -9309 -131235 -168043 -157462 -141192 -143691 -173472
4512 -173472 -148123 -183367 -118771 -156265 -125661 -77997 -27864 100748 132346 149539 129116
4501 129116 149873 179574 122026 15996 8125 -73386 -47579 -46925 5350 152248 182371 91190
4489 91190 -39110 -95554 -10965 -82423 -49940 -28707 31135 164673 140046 34798 -16786
4478 -16786 35013 90052 967 -27954 17737 171362 238517 91507 61652 41316 113044
4467 113044 26387 -24081 -79357 -86023 -173752 -370929 -378258 -220582 -82250 -56673 10068
4456 10068 -33537 -204434 -285097 -137360 -113691 -262230 -356104 -292535 -189229 -192731 -120364
4445 -120364 6824 -100374 -71521 98740 163296 73732 58345 -8486 -9285 96088 155040
4434 155040 54704 -10020 30465 20256 -45307 -192060 -156845 -71793 38627 23290 -30111
4423 -30111 -15086 -42280 -88959 -197498 -135580 -235384 -219183 -253272 -259858 -240324 -147048 -76456
4411 -76456 128026 219680 69891 -64108 15358 135640 111544 -57570 2694 -51915 40361
4400 40361 257891 236538 115289 195757 327229 396906 233446 130086 80738 132003 213458
4389 213458 127760 117339 199669 169466 106247 139168 139878 98447 61242 -92156 -66306 31067
4377 31067 -67150 -33221 -15642 -37714 -168719 -254698 -302133 -176101 -54205 20643 66807
4366 66807 -55298 50074 81982 -52965 -36668 -39201 -136989 -74911 27964 -51659 -119413
4355 -119413 -39457 83304 130378 124103 233403 296863 347114 221794 125898 76006 83976
4344 83976 143764 60317 -11902 -29186 -134001 -109789 73679 15086 -40986 -60698 91387
4333 91387 41719 -28082 24185 110734 79727 57530 -92790 -209797 -318931 -177720 -12340
4322 -12340 50957 80252 130327 88352 -49163 -30445 -88316 -102857 6496 80737 82679 117766
4310 117766 243493 140044 59856 -770 -67161 52809 73335 99974 202447 173537 102993
4299 102993 36605 148112 111515 -30653 209 51335 -62655 -126174 -30839 10466 -21080
4288 -21080 47593 -19277 -128842 -18137 75765 41112 -61046 -17708 -15954 -85419 -36391
4277 -36391 7122 -42964 -179665 -185031 -21453 9042 -122 -146502 -181937 -127145 435
4266 435 26723 14415 -25078 -15446 18346 93400 116906 92305 112760 -110257 -165381 -14492
4254 -14492 85389 115878 96694 -9684 1479 -72181 -162274 -64658 -69389 -126686 -128366 -189877
4242 -189877 -185626 -247372 -236100 -206011 -115697 -23140 28623 97270 4679 -68407 -54703 51180
4230 51180 -81851 -190435 -200139 -36269 -127112 -155688 -61768 18087 3436 -104044 -137917
4219 -137917 -101229 -72346 35470 175780 141224 56795 1399 75548 26257 -72232 -41927
4208 -41927 31816 -11540 45063 68407 81762 -73284 -173008 -237791 -151419 -104574 -190968 -281135
4196 -281135 -221473 -181529 -128406 -218814 -104773 -118223 -193731 -84104 -85088 15745 50484
4185 50484 8317 70487 168159 111743 122896 229050 159352 -4207 -7700 -15433 -31026 -84671
4173 -84671 12026 57403 68119 82525 -56471 -52008 103940 165662 92598 14321 -11260 3846
4161 3846 18169 -104409 -92407 29604 70738 116523 60106 -63386 -106623 -120665 -90027
4150 -90027 -45792 2726 41609 60365 85046 29439 33983 22879 -21269 62572 -135 90161
4138 90161 145378 35110 72305 22705 29610 154185 230626 195629 -65443 -181406 -311819
4127 -311819 -269920 -103742 32190 144491 108651 92129 165884 252674 265245 103397 93668
4116 93668 138319 133536 43005 25303 46795 67762 22339 60264 82810 62780 -9190 57925
4104 57925 175333 185670 113765 19408 40550 103272 71570 142701 250622 132014 -47951
4093 -47951 -160352 -145751 102785 204352 252280 313029 316819 148614 49543 -66469 -124013
4082 -124013 -130831 -158730 -90779 13959 -56903 -164681 -86169 -80776 -87332 -189274 -164276 -130015
4070 -130015 -200744 -129673 -36102 57053 71521 7956 44515 -13942 -40087 -58269 -98734 -132879
4058 -132879 -119448 -154106 -177060 4406 86385 72346 106377 10340 47584 -72258 -66464
4047 -66464 -47101 -149923 -212222 -96328 -105420 -77471 -149072 -221815 -192123 -183300 -269676 -141866
4035 -141866 -126503 46610 181052 112497 -102356 -303849 -395726 -348979 -197407 -40345
4025 -40345 -218504 -176870 -104374 -72159 -73648 -103266 -247308 -266363 -225702 -187157 -68374
4014 -68374 -129131 -146029 88694 139706 171097 202223 157953 189427 92586 12469 -14710 5520
4002 5520 -58919 -93597 -77487 18609 -6082 -92744 -72754 -35321 -403 -77035 -138383 -202960
3990 -202960 -144618 -128629 -133243 -35084 -6643 -97054 -109718 -154804 -99422 -99743 -59166 -39518
3978 -39518 28789 87377 56157 7324 22836 -19528 -95400 -98977 115723 128990 68281 143415
3966 143415 151629 -64 -42319 27374 114391 123770 72529 36862 34348 -5162 25211 103147
3954 103147 190528 168213 -9191 -169148 -112018 44904 86737 150623 83161 -1022 59411
3943 59411 -11358 -174247 -297362 -223532 -163070 -34935 -84219 -111996 -122779 -153790 -20774
3932 -20774 178017 326085 293738 126570 140857 106727 64596 -11530 -20822 46294 -44478
3921 -44478 -95628 42118 82491 33845 38627 158174 122706 4291 -95977 -69703 -21475
3910 -21475 -64522 -134415 113143 168532 84026 70564 184459 159828 136474 114432 211655
3899 211655 313514 118911 -31625 -80516 -69397 54537 49766 52192 -84530 -4009 33412
3888 33412 -2246 -62509 -133367 -139222 -120015 -130930 -74965 2182 -21499 -320258 -440476 -326721
3876 -326721 -226217 -272593 -293695 -178578 -218104 -137299 -17638 95322 83875 118408 71694
3865 71694 15957 -8500 -35557 -49600 -217564 -277187 -175269 -59046 104256 -8154 -233348
3854 -233348 -296172 -199663 -136372 -193852 -190095 -161327 -85023 -14365 -10178 129154 -86538 -306208
3842 -306208 -193255 -91352 -177343 -163458 -46666 116329 133088 145029 64467 32514 40264
3831 40264 -94340 -85795 -52291 18842 118374 24680 89521 64053 -40026 -86284 -6886 103315
3819 103315 78265 118586 80050 57290 -24561 -97173 -130121 16815 99896 156658 4288
3808 4288 -80444 -11195 -89948 -235899 -258429 -260046 -131214 -160681 -48339 57221 47686 16658
3796 16658 11753 -92313 19561 114890 105754 71508 -36081 -88085 -86036 -169883 -111572 -10399
3784 -10399 8280 -77317 -232863 -250610 -145638 -165804 -311085 -224826 -127573 -30493 105846
3773 105846 47209 -126056 -183416 -136510 -38092 124702 102005 -82668 -257419 -322229 -228710
3762 -228710 -43815 70646 122119 96188 -1004 103293 83698 -66722 -75572 979 35249
3751 35249 33739 -72975 -55998 -29775 33030 -14648 -31212 32989 154528 113704 104664 69792
3739 69792 3497 141872 303632 317648 188989 213616 250052 136765 5222 52247 -48282
3728 -48282 -26136 96241 179428 122447 111125 188143 174211 156496 264247 321599 285158
3717 285158 126860 48956 -5806 44877 106541 125371 81813 133500 79705 229812 262227
3706 262227 271849 263037 213089 185085 98843 -54520 -105526 -1317 127882 65610 23623
3695 23623 -6153 -50316 53331 125516 126835 14703 50999 119805 133002 143877 63059 -33378
3683 -33378 -140928 -265301 -245292 -154825 -178247 -245568 -220693 -96847 109169 261672 391959
3672 391959 351423 241214 26238 -41100 -9156 41970 -22671 -134406 -116377 40051 208045
3661 208045 175403 183064 76980 88291 189831 172793 67859 28922 158652 181392 195639
3650 195639 90868 -112033 -79326 -13173 -51261 -723 -15272 78110 9987 5275 -7656
3639 -7656 66 -24438 12228 53445 57977 78074 16692 -70297 -83168 24278 -1680 34397
3627 34397 28677 -64536 -1122 146420 144136 38562 79987 184391 3399 -66571 -215719
3616 -215719 -145127 -48957 -80186 2902 85294 35379 -57605 -81242 -11780 -54469 -37710 -26915
3604 -26915 5172 28453 -68943 -109707 -189408 -165281 -105599 -269986 -310862 -245383 -98272
3593 -98272 -58152 -72133 -93897 -87237 -42918 98867 213419 156936 63059 -27641 111184
3582 111184 351222 345941 308307 309141 102924 26512 -10859 -206063 -223113 -179718 -29538
3571 -29538 74037 18001 -756 25376 8031 -66297 -103997 -74471 -56056 -5922 -116290
3560 -116290 -212963 -201592 -150194 -181054 -220294 -239370 -192284 -232270 -176991 -137464 -83191 4510
3548 4510 75224 207919 259358 185010 205262 195629 25660 -48407 37899 -61853 -13843 -59222
3536 -59222 -61748 -138879 -59589 98596 186928 178693 256037 333136 267271 174396 111816 170065
3524 170065 91813 -19956 -64155 -89082 -84126 -150156 -77830 137881 103495 -12785 -88761
3513 -88761 45419 145448 195711 116561 99614 53131 -34728 -133090 -117464 -146137 -106590
3502 -106590 -31115 18513 163869 140737 91509 29696 -148666 -250721 -173828 -39496 49202
3491 49202 -39428 52931 40953 -48051 -14560 -48062 -55575 51496 -12624 -68195 2402 58759
3479 58759 67612 87589 -6362 47958 13083 -47943 -145823 -171808 -12817 52484 74395 104470
3467 104470 102516 56363 -119979 -116556 -250483 -333830 -181045 19463 130386 185686 118951
3456 118951 90288 74921 76398 31982 -43651 -66964 -181323 -250060 -270524 -137868 7974
3445 7974 39063 24691 120689 91778 50138 86501 115318 162753 97477 24968 129723 212466
3433 212466 196896 130671 120442 -51287 -229515 -243124 -103347 -90953 -164279 -163859 -212501
3422 -212501 -139145 -129258 -208880 -183765 -7 16967 -143795 -232072 -227983 -171374 -221731 -221591
3410 -221591 -192516 -28553 91465 33911 121767 191552 76235 -44748 -164766 -44099
3400 -44099 35398 3801 105084 -17600 -37210 -100013 -42412 -36020 -67001 -29892 24852 133938
3388 133938 73502 108310 199799 172850 210207 139900 1774 -58106 106971 221860 298918
3377 298918 264478 152930 18496 20432 54686 28479 65909 152916 134191 133953 -12432 -166193
3365 -166193 -86829 -36319 169598 81216 -96600 -125327 -179020 -298965 -128180 -40791 -51858
3354 -51858 -19246 -140779 -192215 -160241 -116129 -113175 -109367 -65642 -155287 -51470 -29917 -86864
3342 -86864 34511 46762 -28713 -159674 -280334 -181531 -174751 -198263 -87868 112667 123486
3331 123486 9686 -225649 -416018 -329150 -69909 50379 75671 30439 91705 116933 94785
3320 94785 55474 77809 88763 -80479 -179943 -291077 -279236 -122356 -192385 -50828 -32940
3309 -32940 16274 152091 120916 154486 42122 -140115 -54015 -98087 -206020 -161228 32466
3298 32466 66531 124648 229785 155328 77598 919 7435 -61183 -78882 -20049 -34585 63252
3286 63252 95602 21986 -16396 -122615 -107557 29751 134247 74169 98297 25023 35086
3275 35086 37500 -49375 -32395 -27716 27984 -7165 23872 85200 215770 246466 106410 181626
3263 181626 141733 7362 22931 19823 58790 133574 75214 -30899 -32654 -73585 -204758
3252 -204758 -255063 -154161 -42740 -17040 24037 -28535 20422 153584 130582 85312 110475
3241 110475 143797 48982 117548 139809 115535 36440 -1165 81821 244449 305525 196008
3230 196008 42048 12330 18470 18343 94882 18153 -79805 -42281 -160704 -119006 37819 84543
3218 84543 -29732 -132880 -64150 -52789 -111848 -200530 -212371 -148139 -70644 -47202 -67684
3207 -67684 -115751 -131453 -122657 -72525 -47573 -129027 -5878 42740 -96942 -142147 -147099 -67802
3195 -67802 -124089 -175648 -221088 -257912 -137567 -179412 -271572 -148718 -93600 -106923 -171771
3184 -171771 -159735 -76249 71802 -15537 -64424 49003 -8591 -96584 -123975 -143936 -253266
3173 -253266 -222074 -176160 -86619 -163809 -108291 9376 -6662 67325 5073 -22415 70724
3162 70724 21407 -84468 -184652 -244691 -220126 -133568 -62263 -184105 -412063 -396434 -247971
3151 -247971 -254354 -134478 -151885 -272416 -281345 -217878 -212135 -108394 -59305 -23632 -47176 31844
3139 31844 106977 8487 56049 104117 96468 191233 250336 134546 26474 15226 33133 168405
3127 168405 120573 64410 141797 247104 159568 2667 -17515 148490 87304 -40711 -128800
3116 -128800 -44351 -35581 -121140 -32945 65928 47203 -78042 -129075 -262408 -292904 -329995
3105 -329995 -296404 -281139 -208683 -202112 -26116 4942 -98929 -155484 -89443 -32501 -5367
3094 -5367 -72130 -176671 -304807 -281487 -96143 -28454 -39744 -149328 -33982 98802 128193
3083 128193 15062 -75053 -6470 24498 77780 85881 104264 168568 181791 213224 170539 118317
3071 118317 52168 51632 217232 303643 233589 190205 46210 -24741 -86382 -123974 -124210 -95760
3059 -95760 -104304 -26330 -132769 -201199 -59439 12617 -105550 -29034 20069 36202 5501
3048 5501 -88497 -112958 -46276 747 -42994 -92153 -47548 35444 -16521 -48817 -60171 -63000
3036 -63000 -155074 -105351 -41370 -26202 -66791 -131034 -32328 -23549 -105704 -145218 -129395 -89969
3024 -89969 60714 69644 56784 142313 142336 54751 65607 65116 85415 61073 199771 226422 38779
3011 38779 17598 103348 -16592 -131112 -135714 -38576 43581 89297 112922 212464 249603 127813
2999 127813 -17906 -236597 -80432 117176 58877 -132580 -225498 -139732 -21655 -11516
2989 -11516 38544 58927 103892 96792 -81867 -92295 -71998 30957 -62400 -180685 -71305
2978 -71305 1894 -29030 -79253 -88598 -58763 -184366 -262326 -278983 -217747 -171012 -199497 -158385
2966 -158385 -44208 -7536 -19055 17897 324583 357797 210503 32826 -86986 51137
2956 51137 124510 224616 151687 96325 133232 83778 -41859 -63336 -48528 -112838 -103911 -55722
2944 -55722 -106157 -97024 -49584 -47052 119974 218457 195455 -14431 14782 -44226 -89798 -205271
2932 -205271 -167141 -2896 83978 8157 28884 -11274 -110798 -110337 -6317 -93575 -220296
2921 -220296 -203807 -94813 -36290 -31454 56607 94981 117159 249750 293314 149799 131671
2910 131671 104355 106628 197712 167398 18862 -64397 -88415 55105 101185 195155 -9402
2899 -9402 -101956 -98163 -227441 -188408 -23844 103886 185876 134051 92970 106189 118418 -47145
2887 -47145 -83807 -140429 -117650 -90435 -28966 -68783 18396 -163010 -213217 -186082 -49457
2876 -49457 -42122 -68280 -114192 25470 30479 -12215 -45045 -217189 -168141 -32935 124304
2865 124304 107250 -27109 58456 44718 -39241 -85896 15810 53520 136661 104224 142173
2854 142173 80816 43034 206846 205762 177025 155671 146883 61798 51095 295145 338064 182786
2842 182786 47936 -52262 28234 140989 27194 1 -80098 -18719 141544 174262 90450
2831 90450 -78852 -80136 -118007 -64283 -31553 16926 81818 -19253 41353 -88721 -230264
2820 -230264 -357750 -367431 -121378 26870 -6685 -63856 -87102 -194098 -218927 -124646 -159087
2809 -159087 -269723 -267546 7196 91795 96025 85201 39491 34101 39064 15806 -20213 -18627
2797 -18627 27003 -104193 -244047 -176716 -98426 -33157 878 28153 5113 -32810 -130651
2786 -130651 -56683 -23147 60410 57832 38156 116749 56072 -22026 -79892 -142930 -125608 -130963
2774 -130963 -106436 -112831 -61920 -67333 -122006 -196935 -28858 91813 63400 158337 291900
2763 291900 238127 246069 34715 -73739 -26123 29869 -41149 -39889 -80199 -98142 -130190 -33675
2751 -33675 29581 58901 -13192 64189 111241 95054 57214 58919 61076 41257 -107779 -168528
2739 -168528 -198980 -204871 -19525 95243 113210 258849 266507 136868 -49768 -202931 -200764
2728 -200764 -79791 -23615 -112812 -126059 -60953 -116169 -110809 -30199 -11794 -50637 -13530 54610
2716 54610 395 -176479 -145456 -21831 -76665 -48829 -182918 -207565 -47103 32487 1377
2705 1377 45917 95353 104625 85498 49626 40850 -6958 32692 -26580 -61274 -163122 -128389
2693 -128389 -43115 -42613 15135 10310 49074 39801 557 -102510 -51141 -1098 -11956 -2678
2681 -2678 81896 13328 -102119 -92745 32485 184517 247747 341309 367161 212823 162911
2670 162911 271261 207580 183295 183140 169065 219457 170606 157798 13432 -82661 -3640 -29049
2658 -29049 1725 102603 -26426 -134881 -27828 142909 140277 -118669 49393 48273 21933
2647 21933 23764 -5298 52557 59452 89814 151245 190963 188152 117527 108247 217831 190762
2635 190762 198780 163285 176399 384049 419815 335164 312526 157595 157756 87717 40254 45848
2623 45848 15138 -28600 -91348 -117835 -19527 38261 -66715 -123932 -92293 -148886 -121060 -159859
2611 -159859 -259743 -196344 -93594 -99224 -91406 -77974 -158786 -183041 -118929 13655 135710
2600 135710 191715 163406 61552 -89564 -135282 -35081 -46290 -79327 -4192 -123589 -136422
2589 -136422 -47471 -100334 -67135 -30558 14851 74875 142274 62453 -7882 -15467 -19136 -60678
2577 -60678 -58932 49033 95101 54691 61922 155413 190492 109537 138523 109061 141014 262025
2565 262025 240931 133818 115487 86347 34205 -5220 97027 135098 102708 42134 -127262
2554 -127262 -140425 -7473 50729 146825 121268 -31710 -24405 -65391 -164837 -89201 92511
2543 92511 47139 11632 -55020 -186933 -264585 -196025 -133677 -178563 -40785 47757 66228
2532 66228 12206 68004 123700 69245 81646 101405 144756 97580 60979 40933 -29608 -197870
2520 -197870 -313715 -123770 19521 -143662 -148636 -39258 -149525 -209765 -138080 -83565 -113633
2509 -113633 -19318 86695 177983 201774 152379 62520 13599 -20160 -15320 19227 69055 121734
2497 121734 29298 43472 -65023 -44964 -17652 -27008 51712 23141 74505 40352 -3456 -52996
2485 -52996 -93992 -100563 -41321 -24809 24172 116298 220560 253094 205677 142797 136351 176803
2473 176803 207185 64413 10515 -66977 -47962 72674 90680 156795 238830 243235 248883 209276
2461 209276 41400 32571 72417 83528 88098 73298 -8084 -50747 -9233 -70410 -214065 -230196
2449 -230196 -109785 -3836 74537 41408 69617 81701 66537 83621 -79455 -281325 -403178
2438 -403178 -360051 -198705 -18542 -68150 -155125 10521 157235 195830 222008 144281 3874
2427 3874 -140957 -128128 72435 136841 -41162 7671 61541 75847 77862 159542 315725
2416 315725 186275 29704 41110 113015 10499 11727 103093 107843 162544 288691 332105
2405 332105 208875 120851 145469 119085 18030 -81045 -51465 -47681 -118937 -155472 -122207
2394 -122207 14026 68537 2234 49385 64107 -8484 -129239 -122300 -4279 27389 -8707
2383 -8707 -76466 -94338 -83004 -79400 53320 140871 -6411 -65271 -85109 -85840 -90394 -154350
2371 -154350 -138629 -8409 -7378 -86414 -130133 -185267 -145074 -77570 -15440 34739 81410 131500
2359 131500 108138 94738 92963 86704 69107 220346 237219 225085 214279 133550 41575 -74265
2347 -74265 -194377 -199518 -203455 -186730 -232250 -274688 -216628 -83947 28515 15902 56481 16651
2335 16651 -55618 -49530 -26029 -5963 -1431 -19982 -21824 -112782 -203648 -82115 77643 198601
2323 198601 116690 -47900 -16302 16120 91841 200218 234683 273455 188454 -16450 -34679
2312 -34679 -19084 99127 202353 313994 273053 48467 -50763 5221 83964 -1822 -89978
2301 -89978 -24552 58087 37265 -130757 -141434 42812 51883 91874 211777 132831 2085
2290 2085 -32265 -121732 -59764 95552 167163 181831 163284 106704 45455 73947 -68011 -244518
2278 -244518 -124132 5453 72505 141448 120254 32332 -6472 -35993 71721 75181 15885
2267 15885 17121 143369 122932 -53670 -35630 19563 -101781 -41524 -1404 32231 -183901
2256 -183901 -305135 -186995 -71857 -106904 -93299 887 -56420 -148647 -199529 -176226 -130171
2245 -130171 85452 57552 -91273 -111192 45344 -61818 -182136 -107641 70483 101218
2235 101218 44596 65003 84383 -22435 -69681 -146810 -89150 25566 2471 -17948 10571
2224 10571 64456 -129684 -63884 80607 124969 103745 54064 25989 34104 19689 59743 60919
2212 60919 98753 95921 49527 -5837 5845 -53723 -71266 56338 136366 69673 91850 58903
2200 58903 -180630 -87478 77576 91176 148596 123426 8544 -89443 -20632 -29911 -67611
2189 -67611 -154845 -201418 -304055 -275120 -152406 -102032 -191555 -133658 2996 47953 67181
2178 67181 -7422 32288 49758 42070 111078 84378 24360 104875 152086 64908 -50462 -77167
2166 -77167 -9261 29170 39464 103236 104556 62757 -51011 -182415 -241452 -166224 -10368
2155 -10368 -51413 -131714 -60008 93370 126993 74656 -61131 35294 46985 -20096 -127485
2144 -127485 -23857 -38081 -16232 -80823 -157547 19486 145156 17218 -236183 -343665
2134 -343665 -221019 -94274 54959 141026 83014 54589 -10982 65427 111806 177053 248962
2123 248962 113106 65960 61711 -49403 -38587 -58006 -130616 -92032 160680 185495 226600
2112 226600 206072 172639 83001 -43293 -29176 -1503 37273 16418 -82420 29965 72463
2101 72463 59513 -66812 -155519 19074 51841 1955 -213303 -213103 -95832 -78085 -61739
2090 -61739 56 -20383 -113052 -167741 -116483 -45898 120150 176712 217374 276855 194086 119535
2078 119535 149265 128602 63979 -110219 -160977 -212617 -182508 -111304 -55349 -99448 -126167
2067 -126167 -155241 -71551 -55329 -106646 -284774 -296735 -226771 -137194 -107241 -85683 -33079
2056 -33079 -100089 -224096 -64368 67536 118882 65980 47674 46071 62776 -80847 -63127
2045 -63127 -37078 183522 258859 216278 133510 -42326 -122497 9278 120362 84666 -112177
2034 -112177 -200025 -129251 -90641 -158224 -275980 -154095 42869 130665 190700 148589 22263
2023 22263 -51542 37829 37130 14608 25293 22986 -85415 -183505 -88938 -63664 -9769 -46701
2011 -46701 -102552 36522 122139 193754 98490 34830 18107 87766 121375 49833 69140 32293
1999 32293 -26162 28159 96508 126878 -6354 86224 23434 -36701 155029 162847 210361 159308
1987 159308 85978 33743 -73358 -128200 -207403 -208593 -144760 13847 19959 -78516 -87400 7053
1975 7053 25430 62108 8739 -79215 -12109 26757 -97248 -149449 -9869 83698 155117 190042
1963 190042 105120 158061 82612 19792 87483 125265 114946 9231 -116878 -3165 59364
1952 59364 149072 -106927 -168238 -131788 -81468 25643 56896 84096 128878 203448 141888
1941 141888 -90542 -133246 -172492 -250346 -359568 -273322 -249905 -93904 169073 368290 264754
1930 264754 211813 101158 -103336 -174934 -78039 -54994 -59899 -23862 105642 220692 199254
1919 199254 252675 109893 95118 177638 172319 73586 119697 188207 131138 91006 34558 -107849
1907 -107849 -83002 -67815 -87362 33841 136045 77371 53935 181905 53050 -98223 -185026
1896 -185026 -66620 -57254 -97529 52933 -27373 -152996 -186620 -86882 -58062 36059 -53026
1885 -53026 -108925 -20567 -104398 -35845 -46288 104759 69396 99802 222458 266565 84011
1874 84011 -83573 -289923 -375957 -306503 -212500 -161986 -132407 -8022 63807 -96502 -184374
1863 -184374 -83578 19522 218887 237517 115001 70445 152678 132682 33383 104837 102837
1852 102837 -52291 -152731 18390 162103 256854 103209 -77067 -156696 52415 174370
1842 174370 130701 10176 21560 119580 231770 83525 135226 106880 -58367 -112547 9416
1831 9416 -15164 -123612 -3917 160355 79750 29744 -103848 -74231 -58805 52358 123712
1820 123712 167551 119885 104485 35733 -81769 -36268 60915 141933 344592 312618 200307
1809 200307 198723 111393 62675 34809 25050 -48182 -88130 115267 152742 -104785 -193352 -133586
1797 -133586 -278715 -188630 -81343 -56653 36645 121310 152834 116833 49846 -85197 -128518
1786 -128518 882 -44442 -154409 -157111 -86768 99709 233294 182144 -27 -57888 -24001
1775 -24001 60158 193471 248336 196797 144689 -74578 -165594 -135482 -106166 -71199 49267
1764 49267 12438 64971 161565 131013 73048 15262 135244 91690 -6775 -115535 -164356
1753 -164356 -75407 107344 214664 155794 25303 105428 240234 172826 82497 -13558 3170
1742 3170 100641 116828 161765 174605 49265 -17487 88860 123899 104016 -46251 -74961
1731 -74961 -93626 -141828 -165161 -121400 1931 126957 127692 226504 180306 -173 56411 107904
1719 107904 -8974 1976 -110623 -50246 48418 -47224 -169193 -31158 -72715 -153920 -35740
1708 -35740 40623 32777 -90089 -123771 -166124 -258364 -101545 -17811 -65186 -157546 -59254 -14436
1696 -14436 13640 37152 -20174 67399 161809 57313 100343 84621 -16716 -104519 -88865
1685 -88865 -101313 -110384 11607 159675 73892 57994 66703 -27334 -76962 -112932 -79067 -2023
1673 -2023 -74420 -175259 -207857 -166261 -142050 32778 48825 -50105 51295 64185 151933
1662 151933 119077 -5658 -23799 64689 41681 99709 89059 79312 126091 180585 76737
1651 76737 127616 167169 15206 -144186 -36574 178929 110360 120769 164985 92999 -7742
1640 -7742 -49938 -48070 -180655 -159673 -97214 -130033 -82241 23229 114359 117822 -156000 -162359
1628 -162359 -126858 -30165 38028 17529 -90562 -244322 -367258 -264279 -120489 -39141 -50601
1617 -50601 -64692 14834 129167 200713 242201 211106 10144 -16843 -50486 -20930 32786
1606 32786 19126 -78539 -153728 -176375 40066 177209 109349 -44421 -84104 -37982 -43876
1595 -43876 51917 93085 10890 -77654 -242522 -111960 -93739 -142962 -66098 -115865 -114043 -71556
1583 -71556 -66005 -32608 22934 80891 117458 209497 70644 -12926 71716 191746 273778 213035
1571 213035 154702 45038 3868 35501 -17688 -56700 -149838 -116783 -103730 -255056 -203014
1560 -203014 -204879 -162537 -165721 -220250 -156630 -126492 24204 47317 40840 19173 12307 94610
1548 94610 4937 -7750 89461 37159 -108673 -32201 81997 -97097 -255535 -287648 -213589
$$ [...]
##END NTUPLES=NMR SPECTRUM
##END=
